##TITLE=Analysis number 328536
Compound Code cc 62624
Book Reference 494/182
Project Code adrs
Chemist Name craigr
##JCAMPDX= 6.0         $$ Bruker NMR JCAMP-DX V2.0
##DATA TYPE= NMR SPECTRUM
##DATA CLASS= NTUPLES
##ORIGIN= Bruker BioSpin GmbH
##OWNER= nmr
$$ XWIN-NMR		Version 3.5
$$ Wed Jun 13 15:52:21 2007 GMT Daylight Time (UT+1h)  MAYBRIDGE\nmr@NMR_250MHZ
##.OBSERVE FREQUENCY= 250.131544655141
##.OBSERVE NUCLEUS= ^1H
##.ACQUISITION MODE= SIMULTANEOUS (DQD)
##.ACQUISITION SCHEME= undefined
##.AVERAGES= 16
##.DIGITISER RES= 18
##SPECTROMETER/DATA SYSTEM= dpx250
##.PULSE SEQUENCE= zg30
##.SOLVENT NAME= CDCl3
##.SHIFT REFERENCE= (INTERNAL, CDCl3, 0, 16.522)
##AUDIT TRAIL= $$ (NUMBER, WHEN, WHO, WHERE, WHAT)
$$ ##TITLE= Audit trail, XWIN-NMR		Version 3.5
$$ ##JCAMPDX= 5.01
$$ ##ORIGIN= Bruker BioSpin GmbH
$$ ##OWNER= nmr
$$ C:\u/data/dgb/nmr/ADRS/850/pdata/1/auditp.txt
$$ ##AUDIT TRAIL=  $$ (NUMBER, WHEN, WHO, WHERE, WHAT)
(   1,<2007-06-13 15:51:59.19 +100>,<MAYBRIDGE\nmr>,<NMR_250MHZ>,
      <created by zg, POWCHK disabled, PULCHK disabled
       configuration hash MD5:
       76 6E 9A 78 1E 09 19 81 EC 84 63 8F B0 6A 59 2D
       data hash MD5: 64K
       E2 BA F9 62 2F C1 65 04 25 93 43 E6 18 DB 87 55>)
(   2,<2007-06-13 15:52:11.78 +100>,<MAYBRIDGE\nmr>,<NMR_250MHZ>,
      <Start of raw data processing
       ef LB = 0.3 FT_mod = 6 PKNL = 1 SI = 32K 
       data hash MD5: 32K
       B4 F5 0E FA 78 22 98 D9 56 00 65 C0 8A 16 31 6E>)
(   3,<2007-06-13 15:52:13.59 +100>,<MAYBRIDGE\nmr>,<NMR_250MHZ>,
      <apk 
       data hash MD5: 32K
       6F 4C 18 AB 47 61 44 F0 25 45 01 74 5F 88 F8 0C>)
(   4,<2007-06-13 15:52:14.28 +100>,<MAYBRIDGE\nmr>,<NMR_250MHZ>,
      <abs ABSG = 5 
       data hash MD5: 32K
       AA BD 8E EC 9F D4 ED B0 A2 E9 1C BB 33 D9 D4 16>)
$$ ##END=
$$ 
$$ hash MD5
$$ 7E 76 47 5F BB B9 96 59 5A 9A 19 B0 48 45 23 4C
##$RELAX= 
##$RELAX= 
##$RELAX= 
##$RELAX= 
##$RELAX= 
##$RELAX= 
##$RELAX= 
$$ Bruker specific parameters
$$ --------------------------
##$DU= <C:\u>
##$EXPNO= 850
##$NAME= <ADRS>
##$PROCNO= 1
##$TYPE= <nmr>
##$USER= <dgb>
##$AMP= (0..31)
100 100 100 100 100 100 100 100 100 100 100 100 100 100 100 100 100 100 
100 100 100 100 100 100 100 100 100 100 100 100 100 100 
##$AQSEQ= 0
##$AQ_mod= 3
##$AUNM= <au_zg>
##$AUTOPOS= <47 >
##$BF1= 250.13
##$BF2= 250.13
##$BF3= 250.13
##$BF4= 250.13
##$BF5= 500.13
##$BF6= 500.13
##$BF7= 500.13
##$BF8= 500.13
##$BYTORDA= 1
##$CFDGTYP= 0
##$CFRGTYP= 5
##$CHEMSTR= <none>
##$CNST= (0..31)
1 1 145 1 1 1 1 1 1 1 1 1 1 1 1 1 1 1 1 1 1 1 1 1 1 1 1 1 1 1 1 1 
##$CPDPRG= <>
##$CPDPRG1= <>
##$CPDPRG2= <>
##$CPDPRG3= <>
##$CPDPRG4= <mlev>
##$CPDPRG5= <mlev>
##$CPDPRG6= <mlev>
##$CPDPRG7= <mlev>
##$CPDPRG8= <mlev>
##$CPDPRGB= <>
##$CPDPRGT= <>
##$D= (0..31)
0 1 0 0 0 0 0 0 0 0.06 0 0 0 0 0 0 0.0002 0 0 0 0 0 0 0 0 0 0 0 0 0 0 
0 
##$DATE= 1181746318
##$DBL= (0..7)
120 120 120 120 120 120 120 120 
##$DBP= (0..7)
150 150 150 150 150 150 150 150 
##$DBP07= 0
##$DBPNAM0= <>
##$DBPNAM1= <>
$$ [...]
##$SUBNAM7= <"">
##$SUBNAM8= <"">
##$SUBNAM9= <"">
##$SW= 20.6930455092707
##$SWIBOX= (0..15)
0 0 3 0 0 0 0 0 0 0 0 0 0 0 0 0 
##$SW_h= 5175.983436853
##$TD= 65536
##$TD0= 1
##$TE= 297.16
##$TE2= 300
##$TE3= 300
##$TEG= 300
##$TL= (0..7)
0 120 120 120 120 120 120 120 
##$TP= (0..7)
150 150 150 150 150 150 150 150 
##$TP07= 0
##$TPNAME0= <>
##$TPNAME1= <>
##$TPNAME2= <>
##$TPNAME3= <>
##$TPNAME4= <>
##$TPNAME5= <>
##$TPNAME6= <>
##$TPNAME7= <>
##$TPOAL= (0..7)
0.5 0.5 0.5 0.5 0.5 0.5 0.5 0.5 
##$TPOFFS= (0..7)
0 0 0 0 0 0 0 0 
##$TUNHIN= 0
##$TUNHOUT= 0
##$TUNXOUT= 0
##$USERA1= <user>
##$USERA2= <user>
##$USERA3= <user>
##$USERA4= <user>
##$USERA5= <user>
##$V9= 5
##$VALIST= <valist>
##$VCLIST= <CCCCCCCCCCCCCCC>
##$VD= 0
##$VDLIST= <DDDDDDDDDDDDDDD>
##$VPLIST= <PPPPPPPPPPPPPPP>
##$VTLIST= <TTTTTTTTTTTTTTT>
##$WBST= 1024
##$WBSW= 4
##$XGAIN= (0..3)
0 0 0 0 
##$XL= 0
##$YL= 0
##$YMAX_a= 377919
##$YMIN_a= -318916
##$ZGOPTNS= <>
##$ZL1= 120
##$ZL2= 120
##$ZL3= 120
##$ZL4= 120
##$ABSF1= 16.522
##$ABSF2= -4.171173
##$ABSG= 5
##$ABSL= 3
##$ALPHA= 0
##$AQORDER= 0
##$ASSFAC= 0
##$ASSFACI= 0
##$ASSFACX= 0
##$ASSWID= 0
##$AUNMP= <proc_1d>
##$AZFE= 0.1
##$AZFW= 0.1
##$BCFW= 0
##$BC_mod= 0
##$BYTORDP= 0
##$COROFFS= 0
##$CY= 12.5
##$DATMOD= 1
##$DC= 0
##$DFILT= <>
##$DTYPP= 0
##$F1P= 14.0000005364418
##$F2P= -0.99999901652339
##$FCOR= 0.5
##$FTSIZE= 32768
##$FT_mod= 6
##$GAMMA= 0
##$GB= 0
##$INTBC= 1
##$INTSCL= 1
##$ISEN= 128
##$LB= 0.3
##$LEV0= 0
##$LPBIN= 0
##$MAXI= 10000
##$MC2= 0
##$MEAN= 0
##$ME_mod= 0
##$MI= 0
##$NCOEF= 0
##$NC_proc= -3
##$NLEV= 6
##$NOISF1= 0
##$NOISF2= 0
##$NSP= 0
##$NTH_PI= 0
##$NZP= 0
##$OFFSET= 16.522
##$PC= 1
##$PHC0= -57.30224
##$PHC1= 10.5124
##$PH_mod= 1
##$PKNL= yes
##$PPARMOD= 0
##$PSCAL= 4
##$PSIGN= 0
##$REVERSE= no
##$SF= 250.13
##$SI= 32768
##$SIGF1= 0
##$SIGF2= 0
##$SINO= 400
##$SIOLD= 32768
##$SREGLST= <1H.CDCl3>
##$SSB= 0
##$STSI= 32768
##$STSR= 0
##$SW_p= 5175.98343685301
##$SYMM= 0
##$S_DEV= 0
##$TDeff= 65536
##$TDoff= 0
##$TI= <Analysis number 999999
Compound Code 99
Book Reference 9
Project Code 9>
##$TILT= no
##$TM1= 0
##$TM2= 0
##$TOPLEV= 0
##$USERP1= <user>
##$USERP2= <user>
##$USERP3= <user>
##$USERP4= <user>
##$USERP5= <user>
##$WDW= 1
##$XDIM= 32768
##$YMAX_p= 313593811
##$YMIN_p= -123766
$$ End of Bruker specific parameters
$$ ---------------------------------
##NTUPLES= NMR SPECTRUM
##VAR_NAME=  FREQUENCY,     SPECTRUM/REAL,   SPECTRUM/IMAG
##SYMBOL=    X,             R,               I
##VAR_TYPE=  INDEPENDENT,   DEPENDENT,       DEPENDENT
##VAR_FORM=  AFFN,          ASDF,            ASDF
##VAR_DIM=   32768,         32768,           32768
##UNITS=     HZ,            ARBITRARY UNITS, ARBITRARY UNITS
##FACTOR=    0.157963299565203, 1,           1
##FIRST=     4132.6476996994, 0,             0
##LAST=      -1043.33573715361, 0,           0
##MIN=       -1043.33573715361, -123766,     0
##MAX=       4132.6476996994, 313593811,     0
$$ Real data points
##PAGE= N=1
##DATA TABLE= (X++(R..R)), XYDATA
$$ [...]
16457F877j5835R704J2945J3728j4648k071j5041l535L499j0776p17J1926j9306
$$ 6877 -8958 746 13691 27419 12771 10700 -4341 -7876 -4377 -15153 -15870 -3944 -23250
16444b3250M384J893J1434j0558j9045P732O85j6099n116j1442J9578n51O189
$$ -23250 -18866 -16973 -5539 -16097 -35142 -27410 -26725 -42824 -47940 -59382 -39804 -40355 -34166
16431c4166R7j2597j5802K100L2748J0107j9691o640l152K2926J96j1071K694
$$ -34166 -34069 -46666 -62468 -60368 -27620 -17513 -37204 -43844 -46996 -24070 -23874 -34945 -32251
16418c2251R645j5379q956J0590j3407M298K4894j6430k2358L624K6441O841j1004
$$ -32251 -22606 -37985 -46941 -36351 -49758 -45460 -20566 -36996 -59354 -55730 -29289 -22448 -33452
16405c3452j6754o629Q150O685k0546k2787j51J9482J6963K8996J8607J4980J3781
$$ -33452 -50206 -56835 -48685 -42000 -62546 -85333 -85484 -66002 -49039 -20043 -1436 13544 27325
16392B7325R698m578l0383m756j062j0464m316J6914j7602j8186O158J0367J0519
$$ 27325 37023 32445 2062 -2694 -3756 -14220 -18536 -1622 -19224 -37410 -31252 -20885 -10366
16379a0366J4417R726k7951p262K3704K3359j2525k0874P720Q065r208j2113k2068
$$ -10366 4051 13777 -14174 -21436 2268 25627 13102 -7772 -52 8013 -1195 -13308 -35376
16366c5376O892R875k0393j7575J3314n854J4425K7710R930o402m395R130j2862
$$ -35376 -28484 -18609 -39002 -56577 -43263 -49117 -34692 -6982 2948 -3454 -7849 1281 -11581
16353a1581o263J1323l28k0059K81J0286m319j0533j9070Q158L2467j1287j5715
$$ -11581 -17844 -6521 -6849 -26908 -26627 -16341 -20660 -31193 -50263 -42105 -9638 -20925 -36640
16340c6640K9623J5868j2756m385M925J3346L116j0938k1081j9410K6425K4945
$$ -36640 -7017 8851 -3905 -8290 -3365 9981 13097 2159 -18922 -38332 -11907 13038
16328A3038L0j7211J3760J2590j1035j2473J0978J2774J601k8673j6229J7602
$$ 13038 13068 -4143 9617 22207 11172 -1301 9677 22451 24052 -4621 -20850 -3248
16316c248k0309J2207K2897j9675k2348k082o12m355L877K5473j7119n932J8715
$$ -3248 -23557 -11350 11547 -8128 -30476 -32558 -33170 -37525 -33648 -8175 -25294 -31226 -12511
16303a2511K2321k4611l4586N40K031K5729J4636r021j4927R681R095p865K211
$$ -12511 9810 -14801 -49387 -48847 -46816 -21087 -6451 -15472 -30399 -20718 -11623 -19488 -17277
16290a7277l433j801O242j8024p302M700K0165j145j6073k8070j5895J5790P173
$$ -17277 -20710 -22511 -16269 -34293 -41595 -36895 -16730 -17875 -33948 -62018 -77913 -62123 -54950
16277e4950K4486P01j0736j2567K4111P456O299j2588K0457m425r097J3499k5541
$$ -54950 -30464 -29763 -40499 -53066 -28955 -21499 -15200 -27788 -7331 -11756 -20853 -7354 -32895
16264c2895M415J7567o734o661k4683K4229J3799k1251P357K294l6195r418L948
$$ -32895 -28480 -10913 -17647 -24308 -48991 -24762 -10963 -32214 -24857 -22563 -58758 -68176 -64228
16251f4228P068J7178R037j018q015r802K1304m843j1807J1056K2748J6186k4243
$$ -64228 -57160 -39982 -30945 -31963 -39978 -49780 -28476 -33319 -45126 -34070 -11322 4864 -19379
16238a9379j2790N2l879M010N397m337j0292j162k59L724J0980J9591R876k3842
$$ -19379 -32169 -32117 -35996 -31986 -26589 -30926 -41218 -42380 -42639 -38915 -27935 -8344 1532 -22310
16224b2310j4388r198l149P381L9703J5745r909k0357j0247O737j7488j2386J8186
$$ -22310 -36698 -45896 -49045 -41664 -1961 13784 3875 -16482 -26729 -19992 -37480 -49866 -31680
16211c1680M755J1094q977J0695J5796p273j092j9873J5255J5481j4718j6053
$$ -31680 -26925 -15831 -24808 -14113 1683 -5590 -6682 -26555 -11300 4181 -10537 -26590
16199b6590J7656J2101j6757n549K1330l617n8536l1580K7933L5473m914j5088
$$ -26590 -8934 3167 -13590 -19139 2191 -1426 -59962 -91542 -63609 -28136 -33050 -48138
16187d8138O322j5539M440J8602J4424K8099j9016K318J6965j0934J7517O561
$$ -48138 -41816 -57355 -52915 -34313 -19889 8210 -10806 -8488 8477 -2457 15060 21621
16175B1621m3890k9412R908k608P473O591K6026n28j5304j4902k1324J3458j0268
$$ 21621 -22269 -51681 -41773 -44381 -36908 -30317 -4291 -4819 -20123 -35025 -56349 -42891 -53159
16162e3159R945K1285J2053r342j4277P032L3703M074n82j5577J0600O413l7794
$$ -53159 -43214 -21929 -9876 -19218 -33495 -26463 7240 11314 10732 -4845 5755 12168 -25626
16149b5626m8032R846L22L9984K7628j0995j9904k9753l161L1426J5898k3327
$$ -25626 -73658 -63812 -63490 -23506 4122 -6873 -26777 -56530 -59691 -28265 -12367 -35694
16137c5694k5952N152k338J1690J2046K0932M459j4038K972O625N755j0647j2244
$$ -35694 -61646 -56494 -58832 -47142 -35096 -14164 -9705 -23743 -20771 -14146 -8391 -19038 -31282
16124c1282j6614j0093l401J6725J4976j5338j9476J694K2918J6847J775J6422
$$ -31282 -47896 -57989 -61390 -44665 -29689 -45027 -64503 -62809 -39891 -23044 -21269 -4847
16112d847j0123j4370L9768J6069K6340K1399k9302m0692l4886j8199r135L764
$$ -4847 -14970 -29340 10428 26497 52837 74236 44934 4242 -30644 -48843 -57978 -54214
16100e4214R220P230j72m377r489J1296K6225k2269l0010J2680Q001J5527R094
$$ -54214 -44994 -37764 -37936 -42313 -51802 -40506 -14281 -36550 -66560 -53880 -45879 -30352 -21258
16087b1258K6359O999r865j4452J6189J6101k5436j3529J7225j3568j9435K3101
$$ -21258 5101 12100 2235 -12217 3972 20073 -5363 -18892 -1667 -15235 -34670 -11569
16075a1569J2221J2887M81J3015J007j5885n876j2591j7834J218j3058R998O527
$$ -11569 652 13539 14020 27035 28042 12157 6281 -6310 -24144 -22926 -35984 -25986 -19459
16062a9459N272j9510j6624K6884J3355q829Q323Q282k814j3732k3222j1662J9384
$$ -19459 -14187 -33697 -50321 -23437 -10082 -18911 -10588 -2306 -5120 -18852 -42074 -53736 -34352
16049c4352j1258N174R36j584j6436Q349L7326L4117J202k9703l1897j0927O588
$$ -34352 -45610 -40436 -39500 -41084 -57520 -49171 -11845 22272 23474 -6229 -38126 -49053 -42465
16036d2465J0132J7688l545q978J2946J5610j271j7698J0726J6973o423J3172
$$ -42465 -32333 -14645 -18190 -27168 -14222 1388 117 -17581 -6855 10118 3695 16867
16024A6867K0233O521k3446j0856M723j6462l204j3178j6077p880L152K3479P515
$$ 16867 37100 43621 20175 9319 14042 -2420 -5624 -18802 -34879 -42759 -39607 -16128 -8613
16011h613k377K148r407K655q404J458M72K0408O374J247o478r827k0240j4735
$$ -8613 -10990 -8842 -18249 -15594 -23998 -22540 -22068 -1660 4714 5961 -517 -10344 -30584 -45319
15997d5319J4715M7232L5051J0090k3520k1950O173o674k4538o061j1553k0168
$$ -45319 -30604 16628 51679 61769 38249 16299 22472 15798 -8740 -14801 -26354 -46522
15985d6522j0593L1777r82o427j6308j3409J5826O272J8127J3303J0935k4254
$$ -46522 -57115 -25338 -26320 -32747 -49055 -62464 -46638 -40366 -22239 -8936 1999 -22255
15973b2255l7903j2094l906j077J6172K0630J9929M903Q249j7098l5740O581o430
$$ -22255 -60158 -72252 -76158 -77235 -61063 -40433 -20504 -15601 -7352 -24450 -60190 -53609 -60039
15960f0039J0314J7551K4427k2853r117j3790j784K566K9879K4522k2354k742
$$ -60039 -49725 -32174 -7747 -30600 -39717 -53507 -55291 -52725 -22846 1676 -20678 -23420
15948b3420k899r060j1483J3057K772j6080P740J6082K0560P969p309n886j0195
$$ -23420 -26319 -35379 -46862 -33805 -31033 -47113 -39373 -23291 -2731 5238 -2071 -7957 -18152
15935a8152K951J8222J4917K0785J5998j0235j8219k8665J9092p62j656j5307
$$ -18152 -15201 3021 17938 38723 54721 44486 26267 -2398 16694 15932 14276 -1031
15923a031q112j875j8922j634P715j971j4096j0555J0416K0416J5653j1002l629
$$ -1031 -9143 -11018 -29940 -31574 -23859 -25830 -39926 -50481 -40065 -19649 -3996 -14998 -18627
15910a8627L7195r209K887p165j3853K1478L8402r349m7927l2889l7346Q833L9173
$$ -18627 18568 9359 12246 5081 -8772 12706 51108 41759 -6168 -39057 -76403 -67570 -28397
15897b8397J8079M544k1045l6262J3901K0348j081P729j2092p915K0808j1547
$$ -28397 -10318 -5774 -26819 -63081 -49180 -28832 -29913 -22184 -34276 -42191 -21383 -32930
15885c2930k4800j0375L7359J0798J117J381J2200j091j6999R542J9226J6596
$$ -32930 -57730 -68105 -30746 -19948 -18831 -17450 -5250 -6341 -23340 -13798 5428 22024
15873B2024k4999k2971j957q776J2828K2751J4939r387k855k79O27k2800l0620
$$ 22024 -2975 -25946 -27903 -36679 -23851 -1100 13839 4452 1597 1318 1945 -20855 -51475
15860e1475k105R938N67o020J4510K0372J5809J2205J7213j7498k4791j0399K560
$$ -51475 -53580 -43642 -43075 -49095 -34585 -14213 1596 13801 31014 13516 -11275 -21674 -19114
15847a9114l8544k1177J3748n591J1922K3210j5685k998J4141l031J3378O291
$$ -19114 -57658 -78835 -65087 -70678 -58756 -35546 -51231 -54229 -40088 -43119 -29741 -23450
15835b3450R62m528q445J9317N703L9699Q517k1084k2687j1518j1583j072K4479
$$ -23450 -22488 -27016 -35461 -16144 -10441 29258 37775 16691 -5996 -17514 -29097 -30169 -5690
15822e690K2498j3132Q329J0725J328m935J5144J263n640k1209l2811j2909K0780
$$ -5690 16808 3676 12005 22730 24058 19123 34267 35530 29890 8681 -24130 -37039 -16259
15809a6259O324J2159j8143k1327Q080J5928J6222R901n618K437p310j3149j6918
$$ -16259 -9935 2224 -15919 -37246 -29166 -13238 2984 12885 7267 9704 2394 -10755 -27673
15796b7673O266j0376j6220J1154J8106j7970K93J3445r383O099N775N974l120
$$ -27673 -21407 -31783 -48003 -36849 -18743 -36713 -36420 -22975 -32358 -26259 -20484 -14510 -17630
15783a7630P022q66J208J4124p826k9850j4053N009N424J7961O969r607k6150
$$ -17630 -10608 -11474 -10266 3858 -3968 -33818 -47871 -42862 -37438 -19477 -12508 -22115 -48265
15770d8265j1752P26P46K7706K0328r852j2689j7417k1660j1488K1551K081P907
$$ -48265 -60017 -59291 -58545 -30839 -10511 -20363 -33052 -50469 -72129 -83617 -62066 -59985 -52078
15757e2078L903J1427J3228L037K1256J5881K8622k9836l4545o253J1120j4857
$$ -52078 -48175 -36748 -23520 -20483 773 16654 45276 15440 -19105 -25358 -14238 -29095
15745b9095k4159R719M140L420k6091p155R453L0519L7983j620k8125k3066Q546
$$ -29095 -53254 -43535 -39395 -35975 -62066 -69221 -59768 -29249 8734 7114 -21011 -44077 -35531
15732c5531K2257j2319n936j4730O89K159j3992J8581L0878J1976l330Q03m12
$$ -35531 -13274 -25593 -31529 -46259 -45570 -43411 -57403 -38822 -7944 4032 702 1505 1093
15719A093n471J1107k0819j6855j0280m579J515K8073J8578l058j8083k2896o637
$$ 1093 -4378 6729 -14090 -30945 -41225 -45804 -44289 -16216 2362 -696 -18779 -41675 -48312
15706d8312P532P489K2385K1476K651l5397j1079J3939j2922l362P790j842j1690
$$ -48312 -40780 -33291 -10906 10570 13221 -22176 -33255 -19316 -32238 -35600 -27810 -29652 -41342
15693d1342K6229K1388j9761k9377K1103K4718K7233J1544k9773j6941k9248O726
$$ -41342 -15113 6275 -13486 -42863 -21760 2958 30191 41735 11962 -4979 -34227 -27501
15681b7501j8478j2788J1494J2968L826O534J4034j5075o445J5511m992m724M715
$$ -27501 -45979 -58767 -47273 -34305 -30479 -23945 -9911 -24986 -31431 -15920 -20912 -25636 -20921
15668b0921J2677n133N398P673j6547L034J0963j5334J3728O26J3510l150j9230
$$ -20921 -8244 -13377 -7979 -306 -16853 -13819 -2856 -18190 -4462 -3836 9674 6524 -12706
15655a2706k947K4391K380m3987k1894J1854K9742L6183J601K635J4815j8671
$$ -12706 -15653 8738 11118 -32869 -54763 -42909 -13167 23016 24617 27252 42067 23396
15643B3396j6132m410m668J320j2073k0311j8540J7315K9742q872J5310K2860
$$ 23396 7264 2854 -1814 -494 -12567 -32878 -51418 -34103 -4361 -13233 2077 24937
15631B4937J9004j7946k3512k510l687j1398j3276k066R620j5572m964J433p203
$$ 24937 43941 25995 2483 -27 -3714 -15112 -28388 -30454 -20834 -36406 -41370 -39937 -47140
15618d7140L8331L0303O566k4995j6510j2246l018j6091J3662L506K7761J469
$$ -47140 -8809 21494 28060 3065 -13445 -25691 -28709 -44800 -31138 -27632 129 1598
15606A598R815j756Q107P650J2443n846l3550k8178Q681k492o303p677j945N259
$$ 1598 11413 9657 17764 25414 37857 32011 -1539 -29717 -21036 -23528 -29831 -37508 -39453 -34194
15592c4194O962k1727p140L47j418J579L8783J1313q941M769j3706k0322l1600
$$ -34194 -27232 -48959 -56099 -55752 -57170 -55591 -16808 -5495 -14436 -9667 -23373 -43695 -75295
15579g5295O449J0074J604L305L5146J1185j452j7377l568J2386J4193j943l96
$$ -75295 -68846 -58772 -57168 -53863 -18717 -7532 -8984 -26361 -29929 -17543 -3350 -5293 -5689
15566e689J1640p499j5476J0294K0993J8798r674j5547l6148k139K9475J4517
$$ -5689 5951 -1548 -17024 -6730 14263 33061 23387 7840 -28308 -30447 -972 13545
15554A3545j3141j7273P770J5328K286N598k5807P572n858j9660k719O355j131
$$ 13545 404 -16869 -9099 6229 8515 14113 -11694 -4122 -9980 -29640 -32359 -26004 -27135
15541b7135J8048k1806k5227J1107j4757L0573J5705j1486L74q449R051J8271
$$ -27135 -9087 -30893 -56120 -45013 -59770 -29197 -13492 -24978 -24604 -33053 -24002 -5731
15529e731M696q533K6686K3787j2759k2231q798k571K864J9168P657R506K060
$$ -5731 -1035 -9568 17118 40905 28146 5915 -2883 -5454 -2590 16578 24235 33741 35801
15516C5801j0213l2607n2360k5297K5134J6563J4258m327K5899K6595j316m148
$$ 35801 25588 -7019 -59379 -84676 -59542 -42979 -28721 -33048 -7149 19446 18130 13982
15504A3982P054j3044k9233j3541K0006J4259O278k93R908J1847r113o286K0855
$$ 13982 21036 7992 -21241 -34782 -14776 -517 5761 5468 15376 27223 18110 11824 32679
15491C2679J3463k812J9001r713j5557j0518o218J7397j068k1243p929j3269P219
$$ 32679 46142 43330 62331 52618 37061 26543 20325 37722 36654 15411 7482 -5787 1432
15478A432j3372k3758j7640P77J0097m085K2056R165j3120j9836K4055K2037J285
$$ 1432 -11940 -35698 -53338 -52561 -42464 -46549 -24493 -15328 -28448 -48284 -24229 -2192 -907
15465i07l0685k7198m203K1227K7430J5222R656J552k4356k0128J3457O231j2530
$$ -907 -31592 -58790 -62993 -41766 -14336 886 10542 12094 -12262 -32390 -18933 -12702 -25232
15452b5232J516J9170K0602L608N00K757j6392k0422k6351q076O328K5237r579
$$ -25232 -23716 -4546 16056 19664 20164 22921 6529 -13893 -40244 -48320 -41992 -16755 -26334
15439b6334O730K0366J4763L27q465j3659j1125K527M354k5676J21J2297J2703
$$ -26334 -19604 762 15525 15852 7387 -6272 -17397 -14870 -10516 -36192 -36071 -23774 -11071
15426a1071q701j0286J298k0660J9613j6039k3155J1084K4656K1994o417Q093
$$ -11071 -19772 -30058 -28760 -49420 -29807 -45846 -69001 -57917 -33261 -11267 -17684 -9591
15414i591l187K019j3698j1722L948K1004Q287l715n544O291N62j1524L137q74
$$ -9591 -12778 -10759 -24457 -36179 -32231 -11227 -2940 -6655 -12199 -5908 -5346 -16870 -13733 -14607
15400a4607J5397o889R461K703m747l646P031J0494k2941l9657J2153L0969R871
$$ -14607 790 -6099 3362 6065 1318 -2328 4703 15197 -7744 -47401 -35248 -4279 5592
15387E592J4012r990k2010j1762J616K3774l509J0226m353j107m393j4051q747
$$ 5592 19604 9614 -12396 -24158 -22542 1232 -2277 7949 3596 2489 -1904 -15955 -24702
15374b4702M544l775J4063p925K0935L280j0526r712M446R275Q646Q704j2551
$$ -24702 -20158 -23933 -9870 -17795 3140 6420 -4106 -13818 -9372 -97 8549 17253 4702
15361D702l9542k3386N960O705R058L345j0485m101J1817K0199J1219j8514Q276
$$ 4702 -34840 -58226 -52266 -45561 -36503 -33158 -43643 -47744 -35927 -15728 -4509 -23023 -14747
15348a4747K5140L0152J1701k2554l1904R496l2821J1683J561l06j7210j0219
$$ -14747 10393 40545 52246 29692 -2212 7284 -25537 -13854 -12293 -12599 -29809 -40028
15336d0028q377L035K6566J9168r151k9445j3629J4189K9344j5577r091r38j956
$$ -40028 -48405 -45370 -18804 364 -8787 -38232 -51861 -37672 -8328 -23905 -32996 -33934 -35890
15323c5890M92j620L3813l246l137L374n406j6105k2180J3068j402k5410J370
$$ -35890 -35398 -37018 -3205 -6451 -9588 -6214 -11620 -27725 -49905 -36837 -38239 -63649 -62279
15310f2279L3544L3219J5679k6680j8985O136J6136J634j0569N742R635m535j956
$$ -62279 -28735 4484 20163 -6517 -25502 -19366 -3230 -1596 -12165 -6423 3212 -1323 -3279
15297c279L069M499j0351J8817K0307o83p171j1285K3347P585j508k7452l504
$$ -3279 -210 4289 -6062 12755 33062 32379 25208 13923 37270 44855 43347 15895 12391
15284A2391j5867k1878q158J0077P016l978q390k1603J4742M4000N989M421l614
$$ 12391 -3476 -25354 -33512 -23435 -16419 -20397 -28787 -50390 -35648 8352 14341 18762 15148
15271A5148j4019j5230k0046m557P729P137l314K610J089P889J0827O041l7150
$$ 15148 1129 -14101 -34147 -38704 -30975 -23838 -27152 -24542 -23453 -15564 -4737 1304 -35846
15258c5846n392L972j4755l797R95k451o05K7833J7758j3466j7632J0985Q394
$$ -35846 -41238 -37266 -52021 -55818 -54823 -57274 -57879 -30046 -12288 -25754 -43386 -32401 -24007
15245b4007j95L749J5001K8927n189m95R767q658j9883j5569j4761k0428K2675
$$ -24007 -24202 -20453 -5452 23475 18286 17791 27558 18900 -983 -16552 -31313 -51741 -29066
15232b9066O302J1820J1545j7291m402J4820k628j808K1359L736p905l2925m980
$$ -29066 -22764 -10944 601 -16690 -21092 -6272 -8900 -10708 10651 14387 6482 -26443 -31423
15219c1423M048J2578k734J7920L2146J7712Q032k3175l9558o732j0396K2669
$$ -31423 -27375 -14797 -17531 389 32535 50247 58279 35104 -4454 -11186 -21582 1087
15207A087m6J7763j6381J9635m810K175m760j6755L866l560p334o231j1148k0899
$$ 1087 1041 18804 2423 22058 17248 19423 14663 -2092 1774 -1786 -9120 -15351 -26499 -47398
15193d7398j3782J5279L361L0447N877k0143j2005K829p571O060J6704N837n518
$$ -47398 -61180 -45901 -42540 -12093 -6216 -26359 -38364 -35535 -43106 -37046 -20342 -14505 -20023
15180b0023K5089k6745k703K4518L3r919j1900p796M384N196q450P316k2193L38
$$ -20023 5066 -21679 -24382 136 169 -9750 -21650 -29446 -25062 -19866 -28316 -21000 -43193 -42855
15166d2855L1524P394N684J4519p973j3926j1050K8040P332K0068q4j6201k3240
$$ -42855 -11331 -3937 1747 16266 8293 -5633 -16683 11357 18689 38757 38673 22472 -768
15153g68j5832j2984K0528k4366N877l0689r977K3986L3067K4519J1116j4662
$$ -768 -16600 -29584 -9056 -33422 -27545 -58234 -68211 -44225 -11158 13361 24477 9815
15141I815n103K4532k1900Q776m4381k3694J9107J5895K7496P521j3092n917n971
$$ 9815 4712 29244 7344 16120 -28261 -51955 -32848 -16953 10543 18064 4972 -945 -6916
15128f916K413K0626k756R341P696j7128k8670j135J9887k764K1461j2757r914
$$ -6916 -4503 16123 13367 22708 30404 13276 -15394 -16529 3358 594 22055 9298 -616
15115f16K0697j7994k4708m569J1550o092j573K1678J7048j5496j0981J1505l17
$$ -616 20081 2087 -22621 -27190 -15640 -21732 -23305 -1627 15421 -75 -11056 449 132
15102A32k2297l11O903K705K5102L2278J4941k8207j5928j6964k349j459k097
$$ 132 -22165 -22476 -15573 -12868 12234 44512 59453 31246 15318 -1646 -3995 -5454 -7551
15089g551O328j4412L756M737j7843O751J953o685k411K5229J5935N144k2556
$$ -7551 -1223 -15635 -11879 -7142 -24985 -18234 -16281 -22966 -25377 -148 15787 20931 -1625
15076a625r618j6411J1556L4510R726k7846M840Q91J0715O089j4045J724n051
$$ -1625 -11243 -27654 -16098 18412 28138 292 5132 6023 16738 22827 8782 10506 5455
15063E455j6788j1209K6908J7693O145m248l0879j2539J5296r088l556J2147J8098
$$ 5455 -11333 -22542 4366 22059 28204 23956 -6923 -19462 -4166 -13254 -16810 -4663 13435
15050A3435p162m9108j0938K4171J5111j1282o07K0798n973M807J2442K1391j5300
$$ 13435 6273 -42835 -53773 -29602 -14491 -25773 -26380 -5582 -11555 -6748 5694 27085 11785
15037A1785l663j7713k8787j2739j1155L4549N0152P798q035k2203J7925j1093
$$ 11785 8122 -9591 -38378 -51117 -62272 -27723 22429 30227 22192 -11 17914 6821
15025F821k7605K1351R724J2441l803p331q540j0747j3328k596r77L9982K0803
$$ 6821 -20784 567 10291 22732 18929 11598 3058 -7689 -21017 -23613 -24590 15392 36195
15012C6195k3653j4624J1362j7490J3167J5839J9207L515J1612L1265j2974p052
$$ 36195 12542 -2082 9280 -8210 4957 20796 40003 43518 55130 86395 73421 66369
15000F6369m573P508K6874R3900J53177K67667K14554p3981k63738k20223q5882
$$ 66369 61796 69304 96178 190078 343255 610922 825476 751495 487757 267534 181652
14989A81652o4030m3021l3776j2082j6902l807q060L0851p872j6650k746m421
$$ 181652 117622 74601 40825 28743 11841 8034 -26 30825 22953 6303 3557 -864
14977h64k623K0228q910j33J0550K350l9769l5619J1747L3014K5366l1782k6273
$$ -864 -3487 16741 7831 7698 18248 20598 -19171 -54790 -43043 -10029 15337 -16445 -42718
14964d2718N493O609L720J2810q100J7706k9690K0102J1583Q395K5376k0655j7560
$$ -42718 -37225 -30616 -26896 -14086 -22186 -4480 -34170 -14068 -2485 5910 31286 10631 -6929
14951f929j7058J4518Q250Q77o040J430q416l813L49j8256j2542m459J7703K5414
$$ -6929 -23987 -9469 -1219 -342 -6382 -4952 -13368 -17181 -16832 -35088 -47630 -52089 -34386 -8972
14937h972J6942j3880j9766l670J4372K8507l840o886j0132n99L249M415J0362
$$ -8972 7970 -5910 -25676 -29346 -14974 13533 9693 2807 -7325 -7924 -4675 -260 10102
14924A0102P822J2572J3931m1945n9662J3399M9989O573r21k350J5397l105J214
$$ 10102 17924 30496 44427 2482 -57180 -43781 6208 12781 11860 9510 24907 21802 23016
14911B3016o036l7417J6457K1511l608J9859m070k7418l1005r855L1768K3201
$$ 23016 16980 -20437 -3980 17531 13923 33782 29712 2294 -28711 -38566 -6798 16403
14899A6403Q348J3627J0085j4917m2980k0890r553m385J6825j95k6748O041J8053
$$ 16403 24751 38378 48463 33546 -9434 -30324 -39877 -44262 -27437 -27632 -54380 -48339 -30286
14886c0286N992M3555N855l791k6145k6388J9309k3933n038M699j0632j495K9585
$$ -30286 -24294 19261 25116 21325 -4820 -31208 -11899 -35832 -40870 -36171 -46803 -48298 -18713
14873a8713J1549K2781K3804j439k0261Q590j7940K6808N835r866p066j2975j5003
$$ -18713 -7164 15617 39421 37982 17721 26311 8371 35179 41014 31148 24082 11107 -3896
14860c896p421l888k2614O135L882o500R42m1N181J2572l258J6372J1984J9166
$$ -3896 -11317 -15205 -37819 -31684 -27802 -34302 -33360 -33401 -28220 -15648 -18906 -2534 9450 28616
14846B8616J4388j1086k4936l9q572j815l117M305p525P071k006q550L1657L5530
$$ 28616 43004 31918 6982 6943 -1629 -3444 -6561 -2256 -9781 -2710 -4716 -13266 18391 53921
14832E3921J0218k2752j5970l461j547L798K637J6700k6991l1046j3377k0168
$$ 53921 64139 41387 25417 21956 20409 24207 26844 43544 16553 -14493 -27870 -48038
14820d8038p420M2658K0401L209M717p316j1843j5682j3651J0160N669k011j5820
$$ -48038 -55458 -12800 7601 10810 15527 8211 -3632 -19314 -32965 -22805 -17136 -19147 -34967
14807c4967K97L6021J7054l387J7109j8969m593q694R252j1475l602J6709k773
$$ -34967 -34670 1351 18405 15018 32127 13158 8565 -129 9123 -2352 -5954 10755 7982
14794G982J8932L021j7923k3723j3821N616m711j0267k616J2731J3460m473o44
$$ 7982 26914 29935 12012 -11711 -25532 -19916 -24627 -34894 -37510 -24779 -11319 -15792 -16436
14781a6436j1909j9858J2553M644N789Q929J7103l906J4724j862L810q841l955
$$ -16436 -28345 -48203 -35650 -31006 -25217 -16288 815 -3091 11633 9771 13581 4740 785
14768G85M338M018k5651l2293R909J7463j4047j9189J7471K9857P584J6939K1312
$$ 785 5123 9141 -16510 -48803 -38894 -21431 -35478 -54667 -37196 -7339 245 17184 38496
14755C8496j2595j9589o923k2419l417n921j0404k0595l181Q951K0270m343k380
$$ 38496 25901 6312 -611 -23030 -26447 -32368 -42772 -63367 -66548 -57597 -37327 -41670 -44050
14742d4050J6449Q125J11j4577K176L463K153J0844j0110l5297m586j5319K1049
$$ -44050 -27601 -19476 -19365 -33942 -31766 -28303 -26150 -15306 -25416 -60713 -65299 -80618 -59569
14729e9569L3987J7262m545J2101M1k5850r689j0261j0952M0778J3919n149j556
$$ -59569 -25582 -8320 -12865 -764 -723 -26573 -36262 -46523 -57475 -16697 -2778 -7927 -9483
14716i483O717J5130o46q443j2029P37J7937m122l3587l417j7439R717K8126L9529
$$ -9483 -2766 12364 11718 3275 -8754 -8017 9920 5798 -27789 -31206 -48645 -38928 -10802 28727
14702B8727j9806j6839K4994l461j7381Q875K858j7463k294j0476j1734K456L862
$$ 28727 8921 -7918 17076 13615 -3766 5109 7967 -9496 -11790 -22266 -34000 -31544 -27682
14689b7682L024J2745K8749j1780o990M880Q644J2582l6980m0015R183K0410N8403
$$ -27682 -24658 -11913 16836 5056 -1934 2946 11590 24172 -12808 -52823 -43640 -23230 35173
14676C5173Q562o437J842k632p378M224j4961l3487l1511k4298j51K8123K2690
$$ 35173 43735 37298 39140 36508 29130 33354 18393 -15094 -46605 -70903 -71054 -42931 -20241
14663b0241J6740j9636J0566O363J4477J1776r656J7824Q389k1456o758k7989
$$ -20241 -3501 -23137 -12571 -6208 8269 20045 10389 28213 36602 15146 8388 -19601
14651a9601j0804K3323j2159P313K0718K8387M900j6986J920m883J0554J5220
$$ -19601 -30405 -7082 -19241 -11928 8790 37177 42077 25091 27011 22128 32682 47902
14639D7902M079k5941j1395K9680l1677j7841o913J4959Q138J1837M248j1463
$$ 47902 51981 26040 14645 44325 12648 -5193 -12106 2853 10991 22828 27076 15613
14627A5613j991j2343l0269L0877K9257L15l0335J6066j764L098j337J2971L3290
$$ 15613 13622 1279 -28990 1887 31144 31459 1124 17190 15426 18524 17187 30158 63448
14614F3448q475P67J7398o288j8634k5925j1662l825k528k1003J2116p005q421
$$ 63448 54973 55740 73138 66850 48216 22291 10629 6804 4276 -16727 -4611 -11616 -20037
14601b0037j1489K0456J8638j2433k365K9861J533J3173M649j0933q344L307J486
$$ -20037 -31526 -11070 7568 -4865 -7230 22631 24164 37337 41986 31053 22709 26016 27502
14588B7502l1129k4351J6902R9l2336R581R547K6724J7956j7765r86L172J5469
$$ 27502 -3627 -27978 -11076 -10977 -43313 -33732 -24185 2539 20495 2730 1744 4916 20385
14575B0385k0228l152j3429j9934L3353L5768J6544j1029m9602m4478l944N6582
$$ 20385 157 -2995 -16424 -36358 -3005 32763 49307 38278 -11324 -55802 -59746 -3164
14563c164L8339j4466p391k427k8760Q051J8394k3100k0816J6319K4769L6487
$$ -3164 35175 20709 13318 10891 -17869 -9818 8576 -14524 -35340 -19021 5748 42235
14551D2235j6552j2913K1626o490j7200K684J708j851R359O773j3431k0331J5406
$$ 42235 25683 12770 34396 27906 10706 13390 15098 13247 22606 29379 15948 -4383 11023
14538A1023K35l5o590j285r23n74P392J3714j8439k3980K6844l2051K6373L3411
$$ 11023 11258 11223 4633 3348 2425 1851 9243 22957 4518 -19462 7382 -24669 1704 35115
14524C5115k1595k0308m180J1645M389j1949k0401J850L903J5109K203J01k4560
$$ 35115 13520 -6788 -10968 677 5066 -6883 -27284 -25434 -21531 -6422 -4219 -4118 -28678
14511b8678j8809J4764j6418q169J6024K1764k818R383j8866K507L9459J2299
$$ -28678 -47487 -32723 -49141 -57310 -41286 -19522 -22340 -12957 -31823 -29316 10143 22442
14499B2442J0626j2760j3117j7106R196K5953m074j8245j8903J5676J5296m923
$$ 22442 33068 20308 7191 -9915 -719 25234 21160 2915 -15988 -312 14984 10061
14487A0061m154j47p600J1082j597P97K5068j8063j5418R590q939J2175j8461
$$ 10061 5907 5760 -1840 9242 7645 8442 33510 15447 29 9619 680 12855 -5606
14474e606k5572N536J0191K507r219l2187N841O515Q628L58K0481n901J6373o01
$$ -5606 -31178 -25642 -15451 -12944 -22163 -54350 -48509 -41994 -33366 -33008 -12527 -18428 -2055 -2656
14460b656p443o466j3337P429J7660m823k537j2449M493L71K0631L5877K3428
$$ -2656 -10099 -16565 -29902 -22473 -4813 -9636 -12173 -24622 -20129 -19758 873 36750 60178
14447F0178k693k1372k1441j4990N408J3825M526q679J6521r488m396j5825P044
$$ 60178 57485 36113 14672 -318 5090 18915 23441 14762 31283 21795 17399 1574 8618
14434H618K730j603n929J0134J9555j6671L150K461j8239J3776J5701N518l4241
$$ 8618 11348 9745 3816 13950 33505 16834 19984 22445 4206 17982 33683 39201 4960
14421D960k9188L7081L028R144q670m231r328p753O832r171l139M954j5611L4761
$$ 4960 -24228 12853 15881 25025 16355 12124 2796 -4957 1875 -7296 -10435 -5481 -21092 13669
14407A3669L4714M10j5025K075r438j0455j5407m469M660j4033K2770J9392l0326
$$ 13669 48383 48793 33768 35843 26405 15950 543 -3926 734 -13299 9471 28863 -1463
14394a463j8685l302k2590j623J0248K2766J1625K211L587J8855J2955j6456m518
$$ -1463 -20148 -23450 -46040 -47663 -37415 -14649 -3024 -813 2774 21629 34584 18128 13610
14381A3610L868J2656j597o077M2931Q836k0847j9115M195J4482K5539J9444j9997
$$ 13610 17478 30134 28537 22460 65391 74227 53380 34265 38460 52942 78481 97925 77928
14368G7928k0536K7608p010L382J6602K8221N0516R7212J34826J67769J84463
$$ 77928 57392 85000 77990 81372 97974 126195 176711 273923 408749 576518 760981
14357G60981J69175J32562R6782N1167n1827j41103j76937j93868j59485j13454
$$ 760981 930156 1062718 1159500 1210667 1158840 1017737 840800 646932 487447 373993
14347C73993m7985n6514p9264m2846k6135k9444r537p044k5198k3574j6018O623
$$ 373993 326008 269494 190230 147384 121249 91805 82268 75224 50026 26452 10434 17057
14335A7057j381l151J0355N961k072k292j929J5636J8006R04o965J6743l7969
$$ 17057 15676 12525 22880 28841 26769 24477 22548 38184 56190 57094 50129 66872 28903
14322B8903j9312K2378k4092k7901K2992L8892K0326J7499k3802j8758j481L323
$$ 28903 9591 31969 7877 -20024 2968 41860 62186 79685 55883 37125 35644 38967
14310C8967M291N996j3027j0453j2661l656P28m395J7790j2659j7159R954K1976
$$ 38967 43258 49254 36227 25774 13113 9457 10185 5790 23580 10921 -6238 3716 25692
14297B5692K0227N401l7199J2927R130L470j983j7636m042J9145k4741J1968K9912
$$ 25692 45919 51320 14121 27048 36178 39648 37665 20029 15987 35132 10391 22359 52271
14284E2271M914o515o31J2969k758j1326m0730J1020P542J0868j6258j5279R300
$$ 52271 57185 50670 50039 63008 60250 48924 8194 19214 26756 37624 21366 6087 15387
14271A5387J6563j000p758j3595m876J979j4211J2984J8094k1686k265O852J5780
$$ 15387 31950 30950 23192 9597 4721 6700 -7511 5473 23567 1881 -384 6468 22248
14258B2248O995k0088k4051o991J3941J386K304K0798m212K370J993N243O847
$$ 22248 29243 9155 -14896 -21887 -7946 -6560 -4256 16542 12330 14700 16693 21936 28783
14245B8783M075n142m004J2687N962P390j1386O995n315J238N807o092j6695j5911
$$ 28783 32858 27716 23712 36399 42361 49751 38365 45360 40045 41283 47090 40998 24303 8392
14231H392p500n772J4197J9862j4806k7865J3623K9827K4876j6152K949J664M110
$$ 8392 892 -4880 9317 29179 14373 -13492 131 29958 54834 38682 41631 43295 47405
14218D7405j9148j8257J4581J2485j5132l4067l365M381M0587l487M19K2848j5336
$$ 47405 28257 10000 24581 37066 21934 -12133 -15498 -11117 29470 25983 26402 49250 33914
14205C3914M355l894K0327k2964q793L1828Q888J1507k1290j0592p25J2807Q953
$$ 33914 38269 34375 54702 31738 22945 54773 63661 75168 53878 43286 42561 55368 64321
14192F4321l0826m0513J8289L8342L0811K4129p533J0433k7180j5903j1134l2510
$$ 64321 33495 -7018 11271 49613 80424 104553 97020 107453 80273 64370 53236 20726
14180B0726m0083L401K4448Q768R743J852m037j3971N240o789J0351J6321K9473
$$ 20726 -19357 -15956 8492 17260 27003 28855 24818 10847 16087 9298 19649 35970 65443
14167F5443J5851m86k3918P926n098j409m088j2891k0375K820L113j3974J1422
$$ 65443 81294 80808 56890 64816 59718 58309 54221 41330 20955 23775 26888 12914 24336
14154B4336K5639n151l897K0587p515j2541l7750k1822j2397J7377L4628K2684
$$ 24336 49975 44824 40927 61514 53999 41458 3708 -18114 -30511 -13134 21494 44178
14142D4178M422J2233K4186j1401K2410L86Q631M2922M1816K4764j4591l7456
$$ 44178 48600 60833 85019 73618 96028 96414 105045 147967 189783 214547 199956 162500
14130A62500k1363l1579j1837N193p857l6947k5553P417J7118k6118k1544O495
$$ 162500 141137 109558 97721 102914 95057 58110 32557 39974 57092 30974 9430 15925
14118A5925J4811M432N184j1254R429p771J939J4545N547J570P956l078k5550
$$ 15925 30736 35168 40352 29098 38527 30756 32695 47240 52787 54357 62313 59235 33685
14105C3685l721J1112k4778n644K2222L901m165q354J1184M671N015J8791j741
$$ 33685 29964 41076 16298 10654 32876 36777 32612 24258 35442 40113 45128 63919 62178
14092F2178k814J0836L4395N437j4390m973j0042k7698K592l247o883J1760K7842
$$ 62178 59364 70200 104595 110032 95642 90669 80627 52929 55521 52274 45391 57151 84993
14079H4993k649o453r592n119j7918j7186o381R996o060k430N5255O8451K119
$$ 84993 82344 75891 66299 61180 43262 26076 19695 29691 23631 21201 76456 144907 147026
14066A47026k5262k8949J9822K4274l1756q200R874k1812l2214j0291M175r81
$$ 147026 121764 92815 112637 136911 105155 96955 106829 85017 52803 42512 46687 45706
14054D5706R150J5730M790K1654K5098q707r966j6525j496J8455J469k4875j2000
$$ 45706 54856 70586 75376 97030 122128 113421 103455 86930 85434 103889 105358 80483 68483
14041F8483l607K0552J7417R919R577j2092o443N829L0213j0327n065K0964J4580
$$ 68483 64876 85428 102845 112764 122341 110249 103806 109635 139848 129521 124456 145420 160000
14028A60000k635o217k3198J0028L0528n681J5791q918j5556K425m2150j9539
$$ 160000 157365 151148 127950 137978 168506 162825 178616 169698 154142 156567 114417 94878
14016I4878k5592J705J8535j639l2108r820J9817L1128N9890K4387O861J2653
$$ 94878 69286 70991 89526 87887 55779 45959 65776 96904 156794 181181 188042 200695
14004B00695J5247K3189J0446O429m539j0910L43r569j5330J8442M4809L0284
$$ 200695 215942 239131 249577 256006 251467 240557 240900 231331 216001 234443 279252 309536
13992C09536L8883l059k1466q738k2950j2344J7110Q253K0916j2556q917K1145
$$ 309536 348419 345360 323894 315156 292206 279862 296972 305225 326141 313585 304668 325813
13980C25813J566R114P549K0906K6801J5515j1706j5948j1159q89p179j7166M430
$$ 325813 327379 336493 344042 364948 391749 407264 395558 379610 368451 367562 360383 343217 347647
13967C47647J4267j7477n97R788l1370M653L4620k1566k8447N429J4016j0770
$$ 347647 361914 344437 343840 353628 322258 326911 361531 339965 311518 316947 330963 320193
13955C20193L424o467O314J14n62L5924L5966J4686J7634L2238J9982L1327o721
$$ 320193 323617 317150 323464 323578 323016 358940 394906 409592 427226 459464 479446 510773 504052
13942E04052m766k1836R225L729r425L1807J9383J7828K6350M0783Q017l326K498
$$ 504052 499286 477450 486675 490404 480979 512786 532169 549997 576347 617130 625147 621821 624319
13929F24319L321k056K1905j3982K0664L1716K5007J2036R725M4928O4740M5263
$$ 624319 627640 625584 647489 633507 654171 685887 710894 722930 732655 777583 842323 887586
13917H87586P4838Q3499R3130Q9245J18179O5565N3047N1920J05136J35533J77259
$$ 887586 962424 1045923 1139053 1228298 1346477 1412042 1465089 1517009 1622145 1757678 1934937
13906A934937K16474K15332K80644L56071M08734N09048O01175P13198Q99879
$$ 1934937 2151411 2366743 2647387 3003458 3412192 3921240 4522415 5235613 6135492
13897F135492J024433J074433J069434J069558J086247J183823J476058K131355
$$ 6135492 7159925 8234358 9303792 10373350 11459597 12643420 14119478 16250833
13889A6250833L416964N799749J0276585J7454587K5193585L1544362L5325729
$$ 16250833 19667797 25467546 35744131 53198718 78392303 109936665 145262394
13882A45262394L4553199K7471546J4792967l81266j4993999k7294400l3726415
$$ 145262394 179815593 207287139 222080106 221698840 206704841 179410441 145684026
13875A45684026l3905473l0524967k4310598j7098837j0702922o611453m212825
$$ 145684026 111778553 81253586 56942988 39844151 29141229 22529776 18316951
13868A8316951k780650j960249j500964j269873j201816j156828j123853j055589
$$ 18316951 15536301 13576052 12075088 10805215 9603399 8446571 7322718 6267129
13860F267129r52920p96403o19856m79633l89833l05294k42937j92043j78704
$$ 6267129 5314209 4517806 3897950 3418317 3028484 2723190 2480253 2288210 2109506
13851B109506j48516j49417j28029j09148j16424p7510o1107n7303n3523n7130
$$ 2109506 1960990 1811573 1683544 1574396 1457972 1380462 1319355 1262052 1208529 1151399
13841A151399m9563k3211j9969j16K9646P0400O8957P0067Q3377K1716l1051p8329
$$ 1151399 1101836 1078625 1058656 1058540 1088186 1158586 1227543 1297610 1380987 1402703 1371652 1293323
13829A293323j41578j33171j28102j26900j18994p9326m324J7226L4747L7271
$$ 1293323 1151745 1018574 890472 763572 644578 565252 560928 578154 612901 650172
13819F50172O0807R8521P2605O4456L9539k5711o5841j05774j40863j07703q0085
$$ 650172 710979 809500 882105 946561 986100 960389 894548 788774 647911 540208 460123
13808D60123o2965m6721p769j8038l5203j0096j8265p940j7762j0607R884p829
$$ 460123 397158 350437 342668 324630 289427 279331 261066 253126 235364 224757 234641 226812
13796B26812j7374j3546K0253L0075J0041k7219q50Q653j1717n545l829J9410
$$ 226812 209438 195892 216145 246220 256261 229042 228192 236845 225128 219583 215754 235164
13784B35164j2099k4290o244j3638r726K3024M1146O6823R0687J13378J16600
$$ 235164 223065 198775 192531 178893 169167 192191 233337 300160 390847 504225 620825
13773F20825R0507N6930J6936l1201j00000j19436j04615j02991r3321m0294j8076
$$ 620825 711332 768262 785198 753997 653997 534561 429946 326955 233634 193340 175264
13762A75264l7710j8978q47L9196L5569N8944N4992N1867M7011M8101J0513J2372
$$ 175264 137554 118576 117729 156925 192494 251438 306430 358297 405308 453409 463922 476294
13750D76294j5410m7052p4797m3089o111j3819l5391o759K3949J0966J2718j3947
$$ 476294 460884 413832 339035 295946 289835 276016 240625 233866 257815 268781 281499 267552
13738B67552K2022K1946K6389L7330M6900M0611N4155N5299J9379M1332M10o449
$$ 267552 289574 311520 337909 375239 422139 462750 516905 572204 591583 632915 633325 626876
13726F26876n2517p6994r3029q3070o9244o5522j2802j8313l2731j0228M622j695
$$ 626876 574359 497365 404336 321266 252022 186500 173698 155385 122654 112426 117048 115353
13714A15353o294j7454m326q706k2224k0768l34O35k707L2670L4211J7027J035
$$ 115353 109059 91605 87279 78573 56349 35581 35247 35882 33175 65845 100056 117083 118118
13701A18118Q821k2698k4271P644K6132l752l1362j1325o452r685p028j3485j4218
$$ 118118 126939 104241 79970 87614 113746 109994 78632 67307 60855 51170 44142 30657 16439
13688A6439N50L8512L3556k5732j4157O940k2115o440L1979L5200j5325l9583
$$ 16439 16989 55501 89057 63325 49168 56108 33993 27553 59532 94732 79407 39824
13676C9824N660R450N185l1243j8140J55N903J0466J1549j2656p470j114p076
$$ 39824 45484 54934 60119 28876 10736 10891 16794 27260 38809 26153 18683 17569 10493
13663A0493K4327p593j3986m032K1334J3078M250K480l200J2786N72p995r34K001
$$ 10493 34820 27227 13241 9209 30543 43621 47871 50351 47151 59937 60509 52514 51580 53581
13649E3581l360N762L448j9885j4663J1792P983R632r056j8899j761j726k3070
$$ 53581 50221 55983 59431 39546 24883 36675 44658 54290 45234 26335 24574 22848 -222
13636b22M484L9787K4444J7783N300l7680J7343L6450j6264l5982l1534j396J9420
$$ -222 4262 44049 68493 86276 91576 53896 71239 107689 91425 55443 23909 22513 41933
13623D1933K6767j0992j5222J3916p297L511j0791o511J6194j0045K477p995J726
$$ 41933 68700 57708 42486 56402 49105 52616 41825 35314 51508 41463 43940 35945 37671
13610C7671n808j8634K4978r890O110j4619j5493K1458K5610J7001R286j5567
$$ 37671 31863 13229 38207 28317 34427 19808 4315 25773 51383 68384 77670 62103
13598F2103m008k6535r375J3531J7512l5311j1726K3979K136l481k1794J4244
$$ 62103 58095 31560 22185 35716 53228 17917 6191 30170 32306 28825 7031 21275
13586B1275L507R307K5659k3261k1224J6044J2002M286j3581p782k7056j6800
$$ 21275 24782 34089 59748 36487 15263 31307 43309 47595 34014 26232 -824 -17624
13574a7624k0074l942J8169K1451j2518J5186R206m197M813P478P589j1056K7446
$$ -17624 -37698 -41640 -23471 -2020 -14538 648 9854 5657 10470 17948 25537 14481 41927
13561D1927K0492N4018L8352R587N305M9481O32J3764j6403m7968l2989l8766
$$ 41927 62419 116437 154789 164376 169681 219162 219794 233558 217155 169187 136198 97432
13549I7432k1075o576k7069q237j2009K965k136J8511q525l289K545k275k466
$$ 97432 76357 69781 42712 34475 22466 25431 23295 41806 33281 29992 32537 30262 27796
13536B7796KJ4083L3898L0149M806J5418J7477K0409N920m396o195J6479m585
$$ 27796 27798 41881 75779 105928 110734 126152 143629 164038 169958 165562 159367 175846 171261
13523A71261l0995k0247r664K4869N970k7522p141q525k0669p602q791m4168Q641
$$ 171261 140266 120019 110355 135224 141194 113672 106531 98006 77337 69735 60944 16776 25417
13510B5417L0025R254Q047j0343j2559J488K736J4316j5776o3499r506P212N076
$$ 25417 55442 64696 72743 62400 49841 51329 54065 68381 52605 -10894 -20400 -13188 -8112
13497h112L4666P876p326L834J5816k8793j5635K6797J1399J212Q541j2028m306
$$ -8112 26554 34430 27104 30938 46754 17961 2326 29123 40522 41734 50275 38247 33941
13484C3941m0308j9365J4917J4000J4462k147k1716r220J2339K9298Q044j0469
$$ 33941 -6367 -25732 -10815 3185 17647 15500 -6216 -15436 -3097 26201 34245 23776
13472B3776j0364j015j8586J707R867n269r981K9891L404J1173N858O965o423
$$ 23776 13412 12397 -6189 -4482 5385 116 -9865 20026 23430 34603 40461 47426 41003
13459D1003L130l863j3825K0173O279k0041m1434n854q242J1262q400p763R130
$$ 41003 44133 40270 26445 46618 52897 32856 -8578 -14432 -22674 -11412 -19812 -27575 -18445
13446a8445J1669j0776J0785k207J3121J2918L97r37K2736K7804J0285n069j2474
$$ -18445 -6776 -17552 -6767 -8974 4147 17065 17462 16525 39261 67065 77350 72281 59807
13433E9807n809J046K0576m94k0324j7812j8412J375R441j3120J4312P941P399
$$ 59807 53998 55044 75620 75126 54802 36990 18578 19953 29394 16274 30586 38527 45926
13420D5926Q303l180k408k918P072J3043r49J215L40k791K4313L1444J118p435
$$ 45926 54229 51049 48641 45723 52795 65838 64889 66104 66444 63653 87966 119410 120528 113093
13406A13093L2866M2050R5953J44072J88180J69781J51802J60834R6779q4r8717
$$ 113093 145959 188009 283962 428034 616214 785995 937797 1098631 1195410 1195326 1096609
13395A096609j53714j42270j48640j77316j36163j09748q7812j5342l2833j9966
$$ 1096609 942895 800625 651985 474669 338506 228758 140946 125604 92771 72805
13385G2805l014J9570Q155k2188j3729o038R22p078p102J3908p282J0020l742
$$ 72805 69791 89361 97516 75328 61599 55561 56483 49405 42303 56211 48929 58949 55207
13372E5207n0569l2621m784J425K4294J0462q677l657r960L3602N286k2614N711
$$ 55207 4638 -27983 -32767 -31342 -7048 3414 -5263 -8920 -18880 14722 20008 -2606 3105
13359C105q266Q347k4433l6785K2532M5988K520j9804l114L509P432K888l7725
$$ 3105 -5161 3186 -21247 -58032 -35500 10488 13008 -6796 -9910 -6401 1031 3919 -33806
13346c3806r401m383K6757K7588J8753K0249k6759j9547l0028j8268M0585L4100
$$ -33806 -43207 -47590 -20833 6755 25508 45757 18998 -549 -30577 -48845 -8260 25840
13334B5840J8834j1443j3156k098p865j1562L399K956J9493k146r010l224n230
$$ 25840 44674 33231 20075 17977 10112 -1450 1949 4905 24398 22252 13242 10018 4788
13321D788k0690k6063l44K3741K5489J9588j1223q662M404j7940j3059R922L298
$$ 4788 -15902 -41965 -42309 -18568 6921 26509 15286 6624 11028 -6912 -19971 -10049 -6751
13308f751J061J2175J7742j4531n27O601R806K080j8074j3595p242n909J8111
$$ -6751 -5690 6485 24227 9696 9169 15770 25576 27656 9582 -4013 -11255 -17164 947
13295I47J5220L698J6731M719k6701P236o970j6076J2699K814J1804O048J8173
$$ 947 16167 19865 36596 41315 14614 21850 14880 -1196 11503 14317 26121 32169 50342
13282E0342k3469n834r689r651J9540K4155P798k9648k0428j0847J276J6808j016
$$ 50342 26873 21039 11350 1699 21239 45394 53192 23544 3116 -7731 -6455 10353 9337
13269I337n629l538m02P324L78K4863m394k3742Q473O175p062k0058J3804K3340
$$ 9337 3708 170 -232 7092 7470 32333 27939 4197 12670 18845 11783 -8275 5529 28869
13255B8869L533j5745P52k1152Q27N812j501n069L216J1214k640J816j9363q285
$$ 28869 32402 16657 17409 -3743 -2916 2896 1395 -3674 -458 10756 8116 9932 -9431 -17716
13241a7716N451j717J4389J8281J2290k5220J790R292k60k2072l747m633K619
$$ -17716 -12265 -13982 407 18688 30978 5758 7548 16840 16580 -5492 -9239 -13872 -11253
13228a1253j5026j3157j4143R098L487J0712J9416k0053P855J3875k202O570K1406
$$ -11253 -26279 -39436 -53579 -44481 -40994 -30282 -10866 -30919 -23064 -9189 -11391 -4821 16585
13215A6585L361l12p534N692K4354J9669k181j4250q153j8252L3867J1090l0409
$$ 16585 19946 19634 12100 17792 42146 61815 59634 45384 37231 18979 52846 63936 33527
13202C3527k7377j2924M868J3072j76J1580o109p259l814j5598R826J6092j5194
$$ 33527 6150 -6774 -1906 11166 10990 22570 16461 9202 5388 -10210 -384 15708 514
13189E14k5441j515L268K1935J0095k4679k1599k3119j0136P334L2349J2372O595
$$ 514 -24927 -26442 -23174 -1239 8856 -15823 -37422 -60541 -70677 -63343 -30994 -18622 -12027
13176a2027j731j2327J5104J0044j5983o476n049k1269Q046K1306J4849J8565
$$ -12027 -13758 -26085 -10981 -937 -16920 -23396 -28445 -49714 -41668 -20362 -5513 13052
13164A3052L783j2274j7222J8010m816j9482j2550L730J0444j575L5161J4584
$$ 13052 16835 4561 -12661 5349 533 -18949 -31499 -27769 -17325 -18900 16261 30845
13152C0845o955L078j4274k167J2773j0634r907J8311J6878Q635J6634J9294l3002
$$ 30845 23890 26968 12694 10527 23300 12666 2759 21070 37948 46583 63217 82511 49509
13139D9509l2550O867j1869K3507k95J1863L2613j4445l2671j5691k721j8001
$$ 49509 16959 23826 11957 35464 35169 47032 79645 65200 32529 16838 14117 -3884
13127c884p240M828j6551q344K3571J2787K9292j1286l3252R498Q97j5075J2040
$$ -3884 -11124 -6296 -22847 -31191 -7620 5167 34459 23173 -10079 -581 316 -14759 -2719
13114b719K4667M5285j1243k6306n973n731O215K2729m609k7513j2331l3401j0151
$$ -2719 21948 67233 55990 29684 23711 17980 24195 46924 42315 14802 2471 -30930 -41081
13101d1081K8990J035n012J963k0938j1994L648j5989J3566L511M92M458j0464
$$ -41081 -12091 -11056 -16068 -14105 -35043 -47037 -43389 -59378 -45812 -42301 -41809 -37351 -47815
13088d7815J635m23m699J865L5448L8130R600j0027j0856m8344l465J2185o012
$$ -47815 -46180 -46603 -51302 -49437 -13989 24141 33741 23714 12858 -35486 -38951 -26766 -32778
13075c2778P469O630j0684M669K1521R671o583j1029N502k2023K3690j2234m0911
$$ -32778 -25309 -18679 -29363 -24694 -3173 6498 -85 -11114 -5612 -27635 -3945 -16179 -57090
13062e7090J4529R242Q495J6476J9870R642P985o353r892k5847N972J2719k2721
$$ -57090 -42561 -33319 -24824 -8348 11522 21164 29149 22796 12904 -12943 -6971 5748 -16973
13049a6973P209l505K321n368j2174n557J4337K2847L759j5238j2690L578K6073
$$ -16973 -9764 -13269 -10948 -16316 -28490 -34047 -19710 3137 6896 -8342 -21032 -17454 8619
13036H619L8482j431j1051O384M984q323J2072k6368k2686j861m546j0517q509
$$ 8619 47101 45670 34619 41003 45987 37664 49736 23368 682 -1179 -5725 -16242 -24751
13023b4751P373P481N902K2124k5448R949K340M284N909R290K6011k2343l9666
$$ -24751 -17378 -9897 -3995 18129 -7319 2630 4970 9254 15163 24453 50464 28121 -11545
13010a1545o531L9464K4291k6266l1719J0386n739J9729k534k4511J648N659r957
$$ -11545 -18076 21388 45679 19413 -12306 -1920 -7659 12070 9536 -14975 -13327 -7668 -17625
12997a7625l1625n785K1817J3418L0503q567j1246J4091k468J7694j3731Q189
$$ -17625 -49250 -55035 -33218 -19800 10703 2136 -9110 4981 2513 20207 6476 14665
12985A4665k2499l318J4471N230k0480M016J5472P699m687k0100K2573J6823k416
$$ 14665 -7834 -11152 3319 8549 -11931 -7915 7557 15256 10569 -9531 13042 29865 27449
12972B7449k4431k1575J5761p634M629J840j9451Q236n614J822J0333o983K368
$$ 27449 3018 -18557 -2796 -10430 -5801 -3961 -23412 -15176 -20790 -18968 -8635 -15618 -13250
12959a3250J298N963k0977R497K086k5816j983p206r287O764j5662j1558M576
$$ -13250 -11952 -5989 -26966 -17469 -15383 -41199 -43182 -50388 -59675 -52911 -68573 -80131 -75555
12946g5555J3316Q062J5273J3505J4699M436k8860r352J3335O516Q633p166K1611
$$ -75555 -62239 -54177 -38904 -25399 -10700 -6264 -35124 -44476 -31141 -24625 -15992 -23158 -1547
12933a547k13r611j555M574M754j2787J1607O265j8649j183M462M732L826j0864
$$ -1547 -1760 -11371 -12926 -8352 -3598 -16385 -4778 1487 -17162 -18345 -13883 -9151 -5325 -16189
12919a6189p092N48L2592J3123j2059k7408j1385j0530M3447J8617p789j3884
$$ -16189 -23281 -22733 9859 22982 10923 -16485 -27870 -38400 5047 23664 15875 1991
12907A991J2124J1632q381L930K3409N97l7619j2504k3053M406K1096K8310K5946
$$ 1991 14115 25747 17366 21296 44705 45302 7683 -4821 -27874 -23468 -2372 25938 51884
12894E1884K234L886j4507o785Q305o087k0209J0724N096j1377J0016M990M435
$$ 51884 54118 58004 43497 36712 45017 38930 18721 29445 34541 23164 33180 38170 42605
12881D2605M25l7728m8173J8733L9267O641l6905j5715L2424O374r400q598R860
$$ 42605 43030 5302 -42871 -24138 15129 21770 -15135 -30850 1574 7948 -1452 -10050 -190
12868a90k7237j4066L3223J3312m049K7528j0732j7081J3813j0830n542r769K0831
$$ -190 -27427 -41493 -8270 5042 993 28521 17789 708 14521 3691 -1851 -11620 9211
12855I211l183j176K3886O834J2631j1029j6104q775k6120k6033j3499P917j1053
$$ 9211 6028 4852 28738 35572 48203 37174 21070 12295 -13825 -39858 -53357 -45440 -56493
12842e6493K695K7769M507m878P487M845K5573j3201l5389k980N893p773k583
$$ -56493 -53798 -26029 -21522 -26400 -18913 -14068 11505 -1696 -37085 -40065 -34172 -41945 -44528
12829d4528J4676k790J3605K1846M8110m39P724N18m6975k1485K599J1877J6949
$$ -44528 -29852 -32642 -19037 2809 50919 50480 58204 58722 11747 -9738 -7139 4738 21687
12816B1687K465K2276L9189K580n778j0287l0742l8448L249p815j1147q022p315
$$ 21687 24152 46428 85617 88197 82419 72132 41390 2942 6191 -1624 -12771 -20793 -28108
12803b8108R564j3795L487J2503J1678j4702q841p395k3859O705M128J0546L5134
$$ -28108 -18544 -32339 -28852 -16349 -4671 -19373 -28214 -35609 -59468 -52763 -48635 -38089 -2955
12790b955N180j1211j0083l4717k0686P051j953N5805Q997j7609N433K5444Q653
$$ -2955 2225 -8986 -19069 -53786 -74472 -67421 -69374 -13569 -4572 -22181 -16748 8696 17349
12777A7349m755O625l299r494K590L705M456k942N88m971J0073l2833m594m31
$$ 17349 12594 19219 15920 6426 9016 12721 17177 14235 14823 9852 19925 -12908 -17502 -17933
12763a7933p124m719K0036K0904K4473J9050N7264P0806O3964J1417k7417o8525
$$ -17933 -25057 -29776 -9740 11164 35637 54687 111951 182757 246721 258138 230721 162196
12751A62196o9925k9143j2529n505j5195j345m889j5269q284N051K2063R984J404
$$ 162196 92271 63128 50599 45094 29899 28554 23665 8396 112 5163 27226 37210 38614
12738C8614p510J188k0318l1715j0751J5940J1113J5138J1663p5j7442j0626j0636
$$ 38614 31104 32292 11974 -19741 -30492 -14552 -3439 11699 23362 23287 5845 -4781 -15417
12725a5417n940K127L4097J739j1079O06J7300j5499k4922Q681J8316l7948k0550
$$ -15417 -21357 -19230 14867 16606 5527 6133 23433 7934 -16988 -8307 10009 -27939 -48489
12712d8489K1821J1720J7765P082r630j234j829l3110o870O143m481j4091j2306
$$ -48489 -26668 -14948 2817 9899 269 -965 -2794 -35904 -42774 -36631 -41112 -55203 -67509
12699f7509J7930J8241j8153J104K8825K599j2060J4942J3413P490J490m767J4123
$$ -67509 -49579 -31338 -49491 -48387 -19562 -16963 -29023 -14081 -668 6822 8312 3545 17668
12686A7668K1554j6197k9879p091J0353J4501K253Q771J3656J549j549P065j0980
$$ 17668 39222 23025 -6854 -13945 -3592 10909 13162 21933 35589 37138 35589 42654 31674
12673C1674j3532j0667m044P651M766o447o238J3698J4270J1569j594M2084O2630
$$ 31674 18142 7475 3431 11082 15848 9401 3163 16861 31131 42700 41106 83190 145820
12660A45820O5104J18314K31533M08360N44661L82382o0492m58094n03616l16979
$$ 145820 210924 329238 560771 969131 1513792 1896174 1835682 1377588 873972 556993
12650E56993j71412j07450m4566o8915n1572n6595l0082j5061P734L1647K4518
$$ 556993 385581 278131 233565 164650 113078 56483 26401 11340 19074 50721 75239
12639G5239l839l7639L438o414k6020J1001J3963M699K4082R230J1233k065k3296
$$ 75239 71400 33761 37199 30785 4765 15766 29729 34428 58510 67740 78973 76908 53612
12626E3612j6648J1035L6455K6136L5802L4872j9402l5138r374k9610m4446q965
$$ 53612 36964 47999 84454 110590 146392 181264 161862 126724 117350 87740 43294 34329
12614C4329p354p044m546j1488J6414J8584L493N887k1740q067j4271M3q59j6629
$$ 34329 26975 19931 15385 3897 20311 38895 42388 48275 26535 18468 4197 4240 3381 -13248
12600a3248j7191j5975R135J8917k4605J671M770q149j9980K5933M7460M1660
$$ -13248 -30439 -46414 -37279 -18362 -42967 -41296 -36526 -44675 -64655 -38722 8738 50398
12588E0398J5974j1943n312j0789J5419l421p726k3381n3954k814L8859J6647
$$ 50398 66372 54429 49117 38328 53747 50326 42600 19219 -34735 -37549 1310 17957
12576A7957o82j351k2665l1144k960l495l0516J0215K6812L227J6431J2661K8473
$$ 17957 17275 15924 -6741 -37885 -40845 -44340 -74856 -64641 -37829 -34602 -18171 -5510 22963
12563B2963l2129r425K7096j1491j8687K8936k668O495K973J6242j7748j4759
$$ 22963 -9166 -18591 8505 -2986 -21673 7263 4595 11090 14063 30305 12557 -2202
12551b202j0137j9934J519Q756j328j70L1594K5820k0202k2731k7656k6446J1488
$$ -2202 -12339 -32273 -30754 -21998 -23326 -23496 8098 33918 13716 -9015 -36671 -63117 -51629
12538e1629J2786J7882J3712O294O868J2438J0993J1775j4154k2807K796K67K226
$$ -51629 -38843 -20961 -7249 -955 5913 18351 29344 41119 26965 4158 6954 7221 9447
12525I447J0048J1455l488l504R823l814r244k2432j5920r87P632P32N669L413
$$ 9447 19495 30950 27462 23958 33781 29967 20723 -1709 -17629 -18616 -10984 -10252 -4583 -1170
12511a170k71j5403J375L050j2655j7121O629J1129n658J3375P078j605j6277
$$ -1170 -1441 -16844 -15469 -12419 -25074 -42195 -35566 -24437 -30095 -16720 -9642 -11247 -27524
12498b7524o031Q786j241K657J2347k2317k1445m128J7001J9309J2232r734K0358
$$ -27524 -33555 -24769 -26010 -23353 -11006 -33323 -54768 -58896 -41895 -22586 -10354 -20088 270
12485B70M0446l943m2941o540K4604M968J8229J068j3397j4134j2662J2375J424
$$ 270 40716 36773 -6168 -12708 11896 16864 35093 36161 22764 8630 -4032 8343 9767
12472I767k5713j5760l050q222N184J6015Q096K4261J1897n623l339J2745N79
$$ 9767 -15946 -31706 -34756 -42978 -37794 -21779 -13683 10578 22475 16852 13513 26258 26837
12459B6837j5282k3195j5936L3425P986j0948n158j0339L538P415j1284k3940
$$ 26837 11555 -11640 -27576 5849 13835 2887 -2271 -12610 -9072 -1657 -12941 -36881
12447c6881j738Q246K3288n197P7K9993J4048p206p925j604j7723k3694p383J776
$$ -36881 -38619 -30373 -7085 -12282 -12205 17788 31836 24630 16705 15101 -2622 -26316 -33699 -31923
12433c1923q472j3460j0044K3238J3736j1553j5881j5862o522J4109m756j514
$$ -31923 -40395 -53855 -63899 -40661 -26925 -38478 -54359 -70221 -76743 -62634 -67390 -68904
12421f8904J3148K2047P459J9620q33k2000j219p013K5646J4923K8376J5819n794
$$ -68904 -55756 -33709 -26250 -6630 -7463 -29463 -30682 -37695 -12049 2874 31250 47069 41275
12408D1275j3385J2923j9425K886l429j1437k2885j3412K5653l0921j3773J8662
$$ 41275 27890 40813 21388 24274 20845 9408 -13477 -26889 -1236 -32157 -45930 -27268
12396b7268J4269J14k9474o681J2372K4916M936j3675M070k1531R305Q261Q878
$$ -27268 -12999 -12885 -42359 -49040 -36668 -11752 -6816 -20491 -16421 -37952 -28647 -20386 -11508
12383a1508J0448j4406P101K0734p774p632l5868J082J58P125m471p832q56R760
$$ -11508 -1060 -15466 -8365 12369 4595 -3037 -38905 -37823 -37665 -30540 -35011 -42843 -43699 -33939
12369c3939k3918J4859J4266J3059j9245j2498k6301K9351L2658j0615j5943J7374
$$ -33939 -57857 -42998 -28732 -15673 -34918 -47416 -73717 -44366 -11708 -22323 -38266 -20892
12357b0892j7041j9282M2370K6192j7205N073M99J767k1570O64K5463j9773j810
$$ -20892 -37933 -57215 -14845 11347 -5858 -785 -286 1481 -20089 -19425 6038 -13735 -15545
12344a5545J0071m504j8207J0475J7852p595j8667K3584m586k2630J0826J0074
$$ -15545 -5474 -9978 -28185 -17710 142 -7453 -26120 -2536 -7122 -29752 -18926 -8852
12332h852K2759P597p444k7310L688K5394J3130q883n759l1327P633L0858K4260
$$ -8852 13907 21504 14060 -13250 -9562 15832 28962 20079 14320 -17007 -9374 21484 45744
12319D5744P319k5919j1683l0341K2595J4273l7375k6234j0264J2668K4008m187
$$ 45744 53063 27144 15461 -14880 7715 21988 -15387 -41621 -51885 -39217 -15209 -19396
12307a9396O272j6282k535J9856k4810p583M30K5117J4922j3903j743J2835R631
$$ -19396 -13124 -29406 -31941 -12085 -36895 -44478 -44048 -18931 -4009 -17912 -19655 -6820 2811
12294B811o130k3259J0740R876p017K783K9380J928q072q479O466J9415J5674
$$ 2811 -3319 -26578 -15838 -5962 -12979 -10196 19184 21112 13040 4561 11027 30442 46116
12281D6116j3140l4016j3872j0807k0789K1292L5828J2087l216j5848k2226j3607
$$ 46116 32976 -1040 -14912 -25719 -46508 -25216 10612 22699 19483 3635 -18591 -32198
12269c2198J2218n830K215K6153J7701K193K337j2593J1320j9465j914k099P636
$$ -32198 -19980 -25810 -23595 2558 20259 22452 24789 12196 23516 4051 2137 38 7674
12256G674J505j6928P420k146o759J6444J1253j1618j4594J3743j7289r790K2760
$$ 7674 9179 -7749 -329 -2475 -9234 7210 18463 6845 -7749 5994 -11295 -21085 1675
12243A675J0506j8888k3835r099L7799J6658k856k3067J4049J7733K820R348k1840
$$ 1675 12181 -6707 -30542 -39641 -1842 14816 11960 -11107 2942 20675 23495 32843 11003
12230A1003m0680n294J433j262J4106l219N185L32o040J6311O604J315j2151P787
$$ 11003 -29677 -34971 -33538 -34800 -20694 -23913 -18728 -18396 -24436 -8125 -1521 -206 -12357 -4570
12216d570M461j9980l1683n916L113J1207K8262K2221j2251j5546k0857j6388
$$ -4570 -109 -20089 -51772 -57688 -54575 -43368 -15106 7115 -5136 -20682 -41539 -57927
12204e7927J4143L587K7689Q627R061n578L294q280m277j0596j6144o751j3002
$$ -57927 -43784 -40197 -12508 -3881 5180 -398 2896 -5384 -9661 -20257 -36401 -43152 -56154
12191e6154K9137L1692o259r865l4548j9923L4072K2164L134l6082M750K7533
$$ -56154 -27017 4675 -1584 -11449 -45997 -65920 -31848 -9684 -6550 -42632 -37882 -10349
12179a0349j847j2988m628N2224J9473l0643l7380o999j0250L579L969J7494J7024
$$ -10349 -12196 -25184 -29812 22412 41885 11242 -26138 -33137 -43387 -39808 -35839 -18345 -1321
12166a321j1052k0635J774k414k590o191J0984K7767K2756k747k25O762j6777
$$ -1321 -12373 -33008 -31234 -33648 -36238 -42429 -31445 -3678 19078 16331 16106 22868 6091
12153F091k9804J7839r607R930k799k6490O15K4021o512J7841P684j0331K8225
$$ 6091 -23713 -5874 -15481 -5551 -8350 -34840 -34225 -10204 -16716 1125 8809 -1522 26703
12140B6703P297r367j1861o905m927j2179R906o043r368J8746K1711j6977l9848
$$ 26703 34000 24633 12772 5867 940 -11239 -1333 -7376 -16744 2002 23713 6736 -33112
12127c3112l0404j746K4933m658J1065J3428l727K8504K0379m0056r817L982J0462
$$ -33112 -63516 -65262 -40329 -44987 -33922 -20494 -24221 4283 24662 -15394 -25211 -21229 -10767
12114a0767Q562j771r956j5490R044J9745J8064j9550j7627J8405l176k573K126
$$ -10767 -2205 -3976 -13932 -29422 -20378 -633 17431 -2119 -19746 -1341 -4517 -7090 -4964
12101d964j1609J2810J3853j0426k6038J302J1130J414L654L815k108R248K6471
$$ -4964 -16573 -3763 10090 -336 -26374 -25072 -13942 -12528 -8874 -5059 -7167 2081 28552
12088B8552O776k0051k7058j2578O622j0079l39J4237J510j1439J2498J0355k8818
$$ 28552 35328 15277 -11781 -24359 -17737 -27816 -28155 -13918 -12408 -23847 -11349 -994 -29812
12075b9812k7356J4961K677O567J6009P117Q83k6187j9070j8577K9416M867q648
$$ -29812 -57168 -42207 -39530 -32963 -16954 -9837 -8954 -35141 -54211 -72788 -43372 -38505 -47153
12062d7153J8041M255n001l4280q627J7003k723N767L1952o646R532Q952l3018
$$ -47153 -29112 -24857 -29858 -64138 -72765 -55762 -58485 -52718 -20766 -27412 -17880 -8928 -41946
12049d1946Q171O383L2811L5256J7866l856k7803j7559j8008j4997n137R309l765
$$ -41946 -33775 -27392 5419 40675 58541 54685 26882 9323 -8685 -23682 -28819 -19510 -23275
12036b3275k9816J686K6843K2701Q832r560k0897l5067K6161K1022J980N751j7943
$$ -23275 -53091 -51405 -24562 -1861 6971 -2589 -23486 -58553 -32392 -11370 -9390 -3639 -21582
12023b1582M275P812K084P375N88k3627L736J8454L0416L207l5675l3968j0099
$$ -21582 -17307 -9495 -7411 -36 552 -23075 -19339 -885 29531 32738 -2937 -36905 -47004
12010d7004r676J2253M7368J4799j2530M65J2755M35p38J584l3448k3144J3306
$$ -47004 -56680 -44427 2941 17740 5210 5675 18430 18865 18127 19711 -13737 -36881 -23575
11997b3575P780j127J6224J2881k8701j9934l909J1905K1408J5011R463O568l2421
$$ -23575 -15795 -16922 -698 12183 -16518 -36452 -40361 -28456 -7048 7963 17426 23994 -8427
11984h427k1066O070R724j0835n152L1045N886k2039j9217O207j32R357L801l305
$$ -8427 -29493 -23423 -13699 -24534 -29686 1359 7245 -14794 -34011 -27804 -27936 -18579 -14778 -18083
11970a8083o578j5213K5743K4100P125m709J7754R090k4603k4003L268K9636P845
$$ -18083 -24661 -39874 -14131 9969 17094 12385 30139 39229 14626 -9377 -6109 23527 31372
11957C1372j3047j7901k067n808k350J7655J0793j0962Q400L1074j5667j3468
$$ 31372 18325 424 -1643 -7451 -9801 7854 18647 7685 16085 47159 31492 18024
11945A8024k4244N066L6997J2154n113n582j4012k1111j5228R813r873J506n861
$$ 18024 -6220 -1154 35843 47997 42884 37302 23290 2179 -13049 -3236 -13109 -11603 -17464
11932a7464P956j3695j3319m723L391K6869L1332n679k9081n188o263j4883J043
$$ -17464 -9508 -23203 -36522 -41245 -37854 -10985 20347 14668 -14413 -19601 -25864 -40747 -39704
11919c9704L136K0077k0483l250K6458J1765j414J7156M612q003K2025l958k5284
$$ -39704 -36568 -16491 -36974 -40224 -13766 -2001 -3415 13741 18353 10350 32375 28417 3133
11906C133J5394R858n420k4359m41J2591j0054r968o076N386J8487k885k1461
$$ 3133 18527 28385 22965 -1394 -1835 10756 702 -9266 -15342 -9956 8531 5646 -15815
11893a5815O465j1069n819L9117K4635j7489j107J4976P085p200r597l865m012
$$ -15815 -9350 -20419 -26238 12879 37514 20025 18918 33894 40979 33779 24182 20317 16305
11880A6305q837j3054j1226p357l1301j3607J9704k346j8228J6705J0829J7164
$$ 16305 7468 -5586 -16812 -24169 -55470 -69077 -49373 -51719 -69947 -53242 -42413 -25249
11868b5249M363j7722P021P740J2436J9688K9579J0060k2960j1971l55m096k1274
$$ -25249 -20886 -38608 -31587 -23847 -11411 8277 37856 47916 24956 12985 12630 8534 -12740
11855a2740l780R516J012k5699j2627J0464J2896K2794j5975j950J6180j1817
$$ -12740 -16520 -7004 -5992 -31691 -44318 -33854 -20958 1836 -14139 -16089 91 -11726
11843a1726K1157k417j711l8820Q762J5189k374k4168J4610K038O35O213R653
$$ -11726 9431 7014 5303 -33517 -24755 -9566 -11940 -36108 -21498 -19460 -18825 -12612 -2959
11830b959j596J2287J5275j9308k2325j431j0880J6932J281M293K5067R149j1492
$$ -2959 -4555 7732 23007 3699 -18626 -20057 -30937 -14005 -12724 -8431 16636 25785 14293
11817A4293J1586j7899o232l485K6072Q575j2763n706Q48M083q436K142p651k4204
$$ 14293 25879 7980 1748 -1737 24335 32910 20147 14441 15289 19372 10936 13078 5427 -18777
11803a8777j0410M1623J9622n862n1191l0134J3136k5336n297M0179J1537m2359
$$ -18777 -29187 12436 32058 26196 -24995 -55129 -41993 -67329 -72626 -32447 -20910 -63269
11791f3269j7484J5555K3566J5938J4959K3657j1637k241k5341N45k5059J8059
$$ -63269 -80753 -65198 -41632 -25694 -10735 12922 1285 -956 -26297 -25752 -50811 -32752
11779c2752K6570J2441K4208M550n416j68O033j4352j3701j5643q990o331R839
$$ -32752 -6182 6259 30467 35017 29601 29433 35466 21114 7413 -8230 -17220 -23551 -13712
11766a3712J9461O49j5263r278K2453J7744j6359k2250J1559K950j8806N935J6741
$$ -13712 5749 6398 -8865 -18143 4310 22054 5695 -16555 -4996 -2046 -20852 -14917 1824
11753A824j3456j252m104q766r551R809j7690j0097L2779L0647q196k0398J74
$$ 1824 -11632 -12884 -16988 -25754 -35305 -25496 -43186 -53283 -20504 10143 1947 -18451 -18277
11740a8277l603O510J5965n315o794O444k592j4585k1349L6586J3512r726n084
$$ -18277 -21880 -15370 595 -4720 -11514 -5070 -7662 -22247 -43596 -7010 6502 -3224 -8308
11727h308J3344L4302K9744k3011k0179k132m163J8910m365l7573j5255j9640
$$ -8308 5036 39338 69082 46071 25892 23760 19597 38507 34142 -3431 -18686 -38326
11715c8326J1350K1354L231l7295k7591J8731L1993j7498l765M540N940K248k1399
$$ -38326 -26976 -5622 -2391 -39686 -67277 -48546 -16553 -34051 -37816 -33276 -27336 -25088 -46487
11702d6487n423K5959N358j5781l138L384J5101k068k2476j6048K0832j381K1729
$$ -46487 -51910 -25951 -20593 -36374 -39512 -36128 -21027 -23095 -45571 -61619 -40787 -42168 -20439
11689b0439K949k7462j0321K7750J1035j229p653K9479J828o217j5499k0952j07
$$ -20439 -17490 -44952 -55273 -27523 -16488 -17717 -25370 4109 5937 -280 -15779 -36731 -36838
11676c6838Q777m414J1389J0325j2833j6187J5166M791j2657J0709R347K5171
$$ -36838 -28061 -32475 -21086 -10761 -23594 -39781 -24615 -19824 -32481 -21772 -12425 12746
11664A2746J6839j6182J296k914k6842l0237J5445L8455J5524j3823j9465J6963
$$ 12746 29585 13403 14699 11785 -15057 -45294 -29849 8606 24130 10307 -9158 7805
11652G805N694j846k3020j1023J2372m438J1052K2184j6665k2239L271k866Q320
$$ 7805 13499 11653 -11367 -22390 -10018 -14456 -3404 18780 2115 -20124 -16853 -19719 -11399
11639a1399J4022j7461j8403L999J8445J4509j6039N618q251q060K770P516Q903
$$ -11399 2623 -14838 -33241 -29242 -10797 3712 -12327 -6709 -14960 -23020 -20250 -12734 -3831
11626c831O749j3886k0135j5766m899M3918q519k8773L22M518p042R411J2553
$$ -3831 2918 -10968 -31103 -46869 -51768 -7850 -16369 -45142 -44820 -40302 -47344 -37933 -25380
11613b5380K420K8170j846j531j4769q600J9442J2903j5014l414N605k3533j1828
$$ -25380 -22960 5210 3364 1833 -12936 -21536 -2094 10809 -4205 -7619 -2014 -25547 -37375
11600c7375K7118J0122M681K5370j6148n442O891j2362l918j0596j8846j5073
$$ -37375 -10257 -135 4546 29916 13768 8326 15217 2855 -1063 -11659 -30505 -45578
11588d5578P970J8319l227J2481J4782O972k4403n62O731L753K393l5856k7690
$$ -45578 -37608 -19289 -22516 -10035 4747 11719 -12684 -13246 -6515 -2762 -369 -36225 -63915
11575f3915k101J4118J9176K2874L4259L651j1982r854R29k9061O300J0761k085
$$ -63915 -66016 -51898 -32722 -9848 24411 28062 16080 6226 7155 -21906 -15606 -4845 -6930
11562f930j860n512j4430K2034j5534j9225J8212J5029K2343j8793l271L087K6951
$$ -6930 -8790 -14302 -28732 -6698 -22232 -41457 -23245 -8216 14127 -4666 -7937 -4850 22101
11549B2101J5014p43j1809o41j6995k5353K482K446J1882J0097q01N474k3933
$$ 22101 37115 36372 24563 23922 6927 -18426 -15944 -13498 -1616 8481 7680 13154 -10779
11536a0779o126J5724O097M608K658r314o702R110P700p926m443K038q382j8952
$$ -10779 -16905 -1181 4916 9524 12182 2868 -3834 5276 12976 5050 607 2645 -5737 -24689
11522b4689k4791K8124J1085q939o736K938J6990P714j811r505k675J5239J0077
$$ -24689 -49480 -21356 -10271 -19210 -25946 -23008 -6018 1696 -115 -9620 -12295 2944 13021
11509A3021l6987k1273K7139K7756m395k493l6069n727J7956K0356K1909J2788
$$ 13021 -23966 -45239 -18100 9656 5261 2768 -33301 -39028 -21072 -716 21193 33981
11497C3981j5888l2316j4825J8700L072J2710Q358j0749J8384R183k0419m5687
$$ 33981 18093 -14223 -29048 -10348 -7276 5434 13792 3043 21427 30610 10191 -35496
11485c5496j6403J5829J7624k514L560m277K1294m294j8102J2695k901k952l893
$$ -35496 -51899 -36070 -18446 -20960 -17400 -21677 -383 -4677 -22779 -10084 -12985 -15937 -19830
11472a9830j0944l4467P017J3377L8243P302p170J5205J0297j6057j2247j33O457
$$ -19830 -30774 -65241 -58224 -44847 -6604 698 -6472 8733 19030 2973 -9274 -9407 -2950
11459b950P676M447K3030J7170J9910l2578j0541R959j0184L13p035j8667O258
$$ -2950 4726 9173 32203 49373 69283 36705 26164 36123 25939 26252 19217 550 6808
11446F808k5520j5326k6954j149J3507o389j1871J6021J8593J6724q441o060O903
$$ 6808 -18712 -34038 -60992 -62141 -48634 -55023 -66894 -50873 -32280 -15556 -23997 -30057 -23154
11433b3154rp570J265j4547k8598J2077J108m021j0662R07J9664L5540P788J0586
$$ -23154 -23163 -30733 -29468 -44015 -72613 -60536 -59428 -63449 -74111 -73204 -53540 -18000 -10212 374
11419C74M117K5564k167N956P561Q864j1179M506K368P027o428j7286o41q486
$$ 374 4491 30055 27888 33844 41405 50269 39090 43596 45964 52991 46563 29277 28636 20150
11405B0150N460J5568j2319k676k0255j7403L66q472p958j0935K3736J6114N762
$$ 20150 25610 41178 28859 26183 5928 -11475 -11109 -19581 -27539 -38474 -14738 1376 7138
11392G138L2739j8985l4507J9359K6940j7389r266J2721p206O753q484l3214n471
$$ 7138 39877 20892 -13615 5744 32684 15295 6029 18750 11544 18297 9813 -23401 -28872
11379b8872k3142j2447L3633K7898N791J2968L138l60L557n307r396j4508l4335
$$ -28872 -52014 -64461 -30828 -2930 2861 15829 18967 18607 22164 16857 7461 -7047 -41382
11366d1382l4619n105K3119K9922K678j3419K3534J0896J6674O81m901q226M280
$$ -41382 -76001 -81106 -57987 -28065 -25387 -38806 -15272 -4376 12298 12979 8078 -148 4132
11353D132J1992j0658M899J1677L134j3608O619j158j5039j0362K613K6805P858
$$ 4132 16124 5466 10365 22042 25176 11568 18187 17029 1990 -8372 -5759 21046 28904
11340B8904M455k4233J186j5874M502N649L1q605L502J2773o394J53p337o393
$$ 28904 33359 9126 10312 -5562 -1060 4589 4620 -3985 -483 12290 5896 6049 -1288 -7681
11326g681M501l775k9618k235R186J3597N459J050J4745J3938r698p603r9k5920
$$ -7681 -3180 -6955 -36573 -38808 -29622 -16025 -10566 -9516 5229 19167 9469 1866 1767 -24153
11312b4153L149n583K5801J9184q100K992R292m107n459j0664M311r864J788j5312
$$ -24153 -21004 -26587 -786 18398 10298 13290 22582 18475 13016 2352 6663 -3201 -1413 -16725
11298a6725L946K413j3954M047M449J327j9418k7568l950K785l88L9844K9028
$$ -16725 -12779 -10366 -24320 -20273 -15824 -14497 -33915 -61483 -65433 -62648 -63036 -23192 5836
11285E836p200J6398J7825r42k6114k6189j2235j2848J6257K8177J5231K0807
$$ 5836 -1364 15034 32859 31917 5803 -20386 -32621 -45469 -29212 -1035 14196 35003
11273C5003l92o603p54j1749J9189K367j5089p67j4842m4973l1725Q914J5236
$$ 35003 34611 28008 27254 15505 34694 37061 21972 21205 6363 -38610 -70335 -61421 -46185
11260d6185K9387K2781q850J8183j2995r146P822J301p726k1991K716L712l359
$$ -46185 -16798 5983 -2867 15316 2321 -6825 997 2298 -5428 -27419 -24703 -20991 -24350
11247b4350N08N877l29J4011R961j4880P806J2038j584k2785M074L8768K846n547
$$ -24350 -23842 -17965 -18294 -4283 5678 -9202 -1396 10642 9058 -13727 -9653 29115 31961 26414
11233B6414n35K611o47j1366r605J1636k2334L805j5595j0963p631M552K1122
$$ 26414 25879 28490 27843 16477 6872 18508 -3826 -21 -15616 -26579 -34210 -29658 -8536
11220h536O268j549K756M827J1329K4797j1790k0668j8548k973K9592j694J54
$$ -8536 -2268 -3817 -1061 3766 15095 39892 28102 7434 -11114 -14087 15505 13811 13965
11207A3965j7783j4232J7863J1304n315j2883j1354r457K1291R397J2668J0541
$$ 13965 -3818 -18050 -187 11117 5802 -7081 -18435 -27892 -6601 2796 15464 26005
11195B6005R868k4570j3360K2239j0631J6889K4281k1716j4259o392j0500j8143
$$ 26005 35873 11303 -2057 20182 9551 26440 50721 29005 14746 8354 -2146 -20289
11183b0289j7895m71P663K8042O425j7720L232m277k4569j2565J0362L4265j2617
$$ -20289 -38184 -38655 -30992 -2950 3475 -14245 -11013 -15290 -39859 -52424 -42062 -7797 -20414
11170b0414J0005L4000j3289k2925J8884K5128R462j4228q881m077j1500l599
$$ -20414 -10409 23591 10302 -12623 6261 31389 40851 26623 17742 13665 2165 -1434
11158a434n671n291J6139j0255Q085J4782J0642o197j5227J0228n054o683J3760
$$ -1434 -7105 -12396 3743 -6512 1573 16355 26997 20800 5573 15801 10747 4064 17824
11145A7824p389k2629n135Q961J3527J2039J495k8815j5763j6760j2503Q990j765
$$ 17824 10435 -12194 -17329 -8368 5159 17198 18693 -10122 -25885 -42645 -55148 -46158 -47923
11132d7923O102j2750J6607K6693l926J4752L1571r726M270j1362J3883J0432
$$ -47923 -41821 -54571 -37964 -11271 -15197 -445 31126 21400 25670 14308 28191 38623
11120C8623m316j9204n920o29J7180J3660k6050l2188R208k20j6458l540k2725
$$ 38623 34307 15103 9183 8554 25734 39394 13344 -18844 -9636 -9856 -26314 -29854 -52579
11107e2579r577l250Q064K4920L7492R710j2639k6818j7276m839j0890L4205l048
$$ -52579 -62156 -65406 -57342 -32422 5070 14780 2141 -24677 -41953 -46792 -57682 -23477 -26525
11094b6525k287L668K3828Q897r006n6K0807k90j6999q983j180j5017J2993J2848
$$ -26525 -28812 -25144 -1316 7581 -1425 -1481 19326 19036 2037 -6946 -8126 -23143 -10150 2698
11080B698m783J707J4619q51l3986J789O114K0076L572P823R703r432j6762k1204
$$ 2698 -2085 -378 14241 13390 -20596 -18807 -12693 7383 10955 18778 28481 19049 2287 -18917
11066a8917J9496P978k925M361j8044j0683r465j6619J1233K7495k787K4872L4066
$$ -18917 579 8557 5632 9993 -8051 -18734 -28199 -44818 -33585 -6090 -8877 15995 50061
11053E0061j9305l5992l3584J666J3334n829j3407n265N109J6797O235K4361K741
$$ 50061 30756 -5236 -38820 -37154 -23820 -29649 -43056 -48321 -43212 -26415 -20180 4181 6922
11040F922r526N370J7150J5074j1422k7441m361L5500K0329o566p900l2291M146
$$ 6922 -2604 2766 19916 34990 23568 -3873 -8234 27266 47595 41029 33129 838 4984
11027D984J701q308p877q926r166j1554N831J4010j4218K2425j4792k6561j042
$$ 4984 6685 -1623 -9500 -18426 -27592 -39146 -33315 -19305 -33523 -11098 -25890 -52451 -53493
11014e3493K971j3994J0402J7276R450j929J2661K5688K2480k5601J6469m0p881
$$ -53493 -50522 -64516 -54114 -36838 -27388 -29317 -16656 9032 31512 5911 22380 22340 14459
11001A4459J6325Q60m4241J684J463O651r2on823j6274O812N354O087o418j7446
$$ 14459 30784 31644 -12597 -10913 -9450 -2799 -2891 -2897 -8720 -24994 -18182 -12828 -6741 -13159 -30605
10986c0605j3313K2872J5877l361J022J7705O657J6546o820o828k869Q568j8647
$$ -30605 -43918 -21046 -5169 -8530 -7508 10197 16854 33400 26580 19752 16883 25451 6804
10973F804N115P23j548O836k755L2099J0828q872j2063j8982q033M7508n294m2642
$$ 6804 11919 12642 11094 17930 15175 47274 58102 49230 37167 18185 10152 57660 52366 9724
10959I724j2242O127p658j5254O960L7135J1983O981j9429k2822l8593O990J0311
$$ 9724 -2518 3609 -4049 -19303 -12343 24792 36775 43756 24327 1505 -37088 -30098 -19787
10946a9787M665K892P493K4593k189m950L781L5120r343k0581L2004J3504k916
$$ -19787 -15122 -12230 -4737 19856 17667 12717 16498 51618 42275 21694 53698 67202 64286
10933F4286q628K3207P182j7327j0939k7799k4515o121K72N459K1342J03J2659
$$ 64286 55658 78865 86047 68720 57781 29982 5467 -654 -382 5077 26419 26522 39181
10920C9181P438j2217L14M646R377k0158l2697L235L4663j757J436j6314j961
$$ 39181 46619 34402 34716 39362 48739 28581 -4116 -881 33782 32025 33461 17147 15186
10907A5186j3566k8078q656P276J9748L0897j6742Q190J2566j3199l4283n42J7360
$$ 15186 1620 -26458 -35114 -27838 -8090 22807 6065 14255 26821 13622 -20661 -21203 -3843
10894c843M573j8186l29J2169p443O904Q969k836Q562O360Q251J2710J3813K009
$$ -3843 730 -17456 -17785 -5616 -13059 -6155 2814 -22 8540 14900 23151 35861 49674 51683
10880E1683J876n866K1840K7320K600j4212M843K7735j2724Q756K7272L8983O3170
$$ 51683 53559 47693 69533 96853 99453 85241 90084 117819 105095 113851 141123 180106 243276
10867B43276J49080K41128K28380J79703R8191J69529K57353J51632j07506k47719
$$ 243276 392356 633484 861864 1041567 1139758 1309287 1566640 1718272 1610766 1363047
10857A363047j52245q1638j65573k56216k30901j43041p5076n0136k6245l6628
$$ 1363047 1210802 1129164 963591 707375 476474 333433 258357 208221 181976 145348
10847A45348l1930j2818q950K1063J4707r033J5182k987j63l213n42L938l0840
$$ 145348 113418 100600 91650 112713 127420 118387 133569 130582 130419 127206 126664 130602 99762
10834I9762m975j6314j0950j1340Q660J1207J382J6273M8102K4665O6029R5089
$$ 99762 94787 78473 67523 56183 64843 76050 77432 93705 141807 166472 232501 327590
10822C27590O5086P5914J49950J53349J35100J21005Q1834M4896K407n9272j54596
$$ 327590 392676 468590 618540 771889 906989 1027994 1109828 1154724 1157131 1097859 943263
10811I43263j32776j36731j32357j31151p7859o0959p6481j9532j8010m1829k9018
$$ 943263 810487 673756 541399 410248 332389 271430 194949 175417 157407 115578 86560
10800H6560k450J1588j5674R834p091p012n605k4571j7241j2917K3746K7474J0985
$$ 86560 84110 95698 80024 89858 82767 75755 70150 45579 28338 15421 39167 66641 77626
10787G7626j1293k5924p837J5587J383q433j8543K783L771L3240n182m0105l546
$$ 77626 66333 40409 32572 48159 49542 41109 22566 25349 29120 62360 57178 17073 13527
10774A3527J6010K368J6842j1292j7293J6000l345R058k865K625M195J1012K844
$$ 13527 29537 31905 48747 37455 20162 36162 32817 41875 39010 41635 45830 56842 59686
10761E9686J1299l353m356R839j5240l7679J5841m223M941l5266J6210l858O137
$$ 59686 70985 67632 63276 73115 57875 20196 36037 31814 36755 1489 17699 13841 19978
10748A9978J6208Q060j0746J2674p86M396M415k6357m5458J788K7953o096k4970
$$ 19978 36186 44246 33500 46174 45388 49784 54199 27842 -17616 -15828 12125 6029 -18941
10735a8941J637J6140J0825N410j834J995j754Q928J7589j7533o780k7203k0127
$$ -18941 -17304 -1164 9661 15071 13237 15232 13478 22406 39995 22462 15682 -11521 -31648
10722c1648n397K7864K5594J7303K7409L0522O382L3132M9500L1871j157M627
$$ -31648 -37045 -9181 16413 33716 61125 91647 98029 131161 180661 212532 211375 216002
10710B16002j9243M675J5196k548k2276o5650k5227k1368l579J5379k360j8019
$$ 216002 196759 201434 216630 214082 191806 126156 100929 79561 75982 91361 89001 70982
10698G0982j3770k6690L328k3341q525J8902q720O796M2704j4922r101m671j2858
$$ 70982 57212 30522 33850 10509 1984 20886 12166 18962 61666 46744 37643 32972 20114
10685B0114L2J4956K1758J7116K2279q506k9946k3659J4098L0824M710j5209l0581
$$ 20114 20146 35102 56860 73976 96255 87749 57803 34144 48242 79066 83776 68567 37986
10672C7986J388J888L2303N637o873O513j1637R08j2145l0256O903J6725R914
$$ 37986 39374 41262 73565 79202 72329 78842 67205 68113 55968 25712 32615 49340 59254
10659E9254j8232m850R189Q597r703L139N061l8788m093K5596o866P745j71j3178
$$ 59254 41022 36172 45361 53958 44255 47394 52455 13667 9574 35170 28304 36049 35878 22700
10645B2700Q9O198j0693P315J2229K83m078K4098J9281j7966k5781K6731k748
$$ 22700 22789 28987 18294 25609 37838 38121 34043 58141 77422 59456 33675 60406 57658
10632E7658m6577k7941K0354K3439k23J4173K0084K856L739j2385J388l5881l4846
$$ 57658 11081 -16860 3494 26933 26710 40883 60967 63823 67562 55177 56565 20684 -14162
10619a4162p46K1240M1926j291m2941j112J0469L5290p52K752J0597K2688j0709
$$ -14162 -14908 6332 48258 46967 4026 2914 13383 48673 47921 50673 61270 83958 73249
10606G3249k5893J5144L5611K3342M2405M4873M9677M7929L7967N559o759l4800
$$ 73249 47356 62500 98111 121453 163858 208731 258408 306337 344304 349863 343104 308304
10594C08304j8780m5626q7089o2411k9289j1006M9726L3033q484J7693M8501O6887
$$ 308304 289524 243898 156809 94398 65109 54103 103829 136862 128378 146071 194572 261459
10582B61459J1459l7155k3913J3799L7430K3687q935j0000J9829o623j1605k6491
$$ 261459 272918 235763 211850 225649 263079 286766 277831 267831 287660 281037 269432 242941
10570B42941l5639j4375L109L6222j0968l2960j1380j1262N554l313n009J5748
$$ 242941 207302 192927 196036 232258 221290 188330 176950 165688 171242 167929 162920 178668
10558A78668R577q941j3337J633K6059K337K3865j1365k3596J56K5046j6057L335
$$ 178668 188245 179304 165967 167600 193659 195996 219861 208496 184900 185056 210102 194045 197380
10545A97380K3159M900M640k2551K1986p206r788M696k2127j7593M2749M8381
$$ 197380 220539 225439 230079 207528 229514 222308 212520 217216 195089 177496 220245 268626
10533B68626r083k0232j6953J2471N9864K9661N7079K7161K2674M4431O172j7822
$$ 268626 259543 239311 222358 234829 294693 324354 381433 408594 431268 475699 481871 464049
10521D64049J5695J3726M963K3024J0396m373J2301m65L8102N9481j69K1879M1933
$$ 464049 479744 493470 498433 521457 531853 527480 539781 539316 577418 636899 636730 658609 700542
10508G00542M4625L2390P028k5317r183l0978J46K0288q595L033J976M1727P5062
$$ 700542 745167 777557 784585 759268 750085 719107 719253 739541 730946 733979 735955 777682 852744
10495H52744N4330N8540Q0158J07870J26258J51561J27109J34904J77324K30162
$$ 852744 907074 965614 1045772 1153642 1279900 1431461 1558570 1693474 1870798 2100960
10485B100960K75334L52331M82431M93306M32764M73895O75878Q30359P73929
$$ 2100960 2376294 2728625 3211056 3704362 4137126 4611021 5286899 6117258 6891187
10476F891187O27653O43546R28765J163483J359282J504319J910112K858376M394384
$$ 6891187 7518840 8162386 9091151 10254634 11613916 13118235 15028347 17886723 22281107
10467B2281107O652682J0629862J8348478L2975992N0420820M3203673J9397098
$$ 22281107 28933789 39563651 57912129 90888121 141308941 184512614 203909712
10460B03909712J7002081M4432661M8039555K09802m1179338l7612472j2742293
$$ 203909712 220911793 265344454 313384009 313593811 272414473 234802001 222059708
10453B22059708k1347223m2424432m8280562l5064016k1494995j3443729q877096
$$ 222059708 200712485 158288053 110007491 74943475 53448480 40004751 31127655
10446C1127655o046362m166169l010653k373745j860481j348576j061050r04386
$$ 31127655 25081293 20915124 17904471 15530726 13670245 12321669 11260619 10356233
10438A0356233p14633n16216n15229o20921o82319n59750n13643n74199n91865
$$ 10356233 9641600 9125384 8610155 7989234 7306915 6747165 6233522 5659323 5067458
10429E067458n36227m64152l82470k58096j87097j98046j87993j72132j19395
$$ 5067458 4531231 4067079 3684609 3426513 3239416 3041370 2853377 2681245 2561850
10420B561850j54125j73263j72334j12071j49014j30626j15368r1085p1432o1054
$$ 2561850 2407725 2234462 2062128 1950057 1801043 1670417 1555049 1463964 1392532 1331478
10410A331478q9393o7162p0098n3944n8194l4733j7520l7883n8556n5148l5860
$$ 1331478 1242085 1174923 1104825 1050881 992687 957954 940434 902551 843995 788847 752987
10399G52987m352n925k2097k8381k5984j6923l4914l710L983j0383l0192m8318
$$ 752987 748635 742710 720613 692232 666248 649325 614411 610701 614684 604301 574109 525791
10387E25791l4343J1820K7880j7530k8566j0763j3869N352k796r540l7525l1498
$$ 525791 491448 503268 531148 513618 485052 474289 460420 465772 462976 453436 415911 384413
10375C84413j1796l2470j2754Q90l2291J87K8971J1827l6488j452J1744o702k2356
$$ 384413 372617 340147 327393 328283 295992 296179 325150 336977 300489 299037 310781 304079 281723
10362B81723l5421q462J0954J2547k0285k4781j0550J1170M0430k1884K086j594
$$ 281723 246302 237840 248794 261341 241056 216275 205725 216895 257325 235441 237527 235933
10350B35933l4156K4293J8568o186J1903J756j7189o103J1007m253O659K2757
$$ 235933 201777 226070 244638 238452 250355 252111 234922 228819 239826 235573 242232 264989
10338B64989J765M715L8923N2604M8884M8833M6688P8459J5234l8213l1379J8318
$$ 264989 266754 271469 310392 362996 411880 460713 507401 585860 601094 562881 531502 549820
10326E49820J1413p8398q1173n6243j6702R090k6070l927K7505K4583M942K4408
$$ 549820 561233 482835 401662 345419 328717 337807 311737 307810 335315 359898 364840 389248
10314C89248K5253J3287K4324M7969k4847m1390j5428l7772m0381k6188k128j2090
$$ 389248 414501 427788 452112 500081 475234 433844 418416 380644 340263 314075 311947 299857
10302B99857o336J1795K3424J1860L7875Q6504P6775J6155k7451k453J0163J8757
$$ 299857 293521 305316 328740 340600 378475 464979 541754 557909 530458 528005 538168 556925
10290E56925m6142q8318p7770o1813k5166j7827J348J5151J0486n675j905J146
$$ 556925 510783 422465 344695 282882 257716 239889 241237 256388 266874 261199 259294 260440
10278B60440K2420l6249l0106k6291r298j8595n80N117l079l577k4170j7037O619
$$ 260440 282860 246611 216505 190214 180916 162321 161741 166858 163779 160202 136032 118995 125614
10265A25614J0439j0492m477J2708N051j7966k3378r930L83k9701j9517J6827
$$ 125614 136053 125561 121084 133792 138843 120877 97499 87569 87952 58251 38734 55561
10253E5561P496J5708r887r220l555M460O191K9604Q641j6859K350J2479j4901
$$ 55561 63057 78765 68878 59658 56103 60563 66754 96358 104999 88140 90490 102969 88068
10240H8068j2354n855R453q836k3184j496o391j1578L0775L535J5210J2783K652
$$ 88068 75714 69859 79312 70476 47292 45796 39405 27827 58602 62137 77347 90130 92782
10227I2782j208n764P350q311L258N072R655Q588k934j8427j3699q981q357J9276
$$ 92782 91574 85810 93160 84849 88107 93179 102834 111422 108488 90061 76362 67381 59024 78300
10213G8300J3054k350m2430l833L2048q872m547R677K0052J0853R411K1728j7206
$$ 78300 91354 89004 46574 42741 74789 65917 61370 71047 91099 101952 111363 133091 115885
10200A15885k460K3265j6552J785O18J2352R382O771j5153k2800p580J4338M748
$$ 115885 113425 136690 120138 121923 122541 134893 144275 151046 135893 113093 105513 119851 124599
10187A24599K355l188q192k4805J8448k2662k3167q910l2343j0431K9005K5300
$$ 124599 126954 123766 115574 90769 109217 86555 63388 54478 22135 11704 40709 66009
10175F6009j3852l6262J8131K2864J0066k6518j0327o380j4465P152k5868j8792
$$ 66009 52157 15895 34026 56890 66956 40438 30111 23731 9266 16418 -9450 -28242
10163b8242K9251J6623p449M359p66J0209l545J734k3104j8559J2769M1869O118
$$ -28242 1009 17632 10183 14542 13776 23985 20440 22174 -930 -19489 -6720 35149 41267
10150D1267j1592o596q872n917L0588J948q867J9324L6147j744j6787l1926l3939
$$ 41267 29675 23079 14207 8290 38878 40826 31959 51283 87430 85686 68899 36973 3034
10137C034n58j6112m924L6950K7681k1188j5363j2027n538K953k0387r853K1799
$$ 3034 2476 -13636 -18560 18390 46071 24883 9520 -2507 -8045 -5092 -25479 -35332 -13533
10124a3533K208j8037K1799m725J6913K83K018J3724J8367k3086L030J2203R804
$$ -13533 -11325 -29362 -7563 -12288 4625 4908 6926 20650 39017 15931 18961 31164 40968
10111D0968o224J3221K5786k4833j158j1687j8388J3747l329R485J7028L0698
$$ 40968 34744 47965 73751 48918 47760 36073 17685 31432 28103 37588 54616 85314
10099H5314J3074q735l0496k4887j2169j0227j3818k860J5021Q210q111K7972
$$ 85314 98388 89653 59157 34270 22101 11874 -1944 -4804 10217 18427 10316 38288
10087C8288K5511J7975k9298j454L0361k344l0046m0592j9916J0906L54M314K728
$$ 38288 63799 81774 52476 51022 81383 79039 48993 8401 -11515 -609 -255 4059 6787
10074F787J3965J1501J4417j087j2029j3994R383j510J698R425N127M943L9274
$$ 6787 20752 32253 46670 45583 33554 19560 28943 27433 29131 38556 43683 48626 87900
10061H7900L0000L7531M6116N4114Q9270J42636K46649K43358J22063J13330K55888
$$ 87900 117900 155431 201547 255661 344931 487567 734216 977574 1099637 1212967 1468855
10050A468855K68372K8868k03983j90691k1252m5755j87284k70086k68500j83062
$$ 1468855 1737227 1766095 1562112 1371421 1350169 1304414 1117130 847044 578544 395482
10040C95482j01214o2845n0948l1044q911k5273j1115r659O377j3933k300K462
$$ 395482 294268 231423 180475 149431 140520 115247 104132 94473 100850 86917 84617 87079
10028H7079j0103l7667P605j853M794L149j7111p868M767J4926K3371k9595k4549
$$ 87079 76976 39309 46914 45061 49855 53004 35893 28025 32792 47718 71089 41494 16945
10015A6945J1780K0511l531N343J3139k2451k2119J4721q179l723l935k187L108
$$ 16945 28725 49236 45705 51048 64187 41736 19617 34338 26159 22436 18501 16314 19422
10002A9422J8603j076j0104k3603j2869J7046j247r903K59L0585J549M27L60Q196
$$ 19422 38025 36949 26845 3242 -9627 7419 6172 -3731 -3472 27113 28662 29089 29449 37645
9988C7645o111m6837k522J1953K0710k513j7520J618J4189N568J6689m153q230
$$ 37645 31534 -15303 -17825 -5872 14838 12325 -5195 -3577 10612 16180 32869 28716 20486
9975B0486o588J136k401R227N013O140o066L540k0029j2941J5531l1819j1215
$$ 20486 13898 15034 12633 21860 26873 33013 26947 30487 10458 -2483 13048 -18771 -29986
9962b9986Q328L3571P695M871l250J8740J800k5745j2291n092k410K322j6611
$$ -29986 -21658 11913 19608 24479 21229 39969 41769 16024 3733 -1359 -3769 -1447 -18058
9949a8058k602P698J914K8043L344o735M303J8784k9069m3634m050K2778K4304
$$ -18058 -20660 -12962 -11048 16995 20339 13604 17907 36691 7622 -36012 -40062 -17284 7020
9936G020K4686j8090k8742k5234J8764J5179j9395m944J2521P44K730K7713k773
$$ 7020 31706 13616 -15126 -40360 -21596 -6417 -25812 -30756 -18235 -17491 -14761 12952 10179
9923A0179J1780j0896m347j3562r553P654L326J8491j1816J9089n315J2153K0732
$$ 10179 21959 11063 6716 -6846 -16399 -8745 -5419 13072 1256 20345 15030 27183 47915
9910D7915j6083j4632L912Q70n109n533j3951K459O157m293k853J3268m912k2069
$$ 47915 31832 17200 21112 21982 16873 11340 -2611 -152 6005 1712 -1141 12127 7215 -14854
9896a4854J0583Q651m503n636J7513N0781K3248K359k1815M637p603j8763l1833
$$ -14854 -4271 4380 -123 -5759 11754 62535 85783 88142 66327 70964 63361 44598 12765
9883A2765n583K2607L9061j0388m761M416j5457N888j4311j0394j7244J9004R502
$$ 12765 7182 29789 68850 58462 53701 58117 42660 48548 34237 23843 6599 25603 35105
9870C5105J4975J1700m1193j6358N165n347J3182m799K3923K5821l909r822m506
$$ 35105 50080 61780 20587 4229 9394 4047 17229 12430 36353 62174 58265 48443 43937
9857D3937P323n565j3780N780L4982L7138k7727j9730o722j592K3679L8481M454
$$ 43937 51260 45695 31915 37695 72677 109815 82088 62358 55636 54044 77723 116204 120658
9844A20658j7042k0941k0426m5889o004j3133k4804j7810K925J4464q502M534
$$ 120658 103616 82675 62249 16360 10356 -2777 -27581 -45391 -42466 -28002 -36504 -31970
9832c1970R069j1868j1161K4119J1992j0799m865J0781J7029J0420r224R027R442
$$ -31970 -22901 -34769 -45930 -21811 -9819 -20618 -25483 -14702 2327 12747 3523 12550 21992
9819B1992R86m195J3868K9716j1448j0986K6307n976k4269l32j2220j7682o213
$$ 21992 22978 18783 32651 62367 50919 39933 66240 60264 35995 35663 23443 5761 -452
9806d52L832J0577M806j6976P909J6031k0238j9128o701L26P356q971l877R526
$$ -452 3380 13957 18763 1787 9696 25727 5489 -13639 -20340 -20014 -12658 -21629 -25506 -15980
9792a5980k699J4480L135L6952K9074k3522l2901q871o485j663j0215K4503K9061
$$ -15980 -18679 -4199 -1064 35888 64962 41440 8539 -332 -6817 -8480 -18695 5808 34869
9779C4869K8284p595l4030j0529J4031p534k7566j3468q184J0567J842J9931J9043
$$ 34869 63153 55558 21528 10999 25030 17496 -10070 -23538 -31722 -21155 -19313 618 19661
9766A9661l38j000J6179O657k2980r730K875L3628J6699l5707j9531r097l765
$$ 19661 19323 18323 34502 41159 18179 8449 11324 44952 61651 25944 6413 -2684 -6449
9753f449P137n285O317j7566L557J5173J8529k0919j9609M809o001M872J811J8864
$$ -6449 688 -4597 1720 -15846 -12289 2884 21413 494 -19115 -14306 -20307 -15435 -13624 5240
9739E240J9633n165j1509P412j6905k4465K673L1043L0509L630j4838q189l815
$$ 5240 24873 19708 8199 15611 -1294 -25759 -23086 7957 38466 42096 27258 19069 15254
9726A5254j5193p239j8214j6270J1415M245Q428K3088P912p821j7732J2085J1119
$$ 15254 61 -7178 -25392 -41662 -30247 -26002 -17574 5514 13426 5605 -12127 -42 11077
9713A1077M504p078K4101J1798k7559J468K698j6009m263k47P141j6253q891r36
$$ 11077 15581 8503 32604 44402 16843 18311 21009 5000 737 490 7631 -8622 -17513 -18449
9699a8449l71p465J2234j750J7811Q598J398o875j9269m263M8443K7926j5777
$$ -18449 -18820 -26285 -14051 -15801 2010 10608 12006 5131 -14138 -18401 30042 57968 42191
9686D2191j1617k991L339j1796K427J8009J3847O747n471k3011j3489J897j357
$$ 42191 30574 27583 30922 19126 21553 39562 53409 60156 54685 31674 18185 20082 18725
9673A8725P074J151L884j4409l8193r552N718L7292L5288k0460j0335K0421l91
$$ 18725 25799 26950 30834 16425 -21768 -31320 -25602 11690 46978 26518 16183 36604 36213
9660C6213k5007j8187j5756P167J5924j8191k7849J8286K2081K270q617K50j2673
$$ 36213 11206 -6981 -22737 -15570 354 -17837 -45686 -27400 -5319 -3049 -11666 -11416 -24089
9647b4089O382M1223j2513j826o123m496J8729j0233k3290j9359J7782J1729j9192
$$ -24089 -17707 23516 11003 9177 3054 -1442 17287 7054 -16236 -35595 -17813 -6084 -25276
9634b5276L002R526K994Q720k566R272K6418K5268j0500k0182j5930j9896K3798
$$ -25276 -22274 -12748 -9754 -1034 -3600 5672 32090 57358 46858 26676 10746 -9150 14648
9621A4648o28j3127o292k124K5083O241j5785j4506J255r97K12j0878l988J1704
$$ 14648 14020 893 -5399 -7523 17560 23801 8016 -6490 -5235 -6232 -6020 -16898 -20886 -9182
9607i182j9684k466J4937o44M183J4026r770q571M655n226j846r356K2585r973
$$ -9182 -28866 -31332 -16395 -17039 -12856 1170 -8600 -17171 -12516 -17742 -19588 -28944 -6359 -16332
9593a6332l3310J8757J6808J9893r117r445k556K6895J568k0226j1644J0064N70
$$ -16332 -49642 -30885 -14077 5816 -3301 -12746 -15302 11593 13161 -7065 -18709 -8645 -8075
9580h075l194R821M654m514N133j322J046R340K1867k0355k4667j1110n04J967
$$ -8075 -11269 -1448 3206 -1308 3825 2503 3549 12889 34756 14401 -10266 -21376 -21880 -19913
9566a9913J0487r41N779J3423J0495j7887m2105J0917L5784J9643l304j7596K55
$$ -19913 -9426 -10367 -4588 8835 19330 1443 -40662 -29745 6039 25682 22378 4782 5037
9553E037o374J7798K0403j8570M33J1945K6448R469j2296k260q617k7852j3561
$$ 5037 -1337 16461 36864 18294 18727 30672 57120 66589 54293 52033 43416 15564 2003
9540B003J947M018M796j9735k1714k073J5146j8188J979K2575K7542K1178k0519
$$ 2003 3950 7968 12764 -6971 -28685 -30758 -15612 -33800 -31821 -9246 18296 39474 18955
9527A8955p282O401j2842j4547Q652K7470J3199J1877j9102k9220j5694J4324
$$ 18955 11673 18074 5232 -9315 -663 26807 40006 51883 32781 3561 -12133 2191
9515B191k982j0524J2331K9055K98j7305j0392J4827L1906j7384l6705O137K6824
$$ 2191 -791 -11315 1016 30071 30369 13064 2672 17499 49405 32021 -4684 1453 28277
9502B8277j0737n71M800j5054L552r50R094K0890p638j5492J4140J0277j0438
$$ 28277 17540 16969 21769 6715 10267 9317 18411 39301 31663 16171 30311 40588 30150
9489C0150J5859p931m1986O650K0341k3483r88n201J218j764N865L2997J2846
$$ 30150 46009 38078 -3908 2742 23083 -400 -1388 -6589 -5371 -7135 -1270 31727 44573
9476D4573j3334j9959J793m417Q195K138k25j2173j7914R460J2973K4639j9272
$$ 44573 31239 11280 13073 8656 16851 18989 18764 6591 -11323 -1863 11110 35749 16477
9463A6477o943j027k705j4936Q676L994n808o215P465K615n990l78J5913q649
$$ 16477 9534 8507 5802 -9134 -458 3536 -2272 -8487 -1022 1593 -4397 -4775 11138 2489
9449B489K6200l822o670k5246M197J2844R453Q393j3960j6254m259P688k1053
$$ 2489 28689 24867 18197 -7049 -2852 9992 19445 27838 13878 -2376 -6635 1053 -20000
9436b0000J7615J1172L602K224O702j2040j0802r667N41J1394K0969K4812r282
$$ -20000 -2385 8787 12389 14613 21315 9275 -1527 -11194 -10653 741 21710 46522 37240
9423C7240J9387o824p234L3021q043k5886j1798J4306J605p162K9123j1133k3190
$$ 37240 56627 49803 42569 75590 67547 41661 29863 44169 45774 38612 67735 56602 33412
9410C3412J6776K9373j2529j6147p707R726j3571k7459k728n783L4641M1355K3605
$$ 33412 50188 79561 67032 50885 43178 52904 39333 11874 9146 3363 38004 79359 102964
9397A02964j4576m7836l0254n929J7111R589n659j5108m366J2804O362J451R688
$$ 102964 88388 40552 10298 4369 21480 31069 25410 10302 5936 18740 25102 26553 36241
9384C6241M561K5835K0846j0112J0394j7259j2302j143n428j8903l726L5512N098
$$ 36241 40802 66637 87483 77371 87765 70506 58204 57061 51633 32730 29004 64516 69614
9371F9614k3067p459j2585j2081Q262K3038J088k7417j2825J5865L5480J2802
$$ 69614 46547 39088 26503 14422 22684 45722 46810 19393 6568 22433 57913 70715
9359G0715j9063K23J7421l713K0399j8274l8249P684J5340J3136J7529Q645k5434
$$ 70715 51652 51875 69296 65583 85982 67708 29459 37143 52483 65619 83148 91793 66359
9346F6359r903J0557N751o467J1292J2842k505M79J3060P613m603j1090J9492
$$ 66359 56456 67013 72764 66297 77589 90431 87926 88405 101465 109078 104475 93385 112877
9333A12877J2836n70o968L578J617l1732P977J0416o270m375J8174J9713p638
$$ 112877 125713 125143 118175 121753 123370 91638 99615 110031 103761 99386 117560 137273 129635
9320A29635j3682j0077j538k057j398K338P969J1170j1453J6853M790p750K4173
$$ 129635 115953 105876 104338 102281 100883 103221 111190 122360 110907 127760 132550 124800 148973
9307A48973J3558J5420J5885P751l8539k1391J6433K7608J2897j90L0067K6359
$$ 148973 162531 177951 193836 201587 163048 141657 158090 185698 198595 198405 228472 254831
9295B54831K579K3036N714l5703j0908L7511K2569k8228j3833j1846J8680R907
$$ 254831 257410 280446 286160 250457 239549 277060 299629 271401 257568 245722 264402 274309
9283B74309l883J3816K4475J8732M761q597J6220L8141M3920l219N433M540K9278
$$ 274309 270426 284242 308717 327449 332210 323613 339833 377974 421894 418675 424108 428648 457926
9270D57926L827L7210L7316L8247M3836K1617M9635N5070K6707L1662L9933M8437
$$ 457926 461753 498963 536279 574526 618362 639979 689614 744684 771391 803053 842986 891423
9258H91423M9770P3861Q3203Q6259O5721Q8864J34126J27771J24105J37096J70715
$$ 891423 941193 1015054 1098257 1184516 1250237 1339101 1473227 1600998 1725103 1862199 2032914
9247B032914K05442K34902K64975L06048L24370L32922M16737M83141N13953N59277
$$ 2032914 2238356 2473258 2738233 3044281 3368651 3701573 4118310 4601451 5115404 5674681
9237E674681O20972O57580O31655O03976N44584M24179K06345Q401k17878m02924
$$ 5674681 6295653 6953233 7584888 8188864 8733448 9157627 9363972 9372373 9154495 8751571
9227H751571n24572n70101n88605n85091n99507n81542n47811m69480m41450l85589
$$ 8751571 8226999 7656898 7068293 6483202 5883695 5302153 4754342 4284862 3843412 3457823
9217C457823l15431k77705k67645k35936j89186j65795j33768j30858j06676j02705
$$ 3457823 3142392 2864687 2597042 2361106 2171920 2006125 1872357 1741499 1634823 1532118
9207A532118j09444j10176j02053p9927o7895o4977o7756m8338j4489m5986n0375
$$ 1532118 1422674 1312498 1210445 1130518 1062623 997646 929890 881552 867063 821077 770702
9196G70702m7727m0070j4026k5242k9720k7145m2568l6285j2345j6733m9252n074
$$ 770702 722975 682905 668879 643637 613917 586772 544204 507919 495574 478841 429589 424515
9184D24515J7953L154k1337m4437j9191j0206j3622k629J2531L8697j7029m6080
$$ 424515 442468 445622 424285 379848 360657 350451 336829 334200 346731 385428 368399 322319
9172C22319k6354K23k3414l7758J3943n66l2134j0974p411r678p674j7381J0615
$$ 322319 295965 296188 272774 235016 248959 248393 216259 205285 197874 188196 180522 163141 173756
9159A73756m799j0510k812J3899j4576m04J5579J9964J4403j9256l7045j918k0190
$$ 173756 168957 158447 155635 169534 154958 154554 170133 190097 204500 185244 148199 146281 126091
9146A26091m692R196L0259L3974l4634q904j0947j0764K868j1765q249O382L1518
$$ 126091 121399 130595 160854 194828 160194 151290 140343 129579 132447 120682 112433 118815 150333
9133A50333K9121j8452n849k5019j2484j6790k4367k7686Q057l413J2030K1902
$$ 150333 179454 161002 155153 130134 117650 100860 76493 48807 56864 53451 65481 87383
9121H7383R007k472J3249L922p088L998m042o505N565j3308k878j0961j2320L734
$$ 87383 96390 93918 107167 111089 104001 107999 103957 97452 103017 89709 86831 75870 63550 67284
9107F7284q727j2402J615O121n302P919K5776n02K0455o806k84K1270J9507k4455
$$ 67284 58557 46155 47770 53891 48589 56508 82284 81782 102237 95431 95147 116417 135924 111469
9093A11469P974J3360k1557j7105l727k748K5682Q191j0023l5380l342J8300J2764
$$ 111469 119443 132803 111246 94141 90414 87666 113348 121539 111516 76136 72794 91094 103858
9080A03858J4849n011Q882P679k6677p036n780N03p115Q645L4339K8141l6753
$$ 103858 118707 113696 122578 130257 103580 96544 90764 91267 84152 92797 127136 155277 118524
9067A18524j0995P603k4942N769j4934n643J4531J949n538k0789J6350j7949p006
$$ 118524 107529 115132 90190 95959 81025 75382 89913 91862 86324 65535 81885 63936 56930
9054E6930P71N251r942m634M5488R022R072J3436k7609m8894R84r236m388K0794
$$ 56930 57701 62952 53010 48376 93864 102886 111958 125394 97785 48891 49875 40639 36251 57045
9040E7045o278J1760K2825J1803J1619K139M461j7150r736m70m427j4199l2929
$$ 57045 50767 62527 85352 97155 108774 110913 115374 98224 88488 88018 83591 69392 36463
9027C6463k5143K2500K5919j013L02l2526j4154J6928J1276k966j7624k4144K0782
$$ 36463 11320 33820 59739 58726 59028 26502 12348 29276 40552 37586 19962 -4182 16600
9014A6600J4301K781L740J6141k453r242L3363J0227Q160k1781l6107j7901K4575
$$ 16600 30901 33682 37422 53563 51110 41868 75231 85458 93618 71837 35730 17829 42404
9001D2404K5650J5814P864O403j7943k1668Q87K5566r713k7317j5637J4140R763
$$ 42404 68054 83868 91732 98135 80192 58524 59411 84977 75264 47947 32310 46450 56213
8988E6213J9288o895j4497j3532P382L3419K4604p205l2774k2630j6053L4296
$$ 56213 75501 68606 54109 40577 47959 81378 105982 98777 66003 43373 27320 61616
8976F1616K028j7703n992J8835J5725M841R289p836j3608r893R982M67K3351J5771
$$ 61616 63644 45941 39949 58784 74509 79350 88639 80803 67195 57302 67284 67751 91102 106873
8962A06873k6936K8779J6186k0773L0354K6320M608J0400k4534m4924k6774K2166
$$ 106873 79937 108716 124902 104129 134483 160803 165411 175811 151277 106353 79579 101745
8950A01745j8928J0086k9529j6161l0340n333K4263M0871J2005k0768Q799l53
$$ 101745 82817 92903 63374 47213 16873 11540 35803 76674 88679 67911 76710 76357
8938G6357Q0l367O36k4889j1073J1665j7419J1841L8624k1378j4032P122l929
$$ 76357 76437 73070 73706 48817 37744 49409 31990 43831 82455 61077 47045 54167 50238
8925E0238m222j6470k34J4810R559k6547j8899r740k3221J8593N319J9506J9866
$$ 50238 46016 29546 29312 44122 53681 27134 8235 -1505 -24726 -6133 -814 18692 38558
8912C8558K1708K7837j5160l1902k2553k4114r807L5296J9217J1594M838K4410
$$ 38558 60266 88103 72943 41041 18488 -5626 -15433 19863 39080 50674 55512 79922
8900G9922P780M583j5396k5272j1501o732P557L547K8057J0745q705k931j3049
$$ 79922 87702 92285 76889 51617 40116 33384 40941 44488 72545 83290 74585 71654 58605
8887E8605j9639j4559o073O955J0757L8726J8790j6182k4689J2027Q671j3176
$$ 58605 38966 24407 18334 25289 36046 74772 93562 77380 52691 64718 73389 60213
8875F0213k1290Q357J7166P675q891L791n084Q1L1219L617l1866l1316j1479J6469
$$ 60213 38923 47280 64446 72121 63230 67021 61937 62018 93237 96854 64988 33672 22193 38662
8861C8662O684R120J3135o433k5606j003r248J7629k5158j962K4616L3531J0732
$$ 38662 45346 54466 67601 61168 35562 34559 25311 42940 17782 15820 40436 73967 84699
8848H4699j1851k7431k9411m14J5481O335J3356J2679k528J1786R717l7502k7768
$$ 84699 72848 45417 16006 15592 31073 37408 50764 63443 60915 72701 82418 44916 17148
8835A7148j9680j272j1240r930K0324L7930J7306j1574p060J7502J2792M026P600
$$ 17148 -2532 -3804 -15044 -24974 -4650 33280 50586 39012 31952 49454 62246 66272 73872
8822G3872O377m3467m244O83J8651j8620J7104J0525j6126J3237J3716j4928j2360
$$ 73872 80249 36782 32538 33221 51872 33252 50356 60881 44755 57992 71708 56780 44420
8809D4420p075O906J1151J3314l243j7396k1506o395M516K5111J8661k405o294
$$ 44420 37345 44251 55402 68716 65473 48077 26571 20176 24692 49803 68464 66059 59765
8796E9765k7508k1524j2517O888p234K7542L737J0756P479L708j1685q06J4966
$$ 59765 32257 10733 -1784 5104 -2130 25412 29149 39905 47384 51092 39407 38601 53567
8783E3567R696j4707O195J0614K2669p027k1250j9862r76J0903K0896n144J1895
$$ 53567 63263 48556 54751 65365 88034 81007 59757 39895 38919 49822 70718 65574 77469
8770G7469o568M397J4246R558k3025n787M185P095J5043J272k0790m4877j5297
$$ 77469 70901 75298 89544 99102 76077 70290 74475 81570 96613 97885 77095 32218 16921
8757A6921L545K2436L7991J3898k0778j1744Q23R882k190j8379Q559J489J0851
$$ 16921 20466 42902 80893 94791 74013 62269 63092 72974 70784 52405 60964 62453 73304
8744G3304j8475n636j5957q574K2101r188k775M4924Q150M982k29m272k8025k7465
$$ 73304 54829 49193 33236 24662 46763 37575 34800 79724 87874 92856 92627 88355 60330 32865
8730C2865Q927R080J6087R231j3559l8167k0817j4119k719L6137N703J8194K2692
$$ 32865 41792 50872 66959 76190 62631 24464 3647 -10472 -13191 22946 28649 46843 69535
8717F9535m024j6037N652p504Q412K5951R93L357j9858j0352J5409J7383j274
$$ 69535 65511 49474 55126 47622 56034 81985 82978 86335 66477 56125 71534 88917 87643
8704H7643o868L3642l833j4708J0278N967k3358O255k063O161K4328J4986m942
$$ 87643 80775 114417 110584 95876 106154 112121 88763 95018 92955 99116 123444 138430 133488
8691A33488k4294Q023K173j1610O144n922k5985j7614j724M1197J213J806K579
$$ 133488 109194 117217 119390 107780 113924 108002 82017 64403 62679 103876 105089 106895 109474
8678A09474J7026K834p884o088k5424O87J7054q901n864J5768J9449o921J1142
$$ 109474 126500 129334 121450 115362 89938 90625 107679 98778 92914 108682 128131 121210 132352
8665A32352o177q329J9561J0378j7582j6653K6235L6559J4041k9407L721k6945
$$ 132352 126175 117846 137407 147785 130203 113550 139785 176344 190385 160978 164699 137754
8653A37754k5794M195k638j4480J3830K6966j9447P413N207j7621J6851J8188
$$ 137754 111960 116155 113517 99037 112867 139833 120386 127799 133006 115385 132236 150424
8641A50424J3769J8489m031j6314k172J26j2847L890K3027R397J310m097J4098
$$ 150424 164193 182682 178651 162337 160165 160291 147444 151334 174361 183758 185068 180971 195069
8628A95069L2512M910K6473r292l3467k5562m580K1033L2361N987j9652Q487L6382
$$ 195069 227581 232491 258964 249672 216205 190643 186063 207096 239457 245444 225792 234279 270661
8615B70661o497P028J7528o771J346L3604L4711N3613L523M0564M4027L9857L5172
$$ 270661 264164 271192 288720 281949 283295 316899 351610 405223 408746 449310 493337 533194 568366
8602E68366P6020M7301K9171M9094L9744O0462K8270L0271M3920J9996m5062q3725
$$ 568366 644386 691687 720858 769952 809696 870158 898428 928699 972619 992615 947553 863828
8590H63828j30968j20070p3257n7763n8711l9965n1175K4859L9357j0326j9460
$$ 863828 732860 612790 539533 481770 423059 383094 331919 356778 396135 385809 366349
8579C66349l4836o0466l3657k2793L876n457p055O80r847K0348l577k533l4609
$$ 366349 331513 271047 237390 214597 218473 213016 205961 206641 196794 217142 213565 211032 176423
8566A76423k1954R420J672j1915l0677j4567M60J3086Q06n848j7961j505J3317
$$ 176423 154469 163889 165561 153646 122969 108402 108862 121948 122754 116906 98945 97440 110757
8553A10757L7243j5883m1182m985K0922m1086l0351K2002N9588r798l5690P358
$$ 110757 148000 132117 90935 85950 106872 65786 35435 57437 117025 107227 71537 78895
8541G8895j7793J9232K2292j75N753M994L994K6696n637o849j9144j3237J379
$$ 78895 61102 80334 102626 102451 108204 113198 117192 143888 138251 131402 112258 99021 100400
8528A00400L295l610m384r261n363j377k4415j0076J7678o118J9861K9953P420
$$ 100400 103695 100085 95701 86440 81077 79700 55285 45209 62887 56769 76630 106583 114003
8515A14003p205j734q882o312l7559j5297K2485L6661j2108M470j2127m7933Q118
$$ 114003 106798 105064 96182 89870 52311 37014 59499 96160 84052 88522 76395 28462 36580
8502C6580L0278k1712l3261q882p336K2365L0479K2600p007l379o795K893j315
$$ 36580 66858 45146 11885 3003 -4333 18032 48511 71111 64104 60725 53930 56823 55508
8489E5508j6477J217K933K5881l610k2436r998J8094K246r440J1249q389L335
$$ 55508 39031 40248 43181 69062 65452 43016 33018 51112 53358 43918 55167 46778 50113
8476E0113J3740L923r391j209M451m936J5367r990l1516R065K19o304m65K5044
$$ 50113 63853 67776 58385 57176 61627 56691 72058 62068 30552 39617 39836 33532 33067 58111
8462E8111J364l392k6023j0996K246P326J974k3353k5140L2974K2727l936j2208
$$ 58111 59475 56083 30060 19064 21310 28636 30610 7257 -17883 15091 37818 33882 21674
8449B1674O898R606j7059p79J0454K8822J922L971J7039n211k9701J250p602n474
$$ 21674 28572 38178 21119 20340 30794 59616 61538 65509 82548 77337 47636 48886 41284 35810
8435C5810M168j3319j0447M482j937K4128K991k9100N822K2237J8559j3517k3612
$$ 35810 39978 26659 16212 20694 18757 42885 45876 16776 22598 44835 63394 49877 26265
8422B6265q421r306j6159J8205r45J8410M76m134L868p926r803K1827K3185j5096
$$ 26265 17844 8538 -7621 10584 9639 28049 28525 24391 28259 20333 10530 32357 55542 40446
8408D0446o060j1650O473K2769k5517J0J7686o160j5570p565J915j0580j3286
$$ 40446 34386 22736 29209 51978 26461 26471 44157 37997 22427 14862 16777 6197 -7089
8395g089J6125J4074J6060j2691M34K2904J07j0912n4k571J7476J8042p386k4930
$$ -7089 9036 23110 39170 26479 26913 49817 49924 39012 38958 36387 53863 71905 64519 39589
8381C9589n1840j2562M060r46J5544R328q50J689r483P06R478J6051K1872M524
$$ 39589 -12251 -24813 -20753 -21699 -6155 3173 2323 4012 -5471 -4765 4713 20764 42636 47160
8367D7160k975o163k9182k4181J1635L1447J321J9877l472j2907k0979p348J8065
$$ 47160 44185 38022 8840 -15341 -3706 27741 29062 48939 45467 32560 11581 4233 22298
8354B2298L96K063j997k782l289P170j0860J363K7141j8880J3134J456l7733k6346
$$ 22298 22694 24757 22760 19978 16689 23859 12999 14362 41503 22623 35757 37213 -520 -26866
8340b6866K2849L1723J1433k9216k5694K2903K0581J0243k28j2953l170q184r842
$$ -26866 -4017 27706 39139 9923 -15771 7132 27713 37956 37728 24775 21605 13421 3579
8327C579J2203J0684P488P6p397r802K3192M330k8617j6389J4354k531l276L2385
$$ 3579 15782 26466 33954 34030 26633 16831 40023 44353 15736 -653 13701 11170 7894 40279
8313D0279K9994O366l1337r711J9045K1749k530P903k4472o947j9398k4659K4356
$$ 40279 70273 76639 45302 35591 54636 76385 73855 81758 57286 50339 30941 6282 30638
8300C0638K1346k2456j7127J0324J3174j0312J753M924K523o400l2250m0584K5852
$$ 30638 51984 29528 12401 22725 35899 25587 27340 32264 34787 28387 -3863 -44447 -18595
8287a8595N418Q346L0255O744j3901r020o811j2135o833J5457M1422J760o4273
$$ -18595 -13177 -4831 25424 32168 18267 9247 2436 -9699 -16532 -1075 40347 42107 -22166
8274b2166k3447K5858J3689J4704r954j5828J3619M1349J0128k1996Q74j7849
$$ -22166 -45613 -19755 -6066 8638 -1316 -17144 -3525 37824 47952 25956 26830 8981
8262H981P333n848l575J2284q848M710n836J0569J1193J4122l058p47r282r838
$$ 8981 16314 10466 6891 19175 10327 15037 9201 19770 30963 45085 42027 41280 31998 22160
8248B2160r946K5127J2460K6550o761l6157k7118P000J7374j5495n614L9732J135
$$ 22160 12214 37341 49801 76351 69590 33433 6315 13315 30689 15194 9580 49312 50447
8235E0447j6287j1995l359K6527O972o11j3783m238M010L629J4021o462m907j4971
$$ 50447 34160 22165 18806 45333 52305 51694 37911 33673 37683 41312 55333 48871 43964 28993
8221B8993j676j3423r00J4831j727q276P877N944K82j9630l980k446j045j1035
$$ 28993 27317 13894 12994 27825 26098 17822 25699 31643 31925 12295 8315 5869 4824 -6211
8207f211K9019J7017j076j9035K8180N735j1046o197j2657L2110J0002r261J2254
$$ -6211 22808 39825 38749 19714 47894 53629 42583 36386 23729 55839 65841 56580 68834
8194F8834q975L917K7041N2q564l0140k1896m751N446J2529k3494Q267N030J2
$$ 68834 59859 63776 90817 90869 82305 52165 30269 25518 30964 43493 19999 28266 33296 33308
8180C3308N4k796Q610j8756j4853Q294K0320k2415l480J6976J0084J3045j1073
$$ 33308 33362 30566 39176 20420 5567 13861 34181 11766 8286 25262 35346 48391 37318
8167C7318n886j0471j1680j769k0059J1694J5977j1547J046N17J0722K3581L2533
$$ 37318 31432 20961 9281 7512 -12547 -853 15124 3577 4623 5140 15862 39443 71976
8154G1976j2502l5088j2520N441j5141J7105K5539M4713K7443k3265j5251m1661
$$ 71976 59474 24386 11866 17307 2166 19271 44810 89523 116966 93701 78450 36789
8142C6789l8917L5400J1477k0773k298J2438L0699M347k0073k0175Q885k659k9339
$$ 36789 -2128 33272 44749 23976 21678 34116 64815 69162 49089 28914 37799 35140 5801
8129E801k7822l94M2085J6567n713K9402P651k2997k5255j5809J6519J9911j3173
$$ 5801 -22021 -22415 19670 36237 30524 59926 67577 44580 19325 3516 20035 39946 26773
8116B6773k909j42J4892R619Q155l0891N219Q317j6449J6428J4093k5074n194
$$ 26773 23864 23722 38614 48233 56388 25497 30716 39033 22584 39012 53105 28031 22837
8103B2837j3438n414M673m612K5085K0550j2218N692L2897k8612k0437j9441J2333
$$ 22837 9399 3985 8658 4046 29131 49681 37463 43155 76052 47440 27003 7562 19895
8090A9895J9450Q715k4504j2815N592J7975j90K3027K3246p423l59o898m202j3749
$$ 19895 39345 48060 23556 10741 16333 34308 34118 57145 80391 72968 72609 65711 61509 47760
8076D7760j6489K0557M300k1777j8458J6234M0016L7257j1139l465M009j2642
$$ 47760 31271 51828 56128 34351 15893 32127 72143 109400 98261 94796 98805 86163
8064H6163j6858L562K3681n212n9826k0276J3707K495o799J9565J6461K5423r069
$$ 86163 69305 72867 96548 91336 31510 11234 24941 27436 20637 40202 56663 82086 73017
8051G3017j0451J6520J1476J857J4404j0244m061J1738N820o08J3398j4244j7385
$$ 73017 62566 79086 90562 92419 106823 96579 92518 104256 110076 109468 122866 108622 91237
8038I1237r24k5022M327R990J3704J0918r920J444l806j6282L3697P749j3041
$$ 91237 90313 65291 69618 79608 93312 104230 94310 95754 91948 75666 109363 117112 104071
8025A04071n185K1587J9124k503j405R149m394J7132j819J0106K6734r216k6117
$$ 104071 98886 120473 139597 137094 135689 144838 140444 157576 155757 165863 192597 183381 157264
8012A57264j8313j3334j5691N639M20J0942L6344L6206M0154L1089o01k374k7334
$$ 157264 138951 125617 109926 115565 115985 126927 163271 199477 239631 270720 270119 267745 240411
7999B40411J4044R974r54k1512l5143j0280m3216j8684K6571q914m405j1880M149
$$ 240411 254455 264429 263475 241963 206820 196540 153324 134640 161211 152297 147892 136012 140161
7986A40161L105K3857m1154j7386j5058M780L0468M3095j0484N752O552R166J093
$$ 140161 143266 167123 125969 108583 93525 98305 128773 171868 161384 167136 173688 182854 183947
7973A83947j2268l1465L014K9574L126K0051l059j9591k8203k4676K2569L9592
$$ 183947 171679 140214 143228 172802 175928 195979 192920 173329 145126 120450 143019 182611
7961A82611j5258k762K91L18m73P624J1205J6179K1256r754k5172p023K1937j0296
$$ 182611 167353 164591 164882 165200 164727 172351 183556 199735 220991 211237 186065 179042 200979 190683
7947A90683l4695j6338j1272n87p724j6097N221j8994P101j8986R569K2224K1225
$$ 190683 155988 139650 128378 127791 120067 103970 109191 90197 97298 78312 87881 110105 131330
7934A31330j0613j0209o710J4360o543j1878R252J984L2258N591m919J5444p035
$$ 131330 120717 110508 103798 118158 111615 99737 108989 110973 143231 148822 143903 159347 152312
7921A52312l0404j4882j0342K5450K4824O291n902l0030j2102j3993p519N476
$$ 152312 121908 107026 96684 122134 146958 153249 147347 117317 105215 91222 83703 89179
7909H9179j4851m012j8607K2662L2359J8509l8661l2257J9020o555K0419j8430
$$ 89179 74328 70316 51709 74371 106730 125239 86578 54321 73341 66786 87205 68775
7897F8775M788L0626j1047j6450j5412k262P513K1128J6047J1751P029J710l7064
$$ 68775 73563 104189 93142 76692 61280 59018 66531 87659 103706 115457 122486 124196 87132
7884H7132k0676k8037j495J230K1857K1070J4275r530j7620Q474J4828M642j2422
$$ 87132 66456 38419 36924 38154 60011 81081 95356 85826 68206 76680 91508 96150 83728
7871H3728j1197k8419k529o840K0245J6545O044k9660Q034J8259k6732q230J4591
$$ 83728 72531 44112 41583 34743 54988 71533 77577 47917 55951 74210 47478 39248 53839
7858E3839j2275J5273R134k2950J0500Q081j5451j2370o74m819j2667j1143J3463
$$ 53839 41564 56837 65971 43021 53521 61602 46151 33781 33107 28288 15621 4478 17941
7845A7941Q046j5563K707j1548P22k4212j73J866O596J7627J6136J1290K3530
$$ 17941 25987 10424 13131 1583 2305 -21907 -22080 -20214 -13618 4009 20145 31435 54965
7832E4965j7167r18j6566r141P821K423j4885o409n824J5475L4754K6338k173
$$ 54965 37798 36880 20314 11173 18994 21417 6532 123 -5701 9774 44528 70866 68693
7819F8693k4716L221r568r507j6881J086K312l412L344R990m528k442P900j5906
$$ 68693 43977 47198 37630 28123 11242 12328 14640 11228 14572 24562 20034 17592 25492 9586
7805I586J6550J2314q626j9535Q900j4304q370j0116Q337J7639K7150n528m3802
$$ 9586 26136 38450 29824 10289 19189 4885 -3485 -13601 -5264 12375 39525 33997 -9805
7792i805j6203Q625J3680m044j12J232J7708J0606j5210j9836j0004j3591q833
$$ -9805 -26008 -17383 -3703 -7747 -7859 -6627 11081 21687 6477 -13359 -23363 -36954 -45787
7779d5787k797K4275J8650k0047N554K4884m576J1603j4419o925k099j4019M013
$$ -45787 -48584 -24309 -5659 -25706 -20152 4732 156 11759 -2660 -9585 -11684 -25703 -21690
7766b1690L2095M573j3512p736p563k3449j6238k4061K6384K7383J9597M001J0512
$$ -21690 10405 14978 1466 -6270 -13833 -37282 -53520 -77581 -51197 -23814 -4217 -216 10296
7753A0296J0057j49J197r732q273l651m685r4P250k6029M062L0301L1865k5118
$$ 10296 20353 20204 21401 11669 3396 -255 -4940 -5034 2216 -23813 -19751 10550 42415 17297
7739A7297j9164O989l022N016k0647L2478J0619K185r550P347O530k0632m465
$$ 17297 -1867 5122 2100 7116 -13531 18947 29566 31751 22201 29548 36078 15446 10981
7726A0981N257j2375j4607k0447k3141L1646M7571J4221l1695k3763j5515J1897
$$ 10981 16238 3863 -10744 -31191 -54332 -22686 24885 39106 7411 -16352 -31867 -19970
7714a9970K6520J4305J92J9494J5589j2744r986k0753j7292j9727j7806M0049
$$ -19970 6550 20855 21047 40541 56130 43386 33400 12647 -4645 -24372 -42178 -2129
7702b129K5881k6221m0537m117K8546O164K328R062J1543L426J0359r061k7079
$$ -2129 23752 -2469 -43006 -47123 -18577 -12413 -10085 -1023 10520 13946 24305 15244 -11835
7689a1835j993M814J1704j6328k7761M090J3208J7275K5393K1954K958J1652j5777
$$ -11835 -13828 -9014 2690 -13638 -41399 -37309 -24101 -6826 18567 40521 43479 55131 39354
7676C9354j4699n108j9676k7868n090J4229J5525Q375m57o488r075J5734j2940
$$ 39354 24655 19547 -129 -27997 -33087 -18858 -3333 5042 4585 -1903 -10978 4756 -8184
7663h184K550J3298O098j5374J5910r308k1670j5762k2432J9831K4574j5984n390
$$ -8184 -5634 7664 13762 -1612 14298 4990 -16680 -32442 -54874 -35043 -10469 -26453 -31843
7650c1843K0886M067O644k1592k4047J5041j5138N097M0494K3844J750J4272j2518
$$ -31843 -10957 -6890 -246 -21838 -45885 -30844 -45982 -40885 -391 23453 25203 39475 26957
7637B6957l133n534J3012r466j3616J3693k142j3769j6693J6561J6433Q728K6608
$$ 26957 23824 18290 31302 21836 8220 21913 19771 6002 -10691 5870 22303 31031 57639
7624E7639q876j0767j5231p301N50J9857k6739l5635l759j4805K7011L1191K181
$$ 57639 48763 37996 22765 15464 16014 35871 9132 -26503 -30262 -45067 -18056 13135 15316
7611A5316M936J0911k3987k3298O563j9293k6935N198q844K0249J7535j4296L1802
$$ 15316 20252 31163 7176 -16122 -9559 -28852 -55787 -50589 -59433 -39184 -21649 -35945 -4143
7598d143K8352J2884R75p768k5625j9321J3585p939l9456J025L1120M551Q256
$$ -4143 24209 37093 38068 30300 4675 -14646 -1061 -9000 -48456 -47431 -16311 -11760 -3504
7585c504k292j582J1007M189l5779m535J4770Q070j609J9634j673l6918K017j7548
$$ -3504 -5796 -7378 3629 7818 -27961 -32496 -17726 -9656 -11265 8369 6696 -30222 -28205 -45753
7571d5753k319J7682Q209q909k0925K2203l29J3698R534J3166J2362p443L423
$$ -45753 -48072 -30390 -22181 -31090 -52015 -29812 -30141 -16443 -6909 6257 18619 11176 14599
7558A4599p564J5773r883j7139l1373J3832M6227n405J1042k368n166p435o115
$$ 14599 7035 22808 12925 -4214 -35587 -21755 24472 19067 30109 27741 22575 15140 9025
7545I025k325j7964n342J9807k3353q450j329O184Q096j3908Q316L8145R160j5592
$$ 9025 6700 -11264 -16606 3201 -20152 -28602 -29931 -23747 -15651 -29559 -21243 16902 26062 10470
7531A0470l5372k3354K7584J5329k838J2108Q764j8676l1378j052k0167p083L5056
$$ 10470 -24902 -48256 -20672 -5343 -8181 3927 12691 -5985 -37363 -38415 -58582 -65665 -30609
7518c0609K2439l176j3419J3791K1666j3172K52J3537j7307L2416J697l2974l1631
$$ -30609 -8170 -11346 -24765 -10974 10692 -2480 -2228 11309 -5998 26418 28115 -4859 -36490
7505c6490J0146K3130j2020k2673J3841K6209L7498J2373j5115j9731n548o037
$$ -36490 -26344 -3214 -15234 -37907 -24066 2143 39641 52014 36899 17168 11620 5583
7493E583R770n736j6041J884J0841P857N971n768P034J881j3125j959o031k7250
$$ 5583 15353 9617 -6424 -4540 6301 14158 20129 14361 21395 23276 10151 8192 2161 -25089
7479b5089j0885K0017L030j2579L884k5584q329J0060M2695K1612J3329K9022
$$ -25089 -35974 -15957 -12927 -25506 -21622 -47206 -55535 -45475 -2780 18832 32161 61183
7467F1183p473k382k3474o122j4668J7373J8123J954M237j0495j7724P525J597
$$ 61183 53710 51328 27854 21732 7064 24437 42560 44514 48751 38256 20532 28057 29654
7454B9654n180j147J257q851n3544l0359J6024M210L340L403R047M81J1073J554
$$ 29654 24474 23327 24584 15733 -37811 -68170 -52146 -47936 -44596 -41193 -32146 -31665 -20592 -19038
7440a9038j1822Q719K8214J239m617j0484J1953j994K5560J3572j4852j4646j1098
$$ -19038 -30860 -22141 6073 7312 2695 -7789 4164 2170 27730 41302 26450 11804 706
7427G06l3077N985L476M738O252N126M997P618P72o004J171L904j483j5366j237
$$ 706 -32371 -26386 -22910 -18172 -11920 -6794 -1797 5821 6593 589 1760 5664 4181 -11185 -12422
7412a2422o504O246o963K01K9491j1181m22P592R486M0090L953l5547k4745O127
$$ -12422 -18926 -12680 -19643 -19442 10049 -1132 -1554 6038 15524 55614 59567 24020 -725 5402
7398E402j6614j2335P482J1335n360J2839J7898K4878j6345q007j9223k5228k9676
$$ 5402 -11212 -23547 -16065 -4730 -10090 2749 20647 45525 29180 21173 1950 -23278 -52954
7385e2954j366K1759K6591P726j9213K4388n238j4206j5709j9638Q280J8284O0777
$$ -52954 -54320 -32561 -5970 1756 -17457 6931 1693 -12513 -28222 -47860 -39580 -21296 39481
7372C9481R064m980j1022k5964k9248m345K6447L1824N996r571l8554j6039K316
$$ 39481 48545 43565 32543 6579 -22669 -27014 -567 31257 37253 27682 -10872 -26911 -24595
7359b4595k5026K0501J2332K6958l601j5626L1283j939j1151M483M356J3729m605
$$ -24595 -49621 -29120 -16788 10170 6569 -9057 22226 20287 9136 13619 17975 31704 27099
7346B7099j1810L260k4961k3735P80k301K0953P657O707j6174k0161J0864O417
$$ 27099 15289 18549 -6412 -30147 -29367 -31668 -10715 -3058 3649 -12525 -32686 -21822 -15405
7333a5405K2305p97r171J4484l485k7835j299j5473j1218R528n660L3025K5252
$$ -15405 6900 6103 -3068 11416 7931 -19904 -21203 -36676 -47894 -38366 -44026 -11001 14251
7320A4251k0355j9356q067l084J3227J0278L1124j6960r331j1099k6374k6609
$$ 14251 -6104 -25460 -33527 -36611 -23384 -13106 18018 1058 -8273 -19372 -45746 -72355
7308g2355k5347J5176M3034K1783j3641K1663k677Q101j4731M624P075j7386q197
$$ -72355 -97702 -82526 -39492 -17709 -31350 -9687 -12364 -4263 -18994 -14370 -7295 -24681 -32878
7295c2878J6317J9276J103k7705P941J8358k5960j6475J6544J1691l189j929j0297
$$ -32878 -16561 2715 3818 -23887 -15946 2412 -23548 -40023 -23479 -11788 -14977 -16906 -27203
7282b7203k972K8422k758k4360r850J6412l149m1371j9179K6763L4184Q074O372
$$ -27203 -30175 -1753 -4511 -28871 -38721 -22309 -25458 -66829 -86008 -59245 -25061 -16987 -10615
7269a0615J0911M625j6061J466K448k6329p031m068K9161J0984M98o128k1722
$$ -10615 296 4921 -11140 -9674 -7226 -33555 -40586 -44654 -15493 -4509 -4011 -10139 -31861
7256c1861J79J8450J2124J2179k2734j3677L585L0374r738l3197k773J6553p136
$$ -31861 -31682 -13232 -1108 11071 -11663 -25340 -21755 8619 -1119 -34316 -37089 -20536 -27672
7243b7672L228P680J1707P975k3705l9303J0334J4548K5064k5182k6426J9311
$$ -27672 -24444 -16764 -5057 2918 -20787 -60090 -49756 -35208 -10144 -35326 -61752 -42441
7231d2441K1550K6606k4636n580M942J6427j5156j7785K7753J3135n678l923k626
$$ -42441 -20891 5715 -18921 -24501 -19559 -3132 -18288 -36073 -8320 4815 -863 -4786 -7412
7218g412L128n703J31J2030J5058M94q9q92m765o320J333j7j946q93N549l560
$$ -7412 -4284 -9987 -9856 2174 17232 17726 17637 16745 11980 5660 6993 6976 5030 4137 9686 6126
7202F126j8042J778J2482o959O884j8826j9811o5K8345L2052l3237l0043j942
$$ 6126 -11916 -10138 2344 -4615 2269 -16557 -36368 -36433 -8088 23964 -9273 -39316 -41258
7189d1258Q841J7964N729l078j2837m700K1825J7976n216k2513J1421M069J0305
$$ -41258 -32417 -14453 -8724 -11802 -24639 -29339 -7514 10462 5246 -17267 -5846 -1777 8528
7176H528J5047o3n772j3702j8520O325J3082k7619j2634J888k154L381J8569j084
$$ 8528 23575 23512 17740 4038 -14482 -8157 4925 -22694 -35328 -33440 -35594 -32213 -13644 -14728
7162a4728K3141K7523m92j8124p705L831j3514j7272j4801K3304K1065Q92r410
$$ -14728 8413 35936 35444 17320 9615 13446 -68 -17340 -32141 -8837 12228 13120 3710
7149C710r820J0169J4171q627j5011L62K653r916k9265J8704J6330J5739m699
$$ 3710 -6110 4059 18230 9603 -5408 -5046 -2393 -12309 -41574 -22870 -6540 9199 4500
7136D500j7823j3601K820j8405j6917J0548K7400J938L6122m821l5593k4079Q091
$$ 4500 -13323 -26924 -24104 -42509 -59426 -48878 -21478 -19540 16582 11761 -23832 -47911 -39820
7123c9820M1694J077j9937M992L2452L250K503k7678k0521J5770L8586K811l4949
$$ -39820 1874 2951 -16986 -11994 20458 23708 26211 -1467 -21988 -6218 32368 35179 230
7110B30k1727Q697J9285K0813P697m784p960m23l7656p615o0j557k339k2779l369
$$ 230 -21497 -12800 6485 27298 34995 30211 22251 21828 -15828 -23443 -23503 -25060 -27399 -50178 -53547
7095e3547J1350J0246P792K4284P518p629R356m565j2331j0038M941J4322J0420
$$ -53547 -42197 -31951 -24159 125 7643 14 9370 4805 -7526 -17564 -12623 1699 12119
7082A2119n118k843q387j137p936m785q765K340J4114J683q587q107K4542J8406
$$ 12119 7001 4158 -4229 -5366 -13302 -18087 -26852 -24512 -10398 -8715 -17302 -25409 -867 17539
7068A7539J7955n922k9923k2388Q042J3242J4301j9517r557M162O100R348n51
$$ 17539 35494 29572 -351 -22739 -14697 -1455 12846 -6671 -16228 -12066 -5966 3382 2831
7055B831l6465k0166J717K3157J2451l438J9717Q043j8666p707M032J2415L1945
$$ 2831 -33634 -53800 -52083 -28926 -16475 -19913 -196 7847 -10819 -18526 -14494 -2079 29866
7042B9866m959j0794r426L3666J5484Q623J7930k194j2387k4358j2531k471j7852
$$ 29866 24907 14113 4687 38353 53837 62460 80390 78196 65809 41451 28920 26449 8597
7029H597q367q560J5898j785R69m197k984j993P430Q013N969r677M974n459j2620
$$ 8597 230 -8330 7568 5783 6752 2555 -429 -2422 5008 13021 18990 9313 14287 8828 -3792
7014c792k9195O544N776n934j1786K6859K2828l0738k5700j1666j6560K2843K1888
$$ -3792 -32987 -26443 -20667 -26601 -38387 -11528 11300 -19438 -45138 -56804 -73364 -50521 -28633
7001b8633L763J1953Q926r627j0016k6682j4142K8107L9136L424j372J152J3891
$$ -28633 -24870 -12917 -3991 -13618 -23634 -50316 -64458 -36351 2785 6209 4837 5989 19880
6988A9880p38j6765J4458J418k957k7362J4766o511j1220r866r23j2153j5987
$$ 19880 19142 2377 16835 18253 15296 -12066 2700 -3811 -15031 -24897 -25820 -37973 -53960
6975e3960J7527L7634K227k3849K0650M5806J0328m7579l0547L7614K1617j804
$$ -53960 -36433 1201 3428 -20421 229 46035 56363 8784 -21763 15851 37468 35664
6963C5664r483j6868m199J2975N848J3580k4039m3049k2801J998n291R36M6074
$$ 35664 26181 9313 5114 18089 23937 37517 13478 -29571 -52372 -50374 -55665 -54729 -8655
6950h655L0754o47l782J9206j5026j6129q170q785m759J713O35j7142k8766m789
$$ -8655 22099 21452 17670 36876 21850 5721 -2449 -11234 -15993 -14280 -13645 -30787 -59553 -64342
6936f4342K5155k9652q232K0872K539R087L0580L510O651K325q455k8402l503
$$ -64342 -39187 -68839 -77071 -56199 -53660 -44573 -13993 -10483 -3832 -1507 -9962 -38364 -41867
6923d1867j6340J5532O315J9817K0564r083K804n52j453l199j0090K0348L214
$$ -41867 -58207 -42675 -36360 -16543 4021 -5062 -2258 -2810 -4263 -7462 -17552 2796 6010
6910F010l2868k7236l163J3374L5149R00J664J1194l952p747j9289r256J1677
$$ 6010 -26858 -54094 -57257 -43883 -8734 -7834 -6170 5024 1072 -6675 -25964 -35220 -23543
6897b3543p542L1865L9755N689K3726j8183k7467n266K972K6798K4j3085j7003
$$ -23543 -31085 780 40535 46224 69950 51767 24300 19034 22006 48804 48828 35743 18740
6884A8740k6761j1836q325J6648R866M959q147j070J1371L211m060j3201K0035
$$ 18740 -8021 -19857 -28182 -11534 -1668 3291 -4856 -5926 5445 8656 4596 -8605 11430
6871A1430q316k7606M67q535l0557J6865K7054M301n927j0117J770K3262l541
$$ 11430 3114 -24492 -24025 -32560 -63117 -46252 -19198 -14897 -20824 -30941 -29171 -5909 -9450
6858i450R548J620j7000K5190Q072j5767l889j3293M18J0902r26k575P03k963
$$ -9450 98 1718 -15282 9908 17980 2213 -1676 -14969 -14551 -3649 -4575 -7150 -6447 -9410
6844i410k715J0001L747j9865j4722J388J8908O129m12K4980J1923o287P389L564
$$ -9410 -12125 -2124 1623 -18242 -32964 -31576 -12668 -6539 -6951 18029 29952 23665 31054 34618
6830C4618Q370n879j5947r505o756j3141P422J1158J5254l1484k2701R321K4608
$$ 34618 42988 37109 21162 11657 4901 -8240 -818 10340 25594 -5890 -28591 -19270 5338
6817E338K6583J7521J5056o097j3736k9643k0143n498j536r207j9935L948J8114
$$ 5338 31921 49442 64498 58401 44665 15022 -5121 -10619 -12155 -21362 -41297 -37349 -19235
6804a9235K2574L2595q958l1775q002k6208j942m533n683K2050J3399M1861M398
$$ -19235 3339 35934 26976 -4799 -12801 -39009 -40951 -45484 -51167 -29117 -15718 26143 30541
6791C0541j403j3614j0236j6728l333R138J0220J0405M302j4452J0320p83j3831
$$ 30541 29138 15524 5288 -11440 -14773 -5635 4585 14990 19292 4840 15160 14377 546
6778E46R672m499j4278J3161K4437l3144k2820J6216J3833K5230N409j1756J785
$$ 546 10218 5719 -8559 4602 29039 -4105 -26925 -10709 3124 28354 33763 22007 23792
6765B3792K79k646j7748k6077N105K3358K6201j5802J9833R299J5140j2102k2173
$$ 23792 24071 21425 3677 -22400 -17295 6063 32264 16462 36295 45594 60734 48632 26459
6752B6459j0579r578j0583j0748k4296J9918J7332o287l59j4244r405K0769P324
$$ 26459 15880 6302 -4281 -15029 -39325 -19407 -2075 -8362 -8721 -22965 -32370 -11601 -4277
6739d277K6023J8758Q552r005k7023j9927K056k781J3128j7839R554K810L206
$$ -4277 21746 40504 49056 40051 13028 -6899 -4843 -7624 5504 -12335 -2781 29 3235
6726C235j9075L056N3917r291l6593k0260o299K2704K1080j0802j5779J0692P022
$$ 3235 -15840 -12784 41133 31842 -4751 -25011 -31310 -8606 12474 1672 -14107 -3415 3607
6713C607J0799j847Q3P051K146j3831o726L635k377j5379k2098J2916p396J2354
$$ 3607 14406 12559 12642 19693 21839 8008 1282 4917 2540 -12839 -34937 -22021 -29417 -17063
6699a7063Q817M0681J2003R429m201l4039j1635J1480J4831q711k4922j3031J4459
$$ -17063 -8246 32435 44438 53867 49666 15627 3992 15472 30303 21592 -3330 -16361 -1902
6686a902q490K249j2239J3078J8221p14j7887k0823m985K4701L994J8475m996
$$ -1902 -10392 -8143 -20382 -7304 10917 10203 -7684 -28507 -33492 -8791 -4797 13678 8682
6673H682j9659k4686J901L0002O982L5842M739j3311j7770l4742l1008j1430j362
$$ 8682 -10977 -35663 -33762 -3760 3222 39064 43803 30492 12722 -22020 -53028 -64458 -65820
6660f5820L829J2822L9017L7590K561r811j4108K747L553M232N036j0459j2253
$$ -65820 -61991 -49169 -10152 27438 29999 20188 6080 8827 12380 16612 21648 11189 -1064
6647a064m603k2792O456J7642k0643m240j1057O248K0562J6289J7243o785l122
$$ -1064 -5667 -28459 -22003 -4361 -25004 -29244 -40301 -34053 -13491 2798 20041 13256 10134
6634A0134K8880q32j4353n9214j7241L0358j631j1324k0711q128L2701L4498Q918
$$ 10134 39014 38182 23829 -35385 -52626 -22268 -23899 -35223 -55934 -64062 -31361 3137 12055
6621A2055l720j0366J785J5835j2690k9345q619L5323J1084r27J874j3037k187
$$ 12055 8335 -2031 -246 15589 2899 -26446 -35065 258 11342 10415 12289 -748 -2935
6608b935p421q634J7601J6078o341J3893m458j8457L843K3001p761k0108J3287
$$ -2935 -10356 -18990 -1389 14689 8348 22241 17783 -674 3169 26170 18409 -1699 11588
6595A1588j508j1307k454K701j184j8644J2353o999L205l248j17K685j4000M860
$$ 11588 10080 -1227 -3681 -980 -2164 -20808 -8455 -15454 -12249 -15497 -15614 -12929 -26929 -22069
6581b2069K8499K6067k0382j3815l535r250j9744k0617k4429j7401K2229L3699
$$ -22069 6430 32497 12115 -1700 -5235 -14485 -34229 -54846 -79275 -96676 -74447 -40748
6569d0748j712j4691Q825K4666J917j2340j4321Q79j882P794J8073M583P552N238
$$ -40748 -42460 -57151 -48326 -23660 -21743 -34083 -48404 -47525 -49407 -41613 -23540 -18957 -11405 -6167
6555f167O20k0805j7630O209J1016J1687j2757j1669r765n54J9100J9243j0725
$$ -6167 -5547 -26352 -43982 -37773 -26757 -15070 -27827 -39496 -49261 -49815 -30715 -11472 -22197
6542b2197j1863J0117K5707J1363O057j8466k3110J7994L1873J2084l1361j6153
$$ -22197 -34060 -23943 1764 13127 19184 718 -22392 -4398 27475 39559 8198 -7955
6530g955J0538J7690j1431j2547j958j187q438M02q252p38j2591R68Q522K6583
$$ -7955 2583 20273 8842 -3705 -5663 -6850 -15288 -14886 -23138 -23876 -36467 -35499 -26977 -394
6516c94j2497M892J2528l304K1383r768k5865R10O884j5142j7078K316j4475K7394
$$ -394 -12891 -7999 4529 1225 22608 12840 -13025 -12115 -5231 -20373 -37451 -35135 -49610 -22216
6502b2216L6403P950K499l9825o490J617J4531q003j2734n258J3687J8687j4392
$$ -22216 14187 22137 24636 -15189 -21679 -20062 -5531 -13534 -26268 -31526 -17839 848 -13544
6489a3544k3627p331m101K5796L4462Q943m3185k7118K1112K2945K5149j3543
$$ -13544 -37171 -44502 -48603 -22807 11655 20598 -22587 -49705 -28593 -5648 19501 5958
6477E958k4514Q247J616k439l162j5176j201J9399P703J958M799J0446j9801M247
$$ 5958 -18556 -10309 -8693 -11132 -14294 -29470 -30671 -11272 -3569 -1611 3188 13634 -6167 -1920
6463a920M2657J3083k5794j4202R078P420L167k1287J018L1275J5007j9653j9948
$$ -1920 40737 53820 28026 13824 22902 30322 33489 12202 13220 44495 59502 39849 19901
6450A9901n107K823j025j4029p940m250K9004J6382j4052j6749l7424j689J2069
$$ 19901 14794 17617 16592 2563 -5377 -9627 19377 35759 21707 4958 -32466 -34155 -22086
6437b2086J6927J542k0724j6448M3938L1507k2171m0331J581J2817L680J1378
$$ -22086 -5159 -3617 -24341 -40789 3149 34656 12485 -27846 -26265 -13448 -9768 1610
6425A610J98L46L5867k229k5091o469k704M29J3667K4764m41k7906j1805r64j4762
$$ 1610 1808 2154 38021 35792 10701 4232 1528 1957 15624 40388 39947 12041 236 -728 -15490
6410a5490k215K4266m659j7989K712J0136j709N393j4991J0473N360R166K914
$$ -15490 -17705 6561 1902 -16087 -13375 -3239 -4948 445 -14546 -4073 1287 10453 13367
6397A3367j6803j6746P230m454j4844Q68j3552J0156K2968p927j05J0456j0612
$$ 13367 -3436 -20182 -12952 -17406 -32250 -31382 -44934 -34778 -11810 -19737 -19842 -9386 -19998
6384a9998Q70R302j574q059j6588j379J9397K20R206q454o882j693q678o794J4480
$$ -19998 -19128 -9826 -11400 -19459 -36047 -37426 -18029 -17809 -8603 -17057 -23939 -25632 -34310 -41104 -26624
6369b6624P645j7150J1654J3624K496k4139r70j426J547O604J0796m330J247L566
$$ -26624 -18979 -36129 -24475 -10851 -8355 -32494 -33464 -34890 -33343 -26739 -15943 -20273 -19026 -15460
6355a5460J1379q066j3786n108K3482K4903o562j2307L748m555j9943r056J1878
$$ -15460 -4081 -12147 -25933 -31041 -7559 17344 10782 -1525 2223 -2332 -22275 -31331 -19453
6342a9453J0733j2272k4570q760J1597M8006R326l3833k213J5440q100L657J5642
$$ -19453 -8720 -20992 -45562 -54322 -42725 5281 14607 -19226 -21439 -5999 -14099 -10442 5200
6329E200L734j7069l327J5536P073J552k0313q125l158n218p44J784m090j721
$$ 5200 8934 -8135 -11462 4074 11147 12699 -7614 -15739 -18897 -24115 -24859 -23075 -27165 -28886
6315b8886n913k8005j204K1974K8455Q417Q058P206j4612rR047L887P456j5334
$$ -28886 -34799 -62804 -64008 -42034 -13579 -5162 2896 10102 -4510 -4519 4528 8415 15871 537
6301E37j5547J904q31R842K0599P484o67k5804J2820J5527N184j1352k3195j8097
$$ 537 -15010 -13106 -13937 -4095 16504 23988 23321 -2483 10337 25864 31048 19696 -3499 -21596
6287b1596o106J9k1925R090J6738M415K3290K2283K725j3502l323K129o131n061
$$ -21596 -27702 -27683 -49608 -40518 -23780 -19365 3925 26208 28933 15431 12108 14237 8106 3045
6273C045q932m8321r423O280M173J7439J5293p520J203j4099K0426L9508J3413
$$ 3045 -5887 -54208 -63631 -57351 -53178 -35739 -20446 -27966 -26763 -40862 -20436 19072 32485
6260C2485k375k5580k517j5702m554M141N615j3332j4980j2835M0932L6243K1968
$$ 32485 30110 4530 2013 -13689 -18243 -14102 -8487 -21819 -36799 -49634 -8702 27541 49509
6247D9509l2809j68M47q626r200k3978Q562K9259R615k341k518O606m5800k6372
$$ 49509 16700 16532 16979 8353 -847 -24825 -16263 12996 22611 20270 17752 24358 -21442 -47814
6233d7814R84K7230M0164P930l4200j2028j9164J9613K0805M671L697r789J498
$$ -47814 -46830 -19600 20564 28494 -5706 -17734 -36898 -17285 3520 8191 11888 2099 3597
6220C597J3209K3876J4129j6692l8943j2750l899m798m76L7832K2516k0058l581
$$ 3597 16806 40682 54811 38119 -824 -13574 -17473 -22271 -22747 15085 37601 17543 13962
6207A3962l8613j0694L1879q4N492l0022l2516J7244N0717J6452K0337j0886k4593
$$ 13962 -24651 -35345 -3466 -3550 1942 -28080 -60596 -43352 7365 23817 44154 33268 8675
6194H675M154J4665j4185k6940r278j4583Q075J1724L7909J1319k8397j4047k89
$$ 8675 12829 27494 13309 -13631 -22909 -37492 -29417 -17693 20216 31535 3138 -10909 -11198
6181a1198J1249m489n784l618O209J4027j807j3821j740L1227O634l6566r347
$$ -11198 51 -4438 -10222 -13840 -7631 6396 4589 -9232 -10972 20255 26889 -9677 -19024
6168a9024n317J518R366J074o101P299J6281j4113m492J4885J2629j4949L830
$$ -19024 -24341 -22823 -13457 -12383 -18484 -11185 5096 -9017 -13509 1376 14005 -944 2886
6155B886p440R417K597o628j0536j2409N316J1997q87k1846j799K6065L9470R71
$$ 2886 -4554 4863 7460 832 -9704 -22113 -16797 -4800 -5687 -27533 -29332 -3267 36203 37174
6141C7174o013l2346k2883M719O889n258n317n21K1960J6369L382l162k791P24
$$ 37174 31161 -1185 -24068 -19349 -12460 -17718 -23035 -23556 -1596 14773 18155 14993 12202 12926
6127A2926O533p305j7688K87j0369j05J8113n267Q407j6350k3734j3642M707L4392
$$ 12926 19459 12154 -5534 -5247 -15616 -15721 2392 -2875 5532 -10818 -34552 -48194 -43487 -9095
6113i095J0809K0948N6r424O842m638k3553o46P260m729o876K1141l273J4849
$$ -9095 1714 22662 22718 13294 20136 15498 -8055 -8701 -1441 -6170 -13046 8095 4822 19671
6099A9671J0002p868r752k0201r282k721n274P219J0161P042K894j1649j2822
$$ 19671 29673 21805 12053 -8148 -17430 -20151 -25425 -18206 -8045 -1003 1891 -9758 -22580
6086b2580p355J4613M752J0710Q645j2932k110j5024Q76J5735L120j5355Q690
$$ -22580 -29935 -15322 -10570 140 8785 -4147 -6257 -21281 -20405 -4670 -1550 -16905 -8215
6073h215Q639J533j0349j5755Q72o154J324J5897J289R421J7189K471Q658n673
$$ -8215 424 1957 -8392 -24147 -23275 -29429 -28105 -12208 -10919 -1498 15691 18162 26820 21147
6059B1147O83k18k068J1712l463j1187j4358j470J3880j807o997k728j3934p612
$$ 21147 21830 21612 19544 31256 27793 16606 2248 778 14658 12851 5854 3126 -10808 -18420
6045a8420P498j021N893J7364q873K279K483N356j4837R899J0748j9085o530J521
$$ -18420 -10922 -11943 -6050 11314 2441 4720 7203 12559 -2278 7621 18369 -716 -7246 -5725
6031e725j5078N112L128J6178N469j4498l5489p576J3654K152K1831J6412L294
$$ -5725 -20803 -15691 -12563 3615 9084 -5414 -40903 -48479 -34825 -32673 -10842 5570 8864
6018H864m149j842j3890l825P610j5684J3104R449n689j4164P342j8522J2506
$$ 8864 4715 2873 -11017 -14842 -7232 -22916 -9812 -363 -6052 -20216 -12874 -31396 -18890
6005a8890L012J480K2544J427J2330J1754p815k8462l6706m85j0957q754p92p08
$$ -18890 -15878 -14398 8146 9573 21903 33657 25842 -2620 -39326 -39811 -50768 -59522 -60314 -61022
5991f1022K8447J0717M641J7029R506J0126k0026j8344M305P161Q234K05j1157
$$ -61022 -32575 -21858 -17217 -188 9318 19444 -582 -18926 -14621 -7460 774 979 -10178
5978a0178J8711k1166j4347K308M541P784K8065J2715n025J3090m316J347j7346
$$ -10178 8533 -12633 -26980 -24672 -20131 -12347 15718 28433 23408 36498 32182 33529 16183
5965A6183j8873J7752j2846r001j2370o154o236K975j641K2658J2914J1669m592
$$ 16183 -2690 15062 2216 -6785 -19155 -25309 -31545 -28570 -30211 -7553 5361 17030 12438
5952A2438p596J3120M732k0581n82O145j5492L68N180k3783M566K0075Q106m567
$$ 12438 4842 17962 22694 2113 1531 7676 -7816 -7448 -2268 -26051 -21485 -1410 6696 2129
5938B129j5096k1419k2658J0864K5563Q432O546K1121k1147k5067J3341L06l0309
$$ 2129 -12967 -34386 -57044 -46180 -20617 -12185 -5639 15482 -5665 -30732 -17391 -17085 -47394
5925d7394j7527K664K2850K6013Q916k645K046k906j2463j4546P262N532R414
$$ -47394 -64921 -62257 -39407 -13394 -4478 -7123 -5077 -7983 -20446 -34992 -27730 -22198 -12784
5912a2784J4825K35K2598L672k0781k2741k1116M152K6530J0161N316N84R998
$$ -12784 2041 2276 24874 28546 7765 -14976 -36092 -31940 -5410 4751 10067 10651 20649
5899B0649k2376K674j4950j2697N006n576J80K0135P016n211J7618Q690N477K7975
$$ 20649 -1727 947 -14003 -26700 -21694 -27270 -27090 -6955 61 -5150 12468 21158 26635 54610
5885E4610J4329j9847n405n93k7409k6800k2737j3675J1117J7365L07k3713P402
$$ 54610 68939 49092 43687 43094 15685 -11115 -33852 -47527 -36410 -19045 -18738 -42451 -35049
5872c5049m346J1315L0J0529L186J3071K788k592N206j4073j2092K4058J4383
$$ -35049 -39395 -28080 -28050 -17521 -14335 -1264 1524 -1068 4138 -9935 -22027 2031 16414
5859A6414o195K2692J0495q027l1730j6475K1733J7603q040O21l038n259k5503
$$ 16414 10219 32911 43406 35379 3649 -12826 8907 26510 18470 19091 16053 10794 -14709
5846a4709J7077J3491m109o300j926l208l689j6793P600m148O544M034K144J6033
$$ -14709 2368 15859 11750 5450 3524 316 -3373 -20166 -12566 -16714 -10170 -6136 -3992 12041
5832A2041R865k0134r756j1994j3916K4399J0254Q085j2453m73o225J184L352
$$ 12041 21906 1772 -7984 -19978 -33894 -9495 759 8844 -3609 -4082 -10307 -9123 -5771
5819e771O497r838N839L253k4345L541N377L796J3639j2651J5646J8366K2643
$$ -5771 726 -9112 -3273 -20 -24365 -20824 -15447 -11651 1988 -10663 4983 23349 45992
5806D5992j5248k507k5166k1385k13k324j0740Q270J1156j9275n280L4101K1159
$$ 45992 30744 28237 3071 -18314 -18527 -20851 -31591 -23321 -12165 -31440 -36720 -2619 18540
5793A8540l390j2033o685p020R597O639J1597k072j7311n149k1215j5668j6544
$$ 18540 15150 3117 -3568 -10588 -991 5648 17245 15173 -2138 -7287 -28502 -44170 -60714
5780f0714L1776K3513J7788J5130M991j0515j2260k8414l3733q028M987J906J6208
$$ -60714 -28938 -5425 12363 27493 32484 21969 9709 -18705 -52438 -60466 -55479 -53573 -37365
5767c7365j0382o892K0362J9456J6363K5555J4086j1048q461L237j5971L557m985
$$ -37365 -47747 -54639 -34277 -14821 1542 27097 41183 30135 21674 24911 8940 12497 7512
5754G512J3182n273j4663O188L154o968p904k0235N711j425j2790q81p434L2680
$$ 7512 20694 15421 758 6946 10100 3132 -4772 -25007 -19296 -20721 -33511 -34392 -41826 -9146
5740i146L718M286L0756p300l4882j2559l530n717K5203O155K0j965r665m112
$$ -9146 -5428 -1142 29614 22314 -12568 -25127 -28657 -34374 -9171 -3016 -2996 -4961 -14626 -18738
5726a8738J5822J2745k298j0259Q591j0395l5319m242R119J189K8919k99m196
$$ -18738 -2916 9829 7531 -2728 5863 -4532 -39851 -44093 -34974 -33785 -4866 -5165 -9361
5713i361P464K1611P285k4189l490k7369j8988J2140K4531o864J5994Q152j1204
$$ -9361 -1897 19714 26999 2810 -680 -28049 -47037 -34897 -10366 -17230 -1236 6916 -4288
5700d288o360j290p393J1378l147m100K0615J937j881J6314o977K590l412O929
$$ -4288 -10648 -11938 -19331 -7953 -11100 -15200 5415 7352 5471 21785 14808 17398 13986 20915
5686B0915n88m333p64j7232j823q731k0782J4347Q589J9741j1543R711J003K494
$$ 20915 20327 15994 15230 -2002 -3825 -12556 -33338 -18991 -10402 9339 -2204 7507 8510 11004
5672A1004L023j903k0930k9122O173M0632m650j9661K1681o497l748J7327o97
$$ 11004 14027 12124 -8806 -37928 -31755 8877 4227 -15434 6247 -250 -3998 13329 12632
5659A2632k2326j314m061k632Q419j3034J1442J232k162M423J6683J592r889l504
$$ 12632 -9694 -11008 -15069 -17701 -9282 -22316 -10874 -9642 -11804 -7381 9302 10894 1005 -2499
5645b499R058j8548k4200m028K582q6L921J5425K7793K493j0210j0547K769j5738
$$ -2499 6559 -11989 -36189 -40217 -37635 -37721 -33800 -18375 9418 11911 1701 -8846 -6077 -21815
5631b1815J5176q807j3807J3740Q505j416r322j2442J2339K3933p942o609l710
$$ -21815 -6639 -15446 -29253 -15513 -7008 -8424 -17746 -30188 -17849 6084 -1858 -8467 -12177
5618a2177k0143J2046L4705j8257p207N302K8616k5562l0598P253K4708J6717
$$ -12177 -32320 -20274 14431 -3826 -11033 -5731 22885 -2677 -33275 -26022 -1314 15403
5606A5403K4310J1776n591j0820k5230j7371j5245N193J1660J4626Q010l612j9972
$$ 15403 39713 51489 45898 35078 9848 -7523 -22768 -17575 -5915 8711 16721 13109 -6863
5593f863l926p196j3453K881k0989O793J7765q195k130L691P218J065L386j7657
$$ -6863 -10789 -17985 -31438 -28557 -49546 -42753 -24988 -33183 -35313 -31622 -24404 -23339 -19953 -37610
5579c7610r392K4212K005N982j2494J3713J2033o729J3029K8795q775k9717k1196
$$ -37610 -47002 -22790 -20785 -14803 -27297 -13584 -1551 -8280 4749 33544 24769 -4948 -26144
5566b6144r73j0240j0221J9417J8327K0438J867l0959j8065J1011o453n714O840
$$ -26144 -27117 -37357 -47578 -28161 -9834 10604 12471 -18488 -36553 -25542 -31995 -37709 -30869
5553c0869J8757J0495J0915l410M74j0067J8298l04n066k4287k8689k9115o715
$$ -30869 -12112 -1617 9298 5888 6362 -3705 14593 14289 9223 -15064 -43753 -72868 -79583
5540g9583L329J6639J4846O418K4107J5688J8954M105n693j5592R717K670j7070
$$ -79583 -76254 -59615 -44769 -38351 -14244 1444 20398 24503 18810 3218 12935 15605 -1465
5527a465k0021P459R121m609R738J2354j7893o326l250j8267n377J6173P875Q800
$$ -1465 -21486 -14027 -4906 -9515 223 12577 -5316 -11642 -14892 -33159 -38536 -22363 -14488 -5688
5513e688J3272L49l568j7790j4884j1514K2660M184L0526J4206k2178k9682n265
$$ -5688 7584 7933 4365 -13425 -28309 -39823 -17163 -12979 17547 31753 9575 -20107 -25372
5500b5372j9176p422J0913K3888j7452J7405j9500j3592q015J3494J5498j1239
$$ -25372 -44548 -51970 -41057 -17169 -34621 -17216 -36716 -50308 -58323 -44829 -29331 -40570
5488d0570j2603K4805N207j5386K1545K0963J0086j0584m721n863j9078j967o085
$$ -40570 -53173 -28368 -23161 -38547 -17002 3961 14047 3463 -1258 -7121 -26199 -28166 -34251
5475c4251L39M176J6707j9601m3669L0000M0322K3691K163J0315k0704q864M477
$$ -34251 -33912 -29736 -13029 -32630 -76299 -46299 -5977 17714 19877 30192 9488 624 5101
5462E101R209j0648k4332K2842K2732k710l752j9061k0361j3016J1359K7135o398
$$ 5101 14310 3662 -20670 2172 24904 22194 18442 -619 -20980 -33996 -22637 4498 -1900
5449a900N796K946r955O562k198j8723k2711Q781K057P923k1080l0148J79K8199
$$ -1900 3896 6842 -3113 3449 1251 -17472 -40183 -31402 -29345 -21422 -42502 -72650 -72471 -44272
5435d4272j904J58J9476M649O482O478K204k6781J5157J1961k3832k4442Q45M6243
$$ -44272 -46176 -46018 -26542 -21893 -15411 -8933 -6729 -33510 -18353 -6392 -30224 -54666 -53821 -7578
5421g578J4729J5579l491k9292j3802j1333J876Q557n057J6567M068K7820p247
$$ -7578 7151 22730 19239 -10053 -23855 -35188 -33312 -24755 -29812 -13245 -9177 18643 11396
5408A1396j7071j1343K7627J9848J706k1160o830L015J7280o345j4785k604j7258
$$ 11396 -5675 -17018 10609 30457 32163 11003 4173 7188 24468 18123 3338 734 -16524
5395a6524l5526l218M1439R219j5287j5383J8239J1567O159j2527M668K3067k917
$$ -16524 -52050 -55268 -13829 -4610 -19897 -35280 -17041 -5474 685 -11842 -7174 15893 12976
5382A2976j0050l027l244Q359K102Q550P050J0804l8312j862M499O558L0663R435
$$ 12976 2926 -101 -3345 5014 7116 15666 22716 33520 -4792 -6654 -2155 4403 35066 44501
5368D4501j9405j4249J8317K919p952j9167m567k520j765j016l500j5671q738
$$ 44501 25096 10847 29164 32083 24131 4964 397 -2123 -3888 -4904 -8404 -24075 -32813
5355c2813r186k138Q44K0598j0881j85J953j9216K101K1152J4742l356j03j518
$$ -32813 -41999 -44137 -43293 -22695 -33576 -33761 -31808 -51024 -48923 -27771 -13029 -16385 -16488 -18006
5341a8006L32j0632R471J4342j0290J3572N046K7420q262j8943L226P011j8119
$$ -18006 -17674 -28306 -18835 -4493 -14783 -1211 3835 31255 22993 4050 7276 14287 -3832
5328c832p081j3211K235o4K2967J642j588l909O188j2290k4802m448n390J9306
$$ -3832 -10913 -24124 -21889 -21953 1014 2656 1068 -2841 3347 -8943 -33745 -38193 -43583 -24277
5314b4277J0597j4175j2001Q817m722J9924O476j0426p878k0884j4001K3562K4159
$$ -24277 -13680 -27855 -39856 -31039 -35761 -15837 -9361 -19787 -27665 -48549 -62550 -38988 -14829
5301a4829j5170m720K1789P221k143K3034L0291P874m9622l0403p127k936n57
$$ -14829 -29999 -34719 -12930 -5709 -7852 15182 45473 53347 3725 -26678 -33805 -36741 -37298
5288c7298k283J2531J0921J4529O259K72q913J1857J8073m471j0289J8266r199
$$ -37298 -39581 -27050 -16129 -1600 4659 4931 -3982 7875 25948 21477 11188 29454 20255
5275B0255j0717pk1786L142j0282j5840L9009L881q235K0539j2133J1776k6410
$$ 20255 9538 9531 -12255 -9113 -19395 -35235 3774 7655 -580 19959 7826 19602 -6808
5262f808j5386j1785J576K407K8909K1756K2738j0156N432m421q231p709J6262
$$ -6808 -22194 -33979 -32403 -29996 -1087 20669 43407 33251 38683 34262 26031 18322 34584
5249C4584Q808k969M305j25Q792N602k2812k9613R965o069J4522p439O443R221
$$ 34584 43392 40423 44728 44603 53395 58997 36185 6572 16537 10468 24990 17551 23994 33215
5235C3215J4444K311j3732j1359j9809L882m955l745K2870J1576j3920q993n51
$$ 33215 47659 49970 36238 24879 5070 8952 3997 252 23122 34698 20778 11785 11234
5222A1234J416m981r591j1244K6361J8907l567k5543N316K5222K394j3121j1119
$$ 11234 12650 7669 -1922 -13166 13195 32102 28535 2992 8308 33530 35924 22803 11684
5209A1684O652q901j5561k9262k133L8190j2483j9265o215k748K3286K1564J9570
$$ 11684 18336 9435 -6126 -35388 -37521 669 -11814 -31079 -37294 -40042 -16756 4808 24378
5196B4378j3897K989J6208L921l4250m7253L5617M2056q429k2181J2213R727J1199
$$ 24378 10481 13470 29678 33599 -651 -47904 -12287 29769 21340 -841 11372 21099 32298
5183C2298j3274k1257k3922j6702L8765L0814j5885j4217N578J8189K8755M148
$$ 32298 19024 -2233 -26155 -42857 -4092 26722 10837 -3380 2198 20387 49142 53290
5171E3290l0421q539k4751J398J1741O201k9182l6265l90K4047K2378J0702L84
$$ 53290 22869 14330 -10421 -9023 2718 8919 -20263 -56528 -56918 -32871 -10493 209 593
5158E93J5655p851o965j0621J0814L7396J4522o697j5330j8585j1438Q415K6871
$$ 593 16248 8397 1432 -9189 1625 39021 53543 46846 31516 12931 1493 9908 36779
5145C6779k4945k9825k8200n522J7756Q592K3323L4398l7041j7718J3638L6264
$$ 36779 11834 -17991 -46191 -51713 -33957 -25365 -2042 32356 -4685 -22403 -8765 27499
5133B7499J6142j1966k378J2947K669k5107m0544k81J11L689J5546O566j0722
$$ 27499 43641 31675 29297 42244 44913 19806 -20738 -21019 -20908 -17219 -1673 4893 -5829
5120e829o80M044J6511p087j1122j7747m397j7599J2992K4488N495L02L81m798
$$ -5829 -6509 -2465 14046 6959 -4163 -21910 -26307 -43906 -30914 -6426 -931 -629 -248 -5046
5106e046j2467n168L00J0723j8010j8696K5226n55k1554J9305K8684k1113p602
$$ -5046 -17513 -22681 -22381 -11658 -29668 -48364 -23138 -23693 -45247 -25942 2742 -18371 -25973
5093b5973j9281j2005J83Q813P777J1572L8312k3771k558P225j9642l9490q536
$$ -25973 -45254 -57259 -57076 -48263 -40486 -28914 9398 -14373 -16931 -9706 -29348 -68838 -77374
5080g7374K2161L3638K9206l00J118J651J4369l8251l1959j0280K933N577p186
$$ -77374 -55213 -21575 7631 7331 8449 10100 24469 -13782 -45741 -56021 -53088 -47511 -54697
5067e4697o344K8621P897j0405J7483K4296m517j9286K1686J7997q86Q607j0005
$$ -54697 -61041 -32420 -24523 -34928 -17445 6851 2334 -16952 4734 22731 21845 30452 20447
5054B0447k5550j0373K0108J5072o381m4210j1533k0419j9430R860R534J927L0749
$$ 20447 -5103 -15476 4632 19704 13323 -30887 -42420 -62839 -82269 -72409 -62875 -60948 -30199
5041c0199J3683J125k0214m970J467K0816K3613L421p959n551j5360k1948p448
$$ -30199 -16516 -15391 -35605 -40575 -39108 -18292 5321 8742 783 -4768 -20128 -42076 -49524
5028d9524j6785r368J6880L0954M906n50J2974L4606J8177K0907j1871k9287l6118
$$ -49524 -66309 -75677 -58797 -27843 -22937 -23487 -10513 24093 42270 63177 51306 22019 -14099
5015a4099r8K0872j4911q696r389K8279J6438p021k1155j3955J592K386j9920
$$ -14099 -14197 6675 -8236 -16932 -26321 1958 18396 11375 -9780 -23735 -22143 -19757 -39677
5002c9677J7235m275L615J8203J3703l1895N732K9547P364j1976q424l621k786
$$ -39677 -22442 -26717 -23102 -4899 8804 -23091 -17359 12188 19552 7576 -848 -4469 -7255
4989g255J2553J2545j2050l121J4104J5192P388j2805k330P496r112j3542j9832
$$ -7255 5298 17843 5793 2672 16776 31968 39356 26551 24221 31717 22605 9063 -10769
4976a0769o370o453r387J8582P799j8682j338o748m012K1807L7492J7877j2517
$$ -10769 -17139 -23592 -32979 -14397 -6598 -25280 -26618 -33366 -37378 -15571 21921 39798 27281
4963B7281m2007j9555o02K031k2619K0272L0796J6733L1234o561n69o121j1985
$$ 27281 -14726 -34281 -34883 -32852 -55471 -35199 -4403 12330 43564 37003 36434 30313 18328
4950A8328k1052k6854J7608K078R291K148M505q207L127N628J6279J2383k0642
$$ 18328 -2724 -29578 -11970 -9892 -601 1547 6052 -2155 972 6600 22879 35262 14620
4937A4620m5340j1956K1497o468j8798K5742J8820r582k9456q363J5875O378j2865
$$ 14620 -30720 -42676 -21179 -27647 -46445 -20703 -1883 -11465 -40921 -49284 -33409 -27031 -39896
4924c9896q664J3686J6298O0213O187k0147k703N798j9758j0323O089J6107N836
$$ -39896 -48560 -34874 -18576 41637 47824 27677 24974 30772 11014 691 6780 22887 28723
4911B8723k9199o367J7370J5987J111p715k501q231k0461k5438j141K1734L6827
$$ 28723 -476 -6843 10527 26514 27625 19910 17409 9178 -11283 -36721 -37862 -16128 20699
4898B0699P748j6895L464K82j7705K4243J8643k3931M152j1041p472O629q486
$$ 20699 28447 11552 15016 15298 -2407 21836 40479 16548 20700 9659 2187 8816 330
4885C30K0700J5274j7329k8344l0887M570R897j2822k2073R126J6652r08J6347
$$ 330 21030 36304 18975 -9369 -40256 -35686 -25789 -38611 -60684 -51558 -34906 -35814 -19467
4872a9467j136j0013N849J4513j6504k7394j4214J3740J8256J2466P554J0721
$$ -19467 -20603 -30616 -24767 -10254 -26758 -54152 -68366 -54626 -36370 -23904 -16350 -5629
4860e629j09j7576j8328J2409J4612n191J1553k589L143M1043k551k7811J9827
$$ -5629 -5738 -23314 -41642 -29233 -14621 -19812 -8259 -10848 -7705 33338 30787 2976 22803
4847B2803p797j6318q259o310j7422K5593N1314k2542m928j3710r486j0355J8790
$$ 22803 15006 -1312 -9571 -15881 -33303 -7710 43604 21062 16134 2424 -7062 -17417 1373
4834A373M673j5850J515J9251j173j7104J0552j1402L754q359j3736Q631p022
$$ 1373 6046 -9804 -8289 10962 9789 -7315 3237 -8165 -4411 -12770 -26506 -17875 -24897
4821b4897O713J6120L5959m153j2392L1j2929J0128P732K6750j8371l0054j4771
$$ -24897 -18184 -2064 33895 29742 17350 17381 4452 14580 22312 49062 30691 637 -14134
4808a4134Q169n363J8812k8828j3345J0764M871m698k0434q98j639J5687M719
$$ -14134 -5965 -11328 7484 -21344 -34689 -23925 -19054 -23752 -44186 -45084 -46723 -31036 -26317
4795b6317Q736J1120K2840K3509p199j7472m188Q334n014R798R88P680R50j2478
$$ -26317 -17581 -6461 16379 39888 32689 15217 11029 19363 14349 24147 25135 32815 33765 21287
4781B1287k2897r924q995j947J8018P320j0633L811j4092J1201K6988r604J5593
$$ 21287 -1610 -11534 -20529 -22476 -4458 2862 -7771 -3960 -18052 -6851 20137 10533 26126
4768B6126n323Q651J2454j2440n616j6816M008J0734o162R866j1663N192R66L0551
$$ 26126 20803 29454 41908 29468 23852 7036 11044 21778 15616 25482 13819 19011 19977 50528
4754E0528r954m0370L181q990J5262J6480k9924m486K7679q720k8983o719J0829
$$ 50528 40574 204 3385 -5605 9657 26137 -3787 -8273 19406 10686 -18297 -25016 -14187
4741a4187p587j2722K8732J7190o598M06J3435k055r581p869j6181j2881J2608
$$ -14187 -21774 -34496 -5764 11426 4828 5234 18669 16614 7033 -836 -17017 -29898 -17290
4728a7290j2858l110R24n555k961P756O338L7496J0420j7003l57n732J0981J0849
$$ -17290 -30148 -33258 -32334 -37889 -40850 -33094 -26756 10740 21160 4157 3800 -1932 9049 19898
4714A9898P94Q666l811J17k0333j9968l0745J6446J3712q976Q210K7088k88J1857
$$ 19898 20692 29358 25547 25664 5331 -14637 -45382 -28936 -15224 -24200 -15990 11098 10810 22667
4700B2667q292j7930j5683j0583L848K0108j2430J2389K5864j116j1192J1640
$$ 22667 14375 -3555 -19238 -29821 -25973 -5865 -18295 -5906 19958 18842 7650 19290
4688A9290l63j73j9315j6046j0013M009L0719Q165K2115J1931k5318k9030m875
$$ 19290 18927 18754 -561 -16607 -26620 -22611 8108 16273 38388 50319 25001 -4029 -8904
4675h904o592p206J5391J6878L049j9436j8595K8885k2645l0187J6306m582N372
$$ -8904 -15496 -22702 -7311 9567 12616 -6820 -25415 3470 -19175 -49362 -33056 -37638 -32266
4662c2266M1736R446O823J5818l0716m1606q51M280L2228K6835j6370j7515O583
$$ -32266 9470 18916 25739 41557 10841 -30765 -31616 -27336 4892 31727 15357 -2158 4425
4649D425R805R6l2484m03L1822k2798j4659p510J8650j731k602J0340J1509k1790
$$ 4425 14230 14326 -18158 -18561 13261 -9537 -24196 -31706 -13056 -14787 -17389 -7049 4460 -17330
4635a7330k4410j7661O078P829L1299P788J9612j5419P581M644j2589j1956J5336
$$ -17330 -41740 -59401 -53323 -45494 -14195 -6407 13205 -2214 5367 10011 -2578 -14534 802
4622H02J8018R907j6656k4406p500J9847J4801P679j7148l843k0943j46l144J0947
$$ 802 18820 28727 12071 -12335 -19835 12 14813 22492 5344 1501 -19442 -19588 -22732 -11785
4608a1785p626J6313K4104J6720K6870j313k5050p982k8549r757j9375L581J0328
$$ -11785 -19411 -3098 21006 37726 64596 63283 38233 30251 1702 -8055 -27430 -23849 -13521
4595a3521N064j1515j6537n796J7776L7641L2132j479j7843l845j708m826M653
$$ -13521 -8457 -19972 -36509 -42305 -24529 13112 45244 43765 25922 22077 20369 15543 20196
4582B0196l194k0334m71R807Q205n820q822O327L933M337K82r40J2557m864k8680
$$ 20196 17002 -3332 -3803 6004 14209 8389 -433 5894 9827 14164 14446 13506 26063 21199 -7481
4567g481k2931K1386R949O224k914m300j091K0485K085j9536J859O881P072j060
$$ -7481 -30412 -9026 923 7147 4233 -67 -1158 19327 21412 1876 3735 10616 17688 16628
4553A6628O822p042k6589k2674o163K6017P1l197K078J9629j2711k2010K6585
$$ 16628 23450 16408 -10181 -32855 -39018 -13001 -12930 -16127 -14049 5580 -7131 -29141 -2556
4540b556q048N222Q357R74N28J6949J310p238k3095J1401J8245k384j1812k0939
$$ -2556 -10604 -5382 2975 3949 4477 21426 22736 15498 -7597 3804 22049 19665 7853 -13086
4526a3086J3912K5493j3508k0591l0798j3412K0249J0146K685r352J7064N927
$$ -13086 826 26319 12811 -7780 -38578 -51990 -31741 -21595 -18910 -28262 -11198 -5271
4514e271J0558j8999j836k6759J0942J5884J9265p38k989j7618p385Q393J1804
$$ -5271 5287 -13712 -15548 -42307 -31365 -15481 3784 3046 57 -17561 -24946 -16553 -4749
4501d749L117j988j1987j0433p023J3765J3758O945L2698K2117j9020j8288k5071
$$ -4749 -1632 -3620 -15607 -26040 -33063 -19298 -5540 1405 34103 56220 37200 18912 -6159
4488f159k6726J0472K708j7264j7318l545K5069q890K2764j2158k284L5894K5030
$$ -6159 -32885 -22413 -19705 -36969 -54287 -57832 -32763 -41653 -18889 -31047 -33331 2563 27593
4475B7593j0944m354J905K6862p407o3905J9411L6663J1876o961l2573J6952J0214
$$ 27593 16649 12295 14200 41062 33655 -30250 -10839 25824 37700 30739 -1834 15118 25332
4462B5332r508k0109l110N290l3280J363P422L6440p713j6268J2854J8951j663
$$ 25332 15824 -4285 -7395 -2105 -35385 -34022 -26600 9840 2127 -14141 -1287 17664 16001
4449A6001k945R4J5513k0613L920J1904K3851l8002Q02l83J0713Q105M014N199
$$ 16001 13056 13150 28663 8050 11970 23874 47725 9723 10525 10142 20855 28960 32974 38173
4435C8173j6677Q676k0708j3006R202k3402o939K3665q730o798O56Q177o357J75
$$ 38173 21496 30172 9464 -3542 5660 -17742 -24681 -1016 -9746 -16544 -15888 -7711 -14068 -13893
4421a3893K5146J646j3636k4996j2971M648k4693n729j7774K4378J3723k0485
$$ -13893 11253 12899 -737 -25733 -38704 -34056 -58749 -64478 -82252 -57874 -44151 -64636
4409f4636K300J3012J3117r435K2479K7372K931J6468j6583j8160r596R529K3697
$$ -64636 -62336 -49324 -36207 -45642 -23163 4209 7140 23608 7025 -11135 -20731 -11202 12495
4396A2495j8318k0219J5575J0861J4571j8782n230J2434k1882N439O454o081L8777
$$ 12495 -5823 -26042 -10467 394 14965 -3817 -9047 3387 -18495 -13056 -6602 -12683 26094
4383B6094J3881K562k5281k2152k793j6601O885j508q378K505N692m410j9417
$$ 26094 39975 42537 17256 -4896 -7689 -24290 -17405 -18913 -27291 -24786 -19094 -23504 -42921
4370d2921k0501j505J1119k585P350K2482K5380j8352q172N522j1199P705Q853
$$ -42921 -63422 -64927 -53808 -56393 -49043 -26561 -1181 -19533 -27705 -22183 -33382 -25677 -16824
4357a6824K670J6809L997J362M605j5326j0634J5034J4504k7227j9321q827R401
$$ -16824 -14154 2655 6652 8014 12619 -2707 -13341 1693 16197 -11030 -30351 -39178 -29777
4344b9777m18K4966L795L331Q997p565M422j3740j2020j8419p713J6168J0645
$$ -29777 -30195 -5229 -1434 1897 10894 3329 7751 -5989 -18009 -36428 -44141 -27973 -17328
4331a7328N522j1141k8721K8771J1881O4k9008K256J0179l874L341P495j1666
$$ -17328 -11806 -22947 -51668 -22897 -11016 -10952 -39960 -37704 -27525 -31399 -28058 -20563 -32229
4318c2229O749K4960j2650l6182J5009K0955J769k709K2124j2460n478K128L017
$$ -32229 -25480 -520 -13170 -49352 -34343 -13388 -11619 -14328 7796 -4664 -10142 -8014 -4997
4305d997j505J0431K9849K5676j3211r650O196K377N920k9251m5787p133M4345
$$ -4997 -6502 3929 33778 59454 46243 36593 42789 45166 51086 21835 -23952 -31085 13260
4292A3260J0064k4709r682p886m391N147J7765L120M537j9713o697m48j4264K3300
$$ 13260 23324 -1385 -11067 -18953 -23344 -18197 -432 2688 7225 -12488 -19185 -19633 -33897 -10597
4278a0597j982n085J2962L4010M842R943l065k4038M197j8283q12N643K3314o355
$$ -10597 -12579 -17664 -4702 29308 34150 44093 41028 16990 21187 2904 2092 7735 31049 24694
$$ [...]
##END NTUPLES=NMR SPECTRUM
##END=
