##TITLE=Analysis number 327799
Compound Code cc 62801
Book Reference 518/95
Project Code adrs
Chemist Name colinb
##JCAMPDX= 6.0         $$ Bruker NMR JCAMP-DX V2.0
##DATA TYPE= NMR SPECTRUM
##DATA CLASS= NTUPLES
##ORIGIN= Bruker BioSpin GmbH
##OWNER= nmr
$$ XWIN-NMR		Version 3.5
$$ Tue Apr 10 12:38:53 2007 GMT Daylight Time (UT+1h)  MAYBRIDGE\nmr@NMR_250MHZ
##.OBSERVE FREQUENCY= 250.131544655141
##.OBSERVE NUCLEUS= ^1H
##.ACQUISITION MODE= SIMULTANEOUS (DQD)
##.ACQUISITION SCHEME= undefined
##.AVERAGES= 16
##.DIGITISER RES= 18
##SPECTROMETER/DATA SYSTEM= dpx250
##.PULSE SEQUENCE= zg30
##.SOLVENT NAME= DMSO
##.SHIFT REFERENCE= (INTERNAL, DMSO, 0, 16.522)
##AUDIT TRAIL= $$ (NUMBER, WHEN, WHO, WHERE, WHAT)
$$ ##TITLE= Audit trail, XWIN-NMR		Version 3.5
$$ ##JCAMPDX= 5.01
$$ ##ORIGIN= Bruker BioSpin GmbH
$$ ##OWNER= nmr
$$ C:\u/data/dgb/nmr/ADRS/820/pdata/1/auditp.txt
$$ ##AUDIT TRAIL=  $$ (NUMBER, WHEN, WHO, WHERE, WHAT)
(   1,<2007-04-10 12:38:15.37 +100>,<MAYBRIDGE\nmr>,<NMR_250MHZ>,
      <created by zg, POWCHK disabled, PULCHK disabled
       configuration hash MD5:
       49 4B E0 1D 92 C2 6B 37 9F E6 65 BC 52 41 86 1D
       data hash MD5: 64K
       89 C6 44 B9 51 29 65 35 DB 0C 22 D3 0B 06 92 D8>)
(   2,<2007-04-10 12:38:35.48 +100>,<MAYBRIDGE\nmr>,<NMR_250MHZ>,
      <Start of raw data processing
       ef LB = 0.3 FT_mod = 6 PKNL = 1 SI = 32K 
       data hash MD5: 32K
       19 2C 77 0F 06 0F E3 88 30 AD C6 69 B5 BB 02 AD>)
(   3,<2007-04-10 12:38:40.03 +100>,<MAYBRIDGE\nmr>,<NMR_250MHZ>,
      <apk 
       data hash MD5: 32K
       8F 16 12 12 E2 B6 7B 87 ED 6E 16 2F EE 2A 08 33>)
(   4,<2007-04-10 12:38:41.56 +100>,<MAYBRIDGE\nmr>,<NMR_250MHZ>,
      <abs ABSG = 5 
       data hash MD5: 32K
       0B AD B8 56 B9 F9 6B 7D BD 1F C1 29 47 0E 69 A1>)
$$ ##END=
$$ 
$$ hash MD5
$$ 6E D5 29 83 7F 2B 84 93 E8 DF C0 80 AC D3 AD F5
##$RELAX= 
##$RELAX= 
##$RELAX= 
##$RELAX= 
##$RELAX= 
##$RELAX= 
##$RELAX= 
$$ Bruker specific parameters
$$ --------------------------
##$DU= <C:\u>
##$EXPNO= 820
##$NAME= <ADRS>
##$PROCNO= 1
##$TYPE= <nmr>
##$USER= <dgb>
##$AMP= (0..31)
100 100 100 100 100 100 100 100 100 100 100 100 100 100 100 100 100 100 
100 100 100 100 100 100 100 100 100 100 100 100 100 100 
##$AQSEQ= 0
##$AQ_mod= 3
##$AUNM= <au_zg>
##$AUTOPOS= <27 >
##$BF1= 250.13
##$BF2= 250.13
##$BF3= 250.13
##$BF4= 250.13
##$BF5= 500.13
##$BF6= 500.13
##$BF7= 500.13
##$BF8= 500.13
##$BYTORDA= 1
##$CFDGTYP= 0
##$CFRGTYP= 5
##$CHEMSTR= <none>
##$CNST= (0..31)
1 1 145 1 1 1 1 1 1 1 1 1 1 1 1 1 1 1 1 1 1 1 1 1 1 1 1 1 1 1 1 1 
##$CPDPRG= <>
##$CPDPRG1= <>
##$CPDPRG2= <>
##$CPDPRG3= <>
##$CPDPRG4= <mlev>
##$CPDPRG5= <mlev>
##$CPDPRG6= <mlev>
##$CPDPRG7= <mlev>
##$CPDPRG8= <mlev>
##$CPDPRGB= <>
##$CPDPRGT= <>
##$D= (0..31)
0 1 0 0 0 0 0 0 0 0.06 0 0 0 0 0 0 0.0002 0 0 0 0 0 0 0 0 0 0 0 0 0 0 
0 
##$DATE= 1176205092
##$DBL= (0..7)
120 120 120 120 120 120 120 120 
##$DBP= (0..7)
150 150 150 150 150 150 150 150 
##$DBP07= 0
##$DBPNAM0= <>
##$DBPNAM1= <>
$$ [...]
##$SUBNAM6= <"">
##$SUBNAM7= <"">
##$SUBNAM8= <"">
##$SUBNAM9= <"">
##$SW= 20.6930455092707
##$SWIBOX= (0..15)
0 0 3 0 0 0 0 0 0 0 0 0 0 0 0 0 
##$SW_h= 5175.983436853
##$TD= 65536
##$TD0= 1
##$TE= 683.16
##$TE2= 300
##$TE3= 300
##$TEG= 300
##$TL= (0..7)
0 120 120 120 120 120 120 120 
##$TP= (0..7)
150 150 150 150 150 150 150 150 
##$TP07= 0
##$TPNAME0= <>
##$TPNAME1= <>
##$TPNAME2= <>
##$TPNAME3= <>
##$TPNAME4= <>
##$TPNAME5= <>
##$TPNAME6= <>
##$TPNAME7= <>
##$TPOAL= (0..7)
0.5 0.5 0.5 0.5 0.5 0.5 0.5 0.5 
##$TPOFFS= (0..7)
0 0 0 0 0 0 0 0 
##$TUNHIN= 0
##$TUNHOUT= 0
##$TUNXOUT= 0
##$USERA1= <user>
##$USERA2= <user>
##$USERA3= <user>
##$USERA4= <user>
##$USERA5= <user>
##$V9= 5
##$VALIST= <valist>
##$VCLIST= <CCCCCCCCCCCCCCC>
##$VD= 0
##$VDLIST= <DDDDDDDDDDDDDDD>
##$VPLIST= <PPPPPPPPPPPPPPP>
##$VTLIST= <TTTTTTTTTTTTTTT>
##$WBST= 1024
##$WBSW= 4
##$XGAIN= (0..3)
0 0 0 0 
##$XL= 0
##$YL= 0
##$YMAX_a= 317467
##$YMIN_a= -325711
##$ZGOPTNS= <>
##$ZL1= 120
##$ZL2= 120
##$ZL3= 120
##$ZL4= 120
##$ABSF1= 16.522
##$ABSF2= -4.171173
##$ABSG= 5
##$ABSL= 3
##$ALPHA= 0
##$AQORDER= 0
##$ASSFAC= 0
##$ASSFACI= 0
##$ASSFACX= 0
##$ASSWID= 0
##$AUNMP= <proc_1d>
##$AZFE= 0.1
##$AZFW= 0.1
##$BCFW= 0
##$BC_mod= 0
##$BYTORDP= 0
##$COROFFS= 0
##$CY= 12.5
##$DATMOD= 1
##$DC= 0
##$DFILT= <>
##$DTYPP= 0
##$F1P= 14.0000005364418
##$F2P= -0.99999901652339
##$FCOR= 0.5
##$FTSIZE= 32768
##$FT_mod= 6
##$GAMMA= 0
##$GB= 0
##$INTBC= 1
##$INTSCL= 1
##$ISEN= 128
##$LB= 0.3
##$LEV0= 0
##$LPBIN= 0
##$MAXI= 10000
##$MC2= 0
##$MEAN= 0
##$ME_mod= 0
##$MI= 0
##$NCOEF= 0
##$NC_proc= -4
##$NLEV= 6
##$NOISF1= 0
##$NOISF2= 0
##$NSP= 0
##$NTH_PI= 0
##$NZP= 0
##$OFFSET= 16.522
##$PC= 1
##$PHC0= 218.15
##$PHC1= 8.898874
##$PH_mod= 1
##$PKNL= yes
##$PPARMOD= 0
##$PSCAL= 4
##$PSIGN= 0
##$REVERSE= no
##$SF= 250.13
##$SI= 32768
##$SIGF1= 0
##$SIGF2= 0
##$SINO= 400
##$SIOLD= 32768
##$SREGLST= <1H.DMSO>
##$SSB= 0
##$STSI= 32768
##$STSR= 0
##$SW_p= 5175.98343685301
##$SYMM= 0
##$S_DEV= 0
##$TDeff= 65536
##$TDoff= 0
##$TI= <Analysis number 999999
Compound Code 99
Book Reference 9
Project Code 9>
##$TILT= no
##$TM1= 0
##$TM2= 0
##$TOPLEV= 0
##$USERP1= <user>
##$USERP2= <user>
##$USERP3= <user>
##$USERP4= <user>
##$USERP5= <user>
##$WDW= 1
##$XDIM= 32768
##$YMAX_p= 308881225
##$YMIN_p= -213114
$$ End of Bruker specific parameters
$$ ---------------------------------
##NTUPLES= NMR SPECTRUM
##VAR_NAME=  FREQUENCY,     SPECTRUM/REAL,   SPECTRUM/IMAG
##SYMBOL=    X,             R,               I
##VAR_TYPE=  INDEPENDENT,   DEPENDENT,       DEPENDENT
##VAR_FORM=  AFFN,          ASDF,            ASDF
##VAR_DIM=   32768,         32768,           32768
##UNITS=     HZ,            ARBITRARY UNITS, ARBITRARY UNITS
##FACTOR=    0.157963299565203, 1,           1
##FIRST=     4132.6476996994, 0,             0
##LAST=      -1043.33573715361, 0,           0
##MIN=       -1043.33573715361, -213114,     0
##MAX=       4132.6476996994, 308881225,     0
$$ Real data points
##PAGE= N=1
##DATA TABLE= (X++(R..R)), XYDATA
$$ [...]
24604A9179O40Q5216K493l5321m7364j9319l840J12o914l1913j1439N584k1277
$$ 19179 19819 105035 107528 72207 24843 5524 1684 1796 -5118 -37031 -48470 -42886 -64163
24591f4163M7182q169M973o43l8715k4744L9628k5876M3174P9784M3603j207m5177
$$ -64163 -16981 -25150 -20177 -20820 -59535 -84279 -44651 -70527 -27353 52431 96034 94827 49650
24578D9650r951K579J895J1383j2027l6575J5929J4194k1381J9096k2745m9639
$$ 49650 39699 42278 44173 55556 43529 6954 22883 37077 15696 34792 12047 -37592
24566c7592m161J0338L0555K660j4191l2896J1513m4765L3996O5863j7634j6201
$$ -37592 -41753 -31415 -860 1800 -12391 -45287 -33774 -78539 -44543 21320 3686 -12515
24554a2515N2260L908j9561m8546J6289N6129q332r3273l1355K339M353O3136
$$ -12515 39745 43653 24092 -24454 -8165 47964 39632 -53641 -84996 -82657 -78304 -15168
24542a5168N277m3578m4822j6822K3834P7995M6429j4020m0976k788J9165K3635
$$ -15168 -9891 -53469 -98291 -115113 -91279 -13284 33145 19125 -21851 -24639 -5474 18161
24530A8161n1242k164K1800K9023M5529k4336l4396j8100n0529r296q62k6306
$$ 18161 -33081 -35245 -13445 15578 61107 36771 2375 -15725 -66254 -75550 -76412 -102718
24518a02718j5245J467L653L437M0133K6587K7215J0626n5661m2498L6288J5907
$$ -102718 -117963 -116496 -112843 -109406 -69273 -42686 -15471 -4845 -60506 -103004 -66716 -50809
24506e0809k5442k3299k7039K1771m4457m394L4436N9368K5199K6435k0465M0990
$$ -50809 -76251 -99550 -126589 -104818 -149275 -153669 -119233 -59865 -34666 -8231 -28696 12294
24494A2294m5507p4560j9188N9162O7469N3720l4801o6271n8905N4803J03778
$$ 12294 -33213 -107773 -126961 -67799 -330 53390 18589 -47682 -106587 -51784 51994
24483E1994k4386l2596n3270j0194O7725n55m332m3572K7304P0470p1663n1819
$$ 51994 27608 -4988 -58258 -68452 -727 -1282 -5614 -49186 -21882 48588 -23075 -74894
24471g4894J711J6720L5676L233R3874N7713k0856j5032n6803n5954m5693l9715
$$ -74894 -73183 -56463 -20787 -17554 76320 134033 113177 98145 41342 -14612 -60305 -100020
24459a00020P1868P1584l4749m9673m8221m2478M1198R998o629L5982L2258r171
$$ -100020 -28152 43432 8683 -40990 -89211 -131689 -90491 -80493 -87122 -51140 -18882 -28053
24447b8053J6671L905J1499j8978j4293M388J1361l0379l7283j6924N4812k3435
$$ -28053 -11382 -7477 4022 -14956 -29249 -24861 -13500 -43879 -81162 -98086 -43274 -66709
24435f6709O161J7392m2841J8317N6082M1983L7411p3412l1570O5225J6725k0586
$$ -66709 -60548 -43156 -85997 -67680 -11598 30385 67796 -5616 -37186 28039 44764 24178
24423B4178J6005m0820J322m6335l5295n1937L8831Q0697L9426N97k2416k098
$$ 24178 40183 -637 685 -45650 -80945 -132882 -94051 -13354 26072 26669 4253 2155
24411B155j7563J887L1430j7504k0822k585O908m0605k4649l911K1373Q6507J7667
$$ 2155 -15408 -13521 17909 405 -20417 -23002 -16094 -56699 -81348 -85259 -63886 22621 40288
24398D0288j7438o3915k9955L7112N8815M5655k169j3666J4867j2982j9900O295
$$ 40288 22850 -41065 -71020 -33908 24907 70562 68393 54727 69594 56612 36712 43007
24386D3007k3876p3428j4626K6387N5663N3695m1316k4675q36J1460J164j5743
$$ 43007 19131 -54297 -68923 -42536 13127 66822 25506 831 -5 11455 12619 -3124
24374c124p326l9035j0014O896K0388k331o9972J0503M9196N4839L6870n4608
$$ -3124 -10450 -49485 -59499 -52603 -32215 -34546 -104518 -94015 -44819 10020 46890 -7718
24362g718n2754p740J125M4707l9777j8529k2020M9612J3107M0118K9592J7084
$$ -7718 -60472 -68212 -67087 -22380 -62157 -80686 -102706 -53094 -39987 131 29723 46807
24350D6807j9448k5065j2046k5458k6960n427n991R062m1374p915P161L7931O720
$$ 46807 27359 2294 -9752 -35210 -62170 -67597 -73588 -64526 -105900 -113815 -106654 -68723 -62003
24337f2003n3562l3056K7445N5531O2540m0179r0528j2227j1322k3821o865K5687
$$ -62003 -115565 -148621 -121176 -65645 -3105 -43284 -133812 -146039 -157361 -181182 -188047 -162360
24325a62360M6920j9505J1240N5496K3870o8K5749K6304J0497K7225l9106p833
$$ -162360 -115440 -134945 -123705 -68209 -44339 -44407 -18658 7646 18143 45368 6262 -1571
24313a571J0436j1537M0000J2694R925K6986n4239q4000K6196M2684L079k8384
$$ -1571 8865 -2672 37328 50022 59947 86933 32694 -51306 -25110 17574 20653 -7731
24301g731k9409p0536j784K2125K1718N2351N071m522q900n8660n0710p02N0976
$$ -7731 -37140 -107676 -109460 -87335 -65617 -13266 -8195 -12717 -21617 -80277 -130987 -131689 -80713
24288h0713K7026j7980k5869j1083J1267j874K5862l6945K6725J5622j6777L28
$$ -80713 -53687 -71667 -97536 -108619 -97352 -99226 -73364 -110309 -83584 -67962 -84739 -84411
24276h4411R4503k7752j5637k8402o4788k0127P4020K0990O724j6184R2145l5120
$$ -84411 10092 -17660 -33297 -61699 -126487 -146614 -72594 -51604 -44880 -61064 31081 -4039
24264d039J2270L7990p755j3458m6301k3876j5208J3469K9075J0275M172K0462
$$ -4039 8231 46221 38466 25008 -21293 -45169 -60377 -46908 -17833 -7558 -3386 17076
24252A7076j009k1580m6316j9077L4401J9930K3107J8453J0630l7911p8567J1688
$$ 17076 16067 -5513 -51829 -70906 -36505 -16575 6532 24985 35615 -2296 -80863 -69175
24240f9175L573L2895L9037J422L0165J8700q318J9265K9518j5091l9795Q766
$$ -69175 -65602 -32707 6330 7752 37917 56617 48299 67564 97082 81991 42196 50962
24228E0962o0745j8351l6502M143N8932O8855M3032p3209o4276l2674Q9013L6715
$$ 50962 -9783 -28134 -64636 -60493 -1561 67294 110326 37117 -27159 -59833 29180 65895
24216F5895k0817k9381m5236J3391L2083k7849q9400m3101j5213L0890L7929q224
$$ 65895 45078 15697 -29539 -16148 15935 -11914 -101314 -144415 -159628 -128738 -90809 -99033
24204i9033K4708P2305L4374J912J158Q72k1217k5063j8940K9775K7453Q32n6056
$$ -99033 -74325 -2020 32354 34266 35424 36296 15079 -9984 -28924 851 28304 29136 -26920
24191b6920m757j8205J7329Q3088O2544m7006k9649K8395N9421o1089o5268l5845
$$ -26920 -31677 -49882 -32553 50535 113079 66073 36424 64819 124240 63151 -2117 -37962
24179c7962j9652m0050N8250K6892m8166K9846N6868L5964N4905L8518K0362N671
$$ -37962 -57614 -97664 -39414 -12522 -60688 -30842 26026 61990 116895 155413 175775 181446
24167A81446r9371r4533k0608O949n8529k9266J6110N800K6743k5015k9932N3139
$$ 181446 82075 -12458 -33066 -26117 -84646 -113912 -97802 -92002 -65259 -90274 -120206 -67067
24155f7067M6632J1228K5573k3584L465K9961m3398J602M5787L1624j275n3934
$$ -67067 -20435 -9207 16366 -7218 -3753 26208 -17190 -15588 30199 61823 60548 6614
24143F614J9358K8605J9092n0554m1080K4040K1233n3160j1829m0644n3302J1649
$$ 6614 25972 54577 73669 23115 -17965 6075 27308 -25852 -37681 -78325 -131627 -119978
24131a19978O4006N2677K5066j1799J4895l1441l7607r361j1291n267p992P6630
$$ -119978 -55972 -3295 21771 9972 24867 -6574 -44181 -53542 -64833 -70100 -78092 -1462
24119a462O9414J0700M4636K3148J6276M996j1093n5407n0832l3169j7990j5705
$$ -1462 67952 78652 123288 146436 162712 167708 156615 101208 50376 17207 -783 -16488
24107a6488m777k334n092n4160m0954J1074Q6753K3876n1987J2233J7762k467
$$ -16488 -21265 -23599 -28691 -82851 -123805 -112731 -25978 -2102 -54089 -41856 -24094 -26561
24095b6561k8568O8780N5090q6041p8560J1436O9365N3879o397J3860p120o9254
$$ -26561 -55129 13651 68741 -17300 -95860 -84424 -15059 38820 32423 46283 39163 -30091
24083c0091k0589m6981j3664O8553O8245R309j4341M918j9559j5160P363R261
$$ -30091 -50680 -97661 -111325 -42772 25473 34782 20441 25359 5800 -9360 -1997 7264
24071G264J1943J910j13L778K2219j9620n6825l5250m8152P490P953o0758j507
$$ 7264 19207 21117 21004 24782 47001 27381 -29444 -64694 -112846 -105356 -97403 -158161 -159668
24058a59668M5161K6008O4491M2183N3519m8552K0854J3712j4026j6954J0020
$$ -159668 -114507 -88499 -24008 18175 71694 23142 43996 57708 43682 26728 36748
24047C6748K0336n571k0849J356k940K5921J9214K950R406J7423n0313n3162k5045
$$ 36748 57084 51513 30664 32020 29080 55001 74215 77165 86571 103994 53681 519 -24526
24034b4526k2753k9363J4315J6275k1669M8158O212N9630n976o2856Q208J9482
$$ -24526 -47279 -76642 -62327 -46052 -67721 -19563 -13351 46279 40303 -22553 -14345 5137
24022E137J9907k4080q0994l4649L4730L3524m170K1890J5945K1615L8384o4778
$$ 5137 25044 964 -80030 -114679 -79949 -46425 -50595 -28705 -12760 8855 47239 -17539
24010a7539p2194K1303P913M1586m4213L201L9916k342J2854l6876L0487O567
$$ -17539 -89733 -68430 -60517 -18931 -63144 -59943 -20027 -22369 -9515 -46391 -15904 -9337
23998i337j9687L7139o774J2092L6016O8066K4770m5466m4660k1199j3723q527
$$ -9337 -29024 8115 1341 13433 49449 117515 142285 96819 52159 30960 17237 8710
23986H710p78l2863m6496j1269L3278O7014j7990l5856m824N3314M8009l0222
$$ 8710 7932 -24931 -71427 -82696 -49418 17596 -394 -36250 -41074 12240 60249 30027
23974C0027k8426L5501j2566j1979K5799K3228l6291m5342k184K711J5153J562
$$ 30027 1601 37102 24536 12557 38356 61584 25293 -20049 -22233 -19522 -4369 -2807
23962b807j8788J5583M6729o526j0338K3444J3817l1735k9669k6127j2251n7K05
$$ -2807 -21595 -6012 40717 34191 23853 47297 61114 29379 -290 -26417 -38668 -38725 -38520
23949c8520n6986N709J660M1218L6001l2492n9933N7425P1034J9350m4968m3059
$$ -38520 -95506 -89797 -88137 -46919 -10918 -43410 -103343 -45918 25116 44466 -502 -43561
23937d3561l429m99l128O4317r148k32j3166k9531L7293k2790l4447K63k7311
$$ -43561 -46990 -47489 -50617 13700 4552 4320 -8846 -38377 -1084 -23874 -58321 -58058 -85369
23924h5369K7861L5867K1761L8496l5196m132J5638j5917J9305l3396l1861j9363
$$ -85369 -57508 -21641 120 38616 3420 -712 14926 -991 18314 -15082 -46943 -66306
23912f6306M882K017P6085P5963o589n2673O907j267j1898m0079P881j872k2775
$$ -66306 -61424 -59407 16678 92641 86052 33379 40286 39019 27121 -12958 -5077 -6949 -29724
23899b9724K9304l6242l6981L752K0462j3429N7000L7734j0904J1351k8293r488
$$ -29724 -420 -36662 -73643 -69891 -49429 -62858 -5858 31876 20972 32323 4030 -5458
23887e458R077R232m1819j5998Q041k4969P6366l2562n276K0578M6538l3113j4244
$$ -5458 3619 12851 -28968 -44966 -36925 -61894 14472 -18090 -23366 -2788 43750 10637 -3607
23874c607J6656r922P49n7835j9782k0782k8915N840M7519J4744O6553O1375l4578
$$ -3607 13049 3127 3876 -53959 -73741 -94523 -123438 -117598 -70079 -55335 11218 72593 38015
23861C8015o5744k5753J2583j3860J5194K2064J1567k8040J3434M3506N207n4099
$$ 38015 -27729 -53482 -40899 -54759 -39565 -17501 -5934 -33974 -20540 22966 28173 -25926
23849b5926l0708Q9909L7742k4759o2799J974Q3106M2021k3723m7768p4172O3394
$$ -25926 -56634 33275 71017 46258 -16541 -14567 68539 110560 86837 39069 -35103 28291
23837B8291K3241k1756p147k9006l1705J6051K8194j4942m449j3359n6529k4406
$$ 28291 51532 29776 22629 -6377 -38082 -22031 6163 -8779 -13228 -26587 -83116 -107522
23825a07522J7797N2107j8027K1047j3798k3426K5560P004O3418L3707j688L0484
$$ -107522 -89725 -37618 -55645 -34598 -48396 -71822 -46262 -39258 24160 57867 56179 86663
23813H6663o124L5571p4348j4956o65o7403R825J3811K3136N364k0192J7899Q979
$$ 86663 80539 116110 41762 26806 26141 -41262 -31437 -17626 5510 10874 -9318 8581 17560
23800A7560J7793J662J6582n2535k0010Q311N6699Q597k9613K6206j0496P065
$$ 17560 35353 37015 53597 1062 -18948 -10637 46062 54659 25046 51252 40756 47821
23788D7821m3509j8543Q102j2381J6510M4791k7223p7332K3306K1504M034Q804
$$ 47821 4312 -14231 -6129 -18510 -2000 42791 15568 -61764 -38458 -16954 -12920 -4116
23776d116k6466o8086k8195M0862Q687m2643m2141O3296N3182j6922L6406K9679
$$ -4116 -30582 -98668 -126863 -86001 -77314 -119957 -162098 -98802 -45620 -62542 -26136 3543
23764C543k3368k2491k800J0188M0726J8815Q6168m336o5630n6445j9811l6747
$$ 3543 -19825 -42316 -45116 -34928 5798 24613 110781 106445 40815 -15630 -35441 -72188
23752g2188L9250O3894nj00053q86O9799J2609m7430J0393N2103n227l6835l5305
$$ -72188 -32938 30956 30951 -69102 -69988 -189 12420 -35010 -24617 27486 22259 -14576 -49881
23739d9881m3800m6780Q4230L7185l9794J9006Q424J3214k3713l0322L3818o405
$$ -49881 -93681 -140461 -56231 -19046 -58840 -39834 -31410 -18196 -41909 -72231 -38413 -44818
23727d4818l6510m6528J3918L7075M4511j7423l7027j1290R966J8980K6150j1525
$$ -44818 -81328 -127856 -113938 -76863 -32352 -49775 -86802 -98092 -88126 -69146 -42996 -54521
23715e4521K9550J0109j9995K8775k3452k1118L039j6291M0014O9161k2133n4524
$$ -54521 -24971 -14862 -34857 -6082 -29534 -50652 -47613 -63904 -23890 45271 23138 -31386
23703c1386k647j9957K2400P1072j6649m0473l3544l0454m6893J4614Q3078L3158
$$ -31386 -34033 -53990 -31590 39482 22833 -17640 -51184 -81638 -128531 -113917 -30839 2319
23691B319O409r314k7077K4250P0263N3754m1651J4831j8219l9447K205j6617
$$ 2319 8728 -586 -27663 -3413 66850 120604 78953 93784 75565 36118 38323 21706
23679B1706n0540l2336j004j7433k6994Q3064K4584n8776l9319J199K3484N6669
$$ 21706 -28834 -61170 -62174 -79607 -106601 -23537 1047 -57729 -97048 -95849 -72365 -15696
23667a5696n243N33K214M9147k3042j5515r40R215k8544l8962J417L5432M5182
$$ -15696 -20939 -20406 -18192 30955 7913 -7602 -8542 673 -27871 -66833 -65416 -29984 15198
23654A5198k3043q3268L5388R1526N5251o8352l9521J1835P5779J7178o1428n963
$$ 15198 -7845 -91113 -55725 35801 91052 22700 -16821 -4986 70793 87971 26543 20580
23642B0580k1229k2072N2194K9268k3087j0248p572l0959m0843k2237j2065K3230
$$ 20580 -649 -22721 29473 58741 35654 25406 17834 -13125 -53968 -76205 -88270 -65040
23630f5040k8989k2624R521R801j5931L4893J08664j7491q1735k1353K6910N074
$$ -65040 -94029 -116653 -107132 -97331 -113262 -78369 30295 12804 -68931 -90284 -63374 -58300
23618e8300r029O646L0327K0318m8805m9656K6810L6228M4866L4458L5349M296
$$ -58300 -67329 -60683 -30356 -10038 -58843 -108499 -81689 -45461 -595 33863 69212 73508
23606G3508j7710k2274j9139Q573l23k1165j6599L576J8693J408k0354m1468P526
$$ 73508 55798 33524 14385 22958 22635 1470 -15129 -11553 7140 8548 -11806 -53274 -45748
23593d5748J5813R901K8593N4214J4373n9095p9894n9099j7442N6509P5844N5574
$$ -45748 -29935 -20034 8559 62773 77146 18051 -61843 -120942 -138384 -81875 -6031 49543
23581D9543K1727j1993K398o976j4187L4714o2802o8076l906O6731O0063l4593
$$ 49543 71270 59277 61675 54699 40512 75226 12424 -55652 -59558 7173 67236 32643
23569C2643Q623j1625o275k0699N1297R896o7274l7074K6020J8237j2206j8236
$$ 32643 41266 29641 23366 2667 53964 63860 -3414 -40488 -14468 3769 -8437 -26673
23557b6673l7506k736L333r90M0649K9376n5937j9586o919p48Q190L1312O7285
$$ -26673 -64179 -66915 -63582 -64572 -23923 5453 -50484 -70070 -76989 -77737 -69547 -38235 29050
23544B9050K0131Q782m7983p0076N0169K1974k8024M2687N3905O5028k6705m2042
$$ 29050 49181 57963 9980 -60096 -9927 12047 -15977 26710 80615 145643 118938 76896
23532G6896n6804p7352n6235K6224K7969O4259L8434L1266j0161m7197m3315j3068
$$ 76896 20092 -57260 -113495 -87271 -59302 4957 43391 74657 64496 17299 -26016 -39084
23520c9084L7183o3638J5822M2435K1364J918m6924k4704M4009L3739j0863j8029
$$ -39084 -1901 -65539 -49717 -7282 14082 16000 -30924 -55628 -11619 22120 11257 -6772
23508f772n1624O714L7586L2714j6770p0521R804J0220R327O5044l403m1159l7630
$$ -6772 -58396 -51682 -14096 18618 1848 -68673 -58869 -48649 -39322 25722 22319 -18840 -56470
23495e6470p364l806K3623K2943l0074N3095K212j1349M5319k4522m2688J7539
$$ -56470 -63834 -67640 -44017 -21074 -51148 1947 4159 -7190 38129 13607 -29081 -11542
23483a1542m2704n7014K288Q909P1729J6036m8122M351M7720j2107j2990m92J9866
$$ -11542 -54246 -111260 -108972 -100063 -28334 -12298 -60420 -56069 -8349 -20456 -33446 -33938 -14072
23470a4072j8635M210N8458N2237K4212n2639l8947j02023k9132P786J7827P3510
$$ -14072 -32707 -28497 29961 82198 106410 53771 14824 -87199 -116331 -108545 -90718 -17208
23458a7208O6129n3315m7526o0189r156J5802L6292L4464J4912K4795m7523l0427
$$ -17208 48921 -4394 -51920 -112109 -121265 -105463 -69171 -34707 -19795 5000 -42523 -72950
23446g2950N3017m413k3534m6640j7478P707K7121L2104M9651K6200n164m841
$$ -72950 -19933 -24346 -47880 -94520 -111998 -104291 -77170 -45066 4585 30785 25621 20780
23434B0780l3446l480M6661k0550n2558l1958L3841o037L0546L4969K6263l861
$$ 20780 -12666 -16146 30515 9965 -42593 -74551 -40710 -46747 -16201 18768 45031 41170
23422D1170J0366k3019j8687l7723L0968r478l7760L8734P3568M974l1425k3657
$$ 41170 51536 28517 9830 -27893 3075 -6403 -44163 -5429 68139 73113 41688 18031
23410A8031n255l40l0056O8337l4694j39449o242K4983J233r356j3828K4007O4837
$$ 18031 12776 12436 -17620 50717 16023 -123426 -129668 -104685 -103452 -112808 -126636 -102629 -37792
23397c7792L1926n6633j4783K5009J2431k2228l5995L4236M8544K3653n537n0425
$$ -37792 -5866 -62499 -77282 -52273 -39842 -62070 -98065 -63829 -15285 8368 2831 -47594
23385d7594q640r302O6831k8901K2979Q747P375k716q089q417J5811m0314j8482
$$ -47594 -56234 -65536 1295 -27606 -4627 4120 11495 8779 690 -7727 8084 -32230 -50712
23372e0712M2235L4125l6486j1870K6461O276J9136r052n5700k64K0141k4070
$$ -50712 -8477 25648 -10838 -22708 3753 10029 29165 20113 -35587 -35851 -15710 -39780
23360c9780j2376O910R815J5479j9349O1019N4502n0663m4240k4930j0862O913
$$ -39780 -52156 -45246 -35431 -19952 -39301 21718 76220 25557 -18683 -43613 -54475 -47562
23348d7562l3796p687L8228j3683j3139L4585r428k9790L7509Q5339J9507L0827
$$ -47562 -81358 -89045 -50817 -64500 -77639 -43054 -52482 -82272 -44763 40576 60083 90910
23336I0910l4120o7470q6597m7084N5779o295J7615O5328O7013K4818k9406m5396
$$ 90910 56790 -10680 -97277 -144361 -88582 -94877 -77262 -11934 55079 79897 50491 5095
23324E095L0732P97l1498M833q045M4746L9999k4247l6276J4587O0471l5283o6476
$$ 5095 35827 36624 5126 9959 1914 46660 86659 62412 26136 40723 101194 65911 -565
23311e65O012O0287L7486q0982o6834J1102N1074M8010J791j2370L480J3663l6636
$$ -565 5447 65734 103220 22238 -44596 -33494 17580 65590 67381 55011 58491 72154 35518
23298C5518n6035J5414J8737R542K8303j2004l3589o2927j1890J3489l0670M5725
$$ 35518 -20517 -5103 13634 23176 51479 39475 5886 -57041 -68931 -55442 -86112 -40387
23286d0387R8530j1678l1504j8684j1699k5463M8706N2521k1516j9293K1111J9936
$$ -40387 58143 46465 14961 -3723 -15422 -40885 7821 60342 38826 19533 40644 60580
23274F0580l3413n2654P0849J2328K434k3827l1919L4719q163o2000j0462o799
$$ 60580 27167 -25487 45362 57690 60124 36297 4378 39097 30934 -31066 -41528 -48327
23262d8327L3540J6431o5956L4059N3952J2330j9147M7846L0018l6389o1259J003
$$ -48327 -14787 1644 -64312 -30253 23699 36029 16882 64728 94746 58357 -2902 -1899
23250a899L1930R217o554k6853M8446n1135j8993M0840Q677L3341J4369k5467
$$ -1899 30031 39248 32694 5841 54287 3152 -15841 24999 33676 67017 81386 55919
23238E5919p38K0612r318o0910m0930k1155P5908n730p0276J7734M1161N837J6416
$$ 55919 55181 75793 66475 5565 -35365 -56520 19388 13658 -56618 -38884 2277 8114 24530
23225B4530k791j0875j4333r036m8294l7197o050J4339L1969j3548J1252J7226
$$ 24530 21739 10864 -3469 -12505 -60799 -97996 -104046 -89707 -57738 -71286 -60034 -42808
23213d2808K9635J6319k7999J9705L2270n3930J9063O3255K1841j7138l3947p9580
$$ -42808 -13173 3146 -24853 -5148 27122 -26808 -7745 55510 77351 60213 26266 -53314
23201e3314k2152M6134K6284k8132j2555K7625M920K0522O0696P536m6208l9549
$$ -53314 -75466 -29332 -3048 -31180 -43735 -16110 -11190 9332 70028 77564 31356 -8193
23189h193j739j4687K7294M0698L3536n8691q1744p031k4002L6701L5601l681
$$ -8193 -9932 -24619 2675 43373 76909 18218 -63526 -70557 -94559 -57858 -22257 -25938
23177b5938O9785O4853m9398n9131p595k5198N2695N5629N1699o5552l2664J3774
$$ -25938 43847 108700 59302 171 -7424 -32622 20073 75702 127401 61849 29185 42959
23165D2959L0375k1843j4526Q6084K7697l1311p0971q5706J2155O9404L9347k9485
$$ 42959 73334 51491 36965 123049 150746 119435 48464 -37242 -25087 44317 83664 54179
23153E4179j6498l4213J0403K5379m2461l6265k4759m1954J8178M4087l0047K336
$$ 54179 37681 3468 13871 39250 -3211 -39476 -64235 -106189 -88011 -43924 -73971 -71635
23141g1635Q6195l1144l5383j6774L0562N5252j9932j1249l9871j0025k7563L5241
$$ -71635 14560 -16584 -51967 -68741 -38179 17073 -2859 -14108 -53979 -64004 -91567 -56326
23129e6326J926J4308j1039M750j2004K6319l2835k161J3948J0103O8135K2703
$$ -56326 -54400 -40092 -51131 -46381 -58385 -32066 -64901 -67062 -53114 -43011 25124 47827
23117D7827r65J1714J5894o5481p8432L4849j304k8215J1684L484L4472j4635
$$ 47827 46862 58576 74470 8989 -69443 -34594 -35898 -64113 -52429 -48945 -14473 -29108
23105b9108K507J7683J0132n7339J4463J6178j098J6329K0960l5146M2772L4905
$$ -29108 -26601 -8918 1214 -56125 -41662 -25484 -26582 -10253 10707 -24439 18333 53238
23093E3238M5813J8927l3759k5020r449o2890m6392p866R323N4216R809m7597
$$ 53238 99051 117978 84219 59199 49750 -13140 -59532 -67398 -58075 -3859 5950 -41647
23081d1647J1421j0612L3867J1370J0841L2016k179k4984p6275m4348J5967L9922
$$ -41647 -30226 -40838 -6971 4399 15240 47256 45077 20093 -56182 -100530 -84563 -44641
23069d4641q146m0385L042N0292N2109N4996n8653n5475j4388P044l3498K4529
$$ -44641 -52787 -93172 -90130 -39838 12271 67267 8614 -46861 -61249 -54205 -87703 -63174
23057f3174P5310O3242j6532j9263l4180j1542l4860j0943K6400j4880j1740J1914
$$ -63174 12136 75378 58846 39583 5403 -6139 -40999 -51942 -25542 -40422 -52162 -40248
23045d0248N6354M4402L7427K1097l3300k1547j4237j7438k3028q966L5752j1563
$$ -40248 16106 60508 97935 119032 85732 64185 49948 32510 9482 516 36268 24705
23033B4705j11444o7443L2134j8884L6764K4735P2997L082k5607N985L8916j1020
$$ 24705 -86739 -154182 -122048 -140932 -104168 -79433 -6436 -3354 -28961 -22976 15940 4920
23021D920M225p909k2665L5921O6516k8227q157J1784K8596m0450J4006O96L050
$$ 4920 9145 1236 -21429 14492 81008 52781 44624 56408 85004 44554 58560 59256 62306
23008F2306l21l1884M513N0841m3589j9718J8819l0603j5184N6794o032p0960
$$ 62306 61985 30101 34614 85455 41866 22148 40967 10364 -4820 51974 45942 -25018
22996b5018M9534J8890l1484m8630J1984j7494K0364J6314m1625k2437j0338j7342
$$ -25018 24516 43406 11922 -36708 -24724 -42218 -21854 -5540 -47165 -69602 -79940 -97282
22984i7282R209p162J0198K1777j2252L3229L1154l1L6701l4717o0413K8211j982
$$ -97282 -88073 -95235 -85037 -63260 -75512 -42283 -11129 -11160 25541 -9176 -69589 -41378 -43360
22971d3360K3776K296p025j3456k0922k770K6673j2023K3940N5067L9661l6205
$$ -43360 -19584 -17288 -24313 -37769 -58691 -61461 -34788 -46811 -22871 32196 71857 35652
22959C5652m5164K672L696k9425l1961m1715n2237M8181N0631J1754K4660O310
$$ 35652 -9512 -6840 -3144 -32569 -64530 -106245 -158482 -110301 -59670 -47916 -23256 -16946
22947a6946k4437L7385J0846m1212Q913p5256P963N8128L8340j2590n0462J09219
$$ -16946 -41383 -3998 6848 -34364 -25451 -100707 -92744 -34616 3724 -8866 -59328 49891
22935D9891o21j7091O8018K937o0640l9574j4504j0029k1203J575N1037K5903
$$ 49891 49270 32179 100197 103134 42494 2920 -11584 -21613 -42816 -41241 9796 35699
22923C5699j4356l5707j8993m6814j6486L1794K6514L5859p826n1577j7277J3139
$$ 35699 21343 -14364 -33357 -80171 -96657 -64863 -38349 -2490 -10316 -61893 -79170 -66031
22911f6031q500R9073J5460k747j3721K353l3968L6490K9384k3459j7816l854
$$ -66031 -74531 24542 40002 37255 23534 25887 -8081 28409 57793 34334 16518 12664
22899A2664m1435k3042L4384J397O982j5711l7899q1966K4062M6657K3800R5023
$$ 12664 -28771 -51813 -17429 -16032 -9050 -24761 -62660 -144626 -120564 -73907 -50107 44916
22887D4916M7574n7497M974o847m4706l2499j6660J4822K7348j5495M3371l311
$$ 44916 92490 34993 39967 33120 -11586 -44085 -60745 -45923 -18575 -34070 9301 5990
22875E990l5011l7236r192L7417L3235K0897J9150n840j2172M4941j0288o5473
$$ 5990 -29021 -66257 -75449 -38032 -4797 16100 35250 29410 17238 62179 51891 -13582
22863a3582K0260J7945k5292j4831M0237P0255M1538m2839n2545r0651k6685k5154
$$ -13582 6678 24623 -669 -15500 24737 94992 136530 93691 41146 -49505 -76190 -101344
22851a01344J0714L6488j1468J241j7337k8372J9677J0063J7201J8803K2927J4239
$$ -101344 -90630 -54142 -65610 -64369 -81706 -110078 -90401 -80338 -63137 -44334 -21407 -7168
22839g168j1414j6187K5983J6179M5910k5260m9186K096j0680l1976O1756K6566
$$ -7168 -18582 -34769 -8786 7393 53303 28043 -21143 -19047 -29727 -61703 53 26619
22827B6619L7572R918n3306n0121j5316K0254K9824j9992N4556Q1297n4376p6318
$$ 26619 64191 74109 20803 -29318 -44634 -24380 5444 -14548 40008 121305 66929 -9389
22815i389k0163L0309M789j7703q934n1657m3653K3134j1657L1654L7217J0961
$$ -9389 -29552 757 5546 -12157 -21091 -72748 -116401 -93267 -104924 -73270 -36053 -25092
22803b5092K7503L4652K6226k3215K9935o2837n46L5942l9116l1845j5989O613
$$ -25092 2411 37063 63289 40074 70009 7172 6626 42568 3452 -28393 -44382 -37769
22791c7769M3408P487m3259m1084N61L8168M978K1551r002R465k2235m8990L0718
$$ -37769 5639 13126 -30133 -71217 -70656 -32488 -27510 -5959 -14961 -5496 -27731 -76721 -46003
22778d6003k3927l4944j5548k4586m581L7842o993m6395P2037L9323M3581m5747
$$ -46003 -69930 -104874 -120422 -145008 -149589 -111747 -118740 -165135 -93098 -53775 -10194 -55941
22766e5941o8484m758k6595M782P5686P4392M0365l4669J7179N4435J2623p7542
$$ -55941 -124425 -129183 -155778 -150996 -75310 -918 39447 4778 21957 76392 89015 11473
22754A1473j01225R9689M9777n2756k5008j6323k3126m1245L1403N2829J3187
$$ 11473 -89752 9937 59714 6958 -18050 -34373 -57499 -98744 -67341 -14512 -1325
22743a325p2127j8272j356K3861K749k2388P8199k3421n1087R22J5988N2572P1971
$$ -1325 -73452 -91724 -93080 -69219 -66470 -88858 -10659 -34080 -85167 -84245 -68257 -15685 56286
22730E6286n3625p3973o2327Q213R427N4576L0746J0007Q605M1156L884r199k0649
$$ 56286 2661 -71312 -133639 -125426 -115999 -61423 -30677 -20670 -12065 29091 32975 23776 3127
22717C127j1421N6855K5333L0443k0862o5865j0523n874j7146m679l5586k3524
$$ 3127 -8294 48561 73894 104337 83475 17610 7087 1213 -15933 -20612 -56198 -79722
22705g9722N0049J400J5059K8242M895l6201J2378Q6903L457k8112L4902J8375
$$ -79722 -29673 -28273 -13214 15028 19923 -16278 -3900 83003 86460 58348 93250 111625
22693A11625M2087l6203n4811j5731j5465o749m3921m5870J3726J1767l7678K2985
$$ 111625 153712 117509 62698 46967 31502 24753 -19168 -65038 -51312 -39545 -77223 -54238
22681e4238k8969J9402K3359m3733M610P409k2816K0234L1992L7351K1548K7377
$$ -54238 -83207 -63805 -40446 -84179 -79569 -72160 -94976 -74742 -42750 -5399 16149 43526
22669D3526J6019k8939l695N0105L7025j8239o4328M25M018o921l7577J3929Q1402
$$ 43526 59545 30606 26911 77016 114041 95802 31474 31899 35917 28996 -8581 5348 86750
22656H6750l2784k164M0004j950j39q2204m7715O0845N521j9229K1913M9784k7087
$$ 86750 53966 51802 91806 89856 89717 7513 -40202 20643 26164 6935 28848 78632 51545
22643E1545o2826r300M5170L9520L7808L7878k1484n4402m7903K7716L7018k2212
$$ 51545 -11281 -20581 24589 64109 101917 139795 118311 63909 16006 43722 80740 58528
22631E8528j5020j2548O8886k5954j8070J6858n294n2412p1639J6735M0697n8041
$$ 58528 43508 30960 99846 73892 55822 72680 67386 14974 -56665 -39930 767 -57274
22619e7274J5756N8389N5309J3590j7162p5670o5067Q9308L1432m7373k4778O0304
$$ -57274 -41518 16871 72180 85770 68608 -7062 -72129 17179 48611 1238 -23540 36764
22607C6764J3783N218m7580m0223L2863j531l6457M4171j3392j7428l6022j1619
$$ 36764 50547 55765 8185 -32038 825 -706 -37163 7008 -6384 -23812 -59834 -71453
22595g1453o058N8432J9410k2377o2046K6000Q2820n1986k3366O6166K27o2282
$$ -71453 -77511 -19079 331 -22046 -84092 -58092 24728 -27258 -50624 15542 15769 -46513
22583d6513M9797K4097m098K827j3756j4361L4495m1740l2425J4727o570M2894
$$ -46513 3284 27381 23283 26110 12354 -2007 32488 -9252 -41677 -26950 -33520 9374
22571I374L4944J276r3889m9999M782K3193O2815Q338J8616N9142J1123N1795
$$ 9374 44318 45594 -48295 -98294 -93512 -70319 -7504 834 19450 78592 89715 141510
22559A41510N1622m7637r9977p1357J9794k0737k0041J04685J510j79r082n3949
$$ 141510 193132 145495 45518 -25839 -6045 -26782 -46823 57862 59372 59193 50111 -3838
22547c838j9971k8236K72J1946R037j3201l9187k1227M9006J6976K9496n7709
$$ -3838 -23809 -52045 -51773 -39827 -30790 -43991 -83178 -104405 -55399 -38423 -8927 -66636
22535f6636K1348K9487Q732k3605m043N9344L0772k0067l2126p6497m8484J6251
$$ -66636 -45288 -15801 -7069 -30674 -34717 24627 55399 35332 3206 -73291 -121775 -105524
22523a05524M9652M152J9496K6268j9760l6313m4330o334J4594m1289O1073K7619
$$ -105524 -55872 -51720 -32224 -5956 -25716 -62029 -106359 -112693 -98099 -139388 -78315 -50696
22511e0696J0397L0587m452k4000J4228n743l0619K0465J6326L1244M9708K4377
$$ -50696 -40299 -9712 -14164 -38164 -23936 -29679 -60298 -39833 -23507 7737 57445 81822
22499H1822q752O63p379L554m3568m9620M1945J2080m5128j4050k4736M2632K5227
$$ 81822 73070 73733 66354 69908 26340 -23280 18665 30745 -14383 -28433 -53169 -10537 14690
22486A4690Q55k6548k1823R252J2518l5258q878K8179j8432J5880K0951J9371
$$ 14690 15545 -11003 -32826 -23574 -11056 -46314 -55192 -27013 -45445 -29565 -8614 10757
22474A0757m4082q5839l000N6763O9520n5518p6196L9029K3286J1329m327k7488
$$ 10757 -33325 -119164 -122164 -65401 4119 -51399 -127595 -88566 -65280 -53951 -58278 -85766
22462h5766J8M7961J2008k7967J23012L61r3018p0595O053L6813j5543L4014M4493
$$ -85766 -85748 -37787 -25779 -53746 69266 69627 -23391 -93986 -87933 -51120 -66663 -32649 11844
22449A1844k1754l6602p511Q685K1925M5683K4079j5090p3472o3956J1715L3182
$$ 11844 -9910 -46512 -54023 -45338 -23413 22270 46349 31259 -42213 -106169 -94454 -61272
22437f1272M3844M2272M7064k8275O425j3021m2057K957j1838J0998j6104l1239
$$ -61272 -17428 24844 71908 43633 50058 37037 -5020 -2063 -13901 -2903 -19007 -50246
22425e0246k5144p202O7654O4779K0426j938k1049j5791o0594J4898J6597k2067
$$ -50246 -75390 -82592 -14938 49841 70267 68329 47280 31489 -29105 -14207 2390 -19677
22413a9677j1844M0919m01L0797P2124m3534m5435l5502L86K2229K0432j6073
$$ -19677 -31521 9398 8997 39794 111918 68384 22949 -12553 -12167 10062 30494 14421
22401A4421J3200k8774k7381k3252M9779j9920j8848K0620J7198k0211l1600O2954
$$ 14421 27621 -1153 -28534 -51786 -2007 -21927 -40775 -20155 -2957 -23168 -54768 8186
22389H186L432j568m2397k7703l6144M763L5289K2288P9400J0387r816L003k1698
$$ 8186 11618 10050 -32347 -60050 -96194 -91431 -56142 -33854 45546 55933 46117 49120 27422
22376B7422l2301l5046J4020l162j1597n608r687M6020m2737J7848P4588N0880
$$ 27422 -4879 -39925 -25905 -29067 -40664 -46272 -55959 -9939 -52676 -34828 39760 90640
22364I0640l8184n8241o1277k0416N2102j5227Q629M4052K1503K5435j4723r390
$$ 90640 52456 -5785 -67062 -87478 -35376 -50603 -41974 2078 23581 49016 34293 24903
22352B4903n997m9449j8467j4458J1781k3032N2825K3817o2460n1230l7387l6190
$$ 24903 18906 -30543 -49010 -63468 -51687 -74719 -21894 1923 -60537 -111767 -149154 -185344
22340a85344O2399J03259n5889j8220J03524j757j1745k7297m3741M8487M6937
$$ -185344 -122945 -19686 -75575 -93795 9729 7972 -3773 -31070 -74811 -26324 20613
22329B0613O713J2423K2798m7879J5017K7708o2453j16657j0126K0053O8019N3638
$$ 20613 27326 39749 62547 14668 29685 57393 -5060 -121717 -131843 -111790 -43771 9867
22317I867J6152k0917L8018N6087J3669l2567j5839L8375J6177n1508k7598l0177
$$ 9867 26019 5102 43120 99207 112876 80309 64470 102845 119022 67514 39916 9739
22305I739l582Q009J036j1357k4183j6697L9274l6730q883l777J2937O0575j3645
$$ 9739 6157 14166 15202 3845 -20338 -37035 2239 -34491 -43374 -47151 -34214 26361 12716
22292A2716j2898m530j5957K9495k5549K5990L6899m289Q457k347j7864K0992
$$ 12716 -182 -4712 -20669 8826 -16723 9267 46166 41877 50334 47987 30123 51115
22280E1115o7677q6330j819L3755K5395N0028L651K3472l4554l2820L7350p937
$$ 51115 -16562 -102892 -104711 -70956 -45561 4467 8118 31590 -2964 -35784 1566 -6371
22268f371j5440K313o51J6583K8646m9623m3792k9932K6283J0000k4388P457L7746
$$ -6371 -21811 -19498 -20149 -3566 25080 -24543 -68335 -98267 -71984 -61984 -86372 -78915 -41169
22255d1169O4226M896j3396l3561m30J6668m406M8487J3384n4699r306j2269N3338
$$ -41169 23057 27953 14557 -19004 -19434 -2766 -7172 41315 54699 0 -9306 -21575 31763
22242C1763R3594L3040j6760o5518m9360k8144p0393j3549M0327K6438O4004J1464
$$ 31763 125357 158397 141637 76119 26759 -1385 -71778 -85327 -45000 -18562 45442 56906
22230E6906l4518l1528J7701K3459R342k9130J5368k3484o0484M0011Q3511j4044
$$ 56906 22388 -9140 8561 32020 41362 12232 27600 4116 -56368 -16357 67154 53110
22218E3110M501K9242J7717k2666M947n3707p5430k0766l3259P3470K9526m3129
$$ 53110 57611 86853 104570 81904 86851 33144 -42286 -63052 -96311 -22841 6685 -36444
22206c6444p3998K6410j3460o320L5500N7726N5930k2762m4611J5373J440j3711
$$ -36444 -110442 -84032 -97492 -103812 -68312 -10586 45344 22582 -22029 -6656 -5216 -18927
22194a8927m962P5142J7561K0887j28379k8219L3730J0279K4915q381O411l9384
$$ -18927 -23889 51253 68814 89701 -38678 -66897 -33167 -22888 2027 -6354 57 -39327
22182c9327L8142R683J0577K7712l4548m3345J8702J6666l4162p5897M8775N3999
$$ -39327 -1185 8498 19075 46787 12239 -31106 -12404 4262 -29900 -105797 -57022 -3023
22170c023P9273K1628m367J2980k2752m4524k7432J6785K1479l0237p630n9210
$$ -3023 76250 97878 93511 106491 83739 39215 11783 28568 50047 19810 12180 -47030
22158d7030l4597j812K1598l9469k7654L7145R5350N565j6369K8402J656k8482
$$ -47030 -81627 -83439 -61841 -101310 -128964 -91819 3531 9096 -7273 21129 22785 -5697
22146e697K7605J037o730l4413L4059j0383j3386P167k5380o2692j8231K6512
$$ -5697 21908 22945 16215 -18198 15861 5478 -7908 -741 -26121 -88813 -107044 -80532
22134h0532K1916L4204J5170l8500k3189N4047P8087O2582n203n2192k9676N4222
$$ -80532 -58616 -24412 -9242 -47742 -70931 -16884 61203 123785 118582 66390 36714 90936
22122I0936K5979n7640j5525J967k7184k5129m736L6421L2149l7127n3250j3247
$$ 90936 116915 59275 43750 45717 18533 -6596 -11332 25089 57238 20111 -33139 -46386
22110d6386L78L9524M7976l0878L5593K1641k2400k2017l1121j1181n1055l9306
$$ -46386 -46008 -6484 41492 10614 46207 67848 45448 23431 -7690 -18871 -69926 -109232
22098a09232q68N5954M9120K8098l2175m6817L8387j6617j0617L4220N2485L3225
$$ -109232 -110100 -54146 -5026 23072 -9103 -55920 -17533 -34150 -44767 -10547 41938 75163
22086G5163K1768N297o4480p9278L333j8554K2179N1513j2043m4311k3391O3462
$$ 75163 96931 102228 37748 -41530 -38197 -56751 -34572 16941 4898 -39413 -62804 658
22074F58Q5555J4026k8143m2586m0580l1799J2124K047p740O4393K6940r1366
$$ 658 86213 100239 72096 29510 -11070 -42869 -30745 -28698 -36438 27955 54895 -36471
22062c6471o7555L6515M5860k3448l0382k1587N5173K8941L1473l0460L7246J0109
$$ -36471 -104026 -67511 -21651 -45099 -75481 -97068 -41895 -12954 18519 -11941 25305 35414
22050C5414m3268K449j8279M317L2491k6675m9261o7267m0494N413J04531L8327
$$ 35414 -7854 -5405 -23684 -19367 13124 -13551 -62812 -130079 -170573 -165160 -60629 -22302
22038b2302l2235L1928j0448j9250L9220L8943K0113M731k4117j4441k3168l6970
$$ -22302 -54537 -22609 -33057 -52307 -13087 25856 45969 50700 26583 12142 -11026 -47996
22026d7996K8421K7791p545n900L0237N5170J2495q177j4782n8049k4292m5439
$$ -47996 -19575 8216 671 -5229 25008 80178 92673 84496 69714 11665 -12627 -58066
22014e8066o377K6172k0325L4816J8440o0202n8722K1195r678J8069N0526J05367
$$ -58066 -64443 -38271 -58596 -23780 -5340 -65542 -124264 -103069 -112747 -94678 -44152 61215
22002F1215k6540m6389n1153R391J05822N4428m6914o5099n1764l3830O528m721
$$ 61215 34675 -11714 -62867 -53476 52346 106774 59860 -5239 -57003 -90833 -84305 -89026
21990h9026N0655P168k8397L8400K8144L062L6144j3671p108K196o059L2366k5199
$$ -89026 -38371 -31203 -59600 -21200 6944 10006 46150 32479 25371 27567 21508 53874 28675
21977B8675l9519K0887J1901k3415P666k0917L2397P6l5538J6075l9033Q317M2164
$$ 28675 -10844 10043 21944 -1471 6195 -14722 17675 17751 -17787 -1712 -40745 -32428 9736
21964I736K6611j1903j3099J7138N588j5529Q429l0215L0167K9135l529o045J3721
$$ 9736 36347 24444 11345 28483 34071 18542 26971 -3244 26923 56058 52529 46484 60205
21951F0205j2189l2002k0960k938k1364L4728O09K8019j7086l1622k4669l3304
$$ 60205 48016 16014 -4946 -7884 -29248 5480 6089 34108 17022 -14600 -39269 -72573
21939g2573l3148K8266j6475r595N1881l8j9676M7289J0179L5552m2293m3201
$$ -72573 -105721 -77455 -93930 -103525 -51644 -51682 -71358 -24069 -13890 21662 -20631 -63832
21927f3832q262L684N5695J7552o8487m0154J7256P4969L0245O551j6206n6183
$$ -63832 -72094 -68410 -12715 4837 -63650 -103804 -86548 -11579 18666 25217 9011 -47172
21915d7172m6446k3225l587N0471N5799J9014K9366k229l2308j8247k0886l3536
$$ -47172 -93618 -116843 -120430 -69959 -14160 4854 34220 31991 -317 -18564 -39450 -72986
21903g2986j198K5078N7935J8719j4314j2546m5005j766K9948j1042k9145J6693
$$ -72986 -74184 -49106 8829 27548 13234 688 -44317 -46083 -16135 -27177 -56322 -39629
21891c9629j115K694O4958r893j976K2941m9387n123j9223l2275k1256l5464M1788
$$ -39629 -40744 -38050 26908 17015 15039 37980 -11407 -16530 -35753 -68028 -89284 -124748 -82960
21878h2960J08084L2532k0342j4018l7336m3300Q312P4340P7018L2160k1100o5496
$$ -82960 25124 57656 37314 23296 -14040 -57340 -49028 25312 102330 134490 113390 47894
21866D7894K8663K5723k3934l0362j11239r88K0970L4893j3730J670K9304L9499
$$ 47894 76557 102280 78346 47984 -63255 -64243 -43273 -8380 -22110 -20440 8864 48363
21854D8363k8657j7236j852Q678L2115j6199o4528J2347M5863p987k6789R570
$$ 48363 19706 2470 618 9296 41411 25212 -39316 -26969 18894 10907 -15882 -6312
21842f312O951J7519o1378m0875K5695K2601j6788m7703Q936P7789K7843j0044
$$ -6312 639 18158 -43220 -84095 -58400 -35799 -52587 -100290 -91354 -13565 14278 4234
21830D234l7348m0671J650O4872l8689l4763k2806R789J3362Q6560Q867P321l1119
$$ 4234 -33114 -73785 -72135 -7263 -45952 -80715 -103521 -93732 -80370 6190 15057 22378 -8741
21817h741n5373m6731M505J7355L144K3298p6n597K3173Q1337l2105k1153n9825
$$ -8741 -64114 -110845 -106340 -88985 -85841 -62543 -62619 -68216 -45043 36294 4189 -16964 -76789
21804g6789j5987L2308m1910L2826J6233o6708J4524N9706J7631L2337m5242n5548
$$ -76789 -92776 -60468 -102378 -69552 -53319 -120027 -105503 -45797 -28166 4171 -41071 -96619
21792i6619L8070L0893P3537R307l7755l7357K1084K2741j3284j7482O447k5143
$$ -96619 -58549 -27656 45881 55188 17433 -19924 1160 23901 10617 -6865 -418 -25561
21780b5561q221O497L0040k169J8805J2804K6576o769j0212k939L3830M9825L0605
$$ -25561 -33782 -27285 2755 586 19391 32195 58771 52002 41790 38851 72681 122506 153111
21767A53111m1422N835j4719L3742L0021k3424m4004m9151p180l3351o7827J4602
$$ 153111 111689 117524 102805 136547 166568 143144 99140 49989 42809 9458 -58369 -43767
21755d3767J8154K5530j0091m437M4049M3701J5993l2118k305k6560l1509J4574
$$ -43767 -25613 -83 -10174 -14611 29438 73139 89132 57014 54709 28149 -3360 11214
21743A1214l4974m6604k0239j1830J5396L3753M0134M3109j5423j6360j6224K4025
$$ 11214 -23760 -70364 -90603 -102433 -87037 -53284 -13150 29959 14536 -1824 -18048 5977
21731E977j8107m7332N3058K0655k3682k9978k9887m741L3618L2406j8229L1001
$$ 5977 -12130 -59462 -6404 14251 -9431 -39409 -69296 -74037 -40419 -8013 -26242 4759
21719D759j4341J4019N531k6630p079m350P9646j706n5704o5092K47K6027O1319
$$ 4759 -9582 4437 9968 -16662 -23741 -28091 51555 49849 -5855 -70947 -70700 -44673 16646
21706A6646O8696l6744J415j4755j6140j1968N518P167m3461l6509M8043K8902
$$ 16646 85342 48598 50013 35258 19118 7150 12668 19835 -23626 -60135 -12092 16810
21694A6810o686k5004k2025M6323O2075j4747o1044o3935n0250M1451Q7992o2335
$$ 16810 10124 -14880 -36905 9418 71493 56746 -4298 -68233 -118483 -77032 10960 -51375
21682e1375n9718K2291J3144l856n505K8369J6596N521L0337j6564J000m08L9833
$$ -51375 -111093 -88802 -75658 -79514 -85019 -56650 -40054 -34533 -4196 -20760 -19760 -20168 19665
21669A9665j0965m7956o920l736m6730k190O9292K8284O0448P682n1542n7039
$$ 19665 8700 -39256 -46176 -49912 -96642 -98832 -29540 -1256 59192 66874 15332 -41707
21657d1707n791M3232j9699r580K7023L0086l0748j8150N2455L8328o6457K2567
$$ -41707 -47498 -4266 -23965 -33545 -6522 23564 -7184 -25334 27121 65449 -1008 21559
21645B1559k5124n038J8888L9479K4853k8301m9590J1687R888l1161Q319P1559
$$ 21559 -3565 -8603 10285 49764 74617 46316 -3274 8413 18301 -12860 -4541 67018
21633F7018K0138n9237l2767l6033J1245n1604J3717k3754k5611O1344N8947N834
$$ 67018 87156 27919 -4848 -40881 -29636 -81240 -67523 -91277 -116888 -55544 3403 9237
21621I237K0482l986j4984o0044j3088J2499K5775J27236M1558l2227n3155j6435
$$ 9237 29719 25733 10749 -49295 -62383 -49884 -24109 103127 144685 112458 59303 42868
21609D2868l0727j6539k2240P273N4337j5159m1899l1205N1178K0545l3672K7240
$$ 42868 12141 -4398 -26638 -19365 34972 19813 -22086 -53291 -2113 18432 -15240 12000
21597A2000J5206j3986j4888K1867K3149M2612L8825k370n6774j9732q494M1636
$$ 12000 27206 13220 -1668 20199 43348 85960 124785 122415 65641 45909 37415 79051
21585G9051k2837k9988j796m652r727j3327L2143k6304K5646N7749O749J7960
$$ 79051 56214 26226 24430 19778 10051 -3276 28867 2563 28209 85958 92707 110667
21573A10667j6693J7822M3644K2810j9778q1325l6345L6259q147m8181k4169p9585
$$ 110667 93974 111796 155440 178250 158472 77147 40802 77061 68914 20733 -3436 -83021
21561h3021m007k5135J3275Q7698M2713m1186m9530m6553J04472Q6175q1612l4826
$$ -83021 -87028 -112163 -98888 -11190 31523 -9663 -59193 -105746 -1274 84901 3289 -31537
21549c1537j6755K7450J5055n3733k2373j7289l374R9907M5174j6163l1839m5529
$$ -31537 -48292 -20842 -5787 -59520 -81893 -99182 -102556 -2649 42525 26362 -5477 -51006
21537e1006R704K4898j1097l986J1746K4105k2949K9784r339k8619J1235N4027
$$ -51006 -41302 -16404 -27501 -31487 -19741 4364 -18585 11199 1860 -26759 -15524 38503
21525C8503O64k4248Q4484K0996m9644K2187k9973j6102N520j8161L968m0033
$$ 38503 39167 14919 99403 120399 70755 92942 62969 46867 52387 34226 38194 -1839
21513a839m825L0632N1466m0798l2243J5030k5206k161K2325l8206k0149N2165
$$ -1839 -6664 23968 75434 34636 2393 17423 -7783 -9944 12381 -25825 -45974 6191
21501F191K0986j398m2727q022L8956K5848j5490l3360J5151q370K9305L2138
$$ 6191 27177 25779 -16948 -24970 13986 39834 24344 -9016 6135 -2235 27070 59208
21489E9208j919l1149j4838K9696l8511p32k5975l601L9835N415J7061L3642k3638
$$ 59208 57289 26140 11302 40998 2487 1755 -24220 -27821 12014 17429 34490 68132 44494
21476D4494p747m4294o5725n0248l600R8805O7382p729J7902O162l3924p431O3523
$$ 44494 36747 -7547 -73272 -123520 -127120 -28315 39067 31338 49240 55402 21478 14047 77570
21463G7570r643q8394n7670L3457Q8908O253p6786J3434M3267n6946Q774J5950
$$ 77570 67927 -20467 -78137 -44680 44228 50481 -26305 -12871 30396 -26550 -17776 -1826
21451a826k0443J1803q961m283L045n1117l8334K3538J9748k4153k6407L1664
$$ -1826 -22269 -10466 -19427 -23710 -20665 -71782 -110116 -86578 -66830 -90983 -117390 -85726
21439h5726K080k9931J3867K0260K4722J8874J5054R278p36l6739n3211J0456
$$ -85726 -83646 -113577 -99710 -79450 -54728 -35854 -20800 -11522 -12258 -48997 -102208 -91752
21427i1752M2714k5641p790O0364Q410Q5566j2777J7747O557L3262Q471K1635
$$ -91752 -49038 -74679 -82469 -22105 -13695 71871 59094 76841 83398 116660 125131 146766
21415A46766l314p7821q3742K503l200K9429K0108J8427J4968K8802l7595l1801
$$ 146766 143452 65631 -18111 -15608 -18808 10621 30729 49156 64124 92926 55331 23530
21403B3530L1381k4476n8207l9193L5919N3217m3578m7901p0930R340R4903O6161
$$ 23530 54911 30435 -27772 -66965 -31046 22171 -21407 -69308 -140238 -130898 -35995 30166
21391C0166L0078k4887n7262o5018k946P6066j0206m3159k3291j2829L2358L5167
$$ 30166 60244 35357 -21905 -86923 -89869 -13803 -24009 -67168 -90459 -103288 -70930 -35763
21379c5763J5081j137L1524j1042p549L1316j5800k7781J1516M9045J6099J4756
$$ -35763 -20682 -21819 9705 -1337 -8886 22430 6630 -21151 -9635 39410 55509 70265
21367G0265k6484q079k0696j2596o2251J4227J9499L0434M1746j982M344K6639
$$ 70265 43781 35702 15006 2410 -59841 -45614 -26115 4319 46065 44083 48427 75066
21355G5066K7111k1162P635o1253l4428k8343Q126M8311l5570m2503j9175R4991
$$ 75066 102177 81015 88650 27397 -7031 -35374 -27248 21063 -14507 -57010 -76185 18806
21343A8806O9683k2940p0978N479j6391J0115L3458L4223j8759j6521L8137l3935
$$ 18806 88489 65549 -5429 50 -16341 -6226 27232 61455 42696 26175 64312 30377
21331C0377m8490L0257n8243q9218N2847J0255M5506k0954m2966J3682L1884M6207
$$ 30377 -18113 12144 -46099 -135317 -82470 -72215 -26709 -47663 -90629 -76947 -45063 1144
21319A144O3428J2709j8944O9062K3083o0927l9044r559l4287M5412J8405j2180
$$ 1144 64572 77281 58337 127399 150482 89555 50511 40952 6665 52077 70482 58302
21307E8302k2958r673n9056q3494M2493O1673P471n666J4545k7556K2771K3841
$$ 58302 35344 25671 -33385 -116879 -74386 -12713 -5242 -10908 3637 -23919 -1148 22693
21295B2693q916l9994M3629K9167j3250n9052p153j4935K78J0273K7610p2619
$$ 22693 13777 -26217 17412 46579 33329 -25723 -32876 -47811 -47533 -37260 -9650 -82269
21283h2269n3422N9277J03261J277l4030l0382k7984l6588O7445Q4122O139m907
$$ -82269 -135691 -76414 26847 28124 -5906 -36288 -64272 -100860 -33415 50707 56846 51939
21271E1939L2223l2400m4155K4150m6906K448j9992M321M2133p398j0038j3040
$$ 51939 84162 51762 7607 31757 -15149 -12701 -32693 -28372 13761 6363 -3675 -16715
21259a6715o3145k2978L8382K4416J3720q48J5094k0572Q078k484p819O003k3993
$$ -16715 -79860 -102838 -64456 -40040 -26320 -27168 -12074 -32646 -24568 -27052 -34871 -28868 -52861
21246e2861N3166O4642q987j6692J2107K638o4870M903L4631l9333j5016J3823
$$ -52861 305 64947 55960 39268 51375 54013 -10857 -5954 28677 -10656 -25672 -11849
21234a1849j582K2110l3511K6003J7525j5487j9729j8284j2792N0143J2925n2919
$$ -11849 -13431 8679 -24832 1171 18696 3209 -16520 -34804 -47596 2547 15472 -37447
21222c7447R940j4559k2837j103L0246N1180m1949M0413l9395n4246R8119P5073
$$ -37447 -27507 -42066 -64903 -66006 -35760 15420 -26529 13884 -25511 -79757 18362 93435
21210I3435m9962j8589j0898k9375M0579n9385L2461J9883l2109J4838J7200K3416
$$ 93435 43473 24884 13986 -15389 25190 -34195 -1734 18149 -13960 878 18078 41494
21198D1494N9285j5029l2367l5712K7909J8214o1904m470j8078j401M615N4082
$$ 41494 100779 85750 53383 17671 45580 63794 1890 -2580 -20658 -22059 -17444 36638
21186C6638p566o636O2953M2970Q802Q09j6873k3399k9583K9515k2906k469j9870
$$ 36638 29072 22436 85389 128359 137161 137970 121097 97698 68115 97630 74724 72255 52385
21173E2385O317N4548N380n2305q6229p731J8164N8323N5089n8113O225l7636
$$ 52385 58702 113250 118630 66325 -19904 -27635 -9471 48852 103941 45828 52053 14417
21161A4417n0798o0206L0148n40j9538P696L6139k4300m421N5768Q1759J8181
$$ 14417 -36381 -96587 -66439 -66979 -86517 -78821 -42682 -66982 -71403 -15635 66124 84305
21149H4305k7137j2030k8016o680M737o9957k4949k9565j3728M5740k1304L5301
$$ 84305 57168 45138 17122 10442 15179 -54778 -79727 -109292 -123020 -77280 -98584 -63283
21137f3283K1569L8500K8613k0202O399p117L2361P561p3398j9421L9914N117
$$ -63283 -41714 -3214 25399 5197 11596 4479 36840 44401 -28997 -48418 -8504 -3387
21125c387M0912L0579j7128m8302m2302l3642K7253L6268J6144n5764r348P669
$$ -3387 37525 68104 50976 2674 -39628 -73270 -46017 -9749 6395 -49369 -58717 -51048
21113e1048L1176j660k1785k667N6881L1884o1429l1850K8605N8258K9558r28
$$ -51048 -19872 -21532 -43317 -45984 10897 42781 -18648 -50498 -21893 36365 65923 64995
21101F4995j3281k7684m4408n2110j3891O425Q7962L227l9461l5233j4256j9125
$$ 64995 51714 24030 -20378 -72488 -86379 -79954 8008 11235 -28226 -63459 -77715 -96840
21089i6840P757K5174M9553J847k4167k4087L386N2780l814k2503Q109k647K8261
$$ -96840 -89083 -63909 -14356 -12509 -36676 -60763 -57377 -4597 -8411 -30914 -22805 -25452 2809
21076B809k6768j2410J2358l106N865M6473L2410L6100m9957l046j780K9311K564
$$ 2809 -23959 -36369 -24011 -27117 -21252 25221 57631 93731 43774 40728 38948 68259 70823
21063G0823K0505Q705l7138k1183m1607m4420m0136o1725J588N0046M2714K0656
$$ 70823 91328 100033 62895 41712 105 -44315 -84451 -146176 -144588 -94542 -51828 -31172
21051c1172l4384O273K7817M5541j2537Q1786O5085m9652n2976j31j3998m2503
$$ -31172 -65556 -59283 -31466 14075 1538 83324 148409 98757 45781 45650 31652 -10851
21039a0851k1738k4956N0490L2513M35k5437k8727j9949K9194l911K3615M7207
$$ -10851 -32589 -57545 -7055 25458 25893 456 -28271 -48220 -19026 -22937 678 47885
21027D7885O441m4780l3992m316Q692Q503M8748P803m521K0630N683k4046l9411
$$ 47885 54326 9546 -24446 -28762 -20070 -11567 37181 44984 40463 61093 66776 42730 3319
21014C319R636r715p3055Q893R4075Q815M331R76j7027j6721n6935k3492l0972
$$ 3319 12955 3240 -69815 -60922 33153 41968 46299 47275 30248 13527 -43408 -66900 -97872
21001i7872R0536R5559n2693J0611L7450m1521K781k6664j9162k516m9173m0006
$$ -97872 -7336 88223 35530 46141 83591 42070 44851 18187 -975 -3491 -52664 -92670
20989i2670O3132K7829o8504o4671K6746K1294K0020L0887Q166l9139l053L5349
$$ -92670 -29538 -1709 -70213 -134884 -108138 -86844 -66824 -35937 -27771 -66910 -69963 -34614
20977c4614K0694j6099O8934o740l7531Q40K4448J683j4680K0435J670l8532j7363
$$ -34614 -13920 -30019 38915 32175 -5356 -4516 19932 21615 6935 27370 29040 -9492 -26855
20964b6855k670m6826j786Q379k0357M625L4105K4726L498J2626q720k7473j1036
$$ -26855 -29525 -76351 -78137 -69758 -90115 -85490 -51385 -26659 -23161 -10535 -19255 -46728 -57764
20951e7764J6104M3674j2277p5583l3043N5313J1595J1770M0730L246K4431m6516
$$ -57764 -41660 2014 -10263 -85846 -118889 -63576 -51981 -40211 519 3765 28196 -18320
20939a8320o3881P4180M971l8655L1962j2135M4523J3375L3978K2381l0107r8176
$$ -18320 -82201 -8021 -3050 -41705 -9743 -21878 22645 36020 69998 92379 62272 -35904
20927c5904l1644N5304K4578O0207l204l7780J0823K0026J3737r0228o2740O1853
$$ -35904 -67548 -12244 12334 72541 69337 31557 42380 62406 76143 -14085 -76825 -14972
20915a4972O9061l7342q4392p1653l2805M1364R6409L0589J9169k5002L3239r157
$$ -14972 54089 16747 -67645 -139298 -172103 -130739 -34330 -3741 15428 -9574 23665 14508
20903A4508J2684k0624R676l8140n4087k2292N1051O2884K3207j6957k195n0927
$$ 14508 27192 6568 16244 -21896 -75983 -98275 -47224 15660 38867 21910 19715 -31212
20891c1212K1057O0330L3031Q214K671n4938j22874Q379k089k321L251N6378K692
$$ -31212 -10155 50175 83206 91420 94091 39153 -83721 -75342 -77431 -79752 -76501 -20123 -17431
20878a7431q041J6910j5175k5499K9025n916j8902j2971m2161L3873N7686J2682
$$ -17431 -25472 -8562 -23737 -49236 -20211 -26127 -45029 -58000 -100161 -66288 -8602 4080
20866D080j365J1496M493j1525j1694j6472L5149K4139k0494l3624j0436o896
$$ 4080 2715 14211 18704 7179 -4515 -20987 14162 38301 17807 -15817 -26253 -33149
20854c3149J8403j2023J2843J586j1052L9290r728R370j2084m1145N2624L2073
$$ -33149 -14746 -26769 -13926 -12340 -23392 15898 6170 15540 3456 -37689 14935 47008
20842D7008o9583J8643M6069m2016J2580L1991j5809j1495l7236n4875J6537J5312
$$ 47008 -22575 -3932 42137 121 12701 44692 28883 17388 -19848 -74723 -58186 -42874
20830d2874J9047k0170J6597R829N8654K7295O613k2910k9934j0066q364j3554
$$ -42874 -23827 -43997 -27400 -17571 41083 68378 74991 52081 22147 12081 3717 -9837
20818i837k9424J2338k9649P262j0470K463O7435L7871m1566l2188l2018l1023
$$ -9837 -39261 -26923 -56572 -49310 -59780 -57317 10118 47989 6423 -25765 -57783 -88806
20806h8806j7737J9379n385P958K3285K1749Q3417Q4601k9947o0222m3506p7193
$$ -88806 -106543 -87164 -92549 -84591 -61306 -39557 43860 128461 98514 38292 -5214 -82407
20794h2407J1207N2950l241j8723l1737L675J5565l0099M2683R2633k7943l1577
$$ -82407 -71200 -18250 -21491 -40214 -71951 -68276 -52711 -82810 -40127 52506 24563 -7014
20782g014L8632K615n6105m522l275j2940P1474M4614l2955r5029N1516K5944
$$ -7014 31618 34233 -21872 -26394 -29669 -42609 28865 73479 40524 -54505 -2989 22955
20770B2955l2344O9401K7760m8846m3882J4533J6112n6775Q343k3668m7395L6337
$$ 22955 -9389 60012 87772 38926 -4956 9577 25689 -31086 -22743 -46411 -93806 -57469
20758e7469N838l7247L8805q898j076R920K3188j7145L0900j726l6622P815J0171
$$ -57469 -51631 -88878 -50073 -58971 -60047 -50127 -26939 -44084 -13184 -14910 -51532 -43717 -33546
20745c3546J6021l3761j2092J01494L7500R457l5429m9337k8505N3029q411m5654
$$ -33546 -17525 -51286 -63378 38116 75616 85073 49644 307 -28198 24831 16420 -29234
20733b9234p636K1365l0434o43N4269J0955R771l2736J0676K4367n5169J4122
$$ -29234 -36870 -15505 -45939 -46582 7687 18642 28413 -4323 6353 30720 -24449 -10327
20721a0327J8824K1566j4685L4879L4552k4262o4937j7699p2987l8362M7055k5579
$$ -10327 8497 30063 15378 50257 84809 60547 -4390 -22089 -95076 -133438 -86383 -111962
20709a11962k0747L2501M077J1249M2041m110j3209M6878K0520m5139k0518J9259
$$ -111962 -132709 -100208 -96131 -84882 -42841 -46951 -60160 -13282 7238 -37901 -58419 -39160
20697c9160K2331j2541j4089j2660p168k8247l438j3681L0999O1560k8907m9827
$$ -39160 -16829 -29370 -43459 -56119 -63287 -91534 -94972 -108653 -77654 -16094 -45001 -94828
20685i4828N0818P0596n329k8554J0754o6371k1557K3613Q5055K4838L147m6040
$$ -94828 -44010 26586 21257 -7297 3457 -62914 -84471 -60858 24197 49035 52182 6142
20673F142L118J3164K06k9222n2030m2933J6971L6298K6032K5729O0706K6675
$$ 6142 9260 22424 22630 -6592 -58622 -101555 -84584 -48286 -22254 3475 64181 90856
20661I0856m965j0188J4133j2129j5354l8583l8518M3705m8719o3209J4795M8697
$$ 90856 85891 75703 89836 77707 62353 23770 -14748 28957 -19762 -82971 -68176 -19479
20649a9479L061j3293K2106O301k5600j3040K0870K5442J5695k5633p4426r305
$$ -19479 -16418 -29711 -7605 -1304 -26904 -39944 -19074 6368 22063 -3570 -77996 -87301
20637h7301Q0676K9027J3032m2201j4254K0496J5637j8577n8317l2891N7365K5159
$$ -87301 -6625 22402 35434 -6767 -21021 -525 15112 -3465 -61782 -94673 -37308 -12149
20625a2149O982L7026l4650O494L7328l8397m0665J395p145k5009M7559R368l176
$$ -12149 -5167 31859 -2791 3703 41031 2634 -38031 -36636 -43781 -68790 -21231 -11863 -15039
20612a5039k3809p681j978M4985q614L2840K486L1145J3594k345k3537K7278k2984
$$ -15039 -38848 -46529 -48507 -3522 -12136 20704 23190 54335 67929 65584 42047 69325 46341
20599D6341o1558n7612Q876L379L0315J8267m4749j8832J0061r925M334J6278
$$ 46341 -15217 -72829 -63953 -60574 -30259 -11992 -56741 -75573 -65512 -75437 -71103 -54825
20587e4825k7732L919M6935l7808p4857l1054O4253N8631M1108N1110K2131J5998
$$ -54825 -82557 -78638 -31703 -69511 -144368 -175422 -111169 -52538 -11430 39680 61811 77809
20575G7809k6961l7756N2782J005k1139j3065q588r98K213J6330k2868o0304L55
$$ 77809 50848 13092 65874 66879 45740 32675 24087 23089 25302 41632 18764 -41540 -41185
20562d1185P44J0423p219m319K0589j506K0708l9206k5310J1251k5634l6584J1833
$$ -41185 -40441 -30018 -37237 -41556 -20967 -22473 -1765 -40971 -66281 -55030 -80664 -117248 -105415
20549a05415M4026L1766J175m0602k2501L3060p859M455n679q47O6745K568o1155
$$ -105415 -61389 -29623 -28448 -69050 -91551 -58491 -66350 -61895 -67574 -68421 -1676 892 -60263
20536f0263l0916N4758N8532k2660n2928L2906L941k2460L8040p658l3358j2213
$$ -60263 -91179 -36421 22111 -549 -53477 -20571 -16630 -39090 -1050 -8708 -42066 -54279
20524e4279j8119K937J6529j3953j061K2929N0925K7814J0693J4693O0J7208k9201
$$ -54279 -72398 -69461 -52932 -66885 -67946 -45017 5908 33722 44415 59108 59168 76376 47175
20511D7175o962L2605Q7371J8381n2553l5566j2857k7171m0678m490j7170n79
$$ 47175 40213 72818 160189 178570 126017 90451 77594 50423 9745 5255 -11915 -12494
20499a2494l225J5442O641o277j7132j4591J5113m0939j1506R37P2235k8787l084
$$ -12494 -15719 -277 6364 87 -17045 -31636 -16523 -57462 -68968 -68031 4204 -24583 -27667
20486b7667j9980K8768O5265R093k6500p1384k0951m7322N389N2465K0698j3840
$$ -27667 -47647 -18879 46386 55479 28979 -42405 -63356 -110678 -105289 -52824 -32126 -45966
20474d5966Q419P1473j0666P934k2291o8599m3184m7979O5616K2485m1101P644
$$ -45966 -37547 33926 23260 31194 8903 -59696 -102880 -150859 -85243 -62758 -103859 -96215
20462i6215K2580M4312N3424k5230K7874K0347l2041l8632Q294L0696m5289l5996
$$ -96215 -73635 -29323 24101 -1129 26745 47092 15051 -23581 -15287 15409 -29880 -65876
20450f5876K3015N5141K2142M800M657k925r5654l389N5623n599j2776Q17n74
$$ -65876 -42861 12280 34422 39222 43879 40954 -54700 -58089 -2466 -8065 -20841 -20024 -20598
20437b0598K3543M6955O3689l2197m0699m5197o2074l105J5993K1241j545k3714
$$ -20598 2945 49900 113589 81392 40693 -4504 -66578 -69683 -53690 -32449 -33994 -57708
20425e7708j3758L9496P6375k9911l2413k661K5376p322j7562Q419J7845K1879
$$ -57708 -71466 -31970 44405 14494 -17919 -20580 4796 -2526 -20088 -11669 6176 28055
20413B8055m94k5063P202k1276q6637j3424R9293L7497m4548k2362L4045l8500
$$ 28055 27561 2498 9700 -11576 -98213 -111637 -12344 25153 -19395 -41757 -7712 -46212
20401d6212j0117o369j3293P601q253N686L4392p801M7940o347J2299l1095l6419
$$ -46212 -56329 -62698 -75991 -68390 -76643 -70957 -36565 -44366 3574 -2773 9526 -21569 -57988
20388e7988M5938L2317N325j405R380j3229l7586k2699k0433k92L0943p95j421
$$ -57988 -12050 20267 25592 24187 33567 20338 -17248 -39947 -60380 -60672 -29729 -30524 -31945
20375c1945j7784K4251J9104k0503J1562J0256O403j5806l5203l9405p168M3487
$$ -31945 -49729 -25478 -6374 -26877 -15315 -5059 1344 -14462 -49665 -89070 -96238 -52751
20363e2751l2656O0649m317j4946K1496j6719k4793M4007j4964j400J4141O085
$$ -52751 -85407 -24758 -29075 -44021 -22525 -39244 -64037 -20030 -34994 -36394 -22253 -16168
20351a6168M1632K2880K3635j0905m1191l7192K2793q09j0053j3197K8263q515
$$ -16168 25464 48344 71979 61074 19883 -17309 5484 4675 -5378 -18575 9688 1173
20339A173k4357J903J3351j6278J7901K0651l7193P085j5502Q011L8330J9142
$$ 1173 -23184 -21281 -7930 -24208 -6307 14344 -22849 -15764 -31266 -23255 15075 34217
20327C4217j1171p3845l9278P410j3229j4662j030J1042K0485k1831M2102K7661
$$ 34217 23046 -50799 -90077 -82667 -95896 -110558 -111588 -100546 -80061 -101892 -59790 -32129
20315c2129K5753l9705R6901K4182k9287M799j3668L9799l808k7540m20m3390
$$ -32129 -6376 -46081 50820 75002 45715 50514 36846 76645 72837 45297 44877 1487
20303A487k870k7195L5502K3980k5926L6633q147p5583M4094J9130L0418j4412
$$ 1487 -1383 -28578 6924 30904 4978 41611 33464 -42119 1975 21105 51523 37111
20291C7111p1058l4132J7778N334M0209J2851k1260k7022l1143M6331p3j2498
$$ 37111 -33947 -68079 -50301 -44967 -4758 8093 -13167 -40189 -71332 -25001 -25074 -37572
20279c7572K7829J03l5929M3763N1999J3678j5584p772o3768n5771j6019L4538
$$ -37572 -9743 -9640 -45569 -1806 50193 63871 48287 40515 -23253 -79024 -95043 -60505
20267f0505K4026j3450k3996K2035L1596p561J6170l2502n1375P6749K7294m1049
$$ -60505 -36479 -49929 -73925 -51890 -20294 -27855 -11685 -44187 -95562 -18813 8481 -32568
20255c2568J3325P5356K8324L131l9482k5405l9005o6117Q518N8245R750N0336
$$ -32568 -19243 56113 84437 87568 48086 22681 -16324 -82441 -73923 -15678 -5928 44408
20243D4408n0678p9463M268Q3146Q868l7513P603l2776m0164k417K3644M4230
$$ 44408 -6270 -85733 -81465 1681 10549 -26964 -19361 -52137 -92301 -94718 -71074 -26844
20231b6844K1077j313k2156j9329M4808M406m844K0005M8171K33M6714J5793k8429
$$ -26844 -5767 -7080 -29236 -48565 -3757 649 -4195 15810 63981 64214 110928 126721 98292
20218I8292J2098o2138o2897N0338q431o6856k4231K7458N3939n267j6956K697
$$ 98292 110390 48252 -14645 35693 27262 -39594 -63825 -36367 17572 12305 -4651 -1954
20206a954K1565M5329j4016o3567N855J9015k7353j1387L5615L5699p927k4042
$$ -1954 19611 64940 50924 -12643 -6788 12227 -15126 -26513 9102 44801 36874 12832
20194A2832N0895j7313j1959n1763o327m33k0167l4585m1430K7867K5067m3844
$$ 12832 63727 46414 34455 -17308 -23635 -24068 -44235 -78820 -120250 -92383 -67316 -111160
20182a11160K490J6604K0801O0162K7225K0951r14m1642p5518k5330p2596L4704
$$ -111160 -108670 -92066 -71265 -11103 16122 37073 36159 -5483 -81001 -106331 -178927 -144223
20170a44223R4029M9378Q051j8847k8617n3224L4853J5336M9621J4944m3119K5446
$$ -144223 -50194 -816 7235 -11612 -40229 -93453 -58600 -43264 6357 21301 -21818 3628
20158C628q552J1113J5207n311j7246j3544k4709o447O6922K5175k6896l0025
$$ 3628 -4924 6189 21396 16085 -1161 -14705 -39414 -45861 21061 46236 19340 -10685
20146a0685K9605N9425o0826o8878o0106l2963J32941M9871M474j845Q249k1860
$$ -10685 18920 78345 17519 -51359 -111465 -144428 -11487 38384 42858 41013 49262 27402
20134B7402k8247J3770j0985l1758p275R025q411j0237M026J9893M8618K0815
$$ 27402 -845 12925 1940 -29818 -37093 -28068 -36479 -46716 -42690 -22797 25821 46636
20122D6636n5776J6963R807o1100m2295K3383M3623J3722j8114K6215p7937m4120
$$ 46636 -9140 7823 17630 -43470 -85765 -62382 -18759 -5037 -23151 3064 -74873 -118993
20110a18993Q7813o898k9022K4154q722k9377O7853N1932N034l4630p2071j952
$$ -118993 -31180 -38078 -67100 -42946 -51668 -81045 -13192 38740 43774 9144 -62927 -64879
20098f4879M3487Q262j2044Q445j2249N345M3115J6684m1046j7408n1700O231
$$ -64879 -21392 -13130 -25174 -16729 -28978 -23633 19482 36166 -4880 -22288 -73988 -67757
20086f7757L727K7047J7660J3400p970L726m0095p1098L2946P2512m7179n37M0031
$$ -67757 -64030 -36983 -19323 -5923 -13893 -10167 -50262 -121360 -88414 -15902 -63081 -63618 -23587
20073b3587k4396j7388j5513N0875N1037k7799m0623k3012j5470K6363k4659Q835
$$ -23587 -47983 -65371 -80884 -30009 21028 -6771 -47394 -70406 -85876 -59513 -84172 -75337
20061g5337Q144L6857J8583M1406L011l0472J2387j6474l1775j6039j2590J0501
$$ -75337 -67193 -30336 -11753 29653 32664 2192 14579 -1895 -33670 -49709 -62299 -51798
20049e1798j7358K7229M3453n3129L3556L3703n9398k8358l8483K7997K4086k6704
$$ -51798 -69156 -41927 1526 -51603 -18047 15656 -43742 -72100 -110583 -82586 -58500 -85204
20037h5204L813K0915q243O2025J6012P0577M0242k8899m7111k3273k8781j8990
$$ -85204 -81391 -60476 -68719 -6694 9318 79895 120137 91238 44127 20854 -7927 -26917
20025b6917K6118J9678l7633m1226n3037J4820O9552M7309L4768j835n2741r7439
$$ -26917 -799 18879 -18754 -59980 -113017 -98197 -28645 18664 53432 51597 -1144 -98583
20013i8583n1286L0880Q1256L7560K3792j7518n0141L162J3329k4393L5840k4087
$$ -98583 -149869 -118989 -37733 -173 23619 6101 -44040 -40878 -27549 -51942 -16102 -40189
20001d0189l3186p621K6787q3212L234O6241O1499M4290K0701n732M098K7042
$$ -40189 -73375 -80996 -54209 -137421 -134187 -67946 -6447 37843 58544 52812 56910 83952
19989H3952n8953m4508m0125k0914k4368L4355L6461M9520p085j12466O494O7190
$$ 83952 24999 -19509 -59634 -80548 -104916 -70561 -34100 15420 8335 -104131 -97637 -30447
19977c0447R001N385j9422l509j7174m4627M7947M2296L4425j9809n3711j5986
$$ -30447 -21446 -16061 -35483 -38992 -56166 -100793 -52846 -10550 23875 4066 -49645 -65631
19965f5631o490J5328l5919m7509K1257R0739k0156k6601M9734J7016j7074l1445
$$ -65631 -72121 -56793 -92712 -140221 -118964 -28225 -48381 -74982 -25248 -8232 -25306 -56751
19953e6751R8323p24m3345L3173K3085n5840j5314L312M0426o2789L5306J6771
$$ -56751 41572 40848 -2497 30676 53761 -2079 -17393 -14081 26345 -36444 -1138 15633
19941A5633l9677K6436O671K677k7593j6204r517j0153J5084N1804J1383J5238
$$ 15633 -24044 2392 9063 11740 -15853 -32057 -41574 -51727 -36643 15161 26544 41782
19929D1782N607k3954l2634m3340L5065j4127n6435J0591K8596n0155J0567j1706
$$ 41782 47389 23435 -9199 -52539 -17474 -31601 -88036 -77445 -48849 -99004 -88437 -100143
19917a00143J6346J5338K651M5172L2573l5126j8683k022n3836m3859J8588Q7832
$$ -100143 -83797 -68459 -65808 -20636 11937 -23189 -41872 -43894 -97730 -141589 -123001 -35169
19905c5169J9993q205N3152o487j0095l1468k3026j2650K0177K9962R116k246
$$ -35169 -15176 -23381 29771 23284 13189 -18279 -41305 -53955 -33778 -3816 5300 3054
19893C054l1758R640l820J2840K4622M868J5579l311j616k5273P6463j6988p5904
$$ 3054 -28704 -19064 -22884 -10044 14578 19446 35025 31714 30098 4825 81288 64300 -11604
19880a1604K3154P379K1820M5852L891q221M974M914l2392m3896l5921j0990Q923
$$ -11604 11550 18929 40749 86601 90492 82271 87245 92159 59767 15871 -20050 -31040 -22117
19867b2117L9310j1355l3006N8726L0403P239O450n7753j5163K0973P473m9871
$$ -22117 17193 5838 -27168 31558 61961 69200 75650 17897 2734 23707 31180 -18691
19855a8691J185o050k8394j13492k5931J07838N1583l3696m8290K2861q47N521
$$ -18691 -17506 -23556 -51950 -165442 -191373 -83535 -31952 -65648 -113938 -91077 -91924 -86403
19843h6403K8312K5641K5405N9701K024k5807n3028J8215L9738j2322j950n7522
$$ -86403 -58091 -32450 -7045 52656 54680 28873 -24155 -5940 33798 21476 19526 -37996
19831c7996m2833J0554M1437K0153j2113m0925K4179J9656K7228J3543J170Q416
$$ -37996 -80829 -70275 -28838 -8685 -20798 -61723 -37544 -17888 9340 22883 24053 32469
19819C2469j8794p466k4207K6170m7493k3489N1359K4173j8805J1752n7757J4109
$$ 32469 13675 6209 -17998 8172 -39321 -62810 -11451 12722 -6083 5669 -52088 -37979
19807c7979m418n4745r409O4031k395K2217L2757j616o9943j7219r480P256j621
$$ -37979 -42397 -97142 -106551 -42520 -44915 -22698 10059 8443 -61500 -78719 -88199 -80943 -82564
19794h2564j8030M7811L8935J6729M455m928K4989k9417m1904j6700N5543P2388
$$ -82564 -100594 -52783 -13848 2881 7336 2408 27397 -2020 -43924 -60624 -5081 67307
19782F7307r560l1668J9911m975m2800L8043j2517l728l0611j5986J6804k4708
$$ 67307 57747 26079 45990 41015 -1785 36258 23741 20013 -10598 -26584 -9780 -34488
19770c4488n675m7027l3328Q671L6718L0528J9880O1824Q0617P940k0919m8977
$$ -34488 -40163 -87190 -120518 -111847 -75129 -44601 -24721 37103 117720 125660 104741 55764
19758E5764l4142l4116J2920k1098O2268L0365M1072j6072K920m3790j3813l3369
$$ 55764 21622 -12494 426 -20672 41596 71961 113033 96961 99881 56091 42278 8909
19746H909l0782j1610k358J8171j9443p697N5239L2130j4903Q618K9546m660p3586
$$ 8909 -21873 -33483 -35841 -17670 -37113 -44810 10429 42559 27656 36274 65820 61160 -12426
19733a2426n758L9221l1959m59N31M0801m7784j7656j1974K5775M5934K5521k9580
$$ -12426 -18184 21037 -10922 -11381 -10850 29951 -17833 -35489 -47463 -21688 24246 49767 20187
19720B0187o5965K1852O1049l691n8445j9187r779j3878j3055J5144R817r168
$$ 20187 -45778 -23926 37123 33432 -25013 -44200 -53979 -67857 -80912 -65768 -55951 -65119
19708f5119q975N7311L1302k9835k0908l7928M0538L8326N5865M7239n5822m6077
$$ -65119 -74094 -16783 14519 -15316 -36224 -74152 -33614 4712 60577 107816 51994 5917
19696E917K650m0428n24l1207p723K5024K3421L2835K5792q308j0666R648K2353
$$ 5917 8567 -31861 -32385 -63592 -71315 -46291 -22870 9965 35757 27449 16783 26431 48784
19683D8784N3238l8780K7927J6300o1507J3518N5831k8988r8121p3j497l4861
$$ 48784 102022 63242 91169 107469 45962 59480 115311 86323 -11798 -11871 -13368 -48229
19671d8229R258K4094K053j0309M7413N8630L1371l4517j00488o9300J4564r223
$$ -48229 -38971 -14877 -12824 -23133 24280 82910 114281 79764 -20724 -90024 -75460 -84683
19659h4683m3382m4743L5782J17912N6999m1248r812o273k5819L507N5038O750
$$ -84683 -128065 -172808 -137026 -19114 37885 -3363 -13175 -19448 -45267 -41760 13278 20028
19647B0028l8882K865K4919Q297j1256K5724j0613o97k4077n9056l9247K4330
$$ 20028 -18854 -15989 8930 17227 5971 31695 21082 20385 -3692 -62748 -101995 -77665
19635g7665O5657L1229K1578j5320m7847l6124o3581j5258L4713K6238L1089K3950
$$ -77665 -12008 19221 40799 25479 -22368 -58492 -122073 -137331 -102618 -76380 -45291 -21341
19623b1341l9863l5694q941k9213L3462M5027Q9586P1494p357j8301l0416k0805
$$ -21341 -61204 -96898 -105839 -135052 -101590 -56563 33023 104517 97160 78859 48443 27638
19611B7638l3692k425J08754j3192o5925K7839j6313J9321k5339N557N244n3858
$$ 27638 -6054 -8479 100275 87083 21158 48997 32684 52005 26666 32223 37467 -16391
19599a6391M9666m2650k0652K2570m447N5711q766J2995m352j6791L8294n4625
$$ -16391 33275 -9375 -30027 -7457 -11904 43807 35041 48036 43684 26893 65187 10562
19587A0562k9012J5498M831K9778m1163k8754K798L8244j1703l816K251N3195
$$ 10562 -18450 -2952 1879 31657 -9506 -38260 -35462 2782 -8921 -12737 -10486 42709
19575D2709j926o093j5317l4932N465o916o921J4953K3650L4848r074K9099J9472
$$ 42709 40783 34690 19373 -15559 -10094 -17010 -23931 -8978 14672 49520 40446 69545 89017
19562H9017m9585q917L3723M3847l1994q3970J6358K6717j3244P72m9766l7564
$$ 89017 39432 30515 64238 108085 76091 -7879 8479 35196 21952 22724 -27042 -64606
19550f4606j9845M4521J9789K3962j0317R649r82J649J3790N9915q819m7245m0735
$$ -64606 -84451 -39930 -20141 3821 -6496 3153 2171 3820 17610 77525 68706 21461 -19274
19537a9274M7892L9173n7864p0666j5478q487M0665K6479M3304r879r75N474k3828
$$ -19274 28618 67791 9927 -60739 -76217 -84704 -44039 -17560 25744 15865 14890 20364 -3464
19524c464l7335k8530l576Q9008L827j02986K7049K8492K2952P3660K0911k2728
$$ -3464 -40799 -69329 -72905 16103 19930 -83056 -56007 -27515 -4563 69097 90008 67280
19512F7280o5876m4174M0412R66j6441N9996Q7623m239k9079l0031k8255k6032
$$ 67280 1404 -42770 -2358 -1392 -17833 42163 129786 125547 96468 66437 38182 12150
19500A2150j9136Q3732O186o8603o1545N3634K6742o3173j6007r861K9635J3495
$$ 12150 -6986 76746 82932 14329 -47216 6418 33160 -30013 -46020 -55881 -26246 -12751
19488a2751M8107p412n312L1561l6894k597k9826p3246L2059M3234l6679r987
$$ -12751 35356 27944 22632 54193 17299 14702 -15124 -88370 -56311 -13077 -49756 -59743
19476e9743L3383o119K1335r966M670J4741m930K8261L7361j391l7329p8090l0122
$$ -59743 -26360 -32479 -11144 -21110 -16440 -1699 -6629 21632 58993 57602 20273 -57817 -87939
19463h7939M234P3320N4919j8697J4432l2145l2951L5619j9351m3560L1840M5733
$$ -87939 -83705 -10385 44534 25837 40269 8124 -24827 10792 -8559 -52119 -20279 25454
19451B5454K9759q432l4331L1404L035l0032o359P1229J3604n2292m4526O0436
$$ 25454 55213 46781 12450 43854 46889 16857 10498 81727 95331 43039 -1487 58949
19439E8949l649m0640j6217K5065k6779k3587n597L5410O8928k143l0805o723
$$ 58949 55300 14660 -1557 23508 -3271 -26858 -32455 2955 71883 69740 38935 32212
19427C2212p434Q0101j654j2212k2522J390m4411m3024K2184M011N2618r19k8196
$$ 32212 24778 104879 103225 91013 68491 69881 25470 -17554 4630 8641 61259 60340 32144
19414C2144J4859j1751j3887R543l1756j7974O6561n098P115M4028L9569M5315
$$ 32144 47003 35252 21365 30908 -848 -18822 47739 42641 49756 93784 133353 178668
19402A78668O1844P6716N3088J23392J63143K12868J84267O1304n2015j67115
$$ 178668 240512 317228 370316 493708 656851 869719 1053986 1115290 1063275 896160
19392H96160k48541k01521o0434p5231j13421p0253n5348j15607K6671M1302k6157
$$ 896160 647619 446098 385664 310433 197012 126759 71411 -44196 -17525 23777 -2380
19381b380n9659K5827N5782J1812m5111K5677j0771j6422N1223R323j2179J1953
$$ -2380 -62039 -36212 19570 31382 -13729 11948 1177 -15245 35978 45301 33122 45075
19369D5075m5765m9009l5131L7515J9716j460M5364K0066K9964O9745L4340M2220
$$ 45075 -690 -49699 -84830 -47315 -27599 -29059 16305 36371 66335 136080 170420 212640
19357B12640l8936k3226p5112n6734l0684j7544p461K0073L2242q3725K7714R1781
$$ 212640 173704 150478 75366 18632 -12052 -29596 -37057 -16984 15258 -68467 -40753 51028
19345E1028J1011q4899m0593O5793J9824J9867r442J727R130j9820l0024M562
$$ 51028 62039 -22860 -63453 2340 22164 42031 32589 34316 43446 23626 -6398 -1836
19333a836N7241L4624n1077o2049L9442K4241j1748n3840l5580M9863K8991l694
$$ -1836 55405 90029 38952 -23097 16345 40586 28838 -25002 -60582 -10719 18272 14578
19321A4578k033J7986K0999j4188m5160k1774J7500O6625N6912l8993N16m0137
$$ 14578 12545 30531 51530 37342 -7818 -29592 -12092 54533 111445 72452 72968 32831
19309C2831l1251k423j7544j8130J9880K6955q752n8143R442J05029j5896n8359
$$ 32831 1580 -843 -18387 -36517 -16637 10318 1566 -56577 -47135 57894 41998 -16361
19297a6361k1976k8615r266K9392k9398L1193P8189J7240k501j9787q583J2937
$$ -16361 -38337 -66952 -76218 -46826 -76224 -45031 33158 50398 47897 28110 19527 32464
19285C2464L3540J5346o424j9758q420l2547o951R174M4635n171j4649n6450m2971
$$ 32464 66004 81350 74926 55168 46748 14201 7250 16424 61059 55888 41239 -15211 -58182
19272e8182J604O5202M369j5928l1443J3165L3314P2524J3354n3154n2846L3168
$$ -58182 -56578 8624 12993 -2935 -34378 -21213 12101 84625 97979 44825 -8021 25147
19260B5147M8110o1883K3918L1389n5467m3376Q356k0569k8819K878j2865N8495
$$ 25147 73257 11374 35292 66681 11214 -32162 -23806 -44375 -73194 -70316 -83181 -24686
19248b4686k9269k3367K0657K9001j4066n6364q836N6404J02751n12k9401n2374
$$ -24686 -53955 -77322 -56665 -27664 -41730 -98094 -106930 -50526 52225 51713 22312 -30062
19236c0062j5725M210L505K6986J3472l3992J4462O0570L3471P300P321k2430
$$ -30062 -45787 -41577 -38072 -11086 2386 -31606 -17144 43426 76897 84197 91518 69088
19224F9088j3990p206J5372K1454R664N0507m3121r9969j8736k4443J6803J7118
$$ 69088 55098 47892 63264 84718 94382 144889 101768 1799 -16937 -41380 -24577 -7459
19212g459j7300m446j4453O8277m059q356j1677J4865L9076m5696k0390N757m8
$$ -7459 -24759 -29205 -43658 24619 20560 12204 527 15392 54468 8772 -11618 -5861 -5909
19199e909j4295j2084L0279K9305k1367N229J7976K3033j0794m0508n0716k8480
$$ -5909 -20204 -32288 -2009 27296 5929 11158 29134 52167 41373 865 -49851 -78331
19187g8331K4624J4659j7401k2297N6600j1880l0865m0946K4657N5243O6389l5458
$$ -78331 -53707 -39048 -56449 -78746 -22146 -34026 -64891 -105837 -81180 -25937 40452 4994
19175D994l708L9347O556K2933J7278P2473k7456n9816J0936k2244N138k1389
$$ 4994 1286 40633 47189 70122 87400 159873 132417 72601 83537 61293 66431 45042
19163D5042l5317K8708o0279J8243M2239n5318m5360M4009K3161J5016n3212L3903
$$ 45042 9725 38433 -21846 -3603 38636 -16682 -62042 -18033 5128 20144 -33068 835
19151H35J4385n5198k9261O6276R1489k9552j4780K9268n9103j0805Q944m2181
$$ 835 15220 -39978 -69239 -2963 88526 58974 44194 73462 14359 3554 12498 -29683
19139b9683L3543J7671n2733K0702K9284k0080r684j3476l3498K6205j5581p5496
$$ -29683 3860 21531 -31202 -10500 18784 -1296 -10980 -24456 -57954 -31749 -47330 -122826
19127a22826N3022Q1333r494j0532N9766m5060J3204j7468K607k3519K6097K2212
$$ -122826 -69804 11529 2035 -8497 51269 6209 19413 1945 4552 -18967 7130 29342
19115B9342M1732l280j03030k0031p315R3917J24932P1216r5925m7213L9114m7437
$$ 29342 71074 67794 -35236 -55267 -62582 31335 156267 227483 131558 84345 123459 76022
19103G6022p5049M6588N7349L0533K2744k7828l1671K3805M8569R091n0448k0846
$$ 76022 973 47561 104910 135443 158187 130359 98688 122493 171062 180153 129705 108859
19091A08859J8521J7717M697l4745p4554m8749k2884J087R601K9810M4403K0118
$$ 108859 127380 145097 149794 115049 40495 -8254 -31138 -30051 -20450 9360 53763 73881
19079G3881k6265M0187n0011m9502j9702J4604n341m557j9825M6383K7170k6446
$$ 73881 47616 87803 37792 -11710 -31412 -16808 -22149 -26706 -46531 -148 27022 576
19067E76k1659r5594K9912K5036O3665M2873O4159j0314n0685R261j6139l2964
$$ 576 -21083 -116677 -86765 -61729 1936 44809 108968 98654 47969 57230 41091 8127
19055H127o174Q439j9238k2355K3425m479J0929j0155k2700M5718j6472L5734
$$ 8127 1953 10392 -8846 -31201 -7776 -12255 -1326 -11481 -34181 11537 -4935 30799
19043C0799N7123L9884l0155J1168m61N8232q043m6944L4617L0686J8486r994
$$ 30799 87922 127806 97651 108819 108358 166590 158547 111603 146220 176906 195392 185398
19031A85398m9562m6588r370k550m4525K7220l886j1920K2059r651P698l2029
$$ 185398 135836 89248 79878 77328 32803 60023 56137 44217 66276 56625 64323 32294
19019C2294k2496K4623O0406J4052k128k182J0589L3249l6669q0064J8030k1611
$$ 32294 9798 34421 94827 108879 106751 104569 115158 148407 111738 31674 49704 28093
19007B8093l2885j7699K8794k7469K3231J9983J751K7552L4110J5091j3585l1802
$$ 28093 -4792 -22491 6303 -21166 2065 22048 23799 51351 85461 100552 86967 55165
18995E5165l1892J2665J4070M4263j6385K2289J5264J2880Q8967K6314r4980p2436
$$ 55165 23273 35938 50008 94271 77886 100175 115439 128319 217286 243600 148620 76184
18983G6184j2268k6889j4527L8295K9468O5886o8875o7082J1942M8190M565L1906
$$ 76184 63916 37027 22500 60795 90263 156149 87274 20192 32134 80324 84889 116795
18971A16795j7309j8682l5512k4924j2128m0930M0390O0938L1691k5237k8743
$$ 116795 99486 80804 45292 20368 8240 -32690 7700 68638 100329 75092 46349
18960D6349l1884k7734R765K7201n6162j5083J1498P1304P7191L1713n2278m9771
$$ 46349 14465 -13269 -3504 23697 -32465 -47548 -36050 35254 112445 144158 91880 42109
18948D2109o167J5574l5015k5993K7483r982k8746l3738j2558l699J754p144L2585
$$ 42109 35942 51516 16501 -9492 17991 8009 -20737 -54475 -67033 -70732 -68978 -76122 -43537
18935d3537N3426O63M1655K3810m800q6093m7852N262J3793M0068K6321K1665
$$ -43537 9889 10552 52207 76017 71217 -14876 -62728 -57466 -43673 -3605 22716 44381
18923D4381M8085k5421j2307L6838n845K6255N0003N1706k8483p7424j4169K8505
$$ 44381 92466 67045 54738 91576 85731 111986 161989 213695 185212 107788 93619 122124
18911A22124Q1491J18947P5296r7458j53254j05647j0491Q4881p251K4799N6524
$$ 122124 203615 322562 397858 300400 147146 41499 31008 115889 108638 133437 189961
18900A89961j8342k9654k2317k3820p803O1153P5702k0472k1043J2766j0007M307
$$ 189961 171619 141965 119648 95828 88025 149178 224880 204408 183365 196131 186124 190431
18888A90431k4917o1239J7694J5179N000n0369o35K3656L3514J6147o524m1774
$$ 190431 165514 104275 121969 137148 142148 91779 91144 114800 148314 164461 157937 116163
18876A16163l6172O7024O3868N5509J9214j353J3876l9176m8748q130K5119j2931
$$ 116163 79991 147015 210883 266392 285606 284253 298129 258953 210205 202075 227194 214263
18864B14263L5270k1805j853K3819K3114j3603n6139J284n698J8795J4021j3485
$$ 214263 249533 227728 225875 249694 272808 259205 203066 204350 198652 217447 231468 217983
18852B17983l0478k4603J5944R8016Q8480N2699P5231M198q5675l596m7198j8629
$$ 217983 187505 162902 178846 276862 365342 418041 493272 497470 411795 408199 361001 342372
18840C42372j1575P720n6833L3749J2541j5645K9470O2652N4596J949n2663n0917
$$ 342372 330797 338517 281684 315433 327974 312329 341799 404451 459047 460996 408333 357416
18828C57416M5228Q8021N9920M2946O9021M9135J0377M4525J2668N3331L7891
$$ 357416 402644 490665 550585 593531 662552 711687 722064 766589 779257 832588 870479
18817H70479P5273L3813M9278J26429K90840M45223N31620M56823O3898l67381
$$ 870479 945752 979565 1028843 1155272 1446112 1891335 2422955 2879778 2943676 2576295
18807B576295m16508j03347k7363K7528J70408J33416J60557K78649L15065L67307
$$ 2576295 2159787 2056440 2029077 2056605 2227013 2360429 2520986 2799635 3114700 3482007
18797C482007N14677P38178J069690J328666J298289J213468J476010K379105
$$ 3482007 3996684 4734862 5804552 7133218 8431507 9644975 11120985 13500090
18789A3500090M091644O624940J0667688J9044191L5385367O2735146Q8411505
$$ 13500090 17591734 24216674 34884362 53928553 89313920 152049066 240460571
18782B40460571O8420654n555997p9914610r3514081n3948913k6635273j4173598
$$ 240460571 308881225 303325228 223410618 129896537 75947624 49312351 35138753
18775C5138753q489842n873603m122874k892497k051660j352439q67978o45798
$$ 35138753 26648911 20775308 16652434 13759937 11708277 10355838 9487860 8842062
18767H842062p73880j052345j155720r75662o69708m38748m73360m04136k16342
$$ 8842062 8068182 7015837 5860117 4884455 4214747 3775999 3302639 2898503 2682161
18758B682161n8926r9340m088J38060L29854L08680Q989m91354o71800m33959
$$ 2682161 2623235 2523895 2519807 2657867 2987721 3296401 3305390 2814036 2142236 1708277
18748A708277k09742j21888j47908j81756j10586o8275j03760r3632p3917o5719
$$ 1708277 1498535 1376647 1228739 1046983 936397 868122 764362 670730 596813 531094
18738E31094M293k4375n6988j02508l0158r797M4234r548k1240j4503m4765k0725
$$ 531094 535387 511012 454024 351516 321358 311561 355795 346247 325007 310504 265739 245014
18726B45014J8945L3278N7020K0852j1979r6582o5670j6367j7264l6459K0107
$$ 245014 263959 297237 354257 375109 363130 266548 200878 184511 167247 130788 150895
18715A50895o874M882l1541N247l1118k0671J3190j2057m933o250m483o748l9836
$$ 150895 144021 148903 117362 122609 91491 70820 84010 71953 67020 60770 56287 49539 9703
18702I703P146L1932K3968Q889k3296j5674M102K9855L6961L3339L60l6935j0115
$$ 9703 16849 48781 72749 81638 58342 42668 46770 76625 113586 146925 147285 110350 100235
18689A00235q643J381j9162j8798L153N49K1798M822l0315K498r330o523n8772
$$ 100235 91592 92973 73811 55013 58166 58715 80513 85335 55020 57518 48188 41665 -17107
18676a7107m3687L5577J4000M0399k6594M113J0420J3949j1929q5373L1546R5802
$$ -17107 -60794 -25217 -11217 29182 2588 6701 17121 31070 19141 -66232 -34686 61116
18664F1116K6446r882p7175j869p511k17M4374O9665M7112k7408p5871o0064N4230
$$ 61116 87562 77680 505 -1364 -8875 -9092 35282 104947 152059 124651 48780 -11284 42946
18651D2946P0657m9142o7552k1616L718J3415N1448k0275j1597o479m1827o5467
$$ 42946 113603 64461 -3091 -24707 -20989 -7574 43874 23599 12002 5523 -36304 -101771
18639a01771L0702L2368j0693M371N6346J0961n01l9944j0016j0280M2560N4084
$$ -101771 -71069 -38701 -49394 -45023 11323 22284 21783 -18161 -28177 -38457 4103 58187
18627E8187k5028Q278N9111J6812k3060m4364j6806N8370K7232k0302o570p8824
$$ 58187 33159 41437 100548 117360 94300 49936 33130 91500 118732 98430 91860 13036
18615A3036q7908k460K2680R150K0020L3405R77l4972o0274l2255n200L6807P1958
$$ 13036 -74872 -77332 -54652 -45502 -25482 7923 8900 -26072 -86346 -118601 -123801 -86994 -15036
18602a5036M2397L2005P957j5431l6736n6800j219j4610j348j263k6674j1992
$$ -15036 27361 59366 67323 51892 15156 -41644 -42863 -57473 -58821 -60084 -86758 -98750
18590i8750L2477K2826K1450J2359j8181K3379o245P2387n772o6303k0582m976
$$ -98750 -66273 -43447 -21997 -9638 -27819 -4440 -10685 61702 55930 -10373 -30955 -35931
18578c5931p0981q406J408N4723M1367m5038k830K2407o766n2430k313J8828N2718
$$ -35931 -106912 -115318 -113910 -59187 -17820 -62858 -65688 -43281 -50047 -102477 -104790 -85962 -33244
18565c3244Q4180L410l6182J9367K8631j052J6757k946q7806r3828L8359L4952
$$ -33244 50936 54346 18164 37531 66162 65110 81867 78921 -8885 -102713 -64354 -29402
18553b9402N592r092j7204q193K7844N102K7996p0837n349J1590K5070p915k5411
$$ -29402 -23810 -32902 -50106 -58299 -30455 -25353 2643 -68194 -73543 -61953 -36883 -44798 -70209
18540g0209k4446K1691J5563K6974l1632j9523O456k5756k4639M5392L2836K230
$$ -70209 -94655 -72964 -57401 -30427 -62059 -81582 -75126 -100882 -125521 -80129 -47293 -45063
18528d5063L887j4257o912M877J4395L2934j1259o4882K5522O5110m1807o741
$$ -45063 -41176 -55433 -62345 -57468 -43073 -10139 -21398 -86280 -60758 4352 -37455 -44196
18516d4196J8816k2039P418K0084k4246J0099L9557l907J6277n596l6393N8927
$$ -44196 -25380 -47419 -40001 -19917 -44163 -34064 5493 1586 17863 12267 -24126 34801
18504C4801L9158k9528o0673J1761j2663q012J8137P4668J2280p3835n7161k7694
$$ 34801 73959 44431 -16242 -4481 -17144 -25156 -7019 67649 79929 6094 -51067 -78761
18492g8761J7290l170o4873K7270M1795P342j2542l3306j473O9528J9962r666
$$ -78761 -61471 -64641 -129514 -102244 -60449 -53107 -65649 -98955 -100428 -30900 -10938 -20604
18480b0604j5940M5628O5709l044o9542n3171m8271m462L8073k0406l3706J7129
$$ -20604 -36544 9084 74793 71749 2207 -50964 -99235 -103697 -65624 -86030 -119736 -102607
18468a02607N4066N352L021L1957J9440k866M676k8590l0638p356P038P5349L7074
$$ -102607 -48541 -43189 -40168 -8211 11229 8363 13039 -15551 -46189 -53545 -46507 28842 65916
18455F5916j00196l0572K299J199K3105j0333L2237L2879j0377j4474l6653m0082
$$ 65916 -34280 -64852 -62553 -61354 -38249 -48582 -16345 16534 6157 -8317 -44970 -85052
18443h5052L1146l3265R552M9466N999n396j4306n6995m781o144J5778L0841o914
$$ -85052 -53906 -87171 -77619 -28153 -22154 -27550 -41856 -98851 -103632 -109776 -93998 -63157 -70071
18430g0071L9789O1986o311J389R054j8151j1345m1833m245k1400o288o2401k6365
$$ -70071 -30282 31704 25393 26782 35836 17685 6340 -35493 -39738 -61138 -67426 -129827 -156192
18417a56192M0899K8762k7962l2265l2707O6883j5475l4863K9203L4379Q274j7072
$$ -156192 -115293 -86531 -114493 -146758 -179465 -112582 -128057 -162920 -133717 -99338 -91064 -108136
18405a08136L4692j3625m2305L191M8272N4750L1639M035l4875j0443J7509K5376
$$ -108136 -73444 -87069 -129374 -126183 -77911 -23161 8478 12513 -22362 -32805 -15296 10080
18393A0080O3306M636m357k7283K151j9048o6813q288J7570J01193O487p7349
$$ 10080 73386 78022 73665 46382 48533 29485 -37328 -45616 -28046 73147 79634 2285
18381B285o5678J206J8236K4847P798l306J6398k0353k4387k2580k5501m7889
$$ 2285 -63393 -62187 -43951 -19104 -11306 -14612 1786 -18567 -42954 -65534 -91035 -138924
18369a38924P5296P5782K2050m9093n2737q089K4880j967M6543K9620j1392l9452
$$ -138924 -63628 12154 34204 -14889 -67626 -75715 -50835 -52802 -6259 23361 11969 -27483
18357b7483o5694J0857p332j7850j1559l574L3816j3281J3790Q384M5840L0902
$$ -27483 -93177 -82320 -89652 -107502 -119061 -122635 -88819 -102100 -88310 -79926 -34086 -3184
18345c184k0931J4003l2149k4243m797M2481n9L013M045m0975m9949k7880N7939
$$ -3184 -24115 -10112 -42261 -66504 -71301 -28820 -28879 -25866 -21821 -62796 -112745 -140625 -82686
18332h2686M9403J4467L8822k9603K20K7777m6968k0154N7006K8796k1607m3965
$$ -82686 -33283 -18816 20006 -9597 -9377 18400 -28568 -48722 8284 37080 15473 -28492
18320b8492L3546K5292j8814l6268N7916J8160K9313J3522k375k9145j1315k7599
$$ -28492 5054 30346 11532 -24736 33180 51340 80653 94175 91800 62655 51340 23741
18308B3741L7362R234j2756R477J7910l4278q1564j1555l973k7375J9164l7676
$$ 23741 61103 70337 57581 67058 84968 50690 -30874 -42429 -46402 -73777 -54613 -92289
18296i2289K8528K0815k7889l4599l281k1736K9162m578J9544L1036K3159L1575
$$ -92289 -63761 -42946 -70835 -105434 -108715 -130451 -101289 -105867 -86323 -55287 -32128 -553
18284e53N4897k5284k3635L6517J109j6087n3350M3271N5758j8778n9782k2071
$$ -553 54344 29060 5425 41942 43051 26964 -26386 16885 72643 53865 -5917 -27988
18272b7988N932n16k2144j0346M4435j6791n5723k929l5723L1309N3109M4123
$$ -27988 -22056 -22572 -44716 -55062 -10627 -27418 -83141 -86070 -121793 -90484 -37375 6748
18260F748J5170R749n843j5744l7972n2426j6824Q517J4997J000J5899k3913J1795
$$ 6748 21918 31667 25824 10080 -27892 -80318 -97142 -88625 -73628 -72628 -56729 -80642 -68847
18247f8847L0713l893L3521K3513P1185k010n5345q2504J7111K2587j6143n366
$$ -68847 -38134 -42027 -8506 15007 86192 84182 28837 -53667 -36556 -13969 -30112 -35478
18235c5478j2982M512K4043M0924n6774r3724j4271O9675L2389R409K972n5131
$$ -35478 -48460 -43948 -19905 21019 -35755 -129479 -143750 -74075 -41686 -32277 -29305 -84436
18223h4436k8741O1471o435k3783M5269L8041p9928k030J5392l735K8901J7500
$$ -84436 -113177 -51706 -58141 -81924 -36655 1386 -78542 -80572 -65180 -68915 -40014 -22514
18211b2514k2134o2694P507K5173m475L7048l0083K3533N4770M322j9319k7199
$$ -22514 -44648 -107342 -99835 -74662 -79137 -42089 -72172 -48639 6131 10453 -8866 -36065
18199c6065Q037l7147k5155J2934J6579j5444L8921O828r371k6655L5304L0668
$$ -36065 -28028 -65175 -90330 -77396 -60817 -76261 -37340 -30512 -39883 -66538 -31234 -566
18187e66J6514l6140Q926j8399p9923l0471J9299J1568M9219K7418K8463N7123
$$ -566 15948 -20192 -11266 -29665 -109588 -140059 -120760 -109192 -59973 -32555 -4092 53031
18175E3031J4824n813j1098r46J3837O4277M3729M4529Q1653R2533J29304K25322
$$ 53031 67855 62042 50944 49998 63835 128112 171841 216370 298023 390556 519860 745182
18163G45182K19344J34374J754j91406k57148k31727j72075l4407k7953k4216
$$ 745182 964526 1098900 1100654 909248 652100 420373 248298 213891 185938 161722
18153A61722k4701o4576j9613P7697K695n096m3758j4053k5081r852j5667O57
$$ 161722 137021 72445 52832 130529 133224 128128 84370 70317 45236 35384 19717 20374
18141B0374j2584J4000l2088O899j4470K577N2474q745P913K5064l9493J4442
$$ 20374 7790 21790 -10298 -3399 -17869 -15292 37182 28437 36350 61414 21921 36363
18129C6363J297k3512j8383j9514m5113J1687j3157J6606J399P183L7260n9407
$$ 36363 37660 14148 -4235 -23749 -68862 -57175 -70332 -53726 -52327 -45144 -7884 -67291
18117f7291k5784k0541Q0509N3744Q324l1940n3341m4005K1755o39j2915M1239
$$ -67291 -93075 -113616 -33107 20637 28961 -2979 -56320 -100325 -78570 -79209 -92124 -50885
18105e0885J1856j8821l6364j27N435L9785J0169L9659k0607l6451j263O2173
$$ -50885 -39029 -57850 -94214 -94341 -88906 -49121 -38952 707 -19900 -56351 -57614 4559
18093D559J7720n9582L3387L3734j5305k8329L1767Q263l9437K8143K3426p8168
$$ 4559 22279 -37303 -3916 29818 14513 -13816 17951 26214 -13223 14920 38346 -39822
18081c9822j4927N5569N0258j7987K6372k2929q6424K8311J9417N684M9492J0978
$$ -39822 -54749 820 51078 33091 59463 36534 -49890 -21579 -2162 3522 53014 63992
18069F3992k9405J3863N508j9662l3907o011J7500l196m5743M1726j3131m7075
$$ 63992 34587 48450 53958 34296 389 -5622 11878 8682 -37061 4665 -8466 -55541
18057e5541K8842N4238L5170j1532k8247j470r984J0429J3262j3835l1456j8678
$$ -55541 -26699 27539 62709 51177 22930 21460 11476 21905 35167 21332 -10124 -28802
18045b8802l182r758m9576j221M1877j0219L105l7857k707j9798P331p452L5670
$$ -28802 -31984 -41742 -91318 -92539 -50662 -60881 -57776 -95633 -98340 -118138 -110807 -118259 -82589
18032h2589N2377L9058J321l8494k5124K5932N5458K4313o4017L7861J202J0820
$$ -82589 -30212 8846 10167 -28327 -53451 -27519 27939 52252 -11765 26096 27298 38118
18020C8118k1708m7154j1557j6157J8584k8911K8922J4091J3816l0334P670N8297
$$ 38118 16410 -30744 -42301 -58458 -39874 -68785 -39863 -25772 -11956 -42290 -34620 23677
18008B3677K511Q543k4682K8613j8828k6491k0035M565M1584q125P396k0423j03851
$$ 23677 26188 34731 10049 38662 19834 -6657 -26692 -22127 19457 11332 18728 -1695 -105546
17995a05546r789M6870L6578J6106r443l0080P656P1005N7882k260j651m6210
$$ -105546 -115335 -68465 -31887 -15781 -25224 -55304 -47648 23357 81239 78979 77328 31118
17983C1118j07571M242R734L8935j4041j5080M3333j9471p5351M5539J1077k3251
$$ 31118 -76453 -72211 -62477 -23542 -37583 -52663 -9330 -28801 -104152 -58613 -47536 -70787
17971g0787L943k426R768k8839K500L3993L8232n3532o1023o675k6334q615J3615
$$ -70787 -66844 -69270 -59502 -88341 -85841 -51848 -13616 -67148 -128171 -134846 -161180 -169795 -156180
17958a56180M2186J7836j3538K5932K3453K1123l4674m051l1727J5284K4408r54
$$ -156180 -113994 -96158 -109696 -83764 -60311 -39188 -73862 -77913 -109640 -94356 -69948 -70902
17946g0902K1828M1624J4517J5416Q300j2562l9314K7128j4033P107L730L881
$$ -70902 -49074 -7450 7067 22483 30783 18221 -21093 6035 -7998 -891 2839 6720
17934F720m4247n0698J7505J8629M5154K8260q7556o680j6094o367O2607J1644
$$ 6720 -37527 -88225 -70720 -52091 -6937 21323 -66233 -72913 -89007 -95374 -32767 -21123
17922b1123l3062j4476J2990n959K3360N7243J0145l4775o4093L0291n131K2627
$$ -21123 -54185 -68661 -55671 -61630 -38270 18973 29118 -5657 -69750 -39459 -44590 -21963
17910b1963N7490j5284n6466m279K7750J6125J3482m8808l1046j7022l0341N0657
$$ -21963 35527 20243 -36223 -40502 -12752 3373 16855 -31953 -62999 -80021 -110362 -59705
17898e9705j690l1585m3462K9876M2061K5412j3747j8199K5837m6664K200N0125
$$ -59705 -61395 -92980 -136442 -106566 -64505 -39093 -52840 -71039 -45202 -91866 -89666 -39541
17886c9541K8897o852n501j0499k5620K998m1816k8065J10600J6971o4496K5433
$$ -39541 -10644 -17496 -22997 -33496 -59116 -56118 -97934 -125999 -15399 1572 -62924 -37491
17874c7491J0678m8302m9080K3581K4640L3312M7581k8405l1578L0315M9513o795
$$ -37491 -26813 -75115 -124195 -100614 -75974 -42662 4919 -23486 -55064 -24749 24764 17969
17862A7969p751o3525k9872N632l147l6300R5827R1983k9466r7265L471K9111
$$ 17969 10218 -53307 -83179 -77547 -80694 -116994 -21167 70816 41350 -55915 -52444 -23333
17850b3333M1617K0930k7831M5221k0655m6298j9802J391l122j4526n8864L6714
$$ -23333 18284 39214 11383 56604 35949 -10349 -30151 -28760 -31882 -46408 -105272 -68558
17838f8558P9666L6450o3914P0440k3810m9997J8702K102K2867k9136J0204l1013
$$ -68558 11108 47558 -16356 54084 30274 -19723 -1021 1081 23948 -5188 5016 -25997
17826b5997n937l8652R2267O4502p4833m6719L320M0867O1936J585m4840n8686
$$ -25997 -31934 -70586 21681 86183 11350 -35369 -32049 8818 70754 72339 27499 -31187
17814c1187l9730K1854j3657K363j497k8455r083J0444N8418L1933L6110n3458
$$ -31187 -70917 -49063 -62720 -60357 -61854 -90309 -99392 -88948 -30530 1403 37513 -15945
17802a5945n3792L607N1500l7708k2618N591n341j6621L3109J33j4924l2782J407
$$ -15945 -69737 -66130 -14630 -52338 -74956 -69365 -74706 -91327 -58218 -58085 -73009 -105791 -104384
17789a04384L3211n765Q4024L9810l2879o3153j6815L64l2330L3097M9877m4103
$$ -104384 -71173 -76938 7086 46896 14017 -49136 -65951 -65587 -97917 -64820 -14943 -59046
17777e9046k7795K1673Q427J217O4842j6395k7980O2568j334Q197L9769k4766
$$ -59046 -86841 -65168 -56741 -55524 9318 -7077 -35057 27511 26177 34374 74143 49377
17765D9377j4398k1539J110l0902M8376N0930m3640M2923K846n2702M262m3868
$$ 49377 34979 13440 14550 -16352 32024 82954 39314 82237 85083 32381 36643 -7225
17753g225K7401M0678m4050k4305m692J0902N682J8369O08m2656r042J1053K7732
$$ -7225 20176 60854 16804 -7501 -12193 -1291 4391 22760 23368 -19288 -28330 -17277 10455
17740A0455l6340k6743K1751L4881j122n667M810l4495p9355L8888O6425P3749
$$ 10455 -25885 -52628 -30877 4004 2882 -2785 2025 -32470 -111825 -72937 -6512 67237
17728F7237M7649M5730p1073Q118q851j9358l061m5073k7396l1559K8459J0199
$$ 67237 114886 160616 89543 97661 88810 69452 66391 21318 -6078 -37637 -9178 1021
17716A021l110K5773j2308m8199n7661J5793K4912k96R3066L2241L8272J834l5039
$$ 1021 -2089 23684 11376 -36823 -94484 -78691 -53779 -54075 38991 71232 109504 111338 76299
17703G6299l2016q5003k9335K3305l8079k1383K9243M122M8276L1437L4210m1520
$$ 76299 44283 -40720 -70055 -46750 -84829 -106212 -76969 -72847 -24571 6866 41076 -444
17691d44O8089K5499j2350n8648k8091l5397q644K0391K791k3016k3032k8076
$$ -444 67645 93144 80794 22146 -5945 -41342 -49986 -29595 -26804 -49820 -72852 -100928
17679a00928j125M0989K6499m3928M1973J6811j0354L8184P9k746k3361p3135
$$ -100928 -102053 -61064 -34565 -78493 -36520 -19709 -30063 8121 8200 5454 -17907 -91042
17667i1042n0522n36l448j8481K0161L5405K9622N7256R547q624L1525J4993j0417
$$ -91042 -141564 -142100 -145548 -164029 -143868 -108463 -78841 -21585 -12038 -20662 10863 25856 15439
17654A5439K547J3992L9849j1467l7767J113K8140L2956J5692k7098j6825l011
$$ 15439 17986 31978 71827 60360 22593 23706 51846 84802 100494 73396 56571 53560
17642E3560k2355l5128j4754K9860k9048j6226K6210L7233j1893l0720J7109K6512
$$ 53560 31205 -3923 -18677 11183 -17865 -34091 -7881 29352 17459 -13261 3848 30360
17630C0360l7489M3266L2786j9593q1143L2036m5622k0967K8984J1433k5255K791
$$ 30360 -7129 36137 68923 49330 -31813 223 -45399 -66366 -37382 -25949 -51204 -48413
17618d8413J8200m3299l5641K0481O2200R055j8538K6727N652J1539p791k815
$$ -48413 -30213 -73512 -109153 -88672 -26472 -17417 -35955 -9228 -3576 7963 172 -2643
17606b643J9023j0507M308o4860R039J1226j6944M5572L6700p883j7727L2464
$$ -2643 16380 5873 10181 -54679 -45640 -34414 -51358 -5786 30914 23031 5304 37768
17594C7768L529p782j8522O981m2680j3826o839j1277n361R593J6736K0577Q771
$$ 37768 41297 33515 14993 21974 -20706 -34532 -41371 -52648 -58009 -48416 -31680 -11103 -2332
17581b332k0439J3148p2452L4621N8330K8771J272K6685j0906l666l7413L0937
$$ -2332 -22771 -9623 -82075 -47454 10876 39647 40919 67604 56698 53032 15619 46556
17569D6556j5448q2589m8975j6880j479J5305J7376q133r208J2951J9254m419
$$ 46556 31108 -51481 -100456 -117336 -118815 -103510 -86134 -94267 -103475 -90524 -71270 -75689
17557g5689l8598k1931k1855K1641L9920O5656N4681l5366L9491N1266l1487o8245
$$ -75689 -114287 -136218 -158073 -136432 -96512 -30856 23825 -11541 27950 79216 47729 -20516
17545b0516K0334K8757N7490M1578k0812p326n78n5417k890L5408k4665k2443
$$ -20516 -182 28575 86065 127643 106831 99505 98927 43510 40620 76028 51363 28920
17533B8920j9222J7014P3388K809o1613q1660p986M5451k9425k5122K7777K3188
$$ 28920 9698 26712 100100 102909 41296 -40364 -48350 -2899 -32324 -57446 -29669 -6481
17521f481l1044Q722R151m314l563j665K7305N166l5317J0598k501J792J8970
$$ -6481 -37525 -28803 -19652 -23966 -27529 -29194 -1889 3277 -32040 -21442 -23943 -22151 -3181
17508c181K2709n5179l6034J4471K7181K5617r18N4826n0029k0488n577M1361
$$ -3181 19528 -35651 -71685 -57214 -30033 -4416 -5334 49492 -537 -21025 -26602 14759
17496A4759n472J20k815P527M8957L7040Q91o8590q4021l3704Q36K4466L1611
$$ 14759 9287 9407 6592 14119 63076 100116 101007 32417 -51604 -85308 -84472 -60006 -28395
17483b8395L714N9115J3778L1445k4380o5286l3683L3827J7406m5955m6346m3549
$$ -28395 -24681 34434 48212 79657 55277 -10009 -43692 -9865 7541 -38414 -84760 -128309
17471a28309P1360N7028J3833m1412o1235J2041K9523O5732q370k3072J7301j5188
$$ -128309 -56949 79 13912 -27500 -88735 -76694 -47171 18561 10191 -12881 4420 -10768
17459a0768l9071l4092j7065K8480N3339K5506k9787k5799j7351K3402K3143j7608
$$ -10768 -49839 -83931 -100996 -72516 -19177 6329 -23458 -49257 -66608 -43206 -20063 -37671
17447c7671n597K5236K2301l9503o4652o363J7287M7843L9762N9581M023j7658
$$ -37671 -43268 -18032 4269 -35234 -99886 -106249 -88962 -41119 -1357 58224 62247 44589
17435D4589n2959k8003k4670O981j9556J7671P512O24q815J0891j8559k1190L5337
$$ 44589 -8370 -36373 -61043 -54062 -73618 -55947 -48435 -47811 -56626 -45735 -64294 -85484 -50147
17422e0147k3993m556O581J0767J8441M8752l093k8153L6025K6933o3396j1574
$$ -50147 -74140 -78696 -72115 -61348 -42907 5845 2752 -25401 10624 37557 -25839 -37413
17410c7413j4909M3058K7687m081o7963o1076k2605Q6603Q5236l6623n449L16
$$ -37413 -52322 -9264 18423 14342 -53621 -114697 -137302 -50699 34537 -2086 -7535 -7219
17398g219j8214N1065j302n2680K8924J5184l1805p9907k3952P4847m4067M3374
$$ -7219 -25433 25632 24330 -28350 574 15758 -16047 -95954 -119906 -45059 -89126 -45752
17386d5752M1491J3948m737K0516J9853m9893J6392P7367L0485K747k9687p1312
$$ -45752 -4261 9687 4950 25466 45319 -4574 11818 89185 119670 122417 92730 21418
17374B1418m5810J4069j6608m9270p916P4184k6007n086M911N196k4382J8001
$$ 21418 -24392 -10323 -26931 -76201 -84117 -9933 -35940 -41026 -36115 -30919 -55301 -37300
17362c7300M8938J9275m964O8874n233o2843m3250J2201M6091j5930j2291k213
$$ -37300 11638 30913 25949 94823 89590 26747 -16503 -4302 41789 25859 13568 11355
17350A1355M9839J0020q4057n1849m8077j7503j2818J7098K7046O0614Q6062L4691
$$ 11355 61194 71214 -12843 -64692 -112769 -130272 -143090 -125992 -98946 -38332 47730 82421
17338H2421k4104o1514j3649M5310j0162o59j8911N8214L5673j0274L908l0428
$$ 82421 58317 -3197 -16846 28464 18302 17643 -1268 56946 92619 82345 86253 55825
17326E5825m0247J2426N3203j8322m5913p497m437K0161j1513l1646r136r846
$$ 55825 15578 28004 81207 62885 16972 9475 5038 25199 13686 -17960 -27096 -36942
17314c6942j6216K979O1832M3446J0143q0434o619K1045l4612J6277J2613l1900
$$ -36942 -53158 -50179 11653 55099 65242 -15192 -21811 -766 -35378 -19101 -6488 -38388
17302c8388L6549J5739k1210L4956J0964k3775l2275J0051k8170l0808P50j9444
$$ -38388 -1839 13900 -7310 27646 38610 14835 -17440 -7389 -35559 -66367 -65617 -85061
17290h5061l475j1789n9453K7182R0058j891P125j0507j1636j9480L5453M9309
$$ -85061 -88536 -100325 -159778 -132596 -42538 -44429 -37304 -47811 -59447 -78927 -43474 5835
17278E835r163j4185m3048L5776k3807p4495M62K5685N4861N9112o8658l8912
$$ 5835 -3328 -17513 -60561 -24785 -48592 -123087 -122625 -96940 -42079 17033 -51625 -90537
17266i0537j935P448l8790M9435J3655J900j4874n0779K53K0731L7168j1757p922
$$ -90537 -92472 -85024 -123814 -74379 -60724 -58824 -73698 -124477 -124224 -103493 -66325 -78082 -86004
17253h6004P586K0604J5363K3839P191M9214k7801n4452q3829l1712P0884J3597
$$ -86004 -78418 -57814 -42451 -18612 -11421 37793 9992 -44460 -128289 -160001 -89117 -75520
17241g5520K9933l7386N6537J02028M1390m0149l1897Q823M476l6861l0979n4376
$$ -75520 -45587 -82973 -26436 75592 116982 76833 44936 53759 58235 21374 -9605 -63981
17229f3981J1117K5902k094n7398K455L9828J2091l1017p117m6904M5024o746
$$ -63981 -52864 -26962 -29056 -86454 -83999 -44171 -32080 -63097 -70214 -117118 -72094 -78840
17217g8840k8932J21n4387J9054K9859K4881Q1358J345O62k6461j2002N38Q2738
$$ -78840 -107772 -107651 -162038 -142984 -113125 -88244 -6886 -5541 -4879 -31340 -43342 -42804 39934
17204C9934o262m3412r858j4488J359j615K4239K6345r664l2619n0614N0818K1978
$$ 39934 33672 -9740 -19598 -34086 -32727 -34342 -10103 16242 6578 -26041 -76655 -25837 -3859
17191c859L7239J8399j8813M25k7645K3275l8431j1655l965k7254L4594M2715
$$ -3859 33380 51779 32966 33391 5746 29021 -9410 -21065 -25030 -52284 -17690 25025
17179B5025k398J5894L7134m0728k3094j6351j9833n316q483m3578K3409L3217
$$ 25025 22627 38521 75655 34927 11833 -4518 -24351 -29667 -38150 -81728 -58319 -25102
17167b5102l8564k0920K1734r670L3398J2246k3036K5880k6271n452P6825L7255
$$ -25102 -63666 -84586 -62852 -72522 -39124 -26878 -49914 -24034 -50305 -55757 21068 58323
17155E8323j0277j0153m0696l9748n7663K4913j136M4153k4904o1453k9201M2752
$$ 58323 48046 37893 -2803 -42551 -100214 -75301 -76437 -32284 -57188 -118641 -147842 -105090
17143a05090N3952M2575L0958m983j7330R46n091P712O051l3142l283j9999J8862
$$ -105090 -51138 -8563 22395 17412 82 1028 -4063 3649 9700 -23442 -26725 -46724 -27862
17130b7862P554M7959N7595J52l3686J299k6429o0582j1498O7007L3030k9098
$$ -27862 -20308 27651 85246 85398 51712 53011 26582 -34000 -45498 21509 54539 25441
17118B5441l0340j023P022k6584L1144M8660M554L7393m174m6293l8851k5566
$$ 25441 -4899 -5922 1100 -25484 5660 54320 58874 96267 92093 45800 6949 -18617
17106a8617l9319K2826L8162l8530j0923R417O0458L2628l1745n6462n9183q033
$$ -18617 -57936 -35110 3052 -35478 -46401 -36984 23474 56102 24357 -32105 -91288 -99321
17094i9321R811R8904O3956M638n6052l2343o413J1505n4870J2238K9023M4133
$$ -99321 -89510 9394 73350 77988 21936 -10407 -16820 -5315 -60185 -47947 -18924 25209
17082B5209r566l2159R436l7667J9316J3669K6688o351k9566m6089J4602J5498
$$ 25209 15643 -16516 -7080 -44747 -25431 -11762 14926 8575 -20991 -67080 -52478 -36980
17070c6980J2627N3309M6795j2584K6346j7885Q235L0276q3234k5814J8835k68
$$ -36980 -24353 28956 75751 63167 89513 71628 79863 110139 26905 1091 19926 19658
17058A9658j7310j0491J3602j4893m0798J0638Q001L1057j6751j6842j6886o037
$$ 19658 2348 -8143 5459 -9434 -50232 -39594 -31593 -536 -17287 -34129 -51015 -57052
17046e7052L255L8003K8779P153J0758r61O016N42m2144R029N9628N7P579m2438
$$ -57052 -53797 -15794 12985 20138 30896 29935 35951 36493 -5651 3378 63006 63063 70642 28204
17032B8204k6120p087K3047J8871J376k3389p288j686m490k3496p6258l6197M0732
$$ 28204 2084 -5003 18044 36915 38291 14902 7614 5928 1438 -22058 -98316 -134513 -93781
17019i3781P2623R536J7511J9043j0801n0417o6698o0868k7416k1846Q9676N9532
$$ -93781 -21158 -11622 5889 24932 14131 -36286 -102984 -163852 -191268 -213114 -123438 -63906
17007f3906j5419r860K7087l7602J6011L9607o7186K1796N1355j8991O126j6631
$$ -63906 -79325 -89185 -62098 -99700 -83689 -44082 -111268 -89472 -38117 -57108 -50982 -67613
16995f7613M6820N2242j3520J3999K132m2958j9624n464k5352k947K6193J2759
$$ -67613 -20793 31449 17929 31928 34060 -8898 -28522 -33986 -59338 -62285 -36092 -23333
16983b3333l0287J4914q179r940M8358l3278p8905K707K0403q395P0972R0772
$$ -23333 -53620 -38706 -46885 -56825 -8467 -41745 -120650 -117943 -97540 -105935 -34963 55809
16971E5809o9641k3458j4805j9617P1676K5415k9273m1589j1647P85q228L6106
$$ 55809 -13832 -37290 -52095 -71712 -36 25379 -3894 -45483 -57130 -56345 -64573 -28467
16959b8467n8237K5966n2941M1553N7033o3836k5027J3477M1472L7668J4367J6977
$$ -28467 -86704 -60738 -113679 -72126 -15093 -78929 -103956 -90479 -49007 -11339 3028 20005
16947B0005j8171l5426m2509m838N3741J2915m4628m3334K9360k0830L6697O1624
$$ 20005 1834 -33592 -76101 -80939 -27198 -14283 -58911 -102245 -72885 -93715 -57018 4606
16935D606L15k7192l8940J8813Q3393K6961m387L3102n6883l4319J8551L1875
$$ 4606 4921 -22271 -61211 -42398 40995 67956 63569 96671 39788 5469 24020 55895
16923E5895l0718N2631l6246k0261J0018M9270L3766l7724K6675N4809n9324o1624
$$ 55895 25177 77808 41562 21301 31319 80589 114355 76631 103306 158115 98791 37167
16911C7167R159J4470m458M926n8675k5585K8856N4776k9266n1619k3079L0073
$$ 37167 46326 60796 56338 61264 2589 -22996 5860 60636 31370 -20249 -43328 -13255
16899a3255K9080N218n268k2126R171K5538q0591J681N2371J737K1637L2129K0063
$$ -13255 15825 21043 15775 -6351 2820 28358 -52233 -50552 1819 3556 25193 57322 77385
16886G7385j5406j0653J0056l6465j3558m1807l4153n947P6914M1697j0859j9044
$$ 77385 61979 51326 61382 24917 11359 -30448 -64601 -70548 6366 48063 37204 18160
16874A8160r354l706n2531j3742M9047m332L1098J7814n294L3001L226n5107k5455
$$ 18160 8806 5100 -47431 -61173 -12126 -16458 14640 32454 27160 60161 63387 8280 -17175
16861a7175P332O709m8570J2034M5596j2053j1891N4081J0667n3046K2389M9141
$$ -17175 -9843 -3134 -51704 -39670 5926 -6127 -18018 36063 46730 -6316 16073 65214
16849F5214j7548m0540n7998m6884P0071J03588L1413o5905j07277n4443L894
$$ 65214 47666 7126 -50872 -97756 -27685 75903 107316 41411 -65866 -120309 -116415
16838a16415M3855L6572n491q911M38J2466k2329m8085J4973k0508J4591R1944
$$ -116415 -72560 -35988 -41479 -50390 -49952 -37486 -59815 -107900 -92927 -113435 -98844 -6900
16826f900K793k1787l7724L705R0178K0609j6088K3114p479j6629j8198N061L1250
$$ -6900 -4107 -25894 -63618 -59913 30265 50874 34786 57900 50421 33792 15594 20655 51905
16813E1905o6727J9671N2930k8136l0637j5245m831m0166J1002O6465R576l8163
$$ 51905 -14822 4849 57779 29643 -994 -16239 -21070 -61236 -50234 16231 25807 -12356
16801a2356q577j3598j2902L3618M2257k5633n2764J7356L3900K2741j0336q2738
$$ -12356 -20933 -34531 -47433 -13815 28442 2809 -49955 -32599 1301 24042 13706 -69032
16789f9032j4140O7469J0079j5068J8878K7901k5930N8610K0762K1399p990n4907
$$ -69032 -83172 -15703 -5624 -20692 -1814 26087 157 58767 79529 100928 92938 38031
16777C8031j10023K0158j7823n4159L5532J4506J2909O502K0248K6455k9953l97
$$ 38031 -71992 -51834 -69657 -123816 -88284 -73778 -60869 -54367 -34119 -7664 -37617 -38014
16765c8014K4298N3745p5518o2891m703Q355O3510M6012l8408k1599N526j8820
$$ -38014 -13716 40029 -35489 -98380 -103083 -94728 -31218 14794 -23614 -45213 -39687 -58507
16753e8507K0194L8544K0462n190K1087n6987m1044K017J3883O813k3476m2330
$$ -58507 -38313 231 20693 15503 36590 -20397 -61441 -59424 -45541 -38728 -62204 -104534
16741a04534p023N5803M9027R852O70L212M421k6215n1256R442M0260j3570k229
$$ -104534 -111557 -55754 -6727 3125 3795 7007 11428 -14787 -66043 -56601 -16341 -29911 -32140
16728c2140k2961l1045k2765L2719K2645M8498J201K0468J320K361j4095J6126
$$ -32140 -55101 -86146 -108911 -76192 -53547 -5049 -3848 16620 17940 20301 6206 22332
16716B2332k0p6758K6902N0600K3125k3669M9647L8621j0846M0651q0797m1522
$$ 22332 22312 -54446 -27544 23056 46181 22512 72159 110780 99934 140585 59788 18266
16704A8266K2278n2583L642m4259m7281J6612j0579N9629N352j8159J5354N329
$$ 18266 40544 -12039 -8397 -52656 -99937 -83325 -93904 -34275 -28923 -47082 -31728 -26399
16692b6399l30l0288k275N032j8265L687M7642J7106m709k9570N1479O2998J5424
$$ -26399 -26729 -57017 -59292 -54260 -72525 -68838 -21196 -4090 -8799 -38369 13110 76108 91532
16679I1532l3128l6833K8266k7515m7722J9235N0412m6188K8434L2202p592N3451
$$ 91532 58404 21571 49837 22322 -25400 -6165 44247 -1941 26493 58695 51103 104554
16667A04554J1847p4303n9735q030l8027K666K3851N8623O490l9592p133M503
$$ 104554 116401 42098 -17637 -25667 -63694 -61028 -37177 21446 27936 -11656 -18789 -14286
16655a4286M3319k5989M0818K3726j5768j6578K4946j3311o5495K8146K2459p2611
$$ -14286 29033 3044 43862 67588 51820 35242 60188 46877 -18618 9528 31987 -40624
16643d0624n9286J0355O9854L6334K7603K8776M1985L8514k3953r7917p3330R215
$$ -40624 -99910 -89555 -19701 16633 44236 73012 114997 153511 129558 31641 -41689 -32474
16631c2474M68K2957P831l9227k1086N182J686K1068k7622j3298Q197M1070J6255
$$ -32474 -32006 -9049 -1218 -40445 -61531 -56349 -54663 -33595 -61217 -74515 -66318 -25248 -8993
16618h993M049K435L8272J6123n899j569l595m1801Q53J7797J1976l6758P4369
$$ -8993 -4944 -2509 35763 51886 45987 44418 40823 -978 -125 17672 29648 -7110 67259
16605F7259L2141j5370m3073p3475j7679k3911k8516m4721l9256n446M2923P0314
$$ 67259 99400 84030 40957 -32518 -50197 -74108 -102624 -147345 -186601 -192047 -149124 -78810
16593g8810m874n2531K5609O6345j4341L7559K1591l7474k0275K712J3067N3189
$$ -78810 -83684 -136215 -110606 -44261 -58602 -21043 548 -36926 -57201 -54489 -41422 11767
16581A1767J4288j1397k1792K0159l1608k6146K6732P4113k475q30m5532j3373
$$ 11767 26055 14658 -7134 13025 -18583 -44729 -17997 56116 53641 52811 7279 -6094
16569f094P997n8004m5681N3720k2360Q177l451j169l2952L392K1676P182j771
$$ -6094 1903 -56101 -101782 -48062 -70422 -62245 -65696 -66865 -99817 -96425 -74749 -67567 -69338
16556f9338K7261j9388J284r48J350k6651m7996J0236R325M1205P7051J2109k4160
$$ -69338 -42077 -61465 -60181 -61129 -59779 -86430 -134426 -124190 -114865 -73660 3391 15500 -8660
16543h660P6105M4728j3278J2421m603m7377m7115l3943L9956M9902m5015j9602
$$ -8660 67445 112173 98895 111316 106713 59336 12221 -21722 18234 68136 23121 3519
16531C519K6806j4693J010J0592N615l6040J3554J2581J2601m1154l0289J6612
$$ 3519 30325 15632 16642 27234 32849 -3191 10363 22944 35545 -5609 -35898 -19286
16519a9286L8589r719n2290m2086j9550P1089J4409j1721K7777l351J0956l9853
$$ -19286 19303 9584 -42706 -84792 -104342 -33253 -18844 -30565 -2788 -6139 4817 -35036
16507c5036j7463P896k7894k2670K2854M1810J1453j7566k7525M1423P853k0968
$$ -35036 -52499 -44603 -72497 -95167 -72313 -30503 -19050 -36616 -64141 -22718 -14865 -35833
16495c5833l0229M1213Q5491P4937o0669p3649p5809J1822R183q98l0078J3803
$$ -35833 -66062 -24849 60642 135579 74910 1261 -74548 -62726 -53543 -54441 -84519 -70716
16483g0716J6780O588Q5345M2237n6772j0889q71k2244m3116J8770P243M594M5890
$$ -70716 -53936 -47348 37997 80234 23462 12573 11702 -10542 -53658 -34888 -27645 -23051 22839
16470B2839n2257o5382K2752K2130N0836O0170m0641j722L2125K1527M8058m9095
$$ 22839 -29418 -94800 -72048 -49918 918 61088 20447 18725 50850 72377 120435 71340
16458G1340k8337J2566k550r584m5076j2220K9341l0623k5947n380N362P4052
$$ 71340 43003 55569 53019 43435 -1641 -13861 15480 -15143 -41090 -46470 -41108 32944
16446C2944O7984j8792m4994L0639J4148l4891k7753m7308J6088J7089Q365l2301
$$ 32944 100928 82136 37142 67781 81929 47038 19285 -28023 -11935 5154 13519 -18782
16434a8782N8427O4127n5604r1607k4240R265L9270L2102N450L8574m81j1443
$$ -18782 39645 103772 48168 -43439 -67679 -58414 -19144 12958 18408 56982 56501 45058
16422D5058J8038J1485l9489l7261n8341J0198L8307Q9126O581n1154o8632k8903
$$ 45058 63096 74581 35092 -2169 -60510 -50312 -12005 77121 83702 32548 -36084 -64987
16410f4987L808N8142L5228l9134K606q242K3560J3241Q491r5225l4604L0129
$$ -64987 -61179 -3037 32191 -6943 -4337 -12579 10981 24222 32713 -62512 -97116 -66987
16398f6987L7944J704K6476J0122l6611l0236k5378j5422R1710N7344p095K6447
$$ -66987 -29043 -27339 -863 9259 -27352 -57588 -82966 -98388 -6678 50666 43571 70018
16386G0018r255J644k6313Q791k1286q1954l1775m5797K3072O9235J97K583j842
$$ 70018 60763 62407 36094 44885 23599 -58355 -90130 -135927 -112855 -43620 -43423 -40840 -42682
16373d2682K8875j0589M8841K5421R43q92Q19J3648L4884J8698n4304m1922l9474
$$ -42682 -13807 -24396 24445 49866 50809 49917 50736 64384 99268 117966 63662 21740 -17734
16360a7734j4747o943J4853M7131L4386J6333m7458J3284L115l1217p333R721
$$ -17734 -32481 -39424 -24571 22560 56946 73279 25821 39105 42220 11003 3670 13391
16348A3391m4274j0620L5533K1045L1011J8566m5312k6433Q902L1738k1466J7391
$$ 13391 -30883 -41503 -5970 15075 46086 64652 19340 -7093 1809 33547 12081 29472
16336B9472K1353j561k5624n1680K6253M6393j4830q9460m8761J9587N1963k4121
$$ 29472 50825 49264 23640 -28040 -1787 44606 29776 -59684 -108445 -88858 -36895 -61016
16324f1016P699M4553k4575M2651J3513Q026j2062J5887O0097J1398l787k1463
$$ -61016 -53317 -8764 -33339 9312 22825 30851 18789 34676 94773 106171 102384 80921
16312H0921p6105k8465m4675p382M6632N2048k6000m3303J1075L863l7703K4540
$$ 80921 4816 -23649 -68324 -75706 -29074 22974 -3026 -46329 -35254 -31391 -69094 -44554
16300d4554K7082M2352m7762O216L1800j251n2668j8611J9300L3123l1036K4392
$$ -44554 -17472 24880 -22882 -16666 15134 13883 -38785 -57396 -38096 -4973 -36009 -11617
16288a1617k8036L3311J6338l0583k5674J6076L7340l2441J6555L4244j9186k2090
$$ -11617 -39653 -6342 9996 -20587 -46261 -30185 7155 -25286 -8731 25513 6327 -15763
16276a5763N0960k2326k1560n5311m0244J5604N7031o670l995l7296J6015K5856
$$ -15763 35197 12871 -8689 -64000 -104244 -88640 -31609 -38279 -42274 -79570 -63555 -37699
16264c7699k296k1957K2596L4225r551k5246M6468l8409l8290K169O7049J9150
$$ -37699 -39995 -61952 -39356 -5131 -14682 -39928 6540 -31869 -70159 -67990 -941 18209
16252A8209N4875q43j1388K8376l7586m8457j4781j4691M4160L2735K1720l0090
$$ 18209 73084 72241 60853 89229 51643 3186 -11595 -26286 17874 50609 72329 42239
16240D2239k9997m5186l9882J4148o794R635l6693O1943L7302j4581l7184k3596
$$ 42239 12242 -32944 -72826 -58678 -65472 -55837 -92530 -30587 6715 -7866 -45050 -68646
16228f8646M230K3615K1702K1976P613j0048J1180K1021J8955K202l910j3443
$$ -68646 -64416 -40801 -19099 2877 10490 442 11622 32643 51598 53800 49890 36447
16216C6447m988q45m1444k9577K3930j9746k1853L2790M2154L0623k1237P665
$$ 36447 31459 30614 -10830 -40407 -16477 -36223 -58076 -25286 16868 47491 26254 33919
16204C3919J2018K2072M923j719l007r2468m9413l3885Q4557P1737n8489k0136
$$ 33919 45937 68009 72932 71213 68206 -24262 -73675 -107560 -23003 48734 -9755 -29891
16192b9891K3608M5686l9523p2478l7386O5752J5034j3399k1978q307K9044L6735
$$ -29891 -6283 39403 -120 -72598 -109984 -44232 -29198 -42597 -64575 -72882 -43838 -7103
16180g103l1612l0750j8948J2934K5737N9647N4041j8639k1357p7735N4905J0382
$$ -7103 -38715 -69465 -88413 -75479 -49742 9905 63946 45307 23950 -53785 1120 11502
16168A1502k4368j9836J2527m697j7544P342J3960K206M1684K5472k369J3028
$$ 11502 -12866 -32702 -20175 -24872 -42416 -35074 -21114 -18908 22776 48248 45879 58907
16156E8907l1397o8097r1045L6250J33655L7834l4416Q408n9681k5373J880k7768
$$ 58907 27510 -40587 -131632 -95382 38273 76107 41691 50099 -9582 -34955 -33075 -60843
16144f0843J5655J5356j9921l1035M0382N3510N9034n5807m5159N3968n010J2015
$$ -60843 -45188 -29832 -49753 -80788 -40406 13104 72138 16331 -28828 25140 20130 32145
16132C2145N4515l0137k2249o9022J2849N732J84k1619k8187K7761J5449N0677
$$ 32145 86660 56523 34274 -34748 -21899 -16167 -15983 -37602 -65789 -38028 -22579 28098
16120B8098o294N1170j199k8915m0184k0646l6440k6496j6458J2462R3635R925
$$ 28098 21804 72974 71775 42860 2676 -17970 -54410 -80906 -97364 -84902 8733 18658
16108A8658l7266N210O2204N649j1798m2527l3940o209r822N781o93K4975l6679
$$ 18658 -18608 -13398 48806 54455 42657 130 -33810 -40019 -49841 -44060 -44753 -19778 -56457
16095e6457l5265k4871K5848O9568J7068L6798q366k1513l1537j0303m0338m7066
$$ -56457 -91722 -116593 -90745 -21177 -4109 32689 24323 2810 -28727 -39030 -79368 -126434
16083a26434k3955P0829P4220k9511j3577k1790M0744J1885L8178j2713n4412
$$ -126434 -150389 -79560 -5340 -34851 -48428 -70218 -29474 -17589 20589 7876 -46536
16072d6536j5983q862j063Q461k7992j7953P8166O4903L854j514j8948k3281j1068
$$ -46536 -62519 -71381 -72444 -63983 -91975 -109928 -31762 33141 36995 35481 16533 -6748 -17816
16059a7816m5030J8843L0746m0464q446R761J6958N0879p30J0084n5283k9127
$$ -17816 -62846 -44003 -13257 -53721 -62167 -52406 -35448 15431 14701 24785 -30498 -59625
16047e9625L5904K8308K7558N6355K2267n7922n1687k2228M0110J9644p259n7197
$$ -59625 -23721 4587 32145 88500 110767 52845 1158 -21070 19040 38684 31425 -25772
16035b5772j894K1845m3598n2987K5258O9456J1392k1400K6764J3558n5871L2200
$$ -25772 -27666 -5821 -49419 -102406 -77148 -7692 3700 -17700 9064 22622 -33249 -1049
16023a049L2736j5753P913L3855L508o5477k3761m9043P6653O9975n297J2402
$$ -1049 31687 15934 23847 57702 61210 -4267 -28028 -77071 -418 69557 64260 76662
16011G6662o879Q093O660n6549n06K1683k4056k3468k2823o567K1859k9832o299
$$ 76662 69783 77876 84536 27987 27481 49164 25108 1640 -21183 -27750 -5891 -35723 -42022
15998d2022J0832O3908N5019q5677n7984M3337O0680M0939m102k2514L9061n4171
$$ -42022 -31190 32718 87737 2060 -55924 -12587 48093 89032 84930 62416 101477 47306
15986D7306k2911J7693k8573k0359L2869n2129o4553O2133K9032l942O1708M01
$$ 47306 24395 42088 13515 -6844 26025 -26104 -90657 -28524 508 -3434 58274 58675
15974E8675k3046K385j1213L042j0851n1220l3161l5659o299L8164P0820P496
$$ 58675 35629 38014 26801 29843 18992 -32228 -65389 -101048 -107347 -69183 1637 9133
15962I133m7938p47j4884Q129K924K2707j4341L6783O589p132k6953M4459L6353
$$ 9133 -38805 -39552 -54436 -46307 -43383 -20676 -35017 1766 8355 1223 -25730 18729 55082
15949E5082J9796m2680p1225J0666L1556k7043m0396l4267K8719Q1523N369l5200
$$ 55082 74878 32198 -39027 -28361 3195 -23848 -64244 -98511 -69792 11731 17100 -18100
15937a8100J7351j3369m5938K5522n3638j8833M4500P9164L959m7833j6424l06
$$ -18100 -749 -14118 -60056 -34534 -88172 -107005 -62505 16659 20618 -27215 -43639 -43945
15925d3945J1904j1871j6408L8219J7676K4410K2088o9474L2121L6086j3144k356
$$ -43945 -32041 -43912 -60320 -22101 -4425 19985 42073 -27401 4720 40806 27662 25306
15913B5306k3416k4954p34p036j2104O7658N1418n4949m3767l5266K8591J7948
$$ 25306 1890 -23064 -23798 -30834 -42938 24720 76138 21189 -22578 -57844 -29253 -11305
15901a1305n8567k4189L7735M590n2616j4192N4658O769J2818M8025K6089L2840
$$ -11305 -69872 -94061 -56326 -51736 -104352 -118544 -63886 -57117 -44299 3726 29815 62655
15889F2655m7723q9841k8555L7702Q1434K9629O926k1925k8453j8114r920o2715
$$ 62655 14932 -74909 -103464 -65762 15672 45301 52227 30302 1849 -16265 -26185 -88900
15877h8900l5175M4166M9207j5512J0236K5677Q216K1841n3184l2031n458J2907
$$ -88900 -124075 -79909 -30702 -46214 -35978 -10301 -2085 19756 -33428 -65459 -70917 -58010
15865e8010J8821l808o835N191n4695L3429O3807l6132R087j1832K7334q516q4752
$$ -58010 -39189 -42997 -49832 -44641 -99336 -65907 -2100 -38232 -29145 -40977 -13643 -22159 -106911
15852a06911p445Q2475L5168J0971K2136J6104K8635o5776n3349l1886M5027P839
$$ -106911 -114356 -31881 3287 14258 36394 52498 81133 15357 -37992 -69878 -24851 -17012
15840a7012n4429M8088O7192K6092N338m214o4139n3433J8550O8752P4854Q01
$$ -17012 -71441 -23353 43839 69931 75269 71055 6916 -46517 -27967 40785 115639 116440
15828A16440p5654J5577Q205l0172Q827l1692J1483k6929N171O8462p507o29K320
$$ 116440 40786 56363 64568 34396 43223 11531 23014 -3915 1256 69718 62211 61582 63902
15815F3902l5721l720O3461j8602K998l5898L8628K0740j8900j4879l5365K8803
$$ 63902 28181 24461 87922 69320 72318 36420 75048 95788 76888 62009 26644 55447
15803E5447L684n0605k4157m606m8655P998K2718L818L5597J821q7743L3443M6711
$$ 55447 59131 8526 -15631 -20237 -68892 -60894 -38176 -34358 1239 3060 -84683 -51240 -4529
15790d529M5310P995L136J4901k3670M736l5658j6681k4542m4798r3556J8374
$$ -4529 40781 48776 51912 66813 43143 47879 12221 -4460 -29002 -73800 -167356 -148982
15778a48982P7988J2759j8817j1420J554J9544O8247M6064J7785o4020p5842K3290
$$ -148982 -70994 -58235 -77052 -88472 -86918 -67374 873 46937 64722 702 -75140 -51850
15766e1850N0528l9633j0493L5360j2900j5225M9341L000J1400J1997q315m7789
$$ -51850 -1322 -40955 -51448 -16088 -28988 -44213 5128 8128 19528 31525 23210 -24579
15754b4579J895L3661K8408k3528j7539K3380k3277n9998n3589l0200J5830R1350
$$ -24579 -22684 10977 39385 15857 -1682 21698 -1579 -61577 -115166 -145366 -129536 -38186
15742c8186K0029m6925J0246L1913J9589q607p235R521L0747K4130L9035j4297
$$ -38186 -18157 -65082 -54836 -22923 -3334 -11941 -19176 -9655 21092 45222 84257 69960
15730F9960l4603l2120l8697L7725J5352k9938j7748J1317J00802K3480n6684
$$ 69960 35357 3237 -35460 2265 17617 -12321 -30069 -18752 82050 105530 48846
15719D8846l2851k2411K6744L2350n4227j6185N3491J106l2860o424p545N805
$$ 48846 15995 -6416 20328 52678 -1549 -17734 35757 36863 4003 -2421 -9966 -4161
15707d161j9739p774L4476J3463n001k3879j3941l1885k8413K3814K8839K9518
$$ -4161 -23900 -31674 2802 16265 11264 -12615 -26556 -58441 -86854 -63040 -34201 -4683
15695d683L7645j6248n5338o5018k8503j0397M6554J07975j1392o6972M742K4283
$$ -4683 32962 16714 -38624 -103642 -132145 -142542 -95988 11987 595 -66377 -61635 -37352
15683c7352j2396j0421L8361N714j7415K9031M9118R112p1034p9940M2816K3160
$$ -37352 -49748 -60169 -21808 -16094 -33509 -4478 44640 53752 -17282 -97222 -54406 -31246
15671c1246k3794r202j5640K9980L8371k7303L831j2360l3082o405M78M9200P8131
$$ -31246 -55040 -64242 -79882 -49902 -11531 -38834 -35003 -47363 -80445 -86850 -86372 -37172 40959
15658D0959M2548j6494m4000K9815M222q2289j0076k5122O1797M4980n1540j1514
$$ 40959 83507 67013 23013 52828 57050 -25239 -35315 -60437 1360 46340 -5200 -16714
15646a6714N8061L6397m3614p6501J2255N3374j1688M2115l1642k6645o5443P890
$$ -16714 41347 77744 34130 -42371 -30116 23258 11570 53685 22043 -4602 -70045 -62155
15634f2155K5855K8953K3146k5127k0850k9889o410P3434J1922j5457n0431L030
$$ -62155 -36300 -7347 15799 -9328 -30178 -60067 -66477 6957 18879 3422 -47009 -43979
15622d3979Q2383L2960j7488Q379j977l5880l7522L7291k1305p994J8311J8553
$$ -43979 38404 71364 53876 62255 60278 24398 -13124 24167 2862 -5132 13179 31732
15610C1732K2179K6649n2268p6794K4448J0329j9238k9062o56J7666O4212q392
$$ 31732 53911 80560 28292 -48502 -24054 -13725 -32963 -62025 -62681 -45015 19197 10805
15598A0805j8945j3179M1877K3640m7665m072m3843l1877K5308J0855p594l6277
$$ 10805 -8140 -21319 20558 44198 -3467 -7539 -51382 -83259 -57951 -47096 -54690 -90967
15586i0967j4348O0097J7556L0256l9332N503l3306k9862J9299Q737L1821O5844
$$ -90967 -105315 -45218 -27662 2594 -36738 -31235 -64541 -94403 -75104 -66367 -34546 31298
15574C1298M4519l6074l7866L1825j1564m0512m2412M7939O3023k7846n6981L8206
$$ 31298 75817 39743 1877 33702 22138 -18374 -60786 -12847 50176 22330 -34651 3555
15562C555K6243j3834M0872L1233o4258m1126k076M194l7374Q534L0282q601J5659
$$ 3555 29798 15964 56836 88069 23811 -17315 -19391 -15197 -52571 -44037 -13755 -22356 -6697
15549f697L2434k2443j1486M7459K815n8533j8921j9129L689K7101j0797l1141
$$ -6697 25737 3294 -8192 39267 42082 -16451 -35372 -54501 -50812 -23711 -34508 -65649
15537f5649m287J3528K1043K0358O296m73n407o2374p454J3080k5619L0520P0069
$$ -65649 -69936 -56408 -35365 -15007 -8711 -9184 -14591 -76965 -84419 -71339 -96958 -66438 3631
15524C631J6934n020L5482K5735j7315J2345n2698l3700j4786J054o940L290Q3291
$$ 3631 20565 15545 51027 76762 59447 71792 19094 -14606 -29392 -28338 -35278 -31988 51303
15511E1303M8722l0517l7581j5546L1291m3556r7159n3701N2254M4642n5813o548
$$ 51303 100025 69508 31927 16381 47672 4116 -93043 -146744 -94490 -49848 -105661 -112209
15499a12209J11840R0331J8750l3374m4469P253J1569L1740J9644j8253r049j2275
$$ -112209 -369 89962 108712 75338 30869 38122 49691 81431 101075 82822 73773 61498
15487F1498k9573p0486m2252M378k5177M2000N6064K1707L6138J4413M773o0244
$$ 61498 31925 -38561 -80813 -76435 -101612 -59612 -3548 18159 54297 68710 73483 13239
15475A3239j0723J2732j7214l1495k0277J3868j1835K277j6450M5052j6989k1492
$$ 13239 2516 15248 -1966 -33461 -53738 -39870 -51705 -49428 -65878 -20826 -37815 -59307
15463e9307n4752J4575L1496M8862L1715M7581M3919n0552J414j1901j0621M1275
$$ -59307 -114059 -99484 -67988 -19126 12589 60170 104089 53537 54951 43050 32429 73704
15451G3704l4005n6460k6638k9217Q1819j8567o3333l9640j984K621M0825R3K3382
$$ 73704 39699 -16761 -43399 -72616 9203 -9364 -72697 -112337 -114321 -111700 -70875 -70782 -47400
15438d7400N0323K6789l3038j12516k0785M0871J3016k069O186N989M5903J6712
$$ -47400 2923 29712 -3326 -115842 -136627 -95756 -82740 -84809 -78623 -72634 -26731 -10019
15426a0019r434k2635j5324M4263L329m9350m288K7911K3052q504M874M7131j1823
$$ -10019 -19453 -42088 -57412 -13149 -9820 -59170 -63458 -35547 -12495 -20999 -16125 31006 19183
15413A9183k9243k2285M2644O6387O917n195L021J360N4410R326m5705o1817Q219
$$ 19183 -10060 -32345 10299 76686 83603 78408 81429 82789 137199 146525 100820 39003 47222
15400D7222j1049o6259p4003L3029J2237L9005J8841m0821n468L0422j4171M4884
$$ 47222 36173 -30086 -104089 -71060 -58823 -19818 -977 -41798 -47266 -16844 -31015 13869
15388A3869M2883N30L6783p5655m4634r236M2654J8293m0041m7370j9672L188
$$ 13869 56752 57282 94065 18410 -26224 -35460 7194 25487 -14554 -61924 -81596 -78408
15376g8408l9628K3538J03177R849l364N5401n548n3590j12304l4361M8553P7779
$$ -78408 -118036 -94498 8679 18528 15164 70565 65017 11427 -100877 -135238 -86685 -8906
15364h906O0612j3674L2698K3514j4955k0629k4930n7735r150l2154k4382n698
$$ -8906 51706 38032 70730 94244 79289 58660 33730 -24005 -33155 -65309 -89691 -95389
15352i5389O345N8272K7867q2654m6004j3378K2869M2415M1014M867m9831L7356
$$ -95389 -89044 -30772 -2905 -85559 -131563 -144941 -122072 -79657 -38643 -33776 -83607 -46251
15340d6251M6003L0583K183l8278k4453J4976Q830m8831K3033K6083M5389J5339
$$ -46251 -248 30335 32518 -5760 -30213 -15237 -6407 -55238 -32205 -6122 39267 54606
15328E4606n2625m0843l8371N8312P0368j0035o2248k4656k0804N6518N2359m636
$$ 54606 1981 -38862 -77233 -18921 51447 41412 -20836 -45492 -66296 -9778 42581 37945
15316C7945n896j1694L7795k5017L6887K0601l4686L346J6446K517k2660p0116
$$ 37945 32049 20355 58150 33133 70020 90621 55935 59281 75727 78244 55584 -14532
15304a4532k0533k3560j3172J2603k6128L4257M313J2188K2512K3115n80k8511
$$ -14532 -35065 -58625 -71797 -59194 -85322 -51065 -46752 -34564 -12052 11063 10483 -18028
15292a8028J2076p949j9635p0671L4219N4737R2261M3437j02152l6741M5423O060
$$ -18028 -5952 -13901 -33536 -104207 -69988 -15251 77010 120447 18295 -18446 26977 33037
15280C3037o125J1766q950J4351O4799K7457o3859l5051k2516m6062j5972N7908
$$ 33037 26912 38678 29728 44079 108878 136335 72476 37425 14909 -31153 -47125 10783
15268A0783K1324J2650K5300K730m3727l4437M7752l6334j3780M4604l3390P29
$$ 10783 32107 44757 70057 72787 29060 -5377 42375 6041 -7739 36865 3475 4204
15256D204k6869L5933Q4447n9014o6456K138J1243j691J5121L9774J939k7714
$$ 4204 -22665 13268 97715 38701 -27755 -25617 -14374 -16065 -944 38830 40769 13055
15244A3055q631J4093J0345Q234M308j039m5557j9230L6618m230J6635L1608j4124
$$ 13055 4424 18517 28862 37096 41404 40365 -5192 -24422 12196 7966 24601 56209 42085
15231D2085J2390J5091O6194K8445r2464o931q693n9180p3314J3840k2960j3646
$$ 42085 54475 69566 135760 164205 71741 64810 56117 -3063 -76377 -62537 -85497 -99143
15219i9143O0892Q644J5255M5578J1956q9246j46K4000J3729j209k7725k7804
$$ -99143 -38251 -29607 -14352 31226 43182 -46064 -46210 -22210 -8481 -9690 -37415 -65219
15207f5219O5162J6729J1363l2096k5260L1239L0715J5084j6766m318J7938K2569
$$ -65219 -57 16672 28035 -4061 -29321 1918 32633 47717 30951 26633 44571 67140
15195F7140j0064p691K1536P993L5673K6152K5574l074j06060m3317R951k5012
$$ 67140 57076 49385 70921 78914 114587 140739 166313 163239 57179 13862 23813 -1199
15183a199n725M7168N3101P046o0823j1507N1617K0226k7923m8288l5074p216
$$ -1199 -6924 40244 93345 100391 39568 28061 79678 99904 71981 23693 -11381 -18597
15171a8597k075M506l7581Q325L1602P393J6107J5715j2863P4958k009p2504j11405
$$ -18597 -20672 -16166 -53747 -45422 -13820 -6427 9680 25395 12532 87490 85481 12977 -98428
15158i8428J5165L8969r262J8063N3459N1613l3758o3897J0389L7048M7271n790
$$ -98428 -83263 -44294 -53556 -35493 17966 69579 35821 -28076 -17687 19361 66632 60842
15146F0842l7570k9950K087l04L8629j8612j0843J6818M624j8894o696M016N8386
$$ 60842 23272 -6678 -4591 -4895 33734 15122 4279 21097 25721 6827 131 4147 62533
15133F2533n6998j5430n561J1510k6727o414O1764L1281k1648m7819k4218L9830
$$ 62533 5535 -9895 -15456 -3946 -30673 -37087 24677 55958 34310 -13509 -37727 2103
15121B103P5172J344j1734K1386J1703J5570k9852N381q0782r8173M998N7964
$$ 2103 77275 78619 66885 88271 99974 115544 85692 91073 10291 -87882 -82884 -24920
15109b4920r351j127N7520K1329j0409K8170m4297q193K169L7824J4522o9734
$$ -24920 -34271 -35398 22122 43451 33042 61212 16915 8722 10891 48715 63237 -6497
15097f497R922k6771l9139k1729o715J9757P5450L1755j8820J8687q053k0443
$$ -6497 3425 -23346 -62485 -84214 -90929 -71172 4278 36033 17213 35900 27847 7404
15085G404J3067J747R486K7159K3102k6292j4631m0032L7780k1932j4300J6273
$$ 7404 20471 22218 31704 58863 81965 55673 41042 1010 38790 16858 2558 18831
15073A8831l7371K5913m9861J4451L0216p471J6440J4291O8506J4330j18806o7325
$$ 18831 -18540 7373 -42488 -28037 2179 -5292 11148 25439 93945 108275 -10531 -77856
15061g7856r732J0400K7437O2432j4665p3561J7543K5963N3l0834N2234M3678
$$ -77856 -87588 -77188 -49751 12681 -1984 -75545 -58002 -32039 -31986 -62820 -10586 33092
15049C3092n002j8264K4638L5157j7774m5599j276l3706j1243J8194P7127J4290
$$ 33092 28090 9826 34464 69621 51847 6248 4972 -28734 -39977 -21783 55344 69634
15037F9634n3098o3829p692J0652J820L0219O7200O6023l6439p4198l5308n121
$$ 69634 16536 -47293 -54985 -44333 -42513 -12294 54906 120929 84490 10292 -25016 -30137
15025c0137M5905Q125l4071J2402N0K0857L2909K7481L8584l1139q0047k4598
$$ -30137 15768 23893 -10178 2224 2274 23131 56040 83521 122105 90966 10919 -13679
15013a3679L1437n182J7311j0373N656o2670m9180O9256L9036J8244L1662j4345
$$ -13679 17758 12576 29887 19514 25170 -37500 -86680 -17424 21612 39856 71518 57173
15001E7173n749J097j2074R964P119k2120l0810m9720l0259J7246J7408j7490
$$ 57173 51424 52521 40447 50411 57530 35410 4600 -45120 -75379 -58133 -40725 -58215
14989e8215R854O7065j1256m2967M5317N1412j2726k8199j3163L6143M5286R496
$$ -58215 -48361 18704 7448 -35519 9798 61210 48484 20285 7122 43265 88551 98047
14977I8047n1501l6838m7823k9831M6087P305N674l1539L3038O8611J0419J5414
$$ 98047 46546 9708 -38115 -67946 -21859 -14554 -8880 -40419 -7381 61230 71649 87063
14965H7063L4539K1164J1368k5058j12677q7030k1167N5671j9115O0014O0277
$$ 87063 121602 142766 154134 129076 16399 -70631 -91798 -36127 -55242 4772 65049
14954F5049N8926l2843L1994k0582j455n5430m0585K5514J9053K7287l196j0465
$$ 65049 123975 91132 123126 102544 101089 45659 5074 30588 49641 76928 73732 63267
14942F3267j9584j6005J9670J4607j4597m4494m0975M3110L3483n3556m2754K8740
$$ 63267 43683 27678 47348 61955 47358 2864 -38111 4999 38482 -15074 -57828 -29088
14930b9088O8004J2196M3211m103k1848o3019j884L1942P559J3510o070l2449
$$ -29088 38916 51112 94323 90220 68372 5353 3469 35411 42970 56480 50410 17961
14918A7961q409n4386L4513K7724P029K7520j1575k8252J301L3797j5542j5269
$$ 17961 9552 -44834 -10321 17403 24432 51952 40377 12125 13426 47223 31681 16412
14906A6412j1271K445O5483M184k0271m0294n093L6619L2815m5258k9696o0345
$$ 16412 5141 7586 73069 77253 56982 16688 11595 48214 81029 35771 6075 -54270
14894e4270j785J9126l0460l2499L0746J6493M614L292p779n869O1403M3499K8593
$$ -54270 -56055 -36929 -67389 -99888 -69142 -52649 -48035 -44743 -52522 -58391 3012 46511 75104
14881G5104L004J1420k3125j0771l84J6877j4062j7596P672k4733K8427p6706
$$ 75104 78108 89528 66403 55632 55248 72125 58063 40467 48139 23406 51833 -24873
14869b4873k0278R2425K1223l3845m0060k6010j6883O462O1612L4276k9735l8334
$$ -24873 -45151 47274 68497 34652 -5408 -31418 -48301 -41839 19773 54049 24314 -14020
14857a4020J5985J2818k6476K6983J0353L2419N1495k4402j5603n0295j6095k0438
$$ -14020 1965 14783 -11693 15290 25643 58062 109557 85155 69552 19257 3162 -17276
14845a7276r666K7368M2147q606J7946J7525K8058J6462K0986m253J8623l9108
$$ -17276 -26942 426 42573 33967 51913 69438 97496 113958 134944 130691 149314 110206
14833A10206m3906j7147K9050l3874j2145n748Q760j0570j2316M6946j1929m653
$$ 110206 66300 49153 78203 44329 32184 26436 35196 24626 12310 59256 47327 42674
14821D2674l4154j3950k1534j8889J0298J50L5162K9981p1684j2403k6713M320
$$ 42674 8520 -5430 -26964 -45853 -35555 -35405 -243 29738 -41946 -54349 -81062 -76742
14809g6742M2687N481L5249N8345j2575n3828q1196Q315K2942J248J00229K8560
$$ -76742 -34055 -28574 6675 65020 52445 -1383 -82579 -74264 -51322 -50074 50155 78715
14797G8715j4582n3189L1016L4663j7686j1521m9163k5487p379J6400L3631L9451
$$ 78715 64133 10944 41960 76623 58937 47416 -1747 -27234 -34613 -18213 15418 54869
14785E4869r312l3555J6005P162n468j4438m2661M3116J2266k0042p27L5349j8036
$$ 54869 45557 12002 28007 35169 29701 15263 -27398 15718 27984 7942 7215 42564 24528
14772B4528k7110J2756N969L603k4488p743L7203j4462l3913K8751L5503n5473
$$ 24528 -2582 10174 16143 19746 -4742 -12485 24718 10256 -23657 5094 40597 -14876
14760a4876k7676J1780J4339L3759j863k4915m3097K5158L8795L1800K7248n0816
$$ -14876 -42552 -30772 -16433 17326 15463 -9452 -52549 -27391 11404 43204 70452 19636
14748A9636m7323P284O0285j4232M5058p4827o3120L2951J648k6713j0892L2367
$$ 19636 -27687 -20403 39882 25650 70708 -4119 -67239 -34288 -32640 -59353 -70245 -37878
14736c7878R4988N7495M6724P620j03047l1630O75j7146j5042J8415N2572J3205
$$ -37878 57110 114605 161329 168949 65902 34272 34947 17801 2759 21174 73746 86951
14724H6951n502m4042m4877K335k6755l2466J6089J8745N1826L2659n4911k7754
$$ 86951 81449 37407 -7470 -5135 -31890 -64356 -48267 -29522 22304 54963 52 -27702
14712b7702J6252L8429J1114l5307K73k6942j6502K56M7361J9823Q550J1019r695
$$ -27702 -11450 26979 38093 2786 3059 -23883 -40385 -40129 7232 27055 35605 46624 36929
14699C6929n067k152L030m5083m3836N037j5691L9375j2509j1046J7471J9263
$$ 36929 31862 29710 32740 -12343 -56179 -51142 -66833 -27458 -39967 -51013 -33542 -14279
14687a4279J3263N0350j0890k6615N4852k2153k4006q78M378l2971n2269N4197
$$ -14279 -1016 49334 38444 11829 66681 44528 20522 19644 24022 -8949 -61218 -7021
14675g021P3139J2988j14340j08008l035N1446Q4849J4130p303M4051q060K6442
$$ -7021 66118 79106 -35234 -143242 -146277 -94831 -9982 4148 -3155 40896 32836 59278
14663E9278O5364o3134k8876J3798K8355j2415M6298K3090L2329K1958J2220p8169
$$ 59278 124642 61508 32632 46430 74785 62370 108668 131758 164087 186045 198265 120096
14651A20096K9928J0536m6110k2058J7598k1779m4588q708j4505q765j7435O681
$$ 120096 150024 160560 114450 92392 109990 88211 43623 34915 20410 11645 -5790 891
14639H91l7612k3592k9800K3428M2482k7532n5424K3352N1910P1268K6609J4908
$$ 891 -36721 -60313 -90113 -66685 -24203 -51735 -107159 -83807 -31897 39371 65980 80888
14627H0888M2004o4374k1023L2547m2320K888M3669j6490l6864L8024K9106l3427
$$ 80888 122892 58518 37495 70042 27722 30610 74279 57789 20925 58949 88055 54628
14615E4628p6596k4530P5730J02224K8190J0177l96o5063R819j7216o9865p906
$$ 54628 -21968 -46498 29232 131456 159646 169823 169427 104364 114183 96967 27102 19196
14603A9196K0171j3615O124J3877M1917j827m6475K2887M8630m0220k3485j0853
$$ 19196 39367 25752 31876 45753 87670 85843 39368 62255 110885 70665 47180 36327
14591C6327j4532N3611n755P757r1399j4279j963L7628O5318m6268k2380l1171
$$ 36327 21795 75406 69651 77408 -13991 -28270 -30233 7395 72713 26445 4065 -27106
14579b7106J0674K6480J6761m6279o551o862K7658N0978K218j7932K6408K5492
$$ -27106 -16432 10048 26809 -19470 -26021 -32883 -5225 45753 47971 30039 56447 81939
14567H1939o3519p700K9498J7408J327n9586j274J5633j8974J5625K2345j1797
$$ 81939 18420 10720 40218 57626 58953 -633 -1907 13726 -5248 10377 32722 20925
14555B0925n508j9778n7920j2618N2826P0767M5703l9020m8358J3310L6987J4953
$$ 20925 15417 -4361 -62281 -74899 -22073 48694 94397 55377 7019 20329 57316 72269
14543G2269l1181j6819R666j2174l1569j2340J8119k1109j694K5668P1064O1725
$$ 72269 41088 24269 33935 21761 -9808 -22148 -4029 -25138 -26832 -1164 69900 131625
14531A31625j5280j5510j4859k8473j8718m7826K526O3575K661j0943m9029j6507
$$ 131625 116345 100835 85976 57503 38785 -9041 -6515 57060 59721 48778 -251 -16758
14519a6758L8307O3309M4421n5412j03911m6532q87M5680K1408O0785O661j7319
$$ -16758 21549 84858 129279 73867 -30044 -76576 -77463 -31783 -10375 50410 57071 39752
14507C9752J4114O404l0068K791Q4480N5826k7075o684j768l0170k7495k3764
$$ 39752 53866 60270 30202 32993 117473 173299 146224 139540 137772 107602 80107 56343
14495E6343K079K1916k4006k7709j5216J3276j1850M7175M202p46l947l493l3246
$$ 56343 58422 80338 56332 28623 13407 26683 14833 62008 66210 65464 61517 58024 24778
14482B4778m0481j4134O2537K4210j009J9146k7568J2481J1261k7694k8875k4623
$$ 24778 -15703 -29837 32700 56910 55901 75047 47479 59960 71221 43527 14652 -9971
14470i971j1899j6328k2495L331J1808L6690N0830K0302l2950l0812p179K0324
$$ -9971 -21870 -38198 -60693 -57362 -45554 -8864 41966 62268 29318 -1494 -8673 11651
14458A1651N7021m2356o6929o4480N402j1680K4671P2645L4986L4714K2289L0188
$$ 11651 68672 26316 -40613 -105093 -99691 -111371 -86700 -14055 20931 55645 77934 108122
14446A08122J2267q047j7839j6574m0310l6282K3549M8356k4324m1367N584P3474
$$ 108122 120389 112342 94503 77929 37619 1337 24886 73242 48918 7551 13135 86609
14434H6609M2552j3114m7661m5089P0495m638l7431j9893N6327n3982m0336M9467
$$ 86609 129161 116047 68386 23297 93792 89154 51723 31830 88157 34175 -6161 43306
14422D3306N7124L8642m7535l5423l095k4963j6005m9779k9727P4631N2441L1756
$$ 43306 100430 139072 91537 56114 53019 28056 12051 -37728 -67455 7176 59617 91373
14410I1373J9577j0916m825n1928j6112N3311P877l786l8026n1687k1626o812
$$ 91373 110950 100034 95209 43281 27169 80480 88357 84571 46545 -5142 -26768 -33580
14398c3580o444P1645J7901j8740J1216K0743j4892m844J1495J4117J359k5162
$$ -33580 -40024 31621 49522 30782 41998 62741 47849 43005 54500 68617 69976 44814
14386D4814n9194k3207J1030R817L6336J8269R063l813n139L0853Q914k8112o1701
$$ 44814 -14380 -37587 -26557 -16740 19596 37865 46928 43115 37976 68829 77743 49631 -12070
14373a2070P151L6151L4976n374L210M0257k4938k5476m5882k9625J9398n421
$$ -12070 -4919 31232 66208 60834 64044 104301 79363 53887 8005 -21620 -2222 -7643
14361g643K4227K8171n8790j5527K8467p57O0789K0832k2192o3844K3109O1890
$$ -7643 16584 44755 -14035 -29562 -1095 -1852 58937 79769 57577 -6267 16842 78732
14349G8732K999j8733l3445j5964r054k9237n2829m359p732k0096Q4081M328K6662
$$ 78732 81731 62998 29553 13589 4535 -24702 -77531 -81890 -89622 -109718 -25637 -21309 5353
14336E353N2225k7770m9906j6556N3986M0037J5110o8216M009M6078L5817J758
$$ 5353 57578 29808 -20098 -36654 17332 57369 72479 4263 8272 54350 90167 91925
14324I1925m1452J2464O015K5439K8300m167j4155m6103o6104l0274L8397j7299
$$ 91925 50473 62937 68952 94391 122691 118524 104369 58266 -7838 -38112 285 -17014
14312a7014n2639L0289M6010m3901L5848N1492L5215J0966m9928k6592k620k3813
$$ -17014 -69653 -39364 6646 -37255 -1407 50085 85300 96266 46338 19746 17126 -6687
14300f687k0674M0192M6699k8363k323k4q978K5215Q1858J709M299M019l7365
$$ -6687 -27361 12831 59530 31167 28844 28820 19842 45057 126915 128624 132923 136942 99577
14287I9577o4648n030L9163M0172R753l1309j05727j4032L7811l6641L1049L8657
$$ 99577 34929 29899 69062 109234 118987 87678 -18049 -32081 5730 -30911 138 38795
14275C8795p892J2554l225K594k5989m5762k6817N7169J102n9958j1746N0544
$$ 38795 30903 43457 40232 42826 16837 -28925 -55742 1427 2529 -57429 -69175 -18631
14263a8631J5184K6013J4135L4321P837l5896l8870O0481P8589n4108j2059m8376
$$ -18631 -3447 22566 36701 71022 78859 42963 4093 64574 143163 89055 76996 28620
14251B8620q1326j3445M0311K9530K0395N7263k545j8449j1819m9873n1956J1674
$$ 28620 -52706 -66151 -25840 3690 24085 81348 78803 60354 48535 -1338 -53294 -41620
14239d1620l274M2853P9337k8797K9600l779l8592N3464k676m6192p0489J4837
$$ -41620 -44894 -2041 77296 48499 78099 74320 35728 89192 86516 40324 -30165 -15328
14227a5328J10764Q650l8571K7095N5539j0753p2020K9470M5788q4130p5723L2136
$$ -15328 95436 104086 65515 92610 148149 137396 65376 94846 140634 56504 -19219 12917
14215A2917m836K2339K1388J4914J4836L3141r166r866j9688k1850k101j0578
$$ 12917 8081 30420 51808 66722 81558 114699 105533 95667 75979 54129 52028 41450
14203D1450N1749R72k0133L6126M011n9360l8087k879O4481N0546k1870j7148
$$ 41450 93199 94171 74038 110164 114175 54815 16728 13849 78330 128876 107006 89858
14191H9858k1296o7627j5210K6382J2598J7321m0653j3601N1453M5461J3179l7700
$$ 89858 68562 935 -14275 12107 24705 42026 1373 -12228 39225 84686 97865 60165
14179F0165o0998j868m7609J8493M5287O2158k1670K014J047M768j3749j61j1662
$$ 60165 -833 -2701 -50310 -31817 13470 75628 53958 55972 57019 61787 48038 47877 36215
14166C6215l7807m4184M7602N512l666P0558K223m1302R080O6209N3550m3841
$$ 36215 -1592 -45776 1826 7338 3672 74230 76453 35151 44231 110440 163990 120149
14154A20149m0031l6429o922j1221j174Q859l6969J8801k2339l849M0993P2381
$$ 120149 80118 43689 36767 25546 24372 33231 -3738 15063 -7276 -11125 29868 102249
14142A02249j4634r12m403j5997r513N3313J9906k1048p0282k7543l3613p68J3342
$$ 102249 87615 86703 82300 66303 56790 110103 130009 108961 38679 11136 -22477 -23245 -9903
14129i903K8005l888P61N1266M444p751l4382k9723J0752M916k6628P1990M9169
$$ -9903 18102 14214 14975 66241 70685 62934 28552 -1171 9581 14497 -12131 59859 109028
14116A09028j1943k287l7250J6900N827m5682j0449R909k2314p291N4087j8329
$$ 109028 97085 94798 57548 74448 80275 34593 24144 34053 11739 4448 58535 40206
14104D0206n6935K0935n5616J018M2679K979P356K6359M571L848L1601K6010L4562
$$ 40206 -16729 4206 -51410 -50392 -7713 -4734 2622 28981 33552 37400 69001 95011 129573
14091A29573k6848n068p1967L80O0688J619Q131q2412l2953R0400l2981m0970
$$ 129573 102725 97657 25690 26070 86758 88377 96508 14096 -18857 71543 38562 -2408
14079b408l8288J3469R5885N9330j2140k8550m0387M8833L360J9947R009N226
$$ -2408 -40696 -27227 68658 127988 115848 87298 46911 95744 99104 119051 128060 133286
14067A33286l8772l4805K7491q888j9957k1041O2355K6030K3492M753j9084k7727
$$ 133286 94514 59709 87200 78312 58355 37314 99669 125699 149191 153944 134860 107133
14055A07133k1810R1j9364K3161N8843O006p7675J3743J7532K4606k5839k9546
$$ 107133 85323 85414 66050 89211 148054 154060 76385 90128 107660 132266 106427 76881
14043G6881J081n4313m6369m050q859L9024K8154L991l0439l1852J0193M0931
$$ 76881 77962 23649 -22720 -26770 -35629 3395 31549 35540 5101 -26751 -16558 24373
14031B4373K673L4290R822M577N7803L913j32100m1483P1203j2914l6258M610
$$ 24373 27046 61336 71158 75735 133538 137451 5351 -36132 35071 22157 -14101 -9491
14019i491M5707j0028Q327P328J710J2233j1733l4221J1648n410L5112J0685l5548
$$ -9491 36216 26188 34515 41843 43553 55786 44053 9832 21480 16070 51182 61867 26319
14006B6319l3587L6801J0158L5957M3601m7626n7818J9479k9664j2390L6872p035
$$ 26319 -7268 29533 39691 75648 119249 71623 13805 33284 3620 -8770 28102 21067
13994B1067k2484L1508J6850k9907L2779q284n3824l1072K0033L1903N8334k9580
$$ 21067 -1417 30091 46941 17034 49813 41529 -12295 -43367 -23334 8569 66903 37323
13982C7323q0740L4024M0637L3549j2949J5340j5213l9620k3070K9343k0057L0921
$$ 37323 -43417 -9393 31244 64793 51844 67184 51971 12351 -10719 18624 -1433 29488
13970B9488J7966J279m4137n7346l2394N2154K5037J0386j7742J6434M4856O3405
$$ 29488 47454 48733 4596 -52750 -85144 -32990 -7953 2433 -15309 1125 45981 109386
13958A09386L7700p3744o5100m6915N2598K1154p896j1991j2162K4285K718K7837
$$ 109386 147086 73342 8242 -38673 13925 35079 27183 15192 3030 27315 30033 57870
13946E7870l1985M887O3463J1768j2453L2631M582m5011p8600l2566L6932l705
$$ 57870 25885 30772 94235 106003 93550 126181 130763 85752 7152 -25414 11518 7813
13934G813m8351j1778M0820l9989m7163l7621J9318L4263M2868p044Q4185r001
$$ 7813 -40538 -52316 -11496 -51485 -98648 -136269 -116951 -82688 -39820 -46864 37321 28320
13922B8320m8545n2990L0673Q3723M9915L0342m1476J107L9597K7473N3l7185
$$ 28320 -20225 -73215 -42542 41181 91096 121438 79962 81069 120666 148139 148192 111007
13910A11007l6461N358n3714m1898P1114R1995n6280o6923N7840P4604Q2767j4124
$$ 111007 74546 79904 26190 -15708 55406 147401 91121 24198 82038 156642 239409 225285
13898B25285m1673l7292n2372K0910Q453j7352m6723j4454J0015L6081J2644k1450
$$ 225285 183612 146320 93948 114858 123311 105959 59236 44782 54797 90878 103522 82072
13886H2072l8751K106k5438l561M224J3846k9997O9056J9699O327k8263l4739
$$ 82072 43321 45427 19989 16428 20652 34498 4501 73557 93256 99583 71320 36581
13874C6581m0298K4824j5282M5243k2288r6085N913M6347R310M1693L9534J8730
$$ 36581 -3717 21107 5825 51068 28780 -67305 -61392 -15045 -5735 35958 75492 94222
13862I4222M848N1921n8542p7295k2474L2682J0680L8565K4861j4977l6455m5965
$$ 94222 99070 150991 92449 15154 -7320 25362 36042 74607 99468 84491 48036 2071
13850B071l6299j1678L0624j1154j5590L090K1348O3615K2428J1855j5465j1732
$$ 2071 -34228 -45906 -15282 -26436 -42026 -38936 -17588 46027 68455 80310 64845 53113
13838E3113J597J2413L2423J2010m7895l1366k7150M0375M1984K7939L8756l0515
$$ 53113 54710 67123 99546 111556 63661 32295 5145 45520 87504 115443 154199 123684
13826A23684l8958l9476j2269n857O2951K5446m404n3940N939J106l3659O9658
$$ 123684 84726 45250 32981 27124 90075 115521 111117 57177 63116 64222 30563 100221
13814A00221k3391n6130j6038J6904K6164l085l0643L3754J2830P658n1916L6106
$$ 100221 76830 20700 4662 21566 47730 44645 14002 47756 60586 68244 16328 52434
13802E2434M2152l3409N273J1912J9097r148L3257R8292l1437m4852m168j755
$$ 52434 94586 61177 66450 78362 97459 88311 121568 219860 188423 143571 139403 137648
13790A37648k9369j7363q671o3829L1079j0106L530O4097p235j7786j7290l6262
$$ 137648 108279 90916 82245 18416 49495 39389 42919 107016 99781 81995 64705 28443
13778B8443L3735O2900Q160n0537l0940M987K419m9400K6230J7744l9365j7398
$$ 28443 62178 125078 133238 82701 51761 56748 59167 9767 35997 53741 14376 -3022
13766c022J6358Q91J3347O3077L0629l685j7584L7612K464j2903R035j9365j2880
$$ -3022 13336 14227 27574 90651 121280 117595 100011 137623 140087 127184 136219 116854 103974
13753A03974o2362j0396J1933k2896P304Q7041j9468p949N386J0016l6643q777
$$ 103974 41612 31216 43149 20253 27557 114598 95130 87181 92567 102583 65940 57163
13741E7163j6540k1473P861J9709J5827J1989j3375J0484K7947m1156j3765L2680
$$ 57163 40623 19150 27011 46720 62547 74536 61161 71645 99592 58436 44671 77351
13729G7351N0679L0983K2498q313k4246r2766o1137K9233O2200K3370O2916m7755
$$ 77351 128030 159013 181511 173198 148952 56186 -4951 24282 86482 109852 172768 125013
13717A25013l8138m886L2608r067k8569L5922Q165o997j3284k0601K836J3219
$$ 125013 86875 81989 114597 105530 76961 112883 121048 114051 100767 80166 83002 96221
13705I6221Q4254N4220m3491n4172o5365j3907M806l0211m4436L9879K3222j8651
$$ 96221 180475 234695 191204 137032 71667 57760 62566 32355 -12081 27798 51020 32369
13693C2369K1470n2412j3954L7867K8286k3152K812P286m012m0093J1930p472
$$ 32369 53839 1427 -12527 25340 53626 30474 33286 40572 36560 -3533 8397 925
13681I25J1223J9069K8725k1836j9747J5208R268j1574n1l4737m2949J7628K9010
$$ 925 12148 31217 59942 38106 18359 33567 42835 31261 31210 -3527 -46476 -28848 162
13668A62L0452P240j2210N804l1134j1334j8215M7947J5547K4240M5356o201M3106
$$ 162 30614 37854 25644 31448 314 -11020 -29235 18712 34259 58499 103855 97654 140760
13655A40760j7866j1644l5369j0734r8J9724K2943n454m6019R704L9605P2677
$$ 140760 122894 111250 75881 65147 65049 84773 107716 102262 56243 65947 105552 178229
13643A78229P255j5501q524n9719o5476M9146J3169j0703m0499p676N5989J1085
$$ 178229 185484 169983 161459 101740 36264 85410 98579 87876 47377 39701 95690 106775
13631A06775n7633j7606l0328L8798P1029j4011j9687m6058k7863J7771P7896
$$ 106775 49142 31536 1208 40006 111035 97024 77337 31279 3416 21187 99083
13620I9083J8908k1061j9953N392j5880l4823l9689k5160J2118K1353P6230Q4943
$$ 99083 117991 96930 76977 82369 66489 31666 -8023 -33183 -21065 288 76518 161461
13608A61461K5328M380l2369k9463q1673K5965L3940l5011J9727O370o8401l8344
$$ 161461 186789 191169 158800 129337 47664 73629 107569 72558 92285 98655 30254 -8090
13596h090J1068K0632N5003K4214m7579o242K0233J6929k2362r15p673J6437M3579
$$ -8090 2978 23610 78613 102827 55248 49006 69239 86168 63806 62891 55218 71655 115234
13583A15234O3854L907k7170J3892K4971K048K745n8172j7145K4474n726n313
$$ 115234 179088 182995 155825 169717 194688 196736 199481 141309 124164 148638 142912 137599
13571A37599J8666j6427J4569k3541m7311k9139j7323J5822K3450j3132M5099
$$ 137599 156265 139838 154407 130866 83555 54416 37093 52915 76365 63233 108332
13560A08332L1610K6997J6488j3523R402K9230k3551o6543m844m1640K5005L221
$$ 108332 139942 166939 183427 169904 179306 208536 184985 118442 113598 71958 96963 100184
13548A00184r575m9071o1277p919J8829M2087q684R014o3317L7492L8744N9833
$$ 100184 90609 41538 -19739 -27658 -8829 33258 24574 33588 -29729 7763 46507 106340
13536A06340j2300J5390M950m9393J2025L5850j4014j3588j1264m9236l5249J2308
$$ 106340 94040 109430 114380 64987 77012 112862 98848 85260 73996 24760 -10489 1819
13524A819N8812J5847l6835R766L4383L160J283j4838M1814N882k6659p0271m8847
$$ 1819 60631 76478 39643 49409 83792 86952 88235 73397 115211 121093 94434 24163 -24684
13511b4684N6042M6963L715K2428L3171k5600j5467J5976m7159O453p3726J5361
$$ -24684 31358 78321 82036 104464 137635 112035 96568 112544 65385 71838 -1888 13473
13499A3473O6579l3889M025L611J3497J9994j4517l2176L1350K6942l5347M4040
$$ 13473 80052 46163 50188 53799 67296 87290 72773 40597 71947 98889 63542 107582
13487A07582J8563n6256m6537J5273K8490K8658l1000M0314K9362M3107K9351
$$ 107582 126145 69889 23352 38625 67115 95773 64773 105087 134449 177556 206907
13476B06907J1029k066p8563l2534k3899M3110J4037j6541n3328m7433n77n7706
$$ 206907 217936 215870 137307 104773 80874 123984 138021 121480 68152 20719 20142 -37564
13464c7564K2654J2385M8015M8944n487q469K4479l4678R933n6977r595J7106
$$ -37564 -14910 -2525 45490 94434 88947 80478 104957 70279 80212 23235 13640 30746
13452C0746O9K2318J2618k0331l5795K8129M9007M5505k4801l7928k092r119k0018
$$ 30746 30815 53133 65751 45420 9625 37754 86761 132266 107465 69537 67445 58326 38308
13439C8308J938J782l6459K1614J9968j7516m4226P3070K3288J0485K7033N7772
$$ 38308 40246 42028 5569 27183 47151 29635 -14591 58479 81767 92252 119285 177057
13427A77057K7800o2736m9994L3618J9781r241J3474j6870M1696k2234p1888n1643
$$ 177057 204857 142121 92127 125745 145526 136285 149759 132889 174585 152351 80463 28820
13415B8820M1749M0125m854p1259j7284O3888N1281l9354m8974j6709Q2021N4808
$$ 28820 70569 110694 105840 34581 17297 81185 132466 93112 44138 27429 109450 164258
13403A64258o0388k0194J3750K0031N3652J3337J2642O051k7190k6503J5403o2747
$$ 164258 103870 83676 97426 117457 171109 184446 197088 203139 175949 149446 164849 102102
13391A02102l8543j2569k1596L5839M2766L4185k5011j2914L3605m9235j1812
$$ 102102 63559 50990 29394 65233 107999 142184 117173 104259 137864 88629 76817
13380G6817J4046J1941q2037l7581J3507J8566O3468J1144j2443j58N2888J087
$$ 76817 90863 102804 20767 -16814 -3307 15259 78727 89871 77428 77270 130158 131245
13368A31245m707l8016P130J4042K02N680J9608p0134j2832l4389J1743J24813
$$ 131245 126538 88522 95652 109694 109896 115576 135184 65050 52218 17829 29572 154385
13356A54385J541n2439q767J3677L4423K875o1533m8939l0547L8301j3308m5295
$$ 154385 155926 103487 94720 108397 142820 145695 84162 35223 4676 42977 29669 -15626
13344a5626J9761K8736n09K861j1205R246K2421J7690P0851k3740J1861k563n4814
$$ -15626 4135 32871 32362 35223 24018 33264 55685 73375 144226 120486 132347 129784 74970
13331G4970l4631O3886L4398N1733K8203l4015l1156k3856J6224k518L5932R226
$$ 74970 40339 104225 138623 190356 218559 184544 153388 129532 145756 143238 179170 188396
13319A88396k4774k3377j0507J0264Q328Q501q2354j6290J1118k009O0604K0638
$$ 188396 163622 140245 129738 140002 148330 156831 74477 58187 69305 67296 127900 148538
13307A48538j0077j4714N5172j9006j4816l6490p925L5357p3156k7889K4010N1748
$$ 148538 138461 123747 178919 159913 145097 108607 100682 136039 62883 34994 59004 110752
13295A10752N4025o4337j7237k692l0059J6152j2470P1413L9829n459n7299r946
$$ 110752 164777 100440 83203 80511 50452 66604 54134 125547 165376 159917 102618 92672
13283I2672R674q49l2256j3251J3766N5093K7477Q42p2523j8552j1042L2989M4093
$$ 92672 102346 101497 69241 55990 69756 124849 152326 153168 80645 62093 51051 84040 128133
13270A28133L776Q220k8528j6816j7859K4221L3640K6913J9299L7481K5490o5282
$$ 128133 131909 140129 111601 94785 76926 101147 134787 161700 180999 218480 243970 178688
13258A78688m9120J503n265K7325k9314l4094l5700Q419J0855m307N0466M8316
$$ 178688 129568 131071 125806 153131 123817 89723 54023 62442 73297 68990 119456 167772
13246A67772k3601k1874o973K4086N7588m804l4744o5392N8872J5199j1214n7039
$$ 167772 144171 122297 115324 139410 196998 192194 157450 92058 150930 166129 154915 97876
13234I7876j6002j381J1921K4762L5136N184K1276K702o4378n232l8561m3911
$$ 97876 81874 80493 92414 117176 152312 157496 178772 181474 117096 111864 73303 29392
13222B9392j7540M9677O7807K2697J011j5658k3063K9252K3864l1057m959J400
$$ 29392 11852 61529 129336 152033 153044 137386 114323 143575 167439 136382 131423 132823
13210A32823L5031l005k1850N859L5375J087J3892p452J9327M51k6893o2853p7581
$$ 132823 167854 164849 142999 148858 184233 185320 199212 191760 211087 211538 184645 121792 44211
13197D4211j3273N7167N8404L0860J4307r343m609J181M7049J375M5938o4645
$$ 44211 30938 88105 146509 177369 191676 182333 177724 178905 225954 227329 273267 208622
13185B08622p4481q528L6085M6768o1979O635K662m4735l821L4377l5907K1698
$$ 208622 134141 125613 161698 208466 146487 153122 155784 111049 107228 141605 105698 127396
13173A27396J7992M2504K4114n3421j9723j8600K487L0347j455J6608k3130M4296
$$ 127396 145388 187892 212006 158585 138862 120262 122749 153096 151641 168249 145119 189415
13161A89415J3053K8125J9944J652n5421l4420l9151j2230P9803L3820J1641Q424
$$ 189415 202468 230593 250537 252189 196768 162348 123197 110967 190770 224590 236231 244655
13149B44655k1709k3155k6949j3846M068J5391J1149J0036l5127L4467J4810k1644
$$ 244655 222946 199791 172842 158996 163064 178455 189604 199640 164513 198980 213790 192146
13137A92146n4908M228Q1006K8224r196o4149o1349L9588M8599j4590l0126N010
$$ 192146 137238 141466 222472 250696 241500 177351 116002 155590 204189 189599 159473 164483
13125A64483M168L3723k7036o9677j2649M2082J5391M4138r066j2505k1127M262
$$ 164483 168651 202374 175338 105661 93012 135094 150485 194623 185557 173052 151925 156187
13113A56187L2269m210K8236k675k809j2189j5228L4179L3438q388K6673k3217
$$ 156187 188456 184246 212482 209807 206998 194809 179581 213760 247198 238810 265483 242266
13101B42266L2989l1974j6578o4117n9464M439N0711M4203n067j8308O338q873
$$ 242266 275255 243281 226703 162586 103122 107561 158272 202475 197408 179100 185438 176565
13089A76565l6392k5257l3908P764M0159O9021M2342L8001N455m7333K4344J6790
$$ 176565 140173 114916 81008 88772 128931 197952 240294 278295 283750 236417 260761 277551
13077B77551o968J3027q1987m9559N1807N3518o915n1884J1735n788M3488m835
$$ 277551 270583 283610 201623 152064 203871 257389 250474 198590 210325 204537 248025 243190
13065B43190m2418k6753N2595M7158l2345K9828j7969l0420j5718n218j641j8174
$$ 243190 200772 174019 226614 273772 241427 271255 253286 222866 207148 201930 200289 182115
13053A82115j0517j5859n2798J1189J0378J7703Q9215P131M043N2714n6817j7890
$$ 182115 171598 155739 102941 114130 124508 142211 231426 238557 242600 295314 238497 220607
13041B20607k0046k9482N066K7488J9279M306O461K6336J5348P739J2530M363
$$ 220607 200561 171079 176145 203633 222912 227218 233679 260015 275363 283102 295632 299995
13029B99995p4384K5108L8523j0265n9601j5111n1663j2146M6732K9783m4060
$$ 299995 225611 250719 289242 278977 219376 204265 152602 140456 187188 216971 172911
13018A72911K2532K1764j1226P0462L2958j9082j2190l4493j2900K7177M7897
$$ 172911 195443 217207 205981 276443 309401 290319 278129 243636 230736 257913 305810
13007C05810M6922J0433q905k2555j8668N4325N3966m2858p0686J415j7648M7673
$$ 305810 352732 363165 354260 331705 313037 367362 421328 378470 307784 309199 291551 339224
12995C39224J4240J8674M7813l9500L0209K2463n3708o0021K1843R5711P6519
$$ 339224 353464 372138 419951 380451 410660 433123 379415 319394 341237 436948 513467
12984E13467J18337J32225R1476K4762m2693k3300J424p683m3587l0087J0461
$$ 513467 631804 764029 855505 880267 837574 814274 815698 808015 764428 734341 744802
12973G44802m5379n2888l4396n9041K0345O036K5905K2340L4780p68O429K3876
$$ 744802 699423 646535 612139 553098 573443 579479 605384 627724 662504 661736 668165 692041
12961F92041K1969K7327R583L2523L3676L6283P2782J0373l3720J6371N2758J7947
$$ 692041 714010 741337 750920 783443 817119 853402 926184 936557 902837 919208 971966 989913
$$ [...]
##END NTUPLES=NMR SPECTRUM
##END=
