##TITLE=Analysis number 328184
Compound Code cc 62804
Book Reference 518/99
Project Code adrs
Chemist Name colinb
##JCAMPDX= 6.0         $$ Bruker NMR JCAMP-DX V2.0
##DATA TYPE= NMR SPECTRUM
##DATA CLASS= NTUPLES
##ORIGIN= Bruker BioSpin GmbH
##OWNER= nmr
$$ XWIN-NMR		Version 3.5
$$ Fri May 11 08:56:02 2007 GMT Daylight Time (UT+1h)  MAYBRIDGE\nmr@NMR_250MHZ
##.OBSERVE FREQUENCY= 250.131544655141
##.OBSERVE NUCLEUS= ^1H
##.ACQUISITION MODE= SIMULTANEOUS (DQD)
##.ACQUISITION SCHEME= undefined
##.AVERAGES= 16
##.DIGITISER RES= 18
##SPECTROMETER/DATA SYSTEM= dpx250
##.PULSE SEQUENCE= zg30
##.SOLVENT NAME= CDCl3
##.SHIFT REFERENCE= (INTERNAL, CDCl3, 0, 16.522)
##AUDIT TRAIL= $$ (NUMBER, WHEN, WHO, WHERE, WHAT)
$$ ##TITLE= Audit trail, XWIN-NMR		Version 3.5
$$ ##JCAMPDX= 5.01
$$ ##ORIGIN= Bruker BioSpin GmbH
$$ ##OWNER= nmr
$$ C:\u/data/dgb/nmr/ADRS/810/pdata/1/auditp.txt
$$ ##AUDIT TRAIL=  $$ (NUMBER, WHEN, WHO, WHERE, WHAT)
(   1,<2007-05-11 08:55:36.35 +100>,<MAYBRIDGE\nmr>,<NMR_250MHZ>,
      <created by zg, POWCHK disabled, PULCHK disabled
       configuration hash MD5:
       76 6E 9A 78 1E 09 19 81 EC 84 63 8F B0 6A 59 2D
       data hash MD5: 64K
       1C A1 BA E8 40 C5 64 53 CE 26 B1 50 43 2A 6C EC>)
(   2,<2007-05-11 08:55:50.77 +100>,<MAYBRIDGE\nmr>,<NMR_250MHZ>,
      <Start of raw data processing
       ef LB = 0.3 FT_mod = 6 PKNL = 1 SI = 32K 
       data hash MD5: 32K
       98 98 9A C3 88 01 7A 27 B6 4E 83 EE 96 76 6E 6F>)
(   3,<2007-05-11 08:55:52.44 +100>,<MAYBRIDGE\nmr>,<NMR_250MHZ>,
      <apk 
       data hash MD5: 32K
       79 EA 66 1C B7 2A 77 24 FE DF 85 C2 8D C2 DE CB>)
(   4,<2007-05-11 08:55:53.13 +100>,<MAYBRIDGE\nmr>,<NMR_250MHZ>,
      <abs ABSG = 5 
       data hash MD5: 32K
       EF DF 15 E7 91 A5 57 66 BD F2 D3 8D 8F 65 1B 55>)
$$ ##END=
$$ 
$$ hash MD5
$$ 85 D8 18 FE 85 8F 7D 3C 60 80 00 50 7A B0 C4 31
##$RELAX= 
##$RELAX= 
##$RELAX= 
##$RELAX= 
##$RELAX= 
##$RELAX= 
##$RELAX= 
$$ Bruker specific parameters
$$ --------------------------
##$DU= <C:\u>
##$EXPNO= 810
##$NAME= <ADRS>
##$PROCNO= 1
##$TYPE= <nmr>
##$USER= <dgb>
##$AMP= (0..31)
100 100 100 100 100 100 100 100 100 100 100 100 100 100 100 100 100 100 
100 100 100 100 100 100 100 100 100 100 100 100 100 100 
##$AQSEQ= 0
##$AQ_mod= 3
##$AUNM= <au_zg>
##$AUTOPOS= <1 >
##$BF1= 250.13
##$BF2= 250.13
##$BF3= 250.13
##$BF4= 250.13
##$BF5= 500.13
##$BF6= 500.13
##$BF7= 500.13
##$BF8= 500.13
##$BYTORDA= 1
##$CFDGTYP= 0
##$CFRGTYP= 5
##$CHEMSTR= <none>
##$CNST= (0..31)
1 1 145 1 1 1 1 1 1 1 1 1 1 1 1 1 1 1 1 1 1 1 1 1 1 1 1 1 1 1 1 1 
##$CPDPRG= <>
##$CPDPRG1= <>
##$CPDPRG2= <>
##$CPDPRG3= <>
##$CPDPRG4= <mlev>
##$CPDPRG5= <mlev>
##$CPDPRG6= <mlev>
##$CPDPRG7= <mlev>
##$CPDPRG8= <mlev>
##$CPDPRGB= <>
##$CPDPRGT= <>
##$D= (0..31)
0 1 0 0 0 0 0 0 0 0.06 0 0 0 0 0 0 0.0002 0 0 0 0 0 0 0 0 0 0 0 0 0 0 
0 
##$DATE= 1178870134
##$DBL= (0..7)
120 120 120 120 120 120 120 120 
##$DBP= (0..7)
150 150 150 150 150 150 150 150 
##$DBP07= 0
##$DBPNAM0= <>
##$DBPNAM1= <>
$$ [...]
##$SUBNAM7= <"">
##$SUBNAM8= <"">
##$SUBNAM9= <"">
##$SW= 20.6930455092707
##$SWIBOX= (0..15)
0 0 3 0 0 0 0 0 0 0 0 0 0 0 0 0 
##$SW_h= 5175.983436853
##$TD= 65536
##$TD0= 1
##$TE= 683.16
##$TE2= 300
##$TE3= 300
##$TEG= 300
##$TL= (0..7)
0 120 120 120 120 120 120 120 
##$TP= (0..7)
150 150 150 150 150 150 150 150 
##$TP07= 0
##$TPNAME0= <>
##$TPNAME1= <>
##$TPNAME2= <>
##$TPNAME3= <>
##$TPNAME4= <>
##$TPNAME5= <>
##$TPNAME6= <>
##$TPNAME7= <>
##$TPOAL= (0..7)
0.5 0.5 0.5 0.5 0.5 0.5 0.5 0.5 
##$TPOFFS= (0..7)
0 0 0 0 0 0 0 0 
##$TUNHIN= 0
##$TUNHOUT= 0
##$TUNXOUT= 0
##$USERA1= <user>
##$USERA2= <user>
##$USERA3= <user>
##$USERA4= <user>
##$USERA5= <user>
##$V9= 5
##$VALIST= <valist>
##$VCLIST= <CCCCCCCCCCCCCCC>
##$VD= 0
##$VDLIST= <DDDDDDDDDDDDDDD>
##$VPLIST= <PPPPPPPPPPPPPPP>
##$VTLIST= <TTTTTTTTTTTTTTT>
##$WBST= 1024
##$WBSW= 4
##$XGAIN= (0..3)
0 0 0 0 
##$XL= 0
##$YL= 0
##$YMAX_a= 260602
##$YMIN_a= -249230
##$ZGOPTNS= <>
##$ZL1= 120
##$ZL2= 120
##$ZL3= 120
##$ZL4= 120
##$ABSF1= 16.522
##$ABSF2= -4.171173
##$ABSG= 5
##$ABSL= 3
##$ALPHA= 0
##$AQORDER= 0
##$ASSFAC= 0
##$ASSFACI= 0
##$ASSFACX= 0
##$ASSWID= 0
##$AUNMP= <proc_1d>
##$AZFE= 0.1
##$AZFW= 0.1
##$BCFW= 0
##$BC_mod= 0
##$BYTORDP= 0
##$COROFFS= 0
##$CY= 12.5
##$DATMOD= 1
##$DC= 0
##$DFILT= <>
##$DTYPP= 0
##$F1P= 14.0000005364418
##$F2P= -0.99999901652339
##$FCOR= 0.5
##$FTSIZE= 32768
##$FT_mod= 6
##$GAMMA= 0
##$GB= 0
##$INTBC= 1
##$INTSCL= 1
##$ISEN= 128
##$LB= 0.3
##$LEV0= 0
##$LPBIN= 0
##$MAXI= 10000
##$MC2= 0
##$MEAN= 0
##$ME_mod= 0
##$MI= 0
##$NCOEF= 0
##$NC_proc= -5
##$NLEV= 6
##$NOISF1= 0
##$NOISF2= 0
##$NSP= 0
##$NTH_PI= 0
##$NZP= 0
##$OFFSET= 16.522
##$PC= 1
##$PHC0= -52.98255
##$PHC1= 6.660039
##$PH_mod= 1
##$PKNL= yes
##$PPARMOD= 0
##$PSCAL= 4
##$PSIGN= 0
##$REVERSE= no
##$SF= 250.13
##$SI= 32768
##$SIGF1= 0
##$SIGF2= 0
##$SINO= 400
##$SIOLD= 32768
##$SREGLST= <1H.CDCl3>
##$SSB= 0
##$STSI= 32768
##$STSR= 0
##$SW_p= 5175.98343685301
##$SYMM= 0
##$S_DEV= 0
##$TDeff= 65536
##$TDoff= 0
##$TI= <Analysis number 999999
Compound Code 99
Book Reference 9
Project Code 9>
##$TILT= no
##$TM1= 0
##$TM2= 0
##$TOPLEV= 0
##$USERP1= <user>
##$USERP2= <user>
##$USERP3= <user>
##$USERP4= <user>
##$USERP5= <user>
##$WDW= 1
##$XDIM= 32768
##$YMAX_p= 558586467
##$YMIN_p= -549357
$$ End of Bruker specific parameters
$$ ---------------------------------
##NTUPLES= NMR SPECTRUM
##VAR_NAME=  FREQUENCY,     SPECTRUM/REAL,   SPECTRUM/IMAG
##SYMBOL=    X,             R,               I
##VAR_TYPE=  INDEPENDENT,   DEPENDENT,       DEPENDENT
##VAR_FORM=  AFFN,          ASDF,            ASDF
##VAR_DIM=   32768,         32768,           32768
##UNITS=     HZ,            ARBITRARY UNITS, ARBITRARY UNITS
##FACTOR=    0.157963299565203, 1,           1
##FIRST=     4132.6476996994, 0,             0
##LAST=      -1043.33573715361, 0,           0
##MIN=       -1043.33573715361, -549357,     0
##MAX=       4132.6476996994, 558586467,     0
$$ Real data points
##PAGE= N=1
##DATA TABLE= (X++(R..R)), XYDATA
$$ [...]
$$ plain form
18031 -143228 -255192 -170727 -162966 -102782 -92191 -15984 85039 11909 83475 58980 67736
18020 67736 70608 37944 -43633 161152 179882 302393 407671 379805 152282 74704 -9581
18009 -9581 -72457 -2085 26943 87849 199053 201740 18353 -7081 136386 152123 43403
17998 43403 -61454 61171 125331 192352 403079 562317 534427 254576 37398 42535 29499
17987 29499 -9999 69772 118137 119408 175649 237288 154110 142524 191060 287552 266473 215253
17975 215253 153960 190659 198767 153805 85527 64657 142903 -5957 -75804 -50933 -144715
17964 -144715 -83017 6032 -5583 643 82704 135971 170482 28002 -85644 -14599 118534
17953 118534 219577 203720 105085 106628 162686 24944 -489 38315 -97355 10532 65596
$$ packed form
18031a43228j11964Q4465P761O0184J0591P6207J01023p3130P1566k4495Q756
18020F7736K872l2664q1577K04785J8730J22511J05278k7866k27523p7578q4285
18009i581o2876P0372K9028O0906J11204K687j83387k5434J43467J5737j08720
17998D3403j04857J22625O4160O7021K10727J59238k7890k79851k17178N137j3036
17987B9499l9498P9771M8365J271N6241O1639q3178j1586M8536R6492k1079n1220
17975B15253o1293L6699Q108m4962o8278k0870P8246j48860o9847K4871r3782
17964a44715O1698Q9049j1615O226Q2061N3267L4511j42480j13646P1045J33133
17953A18534J01043j5857r8635J543N6058j37742k5433L8804j35670J07887N5064
$$ plain form
17942 65596 -9021 79647 79255 75635 163195 119702 -424 -118848 -151638 -20425 5964 52191
17930 52191 121071 78341 26741 115342 249151 456428 425682 294849 136722 -13043 23913
17919 23913 43428 78146 113397 9022 -84930 -59559 -11482 -20323 -157134 -43158 168564
17908 168564 180950 203092 105901 -31090 -30569 43201 89738 128815 218357 243252 106241
17897 106241 119740 81392 70471 87986 250665 276798 211682 146370 194907 390741 504110
17886 504110 667385 898518 1105608 1460640 1970033 2595958 2843353 2229702 1437209 1069637
17876 1069637 774454 372428 295191 304965 293635 283023 401301 290081 144242 146381 138436
17865 138436 -27861 -88375 -136664 -191507 -39275 81960 -72306 -38111 31989 -43582 -38048
$$ packed form
17942F5596p4617Q8668l92l620Q7560m3493j20126j18424l2790J31213K6389M6227
17930E2191O8880m2730n1600Q8601J33809K07277l0746j30833j58127j49765L6956
17919B3913J9515L4718L5251j04375r3952K5371M8077q841j36811J13976K11722
17908A68564J2386K2142r7191j36991N21P3770M6537L9077Q9542K4895j37011
17897A06241J3499l8348j0921J7515J62679K6133o5116o5312M8537J95834J13369
17886E04110J63275K31133K07090L55032N09393O25925K47395o13651p92493l67572
17876A069637k95183m02026p7237R774j1330j0612J18278j11220j45839K139p945
17865A38436j66297o0514m8289n4843J52232J21235j54266L4195P0100p5571N534
$$ plain form
17854 -38048 34058 -52592 -136382 -183088 -228147 -15974 169828 90652 91811 141689 157459
17843 157459 77475 -17681 -172669 -183128 -61525 -91355 -112170 -143687 -95971 5052 74214
17832 74214 -49269 -120722 21582 -17158 -244604 -279258 -289244 -161572 -136108 -89480 69159
17821 69159 197867 178946 58371 4870 17769 177996 84767 65123 8110 595 115144
17810 115144 141500 209802 99130 -43911 49589 52974 110964 54498 88572 149443 26473
17799 26473 -89282 -166289 -323512 -218371 -113730 -237322 -139782 -131875 -87166 24626 -53673
17788 -53673 -29373 18207 21621 -88532 -75515 -169268 -188217 -75900 -37035 -25151 -26871 76554
17776 76554 158126 170417 117946 16558 -34307 -192842 -88418 83355 -26303 -97632 -51170
$$ packed form
17854c8048P2106q6650q3790m6706m5059K12173J85802p9176J159M9878J5770
17843A57459p9984r5156j54988j0459J21603k9830k0815l1517M7716J01023O9162
17832G4214j23483p1453J42304l8740k27446l4654r986J27672K5464M6628J58639
17821F9159J28708j8921j20575n3501J2899J60227r3229j9644n7013p515J14549
17810A15144K6356O8302j10672j43041R3500L385N7990n6466L4074O0871j22970
17799B6473j15755p7007j57223J05141J04641j23592R7540P907M4709J11792p8299
17788e3673K4300M7580L414j10153J3017r3753j8949J12317L8865J1884j720J03425
17776G6554Q1572J2291n2471j01388n0865j58535J04424J71773j09658p1329M6462
$$ plain form
17765 -51170 -65428 -127651 -162275 -123696 -32938 35100 -45055 -99159 -148844 -118016 -117136 -129967
17753 -129967 -112917 -119340 -228392 -177935 -112791 11510 73058 144838 152044 27515 -2360
17742 -2360 80342 66086 -5300 40604 138738 131421 56550 25149 -90539 -128802 -46698 -53772
17730 -53772 -82610 -134572 -246177 -272487 -67095 64477 122959 68075 88684 115554 117105
17719 117105 113516 155686 177046 98184 78759 90139 153216 231857 241053 188007 142061 -20879
17707 -20879 -71387 -21414 4671 44741 -83597 -195143 -126676 -11841 7964 7203 59684
17696 59684 85439 41041 -199797 -165854 152496 315932 301760 157921 124419 163113 135147
17685 135147 -38264 -102219 -56780 16618 80241 90610 -26248 61621 181090 116208 129176
$$ packed form
17765e1170j4258o2223l4624L8579R0758O8038q0155n4104m9685L0828Q80j2831
17753a29967J7050o423j09052N0457O5144J24301O1548P1780P206j24529k9875
17742b360Q2702j4256p1386M5904R8134p317p4871l1401j15688l8263Q2104p074
17730e3772k8838n1962j11605k6310K05392J31572N8482n4884K0609K6870J551
17719A17105l589M2170K1360p8862j9425J1380O3077P8641R196n3046m5946j62940
17707b0879n0508M9973K6085M0070j28338j11546O8467J14835J9805p61N2481
17696E9684K5755m4398k40838L3943L18350J63436j4172j43839l3502L8694k7966
17685A35147j73411o3955M5439P3398O3623J0369j16858Q7869J19469o4882J2968
$$ plain form
17674 129176 148739 66117 30420 -47348 -222059 -165973 -145234 -156327 -110619 -89901 -45932
17663 -45932 -163062 -228048 -192388 -162096 -224483 -143575 -108563 -133925 -201896 -281138 -343167
17652 -343167 -293066 -291449 -410998 -440161 -272677 -70535 -106736 -185521 -81488 -86628 -147816
17641 -147816 -114814 -121597 -153797 -138986 -159553 -59571 88248 151230 167227 200110 209366 153415
17629 153415 56298 -79109 -223848 -125827 15989 37053 4501 10211 84371 95313 77482
17618 77482 -22472 24271 65199 153495 262260 315579 377467 304534 239415 135509 30769
17607 30769 -42482 -23531 -51770 -313 53652 65406 107698 37220 -13453 7938 87069 23343
17595 23343 -77106 -156113 -154897 -156581 -132329 -29091 -34444 -410 193207 329147 348524
$$ packed form
17674A29176J9563q2622l5697p7768j74711N6086K0739j1093M5708K0718M3969
17663d5932j17130o4986L5660L0292o2387Q0908L5012k5362o7971p9242o2029
17652c43167N0101J617j19549k9163J67484K02142l6201p8785J04033n140o1188
17641a47816L3002o783l2200J4811k0567R9982J47819O2982J5997L2883R256n5951
17629A53415r7117j35407j44739R8021J41816K1064l2552N710P4160J0942j7831
17618G7482r9954M6743M0928Q8296J08765N3319O1888p2933o5119j03906j04740
17607C0769p3251J8951k8239N1457N3965J1754M2292p0478n0673K1391P9131o3726
17595B3343j00449p9007J216j684K4252J03238n353L4034J93617J35940J9377
$$ plain form
17584 348524 300302 216282 64680 136132 121144 74875 17159 -67584 -182635 -90483 48911
17573 48911 94601 -31577 -95392 6898 -90762 -205221 -92646 51612 142805 65136 207686
17562 207686 208522 206062 344323 321658 238259 106607 3110 -77982 -18150 -26875 -64088 -93323
17550 -93323 -58919 75831 24297 109078 28982 -36070 62356 144283 142064 145876 93995 22909
17538 22909 -36672 -100891 -90448 -65754 30400 -74432 -151132 -10300 23544 -91535 -99236
17527 -99236 11278 109720 53587 191520 290902 97735 -57481 -69280 6437 -24236 -97780
17516 -97780 -177669 -186206 -49339 35304 -45499 12314 130974 15610 -55034 111595 74753
17505 74753 32633 55005 21427 17441 58654 111272 96820 63322 19845 83115 30982 53338
$$ packed form
17584C48524m8222q4020j51602P1452j4988m6269n7716q4743j15051R2152J39394
17573D8911M5690j26178o3815J02290r7660j14459J12575J44258R1193p7669J42550
17562B07686Q36k460J38261k2665q3399j31652j03497q1092N9832q725l7213k9235
17550i3323L4404J34750n1534Q4781q0096o5052R8426Q1927k219L812n1881p1086
17538B2909n9581o4219J0443K4694R6154j04832p6700J40832L3844j15079p701
17527i9236J10514R8442n6133J37933R9382j93167j55216j1799P5717l0673p3544
17516i7780p9889q537J36867Q4643q0803N7813J18660j15364p0644J66629l6842
17505G4753m2120K2372l3578l986M1213N2618j4452l3498m3477O3270n2133K2356
$$ plain form
17493 53338 57483 12640 5730 66123 2639 -190728 -281115 -248558 -216338 -211175 -225328 -161754
17481 -161754 -59626 -8428 35922 -57951 -174485 -115569 -65080 53401 84430 64484 131062
17470 131062 142664 97277 1528 -2437 16822 -96171 -101790 23944 103105 140022 40434
17459 40434 -51116 -170020 -141571 -69926 -543 -34284 -67741 61818 131384 51540 145726
17448 145726 99619 188570 325507 512032 899336 1205870 1482646 1691411 1437031 774393
17438 774393 341786 110377 47488 140127 68317 2014 12642 47303 37970 126297 86589
17427 86589 85105 92430 20122 -34203 -65412 -69581 -112264 -121612 -10500 7183 -23476 -90819
17415 -90819 -26710 7018 -60714 -157860 -1359 118786 73666 -105378 -104339 -72820 -16409
$$ packed form
17493E3338M145m4843o910O0393o3484j93367r0387L2557L2220N163j4153O3574
17481a61754J02128N1198M4350r3873j16534N8916N0489J18481L1029j9946O6578
17470A31062J1602m5387r5749l965J9259j12993n619J25734P9161L6917r9588
17459D0434r1550j18904K8449P1645O9383l3741l3457J29559O9566p9844R4186
17448A45726m6107Q8951J36937J86525L87304L06534K76776K08765k54380o62638
17438G74393m32607k31409o2889R2639p1810o6303J0628L4661r333Q8327l9708
17427H6589j484P325p2308n4325l1209m169m2683r348J11112J7683l0659o7343
17415i0819O4109L3728o7732r7146J56501J20145m5120j79044J039L1519N6411
$$ plain form
17404 -16409 50652 35352 100378 58664 -91994 -204010 -90880 -146880 -186883 -175272 -239266
17393 -239266 -110201 -26495 -185785 -230196 -295778 -277178 -256315 -323170 -312855 -340345 -260520
17382 -260520 -313975 -243122 -257369 -225558 -123441 -175087 -374446 -523120 -320201 -114537
17372 -114537 -10121 -15707 -105933 -14566 71134 103790 40575 1481 -26433 -128848 -152129
17361 -152129 -294730 -203151 -137409 -55385 -24700 19670 -69914 -78813 -29199 65249 60118 -153670
17349 -153670 -226262 -174792 -172002 -77252 -35506 15044 -36401 -206592 -301621 -348394 -231597
17338 -231597 -159103 21433 -45272 -68481 -61544 -10761 6653 41573 138231 237032 301343
17327 301343 238931 252366 285067 268302 262000 270310 194833 -89810 -104511 27873 -65304
$$ packed form
17404a6409O7061j5300O5026m1714j50658j12016J13130n6000m0003J1611o3994
17393b39266J29065Q3706j59290m4411o5582J8600K0863o6855J0315k7490P9825
17382b60520n3455P0853j4247L1811J02117n1646j99359j48674K02919K05664
17372a14537J04416n586r0226R1367Q5700L2656o3215l9094k7914j02415k3281
17361a52129j42601R1579O5742Q2024L0685M4370q9584q899M9614R4448n131k13788
17349a53670p2592N1470K790R4750M1746N0550n1445j70191r5029m6773J16797
17338b31597P2494J80536o6705k3209O937N0783J7414L4920R6658R8801O4311
17327C01343o2412J3435L2701j6765o302Q310p5477k84643j4701J32384r3177
$$ plain form
17316 -65304 -63505 -97070 -162084 -115150 15398 99731 18585 16273 94349 36694 169540 151659
17304 151659 158988 178717 -8871 -154975 -171165 -211430 -92323 -44805 -87675 -168632 -236980
17293 -236980 -202573 -181257 -213719 -202797 -73218 617 175319 151377 75639 96166 136290
17282 136290 -58808 -108764 -166791 -204111 41833 122960 50443 -9171 -66826 -32595 5426
17271 5426 -30193 -58425 -1387 80514 51852 -31747 -37604 50197 106565 -49641 -103341 -79500
17259 -79500 -268515 -346781 -86313 1785 49948 95218 86545 14437 205 -66807 -205911
17248 -205911 -278000 -182727 -102839 -142043 -224399 -111403 104353 175083 -102787 -172725 -119198
17237 -119198 -84998 -127323 -6420 20144 -34922 -62805 -8469 17341 -22219 -45407 -167875
$$ packed form
17316f5304J799l3565o5014M6934J30548Q4333q1146k312P8076n7655J32846j7881
17304A51659P329J9729j87588j46104j6190m0265J19107M7518m2870q0957o8348
17293b36980L4407K1316l2462J0922J29579P3835J74702k3942p5738K0527M0124
17282A36290j95098m9956n8027l7320K45944Q1127p2517n9614n7655L4231L8021
17271E426l5619k8232N7038Q1901k8662q3599n857Q7801N6368j56206n3700K3841
17259g9500j89015p8266K60468Q8098M8163M5270q673p2108j4232o7012j39104
17248b05911p2089R5273P9888l9204q2356J12996K15756P0730k77870o9938N3527
17237a19198L4200m2325J20903K6564n5066k7883N4336K5810l9560k3188j22468
$$ plain form
17226 -167875 -323520 -203992 -108636 -114762 13384 13948 -31190 -54657 -182492 -119111 -165974
17215 -165974 -178574 -177127 -271241 -309794 -315021 -270955 -280325 -237591 -144570 -145209 -140842 -126285 -67252
17202 -67252 24920 76810 -28119 -108302 -35146 -54538 -70074 -70886 29758 9569 52886 73648
17190 73648 556 87476 112710 44586 -90921 -102430 56033 109744 -32056 -92807 -107280
17179 -107280 -32561 -42767 -57099 10097 7505 -5550 -68450 -136634 -269537 -293060 -213006
17168 -213006 -198555 -112090 -94331 -33977 -96731 -240732 -313035 -269634 -186120 -187442 -185491 -54735
17156 -54735 -27498 -49980 -29702 19319 96996 83532 66714 -12359 -36076 -39508 -142290 -122217
17144 -122217 -206671 -344199 -377261 -158372 -110016 -168281 -104437 -49660 -124406 -160054 -50924
$$ packed form
17226a67875j55645J19528R5356o126J28146N64m5138k3467j27835O3381m6863
17215a65974j2600J447r4114l8553n227M4066r370M2734R3021o39M367J4557N9033
17202f7252R2172N1890j04929q0183P3156j9392j5536q12J00644k0189M3317K0762
17190G3648p3092Q6920K5234o8124j35507j1509J58463N3711j41800o0751j4473
17179a07280P4719j0206j4332O7196k592j3055o2900o8184j32903k3523Q0054
17168b13006J4451Q6465J7759O0354o2754j44001p2303M3401Q3514j322J951J30756
17156e4735K7237k2482K0278M9021P7677j3464j6818p9073k3717l432j02782K0073
17144a22217q4454j37528l3062K18889M8356n8265O3844N4777p4746l5648J09130
$$ plain form
17133 -50924 142649 176895 32297 -98900 -77277 -31853 -37430 47112 135437 73973 -90641
17122 -90641 -353707 -334527 -211960 -178703 -83107 -77561 -17613 -15728 19574 223673 237277
17111 237277 210608 137564 84031 167504 139565 9582 -11936 -90288 2696 -118155 -192778
17100 -192778 -74531 127792 162224 54259 12829 10370 164236 127880 -13611 -26735 -50605
17089 -50605 39011 47238 81421 21399 -60916 -1639 116590 133564 17188 -186755 -280285
17078 -280285 -231185 -56305 -192218 -306778 -281964 -343212 -361139 -243767 -152846 -211062 -226893
17067 -226893 -163856 -234181 -270032 -200382 -227573 -275607 -225447 -131825 -95585 -87253 -89785 -28312
17055 -28312 16140 17659 -99955 -94162 29102 58125 98118 53988 41478 96611 133460 122158
$$ packed form
17133e0924J93573L4246j44598j31197K1623M5424n577Q4542Q8325o1464j64614
17122i0641k63066J9180J22567L3257R5596N546N9948J885L5302K04099J3604
17111B37277k6669p3044n3533Q3473k7939j29983k1518p8352R2984j20851p4623
17100a92778J18247K02323L4432j07965m1430k459J53866l6356j41491j3124k3870
17089e0605Q9616Q227L4183o0022q2315N9277J18229J6974j16376k03943r3530
17078b80285M9100J74880j35913j14560K4814o1248j7927J17372R0921n8216j5831
17067b26893O3037p0325l5851O9650k7191m8034N0160R3622L6240Q332k532O1473
17055b8312M4452J519j17614N793J23264K9023L9993m4130j2510N5133L6849j1302
$$ plain form
17043 122158 89495 -109585 -204004 -259408 -318867 -273808 -214682 -174580 -272029 -349527 -119860
17032 -119860 144838 161117 30999 1126 104742 202848 133862 -72709 -106007 -155092 -223541
17021 -223541 -151040 -221741 -210284 -112252 39100 112228 10156 -80863 20631 105033 -48920
17010 -48920 -109337 -76982 -123949 -258367 -250455 -94812 -59916 -45857 -128134 -82546 -1675
16999 -1675 42271 76277 11094 -108574 -198546 -273472 -270027 -133711 -67822 31266 35651 -53638
16987 -53638 -115425 -123791 -58978 -210920 -198051 11812 39720 3822 -101827 -63893 23749
16976 23749 -28336 -43388 28093 146737 104836 75579 -27095 -20713 -54151 65884 37743
16965 37743 -90789 -42246 -19403 12534 4660 -39692 -41567 63175 78791 60362 110110 147373
$$ packed form
17043A22158l2663j99080r4419n5404n9459M5059N9126M0102r7449p7498K29667
17032a19860K64698J6279j30118k9873J03616R8106o8986k06571l3298m9085o8449
17021b23541P2501p0701J1457R8032J51352P3128j02072r1019J01494Q4402j53953
17010d8920o0417L2355m6967j34418P912J55643L4896J4059q2277M5588Q0871
16999a675M3946L4006o5183j19668q9972p4926L445J36316O5889R9088M385q9289
16987e3638o1787q366O4813j51942J2869K09863K7908l5898j05649L7934Q7642
16976B3749n2085j5052P1481J18644m1901k9257j02674O382l3438J20035k8141
16965C7743j28532M8543K2843L1937p874m4352j875J04742J5616j8429M9748L7263
$$ plain form
16953 147373 -38226 -219230 -239406 -154104 -129104 -70910 -36941 -90757 -71417 -76071 -27595
16942 -27595 -21021 3424 -169927 -267383 -68584 63822 45180 -56739 -65155 65035 44395
16931 44395 31273 138989 13035 100697 76664 -49928 -132509 -74648 -2265 -137048 -199234
16920 -199234 -165727 -119726 -54291 -2851 -118252 -230395 -212702 -162688 -54137 21108 52152
16909 52152 28425 15029 -93861 -150780 -22780 82341 46643 23553 57565 107335 10864
16898 10864 -65431 28371 43071 -157413 -228521 -111474 -144022 3080 83820 18647 153944
16887 153944 171098 90775 48364 57798 67724 51136 -58202 -34122 12140 63015 112855 157266
16875 157266 79716 -69094 -147960 -138367 20913 133175 213338 194991 5541 -95760 -17750
$$ packed form
16953A47373j85599j81004k0176Q5302K5000N8194L3969n3816J9340m654M8476
16942b7595O574K4445j73351r7456J98799J32406j8642j01919q416J30190k0640
16931D4395j3122J07716j25954Q7662k4033j26592q2581N7861P2383j34783o2186
16920a99234L3507M6001O5435N1440j15401j12143J7693N0014J08551P5245L1044
16909E2152k3727j3396j08890n6919J28000J05121l5698k3090L4012M9770r6471
16898A0864p6295R3802J4700k00484p1108J17047l2548J47102Q0740o5173J35297
16887A53944J7154q0323m2411R434R926j6588j09338K4080M6262N0875M9840M4411
16875A57266p7550j48810p8866R593J59280J12262Q0163j8347j89450j01301P8010
$$ plain form
16864 -17750 -35719 -46017 74453 115567 20752 40573 4544 -39702 -166272 -164045 -62461
16853 -62461 -15424 -108344 -241242 -180146 -226975 -207859 -62783 19254 -47570 -43455 -137128
16842 -137128 -243435 -176983 -146705 -126146 -132446 -43382 -9272 -29983 104791 70398 -28468
16831 -28468 -36454 -91432 -93113 -53541 28008 -2026 -76630 -80150 116098 85449 -25516 -47693
16819 -47693 -108784 -94374 -111941 -80814 32415 -35977 -83724 -126342 -136127 -81734 -68306 -99504
16807 -99504 -205493 -259857 -243285 -105181 -155870 -40601 70021 130299 174789 97691 -2508
16796 -2508 23846 162729 191614 84931 20831 99490 178986 133332 60010 8255 -514 10093
16784 10093 -123146 -156415 -34819 7821 -33741 -98708 -58168 -48808 1840 -7097 -70366 -32596
$$ packed form
16864a7750j7969j0298J20470M1114r4815J9821l6029m4246j26570K227J01584
16853f2461M7037r2920j32898O1096m6829J9116J45076Q2037o6824M115r3673
16842a37128j06307O6452L0278K0559o300Q9064L4110k0711J34774l4393r8866
16831b8468p986n4978j681L9572Q1549l0034p4604l520J96248l0649j10965k2177
16819d7693o1091J4410j7567L1127J13229o8392m7747m2618r785N4393J3428l1198
16807i9504j05989n4364J6572J38104n0689J15269J10622O0278M4490p7098j00199
16796b508K6354J38883K8885j06683o4100P8659P9496m5654p3322n1755q769J0607
16784A0093j33239l3269J21596M2640m1562o4967M0540R360N0648q937o3269L7770
$$ plain form
16772 -32596 -159777 -276057 -57323 112242 86064 58910 -55003 114292 117553 81894 -62488
16761 -62488 -183831 -184721 -127251 -60876 -94173 -178375 -138661 -118713 -70200 -21479 -147698 -71128
16749 -71128 -8060 -2486 83660 169684 142030 78187 153114 129982 69763 174430 217205 237710
16737 237710 220663 129157 4717 -100437 -199969 -210284 -250952 -173858 71026 159682 96311
16726 96311 126492 65488 -77049 -119876 -151190 -183546 -217339 -209278 -221601 -146204 -72345 5667
16714 5667 11774 4581 684 -55946 -88145 10100 113702 46804 -36711 -7706 28796 -56846
16702 -56846 -137489 -47609 22015 -12481 -97001 42379 67435 14821 28718 -142325 -112616
16691 -112616 5889 43844 -50977 -204280 -239688 -109403 18441 13527 1566 111744 99901
$$ packed form
16772c2596j27181j16280K18734J69565k6178k7154j13913J69295L261l5659j44382
16761f2488j21343q90N7470O6375l3297q4202L9714J9948M8513M8721j26219P6570
16749g1128O3068N574Q6146Q6024k7654o3843P4927k3132o0219J04667M2775K0505
16737B37710j7047r1506j24440j05154r9532j0315m0668P7094K44884Q8656o3371
16726I6311L0181o1004j42537m2827l1314l2356l3793Q061j2323P5397P3859P8012
16714E667O107p193l897n6630l2199R8245J03602o6898q3515K9005L6502q5642
16702e6846q0643Q9880O9624l4496q4520J39380K5056n2614J3897j71043K9709
16691a12616J18505L7955r4821j53303l5408J30285J27844m914j1961J10178j1843
$$ plain form
16680 99901 118552 105624 82181 23412 -124790 -218580 -143803 -177027 -257152 -126537 -56062
16669 -56062 -19691 -91408 -97984 -58636 -83182 -162390 -234492 -288698 -185035 -259892 -170718 -21170
16657 -21170 -159220 -164631 -195812 -182375 -117634 -210957 -275140 -246963 -313052 -320042 -368717 -549357
16645 -549357 -414612 -303685 -151468 -65906 -116952 -34287 -135987 -214488 -299731 -313000 -184375
16634 -184375 -31767 -137947 -191481 -292666 -273128 -54323 26769 449 -42846 -74556 -111894
16623 -111894 -13921 6329 -85308 -224920 -194296 -180359 -275616 -236826 -188196 -130000 -141614
16612 -141614 -158163 -193977 -201997 -184686 -159902 -14261 6224 71524 200091 209649 132170
16601 132170 -52578 -168411 -250128 -344026 -343934 -247245 -104649 -49180 -35000 64292 57300 58093
$$ packed form
16680I9901J8651j2928k3443n8769j48202r3790P4777l3224q0125J30615P0475
16669e6062L6371p1717o576L9348k4546p9208p2102n4206J03663p4857Q9174J49548
16657b1170j38050n411l1181J3437O4741r3323o4183K8177o6089o990m8675j80640
16645e49357J34745J10927J52217Q5562n1046Q2665j01700p8501q5243j3269J28625
16634a84375J52608j06180n3534j01185J9538K18805Q1092k6320m3295l1710l7338
16623a11894R7973K0250r1637j39612L0624J3937r5257L8790M8630N8196j1614
16612a41614j6549l5814q020J7311K4784J45641K0485O5300J28567R558p7479
16601A32170j84748j15833q1717r3898R2R6689J42596N5469J4180R9292o992P93
$$ plain form
16589 58093 64919 27470 67079 96171 97304 -6017 -101721 -203336 -283434 -316722 -324142 -154044
16577 -154044 -37007 -9807 -153912 -226464 -63351 39953 13626 -76526 -112975 -133289 -45181
16566 -45181 -49984 49236 181050 124029 142944 70620 21658 -69593 -94373 -254591 -193145
16555 -193145 18790 -14354 -96598 -58460 -5723 -81786 -164576 -156917 -244910 -176578 9836
16544 9836 6577 -115488 -145071 -114844 -30391 166600 83359 122566 146517 112733 96825 39622
16532 39622 -41585 -169419 -250894 -182301 -38951 4518 86983 128537 10343 -122638 3664
16521 3664 -2083 -11065 -113590 -5191 46174 -48586 -75313 -110849 -168697 -79257 -40854 -226765
16509 -226765 -6663 108418 -485 -158457 -159186 -57249 183775 198147 68582 -18966
$$ packed form
16589E8093O826l7449L9609K9092J133j03321r5704j01615q0098l3288p420J70098
16577a54044J17037K7200j44105p2552J63113J03304k6327r0152l6449k0314Q8108
16566d5181m803R9220J31814n7021J8915p2324m8962r1251k4780j60218O1446
16555a93145K11935l3144q2244L8138N2737p6063q2790P659q7993O8332J86414
16544I836l259j22065k9583L0227Q4453J96991q3241L9207K3951l3784j5908n7203
16532C9622q1207j27834q1475O8593J43350M3469Q2465M1554j18194j32981J26302
16521C664n747q982j02525J08399N1365r4760k6727l5536n7848Q9440L8403j85911
16509b26765K20102J15081j08903j57972p29J01937K41024J4372j29565q7548
$$ plain form
16499 -18966 -30764 -31049 -4898 -46194 -48703 -29474 24281 69810 28122 -97844 -93663 -5160
16487 -5160 120971 178852 176027 125450 10654 10523 50049 102959 194518 175921 -12191 -36856
16475 -36856 110695 2058 -62675 -7708 8197 -47618 -33522 91956 19260 97491 87769
16464 87769 50867 92439 182880 111219 -101721 -199959 -274708 -193328 -81045 19773 26921
16453 26921 69311 8520 -37875 -18463 -32363 -918 -11889 21776 -40251 -14182 -83730 -149201
16441 -149201 -79425 36539 27040 -44322 -22190 -113967 -91589 -67584 97531 222458 89686
16430 89686 -24336 31071 123463 30250 28108 45762 -55290 -30933 47796 62342 -33675
16419 -33675 -125711 -213684 -353892 -281194 -247824 -293117 -211839 -71152 -42077 -77954 -116625
$$ packed form
16499a8966j1798k85K6151m1296k509J9229N3755M5529m1688j25966M181Q8503
16487e160J26131N7881k825n0577j14796j31L9526N2910R1559j8597j88112k4665
16475c6856J47551j08637o4733N4967J5905n5815J4096J25478p2696P8231r722
16464H7769l6902M1572R0441p1661k12940r8238p4749Q1380J12283J00818P148
16453B6921M2390o0791m6395J9412j3900L1445j0971L3665o2027K6069o9548o5471
16441a49201O9776J15964r499p1362K2132r1777K2378K4005J65115J24927j32772
16430H9686j14022N5407R2392r3213k142J7654j01052K4357P8729J4546r6017
16419c3675r2036q7973j40208P2698L3370m5293Q1278J40687K9075l5877l8671
$$ plain form
16408 -116625 -164983 -242462 -90885 -127349 -144946 -160057 -176051 -202774 -188769 -205959 -216663
16397 -216663 -186396 -83539 -59599 -82300 -100977 -109373 -65375 -69603 -183659 -277658 -253835
16386 -253835 -177791 -135422 -114397 -32651 -43283 14534 64950 136273 190837 206067 179210
16375 179210 114702 76401 24731 68944 126409 105058 187646 82615 12848 -99097 -259303
16364 -259303 -242152 -33613 -150813 -137226 -81298 -37597 -136429 -204299 -91871 76354 18954
16353 18954 -6500 3521 132881 44672 21682 -25680 -62271 -137766 -134393 -126339 -67747 -51740
16341 -51740 -23275 -111815 -135881 -55796 -42904 25067 78808 -15842 -77876 -45255 21688 107963
16329 107963 123132 141547 61267 -55897 107518 228911 337077 355113 277674 234554 270442
$$ packed form
16408a16625m8358p7479J51577l6464j7597j5111j5994k6723J4005j7190j0704
16397b16663L0267J02857K3940k2701j8677q396M3998m228j14056r3999K3823
16386b53835P6044M2369K1025Q1746j0632N7817N0416P1323N4564J5230k6857
16375A79210o4508l8301n1670M4213N7465k1351Q2588j05031o9767j11945j60206
16364b59303J7151K08539j17200J3587N5928M3701r8832o7870J12428J68225n7400
16353A8954k5454J0021J29360q8209k2990m7362l6591p5495L373Q054N8592J6007
16341e1740K8465q8540k4066Q0085J2892O7971N3741r4650o2034L2621O6943Q6275
16329A07963J5169J8415q0280j17164J63415J21393J08166J8036p7439m3120L5888
$$ plain form
16318 270442 248892 13045 59447 139600 129209 25856 -36388 -146913 -139531 -96770 -114225
16307 -114225 -184736 -115706 -23154 -56561 -54486 -179869 -224717 -152770 -95875 37323 136907
16296 136907 167111 234690 348137 419382 595377 742126 839906 802605 645951 365874
16286 365874 153446 184945 155352 17884 -42429 37886 166428 129399 11980 21297 55285
16275 55285 61357 63544 67284 -109601 -87966 -148327 -187644 -239353 -170943 4895 -1042 -63596
16263 -63596 -173076 -177609 -39605 -23608 -62534 -90724 -88944 8678 69623 206798 340500
16252 340500 435065 520121 635481 490388 420444 463977 406667 217340 204071 219696 276125
16241 276125 134796 -7544 -42659 53475 176618 193826 255194 245192 177300 95778 24823
$$ packed form
16318B70442k1550k35847M6402Q0153j0391j03353o2244j10525P382M2761j7455
16307a14225p0511O9030R2552l3407K075j25383m4848P1947N6895J33198R9584
16296A36907L0204O7579J13447P1245J75995J46749R7780l7301j56654k80077
16286C65874k12428L1499k9593j37468o0313Q0315J28542l7029j17419R317L3988
16275E5285O072K187L740j76885K1635o0361l9317n1709O8410J75838n937o2554
16263f3596j09480m533J38004J5997l8926k8190J780R7622O0945J37175J33702
16252C40500R4565Q5056J15360j45093o9944M3533n7310j89327j3269J5625N6429
16241B76125j41329j42340l5115R6134J23143J7208O1368j0002o7892q1522p0955
$$ plain form
16230 24823 -22057 -93479 -111756 -122512 98241 143384 -31063 -111627 -21945 128087 279178
16219 279178 300968 228876 172835 151063 192455 186782 15058 -132250 -119626 -59024 48143
16208 48143 141653 231588 210642 263390 214635 48265 -133722 -48645 136211 203212 153534
16197 153534 95590 173591 225424 131836 180973 150396 139924 116319 62311 -15242 -30160
16186 -30160 -110406 -32847 63759 68882 -60780 -128641 -193640 -143254 -68667 -112859 -194471 -170821
16174 -170821 -86084 -133608 -162888 -138908 -40053 1719 -51858 -191976 -214089 -253326 -196167
16163 -196167 -65412 -126804 -109962 70926 216973 227317 282524 162597 13390 5003 -67202
16152 -67202 12099 26509 82150 2018 -102756 -24000 -69941 -117294 -148 115950 1496
$$ packed form
16230B4823m6880p1422j8277j0756K20753M5143j74447q0564Q9682J50032J51091
16219B79178K1790p2092n6041k1772M1392n673j71724j47308J2624O0602J07167
16208D8143R3510Q9935k0946N2748m8755j66370j81987Q5077J84856O7001m9678
16197A53534n7944P8001N1833r3588M9137l0577j0472k3605n4008p7553j4918
16186c0160q0246P7559R6606N123j29662o7861o4999N0386P4587m4192q1612K3650
16174a70821Q4737m7524k9280K3980R8855M1772n3577j40118k2113l9237N7159
16163a96167J30755o1392J6842J80888J46047J0344N5207j19927j49207q387p2205
16152f7202P9301J4410N5641q0132j04774P8756m5941m7353J17146J16098j14454
$$ plain form
16141 1496 -59582 -28352 29517 -45764 -95062 -56833 112573 37862 -48310 -29314 -86024 -31368
16129 -31368 -113865 -181247 -70034 -86552 -145433 -277283 -270139 -211664 -199677 -206246 -185181 -150550
16117 -150550 -149651 -188870 -17492 83351 158254 102061 -84085 -76146 17268 116780 75828
16106 75828 -24457 -88467 -103414 -57986 -142943 -102373 99294 171162 118059 17622 65091
16095 65091 45463 105954 116794 31972 -65644 -133946 -186853 -88217 -99470 -10301 37922 132183
16083 132183 74676 -91069 -190995 -132563 -23160 -22877 -86314 -13703 -8783 -180716 -196408
16072 -196408 -24661 47542 77028 10560 45496 77409 50030 110186 134852 44006 15465
16061 15465 -50345 -225452 -181975 -172090 -215584 -208002 -99356 -103412 -177900 -198419 -23065 -11503
$$ packed form
16141A496o1078L1230N7869p5281m9298L8229J69406p4711q6172J8996n6710N4656
16129c1368q2497o7382J11213j6518n8881j31850P144N8475J1987o569K1065L4631
16117a50550Q99l9219J71378J00843P4903n6193j86146P939R3414R9512m0952
16106G5828j00285o4010j4947M5428q4957M0570K01667P1868n3103j00437M7469
16095F5091j9628O0491J0840q4822r7616o8302n2907R8636j1253Q9169M8223R4261
16083A32183n7507j65745r9926N8432J09403K83o3437P2611M920j71933j5692
16072a96408J71747P2203K9486o6468L4936L1913k7379O0156K4666r0846k8541
16061A5465o5810j75107M3477R885m3494P582J08646m056p4488k0519J75354J1562
$$ plain form
16049 -11503 -115630 -170958 -191664 -29011 25376 89818 61345 -62591 -82565 -13895 40580
16038 40580 -40393 -97784 -176472 -126781 -136163 -172061 -122399 -112245 -293306 -289357 -201293 -29353
16026 -29353 33960 7200 -108026 -139180 -174051 -33820 9913 48498 -56314 3777 135544
16015 135544 99143 -52528 -253654 -118637 45945 63979 -138727 -169187 -155616 -185592
16005 -185592 -141497 -126871 -99733 -100482 50762 86818 58848 5903 -149572 -94023 -100523 -40470
15993 -40470 -106154 -42389 -2832 -22951 83549 58106 -94350 -53392 -142013 -231762 -260908
15982 -260908 -240185 -181899 3287 138672 126442 34553 -80365 -147307 31245 188188
15972 188188 103123 126969 349594 441290 311295 209991 217578 207463 314269 298112 177725
$$ packed form
16049a1503j04127n5328k0706J62653N4387O4442k8473j23936j9974O8670N4475
16038D0580q0973n7391p8688M9691r382l5898M9662J0154j81061L949Q8064J71940
16026b9353O3313k6760j15226l1154l4871J40231M3733L8585j04812O0091J31767
16015A35544l6401j51671k01126J35017J64582J8034k02706l0460J3571k9976
16005a85592M4095J4626K7138p49J51244L6056k7970n2945j55475N5549o500O0053
15993d0470o5684O3765L9557k0119J06500k5443j52456M0958q8621q9749k9146
15982b60908K0723N8286J85186J35385j2230r1889j14918o6942J78552J56943
15972A88188q5065K3846K22625R1696j29995j01304P587j0115J06806j6157j20387
$$ plain form
15961 177725 92689 -26017 -74058 -88260 -165101 -145208 68822 37513 11773 -38546 1424
15950 1424 -75390 -24316 11095 -11546 -29834 -41071 -169792 -204135 -221051 -96830 -58786
15939 -58786 68849 -11766 -86175 -128095 -141844 -70614 -169114 -48687 -9989 -25694 5559
15928 5559 153577 115201 95179 63883 180019 84734 -42661 21339 63575 84054 11574
15917 11574 -58355 -97747 -47735 39190 117734 10743 -133196 -178373 -44650 -18977 25197
15906 25197 -20193 -77114 108665 116912 76850 100831 125613 148255 103833 16460 40230 63588
15894 63588 -12330 -24066 -80700 78107 206759 105632 65517 156854 105195 71110 -13927
15883 -13927 -58686 72756 114956 67486 231277 169066 36251 -51140 -2501 20138 -50230
$$ packed form
15961A77725q5036j18706m8041j4202p6841J9893K14030l1309k5740n0319L9970
15950A424p6814N1074L5411k2641j8288j1237j28721l4343j6916J24221L8044
15939e8786J27635q0615p4409m1920j3749P1230r8500J20427L8698j5705L1253
15928E559J48018l8376k0022l1296J16136r5285j27395O4000M2236K0479p2480
15917A1574o9929l9392N0012Q6925P8544j06991j43939m5177J33723K5673M4174
15906B5197m5390n6921J85779Q247m0062K3981K4782K2642m4422q7373K3770K3358
15894F3588p5918j1736n6634J58807J28652j01127m0115R1337n1659l4085q5037
15883a3927m4759J31442M2200m7470J63791o2211j32815q7391M8639K2639p0368
$$ plain form
15872 -50230 -43501 122423 197823 183838 23114 -140259 -156140 -219235 -216026 -77091 24402
15861 24402 88852 134502 3159 -65673 -66518 -124823 -153128 -89123 -86397 -42813 65471 -40905
15849 -40905 -83618 -10724 88350 49087 39057 61929 -52043 -67004 -17763 -20174 -648 21695
15837 21695 10861 -53617 -118641 -112810 -118946 -99518 -17523 -23600 -35223 50689 67648 -5679
15825 -5679 -94174 -62730 35973 221604 161029 136002 28368 -194334 -136780 451 -16331
15814 -16331 -40082 -94456 -199220 -232994 -210017 -204900 -177500 -135257 -109766 -61270 -184668
15803 -184668 -118454 -52728 -78106 -66505 -140365 -88597 -91130 -71555 7651 -14047 -16244 110081
15791 110081 92566 -6496 56217 204235 286364 241865 97172 68401 -81932 4066 110200
$$ packed form
15872e0230O729J65924P5400j3985j60724j63373j5881o3095L209J38935J01493
15861B4402O4450M5650j31343o8832q45n8305k8305O4005K726M3584J08284j06376
15849d0905m2713P2894R9074l9263j0030K2872j13972j4961M9241k411J9526K2343
15837B1695j0834o4478o5024N831o136J9428Q1995o077j1623Q5912J6959p3327
15825e679q8495L1444R8703J85631o0575k5027j07634k22702N7554J37231j6782
15814a6331k3751n4374j04764l3774K2977N117K7400M2243K5491M8496j23398
15803a84668O6214O5726k5378J1601p3860N1768k533J9575P9206k1698k197J26325
15791A10081j7515r9062O2713J48018Q2129m4499j44693k8771j50333Q5998J06134
$$ plain form
15780 110200 -8808 -107399 -79573 -68741 -27262 8554 33429 -30606 -76425 95817 107082
15769 107082 62478 -3495 -36513 -117645 -143008 -216119 -151820 -238639 -352911 -409649 -265778
15758 -265778 -43720 -13516 33833 174801 238644 220267 173157 107158 8510 -73064 -16226
15747 -16226 142670 96322 -38659 1489 31757 -9529 24317 98880 195045 267567 218791
15736 218791 130749 168393 206457 181238 98089 72162 76050 -5193 -159691 -240044 -66998
15725 -66998 96198 186267 216628 219656 227534 350438 235374 174142 264195 273105 285789 208825
15713 208825 80806 58331 -46753 4121 41163 -21838 -42546 -46921 -2752 22359 5005
15702 5005 -36481 -38565 -103787 -9978 4651 -51473 -41059 67302 250758 235876 40271
$$ packed form
15780A10200j19008r8591K7826J0832M1479L5816K4875o4035m5819J72242J1265
15769A07082m4604o5973l3018q1132k5363p3111O4299q6819j14272n6738J43871
15758b65778K22058L0204M7349J40968O3843j8377m7110o5999r8648q1574N6838
15747a6226J58896m6348j34981M0148L0268m1286L3846P4563R6165P2522m8776
15736B18791q8042L7644L8064k5219q3149k5927L888q1243j54498q0353J73046
15725f6998J63196R0069L0361L028P878J22904j15064o1232R0053Q910J2684p6964
15713B08825j28019k2475j05084N0874L7042o3001k0708m375M4169K5111j7354
15702E005m1486k084o5222R3809J4629n6124J0414J08361J83456j4882j95605
$$ plain form
15691 40271 -181237 -148917 -45396 -27649 -39770 -33890 85207 123880 169557 127250 93073
15680 93073 119821 171911 66031 107609 64913 11116 -37526 -207207 -133145 13649 -30354
15669 -30354 -24575 -92724 -176398 -167003 -116799 -42134 -28829 -72406 -147767 -61108 -93750 -196637
15657 -196637 -182151 -115397 -200122 -91727 -72064 78604 302582 232659 172528 168436 48626
15646 48626 19334 -47281 -87830 -30003 -74861 -156067 -164847 -68463 17847 121852 -61348
15635 -61348 -131214 -138539 -125053 -114514 -162382 -129190 -144513 -115861 -123543 -44574 -78357 -163625
15623 -163625 -206303 -76048 -7597 -2457 62912 34042 78780 148802 90155 61168 59803 -20806
15611 -20806 -78374 -200331 -250524 -202518 -115898 -25834 -75289 -30800 -67112 -211495 -223861
$$ packed form
15691D0271k21508L2320J03521J7747j2121N880J19097L8673M5677m2307l4177
15680I3073K6748N2090j05880M1578m2696n3797m8642j69681P4062J46794m4003
15669c0354N779o8149q3674R395N0204P4665J3305m3577p5361Q6659l2642j02887
15657a96637J4486O6754q4725J08395J9663J50668K23978o9923o0131m092j19810
15646D8626k9292o6615m0549N7827m4858q1206q780R6384Q6310J04005j83200
15635f1348o9866p325J3486J0539m7868L3192j5323K8652p682P8969l3783q5268
15623a63625m2678J30255O8451N140O5369k8870M4738P0022n8647k8987j365q0609
15611b0806n7568j21957n0193M8006Q6620R0064m9455M4489l6312j44383j2366
$$ plain form
15600 -223861 -172368 -217338 -259381 -235747 -187626 -276668 -352164 -337729 -197668 -40607 29168
15589 29168 29981 102257 116203 94273 155344 37695 -100500 -42118 81214 75379 34533 71164
15577 71164 -3377 -17363 9891 -4440 -64296 -17202 51757 66212 33679 31291 -118129 -233642
15565 -233642 -174472 -189258 -249057 -194275 -177427 -94200 21382 19170 12176 -26938 -17982 37751
15553 37751 130266 79825 21692 -24059 75408 54550 25995 -17826 3315 35573 1016 5000
15541 5000 64423 72616 -68803 -182769 -146717 37468 70243 42224 155318 169788 126901
15530 126901 40964 -99993 -192315 -223858 -225518 -320016 -169746 -131270 -312918 -402150 -345544
15519 -345544 -183121 -166599 -161483 -85490 -91001 56809 156844 90402 72384 115356 -46815
$$ packed form
15600b23861N1493m4970m2043K3634M8121q9042p5496J4435J40061J57061O9775
15589B9168Q13P2276J3946k1930O1071j17649j38195N8382J23332n835m0846L6631
15577G1164p4541j3986K7254j4331n9856M7094O8959J4455l2533k388j49420j15513
15565b33642N9170j4786n9799N4782J6848Q3227J15582k212o994l9114Q956N5733
15553C7751R2515n0441n8133m5751R9467k0858k8555m3821K1141L2258l4557L984
15541E000N9423Q193j41419j13966L6052J84185L2775k8019J13094J4470m2887
15530A26901q5937j40957r2322l1543j660r4498J50270L8476j81648q9232N6606
15519c45544J62423J6522N116P5993n511J47810J00035o6442j8018M2972j62171
$$ plain form
15508 -46815 -67963 13551 48262 55571 23836 96282 187290 93144 68417 160411 177948 -82158
15496 -82158 -141150 -106289 -34584 -58042 -85034 -122018 -66873 -12934 115344 188834 100516
15485 100516 124237 -14805 -53346 35307 -13899 -68751 -4363 -21760 49048 72976 -64963
15474 -64963 -129080 -114182 -123197 -129238 -22197 -744 -30773 20578 58750 -113812 -110718 6973
15462 6973 -49958 -10986 -30294 -5701 121150 249560 192848 198443 163773 28825 -34650
15451 -34650 -211342 -220856 -186989 -49394 -10937 21582 61241 83397 196561 360065 221334
15440 221334 17701 -121890 -78203 -28736 -5420 -13234 -114852 -114934 -59795 91075 123087
15429 123087 26548 -23442 41994 58008 59633 -24515 -32966 23582 -19562 72454 136986 133242
$$ packed form
15508d6815k1148Q1514L4711P309l1735P2446R1008r4146k4727R1994J7537k60106
15496h2158n8992L4861P1705k3458k6992l6984N5145N3939J28278P3490q8318
15485A00516K3721j39042l8541Q8653m9206n4852O4388j7397P0808K3928j37939
15474f4963o4117J4898r015o041J07041K1453l0029N1351L8172j72562L094J17691
15462F973n6931L8972j9308K4593J26851J28410n6712N595l4670j34948o3475
15451c4650j76692r514L3867J37595L8457L2519L9659K2156J13164J63504j38731
15440B21334k03633j39591M3687M9467K3316p814j01618q2N5139J50870L2012
15429A23087r6539m9990O5436J6014J625q4148q451N6548m3144R2016O4532l744
$$ plain form
15417 133242 4910 73848 32117 -39875 -116722 -110199 -43708 112069 160764 196113 93211
15406 93211 -64046 -145002 -123557 -135849 -177233 -235259 -96370 117919 145548 -48313 -171866
15395 -171866 -196941 -35522 -39947 -94117 -91016 -47958 -106301 -36033 30532 -62141 -86403 -32797
15383 -32797 -19002 51146 166629 209061 57962 147267 188625 100770 -71094 -133506 -218880
15372 -218880 -197361 -148680 -182223 -58549 57342 126571 -80765 -129278 -116749 -30981 -28160
15361 -28160 47215 54743 52663 173421 210828 110156 836 -65009 -107148 -133463 -106945
15350 -106945 -2582 -81831 -167349 -141936 -122732 -17214 -24089 23805 64197 149116 -4918
15339 -4918 -135005 -226608 -233972 -120942 51245 253283 174015 165312 195619 297170 216571
$$ packed form
15417A33242j28332O8938m1731p1992p6847O523O6491J55777M8695L5349j02902
15406I3211j57257q0956K1445j2292m1384n8026J38889K14289K7629j93861j23553
15395a71866k5075J61419m425n4170L101M3058n8343P0268O6565r2673k4262N3606
15383c2797J3795P0148J15483M2432j51099Q9305M1358q7855j71864o2412q5374
15372b18880K1519M8681l3543J23674J15891O9229k07336m8513J2529Q5768K821
15361b8160P5375P528k080J20758L7407j00672j09320o5845m2139k6315K6518
15350a06945J04363p9249q5518K5413J9204J05518o875M7894M0392Q4919j54034
15339d918j30087r1603p364J13030J72187K02038p9268q703L0307J01551q0599
$$ plain form
15328 216571 50094 45532 -102107 1658 96926 96268 27863 54199 15983 34055 123950
15317 123950 69428 112754 17692 -155802 -180918 -107796 -18704 -56399 -52476 3706 44894
15306 44894 202278 174865 118858 127784 47052 -95680 -268383 -170087 -113084 7449 -54785
15295 -54785 -129833 -181671 -251540 -150541 -204066 -123600 -40659 -39324 33421 23793 -6776 -21970
15283 -21970 -41965 -26586 -25045 13654 -7804 -119994 -58930 -113188 -237939 -243848 -219536 -72933
15271 -72933 76288 108133 199657 189816 101825 85260 53717 130116 68504 20545 -20816 -45962
15259 -45962 -20644 15552 -176407 -409168 -371049 -287512 -261952 -257984 -155916 -85893 -21885
15248 -21885 17020 -86094 -90197 20960 218206 313897 152389 79376 -6799 1496 -43755
$$ packed form
15328B16571j66477m562j47639J03765R5268o58o8405K6336l8216J8072Q9895
15317A23950n4522M3326r5062j73494k5116P3122Q9092l7695L923N6182M1188
15306D4894J57384k7413n6007Q926q0732j42732j72703R8296N7003J20533o2234
15295e4785p5048n1838o9869J00999n3525Q0466Q2941J335P2745r628l0569j5194
15283b1970j9995J5379J541L8699k1458j12190O1064n4258j24751n909K4312J46603
15271g2933J49221L1845R1524r841q7991j6565l1543P6399o1612m7959m1361k5146
15259d5962K5318L6196j91959k32761L8119Q3537K5560L968J02068P0023O4008
15248b1885L8905j03114m103J11157J97246R5691j61508p3013q6175Q295m5251
$$ plain form
15237 -43755 12623 -25335 -188123 -72024 131671 75115 -33257 112255 68395 19614 146938
15226 146938 63423 -72781 10326 -25432 -50480 -264988 -385081 -345034 -212639 -189982 -291446
15215 -291446 -303317 -206417 -195947 -221127 -248825 -78876 112082 235971 163110 141935 74142
15204 74142 1534 35477 75196 90971 185736 251198 164403 83612 66629 -10954 -26420 -23019
15192 -23019 -58970 -14510 10633 136505 197223 91688 20466 -18087 83396 133139 24095
15181 24095 46887 131130 169499 361247 192659 -171847 -206662 -132655 -78913 -134687 -312500
15170 -312500 -360541 -165283 48822 94846 57976 -19681 3800 141398 149697 88603 66421
15159 66421 -79734 -138869 -174647 -127629 -32072 62621 109080 35441 5183 -40037 17834
$$ packed form
15237d3755N6378l7958j62788J16099K03695n6556j08372J45512m3860m8781J27324
15226A46938q3515j36204Q3107l5758k5048k14508j20093M0047J32395K2657j01464
15215b91446j1871R6900J0470k5180k7698J69949J90958J23889p2861k1175o7793
15204G4142p2608L3943L9719J5775R4765O5462q6795q0791j6983p7583j5466L401
15192b3019l5951M4460K5143J25872O0718j05535p1222l8553J01483M9743j09044
15181B4095K2792Q4243L8369J91748j68588l64506l4815P4007N3742n5774j77813
15170c12500m8041J95258K14105M6024l6870p7657K3481J37598Q299o1094k2182
15159F6421j46155n9135l5778M7018R5557R4693M6459p3639l0258m5220N7871
$$ plain form
15148 17834 2439 41399 64162 120861 125287 54010 109609 211945 133221 16401 27472
15137 27472 133353 159396 116518 -30764 55604 70414 -10531 92597 268695 250394 187689
15126 187689 113320 58087 115548 169802 98956 32804 75693 -5585 7988 88232 59714
15115 59714 121283 83800 56952 60067 -94171 -240244 -150727 -96407 -81570 -57690 -15456
15104 -15456 -5636 -92332 -150187 -144762 11370 165277 150569 74055 42407 -67321 -14242
15093 -14242 94861 -19411 -134295 -96868 24052 20985 61865 13031 48222 174038 131508
15082 131508 -5243 -17956 -3952 111536 48663 -72014 131647 92372 -626 -82222 -23152
15071 -23152 -50155 -51226 65430 59685 -5731 75901 -66532 -79983 -97898 -9797 -58665 -132609
$$ packed form
15148A7834j5395L8960K2763N6699M426p1277N5599J02336p8724j16820J1071
15137B7472J05881K6043m2878j47282Q6368J4810q0945J03128J76098j8301o2705
15126A87689p4369n5233N7461N4254p0846o6152M2889q1278J3573Q0244k8518
15115E9714O1569l7483k6848L115j54238j46073Q9517N4320J4837K3880M2234
15104a5456R820q6696n7855N425J56132J53907j4708p6514l1648j09728N3079
15093a4242J09103j14272j14884L7427J20920l067M0880m8834L5191J25816m2530
15082A31508j36751j2713J4004J15488o2873j20677K03661l9275r2998q1596N9070
15071b3152k7003j071J16656n745o5416Q1632j42433j3451j7915Q8101m8868p3944
$$ plain form
15059 -132609 -78116 -149063 -174630 -144949 -236366 -204439 -77578 -5814 89092 127468 118038
15048 118038 26668 -19624 45222 7482 -3532 48583 71022 30493 -102784 -122896 -51194
15037 -51194 -86157 -28728 47555 107932 168070 112398 -15628 -77329 -233309 -340319 -260819
15026 -260819 -204767 -230757 -281760 -353114 -218174 -40047 64147 98107 101343 88915 -11268
15015 -11268 39033 29623 39248 44330 23301 63665 53064 63489 186872 118465 -2954 -27655
15003 -27655 56095 47678 -50796 -53376 68420 107377 231399 320898 237351 187369 296390
14992 296390 227397 51950 -178351 -252126 -215556 -266696 -205516 -193104 -129580 57026 84541
14981 84541 158565 216953 139225 -38094 48161 13656 23884 -53542 -88039 66357 29224
$$ packed form
15059a32609N4493p0947k5567K9681r1417L1927J26861P1764R4906L8376r430
15048A18038r1370m6292O4846l7740j1014N2115K2439m0529j33277k0112P1702
15037e1194l4963N7429P6283O0377O0138n5672j28026o1701j55980j07010P9500
15026b60819N6052k5990n1003p1354J34940J78127J04194L3960L236j2428j00183
15015a1268N0301r410R625N082k1029M0364j0601J0425J23383o8407j21419k4701
15003b7655Q3750q417r8474k580J21796L8957J24022Q9499q3547m9982J09021
14992B96390o8993j75447k30301p3775L6570n1140O1180J2412O3524J86606K7515
14981H4541P4024N8388p7728j77319Q6255l4505J0228p7426l4497J54396l7133
$$ plain form
14970 29224 -147793 -319940 -203386 -125207 -43591 30925 73619 -40462 -78253 -164308 -298358
14959 -298358 -397775 -360217 -246404 -161098 -44214 -28859 56230 15905 -49501 -470 -93594
14948 -93594 -74707 65233 83543 42222 124167 146596 127417 139320 86193 -57331 -16211
14937 -16211 71523 117506 111356 56334 96813 -25362 -100657 18834 54370 168423 162130
14926 162130 103386 102448 122142 48365 -51016 102902 101296 34944 -44819 -38785 12450 -45613
14914 -45613 -21799 11323 -51563 -74683 -47566 -20999 12658 -15241 -103897 -170076 -110294 7625
14902 7625 -22041 -103192 -110142 -57953 12511 105156 94837 -87990 -95932 76886 20192 -57876
14890 -57876 -3537 53988 113611 199540 111686 156881 111713 -119473 -110433 -120828 -185925 -212501
$$ packed form
14970B9224j77017j72147J16554P8179Q1616P4516M2694j14081l7791q6055j34050
14959b98358r9417L7558J13813Q5306J16884J5355Q5089m0325o5406M9031r3124
14948i3594J8887J39940J8310m1321Q1945K2429j9179J1903n3127j43524M1120
14937a6211Q7734M5983o150n5022M0479j22175p5295J19491L5536J14053o293
14926A62130n8744r38J9694p3777r9381J53918j606o6352p9763O034N1235n8063
14914d5613K3814L3122o2886k3120K7117K6567L3657k7899q8656o6179N9782J17919
14902G625k9666q1151o950N2189P0464R2645j0319j82827p942J72818n6694p8068
14890e7876N4339N7525N9623Q5929q7854M5195m5168k31186R040j0395o5097k6576
$$ plain form
14878 -212501 -187195 -40461 48417 10485 124214 200967 86509 68276 -33688 89721
14868 89721 136042 6224 -34956 -53507 -180395 -270477 -150403 -22964 45859 31976 59243
14857 59243 90211 -3118 -140064 -141921 -30480 -123474 -270679 -157964 -139349 -104713 50013
14846 50013 75844 179755 91521 159253 157560 64245 -61658 -199434 -172463 -116139 -124426
14835 -124426 -123844 -138502 -188235 -90757 73925 87259 105616 169647 87874 132286 119955 80632
14823 80632 52593 90332 163032 251091 149699 62911 62709 43201 -15003 50639 187320 167955
14811 167955 179714 239902 143455 192515 224059 91638 4673 -120191 -152257 -278376 -155422
14800 -155422 89211 119759 220250 178454 61050 15907 -33359 -21954 -99744 -220482 -150847
$$ packed form
14878b12501K5306J46734Q8878l7932J13729P6753j14458j8233j01964J23409
14868H9721M6321j29818m1180j8551j26888r0082J20074J27439O8823j3883K7267
14857E9243L0968r3329j36946j857J11441r2994j47205J12715J8615L4636J54726
14846E0013K5831J03911q8234O7732j693r3315j25903j37776K6971N6324q287
14835a24426N82j4658m9733R7478J64682J3334J8357O4031q1773M4412j2331l9323
14823H0632k8039L7739P2700Q8059j01392q6788k02j9508n8204O5642J36681j9365
14811A67955J1759O0188r6447M9060L1544j32421q6965j24864l2066j26119J22954
14800a55422K44633L0548J00491m1796j17404m5143m9266J1405p7790j20738O9635
$$ plain form
14789 -150847 -91802 -20782 17534 9571 -25277 31175 37430 112969 136290 119601 152644 156393
14777 156393 166385 108454 118416 44444 -43217 -97009 10625 64780 49237 -52543 -209846
14766 -209846 -251818 -97950 -4674 145411 246078 125504 34364 16861 -41260 7453 141846
14755 141846 160438 151011 127459 26317 -32723 25350 114054 30502 30876 106275 92590 47915
14743 47915 140880 231006 230472 121266 95503 299552 319171 207521 236722 292701 236034
14732 236034 211012 136022 92618 166099 175660 -26199 -81621 -75255 -67721 -50476 -22262 -8033
14720 -8033 3622 -75256 -187543 -123228 42904 44598 28312 -4909 -23194 -13129 -22543 125338
14708 125338 19175 -83640 -211294 -199158 -35644 -12906 -120134 -238172 -165864 -30969
$$ packed form
14789a50847N9045P1020L8316p963l4848N6452O255P5539K3321j6689L3043L749
14777A56393R992n7931R962p3972q7661n3792J07634N4155j5543j01780j57303
14766b09846m1972J53868R3276J50085J00667j20574r1140j7503n8121M8713J34393
14755A41846J8592r427k3552j01142n9040N8073Q8704q3552L74P5399j3685m4675
14743D7915R2965R0126n34j09206k5763K04049J9619j11650K9201N5979n6667
14732B36034k5022p4990m3404P3481R561k01859n5422O366P534J7245K8214J4229
14720h033J1655p8878j12287O4315J66132J694j6286l3221j8285J0065r414J47881
14708A25338j06163j02815j27654J2136J63514K2738j07228j18038P2308J34895
$$ plain form
14698 -30969 -5259 -79708 -61253 58593 87931 -20753 -35558 134427 144029 302978 335220
14687 335220 214416 118969 99022 8930 22760 5230 11370 56192 125194 -67127 -105132
14676 -105132 -51285 175330 146403 10157 7501 89213 83512 -30766 -176481 -138906 107496
14665 107496 269532 155785 194010 58812 -115518 -95367 99503 215250 87994 -41705
14655 -41705 -70036 -60049 -34807 -18354 22733 108704 60247 40795 58571 86895 107901 43363
14643 43363 -14056 98064 201980 178360 228770 170318 57688 118456 143090 185739 -3999
14632 -3999 -146450 -264001 -211460 -41645 125385 49018 -32564 -57043 -126615 -96320 -50633
14621 -50633 126626 184499 114634 130485 108129 -1603 34777 223123 279995 227003 198692
$$ packed form
14698c0969K5710p4449J8455J19846K9338j08684j4805J69985R602J58949L2242
14687C35220j20804r5447j9947r0092J3830j7530O140M4822O9002j92321l8005
14676a05132N3847K26615k8927j36246k656Q1712n701j14278j45715L7575K46402
14665A07496J62036j13747L8225j35198j74330K0151J94870J15747j27256j29699
14655d1705k8331R987K5242J6453M1087Q5971m8457j9452J7776K8324K1006o4538
14643D3363n7419J12120J03916k3620N0410n8452j12630O0768K4634M2649j89738
14632c999j42451j17551N2541J69815J67030p6367q1582k4479o9572L0295M5687
14621e0633J77259N7873o9865J5851k2356j09732L6380J88346N6872n2992k8311
$$ plain form
14610 198692 140892 144849 104180 -41536 -38257 -134248 -142365 -40646 5080 113563 113443 -109509
14598 -109509 -214501 -176462 -210802 -269850 -212387 -142362 89858 158950 60066 1254 70679
14587 70679 -26971 -129453 -49936 99151 -73181 -209301 -184648 -142759 -88214 29426 73721
14576 73721 -105780 -170912 -125852 -74487 -66524 -71425 -139547 -77040 -26153 -37769 85800 55725
14564 55725 43148 57941 118053 59805 -77451 -213488 -254523 -225459 -52710 -12005 -107573
14553 -107573 -155659 -246187 -214616 -155754 -86340 -60406 -12075 33917 115631 105057 66951
14542 66951 20620 53663 99782 29969 35673 23034 -2003 74934 148930 76572 -99273 -142688
14530 -142688 -160018 -211687 -159277 -78690 -40920 -123498 5000 142844 83202 -14149 -57807
$$ packed form
14610A98692n7800L957m0669j45716L279r5991q117J01719M5726J08483j20k22952
14598a09509j04992L8039l4340n9048N7463P0025K32220O9092r8884n8812O9425
14587G0679r7650j02482P9517J49087j72332j36120K4653M1889N4545J17640M4295
14576G3721j79501o5132M5060N1365P963m901o8122O2507N0887j1616J23569l0075
14564E5725j2577J4793O0112n8248j37256j36037m1035K9064J72749M0705r5568
14553a07573m8086r0528L1571N8862O9414K5934M8331M5992Q1714j0574l8106
14542F6951m6331L3043M6119o9813N704j2639k5037P6937P3996p2358j75845m3415
14530a42688j7330n1669N2410Q0587L7770q2578J28498J37844n9642r7351m3658
$$ plain form
14519 -57807 6604 26846 -48495 26806 81627 33018 56865 81921 73054 36666 -64373 -103608
14507 -103608 -116555 -190953 -72760 54901 6504 -49654 -17605 6694 -47841 -55392 -9651
14496 -9651 100685 83915 -57636 -25529 -13019 -170762 -216254 -139817 -28763 -41928 -142160
14485 -142160 -150174 -81076 -119995 -194410 -186920 -98411 -45175 -203600 -211311 -72875 -14578 -54983
14473 -54983 -47312 7665 -48231 -18823 -25529 -45683 -146520 -99297 -165538 -214928 -203991 -138004
14461 -138004 -128637 -37359 -87959 -136039 -131689 -66627 -136758 -216490 -115404 -185921 -234887 -150671
14449 -150671 -80139 -103458 -109179 -153578 -89281 -65157 -58900 -92164 -22183 123832 199853 111203
14437 111203 101361 46197 11785 109659 57412 96060 150313 213998 194678 143851 116849 87544
$$ packed form
14519e7807O4411K0242p5341P5301N4821m8609K3847K5056q867l6388j01039l9235
14507a03608j2947p4398J18193J27661m8397n6158L2049K4299n4535p551M5741
14496i651J10336j6770j41551L2107J2510j57743m5492P6437J11054j3165j00232
14485a42160q014O9098l8919p4415P490Q8509N3236j58425p711J38436N8297m0405
14473e4983P671N4977n5896K9408o706k0154j00837M7223o6241m9390J0937O5987
14461a38004R367R1278n0600m8080M350O5062p0131p9732J01086p0517m8966Q4216
14449a50671P0532k3319n721m4399O4297K4124O257l3264O9981J46015P6021q8650
14437A11203r842n5164l4412R7874n2247L8648N4253O3685j9320n0827k7002k9305
$$ plain form
14425 87544 72698 -31690 40283 43213 55322 57107 101657 230429 218179 216790 154368 160172
14413 160172 149647 97842 70132 93186 68938 148642 93637 55498 -52550 -53191 16869 186595
14401 186595 202428 110443 89491 180471 28111 -58988 -40704 21362 26254 32448 -81039
14390 -81039 -149661 -108713 -167516 -242133 -133583 -127124 -248525 -309911 -262996 -269190 -129404
14379 -129404 -30003 -12941 -36316 -67838 87909 82709 35428 -62144 -158415 -267096 -312692
14368 -312692 -343466 -141116 -93142 -131689 -64250 28496 43882 40628 147142 98296 13038
14357 13038 10319 37935 -106983 -239640 -173241 -111853 75503 115914 51071 57355 43801
14346 43801 116556 129244 -87466 -175790 -165425 -136798 -133966 71854 91551 22849 35035
$$ packed form
14425H7544j4846j04388P1973K930J2109J785M4550J28772j2250j389o2422N804
14413A60172j0525n1805k7710K3054k4248P9704n5005l8139j08048o41P0060J69726
14401A86595J5833r1985k0952R0980j52360q7099J8284O2066M892O194j13487
14390h1039o8622M0948n8803p4617J08550O459j21401o1386M6915o194J39786
14379a29404R9401J7062k3375l1522J55747n200m7281r7572r6271j08681m5596
14368c12692l0774K02350M7974l8547O7439R2746J5386l254J06514m8846q5258
14357A3038k719K7616j44918j32657O6399O1388J87356M0411o4843O284j3554
14346D3801P2755J2688k16710q8324J0365K8627K832K05820J9697o8702J2186
$$ plain form
14335 35035 -23114 -92139 -26490 47983 48589 10067 -101128 -118468 -149734 -91571 -86356 46353
14323 46353 9940 -95691 -19955 101615 26992 -96564 -37188 107805 132351 35192 45554
14312 45554 76978 48483 39454 -52089 -119385 -133727 -82411 15182 -61071 -69686 -114969 -25982
14300 -25982 -64521 -126966 -246574 -165169 -19068 -73119 -169966 -179833 -172616 -107448 -108376 -28575
14288 -28575 -105546 -108494 -108149 -277936 -237572 -110707 -34087 7246 26442 -53972 -108470 -11093
14276 -11093 114891 371636 339789 254534 67591 -88873 86536 168884 26822 -41590
14266 -41590 -55965 7972 -113534 -297927 -269839 -154428 -115980 36259 8477 -34525 -81412
14255 -81412 -77738 -132381 -149704 -19124 -34813 -101480 -225867 -233242 -119655 14577 60458
$$ packed form
14335C5035n8149o9025O5649P4473O06l8522j11195j7340l1266N8163N215J32709
14323D6353l6413j05631P5736J21570p4623j23556N9376J44993K4546r7159J0362
14312D5554L1424k8495r029r1543o7296j4342N1316R7593p6253q615m5283Q8987
14300b5982l8539o2445j19608Q1405J46101n4051r6847r867P217O5168r28P9801
14288b8575p6971k948L45j69787M0364J26865P6620M1333J9196q0414n4498R7377
14276a1093J25984K56745l1847q5255j86943j56464J75409Q2348j42062o8412
14266d1590j4375O3937j21506j84393K8088J15411L8448J52239k7782m3002m6887
14255h1412L674n4643j7323J30580j5689o6667j24387p375J13587J34232M5881
$$ plain form
14244 60458 -47222 -7902 2625 -8732 129039 193289 217330 150473 157003 36237 -37089
14233 -37089 -83317 -154352 4820 24301 -124899 -195317 -177642 -295186 -237279 -122720 -68424
14222 -68424 -47700 -115198 -95582 -73099 54847 57038 43270 -26150 -45942 14609 120240
14211 120240 129400 61952 9169 -7162 -95537 1422 1037 -51006 -108511 -73247 -70541 -82926
14199 -82926 650 19203 45364 34135 -40 -86923 -50928 -81048 54944 174898 250705
14188 250705 233570 200765 259228 216259 66850 8353 -65650 -159357 -167483 -173738 -145757 -177028
14176 -177028 -244243 -342742 -451347 -343158 -50232 75694 -48579 -207637 -61148 7488
14166 7488 -84088 -71432 50297 156580 170651 8270 -53958 23660 132675 121021 -66573
$$ packed form
14244F0458j07680L9320J0527j1357J37771O4250K4041o6857O530j20766p3326
14233c7089m6228p1035J59172J9481j49200p0418J7675j17544N7907J14559N4296
14222f8424K0724o7498J9616K2483J27946K191j3768o9420j9792O0551J05631
14211A20240R160o7448n2783j6331q8375R6959l85n2043n7505L5264K706j2385
14199h2926Q3576J8553K6161j1229l4175q6883L5995l0120J35992J19954P5807
14188B50705j7135l2805N8463m2969j49409n8497p4003r3707q126o255K7981l1271
14176a77028o7215r8499j08605J08189K92926J25926j24273j59058J46489O8636
14166G488r1576J2656J21729J06283J4071j62381o2228P7618J09015j1654j87594
$$ plain form
14155 -66573 -102989 -184978 -116578 28755 10084 -14093 -152433 -299191 -185165 -142872 20894
14144 20894 131930 125723 77679 22021 126154 38860 -53082 -75139 63261 106259 114467
14133 114467 170720 273672 244146 164040 133362 126150 74930 145038 103291 19367 71513
14122 71513 138563 118521 131003 43516 3437 130409 153273 122429 62336 226787 274494
14111 274494 202748 226321 154799 -21263 33866 99233 12686 43527 -130702 -319882 -201501
14100 -201501 4842 72219 106247 135333 84689 -17145 -82519 -122386 -88837 -51 -8481
14089 -8481 -50662 -80286 29199 -3489 34116 46303 114760 202052 148860 203775 175164 120217
14077 120217 18334 4155 -73195 -24430 3191 -77093 -40138 181526 220525 184166 153005
$$ packed form
14155f6573l6416q1989O8400J45333j8671k4177j38340j46758J14026M2293J63766
14144B0894J11036o207m8044n5658J04133q7294r1942k2057J38400M2998Q208
14133A14467N6253J02952k9526q0106l0678p212n1220P0108m1747q3924N2146
14122G1513O7050k0042J2482q7487m0079J26972K2864l0844o0093J64451M7707
14111B74494p1746K3573p1522j76062N5129O5367q6547L0841j74229j89180J18381
14100b01501K06343O7377L4028K9086n0644j01834o5374l9867L3549Q8786q430
14089h481m2181k9624J09485l2688L7605J2187O8457Q7292n3192N4915k8611n4947
14077A20217j01883j4179p7350M8765K7621q0284L6955K21664L8999l6359l1161
$$ plain form
14066 153005 163295 127142 8761 -53262 4622 154477 286604 246324 108836 54914 -24228
14055 -24228 -126736 -193185 -107035 -8667 -38157 1383 -35554 -10055 -90178 -60542 16767
14044 16767 -26423 -122455 -148968 -99520 -41203 19905 80978 25809 30790 98116 61327 88629
14032 88629 9607 -111488 81460 288944 210633 181930 170470 28670 -36647 22462 -3645
14021 -3645 -76386 -156377 -84427 -45560 -105913 8834 22826 -82427 -1906 -142918 -225861
14010 -225861 -157081 -87107 -133496 -186706 -169591 -142053 48335 116571 160137 363740 318354
13999 318354 242745 159423 114711 106248 72505 72897 220042 214497 163606 84433 104771 121529
13987 121529 74196 60882 84808 87146 -106085 -104255 -65293 -20030 -47418 -23153 43053 130165
$$ packed form
14066A53005J0290l6153j18381o2023N7884J49855J32127m0280j37488n3922p9142
14055b4228j02508o6449Q6150R8368k9490L9540l6937K5499q0123K9636P7309
14044A6767m3190r6032k6513M9448N8317O1108O1073n5169M981O7326l6789K7302
14032H8629p9022j21095J92948K07484p8311k8703j1460j41800o5317N9109k6107
14021c645p2741p9991P1950L8867o0353J14747J3992j05253Q0521j41012q2943
14010b25861O8780O9974m6389n3210J7115K7538J90388O8236M3566K03603m5386
13999C18354p5609q3322m4712q463l3743L92J47145n545n0891p9173K0338J6758
13987A21529m7333j3314K3926K338j93231J830L8962M5263k7388K4265O6206Q7112
$$ plain form
13975 130165 57808 -113816 -64558 56520 -199052 -247698 -113391 -228253 -221524 -59614
13965 -59614 -81986 -129275 -126080 -110250 -15442 135906 -107745 -207204 -33595 57281 61746
13954 61746 41490 193083 369771 317433 98365 31462 97684 84936 -24060 27311 134220
13943 134220 65362 104536 110264 -36950 -61833 -46727 -82210 -17177 93430 53003 -5005
13932 -5005 31751 45038 94922 30304 -25629 -30146 -44879 73090 21835 31532 -43279 -129508
13920 -129508 -99084 -25385 43023 174675 166163 111154 189891 283233 219642 167676 85393
13909 85393 8560 20985 -112436 -253419 -294727 -211697 -133539 -62014 -135101 -217014 -220514
13898 -220514 -189645 -161502 -147605 -215689 -192691 -67621 -50189 -61050 18293 -47530 -92142
$$ packed form
13975A30165p2357j71624M9258J21078k55572m8646J34307j14862O729J61910
13965e9614k2372m7289L195J5830R4808J51348k43651r9459J73609R0876M465
13954F1746k0256J51593J76688n2338k19068o6903O6222j2748j08996N1371J06909
13943A34220o8858L9174N728j47214k4883J5106l5483O5033J10607m0427n8008
13932e005L6756J3287M9884o4618n5933m517j4733J17969n1255R697p4811q6229
13920a29508L0424P3699O8408J31652q512n5009P8737R3342o3591n1966q2283
13909H5393p6833J2425j33421j40983m1308Q3030P8158P1525p3087q1913l500
13898b20514L0869K8143J3897o8084K2998J25070J7432j0861P9343o5823m4612
$$ plain form
13887 -92142 42818 78380 -16902 37059 85462 125295 207921 186750 178735 140165 120788 110943
13875 110943 274311 158111 165618 83345 -54506 21895 -7705 30578 151326 207072 134881
13864 134881 151058 231994 127168 51408 200585 349339 369006 293133 190348 221202 209921
13853 209921 141387 215353 320387 294984 262029 240198 235015 305887 319972 252427 266859
13842 266859 369673 314403 64071 -166147 -123782 -100323 -134002 -18215 158030 234431
13832 234431 154671 98193 228732 410576 437489 525657 504551 522397 514330 356195 274479
13821 274479 375510 411594 258792 226592 184405 18504 -89455 -44328 19940 -4303 12099
13810 12099 -37014 -15723 15579 -89653 -71475 -4391 42133 -27507 -100206 -67308 18681
$$ packed form
13887i2142J34960L5562r5282N3961M8403L9833Q2626k1171q015l8570j9377r845
13875A10943J63368j16200P507q2273j37851P6401k9600L8283J20748N5746p2191
13864A34881J6177Q0936j04826p5760J49177J48754J9667p5873j02785L0854j1281
13853B09921o8534P3966J05034k5403l2955k1831n183P0872J4085o7545J4432
13842B66859J02814n5270k50332k30218M2365K3459l3679J15787J76245P6401
13832B34431p9760n6478J30539J81844K6913Q8168k1106J7846q067j58135q1716
13821B74479J01031L6084j52802l2200m2187j65901j07959M5127O4268k4243J6402
13810A2099m9113K1291L1302j05232J8178O7084M6524o9640p2699L2898Q5989
$$ plain form
13799 18681 -54487 -183427 -243173 -210389 -58792 -69141 -206860 -187438 -166155 28036 148162
13788 148162 113086 -7429 -131574 -247680 -159521 -91065 -99556 -122770 -61391 -25629 -9654
13777 -9654 67415 26627 -65175 -98117 -135314 -167820 -109475 21594 29684 28797 -33350 -46755
13765 -46755 -26777 43366 200869 219466 86241 74100 74449 11405 10976 19380 -33831 -22524
13753 -22524 -86897 -128424 -54264 61268 162825 187902 139840 21681 -126049 -36944 -62782
13742 -62782 -205497 -189872 -24117 138735 -8107 72248 179084 34442 43626 76707 66187
13731 66187 96605 227564 288392 399360 282927 17592 154380 257530 112981 2193
13721 2193 -84662 -28471 119464 198876 96874 -18943 -40164 25165 -17844 -128073 -179867
$$ packed form
13799A8681p3168j28940n9746L2784J51597j0349j37719J9422K1283J94191J20126
13788A48162l5076j20515j24145j16106Q8159O8456q491k3214O1379L5762J5975
13777i654P7069m0788r1802l2942l7197l2506N8345J31069Q090q87o2147j3405
13765d6755J9978P0143J57503J8597j33225j2141L49o3044m29Q404n3211J1307
13753b2524o4373m1527P4160J15532J01557K5077m8062j18159j47730Q9105k5838
13742f2782j42715J5625J65755J62852j46842Q0355J06836j44642R184L3081j0520
13731F6187L0418J30959O0828J10968j16433k65335J36788J03150j44549j10788
13721B193q6855N6191J47935P9412j02002j15817k1221O5329m3009j10229n1794
$$ plain form
13710 -179867 -247791 -277126 -226260 -102030 10719 -35932 -193781 -150602 104282 182602 86805
13699 86805 -19764 31086 62772 80607 148931 232521 190866 134646 119631 168679 145735
13688 145735 33040 87533 93618 -13304 -19422 169141 171515 82855 68468 246279 336167
13677 336167 343060 317185 298700 338260 354830 433656 675969 800419 1054651 1357239 1726964
13666 1726964 1996178 1984694 1719594 1418076 1040012 717725 499198 389479 277794 271506
13656 271506 287263 210087 211408 271576 269187 336601 363486 271446 234551 270013 321189 264959
13644 264959 303463 404451 332816 372581 426637 399174 392857 245016 187251 289162 336647
13633 336647 298870 233449 202993 95445 115314 137514 58098 90036 184144 244775 360767
$$ packed form
13710a79867o7924k9335N0866J24230J12749m6651j57849M3179K54884P8320r5797
13699H6805j06569N0850L1686J7835O8324Q3590m1655n6220j5015M9048k2944
13688A45735j12695N4493O085j06922o118J88563K374q8660j4387J77811Q9888
13677C36167O893k5875j8485L9560J6570P8826K42313J24450K54232L02588L69725
13666A726964K69214j1484k65100l01518l78064l22287k18527j09719j11685o288
13656B71506J5757p7176J321O0168k389O7414K6885r2040l6895L5462N1176n6230
13644B64959L8504J00988p1635L9765N4056k7463o317j47841n7765J01911M7485
13633C36647l7777o5421l0456j07548J9869K2200p9416L1938R4108O0631J15992
$$ plain form
13622 360767 401023 405860 545198 482327 396483 287284 304255 303001 432147 499241 406939
13611 406939 438767 479268 354177 371066 365699 201308 107521 156989 88833 37137 25662
13600 25662 126486 91751 71417 41659 125823 90883 168123 192249 118795 78766 56916
13589 56916 205839 318906 525165 645800 526839 287782 182772 189725 622 -116863
13579 -116863 -200304 -211037 -219393 -99885 55891 74432 -62850 -128122 -96559 -6251 92539
13568 92539 108055 247649 280343 202717 304865 215207 28551 115780 43888 55542 -20821
13557 -20821 -82993 -79196 86834 81410 -15156 38311 59479 72068 147233 208559 265577 187263
13545 187263 86507 60152 189470 229726 109511 -58588 -20109 -22848 82727 240076
$$ packed form
13622C60767M0256M837J39338o2871q5844j09199J6971j254J29146O7094r2302
13611D06939L1828M0501j25091J6889n367j64391r3787M9468o8156n1696j1475
13600B5662J00824l4735k0334k9758Q4164l4940P7240K4126p3454m0029k1850
13589E6916J48923J13067K06259J20635j18961k39057j05010O953j89103j17485
13579a16863q3441j0733q356J19508J55776J8541j37282o5272L1563R0308R8790
13568I2539J5516J39594L2694p7626J02148q9658j86656Q7229p1892J1654p6363
13557b0821o2172L797J66030n424r6566N3467K1168J2589P5165O1326N7018p8314
13545A87263j00756k6355J29318M0256j20215j68099L8479k739J05575J57349
$$ plain form
13535 240076 314962 231984 140176 72369 51914 36073 70411 66944 18522 76167 151257 158870
13523 158870 243877 250078 192841 220914 228435 73892 35724 10799 17279 -167699 -181851 -158311
13511 -158311 -94993 133056 54892 -84211 -76217 -17322 -149756 -134669 -18848 107134 120042
13500 120042 158247 262241 249760 100448 -93955 -219482 -160834 -123835 -84884 3775 -34174
13489 -34174 41399 160328 156449 168680 158119 232099 256091 252661 247930 311680 369250 256951
13477 256951 161587 220710 352314 405114 488765 568220 575951 593006 539564 488863 325339
13466 325339 117920 152850 194587 216522 244465 309313 277792 202099 232585 208617 203549
13455 203549 114729 -9618 24737 147852 324719 422367 424888 367705 382743 469197 490980
$$ packed form
13535B40076P4886q2978r1808o7807k0455j5841L4338l467m8422N7645P5090P613
13523A58870Q5007O201n7237K8073P521j54543l8168k4925O480j84978j4152K3540
13511a58311O3318K28049p8164j39103P994N8895j32434J5087J15821J25982J2908
13500A20042L8205J03994j2481j49312j94403j25527N8648L6999L8951Q8659l7949
13489c4174P5573J18929l879J2231j0561P3980K3992l430m731O3750N7570j12299
13477B56951r5364N9123J31604N2800Q3651P9455P731J7055n3442n0701j63524
13466C25339k07419L4930M1737K1935K7943O4848l1521p5693L0486k3968n068
13455B03549q8820j24347L4355J23115J76867R7648K521n7183J5038Q6454K1783
$$ plain form
13444 490980 527786 498392 479597 580919 475453 341204 447921 504728 505048 557815 565653
13433 565653 566840 424450 304359 336497 376602 325392 226745 64097 35891 36166 173946
13422 173946 248331 151412 134941 102213 173450 216687 198032 176398 241937 175066 187145
13411 187145 473889 742936 799705 593090 616290 643655 470883 348705 376310 431568
13401 431568 328578 199077 122055 29270 120583 232406 229640 166545 156542 196415 202257
13390 202257 198655 201595 212108 290909 303144 225523 71028 144953 217398 240098 208133 177765
13378 177765 161450 61731 10782 135131 215767 165809 75968 159490 272754 263711 173043
13367 173043 134741 90026 143526 86159 -4980 -62346 -70093 -24924 50454 136752 108682 101834
$$ packed form
13444D90980L6806k9394j8795J01322j05466j34249J06717N6807L20N2767P838
13433E65653J187j42390j20091L2138M0105n1210r8647j62648k8206K75J37780
13422A73946P4385r6919j6471l2728P1237M3237j8655k1634O5539o6871J2079
13411A87145K86744K69047N6769k06615K3200K7365j72772j22178K7605N5258
13401D31568j02990j29501p7022r2785R1313J11823k766o3095j0003L9873N842
13390B02257l602K940J0513P8801J2235p7621j54495P3925P2445K2700l1965l0368
13378A77765j6315r9719n0949J24349Q0636m9958q9841Q3522J13264r043r0668
13367A73043l8302m4715N3500n7367r1139n7366p747M5169P5378Q6298k8070o848
$$ plain form
13355 101834 105160 161597 171308 43876 24655 -85143 -211326 -166000 -10420 4776 -59374
13344 -59374 -109033 110431 150250 69050 -8140 -102155 -298796 -79355 97870 78165 15987
13333 15987 85576 71090 54992 205824 87334 -149430 -127502 -57482 -60787 -69616 -29044
13322 -29044 54230 85596 147439 96416 43159 119780 153476 93105 72309 -3082 37156 138240
13310 138240 75913 -65698 73009 259185 303221 205069 139301 127882 132639 131969 112841
13299 112841 60636 99875 201158 87231 11613 -23897 -44896 54364 191720 76710 -10428
13288 -10428 91704 236593 239959 204772 305470 412256 356615 370964 276809 267360 368371
13277 368371 496262 382489 131839 47144 49031 53106 -7019 -26461 24136 29438 -17680
$$ packed form
13355A01834L326N6437R711j27432j9221j09798j26183M5326J55580J5196o4150
13344e9374m9659K19464L9819q1200p7190r4015j96641K19441J77225j9705o2178
13333A5987O9589j4486j6098J50832j18490k36764K1928P0020l305q829M0572
13322b9044Q3274L1366O1843n1023n3257P6621L3696o0371k0796p5391M0238J01084
13310A38240o2327j41611J38707J86176M4036r8152o5768j1419M757o70j9128
13299A12841n2205L9239J01283j13927p5618l5510k0999R9260J37356j15010q7138
13288a0428J02132J44889L366l5187J00698J06786n5641J4349r4155r449J01011
13277C68371J27891j13773k50650q4695J887M075o0125j9442N0597N302m7118
$$ plain form
13266 -17680 20687 162571 218340 231294 235266 156573 125629 95986 131551 353615 591758
13255 591758 720257 756648 698691 679689 622878 704325 738460 584256 448049 413831 403618
13244 403618 416376 499443 550406 497547 374038 217370 138970 231076 170542 134381 134328 217195
13232 217195 200169 180659 267975 233901 120411 104322 222554 365204 512163 752666
13222 752666 831463 907814 842733 785111 584825 297323 157122 230858 340389 335261 411928
13211 411928 373743 331465 299070 121694 178863 220485 254796 258698 268956 213910 89290
13200 89290 109818 203570 264379 88929 140978 254873 173521 95364 72377 208726 188269
13189 188269 72806 12026 -95464 -52481 43666 276005 306847 264022 152727 151058 48794
$$ packed form
13266a7680L8367J41884N5769J2954L972p8693l0944k9643L5565K22064K38143
13255E91758J28499L6391n7957j9002n6811Q1447L4135j54204j36207l4218j0213
13244D03618J2758Q3067N0963n2859j23509j56668p8400R2106o0534l6161n3Q2867
13232B17195j7026j9510Q7316l4074j13490j6089J18232J42650J46959K40503
13222G52666P8797P6351o5081n7622k00286k87502j40201P3736J09531n128P6667
13211D11928l8185m2278l2395j77376N7169M1622L4311L902J0258n5046j24620
13200H9290K0528R3752O0809j75450N2049J13895q1352p8157k2987J36349k0457
13189A88269j15463o0780j07490M2983R6147K32339L0842m2825j11295j669j02264
$$ plain form
13178 48794 -71195 822 82409 44916 -20204 151489 159344 -33579 -50871 -46981 -74739
13167 -74739 -150969 1125 74473 157656 214399 257179 198245 119805 109879 103716 244846 234849
13155 234849 164540 202488 259759 274505 256960 245767 307005 483925 801491 1133550 1289773
13144 1289773 1619082 1808792 1921734 1872407 1601787 1259598 939326 758983 692451 620355
13134 620355 465840 323988 370632 546844 831601 999414 1053365 1246898 1414562 1478486
13124 1478486 1432366 1412661 1392506 1467307 1394649 1324366 1524127 1769710 2012509 1974140 2097125
13113 2097125 2402584 2546706 2380966 2268211 1934455 1545079 1430558 1504783 1570407 1593546
13103 1593546 1686505 1638685 1483180 1415490 1317216 1219777 1149609 1208743 1274516 1140502 1033970
$$ packed form
13178D8794j19989P2017Q1587l7493o5120J71693P855j92923j7292L890k7758
13167g4739p6230J52094P3348Q3183N6743M2780n8934p8440r926o163J41130r997
13155B34849p0309L7948N7271J4746j7545j1193O1238J76920L17566L32059J56223
13144A289773L29309J89710J12942m9327k70620l42189l20272j80343o6532p2096
13134F20355j54515j41852M6644J76212K84757J67813N3951J93533J67664O3924
13124A478486m6120j9705k0155P4801p2658p0283J99761K45583K42799l8369J22985
13113B097125L05459J44122j65740j12755l33756l89376j14521P4225O5624K3139
13103A593546R2959m7820j55505o7690r8274r7439p0168N9134O5773j34014j06532
$$ plain form
13092 1033970 1072932 1150261 1209744 1180002 1135262 1139737 1189672 1398769 1635759 1762539 2028291
13081 2028291 2314643 2479867 2326327 2195771 1869006 1431711 1042155 786845 668994
13072 668994 568796 584966 563562 477458 459241 443029 457038 468039 573241 650256 614177
13061 614177 580036 366069 298645 261889 235050 148096 89803 291111 411691 269689 157650
13050 157650 83847 170778 356226 436631 384920 392994 333402 248186 149327 125253 312948
13039 312948 183861 60519 147173 191017 89044 105019 208221 142267 -7987 -19760
13029 -19760 -8145 6687 175157 172616 148324 114448 124939 9600 11271 119914 158922
13018 158922 146667 101241 61032 51761 70954 45023 187884 203443 70362 121492 181918
$$ packed form
13092A033970L8962P7329N9483k9742m4740M475M9935K09097K36990J26780K65752
13081B028291K86352J65224j53540j30556l26765m37295l89556k55310j17851
13072F68994j00198J6170k1404q6104j8217j6212J4009J1001J05202P7015l6079
13061F14177l4141k13967o7424l6756k6839q6954n8293K01308J20580j42002j12039
13050A57650p3803Q6931J85448Q0405n1711Q074n9592q5216r8859k4074J87695
13039C12948j29087j23342Q6654M3844j01973J5975J03202o5954j50254j1773
13029a9760J1615J4832J68470k541k4292l3876J0491j15339J671J08643L9008
13018A58922j2255m5426m0209r271J9193k5931J42861J5559j33081N1130O0426
$$ plain form
13007 181918 224794 314540 265112 199861 127340 -8690 -102735 -7226 118871 136180 99974
12996 99974 34706 -45459 -129640 -73561 3429 21200 -29527 63501 120934 14470 79305
12985 79305 165516 145858 201872 336572 320459 103688 -12572 844 31993 220027 355221
12974 355221 296657 154147 168651 267629 263485 152410 256114 226720 236506 203070 193596
12963 193596 123183 126525 206529 176656 116832 36379 27044 105426 27325 -6736 34804 87259
12951 87259 208721 251235 173882 203642 291533 379317 431228 415942 459891 360899 281229
12940 281229 335263 232975 228545 202207 239104 356492 313352 289986 318229 187916 140889
12929 140889 97241 154891 298628 413205 494764 398429 398963 338864 286023 450446 638875
$$ packed form
13007A81918M2876Q9746m9428o5251p2521j36030r4045R5509J26097J7309l6206
12996I9974o5268q0165q4181N6079P6990J7771n0727R3028N7433j06464O4835
12985G9305Q6211j9658N6014J34700j6113k16771j16260J3416L1149J88034J35194
12974C55221n8564j42510J4504R8978m144j11075J03704k9394R786l3436r474
12963A93596p0413L342Q0004k9873n9824q0453r335P8382p8101l4061M1540N2455
12951H7259J21462M2514p7353K9760Q7891Q7784N1911j5286M3949r8992p9670
12940B81229N4034j02288m430k6338L6897J17388m3140k3366K8243j30313m7027
12929A40889m3648N7650J43737J14577Q1559r6335N34o0099n2841J64423J88429
$$ plain form
12918 638875 727416 675630 861886 1049403 989503 892692 671563 494485 569332 717444
12908 717444 642376 604821 523496 433084 386773 386625 421091 512315 478118 350861 354157 435078
12896 435078 411523 480490 536977 555056 516319 590505 630087 670286 730123 771630 781208 802086
12884 802086 761092 742445 685034 603033 523136 479648 445785 405031 415821 491449 416544
12873 416544 335963 252682 155442 253922 289045 384118 474986 288778 291147 390322 385144 441737
12861 441737 378507 499716 683220 656241 607714 645746 680627 618582 449588 386934 310490
12850 310490 282316 367811 423175 398941 252052 131525 225111 227714 130700 40136 23767
12839 23767 73629 124145 132305 253606 243176 194054 306816 276514 317775 413898 495658
$$ packed form
12918F38875Q8541n1786J86256J87517n9900r6811k21129j77078P4847J48112
12908G17444p5068l7555q1325r0412m6311j48L4466R1224l4197j27257L296Q0921
12896D35078k3555O8967N6487J8079l8737P4186L9582M0199N9837M1507R578K0878
12884H02086m0994j8647n7411q2001p9897m3488l3863m0754J0790P5628p4905
12873D16544q0581q3281r7240R8480L5123R5073R0868j86208K369R9175n178N6593
12861D41737o3230J21209J83504k6979m8527L8032L4881o2045j68994o2654p6444
12850C10490k8174Q5495N5364k4234j46889j20527R3586K603r7014r0564j6369
12839B3767M9862N0516Q160J21301j0430m9122J12762l0302M1261R6123Q1760
$$ plain form
12828 495658 516246 495809 438859 367674 308856 300492 341932 384879 434607 450418 500670 548462
12816 548462 683184 683692 728721 786153 702465 585686 596693 716844 637202 745512 758148
12805 758148 768789 751922 691815 529473 440458 531730 676747 690069 589505 592380 657194
12794 657194 702719 595549 536415 577582 673129 773066 709656 637111 622852 573507 490189
12783 490189 596537 715956 695266 625399 642528 587073 617343 637369 669220 753635 799969
12772 799969 776387 763459 695626 649070 518892 700203 792287 726320 699841 693672 679020
12761 679020 668605 647598 516198 621782 672012 732877 812535 875096 995130 1182848 1224911
12750 1224911 1262076 1249680 1224648 1197593 1363500 1381298 1321671 1352051 1413905 1335975 1359243
$$ packed form
12828D95658K0588k0437n6950p1185n8818q364M1440M2947M9728J5811N0252M7792
12816E48462J34722N08M5029N7432q3688j16779J1007J20151p9642J08310J2636
12805G58148J0641j6867o0107j62342q9015R1272J45017J3322j00564K875O4814
12794F57194M5525j07170n9134M1167R5547R9937o3410p2545j4259m9345q3318
12783D90189J06348J19419k0690o9867J7129n5455L0270K0026L1851Q4415M6334
12772G99969k3582j2928o7833m6556j30178J81311R2084o5967k6479o169j4652
12761F79020j0415k1007j31400J05584N0230O0865P9658O2561J20034J87718M2063
12750A224911L7165j2396k5032k7055J65907J7798n9627L0380O1854p7930K3268
$$ plain form
12739 1359243 1429872 1445022 1580983 1594469 1699439 1853820 1890062 1763926 1940646 2072616
12729 2072616 2156893 2246970 2418434 2542877 2831345 3116331 3413821 3567782 3826155 3993845
12719 3993845 4247270 4473155 4823263 5323628 5714690 5999455 6396822 6813759 7345321
12710 7345321 8081429 8941904 9705221 10679921 12099394 13802768 15642247 17536072 19651669
12701 19651669 22553192 26540132 31924290 39446147 49809838 64089904 83984947 110750765
12693 110750765 145430222 188060373 236028367 280713730 306115686 300817019 266630614
12686 266630614 216012670 165238823 124909142 96882897 78604049 67559801 61379315
12679 61379315 58553264 58337434 60463202 65519327 73444293 83659683 95834123 109515005
$$ packed form
12739A359243P0629J5150J35961J3486J04970J54381L6242j26136J76720J31970
12729B072616Q4277R0077J71464J24443K88468K84986K97490J53961K58373J67690
12719C993845K53425K25885L50108N00365L91062K84765L97367M16937N31562
12710G345321P36108Q60475P63317R74700J419473J703374J839479J893825K115597
12701A9651669K901523L986940N384158P521857J0363691J4280066J9895043K6765818
12693A10750765L4679457M2630151M7967994M4685363K5401956n298667l4186405
12686B66630614n0617944n0773847m0329681k8026245j8278848j1044248o180486
12679F1379315k826051k15830K125768N056125P924966J0215390J2174440J3680882
$$ plain form
12671 109515005 123407960 135130583 144824668 157223346 176224216 201111590 228628984
12664 228628984 256034274 283411799 313577699 347895760 383091922 408240361 405430114
12657 405430114 366991511 307614670 251455176 212729408 191429007 181633459 178681997
12650 178681997 179233032 180320876 178847171 172168060 160364962 146630132 135917669 129987849
12642 129987849 124696389 115144095 102142131 90666905 83129669 79984723 81898964 89358329
12634 89358329 102686835 123039498 152341378 192507091 244123426 304588046 364962242
12627 364962242 408792279 416150632 375542862 299102377 219136958 157196268 113787938
12620 113787938 84449915 64788171 51457594 42275059 35755461 30838934 26930795
$$ packed form
12671A09515005J3892955J1722623R694085J2398678J9000870K4887374K7517394
12664B28628984K7405290K7377525L0165900L4318061L5196162K5148439k810247
12657D05430114l8438603n9376841n6159494l8725768k1300401r795548k951462
12650A78681997N51035J087844j473705o679111j1803098j3734830j0712463n929820
12642A29987849n291460r552294j3001964j1475226p537236l144946J914241P459365
12634H9358329J3328506K0352663K9301880M0165713N1616335O0464620O0374196
12627C64962242M3830037P358353m0607770p6440485p9965419o1940690m3408330
12620A13787938k9338023j9661744j3330577r182535o519598m916527l908139
$$ plain form
12613 26930795 23846278 21599749 19739131 18023316 16407767 14804710 13235898 11772819
12605 11772819 10744193 9884237 9342018 8791854 8340670 7830363 7345203 7028066 6703608
12596 6703608 6191183 5806632 5641950 5472135 5250418 4994170 4939434 4806533 4700243 4643922
12586 4643922 4594067 4440422 4114109 3979566 3827238 3624656 3585219 3594231 3564417 3382835
12576 3382835 3264212 3017794 2819155 2767605 2726442 2604894 2475169 2460574 2557513 2570643
12566 2570643 2536336 2702642 2775191 2650249 2465371 2313251 2168807 2003123 1845290 1767118
12556 1767118 1812989 1842959 1986231 2163271 2311217 2278144 2195174 2185098 2097916 1989304
12546 1989304 2042058 2042732 1929602 1790056 1780288 1823478 1991172 2005713 1777598 1780282 1937255
$$ packed form
12613B6930795l084517k246529j860618j715815j615549j603057j568812j463079
12605A1772819j028626q59956n42219n50164m51184n10307m85160l17137l24458
12596F703608n12425l84551j64682j69815k21717k56248n4736j32901j06290n6321
12586D643922m9855j53645l26313j34543j52328k02582l9437R012k9814j81582
12576C382835j18623k46418j98639n1550m1163j21548j29725j4595R6939J3130
12566B570643l4307J66306P2549j24942j84878j52120j44444j65684j57833p8172
12556A767118M5871K9970J43272J77040J47946l3073q2970j0076q7182j08612
12546A989304N2754O74j13130j39546r768M3190J67694J4541k28115K684J56973
$$ plain form
12535 1937255 2018378 1894459 1795489 1744356 1584288 1547815 1603508 1622457 1666169 1689167 1631882
12524 1631882 1475358 1357010 1335306 1353815 1437920 1540828 1587441 1683705 1706592 1687581 1846166
12513 1846166 2018198 2180408 2123524 2005911 2002563 2214240 2624762 3072620 3402262 3383733
12503 3383733 3161716 2841170 2545948 2313927 1966657 1672192 1488604 1369620 1247798
12494 1247798 1094974 1007295 1026975 888467 847008 858683 849118 872840 1025815 1133418 1239165
12483 1239165 1264742 1373056 1446370 1448211 1372834 1355891 1402696 1417400 1419325 1356526 1258702
12472 1258702 1194138 1104636 1157870 1057605 946411 816534 739667 812763 899257 913648 750864
12461 750864 720204 937787 1005542 955367 1009635 1015752 862269 644752 542059 645060 727931
$$ packed form
12535A937255Q1123j23919r8970n1133j60068l6473N5693J8949M3712K2998n7285
12524A631882j56524j18348k1704J8509Q4105J02908M6613R6264K2887j9011J58585
12513A846166J72032J62210n6884j17613l348K11677M10522M47858L29642j8529
12503C383733k22017l20546k95222k32021l47270k94465j83588j18984j21822
12494A247798j52824q7679J9680j38508m1459J1675r565K3722J52975J07603J05747
12483A239165K5577J08314P3314J841p5377j6943M6805J4704J925o2799r7824
12472A258702o4564q9502N3234j00265j11194j29877p6867P3096Q6494J4391j62784
12461G50864l0660K17583O7755n0175N4268O117j53483k17517j02693J03001Q2871
$$ plain form
12450 727931 738700 755005 746867 691071 799118 845196 793301 728367 671029 627622 650043
12439 650043 680646 652161 744666 798824 801225 849404 884329 1089070 1210059 1065281 1032283
12428 1032283 1001178 1019875 1040189 1080488 958991 1103975 1213834 1371381 1511181 1300567
12418 1300567 1218984 1297950 1257064 1118085 1060609 960721 858915 817079 796125 838399 735088
12407 735088 812122 914544 875925 894940 885462 928470 1134904 1288628 1263805 1207517 1291161
12396 1291161 1311922 1324954 1299027 1383643 1540924 1566286 1645046 1640012 1709344 2023774 2279436
12385 2279436 2358962 2436707 2611880 2752049 2798748 2830166 2775532 2541676 2260657 1861147
12375 1861147 1608543 1510390 1457478 1431410 1324806 1355409 1401469 1362737 1339588 1245361 1294850
$$ packed form
12450G27931J0769J6305q138n5796J08047M6078n1895o4934n7338m3407K2421
12439F50043L0603k8485R2505N4158K401M8179L4925K04741J20989j44778l2998
12428A032283l1105J8697K0314M0299j21497J44984J09859J57547J39800k10614
12418A300567q1583P8966m0886j38979n7476r9888j01806m1836k0954M2274j03311
12407G35088P7034J02422l8619J9015r478M3008K06434J53724k4823n6288Q3644
12396A291161K0761J3032k5927Q4616J57281K5362P8760n034O9332L14430K55662
12385B279436P9526P7745J75173J40169M6699L1418n4634k33856k81019l99510
12375A861147k52604r8153n2912k6068j06604L0603M6060l8732k3149r4227M9489
$$ plain form
12364 1294850 1382088 1310718 1183727 1171056 1231690 1235891 1271963 1251384 1239545 1174740 1137310
12353 1137310 1130715 1091015 1171372 1179519 1105686 1048162 935966 1053709 1037515 1192526 1240808
12342 1240808 1252948 1231521 1148815 1197721 1158793 970969 1047608 1100102 1185480 1271229 1330380
12331 1330380 1476735 1661051 1577317 1400945 1347203 1436029 1588339 1677139 1704607 1596832
12321 1596832 1595255 1573365 1594261 1617053 1668078 1705065 1744870 1837931 1828741 1756944 1736227 1889629
12309 1889629 2032863 2041293 1908232 1906071 1859056 1982757 2064381 2070878 2126528 2225835 2287227
12298 2287227 2466220 2617062 2658069 2695917 2927616 3309691 3559655 3659122 3903087 4085289
12288 4085289 4366320 4694072 5133590 5554113 5877391 6132799 6569997 7201287 7863841
$$ packed form
12364A294850Q7238p1370j26991j2671O0634M201L6072k0579j1839o4805l7430
12353A137310o595l9700Q0357Q147p3833n7524j12196J17743j6194J55011M8282
12342A240808J2140k1427q2706M8906l8928j87824P6639N2494Q5378Q5749N9151
12331A330380J46355J84316q3734j76372n3742Q8826J52310Q8800K7468j07775
12321A596832j577k1890K0896K2792N1025L6987L9805R3061r190p1797k0717J53402
12309A889629J43234Q430j33061k161m7015J23701Q1624O497N5650R9307O1392
12298B287227J78993J50842M1007L7848K31699L82075K49964R9467K43965J82202
12288D085289K81031L27752M39518M20523L23278K55408M37198O31290O62554
$$ plain form
12279 7863841 8608562 9367700 10188935 11219154 12566248 14088202 15881163 18323794 21299363
12270 21299363 24913146 29446467 35600782 43728437 54567233 69249504 89276449 116524172
12262 116524172 153213374 201022268 259980456 326249972 386331084 417066688 400697633
12255 400697633 342454705 266691988 197951178 148085673 116437151 97446985 86716443
12248 86716443 81604988 80795257 83309267 89311929 98867082 110945180 121938465 128231839
12240 128231839 130917884 135316713 145512771 161334346 179513003 194592912 200653774
12233 200653774 196854972 189263556 188067049 200552735 227538450 266240249 311849066
12226 311849066 355841047 385315352 389320225 366511145 329318667 293962516 267178380
$$ packed form
12279G863841P44721P59138Q21235J030219J347094J521954J792961K442631K975569
12270B1299363L613783M533321O154315Q127655J0838796J4682271K0026945K7247723
12262A16524172L6689202M7808894N8958188O6269516O0081112L0735604j6369055
12255D00697633n8242928p5762717o8740810m9865505l1648522j8990166j0730542
12248H6716443n111455q09731K514010O002662R555153J2078098J0993285O293374
12240A28231839K686045M398829J0196058J5821575J8178657J5079909O060862
12233B00653774l798802p591416j196507J2485686K6985715L8701799M5608817
12226C11849066M3991981K9474305M004873k2809080l7192478l5356151k6784136
$$ plain form
12219 267178380 243353228 216985564 188666545 162867706 143230952 130644064 123376827
12212 123376827 117276730 108020022 94440295 80107332 69009841 62609924 60348488
12205 60348488 61550480 66092576 74092096 85810549 102113400 124587934 154330658
12198 154330658 191132627 232518003 272807461 301430000 303369586 271081792 215469477
12191 215469477 158639953 114626528 84412985 64310431 50932917 41754051 35184934
12184 35184934 30111461 25682882 21895856 18856991 16340353 14433463 12863480 11593269
12176 11593269 10385270 9508658 8793926 8106772 7508201 6901317 6506694 6226073 6009469
12167 6009469 5822799 5692209 5391760 5023414 4811587 4590314 4529176 4535968 4370824 4229524
$$ packed form
12219B67178380k3825152k6367664k8319019k5798839j9636754j2586888p267237
12212A23376827o100097r256708j3579727j4332963j1097491o399917k261436
12205F0348488J201992M542096P999520J1718453J6302851K2474534K9742724
12198A54330658L6801969M1385376M0289458K8622539J939586l2287794n5612315
12191B15469477n6829524m4013425l0213543k0102554j3377514r178866o569117
12184C5184934n073473m428579l787026l038865k516638j906890j569983j270211
12176A1593269j207999q76612p14732o87154n98571o06884l94623k80621k16604
12167F009469j86670j30590l00449l68346k11827k21273o1138O792j65144j41300
$$ plain form
12157 4229524 4010830 3838507 3723303 3622572 3607543 3645047 3667718 3517881 3427854 3323768
12147 3323768 3245163 3093315 2926618 2776157 2607907 2434621 2480831 2610335 2598591 2601394
12137 2601394 2441113 2169439 2088514 2149079 2219313 2148974 2078018 2079472 2096088 2033057 2005710
12126 2005710 1971597 1866068 1731515 1760800 1761103 1774764 1683618 1709779 1688677 1709569 1701520
12115 1701520 1684142 1691795 1763475 1649077 1573610 1522398 1497309 1349818 1453968 1583253 1449578
12104 1449578 1468042 1474637 1418869 1409340 1478603 1546977 1458511 1329290 1254677 1369868 1461988
12093 1461988 1327447 1265689 1360699 1393849 1357953 1265217 1059143 1167990 1271487 1353232
12083 1353232 1399706 1445215 1438513 1316682 1327286 1481953 1546295 1693975 1628876 1378966 1341103
$$ packed form
12157D229524k18694j72323j15204j00731j5029L7504K2671j49837r0027j04086
12147C323768p8605j51848j66697j50461j68250j73286M6210J29504j1744K803
12137B601394j60281k71674q0925O0565P0234p0339p0956J454J6616o3031k7347
12126B005710l4113j05529j34553K9285L03J3661r1146K6161k1102K0892q049
12115A701520j7378P653P1680j14398p5467n1212k5089j47491J04150J29285j33675
12104A449578J8464O595n5768r529O9263O8374q8466j29221p4613J15191R2120
12093A461988j34541o1758R5010L3150l5896r2736k06074J08847J03497Q1745
12083A353232M6474M5509o702j21831J0604J54667O4342J47680o5099k49910l7863
$$ plain form
12072 1341103 1451667 1561584 1546746 1545057 1472695 1487024 1293968 1098934 1099103 1033810 875611
12061 875611 809228 787591 634971 731194 765471 655598 690849 808696 778407 727804 818744
12050 818744 803931 827129 884011 856971 840293 882654 864477 853717 819906 581443 494560
12039 494560 580807 614478 536672 533358 647221 674925 617259 543691 535296 526698 573505 495209
12027 495209 479073 442901 283967 230657 192942 211931 181635 272432 255320 248886 355647
12016 355647 520591 572736 596119 545210 498145 482273 465025 453421 418949 375220 292194
12005 292194 277419 393354 407189 447311 425144 380848 432542 522300 449127 374023 334008
11994 334008 283147 314004 408197 368402 358723 359587 374062 431221 528225 460896 543470 576948
$$ packed form
12072A341103J10564J09917j4838j689p2362J4329j93056j95034J69o5293j58199
12061H75611o6383k1637j52620R6223L4277j09873L5251J17847l0289n0603R0940
12050H18744j4813K3198N6882k7040j6678M2361j8177j0760l3811k38463q6883
12039D94560Q6247L3671p7806l314J13863K7704n7666p3568q395q598M6807p8296
12027D95209j6136l6172j58934n3310l7715J8989l0296R0797j7112o434J06761
12016C55647J64944N2145K3383n0909m7065j5872j7248j1604l4472m3729q3026
12005B92194j4775J15935J3835M0122k2167m4296N1694Q9758p3173p5104m0015
11994C34008n0861L0857R4193l9795r679Q64J4475N7159R7004o7329Q2574L3478
$$ plain form
11982 576948 533158 420584 388290 269408 174050 267518 179959 262915 287569 299916 291701
11971 291701 317509 333419 258593 261424 191456 264415 298867 338535 527283 646519 353947
11960 353947 264671 322596 414701 284291 292733 334860 419292 371477 377086 360093 372378 411523
11948 411523 473529 502579 412553 258152 210538 268404 261241 213997 289354 291025 293218 356553
11936 356553 354149 309455 295083 255229 234945 307643 341470 397847 378912 423330 333522 170764
11924 170764 183079 31076 155123 366473 306497 118244 -4618 15048 15171 60331 167577
11913 167577 239585 383281 434217 294145 216390 112195 60085 150149 284471 369680 402674
11902 402674 404256 267057 281309 288996 255254 345173 394712 341853 271472 290898 286680 235726
$$ packed form
11982E76948m3790j12574l2294j18882r5358R3468q7559Q2956K4654J2347q215
11971B91701K5808J5910p4826K831o9968P2959L4452L9668J88748J19236k92572
11960C53947q9276N7925R2105j30410Q442M2127Q4432m7815N609j6993J2285L9145
11948D11523O2006K9050r0026j54401m7614N7866p163m7244P5357J671K193O3335
11936C56553k404m4694j4372l9854k0284P2698L3827N6377j8935M4418q9808j62758
11924A70764J2315j52003J24047K11350n9976j88253j22862J9666J23M5160J07246
11913A67577P2008J43696N0936j40072p7755j04195n2110R0064J34322Q5209L2994
11902D02674J582j37199J4252P687l3742Q9919M9539n2859p0381J9426m218n0954
$$ plain form
11890 235726 260184 284244 381224 374428 266203 97579 53110 -22382 -49417 116475 313641
11879 313641 523730 502601 387794 307018 243079 299503 230668 198399 233035 129058 171421
11868 171421 237179 224750 256178 252106 228281 77558 58179 117256 181782 178564 254155 199116
11856 199116 263558 323322 340207 302904 405671 282650 116211 222366 207447 75935
11846 75935 125238 251662 155335 73894 18250 107464 158511 192340 120755 173595 105941
11835 105941 74851 50329 13979 137398 119880 143440 96591 104840 231744 301396 350860
11824 350860 345030 520340 778744 970290 1181574 1399878 1587014 1813724 2126760 2120908
11814 2120908 1816647 1481139 1267624 1090006 917808 869377 837934 695461 590386 503164
$$ packed form
11890B35726K4458K4060R6980o796j08225j68624m4469p5492k7035J65892J97166
11879C13641K10089k1129j14807q0776o3939N6424o8835l2269L4636j03977M2363
11868A71421O5758j2429L1428m072k3825j50723j9379N9077O4526l218P5591n5039
11856A99116O4442N9764J6885l7303J02767j23021j66439J06155j4919j31512
11846G5935M9303J26424r6327q1441n5644Q9214N1047L3829p1585N2840o7654
11835A05941l1090k4522l6350J23419j7518K3560m6849Q249J26904O9652M9464
11824C50860n830J75310K58404J91546K11284K18304J87136K26710L13036n852
11814B120908l04261l35508k13515j77618j72198m8431l1443j42473j05075q7222
$$ plain form
11804 503164 485114 371558 376979 500664 382291 364696 476619 517063 645491 893419
11794 893419 998126 1076507 1108252 1053101 979673 1112781 1286503 1406538 1637317 1798154
11784 1798154 1850172 1796398 1709948 1555803 1398766 1185756 1031243 989301 882791 716905
11774 716905 685063 598177 549478 623225 497804 390692 352989 384209 351128 359124 230705
11763 230705 120574 153450 286665 450024 507536 512753 865794 1307067 1634767 1911554
11753 1911554 1929213 1776735 1492080 1068123 771568 607553 464603 253814 154049 72271
11743 72271 13444 92160 172855 188084 107019 -50709 -99331 -66922 -11516 20458 -140693
11732 -140693 -211311 -127630 -82428 4349 -646 86472 177646 308231 284933 286914 125049
$$ packed form
11804E03164j8050j13556N421J23685j18373j7595J11923M0444J28428K47928
11794H93419J04707P8381L1745n5151p3428J33108J73722J20035K30779J60837
11784A798154N2018n3774q6450j54145j57037k13010j54513m1942j06510j65886
11774G16905l1842q6886m8699P3747j25421j07112l7703L1220l3081P996j28419
11763B30705j10131L2876J33215J63359N7512N217L53041M41273L27700K76787
11753A911554J7659j52478k84655m23957k96555j64015j42950k10789r9765q1778
11743G2271n8827P8716Q0695J5229q1065j57728m8622L2409N5406L1974j61151
11732a40693p0618Q3681M5202Q6777m995Q7118R1174J30585k3298J981j61865
$$ plain form
11721 125049 67560 20062 85137 68429 -22572 66391 152222 114299 93620 200561 66141
11710 66141 35717 132965 184249 136717 143729 -45892 -11006 -33990 -61814 -105906 -40521 65711
11698 65711 88569 -25244 -65766 -122833 -127324 -57605 38941 9816 -111382 -229518 -181360
11687 -181360 -73166 60531 140709 136816 44453 -12329 128619 152359 69034 8287 9087
11676 9087 -118947 -149994 15363 78879 11718 -34903 -125416 -142557 -1955 105678 298696
11665 298696 346419 282897 84558 80363 172059 -10261 -98058 -134062 -83273 -189029 -398998
11654 -398998 -108573 83991 42281 24608 189811 179215 81060 89949 162951 195902 176261
11643 176261 178214 198421 97468 46748 -13114 -112840 77768 160705 184080 116804 -51679
$$ packed form
11721A25049n7489m7498O5075j6708r1001Q8963Q5831l7923k0679J06941j34420
11710F6141l0424R7248N1284m7532P012j89621L4886k2984k7824m4092O5385J06232
11698F5711K2858j13813m0522n7067m491O9719R6546k9125j21198j18136M8158
11687a81360J08194J33697Q0178l893r2363n6782J40948K3740q3325o0747Q00
11676I087j28034l1047J65357O3516o7161m6621r0513j7141J40602J07633J93018
11665B98696M7723o3522j98339m195R1696j82320q7797l6004N0789j05756k09969
11654c98998K90425J92564m1710j7673J65203j0596r8155Q889P3002L2951j9641
11643A76261J953K0207j00953n0720n9862r9726J90608Q2937K3375o7276j68483
$$ plain form
11632 -51679 -270667 -306674 -179058 12458 47581 -149743 -159323 6885 9658 -1542 130755
11621 130755 76538 -44284 -147680 -208516 -151025 -115920 -93842 -47272 89766 237897 225092
11610 225092 171307 38784 -4696 32080 8092 -63733 -105217 -197934 -208012 -148566 -74448
11599 -74448 60217 145423 91943 91274 138959 87492 -27504 -25801 16199 196090 308173
11588 308173 233422 167133 221871 237819 131431 -54963 -83893 -71800 -65593 8363 63678
11577 63678 13199 -51758 48009 48879 -21013 -99448 -193829 -79145 -58980 -163672 -138769 -25535
11565 -25535 -72841 -13656 30702 644 -2398 112611 176726 233236 249265 67401 -27845
11554 -27845 166438 253894 231020 131268 69244 64881 -23744 -8430 -62125 -43813 -5717 34041
$$ packed form
11632e1679k18988l6007J27616J91516L5123j97324r580J66208K773j1200J32297
11621A30755n4217j20822j03396o0836N7491L5105K2078M6570J37038J48131j2805
11610B25092n3785j32523m3480L6776k3988p1825m1484r2717j0078N9446P4118
11599g4448J34665Q5206n3480o69M7685n1467j14996J703M2000J79891J12083
11588C08173p4751o6289N4738J5948j06388j86394k8930J2093O207P3956N5315
11577F3678n0479o4957R9767Q70o9892p8435r4381J14684K0165j04692K4903J13234
11565b5535m7306N9185M4358l0058l042J15009O4115N6510J6029j81864r5246
11554b7845J94283Q7456k2874r9752o2024m363q8625J5314n3695J8312L8096L9758
$$ plain form
11542 34041 -53765 -71191 -55619 -203027 -208799 -242541 -231853 -154524 -39621 25823 -3123
11531 -3123 41672 86438 87696 201207 249708 210926 182490 95623 29847 64702 30623 8900
11519 8900 152804 265912 256718 223822 64831 97141 94375 61495 33206 -147080 -190119
11508 -190119 -6225 114915 -21309 -110373 -16686 109035 88226 62759 81253 20590 7549
11497 7549 -103297 -109884 -153580 -104131 -61505 651 51751 -77096 -180420 -219644 -153364
11486 -153364 -24666 58024 112488 154616 63326 56182 30926 99348 93103 112024 13911 -18939
11474 -18939 121962 289943 238991 183364 80702 50699 72845 170337 59201 27003 25732
11463 25732 63602 -87889 -108411 -60681 -76341 -130539 -104925 71076 -124283 -159666 64856
$$ packed form
11542C4041q7806j7426J5572j47408n772l3742J0688P7329J14903O5444k8946
11531c123M4795M4766J258J13511M8501l8782k8436q6867o5776L4855l4079k1723
11519H900J43904J13108r194l2896j58991L2310k766l2880k8289j80286m3039
11508a90119J83894J21140j36224q9064R3687J25721k0809k5467J8494o0663j3041
11497G549j10846o587m3696M9449M2626O2156N1100j28847j03324l9224O6280
11486a53364J28698Q2690N4464M2128r1290p144k5256O8422o245J8921r8113l2850
11474a8939J40901J67981n0952n5627j02662l0003K2146R7492j11136l2198j271
11463B5732L7870j51491k0522M7730j5660n4198K5614J76001j95359l5383K24522
$$ plain form
11452 64856 128649 231256 168305 180098 194212 -27842 -20858 -141360 -150596 -169157 -100396
11441 -100396 112581 71858 -46286 16533 29290 158081 110462 111521 40299 77232 200514
11430 200514 202014 139012 22131 18459 23277 -27014 2165 85854 41949 -54851 89363 156174
11418 156174 66870 3796 -57160 -192321 -121334 -45722 90741 128524 129156 34783 -38970
11407 -38970 -34035 -75988 -6285 22221 -43754 46188 115730 48737 -33454 -179509 -6802
11396 -6802 67158 108217 107581 78735 -2441 -2195 -57933 -71210 -75275 19892 43978 121410 225414
11383 225414 192790 111886 46831 -43979 -77684 -141960 -105374 84493 157824 132757 119839
11372 119839 84982 119092 108795 131531 83203 39853 74700 53624 20717 -31836 41863
$$ packed form
11452F4856O3793J02607o2951J1793J4114k22054O984j20502r236j8561O8761
11441a00396K12977m0723j18144O2819J2757J28791m7619J059p1222L6933J23282
11430B00514J500o3002j16881l672M818n0291K9179Q3689m3905r6800J44214O6811
11418A56174q9304o3074o0956j35161P0987P5612J36463L7783O32r4373p3753
11407c8970M935m1953O9703K8506o5975Q9942O9542o6993q2191j46055J72707
11396f802P3960M1059o36k8846q1176K46n5738j3277m065R5167K4086P7432J04004
11383B25414l2624q0904o5055r0810l3705o4276L6586J89867P3331k5067j2918
11372A19839l4857L4110j0297K2736m8328m3350L4847k1076l2907n2553P3699
$$ plain form
11361 41863 100850 78886 -77167 -336571 -446056 -278643 -240784 -93820 5014 76161 114244
11350 114244 99749 119054 144203 104796 156001 66957 23663 -4631 -120402 -129536 -9634
11339 -9634 -21087 42515 97186 129213 71279 20926 -87974 -177729 -228337 -187303 -149018 -170877
11327 -170877 -251775 -181919 -93783 33208 -5718 -26977 19456 108727 85092 67099 -797
11316 -797 -103743 -134068 -197524 -75627 -136890 -96211 67954 248595 237735 218823 203439
11305 203439 134216 96976 111743 109660 54735 19554 -29372 -172859 -133954 -35254 -112006
11294 -112006 -71527 -117939 -103114 -185969 10914 88634 -54121 -147316 -86716 23239 -31321
11283 -31321 -228815 -250904 -345308 -273176 -147494 -55563 57168 191074 175583 136177 166031
$$ packed form
11361D1863N8987k1964j56053k59404j09485J67413L7859J46964R8834P1147L8083
11350A14244j4495J9305K5149l9407N1205q9044m3294k8294j15771r134J19902
11339i634j1453O3602N4671L2027n7934n0353j08900q9755n0608M1034L8285k1859
11327a70877q0898O9856Q8136J26991l8926k1259M6433Q9271k3635j7993o7896
11316g97j02946l0325o3456J21897o1263M0679J64165J80641j0860j8912j5384
11305B03439o9223l7240J4767k083n4925l5181m8926j43487L8905R8700p6752
11294a12006M0479m6412J4825q2855J96883P7720j42755r3195O0600J09955n4560
11283c1321j97494k2089r4404P2132J25682R1931J12731J33906j5491l9406K9854
$$ plain form
11272 166031 46958 94143 213740 212772 301035 312991 213070 195609 97936 -25875 -121239
11261 -121239 -101109 -30538 -21868 -85508 -72068 -18079 110579 66520 -56767 -57210 -61445 -106336
11249 -106336 -12593 38945 60932 132172 58374 54523 57556 -59704 -94117 -77071 4396 -95660
11237 -95660 -192806 -119112 38467 65777 108281 89273 53538 -135231 -195844 -200523 -208637 -70096
11225 -70096 29141 58238 -115256 -145783 -46557 69590 46788 31375 12660 50061 126591
11214 126591 107200 127152 14747 -19146 56680 80979 740 -65781 -101172 -52907 -12494
11203 -12494 74823 -40912 -43975 89291 121695 96131 148047 263412 203698 135379 142439
11192 142439 87343 -52496 -77859 13052 42784 51308 21327 -69514 -168369 -152879 -244365
$$ packed form
11272A66031j19073M7185J19597r68Q8263J1956r9921j7461r7673j23811r5364
11261a21239K0130P0571Q670o3640J3440N3989J28658m4059j23287m43m235m4891
11249a06336R3743N1538K1987P1240p3798l851L033j17260l4413J7046Q1467j00056
11237i5660r7146P3694J57579K7310M2504j9008l5735j88769o0613m679q114J38541
11225g0096R9237K9097j73494l0527R9226J16147k2802j5413j8715L7401P6530
11214A26591j9391J9952j12405l3893P5826K4299q0239o6521l5391M8265M0413
11203a2494Q7317j15735l063J33266L2404k5564N1916J15365n9714o8319P060
11192A42439n5096j39839k5363R0911K9732Q524k9981r0841r8855J5490r1486
$$ plain form
11181 -244365 -365368 -217080 -10649 86682 168803 200766 360173 352937 290999 242426 204338
11170 204338 196812 102886 -91631 -57103 42197 40686 -40579 42501 92444 -3351 -23303 -61614
11158 -61614 -40630 -94020 -173216 -101502 -123773 -182952 -124013 -142398 -105926 17247 90146
11147 90146 168787 193441 122207 45018 131731 235652 106576 -8899 -8892 51872 51714 75525
11135 75525 64292 10589 -22958 -82089 -95334 -134583 -199800 -170390 -80075 -143847 -83275 -114469
11123 -114469 -48072 -19648 -105499 -74419 -38084 2123 11060 40944 -79123 -12301 139634
11112 139634 55245 -58062 -132125 -70713 -10435 -11895 -18921 -172481 -234411 -101546 3749
11101 3749 15304 -63674 19798 -60594 -74257 -75345 -234972 -316059 -295118 -275102 -204357 -179960
$$ packed form
11181b44365j21003J48288K06431R7331Q2121L1963J59407p236o1938m8573l8088
11170B04338p526r3926j94517L4528R9300j511q1265Q3080M9943r5795j9952l8311
11158f1614K0984n3390p9196P1714k2271n9179N8939j8385L6472J23173P2899
11147I0146P8641K4654p1234p7189Q6713J03921j29076j15475PO0764j58K3811
11135G5525j1233n3703l3547n9131j3245l9249o5217K9410R0315o3772O0572l1194
11123a14469O6397K8424q5851L1080L6335M0207Q937K9884j20067O6822J51935
11112A39634q4389j13307p4063O1412O0278j460p026j53560o1930J32865J05295
11101C749J1555p8978Q3472q0392j3663j088j59627q1087K0941K0016P0745K4397
$$ plain form
11089 -179960 -131503 -93013 -272544 -151496 -47307 70357 216833 104157 105255 238609
11079 238609 119165 -33296 4402 23703 -60332 -137458 -181490 -98252 -24784 -95232 -205858
11068 -205858 -144865 -96195 -158383 -151872 -62474 -77704 11676 82775 13866 36469 140071
11057 140071 135151 115050 225030 98025 -30698 -19934 34695 42600 98660 50906 -51968
11046 -51968 -48086 -184748 -158503 -130515 -155182 -253308 -347540 -312075 -291709 -195012 -244807 -291144
11034 -291144 -179369 -116227 -274573 -295199 -133933 -114493 -119764 -153646 -186476 -200754 -89392
11023 -89392 38808 52654 68943 137433 311329 306881 244086 158000 161465 114117 120455 128834
11011 128834 240187 291613 164433 85135 38085 -8299 22641 -63846 -112850 -65160 -134054
$$ packed form
11089a79960M8457L8490j79531J21048J04189J17664J46476j12676J098J33354
11079B38609j19444j52461L7698J9301q4035p7126m4032Q3238P3468p0448j10626
11068b05858O0993M8670o2188O511Q9398j5230Q9380P1099o8909K2603J03602
11057A40071m920k0101J09980j27005j28723J0764N4629P905N6060m7754j02874
11046e1968L882j36662K6245K7988k4667r8126r4232L5465K0366R6697m9795m6337
11034b91144J11775O3142j58346k0626J61266J9440n271l3882l2830j4278J11362
11023h9392J28200J3846J6289O8490J73896m448o2795q6086L465m7348O338Q379
11011A28834J11353N1426j27180p9298m7050m6384L0940q6487m9004M7690o8894
$$ plain form
11000 -134054 -85150 -10687 -53491 -48892 15785 94139 140641 69332 60613 45146 -127153 -169091
10988 -169091 -24331 65374 -139195 -313656 -149083 137611 167687 53759 103085 126922
10978 126922 321422 383699 307394 208441 41572 -6433 -1416 -14659 46892 11294 -15083
10967 -15083 -205977 -266596 -123479 -52240 -85803 -30367 -30514 18519 81730 -12455 -110991 -16041
10955 -16041 33082 -46783 -48221 -195621 -288638 -142532 -59626 -54267 -126160 -108331 -60149 1178
10943 1178 89480 66868 26276 51077 105341 39033 -16345 -44775 -11304 2973 -57448 -21060
10931 -21060 90634 66488 84468 -41376 -20756 43701 -135997 -173546 -92712 90091 24952
10920 24952 -19311 84851 75397 -21710 -58724 -37950 -151371 -225508 -211075 -221889 -158963
$$ packed form
11000a34054M8904P4463m2804M599O4677P8354M6502p1309q719j5467j72299m1938
10988a69091J44760Q9705k04569j74461J64573K86694L0076j13928M9326K3837
10978A26922J94500O2277p6305r8953j66869m8005N017j3243O1551l5598k6377
10967a5083j90894o0619J43117P1239l3563N5436j47M9033O3211r4185r8536R4950
10955a6041M9123p9865j438j47400r3017J46106Q2906N359p1893J7829M8182O1327
10943A178Q8302k2612m0592K4801N4264o6308n5378k8430L3471J4277o0421L6388
10931b1060J11694k4146J7980j25844K0620O4457j79698l7549Q0834J82803o5139
10920B4952m4263J04162r454r7107l7014K0774j13421p4137J4433j0814O2926
$$ plain form
10909 -158963 -219992 -54344 69003 80647 27979 44737 64218 92596 -91368 -213017 -96034
10898 -96034 26947 171336 190333 73689 14817 -84951 -159783 -48225 -140380 -130968 -117396
10887 -117396 -199481 -159086 -4761 22921 23846 22901 44552 -63252 -231785 -228278 -193877 -143442
10875 -143442 -48607 119576 197085 63380 -30346 -11517 16799 80995 -16047 -72903 -19192
10864 -19192 -27149 -119658 -172188 -174287 -119684 -73294 -75236 9440 43119 55316 49693 -56689
10852 -56689 74007 34056 -183412 -176874 -123839 -130320 -126854 -107652 -161802 -258004 -229221 -64890
10840 -64890 -45655 -93070 22290 103412 75599 92104 120573 96271 102803 63537 -20639 -24534
10828 -24534 -29568 -120838 -103641 -62414 -91099 -277760 -350981 -358665 -319494 -233278 -126042 -20638
$$ packed form
10909a58963o1029J65648J23347J1644n2668J6758J9481K8378j83964j21649J16983
10898i6034J22981J44389J8997j16644n8872r9768p4832J11558r2155R412J3572
10887a17396q2085M0395J54325K7682R25r45K1651j07804j68533L507L4401N0435
10875a43442R4835J68183P7509j33705r3726J8829K8316O4196r7042n6856N3711
10864a9192p957r2509n2530k099N4603M6390j942Q4676L3679J2197n623j06382
10852e6689J30696l9951k17468O538N3035o481L466J9202n4150r6202K8783J64331
10840f4890J9235m7415J15360Q1122k7813J6505K8469k4302O532l9266q4176l895
10828b4534n034r1270J7197M1227k8685j86661p3221p684L9171Q6216J07236J05404
$$ plain form
10816 -20638 -121197 -180774 -167549 -148871 -179689 -62675 -108753 -51344 122774 142913 -7801
10805 -7801 -136900 -110632 -33401 46877 13201 -38976 -123438 -108401 -111862 -23502 -51044 -122609
10793 -122609 -141676 -279362 -189864 -66071 -16316 23572 46335 -16591 -97666 -63424 21824
10782 21824 75237 -47168 -59658 -2788 2785 57458 72546 24324 4035 -111136 -178636
10771 -178636 -157681 -31636 87729 -22007 -58553 -8087 -87786 -107020 -97060 -46350 -5315
10760 -5315 -104747 -117497 60737 140091 175652 197076 42225 75099 111404 -13026 -4333
10749 -4333 159972 87692 28478 -195429 -339600 -260419 -154197 -33443 -52134 -5795 -62736
10738 -62736 -255919 -370538 -270048 -207237 -72966 -31065 76367 -40669 -109701 -12686
$$ packed form
10816b0638j00559n9577J3225J8678l0818J17014m6078N7409J74118K0139j50714
10805g801j29099K6268P7231Q0278l3676n2177q4462J5037l461Q8360k7542p1565
10793a22609j9067j37686Q9498J23793M9755L9888K2763o2926q1075L4242Q5248
10782B1824N3413j22405j2490N6870N573N4673J5088m8222k0289j15171o7500
10771a78636K0955J26045J19365j09736l6546N0466p9699j9234R960N0710M1035
10760e315r9432j2750J78234P9354L5561K1424j54851L2874L6305j24430Q693
10749d333J64305p2280n9214k23907j44171P9181J06222J20754j8691M6339n6941
10738f2736j93183j14619J00490O2811J34271M1901J07432j17036o9032R7015
$$ plain form
10728 -12686 126881 124458 116935 33406 30701 -16929 -13518 67488 170738 91505 68538 22980
10716 22980 -127939 -234363 -222613 -231175 -166549 48519 141338 149449 91864 -78579 -168522
10705 -168522 -202027 -271908 -73386 31159 -85610 -160159 -191468 -33167 78098 74135 119953
10694 119953 36561 -44598 -536 55865 72079 55476 20428 -7950 -11938 -111604 -65414 -20152
10682 -20152 -65745 -110200 -19605 47122 -28596 98148 104822 20649 -116459 -109546 2595
10671 2595 30827 -21733 -74513 -106786 -31623 58458 76515 117754 24445 5974 -114556 -131313
10659 -131313 -72073 5578 31239 194953 187434 -57744 -226367 -139808 -48324 -73730 17601
10648 17601 72984 34376 -62625 14278 -24720 -65081 -107678 -88575 -157751 -65432 120376
$$ packed form
10728a2686J39567k423p523q3529k705m7630L411Q1006J03250p9233k2967m5558
10716B2980j50919j06424J1750q562O4626K15068R2819Q111n7585j70443q9943
10705a68522l3505o9881J98522J04545j16769p4549l1309J58301J11265l963M5818
10694A19953q3392q1159M4062N6401J6214j6603l5048k8378l988r9666M6190M5262
10682b0152m5593m4455R0595O6727p5718J26744O674q4173j37108O913J12141
10671B595K8232n2560n2780l2273P5163R0081J8057M1239r3309j8471j20530j6757
10659a31313N9240P7651K5661J63714p519k45178j68623Q6559R1484k5406R1331
10648A7601N5383l8608r7001P6903l8998m0361m2597J9103o9176R2319J85808
$$ plain form
10637 120376 131285 152868 178559 238694 40953 -43744 -24951 -66759 -116647 -56658 2958
10626 2958 58389 778 25407 -61125 -146739 -125053 -140980 -267930 -151896 48743 -80733
10615 -80733 -113174 -146276 -44366 55697 -12644 35361 177932 179891 48134 97023 92540
10604 92540 -11296 81048 194302 110008 -102375 -165760 -223280 -85610 49669 224517
10594 224517 173496 90264 -4878 -140839 -190993 -201140 -180487 -198687 -60196 -56822 50145
10583 50145 252178 253547 186028 137528 58631 -122438 -229643 -292763 -291565 -185455 -153230
10572 -153230 -71887 -67829 -74352 8134 41736 150545 66787 38934 84723 4275 -33735 -42933
10560 -42933 24883 -3709 -108670 -86451 -202336 -196615 -42919 -14443 -162141 -52299 8094
$$ packed form
10637A20376J0909K1583K5691O0135j97741q4697J8793m1808m9888N9989N9616
10626B958N5431n7611K4629q6532q5614K1686j5927j26950J16034K00639j29476
10615h0733l2441l3102J01910J00063o8341M8005J42571J959j31757M8889m483
10604I2540j03836R2344J13254q4294k12383o3385n7520J37670J35279J74848
10594B24517n1021q3232r5142j35961n0154j0147K0653j8200J38491L374J06967
10583E0145K02033J369o7519m8500p8897j81069j07205o3120J198J06110L2225
10572a53230Q1343M058o523Q2486L3602J08809q3758k7853M5789q0448l8010r198
10560d2933O7816k8592j04961K2219j15885N721J53696K8476j47698J09842O0393
$$ plain form
10549 8094 35941 77619 139384 68623 -83850 -72734 36161 17760 57123 21734 -27628
10538 -27628 29112 904 36592 40306 65080 128353 56149 -137656 -190987 -117366 -75705 -8193
10526 -8193 -42603 -198567 -267375 -154289 2779 60138 17911 -35989 -90351 -113096 -47153
10515 -47153 -60113 -129798 -51125 -95294 -161094 -245775 -287673 -242991 -172542 -100963 47758
10504 47758 17287 -24063 -70288 -65200 -2221 88961 126235 72165 74426 124529 222193 120400
10492 120400 23549 -103337 -28898 150479 157121 31406 8524 181127 294515 149920
10482 149920 30379 -145118 -240527 -315147 -275509 -146550 -68232 87415 82178 -96310 -247491
10471 -247491 -369132 -337637 -190658 10681 103357 64492 8224 -11735 -45375 -66328 24264
$$ packed form
10549H094K7847M1678O1765p0761j52473J1116J08895j8401L9363l5389m9362
10538b7628N6740k8208L5688L714K4774O3273p2204j93805n3331P3621M1661O7512
10526h193l4410j55964o8808J13086J57068N7359m2227n3900n4362k2745O5943
10515d7153j2960o9685P8673m4169o5800q4681m1898M4682P0449P1579J48721
10504D7758l0471m1350m6225N088O2979R1182L7274n4070K261N0103R7664j01793
10492A20400r6851j26886P4439J79377O642j25715k2882J72603J13388j44595
10482A49920j19541j75497r5409p4620L9638J28959P8318J55647n237j78488j51181
10471b47491j21641L1495J46979K01339R2676l8865n6268j9959l3640k0953R0592
$$ plain form
10460 24264 91013 93026 -57201 -116801 -55300 19002 -68352 -206712 -216514 -185619 -157060 -64425
10448 -64425 -73948 -26398 84640 34475 -86464 -171646 -15802 175908 123737 -4977 -112906
10437 -112906 17247 5042 -52803 -114374 -79764 38381 65340 115535 30578 76899 119013
10426 119013 137605 77492 -645 -43101 -111348 -134879 -55713 70718 273299 293398 267473
10415 267473 77032 7160 82852 -123801 -161604 -79196 17852 119174 -43883 -168073
10405 -168073 -159606 -163648 -138949 -176843 -50611 100369 82356 36965 20531 -33339 -58810
10394 -58810 -111499 -130505 -99826 2270 -59221 -26859 -41659 5868 35831 30588 -4300 98867
10382 98867 146829 14303 -114799 -21058 -12402 -46274 -31234 -54041 41299 38454 95965 194964
$$ packed form
10460B4264O6749K013j50227n9600O1501P4302q7354j38360r802L0895K8559R2635
10448f4425r523M7550J11038n0165j20939q5182J55844J91710n2171j28714j07929
10437a12906J30153j2205n7845o1571L4610J18145K6959N0195q4957M6321M2114
10426A19013J8592o0113p8137m2456o8247k3531P9166J26431K02581K0099k5925
10415B67473j90441o9872P5692k06653l7803Q2408R7048J01322j63057j24190
10405a68073Q467m042K4699l7894J26232J50980j8013m5391j6434n3870k5471
10394e8810n2689j9006L0679J02096o1491L2362j4800M7527K9963n243l4888J03167
10382I8867M7962j32526j29102R3741Q656l3872J5040k2807R5340k845N7511R8999
$$ plain form
10370 194964 317744 285257 117584 43802 64419 245168 114669 -20887 28437 94580
10360 94580 -7118 -96509 -87074 -108442 -171495 -156120 -46734 -51242 -10631 -5829 23183 -37313
10348 -37313 -16961 39959 122517 94850 -61560 61985 123500 -3370 -25334 -20464 -58880
10337 -58880 -88280 -188275 891 178503 208710 163873 -11617 -80762 -14175 95023 172488
10326 172488 83797 144571 179845 216888 177336 245200 226116 205349 89335 -1783 -69135
10315 -69135 16864 -55829 -203716 -177816 -60197 -83342 -24409 28913 -2174 3057 -38943
10304 -38943 -83633 35811 45243 54583 198494 295756 369278 235698 103904 13993 -33533
10293 -33533 -60788 -21602 45425 39066 -5615 -117402 -200239 -210019 -25403 -74659 -58360 -99695
$$ packed form
10370A94964J22780l2487j67673p3782K0617J80749j30499j35556M9324O6143
10360I4580j01698q9391R435k1368o3053J5375J09386m508M0611M802K9012o0496
10348c7313K0352N6920Q2558k7667j56410J23545O1515j26870k1964M870l8416
10337e8880k9400r9995J89166J77612L0207m4837j75490o9145O6587J09198P7465
10326A72488q8691O0774L5274L7043l9552O7864j9084k0767j16014r1118o7352
10315f9135Q5999p2693j47887K5900J17619k3145N8933N3322l1087N231m2000
10304c8943m4690J19444R432R340J43911R7262P3522j33580j31794q9911m7526
10293c3533k7255L9186O7027o359m4681j11787q2837r780J84616m9256J6299m1335
$$ plain form
10281 -99695 -143039 -45587 -42984 -14329 -30571 64001 119173 149679 180660 223744 121001 108275
10269 108275 167984 50653 -124495 42148 110923 43943 -72925 -92934 -79966 -125186 -101797
10258 -101797 -24569 55414 48203 56356 49658 51882 34598 -48186 -13515 66942 118486 199653
10246 199653 162835 126003 142248 43644 -26877 -71377 680 70078 11086 -153147 -103533
10235 -103533 -5616 102555 -14537 -30934 -92635 -58460 -48525 -94881 -85186 -118835 -203640
10224 -203640 -268549 -296897 -248192 -136086 -57934 60395 150556 190261 134173 64281 99248
10213 99248 40965 73121 88281 154717 178566 77381 -46499 -53320 44229 81474 -104066
10202 -104066 -70137 -59432 -11279 -65045 -94456 -119208 -91627 -40203 -32618 -14543 -42027 5884
$$ packed form
10281i9695m3344R7452K603K8655j6242R4572N5172L0506L0981M3084j02743j2726
10269A08275N9709j17331j75148J66643O8775o6980j16868k0009J2968m5220K3389
10258a01797P7228P9983p211Q153o698K224j7284q2784L4671Q0457N1544Q1167
10246A99653l6818l6832J6245r8604p0521m4500P2057O9398n8992j64233M9614
10235a03533R7917J08171j17092j6397o1701L4175R935m6356R695l3649q4805
10224b03640o4909k8348M8705J12106P8152J18329R0161L9705n6088o9892L4967
10213I9248n8283L2156J5160O6436K3849j01185j23880o821R7549L7245j85540
10202a04066L3929J0705M8153n3766k9411k4752K7581N1424P585J8075k7484M7911
$$ plain form
10190 5884 141232 179402 106252 75304 -124224 -282677 -303250 -212602 -169111 -181630 -137329
10179 -137329 -70012 -28789 -175001 -236811 -155956 -87031 -52432 27146 29815 -33242 -166684
10168 -166684 -199089 -242485 -257169 -273112 -279164 -159852 -207650 -206915 -203640 -389056 -378313 -205350
10156 -205350 -55340 75529 71791 99945 6465 107801 156239 162229 120111 -122253 -240742
10145 -240742 -138974 -34077 123687 199412 88741 -102316 -149240 -139450 -56601 -90501 96481
10134 96481 98982 -25968 3959 220131 128341 -46155 -94953 -48072 89470 13267 28248
10123 28248 132013 85361 -53522 -52699 -23313 13994 28657 85769 128833 127236 12740 -12821
10111 -12821 18193 67107 153998 181925 119523 -7501 -32659 86540 93536 -915 74743
$$ packed form
10190E884J35348L8170p3150l0948j99528j58453k0573R0648M3491j2519M4301
10179a37329O7317M1223j46212o1810Q0855O8925L4599P9578K669o3057j33442
10168a66684l2405m3396j4684j5943o052J19312m7798P35L275j85416J0743J72963
10156b05350J50010J30869l738K8154r3480J01336M8438N990m2118k42364j18489
10145b40742J01768J04897J57764P5725j10671j91057m6924R790Q2849l3900J86982
10134I6481K501j24950K9927K16172r1790j74496m8798M6881J37542p6203J4981
10123B8248J03765m6652j38883Q23K9386L7307J4663N7112M3064j597j14496k5561
10111a2821L1014M8914Q6891K7927o2402j27024k5158J19199O996r4451P5658
$$ plain form
10100 74743 -3049 -58167 -32887 -51081 -90693 -18438 -13484 135704 278388 156912 37677
10089 37677 -75972 -119272 -69328 -33756 -9028 -109288 -71401 -117116 -189521 -156037 6210
10078 6210 20149 -33080 -95203 -52793 -12267 49398 82312 59431 -160836 -346145 -234684
10067 -234684 18314 62878 21926 55606 -25509 -22686 29394 77736 134000 150526 96413
10056 96413 40938 50656 115080 181233 110644 -45094 -46296 -105381 -58921 -96562 -77371 -31344
10044 -31344 15099 -87307 -179838 -176853 -58881 38615 25658 -31953 -150622 -170111 -18826
10033 -18826 100141 166343 195882 121653 61731 65022 -60967 -262456 -235496 -240958 -166967
10022 -166967 -155776 -100821 -80890 -93228 -46816 -58325 -51307 39902 11880 -59302 -63689 -142886
$$ packed form
10100G4743p7792n5118K5280j8194l9612P2255M954J49188J42684j21476j19235
10089C7677j13649m3300M9944L5572K4728j00260L7887m5715p2405L3484J62247
10078F210J3939n3229o2123M2410M0526O1665L2914k2881k20267j85309J11461
10067b34684K52998M4564m0952L3680q1115K823N2080M8342N6264J6526n4113
10056I6413n5475R718O4424O6153p0589j55738j202n9085M6460l7641J9191M6027
10044c1344M6443j02406r2531K985J17972R7496j2957n7611j18669j9489J51285
10033a8826J18967O6202K9539p4229n9922L291j25989k01489K6960n462P3991
10022a66967J1191N4955J9931j2338M6412j1509P018R1209k8022p1182m387p9197
$$ plain form
10010 -142886 -207355 -77423 101960 9478 8599 -111707 -14046 117122 119535 2392 61853
9999 61853 45065 -1566 97738 33837 -86699 -9731 50596 116791 102937 4120 -27176 50782
9987 50782 -13772 -67604 88262 73593 12335 51096 116954 2669 58456 191109 157636
9976 157636 152052 104953 -46314 -41340 73202 65994 125307 208371 223700 68650 -132992
9965 -132992 -261633 -286166 -123919 -20609 12223 -89346 -186724 -90058 -82179 -115994 -102052
9954 -102052 -92673 7803 -35318 25073 -41284 -99844 29816 112017 117377 98077 58220 -13820
9942 -13820 -226 12108 -17085 10060 -26104 -145789 -59800 95317 96656 101636 37047 117235
9930 117235 146236 166618 144565 65286 -29619 -51021 -34997 -9959 94939 219732 141068
$$ packed form
10010a42886o4469J29932J79383r2482q79j20306R7661J31168K413j17143N9461
9999F1853j6788m6631R9304o3901j20536P6968O0327O6195j3854r8817l1296P7958
9987E0782o4554n3832J55866j4669o1258L8761O5858j14285N5787J32653l3473
9976A57636n584m7099j51267M974J14542p208N9313Q3064J5329j55050k01642
9965a32992j28641k4533J62247J03310L2832j01569r7378R6666P879l3815J3942
9954a02052R379J00476m3121O0391o6357n8560J29660Q2201N360j9300l9857p2040
9942a3820J3594J2334k9193K7145l6164j19685Q5989J55117J339M980o4589Q0188
9930A17235K9001K0382k2053p9279r4905k1402J6024K5038J04898J24793p8664
$$ plain form
9919 141068 189755 155125 92502 34394 77264 45105 55677 82871 -156 -27544 -42140 -50443
9907 -50443 -23186 -7603 51030 135276 74885 -36292 -66897 76176 147117 121735 162400
9896 162400 117089 36084 99635 191329 180799 359314 473209 593075 560358 408014 315683
9885 315683 208909 69166 16177 -47885 -2761 -40789 -58025 -77766 -145462 -187160 -25481
9874 -25481 100559 23793 -71765 -75196 -173335 -287373 -254401 -114812 -127129 -108689 -48956
9863 -48956 32088 68257 209524 78460 -128959 -144056 10332 46392 -22198 66106 223287
9852 223287 254185 252206 245901 3941 -205273 -146500 -47237 -2715 -7850 -46286 -91740 -66541
9840 -66541 13574 1923 -84858 -185069 -194680 -174274 -157788 -47538 9058 55669 121779 133017
$$ packed form
9919A41068M8687l4630o2623n8108M2870l2159J0572K7194q3027k7388j4596q303
9907e0443K7257J5583N8633Q4246o0391j11177l0605J43073P0941k5382M0665
9896A62400m5311q1005O3551R1694j0530J78515J13895J19866l2717j52344r2331
9885C15683j06774j39743n2989o4062M5124l8028j7236j9741o7696m1698J61679
9874b5481J26040p6766r5558l431r8139j14038L2972J39589j2317J8440N9733
9863d8956Q1044L6169J41267j31064k07419j5097J54388L6060o8590Q8304J57181
9852B23287L0898j979o305k41960k09214N8773R9263M4522n135l8436m5454K5199
9840f6541Q0115j1651q6781j00211r611K0406J6486J10250N6596M6611O6110J1238
$$ plain form
9828 133017 244475 290360 314174 319799 246902 128790 132761 -52017 -201833 -231982 -152914
9817 -152914 2468 47836 49421 92588 224966 186670 128364 45416 142389 172831 188550
9806 188550 113299 79090 19716 -57189 -47348 20581 -50033 -93274 -67986 -63086 79325 133669
9794 133669 108484 -23410 -74602 -61060 -2644 -31483 136501 170459 203240 249594 267664
9783 267664 257075 102742 -47141 -37341 92662 234612 105278 49008 -31782 -78999 -58235
9772 -58235 -79301 -71641 -229288 -210950 -178201 -140063 -129047 -70540 -47141 -112797 -68734 48831
9760 48831 131154 117183 100503 161149 50560 -100970 -194974 -177065 -224854 -260026 -154465
9749 -154465 58939 193341 127052 161843 98003 60829 -31123 -127827 -161486 -135415 -2322
$$ packed form
9828A33017J11458M5885K3814N625p2897j18112L971j84778j49816l0149P9068
9817a52914J55382M5368J585M3167J32378l8296n8306q2948R6973L0442J5719
9806A88550p5251l4209n9374p6905R841O7929p0614m3241K5288M900J42411N4344
9794A33669k5185j31894n1192J3542N8416k8839J67984L3958L2781M6354J8070
9783B67664j0589j54333j49883R800J30003J41950j29334n6270q0790m7217K0764
9772e8235k1066P660j57647J8338L2749L8138J1016N8507K3399o5656M4063J17565
9760D8831Q2323j3971j6680O0646j10589j51530r4004J7909m7789l5172J05561
9749a54465K13404J34402o6289L4791o3840l7174r1952r6704l3659K6071J33093
$$ plain form
9738 -2322 109053 63716 -60840 -112759 -64650 -74851 -83003 -60561 11691 92611 85773 144714
9726 144714 232288 123922 -20445 -217981 -196881 -119135 -10582 28614 -22863 -83243 -124343
9715 -124343 -83989 -106242 -26490 -52833 -91755 -162619 -36193 78126 -3895 -47568 128649
9704 128649 317767 343967 293146 239880 105877 -72953 -83273 84880 129756 180376 68477
9693 68477 -73457 -162210 -148818 -37052 87875 -22554 -112421 -43237 122244 32508 -89271
9682 -89271 -94736 -170503 -48812 -31289 -102332 -149578 -144600 -121484 -42490 -3971 -60339 -119263
9670 -119263 -168308 -15848 -15672 -165578 -105090 -114874 -108400 -13533 36164 232463 178243 -27338
9658 -27338 -35089 26976 -22367 -105902 -74883 -6654 -75453 -69881 -41479 144 -51321 -96181
$$ packed form
9738b322J11375m5337j24556n1919M8109j0201q152K2442P2252Q0920o838N8941
9726A44714Q7574j08366j44367j97536K1100P7746J08553L9196n1477o0380m1100
9715a24343M0354k2253P9752k6343l8922p0864J26426J14319q2021m3673J76217
9704A28649J89118K6200n0821n3266j34003j78830j0320J68153M4876N0620j11899
9693F8477j41934q8753J3392J11766J24927j10429q9867O9184J65481q9736j21779
9682h9271n465p5767J21691J7523p1043m7246M978K3116P8994L8519n6368n8924
9670a19263m9045J52460J76j49906O0488r784O474R4867M9697J96299n4220k05581
9658b7338p751O2065m9343q3535L1019O8229o8799N572K8402M1623n1465m4860
$$ plain form
9646 -96181 -137907 -233686 -193330 -9358 -130343 -211736 -225460 -173349 -102344 2683 -66331
9635 -66331 -236003 -229289 -216817 -156383 -123115 -51441 -70084 -53359 -108051 -82696 -21415 78354
9623 78354 36234 -20479 -31610 -65259 -45338 4401 -88951 -123395 -82311 -78210 -46427 -755
9611 -755 126319 43382 36375 52815 98442 15343 -49644 -27611 -58408 -21202 -87304 -56938
9599 -56938 -170686 -247228 -259779 -240858 -127998 -74377 -93764 -56896 -40149 12178 -58928
9588 -58928 -128185 -101682 -64419 21063 61586 39412 -78755 -158462 -196400 -200614 -72862 71068
9576 71068 -100120 -84516 -135984 -139021 -116266 -105731 -4799 -9584 -73607 -63782 -50965 -65424
9564 -65424 145182 82451 32278 34282 9574 -45329 -81862 -29188 32616 79558 120741 53942
$$ packed form
9646i6181m1726r5779M0356J83972j20985q1393j3724N2111P1005J05027o9014
9635f6331j69672O714J2472O0434L3268P1674j8643J6725n4692K5355O1281R9769
9623G8354m2120n6713j1131l3649J9921M9739r3352l4444M1084M101L1783M5672
9611g55J27074q2937p007J6440M5627q3099o4987K2033l0797L7206o6102L0366
9599e6938j13748p6542j2551J8921J12860N3621j9387L6868J6747N2327p1106
9588e8928o9257K6503L7263Q5482M0523k2174j18167p9707l7938m214J27752J43930
9576G1068j71188J5604n1468l037K2755J0535J00932m785o4023R825J2817j4459
9564f5424K10606o2731n0173K004k4708n4903l6533N2674O1804M6942M1183o6799
$$ plain form
9552 53942 49461 32088 -47619 -35771 29814 105055 49235 97720 65585 110123 204159 99112
9540 99112 77348 90884 71179 1321 -69993 55211 70952 90796 -5120 116294 141064
9529 141064 27611 57863 38313 90881 131195 72316 168377 60762 -12688 56314 28130
9518 28130 76623 170579 169353 152537 166087 63038 18488 -40741 10673 100720 84827 -37669
9506 -37669 -79705 5549 -80280 -179048 -227199 -158347 -31528 14909 82847 82646 40353 -4106
9494 -4106 -157229 -245147 -94881 -121094 -101263 -113422 14808 -43721 5575 15314 -103947
9483 -103947 -89573 72689 130903 78514 -55764 -101846 3813 36066 -61470 -44485 -23153
9472 -23153 -169874 -195141 -80672 -62815 9202 -29265 -172391 -142752 -39211 -4550 1296
$$ packed form
9552E3942m481j7373p9707J1848O5585P5241n5820M8485l2135M4538R4036j05047
9540I9112k1764J3536j9705o9858p1314J25204J5741J9844r5916J21414K4770
9529A41064j13453L0252j9550N2568M0314n8879R6061j07615p3450O9002k8184
9518B8130M8493R3956j226j6816J3550j03049m4550n9229N1414R0047j5893j22496
9506c7669m2036Q5254q5829r8768m8151O8852J26819M6437O7938k01m2293m4459
9494d106j53123q7918J50266k6213J9831j2159J28230n8529M9296R739j19261
9483a03947J4374J62262N8214n2389j34278m6082J05659L2253r7536J6985K1332
9472b3153j46721k5267J14469J7857P2017l8467j43126K9639J03541L4661N846
$$ plain form
9461 1296 -51272 33316 163136 172851 59666 27665 36148 32464 6310 -17688 86761 92059
9449 92059 80493 55573 52073 126206 56537 -80802 -74051 -61583 -101898 -96489 107362 215257
9437 215257 252002 181559 152549 43829 -195129 -86185 36323 86227 96240 166690 303684
9426 303684 305137 245046 223677 163906 163982 40247 -39043 91442 14250 54847 106017 117570
9414 117570 17364 -216181 -261515 -253078 -225317 -181856 -124311 -98050 -117977 -87800 2887
9403 2887 125536 87019 -97699 -12685 -92411 -108561 44428 -41241 -101655 -5094 -38848
9392 -38848 14082 45929 19485 55006 -54893 -34340 -102562 -277439 -310102 -152889 -120277
9381 -120277 -194381 -53821 54120 17341 -76334 -77846 -166159 -179687 -169805 -177205 -158521 -112102
$$ packed form
9461A296n2568Q4588J29820R715j13185l2001Q483l684k6154k3998J04449N298
9449I2059j1566k4920l500P4133o9669j37339O751J2468m0315N409K03851J07895
9437B15257L6745p0443k9010j08720k38958J08944J22508M9904J0013P0450J36994
9426C03684J453o0091k1369n9771P6j23735p9290J30485p7192M0597N1170J1553
9414A17570j00206k33545m5334Q437K7761M3461N7545K6261j9927L0177R0687
9403B887J22649l8517j84718Q5014p9726j6150J52989q5669o0414R6561l3754
9392c8848N2930L1847k6444L5521j09899K0553o8222j74877l2663J57213L2612
9381a20277p4104J40560J07941l6779r3675j512q8313j3528R882p400J8684M6419
$$ plain form
9369 -112102 -95574 -68650 -44500 -117481 -185855 -285703 -282531 -265158 -115660 60890 2522
9358 2522 -66117 -36628 -3946 46199 -38497 -76244 78732 228399 147755 56924 -95225
9347 -95225 -163508 -113979 -18526 -86267 -77519 -174452 -287936 -204548 -100113 -64814 -164396 -57263
9335 -57263 -24887 -153506 -216632 -61523 8302 -81213 -91311 -19333 23618 14056 -126288
9324 -126288 -93997 26150 79708 118542 122181 101140 148277 107714 -84469 -134165 -154799
9313 -154799 -67647 18902 46262 56623 -34102 -44782 63555 174723 212433 192144 229087
9302 229087 52176 36086 172865 237565 187214 180979 140719 -1951 6147 165871 204915
9291 204915 186393 174021 205062 245292 246928 250623 364887 255154 101549 45223 22929
$$ packed form
9369a12102J6528K6924K4150p2981o8374r9848L172J7373J49498J76550n8368
9358B522o8639K9489L2682N0145q4696l7747J54976J49667q0644r0831j52149
9347i5225o8283M9529R5453o7741Q748r6933j13484Q3388J04435L5299r9582J07133
9335e7263L2376j28619o3126J55109O9825q9515j0098P1978M2951r562j40344
9324a26288L2291J20147N3558L8834L639k1041M7137m0563j92183m9696k0634
9313a54799Q7152Q6549K7360J0361r0725j0680J08337J11168L7710k0289L6943
9302B29087j76911j6090J36779O4700n0351o235m0260j42670Q098J59724L9044
9291B04915j8522j2372L1041M0230J636L695J14264j09733j53605n6326k2294
$$ plain form
9280 22929 19965 -24675 -89789 40459 81276 144321 274499 258319 72535 36055 33824 65407
9268 65407 145631 295450 396468 431376 391675 311834 275509 186162 271785 200411 181096
9257 181096 60850 -74234 -63173 1064 135042 35245 18576 140982 198219 132502 42666
9246 42666 -29604 70548 194370 159285 93286 65060 59924 -37327 -51517 62671 156321
9235 156321 203514 178366 273664 350222 505263 563025 619186 631896 651579 472732 442820
9224 442820 467306 536005 570566 618023 571429 540355 680516 647844 653923 669648 724501 712935
9212 712935 780811 763894 747020 749331 847015 961013 1067425 1105833 1252643 1475548 1733641
9201 1733641 1918371 2257776 2690099 3086706 3504957 4160695 5197530 6634165 8710123
$$ packed form
9280B2929k964m4640o5114J30248M0817O3045J30178j6180j85784l6480k231L1583
9268F5407Q0224J49819J01018L4908l9701p9841l6325q9347Q5623p1374j9315
9257A81096j20246j35084J1061O4237J33978r9797j6669J22406N7237o5717q9836
9246D2666p2270J00152J23822l5085o5999k8226n136r7251j4190J14188R3650
9235A56321M7193k5148R5298P6558J55041N7762N6161J2710J9683j78847k9912
9224D42820K4486O8699L4561M7457m6594l1074J40161l2672O079J5725N4853j1566
9212G12935O7876j6917j6874K311R7684J13998J06412L8408J46810K22905K58093
9201A733641J84730L39405M32323L96607M18251O55738J036835J436635K075958
$$ plain form
9192 8710123 11635944 15677635 21245664 28538920 37496130 48000943 58286913 61007217
9184 61007217 50399371 35100315 23457645 16281633 11813079 9003050 7097317 5659259
9176 5659259 4541255 3674290 3284804 2974623 2609749 2305593 1980584 1668082 1376575
9167 1376575 1195374 1161877 997859 856196 812278 823602 645559 558753 539468 618308 653497
9156 653497 614879 490615 443542 442073 470674 426345 435777 392567 449905 471519 576355 523794
9144 523794 507873 526702 600797 607227 592337 458151 378485 449129 441631 445131 544365 494157
9132 494157 337971 328843 295581 168824 84700 88532 79897 210048 158638 89278 169334 162545
9120 162545 -3985 81578 59234 -35770 -872 -65123 -103333 10656 -4218 -3214 -13901
$$ packed form
9192H710123K925821M041691N568029P293256Q957210J0504813J0285970K720304
9184F1007217j0607846j5299056j1642670p176012m468554k810029j905733j438058
9176E659259j118004q66965l89486l10181l64874l04156l25009l12502k91507
9167A376575j81201l3497j64018j41663m3918J1324j78043q6806j9285P8840L5189
9156F53497l8618j24264m7073j469K8601m4329R432m3210N7338K1614J04836n2561
9144E23794j5921J8829P4095O430j4890j34186p9666P0644p498L500R9234n0208
9132D94157j56186r128l3262j26757q4124L832q635J30151n1410o9360Q0056o789
9120A62545j66530Q5563k2344r5004L4898o4251l8210J13989j4874J004j0687
$$ plain form
9109 -13901 75026 35611 -51125 -88360 -29015 -117715 -356959 -222689 -58830 -70520 -15642
9098 -15642 168796 241244 271051 291652 249865 184237 172988 110866 189412 205987 265930 134253
9086 134253 22695 -47223 82842 139269 203853 371628 234998 349167 462652 383070
9076 383070 350952 356353 121340 88702 152387 -25124 -150593 -149635 -125029 -17353 37758
9065 37758 71380 6504 -89026 -34579 -53980 -5734 -35340 -62558 22210 -9397 -173703 -149351
9053 -149351 -171511 -235613 -218894 -282366 -226002 -82781 10484 -49 -151241 -115870 -79056
9042 -79056 109687 69519 117188 107347 92618 19159 96209 100753 106482 31293 -83358 -80869
9030 -80869 -181483 -193899 -201668 -137524 -108184 -179666 -152182 -42683 4210 -46582 -107438 -107359
$$ packed form
9109a3901Q8927l9415q6736l7235N9345q8700k39244J34270J63859j1690N4878
9098a5642J84438P2448K9807K0601m1787o5628j1249o2122P8546J6575N9943j31677
9086A34253j11558o9918J30065N6427O4584J67775j36630J14169J13485p9582
9076C83070l2118N401k35013l2638O3685j77511j25469R58K4606J07676N5111
9065C7758L3622o4876r5530N4447j9401M8246k9606k7218Q4768l1607j64306K4352
9053a49351k2160o4102J6719o3472N6364J43221R3265j0533j51192L5371L6814
9042g9056J88743m0168M7669r841j4729p3459P7050M544N729p5189j14651K489
9030h0869j00614j2416p769O4144K9340p1482K7484J09499M6893n0792o0856P9
$$ plain form
9018 -107359 -274967 -234029 -235012 -74555 104952 237675 214049 113659 174109 264273 392113
9007 392113 256559 28522 -17644 62076 99615 34237 30425 115968 187513 201740 307823
8996 307823 217282 180575 167040 73935 -124889 -167831 -56870 103717 159110 171529 143928
8985 143928 175680 234157 190104 95567 -1497 -16746 15917 -46382 -151198 -122151 138907
8974 138907 164243 94335 -12386 -157532 -224192 -115233 -35518 -46862 61732 100449 102321
8963 102321 98707 184026 136537 57356 68001 -5710 -43284 -126410 -143893 24041 86413 2532
8951 2532 36350 51984 74554 165205 229461 261799 170477 117810 164730 190918 267240 239480
8939 239480 316406 297784 180079 221757 190406 174532 34628 -13421 -43953 119032 153417
$$ packed form
9018a07359j67608M0938r83J60457J79507J32723k3626j00390O0450R0164J27840
9007C92113j35554k28037m6166P9720L7539o5378l812Q5543P1545J4227J06083
8996C07823r0541l6707j3535r3105j98824m2942J10961J60587N5393J2419k7601
8985A43928L1752N8477m4053r4537r7064j5249L2663o2299j04816K9047K61058
8974A38907K5336o9908j06721j45146o6660J08959P9715j1344J08594L8717J872
8963A02321l614Q5319m7489p9181J0645p3711l7574q3126j7483J67934O2372q3881
8951B532L3818J5634K2570R0651O4256L2338r1322n2667M6920K6188P6322k7760
8939B39480P6926j8622j17705M1678l1351j5874j39904m8049l0532J62985L4385
$$ plain form
8928 153417 45290 40219 -104435 -196344 -82887 841 21643 -12210 -42069 -5098 18563
8917 18563 -44192 -107067 -135211 -155711 -94881 22125 73443 149261 280999 220424 78450
8906 78450 163631 29841 -93801 28668 152260 94004 -2063 -84089 -132213 -130026 -218712
8895 -218712 -162568 36536 80091 29035 30194 125389 143362 84454 115616 62980 -59119
8884 -59119 -102466 -42862 13963 -99863 -91691 9793 104127 37746 -151718 -132643 -17915
8873 -17915 59368 113189 225449 211766 70134 -13331 47258 64422 38905 109057 67731
8862 67731 23590 7589 81555 202452 133974 133503 127073 118997 218143 191424 139364 46499
8850 46499 44321 235034 187082 188348 165904 68715 6654 34980 80810 40755 -46786 -30356
$$ packed form
8928A53417j08127n071j44654r1909J13457Q3728K0802l3853k9859L6971K3661
8917A8563o2755o2875k8144k0500O0830J17006N1318P5818J31738o0575j41974
8906G8450Q5181j33790j23642J22469J23592n8256r6067q2026m8124K187q8686
8895b18712N6144J99104M3555n1056J159R5195J7973n8908L1162n2636j22099
8884e9119m3347N9604N6825j13826Q172J01484R4334o6381j89464J9075J14728
8873a7915P7283N3821J12260j3683j41632q3465O0589J7164k5517P0152m1326
8862F7731m4141j6001P3966J20897o8478m71o430q076R9146k6719n2060r2865
8850D6499k178J90713m7952J266k2444r7189o2061K8326M5830m0055q7541J6430
$$ plain form
8838 -30356 22842 -2383 -122807 -118451 -78060 29918 152419 337345 396769 213091 232433
8827 232433 198135 181583 212886 140481 47868 50137 33340 98303 123465 72144 109964 148371
8815 148371 72825 76780 195012 289958 347023 219692 201774 266175 285587 173961 110162
8804 110162 267532 328869 267958 256829 207843 133968 112218 96721 158102 147795 50794
8793 50794 124962 81251 61607 14466 70395 76256 49615 -94095 -144291 -60904 -55111 7306
8781 7306 30044 -28457 38412 37873 37436 16388 95439 18972 -96233 -63630 137761 396395
8769 396395 274515 -6812 15427 87935 67398 123216 172154 128652 250661 282383 167246
8758 167246 100441 57666 22698 135286 80485 146070 239588 186644 234250 300850 327632
$$ packed form
8838c0356N3198k5225j20424M356M0391J07978J22501J84926N9424j83678J9342
8827B32433l4298j6552L1303p2405r2613K269j6797O4963K5162n1321L7820L8407
8815A48371p5546L955J18232R4946N7065j27331j7918O4401J9412j11626o3799
8804A10162J57370O1337o0911j1129m8986p3875k1750j5497O1381j0307r7001
8793E0794P4168m3711j9644m7141N5929N861k6641j43710n0196Q3387N793O2417
8781G306K2738n8501O6869n39m37k1048P9051p6467j15205L2603K01391K58634
8769C96395j21880k81327K2239P2508k0537N5818M8938m3502J22009L1722j15137
8758A67246o6805m2775l4968J12588n4801O5585R3518n2944M7606O6600K6782
$$ plain form
8747 327632 153547 124142 118616 146921 220557 163275 -11644 -34933 120396 311947 327767
8736 327767 187742 61048 171118 321764 444508 360509 224994 190075 255661 283991
8726 283991 353080 332235 353109 247522 229521 168458 45068 1643 -26608 -91111 -67958
8715 -67958 128067 267231 91407 -10203 173256 232045 241645 177820 117424 78407 68112
8704 68112 90775 170979 70615 124028 211111 220794 194258 180202 48671 -19092 92302
8693 92302 111014 89565 -33271 -124999 -122208 -56978 74106 40034 120286 226562 239458
8682 239458 164392 61961 35360 69644 92520 141514 246678 266097 253503 242097 186816
8671 186816 155116 66735 -53702 -39788 80962 72451 42302 44464 62026 68819 23240 -12944
$$ packed form
8747C27632j74085k9405n526K8305P3636n7282j74919k3289J55329J91551J5820
8736C27767j40025j26694J10070J50646J22744q3999j35515l4919O5586K8330
8726B83991O9089k0845K0874j05587j8001o1063j23390m3425k8251o4503K3153
8715f7958J96025J39164j75824j01610J83459N8789R600o3825o0396l9017j0295
8704F8112K2663Q0204j00364N3413Q7083R683k6536j4056j31531o7763J11394
8693I2302J8712k1449j22836r1728K791O5230J31084l4072Q0252J06276J2896
8682B39458p5066j02431k6601L4284K2876M8994J05164J9419j2594j1406n5281
8671A86816l1700q8381j20437J3914J20750q511l0149K162J7562O793m5579l6184
$$ plain form
8659 -12944 85178 204004 162077 238963 168736 93900 163099 122683 115515 47988 22103 86441
8647 86441 104180 48800 112243 135933 184818 217784 254293 277888 298174 283631 290225 294213
8635 294213 271741 255425 253283 178206 2990 40484 221118 196308 351134 494340 494072
8624 494072 435838 447309 400316 414321 403394 479636 481814 345818 316546 322924 303986 288105
8612 288105 304235 407599 557079 687858 787692 726127 607878 663599 723870 610725 563435
8601 563435 725959 992004 1054464 1059169 1035919 1024171 1099506 1276291 1500464 1609735 1630708
8590 1630708 1819675 2021270 2156950 2236390 2298270 2106196 2002772 2031795 1731721 1253107
8580 1253107 1074720 1046365 1113841 1060791 945637 833878 556094 448389 555761 490938
$$ packed form
8659a2944R8122J18826m1927P6886p0227p4836O9199m0416p168o7527k5885O4338
8647H6441J7739n5380O3443K3690M8885L2966L6509K3595K0286j4543O594L988
8635B94213k2472j6316k142p5077j75216L7494J80634k4810J54826J43206k68
8624D94072n8234J1471m6993J4005j0927P6242K178j35996k9272O378j8938j5881
8612B88105J6130J03364J49480J30779R9834o1565j18249N5721O0271j13145m7290
8601E63435J62524K66045O2460M705k3250j1748P5335J76785K24173J09271K0973
8590A630708J88967K01595J35680P9440O1880j92074j03424K9023l00074m78614
8580A253107j78387k8355O7476n3050j15154j11759k77784j07705J07372o4823
$$ plain form
8570 490938 502839 535044 505633 432242 391485 330813 256476 407905 529821 574783 385146
8559 385146 195773 187852 84298 85403 259581 300652 285712 279204 175477 70905 11551
8548 11551 -86428 -20304 10298 13886 11024 -1136 63702 18775 -4591 -22841 13049 -158796
8536 -158796 -364464 -197553 -35653 250 179141 167871 21353 -83195 29911 84917
8526 84917 69594 87076 202349 255832 274069 315563 302323 256346 151642 82283 58697
8515 58697 -90039 -17105 81344 53096 -19074 -13434 -19146 220564 386593 325535 229481 145057
8503 145057 31393 20213 50900 -179 -123628 -186800 -234527 -224852 -180003 -82778 -20415
8492 -20415 95508 13893 -14891 -90048 -172588 -136229 -179263 -211591 -148780 -166512 -122615 -58471
$$ packed form
8570D90938J1901L2205k9411p3391m0757o0672p4337J51429J21916M4962j89637
8559C85146j89373p921j03554J105J74178M1071j4940o508j03727j04572n9354
8548A1551r7979O6124L0602L588k862j2160O4838m4927k3366j8250L5890j71845
8536a58796k05668J66911J61900L5903J78891j1270j46518j04548J13106N5006
8526H4917j5323J7482J15273N3483J8237M1494j3240m5977j04704o9359k3586
8515E8697j48736P2934R8449k8248p2170N640n712K39710J66029o1058r6054q4424
8503A45057j13664j1180L0687n1079j23449o3172m7727R675M4849R7225O2363
8492b0415J15923q1615k8784p5157q2540L6359m3034l2328O2811j7732M3897O4144
$$ plain form
8480 -58471 -68717 -85581 -62404 -24170 -17022 8536 -42002 -36507 -66703 -148379 -100270 -86568
8468 -86568 -104654 28582 150195 163147 115461 -123596 -171647 -101484 -70569 -106180 -33434
8457 -33434 19548 -24498 17652 -29849 -34192 24067 84892 -30068 -147748 -139132 -119432 -227487
8445 -227487 -133484 -70337 -32517 -60440 -4137 -24687 100728 38111 25853 38361 32122 98423
8433 98423 201287 179346 117478 32671 90263 255741 242744 65128 -123242 -65304 -14871
8422 -14871 -121502 -14021 65173 92107 -12391 -237367 -312132 -189594 -18957 25719 151947
8411 151947 163676 148943 116272 173031 203066 230295 114237 169382 329953 379204 237712
8400 237712 279816 275618 360640 318607 295349 310538 336528 380048 423315 510654 806531 1315655
$$ packed form
8480e8471j0246j6864K3177L8234P148K5558n0538N495l0196q1676M8109J3702
8468h6568j8086J33236J21613J2952m7686k39057m8051P0163L0915l5611P2746
8457c3434N2982m4046M2150m7501m343N8259O0825j14960j17680Q616J9700j08055
8445b27487R4003O3147L7820k7923N6303k0550J25415o2617j2258J2508o239O6301
8433I8423J02864k1941o1868q4807N7592J65478j2997j77616j88370N7938N0433
8422a4871j06631J07481P9194K6934j04498k24976p4765J22538J70637M4676J26228
8411A51947J1729j4733l2671N6759L0035K7229j16058N5145J60571M9251j41492
8400B37712M2104m198Q5022m2033k3258J5189K5990M3520M3267Q7339K95877N09124
$$ plain form
8388 1315655 1748162 2315446 2773644 2786566 2472447 1970789 1379025 904970 649536 512942
8378 512942 348567 99420 -54842 146377 285346 178140 116992 128960 302370 328393
8368 328393 233573 372132 411172 259062 262810 190265 133786 166040 148547 310944 456720
8357 456720 595722 782576 1143025 1642423 2222170 2688487 2807136 2451146 1757657 1158767
8347 1158767 666420 340120 271485 307917 290061 170386 62267 141267 185614 221908 103278
8336 103278 121298 56784 34985 48469 35810 25257 -5924 70669 68414 15374 -39289 -156391
8324 -156391 -103613 -94871 13968 69929 100077 21399 -81779 -27791 -20658 -157475 -221475
8313 -221475 -249495 -176107 -111663 28283 39581 -13988 -55821 -70701 -52464 -26427 -115910
$$ packed form
8388A315655M32507N67284M58198J2922l14119n01658n91764m74055k55434j36594
8378E12942j64375k49147j54262K01219J38969j07206o1148J1968J73410K6023
8368C28393r4820J38559L9040j52110L748p2545n6479L2254j7493J62397J45776
8357D56720J39002J86854L60449M99398N79747M66317J18649l55990o93489n98890
8347A158767m92347l26300o8635L6432j7856j19675j08119P9000M4347L6294j18630
8336A03278J8020o4514k1799J3484j2659j0553l1181P6593k255n3040n4663j17102
8324a56391N2778Q742J08839N5961L0148p8678j03178N3988P133j36817o4000
8313b21475k8020P3388O4444J39946J1298n3569m1833j4880J8237K6037q9483
$$ plain form
8302 -115910 -154650 -147877 -99936 -45230 -33726 105861 216403 256339 282774 293673 226396
8291 226396 177889 160286 153029 139567 198092 114194 -14650 -60288 67813 112033 84032
8280 84032 17991 -149873 -227289 -116428 -33752 -121502 -197321 -154597 -65034 -51346 -18022
8269 -18022 -69459 -53736 65588 69682 -2307 29032 134456 48839 -63735 -129545 -37281
8258 -37281 66703 80590 59889 79078 98880 -16454 -5379 51921 -43400 2262 82071
8247 82071 19775 64585 137460 -55057 -148005 -41303 34826 82361 400 -34746 -47435
8236 -47435 -77518 -163162 -44065 19461 -191352 -229708 -87916 33428 97244 63492 -2639
8225 -2639 -28976 28373 10511 -51316 51255 128274 20026 32360 -66295 -108395 -221872
$$ packed form
8302a15910l8740O773M7941N4706J1504J39587J10542L9936K6435J0899o7277
8291B26396m8507j7603p257j3462N8525q3898j28844m5638J28101M4220k8001
8280H4032o6041j67864p7416J10861Q2676q7750p5819M2724Q9563J3688L3324
8269a8022n1437J5723J19324M094p1989L1339J05424q5617j12574o5810R2264
8258c7281J03984J3887k0701J9189J9802j15334J1075N7300r5321M5662P9809
8247H2071o2296M4810P2875j92517r2948J06702P6129M7535q1961l5146j2689
8236d7435l0083q5644J19097O3526k10813l8356J41792J21344O3816l3752o6131
8225b639k6337N7349j7862o1827J02571P7019j08248J2334r8655m2100j13477
$$ plain form
8214 -221872 -94449 -26093 -153737 -145502 -149797 -119211 24235 -551 39934 216295 190346
8203 190346 29607 111554 188933 41452 44955 5021 77604 52753 36500 213783 293241
8192 293241 201672 109725 138514 -42323 -185459 -254191 -216957 -84554 -1349 129809 166277
8181 166277 112991 -105533 -192314 -87536 48617 149458 337131 351773 363100 264165 217061
8170 217061 101631 139501 215880 150164 241185 184216 114199 162986 134298 142566 55784 29492
8158 29492 21998 5772 -32973 83257 49685 77377 167227 122749 10674 35789 79491 57874
8146 57874 191937 285119 249456 160482 33066 20123 81105 65226 -9866 44364 27953
8135 27953 21254 -106141 -124750 -11582 136602 90675 41756 -105874 -174597 -225908 -203947
$$ packed form
8214b21872J27423O8356j27644Q235m295L0586J43446k4786M0485J76361k5949
8203A90346j60739Q1947P7379j47481L503l9934P2583k4851j6253J77283P9458
8192B93241r1569r1947K8789j80837j43136o8732L7234J32403Q3205J31158L6468
8181A66277n3286k18524q6781J04778J36153J00841J87673J4642J1327r8935m7104
8170B17061j15430L7870P6379o5716R1021n6969p0017M8787k8688Q268q6782k6292
8158B9492p494j6226l8745J16230l3572K7692Q9850m4478j12075K5115M3702k1617
8146E7874J34063R3182l5663q8974j27416j2943O0982j5879p5092N4230j6411
8135B7953o699j27395j8609J13168J48184m5927m8919j47630o8723n1311K1961
$$ plain form
8124 -203947 -199475 -220665 -10527 131925 222033 146348 106200 218168 429740 317391 87041
8113 87041 35296 95163 205299 110114 19929 100675 156871 257364 300018 348630 252535
8102 252535 68904 -73104 -105985 -122163 -30875 144944 205247 148970 33079 -76274 -66834
8091 -66834 84366 189147 133248 50377 42411 -13039 11777 163543 215448 238286 289643
8080 289643 301508 229209 210236 232480 234528 110793 186468 320253 350578 268969 352164
8069 352164 390907 205233 162656 219983 507300 673306 799229 983201 1140074 1468597
8059 1468597 2108307 2934015 4163849 5781650 7780763 9993518 11003256 9236123 5892198
8050 5892198 3432129 2130347 1475327 1140465 803753 692308 672270 474823 375776 555115
$$ packed form
8124b03947M472k1190K10138J42452R0108p5685m0148J11968K11572j12349k30350
8113H7041n1745N9867J10136r5185r0185Q0746N6196J00493M2654M8612r6095
8102B52535j83631j42008l2881j6178R1288J75819O0303n6277j15891j09353R440
8091f6834J51200J04781n5899q2871p966n5450K4816J51766N1905K2838N1357
8080B89643J1865p2299j8973K2244K048j23735P5675J33785L0325q1609Q3195
8069C52164L8743j85674m2577N7327K87317J66006J25923J83972J56873L28523
8059A468597O39710Q25708J229834J617801J999113K212755J009738j767133l343925
8050E892198k460069j301782o55020l34862l36712j11445k0038j97447r9047J79339
$$ plain form
8040 555115 697428 697884 644185 595019 533017 426053 381989 476011 634851 757187 694473
8029 694473 676767 733524 771695 971333 1221011 1290581 1376692 1668354 1929665 2234792 2688996
8018 2688996 3403962 4313183 5748687 7932466 10907373 15430604 21394031 27445030 32531291
8009 32531291 36565167 35418325 26669061 16364952 9637424 6122870 4190871 3197872
8001 3197872 2516423 2035666 1846263 1837799 1799669 1943963 1949081 1806670 1545335 1129143
7991 1129143 859095 794604 768961 847014 751884 595718 644113 545205 421495 325602 359797
7980 359797 316975 170423 61222 171563 402726 364051 281877 379730 346509 376297 307782
7969 307782 236384 308639 232668 138110 199476 264122 377180 320497 140010 67711 105433
$$ packed form
8040E55115J42313M56n3699m9166o2002j06964m4064R4022J58840J22336o2714
8029F94473j7706N6757L8171J99638K49678O9570Q6111K91662K61311L05127M54204
8018B688996P14966R09221J435504K183779K974907M523231N963427O050999N086261
8009C2531291M033876j146842q749264j0304109o727528l514554j931999r92999
8001C197872o81449m80757j89403q464l8130J44294N118j42411k61335m16192
7991A129143k70048o4491k5643P8053r5130j56166M8395r8908j23710r5893L4195
7980C59797m2822j46552j09201J10341K31163l8675q2174R7853l3221K9788o8515
7969C07782p1398P2255p5971r4558O1366O4646J13058n6683j80487p2299L7722
$$ plain form
7958 105433 88165 171468 257683 325321 279501 379244 488319 502498 645335 651252 575038
7947 575038 372849 205529 203155 228488 175317 173135 195832 112670 68874 28081 152808
7936 152808 251195 137384 97539 203972 191453 46658 75520 59711 86271 62504 6980
7925 6980 -31234 111535 16653 -146940 -70711 -48238 -33936 90984 185950 135970 133174 172091
7913 172091 181937 236812 172930 194938 211528 155126 171223 268053 248588 122034 70267 94455
7901 94455 121473 145817 266697 277209 179554 -20274 -180382 -224139 -181930 -102214 -69966
7890 -69966 -70884 -729 193071 239503 210002 -464 -262515 -343744 -206535 -129402 -77660
7879 -77660 -43180 -128817 50398 147568 101600 79146 50144 -49987 31350 163924 264966
$$ packed form
7958A05433j7268Q3303Q6215O7638m5820R9743J09075J4179J42837N917p6214
7947E75038k02189j67320k374K5333n3171k182K2697q3162m3796m0793J24727
7936A52808R8387j13811l9845J06433j2519j44795K8862j5809K6560k3767n5524
7925F980l8214J42769r4882j63593P6229K2473J4302J24920R4966m9980k796L8917
7913A72091R846N4875o3882K2008J6590n6402J6097R6830j9465j26554n1767K4188
7901I4455K7018K4344J20880J0512r7655j99828j60108m3757M2209P9716L2248
7890f9966r18P0155J93800M6432k9501k10466k62051q1229J37209P7133N1742
7879g7660L4480q5637J79215R7170m5968k2454k9002j00131Q1337J32574J01042
$$ plain form
7868 264966 191045 83453 41408 40213 176377 78320 76864 65921 23264 34900 64197 33591
7856 33591 142285 159283 -1575 -25969 -7835 -32312 29329 -13623 -35136 123432 124612
7845 124612 -6111 130071 173045 77022 63736 17809 -19114 -65349 -98721 65100 186351
7834 186351 103259 19459 82960 143586 137794 42648 9048 32092 67409 76798 56386 31742
7822 31742 -13884 131887 244729 242286 241934 63462 -7567 -51803 -130832 -69683 -102512 19413
7810 19413 34074 109262 126035 178232 32315 32577 111951 39743 19332 142817 74936 -33546
7798 -33546 -236405 -261866 -173838 -126021 -10109 -3616 -18978 -41634 47946 112663 134432 218895
7786 218895 195957 215395 148676 76828 96491 73274 -33092 111493 365961 279057 208414
$$ packed form
7868B64966p3921j07592m2045j195J36164r8057j456j0943m2657J1636K9297l0606
7856C3591J08694J6998j60858k4394J8134k4477O1641m2952k1513J58568J180
7845A24612j30723J36182M2974r6023j3286m5927l6923m6235l3372J63821J21251
7834A86351q3092q3800O3501O0626n792r5146l3600K3044L5317R389k0412k4644
7822C1742m5626J45771J12842k443l52j78472p1029m4236p9029O1149l2829J21925
7810A9413J4661P5188J6773N2197j45917K62P9374p2208k0411J23485o7881j08482
7798c3546k02859k5461Q8028M7817J15912O493j5362k2656Q9580O4717K1769Q4463
7786B18895k2938J9438o6719p1848J9663k3217j06366J44585K54468q6904p0643
$$ plain form
7775 208414 240299 188766 208887 253714 215862 74636 35436 -92864 -147548 -151172 -183826
7764 -183826 -161505 -164485 -41315 8035 74108 49849 -805 -93894 -144762 -156790 -167729 -44345
7752 -44345 -52556 -69596 19480 123759 207931 126467 -2886 -73889 -202114 -112577 74117
7741 74117 51719 -66644 -211197 -178043 -11916 22335 86926 150788 21938 -42175 -10875
7730 -10875 35334 -8328 -4792 76541 287518 350193 298893 71501 -152791 -200858 -83663
7719 -83663 -45749 -59424 1732 -3010 -82031 -48935 -24845 -78016 -115516 -46172 37672 59081
7707 59081 41405 -34961 -60984 -202455 -93781 94019 263262 258355 46628 -143155 -284031
7696 -284031 -291623 -83358 100484 202049 111584 -5905 18998 22410 23346 89199 112328 119764
$$ packed form
7775B08414L1885n1533K0121M4827l7852j41226l9200j28300n4684l624l2654
7764a83826K2321k980J23170M9350O6073k4259n0654r3089n0868j2028j0939J23384
7752d4345q211j7040Q9076J04279Q4172q1464j29353p1003j28225Q9537J86694
7741G4117k2398j18363j44553L3154J66127L4251O4591O3862j28850o4113L1300
7730a0875M6209m3662L536Q1333K10977O2675n1300k27392k24292m8067J17195
7719h3663L7914j3675O1156m742p9021L3096K4090n3171l7500O9344Q3844K1409
7707E9081j7676p6366k6023j41471J08674J87800J69243m907k11727j89783j40876
7696b84031p592K08265J83842J01565r0465j17489K4903L412R36O5853K3129P436
$$ plain form
7684 119764 238505 215884 166735 145330 185243 352007 408937 309861 77500 61797 63079
7673 63079 63142 91156 126163 121962 18097 1289 -82376 -82731 -105525 89315 159543 -6829
7661 -6829 -45390 54715 9001 -80689 -65399 17773 48889 -20865 44698 -29125 -26 -28589
7649 -28589 -128400 -164606 -59497 -180731 -139172 -17755 -1460 -78586 -83027 -209341 -322227
7638 -322227 -235186 -111715 -56330 52349 -31186 -163465 -152717 -169615 8608 41072 -142947
7627 -142947 -8092 196997 116931 27984 173863 195061 41475 -188467 -110817 59866
7617 59866 88611 196950 211930 236762 255540 226857 103525 9774 -22282 -40543 -69064
7606 -69064 -43057 51567 101106 144533 93344 33626 48556 -10031 -58524 -50531 -14437 -41928
$$ packed form
7684A19764J18741k2621m9149k1405L9913J66764N6930r9076k32361j5703J282
7673F3079O3K8014L5007m201j03865j6808q3665l55k2794J94840P0228j66372
7661f829l8561J00105m5714q9690J5290Q3172L1116o9754O5563p3823K9099k8563
7649b8589r9811l6206J05109j21234M1559J21417J6295p7126m441j26314j12886
7638c22227Q7041J23471N5385J08679q3535j32279J0748j6898J78223L2464j84019
7627a42947J34855K05089q0066q8947J45879K1198j53586k29942P7650J70683
7617E9866K8745J08339J4980K4832J8778k8683j23332r3751l2056j8261k8521
7606f9064K6007R4624M9539M3427n1189n9718J4930n8587m8493P993L6094k7491
$$ plain form
7594 -41928 -93726 -176977 -124930 -67603 -110791 -58177 -42471 -65886 -113638 -133862 -27880 43270
7582 43270 43681 -47124 -74260 -26725 67413 138290 156120 90919 -70326 -148988 -50986 124003
7570 124003 46508 -58953 -104332 31996 74818 -27284 -142335 -50364 -1049 34409 93154
7559 93154 33533 -28830 -27928 -55148 -119724 -144703 -179886 -209382 -109764 -27951 63838 68628
7547 68628 42067 -7125 -39852 -10 55326 176483 232297 153030 64377 56994 17865 159770
7535 159770 235942 90006 29466 65941 126660 14561 11195 127082 25801 -86254 18722
7524 18722 175132 221198 219413 134035 36760 12379 83381 165303 323267 318644 48636 -19686
7512 -19686 -40316 -19367 45607 30080 -61884 -99200 -116120 -158603 -51684 -39910 -76861 -159892
$$ packed form
7594d1928n1798q3251N2047N7327m3188N2614J5706k3415m7752k0224J05982P1150
7582D3270M11r0805k7136M7535R4138P0877J7830o5201j61245p8662R8002J74989
7570A24003p7495j05461m5379J36328M2822j02102j15051R1971M9315L5458N8745
7559I3154n9621o2363R02k7220o4576k4979l5183k9496R9618Q1813R1789M790
7547F8628k6561m9192l2727L9842N5336J21157N5814p9267q8653p383l9129J41905
7535A59770P6172j45936o0540L6475O0719j12099l366J15887j01281j12055J04976
7524A8722J56410M6066j785q5378r7275k4381P1002Q1922J57964m623k70008o8322
7512a9686k0630K0949O4974j5527r1964l7316j6920m2483J06919J1774l6951q3031
$$ plain form
7500 -159892 -235047 -70176 80275 145576 74598 73628 145264 149433 17486 -34776 -113736 -254430
7488 -254430 -164400 -86356 63639 90824 121324 78120 97400 -29396 -99284 -93743 -3699
7477 -3699 57099 -4883 80055 147528 11627 -47313 45713 102351 55795 -28244 -88807 -104911
7465 -104911 -115844 -79882 5688 172354 209371 227500 260909 231624 245732 294854 216582
7454 216582 108281 71225 -42326 4907 6395 -48144 66921 98746 26317 -31217 -39757
7443 -39757 -133511 -139016 -164427 -63502 -8781 30990 14500 -5925 37780 136581 98487 23058
7431 23058 38063 -61441 -36692 67936 115044 121643 93466 104567 9004 -143453 -226028 -203728
7419 -203728 -27309 27149 924 121037 150016 132650 86743 98102 65217 84864 182711
$$ packed form
7500a59892p5155J64871J50451O5301p0978r70P1636M169j31947n2262p8960j40694
7488b54430R0030P8044J49995K7185L0500m3204J9280j26796o9888N541R0044
7477c699O0798o1982Q4938O7473j35901n8940R3026N6638m6556q4039o0563j6104
7465a04911j0933L5962Q5570J66666L7017J8129L3409k9285J4108M9122p8272
7454B16582j08301l7056j13551M7233J488n4539J15065L1825p2429n7534q540
7443c9757r3754n505k5411J00925N4721L9771j6490k0425M3705R8801l8094p5429
7431B3058J5005r9504K4749J04628M7108O599k8177J1101r5563j52457q2575K2300
7419b03728J76419N4458k6225J20113K8979j7366m5907J1359l2885J9647R7847
$$ plain form
7408 182711 138842 81398 185176 263828 279640 65104 34501 53191 45752 130392 149271
7397 149271 -21035 -33096 -12444 -93191 -128993 -119299 65093 154685 7030 -162842 -153880
7386 -153880 -248961 -201582 -60953 109337 93962 132410 149312 171712 245538 222157 234705
7375 234705 271874 162642 170274 -40929 -33825 -80480 -102086 36796 94105 50561 -30336
7364 -30336 -65173 -63675 -37260 10074 88048 18969 -77611 -126349 -153640 -174325 -50513 -43847
7352 -43847 31315 33688 -104845 42039 92058 2143 -53089 90854 142416 107454 50143
$$ packed form
7408A82711m3869n7444J03778P8652J5812k14536l0603J8690p439Q4640J8879
7397A49271j70306j2061K0652q0747l5802R694J84392Q9592j47655j69872Q962
7386a53880r5081M7379J40629J70290j5375L8448J6902K2400P3826k3381J2548
7375B34705L7169j09232P632k11203P104m6655k1606J38882N7309m3544q0897
7364c0336l4837J498K6415M7334P7974o9079r6580m8738k7291k0685J23812O666
7352d3847P5162K373j38533J46884N0019q9915n5232J43943N1562l4962n7311
$$ [...]
##END NTUPLES=NMR SPECTRUM
##END=
