##TITLE=Analysis number 327800
Compound Code cc 62809
Book Reference 518/97
Project Code adrs
Chemist Name colinb
##JCAMPDX= 6.0         $$ Bruker NMR JCAMP-DX V2.0
##DATA TYPE= NMR SPECTRUM
##DATA CLASS= NTUPLES
##ORIGIN= Bruker BioSpin GmbH
##OWNER= nmr
$$ XWIN-NMR		Version 3.5
$$ Tue Apr 10 12:46:36 2007 GMT Daylight Time (UT+1h)  MAYBRIDGE\nmr@NMR_250MHZ
##.OBSERVE FREQUENCY= 250.131544655141
##.OBSERVE NUCLEUS= ^1H
##.ACQUISITION MODE= SIMULTANEOUS (DQD)
##.ACQUISITION SCHEME= undefined
##.AVERAGES= 16
##.DIGITISER RES= 18
##SPECTROMETER/DATA SYSTEM= dpx250
##.PULSE SEQUENCE= zg30
##.SOLVENT NAME= CDCl3
##.SHIFT REFERENCE= (INTERNAL, CDCl3, 0, 16.522)
##AUDIT TRAIL= $$ (NUMBER, WHEN, WHO, WHERE, WHAT)
$$ ##TITLE= Audit trail, XWIN-NMR		Version 3.5
$$ ##JCAMPDX= 5.01
$$ ##ORIGIN= Bruker BioSpin GmbH
$$ ##OWNER= nmr
$$ C:\u/data/dgb/nmr/ADRS/830/pdata/1/auditp.txt
$$ ##AUDIT TRAIL=  $$ (NUMBER, WHEN, WHO, WHERE, WHAT)
(   1,<2007-04-10 12:46:14.93 +100>,<MAYBRIDGE\nmr>,<NMR_250MHZ>,
      <created by zg, POWCHK disabled, PULCHK disabled
       configuration hash MD5:
       49 4B E0 1D 92 C2 6B 37 9F E6 65 BC 52 41 86 1D
       data hash MD5: 64K
       E6 57 48 9D 61 09 DB 77 8F 4B A4 BD 1F D5 9B 76>)
(   2,<2007-04-10 12:46:27.13 +100>,<MAYBRIDGE\nmr>,<NMR_250MHZ>,
      <Start of raw data processing
       ef LB = 0.3 FT_mod = 6 PKNL = 1 SI = 32K 
       data hash MD5: 32K
       CF 36 1C FB E0 7E 84 6B BD 8B E4 7F 91 18 DD 98>)
(   3,<2007-04-10 12:46:28.92 +100>,<MAYBRIDGE\nmr>,<NMR_250MHZ>,
      <apk 
       data hash MD5: 32K
       A2 0D 7F 27 CB C6 80 4F C4 35 12 A9 BB 6C E4 D9>)
(   4,<2007-04-10 12:46:29.71 +100>,<MAYBRIDGE\nmr>,<NMR_250MHZ>,
      <abs ABSG = 5 
       data hash MD5: 32K
       D0 96 C3 A7 77 2D 3D C2 DE CA 8B 2C 92 9C E9 1C>)
$$ ##END=
$$ 
$$ hash MD5
$$ 79 D9 5D 8F 48 E5 B0 FA 26 6E FF 68 99 C8 A3 F2
##$RELAX= 
##$RELAX= 
##$RELAX= 
##$RELAX= 
##$RELAX= 
##$RELAX= 
##$RELAX= 
$$ Bruker specific parameters
$$ --------------------------
##$DU= <C:\u>
##$EXPNO= 830
##$NAME= <ADRS>
##$PROCNO= 1
##$TYPE= <nmr>
##$USER= <dgb>
##$AMP= (0..31)
100 100 100 100 100 100 100 100 100 100 100 100 100 100 100 100 100 100 
100 100 100 100 100 100 100 100 100 100 100 100 100 100 
##$AQSEQ= 0
##$AQ_mod= 3
##$AUNM= <au_zg>
##$AUTOPOS= <28 >
##$BF1= 250.13
##$BF2= 250.13
##$BF3= 250.13
##$BF4= 250.13
##$BF5= 500.13
##$BF6= 500.13
##$BF7= 500.13
##$BF8= 500.13
##$BYTORDA= 1
##$CFDGTYP= 0
##$CFRGTYP= 5
##$CHEMSTR= <none>
##$CNST= (0..31)
1 1 145 1 1 1 1 1 1 1 1 1 1 1 1 1 1 1 1 1 1 1 1 1 1 1 1 1 1 1 1 1 
##$CPDPRG= <>
##$CPDPRG1= <>
##$CPDPRG2= <>
##$CPDPRG3= <>
##$CPDPRG4= <mlev>
##$CPDPRG5= <mlev>
##$CPDPRG6= <mlev>
##$CPDPRG7= <mlev>
##$CPDPRG8= <mlev>
##$CPDPRGB= <>
##$CPDPRGT= <>
##$D= (0..31)
0 1 0 0 0 0 0 0 0 0.06 0 0 0 0 0 0 0.0002 0 0 0 0 0 0 0 0 0 0 0 0 0 0 
0 
##$DATE= 1176205573
##$DBL= (0..7)
120 120 120 120 120 120 120 120 
##$DBP= (0..7)
150 150 150 150 150 150 150 150 
##$DBP07= 0
##$DBPNAM0= <>
##$DBPNAM1= <>
$$ [...]
##$SUBNAM6= <"">
##$SUBNAM7= <"">
##$SUBNAM8= <"">
##$SUBNAM9= <"">
##$SW= 20.6930455092707
##$SWIBOX= (0..15)
0 0 3 0 0 0 0 0 0 0 0 0 0 0 0 0 
##$SW_h= 5175.983436853
##$TD= 65536
##$TD0= 1
##$TE= 683.16
##$TE2= 300
##$TE3= 300
##$TEG= 300
##$TL= (0..7)
0 120 120 120 120 120 120 120 
##$TP= (0..7)
150 150 150 150 150 150 150 150 
##$TP07= 0
##$TPNAME0= <>
##$TPNAME1= <>
##$TPNAME2= <>
##$TPNAME3= <>
##$TPNAME4= <>
##$TPNAME5= <>
##$TPNAME6= <>
##$TPNAME7= <>
##$TPOAL= (0..7)
0.5 0.5 0.5 0.5 0.5 0.5 0.5 0.5 
##$TPOFFS= (0..7)
0 0 0 0 0 0 0 0 
##$TUNHIN= 0
##$TUNHOUT= 0
##$TUNXOUT= 0
##$USERA1= <user>
##$USERA2= <user>
##$USERA3= <user>
##$USERA4= <user>
##$USERA5= <user>
##$V9= 5
##$VALIST= <valist>
##$VCLIST= <CCCCCCCCCCCCCCC>
##$VD= 0
##$VDLIST= <DDDDDDDDDDDDDDD>
##$VPLIST= <PPPPPPPPPPPPPPP>
##$VTLIST= <TTTTTTTTTTTTTTT>
##$WBST= 1024
##$WBSW= 4
##$XGAIN= (0..3)
0 0 0 0 
##$XL= 0
##$YL= 0
##$YMAX_a= 404389
##$YMIN_a= -474169
##$ZGOPTNS= <>
##$ZL1= 120
##$ZL2= 120
##$ZL3= 120
##$ZL4= 120
##$ABSF1= 16.522
##$ABSF2= -4.171173
##$ABSG= 5
##$ABSL= 3
##$ALPHA= 0
##$AQORDER= 0
##$ASSFAC= 0
##$ASSFACI= 0
##$ASSFACX= 0
##$ASSWID= 0
##$AUNMP= <proc_1d>
##$AZFE= 0.1
##$AZFW= 0.1
##$BCFW= 0
##$BC_mod= 0
##$BYTORDP= 0
##$COROFFS= 0
##$CY= 12.5
##$DATMOD= 1
##$DC= 0
##$DFILT= <>
##$DTYPP= 0
##$F1P= 14.0000005364418
##$F2P= -0.99999901652339
##$FCOR= 0.5
##$FTSIZE= 32768
##$FT_mod= 6
##$GAMMA= 0
##$GB= 0
##$INTBC= 1
##$INTSCL= 1
##$ISEN= 128
##$LB= 0.3
##$LEV0= 0
##$LPBIN= 0
##$MAXI= 10000
##$MC2= 0
##$MEAN= 0
##$ME_mod= 0
##$MI= 0
##$NCOEF= 0
##$NC_proc= -4
##$NLEV= 6
##$NOISF1= 0
##$NOISF2= 0
##$NSP= 0
##$NTH_PI= 0
##$NZP= 0
##$OFFSET= 16.522
##$PC= 1
##$PHC0= 230.06
##$PHC1= 6.460034
##$PH_mod= 1
##$PKNL= yes
##$PPARMOD= 0
##$PSCAL= 4
##$PSIGN= 0
##$REVERSE= no
##$SF= 250.13
##$SI= 32768
##$SIGF1= 0
##$SIGF2= 0
##$SINO= 400
##$SIOLD= 32768
##$SREGLST= <1H.CDCl3>
##$SSB= 0
##$STSI= 32768
##$STSR= 0
##$SW_p= 5175.98343685301
##$SYMM= 0
##$S_DEV= 0
##$TDeff= 65536
##$TDoff= 0
##$TI= <Analysis number 999999
Compound Code 99
Book Reference 9
Project Code 9>
##$TILT= no
##$TM1= 0
##$TM2= 0
##$TOPLEV= 0
##$USERP1= <user>
##$USERP2= <user>
##$USERP3= <user>
##$USERP4= <user>
##$USERP5= <user>
##$WDW= 1
##$XDIM= 32768
##$YMAX_p= 319284691
##$YMIN_p= -417164
$$ End of Bruker specific parameters
$$ ---------------------------------
##NTUPLES= NMR SPECTRUM
##VAR_NAME=  FREQUENCY,     SPECTRUM/REAL,   SPECTRUM/IMAG
##SYMBOL=    X,             R,               I
##VAR_TYPE=  INDEPENDENT,   DEPENDENT,       DEPENDENT
##VAR_FORM=  AFFN,          ASDF,            ASDF
##VAR_DIM=   32768,         32768,           32768
##UNITS=     HZ,            ARBITRARY UNITS, ARBITRARY UNITS
##FACTOR=    0.157963299565203, 1,           1
##FIRST=     4132.6476996994, 0,             0
##LAST=      -1043.33573715361, 0,           0
##MIN=       -1043.33573715361, -417164,     0
##MAX=       4132.6476996994, 319284691,     0
$$ Real data points
##PAGE= N=1
##DATA TABLE= (X++(R..R)), XYDATA
$$ [...]
18376A5796L1805m5324j4669J5073P691N755L92J5278j2319r094P988j181J1352
18363B8543l382J1962q126L0176l704k9067k5784p053K7433q345j9676k805k4923
18350c4751K910L1336M376K7457Q375K2470n775k5118J8340M125k6957q021q218
18337A0549j2207k7332J8978J4373j9017k5794L6558Q243p527L1314M756l1125
18325A769j9864j9349J5692L5366k1205l2816K3451O6035k344l2862Q498o3O216
18312B8524j4365j8619k3484o95K6289J3391k5412l3452M1369K4427L1832n823
18300D3982n284K184m3623j7611n375p66K033m559J3421J4897j538K6036J8871
18287D2668o751N114j5400q345k2049l313K3154R614k906J4316j3968r231n908
$$ plain form
18376 15796 47601 2277 -12392 2681 10372 16127 16519 31797 19478 10384 18372 17191 28543
18363 28543 25161 37123 28997 59173 55469 26402 618 -6435 20998 12653 -7023 -9828 -34751
18350 -34751 -31841 -505 3871 31328 39703 62173 56398 31280 49620 53745 26788 18767 10549
18337 10549 -1658 -28990 -10012 4361 -14656 -40450 -3892 4351 -3176 28138 32894 1769
18325 1769 -18095 -37444 -21752 13614 -7591 -40407 -16956 49079 46735 13873 22371 22308 28524
18312 28524 14159 -4460 -27944 -28639 -2350 11041 -14371 -47823 -6454 17973 49805 43982
18300 43982 38698 40882 -2741 -20352 -25727 -26493 -24460 -29019 -15598 -701 -2239 23797 42668
18287 42668 35917 41031 25631 17286 -4763 -8076 15078 24692 21786 36102 22134 12903 6995
18274F995j2274K3415L077j1005l4570J3260J7552J042o744k5846L40J7810L0071
18261B3123j2773J1560J2251j348J5421K6J832Q629l1991k8380l866j2664K3289
18248E109o9k696M328m487q484L5391L3072J1407o115J8220M625j510M4073L6001
18234A68865n595q0476p1287n383o152K863N515m2755J906L6602L5979j5780j1665
18221A2637l1011j8066K2316L863m0436J584J4032J7368O02L339J1375j7567k3674
18208d3638M7136M4163K2399R348J0410j8600j0461k400j7682j3431P358L507
18196C8109J9726q49j0752j4992k9217J3567m701r52J0908J3616k3248l1562Q484
18183a1863J3082J2832q399J0438N5255L3732n6880n7771j3770J5641L3802O3358
$$ plain form
18274 6995 -5279 18136 21213 10208 -24362 -11102 6450 7492 748 -25098 -24758 -6948 23123
18261 23123 10350 21910 34161 32813 48234 48260 50092 58721 26730 -1650 -5516 -18180 5109
18248 5109 5040 2344 6672 2185 -6299 29092 62164 73571 67456 85676 90301 88791 132864 168865
18234 168865 163270 82794 11507 6124 -28 2835 8350 -34405 -32499 4103 40082 24302 12637
18221 12637 -18374 -36440 -14124 -10261 -50697 -49113 -35081 -17713 -17111 -13772 -2397 -19964 -43638
18208 -43638 3498 47661 70060 79408 89818 71218 60757 58357 40675 27244 34602 38109
18196 38109 57835 56986 46234 31242 2025 15592 10891 9939 20847 34463 11215 -20347 -11863
18183 -11863 1219 14051 5652 16090 71345 105077 48197 -9574 -23344 -7703 26099 89457
18171H9457L6059P989j7751K741l0212l9181J92P974M1994M8252O279n877l0086
18158A17830l6502l5266j0208O1943K4571l03J694j2953l973J06M6204j513L2002
18145A83632k7632k6097L81n552K3691M3652N3988l175q829N067K2481J8041O3760
18132C43408J0362L6328O565L3584O3633O6353Q7341J11054J33516R4042Q1181
18121A067367J24804K04905K13839L12369M55066O54265R36023J376506K256282
18112G601426L973279P321241J4203086K6564067L0650205j044513k7198768k5796364
18104C6273659j5118471p761106m196659k538389j651662j124729p50333n30733
18096B601577m27496l68743l20319k48319j70693r3335r9698r3492p2543m2169
$$ plain form
18171 89457 125516 133505 115754 118495 88283 49102 49294 57268 99262 147514 153793 147916 117830
18158 117830 81328 46062 35854 97797 122368 122065 123759 110806 106833 106939 153143 151630 183632
18145 183632 156000 129903 130284 124732 148423 192075 246063 242888 234059 239126 261607 279648 343408
18132 343408 353770 390098 396663 430247 493880 560233 647574 758628 892144 986186 1067367
18121 1067367 1192171 1397076 1610915 1923284 2378350 3032615 3968638 5345144 7601426
18112 7601426 11574705 18895946 33099032 59663099 90313304 89268791 62070023 36273659
18104 36273659 21155188 13394082 9197423 6659034 5007372 3882643 3132310 2601577
18096 2601577 2174081 1805338 1485019 1236700 1066007 972672 872974 779482 706939 664770
18086F64770p0998p5422r8265m0029j5393k3267j8396j6651K7734L6071m0860
18075C29294m3019k3006m0585l1522j3300j584k4472k1725M4328j3122l0101J5570
18063A46756K1416o504j2685J9237k4465m50J284n795j2280l4870l7036n317L0991
18050H0282j6257r576m975J387M3829L8818j5893o7052k1668k6645J3919j1016
18038E153k7481R270J5871J0970K3949j8955p204L035j561J6882P985k6258K3797
18025C5453J3392l2889r053J2652M5245P110k8941J8511K074k923j3556J3501
18013F0576N897L1473K6619n745l3338O642j3352l0304n0119n853L3406r411J3353
18000B9844l3572J56J7138L5504J3601K5073J6248k9939m4285j951J2752o1598
$$ plain form
18086 664770 593772 518350 420085 380056 364663 341396 323000 306349 334083 370154 329294
18075 329294 286275 263269 222684 191162 177862 176278 151806 130081 174409 161287 131186 146756
18063 146756 168172 161668 148983 168220 143755 143305 144589 138794 126514 91644 54608 49291 80282
18050 80282 64025 54449 49474 50861 94690 133508 117615 50563 28895 2250 16169 5153
18038 5153 -22328 -13058 2813 13783 37732 18777 11573 14608 13047 29929 37914 11656 35453
18025 35453 48845 15956 6903 19555 64800 71910 42969 61480 63554 60631 47075 60576
18013 60576 66473 97946 124565 118820 85482 92124 78772 48468 -1651 -7504 25902 16491 29844
18000 29844 -3728 -3572 13566 49070 62671 87744 103992 74053 29768 27817 40569 -21029
17988b1029l4657M9452L6362P648n073j1772M8881K1653m7551J3229O665J1563
17976G5371j1759n2758l2102j4955k355j6290J4784N505K9184J3426j9753j5952
17964b7654r597N343K1456J2907j5902n524J5614k4041J7496L2862q638m2450
17952b8128r6671k2554O0249M1021l754J0086M3824P246l6418k6847R357K3949
17940a8640K2420l5960N546P573j1285M523j6314J6590J0364K4691K1115M287
17928C4910r039m468m0599J6356j841J3078j1809l570O851o555j5967l1982k557
17915e7192J666L75M5325M4623J8284J4174p687k3591k9769N40k3832l8869p157
17902f3110k875J4584K1885j6410j5900K8248K0392L0249R244m726K6523K2577
$$ plain form
17988 -21029 -55686 -6234 30128 37776 32703 20931 69812 91465 43914 57143 63808 75371
17976 75371 63612 10854 -21248 -36203 -38558 -54848 -40064 -34559 -5375 8051 -11702 -27654
17964 -27654 -37251 -31908 -10452 2455 -13447 -18971 -3357 -27398 -9902 22960 14322 -28128
17952 -28128 -124799 -147353 -87104 -46083 -49837 -39751 4073 11319 -25099 -51946 -42589 -18640
17940 -18640 3780 -32180 -26634 -19061 -30346 -25823 -42137 -25547 -15183 9508 30623 34910
17928 34910 25871 21403 -19196 -2840 -4681 8397 -3412 -6982 -131 -6686 -22653 -54635 -57192
17915 -57192 -55526 -55151 -9826 34797 53081 67255 59568 35977 6208 6748 -17084 -55953 -63110
17902 -63110 -65985 -51401 -29516 -45926 -61826 -33578 -13186 17063 26307 21581 48104 70681
17890G0681k3913n6836m1789J8354N1202P718K442l4971l8259n9881l2813L0332
17878a07733L917L9276N255J7351J2582j2948J3684K7345k030l1794K5762J0512
17866A179N871l7703m8801L8081J0654O78k8279N370K5782K06K0721J5128j8384
17853i497K0620M5315k2465m4428j5367r29J0773j5805K733L2806J4772k9114
17841a0586N049k011J8299q238j6425l618K7687O605p39m9396j5029J5535m596
17828c7463J9639K8764j7813M086p38k951k6311k4490j687M3496l95K4066J0296
17815A8499j1855m4278M313M1346P317J1247j3921J2671k7454l4376k7003j7666
17803h1160K7287K2428K5439J8903j8064m0852R637q739l4920k4141M0931M3641
$$ plain form
17890 70681 46768 -10068 -51857 -33503 17699 25417 27859 -7112 -45371 -105252 -138065 -107733
17878 -107733 -103816 -64540 -59285 -41934 -29352 -42300 -28616 -1271 -3301 -35095 -9333 1179
17866 1179 7050 -30653 -79454 -41373 -30719 -30041 -58320 -52950 -27168 -26962 -6241 8887 -9497
17853 -9497 11123 56438 33973 -10455 -25822 -26751 -15978 -31783 -29050 3756 18528 -10586
17841 -10586 -5537 -7548 10751 2513 -13912 -17530 10157 16762 16023 -33373 -48402 -32867 -37463
17828 -37463 -17824 10940 -6873 -2787 -3525 -6476 -32787 -57277 -58964 -15468 -15863 8203 18499
17815 18499 6644 -37634 -33321 8025 15342 26589 12668 25339 -2115 -36491 -63494 -81160
17803 -81160 -53873 -31445 -6006 12897 -5167 -46019 -36382 -45121 -80041 -104182 -63251 -19610
17791a9610K0820j1098K5101J3294K295k4771k0158j0663R040J7431K2309J2031
17779C6021j3684J0116j3808l4677j3683J9262k707l5968j2501K9060l417M4237
17767H251J1126l6654l3656L998r282n411r84k5301J0423M6278J8468j3870J3091
17754a3523M586m754j7910L916M155O090k8826l1276Q422K9943O238L4004K2670
17741B3735k6559l4181L2843K8504K1789o9l9353L9666j7156l3507J297k0003
17729b2994J1251K5132k2378k4482j73j1760M601L018P614J2440q949P398k950
17716b2232n632L6646M9413j2610n049L3560O109m8473l6781j8942j7691M0081
17704a601j3585m978K5754j7127j813K1319m2527k0106J4912r330j525l4418l4614
$$ plain form
17791 -19610 1210 -9888 15213 28507 30802 6031 -14127 -24790 -15750 1681 23990 36021
17779 36021 22337 32453 18645 -16032 -29715 -10453 -13160 -49128 -61629 -32569 -35986 8251
17767 8251 19377 -17277 -50933 -46935 -56217 -61628 -62612 -87913 -77490 -31212 -12744 -26614 -13523
17754 -13523 -8937 -13691 -31601 -27685 -23530 -17440 -46266 -77542 -69120 -39177 -32939 1065 23735
17741 23735 -2824 -37005 -4162 24342 46131 46062 6709 46375 29219 -4288 -2991 -22994
17729 -22994 -11743 13389 -8989 -33471 -33644 -45404 -40803 -37785 -30171 -17731 -26680 -19282 -22232
17716 -22232 -27864 8782 58195 45585 40536 74096 80205 31732 -5049 -23991 -41682 -1601
17704 -1601 -15186 -20164 5590 -11537 -13350 7969 -34558 -54664 -39752 -49082 -50607 -85025 -119639
17691a19639M9796L2820O156P401j5860r339k6448r910K8166k907O2100K2650
17679B4986m8628m3666l3750j6400N4186J5507k1372L4101M2614K3521j4240k8899
17667a2040L4682K7378j0837j2870l1378p502J1924k7232l209q534K6252j2333
17655b5699L1983k0430j2520k2659K8930K6924j933p118j2279j9271K5493L1949
17643B3370K2124p243j9360k9708l476o063n8502n802L5353J5804J4641J509J4800
17630b553J6933J250L3197k151j2837k2389j657R367p351m909O634L809J2300
17617B9643J9479M637j615m2203l825P772l9247L4371Q920k5749k6040L2106O498
17604D747k4618l697L0765k4072j2299M9484k417N45k8492k3555k3175J2244K2446
$$ plain form
17691 -119639 -69843 -37023 -30867 -23466 -39326 -48665 -75113 -85023 -56857 -59764 2336 24986
17679 24986 -23642 -67308 -101058 -117458 -63272 -47765 -69137 -35036 7578 31099 16859 -12040
17667 -12040 22642 50020 39183 26313 -5065 -12567 -643 -27875 -31084 -39618 -13366 -25699
17655 -25699 6284 -14146 -26666 -49325 -20395 6529 4596 -2522 -14801 -34072 -8579 23370
17643 23370 45494 38251 18891 -10817 -14293 -20356 -78858 -84660 -49307 -33503 -18862 -17353 -2553
17630 -2553 14380 15630 48827 46676 33839 11450 9793 19160 11809 6900 13534 17343 29643
17617 29643 49122 53759 52144 9941 6116 13888 -25359 9012 17932 -7817 -33857 -1751 4747
17604 4747 -19871 -23568 7197 -16875 -29174 20310 17893 18438 -10054 -33609 -56784 -44540 -22094
17591b2094O672J8n3256j2922O735K8289L0142M0383k3755k3437m63j7254n295
17578d6237J737p458J890j756J4054K4184L8425Q014j125J4577n935k1126k5681
17565f437j0778l861l199K5315l166m3372J7910J6813j4335j6338L7977L2520
17553B9049L827P882k6031r46J226j5763j1143r939J4182N6743J913R717k5766
17540C4951m827l7432l225J2017J3340m5269j0875K0229J2374j6996K4325J9709
17528A8321l3221L9508M0992k6706k2165m3420J7556N535j4721J8766L0745o1290
17516c0100k0815J9910r650O474J880O1175P400n668O706L300J2936j8360j7678
17503A7510k1411n565J7104M3315k0602j5779J9150O109j9882j0518j3125k5404
$$ plain form
17591 -22094 -15422 -15404 -68660 -81582 -74847 -46558 -16416 23967 212 -23225 -23688 -40942 -46237
17578 -46237 -44500 -51958 -50068 -51824 -37770 -13586 24839 32853 31728 46305 40370 19244 -6437
17565 -6437 -17215 -21076 -24275 1040 -2126 -45498 -27588 -10775 -25110 -41448 -3471 29049
17553 29049 32876 40758 14727 13781 15007 -756 -11899 -21838 -7656 49087 51000 60717 34951
17540 34951 30124 -7308 -10533 1484 14824 -30445 -41320 -21091 -8717 -25713 -1388 18321
17528 18321 -14900 24608 65600 38894 16729 -26691 -9135 -3600 -18321 445 31190 -30100
17516 -30100 -50915 -31005 -40655 -34181 -32301 28874 36274 30606 37312 40612 53548 35188 17510
17503 17510 -3901 -9466 7638 50953 30351 14572 33722 39831 19949 9431 -3694 -29098
17491b9098m90N753K0619Q698j8308J6285k3790l7062J9634N1923m4307l3252
17479f3395J6367m858m307L7355K4561o480m950J297j1712J0412j1939k5953k0227
17466f3829l962j1060J4196Q6056J3571l3939n7638m6670J7276N7192M8328K005
17454B1526j5368k6442l8934J3923K9766j6044m903M6091L2972L7514L5516O4375
17442A79992J82108R1905n8830j48036j61425m4968J9972j7736k613J6692l3007
17431B4054L1719L4084k6525j0848L2082J7225q996j1280P6449J05276J06505
17420C69745J04243J43858N0461J970M7249J39117K24157J25656l7923k14543
17410I53990k02400n4222K4627j4982j22431j55058j38200o7670q0585j3894m6132
$$ plain form
17491 -29098 -29588 -23835 -3216 5482 -12826 3459 -20331 -57393 -37759 14164 -30143 -63395
17479 -63395 -47028 -51886 -56193 -18838 5723 -757 -5707 -4410 -16122 -5710 -17649 -43602 -63829
17466 -63829 -67791 -78851 -64655 21401 34972 1033 -56605 -103275 -85999 -28807 19521 21526
17454 21526 6158 -20284 -59218 -45295 -15529 -31573 -36476 9615 42587 80101 115617 179992
17442 179992 362100 454005 395175 247139 85714 40746 60718 42982 40369 57061 24054
17431 24054 55773 89857 63332 52484 84566 101791 92795 81515 157964 263240 369745
17420 369745 473988 617846 668307 670277 717526 856643 1080800 1206456 1168533 953990
17410 953990 751590 697368 721995 707013 584582 429524 291324 223654 143069 129175 83043
17399H3043o8179l5675j6503J6432L0007K9186o753j946j3697j1522n851l191
17387d649j0218P026N1820J8148n137P190j671l1596n4378l3888J8231L2670q238
17374a4690N008M9877L1116P424o6450l0824K6773L6018N324p723j8282J0897
17362C4468O626j2281J0172K4512J9897j0992m974Q398j8064j7074m5851j537
17350f700K1830k8300o766n0866j9564M2204m235k2539n369M5474L1827r556l2838
17337d5398j5092K7820M1677k4242m9604J3089N9771M5012r276k5649k3596k2253
17325b7741K2686O629k9592j3834L4485j9442j8872K4220j4273j9547L6056R476
17313i749p898K573p06K9862k0436K048J4504j4290l050L200R073j5130j1020
$$ plain form
17399 83043 14864 -20811 -37314 -20882 9125 38311 31558 29612 15915 4393 -1458 -4649
17387 -4649 -14867 -7841 43979 62127 56990 64180 62509 30913 -23465 -57353 -39122 -6452 -14690
17374 -14690 -9682 40195 71311 78735 12285 -18539 8234 44252 49576 41853 23571 34468
17362 34468 41094 28813 38985 63497 83394 72402 67428 75826 57762 40688 -5163 -6700
17350 -6700 15130 -13170 -19936 -70802 -90366 -48162 -52397 -74936 -80305 -34831 -3004 -12560 -45398
17337 -45398 -60490 -32670 9007 -15235 -64839 -51750 8021 53033 43757 18108 -5488 -27741
17325 -27741 -5055 1574 -28018 -41852 -7367 -26809 -45681 -21461 -35734 -55281 -19225 -9749
17313 -9749 -17647 -15074 -15780 14082 -6354 -4306 10198 -4092 -7142 -3942 5131 -9999 -21019
17300b1019J260L411N397m750j7104k5720K979Q794k5882L4330r868J236K5964
17287b0972J9533q626K3801L0935k2750n5689j906M5127L5829K3491M7941r711
17275A07003n3030J308k0585j6294J9925P258j4080J1980J6864L090r594K1318
17263G5163P999r227k2037j1791K0855l9907j0689K3182j8802k6571N955k4570
17251c0440k3501k1113J5645K5332L3894K1366L533L3321P078k3846j815j0759
17239B8695K3703m595l3511j2429j532J9336R563j6419N017L0105j3306l1876
17227B751J3235K3043k4524k676j791n840k6674l3829L6411M1410M0593M891j2867
17214E4133j1216j2876K0308k1331R823j6935o1571l8174N4034L9245l3124j9512
$$ plain form
17300 -21019 -19759 -16348 -10951 -15701 -32805 -58525 -55546 -46752 -72634 -38304 -48172 -46936 -20972
17287 -20972 -1439 -10065 13736 44671 21921 -33768 -35674 9453 45282 68773 116714 107003
17275 107003 53973 55281 34696 18402 38327 45585 31505 43485 60349 63439 53845 75163
17263 75163 83162 73935 51898 40107 60962 21055 10366 33548 14746 -11825 -5870 -30440
17251 -30440 -53941 -75054 -59409 -34077 -183 21183 24716 58037 65115 41269 39454 28695
17239 28695 52398 47803 14292 1863 331 19667 29230 12811 17828 47933 34627 2751
17227 2751 15986 39029 14505 11829 10038 4198 -22476 -56305 -19894 21516 62109 67000 54133
17214 54133 42917 30041 50349 29018 38841 21906 -39665 -77839 -23805 15440 -17684 -37196
17202c7196m865J6585J0427n564O762K2493j8845l6961N282L3318K7368l601K1425
17189C6628P602r80j5622k518p009k9710J6191m562n79O393J6517j8313J779m247
17175A570K7981j0665J902j7616j0524L2220m387m4174j6135K0978R938m80K9891
17162B0499K2381l141l3621P130l6126M891R354J8429Q897M2319m887r252J1167
17149E8040m3119k4669N357J2044J6601k7764j1164J8521J5938j3343n5241m9158
17137i7957K4794Q4101J1704J6074J667K480j8458n5882J1675N0851N6791o171
17125H1669j5538j5842L0944l2779j5295j5239m592l6415l733L859J3445J3211
17113C695K3828p587m376q848j1607k782J0602J1948J1724j6614q034J8504M506
$$ plain form
17202 -37196 -42061 -25476 -15049 -20613 -13851 8642 -10203 -47164 -41882 -8564 18804 15203 36628
17189 36628 44230 43250 27628 25110 18101 -11609 4582 20 -559 5834 22351 4038 5817 1570
17175 1570 29551 18886 20788 3172 -7352 24868 20481 -23693 -39828 -18850 -8912 -9392 20499
17162 20499 42880 39739 6118 13248 -22878 -17987 -8633 9796 18693 61012 56125 46873 58040
17149 58040 14921 -9748 -4391 7653 24254 -3510 -14674 3847 19785 6442 -48799 -97957
17137 -97957 -73163 10938 22642 38716 40383 42863 24405 -31477 -19802 31049 87840 81669
17125 81669 66131 50289 81233 48454 33159 17920 13328 -23087 -26820 -22961 -9516 3695
17113 3695 27523 19936 15560 6712 -4895 -7677 2925 14873 26597 9983 1949 20453 24959
17100B4959J3960k6436j8138j6469J2293L2942j1566j8664j720J6308J0206N026
17088B2701J7076l366j8277L0783k0186n0963K1528K1366N2608N8424K4783k4387
17076A32090P876j6338L7483K3015J2596l3333j8081N244J9455l9243q216m682
17064A17866k8172j7692q568k0329P911J7018j1657R22L7062M6714l7460k6532
17052G7083J4065q670j989j9766j4927N264P019k881r262J6554o258N305J3064
17039G4601j7638k4271l5307O177K9665L0049Q950J1734j4614J7514J8593Q8k3059
17026H2482q513n136j002K6270K1213n011k6647l2882n103j1417m7673M2999K4012
17013E3592j358j1220Q981j8458O178j1615r183L043J3594N221L4231M6138j0283
$$ plain form
17100 24959 38919 12483 -5655 -22124 -9831 23111 11545 -7119 -8839 7469 17675 22701
17088 22701 39777 36411 18134 48917 28731 -22232 -704 20662 73270 131694 156477 132090
17076 132090 139966 123628 161111 184126 196722 163389 145308 150552 170007 130764 122548 117866
17064 117866 89694 72002 63434 43105 51016 68034 56377 57299 94361 141075 103615 77083
17052 77083 91148 82478 80489 60723 45796 51060 58079 55198 45936 62490 56232 61537 74601
17039 74601 56963 32692 -2615 3562 33227 63276 72226 83960 69346 86860 105453 105541 82482
17026 82482 73969 68833 67831 94101 115314 110303 83656 50774 45671 34254 -13419 29580 53592
17013 53592 52234 41014 49995 31537 37715 26100 16917 19960 33554 38775 73006 119144 108861
17000A08861n1758l8111J7367K9824J156J3855O341j5299J8728J5285j0420m3965
16988E1864k1002Q089j2414Q26l018k2253l4971N3686N2030N185j1335l5403m321
16975B6963J5007M7319K8375j5144K5997j5893m6430l7716N7098K6444j5540l8993
16963E7487l2588p898J6312M9966K9132j4845j3326M1757K5747K8007L3463n8
16951B13156O9916L5200o4930l1334j1449M2355N1470J7729j7788r0829q2905
16940A30591K527K5805J934n0278o2512m5405J5744M6706P394K4800j5494O391
16928H8203J5056J1108P466K6078L168m5740j3599k3919p665j419J1504J1900
16916H2141K2872L441J8363l1173r240M5777K5919K0576J2423P122k1794m4494
$$ plain form
17000 108861 57103 18992 36359 66183 67339 81194 87535 72236 90964 106249 95829 51864
16988 51864 30862 38951 26537 27363 24345 2092 -32879 20807 72837 78022 66687 31284 26963
16975 26963 41970 89289 117664 102520 128517 112624 66194 28478 85576 112020 96480 57487
16963 57487 24899 17001 33313 83279 112411 97566 84240 125997 151744 179751 213214 213156
16951 213156 283072 318272 253342 222008 210559 252914 304384 322113 304325 213496 130591
16940 130591 133118 158923 160857 110579 48067 2662 18406 65112 72506 97306 81812 88203
16928 88203 103259 114367 121833 147911 151079 105339 91740 67821 60156 58737 70241 82141
16916 82141 105013 108454 126817 95644 86404 132181 158100 178676 191099 198221 176427 131933
16904A31933J6810J3520M7634M030j4162m560j2326J620O985q801J2189K7608
16892B22480j124j6394J7148L8249r344L396L2578L0675m670J380r647J8364L6575
16879C59666K4525n0009l0842j3683K5817K1928k460j7326K3614K9637l625J496
16867C68738R391L7179Q0998N2180N9555N7287K7329p601J1858N2005N1398Q6733
16855H87050R3364L4430N8143J29845K05699K49263K24581O6761j1049J12534
16845B050621K98828M44133K87676M0689N901J73002L98901M92723M04524L16760
16835D913758L83152O88136J027177J356282J577109J997471K965915M743258
16827A9652258P972832J3832441K3217708L1691217K4287114K422270o362194
$$ plain form
16904 131933 148743 162263 209897 213927 199765 195205 182879 184499 191484 182683 194872 222480
16892 222480 221356 204962 222110 260359 251015 254411 286989 317664 312994 314374 304727 323091 359666
16879 359666 384191 334182 303340 289657 315474 337402 334942 317616 341230 370867 367242 368738
16867 368738 378129 415308 496306 548486 608041 665328 692657 685056 696914 748919 800317 887050
16855 887050 980414 1014844 1072987 1202832 1408531 1657794 1882375 1949136 1938087 2050621
16845 2050621 2349449 2793582 3081258 3121947 3127848 3300850 3699751 4192474 4596998 4913758
16835 4913758 5296910 5985046 7012223 8368505 9945614 11943085 14909000 19652258
16827 19652258 27625090 41457531 64675239 96366456 120653570 123075840 116713646
16820A16713646P091830L3950095N3013278K4785037l0550856m8748652l0603266
16813A25651112m630447P727744n520259k6132810l0481248k2544692j3674311
16806C0395089p966185n073023l579648k612231j843512j148447o96428o81306
16798F794309p82121o52799m59190l28908k82441k70845k00643r5517j31456l33374
16788C257015m13451l23091j92149j00334j48838k08220k60311k40240j43333
16779A227048j39854j04678p5063k0675m2523m3919j9428m6912p9350k2705k9896
16768F02045p3570o1710j3227l2603J5070L0472j187j9901m0707k6705m3276l5012
16756B99689n9784K5531M8799J1016k7748m3798n473K206p309J2679J2365j2519
$$ plain form
16820 116713646 123805476 157755571 210768849 235553886 205003030 156254378 125651112
16813 125651112 121020665 128748409 123228150 97095340 66614092 44069400 30395089
16806 30395089 22428904 17355881 13776233 11164002 9320490 8172043 7475615 6794309
16798 6794309 6012188 5359389 4900199 4571291 4288850 4018005 3817362 3721845 3590389 3257015
16788 3257015 2843564 2520473 2328324 2227990 2079152 1870932 1610621 1370381 1227048
16779 1227048 1087194 982516 907453 886778 844255 800336 780908 733996 654646 631941 602045
16768 602045 528475 466765 453538 420935 436005 466477 465290 445389 404682 377977 334701 299689
16756 299689 239905 265436 314235 325251 297503 253705 248232 250438 243129 255808 268173 255654
16744B55654l201r611m4725k2147j8529L3297K0273J521J4990j7351J1121j2624
16732B08668q2072n1483J5877R105n74N082K1494J9536K011m844J1533O379l3832
16719A26880k5469J0833l259L8819p936L7895J3463J208j8497k3483J921P93M415
16706A57583J496M706K507Q098J2290k8837K2103L2367M9847N4512l3507o0897
16694B22268J3918O0846K0968m778o9574l7755j0325o331n027K3441k9127m2414
16682A36110m828L5516j1271Q38q419k5677n7608J1500J6384m547l8245r238K77
16669D0792O695O338J9292L0622k6824k0163j6422m6741k1515N45r220J6340O874
16656a3387m5316n5974K640M6435N4599J1375M220J3087j9773K138j8950k7578
$$ plain form
16744 255654 252453 242842 198117 175970 157441 190738 211011 212532 227522 210171 221292 208668
16732 208668 126596 75113 90990 100095 99521 104603 126097 145633 147644 142800 154333 160712 126880
16719 126880 101411 112244 108985 147804 139868 177763 191226 192434 173937 150454 152375 153168 157583
16706 157583 159079 163785 166292 174390 186680 157843 179946 212313 262160 316672 283165 222268
16694 222268 236186 297032 318000 313222 243648 205893 195568 189237 184210 207651 178524 136110
16682 136110 131282 166798 155527 156365 147946 122269 64661 76161 92545 87998 49753 40515 40792
16669 40792 47487 53825 73117 103739 76915 56752 40330 -6411 -27926 -27381 -36601 -20261 -13387
16656 -13387 -58703 -114677 -112037 -65602 -11003 372 4592 17679 -2094 44 -18906 -46484
16644d6484n784J2637L3942N2552Q454J3531p098J033j0363r089N003J924J03
16631E0361J3048j5109l643J9103M4750Q28k6448l8020j6471K7441J0998j3603
16619E3235j1546r632j0760l017P402j9324l5580J8553J4008r70K7816k0895M883
16606A4173m2535j6855L811l072P376J4632L5484k311j4985n744N928l6615p00
16593d1413j1860K0206L463m2896j4003L0714L1989j9650l516K4229L124j7369
16581c6982m594J2208P949j8081O782J6627K0252J4745k028j1513K0104L1886
16569E7355j3927l1637J7271J7966N030l4231n774p915j5634K6490L2690J4384
16557F2068l0059j8395L619M361l2360l7049R830J9759J0656K3632m3015n1323
$$ plain form
16644 -46484 -52268 -39631 -5689 46863 55317 68848 61750 62783 52420 43331 48334 50258 50361
16631 50361 63409 48300 44657 63760 108510 109338 82890 44870 28399 55840 66838 53235
16619 53235 41689 32057 21297 18280 25682 6358 -29222 -10669 3339 2369 30185 9290 14173
16606 14173 -28362 -45217 -41406 -44478 -37102 -22470 13014 10703 -4282 -10026 -4098 -40713 -41413
16593 -41413 -53273 -33067 -29604 -72500 -86503 -55789 -23800 -43450 -46966 -22737 -19613 -36982
16581 -36982 -41576 -29368 -21419 -39500 -32718 -16091 4161 18906 16878 5365 25469 57355
16569 57355 43428 11791 29062 47028 52058 17827 12053 4138 -11496 14994 47684 62068
16557 62068 32009 13614 17233 21594 -10766 -47815 -37985 -18226 -7570 16062 -26953 -78276
16545g8276P736J4515K9451M2711j7664J2655N717k3273k5751L3176R160l5460
16533b5303l1552J8878K861o142k46j0644J0225q392k1479j3462K2655K1074j2883
16520e4410k9057o678L0283J9201L6442l6464k9741L4905M2034K9995k5870k6823
16508a6183m2486J5699j1292j4604J148J4780N5399K5202m0756q975L2648J0055
16496B0635N682j768l1253k8781j1068L0828J1226J9674k919r782m0959k5669
16484f4154K826K2319K5194j2955l0007M4828J8854J1198j818j4700p497K4322
16472A8410j571K39l43k2666j4371N766J9941k58j9169J2615M5944J2609j6875
16459D0271j60l2666l637Q194L334l1623n9238m9240j7893j3886L9569M4842M828
$$ plain form
16545 -78276 -70540 -56025 -26574 16137 -1527 11128 16845 -6428 -32179 997 10157 -25303
16533 -25303 -56855 -37977 -35116 -41258 -41504 -52148 -41923 -50315 -71794 -85256 -62601 -41527 -54410
16520 -54410 -83467 -90145 -59862 -40661 -4219 -40683 -70424 -35519 6515 36510 10640 -16183
16508 -16183 -58669 -42970 -54262 -68866 -67718 -52938 2461 27663 -13093 -22068 10580 20635
16496 20635 26317 24549 -6704 -35485 -46553 -15725 -4499 15175 12256 2474 -38485 -64154
16484 -64154 -61328 -39009 -13815 -26770 -56777 -11949 6905 18103 16285 1585 -5912 18410
16472 18410 16839 17078 16735 -5931 -20302 -14536 5405 5147 -14022 -1407 44537 57146 40271
16459 40271 40111 7445 3808 12002 15336 -16287 -75525 -124765 -142658 -156544 -116975 -72133 -67305
16446f7305J0538K2805j5889q799K5459M4448o637k7305K0082j6362o297K5339
16434G7j3188m8l0214j9636N2534n149o1683J4433P401L474l399Q697M992J2092
16420b9617R145K4447m826k7940r949l2939N024L4851M4775j2129j6601M43K2564
16407G248j550J4834k179j1547M53K0824k7504n3235J4426J7558O84m068l3411
16394e7467J7478R367K2456J1205r330K2076L8929Q401o510l4889o6992k7014
16382g2290n951J8235L8681k2377L8939j641m2601R782M2080J0336m3954Q071
16370b2690O3966O9l1637r829k0557m3659j0869k3677j4804J9428L1223L7222
16358b5814J8284J9087n644l9197J45J0047J0714J5170j1570J9383j4105k6734
$$ plain form
16446 -67305 -56767 -33962 -49851 -58650 -33191 11257 4620 -22685 -2603 -18965 -25262 77
16434 77 -13111 -13159 -43373 -63009 -10475 -15624 -77307 -62874 -55473 -51999 -55398 -46701 -41709 -29617
16420 -29617 -20472 3975 -851 -28791 -38740 -71679 -66655 -31804 12971 842 -15759 -15316 7248
16407 7248 5698 20532 18353 6806 7259 28083 579 -52656 -38230 -20672 -19988 -24056 -57467
16394 -57467 -39989 -30622 -8166 3039 -6291 15785 54714 63115 56605 21716 -45276 -72290
16382 -72290 -78241 -60006 -21325 -43702 -4763 -6404 -49005 -39223 2857 13193 -30761 -22690
16370 -22690 41276 41345 9708 -121 -20678 -64337 -75206 -98883 -113687 -94259 -63036 -25814
16358 -25814 -7530 11557 5913 -33284 -33139 -23092 -12378 2792 -8778 10605 -3500 -30234
16346c0234J6911J3594P590m690j6560K7913J2882J4729l1125k1015j7971J1161
16334a6815j9070j3131m373j6911J9605N9797J2811p799J9265m511j0586m644
16322A3638J8841P05m867l488o4184k0155L2674J7641K9838J0725j2086k7501
16310h219k8328n1720K7470L1265J5241J3931j0895J802j5470N2368M1633j8330
16298E0748l4941l0724j6852K6071j43Q307J5907j3257l4861Q336M0556R722k5021
16285C848K425J7227P712l7508j724P601o933l896k2554j8520n019J6300J5530
16272b5511j516L6185J6297n311k4580m6285j7822J3143k1684q109M8874j065
16260c7384j3148n47p887P173J9358O2333K5401l8076j1950J0305m5245l9438
$$ plain form
16346 -30234 -13323 271 7861 3171 -13389 14524 27406 42135 11010 -10005 -27976 -16815
16334 -16815 -35885 -49016 -53389 -70300 -50695 9102 21913 14114 33379 28868 18282 13638
16322 13638 32479 33184 28317 24829 -39355 -59510 -26836 -9195 20643 31368 19282 -8219
16310 -8219 -36547 -88267 -60797 -29532 -14291 -360 -11255 -9453 -24923 27445 69078 50748
16298 50748 15807 -14917 -31769 -5698 -5841 2466 18373 5116 -29745 -21409 19147 28869 3848
16285 3848 6273 23500 31212 -6296 -8020 -419 -7352 -11248 -33802 -52322 -57341 -41041 -25511
16272 -25511 -27027 9158 25455 20144 -4436 -50721 -68543 -55400 -77084 -85193 -36319 -37384
16260 -37384 -50532 -51079 -58966 -51793 -32435 29898 55299 17223 5273 15578 -29667 -69105
16248f9105j2176L4554O568N323k8619j9660L7237J2968K4541L9025j331L868
16236C3193J4651K4439j8856l8954M0197K3250r773j4235p47M9936K5076m206
16224A23971K7291P1485J59916J70132J16910L2723j1157O793J32983J88312J28421
16213A147780p6589k34750j51361k8443J5709q164p0893j53563j50954p8787o5183
16202A44802l8236j0155l1519Q424k1794q20k6364n3046J8670P975P627j0681
16190e117j1924L3263K4977O579j6223J6761m664k7427J2494L4247k089j2610
16178D8267J7110M397j4244j4525P727j2500k9423k6714J0842M3276j1700L0626
16166E3139n586k9451o600l5912j5496K7720L2566L1047k8335m2170k4266L8558
$$ plain form
16248 -69105 -81281 -46727 -40159 -34836 -63455 -83115 -45878 -32910 -8369 30656 29325 33193
16236 33193 47844 72283 53427 14473 54670 77920 68147 53912 53165 103101 128177 123971
16224 123971 151262 222747 382663 552795 669705 702428 691271 698064 831047 1019359 1147780
16213 1147780 1071191 836441 685080 656637 672346 664182 593289 439726 288772 209985 144802
16202 144802 106566 96411 64892 73316 51522 50702 24338 -28708 -10038 -2063 5564 -5117
16190 -5117 -17041 16222 41199 47778 31555 48316 43652 16225 28719 62966 60877 48267
16178 48267 65377 69774 55530 41005 48732 36232 6809 -19905 -9063 34213 22513 53139
16166 53139 47553 18102 11502 -24410 -39906 -12186 20380 51427 23092 -19078 -43344 -4786
16154d786K8216l5841j3836L0438M9660j724k8736q833j5266k63q663j1210k0434
16141d1278J0281p818k3179N532L5955K9769p241q852J1732K3180n396j7119p163
16128a597L1423j2134j3347j642p097P391K8116j5996M740p486q046K2811r289
16115A7847r637j992O233j6707o268o515j2520l695J652j1179j3091J668N385
16102d8819q32L8399l0450o4107M958Q7228M1091n0400j1939L345L16L1814K233
16089B837K0479J3251j3777k6886n998k6733K769L5633k836j1199k7043p662J803
16076d5362L0570K6046N822J341l1217m9984l532Q994L8046Q937l711J5720k2242
16063b0572k3716q683O518J4919K3902J3742J6212K5161J3516j0340j1707o6129
$$ plain form
16154 -4786 23430 -12411 -26247 4191 53851 52127 23391 14558 -708 -971 -9634 -20844 -41278
16141 -41278 -30997 -38815 -61994 -56462 -20507 9262 2021 -6831 4901 28081 22685 5566 -1597
16128 -1597 29826 17692 4345 2703 -4394 2997 31113 15117 19857 12371 4325 27136 17847
16115 17847 8210 6218 12451 -4256 -10524 -17039 -29559 -33254 -31602 -42781 -55872 -54204 -48819
16102 -48819 -49651 -11252 -41702 -105809 -100851 -13623 27468 -22932 -34871 -31526 -31210 604 2837
16089 2837 23316 36567 22790 -4096 -10094 -36827 -34058 1575 -1261 -12460 -39503 -47165 -45362
16076 -45362 -14792 11254 17076 18417 -12800 -62784 -66316 -57322 -19276 -10339 -14050 1670 -20572
16063 -20572 -44288 -52971 -46453 -31534 -7632 6110 22322 47483 60999 50659 38952 -27177
16051b7177k9728N2345J2427J5499J2839k0094j1439p5k3130k9174O20K1979M3893
16038A8785K1118j7447n2490n072N4324K1057J460k4253j6065k2687j5324j310
16026c7904j8033r512K1038K4213N6486J7584k7694k9789L7117J1609k8371m6078
16014b9334k3933k5546l4210L3080N1416L7740j8677J763r234m7865o618M71L5362
16001c5585K3980j0663j7222M3415n924k319Q31j5254L2496J7629R011J2749q951
15988D4193k7723j6188q303l154P2289K5035n3220n7578l4320j645k7685m201
15976i2500M6834O0745l766k8256l480n345n111L4968j1049J9497Q252k4374R487
15963E902K6018r556p795j0225J5570J2125o636m3514l6112L7746L1356k420l8881
$$ plain form
16051 -27177 -56905 -4560 7867 23366 36205 16111 4672 4597 -18533 -47707 -47087 -25108 18785
16038 18785 39903 22456 -30034 -35106 19218 40275 41735 17482 1417 -21270 -36594 -37904
16026 -37904 -55937 -65449 -44411 -20198 36288 53872 26178 -3611 33506 45115 16744 -29334
16014 -29334 -53267 -78813 -113023 -79943 -28527 9213 -9464 -7701 -16935 -64800 -71418 -70947 -35585
16001 -35585 -11605 -22268 -39490 3925 -1999 -4318 -3487 -18741 13755 31384 40395 53144 44193
15988 44193 16470 282 -8021 -11175 61114 86149 32929 -24649 -58969 -60614 -88299 -92500
15976 -92500 -45666 15079 11313 -16943 -20423 -25768 -30879 4089 -6960 12537 20789 -3585 5902
15963 5902 31920 22364 14569 4344 19914 32039 25403 -18111 -54223 -16477 14879 12459 -26422
15950b6422L189K0894j9864J252L132j0248L8187K0162J7468j3901m2299k0548
15938b8998j5887R100R866k8507l4516O357K9062L5474L2041K5663K9144j5813
15926E2986q132j8235M33J343l0520J5284r281j2806j167j1074q777J150L0514
15913A718J920j3996L1280K6493q509l265j8260j9768L7025k8833n6521R432K0986
15900b0298J185J6306Q748k3979J6690O865K81m356J4388K527k5901l2548j9381
15887e9473J4407Q2J311J4711k457j8395l2716M1839M582J1234J4191q220j8073
15874c6977N235k0253k3170K8581j9691q960L8686K9916n0605j8631M4578L4855
15862C564P68k1798l9810J9033M7838k577K7100J0347q508j5653j5103o52l3463
$$ plain form
15950 -26422 -23233 -2339 -22203 -20951 -17819 -28067 10120 30282 47750 33849 -8450 -28998
15938 -28998 -44885 -35785 -25919 -54426 -88942 -82585 -53523 -18049 13992 39655 68799 52986
15926 52986 44854 26619 27052 28395 -2125 13159 3878 -8928 -10095 -21169 -29946 -28796 1718
15913 1718 3638 -10358 20922 47415 38906 35641 17381 -2387 34638 5805 -50716 -41284 -20298
15900 -20298 -19113 -2807 5941 -18038 -1348 5517 5798 1442 15830 18357 -7544 -40092 -59473
15887 -59473 -45066 -44984 -43673 -28962 -31419 -49814 -82530 -40691 -36109 -24875 -10684 -18904 -36977
15874 -36977 -31742 -51995 -75165 -46584 -66275 -75235 -36549 -6633 -57238 -75869 -31291 3564
15862 3564 4332 -17466 -57276 -38243 9595 7018 34118 44465 35957 20304 5201 4549 -28914
15849b8914m0336k1042L6682K2565m4069J560J2424K9141N078j2298k788K7952
15837a4045N860O707Q661j4896k3501j3633N1464J722k9824j4428q347o057L9009
15824a1308M2312K3103N86o056K9298j6028k5404m447k8474j7647J7341Q179j4156
15811b701j4303M179O176j2355R393R94m501j4611n961K1515o762j0053K5894
15798c096J8889J5062r521k3482k2327K3750j501J0043k4407j1656r930L977L7747
15785C548j9888k4319q541R484N524N7471J0589l5713j1381J56j2091J6269L802
15772e090n3480k5217N1063J0763o766L818K2781J2804j5263J2720K2820k9370
15760A583n4673q991J654L5813R953m90l19j6102k1603k813J3169o047j9990L5043
$$ plain form
15849 -28914 -69250 -90292 -53610 -31045 -75114 -73554 -61130 -31989 -26911 -39209 -41997 -14045
15837 -14045 -8185 -1478 7183 -7713 -31214 -44847 6617 8339 -21485 -35913 -44260 -50317 -11308
15824 -11308 31004 54107 54693 48637 77935 61907 36503 32056 3582 -14065 3276 11455 -2701
15811 -2701 -17004 -12825 -6649 -19004 -9611 -8617 -13118 -27729 -33690 -12175 -18937 -28990 -3096
15798 -3096 15793 30855 21334 -2148 -24475 -725 -2226 7817 -16590 -28246 -38176 -34199 3548
15785 3548 -16340 -40659 -49200 -39716 -34192 23279 33868 -1845 -13226 -13070 -25161 -8892 -5090
15772 -5090 -58570 -83787 -32724 -21961 -28727 -24909 -2128 10676 -4587 8133 30953 1583
15760 1583 -53090 -62081 -60427 -24614 -14661 -15151 -15470 -31572 -53175 -55988 -42819 -48866 -68856 -33813
15746c3813K4533K689Q140k6002m0615P195K583k8727J8779J8048J5379l0659
15734f2470K3672J5517k1193J1874J8827n489K8377L7266O23l2379K58j496j0986
15721B401p593k58Q912Q401n712j045k1365k183j81j470J1865P509O137o682J5308
15706A4044j9113l2519r961L4807M5829p974j8830j1547J3034J5480J7894j7383
15694B3761J1350j5285n2120j9984Q111J1963K4226N5109l4797m2051q269J1217
15682b6769L6841J2154j0345q814j1210J2178j244j5073R602l7290l7737M0495
15670c7212L8459j2746m6049n5318L7649J3068N520K105J3953J5252k8102k1046
15658g4467k4739L862L9292M6359J1849Q274Q270r306j9120l5751k0608n140N566
$$ plain form
15746 -33813 -9280 -6591 1549 -24453 -65068 -57873 -55290 -84017 -65238 -47190 -31811 -62470
15734 -62470 -38798 -23281 -44474 -32600 -13773 -19262 9115 46381 47004 14625 14883 13387 2401
15721 2401 -5192 -5450 3462 11863 6151 5106 -16259 -18442 -18623 -20093 -8228 -719 5418 -1264 14044
15706 14044 -5069 -37588 -47549 -12742 33087 25113 6283 -5264 7770 23250 41144 23761
15694 23761 35111 19826 -32294 -52278 -44167 -32204 -7978 47131 12334 -29717 -37986 -26769
15682 -26769 10072 22226 11881 3067 -8143 4035 2791 -12282 -2680 -39970 -77707 -37212
15670 -37212 1247 -11499 -57548 -112866 -75217 -62149 -56629 -54524 -40571 -25319 -53421 -74467
15658 -74467 -99206 -95344 -56052 -9693 2156 10430 18700 9394 -9726 -45477 -66085 -71225 -65659
15645f5659L7326K3904J4032J6465j8058l3979R236J3841J006m2168K6172J8941
15633A059J5817K8205j1046j464Q638n289j8241J9039K4663j7581k5481J5261
15621C3580J4580k763k8351k0315r069L0946q493N87j3940Q208N591j2884n180
15608g503k3314k6500J8803J6360J5421k4587k4028P854J9130J97Q46l2342O981
15595e2682K8439j5904K497l3375N753Q071K31k5757J5577N8717J9486j3777r095
15582a1819j1828j0432J1494l1196k8976j5551J7222M1436J0351J5723K1833j1529
15570c272l0817l5685o969k760M014J1895J8634K7401L669j7078l1203J5878L1272
15557a5021O205J2516o299K0364k1259M442K7031l4284n0872J2514L7939L5617
$$ plain form
15645 -65659 -28333 -4429 9603 26068 8010 -25969 -16733 -2892 -1886 -44054 -17882 1059
15633 1059 16876 45081 34035 32571 41209 35920 17679 36718 61381 43800 18319 33580
15621 33580 48160 45397 17046 -3269 -12338 18608 10115 10702 -3238 4970 10561 -2323 -7503
15608 -7503 -30817 -57317 -38514 -22154 -6733 -31320 -55348 -47494 -28364 -28167 -27321 -59663 -52682
15595 -52682 -24243 -40147 -37650 -71025 -65272 -57201 -56970 -82727 -67150 -8433 11053 -2724 -11819
15582 -11819 -23647 -34079 -22585 -53781 -82757 -98308 -81086 -39650 -29299 -13576 8257 -3272
15570 -3272 -34089 -69774 -76743 -79503 -75489 -63594 -44960 -17559 -13890 -30968 -62171 -46293 -15021
15557 -15021 -8816 3700 -2599 17765 -3494 948 27979 -6305 -57177 -44663 -6724 28893
15545B8893J200j8566J1257j4468K6306Q890n7068R344K9603J7191J5098R360
15533F7040j8873k0642l8523k03L4663N494l211L4192m2975m5127j058K7562R144
15520G483m8635J1264J3634K3213Q606Q060j0863J1041M6555J124k0653o8943
15508a8114J382M5830L659l1364l5846q165o024J9428J6698K4593J405J113K7453
15495D2048k6820k399k7057J5949M5283j5372o827p050j6543q611J5510J2862
15483B0973m1014j050j967n041K0981l200R362j3447j065l919n323L1920K4141
15470C1351m1310P924m7749M0289M8090j9114o2010j3791K3813K6601J4481J6974
15458B5549N848l5308k4203J7717j4544j1593Q800K5416j8071M9375K9497n886
$$ plain form
15545 28893 30093 11527 22784 8316 34622 43512 -13556 -4212 25391 42582 57680 67040
15533 67040 48167 27525 -10998 -11201 23462 28956 25745 59937 16962 -28165 -29223 -1661 7483
15520 7483 -41152 -29888 -16254 6959 15565 23625 12762 23803 70358 71482 50829 -18114
15508 -18114 -16732 29098 32757 1393 -34453 -42618 -48642 -29214 -12516 12077 13482 14595 42048
15495 42048 15228 12829 -14228 1721 47004 31632 24805 17755 1212 -7399 8111 20973
15483 20973 -20041 -21091 -23058 -28099 -7118 -10318 -956 -14403 -15468 -19387 -24710 7210 31351
15470 31351 -9959 -2035 -49784 -9495 38595 19481 -42529 -56320 -32507 -5906 8575 25549
15458 25549 31397 -3911 -28114 -10397 -24941 -36534 -27734 -2318 -20389 28986 58483 52597
15446E2597n2543k647R167J6240L3047j3685j0832r931j0194k7723j6784J1999
15434b1289J3166j8402J0848K0215O800Q024k3834j311L4653J8002J1381p307
15422E0946j801L484j8277m2174m352p418k3983P321j8615j2742k2076L9777K9564
15409b0346K3078J9624J4396k7007j1019K2443K1969j5976J1298j9666J4185L633
15397C6612j2129j120K3296O345k1036n9189J3308j8279O65k4465K7483K0812
15385g697K709k0762R101o081K8189Q064l7310J6437L8211J8860l3456j9285L3222
15372C0202j9311k4168q954L4364M4204O62n7075k5957J289J3746o617l3507l324
15359e4446O3190O2791k366k9379k6016j8154L8270k665l5440j8707k1975k7138
$$ plain form
15446 52597 54 -2593 6574 22814 55861 42176 31344 21413 11219 -16504 -33288 -21289
15434 -21289 -8123 -26525 -15677 4538 11338 19362 -4472 -5783 28870 46872 58253 50946
15422 50946 49145 52629 34352 -7822 -12174 -19592 -43575 -36254 -54869 -67611 -89687 -49910 -20346
15409 -20346 2732 22356 36752 9745 -1274 21169 43138 27162 38460 18794 32979 36612
15397 36612 24483 23363 46659 53004 31968 -27221 -13913 -32192 -31527 -55992 -28509 -7697
15385 -7697 -4988 -25750 -16649 -22730 5459 13523 -23787 -7350 30861 49721 16265 -3020 30202
15372 30202 10891 -13277 -22231 12133 56337 56999 -76 -26033 -24744 -10998 -17615 -51122 -54446
15359 -54446 8744 71535 69169 39790 13774 -4380 33890 31225 -4215 -22922 -44897 -72035
15347g2035j6677M4670M1023K3163m0130J418K2951K093J4458r941O100k7916
15335a0823j7552K1476L2372l4312K1080N722k0668l0033j6740K9975K4258l635
15323A120L1923o792k2358K832n0930k5293L358L213K7620J8361m995K2445J2675
15310A3179p198j0326J4476m154L4104J551j2565J0716j2604l987l5921l0467
15298d3196k3498J7585j3143J7112J1109j1230J6538N4932K7611o633j4227k4001
15286H959L3918J4575q334j5245O784L1796m4852o3839n6817J0261L6654Q774
15274c7366J9306N298j2631r361l607K9453P934j4965p558n449n10J3722l068
15261a8802K0471k2961n3978k8668J6637L9289J9392K1498K5176M599l4762L872
$$ plain form
15347 -72035 -88712 -44042 -3019 20144 -19986 -18568 4383 6476 20934 10993 17093 -10823
15335 -10823 -28375 -6899 25473 -8839 12241 17963 -2705 -32738 -49478 -19503 4755 1120
15323 1120 33043 26251 3893 6725 -44205 -69498 -66140 -62927 -35307 -16946 -21941 504 13179
15310 13179 5981 -4345 10131 5977 40081 41632 29067 39783 27179 23192 -12729 -43196
15298 -43196 -66694 -49109 -62252 -45140 -34031 -45261 -28723 26209 53820 47187 32960 8959
15286 8959 42877 57452 49118 33873 40657 72453 27601 -36238 -93055 -82794 -46140 -37366
15274 -37366 -18060 -12762 -25393 -34754 -38361 -8908 -974 -15939 -23497 -28946 -29456 -15734 -18802
15261 -18802 1669 -21292 -75270 -103938 -87301 -48012 -28620 -7122 18054 22653 -12109 -8237
15249h237L200K6729j3016l1841K5559j6258k87J6192K0964j3165j9880R199j3157
15236a3998J3581N5667O59m9371r794N287k9757k541k062L2471J9819k1591r433
15223a1063M7461j1294l4669p185q984J9217R197J848J1629J3032L797j3388q278
15210A1320q013l7392r303M4151J2101J3307J9123k4865k4353J6134j0024m437
15198b251K1584M7773j1886j1877m653l8190L2163L2191k2100R170R560k4326
15186C7158k2215J3309j619J0899l009m0420j2428j0217j2698q680J1143K251
15174c6526K3754k621k823k3868J4815Q317o689n252j2536M5901N7363L723j04
15161F3454j4907k3228K1288K8343n628J2388l5450l7710m523L0859K4331L607
$$ plain form
15249 -8237 -5037 21692 8676 -23165 2394 -13864 -14151 2041 23005 9840 -10040 -841 -13998
15236 -13998 -417 55250 55909 6538 -3256 2031 -27726 -30267 -32329 142 19961 -1630 -11063
15223 -11063 36398 25104 -9565 -16750 -25734 -6517 2680 4528 16157 29189 32986 19598 11320
15210 11320 3307 -34085 -43388 763 12864 26171 45294 20429 -3924 12210 2186 -2251
15198 -2251 19333 67106 55220 43343 38690 500 32663 64854 42754 51924 61484 37158
15186 37158 14943 28252 26633 37532 34523 -5897 -18325 -28542 -41240 -49920 -38777 -36526
15174 -36526 -12772 -15393 -18216 -42084 -27269 -18952 -25641 -30893 -43429 2472 59835 63558 63454
15161 63454 48547 25319 46607 74950 69322 81710 46260 8550 4027 34886 59217 62824
15149F2824j3692k1153j6163q584j7613j6643n06K5020j940L126Q299J9261K1077
15136D3313j6396P073L2116o616l742M2059k0815k2590j4900J2219l5195l9187
15124b2661j7386J3369j8218J0869K0308n822K7513O772l1861n1483M0163K6418
15112b019j2243L3091k143l4783k6174j6408M25L7686K4183K3374K7578j0871
15100D1696l6491m1455j5670M1752j754l7768j2647K0139M9188K1432O2731Q237
15088I9390j1515n8440k425K7783k4924l4447l3959J5367J9379L0743K504k1268
15076H188p155m376p255P648l390j4260M434K8502J8245n0416o408K9846k148
15063A455k8918M704L1125J1194p620k3174K4659J3359n083k046p780n582L3883
$$ plain form
15149 62824 49132 27979 11816 3232 -14381 -31024 -31530 -6510 -8450 -5324 2975 22236 43313
15136 43313 26917 33990 66106 59490 55748 97807 76992 54402 39502 51721 16526 -22661
15124 -22661 -40047 -26678 -44896 -34027 -13719 -19541 7972 14744 -17117 -68600 -28437 -2019
15112 -2019 -14262 18829 16686 -18097 -44271 -60679 -60254 -22568 1615 24989 52567 41696
15100 41696 5205 -36250 -51920 -10168 -11922 -49690 -62337 -42198 6990 28422 91153 99390
15088 99390 87875 29435 27010 54793 29869 -4578 -38537 -23170 -3791 26952 29456 8188
15076 8188 1033 -3343 -10598 -2950 -6340 -20600 -16166 12336 30581 -19835 -26243 3603 1455
15063 1455 -27463 -22759 8366 19560 11940 -11234 13425 26784 21701 19655 11875 6293 40176
15050D0176l961j7854j449Q888j7473J012J8597k2688q149O859k4861P236N1590
15037C7923M5262l1507j7234l366k1371J3921j988j4055q683K933N345j4261K124
15024d957K7086j1819k5752j1193R916K2936k2042R177Q539r041p350l3276l7450
15011h5226K2016N1407j1015j5714J61j0505L19q433J5187k3227j2596K3761K0598
14998c3267R596R58p877j2546L5098J8421n973j053o93J2391O587j827J4012K6675
14984F0502N2583J5060l9363k5420J9993l5597K609j9140j7039N831k242j8974
14972a197M2941r746l3526K642J5850Q808n2676K2853K5591J6483r707j4791m5729
14959c2204K4548K4943J2985J4047K6909J094m5974l1282m9977k8678L2632N3652
$$ plain form
15050 40176 36215 18361 16912 25800 8327 9339 27936 5248 -2901 3958 -20903 -13667 37923
15037 37923 83185 51678 34444 31078 9707 23628 21640 7585 -1098 1835 7180 -7081 -4957
15024 -4957 22129 10310 -15442 -26635 -16719 6217 -15825 -6648 1891 -7150 -14500 -47776 -85226
15011 -85226 -63210 -11803 -22818 -38532 -38371 -48876 -48557 -56990 -41803 -65030 -77626 -53865 -33267
14998 -33267 -23671 -22713 -30590 -43136 -8038 10383 4410 3357 2664 15055 21642 19815 33827 60502
14984 60502 113085 128145 88782 63362 83355 47758 50367 31227 14188 20019 17777 -1197
14972 -1197 41744 31998 -1528 1114 16964 25772 -26904 -4051 21540 38023 28316 13525 -32204
14959 -32204 -7656 17287 30272 44319 71228 72322 26348 -4934 -54911 -83589 -50957 2695
14947B695q554n3334J0228r466l288K9318L4265J7845l965p753q446j4127m4706
14934e9288l6071Q440J5151L4357R279K1810K0743J4478K3262K0621l4043q0053
14922d1314n6937j7055j1577M9494M0955k3520J691Q275K7486J5074N2965j2653
14910C2884j3084l7268K7551L0952l1992l2611K0435K4836K5693k5971l1677K3757
14898A3505l6594J8184K6870m900m115l1332o612J4014l749K8094K9407q110K6158
14885F0820P961K4771r588l6445m9060l8603K8508L9984K1792J6360k0529j9447
14873B6524l6244K5540l359J4747k4239n497J4147N0259M710l1410N578j5995
14861B4761j8743J098J3427M089J0585J7276K254k3321j7226j9206J5631M094
$$ plain form
14947 2695 -5859 -59193 -48965 -58431 -61719 -32401 1864 19709 15744 7991 -455 -14582 -59288
14934 -59288 -95359 -86919 -71768 -37411 -28132 -6322 14421 28899 52161 72782 38739 -41314
14922 -41314 -98251 -115306 -126883 -77389 -36434 -59954 -58263 -49988 -22502 -7428 45537 32884
14910 32884 19800 -17468 10083 41035 9043 -23568 -3133 21703 47396 21425 -10252 13505
14898 13505 -23089 -4905 21965 17065 12950 -18382 -24994 -10980 -14729 13365 42772 34662 60820
14885 60820 68781 93552 83964 47519 -1541 -40144 -11636 28348 50140 66500 45971 26524
14873 26524 -9720 15820 12461 27208 2969 -2528 11619 61878 66588 35178 40756 24761
14861 24761 6018 7116 20543 24632 35217 52493 54747 31426 14200 -5006 10625 14719
14849A4719m793j1800Q115j2242j1612l943J9226j5628Q654J3485L4550L3212
14837G1943n925k4930j8321N185K3775M0059J0674l988m4524n441l917l2657M565
14824A6498j4898k4823J5549O3445q82k5413l6651P157l752O800l2695k5448L5015
14811b0098N8048J91o139r497l9672q108J3067L2245o404k3205r14O810j8170
14798b1846p254K47k0781K8820J7080O971K4908M468p362L1158m183k1601k9661
14785I64j1329L0166L363j4258K5404q480k7419J1350j6666K0790p712J7035J1482
14772C4690j2283Q015L538J4648n345K5428J7563q05j4545J2420J6804j5590k6804
14759E7734m4521J9109L5616j385j656K9379J8561m5151m3264q763k2449J388
$$ plain form
14849 14719 9926 -1874 6241 -6001 -17613 -21556 -2330 -17958 -9304 4181 38731 71943
14837 71943 66018 41088 22767 27952 51727 91786 102460 98472 53948 48507 44590 11933 16498
14824 16498 1600 -23223 -7674 55771 54889 29476 -7175 -18 -3770 3030 -29665 -55113 -20098
14811 -20098 37950 38141 32002 22505 -17167 -25275 -12208 20037 13633 -9572 -10486 -3676 -21846
14798 -21846 -29100 -28853 -49634 -20814 -3734 3237 28145 32613 25251 56409 52226 30625 964
14785 964 -10365 19801 23164 8906 34310 25830 -1589 9761 -6905 13885 6173 23208 34690
14772 34690 22407 30422 33960 48608 43263 68691 86254 85449 70904 83324 100128 84538 57734
14759 57734 13213 32322 67938 66553 64897 94276 112837 67686 24422 15659 -6790 -5402
14747e402J3677K2976K5158j6500N589k4114r84r714j7894P022J0537k3483j0837
14734b3969J7031K1997K0117M3648O347l3830l2868j632n637L268N2563L9021
14722A06056j9921m1799J9685l4925l9592L9030M1924K4637n2155m0503k5558
14711b3121M510J425K9230J9111m3486o8377r296L4450K3242N5553J4341m621
14699C2961o562l5668j9747L5302J0875K0633J6359L2473m917j1905r809P133
14687F7128n161j9106j2922M068q022L983j0968j3652M5180n203j5073R621k9150
14674A0723l2086q595K7860q748j9025j5885J0667L1298k566q529k0575K3976
14662a1485O8672k279j4654J0967o855K5121P242n0506l4966j6862o131J6180
$$ plain form
14747 -5402 8275 31251 56409 39909 45498 21384 20400 10686 -7208 -186 10351 -13132 -23969
14734 -23969 -6938 15059 35176 78824 85171 51341 18473 16841 11204 14472 67035 106056
14722 106056 86135 44336 64021 29096 -10496 28534 70458 95095 42940 2437 -23121
14711 -23121 -18611 -17186 12044 31155 -12331 -80708 -90004 -55554 -32312 23241 37582 32961
14699 32961 26399 -9269 -29016 6286 17161 37794 54153 86626 81709 69804 59995 67128
14687 67128 61967 42861 29939 34007 25985 29968 19000 5348 50528 45325 30252 39873 10723
14674 10723 -21363 -29958 -2098 -10846 -29871 -45756 -35089 -3791 -6357 -14886 -35461 -11485
14662 -11485 57187 54908 40254 51221 44366 69487 76729 26223 -8743 -25605 -31736 -15556
14650a5556j7484J593J3599j8929J9134K2541O351K4604R210j0560j8647k0953
14638e097L578K2049L2547j0487j5827L8119K7157K522N993k3845j6716k3200
14626C6793J4466L1829J6717m1166J288J1548j7556k1821m0185O131M2456L2553
14614G3053N318m5632j9725j7872P703l607O972J7294r478J695K7401K400j7937
14601B7585K0269J1757L306K93j8584l578j5320n452j5134l692J0359p986J9421
14588B3244K8246m645m0908k9342R033J4303K0479K2043K4693K943l027l7104
14576B9958j6084j6396K4762L3964Q596J2962O705l5950k0939O158l1010n877
14564c151J9191O23M4378K4678l048q991K609j467o995n679k4647l4825J5115
$$ plain form
14650 -15556 -33040 -31447 -17848 -36777 -17643 4898 11249 35853 45063 34503 15856 -5097
14638 -5097 -1519 20530 53077 42590 26763 64882 92039 94561 100554 76709 59993 36793
14626 36793 51259 83088 99805 58639 59927 71475 53919 32098 -8087 -1956 40500 73053
14614 73053 78371 32739 13014 -4858 2845 -762 6210 23504 14026 15721 43122 45522 27585
14601 27585 47854 59611 62917 63210 44626 41048 25728 20276 5142 1450 11809 3823 23244
14588 23244 51490 46845 5937 -23405 -14372 -69 20410 42453 67146 70089 67062 29958
14576 29958 13874 -2522 22240 56204 64800 77762 84467 48517 27578 33736 2726 -3151
14564 -3151 16040 16663 61041 85719 82671 73680 76289 74822 67827 62148 37501 2676 17791
14551A7791J3335M8960J7151l7047l9253m297p95J2665p551L420j8706j835k4859
14538b1021k2187J5286J6376J5956J5557j4635J6324N896l1574J8408K0897o520
14526B8763o109K4795j6621m0666M221J5622l2726m903l812j3740L3109j5724
14514b7791k5728K6421L4876k8799j2567K1333L9609J1146k2442j3035J4570j79
14502A7414m688J9109J7871j616k202Q409R133m4244j1842j7476J5547l430J991
14489C976R578L5869J3717K4764N081k3918m9608l3434K1596r636o013K0010M7071
14476E9053J7013L3663l3693l1792L0357m392k4475J616L1520J2036k0120k1714
14464D9072m2019L2052J8634J358o319J3891N142J403m348J895l1492l9558N136
$$ plain form
14551 17791 31126 80086 97237 60190 20937 16640 15845 28510 20959 24379 5673 3838 -21021
14538 -21021 -43208 -27922 -11546 4410 19967 5332 21656 27552 -4022 14386 35283 28763
14526 28763 22654 47449 30828 -9838 -5617 10005 -22721 -27624 -31436 -45176 -12067 -27791
14514 -27791 -53519 -27098 7778 -21021 -33588 -12255 27354 38500 16058 3023 17593 17414
14502 17414 12726 31835 49706 48090 45888 54297 63430 19186 7344 -10132 5415 1985 3976
14489 3976 13554 49423 63140 87904 92985 69067 19459 -13975 7621 -2015 -8028 11982 59053
14476 59053 76066 109729 76036 44244 74601 70209 45734 47350 78870 90906 70786 49072
14464 49072 7053 39105 57739 59097 52778 66669 71811 73214 68866 70761 39269 -289 4847
14451D847k2018j0701K8140K525k173j3587K4688j8364J2066J0781J6859M0448
14439G3511l075Q465k2172k8976r31j3390K0488J9059l2862j4897J0086n145K0594
14426C0755L345j6913m7840N437L1515J4432L416J2179j5969l017L136N5677J2005
14413H8158n0670j399l449J4197j0131j4352j6876j2924l0894j3737M5583N7815
14401E1321N525l690K0378J971j9789m235K832j1989k5430j5502j5716K9012M1388
14388E6076K3455j646l5297p509K0824m638j3672K0371P606L4386j489l1213k1933
14375D5321L7665o872J605j4509l1729q813n08o873j32K5883N285k2856k1137
14362B330M110k1011j7140L9319L518l095M5464n91j4636l538Q657L2064J8545
$$ plain form
14451 4847 -17171 -27872 268 2793 620 -12967 11721 -6643 5423 16204 33063 73511
14439 73511 70436 78901 56729 27753 26822 13432 33920 52979 20117 5220 15306 10161 30755
14426 30755 34100 17187 -30653 -25216 6299 20731 24147 36326 20357 17340 20476 76153 88158
14413 88158 37488 36089 32640 46837 36706 22354 5478 -7446 -38340 -52077 -6494 51321
14401 51321 56846 53156 73534 75505 55716 51481 54313 42324 16894 1392 -14324 14688 56076
14388 56076 79531 77885 42588 35079 55903 51265 37593 57964 65570 99956 98467 67254 45321
14375 45321 82986 76114 77719 63210 31481 22668 22160 15287 15155 41038 46323 23467 2330
14362 2330 6440 -14571 -31711 7608 11126 8031 53495 52904 38268 34730 43387 75451 93996
14349I3996K3028q525j2756j2145L269k3302p1156N433M9772J3205l344k1553
14337C5922j0514J1763J2642J1007k0188J0160j1890R106j2430L2073J1341J9483
14325I8475J225k6299j8145Q413K872K202K5105J8635J115n079o984m3033l0461
14312B8041j0222J5656j1082J485J4128r919k4256K0123J2830P939J1652J2101
14300F8476J3130j2930j0241K0336J362k751k9583L33j032J412K6705O801K6701
14287A08719J9795k963L1792J0744l958J1044K0737J6741L4626M0301K8312J9163
14275C35053M2379O1883Q4839J01934O2066K1020J5556M156J3206K465N54j2394
14263G32717n0209l7966p2786o8341l4152l0548n5051j9360N405m7864j5286L1406
$$ plain form
14349 93996 117024 108499 95743 83598 86867 63565 -7591 -2158 47614 60819 57475 35922
14337 35922 25408 37171 49813 60820 40632 50792 38902 48008 35578 67651 78992 98475
14325 98475 99700 73401 55256 63669 66541 68743 93848 112483 113598 108519 101535 58502 28041
14312 28041 17819 33475 22393 23878 38006 28087 3831 23954 36784 44723 56375 68476
14300 68476 81606 68676 58435 78771 80133 77382 47799 48132 47100 48512 75217 82018 108719
14287 108719 128514 125551 157343 168087 164129 175173 195910 212651 247277 287578 315890 335053
14275 335053 377432 439315 524154 626088 688154 709174 724730 728886 742092 744557 745111 732717
14263 732717 682508 644542 571756 503415 469263 438715 383664 364304 369709 321845 306559 337965
14251C37965M493m9296k0235L697O5581N8812K4623N198l1146j7560M4706P8214
14239E05052Q4530L6841L4521J6814j5376M0524P272J7591P141K8876j9014k2129
14227G22643q2944q3365p4566o0968n9118m2241n9970m2443p5473r647Q323J2052
14215A52283J0833m1809m8403K5977Q148P843p705k1794J7325n180k5895j2151
14203E9472M2552M2580k6765p109j5563n3314K6108K7194J404q946q742k889K197
14190G8179J6756K546M391L7195n833O512j3487j4560k5646j0991M9903J5866
14178A40831j6751j8779J9712q43j1432n807j3359n3199K8623K697J0158L3023
14166A14874P518j5143k9595m304j0571L0067K845q714N634j6125n510L486n088
$$ plain form
14251 337965 342458 293162 272927 276624 342205 401017 425640 430838 399692 382132 426838 505052
14239 505052 589582 626423 660944 677758 662382 702906 710178 727769 734910 763786 744772 722643
14227 722643 639699 556334 481768 420800 361682 319441 259471 217028 141555 131908 140231 152283
14215 152283 163116 121307 72904 98881 107029 114872 107167 85373 102698 97518 71623 59472
14203 59472 102024 144604 117839 110730 95167 41853 67961 95155 96559 87613 78871 75982 78179
14190 78179 94935 97481 101872 139067 133234 139746 126259 111699 86053 75062 124965 140831
14178 140831 124080 105301 125013 124170 112738 106931 93572 40373 68996 71693 81851 114874
14166 114874 122392 107249 77654 73350 62779 92846 95691 86977 92611 76486 70976 74462 69374
14153F9374L278r242R361J7255q600o960K3787m2979j8090J5184M3147L1143R869
14140A36527J216l5888l228m032o045J7045J0358k9697l8811R280K8786Q562J1739
14127A05812p890l7762L6486M1263m1539K7305j1621J8072P186M770J0830k6320
14115A26592j7607k5981l10p983Q246N2716J926J0445r533k490l3823J7766J9488
14102A39452m4573p797M3152J7816m5639k1913M9824K659j3823k373J7876J0316
14090A44977R997l1513k8015L4268L6545K6794P881j7488j6669l0244r180M098
14078A31451J3708J7283m77K4931k8594L476M0801J1589j629j0292l1387k0561
14066A50299K3277J2696J3137L6338k5934n5306l2392L036r151j4919J4113K3717
$$ plain form
14153 69374 72652 63410 72771 90026 81426 74466 98253 55274 37184 52368 95515 126658 136527
14140 136527 137743 101855 98627 94595 88550 105595 115953 86256 47445 56725 85511 94073 105812
14127 105812 97922 60160 96646 137909 96370 123675 112054 130126 137312 142082 152912 126592
14115 126592 108985 83004 82694 74711 82957 135673 137599 148044 138511 136021 102198 119964 139452
14102 139452 94879 87082 130234 148050 102411 80498 130322 132981 119158 116785 134661 144977
14090 144977 154974 123461 95446 129714 166259 193053 200934 183446 166777 136533 127353 131451
14078 131451 145159 162442 161965 186896 158302 161778 202579 214168 212539 202247 170860 150299
14066 150299 173576 186272 199409 235747 209813 154507 122115 125151 116000 101081 115194 138911
14054A38911L8157J8208j5333l1390k1259L688p047k168L7531L5360J2797M345
14042B11800K389o868Q745Q445K5263q935m2952q550L4256J3582N753M38N36o470
14028B37432J3436K2209j9145j4973k6470j8793m2599j6435o771J2494N2080m4585
14016A47880L0552N1589J775n9010n2486K219J8887M1553J1978O39j6824P803
14004A86555N967m014m0299J1519L2315J2622L4405K0993l6584j8428p536j897
13992A95618k5015K3317M604J7571N4154L2534j6893m3488m4288k6007n033N5180
13980B22254j7681n419K9595P817l0839k2351j7964L2276j3730l676q131K3470
13968A95621K0867J2000J8112k2786k6173J0444K0927r130j0680J4297K3377k935
$$ plain form
14054 138911 177068 195276 179943 148553 127294 130982 123935 121767 159298 194658 207455 211800
14042 211800 214189 207321 216066 224511 249774 240839 197887 189337 223593 237175 242928 243366 243902 237432
14028 237432 250868 273077 253932 238959 212489 193696 151097 134662 127891 140385 192465 147880
14016 147880 178432 230021 231796 172786 120300 122519 141406 182959 194937 195576 178752 186555
14004 186555 192522 188508 148209 159728 192043 204665 239070 260063 223479 205051 197515 195618
13992 195618 170603 193920 198524 216095 270249 302783 285890 242402 198114 172107 167074 222254
13980 222254 204573 199154 228749 236566 205727 183376 165412 197688 183958 180282 172151 195621
13968 195621 216488 228488 246600 223814 197641 208085 229012 219882 209202 223499 246876 243941
13956B43941k7689j6752K0973L3455O286J1416L3925o438M0973L7973J3792J0607
13944D02462J0242l1123j0162j081l0577k5313j0515R719j0455j4124n6103k5908
13932B07062K7341j7063J6238J2412K7664K2963k707k332L821J8515M68p492j2623
13919B94267M5692J4230k226j0179j684M6866J3846M3976J3443n1564k9275m577
13907C72815J4157L059J6069N950j5189r369J593J3549K6892j8114l0309k1434
13895C59669M42N9954K6091J4035L303J99k1163R917O6550M7153M7329l149r3
13882F10237Q777K3404L0510M7884O6404M1883J7183K1743o966J182J2921J6892
13870H92054N8409L7014N5753P6467O7148N6539N1241O6573Q8235N4308N1303
$$ plain form
13956 243941 216252 199500 220473 253928 260214 271630 305555 299117 340090 378063 391855 402462
13944 402462 412704 381581 371419 370338 339761 314448 303933 313652 303197 289073 232970 207062
13932 207062 234403 217340 233578 245990 273654 296617 293910 291578 295399 313914 314382 306890 294267
13919 294267 339959 354189 351963 341784 340100 386966 400812 444788 458231 406667 377392 372815
13907 372815 386972 390031 406100 412050 396861 387492 389085 402634 429526 411412 381103 359669
13895 359669 360111 420065 446156 460191 463494 463693 442530 452447 518997 566150 613479 610330 610237
13882 610237 619014 642418 672928 720812 787216 829099 846282 868025 861059 862241 875162 892054
13870 892054 950463 987477 1043230 1119697 1186845 1243384 1294625 1361198 1449433 1503741 1555044
13859A555044R1754J21321P7024Q9019J02970J17114J48473J54335J80387J87114
13849B824555J84048K03031K30947K77679L33429L36359M06802M82762N38921
13840E818533N78685O67806Q07473R42553J113459J313145J476495J749657K099740
13831A6567546K451672K963137L610342M350684N380943O560282P962114R447515
13823E9294235J0762131J1643915J1714904J0728219Q872813O792358M855932
13816A24664507L133940J319673q98839l485194n960079p722470q528089q470756
13808I4052693p857300o962174n969159m928798m020084l203069k434473j814279
13800E6863357j302154p56773j96028L62812Q57254J395038K005675K702814L465728
$$ plain form
13859 1555044 1646798 1768119 1845143 1934162 2037132 2154246 2302719 2457054 2637441 2824555
13849 2824555 3008603 3211634 3442581 3720260 4053689 4390048 4796850 5279612 5818533
13840 5818533 6397218 7065024 7872497 8815050 9928509 11241654 12718149 14467806 16567546
13831 16567546 19019218 21982355 25592697 29943381 35324324 41884606 49846720 59294235
13823 59294235 70056366 81700281 93415185 104143404 113016217 119808575 124664507
13816 124664507 127798447 129118120 128219281 124734087 118774008 111051538 102523449 94052693
13808 94052693 86195393 79233219 73264060 68335262 64315178 61112109 58677636 56863357
13800 56863357 55561203 54804430 54608402 54971214 55828468 57223506 59229181 61931995 65397723
13791F5397723M339074N361649O419363P486987Q466596R050690Q875106P786008
13783A23183196N755614L171345O18345j502404l289583n087135p305955r504338
13775A06039085j1191640j1943387j1647853j0605979r262481p870786o498274
13768C7018685n374057m442058l637094k990922k538716k156920j847287j566843
13760A2464788j388220j206986r99383q37260p81177o73679n80776n00504m58663
13751E038140l76887l54465k92478k97322k94143k52685k00894j28447j42480
13742B698339j85856j73444j38749q0751j17261j33192r8164o2532p7964j17169
13732A513257o8884o4965m7440o2062n2621n1999m5497n6453j9187m8670q611
$$ plain form
13791 65397723 69736797 75098446 81517809 89004796 97471392 106522082 115397188 123183196
13783 123183196 128938810 132110155 132728500 131226096 127936513 122849378 115543423 106039085
13775 106039085 94847445 82904058 71256205 60650226 51387745 43516959 37018685
13768 37018685 31644628 27202570 23565476 20574554 18035838 15878918 14031631 12464788
13760 12464788 11076568 9869582 8870199 8032939 7251762 6578083 5997307 5496803 5038140
13751 5038140 4661253 4306788 4014310 3716988 3422845 3170160 2969266 2840819 2698339
13742 2698339 2512483 2339039 2200290 2119539 2002278 1869086 1770922 1708390 1630426 1513257
13732 1513257 1444373 1379408 1331968 1269906 1217285 1165286 1119789 1063336 1044149 995479 986868
13721I86868k5168n2753k0588l8215n6191N90p38L2052K7822l1550o2944l3340
13709G25845q489k4053j1481j7337j0421m696j9657j3965J5771M9548P868l8759
13697F50174k8655J5731K4852j3638R66L560l7979n0518R764L0323M575l8427
13685E70728j9856O339k59l2950N178k4039j8440J4492j3922l4557k5924k5558
13673D01232K8978J1458J5953K7596J6715o968j1777k37k5970q056j4848k0080
13661D13996l1643R591J2327j167l0102k6620q52J9526J8436j5827J4653k7824
13649C54494m4248l0572j2447K8822J117l028n409j9762m0791M455k3444j5181
13637A94006L361o631J3708j1607J133j8371r382k1453j5553L8689J5167o872
$$ plain form
13721 986868 961700 908947 888359 850144 793953 794543 793805 825857 853679 822129 759185 725845
13709 725845 717356 693303 681822 664485 654064 649368 629711 615746 631517 681065 688933 650174
13697 650174 621519 637250 662102 648464 649430 652990 615011 564493 574257 604580 609155 570728
13685 570728 550872 557211 556952 524002 529180 505141 486701 501193 487271 452714 426790 401232
13673 401232 430210 441668 457621 485217 501932 494964 483187 482950 456980 448924 434076 413996
13661 413996 382353 391944 404271 403104 373002 346382 345530 365056 383492 367665 382318 354494
13649 354494 310246 279674 267227 296049 297166 294138 288729 268967 228176 232631 209187 194006
13637 194006 197367 190736 204444 192837 193970 175599 166217 144764 129211 167900 183067 176195
13625A76195l2819r852M214n2517o419L0759J9238n435k694N331o995m3285k5864
13612D9857K960J9834K3224O298p163j9328L526O83l831M3385k899O667l606L757
13598A23364m545k287M275j3784N2208r056m7798l762l8498k8854M5264L6842
13586A13369m147q145l6370j1938L4935o908k8281r816K4329q64M8021Q917j499
13573A21603m002j2666l50Q61q970k9040J0307J6316l009j186j2658m19j7150
13560E9637j4218L652M0153p955k7464m3143K174N141q039L5593j3162n0240K122
13547a5749J2173j8963Q568J4116O808O96l7835n146K2436K2822L1221j2517J2251
13534D0881J6476l5681N914L4211L0076j7398M224K3276k4976p604N97j5309q596
$$ plain form
13625 176195 143376 133524 137738 85221 78802 109561 128799 123364 120670 126001 119006 75721 49857
13612 49857 52817 72651 95875 102173 95010 75682 79208 79891 76060 119445 116546 123213 119607 123364
13598 123364 118819 116532 120807 107023 159231 150175 102377 98615 60117 31263 76527 113369
13586 113369 109222 101077 64707 52769 87704 80796 52515 42699 67028 66164 114185 123102 121603
13573 121603 117601 104935 104585 105446 96476 67436 77743 94059 91050 89864 77206 76787 59637
13560 59637 45419 49071 89224 81269 53805 10662 12836 17977 9938 45531 32369 -17871 -15749
13547 -15749 -3576 -22539 -13971 145 6953 7649 -30186 -35332 -12896 9926 41147 28630 40881
13534 40881 57357 21676 27590 61801 91877 74479 78703 101979 77003 69399 69996 54687 46091
13521D6091q575M4314k48k0783m2742J1364M2445O131l8991k3046K3046m6395
13509g389l2337n28M9918K8921K3680L561K0633L0080n605j7302j7553o815k7263
13496D2001K6737K3504Q508q049O348j7290j7586J050J2358K8318l1309o3411
13484A1179j7368N1924L8103k0050k8365N40K0710k3947j4402L3626M8907m323
13472I6534l4020l29J9898Q938j3009j6674j0470n465J0964O459P328l0158k593
13459C7403L225j7235J67J4029j7613k5883L1055M238J8022M0146J9865J2692
13447A20111m2602k786l2484l3135j4079p229J9931K8077k0612j3080K539P621
13435A2272m865P509K2552k4110J3771J7690j9407k9287L0341P957j196j7981
$$ plain form
13521 46091 37516 81830 81582 60799 18057 29421 71866 77997 39006 15960 39006 -7389
13509 -7389 -39726 -40254 9664 38585 62265 65826 86459 116539 110934 93632 76079 69264 42001
13496 42001 68738 92242 100750 92701 99049 81759 64173 65223 77581 105899 74590 11179
13484 11179 -6189 45735 83838 63788 35423 35963 56673 32726 18324 51950 100857 96534
13472 96534 62514 62185 82083 91021 78012 61338 50868 45403 56367 62826 70154 39996 37403
13459 37403 40628 23393 23560 37589 19976 -5907 25148 29386 47408 87554 107419 120111
13447 120111 77509 74723 42239 9104 -4975 -12204 7727 35804 15192 2112 4651 12272
13435 12272 7407 14916 37468 13358 27129 44819 25412 -3875 26466 34423 33227 15246
13423A5246J3570K5858m373L540L5496K9736O005J8254J68Q944l7212l7960J6834
13410I4106M249l0544m2236L4393P4982K349n5830k7921n699J994L4072K5654
13398A09569k2420j7259m809J1153O145j0189K3326m908Q712M249k2778j3005
13386F7786j1769l3525j2850K8585J9639J0315j8411J6909n764J5558o93L3390
13374A09170L6452J9088N596N212L4700M5341M2031L2715K0631M6694N8645N1459
13362E07734N1776L5381M1778P3374O934j7925j4251j9883k0529k5781l1305o4270
13350E23033n1978L4687k6181n0635k6279m6178M461m567J9692m3490m5354J4992
13338C02203K4320J2599K9592J7288l6P899L6241L6098O6974L4471L0535N9169
$$ plain form
13423 15246 28816 54674 50301 53841 89337 119073 125078 143332 143500 152444 115232 77272 94106
13410 94106 98355 67811 25575 59968 134950 137299 81469 53548 47849 49843 83915 109569
13398 109569 87149 69890 65081 76234 82379 72190 95516 90608 99320 103569 80791 67786
13386 67786 56017 22492 9642 38227 57866 68181 49770 66679 60915 76473 75780 109170
13374 109170 145622 164710 170306 175518 210218 255559 297590 330305 350936 397630 456275 507734
13362 507734 559510 594891 636669 710043 716977 699052 684801 664918 644389 618608 587303 523033
13350 523033 471055 505742 479561 428926 402647 356469 360930 356363 376055 332565 287211 302203
13338 302203 326523 339122 368714 386002 385966 393865 430106 466204 533178 567649 598184 657353
13326F57353j1716L3465K4640J6073K1786j3140m8841p4089m4377j1582m2404
13315E07168n2599q4948m5123l1237o6017n9332j7210n578M5983L882m5680j8776
13303A30533Q376j670L219k8623m659O895L1572K1388N32k1189n6478k0956j1507
13290E7433K713k326N9491j867k5077k9902q721K2692q643J267L123j490J9574
13277H8267K251k2124l2601L6023R637l580P088l2603k4926L102K8067M0718J3617
13264A12936k5178k3150k4892j3034R733o72J5859K9261L0067J7463N844J6580
13252A50817k6525j2023J3186L9664L3461l5724r311l9293k9537j87k1200k908
13240F0420p662L8792j2309k0571M954O2341M6879k9870l8381R156J9444N856
$$ plain form
13326 657353 645637 679102 703742 719815 741601 728461 679620 605531 561154 549572 507168
13315 507168 454569 369621 324498 293261 227244 167912 150702 145124 191107 194989 149309 130533
13303 130533 138909 137239 140458 111835 107176 114071 145643 167031 167563 146374 89896 68940 57433
13290 57433 60146 57820 117311 115444 90367 60465 51744 74436 65793 67060 70183 68693 88267
13277 88267 90518 68394 35793 71816 81453 77873 84961 52358 27432 30534 58601 99319 112936
13264 112936 87758 64608 39716 26682 36415 35743 51602 80863 110930 128393 134237 150817
13252 150817 124292 112269 125455 165119 198580 162856 153545 114252 84715 84528 63328 60420
13240 60420 52758 91550 79241 58670 63624 125965 172844 142974 104593 113749 133193 139049
13228A39049k8895l7806k5668L900R500m3670J025j3449N0538L2923P54J9967
13216A08168K089l9553l58M1957L2203l4237L847j1806j7l462j098l9245L877
13203F2365M5963J5186l1521j5461p107J7217m061k3413k0629K5837L9568m692
13191I9252l644j900K222K7725K9701L5478k4251j804k833j9783n5350n2731k846
13178B9236J2462N130N3315Q6031K5453k7934n5985l5902J0873J1938q710j6699
13166H9208l5501o181L2347j2098k453J8203J5753j0602p577M049O963j7810O2750
13153A37051N5815j7322k8357m3871k8924l2205J2430k1837K0328K2634R496j365
13141H3873j739P449K4138O084m811K4654K744j330L4920l7540j1646M4478K3518
$$ plain form
13228 139049 110154 72348 46680 50580 60080 16410 17435 3986 54524 87447 88201 108168
13216 108168 110257 70704 70346 112303 144506 110269 114116 102310 102293 98831 97733 58488 62365
13203 62365 108328 123514 91993 76532 69425 86642 82581 59168 38539 64376 103944 99252
13191 99252 95608 93708 95930 123655 153356 188834 164583 162779 159946 140163 84813 32082 29236
13178 29236 41698 46828 100143 186174 211627 183693 127708 91806 102679 114617 105907 89208
13166 89208 53707 47526 79873 67775 65322 83525 99278 88676 81099 85148 92111 74301 137051
13153 137051 192866 175544 147187 103316 74392 42187 54617 32780 53108 75742 85238 83873
13141 83873 82134 89583 113721 119805 114994 139648 142392 141062 175982 138442 126796 171274 194792
13128A94792l5416j1204K6814q967o660j997J21j4083p073r742l0285j2297O423
13115I0426J5423N6422K1321L6375N1487L9227M2765Q1707J15213J34290K36559
13104I21215L16264K10305J3377j41179j94843k02110j82889j53945q4827p6511
13094D24857m9406j1640m254k57j877K6659K8041O6311N2899O6295N9390K6657
13082F83675M0207L8777O4447R8216O8774L5854R8912J05612J67903J62780J02972
13071A668129k2290j31441j76408j77151j07309m4302p7717K57J2130l3685q4269
13060H25944n3396o8738o9801k177L1079k8030p5908p2128p3058k2922K1989J6238
13048D29092L3019O4673Q8998J05363J17132J88575K50146K63809J44485o4068
$$ plain form
13128 194792 159376 148172 174986 166019 159359 157362 157483 143400 136327 126585 96300 84003 90426
13115 90426 105849 162271 183592 219967 271454 310681 353446 435153 550366 684656 921215
13104 921215 1237479 1447784 1461161 1319982 1125139 923029 740140 586195 501368 424857
13094 424857 375451 363811 359557 359300 357423 384082 412123 478434 531333 597628 657018 683675
13082 683675 723882 762659 827106 925322 994096 1029950 1128862 1234474 1402377 1565157 1668129
13071 1668129 1645839 1514398 1337990 1160839 1053530 1009228 931511 931768 943898 910213 825944
13060 825944 772548 703810 634009 631832 662911 634881 558973 486845 413787 390865 412854 429092
13048 429092 462111 526784 615782 721145 838277 1026852 1276998 1540807 1685292 1621224
13038A621224k31555k70152k17025j42992j48036j06649p9995m8405m2906j0363
13028C23146k6163k8982j8155l5724j460K961k7709J6722l597n1865q464K4247
13016A64957Q990k6235j9351k6428J6144J2636j6221J8126K4387J1302K3064O575
13004A97946m3457n1760j8742J8643M3568K075K2224K4730O474j4440l5018L9349
12992A91592K3699j8701l2260k5221J7151j6108l7364o834L5146K7228J3170l6929
12980A34569l0945j6208q661K3887L4175j5636p360j8952R256L4007J9345L001
12968A60478o84P263j0091l1406N244J5183L2377r447j9568r510k1408r446M630
12955A13615M973l692M557L0599J0792p098K348j8006k07L531J7026k716J8862
$$ plain form
13038 1621224 1389669 1119517 902492 759500 611464 504815 424820 376415 333509 323146
13028 323146 296983 268001 249846 214122 212662 215623 187914 204636 201039 149174 140710 164957
13016 164957 173947 147712 128361 101933 118077 130713 114492 132618 157005 168307 191371 197946
13004 197946 154489 102729 83987 102630 146198 148273 170497 195227 201701 187261 152243 191592
12992 191592 215291 196590 164330 139109 156260 140152 102788 95954 131100 158328 171498 134569
12980 134569 103624 87416 78755 102642 136817 121181 113821 94869 104125 138132 157477 160478
12968 160478 159794 167057 156966 125560 130804 145987 178364 168917 149349 139839 118431 108985 113615
12955 113615 118588 114896 119453 150052 160844 153746 156094 138088 137881 141412 158438 155722 174584
12942A74584J7750J2104p541j4518J3737L329j7638k181j047J4063K0555k6023
12930A87174j682M6606j035m538k8863J9410j5864l8576L980K1083o706J468J9528
12917B01985K671M8437m659k4076j7120Q422J850n4947L4403N7750K4746K3401
12905C02863K1987J3337K3646N1559jj9398q672l4215o0612k2461j4875l0484
12893B22674J7914J7525J776Q896l340Q189j2632J7505J2501R446J7689K5205
12881C43348l2599K6468J4415k4501J714M2049N2409J0210L0684K6455m089k4912
12869D61651n3581n2730l0965n564J3123J8161k4070l3786R246L2411N2464K9877
12857D16237j6994K1646k7866j3358m0252k7116k433K7427K9025m9157l5132L2090
$$ plain form
12942 174584 192334 204438 196897 182379 196116 199445 181807 179626 178579 192642 213197 187174
12930 187174 185492 232098 231063 226525 197662 217072 201208 162632 166612 187695 180989 182457 201985
12917 201985 204656 253093 248434 224358 207238 215660 217510 162563 196966 254716 279462 302863
12905 302863 324850 338187 361833 413392 413391 393993 385321 351106 290494 268033 253158 222674
12893 222674 240588 258113 259889 268785 265445 273634 261002 278507 291008 300454 318143 343348
12881 343348 310749 337217 351632 327131 328845 370894 423303 433513 464197 490652 486563 461651
12869 461651 408070 355340 324375 318811 331934 350095 326025 292239 301485 333896 386360 416237
12857 416237 399243 420889 393023 379665 339413 312297 309864 337291 366316 317159 282027 314117
12845C14117R683M6056O8265M9026K4181J6072k8145m0528k6902l1207k9153k0245
12833C51220j0027k9109l1010K5966J3752O251j1764j6251m226L6924K1917M112
12821C57755k5027k6436k0196j85q462l467K9686L9019L6684P224m670n964j7785
12808C58176n325R174l928K6379j9383p9518l8243J3767M1623M9580M2447K6095
12796D20844M8958Q642m3584r085J5411K441m157L0765J1591j9706j6190J8840
12784D64770L6514M5555O0697J05864P5649N2492M5993L3407p765o961l9050o9806
12772G97359o8044o5020n7523j2938M247k2421l3434K8533J1149J4791Q689J2517
12760F17905R017J1357M8373K7921l9369J7092J8482k0808J9938J0371K5911K2757
$$ plain form
12845 314117 323800 369856 438121 487147 511328 527400 499255 458727 431825 400618 371465 351220
12833 351220 341193 312084 281074 307040 320792 327043 315279 299028 294802 331726 353643 357755
12821 357755 332728 306292 286096 285911 277449 273982 303668 342687 379371 386595 381925 375961 358176
12808 358176 352851 362025 358097 384476 365093 285575 247332 261099 302722 352302 394749 420844
12796 420844 469802 478444 434860 425775 441186 443627 439470 470235 481826 462120 445930 464770
12784 464770 501284 546839 607536 713400 789049 841541 887534 920941 913176 906215 867165 797359
12772 797359 729315 664295 606772 593834 598081 575660 542226 570759 581908 596699 605388 617905
12760 617905 626922 638279 686652 714573 675204 692296 710778 689970 709908 720279 746190 768947
12748G68947M4991N0816l7838m4863n1336n6128j9732j5476j1634k7753K1945
12737F21939K0463o409l2760l427K3314j4581j2392J6235K0821K1312K791J0892
12725F68198j4288K7747p948L9635J18205Q9127Q2271O4776M5768K4367O2990
12714A200848J8293o3591m1998n6551n0159j6497l997R505K1465M5988M2441N8566
12702A164313L1955L8731O9441N9728O2514M1812K9921O2499P8274K5329L7156
12691A701673R2181P8684O8083M3294Q7292P3111J19045J62496J30178J27498
12681B683535J38540J15238J34810J52858K11178K52609K37101K98133L54708
12672D578710M05795M96612O18101P36723Q64647R96228J081741J119372J175231
$$ plain form
12748 768947 813938 864754 826916 782053 730717 674589 654857 639381 627747 599994 621939
12737 621939 642402 635993 603233 599806 623120 608539 596147 612382 633203 654515 657306 668198
12725 668198 653910 681657 673709 713344 831549 920676 1002947 1067723 1113491 1137858 1200848
12714 1200848 1219141 1155550 1113552 1057001 1006842 990345 986348 995853 1017318 1063306 1105747 1164313
12702 1164313 1196268 1234999 1304440 1364168 1426682 1468494 1498415 1560914 1639188 1664517 1701673
12691 1701673 1793854 1872538 1940621 1983915 2071207 2144318 2263363 2425859 2556037 2683535
12681 2683535 2822075 2937313 3072123 3224981 3436159 3688768 3925869 4224002 4578710
12672 4578710 4984505 5481117 6099218 6835941 7700588 8696816 9778557 10897929 12073160
12663A2073160J341687J631786K149898K938818M083242N744130Q278514J2160018
12655E0401253J7952520K6184137L6522295M5635034M5496296K8244578j935913
12648B48500200k9052218m1619211m0369887l2344965k3308225j5793538j0322550
12641E5689606o467456l684680j436426P86185L134728N475493P687291R661885
12633G0846626J0583220R339546O976291O752185R807319J3725390J5598106J4797774
12625A58426457J3491839J5054208K0859160K9513157L5264272K8353167M812120
12618C05774380k4201329m1380292m1069453l0414524j8389820r074346k765049
12611A38479567N78001Q91274j573822n740608r102459r222015o469549m622050
$$ plain form
12663 12073160 13414847 15046633 17196531 20135349 24218591 29962721 38241235 50401253
12655 50401253 68353773 94537910 131060205 176695239 222191535 250436113 248500200
12648 248500200 219447982 177828771 137458884 105113919 81805694 66012156 55689606
12641 55689606 49222150 45537470 44101044 44887229 48021957 53497450 61184741 70846626
12633 70846626 81429846 90769392 97745683 104497868 114305187 128030577 143628683 158426457
12625 158426457 171918296 186972504 207831664 237344821 272609093 300962260 305774380
12618 305774380 281573051 240192759 199123306 168708782 150318962 141244616 138479567
12611 138479567 139057568 139948842 138375020 132634412 123531953 114309938 107840389 103218339
12603A03218339o368457r490859j0550728r319314o899064l970003p89350K360569
12595E8191133N805951J0489790J7330066K7098021L9419880N1197484N5688602
12588B65220927M3459496J0604268k9531487n4332340n6626055m6609373l4542930
12581I7642506k4372226j6878740j1695449q210161n987247m558201l580233k875152
12573A9485097k210488j708481j351829j185953j205512j213635j079533q84825
12565H644841o67327n39224n16344n66072n22045l64603l08855k60835j97086
12556D702450k11998k13729k23187k01298k14078k01834j61793j17992r2231r2672
12546B971638m9816m6760p396j6483n4570j24191j11853r2561l9194k5242k3260
$$ plain form
12603 103218339 96849882 87359023 76808295 67488981 60589917 56619914 55830564 58191133
12595 58191133 63997084 74486874 91816940 118914961 158334841 209532325 265220927
12588 265220927 308680423 319284691 289753204 235420864 178794809 132185436 97642506
12581 97642506 73270280 56391540 44696091 36485930 30498683 25940482 22360249 19485097
12573 19485097 17274609 15566128 14214299 13028346 11822834 10609199 9529666 8644841
12565 8644841 7977514 7438290 6921946 6355874 5833829 5469226 5160371 4899536 4702450
12556 4702450 4490452 4276723 4053536 3852238 3638160 3436326 3274533 3156541 3064310 2971638
12546 2971638 2921822 2875062 2867666 2851183 2796613 2672422 2560569 2468008 2428814 2403572 2380312
12535B380312J729J674M0716M1765P0503J62948K24022L51393L41711k5143k47219
12524C344411j59961j0759N0440J30549Q9666K4873j09537j15350j37486k9563
12514C077283N5618J6852o2229j58948k29117k54597j75482p7513o4604k280M627
12503B129610N1749N2991j58M816j464l3453n2685p4826p2580r7502j2684K9326
12491A923140M4938K7024N2405J17624J58118J46172R2961k7450j77273j61766
12481B195893r4394m4163M1044N919l4847r3671j05868j36877j01846m5348j7310
12470A568532O3669J60463K03500J93114J26649R177j27059k02052j51479j21954
12460A722560q8230j19301j03050q7659q4479n5915m8760n2395k1310P572j5443
$$ plain form
12535 2380312 2382041 2383715 2424431 2466196 2536699 2699647 2923669 3275062 3616773 3591630 3344411
12524 3344411 3184450 3173691 3224131 3354680 3444346 3469219 3359682 3244332 3106846 3077283
12514 3077283 3132901 3149753 3087524 2928576 2699459 2444862 2269380 2191867 2127263 2124983 2129610
12503 2129610 2181359 2234350 2234192 2239008 2237544 2204091 2151406 2076580 2004000 1906498 1893814 1923140
12491 1923140 1968078 1995102 2047507 2165131 2323249 2469421 2562382 2534932 2357659 2195893
12481 2195893 2101499 2057336 2098380 2104299 2069452 1975781 1869913 1733036 1631190 1585842 1568532
12470 1568532 1632201 1792664 1996164 2189278 2315927 2325104 2198045 1995993 1844514 1722560
12460 1722560 1634330 1515029 1411979 1324320 1239841 1183926 1135166 1082771 1061461 1069033 1053590
12449A053590o4737q3495j17038q4088p1685k2177m1273N610K2345l516j7891
12438E75645r63J6306n919L174m8829m4192o4832k4683o683j9530l6055j9370
12426C24069l754J8396K2245J6016P414j8662l2534p631j5132N276k2727m6423
12414B46553N1276N4482M229M103m5477o2592R334L7821J5059M8401j5910k8703
12402C18576K522l0691l2810J3115k2405K7132j1066l1880L5496N646m2349j8283
12390B13003N6317L4394r497n6703l8223k2701j997J8820L137j9786j4168M194
12378A66790P833P168o598J8101J4436o562p073K0109K8832K1249k9702k0403
12366B14180J0959L4282Q247J498J2417k5376Q216J5929p571k2111l0868j4874
$$ plain form
12449 1053590 988853 905358 788320 704232 632547 610370 569097 574707 597052 593536 575645
12438 575645 574682 590988 585069 588243 539414 495222 430390 405707 399024 379494 343439 324069
12426 324069 320315 338711 360956 376972 384386 365724 333190 325559 310427 315703 292976 246553
12414 246553 297829 352311 356540 360643 315166 252574 261908 299729 314788 363189 347279 318576
12402 318576 321098 290407 257597 270712 248307 275439 264373 232493 267989 273635 231286 213003
12390 213003 269320 303714 294217 237514 199291 176590 174593 193413 196550 176764 162596 166790
12378 166790 174623 181791 175193 193294 207730 201168 194095 214204 243036 264285 234583 214180
12366 214180 225139 259421 267668 269166 281583 256207 264423 280352 272781 250670 219802 204928
12354B04928K8236j336K2308K6585K143k3405L3602L3299L1697l07M3074P493
12342D08317N046O525p113K9506N8886O6440m4484q8970l4587k0470l6640l7177
12330C05279Q21K6462J3224r932l4889k5129n728K2323k8599o120r345m553K82
12317B44096N5847K4127Q738R700p981J7385K6206L3418K6096r550J3213J6872
12305D58167J2221n30k2372k4527k2924k8911Q998p654K4358K6059l1706k4032
12293C67147j3049k8412Q602K726k3590j4174Q140L435o097j3889r067N3676O3011
12280C98459L2640J4729L4656L37K1275Q683k5504l6812l5109l4096k9040m5760
12268C04458k3823l7146M2023L0035R433M766M4347l51K7846M2817p130N696K2873
$$ plain form
12354 204928 233164 231828 254136 280721 282864 259459 293061 326360 358057 357750 400824 408317
12342 408317 413363 419888 412775 442281 501167 567607 523123 434153 399566 379096 342456 305279
12330 305279 306100 332562 345786 335854 300965 275836 270108 292431 263832 257712 248367 243814 244096
12317 244096 299943 324070 332808 342508 334527 351912 378118 411536 437632 428082 441295 458167
12305 458167 470388 469858 447486 422959 400035 371124 380122 372468 396826 422885 391179 367147
12293 367147 354098 325686 334288 337014 313424 299250 307390 310825 304728 290839 281772 335448 398459
12280 398459 431099 445828 480484 480821 502096 510779 485275 448463 413354 379258 350218 304458
12268 304458 280635 243489 285512 315547 324980 329746 374093 373742 401588 444405 437275 442971 465844
12255D65844q581o2399q1022q041P810J7760N8490J5614j8920j4872L947J4410
12243C90040L8378L5637l2188l5120m1384m9134k8812J033L8099O7999J7255R177
12231D10980p395K5909K6639L531m461J1921R425q624k4221k320P5302Q8075M5508
12218F50269N8282N4211R2398J02849Q3404R2848R7869O6376Q1504M9368O0204
12207A489582o358o7578j28286j57896j15164p0008j6119N6292L5475K5151l0316
12196A014775q0866k6266j7444j2701N600K8873M9430L0136K5793J0641O358K2910
12184A057239J1712K7045J3988Q022j8925m212j9704m70O1411J32274J11445J5638
12172A395463o5255p6196k4806j8073P891M2345K6596K4806O1434N3978M1294
$$ plain form
12255 465844 457263 394864 313842 305801 313611 331371 389861 405475 386555 371683 375630 390040
12243 390040 428418 464055 431867 396747 355363 306229 277417 278450 316549 384548 401803 410980
12231 410980 403585 429494 456133 459664 455203 467124 476549 467925 443704 441384 516686 604761 650269
12218 650269 708551 762762 855160 958009 1041413 1134261 1232130 1298506 1380010 1429378 1489582
12207 1489582 1483224 1415646 1287360 1129464 1014300 944292 928173 984465 1019940 1045091 1014775
12196 1014775 933909 907643 890199 877498 883098 911971 961401 991537 1017330 1027971 1034329 1057239
12184 1057239 1068951 1095996 1109984 1118006 1099081 1094869 1075165 1074695 1136106 1268380 1379825 1395463
12172 1395463 1330208 1254012 1229206 1211133 1219024 1261369 1287965 1312771 1374205 1428183 1469477
12161A469477M1165L4968k2400o1554k2323M101L4132L9611Q0315J15862J83039
12150A896393P8682j6033j07624r4757l7168l277M5546J2588N317J7546N5927
12139A853140J95659K87900L16076K27895Q9074L1738R2665J07351J06228R3333
12129C401059l7656j75311k05581j23347j27510q6159n2146m036M4404J11038
12119B744755J37074J49146J48399J39880J52814K08554K07842J82113K58976
12110D329553L40776L64976L99335M97475O02641O65826Q43711J059049J151781
12101A0255123J290188J555037J948369K466323L155883M038679N339652P192313
12093C7241567J0012688J4264149K0858166L0505693M3188376N5617763N8535206
$$ plain form
12161 1469477 1510642 1545610 1523210 1461656 1439333 1443434 1477566 1517177 1597492 1713354 1896393
12150 1896393 1975075 1959042 1851418 1756661 1719493 1716216 1761762 1774350 1779667 1797213 1853140
12139 1853140 2048799 2336699 2652775 2880670 2969744 3001482 3094147 3201498 3307726 3401059
12129 3401059 3363403 3188092 2982511 2859164 2731654 2645495 2593349 2589313 2633717 2744755
12119 2744755 2881829 3030975 3179374 3319254 3472068 3680622 3888464 4070577 4329553
12110 4329553 4670329 5035305 5434640 5932115 6534756 7200582 8044293 9103342 10255123
12101 10255123 11545311 13100348 15048717 17515040 20670923 24709602 30049254 37241567
12093 37241567 47254255 61518404 82376570 112882263 156070639 211688402 270223608
12086B70223608M0618056L505669l3616211n2982384n2869701m2136920k9680015
12079A03062102j9709874j2630631p594097l986020j061493K130232N859809R033893
12071G5103921R713495O881463K975347K087143N417229J0826321J4823330J3968251
12063A41796500P385770j322538o526470m600506L756147J5583604K8065594L7691111
12055B21829212L9110116K7806360N741899j6948163k9062580k7302955j8580893
12048B02592996j2935928j3669145j7415667j9452190j7522942j2710929p575060
12041A01311135m855249o119911r613607j1679559j0670089p694320m462026j649842
12033D4566532Q20110K931480N000856Q035161J2614885J8937821K7072959L6192098
$$ plain form
12086 270223608 310841664 314347333 280731122 227748738 174879037 132742117 103062102
12079 103062102 83352228 70721597 63127500 59141480 58079987 60210219 66070028 75103921
12071 75103921 84817416 91698879 94674226 96761369 102178598 113004919 127828249 141796500
12063 141796500 149182270 147859732 141333262 136732756 140488903 156072507 184138101 221829212
12055 221829212 260939328 288745688 294487587 277539424 248476844 221173889 202592996
12048 202592996 189657068 175987923 158572256 139120066 121597124 108886195 101311135
12041 101311135 96455886 90335975 80722368 69042809 58372720 50678400 46216374 44566532
12033 44566532 45386642 48318122 53318978 61354139 73969024 92906845 119979804 156171902
12025A56171902M2810889L8663892J6425958j6388460m0439449m6014693l9213791
12018A12016248k9088124k0268726j3852617r522937o751255n078203m168136
12011B3286250l580852l019529k447615j957538j569124j235213r48684p34722
12003G792973o19218n63151n04935m23382m19007l89228l01533k76300k44090
11994D052129k09174j97823j92183j57929j33113j31170j81643j90187j27608
11985B531299j18150q6218n9243m3975m2442n7182q1709o6860p9599q3391l9755
11974A772775k5930k6035k5383n1450k2025m3684p3237l7414j9420J424j125L617
11962A452113L8303N0761R368n5195r7426q4951r8769p3315o9454n7884Q131K9713
$$ plain form
12025 156171902 198982791 237646683 254072641 237684181 197244732 151230039 112016248
12018 112016248 82928124 62659398 48806781 39283844 32532589 27454386 23286250
12011 23286250 19705398 16685869 14238254 12280716 10711592 9476379 8527695 7792973
12003 7792973 7173755 6610604 6105669 5682287 5263280 4874052 4572519 4296219 4052129
11994 4052129 3842955 3645132 3452949 3295020 3161907 3030737 2849094 2658907 2531299
11985 2531299 2413149 2326931 2267688 2223713 2181271 2124089 2042380 1975520 1895921 1812530 1772775
11974 1772775 1746845 1720810 1695427 1643977 1621952 1578268 1505031 1467617 1448197 1449621 1448496 1452113
11962 1452113 1490416 1541177 1550545 1495350 1397924 1312973 1214204 1140889 1071435 1013551 1021682 1051395
11950A051395J6800k2717r450J568k983k628m654k5299l1536j6501N2075N0212
11938A056282l4983k1992J7565l8236l5925L8385j19n4653m314J1835k4478k6186
11926H83181k4957M301l5349m1526J0325Q072r987o6982p2679j6905L1838j6547
11914F52785m7808j2644j3665j7766Q167J6145K7126R077K0714R0554N3013L4376
11902H20074R6923J00978j5429k9395m8498q8560q9603j09968j18261p1604k2668
11891D23989K595j2582n5498l7257r208K5576M727m8874m9680k3236k7357Q856
11879B02051k407L7110J3309l1591J9353N1223K0951O574J4645m690m3602n2237
11867B30689k1041k3587K0387l585L425O681K854J0749l312J240K2031N597j8296
$$ plain form
11950 1051395 1068195 1045478 1036028 1037596 1034613 1031985 1027331 1002032 970496 953995 1006070 1056282
11938 1056282 1021299 999307 1016872 978636 942711 981096 980977 926324 922010 933845 909367 883181
11926 883181 858224 862525 827176 785650 795975 804047 794060 727078 654399 637494 669332 652785
11914 652785 604977 592333 578668 560902 569069 585214 612340 621417 642131 732685 785698 820074
11902 820074 916997 1017975 1002546 973151 924653 836093 746490 636522 518261 446657 423989
11891 423989 426584 414002 358504 321247 312039 337615 342342 293468 243788 220552 193195 202051
11879 202051 199644 236754 250063 218472 237825 289048 309999 316573 331218 326528 282926 230689
11867 230689 209648 186061 206448 202863 206288 212969 215823 226572 223260 224500 246531 252128 233832
11854B33832J8432N688m2757k2584m714q714k9102m405K689l2328l2318q147K0499
11841I6071M7676l948L2130q77r759K1989n859k8623j5490o618L2205L8207Q770
11828B05874j9948l5938j5095o812j229m0995p2735J9534j5324K0983L1251p139
11816F2427K1086L3192M383N113J0995L3392K2848o339R054L927j8718M80l575
11803A78265K7487r866n6055n6786k5746P521L8709n297Q092k4778r840J3490
11791H5196K3837K8306j1057k2577k4003k1618O38K0742K1608j9196k0030L6254
11779I8100n586n979J4529k5310q600K6060q845j6084O136K3617K64l920K0175
11766A14557L7497l603l7273m4162P157J3018k177J3856n602l8227l1310L7170
$$ plain form
11854 233832 252264 257952 215195 192611 187897 179183 150081 145676 148365 116037 83719 75572 96071
11841 96071 143747 139799 171929 171052 161293 183282 177423 148800 133310 126692 158897 197104 205874
11828 205874 185926 149988 134893 128081 126852 85857 13122 32656 17332 38315 69566 62427
11816 62427 83513 116705 121088 126201 137196 170588 193436 187097 196151 200078 181360 181840 178265
11803 178265 205752 195886 139831 83045 57299 64820 103529 98232 106324 81546 71706 85196
11791 85196 109033 137339 126282 103705 79702 58084 58722 79464 101072 81876 61846 98100
11779 98100 92514 86535 101064 75754 67154 93214 84369 68285 74421 98038 98302 94382 114557
11766 114557 152054 148451 111178 67016 74173 87191 85014 98870 93268 55041 23731 60901
11754F0901K2668k9401k6808r759M8402O356M0653j3821M745m935p697K866R77
11741I5147k3240R864L2599J6335l1116J4749j2562k5913O544l2769L304P833
11729F0775K716k3442n292N3770M615m4819l355K2582j94P137n00O691J0801n375
11715H6110M133k1337k4056k3592j1189N476l929K0919K7825j4196k1625Q27J7602
11702D2968K1691J4044L1052k8978k4351k6398k9945m233K3156O693j1060J2975
11690B7614j708R18k1305k4703L6210M2755O831l4115k607J9747K0950L9697K290
11677A12574l2231r240M73k5408m1745p103J6386Q227L048L1074K1022K7092j5036
11664H9133l9243K7303k2903k5225k0168N6885P6841M3991J5797L3333M4601L9400
$$ plain form
11754 60901 83569 54168 27360 17601 66003 72359 113012 99191 103936 99001 91304 94170 95147
11741 95147 71907 81771 114370 130705 99589 114338 101776 75863 82407 49638 52942 60775
11729 60775 63491 40049 34757 88527 93142 48323 44968 67550 67356 74493 73993 80684 91485 86110
11715 86110 90243 68906 44850 21258 10069 15545 11616 32535 60360 46164 24539 25366 42968
11702 42968 64659 78703 109755 80777 56426 30028 83 -4150 19006 25699 14639 27614
11690 27614 25906 26824 5519 -19184 17026 59781 66612 32497 29890 49637 70587 110284 112574
11677 112574 80343 71103 71576 46168 4423 -2680 13706 21933 24981 56055 77077 104169 89133
11664 89133 49890 77193 54290 29065 8897 65782 142623 186614 202411 235744 280345 319745
11652C19745N2718J23729J60260J50846J93075K56918J99909M3806j14631k05052
11642A181323k37028k26226j43928p3960p8456m1966j2162k4967K792M8903K7861
11631D22186M9908M2107L4731J6428j0539J3951P8923J22615Q1938L4039k1246
11620H65041j8369M1038R5615J29322J35736J30701Q6864k0288j07919j40682
11610A197059j35528n7857n3336n5672o1232o6912o0619r7784r0545l8457j2619
11599D66498l4144p0461q4812k4403L809j6888K2168M1295O4586P4827N5478Q4466
11587E82419J01426J78050K25365J62375P6458m7393j63990k03333j82875j78304
11577E50198j18411r7732o8220l5898m6402l1759K7650K9767p4038k8484P834
$$ plain form
11652 319745 372463 496192 656452 807298 1000373 1257291 1457200 1501006 1386375 1181323
11642 1181323 944295 718069 574141 500181 421725 379759 367597 342630 345422 394325 422186
11631 422186 472094 514201 548932 565360 554821 568772 647695 770310 852248 886287 865041
11620 865041 846672 887710 983325 1112647 1248383 1379084 1465948 1445660 1337741 1197059
11610 1197059 1061531 1003674 950338 894666 833434 766522 705903 608119 517574 479117 466498
11599 466498 432354 361893 277081 252678 256487 239599 261767 303062 367648 442475 497953 582419
11587 582419 683845 861895 1087260 1249635 1326093 1278700 1114710 911377 728502 550198
11577 550198 431787 334055 265835 229937 183535 151776 179426 209193 135155 106671 114505
11566A14505j5857j1924p205j8829m377O4721m312p169O285K8137J5685l4942
11554A24718l8070n2804K526K4895J2115k798n0054j7352K7133L5580P870j287
11542G2472m218o945o743P803k0023r723Q869J0342R623J5129m3133j7017k222
11529A4214k9337J6458J708J264K7106J8448K1167q345J0786j1782R767K2244
11517I3698R206k9227n4500k0617j7126j513j767R93j3397J7844J756l875K3470
11504D945K7228J6153j4517r938j0667J7088J6246l590n9749l719K3948O431K287
11491A2146J3473L7157K8247M8031j3680n4878j8344L5511J7073R815j7920k2425
11479G4206p255k7327j7833k5665o300k3025l0393K5019N0734L0313k1425j8327
$$ plain form
11566 114505 98648 86724 79519 60690 56313 121034 116722 109553 115838 143975 159660 124718
11554 124718 86648 33844 36370 61265 73380 70582 20528 3176 30309 65889 73759 72472
11542 72472 68254 61309 54566 62369 42346 32623 41492 51834 61457 76586 33453 16436 14214
11529 14214 -15123 1335 3043 4307 31413 49861 71028 62683 73469 61687 71454 93698
11517 93698 102904 73677 19177 -1440 -18566 -20079 -21846 -20853 -34250 -16406 -14650 -18525 4945
11504 4945 32173 48326 33809 23871 13204 30292 46538 42948 -16801 -20520 3428 9859 12146
11491 12146 25619 62776 91023 139054 125374 70496 52152 87663 104736 114551 96631 74206
11479 74206 66951 39624 21791 -3874 -10174 -33199 -63592 -38573 12161 42474 21049 2722
11467B722M1132j5895J1043j0238K4254P1988M909k732N330J252k7709l9732O389
11454G2713L4743l8405q246L4230J2321k0356k8798k5485j5506k2004K0858J7101
11442C3166j9721N207j2815M0024Q097k0906O421k4116J1387k358p77J8255k5402
11429A6462r158K6396L932k1039k1685J8915J2480j2517K5367O74K9705K2387
11417I1919l0378r282j6389J8018q357j9572Q385j5587j0465N0154M4076o4610
11405C7912k1760K5429j808L593J5233P781n541k1414N497K3174L8156K9476l7654
11392I8074j5773J3204o1164o9690K4163L0890M7263o494J9350J1728k1035j9133
11380E1383j1408M936k3311r844L0671M74o194p952q090P515J4831R368L4964
$$ plain form
11467 2722 43854 27959 39002 28764 53018 125006 129915 127183 132513 133765 106056 66324 72713
11454 72713 107456 69051 60805 95035 107356 87000 58202 32717 17211 -4793 16065 33166
11442 33166 13445 18652 5837 45861 53958 33052 39473 15357 26744 24386 23609 41864 16462
11429 16462 7304 33700 37632 16593 -5092 13823 26303 13786 39153 39827 69532 91919
11417 91919 61541 52259 35870 53888 45531 25959 34344 18757 8292 58446 102522 37912
11405 37912 16152 41581 39773 43366 58599 66380 60839 39425 44922 68096 106252 135728 98074
11392 98074 82301 95505 34341 -35349 -11186 19704 66967 60473 79823 91551 70516 51383
11380 51383 39975 44911 21600 11756 42427 42901 36707 28755 20665 28180 43011 52379 87343
11367H7343J8880q691k8937j4485j0068p381j2617K5650J4559j4151r706K9075
11355F9471M1608Q643l6649J5165M908k0506k0427k3357l664M074K462J3393K6849
11342H1970K4730j5532k6069l1597p933J3831N3656j9539j1545q651l2268M957
11330B6010M3503K2371K450J463l5640K7271M9878L1731k0188l9538j8273K5892
11318A16930M2525j3805l5208l2813J6393J499L357J0803o069L263j0287K148
11306I8736l9727r89M7010K9633m5237k8090K9590L4410K7030L834k7041N225
11294A34384n1606m6951L8067O2233O653j6339o756p893M215J3560P570J2756
11282A49893J0312n7296j2551J628K7650J047j4176j7025J5654N959k8004n450
$$ plain form
11367 87343 106223 97532 68595 54110 44042 36661 24044 49694 64253 50102 40396 69471
11355 69471 111079 119722 83073 98238 103146 82640 62213 38856 35192 39266 41728 55121 81970
11342 81970 106700 91168 65099 33502 25569 39400 93056 73517 61972 53321 21053 26010
11330 26010 69513 91884 94334 95797 60157 87428 137306 169037 148849 109311 91038 116930
11318 116930 159455 145650 110442 77629 94022 95521 98878 109681 103612 106875 96588 98736
11306 98736 59009 58020 105030 134663 89426 61336 90926 125336 152366 156200 129159 134384
11294 134384 82778 35827 73894 136127 142780 126441 119685 111792 116007 129567 137137 149893
11282 149893 160205 102909 90358 91986 119636 120683 106507 89482 105136 111095 83091 77641
11270G7641N01j5779k375o529K5218L200J7492N0565K3436K1839n2660j6076r424
11257A17049P019k5496M01R128k8022R87J8276L351k203J9533m1363p465M5656
11244A16851L0158K9938K7471K6601k6807k3881j7229j9206k4358R177P727o6029
11232G0413J9816L7476R222P181K0494L6958j8775j3895J2619K169j9212j8231
11220A46235J7160J6620j3694m7502L7022L6785k7625k6055l062k2656J1958L6183
11208A61369M732k0355R566L7149M7854k5443M152L2051K3420L6453N7309p613
11196C60644q6772n1390q476R073q318N461Q003J218K0597J2025j7660k6262K8656
11183B46799M7527j0388j6748k1681K6528L0930K3931Q332J7400l1032j1868P582
$$ plain form
11270 77641 78142 62363 59988 53459 78677 81877 99369 149934 173370 195209 142549 126473 117049
11257 117049 124068 98572 98973 108101 80079 81066 99342 102693 100490 120023 78660 71195 116851
11244 116851 147009 176947 204418 231019 204212 180331 163102 143896 119538 128715 136442 70413
11232 70413 90229 127705 136927 144108 164602 201560 182785 168890 181509 183678 164466 146235
11220 146235 163395 180015 166321 118819 155841 192626 165001 138946 135884 113228 125186 161369
11208 161369 166101 145746 155312 192461 240315 214872 219024 251075 274495 310948 368257 360644
11196 360644 273872 222482 214006 223079 214761 220222 228225 229443 250040 262065 244405 218143 246799
11183 246799 294326 283938 267190 245509 272037 302967 326898 335230 352630 321598 309730 317312
11171C17312K2611M6405K8178K2029L411n020j9954j3908N1671L2568n35n828
11159D78940l30K9663K4238J9946J1445N5695O7877L085N690K8156j2972N7933
11147G69366O3178M1859K4316N1111P2011J3095K8520Q4447J10496J02655R3280
11136A454334R2001R7545R5373J19396J62870J55207J87010J87157K49966K65544
11126C066403K97694L57973L99021M75862M77050N74939P20801Q09119R26899
11117H105761J074101J222974J408102J617245J822182K079755K316252K364051
11109B2010423K291152K051929J705466J160532M94180j12199o20488j018053
11101B7962942j281366j378661j452095j418264j231258j100795r53662p96673
$$ plain form
11171 317312 339923 386328 414506 436535 439946 434926 414972 401064 452735 485303 484768 478940
11159 478940 478610 508273 532511 552457 563902 619597 687474 690559 696249 724405 711433 769366
11147 769366 832544 874403 898719 949830 1021841 1034936 1063456 1147903 1258399 1361054 1454334
11136 1454334 1546335 1643880 1739253 1858649 2021519 2176726 2363736 2550893 2800859 3066403
11126 3066403 3364097 3722070 4121091 4596953 5074003 5648942 6369743 7178862 8105761
11117 8105761 9179862 10402836 11810938 13428183 15250365 17330120 19646372 22010423
11109 22010423 24301575 26353504 28058970 29219502 29713682 29601483 28980995 27962942
11101 27962942 26681576 25302915 23850820 22432556 21201298 20100503 19146841 18350168
11093A8350168o65104n26199l50810j74018m3618Q7214K17898L91237N59704P43672
11083A8590144R36161J227232J497862J854289K278132K780861L395302M051229
11075C6611212M722417N484081O116572O395125O106482N054894L146815M93154
11067G4130752k186149m404140n746314o241503o182758n685228n000341m288543
11059C4395776l581443l006297k500088k068022j743663j451041j180899r51169
11051A7913154p37797n61053m00192j98901n9332N3184J54522L52843M80765N92006
11041A7589199P71575R05074J025300J178210J264520J325033J299996J143007
11033B6501914Q28569M20357j07188o72833j275425j743051k000264k095020k063031
$$ plain form
11093 18350168 17685064 17158865 16808055 16634037 16590419 16677633 16895531 17286768 17846472 18590144
11083 18590144 19526305 20753537 22251399 24105688 26383820 29164681 32559983 36611212
11075 36611212 41333629 46817710 52934282 59329407 65435889 70490783 73637598 74130752
11067 74130752 71944603 67540463 61794149 55552646 49369888 43684660 38684319 34395776
11059 34395776 30814333 27808036 25307948 23239926 21496263 20045222 18864323 17913154
11051 17913154 17175357 16614304 16214112 16015211 15955879 16009063 16163585 16516428 16997193 17589199
11041 17589199 18360774 19265848 20291148 21469358 22733878 24058911 25358907 26501914
11033 26501914 27330483 27750840 27643652 26970819 25695394 23952343 21952079 19857059 17794028
11024A7794028j979901j837162j643152j425822j209023j094612r79254q35317
11016F789785p17697o51421m91702m53161m11609l57180l19962l05004k42076
11007B839973k27386k11187j44888j18301j66956j19468j23455j36999p0345n1409
10997A469579n3571p2590j27035n0194k5041m7916o3704m1347k7990o4940n0652
10986H44599l0067q1539j0709j800j0447k9438k4044m1557l0009j0711J083l1833
10974E43528n0188j377J3101J4394k0509l5782j2158l5835l6021M0140n385o1720
10962C52188j793L4052L0407J1572j6265l1529j3534m5184P321J4486J7006L6956
10950C95683m2320k8124j963K6934K6672J648p631k6305m1829J6510k0568m8499
$$ plain form
11024 17794028 15814127 13976965 12333813 10907991 9698968 8604356 7625102 6789785
11016 6789785 6072088 5420667 4928965 4475804 4064195 3707015 3387053 3082049 2839973
11007 2839973 2612587 2401400 2256512 2138211 1971255 1851787 1728332 1591333 1520988 1469579
10997 1469579 1416008 1343418 1216383 1166189 1141148 1093232 1029528 988181 960191 895251 844599
10986 844599 814532 732993 722284 720484 710037 680599 656555 614998 584989 574278 575361 543528
10974 543528 493340 491963 505064 519458 498949 463167 451009 415174 379153 419293 413908 352188
10962 352188 350395 384447 414854 426426 410161 378632 365098 319914 327235 341721 358727 395683
10950 395683 353363 325239 323276 350210 376882 378530 370899 344594 302765 319275 298707 250208
10938B50208j2805L9033k4964n8902j4704N703K5706M6749p79J5602j4000k5608
10926B31239j5775j463O576j3310l9529k9584J587j1640K1551K4873L4187M3040
10914B51752j6985m0419q99K6161K1622m6278l7933j0367J995n48J6592P282j1446
10901A60529L492k6823j6930m847o915J997L3457M877P86j4751K042L2686j0928
10888A58672J2285Q022j4176n3558j8572j0425k3792J2597J8587l1019k207l160
10876E3254J5778R728p045n670P373Q356K4012J5216r208j349l425K3745k2391
10863A08374J3305k5720j1780K178J7339J274k5584l2742L068o390L410m3756
10851B976l2405J0863K5227L7641k396R680J2643r983l2075L236K9038L1116k7690
$$ plain form
10938 250208 237403 276436 251472 192570 177866 183569 209275 256024 255245 270847 256847 231239
10926 231239 215464 214001 220577 207267 167738 138154 139741 128101 149652 174525 208712 251752
10914 251752 234767 194348 193449 219610 241232 194954 157021 146654 148649 148101 164693 171975 160529
10901 160529 164021 137198 120268 115421 108506 110503 143960 148837 149623 134872 136914 169600 158672
10888 158672 170957 178979 164803 111245 92673 82248 58456 71053 89640 58621 56414 53254
10876 53254 69032 78760 71715 66045 73418 81774 105786 121002 111794 110445 107020 130765 108374
10863 108374 121679 95959 84179 86357 103696 104970 79386 46644 49712 43322 46732 2976
10851 2976 -29429 -18566 6661 44302 41906 51586 64229 54246 22171 25407 54445 85561 57871
10838E7871l2628k1001J8618j6349K1524O434K6004J6785k7212l2009j745J3853
10826C0145l676J9704J2294J2472Q983k7912n987j3653j2839J4236N3349K4316
10814A11432K282k3794j7581K1987q66k4716K950j7324j9704j3084j4755L0877
10802C7704J9544l0296O441P997j1530N236k6255J8112k0005j0955P777Q559K702
10789A5031j0430J622j1921J4478J929K130r82J8022K8022j4029P122j4202q554
10776B8238K5114K4741n065N428j4340j0224P415j5977k1006p032L3372k329J2698
10763F1033J3276k0224l5470K4408l533O136k1333Q068K6067j252J2427L965N493
10750G9061l3972k4029j2709O945J6143O0544R884j5202N952j7905j2364m958
$$ plain form
10838 57871 25243 4242 22860 6511 28035 34469 60473 77258 50046 18037 16292 30145
10826 30145 26469 46173 58467 70939 79922 52010 46023 32370 19531 33767 87116 111432
10814 111432 113714 89920 72339 94326 93460 68744 71694 54370 34666 21582 6827 37704
10802 37704 57248 26952 33393 41390 29860 35096 8841 26953 6948 -4007 3770 12329 15031
10789 15031 4601 6223 -5698 8780 10709 12839 11857 29879 57901 43872 50994 36792 28238
10776 28238 53352 78093 73028 78456 64116 53892 61307 45330 24324 17292 50664 48335 61033
10763 61033 74309 54085 18615 43023 39490 45626 24293 32361 58428 57176 69603 73568 79061
10750 79061 45089 21060 8351 15296 31439 91983 101867 86665 92617 74712 62348 57390
10738E7390J7718j9031k1317m070K8405k2529j5245N436k5376m6513o203j5223
10726f6558q749L1989L7842J440M692P800K8454j1528l755r629K7737J6874k7632
10713B8977l5729j1943L169L1839J0055p258R311j5605l7530J2148K8927J7821
10701C4182Q943J6615K0356j5643j8455M333m7071k7597K2562L9434N482j9565
10689B3576l843k1082l606M1016k1005l8411L4922Q5870N503k068L6349j4324
10677A22897l1369l4998j342q489J0159j2086k209j3888k9477l8872r654o40O668
10664d3300k807N788L787J8957j701M7381R650k9731l3300j2929j7479K272M2661
10651a0751L8175l958Q639N281O265n2267j325r046J9452k332j0190K5792j8422
$$ plain form
10738 57390 75108 56077 34760 30690 59095 36566 21321 26757 1381 -45132 -51335 -66558
10726 -66558 -75307 -43318 -5476 -4036 656 8456 36910 25382 21627 11998 39735 56609 28977
10713 28977 -6752 -18695 -15526 16313 26368 19110 28421 12816 -24714 -12566 16361 34182
10701 34182 43125 59740 80096 64453 45998 50331 3260 -24337 -1775 37659 43141 23576
10689 23576 19733 -1349 -4955 36061 15056 -23355 11567 97437 102940 100872 137221 122897
10677 122897 91528 56530 55188 46699 56858 44772 42563 28675 -802 -39674 -49328 -49968 -43300
10664 -43300 -46107 -40319 -36532 -17575 -19276 28105 37755 8024 -25276 -38205 -55684 -53412 -10751
10651 -10751 27424 23466 32105 37386 43651 -8616 -9941 -18987 465 -1867 -12057 13735 -4687
10638d687J5214L3088K899J8405J4601K2571J1039k8098n1790n725j7183j4256
10626c922P781k5749J1127J02K0195L8818j0635j4525r990J8764J3896k2291l5110
10613a1539k0626J8093M2517n544k3192M4773J3938k8363k5481j6644M7949j2662
10601B3219k6602K7833L7574J5822R759m8277k4348M1231R799J2321k0449k2007
10589C5875l9243n3938L6122K6620J194J543J3528n810K9135K4823j8042j5330
10577C6477j2076j2089P45p8J2517J0120J3334n088M354L2104R899j8261m0060
10564C1898l1854k0738k5701j0080j0179K3902N1652R935q941j6248j2102P351
10552a1105K3701M681J6164o244k1505q417J834n776R117p3M310j4629R412J8821
$$ plain form
10638 -4687 10527 43615 46514 64919 79520 102091 113130 85032 33242 27517 10334 -3922
10626 -3922 3859 -21890 -10763 -10661 9534 48352 37717 23192 13202 31966 45862 23571 -11539
10613 -11539 -32165 -14072 28445 22901 -291 44482 58420 30057 4576 -12068 35881 23219
10601 23219 -3383 24450 62024 77846 87605 39328 14980 56211 66010 78331 57882 35875
10589 35875 -3368 -57306 -21184 5436 6630 8173 21701 15891 45026 69849 51807 36477
10577 36477 24401 12312 13057 12979 25496 35616 48950 43862 48216 80320 90219 71958 31898
10564 31898 44 -20694 -46395 -56475 -66654 -42752 8900 18835 9894 -6354 -18456 -11105
10552 -11105 12596 17277 33441 27197 5692 -2725 -891 -6667 2450 2377 6687 -7942 1470 20291
10538B0291P123n030J6914P084M204j5242n7405m5946o68L4881K6978M9307P431
10525D9922J4073M058m9909k1515j626r295j9951k1984J2429L0127K0059K91L18
10512F997R76J2714k399J6652L2444m3563n6743q166R968J5561M9523j062k0738
10499A2164J20Q309J8140L2955k9540n579k1376n707j0630m1797m3467j5997L7473
10486f4932J1184K1293L870K3202J6485O056J4573j5659k9890p526r002L3210
10474B864N5329K0613k3227k009l8945j0135L789K2809M6730L5220N58l4751M739
10461H3584l8908o4132l3311J370N3162M6703m187j0316K1630K0924q098k8341
10449D0080k4950M753j2800n384Q020k2364J7598J3387j2906J7144J7065o183
$$ plain form
10538 20291 27414 22384 39298 46382 50586 35344 -22061 -68007 -68675 -33794 -6816 42491 49922
10525 49922 63995 68053 18144 -3371 -4997 -14292 -34243 -56227 -43798 -13671 6388 6679 6997
10512 6997 7973 20687 18288 34940 67384 23821 -32922 -41088 -31120 -15559 33964 32902 12164
10499 12164 12284 20593 38733 71688 42148 36569 15193 9486 -1144 -42941 -86408 -102405 -64932
10486 -64932 -53748 -32455 -28585 -5383 11102 17158 31731 16072 -13818 -21344 -30346 2864
10474 2864 58193 78806 55579 53570 14625 4490 8279 31088 77818 113038 113596 78845 83584
10461 83584 44676 -19456 -52767 -51397 1765 48468 44281 33965 55595 76519 68421 40080
10449 40080 15130 19883 7083 1699 9719 -12645 4953 18340 5434 22578 39643 33460
10437C3460r039l4102n0744J4449K8590l0994J1266M1117j1691J6989K4241K4636
10425E8178J1091q783n6736p580L6081L3729m127o7802n3813L1555J2685j4747
10413c0269k9138J6949K8159L3210J7205j2441l9085K806N1436J622J490O631
10401D8575L6361j6677k5109k2343k2973K2894j5875k8470J7228K0617l0646K2523
10389F105K9150K428Q742j4091q384j4132l0292j0072l3120j2262J7623M2885
10377a5420l702k7299j4677J0095N6521l172l7850q68j287N605J7695K6515k8391
10364a6235l6248k1159J5270O768L1709L6831J8556K8668L931k3890j546k2764
10352A9891k4527j6051J0512J4646p268J0566K653k0119j7873J6571O5440l4375
$$ plain form
10437 33460 24421 -9681 -60425 -45976 -17386 -48380 -37114 4003 -7688 9301 33542 58178
10425 58178 69269 60486 3750 -3830 32251 65980 61853 -5949 -59762 -28207 -15522 -30269
10413 -30269 -59407 -42458 -14299 18911 36116 23675 -15410 -12604 38832 40454 41944 48575
10401 48575 84936 68259 43150 20807 -2166 20728 4853 -23617 -6389 14228 -16418 6105
10389 6105 35255 37683 46425 32334 23950 9818 -20474 -30546 -63666 -75928 -58305 -15420
10377 -15420 -19122 -46421 -61098 -51003 5518 2346 -35504 -36372 -37659 -32054 -14359 12156 -16235
10364 -16235 -52483 -73642 -58372 -51604 -19895 16936 35492 64160 68091 44201 42655 19891
10352 19891 -4636 -20687 -10175 4471 -2797 7769 10422 -9697 -27570 -10999 54441 20066
10340B0066n0089k8152N271J5895J0030L139P913k7555j4455J1800k048r040j3635
10327g0860K0787N5681R440k4697j4613L7382K7305J5515p2483m9885J4200J9987
10315c2241N4972J500k6838j9160m987M2898Q2520n826k7955j3311j9902l0358
10303A312K9561L8232m533M552j2443o1551j5717J6954J874J123k6509R595n951
10290b3501j9505L036O2634J1567l8046p403N5201K7062l4539q126j0590j7085
10278G05o024p929j0179p412K0915j310L1627L9369J5961m4892k4139O072r182
10265C582K352J2129K0677L3619M854k0009k0531R818j7076r041q827L7817K558
10252E1922l5606j6505q77K0687J4512l37q265m923J224j4978J2333Q862M707
$$ plain form
10340 20066 -30023 -58175 -52904 -37009 -26979 -23840 -15927 -43482 -57937 -46137 -48185 -57225 -70860
10327 -70860 -50073 5608 15048 -9649 -24262 13120 40425 55940 -16543 -66428 -52228 -32241
10315 -32241 22731 24231 -2607 -21767 -26754 16144 98664 92838 64883 51572 31670 1312
10303 1312 30873 69105 64572 69124 56681 -4870 -20587 -3633 -1759 -636 -27145 -17550 -23501
10290 -23501 -43006 -39970 22664 34231 -3815 -11218 43983 71045 36506 28380 17790 705
10278 705 -5319 -13248 -23427 -30839 -9924 -11234 20393 59762 75723 30831 6692 12764 3582
10265 3582 5934 18063 38740 72359 77213 57204 36673 46491 29415 20374 11547 49364 51922
10252 51922 16316 -189 -1066 19621 34133 33796 25531 20608 21832 6854 19187 28049 32756
10239C2756p407p991l1150l5472j6120J3409J5584M9437J0620J6048L0718J8266
10227H8698O751p1829l0788M333L644J0722K5124l2034l4968k8500L4189K6044
10215A386K4269J9980j8465l1059k5270j647j0169J9991M919K9973Q298J5753
10203C7959l6988k8892L425R24J953O643K1125j2850k6874J3352J5554K3587K8416
10190D7334J4518j4823k2114K205J8860K5856j8522m2289j6092L1465K9369L23
10178E6090J1734o838J4380k3112J686l084R725J3475J2794K4107j0351J4570
10166A15176k5851n175l8633o4540j9697K7734M5095p485j7462J0295q704k9285
10154a8532m2020Q192L3828m953k2810j7213K1177n231p807P819P676L312L4096
$$ plain form
10239 32756 25349 17358 -13792 -49264 -65384 -51975 -36391 13046 23666 39714 70432 88698
10227 88698 95449 23620 -7168 -2835 809 11531 36655 4621 -30347 -58847 -24658 1386
10215 1386 25655 45635 27170 -3889 -29159 -30806 -40975 -20984 -16065 13908 22206 37959
10203 37959 971 -27921 -24496 -23572 -21619 -14976 6149 -6701 -33575 -20223 -4669 18918 47334
10190 47334 61852 47029 24915 27120 45980 71836 53314 11025 -5067 26398 55767 56090
10178 56090 67824 60986 75366 52254 53940 50856 60581 74056 86850 110957 100606 115176
10166 115176 89325 84150 45517 -19023 -38720 -10986 34109 26624 9162 19457 10753 -18532
10154 -18532 -60552 -52360 -18532 -23485 -46295 -63508 -42331 -47562 -55369 -47550 -39874 -36562 -2466
10141b466J3216l7500J4325n22n7265P617N8650K7775q053n2771m0137m181P550
10128g3762n661M9242j5606p2418J6268M4243K4507L1144J2623o153j1161L0163
10116B3429l799J3919k7694J7186k713J255L0527M604M462j8090n230K1202O503
10103F5561q580J6852K421p079k5829j1025k0584J162m3284k469J2262M7653Q349
10090C5410l3104q409O2636J91m0723j822k712J0034K1968K7260k9788K020K3429
10077F6390o1238k1009K7645J548n52M19n859j0136N2405j9970m1228q429J7582
10064b432J5641Q007K2357J5797J2150k4713k7765M7989J1321J1997K9947J2095
10052A32391m615q525K7727p151L003L7266N6513M4647K2651P1552J57062K50156
$$ plain form
10141 -2466 10750 -26750 -12425 -12947 -70212 -62595 -3945 23830 15777 -36994 -77131 -81312 -73762
10128 -73762 -79423 -30181 -45787 -118205 -101937 -57694 -33187 -2043 10580 4427 -6734 23429
10116 23429 19630 33549 5855 23041 20328 21583 52110 56714 61176 43086 37856 59058 65561
10103 65561 56981 73833 76254 69175 43346 32321 11737 12899 -30385 -32854 -20592 27061 35410
10090 35410 2306 -6103 56533 56724 16001 14179 11467 21501 43469 70729 40941 42961 66390
10077 66390 5152 -15857 11788 13336 12784 13203 7344 -2792 49613 29643 -11585 -20014 -2432
10064 -2432 13209 21216 43573 59370 71520 46807 19042 67031 78352 90349 120296 132391
10052 132391 127776 119251 146978 139827 142830 180096 236609 281256 303907 375459 532521 782677
10040G82677M37212P71670J529992K884881L245049m24921l002504k611692j470593
10031B141771p34921m63394k55654j49130j05804p8133o0458p1072k1455m563
10021A97187n4506n6921P771q62J8762K434k4861l6516j3283J9431N1506P713
10009A17855j7317j1221j0345k6995J1117m633j9290J0373J308k2881o498j5929
9997E544J5448J1417J7831P125m0897j7678J5920L902l173j9222l3433K9302J7414
9984I500j2470j9221M193J3415L1291M5608J1035j2783j3436j8015l8702L3869
9972C4284M536R855J9332L240j9000k5615j869j360K7176j9754l1373P143R316
9959A5911J3734j4804K0241K1572m762k0735J1461k998J953r797j0516p044k833
$$ plain form
10040 782677 1219889 1991559 3521551 6406432 9651481 9226560 6224056 3612364 2141771
10031 2141771 1406850 943456 687802 538672 432868 354735 294277 223205 201750 197187
10021 197187 142681 85760 93531 92669 111431 113865 89004 52488 39205 58636 110142 117855
10009 117855 100538 89317 78972 51977 63094 58461 39171 49544 50852 27971 21473 5544
9997 5544 20992 32409 50240 57365 16468 -1210 14710 18612 15439 -3783 -37216 -7914 9500
9984 9500 -2970 -22191 -17998 -4583 26708 72316 83351 70568 57132 39117 415 34284
9972 34284 38820 48675 68007 71247 52247 26632 24763 23403 50579 30825 -548 6595 15911
9959 15911 29645 14841 35082 56654 51892 31157 42618 39620 41573 31776 21260 14216 11383
9946A1383J9712m969l1171k0495j2289J0004J9089k611j5144J6732L1383K2789
9934D4413p035q860k5616K3311J4210m2011p0529o599O8216K2193K589k3782Q260
9921a240L1194m9327k4763k3030J0121J8982K4476K952K7908J8480J4277r661
9909D0369l5500n499L6603n002j2864J049J5273l7925m0229J6428q49K1899K7603
9896B1356j6242O3535M8143n2503l6568j4244n932K3138j0064l03K9833L157p41
9883E2565L2904M1154K1923m4814k5842L085K741k852l3235j6793l8026j0733
9871a7923l0703k0317K7211J3672J2922M8695j0091k2481M9838m043m360P849
9859E0269k5637K403j0195K0846k0841l4329k5187J552M2703L0272L735K254k9554
$$ plain form
9946 11383 31095 26126 -5045 -25540 -37829 -27825 -8736 -11347 -26491 -9759 21624 44413
9934 44413 37378 28518 2902 26213 40423 -1588 -72117 -78716 -10500 11693 14282 -9500 -1240
9921 -1240 29954 -19373 -44136 -67166 -57045 -38063 -13587 -10635 17273 35753 50030 40369
9909 40369 4869 -630 35973 30971 18107 19156 34429 -3496 -43725 -27297 -28146 -6247 21356
9896 21356 5114 68649 116792 64289 27721 13477 7545 30683 20619 20316 50149 53306 52565
9883 52565 85469 126623 148546 103732 77890 80975 83716 80864 47629 30836 -7190 -17923
9871 -17923 -48626 -68943 -41732 -28060 -15138 33557 23466 985 50823 46780 42420 50269
9859 50269 24632 27035 16840 37686 16845 -17484 -42671 -41119 1584 31856 35591 37845 8291
9846H291N3903K9588J8219J4278l978j8120R503p877o9687q549J2497k1196K4546
9833D1418N2508q359J244L0733j4139l4388j389m0549P659l240J4453J3271q377
9820E0845k3649k4954k1674j838r980r161L6366L5945J5421j716j508L3951J9742
9807I7790k3316j1606J7728J9333K0490K7411k3228l2557m9619l7886r143K8818
9795B4215K3133k2882J3906J7155L4548J0623m7496l0309k1476K0555K3867j2500
9783C3339j0370k0635j3361K7853L3054P526J0590j1379k5676o267j5064J0179
9771A9789P004K259l443J0673J6614j8928L7972r749l7037M827m901Q89K0177
9758D6146K1592o95k5244P775J5971m1977L97J1879L786L1637J0485K2260o401
$$ plain form
9846 8291 62194 91782 110001 124279 120301 102181 111684 103807 34120 25571 38068 16872 41418
9833 41418 93926 85567 86811 117544 103405 69017 67628 27079 34738 31498 45951 59222 50845
9820 50845 27196 2242 -19432 -21270 -31250 -40411 -4045 31900 47321 45605 44097 78048 97790
9807 97790 74474 62868 80596 99929 120419 147830 124602 92045 42426 4540 -4603 24215
9795 24215 47348 24466 38372 55527 90075 100698 53202 22893 1417 21972 45839 33339
9783 33339 22969 2334 -11027 16826 49880 57406 67996 56617 30941 24674 9610 19789
9771 19789 26793 29052 25609 36282 52896 33968 71940 62191 25154 29981 25080 25969 46146
9758 46146 67738 67043 41799 49574 65545 23568 23965 35844 39630 71267 81752 104012 97611
9745I7611L3693j497Q647J4585P70k187j9549K0279n037l3584R257Q476j8614
9732A12850n371J8681k8762l4048J4315L5567j7159l0871l4978M8822M3887J8291
9720A41224j8108j1609j3816o089J4804K9999M9995L871j4354q828r548N9897
9708B17438o341j4814J5672p976J7663K1811P727K1446j2302N088L6307L568j8466
9695B86821p873K4271k8856j6821J1445L2861J9708Q562J2304k9644N142O4073
9683C81993M1324J0911L0868M7935N1546l343l659N2678L1027P3420K6108k7114
9671G13694K859L8301N4660L0928M8393O8301M4310L3419Q8666O5218N9477N6658
9659A304884R5953J42513J02377J22541J37939J36627J59483J71466J94276J79260
$$ plain form
9745 97611 131304 129807 138454 153039 153809 151622 132073 152352 147315 113731 122988 131464 112850
9732 112850 107479 126160 97398 63350 77665 113232 96073 65202 30224 79046 122933 141224
9720 141224 123116 111507 97691 91602 106406 136405 186400 190271 175917 167089 157541 217438
9708 217438 211097 196283 211955 203979 221642 243453 251180 272626 260324 265412 301719 305287 286821
9695 286821 278948 303219 274363 257542 268987 301848 321556 330118 342422 312778 317920 381993
9683 381993 423317 434228 465096 513031 564577 561234 557575 610253 641280 714700 740808 713694
9671 713694 716553 754854 809514 840442 888835 957136 1001446 1034865 1123531 1188749 1248226 1304884
9659 1304884 1400837 1543350 1645727 1768268 1906207 2042834 2202317 2373783 2568059 2747319
9649B747319K04656K06577J91883K37934K59892K03823J90408K07120J65447J16524
9639D731583P8398P6101o920l3261k1584p5712j72788k02431k42454k27713j93183
9628C710036k04790k26473k25314j74951j82085k16975j70687j63567j41422j18719
9618A885053r5294r8393j02708r4494j11790m0341q0274p6449o7430q0021r7723
9607I40136q0907m2200k0988l3766m8479p1762k3743m1076l9259j8180m5497O017
9595D80296K9252j9583n5183k5219n511J1017o555n4194l8107K4901N6680k8672
9583C69122N728K4147Q191r309R014k3826l1788P018N0517N2134J11905J60204
9571G33057R2494n5346j05762m1424o6273n5050j2753k4541n0497l6354l9090
$$ plain form
9649 2747319 2951975 3158552 3350435 3588369 3848261 4052084 4242492 4449612 4615059 4731583
9639 4731583 4809981 4886082 4879162 4845901 4824317 4748605 4575817 4373386 4130932 3903219 3710036
9628 3710036 3505246 3278773 3053459 2878508 2696423 2479448 2308761 2145194 2003772 1885053
9618 1885053 1789759 1691366 1588658 1494164 1382374 1342033 1261759 1185310 1117880 1037859 940136
9607 940136 859229 817029 796041 762275 713796 642034 618291 577215 537956 519776 474279 480296
9595 480296 509548 489965 434782 409563 404052 415069 408514 354320 316213 341114 397794 369122
9583 369122 374850 398997 407188 397879 406893 383067 351279 358297 408814 460948 572853 733057
9571 733057 825551 770205 664443 623019 556746 501696 488943 464402 413905 377551 338461
9560C38461p536N945P2774P8612L7581N7167Q7539R0014Q6003K6606m7534o4533
9548G61099l5652l3334l9346k5466q393j6488m887j7115k5752o5762l6156k486
9536D50262L1680J05795J34074J50218K54724L89218M70366K32384j68411m21272
9526A629038m34395k74675j76282j37551r6160o6761k6529J3158O4365O06k6618
9515D68196l0403l890O2745P9811J2431R740N5472Q1327P639l5526l6483l2379
9503F38680n2202q2014r7594o8436n3675m7258m4407M3631L9336L4711K6593M8256
9491C85621O0911J4596Q3139J30248J01792p7962k06249j39833j05543m1641k9038
9480A76041j7804J4715J0474J1338K5196n1963m1423o6841j2015n049l06J9764
$$ plain form
9560 338461 330925 336870 409644 488256 525837 583004 670543 760557 846560 873166 825632 761099
9548 761099 725447 692113 652767 627301 618908 602420 597533 580418 554666 488904 452748 450262
9536 450262 481942 587737 721811 872029 1126753 1515971 1986337 2218721 2050310 1629038
9526 1629038 1194643 919968 743686 606135 509975 443214 416685 429843 494208 494814 468196
9515 468196 437793 433903 496648 576459 588890 598630 654102 735429 743068 707542 671059 638680
9503 638680 586478 504464 406870 338434 284759 237501 193094 236725 276061 310772 337365 385621
9491 385621 446532 461128 544267 674515 776307 698345 492096 352263 246720 205079 176041
9480 176041 158237 172952 183426 194764 219960 167997 126574 59733 47718 42669 42363 62127
9468F2127p433n013o04l763J8342K1800l6235j8856k1975K8669M487j2505p788
9455B1253L2645J6139j2231k0494m1849O548K2222L5609J7158j4539l4734n243
9443B2484J8688L333J2432K029k9493j8585P749k6847Q426j7541J111J0851o024
9430a1387K9967M5427Q673l0186j5536o758J4638J552l4876l7969j7528K7576
9418b6407L1751K2826q847k9658j4685N678J7891K1912N440j5511j7177K279j857
9405f365j287j5904J9594J311k2085r807K614Q837j33L4976J336L7149N086k3629
9391C1693J084j2941m4960k0703K4786m009j8531K2488K5645J0389q887l8519
9379c2465j7577J3300l129K4099K5984K3197l7939k0956N666O960j805K608J9744
$$ plain form
9468 62127 54694 49681 49077 45314 63656 85456 49221 30365 8390 37059 41546 29041 21253
9455 21253 53898 70037 57806 37312 -4537 2011 24233 59842 77000 62461 27727 22484
9443 22484 41172 44505 56937 58966 29473 10888 18637 -8210 216 -17325 -16214 -5363 -11387
9430 -11387 18580 64007 72680 42494 26958 20200 34838 36390 1514 -36455 -53983 -26407
9418 -26407 5344 28170 19323 -10335 -25020 -19342 -1451 20461 25901 10390 -6787 -4508 -6365
9405 -6365 -7652 -23556 -3962 -2651 -24736 -34543 -31929 -23092 -23225 11751 13087 50236 55322 31693
9391 31693 32777 19836 -25124 -45827 -21041 -25050 -43581 -21093 4552 14941 6054 -32465
9379 -32465 -50042 -36742 -39871 -15772 10212 33409 -4530 -25486 -19820 -12860 -14665 -12057 7687
9366G687K643J2973j1106j0081P097j8192l076m822K3691O281j6373q976K0044
9353G790o649m7891q175o164L8799N116J9006L8844m751n2057l8881K0434K1999
9340a2580p358O455N368J0901L7830p896k8835j6991M129k9182j8954J5469N6220
9327A4576M2472k3757m0128k1219O170m183m212K2703n067l5824K630M6550P230
9314G941j3917L695M3N42j9851k553K553o005Q4N0852L7905J2256L9496j6685
9300I6356n5955k4267O149M4301k8120M456L864k3219O363P516k3156k9553J2208
9287c057J516l7021k2103J4589L4149J6444m335j0571k3956J0240K128j6505K4075
9274a4407M6752K3151L66j278l8307j3995M2994K2398k1213m954l1194j0564J0862
$$ plain form
9366 7687 10330 23303 12197 2116 9213 -8979 -12055 -16877 6814 13095 -3278 -12254 7790
9353 7790 1141 -46750 -54925 -61089 -22290 -17174 1832 40676 35925 -16132 -55013 -34579 -12580
9340 -12580 -19938 -13483 -8115 2786 40616 32720 3885 -13106 -8977 -38159 -57113 -41644 14576
9327 14576 57048 33291 -6837 -28056 -21886 -26069 -30281 -7578 -12645 -48469 -45839 711 7941
9314 7941 -5976 -2281 -2238 -1696 -21547 -24100 -21547 -27552 -27468 23384 61289 73545 113041 96356
9300 96356 40401 16134 22283 66584 38464 42920 46784 23565 29928 37444 14288 -15265 -3057
9287 -3057 -1541 -38562 -60665 -46076 -11927 4517 182 -10389 -34345 -24105 -21977 -38482 -14407
9274 -14407 32345 55496 55862 54584 16277 2282 45276 67674 46461 41507 10313 -251 10611
9261A0611n761N3694L9367o840k5593o3659l6235j3974K5729K8434n305M077k0506
9248a5961J3834L2996J07k5456k9672j4354J8240J921K0134J9610L6608m0909
9236A7098l6724j3844J8928L6711k0504K4173L8434J1281j7176l8443l8803K805
9224a6064N261K0341K4953j7877j8203k2538L0155j621O044N5400q928m0563m4760
9211b8400m0877K93K1372J6933j1078k5884R033K6459K2884K0076K2417L2853
9199F6081p803J8653j1451l3442k1605L9102N496r609k4776k8491J0941Q371j545
9186I922j0420K176J9883k2812J0641J4907l9236P250L6609n9507m7373K2675
9174e5285L8437J3882l547j1588K720K3820K379j2535M497j198R816R396J630
$$ plain form
9261 10611 4850 58544 97911 91071 65478 1819 -34416 -48390 -22661 5773 468 4545 -15961
9248 -15961 -2127 30869 30976 5520 -24152 -38506 -20266 -18345 1789 21399 58007 17098
9236 17098 -19626 -33470 -14542 22169 1665 25838 64272 75553 58377 19934 -18869 -16064
9224 -16064 -10803 9538 34491 16614 -1589 -24127 6028 4407 10451 65851 56923 16360 -28400
9211 -28400 -69277 -68984 -47612 -30679 -41757 -67641 -58608 -32149 -9265 10811 33228 66081
9199 66081 58278 76931 65480 32038 10433 49535 55031 45422 20646 -7845 3096 11467 9922
9186 9922 -498 1678 21561 -1251 9390 24297 -14939 -7689 28920 -30587 -77960 -55285
9174 -55285 -16848 -2966 -6513 -18101 -15381 8439 10818 -1717 2780 1582 11398 20794 22424
9161B2424j1575k26O993p600K3153N1511k2731m3336k0226k3654n451L973k7726
9148e4471j8395j079M9928L3942k8716j9122l3235L8390M5969k9723K8432l117
9136H803j5570K511L391j5351k956j4471j4869J5766M9761j6118k9373K1046j1660
9123a9090N975K1749L8960M113k1373j0124j1164K0397K2111L994l687N480M0719
9110I8060J1415n1670l5518r283n1560r319K4045o422K868J2194J6108K0822K8373
9097E0113M852n678j1984m359L3095j8851n6582j4018k82j4453k0111K6296K8329
9084c633Q107L1541r691J5766J7645o261R615J0371j1274m7567p8583j0879r816
9071h4659k551O8529R258p376J0322j8107k6149j28L0745K7781j7138j2380R350
$$ plain form
9161 22424 10849 10623 17616 10016 33169 84680 61949 18613 -1613 -25267 -30718 -26745 -54471
9148 -54471 -72866 -73945 -24017 9925 -18791 -37913 -71148 -32758 13211 -16512 11920 8803
9136 8803 -6767 -4256 -865 -16216 -19172 -33643 -48512 -32746 17015 897 -28476 -7430 -19090
9123 -19090 -13115 8634 47594 51707 30334 20210 9046 29443 51554 55548 51861 57341 98060
9110 98060 109475 57805 22287 13004 -38556 -47875 -23830 -30252 -27384 -15190 918 21740 50113
9097 50113 54965 49287 37303 32944 66039 47188 -9394 -23412 -23694 -38147 -58258 -31962 -3633
9084 -3633 4474 36015 26324 42090 59735 53474 63089 73460 62186 14619 -63964 -74843 -84659
9071 -84659 -87210 -18681 -9423 -16799 -6477 -24584 -50733 -50861 -20116 7665 -9473 -21853 -12503
9058a2503L7L513j7970L2108J2292k6188j6861q012j1211J0833L5268q42j7716
9045a7252J4071J2193m400m1434O652J1240j2596J6574J0720K004k417K576M3800
9032D1731K4222j4575k8016j9785q638M7496L0920k9440l524L7514L4529l9137
9020G3297M205K4619m5473l2910p394r780Q504K7063o329J0882L3931m478k0649
9007E5488m298l3223k1207j6267J0587O659J9467j6089J4472q362k6428O78J2948
8994e575j1608K0247m0279k685k159J0076J2165j3952N528K6222k0582l1814N662
8981d8754M928L0425k230o828J4351j5936Q885L4066l6422k1218L6953O495k0890
8968a6175m524J3030j7230K0487K5464K4622L203k2337n9231m5756n211J2172
$$ plain form
9058 -12503 -12466 -8953 -26923 5185 17477 -8711 -25572 -33584 -44795 -33962 1306 464 -17252
9045 -17252 -3181 9012 4612 -36822 -30170 -18930 -31526 -14952 -4232 -2228 -4645 -2069 41731
9032 41731 65953 51378 23362 3577 -5061 42435 73355 43915 40391 77905 112434 73297
9020 73297 77502 102121 56648 23738 16344 6564 15068 42131 35802 46684 80615 76137 55488
9007 55488 51190 17967 -3240 -19507 -8920 -2261 17206 1117 15589 7227 -19201 -18523 -5575
8994 -5575 -17183 3064 -37215 -39900 -42059 -31983 -19818 -33770 -28242 -2020 -22602 -54416 -48754
8981 -48754 -43826 -13401 -15631 -22459 -8108 -24044 -15159 18907 -17515 -38733 -1780 4715 -16175
8968 -16175 -20699 -7669 -24899 -4412 21052 45674 48877 26540 -32691 -78447 -83658 -71486
8956g1486j4781l6497J9775N5864K2870o325j1101k739j2965m065L6058M2375
8944A6983O677P922j9909m3300j8294J8431K9077N816L0189j8806K4383j9418
8932A9751J95k9740k6651J8572O197L3087K1273l2158k8618K1501R543n049n1263
8919d3360j0972K2472O740j7558r125p852L4918L2763q990j1851r57j8241M3731
8906A1718k711M365q149M895q557l943K0455N641k9114k2429M599j0695K349Q863
8892b2713o523L907m009K625r480l8671L1318M4064j3386j5684L057P832j2445
8879c0108l939L5491l864j0670K0540J2537j7629n7648j5349r24K7191J6918M4032
8866A6578L7181M1956k9693k2710k2755q548J0457R39q756K3819L3830l5977o367
$$ plain form
8956 -71486 -86267 -122764 -102989 -47125 -24255 -30580 -41681 -44420 -57385 -61450 -25392 16983
8944 16983 23660 31582 11673 -31627 -49921 -31490 -2413 3403 33592 14786 39169 19751
8932 19751 19946 -9794 -36445 -17873 -11676 21411 42684 10526 -18092 3409 12952 7903 -43360
8919 -43360 -54332 -31860 -25120 -42678 -51803 -59655 -24737 8026 -964 -12815 -13772 -32013 11718
8906 11718 9007 13372 5223 10118 1561 -2382 18073 23714 -5400 -27829 -23230 -33925 -31576 -22713
8892 -22713 -29236 -25329 -29338 -26713 -36193 -74864 -43546 518 -12868 -28552 -25495 -17663 -30108
8879 -30108 -34047 1444 -2420 -13090 7450 19987 2358 -55290 -70639 -71563 -44372 -27454 16578
8866 16578 53759 95715 66022 43312 20557 12009 22466 23405 14649 38468 72298 36321 29954
8853B9954O50o4967l0449K1453J4866k5184j3948j3816j7493K456O0188J0022
8841b6268j8897j1827J8452K5771L675R163J0654m2012l490K5288J8020j5677
8829g148j149n149J1547j2274k0394N2853M999k4520k8022L7221J7622m1663k1895
8816c7972k7811k8488J7340K1465K6975N168q026O014K4842j9468L119j1174m166
8803c2182R998p560J7282m254J216O054j1274k2249M675K6453m537o426l6459
8790e9263l67L6759Q029L871j4692M0059K600J7983j2458J1140j6847K4334m046
8777C7102j0523K3546l2357m2625K5496J6297k6915L6057R152J150J3605K164
8765E2149n0539r711j1483r816k8535L5225M6895k1541l9293L785L5256j3742
$$ plain form
8853 29954 30604 -34363 -64812 -43359 -28493 -53677 -67625 -81441 -98934 -96478 -36290 -26268
8841 -26268 -45165 -56992 -38540 -12769 -9094 69 10723 -31289 -34779 -9491 8529 -7148
8829 -7148 -8297 -13446 -1899 -14173 -34567 18286 23285 -1235 -29257 7964 25586 -16077 -37972
8816 -37972 -65783 -94271 -76931 -55466 -28491 -23323 -31349 -25335 -493 -19961 -16842 -28016 -32182
8803 -32182 -22184 -29744 -12462 -16716 -15500 -9446 -20720 -42969 -38294 -11841 -16378 -22804 -59263
8790 -59263 -59630 -22871 -14842 -10971 -25663 14396 16996 34979 22521 33661 16814 41148 37102
8777 37102 26579 50125 17768 -24857 639 16936 -9979 26078 35230 36380 49985 52149
8765 52149 1610 -8101 -19584 -29400 -57935 -22710 24185 2644 -36649 -32864 2392 -11350
8753a1350J7492L9217m2308o0877o255K4747J1396M1112j1675j2379L049J0078
8741B247m3937K9738N9846p888k7373l0264j3634J1716j3731l7114n176L4221
8729d1349N0341L3645P383k5745k1854L781L9696k2915m0903R514J6967l488j6347
8716a1274j7948p999j3437J989K7583J6517n621K8810j993k2618k9298L6406M3588
8703D4705j6230j2658l4028j9100M3760L3827K6551j6177k8297j6831J1972J2793
8691C0287L3075q56j5618J4619j611l3726J50k1305k9167k2940j4072K2155J2854
8678b6155J2838J2233k8949n7651j0444J3325N0809J0045M0313M1210k4753l2349
8666D72m4155k8781r349K3422L5192K3300l2647K1343K4812k7039K279O68q993
$$ plain form
8753 -11350 6142 45359 3051 -57826 -64081 -39334 -27938 13174 1499 -10880 -7831 2247
8741 2247 -41690 -11952 47894 40006 12633 -17631 -31265 -19549 -33280 -70394 -75570 -41349
8729 -41349 8992 42637 50020 24275 2421 6202 45898 22983 -17920 -8406 8561 5073 -11274
8716 -11274 -29222 -37221 -50658 -48669 -21086 -4569 -10190 18620 16627 -5991 -35289 1117 44705
8703 44705 28475 15817 -18211 -37311 6449 40276 66827 50650 22353 5522 17494 30287
8691 30287 63362 62506 46888 61507 59896 26170 26320 5015 -24152 -47092 -61164 -39009 -26155
8678 -26155 -13317 -1084 -30033 -87684 -98128 -84803 -33994 -23949 16364 57574 32821 472
8666 472 -43683 -72464 -81813 -58391 -23199 101 -32546 -11203 13609 -13430 -11151 -10483 -19476
8653a9476m072L826J2185K7246L7785m2477k7344l89j3105L2324K8151J2735l733
8640D3656k1231r25m826J8207J8830j3455Q867K6447J6732J129p5917n3382J7516
8627a8352k094j2803N4424N2640R99r930J867n503k6126l6507K0153M3106J0463
8614G2337J4724O412k8343q071J718k2534K9633L3942k870k3256j7769J5987N4181
8601A26091K7938m1227k0134k8802j0339M9251K4601m8341l8702k3568Q170k9467
8589d529q083o45M4636K1470j068m434N088J3253l8151n8295l242J9725P20o621
8575b0176J9388N4062L7019j2479O254O1711M3028K129l1063j7146n3440n8980
8563C0307K2402J7266J9251K2882K9299N9916O0741l0686l2170l8091m7882k2262
$$ plain form
8653 -19476 -23548 -19722 -7537 19709 57494 15017 -12327 -12716 -25821 6503 34654 47389 43656
8640 43656 22425 21500 16674 34881 53711 40256 49123 75570 92302 93431 17514 -35868 -18352
8627 -18352 -20446 -33249 21175 73815 74814 64884 66751 61248 35122 -1385 18768 61874 72337
8614 72337 87061 93473 65130 57059 58777 36243 65876 99818 96948 73692 55923 71910 126091
8601 126091 154029 112802 92668 63866 53527 102778 127379 79038 40336 16768 24938 -4529
8589 -4529 -12612 -13257 31379 52849 51781 47347 52435 65688 27537 -30758 -34000 -14275 -13555 -20176
8575 -20176 -788 53274 90293 77814 84068 145779 188807 190936 159873 142727 89287 30307
8563 30307 52709 69975 89226 112108 141407 201323 262064 231378 199208 161117 113235 90973
8551I0973L633l3691j1895O617L4142K6670l9505M088K4151n476J072k508k5029
8538G3242j3226m1553k0830j4128K6663O6357J6928M1421L7192Q040j8349k0175
8526A41582J2660j4492j2615j7180j2479k7546L708q420m4531j3555M503J8516
8514C0151N7417N8844j6778N7789N4258m7652n9236j7023n9255m7081J1684j6732
8502F386l2650j7522L8623M2409K248r879j7448l936k7520k5208K230j2161K5080
8489b9348J0296K5704R991k9452j2818J496K7700l23j7076k5578M123L446j3248
8476d5087L234k3584k661J8786k7043m979M3653l988M7333J7430K070L0551J0674
8463F6389j2264m993q64j151K4817j7313j8950n052N202k0265j8379p808l8030
$$ plain form
8551 90973 94606 60915 49020 55637 89779 116449 76944 81032 105183 99707 100779 98271 73242
8538 73242 60016 18463 -2367 -16495 10168 76525 93453 134874 172066 180106 161757 141582
8526 141582 154242 139750 127135 109955 97476 69930 73638 65218 20687 7132 11635 30151
8514 30151 87568 146412 129634 187423 241681 194029 134793 117770 58515 11434 23118 6386
8502 6386 -26264 -43786 -5163 37246 39494 29615 12167 8231 -19289 -44497 -42267 -54428 -29348
8489 -29348 -19052 6652 16643 -12809 -25627 -24131 3569 3246 -13830 -39408 -35285 -31839 -45087
8476 -45087 -41853 -65437 -68098 -49312 -76355 -81334 -37681 -41669 5664 23094 25164 55715 66389
8463 66389 54125 49132 48268 47117 71934 54621 35671 30619 35821 15556 -2823 -10631 -48661
8450d8661J516K2421N7030J7831j3843j8444r684o843k9451j6517K5104o465L7046
8437A1040k661R622k5623l5019J8304K7898K9239K9703K1058j6435J4771J1199
8425I3096p971j6341N402k5426J354M168j9220l2270k0637l819q961M4254J2148
8412B5777j519k6530M445k7786k4849J2556j7269J8212M4591N070k4621r156r562
8399c0641k6396j7079N0030J9500K8523k9040K8018L043k4233J3963P295k1550
8387A433J2037r347k8525J6031R307k0848l6895J8306K2396k01j9197j311j8022
8374e4836J8813L1289J6165M751j9235l6841L679q303k005J4700L030O251p845
8361c0387M3643l8357n1666q395J8606M5661K4493k7311k1473J5641P641J0430
$$ plain form
8450 -48661 -47145 -24724 32306 50137 36294 17850 8166 1323 -28128 -44645 -19541 -26006 11040
8437 11040 8379 18001 -7622 -42641 -24337 3561 32800 62503 83561 67126 81897 93096
8425 93096 85125 68784 74186 48760 50114 54282 35062 2792 -17845 -21664 -30625 13629 25777
8412 25777 24258 -2272 2173 -25613 -50462 -37906 -55175 -36963 7628 12698 -11923 -21079 -30641
8399 -30641 -57037 -74116 -24086 -4586 23937 -5103 22915 25958 1725 15688 22983 1433
8387 1433 13470 4123 -24402 -8371 936 -19912 -56807 -38501 -16105 -16306 -35503 -36814 -54836
8374 -54836 -36023 -4734 11431 16182 -3053 -39894 -36215 -44518 -46523 -31823 -28793 -22542 -30387
8361 -30387 13256 -25101 -76767 -85162 -66556 -20895 3598 -23713 -45186 -29545 -21904 -11474
8349a1474J224j6403j3443Q814L2368K9761p296m5838K074Q146N554J3334r721
8336b900k1711O720M8658L5401j0524l7740k2838K759r394M959J0799p019k379
8323e209J1880k0093r551J7076k627J926Q508o743K598K8495K1974q004k0808
8310A9422k2262j3877m4508m641L6445P362r60J8905J0092Q006k9539k3974j4321
8297e3850J5371Q230J4348j3501M977J9735k0074j3515J1257j2624K4189J5648
8285A91k7199P566K6911J7329J7220k7957l4046K4262J385k1414J4940K1479J1747
8272C2414m4419j5511J5588j7827j9919o990K62N0787J0847j078l148r635j0838
8259a9467K7579n5297j0693J5691j3768k012J4688N5435K3981K800p310k1173
$$ plain form
8349 -11474 -10250 -26653 -40096 -31282 1086 30847 23551 -22287 -20213 -12067 -6513 6821 -2900
8336 -2900 -24611 -17891 30767 66168 55644 17904 -4934 -2175 -11569 -6610 4189 -2830 -5209
8323 -5209 6671 -13422 -22973 -5897 -8524 -6598 1910 -4833 -2235 26260 48234 40230 19422
8310 19422 -2840 -16717 -61225 -65866 -29421 -22059 -23019 -4114 5978 13984 -15555 -39529 -53850
8297 -53850 -38479 -30249 -15901 -29402 -24425 -4690 -24764 -38279 -27022 -39646 -15457 191
8285 191 -27008 -19442 7469 24798 42018 14061 -19985 4277 5662 -15752 -812 20667 32414
8272 32414 -12005 -27516 -11928 -29755 -49674 -56664 -56402 -5615 5232 4154 1006 -8629 -19467
8259 -19467 8112 -47185 -57878 -42187 -55955 -57967 -43279 12156 36137 38937 31627 10454
8247A0454M4658m198j4508l2306l3164k063J5821Q291O247m5222n8170L420L6576
8234f4164O8371J5693K3368L054K204P831k6120m1321j231L3174N496K90j8046
8221H599j8390j6855L2300O257p420k5665m6336Q264N9669J1661N48n4868J138
8208d1098Q481j1898J1384K1302K2068L4191j0690m0597m3936K3122L464J1724
8196a2483J2336j666j3147N046k8026l0987j6306J9654N0069L2227K5753L2967
8184G5437j7353o8110m7417j475O568m361J8362L5392j0859L0554L7904j3761
8172D0881m5509m938q276L406R207q312j2849J4284J9742l2344n5608j2082J8341
8159g4057K7138M1858K3186R524j3447k5829J8115J9101j6417o836O383K8526
$$ plain form
8247 10454 55112 50914 36406 4100 -29064 -31127 -15306 -7015 -768 -45990 -104160 -100740 -64164
8234 -64164 4207 19900 43268 46322 48526 56357 30237 -11084 -12315 20859 26355 26645 8599
8221 8599 -9791 -26646 5654 11911 4491 -21174 -67510 -59246 423 12084 12632 -42236 -41098
8208 -41098 -32617 -44515 -33131 -11829 10239 44430 33740 -6857 -50793 -27671 -24207 -12483
8196 -12483 -147 -1813 -14960 -9914 -37940 -68927 -85233 -65579 -15510 16717 42470 75437
8184 75437 58084 -10026 -57443 -58918 -52350 -56711 -38349 -2957 -13816 16738 54642 40881
8172 40881 -4628 -9566 -17842 -14436 -5229 -13541 -26390 -12106 7636 -24708 -80316 -92398 -74057
8159 -74057 -46919 -5061 18125 27649 14202 -11627 6488 25589 9172 2336 8719 37245
8147C7245K717j8025L484P117N2922l3810n5639j0731n513P607j5481k5738O1111
8134G266M7838j1640j2796J7281J0404N627j331k9219o003P73K9167L2433m0903
8121D8897k8125l5518J4050J5434K159l46k688L2389j2186J1962j151l344j262
8108D0271k975O983l1745l635J6876r341j6065j5855J9701J9546n230j0109r09
8095G513J4427k901j0586j9934J869K791L1397j0788n869k1194j9739J564L6080
8082D630N1348j0768o698j3224j045j7855j5110l0271P477K768K022N014l0750
8069e2462l1705J2820L9588M7228J2755J6996M047L1j2022J7350J318K319q569
8056D9694k0861j3218K5101j1326l5063K3864N238l5816k5869J9650L1163K6846
$$ plain form
8147 37245 39962 21937 25421 32538 85460 51650 -3989 -14720 -20233 -12626 -28107 -53845 7266
8134 7266 55104 43464 30668 47949 58353 63980 62649 33430 27427 28200 57367 89800 48897
8121 48897 20772 -14746 -696 14738 16897 16551 13863 46252 34066 46028 44877 41533 40271
8108 40271 37296 44279 12534 8899 25775 16434 369 -15486 4215 23761 18531 8422 7513
8095 7513 21940 19039 8453 -11481 -9612 -6821 24576 13788 7919 -13275 -33014 -31450 4630
8082 4630 55978 45210 38512 25288 24243 6388 -8722 -38993 -31516 -28748 -26726 -21712 -52462
8069 -52462 -84167 -71347 -31759 15469 28224 45220 49267 49298 37276 54626 55944 58263 49694
8056 49694 28833 15615 40716 29390 -5673 18191 23429 -12387 -38256 -18606 12557 39403
8044C9403M899l4056J0711k4247R139Ll718j2949k8359J4807J0941K922M180l2557
8030c8881q482K0461j706P569M0761q43J3744R722L2695n155j5696j8085Q74o37
8016C6341K1756K307k3555k0514r324J5042J1982l2339j4230P073N706O671j9281
8003a2365O989K0626m3095j7888r401K9691J6919O2917L153j465q831j5793j0465
7990B0992o045l62J1294M842k1436Q878L5737N3000q959K108l2034k2412m870
7977D0733q334L1571k0427m1810m4961k137L0869l313j8468J6800J3487k6725
7965c2715J522L3547K2576J5169J288K3009K3797K3936l3202k155n879j0951J6029
7952G5971L6890Q83O017j2759j189p806J5046p764k9389L2043K3398k0592j5782
$$ plain form
8044 39403 44302 10246 20957 -3290 5849 5852 2134 -10815 -39174 -24367 -13426 -10504 -6324 -38881
8030 -38881 -47363 -26902 -28608 -21039 19722 18879 32623 42345 75040 69885 54189 36104 36978 36341
8016 36341 58097 60404 36849 16335 7011 22053 34035 1696 -12534 -5461 245 6916 -12365
8003 -12365 -5376 15250 -27845 -45733 -55134 -25443 -8524 54393 57546 56081 47250 31457 20992
7990 20992 14947 14585 25879 30721 9285 18163 53900 106900 97941 100049 68015 45603 40733
7977 40733 32399 63970 43543 1733 -43228 -45365 -14496 -17809 -36277 -19477 -5990 -32715
7965 -32715 -31193 2354 24930 40099 41387 64396 88193 112129 78927 76772 70893 59942 75971
7952 75971 112861 113744 119761 107002 105813 98007 113053 105289 75900 107943 131341 110749 94967
7939I4967l5956n2132l0929j9898O7927M4399R89j8844k6523l5166K6285L9058
7927E4177n929k9876J131M080L4421n1541l8148J7070K9144J8060q399j9491J396
7914F095k5937l6859j2138L8909L6176K9323L3518K276k5981j3571J7101N4160
7902A03072K7573q278r4813n3332j8119K344M0215n890j0740J8624K2822j194
7890B2284j2232o993J4527j5193j6800p995l7575M325k3218J1564J0545L931J4671
7877c8159k972K5196j0915m1342j4201o184J5613M316M0032j6091M0884K8514
7865B4691j1918j6615J6810l568K1829P227J2638J8574p890k2563j0446K6460
7853E5229k543k9275k5820J7698j5457k4083j0888m1687j617J7502J1776J5899
$$ plain form
7939 94967 59011 6879 -24050 -43948 23979 68378 69367 50523 24000 -11166 15119 54177
7927 54177 48248 18372 19503 23583 58004 6463 -31685 -14615 14529 32589 24190 4699 6095
7914 6095 -19842 -56701 -68839 -29930 6246 35569 69087 71363 45382 31811 48912 103072
7902 103072 130645 122367 27554 -25778 -43897 -41553 -1338 -7228 -17968 656 23478 22284
7890 22284 10052 3059 17586 2393 -14407 -22402 -59977 -55652 -78870 -67306 -56761 -52830 -38159
7877 -38159 -41131 -15935 -26850 -68192 -82393 -88577 -72964 -68648 -28616 -44707 -3823 24691
7865 24691 12773 -3842 12968 9400 31229 38456 51094 69668 61778 39215 28769 55229
7853 55229 52686 23411 -2409 15289 -168 -24251 -35139 -76826 -78443 -60941 -49165 -33266
7841c3266J0546J5251L034j3668r581l5513l815j0190M2617Q04j5418l6j1024
7828f0259K857J2084m628j2418K3206K4845j4050k5545L5008K4006r284l701j1902
7815a9781Q979M3677r00j0925j4096l280j5091m2190J782J2708J870N9932J6051
7802C8736k7016P096K1383k6314j1176L6436K7477k2964j8355m144k8791m516
7790a2148J6968M6095l521J4573J8964J6975j9010l9245J7918l4282l3718k0818
7778c1249L282k2841l4326J7077M5057K0766K9220j5767k4405n688K4647k984
7766B789J665l8566k6883L3553K2507K9043k0781k8762J9746J7661J579j0031
7754C520k362j0007J0702Q978L8201k464l2549l1917k2404j6637J3623J4092j9463
$$ plain form
7841 -33266 -22720 -7469 -4435 -18103 -27684 -63197 -67012 -77202 -34585 -33781 -49199 -49235 -60259
7828 -60259 -57402 -45318 -49946 -62364 -39158 -14313 -28363 -53908 -18900 5106 -4178 -7879 -19781
7815 -19781 -10802 32875 31975 21050 6954 3674 -11417 -53607 -51825 -39117 -37247 22685 38736
7802 38736 11720 18816 40199 13885 2709 39145 66622 43658 25303 21159 -7632 -12148
7790 -12148 4820 50915 47394 61967 80931 97906 78896 39651 57569 23287 -10431 -31249
7778 -31249 -27967 -50808 -85134 -68057 -23000 -2234 26986 11219 -13186 -18874 5773 2789
7766 2789 4454 -34112 -60995 -27442 -4935 24108 3327 -25435 -5689 11972 13551 3520
7754 3520 1158 -8849 1853 10831 49032 46568 14019 -17898 -40302 -56939 -43316 -29224 -48687
7741d8687J704L1632k7159j1398K7018K3477o374j0653l9600m0506M72Q2464k954
7728b0564m0484k8706M7543O7490j2667n1476K948P774l6558L3837L8995n846
7716B286k9530o411J045K6030Q776M142k9439O051J9698K1097J6120q772n252
7703B5841J1564m621K2434j4274p437m5803P462N457j4938j1013K4311j2183j2216
7690b5416K9107l868l6455K886K3671r680k9055l0617R415k222J4370L4873r663
7677c2654j2534l005j8479L7224L5541N4425r732k0947j9930j2713m711k144N1113
7664D1454J6795k2808m547q541K4235P30l2742j2732k2214J8622K4540J2371k2712
7651A2451l4113j8498J6650M4607J6305k1434K5325R481m181l6211k695O836q271
$$ plain form
7741 -48687 -46983 -15351 -42510 -53908 -26890 -3413 -9787 -20440 -60040 -100546 -100074 -17610 -20564
7728 -20564 -61048 -89754 -42211 25279 12612 -38864 -35916 -28142 -64700 -30863 8132 2286
7716 2286 -27244 -33655 -32610 -6580 2196 6338 -23101 -17050 2648 23745 39865 31093 25841
7703 25841 37405 32784 55218 40944 33507 -12296 -4834 623 -14315 -25328 -1017 -13200 -25416
7690 -25416 3691 -177 -36632 -33746 -10075 -19755 -48810 -79427 -70012 -72234 -57864 -22991 -32654
7677 -32654 -45188 -48193 -66672 -29448 6093 60518 50786 29839 9909 -2804 -7515 -9659 41454
7664 41454 58249 35441 30894 22353 46588 47318 14576 1844 -20370 -1748 22792 35163 12451
7651 12451 -21662 -40160 -23510 21097 37402 15968 41293 50774 46593 10382 7687 14523 6252
7638F252j6656J7722l1681o604O3J388L693p865K5536J7617k2595k0446P695K581
7624b3300o276J3223k2219l772n3405N238L7760Q202M805L1863k1144r24J9222
7611a0727k3839k9761K3413J3352L6254M9990J7292m5464m4610j9762P872j1785
7599c7775P27K116L3701K9007K8813k0615j6368K5727q123n2812k2177j3882K4113
7586b7548M8184N199j934k7758j6228K3132K6690Q005k0768k3749j7355n240M336
7573b5034J8971l997o751O138J6266M3767o764Q311j5855R785j9882l9432K4745
7560A0268M4575J099m2064k3763k0130q678J4305j3809K5609l339k7839K7750
7548a6016R14R669n391j3499p318k017L7766j1741n2131J7152M3699N595j4673
$$ plain form
7638 6252 -10404 7318 -24363 -30967 -30904 -29516 -25823 -33688 -8152 9465 -13130 -33576 -25881 -23300
7624 -23300 -29576 -16353 -38572 -42344 -95749 -90511 -52751 -44549 -39744 -7881 -29025 -29949 -10727
7611 -10727 -34566 -64327 -40914 -27562 8692 58682 75974 30510 -14100 -33862 -25990 -37775
7599 -37775 -37048 -34932 -1231 27776 56589 35974 19606 45333 37210 -15602 -37779 -51661 -27548
7586 -27548 20636 25835 23901 -3857 -20085 3047 29737 37742 16974 -6775 -24130 -29370 -25034
7573 -25034 -6063 -10060 -16811 -10673 5593 49360 42596 50907 35052 44837 24955 -14477 10268
7560 10268 54843 55942 13878 -9885 -30015 -38693 -24388 -38197 -12588 -15927 -43766 -16016
7548 -16016 -15102 -5433 -10824 -24323 -31641 -33658 4108 -7633 -59764 -42612 1087 6682 -7991
7535g991m277k49k4451N3002j0154l4312J6672L8655N666k6637l0672J1866j298
7522a4180l1932M4225J9959k9434k045K332k1739J6464K1751J3584J6039k1058
7510A3966m235K2867k692p980o1188j4222N7063k966K303L6170j7516l4775m3500
7497e6705j8206J3299o007k405J1253M645j3448J4387K7208J5763L4223k2538
7485A469p2485L761N4992J6808j7986j5064J11k459J8615j6550K4504P372J7029
7472B0117m593l6067j6366j6660n377N2456M4030j8738k5867j8062k1814Q884
7460c8057J9496K8617J9337l0779j9100k194K9201K3941j407m9369m1478J9573
7448d2219J8585J2280L078j2846j0187P240l5861r640j201L4163M3572p324J7917
$$ plain form
7535 -7991 -12268 -12517 -36968 16034 5880 -28432 -11760 26895 32561 5924 -24748 -12882 -14180
7522 -14180 -46112 -1887 18072 -11362 -13407 -11075 -32814 -16350 5401 18985 35024 13966
7510 13966 9731 32598 29906 21926 -39262 -53484 3579 613 2916 39086 21570 -13205 -56705
7497 -56705 -74911 -61612 -67619 -70024 -58771 -54126 -67574 -53187 -25979 -10216 24007 1469
7485 1469 -71016 -67255 -12263 4545 -13441 -28505 -28394 -30853 -12238 -28788 -4284 3088 20117
7472 20117 15524 -20543 -36909 -53569 -58946 -6490 37540 18802 -7065 -25127 -46941 -38057
7460 -38057 -18561 10056 29393 -1386 -20486 -22680 6521 30462 29055 -20314 -61792 -42219
7448 -42219 -23634 -11354 -8276 -21122 -31309 -24069 -59930 -69570 -70771 -36608 6964 -360 17557
7435A7557K0915k3983m4452j2641j1651J6685N193l1299N8J7485k5886K3084K634
7422d6301M1586K5064n446J2127o595Q212j2681l267J5516j6791k6015p429L6169
7409A4149J7941J4167m8287l6952K977J9528K5419k0717j7453P379J2182J1633
7397A966P762R166l1436m8181J6217J9590L2764K3448k1654j0393l3984r573K6919
7384a7389K9513q234j1541k6077K047m073p446o119L9508L0993q357k356J4909
7371B5378Q476m665o0337m4904K6033N2021k611J2461J0190k21L1145L417k0068
7358C6315q0102K303M1686J8212k2551J2096J0580j224j5683j8392q64k311J7009
7345b926j1133j6520j7865m11r549j3748M0507K9375l8712k2071R767L0152L148
$$ plain form
7435 17557 38472 14489 -29963 -42604 -54255 -37570 -32377 -63676 -63618 -46133 -72019 -48935 -46301
7422 -46301 -4715 20349 14903 27030 20435 28647 15966 12699 28215 11424 -14591 -22020 14149
7409 14149 32090 46257 -2030 -38982 -36005 -16477 8942 -11775 -29228 -21849 -9667 1966
7397 1966 9728 18894 -12542 -60723 -44506 -24916 7848 31296 9642 -751 -34735 -44308 -17389
7384 -17389 12124 3890 -7651 -33728 -31681 -35754 -43200 -49319 -9811 21182 12825 10469 25378
7371 25378 33854 29189 -31148 -76052 -50019 2002 -609 11852 22042 21821 52966 56383 36315
7358 36315 -43787 -41484 202 18414 -4137 7959 18539 17315 1632 -16760 -17624 -19935 -2926
7345 -2926 -14059 -30579 -48444 -48855 -58404 -72152 -31645 -2270 -40982 -63053 -53286 -23134 -19986
7332a9986k505l243K1892K5564m4917j458J989N452p5k6404J6423n502l9746j3152
7318h5668L1392O5208K9231k5248r653J2888N555K5615J6080m508N652L227Q155
7305G7926l2751l8205R620P61l1422j1868Q874n843l465n385K2918L4597L2670
7292E8427o816o4085j3176L2544J3851l6676L077M900j1211J7857k6021p033K8204
7279f158K1035P014K4694K652l681p5716o266q439p270j4930L210L0289R284R305
7265a4977j4663j139j4049m0039j2140P3892J0647j7890K488J3293O765j2168
7253a9980J3556L1718k219J0776k6515P683J0422L777o110l800l5502K7034Q399
7240A9239j5056k6343l884R329k5652J2903J6417l8483n457L2184L7050k6885
$$ plain form
7332 -19986 -22491 -25734 -3842 21722 -23195 -24653 -22664 -17212 -17287 -43691 -27268 -32770 -72516 -85668
7318 -85668 -54276 10932 40163 14915 5262 18150 23705 49320 65400 60892 66544 69771 77926
7305 77926 45175 6970 16590 17351 -14071 -25939 -17065 -22908 -26373 -31758 -8840 25757 58427
7292 58427 51611 -12474 -25650 6894 20745 -15931 -12854 -7954 -19165 -1308 -27329 -34362 -6158
7279 -6158 14877 21891 46585 49237 45556 -30160 -36426 -44865 -52135 -67065 -63855 -33566 -24282 -14977
7265 -14977 -29640 -30779 -44828 -84867 -97007 -23115 -12468 -30358 -27870 -14577 -7812 -19980
7253 -19980 -6424 25294 23075 33851 7336 15019 25441 29218 23108 19308 -16194 10840 19239
7240 19239 4183 -22160 -26044 -16715 -42367 -29464 -13047 -51530 -56987 -24803 12247 -14638
7228a4638m6593J0246L2487J5614P364n851m9116N137M7482J7257O859j3322K3520
7215C6446j2j3088k4062J6401K9734k7824l6540j7216J5357J071J4527M854j5636
7202a5988N617K8066m311k9691j0810P404j549j2154O001P640M144j5241J8639
7189a2233m85j9294j1889J6017O914j6673J0696J3201L335J4475J2942k2275k7199
7176c2468l696N6241L1674j3411k1756j1351Q576k616P961N3426J6634n0680k8526
7163A0008Q494K0947p389n9212l6438J405L4779K9389j6709n476K6542J528n0409
7150d2541k8232K8611M4270L1363o72l5361K7516K0153j7682m6240P343K1275
7138I803K9551J8088M4108p1352l7469l806l569K2958J6693j5945k3274M53j4447
$$ plain form
7228 -14638 -61231 -50985 -18498 -2884 4480 -1371 -50487 -45350 2132 19389 26248 12926 36446
7215 36446 36434 23346 -716 15685 45419 17595 -18945 -36161 -20804 -19733 -5206 -352 -15988
7202 -15988 -10371 17695 13384 -16307 -27117 -19713 -21262 -33416 -27415 -19775 -15631 -30872 -12233
7189 -12233 -12718 -32012 -43901 -27884 -20970 -37643 -26947 -13746 -10411 4064 17006 -5269 -32468
7176 -32468 -36164 20077 51751 38340 16584 5233 13809 11193 19154 72580 89214 38534 10008
7163 10008 18502 39449 32060 -27152 -63590 -62185 -27406 1983 -14726 -20202 6340 7868 -42541
7150 -42541 -70773 -42162 2108 33471 32799 -2562 24954 45107 27425 -18815 -11472 9803
7138 9803 39354 57442 101550 30198 -7271 -11077 -14646 8312 25005 9060 -14214 -13761 -28208
7125b8208K9202K846l2068J4465q082R682O304L263L3222R593j1608j8069J145
7112A1687Q17l0447k2423k6489J1722l9859L1512M7637K7520L2217k0469o126
7100A7299k3318k4687K1138K5036m2881j7004M0710J6544O019L0283Q074j1391
7088D5822n3288l0661M2007r91k4211r33N097J042L7700m800J2302K8399j5139
7075D2346j6048o923l3591J2555J7842N4910K7342m8689m6410j9154N693j1800
7063b1927K6393k0237J1551M141j3554N894q88J7499j6154l7290j5470Q801L2583
7050a8658M871J669R316Q110k5804j1498r017q749Q295n042l0713J349K2164l223
7036e6930K6460N192J2758q264O918m9389k4273J7474K2683p940K4931J3670m6442
$$ plain form
7125 -28208 994 3840 -28228 -13763 -21845 -12163 -5859 -2596 30626 40219 28611 10542 11687
7112 11687 12504 -17943 -40366 -66855 -55133 -94992 -63480 -15843 11677 43894 23425 17299
7100 17299 -6019 -30706 -9568 15468 -27413 -44417 -3707 12837 18856 49139 57213 45822
7088 45822 -7466 -38127 3880 2889 -21322 -22255 -17158 -16116 21584 16784 29086 57485 42346
7075 42346 26298 19375 -14216 -1661 16181 71091 98433 49744 3334 -15820 -10127 -21927
7063 -21927 4466 -15771 -4220 -79 -13633 -7739 -8627 8872 -7282 -44572 -60042 -51241 -18658
7050 -18658 -13787 -12118 -2802 5308 -20496 -31994 -41011 -49760 -41465 -46507 -77220 -75871 -53707 -56930
7036 -56930 -30470 -25278 -12520 -20784 -13866 -63255 -87528 -70054 -47371 -55311 -30380 -16710 -63152
7023f3152k9291K3662k155K9420K3530K3240K4075j194k1914k6017j3502J3159
7011b0139K6067J9719j4255j7657m6410j8840R434M3876j5674l787K3150K6868
6999A2352K4815L9915l0283m5326j3794L8563K4795l0613K6038J5637J385k124
6987F1360k1734k1510l2650k1097p319J2940J6979K2576j3066k2320O084L0210
6975A0453l0043k4526M3174Q89L0475J8427j9106k4473j2144k6523j0913K8046
6963a6264k1282Q701j2564j5007K686M7035M0237J5718r863K061k4474N141q10
6950B1315k3166J6045m992K7834p864k009J2420r233m3652j9501J6172K872J6281
6937B522P202r724N395P489K4314K1180j0864j8872j4763o6805J058K4744l2427
$$ plain form
7023 -63152 -92443 -68781 -70936 -41516 -17986 5254 29329 28135 6221 -19796 -33298 -20139
7011 -20139 5928 25647 11392 -6265 -52675 -71515 -62081 -18205 -33879 -37666 -14516 12352
6999 12352 37167 77082 46799 1473 -12321 26242 51037 20424 46462 62099 63484 61360
6987 61360 39626 18116 -14534 -35631 -42950 -30010 -13031 9545 -3521 -25841 -19757 10453
6975 10453 -19590 -44116 -942 -53 30422 48849 29743 5270 -6874 -33397 -44310 -16264
6963 -16264 -37546 -28845 -41409 -56416 -53730 -6695 33542 49260 39397 41458 16984 22125 21315
6950 21315 -1851 14194 9202 37036 29172 27163 39583 30350 -13302 -32803 -16631 -13759 2522
6937 2522 9724 0 5395 12884 37198 58378 47514 28642 13879 -52926 -51868 -27124 -59551
6924e9551Q358O5656K2455k8640j8088P86N0828Q047l7677n320l6541j8843J4415
6911c4115L221J9689j7828j3167K1079K9541r848P209J2024n343n2o757j740m92
6897C421p321K0670J4241j3668j4597k9058j4604o48P26J3807N825k6654q611
6884e6471L9975K0021l1006m1968j3620j6613J2949K2384q076L5831P351n277
6872c4520L9119J3787m1284j5750P64n894K0979K2700j2789j0055K6685L036j2871
6859f093l8470k3476K1409L7848J1733K0738M144l2292j7817K3665j4964o730
$$ plain form
6924 -59551 -51193 14463 36918 8278 -9810 -9024 41804 49851 12174 6854 -29687 -48530 -34115
6911 -34115 -30894 -11205 -29033 -42200 -21121 8420 -1428 5781 17805 12462 12410 5653 3913 3421
6897 3421 -3900 16770 31011 17343 2746 -26312 -40916 -41564 -40838 -27031 -21206 -47860 -56471
6884 -56471 -16496 3525 -27481 -69449 -83069 -99682 -86733 -64349 -72425 -36594 -29243 -34520
6872 -34520 4599 18386 -22898 -38648 -37884 -43778 -22799 -99 -12888 -22943 3742 6778 -6093
6859 -6093 -44563 -68039 -46630 -8782 2951 23689 27833 -4459 -22276 1389 -13575 -20305
$$ [...]
##END NTUPLES=NMR SPECTRUM
##END=
