##TITLE=Analysis number 328225
Compound Code cc 62846
Book Reference 518/105
Project Code adrs
Chemist Name colinb
##JCAMPDX= 6.0         $$ Bruker NMR JCAMP-DX V2.0
##DATA TYPE= NMR SPECTRUM
##DATA CLASS= NTUPLES
##ORIGIN= Bruker BioSpin GmbH
##OWNER= nmr
$$ XWIN-NMR		Version 3.5
$$ Wed May 16 10:06:26 2007 GMT Daylight Time (UT+1h)  MAYBRIDGE\nmr@NMR_250MHZ
##.OBSERVE FREQUENCY= 250.131544655141
##.OBSERVE NUCLEUS= ^1H
##.ACQUISITION MODE= SIMULTANEOUS (DQD)
##.ACQUISITION SCHEME= undefined
##.AVERAGES= 16
##.DIGITISER RES= 18
##SPECTROMETER/DATA SYSTEM= dpx250
##.PULSE SEQUENCE= zg30
##.SOLVENT NAME= CDCl3
##.SHIFT REFERENCE= (INTERNAL, CDCl3, 0, 16.522)
##AUDIT TRAIL= $$ (NUMBER, WHEN, WHO, WHERE, WHAT)
$$ ##TITLE= Audit trail, XWIN-NMR		Version 3.5
$$ ##JCAMPDX= 5.01
$$ ##ORIGIN= Bruker BioSpin GmbH
$$ ##OWNER= nmr
$$ C:\u/data/dgb/nmr/ADRS/1040/pdata/1/auditp.txt
$$ ##AUDIT TRAIL=  $$ (NUMBER, WHEN, WHO, WHERE, WHAT)
(   1,<2007-05-16 10:05:57.01 +100>,<MAYBRIDGE\nmr>,<NMR_250MHZ>,
      <created by zg, POWCHK disabled, PULCHK disabled
       configuration hash MD5:
       76 6E 9A 78 1E 09 19 81 EC 84 63 8F B0 6A 59 2D
       data hash MD5: 64K
       10 38 53 BC CA 16 46 66 5D 02 34 89 44 9C 35 24>)
(   2,<2007-05-16 10:06:14.15 +100>,<MAYBRIDGE\nmr>,<NMR_250MHZ>,
      <Start of raw data processing
       ef LB = 0.3 FT_mod = 6 PKNL = 1 SI = 32K 
       data hash MD5: 32K
       A9 04 78 51 C2 4B 6A F6 01 F8 FE 41 68 E2 5C 4A>)
(   3,<2007-05-16 10:06:15.96 +100>,<MAYBRIDGE\nmr>,<NMR_250MHZ>,
      <apk 
       data hash MD5: 32K
       3B AD 71 CB BD F3 02 8B BA 21 86 A0 B0 62 91 51>)
(   4,<2007-05-16 10:06:16.68 +100>,<MAYBRIDGE\nmr>,<NMR_250MHZ>,
      <abs ABSG = 5 
       data hash MD5: 32K
       B5 5C FB E0 B9 75 72 5B AF 60 44 B2 6E 8C 3F 8B>)
$$ ##END=
$$ 
$$ hash MD5
$$ 53 94 F0 F7 67 25 0A 6B C3 7E DD 96 32 17 AE C8
##$RELAX= 
##$RELAX= 
##$RELAX= 
##$RELAX= 
##$RELAX= 
##$RELAX= 
##$RELAX= 
$$ Bruker specific parameters
$$ --------------------------
##$DU= <C:\u>
##$EXPNO= 1040
##$NAME= <ADRS>
##$PROCNO= 1
##$TYPE= <nmr>
##$USER= <dgb>
##$AMP= (0..31)
100 100 100 100 100 100 100 100 100 100 100 100 100 100 100 100 100 100 
100 100 100 100 100 100 100 100 100 100 100 100 100 100 
##$AQSEQ= 0
##$AQ_mod= 3
##$AUNM= <au_zg>
##$AUTOPOS= <4 >
##$BF1= 250.13
##$BF2= 250.13
##$BF3= 250.13
##$BF4= 250.13
##$BF5= 500.13
##$BF6= 500.13
##$BF7= 500.13
##$BF8= 500.13
##$BYTORDA= 1
##$CFDGTYP= 0
##$CFRGTYP= 5
##$CHEMSTR= <none>
##$CNST= (0..31)
1 1 145 1 1 1 1 1 1 1 1 1 1 1 1 1 1 1 1 1 1 1 1 1 1 1 1 1 1 1 1 1 
##$CPDPRG= <>
##$CPDPRG1= <>
##$CPDPRG2= <>
##$CPDPRG3= <>
##$CPDPRG4= <mlev>
##$CPDPRG5= <mlev>
##$CPDPRG6= <mlev>
##$CPDPRG7= <mlev>
##$CPDPRG8= <mlev>
##$CPDPRGB= <>
##$CPDPRGT= <>
##$D= (0..31)
0 1 0 0 0 0 0 0 0 0.06 0 0 0 0 0 0 0.0002 0 0 0 0 0 0 0 0 0 0 0 0 0 0 
0 
##$DATE= 1179306355
##$DBL= (0..7)
120 120 120 120 120 120 120 120 
##$DBP= (0..7)
150 150 150 150 150 150 150 150 
##$DBP07= 0
##$DBPNAM0= <>
##$DBPNAM1= <>
$$ [...]
##$SUBNAM7= <"">
##$SUBNAM8= <"">
##$SUBNAM9= <"">
##$SW= 20.6930455092707
##$SWIBOX= (0..15)
0 0 3 0 0 0 0 0 0 0 0 0 0 0 0 0 
##$SW_h= 5175.983436853
##$TD= 65536
##$TD0= 1
##$TE= 683.16
##$TE2= 300
##$TE3= 300
##$TEG= 300
##$TL= (0..7)
0 120 120 120 120 120 120 120 
##$TP= (0..7)
150 150 150 150 150 150 150 150 
##$TP07= 0
##$TPNAME0= <>
##$TPNAME1= <>
##$TPNAME2= <>
##$TPNAME3= <>
##$TPNAME4= <>
##$TPNAME5= <>
##$TPNAME6= <>
##$TPNAME7= <>
##$TPOAL= (0..7)
0.5 0.5 0.5 0.5 0.5 0.5 0.5 0.5 
##$TPOFFS= (0..7)
0 0 0 0 0 0 0 0 
##$TUNHIN= 0
##$TUNHOUT= 0
##$TUNXOUT= 0
##$USERA1= <user>
##$USERA2= <user>
##$USERA3= <user>
##$USERA4= <user>
##$USERA5= <user>
##$V9= 5
##$VALIST= <valist>
##$VCLIST= <CCCCCCCCCCCCCCC>
##$VD= 0
##$VDLIST= <DDDDDDDDDDDDDDD>
##$VPLIST= <PPPPPPPPPPPPPPP>
##$VTLIST= <TTTTTTTTTTTTTTT>
##$WBST= 1024
##$WBSW= 4
##$XGAIN= (0..3)
0 0 0 0 
##$XL= 0
##$YL= 0
##$YMAX_a= 311548
##$YMIN_a= -404347
##$ZGOPTNS= <>
##$ZL1= 120
##$ZL2= 120
##$ZL3= 120
##$ZL4= 120
##$ABSF1= 16.522
##$ABSF2= -4.171173
##$ABSG= 5
##$ABSL= 3
##$ALPHA= 0
##$AQORDER= 0
##$ASSFAC= 0
##$ASSFACI= 0
##$ASSFACX= 0
##$ASSWID= 0
##$AUNMP= <proc_1d>
##$AZFE= 0.1
##$AZFW= 0.1
##$BCFW= 0
##$BC_mod= 0
##$BYTORDP= 0
##$COROFFS= 0
##$CY= 12.5
##$DATMOD= 1
##$DC= 0
##$DFILT= <>
##$DTYPP= 0
##$F1P= 14.0000005364418
##$F2P= -0.99999901652339
##$FCOR= 0.5
##$FTSIZE= 32768
##$FT_mod= 6
##$GAMMA= 0
##$GB= 0
##$INTBC= 1
##$INTSCL= 1
##$ISEN= 128
##$LB= 0.3
##$LEV0= 0
##$LPBIN= 0
##$MAXI= 10000
##$MC2= 0
##$MEAN= 0
##$ME_mod= 0
##$MI= 0
##$NCOEF= 0
##$NC_proc= -4
##$NLEV= 6
##$NOISF1= 0
##$NOISF2= 0
##$NSP= 0
##$NTH_PI= 0
##$NZP= 0
##$OFFSET= 16.522
##$PC= 1
##$PHC0= -55.40747
##$PHC1= 8.452165
##$PH_mod= 1
##$PKNL= yes
##$PPARMOD= 0
##$PSCAL= 4
##$PSIGN= 0
##$REVERSE= no
##$SF= 250.13
##$SI= 32768
##$SIGF1= 0
##$SIGF2= 0
##$SINO= 400
##$SIOLD= 32768
##$SREGLST= <1H.CDCl3>
##$SSB= 0
##$STSI= 32768
##$STSR= 0
##$SW_p= 5175.98343685301
##$SYMM= 0
##$S_DEV= 0
##$TDeff= 65536
##$TDoff= 0
##$TI= <Analysis number 999999
Compound Code 99
Book Reference 9
Project Code 9>
##$TILT= no
##$TM1= 0
##$TM2= 0
##$TOPLEV= 0
##$USERP1= <user>
##$USERP2= <user>
##$USERP3= <user>
##$USERP4= <user>
##$USERP5= <user>
##$WDW= 1
##$XDIM= 32768
##$YMAX_p= 586819601
##$YMIN_p= -146787
$$ End of Bruker specific parameters
$$ ---------------------------------
##NTUPLES= NMR SPECTRUM
##VAR_NAME=  FREQUENCY,     SPECTRUM/REAL,   SPECTRUM/IMAG
##SYMBOL=    X,             R,               I
##VAR_TYPE=  INDEPENDENT,   DEPENDENT,       DEPENDENT
##VAR_FORM=  AFFN,          ASDF,            ASDF
##VAR_DIM=   32768,         32768,           32768
##UNITS=     HZ,            ARBITRARY UNITS, ARBITRARY UNITS
##FACTOR=    0.157963299565203, 1,           1
##FIRST=     4132.6476996994, 0,             0
##LAST=      -1043.33573715361, 0,           0
##MIN=       -1043.33573715361, -146787,     0
##MAX=       4132.6476996994, 586819601,     0
$$ Real data points
##PAGE= N=1
##DATA TABLE= (X++(R..R)), XYDATA
$$ [...]
16088D04198k2171q4853r1283p3660o0559m084Q041r82k9572n5046j9913n557
16076c5441M324L2212L0059k4099n327K5466Q213m6891n3458J070M0921J8703
16064d248R812q782L052m448j7994j4166L4836J4662k8864O386J9869k51m2559
16051c2695J3320K3530J7407k9450j1753J9167K6616J9640J2324k2242n402L511
16039C3973j3112O730k2583j4436j8949J5488M4603K7598j1444l8361l1367j9097
16027d0957J9685M702k9112J6554J1593L958m2M1811j2742j6522L3178K2031k9700
16014B4437m3911K9070k333L4617q715j6114P268j2219j1816j3071j3706n0446
16002g6939M0020O2198J4655J089k4725j2040j8097r339k3254o384K4756L4666
$$ y = [404198, 382027, 297174, 205891, 132231, 71672, 67588, 75629, 74647, 45075, -9971, -29884, -35441, -31117, 1095, 31154, 7055, 1728, 27194, 35407, -11484, -64942, -63872, -22951, -4248, 5564, -3218, -166, -4614, -22608, -36774, -1938, 12724, -16140, -9754, 10115, 9864, -32695, -19375, 4155, 21562, -7888, -19641, -474, 26142, 45782, 58106, 35864, 30462, 33973, 20861, 27591, 5008, -9428, -28377, -12889, 31714, 59312, 47868, 9507, -21860, -40957, -21272, -16570, -45682, -29128, -17535, -13577, -13619, 28192, 15450, -1072, 32106, 54137, 24437, -19474, 9596, 7263, 41880, 33165, 17051, 24319, 12100, 284, -12787, -26493, -76939, -36919, 25279, 39934, 41023, 16298, 4258, -13839, -23178, -46432, -52816, -28060, 6606]
15990F606N448k3125q505p669K0635p114J0487K1315K4134J4904k8924k4743J2598
15977A6047n67k3503j9019k4696J6901L8032L3682j0758l9765j1338n193m714
15965c4891K8450Q815k7614j903N5738J8989p980l1935k7826k4164j3205L0253
15953b7273l85M1024k431l2812l2118m099P388K7778j4255l567M266k521J3502
15940b5503J4560p367j6368k1919j3971O172K6439M13k6923J8283o835J8994q556
15927d2581m581J402M0274L9353m13k1135J749P91N899K356N50k9862m6419K4855
15913b7762L0338J8876N657l9456r606K1734K8934Q944j7502m3000l4548R110
15901d8281l936M972N293K1489K1767Q866m6084j8193r210J8067O4473L3315l7585
$$ y = [6606, 12054, -11071, -19576, -27245, -6610, -13724, -3237, 18078, 42212, 57116, 28192, 3449, 16047, 15480, -8023, -27042, -51738, -34837, 3195, 36877, 26119, -13646, -24984, -30177, -34891, -6441, 2374, -25240, -27143, 28595, 47584, 39604, 7669, -20157, -44321, -57526, -27273, -27658, 13366, 10935, -21877, -53995, -58094, -50706, -22928, -37183, -40750, -36484, -39005, -25503, -10943, -18310, -34678, -56597, -70568, -64396, -37957, -37544, -64467, -46184, -53019, -34025, -42581, -47162, -45760, -5486, 33867, 33454, 12319, 14068, 14859, 20758, 23114, 23664, -6198, -52617, -27762, 2576, 21452, 27109, -12347, -21953, -219, 28715, 37659, 20157, -22843, -57391, -48281, -52217, -47245, -41952, -20463, 1304, 10170, -35914, -54107, -63317, -45250, 19223, 52538, 14953]
15888A4953K403j7465j6512j7278j9743j967K3569J5621j7066j763K4918J3555
15876C225k6862P75k1699J6591K6482L7902q030j5682n552O6804k1526j6517r87
15863C4924J4558l0866l7907k7273J5002J1917L7140j9086j0038J7149j1768P657
15851A409k0361J7104J1077o914l4214K1200K5250q363j0127j1385l33P682q182
15838a6157l1009k0680K6876L3331l5917J6738K7173K998j3403L4655k2835J1682
15826A3452p687k8133k796o868K1716Q063p078p465K7347Q17r398J476K8863q212
15812B4097J5680M0593l4492q0501o692j8795J0294K1887N0403J260k2240l0855
15800b9361J902K1209k3517q645M1911L3656N160k5802j5159L2731K8364q759
$$ y = [14953, 17356, -109, -16621, -33899, -53642, -55609, -32040, -16419, -33485, -35248, -10330, 3225, -23637, -22862, -44561, -27970, -1488, 36414, 28384, 12702, 7150, 73954, 52428, 35911, 34924, 49482, 18616, -19291, -46564, -31562, -19645, 17495, -1591, -11629, 5520, -6248, 1409, -18952, -1848, 9229, 2315, -31899, -10699, 14551, 6188, -3939, -15324, -15657, -7975, -16157, -47166, -67846, -40970, -7639, -43556, -26818, 355, 3353, -10050, 24605, 1770, 13452, 5765, -22368, -25164, -32032, -10316, -2253, -9331, -16796, 10551, 11368, 1970, 3446, 32309, 24097, 39777, 80370, 45878, -34623, -41315, -60110, -49816, -27929, 22474, 23734, 1494, -29361, -27459, -6250, -29767, -38412, 3499, 37155, 42315, 16513, 1354, 34085, 62449, 53690]
15788E3690k5732k2496l9902p337L9473M6774K8659J6061k6232j9354j1494j9517
15776A2593l7238k5568J6622L7760L2628J910o8381J0982J5581j4478l1827J0769
15764c8647o633j3571J6094j3100j9809j7583J0147K7263J220J6085L8824j8578
15752a8288n5718J0914J6808J5547m070J8042O80K108K0851j5712j0320J8592
15740e66p954K0830j7711o693L1149J993l6550R680K2739J0054m5330k4241J4114
15727b8486J1784m597K4867J597J2329r410k0808j149L0388J1661j3765R586k74
15714B3723l2165l5684j9198J3489K9440J49O2300L5821k1103j3268M649q001
15702D0152p825M1171J8538j2228m507k2552p640p872j3664J7330P206j5660m7616
$$ y = [53690, 27958, 5462, -34440, -41777, -2304, 44470, 73129, 89190, 62958, 43604, 32110, 12593, -24645, -50213, -33591, 4169, 36797, 38707, -29674, -18692, -3111, -17589, -49416, -38647, -45280, -58851, -42757, -55857, -75666, -93249, -83102, -55839, -54619, -38534, 290, -18288, -74006, -63092, -46284, -30737, -34807, -16765, -16085, -13977, 6874, -8838, -19158, -566, -8520, 12310, -5401, -12094, 19055, 21048, -15502, -5822, 16917, 26971, -18359, -42600, -28486, -16702, -21299, 3568, 5165, 17494, 8084, -12724, -13873, 16515, 28176, 14411, 23997, 23723, -8442, -44126, -63324, -49835, -20395, -20246, 42054, 77875, 56772, 43504, 48153, 40152, 32327, 73498, 92036, 79808, 75301, 52749, 45109, 37237, 23573, 40903, 48109, 32449, -15167]
15689a5167p569J3704J6541l375K7045J9241j8963n7961l3323J0136N3317m12
15677C214j9878j7308k510L950q179R968J3866O280k1765M9848K1632j8266J8631
15664C9483J0830k2022m9147j2626M003M1432k5215m4710p64Q887J5315O034q325
15651c6825m973R688m8550j1837L9095k841L356L4976q63P913k3032J3844k249
15638b2298p578k249J8715l922q994o892J9161k5982n12q271J5991o493k8946
15625f8270J8355L6378O577k2539j716j3394k1350j268K6334K2751L2732J421
15613A6011J838j3807j8358p716L3841M7054Q187q151k0010k754k385l5584K00
15600a634j0638L1117J7910o1199q656K4568M82n994J7456M791j39J5123j4913
$$ y = [-15167, -22736, -9032, 7509, 4134, 31179, 50420, 31457, -26504, -59827, -49691, 3626, 3214, -16664, -33972, -36482, -32532, -40711, -30743, -16877, -10597, -32362, 17486, 39118, 20852, 39483, 50313, 28291, -20856, -33482, -29479, 11953, -13262, -57972, -58736, -49849, -34534, -28500, -36825, -41798, -32110, -80660, -92497, -53402, -56243, -52887, -17911, -18774, -10861, -33893, -20049, -22298, -29876, -32125, -13410, -17332, -26326, -33218, -14057, -40039, -40551, -48822, -32831, -39324, -68270, -49915, -13537, -6960, -29499, -31215, -44609, -65959, -67227, -40893, -18142, 14590, 16011, 17849, 4042, -14316, -22032, 11809, 58863, 67050, 58899, 38889, 36135, 33750, -1834, -1634, -12272, 18845, 36755, -24444, -33100, -8532, -8050, -14044, 3412, 8203, 8064, 23187, 8274]
15587H274J0820M8814l6923j4616K266L1361j9765j5944j7684K373J520m5910
15575d5414n565L3728N006K9501L3436P308P407n042o4545r293P734N672L9180
15562C9113M510k6301l6871m3109J9061J9898r109j483O836K6118Q901l1210k7507
15549e1153j5008J1642J6101J7519Q313J3434L23l7312M735N0256L0768j2287
15537C7331l2514j4866j4117K4726K8645N566l6608m1607N104J2552n170m096
15525c5054J6847L7121L0175J077k749j9704j2191j6116l5704K8519K5610l266
15513A4565k3929J5073N831J5155J2409j2952k7860J5664j5158o506n978l2622
15501d6308N214K7628L9014J4090K5904o8312j5215J7986M342Q697K0112l5289
$$ y = [8274, 19094, 67908, 30985, 16369, 18635, 49996, 30231, 14287, -3397, -1024, 496, -45414, -50979, -17251, -12245, 17256, 50692, 58000, 65407, 60365, -4180, -13473, -5739, -67, 39113, 43623, 17322, -19549, -62658, -43597, -23699, -32808, -34291, -27455, -1337, 7564, -23646, -51153, -66161, -54519, -38418, -20899, -12586, 848, 1171, -36141, -31406, 18850, 49618, 37331, 4817, -10049, -24166, 560, 29205, 34771, -1837, -43444, -38340, -25788, -30958, -35054, -18207, 18914, 49089, 50166, 47417, 27713, 15522, -594, -36298, -7779, 17831, 14565, -9364, 5709, 11540, 26695, 39104, 26152, -1708, 13956, -1202, -7708, -13686, -46308, -41094, -13466, 25548, 39638, 65542, -2770, -17985, 1, 4343, 13040, 33152, -2137]
15489b137k363j9149J468P765l8285J316L0619K8236M0315q527j9162l1488R731
15476a661k1275p256J8767K3020j5507j3175M1765L6780J0818M350J1059L224
15464I0909m1487j8723k0445k7395r84M6899Q836r945k6108j0667k4528k4934
15452e8572l6825O825L479Q032O2315L0507K9543K2731N23j3481j4841l0237j1515
15439a516K291Q028K6411o96K529M365k7090m4614J0569K7703n370K2470q673
15426A6407l4867n380j721p269K5404N736k3919J2353j4920k5262O109j9726J3412
15413e3643K3668k373l592L9109l253j6731K68R55n232L0087j4835j6888J8243
15400d217k9896k3205M471N653K5338J791j7543J7821L1216R321j9579l0179j9528
$$ y = [-2137, -4500, -23649, -22181, -14416, -52701, -51385, -20766, 7470, 47785, 39258, 20096, -11392, -1661, -22936, -30192, -11425, 11595, -3912, -17087, 24678, 61458, 72276, 76626, 87685, 90909, 49422, 30699, 10254, -17141, -18125, 28774, 37610, 27665, 1557, -9110, -33638, -58572, -95397, -88572, -85093, -77061, -14746, 15761, 45304, 68035, 68558, 55077, 40236, 9999, -1516, 775, 8803, 35214, 34518, 37047, 41412, 14322, -30292, -19723, 7980, 2610, 25080, 16407, -18460, -23840, -25561, -32830, -7426, -1690, -25609, -13256, -28176, -53438, -47329, -67055, -53643, -29975, -32348, -35940, 3169, -84, -16815, -16547, -15592, -20824, 9263, -5572, -22460, -4217, -34113, -57318, -52847, -47194, -21856, -20065, -37608, -19787, 11429, 20750, 1171, -29008, -48536]
15387d8536j0786L8222K9627J3474j9675L1177j1226p893m9298o6674R805N3894
15375c7889P557R444l434k6782k4648J4983L7354k5485k3740K7039R133j1168
15363d7636L235K9998J5771j7795l1269j7409K1155O5332N3246O775j3703l7315
15351C0385m0561l1783r05j3728O161J4221P944K6052N8945j3900m1197l5068
15339c3434j7216n246M2665O150j9548L648J3638k5453J8269k853o407k5424Q099
15326d3112M6607J4513k2455k1701k7896o814k6253j7156M0151O0306j4537l4073
15314e2420j2358J6489N3712j5953K8057Q377k5473k356j820l2817k8160J856
15302f2866J4313k8177O669Q045k489M1063J6225P143M1970J2915m7999k1287
$$ y = [-48536, -59322, -21100, 8527, 22001, 2326, 33503, 22277, 14384, -34914, -101588, -91783, -37889, -30332, -20888, -24322, -51104, -75752, -60769, -23415, -48900, -72640, -45601, -36468, -47636, -44401, -14403, 1368, -16427, -47696, -65105, -43950, 21382, 74628, 81403, 67700, 30385, -10176, -41959, -42864, -56592, -50431, -36210, -28266, -2214, 56731, 42831, 1634, -33434, -50650, -55896, -13231, -7081, -26629, -22981, -9343, -34796, -16527, -19380, -25787, -51211, -43112, 3495, 18008, -4447, -26148, -54044, -60858, -87111, -104267, -64116, -3810, -18347, -52420, -64778, -48289, 5423, -10530, 17527, 25904, 431, -1925, -3745, -36562, -64722, -62866, -48553, -76730, -70061, -62016, -64505, -23442, -7217, -74, 41896, 54811, 6812, -14475]
15290a4475J3623J7942l6079J4894K694M215R700L8635n49j0701q686J550k2737
15277A0026l1381K8193j925l3780J5661j1468j9933M1106K1117O39j9332r661
15265a0738L4172K889m7082k325r108k1953K0966J5918J3154K5123m000k9539
15253a2523j6207l2133l1951K5224N6682j9415k9931P002K9113K3650J2313k6270
15241a4446j3165J511K3053K5439k112q720k7447k9172j8888j9713K1127N4722
15229g811M2617J0064o722m4055j884K2895j509j417J3981M7676M9138j1125o6036
15216D5812k2204L0679L2387k5639k2162j7117P082j6566m0636k1215L0701P052
15204a1826k9701O290M1644L5303k4861p068N1470j9876k3842k4550L852J9614
$$ y = [-14475, -852, 17090, -18989, -4095, -1401, 2814, 12514, 51149, 50600, 39899, 31213, 32763, 10026, -21355, 6838, 4913, -28867, -13206, -24674, -44607, -3501, 17616, 18255, -1077, -10738, 23434, 26323, -20759, -23084, -32192, -54145, -33179, -17261, -4107, 21016, 17016, -12523, -28730, -60863, -92814, -67590, -10908, -30323, -60254, -53252, -24139, -489, 11824, -14446, -27611, -26100, -3047, 22392, 20280, 11560, -15887, -45059, -63947, -83660, -62533, -7811, 34806, 44870, 38148, -5907, -7791, 15104, 13595, 12178, 26159, 73835, 122973, 111848, 45812, 23608, 54287, 86674, 61035, 38873, 21756, 28838, 12272, -28364, -49579, -18878, -11826, -41527, -35237, 6407, 41710, 16849, 9781, 61251, 41375, 17533, -7017, -3165, 16449]
15192A6449r068l1090J3014J2079R475J0460j1407k9026J4174L5091J1619P717
15180D9487j7353l3323M0371L3164j2172j0736m4809k0160L3310J2187m607j9037
15168F322j6008j9038k089J3099J4144o968K0655J3822K112k2920o7026q138J3787
15155e8246J4192r43j9575J0353l793j34L3991J8380J9301J7326L285k4578J4224
15142B3783k0452l7131k7745J9313J6648n840k7659j346L4212r59R693n07O1386
15129D3396J5271l1746l0995l1401l0904J3965P186P3407L7522j4366j9304l1282
15117G49l2604K5684L0628q711L744q485l3306k507q320J5907L113j3313k1900
15104d9321q853N8067P6047k1937k4997k4171k0488j0315m921j4686R39J3256
$$ y = [16449, 7381, -23709, -10695, 1384, 10859, 21319, 9912, -19114, -4940, 30151, 41770, 49487, 32134, -1189, 39182, 72346, 60174, 49438, 4629, -15531, 17779, 29966, 25359, 6322, -9686, -28724, -30813, -17714, -3570, -10538, 10117, 23939, 26051, 3131, -63895, -72033, -58246, -44054, -44997, -64572, -54219, -58012, -58146, -24155, -5775, 13526, 30852, 34137, 9559, 23783, 3331, -33800, -61545, -42232, -25584, -31424, -59083, -60429, -26217, -27176, -17483, -17990, 43396, 58667, 26921, -4074, -35475, -66379, -52414, -45228, 28179, 65701, 51335, 32031, 749, -31855, -6171, 24457, 15746, 19490, 11005, -22301, -24808, -33128, -17221, -14108, -27421, -49321, -58174, -107, 75940, 54003, 29006, 4835, -15653, -25968, -30889, -45575, -44636, -31380]
15092c1380J0122j2487p377J7052J5350k6111K460M9823L387j2253K595o109M376
15079I448n448K6193j5777m4140o3455J5373L7577K9889j0483j4806J5572J8827
15067a230k6165R868J1562J3550j2346m425l910J0766q272q442M2083O765Q043
15054C7847j1338m1592K1187k7127j0095J8682k5479j1097J1362j237L0066J8923
15042A0102r532J2740j0731Q852P058k4467j2096k5889q318K3050O562J882L2354
15029A1567M9198J2140l2901k9179P824j7546N960L0436l7425m9234K3556j2129
15017c7733p975M768J8848N6202K2759N1362j82R414j008k6589m2413j5437o523
15004B5493k3323l0969r179J7143M5902L7984m8335k1286L7349J9302M3015P0986
$$ y = [-31380, -21258, -33745, -41122, -24070, -8720, -34831, -32371, 17452, 20839, 8586, 11181, 5072, 9448, 4000, 30193, 14416, -29724, -93179, -77806, -40229, -10340, -20823, -35629, -20057, -1230, -27395, -17527, -5965, 7585, -4761, -9186, -13096, -2330, -10602, -19044, 23039, 29804, 37847, 26509, -15083, 6104, -21023, -31118, -12436, -37915, -49012, -37650, -38887, -8821, 10102, 570, 13310, 2579, 11431, 18489, -5978, -18074, -43963, -52281, -29231, -22669, -20787, 11567, 60765, 72905, 40004, 10825, 18649, 1103, 7063, 37499, 74, -49160, -25604, -37733, -45708, -40940, -22092, 34110, 56869, 108231, 108049, 117463, 116455, 89866, 47453, 32016, 25493, 2170, -28799, -37978, -20835, 25067, 63051, 14716, -6570, 30779, 50081, 93096, 164082]
14992A64082J27463K21007K59427J5530j27719k00571j65974q3680k2909l8763
14982A47893m6629j264k8957k5369j7070j6173J2855N11J9488J8339P132l9958
14970C0798k4512r13l678q651K0887K4643L61k3319l6303j4405L7649K6821n574
14957B3804K3226K0775J4223p172k6854k0347L8257J3087k3898J8570j3426m2965
14945A7280m8497K1933J0841j0760k1950J2197O473l9826j694M9023J8628l1618
14933a7970J1776J7720M311J1653J5859r912l8564L958L2084k340k7008K704K2039
14920B6310p485p952J580k2254j5241J2211O481J3548m95J2632O91l402j4508
14907B116q424j2073j0821L6017P627M157Q442n45l0579m010j3609K5368k249
$$ y = [164082, 291545, 512552, 771979, 787509, 659790, 459219, 293245, 209565, 186656, 147893, 101264, 100000, 71043, 45674, 28604, 12431, 25286, 25797, 45285, 63624, 70756, 30798, 6286, 5373, 1695, -6956, 13931, 38574, 38935, 15616, -20687, -35092, 2557, 29378, 23804, 47030, 67805, 82028, 74856, 48002, 27655, 65912, 78999, 55101, 73671, 60245, 17280, -31217, -9284, 1557, -9203, -31153, -18956, -12483, -52309, -54003, -4980, 13648, -17970, -6194, 11526, 15837, 27490, 43349, 33437, -5127, -1169, 30915, 28575, 1567, 4271, 26310, 18825, 10873, 12453, -9801, -25042, -12831, -6350, 7198, 6703, 19335, 20026, 16624, 2116, -6308, -18381, -29202, 6815, 14442, 18599, 27041, 26496, -4083, -8093, -21702, 3666, 1417]
14894A417r043J5317J4754K4317l1711O932K0204l2345n5960j6148l06K1126J7559
14881b3887J6558j740m42J6637r860j4504K5897J5081k1994k1541J3921M759n970
14868g085m107O561k6018q72k448P963J2162P059O370Q970j1082m217l0138J0182
14854b6700K342J9071k1317j6907L5757n345L6928J6464k9052K16j9863m0691
14842d9097K0586K6036o982L844L264M522j2642q802M2051J3736L714J7618l1962
14829B5886k1350l2846l18J5224K6141K7315K6666K2315n3201J532R080k9409
14817A7035O626k49n6195n0755L2800J5090J6819K8958j0883o314M392Q476m104
14804A696r646o109k228L3902l895j1523J8323j918p4974K3124K6691n179K3009
$$ y = [1417, -7626, 7691, 22445, 46762, 15051, 21983, 42187, 9842, -46118, -62266, -62572, -41446, -23887, -7329, -9069, -9511, 7126, -2734, -17238, 8659, 23740, 1746, -19795, -5874, -1115, -7085, -11192, -4631, -30649, -31521, -33969, -26006, -13844, -6785, -415, 8555, -2527, -6744, -36882, -26700, -24358, -5287, -26604, -43511, -7754, -13099, 23829, 40293, 11241, 11457, -8406, -49097, -28511, -2475, -9457, -5613, -2349, 2173, -10469, -19271, 22780, 36516, 40230, 57848, 25886, 4536, -28310, -28628, -13404, 12737, 40052, 66718, 89033, 35832, 37364, 46444, 17035, 23661, 23412, -32783, -83538, -50738, -35648, -18829, 10129, -754, -7068, -2676, 5800, 1696, -7950, -14059, -16287, 17615, 13720, 2197, 20520, 18602, -56372, -33248, -6557, -11736, 11273]
14791A1273l6854J8488q685k9361Q632J8526K5055k7453j0912o4K0289J3383J0852
14778A3169K2266n672j8058n171K932Q286J5033K5158J2088N198k469k3934m8415
14765D11m2393J9145p032k3991l919M9411M5893L2458m2252n6428p770P168R286
14752b0013q923K8789k594N349j6769r192j9103k9069L5831J2289L9054M4497
14740F0146l7831l3388J8934K9280k845k6334M83K0772J5384L251k5669q457k3361
14727i635k2922L0771K1554p920j2029k1392K2455L5552J6231k2735n5978K0927
14715e121J1882L126l165j1087l6080K9795O238k3416P0p867J4169l004r13K5217
14701a56J4269n275J1096j0711l6029k4052L9743J0581J3059K4219r063j2115
$$ y = [11273, -25581, -7093, -15778, -45139, -36507, -17981, 7074, -20379, -31291, -31355, -11066, 2317, 13169, 35435, 29763, 11705, 6534, 9466, 17752, 32785, 57943, 70031, 75229, 72760, 48826, 411, -41982, -22837, -29869, -53860, -57779, -8368, 37525, 69983, 27731, -28697, -36467, -29299, -20013, -28936, -147, -2741, 2608, -14161, -23353, -42456, -71525, -35694, -23405, 15649, 60146, 22315, -11073, 7861, 37141, 34296, 7962, 8445, 29217, 44601, 47852, 22183, 13726, -9635, -32557, -1786, 19768, 11848, -181, -21573, 882, 36434, 52665, 29930, -26048, -5121, 6761, 9887, 6722, -4365, -40445, -10650, -4412, -27828, -27758, -35625, -21456, -24460, -25373, -156, 14113, 8838, 19934, 9223, -26806, -50858, -11115, -534, 12525, 36744, 27681, 15566]
14689A5566K0851J8918j8622q587l2112Q825j9791j4146l604j2313K5592J1655
14677g768j8712J9472J3737m1704k205J3418P229Q725K6317L807J93l5701m568
14664a7760p91j2170K2627M0930M033j8182L143K9248K1893K4928j6151j8198
14652F3550k3397k8946l8304K4689J734n267L9848M55k1166r685j4494M19l627
14639a4191J2068J1214J4330J3034K3925j8632K671l5551m1996j0437j4582l906
14627f2053K7321Q035N0340P86J3185j30k2331j5312n04l2223j8126q393j7210
14614g6615J7509K6654N371L8437K5647J2652J9354M910m1187l272k1658R334
14602A7136L5998K1774l6735l230J5917k2336k196N9274J2223l1560j3584l5140
$$ y = [15566, 36417, 55335, 36713, 28126, -3986, 4839, -14952, -29098, -32702, -45015, -19423, -7768, -26480, -7008, 6729, -34975, -37180, -23762, -16533, -7808, 18509, 22316, 22509, -13192, -17760, -18551, -30721, -8094, 32836, 36869, 18687, 21830, 51078, 72971, 97899, 81748, 63550, 40153, 11207, -27097, -2408, -674, -5941, 33907, 34362, 13196, 3511, -10983, -10564, -14191, -2123, 9091, 23421, 36455, 60380, 41748, 44419, 8868, -33128, -43565, -58147, -62053, -34732, -26697, 23643, 24429, 37614, 37484, 15153, -159, -663, -32886, -51012, -59405, -76615, -59106, -32452, -27081, 11356, 37003, 49655, 69009, 73919, 32732, 29460, 7802, 17136, 53134, 74908, 38173, 34943, 50860, 28524, 26328, 85602, 97825, 66265, 52681, 17541]
14590A7541J5218L5914J7022j2955j276j8565k5284n540J4116J4364m7261k7577
14578b4283j2215J2347L3710R27j2311L4583l3606k4885J5741J2090K8191j8218
14566A2071j0927K068K3962M5518j1484n4785J1865K0506j9392j4338O938O853
14554A8855K523R684K3502K0475m6270k2951J9458J3434Q977l7338k5155k7618
14542d2424K0392K0770L4731L098j8827k1114J2290O483K7644J902r094j2612
14530B3239R076l3369l5393J9108L7237L0907L0096j7526o1249j7699K182J5487
14518B096J1211o623q227L300j3186L3388Q993K0895L3720L2080m0581o7988m3395
14505c4317j95J6475N640K351L3017P844K1978k3138j2311j5109j5548K2060J1104
$$ y = [17541, 32759, 68673, 85695, 72740, 71464, 52899, 27615, 22075, 36191, 50555, 3294, -24283, -36498, -24151, 9559, 10486, -1825, 32758, -848, -25733, -9992, 2098, 30289, 12071, 1144, 3212, 27174, 72692, 61208, 6423, 18288, 38794, 19402, 5064, 12002, 18855, 21378, 31062, 54564, 75039, 28769, 5818, 25276, 38710, 47687, 10349, -14806, -42424, -22032, -1262, 33469, 36567, 17740, -3374, 8916, 15399, 43043, 44945, 35851, 23239, 32315, -1054, -36447, -17339, 19898, 50805, 80901, 63375, 2126, -15573, -13391, 2096, 13307, 6684, -1543, 1757, -11429, 21959, 30952, 51847, 85567, 117647, 77066, 9078, -34317, -34512, -18037, -12397, -10046, 22971, 30815, 52793, 29655, 17344, 2235, -13313, 8747, 19851]
14492A9851j8110J1412N1506j2415m3391j7968N9096L2247j1778k740n629J4469
14480G6550J4406j186o6142m8279o522O1071L9246l7361p240k3239l5266K2353
14468a1609K7622J0457j4435K1161Q212k3481j9703k0678N0229N1110k4466m1716
14456A2703j8575J0267j2112K1894N8779J2502l0510m2857j5265j5148M389k247
14444a6180J5272j6821J2912J8673j7669k1138j9808O15M8089o645j6429O428
14432a2701R640J5436o945L0075k7150J0527J7584J7738l052J8322J2262j5717
14420F6019l7075j2704O581n079R251J2577L8908k6515l2116R548J8764j841l0026
14407A6292j9054K0355J0104j9634m2158l4435K1795J6065L2394M5483P04m5358
$$ y = [19851, 1741, 13153, 64659, 52244, 8853, -9115, 49981, 82228, 70450, 67710, 62081, 76550, 90956, 89770, 23628, -24651, -31173, 29898, 69144, 31783, 24543, 1304, -33962, -11609, 16013, 26470, 12035, 33196, 41408, 17927, -1776, -22454, 27775, 78885, 54419, 12703, -5872, 4395, -7717, 14177, 72956, 85458, 54948, 12091, -3174, -18322, -13933, -16180, -908, -17729, -4817, 13856, -3813, -24951, -44759, -44144, 3945, -2700, -19129, -12701, -3061, 12375, 5430, 35505, 8355, 18882, 36466, 54204, 51152, 69474, 81736, 66019, 28944, 16240, 22821, 17742, 26993, 39570, 78478, 51963, 19847, 29395, 48159, 46318, 16292, -2762, 17593, 27697, 8063, -34095, -68530, -46735, -30670, 1724, 47207, 47911, 2553]
14395B553o8429Q249K1404P0594K5210k7378N601J1201j6907j2015l2728J2187
14383d58m077J9121J7674l6586K7059L2598M03j9650j5945k0759j6414j4495L6373
14370D844M9068J2274k8735m585J0680k3917L5738J597n324k9975j3706K9062
14358C7021P268J2947k4316K4658q32l6442O274K0387K0226l4608r703P661K2125
14345E2666J7133k4398N72m4895k3723K0162N5198J8383l898o226j593J266K60
14332F0907r461p724k2658j2318j231J7608j2642M6354J7573j5115l0988j8470
14320A1835R939J6339m8064K3703R50K173K2890n64Q964l523j7569m4878j5889
14307c3694J3536J1990J247J9517M2764K3870l6162l2065L0776O7366j2280o9925
$$ y = [2553, -65876, -57627, -36223, 34371, 59581, 32203, 37804, 49005, 32098, 20083, -12645, -458, -4535, 14586, 32260, -4326, 22733, 55331, 55734, 36084, 20139, -620, -17034, -31529, 4844, 53912, 66186, 37451, 32866, 43546, 19629, 55367, 56964, 51640, 21665, 7959, 37021, 44289, 57236, 32920, 57578, 56746, 20304, 26578, 46965, 67191, 32583, 22880, 30541, 52666, 69799, 45401, 45973, 1078, -22645, -2483, 52715, 71098, 67200, 60974, 59381, 60647, 60907, 51446, 43722, 21064, 8746, 7515, 25123, 12481, 58835, 76408, 61293, 30305, 11835, 21774, 38113, -9951, 13752, 14702, 16875, 39765, 39201, 48165, 44642, 27073, -17805, -33694, -20158, -8168, -6921, 12596, 55360, 79230, 43068, 11003, 41779, 109145, 96865, 26940]
14295B6940l2715J246R732N600k2621j4638k641J4532M0901K0160k132o3675l9700
14282e9011J2181K1359N373j8160J7065J8831l263m923j1666K0852p334L1803
14270B3107J9713J7130P397j8773j604j3079J8510k6729R839M745k4831l7145
14258b1720R746L702j220R589P6973L5009Q379m6917k8325P530Q576o031o86j1117
14244D3488O644J4861j4646m0258l1374Q539L7760M0558n414o531l1435k815o34
14231A8743J7818Q420J8009p882r921J5734j9182o364J5907L1372N675l2928j9645
14218C5756k1075p453J3332j0905N781k2378J440K3810O101J2107j3591n7719
14206c4794j4288K9224J6813Q321K0285J2273o611L1571K938k079J1087l4052
$$ y = [26940, -5775, -4529, 5203, 10803, -11818, -26456, -29097, -14565, 26336, 46496, 44364, -19311, -59011, -46830, -25471, -20098, -38258, -21193, -2362, -5625, -10548, -22214, -1362, -8696, 23107, 42820, 59950, 67347, 48574, 46970, 33891, 52401, 25672, 35511, 40256, 15425, -21720, -11974, -8272, -9492, 97, 77070, 112079, 120458, 73541, 45216, 52746, 61322, 55291, 54605, 43488, 50132, 64993, 50347, 10089, -21285, -12746, 25014, 65572, 60158, 53627, 22192, 19377, 18743, 36561, 44981, 62990, 55108, 45187, 60921, 41739, 35375, 51282, 82654, 88329, 55401, 35756, 14681, 7228, 20560, 9655, 15436, -6942, -5502, 18308, 24409, 36516, 22925, -34794, -49082, -19858, -3045, 5276, 25561, 37834, 31223, 62794, 65732, 63653, 74740, 40688]
14194D0688n9274l2666K7249N9146P4895P673l6596l0679j8109j3852k3924J195
14182d254K0206j8061k3658P581J3152K3182k0232o037j7404R76L3047k5350j6555
14169c3407J8119J8827R324L8135K8815j5081j5593n2171M792K8069j5536k9357
14157a5064j9812j1818K8431Q915N332J8640J4715J6812l7556K0746Q681q196
14145B9826l1045l810J5433m979p40J7985R042J9798n860k0572k4168L8493L0668
14132G0071o275J6057k5344l3026j6494J1469K3404L1458m1183R850j2120N431
14120C3298L2412k540J9823q744n1833k8397J1623L0847K5800k583j9211l8128
14108B367L5902m681P753J6591K0217J4287k9332j625J1417k3550j1293J5767
$$ y = [40688, -18586, -51252, -24003, 35143, 110038, 117711, 81115, 50436, 32327, 18475, -5449, -4254, 15952, -2109, -25767, -18186, -5034, 18148, -2084, -8121, -25525, -24549, 8498, -16852, -33407, -15288, 3539, 12863, 50998, 79813, 64732, 49139, -3032, 1760, 29829, 14293, -15064, -34876, -46694, -18263, -9348, -4016, 14624, 29339, 46151, 8595, 29341, 38022, 29826, -1219, -5029, 10404, 5425, 4685, 22670, 31712, 51510, 45650, 25078, 910, 39403, 70071, 63796, 79853, 54509, 21483, 4989, 16458, 39862, 71320, 30137, 39987, 27867, 33298, 65710, 63170, 82993, 74249, 22416, -5981, 5642, 36489, 62289, 59706, 40495, 2367, 38269, 33588, 41341, 57932, 78149, 92436, 63104, 61479, 72896, 49346, 38053, 53820]
14096E3820R124k3281L598n375K0487j5554l8885M8858N1133m7782n3442L2068
14084C4769J4758j8826m2763L1524L9010J8194m4542k8287n741k5251M5836M3087
14072F1768N290p19k3391k9434j0734K1300N5529M5157l7835n2237k211P457Q216
14059D8156J1621j4993j6969o885k4753O165r010j3490j0613L697k994r358J3148
14046b6278K7359L1058o099l3882n5518j6336L9899J9941M2189J9607p236j0164
14034B4540l8165k9041N1938K7633L520j4823K5992J8944N598k1825m425m399
14022D5487J6501q574j3927j7589K6075O292M432J1438k6870r178K5830N254n325
14009E9846p812j8869K797K7305K3968r795m8250l0256j8832J6244K4988K4146
$$ y = [53820, 62944, 39663, 43261, 37886, 58373, 42819, 3934, 52792, 103925, 56143, 2701, 34769, 49527, 30701, -12062, 19462, 58472, 76666, 32124, 3837, -1904, -27155, 18681, 61768, 67058, 66339, 42948, 13514, 2780, 24080, 79609, 124766, 86931, 34694, 32483, 39940, 48156, 59777, 44784, 27815, 20930, -3823, 2342, -6668, -20158, -30771, -27074, -30068, -39426, -26278, 1081, 32139, 26040, -7842, -63360, -79696, -39797, -19856, 22333, 41940, 34704, 24540, -13625, -42666, 9272, 36905, 40425, 25602, 51594, 70538, 76136, 54311, 49886, 45487, 61988, 53414, 39487, 21898, 47973, 54265, 58697, 70135, 43265, 34087, 59917, 65171, 59846, 52034, 33165, 35962, 63267, 87235, 77440, 29190, -1066, -19898, -3654, 21334, 45480]
13997D5480R466J0616n1375n1815R942j6440k0666L0758K966L4947K2130J034
13985B7043r235J752K5648m94J1468J7072J2098m1132m4121k9067M0484J6041
13973B7557K172L6146J7218l146m6504k2114O970j2867K5731O940P377L9806K0577
13960A05863j9581k9487K5883J900j5957j5059Q326j2064k7993k996K8277J5363
13948F2475L970J9613Q685j395m4580k4787j9260P237K93J8316Q711j3766j7038
13935H474o5357p500L3397L3117j9475q48N5022J5540l749l2945J815P321K6308
13922E1120k002m2525K916L1227M383J2291K7949K794o511l0665j6221L1234L099
13909F9089p524m950J4229J9171J1347m0738m5896j4589L2303P403o362K35k8823
$$ y = [45480, 54946, 65562, 14187, -37628, -27686, -44126, -64792, -34034, -31068, 3879, 26009, 27043, 17808, 19560, 45208, 44714, 56182, 73254, 85352, 44220, 99, -28968, 11516, 27557, 29729, 65875, 83093, 79947, 33443, 11329, 18299, 5432, 31163, 38103, 45480, 85286, 105863, 86282, 56795, 82678, 84578, 68621, 53562, 61888, 49824, 21831, 18835, 47112, 62475, 66445, 86058, 94743, 93348, 48768, 23981, 4721, 11958, 12251, 30567, 39278, 25512, 8474, -56883, -64383, -30986, 2131, -17344, -18192, 36830, 52370, 48621, 15676, 17491, 24812, 51120, 49118, 6593, 9509, 40736, 45119, 57410, 85359, 88153, 81642, 50977, 34756, 65990, 69089, 61565, 56615, 70844, 90015, 101362, 60624, 14728, 139, 32442, 39845, 33483, 33718, 4895]
13896D895J607k319J8347J4186L6428M8788j1434l8714k7798j3958K5697L4241
13884H9966K7816j1966J0162l00k7998j9359r239k6681l0948o257P497M469l7962
13871c0800J093N2422L8070m3160l1521l030L574l2658j5756K6802K2341J397
13859a1226L0490p629J7085J949l10k597j0301K0671Q548j0377r20Q831p266J0809
13845D7757J6075J3184R704r203l1453k7416J8871m775N636l6204k5628j7376
13833d0828K4500K6404M198J7697o255p296K971N754r319K5954J5668M058J0437
13820G3943K4948l0188j4949p258n324L8902k6125n3619J0566L4280Q929k3047
13808C1058j6361J0143j1214J4365J7870l3212n3128p252L4829J1578l9506L6205
$$ y = [4895, 6502, 4183, 22530, 36716, 73144, 121932, 110498, 71784, 43986, 30028, 55725, 89966, 117782, 105816, 115978, 115678, 87680, 68321, 59082, 32401, 1453, -4804, 2693, 7162, -30800, -29707, 22715, 60785, 17625, -13896, -16926, -13352, -46010, -61766, -34964, -12623, -11226, 19264, 11635, 28720, 30669, 30359, 27762, 17461, 38132, 46680, 36303, 35383, 44214, 36948, 47757, 63832, 77016, 86720, 77517, 46064, 18648, 37519, 32744, 38380, 2176, -23452, -40828, -16328, 10076, 14274, 31971, 25716, 18420, 21391, 27145, 17826, 43780, 59448, 63506, 73943, 98891, 68703, 53754, 46496, 41172, 80074, 53949, 330, 10896, 45176, 54105, 31058, 14697, 24840, 13626, 27991, 45861, 12649, -40479, -47731, -12902, -1324, -40830, -4625]
13796d625K5591J2841K8711M583o203k3244L790J4041L118j4026R5j6561K3537
13783E1648O554R298K9271J1329n157K0937K2200m834p469k2239o2176k1321k2130
13770E911M7565Q601m000P829J9656q601j3059P26N5704J1140k1351k2303j7349
13757G0469K30j6490j5367J0779J2903J8490k4135l1505R577J8233j6652o662
13745B9870m754L0289J2234J534n9793m5484K5096K8391k0829J3651K4905J5272
13733E0382J2818k8095q102P787L1721J6860j6015k4573J9319Q75Q998R484Q648
13720I0107M1846J5617k7654k0210R74j7727j1180M688K995m1637k7241K239q789
13707D028K6968R19J6350J5426k2825J4813K4647j9040m9323j0995L6268J670
$$ y = [-4625, 20966, 33807, 62518, 67101, 60898, 37654, 41444, 55485, 58603, 44577, 44672, 28111, 51648, 58202, 67500, 96771, 108100, 102943, 123880, 146080, 141246, 133777, 111538, 49362, 28041, 5911, 53476, 62077, 58077, 65906, 85562, 76961, 63902, 64628, 120332, 131472, 110121, 87818, 70469, 70699, 54209, 38842, 49621, 62524, 81014, 56879, 25374, 34951, 53184, 36532, 29870, 25116, 55405, 67639, 69173, 9380, -36104, -11008, 17383, -3446, 10205, 35110, 50382, 63200, 35105, 27003, 34790, 66511, 83371, 67356, 42783, 62102, 62977, 71975, 81459, 90107, 131953, 147570, 119916, 99706, 100680, 82953, 71773, 76461, 79456, 37819, 10578, 12817, 4028, 30996, 31915, 48265, 63691, 40866, 55679, 80326, 61286, 11963, 968, 37236, 38906]
13695C8906L3426J9370k569K0131q166j4594k6201P291L2782L3456n2002k4027
13683E7803m1376N509J8001K4602K3272P3086L355j7086k208k8338J0237J078
13671A27935m2821j0785K3018J0410L643l1973M940k0539k6301q385L4094m749
13659E8487p630j1159L2884K2509j8734k8339J5779n29J1089N799J1270r006k2859
13646E9561Q193K734L288k618j9934n413R701Q128J993M3733j5266k0209J5230
13633H9121k786L281q869K2858J1514j0965J9416j6508K295l2560Q122m509m5940
13620C4470O587j9434m196J3791j5061L4128K6105j7964k0254M3469J4335K1744
13608A17720j2630k0774K0090m618q973Q295O132J959l3758P096J454m879l3368
$$ y = [38906, 72332, 91702, 89133, 109264, 101098, 86504, 60303, 67594, 100376, 133832, 81830, 57803, 16427, 21936, 39937, 64539, 87811, 160897, 164252, 147166, 144958, 116620, 126857, 127935, 85114, 74329, 97347, 107757, 111400, 79427, 84367, 63828, 37527, 29142, 63236, 58487, 50857, 39698, 72582, 95091, 76357, 48018, 63797, 63268, 74357, 80156, 91426, 82420, 59561, 67754, 70488, 73776, 71158, 51224, 45811, 55512, 63640, 65633, 109366, 94100, 73891, 89121, 86335, 89616, 80747, 103605, 115119, 104154, 123570, 107062, 109357, 76797, 84919, 80410, 34470, 41057, 21623, 17427, 31218, 16157, 50285, 76390, 58426, 38172, 81641, 95976, 117720, 105090, 84316, 104406, 99788, 90815, 99110, 105242, 107201, 73443, 80539, 81993, 77114, 43746]
13595D3746K019L626L6493K1333j9789J5051N4680m8521n3462L579k9183j3539
13583A6033P211L2230P473J2913l94k6110M701K2841L4320N259l7238o6429r531
13570C279K86J5664J1249l5735P528O90K0252J387J2651L6792Q130N13K3802R056
13556A15544k7634j0401L4936j5789j6985K6688n154j8777N334k701j8831K1465
13544H7695J4102k2874k1560l601J3158L2375k3264J5504K1877j0685j3886K9377
13532A18218J4149j8112j7439O295l8532l9637J0544M153K8213k4117l732K6793
13520F6796l702k7203r174M2020j5369L9864J733j7609k7237P399q665K9025k806
13507G5072l594m436M111p461K5093k98J8399M045l3593J16O6941K3529l1938
$$ y = [43746, 45765, 49391, 85884, 107217, 87428, 102479, 157159, 108638, 55176, 58755, 29572, 16033, 23244, 55474, 62947, 75860, 75466, 49356, 54057, 76898, 111218, 116477, 79239, 12810, 3279, 3565, 19229, 30478, -5257, 2271, 2961, 23213, 24600, 37251, 74043, 82173, 82686, 106488, 115544, 87910, 77509, 112445, 96656, 79671, 106359, 101205, 82428, 87762, 85061, 66230, 87695, 101797, 78923, 57363, 53762, 66920, 99295, 76031, 91535, 113412, 102727, 88841, 118218, 132367, 114255, 96816, 103111, 64579, 24942, 35486, 39639, 67852, 43735, 40003, 66796, 63094, 35891, 26717, 68737, 53368, 93232, 94965, 77356, 50119, 57518, 48853, 77878, 75072, 71478, 67042, 71153, 63692, 88785, 88487, 106886, 110931, 77338, 77454, 144395, 167924, 135986]
13494A35986j1431O818J7829j1941l593J0562j6720l275J5557J1391j8718J2042
13482A44507J5452L734l772K4995J2863j6703Q119j620l170K4931L3198J3273
13470B55807j5752k2368l7779K208l871m813m8667q263K1010L6962J721l9127
13458A37068P26J6895J1402j966j9684R062K3281j9036j2988j1349l0956L0426
13446A32881m224j0302j6960q319j469K4473J9770j8771k6141O205j787q921K0554
13433A06989L8428j5315P288j6463j5005M7896K7736j5286j3762p902M870k2852
13421A26622j9073N2609J807l0045p820r603k1928n2j55k1561m262K7769o405
13408H7903j2406q172J1551p351J5992j0385J4204K1930j0036m3453M036M2387
$$ y = [135986, 124555, 131373, 149202, 137261, 133668, 144230, 127510, 124235, 139792, 151183, 132465, 144507, 159959, 163693, 159921, 184916, 197779, 181076, 189195, 187575, 184405, 209336, 242534, 255807, 240055, 217687, 179908, 182116, 178245, 173432, 124765, 116502, 137512, 174474, 176195, 137068, 137794, 154689, 166091, 164125, 144441, 153503, 176784, 157748, 144760, 133411, 102455, 132881, 128657, 118355, 101395, 93076, 91607, 116080, 135850, 117079, 90938, 97143, 95356, 86435, 106989, 145417, 130102, 137390, 120927, 105922, 153818, 181554, 166268, 152506, 144604, 149474, 126622, 107549, 160158, 161965, 131920, 124100, 114497, 92569, 92517, 92362, 70801, 66539, 94308, 87903, 75497, 67325, 78876, 71525, 87517, 77132, 91336, 113266, 103230, 59777, 63813, 106200]
13396A06200K8470q157m9025j9455M0567J5952j9710K5990K4101j6472k4787P306
13384A10980J8240K5576R43n2487N32K7022l103q221l9621l5295K389L5547O653
13371H9155K7854J1600k0605k2612Q331q712k9442l296N112j0770m1545K3162
13359B8232L3031N780J7140R492N326K0460k8625J4352J7465k192j63j0289L9312
13346A49321R3248K103k3173j3805n1535m9558j6468j1218q123O245J5989L2812
13334A25838K4237L0431j3019j2539N2895K5672K211m7890n0883N638q264J3502
13322A47829j9925l2688K881L0772J5592J2005j1970K2685n4230m1955P511R354
13310H7861n28M6324L1605m783k3866m1129N523K218K055K5122l654l4109J0038
$$ y = [106200, 134670, 126513, 77488, 58033, 98600, 114552, 94842, 120832, 144933, 128461, 103674, 110980, 129220, 154796, 155739, 103252, 103784, 130806, 127703, 119482, 79861, 44566, 46955, 82502, 89155, 117009, 128609, 108004, 85392, 93723, 85011, 55569, 52273, 57385, 46615, 5070, 28232, 61263, 67043, 84183, 93675, 99001, 119461, 90836, 105188, 122653, 120461, 120298, 110009, 149321, 242569, 244672, 221499, 207694, 156159, 106601, 90133, 78915, 70792, 77037, 93026, 125838, 150075, 180506, 167487, 154948, 207843, 233515, 235726, 187836, 136953, 142591, 134327, 147829, 127904, 95216, 98097, 128869, 144461, 156466, 144496, 167181, 112951, 70996, 78507, 87861, 87333, 133657, 165262, 160479, 136613, 95484, 101007, 103225, 105280, 130402, 126748, 92639, 102677]
13297A02677k6518k2530K3306J8873j3822N324J1924l335j1055k7542J7050K2748
13285I7100j4612L1360O412Q043m483l5140j369J0961k1041l3811n384L3575N529
13272G7140P830k2808K7303K5289J3152j6046k0310N9603Q893n4439j1813q393
13260H5401k4920o136k0123j0653L7732N3338J7161k1954r452j560K8381K226
13248A29441m174j0160J1077j5568Q068K0993r332Q873j82l6905L149J3197l6957
13235H1520n606L7382K9646M1461l688k4589j4842m548k7043K6887L1619J6800
13223A84999j7195l2138k6903j8730K872L2495L3079K9625k382l9211K2207j1747
13211A56971j8321m8633N826q2j0493m98N5793K0165l0197p695N0250J9773j7713
$$ y = [102677, 76159, 53629, 76935, 95808, 81986, 87310, 99234, 95899, 84844, 57302, 74352, 97100, 82488, 113848, 120260, 128303, 123820, 88680, 87311, 98272, 77231, 43420, 38036, 71611, 77140, 84970, 62162, 89465, 114754, 127906, 111860, 91550, 151153, 160046, 105607, 93794, 85401, 60481, 54345, 34222, 23569, 61301, 114639, 131800, 109846, 100394, 98834, 127215, 129441, 125267, 115107, 126184, 110616, 118684, 139677, 130345, 139218, 139036, 102131, 105280, 118477, 81520, 75914, 113296, 142942, 184403, 180715, 156126, 141284, 136736, 109693, 136580, 168199, 184999, 167804, 135666, 108763, 90033, 92905, 125400, 158479, 188104, 185722, 146511, 168718, 156971, 138650, 90017, 95843, 95761, 85268, 84770, 140563, 160728, 130531, 122836, 173086, 192859, 175146]
13198A75146k748J2634n841R644k863J5039p847o7246N824M0165J1554k4098J0212
13185A69575L0384J2376p894j7779P581K3992j3998o457L793k8913K1819k4787
13173A69692P888K5734J169k3318o001k0532k0391J64j2823L3086K6725L970L1097
13160B16460O420j4602m185P764P498J0355J0261k4894o6087k2216J602J9437
13148A47813K9590L6859n487K479J7118j0512q420r84j2453k5496j4305K1508
13136A77710K4365k9863k3551L327K0997r404j3680L6573J5362k3872m7610K5469
13124A55823J4927l0402J0693p279J5092K2979N603R414O8746K0929K9151L0176
13112C45852J1689M0040N8511J12016J31032J37717N7486J5279q4587r2834j13064
$$ y = [175146, 172398, 185032, 179191, 188835, 185972, 201011, 193164, 125918, 131742, 171907, 183461, 159363, 169575, 199959, 212335, 204441, 186662, 194243, 218235, 204237, 197780, 201573, 172660, 194479, 169692, 177580, 203314, 204483, 181165, 175164, 154632, 134241, 134405, 121582, 154668, 181393, 185363, 216460, 222880, 208278, 204093, 211857, 219355, 229710, 239971, 215077, 148990, 126774, 128376, 147813, 177403, 214262, 208775, 211254, 228372, 217860, 209440, 208456, 196003, 170507, 156202, 177710, 202075, 172212, 148661, 151988, 172985, 163581, 149901, 186474, 201836, 177964, 130354, 155823, 170750, 140348, 151041, 143762, 158854, 181833, 187436, 196850, 265596, 286525, 315676, 345852, 357541, 397581, 456092, 568108, 699140, 836857, 894343, 909622, 825035, 732201, 619137]
13101F19137n3260p50k5723p7191l0446k9387Q088p42Q979J7798J1449M6359J9856
13088E14167l728j5272l439K9588L4931O0423M9054K7009O4468R3293P5642N3093
13076I79229J08182O0788l9879j5400r9330j51744p8450k9983k5355P580j2462
13065G03176k450k3094n2524k6405j334l830q3925q5393j6595K0707k5893j5099
13053C87341R518R718P73j8685L0606N7533P9366J27389J59919J39719N0451l4568
13041I99080n8816j14658q0708j19214q5444m8311j9359n1169m0987l6866k8133
13030C15415j5026p664k4599J2106J0672k8294j1779l6609j8080L4935j3046j8050
13018A99981L831Q090m566q861j2589q772Q54K4947J6028k5995K1782j0836j5254
$$ y = [619137, 565877, 565127, 539404, 462213, 431767, 402380, 410468, 409726, 418705, 436503, 447952, 494311, 514167, 510439, 495167, 491728, 521316, 556247, 616670, 665724, 692733, 757201, 850494, 926136, 979229, 1087411, 1148199, 1108320, 1092920, 993590, 841846, 763396, 733413, 708058, 715638, 703176, 700726, 677632, 625108, 598703, 597369, 593539, 509614, 424221, 407626, 428333, 402440, 387341, 396859, 406577, 407350, 388665, 419271, 476804, 556170, 683559, 843478, 983197, 1033648, 999080, 940264, 825606, 744898, 625684, 540240, 491929, 472570, 421401, 380414, 343548, 315415, 300389, 292725, 268126, 280232, 290904, 262610, 250831, 214222, 196142, 231077, 218031, 199981, 203812, 211902, 207336, 198475, 185886, 177114, 177968, 202915, 218943, 192948, 214730, 203894, 188640]
13005A88640J35O644Q085O851N336O891R32P759l4016N814l6513p288K1381j7951
12991A62700j6908L9074M0091K0489j1825m37j8526J5691L4075K2033l9019l0206
12979B17232k364K621K4819K3655J6645k5856j9620j1061j7810P072j5392M6129
12967B46070M984m4549j8571j3439O800l2356k533K1709o540k281K3578K6234
12955B09106m453M0964J0233l3432J2219M096k6548k9382J4243J6923j9940R365
12943B03394K8600K7287J8307K9495J1675k955m830J031K7301J3122l8789p0030
12931B43608n5148j2888L9280J4308M2021K2038r701K1352k0172m6199l8663J8130
12919B17966K9091L680J7230O533K5573L5623q718k1870l0299r408j3484k1612
$$ y = [188640, 188775, 195419, 203504, 210355, 215691, 222582, 223514, 231273, 197257, 203071, 166558, 159270, 180651, 162700, 145792, 184866, 224957, 245446, 233621, 233184, 214658, 230349, 264424, 286457, 247438, 217232, 214868, 217489, 242308, 265963, 282608, 256752, 237132, 226071, 208261, 215333, 199941, 246070, 251054, 206505, 187934, 174495, 181295, 148939, 146406, 168115, 161575, 159294, 182872, 209106, 204653, 245617, 255850, 222418, 234637, 238733, 212185, 182803, 197046, 213969, 194029, 203394, 231994, 259281, 277588, 307083, 318758, 315803, 310973, 312004, 339305, 352427, 313638, 243608, 188460, 175572, 214852, 229160, 271181, 293219, 283518, 304870, 284698, 238499, 199836, 217966, 247057, 250737, 267967, 274500, 300073, 335696, 326978, 305108, 274809, 265401, 251917, 230305]
12907B30305j62J1333K8620J4536L0381l107p250N529k8177k5343O57M857L6244
12894B98423r567N647R569J5568O1511J4264j1559k2370M9431j6197j3972k348
12882C78400j5839q561j7175p024K8282P157J2905K2565l6003J6617L2526N409
12870D19259J1710r938j5809l9132L962Q397m943K7200j9397m1550j4204K4002
12858C49557L3023J2065N3299M4980O350j5208l6775k1794J1299m359j6060j9024
12846C97353j7818P52k3371J4811L7012k0742j1683p808L8969L4296L5591J5609
12834D92971J5578O087k0908k3328m2344j7678M0265J0073K1753j7943K5553K7511
12822E17590k8470j05J4889q118J7266J0717K086O5495J5650O7272J58614J88340
$$ y = [230305, 230143, 241476, 270096, 284632, 315013, 311906, 304656, 310185, 282008, 256665, 257322, 262179, 298423, 288856, 294503, 304072, 319640, 381151, 395415, 383856, 361486, 410917, 394720, 380748, 378400, 362561, 354000, 336825, 329801, 358083, 365240, 378145, 400710, 364707, 381324, 413850, 419259, 430969, 421031, 405222, 366090, 370052, 378449, 373506, 400706, 381309, 339759, 325555, 349557, 382580, 394645, 447944, 492924, 499274, 484066, 447291, 425497, 436796, 432437, 416377, 397353, 379535, 380287, 356916, 371727, 408739, 387997, 376314, 368506, 407475, 441771, 477362, 492971, 508549, 514636, 493728, 470400, 428056, 410378, 450643, 460716, 482469, 464526, 490079, 517590, 489120, 489015, 503904, 495786, 513052, 523769, 525855, 591350, 607000, 674272, 832886, 1021226]
12810A021226K06784J96695J21416J2397m9698J7922R4224M9415o6054j64476
12800A439851k13785j85908j54929l1165l4244l3168o9067k6412J8376l3276n6352
12789F19921K2428J4322N0355O2008L489k4505K4877k647N051L3579J5950L5650
12777H60478L7780q691m3438k8209k7176j9267m1245l1256j5588Q436k640K1015
12765G10199m389j4769L0845J7151K0654j6930J6655l0438J1533N9155L7465j4754
12753H22377j7263N700j276p4m443K7780K9157J4949j0728j3589k3587o8824k6604
12740G33575K0476J9755K6607M1697l751Q822K0501N104J5772R393N474j0110
12728H93315J5354J5764M6575L4823L0207K3929J7547J4348q395j071k4496q670
$$ y = [1021226, 1228010, 1424705, 1546121, 1558518, 1508820, 1526742, 1620966, 1670381, 1604327, 1439851, 1226066, 1040158, 885229, 854064, 819820, 786652, 717585, 691173, 709549, 676273, 619921, 642349, 656671, 707026, 769034, 772523, 748018, 772895, 770248, 775299, 808878, 824828, 860478, 898258, 889567, 846129, 817920, 790744, 771477, 730232, 698976, 683388, 691824, 689184, 710199, 705810, 691041, 721886, 739037, 759691, 742761, 759416, 728978, 740511, 799666, 837131, 822377, 805114, 810814, 809538, 809464, 805021, 832801, 861958, 876907, 866179, 852590, 829003, 760179, 733575, 754051, 773806, 800413, 842110, 838359, 847181, 867682, 872786, 888558, 897951, 903425, 893315, 908669, 924433, 971008, 1005831, 1036038, 1059967, 1077514, 1091862, 1083467, 1082396, 1057900, 1049230]
12716A049230r435L9474N7915K3298k4661k3939k7409j0810J9367J665K6772M2303
12704A163770L2049K3225L8928N1013L027N4336M9667p114J4385O1661O0649P6472
12692A622068O1838N9769R8719P9900P5914J00970J07569R9594J16793J24780
12682B547914J51757J91334J98010K15983K34661K55236L38107M10529M73662
12673E017193O35663P02106O66637N27163M95309N30443O67888Q54186J072940
12664A1169528J499961K042677K800846M005254N697609Q340417J2224366J7432616
12656F5213274K3085017K6148623K2316325J0431865m704210j6227689k0513616
12649A05749589j9267908j5676120j1676309q180649n241139k873020j027459
$$ y = [1049230, 1039795, 1079269, 1137184, 1160482, 1135821, 1111882, 1084473, 1073663, 1093030, 1094695, 1121467, 1163770, 1195819, 1219044, 1257972, 1308985, 1312012, 1366348, 1416015, 1408901, 1423286, 1484947, 1545596, 1622068, 1683906, 1743675, 1842394, 1922294, 1998208, 2099178, 2206747, 2306341, 2423134, 2547914, 2699671, 2891005, 3089015, 3304998, 3539659, 3794895, 4133002, 4543531, 5017193, 5652856, 6354962, 7021599, 7548762, 8044071, 8574514, 9242402, 10096588, 11169528, 12669489, 14712166, 17513012, 21518266, 27215875, 35556292, 47780658, 65213274, 88298291, 114446914, 136763239, 147195104, 142490894, 126263205, 105749589, 86481681, 70805561, 59129252, 50948603, 45707464, 42834444, 41806985]
12642D1806985M12759J363653J963346K524236L316528M050077M073225L490877
12634F3001686L351707M494699O622941Q307605Q724543Q277641Q626624J0826945
12626A22234391J4918016J8999798J8775666J0856460k926029j5302158k0553197
12619A47002947j8606684j3335890q193020m172675j393683J37979P5305j454895
12611A00059384l704444n276172n521247n023350n009875n972896o721591o407744
12603E6422065n275109l690924k029794l64212J466192L836729P139607J1992729
12595F9497283J8398398K5287143K9965425K7827046J5459729l870041k0719143
12588A61845840k8358046k7142482k2162434j7047478j2603959q903869o023134
$$ y = [41806985, 42219744, 43583397, 45546743, 48070979, 51387507, 55437584, 59510809, 63001686, 66353393, 70848092, 77471033, 85778638, 94503181, 102780822, 111407446, 122234391, 137152407, 156152205, 174927871, 185784331, 182858302, 167556144, 147002947, 128396263, 115060373, 106867353, 102694678, 101300995, 101438974, 101514279, 100059384, 96354940, 91078768, 85557521, 80534171, 75524296, 69551400, 62829809, 56422065, 51146956, 47456032, 45426238, 45062026, 46528218, 50364947, 57504554, 69497283, 87895681, 113182824, 143148249, 170975295, 186435024, 182564983, 161845840, 133487794, 106345312, 84182878, 67135400, 54531441, 45627572, 39604438]
12581C9604438l855692k530850k091010k378359l001319l426215l356715k968156
12573A5996122k468984k014121j631798j350104j066122q60757p41727n78387
12565E284122m70859m20636l64247k88622k29725k05490k33904k23485j48294
12556B698860q9404p2991j06116j35119m9864p2124j18767r1349q91m6023l0126
12545A886086m3735l2654J0903k6515n4482j6041k6675k7886k7651J7082m6525
12534A611907n9868l0173j3501k8392l1721j4357r409L6188O8079L6796K0801
12523A586350P0106L8248R6675J50144J64899J67487R5724J1656k1664K697p494
12512B354828J1430j8079l0324q6788j83664j47902n7217r7663q8831k3913l6805
$$ y = [39604438, 35748746, 33217896, 31126886, 28748527, 25747208, 22320993, 18964278, 15996122, 13527138, 11513017, 9881219, 8531115, 7464993, 6604236, 5862509, 5284122, 4813263, 4392627, 4028380, 3739758, 3510033, 3304543, 3070639, 2847154, 2698860, 2609456, 2536465, 2430349, 2295230, 2245366, 2173242, 2054475, 1963126, 1962235, 1916212, 1886086, 1842351, 1809697, 1820600, 1794085, 1739603, 1723562, 1696887, 1669001, 1641350, 1658432, 1611907, 1552039, 1521866, 1508365, 1479973, 1448252, 1433895, 1424486, 1460674, 1528753, 1565549, 1586350, 1656456, 1694704, 1791379, 1941523, 2106422, 2273909, 2369633, 2381289, 2359625, 2362322, 2354828, 2366258, 2348179, 2317855, 2231067, 2047403, 1899501, 1842284, 1744621, 1655790, 1631877, 1595072]
12501A595072n5991n8192o3591k0252L0346p933Q338O891r563m7402m3887p3911
12489A259925l7811K1564O2667P0043K1079L5302P6482M5023J3280K0184O9098
12478A656836N4802l873K3966J8960j8161P373L8605O4281J4862l5396m4184n5972
12466A722099j08432j12005o6258m9099o5053j9466P121J893k7345r254j487o9153
12454A203561l0827J036o048K129K7769L2539K3692L7170k0367l4206l062k0417
12442A212969J9682K9285m0074l0679O8854P2179L7661M8462M745K666K60J3310
12430A439320k3980J9106P2172N7510K8322K1144L6528O1145O8998N7972N8243
12419A896480Q3215J69170J60902J43596J00751J20644J54866K04397J93960K38479
$$ y = [1595072, 1539081, 1480889, 1417298, 1397046, 1427392, 1419459, 1427797, 1434688, 1425125, 1377723, 1333836, 1259925, 1222114, 1243678, 1306345, 1376388, 1397467, 1432769, 1509251, 1554274, 1567554, 1587738, 1656836, 1711638, 1707765, 1731731, 1750691, 1732530, 1739903, 1778508, 1842789, 1857651, 1822255, 1778071, 1722099, 1613667, 1501662, 1435404, 1386305, 1321252, 1301786, 1308907, 1310800, 1283455, 1274201, 1272714, 1203561, 1172734, 1173770, 1167722, 1169851, 1197620, 1230159, 1253851, 1291021, 1270654, 1236448, 1233386, 1212969, 1232651, 1261936, 1221862, 1191183, 1260037, 1332216, 1369877, 1418339, 1423084, 1425750, 1426010, 1439320, 1415340, 1434446, 1506618, 1564128, 1592450, 1613594, 1650122, 1711267, 1780265, 1838237, 1896480, 1979695, 2148865, 2309767, 2453363, 2554114, 2674758, 2829624, 3034021, 3227981, 3466460]
12409C466460K77362K79046L70072M75648N70208O76025Q75310J068409J211727
12400I270267J326129J312940J315774J412305J705087K218048K859701L651350
12392B5071601M922491P043519J0754004J7128124K7368267M0215764M6988251
12385A79492021L5365242J0167105q656293p578621Q330779J7182860M037509
12378B38340602k1502014m0051283m1907302l3029124k3716378j6979756j2240562
12371D8914183r010236o797318n252095m019766l122148k447391k090544j848248
12363A4326437j671057j581251j409427j239712j110108q88880o81182n78511
12355E166309m87774m15918l54764k81696k83036j88123j63794j72021j53901
$$ y = [3466460, 3743822, 4022868, 4392940, 4868588, 5438796, 6114821, 6990131, 8058540, 9270267, 10596396, 11909336, 13225110, 14637415, 16342502, 18560550, 21420251, 25071601, 29994092, 37037611, 47791615, 64919739, 92288006, 132503770, 179492021, 214857263, 225024368, 216368075, 208789454, 217120233, 234303093, 238340602, 216838588, 176787305, 134880003, 101850879, 78134501, 61154745, 48914183, 39903947, 33106629, 27854534, 23834768, 20712620, 18265229, 16174685, 14326437, 12655380, 11074129, 9664702, 8424990, 7314882, 6426002, 5744820, 5166309, 4678535, 4262617, 3907853, 3626157, 3343121, 3154998, 2991204, 2819183, 2665282]
12346B665282j12800j29748r1185j02261l6523p0832o3454n0121n0424p8120j9211
12335A860603J2149k839o520n952M9615Q0330R9943J62407K46019L43558M46718
12324C286031M35227M35807L53243K07103J09960N1966M5485P301r3209k74009
12314D564905l89440m33387m87065m29691l59907k90836k69527j84526j41197
12305A579329j14398r8259p7666o4384q6738o6312j193j4386j9328l9586k4772
12294I72307j0868m2478p4521j6960m3024j6673j3255l7195L6069J4286n2080
12283G15608l6078o850L6484j6595q222q717l2180j1229n497l087l344l5301o213
12270E78779N7197Q2273N5330K4000J8399k404l663j4888k6436O640J3726j2171
$$ y = [2665282, 2552482, 2422734, 2331549, 2229288, 2192765, 2121933, 2058479, 2008358, 1957934, 1879814, 1860603, 1872752, 1869913, 1863393, 1857441, 1907056, 1987386, 2087329, 2249736, 2495755, 2839313, 3286031, 3721258, 4157065, 4510308, 4717411, 4827371, 4879337, 4924822, 4932123, 4838914, 4564905, 4175465, 3742078, 3255013, 2825322, 2465415, 2174579, 1905052, 1720526, 1579329, 1464931, 1366672, 1289006, 1224622, 1137884, 1071572, 1070379, 1055993, 1036665, 997079, 972307, 961439, 918961, 844440, 827480, 784456, 767783, 754528, 717333, 753402, 767688, 715608, 679530, 672680, 709164, 692569, 684347, 675630, 643450, 632221, 626724, 623637, 620293, 584992, 578779, 635976, 718249, 773579, 797579, 815978, 813574, 809911, 795023, 768587, 775227, 788953, 776782]
12258G76782n406L7108O8031L1897q377l6159k6336P684N358q892l8995o4736
12246G37959k3296o1802p9689m7982n787k1755O921q119P01L6887K4692O0760
12234F19490O2388Q683k873Q27k8634J913M212M1257Q6078O2432J9520L9262M0162
12221I54717K3863q734j3668L9284L4048q597r867J5016K0866M3536O2008Q5017
12209A237489O3365Q9771P4012P8759L9832j8923n2972O727n1931q6714l0661
12198A348754n6129m2069k954j7153j4434K1322P2397M1658K3448m657q656J1042
12186A372569l3049m1225j6968r619q085j7901M0101O0149L8674J5257k6420M352
12174A377835Q122m2629n6606k5996o1106K1793N0955l304q416N6476N2059O3858
$$ y = [776782, 771376, 808484, 876515, 908412, 900035, 863876, 837540, 845224, 850582, 841690, 802695, 737959, 714663, 652861, 573172, 525190, 519403, 497648, 504569, 496450, 497151, 534038, 558730, 619490, 681878, 690561, 687688, 688515, 659881, 661794, 666006, 707263, 793341, 855773, 875293, 914555, 954717, 978580, 969846, 956178, 995462, 1029510, 1020913, 1011046, 1026062, 1046928, 1090464, 1152472, 1237489, 1300854, 1390625, 1464637, 1543396, 1583228, 1564305, 1511333, 1518060, 1466129, 1379415, 1348754, 1292625, 1250556, 1247602, 1230449, 1216015, 1237337, 1309734, 1351392, 1374840, 1370183, 1361527, 1372569, 1339520, 1298295, 1281327, 1271708, 1263623, 1245722, 1285823, 1345972, 1384646, 1399903, 1373483, 1377835, 1385957, 1343328, 1286722, 1260726, 1199620, 1221413, 1272368, 1269064, 1260648, 1317124, 1369183, 1433041]
12162A433041k3378l0907p238J815m038N2294O6658Q8526J01336N3815L1098N9834
12150A822856M0973p688l9690p5051k5023k1179Q476Q5373J40797J28185J10338
12139B168367R5780N2138j6676N9682O6258K918n5225p2136p0024q4704q0982
12128B065396m9043o9831k6853k948N1187O5882L5881K6487O5061N6053J12044
12117B329316J29389J02405J49694K02267J99937K50702K69918L18497L58436
12108D310561M68116O07269Q19606J068847J425748J860514K287215K330270J843320
12099A7021466R77352J95595j03300J87431Q35440J745068K861832M308922O361996
12090C4391802R407933J3875721K0098915K7326138L2438906K9717238J6190629
$$ y = [1433041, 1409663, 1378756, 1371518, 1373333, 1369295, 1421589, 1488247, 1576773, 1678109, 1731924, 1763022, 1822856, 1863829, 1856141, 1816451, 1741400, 1716377, 1695198, 1703674, 1789047, 1929844, 2058029, 2168367, 2264147, 2316285, 2299609, 2359291, 2425549, 2428467, 2373242, 2301106, 2231082, 2146378, 2065396, 2016353, 1946522, 1919669, 1916721, 1967908, 2033790, 2069671, 2096158, 2161219, 2217272, 2329316, 2458705, 2561110, 2710804, 2913071, 3113008, 3363710, 3633628, 3952125, 4310561, 4778677, 5385946, 6205552, 7274399, 8700147, 10560661, 12847876, 15178146, 17021466, 17998818, 18194413, 18091113, 18278544, 19113984, 20859052, 23720884, 28029806, 34391802, 43799735, 57675456, 77774371, 105100509, 137539415, 167256653, 183447282]
12083A83447282l214323j9306258k6263879k5089416k0296676j5271190j1137506
12076F2868034p897309n281098k909773n65696J974004M482862N966104N560444
12068F4197572L539309J839129K063917M235008O941547Q066956O239595K211999
12060I9335032j700835l015694p27706M478033J1060129J7329026K0760225J8635077
12052A66153287J0259582j309844j0686474j4049184j2123313q953328p905030
12045A21385696r163716j0644278j0578933q751922n768035l208699k404090l697087
12037F7168936n834141p065225o511835m695209k379688l08227R94955J631147
12029D3000713K436812M250284P495067J1907563J7034393K1811131K2751056
$$ y = [183447282, 180232959, 160926701, 134662822, 109573406, 89276730, 74005540, 62868034, 54970725, 49689627, 46779854, 46214158, 48188162, 52671024, 58637128, 64197572, 67736881, 69576010, 71639927, 75874935, 82816482, 90883438, 97123033, 99335032, 97634197, 94618503, 93890797, 98368830, 109428959, 126757985, 147518210, 166153287, 176412869, 175103025, 164416551, 150367367, 138244054, 129290726, 121385696, 112221980, 101577702, 90998769, 82246847, 76478812, 73270113, 70866023, 67168936, 61334795, 54269570, 47757735, 43062526, 40682838, 40374611, 41369566, 43000713, 45437525, 49687809, 57182876, 69090439, 86124832, 107935963, 130687019]
12022A30687019J5631407J113409j3812144k2192185k2665010j9019571j4837420
12015E4905505j1198708q423215o299432m822541l810502l104199k526420k045432
12007A2675056j642448j274165r96125p62422n34196k93259j77026j46592j31534
11998F717289k48207m00312n33758o00139n54846m38578l99285l26122k73723
11989B942319k13792j73297j68463j29252q8662q1814j37351q0752j10933p5569
11979A682434p4015q5637o8932p1583m8356j8474j533j5775j9827m9203j9377
11968A209722K5115K10N991j5509p4944k3064k0263n522N7554O8587J34616K07333
11956A569826K46104J80811R7058j7782l494Q6077J17823O6446m9458j62521j54367
$$ y = [130687019, 146318426, 147431835, 133619691, 111427506, 88762496, 69742925, 54905505, 43706797, 35283582, 28984150, 24161609, 20351107, 17246908, 14720488, 12675056, 11032608, 9758443, 8762318, 7999896, 7465700, 7172441, 6995415, 6848823, 6717289, 6469082, 6068770, 5535012, 4934873, 4380027, 3941449, 3542164, 3216042, 2942319, 2728527, 2555230, 2386767, 2257515, 2168853, 2087039, 1949688, 1868936, 1758003, 1682434, 1608419, 1522782, 1453850, 1382267, 1333911, 1315437, 1313904, 1298129, 1278302, 1229099, 1209722, 1234837, 1235047, 1241038, 1225529, 1150585, 1127521, 1107258, 1101736, 1159290, 1227877, 1362493, 1569826, 1815930, 1996741, 2093799, 2076017, 2072523, 2158600, 2276423, 2342869, 2293411, 2130890, 1976523]
11945A976523j13600k8375k4765q22N4411J75346L14814M45440P35388J109505
11935D643865J586863J981798K013440J574086Q95339L90807K43542J67365q7310
11926A3409795o66231j429020j910624j968637j683436j303284r47111o49621
11918B851831m85712l71391k48027j58900j89343j43729j24713r5168r7794r0068
11908H46986q1753r4457m0457j1362n188R712M341M506q459j2935k0153k9840
11896E60941q7703n8450m1642l8004l5346j4349k5279j2472k2226J2601k4274
11885B13797j8734K4014j244n1011l0631L832l6941L2684O5284L8132L0412M3209
11873C12803Q685j0513n4410k3174M683j0121O277j1955k9089j7742m026o100
$$ y = [1976523, 1862923, 1834548, 1809783, 1808961, 1863372, 2038718, 2353532, 2798972, 3534360, 4643865, 6230728, 8212526, 10225966, 11800052, 12695391, 13086198, 13329740, 13497105, 13409795, 12743564, 11314544, 9403920, 7435283, 5751847, 4448563, 3501452, 2851831, 2366119, 1994728, 1746701, 1587801, 1398458, 1254729, 1130016, 1034848, 937054, 846986, 765233, 670776, 630319, 618957, 613769, 623481, 627822, 632328, 623869, 610934, 590781, 560941, 473238, 414788, 373146, 335142, 299796, 285447, 260168, 247696, 225470, 238071, 213797, 195063, 219077, 217833, 166822, 136191, 140023, 103082, 135766, 201050, 239182, 269594, 312803, 321488, 310975, 256565, 233391, 238074, 227953, 234230, 222275, 193186, 175444, 171418, 165318]
11861A65318n662m3847j0562k3205p277K0264l796q457p845j4651K9301r586p909
11848G2086j5641K017J3526L0727k6556k4214k5882p776K3220L0550q185J5318
11836G9190K7437Q000k770M82j785j0976k0296k5566l882l3729k1934K6154j3065
11823G260K502K0747N647L887o088M7329L5093O986J1743L7373J48152K13216
11811E33847K19155J05018o5934j47719j55360j22529q9216p7807l9689o268J943
11800A55441n3444l5418J2417R726J5196j9486r680O747K354J1838k8330p029
11788F0332k2932O3730M1667J3749J5305M7296N684l6883k4861j129k7813p193
11776A26952k3016k4770j211J0612k332J1802k8581k9479K6090K636l5583j9111
$$ y = [165318, 159656, 115809, 105247, 82042, 74765, 95029, 91233, 82776, 74931, 60280, 89581, 79995, 72086, 56445, 58462, 71988, 102715, 76159, 51945, 26063, 18287, 41507, 72057, 63872, 79190, 106627, 114627, 111857, 112339, 110554, 99578, 79282, 53716, 49834, 16105, -5829, 20325, 7260, 9762, 30509, 36156, 40043, 33955, 81284, 116377, 123363, 135106, 172479, 320631, 533847, 753002, 858020, 792086, 644367, 489007, 366478, 277262, 199455, 159766, 153498, 155441, 101997, 66579, 78996, 88722, 103918, 84432, 74752, 81499, 83853, 95691, 67361, 60332, 37400, 101130, 142797, 156546, 171851, 219147, 224831, 187948, 163087, 161958, 134145, 126952, 103936, 79166, 77955, 88567, 86235, 98037, 69456, 39977, 66067, 68703, 33120, 14009]
11764A4009K7032J3940K1180P186N229r511l0646m449K8129l8741J6186J8398
11752F7942J9589K860k6728k0481O498l920j7991j8220K190K8743J6247M522J1609
11739G2860m1482k6604J5722l1098r229j6262L6562L8832k3746K2088K1331j0033
11727D8941p098O522k935j4990r579p157p47R466J1924M077O735J359Q290K5761
11713H0569K1213l350k4446J2134J8644M1442P5048L8103j6474n6852k9610l7047
11701A19374n7164m6960P386J8402K4153M9677k7520p804K6847k4992j8049j6702
11689D6648l2523K5985K005j0776j057r748O861m564K0557M531K1012K804j7119
11676E4616k7391q604L8448J8933J2613k3451J0925l3218m0345M8963J7158J7408
$$ y = [14009, 41041, 54981, 76161, 83347, 88576, 79065, 48419, 43970, 72099, 33358, 49544, 67942, 87531, 90391, 63663, 43182, 49680, 45760, 27769, 9549, 11739, 40482, 56729, 61251, 72860, 31378, 4774, 20496, -10602, -19831, -36093, 469, 39301, 15555, 37643, 58974, 48941, 41843, 48365, 45430, 30440, 20861, 13704, 12957, 22423, 34347, 38424, 45159, 46518, 54808, 80569, 101782, 98432, 73986, 86120, 104764, 146206, 221254, 259357, 242883, 186031, 156421, 119374, 62210, 15250, 22636, 41038, 65191, 114868, 87348, 79544, 106391, 81399, 63350, 46648, 14125, 40110, 42115, 31339, 30282, 20534, 27395, 22831, 43388, 47919, 68931, 71735, 54616, 27225, 18621, 57069, 76002, 88615, 65164, 76089, 42871, 2526, 51489, 68647, 86055]
11664H6055M8789r111k3367r179J1973J8620K250K9361L6454L223l6514J3321
11652A71875L0769N9407Q6180N2058N7985R1156J43762J14995O2438l0326j03647
11641G36652j41991j32403j02686j5494j2090p736K3738J0233K9405O4287R6133
11630E48048J30216J16428J17423J36502J54904J51392J14494J06600N5185j05062
11620A526130j47225j28589j38343q5719N54j1970J7538L1873o0297m4229q2291
11609H77432m9312j5988m6483l1967k3730m4703n5857o0430n2740l183o025q791
11597D78223O781n4926p235J3215j0778j4407M5697P7267P3180O6445J02162Q6368
11585H61992J60871J90343J79063J69838K00616K05895K44408L33447L62686K21089
$$ y = [86055, 134844, 125733, 102366, 93187, 105160, 123780, 126030, 155391, 191845, 195068, 158554, 171875, 202644, 262051, 348231, 400289, 458274, 549430, 693192, 808187, 870625, 840299, 736652, 594661, 462258, 359572, 344078, 331988, 324252, 347990, 358223, 387628, 451915, 548048, 678264, 794692, 912115, 1048617, 1203521, 1354913, 1469407, 1576007, 1631192, 1526130, 1378905, 1250316, 1111973, 1026254, 1026808, 1014838, 1032376, 1064249, 1003952, 959723, 877432, 828120, 812132, 765649, 733682, 709952, 665249, 609392, 548962, 496222, 493039, 487014, 478223, 485004, 430078, 422843, 436058, 425280, 410873, 456570, 533837, 607017, 673462, 775624, 861992, 1022863, 1213206, 1392269, 1562107, 1762723, 1968618, 2213026, 2546473, 2909159, 3130248]
11575C130248M8278j78571l85292m60239l86343l14151k82320j88218j52955j49195
11565F81242j14522q7231o1456p9784j1818K797k3850k8097k2979K792m1442m4703
11553A70949n0203j9512j174k6079J1043j6976K461P677N742m423j6474j1378
11541E1653L2514k3522j4338J1832k8750p432j9716m3208O949J3972K3699P261
11529A0914q868J042M7100L1229j1189l3748l4399O779M1107M44l5588o126M9
11516H746l2258M791K4316K8620K5132K2072r559J324J6226P347J584J5528l964
11503A09905j8948k6180k1570P838j7241R777M985K4453j0057j6831l1682K2647
11491C7096M3022K1892o942j8216q860J868j1859m015n788J7490J2886L8379M2774
$$ y = [3130248, 3178526, 2999955, 2614663, 2154424, 1768081, 1453930, 1171610, 983392, 830437, 681242, 566720, 479489, 418033, 338249, 326431, 329228, 305378, 277281, 254302, 257094, 215652, 170949, 120746, 101234, 100060, 73981, 85024, 68048, 70509, 78186, 83928, 79505, 63031, 51653, 84167, 60645, 46307, 58139, 29389, 21957, 2241, -40967, -34018, -20046, 3653, 10914, 2046, 3088, 50188, 81417, 70228, 36480, 2081, 8860, 49967, 50411, 14823, 8697, 8746, -23512, -18721, 5595, 34215, 59347, 81419, 71860, 73184, 89410, 96757, 98341, 113869, 109905, 90957, 64777, 43207, 51045, 33804, 43581, 48566, 73019, 62962, 46131, 14449, 37096, 80118, 102010, 95068, 76852, 67992, 69860, 58001, 53986, 48198, 65688, 78574, 116953, 159727]
11478A59727M883J9332J5030K5936N7368L7384K8070P5315J23329K00948K11786
11467I59108J75848J32851L901j00816k04429j89306j30818q0223q0647n3813
11457D31656l1295k7182n785K3912P463N4942N4308K8694N1165n039l2569M6590
11445E96860p022j4478L1525J9099K5483Q5003J51250J67429J22696R0175J1286
11434A279306p0646r5777j19037j36460q3483j1012K8264l233o2617k4956p1627
11423F28722l2785j1202p0091o6373k8597m7114n8107J1475N7360J1939k6548
11412C68679M1073J13834J23540J47468J90094J62917P7437m2500j14495k01556
11402H66491j96269j39342j14841n2874m2362m4103n6699l9775o3130j3895M8212
$$ y = [159727, 164610, 183942, 198972, 224908, 282276, 319660, 347730, 423045, 546374, 747322, 959108, 1134956, 1267807, 1271708, 1170892, 966463, 777157, 646339, 566116, 485469, 431656, 400361, 373179, 367394, 391306, 398769, 453711, 508019, 536713, 587878, 582839, 550270, 596860, 589838, 575360, 606885, 625984, 651467, 736470, 887720, 1055149, 1177845, 1268020, 1279306, 1208660, 1112883, 993846, 857386, 773903, 762891, 791155, 787922, 725305, 700349, 628722, 595937, 584735, 514644, 448271, 419674, 372560, 314453, 325928, 383288, 395227, 368679, 409752, 523586, 647126, 794594, 984688, 1147605, 1225042, 1182542, 1068047, 866491, 670222, 530880, 416039, 363165, 320803, 276700, 220001, 180226, 117096, 103201, 151413]
11391A51413K1790L0360N725N0180M5094k0739j3350k6616k804n197N433j5549
11379B25740L359J808n1478j9993K9777n6335k8982N7331K7211m238L935k1997
11367A66138k2977j2124Q178k8496m7305j5434p643J9015K8927m033j791K4696
11355A07151R6449O2094l3663m6532o0457l2731k4128k8356k7870j3158l608j5539
11343b0348J3620q0k3854J7288m011J3274K0159N601J3120o278l6596j7698J6364
11330i439K9367n811k2290j4843L229J8837L9910k361j7257j7300J6958l0662
11318a1662l1453K4006j6624P114J5620L5549J1588j110J6916J3900J2862k072
11306G4634j0902j8906K0522k2215k4644j2363L3383K804k7819K6406K0304J6338
$$ y = [151413, 173203, 203563, 209288, 259468, 304562, 283823, 270473, 243857, 241053, 235856, 241289, 225740, 229099, 230907, 179429, 159436, 189213, 132878, 103896, 161227, 188438, 184200, 188135, 166138, 143161, 131037, 139215, 110719, 63414, 47980, 40337, 59352, 88279, 84246, 82455, 107151, 203600, 265694, 232031, 185499, 125042, 92311, 68183, 39827, 11957, -1201, -4809, -20348, -6728, -6808, -30662, -13374, -17385, -4111, 16048, 21649, 34769, 28491, -8105, -25803, -9439, 19928, 14117, -8173, -23016, -19787, -950, 38960, 36599, 19342, 2042, 19000, -11662, -43115, -19109, -35733, -28619, -12999, 22550, 34138, 33028, 49944, 63844, 76706, 74634, 63732, 44826, 65348, 43133, 18489, 6126, 39509, 42313, 14494, 40900, 61204, 77542]
11294G7542K3545J0750o0645j7303k3686j6702K2838J0725j6324J5685q869l089
11282A4467k2418o1326k9757L3531P0906J6638N855j1701l5094k2727J0313K6442
11270d871M5519J8676j8790n0569P029q706P214J1652k28j8827r913M0105J5265
11257C3556n0318k2066J1906M3639L9600Q482J7084J6041k9413O581J555r958
11245F6689l143p706n2296k2784r260K0625O610l9732O195N1918J966n899J8304
11232C1487k7545j8990O371j0492n58J8990J9035k9795k5846k8215k8151N0211
11220d3498N8155L8280Q511K3707L966l6906l9484m1314R195J4779M3457q122
11208C0726k56J4604r862o2646p164J3757N3134L4219l4457P121O427j7158m4298
$$ y = [77542, 101087, 111837, 51192, 33889, 10203, -6499, 16339, 27064, 10740, 26425, 17556, 14467, -7951, -69277, -99034, -65503, 5403, 22041, 27896, 16195, -18899, -41626, -31313, -4871, 40648, 59324, 40534, -10035, -3006, -11712, -4498, 7154, 6926, -11901, -21814, 18291, 33556, -16762, -38828, -26922, 16717, 56317, 64799, 81883, 97924, 68511, 75092, 76647, 66689, 63546, 55840, 3544, -19240, -28500, -7875, -1265, -40997, -34802, 17116, 19082, 13183, 31487, 3942, -15048, -8677, -19169, -19727, -737, 18298, -11497, -37343, -65558, -93709, -43498, 14657, 52937, 61448, 85155, 89121, 52215, 12731, -28583, -19388, -4609, 38848, 30726, 30470, 45074, 35212, -27434, -34598, -20841, 32293, 66512, 32055, 39176, 45603, 28445, -15853]
11195a5853j2210M3170L7478J6952q356k3407J177R229J4431K078J2236L5335
11183A12260k7071j9471n079K0151l0730o720M9247J4038k6285j9487m137k9286
11171B7430j2249k8898M7278P8838P7326J24937J00820P8107J7736n9353j13935
11160C38037n0931m5397n308m7843m3470r946N2174M8473J2193j6577Q1K9734
11148B61220k9544l1810L1497j7453q205n85p3714q7651l3276J3194L7952k3329
11136C8296j9358N518K2324N177j7002J5114L7144K4007k1140j7430K8336L0259
11124A31245Q42l3051k4747q480q728k8817j2319M1210K1196j4945L0164J5769
11112A09339m0034k0815q001j9195j8397L7025N6609j1538k6234k2441K778o742
$$ y = [-15853, -28063, 15107, 52585, 69537, 61181, 37774, 38951, 48180, 62611, 64689, 76925, 112260, 85189, 65718, 60639, 80790, 50060, 43340, 92587, 106625, 80340, 60853, 56716, 27430, 15181, -13717, 33561, 112399, 189725, 314662, 415482, 493589, 511325, 451972, 338037, 287106, 241709, 236401, 188558, 145088, 135142, 187316, 235789, 247982, 231405, 231486, 261220, 231676, 199866, 231363, 213910, 205705, 205120, 131406, 43755, 10479, 23673, 61625, 38296, 18938, 24456, 46780, 51957, 34955, 50069, 87213, 111220, 90080, 72650, 100986, 131245, 132087, 99036, 74289, 65809, 57081, 28264, 15945, 57155, 78351, 63406, 93570, 109339, 69305, 48490, 40489, 21294, 2897, 39922, 96531, 84993, 58759, 36318, 39096, 32354]
11100C2354J5097l2463m0993K524M774M0673P900j9218R41K2154J1263J8189O3061
11087A26256L7677k4724p7631m8698J3341j2747J3612K6375o570J2027j0681J2903
11075F1140K889m7539q83J5035J3761L933k7022l9654K277J7489K9219K7216L5145
11062I3006K1618j5718k0729j9521l2361j7582J4646N8257L1060k3235j3723j4248
11050F1470m2799l3719J6507K4279l211K9756L495j166p733j6136Q584N231l234
11037D1324J0280P850L2012J0526J1255l9943K119k7840n1586K087j8847K1575
11025H12N9656L9817k5623n6099p890L157P535n944K3523j5295k295l471k1638
11012c755M842J0011L8939K8123l3716l6702J8909k9905l389N357L0235j1720
$$ y = [32354, 47451, 14988, -26005, -23481, -18707, 21966, 29866, 10648, 11589, 33743, 45006, 63195, 126256, 163933, 139209, 61578, 12880, 26221, 13474, 27086, 53461, 46891, 58918, 48237, 61140, 64029, 16490, 15607, 30642, 44403, 48336, 21314, -18340, -16063, 1426, 30645, 57861, 93006, 114624, 98906, 78177, 58656, 26295, 8713, 23359, 81616, 112676, 89441, 75718, 61470, 18671, -15048, 1459, 25738, 22527, 52283, 55778, 54612, 46879, 30743, 39327, 44558, 41324, 51604, 59454, 91466, 101992, 113247, 73304, 75423, 47583, -4003, -1916, -20763, 812, 60468, 100285, 74662, 18563, 10673, 13830, 21365, 15421, 38944, 23649, 21354, 17883, -3755, 1087, 11098, 50037, 78160, 44444, 7742, 26651, -3254, -6643, -1286, 28949, 17229]
11000A7229j1473J0321K1602j6319j0856j1792L4903k683l8109L2559M3128l4446
10988C4064k4746R000Q263k2466m6119J5803L8139k9354k3611R155K3085L443
10976e344M7327J1379r369j4115r419p532m673q25n4795R50J5538L4467j9321
10963a5732j5491j881K4920N8444J8807n363K1219m433j6904O697j5376J8452
10951G3359l5034m6366j5855r594K4231m6072k3208O6785K8388k5586j9547J0069
10939a8430J6122l608K4345K8563o536r512m3K1633l386N217P654J5397m233J2421
10925H5604N263O949Q447L3769l2751m7598M707K6669L189K6948N9646O1784O6879
10912C09505L8806M9447J01586J58194K51136M05580N87580O42587M50085q326
$$ y = [17229, 5756, 16077, 37679, 21360, 10504, -1288, 33615, 30932, -7177, 25382, 68510, 34064, 9318, 18318, 26581, 4115, -42004, -26201, 11938, -17416, -41027, -31872, -8787, -5344, 41983, 53362, 43993, 29878, 20459, 12927, 8254, 7429, -47366, -46416, -30878, 3589, -15732, -31223, -33104, -8184, 50260, 69067, 63704, 84923, 80490, 63586, 70283, 54907, 73359, 38325, -8041, -23896, -33490, -9259, -55331, -78539, -11754, 16634, -8952, -28499, -18430, -2308, -5916, 18429, 46992, 40456, 30944, 30901, 52534, 49148, 54365, 62019, 77416, 73183, 85604, 90867, 97816, 106263, 140032, 107281, 59683, 64390, 91059, 94248, 121196, 180842, 242626, 309505, 348311, 397758, 499344, 657538, 908674, 1314254, 1901834, 2544421, 2994506, 2986180]
10902B986180m26269o09688n08678l25720k28276k15796j51759r4984r8179o0400
10892B66431k0764j1482l9092l6010j0382l5826j5419L0400N6575k665l2072l2450
10880A17244k6138j359P963l5937J6350J4104k6015m354K6601L3145j4395m7680
10868E9529j8314J7203N680J0812j8655N84k931K2203n278l0818j2175L0852k4618
10855C4074j5461J0936L9266P53K633J5768R334p546N792n0162j1376J7278K4695
10842G5984j0235l8366l8633N1375L3380k8792M777K0460m638k0017j0543j3472
10830B1280k0134l2721J1412K6473K5362J2509M61J1535J5551P370L9472P379
10818A25949k0118p785K8853J2944j2777J8388l614J8017K407m7150j6474j9640
$$ y = [2986180, 2559911, 1950223, 1441545, 1115825, 887549, 671753, 519994, 425010, 326831, 266431, 245667, 234185, 195093, 159083, 148701, 112875, 97456, 127856, 184431, 181766, 149694, 117244, 91106, 89747, 97710, 61773, 78123, 92227, 66212, 61858, 88459, 121604, 107209, 59529, 41215, 58418, 64098, 74910, 56255, 56839, 53908, 76111, 70833, 40015, 27840, 58692, 34074, 18613, 29549, 68815, 69568, 72201, 87969, 97303, 89757, 95549, 45387, 34011, 51289, 75984, 65749, 27383, -11250, 40125, 73505, 44713, 49490, 69950, 65312, 45295, 34752, 21280, 1146, -31575, -20163, 6310, 31672, 44181, 44642, 56177, 71728, 79098, 118570, 125949, 105831, 98046, 126899, 139843, 127066, 145454, 141840, 159857, 162264, 115114, 98640, 79000]
10806G9000j5202p130K2506K0506R764k1712l8228J0040K6243J0738L2749L4525
10794A63799l4118o1219o3426k3623M012K1001K7936K4695L3601K2018p830m6606
10782F0240Q260J649j0221k3194q899J9835P474k172M8167q201j9873p548k9102
10769C6415j7861K0506J2639k0936L9699M7494q542n2904J0304K99j2953j3432
10757D0728M948K7948L9096L0699L4440J5552l2604J4328P6124M3658m326n0713
10745B39878n3160k8818j2986k557M208O2793M5808k849m7164L7224K033J1132
10733B55542K0653M4624N434l081j2828m3871n9828n3353J6607O356m8822k5779
10721A01654J0752J5722q514M652P755j0968j8047L023m684k9263l290J853J847
$$ y = [79000, 63798, 56668, 79174, 99680, 109444, 87732, 49504, 59544, 85787, 96525, 129274, 163799, 129681, 68462, 5036, -18587, -14575, 6426, 34362, 59057, 92658, 114676, 106846, 60240, 68500, 70149, 59928, 36734, 27835, 47670, 55144, 52972, 101139, 92938, 73065, 65517, 36415, 18554, 39060, 51699, 30763, 70462, 117956, 109414, 56510, 66814, 67113, 54160, 40728, 45676, 73624, 112720, 143419, 177859, 193411, 160807, 175135, 251259, 294917, 290591, 239878, 186718, 157900, 144914, 142357, 146565, 209358, 255166, 252317, 205153, 242377, 244410, 255542, 276195, 320819, 326253, 323172, 310344, 266473, 206645, 153292, 169899, 176255, 127433, 101654, 112406, 128128, 119614, 124266, 132021, 121053, 103006, 106029, 101345, 72082, 68792, 70645, 72492]
10708G2492L0087J3958N58M6992M1916k2027m0407l0621K1398J5827J0697k1769
10696A39101Q754L0113j052O999K2694O301K7140k2574p2198k4904K9177J3360
10684A62911J5556J2834M062J0189L1837N2254K3831l2244p7022p0947n5564k9211
10672D8486p659L6950L6983j0405l0708L5274R635J7742M8801O9864k7387l5875
10660A91701K4029m0151l7188k9584j5857R619M772p657n929J789J4666L4388
10648A44598N6649j2027O312j0438Q217k7743L301K3100K6120M1740N4986Q1928
10636C96743Q1276L5673L3105M5743k919j3976J3820J688p541j6113L1711K7306
10624F26516j1851n4303j7299M7723O6233N3431O5169O7767J11217O8999L574
$$ y = [72492, 102579, 116537, 117095, 164087, 206003, 183976, 143569, 112948, 134346, 150173, 160870, 139101, 147855, 177968, 176916, 183915, 206609, 212910, 240050, 217476, 145278, 120374, 149551, 162911, 178467, 191301, 195363, 205552, 237389, 289643, 313474, 281230, 204208, 133261, 77697, 48486, 40827, 77777, 114760, 104355, 73647, 108921, 118556, 136298, 185099, 254963, 227576, 191701, 215730, 175579, 138391, 108807, 92950, 102569, 107341, 99684, 93755, 95544, 110210, 144598, 201247, 189220, 195532, 185094, 193311, 165568, 168869, 191969, 218089, 259829, 314815, 396743, 478019, 513692, 546797, 592540, 589621, 575645, 589465, 591153, 583612, 567499, 599210, 626516, 614665, 560362, 543063, 590786, 657019, 710450, 775619, 843386, 954603, 1023602, 1027176]
10613A027176o3584q5073p1146j4354k0481l5451j04157j10604j23684j13252
10603B85390m7129l6217j4892L5610j1576J7679L7065K3781j6903K9687L8502
10592C40997o122k5746J0173k440J5787M6939L0989l531j8963m5620O154J1449
10580C60066J6329L2363O7969L3611l8588m6517n602j5584o732R415J2312J353
10568D20395L2872K5657O6089M1836l1546J1491L3960q859n7904q365J1225J2847
10556E49698L3451O4973R2606N8141L2425L6185J3590J2054O7419O0274L3391
10545A054207K5814Q2314N949L0372J6197J3262K9370l160K2336O1177P5140Q2029
10533A495007L3643L9394L6946M4392O3285N7359L2037Q7697J39498J66725J98066
$$ y = [1027176, 963592, 878519, 807373, 793019, 772538, 737087, 632930, 522326, 398642, 285390, 238261, 202044, 187152, 222762, 211186, 228865, 265930, 289711, 272808, 302495, 340997, 334875, 309129, 319302, 316862, 332649, 379588, 410577, 407046, 388083, 342463, 348617, 360066, 376395, 408758, 476727, 510338, 471750, 425233, 419631, 404047, 397315, 406730, 419042, 420395, 453267, 478924, 545013, 586849, 555303, 566794, 600754, 591895, 533991, 525626, 536851, 549698, 583149, 648122, 740728, 798869, 831294, 867479, 881069, 893123, 960542, 1020816, 1054207, 1080021, 1162335, 1168284, 1198656, 1214853, 1228115, 1257485, 1254325, 1276661, 1337838, 1412978, 1495007, 1528650, 1568044, 1604990, 1649382, 1712667, 1770026, 1802063, 1889760, 2029258, 2195983, 2394049]
10522B394049J62807J45185J65863J90765J85145K18593J96392K01230J97302
10513D057331K44706K92965L39725M61462M98431N41396O79710R85950J316067
10504I417743J598835J689006J449808J137506J033398J278807J780531K463312
10496B1848946L313091M453770N984919Q336372J1971904J7631153K6764118M2457112
10488A42761385O9374641J08481832J39210667J10543770J6447306p6655918j18370581
10481C91793102j03227234p3938686n2658697l8188924k7794239k0260008j5008076
10474F0717238j1331743q536982o541563n088847l983579l068405k292285j825260
10466A8048574j737532j801775j744025j558227j351765j099832r25785p91237
$$ y = [2394049, 2556856, 2702041, 2867904, 3058669, 3243814, 3462407, 3658799, 3860029, 4057331, 4302037, 4595002, 4934727, 5396189, 5894620, 6436016, 7115726, 8101676, 9417743, 11016578, 12705584, 14155392, 15292898, 16326296, 17605103, 19385634, 21848946, 25162037, 29615807, 35600726, 43937098, 55909002, 73540155, 100304273, 142761385, 212136026, 320617858, 459828525, 570372295, 586819601, 510163683, 391793102, 288565868, 214627182, 161968485, 123779561, 95985322, 75725314, 60717238, 49385495, 40848513, 34306950, 29218103, 25234524, 22166119, 19873834, 18048574, 16311042, 14509267, 12765242, 11207015, 9855250, 8755418, 7829633, 7038396]
10458G038396o96494n86221m93690l84498l30589l24661k98139k58306j74494
10449C491304j63773k06652j78074j18648j18886j15980j30255j33143j07272
10440B218621p9202j19223j25510r5490j09770o4049j03008j03160k2850l9496
10430A356863q7436o2667o1458n7065k5530n7892N467r339l5893k3704o5914q159
10418H67273j2219R518q427K6362O3442l3183j3029l2561l7945k1735j8742k1366
10406G67388O172N458j2994k9847J2791O735p095K1705k2876m6782p6720p3458
10394E50477r820p176l676O327K6464K4187k6678k9129l4022j003L3736Q59k4277
10381E06269k5477j4562J427N107j8685O2904J3812M8894K5715J1256L0041j7456
$$ y = [7038396, 6341902, 5755681, 5261991, 4877493, 4546904, 4222243, 3924104, 3665798, 3491304, 3327531, 3120879, 2942805, 2824157, 2705271, 2589291, 2459036, 2325893, 2218621, 2139419, 2020196, 1894686, 1799196, 1689426, 1625377, 1522369, 1419209, 1396359, 1356863, 1269427, 1206760, 1145302, 1088237, 1062707, 1004815, 1010282, 1000943, 965050, 941346, 875432, 867273, 855054, 864572, 856145, 882507, 945949, 912766, 899737, 867176, 829231, 807496, 788754, 767388, 773560, 779018, 766024, 736177, 748968, 755703, 748608, 770313, 747437, 700655, 623935, 550477, 540657, 533481, 529805, 536132, 562596, 586783, 560105, 530976, 496954, 495951, 529687, 530546, 506269, 480792, 466230, 467657, 472764, 454079, 516983, 530795, 579689, 605404, 616660, 646701, 629245]
10369F29245K6568J7375L1697M2472j0244j05271j20725q0717k7244K3073O665
10358D32894J7602N9155K2502n3359q8216q0438p1605l7176o4153K9387O5384
10347B31977N0332M0668L4926O0297Q1146n447k8433O881N0190L5103K8647N8925
10335F45212L8803N3484P7326Q5439J58493J85801J75917J54810J84023K47482
10325B006790L31456M68039P02639R82809J270266J493530J394630Q26728O689
10316I483576p52634j218569j288785j203368j023792p68690n99521m54822l35207
10307A838188l25994k18880j44922j40700j13612n3528p7661o3235l2764k2991
10297F43901m7129k6598n2239j28734o2735n3831o7923J1986K3479j523J5289
$$ y = [629245, 655813, 673188, 704885, 747357, 737113, 631842, 511117, 430400, 403156, 426229, 432894, 450496, 509651, 532153, 478794, 390578, 310140, 238535, 201359, 137206, 166593, 231977, 282309, 322977, 357903, 418200, 499346, 493899, 465466, 472347, 522537, 557640, 586287, 645212, 684015, 737499, 814825, 900264, 1058757, 1244558, 1420475, 1575285, 1759308, 2006790, 2338246, 2806285, 3508924, 4491733, 5761999, 7255529, 8650159, 9476887, 9483576, 8730942, 7512373, 6223588, 5020220, 3996428, 3227738, 2628217, 2173395, 1838188, 1512194, 1293314, 1148392, 1007692, 894080, 840552, 762891, 699656, 666892, 643901, 596772, 570174, 517935, 389201, 326466, 272635, 204712, 216698, 240177, 238654, 253943]
10286B53943j2532k6328q206J5600J2666J3590Q646L9654N742L333O165K9048
10274C41321j4813J1498P441k9092j6474l1751r505l9958J2633N3593R399m429
10262B89863k0633r686j2155j2110q590O0297N8930n075j682K3012k5592K1598
10250C58177L3130J4040O2233r744L0765K1571n749k6360J1910K0117P8428J13710
10238G02228P1417R3956P7749J24230K07108J60086J30345K12391J87014J84393
10228B150917J25929J46711K45906L40587M57694O60613R89316J402476K133740
10219H653889L359422N360525Q471852J1992136J3371760R329909N70730p697939
10211E3412284j1434561j0583308q067568n824889m140022k997730k186030j585806
$$ y = [253943, 241411, 215083, 206877, 222477, 235143, 248733, 257379, 297033, 302775, 306108, 312273, 341321, 326508, 338006, 345447, 316355, 299881, 268130, 258625, 218667, 231300, 284893, 294292, 289863, 269230, 259544, 247389, 235279, 226689, 286986, 345916, 340841, 339159, 362171, 336579, 358177, 391307, 405347, 467580, 457836, 488601, 510172, 504423, 478063, 489973, 510090, 588518, 702228, 773645, 867601, 945350, 1069580, 1276688, 1436774, 1567119, 1779510, 1966524, 2150917, 2276846, 2423557, 2669463, 3010050, 3467744, 4128357, 5117673, 6520149, 8653889, 12013311, 17373836, 25845688, 37837824, 51209584, 60539493, 61110223, 53412284, 41977723, 31394415, 23326847, 17501958, 13361936, 10364206, 8178176, 6592370]
10203F592370j216788q81813o60623m77472l48180l24625k95381k43521k27709
10194A916258j95550j85468j74421j33232j12849j33474j21763q9580l6355k4952
10184G08614l0259j9233o7969p8898l3041k6697q931k0528q8250r9282o3086K1261
10172A93701M9225L4581l7317r086Q549j5851m3093l2905k7724J2974J1336j4937
10160A29453j2024k3343j2646K9182j9443J3976J0000K9956N738K2067j829R599
10148A80686k1764j1593j7784k5740M1263J6484j2543j3930k1992Q882K4659j3276
10136A33352l6435l4429K2332L6238j1624K3023j0837n583k0544k5507j1836N2678
10124A10828j0764k7130J5223N256j3621J2466J9266K838k8955o377J495J4313
$$ y = [6592370, 5375582, 4493769, 3833146, 3355674, 3007494, 2682869, 2387488, 2143967, 1916258, 1720708, 1535240, 1360819, 1227587, 1114738, 981264, 859501, 769921, 733566, 708614, 678355, 659122, 591153, 512255, 479214, 452517, 443586, 423058, 334808, 235526, 172440, 193701, 242926, 277507, 240190, 231104, 239653, 223802, 180709, 147804, 120080, 133054, 144390, 129453, 117429, 94086, 81440, 110622, 91179, 105155, 115155, 145111, 150849, 172916, 171087, 180686, 158922, 147329, 129545, 103805, 145068, 161552, 149009, 135079, 113087, 121969, 146628, 133352, 96917, 62488, 84820, 121058, 109434, 132457, 121620, 116037, 95493, 69986, 58150, 110828, 100064, 72934, 88157, 93413, 79792, 92258, 111524, 114362, 85407, 79030, 80525, 94838]
10112I4838k7510m6301k1272J7628M5355J9701j8929N609J7926J1777J5352k44
10100A13930M976j0337K5641q443L711K8274M16j7237M749l1513l2465k7991j4660
10087C9051L324J981K5418k2832k6415k0354P719M3216M9974J5543M822Q5J1905
10074A33437L033J7707L2397L1186L0938j4311J6805M3360R2426J06329J62065
10063F55372K88649M91894O52623O54802L46497j31602n29409o22993m46292l15109
10053A044432k21059j34346j43015j01008n2692n2622m9647o5741o0625N412Q43
10042A69932k8724l1669J2425j2177l5285J7296K3575M909o375L464J6401J3157
10030A46929m386r78M030j6025J9023L2215M585k4051j9500j2720l3574k1352
$$ y = [94838, 67328, 21027, -245, 17383, 62738, 82439, 63510, 69119, 87045, 98822, 114174, 113930, 118906, 108569, 134210, 125767, 129478, 157752, 158168, 140931, 145680, 114167, 81702, 53711, 39051, 42375, 44356, 69774, 46942, 20527, 173, 7892, 51108, 101082, 116625, 121447, 121532, 133437, 136470, 154177, 186574, 217760, 248698, 234387, 251192, 294552, 386978, 493307, 655372, 944021, 1435915, 2088538, 2743340, 3089837, 2958235, 2428826, 1805833, 1359541, 1044432, 823373, 689027, 546012, 445004, 392312, 339690, 290043, 224302, 163677, 169089, 169932, 141208, 109539, 121964, 109787, 74502, 91798, 115373, 120282, 113907, 117371, 133772, 146929, 142543, 141565, 145595, 129570, 148593, 180808, 185393, 161342, 141842, 129122, 95548, 74196]
10018G4196M951N1851L0299j0994p490O5889Q4514O6969J04537J58261K47246
10007H70229M38267O23735O24684K49622k12351l24619j49680J81353L76151K38096
9997B915487j77834n13676n74054m22959l31639j99893j43791j49881p1830k118
9987C27812l5155k5768M3854r878N340Q311m9523n0316q348k1931l4924k7664
9975A21810J1132P760l6179L8608M8440K7606J3774L494l6709N178M576M270j4872
9962A98888K04l0911p018k3659m1439m4012M169J5459k2760l4088r494R352q10
9949A3881k2503J4455M6344J3397m1975N946M5966m123j0121j3000k0476J1437
9937C9228J8105J9018j4211M0390K4222j7626r404J4537K3822L785Q856K4970
$$ y = [74196, 79147, 130998, 161297, 150303, 142813, 208702, 293216, 360185, 464722, 622983, 870229, 1308496, 1932231, 2556915, 2806537, 2594186, 2269567, 2119887, 2301240, 2677391, 2915487, 2737653, 2223977, 1649923, 1226964, 895325, 695432, 551641, 401760, 329930, 327812, 292657, 266889, 310743, 300865, 306205, 314516, 264993, 214677, 206329, 184398, 149474, 121810, 132942, 140702, 104523, 143131, 191571, 219177, 232951, 236445, 199736, 204914, 209490, 213760, 198888, 199092, 168181, 161163, 137504, 96065, 52053, 56222, 71681, 48921, 14833, 5339, 14691, 13881, -8622, 5833, 52177, 65574, 23599, 29545, 75511, 71388, 61267, 48267, 27791, 39228, 57333, 76351, 62140, 102530, 126752, 109126, 99722, 114259, 138081, 141866, 150722, 175692]
9925A75692j6492k825k6025k4412l948R180J1215K5615K0409j5514n119r815j4182
9912A23779m7397p607n210J5371N9220M1879N3233J22266J52036Q9945l9398q2467
9900D75650j10578r8784q9672k1712q194o953N1438M9448m1698l2540j9627m2377
9888A04401l7502L1625K3779K1459K0116K2589j5179J2450O16l077j2733j5934
9876A52610j9783k6246j3463J0125k0223m948L0201j698m291J7301K4722j1356
9864A32951m4164m1478l2744Q96j6327M0753N985k3394K0696J6599k8708j3110
9852A7955L1489j0955l1661J6932L9245j3486l1268O609L4763P1759N9870j6110
9840A75142n3944l9424k0479k0175l0886J6612J476j0478M8688L3068L0766J8445
$$ y = [175692, 159200, 156375, 130350, 105938, 101990, 111170, 122385, 148000, 168409, 152895, 147776, 137961, 123779, 76382, 68775, 63565, 78936, 138156, 180035, 233268, 355534, 507570, 597515, 558117, 475650, 365072, 266288, 176616, 154904, 146710, 139757, 191195, 240643, 198945, 166405, 146778, 104401, 66899, 98524, 122303, 143762, 163878, 186467, 171288, 183738, 184354, 181277, 168544, 152610, 132827, 106581, 93118, 103243, 83020, 78072, 108273, 106575, 102284, 119585, 144307, 132951, 88787, 47309, 14565, 15461, -866, 39887, 45872, 22478, 43174, 59773, 31065, 17955, 49444, 38489, 6828, 23760, 63005, 49519, 18251, 24860, 59623, 131382, 191252, 175142, 121198, 81774, 61295, 41120, 10234, 26846, 28322, 17844, 66532, 99600, 130366, 148811]
9828A48811k0223m5720k7305J2191J1989n318l452o182l7106J7782J1388j5544
9816D1311j0658L1832J2002J1353j7087Q26K4699j067J1525K768L835J7281O248
9803A34868K909n484k4309j2027J3426J6247L2333l429M1939K6686R74K4306j84
9790B48255K6675L7340L34j85k7226n718j6113k5286l8074L712O986j1289j2449
9777A86962k6921k7870k429K8302j2831j4323J4347J2217j6316k2118J2808K9087
9765A60915j0589l9978K4572M604l9069J4486k62j1713n52j0367K8269K533p754
9752A15095M2124K9812k6443J1782K1120p136Q565l9050J635N304K5273j4574
9740A73507k2932j5464L8238L8031L8698k8412j6021j2394q957J376k0751k7548
$$ y = [148811, 128588, 82868, 55563, 67754, 79743, 74425, 70973, 64791, 27685, 45467, 56855, 41311, 30653, 62485, 74487, 85840, 68753, 69579, 94278, 93211, 104736, 107504, 111339, 128620, 134868, 137777, 132293, 107984, 95957, 109383, 125630, 157963, 154534, 196473, 223159, 224133, 248439, 248255, 274930, 312270, 312604, 312419, 285193, 279475, 263362, 238076, 200002, 203714, 210700, 199411, 186962, 160041, 132171, 129742, 158044, 145213, 130890, 145237, 157454, 141138, 119020, 131828, 160915, 150326, 110348, 134920, 139524, 100455, 114941, 114679, 102966, 102414, 92047, 120316, 122849, 115095, 157219, 187031, 160588, 172370, 193490, 186354, 194919, 155869, 157504, 162808, 188081, 173507, 150575, 135111, 173349, 211380, 250078, 221666, 205645, 193251, 184294, 185670, 164919, 137371]
9728A37371K6886M807L5170J258j7338O386M47L865P828J0842Q964m1160L785
9715A89111L7484j416k5113K0901J4863m426j9633J2097m3115k7480K5594K9589
9703B08456J555p588k4443Q918K1238N0379M818Q588k6439m3816j339R035M880
9690B14242k085j4546q39J317L6746L3462J2846l4685n0113j1328J5688J3718
9678B14423R744J0128J3233k3431K4002r421J0233J8916l1097J7060K7793J7333
9666B98916j0914M4686J6096k5836j4283j2402J1989L3105l95Q374j8410J3412
9654C44338o665j8365p325K1848L0768Q392K5610J3772q91k0793J6798K3851k7190
9641D04148j9384K119k0520R65K4477J3707M0775J2192K846p676m833O5262L1191
$$ y = [137371, 164257, 169064, 204234, 205492, 188154, 194540, 194987, 198852, 206680, 217522, 226486, 185326, 189111, 226595, 225179, 200066, 220967, 235830, 231404, 211771, 223868, 180753, 153273, 178867, 208456, 210011, 202423, 177980, 186898, 208136, 258515, 263333, 271921, 245482, 201666, 200327, 209362, 214242, 212157, 197611, 196772, 198089, 234835, 268297, 281143, 246458, 196345, 185017, 200705, 214423, 224167, 234295, 247528, 224097, 248099, 238678, 248911, 267827, 236730, 253790, 281583, 298916, 288002, 332688, 348784, 322948, 308665, 296263, 308252, 341357, 340962, 349336, 330926, 344338, 337673, 319308, 311983, 333831, 364599, 372991, 398601, 412373, 411482, 390689, 407487, 431338, 404148, 384764, 386883, 366363, 367328, 391805, 405512, 446287, 458479, 461325, 453649, 448816, 514078, 545269]
9628E45269l2429j6358M4119P254m3731m727N4055K6936M1914J568m8772o01L5224
9615F09721K7641J8299r270j7931j3816M911K7311n072J5418J3719J1899L254
9603F86084J0661j8099P525J7360K2069O375K1527K4041j3333K3319R89O062L2823
9590H27403k1638l5949J4695K4366J2811L5318M2162K6811N858L6316M0565N478
9578A014196j2583M826L6987M1143J4829j9602M8977M0553L3868K7304K1149K7875
9566A279522N5575K3544N6950L8954L9650M128L7988N5422R1010N5060K4370M1699
9554A803872P1371L7093M2218L8129L5872P7231J02991P6897J07856Q8237P2289
9543B554056O0964N5721J22432J29626R4538O6433Q6578J42671J53817K00204
$$ y = [545269, 512840, 496482, 540601, 547855, 504124, 499397, 553452, 580388, 622302, 623870, 575098, 574497, 609721, 637362, 655661, 646391, 628460, 614644, 619555, 646866, 641794, 657212, 670931, 682830, 686084, 696745, 678646, 686171, 703531, 725600, 731975, 753502, 777543, 764210, 787529, 788518, 794580, 827403, 805765, 769816, 784511, 808877, 821688, 857006, 899168, 925979, 931837, 968153, 1008718, 1014196, 1001613, 1006439, 1043426, 1084569, 1099398, 1079796, 1128773, 1169326, 1203194, 1230498, 1251647, 1279522, 1335097, 1358641, 1415591, 1454545, 1494195, 1498323, 1536311, 1591733, 1682743, 1737803, 1762173, 1803872, 1875243, 1912336, 1954554, 1992683, 2028555, 2105786, 2208777, 2285674, 2393530, 2481767, 2554056, 2615020, 2670741, 2793173, 2922799, 3017337, 3083770, 3170348, 3313019, 3466836, 3667040]
9533C667040K02448J72699J47787J70254J44573J00299J59773K07315K35074K28360
9523E435622K20240K70518K92496L25820L63754L72819L89361M55270M67540M90287
9513I083727N21211N76569O38196P41066P70852Q10093Q49759R74545J077714
9504A6043732J222999J308111J418899J550828J673920J827496J948410K095773
9496B9090168K282258K463681K568329K640124K614183K558025K473734K253161
9488D8943663J902656J501757R61908L91628j74238o86566j251228j673058k021519
9479D7895003k253567k456529k534738k584653k465034k376747k291829k185981
9471B8745925k067551j919178j748525j610451j487938j357576j264877j176809
$$ y = [3667040, 3869488, 4042187, 4189974, 4360228, 4504801, 4605100, 4764873, 4972188, 5207262, 5435622, 5655862, 5926380, 6218876, 6544696, 6908450, 7281269, 7670630, 8125900, 8593440, 9083727, 9604938, 10181507, 10819703, 11560769, 12331621, 13141714, 13991473, 14966018, 16043732, 17266731, 18574842, 19993741, 21544569, 23218489, 25045985, 26994395, 29090168, 31372426, 33836107, 36404436, 39044560, 41658743, 44216768, 46690502, 48943663, 50846319, 52348076, 53309984, 53701612, 53527374, 52840808, 51589580, 49916522, 47895003, 45641436, 43184907, 40650169, 38065516, 35600482, 33223735, 30931906, 28745925, 26678374, 24759196, 23010671, 21400220, 19912282, 18554706, 17289829, 16113020]
9463A6113020j071994r95757r33591q11969p08773o82731o73824o04997n56407
9454I072977m92349m65798m54789l80098l40499l46010l66259l13745k78247k18981
9444E416202k41731j84570j83866k14762k06427j68700j48533j62734j86342j51124
9434C567413j44811j42078j17454q4862n6367r6533j07635j01210j27225j26144
9424B463094p2369l9912l4018q3374q1711p1379o5675n9002p8901n2918m0333
9413A783502l7864M372j7283m3052k3849l9124m3509k8333l6995o3669o9084n0676
9401A334436q704k7820n3955j5002j5239n4203j223l6631j0092k7881o5297l6562
9389I81827J3484k8233k9352J680K2850R291j5719n0712j1335J5870m2352l8834
$$ y = [16113020, 15041026, 14045269, 13111678, 12299709, 11590936, 10908205, 10234381, 9629384, 9072977, 8580628, 8114830, 7660041, 7279943, 6939444, 6593434, 6227175, 5913430, 5635183, 5416202, 5174471, 4989901, 4806035, 4591273, 4384846, 4216146, 4067613, 3904879, 3718537, 3567413, 3422602, 3280524, 3163070, 3078208, 3021841, 2925308, 2817673, 2716463, 2589238, 2463094, 2390725, 2350813, 2316795, 2233421, 2151710, 2080331, 2014656, 1955654, 1876753, 1823835, 1783502, 1745638, 1750010, 1732727, 1689675, 1665826, 1626702, 1583193, 1554860, 1517865, 1454196, 1385112, 1334436, 1325732, 1297912, 1243957, 1228955, 1213716, 1159513, 1158290, 1121659, 1111567, 1083686, 1018389, 981827, 995311, 967078, 937726, 939406, 962256, 971547, 955828, 905116, 893781, 909651, 867299, 828465]
9377H28465m5715p3731k9810K322P152o018j2030k2046J7448L5140j0024P947
9365F99100m5300q838o758J8812k5503l0321j0113j2550j2479k789k1059k6126
9353E16076m4102j0491J1570k5093j8286k584l2149L347L6710p605l5211j3001
9341C79181k0734L719L8710j9520j0594K885m085K1231j2656m1661j0804K2962
9329C48634J8482N419k3462L6629k7580k0611J0343K9575l5012r540J9589n0249
9317C02217n3644j9799L3501J9711L1919k7913j9733j6516L2224j8036k302J773
9305B63402M9243L7812o1655m0776j5153j1373j3487l1273K0089k188j9814l344
9293A71483R538J363K7942J5676Q356o289k1866j1815K1529J6332k4483m0658
$$ y = [828465, 782750, 709019, 679209, 681531, 688683, 682665, 670635, 648589, 666037, 701177, 691153, 699100, 653800, 644962, 638204, 657016, 631513, 601192, 591079, 578529, 566050, 563261, 542202, 516076, 471974, 461483, 473053, 447960, 429674, 427090, 394941, 398288, 434998, 427393, 392182, 379181, 358447, 362166, 400876, 381356, 370762, 373647, 369562, 390793, 378137, 336476, 325672, 348634, 367116, 372535, 349073, 385702, 358122, 337511, 347854, 377429, 342417, 332877, 352466, 302217, 248573, 228774, 262275, 281986, 313905, 285992, 266259, 249743, 281967, 263931, 261629, 263402, 312645, 350457, 288802, 248026, 232873, 221500, 208013, 176740, 196829, 194641, 174827, 171483, 181021, 182384, 210326, 226002, 234358, 228069, 206203, 194388, 215917, 232249, 207766, 167108]
9281A67108K0693M6048P14j0131q257l3979J4841q544j9468l3609k5685j0462
9269I9269K7268J4910j2606K2557j3161j974j9769N3959J6274n4405o3137J8361
9257H7546J9772m578J4191K1662l622j9790l9367L042m462J4253N3998K8512k5520
9244A45637J0212K3122J0110k3556O085N3637R63n1425l4587k072n175J50q802
9231A24299J9471l2474j5191O62k7099L2519N6929m6063l2497M3106K029l6453
9219H9238J0649O659k2138j5652J7701l4292Q053K4653L1453K9561j1198l0319
9207A04368l1258n015K3591O767k0606m6127j0958L0887M0283J9332o248L4571
9195A39587m1184L019K9506J9863M9971O1640M3628p396n1469o8444k6109J3738
$$ y = [167108, 187801, 233849, 234563, 224432, 216175, 182196, 197037, 188493, 169025, 135416, 109731, 99269, 126537, 141447, 128841, 151398, 138237, 136263, 116494, 170453, 186727, 132322, 69185, 87546, 107318, 102740, 116931, 138593, 134971, 115181, 75814, 78856, 74394, 88647, 142645, 171157, 145637, 155849, 178971, 189081, 165525, 171610, 225247, 226210, 174785, 140198, 138126, 132951, 133101, 124299, 143770, 111296, 96105, 96767, 69668, 102187, 159116, 113053, 80556, 123662, 125691, 89238, 99887, 106546, 84408, 68756, 86457, 52165, 60218, 84871, 116324, 145885, 134687, 104368, 73110, 68095, 91686, 98453, 77847, 31720, 20762, 51649, 91932, 111264, 105016, 139587, 98403, 101422, 130928, 150791, 200762, 262402, 306030, 298634, 247165, 178721, 152612, 166350]
9183A66350k4616l4610j1782o984r081J2898K1388q240k7854k020r63j3797K5552
9170H6241L8471J5755l3666j0928R668K1407L0051j483o46o436J9895L9007L9561
9157B46897J05525J53389J29293Q5403L935n1000j02031q9242j02011j04485m3412
9146B32261j518n0689j9523j4198l5791l0189o714L7833n561l3281J3988j4609
9134G2009L802L5144K067m4995J2238L4367o989k1972r416K2543K2501J5339L2142
9121A68780K3092m791k7867J6042P402k0371p318q490l0582J1395j929k272l7916
9108H5175j3168K3736O831k2888m952k398K2997j5596l4314j0560L9636J7231
9096I1730M213J7205k1114l6195p936O205q94J7927P316r332P872P403J1517K6515
$$ y = [166350, 141734, 107124, 95342, 88358, 79277, 92175, 113563, 105323, 77469, 75449, 74486, 60689, 86241, 124712, 140467, 106801, 95873, 105541, 126948, 156999, 155516, 154870, 148434, 168329, 207336, 246897, 352422, 505811, 635104, 720507, 724442, 673442, 571411, 482169, 380158, 275673, 232261, 230743, 180054, 160531, 146333, 110542, 80353, 73639, 111472, 105911, 72630, 86618, 72009, 75811, 110955, 113022, 68027, 80265, 114632, 107643, 85671, 76255, 98798, 121299, 136638, 168780, 191872, 187081, 159214, 175256, 182658, 162287, 154969, 146479, 115897, 127292, 125363, 123091, 85175, 72007, 95743, 102574, 79686, 74734, 72336, 95333, 79737, 45423, 34863, 74499, 91730, 95943, 113148, 92034, 55839, 47903, 54108, 53214, 71141, 78457, 69125, 76997, 84400, 95917, 122432]
9082A22432k9349O796O7542j2925n4837j9035J6579J4804k3970o0407M863J7195
9070D9688j4023m4019j1835L6239K5546J5812L347j6382k4621j2031n489J851
9058D083K3040N926k2485K1248M8388K9240l0919l3530j8528k2548R159J2717
9046B5791L926o9124k0691J986L6122L1624M5390R37l5805O465O778O741O774
9033D6914j9402J3355o702l5461P443L856M944K1463o096k1630J0304j847M5294
9020F2435m059j8538j069j3216p030k3619J6202J2408o214K1454J4414L955j8062
9007C9061m945K2967J5615m3699p655o984K6068L561l9597P917K6685L248k3638
8994A8604l0894L7296J8241L881n781k3226k3025j5733k8220l3417J4155L1135
$$ y = [122432, 93083, 99879, 167421, 154496, 99659, 80624, 97203, 112007, 88037, 27630, 32493, 49688, 35665, -8354, -20189, 16050, 41596, 57408, 60755, 44373, 19752, 7721, 2232, 4083, 27123, 33049, 10564, 31812, 80200, 109440, 78521, 44991, 26463, 3915, 13074, 25791, 29717, -39407, -60098, -58112, -21990, 9634, 55024, 55961, 20156, 26621, 33399, 40140, 46914, 27512, 40867, 34165, -1296, 6147, 10003, 14947, 36410, 30314, 8684, 18988, 17141, 62435, 58376, 39838, 38769, 25553, 18523, -5096, 11106, 23514, 17300, 38754, 53168, 57123, 39061, 34116, 57083, 72698, 28999, 21344, 14360, 40428, 43989, 4392, 12309, 38994, 42242, 18604, -12290, 25006, 43247, 47128, 41347, 18121, -4904, -20637, -48857, -82274, -68119, -36984]
8982c6984J6733J4289k690l3993K2434R916L617k8097k168r243R214j086m767
8969d2825N2094N213n865J2152q401j1474k7726l0502K6117R37J5270M1238L2494
8956E8722o7666m6378K908J8742k4179L4141J7820q612L6912J9591O25k0447k2314
8943a35m0424k3663k4891K3633L5587j593L4601L2759N113k7812J658l91K244
8930A6686k3759m265j8538M1185M8676K2346j9377k1540J2403l3610j9722K7889
8918B8374J0262J0208q350O153m636k0695j7139j4590n328j6125L515J7002k7584
8905c8933k9729J1011J4004Q762K552N27J4187j7727j8597K6445O100n877p460
8892c4735k7028J3214N607J3172M1365Q272L7559J8597p752L997J217m3434l4879
$$ y = [-36984, -20251, -5962, -8652, -42645, -20211, -10295, -6678, -34775, -36943, -46186, -36972, -38058, -42825, 9269, 14482, 8617, 20769, 12368, 894, -26832, -57334, -31217, -30280, -15010, 26228, 58722, -8944, -55322, -52414, -33672, -57851, -23710, -5890, -14502, 22410, 42001, 42626, 22179, -135, -40559, -64222, -89113, -65480, -29893, -31486, 3115, 35874, 40987, 13175, 14833, 14442, 16686, -7073, -11338, -29876, 11309, 59985, 82331, 62954, 41414, 53817, 20207, 485, 28374, 38636, 48844, 40494, 46647, 42011, 21316, 4177, -10413, -15741, -31866, -28351, -11349, -38933, -68662, -57651, -43647, -34885, -32333, -31806, -17619, -35346, -53943, -27498, -21398, -27275, -34735, -61763, -48549, -42942, -29770, 11595, 19867, 57426, 76023, 68271, 72268, 73485, 30051, -4828]
8879d828j8282l5342j8020K8436J7997K4973l0586l0405K1580j9184P492J2690
8867d3479K183j2766J5915L4846L4419M291m8020q560M6877Q45k6828j0964j4381
8854b5622j3478K3629q723R148Q931O679m953k3604K3168M4371n427J956J4031
8841E0106o616l9459k0260K1908j7400l0125J1689J7318l51j0605k0919J5277
8829b9437k325j9100K0278K6218J6894M697j900L7939K1953j3974l9532m1766
8817b0055p527N0251J7899n8351k3406J8310J0889k3182J1836n420M87k0108r465
8804e7842j2999J7710m125K1713M0260L0054k281j6569m2083l061M144L3203L474
8791A1598J1050q72k0065J3393k9058j0252J3486q071K8842K2265k5473o683q507
$$ y = [-4828, -23110, -58452, -76472, -48036, -30039, -5066, -35652, -66057, -44477, -63661, -56169, -43479, -41296, -54062, -38147, -3301, 31118, 35409, -12611, -21171, 25706, 26551, -277, -11241, -25622, -39100, -15471, -24194, -15046, -6115, 564, -4389, -27993, -4825, 39546, 34119, 36075, 50106, 43490, 4031, -16229, 5679, -11721, -41846, -30157, -12839, -13190, -23795, -44714, -29437, -31762, -50862, -30584, -4366, 12528, 17225, 15325, 53264, 75217, 61243, 21711, -20055, -27582, 22669, 40568, -17783, -41189, -22879, -11990, -35172, -23336, -28756, -28269, -48377, -57842, -70841, -53131, -57256, -35543, 4717, 34771, 32490, 15921, -26162, -29223, -25079, 8124, 11598, 22648, 21776, 1711, 15104, -13954, -24206, -10720, -18791, 10051, 32316, 6843, 160, -8347]
8778h347o332j4128J0578O90K0516K7817r730j8947r237J8448l6011n5936j640
8765h2259L4172K6751J9356M283k4117Q563O131n092j2517K7827J3818M0100k3611
8752C3405m0689J4879L8600j9589o588j9831J0049l3291j0730J0213J6627L9467
8740C2522Q205k7693j8524N820K8477P064o766L632j7122j3436O2728N9881m44
8727A24344o3645q0369m8178K2162L0901j186q620K5436N022l439l6012j6995
8715e0579J1068N379k9031j1223K5780M9163L9134K7005J0451J8747l2664p3640
8703a0410o055R366J2123O012K7636M030q547j5780J5609L2368m3758j7122k1757
8690a6285k47j4469j0101O555k8967J4261k6846j5316Q15L1099J3242J5965M9904
$$ y = [-8347, -14679, -28807, -18229, -17539, 2977, 30794, 21064, 2117, -7120, 11328, -24683, -80619, -82259, -48087, -21336, -1980, 2303, -21814, -13251, -7120, -12212, -24729, 3098, 16916, 57016, 33405, -7284, 7595, 46195, 26606, 20018, 187, 10236, -23055, -33785, -23572, -6945, 32522, 40727, 13034, -5490, 330, 28807, 35871, 29105, 32737, 15615, 2179, 64907, 124788, 124344, 60699, -19670, -67848, -45686, -14785, -15971, -24591, 845, 5867, 2428, -33584, -50579, -39511, -34132, -63163, -74386, -48606, 557, 39691, 66696, 77147, 95894, 63230, -10410, -16465, -7099, 5024, 11036, 38672, 42702, 34155, 18375, 33984, 66352, 22594, 5472, -16285, -16532, -31001, -41102, -34547, -63514, -49253, -76099, -91415, -90600, -59501, -46259, -30294, 19610]
8677A9610q646j8284l063Q923K0771k1972j3539n72K9131R732p050k2230O919
8664b70R663l2665J14K5553l8780k065K1769n634J0888l2763K4334L9426K3640
8651D3210j5798k7775J0836K3046M2045K0633n72k0584m3194j3702J4145j3430
8639A8860j2196j5546Q983M1709O206j5626J7161l123K7085l689j4549j4388J2319
8626E3206k7045p679j898j7180j9284j4206L4286k6443k2141J0777j0158O888
8614d0877K502J1011L8140K0190K1707j8896k2940r712k4178K1706p708J00N710
8601c245l6670J7579K5832L0336J1711R465n1514j812K2211J4934J586N7459L5356
8588A33228j4559N936j255Q609J0414q604k1325j8571l2196p0367J1489N9852
$$ y = [19610, 10964, -7320, -10383, -1460, 19311, -2661, -16200, -16772, 12359, 22091, 15041, -7189, -270, 9393, -23272, -23158, 2395, -36385, -38450, -16681, -22315, -11427, -44190, -19856, 19570, 43210, 27412, -363, 10473, 33519, 75564, 96197, 95625, 75041, 31847, 18145, 32290, 18860, 6664, -8882, 101, 41810, 48016, 32390, 49551, 46428, 73513, 69824, 55275, 40887, 53206, 26161, 18482, 16584, -596, -19880, -34086, 200, -26243, -48384, -37607, -47765, -40877, -38375, -27364, 10776, 30966, 52673, 33777, 10837, 1125, -23053, -1347, -9055, -8955, -3245, -39915, -22336, 3496, 33832, 45543, 55008, 3494, 1682, 23893, 38827, 40413, 97872, 133228, 118669, 124605, 123350, 131959, 142373, 133769, 112444, 93873, 61677, -8690, 2799, 62651]
8576F2651K7025L2325j4551m6183j279L875r150J201N805j3611P518n381l6143
8563A4102k029j2581K7031J4047J1058R601R24k8955J536l971k6563k5250R152
8550a1898J8813L9149M039j4188j0701J5660J9834L4696j8057n6518j4849j998
8538C982O403J668j4721n94j0432P730m1764k9570J4427L2452O836l3976j1885
8525f9444K8668J4427K1437J3862j3205J0056K5565K2909M876o881j0810j03M115
8512D5472J5388J57j6610l4198m6660L5189M5339K1K576K9902l0919j8728Q839
8499C5768J6396j6782J0487m1021k1920J3484K2216l298J3271N561N513r880m0668
8486a0873k6390j4542j36n439J2097L3062K6896j451j4338j846M790r089K9632
$$ y = [62651, 89676, 122001, 107450, 61267, 59988, 63863, 54713, 55914, 61719, 48108, 55626, 50245, 14102, 12073, -508, 26523, 40570, 51628, 61229, 62153, 33198, 34734, 30763, 4200, -21050, -11898, 6915, 46064, 50103, 35915, 25214, 40874, 60708, 95404, 77347, 20829, 5980, 3982, 10385, 12053, -2668, -3262, -13694, -5964, -47728, -77298, -62871, -30419, -23583, -57559, -69444, -40776, -26349, -4912, 8950, -4255, 5801, 31366, 54275, 59151, 52270, 41460, 41357, 45472, 60860, 61017, 44407, 10209, -36451, -1262, 44077, 44098, 46674, 76576, 45657, 26929, 35768, 52164, 35382, 45869, 4848, -17072, -3588, 18628, 15330, 28601, 34162, 39675, 29795, -10873, -37263, -51805, -51941, -57380, -45283, -12221, 14675, 13224, -1114, -2960, 1830, -7259, 22373]
8473B2373J5748K869j9121m1493j0103r835l0362J9847L8577K4111k9196m20R759
8460g246l614j1625j4190K3940p281k0145l0429K7377M534m058k7729j2641k119
8447h5226J1793K5788j7692K3101M2764N540K411O436J7800P351j4312L259m4575
8434a5562J3691J1361M3456J455m1440o102l1624L916K6058J4718m6392Q679M8318
8421C0532o78j4753k2127J8732P612l8330j7409M2825K5971M76l2994L22m831
8408d652l0185k1981J3562M9305j8615m1396K7057L0665k2897k4884J3185p058
8396c7894o391J0081j60P2229N5349k2660l481k1043j6826l8339l5391l3040m861
8383h2427P0988J07112M2320j6728l0336l8510l5454k4302l7919J4954L2138j4614
$$ y = [22373, 38121, 40990, 21869, -19624, -29727, -39562, -69924, -50077, -11500, 12611, -16585, -17005, -7246, -10860, -22485, -36675, -12735, -20016, -40161, -70590, -43213, -38679, -42737, -70466, -83107, -85226, -73433, -47645, -65337, -42236, 528, 6068, 8479, 14915, 32715, 40066, 25754, 29013, -15562, -1871, 9490, 52946, 54401, 12961, 6859, -24765, -20849, 5209, 19927, -26465, -17786, 30532, 29854, 15101, -7026, 11706, 19318, -19012, -36421, 6404, 32375, 32851, -143, 179, -4652, -34837, -56818, -43256, 6049, -12566, -53962, -26905, 3760, -19137, -44021, -30836, -37894, -44285, -34204, -34364, 37865, 93214, 70554, 67073, 46030, 29204, -9135, -44526, -77566, -82427, -11439, 95673, 137993, 121265, 90929, 52419, 16965, -7337, -45256, -30302, 1836, -12778]
8371a2778m687j0429k0681K4771L6355K7830l1867l0692k0031O390j2592J7228
8359c1183l2670r177P1779L6917j3345n917L2147m5481m4686J3630L4241Q4589
8347I0844K9825n775m5327k4248k3976M631j6710k6222n832O525k35L9199j3259
8334I440r973L462k3379q618M7705J6830K635j9605j9979r286J1965J495p248
8321d556k2081J5011N85J4884J3990K4397K093k4747j8634m4108m352J3118J9806
8308a4594L3075N731N692K7478p921k2276k4507J6337L0776N5415k1699k8962
8296E4545m5507r704j6437K1682M9544J3025k9192l6813m7855j8659Q878j655
8284e8148L241K1013O613M8208N5063l841l8674m1885J847l021j1278P226k8353
$$ y = [-12778, -17465, -27894, -48575, -23804, 12551, 40381, 8514, -22178, -42209, -35819, -48411, -31183, -63853, -73030, -1251, 35666, 22321, 16404, 48551, 3070, -41616, -27986, 6255, 90844, 120669, 114894, 69567, 45319, 21343, 25974, 9264, -16958, -22790, -16265, -16500, 22699, 9440, -533, 2929, -20450, -29068, 18637, 35467, 38102, 18497, -1482, -10768, 1197, 2692, -4556, -26637, -11626, -11041, 3843, 17833, 42230, 44323, 19576, 942, -43166, -47518, -34400, -14594, 18481, 24212, 29904, 57382, 49461, 27185, 2678, 19015, 49791, 105206, 83507, 54545, 9038, -666, -17103, 4579, 54123, 67148, 37956, 1143, -46712, -65371, -56493, -58148, -54907, -33894, -27281, 20927, 75990, 72149, 33475, -8410, -6563, -9584, -20862, -13636, -41989]
8271d1989k1442j6891j2244J4779M1819L3555R442l085l3579m027Q3n2619j2099
8258i8297K2829J4482L5592J7386m4548n2208J4734L1202N4945K6800o260J3491
8246C0148J2051m9791o0439L728M4159m172M28m031j1440M104q489j289j4836
8233e9869K122o867O0939K5671o127m9746r521p049m546K8885k5281J7473M6060
8220A2144J3777M0097J1016n1719l5067N420J0500r332j4080j2628J5806L7274
8208B3208J5625m6111k7512Q616O3121M0766p980k5885l1789p007j6988p251J0470
8195h717L4866l940J8381o355o0809m2972M3124L2040J7364m3669j7995K0299
8183a8383L3883J6151Q491j2469j5654k1403M860K0376j6738k7376l141N2022
$$ y = [-41989, -63431, -80322, -92566, -77787, -35968, -2413, 7029, 3944, -29635, -33662, -33579, -86198, -98297, -75468, -60986, -25394, -8008, -52556, -104764, -90030, -58828, -3883, 22917, 16657, 30148, 42199, -7592, -68031, -64303, -20144, -24316, -23888, -27919, -39359, -35255, -43744, -45033, -59869, -57747, -64614, -3675, 21996, 15869, -33877, -43398, -50447, -54993, -26108, -51389, -33916, 12144, 25921, 66018, 77034, 25315, -9752, -4332, 6168, -3164, -17244, -29872, -14066, 23208, 38833, -7278, -34790, -26174, 36947, 77713, 69733, 43848, 12059, 5052, -11936, -19187, -8717, 26149, 22209, 40590, 34235, -26574, -69546, -26422, 5618, 22982, -20687, -38682, -18383, 15500, 31651, 40142, 27673, 12019, -9384, -4524, 15852, -886, -28262, -31403, 20619]
8171B0619J3950m116j6224j0656j3794j1012j7351j1875j4952n763m866M5626
8159c0414O2669k1548j3937j3557J9473k2104j0600k0300J6399j8345O448k4757
8147g0573L8904K2180N500r606j611M7810k2618m0462q059j963k1441pR200l2898
8133h5644m582O723L1787K3209j6426J9789L3280J8515k6125k7264n0247L3204
8121d3781O0111L6835J076l7438p775q176p997k9540J3648K6736k1818k2393K9548
8108a0964J799j2540L114j4586N319l2229k1768q978j8168K1503K7468M0995L3560
8095A4525L4586K5021k7666m7369j7068j9109j8087L874L5823M2664J5391m2862
8083b77m1698M2136P07M2692K0565k2224k973j7404L520k8663k0295J4155m796
$$ y = [20619, 34569, 30453, 14229, 3573, -10221, -21233, -38584, -50459, -65411, -71174, -76040, -30414, 32255, 10707, -3230, -16787, 2686, -19418, -30018, -50318, -33919, -52264, -45816, -70573, -31669, -9489, -3989, -13595, -15206, 32604, 9986, -30476, -38535, -40498, -61939, -61946, -52746, -85644, -90226, -83503, -51716, -28507, -44933, -25144, 8136, 26651, 526, -26738, -76985, -43781, 16330, 53165, 54241, 16803, 9028, 852, -7145, -36685, -23037, 3699, -18119, -40512, -10964, -9165, -21705, -18591, -33177, -27858, -60087, -81855, -90833, -109001, -87498, -60030, -19035, 14525, 49111, 74132, 46466, -903, -17971, -37080, -55167, -51293, -15470, 27194, 42585, -277, -41975, 161, 868, 43560, 64125, 41901, 38928, 21524, 25044, -3619, -23914, -9759, -14555]
8070a4555K1112l5008k4185M098L3256k3394j594Q238j3615M205m326k4523R553
8057f0738L4226K6350J5020K549o557k5475K7094R846p164q697K3364J4112k3978
8044A9952j8576L7095J1715k8512J4474r159o901Q683L4717k8954l1326j8266
8032a5058K3342O054M4930K3009n8690q2435O852L2127P179N530n734L5340l5338
8019a2892n0679o707L8056M5127j6448j4860J5031J2006k2774n952k4359Q066
8007c6385M2768M860J0424N0522K2165k8700j6872K724r450o4968m8346J6390
7995e4868O6295M6251K1777K6k990n5385k1900K3012J5640j2325n5531K4419K9050
7982B3471m562o837j1869K8552p431k45p400K8508K898j1990j4635L330N094k062
$$ y = [-14555, 6557, -28451, -52636, -48538, -15282, -38676, -40270, -32032, -45647, -41442, -45768, -70291, -60738, -26512, -162, 14858, 17407, 10850, -14625, 12469, 22315, 15151, 6454, 29818, 43930, 19952, 1376, 38471, 50186, 21674, 36148, 26989, 20088, 28771, 63488, 34534, 3208, -15058, 8284, 14338, 59268, 82277, 23587, -58848, -51996, -19869, -12690, -7160, -12894, 22446, -12892, -63571, -70278, -32222, 12905, -3543, -18403, -3372, 8634, -14140, -20092, -44451, -36385, 6383, 11243, 21667, 72189, 94354, 65654, 48782, 51506, 42056, -22912, -71258, -54868, 11427, 57678, 79455, 79481, 76491, 21106, -794, 22218, 37858, 25533, -29998, -5579, 23471, 18909, 12072, 203, 28755, 21324, 21079, 13679, 42187, 45085, 33095, 18460, 21790, 26884, 24822]
7968B4822k1038M340K0926k6223q541j0474K2221M7964J6082k1324k235L7831
7956H4351R38m3970O459M3708j2437k4280j2157k7119J1065j4716k0514r240n593
7943b3505K1439K4087M223O89j8122J6353m491j9201l6443L1693J3972J4086L0952
7930E5732N928L8637r863j9180j8607j0051K4753L1474k2632k8770K017J2775
7918F2213J1852m7004l3910L2439J8108j8250k1020K2523k184k4425m057n369
7906i084L0417K8953j8260J9488J6368k2547Q027J5612L259J027J6736j1357k6647
7893E1992k926J2507l0032l4302j5497N3756P057k0790n776k2968J5596L5520
7881D4137Q253L838j1194k2316o0874j6327Q524L9082K6946J2436k7017j1544
$$ y = [24822, 3784, 8124, 29050, 2827, -5714, -16188, 6033, 53997, 70079, 48755, 46520, 84351, 85289, 41319, 47778, 91486, 79049, 54769, 42612, 15493, 26558, 11842, -8672, -17912, -23505, -2066, 22021, 26244, 26933, 8811, 25164, 20673, 1472, -34971, -3278, 10694, 24780, 55732, 61660, 100297, 90434, 71254, 52647, 42596, 67349, 98823, 76191, 47421, 49438, 62213, 74065, 27061, -6849, 25590, 43698, 25448, 4428, 26951, 24767, 342, -3715, -9084, 21333, 50286, 32026, 51514, 67882, 45335, 53362, 68974, 72233, 73260, 89996, 78639, 51992, 49066, 61573, 31541, -2761, -18258, 35498, 42555, 21765, 15989, -6979, 8617, 44137, 52390, 56228, 45034, 22718, -38156, -54483, -45959, -6877, 20069, 32505, 5488, -6056]
7869f056p438J95M63J9854k666k5750j3579L5524r344q028K1111p452q014K3616
7855A2436l6155l2805r46L1045M9845J1369l6762m4679j4957O567P215p819Q477
7842d7169M256L9104J4833r207N173r51j7749J1903M0784k1434j9153j3063k5110
7829c7783J3664l761l4298P384l3434K9437J7766J7195O9654N205q689j7120k4567
7816F53j6285k5357m1J7305O621m3010N628K5291M0542L5261k1677l8793l9694
7803e3556n374K9204N0282N582r804n2802o904L2107J350m443q129k470N947J6580
7789b430L679j3936p264K3205L506m51N292j1623L1975q634k8117j5128L0629
7776A0703K6467Q286p746j4073m4529n831L2848n532J2080K4305Q312J465j1569
$$ y = [-6056, -13494, -13299, -12836, 7018, 4352, -21398, -34977, 547, -8797, -16825, 4286, -3166, -11180, 12436, -23719, -56524, -57470, -26425, 23420, 34789, -1973, -46652, -61609, -55042, -47827, -55646, -47169, -42913, -3809, 11024, 1817, 6990, 6039, -11710, 193, 40977, 19543, 390, -12673, -37783, -24119, -27880, -62178, -54794, -88228, -58791, -41025, -23830, 45824, 51029, 42340, 25220, 653, -15632, -40989, -41030, -23725, -17104, -60114, -54486, -29195, 11347, 46608, 24931, -13862, -53556, -58930, -29726, 20556, 26138, 16334, -36468, -43372, -11265, -9915, -14358, -22487, -24957, -19010, -2430, 1249, -12687, -19951, 3254, 6760, 6309, 11601, -22, 31953, 23319, -4798, -19926, 10703, 37170, 45456, 37710, 23637, -20892, -26723, 6125, 593, 12673, 36978, 45290, 46755, 35186]
7763C5186j9327k2031N352l660K7772O250J5450J5979r751q1108o3878Q307N1669
7750c3790L8830l7735n0999L1117O128K1229M3863o131k1781m6192K817K7499
7738b5145L642J9805M250k099J2859J2238l3524l7548k7215L2793N0736M2968
7726E3760j628l3099j684k0804j5864j8370K1556M545n054q373P760J2603j049
7713e701l6163l4588k0288L2925P2803L1254K9153o926m275j4317m4591j9169
7701a9883j6215j8761K1134j0473j6250J4748n057N308N213J3158l75J3716K132
7688a1605N855j7083j6732L1420J6197N626O29n3888j8286N071K7657K198k5592
7675d8533J205J6818L759p191p08K9494k1394k1153m424J0710L760n768J0237
$$ y = [35186, 15859, -6172, -820, -4480, 23292, 29542, 44992, 60971, 51220, -29888, -93766, -85459, -33790, 5040, -32695, -83694, -52577, -46449, -25220, 18643, 12512, -9269, -55461, -52644, -25145, -21503, -1698, 2552, 453, 13312, 25550, -7974, -45522, -72737, -39944, 10792, 53760, 52132, 19033, 17349, -3455, -19319, -37689, -16133, -11588, -16642, -25015, -17255, -4652, -5701, -41864, -76452, -96740, -63815, 8988, 40242, 69395, 62469, 58194, 43877, -714, -19883, -36098, -54859, -33725, -44198, -60448, -45700, -50757, -45449, -40236, -27078, -27453, -13737, -11605, -5750, -22833, -39565, -8145, 8052, 13678, 14307, -39581, -57867, -52796, -25139, -22941, -48533, -47328, -30510, -26751, -33942, -34650, -5156, -26550, -47703, -52127, -41417, -37657, -43425, -33188]
7662c3188k453Q504K1124j8639k4958k9576N964R688K2226K3888j3928J2840J567
7649a6941j8416k1085K4800K8305j2754K8637M9075n432k7190r166k5044l6198
7637d1409k4396K1893K2090j7163k4082M8959L493j5751O407j239m0691M374J9708
7624c7807P258j8321K5347j5261O794L5643k7345j6715j252R487M5208K236k9775
7611a4503n7116m1607K0678N1835K8547K9843q910m7383q615j2662L561L4446
7599b1886J4262k5032M64l5544Q120J0370j1562K4476K2908J2174j947l251o619
7586a3067k9469M0945L4539Q381k6032j0688j223k7465k7879k4989J7681N5038
7574d228j0634K6026j5010o695k1058K4402Q021k906Q187l8609k2729j628K535
$$ y = [-33188, -35641, -27137, -6013, -24652, -49610, -79186, -73222, -63534, -41308, -17420, -31348, -18508, -16941, -35357, -56442, -31642, -3337, -16091, 12546, 61621, 56189, 28999, 19833, -5211, -41409, -65805, -43912, -21822, -38985, -63067, -14108, -10615, -26366, -19959, -21198, -61889, -57515, -37807, -30549, -48870, -23523, -38784, -31990, 3653, -23692, -40407, -41659, -32172, 13036, 15272, -14503, -71619, -113226, -92548, -40713, -12166, 17677, 8767, -38616, -47231, -59893, -56332, -21886, -7624, -32656, -32192, -67736, -59616, -49246, -60808, -36332, -13424, -1250, -3197, -6448, -13067, -42536, -1591, 32948, 41329, 15297, 4609, 3386, -24079, -51958, -76947, -59266, -4228, -14862, 11164, -3846, -10541, -31599, -7197, 824, -2082, 6105, -32504, -55233, -56861, -54326]
7561e4326L2872k4150m8357k583J18K7452n684M8881J6185j8956j8553j4960M6864
7548a5197J9740l6777q29N44l928J0559l712n130n8409l2135J2818R784Q930O466
7534h7276k3082P473J8515L7506J3879m5201K404J2506q741O0391M6708l2676
7522B406m5432j0010J8328k6136J5701M9292j4299k3475k2612J0055M0685k365
7510g862L194k1171k8608L7513J3171k3732l6370K6504L3052Q312n004j0898m600
7497a6499m2124R738Q469O975N934k212Q204j4374q760J3323p55K962K0266K4314
7483A5461q971J7114p897o7105N572j0145n1723M890M0433J7341l8574R469K6687
7470d7448L6761J6247K5378r236j4762M953Q497n0657j6483j7057J9430J0249
$$ y = [-54326, -21454, -45604, -93961, -96544, -96426, -68974, -74658, -25777, -9592, -28548, -47101, -62061, -15197, 4543, -32234, -33063, -32519, -36447, -25888, -29600, -34730, -93139, -125274, -112456, -102672, -93742, -87276, -110358, -102885, -84370, -46864, -32985, -78186, -75782, -63276, -72017, -11626, 35082, 2406, -43026, -53036, -34708, -60844, -45143, 4149, -10150, -33625, -56237, -46182, -5497, -7862, -4668, -25839, -54447, -16934, -3763, -27495, -63865, -37361, -4309, 4003, -1001, -11899, -16499, -58623, -48885, -40416, -33441, -27507, -29719, -21515, -35889, -44649, -31326, -32081, -29119, -8853, 15461, 6490, 23604, 15707, -51398, -45826, -55971, -107694, -102804, -62371, -45030, -83604, -74135, -47448, -10687, 5560, 30938, 21702, 6940, 11893, 20390, -30267, -46750, -63807, -44377, -34128]
7458c4128K4871J3637l6193J4191J8686K884j8980l8689l386l972O8777n400k1571
7445a9273L1270L2611j17l1168k2417P540j4935j8843J4086L0472j2553K6153
7433B2826P722k6381j1270K527J6192j2088J3915j2025k2659l379L6526n752j8332
7420a2178j3777r363K670j2809j8766O6726O510j805J2489K78j4454j1131k1703
7407b7313j0305R218K8137J2612j2154j944j2295p205j0499R749M2212J0752k0288
7394A0677R601L3440n315k3141o085k1261l4506j3038L5832k4146m9397j5941
7382a03280L0678M6163N7313K6816p000l0174k0638k6691j741j955j2525j4722
7370e7756m700J2104M8576M769L876L8429l8049m0708K8403k0388p848l668J5308
$$ y = [-34128, -9257, 4380, -31813, -17622, 1064, 3948, -15032, -53721, -57107, -61079, 7698, 2298, -19273, 11997, 44608, 44491, 13323, -9094, -1554, -16489, -35332, -21246, 9226, -3327, 22826, 30548, 4167, -7103, -4576, 11616, -472, 13443, 1418, -21241, -24620, 11906, 6154, -12178, -25955, -35318, -32648, -45457, -64223, 2503, 9013, 7208, 19697, 19975, 5521, -5610, -27313, -37618, -28400, -263, 12349, 195, -1749, -14044, -21249, -31748, -21999, 20213, 30965, 10677, 20278, 53718, 48403, 25262, 19177, -2084, -36590, -49628, -13796, -37942, -87339, -103280, -72602, -26439, 30874, 57690, 50690, 20516, -122, -26813, -28554, -30509, -43034, -57756, -62456, -50352, -1776, 2993, 6869, 45298, 7249, -33459, -5056, -25444, -33292, -36960, -21652]
7357b1652M730k9169L1938M40o681K80n516j99K3509J1936J1245j4055N709L471
7343A5986J7670L680j714n869j5786o061l0198L37L364j0J3063O4L7202j6310
7329A5418j7312L277l7311Q960P253J133K7855j9797m1724L885P833L6739p537
7316a1328j394J9097M0801L644k7763m1806J9854p203l1610k7962j0301L4944
7304d1027J2879L7226L6917K2578l0621o6j9472M999j1982k12l6211l1664J5095
7291d1561M162j3071k2881K9095J6660M0019L2073k935l3662j9160J234J2139
7279B112K8542R418m2288K12J4452o181J130k915m1144j0562l403l7289Q916N3923
7265b5077O3994K600m4893k4217r882j1789L711j543j788j3640R56J6373M1388
$$ y = [-21652, -16922, -46091, -14153, -13713, -20394, -20114, -25630, -25829, -2320, 9616, 20861, 6806, 12515, 15986, 33656, 37336, 35622, 29753, 13967, 7906, -22292, -21955, -18591, -18601, -5538, -5474, 31728, 15418, -1894, 1383, -35928, -26968, -19715, -18582, 9273, -10524, -52248, -48363, -40530, -3791, -11328, -12722, 6375, 47176, 50820, 23057, -18749, 1105, -6098, -37708, -65670, -75971, -41027, -28148, 9078, 45995, 68573, 37952, 37886, 18414, 23413, 11431, 11219, -24992, -56656, -41561, -37399, -50470, -73351, -44256, -27596, 12423, 44496, 41561, 7899, -11261, -10027, 2112, 30654, 40072, -2216, -2004, 12448, 6267, 7397, 4482, -36662, -47224, -50627, -87916, -79000, -25077, 38917, 41517, -3376, -27593, -37475, -49264, -45553, -47096, -48884, -62524, -61568, -45195, -3807]
7252c807o267k0613j2474Q263M777J2120J1264J1273N153P91J1887k9960O628
7239i65l218j9880j5350j6476K932J3775L7224l422l9395k4630m993K0126o833
7226f1105K9049N21j5352M0192J0354j802O838j3770k3017K5585N9343m7968k4748
7213a5880K2839r854k4879l0591o881q843q811L6455K7443k9495j0659P677P71
7200e0708K650J9990J0960K4735J889k3364j8784k2847p805K1206K3968L5872
7188A7762J5155l1224j3223M3692k995k8586k2024k0847M180M9716K4081l2441
7176C246l7700O6192k2229p893k2519j7050L894L1389O3217j1589p311j6246K071
7163B7472j0530N769O453R368j6883K0501N517j9089j9687k964j0612o317K606
$$ y = [-3807, -10074, -30687, -43161, -34898, -30121, -18001, -6737, 4536, 9689, 10480, 22367, -7593, -965, -4183, -24063, -39413, -55889, -52957, -39182, -1958, -5380, -44775, -69405, -74398, -54272, -61105, -32056, -31535, -46887, -6695, 3659, 1857, 8695, -5075, -28092, -2507, 56836, 8868, -15880, 6959, -2895, -27774, -58365, -65246, -74089, -82900, -46445, -19002, -48497, -59156, -51479, -50708, -48058, -28068, -17108, 7627, 9516, -13848, -32632, -55479, -63284, -42078, -18110, 17762, 32917, 1693, -11530, 32162, 29167, 581, -21443, -42290, -38110, 11606, 35687, 3246, -34454, 31738, 9509, 1616, -20903, -37953, -34059, -2670, 60547, 48958, 41647, 25401, 27472, 16942, 22711, 29164, 38532, 21649, 42150, 47667, 28578, 8891, 5927, -4685, -11002, -8396]
7150h396l7965J896K435J1003K7054J2801j7313n180M82L3845L8050O493j7347
7137D7858l0662l328L605l2713k1371j8550q507L2055L1185r147P045k2047j2180
7124c6757K281q304l7700K6388L9685J2148K7483O138J0841k8624o0215m3878
7112i0514K4917O5369K6780J1303k7975J2599j4384l622J1925J3036j2893k1281
7100d740r036J9134J9072k8699J2908k35j9432K4992J1300r174l7167l5686J8598
7087c8165O499L7894J3486L2578J9699J9080J4769l8523o3574K9986J0341k0927
7075B3143j9421L9190J3094m2753O251K0026j7617k2785K463J0445q576o243j3103
7062a5886q232J6458j7758N099J4790K5734l3646j0122J4296J3308j176q721j605
$$ y = [-8396, -46361, -44465, -42030, -31027, -3973, 8828, -8485, -13665, -13183, 20662, 58712, 65205, 47858, 17196, 13868, 17473, -15240, -36611, -55161, -63668, -31613, -428, -9575, -2530, -24577, -36757, -34476, -42780, -80480, -54092, -14407, -2259, 25224, 31362, 42203, 13579, -46636, -90514, -65597, -228, 26552, 37855, 9880, 22479, 8095, 4473, 16398, 29434, 16541, -4740, -13776, 5358, 24430, -4269, 8639, 8404, -11028, 13964, 25264, 16090, -21077, -56763, -38165, -31666, 6228, 19714, 52292, 71991, 91071, 105840, 67317, 3743, 33729, 44070, 23143, 3722, 42912, 56006, 13253, 19504, 39530, 21913, -872, 1591, 12036, 3460, -2783, -15886, -24118, -7660, -25418, -20319, -5529, 20205, -13441, -23563, -9267, 4041, 2865, -5856, -7461]
7049g461L4490J1191p906L352M401j2177l5091q321O572J1956K0801k9756j9255
7036b7204k0215K3746L4757K0589J9565j765o7714m6518O640J3911K2563M584
7024a7061L2927j6662j9092J2383j7447J1544K2870j5496o2029m4663L5691J5533
7012f1502q066M3817M7125R022P126Q416l590k9121K65o373k1401j6990j479K0125
6998a2626m358J6668J8825o703J635J0143j061R92k8372m9250N642j0342k4472
6985h3279M922m292m619M8225L9387j9428O899M1470j8610o7895k1469M3842K0808
6972a4039j6845J5689r343Q631o240k2824J3144L2378j5530l3762n341L0480K3292
6959c10M4668J3029p540m2564j8097J6214j1549r946J0438M0621K6152j6082m7967
$$ y = [-7461, 27029, 38220, 30314, 33666, 38067, 25890, -9201, -17522, -10950, 1006, 21807, -7949, -27204, -47419, -23673, 11084, 31673, 51238, 49473, -18241, -64759, -58119, -44208, -21645, -17061, 15866, -796, -19888, -7505, -24952, -13408, 9462, -6034, -68063, -112726, -77035, -61502, -69568, -25751, 21374, 30396, 37522, 45938, 42348, 13227, 13492, 7119, -14282, -31272, -32751, -12626, -16984, -316, 18509, 11806, 13441, 23584, 22523, 23515, -4857, -54107, -48465, -58807, -83279, -78357, -82649, -87268, -39043, 344, -19084, -12185, 29285, 10675, -57220, -78689, -34847, -14039, -30884, -15195, -24538, -15907, -22147, -44971, -31827, 551, -14979, -48741, -54082, -23602, -310, 44358, 57387, 49847, 7283, -10814, 5400, -6149, -16095, -5657, 34964, 61116, 45034, -2933]
6946b933o7068j8341J4670N4978L1153J9982N033m291p354m958J6327J1661j2744
6933C6115m3413m4797J6107o594J037J8583n212l3735O216J9675L9409L3883o0187
6920b2913P195Q934K1218k5244n0689j9793J7350K3185l917j235J7691J2153J6454
6907C89J821J8747j963O562L6767p1236o2353k2785j2878K2534Q659L7673J9274
6894a8789l7860j0326L0511J8093J511m0445j3446K9054J8229K1183K1236p644
6882A1307k3402k5095j6734L3806m448R381L1697J4020J8167j2465k3336j1590
6870A308o082k5257k8131K1662L4458L1072k4303j6468L1738L4935N80k9176o455
6857A9881Q991n5926l3670P776L5122N2115j008R260o3872l7827r533L4753P204
$$ y = [-2933, -70001, -88342, -73672, -18694, 12459, 32441, 37474, 33183, 25829, 20871, 37198, 48859, 36115, -7298, -52095, -35988, -42582, -41545, -22962, -28174, -61909, -55693, -36018, 3391, 37274, -22913, -15718, -6784, 14434, -10810, -61499, -81292, -63942, -40757, -44674, -45909, -28218, -16065, 389, 2210, 20957, 18994, 25556, 62323, -8913, -71266, -94051, -106929, -84395, -75736, -38063, -18789, -56649, -66975, -36464, -18371, -16860, -57305, -70751, -41697, -23468, -2285, 18951, 11307, -12095, -37190, -53924, -20118, -24566, -15185, 16512, 30532, 48699, 36234, 12898, 1308, -4774, -30031, -58162, -36500, -2042, 29030, 4727, -11741, 19997, 54932, 55512, 26336, 19881, 28872, -27054, -60724, -52948, -17826, 34289, 33281, 42541, -21331, -59158, -68691, -33938, -26734]
6844b6734J9435j4039j4576q864j5674n984K236J8979K3120L0707M4094K279J370
6831E6349j6687j1439j6902N444k904R548J1047J3308m3655l4195l182m9152o7
6818h2487N2165L2763L2649q904j2730R093J0491m2770j0210K407J8580K0931
6806B1978K7431j4541k5720q136j6182L574o122j3916J0791K99j6043k2721p506
6793f6814L3167J5667J040J5880L8317J1126j5617n344l3891P418q918l2685l6325
6780g6979J9728K4678N931j7406J3855r175R883K9128Q088j5457J3694j6731l0783
6767d1546L5335K6177K1081K1939n0447l2932j648J5646J4355m0718p217K9070
6755a0905M598j2375J0671M7960j2208O844r171o452O120l1340Q298L2675k728
$$ y = [-26734, -7299, -21338, -35914, -44778, -60452, -66436, -64200, -45221, -22101, 8606, 52700, 54979, 56349, 39662, 28223, 11321, 16765, 13861, 23409, 34456, 47764, 4109, -30086, -33268, -82420, -82487, -30322, 2441, 35090, 26186, 13456, 22549, 33040, -9730, -19940, -17533, 1047, 21978, 49409, 34868, 9148, 1012, -15170, -11596, -17718, -31634, -20843, -20544, -36587, -59308, -66814, -33647, -17980, -16940, -1060, 37257, 48383, 32766, 27422, -6469, 949, -7969, -40654, -76979, -57251, -32573, -26642, -44048, -30193, -39368, -29485, -357, 7731, -7726, 5968, -10763, -41546, -6211, 19966, 41047, 62986, 12539, -20393, -22041, -6395, 7960, -32758, -39975, -10905, -6307, -18682, -8011, 39949, 27741, 34585, 25414, 18962, 25082, -6258, 2040, 34715, 31987]
6742C1987P284j5229m269m448m0474n824J1567J0240N710K1496J661J3162l1684
6729A179j335L4465J825L342R10l1392j5701Q242J3903O140l516k6744k0303q227
6715c7212j261M0779Q890O910L7677N4959J6367J5381M6768R4816L0971m0710
6703B74335o9891j9436l0593k5164k3848k7016J3551j7591l5554k8532q486K8025
6691B9800k2641n6514m144J2514q402L0084L2527K8089j5130l16l0264j8319o522
6678b9238j892K3077j4031r159J0789j1156k4310j8928k805k519Q754L1530K5392
6665a4496q83J1393R490P456l6611K040p522l9059J272Q320J9839k33k4684j5081
6651g8759L0366L6002J2308k8717j4903L746k6118o310j7502L2227J0089L9889
$$ y = [31987, 39271, 24042, 19773, 15325, -25149, -30973, -19406, -9166, -3456, 18040, 19701, 32863, 1179, -156, 34309, 36134, 39476, 40386, 8994, -6707, 1535, 15438, 21578, 18062, -8682, -28985, -37212, -38473, 2306, 11196, 18106, 55783, 110742, 127109, 142490, 189258, 284074, 315045, 274335, 204444, 185008, 154415, 129251, 105403, 78387, 91938, 74347, 38793, 10261, 1775, 29800, 7159, -49355, -53499, -40985, -49387, -19303, 13224, 41313, 26183, 25867, -4397, -22716, -29238, -31130, -8053, -22084, -31243, -20454, -31610, -55920, -74848, -77653, -80172, -71418, -39888, -14496, -15379, -3986, 5504, 12960, -23651, -21611, -29133, -68192, -66920, -58600, -38761, -38994, -63678, -78759, -48393, -12391, -83, -28800, -43703, -39957, -66075, -72385, -89887, -57660, -47571, -7682]
6639g682J1522j5296j2602P638r959J9291k8775K0044J8018l9979m160M296K9556
6626h088O637Q429J2559K2157O618k2214m4074j0047R117L3510K4136j8434k3534
6613c228l483k0294l1273j1390N7491K5086m3314K894O587K9525j0618k2545K1804
6600b758K2082P766l802L1594K5083K843k7541l7500n1685n0283K3382M8727L6472
6587B4380r477l239R206J6770J513j6721P24l4167K712O1078p205k7126m7192
6574b8744l0033m0981n797J4019L3562j9321N216M2832O835k9520J9792Q59L430
6561b7851j5921l0974K2309m958j0952L9286K7149L4550J417j8242k4920N511
6549c596L2552K4596k3981k0438J3010j7093m0509l696J3854R597K2722J7583
$$ y = [-7682, 3840, -11456, -24058, -16420, -26379, -7088, -35863, -15819, 2199, -37780, -41940, -37644, -8088, -1451, 6978, 19537, 41694, 48312, 26098, -17976, -28023, -18906, 14604, 38740, 20306, -3228, -6711, -27005, -58278, -69668, -12177, 12909, -30405, -27511, -20924, 8601, -2017, -24562, -2758, 19324, 27090, 23288, 54882, 79965, 82808, 55267, 17767, -33918, -84201, -60819, -12092, 24380, 14903, 11664, 20870, 37640, 39153, 22432, 23156, -11011, -8299, 52779, 45574, 18448, -28744, -58777, -99758, -105555, -91536, -57974, -77295, -72079, -29247, -22412, -51932, -32140, -31281, -27851, -43772, -74746, -52437, -57395, -68347, -29061, -1912, 32638, 34055, 15813, -9107, -3596, 28956, 53552, 29571, 9133, 22143, 5050, -35459, -39155, -25301, -15704, 7018, 24601]
6537B4601L6510K2846m9071l6283M884r915q167K546J3251k2653k060K8358J0142
6524A4989K417k4162o140J2905r380k8293J3974R519k963J4251j3873K6409J7368
6511B7021j8490k7974k2368m6696J9554K6276j3987R9Q7J0243J6960K7068J7751
6498A5544J065j6602k3329k014K846L1649J9028J47L969k8539n1229l2568L0930
6485d9103M7254l104J8965J5192o622j4129j4765l7526M6596J2587J3273N071
6473C3689J7106p798j203l3077m408n091k5033P941J2589k77j280J343j4138j3698
6459c3335l778j1413R954K6929p868L5959k6643n9916j04N5332N3011K042j2230
6446B7940K7043o906k0801J6424K1020j3993m535l3462j8432L9969K5486J5547
$$ y = [24601, 61111, 83957, 34886, -1397, 3487, -6428, -14595, -12049, 1202, -21451, -23511, 4847, 14989, 17406, -6756, -12896, 9, -9371, -37664, -23690, -14171, -17134, -2883, -16756, 9653, 27021, 8531, -19443, -41811, -88507, -68953, -42677, -56664, -56565, -56478, -46235, -29275, -2207, 15544, 16609, 7, -23322, -25336, -22490, 9159, 28187, 28334, 32303, 3764, -47465, -80033, -49103, -1849, -4953, 14012, 29204, 22582, 8453, -6312, -43838, 2758, 15345, 28618, 33689, 50795, 42997, 41794, 8717, 4309, -782, -25815, -17874, -5285, -5562, -6842, -5499, -19637, -33335, -37113, -48526, -38572, -11643, -19511, 16448, -10195, -70111, -70215, -14883, 38128, 40170, 27940, 54983, 48077, 27276, 43700, 64720, 50727, 46192, 12730, -5702, 34267, 59753, 75300]
6434G5300o815m5904J522J0275j0637K1984J3005l338l371l732l3942K4034j893
6421C6488o390l5722j4190j4112K1672j1426j5076j2030k4433J1415M1323k635
6409b5116j9073J5964K6128l360r168l3541r769N9892m744O997P898J0630q440
6396A4298k64k5593J7684J0268k546Q672j8181K991j6968m920j2958L3237K22
6383E942R072k3669M115k9716l1945l938K2739k785J9065K1331K46j3530l2782
6370e5855o919K3890K413M141j6123K5462M1141Q65j6322j3594J7408k5207l426
6357b2126L8845L9580k4012l3539k4813J7803JK7268K0094K0562p047l9191L27
6344A3752m001j7667Q496J1339J9167m738j3423R763k908j2514k5888k6261j9064
$$ y = [75300, 68485, 22581, 24103, 34378, 23741, 45725, 58730, 55392, 52021, 48289, 14347, 38381, 36488, 30098, -5624, -19814, -33926, -12254, -23680, -38756, -50786, -75219, -63804, -22481, -25116, -44189, -28225, -2097, -5457, -14625, -48166, -57935, 1957, -2787, 4210, 12108, 22738, 14298, 14034, -11559, 6125, 16393, 13847, 22519, 4338, 7329, -9639, -14559, -27517, 5720, 5942, 15014, -8655, -4540, -34256, -66201, -70139, -47400, -50185, -31120, -9789, -9543, -23073, -55855, -62774, -38884, -36471, -32330, -48453, -22991, 18150, 19015, 2693, -10901, 6507, -18700, -22126, 16719, 56299, 32287, -1252, -26065, -8262, -8261, 19007, 39101, 59663, 52616, 13425, 13752, 9751, -7916, 580, 11919, 31086, 26348, 12925, 22688, 19780, 7266, -18622, -44883, -63947]
6331f3947l233k5542K6034M6768M1828m882n389j0823k8184m7389R548L1835p437
6318d0813l7568M79J6941J4309K9564J3897k1224q377J4338L317m3507J6112K0738
6305b1794K0542N3080K6096n0353j9495K4388j1992n864l12K1253k5590j5148
6293e189M589k1971k0817j9817m6997l982L9801K1800j4479l7646M3160P3877
6281A2329q954j4539m893k9530M590R94m3580n2134M7322L0665N9521L4430m0540
6268d319J7355L176l7463j2480R208m624l828L0334K2119j3552K089k0913N668
6255g230J7085k367P019k8513n0414J0560q3L3402o640l8774L3328M0334K4231
6242C1938K0570k3694k5182j2034J097L963l016J9931r79p018K4048J2560J6139
$$ y = [-63947, -67180, -92722, -66688, -19920, 21908, 17026, 11637, 814, -27370, -74759, -65211, -33376, -40813, -78381, -77902, -60961, -46652, -17088, -3191, -24415, -32792, -18454, -15137, -58644, -42532, -21794, -1252, 51828, 77924, 27571, 8076, 32464, 20472, 14608, 14296, 35549, 9959, -5189, -600, -22571, -43388, -63205, -110202, -114184, -74383, -52583, -67062, -104708, -61548, 12329, 3375, -11164, -16057, -45587, -40997, -40003, -83583, -135717, -88395, -57730, 1791, 36221, -4319, 13036, 16212, -21251, -33731, -24523, -29147, -32975, -2641, 19478, 5926, 8015, -12898, -7230, 9855, 7488, 14507, -14006, -64420, -53860, -53943, -20541, -27181, -65955, -32627, 7707, 31938, 52508, 28814, 3632, -8402, -7305, -3342, -6358, 13573, 12594, 5576, 29624, 42184, 58323]
6229E8323J4471M0111l2855p1144l9721j3665R020K9900J8952j5758q74k777J1626
6216E609J24Q171K4638k5994p8399k9160Q884K39n823L24K4071J6051O32k6208
6202g6841K6355K2942k5806q285J1534K7730J3086K4631J1200n913K945L447k7130
6189a05k439O259N720k2846j0735L8708K0084k4666R88K8356q554k5645J3860
6176A8985K1539j3218K8459K2805l1249j7404K1200P378j4827j8188l4032l8752
6164d7304m991L0081Q959k5215J3268O395J8967J3597j5926k1969j0332J8564
6152a5906L66k6829r408N0157K1343q973j6174J3037k5648j0144O2102J8880k5856
6139B6947j1990k8263J0912K2670N141j2315q92q311R112J4581j7272Q999p168
$$ y = [58323, 72794, 112905, 80050, 8906, -30815, -44480, -35460, -5560, 13392, -2366, -3240, -6017, 5609, 5733, 13904, 38542, 12548, -65851, -95011, -86127, -85888, -91711, -91387, -67316, -51265, -50633, -76841, -50486, -27544, -53350, -61635, -50101, -22371, -9285, 15346, 26546, 20633, 23578, 27025, -105, -2544, 3715, 9435, -13411, -24146, 14562, 34646, 9980, 10968, 39324, 30770, 5125, 18985, 40524, 27306, 55765, 78570, 47321, 29917, 51117, 58495, 43668, 25480, -8552, -47304, -52295, -22214, -13255, -38470, -25202, -18807, 160, 13757, -2169, -24138, -34470, -15906, -15540, -42369, -51777, -1620, 19723, 10750, -5424, 7613, -18035, -28179, 33923, 52803, 26947, 14957, -13306, -2394, 20276, 25417, 13102, 12210, 3899, 13011, 27592, 10320, 19319, 12151]
6126A2151j1379N049n2387J7927M4281O1913L9396p401j4854j6861L874p835j9690
6113E4184q077k6656j6842l539j3984K920n493M421J4722q076N487M0176J6327
6100E5570l4704j189M5893m487m6137m3417J6756M3858n473k1947l0228J4287
6088a1218K7082k8737J9347L0876J4739N44j1472l374m012p181n105k8204j7340
6075b4055J4870j5659k1814j8143k345J6117M4800K7263q758m4365l4429J6611
6063d9907j0740j7887O0220L3397o000J391N358P189k4874j1806l94K106j43j2155
6049b4245o316L0065L770J5580K549J7342k5097K1005k0103n973Q144J8233M137
6036C9091m6315r320m884j9573j7325J6206M7978M543r762O756N13L1483n645
$$ y = [12151, 772, 5821, -46566, -28639, 15642, 77555, 116951, 109550, 94696, 77835, 81709, 73874, 54184, 46107, 19451, 2609, -930, -14914, -11994, -17487, -13066, 1656, -6420, -933, 39243, 55570, 20866, 19677, 65570, 61083, 14946, -28471, -11715, 32143, 26670, 4723, -25505, -11218, 15864, -12873, 6474, 37350, 52089, 52633, 41161, 37787, 33775, 26594, 21489, -6715, -24055, -9185, -24844, -46658, -64801, -67146, -51029, -6229, 21034, 12276, -32089, -66518, -49907, -60647, -78534, -18314, 15083, 9083, 10474, 15832, 23021, -1853, -13659, -14053, -11947, -12090, -24245, -30561, -496, 3274, 18854, 21403, 38745, 13648, 34653, 14550, 8577, 16721, 34954, 39091, -7224, -16544, -21428, -41001, -58326, -42120, 5858, 10401, 639, 7395, 7908, 39391, 33746]
6023C3746n860j2283K5278k1638n1557j800K1377J2007j6800M5249J2516k6909
6011A3326j8215N356K067q046L968r533k7139j1945Q639K5531p432l1283O467
5998d8239l108j2313K2193K2794o878K4556K3422j7956k7829K0218L4627j0332
5986B1155m2327j4794P573j7270M441N242P75J0371L5256j9415l1470j9361O603
5973e3221n097k9377P16M1971M6443k4991k7943L3924j1483M972J9484m8054j5080
5960f7736l14M070J3625R624R79j5914m857J7542l1403P959N113N779K7936K2809
5946d788l675M2362N978m5250l4792j3036m517K6462j2432K3554J6997j6983l0585
5933e0705k478M885J3584J3579L1056k9861N83q831M118l7609j973O2084K3203
$$ y = [33746, 27886, 15603, 40881, 19243, -32314, -34114, -12737, -730, -17530, 27719, 40235, 13326, -4889, 467, 2534, -5512, -1544, -11077, -38216, -50161, -41522, -15991, -23423, -54706, -48239, -51347, -63660, -41467, -18673, -25551, -995, 22427, 4471, -23358, -3140, 31487, 21155, -21172, -35966, -28393, -45663, -41222, -35980, -35205, -24834, 10422, -8993, -40463, -59824, -53221, -58318, -87695, -86979, -45008, 1435, -23556, -51499, -17575, -29058, -24086, -4602, -52656, -67736, -68050, -63980, -50355, -40731, -39752, -55666, -60523, -42981, -74384, -66425, -61312, -55533, -27597, -4788, -8463, 33899, 39877, -5373, -40165, -53201, -57718, -31256, -43688, -20134, -3137, -20120, -50705, -53183, -48298, -34714, -21135, 9921, -19940, -19357, -28188, -24070, -61679, -63652, -1568, 21635]
5920B1635L5818j0357n7555j961L8204k0570j530p178M461k3264o326m337l4428
5907f7388M90J0682m4478O910J9966M066M1390M0772J620m3012P597r51q794J369
5893b9761O394K991L1051M7323L5493j2821m9846k5697k5005J311j4273m063j8902
5880e5805P926M912L3144M2155j024L841N385J7446j8607k7456l6852j8238j8294
5867f1467l2208K7846R2634J7180M134k8421J3019l5487l3381K1409k214O198
5855a0758N871K8743K1242r228k4597J1988K6025K1349l4681k8851q630J3497
5843A1970k1340j9050J6473l9j0257l727J948L4507M2855J9578P308m7195k3026
5830A0005K3596M7207l4702m8255m904L8535J0176k9856k5505K8786j8835m5085
$$ y = [21635, 57453, 47096, -10459, -12420, 25784, 5214, 3684, -3494, 967, -22297, -28623, -32960, -67388, -66898, -56216, -100694, -93784, -73818, -69752, -28362, 12410, 14030, -28982, -21385, -22336, -31130, -29761, -23367, -20376, 10675, 57998, 93491, 80670, 30824, 5127, -19878, -18567, -32840, -36903, -55805, -47879, -42967, -9823, 32332, 31308, 35149, 40534, 57980, 39373, 11917, -24935, -43173, -61467, -93675, -65829, 26805, 43985, 48119, 19698, 32717, -2770, -36151, -14742, -16956, -10758, -4887, 23856, 45098, 35870, 11273, 23261, 49286, 70635, 35954, 7103, -1527, 11970, -9370, -28420, -11947, -11986, -22243, -25970, -24022, 10485, 53340, 72918, 80226, 33031, 10005, 33601, 80808, 46106, -2149, -7053, 31482, 41658, 11802, -13703, 15083, -3752, -48837]
5818d8837j8877j9678K1661L0814L5419j240m516l444n077p130M432o263q178
5805c0914J0894L6731J297k6755m1461l335R539m6138p399K3161J2166K2071K1301
5792a8842K3778k1037L4277K7335m7331m7955k4096J1370N3489l7166l0989J2104
5780f5063J8479L4260j9668K355L2031J4684j022j3196J6144j9867K0564K4527
5768D4228j8949m9451o206k3703j3840J5236J000J4541J8287k2513j5047L1149
5756b5268J0247K255J5128j9365j072K9193M1521J2540k9601o2456j8482K1582
5744b3778R258K570j4572J4335K6038j1740l7384K0798L1684r396j9674k9769
5732d1630L4416K2869j9816k2486J6912M7154P621n7304r899L2298K0008j9119
$$ y = [-48837, -67714, -87392, -65731, -34917, 502, -738, -5254, -8698, -13775, -20905, -16473, -22736, -30914, -20020, 16711, 18008, -8747, -50208, -53543, -44004, -90142, -97541, -74380, -62214, -40143, -18842, 4936, -16101, 18176, 45511, -1820, -49775, -73871, -62501, -9012, -46178, -77167, -65063, -46584, -12324, -31992, -29637, 2394, 17078, 16056, 2860, 19004, -863, 19701, 44228, 25279, -24172, -30378, -54081, -67921, -52685, -51685, -37144, -18857, -41370, -56417, -25268, -15021, -12766, 2362, -17003, -18075, 11118, 52639, 65179, 35578, -26878, -45360, -23778, -14520, -11950, -26522, -12187, 13851, 2111, -35273, -14475, 17209, 7813, -11861, -41630, -7214, 15655, -4161, -26647, -9735, 37419, 45040, -12264, -22163, 10135, 30143, 11024]
5720A1024l4831k7451Q142k2596J4350K1143K8863K6891l2732m5706p704K9972
5708c0635P308J9265L0716j0288j7606M7562M276l7419k6203M392j0067J3468
5696e231L3117k5080n308N625R68k5309m656L6193L5648M318j1407j7991l1999
5683a1112J2176Q650K535p808P021R236r65k7630k0109j0846K1903k8383m1722
5670h7054n287L5130M7994j3221l073J1384R970l1424J6496K2151m254k3842K3756
5657a274J835j882K3877L0469K2403j6243k0303J9708j373k8717j8165q665j084
5644E86k0271K337J1902k1047M5832K0160k3468m7643j7282k2229K4258M9301
5632B436J9324l8931k3016j161J6197J1005M7898Q065M195n3470j9367J2659R374
$$ y = [11024, -23807, -51258, -43116, -65712, -51362, -30219, -1356, 25535, -7197, -52903, -60607, -30635, -23327, -4062, 26654, 16366, -1240, 46322, 50598, 13179, -13024, -8632, -18699, -5231, 27886, 2806, -2502, 3123, 4091, -21218, -25874, 10319, 45967, 50285, 38878, 20887, -11112, 1064, 9714, 12249, 4441, 11462, 20698, 19733, -7897, -28006, -38852, -16949, -45332, -87054, -92341, -57211, -9217, -22438, -25511, -14127, -4157, -35581, -19085, 3066, -1188, -25030, -1274, 561, -1321, 22556, 53025, 75428, 59185, 38882, 58590, 57217, 28500, 10335, 1670, 586, -19685, -17348, -5446, -26493, 19339, 39499, 16031, -31612, -48894, -71123, -46865, 2436, 21760, -17171, -40187, -41348, -25151, -14146, 33752, 41817, 46012, -7458, -26825, -14166, -4792]
5619d792J1136O153M5462J4136m8070n6796l4571K4259M7342K8691J3667k9994
5607A6623k6654N426J0609J5215R187j5733m8355k014K7097K6696K726k4913K559
5594a531j353j4732k4088M2458Q732m449k7523J1471J6676J0944j557k899k959
5581I190r978M5254J5005k2101p596o0554j2681Q66L8525J1584l4265k0602R375
5568c7978j3023J7956K0936K3411j02j3340K6744N933N648r641O315K2036o648
5555D8247l2788M724K0357P098J8391o848j5408p80j9934m4900J2725N178k86
5542d224j8789J9783J6830l90M0587k644o6229j5822P6990M0953j0742n2246n4547
5529c0490O289L0592K1265N557r376k5618j6326j1619l4800j6707K2549K0699
$$ y = [-4792, 6344, 12497, 57959, 72095, 24025, -32771, -67342, -43083, 4259, 32950, 46617, 16623, -10031, -4605, 6004, 21219, 30406, 14673, -33682, -35696, -8599, 18097, 20823, -4090, -1531, -2884, -17616, -41704, 754, 9486, 5037, -22486, -11015, 5661, 16605, 15048, 12149, 9190, -788, 44466, 59471, 37370, 29774, -30780, -43461, -42595, -4070, 7514, -26751, -47353, -37978, -51001, -33045, -12109, 11302, 11200, -2140, 24604, 30537, 36185, 26544, 32859, 54895, 48247, 15459, 20183, 40540, 47638, 66029, 59181, 43773, 42993, 23059, -21841, -9116, -3938, -4224, -23013, -3230, 13600, 13210, 53797, 51153, -15076, -30898, 46092, 87045, 76303, 24057, -30490, -24201, 6391, 27656, 33213, 23837, -1781, -18107, -29726, -64526, -81233, -58684, -37985]
5517c7985l6312J0514k582J566P6334J5531j1936k5046k3495J3946J3350j3354
5505a9469j2821K8989K2008j9685j2226n058j3049k6354K7030O6480l929Q232
5493D0148L085k8500m614k4547Q912L869l0955n837L131l776K1026q984O102k092
5479b3032J0997j1876l0935M3524p464m244L0076J6787j5095j7391P304q952j6072
5466b6373N640k8624J0474Q085k6375j6579N8742J0178R625m6319k8014O1249
5454h291J4635L1419j3411m4321K0998k7588l5193M1336N5569N419j1323k3127
5442F122l5797j655J4239j534K240L6106L6849K103l0456k9142K523M014m932
5429F80k292J1280j1917j3952J5266m6024R017J7959r099J9270j0866j6281L5291
$$ y = [-37985, -74297, -63783, -66365, -64799, 11535, 27066, 15130, -9916, -33411, -19465, -6115, -19469, -32290, -3301, 18707, -978, -13204, -18262, -31311, -57665, -30635, 35845, 31916, 40148, 43233, 14733, 10119, -14428, -5516, -1647, -32602, -38439, -35308, -39084, -18058, -27042, -20940, -23032, -12035, -23911, -54846, -11322, -18786, -23030, 7046, 23833, 8738, -8653, -1349, -10301, -26373, -20733, -49357, -38883, -30798, -57173, -73752, -15010, -4832, 4793, -41526, -69540, -8291, 6344, 37763, 24352, -19969, 1029, -26559, -61752, -20416, 35153, 40572, 29249, 6122, -29675, -31330, -17091, -18625, -16385, 19721, 56570, 58673, 28217, -925, 1598, 5612, 680, -1612, 9668, -2249, -16201, -935, -46959, -37942, -19983, -29082, -9812, -20678, -36959, -1668]
5416a668J6800J3940J9396J87m4810q249n710m405J5199J073Q282J8628n322l1672
5402h331k4812Q057J7715j1842k1419j9314R710K5841M0820k7676k9318K6719
5390a3850J972k5552K6719j5656k1180J5367J28r360p536J4654L7489N3452m4220
5377A2427l7884L3003K9306m4559o4073R820M0794L2445m4928k231K0157J4687
5365a036K310j0498j5771P195K7003j4837L2861J4373k1188K6598J5983k8880
5353C4113k214J7396j182j834m3565m3438K7116K099k8164J5457J5576m140J6341
5340C561K1573P937K4681l4285m4434k3150L3054K6823k2979p183r434j3690M336
5327c3190L2016J579R015m328l3194J1229L1818j375M6625k4023k4932k8130j2624
$$ y = [-1668, 15132, 29072, 48468, 48655, 3845, -4404, -10114, -14519, 680, 1753, 10035, 28663, 23341, -8331, -33143, -25086, -7371, -19213, -40632, -59946, -50236, -24395, 16425, -11251, -40569, -13850, -11878, -37430, -10711, -26367, -47547, -32180, -32052, -41412, -48948, -34294, 3195, 56647, 12427, -25457, 7546, 36852, -7707, -71780, -61960, -21166, 11279, -33649, -35880, -15723, -1036, 1274, -9224, -24995, -17800, 9203, -5634, 27227, 41600, 20412, 47010, 62993, 34113, 31899, 49295, 48113, 46279, 2714, -40724, -13608, -11509, -39673, -24216, -8640, -12780, 3561, 25134, 33071, 57752, 23467, -20967, -44117, -11063, 15760, -7219, -14402, -23836, -37526, -33190, -1174, 405, 9420, 5092, -28102, -16873, 14945, 13570, 60195, 36172, 11240, -16890, -29514]
5314b9514J0435L1361J0149j6942n6535j5906L9452K0174J1810p355j5909j0938
5302b9718r887K3082J1816K0605j0019o651L023n1448J4678K7932q61j2010L8805
5289A9347j0670k1461r570l727M1801J9730o362j5355j5896L896K5403J4095K374
5276D3605R774m911j8948l8062R251j1460j4272J1659p313l2566j313k4363O762
5263g2157K7188O314L2056K9284R471o318Q526n979p209P306j7568j2828J7422
5250A5508J4721r511k1653j3023j2865j0337M7682m2871q144M543Pk1712k331
5237e9986J1395N6825P616o813o0465J2580k142p67L3632K4714J7974j7818Q614
5224B5359R232j3649k0239k2967r229k3334M4742L1364l908j4014j5833p88K0566
$$ y = [-29514, -19079, 12282, 22431, 5489, -51046, -66952, -27500, -7326, 4484, -2871, -18780, -29718, -39605, -16523, -4707, 15898, 5879, -772, 2251, -49197, -34519, -6587, -7448, -19458, 19347, 8677, -12784, -22354, -26081, 15720, 35450, 29088, 13733, -2163, 1733, 27136, 41231, 43605, 53379, 48468, 29520, -8542, 709, -10751, -25023, -13364, -20677, -53243, -54556, -78919, -72157, -44969, -38655, -6599, 22685, 32156, 25838, 34364, 28385, 21176, 28482, 10914, -1914, 15508, 30229, 20718, -935, -13958, -26823, -37160, 10522, -32349, -40493, -35950, -35943, -57655, -59986, -48591, 8234, 15850, 9037, -51428, -38848, -40990, -41757, -8125, 16589, 34563, 16745, 25359, 34591, 20942, 703, -22264, -31493, -54827, -10085, 21279, 17371, 3357, -12476, -13264, 7302]
5211G302P747l9436l0958O811j9652K4950K6789J4619J6669m7311j1837J6665
5199b7642N0435j3988n1494k3134Q588M860L0185j5565j3930Q457N432M4349k9498
5186b2945k8349q21R729m792O976P952K620L7628K9045k6855k4824K3507k7411
5173a8540L122K6097J1163l5795k3198j1621J6544K4907K3290K125R4n254J3351
5160B6285J1636m9368m6145j6066Q678J1547N857J0858M032Q608J3316J7818r354
5147b298k6838O438J9865j4678l585K4321q127j5463j3720M97L0811J9116N031
5134B1370O165m1900j2790L9815L6093j7357k4775K9762K1713k4933l589p976
5122B1598L6066J0970j1687N970K0079N423j140j1209p001o902J46K5772K0333
$$ y = [7302, 15049, -24387, -55345, -48534, -68186, -43236, -16447, -1828, 14841, -32470, -44307, -27642, 22793, 8805, -42689, -65823, -57235, -52375, -22190, -37755, -51685, -43228, -37796, 6553, -22945, -51294, -52115, -42386, -47178, -40202, -32250, -29630, 7998, 37043, 10188, -14636, 8871, -18540, -15418, 10679, 21842, -13953, -37151, -48772, -32228, -7321, 15969, 18094, 18188, 12934, 26285, 37921, -11447, -57592, -73658, -64980, -53433, -47576, -36718, -32686, -24078, -10762, 7056, -2298, -29136, -22698, -2833, -17511, -21096, 3225, -4902, -20365, -34085, -33588, -2777, 16339, 21370, 27535, -14365, -27155, 12660, 48753, 31396, 6621, 36383, 58096, 33163, 29574, 21598, 57664, 68634, 56947, 62917, 82996, 88419, 87279, 76070, 69069, 62167, 62313, 88085, 108418]
5109A08418j4491k3012k666Q191j1400m8558n223O307k1560L9692K0286j7160
5097C8824j019n104l1379J0536k5725k6689J151m889j336L5730r98l887J2527
5084b258K2198P917k8974L834l543j9265M0666K5055r626k2886j6707L1500j8630
5071I281n1077K7055L7983j3740m1176l9475M2914L637j9466R358j6274k064J7219
5058c5825P5366m27j4641J2024Q228q383k9948J0193K0494Q513J1273J2776K9892
5045I9535m074m3061j8214n351m1908p095M3068J9096j3665k6N0338J5433l8008
5032E6068k0436q275J3855K4369l3771k5210q35J4738j4388l3745j9897L9604
5020g923n538r10k2288j6085l168j8444J8061M6753K9712K6925m2011p797l946
$$ y = [108418, 93927, 70915, 68249, 76440, 65040, 16482, 11259, 17566, -3994, 35698, 55984, 38824, 37805, 32701, 1322, 11858, -13867, -40556, -39405, -44294, -45630, -9900, -10898, -14785, -2258, 19940, 27857, -1117, 2717, -826, -20091, 20575, 45630, 36004, 13118, -3589, 27911, 9281, -41796, -14741, 23242, 9502, -31674, -71149, -28235, -24598, -44064, -34706, -50980, -53044, -35825, 39541, 39114, 24473, 36497, 44725, 36342, 6394, 16587, 37081, 45594, 56867, 69643, 99535, 95461, 52400, 34186, 28835, -13073, -20168, 22900, 41996, 28331, 28305, 78643, 94076, 56068, 35632, 27357, 41212, 65581, 31810, 6600, 5765, 20503, 6115, -27630, -47527, -7923, -13461, -14371, -36659, -52744, -55912, -74356, -56295, -9542, 20170, 47095, 5084, -2713, -6659]
5007f659j1110j6812J114J1780k799Q643L1200K9802l3149k0938K6736l4125m6379
4994f2696J6304j0305m18L0223k1085J2966K3530J9663M3551K024m4222j1918
4982b383J1638j6631k6845j5012J5130K6065J5043j5672j9597K835k6081k311
4970e3821J0788L9035M769k9222m1564O206K696K9215L2703o784M12j0660J6259
4957C2p005j9362R433M2364N661K869n379k183q985l698J5024l6990M87M2862
4943C5130n321K540j9827o615k1641j0899K2989L0370P963o166m8620Q930J2177
4930A010L302k6870l7399K2331K3133L3234K5774m4865o394J008j1828j1086j682
4917c0332j1820j4721L3040L3282K2149k6668k4039j9266l0663Q725L3729L0J5005
$$ y = [-6659, -17769, -34581, -33467, -21687, -24486, -15843, 15357, 45159, 12010, -8928, 17808, -16317, -62696, -46392, -56697, -57115, -26892, -47977, -35011, -11481, 8182, 51733, 53757, 9535, -2383, 9255, -7376, -34221, -49233, -34103, -8038, 7005, -8667, -28264, -25429, -51510, -53821, -43033, -3998, 771, -28451, -70015, -63809, -61113, -31898, 805, -5979, -5567, -16227, 32, -6973, -26335, -16902, 25462, 31123, 33992, 28613, 26430, 17445, 13747, 28771, -8219, -7732, 35130, 29809, 32349, 12522, 5907, -15734, -26633, -3644, 26726, 34689, 28523, -20097, -11167, 1010, 4312, -22558, -59957, -37626, -14493, 18741, 44515, -350, -6744, -5736, -17564, -28650, -30332, -42152, -56873, -23833, 9449, 31598, 4930, -19109, -38375, -69038, -60313, -26584, -26554, -11549]
4904a1549P123k1325K5969J9331L94N272J9678L578o312J4575q967m5911l0591
4891b8735J3213j1161R591K8075J1584O201l4850J5539J5094K0677k1511j0913
4879A2804Q314l0114j3551j0290l263N136l968r561J3297O802J1839j0150K1575
4866a130m749j0509l850J1273L7063J6132k1798J7559L8882l6433k8571r17L105
4853A6057J5196J1719k5434O772R79j2631J3138j7876j3110j7555K6284K603K167
4840H309L2460L616k204p901K3532m1659j1908K0456K980K1284m506k3426k9065
4827h032k7430j6925J4194M812r023N425L054p898n96K4621k6009L3450N6182
4814D5825K3363j7119n0634m2390J6406K1768l1024J6234K718j5551k659k1683
$$ y = [-11549, -4426, -25751, 218, 19549, 19943, 25215, 44893, 48471, 42159, 56734, 47767, 1856, -28735, -15522, -26683, -17092, 10983, 22567, 28768, -6082, 9457, 24551, 45228, 23717, 12804, 21118, -8996, -22547, -32837, -36100, -30964, -34932, -44493, -31196, -24394, -12555, -22705, -1130, -5879, -16388, -20238, -8965, 28098, 44230, 22432, 39991, 78873, 42440, 13869, 12952, 16057, 31253, 42972, 17538, 24310, 25289, 12658, 25796, 7920, -5190, -22745, 3539, 6142, 8309, 40769, 44385, 42181, 34280, 57812, 16153, 4245, 24701, 27681, 48965, 44459, 21033, -8032, -35462, -52387, -38193, -33381, -42404, -36979, -33925, -41823, -42419, -17798, -43807, -10357, 45825, 69188, 52069, 1435, -40955, -24549, -2781, -33805, -17571, -14853, -30404, -33063, -54746]
4802e4746j415P9511N793j022J3262O842l1086p065K2343N818K564J3326K2873
4789G6998j3187k7688k798k2420j0266j4904M3809M9243K9662p780k3075l7314
4777D0280l7028M431j3441r209K592K6635R842J9555J427k618r74j5926l3954
4764h388j4656M9986J4373j5705j995J4768p685l4202R315j1353q221k7206J8867
4751b2102J9417l4188j982l326j436K6689j6400J4274P5164J8138l828j3398k2900
4738C4122L116K6320j9144k7087P885K707j7815L0902L2520l4734n5583l8326
4726e5117q561P345m7586Q603P6226q649k4564M8012J9357k006n939J0046k0220
4713c053P66n4126L1870M0608j869N203K8541l313J7810l2465k8594l1319R40
$$ y = [-54746, -56161, 23350, 29143, 28121, 41383, 48225, 17139, 10074, 32417, 38235, 40799, 54125, 76998, 63811, 36123, 33325, 10905, 639, -14265, 29544, 78787, 108449, 100669, 77594, 40280, 3252, 7683, -5758, -14967, -12375, 14260, 24102, 43657, 45084, 42466, 41492, 25566, -8388, -23044, 26942, 41315, 25610, 23615, 38383, 30698, -3504, 5811, -5542, -13763, -40969, -22102, -2685, -36873, -38855, -42181, -43617, -16928, -33328, -19054, 56110, 74248, 70420, 57022, 34122, 37238, 63558, 44414, 17327, 25212, 27919, 10104, 41006, 73526, 38792, -16791, -55117, -63678, -56333, -103919, -95316, -19090, -27739, -52303, -4291, 15066, 13060, 7121, 17167, -3053, -2287, -56413, -24543, 16065, 14196, 19399, 47940, 44627, 62437, 29972, 1378, -29941, -29001]
4700b9001M4408L485o9255j3955l4533L4433N2325J0793j3298n481j6337K063
4688c4353L3267j158k0552L9820L2488k6008O801k2304o440M334M785k9121p704
4675b6145L0565K8165l9711q962J5130J6377J9076j5932J499k7901j7123K5850
4663H88P764K4229K2340L431j4635J3099k587k0525k5625o015K8941J5581k3406
4650B3480Q876K2845o675j4708l7560k0767j1908Q053L2394k437O704N442r17
4637A2822n6592k533K2647q793J0806k3741K7060L5143J1543L67R70Q121k1869
4624A5951j5426L8812j916J1775j4541m5937l0099L4117L0549J6224m8604J759
4612g336L6599l2130j5154l0775j6533J193Q032K7689L9214j1486l3827P867K2221
$$ y = [-29001, 15407, 18892, -50363, -64318, -98851, -64418, -12093, -1300, -14598, -20079, -36416, -34353, -1086, -2244, -22796, 17024, 49512, 23504, 30305, 8001, 1561, 5895, 10680, -18441, -26145, 4420, 32585, -7126, -16088, -958, 15419, 34495, 18563, 20062, -7839, -24962, 888, 8652, 32881, 55221, 58652, 44017, 57116, 54529, 34004, 8379, 2364, 31305, 46886, 23480, 32356, 55201, 48526, 33818, -3742, -24509, -36417, -28364, 4030, 1593, 8297, 13739, 12822, -43770, -46303, -23656, -32449, -21643, -45384, -18324, 16819, 28362, 28729, 29699, 37820, 15951, 525, 39337, 37421, 49196, 34655, -11282, -41381, -7264, 23285, 39509, -9095, -7336, 29263, -2867, -18021, -48796, -65329, -64136, -56104, -28415, 10799, -687, -34514, -26647, -4426]
4599d426M778R418M401j9202J0323l9393K2p491O112k402K751L899K8779L5237
4585C2806m385L582j1078k9333K9292k2527j1481K1310L9853o409R95k8430P546
4572B1741M3736l7474m4482l938N173K4147k044P631L203j3471j0059l0003Q136
4559b7704R349K3247M4828N712r663j217p133k7807j6496j221k3990J3316M3198
$$ y = [-4426, 352, 9770, 14171, -5031, 5292, -34101, -34079, -41570, -35458, -37860, -35109, -31210, -2431, 32806, 28421, 32003, 20925, -8408, 20884, -1643, -13124, 8186, 48039, 41630, 42625, 14195, 21741, 65477, 28003, -16479, -20417, -15244, 8903, 6859, 14490, 17693, 4222, -5837, -35840, -27704, -18355, 4892, 49720, 55432, 45769, 44552, 37419, 9612, -6884, -8105, -32095, -18779, 24419]
$$ [...]
##END NTUPLES=NMR SPECTRUM
##END=
