##TITLE=Analysis number 327607
Compound Code cc 63014
Book Reference 528/8
Project Code adrs
Chemist Name davee
##JCAMPDX= 6.0         $$ Bruker NMR JCAMP-DX V2.0
##DATA TYPE= NMR SPECTRUM
##DATA CLASS= NTUPLES
##ORIGIN= Bruker BioSpin GmbH
##OWNER= nmr
$$ XWIN-NMR		Version 3.5
$$ Tue Mar 27 16:13:15 2007 GMT Daylight Time (UT+1h)  MAYBRIDGE\nmr@NMR_250MHZ
##.OBSERVE FREQUENCY= 250.131544655141
##.OBSERVE NUCLEUS= ^1H
##.ACQUISITION MODE= SIMULTANEOUS (DQD)
##.ACQUISITION SCHEME= undefined
##.AVERAGES= 16
##.DIGITISER RES= 18
##SPECTROMETER/DATA SYSTEM= dpx250
##.PULSE SEQUENCE= zg30
##.SOLVENT NAME= CDCl3
##.SHIFT REFERENCE= (INTERNAL, CDCl3, 0, 16.4523)
##AUDIT TRAIL= $$ (NUMBER, WHEN, WHO, WHERE, WHAT)
$$ ##TITLE= Audit trail, XWIN-NMR		Version 3.5
$$ ##JCAMPDX= 5.01
$$ ##ORIGIN= Bruker BioSpin GmbH
$$ ##OWNER= nmr
$$ C:\u/data/dgb/nmr/ADRS/2340/pdata/1/auditp.txt
$$ ##AUDIT TRAIL=  $$ (NUMBER, WHEN, WHO, WHERE, WHAT)
(   1,<2007-03-27 16:12:48.64 +100>,<MAYBRIDGE\nmr>,<NMR_250MHZ>,
      <created by zg, POWCHK disabled, PULCHK disabled
       configuration hash MD5:
       49 4B E0 1D 92 C2 6B 37 9F E6 65 BC 52 41 86 1D
       data hash MD5: 64K
       45 36 72 01 7C 84 2F 39 1E 6D 87 53 87 03 A4 CD>)
(   2,<2007-03-27 16:13:04.97 +100>,<MAYBRIDGE\nmr>,<NMR_250MHZ>,
      <Start of raw data processing
       ef LB = 0.3 FT_mod = 6 PKNL = 1 SI = 32K 
       data hash MD5: 32K
       1C 1C F8 6E 68 5A 86 68 E7 3A 24 48 C2 00 4F 6C>)
(   3,<2007-03-27 16:13:06.91 +100>,<MAYBRIDGE\nmr>,<NMR_250MHZ>,
      <apk 
       data hash MD5: 32K
       09 CB 2D DE 09 B0 CE 52 E9 FD 42 E9 DA AD 81 D1>)
(   4,<2007-03-27 16:13:07.61 +100>,<MAYBRIDGE\nmr>,<NMR_250MHZ>,
      <abs ABSG = 5 
       data hash MD5: 32K
       F7 B8 E3 56 7B 83 3E D0 36 7D 1D DF 83 D8 F9 C4>)
$$ ##END=
$$ 
$$ hash MD5
$$ F5 45 E1 D6 64 F7 FA CF 24 DE 11 D3 20 12 BF C0
##$RELAX= 
##$RELAX= 
##$RELAX= 
##$RELAX= 
##$RELAX= 
##$RELAX= 
##$RELAX= 
$$ Bruker specific parameters
$$ --------------------------
##$DU= <C:\u>
##$EXPNO= 2340
##$NAME= <ADRS>
##$PROCNO= 1
##$TYPE= <nmr>
##$USER= <dgb>
##$AMP= (0..31)
100 100 100 100 100 100 100 100 100 100 100 100 100 100 100 100 100 100 
100 100 100 100 100 100 100 100 100 100 100 100 100 100 
##$AQSEQ= 0
##$AQ_mod= 3
##$AUNM= <au_zg>
##$AUTOPOS= <55 >
##$BF1= 250.13
##$BF2= 250.13
##$BF3= 250.13
##$BF4= 250.13
##$BF5= 500.13
##$BF6= 500.13
##$BF7= 500.13
##$BF8= 500.13
##$BYTORDA= 1
##$CFDGTYP= 0
##$CFRGTYP= 5
##$CHEMSTR= <none>
##$CNST= (0..31)
1 1 145 1 1 1 1 1 1 1 1 1 1 1 1 1 1 1 1 1 1 1 1 1 1 1 1 1 1 1 1 1 
##$CPDPRG= <>
##$CPDPRG1= <>
##$CPDPRG2= <>
##$CPDPRG3= <>
##$CPDPRG4= <mlev>
##$CPDPRG5= <mlev>
##$CPDPRG6= <mlev>
##$CPDPRG7= <mlev>
##$CPDPRG8= <mlev>
##$CPDPRGB= <>
##$CPDPRGT= <>
##$D= (0..31)
0 1 0 0 0 0 0 0 0 0.06 0 0 0 0 0 0 0.0002 0 0 0 0 0 0 0 0 0 0 0 0 0 0 
0 
##$DATE= 1175008367
##$DBL= (0..7)
120 120 120 120 120 120 120 120 
##$DBP= (0..7)
150 150 150 150 150 150 150 150 
##$DBP07= 0
##$DBPNAM0= <>
##$DBPNAM1= <>
$$ [...]
##$SUBNAM7= <"">
##$SUBNAM8= <"">
##$SUBNAM9= <"">
##$SW= 20.6930455092707
##$SWIBOX= (0..15)
0 0 3 0 0 0 0 0 0 0 0 0 0 0 0 0 
##$SW_h= 5175.983436853
##$TD= 65536
##$TD0= 1
##$TE= 683.16
##$TE2= 300
##$TE3= 300
##$TEG= 300
##$TL= (0..7)
0 120 120 120 120 120 120 120 
##$TP= (0..7)
150 150 150 150 150 150 150 150 
##$TP07= 0
##$TPNAME0= <>
##$TPNAME1= <>
##$TPNAME2= <>
##$TPNAME3= <>
##$TPNAME4= <>
##$TPNAME5= <>
##$TPNAME6= <>
##$TPNAME7= <>
##$TPOAL= (0..7)
0.5 0.5 0.5 0.5 0.5 0.5 0.5 0.5 
##$TPOFFS= (0..7)
0 0 0 0 0 0 0 0 
##$TUNHIN= 0
##$TUNHOUT= 0
##$TUNXOUT= 0
##$USERA1= <user>
##$USERA2= <user>
##$USERA3= <user>
##$USERA4= <user>
##$USERA5= <user>
##$V9= 5
##$VALIST= <valist>
##$VCLIST= <CCCCCCCCCCCCCCC>
##$VD= 0
##$VDLIST= <DDDDDDDDDDDDDDD>
##$VPLIST= <PPPPPPPPPPPPPPP>
##$VTLIST= <TTTTTTTTTTTTTTT>
##$WBST= 1024
##$WBSW= 4
##$XGAIN= (0..3)
0 0 0 0 
##$XL= 0
##$YL= 0
##$YMAX_a= 301382
##$YMIN_a= -362751
##$ZGOPTNS= <>
##$ZL1= 120
##$ZL2= 120
##$ZL3= 120
##$ZL4= 120
##$ABSF1= 16.45234
##$ABSF2= -4.240833
##$ABSG= 5
##$ABSL= 3
##$ALPHA= 0
##$AQORDER= 0
##$ASSFAC= 0
##$ASSFACI= 0
##$ASSFACX= 0
##$ASSWID= 0
##$AUNMP= <proc_1d>
##$AZFE= 0.1
##$AZFW= 0.1
##$BCFW= 0
##$BC_mod= 0
##$BYTORDP= 0
##$COROFFS= 0
##$CY= 12.5
##$DATMOD= 1
##$DC= 0
##$DFILT= <>
##$DTYPP= 0
##$F1P= 14.0000005364418
##$F2P= -0.99999901652339
##$FCOR= 0.5
##$FTSIZE= 32768
##$FT_mod= 6
##$GAMMA= 0
##$GB= 0
##$INTBC= 1
##$INTSCL= 1
##$ISEN= 128
##$LB= 0.3
##$LEV0= 0
##$LPBIN= 0
##$MAXI= 10000
##$MC2= 0
##$MEAN= 0
##$ME_mod= 0
##$MI= 0
##$NCOEF= 0
##$NC_proc= -3
##$NLEV= 6
##$NOISF1= 0
##$NOISF2= 0
##$NSP= 0
##$NTH_PI= 0
##$NZP= 0
##$OFFSET= 16.45234
##$PC= 1
##$PHC0= 228.3541
##$PHC1= 5.655458
##$PH_mod= 1
##$PKNL= yes
##$PPARMOD= 0
##$PSCAL= 4
##$PSIGN= 0
##$REVERSE= no
##$SF= 250.130017422059
##$SI= 32768
##$SIGF1= 0
##$SIGF2= 0
##$SINO= 400
##$SIOLD= 32768
##$SREGLST= <1H.CDCl3>
##$SSB= 0
##$STSI= 32768
##$STSR= 0
##$SW_p= 5175.98343685301
##$SYMM= 0
##$S_DEV= 0
##$TDeff= 65536
##$TDoff= 0
##$TI= <Analysis number 999999
Compound Code 99
Book Reference 9
Project Code 9>
##$TILT= no
##$TM1= 0
##$TM2= 0
##$TOPLEV= 0
##$USERP1= <user>
##$USERP2= <user>
##$USERP3= <user>
##$USERP4= <user>
##$USERP5= <user>
##$WDW= 1
##$XDIM= 32768
##$YMAX_p= 411289099
##$YMIN_p= -131657
$$ End of Bruker specific parameters
$$ ---------------------------------
##NTUPLES= NMR SPECTRUM
##VAR_NAME=  FREQUENCY,     SPECTRUM/REAL,   SPECTRUM/IMAG
##SYMBOL=    X,             R,               I
##VAR_TYPE=  INDEPENDENT,   DEPENDENT,       DEPENDENT
##VAR_FORM=  AFFN,          ASDF,            ASDF
##VAR_DIM=   32768,         32768,           32768
##UNITS=     HZ,            ARBITRARY UNITS, ARBITRARY UNITS
##FACTOR=    0.157963299565203, 1,           1
##FIRST=     4115.22388381685, 0,            0
##LAST=      -1060.75955303616, 0,           0
##MIN=       -1060.75955303616, -131657,     0
##MAX=       4115.22388381685, 411289099,    0
$$ Real data points
##PAGE= N=1
##DATA TABLE= (X++(R..R)), XYDATA
$$ [...]
17321A33381L5084J9548l044N0888J8010j6763j3534j6809k922n736L412K8770
$$ 133381 168465 188013 184969 235857 253867 237104 223570 206761 203839 198103 201515 230285
17309B30285L2935K7865l070O841K8362N862k7352k2433K7733j8245j5537m925
$$ 230285 263220 291085 288015 294856 323218 329080 301728 279295 307028 288783 273246 268321
17297B68321K0213J4606q281k8985k0439k0924q088R663J9315J5148J6513M1487
$$ 268321 288534 303140 294859 265874 245435 224511 216423 226086 245401 260549 277062 318549
17285C18549j535k4037q997r220r963j8872K3485P686l93K3106L1446M1012M046
$$ 318549 317014 292977 283980 274760 264797 245925 269410 277096 276703 299809 331255 372267 376313
17272C76313j0404j1891k5856M591n600K761K7922m206n2639l4103M432P310K9833
$$ 376313 365909 354018 328162 332753 327153 329914 357836 353630 300991 266888 271320 278630 308463
17259C08463M3577K5657m4601n6385M82K2384J4089j3778M0418K0639M146j5339
$$ 308463 352040 377697 333096 276711 277193 299577 313666 299888 340306 360945 365091 349752
17247C49752m4752J6189K6253L9745J24P218o84K5232M7010K035J8450M5353J4592
$$ 349752 305000 321189 347442 387187 387311 394529 393845 419077 466087 468122 486572 531925 546517
17234E46517K8571j3133q937K639o563L2116O2447K3139K6958L439M4156N7194
$$ 546517 575088 561955 553018 555657 549094 581210 643657 666796 693754 697193 741349 798543
17222G98543N9195P5374L2011J0544K6259m163K7680j4132m5216l9836J5980L3668
$$ 798543 857738 933112 965123 975667 1001926 997763 1025443 1011311 966095 926259 942239 975907
17210I75907N7327L5403K5206o504O1653M1728K6184O9813L9299L6282R6891R3772
$$ 975907 1033234 1068637 1093843 1087339 1148992 1190720 1216904 1286717 1326016 1362298 1459189 1552961
17198A552961J34850J17243J41903J88599K31163K78292L61304M65317O68045
$$ 1552961 1687811 1805054 1946957 2135556 2366719 2645011 3006315 3471632 4139677
17189D139677J076995J683582K253704J718418M18267n0004K74467J385821L258605
$$ 4139677 5216672 6900254 9153958 10872376 11290643 11240639 11515106 12900927 16159532
17180A6159532N693249O439049L258396N65547p43761k065657j194099J466351
$$ 16159532 21852781 28291830 31550226 32115773 31372012 29306355 28112256 29578607
17172B9578607M913807Q140337Q830069K432764m288248p171792p026958l926253
$$ 29578607 34492414 42632751 51462820 53895584 49607336 42435544 35408586 31482333
17164C1482333J08295L066243L869275K821130k365090o719070p022120n672544
$$ 31482333 31590628 34656871 38526146 41347276 38982186 32263116 25240996 19568452
17156A9568452l325583r08498N98823k069j873338k716651k652974k099831j428962
$$ 19568452 16242869 15334371 15933194 15931125 14057787 11341136 8688162 6588331 5159369
17147E159369r16465o47850m45406k96791k41732k24890j73667j13748r8460o9974
$$ 5159369 4242904 3595054 3149648 2852857 2611125 2386235 2212568 2098820 2000360 1930386
17137A930386j3815P0354J64771J96498K01746R4285j16917j92247j91859j69862
$$ 1930386 1916571 1986925 2151696 2348194 2549940 2644225 2527308 2335061 2143202 1973340
17127A973340j13649K7364J53737K26899L23378K05699j4579r6024j4156K9951
$$ 1973340 1859691 1887055 2040792 2267691 2591069 2796768 2782189 2686165 2672009 2701960
17117B701960q7605j78927j83568j44014q1746K5802J29902J70779J12981N5099
$$ 2701960 2614355 2435428 2251860 2107846 2026100 2051902 2181804 2352583 2465564 2520663
17107B520663J9644r154M7696J14174J51700K03703J85084J72661K91704K94928
$$ 2520663 2540307 2531153 2578849 2693023 2844723 3048426 3233510 3406171 3697875 3992803
17097C992803K61609L35401M12297N57844O48092O84255P53252R78105J270515
$$ 3992803 4254412 4589813 5002110 5559954 6208046 6892301 7645553 8623658 9894173
17088I894173J710522K354908L404181N148654Q247469J3786635K2611718L3235444
$$ 9894173 11604695 13959603 17363784 22512438 30759907 44546542 67158260 100393704
17080A00393704L9615573K3256707j0755216k8445555k9132048k0864100p566285
$$ 100393704 140009277 163265984 152510768 124065213 94933165 74069065 66502780
17073F6502780O730043K1901091L1285237J5054091j3431466k7037964k9170446
$$ 66502780 73232823 95133914 126419151 141473242 128041776 101003812 71833366
17066G1833366k3486645j5281248r134630n549441l607272k499260j928045j560175
$$ 71833366 48346721 33065473 23930843 18381402 14774130 12274870 10346825 8786650
17058H786650j258113r92702p85052o75443o05715n14339l72777k69263k80272
$$ 8786650 7528537 6535835 5750783 5075340 4469625 3955286 3582509 3313246 3032974
17049C032974k48097k16837k02846j88793j74982j72165j60367j58983j36330
$$ 3032974 2784877 2568040 2365194 2176401 2001419 1829254 1668887 1509904 1373574
17040A373574q4497p9764r7916o4187m7392o3160o3884l3210J2391j0641o755
$$ 1373574 1289077 1209313 1111397 1047210 999818 936658 872774 839564 851955 841314 834559
17029H34559J8957P4184L6026q2142j09433r8550r1081j02354o7033l0751O0598
$$ 834559 853516 927700 963726 881584 772151 673601 582520 480166 413133 382382 442980
17018D42980P5814N1763j5676m6906j10192q8508l9274k1350j4366j6346N674
$$ 442980 518794 570557 554881 507975 397783 309275 270001 248651 234285 217939 223613
17007B23613L880K6068j728k9068m8852k3498l2737Q599k0671k4082K8663J0607
$$ 223613 227493 253561 251833 222765 173913 150415 117678 126277 105606 81524 110187 120794
16995A20794o488L663k6976m2480j2404j4476m421n916p069K2034k1038O566J0783
$$ 120794 114306 117969 90993 48513 36109 21633 17212 11296 4227 26261 5223 11789 22572
16982B2572j3204K0142j7349K8997M0568k2921j1149L0858k8097p340l679l49
$$ 22572 9368 29510 12161 41158 81726 58805 47656 78514 50417 43077 39398 39049
16970C9049N386k4748m228K1554P947K0457M6137k936k7133j6874P163J3044J3535
$$ 39049 44435 19687 15459 37013 44960 65417 111554 108618 81485 64611 71774 84818 98353
16957I8353O650p803m6529k4985K3069j1223k1550L6656L9057l9617l7271k4478
$$ 98353 105003 97200 50671 25686 48755 37532 15982 52638 91695 52078 14807 -9671
16945i671N357j5009p239j2326k7535Q417M0990r836J3877K8945L4170m817M21
$$ -9671 -4314 -19323 -26562 -38888 -66423 -58006 -17016 -26852 -12975 15970 50140 45323 45744
16932D5744k0064j1298q807L6689M0664q020L2725J3845l6342m521j9997j8484
$$ 45744 25680 14382 5575 42264 82928 74908 107633 121478 85136 80615 60618 42134
16920D2134R066N1750M6508k4565m2168l3082J3716q0Q896K5753k1932j6792k242
$$ 42134 51200 102950 149458 124893 82725 49643 63359 63279 72175 97928 75996 59204 56962
16907E6962p51p897j4096l280J0760L510J1331j1504k1986L036q238p871K4122
$$ 56962 56211 48314 34218 30938 41698 45208 56539 45035 23049 26085 17847 9976 34098
16894C4098P631K806l3193j2602N5602L4617K7727k773J8537J2385l9885J6308
$$ 34098 41729 44535 11342 -1260 54342 88959 116686 113913 132450 144835 104950 121258
16882A21258K463j3978m2617j6155j5905j7462M8748J8668k4306k6000j9734q704
$$ 121258 123721 109743 67126 50971 35066 17604 66352 85020 60714 34714 14980 6276
16870F276K0212J6324m72j7761J68J3694k4193J3664O431q130J481J5120j2249
$$ 6276 26488 42812 42340 24579 24747 38441 14248 27912 34343 26213 27694 42814 30565
16857C0565l5068l5193N214J8932K339k6709J1116L6161N116k9055o016k0626
$$ 30565 -4503 -39696 -34482 -15550 -13211 -39920 -28804 7357 12473 -16582 -22598 -43224
16845d3224L8330M5830J6866j9330K681K7355j9251k7679k0542j5716M456L3160
$$ -43224 -4894 40936 57802 38472 41153 68508 49257 21578 1036 -14680 -10224 22936
16833B2936J6456k5254p717M799N775J4682N445m727l0480M081k0757J0259L581
$$ 22936 39392 14138 6421 11220 16995 31677 37122 32395 1915 5996 -14761 -4502 -921
16820i21M806r239j0896k3576j7894J7385j5572j673L5071j0462P005k3612K0910
$$ -921 3885 -5354 -16250 -39826 -57720 -40335 -55907 -57580 -22509 -32971 -25966 -49578 -28668
16807b8668L2981K51L7251o91l7039q663J0452K5820k4116r323j7862j5588R553
$$ -28668 4313 4564 41815 41124 4085 -4578 5874 31694 7578 -1745 -19607 -35195 -25642
16794b5642J3573J2408J1792j9466k5093Q0207K1882l2351j1720m833j5736P260
$$ -25642 -12069 339 12131 -7335 -32428 47779 69661 37310 25590 20757 5021 12281
16782A2281k7810k3594j0627J5277j7556q967J9872j84l333o080j3220j6628J1980
$$ 12281 -15529 -39123 -49750 -34473 -52029 -60996 -41124 -41308 -44641 -50721 -63941 -80569 -68589
16769f8589Q107J4062L3455j882k888J3512P801j6531p434k834o733K2017L5743
$$ -68589 -60482 -46420 -12965 -14847 -17735 -4223 3578 -12953 -20387 -23221 -29954 -7937 27806
16756B7806K9562J5729l1723k4580l7080j5440L9169k1746L0536q903j3395L0445
$$ 27806 57368 73097 41374 16794 -20286 -35726 3443 -18303 12233 3330 -10065 20380
16744B0380R595k4238K929j4643p85O037N857j9895j2546O184J0640j9293M341
$$ 20380 29975 5737 8666 -5977 -6762 -725 5132 -14763 -27309 -21125 -10485 -29778 -25437
16731b5437r245r327J7057K6669N170j2240M897j6641l5322n237O3093J6575k0141
$$ -25437 -34682 -44009 -26952 -283 4887 -7353 -2456 -19097 -54419 -59656 3437 20012 -129
16718a29k4128k4884l37j1709R468O877L0732L476k365L2871K0011j8803k3070
$$ -129 -24257 -49141 -49478 -61187 -51719 -44842 -14110 -10634 -12999 19872 39883 21080 -1990
16705a990j2069j1255k3062p163r245R518J8901L600J74O000M4291K0000P814
$$ -1990 -14059 -25314 -48376 -55539 -64784 -55266 -36365 -32765 -32591 -26591 17700 37700 45514
16692D5514p194l3615K1472N419l4893j6562M4499N3057k395j3527K5556M8979
$$ 45514 38320 4705 26177 31596 -3297 -19859 24640 77697 75302 61775 87331 136310
16680A36310L5317L3233J0098Q454Q06k3145J3334P716J1695m479N051L7136j1323
$$ 136310 171627 204860 214958 223412 224218 201073 214407 222123 233818 229339 234390 271526 260203
16667B60203j7598M326m261k7137J9490J074l44N0565j849n2421l8198j1760m7400
$$ 260203 242605 246931 242670 215533 235023 236097 235753 286318 284469 232048 193850 182090 134690
16654A34690n7681k8525R015k3714m1810j0396J5794P746k2748j000l3644o700
$$ 134690 77009 48484 57499 33785 -8025 -18421 -2627 5119 -17629 -18629 -52273 -58973
16642e8973J1148m342k4971r215N758k594L186L5331R590J7315p552J3434K0091
$$ -58973 -47825 -52167 -77138 -86353 -80595 -83189 -80003 -44672 -35082 -17767 -25319 -11885 8206
16629H206J2083J5446M610N868k9275k8742k2998j548J828Q622J6478J5085q631
$$ 8206 20289 35735 40345 46213 16938 -11804 -34802 -36350 -34522 -25900 -9422 5663 -2968
16616b968J2105J7524J138L286K9434K3583L2305L1337n465j9622j6356j5628
$$ -2968 9137 26661 27799 31085 60519 84102 116407 147744 142279 122657 106301 90673
16604I0673j9175K4880K4689J2343k8128k6056m393K771K8422M5303P7881N0548
$$ 90673 71498 96378 121067 133410 105282 79226 74833 77604 106026 151329 229210 279758
16592B79758L5633J5056J1323J402k2333o195n0543q6700n7045J1067l7191k8379
$$ 279758 315391 330447 341770 343172 320839 314644 264101 177401 120356 131423 94232 65853
16580F5853q013Q504j7504k4022J109J2325K8573k049r086j1930k399o318k1839
$$ 65853 57840 66344 48840 24818 25927 38252 66825 64776 55690 43760 41361 35043 13204
16567A3204m2160J2328P570j4317k79J9457K2076l303k5396Q386J8812K1009j3282
$$ 13204 -28956 -16628 -9058 -23375 -23654 -4197 17879 14576 -10820 -2434 16378 37387 24105
16554B4105J7877j6584M53k3222J2652L9972l625J3201J9289L5330p267R720K8846
$$ 24105 41982 25398 25851 2629 15281 55253 51628 64829 84118 119448 112181 121901 150747
16541A50747N3713N3320K5276l032j0124j8886j6456m0296n9632o7267k5233j5463
$$ 150747 204460 257780 283056 280024 269900 251014 234558 194262 134630 67363 42130 26667
16529B6667l6265R251L6186J5746k3696m5544R310k1460l95q449j0646N100J6044
$$ 26667 -9598 -347 35839 51585 27889 -17655 -8345 -29805 -30200 -38649 -49295 -44195 -28151
16516b8151l1726l0124N967M9524J1187k3193o481K9005K311k5201M3188N316
$$ -28151 -59877 -90001 -84034 -34510 -23323 -46516 -52997 -23992 -21681 -46882 -3694 1622
16504A622J3439K5592N954l2314k3453j3182q183l24J0922K6833k3985J5887Q477
$$ 1622 15061 40653 46607 14293 -9160 -22342 -30525 -30849 -19927 6906 -17079 -1192 7285
16491G285Q872Q769O924R395k9876L909j4496l1900o941O826L1035M080n557l1603
$$ 7285 16157 24926 31850 41245 11369 15278 782 -31118 -38059 -31233 -198 3882 -1675 -33278
16477c3278k3694k6959n502N011K0666q301J5707L9012M399k6366j0550k7257
$$ -33278 -56972 -83931 -89433 -84422 -63756 -72057 -56350 -17338 -12939 -39305 -49855 -77112
16465g7112N339K3690J997m4422J2442L3752j9236l686J3611K6052K2780j2508
$$ -77112 -71773 -48083 -46086 -90508 -78066 -44314 -63550 -67236 -53625 -27573 -4793 -17301
16453a7301k1201P894L336K1371j1227k9607K1159L0161j2531k8400j6127Q219
$$ -17301 -38502 -30608 -27272 -5901 -17128 -46735 -25576 4585 -7946 -36346 -52473 -44254
16441d4254Q394o425K2347J8332l2667j1854q680j7953O726j0347k839j0488Q117
$$ -44254 -35860 -42285 -19938 -1606 -34273 -46127 -54807 -72760 -66034 -76381 -79220 -89708 -81591
16428h1591L0986L4325j0065J8548j559R006J0758j5097J3091k2539l4433k1575
$$ -81591 -50605 -16280 -26345 -7797 -9356 -350 10408 -4689 8402 -14137 -48570 -70145
16416g0145P551J1512k3753j6024K1303K6773J7209K3413k0414k2581l6561Q839
$$ -70145 -62594 -51082 -74835 -90859 -69556 -42783 -25574 -2161 -22575 -45156 -81717 -72878
16404g2878K171m242m531J9422L0335j0206l0917K0991J0656j0980O540L7735
$$ -72878 -70707 -74949 -79480 -60058 -29723 -39929 -70846 -49855 -39199 -50179 -43639 -5904
16392e904K5690j0455l3382k0706K8754M4163j3640m2205j6752K529j495L3027
$$ -5904 19786 9331 -24051 -44757 -16003 28160 14520 -27685 -44437 -41908 -43403 -10376
16380a0376j136J5416j2311L5024K5694m065L7648K0492K0446q862n2620k3501
$$ -10376 -11512 3904 -8407 26617 52311 48246 85894 106386 126832 117970 65350 41849
16368D1849J551j0708o346M19M6625J7096q734j7934J4675P614M6159M0226j8593
$$ 41849 43400 32692 26346 26765 73390 90486 81752 63818 78493 86107 132266 172492 153899
16355A53899l8868m7239l4615m125L4067N4860k7873l8159r527J3720J5953j1133
$$ 153899 115031 67792 33177 29052 63119 117979 90106 51947 42420 56140 72093 60960
16343F0960L020l0422Q2n9221j9860j6919k47J1037Q247L9158K5003j6341l9655
$$ 60960 63980 33558 33640 -25581 -45441 -62360 -62607 -51570 -43323 -4165 20838 4497 -35158
16330c5158j9998Q364k946L7557j2931J7140j4448k3741M861j1289n557J3956
$$ -35158 -55156 -46792 -49738 -12181 -25112 -7972 -22420 -46161 -41300 -52589 -58146 -44190
16318d4190k5097P150q055K8044J2782q165k5341j7320L0543N3671M472m562j0546
$$ -44190 -69287 -62137 -70192 -42148 -29366 -37531 -62872 -80192 -49649 4022 8494 3932 -6614
16305f614j2352J4543q455K1565K3377K0024l8394l0103k1467k4754q614J2940
$$ -6614 -18966 -4423 -12878 8687 32064 52088 13694 -16409 -37876 -62630 -71244 -58304
16293e8304l9432l179L611L310M46P175L930K0286J9145L9427J0560j2966K156
$$ -58304 -97736 -100915 -97304 -93994 -93548 -86373 -82443 -62157 -43012 -3585 6975 -5991 -3835
16280c835K4550J4485k6062j9641J3121k0227P833k3010m487M2705M2928K0440
$$ -3835 20715 35200 9138 -10503 2618 -17609 -9776 -32786 -37273 5432 48360 68800
16268F8800p1865o1706j3394L2324M8289k3885l3006k67r328K8497R683k5091
$$ 68800 -3065 -64771 -78165 -45841 2448 -21437 -54443 -54710 -64038 -35541 -25858 -50949
16256e0949K3260K429J7113o487p586j7819K3945L3868j9462m1279K981M415O137
$$ -50949 -27689 -25260 -8147 -14634 -22220 -40039 -16094 17774 -1688 -42967 -39986 -35571 -29434
16243b9434k0097j28K452n670M676o649j2951N101J5870J5861K5399n596J4077
$$ -29434 -49531 -49659 -47207 -52877 -48201 -54850 -67801 -62700 -46830 -30969 -5570 -11166 2911
16230B911p114J5600n1477L963L8145K651J209K571k4992J0739K2352J1602j233
$$ 2911 -4203 11397 -40080 -36117 2028 4679 5888 8459 -16533 -5794 16558 28160 26927
16217B6927J4737j6774j3827k2437k7721M179l0744m1873k304K9306p130k33L9667
$$ 26927 41664 24890 11063 -11374 -39095 -34916 -65660 -107533 -109837 -80531 -87661 -87894 -48227
16204d8227J2073j7365r31M1019j1506o5173O63J2202K3126Q292Q21J2434j5220
$$ -48227 -36154 -53519 -54450 -13431 -24937 -90110 -89447 -77245 -54119 -45827 -45006 -32572 -47792
16191d7792j4713k299l47P54K6277K2434J6413k7185n011j464O75M3837O341m7394
$$ -47792 -62505 -64804 -65151 -64397 -38120 -15686 727 -26458 -31469 -32933 -32258 11579 17920 -29474
16177b9474Q506o284J0033K0623K5018N072n6416l9817l686Q330L3716N330n0193
$$ -29474 -20968 -27252 -17219 3404 28422 33494 -22922 -62739 -66425 -58095 -24379 -19049 -69242
16164f9242j0049k2979k0225m68M6781N5791j2589K2462K777j9964j0634J0123
$$ -69242 -79291 -102270 -122495 -122963 -76182 -20391 -32980 -10518 -7741 -27705 -38339 -28216
16152b8216J4977n828o307j7353j4269J8283L1499J2119k4162j5131q34L4513
$$ -28216 -13239 -19067 -25374 -42727 -56996 -38713 -7214 4905 -19257 -34388 -35222 -709
16140g09k4623k8329o825K8070K1331K372K3908j1869r928k0050K0352M04j8885
$$ -709 -25332 -53661 -60486 -32416 -11085 -8713 15195 3326 -6602 -26652 -6300 -5896 -24781
16127b4781j5286j6908j70L8152R306j9733n651L6131k762j2598n0818k6099M7248
$$ -24781 -40067 -56975 -57145 -18993 -9687 -29420 -35071 1060 -1702 -14300 -65118 -91217 -43969
16114d3969K9553L1547J709K3589k1131k4082k0386p264k4902J1735M3386L6337
$$ -43969 -14416 17131 18840 42429 21298 -2784 -23170 -30434 -55336 -43601 -215 36122
16102C6122j5574k1575q299k8153j8426J0708L2931J9680L5595J0979J2502J8060
$$ 36122 20548 -1027 -9326 -37479 -55905 -45197 -12266 7414 43009 53988 66490 84550
16090H4550K4140M5876M3116N04j1521j0049J7826k8285o015j4239j8558j3487
$$ 84550 108690 154566 197682 198186 186665 176616 194442 166157 160142 145903 127345 113858
16078A13858K353P756J8931L9543J2059K1495l2832l1616p088j216l6335l8661
$$ 113858 116211 123967 142898 182441 194500 215995 183163 151547 144459 143243 106908 68247
16066F8247j5868m174P875r360M393j8107m5611m916M054m3139l6896K4780L2325
$$ 68247 52379 48205 56080 46720 51113 33006 -12605 -17521 -13467 -56606 -93502 -68722 -36397
16053c6397P133J6121K3310j1087L890J3398k3102j8441j7686J4155J1387J2382
$$ -36397 -29264 -13143 10167 -920 2970 16368 -6734 -25175 -42861 -28706 -17319 -4937
16041d937R379R056k4761m2647j6714j3182j251J1971J2411p34M058K4892J7585
$$ -4937 4442 13498 -11263 -53910 -70624 -83806 -85057 -73086 -60675 -61409 -57351 -32459 -14874
16028a4874j0453P443M1833o725k5993k1140J5034j1811k8190K0197j3196j9821
$$ -14874 -25327 -17884 23949 17224 -8769 -29909 -14875 -26686 -54876 -34679 -47875 -67696
16016f7696J8041O227M5877l673L435J4924p79L8202l821k4873N815J531r593
$$ -67696 -49655 -43428 2449 -1224 2211 17135 16356 54558 50737 25864 31679 33210 23617
16003B3617j8051L10p68p213j4324k6379K617K5832L3136J3508l1646l7802j889
$$ 23617 5566 5876 5108 -2105 -16429 -42808 -40191 -14359 18777 32285 639 -37163 -39052
15990c9052M329K2750n410Q303K7693j1566j6295k6010j8597J3427J8052O809
$$ -39052 -34723 -11973 -17383 -9080 18613 7047 -9248 -35258 -53855 -40428 -22376 -15567
15978a5567k4453N084M5061L1360l0605m0893k5465m364L1300k1635J2983M681
$$ -15567 -40020 -34936 10125 41485 10880 -30013 -55478 -59842 -28542 -50177 -37194 -32513
15966c2513k6891M312J3408L993k2405J3403j0927R310J9922L1632K2021j4427
$$ -32513 -59404 -55092 -41684 -37691 -60096 -46693 -57620 -48310 -28388 3244 25265 10838
15954A0838M61J3533l443o054l5721o987J4177K48k2639k5669K263Q790R404L1074
$$ 10838 11299 24832 21389 15335 -20386 -27373 -13196 -12948 -35587 -61256 -58993 -50203 -40799 -9725
15940i725K289Q430J3435q518L0042J149j960j1320j1710j6977n876K934J6970
$$ -9725 -7436 994 14429 5911 35953 37102 35142 23822 12112 -4865 -10741 -7807 9163
15927I163L517l1939K3520n12M771P965j8830l9555j0150L990K2284L3556k4515
$$ 9163 12680 -19259 4261 3749 8520 16485 -2345 -41900 -52050 -48060 -25776 7780 -16735
15914a6735k390l9722l0695O489J1689J9293M2078K0378k068j0713k0901J0124
$$ -16735 -19125 -58847 -89542 -83053 -71364 -52071 -9993 10385 8317 -2396 -23297 -13173
15902a3173N514J792j8383K0401M6501K186l9016l2521j6037J9690m042j0543
$$ -13173 -7659 -5867 -24250 -3849 42652 44838 5822 -26699 -42736 -23046 -27088 -37631
15890c7631n890j2668k5394l516j3148J9580M1578J5413q059K2615k583j0066
$$ -37631 -43521 -56189 -81583 -85099 -98247 -78667 -37089 -21676 -29735 -7120 -9703 -19769
15878a9769j6639o772j0835L530L466L888L6403k8640j8323p817K5686L0251r583
$$ -19769 -36408 -43180 -54015 -50485 -47019 -43131 -6728 -35368 -53691 -61508 -35822 -5571 -15154
15865a5154N19J3016M755L105J1576K319q375l3214k4555m699L518L2063J431
$$ -15154 -14635 -1619 3136 6241 17817 20136 11761 -21453 -46008 -50707 -47189 -15126 -13695
15852a3695l4942R554M1882O305j8066l7815R24l853o169R016L1331J1836L747
$$ -13695 -48637 -39083 2799 9104 -8962 -46777 -45853 -49706 -55875 -46859 -15528 -3692 55
15839E5K4695J373j2790m4322M714L0943K3200k9344J3132K8964j4048m2422j487
$$ 55 24750 26123 13333 -30989 -26275 4668 27868 -1476 11656 40620 26572 -15850 -17337
15826a7337K398k0000l2653l5263M698M4469J5540j1902k7439j4836J6831M704
$$ -17337 -14939 -34939 -67592 -102855 -98157 -53688 -38148 -50050 -77489 -92325 -75494 -70790
15814g0790M2968K4546n090k6978j9659J5689k106l610J3024K5527j4478o1309
$$ -70790 -27822 -3276 -8366 -35344 -55003 -39314 -41420 -45030 -32006 -6479 -20957 -82266
15802h2266p814R24J3067K2391K6920K0358K1425J688l4715m2803K6671m368m534
$$ -82266 -90080 -89156 -76089 -53698 -26778 -6420 15005 16693 -18022 -60825 -34154 -38522 -43056
15789d3056k4257j1975L2318J1342J6046q852k8083r456K3044R337K6139K1542
$$ -43056 -67313 -79288 -46970 -35628 -19582 -28434 -56517 -65973 -42929 -33592 -7453 14089
15777A4089j8202l5889K7372K6434O891l07j5346m921R53l6157q304J6794L016
$$ 14089 -4113 -40002 -12630 13804 20695 20388 5042 121 1074 -35083 -43387 -26593 -23577
15764b3577J0519J6974j4457R13k5474j8551K0745J736J5068k510j3007K4847
$$ -23577 -13058 3916 -10541 -9628 -35102 -53653 -32908 -31172 -16104 -18614 -31621 -6774
15752f774k9399k1144R123L1943R624M802J1591l0082j9311J4448m676J6957k4016
$$ -6774 -36173 -57317 -48194 -16251 -6627 -1825 9766 -20316 -39627 -25179 -29855 -12898 -36914
15739c6914j2068J4338L5465J0282m4794l9130J6492L3783P368n956m155j2256
$$ -36914 -48982 -34644 821 11103 -33691 -72821 -56329 -22546 -15178 -21134 -25289 -37545
15727c7545j1106L592j1383K8956L3721K2003k367R590l7731j7744j3244M964
$$ -37545 -48651 -45059 -56442 -27486 6235 28238 25871 35461 -2270 -20014 -33258 -28294
15715b8294J2141j5301o702J8864J1515j7804R521K2765L239K0198K9390l227
$$ -28294 -16153 -31454 -38156 -19292 -7777 -25581 -16060 6705 9944 30142 59532 56305
15703E6305n38O047m9072m0377K872p116N146J1775K5637K4104k1493l5425Q631
$$ 56305 55767 61814 12742 -27635 -24763 -31879 -26733 -14958 10679 34783 13290 -22135 -13504
15690a3504L1858j6737r504K3038k5881K232N097p835l4242k9593Q241K935K051
$$ -13504 18354 1617 -7887 15151 -10730 -8498 -3401 -11236 -45478 -75071 -66830 -63895 -61844
15677f1844j0003K8858J0440j287k5047j844M2916L268m0694j4469K3183K3106
$$ -61844 -71847 -42989 -32549 -33836 -58883 -60727 -17811 -14543 -55237 -69706 -46523 -23417
15665b3417J4683R660J2116l0683m861J9972J2336j9288k3321k101k0825J9874
$$ -23417 -8734 926 13042 -17641 -22502 -2530 9806 -9482 -32803 -34904 -55729 -35855
15653c5855J7154j143K8565R160j494K521k6433j1585P044R001l041j5779K1593
$$ -35855 -18701 -19844 8721 17881 16387 18908 -7525 -19110 -12066 -3065 -6106 -21885 -292
15640b92J9908l461l6819L189K7757j0199M677p745l3746k1228k6269k1131L252
$$ -292 19616 16155 -20664 -17475 10282 83 4760 -2985 -36731 -57959 -84228 -105359 -102107
15627a02107M0175J4449l2231m306J7763L8210L4628p048j9777R503l59r221K7930
$$ -102107 -61932 -47483 -79714 -84020 -66257 -28047 6581 -467 -20244 -10741 -11100 -20321 7609
15614G609l82j1637j8249M2248r131j5969n526q364L67j7117j7563j8632K3893
$$ 7609 7227 -4410 -22659 19589 10458 -5511 -11037 -19401 -19034 -36151 -53714 -72346 -48453
15601d8453M5880L3479k2346k7061j0863R718J9530N472j4419l727K0843J5696
$$ -48453 -2573 30906 8560 -18501 -29364 -19646 -116 5356 -9063 -12790 8053 23749
15589B3749k8741m5891k323K135J1540M571J2987K5692M378k270M0320n88k3760
$$ 23749 -4992 -50883 -53206 -51071 -39531 -34960 -21973 3719 8097 5827 46147 45559 21799
15576B1799q528J0788K222J9344o367j102l9112k578J3807J1209j1977j3270n430
$$ 21799 13271 24059 26281 45625 39258 38156 -956 -3534 10273 21482 9505 -3765 -9195
15563i195o880K0123J4940k5513l0774k5704J3633p097K0957J2197J457L479P106
$$ -9195 -16075 4048 18988 -6525 -37299 -63003 -49370 -56467 -35510 -23313 -21856 -18377 -11271
15550a1271n736J4719p939m001j1079j1562K1233K1188j672j4344J3046k2144
$$ -11271 -17007 -2288 -10227 -14228 -25307 -36869 -15636 5552 3880 -10464 2582 -19562
15538a9562j9950K5124K9486K449k9874J3459o1j4526k3936N258J0167j56j099
$$ -19562 -39512 -14388 15098 17547 -12327 1132 1071 -13455 -37391 -32133 -21966 -22122 -23221
15525b3221K4081K5932l0832m5965K8267M7513K573j2511k0656j5500P044O894
$$ -23221 860 26792 -4040 -50005 -21738 25775 28348 15837 -4819 -20319 -13275 -6381
15513f381K9232q972k0051k3072J3815J9037R74l6444K4157P393p092J1320j844
$$ -6381 22851 13879 -6172 -29244 -15429 3608 4582 -31862 -7705 -312 -7404 3916 2072
15500B072K8022j0774m7906j9426L073J9354M6400L6j4859l5755k3379l320L0223
$$ 2072 30094 19320 -28586 -48012 -44939 -25585 20815 20851 5992 -29763 -53142 -56462 -26239
15487b6239L373J594l429j4230k1146J3568n352k7734r696J0642J554Q416L317
$$ -26239 -22866 -21272 -24701 -38931 -60077 -46509 -51861 -79595 -89291 -78649 -77095 -68679 -65362
15474f5362O289j4200N298L9250K8688L40n1992j4753J3803J7654J395k1469O852
$$ -65362 -59073 -73273 -67975 -28725 -37 303 -51689 -66442 -52639 -34985 -33590 -55059 -48207
15461d8207K2799J8467J3375j7609k6596j419K2764K2583J5981l1836o981J1155
$$ -48207 -25408 -6941 6434 -11175 -37771 -39190 -16426 6157 22138 -9698 -16679 -5524
15449e524R292J9107M5953K915j8443o6025j7305J4337K8847L341n874J5609j0721
$$ -5524 3768 22875 68828 71743 53300 -12725 -30030 -15693 13154 16495 10621 26230 15509
15436A5509p116n41k3716j3744L8283p830J1851K584j4166k0926P735L9878K1144
$$ 15509 8393 7852 -15864 -29608 8675 845 12696 15280 1114 -19812 -12077 27801 48945
15423D8945j4114k5745m3752p727K4486L7065j1858r243k9031K1590j2176J0997
$$ 48945 34831 9086 -34666 -42393 -17907 19158 7300 -1943 -30974 -9384 -21560 -10563
15411a0563Q090K3854M384k4780N697k1014l889k41k3019j711K2026P108j050
$$ -10563 -2473 21381 25765 985 6682 -14332 -18221 -18462 -41481 -43192 -21166 -14058 -15108
15398a5108j4961n798K2549K2443J6704K728L472k8365k1232k156j0171J2498
$$ -15108 -30069 -35867 -13318 9125 25829 28557 32029 3664 -17568 -19724 -29895 -17397
15386a7397j2791j6315m645L153m775j3328k9909k067j4162M5133K4647j1642
$$ -17397 -30188 -46503 -51148 -47995 -52770 -66098 -96007 -98074 -112236 -67103 -42456 -54098
15374e4098N653M6225K4305J0357k8407k5049J2024J9151L2944q723k198n517
$$ -54098 -48445 -2220 22085 32442 4035 -21014 -8990 10161 43105 34382 32184 26667
15362B6667J0205j5911o057l0668j568N798k9159j0268K6014L2396k3187l5304
$$ 26667 36872 20961 14904 -15764 -17332 -11534 -40693 -50961 -24947 7449 -15738 -51042
15350e1042L7362J1190k180m2055N634J3663J9238j2977k3959K5850K5240r211
$$ -51042 -13680 -2490 -4670 -46725 -41091 -27428 -8190 -21167 -45126 -19276 5964 -3247
15338c247m3409M61J1162L5897L0773k565l179k849j2213P605j9646n677M50k3265
$$ -3247 -46656 -46195 -35033 864 31637 29072 25893 23044 10831 18436 -1210 -6887 -6437 -29702
15324b9702K3907K5638L15j057o778j4761o338L5966k2750M122J2478r952l2609
$$ -29702 -5795 19843 20158 19101 12323 -2438 -8776 27190 4440 8562 21040 11088 -21521
15311b1521j6282K7285Q611m667J4685j1815J5623K3302l1067l2868J914j558
$$ -21521 -37803 -10518 -1907 -6574 8111 -3704 11919 35221 4154 -28714 -26800 -28358
15299b8358j5021j7397j2092o164K2279L8236R878l667q724l3261J1242K8656
$$ -28358 -43379 -60776 -72868 -79032 -56753 -18517 -8639 -12306 -21030 -54291 -43049 -14393
15287a4393J6625n6674j0625K2053K1225J7179K243k3039K3846r388j297o182
$$ -14393 2232 -54442 -65067 -43014 -21789 -4610 -2367 -25406 -1560 -10948 -12245 -18427
15275a8427J1083j596m6779J3567M9364M4344J9607k9007k3861P187N928j3368
$$ -18427 -7344 -8940 -55719 -42152 7212 51556 71163 42156 18295 25482 31410 18042
15263A8042l7080k4802M3161K8487l3180n1242j6638k9095M134L4834M2589J6482
$$ 18042 -19038 -43840 -679 27808 -5372 -56614 -73252 -102347 -98213 -63379 -20790 -4308
15251d308J0727j3612k2705L7652q472l0650K6271m368K511R396j1020k2580r234
$$ -4308 6419 -7193 -29898 7754 -718 -31368 -5097 -9465 -6954 2442 -8578 -31158 -40392
15238d0392J1181L562J0748K3415n428J2289J1904M167j4284k608k0983j5296
$$ -40392 -29211 -25649 -14901 8514 3086 15375 27279 31446 17162 14554 -6429 -21725
15226b1725M0235J6507l2279k4932K563K2565r175n697j2895q240l4J608k439
$$ -21725 18510 35017 2738 -22194 -19631 2934 -6241 -11938 -24833 -33073 -33107 -31499 -33938
15213c3938M1100L4650l186k0496o58l6259J9920R825m0124l4603k5189M0448
$$ -33938 7162 41812 38626 18130 17472 -18787 1133 10958 -29166 -63769 -88958 -48510
15201d8510M6189K0917J1510j121r720k2657J7505O411l0458K8235k6682j1815
$$ -48510 -2321 18596 30106 28985 19265 -3392 14113 20524 -9934 18301 -8381 -20196
15189b0196j2126P156J4511J2888k7553J8626j8690l2356N991K1834K8235M4417
$$ -20196 -32322 -25166 -10655 2233 -25320 -6694 -25384 -57740 -51749 -29915 -1680 42737
15177D2737N553k2057l9580J921N5284K151m0014k8270j3410j4512K1190K351
$$ 42737 48290 26233 -13347 -11426 43858 46009 5995 -22275 -35685 -50197 -29007 -26656
15165b6656j5771j1383R371J2523M4194J8369j9793O201J7435l1781R411o204
$$ -26656 -42427 -53810 -44439 -31916 12278 30647 10854 17055 34490 2709 12120 5916
15153E916j4738j1785k6651k4335K6490O9888K2970m0217o5230q514N1921K0643
$$ 5916 -8822 -20607 -47258 -71593 -45103 24785 47755 7538 -57692 -66206 -14285 6358
15141F358L508o376j6168j5245k870j628J4966L9123J711m182L29j9049j3153
$$ 6358 9866 3490 -12678 -27923 -30793 -32421 -17455 21668 23379 19197 19526 477 -12676
15128a2676J3761r182k3627J4872J4458K1777J3178k6123p692k1867J9764J3103
$$ -12676 1085 -8097 -31724 -16852 -2394 19383 32561 6438 -1254 -23121 -3357 9746
15116I746n193j5921Q716j388K7423K2778P07j270r344N802K1721o880k5525j8076
$$ 9746 4553 -11368 -2652 -4040 23383 46161 46868 45598 36254 42056 63777 56897 31372 13296
15102A3296J0193J0231j1004l118J4245L488l1470l8907K842J9568K364Q927J9901
$$ 13296 23489 33720 22716 19598 33843 37331 5861 -33046 -30204 -10636 -8272 655 20556
15089B0556j2060j8024J583q15J7746M1637M688j5682n122O833M498j2824j3132
$$ 20556 8496 -9528 -7945 -8760 8986 50623 55311 39629 34507 41340 45838 33014 19882
15076A9882J3589J3646l1858j7792n831j2875p108M421O338j5655l9008n378K1373
$$ 19882 33471 47117 15259 -2533 -8364 -21239 -28347 -23926 -17588 -33243 -72251 -77629 -56256
15063e6256J436M3916L965j0007J9754L3353K8874P840l6460m6471J348j2871
$$ -56256 -54820 -10904 -6939 -16946 2808 36161 65035 72875 36415 -10056 -8708 -21579
15051b1579q871K5703P012M477J7118J2410r142k4931m1886l688N2066L6547J0756
$$ -21579 -30450 -4747 2265 6742 23860 36270 27128 2197 -39689 -43377 8689 45236 55992
15038E5992q542k3481j9694R363J8864k20j1627L660j0402j057n7291k8614L688
$$ 55992 47450 23969 4275 13638 32502 32282 20655 24315 13913 12856 -44435 -73049 -69361
15025f9361m2731q404M3742L2707J7003L8255J16l8777j3123K3049Q446q994L2261
$$ -69361 -112092 -120496 -76754 -44047 -27044 11211 11327 -27450 -40573 -17524 -9078 -18072 14189
15012A4189j0762k4483l132j0678k8961L3632L4422J8234L550N815O3328J22769
$$ 14189 3427 -21056 -24188 -34866 -63827 -30195 4227 22461 26011 31826 95154 217923
15000B17923J50013K11426M51359N29348n2706l46728l79032l25553j43431p7492
$$ 217923 367936 579362 1030721 1560069 1507363 1160635 781603 456050 312619 235127
14990B35127o5456m9797k6966m5752l7250m436j0655j8009L3584L7129K9324j154
$$ 235127 169671 119874 92908 47156 9906 5470 -5185 -23194 10390 47519 76843 75689
14978G5689m7047J211j6435J755j4246R511J0494k4675j8788J7123J7618K823
$$ 75689 28642 29853 13418 15173 927 10438 20932 -3743 -22531 -5408 12210 15033
14966A5033J3271l9688k2666k392L1757K7500k8667m135M287l19m6519J6606M1680
$$ 15033 28304 -11384 -34050 -36442 -4685 22815 -5852 -9987 -5700 -6019 -52538 -35932 5748
14953E748k671j2878O521J8986P564l228p626k4778L254M09L607k6298j6035J7148
$$ 5748 3077 -9801 -3280 15706 23270 20042 12416 -12362 -9108 -8699 -5092 -31390 -47425 -30277
14939c0277L1608j125P01M813p910J2309J2410k2746o275j0621j3004J1280j305
$$ -30277 1331 206 907 5720 -2190 10119 22529 -217 -6492 -17113 -30117 -18837 -20142
14926b0142J8098N9248n744l0782k478l4536M248j7956k0478J5606j2165j5250
$$ -20142 -2044 57204 51460 20678 18200 -16336 -12088 -30044 -50522 -34916 -47081 -62331
14914f2331K2290P136k9479m601r411J6672m471P48J1218j316L2852M4004J8024
$$ -62331 -40041 -32905 -62384 -66985 -76396 -59724 -64195 -63447 -52229 -53545 -20693 23311 41335
14901D1335n1159m478K2057J6949k5068q054M875p068N332L995j0057P986j2812
$$ 41335 -9824 -14302 7755 24704 -364 -8418 -3543 -10611 -5279 -1284 -11341 -3355 -16167
14888a6167k0159K4324J2966O20J8290l224k135J5298Q66k5532P251J1462l719
$$ -16167 -36326 -12002 964 1584 19874 16650 14515 29813 30679 5147 12398 23860 20141
14875B0141k8813k686O1687J5797l5889m7284j2724P16j5444L96J8155k4659j7090
$$ 20141 -8672 -11358 50329 66126 30237 -17047 -29771 -29055 -44499 -44103 -25948 -50607 -67697
14862f7697P619J4362j0402J8081K1252K1973k0994o019l408J8525Q868o71L8096
$$ -67697 -60078 -45716 -56118 -38037 -16785 5188 -15806 -21825 -25233 -6708 2160 1489 39585
14849C9585R955r166j2180J2937j4864k0218o134l3249j249M1940L3216l65l433
$$ 39585 49540 40374 28194 41131 26267 6049 -85 -33334 -34583 7357 40573 40208 36775
14836C6775o801M688j3879O879k9101j9750K5300o9n781j6693K796o843O967P310
$$ 36775 29974 34662 20783 27662 -1439 -21189 4111 4042 -1739 -18432 -15636 -22479 -15512 -8202
14822h202o391L255n553R726p220J8141q512j3484M3482K2383k6219Q338R66j4584
$$ -8202 -14593 -11338 -16891 -7165 -14385 3756 -4756 -18240 25242 47625 21406 29744 30710 16126
14808A6126r735R975J4647n103n313r587k9001k0405O240J1278j1406K2936L7838
$$ 16126 6391 16366 31013 25910 20597 11010 -17991 -38396 -32156 -20878 -32284 -9348 28490
14795B8490J8313k6605j5610O562J1276K2431j6525o7849q897L9404m560j7273
$$ 28490 46803 20198 4588 11150 22426 44857 28332 -39517 -48414 -9010 -13570 -30843
14783c0843J3658n913J4866M164o78J5630j9456m834J8126K3355k7478j7338P910
$$ -30843 -17185 -23098 -8232 -4068 -4746 10884 -8572 -13406 4720 28075 597 -16741 -8831
14770h831j9712m154J8317J9317p443l1508N825r774j2491R584m913j0621J3413
$$ -8831 -28543 -32697 -14380 4937 -2506 -34014 -28189 -37963 -50454 -40870 -45783 -56404 -42991
14757d2991K3472K0625p804j5989j3606N593J32l0347j3512j3611k2962L8127
$$ -42991 -19519 1106 -6698 -22687 -36293 -30700 -30568 -60915 -74427 -88038 -111000 -72873
14745g2873N0141J8824R012K0636M529o722L0521J1886k6467j0694k2073l3370
$$ -72873 -22732 -3908 5104 25740 30269 23547 54068 65954 39487 28793 6720 -26650
14733b6650k4452O99J1216j611L4789P961m4659L239J9499l3936P920P724J845
$$ -26650 -51102 -50403 -39187 -40798 -6009 1952 -42707 -39468 -19969 -53905 -45985 -38261 -36416
14720c6416J4543K0085J7411Q219O052j1009j1683j6055J404N46p057l824N365
$$ -36416 -21873 -1788 15623 23842 29894 18885 7202 -8853 -7449 -6903 -13960 -17784 -12419
14707a2419K2723k7579k7128p849K668j6582J7501J0372j5068j921J9442N124
$$ -12419 10304 -17275 -44403 -52252 -49584 -66166 -48665 -38293 -53361 -55282 -35840 -30716
14695c0716R763J5571p966l184j015J1496J8450p156q812q310J8622Q569k3764
$$ -30716 -20953 -5382 -13348 -16532 -17547 -6051 12399 5243 -3569 -11879 6743 15312 -8452
14682h452M667j684l2121k9368K9101M4452M259n402J9708O99k40J295J1676l6587
$$ -8452 -3785 -5469 -37590 -66958 -37857 6595 10854 5452 25160 25859 25619 26914 38590 2003
14668B003m0682k2648j1031L7512K0742J5782j0277m2082J355L7557l207L2345
$$ 2003 -38679 -61327 -72358 -34846 -14104 1678 -8599 -50681 -49326 -11769 -14976 17369
14656A7369K114j9977P337J4576m9370p588L6238L8786K5388N23l6113J8645K1109
$$ 17369 19483 -494 6843 21419 -27951 -35539 699 39485 64873 65396 29283 47928 69037
14643F9037l1186M377k1366k6079J1589m102k1589o615m808J3515J9697j613k8979
$$ 69037 37851 42228 20862 -5217 6372 2270 -19319 -25934 -30742 -17227 2470 857 -28122
14630b8122N282k105J4277L2897K5626J7895j3942j8275l861j2913p922M401K9661
$$ -28122 -22840 -24945 -10668 22229 47855 65750 51808 33533 29672 16759 8837 13238 42899
14617D2899K4547l7355m8694k3026j9551K4747L7029J4140m70r378M3328K4744
$$ 42899 67446 30091 -18603 -41629 -61180 -36433 596 14736 14266 4888 48216 72960
14605G2960k558j4348j8123j4978p945J2715m557n733J4065n762r267j4422j1892
$$ 72960 70402 56054 37931 22953 15008 27723 23166 17433 31498 25736 16469 2047 -9845
14592i845l384J8702K0438P038k3729O545p149J3285j4442j9073m7029O828J8966
$$ -9845 -13229 5473 25911 32949 9220 15765 8616 21901 7459 -11614 -58643 -51815 -32849
14579c2849K5345K4355J6784P707Q410j1055K4901J7691k3136l3999l5853L4403
$$ -32849 -7504 16851 33635 41342 49752 38697 63598 81289 58153 24154 -11699 22704
14567B2704K7564j4287j4820M2826J3882N4575l6245p110L612l0206K5082Q7945
$$ 22704 50268 35981 21161 63987 77869 132444 96199 89089 92701 62495 87577 175522
14555A75522R1202Q1079J69296J60143P8557Q756r1998r6844j24996j24024r0061
$$ 175522 266724 347803 517099 677242 755799 764555 672557 575713 450717 326693 236632
14544B36632k6620m9896m9485l3433J6976K7752m0682l9268K622R111j6360m0242
$$ 236632 210012 160116 110631 77198 94174 121926 81244 41976 44598 53709 37349 -2893
14532b893k7146R292L8925k399l0563J315K7677K0808k1518m3936R772J6907J7502
$$ -2893 -30039 -20747 18178 15779 -14784 -13469 14208 35016 13498 -30438 -20666 -3759 13743
14519A3743j4869K4250J8453J7060q922l7547l0277l2176M1935J807k522R141
$$ 13743 -1126 23124 41577 58637 49715 12168 -18109 -50285 -8350 -6543 -9065 76
14507G6j157l3115O299R684l5214j3327M5307J3351J9869J2640l1502q11J8058
$$ 76 -1081 -34196 -27897 -18213 -53427 -66754 -21447 -8096 11773 24413 -7089 -7900 10158
14494A0158J2452k3685j1161P126J9155j3681j8674j4556p743K5033j2796k5000
$$ 10158 22610 -1075 -12236 -5110 14045 364 -18310 -32866 -40609 -15576 -28372 -53372
14482e3372K3451K1988P467k2520J9498J2739m1638n290M7253K8683l2459p882
$$ -53372 -29921 -7933 -466 -22986 -3488 9251 -32387 -37677 9576 38259 5800 -2082
14470b082j1968j8414k6946J265J6903j7736J3553K2888J6918J4435p213l3695
$$ -2082 -14050 -32464 -59410 -58145 -41242 -58978 -45425 -22537 -5619 8816 1603 -32092
14458c2092o441N4162J4322j4535j0923K526J0320O187k9079j9685m379m1631
$$ -32092 -38533 15629 29951 15416 4493 7019 17339 23526 -5553 -25238 -29617 -71248
14446g1248L680M2589M393J746N604K4721j0864L351j8050K0680r082J1714k1438
$$ -71248 -67568 -24979 -20586 -18840 -13236 11485 621 3972 -14078 6602 -2480 9234 -12204
14433a2204J5040j4946j3153J5341K160j1052K2138r452K362k807J4712j5675
$$ -12204 2836 -12110 -25263 -9922 -7762 -18814 3324 -6128 -3766 -6573 8139 -7536
14421g536R505j1777k1498J7098r059L944J3901j6814J3231J2344J2517j2035
$$ -7536 1969 -9808 -31306 -14208 -23267 -19323 -5422 -22236 -9005 3339 15856 3821
14409C821o032q827N761p253o695p388O191k5918r955K3434L6513K310j2210K3847
$$ 3821 -2211 -11038 -5277 -12530 -19225 -26613 -20422 -46340 -56295 -32861 3652 5962 -6248 17599
14395A7599l6780J5854n101m0306K6438R011N552R055j0598l277n291l634o229
$$ 17599 -19181 -3327 -8428 -48734 -22296 -13285 -7733 1322 -9276 -12553 -17844 -21478 -27707
14382b7707l51J2085J5156N180J7648P594o560K7335J4641k0669j3197k7397j5317
$$ -27707 -28058 -15973 -817 4363 22011 29605 23045 50380 65021 44352 31155 3758 -11559
14369a1559Q647L6305k923j4605o292K2494k154j1835j8101L3327L1555j7202
$$ -11559 -2912 33393 30470 15865 9573 32067 29913 18078 -23 33304 64859 47657
14357D7657j5746p065N360L7469J8676k8234k8505l9255j768R393M0345J3692
$$ 47657 31911 24846 30206 67675 86351 58117 29612 -9643 -11411 -2018 38327 52019
14345E2019j3868l8284o888N154J1643J7218r931K0817j5716j6269J7132N248
$$ 52019 38151 -133 -7021 -1867 9776 26994 17063 37880 22164 5895 23027 28275
14333B8275Q138J2912k2441m7396R480J9872j6390k2976L0975K8328L0312M756
$$ 28275 36413 49325 26884 -20512 -11032 8840 -7550 -30526 449 28777 59089 63845
14321F3845k5347j5070l4566R850J1629j6101j1462n368M6905J6172k3961m3927
$$ 63845 38498 23428 -11138 -1288 10341 -5760 -17222 -22590 24315 40487 16526 -27401
14309b7401k0290L6532M6681K3600k4614m3402K27j4931j1860K1566J1841k2196
$$ -27401 -47691 -11159 35522 59122 34508 -8894 -8667 -23598 -35458 -13892 -2051 -24247
14297b4247k4868l0020k699K8472K6352O777K4071J4868Q800J1449M5948K735
$$ -24247 -49115 -79135 -81834 -53362 -27010 -20233 3838 18706 27506 38955 84903 87638
14285H7638j2917j7115j5296J4780l5351j3255J5119j8468k031J0503k4975K21
$$ 87638 74721 57606 42310 57090 21739 8484 23603 5135 3104 13607 -11368 -11147
14273a1147L2558o052J1291J2234k626J9935j7960m4654l1700P232m032J2178
$$ -11147 21411 15359 26650 38884 36258 56193 38233 -6421 -38121 -30889 -34921 -22743
14261b2743m6887q403K6650J9384K530J2079M673K456R182l364k8747J8738J2320
$$ -22743 -69630 -78033 -51383 -31999 -29469 -17390 -12717 -10261 -1079 -4443 -33190 -14452 -2132
14248b132R612j7364L738K1166l0012k6955j0786K3215L2656J8544Q409j4269
$$ -2132 7480 -9884 -6146 15020 -14992 -41947 -52733 -29518 3138 21682 30091 15822
14236A5822k6527N565J3141J7857m367K293J0414J9116l674q418O528l1457J0751
$$ 15822 -10705 -5140 8001 25858 21491 23784 34198 53314 49640 41222 47750 16293 27044
14223B7044J2516r425l5315l2981J3000K3297j603m277P356p175K0831r685K327
$$ 27044 39560 30135 -5180 -38161 -25161 -1864 -3467 -7744 -388 -7563 13268 3583 5910
14210E910k7795K2888L1479K260l99J7091P316p3952k8304Q974L0306M400m2659
$$ 5910 -21885 1003 32482 34742 34343 51434 58750 -15202 -43506 -34532 -4226 174 -42485
14197d2485J0095R813k3177j4168j3281J7168O2831L162j3122J2578J3138j7752
$$ -42485 -32390 -22577 -45754 -59922 -73203 -56035 6796 9958 -3164 9414 22552 4800
14185D800M708J9912J2927n38j78L302n323k4282k3179l6533o108Q13J9734L4379
$$ 4800 9508 29420 42347 41809 41631 44933 39610 15328 -7851 -44384 -50492 -49679 -29945 4434
14171D434k4734L0687m3203n3609M0441K7890L456K6144L6896q274m1177r148
$$ 4434 -20300 10387 -32816 -86425 -45984 -18094 -14638 11506 48402 40128 -1049 -10197
14159a0197o586j4005n323J4383J4418j4420J3219J9966L131R736q577j9966j1696
$$ -10197 -16783 -30788 -36111 -21728 -7310 -21730 -8511 11455 14586 24322 15745 -4221 -15917
14146a5917r803J8875J9855j1338k0686m0039m1143Q302J423M3904O5507j3250
$$ -15917 -25720 -6845 13010 1672 -19014 -59053 -100196 -91894 -90471 -46567 18940 5690
14134E690m1735K7110K4529K92J6674K1225j6847j4710j0830J8784j0739l6641
$$ 5690 -36045 -8935 15594 15886 32560 53785 36938 22228 11398 30182 19443 -17198
14122a7198k2686K6015L1619K8156j7380k4015L941L374K5559k0337j9078J1864
$$ -17198 -39884 -13869 17750 45906 28526 4511 8452 11826 37385 17048 -2030 9834
14110I834M8423r661k1739lJ3441k782p566j448j2435k9189J2160n278N995K0211
$$ 9834 58257 48596 26857 26854 40295 37513 29947 28499 16064 -13125 -965 -6243 -248 19963
14096A9963K1344k0847l8186j9234p1J6064j8435k369J2108m407J0124M0790r878
$$ 19963 41307 20460 -17726 -36960 -37031 -20967 -39402 -41771 -29663 -34070 -23946 16844 6966
14083F966l1078j6618P529L0673O07K846K6482L8661j7800j5030r970r500K3647
$$ 6966 -24112 -40730 -33201 -2528 -1921 925 27407 66068 48268 33238 23268 13768 37415
14070C7415m248J4831L098k5421k0322r994M546k0835O4j4094K1395L0850k4095
$$ 37415 33167 47998 51096 25675 5353 -4641 -95 -20930 -20866 -34960 -13565 17285 -6810
14057f810l0950j5685M8561J0460O121K7288n706j8665K712r999j4795j9667J0662
$$ -6810 -37760 -53445 -4884 5576 11697 38985 33279 14614 17326 7327 -7468 -27135 -16473
14044a6473O726K1728j18k3970J3744K1619K6610o626l0085l171K6516j4413K0100
$$ -16473 -9747 11981 11863 -12107 1637 23256 49866 43240 13155 9984 36500 22087 42187
14031D2187m4113k9671n822j1064M9477K5801l95k6909L448k0082j9434j6329
$$ 42187 -1926 -31597 -37419 -48483 994 26795 26400 -509 2939 -17143 -36577 -52906
14019e2906J8090K835j4050N938K7056K0739K2979j3380J4836j7005k5251q044
$$ -52906 -34816 -31981 -46031 -40093 -13037 7702 30681 17301 32137 15132 -10119 -18163
14007a8163J1372L398R572k067J924K1220j3908R029J7268j1596k6183k5545r790
$$ -18163 -6791 -3393 6179 4112 6036 27256 13348 22377 39645 28049 1866 -23679 -33469
13994c3469J9670K0016Q153J0329m762O326j217k2888k0634j4151L411k0925l867
$$ -33469 -13799 6217 14370 24699 19937 26263 25046 2158 -18476 -32627 -29216 -50141 -54008
13981e4008M3023J9098J2446J8790L454k263j7008o874K4764k502q059k5081j3199
$$ -54008 -10985 8113 20559 39349 42803 40540 23532 16658 41422 38920 30861 5780 -7419
13968g419j8923l7414J1404M724J8178K6994N155M88J0420m2323L031M784j9601
$$ -7419 -26342 -63756 -52352 -47628 -29450 -2456 2699 3187 13607 -28716 -25685 -20901 -40502
13955d0502P978O2241K5987j0060j6988n2911j5276m29P244N793k4228p857Q366
$$ -40502 -32524 29717 55704 45644 28656 -24255 -39531 -39960 -32716 -26923 -51151 -59008 -50642
13942e0642j382j003N298L8408P439j1272j6271p465p173k9519L4811L8141L0375
$$ -50642 -52024 -53027 -47729 -9321 -1882 -13154 -29425 -36890 -44063 -73582 -38771 -630 29745
13929B9745J6734p0P276l4297k2839o919R106N554m384k4543J1398J6744J3885
$$ 29745 46479 46409 53685 19388 -3451 -10370 -1264 4290 -94 -24637 -13239 3505 17390
13916A7390j7839q066O72j9558m1053M3831J6795j753K7791J7703J8216k1585
$$ 17390 -449 -8515 -7843 -27401 -68454 -24623 -7828 -9581 18210 35913 54129 32544
13904C2544k1204k7902o066r899j2701Q498j11L1035N1855J4752k1574j4898k48
$$ 32544 11340 -16562 -22628 -32527 -45228 -36730 -36841 -5806 46049 60801 39227 24329 24081
13891B4081K604R048l2831n81L4244L812k4730R806l347l010l8157j4949j302
$$ 24081 26685 35733 2902 2321 36565 40377 15647 25453 22106 19096 -19061 -34010 -35312
13878c5312m528k604Q949k4619N149L1849Q179N816m659O141k5169L8883K1638
$$ -35312 -39840 -42444 -33495 -58114 -52965 -21116 -12937 -7121 -11780 -5639 -30808 8075 29713
13865B9713j4701J8803K8061m3063o0876k3125K7490M779L6063P948Q98J8547
$$ 29713 15012 33815 61876 18813 -42063 -65188 -37698 -32919 3144 11092 11990 30537
13853C0537J3698J024m373l1408l8142L338K1388J4704p541Q776j8068l2522R36
$$ 30537 44235 45259 40886 9478 -28664 -25326 -3938 10766 3225 12001 -6067 -38589 -37653
13840c7653r16J0107l728j0995k3424J9300M7066J3386K8317m988R496l015M918
$$ -37653 -38569 -28462 -32190 -43185 -66609 -47309 -243 13143 41460 36472 45968 42953 47871
13827D7871L7918j0183j330Q739k8493k1238k7590L357K2327R959k049k0684k6828
$$ 47871 85789 75606 74276 83015 54522 33284 5694 9051 31378 41337 39288 18604 -8224
13814h224o789o012K0949L101o95j6870j1748j449p268M4207J4523k1497L820
$$ -8224 -15013 -21025 -76 3025 2330 -14540 -26288 -27737 -35005 9202 23725 2228 6048
13801F048J7391J255J9236J882k3232j9396L9507M7059j9881n3014k4363p709
$$ 6048 23439 24694 43930 45812 22580 3184 42691 89750 69869 16855 -7508 -15217
13789a5217L8097m291k900L1591o960J8936J4957m0528m5578o665K800j5339j2041
$$ -15217 22880 18589 15689 47280 40320 59256 74213 33685 -11893 -18558 -15758 -31097 -43138
13776d3138J0092j605J9059K7703K3300J8107j4670l1716L635K7524N76k3898
$$ -43138 -33046 -34651 -15592 12111 35411 53518 38848 7132 10767 38291 38867 14969
13764A4969n212O3750J2685k6398j9969q565j5252k095R321k2743N665O262J7481
$$ 14969 9757 73507 86192 59794 39825 31260 16008 13913 23234 491 6156 12418 29899
13751B9899Q230J7164N794k2041l8339n786M266L639k2346K3057O3224K1296j4225
$$ 29899 38129 55293 61087 39046 707 -5079 -813 2826 -19520 3537 66761 88057 73832
13738G3832j6084J2240q727K483r317j9696K0382L1432l0184l2448j7604o321
$$ 73832 57748 69988 61261 63744 54427 34731 55113 86545 56361 23913 6309 -12
13726a2l561j6504M660R582M2453J0857k0335k396N405J8366k0429m0787o626
$$ -12 -3573 -20077 -15417 -5835 36618 47475 27140 24744 30149 48515 28086 -12701 -19327
13713a9327L7989L8807j6300k9079J5959p507R241j2453k5703J2926L90q268M344
$$ -19327 18662 57469 41169 12090 28049 20542 29783 17330 -8373 4553 4943 -3325 1019
13700A019j8809r910L4253k4649L89M6886p033q493K5528j924J439L869k1523
$$ 1019 -17790 -27700 6553 -18096 -17707 29179 22146 13653 39181 37257 38696 42565 21042
13687B1042M277p659M313N31p185j2115L6501K4326J5415K0419j3904P910j9095
$$ 21042 25319 17660 21973 22504 15319 3204 39705 64031 79446 99865 85961 93871 74776
13674G4776m7385k997J8548J9616k7382M447J1754j5812n178M2217k426l2502
$$ 74776 27391 24394 42942 62558 35176 39623 51377 35565 30387 72604 70178 37676
13662C7676k795j0150l0430j1714K2258P164L897J6755j8668p317O172L3753Q418
$$ 37676 34881 24731 -5699 -17413 4845 12009 15906 32661 13993 6676 12848 46601 55019
13649E5019j5102j581J3143p216j2605o273l0314n349M2548J3831J992j3007Q753
$$ 55019 39917 38336 51479 44263 31658 25385 -4929 -10278 32270 46101 48093 35086 43839
13636D3839R136k2091O78J9448j3327k7203j6558j4018J2669K6387J4958K4759
$$ 43839 52975 30884 31562 51010 37683 10480 -6078 -20096 -7427 18960 33918 58677
13624E8677K819m8510L49k481k9344R930J9040L3702K9423r869j5604k4809O747
$$ 58677 61496 12986 13335 10854 -18490 -8560 10480 44182 73605 63736 48132 23323 30070
13611C0070J209l6307J4825L267J6333P035m528J5718K2485k7963J3767L4911
$$ 30070 31279 -5028 9797 13064 29397 36432 31904 47622 70107 42144 55911 90822
13599I0822L051l2242l5203P544J058j7453M5983L6714R940j3918j1054j8680
$$ 90822 93873 61631 26428 33972 35030 17577 63560 100274 110214 96296 85242 66562
13587F6562K163j3477j5966P375J6810l3216k1848P609K8976j613r798j8865k0149
$$ 66562 68725 55248 39282 46657 63467 30251 8403 16012 44988 43375 33577 14712 -5437
13574e437N080L3527L0025M7387j7968j3216k1517j9169K222l6257l719L9171
$$ -5437 -357 33170 63195 110582 92614 79398 57881 38712 40934 4677 958 40129
13562D0129J5861J7841k70j5532j710J783K2141j443m0278l3944j0428M3703O480
$$ 40129 55990 73831 73561 58029 56319 58102 80243 78800 38522 4578 -5850 37853 44333
13549D4333j7980j2013K6745J7909j2797K809k662j45J4145N684L574R480J3192
$$ 44333 26353 14340 41085 58994 46197 49006 46344 46199 60344 66028 69602 79082 92274
13536I2274K3044q546k2734m9238O05K7504J8865Q255k0962L949j1275p47Q441
$$ 92274 115318 106772 84038 34800 35405 62909 81774 90029 69067 73016 61741 60994 69435
13523F9435J9686j6790r876J1534N312j4831k7143J575M0227j9638M915Q336l2874
$$ 69435 89121 72331 62455 73989 79301 64470 37327 38902 79129 59491 64406 72742 39868
13510C9868j7519K7175m27j0741J7512j3525m525K834m731K2616J5015k5944J563
$$ 39868 22349 49524 49097 38356 55868 42343 37818 40652 35921 58537 73552 47608 49171
13497D9171k18j0044r826K0305j5351k0031j3791j4594J3030k7798R916M3914
$$ 49171 48953 38909 29083 49388 34037 14006 215 -14379 -1349 -29147 -19231 24683
13485B4683L7693j5188j4910k4452n4264j7552L4898L1341K5880L4660l146o623
$$ 24683 62376 47188 32278 7826 -46438 -63990 -29092 2249 28129 62789 59643 53020
13473E3020n47o748J03j126J2896K472L338M271j2783j4937K6382j5575L416q463
$$ 53020 52473 45725 45828 44702 57598 60070 63408 67679 54896 39959 66341 50766 54182 45719
13459D5719n096L5076K8122j7540r73j6j9975L238J5579k8519j0448J5428M68
$$ 45719 40623 75699 103821 86281 85308 85292 65317 68555 84134 55615 45167 60595 61063
13446F1063O145j8839j6549K974L8058m263j8116J2782L4661k822j052l0493l2774
$$ 61063 67208 48369 31820 34794 72852 68589 50473 63255 97916 95094 94042 63549 30775
13433C0775L6253k042j2959j4026K1747o711l8670j1815r35N5910O475P815j6071
$$ 30775 67028 64986 52027 38001 59748 53037 14367 2552 1617 57527 64002 71817 55746
13420E5746j9350l6260J90J2943j215l4500l1709J5724N7003L5844K3156J4469
$$ 55746 36396 136 326 13269 12054 -22446 -54155 -38431 18572 54416 77572 92041
13408I2041o611j0954j1263j9318l1339j639M997J3628O416j7823J340J1468M835
$$ 92041 85430 74476 63213 43895 12556 10917 15914 29542 35958 18135 19475 30943 35778
13395C5778M683O082p414o754j495l2678J2406M2498L4000J2224j879l5932n5316
$$ 35778 40461 46543 39129 32375 30880 -1798 10608 53106 87106 99330 97451 61519 6203
13382F203Q593K4328K0678r961j4427J3305L0984L1874J4066k1563n1991l3253
$$ 6203 14796 39124 59802 49841 35414 48719 79703 111577 125643 104080 52089 18836
13370A8836J9440K7592N741J932j8729r318k4302j7090K8179O129j7193r23L6649
$$ 18836 38276 65868 71609 73541 54812 45494 21192 4102 32281 38410 21217 20294 56943
13357E6943J648j7584p699J3615J125k396l2550m980L2472J4369n056K879K9174
$$ 56943 58591 41007 33308 46923 48048 45652 13102 8122 40594 54963 49907 52786 81960
13344H1960O863P664k5193K3929j2278J1577j4499k5292j3533k869j3025o181
$$ 81960 88823 96487 71294 95223 82945 94522 80023 54731 41198 38329 25304 19123
13332A9123o694J5797J1117J1906N4195n1847l8199M2519L5136j0832L453K8604
$$ 19123 12429 28226 39343 51249 105444 53597 15398 57917 93053 82221 85674 114278
13320A14278l238l2455j8453K2897j8619j8670K9625o821k8768r548j4221J7682
$$ 114278 111040 78585 60132 83029 64410 45740 75365 68544 39776 30228 16007 33689
13308C3689L5064j7183l0322K0200J031J2434Q284J9231J2812j4880j9334j3583
$$ 33689 68753 51570 21248 41448 42479 54913 63197 82428 95240 80360 61026 47443
13296D7443l6956O22L1549Q318M0096k3047m1110M814o532J6517J3106j033j2388
$$ 47443 10487 11109 42658 50976 91072 68025 26915 31729 25197 41714 54820 53787 41399
13283D1399O007k4156j9489J7322L2575K7386j984O495J0185K3937j660R941L1942
$$ 41399 47406 23250 3761 21083 53658 81044 79060 85555 95740 119677 118017 127958 159900
13270A59900k5883k4408J607m625J4687K7879q006l2669m49r357k7465O02Q312
$$ 159900 134017 109609 111216 106591 121278 149157 141151 108482 108033 98676 71211 71813 80125
13257H0125r24J9548L364p560k0157J2626p902o008J2008k9706j7272K091J9223
$$ 80125 79201 98749 102113 94553 74396 87022 79120 73112 85120 55414 38142 40233 59456
13244E9456k4512J5344L8857k7087k0410M7540P660l3071J4454K230J4409J661
$$ 59456 34944 50288 89145 62058 41648 89188 96848 63777 78231 80461 94870 96531
13232I6531j3969n1966K3823L7170o000k8035L1054K3843L404J2079k4987j8840
$$ 96531 82562 30596 54419 91589 85589 57554 88608 112451 115855 127934 102947 84107
13220H4107l2530j0595K5762k897J464K529O371j1042j6396M339K6288n652m239
$$ 84107 51577 40982 66744 63847 65311 67840 74211 63169 46773 51112 77400 71748 67509
13207F7509m543Q173n663j2895n128q553K5895K6113k0776P09M8887K1828k2727
$$ 67509 62966 71139 65476 52581 47453 38900 64795 90908 70132 70841 119728 141556 118829
13194A18829r099j2120k0608k5759L499M5032M0372L3382m0441L2299m443j7728
$$ 118829 109730 97610 77002 51243 54742 99774 140146 173528 133087 165386 160943 143215
13182A43215l3519l0662P735l142p06j1455N482K1622J9704j8040j6310o509j8402
$$ 143215 109696 79034 86769 83627 82921 71466 76948 98570 118274 100234 83924 77415 59013
13169E9013M326j3980J3751M7610P390k2013k1506J775N342J91l8131j6226j3044
$$ 59013 63339 49359 63110 110720 118110 96097 74591 76366 81708 81899 43768 27542 14498
13156A4498N462L6373J3750k296K7378M224j6030m1111k3999K1245r461P777L860
$$ 14498 19960 56333 70083 67787 95165 99389 83359 42248 18249 39494 30033 37810 41670
13143D1670j0784J902K1111K9966J0019J8909P694r333k0509j6236l246J1138
$$ 41670 30886 32788 53899 83865 93884 112793 120487 111154 90645 74409 71163 82301
13131H2301k8601j9866M7890L2195K2757K604k5902O091O019N386k7465l7796
$$ 82301 53700 33834 81724 113919 136676 139280 113378 119469 125488 130874 103409 65613
13119F5613J4493J2230p433l423o434P614L717R07R006J1170o087l0647j0078
$$ 65613 80106 92336 84903 81480 75046 82660 86377 87284 96290 107460 101373 70726 60648
13106F0648j2149K5397L1850r952o059J793R968k9476R773J0643j6057o137q097
$$ 60648 48499 73896 105746 95794 89735 91528 101496 72020 81793 92436 76379 70242 62145
13093F2145L7553K2067O578N44k1130n634j3820j0127J3754O211K7553j1147N27
$$ 62145 99698 121765 128343 128887 107757 102123 88303 78176 91930 98141 125694 114547 115074
13080A15074K5350m9547j0328J1135j4810J4829J9695J2570J8897k0350k7209
$$ 115074 140424 90877 80549 91684 76874 91703 111398 123968 142865 122515 95306
13069I5306q209j6953L668J7534K4882k8295k9547j2679R844J0989n357K9159
$$ 95306 87097 70144 73812 91346 116228 87933 58386 45707 55551 66540 61183 90342
13057I0342K3680L986P208j4334J3819j7734m5415l2226m0949j3258M5284L2685
$$ 90342 114022 118008 125216 110882 124701 106967 61552 29326 -11623 -24881 20403 53088
13045E3088j1212M3449N1269O142K2654M930j0359r805k2316K6437L9408j336
$$ 53088 41876 85325 136594 142736 165390 170320 159961 150156 127840 154277 193685 192349
13033A92349k3528K825j567k4418r934J447m936p152p018L1382m347k0701J0683
$$ 192349 168821 171646 170079 145661 135727 137174 132238 125086 118068 149450 145103 124402 135085
13020A35085l2600j8754p94M7918N266q980k3891K5103L5835k3450j1070J222
$$ 135085 102485 83731 82937 130855 136121 127141 103250 128353 164188 140738 129668 130890
13008A30890J3635k2303k0141J0689K3600J2884J4222j6195k9891K8824l1214
$$ 130890 144525 122222 102081 112770 136370 149254 163476 147281 117390 146214 115000
12997A15000j0605K7324l0624Q294K0793j6674j4195k017k267K6692l776j4452
$$ 115000 104395 131719 101095 109389 130182 113508 99313 97296 95029 121721 117945 103493
12985A03493J336P567l2526Q665J0240k231j0440l0182R96K1477J5195L763O751
$$ 103493 104829 112396 79870 88535 98775 96544 86104 55922 56918 78395 93590 97353 104104
12972A04104o55k422j3132J8381P912J8711O785j8408J0859p362j6839k5307o877
$$ 104104 103449 101027 87895 106276 114188 132899 139684 121276 132135 124773 107934 82627 75750
12959G5750J4487K0744k3537k7678m408K4500J1100l03j550j7435m7188p18K7724
$$ 75750 90237 110981 87444 59766 55358 79858 90958 90655 89105 71670 24482 23764 51488
12946E1488N5029R007J1756j6728P183O020J8201J177L152j8507m0073J3874n525
$$ 51488 106517 115524 127280 110552 117735 123755 141956 143133 146285 127778 87705 101579 96054
12933I6054k5064j0117J4964K0195L0422m101J7927M4582j4846l3800l7012j6705
$$ 96054 70990 60873 75837 96032 126454 122353 140280 184862 170016 136216 99204 82499
12921H2499j6479L5004R104K7578k809k401j4510M1915K1850j1164j4265J6205
$$ 82499 66020 101024 110128 137706 134897 132496 117986 159901 181751 170587 156322 172527
12909A72527J6868l1944l147R176J3865L63q719k0936l5619J8345R443K996P589
$$ 172527 189395 157451 154304 163480 177345 177708 168989 148053 112434 130779 140222 143218 150807
12896A50807K3256p400k1656J8455l2053k6839J6037J8732j9771k4298j8318L5129
$$ 150807 174063 166663 145007 163462 131409 104570 120607 139339 119568 95270 76952 112081
12884A12081K1506P901O355J3069k2969j2551j8483J4352L1771Q074k5581j1011
$$ 112081 133587 141488 147843 160912 137943 125392 106909 121261 153032 161106 135525 124514
12872A24514j2312k1181J851M7914K7990q539q47p428j8056J762J1750p658j9080
$$ 124514 112202 91021 92872 140786 168776 160237 159390 151962 133906 135668 147418 139760 120680
12859A20680o190K5155K6118k6j5097K9329J2090p392k4200k7754l3316J9572
$$ 120680 114490 139645 165763 165737 150640 179969 192059 184667 160467 132713 99397 118969
12847A18969M1990j0005j8512K6067K0323j1970j1390n036K0590K272R293o371
$$ 118969 160959 150954 132442 158509 178832 166862 155472 150436 171026 173298 182591 176220
12835A76220m3282k2114r90Q336L957j8676j0338K7339K5850J2246R104r597p606
$$ 176220 132938 110824 109834 118170 122127 103451 93113 120452 146302 158548 167652 158055 150449
12822A50449n661k945L6189J6811j8311j5474L2723Q523K2299j2908k3139J168
$$ 150449 144788 141843 178032 194843 176532 161058 193781 202304 224603 211695 188556 189724
12810A89724j2648l6182j1027J4811o143m1928j5110M0619J9830L5136K041j4773
$$ 189724 177076 140894 129867 144678 138535 96607 81497 122116 141946 177082 179123 164350
12798A64350K830R074k4075r318N923j0281J3619K6484n693j1572j3984Q840L3203
$$ 164350 167180 176254 152179 142861 148784 138503 152122 178606 172913 161341 147357 156197 189400
12785A89400q747L415j4397q821j6598k072J877L3956J3278M339K9708k0164l0405
$$ 189400 180653 184068 169671 160850 144252 142180 144057 178013 191291 195630 225338 205174 174769
12772A74769Q439J6911M904m3566k0364L0878m632j021K0928K3451J4838m8238
$$ 174769 183208 200119 205023 161457 141093 171971 167339 166318 187246 210697 225535 177297
12760A77297M98J8299J9778k4526P134J088r135L724O98J9484N734K359j5991
$$ 177297 177795 196094 215872 191346 198480 199568 190433 194157 194855 214339 220073 222432 206441
12747B06441k8099J498J0911J4969j8133o358J043K0790Q74l2769K2961M1066
$$ 206441 178342 179840 190751 205720 187587 181229 182272 203062 203936 171167 194128 235194
12735B35194j9744L679j6922l830K0725k557l466J1610r950p783k752L6122j6686
$$ 235194 215450 219129 202207 198377 219102 216545 213079 224689 214739 206956 204204 240326 223640
12722B23640M3580M6404j2806j900l3209p367k657j1772J9158j1665l3404J2971
$$ 223640 267220 313624 300818 298918 265709 258342 255685 243913 263071 251406 218002 230973
12710B30973J2044k3208j4699L75J030K0270K8383k2160j2077K9447N38K0658
$$ 230973 243017 219809 205110 205485 206515 226785 255168 233008 220931 250378 250916 271574
12698B71574p041l1005l4424K0070J2875K8438k13j0489p466j9127J1466L3799
$$ 271574 264533 233528 199104 219174 232049 260487 260274 249785 242319 223192 234658 268457
12686B68457K7702J4176K134J7660j6765m0821l8263J9913M5343j9662j9924m3376
$$ 268457 296159 310335 312469 330129 313364 272543 234280 254193 299536 279874 259950 216574
12674B16574P131N5665J0566j5447J2317o31q014J2018J6318M1347J4783l4773
$$ 216574 223705 279370 289936 274489 286806 286175 278161 290179 306497 347844 362627 327854
12662C27854k6338K0710K679r099k6179l34j586k0470L1407L5555J3553l0472
$$ 327854 301516 322226 324905 315806 289627 289293 287707 267237 298644 334199 347752 317280
12650C17280j0489R134N536J4378o46O413R98J8707l928K0406J2541j1965j6669
$$ 317280 306791 315925 321461 335839 335193 341606 342604 361311 357383 377789 390330 378365 361696
12637C61696j6308k9878R712K1247L5993M188J5411K4846k10n056k895K4113p05
$$ 361696 345388 315510 325222 346469 382462 386650 402061 426907 426697 421641 418746 442859 442154
12624D42154P638k5245K1195J5968P230l0126Q621k5345k2198M099J6243j6199
$$ 442154 449792 424547 445742 461710 468940 438814 447435 422090 399892 403991 420234 404035
12612D04035k4451l8794j4567J4300K9572K979J0598K2911J0760K4329L936j0153
$$ 404035 379584 340790 326223 340523 370095 373074 383672 406583 417343 441672 445608 435455
12600D35455j4409j7626j112j4353J6189J3568l1379k6736j741L8660L2873k015
$$ 435455 421046 403420 402308 387955 404144 417712 386333 359597 357856 396516 429389 427374
12588D27374m769j6450P936J0296m95k3704J8521j9388k0754J0967L8583O545
$$ 427374 422605 406155 414091 424387 423892 400188 418709 399321 378567 389534 428117 434662
12576D34662K3207l483j1308k8337j3418M403j1159P289r611j7057J0366K0781
$$ 434662 457869 454386 443078 414741 401323 405726 394567 401856 392245 375188 385554 406335
12564D06335J5204o149Q533K79N6346M4292l7568k3632k6901j6326L2802J7316
$$ 406335 421539 415390 423923 424202 480548 524840 487272 463640 436739 420413 453215 470531
12552D70531q379K5878N334J617Q765J589J0319l2250j6080J5733K7588j592l2638
$$ 470531 462152 488030 493364 494981 503746 505335 515654 483404 467324 483057 510645 509053 476415
12539D76415l5677k7505N203M3022p49j1240o063j7640M4983M8281Q161j0768
$$ 476415 440738 413233 418436 461458 460709 449469 443406 425766 470749 519030 527191 516423
12527E16423j2027k0583K6167L3668L3296j8607n239Q614K5510L2512N992k1666
$$ 516423 504396 483813 509980 543648 576944 558337 553098 561712 587222 619734 625726 604060
12515F04060j391o186R087n728n045j537k738J1623q415K594J0755J2919K2082
$$ 604060 602669 596483 605570 599842 594797 593260 590522 602145 593730 596324 607079 619998 642080
12502F42080K334K9614K0043P035L4546K1883L079J3488M6431P6700R0416J14489
$$ 642080 644414 674028 694071 701106 735652 757535 760614 774102 820533 897233 987649 1102138
12490A102138R0099O8307K3112k8224j5063J5529L1138L9561K5327l5295n6798
$$ 1102138 1192237 1260544 1283656 1255432 1240369 1255898 1287036 1326597 1351924 1316629 1259831
12479A259831j32079j20340q3492m5993l1963l5864r62N345j0414q153m1889k4478
$$ 1259831 1127752 1007412 923920 877927 845964 810100 809138 814483 804069 795916 754027 729549
12467G29549O939j0341K3780k431j4448J1127Q626j049k1973l0568J3193L5406
$$ 729549 736488 726147 749927 747496 733048 744175 752801 751752 729779 699211 712404 747810
12455G47810K3129l377k5322R516M4455N4179k0524l2198L346r030L809K3234
$$ 747810 770939 767562 742240 751756 796211 850390 829866 797668 801014 791984 795793 819027
12443H19027k7182j3877L0094K9902Q398M915o77K6534O8053J7420N368J3591
$$ 819027 791845 777968 808062 837964 846362 851277 850600 877134 945187 962607 967975 981566
12431I81566k3537l3435k1040R025J1825K0317N3302J7435q986j6427j4267J9588
$$ 981566 958029 924594 903554 912579 924404 944721 998023 1015458 1006472 990045 975778 995366
12419I95366k980K5183K047J6058J8343J856k7884j65Q705L6802R09j8874Q135
$$ 995366 992386 1017569 1019616 1035674 1054017 1055873 1027989 1027824 1036529 1073331 1074240 1055366 1063501
12406A063501P953O7921K4983m665J4674J7788k64M717j5291K8107J1123k3427
$$ 1063501 1071454 1139375 1164358 1159693 1174367 1192155 1191891 1196608 1181317 1209424 1220547 1197120
12394A197120m36o967K5917L5857J2598P993J8584R006K935N352l062N5415N0204
$$ 1197120 1196684 1189717 1215634 1251491 1264089 1272082 1290666 1299672 1302607 1307959 1304897 1360312 1410516
12381A410516K6194N675j7957j2726J8952J0793J4421K7607P386M3185K0509j0471
$$ 1410516 1436710 1442385 1424428 1411702 1430654 1441447 1455868 1483475 1490861 1534046 1554555 1544084
12369A544084l7389L3827M7441o490n812J2873L7146M52K3822J9280L5178N2944
$$ 1544084 1506695 1540522 1587963 1581473 1575661 1588534 1625680 1626132 1649954 1669234 1704412 1757356
12357A757356K0794N340P347P815K3573m380k435M4450K3962J7756M0981J8211
$$ 1757356 1778150 1783490 1790837 1798652 1822225 1817845 1815410 1859860 1883822 1901578 1942559 1960770
12345A960770N95J7499M5953J6083O38M2082K6808K1711K4024k755L7698N5823
$$ 1960770 1961365 1978864 2024817 2040900 2041538 2083620 2110428 2132139 2156163 2153408 2191106 2246929
12333B246929K030K1924K9673J1648j331J0692O2949M2049K1710J3146J2839J2802
$$ 2246929 2248959 2270883 2300556 2312204 2310873 2321565 2384514 2426563 2448273 2461419 2474258 2487060
12321B487060J3599K0445M6918L6099M7247K9627J5095J5153L2900N3879M1851
$$ 2487060 2500659 2521104 2568022 2604121 2651368 2680995 2696090 2711243 2744143 2798022 2839873
12310B839873K5273J8740Q951M5119O1703K7759J5940L1547N2456N5951L7116
$$ 2839873 2865146 2883886 2892837 2937956 2999659 3027418 3043358 3074905 3127361 3183312 3220428
12299C220428O5512N6361L7438M3857K8477J6500N8257K9551O2686P6017O6124
$$ 3220428 3285940 3342301 3379739 3423596 3452073 3468573 3526830 3556381 3619067 3695084 3761208
12288C761208L1897K6518M6775N1036R3159O8191M3033M7222M8642Q2998J25458
$$ 3761208 3793105 3819623 3866398 3917434 4010593 4078784 4121817 4169039 4217681 4300679 4426137
12277D426137M7873L8120M2567P0845R2186P5123J00121R1186R0951L9514J8723
$$ 4426137 4474010 4512130 4554697 4625542 4717728 4792851 4892972 4984158 5075109 5114623 5133346
12266E133346N2390J06792J00358O5562N7272N6167N2282M8961J08329P7363N2202
$$ 5133346 5185736 5292528 5392886 5458448 5515720 5571887 5624169 5673130 5781459 5858822 5911024
12255E911024Q3373J45590J52982J22881J20836Q3672O0596M4737J7281P3604
$$ 5911024 5994397 6139987 6292969 6415850 6536686 6620358 6680954 6725691 6742972 6816576
12245F816576J27558J04116R6778Q0065Q8246R8141J17456J27996Q6824J33152
$$ 6816576 6944134 7048250 7145028 7225093 7313339 7411480 7528936 7656932 7743756 7876908
12235G876908J33950J40322J32920Q7190O8057P4982R6019J21942J29787J56445
$$ 7876908 8010858 8151180 8284100 8371290 8439347 8514329 8610348 8732290 8862077 9018522
12225I018522R8374O1133R0787J24818J40659R8065O8123J00140J29991Q0887
$$ 9018522 9116896 9178029 9268816 9393634 9534293 9632358 9700481 9800621 9930612 10011499
12215A0011499R0094J08270J22928J61268J24071Q7414Q2859Q6373J14435J03982
$$ 10011499 10101593 10209863 10332791 10494059 10618130 10705544 10788403 10874776 10989211 11093193
12205A1093193J37405J37443J33685J01245J11422J04703J04401J77533J99018
$$ 11093193 11230598 11368041 11501726 11602971 11714393 11819096 11923497 12101030 12300048
12196A2300048K34697L54416L49355L13835L40345L07915L09948K46812K21073
$$ 12300048 12534745 12889161 13238516 13552351 13892696 14200611 14510559 14757371 14978444
12187A4978444J44992J6188j6954r2528j67457k31591k71455l04734l05165l37586
$$ 14978444 15123436 15139624 15122670 15030142 14862685 14631094 14359639 14054905 13749740 13412154
12177A3412154l50147l77453l45555k98126k32355j59735j47957j33213j43923
$$ 13412154 13062007 12684554 12338999 12040873 11808518 11648783 11500826 11367613 11223690
12168A1223690j26248r4218o5967o8350j31383j28998p6276p6623q4769p6515
$$ 11223690 11097442 11003224 10937257 10868907 10737524 10608526 10532250 10455627 10370858 10294343
12158A0294343j17238j06750r6614q9520j08480j09347j09220j04969q7987p7676
$$ 10294343 10177105 10070355 9973741 9884221 9775741 9666394 9557174 9452205 9364218 9286542
12148I286542r5382o0640q6516o9110k2575P5730J56310K37428K34932Q9006j54303
$$ 9286542 9191160 9130520 9044004 8974894 8952319 9028049 9184359 9421787 9656719 9745725 9591422
12137I591422l50053m30081l58055k88798j91490j48638j61352j14800j31573
$$ 9591422 9241369 8811288 8453233 8164435 7972945 7824307 7662955 7548155 7416582
12128G416582p4470n2986n5897o9178l3253l2194k7863n8725q8698q1079j00395
$$ 7416582 7342112 7289126 7233229 7164051 7130798 7098604 7070741 7012016 6923318 6842239 6741844
12117F741844o5243q1548n3553l2575n9428o7101m6935m6415o1325l3227m9987
$$ 6741844 6676601 6595053 6541500 6508925 6449497 6382396 6335461 6289046 6227721 6194494 6144507
12106F144507l9951j6049N133L0802K5619J5644Q1651M9373L6130P8273Q7038
$$ 6144507 6104556 6088507 6093640 6124442 6150061 6165705 6247356 6296729 6332859 6411132 6498170
12095F498170J10197J66353K22265K66656L32989M33149M59477M99392N08933
$$ 6498170 6608367 6774720 6996985 7263641 7596630 8029779 8489256 8988648 9497581
12086I497581M72798M91901N75372P75642R82317J197580J530771K027753K641763
$$ 9497581 9970379 10462280 11037652 11813294 12795611 13993191 15523962 17551715 20193478
12077B0193478L652144N479847Q601002J3336712J9181961K3473520K2519015
$$ 20193478 23845622 29325469 37926471 51263183 70445144 93918664 116437679
12070A16437679J4847565L570112n906970q632463m046255L818857Q692659O557980
$$ 116437679 131285244 134855356 128948386 120315923 116269668 120088525 128781184 135339164
12062A35339164k445637j3560682k1143997k2700071j9597072j4573851r932515
$$ 135339164 132893527 119332845 98188848 75488777 55891705 41317854 31385339
12055C1385339o501126m297473l004846k201836j644555j265652r37192n83648
$$ 31385339 24884213 20586740 17581894 15380058 13735503 12469851 11532659 10949011
12047A0949011l87996m15421o41368q63150r81089r57347q25355o31028m75868
$$ 10949011 10561015 10145594 9504226 8641076 7659987 6702640 5877285 5246257 4770389
12038D770389l88226k64393k05961k01869j74239j48861j73500j22830o3887o5756
$$ 4770389 4382163 4117770 3911809 3709940 3535701 3386840 3213340 3090510 3026623 2960867
12028B960867p2823j11314r2069r1115m6482n1463m2495j8324q307M323L51k3464
$$ 2960867 2888044 2776730 2684661 2593546 2547064 2495601 2453106 2434782 2426475 2430798 2431149 2407685
12016B407685n5599o1701j02010q2883n030j1717k3803j1696k0432m8471p8654
$$ 2407685 2352086 2290385 2188375 2105492 2100462 2088745 2064942 2053246 2032814 1984343 1905689
12005A905689n0531j3488m4866l5803l8047l748k6960m7287j8545L181M0238m216
$$ 1905689 1855158 1841670 1796804 1761001 1722954 1719206 1692246 1644959 1626414 1629595 1669833 1665617
11993A665617l3053k9826k2945J085L5581N4749K6447P110J7534J3555M0729K2504
$$ 1665617 1632564 1602738 1579793 1580878 1616459 1671208 1697655 1704765 1722299 1735854 1776583 1799087
11981A799087K0641J9693j7761n0340l6997l6632o8016l1643r690o0377p1040
$$ 1799087 1819728 1839421 1821660 1771320 1734323 1697691 1629675 1598032 1588342 1527965 1456925
11970A456925r2945m6151k7351k1733j2038n8841m5175l3285l6096O865j4716
$$ 1456925 1363980 1317829 1290478 1268745 1256707 1197866 1152691 1119406 1083310 1090175 1075459
11959A075459R287j7037k0667l820L7441j5872k0657k2379k9467j0312L6586J2348
$$ 1075459 1084746 1067709 1047042 1043222 1080663 1064791 1044134 1021755 992288 981976 1018562 1030910
11947A030910k420O365j0770k13k3191k9035l5925l4659l3798r079J1896J2300
$$ 1030910 1028490 1034855 1024085 1023872 1000681 971646 935721 901062 867264 858185 870081 882381
11935H82381j1740l0625l9095Q979J4126K698j7723j1065j4662L0369L6841J5644
$$ 882381 870641 840016 800921 809900 824026 826724 809001 797936 783274 813643 850484 866128
11923H66128l56k1436L149l93K2378L1356p359L315P330J6910j020j2435l7497
$$ 866128 865772 844336 847485 847092 869470 900826 893467 896782 904112 921022 920002 907567 870070
11910H70070r420L84k4775k734J3023P033j0544N228P349P263N311O717n5405
$$ 870070 860650 861034 836259 833525 846548 853581 843037 848265 855614 862877 868188 874905 819500
11897H19500l1613j460J6060M6175O033k8809o721J2651R233j0241K2187M695
$$ 819500 787887 786427 802487 848662 854695 825886 819165 831816 841049 830808 852995 857690
11885H57690J3437j2318l0374k4462J9815L0336J9352j9287j3424o966k8151n6371
$$ 857690 871127 858809 828435 803973 823788 854124 873476 854189 840765 833799 805648 749277
11873G49277L1463L832l2145j4623K3437J8966M524N894k0583j8291j1261K9183
$$ 749277 780740 784572 752427 737804 761241 780207 784731 790625 770042 751751 740490 769673
11861G69673P403m3310o73K4061l4524k0267K363R45N384j5733L3157L1482q79
$$ 769673 777076 733766 733093 757154 722630 702363 704726 705671 711055 695322 728479 759961 759082
11848G59082m5536p49P005o397K3984L254j7467L5482M1418O1388K3748k1397
$$ 759082 713546 712797 719802 713405 737389 740643 723176 758658 800076 861464 885212 863815
11836H63815n0638l2179j1442P375j2600O18K4328j1973N060k5076o1138m9395
$$ 863815 813177 780998 769556 776931 764331 764949 789277 777304 782364 757288 696150 646755
11824F46755m2999q196L1868n919O62q451J3710L752L7352K7190K1822Q748K0396
$$ 646755 603756 595560 627428 621509 622171 613720 627430 631182 668534 695724 717546 726294 746690
11811G46690R411J2784p894k7865j5903n1823l8181j5631k6430j03M783J601J2207
$$ 746690 756101 768885 760991 733126 717223 665400 627219 611588 585158 585055 589838 591439 603646
11798F03646Q510j075r264R697J1091j7962R90P384o506L2298K2382k4249k7225
$$ 603646 612156 611081 601817 611514 622605 604643 605633 613017 606511 638809 661191 636942 609717
11785F09717O488J3168J9485K8761k8572J370j3183L2149N5264M8034L9408P664
$$ 609717 616205 629373 648858 677619 649047 650417 637234 669383 724647 772681 812089 819753
11773H19753L315J7580L541j0530K7704R1312J21687N4869K2709k2743l7660p6118
$$ 819753 823068 840648 844189 833659 861363 952675 1074362 1129231 1151940 1129197 1091537 1015419
11761A015419q7405o4917k9989l3931n8033k8527L365J3300P4538R7303J19477
$$ 1015419 928014 863097 833108 799177 741144 712617 715982 729282 803820 901123 1020600
11750A020600J24239R2126O2464O0187O4427J9436o960n6350o7295n8515n2767
$$ 1020600 1144839 1236965 1299429 1359616 1424043 1443479 1436519 1380169 1312874 1254359 1201592
11739A201592k4076k7028O401J401k4247J9489K9308M3718J0175m5842p7374r7190
$$ 1201592 1177516 1150488 1156889 1158290 1134043 1153532 1182840 1226558 1236733 1190891 1113517 1016327
11727A016327n6188k5766l0651k4673J3138K4455K4060o975J8641K0081k94K0119
$$ 1016327 960139 934373 903722 879049 892187 916642 940702 933727 952368 972449 972155 992274
11715I92274k6622K8335L3624L6893P0401P0468N4581M7801L8791L4755L2490
$$ 992274 965652 993987 1027611 1064504 1134905 1205373 1259954 1307755 1346546 1381301 1413791
11704A413791O3086J08778J62705K63753L82390O98007J158656J905507K673056
$$ 1413791 1476877 1585655 1748360 2012113 2394503 3092510 4251166 6156673 8829729
11695H829729K691181J281032q13635k192755k517759k086427j429350q54833
$$ 8829729 11520910 12801942 11988307 9795552 7277793 5191366 3762016 2907183
11687B907183m98511k73171k10134j31369n2471p6878j03833o0125j3724K6756
$$ 2907183 2408672 2135501 1925367 1793998 1741527 1664649 1560816 1500691 1486967 1513723
11677A513723N9343R4263Q8014J5555p6797o0198p3276n1525l7540K1428J5503
$$ 1513723 1573066 1667329 1755343 1770898 1694101 1633903 1560627 1509102 1471562 1492990 1508493
11666A508493l4324l6179L478J1626M9153M9748L2561K6111L0168P1602O1120
$$ 1508493 1474169 1437990 1441468 1453094 1502247 1551995 1584556 1610667 1640835 1712437 1773557
11655A773557K5187K350P2779J03246J20939J18032J52542J51781J89177J63639
$$ 1773557 1798744 1801094 1873873 1977119 2098058 2216090 2368632 2520413 2709590 2873229
11645B873229R9584R3903J09665J32339J48068J94702K31899K52673K31027K09661
$$ 2873229 2972813 3066716 3176381 3308720 3456788 3651490 3883389 4136062 4367089 4576750
11635D576750J47546J13057J48245K11450K37299L16015L92554N43367O87831
$$ 4576750 4724296 4837353 4985598 5197048 5434347 5750362 6142916 6686283 7374114
11626G374114Q39099J019927J187852J443609J854499K542138L477085M470796
$$ 7374114 8213213 9233140 10420992 11864601 13719100 16261238 19738323 24209119
11618B4209119N386733O727592R726208J5879966K7145727M6810541P4597567
$$ 24209119 29595852 36323444 46049652 61929618 89075345 135885886 210483453
11611B10483453R4120430Q3320284K3364932m2654178p9642741q4822385o7252843
$$ 210483453 304603883 387924167 411289099 368634921 288992180 204169795 136916952
11604A36916952m5121983k7209047j5960264r907460o946384n552139m685503
$$ 136916952 91794969 64585922 48625658 38718198 31771814 26219675 21534172
11597B1534172l892694l072504k326513j856280j440360j111175q75536p31656
$$ 21534172 17641478 14568974 12242461 10386181 8945821 7834646 6959110 6227454
11589F227454o05725m62221k61934j00828l7537k21788m83374n85291n00170l85727
$$ 6227454 5621729 5159508 4897574 4796746 4759209 4537421 4054047 3468756 2968586 2582859
11579B582859k91717j78589j52938j06764j05199p5501p6199j10859q0333p3950
$$ 2582859 2291142 2112553 1959615 1852851 1747652 1672151 1595952 1485093 1404760 1330810
11569A330810m0458m4082p1418o9038o4997p7729j01796p4302m1580J085L3384
$$ 1330810 1290352 1246270 1174852 1105814 1040817 963088 861292 786990 745410 746495 779879
11558G79879N3765L3830L3356p902l3646n4962l6824l9048q1374r3146l811m6179
$$ 779879 833644 867474 900830 892928 859282 804320 767496 728448 647074 553928 550117 503938
11546E03938m7768l9321k0157j3836l5631o1999j3964M5953K9544O032j0219l6790
$$ 503938 456170 416849 396692 382856 347225 285226 271262 317215 346759 352791 342572 305782
11534C05782j3662j4633j8716m5701J0001k5989o001Q415k8912n177M7190R54
$$ 305782 292120 277487 258771 213070 223071 197082 191081 199496 170584 165407 212597 213551
11522B13551l9826k5007J5759Q196J0925k2256q96J9658K381n606k8486m0436
$$ 213551 173725 148718 164477 172673 183598 161342 160446 180104 182485 176879 148393 107957
11510A07957J8794M404r256j4590o49K1350J1310J720m1185N639J0406p702M803
$$ 107957 126751 131155 121899 107309 106660 128010 139320 141040 99855 105494 115900 108198 113001
11497A13001K733L2177M6134J1984O422J5285K4264O2238Q1561M8352K0360n1457
$$ 113001 115734 147911 194045 206029 212451 227736 252000 314238 395799 444151 464511 413054
11485D13054o7005o3834l2745P055k6003q415l3224l0161l134r23O16L241n6203
$$ 413054 346049 282215 249470 256525 230522 222107 188883 158722 155588 154665 155281 158522 102319
11472A02319k9491m0590j3590J8363K1930N0542O7079L2033J4707K5284n044j9828
$$ 102319 72828 32238 18648 37011 58941 109483 176562 208595 223302 248586 243542 223714
11460B23714K559l513k7984k3769n25k3784k4011O889K25n71R841M6769O996J6252
$$ 223714 226273 222760 194776 171007 170482 146698 122687 129576 129801 129230 139071 185840 192836 209088
11446B09088j1332l1122m961o228k0434k9559J1916J3637r282P095q873j2816
$$ 209088 197756 166634 161673 155445 135011 105452 117368 131005 121723 128818 119945 107129
11434A07129O381k954n169m587K7677R031j3172R5K1448o113O700l9583r516j8488
$$ 107129 113510 110556 105387 100800 128477 137508 124336 124431 145879 139766 146466 106883 97367 78879
11420G8879m0738N7695K9966K452k5174P831j838j2249M049j9973l4013N396P930
$$ 78879 38141 95836 125802 128254 103080 110911 109073 96824 100873 80900 46887 52283 60213
11407F0213m4506J5261K9630M5222K0752r328j3547L551M5903J2492o8065l3726
$$ 60213 15707 30968 60598 105820 126572 117244 103697 107248 153151 165643 97578 63852
11395F3852j9153Q84q175o361j5908n463K7475K214m621k9780R162j053J841m282
$$ 63852 44699 45583 37408 31047 15139 9676 37151 39365 34744 4964 14126 13073 14914 10632
11381A0632J1047J75l685K9018L9321q676j9187J8628J354j8539Q907J445k2424
$$ 10632 21679 21854 18169 47187 86508 77832 58645 77273 78627 60088 68995 70440 48016
11368D8016N955J5662J2045l138l4079j7430j7403m944N528K3509j9334j1499
$$ 48016 53971 69633 81678 78540 44461 27031 9628 4684 10212 33721 14387 2888
11356B888K429L1269k732k2806j583j1963j7151O231J2405J875k2302O297J0420
$$ 2888 5317 36586 33854 11048 9465 -2498 -19649 -13418 -1013 862 -21440 -15143 -4723
11343d723k3980L6441k1180k5128J2698L0611L4119l52K932k779k4990k801M3186
$$ -4723 -28703 7738 -13442 -38570 -25872 4739 38858 38506 41438 38659 13669 10868 54054
11330E4054P9908P69m2047j6573J7813q517j6284l1169P721J8183o911R925K6298
$$ 54054 133962 134731 92684 76111 93924 85407 69123 37954 45675 63858 56947 66872 93170
11317I3170J7238m4978j2302K8671Q486N509J7616r001l2662j1515k416j2224
$$ 93170 110408 65430 53128 81799 90285 95794 113410 104409 71747 60232 57816 45592
11305D5592l7099Q110K9190L7242p567j9852L6265R044r691j0693J1274N3735
$$ 45592 8493 16603 45793 83035 75468 55616 91881 100925 91234 80541 91815 145550
11293A45550O1364R9020K37163L15999K69837J63293K5461l3278j67470k68685
$$ 145550 206914 305934 543097 859096 1128933 1292226 1317687 1284409 1116939 848254
11283H48254k57165j64179j27878j16518l7429L898j92n565J903j8306Q199q54
$$ 848254 591089 426910 299032 182514 145085 148983 148791 143226 145129 126823 135022 134168
11271A34168l5450l7313m392p918l7402j6674K1336L7354J8427j5591k9042l3333
$$ 134168 98718 61405 57013 49095 11693 -4981 16355 53709 72136 56545 27503 -5830
11259e830j358Q941R11K1197K0355J8732j3231J6287K37j5528j8330j9651j596
$$ -5830 -7188 1753 2664 23861 44216 62948 49717 66004 66241 50713 32383 12732 11136
11246A1136l1032p102K0595K7299q647M651K629j4292M791j3013k3282o219J3412
$$ 11136 -19896 -26998 -6403 20896 12249 16900 19529 5237 10028 -2985 -26267 -32486 -19074
11233a9074J5414K5171k126l438L3793J9796q238J5813k4547j8910k1082j6761
$$ -19074 -3660 21511 19385 15947 49740 69536 61298 77111 52564 33654 12572 -4189
11221d189R980J4707K9685J9892P539M629R592j7690l8379j3417j1916N389L2021
$$ -4189 5791 20498 50183 70075 77614 82243 91835 74145 35766 22349 10433 15822 47843
11208D7843N941J8056R51j2768J2732O203k8330l4252M777K2426n1684k4929L9736
$$ 47843 53784 71840 72791 60023 72755 78958 50628 16376 21153 43579 -8105 -33034 6702
11195F702M3987R739L601l7435L530N1519p043k614j0372L0089L8907L1464M005
$$ 6702 50689 60428 64029 26594 30124 81643 74600 71986 61614 91703 130610 162074 166079
11182A66079o379N2718K0460M3513M4999J25645K41673L14655K26707O5562O1921
$$ 166079 159700 212418 232878 276391 321390 447035 688708 1003363 1230070 1295632 1357553
11171A357553J94399K32395J93196K75601L28788J91313n9565l55382n24302n07134
$$ 1357553 1551952 1784347 1977543 2253144 2581932 2773245 2713680 2358298 1833996 1326862
11161A326862l94296k56392j42536p4729j02491q5082j1971j0324m4036m9629
$$ 1326862 932566 676174 533638 458909 356418 271336 259365 249041 205005 155376
11151A55376l7449k3652L4027J7976j4121q680k4010m371Q078k0229j4574k0964
$$ 155376 117927 94275 128302 146278 132157 123477 99467 95096 103174 82945 68371 47407
11139D7407j2565k5595j991j5303K192K5258P997J1737J1014k479l137j7146J3671
$$ 47407 34842 9247 7256 -8047 -5855 19403 27400 39137 50151 47672 44535 27389 41060
11126D1060J2143l7002l5575M800M2327L1785j939l3382l5494K4329K7425j4009
$$ 41060 53203 16201 -19374 -14574 27753 59538 57599 24217 -11277 13052 40477 26468
11114B6468l052p440o131L089q642J7080J9513q566J4642n814l594J6411M8356
$$ 26468 23416 15976 9845 12934 4292 21372 40885 32319 46961 41147 37553 53964 102320
11101A02320j040k4563l1761q309J1201p482j1540J6716n83j2421K0651J6703
$$ 102320 101280 76717 44956 36647 47848 40366 28826 45542 44959 32538 53189 69892
11089F9892M5353M1315J9618O806k0612K3466J0366R431K3329j5895j5535m7334
$$ 69892 115245 156560 176178 182984 162372 185838 196204 205635 228964 213069 197534 150200
11077A50200k3708K2795p251p273K2147j7007o2831j0227N836j7916j6371M139
$$ 150200 126492 149287 142036 134763 156910 139903 77072 66845 72681 54765 38394 42533
11065D2533L599l2451k7390L4110k575m727K1898R918K7573r438J331M017R243
$$ 42533 46132 13681 -13709 20401 17826 13099 34997 44915 72488 63050 64381 68398 77641
11052G7641j1910k398J8242K4946J4842l1188k1282j70k7882j8046j4230q846
$$ 77641 65731 63333 81575 106521 121363 90175 68893 68723 40841 22795 8565 -281
11040b81J0440J8925K4808k8337J3087J0567k1380M21p323J2869L8008K7861j9293
$$ -281 10159 29084 53892 25555 38642 49209 27829 28250 20927 33796 71804 99665 80372
11027H0372k2045k8810N315j3331K6386J1945o988N228K3106N2312K4826M7348
$$ 80372 58327 29517 34832 21501 47887 59832 52844 58072 81178 133490 158316 205664
11015B05664J7694N832M8952Q4541L8106q347n0491n4723p8813n3140m7325j0686
$$ 205664 223358 229190 278142 362683 400789 392442 341951 287228 208415 155275 107950 97264
11003I7264J7791K486r678j2622l5894O620P970R090m2656l0580m6398J4998K6507
$$ 97264 115055 117541 107863 95241 59347 65967 73937 83027 40371 9791 -36607 -21609 4898
10990D898J0307K7346o140m470j3649p413j174N376M6923Q805k4146j6911R90
$$ 4898 15205 42551 36411 31941 18292 10879 9705 15081 62004 70809 46663 29752 30742
10977C0742J0168k3338k4165l126M4250M647k0469j1754L4473K3279k0543l1603
$$ 30742 40910 17572 -6593 -9719 34531 39178 18709 6955 41428 64707 44164 12561
10965A2561J9661K8702k6845k2247j0446O67K7111K7399k6727j9958m053j0802
$$ 12561 32222 60924 34079 11832 1386 2053 29164 56563 29836 9878 5825 -4977
10953d977j5249J9508J0512j8412l003J3994K7462K1978k1294j8211j5573Q28
$$ -4977 -20226 -718 9794 -8618 -11621 2373 29835 51813 30519 12308 -3265 -2437
10941b437J0462Q857l0144L897K3525M392L253n873j1927R897l6516M416m066
$$ -2437 8025 16882 -13262 -9365 14160 18552 21805 15932 4005 13902 -22614 -18198 -22264
10928b2264J4917p629K0461K8774J9431Nl6702q999P650k4074R166J2125P418
$$ -22264 -7347 -14976 5485 34259 53690 53695 16993 7994 15644 -8430 736 12861 20279
10915B0279j1465k2299k1920Q637m374M188L8220L87J903k2135L071J6918R532
$$ 20279 8814 -13485 -35405 -26768 -31142 -26954 11266 11653 13556 -8579 -5508 11410 20942
10902B0942R223r595o698K0478l754J3421O955o483R401J5744j4858n5605K5484
$$ 20942 30165 20570 13872 34350 30596 44017 50972 44489 53890 69634 54776 -829 24655
10889B4655N8767K3962p394j6290R868J8643j9137m2307K061k3532q946L791o283
$$ 24655 83422 107384 99990 83700 93568 112211 93074 50767 52828 29296 20350 24141 17858
10876A7858J8108M8154j1300j5369j9771P443r430P218N99m509l862j2588P761
$$ 17858 35966 84120 72820 57451 37680 45123 35693 42911 43510 39001 35139 22551 30312
10863C0312K7964J9009k2255l3501P929o629j4801L23K9751j7748m4910j9072
$$ 30312 58276 77285 55030 21529 29458 22829 8028 8351 38102 20354 -24556 -43628
10851d3628O9633M1335k2925j9782m3637j9005j3821J5788M0279K5338j711P103
$$ -43628 26005 67340 44415 24633 -19004 -38009 -51830 -36042 4237 29575 27864 34967
10839C4967k2240k2588n271N784k0487k5546J0334M1674L3483N4782l7868m4821
$$ 34967 12727 -9861 -15132 -9348 -29835 -55381 -45047 -3373 30110 84892 47024 2203
10827B203J1695j8038j4722o559J5806J7337q262K1404M368k9385p785J9841m434
$$ 2203 13898 -4140 -18862 -25421 -9615 7722 -540 20864 25232 -4153 -11938 7903 3469
10814C469M052n7519j7117M4506L2076J3788j6027k295Q615j8294J5858N2923
$$ 3469 7521 -49998 -67115 -22609 9467 23255 7228 4933 13548 -4746 11112 64035
10802F4035J2907k5679l333j2496L0745J5561l049n240m2586l422Q989j2819K49
$$ 64035 76942 51263 47930 35434 66179 81740 78691 73451 30865 27443 36432 23613 23862
10789B3862J5087O160R613K0424o597J1017O081k8865q151k3676M396L0695K268
$$ 23862 38949 45109 54722 75146 68549 79566 85647 56782 48631 24955 29351 60046 62314
10776F2314r207k8262M336L1958j4941k8976J1964M2356k0980k7303P897J8366
$$ 62314 53107 24845 29181 61139 46198 17222 29186 71542 50562 23259 31156 49522
10764D9522M966l446l084R240q597J257o192m208K0455M8158j64l1566l350M1081
$$ 49522 54488 51042 47958 57198 48601 49858 43666 39458 59913 108071 107907 76341 72991 114072
10750A14072J06408J46324J38815n8430j13605j08382j09542n3919l2688L819
$$ 114072 220480 366804 505619 447189 333584 225202 115660 61741 29053 32872
10740C2872l108k4117P701q745L308K3335k1739k6301K1178K3485J08j418k5377
$$ 32872 29764 5647 13348 4603 7911 31246 9507 -16794 4384 27869 27977 26559 1182
10727A182m6169j1764J4054K2509K4832J6491P188j5099J8562Q924J8401l9798
$$ 1182 -44987 -56751 -42697 -20188 4644 21135 28323 13224 31786 40710 59111 19313
10715A9313j5649P263k96K6716p114q118p365M649N511J6482k6374k8725k331
$$ 19313 3664 10927 10631 37347 30233 22115 14750 19399 24910 41392 15018 -13707 -16038
10702a6038J6759p236n0068J2123N9061J4215L2719J8077j3457k2741l5501K3
$$ -16038 721 -6515 -56583 -44460 14601 28816 61535 79612 66155 43414 7913 7936
10690G936L5122J4208M8718O999k0130l6640K5138M2649l2743l7327j7666k0467
$$ 7936 43058 57266 105984 112983 92853 56213 81351 124000 91257 53930 36264 15797
10678A5797k9139L843l7092O825J3834M2656L4636q646j1431J9035j4989o732
$$ 15797 -13342 -9499 -46591 -39766 -25932 16724 51360 42714 31283 50318 35329 28597
10666B8597L9951K5582j8216l5381j5731K5223j9361k8435j2661M57J5819j9485
$$ 28597 68548 94130 75914 40533 24802 50025 30664 2229 -10432 -9975 5844 -13641
10654a3641J6840J1980r771L7513J9158l267k6780k3125P019N502J0485k0255
$$ -13641 3199 15179 5408 42921 62079 58812 32032 8907 15926 21428 31913 11658
10642A1658o125P840J2906J0663k1311J3504K8998j0704j2350k5687J3920p220
$$ 11658 5533 13373 26279 36942 15631 29135 58133 47429 35079 9392 23312 16092
10630A6092J05O948L1530m970k4347k3862K1853L9817P84q820J6758K2222n706
$$ 16092 16197 23145 54675 49705 25358 1496 23349 63166 63950 55130 71888 94110 88404
10617H8404J2142K7075l706n58j474k8134k2921m462J1033k4666j2221N552K0564
$$ 88404 100546 127621 123915 123357 121883 93749 70828 66366 77399 52733 40512 46064 66628
10604F6628j4774m5054k4277L0053J4804m3071q896j8482j7067M9960K7806O720
$$ 66628 51854 6800 -17477 12576 27380 -15691 -24587 -43069 -60136 -10176 17630 24350
10592B4350J1672o462o98K5882K8276k048k2054k3683Q911K3055J0604J4816j6278
$$ 24350 36022 29560 28862 54744 83020 80972 58918 35235 44146 67201 77805 92621 76343
10579G6343L7673j8921m7867J5542K0857j093N553J8699Q430m3751j0661J9673
$$ 76343 114016 95095 47228 62770 83627 82534 88087 106786 115216 71465 60804 80477
10567H0477R539N627L2280l097k9622l8409j1114j3682j3294j4999j859K484K7113
$$ 80477 90016 95643 127923 124826 95204 56795 45681 31999 18705 3706 1847 4331 31444
10554C1444K5991L7148J9193j3769l049q562j5276j4819J3389J1592J7591o858
$$ 31444 57435 94583 113776 100007 96958 88396 73120 58301 71690 83282 100873 94015
10542I4015k0450j1155m5785R602K2654m621q937j1785k910m359m21J0242Q838
$$ 94015 73565 62410 16625 26227 48881 44260 35323 23538 20628 16269 15848 26090 34928
10529C4928j489j127M597J4230L0627j4047r710m833j7712K7408J8170q096l9208
$$ 34928 33439 32312 36909 51139 81766 67719 58009 53176 35464 62872 81042 72946 33738
10516C3738q408p117j4120K3059j5024N549J8131M18K4470J1259m685k050R171
$$ 33738 25330 18213 4093 27152 12128 17677 35808 36226 60696 71955 67270 65220 74391
10503G4391J2259J90J8062r85j6924j1773m860p348q309J931p810j0891j0041
$$ 74391 86650 86840 104902 103917 86993 75220 70360 63012 54703 56634 48824 37933 27892
10490B7892M037J8458k3287j0335K9965K6717M832j465l0515J5319J0170J4626
$$ 27892 31929 50387 27100 16765 46730 73447 78279 76814 46299 61618 71788 86414
10478H6414L602l3451n2124k496K2853K5261n176j4342K3371K2936O536k9350
$$ 86414 90016 56565 4441 1945 24798 50059 44883 30541 53912 76848 83384 54034
10466E4034k8484j0753J7417r228j472L283j9738J1460J9517j174R417L7150O382
$$ 54034 25550 14797 32214 22986 21514 24797 5059 16519 36036 34862 44279 81429 87811
10453H7811q022K325k313J9952l9312n4685j573J5992K9242j702q132R394m789
$$ 87811 79789 82114 79801 99753 60441 5756 4183 20175 49417 47715 39583 48977 44188
10440D4188j0617J0143K423J4444k2500k5684j843J14k3709J613M0838j3093j2838
$$ 44188 33571 43714 46137 60581 38081 12397 10554 10668 -13041 -11428 29410 16317 3479
10427C479P40k2688R067J8858m498J0683J9595K815k7180k212J6494J9302K3113
$$ 3479 4219 -18469 -9402 9456 4958 15641 35236 38051 10871 8659 25153 44455 67568
10414F7568L662P323M7064j4496m5600R596J7665k2005j5983M968Q140l611q848
$$ 67568 71230 78553 125617 111121 65521 75117 92782 70777 54794 59762 67902 64291 55443
10401E5443j7850M733J1539j6016j1223K919K536K3949K0673k0964O426J9072
$$ 55443 37593 42326 53865 37849 26626 29545 32081 56030 76703 55739 62165 81237
10389H1237j0112j0928k290p772n4243K7658J5407J602r648l415K296L5148K9801
$$ 81237 71125 60197 57907 50135 -4108 23550 38957 40559 30911 27496 29792 64940 94741
10376I4741k7377k5607J4828k0514K0375J8233J1549j5953J3291K7808J0037k4041
$$ 94741 67364 41757 56585 36071 56446 74679 86228 70275 83566 111374 121411 97370
10364I7370n0024K494N177l3797j9978O461j6274L9090J1997o744j4171p595K0490
$$ 97370 47346 49840 55017 21220 1242 7703 -8571 30519 42516 35772 21601 14006 34496
10351C4496n712r074q346L235K0966J0548K3163M7263j174k9963j2260j2211K2451
$$ 34496 28784 19710 11364 14599 35565 46113 69276 116539 115365 85402 73142 60931 83382
10338H3382k132k0424J0445J5014J1360k2016j68l8009j7417l949P934R66o090
$$ 83382 81250 60826 71271 86285 97645 75629 75461 37452 20035 16086 24020 24986 18896
10325A8896K2407P744P779j2555l5230J076P243M1244J2357j7665R233L007k4006
$$ 18896 41303 49047 56826 44271 9041 10117 17360 58604 70961 53296 62529 65536 41530
10312D1530j1255l6214J4537m071K5278R442j6029J8031L5982Q134l7222j7154
$$ 41530 30275 -5939 8598 4527 29805 39247 23218 41249 77231 85365 48143 30989
10300C0989P894j465L569p373L76K2944k1846J2904p135k2174N156L96J2405l7547
$$ 30989 38883 37418 40987 33614 33990 56934 35088 47992 40857 18683 23839 24235 36640 -907
10286i07L239M3115r090j2168l11J8744K0066n417J4621J2405j7529O643N132
$$ -907 2332 45447 36357 24189 23878 42622 62688 57271 71892 84297 66768 73411 78543
10273G8543r932J1R657J7944q978l5743k9572j5710L5280L0854J2373J3457K4274
$$ 78543 68611 68622 78279 96223 87245 51502 21930 6220 41500 72354 84727 98184 122458
10260A22458k6132l1350J6425M341n060K324j5262j5995J0862K6410l3227k8675
$$ 122458 96326 64976 81401 85742 80682 83006 67744 51749 62611 89021 55794 27119
10248B7119l280K4758J5582K6261q153N307j7052J9067j488k4158J4437K986k8313
$$ 27119 23839 48597 64179 90440 82287 87594 70542 89609 88121 63963 78400 81386 53073
10235E3073j937L2340L4262J8813k84o8774r431J3403K589J9715J3149L351J563
$$ 53073 51136 83476 117738 136551 136267 67493 58062 71465 74054 93769 106918 110269 111832
10222A11832j2617q016r70J1386L0809J9871N400K6440J4644J9266J5777M0514
$$ 111832 99215 91199 90229 101615 132424 152295 157695 184135 198779 218045 233822 274336
10210B74336P3646J46884J93360K64024K69208J64110J47964K37052J37127m3781
$$ 274336 347982 494866 688226 952250 1221458 1385568 1533532 1770584 1907711 1863930
10200A863930j59095j56177j53147k13772k42757k28789j75038j29533p6279r3838
$$ 1863930 1704835 1548658 1395511 1181739 938982 710193 535155 405622 329343 235505
10190B35505n6457o566j261o99j8805l4390k5947n564N982k0584j4845r48M7428
$$ 235505 179048 172482 171221 170522 151717 117327 91380 85816 91798 71214 56369 55421 102849
10177A02849J3572n202m5020O277J4387j2797j4612j0397J2866p919P434J4421
$$ 102849 116421 111219 66199 72476 86863 74066 59454 49057 61923 54004 61438 75859
10165G5859j5561K4839k5101J554K5655k7061k035Q963j1050q338L946J1075J112
$$ 75859 60298 85137 60036 61590 87245 60184 58149 67112 56062 47724 51670 62745 63857
10152F3857M916j8257r802j1690l0188J4534L8088J911j1238l7599J4649M639
$$ 63857 68773 50516 40714 29024 -1164 13370 51458 53369 42131 4532 19181 23820
10140B3820O063K44o201j7850J5317K408L4123K5709K2226j1469l2509k101j1094
$$ 23820 29883 30127 23926 6076 21393 23801 57924 83633 105859 94390 61881 59780 48686
10127D8686q705J4909M9577P761K7802M2463m4727p5389j7083j5082J5884K2243
$$ 48686 39981 54890 104467 112228 140030 182493 137766 62377 45294 30212 46096 68339
10115F8339K9959j251m586n559j0152N934j3804k2930M0735r005M532nM376p07
$$ 68339 98298 97047 92461 86902 76750 82684 68880 45950 86685 77680 82212 82207 86583 85876
10101H5876N578L6285J7305j4459k0389L532q893k8711j3042j2189J0075M2561
$$ 85876 91454 127739 145044 130585 110196 113728 104835 76124 63082 50893 60968 103529
10089A03529L0898q812m1750j7920l418J9336J384L590J809N831P815K161k5208
$$ 103529 134427 125615 83865 65945 62527 81863 83247 86837 88646 94477 102292 104453 79245
10076G9245K0157n11k8262o617P001P24O924K2667J9684k6493l7572k7529l1906
$$ 79245 99402 98891 70629 64012 71013 71737 78661 101328 121012 94519 56947 29418 -2488
10063b488J4507L8910J6096k2038l820k682L572Q006L4498K779k8092m1682J2472
$$ -2488 12019 50929 67025 44987 41167 38485 42057 50063 84561 87340 59248 17566 30038
10050C0038O9039L2938j941r788j627M6026J8589m2759m6985k0245o770j7484
$$ 30038 99077 132015 130074 120286 118659 164685 183274 140515 93530 73285 66515 49031
10038D9031j7089q03m104j4125J6176K7928K5178K0339J4825k939p699j5193j6537
$$ 49031 31942 31139 27035 12910 29086 57014 82192 102531 117356 114417 106718 91525 74988
10025G4988L4537K0835k9026k369O458j5766K558J3360J8130j7462q284Q928J0676
$$ 74988 109525 130360 101334 98965 105423 89657 92215 105575 123705 106243 97959 106887 117563
10012A17563J666l974R420j6609o1065q165L7995P577r826R255J2038K849q399
$$ 117563 119229 115255 124675 108066 47001 38836 76831 84408 74582 83837 95875 98724 90325
9999I0325k3778j4293j0289K4655J1272m298J588J2288j20o370L9990j0735m6890
$$ 90325 66547 52254 41965 66620 77892 73594 75182 87470 87350 80980 120970 110235 63345
9986F3345k576J4414p51j0484o045K2941p227j2693K6154L2004K0270m9729k7172
$$ 63345 60769 75183 74432 63948 57903 80844 73617 60924 87078 119082 139352 89623 62451
9973F2451L1078L7812J7037k3163k9128J0782K1714k7313l178K586J3649m291
$$ 62451 93529 131341 148378 125215 96087 106869 128583 101270 98092 100678 114327 110036
9961A10036q345l139L4454K322j4044P821J1982m7811P012J8275j1165j8275R194
$$ 110036 101691 98552 133006 135328 121284 129105 141087 93276 100288 118563 107398 89123 98317
9948I8317L0399k0338j7201K845O252P729m538j297K1081P064k4478J5606J2390
$$ 98317 128716 108378 91177 94022 100274 108003 103465 102168 123249 130313 105835 121441 133831
9935A33831k369n678j8548J0045J9529r584r821K324j3318j0244j8608r742L9491
$$ 133831 131462 125784 107236 117281 136810 127226 117405 119729 106411 96167 77559 67817 107308
9922A07308J4690k1732j0166k435j5780K142l44K9925K9881O22K2187j160K1372
$$ 107308 121998 100266 90100 87665 71885 74027 73683 103608 133489 134111 156298 155138 176510
9909A76510r399k6798l3412l2809N451J3395K6571Q793M214l5848j4932k8710
$$ 176510 167111 140313 106901 74092 79543 92938 119509 128302 132516 96668 81736 53026
9897E3026L4958M41K5375L5205j710j2206N3868J08048J32702J871o5212n6048
$$ 53026 87984 88425 113800 149005 147295 135089 188957 297005 429707 431578 366366 310318
9885C10318m3369m0617n1155M832L0235k963l598r103n377j8410k3390k6615K1900
$$ 310318 266949 226332 175177 180009 210244 207281 203683 194580 189203 170793 147403 120788 142688
9872A42688M4880J36J3587N975j0162j837k2779j2413q516l3082l7741J6449J0058
$$ 142688 187568 187704 201291 207266 197104 195267 172488 160075 151559 118477 80736 97185 107243
9859A07243O502J2408K9032K131l98N292K3560O325k0227k12j1280j5767J59K3343
$$ 107243 113745 126153 155185 157316 156918 162210 185770 192095 171868 171656 160376 144609 144768 168111
9845A68111J4256l3155o966R33L979k0855m8207r505K2098J0677O451J7003J0571
$$ 168111 182367 149212 142246 143179 147158 126303 78096 68591 90689 101366 107817 124820 135391
9832A35391J2135J4190j2357L029Q382K2149O129k6496k1686K7332K0962K7549
$$ 135391 147526 161716 149359 152388 160770 182919 189048 162552 140866 168198 189160 216709
9820B16709J920m2681j8898j4964L0181J1848l8062j1211N069p430j0987J9026
$$ 216709 218629 175948 157050 142086 172267 184115 146053 134842 139911 132481 121494 140520
9808A40520M1890J346l78p648q882P422J2118j3228j7015k923j6733j291K888
$$ 140520 182410 183756 183378 175730 166848 174270 186388 173160 156145 153222 136489 135198 138086
9795A38086J6134J942R415O446q480J903N267k4878J3981K4029J4188j753J6214
$$ 138086 154220 156162 165577 172023 163543 165446 170713 145835 159816 183845 198033 196280 212494
9782B12494K0061l139N880k7188R070K0462k2459l2355N204J7736L6903j3749
$$ 212494 232555 229416 235296 208108 217178 237640 215181 182826 188030 205766 242669 228920
9770B28920m9240j1033k99K2291K9481l4380m0490j204K210l1194k8859L434L2689
$$ 228920 179680 168647 168348 190639 220120 185740 145250 144046 146256 115062 86203 89637 122326
9757A22326K6005j224K8439O143j0688P832k5094l3880K0933K4905J2841j1443
$$ 122326 148331 147107 175546 181689 171001 178833 153739 119859 140792 165697 178538 167095
9745A67095O096J2461l3255j633j94K4457J9312Q71R84J6710K036k1673j1420
$$ 167095 173191 185652 152397 150764 150570 175027 194339 195210 196194 212904 214940 193267 181847
9732A81847j3481J9462L7520l7777l0816J3799L4842l368k8778j2113o962j8706
$$ 181847 168366 187828 225348 187571 156755 170554 205396 202028 173250 161137 154175 135469
9720A35469J8469J6752k4732J7530L5694J1838L8377j780k2942l0935j5691M5
$$ 135469 153938 170690 145958 163488 199182 211020 249397 247617 224675 193740 178049 178094
9708A78094k679R171l6656J6517L1792J7688O115k4535J5108L9154o2k7514k6903
$$ 178094 175415 184586 147930 164447 196239 213927 220042 195507 210615 249769 249707 222193 195290
9695A95290j9066K629J1726K8534L2105J2844n4080j1277K5042r74J7821P336
$$ 195290 176224 178853 190579 219113 251218 264062 209982 198705 223747 222773 240594 247930
9683B47930k8687n095R586q857j1015K2862K1834k2118J5837L7567k2393l9926
$$ 247930 219243 214148 223734 214877 203862 226724 248558 226440 242277 279844 257451 217525
9671B17525L0248R175J8428L594r20j8133l711k135K0179J8176j7719j671P235
$$ 217525 247773 256948 275376 278970 278050 259917 256206 254071 274250 292426 274707 273036 280271
9658B80271J7784j631j1748K6019J3697j4677n6810m229J6975K9621J3287j2751
$$ 280271 298055 296424 284676 310695 324392 309715 252905 248676 265651 295272 308559 295808
9646B95808K976K3569j5872j9658J4507q555j9554n682O90j884K7737m401j2130
$$ 295808 298784 322353 306481 286823 301330 292775 273221 267539 268229 266345 294082 289681 277551
9633B77551l504J3205J5279q041l0523r202J5741L3523P701j8591k3862p123K9823
$$ 277551 274047 287252 302531 294490 263967 254765 270506 304029 311730 293139 269277 262154 291977
9620B91977N207j3542l0654K415N809K1130j51p815j9185K8370J9704O271l170
$$ 291977 297184 283642 252988 255403 261212 282342 282191 274376 255191 283561 303265 309536 306366
9607C06366q530j6274l6657j5647J6620K5943l309m3184M4300N4808k5732r606
$$ 306366 297836 281562 244905 229258 245878 271821 268512 225328 269628 324436 298704 289098
9595B89098K6960n394K928k6044k0872l8382J3368P5827L2659j2725m5893k381
$$ 289098 316058 310664 313592 287548 266676 228294 241662 317489 350148 337423 291530 289149
9583B89149J8801J4360J6538j5175q471L8867M498k5369O258Q870K4299O861j2931
$$ 289149 307950 322310 338848 323673 315202 354069 358567 333198 339456 348326 372625 379486 366555
9570C66555j2464l354J0161J5226j5855p458k6244n048J5239R612k257j7343k055
$$ 366555 354091 350737 360898 376124 360269 352811 326567 321519 336758 346370 344113 326770 324715
9557C24715n715M0195J2565k916J2391r539O219j9414k8498k660P1735J2305k4387
$$ 324715 319000 359195 371760 368844 381235 371696 377915 358501 330003 327343 399078 411383 386996
9544C86996k4519l7075l606o693j4258J6290M924J7568J3327m10K7310J6755q911
$$ 386996 362477 325402 321796 315103 300845 317135 322059 339627 352954 352544 379854 396609 387698
9531C87698J146j890l1378R410J9446N859r997R976L2026J2452J1494N224p345
$$ 387698 388844 386954 355576 364986 384432 390291 380294 390270 422296 434748 446242 451466 444121
9518D44121k9283j9330J0712K0567N0089M7778j8844k3465k7339K468O910n748
$$ 444121 414838 395508 406220 426787 476876 524654 505810 482345 455006 457474 464384 458636
9506D58636j4290N611m294l0844j9063R036K8912P0409J5472J7617j9250k3587
$$ 458636 444346 449957 445663 414819 395756 404792 433704 504113 519585 537202 517952 494365
9494D94365k1754J5234J7307j1565q964j1776j6760J4067J1578k154O658p953
$$ 494365 472611 487845 505152 493587 484623 472847 456087 470154 481732 479578 486236 478283
9482D78283k1294L9845J3204j0163K047J1672J8366K324k9674J6502j9351L6957
$$ 478283 456989 496834 510038 499875 501922 513594 531960 534284 504610 521112 501761 538718
9470E38718J4011k6347J5237J3914J2865k8269j7982K5049M0938R929j8282R866
$$ 538718 552729 526382 541619 555533 568398 540129 522147 547196 588134 598063 579781 589647
9458E89647k3434o228m854N546o346j585N02J5094K853J6630K2202p465l6131
$$ 589647 566213 559985 555131 560677 554331 552746 553248 568342 571195 587825 610027 602562 566431
9445E66431o496l530q387j2003q377L1648J3540O015o926K4286J5782J2192q202
$$ 566431 559935 556405 548018 536015 527638 559286 572826 578841 571915 596201 611983 624175 615973
9432F15973j8392n369Q927K8936k919J0945j0680o417n120J3307L4913k0711k9477
$$ 615973 597581 592212 601139 630075 627156 638101 627421 621004 615884 629191 664104 643393 613916
9419F13916l307K8730M6214Q469j3358L0719J1901p134q951L999K3254j5944k1033
$$ 613916 610609 639339 685553 694022 680664 711383 723284 716150 707199 711198 734452 718508 697475
9406F97475P64K4188P943m207p380P685n425J4806o238N522L3317K9304k1961
$$ 697475 698239 722427 730370 726163 718783 726468 721043 735849 729611 735133 768450 797754 775793
9393G75793j8448K1693k1846j8244K6376J6445J9704j3205K3087K5150k0011J3412
$$ 775793 757345 779038 757192 738948 765324 781769 801473 788268 811355 836505 816494 829906
9381H29906J713m4727m3005L807K0614K5996j8225K378j91l1136J3448L1623L606
$$ 829906 831619 786892 743887 747694 768308 794304 776079 778457 778266 747130 760578 792201 795807
9368G95807N054J1575K1111j9272P702j9005p841J4606J6998K8374M0691N520
$$ 795807 800861 812436 833547 814275 821977 802972 795131 809737 826735 855109 895800 901320
9356I01320k9127Q114l0718k2226J0232K987M550J0756L6893R351k273J1355J1460
$$ 901320 872193 880307 849589 827363 837595 840582 845132 855888 892781 902132 899859 911214 922674
9343I22674j6016P065k6683K5337J4641k2099l165O69Q99j603J1014J5867O691
$$ 922674 906658 913723 887040 912377 927018 904919 901754 902423 903322 901719 912733 928600 935291
9330I35291M740O629J7318o295m301N886M465J3852J3042j995q840j4583l3295
$$ 935291 940031 946660 963978 957683 953382 959268 963733 977585 990627 988632 979792 965209 931914
9317I31914R680K835o339p527J5250m297L52J1854n289K9923K1519j1567j0803
$$ 931914 941594 944429 938090 930563 945813 941516 941868 953722 948433 978356 999875 988308 977505
9304I77505j0175l750J9007l449j8272J3304j9965j6346k952J1856L2504K2112
$$ 977505 967330 963580 982587 979138 960866 974170 954205 937859 934907 946763 979267 1001379
9292A001379J0554K310P842k2626j9337K3852L1973m845q856J5784J3980J2957
$$ 1001379 1011933 1014243 1022085 999459 980122 1003974 1035947 1031102 1022246 1038030 1052010 1064967
9280A064967j6051R517j1837m0565J3950j2282J8580L7281j161k8538j1057j5449
$$ 1064967 1048916 1058433 1046596 1006031 1019981 1007699 1026279 1063560 1062399 1033861 1022804 1007355
9268A007355l369k4299K2979L6265K0983J0607r970m8091l0215m046J0896M683
$$ 1007355 1003986 979687 1002666 1038931 1059914 1070521 1060551 1012460 982245 978199 989095 993778
9256I93778K5550l906o685r867j0252K8267j7944n2104J2866Q611Q530k313K0106
$$ 993778 1019328 1015422 1008737 998870 988618 1016885 998941 946837 959703 968314 976844 974531 994637
9243I94637o437q94m016j2285J3944K17l5916m105K0302m720k6735q293Q156j5135
$$ 994637 988200 987306 983290 971005 984949 985166 949250 945145 965447 960727 933992 925699 933855 918720
9229I18720O868L769k8962r463m074p770Q857j1849j5192K4463q903K1588J1320
$$ 918720 925588 929357 900395 890932 886858 879088 887945 876096 860904 885367 876464 898052 909372
9216I09372o037j6711p128J330j0226j5610J1432J3577l8158J5514K4544k2159
$$ 909372 903335 886624 879496 880826 870600 854990 866422 879999 841841 857355 881899 859740
9204H59740k3880l0551j3786m765O403K6769K6200J7854j5115r0n112O73l65m8451
$$ 859740 835860 805309 791523 786758 793161 819930 846130 863984 848869 848779 843667 844340 843975 795524
9190G95524j7244J7965k1367r870P754l229j3423j9216k9079L435J0262M989J9682
$$ 795524 778280 796245 774878 765008 772762 769533 756110 736894 707815 711250 721512 726501 746183
9177G46183K3613j9498l0277r595P21J3327Q209m203k158J1536k1993j9293q612
$$ 746183 769796 750298 720021 710426 711147 724474 732683 728480 726322 737858 715865 696572 687960
9164F87960J6769k7651j2471K2043Q416J163j4197l6921l2199K3987L5010j1640
$$ 687960 704729 677078 664607 686650 695066 696229 682032 645111 612912 636899 671909 660269
9152F60269j6631j481n444j4249J746n300O987k2152k8087m7241K3009K6886L424
$$ 660269 643638 642157 636713 622464 624210 618910 625897 603745 575658 528417 551426 578312 581736
9139E81736K3986K4791Q634k4491l3658j7230l558k1120O947p415j4519j1462
$$ 581736 605722 630513 639147 614656 580998 563768 560210 539090 546037 538622 524103 512641
9127E12641r143M1995q883K831l658J9465q551j0459J6500K384o160r483M2653
$$ 512641 503498 545493 536610 539441 535783 555248 546697 536238 552738 555122 548962 539479 582132
9114E82132L4470P33l2703j0670j1658n931O407l0228J889l52r388m5755j7123
$$ 582132 616602 617335 584632 573962 562304 556373 562780 532552 534441 534089 524701 478946 461823
9101D61823Q994J0826r783L606O684o949j2577K234K9610J503m1854n307q263
$$ 461823 470817 481643 471860 475466 482150 475201 462624 464858 494468 495971 454117 448810 440547
9088D40547J5346k252n351k0905N115J7467j5136j467l255K3614n012l2445K147
$$ 440547 455893 453641 448290 427385 432500 449967 434831 433364 430109 453723 448711 416266 418413
9075D18413n619M7511n000m2463j1557l4298l8090K5524j951q15J3311K2088k1260
$$ 418413 412794 460305 455305 412842 401285 366987 328897 354421 352470 351655 364966 387054 365794
9062C65794k3299J990K5424J4213j2784K908o166j7841K996j0799K2392J1453
$$ 365794 342495 344485 369909 384122 371338 374246 368080 350239 353235 342436 364828 376281
9050C76281O392k514k5017k9620p367J8372K2577l6367k9964l581J0724j8512
$$ 376281 382673 380159 355142 325522 318155 336527 359104 322737 292773 289192 299916 281404
9038B81404J2886K9107l4692N74K9882k3489p540J4736k252r306j0151m749J5693
$$ 281404 294290 323397 288705 289279 319161 295672 288132 302868 300616 291310 281159 276410 292103
9025B92103O278l0151q755J6036Q294n66k2137L589J7865q311j363j1204j4524
$$ 292103 298381 268230 259475 275511 283805 283239 261102 264691 282556 274245 272882 261678 247154
9012B47154J1232J1834j2683M509k5368M325O972R031J640J5124m023k2253K0678
$$ 247154 258386 270220 257537 262046 236678 241003 247975 257006 258646 273770 269747 247494 268172
8999B68172o975N523J1825N271K3203k1444k4885n946J5057L1130J18n750k895
$$ 268172 261197 266720 278545 283816 307019 285575 260690 254744 269801 300931 301049 295299 292404
8986B92404l0084j7477l0736l8717k996K7143L3595K138k0103K724L5746m125
$$ 292404 262320 244843 214107 175390 172394 199537 233132 235270 215167 217891 253637 249512
8974B49512j0414j7354Q113J8741J304N73L7120j707m877r944k0025k4279J2650
$$ 249512 239098 221744 229857 248598 249902 250475 287595 285888 281011 271067 251042 226763 239413
8961B39413O1102Q163k5319m9317l4975l5213N869M5337J9538R581k595j2429
$$ 239413 300515 308678 283359 234042 199067 163854 169723 215060 234598 244179 241584 229155
8949B29155K7994l2k9044J735k8959P383O876p368j0812K1014L5276J3614j6282
$$ 229155 257149 257117 228073 229808 200849 208232 215108 207740 196928 217942 253218 266832 250550
8936B50550m9434j4416J1652K2684o030j6334m373m838J052j6860J0277O0715
$$ 250550 201116 186700 198352 221036 215006 198672 194299 189461 190513 173653 183930 244645
8924B44645J9949l4253K7001K8505k5172k8143L5819P590l739k4545K8379N1869
$$ 244645 264594 230341 257342 285847 260675 232532 268351 275941 272202 247657 276036 327905
8912C27905J7160l915J6558J93j5361k5944j5411l9266j2228J5147L3496L745
$$ 327905 345065 341150 357708 357901 342540 316596 301185 261919 249691 264838 298334 302079
8900C02079M163R599l521N510K5884N1319L9426K1075O725K9598M4643N2619P3990
$$ 302079 306242 315841 312320 317830 343714 395033 434459 455534 462259 491857 536500 589119 663109
8887F63109J06530J18213Q1209O6517P8673P8478N6480Q8214J56613K91844M83331
$$ 663109 769639 887852 969061 1035578 1114251 1192729 1249209 1337423 1494036 1785880 2269211
8876B269211O99909J125266J909611L098640M351145L339441n77300l027667l550344
$$ 2269211 2969120 4094386 6003997 9102637 13453782 16793223 16215923 13188256 9637912
8867I637912l084748k101480j249360p65858m82162l02131k10538j83884j19454
$$ 9637912 6553164 4451684 3202324 2436466 1954304 1652173 1441635 1257751 1138297
8858A138297j48582q7941q0852n3232p1439o9758q5504q9306n9260j7328m3180
$$ 1138297 989715 901774 820922 767690 696251 626493 540989 451683 392423 375095 331915
8847C31915n7466l9640j2484k2391j1618k3174J9256R29l278k1582q512L3280
$$ 331915 274449 234809 222325 199934 188316 165142 184398 185327 182049 160467 151955 185235
8835A85235M152l322R254J3824m3942j5635K9990L5209J3280J318l4348j9455
$$ 185235 189387 186065 195319 209143 165201 149566 179556 214765 228045 229363 195015 175560
8823A75560J9673j0600j1799q016k1177l603R92K056j7873r790p211K2273K373
$$ 175560 195233 184633 172834 164818 143641 140038 141030 143086 125213 115423 108212 130485 132858
8810A32858k0326k6226j8848M698R611J6916K5025J8542j5699L476K2910k6916
$$ 132858 112532 86306 67458 72156 81767 98683 123708 142250 126551 130027 152937 126021
8798A26021k0838K177k0863n792J8267k993k2617J6503K6387J753j960l790M464
$$ 126021 105183 107360 86497 80705 98972 95979 73362 89865 116252 118005 116045 112255 116719
8785A16719K7010R139j1058J3642K2654O20J6451m925k5939p516l6404l8141o866
$$ 116719 143729 152868 141810 155452 178106 178726 195177 190252 164313 156797 120393 82252 75386
8772G5386P264J0825J7603L8077j3405j3838l1002j1768J9546J1923j7235l5479
$$ 75386 82650 93475 111078 149155 135750 121912 90910 79142 98688 110611 93376 57897
8760E7897j6723K3964n138j6452k6750L5920L6186O31p951j0611o275N036J99
$$ 57897 41174 65138 60000 43548 16798 52718 88904 89535 81584 70973 64698 69734 69933
8747F9933k1698R0Q137Q702L2809q38k6272j2582o032j4908J5847J2384l741L0144
$$ 69933 48235 48325 56462 65164 97973 97135 70863 58281 52249 37341 53188 65572 61831 91975
8733I1975J9447K2598L291k3295k3160q325J403L1778M937J9643q631j9296L2975
$$ 91975 111422 134020 137311 114016 90856 82531 83934 115712 120649 140292 131661 112365 145340
8720A45340m692j616k6278j8865j5376j9565k6551N670L394j0566j2123K3103
$$ 145340 140648 139032 112754 93889 78513 58948 32397 38067 41461 30895 18772 41875
8708D1875K1014L7744N1514m292n8398j6587J9106L88j3645K0988P488j5825j5413
$$ 41875 62889 100633 152147 147855 89457 72870 91976 92364 78719 99707 107195 91370 75957
8695G5957j168K3613q459j2997O353L622J6226J9811J5350j8265k2212j3631L884
$$ 75957 74789 98402 89943 76946 83299 86921 103147 122958 138308 120043 97831 84200 88084
8682H8084L4129j5255k0018K0567j5919M078J0499j9772J417K5504J3897N584
$$ 88084 122213 106958 86940 107507 91588 95666 106165 86393 87810 113314 127211 132795
8670A32795j8312K5054l760m8198j9081K1598j5541l785p096k286j5884J2602
$$ 132795 114483 139537 135777 87579 68498 90096 74555 70770 63674 61388 45504 58106
8658E8106m341L6684o638J0684j548l0876L933K7900l335l95R450q573J4088L5131
$$ 58106 53765 90449 83811 94495 92947 62071 66004 93904 90569 90174 99624 91051 105139 140270
8644A40270k7182j8937L2468P086J876l988J07L058L6339J7803l5336l5189n652
$$ 140270 113088 94151 126619 133705 135581 131593 131700 134758 171097 188900 153564 118375 112723
8631A12723J4849K0482j0284j5403k1689K484L8038Q426j2282k580J2970K2658
$$ 112723 127572 148054 137770 122367 100678 103162 141200 149626 137344 134764 147734 170392
8619A70392N095J7001J6887J9067m854P225k6649K3589M849j4295q743R141q965
$$ 170392 175487 192488 209375 228442 223588 230813 204164 227753 232602 218307 209564 218705 209740
8606B09740M147j2104Q69k893l560K4272K0981J6136K6163M6061p537r406O4395
$$ 209740 213887 201783 202652 199759 196199 220471 241452 257588 283751 329812 322275 312869 377264
8593C77264L3200j3520l0321J2218L3275P388k6986n1414k5477k5390l8080k3860
$$ 377264 410464 396944 366623 378841 412116 419504 392518 341104 315627 290237 252157 228297
8581B28297l3376k8322l0505k3961J9924Q205j3920o856J6372j0625r469k080
$$ 228297 194921 166599 136094 112133 132057 140262 126342 119486 135858 125233 115764 113684
8569A13684j8006j7303L498K6828k4917n8175L6072J7933K511o324j8708j7500
$$ 113684 95678 78375 81873 108701 83784 25609 61681 79614 82125 75801 57093 39593
8557C9593k6993l5876L1755J2710K0300J9652M3003J1935J2134Q587j1763k3520
$$ 39593 12600 -23276 8479 21189 41489 61141 104144 116079 128213 136800 125037 101517
8545A01517m1036r697j30K3121K3308R006Q885K3444J5397K9993l618K2911N6533
$$ 101517 60481 50784 50654 73775 97083 106089 114974 138418 153815 183808 180190 203101 259634
8532B59634O8783N5364j0377l8328m2856l9660l8203n1557j1822l838l9757n5787
$$ 259634 328417 383781 373404 335076 292220 252560 214357 162800 150978 147140 107383 51596
8520E1596J6008K3987k4542j3588M6013j520k3299L761J7960J5495j4446k7385
$$ 51596 67604 91591 67049 53461 99474 97954 74655 78416 96376 111871 97425 70040
8508G0040Q604K9636J4258k683K271K3719O8411M5645j6211k7010l2432N296O516
$$ 70040 78644 108280 122538 119855 122126 145845 214256 259901 243690 216680 184248 189544 196060
8495A96060o68Q1324J08164P3462N3469q348o9175j38962j25029m1635l8928k4221
$$ 196060 195392 276716 384880 458342 511811 503463 434288 295326 170297 128662 89734 65513
8483F5513J6535k1893P802L158j1223j0570k209o350N723M940r669o647L1222
$$ 65513 82048 60155 67957 71115 59892 49322 47113 40763 46486 51426 41757 35110 66332
8470F6332K0403J6738J2917O597k6160o8338j0813K662j3544j4837J5474J6741
$$ 66332 86735 103473 116390 122987 96827 28489 17676 20338 6794 -8043 7431 24172
8458B4172j5521O713J2926J8789K7874J3466J839k0351q546J5396r960j7236l738
$$ 24172 8651 15364 28290 47079 74953 88419 90258 69907 61361 76757 66797 49561 45823
8445D5823q028j9518j7242j0183P717j2482j4138J6704J7934J5120n794k818J3105
$$ 45823 37795 18277 1035 -9148 -1431 -13913 -28051 -11347 6587 21707 15913 13095 26200
8432B6200j8733P046j5973l949K1356R228J0294j9917k417r401J274k8914j5687
$$ 26200 7467 14513 -1460 -5409 15947 25175 35469 15552 13135 3734 5008 -23906 -39593
8419c9593p089L6618O2373K0514n4492j8479k087O292j045j8829J014L1621N43
$$ -39593 -46682 -10064 52309 72823 18331 -148 -2235 4057 3012 -15817 -14803 16818 17361
8406A7361j8556J1269j617p486m0614p885L3211P1230J7237o7000k3721K8852
$$ 17361 -1195 10074 8457 971 -39643 -47528 -14317 56913 74150 7150 -16571 12281
8394A2281j2187j3468m044N896J297K5578J1953K6938O761j779k755l3031K1208
$$ 12281 94 -13374 -17418 -11522 -10225 15353 27306 54244 61005 59226 56471 23440 44648
8381D4648q572j0794j7098l189K1932J801J1148o320Q312N82K2925j9388n0879
$$ 44648 36076 25282 8184 4995 26927 28728 39876 33556 41868 42450 65375 45987 -4892
8368d892L807p110J4695k241L4126O181R514m211m630l7593K2347n650O122K962
$$ -4892 -1085 -8195 6500 4259 38385 44566 54080 49869 45239 7646 29993 24343 30465 33427
8354C3427j2997J215L1233q54r737K0621J1845j4889O248K2098j6167q996J2917
$$ 33427 20430 21645 52878 52024 42287 62908 74753 59864 66112 88210 72043 63047 75964
8341G5964p374j7418k5938k2113P9908Q9748P0593J02300R9641J04136N1033m2331
$$ 75964 68590 51172 25234 3121 83029 172777 243370 345670 445311 549447 600480 558149
8329E58149j22492j05731o3040o7124n6406k9566p927k7230j202N004k9160J0133
$$ 558149 435657 329926 266886 199762 143356 113790 105863 78633 77431 82435 53275 63408
8317F3408K122j8160J7221J9623M23j8598m248j7539K3242J1557J3626N083k2294
$$ 63408 65530 47370 64591 84214 84637 66039 61791 44252 67494 79051 92677 97760 75466
8304G5466R856L51j8062m824O728k6511K5594L6260J9706K089n563Q941L8854
$$ 75466 85322 85673 67611 62787 69515 43004 68598 104858 124564 126653 121090 130031 168885
8291A68885P1794R0138R2264Q1517M6635J223n0080j04957r7074q7707m1274l4461
$$ 168885 240679 330817 423081 504598 551233 552456 502376 397419 300345 212638 171364 136903
8279A36903l2833j5955l1207l271j3589l6889P552L2383J0433K901j9011k9907
$$ 136903 104070 88115 56908 53637 40048 3159 10711 43094 53527 56428 37417 7510
8267G510K124l973m47k4520K107P826j7596J4598J2384J8016j3055N429K9352
$$ 7510 9634 5661 5214 -19306 -17199 -9373 -26969 -12371 13 18029 4974 10403 39755
8254C9755j3285m0658k6302J5137L5295M3877P322J0199J3761K651j8042j0200
$$ 39755 26470 -14188 -40490 -25353 9942 53819 61141 71340 85101 87752 69710 59510
8242E9510l4095j8071K9820M001Q428j2964j4820o074K7824K1599j1728l0968
$$ 59510 25415 7344 37164 41165 49593 36629 21809 15735 43559 65158 53430 22462
8230B2462k3322K5677J4173j7717M679k0832k9602L738l758K7746J1476O872M991
$$ 22462 -860 24817 38990 21273 25952 5120 -24482 -20744 -24502 3244 14720 21592 26583
8217B6583J3267r161l0087l3192J4917o784R468k755m2999L3069L8027j3793K1844
$$ 26583 39850 30689 602 -32590 -17673 -24457 -14989 -17744 -60743 -27674 10353 -3440 18404
8204A8404j079k2690N133q410q972K9688J6240K5423J5438o509n1390j6993R102
$$ 18404 17325 -5365 -232 -8642 -17614 12074 28314 53737 69175 62666 11276 -5717 3385
8191C385k26j11k3245k0126L3461k0611J1950J2706j3640L486K1128J4394K815
$$ 3385 3159 3048 -20197 -40323 -6862 -27473 -15523 -2817 -16457 -12971 8157 22551 25366
8178B5366j5426K3017R387k5566j4176M980L4057J6015l0779k8889j2276R760
$$ 25366 9940 32957 42344 16778 2602 7582 41639 57654 26875 -2014 -14290 -4530
8166d530L2037N327l730K814K554p100j370p608L8264M2978l207k3511k3966L335
$$ -4530 27507 32834 29104 31918 34472 27372 26002 18394 56658 99636 96429 72918 48952 52287
8152E2287j6575k1178o992L391J521r007j3876M845L6618M285n498m973j5174
$$ 52287 35712 14534 7542 10933 12454 3447 -10429 -5584 31034 35319 29821 24848 9674
8139I674k4489j0565p711J8825L7942K0613m5258k5233Q728L2000K7067Q133k2323
$$ 9674 -14815 -25380 -33091 -14266 23676 44289 -969 -26202 -17474 14526 41593 49726 27403
8126B7403o596J3221J6911L499n5490m8298J063P968j2594M5170M1600J3713J6509
$$ 27403 20807 34028 50939 54438 -1052 -49350 -48287 -40319 -52913 -7743 33857 47570 64079
8113F4079n08j9668n783r912j2560m6652j6187K5984J0189K5937j7376J3628K4877
$$ 64079 63571 43903 38120 28208 15648 -31004 -47191 -21207 -11018 14919 -2457 11171 36048
8100C6048k5802m497M624j7273j9891r737P765j1856J9780Q018j9783j4157L2445
$$ 36048 10246 5749 10373 -6900 -26791 -36528 -28763 -40619 -20839 -12821 -32604 -46761 -14316
8087a4316n424j0022m767j2431J7247J2336j8827m416M1879J3867J0160l7551
$$ -14316 -19740 -29762 -34529 -46960 -29713 -17377 -36204 -40620 1259 15126 25286 -12265
8075a2265j7373k2733O343M1286K7106K5715k989p81M520O453k6641j1389k209
$$ -12265 -29638 -52371 -46028 -4742 22364 48079 45090 44309 48829 55282 28641 17252 15043
8062A5043q168k900m728K735M8212M1625K0236K2608k2285k4295J0622k7490m0055
$$ 15043 6875 3975 -753 1982 50194 91819 112055 134663 112378 88083 98705 71215 31160
8049C1160j9665J930P832K1520K386K294M257l2431J145J7705J8085J4543j2356
$$ 31160 11495 13425 21257 42777 45163 47457 51714 19283 20428 38133 56218 70761 58405
8036E8405l5708l0760j174M1344M1328K0345j0379N331L0672l396m3677m3146
$$ 58405 22697 -8063 -9237 32107 73435 93780 83401 88732 119404 116008 72331 29185
8024B9185o667M8063L4312M739r708n92J8005l809P073K812j1911O979K8334J1560
$$ 29185 22518 70581 104893 109632 99924 99332 117337 113528 120601 123413 111502 118481 146815 158375
8010A58375L392j4458l0251L2283L5102K4751J4612L4819o053j2330l0768j4148
$$ 158375 161767 147309 117058 149341 184443 209194 223806 258625 252572 240242 209474 195326
7998A95326N540m775j3926q887K3212Q073r777m064L8514Q2P085K0039N3005Q9920
$$ 195326 200866 196091 182165 173278 196490 204563 194786 190722 229236 229318 236403 256442 309447 399367
7984C99367Q7714P5233N1455k1559q5820q6780q0016r2440o2297k9848J290o814
$$ 399367 487081 562314 613769 592210 506390 419610 339594 247154 184857 155009 156299 149485
7972A49485k5735m0944M567K137N844j5176j9524P338J5985J6453K2585K1517
$$ 149485 123750 82806 87373 89510 95354 80178 60654 67992 83977 100430 123015 144532
7960A44532j6978L335J0985J3504J5606k7001k2476K5679K8210k3124m882K9281
$$ 144532 127554 130889 141874 155378 170984 143983 121507 147186 175396 152272 147390 176671
7948A76671J5298k993O212K7388O6367O5149M1164N1836R5685P1306k5471p3470
$$ 176671 191969 188976 195188 222576 288943 354092 395256 447092 542777 614083 588612 515142
7936E15142j00600r3442r1020l4413n4277m3893k0175k0440k2055K4486J5351
$$ 515142 414542 321100 230080 195667 141390 97497 77322 56882 34827 59313 74664
7925G4664l918J519j0387L5917j7505k4474j3717j6150j318j6362k7050K129j9511
$$ 74664 70746 72265 61878 97795 80290 55816 42099 25949 24631 8269 -18781 -16652 -36163
7912c6163r900L5224M8936L1259j208k450P510m7514j2170J6169R015J1565k1550
$$ -36163 -46063 -10839 38097 69356 68148 65698 73208 25694 13524 29693 38708 50273 28723
7899B8723J3328q887j1036l957L972O557p887m61R679k0537K0043J5739j3950
$$ 28723 42051 33164 22128 18171 22143 28700 20813 20352 30031 9494 29537 45276 31326
7886C1326q4J1013j5902K679J5689K517K75j6243j0840P554J8541l4681k7287
$$ 31326 31242 42255 26353 29032 44721 47238 47513 31270 20430 27984 46525 11844 -15443
7873a5443J1890r177m7272j2053J5144K2530J5020J7897r158j7501J0547j6509
$$ -15443 -3553 -12730 -60002 -72055 -56911 -34381 -19361 -1464 -10622 -28123 -17576 -34085
7861c4085k5001P130L8731K2764R383r120l228Q8L828J1491l641n70k0489l592
$$ -34085 -59086 -51956 -13225 9539 18922 9802 6574 6662 10490 21981 18340 17770 -2719 -6311
7847f311p012r951J1486L2860O540k0458O172q23K4836J2315l9263m6374J8179
$$ -6311 -13323 -23274 -11788 21072 27612 7154 13326 12503 37339 49654 10391 -35983 -17804
7834a7804J4126J679L7905J825l0181P836J7021l8850n4632j215M940N353N037
$$ -17804 -3678 -1999 35906 37731 7550 15386 32407 -6443 -61075 -62290 -57350 -51997 -46960
7821d6960j1802J9569j0672O344M5754K3699J9013k7899k8702m29N348l2529R930
$$ -46960 -58762 -39193 -49865 -43521 2233 25932 44945 17046 -11656 -12085 -6737 -39266 -29336
7808b9336r680o275k1467M022O005K115N0879j367J6876J270K4815P62j4576o804
$$ -29336 -39016 -45291 -66758 -62736 -56731 -54616 -3737 -5104 11772 13042 37857 38619 24043 17239
7794A7239k2277k2191l762J4158m113m7037m4090K0118M2099L6419K6689j2595
$$ 17239 -5038 -27229 -30991 -16833 -20946 -67983 -112073 -91955 -49856 -13437 13252 657
7782F57r476R219o720M343Q756j2838k1324r631K054j270J2504J1882j0419l3786
$$ 657 -8819 400 -6320 -1977 6779 -6059 -27383 -37014 -34960 -36230 -23726 -11844 -22263 -56049
7768e6049L108L4647P851K9889j608o57k1373j5142J9826k5754k4684l8490P746
$$ -56049 -52941 -18294 -10443 19446 17838 17181 -4192 -19334 492 -25262 -49946 -88436 -80690
7755h0690J9696K5738K1059L2984j7216l6117m7043j0570K8921K9224J1048l889
$$ -80690 -60994 -35256 -14197 18787 1571 -34546 -81589 -92159 -63238 -34014 -22966 -26855
7743b6855L6423J7241K6774l036o254r249k9526j5504k8115j9527L948l5458q154
$$ -26855 9568 26809 53583 50547 44293 35044 5518 -9986 -38101 -57628 -53680 -89138 -97292
7730i7292K5238K9047L833K8492L3685n17J2594j1991j3089j7067R327k608J6300
$$ -97292 -72054 -43007 -39174 -10682 23003 22486 35080 23089 10000 -7067 2260 -348 15952
7717A5952K8931m941k4648k3439k5582j8260j7196O092N6482J9425j3064J2025
$$ 15952 44883 39942 15294 -8145 -33727 -51987 -69183 -63091 -6609 12816 -248 11777
7705A1777j127o368m2921l119J1366r229J4962L1119J2901l2734Q665O665J0772
$$ 11777 10650 4282 -38639 -41758 -30392 -39621 -24659 6460 19361 -13373 -4708 1957 12729
7692A2729j3466l2553l3985j4831p319K2139J0167J2333J8024L1066L0878L0556
$$ 12729 -737 -33290 -67275 -82106 -89425 -67286 -57119 -44786 -26762 4304 35182 65738
7680F5738M497k2414n6828j8673p106K776J3372M4667J7782m7921O914L0695m444
$$ 65738 70235 47821 -9007 -27680 -34786 -32010 -18638 26029 43811 -4110 2804 33499 29055
7667B9055k5004k2207k3148j1541J3832j4134j50m8927Q913O4255R588j4953j1811
$$ 29055 4051 -18156 -41304 -52845 -39013 -53147 -53297 -102224 -93311 -29056 -19468 -34421 -46232
7654d6232j2379q259J4746J811k8229k9627K531q179J5120L5541K7742K1616j0951
$$ -46232 -58611 -66870 -52124 -50313 -78542 -108169 -105638 -113817 -98697 -63156 -35414 -13798 -24749
7641b4749K0811k0681J6787P975O979J8935j1108q663p748j615j8349M768k45
$$ -24749 -3938 -24619 -7832 143 7122 26057 14949 6286 -1462 -3077 -21426 -16658 -16903
7628a6903k3185k6177O786J9535Q292j8638o580J1313K0988J9869J5555M2322
$$ -16903 -40088 -66265 -59479 -39944 -31652 -50290 -56870 -45557 -24569 -4700 10855 53177
7616E3177l912p0963l0491j5810R384k601K1223j8927Q005q683L581L351k3870
$$ 53177 49265 -21698 -52189 -67999 -58615 -61216 -39993 -58920 -50915 -59598 -56017 -52666 -76536
7603g6536j1453K5339L5276K5830l7858n279p467j3658M2767Q779J9914R35N034
$$ -76536 -87989 -62650 -27374 -1544 -39402 -44681 -52148 -65806 -23039 -14260 5654 6589 11623
7590A1623m0928R905J8956N57k0900O407j680Q988j4047m3918l4525L0562J2349
$$ 11623 -29305 -19400 -444 113 -20787 -14380 -16060 -7072 -21119 -65037 -99562 -69000 -56651
7577e6651n47K0041M622M796K3101L0552K6172J7723J0695j9018j6712j8249j1487
$$ -56651 -57198 -37157 -32535 -27739 -4638 25914 52086 69809 80504 61486 44774 26525 15038
7564A5038P834l3354k3098K0129J2326p014o239j8032l6102j4282K1965J8455
$$ 15038 22872 -10482 -33580 -13451 -1125 -8139 -14378 -32410 -68512 -82794 -60829 -42374
7552d2374M091K4952J1935J9159p499j1575r474j6444J3232M4552k4821l3700
$$ -42374 -38283 -13331 -1396 17763 10264 -1311 -10785 -27229 -13997 30555 5734 -27966
7540b7966k9933K0172L3390M711J1200j0654q147p898l4305o867N2300K547j4433
$$ -27966 -57899 -37727 -4337 374 11574 920 -7227 -15125 -49430 -56297 -3997 -1450 -15883
7527a5883j3886k2367J5889J2387N86K2879K8944k964J10J186l2912k0615J407
$$ -15883 -29769 -52136 -36247 -23860 -23274 -395 28549 25585 25695 26881 -6031 -26646 -25239
7514b5239J4873K484k2746M761l2505l0358O767K6713J8470Q053j9964M774M2247
$$ -25239 -10366 -7882 -30628 -25867 -58372 -88730 -81963 -55250 -36780 -28727 -48691 -43917 -1670
7501a670N668m926O950j6816L0075N822M942j6459k1498l0040k891k894J9718
$$ -1670 3998 -928 6022 -10794 19281 25103 30045 13586 -7912 -37952 -40843 -43737 -24019
7488b4019K6388K5689k4145o59K5185J6268m9771o2594O934L106k6188L1461J2182
$$ -24019 2369 28058 3913 3254 28439 44707 -5064 -67658 -60724 -57618 -83806 -52345 -40163
7475d0163N044L34j3530j1279j1905J4956J3481N747R274o885R198J2487j7512
$$ -40163 -35119 -34785 -48315 -59594 -71499 -56543 -43062 -37315 -28041 -34926 -25728 -13241 -30753
7462c0753j1361j7001j207K0672j808K5526K7181q871k0039j7283K718L6K5175
$$ -30753 -42114 -59115 -60322 -39650 -41458 -15932 11249 2378 -17661 -34944 -32226 -32190 -7015
7449g015r687l1415J1333J7972j1437k2089J8177J3890J1739O847n362l2395l624
$$ -7015 -16702 -48117 -36784 -18812 -30249 -52338 -34161 -20271 -8532 -1685 -7047 -39442 -43066
7436d3066n77O827J738K1779R909N480j7645k2696j8836M9083K2884k1003J0607
$$ -43066 -43643 -36816 -35078 -13299 -3390 2090 -15555 -38251 -57087 -8004 14880 -6123 4484
7423D484j6674j7749O74Q962j8358l516J61q995K309J4724l6536r088M274R338
$$ 4484 -12190 -29939 -29265 -20303 -38661 -42177 -42016 -51011 -48702 -33978 -70514 -79602 -75328 -65990
7409f5990J1009J0445K5693M8178n769n6911j9820K451M292r769K194J4218N264
$$ -65990 -54981 -44536 -18843 29335 23566 -33345 -53165 -50714 -46422 -56191 -53997 -39779 -34515
7396c4515k1559K9384M3988k6767r543j6492k2996L3073j165j3540l962K765M757
$$ -34515 -56074 -26690 17298 -9469 -19012 -35504 -58500 -25427 -26592 -40132 -44094 -41329 -36572
7383c6572p798j7027K3683K4012l0778l1280J1414L0297P521m622P456K0024J2769
$$ -36572 -44370 -61397 -37714 -13702 -44480 -75760 -64346 -34049 -26528 -31150 -23694 -3670 9099
7370I099J5844M236k8311o215j866K2248J6732k0555k380k0972l6078j4230K3151
$$ 9099 24943 29179 868 -5347 -7213 15035 31767 11212 8832 -12140 -48218 -62448 -39297
7357c9297r074j3337j918K5587m636k791K8030k532k7712O411n376N691J0955
$$ -39297 -48371 -61708 -63626 -38039 -42675 -45466 -17436 -19968 -47680 -41269 -46645 -40954 -29999
7344b9999J6925l293l461j7666j6067J8196RK955O016K216J5362O803k2656J6525
$$ -29999 -13074 -16367 -19828 -37494 -53561 -35365 -35356 -32401 -26385 -24169 -8807 -2004 -24660 -8135
7330h135L1942L7967n496l4107l9551l053N915P535K6610K2394J0371j4960j4549
$$ -8135 23807 61774 56278 22171 -17380 -20433 -14518 -6983 19627 42021 52392 37432 22883
7317B2883J7469j7270j0605N358j214r742N98j2929J0564R379j1693M88P68l8911
$$ 22883 40352 23082 12477 17835 16621 6879 7477 -5452 5112 14491 2798 3286 4054 -34857
7303c4857p053l074k4155j1492J3065M4654P4707K6774l1836n5070l3768R164
$$ -34857 -41910 -44984 -69139 -80631 -67566 -22912 51795 78569 46733 -8337 -42105 -32941
7291c2941o341r85K6292K3972J265J3348j7729l0434Q704R40K329k1244K954l0526
$$ -32941 -39282 -40267 -13975 9997 11262 24610 6881 -23553 -14849 -13909 -11580 -32824 -29870 -60396
7277f0396j3760K2730J9449L385j6168K5227P232j9107j7624N554L1700K701j7132
$$ -60396 -74156 -51426 -31977 -28592 -44760 -19533 -12301 -31408 -49032 -43478 -11778 -9077 -26209
7264b6209j8345J0836n977R482l833l432P9j3115L678O055L6517J6847j7210j0255
$$ -26209 -44554 -33718 -39695 -30213 -34046 -37478 -37399 -50514 -46836 -40781 -4264 12583 -4627 -14882
7250a4882L920k922O441j3257M225n441l9734R50K8667M240m4798k5790J9060
$$ -14882 -10962 -13884 -7443 -20700 -16475 -21916 -61650 -60700 -32033 -27793 -72591 -98381 -79321
7237g9321J714N1914L2184j0150j8187j6225K4260j0532L614J5269L0371J0197
$$ -79321 -77607 -25693 6491 -3659 -21846 -38071 -13811 -24343 -20729 -5460 24911 35108
7225C5108J0771Q479k4169m9762k0661k711q226k071J7686l1064k8834L287K8604
$$ 35108 45879 54358 30189 -19573 -40234 -42945 -51171 -53242 -35556 -66620 -95454 -92167 -63563
7212f3563L7167O705J9093L436k5334j6698k524J0395K5644J6456m988L309q325
$$ -63563 -26396 -19691 -598 2838 -22496 -39194 -41718 -31323 -5679 10777 5789 9098 773
7199G73q79J4354J5504K5817k8232j5200k2040J163J9484O326P447J2909q414
$$ 773 -106 14248 29752 55569 27337 12137 -9903 -8740 10744 17070 24517 37426 29012
7186B9012j2787j2488M291O785r751r767P219j7016M375j467k0690j5425k6599
$$ 29012 16225 3737 8028 14813 5062 -4705 2514 -14502 -10127 -11594 -32284 -47709 -74308
7173g4308k3128L8673L0176K4637j6706j0026J7891m939K965J6566l73j3587M813
$$ -74308 -97436 -58763 -28587 -3950 -20656 -30682 -12791 -17730 -14765 1801 1428 -12159 -7346
7160g346k9926j7111K6377K1765J4765j783Q18j1345l2186R346j552K6362K2898
$$ -7346 -37272 -54383 -28006 -6241 8524 6741 7559 -3786 -35972 -26626 -28178 -1816 21082
7147B1082j8815k9986n99l495j5125R266n476K7516J2561r03K0174K6576K2790
$$ 21082 2267 -27719 -28318 -31813 -46938 -37672 -43148 -15632 -3071 -3974 16200 42776 65566
7134F5566j0171k5646o143p19K1595j0814l8251J6075J412J8793K3982L7169j6088
$$ 65566 55395 29749 23606 22887 44482 33668 -4583 11492 12904 31697 55679 92848 76760
7121G6760l2524k2248j4472j2180K5539J5162j5200l9572J756L0146L2583R694
$$ 76760 44236 21988 7516 -4664 20875 36037 20837 -18735 -16979 13167 45750 55444
7109E5444k4029j8913j4108k0184L0304j4027j0410j6407K5281j5526k1048J4202
$$ 55444 31415 12502 -1606 -21790 8514 -5513 -15923 -32330 -7049 -22575 -43623 -29421
7097b9421J770J7083j0097l2900m591M798j7001N49L0709M5371j3483l1236m3221
$$ -29421 -27651 -10568 -20665 -53565 -58156 -53358 -70359 -69810 -39101 6270 -7213 -38449 -81670
7084h1670j8964j623K1096L9426J8119K2082p008k2519K3950m030J5577J4456
$$ -81670 -100634 -102257 -81161 -41735 -23616 -1534 -8542 -31061 -7111 -11141 4436 18892
7072A8892k6125j2437J397k1264j477J9309J9814r083P420K0969j2648k4850j1903
$$ 18892 -7233 -19670 -18273 -39537 -41014 -21705 -1891 -10974 -3554 17415 4767 -20083 -31986
7059c1986J3538L4494L930j4912l7160n615K6259M1923J717l5742Q613n289n612
$$ -31986 -18448 16046 19976 5064 -32096 -37711 -11452 30471 32188 -3554 5059 -230 -5842
7046e842N126j46OJ3409L803Q501J833k0098j7206k250J5293K0813J9875j7022
$$ -5842 -716 -862 -856 12553 16356 24857 26690 6592 -10614 -12864 2429 23242 43117 26095
7032B6095q887o874k9718m771p164K2020l895K6639K1318k2636k5863J8047J7037
$$ 26095 17208 10334 -19384 -24155 -31319 -9299 -13194 13445 34763 12127 -13736 4311 21348
7019B1348k5917o135J1393L539k9110J2472J3474j2322m2479l9625L0080N1354
$$ 21348 -4569 -10704 689 4228 -24882 -12410 1064 -11258 -53737 -93362 -63282 -11928
7007a1928K4317J0092M632K1386J523l9132M852NJ034n5352l2246J7905P320j5521
$$ -11928 12389 22481 27113 48499 50022 10890 15742 15747 16781 -38571 -70817 -52912 -45592 -61113
6993f1113p319r855J2840J0692J5101L8901m314J0414j229n353l411j823k0828
$$ -61113 -68432 -78287 -65447 -54755 -39654 -753 -5067 5347 4118 -1235 -4646 -6469 -27297
6980b7297k8264l410R940j0454J3079K5159L1585K456k1965k7372j6637N570k780
$$ -27297 -55561 -58971 -49031 -59485 -46406 -21247 10338 12794 -9171 -36543 -53180 -47610 -50390
6967e0390K5642M5676N056j8509K0931K0172n39l2436K434K083j4389L357K2032
$$ -50390 -24748 20928 25984 7475 28406 48578 48039 15603 18037 20120 5731 9088 31120
6954C1120J1143j1728q203l3738l626M3373J2142O9q459m5227k6268K831M3167
$$ 31120 42263 30535 22332 -11406 -15032 28341 40483 40552 32093 -13134 -39402 -36571 6596
6941F596K6370j3208K6660K209P906j3919k7648k4974j7521p500K0998K627K5634
$$ 6596 32966 19758 46418 48627 56533 42614 14966 -10008 -27529 -35029 -14031 -11404 14230
6928A4230M392j4519m0300j573q542q776q98K007k7255J6266N7414j363q660k8536
$$ 14230 18622 4103 -36197 -37770 -46312 -55088 -55986 -53979 -81234 -64968 -7554 -8917 -17577 -46113
6914d6113J0771l372j8235J2895K5885O596K1525O773K0962J6334j4529j4331
$$ -46113 -35342 -38714 -56949 -44054 -18169 -11573 9952 16725 37687 54021 39492 25161
6902B5161J6247j7837L334j1685k5978j1042J6932l312j3174k6830j7810J2421
$$ 25161 41408 23571 26905 15220 -10758 -21800 -4868 -8180 -21354 -48184 -65994 -53573
6890e3573J6380k6528p285K3351M279J0833K791L1661K8775k2771j7813m2438
$$ -53573 -37193 -63721 -71006 -47655 -43376 -32543 -29752 1909 30684 7913 -9900 -52338
6878e2338o127Q245O212J3849k2889k4877l5471J4116K5224n168q854K2392M2891
$$ -52338 -58465 -50220 -44008 -30159 -53048 -77925 -113396 -99280 -74056 -79224 -88078 -65686 -22795
6865b2795m163J1330p169j4204J0792M740j302m508j2437p742l38O88K5456K6340
$$ -22795 -26958 -15628 -22797 -37001 -26209 -21469 -22771 -27279 -39716 -47458 -47796 -47108 -21652 4688
6851D688l5090l4237j0434K6081M520r645J6678L36K5121k440k9601J1162P133
$$ 4688 -30402 -64639 -75073 -48992 -44472 -54117 -37439 -37103 -11982 -14422 -44023 -32861 -25728
6838b5728k5629J2684M355j222O272j999j8889J0920l885K3515J6789o187k3184
$$ -25728 -51357 -38673 -34318 -35540 -29268 -31267 -50156 -39236 -43121 -19606 -2817 -9004 -32188
6825c2188k976K0104K6600O829J3297L920k0914m1072k385J3544j0745q314k7736
$$ -32188 -35164 -15060 11540 18369 31666 35586 14672 -26400 -28785 -15241 -25986 -34300 -62036
6812f2036O017L6549o209j3751J0928K3110k7997k5574O679m106l592K6118J9363
$$ -62036 -56019 -19470 -25679 -39430 -28502 -5392 -33389 -58963 -52284 -56390 -59982 -33864 -14501
6799a4501J9316K1442l3266q641O446N0373l0119l1311N585m0936k5305L7944
$$ -14501 4815 26257 -7009 -15650 -9204 41169 11050 -20261 -14676 -55612 -80917 -42973
6787d2973M1018j8992j9483o405j9692J2456p237Q867L3705r622L3881J2319j5984
$$ -42973 -1955 -20947 -40430 -46835 -66527 -54071 -61308 -52441 -18736 -28358 5523 17842 1858
6774A858m855j5872R14l159k4405J1668K2090j6963q393K0702K720J1734J8800
$$ 1858 -2997 -18869 -17955 -21114 -45519 -33851 -11761 -28724 -37117 -16415 -13695 -1961 16839
6761A6839K0274J352r929k3529K5779M9097j655l0425k3543o268j4691l3280k2689
$$ 16839 37113 38465 28536 5007 30786 79883 78228 47803 24260 17992 3301 -29979 -52668
6748e2668q82M4011J3310j7950m260j7149K1026j040O15K5634k4657k1793J2531
$$ -52668 -53550 -9539 3771 -14179 -18439 -35588 -14562 -15602 -14987 10647 -14010 -35803 -23272
6735b3272J0699n73p639k1159j826Q232J3871J9144K7156k4578k0444J1257L3078
$$ -23272 -12573 -13146 -20785 -41944 -43770 -35538 -21667 -2523 24633 55 -20389 -9132 23946
6722B3946K4004p302l0564J2127K2515P4479O5673M455n7072l2341m6001j9981
$$ 23946 47950 40648 10084 22211 44726 119205 184878 189333 132261 99920 53919 33938
6710C3938n419j4835R215j5420n6554q678L2329j7989k1524n171J370P485M7764
$$ 33938 28519 13684 22899 7479 -49075 -57753 -25424 -43413 -64937 -70108 -68738 -61253 -13489
6697a3489R648j187K9169K2142P489o189k3832q828L031O440J5197P727k7131
$$ -13489 -3841 -5028 24141 46283 53772 47583 23751 14923 17954 24394 39591 47318 20187
6684B0187m961O203j7093L077j3777L3470P913j8218j0281l8965o43l758l9977
$$ 20187 15226 21429 4336 7413 -6364 27106 35019 16801 6520 -32445 -33088 -36846 -76823
6671g6823j949K2586K5167O861n161l267L3994R697k2732k584K8781l985j2062
$$ -76823 -78772 -56186 -31019 -24158 -29319 -32586 1408 11105 -11627 -14211 14570 10585 -1477
6658a477m0154k5314J0563q438K789Q516J7064j204K4652j3605R841L060j0112
$$ -1477 -41631 -66945 -56382 -64820 -62031 -53515 -36451 -37655 -13003 -26608 -16767 -13707 -23819
6645b3819j0211K31j8772j6578K2603J0286R764k8689j7912K2974J9007R305K1900
$$ -23819 -34030 -33799 -52571 -69149 -46546 -36260 -26496 -55185 -73097 -50123 -31116 -21811 89
6632H9l876m0612l7373R843k7715n079K4089L9871k931k6652K0209k0348k0543
$$ 89 -3787 -44399 -81772 -71929 -99644 -104723 -80634 -40763 -43694 -70346 -50137 -70485 -91028
6619i1028K6046J0778l959K9784k913j2318K1198L2570q002l1759J7327M4529
$$ -91028 -64982 -54204 -58163 -28379 -31292 -43610 -22412 10158 2156 -29603 -12276 32253
6607C2253M7602j7200m9737j3015k1810J6920L1653M695l2536m5412M503P01R576
$$ 32253 79855 62655 12918 -97 -21907 -4987 26666 31361 -1175 -46587 -42084 -41383 -31807
6594c1807K7747J7131j6358l53L744L7534j0293k3361O385j0400l3153J4126J7882
$$ -31807 -4060 13071 -3287 -3640 104 37638 27345 3984 10369 -31 -33184 -19058 -1176
6581a176j9429J4508j4293j8599j9139j428N444N112j2626q797j1201J3984N5493
$$ -1176 -20605 -6097 -20390 -38989 -58128 -59556 -54112 -49000 -61626 -70423 -81624 -67640 -12147
6568a2147L1390l8805m2679M711N842K5260K2400j1770J4097j2198k6326N487
$$ -12147 19243 -19562 -62241 -57530 -51688 -26428 -4028 -15798 -1701 -13899 -40225 -34738
6556c4738K6143m344j752j6833k7959K1051J2864o941J458k797o944p764K1314
$$ -34738 -8595 -12939 -14691 -31524 -59483 -38432 -25568 -32509 -31051 -33848 -40792 -48556 -27242
6543b7242L7560l825k4722k8776j1003l5458K3395K3351K1255L3774J977J1662
$$ -27242 10318 6493 -18229 -47005 -58008 -93466 -70071 -46720 -25465 8309 10286 21948
6531B1948P889j0109K422n176L648j210j9209j1373Q030l236o463l7922N78K8678
$$ 21948 29837 19728 22150 16974 20622 19412 203 -11170 -3140 -6376 -12839 -50761 -50183 -21505
6517b1505k482r102j9617J8312N7031J2775l07M769J0519p788n5225l260Q404
$$ -21505 -23987 -33089 -52706 -34394 22637 35412 35105 39874 50393 42605 -12620 -15880 -7476
6504g476k1701L219L5934J2870O982j1198K346M06j3689k1763l5964J2727K1734
$$ -7476 -29177 -25958 9976 22846 29828 18630 20976 21382 7693 -14070 -50034 -37307 -15573
6491a5573k816k8443J6785K2983p817n1971l522j3085J8595J9196k0977Q601M192
$$ -15573 -18389 -46832 -30047 -7064 -14881 -66852 -70374 -83459 -64864 -45668 -66645 -58044 -53852
6478e3852J4132Q69j8234K8376N4647j0820q647j7803n12r67k3397J70j0565j0641
$$ -53852 -39720 -38851 -57085 -28709 25938 15118 6471 -11332 -11844 -12811 -36208 -36038 -46603 -57244
6464e7244Q933K5473L8124j6801l0681j907J6973K8362l540k5660l1910j5578
$$ -57244 -48311 -22838 15286 -1515 -32196 -34103 -17130 11232 7692 -17968 -49878 -65456
6452f5456N297K5641j7653k2636N57J9977k8308L65M7565L1624P519j1013J4008
$$ -65456 -60159 -34518 -52171 -74807 -74250 -54273 -82581 -82216 -34651 -3027 4492 -6521 7487
6439G487j5740j549J1150m6192n4591J1937L4795J9342j4690P78J6118j6403J9333
$$ 7487 -8253 -9802 1348 -44844 -99435 -87498 -52703 -33361 -48051 -47273 -31155 -47558 -28225
6426b8225J7590K9169J1558j0833k6576o152n298k8392q48K1121J5382j9078J0072
$$ -28225 -10635 18534 30092 19259 -7317 -13469 -18767 -47159 -48007 -26886 -11504 -30582 -20510
6413b0510N7538J5153l5160j1803J6592j0712m256N50p154l5923p006K770p023
$$ -20510 37028 52181 17021 5218 21810 11098 6842 7392 238 -35685 -42691 -39921 -46944
6400d6944P163p189j968M04P963R258k934N0440P918n8212j2137j9602J9393K3842
$$ -46944 -39781 -46970 -48938 -48534 -40571 -31313 -34247 16193 24111 -34101 -46238 -65840 -46447 -22605
6386b2605j1731j5742o405K3834j0270j963O3701J1428l2156l3764m54Q583k1150
$$ -22605 -34336 -50078 -56483 -32649 -42919 -44882 18819 30247 -1909 -35673 -36127 -27544 -48694
6373d8694l268M2778Q123q659l8949j1869K1252M4805J2949j044k5680j2426l591
$$ -48694 -51962 -9184 -1061 -9720 -48669 -60538 -39286 5519 18468 17424 -8256 -20682 -24273
6360b4273J7437m071O368L118M577K1157J92m428k7215J4313l4774q716k367L1703
$$ -24273 -6836 -10907 -4539 -1421 3156 24313 24505 20077 -7138 7175 -27599 -36315 -38682 -6979
6346f979L1532p107r140R678k0576j1615K993K127M872N040K87j7258L9241k7013
$$ -6979 24553 17446 8306 17984 -2592 -14207 -11214 -9087 -4215 825 1112 -16146 23095 -3918
6332c918k9801M948J5010r285J7728k2624j1315J2277K2493l337Q968J4575J875
$$ -3918 -33719 -28771 -13761 -23046 -5318 -27942 -39257 -26980 -4487 -7824 1144 15719 17594
6319A7594J6485J5000r134J0008j5899j5868k5413l5066J3315J1579N291l976
$$ 17594 34079 49079 39945 49953 34054 18186 -7227 -42293 -28978 -17399 -12108 -16084
6307a6084m0459M877J9414J6104J2773k405k4171L216L842j1745L234J3234M241
$$ -16084 -56543 -51666 -32252 -16148 -3375 -5780 -29951 -26735 -22893 -34638 -31404 -18170 -13929
6294a3929J4617k545Q137N153P734o352l1487m1319k3530K5615K5467K0758L3689
$$ -13929 688 -1857 6280 11433 19167 12815 -18672 -59991 -83521 -57906 -32439 -11681 22008
6281B2008k2604m6149j9679L5225J313M353J7774m5279k0603r520J5047K3704
$$ 22008 -596 -46745 -66424 -31199 -29886 -25533 -7759 -53038 -73641 -83161 -68114 -44410
6269d4410o116R552K2527J0855K0432J571J193n614j9980l4844j016l3826P818
$$ -44410 -50526 -40974 -18447 -7592 12840 14411 15604 9990 -9990 -44834 -45850 -79676 -71858
6256g1858R432K868J7433L7946K7596p841j7525R557J0393j1968L320O601J744
$$ -71858 -62426 -59558 -42125 -4179 23417 15576 -1949 7608 18001 6033 9353 15954 17698
6243A7698j3880j0470l6408Q81L4598q949m3987k0296J6483M7294L4845j4202
$$ 17698 3818 -6652 -43060 -42179 -7581 -16530 -60517 -80813 -64330 -17036 17809 3607
6231C607r639j3445K070J6185m0071k3018L5786j723K8591r492m5753L1293j1895
$$ 3607 -6032 -19477 -17407 -1222 -41293 -64311 -28525 -30248 -1657 -11149 -56902 -25609 -37504
6218c7504J5901r164o867K8304L8179j7481k5793j0983K5317j2164k4208L2433
$$ -37504 -21603 -30767 -37634 -9330 28849 11368 -14425 -25408 -91 -12255 -36463 -4030
6206d030J8494k8540k5611L328L3384m350m685k7960k083L203M4668O2390l1138
$$ -4030 14464 -14076 -39687 -36359 -2975 -7325 -12010 -39970 -42053 -38850 5818 68208 37070
6193C7070m7192k3923K3558J2989J4658K1021J9171k376j2129l3807p600L853
$$ 37070 -10122 -34045 -10487 2502 17160 38181 57352 54976 42847 9040 1440 5293
6181E293j6487k2081K7284K2710j1916l1662P433j963K8186p250k9645m0818j8805
$$ 5293 -11194 -33275 -5991 16719 4803 -26859 -19426 -21389 6797 -453 -30098 -70916 -89721
6168h9721k4274J5787N4810J9324o843J6771J3853M541j2858J2129L9262k8792
$$ -89721 -113995 -98208 -43398 -24074 -30917 -14146 -293 4248 -8610 3519 42781 13989
6156A3989l6963J6525K0448M014l6695J9035L1206K2695K001n3119n9632p568
$$ 13989 -22974 -6449 13999 18013 -18682 353 31559 54254 56255 3136 -56496 -64064
6144f4064J8424P618O803L5090K6490j8598K512N545j2868j0662j6216J1024p791
$$ -64064 -45640 -38022 -31219 3871 30361 11763 14275 19820 6952 -3710 -19926 -8902 -16693
6131a6693J2331j399K9408M1445k3592p7473l7194o615N2711J4212J981J5149
$$ -16693 -4362 -5761 23647 65092 41500 -35973 -73167 -79782 -27071 -12859 -10878 4271
6119D271J6301j3533l3254j6440j678L486J8095M046J3291K0995l2598j6326N666
$$ 4271 20572 7039 -26215 -42655 -44333 -40847 -22752 -18706 -5415 15580 -17018 -33344 -27678
6106b7678q863J827J9817L9500J4158K0486l6135k9978j991J8169p74j2807J653
$$ -27678 -36541 -34714 -14897 24603 38761 59247 23112 -6866 -8857 9312 8538 -4269 -2616
6093b616k955j5379P993L213j214j6546R653L5088p558n232J0087n040l4500j5428
$$ -2616 -5571 -20950 -12957 -9744 -10958 -27504 -17851 17237 9679 4447 14534 9494 -25006 -40434
6079d0434J9J8625L521r997j719J2062j8710K4188K9361k8186l4400P022K1767
$$ -40434 -40415 -21790 -18269 -28266 -29985 -17923 -36633 -12445 16916 -11270 -45670 -38648 -16881
6066a6881J4844j7076j8170j1387K8233L4688n947K3200P899m670J7937P797k687
$$ -16881 -2037 -19113 -37283 -48670 -20437 14251 8304 31504 39403 34733 52670 60467 57780
6053E7780o616N321l4871l2921J4943L424J2157Q142k4294Q512Q134j0711p680
$$ 57780 51164 56485 21614 -11307 3636 7060 19217 27359 3065 11577 19711 9000 1320
6040A320q912l6551p189N067L47N784k7551M5059J5259p668q791o542k993L630
$$ 1320 -7592 -44143 -51332 -46265 -45918 -40134 -67685 -22626 -7367 -15035 -23826 -30368 -33361 -29731
6026b9731J2534k2096N134J3356p279L488K0428k9882l2913J4028O013K5434J5816
$$ -29731 -17197 -39293 -34159 -20803 -28082 -24594 -4166 -34048 -66961 -52933 -46920 -21486 -5670
6013e670p538P097j1777m198l010O95J4488J3466P100k3917O486N0614k3560k9365
$$ -5670 -13208 -6111 -17888 -22086 -25096 -24401 -9913 3553 10653 -13264 -6778 43836 20276 -9089
5999i089L0064k6326k2865O786q499L33O087P235p156m657o022J5190J8613n432
$$ -9089 20975 -5351 -28216 -21430 -29929 -29596 -23509 -16274 -23430 -28087 -34109 -18919 -306 -5738
5985e738k2900Q83p474j7174j6001M832K0536K2338n767m2896m1129L5452M0703
$$ -5738 -28638 -27755 -35229 -52403 -68404 -63572 -43036 -20698 -26465 -69361 -110490 -75038 -34335
5972c4335K1335J4646j5466k2101L9835J9877j9619J3672q96N357J5050k5333
$$ -34335 -13000 1646 -13820 -35921 3914 23791 4172 17844 16948 22305 37355 12022
5960A2022j4291k4675O040q196K131J0173K028K8586j2866j3726m659k1011K2233
$$ 12022 -2269 -26944 -20904 -29100 -26969 -16796 -14768 13818 952 -12774 -17433 -38444 -16211
5947a6211L0934J9860J1383m502m3688l4087P862K9951j8039J912K357J0272j8397
$$ -16211 14723 34583 45966 41464 -2224 -36311 -28449 1502 -16537 -14625 -12268 -1996 -20393
5934b0393m514J4455O871k0909j4812j6561J0944J7557J7938P746J8913p187j8281
$$ -20393 -24907 -10452 -3581 -24490 -39302 -55863 -44919 -27362 -9424 -1678 17235 10048 -8233
5921h233j3410j5168J2564j1981p259J6947M906k4149N115P506k077k485J4944
$$ -8233 -21643 -36811 -24247 -36228 -43487 -26540 -21634 -45783 -40668 -33162 -35239 -37724 -22780
5908b2780K4448O238k9858k0606J707J4179J4137k3891r630k9729o933K118L148
$$ -22780 1668 7906 -21952 -42558 -40851 -26672 -12535 -36426 -46056 -75785 -82718 -80600 -77452
5895g7452K8624K3413j3009j1238p943M1463M969J2026j1140K120j7313n41m9776
$$ -77452 -48828 -25415 -38424 -49662 -57605 -16142 -11173 853 -10287 -8167 -25480 -26021 -75797
5882g5797j0518L6608K1710J1915K2289J4096m6723l3540R893L6931j7959k7249
$$ -75797 -86315 -49707 -27997 -16082 6207 20303 -26420 -59960 -50067 -13136 -31095 -58344
5870e8344L1967O8468J0409l2949k5473P622J9742l436p171P076J2408J031O713
$$ -58344 -26377 42091 52500 19551 -5922 1700 21442 18006 10835 17911 30319 31350 38063
5857C8063j7752k0846l8309K974K1463k967O502Q534R536k746n0379l105K2900
$$ 38063 20311 -535 -38844 -35870 -14407 -17374 -10872 -2338 7198 4452 -45927 -49032 -26132
5844b6132M341q753J7959J4216J8590L723Q508M702k9573O675O717j8872j1651
$$ -26132 -21791 -30544 -12585 1631 20221 23944 32452 37154 7581 14256 20973 2101 -9550
5831i550N532m541J0395n666o74j1741k3001Q289J9319Q386K095k0840q789j2226
$$ -9550 -4018 -8559 1836 -3830 -4504 -16245 -39246 -30957 -11638 -3252 -1157 -21997 -30786 -43012
5817d3012k3773n989j6586j7241J1184L5073J1875J5624K9458K6910Q81k4444
$$ -43012 -66785 -72774 -89360 -106601 -95417 -60344 -48469 -32845 -3387 23523 24404 -40
5805d0J3047J1545j1760j1301k6916N429N492m221j1477m406j3884K061J6012
$$ -40 13007 24552 12792 1491 -25425 -19996 -14504 -18725 -30202 -34608 -48492 -46431 -30419
5792c0419Q108K5480K4178j8664j9828R037J0487J7421o632k8950k1639j9107
$$ -30419 -22311 3169 27347 8683 -11145 -2108 8379 25800 19168 -9782 -31421 -50528
5780e0528j8258J0765K6146j6616J9625J5333K7445K8130k3737l8086J2449J3371
$$ -50528 -68786 -58021 -31875 -48491 -28866 -13533 13912 42042 18305 -19781 -7332 6039
5768F039J1715l951m069m6172P867O0401J1666k8992N85L0689P771J6655j548
$$ 6039 17754 13803 9734 -36438 -28571 31830 43496 14504 15089 45778 53549 70204 68656
5755F8656m5094O35K502n890l1152j8191J6426j1578j7980J0290M2588L6774J7080
$$ 68656 23562 24197 26699 20809 -10343 -28534 -12108 -23686 -41666 -31376 11212 47986 65066
5742F5066m3517p226j5755R131J8374m58o0565k4951J7779l4422j657R448K6993
$$ 65066 21549 14323 -1432 7699 26073 25615 -34950 -59901 -42122 -76544 -78201 -68753 -41760
5729d1760L2456J7890J8149k4168k5217j4935P626n050L962M4784J1649k4659
$$ -41760 -9304 8586 26735 2567 -22650 -37585 -29959 -35009 -31047 13737 25386 727
5717G27j3465L3592M075l4273m6247J4109J7018J0449L1706n504K1989j9426j0600
$$ 727 -12738 20854 24929 -9344 -55591 -41482 -24464 -14015 17691 12187 34176 14750 4150
5704D150J4304K163j915k3922l3112j4654J1276K1619m118j0425L5017L5959O355
$$ 4150 18454 20617 18702 -5220 -38332 -52986 -41710 -20091 -24209 -34634 383 36342 42697
5691D2697J6923N180l3784m1003N340K8052k9415l447J6995j4844k8810k4936
$$ 42697 59620 64800 31016 -9987 -4647 23405 -6010 -9457 7538 -7306 -36116 -61052
5679f1052J6628j6858r055K8330O995O273K4296j2469k5517q507J1455K0987P905
$$ -61052 -44424 -61282 -70337 -42007 -35012 -28739 -4443 -16912 -42429 -50936 -39481 -18494 -10589
5666a0589L1606j7031L578j0591N050l264J493K6706K8429q223j8729k838k9540
$$ -10589 21017 3986 7564 -3027 2023 -1241 252 26958 55387 47164 28435 25597 -3943
5653c943L901J7031K9384j45k8112j9865j954R693k7425r449J0051K171J181J7704
$$ -3943 -42 16989 46373 46228 18116 -1749 -3703 5990 -21435 -30884 -20833 -18662 -17481 223
5639B23k217J4388l632K284n761j934o404k9595j1478j6725J580K8359L481j8164
$$ 223 -1994 12394 8762 11046 5285 3351 -3053 -32648 -44126 -60851 -59271 -30912 -27431 -45595
$$ [...]
##END NTUPLES=NMR SPECTRUM
##END=
