##TITLE=Analysis number 328443
Compound Code cc 63804
Book Reference 511/122
Project Code adrs
Chemist Name stevem
##JCAMPDX= 6.0         $$ Bruker NMR JCAMP-DX V2.0
##DATA TYPE= NMR SPECTRUM
##DATA CLASS= NTUPLES
##ORIGIN= Bruker BioSpin GmbH
##OWNER= nmr
$$ XWIN-NMR		Version 3.5
$$ Wed Jun  6 11:30:15 2007 GMT Daylight Time (UT+1h)  MAYBRIDGE\nmr@NMR_250MHZ
##.OBSERVE FREQUENCY= 250.131544655141
##.OBSERVE NUCLEUS= ^1H
##.ACQUISITION MODE= SIMULTANEOUS (DQD)
##.ACQUISITION SCHEME= undefined
##.AVERAGES= 16
##.DIGITISER RES= 18
##SPECTROMETER/DATA SYSTEM= dpx250
##.PULSE SEQUENCE= zg30
##.SOLVENT NAME= CDCl3
##.SHIFT REFERENCE= (INTERNAL, CDCl3, 0, 16.4561)
##AUDIT TRAIL= $$ (NUMBER, WHEN, WHO, WHERE, WHAT)
$$ ##TITLE= Audit trail, XWIN-NMR		Version 3.5
$$ ##JCAMPDX= 5.01
$$ ##ORIGIN= Bruker BioSpin GmbH
$$ ##OWNER= nmr
$$ C:\u/data/dgb/nmr/ADRS/330/pdata/1/auditp.txt
$$ ##AUDIT TRAIL=  $$ (NUMBER, WHEN, WHO, WHERE, WHAT)
(   1,<2007-06-06 11:29:53.40 +100>,<MAYBRIDGE\nmr>,<NMR_250MHZ>,
      <created by zg, POWCHK disabled, PULCHK disabled
       configuration hash MD5:
       76 6E 9A 78 1E 09 19 81 EC 84 63 8F B0 6A 59 2D
       data hash MD5: 64K
       CD EE 92 BC 4D DC 0C 0E 75 7A AB B9 ED 8F AD 8A>)
(   2,<2007-06-06 11:30:06.60 +100>,<MAYBRIDGE\nmr>,<NMR_250MHZ>,
      <Start of raw data processing
       ef LB = 0.3 FT_mod = 6 PKNL = 1 SI = 32K 
       data hash MD5: 32K
       33 6F 29 7D E9 2B C9 17 76 88 EE DF D8 21 20 0B>)
(   3,<2007-06-06 11:30:08.54 +100>,<MAYBRIDGE\nmr>,<NMR_250MHZ>,
      <apk 
       data hash MD5: 32K
       AD EB 25 99 6A 04 9F 30 EE 88 E5 A8 F8 C7 71 D0>)
(   4,<2007-06-06 11:30:09.29 +100>,<MAYBRIDGE\nmr>,<NMR_250MHZ>,
      <abs ABSG = 5 
       data hash MD5: 32K
       CA 9A F7 A3 80 7B 4D 37 59 F9 54 87 BD 21 52 81>)
$$ ##END=
$$ 
$$ hash MD5
$$ 04 45 6F 7D 70 24 D1 52 10 91 BA 29 34 22 8A FC
##$RELAX= 
##$RELAX= 
##$RELAX= 
##$RELAX= 
##$RELAX= 
##$RELAX= 
##$RELAX= 
$$ Bruker specific parameters
$$ --------------------------
##$DU= <C:\u>
##$EXPNO= 330
##$NAME= <ADRS>
##$PROCNO= 1
##$TYPE= <nmr>
##$USER= <dgb>
##$AMP= (0..31)
100 100 100 100 100 100 100 100 100 100 100 100 100 100 100 100 100 100 
100 100 100 100 100 100 100 100 100 100 100 100 100 100 
##$AQSEQ= 0
##$AQ_mod= 3
##$AUNM= <au_zg>
##$AUTOPOS= <16 >
##$BF1= 250.13
##$BF2= 250.13
##$BF3= 250.13
##$BF4= 250.13
##$BF5= 500.13
##$BF6= 500.13
##$BF7= 500.13
##$BF8= 500.13
##$BYTORDA= 1
##$CFDGTYP= 0
##$CFRGTYP= 5
##$CHEMSTR= <none>
##$CNST= (0..31)
1 1 145 1 1 1 1 1 1 1 1 1 1 1 1 1 1 1 1 1 1 1 1 1 1 1 1 1 1 1 1 1 
##$CPDPRG= <>
##$CPDPRG1= <>
##$CPDPRG2= <>
##$CPDPRG3= <>
##$CPDPRG4= <mlev>
##$CPDPRG5= <mlev>
##$CPDPRG6= <mlev>
##$CPDPRG7= <mlev>
##$CPDPRG8= <mlev>
##$CPDPRGB= <>
##$CPDPRGT= <>
##$D= (0..31)
0 1 0 0 0 0 0 0 0 0.06 0 0 0 0 0 0 0.0002 0 0 0 0 0 0 0 0 0 0 0 0 0 0 
0 
##$DATE= 1181125792
##$DBL= (0..7)
120 120 120 120 120 120 120 120 
##$DBP= (0..7)
150 150 150 150 150 150 150 150 
##$DBP07= 0
##$DBPNAM0= <>
##$DBPNAM1= <>
$$ [...]
##$SUBNAM7= <"">
##$SUBNAM8= <"">
##$SUBNAM9= <"">
##$SW= 20.6930455092707
##$SWIBOX= (0..15)
0 0 3 0 0 0 0 0 0 0 0 0 0 0 0 0 
##$SW_h= 5175.983436853
##$TD= 65536
##$TD0= 1
##$TE= 296.16
##$TE2= 300
##$TE3= 300
##$TEG= 300
##$TL= (0..7)
0 120 120 120 120 120 120 120 
##$TP= (0..7)
150 150 150 150 150 150 150 150 
##$TP07= 0
##$TPNAME0= <>
##$TPNAME1= <>
##$TPNAME2= <>
##$TPNAME3= <>
##$TPNAME4= <>
##$TPNAME5= <>
##$TPNAME6= <>
##$TPNAME7= <>
##$TPOAL= (0..7)
0.5 0.5 0.5 0.5 0.5 0.5 0.5 0.5 
##$TPOFFS= (0..7)
0 0 0 0 0 0 0 0 
##$TUNHIN= 0
##$TUNHOUT= 0
##$TUNXOUT= 0
##$USERA1= <user>
##$USERA2= <user>
##$USERA3= <user>
##$USERA4= <user>
##$USERA5= <user>
##$V9= 5
##$VALIST= <valist>
##$VCLIST= <CCCCCCCCCCCCCCC>
##$VD= 0
##$VDLIST= <DDDDDDDDDDDDDDD>
##$VPLIST= <PPPPPPPPPPPPPPP>
##$VTLIST= <TTTTTTTTTTTTTTT>
##$WBST= 1024
##$WBSW= 4
##$XGAIN= (0..3)
0 0 0 0 
##$XL= 0
##$YL= 0
##$YMAX_a= 301018
##$YMIN_a= -283879
##$ZGOPTNS= <>
##$ZL1= 120
##$ZL2= 120
##$ZL3= 120
##$ZL4= 120
##$ABSF1= 16.45614
##$ABSF2= -4.237032
##$ABSG= 5
##$ABSL= 3
##$ALPHA= 0
##$AQORDER= 0
##$ASSFAC= 0
##$ASSFACI= 0
##$ASSFACX= 0
##$ASSWID= 0
##$AUNMP= <proc_1d>
##$AZFE= 0.1
##$AZFW= 0.1
##$BCFW= 0
##$BC_mod= 0
##$BYTORDP= 0
##$COROFFS= 0
##$CY= 12.5
##$DATMOD= 1
##$DC= 0
##$DFILT= <>
##$DTYPP= 0
##$F1P= 14.0000005364418
##$F2P= -0.99999901652339
##$FCOR= 0.5
##$FTSIZE= 32768
##$FT_mod= 6
##$GAMMA= 0
##$GB= 0
##$INTBC= 1
##$INTSCL= 1
##$ISEN= 128
##$LB= 0.3
##$LEV0= 0
##$LPBIN= 0
##$MAXI= 10000
##$MC2= 0
##$MEAN= 0
##$ME_mod= 0
##$MI= 0
##$NCOEF= 0
##$NC_proc= -5
##$NLEV= 6
##$NOISF1= 0
##$NOISF2= 0
##$NSP= 0
##$NTH_PI= 0
##$NZP= 0
##$OFFSET= 16.45614
##$PC= 1
##$PHC0= -55.76282
##$PHC1= 10.32608
##$PH_mod= 1
##$PKNL= yes
##$PPARMOD= 0
##$PSCAL= 4
##$PSIGN= 0
##$REVERSE= no
##$SF= 250.130016472457
##$SI= 32768
##$SIGF1= 0
##$SIGF2= 0
##$SINO= 400
##$SIOLD= 32768
##$SREGLST= <1H.CDCl3>
##$SSB= 0
##$STSI= 32768
##$STSR= 0
##$SW_p= 5175.98343685301
##$SYMM= 0
##$S_DEV= 0
##$TDeff= 65536
##$TDoff= 0
##$TI= <Analysis number 999999
Compound Code 99
Book Reference 9
Project Code 9>
##$TILT= no
##$TM1= 0
##$TM2= 0
##$TOPLEV= 0
##$USERP1= <user>
##$USERP2= <user>
##$USERP3= <user>
##$USERP4= <user>
##$USERP5= <user>
##$WDW= 1
##$XDIM= 32768
##$YMAX_p= 424577822
##$YMIN_p= -461095
$$ End of Bruker specific parameters
$$ ---------------------------------
##NTUPLES= NMR SPECTRUM
##VAR_NAME=  FREQUENCY,     SPECTRUM/REAL,   SPECTRUM/IMAG
##SYMBOL=    X,             R,               I
##VAR_TYPE=  INDEPENDENT,   DEPENDENT,       DEPENDENT
##VAR_FORM=  AFFN,          ASDF,            ASDF
##VAR_DIM=   32768,         32768,           32768
##UNITS=     HZ,            ARBITRARY UNITS, ARBITRARY UNITS
##FACTOR=    0.157963299565203, 1,           1
##FIRST=     4116.17469888755, 0,            0
##LAST=      -1059.80873796546, 0,           0
##MIN=       -1059.80873796546, -461095,     0
##MAX=       4116.17469888755, 424577822,    0
$$ Real data points
##PAGE= N=1
##DATA TABLE= (X++(R..R)), XYDATA
$$ [...]
25606a4639p3108J6664n005K9921J37086N372J4952j8285j27780j52423J8704
25595a68541J43785N5554p0616m4031Q6205j1727J20603J45596l3355q3460m3052
25584I6961K7104j22267p6203m7805l3108J19279R0429O4074j7197q2528j9397
25573f58n3863n4235o5866j2937K6233Q2432n900o6866k0453J0407L8114J2418
25561a11174j18744O7313Q7989q8899o9545J03907P3630l7069N1018Q3552o857
25550C5121r9956j03758m7949m1395O5218N1938m0732m6372K8552o5752J20881
25539a44204R3143J7005K9991m2328l6430N7029o4794j24782n2964l6253o45j276
25527c06508Q8031m9470n6187m192N6413J28710R9478Q2468j14631J27976J45496
$$ y = [-14639, -87747, -71083, -76088, -46167, 90919, 96291, 111243, 92958, -34822, -187245, -168541, -24756, 30798, -39818, -83849, 2356, -9371, 111232, 256828, 223473, 140013, 96961, 124065, 1798, -74405, -122210, -155318, -36039, 54390, 118464, 101267, 18739, -658, -54521, -108756, -174622, -187559, -161326, -78894, -84794, -151660, -172113, -161706, -123592, -111174, -229918, -162605, -74616, -163515, -233060, -129153, -55523, -92592, -41574, 41978, 35121, -64835, -168593, -216542, -257937, -192719, -140781, -181513, -227885, -199333, -265085, -144204, -51061, -34056, -4065, -46393, -82823, -25794, -90588, -215370, -268334, -304587, -305232, -306508, -218477, -267947, -324134, -328326, -271913, -143203, -43725, 38743, -75888, 52088, 197584]
25516A97584r203n2685L1984M482L1418k7197q9011l5849M1128O8411L6641j38448
25504E9255J6096k276l2079o5513K165m6045L3841K13631N9065o4128j89049r6928
25492a11965K1629M1480J29211O677j73155l6045o9028J00692r3965q2602Q9277
25481a77794Q3795j0930p6522o6956m0155n0459J17949O4425j3397J19168J28895
25470G8019J9915j01914m1793j34912K5738J32000m4437o0471J62939L491l3469
25459E106r3372m3324N5429o4707Q8213P3114k4196l8785L7887l6614J4234R6178
25447F9163K1368m235J787Q354R9414L6927r0778R2709L2251m7807p6317o7057
25435G5779j24714K9695N6187N2401p2286j27508M3429J18669Q1221k3108k8444
$$ y = [197584, 188381, 135696, 167680, 172162, 203580, 176383, 87372, 51523, 92651, 161062, 197703, 59255, 75351, 73075, 40996, -24517, -22352, -68397, -34556, 179075, 238140, 174012, -15037, -111965, -90336, -48856, 80355, 87032, -86123, -122168, -191196, -90504, -184469, -267071, -177794, -93999, -104929, -181451, -248407, -288562, -339021, -221072, -156647, -170044, -50876, 78019, 97934, -3980, -45773, -180685, -154947, -22947, -67384, -127855, 35084, 38575, 5106, -88266, -131590, -76161, -140868, -52655, 20459, -3737, -42522, -4635, -41249, -27015, 69163, 90531, 86296, 88083, 96437, 195851, 232778, 142000, 234709, 266960, 219153, 142836, 75779, -48935, -19240, 36947, 89348, 17062, -110446, -67017, 51652, 132873, 109765, 81321]
25424H1321j6685m3495J221N2463J4787L2443k0717k5829l4145o0232R73l9721
25412e7616r3635k5857N3104M2638J44931Q1263j11841p1482j6289m0494l3331
25401a28609L3050m7603M2377O735m9614N7095L6467N6702J31188R1942q358l5653
25389A85719r7115o753N1979j79791j51167N1962M6120k499M0864O7241P3218
25378G9778O5463q2329j35671j3447n1023R8953J80595j02218p8570J2514p0393
25367i6348j7828n6942N5346J0997j8581n9477j10250M1698J08618P7878J22016
25356E7127J22167k3764j83714j30057p038J48698R5865k4428P170L6276L4203
25345A32505p1369Q5160J5532q2273p572L694L6689O3912J22718p4662P913k12028
$$ y = [81321, 64636, 21141, 22362, 74825, 89612, 122055, 101338, 75509, 41364, -18868, -17895, -57616, -151251, -177108, -124004, -81366, 63565, 144828, 32987, -38495, -54784, -95278, -128609, -95559, -143162, -100785, -94050, -143664, -86569, -50102, 6600, 137788, 229730, 221372, 185719, 88604, 81851, 133830, -45961, -197128, -145166, -99046, -101545, -60681, 6560, 79778, 145241, 62912, -72759, -86206, -137229, -38276, 142319, 40101, -38469, -25955, -96348, -114176, -171118, -115772, -104775, -123356, -182833, -293083, -251385, -142767, -64889, 57127, 179294, 155530, -28184, -158241, -165279, -16581, 79284, 54856, 62026, 98302, 132505, 61136, 146296, 161828, 79555, 71983, 75677, 112366, 176278, 298996, 224334, 232247, 20219]
25333B0219n6880J23097Q6757l8890r4098n7255N864l2087r3802q6537J26734
25322i6878R9379K8969o8644J43879K9452j03951r3086j5677n947r4492K8424
25311a48572J17031J9894m0269J02882P1358Q443l3397M2404J9418n8229q4674
25300A6289l9918n717n6554j3217L3713q6299j7129J12050R8556j5390j64271
25289a37887k1483j870M6507N5693O5078N4419k6703k8766P1031J3052m8161j11183
25277g0273K7260p2506j09863O0449J47235J41543L0517K5878k4988O6435K0002
25266B41689m7039j14667o6457j55555m8883N6383M6441M6209J41778L8232j69437
25255c1306k5956J26408O7887q6382j15631j3598n543o5309J37092L2575J7865
$$ y = [20219, -36661, 86436, 173193, 134303, 40205, -17050, -11186, -43273, -137075, -223612, -96878, 2501, 31470, -37174, 106705, 136157, 32206, -60880, -76557, -82504, -176996, -148572, -31541, -11647, -51916, 50966, 122324, 130767, 97370, 139774, 159192, 100963, 16289, -23629, -29346, -85900, -99117, -65404, -151703, -168832, -56782, 41774, 26384, -137887, -159370, -161240, -114733, -59040, 6038, 60457, 33754, 4988, 76019, 89071, 40910, -70273, -43013, -115519, -225382, -164933, -17698, 123845, 154362, 180240, 155252, 221687, 241689, 194650, 79983, 13526, -142029, -190912, -134529, -88088, -41879, 99899, 138131, -31306, -57262, 69146, 137033, 50651, -64980, -78578, -84121, -149430, -12338, 20237, 38102]
25244C8102J35846j7319l1634j45655j19083L1589J24368J73576l3893l805j73046
25233b0954r1160m5581j28010P8282J57570N1414m1208r7306Q043J49066O0666
25222H0822J4721L4462O625k9290l8201J00554K0709j00233N3162l6950o4777
25211D1604m548m4395n1735L0645L1438o6402l7016k7599Q3544n8274J2952m907
25199i4693R685J05835k1644p8439Q507O9949O0835m0995j3244l8211j18898J1800
25187a39513J17102J81525n9992m0615p6246k6587R1957j0761o1835m3843k9593
25176i8401R102p5865o366P0870L5227o4663o9245K0790M517j13591k7811L6510
25164b78926L714J13393l2632q044k0746N1102J50955O8945J35420l3071r0623
$$ y = [38102, 173948, 156629, 124995, -20660, -139743, -108154, 16214, 189790, 155897, 152092, -20954, -112114, -157695, -285705, -207423, -49853, 1561, -39647, -136953, -128910, 20156, 80822, 95543, 130005, 136630, 107340, 69139, 169693, 190402, 90169, 143331, 106381, 41604, 37056, -7339, -59074, -28429, 3009, -63393, -100409, -128008, -44464, -102738, -89786, -94693, -85008, 20827, -817, -79256, -70749, -800, 60035, 19040, 5796, -32415, -151313, -139513, -22411, 159114, 99122, 58507, -17739, -44326, 47631, 36870, -24965, -68808, -98401, -89299, -165164, -171530, -100660, -65433, -130096, -199341, -178551, -174034, -287625, -315436, -278926, -275212, -161819, -194451, -202495, -223241, -172139, -21184, 47761, 183181, 150110, 59487]
25153E9487q5599O7737P8244K3341k1943j13741Q2136l9300q020q3474k1334J481
25141f0985n7628j09979q5041n845J89031j8750P8250M1107O0027P7122L6705
25130A44014j37681m4360J02458K48175q9152p0561J7094q5570j22490l8150p0992
25119a47215p653Q4958R945l3596K3226J3642L2583o459J6727m7813J24077N6449
25107A18871O7365n7440m8152j12638J04211J7730j4112M0406M3333k866k5454
25096A31254Q636l5458L053n0622m0212J58429k9167n1523R6132k2894r6897K417
25084G3148l7547N4081k449q5658Q7403J3214O3059R536n1155j3378J7419j6713
25072A10960J298J35165r1983n5750j53202L5339l7374l775j21341O4017J34704
$$ y = [59487, -26112, 41625, 119869, 143210, 121267, 7526, 89662, 50362, 42342, -41132, -62466, -60985, -118613, -228592, -313633, -319478, -130447, -149197, -70947, -29840, 30187, 107309, 144014, 6333, -38027, 64431, 312606, 223454, 152893, 169987, 84417, -38073, -76223, -147215, -154868, -69910, -59965, -93561, -70335, -56693, -24110, -30569, -13842, -61655, 62422, 118871, 186236, 128796, 80644, -31994, 72217, 89947, 75835, 116241, 159574, 156708, 131254, 139890, 104432, 107485, 56863, 16651, 175080, 145913, 94390, 190522, 167628, 70731, 73148, 35601, 89682, 87233, 1575, 88978, 102192, 165251, 174787, 123632, 110254, 127673, 110960, 112258, 247423, 155440, 99690, -53512, -18173, -55547, -59322, -180663, -116646, 18058]
25061A8058m1203J50910O4615Q3175N42p9457j5576R9889p1839j7904j5315k9818
25049A46077k34986l3574J04392j5502m0156q0370n9324P7297K05070O6274l6656
25038I8542L18J7572L6782m9833j06620k8039r3266j32333j872J09635m6043M1542
25026a53615J34709N7263J08083M711M8601n0189o5394j02678q9744O5146l2890
25015g5997K9394P1214M3992M321j4179N8015p2698q511P1837k5966j553k5035
25003E4834j2383L9373m7954j04358J4601M4824J09786n6437j56427O7126R5593
24992D8578n2048j3553P4276L2993p161r6921N1310N0884j6542M1088N5175J14979
24980B83058j1439j45052n3350M4865Q8229q616j06076q8114n303K0649K8727
$$ y = [18058, -23145, 127765, 192380, 275555, 276097, 196640, 181064, 280953, 209114, 191210, 175895, 146077, -88909, -122483, -18091, -33593, -73749, -154119, -213443, -136146, 68924, 135198, 98542, 98860, 116432, 153214, 103381, -3239, -31278, -124544, -256877, -258749, -149114, -195157, -153615, -18906, 38357, 146440, 151151, 199752, 149563, 84169, -18509, -108253, -43107, -75997, -46603, 24611, 68603, 72924, 58745, 116760, 44062, 35551, 107388, 81422, 79869, 54834, 42451, 81824, 33870, -70488, -55887, -11063, 98723, 42286, -114141, -47015, 48578, -3470, -17023, 57253, 90246, 83085, -13836, 37474, 88358, 71816, 112904, 168079, 283058, 271619, 126567, 73217, 118082, 206311, 197695, 91619, 3505, -1798, 18851, 47578]
24969D7578j64496j324M6801j5436l693Q9588K563j16676m8914k1215o6369J21253
24957a30340P2034r9477r7676J8746J01136m034J00723M1820k5342K9292r0102
24946h3220N0225n7651K921j0892L2789M2577J43753L0129k4098J886j6441M8357
24934A60335l8344n0577J20L7192j16379n6151N8910P0481Q4762K075k1200j0675
24922A20549J04995j977r0035j29506q9378l0719k0445K7749Q9238M3554m1148
24911a7123R6777J5900q6879m8544N7321M9419Q0561n105j6919M3479m944n691
24899A58252k4309j63387q003O042M8907O3478O9906R2581J3387j38532R795J2708
24887A40825o9663k581q1996j13849j0063J47873P9980o2015k16249m0645J35039
$$ y = [47578, -116918, -118242, -71441, -86877, -90570, -982, 1581, -115095, -164009, -185224, -251593, -130340, -58306, -157783, -255459, -236713, -135577, -139611, -38888, 2932, -22410, 6882, -83220, -32995, -90646, -87725, -98617, -65828, -23251, 120502, 150631, 126533, 128419, 111978, 160335, 121991, 71414, 71534, 108726, -7653, -63804, -4894, 65587, 150349, 152424, 131224, 120549, 225544, 223567, 133532, 4026, -85352, -116071, -136516, -108767, -19529, 24025, -17123, 79654, 95554, 8675, -39869, 17452, 66871, 147432, 142327, 125408, 168887, 163943, 158252, 133943, -29444, -37447, -31405, 17502, 80980, 150886, 243467, 256854, 118322, 128117, 140825, 71162, 68581, -13415, -127264, -137327, 10546, 90526, 28511, -187738, -228383, -93344]
24876i3344M8488j0618M2290L8146J1833R7389L7696p9051j0981m2640q7881O3381
24864A4708r589J3725R1965m1794k2549M1492j11938L3797k2455Q4379p3818j08851
24852a10928J2842n1083O6493M5099P3989k6188N9636M357r1774o5588l187j9178
24840a05510Q9712J0601O3459r769n7454o0143J137r929m039k9385j38230j6220
24828b65770M5593J6978R4959J4959p3351p3256J24002R3443j0305n4074O2948
24817b3874J15864O511p4430r7697n6014J4158K3513N9506N005N0457P1454Q2718
24805A77171l7643k09140o5092K4824K00613O0621j53917j07102P4425M9898o7836
24794e3178k4704r0063n8123R1019n8475L4588n7864M0617J64802l5945j76827
$$ y = [-93344, -44856, -55474, -13184, 24962, 36795, 134184, 171880, 92829, 81848, 39208, -48673, 14708, 5119, 18844, 110809, 69015, 46466, 87958, -23980, 9817, -12638, 71741, -2077, -110928, -98086, -149169, -82676, -37577, 36412, 10224, 69860, 74217, -17557, -83145, -86332, -105510, -15798, -5197, 58262, 48493, -8961, -69104, -67967, -77896, -81935, -111320, -249550, -265770, -220177, -203199, -108240, -93281, -166632, -239888, -115886, -22443, -32748, -86822, -23874, 91990, 98501, 24071, -73626, -129640, -115482, -91969, -32463, -27458, 22999, 94453, 177171, 139528, -69612, -134704, -109880, 90733, 151354, -2563, -109665, -35240, 14658, -53178, -77882, -167945, -226068, -135049, -193524, -158936, -216800, -176183, -11381, -47326, -224153]
24783b24153o0260J05632Q5356M3238L6492M1206L5113j5194o465j7338q1876
24772e8249J2989m7651L3663R720n8148J61528J30683j41473j48628p6798R6491
24761h5873J6719j8166M3815J8345K4309j00712j8649N1998J9320p8719o771P7385
24749e6999m2988p8378l9801M4867Q6079J51103M4593j7947O8578o5347n9m6106
24737D7595k18559j20807P8624P1052p0400m3156J09335R6102J9508m988o7637
24726a03331J6230K0684l6319J5893M6426n4438N0044Q9786Q8867Q6950j550q0436
24714A38806j11327l7455O9949L4608j24411j1268J19637R893J473J00123q0249
24703A09779o4857j0142j7966N6234k6178p0634k1442K1793M266k1565k118N7570
$$ y = [-224153, -284413, -178781, -93425, -50187, -13695, 27511, 62624, 47430, 40965, 23627, -58249, -45260, -92911, -59248, -49528, -107676, 53852, 184535, 43062, -105566, -182364, -85873, -69154, -87320, -43505, -25160, -851, -101563, -120212, -68214, -48894, -127613, -134384, -56999, -99987, -178365, -218166, -173299, -87220, 63883, 108476, 90529, 159107, 93760, 93701, 47595, -170964, -291771, -213147, -142095, -212495, -255651, -146316, -50214, -30706, -35694, -103331, -87101, -66417, -102736, -86843, -40417, -94855, -44811, 44975, 133842, 220792, 219242, 138806, 27479, -9976, 59973, 94581, -29830, -41098, 78539, 88432, 89905, 190028, 109779, 44922, 34780, 16814, 73048, 46870, -23764, -45206, -23413, -19147, -40712, -42830, 14740]
24691A4740J9959j60937q239P5500L8253o3743r0556j5087l9607o9898j2251o91
24679c12557J34916J18065n8582M0921m3216l1409K1571Q3869M6345j28169J02330
24668b5916L0018L8070M9574O6497k8469p1285q7970n4408L4810k2888l808m2527
24656a18302q0109J05162K21865K0514j11826N3178q3169p3875L1469l412o4841
24645a03346N6573O3155n4009j0409q0812r4031p9685J01527K0336J4299J66728
24634C26Q2536Q1469q0432m6812J36155L3675J5943j2080L8661K2374j4517r4059
24622A63239j1520R1394L8968O513r8300q9250m0647m8403O3334J7254q5118r3106
24610h5642J47813R9156N511k80r6854m8328j18087r9031P9499l0906L0447J46303
$$ y = [14740, 34699, -126238, -134477, -58977, -20724, -84467, -175023, -190110, -229717, -299615, -311866, -312557, -177641, -59576, -118158, -77237, -120453, -151862, -130291, -46422, -77, -128246, -25916, 4102, 42172, 91746, 158243, 129774, 58489, -29481, -83889, -49079, -71967, -75775, -118302, -198411, -93249, 128616, 149130, 37304, 90482, 7313, -66562, -35093, -38505, -103346, -46773, 16382, -37627, -48036, -128848, -222879, -302564, -201037, -180701, -166402, 326, 82862, 164331, 83899, 37087, 173242, 206917, 222860, 210780, 249441, 271815, 257298, 163239, 151719, 243113, 282081, 288594, 190294, 101044, 60397, 11994, 75328, 92582, 7464, -85642, 62171, 161327, 166838, 166558, 69704, 21376, -96711, -195742, -116243, -147149, -116702, 29601]
24598B9601j0257N7656J0018l1271N3850j8606o5463K4044L3287j425r1154o0302
24586g0022R2519R0812n7725p7341r2798J7556Q3854p3077L9066j8155n9349K1565
24574a03095r374q504O5507p7878j2365K6540l588M3471J37913P0464p3044n8923
24562b876m8073K5676L0526m3643K9149J19301M0928J1551m4723p7575m1288l1565
24550c2612M2913O6291j2244k5127K794m4425p8496N1112J12017j019k27185K5951
24538a20030J8601p1370L5237L2629m7227J19894q1987p0171R4873M6590m7912
24527i0873O5334p4228m442j7530l640Q2687J24306q9966p1983L6937o065j16715
24515a66178m5804J20263j08768M3080R297P1884P1165j895M4349l2898m8595
$$ y = [29601, 19344, 77000, 87018, 55747, 109597, 90991, 25528, 49572, 82859, 81434, -9720, -70022, 22497, 113309, 55584, -21757, -114555, -96999, -13145, -86222, -47156, -65311, -124660, -103095, -112469, -120973, -55466, -133344, -145709, -119169, -122757, -79286, 58627, 129091, 56047, -2876, -50949, -25273, 5253, -38390, -9241, 110060, 150988, 162539, 117816, 40241, -1047, -32612, 10301, 76592, 64348, 39221, 42015, -2410, -80906, -29794, 82223, 81204, -145981, -120030, -101429, -172799, -137562, -104933, -152160, -32266, -114253, -184424, -89551, -42961, -90873, -25539, -99767, -104209, -121739, -125379, -42692, 81614, -8352, -80335, -43398, -49463, -166178, -211982, -91719, -200487, -157407, -148110, -76226, -5061, -6956, 37393, 4495, -44100]
24504d4100j9250l2307L0041J03592l074j45195r1745m304J20025J54593j720
24493F6556j17304p915j574N9426J02110k5322K0725j03865l0057l9169K879J31626
24481E8116L6565L6009J0180j25312j075Q0644k2443o7234l8813K6525M795K6092
24469B4049n5000j15967K8168Q1033J9K7499L3959l9130j4577O8478P4480k4377
24457H8634N4864P5803q2120Q233j9503j66001o8580k968K8032M1689J02835J42872
24445B03790o6599J6004n7718R0673M2814n2968o0657n0762K9105K3943j2122
24434A05503p6470n8765J12655m1260j5263L0483L9827M0769r004j15322j00151
24423h6998j04010m9533Q411L2805K14851J48759o4907N356j57294j07919K8209
$$ y = [-44100, -63350, -95657, -65616, 37976, 34902, -110293, -202038, -206342, -86317, 68276, 66556, -50748, -58663, -60237, -811, 101299, 75977, 96702, -7163, -37220, -76389, -73510, 58116, 94681, 130690, 140870, 15558, 14483, 95127, 72684, 5450, -33363, -6838, -2043, 24049, -30951, -146918, -118750, -37717, -37698, -10199, 23760, -15370, -29947, 38531, 113011, 88634, 143498, 219301, 137181, 145414, 125911, -40090, -108670, -111638, -83606, -41917, 60918, 203790, 137191, 153195, 95477, 186150, 228964, 175996, 115339, 64577, 93682, 117625, 105503, 29033, -29732, 82923, 41663, 26400, 56883, 96710, 137479, 128475, 13153, -86998, -191008, -240541, -232130, -199325, 15526, 164285, 99378, 104734, -52560, -160479, -132270]
24412a32270M2876k2262P6583r4082n5720O8627J59357M0297l5183j16258R100
24401e8935J30865j4833J6561k2109k5037K7298n2826j8947j1584n3230J2883
24390f9894P03m9518o13O9020j10333J2758Q2737P3072m2695R1129L0459k1206
24378F5619k346K1108J21126N9912j30455j97987N8228L3016j04982P214J78710
24367A09163N2443n4930l205o4697m7468o972K8993Q358r673j09581J3294m4950
24355a29225R7302R3667j07491L3273J66095O5087o4790l3255K1451j16498J9032
24344D4648M0209k7719L2547p0475j16618m4739P0319J24232M4276M1184J2937
24333A50801p1242n5490n9788M4159N4757K9170k8071N9820m7987o4256J4044
$$ y = [-132270, -89394, -111656, -35073, -129155, -184875, -116248, 43109, 83406, 48223, -68035, -58935, 71930, 57097, 73658, 51549, 26512, 53810, 984, -17963, -29547, -82777, -69894, -69191, -118709, -119322, -50302, -160635, -147877, -65140, 7932, -34763, 56366, 86825, 65619, 63273, 84381, 205507, 265419, 134964, -63023, -4795, 28221, -76761, -69547, 109163, 161606, 106676, 103471, 38774, -8694, -15666, 13327, 21685, 12012, -97569, -84275, -129225, -31923, 61744, -45747, -12474, 153621, 218708, 153918, 120663, 142114, 25616, 44648, 84857, 57138, 89685, 19210, -97408, -142147, -71828, 52404, 96680, 137864, 150801, 79559, 24069, -35719, 8440, 63197, 92367, 64296, 124116, 76129, 11873, 25917]
24322B5917R2415n8851L4545q3408R5681p4225j28236o4821L1162O6817O1150
24311a854K3959L4153N8897k9259m324M5839o848j4219L7218m2485l9505n7770
24299C802J3311K1719J1626L035J1817L9230L2819n0862r1723j81729R2849J41202
24287D7096M9395k140j12499l3983m4825k0350J04842J17307Q5488R4579k8714
24276B56196q1060j1974N1232l4057r147n8487k7059j07464n6886m5329o0276
24265a84311Q9715J65908Q0574j34073j33902N2761n419K0892R344Q2400J4129
24254E8018n1647o7328r9781J8138Q9566L0802K9161N4766j11589o2319J62235
24243E0022M4216l650m0039j8910K3887P986J9811p5031N0722N5007m3963l4297
$$ y = [25917, 118332, 59481, 94026, 10618, 106299, 32074, -96162, -160983, -129821, -63004, -1854, 22105, 56258, 115155, 85896, 81572, 127411, 120563, 106344, 143562, 101077, 61572, 3802, 17113, 38832, 50458, 53493, 65310, 104540, 137359, 86497, -5226, -186955, -94106, 47096, 96491, 94351, -18148, -52131, -96956, -117306, -12464, 104843, 190331, 284910, 256196, 175136, 163162, 214394, 180337, 171190, 112703, 85644, -21820, -78706, -124035, -184311, -94596, 71312, 151886, 17813, -116089, -63328, -68747, -47855, -38511, 43889, 58018, 6371, -60957, -160738, -142600, -53034, -22232, 6929, 61695, -49894, -112213, 50022, 94238, 90588, 50549, 31639, 55526, 63512, 83323, 8292, 59014, 114021, 70058, 35761]
24231C5761j05507k6485Q8095J15695K6599j16062o0484J5186K7455M1833J19629
24220A61715N9523j00502k41743p1658M1963J53107Q4651o8323j02203O0675N061
24209a7734o4984L2009j9342j503K5703q441O3354J1213o9154K5468P3833Q384
24197E8806m7200K9502p405k8531k0358j431r3195o8228l7539J1015O7884J07258
24185b9422L1798j24009k8513J44728M842L5588q7479j01267r3850P6207P2047
24174i9330R842m2044K8376N0679J00760M3176J1754r794n3748l2878k308j16449
24162a11964j57323J2110O7371O3018N9860L1679L2579k5488k17151j03277O3720
24151b84866J21762J5804n5638r7075j1988M5781N0185m6823P0406N1080j4249
$$ y = [35761, -69746, -96231, -8136, 107559, 134158, 18096, -42388, -27202, 253, 42086, 161715, 221238, 120736, -121007, -192665, -150702, 2405, 87056, 18733, -83470, -22795, -17734, -82718, -50709, -70051, -71554, -45851, -54292, 9062, 20275, -48879, -23411, 50422, 58806, 11606, 41108, 33703, 5172, -15186, -16617, -109812, -178040, -215579, -204564, -136680, -29422, 2376, -121633, -150146, -5418, -576, 35012, -52467, -153734, -247584, -171377, -99330, -89488, -131532, -103156, -52477, 48283, 91459, 103213, 93419, 39671, 6793, 4485, -111964, -269287, -257177, -189806, -126788, -66928, -35249, -2670, -28158, -245309, -348586, -284866, -163104, -147300, -202938, -300013, -312001, -266220, -216035, -262858, -192452, -141372, -155621]
24140a55621o9881J06444J39206P6274P8801l3804q8998j26646k5201J9269N7136
24129b3021L9383M7290N5491q6530r3798j15323J5906J03311R2771j63859k03421
24118c31800P7374P6361R0868P8132O9374m3382j24954k7107O7848J71570N0408
24107A54692J1252l4436j65770p0069Q9796K306q1667p8294j52725j23040J11014
24096c36941J90784P815O429J8529P3984o1767J20954J17196j9952o0157p6840
24085a9966p4816l4176N8293O2959N0452m045N7186O4670L0406K9920r1414p9913
24073D9556J8113m8293K7082p2373j50227n6831R2746J08530M3419o1785r4086
24062a44149r901J9444J24524m7272m9148k7093J77339O9467r2702p6264L0284
$$ y = [-155621, -225502, -119058, 20148, 96422, 175223, 141419, 52421, -74225, -99426, -80157, -23021, 16362, 63652, 119143, 32613, -61185, -176508, -160602, -57291, 35480, -128379, -331800, -254426, -178065, -87197, -9065, 60309, 16927, -108027, -135134, -67286, 104284, 154692, 165944, 131508, -34262, -104331, -14535, -12229, -93896, -172190, -324915, -447955, -336941, -146157, -138342, -131913, -113384, -39400, -101167, 19787, 136983, 117031, 56874, -19966, -94782, -128958, -70665, -7706, 42746, 38701, 95887, 160557, 190963, 220883, 129469, 49556, 67669, 19376, 46458, -25915, -176142, -232973, -140227, -31697, 11722, -50063, -144149, -154050, -134606, -10082, -57354, -106502, -133595, 43744, 113211, 20509, -55755, -25471]
24051b5471n0977n4198N1990R8021n20j2005n4315l5995k0519K10686N3877q0196
24039H0378q3305p0300J253j7690M536l1659O9628J2107l5568Q8952m044K3921
24027C8209J2145j25801l7011O7493r0194O61O1006O7278N0924r640r1642n4110
24015a10682K4199j5606N8425M3694J01301O7289l2590P716q035r5873o4821q0086
24003a05069k1320R3820R9830N5607M5967l3582L0911K349r7382k8526J3115n4573
23991A147p9289k9435J70586N6678p6877n0961o9098k8240R0702k2550m3710Q105
23979g2942J4840P0845m1712o4703K7989R0790J04938P3268j01717j09429R749
23968A916K529k067Q2913R4881m1960j8981j909Q770L0745j6463o5512m8612j01664
$$ y = [-25471, -76448, -130646, -78656, 19365, 18845, 6840, -47475, -83470, -103989, 106697, 160574, 80378, -2927, -73227, -71974, -89664, -85128, -116787, -47159, -35052, -70620, 18332, 14288, 38209, 50354, -75447, -112458, -44965, -135159, -134498, -73492, -6214, 44710, 35070, -56572, -110682, -86483, -102089, -43664, 30, 101331, 168620, 136030, 143746, 135711, 39838, -24983, -105069, -126389, -32569, 67261, 122868, 168835, 135253, 166164, 168513, 71131, 42605, 55720, 1147, -78142, -107577, 63009, 119687, 42810, -8151, -77249, -105489, -14787, -37337, -81047, -72942, -58102, 12743, -28969, -93672, -65683, 25107, 130045, 203313, 101596, -7833, 1916, 4445, 2378, 85291, 180172, 138212, 119231, 117322, 126092, 156837, 140374, 74862, 26250, -75414]
23955g5414j1947O9386J05120J12672Q1613m1853j28497j74397j09066J06439
23945f5944J23162O1201r9818r727j4237o5137L4940J03770l2841j9438n2856
23934c6925j00430L3888K1371k309R757J9328K15187J62977K4796r8430k18076
23923C1134j45485n3651N3532P4532K136Q9449J59247m0696J1790O8186p2045
23912A78129k3934o9220l9254K4900j13224m6485p077j5770K8059J10201m3482
23901a7157j27583L0516J72189J05979r6860M4339l2480q1830k1656M2415N413
23890B3285J0846m9407j27085l9188O3849J0462o991L7670J69986j512n8674M997
23878C8238m5966j02696P5966J11648p2956j6315k1021o7455Q5135q0804j08259
$$ y = [-75414, -87361, -17975, 87145, 199817, 281430, 239577, 111080, -63317, -172383, -65944, 57218, 118419, 18601, 8874, -5363, -70500, -35560, 68210, 35369, 15931, -36925, -137355, -103467, -82096, -84405, -74648, -55320, 159867, 322844, 347640, 249210, 31134, -114351, -168002, -114470, -39938, -37802, 51647, 210894, 170198, 181988, 250174, 178129, 154195, 84975, 45721, 70621, -42603, -89088, -96165, -111935, -83876, 26325, -17157, -144740, -114224, 57965, 163944, 67084, 111423, 78943, -2887, -24543, 17872, 23285, 34131, -15276, -142361, -181549, -117700, -107238, -114229, -76559, 93427, 91915, 33241, 38238, -7728, -110424, -34458, 77190, 4234, -12081, -33102, -100557, -15422, -96226, -204485]
23867b04485M6927L5229J03649N4856m4514j08247J2405M4085R0276J7326N0303
23856I7810j3189K5888J7778L8731m3627q283O6983N0824n8702k3355K2374j9726
23844A53506m6666r4576j24770L6367O654j3493j02424L1455J05763P1179P846
23833C0841P4065r2271m2114J07120l4724j35184J8463J19544j19076L2229P1730
23822C0623J7643j06212j4610q512J91349j3065m6836l0320r9392M5899N8333
23811B4900J1121q2125n2560Q8021N4336j0626K7854J51893J0672j30742j29137
23800c6393n030l5234n7626R1910J49450J3111j11903J0532K1558q5579p7812
23789a23016M9626Q9842q7093l5831J41889p5813q5589M2887o012O0524j9983
$$ y = [-204485, -157558, -122329, -18680, 36176, -8338, -116585, -104180, -60095, 30181, 47507, 97810, 84621, 110509, 128287, 167018, 123391, 115108, 182091, 232915, 174213, 150858, 173232, 153506, 106840, 12264, -112506, -76139, -69485, -82978, -185402, -153947, -48184, 22995, 30841, 104906, 12635, -29479, 77641, 42917, -92267, -73804, 45740, -73336, -41107, 30623, 48266, -57946, -72556, -81068, 110281, 97216, 50380, 20060, -79332, -33433, 24900, 36021, -46104, -98664, -10643, 43693, 33067, 60921, 212814, 223486, 92744, -36393, -41423, -76657, -134283, -42373, 107077, 120188, 8285, 18817, 40375, -45204, -123016, -73390, 16452, -70641, -106472, 35417, -40396, -125985, -83098, -89110, -28586, -48569]
23778d8569p835L0699p826N896J39385J19848n858M9011j28058k8310j2189J09643
23766B15837j2492N8188j20940K7440n0467j49600j38315J06772J19015m7754
23756G684m5749k2871l4562J41808J02690q0753q0281p7775o675Q4492K2648M6688
23744E7344J66802p6915j34530L7459M6407K523k1255j03437L4033j02730L8995
23733e5304Q8931o676J9748k3404n4542j14151m9166k8703j8292R9543J25334
23722a6682J14625o434m9247q7155o6312M2924J26703k4962j13925J09347J02964
23711A31846q4161p7045m1225m0329O3636J9305P8328K9901m0144l5876q1981
23700g7745p0161p3995N9568J07349m4187o3734Q9795j4864J40501O1798k2232
$$ y = [-48569, -56404, -25705, -33531, -27635, 111750, 231598, 225740, 274751, 146693, 118383, 106194, 215837, 203345, 261533, 140593, 168033, 117566, -32034, -170349, -63577, 55438, 7684, -38065, -60936, -95498, 46310, 149000, 68247, -12034, -89809, -96484, -11992, 10656, 57344, 224146, 147231, 12701, 50160, 96567, 99090, 77835, -25602, 8431, -94299, -55304, 33627, 26951, 46699, 23295, -31247, -145398, -194564, -223267, -241559, -142016, -16682, 97943, 91509, 42262, -44893, -111205, -68281, 58422, 33460, -80465, 28882, 131846, 47685, -29360, -70585, -110914, -47278, -27973, 50355, 80256, 40112, 4236, -77745, -147906, -221901, -162333, -54984, -99171, -162905, -73110, -87974, 52527, 114325, 92093]
23689I2093q569m4548N709o2079q1666J412q5064J7967Q6559L8469L6752j9527
23677b2492Q3065l0056K0790J9548p9017L2857Q9058n5674k0601o6609L2170k7906
23665b4867n9752k0659L1980r53J7758J4178P1642N3141q5861k2006J04637k1580
23653E7658L4892l7998r3950j11302p7324N7825M4186P0006R3538P7493p9475
23642C5549r366j00106P6873P2281m8267j61805j17321j1048J32608J14629M6221
23631C0248P5086J2907r5544m4809M5644k1691K628j03443n6223L3540N4853J53798
23619H6994q884M719O6743J0959P5175l5352o5476Q6441k6620m2110j24465j41861
23607a13737J41n5663Q1399R0181q5794j27784M7603K6034R7936J8631l4869J1435
$$ y = [92093, 83524, 38976, 44685, -17394, -99060, -97648, -182712, -164745, -78186, -39717, -2965, -22492, 60573, 30517, 51307, 70855, -8162, 24695, 113753, 58079, 37478, -29131, 3039, -24867, -84619, -105278, -73298, -74251, -56493, -42315, 29327, 82468, -3393, -25399, 79238, 57658, 92550, 54552, -39398, -150700, -228024, -170199, -126013, -56007, 37531, 115024, 35549, 26183, -73923, 2950, 75231, 26964, -134841, -252162, -263210, -130602, -15973, 30248, 105334, 118241, 22697, -22112, 23532, 1841, 4469, -98974, -155197, -121657, -66804, 86994, 78110, 82829, 149572, 160531, 235706, 200354, 134878, 221319, 194699, 152589, 28124, -113737, -113596, -169259, -87860, 2321, -83473, -211257, -163654, -137620, -39684, -21053, -55922, -44487]
23595d4487K36581M1069J3250o2378n8881l2634K9656N3497o8229j13315n9272
23584f5143j25943J40887P7215k7718j41R0748j530j13326m3031P8431j29983
23573a19534J110P7147N4909J1629J5795N1904O0030r7955J1152K7466J7426J4324
23561A25403o0040j47067p1618K2742J27568O228J0308R3263J02154p8605P099
23550A37435P8927n1312j93349r4871J357L9031J24205P394r5066o2812P654P6015
23538b5392J85597l0616j04885j20988L5745N4384Q4235k8095j01641p002N2242
23527f416K4818r249K1394q7653P4997N6491n4849M0977J05247l6474m0471K2074
23515A10886m9265l1988j17413J8306l53k403K429j9274J7614j7394M4468L2438
$$ y = [-44487, 192094, 233163, 246413, 184035, 125154, 92520, 122176, 175673, 107444, -5871, -65143, -191086, -50199, 27016, -702, -843, 89905, 88375, -24951, -67982, 10449, -119534, -118424, -41277, 13632, 25261, 41056, 92960, 152990, 55035, 66187, 93653, 111079, 125403, 65363, -81704, -153322, -130580, -3012, 3216, 13524, 106787, 208941, 130336, 137435, 216362, 165050, -28299, -123170, -121813, -82782, 41423, 48817, -46249, -109061, -101407, -25392, 160205, 129589, 24704, -96284, -60539, -6155, 78080, 49985, -51656, -58658, -6416, 18402, 9153, 30547, -57106, 17891, 74382, 19533, 60510, 165757, 129283, 88812, 110886, 61621, 29633, -87780, -69474, -69827, -72230, -69801, -89075, -71461, -88855, -44387, -11949]
23503a1949o7064J00875N3195m8993j3641j39q6808P0526m9890l9196J5836p5936
23491a53184l8145J105p9306l0936L9318m9463O0305O41O9174J07771R0964n7152
23479c8908K9293O4867j05792l4342p364P0664n7973n1575O9486J08416n8271
23468a1499J3766P0961k4971j1522M0296J52614K9863j06283r2213l4603m2513
23457a6104j000J4142K9982P4346m5086r4818q9784K9874p6522j6140L909o2670
23445b49871l4935K286k6706l3963J49588L1924O4588M641j04930R0499O0800
23434d6079J0253p6328l2891o4669K9390j9082N7217K21030J12856l4680j23775
23423C3242n8469L2547j4290j06495M0627Q698J5964N5449k2364K6747r895K6381
$$ y = [-11949, -79013, 21862, 75057, 26064, 12423, 12284, -74524, -3998, -53888, -93084, -77248, -153184, -191329, -190224, -269530, -300466, -261148, -310611, -250306, -249665, -180491, -72720, 18244, -38908, -9615, 55252, -50540, -84882, -92246, -21582, -79555, -131130, -61644, 46772, -11499, 2267, 73228, 48257, 36735, 77031, 229645, 259508, 153225, 61012, 26409, -16104, -17104, -2962, 27020, 101366, 56280, -38538, -128322, -98448, -174970, -191110, -187201, -249871, -284806, -282520, -309226, -343189, -193601, -161677, -97089, -92448, -197378, -106879, -46079, -35826, -112154, -145045, -209714, -180324, -199406, -142189, 78841, 191697, 157017, 33242, -25227, 7320, -6970, -113465, -72838, -64140, -48176, 7273, -15091, 11656, 1761, 28142]
23411B8142j07882j3524J31011P7868r3667j44677M1020L7955K06722k8426p0865
23400F3677Q5416r889j00527p8367j39275J8840J27430L3089N6460j3551q0423
23389c7120M7836J01603k9255N1702R9318r4671j43430o8093P562R8751N7938
23378I2141p1740m2943R419R8984O1899r598o449j92960m2733K8516Q9097N9105
23366G2738j2955O1714P906O2286n5644P300r9908r2555Q921K449N2057l4010
23354a9701j16628l0130K2465Q4621q0410j41617M8211J09557K00856J3080j36393
23343d6089j2715J36859K8987p4770m156n7352q874K2335Q7705M7575m9399j3383
23331E6723o0807r6196J26414j8644o1592J18250L1037q4288j7157N8365J9312
$$ y = [28142, -79740, -93264, 37747, 115615, 21948, -122729, -81709, -43754, 162968, 134542, 63677, 149093, 139204, 38677, -39690, -178965, -160125, -32695, 394, 56854, 43303, -37120, 10716, 112319, 83064, 134766, 234084, 139413, -4017, -72110, -64548, 34203, 92141, 20401, -22542, -13123, 85861, 147760, 138162, 131713, -61247, -103980, -75464, 13633, 72738, 59783, 121497, 129403, 191689, 136045, 143345, 43437, -49118, -40197, -37748, 14309, -19701, -136329, -166459, -143994, -59373, -139783, -281400, -233189, -123632, 77224, 90304, -46089, -58804, 78055, 107042, 32272, 28116, -29236, -38110, -15775, 71930, 119505, 70106, 56723, -4084, -100280, 26134, 7490, -54102, 64148, 95185, 10897, -6260, 52105, 71417]
23320G1417k0489n0123j4099n6814L4767K1549J457Q2681R9995l4182j12434n8096
23308c4371n4467L7646J7099l0291p2O4925J24965L9765j21397m2835O5226M2146
23296A08339j00410l8202k6453k3379o8779Q9606J6660j9598l4687P3573J1467
23285a1863N0907r3797K4782M2300l4619m2578N4862K5563L7950P5300k2547o3770
23273D2490k07658j35051Q7623R1558N9813N465R5424o0283j28682K5392J21551
23262b358l1622j01613M3034J49671M1067j66201j18012O2816J191j32666N1294
23251b03399J54805O7797L5103J2941O0823R1397j06059j75673K2369k4853n9489
23240a24238L3194J09107K1103N613m3316J5241K7359O176j2277l2392P5758M9203
$$ y = [71417, 50928, 805, -13294, -70108, -35341, -13792, -12335, 70346, 170341, 136159, 23725, -34371, -88838, -51192, -34093, -64384, -64456, 469, 125434, 165199, 43802, 967, 66193, 108339, 7929, -30273, -56726, -80105, -148884, -59278, -42618, -62216, -96903, -23330, -11863, 39044, -54753, -29971, 12329, -22290, -64868, -10006, 15557, 53507, 128807, 106260, 42490, -165168, -300219, -212596, -121038, -61225, -55760, 39664, -20619, -149301, -123909, -2358, -33980, -135593, -92559, 57112, 98179, -68022, -186034, -123218, -122027, -254693, -203399, -48594, 19203, 54306, 67247, 128070, 219467, 113408, -62265, -39896, -64749, -124238, -91044, 18063, 39166, 44779, 1463, 16704, 44063, 50239, 37962, 5570, 81328, 130531]
23228A30531R0320o7842j13107p764K2727L0413p0753k1489r321m6403M8811R8952
23216H5075j991k4031n3299j590N9853K5815q7591j6637K4769J91498K5232p9828
23204A47275j8106j14168o607M8115p902n7158k0305j3341J8241R928L9670J096
23192B6738K9589N5048j9317r544k7879L9620r3297P408o4088R185O8670J8008
23180D0141N6647O7552L000m0327l6870m5836n7322K9293J42295j07700n935O979
23168E1917r7509L6405P0992o2298K1731L3098J1067j3107J6314J3109o8944l4002
23156b1227j7815K6568M8372L6610M3191n0878n1040q4503P1915m5382o1060L3042
23144g2207N1300J24780m2030n6854j22166k9296Q599P3244J7407N0694n5226
$$ y = [130531, 220851, 153009, 39902, 32138, 54865, 85278, 14525, -6964, -16285, -62688, -13877, 85075, 83084, 59053, 5754, 4164, 64017, 89832, 2241, -14396, 10373, 201871, 227103, 147275, 129169, 15001, 8394, 56509, 48607, -8551, -28856, -42197, -23956, -14028, 25642, 26738, 56327, 111375, 92058, 82514, 54635, 94255, 958, 8366, -55722, -46537, 22133, 40141, 96788, 164340, 167340, 127013, 90143, 44307, -13015, 16278, 158573, 50873, 44938, 51917, -45592, -9187, 61805, -493, 21238, 54336, 65403, 52296, 68610, 81719, 12775, -21227, -39042, -12474, 35898, 72508, 115699, 64821, 13781, -70722, 1193, -44189, -105249, -72207, -20907, 103873, 61843, 4989, -117177, -146473, -137874, -64630, -47223, 3471, -51755]
23133e1755p147q0834L5191O6580l5108J4637L9356K8288L4258R506J1781M3430
23121A08183J7986m198J4032M6684M0704o776J8524n630L8322J0024l1800q5708
23109A60347j61627j15127J4670J785J1777J07144O5992J1630J4321P8916Q3943
23098B73771o6193p2418j6451L3756j15380J576L0478n3258n4960m0563k7089
23087a06731j06251Q4114J16738J6987p6199l4844m3441O6329J06068K7615K3518
23076G3903p2751n1129M0333N6767l650J21422K2538o2433o7070N6791K317j29053
23064a2015j30827K1248J41298j27207k7915P3556J0251Q4735K5499K8194p1127
23053A5690p6458l8125j0086k3023O5887p3060J9698P7218J48803k6670j3422
$$ y = [-51755, -58902, -139736, -104545, -37965, -73073, -58436, -19080, 9208, 43466, 52972, 64753, 108183, 126169, 121971, 136003, 182687, 223391, 216615, 235139, 229509, 267831, 277855, 246055, 160347, -1280, -116407, -101737, -99952, -88175, 18969, 84961, 96591, 110912, 189828, 273771, 207578, 135160, 118709, 152465, 37085, 38661, 69139, 15881, -39079, -79642, -106731, -212982, -128868, -12130, 4857, -71342, -106186, -149627, -83298, 22770, 50385, 73903, 1152, -49977, -9644, 47123, 43473, 164895, 187433, 125000, 57930, 114721, 117038, -12015, -142842, -121594, 19704, -107503, -135418, -61862, -51611, 33124, 58623, 86817, 15690, -60768, -98893, -108979, -132002, -66115, -139175, -119477, -42259, 106544, 79874, 66452]
23042F6452j20514M4434r777j11451K076p757M736P3818P9602k1776k2946O2610
23030C9507L6751n171m6153J4548M0060N8260m6905p5824j12203J04711J39594
23019A47175k7710J8623L9904L341j04537J6167M265j50791j37059K9264N1116
23008a10242J8673Q7521J68645m2550q6251K787O0767l6414o4314K6927J50890
22997A76439O1721o4593j39729J2419J18523M6184j42035r9632J36914J14703
22987B20914j2676j39010n3399j06535j57731L5108R8863L8390O3903L2931P1455
22976I2213l7991p6277k3006R1069J5523L162L8363M4581r0428r7317k6455n5253
22964a21816k2966O6357J08869M8109M2032j6964K3659P6390l8237l0300j057
$$ y = [66452, -54062, -9628, -19405, -130856, -128780, -136537, -131801, -57983, 21619, -157, -23103, 39507, 76258, 71087, 24934, 39482, 79542, 137802, 90897, 15073, -97130, 7581, 147175, 119465, 138088, 177992, 181333, 76796, 92963, 97228, -53563, -190622, -161358, -110242, -91569, -4048, 164597, 122047, 35796, 38583, 99350, 62936, -1378, 25549, 176439, 238160, 173567, 33838, 46257, 164780, 210964, 68929, -30703, 106211, 220914, 208238, 69228, 15829, -90706, -248437, -213329, -114466, -76076, -12173, 20758, 92213, 54222, -22055, -45061, 46008, 61531, 64693, 103056, 147637, 57209, -40108, -66563, -121816, -144782, -78425, 30444, 78553, 120585, 103621, 127280, 203670, 165433, 135133, 134076]
22953A34076J6186r7664r0747r076k7970l5635q5702K6397J16294n6169J4833
22942i5177M6797j0170p7000q5108L3317J57270J2973m1765m8629J4633K597n6441
22930a46703N7295J57950n394N5744n7522j26701l1080J16240o1626l7333Q0950
22919A820O2505J62415L833j03766o7406o1927J18684p3819j79185M3829J86149
22908I3132P9676j02835N2505l2716r5051j3584p3405n4180N6596J13193M758
22897B8089r5904n127n9165J14979J07197Q47j0247k0365j17601P5876n1547m967
22885c7935j1924o4524p282L2724M9905K1516o6189n9942J4151Q4667O7237M1008
22873F3412k379k6874L6439J05303l1518r0431p4147l9719P5582J42046J02774
$$ y = [134076, 150262, 52598, -38149, -47225, -75195, -110830, -196532, -170135, -53841, -110010, -95177, -48380, -58550, -135550, -220658, -187341, -30071, -17098, -58863, -107492, -92859, -90262, -146703, -89408, 68542, 63148, 118892, 61370, -65331, -96411, 19829, -41797, -79130, 1820, 64325, 226740, 230573, 126807, 59401, -2526, 116158, 42339, -136846, -93017, 93132, 172808, 69973, 122478, 89762, -5289, -18873, -92278, -146458, -89862, 23331, 28089, -67815, -72942, -132107, -17128, 90069, 90916, 80669, 60304, -57297, 18579, -32968, -37935, -49859, -114383, -121665, -88941, -39036, -17520, -83709, -143651, -129500, -44833, 22404, 63412, 61033, 34159, 70598, 175901, 144383, 53952, -20195, -59914, 15668, 157714, 260488]
22862B60488j04541j70251m0746j3259M5504P5374k3597k4578l116N8359N5508
22851A15145K873o0286r4077m6199J9648R0878P555M757m3260k5169J28621J05782
22839B06268L6398j16720j49506j05728J67539J51299K4939o5904p1089q0630
22829c134o8551K3939Q2735K9400j88058m2471N1825N3823l0641Q6278O2789O362
22817F4296p104o0479N1842k9204j02205n206J31104J1560L5426l9227p5700r470
22805c4367N4853p0592j48885K5213Q0455R6115j7578L4867K18824q6946k5507
22794A26452P8088m8774M265l7877j0655l9478j44213l5423L9574j6978q0826
22783a65845J22273J24767J53116q3691j93840l8845m1850j3106O0781J22506
$$ y = [260488, 155947, -14304, -55050, -68309, -22805, 52569, 28972, 4394, 1278, 59637, 115145, 118018, 57732, -36345, -82544, -62896, 27982, 35537, 40294, -2966, -28135, 100486, 206268, 242666, 125946, -23560, -129288, 38251, 189550, 214489, 148585, 77496, -3134, -71685, -47746, 34989, 64389, -123669, -166140, -114315, -60492, -91133, -4855, 57934, 64296, 57192, -3287, 48555, 19351, -82854, -88060, 43044, 54604, 90030, 50803, -24897, -34367, 20486, -50106, -198991, -173778, -93323, 2792, -14786, 20081, 238905, 151959, 126452, 204540, 155766, 160031, 122154, 111499, 72021, -72192, -107615, -68041, -85019, -165845, -43572, 81195, 234311, 150620, -43220, -82065, -123915, -137021, -76240, 46266]
22773D6266J12928m5877M3301L4314J0469j7982R1246N8838j27644k34929j09299
22762a38369P7785j4861j83794N8966J89104O8219j48339J88882J09152o0453
22752A46292j3268q5875p9519O5919Q812P821p2414J9489J0043k871j43200p3313
22740b12084J20499K1680n6940L7829K0833j4249l759M1699J3320L9741j3241
22729d672O9985J31299j4927j6953n9877J900K1764L976k5896N600J2579p8020
22717D6758l2418n0052N134R1125k9683J06602L6119j733l6210j6573n0877k1484
22705D6708N2405L4173l2579M4022j8354m5656l0034J28582j2349n9764n3320
22694E3834k2033j1612r189o7079N8319R1327k6705k5106L7372J0666L818J7432
$$ y = [46266, 159194, 113317, 156618, 190932, 201401, 183419, 274665, 333503, 205859, -29070, -138369, -60584, -75445, -259239, -200273, -11169, 57050, -91289, 97593, 206745, 146292, 133024, 47149, -32370, 33549, 42361, 50182, -22232, -2743, 7300, 4429, -138771, -212084, -91585, -69905, -126845, -89016, -68183, -82432, -86191, -44492, -31172, 8569, -4672, 65313, 196612, 181685, 164732, 104855, 106755, 128519, 132495, 106599, 112199, 124778, 46758, 14340, -35712, -30578, 60547, 30864, 137466, 173585, 171852, 135642, 119069, 68192, 46708, 99113, 133286, 100707, 144729, 126375, 80719, 50685, 179267, 166918, 107154, 53834, 31801, 20189, 11000, -56079, 2240, 93567, 66862, 41756, 79128, 89794, 93612, 111044]
22682A11044L4279m8410p5836L4832j9241j76548l9618J40739M2732M5055j3919
22671C5109M2380k845o9501p8820L7476m8221M2122M2531j2660Q7668O9105l8937
22659A05407N4998j6788M0086J2419j62201m7716O5967l1336J4925o1266j00246
22648a25751l2528Q8963l9092N8818k2643p0767M5856J57840p6297n6600O5418
22637f783p6535p4185K1086P0695J54465J04155k4889j26802l3649R0771Q8668
22626A86997k4197K8586K8015P240j7736j22201p817M9830l6164o8265o9613M2865
22614b460Q7609q0106j7969L5720l4911N9969K3966J1156l9708J3327N2730K5707
22602A35030l4305k0920k7287P7382J5373n5080q2902J0848p1766l8044l4640
$$ y = [111044, 145323, 96913, 21077, 55909, 36668, -139880, -179498, -38759, 3973, 49028, 35109, 77489, 74644, 5143, -73677, -36201, -84422, -42300, 231, -12429, 75239, 144344, 105407, 160405, 143617, 183703, 196122, 33921, -13795, 52172, 20836, 35761, -25505, -125751, -158279, -69316, -108408, -49590, -72233, -143000, -97144, 60696, -15601, -72201, -6783, -83318, -157503, -136417, -65722, 88743, 192898, 168009, 41207, 7558, 98329, 186997, 162800, 191386, 219401, 226641, 208905, 86704, 78887, 128717, 92553, 24288, -45325, -2460, 85149, 5043, -12926, 22794, -12117, 47852, 71818, 82974, 43266, 56593, 109323, 135030, 100725, 79805, 52518, 129900, 145273, 90193, 7291, 18139, -53627, -91671, -126311]
22591a26311R1872J23611r4163l1118J7146l0402n63L4877P4813m2758K4776j9790
22579B1990j17249J2500M7755L0264r3766R5441Q8805m5069o9172J06058n7227
22568B0330j26463q5080R5642M3862N7815R2668N1788L8170j13090M5197M0323
22557A61162l1639j29050j21872k6339P9782q388O9936Q401l0399m9135K8971
22546d8570N5099m4900L4240o8579m5392M5728P801J0693J23125O3964P8208N0273
22534B61690Q0209M3923n0672Q2414O809p0522N6939K41381M29041K82495J99307
22523A563014J22012q5528j2489o6921N2365j0995r5998j93344l45641k06579
22513G19896k39651j6514j04486p4122n1828j49288n1629N0180l1650k3321o1260
$$ y = [-126311, -34439, 89172, -4991, -36109, -18963, -49365, -49928, -15051, 59762, 17004, 41780, 21990, -95259, -82759, -35004, -4740, -98506, -3065, 85740, 40671, -28501, 77557, 20330, -106133, -191213, -95571, -51709, 6106, 98774, 150562, 188732, 75642, 120839, 161162, 129523, 473, -121399, -147738, -67956, -76344, -6408, 1993, -28406, -77541, -48570, 6529, -38371, -4131, -72710, -118102, -72374, -64573, -53880, 69245, 133209, 211417, 261690, 341899, 385822, 335150, 417564, 424373, 353851, 410790, 652171, 1081212, 1363707, 1563014, 1685026, 1599498, 1587009, 1520088, 1572453, 1561458, 1465460, 1272116, 926475, 719896, 480245, 463731, 359245, 285123, 233295, 84007, 32378, 82558, 50908, 27587, -33673]
22502c3673m1441N0345O0132L721M6259M5435j9242o1647j06123L1779R0985J15895
22490A82425K7745N3113q377j08912o7004K1150P4925R825k9728j05818p9044
22479b9700O3197M9253K1566O113j30360m6830N8832K1537J7485p2009m9073K852
22467h7137M0243o6794l8906j05853m5753K3796R0039K5212J9488R1576O0380
22456F291L4979J8681n1264J6173m7098k0839O5656M91p2583l8640o8820K8585
22444a28388M0657J06837K0661n8085N9787K7504k8946q212R1226O2732l7214
22433A48559O0058Q9960J0083j05175n9771j8671m1363P5200K9936P633Q7713
22422B84162R913m0337j50294k7987n4438O0804n5205m456J17207k2685l5052
$$ y = [-33673, -75114, -24769, 35363, 39084, 85343, 130778, 111536, 49889, -56234, -24455, 66530, 182425, 210170, 263283, 254906, 145994, 78990, 100140, 175065, 184890, 155162, 49344, -29700, 33497, 82750, 104316, 110429, -19931, -66761, -7929, 13608, 31093, -40916, -89989, -87137, -46894, -113688, -152594, -258447, -304200, -280404, -190365, -165153, -145665, -54089, 6291, 41270, 59951, 8687, 24860, -22238, -43077, 22579, 23070, -49513, -88153, -156973, -128388, -87731, 19106, 39767, -18318, 41469, 68973, 40027, 31815, 123041, 185773, 148559, 208617, 298577, 308660, 203485, 143714, 125043, 83680, 158880, 188816, 196449, 284162, 294075, 253738, 103444, 75457, 21019, 81823, 26618, 22162, 139369, 116684, 81632]
22411H1632R0635k611k1190j30702K9751P1126l0537K0243P2949q2599p7116l9920
22399a8339P520J2848K95o3439L6444K23265O4169j57162j19621j3699R8483L8526
22387A09290j35278L0794R9455J63326r1322j66338L9637K0741L463Q6053J8694
22376A78515K2892j17934N6551p0149J136J6938M2L0194N0289n1099k0077R6731
22364A94029J683n7590n8133j50949O114N5083K9733N4157n5473R8966p1008Q8381
22352A34993P2723j02515k0952K1046k5521K8818R6459Q1585N8370j28231o6540
22341A50235m9398m3118n0744O6530J1216m9702j03861J6661J21499Q4836m0372
22330A13782j778R9690J16053n1723j09907j10918m2806L3028q4125k6739J10271
$$ y = [81632, 172267, 169656, 148466, 17764, 47515, 118641, 88104, 108347, 181296, 98697, 21581, -18339, -10819, 2029, 2324, -61115, -24671, 198594, 262763, 105601, -14020, -27719, 70764, 109290, -25988, 4806, 104261, 267587, 176265, 9927, 49564, 70305, 73768, 159821, 178515, 201407, 83473, 140024, 69875, 71011, 87949, 87991, 118185, 168474, 117375, 97298, 194029, 195712, 138122, 79989, -70960, -64846, -9763, 19970, 74127, 18654, 117620, 46612, 134993, 207716, 105201, 84249, 105295, 79774, 108592, 205051, 286636, 345006, 216775, 150235, 100837, 57719, 6975, 73505, 84721, 35019, -68842, -52181, 69318, 154154, 113782, 112004, 211694, 327747, 276024, 166117, 55199, 12393, 45421, -38704, -65443, 44828]
22319D4828K166N4664j08801k3852j0066R5920J26494p5123r302J43443o7462
22308A72909o2309P7611L79m7698p8421J20329K4115j04837j1746j5706K4461
22297I9087K260l715n6392n8791K6292o7217p4960N1389O6104K0318K3465J2599
22285D0439n2659n6707r5709M3951m131k2635P2798k592Q9122m7095q816L3297
22273a0737l5267J14508K4498P541n797k1813q112M5868K2241J6977l0595P511
22261A26823j04607o2857n033J53830p668j5861R0689N3309r8206l1679m5485
22250E3255N0120L8499M6167J07164n5006m968M3225n0461m3275M1487J44696
22239C70903J1939m5733K1452N6644l6582K1917K5939r4388j17200m6654k4917
$$ y = [44828, 46994, 101658, -7143, -30995, -41061, 54859, 181353, 106230, 96928, 240371, 172909, 110600, 188211, 188590, 140892, 62471, 182800, 206915, 102078, 90332, 74626, 99087, 101347, 97632, 41240, -17551, 8741, -58476, -133436, -82047, -15943, 4375, 27840, 40439, -12220, -68927, -164636, -120685, -124816, -147451, -74653, -77245, 11877, -35218, -44034, -10737, -46004, 68504, 93002, 100543, 94746, 72933, 64821, 110689, 132930, 149907, 119312, 126823, 22216, -40641, -45674, 108156, 100488, 84627, 175316, 228625, 130419, 98740, 53255, 103375, 141874, 188041, 295205, 240199, 235231, 278456, 227995, 184720, 226207, 370903, 382842, 337109, 358561, 415205, 378623, 400540, 426479, 332091, 214891, 168237, 143320]
22228A43320J25194k5003l2080p0231N8469O7440j713q9189r4385l8210R7217
22217A40829M1282m3843l4089O5704L588j74868r981R4385L6060P2469J08799
22206C00335j9779n1472j09087Q0550k9570l460j1773r9625J6048K6892q003k1201
22194F9855J8125L5533N1067m1957l5705M2677K4832p3207r5284j07203m2484
22183a53751J20833L0736Q310M201K9598J10135n8473n2323N3096N6686J1229
22172A60277l6409l492q507N0908p8805N0048M1079P6059Q9176Q1041k2439l879
22160C95057o2187l2723M5731j43000r0685J3410P4661q9519j0322l3797J12092
22149A78718O1363n3333r482m4224K3852j25561O113M1632J28028J3909M2162
$$ y = [143320, 268514, 243511, 211431, 141200, 199669, 267109, 265396, 176207, 81822, 43612, 140829, 182111, 138268, 104179, 169883, 173471, -1397, -11378, 83007, 119067, 191536, 300335, 280556, 229084, 119997, 200547, 170977, 167517, 155744, 56119, 72167, 99059, 91056, 69855, 87980, 123513, 174580, 132623, 96918, 139595, 164427, 91220, -4064, -111267, -153751, -32918, -2182, 6128, 10329, 39927, 150062, 91589, 39266, 92362, 149048, 160277, 123868, 120376, 111869, 162777, 83972, 134020, 175099, 251158, 340334, 421375, 398936, 395057, 332870, 300147, 345878, 202878, 112193, 125603, 200264, 110745, 100423, 66626, 178718, 240081, 186748, 177266, 133042, 156894, 31333, 37446, 79078, 207106, 221015, 263177]
22138B63177K9163j02207L969N578j03670r2870j0512M1603Q5811J10670K3006
22127B53718p3699k5777K2308N1066n6899j63224l9094O8895K6626M1731P4931
22116A80582M4989Q2702J21808k1168o2241N4525P6481j8340n4407l2418K2022
22105C94535k724n2576J09175L3179J206J24418j2171P2209o6655p5204o5173
22094D60219n575q8852o5666p1314J0905J34554R1040m4504j09869K2207l290
22083C29855q1065Q4453J5944n0865K274l2662J51065J78466j5355P5514l2774
22072F24850j83047o3370Q0352R1786N7499M2324P2972K11309J51435J99333K63640
22061A549083J30596K09020J11181k4043N9394L5976J05044r1416j60206r0455
$$ y = [263177, 292340, 190133, 194102, 199680, 96010, 3140, -7372, 34231, 120042, 230712, 253718, 180019, 154242, 176550, 227616, 170717, 7493, -31601, 37294, 63920, 105651, 180582, 225571, 308273, 430081, 408913, 346672, 401197, 477678, 459338, 404931, 372513, 394535, 391811, 339235, 448410, 481589, 482795, 607213, 595042, 667251, 600596, 525392, 460219, 454644, 365792, 300126, 228812, 239717, 374271, 465311, 420807, 310938, 333145, 329855, 248790, 333243, 349187, 298322, 300596, 267934, 418999, 597465, 582110, 657624, 624850, 441803, 378433, 458785, 550571, 608070, 650394, 723366, 934675, 1086110, 1285443, 1549083, 1679679, 1888699, 1999880, 1975837, 2035231, 2071207, 2176251, 2084835, 1924629, 1834174]
22051A834174k61575l50679k16617k13053j37125o0117J04709J34587L1894n2351
22041H13847l93o9057j5538J79757J24915K6028K9896J08338K41901J06135K6701
22030A572530n8919K3990M7085K5600J1719o6165p679m5380N8354J9590J55376
22019A736101R9493J22117Q1613K07245J72177R2069Q5134Q3402J60099K45868
22009C085318K68354K73418L49583M43605M18834N57324O17352P73932R14635
22000G702355J297094J719405K307016L211808M402389O438378R969327J5527562
21992E2575334K4685334L6446696M6516881M8818412L9929693K1945182M261874
21985B75179406l717405j045575M212257J829539j1937052l1236276m5680694
$$ y = [1834174, 1572599, 1221920, 1005303, 792250, 655125, 595008, 699717, 834304, 866198, 813847, 813454, 744397, 728859, 908616, 1033531, 1059559, 1089455, 1197793, 1439694, 1545829, 1572530, 1513611, 1537601, 1584686, 1610286, 1622005, 1555840, 1548161, 1502781, 1561135, 1580725, 1736101, 1835594, 1957711, 2039324, 2246569, 2418746, 2510815, 2595949, 2679351, 2839450, 3085318, 3353672, 3627090, 3976673, 4420278, 4839112, 5396436, 6013788, 6787720, 7702355, 8999449, 10718854, 13025870, 16237678, 20640067, 27078445, 37047772, 52575334, 77260668, 113707364, 160224245, 209042657, 248972350, 270917532, 275179406, 271462001, 270416426, 274628683, 276458222, 264521170, 233284894, 187604200]
21978A87604200m8978238m1973689l0544268k0139284j2808129q313735n621271
21971A9225586l881805k813315k215698j676632j179594j038961r28771o74042
21963D816768n50844n35831m93037k62737j99733k14699k04299k13855j59313
21954A982420j50243k29817j47472N4646n2147j48557q8573m3213j02198p1474
21944A003372k36740l7350K9121k4043j15843r7975p0016l3583R1026j0643j63437
21933C33889o9586N3166m1394P3137p9690n822J24410L0610r1517p3229M676N9464
21921C18114J0545k8802m4355O6097K23506K03457L39324K96178J69193P0871
21911A624128j9176R1440O6537j0776l3383o2021j74620k56909k68987k72710
$$ y = [187604200, 138625962, 96652273, 66108005, 45968721, 33160592, 24846857, 19225586, 15343781, 12530466, 10314768, 8638136, 7458542, 6419581, 5490810, 4816768, 4265924, 3730093, 3237056, 2974319, 2774586, 2559887, 2355588, 2141733, 1982420, 1832177, 1602360, 1454888, 1509534, 1457387, 1308830, 1220257, 1177044, 1074846, 1003372, 766632, 729282, 758403, 734360, 618517, 520542, 450526, 416943, 507969, 497326, 333889, 264303, 317469, 276075, 349212, 269522, 263700, 388110, 418720, 327203, 253974, 258650, 318114, 328659, 299857, 255502, 321599, 545105, 748562, 1087886, 1384064, 1553257, 1624128, 1604952, 1696392, 1762929, 1752153, 1718770, 1656749, 1482129, 1225220, 956233, 683523]
21901F83523k16251j41954o9222J40636q6057j13473k5537k0059Q339M9572K799
21890B12316L2127L0352k5769j22823O3565L9356j47346j93960P550N7839j06059
21879a52852K3228N9492Q1195M540P0806J5904o6333L7272N040q6154l903p2445
21867h4210j29794L7382R4327O468L6855M1655J22419J10407k2316L9253L6969
21856B89415J30145N4756j3763j08973l7440m4562R0749J1115n7885n8671l9877
21845B15009j14921j69455n3460K4500N8847j16437m6230k9182o8679L5407L6819
21834b27782J87586L0369n1924p0096J3958O2258K5925J21704J31836j5161q6280
21823A22393q0006o0318K7412O9371L7852j12596r57J35024j29174J1633M3159
$$ y = [683523, 467272, 325318, 256096, 396732, 310675, 197202, 171665, 151606, 159945, 209517, 212316, 244443, 274795, 249026, 126203, 189768, 229124, 81778, -112182, -104632, -46793, -152852, -129624, -70132, 11063, 15603, 86409, 102313, 35980, 73252, 78292, -7862, -11765, -84210, -214004, -176622, -82295, -75827, -38972, 2683, 125102, 235509, 213193, 252446, 289415, 419560, 474316, 460553, 351580, 314140, 269578, 360327, 371442, 313557, 254886, 215009, 100088, -69367, -122827, -98327, -39480, -155917, -202147, -231329, -300008, -264601, -227782, -40196, -9827, -61751, -131847, -117889, -55631, -29706, 91998, 223834, 208673, 122393, 42387, -17931, 9481, 78852, 116704, 4108, 3151, 138175, 9001, 20634, 63793]
21812F3793M3813j84749j72906j3559J10476P4990o3936n1320L4858K6007O4309
21801f8224K1771l1654R536Q171r2047p2318M7334K7111M5736q9530j49382j370
21789c44866R6061J11483P7612J5631r617q8624o2690K5762K0077J04832o4834
21778a19173l1028n27J08497J00244l8251R6615k1133N249k1630j24490k9759
21767g5386n829o3341j12382j29760K01809N8834p761M3634J16443P4827J588
21756A02676O5602n3974J9611K7996p3966k28201L8600Q9113Q274n1075m5714
21745a01058M9753r4160j181J41962J66573L1329k4895j11514l3987k6264l3418
21734c6860p7529j60956J8648Q8546Q2088P4900K458j1063o1350m455M617l4852
$$ y = [63793, 107606, -77143, -250049, -263608, -153132, -78142, -142078, -193398, -158540, -132533, -68224, -46453, -78107, -68571, -60400, -152447, -224765, -177431, -150320, -104584, -194114, -343496, -344866, -248805, -137322, -59710, -44079, -53696, -142320, -205010, -179248, -159171, -54339, -119173, -150201, -150728, -42231, 58013, 19762, 116377, 95244, 100493, 78863, -45627, -75386, -81215, -144556, -256938, -386698, -184889, -126055, -133816, -90182, 26261, 101088, 102676, 168278, 114304, 133915, 161911, 87945, -140256, -101656, -12543, -4269, -55344, -101058, -51305, -145465, -146646, -4684, 161889, 193218, 168323, 56809, 22822, -3442, -36860, -114389, -275345, -256697, -168151, -86063, -11163, -8705, -19768, -81118, -85573, -80956, -115808]
21722a15808M7851J17621o6909n548q2751P906R9116N7557L6464Q4783p1785p600
21710A00897r3329p6864o211k7386K9722L6997q6658J8418m4069n1053m7717N1821
21698a95432J00135Q5065M4551o773l8904M9573L3970N2513K0993j8547J0269
21687A37413j3338K6419P0053N0421m7700K8695J04976m467j98698o5825l7329
21676E0620K9507O2938m1067J4656j7620Q1536j22605r8863J5861L3402N031j9147
21664e751k9398l7990j2762k4526j7190L4930j8829N5742j759J050J13330O8647
21652A25494j14356o6043L8976J15934L4476M8234q3918q6149l5768j3842q6862
21641a23824r0290j6815K1972N308P4616J9730J12402k0745n3789j6883L595p9913
$$ y = [-115808, -67957, 49664, -17245, -22793, -105544, -97638, 1478, 59035, 95499, 180282, 108497, 100897, 7568, -69296, -75507, -102893, -73171, -36174, -122832, -104414, -148483, -199536, -247253, -195432, -95297, -10232, 34319, 27546, -11358, 38215, 72185, 124698, 145691, 127144, 137413, 124075, 150494, 220547, 270968, 223268, 251963, 356939, 352472, 153774, 87949, 50620, 80127, 143065, 101998, 116654, 99034, 180570, 57965, -40898, -25037, 8365, 13396, -5751, -35149, -73139, -85901, -110427, -127617, -92687, -111516, -55774, -57533, -56483, 56847, 125494, 11138, -54905, -15929, 100005, 134481, 182715, 98797, 12648, -23120, -36962, -123824, -214114, -230929, -208957, -203649, -129033, -109303, 3099, -17646, -71435, -88318, -84723, -164636]
21629a64636o9022l9029J43M6249J24856P3330k218P7255O8398P6156l9501j43981
21617H000n2551R8415K503q2407j5405R4117J9748k5150m126N7220j454j2302
21605H6608K6594J0856j26522o9394M6610p4181J35716n3924p4267r669j34406
21594b35979k9784K8197r7083J7328O7172n8162k5552O8312O3482j20j7821N1293
21582a68717M1837N520o0597L6943N528J23843N2188j5268j38886n4400p1371
21571b43380Q79R7625L5493J00139l2573m8297P8182J03804p9022j27655n0721
21560a65526M6735L6537j6536l1357J28297J08221q6418l9497o8076l7958j48235
21549b73813j6214L7658k243P4932J5222R1966J6962l3315q4906n4309L6687P6807
$$ y = [-164636, -233658, -272687, -272544, -226295, -101439, -28109, -30327, 46928, 115326, 191482, 151981, 8000, -44551, 53864, 56367, -26040, -41445, 52672, 72420, 47270, 43144, 100364, 98910, 86608, 113202, 124058, -2464, -71858, -25248, -99429, 36287, -17637, -91904, -101573, -235979, -265763, -237566, -334649, -317321, -250149, -308311, -333863, -265551, -202069, -202189, -220010, -168717, -126880, -121360, -181957, -145014, -139486, -15643, 36545, 21277, -117609, -172009, -243380, -242501, -144876, -109383, -9244, -41817, -90114, -11932, 91872, 12850, -114805, -165526, -118791, -82254, -98790, -130147, -1850, 106371, 19953, -19544, -87620, -125578, -273813, -290027, -252369, -254612, -179680, -164458, -72492, -55530, -88845, -173751, -228060, -191373, -114566]
21537a14566n7084j0299M5373P4347p2170L2075K2997J00822R8640J2992L0189
21526A63316j05147N2533j447r7661O0321j3212j7527n6628m0490j04345l5489
21515a95776M4475N7198L5092n361J30811J1919k3509L2816r2134l0991k0096
21504e5556J9913k283j35222J2523J9334L9953J02015j4412R549l0163K0614J04302
21492I0567K6606k18842j14849L7603M8173N0447O2277N0545j2670k8897j6217
21481b5257L2677K9056j5440O8227O7439k8611j05806m634J17875J034j20745
21470A5815j10855J15375J73752r5893j15584j2947K4753J40076L8515P5294q9678
21459A58623r3494L664J17002J07285q6592j50967R7437J47388P9925n4015r905
$$ y = [-114566, -171650, -181949, -136576, -62229, -134399, -102324, -79327, 21495, 120135, 133127, 163316, 58169, 110702, 109255, 11594, 71915, 58703, 41176, -15452, -55942, -160287, -195776, -151301, -94103, -59011, -64372, 66439, 78358, 54849, 87665, -4469, -35460, -55556, -35643, -37926, -173148, -160625, -141291, -101338, 677, -13735, -4186, -34349, -13735, 90567, 117173, -101669, -216518, -178915, -130742, -80295, -18018, 32527, 19857, -9040, -25257, 7420, 36476, 21036, 89263, 156702, 128091, 22285, 17651, 135526, 136560, 15815, -95040, 20335, 194087, 98194, -17390, -30337, -5584, 134492, 173007, 248301, 158623, 65129, 68793, 185795, 293080, 206488, 55521, 152958, 300346, 380271, 326256, 316351]
21448C16351p4392j58730K6346K01708J93432J61388K47148K49785K93404J90100
21438A646540K0945k8109P5828q6078j44570j91109k43986j92727j35297j42752
21428E78685j43233j24153o0676n1598j60262m1688P1084L4070Q9628r6550j04429
21417i122j12168j4284j7374K8892J14645M0499N2724L2696q644j32020j03094
21406a27250P9590R6530l9820r2699j01336J8739n0381J89965Q2878n5080n9587
21395e8451K7979j0941O3240N9202k0889k1911r8549L8891P0233n9633o3054o4919
21383a38802o5500j2693K3630k5886q098O8185J10844N3711K384j66164n1969
21372b10358N2808J01828O9415n0612q2751p7222l4309N6615l7492K6941O1083
$$ y = [316351, 241959, 83229, 109575, 311283, 504715, 666103, 913251, 1163036, 1456440, 1646540, 1667485, 1639376, 1715204, 1629126, 1484556, 1293447, 1049461, 856734, 721437, 578685, 435452, 311299, 250623, 199025, 38763, -2925, 68159, 102229, 191857, 95307, -9122, -121290, -135574, -152948, -124056, -9411, 31088, 83812, 116508, 107864, -24156, -127250, -47660, 48870, 9050, -83649, -184985, -166246, -216627, -26662, 56216, 1136, -58451, -30472, -41413, 21827, 81029, 60140, 38229, -60320, -21429, 48804, -10829, -73883, -138802, -204302, -216995, -193365, -219251, -227349, -159164, -48320, 5391, 7775, -158389, -210358, -157550, -55722, 13693, -36919, -119670, -196892, -231201, -174586, -212078, -185137, -124054]
21361a24054K5879O6285K6927J9415l6110j18006o9004M356J23314J18373j17897
21350h0522m4707N9036j5096o2952M4160M2831Q1091K9995k7209O5427J1756p097
21338I6713l9561p0896O776j8525l3680k9130j1827j5742L0175M5032J4833m9107
21326g4939N1915J38815K25185J44649J05089k1770o8353l4795J31273K1371j25271
21315D93169j00890k03554j45878p9692Q818Q780P8552j4421k0396n7028R895
21304b2645j6407r2187l5223M8400M4793k9059l2059N2637j90N1795N5243J18230
21292A43328q1812j5793J463m1686r4301q1729L7791L2906q9379m8721Q5708Q9268
21280f2957k9947L219K8572o4595L318Q5131M7536l2781r5785J013k6676l3198
$$ y = [-124054, -98175, -31890, -4963, 14452, -21658, -139664, -208668, -204312, -80998, 37375, -80522, -125229, -66193, -81289, -144241, -100081, -57250, 23841, 53836, 26627, 92054, 103810, 96713, 57152, -13744, -6968, -25493, -59173, -88303, -100130, -115872, -85697, -40665, -25832, -74939, -23024, 115791, 340976, 485625, 590714, 568944, 500591, 465796, 597069, 618440, 493169, 392279, 188725, 42847, -36845, -28027, -19247, 59305, 44884, 24488, -32540, -22645, -39052, -131239, -166462, -118062, -73269, -102328, -134387, -81750, -81940, -30145, 25098, 143328, 61516, 45723, 47186, 5500, -88801, -170530, -132739, -99833, -189212, -237933, -152225, -62957, -92904, -89685, -61113, -125708, -122390, -37259, 10277, -22504, -118289, -117276, -143952, -177150]
21268a77150j08675N6309N4179O989n985l4499K983O6759J21584Q3451n8871k0853
21256a3779j3286q5093R9381J25830l3517n6837j4914m6881p2324R289L2381m4661
21244a14411l720K2815J3672M7090J32063J8183j06103p6895j7100J01405K1370
21233C8369j68023n1890N2909o2895L6290R1411J62082O0796l1295l3985j01526
21222g757l6985L8502j81334J3256K01617K39531K00040R7439j8961l9697q505
21211D97146N5659j52305k14590j18664M988J04354n4881n8539J8840P0397J4218
21200A66623j21782j20326k892k409L8049L8752J3885q2959O038M1845j5209l7328
21188g7713j68064j1472K6685J25636Q5587j6895o1386J8186l6797K6483Q5818
$$ y = [-177150, -285825, -229516, -175337, -168348, -174333, -208832, -205849, -139090, -17506, 65945, 7074, -13779, -27065, -112158, -12777, 113053, 79536, 22699, 7785, -39096, -111420, -102131, -69750, -114411, -118131, -95316, -81644, -34554, 97509, 115692, 9589, -67306, -84406, 16999, 38369, -129654, -181544, -128635, -191530, -155240, -63829, 98253, 159049, 127754, 93769, -7757, -44742, -6240, -187574, -174318, 27299, 266830, 466870, 564309, 545348, 505651, 497146, 552805, 400500, 185910, 67246, 72234, 176588, 121707, 63168, 82008, 152405, 166623, 44841, -75485, -78377, -80786, -42737, -3985, 9900, -73059, -67021, -25176, -40385, -77713, -245777, -257249, -230564, -104928, -19341, -36236, -97622, -79436, -116233, -89750, -3932]
21177c932K9903O5218N3476j43006j55954o3754O3899J99164J0524l3137J2732
21166C5133L4459j06068m9591o8685J0211n031L4661M7764O133j63548k1773O2406
21154a83929r427m5125J01654N1290J9838M293L9796Q8514n0343j22432M5005
21143f0866m4127m0493J7646K585L3844N0725p2938M3973R6729K651K1093j3951
21131C6871k7873M5044J1847j4454L0413p2875j04233P5059O5335M7601N8450
21120A51185r1857j2796N466j2250M3540r7314q8421j5201N0928N9013j05359
21109a13066r751R6859J6208k1999J8884M6394j01507L9992N8356K9795P970j2886
21097E5249j07467M3448O9917l2757K746j1882K7731l0437j55013j7646j8157
$$ y = [-3932, 25971, 91189, 144665, 1659, -154295, -218049, -154150, 45014, 55538, 22401, 35133, 69592, -36476, -86067, -154752, -144541, -149572, -114911, -67147, -61014, -224562, -246335, -183929, -193356, -238481, -136827, -85537, -65699, -61406, -21610, 66904, 16561, -105871, -60866, -104993, -145486, -127840, -125255, -91411, -40686, -113624, -69651, 27078, 29729, 50822, 36871, 8998, 54042, 65889, 51435, 81848, 8973, -95260, -20201, 45134, 92735, 151185, 59328, 46532, 51998, 39748, 83288, -14026, -102447, -117648, -66720, -7707, -113066, -122817, -25958, -9750, -31749, -12865, 33529, -67978, -27986, 30370, 60165, 68135, 55249, -52218, -8770, 61147, 28390, 31136, 19254, 46985, 16548, -138465, -156111, -174268]
21086a74268j1871M1505J8329M9442l0650r269O6469j6190m6621K4473J40505
21075E1854J38053N321j6946r051p1706p6745m1351l0323M1087J21834M5354m1113
21063A16268J8870P3968P916n7362l6297j48776r0462J29195M4450J02115n5962
21052A03923o9679o0532m99m2134N8187J21572J5658k2767m9755k3355J2146o5047
21040b2282o9306M1248J00614M1864L0541o6139j01028q8231K3997j5255Q1012
21029d2965O3925N9129k8642j22578N7328j1538k8076j2356L6643r50m0909p01
21017g1690k1928P6887N1862K959m4559p5753l7442J3682N2404l1134l6729n0634
21005a72075k4962J36115L9478n6570K9883J0456J65165J00906j66535j38615
$$ y = [-174268, -186139, -144634, -126305, -76863, -107513, -116782, -50313, -66503, -113124, -88651, 51854, 189907, 195228, 178282, 169231, 97525, 20780, -20571, -50894, -9807, 112027, 157381, 116268, 135138, 209106, 217022, 159660, 123363, -25413, -115875, 13320, 57770, 159885, 103923, 34244, -26288, -26787, -68921, -10734, 110838, 126496, 103729, 53974, 30619, 42765, -22282, -91588, -50340, 50274, 92138, 122679, 56540, -44488, -132719, -108722, -123977, -42965, 20960, 80089, 51447, -71131, -13803, -25341, -53417, -65773, -29130, -30080, -70989, -71690, -93618, -16731, 35131, 38090, -6469, -82222, -119664, -105982, -53578, -84712, -121441, -172075, -197037, -60922, -21444, -78014, -48131, -37675, 127490, 228396, 61861, -76754]
20995g6754q6846l6153J8466K0605P3613J02134L3346k6138P8539N0043m8448
20984A02407r1947j9551M9276Q508J3812O3532r6612r4908P2056Q6215l8479l4989
20972A9320j1924J6185j16128j09073L7003J67815q754j46905O902J37035Q6977
20961G8453p949K7320n0905r2718Q4374J7023K364r9113o6387J2966J07652P9809
20949I2889R1805q4845q132J2137m3741o6667k5197P9483J0739k3360O1227K2205
20937A18543m3385J4428K2103M320n7209k9078l4737Q5434P6937o889o4807K3900
20925A09560M354m0283r915k1152l5401J09682j40938o3520J7858J47899P7281
20914A55425q2935p9918o4402J3272Q2005m2074k1685m1196N9065P4180j08822
$$ y = [-76754, -163600, -199753, -181287, -160682, -87069, 15065, 48411, 22273, 100812, 150855, 102407, 10460, -9091, 40185, 48693, 62505, 126037, 29425, -65483, 6573, 92788, 54309, 19320, 7396, 23581, -92547, -201620, -164617, 3198, -5556, -152461, -145559, -8524, 78453, 70504, 97824, 46919, -45799, 38575, 55598, 57962, -41151, -107538, -94572, 13080, 92889, 184694, 99849, 91717, 103854, 60113, -6554, -31751, 47732, 58471, 35111, 96338, 118543, 75158, 89586, 111689, 116009, 58800, 29722, -5015, 80419, 157356, 150467, 85660, 109560, 113914, 73631, 63716, 42564, 7163, 116845, -24093, -87613, -69755, 78144, 155425, 72490, -7428, -71830, -58558, 23447, -18627, -40312, -81508, -22443, 51737, -57085]
20903e7085j11674J57531J30362j2967n8424L1247P1205n7201J023P9287n7661
20892A15643j00249m7557m0865K0822Q17M9118L086O8502p1446l6071O8034J7909
20880D7743o3803P424m5333m7575r9917q876N7189R4961Q4238K7497Q0272K688
20868A36508l7578n0254l4880o3873p2871J3106j03582J5775P7257K4628M9740
20857d6024P4349j1901O3554L5457P676q9748q3392R4480Q2332m8213o3360J2603
20845B7813P7797J04424R6856K5987N9777L2865P0293J59406J71562J80549K16945
20834A224274L35326M35089J39561k52230m31971l44852k46520k90057j95630
20825C72990o3396m1456J8544k5237n0544j52293j33301n8737J41322K12259j0143
$$ y = [-57085, -168759, -11228, 119134, 106167, 47743, 78990, 150195, 92994, 94017, 173304, 115643, 15394, -32163, -73028, -52206, -51389, -2271, 815, 69317, -2129, -38200, 29834, 47743, -16060, -8636, -53969, -101544, -201461, -210337, -153148, -58187, 26051, 53548, 133820, 136508, 98930, 48676, 13796, -50077, -122948, -109842, -213424, -197649, -120392, -95764, -46024, 28325, 16424, 79978, 115435, 123111, 33363, -50029, 44451, 126783, 78570, 15210, 27813, 105610, 210034, 306890, 332877, 392654, 425519, 495812, 655218, 826780, 1007329, 1224274, 1559600, 1994689, 2134250, 1882020, 1450049, 1105197, 858677, 568620, 372990, 309594, 268138, 286682, 261445, 210901, 58608, -74693, -133430, 7892, 220151, 210008]
20814B10008m5289L0782p7337j57118o6913J31745j1384l8026R2881m7123o7358
20803d5132K9679M4553M2683j4502O8472J26783j2338j12595L2656o5305m8528
20792D6426N2422j7255l9294L1341k2074q3626M0649M1953l7217o7041j813R105
20780d6424J948M720k2127Q2562J3627R7775O0998J7861q0688j167M3286m5038
20768A27333k2985O8579L967K8873p436j7895k1065q2857K6881M1511o0237j740
20756H2929J7021j37786j15708P8645J47545L0814j0058j55044l1813L550n9168
20745a49073r3642R6019J6518J19621J24613k8358r3725Q4706R9698L4447p1944
20734A38880j66745J2110P1736l5938l3087j14999j38039N4865P1366k8578P7002
$$ y = [210008, 164719, 195501, 118164, -38954, -105867, 25878, 14494, -23532, 69349, 22226, -45132, -15453, 29100, 71783, 57281, 125753, 252536, 240198, 127603, 160259, 94954, 46426, 98848, 81593, 42299, 73640, 51566, -32060, 8589, 50542, 13325, -53716, -55529, -46424, -44476, -39756, -61883, 20679, 34306, 132081, 193079, 210940, 130252, 129085, 172371, 127333, 104348, 172927, 176894, 205767, 198331, 180436, 159371, 76514, 103395, 144906, 84669, 82929, 99950, -37836, -153544, -74899, 72646, 103460, 93402, -61642, -93455, -89905, -149073, -242715, -146696, -130178, -10557, 114056, 85698, -8027, 76679, 176377, 210824, 138880, -27865, -15755, 55981, 20043, -13044, -128043, -266082, -211217, -139851, -168429, -91427]
20723i1427R7607J00663J1375O2836k139m9859K9492k8311r9949n9560j1590N6695
20711A5833J21054j10684j14839r2284M5375J35062M2404p6271J30232R1790j18616
20700F9056j1324N7227O5945j25675m4919l9023Q3724M1915q2534m8825q2211
20689a16644l4211L7917k4127j5974Q0719J77511J13637J9037j71084o9435K9534
20678B6880J0542j37908k9903M5877J46339Q38n5687j04168k6313J19695k6546
20667c0354P9035K0451o768J8487R0742j15722l7295j02701n2787P2481j5247
20656g9678M3149O2750K719J9529O0827K1442o1898q3584p6496q9680J05763L6859
20644c8298j23466k3198J8759J26453j5829j8653K4393N8386P9228r3042o9293
$$ y = [-91427, 6180, 106843, 118218, 181054, 178915, 129056, 158548, 130237, 30288, -29272, -40862, 15833, 136887, 26203, -88636, -180920, -135545, -483, 41921, -34350, 95882, 187672, 69056, 57732, 114959, 180904, 55229, 10310, -28713, 55011, 96926, 14392, -34433, -116644, -150855, -112938, -137065, -153039, -72320, 105191, 218828, 237865, 66781, -2654, 26880, 37422, -100486, -130389, -84512, 61827, 62665, 6978, -97190, -123503, -3808, -30354, 48681, 69132, 62364, 80851, 171593, 55871, 18576, -84125, -136912, -64431, -79678, -36529, 26221, 28940, 48469, 109296, 130738, 68840, -14744, -91240, -180920, -75157, -38298, -161764, -184962, -166203, -39750, -55579, -74232, -49839, 8547, 87775, -5267, -74560]
20633g4560n8951L4854J52444K8889J6011j29650m6369k9954Q0841O4826l2326
20622F055k7418O6806J7800p8516m8438J2671M8781n2068p5616K7819j22074q528
20610b32726K52666J03398N9366j7242j34096q1928P6829J8326m3233N6524l4903
20599B2981r0037o0144N6106J84373K6335j04410q4403J00472r4859m7281q649
20588i9516L855j7127q371j1372Q3147O9824J26268Q041j3778q428j10616q6611
20576f4684j7045J718O6619M7317o3305r2313O6337j0643p6088j2506M0878k7129
20564a40844O6685k7756K3053P2417R7143Q2630J7333L1755o2038J988j7410j66863
20552b1907K6976N150k9720j08970j6282j7576K9695j2735P161q2836J25065J55854
$$ y = [-74560, -133511, -98657, 53787, 82676, 98687, -30963, -77332, -107286, -26445, 38381, 6055, -21363, 45443, 63243, -15273, -63711, -51040, -2259, -54327, -129943, -102124, -224198, -232726, 19940, 123338, 182704, 165462, 31366, -50562, 26267, 44593, 1360, 57884, 22981, -67056, -127200, -71094, 113279, 139614, 35204, -49199, 51273, -43586, -90867, -99516, -95661, -112788, -121159, -132531, -49384, 20440, 146708, 154749, 140971, 132543, 21927, -64684, -81729, -80011, -13392, 33925, -29380, -121693, -55356, -65999, -142087, -154593, -113715, -140844, -74159, -101915, -78862, -6445, 90698, 173328, 190661, 222416, 160378, 162366, 144956, -21907, 5069, 10219, -19501, -128471, -144753, -162329, -132634, -145369, -138208, -221044, -95979, 59875]
20540E9875O3992j06456j87483J14747J00417N8105j07442l1113J253J5226Q1235
20529F2356J44995q4783j56288j32785j37045M9757K20671R3955P054j58388k4347
20518a14848L9372p922o1870Q3029M0372K6003q0154r289P6383R0079k7742j18745
20506f5332j50141l7924R5420K53482N0231j09107k3038J00641N216o7794j06911
20495e5257J8455j57031o1439K9080J09725j6641j28173J22446K08274J11918
20485A81357k7852L855L4836m1350j0686j8399m1599j02346j05774M4538k1556
20474a04976j4012K0253J38933J37592p22R651M6161L3452M3065o4051M822K9433
20462B79601K7885P9717n3964R8404P79m9102l686k07190k04379K5353O6899K6415
$$ y = [59875, 123867, 17411, -170072, -55325, 45092, 103197, -4245, -35358, -34105, -18879, 62356, 207351, 122568, -33720, -166505, -303550, -253793, -33122, 60833, 67887, -90501, -114848, -75476, -83398, -145268, -62239, -21867, 4136, -76018, -85307, -8924, 81155, 53413, -65332, -215473, -253397, -157977, 95505, 145736, 36629, 13591, 114232, 119448, 51654, -55257, -36802, -193833, -255272, -226192, -116467, -133108, -261281, -138835, 69439, 181357, 153505, 157360, 192196, 150846, 140160, 121761, 80162, -22184, -127958, -83420, -104976, -118988, -98735, 40198, 177790, 177068, 186719, 232880, 266332, 309397, 245346, 250168, 279601, 307486, 387203, 333239, 431643, 432422, 383320, 379634, 172444, -31935, -6582, 60317, 86732]
20450H6732L08N1564o848N2975j04951n0595M4995J31472J05580k615p8445n8986
20438A71186j75042q0488P2711P2111J8628k3414k3588k566m4934j0183O5111
20427C9532J01739j00160J8538N7384K9246j10944r9960n580J24940K9734L0687
20416A15156L4151l473K0632k0228m4358o5343j3313j8924k2570j32202l264Q9756
20404f3980J23176J42772M6539j24707j98835p8473k9712K6735Q9321J17972r505
20393D1303j5216k1637l7805m9757R1746J11934r3550k9218m6714l4447k2718
20382a06079O9152J79768j33630n3167K1687m6843P4933K0253P0278M0453Q2l3948
20370A02939o2884N3347P8355K3860J3839O1982r319J4415j35028O8409n9372
$$ y = [86732, 87040, 138604, 131756, 184731, 79780, 29185, 74180, 205652, 311232, 308617, 230172, 171186, -3856, -84344, -11633, 60478, 79106, 55692, 32104, 29538, -15396, -25579, 39532, 141271, 41111, 59649, 117033, 146279, 35335, -64625, -70205, 54735, 84469, 115156, 149307, 145834, 166466, 146238, 101880, 36537, 23224, 4300, -18270, -150472, -153736, -63980, 59196, 201968, 248507, 123800, -75035, -153508, -183220, -156485, -67164, 50808, 41303, 26087, 4450, -33355, -83112, 8634, 120568, 27018, -2200, -48914, -83361, -106079, -36927, 142841, 9211, -43956, -22269, -69112, 5821, 26074, 96352, 136805, 136887, 102939, 40055, 93402, 171757, 195617, 209456, 271438, 262119, 276534, 141506, 209915, 150543]
20359A50543j96194O6522J61265o3320L6045L114k5880J6164L2913j840n7214
20348A22118o4475N5510J35725N345R369o214M7162o8355O698K7048Q169K9957
20336C08057O848J03851m3272m0472N8506q1995l3364Q3714J07118m0214M1124
20325D69901o400j26711O2774R8744P1593l9160n6458N4884M205q1408k963n2093
20313C96908K2272J23396J76631j18593j16744J16689K76944J03515Q9238p015
20303A063241q1682n4565j78142L0901K4730q6855q3261k9818R6022Q8700l0217
20292G59054j5186k2910J39462Q1705L7536m0199n2578r4624L0655p6876j55769
20281E90270J5007J4628N554j3057L2868P8686J07311K21720J97894j11097m2001
$$ y = [150543, -45651, 20871, 182136, 118816, 154861, 157975, 132095, 148259, 181172, 179332, 122118, 57643, 113153, 248878, 254223, 263592, 257378, 304540, 236185, 242883, 269931, 278100, 308057, 314905, 418756, 375484, 335012, 393518, 311523, 278159, 361873, 468991, 428777, 469901, 463501, 336790, 399564, 498308, 569901, 530741, 474283, 529167, 533372, 451964, 449001, 396908, 419180, 542576, 719207, 600614, 483870, 600559, 877503, 981018, 1070256, 1063241, 981559, 926994, 748852, 779753, 804483, 717628, 634367, 604549, 700571, 789271, 759054, 743868, 720958, 860420, 942125, 979661, 939462, 886884, 792260, 822915, 746039, 590270, 605277, 619905, 625459, 612402, 645270, 723956, 831267, 1052987, 1250881, 1139784, 1097783]
20270A097783r3777P1406N4389L1288j7357L0903J21295r7493l7230J63804J97454
20259A522465K80217L58753L27498J05253n2232j40861J03273J07756J52233K17986
20249B982341r7216j39594J29671K23382J77640L70124N61234Q20110J095566
20240F123258R29863L87921k43091p65550q07670l70780n4050K137K8377J63593
20230E394008M07299L03798L67554N12383O66303O84094Q00502J125147J451333
20221A1712421J555924J814744K283401K703441L359252M488526N929053P908980
20213D1755742J1130580J6111775K3488414L5436242N3808811P7814196R3992399
20206C53538159P1039663j667236p3272781r3597453p5486176n1522363l4314321
$$ y = [1097783, 1004006, 1075412, 1129801, 1161089, 1143732, 1174635, 1295930, 1198437, 1161207, 1325011, 1522465, 1802682, 2161435, 2488933, 2594186, 2541954, 2401093, 2504366, 2612122, 2764355, 2982341, 2885125, 2745531, 2875202, 3098584, 3276224, 3646348, 4207582, 5027692, 6123258, 7053121, 7441042, 7197951, 6432401, 5624731, 5253951, 5199901, 5202038, 5230415, 5394008, 5801307, 6105105, 6472659, 6985042, 7651345, 8335439, 9135941, 10261088, 11712421, 13268345, 15083089, 17366490, 20069931, 23429183, 27917709, 33846762, 41755742, 52886322, 68998097, 92486511, 127922753, 181731564, 259545760, 353538159, 424577822, 422910586, 349637805, 256040352, 180554176, 129031813, 94717492]
20199I4717492k3067432j5937741j1375414q391320o239962m699898l640772k900958
20191A8463995k216706j491623j150455p89200n27838k52274k45728q93297j257488
20182I639386j276431r08338o49496m46750j37851J39474O31759J071532J652931
20173I716216K236897J658165r554j755936k300117j835542j428570j126706q54603
20164D300250n63157k68124k26522j40670K5724q2875j97047k54902k52781j8549
20154B321347J60849N4302k47218m28521l76322j76086r1291n7840k474L9595
20144A196341l4144j46306j35615o4692o1284r9764k9098r59O3337l06o9352j5819
20132F02339O6877j01743j02781P6394L5811k7971j1965j64747P2271L8572j14542
$$ y = [94717492, 71650060, 55712319, 44336905, 35945585, 29705623, 25005725, 21364953, 18463995, 16247289, 14755666, 13605211, 12816011, 12288173, 12035899, 11790171, 10896874, 9639386, 8362955, 7454617, 6805121, 6358371, 6220520, 6359994, 6991753, 8063285, 9716216, 11953113, 13611278, 13601724, 11845788, 9545671, 7710129, 6281559, 5154853, 4300250, 3737093, 3468969, 3242447, 3101777, 3127501, 3044626, 2847579, 2592677, 2339896, 2321347, 2482196, 2536498, 2289280, 1860759, 1484437, 1308351, 1217060, 1159220, 1156746, 1196341, 1162197, 1015891, 880276, 815584, 754300, 654536, 625438, 624479, 687816, 687510, 618158, 602339, 669216, 567473, 464692, 541086, 576897, 548926, 536961, 372214, 444485, 483057, 368515]
20121C68515k15140O3767Q3550J02659O0464l4179j09256J29916O5212n4275r3664
20110C67569m9236L8045k6185m7704j600L6957n6468l8460j54721n089R6260J56493
20098C15861P2428M0625J2402j74339K3441k672j9240J6557k6826n6508n1413
20087A50316M1070n5490N8260J51155n7356J37061L4806L6124n0781k2957q2703
20076C39505o5093q926L2665L3546j24081J5734p3046j19927j0333O8899p80M8393
20064A36556m2180l3198k4332P6359R9567j7650O2132q1045K3786j4558K0479
20053B05916J9789j4292j8767o7974j11819P8989P6527p172k1111p226R4030l7349
20041A89541j61491J1702q4883p9628J13739k9011k6662Q7246q1910q4421n052
$$ y = [368515, 153375, 217142, 300692, 403351, 463815, 429636, 320380, 450296, 515508, 461233, 367569, 318333, 356378, 330193, 282489, 280889, 317846, 261378, 222918, 68197, 63108, 159368, 315861, 388289, 428914, 441316, 266977, 290418, 287746, 268506, 285063, 258237, 201729, 150316, 191386, 135896, 194156, 345311, 287955, 425016, 459822, 495946, 445165, 422208, 339505, 274412, 265486, 298151, 331697, 207616, 223350, 150304, 30377, 20044, 88943, 88163, 136556, 94376, 61178, 36846, 113205, 212772, 195122, 257254, 176209, 199995, 185437, 205916, 225705, 211413, 192646, 124672, 12853, 91842, 168369, 161197, 140086, 132860, 226890, 189541, 28050, 39752, -45131, -124759, -11020, -40031, -66693, 20553, -61357, -145778, -150830]
20030a50830L9876P7549j08001l5653J08265Q2367r2002j04303L4932P4832J1423
20019f1545o9472O7618N4298J01199J27940n8637j75909j61799j1669k952J24963
20008f5965J10246j086k3554q9199l9309q2709L2731Q5775n0203P6953K9980P863
19996h477l6544N1683J15208q621l9271j32050r3092L7096Q9262n7362o9766K9703
19984a22231j8272k9106N7232K7609J03020J3682p2620N4244J04176j6592j01287
19973a45p6298j9072L5328k5604M4024L6728J5411M8932j16042O4370P8783P4647
19961A61062n8462j33969M8336J5453m7644L8281j4647L9509r6426m3126o5439
19950a57072q4733j012M6799Q1917K3231K9495j3342P3888M9227L8557l9796l7938
$$ y = [-150830, -110954, -33405, -141406, -177059, -68794, 13573, -78429, -182732, -147800, -72968, -61545, -131017, -63399, -9101, 92098, 220038, 161401, -14508, -176307, -187976, -190928, -65965, 44281, 43195, 19641, -69558, -108867, -191576, -158845, -73070, -123273, -46320, -16340, -8477, -45021, 6662, 121870, 113249, 73978, -58072, -151164, -114068, -24806, -82168, -151934, -122231, -140503, -169609, -112377, -84768, 18252, 31934, -40686, 13558, 117734, 101142, -145, -76443, -95515, -60187, -85791, -41767, -5039, 10372, 59304, -56738, 7632, 86415, 161062, 102600, -31369, 16967, 32420, -15224, 23057, 8410, 47919, -48507, -91633, -157072, -241805, -242817, -196018, -114101, -90870, -61375, -74717, -829, 48398, 86955, 47159, 9221]
19938I221k5344l7503p2492j40441L757J24716N6738k2902J00459k8269j78886
19927b10946J7643P7586r7585O421O5595m218P3487K1489J40211P1910o1832R2367
19915A92128J08228k9578j01592L8675M7540j41493n4837N8358k2744R7422J39882
19904C31989M7854j88776j55352j51260J9968J15497M1054n3390m7479l3294k7041
19893a00230K9352P354j52623n2083J37229M7856l6063m0969m0716P680J85616
19882g597j7939j34186O1394M3383m5586K5710j5650O6541O2239j3761p3783j87608
19870b36843K6141J35212R2422m5485r7628O013Q0014M9157o8004r9214M8235
19859a09980K5904J30113J08453k3532j39827j53764M51L5315P1164Q2956o1324
$$ y = [9221, -16123, -53626, -126118, -266559, -262802, -138086, -81348, -104250, -3791, -32060, -210946, -193303, -115717, -213302, -206881, -141286, -145504, -72017, -50528, 89683, 161593, 99761, 192128, 300356, 270778, 169186, 207861, 255401, 113908, 59071, 117429, 94685, 192107, 331989, 379843, 191067, 35715, -115545, -95577, 19920, 60974, 7584, -39895, -73189, -100230, -70878, -63524, -216147, -268230, -131001, -83145, -119208, -160177, -200893, -193213, -7597, -25536, -159722, -98328, -54945, -100531, -74821, -90471, -23930, 38309, 24548, -49235, -236843, -210702, -75490, 16932, -28553, -126181, -120168, -40154, 9003, -59001, -158215, -109980, -84076, 46037, 154490, 130958, -8869, -162633, -162182, -126867, -55703, 27253, -34071]
19848c4071r4658j5978n6274O1603P8735O8189L260o644p4263l9978l4454K74
19836a44259J94792R5128p3605j24873n5648N2646L9318Q2655J6949l9380p3565
19825b9842K6906R7774M2610j09293j28767q6768k6601P1368L0465J7006J60733
19814F5591J19128q8068q3839R01o9177k6226P5049k5936p4665k996O7284J03235
19802F0281O9584K225j68504j63668M2061J37685M1058j28618j7318k1087M4216
19791a02085L5145L0060n3828L4249K5726j5593p4278P7694J31503P173p7229
19780A8537J2332J9609r8320K4020N989j8700j7107M1913k0041n766N7636o5458
19768d5356q9734j3536K8184O1627K8366N564P5716L1444n19l8451q4387K2114
$$ y = [-34071, -128729, -144707, -200981, -139378, -60643, 7546, 10806, 4162, -70101, -110079, -144533, -144259, 50533, 145661, 72056, -52817, -108465, -55819, -16501, 66154, 83103, 43723, -29842, -2936, 94838, 137448, 28155, -100612, -187380, -213981, -142613, -112148, -95142, 65591, 184719, 96651, 12812, 13713, -55464, -81690, -6641, -32577, -107242, -110238, -42954, 60281, 129865, 132090, -36414, -200082, -158021, -20336, 20722, -107896, -125214, -146301, -102085, -66940, -36880, -90708, -56459, -30733, -46326, -120604, -42910, 88593, 95766, 18537, 30869, 50478, -47842, -23822, -17833, -36533, -53640, -11727, -31768, -37534, 20102, -45356, -135090, -148626, -120442, -58815, -30449, -24885, 50831, 82275, 81756, 43305, -41082, -18968]
19756a8968l563M5555M4957k5853N3064J84471l2238j25982K584O3733j4619j00675
19744G2466K8095J43623l6183j11776j36594n7999M2151j3833j0513J00786K345
19733B2568p5695j1981L7193J05133Q2149R9478r133r7295j86384j41526N4225
19722a21268M7331r6111l9283Q6505Q7352K9984m1432N0818l0597k4393M8891
19711b203R7844l3456l7515Q8906L1584Q1161j10596n4108l7449j50117k1739
19700a47688O58n772P74P3257K8974r7196P6295O7979M8939J55444M3182p6204
19688A68642M919n4264j80080j23923r6916K6830O4787L6454P0373p103M0972
19677d9309P9454j46046r3097M7213L1076K0781N3305P3739N8328L2568J20468
$$ y = [-18968, -22531, 23024, 67981, 42128, 95192, 279663, 247425, 121443, 124027, 187760, 173141, 72466, 100561, 244184, 208001, 96225, -40369, -98368, -56217, -70050, -80563, 20223, 22568, -53127, -65108, -27915, 77218, 159367, 258845, 249712, 152417, -33967, -175493, -121268, -73937, -170048, -209331, -122826, -35474, -5490, -46922, 3896, -26701, -51094, -2203, 95641, 62185, 24670, 113576, 145160, 226321, 115725, 61617, 24168, -125949, -147688, -147030, -152802, -152028, -78771, -49797, -146993, -70698, -2719, 46220, 201664, 244846, 168642, 173561, 119297, -60783, -184706, -281622, -254792, -190005, -153551, -83178, -90281, -49309, 30145, -115901, -208998, -161785, -130709, -109928, -56623, 17116, 75444, 108012, 228480]
19666B28480k0497j51719l4815j4291j0615M1386m2086j23988L7448N8537K8302
19655c858k585K0822O3488L1300j75791o8762J13145l9488j22119J2321J42394
19644b9133K8644j19155P8715l3224p0909M0926R0579J02871q4079L6758j2523
19633B9470n1930p299O4875j36087p0234J15882Q8455n9253K4605m8812n5704
19622a06032K8740J6394q3262K7777N5541J0735k209K2459R4194N5336j27279
19611g606n4336K4644n1597L2222L8393K47853J993q1032o9928j27270P0902K647
19599B6885J8870J0113J7554J3934R5105k0237L879L3212j3167O1346m3054j04173
19587A00267J0210k5323O0014q5151m8943K43727N4414o1155J26644Q1797J63716
$$ y = [228480, 207983, 56264, 21449, 7158, -3457, 37929, -4157, -128145, -90697, -32160, -3858, -6443, 14379, 77867, 109167, -66624, -135386, -22241, -61729, -183848, -171527, -29133, -489, -119644, -40929, -74153, -145062, -104136, -13557, 89314, 5235, 41993, 29470, -22460, -29759, 35116, -100971, -171205, -55323, 33132, -26121, -1516, -50328, -106032, -77292, -60898, -144160, -116383, -60842, -50107, -52316, -29857, 64337, 119673, -7606, -61942, -37298, -88895, -56673, -18280, 229573, 231566, 150534, 80606, -46664, 24238, 26885, 45755, 55868, 73422, 87356, 182461, 162224, 166103, 199315, 186148, 247494, 204440, 100267, 110477, 85154, 145168, 60017, 11074, 254801, 309215, 248060, 374704, 456501, 620217]
19576F20217J50298K26846K36067L82094M07525K22980j17323l48791n47437l89810
19566H42666k82610j61644j66998q2407r6204j18911R7994M8028J11353J09502
19556C00769j2982j49369j12744q2088m7587j024Q3358J7295K7929J9365K2308
19545F5230R537m49J7119q0512J28213N8422m0399l2757j31780j41911K9451J13556
19533f280l2680J18574J34206j4749j30240m4307N1800o20q6071J1736j4449Q6623
19521G3543J72290j65190q3471Q8360Q5089m399j51462j10211M803J6984L6256
19510c7408N841J7802l0345j9299J15874n1962l2349r5532j620J17992M4756l8900
19498e150k2917J968J17592J6452j43271p5046R8309P1211j6196Q5157N1836l5190
$$ y = [620217, 770515, 997361, 1233428, 1615522, 2023047, 2246027, 2128704, 1779913, 1232476, 842666, 560056, 398412, 231414, 149007, 52803, -66108, 31886, 79914, 191267, 300769, 287787, 138418, 25674, -56414, -104001, -105025, -21667, -4372, 23557, 42922, 65230, 74767, 74318, 91437, 10925, 139138, 197560, 157161, 124404, -7376, -149287, -119836, -6280, -38960, 79614, 213820, 199071, 68831, 24524, 76324, 75704, -10367, 1369, -13080, 73543, 245833, 80643, -2828, 85532, 170621, 166222, 14760, -95451, -90648, -73664, -37408, -31567, -13765, -44110, -63409, 52465, 503, -31846, -127378, -128998, -11006, 33750, -5150, -28067, -26099, 91493, 107945, -35326, -110372, -12063, 59148, 42952, 128109, 179945, 144755]
19486A44755o6177p7958l3034N4147J28928m2467q1888j9527n0072N291K4729
19475a3273O4477j3329L4393J52800L6419r5289K3063n4376m8233k9751q5796
19464b8895k7303L2919L5224M2586q8699o1021j5364O4727Q675j28065K318Q5473
19452g7425J93119J25875J65368L11133L86404K45999K1548k87264m02792k28654
19442D53311j42572r4371k8486m1589j19804j1005N9824m3164j8974p0376J9600
19431c7606J1682K3595J01842j02070L3113Q5895o7499J8511K1347N2225N205
19420A46240J5216o8958r8160N602J15343K76680M08954M17385L56542j42934
19410A431910l70696l68691k56871k53941l9361N9964r2642l6570l1481L0054
$$ y = [144755, 78578, 620, -32414, 21733, 150661, 108194, 26306, 6779, -43293, -38002, -13273, 51204, 37875, 72268, 225068, 261487, 166198, 189261, 134885, 86652, 56901, -28895, -56198, -23279, 11945, 54531, -34168, -95189, -110553, -45826, -37151, -165216, -162898, -77425, 115694, 241569, 406937, 718070, 1104474, 1350473, 1372021, 1084757, 681965, 453311, 310739, 216368, 187882, 146293, 26489, 15484, 75308, 32144, 13170, -57206, -37606, -25924, -2329, 99513, -2557, 30556, 116451, 48952, 67463, 88810, 141035, 146240, 161456, 92498, -5662, -60, 115283, 391963, 800917, 1218302, 1574844, 1431910, 1061214, 692523, 435652, 181711, 142350, 202314, 109672, 73102, 41621, 71675]
19400G1675P0699J05016j39742l0757M7766j44503q0042l4040l6462K236O7978
19389a00176P8295P0728k9491K0665O00k6557o6994M3556N9032P9061j1697p2703
19377D4319J4098M1120n2145p6213J958l0910j1667j22276P2166l8860j6536J25735
19365d9211J8358O1573J07332l9261n6261J0676J8307j36023P3482N6268L6141
19354A01381R668k2987K3573m2939J34464K15853J06100J29967l9303k13847j97636
19343B04294p6349j56538J6639J10801Q3619Q3450m8522j41955p664N1234L8148
19332A57157L1997j0975j69858r9750m2232Q5806Q8481j7585l0898p0957q2012
19321a60826L6970K1835l2494Q2944J11382n6477J42606J85795J43754K10978
$$ y = [71675, 142374, 247390, 107648, 76891, 124657, -19846, -99888, -133928, -170390, -168154, -100176, -21881, 48847, 19356, 40021, 40621, 14064, -52930, -9374, 49658, 128719, 117022, 44319, 58417, 99537, 47392, -28821, -26863, -57773, -69440, -191716, -119550, -158410, -174946, -49211, -30853, 30720, 138052, 98791, 42530, 53206, 71513, -64510, 8972, 65240, 101381, 111049, 88062, 111635, 68696, 203160, 419013, 525113, 655080, 615777, 401930, 204294, 127945, -28593, -11954, 98847, 182466, 265916, 217394, 75439, 67775, 119009, 157157, 189154, 178179, 8321, -91429, -133661, -47855, 40626, 23041, -7857, -78814, -160826, -123856, -102021, -134515, -51571, 59811, 3334, 145940, 331735, 475489, 686467]
19311F86467j62915j82427k06462j67701N1573J25844l2250m9736j23845n654
19301f7106K2318K14411N8210r6236j63097r5689O0662Q2510J5772L1212P6086
19290A39053N7873k1644k1741m422O1618k00210j56362R429P3880L3415J87917
19279A58806L4232j32191p1356j0199J04178P513o6943r9649j05109N7899J51858
19268B9039j408q5701J24551j09656k8088J15382P757j4191k3307j2912m8595
19257d7129L9629M4246L8352q1471m5975Q7744J10254j44984j73552q807k868
19246a84561K12298J36264p4282j47579M5760J80485j7687k26205k6945l3347
19236a35799M0136O1548J8009O3824m278m9494R260M2997q6989j80591k2009J45676
$$ y = [686467, 523552, 341125, 134663, -33038, 18535, 144379, 112129, 62393, -61452, -67106, -44788, 169623, 227833, 131597, -31500, -127189, -66527, 15983, 31755, 62967, 139053, 196926, 175282, 153541, 149119, 210737, 10527, -145835, -136406, -62526, -29111, 158806, 193038, 60847, -10509, -20708, 83470, 90983, 24040, -75609, -180718, -122819, 29039, 27631, -58070, 66481, -43175, -71263, 44119, 51876, 37685, 14378, 1466, -47129, -7500, 36746, 75098, -6373, -52348, 35396, 145650, 666, -172886, -181693, -184561, 27737, 164001, 89719, -57860, -12100, 168385, 150698, -75507, -102452, -135799, -95663, -34115, -16106, 47718, 43440, -6054, 3206, 46203, -40786, -221377, -243386, -97710]
19224i7710K2893L2932O2601K6390Q2396J9570P5070M8512l9006j76385n1327
19213E936N7087m0121k9141N5880O0042K8350P518j98512K6529K6042j8440k9417
19201d8247j11991m9229k1271m3353J61384J92516J2630j57063K5918Q6416k7325
19190B0385Q5349j27760o6710P8313M5626M5248J91627O9031P0423j70167k29772
19179A1593p0900O3712K7207M1216k0838j38323p640M7270K6087K8917L1226m3273
19167c746Q2290L2124p7135l8207k6666j25555l0658J17902N8183K5733P9688
19156I3953L0452o0004K083Q1917o5737k9773L2574j21990n9211K1518Q9535J02821
19144A18138J028k1418k1996r4020n4578O9668m3854P3744L1351N8628N7580M8096
$$ y = [-97710, -74817, -41885, 20716, 47106, 129502, 149072, 224142, 272654, 233648, 57263, 5936, 63023, 22902, -6239, 49641, 109683, 138033, 145551, -52961, -26432, -390, -18830, -48247, -160238, -209467, -230738, -274091, -112707, 79809, 92439, -64624, -38706, 47710, 20385, 105734, -22026, -88736, -10423, 35203, 80451, 272078, 341109, 411532, 241365, 11593, -59307, 4405, 31612, 72828, 51990, -86333, -93973, -46703, -20616, 8301, 39527, -3746, 78544, 110668, 33533, -4674, -31340, -156895, -187553, -69651, -11468, 14265, 93953, 124405, 64401, 66484, 148401, 82664, 52891, 85465, -36525, -95736, -74218, 15317, 118138, 119166, 97748, 75752, -18268, -72846, -3178, -47032, 26712, 58063, 116691, 174271, 222367]
19132B22367m1271n9253j04696j3019N86J4420J9850l787M8978K4920P6956r069
19120A76982R168k9636l5809j8274O9098R5448J5151n4921j40291p5210M8599
19109F0305l7623j1782P6035j12078j47161J9137K10454N4736p6777Q169L3823
19098G7238M7815m3390J1921N7013J01479o5688j16192j16029N735R923o5159
19087i5334m051J09458L1496r2819q7554o1336O12K06720J90386K48825P340r9999
19075C53744j51258k29072o8712m6821J2474m6499M1122R5731Q915P5019k4953
19064A9690N7233N6960O2398M2591Q2954m4577q6760k9765N6517j7553j66550
19053C3138o4513m7935m1649K3183J47520J39520l145j15948p8934q135R2676
$$ y = [222367, 181096, 121843, 17147, 4128, 4714, 19134, 38984, 35197, 84175, 109095, 186051, 176982, 186150, 156514, 120705, 102431, 171529, 266977, 282128, 227207, 86916, 11706, 60305, 22682, 10900, 86935, -25143, -172304, -153167, 57287, 112023, 35246, 43415, 77238, 125053, 81663, 93584, 150597, 252076, 186388, 70196, -45833, -40098, -30175, -95334, -99385, 10073, 41569, -51250, -138804, -200140, -199528, 7192, 197578, 446403, 453743, 353744, 202486, -26586, -95298, -142119, -129645, -176144, -135022, -39291, -30376, 44643, 19690, 76923, 133883, 196281, 238872, 321826, 277249, 190489, 160724, 217241, 199688, 33138, -31375, -79310, -120959, -97776, 49744, 189264, 186119, 70171, -8763, -16898, 75778]
19042G5778O0266j73136n5698p5599J9638N5138R5263L0890m0656J9450p2335
19031f1001O4800j7103O7588P7031k0385o0215q5391O1936J6155K2848J15221
19020A81484J35498J6761l2299j59492m2143J5213N0269l1545q4222j1041j2707
19009B5776K6568J02409M1668O9869L4015k2592j17017m7533P3799N2197O6833
18998C05992R138n661r0825q1388O9896O0788j1874J75606P0462j27966j30191
18987B43977k0089K3643l6331N2437N1515r9469n2838J4109l7597j61647k8900
18976e1190O5850Q0936L4492L6514l8123M7019L706M9037J32058P0309q4280L786
18964C50114K1267L4424j0000O6734m118p1489m5190O8818J1886j60465p6801
$$ y = [75778, 136044, -37092, -92790, -168389, -148751, -93613, 1650, 32540, -8116, 11334, -61001, 3799, -13304, 54284, 131315, 110930, 50715, -34676, 27260, 43415, 66263, 181484, 316982, 333743, 301444, 141952, 99809, 115022, 165291, 133746, 49524, 38483, 25776, 52344, 154753, 196421, 266290, 300305, 277713, 160696, 113163, 186962, 239159, 305992, 315130, 309469, 218644, 137256, 207152, 267940, 256066, 431672, 502134, 374168, 243977, 223888, 247531, 211200, 263637, 315152, 215683, 162845, 176954, 139357, -22290, -51190, 14660, 95596, 130088, 166602, 128479, 175498, 179204, 228241, 360299, 430608, 346328, 350114, 371381, 405805, 395805, 462539, 458421, 386932, 341742, 410560, 422446, 261981, 185180]
18953A85180o2604M7030M3815N6738P5849M927Q7124J27901J02954Q1228L5834
18942G85976k2912l0851j07450j28398j03808M9567J98814K14704K41119N4760
18932A151521k14272j40781N3959j7461j12446j44848l2149j6949J08138J12461
18922G47173m4184L6928J3454o7483j40449J9294J919j7752Q3791R6004n459Q6668
18910H09904K47728K61623K2291p8641k05094P0383Q6342J26492J73314L12316
18900A826658N88616P32437L95320K205k5673j03066o07644p69818l30066j36585
18890A572384J24492Q8741q8725J04470O0985K6703J09975K00180K13703L49084
18880B761992M61387O28259R07748L77742J4317J13919L43568N93276Q85950J314411
$$ y = [185180, 122576, 169606, 213421, 270159, 346008, 350935, 438059, 565960, 668914, 750142, 785976, 763064, 732213, 624763, 496365, 392557, 442124, 640938, 855642, 1096761, 1151521, 937249, 796468, 850427, 832966, 720520, 575672, 543523, 526574, 634712, 747173, 702989, 739917, 753371, 685888, 545439, 564733, 566652, 548900, 632691, 728695, 723236, 809904, 1057632, 1319255, 1341546, 1262905, 1057811, 1128194, 1214536, 1341028, 1514342, 1826658, 2415274, 3147711, 3543031, 3545236, 3519563, 3416497, 2808853, 2039035, 1708969, 1572384, 1696876, 1785617, 1696892, 1801362, 1862347, 1889050, 1999025, 2199205, 2412908, 2761992, 3223379, 3851638, 4759386, 5137128, 5151445, 5265364, 5608932, 6202208, 7088158, 8402569]
18870H402569J935538K811488M200942O313525R278483J4467937K5551914M9935916
18862A22898312R0176703R0884666n759628r8318379q5083941m4603798k2915246
18855D7278689j3420760q593559n483583l591969k486986j851752j233546n76436
18847A0040098k32956k64600q3041N04737Q79921n2007q01980n78114J28739P61792
18837A0302589J302129J622614J518924J879481L467513N945526R304482J4738029
18829E0081287K5987595M9583702R2355288J15068945K6413633r6879263j08539687
18822A54071500o0628609l1557007j8711725j1981007p775435n300212l569485
18815A4548020k345176j759909j210825p22706o13507n80899j32244J6088m67600
$$ y = [8402569, 10338107, 13149595, 17350537, 23664062, 32942545, 47410482, 72962396, 122898312, 213075015, 303959681, 298200053, 199881674, 114797733, 70193935, 47278689, 33857929, 25264370, 19780787, 16188818, 13701832, 11850080, 10616534, 10040098, 9807142, 9542542, 9459501, 9964238, 10844159, 10792152, 9990172, 9412058, 9540797, 10302589, 11604718, 13227332, 14746256, 16625737, 20093250, 26038776, 35343258, 50081287, 76068882, 125652584, 218007872, 333076817, 359490450, 262611187, 154071500, 93442891, 61885884, 43174159, 31193152, 23417717, 18117505, 14548020, 12202844, 10442935, 9232110, 8509404, 7895897, 7314998, 7182754, 7198842, 6731242]
18806F731242j040450r41999n62012j183K86458M30952K6517p76153q44292n06277
18796B802803k33242j10057J55488L86315P38876N23865J42429N4587N97545O05150
18786E663759m82331j547698j219614n86356l16686k80463j16150m2899j42233
18777I29329p4636j10135N792P65R6566J24381L4870K0385k6535K18641M64372
18766A683795K65656j89575n25921m63682j80100j46689o3630K3130L7310j2736
18756D27558j7393p4796p3883k7198j12521J03265J28906Q5761j05637j20523
18746B13539L2716l5937j24777j1680J14281Q6506J5867j47579p7435P1897J16429
18735B53827J16937J45397M8915j53910j17579j74878j35434m4682p4889P4792
$$ y = [6731242, 5690792, 4748793, 4186781, 4185598, 4472056, 4903008, 4929525, 4153372, 3309080, 2802803, 2569561, 2459504, 2614992, 3001307, 3740183, 4264048, 4406477, 4461064, 5058609, 5663759, 5181428, 3633730, 2414116, 1827760, 1511074, 1230611, 1114461, 1071562, 929329, 854693, 744558, 750350, 751115, 847681, 972062, 1006932, 1027317, 1000782, 1219423, 1683795, 1949451, 1759876, 1233955, 770273, 590173, 443484, 379854, 402984, 440294, 427558, 410165, 335369, 261486, 234288, 121767, 225032, 353938, 439699, 334062, 213539, 246255, 210318, 85541, 73861, 188142, 274648, 290515, 142936, 65501, 137398, 253827, 370764, 516161, 565076, 411166, 293587, 118709, -16725, -61407, -136296, -61504]
18725f1504J5150M6770N6549Q4536J27839K6665l7021j08519k57945j8095J33595
18714H020n1772m974J32537q882J49360Q3822O2390j9339P857n252J0648j10498
18702B53917j1857o3403M333P0531K4899j04154j53852n5213Q7248J46237l6344
18691A62342l4934N3405O3590j527o3047J1720m2872j10899m3749j00241j7357
18680a23569J30024J45329K9094o8438K939J1315r8187r3313n7440o63M0176O0752
18668b1981l074l7758N9232J4623p5633L0015Q8738N3005J02056L0250l5224O597
18656B10846n2990j24539k4370P1749L3100p6344m348o452n8648j15175k59R9572
18644d7858M7789N2509K1872l0815j68546l3808J48746Q6233O5546J00787K30
$$ y = [-61504, -46354, 416, 56965, 141501, 269340, 296005, 258984, 150465, -107480, -125575, 8020, -43752, -48726, 83811, 74929, 224289, 308111, 370501, 351162, 359019, 353767, 364415, 253917, 242060, 178657, 182990, 253521, 278420, 174266, 20414, -34799, 52449, 198686, 162342, 127408, 180813, 244403, 242876, 179829, 191549, 148677, 37778, -5971, -106212, -123569, 6455, 151784, 180878, 112440, 115379, 126694, 28507, -64806, -122246, -122909, -82733, -21981, -25055, -62813, -3581, 11042, -64591, -34576, 54162, 107167, 209223, 239473, 204249, 210846, 157856, 33317, 8947, 80696, 113796, 37452, 33104, 26652, -31996, -147171, -147430, -47858, -69, 52440, 74312, 43497, -125049, -158857, -10111, 76122, 141668, 242455, 242685]
18633B42685j63625j00454j7830j758J51844J60990J09457J44090Q1405j23966
18623D82838r4918o5782P8819J24868O381j00058q4298j27052n8103k4154M8084
18612A86625j05237M0611Q7062L1351o1100l8970K1322j15081j09049J24737K23653
18601B85924N9275n5278P3458K0704j67854r0735L7804l285M5474J18551K9797
18590C53835l2236L9833Q699J28865J32469l7745j51034j05745j21719r5831l7376
18579H2015Q7529l8237n906J59949M9231q0415j65043J5385n7359r1308J0600
18568c3559O4528m958j24962n2529J27555J11989J22034K2086l7963Q1839l8375
18557B37685p9138j46227m9509j4757K24610J72379P728p1340m1910l3883n3415
$$ y = [242685, 79060, -21394, -39224, -40982, 110862, 271852, 381309, 525399, 606804, 482838, 387920, 322138, 400957, 525825, 532206, 432148, 347850, 220798, 162695, 138541, 186625, 81388, 121999, 209061, 240412, 179312, 140342, 161664, 46583, -62466, 62271, 285924, 345199, 289921, 363379, 384083, 216229, 125494, 163298, 160013, 205487, 324038, 353835, 321599, 361432, 370131, 498996, 631465, 593720, 442686, 336941, 215222, 119391, 82015, 169544, 131307, 125401, 285350, 334581, 254166, 89123, 104508, 47149, -44159, -33559, 30969, 26011, -98951, -151480, -23925, 88064, 210098, 232184, 194221, 276060, 237685, 158547, 12320, -37189, -51946, 172664, 345043, 352771, 281431, 239521, 205638, 152223]
18546A52223K0215j01738n8276k0059M4837P2883l5174k1377j10846M9205J54596
18535A46489J2981R494m5615n6238p7678p6357l3730P5656K15757Q250j4418q9453
18523G5138r47K9995M2437R145o4545r6563j1895n3554R725j7396M2916Q0692
18511D5148r542p045M8076P5943j2367J15840j35199j56049O1751j882k3048L0036
18499C1662R6682J0963n6742j81364L1866R3821J10158L6554K5665p3066j9054
18488A07145m3589o3374N4025J32862O590q7193O9401O8006m3671m6246O5983
18477B19939K6242k2935j26722M7641J94248k9256o3568J18055J06777l235o9359
18466C97827K6234Q9226N4825q823R5341J63995p0408k53250p3851O4332r0646
$$ y = [152223, 172438, 70700, 12424, -7635, 37202, 110085, 74911, 53534, -57312, -8107, 146489, 159470, 168964, 123349, 67111, -10567, -86924, -120654, -44998, 170759, 179009, 164591, 75138, 74191, 104186, 146623, 155768, 91223, -5340, -17235, -70789, -61064, -78460, -35544, 45148, 35606, 28561, 76637, 152580, 140213, 256053, 120854, -35195, 26556, 24674, 1626, 31662, 128344, 139307, 82565, -98799, -66933, 26888, 137046, 173600, 199265, 126199, 107145, 63556, 182, 54207, 187069, 193659, 106466, 175867, 243873, 200202, 153956, 219939, 246181, 223246, 96524, 144165, 338413, 309157, 245589, 363644, 470421, 467186, 397827, 424061, 513287, 568112, 559289, 654630, 818625, 748217, 494967, 421116, 485448, 394802]
18455C94802p2568N973l5576n8721K5382j7069N233N3590j0936J8073n5627l2134
18443B20422P9426R0770O1198R5940J5361j18447j4435J2721m8107J8131N8378
18432D71358O2166J92123N1194J6935J01214J74557J19402k4798j08145q2699
18422I73307j18728L9604l5057L6175J05523l2501J24894J18825n973J72380Q4766
18411A463215J44334J84957M74633P49960Q04972K96735l7331J12919L70852M6435
18401D611681k88162j79431K22450N34081O44908O98709R50928J545184J692200
18392A0432548J491060J770266L237873N238285Q142762J3761448K5260922M7826850
18384A17162014Q7303170J11427101L8673528q0128402j09486173o7680748l5021673
$$ y = [394802, 322234, 328207, 292631, 233910, 259292, 242223, 247456, 301046, 290110, 308183, 252556, 220422, 299848, 390618, 451816, 547756, 563117, 444670, 430235, 442956, 394849, 412980, 471358, 533524, 725647, 776841, 793776, 894990, 1069547, 1188949, 1164151, 1056006, 973307, 854579, 894183, 859126, 895301, 1000824, 968323, 1093217, 1212042, 1206069, 1378449, 1463215, 1607549, 1792506, 2267139, 3017099, 3822071, 4118806, 4081475, 4194394, 4565246, 4611681, 4323519, 4144088, 4366538, 4900619, 5545527, 6244236, 7195164, 8740348, 10432548, 11923608, 13693874, 16931747, 22170032, 30312794, 44074242, 69335164, 117162014, 204465184, 315892285, 354565813, 274437411, 164951238, 97270490, 62248817]
18377F2248817j9348638j1424235p048322m579012k748668j422346r10218q28537
18369A3938841j042478r06479m71774j90924l6505l55079l32896k58703L6126
18360A0380129O20258J360068J400583P78459R48657K517894M880357P190571
18352C0076976J0246894J7444823L3768050O5117375R7091390N7514857m8228570
18345B63031795r9520664o9150673l5773187j9133021j1242814o974660m559850
18338A6676926l130339k004167j171760q33186q70034j036889n73376N5440M01416
18329G514031J39455m71157p56599r94067o18315p1678n6104k74762m16825j18889
18319C875090M65101R08805K50368r74473j304931q42547m45523k04288j12359
$$ y = [62248817, 42900179, 31475944, 24427622, 19848610, 17099942, 15677596, 14767378, 13938841, 12896363, 11989884, 11518110, 11327186, 11290681, 10935602, 10602706, 10344003, 10380129, 11000387, 12360455, 13761038, 14539497, 15488154, 18006048, 22886405, 30076976, 40323870, 57768693, 91536743, 156654118, 253745508, 311260365, 263031795, 163511131, 94360458, 58587271, 39454250, 28211436, 21236776, 16676926, 13546587, 11542420, 10370660, 9537474, 8667440, 7630551, 7057175, 7112615, 7514031, 7653486, 7182329, 6425730, 5431663, 4813348, 4741670, 4685566, 4410804, 3993979, 3875090, 4340191, 5248996, 5499364, 4524891, 3219960, 2377413, 1931890, 1727602, 1615243]
18310A615243j86516k71844j68622p5677p7980J1231L4232j25241j26697p8383
18300E49746M629p6667K3516P0660o2488J80057L7327j12555p4100k08821j49616
18289A81688m5219q521Q1149N840j02184p8745P8609J58783Q222p6543R903j0085
18277B02897L3258M9329j0107m280o2821l2681Q5259L1713m338J07135J03074
18266D98438K10832M76609N60558L96223K665n32797n23376j92393j51756r2659
18256F52344j43938k8179o5576K9105k7160j34297j45068M3885o966m6314P0482
18245A98318Q885j6739K9993n3454k32107q2767N2426R5738l0114M4456J36922
18234A51557J74868R2990J23078j4347K53153K31431K05389J90191j26507m56034
$$ y = [1615243, 1428727, 1156883, 988261, 912584, 834604, 845835, 880067, 754826, 628129, 549746, 554375, 477708, 501224, 571884, 509396, 689453, 726780, 614225, 540125, 331304, 181688, 136469, 127948, 209097, 214937, 112753, 34008, 112617, 271400, 279622, 203079, 212982, 202897, 236155, 285484, 275377, 271097, 208276, 175595, 260854, 292567, 288229, 395364, 498438, 709270, 1185879, 1746437, 2142660, 2145325, 1612528, 1089152, 896759, 745003, 652344, 508406, 480227, 414651, 443756, 416596, 282299, 137231, 181116, 174150, 127836, 198318, 207203, 190464, 220457, 167003, -65104, -147871, -95445, 293, -29821, 14635, 151557, 326425, 419415, 542493, 528146, 781299, 1012730, 1218119, 1408310, 1281803, 825769]
18224H25769j67721L2604p515k8894j54253j60283j78906p9883n4852J47731K4735
18213A98532j21270o7064M2613J4686J5509j1769J12750J29533K1076q1861J6175
18202B68910q0291j17493l3428K7064j5288K042Q7160M31K9878n0230L3295L4297
18190A86347l2704q1603n5459J52756N6012o854L9257J09434N728j65271k9040
18179A78603m7034N1757L4172l5082p533N409j27059N1749J03930O7132o3494
18168B12550J43936J23991o0462q4116l9402j04209o3414j9287l286k7119m735
18157G4447J38386N8599M6679j7821J6141O1458n146L284k3934p8931R550l7378
18145B45334J70155N7960m831M2560R9110j1299p6406j8815K27757K69249J41988
$$ y = [825769, 658048, 690652, 683137, 654243, 499990, 339707, 160801, 80918, 26066, 173797, 198532, 77262, 10198, 52811, 67497, 83006, 71237, 183987, 313520, 334596, 252735, 268910, 188619, 71126, 37698, 64762, 49474, 51516, 138676, 139107, 168985, 118755, 152050, 186347, 153643, 72040, 16581, 169337, 225349, 218495, 257752, 367186, 372914, 207643, 178603, 131569, 183326, 217498, 182416, 174883, 180292, 53233, 104982, 208912, 276044, 212550, 356486, 480477, 420015, 335899, 296497, 192288, 128874, 109587, 106301, 79182, 74447, 212833, 271432, 318111, 300290, 316431, 377889, 372743, 376027, 352093, 273162, 282712, 245334, 415489, 473449, 468618, 511178, 610288, 598989, 522583, 503768, 731525, 1000774, 1142762]
18134A142762N5523L2958M1754m5518M2531K21353K31358J80781J04526J55973
18124B164001L52982M25428M93975N44400P00019Q24789J066518J320642J896967
18115I789721K947003M634985P131476J2231865K2976435M5464812Q5527891R6222261
18107B86926449N371254r5140265q8120509m5649935k2602367j2662845p666377
18100B0455405m829195l417190k477239j885966j409482j165587r02401m64437
18092C903908k50857j98926n07606m70196l31468j41705j36127j23708k40994
18083A502321j60176j03787k3771l0387j33179n3861j11561j45783m3180P1637
18073G68273M6808n3502j78767j01710p5414j1970q4073q5305j2718m524m665
$$ y = [1142762, 1198285, 1231243, 1272997, 1227479, 1270010, 1491363, 1722721, 1903502, 2008028, 2164001, 2516983, 2942411, 3436386, 3980786, 4680805, 5505594, 6572112, 7892754, 9789721, 12736724, 17371709, 24503185, 36735050, 59711485, 105176297, 190704188, 286926449, 292297703, 197157438, 109036929, 63386994, 40784627, 28121782, 20455405, 15626210, 12209020, 9731781, 7845815, 6436333, 5270746, 4368345, 3903908, 3653051, 3454125, 2946519, 2476323, 2144855, 2003150, 1867023, 1743315, 1502321, 1342145, 1238358, 1214587, 1184200, 1051021, 997160, 885599, 739816, 696636, 768273, 815081, 761579, 582812, 481102, 405688, 393718, 309645, 224340, 211622, 207098, 202433]
18062B02433o1067n2450P691R7966k7126l2190r508J72112o3394j4605o6716K6416
18050A79562k2010m5056l489o8740n7284J09095L4272j5056r2239J3780O1203
18039I4038o740j38116N0502L9167J04288o8750j26951M0565J8624L8711k3848
18028B1490O641k1899J9239L1205k7560K1950k0538q2444q0226k1817J18732N121
18016c0106j6294n4841j27706q854J39732O3053j2401n2100r3531P3181J17711
18005b156l3707j972l9718k7115O8191j62233j12228j391R3138r2305r203Q6155
17993b34544R3397Q2177l9321J2554Q2214Q6566P4663n9274o7834m9332K0399
17982A665J40224Q0420j1847r7969P278J439j52796J9584L7944N0281M5265j12552
$$ y = [202433, 141366, 88916, 96607, 194573, 167447, 135257, 125749, 297861, 234467, 219862, 153146, 179562, 157552, 112496, 109007, 40267, -17017, 92078, 126350, 111294, 19055, 32835, 94038, 87298, -50818, -316, 38851, 143139, 74389, -52562, -11997, 6627, 45338, 21490, 28131, 6232, 25471, 56676, 29116, 51066, 30528, -51916, -132142, -153959, -35227, -30106, -46400, -101241, -228947, -237801, -98069, -35016, -47417, -99517, -193048, -119867, -2156, -35863, -37835, -77553, -104668, -36477, -198710, -310938, -312329, -219191, -311496, -320699, -234544, -141147, -58970, -98291, -85737, -3523, 83043, 157706, 98432, 30598, -18734, 1665, 141889, 222309, 210462, 112493, 119771, 121210, -31586, -12002, 25942, 76223, 121488, 8936]
17970H936r7094K6625K149r840M2618j8586m3962M7306M167o2914J10810p142
17958C073J9105m7790p2668J0876J30699L537r8435j09732K1710Q0362K8723M1654
17946A1114R3j0183n223m4969o1421K6717J16269J47873l2375n2235j50747l2996
17934h8083P9922O9635K7817j29623q8540l6914N5522P5516k9729k2817P6010
17923a1284k366O7111j03825j20436O0774O7323r8071J06049K6112j8365Q973
17912a8005O5136J21456O8614n5811r2936n7726j47862J14045L1788o2454j15818
17901a49573K9068Q7903J5731k2085o2955N120j7160k9502J22721O9590j48760
17890i9902m5668j725M5052N8405N3604J08360k664j20283o4200l388J7569M8788
$$ y = [8936, -88158, -61533, -59384, -69224, -26606, -45192, -89154, -41848, -37681, -100595, 10215, 3073, 22178, -25612, -98280, -87404, 43295, 46832, -51603, -161335, -139625, -59263, -30540, 11114, 11207, 1024, -4199, -49168, -110589, -83872, 32397, 180270, 147895, 95660, -55087, -88083, -8161, 61474, 89291, -40332, -128872, -165786, -110264, -34748, -64477, -87294, -11284, -13650, 53461, -50364, -170800, -110026, -42703, -140774, -34725, -8613, -26978, -18005, 47131, 168587, 237201, 181390, 88454, 30728, -117134, -3089, 28699, -33755, -149573, -120505, -32602, -16871, -38956, -101911, -96791, -113951, -143453, -20732, 48858, -99902, -145570, -147295, -102243, -43838, 9766, 118126, 115462, -4821, -69021, -72409, -54840, -6052]
17878f052J24319L9336p6166l3659j02755j03234Q9549P4491O1771M7815J16498
17867B31913k7833j05098j0893r452j25751j59473M2406J00021J12598k1191j83012
17856a55765m147O00J21335J16929R4762M9179j03843o3468J5016L9112K8555
17845A38265k4986o1982j5045q3720J9695Q6585p1816l1735R9574K04147J41722
17834D00704K74025K38057L79755K77218r3318m08339l28614k15556j86301j69583
17824A68048j16054l6328Q7436M1180L681M0279n9540k928J8515K4824K3826l0303
17812A62636j4241j29775k8735L9282J46315J55607N399j15910j08152J0985O4546
17801A87957r8432L5988K23566J59433L33317L06972J16992j64569l07760l19481
$$ y = [-6052, 118267, 157603, 81437, 47778, -54977, -158211, -68662, 5829, 67600, 115415, 231913, 204080, 98982, 88089, 78637, -47114, -206587, -164181, -64160, 48438, 27247, -155765, -159912, -159312, -37977, 78952, 173714, 222893, 119050, 55582, 70598, 109710, 138265, 113279, 51297, 36252, -47468, -27773, 58812, -13004, -44739, 54835, 258982, 400704, 674729, 912786, 1292541, 1569759, 1476441, 1068102, 739488, 523932, 337631, 168048, 51994, 15666, 103102, 144282, 147963, 188242, 128702, 125774, 144289, 169113, 192939, 162636, 148395, 18620, -10115, 29167, 175482, 331089, 336488, 220578, 112426, 123411, 187957, 89525, 125513, 349079, 508512, 841829, 1148801, 1265793, 1101224, 793464, 473983]
17791D73983p7961r0630j69544p9322n594O3330o7205O2160j0198m864j68276
17780g4121n1146R17R8225k7422R5937k7596k6247O6275K7177m120J1884j6617
17768G3146q5607j15195o098J9157M7947L487J89915J59077K3481n3656j36168
17757A19486l2649n5892l789o2493O5254K966l2734m0438p3643r6537L9248P0681
17745a00540R9093P5143J766j38166j49639q4467J05050l751M5147R154n450O5211
17733h1449M170R026j06819j05391K3235J64210O6888J911n9452n5096j10295
17722b49062O9275L0700l2844J45429J02837q1941k19254n9710K2840L1698N1024
17711a89008M103k3707J37671P8255n3795K0383J1778l7814L4737m398M0832r07
$$ y = [473983, 396022, 305392, 135848, 56526, 50932, 114262, 47057, 109217, 99019, 94155, -74121, -125267, -124350, -26125, -53547, 42390, 14794, -11453, 54822, 81999, 77879, 89763, 73146, -12461, -127656, -133754, -114597, -66650, -63163, 126752, 285829, 309310, 255654, 119486, 86837, 30945, 27156, -35337, 29917, 32883, 149, -40289, -113932, -210469, -171221, -100540, -1447, 73696, 75462, -62704, -212343, -296810, -191760, -195511, -150364, -141210, -146660, -81449, -77279, -68253, -175072, -280463, -257228, -93018, -26130, -24219, -83671, -138767, -249062, -179787, -149087, -181931, -36502, 66335, -15606, -234860, -294570, -271730, -240032, -189008, -184905, -208612, -70941, 7314, -46481, -26098, -14320, -52134, -17397, -21795, 19037, 18130]
17699A8130L952m6568K7498O0694j15220o5670J19335M546N8820l0511l8910j120
17687e024J5372k2439l2366o0342J7756R4341L3938J9560n7175j62430M278L0803
17675a23728l9474K7300J35861k4164J1931L6136l6853j25073n4040O9157P3395
17664d9552n6352k5305R4596M6639M3614J02078q8294p4192n5669j50199j05340
17653c17976J50813J61195J5409R9538O3660p3558o846l290q9589o3698p1799
17642a36141l8995n7079L22K2236P1916k0857l987R0391J7563j2648O915O9033
17630H669n5681J5333N7720j22845m0300n8511Q0999J8604R2105j13755r1263
17619b08925N5524N1712o5555K4063J8762r547p767J8653j00018K1300N9976k0825
$$ y = [18130, 22082, -24486, 3012, 63706, -51514, -117184, 2151, 6697, 65517, 35006, -3904, -5024, 10348, -12091, -44457, -104799, -87043, 7298, 41236, 60796, 3621, -158809, -154531, -123728, -163202, -135902, -41, -24205, -12274, 23862, -12991, -138064, -192104, -122947, -49552, -105904, -131209, -36613, 10026, 53640, 155718, 67424, -6768, -62437, -212636, -317976, -167163, -5968, 9441, 108979, 172639, 99081, 92235, 88945, -644, -64342, -136141, -175136, -232215, -231893, -209657, -137741, -158598, -162585, -72194, -54631, -67279, -60364, 8669, -47012, -31679, 26041, -96804, -137104, -195615, -114616, -96012, -3907, -117662, -208925, -153401, -101689, -167244, -143181, -124419, -133966, -141733, -123080, -223098, -201798, -141822, -162647]
17607a62647O7697N83j6124j04310O5571J05686P4710L702j8662q8702l5839J0064
17595i8271J14434J08245M7494l5607j75735j42002M9568R1476L1280n9102K8181
17584d0039j5612j5131m3415r0817O9549J19044N6875P759N2789p2531m1179k7679
17572d0387Q60o5086p1291m6413q7698J00J02799R6582r2881j19702l0522K1173
17560c32466N6689M1737n5037P5710k2260j07620o3557K20024J28561J0176l5435
17549h3478j7135N5954l9862j2849p9193l6233J02338P0221O4125O08j15245j03023
17537a93772k1058j8549N3799J50764J39108Q5853j24381r6232K1391M2707m7535
17526g905L2195K9536q3197j35104K3125R8740P3884p8170o1240K9680J32488
$$ y = [-162647, -94950, -94367, -110491, -214801, -149230, -43544, 31166, 34868, 16206, -72496, -108335, -98271, 16163, 124408, 171902, 136295, -39440, -181442, -131874, -40398, -9118, -68220, -40039, -55651, -70782, -114197, -205014, -135465, -16421, 40454, 48213, 101002, 28471, -12708, -40387, -39527, -104613, -175904, -222317, -310015, -309915, -207116, -110534, -203415, -323117, -353639, -332466, -275777, -234040, -289077, -213367, -235627, -343247, -406804, -186780, -58219, -48043, -83478, -100613, -44659, -84521, -97370, -176563, -212796, -110458, -40237, 23888, 24496, -90749, -193772, -214830, -233379, -179580, -28816, 110292, 196145, 71764, -24468, -3077, 39630, -7905, 24290, 53826, -29371, -164475, -141350, -42610, 31274, -46896, -108136, -78456, 54032]
17515E4032K5498j01398m132m5020L8641m2542K141L4792N7222m2424o4930R70
17503h7150L2730k0096l0125p1405J2699P3900l9910L7469n1500K3726q812M7408
17491h1066J7723p0376M3343k8460K6924K7650Q2000M2154K8297n004j0170K1011
17479I4026n3139P3080m8306n3644j22636j18769n587j0270R8491P1516N8388
17468a6850n4157j08893J5911n8572l7916Q8202P0144K6279p8131Q6545j3486
17457h0924r5954j23901p3197L8436M2820J0525Q8329L4317Q6803M4246p5057
17446a03557O0984J73047J41385L65137O10034K02220l65315n36737k76699m7387
17436B23112j17331n8934N4124N307O9668n754j24696o5931n173N9106O5185Q1349
$$ y = [54032, 79530, -21868, -26000, -71020, -32379, -74921, -72780, -37988, 19234, -23190, -88120, -87150, -54420, -74516, -104641, -176046, -163347, -89447, -129357, -91888, -143388, -119662, -128474, -81066, -63343, -133719, -90376, -118836, -91912, -64262, 17738, 59892, 88189, 83185, 73015, 94026, 40887, 113967, 65661, 12017, -110619, -229388, -234975, -245245, -146754, -75238, -16850, -71007, -179900, -163989, -222561, -260477, -172275, -102131, -75852, -153983, -67438, -80924, -176878, -300779, -373976, -335540, -292720, -282195, -193866, -159549, -72746, -28500, -103557, -42573, 130474, 271859, 636996, 1247030, 1449250, 1083935, 547198, 270499, 223112, 105781, 46847, 100971, 106278, 175946, 170192, 45496, -20435, -25608, 33498, 98683, 180032]
17424A80032n8685r247p2111k0889m2643j09033J01733l7193m6859J30701q7203
17413g1397M1293J04330j76817p7908k5308n7032k0733r6458M8835r140L0119
17402c10216L7172P8714R4886P6261q0826m3063j8018j21070j42426l2509J46270
17391c14825J66839O7833P7914J2993j42099L9084Q0851J0423J02487Q0645k1949
17380A60196M157n9824l0707J6795p5285o2170n7677M5686J3938j18878n4718
17369b18487N8108K2030o1422L472k2987P5102n5537m4010j4143J11659l3749
17358a79964k3697k1917J3004J45910L669j43518K9415J05356O1684n7789M9970
17347a7877o7473j21741m3333N465J41468L0647o2808J8971Q3859J4724k5626
$$ y = [180032, 121347, 112100, 39989, 19100, -23543, -132576, -30843, -68036, -114895, 15806, -71397, -30104, 74226, -102591, -180499, -205807, -262839, -283572, -380030, -331195, -340335, -310216, -273044, -194330, -99444, -23183, -104009, -147072, -165090, -286160, -428586, -461095, -314825, -147986, -80153, -2239, 10754, -131345, -92261, -11410, -987, 101500, 182145, 160196, 164353, 104529, 73822, 90617, 15332, -46838, -104515, -58829, -44891, -163769, -218487, -160379, -138349, -199771, -196299, -219286, -144184, -199721, -243731, -257874, -146215, -179964, -203661, -225578, -212574, -66664, -62995, -206513, -177098, -71742, -10058, -67847, -17877, -85350, -207091, -250424, -244959, -103491, -72844, -135652, -116681, -32822, -18098, -43724]
17336d3724p1381K5758l7992l2927p5953J39108J09652n9879k7537Q4407K8761
17325C8293p8903j00895l7502J15713o359j43205q403q328j3040K6741J39565
17314g6323M5942m4265K4393P6475L8798l9953n0433j09325p6449L2141P6799
17303a02200P9805R5027m788r9154k5544k8674o2759M1630P5264m8387R1834J1473
17291B3527r5238L9460j9199j08840o2151Q4518L7434N9262o0k7558J14693R6494
17279A42342p0203j25615p8348K9815m544r8239K1488K2082j9063M0233m959m7088
17267a92099M397M5304k4263l8189k1363r5630K3469L5854o563N2398Q9687J2822
17255a14176J8103j0990l6985M7542p5558K8613J04304j1415j68695J8275k163
$$ y = [-43724, -115105, -89347, -127339, -160266, -236219, -97111, 12541, -47338, -74875, 9532, 38293, -40610, -141505, -179007, -63294, -69653, -212858, -221261, -229589, -242629, -215888, -76323, -30381, -74646, -50253, 26222, 65020, 25067, -25366, -134691, -211140, -178999, -102200, -22395, 72632, 67844, -31310, -56854, -85528, -148287, -106657, -31393, -79780, 12054, 23527, -71711, -32251, -51450, -160290, -222441, -137923, -100489, -41227, -41287, -68845, 45848, 142342, 72139, -53476, -131824, -102009, -106553, -204792, -183304, -161222, -180285, -140052, -145011, -192099, -187702, -142398, -166661, -204850, -226213, -321843, -298374, -262520, -269083, -216685, -126998, -114176, -96073, -107063, -144048, -96506, -172064, -143451, -39147, -50562, -219257, -200982, -203145]
17244b03145j7368Q975m7170L619P2846M9423J7067L6556m1127O4487j16499n735
17232a78071q011J21417K1100j64463P7291R491J0680n376J6750l1232K9850j1279
17220a11853J6299P4183J7603n1645J36030j6372m9566n7557j24053m7J3306p3110
17208b26782L9653J5965J07454P2195K220l6144R6788o9856o6849n2243k9345
17197a46944l7617j01484m6033J71160J39018k4199r5188m7031J66745R4464o3811
17186I080j00288J19367R307j86966j23380J24046P7888l8885j3014k6149L7672
17175a11322N6269o5385r1374j49765k7030L8619m4078J0874R9017J03174J8337
17164a62664O6803l3953K1254M7510j70295L4696K2391J49440J03326j77817j05857
$$ y = [-203145, -220513, -211538, -258708, -255089, -182243, -132820, -115753, -79197, -120324, -55837, -172336, -178071, -186082, -64665, -43565, -208028, -130737, -121246, -110566, -115942, -99192, -130424, -100574, -111853, -95554, -21371, -3768, -55413, 80617, 64245, 14679, -42878, -166931, -166978, -153672, -226782, -187129, -171164, -63710, 8485, 10705, -25439, 71349, 1493, -65356, -117599, -146944, -184561, -286045, -332078, -160918, -21900, -46099, -141287, -188318, -21573, 72891, 9080, -91208, 28159, 37466, -149500, -272880, -148834, -70946, -109831, -122845, -148994, -111322, -55053, -120438, -211812, -361577, -388607, -349988, -394066, -383192, -284175, -181001, -162664, -95861, -129814, -108560, -61050, -231345, -196649, -174258, -24818, 78508, -99309, -205166]
17153b05166M9515J27854M8837q4610m1507N2369q2306K8258n1548K9294J06377
17142b2633N986n6218M722j0671P2747J35100m7181o3636r4659j8391l8804o8725
17130b02363K9799J17683J12240r3920j21972j46180J29208M9741o649m5204Q1578
17119i6039m4090k2803K7710L0295m9583O0069j1421Q2314j6835k8079P487q1009
17107a41984K2773O8332m9678r721m9460K3893j2777R459K7034L6607m3662m6605
17095a65789k3328O8359K0233m6678Q9691N1982n0323O3031j0765L0646R125j31378
17083i5194k1564n1958n8158J10354J45805L1925n9765k6895p5012j23972K4289
17072b00145J38038J52574m099j48050l9103J9303k9795l2030m0922m4756j2085
$$ y = [-205166, -155651, -27797, 21040, -63570, -105077, -52708, -135014, -106756, -158304, -129010, -22633, -16647, -72865, -68143, -78814, -6067, 129033, 81852, 18216, -76443, -94834, -133638, -202363, -172564, -54881, 57359, -36561, -158533, -304713, -175505, -125764, -132413, -177617, -96039, -140129, -162932, -135222, -104927, -154510, -94441, -105862, -23548, -40383, -68462, -60975, -141984, -119211, -50879, -100557, -110278, -159738, -135845, -148622, -139163, -112129, -75522, -119184, -165789, -189117, -120758, -100525, -147203, -57512, -5530, -55853, 7178, -3587, 27059, 36184, -95194, -116758, -168716, -226874, -116520, 29285, 61210, 1445, -25450, -100462, -224434, -200145, -62107, 90467, 86368, -61682, -100785, -81482, -111277, -143307, -184229, -228985, -241070]
17061b41070L4672J27416l7165k0565m2535P7648Q1731L8885N2993j39285n8731
17050a26006p089N5747j00553P4881j9953j08281J10201J12205M9570j01454O672
17039e4060L3285K7249k0039p9266N0746P4058m3011J9080Q5615j26523k15570
17028b48436N1921Q9577J4713N5292R2203k4575O9127O16j81306M235M253o5349
17016a37729Q6842n4736r582l0263q6076j03688J8368J64051R491J2211J52207
17005B1096J19085N7435L0679j26097j01174j32749l0242J25187J3454L889P973
16994a1464j97042q6933L5679M6170R5772p6833l4695O620Q6729L1386l1121O0442
16982g5290P1958n8811j0096j3770O4673l8960o0706L7788m0222O9872N3184m5585
$$ y = [-241070, -206398, -78982, -116147, -136712, -179247, -101599, -19868, 19017, 72010, -67275, -126006, -133095, -77348, -177901, -103020, -122973, -231254, -121053, -8848, 40722, -60732, -54060, -20775, 6474, -13565, -92831, -42085, 31973, -11038, 8042, 93657, -32866, -248436, -196515, -106938, -92225, -36933, 55270, 30695, 99822, 100438, -80868, -76633, -72380, -137729, -50887, -105623, -115205, -145468, -231544, -335232, -316864, -152813, -143322, -131111, 21096, 140181, 197616, 228295, 102198, 1024, -131725, -161967, -36780, -23326, -19437, -11464, -208506, -295439, -259760, -213590, -117818, -194651, -229346, -222726, -135997, -104611, -135732, -75290, -3332, -62143, -72239, -86009, -21336, -60296, -121002, -83214, -123436, -53564, -380, -45965]
16970d5965p9907L6407L6266N7602K2632k9570o0923n3633L8825J40470k0769
16959D1435Q348J73517j8294n5006j64488j35583L8285o651m1667R459O064O5400
16947g9181J21148M419n0177k7699R7568J4027p0585j02120o4852P7136M7958
16936c2358j8082O4665L6179p6797n9864K8334k3578n6011p8885k628J68879j8653
16924f8799O8298K0731j25285q2175l5896J55336M143Q557J04395N112k3685m3406
16912a2674q1847j3498n1260L3101R6807o2434K9199m4576M454l166O1962K2789
16900b1143L8416o148j4618Q2925o1419k08702J24850Q8206n5748P42P1428l5467
16888C322j00663j19592q3752M4872J8837L0577J35389J45508Q1449Q457j23392
$$ y = [-45965, -125872, -89465, -53199, 4403, 27035, -2535, -63458, -117091, -78266, 62204, 41435, 49783, 223300, 205006, 150000, -14488, -150071, -111786, -118437, -160104, -150645, -144581, -79181, 41967, 46386, -3791, -31490, 66078, 80105, 9520, -92600, -157452, -80316, -32358, -50440, 14225, 50404, -26393, -86257, -57923, -81501, -137512, -216397, -219025, -50146, -68799, -501, 20230, -105055, -187230, -223126, -67790, -63647, -55090, 49305, 54417, 30732, -12674, -94521, -108019, -159279, -126178, -29371, -91805, -62606, -107182, -102728, -105894, -43932, -21143, 17273, 11125, -3493, 79432, 18013, -190689, -65839, 22367, -33381, -32639, 38789, 3322, -97341, -216933, -300685, -255813, -236976, -206399, -71010, 74498, 155947, 164404, 41012]
16877D1012o2447M8185j1071p3386j74266L3188M8928j33499L3709J06234M4549
16866i8864l3179j04512q0979J06498J06003R2072N7426j08254j38486l2014Q2237
16855a52052J25917O5509n1737O041R340o8126n2179P726M7758J10003M7602M4741
16843A40543P794j1798j38925r3248n4589o90N3575P0120Q3210Q524n2223o1327
16831d9034R8569J27809l5342r4348j92708o6694M7960m4904n9972k302O399J74588
16819h9979O9116m5740P7428J0986r783r4510j5260l9218R84J42711k1333r197
16807b3795m318j6005N9906N0501K1268r1990j59200o8491m5356J1329O6954Q2388
16795a16809K5423p0488K8055J04357K3340r3870l7148k9313K0128L5080O9629
$$ y = [41012, -21435, 26750, 15679, -57707, -231973, -198785, -149857, -283356, -249647, -143413, -98864, -132043, -236555, -317534, -211036, -105033, -12961, 44465, -63789, -202275, -234289, -152052, -26135, 39374, -12363, -6322, 3018, -65108, -117287, -109561, -61803, 48200, 95802, 140543, 148337, 136539, -2386, -95634, -150223, -150913, -97338, -27218, 55992, 64516, 12293, -49034, 49535, 177344, 142002, 47654, -145054, -211748, -163788, -208692, -268664, -270966, -264567, -89979, -20863, -66603, 10825, 21811, 12028, -82482, -97742, -136960, -135976, 6735, -14598, -23795, -28113, -44118, 15788, 66289, 87557, -4433, -163633, -232124, -277480, -266151, -199197, -116809, -91386, -161874, -133819, -29462, -6122, -99992, -137140, -166453, -146325, -111245, -41616]
16784d1616m7149q71j0644j03119J37809O6385j03475n3414J41676m8125j2951
16773g5494j3431J2014M8069j4211l7671r0245q5822r6027R4096K02658P8728
16762B2664m6911m2711j08347N0256k1748j30763L1260O3681O1218m6493q5611
16751b53505J30281K112L2392O3896L8440M2015k4239n848O4439j32283l0749
16740g3049J2243j77834j8858J91545J371o0070J25678O8314q1146q5651r3556
16729a91013P3686J30148J622j25744L0127N199j52423r6149R2227K0361M9679
16718a62280L6250n1081n0523R3412L3389j2267J9154l9267j6697M3055P8958
16707b7897l1966n0404m265l2806q9324N8359P6735K4691n4842m2975n844O3704
$$ y = [-41616, -88765, -89636, -100280, -203399, -65590, 795, -102680, -156094, -14418, -62543, -75494, -88925, -76911, -28842, -43053, -80724, -170969, -256791, -352818, -258722, -56064, 22664, -24247, -66958, -175305, -125049, -146797, -277560, -246300, -182619, -121401, -167894, -253505, -123224, -121112, -88720, -24824, 13616, 55631, 31392, 25544, 89983, -42300, -73049, -60806, -238640, -257498, -65953, -64582, -124652, 1026, 69340, -11806, -97457, -191013, -117327, 12821, 14443, -111301, -81174, -75975, -228398, -324547, -232320, -211959, -162280, -126030, -177111, -227634, -134222, -100833, -113100, -93946, -133213, -149910, -106855, -27897, -59863, -110267, -114532, -147338, -236662, -178303, -101568, -76877, -131719, -174694, -180538, -116834]
16695a16834O4711Q8965J38187j1774l0214O443l2816j36071q946L3792P8036
16684G3479M637j35743j0756J24184J02781j397p3859j05139o4453J00765m3772
16673b9273M980l6930J7205J2959L4816r933j2604Q5902q4660j68969J5145P0404
16661a00958m3803j1030n3743j6960M6428n3154j3611J4097l1275P4267P2798
16650a16944k6120k1234m965Q5289O6196O2875J41949J9492j10232o1932J00269
16639A34643K2398j20221j32949l4256l1308L4739K9999j4441o277L4437M1679
16628d1557q2192o6360J857L3733K0017J9446L7896k7421n5165L8167M4531K03550
16616A26502k8689j06681N1352r161j5449k0545p2266k8271O3898J07028n3081
$$ y = [-116834, -52123, 36842, 175029, 163255, 133041, 139484, 106668, -29403, -38349, -4557, 73479, 78116, -57627, -68383, 55801, 158582, 157185, 83326, -21813, -86266, 14499, -29273, -24293, -61223, -44018, -31059, 3757, -6176, -18780, 67122, -17538, -186507, -171362, -100958, -144761, -155791, -209534, -226494, -180066, -233220, -246831, -232734, -264009, -189742, -116944, -143064, -164298, -169263, -83974, -17778, 45097, 187046, 206538, 96306, 34374, 134643, 157041, 36820, -96129, -130385, -161693, -126954, -96955, -111396, -117673, -83236, -41557, -123749, -190109, -188252, -154519, -134502, -115056, -77160, -104581, -159746, -121579, -77048, 126502, 97813, -8868, 42484, 33323, 17874, -2671, -74937, -103208, -39310, 67718, 14637]
16605A4637j3052O0551M9930P6095m29k24662o8056L7535o441L4839q232K5260
16593b2025L4086M3486o975j8557j32054M9490J32446j2013k6884P8545p891j20078
16581h424p5247q0653q7560q1843O8779J24880K48180n8465j24280q2026j48892
16570c05551l510K40815R7901J6339q3951m7162R8042n4943R816R841l6000m0967
16558i9330Q3047O9067n5482j56567o6362Q5026K540R172J17201p253p19j14241
16546a33901j00231r0775L6239P4752o2385N8780o878l5771m330N3448K0405N2084
16534a38563k9949K676M4253m5746N3692J10467n4394r7050M2719j2262k9804
16523a53961q3953K3310P6227m1967j7456M1488R5967k7738L7672j06031l1918
$$ y = [14637, 1585, 62136, 112066, 188161, 187732, -36930, -104986, -67451, -73892, -39053, -47285, -22025, 12061, 55547, 48572, 30015, -102039, -52549, 79897, 67884, 41000, 119545, 111654, -8424, -83671, -164324, -251884, -333727, -264948, -140068, 108112, 49647, -74633, -156659, -305551, -309061, -68246, 29655, 45994, -37957, -85119, 12923, -42020, -32204, -22363, -58363, -99330, -16283, 52784, -2698, -159265, -225627, -140601, -138061, -128889, -11688, -18941, -19660, -133901, -234132, -324907, -288668, -213916, -276301, -217521, -224399, -260170, -264500, -211052, -190647, -138563, -168512, -165836, -121583, -167329, -113637, -3170, -57564, -154614, -111895, -124157, -153961, -237914, -214604, -138377, -180344, -197800, -156312, -60345, -88083, -50411, -156442, -188360]
16512a88360O9656l3164p803N939R222J37891J07093J1580l0704n7310r7622m5803
16500a19385R4946L3860k1312K6144J1621Q7819N4194L1011q0107p4848o680J24033
16488A61296m0482j45548j4653j0163l0323r3445l8090K2029P8407L3043o4828
16477a42757Q765N9018n2060j651L4621l4759q532q8607M2652L222m5897l798
16465b29783l604o1904Q1614P1367O9089M7089j3705P556j34631j15948L6774
16454b46086Q4076Q7321M410L9451p4792J9714L9884J1765p7460j64418l7513
16443c13648P9778L2586J02922J05246m5592j7717O9867j18065lO1566q0070o467
16431a29597O0165J39442P2573M7176o0771r6889j03944j9355j26149N7349J90952
$$ y = [-188360, -118704, -151868, -159671, -153732, -144510, -6619, 100474, 112054, 81350, 24040, -73582, -119385, -24439, 9421, -11891, 14253, 25874, 113693, 167887, 198898, 118791, 43943, 37263, 161296, 120814, -24734, -39387, -49550, -79873, -173318, -211408, -189379, -110972, -77929, -142757, -133992, -74974, -127034, -128685, -94064, -128823, -137355, -225962, -183310, -180088, -225985, -229783, -233387, -295291, -213677, -142310, -73221, -26132, -39837, -32281, -166912, -282860, -246086, -162010, -74689, -70279, -30828, -105620, -85906, -46022, -34257, -111717, -276135, -313648, -233870, -201284, -98362, 6884, -38708, -56425, 13442, -104623, -104626, -43060, -123130, -129597, -69432, 70010, 142583, 189759, 128988, 32099, -71845, -91200, -217349, -160000, 30952]
16420C0952j8324j5139m4925j17347j8062L2720P360P3615K4978J4226N9465k1041
16408H478o1394k1800j0154n92l4823k5773j9595o0090O6454q6727k7304q436
16396b81756n0603O2280J82072k9560Q0011O5215Q5402R7094o1710o5936J6055
16385I8564m8908p7761K2990N6645L5202j00205J1620J5964r7221R3956n5381
16374d4535m7928N4339M0414O6564J0455j8146p0027j47304j14074M2588J69605
16363e8049P1554j7421m8328k2522k9979M537O2963O0813n0008K3652p2244J8257
16351e6775j1109o5257R013P1676P4149K5784j13995j8529K3928N6804r5884M832
16339i5363O0694O9225j08908J2511M2186R2284J9337m6515p1714k6388j24373
$$ y = [30952, 12628, -2511, -47436, -164783, -182845, -150125, -142765, -69150, -44172, -29946, 29519, 8478, -52916, -74716, -84870, -85462, -120285, -146058, -165653, -225743, -159289, -246016, -273320, -281756, -332359, -270079, -88007, -117567, -37556, 27659, 113061, 210155, 148445, 82509, 98564, 49656, -28105, -5115, 51530, 86732, -13473, -1853, 14111, -83110, 10846, -44535, -92463, -38124, 2290, 68854, 79309, 61163, -8864, -156168, -270242, -227654, -58049, 13505, -3916, -52244, -74766, -104745, -100208, -37245, 23568, -26440, -2788, -75032, -56775, -67884, -133141, -124128, -52452, 21697, 47481, -66514, -85043, -61115, -4311, -100195, -95363, -34669, 34556, -74352, -61841, -19655, 72629, 91966, 45451, -26263, -52651, -177024]
16328a77024l951Q8053j17107K5090M6105J49468J20471Q8895P0674j70974k64942
16317a45242l3766j6937L5409J13293j09189j08378Q3555M3307M0257p7413J4112
16306a60992o8537l4315P6245O1850J20490J28536p0341j48609j32084J8160K0268
16295a89329p375P114q5345o3088P5891J17823L5207K2824M3591J00031j9705
16284C7639j44830l3470l9508p0240m8282M989J59741p2760K1937M9670l8263
16273a73377p4548O9753O3646J29923R2838j26583j31753k7842k4016Q9946N9449
16262e2564q8891L7499J17660O1448m9171j87294n1965K4911L5745L9095J45318
16251C1791q2028p8120p310K7192k2447j2859O8314Q6103J9734j0645k33j41520
$$ y = [-177024, -180975, -92922, -210029, -184939, -138834, 10634, 131105, 220000, 290674, 119700, -145242, -179008, -195945, -160536, -47243, -156432, -264810, -181255, -137948, -97691, -175104, -160992, -229529, -263844, -187599, -125749, -5259, 123277, 52936, -95673, -227757, -209597, -189329, -196704, -189590, -274935, -338023, -262132, -144309, -109102, -86278, -42687, 57344, 37639, -107191, -140661, -180169, -250409, -298691, -293702, -133961, -206721, -184784, -135114, -173377, -247925, -178172, -114526, 15397, 108235, -18348, -150101, -177943, -201959, -112013, -52564, -141455, -103956, 13704, 75152, 25981, -161313, -213278, -188367, -152622, -113527, 31791, -50237, -128357, -135667, -108475, -130922, -143781, -75467, 10636, 30370, 19725, 19492, -122028]
16239a22028q0556L0864m5301J093J03294K9009m6281n0508l4332K4568k1197
16228b11375N0452O073N0487m8140m3627P866q0061l831R570q854Q0698P9434
16216a11308J7479p4825k3582J38898M5766j502M6314K1718J5260k9541k1543
16205B3134l1929m4974o7052N7580K7188K0145N9356j1718k6990o6121p6394O6994
16193g0781R9115M4602p8927l1301r200P7615J46006N5709p5002j47788j5277
16182e229K230N5190K9238p6515r7418M606O2485q7995J3084m016q5162o7782
16170b57284J8131L9881Q6825N1690p4786M4726O3234J0588k4543j35222k7334
16159b04094J7658Q4018o3020n221K4817M7671N7195k2380j23706j20096m2583
$$ y = [-122028, -202584, -171720, -217021, -215928, -112634, -83625, -129906, -180414, -214746, -190178, -211375, -160923, -154850, -104363, -152503, -196130, -188264, -268325, -272156, -262586, -271440, -190742, -111308, -93829, -168654, -192236, -53338, -7572, -9074, 37240, 58958, 74218, 44677, 23134, -8795, -53769, -120821, -63241, -36053, -15908, 43448, 31730, 4740, -61381, -137775, -70781, 28334, 72936, -5991, -37292, -46492, 31123, 177129, 232838, 157836, 10048, -5229, -2999, 52191, 81429, 4914, -92504, -87898, -25413, -113408, -100324, -104340, -189502, -257284, -239153, -199272, -112447, -60757, -135543, -90817, -27583, -16995, -41538, -176760, -204094, -186436, -102418, -165438, -170659, -145842, -98171, -40976, -63356, -187062, -307158, -349741]
16148c49741J68459N9532R9097Q8259m5857n5911J1805Q9231p403l4457m4695
16137b1681J1609J5498M3141P8800j4833l0786j14731j91135k9240J15176j36518
16126b74700j17045J01621J66956J23054J7351j15652n8839O8179M6278K1885
16116b0912n1361R0689P3174L2203k6309m5873K952J8505L2853L6436j01845q4571
16104d4059m7569o0356m8853L912K9841N8182Q8948n682r0287l956n648k897J5756
16091a12668q38N3375j5009l2164k1063m3974q4039r259j9690O4076p4163P841
16079b87575J15503J15640O4847J10822k4087r5039j16148p2888Q406L1765N0425
16068i8329O9523k0005n1150o6913J10786J69230q0443m3300k14586j24967j5058
$$ y = [-349741, -181282, -121750, -22653, 65606, 19749, -36162, -24357, 64874, 57471, 23014, -21681, -10072, 5426, 48567, 127367, 112534, 81748, -32983, -224118, -253358, -138182, -274700, -391745, -290124, -123168, -114, 17237, -98415, -157254, -89075, -42797, -20912, -72273, 18416, 91590, 123793, 97484, 51611, 54563, 73068, 105921, 142357, 40512, -44059, -91628, -151984, -200837, -196925, -167084, -108902, -19954, -25636, -115923, -119879, -125527, -128424, -112668, -113506, -60131, -75140, -107304, -128367, -172341, -256380, -265639, -285329, -221253, -295416, -287575, -172072, -56432, 8415, 119237, 95150, 111, -116037, -188925, -180519, -148754, -98329, -28806, -48811, -99961, -166874, -56088, 113142, 32699, -10601, -225187, -350154, -365212]
16057c65212J25697J89874R8521l6880N8607P4756M008j71347n6718l0872j14598
16046b24164M4554J33552n1873n8133m5263J01962K2536j7159l5686P8144l4453
16035h5983K3813j0152j46427J0622J17713k9759K2677K1822q4010J132P8969
16024g9583N5649j19311m5155J28963r4437K4878R6737N9061j48697m4464Q6936
16013g9423J04765K1687L8237m1430K9305p2412K8891p4636j24213k8646Q4891
16002a12984R5872K6801o5056Q914j9967k36728K331Q3845J08483k1955j12431
15991b42875L6820P2846j0291J3799q8613O2255J41481R5861j0432j07513q324
15980d4986L3080J30787n4891q5237p3473k7928N9230J15054k72j62686l9806
$$ y = [-365212, -239515, -49641, 48880, 12000, 70607, 145363, 149371, -21976, -78694, -109566, -224164, -179610, -46058, -97931, -156064, -201327, -99365, -76829, -93988, -129674, -51530, -85983, -62170, -72322, -218749, -208127, -90414, -120173, -97496, -75674, -159684, -158552, -79583, -23934, -143245, -188400, -59437, -153874, -128996, -32259, 26802, -121895, -166359, -79423, 25342, 47029, 85266, 43836, 73141, 729, 29620, -45016, -169229, -197875, -112984, -17112, 9689, -55367, -46453, -66420, -303148, -300817, -216972, -108489, -130444, -242875, -206055, -133209, -143500, -129701, -218314, -156059, -14578, 81283, 70851, -36662, -44986, -11906, 118881, 63990, -21247, -94720, -122648, -63418, 51636, 51364, -111322, -151128]
15969a51128J3814k2817m7497q112k0059K4025J05960n0069m063L920O7060n3123
15957a42089j4181M3530J25461N5036m4655p3765K9623l0733m6148O5106j10638
15946a43453N0354J05082p3519p3111o2710N0136p0600o9022M8883K06775L2527
15935A342L7033R5488J1380r1361p5323j64235r228J06249J2047K4319n6365q8773
15923a97427j4414k8467j09904J3133J19010J45289n929K8890J81258P3592n145
15912A99886j07951p1601n8152q8747Q4180J00639J116j03783n4110M3990K5413
15901b9120q5982m2199J1121Q4360Q4273p4783q9038j00741j7539p1919M3409
15890b88158N3507M3309P7150K5495n4060j7903N69N8561O9820n4364M611J66369
$$ y = [-151128, -137314, -160131, -207628, -215740, -235799, -211774, -105814, -155883, -159946, -156026, -88966, -142089, -156270, -112740, 12721, 67757, 23102, -50663, -21040, -51773, -97921, -32815, -143453, -93099, 11983, -61536, -134647, -197357, -147221, -217821, -286843, -237960, -31185, 1342, 38375, 133863, 145243, 53882, -21441, -185676, -194904, -88655, -76608, -52289, -108654, -197427, -211841, -240308, -350212, -337079, -218069, -72780, -78709, -49819, 131439, 205031, 199886, 91935, 20334, -37818, -126565, -42385, 58254, 59370, -44413, -98523, -54533, -29120, -115102, -157301, -146180, -61820, 22453, -52330, -141368, -242109, -259648, -331567, -288158, -234651, -191342, -114192, -88697, -142757, -160660, -160091, -101530, -31710, -86074, -81463, 84906]
15878H4906q703k06346K9130R0262n0868j12620O2280P1883M5811L6426K6000
15867F8161P98o7475j2830N737r4260o0598r1140j09674l6925J57215N6644P1292
15855a13055k017r0830M90L4634M6115j8936l158L6970q8486J3360K3135k8034
15843a89812O127R9232l053r1942M4043J65492k0739M5662m1587j45570L8730
15832i3417L9575r7901M5462Q2901M952J1672N0031n4636P7798L9163J224r9126
15820G698n42l5575n003N3638k6667j27581L341j5500j36575K084R6631J5785
15808a68266m519N7484k2693J01898P0738l6486j60881J47246Q8319q0373k0611
15797b8144N9477j1307j27810p7224M4686J11214l7793j29312q8529r5231N3869
$$ y = [84906, 76203, -130143, -101013, -10751, -61619, -174239, -111959, -40076, 5735, 42161, 68161, 68959, 1484, -11346, -5609, -99869, -160467, -251607, -361281, -398206, -240991, -184347, -113055, -115072, -205902, -205412, -170778, -124663, -143599, -146757, -109787, -198273, -184913, -161778, -189812, -183685, -84453, -87506, -179448, -135405, 30087, 9348, 55010, 13423, -132147, -93417, -53842, -151743, -106281, -23380, -18428, -6756, 43275, -11361, 66437, 105600, 106824, 7698, 7156, -28419, -33422, 20216, -6451, -134032, -130691, -146191, -282766, -280682, -184051, -168266, -172785, -115301, -137994, -36096, 34642, -1844, -162725, -15479, 72840, -7533, -28144, 31333, 20026, -107784, -185008, -140322, -29108, -66901, -196213, -284742, -379973, -326104]
15786c26104J15584R5498R1187K2055j3002q0664J02943m3984r0002M337K417
15775a19735O3965M214J6182o0317Q1497L0495k034m1482p1345m9592J02484J17132
15763G1464n5177m6665j5953P4033L1152j31436M3115J5355j7033P1611q8083
15752d7617k4728l8155M7102R0623q949q9870j65384q7017J40481K0805o663J12952
15740e6420L8788l9431j53151J1451K18989J01127k4143L2465q9192q0307M7315
15729G491j6549l1510L282N3301R8613M2701M9107j07632L5433M3196L5139q6405
15717A26167l1252p0495j15301j05070N3959N5632q7377j17121Q7169Q7305m1252
15706a57636M1488o695J0363N6813J546o5372p170O0195O3754L2798P551p1617
$$ y = [-326104, -210520, -115022, -23835, -1780, -14782, -95446, 7497, -36487, -126489, -122152, -119735, -55770, -51556, -35374, -95691, -14194, 16301, 14267, -27215, -98560, -148152, -45668, 71464, 16287, -30378, -46331, 27702, 58854, -72582, -29467, -14112, -31145, 40466, -47617, -72345, -110500, -63398, 27225, 18276, -71594, -236978, -323995, -183514, -162709, -169372, -56420, -17632, -57063, -210214, -198763, 20226, 121353, 97210, 129675, 40483, -39824, 7491, -9058, -40568, -37286, 16015, 114628, 157329, 206436, 98804, 134237, 177433, 212572, 126167, 94915, 24420, -90881, -195951, -141992, -86360, -173737, -290858, -203689, -116384, -157636, -116148, -122843, -112480, -55667, -54121, -119493, -126663, -66468, -2714, 30084, 37635, -33982]
15694c3982n6746n9437O7115J36901p678j57022o5460j1577R3160R2288M6781
15683D4343J0367l5734J9280j3718q7930p696j57393r0636N8892R5590J08755
15672e5880N8517j4161L2831n1875J04473l6938j38892K6139P2126N4828L7506
15661H8674j5214j5186n5360o7513n5315J6651n1489j47230j3808N4119L4929
15650b26742O0927o3025N586J85291M7028q2246J2371r039m6907J2977K4938N6226
15638b2615L732l5284p3363o385K3893M9051m7304q5942J07073O7500r1974O7086
15626d4532J2129j20295K6197l6053l2060j2527J52219J23286J2698O2198K0216
15615A63476o2455k0671j7078O4001L1737j30948o9884r989L1351j14477j20400
$$ y = [-33982, -90728, -150165, -83050, 53851, 46173, -110849, -176309, -187886, -94726, -2438, 44343, 54710, 18976, 38256, 24538, -63392, -71088, -228481, -319117, -260225, -164635, -55880, 2637, -11524, 21307, -30568, 73905, 36967, -101925, -75786, -3660, 51168, 88674, 73460, 58274, 2914, -64599, -119914, -103263, -154752, -301982, -315790, -261671, -226742, -165815, -228840, -223254, -37963, 9065, -73181, -60810, -69849, -116756, -103779, -78841, -22615, -18883, -54167, -127530, -133915, -110022, -60971, -108275, -194217, -87144, -19644, -111618, -44532, -32403, -152698, -126501, -162554, -194614, -207141, -54922, 68364, 81062, 143260, 163476, 101021, 80350, 63272, 127273, 159010, 28062, -41822, -51811, -20460, -134937, -255337]
15604b55337K1099P7118J15497J67188Q4538n8751j52467l2246J424J27665O4544
15593A60272j09215n3204r6546k8546n9365j4267N2279M6473K7514Q9148j796
15582A2747m5814m5671m7582j8229q6829q7628O7986L6725M2728k1948L5753p1541
15570b29303r1743N8369l0536j2774M3797R8809L4549J3513q9727J7873j23964
15559c11137n2366j554O1875R2924J77313N0414M9665r7696j22663k5444k5953
15548b04622N9717J03598Q936J76050Q9475m3269P4709m0266j74536j15776j91500
15537b57484K6381J56942J37574l8047k6532Q6777l1385j39695J13953J08351
15527A36835J40973L4252k38472j59117j2375r887J0500n9582j84736L0110J145
$$ y = [-255337, -234238, -157120, -41623, 125565, 210103, 151352, -1115, -33361, -31937, 95728, 160272, 51057, -2147, -98693, -127239, -186604, -200871, -148592, -102119, -74605, 14543, 12747, -33067, -78738, -126320, -144549, -231378, -319006, -251020, -214295, -171567, -193515, -157762, -229303, -321046, -262677, -293213, -305987, -262190, -163381, -128832, -115319, -205046, -187173, -311137, -363503, -365057, -303182, -210258, -32945, 17469, 67134, -30562, -153225, -178669, -204622, -144905, -41307, -32371, 143679, 233154, 189885, 264594, 224328, 49792, -65984, -257484, -231103, -74161, 63413, 25366, -1166, 85611, 54226, -85469, 28484, 136835, 277808, 312060, 73588, -85529, -97904, -107791, -97291, -156873, -341609, -311499, -310354]
15516c10354J46414Q12n3927R3267K1684j0426j5920l9156K6284j3312N9988P1865
15504b2781J1727p6455l0053M8931R7579O4118Q029K8252p9455j8129Q5805j61754
15492d4186p8914p0205j06479J42054R0101M0060p6274K472o9742K5841q284o4755
15480b18311J5491L2356l8279k6076M8759Q3245J18673P7510Q6973N0447j74021
15469E6767j61255J4768M2206Q207P2448L384J59554l4832j14927j1108q4431
15458d9219j02748j3754O5821K718k8379m1286p9277O9764j7707K9783J23349
15447d0935o505m9524R4173J2442n2105m3947m3955k5752J2194L2171n972l2228
15435a49943J16199Q6497J68820o2256j52204l6718o8949j4454J33496P4700L566
$$ y = [-310354, -163940, -163128, -217055, -123788, -102104, -112530, -128450, -167606, -141322, -154634, -94646, -22781, -11054, -87509, -117562, -68631, 28948, 93066, 101095, 129347, 49892, 31763, 117568, -44186, -123100, -193305, -299784, -157730, -67629, -27569, -103843, -101371, -171113, -145272, -153556, -218311, -202820, -170464, -208743, -234819, -186060, -102815, 15858, 93368, 180341, 230788, 56767, -104488, -89720, -47514, -39307, 33141, 36525, 196079, 161247, 46320, 35212, -49219, -151967, -165721, -99900, -97182, -125561, -166847, -246124, -176360, -194067, -164284, -40935, -47440, -96964, -2791, 9651, -42454, -86401, -130356, -156108, -143914, -111743, -117715, -149943, -33744, 52753, 221573, 159317, 7113, -29605, -98554, -113008, 20488, 95188, 98754]
15424I8754o9725p5142m8488L7570J6539J05148m3836j748O5103k9805L6014l4148
15412E6236Q6230K0666n7776n9978q519M5194j06202r3131o6856R1467J3216p427
15400h6880N5530J2655Q5006j6926q4980j37125n3871P5864O7751P3445p1559
15389h1090j14595J0306R6006J07778R7225J2106k0266n7204j52438q7593M1770
15378a47995O4010l6982q1433O0413M9810N6164j4213P6011L2739n6064p4433
15367g1973j42034J879J74399O4202m8900L7344K8744k07479p1874K2059J52631
15356f1002K0595L862k4687j39017K0134L4503O3310l4257k0628k7850L2507l6957
15344a69487r713J26094P7390m5004p4952J141K8812J3333o891P8557M8533p3541
$$ y = [98754, 29029, -46113, -94601, -57031, -40492, 64656, 20820, 19072, 84175, 54370, 90384, 56236, 142466, 163132, 105356, 45378, 36859, 82053, -24149, -117280, -184136, -92669, -79453, -86880, -31350, -18695, 66311, 49385, -35595, -172720, -226591, -150727, -82976, -9531, -81090, -195685, -185379, -89373, 18405, 115630, 127736, 107470, 50266, -102172, -189765, -147995, -83985, -120967, -202400, -141987, -92177, -36013, -50226, 25785, 58524, 2460, -71973, -214007, -212128, -37729, 26473, -22427, 14917, 43661, -163818, -235692, -213633, -61002, -40407, -36545, -61232, -200249, -180115, -145612, -82302, -116559, -137187, -165037, -132530, -169487, -179200, -53106, 24284, -20720, -95672, -94531, -65719, -52386, -59277, 19280, 67813, -5728]
15332e728j926n757k6707m6492p3501M8381L5764K1337Q600j35267n0788j8357
15320b50441o0476o6014k2063K27269J56873l1898n0442m7601n2228L3643Q6673
15309g6705J23856K4951q126j5482L5978k2828j44668r1522j30252k1090Q8104
15298b37784J2188R1000J01789o2483j43167k0378l3505q0871J44368J51558L5492
15287d1793P6463L8511j10724j37231K7911N6608M207M0059j186l9394r692K1949
15275g4312R8113J7083j03039k9330K2746O1520q1519r5482l5408M8853R0751
15264h0024K2631J52023O9208n3023k21266l1511J18796l7237j6973l40L9527
15253c8189R362J3898o8327j0033q1342k3052J5649L6878J21167J32647n3453
$$ y = [-5728, -7654, -13411, -40118, -86610, -160111, -111730, -75966, -54629, -46029, -181296, -232084, -250441, -310917, -376931, -398994, -171725, -14852, -46750, -97192, -144793, -197021, -163378, -76705, 47151, 72102, 63976, 48494, 84472, 61644, -83024, -174546, -304798, -325888, -237784, -225596, -134596, -32807, -95290, -238457, -258835, -292340, -373211, -228843, -77285, -41793, 34670, 73181, -37543, -174774, -146863, -90255, -86048, -45989, -47175, -86569, -96261, -74312, 23801, 40884, -62155, -91485, -68739, -7219, -88738, -184220, -219628, -170775, -80024, -57393, 94630, 163838, 110815, -110451, -141962, -23166, -60403, -77376, -77716, -38189, -28827, -14929, -83256, -93289, -174631, -197683, -182034, -145156, -23989, 108658, 55205]
15242E5205n6841m5276j48486K7115J12012p5748k4875N2328N821M5319J4332
15231c9094J14343N2929j15798p8448M1733M0244N5184J9955L4045K1966k6047
15220A21012o541j39396j43039K680P8985j05887J9178K26031J22168j05343j40016
15209g0168n7654P8111l8779o666N2517j67373j15941J36021M7377j1961j02140
15198b56656j58457J28477Q9782L7355o9841J636J62253J68571p238o6860M6160
15187G5182p0410n6315p1042j4176L1392o8878p8825M3561j858J10649N8995l5521
15175g7246r4802L6533j182n1877n504J34360J50525M359j61386n2093N6253N6438
15163e622J62508j0024o2384j78365k4366O3583m436l838j02734n8468M4148P7627
$$ y = [55205, -1636, -46912, -195398, -168283, -56271, -132019, -156894, -104566, -98745, -53426, -39094, 75249, 128178, 12380, -66068, -24335, 15909, 71093, 91048, 125093, 147059, 121012, 114471, -24925, -167964, -165284, -86299, -192186, -173008, 53023, 175191, 69848, -70168, -127822, -49711, -88490, -95156, -42639, -210012, -325953, -189932, -142555, -154516, -256656, -415113, -286636, -196854, -159499, -229340, -227704, -65451, 103120, 95882, 29022, 75182, 4772, -51543, -122585, -136761, -105369, -174247, -253072, -209511, -211369, -100720, -41725, -77246, -172048, -135515, -136697, -188574, -194078, -59718, 90807, 95166, -66220, -118313, -62060, -5622, 156886, 146862, 84478, -93887, -118253, -54670, -59106, -62944, -165678, -224146, -179998, -102371]
15151a02371K2461O6043L2256L6672p3139k4086J1889J7842m1151L1236N764O0009
15139D3425R4925m5194j88650k45755j18181P7922J21813J24269O4226O8475l4265
15128c6990j57897N6500R1367P5000p8952n1817q6086l460J3590J6762N9844j37992
15116b40131J1331P2360N8947p806O7534J6901k9860j4111L568Q98j08548j70283
15104c39200o332K8430J54822J19648M564r414K0540l5686l8924J3230j09758
15093a98080M3230p7009j07391J07227K19796o092j59947p9570J3493J63184k0919
15082a02078k5522K0912j10407K0411K6914N2374K5662j384N3130Q449M6132K1311
15070C5904n9623l4379q7584J41579R6844k8225q007j15908j1202L0162K7703
$$ y = [-102371, -79910, -13867, 18389, 55061, -18078, -42164, -30275, -12433, -53584, -22348, -16584, 43425, 138350, 93156, -95494, -341249, -459430, -381508, -259695, -135426, -71200, -2725, -36990, -194887, -138387, -47020, 27980, -50972, -102789, -188875, -192335, -178745, -161983, -102139, -240131, -228800, -156440, -97493, -105299, -37765, -20864, -50724, -64835, -61267, -60369, -168917, -339200, -345532, -317102, -162280, -42632, -38068, -47482, -26942, -62628, -101552, -88322, -198080, -154850, -231859, -339250, -232023, -12227, -18319, -178266, -257836, -244343, -81159, -102078, -127600, -106688, -217095, -196684, -169770, -117396, -91734, -93118, -39988, -31539, 14593, 35904, -23719, -58098, -145682, -4103, 92741, 64516, 56509, -59399, -70601, -40439, -12736]
15059a2736J363N6376k3566n6348n474j5899k4590J8960l5308r7472N8761K17640
15047H1707P3149r6725j56061K5465L7513O9658K5182N654J4952N643j36364k2023
15035g2250M3189j3649J0946K2111J4041K6123J2931M6792j21530o9202L0017
15024g0481p5697j17078R8470J15638J35784q7433o8551N2531R6509k1778m8873
15013I041M6337N086J6004j7886M8418j6803M3126j0987j0080J1298l8777n8114
15001B6663q6235n4920K191K6126L4189R9331q3532L1342L9683J59147K3724j52251
14989F5458k3458o1484j5692J8686J6837N3692M9275M2911J01987k7981r2808
14978A27423q1113o4678M9811q396K295k2557n7801O231Q2315O707M7176n7133
$$ y = [-12736, -11373, 45003, 21437, -34911, -40385, -56284, -80874, -61914, -97222, -194694, -135933, 81707, 154856, 58131, -97930, -72465, -34952, 34706, 59888, 65542, 80494, 86137, -50227, -72250, -29061, -42710, -31764, -9653, 4388, 30511, 43442, 90234, -31296, -100498, -70481, -146178, -263256, -164786, -49148, 86636, -797, -69348, -16817, 79692, 57914, 9041, 55378, 60464, 76468, 58582, 107000, 90197, 133323, 122336, 112256, 123554, 84777, 26663, -59572, -114492, -112301, -86175, -51986, 47345, -36187, -4845, 34838, 193985, 217709, 65458, 42000, -19484, -35176, -16490, 347, 54039, 103314, 146225, 248212, 220231, 127423, 46310, -18368, 31443, 23047, 25342, 2785, -55016, -48785, 33530, 40237, 87413, 30280]
14966C0280n8725m490O1261L0122o0344j2779P6435P808k1132m052m21J3367p0162
14953a2832o9977K5273O2505N986K26j4091o7482n8014R3326j1792R392J2922
14941b4558o9294M777k8105K2650j41606l7062Q3867n1551k4652J23683N3423
14930h8428L1944j5799m7445J28285o8189j35911M3400P2970m0138n0795J1004
14919a59102l9982P4655J05165q3766J05557k47J13636M2652l9334j86943L2516
14908c5193O4733P2133L9263p4606n4750l2773J6137L945J5916p3911K6822M7697
14896A5413j22456o3114o5782m5790J16445O730m4615k8458J1686j6532K4221
$$ y = [30280, -28445, -32935, 28326, 58448, -1896, -14675, 61760, 69568, 48436, 44384, 43963, 57330, -12832, -82809, -57536, 4969, 10955, 11181, -2910, -70392, -128406, -35080, -46872, -37480, -24558, -93852, -89075, -117180, -94530, -236136, -273198, -189331, -240882, -265534, -141851, -88428, -56484, -72283, -119728, 8557, -59632, -195543, -152143, -79173, -119311, -170106, -159102, -199084, -124429, -19264, -103030, 2527, 2280, 115916, 158568, 119234, -67709, -35193, 29540, 101673, 140936, 66330, 11580, -21193, -5056, -1111, 14805, -59106, -32284, 15413, -107043, -170157, -235939, -281729, -165284, -158554, -203169, -231627, -219941, -236473, -212252]
$$ [...]
##END NTUPLES=NMR SPECTRUM
##END=
