##TITLE=Analysis number 328237
Compound Code cc 63813
Book Reference 511/98
Project Code adrs
Chemist Name stevem
##JCAMPDX= 6.0         $$ Bruker NMR JCAMP-DX V2.0
##DATA TYPE= NMR SPECTRUM
##DATA CLASS= NTUPLES
##ORIGIN= Bruker BioSpin GmbH
##OWNER= nmr
$$ XWIN-NMR		Version 3.5
$$ Wed May 16 14:18:39 2007 GMT Daylight Time (UT+1h)  MAYBRIDGE\nmr@NMR_250MHZ
##.OBSERVE FREQUENCY= 250.131544655141
##.OBSERVE NUCLEUS= ^1H
##.ACQUISITION MODE= SIMULTANEOUS (DQD)
##.ACQUISITION SCHEME= undefined
##.AVERAGES= 16
##.DIGITISER RES= 18
##SPECTROMETER/DATA SYSTEM= dpx250
##.PULSE SEQUENCE= zg30
##.SOLVENT NAME= CDCl3
##.SHIFT REFERENCE= (INTERNAL, CDCl3, 0, 16.4555)
##AUDIT TRAIL= $$ (NUMBER, WHEN, WHO, WHERE, WHAT)
$$ ##TITLE= Audit trail, XWIN-NMR		Version 3.5
$$ ##JCAMPDX= 5.01
$$ ##ORIGIN= Bruker BioSpin GmbH
$$ ##OWNER= nmr
$$ C:\u/data/dgb/nmr/ADRS/1110/pdata/1/auditp.txt
$$ ##AUDIT TRAIL=  $$ (NUMBER, WHEN, WHO, WHERE, WHAT)
(   1,<2007-05-16 14:18:13.53 +100>,<MAYBRIDGE\nmr>,<NMR_250MHZ>,
      <created by zg, POWCHK disabled, PULCHK disabled
       configuration hash MD5:
       76 6E 9A 78 1E 09 19 81 EC 84 63 8F B0 6A 59 2D
       data hash MD5: 64K
       90 47 9F 46 86 B6 FC D5 EC 8D B6 0B 75 EC EC 1B>)
(   2,<2007-05-16 14:18:29.19 +100>,<MAYBRIDGE\nmr>,<NMR_250MHZ>,
      <Start of raw data processing
       ef LB = 0.3 FT_mod = 6 PKNL = 1 SI = 32K 
       data hash MD5: 32K
       6B F0 75 F1 8A 01 12 3D 6F 14 90 6C F9 65 39 0A>)
(   3,<2007-05-16 14:18:30.88 +100>,<MAYBRIDGE\nmr>,<NMR_250MHZ>,
      <apk 
       data hash MD5: 32K
       0D 56 36 E4 24 1A 30 F4 ED 7A 30 4E FE 4A DA 51>)
(   4,<2007-05-16 14:18:31.56 +100>,<MAYBRIDGE\nmr>,<NMR_250MHZ>,
      <abs ABSG = 5 
       data hash MD5: 32K
       B4 0A 06 FA DB 5F 4C DA 8D 32 41 7B 85 E6 92 64>)
$$ ##END=
$$ 
$$ hash MD5
$$ 99 BD F3 EA 3B F7 0F 44 30 63 64 DB D8 BC F7 E1
##$RELAX= 
##$RELAX= 
##$RELAX= 
##$RELAX= 
##$RELAX= 
##$RELAX= 
##$RELAX= 
$$ Bruker specific parameters
$$ --------------------------
##$DU= <C:\u>
##$EXPNO= 1110
##$NAME= <ADRS>
##$PROCNO= 1
##$TYPE= <nmr>
##$USER= <dgb>
##$AMP= (0..31)
100 100 100 100 100 100 100 100 100 100 100 100 100 100 100 100 100 100 
100 100 100 100 100 100 100 100 100 100 100 100 100 100 
##$AQSEQ= 0
##$AQ_mod= 3
##$AUNM= <au_zg>
##$AUTOPOS= <34 >
##$BF1= 250.13
##$BF2= 250.13
##$BF3= 250.13
##$BF4= 250.13
##$BF5= 500.13
##$BF6= 500.13
##$BF7= 500.13
##$BF8= 500.13
##$BYTORDA= 1
##$CFDGTYP= 0
##$CFRGTYP= 5
##$CHEMSTR= <none>
##$CNST= (0..31)
1 1 145 1 1 1 1 1 1 1 1 1 1 1 1 1 1 1 1 1 1 1 1 1 1 1 1 1 1 1 1 1 
##$CPDPRG= <>
##$CPDPRG1= <>
##$CPDPRG2= <>
##$CPDPRG3= <>
##$CPDPRG4= <mlev>
##$CPDPRG5= <mlev>
##$CPDPRG6= <mlev>
##$CPDPRG7= <mlev>
##$CPDPRG8= <mlev>
##$CPDPRGB= <>
##$CPDPRGT= <>
##$D= (0..31)
0 1 0 0 0 0 0 0 0 0.06 0 0 0 0 0 0 0.0002 0 0 0 0 0 0 0 0 0 0 0 0 0 0 
0 
##$DATE= 1179321490
##$DBL= (0..7)
120 120 120 120 120 120 120 120 
##$DBP= (0..7)
150 150 150 150 150 150 150 150 
##$DBP07= 0
##$DBPNAM0= <>
##$DBPNAM1= <>
$$ [...]
##$SUBNAM7= <"">
##$SUBNAM8= <"">
##$SUBNAM9= <"">
##$SW= 20.6930455092707
##$SWIBOX= (0..15)
0 0 3 0 0 0 0 0 0 0 0 0 0 0 0 0 
##$SW_h= 5175.983436853
##$TD= 65536
##$TD0= 1
##$TE= 683.16
##$TE2= 300
##$TE3= 300
##$TEG= 300
##$TL= (0..7)
0 120 120 120 120 120 120 120 
##$TP= (0..7)
150 150 150 150 150 150 150 150 
##$TP07= 0
##$TPNAME0= <>
##$TPNAME1= <>
##$TPNAME2= <>
##$TPNAME3= <>
##$TPNAME4= <>
##$TPNAME5= <>
##$TPNAME6= <>
##$TPNAME7= <>
##$TPOAL= (0..7)
0.5 0.5 0.5 0.5 0.5 0.5 0.5 0.5 
##$TPOFFS= (0..7)
0 0 0 0 0 0 0 0 
##$TUNHIN= 0
##$TUNHOUT= 0
##$TUNXOUT= 0
##$USERA1= <user>
##$USERA2= <user>
##$USERA3= <user>
##$USERA4= <user>
##$USERA5= <user>
##$V9= 5
##$VALIST= <valist>
##$VCLIST= <CCCCCCCCCCCCCCC>
##$VD= 0
##$VDLIST= <DDDDDDDDDDDDDDD>
##$VPLIST= <PPPPPPPPPPPPPPP>
##$VTLIST= <TTTTTTTTTTTTTTT>
##$WBST= 1024
##$WBSW= 4
##$XGAIN= (0..3)
0 0 0 0 
##$XL= 0
##$YL= 0
##$YMAX_a= 170038
##$YMIN_a= -252335
##$ZGOPTNS= <>
##$ZL1= 120
##$ZL2= 120
##$ZL3= 120
##$ZL4= 120
##$ABSF1= 16.45554
##$ABSF2= -4.237633
##$ABSG= 5
##$ABSL= 3
##$ALPHA= 0
##$AQORDER= 0
##$ASSFAC= 0
##$ASSFACI= 0
##$ASSFACX= 0
##$ASSWID= 0
##$AUNMP= <proc_1d>
##$AZFE= 0.1
##$AZFW= 0.1
##$BCFW= 0
##$BC_mod= 0
##$BYTORDP= 0
##$COROFFS= 0
##$CY= 12.5
##$DATMOD= 1
##$DC= 0
##$DFILT= <>
##$DTYPP= 0
##$F1P= 14.0000005364418
##$F2P= -0.99999901652339
##$FCOR= 0.5
##$FTSIZE= 32768
##$FT_mod= 6
##$GAMMA= 0
##$GB= 0
##$INTBC= 1
##$INTSCL= 1
##$ISEN= 128
##$LB= 0.3
##$LEV0= 0
##$LPBIN= 0
##$MAXI= 10000
##$MC2= 0
##$MEAN= 0
##$ME_mod= 0
##$MI= 0
##$NCOEF= 0
##$NC_proc= -6
##$NLEV= 6
##$NOISF1= 0
##$NOISF2= 0
##$NSP= 0
##$NTH_PI= 0
##$NZP= 0
##$OFFSET= 16.45554
##$PC= 1
##$PHC0= -55.08939
##$PHC1= 7.932113
##$PH_mod= 1
##$PKNL= yes
##$PPARMOD= 0
##$PSCAL= 4
##$PSIGN= 0
##$REVERSE= no
##$SF= 250.130016623011
##$SI= 32768
##$SIGF1= 0
##$SIGF2= 0
##$SINO= 400
##$SIOLD= 32768
##$SREGLST= <1H.CDCl3>
##$SSB= 0
##$STSI= 32768
##$STSR= 0
##$SW_p= 5175.98343685301
##$SYMM= 0
##$S_DEV= 0
##$TDeff= 65536
##$TDoff= 0
##$TI= <Analysis number 999999
Compound Code 99
Book Reference 9
Project Code 9>
##$TILT= no
##$TM1= 0
##$TM2= 0
##$TOPLEV= 0
##$USERP1= <user>
##$USERP2= <user>
##$USERP3= <user>
##$USERP4= <user>
##$USERP5= <user>
##$WDW= 1
##$XDIM= 32768
##$YMAX_p= 541968217
##$YMIN_p= -934096
$$ End of Bruker specific parameters
$$ ---------------------------------
##NTUPLES= NMR SPECTRUM
##VAR_NAME=  FREQUENCY,     SPECTRUM/REAL,   SPECTRUM/IMAG
##SYMBOL=    X,             R,               I
##VAR_TYPE=  INDEPENDENT,   DEPENDENT,       DEPENDENT
##VAR_FORM=  AFFN,          ASDF,            ASDF
##VAR_DIM=   32768,         32768,           32768
##UNITS=     HZ,            ARBITRARY UNITS, ARBITRARY UNITS
##FACTOR=    0.157963299565203, 1,           1
##FIRST=     4116.02441954434, 0,            0
##LAST=      -1059.95901730867, 0,           0
##MIN=       -1059.95901730867, -934096,     0
##MAX=       4116.02441954434, 541968217,    0
$$ Real data points
##PAGE= N=1
##DATA TABLE= (X++(R..R)), XYDATA
$$ [...]
$$ plain form
25309 143767 -39157 74303 201579 69178 22093 221852 164282 -47007 -28845 114045
25299 114045 208710 211014 202220 37585 -168008 -180381 -28955 2261 24567 2563 -27899
25288 -27899 287964 394833 320114 38168 -59968 -58693 -118825 -121374 -253217 -286236 -79762
25277 -79762 76975 143934 219158 286138 170413 -17162 -51740 27767 107515 149079 121675
25266 121675 77277 191557 232733 126172 -134794 -164003 -182788 -185509 -68549 -93535 -44074
25255 -44074 -54319 -230880 -246377 -327050 -281171 -225592 -410117 -156100 221399 384838 134302
25244 134302 -30949 -170615 -96901 -106550 -82673 -52724 41754 222519 170802 394726 380708
25233 380708 351858 124086 -378 70602 -7489 163704 243773 27577 -129942 -190666
$$ packed form
25309A43767j82924J13460J27276j32401m7085J99759n7570k11289J8162J42890
25299A14045R4665K304q794j64635k05593j2373J51426L1216K2306k2004l0462
25288b7899L15863J06869p4719k81946r8136J275o0132k549j31843l3019K06474
25277g9762J56737O6959P5224O6980j15725j87575l4578P9507P9748M1564k7404
25266A21675m4398J14280M1176j06561k60966k9209j8785k721J16960k4986M9461
25255d4074j0245j76561j5497q0673M5879N5579j84525K54017L77499J63439k50536
25244A34302j65251j39666P3714r649K3877K9949R4478J80765n1717K23924j4018
25233C80708k8850k27772j24464P0980p8091J71193Q0069k16196j57519o0724
$$ plain form
25223 -190666 -183142 -109695 -337594 -268189 96109 289664 55678 -213017 -188401 106570
25213 106570 92155 -12842 9503 264745 198545 44332 -122293 -141941 5026 124307
25203 124307 174099 56581 -67633 -209119 -65080 235799 162725 204485 221009 -25242
25193 -25242 15036 260287 342127 134703 159447 138398 384341 143702 -67901 176819
25183 176819 95846 -67411 156475 398167 321888 189539 251579 174328 -87797 -275561
25173 -275561 -265736 -185286 -221161 -24431 -117205 -262698 -362905 -132613 -123840 19089 -148811
25162 -148811 -32477 -29855 -259779 -232154 -46119 -28882 -171179 -264715 -203010 -139109 36069
25151 36069 74149 -94256 -381414 -318282 -213008 35513 24178 24425 11003 209258 229428
$$ packed form
25223a90666P524P3447k27899O9405L64298J93555k33986k68695K4616K94971
25213A06570j4415j04997K2345K55242o6200j54213j66625j9648J46967J19281
25203A24307M9792j17518j24214j41486J44039L00879p3074M1760J6524k46251
25193b5242M0278K45251Q1840k07424K4744k1049K45943k40639k11603K44720
25183A76819q0973j63257K23886K41692p6279j32349O2040p7251k62125j87764
25173b75561R825Q0450l5875J96730r2774j45493j00207K30292Q773J42929j67900
25162a48811J16334K622k29924K7625J86035J7237j42297r3536O1705O3901J75178
25151C6069L8080j68405k87158O3132J05274K48521j1335K47j3422J98255K0170
$$ plain form
25140 229428 180231 229126 66977 127466 310101 267449 240504 189108 122642 279606 430611
25129 430611 429753 380220 336042 287254 429359 374085 116965 -91326 -16890 118423 164281
25118 164281 262527 121681 -97195 -238070 24262 125814 104016 63215 110671 212386
25108 212386 267140 2354 -131449 -19376 32391 -39167 -11930 156318 -1282 -103964
25098 -103964 92492 213769 36918 -235538 -196525 -70365 -341156 -490295 -345597 -116197
25088 -116197 10612 -73235 -103926 -22600 38513 -103146 -62408 -140742 -119050 37877 116512
25077 116512 69555 -64585 -85626 -181611 -187153 -71764 -138877 -3906 -3794 56933 131642
25066 131642 216889 272292 24313 34906 213065 336345 298984 -43120 -262225 -252556 -224272
$$ packed form
25140B29428m9197M8895j62149O0489J82635m2652k6945n1396o6466J56964J51005
25129D30611q58m9533m4178m8788J42105n5274k57120k08291P4436J35313M5858
25118A64281R8246j40846k18876j40875K62332J01552k1798m0801M7456J01715
25108B12386N4754k64786j33803J12073N1767p1558K7237J68248j57600j02682
25098a03964J96456J21277j76851k72456L9013J26160k70791j49139J44698K29400
25088a16197J26809q3847l0691Q1326O1113j41659M0738p8334K1692J56927P8635
25077A16512m6957j34140k1041r5985n542J15389o7113J34971J12O0727P4709
25066A31642Q5247N5403k47979J0593J78159J23280l7361l42104k19105R669K8284
$$ plain form
25055 -224272 -121007 -181560 -216088 -208987 -295975 -295016 -126744 -187102 -105343 -72401 -34945 -98869
25043 -98869 -102974 -101542 -173189 -278728 -366138 -293446 -274495 -51673 -1257 -2953 154910 212730
25031 212730 59668 -102325 -112938 56977 66237 184341 21654 19412 82510 -104077 -143864
25020 -143864 -80429 1909 187844 144305 -141889 -259049 -343896 -475558 -210144 -133247
25010 -133247 -236826 -417428 -362985 -104506 -144731 -60608 122802 257851 384641 252596
25000 252596 75044 64657 -94383 -187613 -311305 -153694 -91640 -167881 -157878 -66137 96149
24989 96149 241990 146486 302742 350178 252811 136309 283665 524640 342484 96374
24979 96374 97493 60134 -272145 -283338 -112405 99184 194105 250867 122962 95247 109556
$$ packed form
25055b24272J03265o0553l4528P101q6988R59J68272o0358Q1759L2942L7456o3924
25043i8869m105J432p1647j05539q7410P2692J8951K22822N0416j696J57863N7820
25031B12730j53062j61993j0613J69915R260J18104j62687k242O3098j86587l9787
25020a43864O3435Q2338J85935m3539k86194j17160q4847j31662K65414P6897
25010a33247j03579j80602N4443K58479m0225Q4123J83410J35049J26790j32045
25000B52596j77552j0387j59040r3230j23692J57611O2054p6241J0003R1741J62286
24989I6149J45841r5504J56256M7436r7367j16502J47356K40975j82156k46110
24979I6374J119l7359l32279j1193J70933K11589R4921N6762j27905k7715J4309
$$ plain form
24968 109556 132260 152829 147492 48033 -44946 -87659 -99785 74405 110868 -31648 -256128
24957 -256128 -268624 -172192 -71031 49001 15494 24384 113520 31545 -83040 49150 322236
24946 322236 178081 -25077 -47695 -238787 -243826 -180466 -72864 -181945 -150769 -226556 -45938
24935 -45938 -11107 39303 146624 -28738 -268967 169474 357678 360025 264229 151960 116340
24924 116340 24828 -226999 -249953 -28642 52780 -136743 -71008 -90374 18840 54172 -196589
24913 -196589 -458561 -520203 -417848 -365827 -355346 -292626 64348 292353 60616 -380662
24903 -380662 -314731 -211270 -8388 141253 33298 -255237 -360944 -360532 -309440 -160112
24893 -160112 40152 137566 215251 205713 311025 220971 65450 185357 352737 208637
$$ packed form
24968A09556K2704K0569n337r9459r2979m2713j2126J74190L6463j42516k24480
24957b56128j2496R6432J01161J20032l3507Q890Q9136q1975j14585J32190K73086
24946C22236j44155k03158k2618j91092n039O3360J07602j09081L1176p5787J80618
24935d5938L4831N0410J07321j75362k40229M38441J88204K347r5796j12269l5620
24924A16340r1512k51827k2954K21311Q1422j89523O5735j9366J09214L5332k50761
24913a96589k61972o1642J02355N2021J0481O2720L56974K28005k31737m41278
24903c80662O5931J03461K02882J49641j07955k88535j05707M12N1092J49328
24893a60112K00264R7414P7685r538J05312r0054j55521J19907J67380j44100
$$ plain form
24883 208637 36808 11243 292887 230213 -62474 -329653 -590727 -379846 -211515 -65912
24873 -65912 -1538 -124480 110402 120339 35155 114977 -123109 -173269 -133714 -120568 17759
24862 17759 -99187 55289 395645 383721 84409 -74966 -107906 173447 260456 211010
24852 211010 171424 200237 20725 149462 313164 336806 117615 -210239 -244454 173873
24842 173873 364674 284016 313857 182585 -186328 -121662 -95266 -43636 -47033 131633 150346
24831 150346 180816 131597 141619 96351 88509 -128120 -97856 -422390 -476574 -297946 -145426
24820 -145426 30085 18628 -324561 -391674 -107369 -67964 -45150 -55298 -67454 -62808 46727
24809 46727 212011 351818 443158 543428 444760 469166 392019 489431 543260 221101 303040
$$ packed form
24883B08637j71829k5565K81644o2674k92687k67179k61074K10881J68331J45603
24873f5912O4374j22942K34882R937q5184P9822k38086n0160L9555J3146J38327
24862A7759j16946J54476L40356j1924k99312j59375l2940K81353Q7009m9446
24852B11010l9586K8813j79512J28737J63702K3642k19191l27854l4215M18327
24842A73873J90801q0658K9841j31272l68913O4666K6396N1630l397J78666J8713
24831A50346L0470m9219J0022m5268p842k16629L0264l24534n4184J78628J52520
24820a45426J75511j1457l43189o7113K84305L9405K2814j0148j2156M646J09535
24809D6727J65284J39807R1340J00270r8668K4406p7147R7412N3829l22159Q1939
$$ plain form
24798 303040 387623 234045 298098 314950 176084 101909 93592 138818 -37767 -29022 95132
24787 95132 -43516 29801 172837 367991 352994 324710 444450 511065 477545 340469 126467
24776 126467 14824 -41961 -79946 127030 361321 44621 -83495 -96630 -127464 -376999
24766 -376999 -335543 -177347 -338115 -230731 102229 103565 -49416 4500 -53704 -129411 -145441
24755 -145441 -325494 -604713 -617086 -438439 -82298 98548 137785 300726 369657 349144
24745 349144 178734 -9628 77399 167397 140326 35228 85582 203240 347868 242918
24735 242918 156425 567273 655057 353396 356607 455089 270368 228149 156913 -40566 -274771
24724 -274771 -335022 -190439 26709 -40564 -110604 -267465 -102137 60507 823 -167913
$$ packed form
24798C03040Q4583j53578O4053J6852j38866p4175q317M5226j76585Q745J24154
24787I5132j38648P3317J43036J95154j4997k8284J19740O6615l3520j37076k14002
24776A26467j11643n6785l7985K06976K34291l16700j28116j3135l0834k49535
24766c76999M1456J58196j60768J07384L32960J336j52981N3916n8204p5707j6030
24755a45441j80053k79219j2373J78647L56141J80846L9237J62941O8931k0513
24745C49144j70410j88362Q7027Q9998k7071j05098N0354J17658J44628j04950
24735B42918q6493M10848Q7784l01661L211R8482j84721m2219p1236j97479k34205
24724b74771o0251J44583K17148o7273p0040j56861J65328J62644n9684j68736
$$ plain form
24714 -167913 -90152 127551 283996 267067 -41051 -7933 118332 283677 214340 -188791
24704 -188791 -505626 -494300 -63486 109879 -68072 -259600 -359018 -368443 -9918 268167
24694 268167 258205 -23483 -38269 -134330 -40830 41999 25122 -34455 41363 183896 330494
24683 330494 251348 363046 511718 207637 -93199 -50669 -54796 94913 95900 153253 242903
24672 242903 292846 163743 231987 141097 -236376 -239355 -127620 55487 95487 142891 173492
24661 173492 400930 580239 548484 442387 471428 315274 318051 584701 642163 420644
24651 420644 120330 -7037 -129308 -288301 -381933 -307931 -358305 -334603 -231365 -6541
24641 -6541 -1706 143295 174951 -43202 -417785 -324494 -77021 -136114 17622 42537 17118
$$ packed form
24714a67913P7761K17703J56445j6929l08118L3118J26265J65345o9337m03131
24704a88791l16835J1326M30814J73365j77951j91528r9418r425L58525K78085
24694B68167r962k81688j4786r6061R3500Q2829j6877n9577P5818J42533J46598
24683C30494p9146J11698J48672l04081l00836M2530m127J49709R87N7353Q9650
24672B42903M9943j29103O8244r0890l77473k979J11735J83107M0000M7404L0601
24661A73492K27438J79309l1755j06097K9041j56154K777K66650N7462k21519
24651D20644l00314j27367j22271j58993r3632P4002n0374K3702J03238K24824
24641f541M835J45001L1656k18153l74583R3291K47473n9093J53736K4915k5419
$$ plain form
24630 17118 248795 233375 301680 341611 13634 -100121 16252 225848 -54315 -104510
24620 -104510 -23950 105022 -65173 54397 187766 104492 -45847 -147013 -146484 -133728 -173594
24609 -173594 -169680 70298 45900 18263 22225 -65798 49203 -42613 -6445 206122 53491
24598 53491 173650 160701 87951 142825 -8061 109679 443828 373713 94643 -69218
24588 -69218 -31352 -103276 -269450 -104870 50560 -9189 -86202 -47277 26284 130425 182279
24577 182279 62584 75558 -125357 -34449 113223 247929 44775 -40484 -44367 -12400 232446
24566 232446 184396 123706 244140 387938 516419 312443 161847 -2628 24443 -103869
24556 -103869 -53910 30390 45593 -67030 -233243 -46500 95218 33145 -37048 107742
$$ packed form
24630A7118K31677j5420O8305L9931l27977j13755J16373K09596k80163n0195
24620a04510Q0560J28972j70195J19570J33369q3274j50339j01166N29J2756l9866
24609a73594L914K39978k4398k7637L962q8023J15001r1816L6168K12567j52631
24598E3491J20159j2949p2750N4874j50886J17740L34149p0115k79070j63861
24588f9218L7866p1924j66174J64580J55430n9749p7013L8925P3561J04141N1854
24577A82279j19695J2974k00915R0908J47672J34706k03154q5259l883L1967K44846
24566B32446m8050o0690J20434J43798J28481k03976j50596j64475K7071j28312
24556a03869M9959Q4300J5203j12623j66213J86743J41718o2073p0193J44790
$$ plain form
24546 107742 234627 1991 -135355 -219509 -228521 -196858 -162229 -256942 -236711 30066 340532
24535 340532 130579 88175 68157 2295 -77727 -134289 -45243 -32112 121150 86854 -189352
24524 -189352 -214220 165912 301623 234681 83604 -62355 -258872 -155600 -47090 -1548
24514 -1548 -224799 -188723 -50805 218735 438885 386003 242808 229255 193240 74742 -227713
24503 -227713 -255985 -165074 -80655 -231512 -310495 -324092 20108 228077 348050 362131 223299
24492 223299 41300 71912 138454 42384 14423 249762 341033 177572 139923 102996 22548
24481 22548 -184469 -213331 -404121 -415387 -164996 241224 396661 265536 199449 91091
24471 91091 -246777 -389090 60524 66778 25412 172332 143122 218116 251738 219024 -44318
$$ packed form
24546A07742J26885k32636j37346q4154r012L1663L4629r4713K0231K66777L10466
24535C40532k09953m2404k0018o5862q0022n6562Q9046J3131J53262l4296k76206
24524a89352k4868L80132J35711o6942j51077j45959j96517J03272J08510M5542
24514a548k23251L6076J37918K69540K20150n2882j43195j3553l6015j18498l02455
24503b27713k8272R0911Q4419j50857p8983j3597L44200K07969J19973J4081j38832
24492B23299j81999L0612O6542r6070k7961K35339R1271j63461l7649l6927q0448
24481B2548k07017k8862j90790j1266K50391M06220J55437j31125o6087j08358
24471I1091l37868j42313M49614O254m1366J46920k9210P4994L3622l2714k63342
$$ plain form
24460 -44318 -161644 -105969 -110874 -20001 -127277 -320899 -423391 -256670 -4242 -122076
24450 -122076 -319926 -323333 -81076 105567 105125 144405 184449 335253 384865 339296 236785
24439 236785 166636 7301 34776 11393 -201621 -281870 -121175 115904 -81174 -357761
24429 -357761 -450456 -320376 -316600 -371787 -492684 -452566 -306762 -182944 -159379 -251260 -265327
24418 -265327 -151148 -91601 -134547 -342578 -231454 -127489 23762 266204 105548 24944
24408 24944 -106696 -224345 -354445 -228626 167288 137095 -180519 -13663 137728 140999
24398 140999 33608 150996 279245 18989 -324037 -110297 300893 548765 370248 473216
24388 473216 669617 589736 293741 78616 -32242 83682 180798 143114 23082 26962
$$ packed form
24460d4318j17326N5675m905R0873j07276j93622j02492J66721K52428j17834
24450a22076j97850l407K42257J86643m42L9280M0044J50804M9612m5569j02511
24439B36785p0149j59335K7475k3383k13014q0249J60695K37079j97078k76587
24429c57761r2695J30080L776n5187j20897M0118J45804J23818K3565r1881j4067
24418b65327J14179N9547m2946k08031J11124J03965J51251K42442j60656q0604
24408B4944j31640j17649j30100J25819L95914l0193l17614J66856J51391L271
24398A40999j07391J17388J28249k60256l43026K13740M11190K47872j78517J02968
24388D73216J96401p9881k95995k15125j10858J15924R7116l7684j20032L880
$$ plain form
24378 26962 147243 46889 -6978 -176224 -302844 -305467 -266698 -375974 -510197 -542897 -421832
24367 -421832 31242 15544 -39043 -107366 -149004 -57831 94938 305276 127587 -2693
24357 -2693 -153958 -71885 91182 149909 187644 299620 187451 309 -102310 -142128 -114587
24346 -114587 -177240 -174303 -171866 -49352 56115 -29823 -91739 -73482 30812 -81005 -107757
24335 -107757 11856 11142 160342 351065 416935 365792 380353 382695 257138 214206 247178
24324 247178 183626 40094 -88448 -266415 -222104 -258705 -195317 -195237 -300825 -459797 -359075
24313 -359075 -324945 -143568 134700 130160 -123298 -189480 -84115 63872 58314 96268 -154813
24302 -154813 -139577 -176509 950 -44562 -59752 -69103 -47204 178975 306757 358119 337675
$$ packed form
24378B6962J20281j00354n3867j69246j26620k623L8769j09276j34223l2700J21065
24367d21832M53074j5698n4587o8323m1638R1173J52769K10338j77689j30280
24357b693j51265Q2073J63067N8727L7735J11976j12169j87142j02619l9818K7541
24346a14587o2653K937K437J22514J05467q5938o1916J8257J04294j11817k6752
24335a07757J19613p14J49200J90723O5870n1143J4561K342j25557m2932L2972
24324B47178o3552j43532j28542j77967M4311l6601O3388Q0j05588j58972J00722
24313c59075L4130J81377K78268m540k53458o6182J05365J47987n558L7954k51081
24302a54813J5236l6932J77459m5512j5190r351K1899K26179J27782N1362k0444
$$ plain form
24291 337675 74728 -223576 -289739 -445477 -549775 -467757 -232112 -63349 -228061 -78503
24281 -78503 79190 157688 51488 11332 102638 118135 137057 49237 64367 77559 176453
24270 176453 333751 418428 355715 301540 355356 389953 122055 -215403 -135514 -148000 -227087
24259 -227087 -279584 -112390 4783 27275 85428 -204551 -167003 -287140 -268176 -334548 -305153
24248 -305153 -39411 106007 -80026 -108755 -71925 126586 313955 176620 125831 -31069
24238 -31069 -390818 -351981 -134318 -158110 -78524 -193545 -162655 -291430 -301368 -259920 -129229
24227 -129229 191223 302850 199933 200885 85640 -62777 -253148 -279489 -282678 -237747 -112190
24216 -112190 -197494 -254631 -158752 53451 203467 162498 219748 225272 54140 177514 261864
$$ packed form
24291C37675k62947k98304o6163j55738j04298Q2018K35645J68763j64712J49558
24281g8503J57693P8498j06200m0156R1306J5497J8922q7820J5130J3192R8894
24270A76453J57298Q4677o2713n4175N3816L4597k67898l37458P9889j2486p9087
24259b27087n2497J67194J17173K2492N8153k89979L7548j20137J8964o6372K9395
24248c05153K65742J45418j86033k8729L6830J98511J87369j37335n0789j56900
24238c1069l59749L8837K17663k3792P9586j15021L0890j28775r938M1448J30691
24227a29229L20452J11627j02917R52j15245j48417j90371k6341l189M4931J25557
24216a12190q5304n7137R5879K12203J50016m0969N7250N524j71132J23374Q4350
$$ plain form
24205 261864 145059 114609 62840 -48084 249483 353910 279181 154376 45233 -182314
24195 -182314 -175275 -30904 1870 -210811 -260417 83934 223889 93258 131264 28013
24185 28013 -94065 73691 376259 487086 537761 639622 508504 336208 305349 213614
24175 213614 112674 -90943 93302 196587 91951 69713 -27640 -346683 -383318 -253378
24165 -253378 -328562 -61505 170276 115244 65765 26903 -115891 -255285 -180331 -140409 -23926
24154 -23926 91342 38314 -42839 260425 -5960 -251613 -537330 -459508 -395355 -483107 -331305
24143 -331305 -339796 -611655 -407766 -264225 -236500 -275352 -200746 -21646 88478 -238596
24133 -238596 -208430 112504 175420 121059 136304 144171 -87592 -38026 23559 -263964 -429399
$$ packed form
24205B61864j16805l0450n1769j10924K97567J04427p4729j24805j09143k27547
24195a82314P039J44371L2774k12681m9606L44351J39955j30631L8006j03251
24185B8013j22078J67756L02568J10827N0675J01861j31118j72296l0859r1735
24175B13614j00940k03617J84245J03285j04636k2238r7353l19043l6635J29940
24165b53378p5184K67057K31781n5032m9479l8862j42794j39394P4954L9922J16483
24154b3926J15268n3028q1153L03264k66385k45653k85717P7822O4153q7752J51802
24143c31305q491k71859K03889J43541K7725l8852P4606J79100J10124l27074
24133b38596L0166L20934O2916n4361J5245P867k31763M9566O1585k87523j65435
$$ plain form
24122 -429399 -356811 -112887 144506 391394 472444 326719 49867 61264 166685 414336
24112 414336 452396 215197 319761 41952 -258906 105461 328160 367576 262345 210597
24102 210597 214092 206633 348618 243020 161978 28830 -157941 -124278 -72177 63489 122985
24091 122985 -71564 -305814 -115257 -39826 -166178 57312 12102 16809 11022 49169 75718
24080 75718 4469 -137987 -21981 228011 295663 80109 -113039 -316701 -316594 -81369 126612
24069 126612 125559 103941 12326 58860 151043 59852 98434 38744 23977 30334 115164 142496
24057 142496 80137 -57298 -19492 13173 70214 -19445 3381 -27737 283402 313992 341707
24046 341707 563776 537063 352046 483785 425500 148841 146807 310406 193357 -80903
$$ packed form
24122d29399P2588K43924K57393K46888Q1050j45725k76852J1397J05421K47651
24112D14336L8060k37199J04564k77809l00858L64367K22699L9416j05231n1748
24102B10597L495p459J41985j05598q1042j33148j86771L3663N2101J35666N9496
24091A22985j94549k34250J90557P5431j26352K23490m5210M707n787L8147K6549
24080G5718p1249j42456J16006K49992O7652k15554j93148k03662J07K35225K07981
24069A26612j053k1618r1615M6534R2183r1191L8582n9690j4767O357Q4830K7332
24057A42496o2359j37435L7806L2665N7041q9659K2826l1118L11139L0590K7715
24046C41707K22069k6713j85017J31739n8285k76659k034J63599j17049k74260
$$ plain form
24036 -80903 -208255 -319532 -470420 -563861 -174181 114769 255531 187112 -90671 -120684
24026 -120684 106356 70373 -103471 -2035 -128188 -203933 -203031 -131182 -85637 176795 223687
24015 223687 -17329 104953 313156 358746 311361 325479 211541 -30678 -93565 19467
24005 19467 68055 -12960 -130620 -21114 179111 347316 263149 184288 144647 189406 98873
23994 98873 -25859 -111251 -343315 -240002 -177760 -246412 -108168 100904 149786 106440 -171624
23983 -171624 -247600 -282855 -334548 -151402 -179078 -368542 -231566 -283766 -557614 -468362 -407979
23972 -407979 -442377 -439808 -320160 -361469 -129579 -84419 -121633 -145258 -70295 -19954 -56193
23961 -56193 -173300 -39004 171515 355063 396876 436232 269818 41755 54098 123121
$$ packed form
24036h0903j27352j11277j50888r3441L89680K88950J40762o8419k77783l0013
24026a20684K27040l5983j73844J01436j26153p5745R02P1849M5545K62432M6892
24015B23687k41016J22282K08203M5590m7385J4118j13938k42219o2887J13032
24005A9467M8588q1015j17660J09506K00225J68205q4167p8861l9641M4759r0533
23994I8873j24732q5392k32064J03313O2242o8652J38244K09072M8882m3346k78064
23983a71624p5976l5255n1693J83146k7676j89464J36976n2200k73848Q9252O0383
23972d07979l4398K569J19648m1309K31890M5160l7214k3625P4963N0341l6239
23961e6193j17107J34296K10519J83548M1813L9356j66414k28063J2343O9023
$$ plain form
23951 123121 27202 181010 141458 -20739 -148480 -444586 -311117 -118755 -2784 137579
23941 137579 167414 -36395 -146696 -132693 -13296 109511 105249 228207 179762 157065 173361
23930 173361 186065 213640 93477 137913 144710 -9859 -120255 -3366 53019 10292 140752
23919 140752 149056 -10378 -46299 11346 -54130 -24569 -108618 -15182 139805 56229 21381
23908 21381 -216880 -342634 -163761 85481 107179 -121533 -132634 180759 206164 -79871
23898 -79871 -275559 -208976 -441320 -724735 -676115 -329782 -110542 -159791 -299692 -191246
23888 -191246 -48883 -230696 -157275 104111 41278 -117287 -14976 -199918 -303996 -250844
23878 -250844 -380183 -180016 -191593 -160457 -34698 -235219 -331818 -89634 -33713 -89199
$$ packed form
23951A23121r5919J53808l9552j62197j27741k96106J33469J92362J15971J40363
23941A37579K9835k03809j10301J4003J19397J22807m262J22958m8445k2697J6296
23930A73361J2704K7575j20163M4436O797j54569j10396J16889N6385m2727J30460
23919A40752Q304j59434l5921N7645o5476K9561q4049R3436J54987q3576l4848
23908B1381k38261j25754J78873K49242K1698k28712j1101L13393K5405k86035
23898g9871j95688O6583k32344k83415M8620L46333K19240m9249j39901J08446
23888a91246J42363j81813P3421K61386o2833j58565J02311j84942j04078N3152
23878b50844j29339K00167j1577L1136J25759k00521r6599K42184N5921n5486
$$ plain form
23868 -89199 314226 544138 369777 92145 -203454 -215159 -142450 -137013 -200348 -367277 -319774
23857 -319774 -65293 148280 -104664 -269727 -117760 -133176 -133659 157551 200331 -27820
23847 -27820 -33852 20572 338589 251732 -5975 -219245 -244457 54724 413520 294308 -130783
23836 -130783 -250914 -266009 -226454 -137991 34987 336771 259198 185813 40523 -14089 106497
23825 106497 -85154 -145378 -166611 -25686 95372 6194 48296 180288 223003 -74557
23815 -74557 -51258 -160202 -388155 -284716 -169959 -142797 -10067 -26493 -119741 -124025 -37423
23804 -37423 39481 104202 253885 396411 550174 409195 299863 150389 172770 217712
23794 217712 118709 114260 -5112 -100152 264713 453939 613924 441017 487861 404487 126686
$$ packed form
23868h9199M03425K29912j74361k77632k95599j1705P2709N437o3335j66929M7503
23857c19774K54481K13573k52944j65063J51967j5416m83K91210M2780k28151
23847b7820o032N4424L18017q6857k57707k13270k5212K99181L58796j19212m25091
23836a30783j20131j5095L9555Q8463J72978L01784p7573p3385j45290n4612J20586
23825A06497j91651o0224k1233J40925J21058q9178M2102J31992M2715k97560
23815g4557K3299j08944k27953J03439J14757K7162J32730j6426r3248m284Q6602
23804c7423P6904O4721J49683J42526J53763j40979j09332j49474K2381M4942
23794B17712r9003m449j19372r5040L64865J89226J59985j72907M6844q3374k77801
$$ plain form
23783 126686 -40936 -126302 -153576 -120741 -61548 -127465 -33651 60765 -23199 -244295 -165166
23772 -165166 -121253 -225367 -44421 89182 12656 -65330 -88276 -13559 -146656 -221584 -110372
23761 -110372 -187241 -226611 -191478 14412 608 11078 19450 -124952 -134801 80139 377795
23750 377795 479841 427402 321744 124441 -58317 -103434 -64161 -193157 -446363 -445636 -427767
23739 -427767 -236554 153603 347100 229840 399476 509302 327665 350995 162930 -110516
23729 -110516 -131814 -330843 -347522 -359406 -199364 -81424 -109330 -285666 -85819 -213660
23719 -213660 -376711 -339359 42827 252110 249691 8077 -37958 60709 289189 361648 447787
23708 447787 372919 257807 187455 369648 281218 60719 38495 50730 6097 -77267 174053
$$ packed form
23783A26686j67622q5366k7274L2835N9193o5917R3814R4416q3964k21096P9129
23772a65166M3913j04114J80946J33603p6526p7986k2946P4717j33097p4928J11212
23761a10372p6869l9370L5133K05890j3804J0470Q372j44402r849K14940K97656
23750C77795J02046n2439j05658j97303j82758m5117L9273j28996k53206P27J7869
23739d27767J91213L90157J93497j17260J69636J09826j81637K3330j88065k73446
23729a10516k1298j99029j6679j1884J60042J17940k7906j76336J99847j27841
23719b13660j63051L7352L82186K09283k419k41614m6035R8667K28480P2459Q6139
23708D47787p4868j15112p0352J82193q8430k20499k2224J2235m4633q3364K51320
$$ plain form
23697 174053 380327 346874 170101 228919 450425 657391 580357 630422 667829 493075
23687 493075 465090 351540 -43557 -324724 -288249 -143817 168308 229129 256025 127506
23677 127506 37078 72856 272249 267775 5359 -277429 -85393 218637 353675 206147
23667 206147 10348 8401 -247152 -187464 76563 71200 -163372 -311787 -126447 48659
23657 48659 88171 -26377 -201424 -127802 -237137 -184960 5921 -72023 95597 55640 166117
23646 166117 236987 303578 302660 13972 -75524 46263 -28421 -118227 -48699 -275657 -434535
23635 -434535 -116316 196471 203047 -22980 -70847 72829 253467 149800 105336 265613
23625 265613 60263 -160193 -241936 -99271 -112772 -16248 -89081 -191922 -190910 -56670 7027
$$ packed form
23697A74053K06274l3453j76773N8818K21506K06966p7034N0065L7407j74754
23687D93075k7985j13550l95097k81167L6475J44432L12125O0821K6896j28519
23677A27506r0428L5778J99393m474k62416k82788J92036L04030J35038j47528
23667B06147j95799j947k55553N9688K64027n363k34572j48415J85340J75106
23657D8659L9512j14548j75047P3622j09335N2177J90881p7944J67620l9957J10477
23646A66117P0870O6591r18k88688q9496J21787p4684q9806O9528k26958j58878
23635d34535L18219L12787O576k26027m7867J43676J80638j03667m4464J60277
23625B65613k05350k20456q1743J42665j3501R6524p2833j02841J012J34240O3697
$$ plain form
23614 7027 -92275 -112121 -167317 -14433 112068 -153712 -118556 -284659 -517866 -356812 -347926
23603 -347926 -222716 145561 412678 242864 55599 -36367 -39712 195040 227960 297370
23593 297370 432475 241012 118268 286835 377791 314764 125832 -57865 -19812 -312200
23583 -312200 -370229 -373282 -399220 -199810 -216223 -309023 -491602 -457742 -552318 -226794 295474
23572 295474 176771 -7855 72259 282007 199739 -26017 -190224 -275759 -287263 -506133
23562 -506133 -228784 -92695 138135 482401 510137 -32230 -303634 -327718 -352310 -563375
23552 -563375 -401490 -145417 139474 235379 6086 -6023 -293814 -439449 -495270 -522864
23542 -522864 -556461 -539003 -354323 -293016 -358647 -300885 -303413 -358621 -459029 -504895 -568324
$$ packed form
23614G027r9302j9846n5196J52884J26501k65780L5156j66103k33207J61054Q886
23603c47926J25210L68277K67117j69814j87265r1966l345K34752L2920O9410
23593B97370J35105j91463j22744J68567R0956o3027j88932j83697L8053k92388
23583c12200n8029l053k5938J99410j6413r2800j82579L3860r4576L25524N22268
23572B95474j18703j84626Q0114K09748q2268k25756j64207q5535j1504k18870
23562e06133K77349J36089K30830L44266K7736n42367k71404k4084k4592k11065
23552e63375J61885K56073K84891R5905k29293j2109k87791j45635n5821k7594
23542e22864l3597J7458J84680O1307o5631N7762k528n5208j00408m5866o3429
$$ plain form
23531 -568324 -508649 -377208 -238256 -282804 -116955 130497 -17411 -4181 81357 90073 44439
23520 44439 77312 180707 20257 67560 143517 6285 -280325 -246228 -293206 -257247 -241249
23509 -241249 -406691 -423747 -462186 -238482 -349131 -658038 -834539 -775565 -608436 -455350
23499 -455350 -563877 -561615 -566906 -286355 13672 -55409 -120481 -68727 -19201 -60696 101095
23488 101095 127961 145927 189011 22381 -62465 -213435 -340280 -217663 -56136 61605
23478 61605 -36542 29207 215649 272233 231258 179618 162879 56944 -73205 -65296 -12253
23467 -12253 147281 356165 325054 -119533 -406484 -432675 -525284 -404279 -425270 -564055
23457 -564055 -407010 -236747 -108764 -13110 254457 206906 185495 129841 191413 158528 276609
$$ packed form
23531e68324N9675J31441J38952m4548J65849K47452j47908J3230Q5538Q716m5634
23520D4439L2873J03395j60450M7303P5957j37232k86610L4097m6978L5959J5998
23509b41249j65442j7056l8439K23704j10649l08907j76501N8974J67129J53086
23499d55350j08527K262n291K80551L00027o9081o5072N1754M9526m1495J61791
23488A01095K6866J7966M3084j66630q4846j50970j26845J22617J61527J17741
23478F1605r8147O5749J86442N6584m0975n1640j6739j05935j30149P909N3043
23467a2253J59534K08884l1111m44587k86951k6191r2609J21005k0991j38785
23457e64055J57045J70263J27983R5654K67567m7551k1411n5654O1572l2885J18081
$$ plain form
23446 276609 -326 -222208 -143456 -92035 2435 189968 266903 402462 557150 471324
23436 471324 105933 -1183 91425 2764 18545 248138 239453 363679 507921 555076 433567
23425 433567 175204 334834 255276 86855 37785 187201 191179 1208 -221817 -445273
23415 -445273 -307523 -59546 -94698 -186499 -55895 172140 330272 189159 12403 -41651
23405 -41651 -209212 -276233 -62831 -69122 -6956 146991 172843 217211 169541 178388 245732
23394 245732 300789 181085 118593 786 -156682 -335498 -301386 -305819 -299843 -211868 39972
23383 39972 -16261 20534 -15502 -29312 268544 336819 349952 325169 228331 154348 67641
23372 67641 -95788 -266208 -291109 -53609 -90154 -107728 28526 81546 255263 69877
$$ packed form
23446B76609k76935k21882P8752N1421R4470J87533P6935J35559J54688q5826
23436D71324l65391j07116R2608q8661J5781K29593q685J24226J44242M7155j21509
23425D33567k58363J59630p9558j68421m9070J49416L978j89971k23025k23456
23415d45273J37750K47977l5152r1801J30604K28035J58132j41113j76756n4054
23405d1651j67561o7021K13402o291O2166J53947K5852M4368m7670Q847O7344
23394B45732N5057j19704o2492j17807j57468j78816L4112m433N976Q7975K51840
23383C9972n6233L6795l6036j3810K97856O8275J3133k4783r6838p3983q6707
23372F7641j63429j70420k4901K37500l6545j7574J36254N3020J73717j85386
$$ plain form
23362 69877 -134605 -209465 -390442 -489513 -152820 -53840 88410 -54583 -75752 20952 69108
23351 69108 1175 -98777 -303190 -357323 -191612 -46947 130520 233142 -67588 -68424 172449
23340 172449 267624 115618 -145840 63159 238737 114421 153671 205277 160024 218772
23330 218772 244521 185939 146764 131064 273546 119868 32459 -66217 80296 232746 138773
23319 138773 113142 8284 22023 84803 -203697 -323722 -103253 -6792 18328 -142531
23309 -142531 -219925 -14773 247616 105961 -110327 -99394 -209567 -238685 -292828 -412230
23299 -412230 -426341 -546849 -567120 -347089 -328021 -383609 -233376 -20535 215977 153407
23289 153407 -135952 -224136 -46841 33296 -127160 -322489 -144694 -184934 -235999 -25737
$$ packed form
23362F9877k04482p4860j80977r9071L36693R8980J42250j42993k1169R6704M8156
23351F9108o7933r9952k04413n4133J65711J44665J77467J02622l00730q36K40873
23340A72449R5175j52006k61458K08999J75578j24316L9250N1606m5253N8748
23330B18772K5749n8582l9175j5700J42482j53678q7409r8676J46513J52450r3973
23319A38773k5631j04858J3739O2780k88500j20025K20469R6461K5120j60859
23309a42531p7394K05152K62389j41655k16288J0933j10173k9118n4143j19402
23299d12230j4111j20508k0271K20031J9068n5588J50233K12841K36512o2570
23289A53407k89359q8184J77295Q0137j60456j95329J77795m0240n1065K10262
$$ plain form
23279 -25737 151298 156721 231272 259037 50701 64318 92693 28206 56682 296405 490035
23268 490035 297081 115999 182668 83471 -33595 -34559 50607 136911 77949 170349 134455
23257 134455 210360 13939 -187831 -268604 -212286 -254055 -343178 -32621 -46474 -52784 51964
23246 51964 162348 251306 235301 143334 -79081 -262077 -255756 -132295 94422 123387 103038
23235 103038 315 -165844 -275859 -285081 -294693 -237906 -37476 -7681 196608 333420 259868
23224 259868 250924 397147 482961 400167 238398 147928 143012 65205 44036 152029 2874
23213 2874 -25304 35176 91943 -33573 -45043 242091 86320 -239945 -440658 -113202 -40751
23202 -40751 117101 51751 19261 -102817 -209166 137864 35769 18247 -65521 -245268
$$ packed form
23279b5737J77035N423P4551K7765k08336J3617K8375o4487K8476K39723J93630
23268D90035j92954j81082O6669r9197j17066r64Q5166Q6304n8962R2400l5894
23257A34455P5905j96421k01770q0773N6318m1769q9123L10557j3853o310J04748
23246E1964J10384Q8958j6005r1967k22415j82996O321J23461K26717K8965k0349
23235A03038j02723j66159j10015r222r612N6787K00430K9795K04289J36812p3552
23224B59868q944J46223Q5814q2794j61769r0470m916p7807k1169J07993j49155
23213B874k8178O0480N6767j25516j1470K87134j55771l26265k00713L27456P2451
23202d0751J57852o5350l2490j22078j06349L47030j02095j7522q3768j79747
$$ plain form
23192 -245268 -270269 -240042 -124852 -195139 -203279 -211907 -97592 -166487 -9989 238420 214233
23181 214233 267090 244811 221341 260773 202912 -152045 -388879 -460585 -385818 -175436 -76343
23170 -76343 -212543 33738 81798 -155023 -216351 -333244 -293529 -136189 -95541 -164105 -200783
23159 -200783 -423560 -430055 -248432 34078 193189 243810 237348 -26541 -250187 -135999
23149 -135999 -93974 -179737 -173364 -247884 -58947 -23961 -317512 -271644 -321047 -334858 -339361
23138 -339361 -135939 -389170 -448589 -470005 -654482 -504365 -411317 -206372 -165227 -167648 -330793
23127 -330793 43889 233476 362391 399343 421811 453016 271725 219789 189395 156273 71477
23116 71477 -254517 -241663 -148996 -121003 -41724 -98253 -312690 -547377 -448644 -370043 -374742
$$ packed form
23192b45268k5001L0227J15190p0287q140q628J14315o8895J56498K48409k4187
23181B14233N2857k2279k3470L9432n7861l54957k36834p1706P4767K10382R9093
23170g6343j36200K46281M8060k36821o1328j16893L9715J57340M0648o8564l6678
23159b00783k22777o495J81623K82510J59111N0621o462k63889k23646J14188
23149a35999M2025q5763O373p4520J88937L4986k93551M5868m9403j3811m503
23138c39361K03422k53231n9419k1416j84477J50117R3048K04945M1145k421j63145
23127c30793L74682J89587J28915L6952K2468L1205j81291n1936l0394l3122q4796
23116G1477l25994J2854R2667K7993P9279n6529k14437k34687R8733P8601m699
$$ plain form
23105 -374742 -404391 -143232 -173279 -367355 27795 240119 249919 189391 265273 260402 241477
23094 241477 247408 82192 -106251 -273810 -24435 55336 -175663 -108209 -155328 -261386
23084 -261386 -20401 118747 87929 87380 126613 12851 93061 69622 -142808 -58248 182680
23073 182680 14029 -129976 -125493 123062 149033 21427 23619 -158295 -288539 -252045 -155987
23062 -155987 -73840 154052 237753 300192 195412 97864 373153 370294 186764 -28110 38562
23051 38562 -104432 -221190 -59611 -153063 -248509 -386615 -361879 28698 -67965 -146088 -111503
23040 -111503 -282874 -390441 -275569 -205686 -212040 -76685 139308 52906 -145541 -238366
23030 -238366 -177131 -57217 -29970 -71341 -133405 -238071 -256983 -337862 -344286 -279000 -174199
$$ packed form
23105c74742k9649K61159l0047j94076L95150K12324R800o0528P5882m871j8925
23094B41477N931j65216j88443j67559K49375P9771k30999O7454m7119j06058
23084b61386K40985J39148l0818n49L9233j13762Q0210k3439k12430Q4560K40928
23073A82680j68651j44005M483K48555K5971j27606K192j81914j30244L6494R6058
23062a55987Q2147K27892Q3701O2439j04780r7548K75289k859j83530k14874O6672
23051C8562j42994j16758J61579r3452r5446j38106K4736L90577r6663p8123L4585
23040a11503j71371j07567J14872O9883o354J35355K15993q6402j98447r2825
23030b38366O1235J19914K7247m1371o2064j04666j8912q0879o424O5286J04801
$$ plain form
23019 -174199 -206928 -459879 -316013 -263529 -50983 63605 30033 -118115 -219609 -76555
23009 -76555 12789 -150721 -125947 -268418 -123271 -117405 -170142 -273765 -475736 -420724 -280181
22998 -280181 -146176 -51639 -179381 -113339 -122844 19435 138963 322883 282673 430984
22988 430984 358459 -44056 -119078 -68149 51814 91525 193860 248702 163914 236330 129549
22977 129549 -4023 66147 74707 -250555 -333885 -135120 -174691 23122 35411 -19911 21599
22966 21599 -49455 -15913 27961 303330 475416 380244 283631 208798 27997 -95700 125110
22955 125110 77848 -123892 -250584 -517938 -543096 -416162 -278588 -253387 -263423 -232747
22945 -232747 -351775 -386410 -382395 -215717 92481 112312 167953 323231 481324 266678
$$ packed form
23019a74199l2729k52951J43866N2484K12546J14588l3572j48148j01494J43054
23009g6555Q9344j63510K4774j42471J45147N866n2737j03623k01971N5012J40543
22998b80181J34005R4537j27742O6042r505J42279J19528J83920m0210J48311
22988D30984p2525m02515p5022N0929J19963L9711J02335N4842q4788P2416j06781
22977A29549j33572P0170Q560l25262q3330J98765l9571J97813J2289n5322M1510
22966B1599p1054L3542M3874K75369J72086r5172r6613p4833j80801j23697K20810
22955A25110m7262k01740j26692k67354k5158J26934J37574K5201j0036L0676
22945b32747j19028l4635M015J66678L08198J9831N5641J55278J58093k14646
$$ plain form
22935 266678 140895 32517 12991 -7400 134045 187951 174282 215480 119006 63414 -144934
22924 -144934 -135317 65014 80501 3462 59501 43185 -14797 79246 -185876 -215403 -64412
22913 -64412 -176650 -281276 -388837 -651010 -375266 -62837 73822 140112 248673 324357
22903 324357 247021 279519 206559 224015 334335 296419 213380 75808 -238163 -346215 -63262
22892 -63262 154159 390028 503755 563846 385254 312015 186222 58819 202410 -34837
22882 -34837 -49441 167221 10807 -13447 286517 241853 263094 152154 30951 130656 256623
22871 256623 107436 -30684 -88221 -75280 -61849 -71628 137370 263009 151911 -175766
22861 -175766 -271 113997 14377 -116055 -49402 -80596 -234139 -216721 -218272 -142559 -128183
$$ packed form
22935B66678j25783j08378j9526k0391J41445N3906j3669M1198r6474n5592k08348
22924a44934R617K00331J5487p7039N6039j6316n7982R4043k65122k9527J50991
22913f4412j12238j04626j07561k62173K75744L12429J36659O6290J08561P5684
22903C24357p7336L2498p2960J7456J10320l7916q3039j37572l13971j08052K82953
22892f3262K17421K35869J13727O0091j78592p3239j25793j27403J43591k37247
22882c4837j4604K16662j56414k4254K99964m4664K1241j10940j21203R9705J25967
22871B56623j49187j38120n7537J2941J3431r779K08998J25639j11098l27677
22861a75766J75495J14268r9620j30432O6653l1194j53543J7418j551P5713J4376
$$ plain form
22850 -128183 -83388 -14392 10664 -46065 13808 133524 195116 148545 -20402 -147542 -104840
22839 -104840 -148056 -38888 219857 539774 543510 290780 14434 -82816 -295820 -387790
22829 -387790 -197796 -149790 -148856 -314159 -222448 -152088 2863 -2049 -19241 -144608 74248
22818 74248 261545 353530 39267 -86677 6243 153780 285281 215600 -26398 -82049
22808 -82049 139902 130118 -87333 42113 54 -5350 -204235 -168272 -228819 -237209 -102724
22797 -102724 -194358 101942 37120 13351 -93563 -1267 -37262 -327936 -193535 -110619 899
22786 899 -141515 -181121 -20935 112772 177435 -29210 -315476 -359754 -217292 -31120 123198
22775 123198 238129 -53580 -241335 -107749 201811 218014 365224 226953 -45600 -33418
$$ packed form
22850a28183M4795O8996K5056n6729N9873J19716O1592m6571j68947j27140M2702
22839a04840m3216J09168K58745L19917L736k52730k76346r7250k13004r1970
22829c87790J89994M8006R34j65303R1711P0360J54951m912j7192j25367K18856
22818G4248J87297R1985l14263j25944R2920J47537J31501o9681k41998n5651
22808h2049K21951r784k17451J29446m2059n404j98885L5963o0547q390J34485
22797a02724r1634K96300o4822k3769j06914R2296l5995k90674J34401Q2916J11518
22786H99j42414l9606J60186J33707O4663k06645k86266m4278J42462J86172J54318
22775A23198J14931k91709j87755J33586L09560J6203J47210j38271k72553J2182
$$ plain form
22765 -33418 -29765 -19483 92885 101328 -32350 -139328 170205 361188 333919 316006 539540
22754 539540 440010 191076 88289 -59021 -4228 66108 53355 139859 98811 -109990 -202810
22743 -202810 -253387 -164689 -150635 -178111 132322 225058 128064 -13657 -116995 -75209 -28391
22732 -28391 -84226 35710 -2992 181431 93337 44218 153172 181242 190481 100825 30426
22721 30426 -8883 83592 179638 54428 43516 -28003 30283 -139214 -218903 -165927 132569
22710 132569 154248 57863 104145 92211 128112 -149925 -148088 -165639 -23988 40684 198060
22699 198060 227280 243770 143298 129533 363690 91421 -163395 -105643 379920 530411
22689 530411 237403 -88870 -322149 -417254 -409563 -284518 -57660 -161385 -51796 125916
$$ packed form
22765c3418L653J0282J12368Q443j33678j06978L09533J90983k7269j7913K23534
22754E39540r9530k48934j02787j47310N4793P0336j2753Q6504m1048k08801r2820
22743b02810n0577Q8698J4054k7476L10433R2736r6994j41721j03338M1786M6818
22732b8391n5835J19936l8702J84423q8094m9119J08954K8070R239q9656p0399
22721C0426l9309R2475R6046j25210j0912p1519N8286j69497p9689N2976K98496
22710A32569K1679r6385M6282j1934L5901k78037J837j7551J41651O4672J57376
22699A98060K9220J6490j00472j3765K34157k72269k54816N7752M85563J50491
22689E30411k93008l26273k33279r5105P691J25045K26858j03725J09589J77712
$$ plain form
22679 125916 -4891 -63599 -18014 105724 344435 240286 -88180 -394646 -216943 -43296
22669 -43296 175853 -14109 -323907 -560205 -476870 -193319 -269396 -453314 -432703 -116610
22659 -116610 79882 15790 -96470 61902 38785 -149988 -106542 195252 122650 9352
22649 9352 -61285 -1556 148041 357777 279532 274836 207990 220069 113699 -48602 -24091
22638 -24091 -42089 137341 114212 -69131 12621 64412 147807 -71842 -261993 -309685 -146256
22627 -146256 32796 29378 -303099 -378932 -162899 100644 263060 22719 133783 150556
22617 150556 132767 83036 319627 130175 16294 -17279 -12438 8854 8047 7730 -36613 56488
22605 56488 -25135 -271058 -233594 -46410 41174 27191 124722 350607 207660 -80343 59666
$$ packed form
22679A25916j30807n8708M5585J23738K38711j04149l28466l06466J77703J73647
22669d3296K19149j89962l09798k36298Q3335K83551p6077j83918K0611L16093
22659a16610J96492o4092j12260J58372k3117j88773M3446L01794p2602j13298
22649I352p0637N9729J49597K09736p8245m696o6846J2079j06370j62301K4511
22638b4091j7998J79430k3129j83343Q1752N1791Q3395k19649j90151m7692J63429
22627a46256J79052l418l32477p5833K16033K63543J62416k40341J11064J6773
22617A50556j7789m9731K36591j89452j13881l3573M841K1292q07l17m4343R3101
22605E6488q1623k45923L7464J87184Q7584j3983R7531K25885j42947k88003J40009
$$ plain form
22594 59666 4400 -24787 -212521 -231631 -147048 -241384 -111472 -229722 -305801 -142030 -216450
22583 -216450 -66542 48086 86773 21691 -27423 64064 10602 -11570 -7713 -51232 -191243
22572 -191243 -245741 -105421 -99801 -349681 -387013 -359908 -393855 -391435 -321327 -113500 68287
22561 68287 256517 289551 63114 102335 235539 51227 -121055 -48278 48574 -37834 -91815
22550 -91815 -175679 55543 158345 -190650 -200838 -135788 175704 192358 -37584 -145695
22540 -145695 -167842 -175858 -66478 15665 115407 165926 84834 -169893 -32355 -14561 -180325
22529 -180325 -286845 -251390 -329642 -112486 276692 298628 252477 152930 -83453 -178975 -116107
22518 -116107 6924 -122942 -187919 -506644 -645906 -319604 -228790 -198028 -280676 -293410
$$ packed form
22594E9666n5266k9187j87734j9110Q4583r4336J29912j18250p6079J63771p4420
22583b16450J49908J14628L8687o5082m9114R1487n3462k2172L857m3519j40011
22572a91243n4498J40320N620k49880l7332K7105l3947K420P0108K07827J81787
22561F8287J88230L3034k26437L9221J33204j84312j72282P2777R6852q6408n3981
22550i1815q3864K31222J02802l48995j0188O5050L11492J6654k29942j08111
22540a45695k2147q016J09380Q2143R9742N0519q1092k54727J37538J7794j65764
22529a80325j06520L5455p8252K17156L89178K1936m6151r9547k36383r5522O2868
22518a16107J23031j29866o4977l18725j39262L26302R0814L0762q2648j2734
$$ plain form
22508 -293410 -551947 -661130 -418473 -106912 245811 181485 45942 34418 -78245 -155896
22498 -155896 -77168 -134876 -51765 66740 194754 312762 280203 154344 324106 204583
22488 204583 -198364 -60304 8157 60118 205031 -38395 -258388 -319049 -179645 7550
22478 7550 51408 -58216 -125644 -37595 175608 412978 386822 230182 -115617 -217929 -127358
22467 -127358 1782 101562 360074 350329 339364 588109 503536 460448 412764 420614 246097
22456 246097 138379 134396 23149 -61645 -189302 -101087 -154656 -261994 -388613 -483994 -381520
22445 -381520 -222725 -245205 -331868 -162032 77146 60576 -164570 -151768 -305851 -439517
22435 -439517 -322790 -188423 15269 72542 38221 170079 74631 -54921 -159560 -91671
$$ packed form
22508b93410k58537j09183K42657L11561L52723o4326j35543j1524j12663p7651
22498a55896P8728n7708Q3111J18505J28014J18008l2559j25859J69762j19523
22488B04583m02947J38060O8461N1961J44913k43426k19993o0661J39404J87195
22478G550M3858j09624o7428Q8049K13203K37370k6156j56640l45799j02312R0571
22467a27358J29140R9780K58512r745j0965K48745q4573m3088m7684P850j74517
22456B46097j07718l983j11247q4794j27657Q8215n3569j07338j26619r5381J02474
22445c81520J58795k2480q6663J69836K39178j6570k25146J2802j54083j33666
22435d39517J16727J34367K03692N7273l4321J31858r5448j29552j04639O7889
$$ plain form
22425 -91671 -120017 -107097 -239998 -619038 -605438 -370054 -281720 -93137 -71037 -151956 -319008
22414 -319008 -330545 -359177 -374687 -564640 -294228 -61494 -73223 -127325 -138346 6499 -52812
22403 -52812 -36894 28018 34057 23404 46285 -197366 -357183 -158048 186486 210466 373965
22392 373965 21356 -282211 -42700 94925 -25866 -34556 -26110 -204323 -204308 -10911 50352
22381 50352 -56267 179845 217396 -134174 -12192 57133 -70617 -210336 635 308092
22371 308092 274001 104983 106622 60476 -825 58249 -39518 -214754 -183985 -69072 -6927
22360 -6927 191755 114506 -205911 -75876 90082 213351 223964 282053 346894 154751 -32592
22349 -32592 69456 96130 159115 183938 213817 -57063 -156860 -284151 -39058 114631 -56336
$$ packed form
22425i1671k8346J2920j32901l79040J3600K35384Q8334J88583K2100q0919j67052
22414c19008j1537k8632j5510j89953K70412K32734j1729n4102j1021J44845n9311
22403e2812J5918O4912O039j0653K2881k43651j59817J99135L44534K3980J63499
22392C73965l52609l03567K39511J37625j20791q690Q446j78213J5J93397O1263
22381E0352j06619K36112L7551l51570J21982O9325j27750j39719K10971L07457
22371C08092l4091j69018J639m6146o1301N9074r7767j75236L0769J14913O2145
22360f927J98682p7249l20417J30035J65958J23269J0613N8089O4841j92143j87343
22349c2592J02048K6674O2985K4823K9879k70880r9797j27291K45093J53689j70967
$$ plain form
22338 -56336 -11862 119769 25410 -339532 -156508 -168978 -266103 -175459 -246391 -125402 180015
22327 180015 82604 -177042 -232525 -39988 6159 91131 243287 199556 172849 15639 -237699
22316 -237699 -129885 42079 10274 82745 127458 -201747 -333446 -477640 -217031 218641
22306 218641 380099 327716 359776 386595 298491 45823 78456 233268 121323 -99471
22296 -99471 -186421 -204321 -120064 -333232 -278945 -167037 -61642 -85690 -270556 -404943 -490633
22285 -490633 -428633 -379212 -156482 80433 -129071 -57171 59654 -60792 -48142 -223034
22275 -223034 -382839 -313607 -63522 247037 190155 -40702 -65074 36896 -27436 -171740
22265 -171740 -184158 -269331 -192330 -160280 56000 202071 99569 182011 138203 367229 528456
$$ packed form
22338e6336M4474J31631r4359l64942J83024j2470r7125R0644p0932J20989L05417
22327A80015r7411k59646n5483J92537M6147Q4972J52156m3731k6707j57210k53338
22316b37699J07814J71964l1805P2471M4713l29205j31699j44194K60609M35672
22306B18641J61458n2383L2060K6819q8104k52668L2633J54812j11945k20794
22296i9471q6950j7900Q4257k13168N4287J11908J05395k4048j84866j34387q5690
22285d90633O2000M9421K22730K36915k09504P1900J16825j20446J2650j74892
22275b23034j59805O9232K50085L10559n6882k30857k4372J01970o4332j44304
22265a71740j2418q5173P7001L2050K16280J46071j02502Q2442m3808K29026J61227
$$ plain form
22254 528456 367295 320462 193527 171183 -8373 -22676 -58811 -142286 7170 -197815
22244 -197815 -221006 62846 181685 82028 -58167 -241224 -312762 -339721 -405090 -300173
22234 -300173 -160170 -283873 -185351 -136194 150773 -16151 -45053 110390 45690 -441058
22224 -441058 -415422 -38833 145000 247020 145381 -67424 -25423 -131228 -193283 -165662
22214 -165662 -519789 -289022 -24222 -11012 8309 112934 -154567 -301295 -366338 -186425
22204 -186425 -41902 23078 -260611 -295452 -30942 -94044 -104085 -63177 -182477 -127581 -55847
22193 -55847 51922 61639 -90590 -125470 -109125 -143389 -82125 -98999 7409 -149957 -228843
22182 -228843 -130733 -367456 -413502 -203990 -1164 161577 180790 10294 -174947 61680
$$ packed form
22254E28456j61161m6833j26935k2344j79556j4303l6135q3475J49456k04985
22244a97815k3191K83852J18839r9657j40195j83057p1538k6959o5369J04917
22234c00173J40003j23703R8522M9157K86967j66924k8902J55443o4700m86748
22224d41058K5636L76589J83833J02020j01639k12805M2001j05805o2055K7621
22214a65662l54127K30767K64800J3210J9321J04625k67501j46728o5043J79913
22204a86425J44523O4980k83689l4841K64510o3102j0041M0908j19300N4896P1734
22193e5847J07769R717j52229l4880J6345l4264O1264j6874J06408j57366p8886
22182b28843R8110k36723m6046K09512K02826J62741J9213j70496j85241K36627
$$ plain form
22172 61680 225367 -5669 -216062 -256718 -156898 -271123 -218621 -177943 -234023 -370514 -324409
22161 -324409 -561605 -479055 -224686 166580 316982 90325 19117 -43525 68921 -22545
22151 -22545 -473246 -579093 -499910 -276050 -242346 -387045 -348231 -446262 -360651 -108538 3653
22140 3653 -184015 -155938 -111546 -216251 -399114 -80002 114908 105867 46476 -126230 -251747
22129 -251747 -232077 -179667 928 -14196 -258351 -11587 165645 375105 572879 404800
22119 404800 288405 204898 190998 163466 41930 -10107 49021 89407 72150 341262 330551
22108 330551 153047 305103 233152 290112 482016 455695 242180 190059 106307 -75781
22098 -75781 22216 251605 397219 106559 -101759 82959 153504 151154 140715 323868 564376
$$ packed form
22172F1680J63687k31036k10393m0656R9820j14225N2502M0678n6080j36491M6105
22161c24409k37196Q2550K54369L91266J50402k26657p1208o2642J12446r1466
22151b2545m50701j05847P9183K23860L3704j44699L8814r8031Q5611K52113J12191
22140C653j87668K8077M4392j04705j82863L19112J94910r041n9391j72706j25517
22129b51747J9670N2410J80595j5124k44155K46764J77232K09460J97774j68079
22119D04800j16395q3507j3900k7532j21536n2037N9128M0386j7257K69112j0711
22108C30551j77504J52056p1951N6960J91904k6321k13515n2121q3752j82088
22098g5781R7997K29389J45614k90660k08318J84718P0545k350j0439J83153K40508
$$ plain form
22087 564376 499841 483948 419397 60731 6211 -55032 -40322 -49832 105603 236395 183100
22076 183100 -178565 -462774 -390727 -368883 -400672 -138214 -37753 13631 -155748 -247567
22066 -247567 -421160 -247264 -8063 90594 -25941 -71031 -141228 -48040 -20918 -9755 19803
22055 19803 -45238 -39092 -80089 -141381 -91276 -152823 39995 265698 107023 -114321 -126980
22044 -126980 56256 127561 138470 69593 173070 -130652 -361272 -412015 -502981 -517424 -261313
22033 -261313 -152136 180574 293815 188765 -134415 -207122 -335818 -241176 -215856 -385582
22023 -385582 -418189 -102133 185157 241984 -26154 -139540 72846 179366 9044 383775
22013 383775 529754 260801 129285 -68212 -149145 -69426 -261064 -161549 -142924 -267032
$$ packed form
22087E64376o4535j5893o4551l58666n4520o1243J4710r510J55435J30792n3295
22076A83100l61665k84209P2047K1844l1789K62458J00461N1384j69379r1819
22066b47567j73593J73896K39201R8657j16535m5090p0197R3188K7122J1163K9558
22055A9803o5041O146m0997o1292N0105o1547J92818K25703j58675k21344j2659
22044a26980J83236P1305J0909o8877J03477l03722k30620n0743r0966j4443K56111
22033b61313J09177L32710J13241j05050l23180p2707j28696R4642K5320j69726
22023c85582l2607L16056K87290N6827k68138j13386K12386J06520j70322L74731
22013C83775J45979k68953j31516j97497q0933P9719j91638R9515J8625j24108
$$ plain form
22003 -267032 -288259 -75200 -80923 -152779 -248873 -366619 -415085 -397584 -255289 -106388 -88211
21992 -88211 -140984 -138432 -191851 -13447 160085 120988 5933 -195863 -195305 -288857 -521386
21981 -521386 -434597 -271168 -213466 -168875 -252606 -157173 -269239 -301141 -373885 -338079 -185248
21970 -185248 -158254 -279782 -322329 19658 206362 114856 -43015 -134855 -247543 -141755
21960 -141755 119979 232649 205231 42958 -74628 18692 -20846 -164063 -259302 -369472
21950 -369472 -575414 -490982 -184867 -33226 -304187 -294760 -164750 33774 54467 24064
21940 24064 -112381 -73917 114925 161613 68451 -88713 -193124 -267284 -31859 234195
21930 234195 378724 250240 106339 225059 282957 288009 356157 390773 350897 319777 137711
$$ packed form
22003b67032k1227K13059n723p1856r6094j17746m8466J7501J42295J48901J8177
21992h8211n2773K552n3419J78404J73532l9097j15055k01796N58r3552k32529
21981e21386Q6789J63429N7702M4591q3731R5433j12066l1902p2744L5806J52831
21970a85248K6994j21528m2547L41987J86704r1506j57871r1840j12688J05788
21960a41755K61734J12670k7418j62273j17586R3320l9538j43217r5239j10170
21950c69472k05942Q4432L06115J51641k70961R427J30010J98524K0693l0403
21940B4064j36445L8464J88842M6688r3162j57164j04411p4160K35425K66054
21930B34195J44529j28484j43901J18720N7898N052O8148L4616l9876l1120j82066
$$ plain form
21919 137711 65943 -171045 -235621 -194174 -58672 -26910 116043 23641 -314265 -451028
21909 -451028 -103426 213446 436976 483178 476769 308826 -65895 -131497 -85580 -199162
21899 -199162 -130320 94165 222067 126634 -131984 -152705 -200831 -302338 -154099 146781
21889 146781 -119879 -381146 -326508 -189859 -223605 -79041 -30473 -62121 -79918 3176 -83873
21878 -83873 131711 127461 23246 280467 8424 -194427 -245850 -150048 -217529 -283534 -514911
21867 -514911 -389914 -170344 -114975 -47355 158773 217637 25986 -49037 -164882 -167730 -103484
21856 -103484 57019 131146 -120602 -303777 -454257 -424886 -161851 -181905 -212420 -78758
21846 -78758 -279561 -532373 -384803 -221560 -125507 -87155 -113983 -109710 -37204 24933 -18364
$$ packed form
21919A37711p1768k36988o4576M1447J35502L1762J42953r2402l37906j36763
21909d51028L47602L16872K23530M6202o409j67943l74721o5602M5917j13582
21899a99162O8842K24485J27902r5433k58618k0721m8126j01507J48239L00880
21889A46781k66660k61267N4638J36649l3746J44564M8568l1648j7797Q3094q7049
21878h3873K15584m250j04215K57221k72043k02851n1423R5802o7481o6005k31377
21867e14911J24997K19570N5369O7620K06128N8864j91651p5023j15845k848O4246
21856a03484J60503P4127k51748j83175j50480K9371K63035k0054l0515J33662
21846g8758k00803k52812J47570J63243R6053L8352k6828M273P2506O2137m3297
$$ plain form
21835 -18364 -89856 -49313 135917 36625 -92963 -159326 -276130 -268024 -121425 -29639 -36432
21824 -36432 -104884 -135193 -257377 -389585 -277435 -169126 -137936 -339973 -236620 -161357
21814 -161357 -259691 -354229 -271338 -295493 -192721 -252300 -78892 24505 13881 182910 304273
21803 304273 157968 76875 -9407 -150938 -85988 -3205 58663 263741 187230 17822 114512
21792 114512 289874 171207 -62612 -9031 -222098 -139842 -3863 -179752 -79534 225745
21782 225745 24961 -532776 -582746 -446344 -485784 -326443 -315723 -150602 169938 323740
21772 323740 484743 391664 191646 70883 -25522 -104516 -141718 -197893 -331854 -204220
21762 -204220 -103152 36740 101470 58083 -64765 -160659 41760 44300 -99858 -150365 -158505
$$ packed form
21835a8364p1492M0543J85230r9292j29588o6363j16804Q106J46599R1786o793
21824c6432o8452l0309j22184j32208J12150J08309L1190k02037J03353P5263
21814a61357r8334r4538Q2891k4155J02772n9579J73408J03397j0624J69029J21363
21803C04273j46305q1093q6282j41531O4950Q2783O1868K05078p6511j69408R6690
21792A14512J75362j18667k33819N3581k13067Q2256J35979j75889J00218L05279
21782B25745k00784n57737m9970J36402l9440J59341J0720J65121L20540J53802
21772C23740J61003r3079k00018j20763r6405p8994l7202n6175j33961J27634
21762b04220J01068J39892O4730m3387j22848r5894K02419K540j44158n0507q140
$$ plain form
21751 -158505 -101570 110847 176599 23338 -245532 -183198 -135102 85400 113373 30567 31229
21740 31229 124189 221445 280059 434999 365066 194892 199424 165296 163608 -44468 106328
21729 106328 98202 -161199 -221512 -282590 -155876 26500 -140479 -253357 -273086 -93186
21719 -93186 53864 54205 -240593 -476696 -432279 -280201 -59475 183144 183254 -68178 -25724
21708 -25724 127271 111933 65970 -218554 -353306 -354945 -250048 -205693 -187333 -91120 -175860
21697 -175860 -194843 -308431 -278957 7688 -61552 -307132 -211110 -178595 -147109 -257322 -356428
21686 -356428 -238587 -211223 -143779 160565 158822 -82441 -108027 -42962 -2757 -60191 -23431
21675 -23431 105868 126159 -43030 -82353 -133970 -77530 37125 174477 252144 159411 -1037
$$ packed form
21751a58505N6935K12417O5752j53261k68870O2334M8096K20502K7973q2806O62
21740C1229R2960R7256N8614J54940o9933j70174M532l4128j688k08076J50796
21729A06328q126k59401o0313o1078J26714J82376j66979j12878j9729J79900
21719i3186J47050L41k94798k36103M4417J52078K20726K42619J10k51432M2454
21708b5724J52995j5338m5963k84524j34752j639J04897M4355J8360R6213q4740
21697a75860j8983j13588K9474K86645o9240k45580R6022L2515L1486j10213r9106
21686c56428J17841K7364O7444L04344j743k41263k5586O5065M0205n7434L6760
21675b3431J29299K0291j69189l9323n1617N6440J14655J37352P7667r2733j60448
$$ plain form
21664 -1037 19025 -118136 -365696 -172163 78516 162475 12637 114115 239669 -3815
21654 -3815 -172961 -113444 -171855 -155176 -171646 -64597 275556 336467 360691 610567 539458
21643 539458 123964 15907 270062 490312 237218 126368 -64784 -92943 -47393 -100561
21633 -100561 -127216 37432 -44571 -289436 -346815 -40125 46857 173475 98966 139992 93766
21622 93766 -79369 39140 195049 190410 17967 76247 156922 249750 74416 -68414 19395
21611 19395 139481 94570 207399 120076 19579 -210025 -204479 -141769 -28783 -65935 -69007
21600 -69007 -233014 -346646 -539013 -454869 -383089 -223798 -210860 -140847 8451 45636 82194
21589 82194 55533 215697 261774 185951 187168 321524 133664 123847 92851 55710 100916
$$ packed form
21664a037K0062j37161k47560J93533K50679Q3959j49838J01478J25554k43484
21654c815j69146N9517n8411J6679j6470J07049L40153O0911K4224K49876p1109
21643E39458m15494j08057K54155K20250k53094j10850j91152k8159M5550n3168
21633a00561k6655J64648q2003k44865n7379L06690Q6982J26618p4509M1026m6226
21622I3766j73135J18509J55909m639j72443N8280Q0675R2828j75334j42830Q7809
21611A9395J20086m4911J12829q7323j00497k29604N546O2710J12986l7152l072
21600f9007j64007j13632j92367Q4144P1780J59291J2938P0013J49298L7185L6558
21589H2194k6661J60164M6077p5823J217J34356j87860r817l0996l7141M5206
$$ plain form
21578 100916 48546 -108546 -72549 -91097 -45054 -208332 -551196 -595169 -346703 -318100 -95812
21567 -95812 -43209 -96392 -37734 229823 195169 254911 237892 9437 -309298 -468273 -470675
21556 -470675 -506199 -465951 -230993 -32022 128556 261303 -43560 -217025 -436708 -557218
21546 -557218 -439602 -189642 -223818 -58055 -119 63883 11447 146708 158532 173483 229157
21535 229157 212792 296224 312086 118153 9527 151329 20194 225250 279717 69732
21525 69732 -75656 -201486 83206 51485 297336 301042 19155 -280294 -361185 -111328
21515 -111328 55997 215444 124388 172464 298591 77634 -28333 13975 91674 -48287
21505 -48287 -131344 113965 212337 94205 -180174 -288104 -213509 -210392 -389177 -326647 -225663
$$ packed form
21578A00916n2370j57092L5997j8548M6043j63278l42864m3973K48466K8603K22288
21567i5812N2603n3183N8658K67557l4654N9742j7019k28455l18735j58975k402
21556d70675l5524M0248K34958J98971J60578J32747l04863j73465k19683j20510
21546e57218J17616K49960l4176J65763N7936O4002n2436J35261J1824J4951N5674
21535B29157j6365Q3432J5862j93933j08626J41802j31135K05056N4467k09985
21525F9732j45388j25830K84692l1721K45851L706k81887k99449q0891K49857
21515a11328J67325J59447r1056M8076J26127k20957j05967M2308P7699j39961
21505d8287q3057K45309R8372j18132k74379j07930P4595L117j78785O2530J00984
$$ plain form
21494 -225663 -214049 -18253 70323 -194016 -198262 1860 167765 278238 256744 77396
21484 77396 -159253 -151241 4480 89962 258446 109260 34209 134631 172963 220493 270261
21473 270261 211193 -34068 -278092 -147667 -224818 -455289 -512418 -499355 -552745 -250208
21463 -250208 134757 195432 180558 140602 65744 -287230 -279613 -84039 -68733 -130116 -278923
21452 -278923 -229122 -218928 -296667 -343773 -360097 -208907 28609 181036 81275 37748 -33930
21441 -33930 4528 -131812 -401384 -298020 -47414 47449 -335474 -478301 -336020 -17537
21431 -17537 139213 76256 117666 130970 72387 -71961 -198022 -8321 78681 143496 177423
21420 177423 108284 -110023 -103544 -213264 -188540 -178688 -275512 -336667 -80614 -88610 -508490
$$ packed form
21494b25663J1614J95796Q8576k64339m246K00122J65905J10473k1494j79348
21484G7396k36649Q012J55721Q5482J68484j49186p5051J00422L8332M7530M9768
21473B70261n9068k45261k44024J30425p7151k30471n7129J3063n3390L02537
21463b50208L84965O0675j4874l9956p4858l52974P617J95574J5306o1383j48807
21452b78923M9801J0194p7739m7106j6324J51190K37516J52427r9761m3527p1678
21441c3930L8458j36340k69572J03364K50606R4863l82923j42827J42281L18483
21431a7537J56750o2957M1410J3304n8583j44348j26061J89701Q7002O4815L3927
21420A77423o9139k18307O479j09720K4724R852r6824o1155K56053p996m19880
$$ plain form
21409 -508490 -444886 -277057 -282244 -320924 -322081 -242182 -231527 -450310 -131953 284462 308255
21398 308255 -76 69819 -14163 59642 52917 -263042 -287275 -384523 -370408 -132796 -167850
21387 -167850 -81350 -96039 -80467 -70192 151514 507839 582086 308501 151784 30510
21377 30510 -62153 -58520 18958 41229 -200263 -298769 -87223 16372 31344 54315 22592
21366 22592 67057 48361 52699 281777 507765 494612 445030 290152 -18367 -134889 -89806
21355 -89806 113744 275638 189823 160021 396893 373895 44214 -29446 -120141 -297674 -256270
21344 -256270 -217939 -152938 -91853 104924 754 -188441 -147896 90562 64130 260635
21334 260635 45298 -193169 -313804 -223345 -330576 -179393 -46154 -144769 -365900 -102489
$$ packed form
21409e08490O3604J67829n187l8680j157P9899J0655k18783L18357M16415K3793
21398C08255l08331O9895q3982P3805o725l15959k4233r7248J4115K37612l5054
21387a67850Q6500j4689J5572J0275K21706L56325P4247k73585j56717j21274
21377C0510r2663L633P7478K2271k41492r8506K11546J03595J4972K2971l1723
21366B2592M4465j8696M338K29078K25988j3153m9582j54878l08519j16522M5083
21355h9806K03550J61894q5815k9802K36872k2998l29681p3660r0695j77533M1404
21344b56270L8331O5001O1085J96777j04170j89195M0545K38458k6432J96505
21334B60635k15337k38467j20635R0459j07231J51183J33239r8615k21131K63411
$$ plain form
21324 -102489 -122015 -83246 43173 94778 111602 45739 143690 101619 133647 -130550 77609
21313 77609 141881 188214 199238 18326 123145 123247 294273 351805 44178 -44942 -233934
21302 -233934 -69407 50045 99597 360454 351995 146931 77702 -169769 -204599 -193770 -118321
21291 -118321 -187306 -295761 -284617 -228729 -182793 214034 522437 648951 664094 598766 453250
21280 453250 121884 -76011 19196 134925 29084 -195245 -426022 -191572 -81698 -110293
21270 -110293 -327578 -101624 99034 76317 227067 367676 121608 -25591 129305 15580
21260 15580 84625 38391 28516 -48842 -62543 118403 181468 391320 390065 245921 173720
21249 173720 258346 102136 157578 270538 85099 195549 334257 217407 123347 -103072
$$ packed form
21324a02489j9526L8769J26419N1605J6824o5863R7951m2071L2028k64197K08159
21313G7609O4272M6333J1024j80912J04819J02J71026N7532l07627q9120j88992
21302b33934J64527J19452M9552K60857q459k05064o9229k47471l4830J0829P5449
21291a18321o8985j08455J1144N5888M5936L96827L08403J26514J5143o5328j45516
21280D53250l31366j97895R5207J15729j05841k24329k30777K34450J09874k8595
21270a10293k17285K25954K00658k2717J50750J40609k46068j47199J54896j13725
21260A5580O9045m6234r875p7358j3701J80946O3065K09852j255j44144p2201
21249A73720Q4626j56210N5442J12960j85439J10450J38708j16850r4060k26419
$$ plain form
21239 -103072 -82772 82183 45825 -29616 -301471 -487079 -309364 99251 328358 138507
21229 138507 -128445 -176532 76374 79892 63268 24436 -186524 -297648 -181154 -285938
21219 -285938 -213872 -168469 -74116 28274 -283361 -92740 -19525 22395 -3346 -43826 -103379
21208 -103379 -14251 126141 173031 168869 455666 165074 -138495 -158682 -221327 -7763 -30617
21197 -30617 -93462 -17995 10738 57580 -70421 -129864 -74717 -12090 -14714 -275445 -256356
21186 -256356 -65053 98545 95354 -78678 -268218 -210971 -186402 -205666 -268595 -9842 163809
21175 163809 52964 207494 234041 287259 97968 -139122 -72993 -107537 -77210 49406
21165 49406 95258 50220 -299831 -409161 -240488 -460574 -361559 -60928 -96428 9477
$$ packed form
21239a03072K0300J64955l6358p5441k71855j85608J77715M08615K29107j89851
21229A38507k66952m8087K52906L518j6624l8832k10960j11124J16494j04784
21219b85938P2066M5403R4353J02390l11635J90621P3215M1920k5741m0480n9553
21208a03379Q9128J40392M6890m162K86797k90592l03569k0187o2645K13564k2854
21197c0617o2845P5467K8733M6842j28001n9443N5147O2627k624k60731J9089
21186b56356J91303J63598l191j74032j89540N7247K4569j9264o2929K58753J73651
21175A63809j10845J54530K6547N3218j89291k37090O6129l4544L0327J26616
21165D9406M5852m5038l50051j09330J68673k20086R9015L00631l5500J05905
$$ plain form
21155 9477 94752 181857 78685 -271400 -435418 -286254 -135379 -325453 -419348 -208303
21145 -208303 -370760 -338249 37747 149191 52494 -61577 -97736 -128318 53677 143496
21135 143496 198400 154014 73228 -92389 -354638 -546697 -459159 -298824 -96435 -85484
21125 -85484 -232127 -147579 -173393 -118136 102592 194491 164254 227724 316759 407375 402358
21114 402358 365214 217809 249708 326008 88733 97767 142087 282865 436499 514905 318427
21103 318427 168047 42810 -19480 116629 94981 -174812 -228260 -133363 118573 -62817
21093 -62817 -140464 174238 30117 -329218 -455522 -259431 20141 -139026 -55579 85753
21083 85753 5176 152396 283741 275044 12621 -154058 -155201 -36601 1229 -61582 -75215
$$ packed form
21155I477Q5275Q7105j03172l50085j64018J49164J50875j90074r3895K11045
21145b08303j62457L2511L75996J11444r6697j14071l6159l0582J81995Q9819
21135A43496N4904m4386q0786j65617k62249j92059Q7538J60335K02389J0951
21125h5484j46643Q4548k5814N5257K20728R1899l0237O3470Q9035R0616n017
21114D02358l7144j47405L1899P6300k37275R034M4320J40778J53634P8406j96478
21103C18427j50380j25237o2290J36109k1648k69793n3448R4897K51936j81390
21093f2817p7647L14702j44121l59335j26304J96091K79572j59167Q3447J41332
21083H5753q0577J47220J31345q697k62423j66679j143J18600L7830o2811j3633
$$ plain form
21072 -75215 -57882 -128501 -12728 -39260 160508 230757 192881 183278 166766 84541 26187
21061 26187 -24350 47735 -45019 -157388 -54583 -83215 -57808 -12502 229441 152203 213869
21050 213869 268353 123146 47080 91562 246211 290593 253525 181205 74415 50989 120474
21039 120474 -52542 -228509 -380797 -287630 -108296 -174687 -258239 -132184 58956 -169993
21029 -169993 -438504 -365633 -326594 -306845 -352045 -425019 -405832 -265506 -220936 -200682 -43655
21018 -43655 -51406 -208697 -250395 -342898 -397559 -137154 33686 -74271 -218002 -169149 -215160
21007 -215160 -231157 -71254 102130 151625 124404 51455 -208280 -375143 -408953 -232366
20997 -232366 -76516 138706 33626 31347 44856 -29350 -168697 -245300 -242056 -24536 -2321
$$ packed form
21072g5215J7333p0619J15773k6532J99768P0249l7876r603j6512q2225n8354
21061B6187n0537P2085r2754j12369J02805k8632K5407M5306K41943p7238O1666
21050B13869N4484j45207p6066M4482J54649M4382l7068p2320j06790k3426O9485
21039A20474j73016j75967j52288R3167J79334o6391q3552J26055J91140k28949
21029a69993k68511P2871L9039J9749m5200p2974J9187J40326M4570K0254J57027
21018d3655p751j57291m1698r2503n4661K60405J70840j07957j43731M8853m6011
21007b15160j5997J59903J73384M9495k7221p2949k59735j66863l3810J76587
20997b32366J55850K15222j05080k279J3509p4206j39347p6603L244K17520K2215
$$ plain form
20986 -2321 182184 210207 199618 86493 37541 19944 35807 -129338 -15847 24554 -2236
20975 -2236 12990 -40001 -159824 -175132 -15029 -228008 -244175 -95860 -277219 -188195 -185758
20964 -185758 -28639 -85703 -42044 396 282740 371683 227728 43139 -73277 -364402
20954 -364402 -703843 -505355 -447742 -383878 -224519 -76863 -307350 -586832 -587053 -597797 -380755
20943 -380755 -302325 -200058 68751 -12941 -47769 -93971 -265621 -244435 -56961 -159815
20933 -159815 -189317 64397 58374 -124249 -93072 10620 -72522 -315741 -371599 -463186 -242159
20922 -242159 -167746 -121632 -29320 -18857 113518 -136447 -193477 -119522 113336 231805 200407
20911 200407 66379 -21599 64752 87702 21443 -85529 -212015 -327251 -327748 -211035 -124503
$$ packed form
20986b321J84505K8023j0589j13125m8952j7597J5863j65145J13491M0401k6790
20975b236J5226n2991j19823j5308J60103k12979j6167J48315j81359Q9024K437
20964a85758J57119n7064M3659M2440K82344Q8943j43955j84589j16416k91125
20954c64402l39441J98488N7613O3864J59359J47656k30487k79482k21j0744K17042
20943c80755P8430J02267K68809q1692l4828m6202j71650K1186J87474j02854
20933a59815k9502K53714o023j82623L1177J03692q3142k43219n5858r1587K21027
20922b42159P4413M6114R2312J0463J32375k49965n7030P3955K32858J18469l1398
20911B00407j34028q7978Q6351K2950o6259j06972j26486j15236m97J16713Q6532
$$ plain form
20900 -124503 -28025 110580 242073 30470 164943 224824 60658 245123 105217 45081
20890 45081 114775 48045 -39533 -326798 -545706 -395618 -592653 -562483 -490439 -519611 -461464
20879 -461464 -366788 -230497 1372 3597 139538 -49713 -364219 -724895 -759361 -708238
20869 -708238 -714822 -585189 -382972 -324714 -268981 -150089 -168044 -234230 49665 54836 -27285
20858 -27285 163864 205643 330611 223835 -6143 41201 25498 -101842 -374879 -190446
20848 -190446 -40532 -313470 -483912 -431991 -385005 -237925 -164188 -217673 -310532 -256887 -119407
20837 -119407 199718 334233 449396 460963 342141 333312 255052 131058 29870 46415
20827 46415 70984 -20483 31215 -5157 -45202 -124417 -49633 34685 144350 208086 -89762
$$ packed form
20900a24503R6478J38605J31493k11603J34473N9881j64166J84465j39906o0136
20890D5081O9694o6730q7578k87265k18908J50088j97035L0170P2044k9172N8147
20879d61464R4676J36291K31869K225J35941j89251l14506l60676l4466N1123
20869g08238o584J29633K02217N8258N5733J18892j7955o6186K83895N171q2121
20858b7285J91149M1779J24968j06776k29978M7344j5703j27340k73037J84433
20848a90446J49914k72938j70442N1921M6986J47080P3737n3485r2859N3645J37480
20837a19407L19125J34515J15163J1567j18822q829p8260j23994j01188J6545
20827D6415K4569r1467N1698l6372m0045p9215P4784Q4318J09665O3736k97848
$$ plain form
20816 -89762 -335169 -248822 -123514 212537 222079 191268 261835 295600 78687 -43358 -70823
20805 -70823 171516 449697 583828 832650 1023571 1597455 2084404 2198944 2107967 1669319
20795 1669319 1402048 1008999 659773 641943 397223 257711 167102 135562 517671 655771
20785 655771 393063 336768 259411 162281 154017 -9452 -161431 -214950 -85787 -74684 -81172
20774 -81172 998 224028 218513 36049 -120835 -104951 102589 67980 -60402 -52481 -106731
20763 -106731 -78814 20222 -5487 -137707 -72607 35987 92123 82265 59080 39978 -10249
20752 -10249 -313928 -283163 -180290 -181319 -367383 -322860 -116054 153944 441817 476272 441647
20741 441647 129518 -304116 -528829 -349537 -95910 -163781 -156562 36747 -231357 -399756
$$ packed form
20816h9762k45407Q6347J25308L36051R542l0811P0567L3765k16913j22045k7465
20805g0823K42339K78181J34131K48822J90921N73884M86949J14540r0977m38648
20795A669319k67271l93049l49226j7830k44720j39512r0609l1540L82109J38100
20785F55771k62708n6295p7357r7130q264j63469j51979n3519J29163J1103o488
20774h1172Q2170K23030n515j82464j56884J5884K07540l4609j28382P921n4250
20763a06731K7917R9036k5709j32220O5100J08594N6136r858k3185j9102n0227
20752a0249l03679L0765J02873j029j86064M4523K06806K69998K87873L4455l4625
20741D41647l12129m33634k24713J79292K53627o7871P219J93309k68104j68399
$$ plain form
20731 -399756 -184232 34393 8908 43903 -170538 -140101 -183030 -372779 -497001 -717482
20721 -717482 -628033 -259962 -107403 -125251 -157846 3916 -194097 -310239 -308071 -300205 -427291
20710 -427291 -264689 -46051 -42298 -88282 -188556 -119649 -54112 -178319 -36859 94817
20700 94817 188155 45406 -197417 -164759 -218570 -452228 -435697 -193736 -253462 -181270 152208
20689 152208 204289 -73742 -194137 -220256 -249257 -57579 -79886 -192357 -153119 -16561
20679 -16561 147555 68877 149401 175711 -4649 -86422 152932 101172 64580 -78789 -76568
20668 -76568 64874 62553 -45724 36874 275736 237242 301910 112480 -73851 -14666 -115153
20657 -115153 16933 307324 109891 -158587 -258286 -163911 -282233 -56963 277795 54370
$$ packed form
20731c99756K15524K18625k5485L4995k14441L0437m2929j89749j24222k20481
20721g17482Q9449L68071J52559j7848l2595J61762j98013j16142K168P866j27086
20710d27291J62602K18638L753m5984j00274O8907O5537j24207J41460J31676
20700I4817R3338j42749k42823L2658n3811k33658J6531K41961n9726P2192L33478
20689A52208N2081k78031j20395k6119k9001J91678k2307j12471L9238J36558
20679a6561J64116p8678Q0524K6310j80360q1773K39354n1760l6592j43369K221
20668g6568J41442k321j08277Q2598K38862l8494O4668j89430j86331N9185j00487
20657a15153J32086K90391j97433k68478r9699R4375j18322K25270L34758k23425
$$ plain form
20647 54370 98162 176448 93190 7900 98228 228314 250206 -60123 -413171 -517745 -370834
20636 -370834 -174974 -122788 4001 132497 312702 187510 -75741 -85534 -167418 -155962
20626 -155962 -55344 88835 3668 119284 -211698 -16314 -23660 81289 297857 257265
20616 257265 40715 -215588 -448364 -469134 -336431 -395921 -449338 -493937 -233329 -91935
20606 -91935 66215 99747 12622 -218722 -389939 -579694 -445910 -452130 -417284 -277567 -9383
20595 -9383 -28818 -132870 -172406 60059 282052 358833 238042 232689 26816 -7992 -110631
20584 -110631 -99412 -281024 -273752 -151271 -288191 -312522 -264367 -108012 -236018 -178369 -184205
20573 -184205 -344741 -146401 -13997 -35768 80191 62966 -277632 -458762 -179960 -96436
$$ packed form
20647E4370M3792P8286q3258q5290R0328J30086K1892l10329l53048j04574J46911
20636c70834J95860N2186J26789J28496J80205j25192k63251r793q1884J1456
20626a55962J00618J44179q5167J15616l30982J95384p346J04949K16568m0592
20616B57265k16550k56303k32776k0770J32703n9490n3417m4599K60608J41394
20606i1935J58150L3532q7125k31344j71217j89755J33784o220L4846J39717K68184
20595i383j9435j04052l9536K32465K21993P6781j20791n353k05873l4808j02639
20584a10631J1219j81612P272J22481j36920k4331M8155J56355j28006N7649n836
20573a84205j60536J98340J32404k1771J15959j7225l40598j81130K78802Q3524
$$ plain form
20563 -96436 -27477 219166 426580 302920 162733 242691 266972 130212 262789 161407
20553 161407 180670 86701 -25855 -267 -107000 -222372 -172605 -47709 146030 144529 274662
20542 274662 251754 -67482 -62411 -22157 146215 103018 -69612 -171731 -84768 5993 23003
20531 23003 -237163 -218625 -64217 -55197 24726 -27257 73141 32712 -66586 32695 -61823
20520 -61823 40319 325035 414189 226743 21551 -75064 16549 35837 121373 -140944 -41150
20509 -41150 152294 202132 293928 154770 137094 28195 82960 -96656 -121655 -354288 -261480
20498 -261480 -501029 -594253 -452185 -427219 -250490 -264177 -210343 -184824 -241424 -309259 -406188
20487 -406188 -194666 240352 232797 -3491 -18693 -29766 111098 -104308 -161527 81581
$$ packed form
20563i6436O8959K46643K07414j23660j40187P9958K4281j36760J32577j01382
20553A61407J9263r3969j12556K5588j06733j15372M9767J24896J93739j501J30133
20542B74662k2908l19236N071M0254J68372m3197j72630j02119Q6963R0761J7010
20531B3003k60166J8538J54408R020P9923n1983J00398m0429r9298R9281r4518
20520f1823J02142K84716Q9154j87446k05192r6615R1613J9288Q5536k62317R9794
20509d1150J93444M9838R1796j39158j7676j08899N4765j79616k4999k32633R2808
20498b61480k39549r3224J42068K4966J76729j3687N3834K5519n6600o7835r6929
20487d06188K11522M35018p555k36288j5202j1073J40864k15406n7219K43108
$$ plain form
20477 81581 190278 170369 95156 6911 -206644 -280735 -90564 -48998 15875 11166 -35617
20466 -35617 51917 251445 328915 362432 408550 114355 136215 152217 243323 285134 293841
20455 293841 315208 409114 375909 400389 496235 367023 229245 313767 214082 249789 171184
20444 171184 48888 -16167 -51406 -53825 -99222 54808 285072 363091 217417 180172 2978
20433 2978 -52888 -123740 -2170 49350 93476 229936 394247 429202 268800 14138 97483
20422 97483 76349 -8411 -134080 -80141 -49523 -112236 -265876 -147003 -155813 32296 40961
20411 40961 -64464 -15835 -63259 -119708 108971 473469 472472 187919 16526 177389 -80986
20400 -80986 -243206 -253829 -196210 -311637 -305908 -323767 105887 328603 395446 365429 131972
$$ packed form
20477H1581J08697j9909p5213q8245k13555p4091J90171M1566O4873m709m6783
20466c5617Q7534J99528P7470L3517M6118k94195K1860J6002R1106M1811Q707
20455B93841K1367R3906l3205K4480R5846j29212j37778Q4522r9685L5707p8605
20444A71184j22296o5055l5239k419m5397J54030K30264P8019j45674l7245j77194
20433B978n5866p0852J21570N1520M4126J36460J64311L4955j60402k54662Q3345
20422I7483k1134q4760j25669N3939L0618o2713j53640J18873q810J88109Q665
20411D0961j05425M8629m7424n6449K28679L64498r97k84553j71393J60863k58375
20400h0986j62220j0623N7619j15427N729j7859M29654K22716O6843l0017k33457
$$ plain form
20389 131972 256858 304710 183284 75276 176886 146919 64754 58969 316902 351368 270683
20378 270683 161627 -66905 -42274 -145786 -238485 -240307 -60111 -77973 -145079 9298 107913
20367 107913 242218 335665 386058 700112 475313 -31750 -336634 -274805 31710 117723
20357 117723 54506 15251 437368 387503 81071 33437 81669 -53920 -76189 -174441 -373310
20346 -373310 -243346 -93383 89261 131855 127021 1280 -75602 -56249 -15541 194963 107210
20335 107210 155612 518639 636443 491390 297657 53628 -95056 -53164 -3212 -339370
20325 -339370 -548972 -568647 -602717 -420921 -64208 30440 60900 -133692 -240916 -264008
20315 -264008 -152666 -49646 -44998 -11097 155495 240583 216509 237517 143411 171590 215725
$$ packed form
20389A31972J24886M7852j21426j08008J01610k9967q2165n785K57933L4466q0685
20378B70683j09056k28532K4631j03512r2699j822J80196j7862o7106J54377R8615
20367A07913J34305R3447N0393L14054k24799n07063l04884O1829L06515Q6013
20357A17723o3217l9255M22117m9865l06432m7634M8232j35589k2269r8252j98869
20346c73310J29964J49963J82644M2594m834j25741p6882J9353M0708K10504q7753
20335A07210M8402L63027J17804j45053j93733k44029j48684M1892M9952l36158
20325c39370k09602j9675l4070J81796L56713R4648L0460j94592j07224k3092
20315b64008J11342J03020M648L3901J66592Q5088k4074K1008r4106K8179M4135
$$ plain form
20304 215725 447156 572217 582108 646547 439731 493954 386793 256565 135962 152529
20294 152529 -22838 60103 55196 16771 134165 83661 -83133 144135 195228 390779 434875
20283 434875 445327 594598 579375 669601 598722 92995 -29092 84596 265869 326896
20273 326896 309378 330636 18340 122146 271062 317454 291024 440548 501756 398873
20263 398873 167172 94235 112039 314864 463420 398593 439738 704346 600900 426465
20253 426465 530258 662014 748719 693805 835154 923751 830016 831889 861121 747259 653895
20242 653895 839553 1057326 884112 706291 890017 922089 851296 709292 599022 600214
20232 600214 560913 584211 737265 838251 1042039 1355825 1879523 2151519 2261232 2130110
$$ packed form
20304B15725K31431J25061R891O4439k06816N4223j07161j30228j20603J6567
20294A52529j75367Q2941m907l8425J17394n0504j66794K27268N1093J95551M4096
20283D34875J0452J49271j5223R0226p0879n05727j22087J13688J81273O1027
20273C26896j7518K1258l12296J03806J48916M6392k6430J49524O1208j02883
20263C98873k31701p2937J7804K02825J48556o4827M1145K64608j03446j74435
20253D26465J03793J31756Q6705n4914J41349Q8597r3735J873K9232j13862r3364
20242F53895J85658K17773j73214j77821J83726L2072p0793j42004j10270J192
20232F00214l9301K3298J53054J00986K03788L13786N23698K71996J09713j31122
$$ plain form
20222 2130110 2148682 2555907 2863732 3134396 3197229 3144971 2781656 2641981 2933981 3277413
20212 3277413 3695846 4628544 5484175 6682470 7910918 8527371 8448094 7602167 6513492
20203 6513492 5797375 5562520 5794145 5897433 5779127 6154235 6715927 7325726 7813736
20194 7813736 8279719 9056066 10128337 11491668 12923406 14352479 16307762 18736081
20186 18736081 21701383 25479200 30512857 36959879 45549835 57839263 75762336 102476315
20178 102476315 141922647 201427747 286750033 390773821 475351843 485197155 410583679
20171 410583679 304897040 217109572 157158681 118216805 92387957 73455152 58936717
20164 58936717 47845971 39408913 33014488 28271464 24201563 20847790 18104560 16089137
$$ packed form
20222B130110J8572M07225L07825K70664O2833n2258l63315j39675K92000L43432
20212C277413M18433R32698Q55631J198295J228448O16453p9277q45927j088675
20203F513492p16117k34855K31625J03288j18306L75108N61692O09799M88010
20194G813736M65983P76347J072271J363331J431738J429073J955283K428319
20186A8736081K965302L777817N033657O447022Q589956J2289428J7923073K6713979
20178A02476315L9446332N9505100Q5322286J04023788Q4578022R845312p4613476
20171D10583679j05686639q7787468n9950891l8941876k5828848j8932805j4518435
20164E8936717j1090746q437058o394425m743024m069901l353773k743230k015423
$$ plain form
20156 16089137 14516255 13011425 11516672 10350585 9344694 8404074 7760959 7170768
20148 7170768 6802630 6423375 5954085 5814761 6090918 6417483 7127364 8204264 8929027
20139 8929027 8693089 7543192 5985085 5019841 4245204 3702962 3484687 3308672 3137160
20130 3137160 3000999 2928779 3095378 3250604 3121230 3069368 2864963 2827557 2874767 2697334
20120 2697334 2456079 2399716 2011565 1778391 1685611 1489151 1407127 1386063 1299051 1360432
20110 1360432 1203363 1017169 957601 712896 646986 610639 869683 871864 692243 598494
20100 598494 734404 523881 573431 521075 421559 488440 740046 709605 654179 623556 597324
20089 597324 612833 746202 728217 864732 847147 731432 743533 674780 497621 470335 781226
$$ packed form
20156A6089137j572882j504830j494753j166087j005891r40620o43115n90191
20148G170768l68138l79255m69290j39324K76157L26565P09881J076900P24763
20139H929027k35938j149897j558107r65244p74637n42242k18275j76015j71512
20130C137160j36161p2220J66599J55226j29374n1862k04405l7406M7210j77433
20120B697334k41255n6363l88151k33174r2780j96460q2024k1064q7012O1381
20110A360432j57069j86194n9568k44705o5910l6347K59044K181j79621r3749
20100E98494J35910k10523M9550n2356r9516O6881K51606l0441n5426l0623k6232
20089E97324J5509J33369j7985J36515j7585j15715J2101o8753j77159k7286L10891
$$ plain form
20078 781226 833377 692822 763554 614495 316390 377631 393308 305230 374158 418893 567558
20067 567558 672731 559914 365261 434760 574719 361556 152192 118341 210833 361629
20057 361629 180643 157178 288215 180905 150340 323927 313328 253439 430322 414040
20047 414040 561436 537736 354427 114785 -222122 -282018 54504 305090 492985 576885
20037 576885 679778 533534 473816 408251 492679 338263 110402 -92523 -81226 -139178
20027 -139178 151514 410656 557498 718769 774032 649749 577481 339363 -84209 -252238
20017 -252238 -311916 -125168 -61726 38845 246228 130348 -89980 32993 161137 96975
20007 96975 317087 520809 495300 526638 422833 373331 30884 77560 174043 -109172 -23816
$$ packed form
20078G81226N2151j40555P0732j49059k98105O1241J5677q8078O8928M4735J48665
20067E67558J05173j12817j94653O9499J39959k13163k09364l3851R2492J50796
20057C61629j80986k3465J31037j07310l0565J73587j0599n9889J76883j6282
20047D14040J47396k3700j83309k39642l36907n9896L36522K50586J87895Q3900
20037E76885J02893j46244n9718o5565Q4428j54416k27861k02925J1297n7952
20027a39178K90692K59142J46842J61271N5263j24283p2268k38118m23572j68029
20017b52238n9678J86748O3442J00571K07383j15880k20328J22973J28144o4162
20007I6975K20112K03722k5509L1338j03805m9502l42447M6676R6483k83215Q5356
$$ plain form
19996 -23816 135617 221577 129978 143924 389818 441865 281641 75803 -183968 -423934
19986 -423934 -258367 -237210 -250883 -335211 -229683 -142095 -174166 -267188 -300127 -225339 35339
19975 35339 233907 146357 -1853 30355 123707 320639 322627 208088 97323 -126607 -282596
19964 -282596 -343771 -395041 -277700 -87528 38997 56547 46535 88687 -82930 -204807
19954 -204807 -188221 -180433 262298 362686 264979 110093 49693 -106845 -282483 -184522 -8686
19943 -8686 61377 98911 33988 201 29035 -137878 -56555 -17904 -141203 -224025 9581
19932 9581 264651 204005 150157 73706 100575 214674 174876 75282 102743 -189853 -407768
19921 -407768 -409302 -379097 -377257 -503761 -338753 -263956 -231361 -99689 -121210 -2774 48100
$$ packed form
19996b3816J59433Q5960r1599J3946K45894N2047j60224k05838k59771k39966
19986d23934J65567K1157j3673q4328J05528Q7588l2071r3022l2939P4788K60678
19975C5339J98568q7550j48210L2208R3352J96932J988j14539j10765k23930j55989
19964b82596o1175n1270J17341J90172J26525J7550j0012M2152j71617j21877
19954b04807J6586P788M42731J00388r7707j54886o0400j56538j75638R7961J75836
19943h686P0063L7534o4923l3787K8834j66913Q1323L8651j23299q2822K33606
19932I581K55070o0646n3848p6451K6869J14099l9798r9594K7461k92596k17915
19921d07768j534L0205J840j26504J65008P4797L2595J31672k1521J18436N0874
$$ plain form
19910 48100 -67910 398032 600922 360773 74011 82303 418815 629884 396673 242414
19900 242414 183589 376279 444716 405660 440105 420738 228200 -96534 -206211 -205214 -217268
19889 -217268 73660 263708 258431 255265 235860 88428 869 -182043 -320530 -350988 -69801
19878 -69801 25612 -122264 28020 272296 319579 63577 -387777 -553960 -580023 -387607
19868 -387607 -312501 49388 315129 207746 -55663 -125316 -111476 -21104 185829 415411
19858 415411 353930 -71660 -48049 33529 127939 1390 -302037 -420161 -279784 -470292
19848 -470292 -490308 -414223 -251245 -148566 -152405 -286288 -504611 -339556 -359601 -251719
19838 -251719 -109904 -292754 -284944 -108775 44492 9192 -139320 75615 -19882 -41224
$$ packed form
19910D8100j16010M65942K02890k40149k86762Q292L36512K11069k33211j54259
19900B42414n8825J92690O8437l9056L4445j9367j92538l24734j09677R97j2054
19889b17268K90928J90048n277l166j9405j47432q7559j82912j38487l0458K81187
19878f9801R5413j47876J50284K44276M7283k56002m51354j66183k6063J92416
19868c87607P5106L61889K65741j07383k63409o9653J3840R0372K06933K29582
19858D15411o1481m25590K3611Q1578R4410j26549l03427j18124J40377j90508
19848d70292k0016P6085J62978J02679l839j33883k18323J65055k0045J07882
19838b51719J41815j82850P810J76169J53267l5300j48512K14935r5497k1342
$$ plain form
19828 -41224 -78459 -225896 -146863 -138291 -89598 -112334 -378647 -412616 -171178 1614 73367
19817 73367 -4204 -269859 -439130 -420898 -329856 -113564 -31636 -162449 -237476 -232462 -134008
19806 -134008 -185580 -261082 -184852 -54540 -202610 -389663 -564483 -568633 -344237 -89829
19796 -89829 -14997 -64057 -232585 -190446 -361 105054 232743 232115 72251 -116852 -183741
19785 -183741 -228879 -342345 -204816 26904 113218 176081 -24359 -249608 -290449 -517978
19775 -517978 -401040 12752 237071 288301 153649 172191 475350 212553 -72487 -96556
19765 -96556 60516 265180 94157 -29292 -270611 -153788 -42226 -90028 3178 -144199
19755 -144199 -154984 -164456 -102590 147890 327274 332438 391247 493504 301869 78915 -67672
$$ packed form
19828d1224l7235j47437P9033Q572M8693k2736k66313l3969K41438J72792P1753
19817G3367p7571k65655j69271J8232R1042K16292Q1928j30813p5027N014R8454
19806a34008n1572p5502P6230J30312j48070j87053j74820m150K24396K54408
19796h9829P4832m9060j68528M2139J90085J05415J27689o28j59864j89103o6889
19785a83741m5138j13466J37529K31720Q6314O2863k00440k25249m0841k27529
19775e17978J16938M13792K24319N1230j34652J8542L03159k62797k85040k4069
19765i6556J57072K04664j71023j23449k41319J16823J11562m7802R3206j47377
19755a44199j0785r472O1866K50480J79384N164N8809J02257j91635k22954j46587
$$ plain form
19744 -67672 41654 102657 -37701 -224513 -215163 -125304 -198808 -91966 83357 -14353 -43246
19733 -43246 -28267 -96196 3715 184776 38029 -62723 -175443 -74650 -31144 -213388
19723 -213388 -77231 -3600 -114117 -395021 -441622 -352070 -211488 -267774 -410677 -432374
19713 -432374 -172307 -256916 -585773 -934096 -854319 -462028 -119633 91338 137883 44762
19703 44762 13959 139783 -109426 -458877 -415462 -356963 -298566 -159165 -199832 -346650 -342167
19692 -342167 -152587 -37480 232984 122453 -1541 5086 110168 -176255 -122606 34397
19682 34397 39996 50553 87140 -194981 -314961 -408266 -287241 -242095 -122688 146939 367439
19671 367439 258324 125679 107640 22833 102514 125052 -220925 -418205 -278243 -312882
$$ packed form
19744f7672J09326O1003j40358j86812R350Q9859p3504J06842J75323r7710k8893
19733d3246J4979o7929R9911J81061j46747j00752j12720J00793M3506j82244
19723b13388J36157P3631j10517k80904m6601Q9552J40582n6286j42903k1697
19713d32374K60067q4609l28857l48323P9777L92291L42395K10971M6545r3121
19703D4762l0803J25824k49209l49451M3415N8499N8397J39401m0667j46818M483
19692c42167J89580J15107K70464j10531j23994O627J05082k86423N3649J57003
19682C4397N599J0557L6587k82121j19980r3305J21025M5146J19407K69627K20500
19671C67439j09115j32645j8039q4807P9681K2538l45977j97280J39962l4639
$$ plain form
19661 -312882 -262247 -65785 -4019 86381 44237 82348 47073 57448 120906 -126230 -121055
19650 -121055 -141476 -158089 -42369 129605 -70324 -137047 -254533 -140057 11374 32642
19640 32642 -61045 4645 329802 582098 596664 623505 424675 103262 153104 242279 261977
19629 261977 197156 117906 132438 155287 177382 328697 287402 72866 207563 365772 232517
19618 232517 179310 119891 -51650 -76846 -252716 -350767 -318502 -140446 130304 120084 -510
19607 -510 42882 -15941 -220052 -55328 22445 88375 155669 166195 205497 165287 262897 359177
19595 359177 519188 534892 291485 251425 197720 59867 307244 458346 133682 -81196
19585 -81196 -94509 75777 209112 333341 507454 451363 347896 168984 62840 30023
$$ packed form
19661c12882N0635J96462O1766R0400m2144L8111l5275J0375O3458k47136N175
19650a21055k0421j6613J15720J71974j99929o6723j17486J14476J51431K1268
19640C2642r3687O5690L25157K52296J4566K6841j98830l21413M9842Q9175J9698
19629B61977o4821p9250J4532K2849K2095J51315m1295k14536J34697J58209j33255
19618B32517n3207n9419j71541k5196j75870r8051L2265J78056K70750j0220j20594
19607e10M3392n8823k04111J64724P7773O5930O7294J0526L9302m0210R7610R6280
19595C59177J60011J5704k43407m0060n3705j37853K47377J51102l24664k14878
19585h1196j3313J70286J33335J24229J74113n6091j03467j78912j06144l2817
$$ plain form
19575 30023 -25928 63066 23676 -197460 -336137 -97855 140702 267959 149586 255407
19565 255407 259042 144589 237102 286168 237098 120819 282546 421168 446516 529586 467365
19554 467365 418396 457866 437453 383746 299380 518363 894132 966348 1032450 1016740 1499817
19543 1499817 2023680 2358051 2447989 2512668 2157248 1856493 1438317 961538 848080 758581
19533 758581 497020 207869 131243 27498 -95911 280998 539770 618906 549745 593225
19523 593225 501563 263305 260926 289537 -55957 -121267 130277 255428 7007 43394 278035
19512 278035 219458 192180 237304 186254 277917 424788 279142 389073 369093 76620 -120015
19501 -120015 -75238 -38477 24895 192454 449160 306472 97161 138716 284884 388620
$$ packed form
19575C0023n5951Q8994l9390k21136j38677K38282K38557J27257j18373J05821
19565B55407L635j14453R2513M9066m9070j16279J61727J38622K5348Q3070o2221
19554D67365m8969L9470k0413n3707q4366K18983L75769P2216O6102j5710M83077
19543A499817N23863L34371Q9938O4679l55420l00755m18176m76779j13458q9499
19533G58581k61561k89151p6626j03745j23409L76909K58772P9136o9161M3480
19523E93225r1662k38258k379K8611l45494o5310K51544J25151k48421L6387K34641
19512B78035n8577k7278M5124n1050R1663J46871j45646J09931j9980k92473j96635
19501a20015M4777L6761O3372J67559K56706j42688k09311M1555J46168J03736
$$ plain form
19491 388620 225370 85934 184362 278130 165560 -147046 -96944 -83217 56216 164930
19481 164930 363930 523148 187948 46468 71451 -73025 43397 -65244 -178396 -19379
19471 -19379 44291 -87099 -225915 -102707 130266 185130 291320 420949 207369 103181
19461 103181 44983 189789 493970 453453 294516 287028 611515 589629 163357 5497
19451 5497 209105 173024 -28278 -31121 -32701 -189905 -197311 108016 96134 -46601 100143
19440 100143 122668 89292 189027 171051 365226 382782 188128 248955 295371 244299 235215
19429 235215 55682 -20564 74974 199742 253761 222373 353840 418803 367724 422125 443245
19418 443245 466814 427554 423635 471479 756427 886799 1067386 1546118 1815159 1717370 1511377
$$ packed form
19491C88620j63250j39436R8428R3768j12570l12606N0102J3727J39433J08714
19481A64930J99000J59218l35200j41480K4983j44476J16422j08641j13152J59017
19471a9379O3670j31390j38816J23208K32973N4864J06190J29629k13580j04188
19461A03181n8198J44806L04181m0517j58937p488L24487k1886m26272j57860
19451E497K03608l6081k01302k843j580j57204p406L05327j1882j42735J46744
19440A00143K2525l3376R9735j7976J94175J7556j94654O0827M6416n1072r084
19429B35215j79533p6246R5538J24768N4019l1388J31467O4963n1079N4401K1120
19418D43245K3569l9260l919M7844K84948J30372J80587M78732K69041r7789k05993
$$ plain form
19407 1511377 1104397 745262 566924 683909 774286 483144 382078 350234 562460 855267
19397 855267 842819 692196 662840 704666 525199 407083 466114 745308 722574 697152 794021
19386 794021 910029 627513 321288 213620 327983 846566 994935 933557 1048507 1155158
19376 1155158 1472377 1829046 2169913 2158173 1691806 1313578 1103186 1015444 1046567 991798
19366 991798 1094249 961872 814347 645099 569736 542889 533556 482229 280105 301189 374264
19355 374264 366607 412824 257099 367859 294822 213213 191576 69865 17979 -12530 216268
19344 216268 293965 404687 427906 370746 184404 -45039 -100257 149589 491332 466179
19334 466179 246768 141618 195020 187878 -125271 -161646 -103709 -44638 -206108 -25882 217661
$$ packed form
19407A511377m06980l59135j78338J16985R0377k91142j01066l1844K12226K92807
19397H55267j2448j50623k9356M1826j79467j18116N9031K79194k2734k5422R6869
19386G94021J16008k82516l06225j07668J14363N18583J48369o1378J14950J06651
19376A155158L17219L56669L40867j1740m66367l78228k10392q7742L1123n4769
19366I91798J02451j32377j47525j69248p5363k6847r333n1327k02124K1084P3075
19355C74264p657M6217j55725J10760p3037q1609k1637j21711n1886l0509K28798
19344B16268P7697J10722K3219n7160j86342k29443n5218K49846L41743k5153
19334D66179k19411j05150N3402p142l13149l6375N7937N9071j61470J80226K43543
$$ plain form
19323 217661 403144 638108 420294 120737 -42437 -201377 -50617 58148 231618 485083
19313 485083 554234 613547 553557 476084 542864 435826 408237 217185 188888 88172 -134481
19302 -134481 -242270 -206806 -233578 -250546 -209765 -18190 478 -127373 -322379 -153718
19292 -153718 109428 160238 242418 378499 370638 69523 -13008 145583 197073 241036 280358
19281 280358 488358 592136 500001 317573 79857 -35916 -99847 -187195 -74175 -25074
19271 -25074 -23147 123929 -151895 -231149 -438922 -387550 -394303 -205405 73899 143820 169243
19260 169243 112275 90403 91940 -75410 -255074 -113819 187284 91887 113114 52746 38117
19249 38117 34917 183135 29939 -61164 -205475 -362420 -293524 -78382 169349 216278 74564
$$ packed form
19323B17661J85483K34964k17814k99557j63174j58940J50760J08765J73470K53465
19313D85083O9151N9313n9990p7473O6780j07038k7589j91052k8297j00716k22653
19302a34481j07789L5464k6772j6968M0781J91575J8668j27851j95006J68661
19292a53718K63146N0810Q2180J36081p861l01115q2531J58591N1490M3963L9322
19281B80358K08000J03778r2135j82428k37716j15773o3931q7348J13020M9101
19271b5074J927J47076k75824p9254k07773N1372o753J88898K79304O9921K5423
19260A69243n6968k1872J537j67350j79664J41255L01103r5397K1227o0368j4629
19249C8117l200J48218j53196r1103j44311j56945O8896K15142K47731M6929j41714
$$ plain form
19238 74564 13185 159757 306763 326720 326476 43550 -467022 -477486 -288099 -135902 100272
19227 100272 291137 174565 -66189 -219425 -275816 -55467 -90815 -97200 -181343 -195629 2792
19216 2792 83758 169846 -23523 71525 107073 195671 159674 125078 62427 52659 -42157 226744
19204 226744 184080 51815 183999 133631 301071 321816 192288 150399 7991 14382 22979
19193 22979 -130308 -104917 199735 247275 200141 104446 57661 161790 135975 220520 337714
19182 337714 339516 401673 188826 191481 -47357 2070 -80457 -271252 -166031 -98497 32403
19171 32403 241685 58927 -249659 -267613 -101880 -97166 -68269 -20691 -284720 -154539 -164475
19160 -164475 -38148 127469 -47796 -80475 -279231 -472778 -500446 -519797 -350176 -99848
$$ packed form
19238G4564o1379J46572J47006J9957k44k82926n10572j0464J89387J52197K36174
19227A00272J90865j16572k40754j53236n6391K20349l5348o385q4143j4286J98421
19216B792Q0966Q6088j93369R5048L5548Q8598l5997l4596o2651r768r4816K68901
19204B26744m2664j32265J32184n0368J67440K0745j29528m1889j42408O391Q597
19193B2979j53287K5391L04652M7540m7134r5695m6785J04129k5815Q4545J17194
19182C37714J802O2157k12847K655k38838M9427q2527j90795J05221O7534J30900
19171C2403K09282j82758l08586j7954J65733M714K8897M7578k64029J30181r936
19160a64475J26327J65617j75265l2679j98756j93547k7668j9351J69621K50328
$$ plain form
19150 -99848 5910 108663 210842 367948 207686 121499 51430 -149576 30263 132698
19140 132698 191812 -80865 -52871 -193761 -145872 -23720 -203560 -353495 -345367 -30741
19130 -30741 248782 326008 305965 305532 85540 -85186 -212024 -26153 99802 141381 -14951
19119 -14951 -359287 -391612 -117122 -137466 -112518 -68597 29907 183476 219079 246570 573039
19108 573039 597689 307326 114989 -41414 -67876 -291135 -244745 -21104 -152895 -143817
19098 -143817 62508 -60934 -84067 -179970 168173 322069 103992 -29420 -40328 -101281
19088 -101281 -354132 -337774 -170610 -21757 -39228 -296918 -322336 -129297 18941 -178318
19078 -178318 -277369 -296844 -178834 -299697 -231733 -110156 -3718 -186083 -271486 -146385
$$ packed form
19150i9848J05758J02753J02179J57106j60262q6187p0069k01006J79839J02435
19140A32698N9114k72677K7994j40890M7889J22152j79840j49935Q128L14626
19130c0741K79523P7226k0043m33k19992j70726j26838J85871J25955M1579j56332
19119a4951l44336l2325K74490k0344K4948M3921R8504J53569L5603K7491L26469
19108E73039K4650k90363j92337j56403k6462k23259M6390K23641j31791R078
19098a43817K06325j23442k3133r5903L48143J53896k18077j33412j0908o0953
19088a01281k52851J6358J67164J48853j7471k57690k5418J93039J48238j97259
19078a78318r9051j9475J18010j20863O7964J21577J06438j82365q5403J25101
$$ plain form
19068 -146385 -88898 83931 -201043 -200338 16839 62366 -89050 -279990 12702 279292
19058 279292 169041 182388 73718 -89470 25580 -60431 -108259 -47494 89851 158866
19048 158866 -50718 -20854 -48521 -41697 278371 508423 497307 391864 475514 424097 456486
19037 456486 381765 253228 177937 155845 180981 10496 -94124 -129218 -175837 -76851 48459
19026 48459 -27118 -53037 116785 102828 -51595 -134809 -199120 -160416 -11164 -17709 246128
19015 246128 222726 -68467 -116399 -54810 -91987 -345028 -444419 -194773 -184217 -345120 -180028
19004 -180028 -43074 175745 -168092 -238360 -154157 18318 284608 101773 -157578 26227
18994 26227 122156 145227 238890 300328 426012 291261 200784 264105 358060 438052 414976
$$ packed form
19068a46385N7487J72829k84974P05K17177M5527j51416j90940K92692K66590
19058B79292j10251J3347j08670j63188J15050q6011m7828O0765J37345O9015
19048A58866k09584K9864k7667O824L20068K30052j1116j05443Q3650n1417L2389
19037D56486p4721j28537p5291k2092K5136j70485j04620l5094m6619R8986J25310
19026D8459p5577k5919J69822j3957j54423q3214o4311L8704J49252o545K63837
19015B46128k3402k91193m7932O1589l7177k53041r9391K49646J0556j60903J65092
19004a80028J36954K18819l43837p0268Q4203J72475K66290j82835k59351J83805
18994B6227R5929K3071R3663O1438J25684j34751r0477O3321R3955P9992k3076
$$ plain form
18983 414976 589113 772076 818682 496104 116059 -121834 -60226 202443 109246 35789
18973 35789 108168 285450 348323 143295 326611 358060 160055 92841 123485 64047 130856
18962 130856 257019 374907 351388 274257 286334 365420 247708 267253 609204 673862 693562
18951 693562 641521 739745 576920 303337 90614 330945 226699 13651 -38637 12842
18941 12842 40970 -20658 -24628 195366 353679 330873 359443 278256 263375 288948 357779
18930 357779 282563 168087 59691 70455 126923 273389 306778 146514 174171 261947 424687
18919 424687 541802 641352 886082 901452 793464 618228 574794 644562 601341 706745
18909 706745 843310 934666 808914 968145 799332 347671 257649 216535 344286 436385
$$ packed form
18983D14976J74137J82963M6606l22578l80045k37893O1608K62669r3197p3457
18973C5789P2379J77282O2873k05028J83316L1449j98005o7214L0644n9438O6809
18962A30856J26163J17888k3519p7131J2077P9086j17712J9545L41951O4658J9700
18951F93562n2041R8224j62825k73583k12723K40331j04246k13048n2288N1479
18941A2842K8128o1628l970K19994J58313k2806K8570q1187j4881K5573O8831
18930C57779p5216j14476j08396J0764N6468J46466L3389j60264K7657Q7776J62740
18919D24687J17115R9550K44730J5370j07988j75236m3434O9768m3221J05404
18909G06745J36565R1356j25752J59231j68813m51661r0022m1114J27751R2099
$$ plain form
18899 436385 467759 326342 145571 201920 157940 81236 156535 230228 325002 357415 369809
18888 369809 197232 128178 194134 179945 300753 546592 587352 727336 766602 482052
18878 482052 278025 538351 607597 590710 826097 1349065 2019516 2753396 3512193 3104452
18868 3104452 2036594 1607532 1374549 1336994 1776316 1996231 2067155 2259298 2625919 3000737
18858 3000737 2963620 2631794 2110079 1794206 1702198 1516930 1623313 1864061 2150763 2281943
18848 2281943 2514937 2752626 2969540 3252534 3711433 4353566 5159480 5711010 5968190
18839 5968190 5841147 6296432 7331296 8204242 9524764 11595189 14946381 19518682 26240960
18830 26240960 36247022 51234813 77042568 124234251 203148179 297246633 328162048
$$ packed form
18899D36385L1374j41417j80771N6349m3980p6704P5299P3693R4774L2413J2394
18888C69809j72577o9054O5956j4189J20808K45839M0760J39984L9266k84550
18878D82052k04027K60326O9246j6887K35387N22968O70451P33880P58797m07741
18868C104452j067858m29062k32983l7555M39322K19915P0924J92143L66621L74818
18858C000737l7117l31826n21715l15873r2008j85268J06383K40748K86702J31180
18848B281943K32994K37689K16914K82994M58899O42133Q05914N51530K57180
18839E968190j27043M55285J034864Q72946J320522K070425L351192M572301O722278
18830B6240960J0006062J4987791K5807755M7191683P8913928R4098454L0915415
$$ plain form
18823 328162048 256617231 156975060 95984638 64266008 46580633 35663129 28638825
18816 28638825 24238988 21829613 19686800 17518206 15747346 14464861 13456364 12698498
18808 12698498 12438128 12526696 12460382 11766083 10763787 10260954 10617920 11688902 13212719
18799 13212719 15231837 18378637 22635096 28935060 39138285 54969077 80932529 127680966
18791 127680966 209040931 318976121 381572460 325637088 206723793 123990834 80756781
18784 80756781 57062263 42643070 33279020 27472890 24083484 21310495 18171945 15166264
18776 15166264 13201300 11822469 10545273 9494756 8780829 7969900 7066420 6360549 6155568
18767 6155568 6404172 6424758 5753635 4615422 3584322 3002188 3008817 2889295 2968124 3204672
$$ packed form
18823C28162048p1544817r9642171o0990422l1718630j7685375j0917504p024304
18816B8638825m399837k409375k142813k168594j770860j282485j008497p57866
18808A2698498k60370Q8568o6314o94299j002296n02833L56966J070982J523817
18799A3212719K019118L146800M256459O299964J0203225J5830792K5963452M6748437
18791A27680966Q1359965J09935190O2596339n5935372j18913295q2732959m3234053
18784H0756781k3694518j4419193r364050n806130l389406k772989l138550l005681
18776A5166264j964964j378831j277196j050517p13927q10929r03480p05871k04981
18767F155568K48604K0586o71123j138213j031100n82134O629j19522P8829K36548
$$ plain form
18757 3204672 3543678 3958486 4138852 4148487 3294038 2514112 2056457 1859589 1669371 1635135
18747 1635135 1566696 1335759 1098604 1072291 1064016 964756 923640 925227 664423 651269 593703
18736 593703 782514 692042 650345 770294 824282 762208 732821 605896 383196 370513 295434
18725 295434 231174 200104 162371 141714 4012 89056 197818 320627 524115 499723 423511
18714 423511 453876 612349 615097 520086 442049 659547 737943 493142 432656 691672 524339
18703 524339 390018 652035 636731 392029 400400 369095 122718 -19174 147824 254691
18693 254691 241839 201147 361325 281339 388126 343799 161722 103236 13222 59445 342972
18682 342972 422233 375076 231885 37509 -134196 -196006 -180483 -82239 -83245 96368 291763
$$ packed form
18757C204672L39006M14808J80366R635q54449p79926m57655j96868j90218l4236
18747A635135o8439k30937k37155k6313q275r9260m1116J587k60804j3154n7566
18736E93703J88811r0472m1697J19949N3988o2074k9387j26925k22700j2683p5079
18725B95434o4260l1070l7733k0657j37702Q5044J08762J22809K03488k4392p6212
18714D23511L0365J58473K748r5011p8037K17498P8396k44801o0486K59016j67333
18703E24339j34321K62017j5304k44702Q371l1305k46377j41892J66998J06867
18693B54691j2852m0692J60178p9986J06787m4327j82077n8486r0014M6223K83527
18682C42972P9261m7157j43191j94376j71705o1810J5523R8244j006J79613J95395
$$ plain form
18671 291763 441200 458783 292211 258851 325566 372090 380873 367221 299191 146941 -131762
18660 -131762 -209429 -160288 -99836 -40397 -115641 -53398 -160760 -131776 108323 51048 121017
18649 121017 191319 287679 -64745 -444609 -383282 -215319 28168 122447 191491 338295
18639 338295 426873 390091 255898 137717 260840 215605 82310 -85774 4905 101868
18629 101868 141616 40868 -137373 -13935 244006 340121 224583 9867 -109646 -115622
18619 -115622 -289461 -229845 -259890 -173590 131888 545636 662809 637636 565552 550534 642444
18608 642444 585817 341567 342697 247342 -16255 63864 130069 351457 378393 303639 374284
18597 374284 505854 323056 251066 -11801 206761 328714 493738 337817 338179 477203
$$ packed form
18671B91763J49437J7583j66572l3360O6715M6524Q783j3652o8030j52250k78703
18660a31762p7667M9141O0452N9439p5244O2243j07362K8984K40099n7275O9969
18649A21017P0302R6360l52424l79864O1327J67963K43487R4279O9044J46804
18639C38295Q8578l6782j34193j18181J23123m5235j33295j68084R0679R6963
18629A01868L9748j00748j78241J23438K57941R6115j15538k14716j19513n976
18619a15622j73839N9616l0045Q6300L05478M13748J17173k5173p2084j5018R1910
18608F42444n6627k44250J130r5355k63597Q0119O6205K21388K6936p4754P0645
18597C74284J31570j82798p1990k62867K18562J21953J65024j55921L62J39024
$$ plain form
18587 477203 552185 380579 422481 381909 71948 -126044 -88156 -58519 60552 267394
18577 267394 504890 782072 744264 829623 632450 340505 171920 232932 355365 263059
18567 263059 82527 29388 10687 -186373 -343544 -187829 25870 156824 310536 243435
18557 243435 -41138 65323 55810 92589 -48082 304953 597226 635130 647890 393956
18547 393956 -34700 20910 182074 119609 -17038 -42518 -86346 -22484 236859 362778
18537 362778 115233 -150352 -35391 73864 66153 188549 183122 152052 145662 228852 265726
18526 265726 406714 311628 203471 182184 -57095 21181 143604 66193 155766 391036
18516 391036 471835 642398 695432 700231 484569 209601 -46945 3444 33789 156369 163893
$$ packed form
18587D77203P4982j71606M1902m0572l09961j97992L7888K9637J19071K06842
18577B67394K37496K77182l7808Q5359j97173k91945j68585O1012J22433r2306
18567B63059j80532n3139j8701j97060j57171J55715K13699J30954J53712o7101
18557B43435k84573J06461r513L6779j40671L53035K92273L7904J2760k53934
18547C93956m28656N5610J61164o2465j36647k5480m3828O3862K59343J25919
18537C62778k47545k65585J14961J09255p711J22396n427l1070o390Q3190L6874
18526B65726J40988r5086j08157k1287k39279P8276J22423p7411Q9573K35270
18516C91036Q0799J70563N3034M799k15662k74968k56546N0389L0345J22580P524
$$ plain form
18505 163893 -13071 56302 77782 69773 195836 239887 19128 -201716 -129618 -48243 42983
18494 42983 147950 448906 457279 293709 235573 291223 206560 -8278 -56314 120129 564658
18483 564658 916721 811810 369504 147868 223572 165201 251220 169112 207544 182415 196388
18472 196388 -27071 -236310 -89750 -168880 -79540 -69456 113409 26988 -74656 -98781
18462 -98781 -158383 -323070 -28846 310953 473756 333122 20514 118434 69999 -100243
18452 -100243 -245207 -131972 190299 379594 491710 468497 412756 96607 -179120 -119775
18442 -119775 20367 167106 94078 218955 245483 40958 -24347 369716 593228 270530
18432 270530 -229419 -204183 84256 276460 469521 605925 605376 308961 261015 279812 403134
$$ packed form
18505A63893j76964O9373K1480q009J26063M4051k20759k20844P2098Q1375R1226
18494D2983J04967L00956Q373j63570n8136N5650q4663k14838m8036J76443M44529
18483E64658L52063j04911m42306k21636P5704n8371Q6019q2108L8432k5129J3973
18472A96388k23459k09239J46560p9130Q9340J0084J82865q6421j01644k4125
18462i8781n9602j64687K94224L39799J62803j40634l12608R7920m8435j70242
18452a00243j44964J13235L22271J89295J12116k3213n5741l16149k75727N9345
18442a19775J40142J46739p3028J24877K6528k04525o5305L94063K23512l22698
18432B70530m99949K5236K88439J92204J93061J36404n49k96415m7946J8797J23322
$$ plain form
18421 403134 289477 442154 474963 554124 664593 854084 924590 957994 1052913 948365
18411 948365 890026 794684 511989 472362 689686 820850 644345 233387 440444 766171
18401 766171 1139270 1131299 1160075 1222293 1149979 946078 1066725 1021518 781082 1165980 1273820
18390 1273820 1092517 1013354 1151311 1189440 1425960 1822564 2211587 2774626 3158744 3578112
18380 3578112 4327403 4677886 4555929 4626934 5143969 5354930 5112798 5019446 5363655 5738393
18370 5738393 6413363 7507448 9075895 10909735 12598655 14743195 17380890 21529066
18362 21529066 28081679 38710103 56032660 86207430 140489214 229651337 335364036
18355 335364036 375803473 303387046 190463661 115534436 76009581 54424923 42264627
$$ packed form
18421D03134j13657J52677L2809P9161J10469J89491P0506L3404R4919j04548
18411I48365n8339r5342k82695l9627K17324J31164j76505m10958K07057L25727
18401G66171L73099p971K8776O2218p2314k03901J20647m5207k40436L84898J07840
18390A273820j81303p9163J37957L8129K36520L96604L89023N63039L84118M19368
18380C578112P49291L50483j21957P1005N17035K10961k42132r3352L44209L74738
18370E738393O74970J094085J568447J833840J688920K144540K637695M148176
18362B1529066O552613J0628424J7322557L0174770N4281784Q9162123J05712699
18355C35364036M0439437p2416427j12923385p4929225l9524855k1584658j2160296
$$ plain form
18348 42264627 35199285 30240422 26141256 22677562 20098763 18006398 16239051 14740455
18340 14740455 13563121 12292150 11425858 10887488 11008901 11291997 11350045 11975991 13681925
18331 13681925 15500080 16575817 17799722 20285210 24940702 32514189 45149927 67287195
18323 67287195 107480468 176439151 269219354 326521421 286557885 187232441 111638069
18316 111638069 71147430 49492383 36937967 29721827 25207766 21200365 17452795
18309 17452795 14730088 12830679 11181633 9499426 8230199 7432221 7130161 7093184 7098035
18300 7098035 6818779 6263057 5858597 5938188 6005454 5559909 4557758 3694895 3395494 3050053
18290 3050053 2721703 2469640 2365692 2176154 2049802 2050260 2281129 2398797 2072407 1850261
$$ packed form
18348D2264627p065342m958863m099166l463694k578799k092365j767347j498596
18340A4740455j177334j270971q66292n38370J21413K83096N8048O25946J705934
18331A3681925J818155J075737J223905K485488M655492P573487J2635738K2137268
18323F7287195M0193273O8958683R2780203N7302067l9963536r9325444p5594372
18316A11638069m0490639k1655047j2554416p216140m514061m007401l747570
18309A7452795k722707j899409j649046j682207j269227p97978l02060l6977M851
18300G098035k79256n55722m04460P9591O7266m45545j002151q62863k99401l45441
18290C050053l28350k52063j03948j89538j26352M58K30869J17668l26390k22146
$$ plain form
18280 1850261 1666389 1701235 1699244 1610255 1530144 1416920 1208671 1096237 1138842 1259022
18270 1259022 1435468 1394046 1352108 1335094 1260364 1162999 1109811 996967 771404 554361
18260 554361 465131 409520 623915 874838 712376 546466 682204 507138 479767 699742
18250 699742 667607 569566 309481 450112 674231 690411 1030100 1092200 976791 868767
18240 868767 685770 793871 1111089 1435010 1531811 1389777 1240790 1162286 1073399 1169081
18230 1169081 1642519 2104548 2589833 2720440 2456827 1670170 1201287 1052168 950009
18221 950009 790831 554530 612111 850117 817613 725172 761282 829218 692901 718778 513826
18210 513826 382738 393950 378053 305143 385021 571944 499270 443740 381208 -10187 -80185
$$ packed form
18280A850261j83872L4846j991q8989q0111j13224k08249j12434M2605J20180
18270A259022J76446m1422m1938j7014p4730r7365n3188j12844k25563k17043
18260E54361q9230n5611K14395K50923j62462j65910J35738j75066k7371K19975
18250F99742l2135r8041k60085J40631K24119J6180L39689O2100j15409j08024
18240H68767j82997J08101L17218L23921R6801j42034j48987p8504q8887R5682
18230A169081M73438M62029M85285J30607k63613p86657m68883j49119j02159
18221I50009j59178k36301N7581K38006l2504r2441L6110O7936j36317K5877k04952
18210E13826j31088J1212j5897p2910P9878J86923p2674n5530o2532l91395o9998
$$ plain form
18199 -80185 -66221 11616 175874 316621 445157 622315 819112 1039731 895306 363767
18189 363767 155949 41362 27166 -30665 48044 274404 234190 131586 139910 182360 117586
18178 117586 282211 516201 487233 469641 604028 482933 372928 366727 356228 427916 504119
18167 504119 563588 696138 404150 -49083 213411 432114 463453 395731 413597 498181
18157 498181 541849 551919 551620 481824 608302 811954 785207 606940 473483 630274 713952
18146 713952 646227 782777 1149150 1081266 837318 860104 986391 1392244 1579535 1530928
18136 1530928 1705437 1697409 1727275 1925447 2475810 3061899 3354324 3484496 3820281 3844368
18126 3844368 4103524 4607417 5321291 5710223 6530280 7793434 9554183 11498840 13953415
$$ packed form
18199h0185J3964P7837J64258J40747J28536J77158J96797K20619j44425n31539
18189C63767k07818j14587j4196n7831P8709K26360m0214j02604Q324M2450o4774
18178A17586J64625K33990k8968j7592J34387j21095j10005o201j0499P1688P6203
18167E04119N9469J32550k91988m53233K62494K18703L1339o7722J7866Q4584
18157D98181M3668J0070k99o9796J26478K03652k6747j78267j33457J56791Q3678
18146G13952o7725J36550L66373o7884k43948K2786J26287M05853J87291m8607
18136A530928J74509q028K9866J98172N50363N86089K92425J30172L35785K4087
18126C844368K59156N03893P13874L88932Q20057J263154J760749J944657K454575
$$ plain form
18117 13953415 17225170 21954668 29067115 40196439 58445592 89991408 149285992
18110 149285992 257361271 420090581 541968217 487775935 307208559 173725154
18104 173725154 106581646 71861716 51663372 38848596 30091099 24040118 19640338
18097 19640338 16009623 13254394 11390721 10095827 8941462 7878241 6935175 6246528
18089 6246528 5567286 4944876 4457626 4153610 3576291 3194268 3110676 2839101 2544855 2131046
18079 2131046 2148406 2081605 1863008 1831367 1813978 1857804 1764958 1612859 1556201 1430291 1487789
18068 1487789 1455293 1162564 1231418 1377613 1045010 675924 762897 857692 656609 552680
18058 552680 815852 923965 955315 880064 828267 878761 635234 464358 620186 912912
$$ packed form
18117A3953415L271755M729498P112447J1129324J8249153L1545816N9294584
18110A49285992J08075279J62729310J21877636n4192282j80567376j33483405
18104A73725154o7143508l4719930k0198344j2814776q757497o050981m399780
18097A9640338l630715k755229j863673j294894j154365j063221r43066o88647
18089F246528o79242o22410m87250l04016n77319l82023q3592k71575k94246m13809
18079B131046J7360o6801k18597l1641j7389M3826r2846j52099n6658j25910N7498
18068A487789l2496k92729O8854J46195l32603l69086Q6973R4795k01083j03929
18058E52680K63172J08113L1350p5251n1797N0494k43527j70876J55828K92726
$$ plain form
18048 912912 841088 700237 810938 804569 597006 577588 620663 588501 308040 95817 102441
18037 102441 310012 381570 335573 293192 36687 128865 433607 367790 283724 484468 336496
18026 336496 172813 250444 213277 -136716 -144943 89565 337745 724589 614418 417237
18016 417237 255870 100699 172192 347632 383054 217897 42424 -77786 183809 217092
18006 217092 87244 -253559 -153002 -94524 -317712 -215579 164538 224020 -151 -20216
17996 -20216 233723 480029 302749 -25113 -323064 -260150 21905 211145 366517 482414
17986 482414 469292 286598 231220 238058 206685 128994 -15377 -210100 -274728 -217586 -228722
17975 -228722 -196906 22912 230941 193127 66791 130263 381488 571104 361117 381503
$$ packed form
18048I12912p1824j40851J10701o369k07563j9418M3075l2162k80461k12223O624
18037A02441K07571P1558m5997m2381k56505R2178L04742o5817q4066K00744j47972
18026C36496j63683P7631l7167l49993q227K34508K48180L86844j10171j97181
18016D17237j61367j55171P1493J75440L5422j65157j75473j20210K61595L3283
18006B17092j29848l40803J00557N8478k23188J02133L80117N9482k24171k0065
17996b0216K53939K46306j77280l27862k97951O2914K82055J89240J55372J15897
17986D82414j3122j82694n5378O838l1373p7691j44371j94723o4628N7142j1136
17975b28722L1816K19818K08029l7814j26336O3472K51225J89616k09987K0386
$$ plain form
17965 381503 364105 257131 -135285 -345988 -189699 -81781 -20227 54055 245458 470428
17955 470428 417349 130899 -119757 -201075 -180611 -168578 -107369 -175600 -306074 -141053 -159943
17944 -159943 -172955 -60460 81592 185937 188789 23933 -42504 16275 230851 96938
17934 96938 -142437 -301926 -304364 -394018 -238517 -201889 -274916 -455266 -508049 -298276 -91907
17923 -91907 -92610 -110645 -84388 5312 259237 223812 -31002 165205 442530 208224 162575
17912 162575 304579 154910 23879 59285 -44258 -30425 22875 -144888 -58181 93787
17902 93787 20483 -13081 -121286 -195255 -104586 71864 104318 74373 -104331 -169315 -125465
17891 -125465 -242388 -295797 -199764 -5435 24081 30978 21237 -10848 193730 184888 101849
$$ packed form
17965C81503j7398j06974l92416k10703J56289J07918O1554P4282J91403K24970
17955D70428n3079k86450k50656q1318K0464J2033O1209o8231j30474J65021j8890
17944a59943j3012J12495J42052J04345K852j64856o6437N8779K14576j33913
17934I6938k39375j59489k438q9654J55501L6628p3027j80350n2783K09773K06369
17923i1907p03j8035K6257Q9700K53925l5425k54814J96207K77325k34306m5649
17912A62575J42004j49669j31031L5406j03543J3833N3300j67763Q6707J51968
17902I3787p3304l3564j08205p3969R0669J76450L2454k9945j78704o4984M3850
17891a25465j16923n3409R6033J94329K9516O897r741l2085K04578q842q3039
$$ plain form
17880 101849 52585 -261362 -226604 4413 151139 258741 106327 -166327 -368788 -401285
17870 -401285 -441339 -385585 -250089 -32280 -72287 -338955 -297181 -151273 -58939 3213 47940
17859 47940 -75996 -104538 -102974 49048 19483 85655 -38280 -58431 254 83125 -161774
17848 -161774 -401601 -279521 -374531 -351824 -275403 -184423 -237691 -509551 -559020 -379616 -372461
17837 -372461 -204929 -128977 -265795 -60772 91553 -167976 -282725 -258954 -302680 -103799
17827 -103799 172824 243857 -34392 13905 58525 24636 135033 -121350 -354613 -225087
17817 -225087 -208126 -250742 -2150 550202 656811 365700 445873 339202 214042 491450
17807 491450 531438 924065 1347171 1543490 1391449 925666 614569 596683 510054 292102
$$ packed form
17880A01849m9264l13947L4758K31017J46726J07602j52414k72654k02461l2497
17870d01285m0054N5754J35496K17809m0007k66668M1774J45908R2334O2152M4727
17859D7940j23936k8542J564J52022k9565O6172j23935k0151N8685Q2871k44899
17848a61774k39827J22080r5010K2707P6421R0980n3268k71860m9469J79404P155
17837c72461J67532P5952j36818K05023J52325k59529j14749K3771m3726J98881
17827a03799K76623P1033k78249M8297M4620l3889J10397k56383k33263J29526
17817b25087J6961m2616K48592N52352J06609k91111Q0173j06671j25160K77408
17807D91450L9988L92627M23106J96319j52041m65783l11097j7886q6629k17952
$$ plain form
17797 292102 268157 272620 177870 201727 413985 308378 333324 462873 387052 175521 235276
17786 235276 216580 -40948 -214477 -183502 -95723 -62155 -152907 -198379 -267480 -5797 275922
17775 275922 385033 433398 446978 704241 911227 1292965 1514603 1494571 1202644 656414
17765 656414 399673 376481 176399 155474 127314 251476 383482 309149 318169 297078 117122
17754 117122 -26486 -350329 -271199 -79268 69481 61643 134044 106112 146929 80115 -72884
17743 -72884 -406555 -224309 -215477 -451972 -384384 -69778 214964 260295 88008 29405 23639
17732 23639 -41223 334639 408113 114882 -16780 -53410 -12106 201682 163216 232561 303835
17721 303835 291486 115612 -28910 -72059 27043 -80654 -218691 -291317 -165456 -424901
$$ packed form
17797B92102k3945M463r4750K3857K12258j05607K4946J29549p5821k11531N9755
17786B35276j8696k57528j73529L0975Q7779L3568r0752m5472o9101K61683K81719
17775B75922J09111M8365J3580K57263K06986L81738K21638k0032k91927n46230
17765F56414k56741k3192k00082k0925k8160J24162J32006p4333R020k1091j79956
17754A17122j43608l23843P9130J91931J48749p838P2401k7932M0817o6814j52999
17743g2884l33671J82246Q832k36495O7588L14606K84742M5331j72287n8603n766
17732B3639o4862L75862P3474k93231j31662l6630M1304K13788l8466O9345P1274
17721C03835j2349j75874j44522m3149R9102j07697j38037p2626J25861k59445
$$ plain form
17711 -424901 -592790 -721745 -561678 -343831 -313790 -425595 -410870 -405820 -529488 -233869
17701 -233869 -81831 -115490 3473 53929 107176 64114 -100325 -508437 -497813 -399289 -406219
17690 -406219 -383650 -421577 -409022 -410367 -372939 -299608 -145463 -153268 -64539 -84308 -152792 72343
17678 72343 129441 1116 -225263 -322644 -109033 516 -85719 -234140 11510 138374
17668 138374 -60567 -240841 -296346 -333917 -258538 37060 -105954 -330664 -552458 -365665
17658 -365665 -108965 -116612 -151334 46578 -13561 -112143 9497 270352 327742 128877 -33444
17647 -33444 2816 29095 84764 197907 465176 111302 44343 324090 454316 54450
17637 54450 -57124 -182230 -522208 -396663 -57182 -240859 -170707 26847 -12788 -104332
$$ packed form
17711d24901j67889j28955J60067K17847L0041j11805J4725N050j23668K95619
17701b33869J52038l3659J18963N0456N3247m3062j64439m08112J0624R8524o930
17690d06219K2569l7927J2555j345L7428P3331J54145p805Q8729j9769o8484K25135
17678G2343N7098j28325k26379r7381K13611J09549q6235j48421K45650J26864
17668A38374j98941j80274n5505l7571P5379K95598j43014k24710k21794J86793
17658c65665K56700p647l4722J97912o0139r8582J21640K60855N7390j98865j62321
17647c3444L6260K6279N5669J13143K67269l53874o6959K79747J30226l99866
17637E4450j11574j25106l39978J25545L39481j83677P0152J97554l9635r1544
$$ plain form
17627 -104332 -175342 -114564 -79250 -5945 22903 310854 120095 139345 174487 208086 38456
17616 38456 -67962 -6391 -311494 -449971 -335428 -374969 -479220 -522514 -491234 -448628 -326642
17605 -326642 -249489 -19993 -118674 -128475 -341748 -432210 -260439 -121762 -240018 -96318
17595 -96318 -150149 -357972 -291448 -457551 -370823 -14562 -177295 -233275 -238988 -408020 -425335
17584 -425335 -372138 -461341 -379459 -339901 -255564 -248584 -194127 -253535 -384305 -534153 -442220
17573 -442220 -225873 -1585 -108045 -560266 -480207 -261490 -173572 44400 -34816 -4320
17563 -4320 9817 -233290 -401217 -458909 -479337 -103894 182329 305648 553836 413559
17553 413559 98957 122052 223418 -70587 -438625 -362439 -83230 -48109 -135086 -281268
$$ packed form
17627a04332p1010O0778L5314P3305K8848K87951j90759J9250L5142L3599j69630
17616C8456j06418O1571l05103j38477J14543l9541j04251m3294L1280M2606J21986
17605c26642P7153K29496r8681r801k13273r0462J71771J38677j18256J43700
17595i6318n3831k07823O6524j66103Q6728L56261j62733n5980n713j69032j7315
17584d25335N3197q9203Q1882L9558Q4337O980N4457n9408j30770j49848R1933
17573d42220K16347K24288j06460m52221Q0059K18717Q7918K17972p9216L0496
17563d320J4137k43107j67927n7692k0428L75443K86223J23319K48188j40277
17553D13559l14602K3095J01366k94005l68038P6186K79209L5121q6977j46182
$$ plain form
17543 -281268 -281361 -185631 -22559 -166007 -193877 -182090 -162394 -161581 -349220 -223174 -125864 -73689
17531 -73689 35149 128506 105213 -77160 73498 49887 -335343 -561782 -192005 -101932
17521 -101932 -252392 -324507 -148955 -76892 47272 245265 293798 15184 -2903 -116508
17511 -116508 -181183 -270842 -394876 -194562 -214643 -405906 -245119 -103384 102317 83867
17501 83867 -15458 -17976 -152486 -170804 -110846 -136443 -233149 -420643 -216945 -228683 -415870
17490 -415870 -354933 -274423 -452107 -524653 -330285 -43060 -71785 -33722 3573 9768 216190
17479 216190 404465 161250 17485 -50061 58419 -27396 -4214 -87837 -31468 30518 11111
17468 11111 207241 307434 341120 186730 1031 -29043 147574 245347 262354 129651
$$ packed form
17543b81268r3R5730J63072j43448k7870J1787J9696Q13j87639J26046R7310N2175
17531g3689J08838R3357k3293j82373J50658k3611l85230k26439L69777R0073
17521a01932j50460p2115J75552P2063J24164J97993M8533k78614j8087j13605
17511a16508o4675q9659j24034K00314k0081j91263J60787J41735K05701j8450
17501H3867r9325k518j34510j8318N9958k5597r6706j87494K03698j1738j87187
17490d15870O0937Q0510j77684p2546J94368K87225k8725L8063L7295O195K06422
17479B16190J88275k43215j43765o7546J08480q5815K3182q3623N6369O1986j9407
17468A1111J96130J00193L3686j54390j85699l0074J76617R7773J7007j32703
$$ plain form
17458 129651 152052 2953 113867 83281 -134762 -161818 -71188 -133560 -96676 46146 236638
17447 236638 361190 361961 584653 1071824 2029362 2745419 2665498 1779708 917086 579745
17437 579745 527926 321132 266497 288841 84452 -83047 -135312 32138 168949 -102691
17427 -102691 -225106 -230856 -134123 -75956 -13074 7783 -50943 52824 -55082 11438 158041
17416 158041 297138 439696 396438 109304 -62939 -176058 -146419 -239831 -168469 -217578
17406 -217578 -410878 -434653 -316813 -333024 -312587 -169010 -97563 -246660 -355879 -334598
17396 -334598 -230486 -279827 -309341 -88621 -168951 -111044 30736 -44011 -116516 100916 442514
17385 442514 499282 608092 355695 73678 -67633 2357 -60836 -182135 -255181 -171562
$$ packed form
17458A29651K2401j49099J10914l0586k18043k7056R0630o2372L6884J42822J90492
17447B36638J24552P71K22692M87171R57538P16057p9921q85790q62622l37341
17437E79745n1819k06794n4635K2344k04389j67499n2265J67450J36811k71640
17427a02691j22415n750R6733N8167O2882K0857n8726J03767j07906O6520J46603
17416A58041J39097J42558m3258k87134j72243j13119K9639r3412P1362m9109
17406b17578j93300k3775J17840j6211K0437J43577P1447j49097j09219K1281
17396c34598J04112m9341k9514K20720q0330N7907J41780p4747p2505K17432L41598
17385D42514N6768J08810k52397k82017j41311O9990o3193j21299p3046Q3619
$$ plain form
17375 -171562 -417045 -385693 -199844 -115863 -168633 -199341 -104115 -174904 -192438 -77043 74934
17364 74934 319282 428200 252268 106359 10020 -187727 -10124 -6568 108049 264942
17354 264942 248857 187364 41934 -317759 -392917 -165311 -225931 -130742 -204779 -375776 -302799
17343 -302799 -126971 -138500 -196134 -141436 -114591 -81957 -52662 -86531 -140012 -25092 21833
17332 21833 -1274 -28946 -73619 348091 620390 272781 119008 143754 354702 150505
17322 150505 74185 319905 450419 473282 351213 203842 -30600 -191035 -261433 -277327
17312 -277327 -390987 -379272 -351244 -161122 -193453 -319580 -134838 -17110 -27501 41043
17302 41043 168939 245827 91818 -120341 -136656 -256756 -221612 16247 -52845 -135106 -71249
$$ packed form
17375a71562k45483L1352J85849Q3981n2770l0708R5226p0789j7534J15395J51977
17364G4934K44348J08918j75932j45909r6339j97747J77603L556J14617J56893
17354B64942j6085o1493j45430l59693p5158K27606o0620R5189p4037j70997P2977
17343c02799J75828j1529n7634N4698K6845L2634K9295l3869n3481J14920M6925
17332B1833k3107k7672m4673M21710K72299l47609j53773K4746K10948k04197
17322A50505p6320K45720J30514K2863j22069j47371k34442j60435p0398j5894
17312b77327j13660J1715K8028J90122l2331j26127J84742J17728j0391O8544
17302D1043J27896P6888j54009k12159j6315j20100L5144K37859o9092q2261O3857
$$ plain form
17291 -71249 -122019 -152428 -258083 -375902 -197308 -70628 241730 345591 118606 -288174
17281 -288174 -563850 -523906 -449542 -316607 -203125 -315114 -466110 -379072 -332062 -177027
17271 -177027 -64777 -189670 -361144 -66420 190891 172367 -17080 39950 145986 183358
17261 183358 328310 312780 184410 181558 98256 76496 52838 95728 2877 -253911 -343521
17250 -343521 -351058 -284958 -313014 -169507 -247786 -240113 36460 346347 242017 194562 333609
17239 333609 347369 -101732 -229626 -127546 -9518 155343 194946 199898 215055 226970 229764
17228 229764 133169 -3423 -79249 -83967 -203702 -311148 -478553 -441835 -365974 -208864 -66669
17217 -66669 -34090 57353 -14911 3752 -88804 35277 73507 14093 291088 130338 96767
$$ packed form
17291g1249n0770l0409j05655j17819J78594J26680L12358J03861k26985m06780
17281b88174k75676L9944P4364J32935J13482j11989j50996Q7038M7010J55035
17271a77027J12250j24893j71474K94724K57311j8524j89447N7030J06036L7372
17261A83358J44952j5530j28370k852q3302k1760k3658M2890r2851k56788q9610
17250c43521p537O6100k8056J43507p8279P673K76573L09887j04330m7455J39047
17239C33609J3760m49101j27894J02080J18028J64861L9603M952J5157J1915K794
17228B29764r6595j36592p5826m718j19735j07446j67405L6718P5861J57110J42195
17217f6669L2579R1443p2264J8663r2556J24081L8230n9414K76995j60750l3571
$$ plain form
17206 96767 138447 -7160 5866 -185950 -256152 -392571 -460497 -336826 -70003 -10821 7517
17195 7517 -100598 -82777 -142994 -264393 -312780 -291076 -321472 -484169 -554819 -420857 -152061
17184 -152061 227485 341126 326610 253037 304506 196131 280967 244281 296197 134687 122636
17173 122636 83839 -274 -110742 -208031 -147908 -205005 -271324 -242164 -162145 -36935 35797
17162 35797 108083 29513 -145001 -160573 -169357 -123634 -198165 -94452 43858 163586 132937
17151 132937 242592 101037 104458 48924 85138 -28599 -76952 -144631 -353950 -448430 -380079
17140 -380079 -145359 -189528 -92603 283721 99134 -70034 196570 158535 -248912 -455371
17130 -455371 -336993 -454012 -403322 -205196 -379304 -291915 57387 33592 -1162 -101393
$$ packed form
17206I6767M1680j45607J3026j91816p0202j36419o7926J23671K66823N9182J8338
17195G517j08115J7821o0217j21399m8387K1704l0396j62697p0650J33962K68796
17184a52061L79546J13641j4516p3573N1469j08375Q4836l6686N1916j61510j2051
17173A22636l8797q4113j10468r7289O0123n7097o6319K9160Q0019J25210P2732
17162C5797P2286p8570j74514j5572q784M5723p4531J03713J38310J19728l0649
17151A32937J09655j41555L421n5534L6214j13737m8353o7679k09319r4480O8351
17140c80079K34720m4169R6925L76324j84587j69168K66604l8035m07447k06459
17130d55371J18378j17019N0690J98126j74108Q7389L49302k3795l4754j00231
$$ plain form
17120 -101393 -65374 14551 70077 109468 196708 142713 92722 -41882 100710 124049 -22885
17109 -22885 12032 -10879 -84821 70444 315061 51556 -240071 -366904 -180794 31133
17099 31133 79010 -114803 -144930 -114624 -354456 -609890 -604017 -456243 -248171 -292011 -220940
17088 -220940 -94755 -77296 -296797 -382731 -387639 -299032 -187881 -147437 -227189 -280604 -295997
17077 -295997 -173099 80056 175627 44724 63932 44418 -88485 -191049 -20156 53416
17067 53416 136297 212419 269509 164886 99240 56672 -60573 -107569 -128854 10116 203363
17056 203363 51483 -150086 -151383 -78168 -64971 -26622 -166814 -291786 -608859 -353600
17046 -353600 -177772 -15804 300060 -21126 -64129 345578 271766 141418 -7337 -54694
$$ packed form
17120a01393L6019P9925N5526L9391Q7240n3995m9991j34604J42592K3339j46934
17109b2885L4917k2911p3942J55265K44617k63505k91627j26833J86110K11927
17099C1133M7877j93813l0127L0306k39832k55434N873J47774K08072m3840P1071
17088b20940J26185J7459k19501q5934m908Q8607J11151M0444p9752n3415j5393
17077b95997J22898K53155R5571j30903J9208j9514j32903j02564J70893P3572
17067E3416Q2881P6122N7090j04623o5646m2568j17245m6996k1285J38970J93247
17056B03363j51880k01569j297P3215J3197L8349j40192j24972l17073K55259
17046c53600J75828J61968L15864l21186m3003M09707p3812j30348j48755m7357
$$ plain form
17036 -54694 -61513 15891 -19166 -64722 -12803 -26163 -172655 -267904 181880 332777 334566
17025 334566 107984 -61000 -52101 -78071 -91585 -16605 248195 51230 -64157 -325328
17015 -325328 -721604 -576783 -508209 -305082 -212787 -79635 -69122 -26713 -141223 -484458
17005 -484458 -431183 -326330 -275613 -275643 65370 145667 73998 123585 110474 -242837 -362974
16994 -362974 -227073 -315750 -215682 -229399 -380187 -354741 -437159 -312721 -460431 -278513
16984 -278513 62772 -29850 -47348 13206 -113586 -402786 -293858 -156285 -170362 -156859
16974 -156859 28302 -95541 -155175 -212746 -179613 -59248 -121839 -224176 -155065 -292165
16964 -292165 -252426 55682 154081 82815 52155 186701 297548 196057 228990 228746 180094
$$ packed form
17036e4694o819P7404l5057m5556N1919j3360j46492r5249M49784J50897J789
17025C34566k26582j68984Q899k5970j3514P4980K64800j96965j15387k61171
17015c25328l96276J44821O8574K03127R2295J33152J0513M2409j14510l43235
17005d84458N3275J04853N0717l0L41013Q0297p1669M9587j3111l53311j20137
16994c62974J35901q8677J00068j3717j50788K5446q2418J24438j47710J81918
16984b78513L41285r2622j7498O0554j26792k89200J08928J37573j4077J3503
16974a56859J85161j23843n9634n7571L3133J20365o2591j02337O9111j37100
16964b92165L9739L08108R8399p1266l0660J34546J10847j01491L2933k44m8652
$$ plain form
16953 180094 55111 -194471 -129730 -21362 -193056 -175542 -50472 150193 335677 204416
16943 204416 -145496 -310999 -319344 -247060 -374285 -307481 -37804 -163147 -202629 -74464
16933 -74464 -421425 -403513 -124544 -63167 226920 214015 -9877 -267747 -396271 -403718 -225787
16922 -225787 -151644 -257478 -353636 -417741 -244637 -230477 -286016 -217960 -253553 -258578 -271913
16911 -271913 -241810 -173847 -242481 -96106 -153977 -86211 -184111 -333471 -388581 -316520 -252963
16900 -252963 -229531 -222035 -284915 -106306 23328 85419 427693 548747 353594 -100525
16890 -100525 -162206 78892 84199 -44751 -72205 88 83457 100966 -72829 -310967 -245997
16879 -245997 -222696 -487994 -325341 -92927 -222702 -384008 -420150 -442494 -398549 -215068
$$ packed form
16953A80094j24983k49582O4741J08368j71694J7514J25070K00665J85484j31261
16943B04416l49912j65503q345P2284j27225O6804K69677j25343l9482J28165
16933g4464l46961J7912K78969O1377K90087j2905k23892k57870j28524p447J77931
16922b25787P4143j05834r6158o4105J73104J4160n5539O8056l5593n025j3335
16911b71913L0103O7963o8634J46375n7871O7766r7900j49360n5110P2061O3557
16900b52963K3432P496o2880J78609J29634O2091L42274J21054j95153m54119
16890a00525o1681K41098N307j28950k7454P2293Q3369J7509j73795k38138O4970
16879b45997K3301k65298J62653K32414j29775j61306l6142k2344M3945J83481
$$ plain form
16869 -215068 -155705 -28101 6903 -143941 -114755 -246986 -249068 -192493 -202145 -45341 -48877
16858 -48877 -105179 -338478 -346060 -59248 48496 -127871 -288238 -465337 -616273 -597401
16848 -597401 -434572 -254189 -128307 12395 117223 78503 47957 -78988 -114876 -289630
16838 -289630 -418471 -296458 45600 176211 175216 163329 -72128 -141002 -231893 -29072 -124100
16827 -124100 -263820 -339341 -383920 -305347 -25564 60978 61009 54816 -51767 95254 286300
16816 286300 201931 105285 24382 -57311 -371977 -282873 190384 205241 -109324 -229649 -54960
16805 -54960 -55495 -131103 -45706 66472 142068 111941 25687 -105737 -286345 -71843 110364
16794 110364 -99840 -257607 40195 19482 -488816 -362868 -48055 -193977 -422723 -470190
$$ packed form
16869b15068N9363J27604L5004j50844K9186j32231k082N6575r652J56804l536
16858d8877n6302k33299p582K86812J07744j76367j60367j77099j50936J8872
16848e97401J62829J80383J25882J40702J04828l8720l0546j26945l5888j74754
16838b89630j28841J22013L42058J30611r95j1887k35457o8874r0891K02821r5028
16827a24100j39720p5521m4579P8573K79783Q6542L1o193j06583J47021J91046
16816B86300q4369r6646q0903q1693l14666Q9104M73257J4857l14565j20325J74689
16805e4960n35p5608Q5397J12178P5596l0127q6254j31424j80608K14502J82207
16794A10364k10204j57767K97802k0713n08298J25948L14813j45922k28746m7467
$$ plain form
16784 -470190 -369448 -317658 -276365 -156225 -175296 -103631 -28037 -51451 80993 62051 87761
16773 87761 27780 -214939 -201471 -282844 -391850 -510386 -186608 -113446 -224474 -306365 -165234
16762 -165234 -272241 -355297 -450532 -428976 -594816 -151150 215415 296986 418142 451008
16752 451008 442723 306504 393361 364134 303306 208569 -47711 -198520 -204931 23201 124949
16741 124949 -90767 -246871 -353853 -158094 -173196 -404122 -412967 -201961 -64098 -228506
16731 -228506 -279348 -88195 -50511 29212 -120822 -155782 -185172 -284296 53368 245063 23569
16720 23569 -219073 -354288 -224662 -190237 -78602 -114760 -264670 -199763 22751 267932
16710 267932 201495 42930 -111679 -215413 -250972 -321874 -599022 -742921 -564329 -216714
$$ packed form
16784d70190J00742N1790M1293J20140j9071P1665P5594k3414J32444j8942K5710
16773H7761n9981k42719J3468q1373j09006j18536L23778P3162j11028q1891J41131
16762a65234j07007q3056r5235K1556j65840M43666L66565Q1571J21156L2866
16752D51008q285j36219Q6857k9227o0828r4737k56280j50809o411K28132J01748
16741A24949k15716j56104j06982J95759j5102k30926q845K11006J37863j64408
16731b28506n0842J91153L7684P9723j50034l4960k9390r9124L37664J91695k21494
16720B3569k42642j35215J29626L4425J11635l6158j49910O4907K22514K45181
16710B67932o6437j58565j54609j03734l5559p0902k77148j43899J78592L47615
$$ plain form
16700 -216714 -19049 -432692 -569334 -311588 -119493 -103919 71402 -63643 -243214 -141708
16690 -141708 12102 77713 152074 -32777 -15255 -104962 -28317 21710 -123578 -177509 -160431
16679 -160431 5305 75478 169973 187670 138845 200768 465744 371937 103733 159392 92867
16668 92867 -100038 173018 497611 595215 276403 79211 -36136 -242285 -100013 -87162
16658 -87162 -120300 -275882 -365314 -166484 -234375 -204090 -247328 -376749 -206969 32187 238979
16647 238979 320821 333318 108203 100614 -175335 -263257 -271444 -274678 -71279 -23507 20781
16636 20781 203296 156524 270944 -51978 -142235 -161361 -104771 -259063 -394400 -370204 -295320
16625 -295320 -304096 -335748 -262959 -168549 -131209 -137617 -396660 -418260 -438059 -99215 -33063
$$ packed form
16700b16714J97665m13643j36642K57746J92095J5574J75321j35045j79571J01506
16690a41708J53810O5611P4361j84851J7522q9707P6645N0027j45288n3931J7078
16679a60431J65736P0173R4495J7697m8825O1923K64976r3807k68204N5659o6525
16668I2867j92905K73056L24593R7604l18812j97192j15347k06149J42272J2851
16658h7162l3138j55582q9432J98830o7891L0285m3238j29421J69780K39156K06792
16647B38979Q1842J2497k25115p589k75949q7922q187l234K03399M7772M4288
16636B0781J82515m6772J14420l22922r0257j9126N6590j54292j35337K4196P4884
16625b95320q776l1652P2789R4410L7340o408k59043k1600j9799L38844O6152
$$ plain form
16614 -33063 -33274 -136129 -144837 -43146 -149904 -166618 -85654 -98128 -171116 -437099 -445403 -108281
16602 -108281 83412 -7019 -24087 -91454 -166742 -266797 -181008 -135169 -115288 46671 -93149
16591 -93149 -280251 -499691 -337439 -229214 -83706 128567 53301 15178 244782 209431
16581 209431 223725 89033 -299567 -448795 -479568 -571863 -545615 -279431 -264920 -282161 -190755
16570 -190755 -79291 1387 87582 20898 -47721 -275439 -146772 -253367 -120627 -121582 -250177
16559 -250177 -198442 -33943 56580 9503 -29728 -35135 -16832 -255649 -316510 -357703 -508418
16548 -508418 -498799 -191793 -112108 -338753 -485476 -413270 -231067 4632 103311 29690 58233
16537 58233 88501 101033 248417 392373 487270 381594 293752 97335 -86569 -181891 62090
$$ packed form
16614c3063k11j02855q708J01691j06758j6714Q0964j2474p2988k65983q304L37122
16602a08281J91693r0431j7068o7367p5288j00055Q5789M5839J9881J61959j39820
16591i3149j87102k19440J62252J08225J45508K12273p5266l8123K29604l5351
16581B09431J4294j34692l88600j49228l0773r2295K6248K66184J4511j7241R1406
16570a90755J11464Q0678Q6195o6684o8619k27718J28667j06595J32740r55j28595
16559b50177N1735J64499R0523m7077l9231n407J8303k38817o0861m1193j50715
16548e08418R619L07006P9685k26645j46723P2206J82203K35699R8679p3621K8543
16537E8233L0268J2532J47384J43956R4897j05676q7842j96417j83904r5322K43981
$$ plain form
16526 62090 68500 101502 167389 121760 -41619 11761 -100241 -62853 -109078 -106765 -49641 33891
16514 33891 -107133 -69866 -114614 15629 117093 -23296 -34283 132830 245284 162534
16504 162534 -59826 -256832 -187552 -316409 -241934 -278861 -177638 -388258 -672315 -597214
16494 -597214 -246931 -96263 -231911 -43502 -525 -93107 -348527 -368145 -106092 55427
16484 55427 -140306 -246823 -414591 -307765 -258978 -330622 -188994 -268590 -352430 -449982 -404233
16473 -404233 -151152 43124 -159545 -250265 -212678 -201402 -37935 -123702 -444400 -351143
16463 -351143 -444712 -583309 -722498 -671157 -303709 -271770 -447885 -352198 -346241 -331809 -335096
16452 -335096 -59971 143382 139479 -161034 -220784 -41807 -115083 -86559 -41093 -99035 -186224
$$ packed form
16526F2090O410L3002O5887m5629j63379N3380j12002L7388m6225K313N7124Q3532
16514C3891j41024L7267m4748J30243J01464j40389j0987J67113J12454q2750
16504A62534k22360j97006O9280j28857P4475l6927J01223k10620k84057P5101
16494e97214L50283J50668j35648J88409M2977r2582k55420j9618K62053J61519
16484E5427j95733j06517j67768J06826M8787p1644J41628p9596q3840r7552M5749
16473d04233K53081J94276k02669r0720L7587J1276J63467q5767l20698R3257
16463c51143r3569j38597j39189N1341L67448L1939j76115R5687N957J4432l287
16452c35096K75125K03353l903l00513n9750J78977p3276K8524M5466n7942q7189
$$ plain form
16441 -186224 -224831 -393186 -599644 -596629 -460761 -168437 -34344 203271 414589 427517
16431 427517 256138 122716 -247396 -293301 -133619 -69084 -156562 -18348 97872 94877
16421 94877 54086 422978 571421 301522 -127978 -269267 -47106 -180635 -159456 -45130
16411 -45130 -7005 42084 -148197 -106299 -19726 -117975 81015 211301 344036 370087 -21349
16400 -21349 -192731 -22655 71072 31617 -151770 -181706 -25731 -93648 -151109 -216527 -342486
16389 -342486 -469749 -608175 -605130 -506180 -363153 -371456 -225019 -165459 -161954 -9853 264151
16378 264151 33830 29864 83947 -19419 107524 195616 135747 -244310 -505797 -355826
16368 -355826 -258761 -169076 -304265 -73211 68944 250371 251263 92541 57778 -160062 -378457
$$ packed form
16441a86224l8607j68355k06458L015J35868K92324J34093K37615K11318J2928
16431D27517j71379j33422l70112m5905J59682O4535q7478J38214J16220k995
16421I4877m0791L68892J48443k69899m29500j41289K22161j33529K1179J14326
16411d5130L8125M9089j90281M1898Q6573r8249J98990J30286J32735K6051l91436
16400b1349j71382J70076R3727l9455j83387k9936J55975o7917n7461o5418j25959
16389c42486j27263j38426L045R8950J43027q303J46437N9560L505J52101K74004
16378B64151k30321l966N4083j03366J26943Q8092n9869l80057k61487J49971
16368c55826R7065Q9685j35189K31054J42155J81427Q92j58722l4763k17840k18395
$$ plain form
16357 -378457 -261565 -65410 -233507 -224691 -101567 21736 110920 31594 -64156 23972 217224
16346 217224 559518 527037 268025 341157 252584 315640 390192 291884 223546 329107 417001
16335 417001 147325 15615 -9091 -117549 -42561 -37225 41774 -91776 -180721 -158280 -144068
16324 -144068 -246643 -252588 -322230 -372496 -412074 -406458 -363893 -393444 -249650 -11897 155447
16313 155447 76489 -35796 56866 -29833 -202976 -286056 -68338 235778 259865 391603
16303 391603 358219 100737 -20596 -162185 -126367 -104780 -344292 -659562 -639659 -594942
16293 -594942 -650944 -471291 16669 -14222 62074 61987 109389 273572 211976 162779 -97300
16282 -97300 -374411 -209260 -196207 -294786 -133215 -16400 -189071 -259328 45316 -210355
$$ packed form
16357c78457J16892J96155j68097Q816J23124J23303Q9184p9326r5750Q8128J93252
16346B17224L42294l2481k59012P3132q8573O3056P4552r8308o8338J05561Q7894
16335D17001k69676j31710k4706j08458P4988N336P8999j33550q8945K2441J4212
16324a44068j02575n945o9642n0266l9578N616M2565k9551J43794K37753J67344
16313A55447p8958j12285R2662q6699j73143q3080K17718L04116K4087J31738
16303C91603l3384k57482j21333j41589L5818K1587k39512l15270J9903M4717
16293e94942n6002J79653M87960l0891P6296q7M7402J64183o1596m9197k60079
16282i7300k77111J65151J3053r8579J61571J16815j72671p0257L04644k55671
$$ plain form
16272 -210355 -260115 -99001 239206 129015 -138544 -195718 -188919 -37652 -41655 -71518 -236315
16261 -236315 -366935 -587720 -597411 -594509 -350868 -56796 140496 -18472 -54076 299427
16251 299427 222157 128561 135517 112413 51156 33840 25193 -163386 -93267 -212500 -151655
16240 -151655 -36224 -159644 -59049 -75013 -108129 -212778 -111493 140136 13340 -208945
16230 -208945 -46603 109794 35275 106617 139266 -50464 -60506 -100317 -276096 -377842
16220 -377842 -233153 -258704 -197563 -76673 32606 -7466 -150159 -163025 6614 -50206
16210 -50206 -144708 -299304 -239104 -162968 -291041 -450485 -406606 -420302 -354676 -305387 -448584
16199 -448584 -409533 -350895 -165555 8570 197364 320210 163257 -32938 -174554 -209385
$$ packed form
16272b10355m9760J61114L38207j10191k67559n7174O799J51267m003k9863j64797
16261b36315j30620k20785r691K902K43641K94072J97292j58968l5604L53503
16251B99427p7270r3596O956k3104o1257j7316q647j88579P0119j19233O0845
16240a51655J15431j23420J00595j5964l3116j04649J01285K51629j26796k22285
16230b08945J62342J56397p4519P1342L2649j89730j0042l9811j75779j01746
16220c77842J44689k5551O1141J20890J09279m0072j42693j2866J69639n6820
16210e0206r4502j54596O0200P6136j28073j59444M3879j3696O5626M9289j43197
16199d48584L9051N8638J85340J74125J88794J22846j56953j96195j41616l4831
$$ plain form
16189 -209385 -41666 165183 111275 -17829 111038 245060 -38142 -189850 -269162 -410340
16179 -410340 -337963 -262008 -36537 38714 13155 -80086 -188935 30315 -243065 -401714
16169 -401714 -209603 -13751 89718 101646 -64823 -241546 -173207 -298763 -233766 -123040
16159 -123040 -198362 -137862 1697 -121753 -445837 -633977 -355657 -70712 -118784 -287809
16149 -287809 -337942 -304021 -419360 -486303 -446145 -137318 23467 -144884 -147788 -66482 -53752
16138 -53752 -55179 6552 -262957 -373971 -408043 -340061 -163349 -145094 -25124 -19859 -322052
16127 -322052 -415053 -287545 -197990 -130051 -327876 -478002 -411523 -365828 -96184 -64245 72668
16116 72668 288193 -14289 -135095 -223251 -229896 -86447 -66389 -219790 -333177 -313128 -354688
$$ packed form
16189b09385J67719K06849n3908j29104J28867J34022k83202j51708p9312j41178
16179d10340P2377P5955K25471P5251k5559r3241j08849K19250k73380j58649
16169d01714J92111J95852J03469J1928j66469j76723O8339j25556O4997J10726
16159a23040p5322O0500J39559j23450l24084j88140K78320K84945m8072j69025
16149b87809n0133L3921j15339o6943M0158L08827J60785j68351k904Q1306J2730
16138e3752j427O1731k69509j11014l4072O7982J76712J8255J19970N265l02193
16127c22052r3001J27508Q9555O7939j97825j50126O6479M5695K69644L1939J36913
16116G2668K15525l02482j20806q8156o645J43449K0058j53401j13387K0049m1560
$$ plain form
16105 -354688 -303548 -203708 -90816 -106032 -320749 -205216 -43439 -251661 -373194 -207453
16095 -207453 -148669 -215624 -104673 29780 85670 65722 50279 57427 98745 -204389 -359462
16084 -359462 -421402 -394195 -307700 -151126 -175947 -117710 8018 -18877 -42383 -51218 -5173
16073 -5173 72859 -127946 -444919 -487670 -196009 108783 78173 113734 254189 385084 294160
16062 294160 -51903 -172487 -83013 181712 274294 206441 43418 -115472 -190041 -75193
16052 -75193 16724 153280 176035 262595 199423 275575 407795 569010 418219 396322 504851
16041 504851 630733 621831 470864 222215 -219089 -489520 -615166 -544367 -179001 -1204
16031 -1204 -39131 44981 35218 -3464 148325 -106803 -383389 -293119 -22053 35497 -262996
$$ packed form
16105c54688N1140R9840J12892j5216k14717J15533J61777k08222j21533J65741
16095b07453N8784o6955J10951J34453N5890j9948j5443P148M1318l03134j55073
16084c59462o1940K7207Q6495J56574k4821N8237J25728k6895k3506q835M6045
16073e173P8032k00805l16973m2751K91661L04792l0610L5561J40455J30895r0924
16062B94160l46063j20584Q9474K64725R2582o7853j63023j58890p4569J14848
16052g5193R1917J36556K2755Q6560o3172P6152J32220J61215j50791k1897J08529
16041E04851J25882q902j50967k48649m41304k70431j25646P0799L65366J77797
16031a204l7927Q4112r763l8682J51789k55128k76586R0270K71066N7550k98493
$$ plain form
16020 -262996 -184441 -178195 -226574 -89380 -220888 -361341 -254190 -265133 -294034 -66629 -126073
16009 -126073 -128651 -54281 -106717 23713 57530 9046 -285 30443 116678 20822 19941 -128346
15997 -128346 -212497 -141476 -105719 -42763 -149322 -300954 -445084 -811426 -723769 -407523
15987 -407523 -430022 -596848 -712183 -557824 -129535 -248193 -120284 -38897 -145426 11820
15977 11820 -126403 -235754 -170415 -88360 -76083 43843 40803 24804 -143230 -115683 110250
15966 110250 535229 503262 354223 427945 439934 459689 45703 -440601 -492019 -474784 -211496
15955 -211496 -22147 -311987 -406430 -273374 -103361 14214 37948 164881 389841 218337
15945 218337 -167151 -52591 24283 143574 253564 260711 188838 133834 -61932 -163713
$$ packed form
16020b62996P8555O246m8379J37194j31508j40453J07151j0943k8901K27405n9444
16009a26073k578P4370n2436J30430L3817m8484r331L0728Q6235r5856q81j48287
15997a28346q4151P1021L5757O2956j06559j51632j44130l66342Q7657L16246
15987d07523k2499j66826j15335J54359M28289j18658J27909Q1387j06529J57246
15977A1820j38223j09351O5339Q2055J2277J19926l040j5999j68034K7547K25933
15966A10250M24979l1967j49039P3722J1989J9755m13986m86304n1418J7235K63288
15955b11496J89349k89840r4443J33056J70013J17575K3734J26933K24960j71504
15945B18337l85488J14560P6874J19291J09990P147p1873n5004j95766j01781
$$ plain form
15935 -163713 -61158 133087 71444 -236428 -578103 -496386 -212129 -82320 131118 255915
15925 255915 100287 -265163 -280804 41517 244562 272597 203449 -16929 -125989 -107325
15915 -107325 -242972 -90077 -88300 28854 276681 324561 472137 325454 251013 198495
15905 198495 247717 171269 121869 16800 -42067 -65959 -152763 -257017 -307440 -87170 -202706
15894 -202706 -316816 -288726 -177988 -202669 -388205 -416722 -518763 -379624 -179430 -176027
15884 -176027 -368888 -234525 -268520 -412969 -496537 -448433 -253163 -82389 -207612 -62233
15874 -62233 -15325 -33790 -38851 -127211 -252478 -392901 -498177 -363289 -118390 255587 129575
15863 129575 166901 254560 217914 -2773 45716 -56797 -183464 -217672 -259599 -200095 -114589
$$ packed form
15935a63713J02555J94245o1643l07872l41675Q1717K84257J29809K13438J24797
15925B55915j55628l65450j5641L22321K03045K8035o9148k20378j09060J8664
15915a07325j35647J52895J777J17154K47827M7880J47576j46683p4441n2518
15905A98495M9222p6448m9400j05069n8867k3892q6804j04254n0423K20270j15536
15894b02706j14110K8090J10738k4681j85536k8517j02041J39139K00194L403
15884a76027j92861J34363l3995j44449q3568M8104J95270J70774j25223J45379
15874f2233M6908j8465n061q8360j25267j40423j05276J34888K44899L73977j26012
15863A29575L7326Q7659l6646k20687M8489j02513j26667l4208m1927N9504Q5506
$$ plain form
15852 -114589 12383 109755 235636 179068 184252 274368 493909 500358 225474 99575 156950
15841 156950 206837 80619 68572 15348 111994 -29993 -15001 -108357 -300039 -287746 -349614
15830 -349614 -159323 -231671 -312273 -270653 -178674 -10866 -17112 13339 30201 273850 227480
15819 227480 -133825 -262334 -278548 -148445 277595 366991 297795 386754 173212 -93629
15809 -93629 -180138 -194404 -197627 -77561 134252 -86639 -268309 -227845 -64828 -110762 -20546
15798 -20546 198276 -23964 -465983 -308328 30827 103942 -15723 -247138 -402176 -267906
15788 -267906 -286742 -346807 -408557 -414806 -275745 -52559 -113920 -64914 -108075 -202622 -184438
15777 -184438 -35813 122032 -68502 -87000 111166 286405 202050 12979 -7940 132874
$$ packed form
15852a14589J26972R7372J25881n6568N184R0116K19541O449k74884j25899N7375
15841A56950M9887j26218j2047n3224R6646j41987J4992r3356j91682J2293o1868
15830c49614J90291p2348q0602M1620R1979J67808o246L0451J6862K43649m6370
15819B27480l61305j28509j6214J30103M26040Q9396o9196Q8959k13542k66841
15809i3629q6509j4266l223J20066K11813k20891j81670M0464J63017m5934R0216
15798b0546K18822k22240m42019J57655L39155P3115j19665k31415j55038J34270
15788b67906j8836o0065o1750o249J39061K23186o1361M9006m3161r4547J8184
15777a84438J48625J57845j90534j8498J98166J75239q4355j89071k0919J40814
$$ plain form
15767 132874 313134 169575 50467 -10637 -200874 -111973 -303297 -429754 -472788 -171604
15757 -171604 -6086 173748 339349 373250 117265 -11958 219360 435522 450930 265268
15747 265268 131647 17685 -150656 19133 -160476 -423075 -435757 -219515 -115895 -84148
15737 -84148 -103810 -202041 57563 267361 287043 78761 -223879 -167576 -82793 -248456 -334705
15726 -334705 -167765 -61481 58245 203582 32834 -190405 -152734 259138 287412 261658
15716 261658 128125 -4813 -117420 -159339 -64503 61819 -86490 -182702 -154420 -89991
15706 -89991 41916 221055 217251 363705 497498 576827 634555 345075 -124454 -297282
15696 -297282 -175108 -186140 -350074 -228371 -55158 137571 310093 47016 -49693 -192276
$$ packed form
15767A32874J80260j43559j19108o1104j90237Q8901j91324j26457m3034L01184
15757a71604J65518J79834J65601L3901k55985j29223K31318K16162J5408j85662
15747B65268j33621j13962j68341J69789j79609k62599j2682K16242J03620L1747
15737h4148j9662r8231K59604K09798J9682k08282l02640N6303Q4783j65663q6249
15726c34705J66940J06284J19726J45337j70748k23239L7671M11872K8274k5754
15716B61658j33533j32938j12607m1919R4836J26322j48309r6212K8282O4429
15706h9991J31907J79139l804J46454J33793P9329N7728k89480m69529j72828
15696b97282J22174j1032j63934J21703J73213J92729J72522k63077r6709j42583
$$ plain form
15686 -192276 -502400 -509072 -298204 -64700 -62659 1621 -24715 -381 49618 -159787 -424586
15675 -424586 -394535 -318326 -29060 -82178 -301532 -479110 -396770 -271347 -331819 -466175
15665 -466175 -258252 -202360 -210041 -125052 -29145 73337 122362 25209 -270590 -330496 -73689
15654 -73689 -12240 3576 44163 110666 7003 -238122 -193732 27808 176507 152489 97526
15643 97526 18735 -230693 -181443 -52978 158763 317391 226938 -13401 -177043 -209704
15633 -209704 -90665 -30622 -113721 -300725 -401578 -376348 -288470 -210776 -188851 -73707 -46054
15622 -46054 -115933 -346213 -435594 -325494 -479218 -336965 -235335 -107870 -77691 -212228
15612 -212228 -251374 -129038 -166760 2388 -67065 1984 -13612 66784 -3790 -305066 -301059
$$ packed form
15686a92276l10124o672K10868K33504K041O4280k6336K4334M9999k09405k64799
15675d24586L0051P6209K89266n3118k19354j77578Q2340J25423o0472j34356
15665d66175K07923N5892p681Q4989R5907J02482M9025r7153k95799n9906K56807
15654g3689O1449J5816M0587O6503j03663k45125M4390K21540J48699k4018n4963
15643I7526p8791k49428M9250J28465K11741J58628r0453k40339j63642l2661
15633b09704J19039O0043q3099j87004j00853K5230Q7878P7694K1925J15144K7653
15622d6054o9879k30280q9381J10100j53724J42253J01630J27465L0179j34537
15612b12228l9146J22336l7722J69148o9453O9049j5596Q0396p0574l01276M007
$$ plain form
15601 -301059 -153667 177082 169065 -79914 -253935 -147693 -93461 -349638 -526316 -410659
15591 -410659 -159174 13758 -200515 -314411 -425055 -302766 8375 136381 2935 -287754
15581 -287754 -209146 -12290 -101316 -138653 -241188 -263889 -231461 -152098 -87066 5185 5392
15570 5392 127094 188265 106643 -45859 -19986 -98598 -269334 -154191 -208633 -337520 -235574
15559 -235574 -130379 -111436 -309391 -202672 -91770 -143069 -189099 -422 119033 -48856
15549 -48856 -376313 -442311 -194370 -33832 71524 -158990 -249058 -550197 -522200 -424611
15539 -424611 -526155 -636212 -321532 -203486 -55542 52922 103125 -17810 -26552 -144946
15529 -144946 -179796 -252416 -368097 -283134 -102027 -104031 -85692 -38336 36664 316203 93872
$$ packed form
15601c01059J47392L30749q017k48979j74021J06242N4232k56177j76678J15657
15591d10659K51485J72932k14273j13896j10644J22289L11141J28006j33446k90689
15581b87754P8608J96856q9026l7337j02535k2701L2428P9363O5032R2251K07
15570E392J21702O1171q1622j52502K5873p8612j70736J15143n4442j28887J01946
15559b35574J05195J8943j97955J06719J10902n1299m6030J88677J19455j67889
15549d8856l27457o5998K47941J60538J05356k30514r0068l01139K7997R7589
15539d24611j01544j10057L14680J18046J47944J08464N0203j20935q742j18394
15529a44946l4850p2620j15681Q4963J81107k004J8339M7356P5000K79539k22331
$$ plain form
15518 93872 -116317 51082 -21292 -87840 -163428 -249184 -339127 -400412 -194160 -3983 192707
15507 192707 162230 94705 -45507 -80005 -84386 -6972 -94769 91104 406226 372361 187216
15496 187216 67042 74994 -35394 -12723 -113237 -69947 127043 155879 57889 102224 -30346
15485 -30346 -121789 -144244 -3827 123022 21518 33442 69916 129458 87692 216757 136032
15474 136032 8590 45897 -58013 -191462 -207190 -219229 11707 170135 112706 70064
15464 70064 45438 -216938 -28315 172504 269143 281893 483437 648546 574702 352835
15454 352835 118345 105569 71294 65172 106610 12618 -228528 -300996 -38710 86020 104936
15443 104936 -7325 -69642 -150573 -123167 -107991 -270679 -38775 208152 184615 119183 -111027
$$ packed form
15518I3872k10189J67399p2374o6548p5588q5756q9943o1285K06252J90177J96690
15507A92707l0477o7525j40212l4498m381P7414q7797J85873L15122l3865j85145
15496A87216j20174P952j10388K2671j00514M3290J96990K8836r7990M4335j32570
15485c0346r1443k2455J40417J26849j01504J1924L6474N9542m1766J29065q0725
15474A36032j27442L7307j03910j33449j5728j2039K30936J58428n7429m2642
15464G0064k4626k62376J88623K00819R6639J2750K01544J65109p3844k21867
15454C52835k34490j2776l4275o122M1438r3992k41146p2468K62286J24730J8916
15443A04936j12261o2317q0931K7406J5176j62688K31904K46927k3537o5432k30210
$$ plain form
15432 -111027 -102539 -31990 55899 -90577 -374626 -266965 -171171 -204426 -101542 -111452 -188685
15421 -188685 81242 -134333 -148972 14430 -132521 -295575 -381213 -202321 -146126 -174865
15411 -174865 -243821 -240655 -69742 -122728 -47332 -141852 -369907 -216521 -208724 -296443 -191844
15400 -191844 -335486 -447500 -369249 -288197 -453319 -300681 -27032 -36078 132219 112681
15390 112681 -14968 -415813 -516245 -409828 -256963 -65903 81454 -50888 -294638 -186583
15380 -186583 -24483 -234970 -366849 -427528 -226836 -95808 -148487 -447898 -466729 -348417
15370 -348417 -194489 -20468 75147 56588 -89591 -142136 150751 168997 141314 185935 -25136
15359 -25136 -122231 -287602 -247468 -72332 -86310 130316 144419 122356 149547 75666 275597
$$ packed form
15432a11027Q488P0549Q7889j46476k84049J07661R5794l3255J02884r910p7233
15421a88685K69927k15575j4639J63402j46951j63054q5638J78892N6195k8739
15411a74865o8956L166J70913n2986P5396r4520k28055J53386P797q7719J04599
15400a91844j43642j12014P8251Q1052j65122J52638K73649r046J68297j9538
15390A12681j27649m00845j00432J06417J52865J91060J47357j32342k43750J08055
15380a86583J62100k10487j31879o0679K00692J31028n2679k99411j8831J18312
15370c48417J53928J74021R5615j8559j46179n2545K92887J8246k7683M4621k11071
15359b5136r7095j65371M0134J75136j3978K16626J4103k2063K7191p3881J99931
$$ plain form
15348 275597 374216 219549 158049 47677 -272215 -364928 -67324 169792 322341 358809
15338 358809 187224 -76414 -190863 -178204 -5906 -41455 12159 177811 -159874 -54695
15328 -54695 111884 5040 15437 68663 23769 154432 38517 -55952 -110461 -128732 -237865
15317 -237865 -182482 -19781 -81719 -155311 -58606 -113331 -236967 -80864 106277 209589
15307 209589 57210 171344 225656 52146 -161056 -147610 -160540 -420109 -439961 -518108
15297 -518108 -560805 -540248 -618905 -629225 -690587 -537021 -353180 -337239 -236782 -233173 -150337
15286 -150337 -160191 -326198 -330346 -101037 -47285 67674 -2398 -31008 -92451 -329549 -463733
15275 -463733 -253453 -198953 -58204 91883 -26294 87816 258555 308827 243161 41213
$$ packed form
15348B75597R8619j54667o1500j10372l19892r2713K97604K37116J52549L6468
15338C58809j71585k63638j14449J2659J72298l5549N3614J65652l37685J05179
15328e4695J66579j06844J0397N3226m4894J30663j15915r4469n4509j8271j09133
15317b37865N5383J62701o1938p3592R6705n4725j23636J56103J87141J03312
15307B09589j52379J14134N4312j73510k13202J3446j2930k59569j9852p8147
15297e18108m2697K0557p8657j0320o1362J53566J83841J5941J00457L609Q2836
15286a50337r854j66007m148K29309N3752J14959p0072k8610o1443k37098j34184
15275d63733K10280N4500J40749J50087j18177J14110J70739N0272o5666k01948
$$ plain form
15265 41213 -223286 -2455 103824 191945 154794 129400 135803 9176 120885 11144 -40991
15254 -40991 7337 18308 -30644 -156574 -261433 -156856 -140939 -79624 -128601 -9289 -3603
15243 -3603 -28368 -165874 -381010 -308135 -25304 -16529 -294384 -212721 -2777 -148023 -399475
15232 -399475 -482117 -357758 -342226 -237717 -228534 -156412 63237 -47622 -133721 190026 376545
15221 376545 238671 54435 47941 105821 -18521 -44170 -18126 104698 1283 -69195 -86896
15210 -86896 -228010 -301930 -373496 -444351 -423496 -271589 -117107 -118168 -138674 -293733 -381154
15199 -381154 -369874 -398023 -347887 -149272 -36796 3169 169367 122107 -63170 -204685
15189 -204685 -270532 -211404 -17367 83082 -46873 13953 175711 116960 78341 155138 137461
$$ packed form
15265D1213k64499K20831J06279Q8121l7151k5394O403j26627J11709j09741n2135
15254d0991M8328J0971m8952j25930j04859J04577J5917O1315m8977J19312N686
15243c603k4765j37506k15136P2875K82831Q775k77855Q1663K09944j45246k51452
15232c99475q2642J24359J5532J04509R183P2122K19649j10859q6099L23747J86519
15221C76545j37874j84236o494N7880j24342k5649K6044J22824j03415p0478j7701
15210h6896j41114p3920p1566p0855K0855J51907J54482j061k0506j55059q7421
15199c81154J1280k8149N0136J98615J12476L9965J66198m7260j85277j41515
15189b04685o5847N9128J94037J00449j29955O0826J61758n8751l8619P6797j7677
$$ plain form
15178 137461 34552 -119007 -261713 -214013 -245221 -35972 18939 59710 174655 216741
15168 216741 111491 -119369 -210285 -27195 257748 242067 314645 253725 18884 -182274
15158 -182274 -165595 -5216 126480 32282 -281294 -503156 -425279 -253605 -195739 8570
15148 8570 -22387 -126369 -98210 9090 90082 5441 -87236 -43917 133683 105778 72854
15137 72854 379067 373728 241956 41502 18607 90876 237629 376507 93362 -117622
$$ packed form
15178A37461j02909j53559j42706M7700l1208K09249N4911M0771J14945M2086
15168B16741j05250k30860r0916J83090K84943j5681P2578o0920k34841k01158
15158a82274J6679J60379J31696r4198l13576k21862P7877J71674N7866K04309
15148H570l0957j03982K8159J07300Q0992q4641r2677M3319J77600k7905l2924
15137G2854L06213n339j31772k00454k2895P2269J46753J38878k83145k10984
$$ [...]
##END NTUPLES=NMR SPECTRUM
##END=
