##TITLE=Analysis number 326866
Compound Code cc 63824
Book Reference 511/86
Project Code adrs
Chemist Name stevem
##JCAMPDX= 6.0         $$ Bruker NMR JCAMP-DX V2.0
##DATA TYPE= NMR SPECTRUM
##DATA CLASS= NTUPLES
##ORIGIN= Bruker BioSpin GmbH
##OWNER= nmr
$$ XWIN-NMR		Version 3.5
$$ Mon Feb 26 14:18:02 2007 GMT Standard Time (UT+0h)  MAYBRIDGE\nmr@NMR_250MHZ
##.OBSERVE FREQUENCY= 250.131544655141
##.OBSERVE NUCLEUS= ^1H
##.ACQUISITION MODE= SIMULTANEOUS (DQD)
##.ACQUISITION SCHEME= undefined
##.AVERAGES= 16
##.DIGITISER RES= 18
##SPECTROMETER/DATA SYSTEM= dpx250
##.PULSE SEQUENCE= zg30
##.SOLVENT NAME= CDCl3
##.SHIFT REFERENCE= (INTERNAL, CDCl3, 0, 16.4524)
##AUDIT TRAIL= $$ (NUMBER, WHEN, WHO, WHERE, WHAT)
$$ ##TITLE= Audit trail, XWIN-NMR		Version 3.5
$$ ##JCAMPDX= 5.01
$$ ##ORIGIN= Bruker BioSpin GmbH
$$ ##OWNER= nmr
$$ C:\u/data/dgb/nmr/ADRS/1970/pdata/1/auditp.txt
$$ ##AUDIT TRAIL=  $$ (NUMBER, WHEN, WHO, WHERE, WHAT)
(   1,<2007-02-26 14:17:40.35 +000>,<MAYBRIDGE\nmr>,<NMR_250MHZ>,
      <created by zg, POWCHK disabled, PULCHK disabled
       configuration hash MD5:
       49 4B E0 1D 92 C2 6B 37 9F E6 65 BC 52 41 86 1D
       data hash MD5: 64K
       5C 06 1A B4 34 7A 80 E0 35 AB 50 D7 BC 81 FB 76>)
(   2,<2007-02-26 14:17:53.11 +000>,<MAYBRIDGE\nmr>,<NMR_250MHZ>,
      <Start of raw data processing
       ef LB = 0.3 FT_mod = 6 PKNL = 1 SI = 32K 
       data hash MD5: 32K
       18 3C 73 67 41 4E A8 DC C6 EA 05 60 50 68 59 36>)
(   3,<2007-02-26 14:17:54.79 +000>,<MAYBRIDGE\nmr>,<NMR_250MHZ>,
      <apk 
       data hash MD5: 32K
       AD B8 DB 26 5C 93 28 07 0D C9 CF FE 72 06 BF 61>)
(   4,<2007-02-26 14:17:55.47 +000>,<MAYBRIDGE\nmr>,<NMR_250MHZ>,
      <abs ABSG = 5 
       data hash MD5: 32K
       6A 8C 3E E9 20 8B 96 C5 5D 74 DD FE 4F AD 07 0D>)
$$ ##END=
$$ 
$$ hash MD5
$$ CE 17 E9 30 72 6B 3E 7A 2E 00 17 B1 67 E1 B1 5D
##$RELAX= 
##$RELAX= 
##$RELAX= 
##$RELAX= 
##$RELAX= 
##$RELAX= 
##$RELAX= 
$$ Bruker specific parameters
$$ --------------------------
##$DU= <C:\u>
##$EXPNO= 1970
##$NAME= <ADRS>
##$PROCNO= 1
##$TYPE= <nmr>
##$USER= <dgb>
##$AMP= (0..31)
100 100 100 100 100 100 100 100 100 100 100 100 100 100 100 100 100 100 
100 100 100 100 100 100 100 100 100 100 100 100 100 100 
##$AQSEQ= 0
##$AQ_mod= 3
##$AUNM= <au_zg>
##$AUTOPOS= <32 >
##$BF1= 250.13
##$BF2= 250.13
##$BF3= 250.13
##$BF4= 250.13
##$BF5= 500.13
##$BF6= 500.13
##$BF7= 500.13
##$BF8= 500.13
##$BYTORDA= 1
##$CFDGTYP= 0
##$CFRGTYP= 5
##$CHEMSTR= <none>
##$CNST= (0..31)
1 1 145 1 1 1 1 1 1 1 1 1 1 1 1 1 1 1 1 1 1 1 1 1 1 1 1 1 1 1 1 1 
##$CPDPRG= <>
##$CPDPRG1= <>
##$CPDPRG2= <>
##$CPDPRG3= <>
##$CPDPRG4= <mlev>
##$CPDPRG5= <mlev>
##$CPDPRG6= <mlev>
##$CPDPRG7= <mlev>
##$CPDPRG8= <mlev>
##$CPDPRGB= <>
##$CPDPRGT= <>
##$D= (0..31)
0 1 0 0 0 0 0 0 0 0.06 0 0 0 0 0 0 0.0002 0 0 0 0 0 0 0 0 0 0 0 0 0 0 
0 
##$DATE= 1172499459
##$DBL= (0..7)
120 120 120 120 120 120 120 120 
##$DBP= (0..7)
150 150 150 150 150 150 150 150 
##$DBP07= 0
##$DBPNAM0= <>
##$DBPNAM1= <>
$$ [...]
##$SUBNAM7= <"">
##$SUBNAM8= <"">
##$SUBNAM9= <"">
##$SW= 20.6930455092707
##$SWIBOX= (0..15)
0 0 3 0 0 0 0 0 0 0 0 0 0 0 0 0 
##$SW_h= 5175.983436853
##$TD= 65536
##$TD0= 1
##$TE= 295.16
##$TE2= 300
##$TE3= 300
##$TEG= 300
##$TL= (0..7)
0 120 120 120 120 120 120 120 
##$TP= (0..7)
150 150 150 150 150 150 150 150 
##$TP07= 0
##$TPNAME0= <>
##$TPNAME1= <>
##$TPNAME2= <>
##$TPNAME3= <>
##$TPNAME4= <>
##$TPNAME5= <>
##$TPNAME6= <>
##$TPNAME7= <>
##$TPOAL= (0..7)
0.5 0.5 0.5 0.5 0.5 0.5 0.5 0.5 
##$TPOFFS= (0..7)
0 0 0 0 0 0 0 0 
##$TUNHIN= 0
##$TUNHOUT= 0
##$TUNXOUT= 0
##$USERA1= <user>
##$USERA2= <user>
##$USERA3= <user>
##$USERA4= <user>
##$USERA5= <user>
##$V9= 5
##$VALIST= <valist>
##$VCLIST= <CCCCCCCCCCCCCCC>
##$VD= 0
##$VDLIST= <DDDDDDDDDDDDDDD>
##$VPLIST= <PPPPPPPPPPPPPPP>
##$VTLIST= <TTTTTTTTTTTTTTT>
##$WBST= 1024
##$WBSW= 4
##$XGAIN= (0..3)
0 0 0 0 
##$XL= 0
##$YL= 0
##$YMAX_a= 246405
##$YMIN_a= -325866
##$ZGOPTNS= <>
##$ZL1= 120
##$ZL2= 120
##$ZL3= 120
##$ZL4= 120
##$ABSF1= 16.45236
##$ABSF2= -4.240812
##$ABSG= 5
##$ABSL= 3
##$ALPHA= 0
##$AQORDER= 0
##$ASSFAC= 0
##$ASSFACI= 0
##$ASSFACX= 0
##$ASSWID= 0
##$AUNMP= <proc_1d>
##$AZFE= 0.1
##$AZFW= 0.1
##$BCFW= 0
##$BC_mod= 0
##$BYTORDP= 0
##$COROFFS= 0
##$CY= 12.5
##$DATMOD= 1
##$DC= 0
##$DFILT= <>
##$DTYPP= 0
##$F1P= 14.0000005364418
##$F2P= -0.99999901652339
##$FCOR= 0.5
##$FTSIZE= 32768
##$FT_mod= 6
##$GAMMA= 0
##$GB= 0
##$INTBC= 1
##$INTSCL= 1
##$ISEN= 128
##$LB= 0.3
##$LEV0= 0
##$LPBIN= 0
##$MAXI= 10000
##$MC2= 0
##$MEAN= 0
##$ME_mod= 0
##$MI= 0
##$NCOEF= 0
##$NC_proc= -5
##$NLEV= 6
##$NOISF1= 0
##$NOISF2= 0
##$NSP= 0
##$NTH_PI= 0
##$NZP= 0
##$OFFSET= 16.45236
##$PC= 1
##$PHC0= 231.5732
##$PHC1= 8.251024
##$PH_mod= 1
##$PKNL= yes
##$PPARMOD= 0
##$PSCAL= 4
##$PSIGN= 0
##$REVERSE= no
##$SF= 250.130017418665
##$SI= 32768
##$SIGF1= 0
##$SIGF2= 0
##$SINO= 400
##$SIOLD= 32768
##$SREGLST= <1H.CDCl3>
##$SSB= 0
##$STSI= 32768
##$STSR= 0
##$SW_p= 5175.98343685301
##$SYMM= 0
##$S_DEV= 0
##$TDeff= 65536
##$TDoff= 0
##$TI= <Analysis number 999999
Compound Code 99
Book Reference 9
Project Code 9>
##$TILT= no
##$TM1= 0
##$TM2= 0
##$TOPLEV= 0
##$USERP1= <user>
##$USERP2= <user>
##$USERP3= <user>
##$USERP4= <user>
##$USERP5= <user>
##$WDW= 1
##$XDIM= 32768
##$YMAX_p= 345276606
##$YMIN_p= -680855
$$ End of Bruker specific parameters
$$ ---------------------------------
##NTUPLES= NMR SPECTRUM
##VAR_NAME=  FREQUENCY,     SPECTRUM/REAL,   SPECTRUM/IMAG
##SYMBOL=    X,             R,               I
##VAR_TYPE=  INDEPENDENT,   DEPENDENT,       DEPENDENT
##VAR_FORM=  AFFN,          ASDF,            ASDF
##VAR_DIM=   32768,         32768,           32768
##UNITS=     HZ,            ARBITRARY UNITS, ARBITRARY UNITS
##FACTOR=    0.157963299565203, 1,           1
##FIRST=     4115.22913169763, 0,            0
##LAST=      -1060.75430515538, 0,           0
##MIN=       -1060.75430515538, -680855,     0
##MAX=       4115.22913169763, 345276606,    0
$$ Real data points
##PAGE= N=1
##DATA TABLE= (X++(R..R)), XYDATA
$$ [...]
23306d9717Q6681O2478r0250J119J5539o4347q1030J50744P3423k803l8028J01263
23294A65072P1872l6674J9906q2887L404L5503j7042j3308n3877k34826j82038
23283c24895R9301K82151K30227M6779j48248j15070l4753N6912j79064q4196
23273a70856O0813Q8653O2581n9367k34809P1748M7227r818n0659n2541J34331
23262a12697R893J75300J04759l9861J8880j55044j3064Q0627M7201O443j27387
23251d950l2792l1433o6223N6408J5938N6318j69611o8746J13463P7748k7060
23240h0940j6561l3326j19520n7361l0082J02334n1441J45144j06669J16846J31112
23229d64O2056p1802J17347R6518j39248k68804J23778n7273Q0885M1489R0213
$$ y = [-49717, 36964, 99442, 9192, 10311, 25850, -38497, -119527, 31217, 104640, 101837, 63809, 165072, 236944, 200270, 220176, 137289, 140693, 176196, 159154, 145846, 91969, -142857, -324895, -225594, 56557, 286784, 333563, 185315, 70245, 35492, 92404, -86660, -170856, -110043, -21390, 41191, -18176, -252985, -181237, -134010, -143828, -194487, -247028, -112697, -102804, 72496, 177255, 137394, 156274, 1230, -11834, 68793, 115994, 122437, -4950, -37742, -69175, -135398, -78990, -63052, -6734, -176345, -245091, -131628, -53880, -80940, -97501, -130827, -250347, -307708, -337790, -235456, -286897, -141753, -248422, -131576, -464, 61592, -10210, 107137, 203655, 64407, -204397, -80619, -137892, -57007, -15518, 74695]
23218G4695J1215M6749L9253q3993j10230q9300P451j22781j65536P5128K52947
23207f4402J04595J06659j13470k2882l2069j88671j73859N3435N1156P3997K85100
23196G9589M184k30366q7223L5170N6811p7541J11119P5401J21779L1155k67810
23185a47732q1957J12037J27773O5161k48166j91723N8971l384O0555j2546K126
23174b58885M3212R9128L3561l2214o5735m460J86677n372o9631n4237o7338J8564
23162a76730l2391n1914J73679J58505j21972j35388O0868r8469j01490o4350
23152c89652O8695l0933k2051J9734J12768J82494p5985J6286m3728l9905M7352
23141a54925J22620M4477l7199P8850K4282N3612J78605N2507K2817j42066N2396
$$ y = [74695, 85910, 132659, 171912, 87919, -22311, -111611, -104160, -226941, -392477, -317349, -64402, 40193, 146852, 33382, 10500, -21569, -210240, -384099, -330664, -279508, -205511, 79589, 83773, -146593, -233816, -198646, -141835, -219376, -108257, -32856, 88923, 120078, -147732, -229689, -117652, 10121, 75282, -172884, -364607, -305636, -309020, -248465, -261011, -258885, -215673, -116545, -82984, -115198, -180933, -185393, 1284, -4088, -73719, -127956, -195294, -176730, -209121, -261035, -87356, 71149, -50823, -186211, -125343, -223812, -325302, -389652, -320957, -351890, -373941, -354207, -241439, -58945, -134930, -118644, -162372, -202277, -154925, -32305, 12172, -25027, 53823, 78105, 131717, 310322, 362829, 385646, 243580, 295976]
23130B95976P5960k3788R7726j71083k01270j41220j20648j67198J01638K09389
23120d4518J11439j80990p5150K5727J30132r9921k3233J80941K3466j65415J9992
23109i7530J37879L2333m4934j9185M2617p6407p8722Q6995m1151K5218L2035
23098h52K03433o3072l09914J19359J64709j58460j55187R4733K9591j0719n8141
23087a44520M7322J75558Q9624j53270p9947O4422M2753J7827l5959P9098q1157
23076B1751r2662J28334m823l047m5936n3190m1966M274K2476j6123j343l3497
23064a15752K7379J37067o0642m6503M436l1959J01346L2910j52043o9013Q6797
23053h5977L0553J19937K4444j56858r5922r6429Q9819J07451m1476J07167O06
$$ y = [295976, 371936, 348148, 445874, 274791, 73521, -67699, -188347, -355545, -253907, -44518, 66921, -114069, -189219, -163492, -33360, -133281, -156514, 24427, 47893, -117522, -97530, 40349, 72682, 27748, 8563, 51180, -25227, -103949, -16954, -58105, -32887, -852, 202581, 139509, -170405, -51046, 113663, -44797, -199984, -105251, -75660, -86379, -144520, -97198, 78360, 167984, 14714, -65233, -811, 41942, 59769, 23810, 102908, 21751, -70911, 57423, 52600, 49553, 3617, -49573, -91539, -87265, -64789, -80912, -82255, -115752, -88373, 48694, -11948, -58451, -54015, -85974, 15372, 48282, -103761, -172774, -85977, -55424, 64513, 88957, -67901, -163823, -260252, -170433, -62982, -104458, 2709, 3315]
23042C315r7584K3686J384Q1577K15673j75281j91379P9098P2807m0114j74348
23031b01166n3719K74380O7809j46147k56547L8586L860J23853J93126J51740
23021A95775j2138q6660q1234k6724J6138K9252j02378J57603Q8570l1371k07970
23010f1137p1286N1178n4754J04186J93782N9862l5143j39521N0193P4281j3267
22999A58374n9575j08070j41657n1892l7267R9358J89260K3391n6859O1034l4929
22988D1168J35162P4256o1704j51638j2902N9207Q2947j34277j31044J2869j8565
22977a04521n6238j11773J26596J28408O7034M4574j27824r2561R67Q9722k9715
22966f5331J40572m2845P9969p032o1542p7492n783j14854p9364O5822L1140J4627
$$ y = [3315, -94269, -70583, -69199, 12378, 228051, 52770, -138609, -59511, 13296, -26818, -201166, -254885, 19495, 87304, -58843, -315390, -276804, -272944, -149091, 44035, 195775, 183637, 96977, 15743, -10981, 5157, 34409, -67969, 89634, 178204, 146833, -61137, -132423, -81245, -135999, -31813, 161969, 221831, 186688, 47167, 97360, 171641, 158374, 98799, -9271, -150928, -202820, -240087, -140729, 48531, 71922, 15063, 76097, 41168, 176330, 250586, 188882, 37244, 24342, 83549, 166496, 32219, -98825, -85956, -104521, -160759, -272532, -145936, -17528, 49506, 94080, -33744, -126305, -125338, -35616, -65331, 75241, 32396, 112365, 105333, 43791, -33701, -39484, -154338, -233702, -167880, -136740, -122113]
22954a22113J18053K4482L7054m8649q5861j14845p5919N9060J04419n320J36633
22943B6994J17413r2531j064l8930r0513k7419j7532L8476o3386o1410J83905
22932b5997M6824j04160N407J37184j5648L7898J9811P2588O1116J12096l7609
22921C09510j23956q3047j28027r7934J20297N7930l1019L8821r8405k7443P2768
22910I495q9681J04792m4880j22311O8744J69994l0725k1651K227J17056P0536
22899B33596q5159k08156J2308K7997m9749P9323o4782j50671J82052J15353R8937
22888A91049M989j64213j03022J20500j10009J2616M0958l8719L0589J7191r8644
22877i6715p8359J64172J38432m1403j86776q9664K36812j1960J30254J19186
$$ y = [-122113, -4060, 20422, 57476, 8827, -77034, -191879, -267798, -208738, -104319, -109639, 26994, 144407, 51876, 50812, 11882, -78631, -106050, -123582, -85106, -148492, -209902, -25997, 20827, -83333, -77926, 59258, 43610, 81508, 101319, 173907, 235023, 347119, 309510, 185554, 102507, -25520, -123454, -3157, 54773, 23754, 62575, -35830, -63273, 9495, -80186, 24606, -20274, -142585, -73841, 96153, 65428, 43777, 46004, 163060, 233596, 148437, -59719, -47411, -19414, -69163, 10160, -54622, -205293, -23241, 92112, 191049, 196038, 31825, -71197, 49303, -60706, -48090, -7132, -45851, -15262, 1929, -96715, -175074, -10902, 127530, 86127, -100649, -190313, 46499, 34539, 164793, 283979]
22867B83979o4160n0600j11383n5542n9988J35091J7269k5353p6951J67659N5359
22856B15380r4892j26424p0334j0834J88626R1773J1316j88777o8174k1074J22932
22845D9518j33663j24730j11860O2503P9063J00753J80610q1280k2311Q6872j2462
22834G3013M7874q3153k2209J21974j2402j08193j28053q5692J08062Q8912q4322
22823h4189j01721J51349J76800j43808L824R4001l557j21521k10649q7752J30009
22812a97214J94208m3441J26033q8037N2180p3666K2550M3847p462R3351Q701
22801A31050j35586j5998M965J7645l4667K4432l7720j41628K8515m5363J0109
22790a94246P1444o789l8344Q2161j07541j52456J05503J53629K39452J81772
$$ y = [283979, 219819, 169219, 57836, 2294, -57694, 77397, 94666, 69313, -7638, 160021, 215380, 120488, -5936, -76270, -87104, 101522, 193295, 204611, 15834, -52340, -73414, 49518, -84145, -208875, -320735, -258232, -179169, -78416, 102194, 20914, -1397, 85475, 73013, 120887, 37734, 15525, 137499, 125097, 16904, -111149, -196841, -88779, 133, -84189, -185910, -34561, 142239, -1569, 2255, 96256, 92699, -28822, -239471, -327223, -197214, -3006, -46447, 79586, -8451, 43729, -29937, -7387, 36460, 28998, 122349, 131050, -4536, -20534, -15569, 2076, -32591, -8159, -45879, -187507, -158992, -204355, -194246, -122802, -129591, -167935, -85774, -193315, -345771, -240268, -86639, 152813, 334585]
22780C34585n9920j14905k91898j61415L2961P6614Q163K9730l8317L9872J11184
22769c3346M1978L1455o7104k33796j8585J20283J24532K0077J75704N5848p6187
22758A40859k4637j22213m2699O1476J12417K5545j40135O930J55014l7629k2680
22747A12248j2976o5576p9577P7499O0633M8354n5130q1734n3613m4501j23126
22736b17499m3193J76771J72902P3862q4878l7047P508k5490o5726j59779R9288
22725a03281J03253o6800o0759l0338j11720k4357J63937p25n6629q9650Q6926
22714a90143r4807q1230J90376J65054J07082q1798p1511K5800J03647K6138j42062
22703d3454K0958M353k108M603j02008J00591J21775m6229r0633L1967J58093
$$ y = [334585, 274665, 159760, -132138, -293553, -260592, -183978, -175815, -146085, -184402, -144530, -33346, 8632, 40087, -27017, -260813, -279398, -159115, -34583, -14506, 161198, 217046, 140859, 116222, -5991, -48690, 12786, 125203, 150748, 10613, 17543, 172557, 134928, 112248, 99272, 33696, -45881, 31618, 92251, 140605, 85475, 3741, -49872, -94373, -217499, -260692, -83921, 88981, 162843, 77965, 40918, 48426, 22936, -42790, -202569, -103281, -28, -66828, -127587, -157925, -269645, -294002, -130065, -130790, -187419, -277069, -190143, -284950, -366180, -175804, -10750, 96332, 14534, -56977, -31177, 72470, 98608, -43454, -22496, -18143, -20251, -15648, -117656, -17065, 104710, 58481, -32152, -185, 157908]
22692A57908n5033j74441j01380J28972J98861M3387j19221k6215K08545k5856
22682B35527J36838m6070K7976j27783l8900r7894j08786O8926J6323J20587L669
22671A90413j7823j45594j47090m2970l9423j25728O1474O4162J42071k5842j16307
22660b02657J186L06811J54086j17327j22578r7246n8353K36520N3860j05664
22650D8638m721j7135J64400Q9366j00648m00665j94041M1553J93639J1175k4341
22639a92780m6951r9769P0153J29926L1300N0793O2685M0530J24717R0116J31936
22628C92656j8343q3654n1516M694j57410q2286J4572Q0189l4789q7670N3320
22617B9763J05748j07641k8190Q8318L766k86451o788R9410n2623K6768J21497
$$ y = [157908, 102875, -71566, -172946, -43974, 154887, 198274, 79053, 52838, 261383, 235527, 372365, 326295, 354271, 226488, 187588, 89694, -19092, 49834, 66157, 186744, 190413, 172590, 26996, -120094, -163064, -202487, -328215, -266741, -202579, -60508, -86350, -202657, -201471, 105340, 259426, 142099, 19521, -77725, -136078, 100442, 154302, 48638, 43917, 26782, 191182, 280548, 179900, -220765, -414806, -373253, -179614, -168439, -192780, -239731, -339500, -269347, -139421, -108121, -57328, 5357, 45887, 170604, 260720, 392656, 374313, 290659, 239143, 243837, 86427, 4141, 18713, 98902, 64113, -23557, 29763, 135511, 27870, -320, 87998, 91764, -194687, -201475, -102065, -154688, -127920, -6423]
22606f423J23011j2244j25333N4161J11664l2836o6753M099l7105K0371n2959
22595b0347j27909l558K15379m0486j35613J14530J21001K9597l7651j07900j25696
22584a18653j08937P534K6490p9816O5714L8452J71763L5313j48758J4802J35452
22573C9356J51607O6563l3990P9578n43n8636k18635o3869q0830r5056n1619M9313
22561b16761n5037R2832J04939K7427k2593N2277m4885j1993L3772n703J269j31999
22549a76455O7740N6027l3968p0661O9347l0249J25899R4838M6449o8821k72480
22538a92334m1832J30974R5319R9357Q2175K4174p7132p3664M2540O3635k1331
22527A31881J8000M1960q2333q5561p5915k091J93802J69361j28873j10914N7755
$$ y = [-6423, 116588, 104344, -20989, 33172, 144836, 112000, 45247, 49346, 12241, 32612, -20347, -148256, -151814, 63565, 23079, -112534, 1996, 122997, 152594, 114943, 7043, -118653, -227590, -220056, -193566, -273382, -207668, -169216, 2547, 37860, -110898, -96096, 39356, 190963, 257526, 223536, 303114, 302571, 243935, 25300, -38569, -119399, -214455, -266074, -216761, -271798, -178966, -74027, -46600, -69193, -16916, -61801, -73794, -40022, -45725, -44456, -176455, -108715, -52688, -86656, -157317, -87970, -118219, 7680, 102518, 148967, 80146, -192334, -234166, -103192, -7873, 91484, 173659, 197833, 120701, 47037, 89577, 153212, 131881, 149881, 191841, 109508, 23947, -51968, -54059, 139743, 309104, 180231, 69317, 127072]
22516A27072J27798k04746j65227J10617Q858J72246R6614L3900R1496l7267j5944
22505C45417p149j57274j12165L1510j92976j27461J49674L1782k7404M4087k5143
22494d7102L0025J5346m4867N5201N764M4701R8465K6290n0675J3493K26301J45985
22482E18927j38378j85875q4716j18753L2985Q9375R5838n7683q1300j02683J22606
22471I0343L3715m433p302K5766j12491k07430n0468M0086K34815J30690Q8859
22460B62150q4961l5064j86528j64327R9315L8759o7462j0612P6310Q5597P5013
22449H8190j07713k922R2924J9847J8772o8905j03927K5966L2882q19R885M0484
22437D4664L4571K2145J77846m1628j19049r7042r1124j19216J48451J01195P393
$$ y = [127072, 254870, 50124, -115103, -4486, 4372, 176618, 273232, 307132, 398628, 361361, 345417, 338268, 180994, 68829, 100339, -92637, -220098, -70424, -38642, -66046, -21959, -47102, -17077, -1731, -46598, 8603, 14367, 59068, 157533, 183823, 133148, 146641, 372942, 518927, 380549, 194674, 109958, -8795, 24190, 113565, 209403, 151720, 70420, -32263, 90343, 124058, 119625, 112323, 138089, 25598, -181832, -232300, -192214, 42601, 173291, 262150, 177189, 142125, -44403, -208730, -109415, -70656, -138118, -148730, -72420, 13177, 88190, -19523, -22445, 70479, 90326, 109098, 40193, -63734, -37768, -4886, -5705, 4180, 44664, 79235, 101380, 279226, 237598, 118549, 21507, -69617, -188833, -40382, 60813, 68206]
22426F8206j68044k6405R5721k45241j14709J46069J33151m4954j6783R990R4243
22415f8756L4059J15831O4959j37041r4342j04002O1439q6668j45570Q798l0346
22404c81639N9184P3494j4196Q3120J17324m7657j05973P1135J69083K42121r4040
22393A71956j09361N0855J8495L0238R4731R1005j0306k49256k02147r1133l0450
22382b35373k3439O7127M9638M5228J10455k7722N5518R4401J44339k30731J5962
22371F5403K00932n1861l6903j06241j5890J0414q2706j79139j09002J65340J24487
22360a5166q7847J79439J45116k18139q628M3131m738L0752l51J3202r2090M9721
22348C4402L44J39554j6705j224j60043Q150M8706P2726o2182j86377j26335J71368
$$ y = [68206, -99838, -126243, -30522, -275763, -390472, -244403, -111252, -156206, -172989, -162999, -68756, -34697, 81134, 146093, 9052, -85290, -189292, -127853, -214521, -360091, -351293, -381639, -322455, -248961, -263157, -180037, -62713, -110370, -216343, -145208, 23875, 265996, 171956, 62595, 113450, 131945, 162183, 256914, 347919, 337613, 88357, -113790, -204923, -235373, -258812, -191685, -142047, -96819, 13636, -14086, 41432, 135833, 280172, 49441, 65403, 266335, 214474, 177571, 71330, 55440, 65854, -16852, -195991, -304993, -139653, -15166, -103013, 76426, 221542, 3403, -5225, 37906, 33168, 63920, 63569, 76771, -15319, 34402, 34746, 174300, 157595, 156371, -3672, 4478, 53184, 125910, 63728, -122649, -248984, -77616]
22336g7616M0516J2207q235n9020p7336n3475K16520j9705p1755P6839J8344J3414
22324A0698l3536Q845J3865K053K0902k6472R7732J37125k4546j27875K3810j10799
22312h198j37050K4072Q1156N8935J23631j14390k18517j49438J44917R0745J20596
22301A6459l5794R00o182J532j81468j287O8545R0896K73067P7633r3696j0376
22289B00229p4986k43083o4139J68292n204L7071m7408j35826o8169Q6590J33423
22278a3210P4J7025q3812J18510K8150l2707J25542N9572J6403j40515l3089k4459
22266C7484j30294j12650O7882R7527N6739K7657j83717l170N0885L1479J3953
22255d6225J3886j02019J13282M5112r3745n5728q9287J58418J31872J4232l8242
$$ y = [-77616, -37100, -24893, -33128, -92148, -169484, -222959, -6439, -26144, -97899, -21060, -2716, 10698, -22838, -13993, -128, 1925, 22827, -3645, 94087, 231212, 206666, 78791, 102601, -8198, -145248, -121176, -40020, 18915, 142546, 28156, -190361, -339799, -194882, -104137, 16459, -19335, -18435, -24617, -23085, -204553, -205840, -137295, -46399, 226668, 304301, 210605, 200229, 125243, -117840, -181979, -13687, -18891, 18180, -29228, -165054, -233223, -146633, -13210, -13136, 3889, -79923, 38587, 66737, 34030, 159572, 219144, 235547, 95032, 61943, 37484, -92810, -205460, -137578, -40051, 16688, 44345, -139372, -142542, -91657, -60178, -46225, -32339, -134358, -21076, 24036, -69709, -125437, -214724, -56306, 75566, 89798, 51556]
22244E1556k06402j47869K85637K6767J0934m2866J18035k7369p3510r449q6573
22233a01109R149J54422J51516o2448J8539n6658j48656n7887n3734k53568K7538
22222c72896J25660L43300J62861n1870p5017K9805j83248j45414p719k8562j6885
22211b19985K10866J13041l4569N5544J03179q612J884j6425M5923N8726o4067
22200B45505r8072k69170k18300J19218J36932j23060n0273K5025Q9818n8207
22190b00584R1018o5054n1900L3147M6997O057M1734m8255R8211J28402R0344
22179A70117j3641k70117j42884L4264M1495q1056n6455K32090J99126k95596
22169a82657k90864j18911J23851L90742J7288N6576N7926K7139r8090o3467J12813
$$ y = [51556, -154846, -302715, -17078, 9689, 20623, -22243, 95792, 68423, -5087, -14536, -101109, -91960, 62462, 213978, 151530, 170069, 113411, -35245, -93132, -146866, -400434, -372896, -247236, 96064, 258925, 207055, 132038, 161843, -21405, -166819, -174538, -203100, -219985, -9119, 103922, 69353, 124897, 228076, 219464, 221348, 204923, 250846, 309572, 245505, 147433, -121737, -340037, -220819, -83887, -206947, -257220, -232195, -142377, -200584, -109566, -174620, -226520, -193373, -146376, -140319, -98585, -146840, -48629, 79773, 170117, 156476, -113641, -256525, -222261, -180766, -261822, -318277, -86187, 112939, -182657, -473521, -592432, -468581, -77839, -60551, -3975, 53951, 81090, -17000, -80467, 32346]
22158C2346L2700n6086J8461q2803p2253J01208J4796j69278N1669J05188M0527
22147A6475M9108j42674j86387n5251J86288O1622n4261j8976J68610L1095p5055
22136a9406P9256j36825j82122j51597J35886J66528O5142J43636j67762j9603
22126h6867L9875j36700J59578j6216r1392J4228Q986j08486j01665p6850R524
22115c85985J30306P9242n2332j38637j68301j4020n463L9864M8657J82684J02401
22104a81584P1248L9107L7298P321R8845L0322q5029r6560j4849M2481O6364J51443
22092A66407k8360k96941o9709P3171P6968J14274j38098o5259m883N7772J07302
22081g356m1503k20986J66018M2366p2116j0561P8695J05009R4818m9841O139
$$ y = [32346, 65046, 8960, 27421, -55382, -127635, -26427, -11631, -180909, -129240, -24052, 16475, 65583, -77091, -263478, -318729, -132441, -70819, -125080, -144056, 24554, 55649, -19406, 59850, -76975, -259097, -410694, -274808, -108280, -43138, 100498, -67264, -86867, -46992, -183692, -24114, -40330, -131722, -117494, -108508, -216994, -318659, -395509, -385985, -255679, -176437, -228769, -367406, -535707, -549727, -555190, -515326, -466669, -283985, -181584, -110336, -71229, -33931, -26610, 72235, 102557, 17528, -79032, -93881, -51400, 14964, 166407, 138047, -158894, -228603, -155432, -78464, 35810, -102288, -167547, -172430, -114658, -7356, -48859, -269845, -103827, -61461, -133577, -144138, -65443, 39566, 134384, 84543, 90682]
22070I0682n10q4436p7738n9696r0053m5241o1586j38956p0528J87326J19805
22059b30931P5281J42730J75044j32149J612K5102N6439K8453j00599P1658J23627
22048B36267l9796m4944j43903J39730R3471o594j8909k92734j79760L5937J37651
22037h3584K26754o3445M0060J02468l4150q6905l1046n0761k6476l4172J39965
22026I8708j18266p5935P4501j1635M7279j66437o323J19039M0495n2829L1637
22015a9766q9154k3859p9086j0599r4752J56695R9121m6995J4597P4761K19411
22004B00374j03384p0834K299q1475j38666m1700j2948J91683J80208k4780J75368
21993B76145J44305l2988j58765k91039Q6707J61933n6230j57045L4519k9834
$$ y = [90682, 90172, 5736, -72002, -131698, -221751, -266992, -328578, -467534, -538062, -350736, -230931, -155650, -12920, 162124, 29975, 31587, 56689, 113128, 141581, 40982, 112640, 236267, 196471, 151527, 7624, 147354, 240825, 234231, 215322, -77412, -257172, -221235, -83584, 143170, 79725, 119785, 222253, 188103, 101198, 70152, 19391, -7085, -41257, 98708, -19558, -95493, -20992, -32627, 14652, -151785, -158108, -39069, 1426, -51403, -19766, -108920, -132779, -211865, -222464, -317216, -160521, -61400, -108395, -93798, -19037, 200374, 96990, 26156, 28455, -53020, -191686, -233386, -246334, -54651, 125557, 100777, 276145, 420450, 387462, 228697, -62342, 24365, 186298, 130068, -26977, 7542, -22292]
21983b2292J0635j4229P0657q6562q7684q2263l0949R6543l3797o7883N8288K79802
21971I0266P4747O3120p3701m5319j04842j75484l1260K5989J00140l7531n9572
21960a73447O487J52776j78507j38332J9178K66314K06794l5554p8500J04128
21950A51337m3833q7251R8517Q4588K8324l36j56067r1186J16635J8888O6345
21939A85961M5949J31284k43837k10820J10067O0312j57896Q5669K16832O349
21929B29870n602O1807j0071j51623Q9864m2390j30057L8623J37123p0453k10683
21918f3592R8325R3793m2557k2031L5158L7727k4931l835n6190q4929r4629j9131
21906a46822K6418r2998p9756l9365k9010l9866j1126K49024K14919Q2550j91123
$$ y = [-22292, -11657, -25886, 44771, -41791, -129475, -211738, -242687, -146144, -179941, -247824, -189536, 90266, 165013, 228133, 154432, 109113, 4271, -171213, -202473, -176484, -76344, -113875, -173447, -166960, -14184, -192691, -331023, -311845, -45531, 161263, 125709, 47209, 151337, 107504, 20253, 118770, 203358, 231682, 231346, 75279, -15907, 100728, 119616, 185961, 231910, 363194, 119357, -91463, 18604, 78916, -78980, 6689, 223521, 229870, 224268, 286075, 276004, 124381, 214245, 171855, 41798, 80421, 217544, 147091, -63592, 34733, 128526, 85969, 63938, 99096, 136823, 111892, 108057, 51867, -33062, -127691, -146822, -120404, -213402, -293158, -332523, -361533, -401399, -412525, -163501, 51418, 133968, -57155]
21895e7155R9065m7756k85675J8781K03575L9059K6938p3994k43471J75779n0320
21884a95174r688K22916o199j07091k9417J41901N6016p3636j85375m5830j48930
21873c80507l3339l4107J43230R1133N8614j09033r9655J87496K27779J8578j464
21862F8725L8573J27603p5679j01119j9702j50830j41511N5246O3185J46634L8383
21851D9508p0927o734o094n2789J23967J14142P87k63717l5075m8426o2544m0372
21839b98274K8878j77210n6745K83612L7348j05820m7125n0036P9111R5262O4691
21828a46308J5080r677J919l5773Q6165N1023j01811j08471r9850J43338K14941
21817A0576K00085k546j20731m8092j25735Q1580R3860J21142j07866j60855j20702
$$ y = [-57155, 41910, -5846, -291521, -272740, -69165, -30106, -3168, -77162, -320633, -144854, -195174, -204862, 18054, 11855, -95236, -124653, 17248, 73264, -372, -185747, -231577, -380507, -413846, -447953, -304723, -213590, -154976, -264009, -363664, -176168, 51611, 70189, 68725, 107298, 234901, 159222, 58103, 38401, -112429, -253940, -198694, -135509, 11125, 49508, -21419, -28153, -34247, -87036, 36931, 151073, 151860, -111857, -146932, -195358, -257902, -298274, -269396, -446606, -503351, -219739, -182391, -288211, -335336, -385372, -306261, -210999, -146308, -131228, -140905, -138986, -174759, -88594, -37571, -139382, -247853, -347703, -204365, 10576, 210661, 208115, 87384, 39292, -86443, -4863, 88997, 210139, 102273, -58582, -179284]
21806a79284q067L1051M8827J3573m3555r600L3654J56982O5284l7651Q7852j33744
21794B5322j60569j8315j84291M8713J85621J36916k9981j39434n7794P756J53228
21783c2828o4286m762K20557n3972j70323P6986j47588l0510J02802J7170P3249
21772a3505L4349O1589N0338J309K266j5395j1932J892j28258j35861k8100l6374
21760b17682P4966O7358N7233m7764J19869K71009R0625j80079J5575k3386J0468
21749B38192r2524q4179k6475j69145q3958J12569L5334O3298M8046L2441O1761
21738A35360J21320J25892k8094k19949k20220J0152K7311J5878J08265J2570
21728H8485P3151K4201j43207r4440R9526M9507p6484M352j8060j8305M3076J05990
$$ y = [-179284, -187351, -156300, -107473, -93900, -137455, -147055, -113401, 43581, 108865, 71214, 159066, 25322, -135247, -153562, -337853, -289140, -103519, 33397, 3416, -136018, -193812, -186056, -32828, -97114, -101876, 118681, 64709, -105614, -28628, -176216, -206726, -103924, -86754, -13505, 20844, 82433, 132771, 134080, 136346, 120951, 109019, 110911, -17347, -153208, -181308, -217682, -142716, -75358, -18125, -65889, 53980, 324989, 415614, 235535, 251110, 227724, 238192, 145668, 61489, 35014, -134131, -218089, -105520, -70186, -6888, 41158, 73599, 135360, 256680, 382572, 354478, 134529, -85691, -75539, -48228, -32350, 75915, 88485, 161636, 185837, 42630, -51810, 47716, 97223, 20739, 25091, 7031, -11274, 31802, 137792]
21716A37792J27336j35595k91120m9034J59726J02541L1609k0199j60508J56445
21706E8993J38425j20640n5918R8698L9809l5968L9565M122J3385j19819K60L5071
21694I5983n2664L3134K7063j4817n2183j10328O1980L8719J4830P5091J20742
21683B37550r6107p5976o4165q7633J4178K227N3673Q0757J27204n4898j96916
21672f0106M1400j3226J32526J77991j50803r2653r5082j46733k9297L8673r4136
21661b91446K9974k4944L3350J05272J816l1503m014L8637N732m6709m4148O5534
21649a62449O2061r4J42651K0845K7054L3184m093Q6210p5530j60029Q2194P4585
21637A26589J05568L6527p5558P3077q3075j02070P0378K9731K5416l2861n8462
$$ y = [137792, 265128, 129533, -161587, -210621, -50895, 51646, 83255, 63056, -97452, 58993, 197418, 76778, 20860, 119558, 159367, 123399, 162964, 167086, 180471, 60652, 60912, 95983, 43319, 76453, 103516, 88699, 36516, -73812, -11832, 26887, 41717, 116808, 237550, 141443, 65467, 1302, -86331, -72153, -69926, -16253, 64504, 191708, 136810, -60106, -18706, -31932, 100594, 278585, 127782, 35129, -59953, -206686, -235983, -197310, -291446, -261472, -286416, -253066, -147794, -145978, -177481, -181495, -142858, -137126, -183835, -227983, -162449, -100388, -100482, 42169, 63014, 90068, 123252, 119159, 205369, 129839, -30190, 52004, 126589, 232157, 268684, 193126, 266203, 183128, 81058, 151436, 181167, 206583, 173722, 115260]
21626A15260N4504P408J0164R5249K271j28385l89772M9949K30261N4103l07125
21615b06113j25256J31688J56587J17465j57313j18221Q695J26344J65175L5690
21605A34741l9965M2601K9690K2879q7467l5427K4489m309j29342p6115k2672
21594a40897O5463J48747J2278k1857r9566J52998J13122k9256j19326j15924
21584c4218Q5235M1137o0416O6170j75053k32076Q0982K32928J96550J52968j90595
21573A63612k77842k2947J2000r4131L7447Q2370M6925q4337k40083p3176J38017
21562c12145L54346R8734M1776l2065P7074j69952j52932N0160P281K7054k3253
21551c3922j10546Q3053J41716l5664K4776K6615q1726k7260k0255P3423k02963
$$ y = [115260, 169764, 177172, 187336, 282585, 284856, 156471, -233301, -183352, 46909, 101012, -206113, -331369, -199681, -43094, 74371, -82942, -201163, -192468, -66124, 99051, 134741, 94776, 137377, 167067, 189946, 102479, 67052, 91541, 87232, -42110, -118225, -140897, -75434, 73313, 85591, 63734, -35832, 117166, 230288, 201032, 81706, -34218, 51017, 92154, 31738, 97908, -77145, -309221, -228239, 4689, 201239, 354207, 163612, -114230, -137177, -125177, -219308, -181861, -99491, -52566, -136903, -376986, -450162, -312145, 42201, 140935, 182711, 150646, 227720, 57768, -95164, -45004, -37723, -10669, -33922, -144468, -61415, 80301, 44637, 69413, 96028, 14302, -12958, -33213, 40210, -162753]
21540a62753j26509n9350R2294J15013K32324P1960R0943n831m3650j00092o0912
21529D3437k23637R4918j2406P0406M8005O9330p4603O1127l3632j36859j15964
21518b09878L3758m6663p9262J0839Q7071J35818j8925p4407N9947K50146J85361
21507C33805j6728j44882p7741q9840P0906j45213r9048q2117m3322J24971J31423
21496c7786r1251k5781O049L015j52408j63009J22895J38155n4354J43173J88469
21485G7167J38801n3384j71317r8548l1127R4054M2509l263j12739L3437M2846
21474d1564J9786P2678n0215O1930j5308k31812j84050L41130J03717K2068r9961
21463a601r9543K6834q381M683j40569j66097J14364P2493Q6993J92785J90141
$$ y = [-162753, -289262, -348612, -256318, -141305, 91019, 162979, 253922, 248091, 204441, 104349, 43437, -180200, -85282, -97688, -27282, 20723, 90053, 15450, 76577, 42945, -93914, -209878, -176120, -222783, -302045, -291206, -204135, -68317, -87242, -161649, -101702, 148444, 333805, 317077, 172195, 94454, 4614, 75520, -69693, -168741, -250858, -294180, -169209, -37786, -129037, -154818, -148769, -145754, -298162, -461171, -338276, -200121, -254475, -111302, 77167, 215968, 162584, -8733, -107281, -138408, -44354, -1845, -5108, -117847, -84410, -41564, -21778, 50900, 685, 62615, 47307, -184505, -368555, -27425, 76292, 98360, -1601, -101144, -74310, -82691, -78008, -218577, -384674, -270310, -197817, -110824, 81961, 272102]
21452B72102j82975p8831k461L4762R3865k06122k9234J2096K2055j30125O5552
21441a29316K8959p127N408J0329M7560J11015j47664o9682J8922n5869L9451
21430a48014j14964r9811L644j0722J37810K42696m0490j17301J01496J66803
21420A21147j20689M9822Q8258q3949m672R9133K2848j21903j28556n134N285
21409g8410Q1824m9735N1495J27204J50819j69597q7259o7237O5331N1607j12982
21398c6940o6557J78246j402l6204j02489j56438O3469K75915K24922j58171k18614
21387c4263P4336j0370k9618l5360l3710J09621k823j5049R3566q0390P8792J59292
21375B74024J30569k48027k24336k44196n3838J20211K00555k0243j26442J221
$$ y = [272102, 89127, 10296, 7835, 42597, 136462, -69660, -98894, -86798, -64743, -194868, -129316, -100357, -107484, -102076, -91747, -44187, 66828, -80836, -150518, -131596, -187465, -148014, -262978, -362789, -359145, -369867, -232057, 10639, -29851, -147152, -45656, 121147, 458, 50280, 138538, 54589, 49917, 149050, 171898, 49995, -78561, -83695, -78410, 3414, -46321, 5174, 132378, 283197, 113600, 26341, -40896, 24435, 76042, -36940, -103497, 74749, 73347, 37143, -65346, -221784, -158315, 117600, 342522, 184351, -34263, 40073, 29703, 85, -35275, -68985, 40636, 37813, 22764, 116330, 35940, 114732, 274024, 404593, 156566, -67770, -311966, -365804, -245593, -45038, -65281, -191723, -190502]
21365a90502J30460J15528L7859L8395k0867L5290R2487k0789j09185J61828J62569
21354D33073j7544k22676q7389j66947O6959k3738n2134p9225o0074L4655J39936
21343c5104R999Q1566N4099Q0422l081m2555N2568O0115m2498m1898j20574j11105
21331e8046n9105j0599J13240L8607q6341M7847K3833N620K06658J03090j43435
21320A81369j18081N036O6459o3990m1488M2797Q5780J67973j62591j59782L3529
21309C7011l4695j13306l8438J08275n019l3283o5485K09924L3709J88K5568n1325
21297G3124J28830j05238k80442m4707J60802O226O1380N8780L8499m7696n9743
21286a0185J20281J8170O8559L4267j88902k29849O3365m3230r4696J1798M2961
$$ y = [-190502, -60042, 55486, 93345, 131740, 110873, 146163, 238650, 217861, 108676, 270504, 433073, 415529, 192853, 105464, -61483, 5476, -18262, -70396, -149621, -209695, -175040, -35104, -25105, 56461, 110560, 190982, 187901, 145346, 197914, 258029, 215531, 173633, 53059, -58046, -117151, -127750, -14510, 24097, -62244, -14397, 9436, 15056, 221714, 324804, 181369, 63288, 68324, 134783, 70793, 29305, 72102, 157882, 325855, 163264, 3482, 37011, 2316, -110990, -149428, -41153, -46172, -79455, -144940, 64984, 98693, 98881, 124449, 73124, 201954, 96716, -183726, -228433, -67631, -61405, -25, 58755, 97254, 49558, -10185, 110096, 128266, 196825, 231092, 42190, -187659, -124294, -167524, -262220, -250422, -207461]
21275b07461J82233J67276l9019j9583j36894k49307J41982J74415J01932j57845
21265d2271j5926j85990R8728J10110n2188j01833q6910N1886Q6344N2687J64448
21254G9085j21924n1790j2800J02075O2905m4669k4188p4485j5100P3212m936
21243c2615j00247q2328J53942P6346Q0124N2458J17305m7557p8909m2347k4527
21232G1645j90165J143J40498K964p907k4668M2304j88448k6857P7121L7191J3188
21220e1991n7429m928r2161j87460J76852J03801J6040Q1275L6744N6079k12696
21209a35874j45911n2180J62296M0136o8748J24264J89240j67210l33655O3686
21199c23956K21446N5346J8906M1126M3525l9084r7466j04584o4638J24985K02248
$$ y = [-207461, -25228, 142048, 103029, 83446, -53448, -302755, -160773, 13642, 115574, -42271, -58197, -244187, -145459, -35349, -87537, -189370, -276280, -224394, -138050, -85363, 79085, -42839, -94629, -107429, -5354, 57551, 12882, -11306, -85791, -100891, -27679, -32615, -132862, -215190, -61248, 15098, 95222, 147680, 264985, 217428, 138519, 96172, 71645, -118520, -117377, 23121, 26085, 18178, -6490, 35814, -152634, -179491, -102370, -65179, -51991, -109420, -114348, -206509, -393969, -217117, -113316, -97276, -16001, 20743, 76822, -135874, -281785, -333965, -171669, -131533, -200281, -76017, 113223, -53987, -387642, -323956, -102510, -47164, -28258, 12868, 56393, 17309, -80157, -184741, -249379, -124394, 77854]
21188G7854K4773j10264K6023j79539o266K3306j29797p5080J53083J74250J13703
21177I2046j09667q29J08808m0393m2390P0992N2676q5177J7298p3869N0420O2860
21165A02775R4282j49997R2649j63417j13702K7594M8651L6016L5792q0285q493
21154g8135J48648J5216p4116J23645J38520k6765r0920n4265m0556j92910m3076
21143a74714O8078J11172P7203j641R6245n7295L0765j97905l54336J57664K51135
21132F371n4871j42423k088Q5252N8183j6867n1096K4462n8622m8772j9583k7783
21120b47837L5588j9742J22693J09673N7036j29170l3697j5449M1410m086n3677
21109a37258O2302J7937M8117R0698O4002l751j00469L7885J22556O3478o5341
$$ y = [77854, 102627, -7637, 18386, -161153, -167419, -144113, -273910, -348990, -195907, -21657, 92046, -17621, -18450, 90358, 49965, 7575, 78567, 131243, 46066, 63364, -10505, 39915, 102775, 197057, 47060, 139709, -23708, -137410, -109816, -61165, -25149, 10643, -69642, -78135, 70513, 85729, 11613, 135258, 273778, 247013, 156093, 101828, 61272, -131638, -174714, -106636, 4536, 81739, 80098, 176343, 119048, 149813, -48092, -402428, -244764, 6371, -48500, -190923, -193011, -107759, -49576, -66443, -117539, -93077, -151699, -200471, -220054, -247837, -212249, -231991, -109298, 375, 57411, -71759, -105456, -120905, -79495, -83581, -137258, -74956, -57019, -8902, 81796, 145798, 142047, 41578, 79463, 202019, 265497, 200156]
21098B00156j47091q3406K6831J08438O4098j87196r1530j44677J12721N9796
21088h1860O852n9436l5231j99357j7933J77350J13064Q7060N034J48105r3261
21077E0387j93212l8171K940l0102l2349O0433M5795o2057J9757o466J7636L4389
21065a31020k8717P8768q8553M4637J20579J20411k1679k0951J2118j04097J7092
21054a412j3927j39671j89675k999J74317K36021L4245k04451r7156J81290j0892
21043c4310q4391p6288P938R4249Q1482j58349l2543K12888q3579j19976L4135
21032a58744O8288O4094K38625l6717j02800M0426K3417j8498n4263K7416j20277
21021b9033j26458J5257K4927J76854J996K5274j53624K9329M5466o9088r7685
$$ y = [200156, 53065, -30341, -3510, 104928, 169026, -18170, -109700, -254377, -141656, -81860, -75008, -134444, -169675, -369032, -386965, -209615, -96551, -9491, -4457, 143648, 50387, -142825, -180996, -178056, -208158, -240507, -180074, -134279, -196336, -176579, -183045, -165409, -131020, -159737, -80969, -169522, -124885, -4306, 116105, 94426, 73475, 85593, -18504, -1412, -15339, -155010, -344685, -347684, -173367, 62654, 96899, -107552, -204708, -23418, -34310, -118701, -194989, -187051, -92802, -11320, -169669, -202212, 10676, -72903, -192879, -158744, -90456, -26362, 212263, 175546, 72746, 113172, 136589, 118091, 63828, 91244, -29033, -155491, -140234, -115307, 61547, 63543, 88817, -64807, -35478, 9988, -59100, -156785]
21010a56785j24553J65668J39718k1314l0548R5896J8945O1392m7068O9811O1862
20999B33024K275M1190j60154j25273J26995L8567j80774j33579r9305N0856n7030
20988b63208L4258K05281J81789k07154j71919q9664M8772j3102J22138Q7266
20978f5543m6309j08883l4331N304l2853O9349O906J9628l5150N2114M9492J13520
20966f756m375j35705l7284j5188P4759J06397J05140k6973j16986j14529L0503
20955a40997J7254J25499J85547Q1439P855m9237n5361l0347j88599j06319j0301
20944a63567J89347M0045L9267L0019j1256p3753j9359p5644j15782O9814k3541
20933a14410j44390j36609M2761O1500R2411K5366Q1672J07249Q127j53032j7655
$$ y = [-156785, -281338, -115670, 24048, 2734, -27814, 68082, 87027, 148419, 101351, 171162, 233024, 235299, 276489, 116335, -8938, 118057, 156624, -24150, -157729, -257034, -206178, -263208, -228950, -23669, 158120, -49034, -220953, -310617, -261845, -274947, -152809, -65543, -111852, -220735, -255066, -249762, -282615, -213266, -206360, -186732, -221882, -169768, -120276, -6756, -11131, -146836, -184120, -199308, -124549, -18152, 86988, 60015, -56971, -171500, -140997, -123743, 1756, 187303, 268742, 276597, 227360, 171999, 141652, -46947, -153266, -163567, 25780, 65825, 105092, 135111, 123855, 50102, 30743, -44901, -160683, -90869, -114410, -258800, -395409, -352648, -291148, -198737, -173371, -91699, 15550, 23677, -129355, -147010]
20922a47010J58169p3133q0211p8523J15157Q7103j39388m812J59774J03453m0156
20911F0423j59981q0049j22297J43547J52006P3627j79256k47465N610M1180k0034
20900c32689J6727K91320J65065j249P7278M6531j84341j54139P8596N3594j14730
20889e8037N1142R794l6011l3761O1379O4691j64133o2084p8941Q8093L2598O485
20877a18785Q314m4448m7478K9771O3829J50688l9252O5707j18197k11850j7230
20866b78931K24019J38200K3101n1804j9383j15342J9074R0563q763N5678p8963
20855b551j17822M8707N9494j080r776m9914o7647J66397O080j52263j84357j08485
20843d13217J31240J04132M5949j4137J00210Q4848l8988J18513P9061L4889k9787
$$ y = [-147010, 11159, -61974, -142185, -220708, -105551, -18448, -157836, -162648, -2874, 100579, 60423, -99558, -179607, -301904, -158357, -6351, 67276, -111980, -359445, -353835, -312655, -332689, -315962, -24642, 140423, 139174, 216452, 262983, 78642, -75497, 3099, 56693, -58037, -6895, 2899, -33112, -66873, -5494, 59197, -104936, -167020, -245961, -157868, -125270, -118785, -110471, -154919, -202397, -172626, -108797, 41891, 2639, 68346, -49851, -261701, -278931, -54912, 83288, 106389, 54585, 35202, -80140, -61066, 29497, 20734, 76412, -2551, -120373, -71666, -12172, -13252, -23028, -72942, -140589, 25808, 31888, -120375, -304732, -413217, -281977, -177845, -131896, -146033, -45823, 39025, 37, 118550, 197611, 232500, 202713]
20832B02713J76583K7290p9209k5615J50460K45757L92294L06833P2972j1493
20822A458585j65936m12367j99667j99662j54641q795R5195k35770k14969N6329
20812A8302J2543k01172L1705j7910j84J7809J56291J50215J47447O880j10323
20801B11603r2723O3609J09402j62600k19612k0486J88786K6381o0280O8541j1647
20790A00974j40188K8206n1262J45251k4609o4129j81097N5230J46781L8991j37182
20779h3034m4653l6294J88590O0770L0160p8982k88981o0763P1568K7748M9490
20768a64381N704p8441p8254J3699Q6938P15k348q0948o2629J19829K02255J82088
20756A44227n4619k49271J2528J49166p7836q9566L0521N2518J57190P7681l4831
$$ y = [202713, 379296, 406586, 327377, 301762, 452222, 697979, 1090273, 1397106, 1470078, 1458585, 1292649, 880282, 680615, 480953, 326312, 317517, 412712, 176942, -38027, 18302, 30845, -170327, -138622, -156532, -156716, -138907, 17384, 167599, 315046, 321926, 211603, 118880, 182489, 291891, 129291, -90321, -110807, 77979, 104360, 44080, 112621, 100974, -39214, -11008, -62270, 82981, 58372, -5757, -186854, -131624, 15157, 54148, -83034, -127687, -163981, 24609, 85379, 115539, 36557, -252424, -313187, -241619, -213871, -164381, -158677, -237118, -315372, -301673, -214735, -214020, -216368, -297316, -359945, -240116, -37861, 144227, 89608, -159663, -147135, 2031, -75805, -165371, -134850, -82332, 74858, 152539, 117708]
20745A17708j17829n2285l5369N0509J45751O2097m1217q3999n6303p1913M6230
20734c6620K4720N0301J09045K3640N6859j57566j80721K6754J0727k8808J01873
20723B04Q0112R5225O8681q7851k10041j48906n1411K48651P8747l2341K3712
20712F4782k1305J51345q2518q8300m5046J22836J04046J57876k8169j36779r7304
20701A01464j45927j70288J86422J42465j02629J88636P2210k771n4385n2595
20691A62602P3365K2644n7139j5545j02449r0531j75144o6976l516J98884J38915
20680H5110r1376j56592J26912J84476J14505j46636J4407J02920o0894j64475
20670H357L6904N6114j42282j45534L8080O604J49038j2994k53359M5987J93239
$$ y = [117708, -121, -52406, -87775, -37266, 108485, 170582, 129365, 45366, -10937, -82850, -36620, -11900, 38401, 147446, 171086, 227945, 70379, -110342, -83588, -72861, -101669, 204, 80316, 175541, 244222, 156371, -53670, -202576, -253987, -5336, 73411, 41070, 64782, 43477, 194822, 112304, 24004, -21042, 101794, 205840, 363716, 335547, 198768, 101464, -44463, -214751, -28329, 114136, 11507, 200143, 272353, 269582, 215197, 162602, 235967, 258611, 201472, 185927, 83478, -7053, -182197, -249173, -252689, -53805, 85110, -6266, -162858, -35946, 148530, 263035, 116399, 130806, 233726, 172832, 8357, 45261, 101375, -40907, -186441, -148361, -141757, 7281, -5713, -259072, -213085, -19846]
20659a9846N6610p6341P7483M6120L1044L0485o4683j07996K9187J38370k6872
20648A13561m2065n2447j4091J11208N7718p4922o8424r6890l931l6774J29990
20637B2933J71554p8029p3482m6185P117j8263m6383J03596N5002Q5905K4865
20626B08630k3647o0484j16160q8489k3427k8018j81793j0062j05514Q5914J13680
20615b29370k441Q602J3450J44776J33775N8447j2529k11622J12008J56897r0067
20604H1926j44134J2443P557M9276Q0788R8083k64535j54283l6611m4792J75270
20593a39012K94031j86166k06487n793J24565L2153L3097j26047j9186R0986o6661
20582a74520j13562J10147k3546L6473j067j79683k5691J15518J17735L4738J9398
$$ y = [-19846, 36764, -39577, 37906, 84026, 115070, 145555, 80872, -27124, 2063, 140433, 113561, 71496, 19049, 4958, 116166, 173884, 98962, 30538, -66352, -70283, -107057, 22933, 194487, 116458, 42976, -3209, 3908, -14355, -60738, 42858, 97860, 183765, 208630, 184983, 124499, 8339, -80150, -103577, -131595, -313388, -323450, -428964, -343050, -229370, -231811, -223209, -209759, -64983, 68792, 127239, 114710, -96912, 15096, 171993, 81926, -62208, -49765, -42208, 7068, 87856, 185939, -78596, -232879, -269490, -314282, -139012, 155019, -31147, -237634, -243427, -118862, -86709, -53612, -179659, -198845, -107859, -174520, -288082, -177935, -201481, -165008, -166075, -345758, -371449, -255931, -138196, -103458, -84060]
20571h4060j4732r7424J35640K54791J5018j44712j02207m407k8779J75444K36041
20560C40613o4172m7580K7150j19569j31169p6660j6846K05759K12085j8254n7016
20549B54341j16300m6548j22583k07892n7493J99875M03K646k0545Q6609L8419
20538A0932m9784p0834k1288Q9929J9427o546k2416n6709j19695j13577J54144
20527a86417K17873J381j18227o9347L4029k17954q2136J29877J77052o7939j46103
20516c27911o4262K2505J27108J64747N2670J79470J6021j53896L3746k0169n1616
20505b1587k0141n5264j07658j2062l5379K1896J35588K2994m1650J69293N9046
20494A15076J822m8528j6459N7549n566o2138Q4643L9538L2056o7517l5885J9050
$$ y = [-84060, -98792, -196216, -60576, 194215, 209233, 64521, -37686, -42093, -70872, 104572, 340613, 276441, 228861, 256011, 136442, 5273, -71387, -88233, 117526, 329611, 311357, 254341, 138041, 91493, -31090, -238982, -296475, -96600, -96197, -93551, -114096, -27487, 10932, -38852, -109686, -130974, -41045, -21618, -28164, -50580, -107289, -226984, -340561, -186417, 31456, 32837, -85390, -154737, -120708, -338662, -420798, -290921, -113869, -181808, -327911, -392173, -369668, -242560, -77813, -25143, 154327, 170348, 16452, 50198, 30029, -21587, -41728, -96992, -204650, -216712, -252091, -230195, -94607, -71613, -113263, 56030, 115076, 116898, 68370, 51911, 109460, 103894, 41756, 126399, 165937, 197993, 130476, 94591, 113641]
20482A13641j29072j1008K07810j9266k3955L4374j2023k4718j14154m0224j18908
20471a37503J45396R1798L0731m2309K178O0699J36714Q869k290l5202K5442l0976
20459B53547o5352j33104P3583K19606J05444j27048j18202J9368j63020p7280
20449a2458J21072M6018j30175p1498N5679R4873m8815j11203m5439J15268O7619
20438H0941J30462P0500j18375k9080K6935j44833O4735K8664k8375l2316R4500
20427A43758Q9298M1187J28204j2889J6374l3251j00973l0144m2756k20779k04681
20416b26652o0792R5201J30497J30462m3577J29077K3158j44323J2086L9442J9675
20405A04254j27948q1971n5571j2843j15380O6338m0936R2893K66298N9253p8672
$$ y = [113641, -15431, -26439, 181371, 162105, 138150, 172524, 160501, 135783, 21629, -18595, -137503, 7893, 99691, 130422, 88113, 90291, 150990, 287704, 296573, 294283, 259081, 284523, 253547, 188195, 55091, 128674, 348280, 453724, 326676, 208474, 227842, 64822, -12458, 108614, 154632, 24457, -47041, 8638, 103511, 54696, -56507, -101946, 13322, 80941, 211403, 281903, 163528, 134448, 161383, 16550, 81285, 109949, 81574, 49258, 143758, 233056, 274243, 402447, 389558, 405932, 372681, 271708, 241564, 198808, -21971, -226652, -287444, -192243, -61746, 68716, 25139, 154216, 177374, 33051, 45137, 84579, 104254, -23694, -105665, -161236, -174079, -289459, -223121, -264057, -171164, 95134, 154387, 75715]
20394G5715M0146l9408K8622P7796M2795n5168q6584J26631l885L5481l6597Q9190
20382B94734k8077K7597l0262J00345J17111K4241o7980p1375j03960o289p635
20371B48450o468q3522j56546l241J40512N5204r786j59735r5855n7571P4865
20360e3693J32430J14066k268q2122j34088L378O7108J06936K45233J7780k19106
20349A95654j04349P0448L4908j10924j18046L7624m8667j1988M1050o7936J88169
20338A05943M5330r4142R6912J81818n8907j00156K9343p0503J0115J37755m672
20327B78836K3802j52089k8226n6674j01193N7419n543l7701k9592k7449n2946
20316a31356N9035J35307P6140L5680O9152l762M0721J10892j06598j07864P2224
$$ y = [75715, 115861, 76453, 105075, 182871, 225666, 170498, 83914, 210545, 206660, 242141, 205544, 294734, 266657, 294254, 263992, 364337, 481448, 505689, 437709, 366334, 262374, 256085, 248450, 241982, 158460, 1914, -1327, 139185, 194389, 184603, 24868, -70987, -128558, -53693, 78737, 192803, 190535, 108413, -25675, -22297, 44811, 151747, 396980, 414760, 195654, 91305, 161753, 196661, 85737, -32309, 5315, -43352, -55340, -14290, -82226, 105943, 151273, 57131, 154043, 335861, 276954, 176798, 206141, 135638, 145753, 283508, 278836, 302638, 150549, 122323, 65649, -35544, 21875, 16332, -21369, -50961, -78410, -131356, -72321, 62986, 139126, 174806, 243958, 240196, 280917, 391809, 285211, 177347, 249571]
20305B49571J7332m056p7733J20934J0387P5490J73461n8469j8801m5681J10484
20294E52919p7068k15573p0479J13869r8463k3493O8003j68105j7158J12697K09331
20283C86480j8516q2113K196j6972R2834J98796o4510j60900j20871k3197Q9760
20272B82987N2641J38913O3499J45359l3203j45223l2206K93717K9304r6035L0934
20261G30687O8509Q2166L4359Q9024j72688M7207Q6279r3909J30442K35259P2205
20250A309540J63102K81031J73210K2618n0188M1479J19963J3246k1122P282l4931
20239B025230Q6764Q8303J26503K67025P32957R04133P59013O90035m0442l31962
20229E307559n46908m95019k16454k23362j55815J11676K32139J82103K06809
$$ y = [249571, 266903, 262847, 185114, 306048, 316435, 391925, 565386, 506917, 488116, 442435, 552919, 475851, 260278, 189799, 303668, 205205, 181712, 249715, 81610, 64452, 177149, 386480, 367964, 285851, 288047, 271075, 363909, 562705, 498195, 337295, 216424, 193227, 282987, 335628, 474541, 538040, 683399, 650196, 504973, 472767, 766484, 795788, 699753, 730687, 799196, 881362, 915721, 1004745, 832057, 879264, 965543, 871634, 1002076, 1237335, 1309540, 1472642, 1753673, 1926883, 1949501, 1899313, 1940792, 2060755, 2074001, 2052879, 2060161, 2025230, 2111994, 2200297, 2326800, 2593825, 3326782, 4230915, 4989928, 5679963, 5639521, 5307559, 4760651, 4265632, 4049178, 3825816, 3670001, 3781677, 4013816, 4195919, 4402728]
20220D402728M39005N19608M70990O18104P68402R10465J117708J323841J502906
20211A2073757J850823K153987L104871L908180N231149O987378J0220546J4839074
20203F0369765K2114717L3934912N0503796O6060229O0633075K2620474j9932374
20196B96304594m7920989o0493610n3223515l7229856k4347720j6438631j1363894
20189D5286379q071525o086269m605233l388378k946205k449452j964740j645222
20181A4129355j128327r37001j158681r67942n91790p33965p03482m92792n63556
20172F851819m44888j73803l95743j1194Q6642M47179N21203L77760j24942m63051
20162F670982q44210q39426o57231l99080l72850k73997m103l3291K9759p0111
$$ y = [4402728, 4841733, 5361341, 5832331, 6450435, 7218837, 8129302, 9247010, 10570851, 12073757, 13924580, 16078567, 19183438, 23091618, 28322767, 35310145, 45530691, 60369765, 82484482, 116419394, 166923190, 232983419, 293616494, 316236968, 296304594, 248383605, 187889995, 134666480, 97436624, 73088904, 56650273, 45286379, 37214854, 31128585, 26523352, 23134974, 20188769, 17739317, 15774577, 14129355, 13001028, 12064027, 10905346, 9937404, 9345614, 8611649, 7908167, 7415375, 6851819, 6406931, 6233128, 5837385, 5826191, 5912833, 6360012, 6881215, 7258975, 7134033, 6670982, 5826772, 4987346, 4330115, 3931035, 3558185, 3284188, 3280085, 3246794, 3276553, 3206442]
20152C206442q4385j01268k21684k10028j47936p2406P3416Q793j54819l52820
20142A943305j79980m185j50139j40620j84549j4206R5821J30523n4081m5645
20132A396244j80109q3098r9654j73256O2741R5381j13834n7442q3158j1412P9855
20121H32258m5710J31291j1713j06844R29n9774R9706J16054j45728j91101k38662
20110C80706O5151N8558J28217K9668M129N0676j1414K9604N10j40647j43286
20099D51872j91611j49492r4891O7563L3777n9999j37998j29540J66464J14067
20089G0212j23073Q4402Q1908Q6424J04751J3465j08360j38848L5426R43J1815
20078A19065o5544j1716J72104K07224L3873m6687k47280k7901j4412Q661J17203
$$ y = [3206442, 3122057, 3020789, 2799105, 2589077, 2441141, 2368735, 2442151, 2450944, 2296125, 1943305, 1763325, 1759140, 1609001, 1468381, 1283832, 1269626, 1365447, 1495970, 1441889, 1396244, 1216135, 1133037, 1033383, 860127, 922868, 1018249, 904415, 846973, 763815, 752403, 832258, 786548, 917839, 906126, 799282, 800211, 740437, 840143, 956197, 810469, 619368, 380706, 445857, 504415, 632632, 662300, 666429, 717105, 705691, 735295, 735805, 595158, 451872, 260261, 110769, 15878, 83441, 117218, 57219, -80779, -210319, -43855, 70212, -52861, 31541, 113449, 199873, 304624, 318089, 209729, 70881, 106307, 107250, 119065, 53521, 41805, 213909, 421133, 455006, 408319, 161039, 133138, 118726, 127387, 244590]
20067B44590N1812k70411q8983J04521J09814m3427p6039J48257j79584l0696
20057c0146r0177o1588J69934J74118O4100j56244j45917J22393j68496J6601
20047a05422J69567q314J01081K18296p8184k09008p0117r1327J78233J5161J37902
20036B57868O3643j52893p9125k0939j58671j10337J61173M31522J65508r998
20026E47751j40506k33131p8665Q0897n4719j25969j16389j88016R0347J77503
20016d0897R3155J13887p55k66543P7047J41348p4978k08534J9659J91134J28132
20005A72655j10306m0468o8735M1049M4994j2875P1218N4910J1906N635K248K260
19993A74491k8511j98692j31768J00709l7177l7065J06801J60439J316l5560R7931
$$ y = [244590, 296402, 25991, -62992, 41529, 151343, 107916, 31877, 180134, 550, -30146, -120323, -181911, -11977, 162141, 226241, 69997, -75920, 46473, -122023, -105422, 64145, 55831, 156912, 375208, 297024, 88016, 17899, -73428, 104805, 119966, 257868, 321511, 168618, 89493, 68554, -90117, -200454, -39281, 392241, 557749, 547751, 407245, 174114, 95449, 176346, 121627, -4342, -120731, -308747, -218400, -40897, 52258, 166145, 165390, -101153, -24106, 117242, 42264, -166270, -146611, 44523, 172655, 62349, 21881, -46854, -5805, 39189, 26314, 97532, 152442, 164348, 169983, 172231, 174491, 145980, -52712, -184480, -83771, -120948, -158013, -51212, 109227, 110543, 74983, 172914]
19982A72914m3946m7358l0175j36761j10497p6199M8349R8985o401n9773q7513
19971b78375J23250m3959O6083j17010J21073P4367J00769N1785j54899r7655
19961a54571L1009J61080O0199L6820P9118k086l01235r6039o4091j09728O8372
19950b91152J94263j27812k44189J98388l7414j12503J16096J55349Q2130m0470
19940a07314n2701J57034J14730j02292m1397K31502N4440k24184Q7156Q1443
19930A98417m7095K5501k1253n606n8124m8956l2036j32141n8784J09154O8415
19919b508q902n4287M0976P8254N9718P308p6300q4686q2175j4131J95332K31271
19907B89870k7699j00856j89133o221L1399Q5464O1018j34989p1598k1268j27412
$$ y = [172914, 128968, 81610, 51435, -85326, -195823, -272022, -223673, -124688, -131089, -190862, -278375, -155125, -199084, -133001, -250011, -128938, -54571, 46198, 97983, -56916, -154571, -123562, 37518, 97717, 134537, 213655, 211569, -89666, -185705, -249796, -359524, -291152, -96889, -224701, -468890, -270502, -307916, -420419, -304323, -148974, -66844, -107314, -160015, -2981, 111749, 9457, -31940, 199562, 254002, 29818, 116974, 198417, 151322, 176823, 155570, 149964, 91840, 42884, 10848, -121293, -180077, -70923, -2508, -11410, -65697, -24721, 53533, 113251, 120559, 44259, -40427, -122602, -136733, 58599, 289870, 262171, 161315, -27818, -34039, -2640, 82824, 143842, 8853, -62745, -84013, -211425]
19896b11425l0328M7369J8953O442J22281J09495Q6398o254o8953R1575l9917
19885A25636n3677Q328k7865L1551k04952p3948O7828r2440J37417k7275j27969
19874b37366m9500o1097J47686R3139j5881N5182q682o5534q3569K35186Q1489
19863I1053j86031l3560L367J02906m2494J9192J54715l6723j62318J04392q727
19852E772o9632j03578n3885R1341m465m6452O2225J44240J07349L773k3871j37173
19840b4356n1244J18184J9070J01937m1516p5742p4975j91515j3394q7593J9615
19829c01529K33334j1803j11941p9783l269Q1047N7178J88682K33897m6667k4415
19818B14731K8237k42325p5981j0303j0797R9048m3576j16219M7470J24802J40739
$$ y = [-211425, -241753, -194384, -175431, -168989, -46708, 62787, 149185, 142931, 73978, 165553, 125636, 71959, 80287, 52422, 83973, -120979, -194927, -127099, -219539, -82122, -109397, -237366, -286866, -347963, -200277, -107138, -123019, -67837, -76519, -142053, -225622, 9564, 91053, -94978, -128538, -125171, -22265, -64759, -45567, 109148, 72425, -89893, 14499, 5772, -63860, -167438, -221323, -129982, -134447, -180899, -118674, 25566, 132915, 136688, 112817, -24356, -75600, 42584, 61654, 163591, 122075, 46333, -28642, -220157, -233551, -321144, -301529, -68195, -79998, -191939, -271722, -274991, -193944, -136766, 51916, 285813, 239146, 214731, 242968, 643, -75338, -85641, -96438, 2610, -40966, -157185, -109715, 15087, 155826]
19807A55826K9236R894j49375l3829n2678j4515o6145j27832Q142n2734J23513
19796a70497j93343k2569J54162K5464P8763J13027J4600J29217m433j96502O0114
19785a1997J13224J6017j30050J3276l4715m6246r601K6401J55034J66572j54531
19774A03384j82525j2804M6061j6184l607L5634p2447J20906j10303O5730q866
19763c5021P2115j0920P7017O883r3166j13798k10552O4872L3704M2145l9214
19752b05935M7269K8058K16556J57770J7230K5678j10051p6866j49737l7188J93124
19741A05908r1656m3736o8757n3209J05273p705J51489J12403j22565k05399J03047
19730a4907R4432N748L7518p7331j66029N6583q7792P0898P2313J494r7140J34865
$$ y = [155826, 185062, 194956, 45581, 11752, -40926, -55441, -121586, -249418, -241276, -294010, -170497, -363840, -386409, -232247, -206783, -128020, -14993, -393, 128824, 124391, -72111, -11997, 101227, 117244, -12806, 470, -34245, -80491, -90092, -63691, 91343, 257915, 103384, -79141, -91945, -45884, -62068, -65675, -30041, -102488, 18418, -91885, -26155, -35021, 37094, 26174, 103191, 110074, 16908, -96890, -307442, -242570, -208866, -166721, -205935, -158666, -130608, 85948, 243718, 260948, 286626, 176575, 99709, -50028, -87216, 105908, 14252, -29484, -98241, -151450, -46177, -53882, 97607, 210010, 87445, -117954, -14907, 79525, 85273, 122791, 45460, -120569, -63986, -151778, -80880, -8567, -7073, -104213, 30652]
19718C0652N8924j43927K4193k4011K6145k0923r4417N7686Q8389J12280J45699
19707B60690j61228n4494q1268N5043j5021L0994J8631j40869J7721J29474j67447
19696a07774j29959J43263L4786J12322l1531j18139o9329M8226O3396J28387
19686G3648M6099M8277j36717l136J06488p9506k15401j03209j06457J40462J19063
19675a10389J85609J34383q4124k35182K4271k8677p5257p1195R4942P9084j5653
19664a02188P2968r1750L4488l7169R9274o5882l4375n1244J37128J65607m6621
19653H0236k51818l6424M1492L1067L5280J92000q6018j43379J03137M7585J4061
19642B7219Q4013R7465k39318j34109j40868P5200n3994O0394J10818K9730j38364
$$ y = [30652, 89576, -54351, -30158, -54169, -28024, -48947, -143364, -85678, 2711, 114991, 260690, 99462, 44968, -36300, 18743, 3722, 34716, 53347, -87522, -69801, 59673, -107774, -237733, -94470, -59684, 52638, 21107, -97032, -166361, -118135, -54739, 73648, 119747, 168024, 31307, 28171, 134659, 55153, -160248, -263457, -369914, -229452, -110389, 75220, 209603, 125479, -109703, -85432, -114109, -189366, -260561, -165619, -86535, -102188, -29220, -120970, -86482, -123651, -24377, -90259, -124634, -175878, -38750, 126857, 80236, -171582, -208006, -166514, -135447, -100167, 91833, 5815, -137564, -34427, 13158, 27219, 111232, 208697, -30621, -164730, -305598, -230398, -284392, -223998, -113180, -83450, -221814]
19631b21814j09951R0441r8675L2237q8312J41143J50890Q6502M7543R16M3455
19620G4375k9261J20347K0092R5600o0785k2337J19928j11028j88615J5822M8644
19609H2782o554q3299j41732j10052J13703J68827m8340j40466n5905q8750K10092
19598i9694K53989J82129j18857j74831J22356R1587k95797l08354J07335J11997
19588a28140P5592J03559K8559j28254q373n9009K1286K17756K96669M450j78887
19577B45208j40458Q1215J00012L0266R8477J5797K00665m5675l6104J66333J78129
19566H93865L66541K12448L8725l1536j4119l67969m35558l51515j12622J19129
19556C17389j67126j28570M1439M2014l0835J10298j2812J5361K0890o4219m1037
$$ y = [-221814, -331765, -241324, -339999, -307762, -396074, -254931, -104041, -17539, 30004, 30920, 74375, 45114, 165461, 185553, 281153, 220368, 198031, 317959, 206931, 18316, 34138, 82782, 76228, -7071, -148803, -258855, -145152, 23675, -24665, -165131, -221036, -309786, -99694, 154295, 336424, 217567, 42736, 165092, 256679, -39118, -347472, -240137, -128140, -52548, 51011, 79570, -48684, -57057, -116066, -94780, 122976, 419645, 424095, 245208, 104750, 185965, 285977, 316243, 414720, 430517, 631182, 585507, 549403, 715736, 893865, 1260406, 1472854, 1511579, 1480043, 1465924, 1097955, 662397, 310882, 198260, 317389, 150263, 21693, 63132, 105146, 74311, 184609, 171797, 187158, 208048, 143829, 102792]
19545A02792q3245j14702l2413K61431L9084J626r4480r7600j17478J5564m6506
19534a65927J38087r9225r8935K09330R244j31658O1944J17694L4778j2169r2055
19523b8892J03584R115j61375j21950o0174R430J03049Q9493K5514N4249l6206
19512a4163N7870M1637Q435L6965j51071N6891N5952J932J5086k582p3333r7421
19500f3802j49872k3060J71035M8031R8783k47925l4405J41307l6164M9530J03262
19489E6720R0249k09216j55770Q1824j143n6611J87319J30198o9549j31243J49360
19478G2138j44404p1387n2427J12268j27173O520J65313P035o493p9051p5875
19467a93536o4298k478r4422j19474J65702R5347K6917k2264J88395J4549J1721
$$ y = [102792, 19547, -95155, -127568, 133863, 172947, 174573, 80093, -17507, -134985, -119421, -165927, -27840, -127065, -226000, -16670, -7426, -139084, -77140, 40554, 75332, 63163, -28892, 74692, 83807, -77568, -199518, -259692, -250262, -147213, -57720, -32206, 22043, -14163, 43707, 85344, 93779, 130744, -20327, 36564, 92516, 94448, 109534, 106952, 33619, -63802, -213674, -236734, -65699, -17668, 81115, -166810, -201215, -59908, -96072, -46542, 56720, 146969, -62247, -218017, -136193, -137336, -193947, -6628, 123570, 54021, -77222, 72138, -72266, -143653, -196080, -83812, -210985, -204465, -39152, -32117, -38610, -117661, -193536, -257834, -260312, -354734, -474208, -308506, -213159, -186242, -208506, -20111, -5562, 6159]
19456F159R2078J49650J01332j38420j00245p1606J48196j3202j38562J09615
19446A44995R6137L0843q7074j07126M8454J42364K49815J38203K74124J45855
19436A076590k31487k18000k28508O4364j39696r7263J88166j85179l5437m4169
19426A49381k3972j36543l9336J2096j5798l2385j14350J03892K9375M3591K7140
19415C091j52327n3523P5988R88K32737J24019P2743j21058j58214m704J80567
19404B00307J81289K72599J55357Q6299R6658R67k03380l29767m2254r3687O8391
19393C92779k17294k78415l4739J84830J90408q7431m9237P2151l5341k936k191
19382A32584o4075p096l1223k1771J21102M4587j07206M6749q984p149m9734j36955
$$ y = [6159, 98237, 247887, 349219, 210799, 110554, 38948, 187144, 173942, 35380, 144995, 241132, 271975, 184901, 77775, 126229, 268593, 518408, 656611, 930735, 1076590, 845103, 627103, 398595, 462959, 323263, 226000, 414166, 228987, 193550, 149381, 125409, -11134, -50470, -38374, -54172, -86557, -200907, -97015, -67640, -24049, 3091, -149236, -202759, -126771, -125783, 106954, 230973, 303716, 182658, 24444, 19740, 200307, 381596, 654195, 809552, 895851, 992509, 993476, 790096, 460329, 418075, 324388, 392779, 175485, -102930, -137669, 47161, 237569, 150138, 100901, 173052, 137711, 134775, 132584, 68509, 61413, 30190, 8419, 129521, 174108, 66902, 113651, 104667, 97518, 47784, -89171]
19370h9171Q749j0573m0197k6929J2112M1632K40600J00310M9242o1592N9815
19359B83998l2170j23026j34933K6392J41252K5160j2852j34206l0352p3813l7322
19348a01872p2559n8789J14403j6605O505j07210M6008L1257L5225Q6481M5179
19337H023P592k12928j16063P4949J15044K28826J19646J89913k8958j42872j77995
19326F5177o6870l5066j45797k46882J01264K40790J07246R8621Q3409j33522
19316F8370j69465j5291J95605J45563j51128q5089j29799j7010J09329j3289
19306f2204J9379K1343k22550l7850J84992k5271j50146j19765m0725P9360J71756
19295a81681J83599J13171j13874k1179J1357j97778r1179L3448J03293R9453
$$ y = [-89171, -80422, -90995, -131192, -158121, -146009, -104377, 136223, 236533, 285775, 224183, 283998, 251828, 128802, -6131, 20261, 161513, 186673, 173821, 39615, 9263, -64550, -101872, -174431, -233220, -118817, -135422, -128917, -236127, -190119, -158862, -123637, -37156, 8023, 15615, -197313, -313376, -238427, -123383, 105443, 225089, 415002, 386044, 243172, 65177, -1693, -36759, -182556, -429438, -328174, -87384, 19862, 118483, 201892, 68370, -101095, -116386, 79219, 224782, 73654, -11435, -141234, -158244, -48915, -62204, -42825, -21482, -244032, -281882, -96890, -122161, -272307, -392072, -432797, -353437, -181681, 1918, 115089, 1215, -19964, -8607, -206385, -297564, -264116, -160823, -61370]
19285f1370K6837Q1924m6193j79584o0170J3553R5777J18972J1794O1319l0083
19274C2776Q117p0647o2617J79193N33k01299j53359p4907O9023k6843L7950O9848
19262a92232j09893k736J59037Q0040o6295j80164J2909Q5198J90151J01291J16958
19251A94264N317k1094q1388j86933k67629l8810J23858R5982o7249r7346J06409
19240b34619N1341M7421J49227j71039n3858n650J42825J15947j59266k886P4522
19229d6035n936k5601p853O5647J78437Q3436p3148j80522Q2508J26226N5646
19218B52805j10197k3514l4371j58516J0833K12615N7519j32720r4103m387J12323
19207H8287q8584j30445O2662L00434J35143r0287p0955l6473j6564J28576r1469
$$ y = [-61370, -34533, 47391, 1198, -178386, -238556, -225003, -129226, -10254, 1540, 62859, 32776, 40893, -29754, -92371, 86822, 87355, -113944, -267303, -342210, -273187, -300030, -262080, -192232, -302125, -304861, -145824, -65784, -132079, -312243, -299334, -214136, -23985, 77306, 194264, 199581, 178487, 97099, -89834, -357463, -396273, -272415, -176433, -243682, -341028, -234619, -183278, -135857, 13370, -157669, -211527, -217177, -74352, 41595, -117671, -120557, -46035, -51971, -77572, -85425, -19778, 158659, 242095, 168947, -11575, 70933, 197159, 252805, 142608, 119094, 84723, -73793, -62960, 149655, 207174, 74454, -19649, -24036, 88287, -297, -130742, -68080, 232354, 367497, 277210, 206255, 169782, 153218, 281794, 190325]
19196A90325j39950N773r6954j1676J44537M7971j26167k2588k253O1561P4119
19185A24698o1211j80511k40356p7294L5167J55200N6640N4942Q0506j29983r5644
19174b77846J14624J24066L7230j55410o4282N2553r0033j12351J34907K03868
19164c2674J86283m629j67737N8771L715R8053Q1178j22873j06114j08523J10233
19153d317J22755n3405J847M097j07329o9166L4755J34655J85469L8904j5859
19142B72406o2979l00575j74049N4094J16340j37583J0311M2406j26807L487J80077
19131a22872K28487J08752q4591q5534R5227O9183j00909m7724k1145K0605n6883
19120B596m9451N8847J64969P7712j23196p5552j67366Q0358J91226J26999j37295
$$ y = [190325, 50375, 56148, -40806, -52482, 92055, 140026, 13859, -8729, -10982, 50579, 124698, 63487, -117024, -357380, -434674, -399507, -244307, -187667, -132725, -52219, -182202, -277846, -163222, -39156, -1926, -157336, -221618, -169065, -259098, -371449, -236542, -32674, 153609, 148980, -18757, 40014, 43729, 141782, 222960, 100087, -6027, -114550, -4317, 118438, 65033, 66880, 70977, -36352, -105518, -70763, 63892, 249361, 288265, 272406, 209427, -91148, -265197, -211103, -94763, -232346, -222035, -179629, -306436, -302949, -122872, 105615, 214367, 129776, 44242, 139469, 208652, 107743, 60019, 38874, 59479, 2596, -46855, 11992, 176961, 254673, 131477, 55925, -111441, -31083, 160143, 287142, 149847]
19109A49847M8211j6858m4288K1672J22475P9252l0675j20060j06313j08037p647
19098a2421K8157k1783j0866J58430Q4473J7892o7512M4932o6712n1692k4770
19087G8128o3406r5399m3760O6786o3500L900M4413N6144N0232J02973m4719o0628
19075C1164j3373l7516N8674R7262P0364l7564m7098J24098N8038j04628r1780
19064A07641J7514P0962k9298o1534j05591K26863L5983j1279O2024k2747l6280
19053B54258m2256j67874o4586o5763j3191J889k6164k5672O6491J16061l3323
19042a30j13535J31421k4513j39883m5615J24429k1006O8583l404Q4551l1436
19031B9462j57732J50457O1534j73116r1438q9806k8466J8460J90493J37317l4548
$$ y = [149847, 198058, 181200, 136912, 158584, 281059, 360311, 329636, 209576, 103263, -4774, -12421, 15736, -6047, -16913, 141517, 225990, 243882, 176370, 221302, 154590, 102898, 78128, 14722, -80677, -124437, -57651, -121151, -117251, -72838, -16694, 33538, 136511, 91792, 31164, 17791, -19725, 38949, 136211, 206575, 169011, 121913, 246011, 304049, 199421, 107641, 125155, 196117, 166819, 105285, -306, 226557, 262540, 251261, 313285, 290538, 254258, 212002, 44128, -20458, -86221, -99412, -97523, -123687, -149359, -82868, 33193, -130, -113665, 17756, -6757, -146640, -192255, -67826, -88832, -20249, -23653, 60898, 29462, -128270, 22187, 83721, -89395, -180833, -270639, -299105, -280645, -90152, 47165, 12617]
19020A2617N8207P7492q794r6659j31038Q0818O3353R822r5420m4840M1357J7781
19008a5304j07196j01531m1375K21342J70897j78434j02524M0169j9892r1824
18998b25672N9279J19974Q9614r2367L3586P6094n7129q2634n0878M9021J50727
18987F9615Q3150L3859j26084K3229j5558k47591q4798J89400N5230O9513L9430
18976H9395r493K5370k8314j20225r1265J71591Q893j83938k4729O7479n4865
18965a50101o4768J4454J89917J70773j7955k03367m681M5652K3843k30599M6383
18954a80449J04074J5484N4331O9757R7447J86360k4487j14128K3779K9359Q7481
18943C49008J07319j1505j84053k09539m9439J11036R3136m7473p0471J90914
$$ y = [12617, 70824, 148316, 139522, 42863, -88175, -7357, 55996, 65818, -29602, -74442, -33085, -15304, -122500, -224031, -265406, -44064, 126833, -51601, -154125, -113956, -133848, -225672, -166393, -46419, 43195, -49172, -15586, 60508, 3379, -79255, -130133, -81112, 69615, 152765, 186624, 60540, 83769, 68211, -179380, -264178, -74778, -19548, 49965, 89395, 79902, 105272, 76958, -43267, -134532, 37059, 45952, -137986, -162715, -95236, -150101, -214869, -200415, -10498, 160275, 142320, -61047, -65728, -20076, 3767, -226832, -180449, -76375, -60891, -6560, 63197, 160644, 347004, 322517, 208389, 232168, 261527, 349008, 456327, 444822, 260769, 51230, 1791, 112827, 205963, 158490, 88019, 278933]
18933B78933J33742M3974J55811K64559K3194m1688j39247r8441k56884j36223
18923B27730K3174Q4832R7629k7291p3769l8997J0546j0577M0816N2763j50947
18912B35909j11691J63641R2915Q8443k6877L7491O9164O7036j88332L572K2654
18901D53925l7464q4808J21115K83506K09932K81568M43960L70508l1417j40754
18891A870071l73799k0129J19240J04588K12160J97594L4505k09944l31257k84824
18881A318205j30167J8903J93891N0097M1350p976J5894K00735M60766L37476
18871B499174K16498J29885M52805O41822L91148J45362J00736M58398P96526
18862E832354Q12516J210965J675846K490055L764544N713301Q760704J4765791
$$ y = [278933, 412675, 456649, 612460, 877019, 900213, 858525, 719278, 620837, 363953, 227730, 250904, 335736, 433365, 406074, 332305, 293308, 303854, 293277, 334093, 386856, 235909, 124218, 287859, 380774, 469217, 442340, 479831, 548995, 616031, 427699, 431271, 453925, 416461, 331653, 452768, 736274, 946206, 1227774, 1671734, 2042242, 2010825, 1870071, 1496272, 1476143, 1595383, 1699971, 1912131, 2109725, 2144230, 1934286, 1603029, 1318205, 1188038, 1206941, 1400832, 1450929, 1492279, 1484303, 1500197, 1700932, 2161698, 2499174, 2715672, 2845557, 3298362, 3940184, 4331332, 4476694, 4577430, 5035828, 5832354, 6644870, 7855835, 9531681, 12021736, 15786280, 21499581, 30260285, 45026076]
18854D5026076K7117208M9148856O2983973J7985954k1924714l4172881n1036948
18847I5127524l6707519j8945904j0255820o253619m114648l175486k261437j391707
18839A2021384r32398n44510l87299l53359J21893J97693k5740l18605l99892
18830I379167l85858O182K63798M46361R32639J567982K453055L801392N742377
18821B4207095Q881492J4856553K6861489M9482858P2832636L8714991k0032269
18814B15804845l4964118n6648527m8513082k5928194j4024478q421378n627485
18807B1677583l874282k775305j922445j609041j145289q36533p26374m14798
18799H373516k39448n98969q24054q67715q04974n08341n29580m03909j82556
$$ y = [45026076, 72143284, 121292140, 184276113, 202262067, 180337353, 146164472, 95127524, 58420005, 39474101, 29218281, 22964662, 18850014, 15674528, 13413091, 12021384, 11088986, 10544476, 10157177, 9803818, 9925711, 10123404, 10097664, 9779059, 9379167, 8993309, 8999491, 9263289, 9709650, 10642289, 12210271, 14663326, 18464718, 24207095, 33088587, 47945140, 74806629, 124289487, 197122123, 235837114, 215804845, 180840727, 124192200, 75679118, 49750924, 35726446, 27305068, 21677583, 17803301, 15027996, 13105551, 11496510, 10351221, 9514688, 8788314, 8373516, 8134068, 7535099, 6711045, 5843330, 5038356, 4530015, 4000435, 3596526, 3413970]
18790C413970p9039j94852j47210j53423j14230j49544J33645J73490K38799l7523
18780C084083l45971k74885m75790j89063j75448o3114J734o8091j4962m7608
18770A430885J52119K38022N61661M73573k47084k97883k46511l62514k11526
18761A490742j99553j17209r1163j59116j08348k17614k23170L6789J74441j34323
18751D51476j00919l0213R5200J94053j23209j36852j2233J1186N5444n8821N5822
18740D00934l2445k28003r9175J52173M5365N6518k5667l689m2575k4919K09467
18729D07984n3451k77734n8517J37949K57501o0482p5853q4965j69483O3898J13350
18718B00197l4763j39943K8839N8292K07035o0827j52801J44613J54282j09976
$$ y = [3413970, 3334931, 3140079, 2992869, 2839446, 2725216, 2575672, 2709317, 2882807, 3121606, 3084083, 2738112, 2463227, 1987437, 1798374, 1622926, 1559812, 1561546, 1493455, 1478493, 1430885, 1583004, 1821026, 2382687, 2856260, 2609176, 2311293, 2064782, 1702268, 1490742, 1291189, 1173980, 1082817, 923701, 815353, 597739, 374569, 411358, 585799, 451476, 350557, 320344, 415544, 609597, 486388, 349536, 337303, 348489, 403933, 345112, 400934, 368489, 140486, 41311, 193484, 238849, 295367, 269700, 266011, 223436, 198517, 407984, 354533, 76799, 18282, 156231, 413732, 353250, 277397, 192432, 22949, 86847, 200197, 165434, 25491, 54330, 112622, 319657, 258830, 106029, 250642, 404924, 294948]
18708B94948j08300o9000m1062k8052M3458j50986J8435n2361J76113J14305K0597
18697B18095P2481j15998j85908J13293l6111q1035N2756J75587P8978J06481
18687C98619o2201j07311j59425k08696K2484J23933o968j2619M2686M1664J25344
18676A97510j821L508l5194q946J6998j31535j7558R5333P9791j97426r4631P7361
18664a6610N6921N7625l0812M6414J81860l3628j13599j61407k4250j03070K81987
18653A41431K74685j22856l09967P4038p4262j1545O7343n2004m0865o014J5577
18642d4439L4288o2649j18548J67575Q4154M5606n6964J9858N5532N6602J5338
18631A96353q9900j26395M1874M5968p4753o5853p3587J36312J23167J9217j16829
$$ y = [294948, 186648, 117648, 76586, 48534, 91992, -58994, -40559, -92920, 83193, 197498, 218095, 290576, 174578, -11330, 101963, 65852, -15183, 37573, 213160, 292138, 398619, 336418, 229107, 69682, -139014, -116530, 7403, 435, -12184, 30502, 72166, 197510, 195689, 199197, 164003, 155057, 172055, 40520, 22962, 118295, 198086, 660, -93971, -16610, 40311, 97936, 67124, 113538, 295398, 261770, 148171, -13236, -37486, -140556, 141431, 416116, 293260, -16707, 57331, -16931, -28476, 38867, -13137, -54002, -60016, -44439, -10151, -72800, -191348, -23773, 60381, 105987, 49023, 68881, 124413, 181015, 196353, 106453, -19942, 21932, 67900, -6853, -72706, -146293, -9981, 113186, 132403, 15574]
18620A5574p9794L2938K4406N4014M0861L3424m7699r6120J8652K3939K4476j77557
18608a32886j84320O2764R7699Q2955Q06P2954O569n8061m0837J66874J87596
18597B62113J20407l7019O1959j780J99p9018o8394j25019k8879J09753L4216
18586B48538j45978L5100J15243k7956k7374m2496n5234N3622n8479k07658M2856
18575f9816K12887J0221j09555q3700n5463L830k3327O3942L7673J6326m6036
18564d3018L8545K26454J20213j32875j11885R6958P1691q2331n8941M2812j08283
18553E9340j12832J9540P2679M2528j82490J81333J23452j37263j39916J46999
18543G3370l8163K0097q6795j95379k1409O6940J03032K2240k2381J175N7212
$$ y = [15574, -64220, -31282, -6876, 47138, 87999, 121423, 73724, -22396, -3744, 20195, 44671, -132886, -317206, -254442, -156743, -73788, -72982, -28, 6541, -51520, -92357, 74517, 262113, 382520, 345501, 407460, 405680, 405879, 326861, 258467, 133448, 104569, 214322, 248538, 102560, 137660, 252903, 224947, 197573, 155077, 99843, 153465, 94986, -112672, -69816, 143071, 153292, 43737, -39963, -95426, -91596, -114923, -50981, -13308, 3018, -43018, -4473, 221981, 342194, 209319, 97434, 194392, 266083, 183752, 124811, 167623, 59340, -53492, -33952, 38727, 81255, -101235, 80098, 203550, 66287, -73629, 73370, 35207, 55304, -31491, -226870, -248279, -181339, -78307, -56067, -78448, -77273, -20061]
18532b0061p8781M3060J76420Q0736j12014p9053J31140M3074k2096j23544j16182
18521g7301J7747l8311m2303j16752J25007J19787m7516j1816q2301Q7548Q6927
18510B0716J56213m7915j45039m5642m276k5391P1940M4839l6691r5137o0026
18499a66409p445K3412J60747J6223Q1388j9887J41566L772j41878M6397J0942
18488A48828j43087l1330J04527L0186p2166J23470j74440k446J68132M2699l6631
18477A57742J30123L9978J24743j05179j29069K4504J2821k8866l4271Q3233m7200
18466B28559l2560P7581J11871n0494m3824j60572o3315J35963r4164K8943r4042
18455D3946k5558K27865O0424j61988K6257J89453j05568n8385k4631J64472J79533
$$ y = [-20061, -98842, -55782, 120638, 201374, 89360, 10307, 141447, 184521, 162425, 38881, -77301, -59554, -97865, -140168, -256920, -131913, -12126, -59642, -71458, -153759, -66211, 20716, 176929, 129014, -16025, -61667, -65943, -91334, -19394, 25445, -11246, -106383, -166409, -173854, -150442, 10305, 26528, 107916, 88029, 229595, 233367, 91489, 137886, 148828, 5741, -25589, 78938, 109124, 36958, 160428, -14012, -16458, 151674, 194373, 157742, 287865, 327843, 452586, 347407, 218338, 242842, 255663, 226797, 192526, 275759, 228559, 195999, 273580, 385451, 334957, 291133, 130561, 67246, 203209, 109045, 137988, 43946, 18388, 246253, 306677, 144689, 170946, 360399, 254831, 196446, 171815, 336287, 515820]
18444E15820L858k4648k9270o7467J11870J6209K5564n3193m5797J69639j1750
18433F10835m3786j71747j1352K73245J83309j93972k49085M5804J79788P174
18423F30213p0603M5062M394L6516J82935L5131K599o074r5399r2230L1122K9260
18411G32926J34456M7956J54225J27320L04266K08142L52742N37149K97194j12671
18401B783705J09445J80026L3339q8210K01708K89609L88001M53043M78714P82779
18391E612159J152261J250545J172572J344918J930975L133283N217841Q469172
18383B9283726J4738044K6967111M9023012P0706743M1384874j5037281l4923547
18376A82142682n4416364m9506124k7544916j4539734q619166n502044l371187
$$ y = [515820, 519678, 495030, 465760, 398293, 510163, 526372, 551936, 498743, 452946, 622585, 610835, 567049, 395302, 383950, 657195, 840504, 646532, 397447, 443251, 623039, 630213, 559610, 604672, 609066, 645582, 828517, 863648, 866247, 860173, 764774, 672544, 703666, 732926, 867382, 915338, 1069563, 1196883, 1501149, 1709291, 2062033, 2599182, 2896376, 2783705, 2893150, 3073176, 3106515, 3018305, 3220013, 3509622, 3897623, 4350666, 4829380, 5612159, 6764420, 8014965, 9187537, 10532455, 12463430, 15596713, 20814554, 29283726, 44021770, 70988881, 120011893, 190718636, 232103510, 217066229, 182142682, 127726318, 78220194, 50675278, 36135544, 27516378, 22014334, 18643147]
18369A8643147k055218j325973j250413j138945r00555r52416q21283m89348m28807
18360I280189j24532o9784o4094K78607P57918J097779P66294N96060Q84248J862890
18350A5265575L564099O161011J0804875J9705837L6384155N8476052M8155331
18343A98516935m236935k7359469m3359065m7143004k8370567j4877199q394138
18336B4776558n304408l569696k424926j650619j096253j041801q89930r08544
18328G890381r29634l61585k26886l71050k01240k40806m25137k87018q6884l26698
18318D433443n20195n04929m60690m90875k30173r1465m0805j25245k90915k55785
18308A422366k026L23Q1375j0276j47640q4938O5870j39233j23120J02723k24761
$$ y = [18643147, 16587929, 15261956, 14011543, 12872598, 11972043, 11019627, 10198344, 9708996, 9280189, 9155657, 9085873, 9021779, 9300386, 10058304, 11156083, 11922377, 12518437, 13402685, 15265575, 18829674, 24990685, 35795560, 55501397, 91885552, 150361604, 198516935, 194280000, 166920531, 123561466, 76418462, 48047895, 33170696, 24776558, 19472150, 15902454, 13477528, 11826909, 10730656, 9688855, 8798925, 7890381, 6960747, 6599162, 6372276, 6001226, 5799986, 5559180, 5134043, 4847025, 4760141, 4433443, 3913248, 3408319, 2947629, 2456754, 2226581, 2135116, 2094311, 1969066, 1678151, 1422366, 1420340, 1420663, 1502038, 1491762, 1344122, 1259184, 1325054, 1185821, 1062701, 1165424, 940663]
18297I40663j94678L4468R0829l479j60642j65596r7101J02670J9892J374N4794
18286F23194l5111K855J07979J47206M8403j04464j44867j4371q3341l6288R0667
18275F01862Q8983Q4740Q5186m7545o3062k52498o8188l7406m5714j12643J16971
18264C50686O8371M0526o924L6952M4412L723K20078J11627J13345M22377N31278
18253A936451J23523k77106l44265l64384l06803j1735j49277j46074J7222M1257
18243E18809j33354L197n7296O6485k027m2075q2419p2134N1018J08341J807r6678
18231B63674J63037O4422k40245m6376J04651Q3082m9494n912r8481n6999R8489
18220B79848J71238L83723K55014m2203p5627j28374j57225o3572j52491m5848
$$ y = [940663, 745985, 780453, 871282, 867803, 707161, 541565, 444464, 547134, 567026, 568400, 623194, 588083, 590938, 698917, 846123, 894526, 790062, 645195, 630824, 547483, 511195, 601862, 690845, 775585, 860771, 813226, 750164, 497666, 429478, 392072, 346358, 233715, 350686, 419057, 459583, 452659, 489611, 534023, 537746, 757824, 869451, 982796, 1405173, 1936451, 2059974, 1782868, 1438603, 1074219, 767416, 755681, 606404, 460330, 477552, 518809, 385455, 388652, 331356, 397841, 395814, 353739, 271320, 199186, 250204, 358545, 360352, 263674, 426711, 491133, 250888, 204512, 309163, 392245, 342751, 336839, 238358, 181359, 279848, 451086, 834809, 1089823, 1047620, 971993, 843619, 686394, 622822, 470331, 424483]
18210D24483q4674j64135o6721N9869N6035k6246j19271n391j23598J1308J29860
18199I1519r3403K78875Q9301q2494n1504j98597l6182J24609J83893J13344J14607
18188E33968j39462j05305J3241J10141r2106q3170q5865q4674J57117K1510K3149
18177B68544J00580Q1447K2100k53123k04110J71770K34638q6224K1042O9945
18167D26609j05022p6780n5908m3398P7354J30097o4784L0295M7822N7963o7715
18156C56533j05042K00696N1217j7825J20576J48090J17129M5161J3506J1991
18146I42032m0762M68K11501N0626j32949n9930N0814l4979m7661J4237Q537J85465
18134A147399K18540K67120J44194P0753K52444K38843J48327J41774M07677N99701
$$ y = [424483, 339809, 175674, 108953, 168822, 224857, 198611, 79340, 73949, -49649, -38341, 91519, -1884, 276991, 366292, 283798, 232294, 33697, -2485, 122124, 306017, 419361, 533968, 394506, 289201, 302442, 412583, 320477, 237307, 151442, 66768, 223885, 245395, 268544, 369124, 450571, 472671, 219548, 15438, 187208, 421846, 335622, 356664, 426609, 321587, 244807, 188899, 145501, 222855, 352952, 288168, 318463, 366285, 424248, 356533, 251491, 452187, 503404, 485579, 606155, 754245, 871374, 916535, 930041, 942032, 901270, 901738, 1113239, 1163865, 1030916, 970986, 1021800, 986821, 939160, 953397, 961934, 1147399, 1365939, 1633059, 1777253, 1848006, 2100450, 2339293, 2487620, 2629394, 3037071, 3636772]
18124C636772O60715Q98783P53482Q71551J126561J405384J873303K488086L400460
18115A7115097N514110Q973585J4895548K6718587N0286914R2736554J11606732
18108C27847127J7429479m3738855o4232118r1738655n8878461k8860866j5596189
18101D2231462r558103o224767m451850l494743k561339k139174j695833j427835
18093A0677818r16751p34324p02342p53138o34357o63989n99127n23914m77009
18084D672867k41060k55681k80867j13118k37437l85563l08931k19946j99119
18075B431145j58630N3981j6701r9301j40871n2940k30645l34257r5232K1095
18065A377644L9219k622j1886j21730K225j03485k9091L2540K70606J93853J8592
$$ y = [3636772, 4297487, 5196270, 5949752, 6821303, 7947864, 9353248, 11226551, 13714637, 17115097, 22629207, 31602792, 46498340, 73216927, 123503841, 216240395, 327847127, 345276606, 301537751, 237305633, 145566978, 86688517, 57827651, 42231462, 32673359, 26448592, 21996742, 18501999, 15940660, 13801486, 12105653, 10677818, 9761067, 9026743, 8324401, 7571263, 6936906, 6272917, 5673790, 5149876, 4672867, 4431807, 4176126, 3895259, 3782141, 3544704, 3159141, 2850210, 2630264, 2431145, 2272515, 2326496, 2309795, 2210494, 2069623, 2016683, 1786038, 1451781, 1356549, 1377644, 1416863, 1414241, 1402355, 1280625, 1282850, 1179365, 1150274, 1182814, 1453420, 1647273, 1665865]
18054A665865L8646j47410n7430j43984k21050j47178n2609l0936K8094j34775
18044G97233k47961K9616K0904q9736P2200J57443L7575k88201k53778q0994P159
18033A61460n26P9085R9484J14991J2571n7006M1098j08725n8067l7741l957J50133
18021C92800R626p1810J08667N3257j20172k7247j87249N6627J02809j61368p1585
18010H4355J0813M3927J8363M501J6118m0793J21958J75133j14564r5093P3739
17999B98457r033O3668M8078O0606M7095m8631J69630J98563Q5836J14244K47523
17988A276036O2420j08370k81025J25150N5123l5598l6675P0688j76164j63674
17978G87911j20740q3355l7398m2146j09124k8637M5856k3483m5468O5749R3241
$$ y = [1665865, 1704511, 1557101, 1499671, 1355687, 1134637, 987459, 934850, 903914, 932008, 797233, 549272, 578888, 599792, 510056, 582256, 739699, 777274, 489073, 235295, 154301, 161460, 160934, 240019, 339503, 454494, 467065, 410059, 451157, 342432, 284365, 246624, 242667, 392800, 402426, 330616, 439283, 492540, 372368, 345121, 157872, 214499, 317308, 155940, 84355, 95168, 139095, 157458, 161959, 178077, 137284, 259242, 434375, 319811, 224718, 298457, 289424, 353092, 401170, 461776, 508871, 460240, 629870, 828433, 914269, 1028513, 1276036, 1338456, 1230086, 949061, 1074211, 1129334, 1093736, 1057061, 1127749, 951585, 787911, 667171, 583816, 546418, 504272, 395148, 366511, 412367, 388884, 343416, 409165, 502406]
17967E02406k0245k39860k0987K9819K5486k9128o4879J9624J143O8362J64462
17956D36203j30689j94217M7125P9924j32041m3389J74529J19076J12118j0753
17946D57886M1275K0795p4795j66957p7644J76062L6916R1848n2069N0789l776
17935E00330k0767k44081k05009j25724N0004J21224k8570J0169r4022P168p217
17924c6495M2820j77836j51869j74982m985P8304J50274L4828J04188J76413K6338
17913F6998j52980P7173R2372j14575K2762k0905N4947J09459m8621q8686j4023
17902a6079k3906r7974j23215J35631J94457J02256m717k92474k8157J15590K2686
17891a5902J17032R8327j37526r7206j4668j20302j81346M5537K32988m671J03651
$$ y = [502406, 482161, 242301, 221314, 251133, 276619, 247491, 182612, 202236, 203379, 271741, 436203, 305514, 111297, 158422, 238346, 106305, 62916, 237445, 356521, 468639, 457886, 499161, 519956, 445161, 278204, 200560, 376622, 413538, 505386, 453317, 504106, 500330, 479563, 235482, 30473, -95251, -45247, 75977, 47407, 57576, -36446, -29278, -36495, 6325, -171511, -323380, -498362, -503347, -425043, -274769, -239941, -135753, 40660, 66998, -85982, -8809, 83563, -31012, -8250, -29155, 25792, 135251, 86630, -2056, -16079, -39985, -137959, -261174, -125543, 68914, 171170, 166453, -126021, -154178, -38588, -15902, 101130, 199457, 61931, -35275, -49943, -170245, -351591, -306054, -73066, -77737, 25914]
17880B5914k9549n3220J11869p3532M9788J16410Q4035k2484M6709J02523j07395
17869B51068J306r9240j81549n2831N0248M3551O02m0170r7929L465j48488k129
17857b72096K5406Q6701L6516n4612m758k188l465K22380J50673j6882n7956Q1352
17845A91071J13774j31264j56434N719n063n594J82805P4454o33j48589l469K02339
17833C19116J91708n8807k3222J15114N8589R9762R7146M275j22796j17088j82390
17822C81407j49045j74139M2161Q6110J5938k08237r3887n9537L8988J15025P5152
17811F9936j22712J8440J7226j32678q7776P604j00788n486K66354K04095L1957
17800A66172k4920l3123n070O1579L4757K49197J01885J87259n6288q4052j8717
$$ y = [25914, -3635, -56855, 55014, -18518, 31270, 147680, 231715, 209231, 255940, 358463, 251068, 252374, 153134, -28415, -81246, -30998, 12553, 13155, -27015, -124944, -121479, -269967, -272096, -246690, -159989, -123473, -178085, -182843, -185031, -188496, 33884, 184557, 167675, 109719, 191071, 304845, 173581, 17147, 22866, 17803, 12209, 195014, 269468, 268835, 120246, 116777, 319116, 510824, 452017, 428795, 543909, 602498, 702260, 799406, 803681, 680885, 563797, 381407, 232362, 58223, 100384, 186494, 202432, -5805, -99692, -159229, -120241, -5216, 69936, -52776, -34336, -17110, -149788, -237564, -229960, -330748, -336234, -69880, 134215, 166172, 141252, 108129, 103059, 164638, 199395, 448592, 550477, 737736, 681448, 597396, 578679]
17789E78679r7286k07084K7314k5255k17700r1321j32271j56252o5851K86313
17779a00714J66514k6131j78m1724j0949J0934p0325j2567m7965J79274O6164
17768A12333L9148j43688J27665Q367j39383j79314L5320j8833K40689j12282
17758b9978j27707O3314j17796J08523O1063n3300o2512j00053P7026J68449P1114
17747E8143k61750j1544K5781J20033J53540o1804n0922j0411J4345K6207J46047
17736A47665K16047j39890J6964K235j69370j70892r4782P5543M460q9723J14291
17725h7452Q6406L00M4638k8979k7674j22701k33945J22008p6322K180N9312J66774
17713i5455J66803O0327j60647m7298q3308J4124N9256J9584k13468r2374K40046
$$ y = [578679, 481393, 274309, 301623, 276368, 58668, -32653, -164924, -321176, -387027, -100714, 65800, 39669, 39491, -2233, -13182, -2248, -72573, -85140, -133105, 46169, 112333, 151481, 7793, 135458, 143825, 4442, -174872, -139552, -158385, 82304, -29978, -157685, -94371, -212167, -103644, -42581, -95881, -158393, -258446, -181420, -12971, 58143, -203607, -215151, -189370, -69337, 84203, 22399, -28523, -38934, -24589, 1618, 147665, 363712, 223822, 240786, 243021, 73651, -97241, -192023, -116480, -112020, -201743, -87452, -1046, -746, 43892, 14913, -12761, -135462, -369407, -247399, -323721, -321541, -262229, -95455, 71348, 131675, -28972, -76270, -159578, -145454, -86198, -66614, -280082, -372456, -132410]
17702a32410K4123J9380J37893L7417j03138o3278P7644k1945M5586j37670j43299
17691b59697k024r6100O2846R1186q5118R0745N0267k2855J03998p433P3520Q9058
17679H8393n6003j74815j36482n6501O6932K69046J07985l6826k49433l374K2955
17668a58123K37539J72966J08745O3875K0801j0389J3305O6014k2160M4307Q5824
17657F22704L2743n457j47795k04602j47187k8445j59943j66080n2256R241o3075
17646c10152K16369M8309o46p3547l8499M7736o285J42715J79530r7048L6774
17635A45256O924q7798N1864J34889q7845p1147j55624l2308M4276J54002o7739
17624C4750l3278n4341L5207k1612J7730p935j33383M8716r049K1093n1259j08780
$$ y = [-132410, -108287, -88907, 48986, 86403, -16735, -80013, -2369, -24314, 21272, -116398, -259697, -261721, -357821, -294975, -203789, -288907, -198162, -147895, -170750, -66752, -74185, -665, 88393, 32390, -142425, -278907, -335408, -268476, 570, 108555, 71729, -177704, -181078, -158123, 79416, 252382, 361127, 425002, 445803, 435414, 448719, 514733, 492573, 536880, 622704, 655447, 649990, 502195, 297593, 150406, 121961, -37982, -204062, -256318, -247077, -310152, -93783, -45474, -46120, -119667, -158166, -110430, -116715, 26000, 205530, 108482, 145256, 152180, 64382, 116246, 251135, 163290, 92143, -63481, -95789, -51513, 102489, 34750, 1472, -52869, -17662, -39274, -21544, -29479, -162862, -114146, -123195, -102102, -153361, -262141]
17612b62141M2264K62733m4448l2907K4388m3219Q6566O0600j21808Q6478J80578
17601B39084n6724q8441q7719R392p6277p2237J66615m777k3410p5852o3803R8693
17589c5456J03678R938j09220m5475J44425K3954Q9288N6602j42017j45272j88888
17578b38443j82161R2430R7950L9442M2115M9747l839Q4041J33529L1545l8179
17567A08177p0064j25484l8493K3608J08979N8464j353l0819k26036p4983Q5294
17556a82710K47722J51796o7925J9163l6201m4957j36672O8536J09880k7514q456
17545I2662p998l5828K5038K7688J3716j86007j24747j45995J29513O7802R9845
17534d4311j04383M5324O4002k58248K1375n8609l8342N0321k5557j51036J59984
$$ y = [-262141, -219877, 42856, -1592, -34499, -10111, -53330, 33236, 93836, -27972, 58506, 239084, 182360, 93919, 6200, 15592, -60685, -132922, 33693, 28916, 5506, -70346, -134149, -35456, 68222, 78160, -31060, -76535, 67890, 91844, 181132, 237734, 95717, -49555, -238443, -420604, -328174, -230224, -190782, -148667, -98920, -102759, -18718, 114811, 146356, 108177, 38113, -87371, -125864, -102256, 6723, 65187, 63834, 33015, -193021, -268004, -182710, 65012, 216808, 148883, 168046, 131845, 86888, -49784, 18752, 128632, 101118, 92662, 84664, 48836, 73874, 101562, 115278, -70729, -195476, -341471, -211958, -144156, -44311, -148694, -103370, -39368, -297616, -276241, -334850, -373192, -322871, -348428, -499464, -339480]
17523c39480J20607O3705k6114P3293J27390J37106l3535j34122j28677p3305
17513b13132P0572p7511K607J52074J26782j20744m4003Q0971M8517M1396j38190
17502g0661r0258o8003N0236k6857O5827j04046j34012K6271J69696J02824j52493
17491b31476O7098J11076N6921j79410o4035R8974J58172O0052l9704j37897Q375
17480i1854K0172Q8022o1484k41946j45660J32658K58511R3752n9499K1325k2635
17469h638k343m6075j6555m906j19856p231m8248O2741J05274J0261j96357k13109
17457d85042Q3044J28053K09762P4903j9706R1475K0707k9620J9991q9071O2473
17446F6969K19408L03129L73178O70743K09569j92980j27618n55348m21681l00814
$$ y = [-339480, -218873, -155168, -181282, -107989, 19401, 156507, 122972, -11150, -139827, -213132, -142560, -220071, -217464, -65390, 61392, -59352, -103355, -22384, 26133, 67529, -70661, -160919, -228922, -178686, -205543, -139716, -243762, -377774, -351503, -181807, -78983, -231476, -164378, -53302, 3619, -175791, -239826, -140852, 17320, 77372, 37668, -100229, -91854, -71682, 16340, -45144, -287090, -432750, -300092, -41581, 52171, -7328, 13997, -8638, -10981, -57056, -73611, -78517, -198373, -205604, -253852, -191111, -85837, -75576, -271933, -485042, -401998, -273945, -64183, 10720, -8986, 82489, 103196, 73576, 93567, 4496, 66969, 286377, 589506, 962684, 1633427, 1842996, 1650016, 1522398, 967050, 545369, 244555]
17436B44555j74446l7434k5905O0744j43176j95889j00880j5492l4632R6567J3880
17425c12108J16049J10606R1327n195j363k4798j5114j71462j69793L7950J61091
17414a82810J75922O8496r4614M3696j11538K3845K5001J693m0639l1905J01175
17403b1678K2202j97977n6345P9189P8876j4120q6318p7238R3231P8264J37838
17392C5924J16759J7545l1157j4633m0270l1560m0366j72969P9661K11085k5694
17381A04325j76209l8452Q0433j28611k8607Q0197J1270n4284J2134j08350j75811
17370d21965P7606J3099O7237K10000L0852o0030q2015m6819k5528J05378J82997
17359E0812M4324j27986n0132m1748l0333P7541j3796J6797p734k8045L9842K3479
$$ y = [244555, 70109, 32675, 6770, 67514, -75662, -271551, -372431, -387923, -422555, -325988, -312108, -196059, -85453, 5874, 679, -684, -25482, -40596, -212058, -381851, -343901, -182810, -6888, 61608, -33006, 10690, -100848, -77003, -52002, -50309, -90948, -122853, -21678, 524, -197453, -253798, -174609, -95733, -109853, -196171, -273409, -180178, -101914, 35924, 152683, 170228, 139071, 124438, 84168, 52608, 12242, -160727, -81066, 130019, 104325, -71884, -110336, -29903, -158514, -187121, -106924, -95654, -149938, -137804, -246154, -421965, -344359, -331260, -264023, -54023, -23171, -83201, -165216, -212035, -237563, -132185, 50812, 95136, -32850, -82982, -124730, -155063, -77522, -91318, -74521, -82255, -110300, -70458, -46979]
17347d6979n4858Q0726R258r5358Q0358J34613J07530m6630j66123L4106j0768
17336B5875j14304n1992l8716j10447R677J04581O4988J00988j6246K5801N3759
17325E3964N9751J00748n4451j452k4191J4570O0292q365n9844k23549j55179
17314b37706L5772O1502q9077r348N5350M4507R5998J09518J10393J00112o0654
17303B16367j2036k9575N1154K5851o4033P4454j44860q3779m8716p2193O2600
17292b4766K5422k3141R17j1690L665P5534r1528o5387j14473r8892N3351P5855
17280a95133o7123L9384k3262j67173L2132O322K04793J70846n6882K1455j9906
17269e4547J04506Q2429q6694p0732M3044K3161M3944j00869L5481K5590n9665
$$ y = [-46979, -101837, -21111, -11853, -107211, -26853, 107760, 215290, 168660, 2537, 36643, 25875, -88429, -140421, -179137, -289584, -279907, -175326, -110338, -9350, -25596, 205, 53964, 113715, 214463, 160012, 158560, 134369, 148939, 209231, 200866, 141022, -82527, -237706, -201934, -140432, -229509, -238857, -183507, -139000, -43002, 66516, 176909, 277021, 216367, 204331, 174756, 225910, 251761, 187728, 262182, 117322, 33543, -15173, -87366, -24766, 656, -22485, -21568, -33258, -29593, 45941, -45587, -110974, -225447, -324339, -270988, -195133, -262256, -222872, -246134, -413307, -381175, -374853, -170060, 786, -56096, -34641, -54547, 49959, 132388, 45694, -25038, 18006, 41167, 85111, -15758, 19723, 45313, -14352]
17258a4352m8307q4204J61323J05549n0581J8151L1469j59975j07398n814l3005
17247a87144M8472j6213J34043K091n0749r8966Q7684J39285Q578l828J20575
17236A83828n8695p9916j89616m8798J3442M0455j27079j10440J68516J21804
17226h6499J84879k5458M1891q4758j42523Q3691J52707P2808L7349k21942J3398
17215B5543J01259k53606j81325J66561J61609J1857j09992p2436p8505J28250
17205a00785M4820r3834J4442J76145o6054j20003N921q1954K0328J59049J15322
17194G3397n9343j24161O7554K637m1303J47044O8774n8336j94272k38625K40506
17183a16128R2595o3897L5283M8421P9967P6453O1596m6977p1150k5770P513K25585
$$ y = [-14352, -62659, -146863, 14460, 120009, 69428, 87579, 119048, -40927, -148325, -154139, -187144, -138672, -154885, -20842, -18751, -69500, -168466, -80782, 58503, 67081, 63253, 183828, 125133, 45217, -144399, -193197, -179755, -139300, -266379, -376819, -208303, -86499, 98380, 72922, 114813, 30055, -112468, -28777, 123930, 196738, 234087, 12145, 25543, 126802, -126804, -308129, -141568, 20041, 31898, -78094, -150530, -229035, -100785, -55965, -149799, -135357, 40788, -25266, -145269, -139348, -221302, -200974, -41925, 73397, 14054, -110107, -42553, -39916, -81219, 65825, 134599, 76263, -118009, -356634, -116128, -23533, -87430, -52147, -3726, 76241, 152694, 214290, 167313, 96163, 70393, 77906, 303491]
17171C03491j3093j72127k34322N2979J40743j2255q0652p175l8449m100P9205
17160A4245N1473L4020j72721N2920O6511j34706q0189K08539K05859M4766j64956
17149A25761j45154m8085M7443N5315j07899n9645o5842j438K11214L362p6698
17138f1666M053o955l2070n732K0753j5312N3513M0637j9687j2901K332n3735
17126h6770J29987k9288p2252j43396Q7615n9859m6525J29611j81553m9937J49098
17115a73269j30161m2510J25951J21997O5714L4038K4475K9783o678N4908j52104
17104d7856k02601j09905M009K23504K23215q2261J34488K43741j00118l06224
17094b0008l5572J72330j22670r2546k601n1592J34942k976k9393k3725j47599
$$ y = [303491, 290398, 118271, -116051, -63072, 77671, 65416, -15236, -22411, -60860, -64960, 14245, 65718, 99738, -72983, -20063, 46448, -88258, -168447, 40092, 245951, 290717, 125761, -19393, -67478, -20035, 35280, -72619, -132264, -198106, -199544, 11670, 15032, -61666, -57613, -64568, -96638, -102370, -81617, -96929, -43416, -2779, -22466, -35367, -33035, -86770, 43217, 13929, -58323, -201719, -114104, -173963, -220488, -90877, -272430, -322367, -173269, -303430, -345940, -219989, -97992, -32278, 1760, 26235, 56018, 49340, 104248, -47856, -250457, -360362, -356353, -132849, 90366, 8105, 142593, 386334, 286216, -20008, -55580, 116750, -5920, -98466, -101067, -152659, -17717, -20693, -50086, -73811, -221410]
17083b21410p2234R0690Q6412j3195l968R4121n8031j82594N8843L9240J45006
17072c7120L7672j65474j1729R458J4917M3210J15232J2087L304l3555j8669N2184
17060B1517l9223j01024J42355p627J61845q4288j13382r2335j48104j0136p783
17049b78185j25118Q2796K15970m3801m5162m9869k6957l1578J105J82572J46112
17038B7885L6704m4562j9068R4700Q0724j13822p2506m667j18293Q5793L0230
17027a6882J36384j7017J26506M2464M3371j51095m356o5059n0414J9195N1321
17016A14418L3182j58869j20960R7297M0703p7850j1896J32893Q142l6210P1945
17005I2795n325j46684m0567J09094J02091P03p6649R0460J7551L45P7087j19963
$$ y = [-221410, -293644, -202954, -116542, -129737, -133705, -39584, -97615, -280209, -221366, -182126, -37120, 552, -164922, -176651, -167193, -152276, -109066, 6166, 18253, 21557, -11998, -30667, 21517, -17706, -118730, 23625, 15998, 177843, 93555, -19827, -112162, -260266, -270402, -278185, -403303, -320507, -104537, -148338, -193500, -243369, -270326, -301904, -300799, -118227, 27885, 64589, 20027, 959, 95659, 176383, 62561, -9945, -14612, -132905, -47112, -16882, 119502, 102485, 228991, 271455, 314826, 163731, 159375, 94316, 43902, 63097, 114418, 147600, -11269, -132229, -34932, 5771, -72079, -83975, 48918, 57060, 20850, 92795, 87470, -59214, -99781, 9313, 111404, 112107, 35458, 125918, 143469, 143814, 220901, 100938]
16993A00938k17808o2917K2457m393p8866j42681Q6688n2193n3210j93788M0543
16982e55230K47376L15380K45978J52705k43632k52941p5379J8337K02781J58926
16972B14301K2266m5973j74888l8501J34325J56306j38095N5409J28224r6933
16962B16441l8145j3186j79806q7213q7552O5716O5660O8321J1674n4183Q646
16951b3627o9544r9632J8524J63038j35227N8426j2152n7819K1335O3887P9466
16940F675J650q3541l0734R4046J05313J8637r6904j20789j96708k161J30679
16929a73837l3681j54792Q7423J9900K5457M9322o77j1348j30999R888Q9846K8719
16917a94779K52126J20224j15500o5968o0p8200p4715j41092l4995K0633L7225
$$ y = [100938, -116870, -179787, -157330, -161723, -240589, -383270, -296582, -348775, -401985, -595773, -555230, -307854, 7526, 253504, 406209, 162577, -90364, -165743, -147406, 55375, 214301, 236567, 190594, 15706, -22795, 111530, 267836, 129741, 185150, 313374, 216441, 178296, 165110, -14696, -101909, -189461, -123745, -58085, 10236, 21910, -32273, -23627, -93171, -192803, -174279, -11241, -146468, -88042, -100194, -158013, -136678, -72791, 6675, 8325, -75216, -105950, -11904, 93409, 112046, 15142, -105647, -302355, -304516, -173837, -207518, -362310, -274887, -254987, -229530, -180208, -180885, -192233, -323232, -313344, -223498, -194779, 57347, 177571, 62071, -3897, -3957, -82157, -156872, -297964, -332959, -312326, -275101]
16906b75101J13999N1602j47667J00979J70852r8915j22353N8974N2744l1707
16896a26593R715K8653J8519O9034k1409j31671K2988L2429J01504P3399m7885
16885B8683L0121m5439j49183j98317O1098R9439P0956p3348P2907K53912r674
16874A41155m0673o1719J38287N1713j02333J6352p2892k00546q9830Q2898j23403
16863b60991j7004j27328Q2724O1349P831K34317M2580j39872n0785l8397j00571
16852c06147p2407N4232n7263j97102K20684J51780K9305J62010K10529k7864
16842A67757k07601p3289J02820Q9977q8631j64235m1612O2934N3943K35420K8204
16831A65687q6525j12732j4848l0939n3838n2366k6742K0772J15722N0378j08551
$$ y = [-275101, -161102, -109500, -257167, -156188, 14664, -84251, -206604, -147630, -94886, -126593, -116878, -88225, -69706, -672, -22081, -153752, -130764, -98335, 3169, 76568, 28683, 58804, 13365, -135818, -334135, -273037, -173598, -102642, -175990, -103083, 150829, 141155, 100482, 38763, 177050, 228763, 126430, 142782, 69890, -130656, -220486, -137588, -260991, -277995, -405323, -322599, -261250, -253419, -19102, 23478, -116394, -167179, -205576, -306147, -378554, -324322, -381585, -578687, -358003, -206223, -176918, -14908, 195621, 167757, -39844, -113133, -10313, 79664, -8967, -173202, -214814, -151880, -97937, 137483, 165687, 79162, -33570, -48418, -79357, -133195, -185561, -212303, -191531, -75809, -25431, -133982]
16820a33982r1688q426N5757K46329J7605r4249m1947R831k8046r1386O9577J09618
16808A8993j5208r4482K7738M5950Q2769L7345j16779n0096J18165k3474J1191
16797D2112L4645N7448J4441K0587l4785L369j05247p3649O8389J71244k3870
16786A74684j35485k0194j06625k17240O74J59860o5858j10576L5662Q3342J91362
16775a0394N824J62411K09160n0921k990k42535j78855J42815O8812n0981L1706
16764H4052M1759r6828J6356Q2693J28876q7947o1956n1291j82518r5977J83085
16753c9696M9100r7538j3629L2864M5277N0081R3104N4496j72618q0463P7730
16742a292L1467O8047P5236j0207O8790n6844j1125m474J4198j5357N9925k73209
$$ y = [-133982, -225670, -234096, -178339, 67990, 85595, -8654, -50601, -40770, -68816, -160202, -90625, 18993, 3785, -90697, -62959, -17009, 65760, 103105, -13674, -63770, 54395, 30921, 42112, 76757, 134205, 148646, 169233, 134448, 137817, 32570, -41079, 27310, 198554, 174684, 39199, 19005, -87620, -304860, -304186, -144326, -210184, -320760, -285098, -201756, -10394, -4570, 157841, 367001, 316080, 313090, 70555, -108300, 34515, 103327, 52346, 84052, 125811, 28983, 45339, 128032, 256908, 168961, 107005, 55714, -126804, -222781, -39696, 9404, -88134, -101763, -68899, -23622, 26459, 119563, 174059, 1441, -79022, -1292, 30175, 98222, 173458, 163251, 232041, 175197, 164072, 159598, 173796, 158439, 218364, -54845]
16730e4845j15831R8624n7340J23157K1443n0689j49738O1569Q5791P9638q1837
16719d0058p9691k3842k4244M3051R1340J94262R71o2247j05865l521O0412k8632
16707B1936j33425r5060K38894J44449n0312n9356k18328q5393J20942J48538
16697C2885N0358q6665q3845j2167l8946p8603m3830j0423K6629L3801J85823
16686b4983p8944j05510j3900j54154M3234K55987j3073O6644o0340n187N6875
16675c3351J57901m6306j70854N3133n1760q2148r8016o355J91467j9411m0284
16664a45984K26758K30230j2439k2847j75110k17898J9084r8102j54073L54J5298
16653c34729N5564K32049K4263P357p1937r9205O5334J77K51002q6040J00243
$$ y = [-54845, -170676, -72052, -129392, -6235, 15208, -35481, -185219, -123650, -37859, 41779, -40058, -119749, -143591, -167835, -124784, -33444, 160818, 161789, 99542, -6323, -9844, 50568, 21936, -111489, -206549, 32345, 176794, 126482, 67126, -151202, -236595, -115653, 32885, 83243, -3422, -87267, -99434, -138380, -216983, -260813, -271236, -244607, -210806, -24983, -103927, -209437, -223337, -377491, -334257, -78270, -91343, -24699, -85039, -90226, -33351, 124550, 78244, -92610, -39477, -91237, -173385, -271401, -277756, -86289, -105700, -145984, 80774, 311004, 298565, 275718, 100608, -117290, -98206, -196308, -350381, -350027, -334729, -279165, -47116, -22853, -15496, -87433, -186638, -121304, -121127, 129875, 43835, 144078]
16642A44078N352j91382K6959J55638r017j00435K9748Q579O2093J48969j45547
16631A35035k17932o9751L3926n9861P4600J62493k0024k17696K7516J15141j06622
16620a43175J974O9033J45544N9463n2393J693N1256j48352m6001j9224N0161
16609c0021n9855J47272j32925j6697j02921Q8194J18286q5196k5823K1257J34039
16598E5610p6627j06247j05215j40671j47n4508J6868J24213N7471J5631J64893
16587d8729j0193O539j39143J3495R0742J28765K15324P5389j42350j80454j30217
16576a20832j96363P2606J76741J25082R8016p7029j25096q4481r5370J1793J6086
16565a98847l6903K31281J48217j53055o9445P3300q9236l6107P1621K9167n1911
$$ y = [144078, 149430, -41952, -14993, 140645, 131628, 31193, 60941, 69520, 131613, 280582, 135035, -82897, -152648, -118722, -178583, -103983, 58510, 38486, -179210, -151694, -36553, -143175, -141201, -72168, 73376, 132839, 80446, 82139, 133395, -14957, -60958, -80182, -30021, -89876, 57396, -75529, -92226, -195147, -106953, 11333, -73863, -99686, -78429, 55610, -21017, -127264, -232479, -373150, -373297, -427805, -410937, -286724, -229253, -213622, -48729, -58922, -52383, -191526, -178031, -87289, 41476, 256800, 332189, 189839, 9385, -120832, -317195, -244589, -67848, 57234, 155250, 78221, -46875, -131356, -226726, -214933, -198847, -235750, -4469, 143748, -9307, -78752, -5452, -94688, -130795, -59174, -30007, -81918]
16554h1918N2517P4599J52363J6379J45779N0967j81525j03935o1317r3731j42168
16543a71990l8032N3605K61878J19106n7118m3670l6294k3423n5776o5263r2646
16532a49623N3587M4071j50928m0643n141K2005J04238J28370M8589k4174l4962
16521d611j04059R4993L433j31567l1386M3283K5992J06154N8922o468j37481
16510h2795j64009J90017J17758p1032N2509L1684j48251o0310J11024N3162K1167
16499E0924m561O8398l14499k22067J82098J1326J41324J8705J20819J85719q6885
16488A51301j62351j02952J58019n3591j1538J1286L5194Q986L6576n0901j28166
16477a08137p9489n2542j52883J01503J45596q612P8199p9937R2988n4650j32586
$$ y = [-81918, -29401, 45198, 197561, 213940, 359719, 410686, 229161, 125226, 63909, -29822, -171990, -210022, -156417, 105461, 224567, 167449, 123779, 87485, 64062, 8286, -56977, -149623, -96036, -51965, -202893, -243536, -248677, -226672, -122434, 5936, 54525, 30351, -4611, -108670, -13677, -10244, -141811, -173197, -129914, -103922, 2232, 61154, 54686, -82795, -246804, -56787, 60971, -10061, 42448, 74132, -74119, -134429, -23405, 29757, 50924, 46363, 114761, -199738, -421805, -239707, -228381, -87057, -68352, 52467, 238186, 151301, -11050, -114002, 44017, -9574, -21112, -9826, 25368, 34354, 70930, 20029, -108137, -187626, -240168, -393051, -291548, -145952, -154564, -76365, -156302, -63314, -117964, -250550]
16466b50550N258P1735o8875r00Q7904J5541l6071q8501K31711J38384m2905j35565
16454g2834j42674k9710J90032J8857n4731n5059m6520L4472Q7516L6029K14104
16443A79482k2720J2932l3174J1945r8853k56829j77741Q0702M47709N9548P7659
16432B80660r437j58238K7127L5812P2019o7164q4677j83515J4973m1382k1006
16421a34828Q8930q2428q58O0892j2819l8342l9956J7254o896j39835K8499J3789
16409b46598k9797K33436m513r5769J29325O6214J05968k9960j58992q6059P9521
16398c7224m6061M8842J33994j11748m1850J12560O1618L219k34519r6473N4908
16387a52734K50974r446n6031O0171n617k3836Q713p9728q6607P843p118p995
$$ y = [-250550, -245292, -173557, -242432, -243332, -155428, -139887, -175958, -264459, -32748, 105636, 62731, -72834, -215508, -245218, -55186, -36329, -91060, -146119, -192639, -158167, -70651, -34622, 179482, 156762, 169694, 136520, 148465, 49612, -207217, -384958, -304256, 143453, 203001, 280660, 271223, 112985, 140112, 175924, 247943, 180779, 96102, -87413, -72440, -113822, -134828, -45898, -128326, -129184, -68292, -81111, -119453, -159409, -142155, -149051, -288886, -260387, -246598, -276395, -42959, -47472, -143241, -13916, 52298, 158266, 128306, -30686, -116745, -37224, -83285, -34443, 99551, -12197, -54047, 58513, 120131, 123350, -111169, -207642, -152734, 98240, 88794, 32763, 92934, 87317, 63481, 72194, -7534, -94141, -86298, -93416, -101411]
16375a01411J13135Q4435J4981k9658k897p7944r5634Q6823L0898k5423P4112
16364G1417j2260j39277j22381o9066J85328J61445O0132M0604j92515p1685N0842
16353c7416M2776Q3362m9533l4433m4574R0533M4539Q9593j36172m1923q8563
16342h1811k3759j1762r0582L7683N1935l9456K5427J32256J4355m4188n0511
16331h0413m8341J76062L3577j29700n959k4130r6480j07940l0973j63374j2876
16320d90547R559J11160J10094K41835m2133j01353L9605Q8879j75808j11972
16310c20681j35J2031J85337M6379J7474r590p6199o9092J11025J2571R0977j19594
16298a19497l5192L3586N8151j4017L722n0761j38929J3166N7547J11343O6643
$$ y = [-101411, 11724, 96159, 111140, 81482, 78585, 641, -94993, -8170, 22728, -2695, 71417, 59157, -80120, -202501, -271567, -86239, 75206, 135338, 175942, -16573, -88258, -37416, 5360, 88722, 39189, 4756, -39818, 50715, 95254, 184847, 48675, 6752, -81811, -105570, -117332, -207914, -170231, -118296, -157752, -132325, -69, 14286, -29902, -80413, -128754, 47308, 80885, -48815, -54774, -78904, -175384, -283324, -314297, -477671, -490547, -480988, -369828, -259734, -17899, -60032, -161385, -121780, -32901, -208709, -320681, -320816, -308785, -123448, -77069, -59595, -69185, -145384, -214476, -103451, -90880, 97, -119497, -154689, -121103, -62952, -76969, -73247, -124008, -262937, -249771, -192224, -80881, -14238]
16287a4238K8048O2193Q3326n3453Q6130p5322j04581n6468m8455K1884k6998
16276i7934L864K4677p5859q7835M0949J07198J93605j508q0409j17057P1247
16265a9062Q2245j13042K8250K54119J45275l1648j98191k07123p7491J56080
16255A9412L4653j28694q4502J35152J77443j19858j45011k1757J0216j63450
16245b86396J24565P6927k78986j7357J67041K20996P1187j03117r8309j34254
16235b57703J06349Q9604m9967j45286j5423K28011o9497l4903J6218J51935K33639
16224B52977q9845k4529k4316l09904j28628P3725O4475K1152k608l0061O4280
16213a33282L4145R8151q0576n9295M7698j52350j13891j2482M7736J15560L9867
$$ y = [-14238, 13810, 76003, 159329, 105876, 192006, 116684, 12103, -44365, -92820, -70936, -97934, -94070, -69393, -145252, -233087, -192138, -84940, 108665, 107157, 26748, -90309, -19062, 63183, -49859, -21609, 232510, 377785, 346137, 147946, -59177, -136668, 19412, 54065, -74629, -159131, -23979, 153464, 33606, -111405, -133162, -122946, -286396, -161831, -84904, -363890, -381247, -214206, 6790, 77977, -25140, -123449, -257703, -151354, -61750, -111717, -257003, -272426, -44415, -113912, -148815, -132597, 19338, 252977, 163132, 138603, 114287, -195617, -324245, -250520, -186045, -164893, -167501, -197562, -133282, -99137, -986, -81562, -140857, -93159, -245509, -359400, -371882, -324146, -208586, -168719]
16202a68719J141N034k3212P6124j7890j28859n2190M2922N0533J01812J76072
16191F2768J28918k25347p7722m1282m7365L5848K3484R2096J11647j95558k01204
16180c33717L5183J76928N4636j48614j110J59874P2955J53909R3981m1611j67078
16169E5336j96402p7516L3339O875K0941n660O5010J2645j9370j39320J62757
16158h1365J26191J12051J9918k49466j77075N4588L9008k0748L9424K11914j6796
16147E7644M8725j63710j20517J20849j36133O9232j8004M9546k3780O7075P2884
16136B3811J2053r5663j63514K56201Q1662n4894J07637M0788j28211K683K7957
16125A10510j29242N0323j15620j89001l8634N0751l4372R7078Q9357m9418q2058
$$ y = [-168719, -167578, -162544, -185756, -109632, -127522, -256381, -308571, -265649, -215116, -113304, 62768, 191686, -33661, -111383, -152665, -200030, -164182, -140698, -48602, 63045, -132513, -333717, -298534, -121606, -66970, -215584, -216694, -56820, 16135, 170044, 264025, 222414, 55336, -141066, -218582, -185243, -178368, -157427, -163087, -98077, -85432, -104802, -244122, -81365, 44826, 156877, 176795, -72671, -249746, -195158, -156150, -176898, -137474, 74440, 57644, 106369, -57341, -177858, -57009, -193142, -123910, -141914, -92368, -116148, -49073, 23811, 35864, -59799, -223313, 32888, 114550, 59656, 167293, 208081, 79870, 82553, 110510, -18732, 31591, -84029, -273030, -311664, -260913, -295285, -198207, -108850, -158268, -240326]
16114b40326j48184Q8790K20278Q6669P8156j39925r7395K20844J27977k34436
16104c7552n7808k3759n4534J15853O6677Q6479Q101l8154N3392M9156j6428O4647
16092B16070Q0145j65745j05878k66051j16532J1812K8566K7129m6664M7266K8020
16081b61862O4113Q4952m8279l5946l5285L3778J50589j191j2226j26077j13325
16070c00759O1542P1775K0189M4873j6517m228O0451m3835l6997N8463J43995
16059E8952q6487j45417K0682Q0240J58141J31489m1947p9162l8997l167r1815
16048c7488O5055k0234j1065k0211j0511K0201M9006l4554o7436m905L1638p410
16036d7914J33247n0673r9588q224P8808o9319j0992Q7517j9103k8264R3802J38595
$$ y = [-240326, -388510, -299720, -79442, 7227, 85383, -54542, -151937, 68907, 196884, -37552, -95360, -119119, -173653, -57800, 8877, 95356, 103457, 65303, 118695, 167851, 151423, 216070, 296215, 130470, 24592, -241459, -357991, -346179, -317613, -290484, -337148, -289882, -261862, -197749, -112797, -161076, -197022, -232307, -198529, -47940, -49131, -61357, -187434, -300759, -239217, -167442, -147253, -102380, -118897, -123125, -62674, -106509, -143506, -85043, 58952, -27535, -172952, -152270, -72030, 86111, 217600, 175653, 96491, 57494, 54327, -37488, 27567, 7333, -3732, -23943, -34454, -14253, 34753, 199, -67237, -72142, -40504, -47914, 85333, 34660, -64928, -73152, 5656, -63663, -74655, 12862, -6241, -34505, 59297, 197892]
16024A97892j40053j31335K95231n4562j44452L6713k2571j55160q3167q598J04429
16013a05633J44778M9049q1581k9056j10513L8649K8001l1807K3999J9171q5911
16002a40854r472p4778m0495l5105k2998R3232r184k0962k0022k8665j59877k1292
15990d90472o8184M8107L08100K42885J48488l2376j00007l9978P1165j74221
15980h6493k63912J3542K05898K13798J31640k2152k2590q7770r1122k05115j72942
15969c87218J22284K23026Q1130j62288j11118J62761n3447m1715L1062M9304
15959h6219L7178l1078O6458p5028n4351N0216j56478M5556J42497k1507m3865
15948a26621o690L5195m9117O3842R1254q8077p0750j5016j19911Q944J46226
$$ y = [197892, 57839, -73496, 221735, 167173, 22721, 59434, 36863, -118297, -201464, -210062, -105633, 39145, 88194, 6613, -22443, -132956, -94307, -66306, -98113, -74114, -54943, -140854, -150326, -225104, -265599, -300704, -323702, -230470, -239654, -260616, -280638, -309303, -469180, -490472, -558656, -510549, -202449, 40436, 188924, 156548, 56541, 16563, 87728, -86493, -350405, -336863, -130965, 82833, 214473, 192321, 169731, 81961, -9161, -214276, -387218, -264934, -41908, 39222, -123066, -234184, -71423, -124870, -166585, -135523, -86219, -49041, -80119, -13661, -88689, -143040, -92824, -249302, -203746, -61249, -82756, -126621, -133311, -98116, -147233, -83391, 7863, -80214, -150964, -165980, -285891, -276947, -130721]
15937a30721l5110r0789j37171R4771J46863R0352m3588K0027L9400J4636o8231
15926i9561p8197r3775q3201k2684K08169K22147m6235j9658J73625j4759O997
15915A52868J47501L2026r951q0982O6353j23375k24008m0711J89686j6975j07716
15904a5284N7469R0222R5041j47799k34729L7581M8485J9538K9086j58060o6669
15893b45119K00263J45613J09708k76584L8032P5541R3808j19989k0557M6757
15883D7473M3758r8467r2067j22941q5973O9344O0799K3788J86260J15403n5430
15872I1947j9608j11863m0918j43727J41927L3555q0003Q5695K0104j31997o4333
15861b19221m6974q417J53762O5443n8311j32550P1758J9814n2128J18637Q1397
$$ y = [-130721, -165831, -256620, -393791, -299020, -152157, -61805, -105393, -85366, -45966, -31330, -99561, -177758, -271533, -354734, -377418, -169249, 52898, 6663, -12995, 160630, 145871, 152868, 300369, 332395, 322444, 241462, 307815, 184440, -39568, -80279, 109407, 92432, -15284, 42185, 132407, 227448, 79649, -155080, -117499, -69014, -49476, -20390, -178450, -245119, -44856, 100757, 210465, -66119, -28087, 47454, 141262, 21273, 716, 47473, 91231, -7236, -99303, -222244, -308217, -238873, -178074, -154286, 31974, 147377, 91947, 72339, -39524, -80442, -224169, -82242, -48687, -128690, -42995, -22891, -154888, -219221, -266195, -274612, -120850, -55407, -113718, -246268, -174510, -154696, -206824, -88187, -6790]
15850f790n517r0221j5049N9233J82636R181K0809j4279k19117M5433r52j49360
15838a83993q2094J10656O0701K1631q9614J21818m7324q7843J7641J22580j3444
15827d9285l7707k09871m4789N3314N9218k8795j01804P8983J34325j00984O1511
15816a85884Q5383j1719M4029K35358q0616k00861m7780J22415J27960J7372r6443
15805I214j1956K16189p7951j10935O3547l6046j29448q8053j4716p6853M1969
15794b15039l9629P3991J63563J7811o1225N4101J01204M2941p6012l5987r016
15783A6703P9840O9418M4007M7426k09948q3573O3754n2510J1222m8813j44281
15772b06755m6547j2628j21058J13369J70844Q220M8490J54110J09662o1382k51698
$$ y = [-6790, -12307, -102528, -117577, -58344, 124292, 133473, 154282, 140003, -79114, -33681, -34633, -183993, -266087, -155431, -94730, -73099, -162713, -40895, -88219, -176062, -158421, -35841, -49285, -86992, -296863, -341652, -288338, -229120, -257915, -359719, -280736, -146411, -247395, -185884, -100501, -112220, -68191, 167167, 86551, -114310, -162090, -39675, 88285, 105657, 9214, -2742, 213447, 135496, 24561, 88108, 52062, -77386, -165439, -180155, -257008, -215039, -254668, -180677, -17114, 697, -60528, -6427, 94777, 137718, 61706, 25719, 16703, 96543, 165961, 209968, 257394, 47446, -36127, 27627, -24883, -13661, -62474, -206755, -253302, -265930, -386988, -273619, -102775, -94555, -46065, 108045, 217707, 156325, -95373]
15761i5373k10536J4534J14270j00456J9527J08350M6879L7995O8936j08224M9458
15750e4640Q6675P7088R573J18192J5369O0051j12939j45472j9170P39j30851
15739i5385J19564K5941j45616p3765J83293J14083j90766r3055l8768P2595R2631
15728b9248R643M5227J16466l7073q2451m9220K1865k3683K6558N5361j87870
15717a34425m0083J62622N9183q8877K0547r3102J8813K06931J14217j01034k29857
15706a05065j88288J3322J22097O0745J54511J394J32899o5087j10741j13553
15696i7766p9289p6767J16009l247K19628J09517j19421k42984j96450J75587
15686a95183N9877j09612k18817j17747m8130K09116K29469J42884J4648j59238
$$ y = [-95373, -305909, -291375, -177105, -277561, -258034, -149684, -102805, -64810, 4126, -104098, -54640, 32035, 109123, 118696, 236888, 252257, 312308, 199369, 53897, 34727, 35466, -95385, 24179, 50120, -95496, -169261, 14032, 128115, -62651, -155706, -194474, -121879, -29248, -19605, 25622, 142088, 105015, 22564, -26656, -4791, -28474, -1916, 53445, -134425, -174508, -11886, 47297, -41580, -21033, -114135, -95322, 111609, 225826, 124792, -105065, -293353, -280031, -157934, -97189, 57322, 58716, 191615, 126528, 15787, -97766, -177055, -253822, -137813, -141060, 78568, 188085, 68664, -174320, -370770, -195183, -135306, -244918, -463735, -581482, -629612, -420496, -191027, -48143, -33495, -192733]
15676a92733l2622M7423L3636M4311J76021J67437N2015K9817k39871j22400O490
15665c0476K6557K5287J2205J19967p6493j84026P4795J33841N6246J226o9658
15654H9471j49j6676p7325q0998L8139P0555l6818l4780j08625j22251j81743
15643d61200q1374P3987J27530J33919k4655J40471j08954l7541O1720J4956M8736
15632a12405K10669r455j71408k82466k26354q9436J72102K02272r3102J33020
15622b66563K53681J5427O0922N6304L8979M5327N98j65758j30306O7307K2191
15611a891R0861q2690J5720o3549n8716j9716k9015J13927L27179j1394k09267
15600G1449N8409L7165j19675j29566j2830M5404J14946l923j761n251j43442
$$ y = [-192733, -225355, -177932, -144296, -99985, 76036, 243473, 295488, 325305, 85434, -36966, -30476, -3919, 21368, 33573, 153540, 77047, -106979, -32184, 101657, 157903, 159129, 89471, 89322, 72646, -4679, -85677, -47538, 23017, -13801, -48581, -157206, -279457, -461200, -542574, -468587, -341057, -207138, -231793, -91322, -200276, -237817, -176097, -161141, -112405, 98264, 88809, -82599, -365065, -591419, -680855, -508753, -306481, -399583, -266563, -12882, 2545, 63467, 119771, 158750, 204077, 204675, 38917, -91389, -24082, -1891, 88970, 6280, 22000, -41549, -100265, -119981, -148996, -35069, 292110, 280716, 71449, 129858, 167023, 47348, -82218, -95048, -49644, 65302, 61379, 59618, 54367, -89075]
15589h9075m7099J11522j00263l2462n0581J8273k104Q5263J04113k9450q7299
15578a19162Q8732o7366O769j3619k0149k9452j14305j06775J17434O0931J9452
15567a77510K4541K2246P3498j52279J61183Q5778j38415N6407k1716m7310Q0614
15556c2963R2921n473Q9459M2257o1312j94771j63976m7622M9677K48982L4557
15545E1736j99112o7351J41282k0109j81034j01018r8346J59419M4688k9556R0437
15534b08964J34586J08430k4269m0336q2359k5981K1421m5825J58220N2652L5931
15523H3506r2734o5709k6137m863J00256K1635q3917J08892O3225J9633K0426
15512A44213m8290j38629o3833M2664L3719K29900m8925j77951j93239R7009J64666
$$ y = [-89075, -136174, -24652, -124915, -157377, -207958, -189685, -191789, -106526, -2413, -31863, -119162, -30430, -97796, -91027, -104646, -124795, -154247, -268552, -375327, -257893, -196962, -177510, -152969, -130723, -57225, -209504, -48321, 37457, -100958, -44551, -66267, -113577, -32963, 59958, 54485, 143944, 186201, 124889, -69882, -233858, -281480, -231803, 17179, 51736, -147376, -214727, -73445, -93554, -274588, -375606, -473952, -314533, -269845, -299401, -208964, -74378, 34052, 9783, -30553, -112912, -138893, -117472, -163297, -5077, 47575, 83506, -9228, -74937, -101074, -105937, -5681, 15954, -67963, 40929, 104154, 123787, 144213, 95923, -42706, -106539, -63875, -30156, 199744, 150819, -27132, -220371, -123362, 41304]
15501D1304R1346n7030N6946M1422m6188m5231o4779j04016j58717Q6670O1204
15490i7069M1163J5254q4671j18876P2162p9754O9186J77971M137m9928Q7036
15479C6611L632K5823N1147N6961M387n5056m8513N4127m2374j54657j47662n7012
15467b72586J31116J90719J08650l6359j56162o4005j4656J27214q9887j8809
15457i4765j01578j24690j1912o2852J45872J55700L4169j45234j9298J52428
15447g2160l1593J34553J13375j3488O3400q6325q6298q1998J08723J80446k0848
15436B07787l2258o0489k8602j77657p6424p2320K52391n0294R26m515L6420k4134
15424b9169N8644n4776r2615j34659J20175P1380M1430q8271o3667o3668N260
$$ y = [41304, 132650, 75620, 132566, 173988, 127800, 82569, 17790, -86226, -244943, -158273, -97069, -55906, -40652, -125323, -244199, -172037, -251791, -182605, -4634, -497, -50425, 36611, 40243, 66066, 117213, 174174, 178561, 123505, 74992, 129119, 86745, -67912, -215574, -272586, -141470, 49249, 157899, 121540, -34622, -98627, -113283, 13931, -75956, -94765, -196343, -321033, -332945, -395797, -249925, -94225, -60056, -205290, -224588, -72160, -103753, 30800, 144175, 130687, 194087, 107762, 21464, -60534, 48189, 228635, 207787, 175529, 115040, 86438, -91219, -167643, -239963, 12428, -37866, -36940, -41455, -5035, -29169, 29475, -25301, -117916, -252575, -132400, -61020, -19590, -107861, -171528, -235196, -229936]
15413b29936J20424M379M6913J29844R2962K03689k06854k26949j07330j23015
15403b95873r460R1566K35926L0930j36383J980k2816J01013J03657o3556j0544
15392B6440J31425j71159j35502L5763n7096o7079J80268n3574N8917L5416j07434
15381a23615N3473Q6008k02093m4472L6738L7134J25580J26567J00034J1534j90737
15370A6151J4453m3905j89795J13122r2476p6425J26975J44235k0663P1316N8983
15359A21971j4045k25503l2692O3248J29606O3829J4792J4860l6215j7753J55949
15348B38047M4921j96388k54746j14710j4186J81816M6379o127j16370L2369J02573
15337e6422N7095l4918l2913J19243m7496j28693N6049L16866K1631l2715r0922
$$ y = [-229936, -109512, -105133, -58220, 71624, 164586, 368275, 161421, -65528, -172858, -295873, -305333, -213767, 22159, 53089, -83294, -81314, -104130, -3117, 100540, 36984, 26440, 157865, -13294, -148796, -113033, -170129, -237208, -56940, -110514, -51597, -16181, -123615, -70142, 15866, -186227, -230699, -193961, -156827, -31247, 95320, 195354, 206888, 16151, 30604, -13301, -203096, -89974, -182450, -258875, -131900, 12335, -8328, 62988, 121971, 107926, -117577, -150269, -87021, 42585, 106414, 121206, 136066, 99851, 82098, 238047, 282968, 86580, -168166, -282876, -297062, -115246, -68867, -74994, -191364, -158995, -56422, 673, -34245, -67158, 52085, 4589, -124104, -68055, 248811, 270442, 237727, 146805]
15326A46805k84445j85892j8053J52242K10951M5840j43309M5019K7562j46533
15316a49813k0551L9737p3607N6081J78172J49614M0626j27783r9426l9717q3437
15305a30104O332J67254L5593j04406l7453r5568p0182l9581n0003j38816j07811
15294e64745Q9337J73206J14781q0652O789l0850R3752Q5823L7645J83186L6093
15283A44365J08016K5278j6686j38592j09892l0898O6731q4548l7773o2430M6936
15272h9493K9328p1897k6767j37503j17798Q7218K00938J1307Q5071j3538L9424
15261c710m8833N2471K04285J7625j76865N2146j09641j53910m3258j78392J15729
15250b72353J14752Q9898M7761j11405j15530m563J26509J29268J41614o0022
$$ y = [146805, -137640, -323532, -341585, -189343, 21608, 67448, -75861, -30842, -3280, -149813, -170364, -130627, -204234, -148153, 30019, 179633, 220259, 92476, -6950, -46667, -130104, -123772, 43482, 79075, -25331, -62784, -158352, -228534, -268115, -318118, -456934, -564745, -475408, -302202, -187421, -268073, -261284, -292134, -198382, -112559, -74914, 108272, 144365, 252381, 277659, 260973, 122381, 12489, -18409, 48322, -36226, -73999, -136429, -89493, -60165, -132062, -158829, -296332, -414130, -326912, -125974, -114667, -29596, -43134, -3710, -52543, -72, 204213, 221838, 44973, 97119, -12522, -166432, -209690, -388082, -272353, -157601, -67703, -19942, -131347, -246877, -251440, -124931, 4337, 145951, 85929]
15240H5929r9406q2389m7714r1372J03109K01664k09301o8048J19503O4492j2155
15229c5688j56921j7000J17051J90090P5714j64511o3623Q9492J61989n0939j46438
15218g84K5606J12989K08659j88329j57804r8894j46336n5431l8487m1680K28546
15207a51945L1607N9797O9931l2537n4384R1767N5992Q317o5278l4691R5518l8720
15195C5374n7900M3267R4376O4093j3100j56632J06464K17232n8736O3556l608
15184C34386j11531j07069k7351q7944k18809J458m8445j815P2891l5270j32126
15173c61625m6667J38528K11003J01942L1142q6663r8826O479J14204R027j38830
15162a20286m109n2269p2838N8762J17385L8265L2960k4722j93817j29763K52882
$$ y = [85929, -13477, -95866, -143580, -234952, -131843, 69821, -139480, -207528, -88025, -23533, -35688, -192609, -209609, -92558, 97532, 173246, 8735, -54888, 34604, 196593, 145654, -784, 24822, 137811, 346470, 158141, 337, -98557, -244893, -300324, -338811, -380491, -151945, -120338, -60541, 9390, -23147, -77531, 14236, 70228, 78545, 13267, -21424, 74094, 35374, -22526, 20741, 115117, 179210, 166110, 9478, 115942, 333174, 274438, 337994, 334386, 222855, 115786, 88435, 491, -218318, -216860, -265305, -267120, -194229, -229499, -361625, -408292, -269764, -58761, 43181, 74323, -12340, -111166, -104687, 9517, 18544, -120286, -124395, -176664, -249502, -190740, -73355, -35090, -2130, -26852, -220669, -350432, -97550]
15151i7550J90886j28652r097j9777j4464n1650Q1527K6810j31111o1753l7386
15140b52217J34184Q1089M9224k4144o4268q9127J77637R7962j51884r4997j6198
15129a52739k5121l2226J05017K18745J38739j29355J7184M7806j10947L1416
15119A08519j14652j02556M1079M6322K9675o2589j979m2771Q2556K23785P474
15108B14863J16572j83602k86104P5605J0125L0327J27930m4047O437j9136n1649
15097b679j01811j05359J6045J12892p9002n1199J42251j1104q25m1033l6162
15086a57986O2755J61218P9398K9842r8112q238m1262Q1790k1435p5622J4562
15075B6910k3991R713O4550L6072j20600j25589m2556R5300j36647j5126J19561
$$ y = [-97550, 93336, -35316, -44413, -64190, -78654, -130304, -48777, -21967, -153078, -214831, -252217, -118033, -36944, 12280, -11864, -76132, -165259, 12378, 110340, -41544, -136541, -152739, -177860, -210086, -105069, 113676, 252415, 123060, 140244, 188050, 77103, 108519, -6133, -108689, -67610, -21288, 8387, -54202, -56181, -98952, -16396, 207389, 214863, 331435, 147833, -138271, -62666, -52541, -22214, 105716, 61669, 68106, 48970, -2679, -104490, -209849, -193804, -80912, -159914, -211113, -68862, -79966, -80791, -121824, -157986, -95231, 65987, 145385, 175227, 77115, 68877, 27615, 109405, 87970, 12348, 26910, 2919, 12632, 77182, 113254, -7346, -132935, -175491, -80191, -216838, -231964, -112403]
15064a12403J50180n6920k4967k39980P9392K7232O5854K9972q3827k55191l5431
15053d56089J48195j056M2605K6202R4130P5546N5511p5006J7299J16148J14255
15042A57740R8023j93821j94608J23378N8413L0065K40153J3028k30559r6869
15032D943R3251K6821n3678r9581O0474K4036m2625j3143J7686R2680j06611j57349
15020a53096k3906j6490J229j19831k5290J27698R5946J16930Q5982l067M5941
15009A32046J01692j09026q9253L1760m895M6240j10590R8986J25445k06064m5565
14998b9224L0985j13223J94537q5584k01780j34430J27229K13529m3691o4978
14988a06630J2796m990l6110J0333j13328Q6504K5452J76816J61591m0136j97002
$$ y = [-112403, 37777, -19143, -44110, -284090, -204698, -177466, -111612, -81640, -165467, -420658, -456089, -307894, -308950, -266345, -240143, -146013, -70467, -14956, -89962, -72663, 43485, 157740, 255763, 61942, -132666, -9288, 49125, 79190, 319343, 332371, 101812, 4943, 98194, 125015, 71337, -28244, 32230, 56266, 13641, 498, 18184, 110864, 4253, -153096, -177002, -193492, -192263, -312094, -337384, -209686, -113740, 3190, 89172, 86105, 132046, 233738, 124712, 35459, 67219, 62324, 108564, -2026, 96960, 222405, 16341, -29224, 1761, -111462, 83075, -2509, -204289, -338719, -211490, 2039, -41652, -106630, -93834, -98824, -134934, -124601, -237929, -151425, -125973, 50843, 212434, 172298, -24704]
14977b4704M2812N5551j66583J24613J02908L8202L022q9864r532M8563R2761
14966B17749m2701k4370j06666J3935N7433o8635j17474k1430J01778J71591k05219
14955b4009l5004q9141Q9464R6720n109q0859K6879J41433m9915m7102o2757P7648
14943C8248J06954N3626r4985k47622k7289J41029J38665Q0371j74809j01677
14933h7489O6935j16626m9876K11456m0974n3038O4113L8208j71057N076R6868
14922c6404l9857j06343P9349M7106O5014j52543o3200J0880P2088K276k6407
14911a48041P7113Q9538N5113j22090o6050J5405M2930J1171n0063l4722P1440
14900e8256R9453Q6616o2188k5525j21646Q7175J71208j2108j98790m290Q5607
$$ y = [-24704, 18108, 73659, -92924, 31689, 134597, 172799, 175821, 85957, 76425, 124988, 217749, 175048, 150678, 44012, 57947, 115380, 46745, -70729, -92159, 9619, 181210, -24009, -59013, -148154, -58690, 38030, 32921, -47938, -21059, 120374, 70459, 23357, -39400, 38248, 145202, 198828, 103843, -143779, -171068, -30039, 108626, 188997, 14188, -87489, -20554, -137180, -187056, 24400, -16574, -69612, -5499, 32709, -138348, -133272, -36404, -76261, -182604, -103255, -56149, 8865, -143678, -206878, -195998, -123910, -121634, -148041, -70928, 18610, 73723, -48367, -114417, -99012, -56082, -44911, -94974, -129696, -58256, 41197, 127813, 65625, 40100, -81546, 5629, 176837, 164729, -34061, -38351, 47256]
14889D7256J17065Q9610p4548j52942m5404r1603q5123J69940J37128J43827l0506
14878B24700k4630J64576J08147j27517l35837k93976J07694J34040J13265O9615
14868A40077k7088j10233J28667K00465J91525L7648j73168M0335P6721J83103
14858F88052j35691k12582k3168l1469j14820J14919Q9445p689j17699J47811
14848C97109J11965j73297j41706m3239J58597J02622Q606k52308r6526P6779
14838A48602Q3104M0131P7886N4955j62843j39524O1002J83027M0995j94176o362
14827A86797n3879j00365O0932P9964p3526r667l0762m2459m7837J29371L7771
14816A36340j8837K2510m6557n2338K5636p3714p775J3021J29569l3150m2685
$$ y = [47256, 164321, 253931, 179383, 26441, -18963, -110566, -195689, -25749, 111379, 255206, 224700, 200070, 364646, 472793, 345276, 9439, -284537, -176843, -42803, 70462, 140077, 112989, 2756, 131423, 331888, 523413, 561061, 387893, 428228, 504949, 688052, 552361, 339779, 316611, 285142, 170322, 285241, 374686, 366997, 249298, 397109, 509074, 335777, 194071, 150832, 309429, 412051, 420657, 168349, 71823, 148602, 231706, 271837, 349723, 404678, 241835, 102311, 163313, 346340, 387335, 193159, 186797, 132918, 32553, 93485, 173449, 99923, 90256, 59494, 17035, -30802, 98569, 136340, 117503, 140013, 93456, 41118, 66754, -6960, -14735, -1714, 127855, 94705, 52020]
14805E2020q5889j55913j636K63892p499j02285M9463N3083j81210k41015P842
14794c49147K6288J13565J42115n3081j5189P1184L52203J839k14816j4220l8633
14783B2108j7012J88655P5111l1282O7816Q0841o0681j53159j21056j1715Q6741
14772A26367j65450L478J57813O6695m3841K7379J19378J829r2478k3041m5003
14761A33126n723p3211m2403J32866J65593J55672P8360j59647k99448P1467J20970
14750B77622j5367l6239j66463K1757Q5102R8287n1163n1197J15666J15175R5294
14739D88474l7087r6725j06367j38626j8485J33648j27772r0401K7188J08156
14729A42003j5683J00728k758o6781n7446o7151J6445k0254M7940M7386l7303
$$ y = [52020, -33869, -189782, -191418, 72474, 64975, -37310, 12153, 65236, -115974, -356989, -349147, -322859, -209294, -67179, -120260, -135449, -64265, 287938, 289777, 74961, 60741, 22108, 5096, 193751, 268862, 237580, 305396, 386237, 325556, 172397, 51341, 39626, 126367, -39083, -35605, 122208, 188903, 145062, 172441, 291819, 293648, 201170, 178129, 133126, 127403, 54192, 11789, 144655, 310248, 465920, 544280, 384633, 85185, 156652, 277622, 262255, 226016, 59553, 81310, 166412, 264699, 213536, 162339, 278005, 393180, 488474, 451387, 354662, 248295, 109669, 91184, 224832, 97060, 6659, 33847, 142003, 126320, 227048, 224290, 157509, 100063, 32912, 49357, 29103, 77043, 124429, 87126]
14718H7126R8165Q6549j74397k71681J12699J49349P0970J97253k0697j49648
14708A85688p2635p1662r5538J07511K22370j1425m3211l3936j66381j28388k6988
14697a34595J94873J55907j66105L8230j0568j97484p1341Q0052K09083L9115
14687A37167q2237m789M242j12512l4476m5465l3823m3968j7089R2262N1643N2250
14675c6795K7987j17050n2879J86697J43121M0589m4506j29275p054j5301Q8331
14664H3865O2604J75997p0418j62729n0392k1232O7493q196p6346q9329P7948
14653a0735R1551l6715p9618q9262j2963J01046J00898J14498m8905J52166q8454
14642A93507k44338j3744m882R49o999J221l3974j4449P1986o1283J97235J43367
$$ y = [87126, 185291, 271840, 97443, -174238, -61539, 87810, 158780, 356033, 335336, 185688, 113053, 41391, -54147, 53364, 275734, 264309, 221098, 187162, 20781, -107607, -134595, 60278, 216185, 50080, 88310, 77742, -119742, -191083, -111031, 98052, 137167, 54930, 50141, 54383, -58129, -92605, -138070, -171893, -215861, -232950, -140688, -89045, -36795, -8808, -125858, -178737, 7960, 151081, 191670, 147164, 17889, 10835, -4466, 83865, 146469, 322466, 252048, 89319, 38927, 17695, 85188, 76992, 646, -88683, -10735, 80816, 44101, -35517, -124779, -137742, -36696, 64202, 178700, 129795, 281961, 193507, -50831, -64575, -69457, -68508, -75507, -74286, -108260, -122709, -50723, -112006, 85229, 228596]
14630B28596j7891K3448J0670j0580Q3q6520j16196M0679o6831m6912J6502M6210
14618B1258J05957K09025M2514j09999j5644J63645j33727n5126p3365L7552l173
14607A88917k9448K7999q795n5349o471p7092q8420J36880R2827M6472j992J0584
14595B36112k5015K0957L0035l1824q9491j59216j33546J87695L30464j27207
14585B38964k27710L4250Q5059K6306N0201P9141L3839m0793l5191K6668l2148
14574B38586m1474j35174k7569K01084L0342m7420Q8964J5280n7068Q4641m9481
14563C00711J67999J26229R7213K37806l1622j57620N2952j36950j41993m7813
14553D66912N8032j08229j57926j41599K19011k3182m0350j76846l4217Q7271
$$ y = [228596, 210705, 234153, 244823, 234243, 234326, 147806, 31610, 72289, 5458, -41454, -24952, 21258, 127215, 336240, 378754, 268755, 253111, 416756, 283029, 227903, 154538, 192090, 188917, 159469, 187468, 178673, 123324, 116853, 39761, -48659, 88221, 181048, 227520, 225528, 236112, 211097, 232054, 262089, 230265, 140774, -18442, -151988, 35707, 366171, 238964, 11254, 45504, 130563, 156869, 207070, 286211, 320050, 279257, 244066, 270734, 238586, 197112, 61938, 34369, 235453, 265795, 218375, 307339, 322619, 265551, 350192, 300711, 468710, 594939, 692152, 929958, 898336, 740716, 793668, 656718, 514725, 466912, 524944, 416715, 258789, 117190, 336201, 313019, 272669, 95823, 61606, 148877]
14543A48877K9158K7749n9385l7221J60670Q8597m1697j18562r0005K17100J73858
14532D99139P4420M5058M5605k7674j7839k04740j04001L0241J3263L9624j10414
14521B82682J5977j04055k80699p1280Q7451m5355O0900K01389J66067j4717j60587
14510A37773p6671J329K211O7978R6920l7453o9736P0490J68965J73681K14622
14499G50109j9379j25490k80451k13562j23367J86612J28072m7620l6864R2542
14489C10602L318j59872N3882N7474K00716p4087m0422L0877J63096j51446j54039
14478B40099N9922J5203K8112j5453L710m7367J20556K68467k6136n3430K6491
14467F20174l1738J04286J60649J90301J1522r3295n0455R7173R8487J27302J36988
$$ y = [148877, 178035, 205784, 146399, 109178, 269848, 358445, 316748, 198186, 108181, 325281, 499139, 573559, 618617, 664222, 636548, 618709, 413969, 309968, 340209, 353472, 393096, 282682, 298659, 194604, -86095, -157375, -69924, -115279, -54379, 147010, 313077, 298360, 137773, 61102, 62431, 64642, 132620, 229540, 192087, 122351, 192841, 361806, 535487, 750109, 730730, 605240, 324789, 111227, -12140, 174472, 302544, 254924, 218060, 310602, 313920, 154048, 207930, 265404, 466120, 392033, 351611, 382488, 545584, 394138, 240099, 300021, 315224, 343336, 327883, 331593, 284226, 404782, 673249, 647113, 593683, 620174, 588436, 692722, 853371, 1043672, 1055194, 961899, 911444, 1008617, 1107104, 1234406, 1371394]
14456A371394J12649J3365O8889P2048J85389J45224J82099L15426M30737M11332
14446C308552L59290M45199N53801O36568O45593J113065J564906K084012K618026
14437A3329012K900098L077030K924043K139895R78639M99804L09702N10139Q10685
14428B7479047J026411J519845K044960K381014K961531L758897M235248M264472
14420D9671425L536838K248738L65049j290679k205342k864325k562112j526221
14412D5373371j99390J398856K975962M351949N088102M847913M071267K785871
14404G0693901J596808L27857r05064k554388l922366m705276m257276k761078
14396E3513118p27562J308618K571570K337992J824919Q94466j138667k787337
$$ y = [1371394, 1484043, 1497408, 1566297, 1638345, 1823734, 1968958, 2151057, 2466483, 2897220, 3308552, 3667842, 4113041, 4666842, 5303410, 5949003, 7062068, 8626974, 10710986, 13329012, 16229110, 19306140, 22230183, 24370078, 25348717, 25848521, 26158223, 26668362, 27479047, 28505458, 30025303, 32070263, 34451277, 37412808, 41171705, 45406953, 49671425, 53208263, 55457001, 55822050, 54531371, 52326029, 49461704, 46899592, 45373371, 45173981, 46572837, 49548799, 53900748, 58988850, 63836763, 67908030, 70693901, 72290709, 72618566, 71713502, 69159114, 65236748, 60531472, 56274196, 53513118, 52785556, 54094174, 56665744, 59003736, 60828655, 61723121, 60584454, 57797117]
14388E7797117l975838m289435l922036l140235k345328j462445o09396k67261
14380C7785143K27491J26292l36644j339018k088962k822871l422958l637936
14372B4490537l335376k824357k337127j842364j508519j175361o46773l06423
14364A0514237l19716m50881n48344j73316j3294R8901L25103M03072O07466Q00892
14354A1244120J196415J626721K175659K692927L215394L390137L174139K872884
14346C1588396K446668J444175P47005L03478J44965M53557O77582Q87703J757554
14337D0451083K778797L454169M048843L498642K635672K119545J427785R9449
14329F0513985j272413k537561k932555k008442k84171J981759L737969M641255
$$ y = [57797117, 53821279, 49531844, 45609808, 42469573, 40124245, 38661800, 38052404, 37785143, 38012634, 38138926, 37802282, 36463264, 34374302, 31551431, 28128473, 24490537, 21155161, 18330804, 15993677, 14151313, 12642794, 11467433, 10820660, 10514237, 10194521, 9743640, 9195296, 9021980, 9008686, 9107587, 9432690, 9835762, 10443228, 11244120, 12440535, 14067256, 16242915, 18935842, 22151236, 25541373, 28715512, 31588396, 34035064, 35479239, 36226244, 36529722, 36674687, 37128244, 37805826, 38693529, 40451083, 43229880, 46684049, 50732892, 54231534, 56867206, 58986751, 60414536, 60513985, 59241572, 56704011, 53771456, 51763014, 51478843, 53460602, 57198571, 61839826]
14321F1839826M699285M009546L027827K087762J201750K95152j491762l231932
14313G2437454m536727n091853m252589k796831r47013O78058J797007K292324
14305E9579830J854994M82023j238324k619299l694867l922648l704566l306305
14297D3430838k556285k015269j496796j274381j105812j031091j181518j527196
14289C1242490j966755k287926k646639k680577k774992k665199k285757j925212
14281A2009433j457794j102635q87181p55496o56245n47317l97527n21739m35524
14272E247975l43038m08147k48070j08156l26643k89638k48257k02579j89744
14263B883703j44274j77436k34236j34688m6637r1096L0492o6935k67231j14071
$$ y = [61839826, 66539111, 70548657, 73576484, 75664246, 76865996, 77161148, 75669386, 72437454, 67900727, 62808874, 58556285, 55759454, 54812441, 55490499, 57287506, 59579830, 61434824, 61916847, 60678523, 58059224, 54364357, 50441709, 46737143, 43430838, 40874553, 38859284, 37362488, 36088107, 34982295, 33951204, 32769686, 31242490, 29275735, 26987809, 24341170, 21660593, 18885601, 16220402, 13934645, 12009433, 10551639, 9449004, 8561823, 7806327, 7150082, 6602765, 6205238, 5683499, 5247975, 4904937, 4496790, 4248720, 4140564, 3813921, 3524283, 3276026, 3073447, 2883703, 2739429, 2561993, 2327757, 2193069, 2146432, 2055336, 2085828, 2018893, 1751662, 1637591]
14253A637591l618j0073q8761k30466j02822P8842R9456k13709j64555o9301j10106
14242H22478Q0002l18q4264N4909l0463l5478p234J34472P5288L5636l2003r9212
14230I13813p5261k2008O7525O0720p073o8979j28036n821j206j03238K9631m6340
14218F13727q4091j32443k5808O0538P2789P6367L2775r3831M117p1448j15990
14207C36702R4518Q3087j1994Q3437j7664O9466k0654j11793M0046j72091k45494
14196A27566Q8951n0609J63681J24344M0002m4663J0594n6380l4485J83985L6056
14185E89042k20267l2987j04161j97223N4954K23640J27645j42441j1182m1369
14175B45651l9478m2065J49931L0266j14835q712j81423J52651R9178L4062j0110
$$ y = [1637591, 1633973, 1623900, 1535139, 1304673, 1201851, 1280693, 1380149, 1166440, 1001885, 932584, 822478, 902480, 902162, 817898, 872807, 842344, 806866, 799632, 934104, 1009392, 1045028, 1013025, 913813, 838552, 816544, 884069, 944789, 937716, 868737, 740701, 734880, 733674, 630436, 660067, 613727, 529636, 397193, 371385, 431923, 504712, 581079, 613854, 520023, 524140, 452692, 336702, 431220, 514307, 502313, 585750, 568086, 637552, 616898, 505105, 545151, 373060, 127566, 216517, 165908, 329589, 453933, 493935, 449272, 459866, 403486, 369001, 552986, 589042, 368775, 335788, 231627, 34404, 89358, 312998, 440643, 298202, 287020, 245651, 206173, 164108, 314039, 344305, 229470, 220758, 39335, 191986, 291164, 325226, 315116]
14164C15116J056q0641m539N6235M7061j23412J18083o5959j96923j7965P5348
14153A23460j44485K6590J51394J46525O2878L9278N565J58158k1452q1122j09144
14142C57645k6352r41k0402J2344j10060j10229j08577N7137k6940k506m131K6512
14130D3500Q5438l9303J7999j63385o4121n5489P4219m045J74582K37807L806
14119C11008j53529j01339m2883K55481J09921j41996J6685j74107j72154j1881
14109a04794M7530K8202N1988o8486L7669J21099l0797R9575M471m732O6032K5544
14097B73301j41243O1426Q0419q1626j87667J2253m865r9059j13212M7301L1578
14086a21394j7357J08596J03645M9053j4372P9800P5973r0608r2335k2090p0167
$$ y = [315116, 316172, 235531, 230992, 287227, 334288, 210876, 328959, 263000, 66077, 48112, 123460, -21025, 5565, 156959, 303484, 366362, 405640, 411205, 569363, 547911, 466789, 357645, 331293, 330352, 309950, 322294, 212234, 102005, -6572, 50565, 23625, 21119, 16988, 43500, 128938, 89635, 107634, -55751, -119872, -175361, -101142, -105187, 69395, 307202, 311008, 157479, 56140, 13257, 268738, 378659, 236663, 253348, 79241, -92913, -104794, -57264, -29062, 22926, -45560, -7891, 113208, 82411, 181986, 186457, 181725, 247757, 273301, 132058, 193484, 273903, 192277, 4610, 16863, 11998, -87061, -200273, -152972, -121394, -138751, -30155, 73490, 122543, 108171, 187971, 263944, 173336, 81001, 58911, -11256]
14075a1256J62293M0236n6188q2218L2200J74112P768j91305o9196J2342J37187
14064A55975L8127J09653L194q5869j70505j54027J58222N6460j83755j31989
14054b04514k8845J48793J43784L9299j31077n3105K02434j4609n6311N5924Q6660
14043A88433r724r6674P4409L8796r8178n0580R3461j41527n2163J21924O2326
14032A30503N8236Q2845J16674N0039k712j29874k26470j6261J437j53210J29556
14021D0763p313J29877R4355j84115P0896p0667r213K02815L4847L682J2337j67812
14009A50452j81137Q2738L8574R6735L0244j34241j4262J53395J05529l7267j30177
13998A60583k33132Q1926J14833P3073J27611J9525j48543J46474o2542Q7370
$$ y = [-11256, 151037, 191273, 135085, 52867, 85067, 259179, 266947, 75642, 6446, 18788, 155975, 194102, 303755, 306949, 221080, 50575, -103452, 54770, 111230, -72525, -204514, -233359, -84566, 59218, 98517, -32560, -85665, 116769, 102160, 45849, 101773, 188433, 178709, 82035, 156444, 195240, 97062, 46482, 139943, -1584, -53747, 68177, 130503, 188739, 271584, 388258, 438297, 435585, 305711, 79241, 62980, 64417, -88793, 40763, 33450, 163327, 257682, 73567, 144463, 73796, 64583, 267398, 302245, 305927, 318264, 150452, -30685, 52053, 90627, 187362, 217606, 83365, 69103, 222498, 328027, 290760, 160583, -72549, 9377, 124210, 197283, 324894, 344419, 195876, 342350, 279808, 367178]
13988C67178K7533k21714j51448J3165J42531O4458K1466J56051K9341r912q2165
13977C56484J1064r985P3308n0471J27285K7602L6932n4561j13985j1272q9024
13966C03377l8781J23078n9778j3571n3111q926J83673J39224o8620r6644j21088
13955B88833k90989P572J62900M9976j05580j52019M8389J7241N8903J48023R9830
13944C33079J5315j05125K9234q3038J07003J47435N4002j19757k69237M6256
13934A55167j0198O6143k2930R5323Q2730l26307j92535J87910J98408O8459o665
13923B95505j19377j62056p9206j0822l7366o6517P165J01294j5642j35005K42972
13912B0945L22185K4408j35364k20544j4310L6666N0884J8397J75731K3828j74963
$$ y = [367178, 394711, 172997, 21549, 34714, 177245, 241703, 263169, 419220, 448561, 438649, 356484, 367548, 357563, 430871, 380400, 507685, 535287, 572219, 517658, 403673, 392401, 303377, 264596, 387674, 327896, 314325, 261214, 252288, 435961, 575185, 506565, 409921, 288833, -2156, 5416, 168316, 218292, 112712, -39307, 9082, 26323, 85226, 233249, 333079, 348394, 243269, 272503, 189465, 296468, 443903, 497905, 378148, 108911, 155167, 144969, 211112, 188182, 283505, 366235, 39928, -152607, 35303, 233711, 302170, 295505, 176128, 14072, -65134, -75956, -113322, -179839, -172674, -71380, -87022, -222027, 20945, 343130, 367538, 232174, 11630, -2680, 33986, 84870, 103267, 278998, 302826, 127863]
13901A27863J05194J13825n4916q7975J50598l4443k42282J1955M8285j53294
13891a5190l2662K05505J45766J61137k6642p7854K5753R1915m8652j52569j02715
13880A73792K2634k0282N9098P0066N0517m1613j4907J51460j80291K9296J57746
13869D57516j46495j40963j0774J76565P2699j08803j27408P9344J04549p5626
13859B80604K1877Q697j07736J27695j30616j1836J46018J03105m9223r3648j0740
13848B84197k3387j84674n1332J26874J17627J73757J52915j3522j61482j23008
13838B97965p7362K2105l8893j74456m3809j07180j17199n2725j62191r292K89217
13827a73820J67527m523J26811J72255k00631M0428J16950L7243m5429j37096
$$ y = [127863, 233057, 346882, 291966, 203991, 354589, 320146, 77864, 89819, 138104, -15190, -47852, 157653, 303419, 464556, 437914, 360060, 385813, 477728, 429076, 276507, 173792, 196426, 176144, 235242, 305308, 355825, 314212, 299305, 450765, 270474, 299770, 457516, 311021, 170058, 159284, 335849, 408548, 299745, 172337, 251681, 356230, 280604, 302481, 311178, 203442, 331137, 200521, 188685, 334703, 437808, 388585, 294937, 284197, 260810, 76136, 24804, 151678, 269305, 443062, 595977, 582455, 420973, 297965, 220603, 242708, 203815, 29359, -14450, -121630, -238829, -291554, -453745, -463037, -173820, -6293, -10816, 115995, 288250, 87619, 128047, 244997, 282240, 236811, 99715]
13817I9715L2705J9271j44444o4179N7281J35888l3506j94134R0652J63227o2339
13806A00137m0745N6866j8825P6935j98753J8984j24479l7723n6820M9242J83761
13795H580j14035K91105J81669L2560J13794j03959k45986k63772k3372J90101
13785F6685O8995N4856r676j4666m7186o7279J54377P2869k08586n7243Q4249
13774I7395m5676N3624K5620N1280r8296q9383j26755L6865J51538j5552K4994
13763F5654K3333J73875j68006j51647O2372J22982K5063l7761O6047j29925p6391
13752b4404m5269L6464J09880n2729J2976J67510o395M1839p2179k2977R284j49022
13740D978j65990j02864J26409J36706N7802l3370l4497j29380J57066K5127j5415
$$ y = [99715, 132420, 151691, 7247, -56932, 349, 136237, 102731, -91403, -751, 162476, 100137, 59392, 116258, 97433, 174368, -24385, -5401, -129880, -167603, -224423, -175181, 8580, -105455, 185650, 367319, 399879, 513673, 409714, 163728, -100044, -123416, 66685, 135680, 190536, 180860, 166194, 119008, 51729, 206106, 278975, 70389, 13146, 97395, 51719, 105343, 130963, 182243, 83947, -5436, -132191, -95326, 56212, 40660, 65654, 88987, 262862, 94856, -56791, 5581, 128563, 153626, 115865, 181912, 51987, -24404, -69673, -33209, 76671, 23942, 36918, 204428, 198033, 239872, 167693, 144716, 154000, 4978, -161012, -263876, -137467, -761, 57041, 23671, -10826, -140206, 16860, 41987, 26572]
13729B6572j03019j62160M5484J76214N2875k2925r5435j42532J51438Q1635P1956
13718H0103J01601j26421j36522p7629j45419j50080N6484J86095J14518J08272
13708A1002N7492r0908j15104P0682p3490j58923O3687N5072o965K23033J57475
13697A93053J65305p5839n9928O5391n5422j28981j61582n4318L7233j00213J72507
13686b794R9111k18069j99039J72893P3595k88192k09698L56064Q1954J90762
13676E6587j09908Q8073J13751O726j58164j7543m0594q7994m8440P4244J8835
13665a04427m7608J72072M1033k06972r1382Q7735R9355q232n4897P7259J15502
13654G9438j30991p6430L386R0888P7103m6216q1555J55356J08169n3381p203
$$ y = [26572, -76447, -238607, -193123, -16909, 35966, 13041, -82394, -224926, -73488, 8147, 80103, 181704, 55283, -81239, -158868, -304287, -454367, -397883, -211788, -97270, 11002, 68494, -22414, -137518, -66836, -140326, -299249, -235562, -180490, -187455, 35578, 193053, 358358, 282519, 222591, 287982, 232560, 103579, -58003, -112321, -75088, -175301, -2794, 96317, -121752, -320791, -147898, -74303, -362495, -572193, -216129, -134175, 56587, -53321, 34752, 148503, 155229, -2935, -20478, -61072, -149066, -197506, -123262, -104427, -152035, 20037, 61070, -145902, -237284, -149549, -50194, -58426, -113323, -36064, 79438, -51553, -127983, -124597, -33709, 43394, -2822, -84377, 70979, 179148, 125767, 118564]
13643A18564p5221o1106J4462M1550p56l3696k3372m5284o5722j75755L9849J70386
13631i6101J71202K0516m644q9697L3663J9481k9722k9588K434J33219L5751l0312
13619A36202j08118m9972J21563J641O27n8799j81521p2462O9207l1722O0222
13608a13132j402r6680n3639J22731q608j0882j27070J8871J22675N8117n9256
13597a48275l8628J37215N9135M4588r165n2094q1867R9400J17918l0833n4482
13586D2912j91624l09377M9661N3120L2153J55687J51795J73057o3164q009j60580
13575g4369p4780j64994j25857J52951J94212L3039l6043j25059q4474k181m3533
13564c51088Q2661J40870J90140J20959r4997N6082n8586o7558l8909J21971j36399
$$ y = [118564, 43343, -17763, -3301, 38249, 37493, 3797, -19575, -64859, -130581, -306336, -266487, -96101, 75101, 95617, 90973, 1276, 34939, 54420, 24698, -4890, -2456, 130763, 166514, 136202, 28084, -21888, 99675, 101316, 101943, 43144, -138377, -210839, -141632, -173354, -113132, -114534, -211214, -264853, -142122, -150730, -161612, -288682, -269811, -147136, -89019, -148275, -186903, -49688, 9447, 54035, 44870, -7224, -89091, 10309, 128227, 97394, 42912, -148712, -458089, -408428, -355308, -323155, -167468, -15673, 157384, 94220, 86211, -74369, -149149, -314143, -440000, -287049, -92837, -59798, -95841, -220900, -305374, -307555, -351088, -268427, -127557, 62583, 183542, 88545, 144627, 86041, 18483, -20426, 101545, -34854]
13553c4854r0883m3910J49323J56647j51330j17699j08681j90702l9715J61921
13543c09883N5809O6720Q566J50079Q7649J8485j31059j28079O3797K9818j03254
13532a91352j4646Q8741K29174R0204r9454l1125j1172K2240q3399K2554J93610
13521B15375k453J7825n0482P8519J29642q3925l25565j93345P6403j7766K0316
13510a35456q9746J51657J38779j31817j21566J463P7760K36923J03344O0673
13500B92014j53198j86661l2024j21265M3264O7946J55948Q2759j2757j8944n831
13489A11251j8574m6729j04799l0335j69384Q182L35059J49189j34739K6296q9297
13478C6120M8186K3131N3316n2829n1737r6472j16680P6174M8862O8807k00029
$$ y = [-34854, -125737, -169647, -20324, 136323, -15007, -132706, -241387, -432089, -471804, -309883, -254074, -187354, -178788, -28709, 58940, 77425, -53634, -181713, -117916, -88098, -191352, -205998, -117257, 111917, 202121, 102667, 71542, 60370, 82610, -789, 21765, 215375, 212922, 230747, 180265, 258784, 388426, 304501, -21064, -214409, -138006, -155772, -135456, -225202, -73545, 65234, -66583, -188149, -186686, -108926, 127997, 231341, 292014, 138816, -47845, -79869, -201134, -157870, -89924, 66024, 148783, 136026, 117082, 111251, 92677, 45948, -58851, -89186, -258570, -250388, 84671, 233860, 99121, 125417, 36120, 84306, 107437, 160753, 107924, 56187, -40285, -156965, -80791, -31929, 36878, -163151]
13467a63151j6967J0047o7863j0568K09845q8934j17378J29430J42667M867j65623
13456a33628N7535N9800Q2180k175K743N4861q6870R212J0574J29622n8058q6842
13444C8954j50897j7673K5385R075R6752L4993J19580J59585K076r0456K7634
13433B55008o2532r2483K54031J29197r0420j70494o2195P5428J61949j02479
13423B95010k54418Q0832J03884k258p4915k13913m3230L6992o9841L62P1623
13412f9872o5131Q7276n0386j15719M2578j0045J53475o1404L2051k6618M8538
13401c5257O1112M7390J06655n4878p1687O1165L3585K0803j55613j0894r4356
13390i1975j75267M2045L27411o526j29626R8908L1469J6811n9356j26265j3382
$$ y = [-163151, -180118, -170071, -237934, -248502, -38657, -127591, -244969, -115539, 27128, 31995, -133628, -76093, -16293, 65887, 63712, 66455, 121316, 34446, 43658, 54232, 183854, 125796, 38954, -111943, -129616, -104231, -95156, 1596, 36589, 156169, 315754, 317830, 227374, 255008, 192476, 99993, 354024, 483221, 392801, 222307, 160112, 235540, 397489, 295010, 40592, 121424, 225308, 223050, 148135, -65778, -109008, -72016, -141857, -141495, -69872, -135003, -47727, -98113, -213832, -171254, -181299, -27824, -89228, -57177, -83795, -35257, 25855, 73245, 179900, 125022, 53335, 114500, 148085, 168888, 13275, 2381, -91975, -267242, -225197, 102214, 95688, -33938, 64970, 96439, 113250, 53894, -72371, -85753]
13379h5753K6062O7690J94116J31517l3264m6163j05886r1209k8368J8015j12670
13368f5913n0250k48735j02319J11953J51827K20714Q5749O2395l982j55050n8262
13357e1873R2224P961k5589J02202K2796j91592P7474O6343p435L566J03454J5308
13345B14839l2453j63713k4178J29591q7056k0589j1067k7209J4473J66706m0814
13334A18530P8330p6113n5835L5732n8636k34760o8952m4835Q3009K39847J48240
13323A64557j05994j26756P7439L9470Q6469j51864r8736P1470J17647n8652Q6236
13312A01286M4011l2207N7980O609j68041J6530J33562R3563p5825J0673J2964
13301B01105O4335N1404k14698j22040p4111p5568l6205N7002j04011L2865K52882
$$ y = [-85753, -59691, 7999, 202115, 333632, 300368, 254205, 148319, 57110, 28742, 46757, -65913, -116163, -364898, -467217, -355264, -203437, 17277, 103026, 165421, 161439, 6389, -51873, 40351, 48312, 22723, 124925, 147721, -43871, 33603, 99946, 92511, 96077, 199531, 214839, 182386, 18673, -5505, 124086, 37030, 16441, 5374, -21835, -7362, 159344, 118530, 196860, 120747, 64912, 100644, 42008, -192752, -261704, -306539, -223530, 16317, 164557, 58563, -68193, 9246, 48716, 135185, -16679, -115415, -43945, 73702, 15050, 101286, 145297, 113090, 171070, 177679, 9638, 26168, 159730, 253293, 177468, 188141, 201105, 265440, 316844, 102146, -19894, -94005, -169573, -205778, -148776, -252787, -219922, 32960]
13290C2960J6143p9775m281k0255j18114N3369k7655J1841j65059q1813K75078
13279a07561J61904k0659m0958j39145k4186K04200K244j47704j1743j474m7050
13268a72132k4934L6632R4348q5428L582J12543L46907K2012r2896n0036j32986
13257E7612j63802k13752j43380K08502L35612m1635k66215l061K50177J237j1896
13246I399m1048o3378j09802K51078J16507o4998n0516K0899N2003P5144j9564
13235A75724J306M997j705J138j24428J1332Q6181P0613r4619j24611M3490P0105
13223A19523n9963p8524k7737m4773n8378K1832J50649j7565r9173l6453j14568
13212b45130J03495J35474j61016m0966J56995K8699q6870J47157j47830J5429
$$ y = [32960, 49103, -30672, -34953, -55208, -173322, -119953, -147608, -135767, -300826, -382639, -107561, 54343, 33684, -7274, -146419, -170605, 33595, 35839, -111865, -123608, -125082, -172132, -197066, -160434, -66086, -151514, -147932, -35389, 311518, 333530, 240634, 190598, 57612, -106190, -319942, -463322, -254820, 80792, 39157, -227058, -230119, 20058, 21295, 9399, -31649, -95027, -204829, 46249, 162756, 97758, 47242, 68141, 120144, 195288, 175724, 177030, 182027, 180322, 181460, 57032, 68364, 154545, 225158, 130539, 5928, 49418, 119523, 59560, -18964, -46701, -91474, -149852, -128020, 22629, 5064, -94109, -130562, -245130, -141635, -6161, -167177, -208143, -51148, -22449, -109319, 37838, -109992, -94563]
13202i4563J7012O2018o9874j6409J4087j08432k2187L8426K9500J6298R6767
13191c7357Q5240J18702p1950P5416o8138j28738n3957k1333J11257j48218j60384
13180b99460M0076m460J21494P7509m0348j37818R0488M2556R2247J46416J5793
13169A44493r4185M5223j10714L282L9282J8141L2667P6233K8247j79131n4900
13158e1362Q0298J51385J4909J19838K13444j67062j66482l1818j86206j19930
13148a42986J53938j21944j75658K60097l8454n3655m7314Q0064L7059J0961J01334
13137F3442J19421j12263j29392J51202N0358q4590q1401k2735Q7866k7255l1776
13126a7123L050r3520m7674K05256J738k01424L9285J70128o3504J22512L0277
$$ y = [-94563, -77551, -15533, -85407, -101816, -87729, -196161, -218348, -179922, -150422, -134124, -37357, 47883, 166585, 94635, 170051, 101913, -26825, -80782, -102115, 9142, -139076, -299460, -259384, -263844, -142350, -64841, -105189, -243007, -152519, -109963, -17716, 128700, 144493, 50308, 95531, -15183, -11901, 27381, 45522, 78189, 154422, 182669, 3538, -51362, 28936, 180321, 195230, 315068, 528512, 361450, 194968, 163150, -23056, -142986, 10952, -110992, -286650, -26553, -65007, -118662, -165976, -85912, -48853, -37892, 63442, 182863, 70600, -58792, 92410, 142768, 58178, -23223, -45958, 41908, 14653, -17123, -14073, -107593, -155267, 49989, 51727, -149697, -110412, 59716, -3788, 118724, 149001]
13115A49001m2488q6955j16862J59415J1280j59085j95974p6363k7622K49878
13105a35775J86442Q0127Q5030Q016R8447J01951J12073m6843j30602q5291R1788
13094C65363j78950l79546O0450K10951N2281j4948k09513m0571O6568l8139p5473
13083a81527p4004r337J80860J05003r5077k9834M6138J08040J76507j85997j66035
13072a25263k5312m8566O3543K02927m4894M7432o3184N2613l4034J1358J06839
13061A43459k4761o2180o739Q7438R3839j39833K8993q9546N0700K8400j02758
13050G012K2698P7875J9377j46011j28231j1483J07256K2779o9668N3705n3578
13039i8269j11444J6878q0559J39709R7600j00326J493j15642j36750Q8759J52016
$$ y = [149001, 106513, 19558, -97304, 62111, 73391, -85694, -281668, -358031, -385653, -135775, 50667, 130794, 215824, 223840, 322287, 424238, 536311, 489468, 358866, 273575, 365363, 186413, -193133, -132683, 78268, 130549, 115601, -93912, -134483, -67915, -106054, -181527, -255531, -264868, -84008, 20995, -74082, -103916, -57778, 50262, 226769, 40772, -125263, -150575, -199141, -135598, 67329, 22435, 69867, 6683, 59296, 25262, 36620, 143459, 118698, 56518, 49779, 137217, 231056, 91223, 120216, 30670, 81370, 109770, 7012, 29710, 107585, 126962, -19049, -147280, -158763, -51507, -28728, -98396, -44691, -98269, -209713, -192835, -273394, -133685, -36085, -136411, -134918, -250560, -387310, -298551, -146535]
13028a46535j08076j21293m6505n2249J12650J94212L9358N263m6076J48647P3942
13017E3338m8415l6746j18854Q0206J24265n1910o1094L6507j09592m5800N9682
13006a18413J86935L391j12468k40737l6151K66282Q2156N6995J35166J45983
12996C69139j0937k89648l65L4035q3440O4213n1070j26935K7834j02407N0222
12985a19359m1111P2009M401M5414r2469M8016P5847Q9768J08436M6926j52602
12974H5276n3378n3444M4504L3582j74505O8164L0612j17386m7579O2310m7613
12963a69457J40868L55275J91770k1216M3321j75403j97144j72527r3418N7262
12953d0669k0288N048K17661j9298l2136j21100j54592l3315O8571P2364m1733
$$ y = [-146535, -254611, -375904, -422409, -474658, -362008, -167796, -128438, -123175, -169251, -20604, 53338, 4923, -31823, -150677, -70471, 53794, 1884, -59210, -22703, -132295, -178095, -118413, 68522, 71913, -40555, -281292, -317443, -51161, 30995, 87990, 223156, 369139, 358202, 68554, 68189, 102224, 18784, 82997, 31927, -95008, -67174, -169581, -119359, -160470, -88461, -84060, -38646, -131115, -83099, -7252, 82516, 190952, 237878, 85276, 31898, -21546, 22958, 56540, -117965, -49801, -19189, -136575, -184154, -121844, -169457, -28589, 326686, 518456, 497240, 540561, 365158, 168014, -4513, -97931, -40669, -60957, -55909, 161752, 142454, 110318, -10782, -165374, -198689, -130118, -57754, -99487]
12942i9487O2094J22186l8700Q2417R102J19528l8667k39850j20631P7203J10601
12931D5796N2683J14690m1979m0471J87073J75884j20370j07332q3261l1584q2327
12920F8802J5610j6825j31236k577j5563q8371k723J50838M7330j5084l1433M7070
12908B5838n5210n8093K94677J7873j32179k23617P572J78173p0054J0242j9800
12897b4578j01798l149J82268J21016r8222M6605N511J0359J68813J22331J05486
12886E34642L7053l3627O282n1195k84526q5223O9596p950k45305j23140J83421
$$ y = [-99487, -37393, 84793, 46093, 128510, 137612, 257140, 218473, -21377, -142008, -64805, 45796, 98479, 213169, 171190, 130719, 317792, 493676, 373306, 265974, 182713, 151129, 68802, 84412, 67587, -63649, -66226, -81789, -170160, -172883, -22045, 25285, 10201, -21232, 25838, -29372, -87465, 207212, 225085, 92906, -130711, -123139, 55034, -15020, -4778, -24578, -126376, -129525, 52743, 173759, 75537, 122142, 127653, 138012, 306825, 429156, 534642, 571695, 538068, 544350, 493155, 208629, 123406, 193002, 185052, -60253, -183393, 28]
$$ [...]
##END NTUPLES=NMR SPECTRUM
##END=
