##TITLE=Analysis number 328148
Compound Code cc 63913
Book Reference 470/174
Project Code adrs
Chemist Name mikem
##JCAMPDX= 6.0         $$ Bruker NMR JCAMP-DX V2.0
##DATA TYPE= NMR SPECTRUM
##DATA CLASS= NTUPLES
##ORIGIN= Bruker BioSpin GmbH
##OWNER= nmr
$$ XWIN-NMR		Version 3.5
$$ Tue May  8 14:37:05 2007 GMT Daylight Time (UT+1h)  MAYBRIDGE\nmr@NMR_250MHZ
##.OBSERVE FREQUENCY= 250.131544655141
##.OBSERVE NUCLEUS= ^1H
##.ACQUISITION MODE= SIMULTANEOUS (DQD)
##.ACQUISITION SCHEME= undefined
##.AVERAGES= 16
##.DIGITISER RES= 18
##SPECTROMETER/DATA SYSTEM= dpx250
##.PULSE SEQUENCE= zg30
##.SOLVENT NAME= CDCl3
##.SHIFT REFERENCE= (INTERNAL, CDCl3, 0, 16.522)
##AUDIT TRAIL= $$ (NUMBER, WHEN, WHO, WHERE, WHAT)
$$ ##TITLE= Audit trail, XWIN-NMR		Version 3.5
$$ ##JCAMPDX= 5.01
$$ ##ORIGIN= Bruker BioSpin GmbH
$$ ##OWNER= nmr
$$ C:\u/data/dgb/nmr/ADRS/560/pdata/1/auditp.txt
$$ ##AUDIT TRAIL=  $$ (NUMBER, WHEN, WHO, WHERE, WHAT)
(   1,<2007-05-08 14:36:42.81 +100>,<MAYBRIDGE\nmr>,<NMR_250MHZ>,
      <created by zg, POWCHK disabled, PULCHK disabled
       configuration hash MD5:
       76 6E 9A 78 1E 09 19 81 EC 84 63 8F B0 6A 59 2D
       data hash MD5: 64K
       7A D5 C0 05 B1 B0 F9 07 21 DA 3B 0B 2E D4 6C 88>)
(   2,<2007-05-08 14:36:55.34 +100>,<MAYBRIDGE\nmr>,<NMR_250MHZ>,
      <Start of raw data processing
       ef LB = 0.3 FT_mod = 6 PKNL = 1 SI = 32K 
       data hash MD5: 32K
       D8 FA 14 4A 9A 3C 3C 83 E3 2F 80 06 08 36 63 A1>)
(   3,<2007-05-08 14:36:57.09 +100>,<MAYBRIDGE\nmr>,<NMR_250MHZ>,
      <apk 
       data hash MD5: 32K
       EC AD 15 C4 4F 8C BD A2 BE 0A 26 C3 00 96 D2 44>)
(   4,<2007-05-08 14:36:58.00 +100>,<MAYBRIDGE\nmr>,<NMR_250MHZ>,
      <abs ABSG = 5 
       data hash MD5: 32K
       41 20 5D C0 7F BB FE C8 52 3E 76 0D 07 F7 EF CE>)
$$ ##END=
$$ 
$$ hash MD5
$$ 2B B6 F1 EA 5C E4 74 28 A7 D9 4F 0F 19 A7 A3 EB
##$RELAX= 
##$RELAX= 
##$RELAX= 
##$RELAX= 
##$RELAX= 
##$RELAX= 
##$RELAX= 
$$ Bruker specific parameters
$$ --------------------------
##$DU= <C:\u>
##$EXPNO= 560
##$NAME= <ADRS>
##$PROCNO= 1
##$TYPE= <nmr>
##$USER= <dgb>
##$AMP= (0..31)
100 100 100 100 100 100 100 100 100 100 100 100 100 100 100 100 100 100 
100 100 100 100 100 100 100 100 100 100 100 100 100 100 
##$AQSEQ= 0
##$AQ_mod= 3
##$AUNM= <au_zg>
##$AUTOPOS= <25 >
##$BF1= 250.13
##$BF2= 250.13
##$BF3= 250.13
##$BF4= 250.13
##$BF5= 500.13
##$BF6= 500.13
##$BF7= 500.13
##$BF8= 500.13
##$BYTORDA= 1
##$CFDGTYP= 0
##$CFRGTYP= 5
##$CHEMSTR= <none>
##$CNST= (0..31)
1 1 145 1 1 1 1 1 1 1 1 1 1 1 1 1 1 1 1 1 1 1 1 1 1 1 1 1 1 1 1 1 
##$CPDPRG= <>
##$CPDPRG1= <>
##$CPDPRG2= <>
##$CPDPRG3= <>
##$CPDPRG4= <mlev>
##$CPDPRG5= <mlev>
##$CPDPRG6= <mlev>
##$CPDPRG7= <mlev>
##$CPDPRG8= <mlev>
##$CPDPRGB= <>
##$CPDPRGT= <>
##$D= (0..31)
0 1 0 0 0 0 0 0 0 0.06 0 0 0 0 0 0 0.0002 0 0 0 0 0 0 0 0 0 0 0 0 0 0 
0 
##$DATE= 1178631401
##$DBL= (0..7)
120 120 120 120 120 120 120 120 
##$DBP= (0..7)
150 150 150 150 150 150 150 150 
##$DBP07= 0
##$DBPNAM0= <>
##$DBPNAM1= <>
$$ [...]
##$SUBNAM7= <"">
##$SUBNAM8= <"">
##$SUBNAM9= <"">
##$SW= 20.6930455092707
##$SWIBOX= (0..15)
0 0 3 0 0 0 0 0 0 0 0 0 0 0 0 0 
##$SW_h= 5175.983436853
##$TD= 65536
##$TD0= 1
##$TE= 683.16
##$TE2= 300
##$TE3= 300
##$TEG= 300
##$TL= (0..7)
0 120 120 120 120 120 120 120 
##$TP= (0..7)
150 150 150 150 150 150 150 150 
##$TP07= 0
##$TPNAME0= <>
##$TPNAME1= <>
##$TPNAME2= <>
##$TPNAME3= <>
##$TPNAME4= <>
##$TPNAME5= <>
##$TPNAME6= <>
##$TPNAME7= <>
##$TPOAL= (0..7)
0.5 0.5 0.5 0.5 0.5 0.5 0.5 0.5 
##$TPOFFS= (0..7)
0 0 0 0 0 0 0 0 
##$TUNHIN= 0
##$TUNHOUT= 0
##$TUNXOUT= 0
##$USERA1= <user>
##$USERA2= <user>
##$USERA3= <user>
##$USERA4= <user>
##$USERA5= <user>
##$V9= 5
##$VALIST= <valist>
##$VCLIST= <CCCCCCCCCCCCCCC>
##$VD= 0
##$VDLIST= <DDDDDDDDDDDDDDD>
##$VPLIST= <PPPPPPPPPPPPPPP>
##$VTLIST= <TTTTTTTTTTTTTTT>
##$WBST= 1024
##$WBSW= 4
##$XGAIN= (0..3)
0 0 0 0 
##$XL= 0
##$YL= 0
##$YMAX_a= 402125
##$YMIN_a= -423637
##$ZGOPTNS= <>
##$ZL1= 120
##$ZL2= 120
##$ZL3= 120
##$ZL4= 120
##$ABSF1= 16.522
##$ABSF2= -4.171173
##$ABSG= 5
##$ABSL= 3
##$ALPHA= 0
##$AQORDER= 0
##$ASSFAC= 0
##$ASSFACI= 0
##$ASSFACX= 0
##$ASSWID= 0
##$AUNMP= <proc_1d>
##$AZFE= 0.1
##$AZFW= 0.1
##$BCFW= 0
##$BC_mod= 0
##$BYTORDP= 0
##$COROFFS= 0
##$CY= 12.5
##$DATMOD= 1
##$DC= 0
##$DFILT= <>
##$DTYPP= 0
##$F1P= 14.0000005364418
##$F2P= -0.99999901652339
##$FCOR= 0.5
##$FTSIZE= 32768
##$FT_mod= 6
##$GAMMA= 0
##$GB= 0
##$INTBC= 1
##$INTSCL= 1
##$ISEN= 128
##$LB= 0.3
##$LEV0= 0
##$LPBIN= 0
##$MAXI= 10000
##$MC2= 0
##$MEAN= 0
##$ME_mod= 0
##$MI= 0
##$NCOEF= 0
##$NC_proc= -2
##$NLEV= 6
##$NOISF1= 0
##$NOISF2= 0
##$NSP= 0
##$NTH_PI= 0
##$NZP= 0
##$OFFSET= 16.522
##$PC= 1
##$PHC0= -57.19188
##$PHC1= 7.708283
##$PH_mod= 1
##$PKNL= yes
##$PPARMOD= 0
##$PSCAL= 4
##$PSIGN= 0
##$REVERSE= no
##$SF= 250.13
##$SI= 32768
##$SIGF1= 0
##$SIGF2= 0
##$SINO= 400
##$SIOLD= 32768
##$SREGLST= <1H.CDCl3>
##$SSB= 0
##$STSI= 32768
##$STSR= 0
##$SW_p= 5175.98343685301
##$SYMM= 0
##$S_DEV= 0
##$TDeff= 65536
##$TDoff= 0
##$TI= <Analysis number 999999
Compound Code 99
Book Reference 9
Project Code 9>
##$TILT= no
##$TM1= 0
##$TM2= 0
##$TOPLEV= 0
##$USERP1= <user>
##$USERP2= <user>
##$USERP3= <user>
##$USERP4= <user>
##$USERP5= <user>
##$WDW= 1
##$XDIM= 32768
##$YMAX_p= 332696362
##$YMIN_p= -103289
$$ End of Bruker specific parameters
$$ ---------------------------------
##NTUPLES= NMR SPECTRUM
##VAR_NAME=  FREQUENCY,     SPECTRUM/REAL,   SPECTRUM/IMAG
##SYMBOL=    X,             R,               I
##VAR_TYPE=  INDEPENDENT,   DEPENDENT,       DEPENDENT
##VAR_FORM=  AFFN,          ASDF,            ASDF
##VAR_DIM=   32768,         32768,           32768
##UNITS=     HZ,            ARBITRARY UNITS, ARBITRARY UNITS
##FACTOR=    0.157963299565203, 1,           1
##FIRST=     4132.6476996994, 0,             0
##LAST=      -1043.33573715361, 0,           0
##MIN=       -1043.33573715361, -103289,     0
##MAX=       4132.6476996994, 332696362,     0
$$ Real data points
##PAGE= N=1
##DATA TABLE= (X++(R..R)), XYDATA
$$ [...]
19401a904l211j740P024J119l753N908Q43L28J948J285l543l213l366l631M968
19386i38M026m289n174j271m352M570M738K398k965o784J577P306N199j236m344
19371a539n019K628K738O407r15m961N526J905k055k528L903N45Ol966l131j099
19355a555P0m976n223Ok441J133O260o378J834O64K941K893q85j644M131J930
19339a240r36j423P17P433P54L66O537j721p683Q72L418j18k011K919L743l657
19323G970j089N234j024o810J808n866l236l452q540j055j28K289J1228K15j733
19308d189m353k50P635M22o775L348R059m986m204J852L455j580l388J768N134
19293B948J21r985n033J662j002j025J720K123M083L912L425m00j74q5j52j151
$$ y = [-1904, -5115, -6855, 169, 1288, -2465, 3443, 4286, 4614, 6562, 7847, 4304, 1091, -2275, -5906, -938, 3088, -1201, -6375, -7646, -11998, -7428, -2690, -292, -3257, -10041, -8464, -1158, 4041, 2805, -1539, -6558, -3930, -1192, 5215, 4300, -661, 4865, 6770, 4715, 2187, 6090, 6635, 6641, 2675, -456, -1555, -1485, -6461, -11684, -11678, -14119, -12986, -6726, -13104, -11270, -10606, -7665, -4772, -5657, -7301, -3170, -1240, -2176, -3599, -2882, 4551, 5305, 5671, 12208, 10487, 2804, 3676, 7094, 6976, 4965, 7884, 11627, 7970, 6881, 12115, 11091, 4281, 6089, 223, -3013, -6465, -15005, -16060, -16188, -13899, -2671, -2456, -4189, -8542, -8792, -1157, -735, -7510, -4162, 4897, -89, -4293, -2441, 1014, -566, -3954, -2186, 2948, 3069, -6916, -11949, -10287, -11289, -12314, -10594, -8471, -4388, -476, 2949, 2549, 2375, 2290, 2138, 987]
19277I87J009k728o804K183l67K642n36K959O671K906R16m592j866n659p09K681
19261c07k946L71J861L568l285L28o85k421K205R43k941L485m913r61P630J813
19245C745o306o256K251M657j028K259k610p248N877L025m446J135n235L325P741
19230H86R895L850J474j0278m812n907j898K126N460n622l569j981P431P262l594
19215G23k07l532m392J655J548K257m211J836l061O97N177n746L52O345J106j312
19199g65Q20k632n65J536K749n036j200j653o033m123K200P28M476L588P12q28
19183f026K699L642m215l028J488k637k747k359L742M040m506K181j531K495J898
19168d864N098K00j437K16J51j235M131M1m116J678P74L601j1J380k102l860l672
$$ y = [987, 1996, -732, -7536, -5353, -5720, -3078, -3614, -655, 6016, 8922, 9838, 5246, 3380, -2279, -2988, -307, -3253, -2882, -1021, 2547, -738, -410, -1095, -3516, -1311, -368, -3309, 176, -4737, -5698, 1932, 3745, -2561, -8817, -6566, -1909, -2937, -678, -3288, -10536, -4659, -1634, -6080, -4945, -10180, -6855, 886, 10781, 14631, 16105, 5827, 1015, -4892, -6790, -4664, 796, -4826, -8395, -10376, -2945, 4317, 723, 516, -3016, -7408, -5753, -4205, -1948, -6159, -4323, -7384, -6687, -1510, -7256, -6904, -559, 547, -765, 55, -2577, -3142, -1606, 1143, -3893, -5093, -6746, -12779, -16902, -14702, -13974, -9498, -5910, -5198, -6026, -3327, 315, -3900, -6928, -5440, -8077, -10824, -13183, -9441, -5401, -9907, -7726, -9257, -6762, -4864, 234, 434, -1003, -787, -636, -1871, 2260, 2301, -1815, -137, 637, 4238, 4227, 5607, 3505, -355, -4027]
19151d027j77N635N110j460j634o520P166Q009n782j861j082K705n368o342o275
19136a1903J1017J1898l949p354J434J003n505L060Q75m110m378k31L869J727
19122b547M454J880r55k925L737k974m97M014n672m364K753N90N718j116J987
19107D083j499l445j21Q121n598m503J129r7l67J612K318J305N230J41l13l292
19091D704q03k232q72k968M717L719J06k521q633M112N476l366j0159j627M861
19076e486N382P585k213l845l335n011n998l173L339m7M136L451L321J519K211
19061A836j826p038n925J720K631M355J433k76M169J538o141J538J1700J31o421
19046C424R07l504r701j789M166K77l015K345J721o07l459K043R53N087Q082M611
$$ y = [-4027, -4204, 1431, 6541, 5081, 3447, -3073, 4093, 12102, 6320, 4459, 3377, 6082, 714, -5628, -11903, -886, 11012, 7063, -291, 1143, 2146, -3359, -299, 576, -3534, -7912, -8143, -4274, -2547, 1907, 3787, 2832, -93, 3644, 670, 173, 4187, -1485, -5849, -3096, -2506, 3212, 2096, 4083, 2584, -861, -982, 7139, 1541, -2962, -1833, -1930, -2297, -685, 1633, 2938, 8168, 8309, 7996, 4704, 3901, 1669, 797, -2171, 2546, 6265, 6371, 3850, -4783, -671, 4805, 1439, -8720, -10347, -5486, -104, 7481, 5268, 1423, -1912, -6923, -12921, -16094, -12755, -12802, -8666, -5215, -1894, -375, 1836, 10, -7028, -12953, -11233, -8602, -4247, -2814, -3090, 1079, 2617, -3524, -1986, 9714, 9845, 3424, 4331, 827, -8874, -10663, -6497, -6220, -9235, -6890, -5169, -5776, -9235, -7192, -6239, -1152, 6930, 11541]
19030A1541o422o18k077k401M38p75L45K645j757l497q19L935O362m573n387k228
19014e288M828l304o597J0447l437n666J535Qq67N12K2j444n217L998P647M981
18998B158j495n379M897L668k452Q20o49m488q83L741Q47j637m982J272k715m240
18982a1517L383L189l817K466J755l457L63M464p248K964J785k309N600R015J813
18967H449k177K78J279J221n69n165o538K145j291N691J861j862j280p79N064
18952F327j206k848p955n613N166N736n072p111N53J929K393K389o00j355j341
18937h608n607k493P318R244L071m258N557j580j164M597p164J074l87k740M951
18922A811o86R354L717n042k323j908l374J515O819M981o401m089j959n51L007
$$ y = [11541, 5119, 4501, 2424, 23, 461, -314, 31, 2676, 919, -2578, -3397, 538, 6900, 2327, -3060, -5288, -460, -3764, -10361, 86, -3351, -9017, -7482, -7474, -8341, -7829, -7807, -9251, -14468, -10470, -2823, 2158, 663, -4716, 181, 3849, 1397, 2217, 1568, -2920, -3803, -62, 785, -852, -5834, -4562, -7277, -11517, -8134, -4945, -8762, -6296, -4541, -7998, -7635, -3171, -10419, -7455, -5670, -7979, -2379, 6636, 8449, 6272, 6550, 7829, 9050, 8481, 3316, -3222, -1077, -2368, 3323, 5184, 3322, 2042, 1263, 6327, 5121, 2273, -5682, -11295, -6129, -393, -5465, -12576, -12023, -10094, -7701, -5312, -5912, -7267, -8608, -14215, -16708, -9390, -146, 2925, -1333, 4224, 2644, 1480, 6077, -1087, -13, -400, -3140, 1811, 1125, 10479, 14196, 9154, 6831, 4923, 1549, 3064, 9883, 14864, 8463, 4374, 2415, 1864, 4871]
18907D871m255q80N545M99j190Q7m8m68N16l998j593k573N565N378J0400m064
18891A3792j0164l833M447l270J522P742k45l074r941o514L492J618R472O992
18877A2036p035j025m979j114N081K718M033O53r631k703L078j219o9n616m197
18862i989J273j221j534N29J0888R150k312l320l497K849J1015K215j209l634
18848A1203k433m540K228j1788r340N908J1784O010k019n678n143o297m998K066
18834a3037L308j093k170K87N119N764N454J584L355O768l346n816m340K900n244
18819e07l328N919L584O317K290l105j791O557N851p601o580L605M04N36j629
18804A0522K88l533n774J42K028J505O375j336R46O826l974p440k188K765R480
$$ y = [4871, 616, -264, 5281, 5780, 4590, 4677, 4629, 4161, 4677, 679, -914, -3487, 2078, 7456, 17856, 13792, 3628, -205, 4242, 972, 2494, 10236, 9991, 6917, -3024, -9538, -6046, -4428, 5044, 12036, 5001, 3976, -1003, -2117, 2964, 5682, 9715, 10368, 737, -1966, 1112, -107, -176, -5792, -9989, -8716, -9937, -11471, -10942, -54, 9096, 6784, 3464, -33, 2816, 13831, 16046, 14837, 11203, 8770, 4230, 6458, -5330, -14670, -8762, 3022, 9032, 7013, 1335, -3808, -10105, -15103, -13037, -9729, -10822, -12992, -12705, -7586, -1822, 3632, 5216, 8571, 15339, 11993, 6177, 1837, 4737, -507, -3835, 2084, 5668, 11985, 14275, 11170, 9379, 15936, 21787, 14186, 7606, 11211, 11615, 12151, 10522, 10810, 7277, 1503, 1645, 3673, 5178, 11553, 10217, 11163, 17989, 14015, 6575, 4387, 7152, 16632]
18789A6632J0426Q314J0762J3846K0080K8779L6347N2752O8156P7630P2622N5153
18777D71499J1328k5327n1508p0472p4020o6559n6794l2753o812J504Q786m565
18765A04307k1720k8318k2217r747J684O973j339n005n568K256L764l296j0815
18752A0959q477m100J397M724R25L718l835J875k057q311o490O648K487l761m690
18737h988J840j502L18J519Q004P659o1R0M772p060n174J770n760Q16N225N110
18721H578L834R79J825N923L020k696l440N57n17M16k262l011j670k222j104Q06
18705I016J92K869K728k304o696j1701L717N756N345j562l882p02j628O531K460
18690A0139j145k315L8j627K132J733M697j0477n382L961L36M383M821N171o275
$$ y = [16632, 27058, 35372, 46134, 59980, 80060, 108839, 145186, 197938, 266094, 343724, 416346, 471499, 482827, 457500, 405992, 335520, 261500, 194941, 138147, 105394, 98582, 100086, 108872, 104307, 82587, 54269, 32052, 22305, 23989, 30962, 29623, 24618, 19050, 21306, 25070, 21774, 10959, 2482, -1618, -221, 4503, 5428, 9146, 5311, 7186, 5129, -3182, -9672, -3024, -537, -4298, -8988, -7148, -8650, -8332, -6813, 1191, 8850, 8789, 8879, 13651, 6591, 1417, 3187, -2573, -1757, 3468, 8578, 12412, 13391, 15216, 21139, 24159, 21463, 18023, 18580, 18063, 18479, 16217, 13206, 11536, 9314, 8210, 9016, 9208, 12077, 14805, 12501, 5805, -5896, -2179, 3577, 8922, 7360, 3478, 2776, 1148, 7679, 10139, 8994, 6679, 6717, 5090, 7222, 8955, 13652, 3175, -2207, 1754, 2090, 6473, 11294, 16465, 10190]
18675A0190l344O710j171k47K109K01j675l311j033K033j089K354j726M97K639
18660A3137J110L827o366j689L892l763o931J936K186o337n162m59l47K780K776
18645E90l99n920l845l90O714K301m905R74O120M404l255l586L779R34j037l853
18629a374m831K856m355Q41m20j491M488L909J057K65j788m122j486k25o40L726
18613c590l088N164l065k629J292N722N641l13R87n839n154k67M504M441k406
18598A400K134K236K655j744J819m17K570M383l185q159K287N132K25L657J800
18583A6793j0600q489l409k411O97N99J9P625k387J064n692p50R759k420k867
18568b469k61M072N598J2358k224m310m548k281o985K982R168k319k690n126r54
$$ y = [10190, 6846, 13556, 12385, 12138, 14247, 14448, 12773, 9462, 8429, 10462, 9373, 11727, 10001, 10498, 13137, 14247, 18074, 11708, 10019, 13911, 10148, 3217, 5153, 7339, 1002, -4160, -4619, -4966, -2186, 590, 191, -5729, -9574, -9964, -3250, -949, -5854, -4880, 1240, 5644, 2389, -1197, 2582, 3516, 2479, -1374, -6205, -3349, -7704, -6863, -7283, -8774, -4286, -377, 680, 945, -843, -4965, -6451, -6676, -7316, -3590, -6678, -1514, -4579, -7208, -5916, -194, 5447, 5134, 6121, 282, -4872, -5139, -635, 3806, 1400, 3534, 5770, 8425, 6681, 8500, 8083, 10653, 15036, 11851, 3692, 5979, 11111, 11336, 14993, 16793, 6193, -2296, -5705, -8116, -7419, -6820, -6801, 824, -1563, -499, -6191, -6941, 2818, 398, -2469, -2730, 1342, 6940, 19298, 17074, 12764, 8216, 5935, -1050, 1932, 11100, 8781, 6091, 965, 11]
18553A1P073L829p38k57k481k032J803K397k968l851K253L912J886P403J0242
18538B8482P075J0021J3740O970k691j4658j2964q330o235j2p901k875N544l91
18524A5775j0072m54j576j252Q359J339O85k789m463K13K494J136J181p69K032
18509A1839o589m045j271K51R229M147j747p213n813n249P869J4366K322j320
18495A6776j940m245K401j992k896L383L552L284o10m113j0457l742j413k961
18481d973K871O815K066J125p554K960Q648J775L212K102k024Q078l92m678o96
18466A9335k810m501o377m469K124J389L10l405N289j440m461M071O017O769l395
18451A4446j971Q316O845J413M150M245K67q690k299k456P345J520m98M18J201
$$ y = [11, 7084, 10913, 10175, 9918, 7437, 5405, 7208, 9605, 6637, 2786, 5039, 8951, 10837, 18240, 28482, 35557, 45578, 59318, 66288, 63597, 48939, 35975, 27645, 21410, 21398, 13497, 10622, 16166, 15775, 5703, 5249, 3673, 2421, 10780, 12119, 12804, 10015, 5552, 5765, 8259, 9395, 10576, 9807, 11839, 5250, 1205, -66, 185, 9414, 13561, 11814, 4601, -1212, -6461, 1408, 15774, 18096, 16776, 14836, 10591, 12992, 11000, 8104, 11487, 15039, 18323, 17713, 13600, 3143, -599, -2012, -4973, -2102, 4713, 6779, 7904, 350, 3310, 11958, 13733, 16945, 19047, 17023, 25101, 24709, 20031, 19335, 16525, 12024, 5647, 1178, 3302, 4691, 5001, 1596, 6885, 5445, 984, 5055, 11072, 17841, 14446, 12475, 20791, 27636, 29049, 33199, 37444, 37711, 29021, 26722, 24266, 31611, 33131, 32633, 33051, 34252]
18436C4252p295N235N433q9O314Q139P514J7781K7453J8226K495k949r907j5214
18422I7388j5457j7179j1274r788k547m441k623J211j91M89o647k860k644j32
18408B3305j250n139J019P0p099J743P05K265k8K561R97J72j064M765N40J999
18392B5561l912l931N381J2773J4668J1016J5070K732j973m048k026n481m85j766
18378F3579m909J683n097m768q601j761n924O064L652J2708J6926K5992L7465
18365A37009M4703Q0360J10375J18135R7021L9514l2530r0304j23131j12055q5074
18354A84023n3332l5184k5578j2497j584J930J423r525l693K90M672l286j829
18341D5830N325J868P904N355l28j4208m928K186N468P309n115L1J0436M282K2
$$ y = [34252, 26957, 32192, 37625, 37536, 43850, 51989, 59503, 77284, 104737, 122963, 125458, 122509, 112602, 97388, 81931, 64752, 53478, 43690, 41143, 36702, 34079, 35290, 35099, 35588, 28941, 26081, 23437, 23305, 22055, 16916, 17935, 18005, 10906, 12649, 13354, 15619, 15591, 18152, 19149, 19321, 18257, 23022, 23562, 25561, 21649, 17718, 23099, 35872, 50540, 61556, 76626, 79358, 77385, 73337, 71311, 65830, 65345, 63579, 58670, 60353, 55256, 50488, 41887, 40126, 34202, 40266, 43918, 56626, 73552, 99544, 137009, 181712, 262072, 372447, 490582, 587603, 627117, 594587, 504283, 381152, 269097, 184023, 130691, 95507, 69929, 57432, 55848, 57778, 59201, 49676, 45983, 46273, 50945, 47659, 45830, 51155, 53023, 60927, 66282, 65954, 51746, 46818, 49004, 54472, 61781, 56666, 56697, 67133, 71415, 71437]
18326G1437m65O676J6385K1665L2755M2822O2557Q7988J27711J80409K34031K66662
18314A150633K19533Q0562n9192j81753k27770j81824j22484r2335p3011n9187
18304D53172l3459J2240O2912R4194J17343R7873M8860l7765j13325j34992j28111
18293D38942j04427p3718n1282k3641j3784n451K333O909J9598Q808J0062J903
18281B16252j4334j6195k4503j8545j1833k466m130n111p38m793j0535j5066j166
18268H6837m591p83r68M875q571p71R324o52K312P656Q161K705Q35N192M278L086
18252A18925l405l787Q929P078J580P226p6K760K603J3392J2288J0678L814J503
18238A83508J0357M038P829J0521Q994O290J986j415O692J4796J6772J6552J4392
$$ y = [71437, 70972, 77648, 94033, 115698, 148453, 191275, 253832, 341820, 469531, 649940, 883971, 1150633, 1370166, 1450728, 1391536, 1209783, 982013, 800189, 677705, 585370, 512359, 453172, 419713, 431953, 494865, 589059, 706402, 804275, 853135, 815370, 702045, 567053, 438942, 334515, 260797, 209515, 185874, 172090, 166639, 168972, 175881, 195479, 204287, 214349, 216252, 201918, 185723, 161220, 142675, 130842, 128376, 124246, 119135, 118397, 113604, 103069, 88003, 86837, 82246, 81463, 80495, 85370, 76799, 76028, 85352, 84700, 87012, 94668, 102829, 105534, 106369, 111561, 115839, 118925, 115520, 111733, 120662, 127740, 129320, 136546, 136470, 139230, 141833, 155225, 167513, 178191, 182005, 183508, 193865, 197903, 205732, 216253, 225247, 231537, 233523, 232108, 238800, 253596, 270368, 286920, 301312]
18225C01312K2181K0398L3263N2976O8461Q5364J03748R8673Q8561O8096M2331
18214I85364L0321K3873L3841N0487O0738M4254J9530j5749n2546n3717k6030
18203A100366J1304O6884J30132J73806K05319K04247J83861J70181J44923J45143
18193B536166J66559K19980L14274M56003O47036R16930J315764J939288K911578
18184A1423578M390469O543983R193955J1974051J3841570J3476906J0963015
18177H1807527N070090j770188q112711j3137552j4592543j3647657j1076512
18170B4540454p834201n137282l198123j990467j287459q60675n91822m14378
18162C226047k86961j94277j30682r1527o6161q0266j32787j79503k20944k37594
$$ y = [301312, 323493, 343891, 377154, 430130, 498591, 583955, 687703, 786376, 874937, 943033, 985364, 1015685, 1039558, 1073399, 1123886, 1184624, 1228878, 1248408, 1232659, 1180113, 1126396, 1100366, 1111670, 1178554, 1308686, 1482492, 1687811, 1892058, 2075919, 2246100, 2391023, 2536166, 2702725, 2922705, 3236979, 3692982, 4340018, 5256948, 6572712, 8512000, 11423578, 15814047, 22358030, 31551985, 43526036, 57367606, 70844512, 81807527, 86877617, 85107429, 76994718, 63857166, 49264623, 35616966, 24540454, 16706253, 11568971, 8370848, 6380381, 5092922, 4232247, 3640425, 3226047, 2939086, 2744809, 2614127, 2522600, 2456439, 2376173, 2243386, 2063883, 1842939, 1605345]
18152A605345k33503k02299j55019j20748j07819p6995n9189m9983m1835l9124
18142E18831l5790k5134k9931j6555q213o091j615o158r753l930J221Q291P699
18129C92872O001Q447J6936K2090L0492L8069O3442J09373J48264K07742K77019
18118A320747L74705M74066N37497N57390N38894N56703P75472J343220K293820
18109H772514L503374L633730o76304n055503m486480k360248j182969o35575
18101A512539l77128k32756j62071j23489q9167o3155n3737m4224k5997l2083
18091C08732k7456j9688k3578k8309k6289j5392j0487j0966j4252k1119j1284
18080I9912l806m968q735l434n722r109n063l290O556J0363m308k594m949k034
$$ y = [1605345, 1371842, 1169543, 1014524, 893776, 785957, 708962, 649773, 599790, 557955, 518831, 483041, 457907, 427976, 411421, 403208, 397117, 395502, 389344, 379591, 375661, 376882, 385173, 392872, 398873, 407320, 424256, 446346, 476838, 514907, 578349, 687722, 835986, 1043728, 1320747, 1695452, 2169518, 2707015, 3264405, 3803299, 4360002, 5135474, 6478694, 8772514, 12275888, 15909618, 15233314, 10177811, 5691331, 3331083, 2148114, 1512539, 1135411, 902655, 740584, 617095, 527928, 464773, 411036, 366812, 340815, 308732, 281276, 261588, 238010, 209701, 183412, 168020, 157533, 146567, 132315, 111196, 99912, 96106, 91138, 82403, 78969, 73247, 64138, 59075, 55785, 62341, 72704, 68396, 65802, 60853, 58819]
18066E8819m573q102k993K644J216J341M224r468j952l658J070J366J189R262
18052E0385J2032P430J9458K3816J9882N740k053k0170j8799p013J668l075r44
18039H8357n61p442q064n681o362p461J387p86q85q537j0291j215N701L066n06
18024D0720J471l888m454K103K113q01l698j717M823Q692K034j6386n479O13k300
18009B3846P21J353L343M321j781J525R315Q864K195m976R39n187o946K142L137
17994D2811l737q371K522J40q500k176m831M599M751M97k427K676K433J880n434
17979B6833n226o726n731l768l031J288P255P60k555M28M931j410M96K908m77
17964A5975j546q172q30O813M492n243q978j901K256M199L439m805k396J999l644
$$ y = [58819, 54246, 46144, 43151, 45795, 47011, 48352, 52576, 43108, 41156, 37498, 38568, 39934, 41123, 50385, 62417, 69847, 89305, 113121, 133003, 138743, 136690, 116520, 97721, 90708, 92376, 89301, 88357, 87796, 80354, 72290, 66609, 60247, 52786, 54173, 53387, 52502, 43965, 33674, 32459, 38160, 41226, 40720, 42191, 38303, 33849, 35952, 38065, 37264, 33566, 31849, 36672, 45364, 47398, 31012, 25533, 26146, 23846, 24567, 25920, 29263, 33584, 31803, 33328, 42643, 51507, 53702, 48726, 49665, 44478, 37532, 39674, 42811, 39074, 30703, 33225, 33365, 24865, 22689, 17858, 22457, 27208, 27705, 25278, 27954, 30387, 32267, 26833, 21607, 14881, 9150, 5382, 2351, 3639, 10894, 11654, 9099, 9527, 14458, 13048, 13544, 16452, 15975, 14429, 6257, 5427, 12240, 16732, 11489, 2511, 610, 2866, 7065, 10504, 5699, 3303, 5302, 1658]
17949A658o752n76J054N008N929L986M512J570J64J624n035r63N031M18l527m348
17933I753j22J964J547J028K011j239l877j105N754L203K058m13n54l855l551
17918A2602J213L469K034J568M400q19m472p876j1618J450k30J625O648k449r369
17903a824K037P900J276P471J0513n634q648J524L294L145l043o65p354L035J244
17888A4271L88K07n607r260M682K485K835j102l827l531K67J699K376M222J428
17873A1533p114o91J336n973j393J538O918m306j3934m538N863L91N797L467n732
17858f838l020K964K143N004K44k670l89j888J239k850m503L880N46J090O784
17843A736J613m681n965O627j033j52J230J283Q57N209k967o153P9n377L014O134
$$ y = [1658, -5094, -5670, -4616, 392, 6321, 10307, 14819, 16389, 16553, 18177, 13142, 12179, 17210, 17628, 14101, 9753, 9631, 11595, 13142, 14170, 16181, 14942, 11065, 9960, 15714, 18917, 20975, 20562, 20008, 16153, 12602, 13815, 17284, 19318, 20886, 25286, 24467, 19995, 12119, 501, 1951, 1721, 3346, 9994, 7545, -1824, 213, 8113, 9389, 16860, 27373, 21739, 13091, 14615, 17909, 21054, 18011, 17346, 9992, 13027, 14271, 14659, 14866, 9259, -1, 4681, 7166, 10001, 8899, 5072, 1541, 1808, 3507, 5883, 10105, 11533, 4419, 3728, 5064, -909, -2302, -764, 6154, 1848, -12086, -16624, -10761, -10370, -4573, -1106, -6838, -9858, -6894, -4751, 253, 497, -2173, -2562, -4450, -3211, -6061, -10564, -6684, -6138, -5048, 1736, 3349, -1332, -7297, -670, -1703, -1855, -625, 658, 1515, 6724, 3757, -2396, -2317, -7694, -4680, 1454]
17827A454m19j979K107M603k294q359L088N208O582o284j514J138J197J872j036
17812E364r703L96j652K184R28j0027J348M579J608J611l618n579m450K602N237
17797i172K253l182j845m091R693O081L163j524M789N118k955j017j66q22k437
17782C886M940j759n839m707k445k636O85M470n920J944K184K985n073o43K658
17767e270N003o36o158l636J85l143l429O20M283k039K39J370l29l172O46L902
17751a1564O05J12N468M47j441q87J719M613k312L075K566J816r49j635n682k746
17735f795O284K76M520L425L287j065L092m391o106R8n178l017O482N932k463
17720D381k719p843n071P356O602L330j437j767j814P78k96l723Q43q40J254j731
$$ y = [1454, 1035, -944, 1163, 5766, 3472, -4887, -1799, 3409, 9991, 3707, 2193, 3331, 4528, 6400, 5364, -4339, -3943, -5595, -3411, -2483, -12510, -11162, -6583, -4975, -3364, -6982, -12561, -17011, -14409, -9172, -6919, -10101, -11946, -16037, -6344, -263, 2900, 1376, 6165, 11283, 8328, 7311, 7145, 6323, 3886, 8826, 7067, 1228, -3479, -5924, -8560, -7875, -3405, -9325, -7381, -5197, -2212, -7285, -7928, -5270, -267, -903, -7061, -10697, -10512, -13655, -17084, -16464, -12181, -14220, -13981, -12611, -12940, -16112, -15466, -11564, -10959, -10847, -5379, -4932, -6373, -7260, -5541, -928, -3240, -165, 2401, 4217, 3268, 1633, -4049, -6795, -511, -235, 4285, 7710, 10997, 9932, 13024, 8633, 2527, 2625, -2553, -5570, 912, 6844, 4381, 1662, -6181, -11252, -3896, 2706, 6036, 4599, 2832, 1018, 1796, 1500, -2223, -1380, -2220, -966, -2697]
17704b697L64K169J463J349L312l206o508n158K64O633Q739r2p623m231N719K432
17688B929l062M007P142j535o055p794J293q80o741l446K078P552O463Rn96M837
17672F201M219o994K210L620l930j366K301l029j788q034j577l568M73k28J955
17657i535K082q072n759P595P980M67l4K538N110P653j652k204q61j911N392l668
17641E121j1535j729k810j92P256k68j869l287q293R958R265j367r69k582O339
17626C038L070n021r452J0408J269k855J854l934m96r48m1R48j914l713L145J322
17610c320M779N936N087R81l037n665K122k036m703L865k576J283K742o252n392
17595f186K327r10K605j14j520N54N0j461J106N309O025l33l448M742P954L258
$$ y = [-2697, -2333, -164, 1299, 2648, 5960, 2754, -3754, -8912, -8648, -2015, 6724, 6632, -991, -5222, 497, 2929, -133, 3874, 11016, 9481, 3426, -4368, -3075, -3955, -10696, -14142, -12064, -4512, 1951, 1960, 1364, 6201, 10420, 3426, 5636, 9256, 5326, 3960, 6261, 3232, 1444, -6590, -8167, -11735, -11262, -11490, -9535, -7453, -15525, -21284, -13689, -5709, -5242, -5276, -2738, 2372, 10025, 8373, 6169, 5308, 3397, 8789, 5121, -6414, -8143, -10953, -11145, -3889, -4157, -6026, -9313, -17606, -7648, 1617, 250, -719, -3301, 3038, 6108, 1087, -8365, 2043, 3312, 457, 2311, -1623, -2119, -3067, -3108, -2160, -4074, -7787, -4642, -3320, 1459, 7395, 12482, 13463, 10426, 4761, 6883, 4847, 144, 4009, 1433, 2716, 5458, -794, -6186, -3859, -4769, -2164, -2278, -3798, -3244, -3194, -4655, -3549, 1760, 7785, 7452, 4004, 8746, 16700, 19958]
17579A9958Q689O075J8303J9614L2439M6879N8245P1724P3318O3090M4382P898
17567D70614k8566n9528p6363q3470p3152m4349l3567k4267j5006j0722j342K471
17555B2753j765m104j475O843K993n561n896n773m285m474o86P217O686n42j969
17540I962o023n609l874K783J209K854m193m54Q387p789k194j986Q20O036l704
17525c775j250P96n632k37k067K150N516O024Q41J952k766r20k057m105Q207O198
17509H875L112j927M782J914l045k308J547n438n918k513r04m9R01j685K523L40
17493B07K298m021m912M383m633J970k990j989J243K992j52K939j323L733N631
17478E376M82J388L88j613k889m373p121m359n55K097M65Q50q933m867P967O864
$$ y = [19958, 28647, 34722, 53025, 72639, 105078, 151957, 210202, 281926, 355244, 418334, 462716, 470614, 442048, 382520, 306157, 222687, 149535, 105186, 71619, 47352, 32346, 21624, 20282, 22753, 20988, 16884, 15409, 22252, 25245, 19684, 13788, 8015, 3730, -744, -1430, 5787, 12473, 11931, 9962, 3939, -1670, -5544, -2761, -1552, 1302, -2891, -3345, 5042, -2747, -4941, -6927, -6107, -71, -3775, -5025, -4229, -9861, -10098, -12165, -10015, -4499, 1525, 2366, 4318, 1552, 632, -1425, -5530, 2677, 8875, 11987, 10060, 14842, 16756, 13711, 11403, 12950, 7512, 1594, -919, -1823, -1872, -971, -2656, -133, 207, 2505, -1516, -6428, -2045, -6678, -4708, -7698, -9687, -8444, -5452, -5604, -2665, -3988, -255, 5376, 5858, 7246, 7634, 6021, 3132, -1241, -8362, -12721, -13276, -11179, -10714, -9864, -18797, -23664, -15697, -8833]
17462h833N111K659p07K171l380l766m079N53l835K671O44J748j440Q320Q922
17447F759N18o193k304J3918K1357K9700J9864j660k9966k2400j4830j2772j086
17434I05M955M001q42o736L118J1516k212r657O838p62o241N253M901R573J9423
17419D4033R593q995j5312r649n324m759m520j05l495Q77K388n254j665k033j780
17404f000L75o46K070k498j985P270P615j127m349L085n782M530M707o849J804
17389B220k283L899p746j3266K656n01N796J0334n18m782k109L169N056J720J38
17374C783L617M498q150n810L36O809P895K954J658k224n343J677K35p755n025
17359h45L654j240o838k402R033O589J760o686k878R98J69N995K717M107k685
$$ y = [-8833, -3722, -1063, -1770, 401, -2979, -6745, -10824, -10271, -14106, -11435, -10791, -9043, -10483, -2163, 6759, 7277, 1084, -1220, 12698, 34055, 63755, 83619, 81959, 51993, 29593, 14763, 1991, 905, 5860, 9861, 9019, 2283, 5401, 16917, 14705, 5048, 11886, 11124, 4883, 10136, 15037, 24610, 44033, 53626, 44631, 29319, 19670, 14346, 9587, 5067, 4962, 1467, 2344, 4732, -522, -2187, -4220, -6000, -5625, -6271, -4201, -6699, -8684, -1414, 6201, 5074, 725, 3810, -1972, 2558, 7265, 416, 2220, -63, 3836, -3910, -17176, -14520, -15021, -9225, 1109, 591, -4191, -6300, -3131, 1925, 3645, 3783, 7400, 11898, 3748, -2062, -1726, 5083, 12978, 15932, 17590, 15366, 10023, 11700, 11935, 4180, -845, 2809, 1569, -5269, -7671, 1362, 7951, 9711, 3025, 147, 1145, 1314, 7309, 10026, 14133, 11448]
17344A1448r92n116r09j974J650k726n810M593M445q951o045K542M715O134K787
17329E791K476L162o533J268P450Q292l138m559m949q420J405K322l819O080l376
17314C452L371R253K453n64J958m217l901M9m575k403n347j751R397P853m141
17299A0887M97K59L436m41n977l7L273k041k804q10L654M160l258r08l287K962
17283I565J31n812m78M195j716L624R831j868n912K694L882k834j038J255j796
17268A3723p718k308K986N327N177J473L368K909m08N85J85j386K921q278l006
17253A5550O568K008p06j820l190r13K373Q092J712o876j1865O26R360O378K860
17238C0157n440n357M179N540m403P58j382q749j2781m440J197P234M983O665
$$ y = [11448, 10456, 5340, 4431, 2457, 4107, 1381, -4429, 164, 4609, -4342, -10387, -7845, -3130, 3004, 5791, 8267, 11429, 4896, 6164, 13614, 21906, 18768, 14209, 9260, 840, 2245, 4567, 748, 6828, 3452, 6823, 16076, 18529, 17965, 19923, 15706, 11805, 11854, 7279, 4876, -471, -2222, 7175, 15028, 10887, 11384, 11643, 15079, 14638, 8661, 8624, 11897, 9856, 7052, 6242, 9896, 14056, 10798, 9890, 6603, 9565, 9696, 3884, 3406, 7601, 5885, 9509, 19340, 17472, 11560, 14254, 18136, 15302, 14264, 15519, 13723, 6005, 3697, 6683, 12010, 17187, 18660, 22028, 24937, 24529, 25114, 25299, 23913, 26834, 18556, 15550, 22118, 24126, 23420, 21600, 18410, 17497, 19870, 27962, 29674, 22798, 10933, 11559, 20919, 27297, 30157, 24717, 19360, 23539, 29079, 24676, 25434, 24052, 15303, 2522, -1918, -721, 6513, 11496, 18161]
17224A8161J341k243j931n157n102M003L637J564k158K158L832K55k110k121r56
17209A3173R45M732K656L316l148l811Q32j435%M85K92N089K031o299m346m955
17193I557N09K09K5J263k258K363k202k685O73l782k388L531P612l302p642k557
17177a074J317R164m05L400K132m928k924M42j342N842L811l36o388O15N013q49
17161A3490q564P62L583j256L358j873m621k238M652J040m30n063K689O023K275
17146A3827K715n78j0324k324O669L260K834n318j0397q068K868R841N83O983
17132A2571K80q338q569P733N178k512n951Q17J957k740L220M90l071k239k677
17117c851J109K625J379M692O008o100j174J824j595p107l34M744n395J333k452
$$ y = [18161, 19502, 17259, 15328, 10171, 5069, 9072, 12709, 14273, 12115, 14273, 18105, 18360, 16250, 14129, 13173, 14118, 18850, 21506, 24822, 21674, 17863, 18695, 17260, 17260, 17745, 18037, 23126, 25157, 18858, 14512, 9557, 10066, 10275, 10300, 11563, 9305, 11668, 9466, 6781, 7454, 3672, 1284, 4815, 12427, 9125, 1483, -1074, 243, 9407, 9002, 12402, 14534, 9606, 6682, 7124, 5782, 11624, 15435, 15099, 8711, 9326, 14339, 13490, 4926, 5688, 9271, 8015, 11373, 9500, 4879, 2641, 7293, 8333, 7903, 2840, 5529, 11552, 13827, 16542, 15964, 5640, 3316, 9985, 13245, 16079, 10761, 364, -7704, -4836, 5005, 5588, 12571, 12851, 4513, -4056, 3677, 8855, 6343, 392, 1209, 3166, 426, 3646, 4136, 1065, -1174, -3851, -2742, -117, 1262, 5954, 11962, 5862, 4688, 6512, 4917, -2190, -2524, 2220, -3175, -1842, -4294]
17102d294n233j526J564o175m146R475R482N989k67q56K885k296j203q73L979
17087F505m054q296j465L788L338j253n291j108K525O232N383Q5n393L347r07
17072C436n003n708N601J962o889m400M581P15j911j433l33K13P526K256p675
17057g062M709r40L0J822k703k31L288L924l976N466m24l667q45L835j13k535
17041E78J859j338k796q093j322P21k94M975n75q31Q01N209P377m55k551O49P95
17024D709K095m503p253o16Q614J93k861K436K300n259L27M871k503n843m992
17009h285l602J997L238K259L664K090K599o373o102R182J888m23N469J0333k485
16994A5449q340o187k179j0440m95J393M554J573j052L064N550j837L065J567
$$ y = [-4294, -9527, -11053, -9489, -15664, -19810, -10335, -853, 5136, 4869, 4013, 6898, 4602, 3399, 2526, 6505, 2451, -5845, -7310, -3522, -184, -1437, -6728, -7836, -5311, 921, 6304, 6389, 996, 4343, 3436, -1567, -7275, -1674, 288, -6601, -11001, -6420, -5705, -7616, -9049, -9382, -9169, -1643, 613, -7062, -2353, -3293, -3263, -1441, -4144, -4375, -1087, 2837, -1139, 4327, 3903, 236, -609, 3226, 3113, 578, 2437, 1099, -1697, -9790, -11112, -10391, -10685, -5710, -6285, -7116, -6315, -1106, 6271, 5816, 3265, 3914, 4709, 6804, 2301, -4952, -5568, 3046, 3239, 378, 2814, 5114, -145, 182, 5053, 2550, -3293, -8285, -11887, -9890, -6652, -4393, -729, 1361, 3960, -2413, -8515, 667, 2555, 2132, 7601, 17934, 15449, 7109, 922, -1257, -11697, -12192, -10799, -6245, -4672, -5724, -2660, 2890, 1053, 4118, 5685]
16980E685p13K244m937m596r69n6l526k249p07P747M021j560o94O062P012L277
16964A6041J1513Q438Q090J2200K152j1745j2345j4529j2724n356P725K308k504
16951I264k175l494j525j665k564N388k589k030J246k392p778k30l82j486l90
16936a2802M860K808N79n828j2456K592P948R447k602l719J680M822J655N185
16922D169j807m375j447l887k017J181q34j35J285L414L495N76L853k009M478
16907E940J431j131l435o053m266J200p796L711Q95K925k797k385P154L524K941
16892A858L942p039K302N68n88j334o134j294p443m284Q288N552O348n204J27
16877d335l957l797j464K310r65M431K938N24n649l911K847P777N12p967k431
$$ y = [5685, 4972, 7216, 2279, -2317, -3286, -3342, -6868, -9117, -9824, -2077, 1944, 384, -310, 5752, 12764, 16041, 27554, 35992, 44082, 56282, 58434, 46689, 34344, 19815, 7091, 1735, 9460, 11768, 9264, 7089, 3595, 2070, 405, -2159, 3229, 640, -1390, -144, -2536, -10314, -10544, -10926, -12412, -12802, -7942, -5134, -4555, -10383, -22839, -20247, -12299, -2852, -5454, -9173, -7493, -2671, -1016, 4169, 2362, -2013, -3460, -7347, -9364, -8183, -9017, -9152, -7867, -4453, -958, -382, 3471, 1462, 5940, 7371, 6240, 2805, -3248, -7514, -6314, -14110, -10399, -9504, -6579, -9376, -11761, -4607, -1083, 1858, 5800, -1239, 1063, 1631, 1043, -291, -6425, -7719, -15162, -19446, -11158, -5606, 742, -4462, -4335, -8292, -12089, -13553, -11243, -12208, -7777, -4839, -4315, -9964, -13875, -11028, -3251, -2739, -10706, -13137]
16862a3137l984N072N979M232N190l116j0908j345M252j73J060K598j147J300
16848d127K053l318J935L277p46L992K121j109q086q924n581k080N89N713Q56
16833a3435N81o77q61L402N215J37M460L322k5l379N51K27l035m325J100k542
16817i284l180K573R767R552m542j2870j5857o173J3724P327N883n494r782J3
16803a8343q02L950O876J1200k038k842n499J093l728n795K388Q954P734k017
16789A131l793o45K5l292j600N473L571m259o698k805O482Q093J643p899k671
16774g244Q61m785l22j57m060j478L787N654j329L123R045q447r267l500J148
16759a6971M363N448J641l436j623K590l687j196N173k46p28l316N607o32p278
$$ y = [-13137, -17121, -12049, -6070, -1838, 3352, 236, -10672, -12017, -7765, -7938, -6878, -4280, -5427, -4127, -2074, -5392, -3457, -180, -926, 3066, 5187, 4078, -4008, -12932, -18513, -20593, -20004, -14291, -13435, -12854, -13531, -14392, -10990, -5775, -5638, -1178, 2144, 2119, -1260, -709, -482, -3517, -7842, -6742, -9284, -12464, -9891, -124, 9428, 4886, -7984, -23841, -30014, -16290, -8963, -3080, -8574, -18356, -18343, -19145, -15195, -8319, 2881, 843, -1999, -7498, -6405, -10133, -15928, -13540, -4586, 3148, 1131, -2662, -3307, -3282, -6574, -8174, -2701, 870, -3389, -10087, -12892, -6410, 1683, 3326, -4573, -7244, -6383, -11168, -11490, -11647, -15707, -17185, -13398, -7744, -9073, -5950, 3095, -5352, -14619, -18119, -16971, -12608, -7160, -5519, -8955, -10578, -7988, -11675, -12871, -7698, -7944, -8672, -11988, -6381, -7013, -14291]
16744a4291L16r37J3L453Q901M131l250o763n579L80P755L89N68L959K578k013
16728c90K071o983m212M589k897J659K003j135k738Q033k622l515o636J704p53
16713a1822M739m152l00l394k710N444O307J4857K536n557L52k88p541k813k102
16698f444m55K622O52l094k234M632M422K592K57J386l8j881k429o184N4J866
16682d276K16k877p984J433N275P48Q695N684J131m189p417j422J069K478l821
16667e257o214j904k418l444Q155N148L560P954R51n723l051J687N467L325k191
16652F045n333k840J396m013r003Q59O722K428n345k952M240M36L820J069l675
16637f146m654l051l529L063N930M894J890o173L679K433K95n300k917L004N215
$$ y = [-14291, -13975, -14912, -14899, -11446, -2545, 1586, -1664, -8427, -14006, -13626, -5871, -5482, -4914, -955, 1623, -390, 1681, -5302, -9514, -4925, -7822, -6163, -4160, -5295, -8033, 0, -2622, -6137, -12773, -11069, -11822, -7083, -11235, -11535, -14929, -17639, -12195, -5888, 8969, 11505, 5948, 6300, 6012, -1529, -4342, -6444, -6899, -4277, -3625, -6719, -8953, -4321, 101, 2693, 2950, 4336, 4298, 2417, -12, -6196, -6142, -4276, -4060, -6937, -14921, -13488, -8213, -7465, 1230, 6914, 8045, 3856, -3561, -4983, -3914, -1436, -5257, -11471, -13375, -15793, -19237, -11082, -5934, -2374, 5580, 6531, 808, -2243, -556, 4911, 8236, 6045, 712, -2128, -732, -4745, -13748, -12889, -6167, -3739, -9084, -12036, -7796, -7360, -3540, -2471, -6146, -10800, -13851, -17380, -14317, -8387, -3493, -1603, -7776, -4097, -1664, -1369, -6669, -9586, -6582, -1367]
16622a367J378J061j734p75j952L294p492n263K404M507j102n673k112K301J987
16607a0538P906q84K93l659O44K692K472P002l751p594m401o14J093M051m8R19
16591d417n64P741P92r480o784l084K054k625J975M788P27j202N17m181m326j570
16575a9639N122M108n245l140L212O120J237k5O925M371l460q041j2729k206O971
16560a6419Q493M435L679M755r40o535M72J0769M777j073p46n936m680j582Q58
16545C27L120j077K975L299n134O36J7o590k682P47n618n060O3J27j2l261o59
16528a8782M875M88l228k64M996O449M06l79k091L417K654Q957k348m328p167
16513f345k088n46l648J953l290K332j238L232l50k295K215M848M764l10k585
$$ y = [-1367, 11, 1072, -662, -1437, -3389, -95, -7587, -12850, -10446, -5939, -7041, -12714, -14826, -12525, -10538, -2632, -3516, -3223, -6882, -6238, -3546, -1074, 5928, 2177, -5417, -9818, -10432, -9339, -5288, -5336, -4417, -4981, 2760, 3552, -5928, -12712, -15796, -13742, -16367, -14392, -9604, -8877, -10079, -9562, -13743, -18069, -19639, -14517, -10409, -15654, -18794, -15582, -9462, -8225, -8250, -1325, 3046, -414, -8455, -21184, -23390, -16419, -7926, -3491, 188, 4943, 4003, -2532, -2060, 8709, 13486, 12413, 11667, 5731, 1051, -531, 327, 3447, 2370, 5345, 8644, 3510, 4146, 4163, -2427, -5109, -4362, -9980, -15040, -14977, -14850, -14862, -18123, -18782, -13907, -13419, -16647, -16911, -11915, -5466, -5060, -5439, -7530, -4113, -1459, 7498, 5150, 822, -6345, -8433, -8979, -12627, -10674, -13964, -11632, -12870, -9638, -9988, -12283, -10068, -5220, -456, -766, -3351]
16498c351p009k300m194M446q66N836P456N319J39m895k649k223L9p838O99P035
16482d356Q088k531J455n914o56n61m09N245J394k376J028k131K280M815l2o989
16466a650k396j852J670j286j985k822J92Q363K175K8P24l724k7K104J613l744
16450b617k485j597L949k88N17N105R80q017k340n027N173P749k597q85j17l526
16434f023J400jo159M881L318N490m608J311J357M51K474M038n813o776k215P800
16418I25j624q12O411K317l628j765K566L835r41m055j801M32j740l111L815k98
16402E26L144k692M161N612J335o797K261l908J635k766q43L125l918o450K316
16387c259l384m786M148P746L450M704o903K171l54j543k327J769N602J207p161
$$ y = [-3351, -10360, -12660, -16854, -12408, -13274, -7438, 18, 5337, 5476, 581, -2068, -4291, -4252, -12090, -11391, -4356, 3732, 1201, 2656, -3258, -3914, -4475, -4884, 361, 1755, -621, 407, -1724, 556, 5371, 5339, -1650, -4046, -5898, -4228, -5514, -7499, -10321, -10129, -1766, 409, 437, 1161, -2563, -2590, -486, 1127, -2617, -5102, -6699, -2750, -3038, -2521, 2584, 3564, -4453, -6793, -11820, -6647, 1102, -1495, -2380, -2497, -6023, -4623, -4624, -10783, -5902, -2584, 2906, -1702, -391, 966, 1417, 3891, 7929, 2116, -4660, -6875, 925, -699, -1511, 4900, 7217, 3589, 1824, 4390, 8225, 7284, 3229, 1428, 1860, 120, -2991, 824, 526, 3670, 978, 5139, 10751, 12086, 5289, 7550, 3642, 5277, 2511, 1668, 4793, 875, -5575, -3259, -6643, -11429, -7281, 465, 3915, 8619, 1716, 3887, 3533, 1990, -337, 1432, 7034, 8241, 1080]
16372A080N202J9j863l363r22O000J341P068l542q707o476l167Q911L179L83M836
16356I979j566p864n776P0N72L985l515n127K005N699M81m438n62M214O60N507
16340D324J3352q210o319O222K991J389r279q135l474N437N988l83L33M492n624
16325C104k812K257J52k206l625K135N562l739L168L412L11K868q206n315K736
16310a98n442j108N561p43p707J1005P055O25j0003j283Q60L644k967m403J89
16295d915J442J830j666k635q159r74J927R616N022J236m418Q35J464J549P01
16280B855k060p434o024L627L173P189Q167j079l438j744n750k985K643N287n726
16265c299j0470M461Q042p326L928O074K848m933p314p969O352Q76l73q88P982
$$ y = [1080, 6282, 6301, 4438, 1075, 153, 6153, 7494, 14562, 11020, 2313, -4163, -7330, 1581, 4760, 5143, 9979, 8413, 549, -5227, -5157, -4585, -600, -4115, -9242, -7237, -1538, -1057, -5495, -6057, -1843, -1183, 4324, 17676, 9466, 3147, 9369, 12360, 13749, 4470, -3665, -7139, -1702, 4286, 3903, 4236, 8728, 3104, 292, 2549, 2701, 495, -3130, -995, 4567, 828, 3996, 7408, 7719, 10587, 2381, -2934, -198, -5640, -6748, -1187, -1930, -9637, 1368, 8423, 9048, -955, -2238, -1378, 2266, -701, -5104, -4915, -3473, -1643, -3309, -5944, -14103, -15077, -13150, -3534, 1488, 2724, -1694, -859, 605, 2154, 2855, 795, -6639, -12663, -9036, -5863, 1326, 9493, 8414, 4976, 3232, -2518, -5503, -2860, 2427, -3299, -13769, -9308, -1266, -8592, -4664, 1410, 4258, -675, -7989, -15958, -9606, -8730, -9103, -9991, -2009]
16250b009J171l187l589K239K974J990k818K466K482o22m567K347M765L261m350
16235B553m241j078M26n584J385O872J712M692K353L376p741l517K909K998K92
16220G407p295p232k800m939R232J0346L366l959o593K968O048l59o234l208L311
16205E9N037J508m867L007M094o316l693j79r60n001l447j670R49k34J945L807
16189e961M027J86m877J299k586j815l817l04P329K482o333R53M020k340n78k060
16173a0375l002L608M393O22N61m734k038R055K644k057m893m355L76L668P661
16158A134J175J274m89P71N67n427o984m060J238P033J705q91L406k810m153J223
16142e288k749J714m003p703N344Q236K416n047l079J089M018K240m338k081L639
$$ y = [-2009, -838, -4025, -7614, -5375, -2401, -411, -3229, -763, 1719, 1097, -3470, -1123, 3642, 6903, 2553, -1688, -2766, -2340, -7924, -6539, 333, 2045, 6737, 9090, 12466, 4725, 1208, 4117, 7115, 7407, 112, -7120, -9920, -14859, -5627, 4719, 8085, 4126, -2467, 501, 6549, 6190, -44, -3252, 59, 5096, 6604, 1737, 4744, 8838, 2522, -1171, -1350, -2310, -7311, -10758, -12428, -11479, -11713, -9768, -5961, -1934, -1748, -6625, -5326, -7912, -9727, -13544, -13848, -6519, -4037, -10370, -9417, -5397, -7737, -8315, -10375, -13377, -9769, -5376, -4754, -4193, -8927, -10965, -1910, 734, -1323, -6216, -10571, -10195, -6527, 1134, 2309, 3583, 3094, 3865, 4432, -995, -7979, -12039, -10801, -3768, -2063, -2954, 452, -2358, -6511, -5288, -8037, -6323, -10326, -18029, -12685, -4449, -2033, -7080, -10159, -9070, -5052, -2812, -7150, -9231, -5592]
16127e592j814N624k797p057K999J1779J595l780l373L440k585l093n990k991
16113a3635Q47M074R259j528q719j059P81L029l199n375N135L711K518l042L543
16098c660L595N257M358m37j669r559K981K1J453k162l085P76m897j517l263l422
16082a5230N342J1202L183n148o430K414n981r508O981P209k638p48N516P11j043
16067d168J687q95n44n883o399q41P590l87J743j878J836m51k591O290K786M207
16051B102j584n106q85N768O127L217n958m533o989k779N459K272k016j006r01
16036f812L4n900l682m97O742L874J677k824K028M131K392j842j489P379R1j0553
16020e251j395Q387p93o057J694K588o0J132k817k94N64K430k562k952j618l117
$$ y = [-5592, -7406, -1782, -4579, -11636, -8637, 3142, 4737, 957, -2416, 1024, -1561, -4654, -10644, -13635, -12788, -8714, 545, -983, -9702, -10761, -9980, -6951, -10150, -15525, -10390, -6679, -4161, -7203, -3660, -65, 5192, 9550, 9113, 7444, -2115, 866, 887, 2340, 178, -2907, -2131, -7028, -8545, -11808, -15230, -9888, 1314, 4497, -651, -7081, -4667, -10648, -20156, -13175, -5966, -8604, -9352, -3836, -3125, -4168, -2481, -3376, -3920, -9803, -16202, -17043, -9453, -9840, -8097, -9975, -8139, -8590, -11181, -4891, -2105, 2102, 518, -4588, -5473, 295, 6422, 9639, 3681, -852, -7841, -10620, -5161, -2889, -4905, -5911, -6812, -6778, -12678, -16360, -16857, -10115, -6241, -4564, -7388, -5360, -1229, 1163, -679, -2168, 5211, 5302, -5251, -6646, 1741, 948, -5109, -3415, -827, -887, 245, -2572, -2866, -2302, 128, -2434, -5386, -7004, -10121]
16004a0121m136L833q05N808k323k40k051k134p53L281l652l934K348O657M847
15989c375o084Q2m245K53k833K447O766n4j664n399o155O360n754m988J144R831
15973a3668P333o38R504N241r080n429J079k66o622K633L175J301K354K285L498
15958B700m649p153l856j532N368L427j253K38k069k470k567L770P884p00l701
15943f563K722j41j646L226L122k346o869J880N68M96k352J654r0l255n028p98
15927a5420R53k69R11L401L416R47K914Q87n510M807K410R40l906l327k701R78
15911h569L12P3M528O849K921L87o59l896J922m620k147J432r58j693K322l151
15895d947k507Q111K073k936K12J341n593o457n101j666J69Q212O058M573n638
$$ y = [-10121, -14257, -10424, -11229, -5421, -7744, -7984, -10035, -12169, -12922, -9641, -13293, -17227, -14879, -8222, -3375, -9459, -9377, -13622, -13369, -16202, -13755, -6989, -7043, -8707, -14106, -20261, -13901, -19655, -24643, -23499, -13668, -6335, -6973, 2531, 7772, -1308, -6737, -5658, -5924, -12546, -9913, -6738, -5437, -3083, -798, 2700, -1949, -9102, -12958, -14490, -9122, -5695, -6948, -6710, -8779, -11249, -13816, -10046, -2162, -2862, -6563, -3841, -3982, -5628, -2402, 720, -1626, -8495, -6615, -6047, -5551, -7903, -6249, -6339, -9594, -14622, -15420, -14467, -14736, -13825, -10424, -7008, -6061, -3147, -2260, -7770, -2963, -553, 387, -3519, -6846, -9547, -8569, -8257, -8184, -3656, 3193, 6114, 6501, 5842, 1946, 3868, -752, -2899, -1467, -2425, -4118, -1796, -4947, -7454, 657, 2730, -206, 6, 1347, -4246, -10703, -15804, -17470, -17301, -9089, -3031, 1542, -4096]
15880d096j674k813n387m151N662J323J298K140K309M115l468r526L160L273L348
15865d487N42r575j78j9j673M71J500J345L92j372J845L501J715m29j727O602
15849a547J405N42J823n347l434m16M45N6J377K298m906O173M244l596k767p24
15833d374o896k654O206O254K785j4221l302P42O150J330k120o73j455N370K766
15818d092q19N03k217P043k482m476K493l366M53L756P007k186m815j444N352
15803G10K117j58k776M62j465R98k88K471k933l549K278q19M437M82k940l681
15787d654J042N476K640P39N656l289l696L259o562p603N744K953l836k459m23
15772e013P52n778k67K567K137n68k371p52J67P043M447o033j106l391P56M729
$$ y = [-4096, -5770, -8583, -13970, -18121, -12459, -11136, -9838, -7698, -5389, -1274, -4742, -14268, -11108, -7835, -4487, -3945, -13520, -13698, -13717, -15390, -14919, -13419, -12074, -11682, -13054, -11209, -7708, -5993, -6422, -8149, -1547, -142, 400, 2223, -3124, -6558, -6974, -6529, -6473, -5096, -2798, -7704, -1531, 2713, -883, -3650, -4374, -11270, -13924, -7718, -1464, 1321, -12900, -16202, -15460, -9310, -7980, -10100, -10773, -12228, -6858, -4092, -4911, -4408, -6625, 418, -2064, -6540, -4047, -7413, -6960, -3204, 3803, 1617, -3198, -4642, 710, 2827, 2669, -107, 355, -1110, -112, -400, 2071, -862, -4411, -2133, -2952, 1485, 1967, -973, -4654, -3612, 1864, 4504, 5243, 10899, 7610, 3914, 7173, 611, -6992, -1248, 1705, -2131, -4590, -5013, -4261, -10039, -10306, -7739, -5602, -6170, -8541, -9293, -9126, -2083, 2364, -3669, -4775, -8166, -7410, -2681]
15756b681L840k125J819L058j376k404M040k075k797k625k619n034N246M986M709
15741C962L031J006p730o816M118K666l402n76L142m503M69o634o059R959O762
15726f05P540K782J505N84p385k17k785J004M02L344k660q460l224j187j034N995
15710d401m045K226L142m595o327J199N143K087j728O56J756L277l148j818M092
15695b484Q896K230l715m286o869P92L550L509m140m707K045q09m809L281J37
15680g379q621l455R170L184K842R22r908L179O653j498O691M881n12n079o685
15665e615K642p44l07J348o640o86L074o10n93M532L870K713r9j536k754p59j217
15648c381O61K218n168r176J293Q425O285j996m301K514N294J616m467o184j352
$$ y = [-2681, 1159, -966, 853, 3911, 2535, 131, 4171, 2096, -701, -3326, -5945, -10979, -5733, -747, 3962, 6993, 7999, 269, -6547, -2429, 237, -3165, -3741, -599, -5102, -4633, -11267, -17326, -7367, -605, 6935, 9717, 11222, 11806, 4421, 4204, 1419, 2423, 2825, 6169, 3509, -4951, -8175, -9362, -10396, -4401, -8446, -6220, -3078, -7673, -14000, -12801, -7658, -5571, -7299, -6643, -4887, -1610, -4758, -6576, -2484, 6412, 8642, 4927, 641, -6228, -5436, -1886, 1623, -2517, -7224, -5179, -5988, -10797, -7516, -7379, -16000, -19455, -10285, -7101, -4259, -3337, -13245, -10066, -3413, -4911, 1780, 6661, 6149, 1070, -5615, -2973, -3717, -4024, -2676, -9316, -10002, -6928, -7538, -8131, -3599, 271, 2984, 2885, 1349, -1405, -2164, -3381, -2720, -502, -5670, -14846, -13553, -5128, 1157, -839, -5140, -2626, 2668, 4284, -183, -6367, -7719]
15633g719O555J849k034o849N230J581L855l06M437m473j123o557j519m16L554
15618c935j804J73K928J168o432M083L488m296r24O389P967L401n207j394p508
15603a903q185l304J2441P242j575R13j12J648j518l151l758M44M008l619p496
15588g925J295r674j597K715O779N748J036M57l04L106M636R481j869r202n678
15573i96o00J34k107O186P66J2m241o38M823Q259N492r900n519K161k505k300
15557i73O975N245j222l9k501k791o683l682Q127M468m162Q97J390l085q603j216
15541g855K277J141J1989R146k746p309j1441j728l0k238o020M186M437l836O838
15526c189M108M684j656J381j644p904k809o841Q316K087j055O45j909l5K211
$$ y = [-7719, -1164, 685, -1349, -8198, -2968, -1387, 2468, 2162, 6599, 2126, 1003, -5554, -7073, -7489, -3935, -5739, -5566, -2638, -1470, -7902, -3819, -331, -4627, -5551, 838, 8805, 12206, 6999, 5605, -1903, -10088, -13392, -951, 6291, 4716, 5629, 5517, 7165, 5647, 2496, -1262, -818, 3190, -429, -7925, -6630, -16304, -17901, -15186, -8407, -2659, -1623, -1166, -1470, 1636, 6272, 15753, 13884, 4682, -996, -1596, -1462, -3569, 2617, 3383, 3395, -846, -1484, 3339, 11598, 17090, 7190, 1671, 3832, 1327, -973, 6002, 11247, 10025, 9986, 7485, 4694, -1989, -5671, 2456, 6924, 2762, 3659, 5049, 1964, -6639, -7855, -5578, -4437, 7552, 16698, 13952, 6643, -4798, -6526, -6556, -8794, -14814, -10628, -6191, -10027, -3189, 919, 5603, 3947, 5328, 3684, -4220, -7029, -13870, -5554, -3467, -4522, -3877, -5786, -5821, -3610]
15511c610N757m1M958K715m612l674j352J105o201n959N975Q236L120J331M262
15496A2010j77J579J394o170k971K458r26m464P807m237q647M952L218o433k440
15481c047P380j082q54m635l428L839O251L433l423o700N635M093m253j941j521
15466b53P567J907j936m710K696R372M846k833n550l953j629j003r35k332J384
15451B638L21l706N011j046L675R403L166j919q2m385m599l071J009N094o504
15436E005p04K337L427L00n695o35k215k322P542L298l762L397P582k153j247
15421A4155k878J254J151M492J796J000m413m533m634M589m5K228J901m62N410
15406B1011P21O91Q96K587l831m425q096m163J0925P672l861j160O26M587m102
$$ y = [-3610, 2147, 2106, 7064, 9779, 5167, 1493, 141, 1246, -4955, -10914, -4939, 3297, 6417, 7748, 12010, 11833, 13412, 14806, 8636, 5665, 8123, 7197, 2733, 10540, 6303, -2344, 2608, 5826, -607, -3047, 4333, 3251, 2397, -2238, -5666, -1827, 4424, 7857, 4434, -2266, 3369, 7462, 3209, 1268, -253, 7314, 9221, 7285, 2575, 5271, 14643, 19489, 16656, 11106, 7153, 5524, 4521, 3586, 1254, 2638, 2959, -747, 4264, 3218, 6893, 16296, 19462, 17543, 17461, 13076, 8477, 5406, 6415, 11509, 5005, 4301, 6638, 10065, 10365, 4670, 4035, 1820, -502, 7040, 10338, 6576, 9973, 17555, 15402, 14155, 11277, 12531, 13682, 18174, 19970, 20970, 16557, 12024, 7390, 11979, 11934, 14162, 16063, 15601, 21011, 21732, 22423, 23319, 25906, 22075, 17650, 9554, 5391, 16316, 23988, 20127, 18967, 19593, 24180, 20078]
15391B0078o12J400K15N072O75n432l95k094M38J686J254k7L84L322j663r486
15375A4815n390K652L861L780K196M358N696k268j262n157q903k077P918J802
15361B2021p749J3N566Q05L43J942r29l848n74j606Q24L344N616N77m001j42M655
15344B6857L020j239P04j884q683l692L549k418L172m405K390m00N37J382q465
15329A0425J177j536n63O048j450p11l242P576J1746O674k759k32q069q764m181
15314A2139J067j218l994O78O25j706M072L705K29m568K59M415J300k574n934
15299H495r380l733M341N374L906m19n021J764L285j782K334p56K02p31j553J102
15283G428j60P15J061m912j422l374j831j326M565L629K114j904l355L453j561
$$ y = [20078, 19466, 20866, 21081, 26153, 26828, 21396, 21001, 18907, 19345, 21031, 22285, 22258, 22642, 25964, 24301, 14815, 9425, 12077, 15938, 19718, 21914, 26272, 31968, 29700, 28438, 23281, 14378, 12301, 20219, 22021, 14272, 14285, 19851, 20656, 20999, 22941, 22012, 18164, 17590, 15984, 16808, 20152, 25768, 26345, 22344, 22202, 26857, 29877, 28638, 29342, 27458, 18775, 15083, 18632, 16214, 19386, 14981, 17371, 16971, 17508, 18890, 10425, 11602, 10066, 9503, 15551, 14101, 13390, 10148, 17724, 29470, 36144, 33385, 33153, 25084, 16320, 12139, 13206, 11988, 7994, 8672, 9297, 7591, 11663, 15368, 15597, 11029, 11288, 15703, 17003, 14429, 8495, -885, -4618, -277, 5097, 9003, 8584, 3563, 5327, 8612, 6830, 9164, 8408, 8610, 7879, 6326, 7428, 7268, 7983, 9044, 4132, 2710, -664, -2495, -3821, 744, 4373, 6487, 4583, 1228, 4681, 3120]
15268C120O545r4R46J395L002L975q074q545N554L415m071m68m83q520k821M106
15252a018N460l384k71m21r43K706N271n811o321O929L527L945j930o596n747
15237d604J361L873J069l07k348j623l217K590m122k453n32l236j89o27J643n856
15221a8578J154Q474J832r65O161M617l168L139Q77J610K985m007k137k426n129
15206e561K367m002j297k406L974J2984m402p492K04P818J854q76q835l876J425
15191h121K79N929J442k640o692m498q02P836L71m594j103M336L520L160j824
15176c401L957P369K006L732l117r057m092O244P719l393n836p72k032o371R73
15161f071L482L208m543K05J428J378J250k572j470Q463Q216k866j956k256J645
$$ y = [3120, 9665, 9571, 10517, 11912, 14914, 18889, 10815, 2270, 7824, 11239, 7168, 6700, 6217, -2303, -5124, -1018, 4442, 1058, 787, 366, -577, 2129, 7400, 1589, -4732, 2197, 5724, 9669, 7739, 1143, -4604, -3243, 630, 1699, 1392, -956, -2579, -5796, -3206, -7328, -9781, -10313, -13549, -13738, -14365, -12722, -18578, -17424, -8950, -7118, -8083, -1922, 2695, -473, 2666, 3543, 5153, 8138, 4131, 1994, -432, -5561, -3194, -7196, -8493, -10899, -6925, 6059, 1657, -5835, -5631, 2187, 4041, 3165, -5670, -9546, -8121, -7842, -1913, -471, -3111, -9803, -14301, -15103, -7267, -6896, -11490, -12593, -8257, -4737, -1577, -3401, 556, 7925, 9931, 13663, 10546, 1489, -2603, 3641, 11360, 7967, 2131, 1359, -673, -7044, -6071, -2589, 619, -3924, -3719, -2291, -913, 337, -2235, -3705, 4758, 12974, 10108, 8152, 5896, 7541]
15146G541m693n067n68l9L894j877k872J87J459l684l210K938R75j930n800L156
15130i590N811J386J584L740K177o70R415M78o693m362j2607o887O035L82l648
15115a3449N914Q77L0M755O754l39l841J008o534n397q18m77j442p785L652Q06
15099a6286N441L283l386k296Q223N090r084n129O974Q052l26m789Q9k086l807
15084a0037N784K094K190L542o09k567k205k680k268L984M302n325N114P278k735
15069E862m410j685J968K217L92o002k985o61K314O2k666j239O752O500j298k613
15053B508k089q768k250K034L419p18j926l937q42J840k6r03k745j144l484O273
15037a2758J875k256k314j107l50mk752M694J558L303P12q64p16o19l415M333
$$ y = [7541, 2848, -2219, -2787, -2826, 1068, -809, -3681, -3494, -2035, -5719, -8929, -5991, -5016, -6946, -12746, -9590, -3779, -2393, -809, 2931, 5108, 4438, 13853, 14331, 7638, 3276, -9331, -16218, -10183, -9801, -13449, -7535, -6658, -6628, -1873, 4881, 4542, 701, 1709, -4825, -10222, -11040, -11517, -12959, -20744, -17092, -16286, -10845, -7562, -10948, -13244, -5021, 69, -9015, -14144, -7170, 882, 556, -4233, -4144, -6230, -10037, -4253, -2159, 31, 3573, 2964, 397, -1808, -4488, -6756, -2772, 1530, -3795, 1319, 8597, 5862, 1452, -233, 1735, 3952, 4344, -1658, -4643, -5304, -2990, -2928, -5594, -6833, -81, 6419, 5121, 2508, 419, -8349, -10599, -8565, -5146, -5864, -7790, -11727, -12569, -10729, -10755, -11658, -14403, -15547, -19031, -12758, -10883, -13139, -15453, -16560, -16910, -16914, -19666, -14972, -13414, -10111, -9399, -10263, -10979, -11598, -15013, -10680]
15021a0680K734K720m030p083l520J758Q510K890k178J563O023Q59l347k382k079
15006h242p28L575k654N344L210j277n29n38J756K304j255K92p82l388l444k455
14990h811M79L914O22K025K832m124j841m0m813K745O737L267q16k802O121L027
14974H522l182K936r52n733k510l626R1P583O437J449m982r182o471J706k93l06
14958h513O084P442p468l037M462r216j1165o08O212M793N013P130k783J95n271
14943f730p809J655L255Q044J499K076K289JL061K354L134M542l555r516J533
14928E833N444k765K88l138o600k360j003M577L867K972k646j1428M246K122o314
14913f905K855L787o42K613q92m139k782o9p009m104O16P373L980n75j678L185
$$ y = [-10680, -7946, -5226, -9256, -16339, -19859, -18101, -9591, -6701, -8879, -7316, -1293, -434, -3781, -6163, -8242, -8970, -5395, -8049, -2705, 505, -772, -1301, -1839, -83, 2221, 966, 1258, 476, -2912, -6356, -8811, -8332, -4418, -3796, -1771, 1061, -3063, -4904, -4944, -9757, -7012, -275, 2992, 2176, -626, 5495, 8522, 5340, 8276, 7324, 1591, -919, -4545, -4454, 3129, 9566, 11015, 6033, -3149, -9620, -7914, -8207, -8513, -2429, 5013, -2455, -5492, -1030, -10246, -21411, -22019, -15807, -11014, -6001, 1129, -1654, -1459, -6730, -14539, -12884, -9629, -1585, -86, 1990, 4279, 4280, 7341, 9695, 12829, 17371, 13816, 4300, 5833, 11277, 8512, 8800, 5662, -938, -3298, -4301, 276, 4143, 7115, 4469, -6959, -2713, -591, -6905, -4050, -263, -905, 1708, 816, -3323, -6105, -6174, -13183, -17287, -16671, -9298, -5318, -5893, -7571, -4386]
14897d386M052q26J965m008m127j73K666K319J093j516K672R6N838l322l731o63
14881b051l983L222o3q646l559N718Q69p051m24O110J0790M519j382k57R24R626
14865A4362n746j0174j068J371K388j989m83m055K81K530P95K062P84o857K464
14850c335J525K118J739J281k323r002j658N143j236p22J614K018l905K212o659
14835a1190o762j996O693k495p151K125O871Q000m096J583J565k746m155K31J417
14820a2106K955M160o773j667J977M147J530j387j054k902P672J3370J407j756
14806I573j690p069m775j761j204j126J068j140j191K765l42o50M466l918q927
14791a5921j133M653N649N037J922o143m040k821J670M37P594M469r46k287j988
$$ y = [-4386, -334, -1160, 805, -3203, -7330, -7503, -4837, -2518, -1425, -2941, -269, -173, 5665, 2343, -1388, -2051, -6034, -2812, -2875, -11521, -15080, -9362, -8493, -15544, -15968, -9858, 932, 5451, 4069, 3812, 4736, 14362, 8616, -1558, -2626, -1255, 1133, -856, -1339, -5394, -5113, -2583, -1788, 274, 1058, -5799, -3335, -1810, 308, 2047, 3328, 1005, -7997, -9655, -4512, -5748, -6470, -4856, -2838, -6743, -4531, -11190, -17952, -19948, -13255, -15750, -22901, -20776, -13905, -5905, -10001, -8418, -6853, -9599, -13754, -13523, -12106, -9151, -4991, -11764, -13431, -11454, -7307, -5777, -7164, -8218, -11120, -3448, 9922, 11329, 9573, 7883, 814, -3961, -5722, -6926, -8052, -6984, -8124, -9315, -6550, -6892, -7542, -3076, -6994, -15921, -17054, -12401, -6752, -1715, 207, -5936, -9976, -12797, -11127, -10690, -3096, 1373, 427, -1860, -3848]
14776c848j5716k245Q211O174j24R45j315m56P627K560l035K22J380q104o49Q145
14760b28J393M333k079o370k735n633J637O038r14m459j665K606L709M594q8m755
14744d616k270K204M673P205o96n684m067K360O910K962m122o789j054m019L51
14729f652L271K636l064o354N18M63K007k779l459R79P694K992p549k227K833
14714h691l034p76L976J466m202J76L643L527M19M541l179m422n52K904K271k615
14698d548k56O81k974J893j043J762O69L74O25k258N06j004j45j397k113n958
14682a5186r99L810o53K864O73M074L127J381m695j566l04j720m425J248L985
14667h386O51M602r20q092J266L607o14n485P282N736M777r46l415o394k071k017
$$ y = [-3848, -19564, -21809, -13598, -7424, -7548, -6603, -7918, -8374, -747, 1813, -1222, -1000, 380, -7724, -8373, -228, 1165, 5498, 3419, -2951, -5686, -11319, -9682, -3644, -4558, -9017, -10682, -8076, -4367, 227, 139, -4616, -6886, -4682, -9, 7196, 6500, 816, -3251, -891, 6019, 8981, 4859, -1930, -2984, -7003, -6652, -3381, -745, -3809, -10163, -9645, -9182, -7175, -9954, -13413, -12434, -4740, -1748, -9297, -11524, -8691, -11725, -12501, -8525, -7059, -11261, -11085, -7442, -3915, -3496, 1045, -2134, -6556, -7108, -4204, -1933, -4548, -4804, -4123, -7097, -5204, -6247, -4485, -3816, -3442, -2817, -5075, -4569, -5573, -5718, -7115, -9228, -15186, -16185, -12375, -13028, -10164, -9491, -5417, -2290, -909, -5604, -7170, -7474, -9194, -13619, -12371, -8386, -7735, -3133, -4053, -12145, -10879, -7272, -7886, -13371, -6089, -353, 4424, 3478, 63, -6331, -8402, -10419]
14651a0419J770Q630j585k708L426m96m376j104N551R03O142J490N393n97j017
14636A1003o715o272l920k84m103J0417n389l698o063L016O318o375L619L000
14622e446L068J831O551k478l426k630j127P013O904n56l370J780n384J079l791
14607A8n985N29r69m673P84M015M72k430N975N767j854k615L354o844q534j211
14591a4201m649N515R451P334M921J420n865l304j034p21m744k791J565l39P033
14576d09l834p49M118j131r059J808N27k390M324L595N960J3537K866m686o223
14561H254J79M859R78r309o126j399O10n49m123l072K425J06N13N4O15r82k2l724
14543a0713L093P620M853M408K991j1075l653k763P18J770m931m279L411J833
$$ y = [-10419, -8649, -19, -1604, -4312, -886, -1382, -5758, -6862, -1311, -408, 5734, 7224, 12617, 12020, 11003, 4288, -1984, -5904, -6188, -10291, 126, -5263, -8961, -15024, -12008, -5690, -12065, -8446, -5446, -2378, -547, 6004, 3526, 100, -2530, -3657, 3356, 10260, 9704, 6334, 8114, 2730, 3809, 18, -5967, -5438, -6407, -11080, -10296, -6281, -5809, -8239, -2264, 3503, 1649, -966, 2388, -4456, -12990, -14201, -18850, -13335, -3884, 3450, 8371, 9791, 3926, 622, -412, -1133, -5877, -8668, -7103, -7442, -409, -4243, -4992, -874, -2005, -11064, -9256, -8729, -11119, -6795, -3200, 2760, 16297, 19163, 14477, 8254, 8433, 13292, 14270, 4961, -1165, -2564, -1954, -2503, -6626, -9698, -7273, -7167, -6654, -6600, -5985, -6967, -6989, -10713, -7620, 0, 4853, 9261, 12252, 1177, -2476, -5239, -4521, -2751, -7682, -11961, -8550, -6717]
14529f717N604n653M837J386r661M577j587l24O61K460j566M23M123J798j756
14514a395l421J37N951N615l468p560j1878J0768R026n810k367j530L06J332k612
14499f906o669l393O508L740K57n154j522j117M262N174P06k674k166Q09J1056
14484B911M595j1069J195m76k768Q229O638o474q677n156K564M727l181L627Q070
14469D755J451q097m656N933l610k926J60M33l397l135O517K702M394L526k511
14454A539n665K515K954j876q1j314l396l877O416m735j830p06J557P559N062
14439D122k283J249j537p75k326m345l45M950K794p739k196K174M379L989J805
14424C916n860j3934m073O547J402M342k085L561M998N905L430M290j374q62j0530
$$ y = [-6717, -1113, -6766, -1929, -543, -10204, -5627, -7214, -7538, -6877, -4417, -5983, -5560, -1437, 361, -1395, -4816, -4679, 1272, 6887, 3419, -4141, -16019, -5251, 3775, -2035, -4402, -5932, -5626, -4294, -6906, -13575, -16968, -10460, -6720, -6463, -11617, -13139, -14256, -9994, -4820, -4114, -6788, -8954, -8145, 2911, 7506, -3563, -2368, -2844, -5612, 2617, 9255, 2781, -5896, -11052, -8488, -3761, -6942, -3315, 4755, 6206, -1891, -6547, -614, -4224, -7150, -6990, -6557, -9954, -13089, -6572, -3870, 524, 4050, 1539, -4126, -1611, 1343, -533, -614, -1928, -5324, -9201, -2785, -7520, -9350, -10056, -8499, -940, 4122, 1839, 3088, 1551, 776, -1550, -5895, -6240, -1290, 1504, -6235, -8431, -6257, -1878, 2111, 3916, -1944, -15878, -19951, -13404, -12002, -7660, -9745, -6184, -1186, 4719, 8149, 12439, 11065, 10203, -327]
14409c27j373L284q97o592l312k03j5k482M062N01k923n893J531Q577O254l714
14393c522J378J246k768n09m283l824j532K878j848l36K571J04J439J0743N813
14378G550j980L311m417p683n508J471M211L108k186l831J491O637L767l185K063
14363D819j657p971L934Q654L49p48n662m549L21l88L155k523p77K914L286m541
14347a384J152j56L209K166P11J766k706j0338j226M020M967j016M572P42K114
14332H593j943m603j27P013k120n280O4K517J698m241n225l23M196P99n968o947
14316a1897N888J748M019O927J896n409m059r34N125J374j614j399l173n461M652
14301b317L960k751O398M765j896K247k71L148m580o651k022m895R97L714q30
$$ y = [-327, -1700, 1584, 687, -5905, -9217, -9420, -9435, -11917, -7855, -7354, -10277, -16170, -14639, -6062, 192, -3522, -2144, -898, -3666, -4175, -8458, -12282, -13814, -10936, -12784, -13120, -10549, -10445, -9006, 1737, 7550, 5570, 8881, 4464, -3219, -8727, -7256, -3045, 63, -2123, -5954, -4463, 2174, 5941, 2756, 4819, 3162, -4809, -875, 7779, 8128, 7380, 1718, -2831, -2510, -2898, 257, -2266, -3043, -129, 3157, -1384, -232, -388, 2821, 4987, 5698, 7464, 4758, -5580, -6806, -2786, 2181, 1165, 5737, 6479, 8593, 6650, 2047, 1920, 8933, 6813, 1533, 1597, 4114, 5812, 1571, -3654, -3977, 219, 1018, -4950, -11897, -6009, -4261, -242, 6685, 8581, 3172, -887, -1821, 3304, 4678, 3064, 1665, -1508, -6969, -2317, 1643, -1108, 5290, 10055, 8159, 10406, 10135, 13283, 8703, 2052, 30, -4865, -3868, -154, -984]
14286i84m571K662L457L082L279j536j908l934q411k687O156O967K462R03J729
14271F666K050L375K133r962k898L33J921K578J701k640J656l964q277m162M329
14256e161Q948N591p443o931K539Q087L934n2j069k294K761j86K417j694M471
14241A3918j362J312K233J763m21k408k018L981m44K004l125l919R187P650P560
14226C5911k249o138M957J0243L205N005O381J9366K1177J9283L0357N2413O9318
14213B69229R9647J12396J06517P2453J4839m2343p8039q1937m7936N912N1293
14202D82031P8553P6776N0773q003o6612j08389j17932j10212q3604n1054m0412
14191A01915k3818r049j8889r416L158j805n377p283k285o134l333m546k990P961
$$ y = [-984, -5555, -2893, 564, 3646, 6925, 5389, 3481, -453, -8864, -11551, -5395, 1572, 4034, 4937, 6666, 8716, 12091, 14224, 4262, 1364, 1697, 3618, 6196, 7897, 5257, 6913, 2949, -5328, -9490, -5161, 3787, 9378, 1935, -4996, -2457, 5630, 9564, 9512, 8443, 6149, 8910, 8724, 11141, 9447, 13918, 12556, 13868, 16101, 17864, 17443, 15035, 13017, 16998, 16554, 18558, 15433, 11514, 20701, 28351, 35911, 33662, 27524, 32481, 42724, 45929, 50934, 57315, 76681, 97858, 117141, 147498, 199911, 269229, 368876, 481272, 587789, 660242, 675081, 632738, 554699, 472762, 424826, 430738, 482031, 560584, 637360, 688133, 680130, 613518, 505129, 387197, 276985, 193381, 142327, 101915, 78097, 69048, 50159, 40743, 43901, 42096, 36719, 29436, 27151, 21017, 17684, 13138, 10148, 18109]
14177A8109l224n718k640L911O57k900o1k839l120p363j337n78o51M734l883O164
14161g39M196j730k855j052K923j401l972l069Q349Q882l830m85J150k205ql092
14145A062L145m96K224L895n966j747j132j60Q370L130n407L23J673K745l53q97
14129A0409J401k340K580k931m728m533k878K463P852k791j818Q58o96m745l057
14114d954Q69O830Q37K901L976j953l305L339L638k390j12P47L57J967m343l439
14098D965m083o571j318k561k758M154N799K060l133M71P35q37L691j014M494
14083D094K557k749k452p703l493N315n60J781K951M738j045n878M779k08L291
14068E418K190k567j140r658m277j42j394j712N246N021m874n321M852J1142l356
$$ y = [18109, 14885, 9167, 6527, 10438, 11095, 8195, 8134, 5295, 2175, -5188, -6525, -7103, -7754, -3020, -6903, -739, 3457, 1727, -1128, -2180, 743, -658, -4630, -7699, 650, 9532, 5702, 5217, 6367, 4162, 4154, 1062, 4207, 3711, 5935, 9830, 3864, 2117, 985, 825, 9195, 12325, 6918, 7241, 8914, 11659, 11306, 10409, 11810, 9470, 12050, 9119, 4391, -142, -3020, -557, 7295, 4504, 2686, 3544, 2848, -1897, -4954, -4085, 2745, 3582, 6483, 10459, 8506, 5201, 8540, 12178, 9788, 9676, 10423, 10780, 12747, 8404, 4965, 882, -5689, -7007, -9568, -12326, -8172, -2373, -313, -3446, -2975, -2240, -3077, 614, -400, 4094, 6651, 3902, 1450, -6253, -9746, -4431, -4991, -3210, -259, 4479, 3434, -2444, 2335, 2127, 5418, 7608, 5041, 3901, -5757, -10034, -10176, -11570, -13282, -8036, -3015, -7889, -13210, -8358, 2784, -572]
14053e72p309l869M168O937P774j677r096M472j109l025K120P476N750n23k707
14038H810K159J902L154p80m708p297j441J183R67M135P39j5045m690L185k98
14023h025R14m157L341O59P373K272j320o885L257k17o225q69J1899k69k013j803
14007b068R43L85o30n492L552o5J479Q048m723j714R24K83j710k706k53M465K350
13990C068j330k824J113j670l148J056R34N539l64L256J717j543j416j649p11
13975B028J366o10n589R653P258l688l713k024l064j268J962k598k425J303J725
13960C16l730J863K883n322q5j442j048M020N490J842l071m767k769K700R51P29
13944a440j628L321M295j502l617r9K525J87Q23l818k151l691J051M174Q66K000
$$ y = [-572, -7881, -11750, -7582, -645, 7129, 5452, -3644, 828, -281, -3306, -1186, 6290, 12040, 11517, 8810, 10969, 12871, 16025, 15245, 10537, 3240, 1799, 2982, 3949, 8084, 8823, -6222, -10912, -7727, -8025, -7111, -11268, -7927, -7268, 105, 2377, 1057, -5828, -2571, -2788, -9013, -9882, 2017, 1748, -265, -2068, -1125, -740, -1370, -6862, -3310, -3375, -1896, 6152, 1429, -285, 639, 922, -788, -3494, -3747, 718, 3068, 1738, -1086, 27, -1643, -4791, -3735, -2801, 2738, 2374, 5630, 7347, 5804, 4388, 2739, 2028, 3394, 2784, -2805, 6848, 14106, 10418, 6705, 4681, 1617, 349, 2311, -287, -2712, -1409, 316, -3414, -1551, 1332, -3990, -4075, -5517, -6565, -2545, 2945, 4787, 1716, -3051, -5820, -3120, -2169, -1440, -3068, 253, 4548, 3046, -571, -670, 1855, 2042, 2865, -953, -3104, -6795, -5744, -1570, -704, 1296]
13928A296m682j837N303l548j179P588p88j264k268o336l87K885L839L117j748
13913iK780K96K826J171M494O700J910K524j515q932o747j1179L67Q527k708p57
13897b52N608j925o628j069J216o105k476J290R923O683p742l180K69J929K377
13882h2p552q54Q531O161N86J329l372q059p531M083K999L090K314K791K993J830
13866I257l69n214m309N818J319K781l217l700p71L935l738n309J810M241J428
13851C962J0314Q190R67o03m571m639m342Q87N02m37q870q762n816m7Q873N792
13835A400M073L530J338k885R98J06J568J738K818j057k068J075R704k076j86
13820B0076o47P890N30l866j655k166K164K653J251J27L177j699k577L373L661
$$ y = [1296, -3386, -5223, 80, -3468, -4647, 2941, 2153, 889, -1379, -7715, -8102, -5217, -1378, 1739, -9, 2771, 3067, 5893, 7064, 11558, 18258, 20168, 22692, 21177, 12245, 5498, -5681, -5314, 3213, 505, -252, 5356, 3431, -3197, -4266, -3050, -9155, -11631, -10341, -418, 6265, -1477, -4657, -4388, -2459, -82, -7634, -8488, 43, 6204, 6790, 8119, 4747, -3312, -10843, -6760, -3761, -671, 1643, 4434, 7427, 9257, 8888, 3674, -635, 5183, 6502, 9283, 6066, 2366, 1595, 5530, 1792, -3517, -1707, 2534, 3962, 14276, 22466, 23433, 22830, 18259, 13620, 9278, 10165, 10667, 10230, 1360, -7402, -13218, -13265, -4392, 1400, 5473, 9003, 10341, 7456, 8454, 8560, 10128, 11866, 14684, 13627, 11559, 12634, 22338, 20262, 20076, 19429, 27319, 27849, 23983, 22328, 20162, 22326, 24979, 26230, 26357, 29534, 27835, 25258, 28631, 32292]
13805C2292Q428J806N456J0857J7983J9238K2142L3773M5660O9456P4161N9292
13793D00544L1521J477m2428p4478p8908o0098m1028l6682k0173j3483j4601j7622
13781C4041o455k184J168k60rN90r64j659k70k484P37l78l297k10n41M162l627
13764A8360k362M843L521p810J184J148m497N201M166j059L226q26q18Q44J92
13749B5313r051o156N14N106N241J051j023P04o007N48o31N403L411L969r69l265
13733B4158k855J598J7m621K16J1334N168m415L672j852L744M373K441M615M156
13718E1749l245K028nk290J58P555O291O316O579M249k882K197Q559J0056K944
13703A00259N879J4429Q060N494J2355J5105N798R753J2425J9379L2400K1504
$$ y = [32292, 40720, 42526, 47982, 58839, 76822, 96060, 118202, 151975, 197635, 267091, 341252, 400544, 432065, 433542, 391114, 316636, 237728, 177630, 136602, 99920, 79747, 66264, 51663, 34041, 27586, 25402, 26570, 26310, 26301, 26891, 25927, 24268, 23998, 21514, 22251, 21873, 18576, 18366, 17825, 21987, 18360, 15998, 20841, 24362, 16552, 17736, 18884, 14387, 19588, 23754, 22695, 25921, 25095, 24277, 25121, 25313, 16262, 10106, 10620, 15726, 20967, 22018, 20995, 21699, 15692, 16240, 15609, 21012, 24423, 28392, 27423, 24158, 21303, 22901, 22918, 18297, 18513, 29847, 35015, 30600, 34272, 32420, 36164, 40537, 42978, 47593, 51749, 48504, 50532, 50527, 48237, 48395, 55950, 62241, 68557, 75136, 79385, 76503, 78700, 87259, 97315, 100259, 106138, 120567, 128627, 134121, 146476, 161581, 167379, 177132, 189557, 208936, 241336, 262840]
13691B62840K5858K9025L5757M3442M4122N2858O2341O6308R1446J03762J15534
13680I33293J39824J64569J81328J93240J93089J74128J42888Q4411K2825n0706
13670B178889j20009j62837j89462k00622j81693j74520j53399j36743j06664
13661G52940q7117p5804p0259n1755m3020m0247l3699k9657k6736k4977k4509
13650B45160k6216j2371j0350j5061j9131j4000j5468o621q56m760j5037j2851
13638I2438l661j072k270o658k301N28J813o752j1823q889L41M026J632k171k862
13623E2319o619o108j731K248q314l951R894J703j1891L796k033k099K854J896
13609C1964J298j048l524L936l775r814o110K764l284R68P565L007r52m190J288
$$ y = [262840, 288698, 317723, 353480, 396922, 441044, 493902, 556243, 622551, 713997, 817759, 933293, 1073117, 1237686, 1419014, 1612254, 1805343, 1979471, 2122359, 2206770, 2229595, 2178889, 2058880, 1896043, 1706581, 1505959, 1324266, 1149746, 996347, 859604, 752940, 665823, 590019, 519760, 468005, 424985, 384738, 351039, 321382, 294646, 269669, 245160, 218944, 206573, 196223, 181162, 162031, 148031, 132563, 125942, 125086, 120326, 105289, 92438, 88777, 87705, 85435, 78777, 76476, 77004, 78817, 72065, 60242, 51353, 51694, 55720, 57352, 55181, 52319, 45700, 39592, 37861, 40109, 31795, 27844, 37738, 39441, 27550, 31346, 29313, 27214, 30068, 31964, 33262, 32214, 28690, 32626, 28851, 19037, 12927, 15691, 12407, 13375, 20940, 23947, 22995, 18805, 20093]
13594B0093K850r09n347n277J268L030N584o087l234j158L603K515k802K665J425
13579A8219O341J3134J1524N104J028J5365J1936K579l757r915k231o250j1655
13566E1422j3450n008m23l581p451k66L389o329o684N956M385j656j1305M73Q59
13551A0331J057Q857Q506J637L519P198J0786J6555J6034N625p636o34J751r897
13537G3689r915p312j1300j4976p088k261j630n219m724p188L022k43p31P442
13523A1566J287o59J959m284j952k993j189P36j43P457m16q864L632M828m541
13508F424n220l593N471J951L556j094M83M397O241r1k424k519O27o23p071J44
13492F659O946J149k275l397m649J973L614K273k178o274J384K929K696l332J946
$$ y = [20093, 22943, 22034, 16687, 11410, 12678, 15708, 21292, 15205, 11971, 10813, 14416, 16931, 14129, 16794, 18219, 24560, 37694, 49218, 54322, 55350, 70715, 82651, 85230, 81473, 71558, 69327, 63077, 51422, 37972, 32964, 32541, 28960, 21509, 21243, 24632, 18303, 11619, 17575, 21960, 20304, 8999, 9472, 10331, 11388, 20245, 28751, 30388, 33907, 41105, 51891, 68446, 84480, 90105, 82469, 81835, 83586, 73689, 63774, 56462, 45162, 30186, 23098, 20837, 19207, 13988, 9264, 2076, 5098, 4855, 4124, 11566, 12853, 12194, 14153, 9869, 7917, 4924, 3735, 4471, 4328, 11785, 11369, 2505, 6137, 10965, 6424, 1204, -2389, 3082, 5033, 8589, 7495, 7978, 12375, 18616, 18525, 16101, 13582, 14209, 13586, 6515, 6659, 13605, 14754, 12479, 9082, 4433, 6406, 10020, 12293, 10115, 3841, 5225, 8154, 10850, 7518, 9464]
13477I464N000R84k21m043jN753k101K27L525m190j0005J302K051j150P61M948
13461A2304j159j858k58n750k148L68O837M470Q77q870l816L342M578l466L053
13446H504Q17L977m836J265L520M565L349m739m346l844q819J609J332j26Q25
13431C053M991L631J790K250J83o761j0509l904N68P89L014M703J192L971L222
13416A2183l222n294L716Q26p009m189J199j220o84K792N971L767l024l47L125
13401H590O51L473K587j886J662m519m851L10j244p117K172L135J220R07J409
13386F499J431J884K154l648J091J588R79K62p56m151L920P628o782K201J74l955
13370A0519r31L275n125m178m021k302L984L821o6N338o687k600O92N532O996
$$ y = [9464, 14464, 15448, 15227, 11184, 11183, 16936, 14835, 15062, 18587, 14397, 4392, 5694, 7745, 6595, 7356, 12304, 11145, 9287, 9029, 3279, 1131, 1499, 8336, 12806, 13683, 4813, 997, 4339, 8917, 5451, 8504, 9321, 13298, 8462, 9727, 13247, 17812, 21161, 16422, 12076, 8232, -587, 1022, 2354, 2228, 3053, 8044, 11675, 13465, 15715, 15898, 9137, -1372, -5276, -4708, -3919, -905, 3798, 4990, 8961, 12183, 8961, 3667, 7383, 8209, 1200, -2989, -1790, -3010, -3694, -902, 5069, 8836, 5812, 5465, 8590, 9241, 12714, 15301, 13415, 15077, 10558, 5707, 6017, 4773, -2344, -172, 2963, 4183, 5090, 6499, 7930, 9814, 11968, 8320, 9411, 10999, 11978, 12240, 11484, 7333, 11253, 18881, 12099, 14300, 14474, 10519, 9588, 12863, 7738, 3560, -461, -2763, 1221, 5042, 4976, 10314, 3627, 1027, 1719, 7251, 14247]
13355A4247K712k107k071l029n423K844l800o76P053L916m834o82l990r7L123
13340G186N058l435k005l571N309l946o537k364N518K940N60p67n604l573L384
13325a847j189k483o91L895L544J417L67L668p35k360J749m474J883r88R07L652
13309F315Q75k701n206m59J931j806L781P949o206j079L744M371K533q55K155
13294A5342K76o455J966R25p82Q06j553K10p572k765O954P296m019l221R47J030
13278I385m833R64O80k673m967N74K486M877k98n454J569M366n565o84j560q73
13262b006K878k251L42M782R088l524o818p435J147J207Q649M267N774k282J812
13247A5630l286O33M240q88k394m062K713J0111j491j368o729m769p65M332L656
$$ y = [14247, 16959, 14852, 12781, 9752, 4329, 7173, 3373, 2697, 9750, 13666, 8832, 8150, 4160, 4063, 7186, 12244, 8809, 6804, 3233, 8542, 4596, -1941, -4305, 1213, 4153, 4713, 3946, -1658, -5231, -1847, -3036, -5519, -6210, -2315, 1229, 2646, 3013, 6681, 5946, 3586, 5335, 861, 2744, 1756, 2663, 6315, 7190, 4489, -717, -1176, 755, -1051, 2730, 10679, 4473, 3394, 7138, 11509, 14042, 13187, 15342, 15618, 9163, 11129, 12054, 11272, 12078, 10525, 10735, 3163, 398, 7352, 14648, 10629, 7408, 8355, 9385, 4552, 5516, 6196, 3523, -1444, -870, 1616, 6493, 6195, 741, 2310, 6676, 1111, 427, -1133, -2006, 872, -1379, -1037, 3745, 12833, 9309, 2491, -4944, -3797, -2590, 6059, 10326, 16100, 13818, 15630, 12344, 12977, 17217, 16329, 13935, 9873, 12586, 22697, 21206, 19838, 13109, 8340, 7575, 11907, 15563]
13232A5563j72j1544l265k825L670N054O820j192l635k274O423K739m513J593
13218A2442q27k531J173M296k165O571R183l056l700l804M28R750Q978N618J919
13203D4275m737r569L458Q024k690k804K475j866m212n033l696R2J017j092m26
13188B3216o684k961J07M080J02n993O233N751k884q177p260K162L034n461j174
13173D091M962J1100N977n204l140O28l810n501l67j626j238N798M231r87n424
13158I490o489j859O042P035P994J632J041L393K271q375J513J880r839m414m106
13143G209O623M160R35o161k502O789N02N012m18p78J516m604P210L608r1m418
13127B4592L33J339K785k124q126p22Q472L889L761J609l776p977O6M037J929
$$ y = [15563, 15391, 3847, 582, -2243, 1427, 6481, 13301, 12109, 8474, 6200, 12623, 15362, 10849, 12442, 11615, 9084, 10257, 14553, 12388, 18959, 28142, 25086, 21386, 17582, 18010, 27760, 36738, 42356, 44275, 39538, 29969, 33427, 41451, 38761, 35957, 38432, 36566, 32354, 27321, 23625, 23717, 24734, 23642, 23216, 16532, 13571, 13678, 17758, 17860, 11867, 18100, 23851, 20967, 12790, 5530, 7692, 10726, 5265, 4091, 9053, 20153, 26130, 20926, 17786, 18414, 14604, 9103, 8736, 7110, 5872, 11670, 15901, 14914, 9490, 3001, 1142, 7184, 14219, 22213, 23845, 24886, 28279, 30550, 22175, 23688, 25568, 15729, 11315, 7209, 13832, 17992, 18927, 12766, 10264, 17053, 17555, 22567, 22149, 21371, 22887, 18283, 25493, 29101, 29010, 24592, 24925, 26264, 29049, 26925, 18799, 18077, 26549, 30438, 34199, 35808, 32032, 24055, 24121, 28158, 30087]
13112C0087n125k373J247J2351J8009J4184J9676J9572K2720K8645K8765M1512
13100B29270Q1797J33452K12942L17335L80472L40042J40455j28633l31757m08903
13090I66472l36994k14946j21041p7142m6541k9550k0635k1073j8589o199J506
13079G5268p018q090m033l892m957n974o917J899N608L819k028n462r147j3598
13065A5478l848n703J18P347P548O101M510O502R983K61N59P442J6686Q955J981
13050H3920P321L074l027N282J6939J9450J6217L2226M9044P5010J23850J78322
13038F07628K19961K18903J46564K0733j11769k03034k06888j40932n7515r71
13028D92680K1628Q608l8321p3935r3727q2052o3231m0952k2015k0686j7101p158
$$ y = [30087, 24962, 22589, 23836, 36187, 54196, 68380, 88056, 107628, 130348, 158993, 187758, 229270, 311067, 444519, 657461, 974796, 1355268, 1695310, 1835765, 1707132, 1375375, 966472, 629478, 414532, 293491, 216349, 169808, 140258, 119623, 98550, 79961, 73762, 75268, 68250, 60160, 56127, 52235, 47278, 41304, 34387, 36286, 41894, 45713, 43685, 38223, 29076, 15478, 11630, 5927, 6045, 13392, 20940, 27041, 31551, 38053, 48036, 48297, 48856, 56298, 72984, 81939, 83920, 91241, 94315, 91288, 96570, 113509, 132959, 149176, 181402, 230446, 305456, 429306, 607628, 827589, 1046492, 1193056, 1213789, 1102020, 898986, 692098, 551166, 493651, 492680, 514308, 522916, 484595, 410660, 316933, 234881, 171650, 130698, 108683, 87997, 70896, 63738]
13016F3738k304L462l189l632P71O156J35o840n767j4719j2034k652l978j97J227
13001B0177P968Q747O919M316q140k137N688L367q148j531N09r195l29R053K38
12986C7502n165J343j36L546P697n76p224l787j680O885j835m171R477N093L155
12971E0124K572j549P11P887J2758N542p187j5225j3980n066j2395j2824j2828
12958a460m989Q417J0129L592J195J400K847M568J251K159l767n009L087Q772
12944C2192K575j737J877M358p916m317m110j1992p015m516j412R255J6831Q140
12930C2213J6771J0236M286K770O801J1666J3086j962O9j360L971L579j824j829
12916I8473O810m300j1044o022j0604o987L762K782K723J1048J909L891N578N360
$$ y = [63738, 61434, 64896, 61707, 58075, 58846, 65002, 65137, 58297, 52530, 37811, 25777, 23125, 19147, 18950, 20177, 28145, 36892, 43811, 48127, 39987, 37850, 43538, 46905, 38757, 37226, 37735, 28540, 28211, 37264, 37502, 32337, 33680, 33544, 37090, 44787, 44211, 36987, 33200, 31520, 38405, 36570, 32399, 41876, 46969, 50124, 52696, 51147, 51858, 59745, 72503, 78045, 70858, 55633, 41653, 36587, 24192, 11368, -1460, -6449, 1968, 12097, 15689, 16884, 18284, 21131, 25699, 26950, 29109, 25342, 20333, 23420, 32192, 34767, 33030, 34907, 39265, 31349, 27032, 22922, 10930, 3915, -601, -2013, 7242, 24073, 32213, 48984, 59220, 63506, 66276, 73077, 84743, 97829, 95867, 95936, 94576, 98547, 102126, 100302, 98473, 105283, 100983, 89939, 83917, 73313, 66326, 70088, 72870, 75593, 86641, 88550, 92441, 98019, 103379]
12902A03379J2157J4706Q017j3154k4931j9952j6361m734k656l945j960k87q587
12889D1692n538K703N592O085M851Q121P584R959J5605M792L65M501Q0m756l514
12874I8122P527J2477J6242K2417K8103K2076O963j0066k4736k6186q001o110
12862A38828N762J1773J233K849J6608K3952K6406L5838O1433P2180N3597J866
12850D52325o0812j06436j02575p8799m2762j5133q879q326n548k755M00n99j866
12837A8235N474N446R874N334L005n515l156o758r873L353K131K310N252J2376
12823D7488P351L388L813N059O227M917M192O054o810o477q674O205L657j5O703
12808H3078R980O223O399J945l786j1789j4562j4188n585N379p227j0439N15j377
$$ y = [103379, 115536, 130242, 138259, 125105, 100174, 80222, 63861, 59127, 56471, 52526, 50566, 50279, 41692, 36154, 38857, 44449, 50534, 55385, 63506, 71090, 81049, 96654, 101446, 101811, 106312, 106392, 101636, 98122, 105649, 118126, 134368, 156785, 184888, 206964, 213927, 203861, 179125, 152939, 144938, 138828, 144590, 156363, 157596, 160445, 177053, 201005, 227411, 263249, 324682, 396862, 450459, 452325, 391513, 285077, 182502, 103703, 60941, 45808, 36929, 28603, 23055, 20300, 20700, 20101, 18235, 23709, 29155, 39029, 44363, 47368, 41853, 38697, 31939, 22066, 25419, 27550, 29860, 35112, 47488, 54839, 58227, 62040, 67099, 73326, 78243, 82435, 88489, 81679, 75202, 66528, 72733, 76390, 76375, 83078, 93058, 99281, 105680, 107625, 103839, 92050, 77488, 63300, 57715, 63094, 55867, 45428, 45943, 44566]
12794D4566j903l142J277l046O410J4391L3816N7773N5558M6711L8781K5748P034
12781C23974L573K9701N0939O5142N7941M1576K9166L0686M0525P0356J09420
12770H52999J40934K06189L10323M75318P03008R00720Q88326O36224J26288l37762
12760D902567m73828k38008K52283N14007K10740l43779q22369r88960p45432
12751B267221m31165k66066k25614k21287k08422j64631j00640n9815m3479l5712
12741E10390k3303p915M149J9925J5447M959K856P986J5668K3196L3015L8680
12729F45053L6612K0992J5328R465n151q377j7908j4669j2759k26J7989J5192
12717G01541N231K7332L8902N3875O9727Q5474J33238J86347J99763J11218k5808
$$ y = [44566, 42663, 39521, 40798, 37752, 44162, 58553, 92369, 150142, 205700, 252411, 291192, 316940, 323974, 327547, 357248, 408187, 473329, 531270, 572846, 602012, 632698, 673223, 743579, 852999, 993933, 1200122, 1510445, 1985763, 2688771, 3589491, 4477817, 5114041, 5240329, 4902567, 4428739, 4190731, 4443014, 4957021, 5167761, 4823982, 4001613, 3012653, 2267221, 1836056, 1569990, 1344376, 1123089, 914667, 750036, 649396, 589581, 546102, 510390, 487087, 479172, 483321, 503246, 518693, 523652, 526508, 534494, 550162, 573358, 606373, 645053, 681665, 702657, 717985, 727450, 722299, 713922, 696014, 681345, 668586, 668360, 686349, 701541, 706772, 734104, 773006, 826881, 896608, 982082, 1115320, 1301667, 1501430, 1612648, 1586840]
12706A586840j35122j83228j28052l9818K806J7290J0859J0344K3972L4386N3198
12695A253475P6558R6730J09445J43837J85593K30406K67038K70628K30447J64936
12685C029093Q2404p035o0085r5908p5703M924R6614J78797K41052L17298L80251
12674D091702M67250N95169P63769R79803J269007J599271J819130J910104K091670
12665A5586875K556596L473109M945992P050036J0217740J5384160K3899671L6962415
12657A20076594N3873850O7041775O1534456L0169687j4101251n3832800p3511119
12650A91251192o6097195m4481315k5723004j4764255r080650o134784m541240
12643B0428749l556112k805972k156540j612727j212626r37146p40142n88853
$$ y = [1586840, 1451718, 1268490, 1140438, 1100620, 1103426, 1120716, 1131575, 1141919, 1165891, 1200277, 1253475, 1330033, 1426763, 1536208, 1680045, 1865638, 2096044, 2363082, 2633710, 2864157, 3029093, 3111497, 3104462, 3044377, 2948469, 2872766, 2877690, 2974304, 3153101, 3394153, 3711451, 4091702, 4558952, 5154121, 5917890, 6897693, 8166700, 9765971, 11585101, 13495205, 15586875, 18143471, 21616580, 26562572, 33612608, 43830348, 59214508, 83114179, 120076594, 173950444, 240992219, 302526675, 332696362, 318595111, 264762311, 191251192, 125153997, 80672682, 54949678, 40185423, 31104773, 24969989, 20428749, 16872637, 14066665, 11910125, 10297398, 9084772, 8147626, 7407484, 6818631]
12635F818631m80459l77169k75410j86012j05237m9840J1458Q1595J59093K66894
12625E863544M09795N47476O53459P29241Q58884J058630J357227J809286K525287
12616A5812829L630441N375332Q113624J2297644J8348002K6485923L5617456
12609A25681251M0445521L3522461J4884663r072650l0768603m3188157m2113365
12602H9391121l1095108j9156539j1144174o674032m233557k862782k079945j632281
12594A0512703j301481j026134p91038o28921n62474n78999o10428n98288n16864
12585C898076m03427l09642k42618k15521j91681j76078j80722j61881j51602
12576A864904j38260j15042j00111q5965o5487o4053o8379o2968o2684m6128m9937
$$ y = [6818631, 6338172, 5961003, 5685593, 5499581, 5394344, 5344504, 5355962, 5437557, 5596650, 5863544, 6273339, 6820815, 7474274, 8203515, 9062399, 10121029, 11478256, 13287542, 15812829, 19443270, 24818602, 32932226, 45229870, 63577872, 90063795, 125681251, 166126772, 199649233, 214533896, 205461246, 174692643, 131504486, 89391121, 58296013, 39139474, 27995300, 21321268, 17087711, 14224929, 12144984, 10512703, 9211222, 8185088, 7394050, 6765129, 6202655, 5623656, 5013228, 4414940, 3898076, 3494649, 3185007, 2942389, 2726868, 2535187, 2359109, 2178387, 2016506, 1864904, 1726644, 1611602, 1511491, 1425526, 1360039, 1295986, 1227607, 1164639, 1101955, 1055827, 1005890]
12565A005890n0437m6582l9105l5935l5990k2061k6264l0393k5816k9822l5662
12554F27823l4119k8065k0226k0824k0353p300j1358j3375j3456j5599p384j2986
12542D22778j5773j0819j2428j3547j6451j1809k036P94K678K862R36J229K7114
12529C75528M5861L6947K8760L287k9256k8933j8059l418R525J7256J7523r384
12517D45637k1427k5760k1268j9729j5277j5189r850o306j2423j8847j7054j6918
12505B45589n178k459k088J0631J6471Q046L074J132q380q364j5235j4950r100
12492B19189o995n261j3808o130l164L059J436M012J2295K8717L4852L7214K8342
12479C33758J7160M057o715p114o218J5493J0830J0258K512j1441j5233j7716
$$ y = [1005890, 955453, 908871, 869766, 833831, 797841, 775780, 749516, 719123, 693307, 663485, 627823, 593704, 565639, 545413, 524589, 504236, 496936, 485578, 472203, 458747, 443148, 435764, 422778, 407005, 396186, 383758, 370211, 353760, 341951, 339915, 340709, 343387, 346249, 347185, 348414, 375528, 421389, 458336, 487096, 490383, 461127, 432194, 414135, 410717, 420242, 437498, 455021, 445637, 424210, 398450, 377182, 357453, 342176, 326987, 317137, 310831, 298408, 279561, 262507, 245589, 240411, 237952, 235864, 246495, 262966, 271012, 274086, 275218, 266838, 258474, 243239, 228289, 219189, 212194, 206933, 193125, 186995, 183831, 186890, 188326, 192338, 204633, 233350, 268202, 305416, 333758, 350918, 354975, 348260, 341146, 334928, 350421, 361251, 371509, 374021, 362580, 347347, 329631]
12467C29631j8140r220j0498p935p929l615l708j0835k4829l0984k4576j7052
12455A60310q981j457n868K679J318N49m282l812o532l68Q536L222J458M023R366
12440A60161R159J2859L410q469q907k89m435l596o49j0341o072m838k927L902
12426A38968M786K313K616Q38L98L24L745m054q4j465L065k117m695j293J294
12411A44639j0617k1966j6288j5447n384M808J0669K5258J0646l197M451O014
12399A33586j32J0444R183J4164J6383J0586L791j873j4470k3259j7727j7347
12387A23329o745l741q883j289L682k997L061N994J872J3057J0207O503O106O848
12373A57004M610J132j0162m646n412L7l54n858p006n813o617M039J1122J9373
$$ y = [329631, 311491, 302271, 291773, 283838, 275909, 272294, 268586, 257751, 232922, 201938, 177362, 160310, 151329, 149872, 144004, 146683, 148001, 148550, 144268, 140456, 133924, 133556, 142092, 145314, 146772, 150795, 160161, 169320, 182179, 185589, 177120, 168213, 167924, 163489, 159893, 159244, 148903, 142831, 137993, 135066, 138968, 143754, 146067, 148683, 149521, 149919, 150243, 153988, 149934, 149850, 148385, 151450, 149333, 144638, 143345, 144639, 134022, 112056, 95768, 80321, 74937, 79745, 90414, 115672, 126318, 123121, 127572, 133586, 133454, 143898, 153081, 167245, 183628, 194214, 198005, 196132, 181662, 158403, 140676, 123329, 116584, 112843, 103960, 102671, 106353, 103356, 106417, 112411, 114283, 127340, 137547, 144050, 150156, 157004, 161614, 162746, 152584, 147938, 142526, 142563, 142209, 136351, 129345, 123532, 116915, 120954, 132076, 151449]
12359A51449K9882L1051L6500K9101m449j4792k0692j3150r561j5303j2223j1347
12347A76466k2584j9280j9650j8632j2348l008j562m829j800N330q155n120K611
12334F7439R586M785m55P71K632O770M835N210J334m488j177K870K72Q353J1599
12319A20336Q412N197j3082j2344m625p143q267l435p84J659J306O698n92l701
12305H9635n470n114L04m702p582j2778l784r265p793o495k088L00J937K812J0842
12290D0759L736L864J1528j935j0282k040N427J629J543j454m552j286j781o902
12276C8254J770J065m478m968k155L667N926k178l617M984k640k706P167J943
12262D2034L920L14R233J1882K060l678J230q64o814q488j3564o227J0679R930
$$ y = [151449, 181331, 212382, 248882, 277983, 273534, 258742, 238050, 224900, 215339, 200036, 187813, 176466, 153882, 134602, 114952, 96320, 83972, 80964, 79402, 74573, 72773, 78103, 69948, 64828, 67439, 77025, 81810, 81355, 82126, 84758, 91528, 96363, 101573, 102907, 98419, 97242, 100112, 100384, 108737, 120336, 128748, 133945, 120863, 108519, 103894, 96751, 88484, 85049, 84265, 85924, 87230, 93928, 93336, 89635, 84165, 79051, 79355, 74653, 67071, 54293, 50509, 41244, 33451, 26956, 24868, 25168, 27105, 29917, 40759, 44495, 48359, 59887, 57952, 47670, 45630, 51057, 52686, 54229, 52775, 48223, 46937, 45156, 38254, 40024, 41089, 36611, 31643, 29488, 33155, 39081, 36903, 33286, 38270, 35630, 32924, 40091, 42034, 45954, 46268, 55501, 67383, 69443, 65765, 66995, 66131, 59317, 50829, 37265, 31038, 41717, 51647]
12248E1647L489l23O137J715o653r86P329J804r324j2257J096K954o8K38o199
12233D0599l648N73j815p09M604J2387M411k768r87L034P873R631J5379J2752
12219A01316R883J6874K0143L3022M4036N8221Q2424J17364J87308K80393L71573
12208A322557L55201J89977p2053k96097m07488l57675k43927j41841p8720l6926
12198B33008k5590k2944k0531j3975j6926k4399j7110r450j345J0485M367o707
12186H8883j410n29N015Q809P912J5079K3660L2260N1076R2872J34002J74372
12174F32001K23401K06813J17138k4204j50138k29896k28793j71245j02427n9716
12164B12934l3970k2983j3191j4262j6582j6686j2892p536m928O312M865q541
$$ y = [51647, 55136, 54813, 60950, 62665, 56012, 55026, 62355, 64159, 54835, 42578, 43674, 46628, 46560, 46798, 40599, 36951, 37524, 35709, 35000, 39604, 51991, 56402, 53634, 52647, 55681, 63554, 73185, 88564, 101316, 111199, 128073, 148216, 181238, 225274, 283495, 365919, 483283, 670591, 950984, 1322557, 1677758, 1867735, 1795682, 1499585, 1092097, 734422, 490495, 348654, 269934, 233008, 207418, 184474, 163943, 149968, 133042, 108643, 91533, 82083, 80738, 91223, 95590, 88883, 87473, 86944, 91959, 100768, 108680, 123759, 147419, 179679, 230755, 323627, 457629, 632001, 855402, 1062215, 1179353, 1155149, 1005011, 775115, 546322, 375077, 272650, 212934, 178964, 155981, 142790, 128528, 111946, 95260, 82368, 74832, 69904, 76216, 81081, 72540]
12152G2540o579k607n263m217o440p185p121m413j597k153k58M844O681m081J56
12137C2307O949j583l508r61M486K433k938j905L656J818r185r594n074K85M606
12122B1792o3M164N368l698o302o218p95M323J179O766k751k384l000n65j724
12107A6092K998m45P404L960j471l153j1L31R34k38k971j101q557O79j689l071
12091I691j722M926N412k189J270Q966l69J11K782K392J818n122p645L73Q41M347
12075B5882n782m350J159j149L580O9m056o370l232L578J3126J0320l958q445
12061B0372k654M00l811P116o35r575k259N216R574k454L045Q62P86K838K723
12046C1544o788m760k772m505R618m059R27L009j010j3699k349K771K190R1N006
$$ y = [72540, 65961, 63354, 58091, 53874, 47434, 40249, 33128, 28715, 27118, 24965, 24707, 29551, 36232, 32151, 32307, 39256, 37673, 34165, 33204, 37690, 40123, 37185, 35280, 38936, 40754, 31569, 21975, 16901, 17186, 21792, 21729, 25893, 31261, 27563, 21261, 15043, 14248, 18571, 19750, 26516, 23765, 21381, 18381, 17816, 16092, 19090, 18645, 26049, 30009, 28538, 25385, 25374, 25705, 26639, 26401, 23430, 22329, 13772, 14451, 12762, 9691, 7969, 12895, 18307, 16118, 17388, 26354, 25985, 26096, 28878, 31270, 33088, 27966, 20321, 20694, 21535, 25882, 20100, 15750, 16909, 15760, 19340, 19409, 15353, 8983, 5751, 9329, 22455, 32775, 28817, 20372, 17718, 18118, 14307, 21423, 20788, 11213, 8954, 14170, 23744, 21290, 24335, 25197, 25983, 28821, 31544, 24756, 19996, 17224, 12719, 22337, 18278, 19205, 22214, 21204, 7505, 5156, 7927, 10117, 10208, 15214]
12031A5214L309j555O431O381J851m174r451m712j177P946O019q960p455Q00m11
12016A0056k681Q17j574J701L943P016K028K068m332q675k450L842O458m389l452
12001A0376L651K592q831n134p35P127R470M101M970l175K551r039KM135l224
11986A8837N52J704n105k354O757k475p187m396N571K929n001K127J770k249j977
11971I503R31j512m392N916M994j50q512m131l196l550P368Q33j502K432P467
11956A2499j152K084k464n049l674l071j572l62J2661O283j103l103l809O217
11942A4385O888L153n458q20R36j11j273K409j979K265N481J831k563K611r82
11927B6773p625J214k59N058j506j950q461K055M432k012p836n920n08P399L957
$$ y = [15214, 18523, 16968, 23399, 29780, 31631, 27457, 18006, 13294, 12117, 20063, 26082, 17122, 9667, 10467, 10056, 7375, 8192, 6618, 8319, 12262, 19278, 21306, 23374, 19042, 10367, 7917, 11759, 18217, 13828, 10376, 14027, 16619, 7788, 2654, 1919, 9046, 18516, 22617, 27587, 24412, 26963, 17924, 17926, 22061, 18837, 19389, 21093, 15988, 13634, 20391, 17916, 10729, 6333, 11904, 14833, 9832, 11959, 13729, 11480, 9503, 10434, 8922, 4530, 10446, 15440, 15290, 6778, 2647, -549, -4099, 3269, 4102, 2600, 5032, 12499, 11347, 13431, 10967, 5918, 2244, -827, -2399, -2761, 9900, 16183, 15080, 11977, 8168, 14385, 21273, 24426, 18968, 18148, 19084, 18973, 17700, 20109, 18130, 20395, 25876, 27707, 25144, 27755, 26773, 19148, 20362, 20103, 25161, 23655, 21705, 13244, 15299, 19731, 17719, 9883, 3963, 3455, 10854, 14811]
11912A4811m681k356k874m387O049L843l251L896j210l491m274P079O804k906
11898A3052J20r332l224m180j086P638L186J133K82m074L721j023Q92Q134L517
11883A8756O424N780o93p068p725m513k906k083L682J879m60K162j255L693n463
11868A0210n653Q51k214m827l508O130P625M904k116n119o287K606J563Q78k06
11853D837J422l063L723R77K655j605k573M461J761o63k110k675K539P85k684
11838G787l170Q12n387o6L643j193p78L409Q08l800m105K966P232j680p925j610
11822c057N738J208Q68J210l281O75N408P272l343o616Q453M069p828k077Q93
11807I592L37m944m646L417P723K86o376K967l398J982J326Q8j648m305l449R91
$$ y = [14811, 10130, 7774, 4900, 513, 6562, 10405, 7154, 11050, 9840, 6349, 2075, 9154, 15958, 13052, 13172, 3840, 616, -3564, -4650, 2988, 6174, 7307, 7589, 3515, 7236, 6213, 7105, 15239, 18756, 25180, 30960, 30267, 23199, 15474, 10961, 8055, 5972, 9654, 11533, 11073, 13235, 11980, 15673, 10210, 4557, 5408, 3194, -1633, -5141, 989, 8614, 13518, 11402, 6283, -4, 2602, 4165, 5043, 4837, 6259, 3196, 6919, 7896, 10551, 8946, 6373, 10834, 12595, 11932, 9822, 7147, 9686, 10471, 7787, 4617, 5429, 42, -24, 3619, 2426, 1648, 5057, 5865, 2065, -2040, 926, 8158, 6478, -1447, -3057, 2681, 3889, 4757, 5967, 2686, 3361, 8769, 16041, 12698, 6082, 14535, 18604, 10776, 8699, 9592, 9929, 4985, 339, 3756, 11479, 11765, 5389, 8356, 4958, 6940, 8266, 8354, 6706, 2401, -1048, -57]
11791e7j248J980o53L268r39k302k372j363L076K732O99n8M295J652k749k8n439
11774D94J93k444M415K656K336n310l274N873N918k770q45J940K775k37k224R52
11758A0448q49n230j217K413J084N371j264n312j801l116k607J197L606k203j140
11743f20q393P394P613L798K207k536j679p23L933l011k859l313K906J547k479
11728C785M44k198O27j557j879N478J901l679O337K637k950K405l142o559n201
11713c551K185P916L959o657L07L234L210L980J907N626O95n924j0576o998J074
11698C87j33K738k452j029L540J371J96l719o44m917M145N847l216O965O781P059
11682B2919k616q656o665m673N087K655M243n60j448P83L39p493k328o32j416
$$ y = [-57, -1305, 675, 22, 3290, 2351, 49, -2323, -3686, -610, 2122, 2821, 2763, 7058, 8710, 5961, 5933, 494, 687, -1757, 2658, 5314, 7650, 2340, -934, 4939, 10857, 8087, 7242, 9182, 11957, 11720, 9496, 10448, 9599, 4369, 3152, 5565, 6649, 12020, 10756, 5444, 3643, 527, -2080, -883, 2723, 520, -620, -9013, -1619, 5994, 9792, 11999, 9463, 7784, 7061, 10994, 7983, 5124, 1811, 4717, 6264, 3785, 4229, 2031, 2658, 1101, -778, 4700, 6601, 2922, 9259, 11896, 8946, 11351, 8209, 1650, -3551, -1366, 6550, 10509, 3852, 4159, 7393, 10603, 14583, 16490, 22116, 22811, 16887, 6311, -687, 387, 254, 2992, 540, -489, 3051, 4422, 4618, 899, 255, -4662, -517, 5330, 2114, 9079, 15860, 22919, 20303, 11647, 4982, 309, 5396, 8051, 12294, 11734, 10286, 11069, 11408, 3915, 1587, 955, -461]
11667d61M264J447J378j321N12J21l491O0M148K902J834l147j07k32l450m09L615
11650G663L555k647m889J940N482L694J178J087o573R18j605o475n089J600M110
11635C949N804K729l763k963K076o382j680K67N39l667J488N709M492K79o480
11620B397L906L635J227J196l794l87Q60k584r814J193r82M001N884l338K06P306
11604A0912N896J796o115o516n066L423o987j1414N598M214j219K993R087M534
11590A1136k380J655R75j0166k526n962m933k201L683K598Q785O788o118q104
11576f770n086J312Q754J1746m581j0391j271J219L781J459M329k86j804K576
11562D987N124p830k382J143q788p567j304j342Q026P336P718K392n948l817k847
$$ y = [-461, 3803, 5250, 6628, 5307, 5819, 5940, 2449, 2509, 6657, 9559, 11393, 8246, 8139, 7907, 4457, 4048, 7663, 11218, 8571, 3682, 5622, 11104, 14798, 15976, 17063, 10490, 11408, 9803, 3328, -1761, -161, 3949, 9753, 12482, 8719, 5756, 7832, 1450, -230, 37, 576, -3091, -1603, 4106, 8598, 8877, 2397, 6303, 9938, 11165, 12361, 8567, 8180, 9040, 6456, -3358, -2165, -3147, 854, 6738, 3400, 3606, 10912, 16808, 18604, 12489, 5973, 907, 4330, -2657, -14071, -8473, -4259, -5478, -2485, 6602, 11136, 8756, 10411, 11386, 1220, -1306, -7268, -12201, -14402, -10719, -8121, 664, 7452, 1334, -6770, -11856, -10544, -1790, 9956, 5375, -5016, -6287, -5068, -1287, 172, 4501, 4215, 2411, 4987, 10111, 2281, -101, 1042, -7746, -15313, -16617, -17959, -9933, -2597, 5121, 7513, 1565, -2252, -5099]
11547e099j064k896l79N899j242M250L880J872j366O107N77L914K920j429o240
11532I704l370j372J168j302K04k64q216l330R86j6J545J3584K321J03M0n756
11516F029m036m019J979J1989n09o006K150l853r873n14M831P937L440K599k337
11501I807o277q118L159M781L58J905L231j103j247K430L006r54n811j582J332
11486D917j264k05j359q25J419j604j749l230m63M565M499n135K774Q325m193
11471F472n938M741M444Q40q296m58p07N129L925k211j4047p794P995L198M84
11456b223q34l26J407K801R581R11L322K969p506k855J437J582j412l951J964
11441F867J366K355M6j0794j636L685L98M077J879n587m993L049K364L673k357
$$ y = [-5099, -6163, -9059, -9438, -3539, -4781, -531, 3349, 5221, 3855, 9962, 10539, 14453, 17373, 15944, 9704, 6334, 4962, 6130, 4828, 5032, 4768, -3448, -6778, -5792, -5808, -4263, 9321, 11642, 11745, 11785, 6029, 1993, -2026, -47, 11942, 11433, 5427, 7577, 3724, -6149, -6663, -1832, 6105, 9545, 12144, 9807, 3530, -4588, -1429, 3352, 3710, 5615, 8846, 7743, 6496, 8926, 11932, 10978, 5167, 3585, 4917, 3653, 3448, 2089, 1264, 2683, 1079, -670, -3900, -4363, 202, 4701, -434, 2340, 10665, 6472, 534, 5275, 9719, 10559, 2263, 1805, 1098, 6227, 10152, 7941, -6106, -13900, -5905, -2707, -2223, -3057, -3383, -1976, 825, 10406, 11317, 14639, 17608, 10102, 7247, 8684, 10266, 8854, 4903, 6867, 8233, 10588, 10634, -160, -1796, 1889, 2287, 6364, 8243, 2656, -2337, 712, 3076, 6749, 4392]
11426D392k394L37l945n489M331Q827K814l904r332L430Q205J0165n073j2091
11412B73m433q62N684p0l960J300N628k908R74q23j589K424k021m408j233L301
11396b723R011L262n777o959n239m883N808J0545Q183l131p270k951K22J088q20
11381a634K70L178L082n37K852O158k368j484k991k692M069O851K666o283n011
11366F126j365J609n91j623j02m845p65L81J801m082j524K588N124M813K300q288
11350A557n125J406J525k207L710L285m552J416k842l876k789J364K301l284L000
11335e111M117l580p343n72Q123P166L625m013o328M773R886P771k746O89k339
11320A4118o896m772k278J335k133j267L187L086Q14J925R83O08n625k816o636
$$ y = [4392, 1998, 2335, -1610, -7099, -2768, 6059, 8873, 4969, -4363, -933, 7272, 17437, 12364, 273, -4160, -5022, 662, 592, -3368, -2068, 3560, 652, 1626, 803, -786, 1638, -383, -4791, -6024, -2723, 6288, 9550, 3773, -3186, -8425, -13308, -7500, 3045, 11228, 8097, 827, -2124, -1902, -814, -1634, -1364, 1814, 4896, 4359, 7211, 13369, 11001, 9517, 6526, 3834, 7903, 14754, 17420, 11137, 6126, 4761, 6370, 5779, 4156, 4054, -791, -1556, -1175, 626, -3456, -4980, -2392, 2732, 7545, 9845, 1557, -3568, -2162, -637, -2844, 866, 4151, -401, 1015, -1827, -5703, -8492, -7128, -4827, -8111, -5111, -994, -4574, -11917, -12489, -4366, 2800, 6425, 2412, -3916, 857, 10743, 18514, 15768, 16457, 14118, 7222, 2450, 172, 1507, -626, -1893, 1294, 4380, 5194, 7119, 8102, 8710, 3085, 269, -6367]
11305f367o819J945L937j196j409N387O558n898p746J716L583J1732j672j766
11291A985K299K204m488n066K735j090m061l273K282L23J0624M592L563j272k013
11276I344o51o826Q99o768l027l035N714O979j503o883l010N682L810j295m515
11261e085k925J866m41K744P315M703k049j015n356K040Q707m999k693l62J627
11246D077L523m646j346J603j771l03o528k636r37K524O666o77J840l789o148
11231h548K622P014P122K671K513M222J101q612o768J978k603M825J51n676l821
11216a809L531N301N979O9J658J523o872p970K088p3J642N453K694l189P73j782
11200I016j020J138o24P439K103l170k820k480r18o781q7K335O16l405l32K733
$$ y = [-6367, -13186, -11241, -7304, -8500, -9909, -4522, 2036, -3862, -11608, -9892, -6309, 5423, 3751, 1985, 4284, 6488, 2000, -3066, -331, -1421, -5482, -8755, -6473, -6150, 4474, 9066, 12629, 11357, 9344, 8693, 1867, 2766, -4002, -7029, -10064, -4350, 2629, 1126, -5757, -8767, -3085, 725, -570, -5085, -8010, -6144, -6585, -3841, 3474, 8177, 6128, 5113, -243, 1797, 10504, 5505, 2812, 2450, 4077, 7600, 2954, 1608, 3211, 1440, 1137, -5391, -8027, -8964, -6440, 226, -451, 1389, -2400, -8548, -5926, 1088, 8210, 10881, 13394, 17616, 18717, 10105, 3337, 5315, 2712, 7537, 7688, 2012, -1809, 1722, 7023, 13002, 13071, 14729, 16252, 9380, 1410, 3498, 3425, 5067, 10520, 13214, 10025, 10798, 9016, 7996, 9134, 8510, 15949, 18052, 14882, 12062, 9582, 8664, 1883, 1796, 4131, 4747, 1342, 1010, 3743]
11184C743L933q414n528K152K043l198k501Q47O11k843Q84L339J047K282o924
11169h527k959K84K955O313N882l887p632J32j187M513j220N196M017L324O31
11154G835k848k00m85J36R345O764l628j0060j581K112l378K821j653m45M679
11139I414j986q206k789M360K229m090M146p186L157L401O513J262l412j55K335
11124H993J212n004RO411j360p465r72M1o066K681L529M046L246m776o053n530
11108g058J918M062J789k86L161Qr336K877q3n710N244N571J811n286o433N275
11092b476O708r1m03q241O399O074j978j2972K682M150L391N397O46K019n112
11077F193k556k774M556K101N10O43j314M360L253n865n458l71l074j185J090
$$ y = [3743, 7676, -738, -6266, -4114, -2071, -5269, -7770, -6923, -6312, -9155, -8271, -4932, -3885, -1603, -8527, -11486, -11202, -8247, -1934, 3948, 61, -7571, -7439, -8626, -4113, -5333, -137, 3880, 7204, 7835, 4987, 4787, 4302, 4438, 13783, 20547, 16919, 6859, 5278, 7390, 4012, 6833, 5180, 4735, 9414, 7428, -778, -3567, 793, 3022, -1068, 3078, -4108, -951, 2450, 8963, 10225, 6813, 6658, 8993, 10205, 5201, 5210, 11621, 10261, 2796, 1824, 1865, -4201, -1520, 2009, 6055, 9301, 4525, -1528, -7058, -5140, -1078, 711, 425, 3586, 3594, -5742, -2865, -2948, -8658, -3414, 2157, 3968, -1318, -7751, -2476, 4232, 4141, 3738, -4503, 1896, 7970, 5992, -6980, -4298, -148, 3243, 8640, 9286, 11305, 6193, 3637, 863, 5419, 7520, 8030, 8673, 7359, 11719, 14972, 9107, 3649, 3278, 204, -981, 109]
11062A09k583K374Q805K293L423L719O07n209m137m492k674m278j2l245L516R237
11046G453J364K38p68k579l3M077l803m640K819R338J812j329n285J637M979K54
11030A5534l752k836m834j259r78K624j405l711P991P305j897R81k893k708m137
11015D025q101q38O630J259k250n584L35K185J411O995Q116R61j433J675k395
11000A2991j12M564l413k001K730m53l188M268J511L649m473j0030m358l048L
10985a360L977N357L400K47m606J897k260k081k353q09R524M259p748l114N69
10970D899n12J380K66P241J88o366Q017l249p202j432N090K691k696j003l926
10955C386n406K937K713J714K024J300K4k435j1457l067R362op656N35L240J975
$$ y = [109, -2474, -100, 8705, 10998, 14421, 18140, 18747, 13538, 9401, 4909, 2235, -2043, -2055, -5300, -1784, 7453, 8817, 9055, 8287, 5708, 5675, 9752, 5949, 1309, 4128, 13466, 15278, 13949, 8664, 10301, 15280, 15534, 11782, 8946, 4112, 2853, 1875, 4499, 3094, -617, 7374, 14679, 12782, 13763, 10870, 8162, 4025, -4076, -4914, 1716, 2975, 725, -4859, -4524, -2339, -928, 6067, 14183, 15144, 13711, 15386, 12991, 12879, 17443, 14030, 12029, 14759, 14306, 11118, 15386, 16897, 20546, 16073, 6043, 1685, -1363, -1360, 2617, 7974, 11374, 11621, 7015, 8912, 6652, 4571, 2218, 1409, 10933, 15192, 7444, 4330, 4899, 4387, 5767, 6033, 13274, 13462, 7096, 15113, 11864, 4662, 3230, 8320, 11011, 8315, 7312, 3386, -2020, 917, 3630, 5344, 7368, 8668, 8692, 6257, -5200, -8267, 1095, 1089, -6567, -6032, -2792, -817]
10939h17P270j67l032M029K826J394J417N741J699o790o514L324n282j306m95
10924C297o201p068L321K547N752N297J264r71K712N790j221n088K537M029N399
10909B1396m91J893j067j1688j528J960n424k778K503L371m362M788j433p13j000
10894E427j1976n383L602O407l01N90j34M606J855k820N74K833O149N39J510J697
10878A5175R114J3049J2097R392J3189L518j7125j0634j0318j0957k842n091m823
10865A3744m619N75J331l710o573n190L027L313K499P057M093l65j268n658l898
10850D358P190j8q843N30K510q41n629J1372L113K88o841J316M4J689K536q882
10834C892l403k97L50j212L016k188Q86O2n784N780k0K910N50n329n295L148M991
$$ y = [-817, 6453, 6286, 3254, 7283, 10109, 11503, 12920, 18661, 20360, 13570, 7056, 10380, 5098, 3792, 3297, -2904, -9972, -6651, -4104, 1648, 6945, 8209, 7238, 9950, 15740, 14519, 9431, 11968, 15997, 21396, 20905, 22798, 21731, 10043, 8515, 10475, 5051, 2273, 4776, 8147, 3785, 8573, 7140, 6427, 5427, -6549, -11932, -8330, -1923, -2224, -1634, -1768, 2838, 4693, 1873, 2447, 5280, 11429, 11968, 13478, 15175, 24289, 37338, 49435, 58827, 72016, 75534, 58409, 47775, 37457, 26500, 23658, 18567, 13744, 9125, 9700, 11031, 7321, 748, -4442, -1415, 1898, 4397, 11454, 15547, 15182, 13914, 8256, 4358, 11548, 11530, 2687, 3217, 5727, 4886, -743, 10629, 13742, 14030, 7189, 8505, 8549, 10238, 12774, 3892, 489, 192, 542, -670, 2346, 158, 1044, 1106, -4678, 1102, 1082, 3992, 4542, -787, -6082, -2934, 2057]
10817B057L649L325q626q055K741j716O436P685J064p045l052M056k906N310P279
10802A2202j023l023R11L072o207r031O88L834j759j683n352L029o14m474N298
10787d132J1009K815r94m520N447j743k929j060q17M996L523M67j093l872M778
10772A1875l15O74k514j354j209J353J597n61L335j455p073O978n89l666l816
10757C260N011M641l248m491J786m490j81J834N335K874P75j043l816k291O88
10742F644j693m14J081k017q51j6J025O966K018m791n498M483O754l828k271r41
10726F651j084n96j310L990R12k959o099J581J217R87K142J572J377J586j154
10711H813M403K999j091n366q526n000M350L849l224N936J984o085K073K641L363
$$ y = [2057, 5706, 9031, 405, -7650, -4909, -6625, -189, 7496, 8560, 1515, -1537, 2519, -387, 4923, 12202, 11179, 8156, 9067, 12139, 5932, -3099, -2411, 1423, -336, -2019, -7371, -4342, -4956, -9430, -4132, 6877, 9692, 8698, 4178, 9625, 7882, 4953, 3893, 3076, 8072, 11595, 12062, 10969, 7097, 11875, 11560, 12234, 9720, 8366, 7157, 8510, 10107, 9546, 12881, 11426, 4353, 11331, 10742, 7076, 3260, 8271, 12912, 9664, 5173, 6959, 2469, 2288, 4122, 9457, 12331, 13106, 12063, 8247, 5956, 6644, 4951, 4537, 5618, 3601, 2750, 2734, 3759, 10725, 12743, 7952, 2454, 6937, 13691, 9863, 7592, 6651, 5567, 4971, 3661, 7651, 8563, 5604, -495, 1086, 2303, 3290, 5432, 7004, 8381, 9967, 8813, 13216, 16215, 15124, 9758, 1232, -3768, 582, 4431, 1207, 7143, 9127, 3042, 5115, 7756, 11119]
10696A1119J4j111n28K15o731N53m61J684O863L074q033q758L299L904N03j791
10680C815m584j311n384j332K041M233k717j48K135R97N763K867o209o405k60
10665f499J0912M775K669q882N550N384n772q161q258Q262j749L907N176m710
10651B604J608M156l919n558O131j540m066o000k064Q338N184K604k416j265O04
10636D401N313M527m378l342R19K127j1052N384N104M73j650k133R075j628m572
10621H568q25J846J736j329m084R11J1416j150j201K001m367L621k859m567J947
10606A1664k122j1469m698Q485M756l121j15L121L337J431p38k348m879k443J801
10591B662P90J99k852K271J351p98O211K660k759n355M34J927N092l849J925k067
$$ y = [11119, 11133, 10022, 9494, 9709, 2978, 3531, 3070, 4754, 11617, 14691, 6658, -2100, 1199, 5103, 5606, 3815, -769, -2080, -7464, -8796, -6755, -2522, -5239, -5387, -3252, -2255, 3508, 6375, 166, -6239, -6499, 4413, 9188, 11857, 2975, 8525, 13909, 8137, -24, -8282, -20, -1769, 2138, 7314, 2604, 4212, 8368, 4449, -1109, 5022, 3482, -584, -6584, -8648, -310, 4874, 7478, 5062, 3797, 4401, 9714, 14241, 9863, 6521, 7440, 9567, -1485, 3899, 9003, 9476, 7826, 5693, 14768, 13140, 8568, 7743, 9589, 11325, 9996, 5912, 6823, 18239, 17089, 15888, 17889, 13522, 17143, 14284, 9717, 11664, 9542, -1927, -6625, 1860, 6616, 3495, 3380, 6501, 9838, 11269, 10531, 8183, 3304, 861, 2662, 3452, 3651, 799, 3070, 4421, 3623, 9834, 12494, 9735, 4380, 4814, 6741, 11833, 7984, 9909, 7842]
10575G842k664j162l57j637O554P245K892J575m011k67m181n813P320k255N022
10560A6103k182j3063j672K255l0M213Q013j841q662R66J0462k96r19K046k780
10545A2613l152M42r19l393P6m835r90K866L213k844K7l027k932K035K892J159
10529C231L550M588k070J756o659K314J76m367J313J533l12N685O410q24Q71j2277
10513D918j0607N153Q667l393n118J230J1022L659k181k371o103K305K774J880
10499A1835M574Q495M641N586L93p650j0139r773o85L110no404j2812l670P698
10484d806J1335K2k48N113J81l174m25j451l070P966L358m399n273l192j216O472
10468G193O994Q481l809j911k611Q67l558N474L596m836p214k957J135J660K315
$$ y = [7842, 5178, 4016, 3659, 2022, 8576, 15821, 18713, 20288, 16277, 16010, 11829, 6016, 13336, 11081, 16103, 13921, 858, -814, 1441, 1411, 5624, 13637, 11796, 3134, 4100, 14562, 14266, 13347, 15393, 12613, 9461, 9903, 8984, 5591, 5667, 832, -158, 2708, 5921, 3077, 3104, 77, -2855, -820, 2072, 3231, 6781, 11369, 9299, 11055, 4396, 6710, 6886, 2519, 3832, 5365, 5053, 10738, 17148, 16324, 17195, 4918, -5689, -536, 8131, 4738, -380, 850, 11872, 15531, 13350, 10979, 4876, 7181, 9955, 11835, 16409, 24904, 29545, 35131, 35524, 27874, 17735, 7962, 7277, 10387, 10382, 3978, -8834, -12504, -4806, 6529, 6551, 6303, 11416, 11597, 8423, 7998, 6547, 3477, 11443, 14801, 10402, 5129, 1937, 721, 7193, 14187, 22668, 18859, 16948, 14337, 15204, 11646, 17120, 20716, 15880, 8666, 5709, 6844, 8504, 10819]
10453A0819K639o17o370J518J0511K116M631M52J1789K5224K6957K2184J1081
10440A22934k3785k9337k7605k1346q875l210N41M590j968p539j19L575N164m329
10426H691O670p9M152L83l106p192l178n430L437O661k413Q16N640j826l68N472
10410A8330K442l346j465l397M76Q84k829q140J872k474M072O597L444n419m930
10395F117n50l44J207J914J066Q85O78K951k079M802L1l630M616k09L44q698J682
10378A0783O15k50M384k89J525J079m580l013K453K068j834m059J280K385P66
10363A3313k483K500M457L749J752k397o144L505N806m367m275o891M134m503
10349H156J625K003l862q9M773n87o15k986J887L621N111k551n862r02m542m948
$$ y = [10819, 13458, 12841, 6471, 7989, 18500, 20616, 25247, 25699, 37488, 62712, 89669, 111853, 122934, 99149, 69812, 42207, 20861, 11986, 8776, 9317, 13907, 11939, 4400, 4281, 7856, 13020, 8691, 15361, 15282, 19434, 19817, 16711, 9519, 6341, 911, 4348, 11009, 8596, 9412, 15052, 13226, 12858, 18330, 20772, 17426, 15961, 12564, 13040, 13924, 11095, 2955, 4827, 2353, 6425, 13022, 16466, 11047, 6117, 5567, 5223, 6430, 8344, 9410, 10295, 10973, 13924, 11845, 16647, 16678, 13048, 17664, 17455, 17799, 9101, 10783, 11398, 11148, 15532, 15243, 16768, 17847, 13267, 10254, 12707, 14775, 12941, 8882, 10162, 12547, 13313, 10830, 13330, 17787, 21536, 23288, 20891, 14747, 18252, 24058, 19691, 15416, 8525, 12659, 8156, 9781, 11784, 7922, 7833, 12606, 12019, 11404, 8418, 10305, 13926, 19037, 16486, 10624, 9722, 5180, 232]
10333B32L129N939O697N686l282O227m667m777j643o184P61N72k70N717L69m459
10317A0047k561M505K658k627K538k43R652q49l129p222o57K976n446l300M898
10302A1240J043L11j840n339q19j62M243L391M387q113j882l04P029N718O737
10287B5640k334r683k309K467L060K118n856J033K116J95j127p2J337k709k884
10272A0992k2o0O271N538K038O35n947P60j911j415K004M322l473J478o543j488
10256A3179j201q815J042J132J1366O862l318j649M947k207k046K061K575K260
10242B6188j295n45q78J222J826m842k63j60j470J936N934k200k973p233o589
10227H658O016M419K504R98o785r651O332L947l990J942k832m327m297M805N863
$$ y = [232, 3361, 9300, 15997, 21683, 18401, 24628, 19961, 15184, 13541, 7357, 8118, 8690, 8420, 14137, 14506, 10047, 7486, 11991, 14649, 12022, 14560, 14317, 23969, 23120, 19991, 12769, 12112, 15088, 9642, 6342, 11240, 12283, 12594, 10754, 5415, 4596, 4434, 8677, 12068, 16455, 8342, 6460, 6156, 13185, 18903, 25640, 23306, 13623, 11314, 13781, 16841, 18959, 13103, 14136, 16252, 16447, 15320, 15248, 16585, 13876, 10992, 10970, 10910, 17181, 22719, 24757, 25392, 19445, 20205, 18294, 16879, 18883, 23205, 19732, 21210, 14667, 13179, 11978, 3163, 4205, 5337, 16703, 23565, 20247, 18598, 23545, 21338, 19292, 21353, 23928, 26188, 24893, 24348, 23470, 24692, 26518, 21676, 21413, 21253, 19783, 21719, 27653, 25453, 22480, 15247, 8658, 14674, 19093, 21597, 22595, 15810, 6159, 12491, 16438, 12448, 14390, 11558, 7231, 2934, 7739, 13602]
10212A3602L237J337J82K980M434k218p706K273M984K010q033k826l419k263L682
10197A2256K438j149l232m034j143J403K016M431R41L859J049L666N961L935m349
10182B8048k806P332N040p929j003m473r173m340M524M329j894P66K764P77n634
10167A6328n466J421M14K874N74J814k770J204K124L128n88L070l031j971N743
10152B4868Q080K584p483o878M91j916Q21o545J047k15N133J376m43k941j0195
10137G784K739R20j633R432N280K201M293l792J32j282n010n898p834k730J135
10122E737J850N589M281l545K532L730M520l835j352q12K723K082J638K845j31
10107B7852n874m504J5J001o368n693N178J0229M190m259n279k3k532K689L193
$$ y = [13602, 16839, 18176, 18358, 21338, 25772, 23554, 15848, 18121, 23105, 25115, 17082, 14256, 10837, 8574, 12256, 14694, 13545, 10313, 6279, 5136, 6539, 8555, 12986, 13927, 17786, 18835, 22501, 28462, 32397, 28048, 25242, 32574, 37614, 29685, 28682, 24209, 15036, 10696, 15220, 19549, 17655, 18421, 21185, 21962, 16328, 10862, 12283, 12697, 15571, 16145, 17959, 15189, 16393, 18517, 21645, 21057, 24127, 21096, 19125, 24868, 32948, 35532, 28049, 21171, 21662, 19746, 20567, 14022, 15069, 14854, 19987, 21363, 20920, 17979, 7784, 10523, 11443, 9810, 19242, 24522, 26723, 31016, 27224, 27356, 26074, 21064, 15166, 7332, 4602, 5737, 7587, 13176, 17457, 13912, 16444, 20174, 24694, 20859, 19507, 18695, 21418, 23500, 25138, 27983, 27852, 21978, 17474, 17489, 18490, 12122, 6429, 11607, 21836, 26026, 21767, 16488, 16465, 13933, 16622, 19815]
10092A9815mk739k00L144j051n618j968M391J71n943l08Q370L650J236L472M560
10076C0978k277l784k817k462R308l124j004J905j962p056L102R35L943M90k20
10061B5955J668J570r897p126K72L654N36J794O098n488n858l145O803M49l262
10046A4023m203J563J873O019j0056o048M603O893L296j858Q95K440N79l792N807
10031B2034j097l587L656N221n75k96j489J721O670R01J964m113n867j793p56
10016B2594j979M663o529k324L955l063L797O887r05k458j965L772j471k589l726
10001A8659q495J891J0885J899o426q046r542L46O454N738N405j116P18k615J930
9986A7685M315M906K794r13n273n396l666Q95O015P021j002l842P81J348l245
$$ y = [19815, 19811, 17072, 16872, 20016, 18965, 13347, 11379, 15770, 15941, 9998, 9690, 18060, 21710, 22946, 26418, 30978, 28701, 24917, 22100, 19638, 28946, 25822, 24818, 26723, 24761, 17705, 20807, 21742, 25685, 26175, 25955, 27623, 29193, 19296, 12170, 12442, 16096, 16632, 18426, 24524, 19036, 13178, 10033, 16836, 17285, 14023, 9820, 11383, 13256, 19275, 9219, 3171, 7774, 14667, 17963, 16105, 17000, 19440, 20019, 16227, 22034, 20937, 17350, 21006, 26227, 25652, 25356, 23867, 25588, 32258, 33159, 35123, 31010, 25143, 23350, 22594, 20615, 25278, 18749, 16425, 20380, 17317, 21114, 28001, 27096, 24638, 22673, 26445, 24974, 22385, 18659, 10164, 12055, 22940, 24839, 18413, 10367, 825, 1171, 7625, 13363, 18768, 17652, 18370, 15755, 17685, 22000, 26906, 29700, 28787, 23514, 18118, 14452, 15347, 21362, 28383, 27381, 23539, 24320, 25668, 22423]
9971B2423K638n59p597O552M760K677M1L035J52n633L60q22J188m598j319R57
9955B4255N072m302r61J455O14m635M204N136k642r184k907M282J887R100j125
9940C0249n007j471P37P988R417k5n376m233J213k672J008o699M26L145o625J433
9924B3508K143K943j927n283O03J170m675l409L915M853K516j57q24M114Q809
9909C8299M763l178j647M638Q28j1715p305L901j070l621N423L88K533l171j213
9894B7853M750K626k808j027l645l41N742k967M49L546K175o09K243m17j0179
9879B7391n258M052L298O719n29m96k539l772J159K867k997o010K192N807N268
9864C7152jJ82J22n581m390n080k194N231R146J110o746l45K861Q334k633N552
$$ y = [22423, 25061, 24502, 16905, 23457, 28217, 30894, 30935, 33970, 34122, 28489, 28849, 28027, 29215, 24617, 23298, 24255, 29327, 25025, 24064, 25519, 26133, 21498, 25702, 30838, 28196, 19012, 16105, 20387, 22274, 31374, 30249, 25242, 23771, 24508, 32496, 41913, 41888, 36512, 32279, 33492, 30820, 31828, 25129, 25555, 28700, 22075, 23508, 25651, 28594, 26667, 21384, 21987, 23157, 18482, 15073, 18988, 23841, 26357, 26200, 25376, 29490, 38299, 43062, 39884, 38237, 42875, 43703, 31988, 24683, 28584, 27514, 23893, 29316, 29704, 32237, 29066, 27853, 32603, 35229, 32421, 31394, 27749, 27408, 33150, 30183, 30632, 34178, 36353, 35744, 37987, 37570, 27391, 22133, 26185, 29483, 36202, 35673, 35177, 32638, 28866, 30025, 32892, 29895, 23885, 26077, 31884, 37152, 37151, 37333, 37455, 31874, 27484, 22404, 20210, 25441, 34587, 35697, 28951, 28606, 31467, 39801, 37168, 42720]
9848D2720N515K265N098N07n03n624q388m027K589K274L771k711o612m180l586
9833B9108K368M20o453M153o32j664K111L813m320m580L15P583P980P495N202
9818E2899j145K051K881L169k144J368Q335J2470J6896N320O196r17j8959k0691
9804F7729j3300m766o768m56N327O656M922R23R87o082p086L36R077m396o325
9789D6778M596J4062J2414M803J5281K7927L9318N7319N0341M8649K7619r154
9777C39953m0099n8278o0423l7133l1909j3646j0637r550J619M813K655l2n180
9764H2153k585L166N497Q687O855J8482J3263J7995K8705L9392N9478Q7226J49507
9751E17821K46834L53596M38807K69379k13650m64383l51558k04766j14126p4334
$$ y = [42720, 48235, 50500, 55598, 56105, 55602, 49978, 41590, 37563, 40152, 42426, 46197, 43486, 36874, 32694, 29108, 31476, 31896, 25443, 29596, 28964, 27300, 29411, 33224, 28904, 24324, 24639, 32222, 40202, 47697, 52899, 51754, 53805, 56686, 59855, 57711, 59079, 67414, 79884, 96780, 102100, 108296, 107379, 88420, 67729, 54429, 49663, 42895, 42439, 47766, 54422, 59344, 60267, 61254, 55172, 48086, 48422, 57499, 53103, 46778, 51374, 65436, 77850, 82653, 97934, 125861, 165179, 222498, 272839, 321488, 349107, 339953, 299854, 241576, 181153, 144020, 112111, 98465, 87828, 78278, 79897, 84710, 87365, 87333, 82153, 79568, 82734, 88231, 96918, 103773, 122255, 135518, 153513, 182218, 221610, 281088, 368314, 517821, 764655, 1118251, 1557058, 1826437, 1612787, 1148404, 796846, 592080, 477954, 403620]
9741D03620n9862n9208o0711l8013k6433j9569j9594q026r143j4230l145j344
9729H4342k912j382j70j297n250p706o924n425M117L269J30N16J359K325n159
9714E9833l144j291N528p762J751J2035N357r364Q95O552p09p614j807M413l434
9699F1239m247P995k96n080M59K965m729o366k991L071j209M21M100P64Q261M540
9683F8897P340j065j749m328o08J869j265l646j28k655j324J150P185l820J60
9668F6013J856L206M000m199n039k047l976m986L066R841O013J946r219l542L896
9653F6829k713j224j358n533j296p61K029j443j369M185Q525L148J930l448m242
9638F3259J026L179m290j439R037p28l971O365L349k400r966j148L800Q062l946
$$ y = [403620, 343758, 284550, 223839, 185826, 159393, 139824, 120230, 112204, 103061, 88831, 85686, 84342, 81430, 80048, 79878, 78581, 73331, 65625, 58701, 53276, 57393, 60662, 60792, 61308, 62667, 64992, 59833, 56689, 55398, 60926, 53164, 54915, 66950, 72307, 62943, 63838, 70390, 69681, 62067, 60260, 64673, 61239, 56992, 64987, 64691, 59611, 60070, 63035, 58306, 51940, 48949, 52020, 50811, 51232, 55332, 56096, 64357, 68897, 76237, 75172, 73423, 69095, 68487, 70356, 69091, 65445, 65317, 62662, 61338, 62488, 69673, 65853, 66013, 67869, 71075, 75075, 70876, 65837, 63790, 59814, 54828, 57894, 67735, 73748, 75694, 66475, 62933, 66829, 64116, 62892, 61534, 56001, 54705, 53944, 55973, 54530, 53161, 57346, 65871, 69019, 70949, 67501, 63259, 64285, 67464, 63174, 61735, 70772, 70044, 66073, 72438, 75787, 73387, 63421, 62273, 66073, 74135, 70189]
9623G0189l004J168k983J581K179j28j667j127l005j578M200P052L774j421l18
9608G4912N008j882n582K071J426P77M340P07Q46J403k628k906L685J036l178
9593H0035k210L618O404K147l798m421j1273j1402O701M525N028K477m234L535
9579G7132J741J85J222L937J97o61j873J621L716M321M249j232K619k952n507
9564H8715p167K746m20p087J099P690J4125P039j532K795K813R05n224j0960p118
9549H8419O154R225q07o376L318K030n86J585k307j956J400K10J0715m57n648
9534A04919L086M799M507J826j925m956K68l703j1099J766J639L798n750n351
9520I3824O19K036L713q1k985L390L932O118p54k188M114O985l264l332N43l73
$$ y = [70189, 67185, 68353, 65370, 66951, 69130, 69002, 67335, 66208, 63203, 61625, 65825, 72877, 76651, 75230, 74912, 79920, 78038, 72456, 74527, 75953, 76730, 81070, 81777, 82623, 84026, 81398, 78492, 82177, 83213, 80035, 77825, 81443, 87847, 89994, 86196, 81775, 70502, 59100, 65801, 70326, 75354, 77831, 73597, 77132, 78873, 79058, 80280, 84217, 84414, 83753, 81880, 83501, 87217, 91538, 95787, 94555, 97174, 94222, 88715, 81548, 84294, 83874, 76787, 77886, 85576, 99701, 106740, 105208, 108003, 110816, 111721, 106497, 95537, 88419, 94573, 103798, 102991, 96615, 99933, 101963, 101377, 102962, 100655, 98699, 100099, 100309, 111024, 110567, 104919, 108005, 112804, 117311, 119137, 117212, 112256, 112524, 108821, 97722, 99488, 101127, 104925, 99175, 93824, 94443, 96479, 100192, 100111, 97126, 100516, 104448, 110566, 109812, 107624, 111738, 118723, 115459, 112127, 112670, 112297]
9504A12297K646K725K682K939K765k578J776q37M651j659P25L480O62l726m410
9489A24138l202n14Q11J866m019q016M420J061j357M115P330J316K063K325M699
9474A37036O640j078k518L030R073M732o884p615n719O494O897m364m719L389
9460A44394M859O802j51m595n271k285K649O778j521k269p497k78J465P37J009
9445A44826J031N953M532J216M565Q521m654p141k947n93N515j584m559l280L557
9430A54958N881Q563M135o10k800J899K176k924j177l381K228L435j064J0453
9416A81772Q693J416k864k016j230J055R02n44L74j859k339L292J1748P634L550
9401B09584j550j009m761m999M854k001N348L597j464p020l977N675M646J0448
$$ y = [112297, 114943, 117668, 120350, 123289, 126054, 123476, 125252, 124415, 129066, 127407, 128132, 131612, 132274, 128548, 124138, 120936, 120422, 121233, 123099, 119080, 111064, 115484, 116545, 115188, 119303, 126633, 127949, 130012, 132337, 137036, 143676, 142598, 140080, 143110, 152183, 156915, 150031, 142416, 136697, 143191, 150088, 145724, 141005, 144394, 149253, 156055, 155904, 151309, 146038, 143753, 146402, 153180, 151659, 149390, 141893, 141615, 143080, 143817, 144826, 145857, 151810, 156342, 157558, 162123, 170644, 165990, 158849, 155902, 155309, 160824, 159240, 154681, 151401, 154958, 160839, 169402, 173537, 172927, 170127, 172026, 174202, 171278, 170101, 166720, 168948, 172383, 171319, 181772, 190465, 191881, 189017, 187001, 185771, 186826, 187728, 187184, 187558, 185699, 183360, 186652, 198400, 206034, 209584, 208034, 207025, 202264, 197265, 202119, 200118, 205466, 209063, 207599, 200579, 196602, 202277, 206923, 217371]
9387B17371j54k496j75l309N360j575j146M820O948L562m782L484K277J890R605
9372B41680N351p51j1532K824L222L871K139n828m394m796J537J925J360R850
9358B46458P389l32j963R272m024L114N820j730n740M250L217q96K748M350P328
9343B79261N45q427J809J1021L636o20m3M124N842L557J372L613L875J568j142
9328C09991q7K66P60L202K177L390L37J373Q960n58J619o09O285l11l619K131
9312C35307Q490Q043M12Q26K33J344N559N056K766K629K194M329M161k097K244
9297C81496Q236N228J985L226Q41M061j010P830M717K281m926k645P51j260J2091
9282D22902J2065Q755p08k243M878Q171O447Q587M400K613K8n025K477O876P078
$$ y = [217371, 217217, 214721, 214546, 211237, 216597, 215022, 213876, 218696, 225644, 229206, 224424, 227908, 230185, 232075, 241680, 247031, 246280, 234748, 237572, 240794, 244665, 246804, 240976, 236582, 231786, 233323, 235248, 236608, 246458, 253847, 253515, 251552, 260824, 256800, 259914, 265734, 264004, 258264, 262514, 265731, 264835, 267583, 271933, 279261, 279806, 271379, 273188, 284209, 287845, 287225, 287182, 291306, 297148, 300705, 302077, 305690, 309565, 311133, 309991, 309904, 310170, 310930, 314132, 316309, 319699, 320036, 321409, 330369, 329811, 331430, 330821, 337106, 336795, 333176, 335307, 343797, 351840, 352252, 353078, 353311, 354655, 360214, 365270, 368036, 370665, 372859, 377188, 381349, 379252, 381496, 389732, 394960, 396945, 400171, 401012, 405073, 404063, 411893, 416610, 418891, 413965, 411320, 412071, 410811, 422902, 434967, 443722, 443014, 440771, 445649, 453820, 460267, 468854, 473254, 475867, 475895, 470870, 473347, 480223, 487301]
9267D87301O385q65K05J3178O155J966N669Q470N149o55P563J0058P659J1232
9253E69470J5104J1063K4924J7456P692k589o149n119n303j773j988N597N684
9240F34069P320J1073P008J6936J4536J2969Q911M139J2220O821j593j04R980
9227G44285J1052J0400J0627R184N142L940M377J0954J3215J6251L3277L5140
9215I07844K8979K8895L4054J2294k1813k1322r748n983m042N195J2348J5848
9203I82549P448P70N313J6546J0548J8744J4188J8649K1158J7719J6115P732J3121
9190A150600P744j541J1111J4097J7462J1461J3536J8641J7198K0529K9709K7789
9178A338336L3831L3962K7375J5416m38N99J5292J7665J5284J5699J7775K3114
$$ y = [487301, 493686, 492821, 493026, 506204, 512359, 514325, 519994, 528464, 533613, 532958, 540521, 550579, 558238, 569470, 584574, 595637, 620561, 638017, 645709, 643120, 636971, 631852, 626549, 624776, 622788, 628385, 634069, 641389, 652462, 659470, 676406, 690942, 703911, 712822, 716961, 729181, 736002, 734409, 734305, 744285, 755337, 765737, 776364, 785548, 790690, 794630, 799007, 809961, 823176, 839427, 872704, 907844, 936823, 965718, 999772, 1012066, 990253, 968931, 959183, 953200, 949158, 954353, 966701, 982549, 989997, 990767, 996080, 1012626, 1023174, 1041918, 1056106, 1074755, 1095913, 1113632, 1129747, 1137479, 1150600, 1158344, 1156803, 1167914, 1182011, 1199473, 1210934, 1224470, 1243111, 1260309, 1280838, 1310547, 1338336, 1372167, 1406129, 1433504, 1448920, 1448482, 1449081, 1464373, 1482038, 1497322, 1513021, 1530796, 1553910]
9166A553910J9871K2457K3855J9277K0391L5472L1457K7151K8750K7091K9373
9155A839055K5486K5348L3794L4610L3628L3734K8292L9385M0495L8139L8293
9144B210259L7634M0366L8462M3246M5818M2678N7023N4207M0768L9198M6669
9133B696328N4972N5670N6475N6437N8835N6580N3167O1299P2260O4861P4236
9122C361120P0125P5660P7908P6376P9493Q0410Q4896Q4305R6386J00037J00717
9111D287433J03923R9932R9951J11039J16294J16448J24953J34115J39152J34838
9101E468078J26301J38261J56278J57854J49132J53196J61883J69373J75397J76415
9091G032168J80169J93848K04020K08817K10132K22458K21665K34365K44331K42879
$$ y = [1553910, 1573781, 1596238, 1620093, 1639370, 1659761, 1695233, 1726690, 1753841, 1782591, 1809682, 1839055, 1864541, 1889889, 1923683, 1958293, 1991921, 2025655, 2053947, 2093332, 2133827, 2171966, 2210259, 2247893, 2288259, 2326721, 2369967, 2415785, 2458463, 2515486, 2569693, 2610461, 2649659, 2696328, 2751300, 2806970, 2863445, 2919882, 2978717, 3035297, 3088464, 3149763, 3222023, 3286884, 3361120, 3431245, 3506905, 3584813, 3661189, 3740682, 3821092, 3905988, 3990293, 4086679, 4186716, 4287433, 4391356, 4491288, 4591239, 4702278, 4818572, 4935020, 5059973, 5194088, 5333240, 5468078, 5594379, 5732640, 5888918, 6046772, 6195904, 6349100, 6510983, 6680356, 6855753, 7032168, 7212337, 7406185, 7610205, 7819022, 8029154, 8251612, 8473277, 8707642, 8951973, 9194852]
9081I194852K52346K61768K70200K72947K76368K81068K86806K94061K99766L04090
9071A1994272L07451L13481L12799L07163L07689L12024L15027L08445L08054
9062A4786405L01353L09267K93411K74157K63297K44945K32721K25321K04568
9053A7135445J84033J55305J38982J21041R2845O5542L5621J2822k370l1403o2773
9042A7845090r6510j17489j31679j53308j67387j95377k10587k35003k51307k67620
9032A6018823k79218k84829k96992l00511k98424l04413l09126l14402l19600
9023A3311308l17528l16967l07528l07458l01018k95795k93126k88535k85779
9014A0597574k82298k71378k61559k61791k58251k52207k36352k22921k24712
$$ y = [9194852, 9447198, 9708966, 9979166, 10252113, 10528481, 10809549, 11096355, 11390416, 11690182, 11994272, 12301723, 12615204, 12928003, 13235166, 13542855, 13854879, 14169906, 14478351, 14786405, 15087758, 15397025, 15690436, 15964593, 16227890, 16472835, 16705556, 16930877, 17135445, 17319478, 17474783, 17613765, 17734806, 17827651, 17893193, 17928814, 17941636, 17939266, 17907863, 17845090, 17748580, 17631091, 17499412, 17346104, 17178717, 16983340, 16772753, 16537750, 16286443, 16018823, 15739605, 15454776, 15157784, 14857273, 14558849, 14254436, 13945310, 13630908, 13311308, 12993780, 12676813, 12369285, 12061827, 11760809, 11465014, 11171888, 10883353, 10597574, 10315276, 10043898, 9782339, 9520548, 9262297, 9010090, 8773738, 8550817, 8326105]
9005H326105k20936k18023k08235j98198j95637k02843j89917j64277j68482j74369
8995F385188j62546j57294j51942j48383j47856j36496j37590j25516j18402j16167
8985D982996j18793j19166j16016j01460j04452j09843r9241q6879r1911r6301
8975C938934q2372q2797p6707p6584p7980p9445p6225o6510o7798o3009o4501
8964C125006n8273o0592o6153o2906n7393n4257n2410n1172m7017m7638m6776
8953B520419m9832m4007m5577m4067l7978l6600l5048m1736l6398l2441l7745
8942B078990l3273m0605m1040l5146k8988k7030l2768k7048l0569k7425k9720
8931A725378k5343k7639k9891k1410k4223k8975k0971j8760j6764j8365k6097
$$ y = [8326105, 8105169, 7887146, 7678911, 7480713, 7285076, 7082233, 6892316, 6728039, 6559557, 6385188, 6222642, 6065348, 5913406, 5765023, 5617167, 5480671, 5343081, 5217565, 5099163, 4982996, 4864203, 4745037, 4629021, 4527561, 4423109, 4313266, 4214025, 4127146, 4035235, 3938934, 3856562, 3773765, 3697058, 3620474, 3542494, 3463049, 3386824, 3320314, 3252516, 3189507, 3125006, 3066733, 3006141, 2939988, 2877082, 2819689, 2765432, 2713022, 2661850, 2614833, 2567195, 2520419, 2470587, 2426580, 2381003, 2336936, 2298958, 2262358, 2227310, 2185574, 2149176, 2116735, 2078990, 2045717, 2005112, 1964072, 1928926, 1899938, 1872908, 1840140, 1813092, 1782523, 1755098, 1725378, 1700035, 1672396, 1642505, 1621095, 1596872, 1567897, 1546926, 1528166, 1511402, 1493037, 1466940]
8920A466940j9465j9669j8281j5998k5054j6859p491j6703j9166k1783j9927j4415
8908A252129o427j7157k1224j4902j2968j9051j4796j8611j3069j0237r517j3357
8896A080813j9935j8785q817j2810n193q383j6279q842j4129j6033j0248j2027
8884I29332j3138p114j0622j0036q451r340j2149o553j1430j0764n670r645q465
8871H05955q309p263j3755j3513j1610m377n388p485j0795p735p760p751m929
8858F95285p987l853j344L07n363q340J405l686o597n799K467N701o15k0814k1432
8843F19335p799r331l660l247q212r696r720q198k004n09n954j653j463p332n102
8828E35455p333l16K858k383l277m710r07o819K726p263k447K480o056o392l530
$$ y = [1466940, 1447475, 1427806, 1409525, 1393527, 1368473, 1351614, 1344123, 1327420, 1308254, 1286471, 1266544, 1252129, 1245702, 1228545, 1207321, 1192419, 1179451, 1160400, 1145604, 1126993, 1113924, 1103687, 1094170, 1080813, 1060878, 1042093, 1033276, 1020466, 1015273, 1006890, 990611, 981769, 967640, 951607, 941359, 929332, 916194, 909080, 898458, 888422, 879971, 870631, 858482, 851929, 840499, 829735, 824065, 814420, 805955, 797646, 790383, 776628, 763115, 751505, 747128, 741740, 734255, 723460, 715725, 707965, 700214, 695285, 687298, 683445, 682101, 682408, 677045, 668705, 670110, 666424, 659827, 654028, 656495, 662196, 661581, 640767, 619335, 611536, 602205, 598545, 595298, 587086, 577390, 567670, 559472, 557468, 556959, 551005, 549352, 547889, 540557, 535455, 528122, 527806, 530664, 528281, 525004, 520294, 519387, 512568, 515294, 508031, 505584, 508064, 502008, 495616, 492086]
8813D92086M886J2660M236L88P554J6470K3321M0069O6678J00631J26485J05592
8801A001056K949j12513j40782j00788m8431j6700n088Q811L6643O4001Q2548
8790G71706J13566Q1080l5072j35228j39359j00283n9751m4784k3450o034r566
8779D12825j2046p822p228j1412j2532l539o126j168j745m743M071j318m606q315
8765C34296k551k272j906M85K926l732j1488p429K614o388r691K2k049n654o306
8750B80877L90k53j802K299m542j456M072k7r87j060m013N444J0241R67q234j0615
8734B71301n568l307R75p217l084J855l504m146j100K52K181k03n158q008R18
8719B36187l722j352K361L471n884k103Nj765J747r40j582j283l818n740k958
$$ y = [492086, 496972, 509632, 513868, 514256, 521810, 538280, 561601, 601670, 668348, 768979, 895464, 1001056, 1004005, 891492, 750710, 649922, 601491, 584791, 579703, 588514, 625157, 689158, 771706, 885272, 966352, 931280, 796052, 656693, 556410, 496659, 451875, 428425, 422391, 412825, 400779, 392957, 385729, 374317, 361785, 358246, 352120, 350952, 349207, 344464, 348535, 347217, 342611, 334296, 331745, 329473, 327567, 328052, 330978, 327246, 315758, 308329, 310943, 304555, 294864, 294886, 292837, 287183, 280877, 281267, 281014, 279212, 281511, 276969, 275513, 279585, 279558, 278571, 277511, 273498, 278942, 289183, 290150, 281916, 271301, 265733, 262426, 263401, 256184, 253100, 254955, 251451, 247305, 246205, 246457, 248638, 248435, 243277, 235269, 236187, 232465, 231113, 233474, 236945, 231061, 228958, 228963, 227198, 228945, 228005, 226423, 225140, 221322, 215582, 212624]
8704B12624q907M525Q407J915L335J157q499j2885k571J159N717J3867J0280R314
8690B39438O220n896j5242j3563l904m167K86j494m636j953N574j737l934j340
8676A93652k394J229M328j787q651j963l705k27l901J000j392k170M84M866k658
8661A76711n302l61J0554K606k950J783m843j1688j51k665p1J889l713p643K339
8646A56495r075m448P751L006k417J089l000M450k194K777L85q98K104M14m99
8631A55940j228j436j048O279n552l855J342pl058o864j117j841l112N07L044
8616A37994L545j180N886j963j3N108j888K130o83j3781l851j714J541O440j41
8601A37430j54l31Q30M583m265k547j126N39K267M553j37L139N440o421r451n557
$$ y = [212624, 203717, 208242, 216649, 218564, 221899, 223056, 214557, 201672, 199101, 200260, 205977, 219844, 230124, 239438, 245658, 239762, 224520, 210957, 207053, 202886, 203172, 201678, 197042, 195089, 200663, 198926, 194992, 193652, 191258, 192487, 196815, 195028, 186377, 184414, 180709, 180482, 176581, 177581, 176189, 174019, 174503, 179369, 176711, 171409, 171048, 181602, 184208, 181258, 183041, 178198, 166510, 166359, 163694, 163623, 165512, 161799, 154156, 156495, 147420, 142972, 150723, 153729, 151312, 152401, 149401, 153851, 151657, 154434, 154819, 153921, 156025, 156439, 155940, 154712, 153276, 152228, 158507, 152955, 149100, 150442, 150435, 147377, 140513, 139396, 137555, 134443, 134950, 137994, 141539, 140359, 146245, 144282, 144269, 149377, 147489, 149619, 148936, 135155, 131304, 129590, 131131, 137571, 137430, 137276, 136945, 137775, 142358, 138093, 135546, 134420, 134959, 137226, 141779, 141642, 144781, 150221, 143800, 134349, 128792]
8585A28792n524j167L780J088l963K128M142k70r652k356O582R50Q11N946J232
8570A32519Q89p743n058K98L037O046K732l276L603R253N369j927o109j136M476
8555A42973N651Q77K737L20L871O205m78O98r12j699n029j3478j7469r451n197
8540A09619j214M472K505k456m070k718J79K846n410n458L88L892L934P25J379
8525A08613M417L868K199J443Q205n028j730P166R586J0292K0342L6232O2558
8512B68163P5282O4928j9556r2502q2280m8275k9043p758m651j1039o853Q467
8500A14883Q315J151J349J0365R744R877J5811J8856J4340k285j8621l4483j9943
8487A29359j1989j0956m740j779j086n772L870P927J686n774K133N353P870R391
$$ y = [128792, 123268, 122101, 125881, 126969, 123006, 125134, 129276, 129006, 119354, 116998, 123580, 124530, 125341, 131287, 132519, 133408, 125665, 120607, 120905, 123942, 129988, 132720, 129444, 133047, 142300, 147669, 145742, 139633, 138497, 142973, 148624, 149501, 152238, 152558, 156429, 162634, 162156, 162854, 161942, 160243, 155214, 141736, 124267, 114816, 109619, 108405, 112877, 115382, 112926, 108856, 106138, 106317, 109163, 103753, 98295, 98683, 102575, 106509, 107234, 108613, 113030, 116898, 119097, 120540, 128745, 123717, 121987, 129153, 138739, 149031, 169373, 205605, 268163, 343445, 408373, 388817, 296315, 214035, 165760, 136717, 128959, 124308, 113269, 106416, 114883, 123198, 124349, 125698, 136063, 145807, 155684, 171495, 190351, 204691, 202406, 183785, 149302, 129359, 117370, 106414, 101674, 99895, 98809, 93037, 96907, 104834, 106520, 100746, 102879, 108232, 116102, 125493]
8473A25493K01j0784j4018q665m817j844l142j305J951p23n173j255j436m289
8459G0194L582P007K959k018m038M45K049j041o88K400k349j387p721k617k02
8444F6575L854m06o89P32K095L195J05p98m263j751J627n198K383m075M75J627
8428F5488K546N977O227J34L956p0p194J538m57n788j1616L997L705N813r80o342
8412F6934K682K838J613J135n175M474L070J252R5R74j895m036N639J3941k39
8397I3302M653M992M860Q776J8643J5718l462j5991k4986j7831j522J5902K3819
8384A26873J5173N036k296k1424j8523j7712j2663k834k807J781M434N21o545
8371F9014j761r28n99N09l651m553K831k475K678p72N215L959j729k432Q528J4063
$$ y = [125493, 125694, 114910, 100892, 92227, 87410, 85566, 82424, 81119, 83070, 82347, 77174, 75919, 74483, 70194, 73776, 80783, 83742, 81724, 77686, 78131, 80180, 79139, 78451, 80851, 78502, 77115, 69394, 66777, 66575, 70429, 70023, 69334, 70066, 72161, 75356, 75461, 74663, 70400, 68649, 70276, 65078, 67461, 63386, 63861, 65488, 68034, 74011, 80238, 80372, 84328, 84258, 77064, 78602, 78145, 72357, 60741, 64738, 68443, 74256, 73276, 66934, 69616, 72454, 74067, 75202, 70027, 74501, 77571, 78823, 78918, 79892, 77997, 73961, 79600, 93541, 93302, 97955, 102947, 107807, 116583, 135226, 150944, 147482, 131491, 106505, 88674, 87152, 103054, 126873, 142046, 147082, 144786, 123362, 104839, 87127, 74464, 71630, 68823, 70604, 75038, 75559, 69014, 67253, 66325, 65726, 66235, 62584, 58031, 60862, 58387, 61065, 60293, 65508, 69467, 67738, 65306, 73834, 87897]
8355H7897J1927J9070K1591J7426K38k4250j9466j8108j9653r172q855M651L220
8342F6516m230o866l923O247M032M565q929l648N19J842j74J54L950M06J588K901
8326F4950q13O636M889J919Q636J8407J1320J6240J619j6524k0358k0207j4591
8313F2123o617M486R613k699k999l897Q879r8M257M214p032j0734p922J589n97
8298E2566p315n69l585L98K669N992M29k247N396j771q286j018r51O063N955l410
8282E0316J212r90K321Q2K397K357o868j65O119k721j187L542l80J155k384n864
8266D8942l23K78l828j215l650j870K863M084l629k307M08j911j010N526P455
8251D9813Q343J3820n755o315o386m691j118l187J467r024q757L279L105J496
$$ y = [87897, 99824, 118894, 140485, 157911, 158149, 133899, 114433, 96325, 76672, 67500, 58645, 63296, 66516, 62286, 55420, 51497, 57744, 61776, 66341, 57412, 53764, 54283, 56125, 55951, 56105, 60055, 60461, 62049, 64950, 64137, 70773, 75662, 77581, 86217, 104624, 115944, 132184, 133803, 117279, 96921, 76714, 62123, 55506, 59992, 69605, 66906, 63907, 60010, 68889, 68791, 73048, 77262, 70230, 59496, 51574, 53163, 52566, 45251, 44682, 41097, 41495, 44164, 50156, 50585, 48338, 53734, 51963, 43677, 42659, 41708, 47771, 53726, 50316, 51528, 50538, 52859, 52941, 55338, 57695, 50827, 50662, 56781, 54060, 52873, 56415, 56035, 57190, 54806, 48942, 48619, 48897, 45069, 43854, 40204, 38334, 41197, 45281, 41652, 39345, 39753, 37842, 36832, 42358, 49813, 58156, 71976, 66221, 59906, 53520, 48829, 47711, 44524, 45991, 36967, 28210, 31489, 34594, 36090]
8237C6090J399m07M867N073j576o558m817k872J617J2250R530n836l058J884n420
8222D2166R64p10l276p74n491J355J597J728l946m193Q929M653m76j289m875j412
8206C4950O83k808l169k930m074l479k013Q219O307J485m109k659K189M976J671
8191C5239m316J824N623k217n58Q771m299m161n9L033R27L328p207j46K377r08
8175C7251k643l196K395j66o800m26Q517J541R24l008p90n639q52J639J173K194
8159C2114O42O374M972P850O173o434o427m424l891j277J568L551l133m219q215
8144B5224n351m565r21L094M911J507l696J67N922J1102k144l498j30N217K818
8129C9657o396m279P704L206o729o245O500Q918j890p953J316Q609J136m207q519
$$ y = [36090, 37489, 37082, 41949, 47022, 45446, 38888, 34071, 31199, 32816, 45066, 54596, 48760, 45702, 47586, 42166, 43130, 42420, 39144, 38370, 32879, 34234, 35831, 37559, 33613, 29420, 38349, 43002, 42526, 41237, 36362, 34950, 35633, 32825, 29656, 26726, 22652, 19173, 17160, 25379, 31686, 33171, 29062, 26403, 28592, 33568, 35239, 30923, 32747, 38370, 36153, 35595, 44366, 40067, 35906, 35847, 38880, 39807, 43135, 35928, 35782, 38159, 37251, 34608, 31412, 33807, 33641, 26841, 26415, 34932, 36473, 37397, 34389, 33599, 27960, 27108, 28747, 29920, 32114, 32756, 39130, 44102, 51952, 58125, 51691, 45264, 40840, 36949, 35672, 37240, 40791, 37658, 33439, 25224, 19873, 15308, 14387, 17481, 22392, 23899, 20203, 20370, 26292, 37394, 35250, 31752, 31622, 36839, 39657, 33261, 28982, 36686, 39892, 33163, 26918, 33418, 42336, 40446, 32493, 33809, 42418, 43554, 39347, 30828]
8114C0828q321k815K771J780m857n26O750O043K371O198N649m886j509m281O48
8099C5843M395k847l329m084k248K092M278N537j539k899n051l175J981k919q027
8084A8008j266P320j98k602n3j440o87O120k702k327P218P0J370q12J006j413
8068B7612k758j867L691l991L982R346k362j870q871J188J336k736m387M523O600
8053B9436n560l474p63O255L825r676j541J523o36N885J336L040K305L869J507
8038C7331k242m856K094J757j343l954p04j188L444m150p625K805Q142N794j829
8023C3476k801p116L852O911J249m70j744m412j443M7m216M308N294l14l713o183
8007B2725P63k440L114o15J132R070k578l611M095K974M583N399l015n106l59
$$ y = [30828, 22507, 19692, 22463, 24243, 19386, 18860, 25610, 31653, 34024, 40222, 45871, 40985, 39476, 35195, 35843, 40238, 37391, 34062, 29978, 27730, 29822, 34100, 39637, 38098, 35199, 30148, 26973, 28954, 26035, 18008, 16742, 24062, 23864, 21262, 21209, 19769, 19082, 25202, 22500, 20173, 27391, 27461, 28831, 28019, 29025, 27612, 24854, 22987, 26678, 22687, 26669, 36015, 33653, 31783, 22912, 24100, 25436, 22700, 18313, 22836, 29436, 23876, 20402, 19639, 25894, 29719, 20043, 18502, 20025, 19389, 25274, 26610, 29650, 31955, 35824, 37331, 35089, 30233, 32327, 34084, 32741, 28787, 28083, 26895, 30339, 26189, 18564, 21369, 29511, 35305, 33476, 30675, 23559, 27411, 34322, 35571, 35101, 33357, 28945, 27502, 27549, 23333, 27641, 32935, 32621, 28908, 22725, 23488, 21048, 24162, 23547, 24679, 33749, 31171, 27560, 31655, 34629, 39212, 44611, 41596, 36490, 36131]
7992C6131K284j950j874p72m974m343J823K804L015K311M449k177l22l029n15
7977C2861L329n053m808L07P923M796o720r390j256L350L810k275M5L500R17l064
7961B8272L188M627j9n409M02m257J379O308j10J172p386o854K331L599K330O140
7945C5713Q305o84q769p204n341J364r36m570K004K430J674j073O551l610m242
7930B1612k608N991M700K117k85p279j988J144O453M677Q982j31n331p512M099
7915C4641o54K893P622K559n780L11j572m093J896j303q780l676j589q52R523
7900C1146M616k698l50l947L03J683m054j792P506j756l648K931O082r86n613
7885B9423o8N609Q304J883k690n325l500m342Q51o606J659M733L590l605O451
$$ y = [36131, 38415, 36465, 34591, 33819, 28845, 24502, 26325, 29129, 32144, 34455, 38904, 36727, 36405, 33376, 32861, 36190, 31137, 26329, 26636, 34559, 39355, 32635, 23245, 21989, 25339, 29149, 26874, 26919, 30419, 31336, 28272, 31460, 36087, 36068, 30659, 31061, 26804, 28183, 34491, 34381, 35553, 28167, 21313, 23644, 27243, 29573, 35713, 44018, 43334, 34565, 27361, 22020, 23384, 22448, 17878, 19882, 22312, 23986, 22913, 29464, 25854, 21612, 19004, 24995, 29695, 31812, 31527, 24248, 22260, 23404, 29857, 34534, 43516, 43385, 38054, 30542, 34641, 33987, 36880, 44502, 47061, 41281, 41592, 40020, 35927, 37823, 36520, 27740, 24064, 22475, 21623, 31146, 35762, 33064, 32714, 28767, 29070, 30753, 26699, 24907, 32413, 30657, 27009, 29940, 36022, 35036, 29423, 29355, 34964, 43268, 45151, 42461, 37136, 33636, 29294, 30145, 23539, 25198, 29931, 33521, 29916, 36367]
7870C6367J405l387o405o465j254L270R140l801q88k572j097M901j101m300O58
7855B4471P484O899K87l364j799m337k279p729o208n410J0484J617m738R77K957
7840A9312k526l460J78N227J997L03L062O38M190N38l980j954p247o494j461P780
7824A6103k191j365j176j010J240N875Q68N9m992J13K75J616r30J958K631j830
7808A7244K917O764k570p376o086J397M641r43l991n4J090k331j692J340o269
7793D081K099k698N448K953k926M227O152p234n510L196K356J197j478l654J0073
7778A8282M707m045m800m821j713M844M775o303N790N927k086j681O80k403j539
7763A5614j00J475j84m74l482J312P195J368l174n736j370j15l08q296j242Jk642
$$ y = [36367, 37772, 34385, 27980, 21515, 20261, 23531, 32671, 28870, 27982, 25410, 24313, 29214, 28113, 23813, 24471, 31955, 38854, 39141, 35777, 33978, 29641, 27362, 19633, 13425, 8015, 18499, 20116, 15378, 16355, 19312, 16786, 13326, 13504, 18731, 20728, 21031, 24093, 24731, 28921, 29459, 25479, 23525, 16278, 9784, 8323, 16103, 13912, 12547, 11371, 10361, 11601, 17476, 18344, 18403, 13411, 13524, 13799, 15415, 14485, 16443, 19074, 17244, 20161, 26925, 24355, 16979, 10893, 12290, 16931, 15988, 11997, 11943, 13033, 10702, 9010, 10350, 4081, 6180, 3482, 8930, 11883, 8957, 13184, 19336, 12102, 6592, 9788, 12144, 13341, 11863, 8209, 18282, 22989, 18944, 14144, 9323, 7610, 12454, 17229, 10926, 16716, 22643, 20557, 18876, 19556, 17153, 15614, 15514, 16989, 16805, 16331, 12849, 14161, 21356, 22724, 19550, 13814, 12444, 12329, 12021, 3725, 2483, 2484, -158]
7746a58J447J595N857L685j428J642l074l871J956J93J82K758R008J266m276l600
7730A3182J915Q215m30n424n855l464K76j562j675K08J420k561K881K905L937
7715A3968l08J725o42j971Q785j389p539J069L303j129k528j109k005l238N30
7700G522Q368J104O276N94o197k119k398o659k630N059J137R90L582p06m135j303
7684H485j247q0Q7o351q417Q711J249K268l002n866K57Q326M33k513K529K277
7668G146p706o67J0630N478n386o167J265l972J570J2059k286k548l302k498J0075
7653A3691K463o961k224J274K611J778N32J565M473l404q303J014n019k88k017
7638A185j830j588M070l101O48M392L398N514j25l38m337m515r63n901K308J1083
$$ y = [-158, 1289, 2884, 8741, 12426, 10998, 12640, 9566, 5695, 7651, 7844, 8026, 10784, 19792, 21058, 16782, 13182, 15097, 23312, 22882, 17458, 11603, 8139, 8415, 6853, 5178, 5386, 6806, 4245, 7126, 10031, 13968, 13660, 15385, 14743, 12772, 21557, 20168, 12629, 13698, 17001, 15872, 13344, 12235, 10230, 6992, 7522, 15890, 16994, 23270, 23864, 17667, 15548, 13150, 6491, 3861, 8920, 10057, 11047, 14629, 13923, 9788, 8485, 7238, 7158, 7245, 894, -7523, 1188, 2437, 4705, 1703, -4163, -3906, 4420, 4853, 2340, 4869, 7146, -560, -1227, 9403, 14881, 9495, 3328, 4593, 621, 2191, 14250, 11964, 9416, 6114, 3616, 13691, 16154, 9193, 6969, 8243, 10854, 12632, 13164, 14729, 19202, 15798, 7495, 8509, 3490, 3202, 1185, -645, -2233, 1837, -1264, -616, 3776, 7174, 12688, 12563, 12225, 7888, 3373, 2410, -3491, -1183, 9900]
7622I900j671J825K864l188l05M76m583k775m57N272j671o071k860K824O231K923
7606H734l309N50Q778R344o821k740o884M68K527L879m010K57j383n97l892m629
7590B72l407J61L567K848M618J345n643K009K106L53m73n576j316l788m999O759
7574a164K200n30r71k922N946Q61n629K936L533k355Q7L668L825j09l91m879J227
7557E333L527m642l776M73k120n692j703P22L679J920L792N89J762k44P41L23
7541D684k839R65M526n045p996J903O123L748j288Q567k839j807Q58J698j641
7526I617j441L876O169j541o062O897o87j830l052q162q240K024R92M742P552
7511A0854J53O3k264R65Q28J95j542K421m903K76k52j867j28K558K762k322k453
$$ y = [9900, 8229, 10054, 12918, 9730, 9425, 9901, 5318, 2543, 2086, 7358, 5687, -384, -3244, -420, 5811, 8734, 5425, 5975, 14753, 24097, 17276, 14536, 7652, 8120, 10647, 14526, 10516, 10773, 9390, 8793, 4901, 272, -3135, -2974, 593, 3441, 8059, 9404, 3761, 5770, 7876, 8229, 7756, 2180, 864, -2924, -7923, -1164, 1036, 506, -465, -3387, 2559, 3420, -2209, 727, 4260, 1905, 1992, 5660, 9485, 9376, 8985, 4106, 5333, 8860, 4218, 442, 915, -1205, -6897, -8600, -7878, -4199, -2279, 1513, 2102, 3864, 3620, 4361, 4684, 1845, 2810, 7336, 2291, -5705, -3802, 2321, 6069, 4781, 13348, 10509, 8702, 9560, 11258, 9617, 8176, 12052, 18221, 16680, 10618, 17515, 16828, 14998, 11946, 3784, -4456, -2432, -1440, 3302, 10854, 11007, 11070, 8806, 9771, 10599, 10794, 9252, 11673, 6770, 7046, 6794, 4927, 4799, 7357, 10119, 7797, 5344]
7494E344n816l466k934m614R216J1544N656k480k368j941K870p47j985l764q283
7479c768k121K984P54n02O308j90j527j61K493K588J833q376k174m73M230K07
7463B105j62K744L892j416j787l707m337M286M311K366L072k08p62K63j807M749
7447A3602l96K125j913m164o344N110P196J69k439k524k323n816O662O99l884
7432E760m17Q0L758J123p94k188k824l939N958N129n020m49q869j819N988l174
7416a697J37M780M257k728K512q97k496j986P822O32k242O47k860k898K299L251
7400H533N16J5178J300j3352q347l316o87M137J092l252k985O10j504m144J54
7385f067L964k453l37L371K065K744j150K25N169N960n398r60M13l261n212l729
$$ y = [5344, -472, -3938, -6872, -11486, -2270, 9274, 14930, 12450, 10082, 8141, 11011, 10264, 8279, 4515, -3768, -5889, -2905, -2151, -2653, 3655, 3465, 1938, 1777, 4270, 6858, 8691, 315, -1859, -2332, 1898, 2105, 1943, 4687, 8579, 7163, 5376, 1669, -2668, 1618, 5929, 8295, 11367, 11159, 10397, 10660, 8853, 13602, 13206, 15331, 13418, 9254, 2910, 8020, 15216, 15385, 12946, 10422, 8099, 2283, 8945, 9644, 5760, 5343, 5423, 9181, 10304, 9510, 7322, 4498, 559, 6517, 11646, 6626, 6177, -2692, -4511, 1477, -1697, -1560, 3220, 7477, 4749, 7261, 6364, 3868, 1882, 9704, 10336, 8094, 8741, 5881, 2983, 5282, 8533, 9049, 24227, 25527, 12175, 3828, 512, -175, 3962, 5054, 1802, -1183, -573, -2077, -6221, -6067, -2103, -4556, -4893, -1522, 543, 3287, 2137, 2362, 7531, 13491, 8093, 7133, 7546, 4285, -927, -4656]
7369d656P205k299o963n148M775P538Q574J12J127M448M58J92K560k46m96QJ3
7352A7202l160M426j706q268j650K756R3N281j407n882j767k343L89m1j357m020
7336a454J346J400J869M334o544r42L59L616M262O063K573N255k05k510l95k857
7320A6170o717n32K386n401q04k866q698q001M661Q5l254J860j2P455N746N113
7304G191M110m244j351N89k971J04N833l508q302m798L144N867k195n679k881
7289i091j507N962K630k632M115J1711n598r966m491K269j448N87j491m840K869
7274a0921M555K731M968p35M96J885j64M157P1j523m86k984m414r00p2J486J776
7257g4L984j061K581l42R291O151j0429j2115n468J700k107N777N38L73p38N648
$$ y = [-4656, 2549, 250, -6713, -11861, -7086, 452, 9026, 9138, 10265, 14713, 15171, 15363, 17923, 17677, 17181, 17189, 17202, 14042, 18468, 16762, 8494, 6844, 9600, 9693, 14974, 13567, 7685, 5918, 3575, 3964, 3923, 2566, -1454, -108, 1292, 3161, 7495, 951, 9, 368, 3984, 8246, 14309, 16882, 22137, 21932, 19422, 19027, 16170, 9453, 8921, 11307, 5906, 5102, 2236, -6462, -14463, -9802, -9717, -12971, -11111, -11123, -3668, 2078, 7191, 11301, 7057, 5706, 6295, 3324, 3428, 9261, 5753, -2549, -7347, -4203, 1664, -531, -6210, -9091, -10598, -4636, -2006, -4638, -523, 11188, 5590, -4376, -8867, -6598, -8046, -7459, -8950, -13790, -10921, -6366, -3635, 1333, 598, 1094, 2979, 2815, 6972, 7043, 5520, 5034, 2050, -2364, -3264, -3336, -1850, -74, 3910, 2849, 5430, 5088, 14379, 20530, 10101, -2014, -7482, -5782, -7889, -2112, -1574, -1201, -1939, 3709]
7241C709m953M745k800k220Q238L555L282n239j737l619k819j371N347P02Q052
7226A2872K067Q48n694k964j0928J805O571P887p964j2502J327O351n143l463
7212h930R251o244o6M140K188J3752k87j1625r212R641Q762k535r162j8J10l235
7196c470l536m68P356P891k490j956l845j356N922Q818Q2J745j804q77q626q769
7180e383l702N37j506m894l472L501Q396Q458J2141n337p591J429n247L120k542
7165b092j0807L872N102q50P64R555J0950j140m501l859L968J588j606k958M315
7150A2301k906p469j846R26N38N47J239j0346p083L666N780M338J182L752R528
7135A4147O318N60o80j44K04n519o683k260n943l247n479m607R63K621K605j935
$$ y = [3709, -1244, 3501, 701, -1519, 6719, 10274, 13556, 8317, 6580, 2961, 142, -1229, 4118, 4820, 12872, 14939, 15787, 10093, 7129, -3799, -1994, 4577, 12464, 4500, -8002, -6675, -324, -5467, -8930, 321, -5923, -5989, -1849, 339, 14091, 13804, 2179, -7033, 2608, 11370, 8835, -327, -345, -235, -3470, -7006, -7474, -118, 7773, 5283, 3327, -518, -1874, 4048, 12866, 12948, 14693, 12889, 12012, 3386, -5383, -9085, -8548, -10054, -14948, -18420, -14919, -6523, 1935, 14076, 8739, 1148, 2577, -2670, 450, -2092, -12899, -9027, -3925, -4775, -4011, 5544, 16494, 15354, 10853, 6994, 10962, 12550, 10944, 7986, 12301, 9395, 1926, 80, 1006, 1544, 2091, 3330, -7016, -14099, -10433, -4653, -315, 867, 4619, 14147, 20465, 21025, 20345, 20201, 20405, 14886, 8203, 5943, 0, -3247, -8726, -13333, -12370, -9749, -7144, -9079]
7119i079L135M839M907N484K318l12r072j1353k433N436N4K587N075P209o859
7104A936k697J188j752l455K270O381l277k508m245K753M926J27J068L917L279
7089I911K022k210o386l030M151k494o482Q32J274J012n00m815m523k425j574
7074a5237K141L831m320L99L517l376L352P416n851n007K352Q265J887J026M125
7059D520q73P388k616l972l037K738j647j167m83k086Q698N972J271J483j2228
7044C961j359K490j753q914J79l266n871o983L458K611k944M385L158K990J0318
7029B460Q84J405J45M266O21k325q71m877l210n560o23L937l583l255P18l36J646
7012h558R664j268N177L112K917m711m066k069j430k084k706L453j974r049p482
$$ y = [-9079, -5944, -1105, 3802, 9286, 11604, 11292, 2220, -9133, -11566, -6130, -6076, -3489, 1586, 8795, 1936, -761, 427, -1325, -4780, -2510, 3871, 594, -1914, -6159, -3406, 1520, 1647, 2715, 6632, 9911, 11933, 9723, 3337, 307, 4458, 1964, -4518, -3686, -2412, -1400, -1900, -6715, -11238, -13663, -15237, -13096, -9265, -13585, -13186, -9669, -13045, -9693, -2277, -8128, -13135, -10783, -2518, -631, 395, 4520, 3647, 11035, 8419, 4447, 1410, 4148, 2501, 1334, 851, -1235, 7463, 13435, 14706, 16189, 3961, 2602, 5092, 3339, -5575, -5396, -8662, -14533, -21516, -18058, -15447, -18391, -14006, -10848, -7858, 2460, 3344, 4749, 4894, 9160, 9781, 7456, 6585, 1708, -1502, -7062, -7685, -3748, -7331, -10586, -9868, -10204, -8558, 1106, -162, 5015, 8127, 11044, 6333, 2267, 198, -1232, -3316, -6022, -2569, -4543, -13592, -21074]
6997b1074N977J0949L780l3O045Q79m449r54q900r479L985N385j290n840L773
6982a1246N646K22J470L888J277k95L343L699k851p901K880P006o02K467J872
6967A0875k099m169M305K809l073pN57r78j688m08L031l573k202P231o794n019
6951a202l286N87O983M391k985o392j295N238n72N888l68j0235m229p33P104o4
6935a170L367q8n762k638J854o26k569O480N292P490N68l586j1910q892Q561Q55
6919b774n882O320J2635O51n850n700O395M299j504l477k214L134L353q64l788
6904D734K700L108M134L11m956O993k861n458J3k57j928o9j71n295k623K796M095
6887E266j729O325p069j1183P372Q48m927k331o93k250k231M942J336j469l327
$$ y = [-21074, -15097, -4148, -368, -401, 5644, 6523, 2074, 1120, -7780, -17259, -13274, -7889, -9179, -15019, -11246, -5600, -5378, -3908, -20, 1257, 962, 4305, 8004, 5153, -2748, 132, 7138, 6536, 9003, 10875, 8776, 4607, 8912, 11721, 8648, 8641, 9198, 8220, 6532, 6124, 9155, 5582, 3380, 10611, 3817, -1202, -4488, -3901, 3082, 7473, 4488, -1904, -3199, 2039, 1467, 7355, 6987, -3248, -7477, -8210, -1106, -1170, 2197, 2109, -3653, -6291, -4437, -5063, -7632, -1152, 4140, 11630, 12198, 8612, -3298, -12190, -3629, -2774, -8656, -2336, 10299, 10950, 5100, -600, 5795, 10094, 8590, 5113, 2899, 6033, 9386, 8522, 4734, 7434, 10542, 14676, 14987, 10031, 17024, 14163, 8705, 8718, 8461, 6533, 6464, 6293, 998, -1625, 1171, 5266, 3537, 9862, 2793, -8390, -1018, -170, -5097, -7428, -8121, -10371, -12602, -7660, -6324, -7793, -11120]
6872a1120O519n812M725K031O156Q388P06o302o609J37Q59K67n362k354j206k289
6856a1266P070K296r89Q196o00j04j513k557o218J494Q738m331o761L679j628
6841d494J095L579M596K741q81K975j928o353j58l919J337L76p83l799k236J611
6825f241k741M519J398J043K687P82n82j155j056M966L531n809N623J0398p906
6810I457j2813p310Q171P812m297j564N844J798k574R115j209p551l159k59K332
6795C793K773k920J572J504N58q16o930l376J971r83J994r42K753P594j90J066
6779I421j313n756j780Q529N689l544j956n060J050M81p187l600Q437O174J607
6764A1192M15j703j423j360j677j453q573r3L727n244K648m04L326O872M336J926
$$ y = [-11120, -4601, -10413, -5688, -3657, 2499, 10887, 11593, 5291, -1318, -1181, -322, -55, -5417, -7771, -8977, -11266, -4196, -1900, -2889, 5307, 4707, 4603, 3090, 533, -5685, -4191, 4547, 216, -6545, -2866, -4494, -3399, 180, 4776, 7517, 6636, 9611, 7683, 1330, 1172, -2747, -1410, -1034, -1817, -5616, -7852, -6241, -8982, -4463, -3065, -2022, 665, 1447, 865, -290, -1346, 3620, 7151, 1342, 6965, 17363, 9457, -3356, -10666, -2495, 5317, 1020, -544, 5300, 7098, 4524, 13639, 12430, 4879, 1720, 1461, 3793, 6566, 3646, 5218, 6722, 7280, 6464, -466, -3842, -1871, -2854, -860, -1802, 951, 8545, 8355, 9421, 8108, 2352, 572, 9101, 14790, 11246, 9290, 4230, 5280, 5761, -1426, -5026, 3411, 9585, 11192, 11607, 9904, 8481, 7121, 5444, 3991, -4582, -4675, -948, -6192, -3544, -3948, -622, 6250, 10586, 12512]
6748A2512m669p237P010K221J15l149k156L112M379M961k54q835k569j19k791
6733B531K625k544m172l838o3r84k128L770O536Q905N846M38j0840j929m7j632
6717B474j10M596M517J3K888k493p183M465k192J219n479K081P292M510l515j1448
6701A635K79L682K623J92k450l253J077L619K282M301n882J975j316j0227j873
6686c336K971o5l19l170N410L237L282P64l380N331Q2M408m89l846n957j41p316
6669b534n815M553L892K62L303M154p83k789M480j165j0001l416r34k110L851
6654e052M693l83j739k367k538O97K611M454J120l258j292J0606P647j982l419
6639I798o814p237m559p0N06K1L022R138K045M134k913n241j022k874J494J0665
$$ y = [12512, 7843, 606, 7616, 9837, 9952, 6803, 4647, 7759, 12138, 17099, 16845, 8010, 5441, 5322, 2531, 5156, 2612, -1560, -5398, -5461, -6445, -8573, -4803, 1733, 10638, 16484, 16922, 6082, 4153, 4106, 2474, 2364, 6960, 11477, 11490, 14378, 11885, 4702, 9167, 6975, 8194, 2715, 4796, 12088, 16598, 13083, 1635, 1914, 5596, 8219, 8411, 5961, 2708, 3785, 7404, 9686, 13987, 8105, 10080, 8764, -1463, -3336, -365, -430, -749, -3919, 1491, 4728, 8010, 8774, 5394, 10725, 10807, 15215, 14726, 10880, 4923, 4782, -2534, -8349, -3796, 96, 358, 3661, 7815, 7032, 4243, 8723, 7558, -2443, -5859, -6793, -8903, -5052, -359, -742, -2481, -4848, -7386, -6689, -4078, 376, 1496, -1762, -3054, 7552, 15199, 13217, 9798, 2984, -4253, -8812, -8882, -8376, -8355, -5333, 3805, 5850, 9984, 7071, 1830, 808, -2066, -572, 10093]
6623A0093l165r561j083L68j208L417L954J576l254n839R61J673J140J009K055
6608B136N72j794m611j320K981J754l153n882P17L208K386P81j0614J678N450
6593e711j959M421J270m008n255m175J618P267L047P569Q696Q65m90l491n138
6578D526J963J439J979J235L918m52L208M50m493p385p868o026q12L120R13j600
6562e885j846N211N99J995K061P75R39J361l569l692m553j962Q181Q983n77J540
6546I561j033o582q539K208N399l576p752k741k085O996N504K117K587J370n154
6531a720K263M997m554o210j390q95K667L631J775q521n728L580L829N806K474
6516B004k522l827m728j947P058L364m58m752J03k014j776L426O564L347n420
$$ y = [10093, 6928, -2633, -3716, -3348, -4556, -1139, 2815, 4391, 1137, -4702, -3741, -2068, -928, 81, 2136, 2708, 914, -3697, -5017, -2036, -282, -3435, -9317, -8600, -5392, -3006, -2225, -12839, -11161, -5711, -7670, -3249, -1979, -5987, -11242, -15417, -13799, -6532, -3485, 4084, 12780, 13645, 13155, 9664, 4526, 6489, 7928, 9907, 11142, 15060, 14608, 17816, 18266, 13773, 6388, -1480, -7506, -8318, -5198, -4285, -5885, -7731, -2520, -1921, 74, 2135, 2910, 3849, 5210, 1641, -2051, -6604, -8566, -385, 8598, 8021, 9561, 8528, 1946, -6593, -4385, 1014, -2562, -10314, -13055, -15140, -8144, -2640, -523, 2064, 3434, -1720, 543, 5540, 986, -5224, -6614, -7509, -4842, -1211, 564, -7957, -13685, -10105, -6276, -470, 2004, -518, -4345, -9073, -11020, -3962, -598, -1056, -5808, -5705, -7719, -9495, -6069, 495, 3842, -1578]
6501a578o134N797J817N63R74M943k560m492N535P43j640q70n29p074l305N213
6485b597P660o777l713Q416k276n056k131l034J073L784K556q65m506l584M438
6470f612O493k639J040J364k973j493r49j159k424M083K604N246k851m592k688
6455g550K104J189m443J975K394pr79J08k691K46M263L689M012n536l494K335
6439b385k110K73O32M373k337K574R62M39n11R50K566j558K165l557p98K83J410
6422C371j396K93q39l844p242j541Q426K367j331L284j405r016k068L312j044
6407h673N829P72p922p50j764l667P239R942P533j475o433p88J579K769q121J450
6391b480L339K932M158p902j651p367k310M766O292K733M916j392k547l547q109
$$ y = [-1578, -7712, -1915, -98, 465, 1439, 6382, 3822, -670, 4865, 5608, 3968, 3098, 2569, -4505, -7810, -2597, 5063, -1714, -5427, 2989, 713, -4343, -6474, -9508, -8435, -4651, -2095, -2960, -7466, -11050, -6612, -119, -2758, -1718, -354, -3327, -4820, -5769, -6928, -9352, -5269, -2665, 2581, -270, -4862, -7550, -5446, -4257, -8700, -6725, -4331, -4338, -5317, -5209, -7900, -7654, -3391, 298, 4310, -1226, -4720, -2385, -4495, -4222, -3590, 783, -1554, 1020, 1982, 2421, 1910, 2860, 5426, 3868, 6033, 2476, 1678, 1961, 3371, 1975, 2268, 1429, -2415, -9657, -11198, -2772, -405, -1736, 1548, 143, -8873, -10941, -7629, -8673, -2844, -2072, -9994, -10744, -12508, -16175, -8936, 1006, 8539, 7064, 631, -157, 1422, 4191, -3930, -2480, 859, 3791, 7949, 47, -1604, -8971, -11281, -6515, -223, 2510, 7426, 6034, 3487, -60, -8169]
6376h169N283P538p307k896L706Q288n68j728j983J254k283J772J764J862m579
6361A954o368l344J848M911K680k373m608M505j578N911j802m182n564r05j276
6346a0191N110R606M984l693k367o033o95K452p41K019M346P16j2221o369J542
6331a1535l870M185J571N028L510R86K702l667k523P132L248j260o000L170P76
6316C453m359J066J586l968m63L726m981j552K339k22M17J400Q220n58o960J885
6300A029N620l279n574M280J948j172n928j853L90P988K689q50j566k192l991
6285b461k44l636j535j696P443O564N287k205M66O884m536j101J448p08K836L802
6269A6608q142k698l24J833q15l662r83o08j0190j794L309L269M530J479J786
$$ y = [-8169, -2886, 4652, -2655, -5551, -1845, 6443, 5875, 4147, 2164, 3418, 1135, 2907, 4671, 6533, 1954, -4414, -7758, -5910, -999, 1681, -692, -5300, -795, -2373, 3538, 1736, -2446, -8010, -8915, -10191, -5081, 4525, 9509, 5816, 3449, -2584, -3279, -827, -1568, 451, 4797, 5513, -6708, -13077, -11535, -15405, -11220, -9649, -4621, -1111, -125, 2577, -1090, -3613, 3519, 6767, 5507, -493, 2677, 3453, -906, 160, 1746, -2222, -2685, 1041, -3940, -5492, -3153, -3375, -2958, -1558, 6662, 6104, -856, 1029, 6649, 3370, -2204, 2076, 4024, 2852, -3076, -4929, -4539, 3449, 6138, 5288, 3722, 1530, -2461, -2705, -6341, -7876, -9572, -2129, 4435, 9722, 7517, 7983, 14867, 10331, 9230, 10678, 9970, 12806, 16608, 8466, 5768, 5444, 7277, 6462, 2800, 1817, 1209, -8981, -10775, -7466, -4197, 333, 1812, 3598]
6254C598o72l437o070L779j227n691K915N327M31l284N649M411P198j370m709
6239F848o096j70K006J826j813Q9o228k294Q88l277k443N849K580J028O099l113
6223A779l915K673p821k329M112L152O87k846l07k648R606M695l357q179j66O360
6207A496L874m884j942j898K383M749K139o32q87o00q084p58N264J991L401q10
6191D802O23K487O403k872p453k310J329k21K894k309m270m270O412r68j64L73
6175D86M095r93j720l323j449K833N606K488p771j736M417j382l155J650j560
6160a514l540j027j82k447m499N240P520N866j409m43L935k200p098l21K206j927
6144a840r80N45o748J388L242J277j0923m253L579K565N324O795m120j433K802
$$ y = [3598, 2926, -511, -6581, -2802, -4029, -9720, -6805, -1478, -1047, -4331, 1318, 5729, 12927, 11557, 6848, 752, 582, 2588, 4414, 2601, 2690, -3538, -5832, -4944, -8221, -10664, -4815, -2235, -1207, 4892, 1779, -2136, 537, -7284, -9613, -5501, -2349, -1662, -4508, -4815, -7463, 2143, 6838, 3481, -4698, -4864, 1496, 5370, 486, -1456, -3354, -971, 3778, 5917, 5285, 4398, 3798, -4286, -5044, 220, 2211, 5612, 4802, 5425, 7912, 14315, 11443, 3990, 1680, 3009, 2788, 5682, 3373, -897, -5167, 1245, 277, 113, 486, 4581, 3588, 1868, -1455, -2904, -71, 5535, 8023, 252, -1484, 2933, 1551, -1604, 46, -1514, -5054, -6081, -6263, -8710, -13209, -7969, -449, 5417, 4008, 3565, 7500, 5300, -1798, -2119, 87, -1840, -2820, -2275, -9023, -7635, -4393, -3116, -14039, -18292, -14713, -12148, -6824, -29, -4149, -5582, -2780]
6129b780K897l4L953N690j379q059P3j261p575k221K987M92J700M621L102O057
6113H263k037p026n06Q66k413l348J454M666m162p91r32P113N467p880o74Q214
6097F274K140n441m325L557m827o928R918M771j0214m565O773N594J283j545k49
6082B216O55M225k024j361l275n198l270N794O209o294K210K918K66J122o431
6067b238K956M601l198r37l522q755L471J3576m386m216N68K836m437l724r4K430
6051e069N415r94P50J410N609k545l155p724j675K697k448j947K205M913r39j264
6035d761N515J905K552k896j48K502m665l851m421k775M4R292P294J990j675q687
6019b785n812K442N912N880M646o81k844O49m453J44L565k783m293j329p687J573
$$ y = [-2780, 117, 83, 4036, 9726, 8347, 288, 361, -900, -8475, -10696, -7709, -7217, -5517, -896, 2206, 8263, 6226, -800, -1306, -440, -2853, -6201, -4747, -81, -4243, -5034, -5966, 1147, 6614, -1266, -1940, 6274, 8414, 2973, -1352, 2205, -2622, -9550, 368, 5139, -5075, -9640, -2867, 2727, 4010, 2465, 2216, 2871, 7096, 5072, 3711, 436, -4762, -8032, -2238, 3971, -2323, -113, 2805, 3071, 4193, -2238, 718, 5319, 2121, 1184, -2338, -11093, -7622, 5954, 1568, -2648, -2080, 756, -3681, -7405, -7499, -5069, 346, -648, 102, 1512, 7121, 4576, 1421, -6303, -7978, -5281, -7729, -9676, -7471, -2558, -3497, -4761, 754, 2659, 5211, 2315, 2167, 4669, 4, -3847, -8268, -11043, -10999, -1707, 5587, 7577, 5902, -2785, -8597, -6155, -243, 5637, 10283, 9602, 6758, 7407, 2954, 3098, 6663, 3880, -413, -1742, -9429, -7856]
6003g856M405N735k284m220K026k941M817o365k192M980J611P68l516j8q17K98
5987e569J274J483N158J78l88l681l169P42M70o502N557M842P614K394j112n078
5971D213n168L883l93k431p904j881K909R277M424o346J932j73j649l020o955
5956i282K593J130M147l757j0903M735L28j339o121n978j66j52P825J444N749
5941i747N87L214M099r63J513M803l090m507N36j030N30j515J381K7K528L421
$$ y = [-7856, -3451, 2284, 0, -4220, -2194, -5135, -318, -6683, -8875, -3895, -2284, -1516, -5032, -5050, -5867, -5569, -4295, -2812, 2346, 2524, 2136, -1545, -4714, -3972, -3502, -10004, -4447, 395, 8009, 10403, 9291, 4213, -955, 2928, 2535, 104, -7800, -9681, -6772, 2505, 6929, 583, 2515, 2342, 693, -2327, -9282, -6689, -5559, -1412, -5169, -16072, -11337, -11009, -12348, -18469, -24447, -24613, -24765, -16940, -15496, -9747, -9160, -5946, -1847, -2810, -1297, 3506, 416, -4091, -3555, -4585, -4055, -5570, -4189, -4162, -1634, 1787]
$$ [...]
##END NTUPLES=NMR SPECTRUM
##END=
