##TITLE=Analysis number 328017
Compound Code cc 64701
Book Reference 508/88
Project Code adrs
Chemist Name antons
##JCAMPDX= 6.0         $$ Bruker NMR JCAMP-DX V2.0
##DATA TYPE= NMR SPECTRUM
##DATA CLASS= NTUPLES
##ORIGIN= Bruker BioSpin GmbH
##OWNER= nmr
$$ XWIN-NMR		Version 3.5
$$ Wed Apr 25 13:01:49 2007 GMT Daylight Time (UT+1h)  MAYBRIDGE\nmr@NMR_250MHZ
##.OBSERVE FREQUENCY= 250.131544655141
##.OBSERVE NUCLEUS= ^1H
##.ACQUISITION MODE= SIMULTANEOUS (DQD)
##.ACQUISITION SCHEME= undefined
##.AVERAGES= 16
##.DIGITISER RES= 18
##SPECTROMETER/DATA SYSTEM= dpx250
##.PULSE SEQUENCE= zg30
##.SOLVENT NAME= DMSO
##.SHIFT REFERENCE= (INTERNAL, DMSO, 0, 16.522)
##AUDIT TRAIL= $$ (NUMBER, WHEN, WHO, WHERE, WHAT)
$$ ##TITLE= Audit trail, XWIN-NMR		Version 3.5
$$ ##JCAMPDX= 5.01
$$ ##ORIGIN= Bruker BioSpin GmbH
$$ ##OWNER= nmr
$$ C:\u/data/dgb/nmr/ADRS/3100/pdata/1/auditp.txt
$$ ##AUDIT TRAIL=  $$ (NUMBER, WHEN, WHO, WHERE, WHAT)
(   1,<2007-04-25 13:01:16.70 +100>,<MAYBRIDGE\nmr>,<NMR_250MHZ>,
      <created by zg, POWCHK disabled, PULCHK disabled
       configuration hash MD5:
       76 6E 9A 78 1E 09 19 81 EC 84 63 8F B0 6A 59 2D
       data hash MD5: 64K
       E7 C8 FF 36 5F 25 B5 0D 49 AD 80 F5 AB 5A 2B 1C>)
(   2,<2007-04-25 13:01:30.68 +100>,<MAYBRIDGE\nmr>,<NMR_250MHZ>,
      <Start of raw data processing
       ef LB = 0.3 FT_mod = 6 PKNL = 1 SI = 32K 
       data hash MD5: 32K
       33 A6 78 5B 6B 7C 6E 48 38 76 27 F4 FE BF 2F 08>)
(   3,<2007-04-25 13:01:33.09 +100>,<MAYBRIDGE\nmr>,<NMR_250MHZ>,
      <apk 
       data hash MD5: 32K
       DA AF 40 18 33 B2 FA EC 1B A0 C5 E8 13 64 C9 27>)
(   4,<2007-04-25 13:01:34.01 +100>,<MAYBRIDGE\nmr>,<NMR_250MHZ>,
      <abs ABSG = 5 
       data hash MD5: 32K
       89 23 B9 C6 17 54 6B 04 F6 3B 7D 0D 47 65 96 1A>)
$$ ##END=
$$ 
$$ hash MD5
$$ 3A EF 68 91 C3 67 3E 2A 01 62 00 09 C0 2E 7A 70
##$RELAX= 
##$RELAX= 
##$RELAX= 
##$RELAX= 
##$RELAX= 
##$RELAX= 
##$RELAX= 
$$ Bruker specific parameters
$$ --------------------------
##$DU= <C:\u>
##$EXPNO= 3100
##$NAME= <ADRS>
##$PROCNO= 1
##$TYPE= <nmr>
##$USER= <dgb>
##$AMP= (0..31)
100 100 100 100 100 100 100 100 100 100 100 100 100 100 100 100 100 100 
100 100 100 100 100 100 100 100 100 100 100 100 100 100 
##$AQSEQ= 0
##$AQ_mod= 3
##$AUNM= <au_zg>
##$AUTOPOS= <26 >
##$BF1= 250.13
##$BF2= 250.13
##$BF3= 250.13
##$BF4= 250.13
##$BF5= 500.13
##$BF6= 500.13
##$BF7= 500.13
##$BF8= 500.13
##$BYTORDA= 1
##$CFDGTYP= 0
##$CFRGTYP= 5
##$CHEMSTR= <none>
##$CNST= (0..31)
1 1 145 1 1 1 1 1 1 1 1 1 1 1 1 1 1 1 1 1 1 1 1 1 1 1 1 1 1 1 1 1 
##$CPDPRG= <>
##$CPDPRG1= <>
##$CPDPRG2= <>
##$CPDPRG3= <>
##$CPDPRG4= <mlev>
##$CPDPRG5= <mlev>
##$CPDPRG6= <mlev>
##$CPDPRG7= <mlev>
##$CPDPRG8= <mlev>
##$CPDPRGB= <>
##$CPDPRGT= <>
##$D= (0..31)
0 1 0 0 0 0 0 0 0 0.06 0 0 0 0 0 0 0.0002 0 0 0 0 0 0 0 0 0 0 0 0 0 0 
0 
##$DATE= 1177502475
##$DBL= (0..7)
120 120 120 120 120 120 120 120 
##$DBP= (0..7)
150 150 150 150 150 150 150 150 
##$DBP07= 0
##$DBPNAM0= <>
##$DBPNAM1= <>
$$ [...]
##$SUBNAM7= <"">
##$SUBNAM8= <"">
##$SUBNAM9= <"">
##$SW= 20.6930455092707
##$SWIBOX= (0..15)
0 0 3 0 0 0 0 0 0 0 0 0 0 0 0 0 
##$SW_h= 5175.983436853
##$TD= 65536
##$TD0= 1
##$TE= 683.16
##$TE2= 300
##$TE3= 300
##$TEG= 300
##$TL= (0..7)
0 120 120 120 120 120 120 120 
##$TP= (0..7)
150 150 150 150 150 150 150 150 
##$TP07= 0
##$TPNAME0= <>
##$TPNAME1= <>
##$TPNAME2= <>
##$TPNAME3= <>
##$TPNAME4= <>
##$TPNAME5= <>
##$TPNAME6= <>
##$TPNAME7= <>
##$TPOAL= (0..7)
0.5 0.5 0.5 0.5 0.5 0.5 0.5 0.5 
##$TPOFFS= (0..7)
0 0 0 0 0 0 0 0 
##$TUNHIN= 0
##$TUNHOUT= 0
##$TUNXOUT= 0
##$USERA1= <user>
##$USERA2= <user>
##$USERA3= <user>
##$USERA4= <user>
##$USERA5= <user>
##$V9= 5
##$VALIST= <valist>
##$VCLIST= <CCCCCCCCCCCCCCC>
##$VD= 0
##$VDLIST= <DDDDDDDDDDDDDDD>
##$VPLIST= <PPPPPPPPPPPPPPP>
##$VTLIST= <TTTTTTTTTTTTTTT>
##$WBST= 1024
##$WBSW= 4
##$XGAIN= (0..3)
0 0 0 0 
##$XL= 0
##$YL= 0
##$YMAX_a= 240706
##$YMIN_a= -243162
##$ZGOPTNS= <>
##$ZL1= 120
##$ZL2= 120
##$ZL3= 120
##$ZL4= 120
##$ABSF1= 16.522
##$ABSF2= -4.171173
##$ABSG= 5
##$ABSL= 3
##$ALPHA= 0
##$AQORDER= 0
##$ASSFAC= 0
##$ASSFACI= 0
##$ASSFACX= 0
##$ASSWID= 0
##$AUNMP= <proc_1d>
##$AZFE= 0.1
##$AZFW= 0.1
##$BCFW= 0
##$BC_mod= 0
##$BYTORDP= 0
##$COROFFS= 0
##$CY= 12.5
##$DATMOD= 1
##$DC= 0
##$DFILT= <>
##$DTYPP= 0
##$F1P= 14.0000005364418
##$F2P= -0.99999901652339
##$FCOR= 0.5
##$FTSIZE= 32768
##$FT_mod= 6
##$GAMMA= 0
##$GB= 0
##$INTBC= 1
##$INTSCL= 1
##$ISEN= 128
##$LB= 0.3
##$LEV0= 0
##$LPBIN= 0
##$MAXI= 10000
##$MC2= 0
##$MEAN= 0
##$ME_mod= 0
##$MI= 0
##$NCOEF= 0
##$NC_proc= -4
##$NLEV= 6
##$NOISF1= 0
##$NOISF2= 0
##$NSP= 0
##$NTH_PI= 0
##$NZP= 0
##$OFFSET= 16.522
##$PC= 1
##$PHC0= -61.13315
##$PHC1= 7.798384
##$PH_mod= 1
##$PKNL= yes
##$PPARMOD= 0
##$PSCAL= 4
##$PSIGN= 0
##$REVERSE= no
##$SF= 250.13
##$SI= 32768
##$SIGF1= 0
##$SIGF2= 0
##$SINO= 400
##$SIOLD= 32768
##$SREGLST= <1H.DMSO>
##$SSB= 0
##$STSI= 32768
##$STSR= 0
##$SW_p= 5175.98343685301
##$SYMM= 0
##$S_DEV= 0
##$TDeff= 65536
##$TDoff= 0
##$TI= <Analysis number 999999
Compound Code 99
Book Reference 9
Project Code 9>
##$TILT= no
##$TM1= 0
##$TM2= 0
##$TOPLEV= 0
##$USERP1= <user>
##$USERP2= <user>
##$USERP3= <user>
##$USERP4= <user>
##$USERP5= <user>
##$WDW= 1
##$XDIM= 32768
##$YMAX_p= 383982524
##$YMIN_p= -310285
$$ End of Bruker specific parameters
$$ ---------------------------------
##NTUPLES= NMR SPECTRUM
##VAR_NAME=  FREQUENCY,     SPECTRUM/REAL,   SPECTRUM/IMAG
##SYMBOL=    X,             R,               I
##VAR_TYPE=  INDEPENDENT,   DEPENDENT,       DEPENDENT
##VAR_FORM=  AFFN,          ASDF,            ASDF
##VAR_DIM=   32768,         32768,           32768
##UNITS=     HZ,            ARBITRARY UNITS, ARBITRARY UNITS
##FACTOR=    0.157963299565203, 1,           1
##FIRST=     4132.6476996994, 0,             0
##LAST=      -1043.33573715361, 0,           0
##MIN=       -1043.33573715361, -310285,     0
##MAX=       4132.6476996994, 383982524,     0
$$ Real data points
##PAGE= N=1
##DATA TABLE= (X++(R..R)), XYDATA
$$ [...]
24772g2101Q7334Q8898K3829J6761K5221k994m4948r0864P170j5171K4110R5669
24760A42914m4047k4920n7577j3205L8674N3389K491m2712l9064Q5981o1116m3928
24748c120m1039l5059j1133N4260k6823J9879L3824J20188N7591m8452j9500k6747
24736G3869J6034J5188L9420k1762K7107m0815n2349k1701M3993K7193o1351q8500
24724d3674k3037M500K9474l5793J3196Q1527J8222n7318o5384j9048K261J4086
24712h0988q981l6178K1491O1411L7982n3156j2474p2103Q245O8313K3772k5199
24700f7865k5397Q912P1731P5917L3142q9942l6460K062k1626J08282K8267j15713
24688b8690m6388L642M5875J32019Q3407j42725r8386J2179l4778k2633K0931
$$ plain form
24772 -72101 15233 104131 127960 144721 169942 166948 122000 31136 38306 23135 47245 142914
24760 142914 98867 73947 16370 3165 41839 95228 97719 55007 15943 101924 40808 -3120
24748 -3120 -44159 -79218 -90351 -36091 -62914 -43035 -9211 110977 168568 120116 100616 73869
24736 73869 89903 105091 144511 122749 149856 109041 56692 34991 78984 106177 44826 -43674
24724 -43674 -66711 -62211 -32737 -68530 -55334 26193 44415 -12903 -78287 -97335 -95074 -80988
24712 -80988 -89969 -126147 -104656 -43245 -5263 -58419 -70893 -142996 -134751 -66438 -42666 -67865
24700 -67865 -93262 -84350 -12619 63298 96440 6498 -29962 -27900 -49526 58756 87023 -28690
24688 -28690 -75078 -71436 -25561 106458 189865 47140 -51246 -39067 -73845 -96478 -75547
24677g5547k9644N7309O2268l904m4532N3207P9594L6281m3283j8794J8161k3381
24665F7735N3635o726k8414q4586N3571N5395K8180J2649p3420j00533k3688l7000
24653h3202m1501N2878M3131m2218r5029j33165j1179P1192R1948K2025M018Q5895
24641c5207P7731J9356K9399n1766o7194k229M804k824O5708j4766k5867m8132
24629e0987n1637k5540n851O8182J892L8520p20k5295L2747O0610n0202j14909
24617a23190n0588J47765P3469k3822m6789m8944L6755Q2911M7984K24Q232k9585
24605G4422J2517o967J1113L1224n8243k6658j02514M8990P8276O1355m4414p3298
24593E803O5492L7338n6059l113L608p562q336p67l6366j7021O2077n9897j8010
$$ plain form
24677 -75547 -105191 -47882 14386 10482 -34050 19157 98751 135032 91749 72955 91116 67735
24665 67735 121370 114644 86230 1644 55215 110610 138790 151439 78019 -22514 -46202 -83202
24653 -83202 -124703 -71825 -28694 -70912 -165941 -299106 -310285 -239093 -147145 -125120 -121102 -35207
24641 -35207 42524 61880 91279 39513 -27681 -29910 -25106 -27930 37778 23012 -2855 -50987
24629 -50987 -102624 -128164 -134015 -65833 -63941 -25421 -26141 -51436 -18689 41921 -8281 -123190
24617 -123190 -173778 -26013 47456 23634 -23155 -72099 -35344 47567 95551 95775 104007 74422
24605 74422 86939 79972 91085 122309 64066 37408 -65106 -16116 62160 123515 79101 5803
24593 5803 71295 108633 52574 49461 53069 45507 37171 36404 38 -16983 45094 -14803 -32813
24580c2813Q359L5897M2491l5215L9843O6108m6580p2992n668m0257J4628Q1458
24568E5259P1396k2256M2511j18204q3864j6796Q7696J3559j02377o685J58270
24557G8509N1321l3553k5891r5847p4105o906N1694L0377P4885M2505l3190k266
24545E7533j0002j02440L7905l5427l8413J4935J2301j2422o479M1409L203j8520
24533e6417Q404j3559N8458o0034n8984N9497M3708l003P560m5678j1695o5317
24521a37060o2924K4924K938k2783m2496O9508J38619J28328r6812J9125M1852
24510F3219n6633m9847n1452k3119k099k9331m2682j363P1791M6041k122J6103
24498f1494j8433l1564K2507K3294q1748l1992l228O8005O1881l2469m4362L9559
$$ plain form
24580 -32813 -24454 11443 53934 18719 58562 124670 78090 5098 -570 -40827 -26199 55259
24568 55259 126655 104399 146910 28706 -55158 -71954 15742 29301 -73076 -79761 78509
24557 78509 129830 96277 70386 -25461 -99566 -106472 -54778 -24401 50484 92989 59799 57533
24545 57533 47531 -54909 -17004 -52431 -90844 -75909 -63608 -76030 -82509 -41100 -37897 -56417
24533 -56417 -48013 -61572 -3114 -63148 -122132 -62635 -18927 -21930 -14370 -60048 -71743 -137060
24521 -137060 -199984 -175060 -172122 -194905 -237401 -167893 -29274 99054 2242 21367 63219
24510 63219 6586 -43261 -94713 -117832 -119931 -149262 -191944 -193307 -121516 -75475 -77597 -61494
24498 -61494 -79927 -111491 -88984 -65690 -147438 -179430 -182658 -114653 -52772 -85241 -129603 -90044
24486i0044N0639M6818m1067n4294m3233L0103K610l0090N7048J01978k5396l0162
24474b5090K6936N1360j5327o4219l9975M5768k0524L3452K0006N4561M6369p4493
24462C8824r3668k1097j3618p10r271k9158O0561J8126M2766J24407j5115q039
24450I4008m4901l3378J1012k4446L4140K3251J0885l3324k2399L9204m4941l3646
24438b4535L8177m7061j6001j0337l647J26376N6157r5278q46J07450j6057j20154
24426e756r4332M6034k031P2362j2630n4535M8886j6710K6623K4198J119O874
24414D0102K6443K8603l0849r0594k1690P025Q629l1268Q974m3626j774K1443
24402g8582k9877l718k2114L7148O1726l2205o0996o3615L6610O378n7821N0824
$$ plain form
24486 -90044 -39405 7413 -33654 -87948 -131181 -101078 -98468 -128558 -71510 30468 5072 -25090
24474 -25090 1846 53206 37879 -26340 -66315 -20547 -41071 -7619 12387 66948 113317 38824
24462 38824 -54844 -75941 -89559 -90269 -99540 -128698 -68137 -50011 -7245 117162 102047 94008
24450 94008 49107 15729 26741 2295 36435 59686 70571 37247 14848 54052 9111 -24535
24438 -24535 13642 -33419 -49420 -59757 -63404 62972 119129 23851 23005 130455 114398 -5756
24426 -5756 -100088 -54054 -56085 16277 3647 -50888 -2002 -18712 7911 32109 33228 40102
24414 40102 66545 95148 64299 -26295 -47985 -40960 -32331 -63599 -54625 -98251 -100025 -78582
24402 -78582 -108459 -112177 -134291 -97143 -35417 -67622 -128618 -192233 -155623 -149245 -207066 -156242
24390a56242Q9890R906K4044K9332L9747l2665q0342j8069j7342j1447K81K5293
24378i7614n9882P6027n648o417N5742J6350O9610R783L5988m2577j96k9649K5942
24365D7459M8816r34J6727R395m9714M462K7984k2601n4834n6986J0760J00691
24353H1225K7529r9487r85K6094l2186N9924q3652j08511j4302P2395M4782K7393
24341B19L9228M7686J0038l0699j6014o1747Q229P1766L0274j4435K1836r793
24329I6588j10480p4872M483N9288l1783j07259k815J69475J8881j3402K2095
24318C0199K5017l4902Q1730R3784r295q0132j0266L3584J8265J9743j20786l3714
24306A3227N1420m1615k5414P0112J6395l7402k9538O363p765p2453K8227O6787
$$ plain form
24390 -156242 -66352 -56446 -32402 -3070 36677 4012 -76330 -94399 -111741 -123188 -122907 -97614
24378 -97614 -157496 -81469 -87117 -93534 -37792 -21442 48168 57951 93939 51362 51166 21517 47459
24365 47459 96275 95341 112068 121463 71749 76211 104195 81594 26760 -30226 -19466 81225
24353 81225 108754 9267 8282 34376 2190 62114 -21538 -130049 -144351 -71956 -27174 219
24341 219 39447 87133 97171 66472 50458 -11289 -3060 68706 98980 84545 106381 96588
24329 96588 -13892 -88764 -84281 -24993 -56776 -164035 -166850 2625 21506 8104 30199
24318 30199 55216 20314 102044 195828 186533 106401 96135 129719 147984 167727 46941 13227
24306 13227 64647 23032 -2382 67730 84125 46723 17185 23548 15783 -56670 -28443 38344
24294C8344M6450l9473r2227o1089L302M7426J6796j7719l326L3466K9998M5086
24282D7034j3233n931p777q695j3670K297k1943m0455Q1542k3289l7102j2950
24270e4172l02j6721J8039N7669k832r0046M0812K0822J7913p043k563J7359l235
24257d300l444o8396r015M2840k4617j3925L8688k8112o0081p6080K7308Q3837
24245i5297K9912K8249j4203r9990M1196M4556L4759L5274r7880J445L4497L8609
24233a8873p1781q652L6101J12957L0226q4689O952N1128j2440Q9206j4983o5970
24221D9182L3014j1295J2560o7212L797m2270J557J509O5247J6032n1167L1327
24209D2281k258m5866q920o0897j06964n0635J00727P1627l352j3277M997K6304
$$ plain form
24294 38344 84794 45321 -46906 -107995 -104693 -57267 -40471 -58190 -61516 -28050 1948 47034
24282 47034 33801 27870 20093 11398 -2272 25 -21918 -62373 19169 -4120 -41222 -54172
24270 -54172 -54474 -71195 -53156 4513 1681 -88365 -47553 -26731 -8818 -15861 -18424 -1065 -4300
24257 -4300 -7744 -76140 -85155 -42315 -66932 -80857 -42169 -70281 -130362 -206442 -179134 -95297
24245 -95297 -65385 -37136 -51339 -151329 -110133 -65577 -30818 4456 -93424 -91979 -57482 -18873
24233 -18873 -90654 -99306 -63205 49752 79978 -4711 2241 53369 40929 130135 115152 49182
24221 49182 82196 70901 83461 16249 20046 -22224 -20667 -19158 46089 62121 10954 42281
24209 42281 40023 -5843 -14763 -75660 -182624 -233259 -132532 -60905 -64257 -77534 -72537 -46233
24197d6233M339L8580N3713r1049q4711m1414M4994R6974j941O1284M2814Q263
24185H5613n7990o0024P2205M9833p4866l9094N686Q598o8637j6463J4950k6951
24173a07140m8652m0737O1209J02284k858O987M5371l1703k3781n6947L9585O3701
24161G319k3252O4792l4738k0403J3584K4768L2443K3401o5585k14733p4263J1433
24149b55234J9843J27493J1908m1182J8678L4292K1159k5582O6506Q8540r6341
24138b9920q3870J3000K8748k0981q544Q2771J7874j2854j441k1278K5352L4988
24126B3845n0505o446K4467J91k535l0701l6233L2328K1371O8042Q6680p4806
24114E5698o1773M94Q898L2515n6069L956l1853N2703N5293m64k1746L6495l8996
$$ plain form
24197 -46233 -41894 -3314 50399 -40650 -125361 -166775 -121781 -24807 -26748 34536 77350 85613
24185 85613 27623 -32401 39804 89637 14771 -24323 -18637 -10039 -78676 -95139 -80189 -107140
24173 -107140 -155792 -196529 -135320 -33036 -35894 -28907 16464 -15239 -39020 -95967 -56382 7319
24161 7319 -15933 48859 14121 -6282 7302 32070 64513 87914 22329 -192404 -266667 -255234
24149 -255234 -235391 -107898 -95990 -137172 -118494 -84202 -63043 -88625 -22119 66421 -29920
24138 -29920 -113790 -100790 -72042 -93023 -101567 -18796 -922 -13776 -15217 -36495 -11143 23845
24126 23845 -26660 -33106 -8639 -8448 -10983 -41684 -77917 -45589 -24218 43824 130504 55698
24114 55698 -6075 -5581 3317 35832 -20237 -16281 -48134 4569 59862 59398 37652 74147 35151
24101C5151K701Q024M6049P0512M2406o9737p3248j17379N967J2118j3835K3024
24089b8247J4130p460J966K7381J3177K828o4072M1804K5997r8313n5233K1838
24077a04204J5223N5233K4944N9329k126j29655q359M6742o398j3020K6752J6668
24065a8871J6008j7800l8403M3834N5777o2272n0248k9283N2222l3975J6709J10212
24053D3910K5893n8254n115j08470O810J1813M7840J1958J3558j00607l9260M9404
24041a00520N5593N3803K8612j401Q538p5134L0005J0744o5501m1421P3901K7337
24029D556k2608N0084o0940j4172M1323Q1993K54L160L9974j5367n3064n7525
24017b332k3889M234K0187n3622j9896R1585J3436j9191n7242K6788m208J6367
$$ plain form
24101 35151 37852 45876 91925 162437 204843 135106 61858 -55521 -49554 -37436 -51271 -28247
24089 -28247 -14117 -21577 -19611 7770 20947 23775 -40297 1507 27504 -70809 -126042 -104204
24077 -104204 -88981 -33748 -8804 50525 48399 -81256 -89615 -42873 -49271 -62291 -35539 -18871
24065 -18871 -2863 -20663 -59066 -15232 40545 -21727 -71975 -101258 -49036 -83011 -66302 43910
24053 43910 69803 11549 6434 -102036 -95226 -83413 -35573 -23615 -10057 -110664 -149924 -100520
24041 -100520 -44927 8876 37488 36087 44625 -30509 -504 10240 -55261 -96682 -22781 4556
24029 4556 -18052 32032 -28908 -43080 -1757 80236 80490 83650 123624 108257 55193 -2332
24017 -2332 -26221 -21987 -1800 -55422 -75318 16267 29703 10512 -46730 -19942 -24150 -7783
24005g783m339J3988O4224J7123o0814m7489l0741m9421l1042O3048R6834k0196
23993C392k1947J6908L4594P1464o5527M4306M7637K0701M2099q8862j94013l0222
23981a19470n0938l5240M6010N0640R364Q7399j8139j06607K6078Q8628M5864
23970B3589n230l7560J7134J2778J1756j5581q284L6885Q8854k5877j03495o6968
23958g1999O8729N4311j2764n3742o0272M8191O3513j518l775R0270P936q7495
23946D1385p1289j0643N3780j14400j8117J36843J27287p103j4497j05924k8964
23935a1642j31540r0109J18392J23633r227O094R1831p925L379J2291N384K8263
23923A38824m1738J601K0058n1979k8505n2908k214m1380L643J06431k4738o8604
$$ plain form
24005 -7783 -12122 1866 66090 83213 22399 -25090 -55831 -105252 -136294 -73246 23588 3392
23993 3392 -18555 -1647 32947 104411 38884 83190 130827 151528 193627 104765 -89248 -119470
23981 -119470 -170408 -205648 -159638 -108998 -99634 -12235 -30374 -136981 -110903 -22275 23589
23970 23589 18359 -19201 -2067 10711 22467 6886 -1398 35487 124341 98464 -5031 -71999
23958 -71999 -3270 51041 38277 -15465 -75737 -27546 35967 34449 30674 120944 128880 41385
23946 41385 -29904 -40547 13233 -101167 -119284 17559 144846 137743 123246 17322 -11642
23935 -11642 -143182 -233291 -114899 8734 -493 5601 97432 89507 92886 105177 110561 138824
23923 138824 97086 98687 118745 66766 38261 -14647 -16861 -58241 -54598 51833 27095 -41509
23911d1509j3814Q2934n9357j12427M8452M6761K8926j2823l0237j5707N218j4702
23899h8285m0249P6975k4404M1292m984j06836K2280L1968l821j3423K2601l4734
23887a21620l3278R8583j8002m8244m9527m1477l4619L0544Q5098P1128l862O958
23875e8318n113R1888N5508m859r7963j6879M3193P7045l2266q9363m5740J20035
23863C7168J03214k859l6561q6049m1932j0935n3683L6296P5484P3867N8980j5981
23851A37009M4528J730p5968r1014J2582n676q153j36991m1031m708k8966M0425
23839a56233K0022K5703J9135M6250m1974M5837K3559J6227K8640k7766J3500
23828A2900K95Q181n0567k6900M4112J3645k1580j5730L5453Q9725j59150r3847
$$ plain form
23911 -41509 -55323 27611 -31746 -144173 -95721 -48960 -20034 -32857 -63094 -78801 -73583 -88285
23899 -88285 -128534 -51559 -75963 -34671 -39655 -146491 -124211 -92243 -96064 -109487 -86886 -121620
23887 -121620 -154898 -56315 -74317 -122561 -172088 -213565 -248184 -217640 -132542 -61414 -65276 -58318
23875 -58318 -63431 28457 83965 79106 -18857 -35736 7457 84502 52236 -37127 -82867 37168
23863 37168 140382 137523 100962 14913 -27019 -37954 -91637 -55341 20143 94010 152990 137009
23851 137009 181537 183267 107299 16285 28867 23191 15038 -121953 -162984 -167692 -196658 -156233
23839 -156233 -136211 -110508 -91373 -45123 -87097 -41260 -17701 -1474 27166 -600 12900
23828 12900 13195 21376 -29191 -56091 -11979 1666 -19914 -35644 -191 89534 -69616 -163463
23816a63463J15962P7043J4669N7832m360m4218j022j25356J4364K4736r0708
23805a24521j4947J16M8186O0138K3792r79J8741r135l2547L5354k5994j6369
23793c8165m5441n8128J4227J07534L0253p286M90J1558K1753k0527n7255n0801
23781i1788L5723M3966p6832M164O6898k1768n5233P7711L2124Q6102M3081j4947
23769A29201K0276k0790K158k6422j23747j1519L0848L986j01751j1925N8605
23758e1080P5440L2745M5861n1852p7965k1084J8804j251N3419O3233R407r6611
23746i34p1526j6482M5147L5489J4389n5683K009L1855J5761M570J1242L5460
23734E1297O2453M5383p194m3114K9075o8180j9511J9499q357o0626L3649m0275
$$ plain form
23816 -163463 -47501 29542 44211 102043 97683 53465 52443 -72913 -58549 -33813 -124521
23805 -124521 -139468 -139352 -91166 -31028 -7236 -8215 10526 1391 -31156 4198 -21796 -38165
23793 -38165 -83606 -141734 -127507 -19973 10280 2994 3484 15042 36795 16268 -40987 -91788
23781 -91788 -56065 -12099 -88931 -84767 -17869 -39637 -94870 -17159 14965 101067 144148 129201
23769 129201 149477 128687 130845 104423 -19324 -30843 5 3991 -97760 -109685 -51080
23758 -51080 24360 57105 102966 51114 -26851 -47935 -29131 -30382 23037 86270 95677 -934
23746 -934 -72460 -88942 -43795 -8306 6083 -49600 -47591 -15736 25 4595 15837 51297
23734 51297 113750 159133 151939 108825 137900 69720 50209 69708 61351 725 34374 -5901
23722e901n6741K4643O8769k6760p5351l7187J8268q516J05027O4836K3090K7785
23710A21962J7437q0249p7714m8186L2035L8537J5303K9138J9130L728m4939j22874
23698i6692o7791R4609P0585L0576O6110n8921L52N7121m0573p3385O2096N226
23686D9313n508n1353o0406p1098j12099Q2359Q6739P2334M3923m4771J3497L1974
23674C4904l0374q978K4716k7993N8253m9897j04081J2350K2736l4609K2884R5739
23662A5650K7932p3591q4347j8402J06535K3826j0280J2538j7697J11506J9625
23651A13295r6174m4508n0644K9430R273r406r905j2657k580J8330M5940K8691
23639A9085R0849k2258r7206o2735M1483Q5531m2338n1807k9661M2641J1070K4547
$$ plain form
23722 -5901 -62642 -37999 30770 4010 -71341 -108528 -90260 -98776 6251 71087 94177 121962
23710 121962 139399 59150 -18564 -66750 -34715 3822 19125 48263 67393 71121 26182 -96692
23698 -96692 -164483 -69874 711 31287 97397 38476 38828 95949 55376 -18009 44087 49313
23686 49313 43805 -7548 -67954 -139052 -251151 -168792 -82053 -9719 34204 -10567 2930 34904
23674 34904 4530 -4448 20268 -7725 50528 631 -103450 -91100 -68364 -102973 -80089 15650
23662 15650 43582 -30009 -114356 -132758 -26223 -2397 -12677 -139 -17836 93670 113295
23651 113295 17121 -27387 -78031 -48601 -39328 -48734 -58639 -71296 -73876 -55546 -9606 19085
23639 19085 109934 87676 -9530 -72265 -30782 54749 12411 -39396 -69057 -26416 -15346 9201
23627I201m9273K0092M2988j1852p856N5310M8485m8549r2812P0673R5481K4423
23615A56311l0517r2727o0571L0848l2235k4741L8948Q2079L3792n0248L2287
23604H3226k3883l4358l583j13689k7288O4806J9170m7168M8481J31977l254k2449
23592G1988J5855Q0620n8554j15312K5480L7466l6813P5826L4318l0407j6482
23581H3985j13774p118K0849J13248j10908q5486n2835P6805P3217l7785K6636
23570a3166o6648J436L7940j7527k5877k7293N1063K6131o4408j7252L3038J1672
23558g0891m681M2555P3415l2022p367R3720R5346n335q5720j16525m4792P1199
23546H902J1263J6070j7177m5949M7372m5724k000o441l9519p3501J401J1713
$$ plain form
23627 9201 -40072 -19980 23008 11156 3300 58610 107095 58546 -34266 36407 131888 156311
23615 156311 125794 33067 -27504 3344 -28891 -53632 -14684 67395 101187 50939 83226
23604 83226 59343 24985 21402 -92287 -119575 -54769 -35599 -82767 -34286 97691 94437 71988
23592 71988 87843 168463 109909 -5403 20077 57543 20730 96556 130874 100467 83985
23581 83985 -29789 -36907 -16058 97190 -13718 -99204 -152039 -75234 -2017 -39802 -13166
23570 -13166 -79814 -78378 -40438 -57965 -83842 -111135 -60072 -33941 -98349 -115601 -82563 -70891
23558 -70891 -75572 -33017 40398 8376 1009 94729 190075 184740 99020 -17505 -62297 8902
23546 8902 20165 36235 19058 -26891 20481 -25243 -27243 -33684 -73203 -146704 -145303 -133590
23534a33590r822J6111O7311R8372m0974o7386M5146j6720k045J2006n838O4645
23522B7216n3763K8890L7994j1171j3419l9187p688k3855j2122r1662J8116J1888
23510a28763q4422j3450Q1228R9314P8638q134q7436r4329J36672R6595n5894
23499B0019l2407q113K2718P279n5372j13564L3859R4324N3410R134o1073k6673
23487e6459K5772k7999j3571j1253J0057p272J496p85L4214N1362N82K9205k7204
23474H145o798j0998K1449K7528n335k8957L0880J5029j6480o5629M0118m2693
23462c3741j7503R1620L2884q0105n3264j7755o2108K7372O4308L8584N0532L7132
23450G7956l7271m2693j10134L0620R1852p2406j1569q828j0979j1397R3430M3525
$$ plain form
23534 -133590 -143412 -127301 -59990 38382 -2592 -69978 -24832 -41552 -43597 -31591 -37429 27216
23522 27216 -26547 2343 40337 29166 15747 -23440 -31128 -54983 -67105 -158767 -140651 -128763
23510 -128763 -213185 -226635 -145407 -46093 32545 24411 -63025 -157354 -20682 75913 20019
23499 20019 -12388 -20501 2217 9496 -45876 -159440 -125581 -31257 22153 31287 -29786 -56459
23487 -56459 -30687 -58686 -72257 -83510 -73453 -80725 -79229 -80014 -45800 5562 6144 35349 8145
23474 8145 1347 -9651 11798 39326 33991 5034 35914 50943 34463 -31166 8952 -33741
23462 -33741 -51244 40376 73260 -6845 -60109 -77864 -139972 -112600 -48292 -9708 40824 77956
23450 77956 40685 -2008 -112142 -81522 10330 -62076 -73645 -82473 -93452 -104849 -11419 32106
23438C2106j11175m1910K598L0053R8588M8837N8311K8723K4044n8306n8228k7984
23426B5657K7316j0447L3994M2995l237J6996j1062q7204l6478k8656J35598J9797
23414A25269n8695j9687j3479j5209Q9129p4183n7959L8393M5724K0103J1546
23403I0952J7575r271l0709K9202m6618j8481l1738k7738k2122N3013n333q1878
23391h3146K1217Q2912N7903M617j8225n8348K8510Q0468K6165N8645L2017l3911
23379A98824k6421k179r3069j4209J3286J3246o8272P4764M5923q1771m6679n8318
23367d4875n4015J20856K7758k5533K0906j2282n4622q257l9335M0370J03617
23356G4588M8799o5548p261j1131l6253n3814m1204P972p657m4311p694k250N7362
$$ plain form
23438 32106 -79069 -120979 -118381 -88328 10260 59097 117408 146131 170175 111869 53641 25657
23426 25657 52973 42526 76520 119515 116278 133274 122212 35008 -1470 -30126 105472 125269
23414 125269 66574 46887 33408 18199 107328 33145 -24814 13579 59303 79406 90952
23403 90952 108527 99256 68547 97749 51131 32650 912 -26826 -48948 4065 -1268 -83146
23391 -83146 -61929 20983 78886 83503 65278 6930 35440 115908 142073 200718 232735 198824
23379 198824 172403 170224 77155 62946 76232 89478 21206 95970 141893 60122 13443 -44875
23367 -44875 -98890 21966 49724 24191 45097 32815 -21807 -30064 -69399 -29029 74588
23356 74588 123387 57839 50578 39447 3194 -50620 -91824 -83852 -91509 -135820 -143514 -145764 -88402
23343h8402J18069P8235j4462k5187j7864k790m0394l9785J8670P937k019m539
23331a2531L8319N123M4354p35l6356r889l5898M658n5803o5905n7921L7703Q47
23318a44034O0409K6276M4742n8069o146n4216R547J07726N3609r629R2646N3906
23306A76767l1735k7481J2519M2097L7738o4427o5578p0560n0851O5901M877j3201
23294A6066r973k0037p6594J7538M3925P0829n6308N1620J1243n7822q4014o6302
23282a59829Q0936J6800J03153L2278j3417m6024r305o2627o0845K5462L754J3700
23270g5964L9140J7676j4655n0434k1829K1771O6878j3023L6990o2387k1168L6442
23258d0563j645j2188n725K2962M0701j4527r639O5851J7656p1906q5061P9419
$$ plain form
23343 -88402 29667 107902 93440 68253 50389 47599 7205 -32580 -13910 -5973 -7992 -12531
23331 -12531 25788 30911 75265 74530 38174 28285 -7613 -2955 -58758 -124663 -182584 -144881 -144034
23318 -144034 -83625 -57349 -12607 -70676 -76822 -131038 -121491 -13765 39844 30215 122861 176767
23306 176767 145032 117551 130070 172167 209905 145478 79900 9340 -41511 24390 29267 16066
23294 16066 6093 -13944 -90538 -73000 -29075 41754 -14554 37066 48309 -9513 -93527 -159829
23282 -159829 -78893 -62093 41060 73338 59921 13897 4592 -58035 -118880 -93418 -89664 -75964
23270 -75964 -36824 -19148 -33803 -84237 -106066 -84295 -17417 -30440 6550 -55837 -77005 -40563
23258 -40563 -42208 -54396 -60121 -37159 3542 -10985 -20624 45227 62883 -9023 -94084 -14665
23246a4665Q4472n0548j08324k7363k796m3607M96J39632N7228o5282L3291R7357
23234I9891j6774p1729k1188K3655j5944q5798q8518J53495Q3861m2802m0751
23223b2602n8421p679M6207K7812l9730q1720K9742J10048M5913q709o7605o7780
23211i4524K5356J5625p850L1385K2296l0316l1959m4645J4243R6821P8025L6113
23199A10570o3626p4623o065L5559k9114k2407N191L0322Q5393Q225o3000n2063
23187c5638J7964O1471k4405P208p748P8851m0662l2252N532m2795K6869J21813
23175A36208j4644l9208k8592m3566J4289m0212m5224j2452L0980P7123k9713
23164D989j07717J4951J58189k3139m2179q516K4171R201K8716J5053k4423o5664
$$ plain form
23246 -14665 69807 19259 -89065 -116428 -119224 -162831 -162335 -22703 34525 -30757 2534 99891
23234 99891 83117 11388 -9800 13855 -2089 -87887 -176405 -22910 60951 18149 -22602
23223 -22602 -81023 -88702 -42495 -14683 -54413 -136133 -106391 3657 49570 40861 -26744 -94524
23211 -94524 -69168 -53543 -61393 -30008 -7712 -38028 -69987 -114632 -100389 -3568 74457 110570
23199 110570 46944 -27679 -33744 1815 -27299 -49706 -44515 -14193 71200 79425 16425 -35638
23187 -35638 -17674 43797 19392 26600 18852 97703 57041 24789 30321 -12474 14395 136208
23175 136208 121564 82356 53764 10198 24487 -15725 -60949 -73401 -42421 34702 4989
23164 4989 -102728 -87777 70412 47273 5094 -3422 20749 29950 58666 73719 49296 -16368
23152a6368r1532j475o08J1602N535q1597o0229k0664O5017L9520K5651P5736
23140d9412P4892k5945j8587j204N2130l3973q872R68p2649K1071O0927K1812
23128B1158R636M2703K7532n8748M7346J615j32264m3673K6926L8975Q7243P5629
23116A44078K4278O4448J9934q7474p8654n3543q4948n2657K9464j9097j498J8026
23104g7643J6552n474m0755J3024k599M5894p1035K1301J8746Q7821J12920m3616
23092G5136r2258m996L2499l9449J8467N4385L88k3768k0754M4708N4031r6242
23080B147q4111K832l2461p18J6320O3272m2264q0888N3517n0222l7050L6016
23068a53610L7635P1323m4872j05326P2458K9240o558N3762O0124p794J9663k7642
$$ plain form
23152 -16368 -107900 -109375 -109983 -98381 -92846 -174443 -234672 -255336 -190319 -150799 -125148 -49412
23140 -49412 25480 -465 -19052 -20256 31874 -2099 -10971 -10003 -82652 -61581 -654 21158
23128 21158 30794 73497 101029 42281 89627 91242 -41022 -84695 -57769 -18794 68449 144078
23116 144078 168356 232804 252738 165264 86610 33067 -51881 -104538 -75074 -94171 -95669 -77643
23104 -77643 -61091 -66565 -107320 -94296 -96895 -51001 -122036 -100735 -81989 5832 118752 75136
23092 75136 -17122 -22118 10381 -29068 -10601 43784 44172 20404 -350 44358 98389 2147
23080 2147 -81964 -79132 -111593 -112311 -95991 -32719 -74983 -155871 -102354 -152576 -189626 -153610
23068 -153610 -115975 -44652 -89524 -194850 -122392 -93152 -99710 -45948 14176 6382 26045 -1597
23056a597J7401n9092J5939R834O0749l0537P651K0395j8086m9504J6053J19078
23044A08284j0982K9089r6267l1700l306Q7678m513m1741j31891n2818J8115J6528
23032a13524J1183L1463m8634J85P2023o169m8286m8039K4162L1227J6885O4647
23020a2877M4463O08L6455m1167L547j6035o7775j0357O7289M303l1088j7595
23008d0229j9102L7754M958k3052M5409N8424L4931o8653J7634J3612M780k0750
22996D5716k3205k1363m2939l6131K687P452N5109R0414n4301K7803J8418o3046
22984F614q753O0098l1155R5777R3634n1148m1189M3014K8386q5680j64250k1595
22972g6247n8987J8864Q7692J5914N7729m7684o6752R9108N8124n1531l834K5359
$$ plain form
23056 -1597 15804 -43288 -27349 -17515 43234 12697 20348 40743 22657 -26847 -10794 108284
23044 108284 97302 126391 30124 -1576 -4882 82796 78283 36542 -95349 -148167 -130052 -113524
23032 -113524 -102341 -70878 -119512 -119327 -47304 -53473 -101759 -149798 -125636 -94409 -77524 -12877
23020 -12877 31586 32194 68649 27482 31029 14994 -52781 -63138 4151 8454 -22634 -40229
23008 -40229 -59331 -21577 -16619 -39671 5738 64162 99093 30440 48074 61686 66466 45716
22996 45716 22511 1148 -41791 -77922 -75235 -67783 -12674 77740 23439 51242 69660 6614
22984 6614 -2139 57959 26804 122581 216215 165067 123878 166892 195278 109598 -54652 -76247
22972 -76247 -135234 -116370 -28678 -12764 44965 -2719 -69471 29637 87761 36230 32396 57755
22960E7755l0886j52412p538O1355K4882o3379k2403l0037Q9344K5653p5693N6918
22948f6441j250K3299j9817K7490N1145j8404k3174K2321J7080l9788o3489M6240
22936d4788J50197k1914j8598K0111l0874n4202k2405N5366k2169m5775K0640
22925a4411N4972m6344L5227R235m6862M5014l9846j12269k4022M9094P6518K416
22913a1278L5736N5634m5962o7050K3970l6673p5081K1732n312K9089Q0493M7295
22901E2593l9204k7587J0651K3044k4335R043l1971l4327K5222N5283j394J4223
22889C1241K4419q8324r2382K8728L8424o0537l5528Q61l0398o0424N5612J04100
22877h4208M4612p3930m1346Q5960O1459l295l1240r1130o4887Q7957J2631J9981
$$ plain form
22960 57755 26869 -125543 -133081 -71726 -46844 -110223 -132626 -162663 -73319 -47666 -123359 -66441
22948 -66441 -67691 -44392 -64209 -36719 14426 -3978 -27152 -4831 12249 -27539 -91028 -44788
22936 -44788 105409 83495 64897 85008 54134 -68 -22473 32893 10724 -35051 -14411
22925 -14411 40561 -5783 29444 38679 -8183 36831 -3015 -115284 -139306 -90212 -13694 -11278
22913 -11278 24458 80092 34130 -32920 -8950 -45623 -120704 -98972 -104284 -75195 5298 52593
22901 52593 13389 -14198 -3547 19497 -4838 4205 -27766 -62093 -36871 18412 17018 31241
22889 31241 55660 -32664 -125046 -96318 -57894 -118431 -153959 -153098 -183496 -243920 -188308 -84208
22877 -84208 -39596 -113526 -154872 -68912 -7453 -10748 -41988 -133118 -198005 -110048 -97417 -77436
22865g7436K183N6375n6174k5556l2495n3038P2802O1343J2537n980J2075n1135
22853h4499K8235O2795K4521n1184n0496J4552N1013l0696k2202J00256M7507
22842H9802K9016n637k7826k6048m8094M5933j7150j9380j5732l8371J4382l548
22830b2653j777l3257L8817Q3761J5203j7431n2578o5972k6654k4544K4364K4021
22818e8700k891N5684L0036j06881J721O6884j9532k1299O0038k7512k2169R623
22806c4998l928p4831M8272J38188l5899n3877j8904r133L064o4481o2565N2315
22794a16777P9605N5417O8241p6186p4735m935K797L9177n9115O623M802k993
22782g8079m6065K5720M5623K7102J9407n515n632J6187n631M830j1172N5679
$$ plain form
22865 -77436 -75253 -18878 -75052 -100608 -133103 -186141 -113339 -51996 -39459 -45439 -33364 -84499
22853 -84499 -56264 6531 31052 -20132 -70628 -56076 -5063 -35759 -57961 42295 89802
22842 89802 118818 113181 85355 59307 11213 57146 39996 20616 4884 -33487 -19105 -22653
22830 -22653 -24430 -57687 -18870 64891 80094 62663 10085 -55887 -82541 -107085 -82721 -58700
22818 -58700 -61591 -5907 24129 -82752 -81031 -14147 -33679 -54978 5060 -22452 -44621 -34998
22806 -34998 -38926 -113757 -65485 72703 36804 -17073 -35977 -45110 -42046 -106527 -169092 -116777
22794 -116777 -37172 18245 86486 10300 -64435 -69370 -66573 -27396 -86511 -79888 -75086 -78079
22782 -78079 -124144 -98424 -52801 -25699 -6292 -11807 -17439 -1252 -6883 -2053 -13225 42454
22770D2454O263k9754n8493q263m4460J1742O5286K2552N3134r2902k5700L4315
22758b3826L9999N8114l3948m9018p4815n890K0861J7296k519p8963P038k8778
22746a54449n7676j554K4857m1122J04699N5599N726O9161K9019q25k4701n0253
22734d1519k5231P6890L7360l4806j12556l7388O538Q7777q081o527L4446l3906
22722e7003j30491o9342q717J52658M0978O39r1835L4049J27187O60J6474M8997
22710F4254O6202J5574N864o3949j2804J6228j902n947P542L193j3755o112N3075
22697A27463M8958l6221k7932O751j08820j11166k3505N5240n125M7952M1127
22686A4722N430j513K5070J2369n0336k7957j7290N5000L9224L2639K5713r0509
$$ plain form
22770 42454 48717 18963 -39530 -47793 -92253 -80511 -15225 7327 60461 -32441 -58141 -23826
22758 -23826 16173 74287 40339 -8679 -83494 -89384 -68523 -51227 -53746 -132709 -125671 -154449
22746 -154449 -212125 -213679 -188822 -229944 -125245 -69646 -63920 5241 34260 33435 8734 -41519
22734 -41519 -66750 10140 47500 12694 -99862 -137250 -130712 -42935 -51016 -57543 -23097 -57003
22722 -57003 -187494 -256836 -265553 -112895 -71917 -71278 -163113 -129064 -1877 -1217 15257 64254
22710 64254 130456 146030 151894 87945 75141 91369 89467 83520 91062 94255 80500 74388 127463
22697 127463 176421 140200 112268 119019 10199 -100967 -124472 -69232 -74357 -26405 14722
22686 14722 20152 18639 43709 56078 5742 -22215 -39505 15495 54719 87358 113071 22562
22674B2562J3786K8336p601j87n6263l3190j5948p037k876O1658M633J2490n1328
22661c0965L2399N7431R546m0347l4863L3937R449J7337l0019o9645l6871J0963
22649g1648J11332J36286L9191n5702Q719m5827o3598k8813q1820O7786M0141
22638E6047j1530l3478l5757L1601M0391J2565r5935k2759K8004k5825j08962
22627a65638l8429Q7158J67740K5118j46297K2305k7654j0356N7349L084k1682
22616d7302J1561m6449P916m9340K3563K4514N4900Q3873K1563p8615n5489K711
22604d6594P7325J2580m3438k8031l7772k26K8150K3689j0909k084j8383N7413
22592A1720j1866p6444J831o320k7014q911M4676J8636N0419K6946j1223L7680
$$ plain form
22674 22562 36348 64684 57083 56896 633 -32557 -48505 -55542 -58418 3240 7873 20363 -30965
22661 -30965 1434 58865 68411 28064 -6799 27138 36587 53924 23905 -45740 -82611 -71648
22649 -71648 39684 175970 215161 159459 168178 122351 58753 29940 -51880 15906 56047
22638 56047 44517 11039 -24718 6883 47274 59839 -36096 -58855 -30851 -56676 -165638
22627 -165638 -204067 -116909 50831 75949 -70348 -48043 -75697 -86053 -28704 -25620 -47302
22616 -47302 -35741 -82190 -74274 -123614 -100051 -75537 -20637 63236 84799 6184 -49305 -46594
22604 -46594 30731 43311 -127 -28158 -65930 -66156 -38006 -14317 -25226 -27310 -45693 11720
22592 11720 -146 -76590 -74759 -81079 -108093 -117004 -72328 -53692 -3273 23673 12450 50130
22580E0130q0964o4950Q3877J7871o875n3184l4768J8479K1105N2486j4369p7598
22568h8760k9834L6257N677K4112J06742M349N4549n6079k3050J8268k0341k9445
22556B445Q3336K9738J7207k8039k1068l5954n2305q6252J4143K6804o743N4627
22544b061K6566o3740j0664l5751P6290P9187k0542r0227o9943J9126J0723K0005
22532f1031m3352n3001j9717K209K4522J17983O6137L1404j99K5122j597J2407
22520A00887m3167r3646o8605L0654N5218q5171J7575P0818k5160m3439n900J4180
22508g5756R8503N757n9337m665N4201K3767J1266o2468r6847L009l8023Q3933
22496e6660L5682L3349n7171p7532j0280M4793N1205O9376l702J3749J824r5416
$$ plain form
22580 50130 -30834 -95784 -11907 5964 -911 -54095 -88863 -70384 -49279 3207 -11162 -88760
22568 -88760 -118594 -82337 -76660 -52548 54194 58543 113092 57013 33963 52231 31890 2445
22556 2445 85781 115519 132726 104687 83619 47665 -4640 -90892 -76749 -49945 -56688 -2061
22544 -2061 24505 -39235 -49899 -85650 -9360 69827 49285 -40942 -110885 -91759 -81036 -61031
22532 -61031 -104383 -157384 -177101 -174892 -150370 -32387 33750 65154 64955 90077 88480 100887
22520 100887 57720 -35926 -104531 -73877 -18659 -103830 -86255 -15437 -40597 -84036 -89936 -75756
22508 -75756 22747 28504 -30833 -35498 18703 42470 53736 -8732 -105579 -102570 -140593 -56660
22496 -56660 -20978 12371 -44800 -122332 -132612 -87819 -36614 32762 29060 42809 44633 -50783
22484e0783n7476O9973j9155l3757l389k2218P0872Q0825r27j64039p0698k4615
22472b25387Q5981J60919J14491k6926l4249p4247M1288Q061j2553o2764p177
22461c2563j3116O764j4920Q8632p1116o5991j7779L0412r9690p8197l4771L0272
22449b72063L9668P6479j1077q1606M570L951L2134P8227j5316k9803j0577J18733
22437f6680L6567N7907K9367r0378k6726M4115O475J4738K0947q635k2127m733
22425i163j5861J5423j3138p4283L8861K5788L091L3612o0077K9403j1508j7971
22413e5823M874o90q796K7561K7809k5578O352j4197O6521k6398o796j3501m9381
22400f8043M7979J2756L4033R880L7516m6894o8573J7882R412p208N610j2463
$$ plain form
22484 -50783 -108259 -38286 -57441 -91198 -94587 -116805 -45933 34892 33965 -130074 -200772 -225387
22472 -225387 -139406 21513 136004 109078 74829 582 41870 49931 37378 -25386 -32563
22461 -32563 -45679 -38915 -53835 34797 -36319 -102310 -120089 -89677 -189367 -267564 -302335 -272063
22449 -272063 -232395 -155916 -166993 -248599 -244029 -240078 -207944 -129717 -145033 -174836 -185413 -66680
22437 -66680 -30113 27794 57161 -33217 -59943 -15828 -9353 5385 26332 17697 -4430 -9163
22425 -9163 -25024 -9601 -22739 -97022 -58161 -32373 -29282 4330 -55747 -26344 -37852 -55823
22413 -55823 -50949 -51639 -60435 -32874 -5065 -30643 -24291 -38488 28033 1635 -5161 -18662 -68043
22400 -68043 -20064 -7308 26725 36605 74121 27227 -41346 -23464 -14052 -21260 -15650 -28113
22388b8113K8628m238L936l2152P9561Q2428p6620j71685j9858N9716O1027j2508
22376b9878n9754j4078K7413K8357m5679M3871J518l1209n1507J1230p4363k5387
22364b19466N6838J03545J1120O5693K3985j3584k3529q2058J876L0470k0990
22353f6100K8237O3635M2975R44l4270j4973j7034m2077J09279L9629r9918m3184
22341c2857O2936O3561k2636L3195q1100r1253N272L0169P7684r928j23206l2871
22329a21034k2534J05065P0098O0752L1155N2362m2697p7850Q119M0160K8098
22318A31694N2661l3592q1710p0938n1565p7551R093M8339j4959J6013M5461K9131
22306B077r285Q272K2412O4627j10701j15591L5627L8900Q742o442l0554J6913
$$ plain form
22388 -28113 515 -3723 213 -31939 47622 130050 53430 -118255 -138113 -78397 -17370 -29878
22376 -29878 -89632 -103710 -76297 -47940 -93619 -49748 -48230 -79439 -130946 -119716 -194079 -219466
22364 -219466 -162628 -59083 -47963 17730 41715 28131 4602 -77456 -75580 -45110 -66100
22353 -66100 -37863 25772 68747 69691 35421 20448 3414 -38663 70616 110245 10327 -32857
22341 -32857 30079 93640 71004 104199 23099 -68154 -62882 -32713 44971 35043 -88163 -121034
22329 -121034 -143568 -38503 31595 92347 123502 175864 133167 55317 63436 103596 131694
22318 131694 184355 150763 69053 -1885 -53450 -131001 -121908 -73569 -88528 -72515 -27054 2077
22306 2077 -7208 1064 23476 88103 -22598 -138189 -102562 -63662 -54920 -61362 -91916 -75003
22294g5003m239L3004M8170J2535n3415k3854M2757J08710l2982q4066L29m5677
22282g3731m2708l94Q3228L5081K9724L2098Q0748l2061j5257l4530n4747l6679
22270b9228O1624N196l8759N2426L1579p4294o4017O2491M3155j08621J9323P5183
22258C6058l936K0003q6386K4426L5512l1042m3537K577k687J6678j7996k1006
22246g1336R457L8189m5018K5063Q1858K7069l7966J6932n5854M1472r938Q3784
22234A03712j3114k3247j14076l041O2m9814L0246N4604j258j0077L4586j0474
22222a891m7778j8820R9943R8577K3594j76464j36088P4216j0107J837N9691K5722
22210g568l609K8779n8285R923O2415J0112l8508L4001k2924j5892m5748l381
$$ plain form
22294 -75003 -79242 -46238 1932 14467 -38948 -62802 -20045 88665 55683 -28383 -28054 -73731
22282 -73731 -116439 -116833 -33605 1476 31200 63298 144046 111985 96728 62198 7451 -29228
22270 -29228 32396 37592 -1167 51259 82838 8544 -55473 7018 50173 -58448 -39125 36058
22258 36058 32122 52125 -34261 -9835 25677 -5365 -48902 -46325 -49012 -32334 -50330 -71336
22246 -71336 -61879 -23690 -68708 -43645 38213 65282 27316 44248 -11606 29866 19928 103712
22234 103712 90598 67351 -46725 -49766 -49704 -99518 -69272 -14668 -15926 -26003 8583 -1891
22222 -1891 -49669 -68489 31454 130031 153625 -22839 -158927 -84711 -94818 -92981 -33290 -7568
22210 -7568 -11177 17602 -40683 -30760 31655 41767 3259 37260 14336 -1556 -47304 -50685
22198e0685o9890j2047J00395M9095n0413k0820k0916p9756J1521J40638R9180
22187I6302m2163p276n8099o8180j2501L9340J8496K9139o8804K2088k5620k0988
22175i8266L2191j5805N5517M8138m2296r5781k3311k819J8933K7671M9429J7737
22163b8662l6130N178M2771L8550M6828m7030m1523J4693L4393N8411k5346j7545
22151D4588m8132m206K3698J9284m2484l9764M4705L0819o2500n5415L829n7723
22139a43301J2446Q6554M7465j9183k3504j1053l0264k7390J4045o0999P866m4073
22127a91391J0949J04444j7344L5452K5393K6837J0156J2395m96m2867L570K8386
22115E484K7286j5183r0550L6147L7465q1770J8656O5153J04166k6066j03906
$$ plain form
22198 -50685 -120575 -132622 -32227 16868 -33545 -54365 -75281 -155037 -143516 -2878 96302
22187 96302 54139 46863 -11236 -79416 -91917 -52577 -34081 -4942 -73746 -51658 -77278 -98266
22175 -98266 -66075 -81880 -26363 21775 -20521 -116302 -139613 -142432 -123499 -95828 -46399 -28662
22163 -28662 -64792 -59614 -16843 21707 68535 21505 -20018 -5325 29068 87479 62133 44588
22151 44588 -3544 -7750 15948 35232 -7252 -47016 -2311 28508 -33992 -89407 -85578 -143301
22139 -143301 -130855 -44301 3164 -16019 -39523 -50576 -80840 -108230 -94185 -155184 -147318 -191391
22127 -191391 -180442 -75998 -93342 -57890 -32497 -5660 4496 16891 16395 -26472 -22902 5484
22115 5484 32770 17587 -72963 -36816 649 -81121 -62465 2688 106854 80788 -23118
22104b3118L1155j4182q5175k5603J06684n3096p4153L622J4398m5541p6678n8451
22092c00138P9180N7783J9743n0819R329K5156K9691O2730M5546k5986p3507J1858
22080a09434j779l1496K3465L0718N684m0642l6247J8020N1032J21206k3575j2597
22068e645r5825K7410N8018l4682o1277N605R2492J38082r4362l8563K3510O3629
22056G8392M4309k5884k8604p1975K1036R1239Q268J1462l6682m5147j0294n1317
22044a5197J151L8615K9653L4903l7522J0657q1559r0175m2707l29l0483P731
22032a75262N9268N7474o3722m7612J5075m6321L6799Q3103N6551N0187Q5150
22021A10690n308l5885k0606j4234k4966j21721m7825M2392J02238L780K6445
$$ plain form
22104 -23118 8037 -6145 -91320 -116923 -10239 -63335 -137488 -133866 -119468 -165009 -241687 -300138
22092 -300138 -220958 -163175 -143432 -194251 -184922 -159766 -130075 -67345 -21799 -47785 -121292 -109434
22080 -109434 -111213 -142709 -119244 -88526 -82842 -123484 -159731 -141711 -90679 30527 6952 -5645
22068 -5645 -101470 -74060 -16042 -50724 -112001 -106396 -13904 124178 29816 -8747 14763 78392
22056 78392 122701 96817 68213 -3762 17274 108513 116781 128243 91561 46414 36120 -15197
22044 -15197 -14046 24569 54222 89125 51603 62260 -19299 -109474 -152181 -152510 -182993 -175262
22032 -175262 -115994 -58520 -122242 -169854 -154779 -201100 -164301 -81198 -24647 25540 110690
22021 110690 105382 69497 48891 34657 9691 -112030 -159855 -117463 -15225 -11445 15000
22010A5000L5864k4704j857j7706k8677l6559N1595j639M279L0463k7722j8080
21998a9743O6704q371j9389N6163k0969r803L1272k5118k7687q5073k0870O8661
21986a4223m4830l0789J07369P2551m2751n5390M8438K1078r577j10903n88M3024
21974a6591n8677P7716Q7874m755k3633P08L7038K6617m9339k6505M2362K3813
21962A16628M73l0423p3588j6211m9626m4582p8406n4247L5357R4657j0717K6027
21950h4658Q9454N1532q1743r6499K5128Q1811k8950n7536Q2095L1353q113K6720
21938C0594k8507J2443P734m1355O3608J0391j10876j41659j7288J3669O3841
21927a37405K5909k9899N6177R3657J6104l6823N4390O3570k5473l2931l679P262
$$ plain form
22010 15000 50864 26160 24303 6597 -22080 -58639 -7044 -8683 -4404 26059 -1663 -19743
21998 -19743 46961 38590 19201 75364 54395 44592 75864 50746 23059 -62014 -82884 -14223
21986 -14223 -59053 -89842 17527 90078 47327 -8063 40375 61453 51876 -59027 -59615 -16591
21974 -16591 -75268 2448 90322 85567 61934 62642 99680 126297 76958 50453 92815 116628
21962 116628 117101 86678 13090 -3121 -52747 -97329 -175735 -229982 -194625 -99968 -110685 -84658
21950 -84658 4796 56328 -25415 -121914 -96786 -14975 -43925 -101461 -19366 11987 3874 30594
21938 30594 2087 14530 22264 -19091 44517 54908 -55968 -197627 -214915 -201246 -137405
21927 -137405 -111496 -141395 -85218 8439 24543 -12280 42110 105680 80207 47276 43597 50859
21915E0859k6149N316j1209l147q3234k7461P4829P5523L4045o8714r8285o0418
21903a38045M9563o4094R2876Q1113p3025P7648R6218J9520K851j09395j64962
21892a29732J2565L1852R827m4410M0942J0211k4597J9323R985M4114O5175p449
21880C7806p4106n099m110n9705k8809N3364O966k7603O6328J7065m0012O4974
21868G059P3948o1278O8981N9042n560j38913l3253j5358m813N6906O4624L0583
21856A01968K5852m8621n6022j3184O617l9265P8014J6648J0260q3115o2113P32
21844f2229j9746M202l408k0295K2391M4309J939Q442L9516l5606k8259n62L792
21831d5514r2762j07027K7833R2505P8590n2148j9637l7002J8329N9140O3807
$$ plain form
21915 50859 24710 30026 18817 15670 -67564 -95025 -20196 55327 89372 20658 -77627 -138045
21903 -138045 -88482 -152576 -59700 21413 -51612 26036 122254 141774 144625 35230 -129732
21892 -129732 -117167 -85315 -75488 -119898 -78956 -68745 -93342 -74019 -64034 -19920 45255 37806
21880 37806 -36300 -41399 -45509 -105214 -134023 -80659 -73693 -101296 -34968 -17903 -57915 7059
21868 7059 81007 19729 88710 147752 142192 3279 -29974 -45332 -50145 6761 71385 101968
21856 101968 127820 79199 23177 9993 16610 -22655 55359 72007 82267 -848 -62961 -62229
21844 -62229 -81975 -77773 -81181 -101476 -79085 -34776 -32837 -24395 15121 -20485 -48744 -49306 -45514
21831 -45514 -138276 -245303 -217470 -124965 -46375 -98523 -118160 -155162 -136833 -77693 -13886
21820a3886K8625p4258M7425P7181L7139r644n5670n5798k2287j1369R876L5603
21808g063k6237j9358j08461N2295R6996J05300k3603j496J1290O0002k843o1314
21796G5508p1880o574J07042J27240p4811r6055l6709q2922J0943K2178L009M6491
21784B3460L8593p2372L6537n3990j3300m8207K2531L1444L3950O3446j0121L1303
21772H3274k8924m3080k9044m0219p592Q5103p317j569j0677l5780p5556J4497
21760i6884O6909n9585M621n717J4983K0999N0518Q708P024n4145l7778N1489
21748b8858l1802j2159R9544J2623N882N7990N029q7195j2094m7527l9516J6458
21736f1625j3852q66k791J05842m3632m1889Q1766L3304j1084P4608Q659n3866
$$ plain form
21820 -13886 14739 -59519 -12094 65087 102226 92582 36912 -18886 -41173 -52542 -42666 -7063
21808 -7063 -33300 -52658 -161119 -108824 -11828 93472 69869 68373 79663 139665 136822 75508
21796 75508 3628 -2946 104096 231336 156525 60470 23761 -59161 -48218 -26040 -23031 23460
21784 23460 62053 -10319 26218 -27772 -41072 -89279 -66748 -35304 -1354 62092 51971 83274
21772 83274 54350 11270 -17774 -57993 -65585 19518 12201 10632 -45 -35825 -111381 -96884
21760 -96884 -29975 -89560 -84939 -90656 -75673 -54674 -4156 4552 11576 -42569 -80347 -28858
21748 -28858 -60660 -72819 26725 39348 45230 103220 108249 21054 8960 -38567 -78083 -61625
21736 -61625 -75477 -76343 -79134 26708 -16924 -58813 22953 56257 45173 119781 128440 74574
21724G4574n114K9706M744k6211p315M8789M7557p1991q1649L316K1659j0795
21712B7270o8436o2303K0073L206M3716J25629k0506n6797k1802n3103J5542R1262
21700D3751l3772n0034K0117j3575L976o4249R9916M7330o8781J2499M5118K4155
21688F6451N9554k6342n768j1580j57112m9060K3141J9792J03071N6455K7494
21677A06096j4832M393o5006p8294K8394M9117L2230n6503p0430o2902p55L0208
21665i8284L844N0761K1447p541k2380M2277L4033m9057j7946L3463O4137J9593
21653G4347o2130q0819M491l5146n1225Q040R0029l8328r651J1033K3765L215
21641f2379J21104J8868o7897q8924J03147j4199L4483L3134J7998L5564n0531
$$ plain form
21724 74574 69460 99166 103910 77699 70384 119173 166730 94739 13090 16406 38065 27270
21712 27270 -41166 -103469 -83396 -80190 -36474 89155 68649 11852 -9950 -63053 -47511 43751
21700 43751 9979 -40055 -19938 -33513 -29537 -93786 6130 53460 -15321 -2822 42296 66451
21688 66451 126005 99663 93895 82315 -74797 -123857 -100716 -80924 22147 78602 106096
21677 106096 91264 95657 30651 -47643 -19249 29868 62098 5595 -64835 -127737 -128492 -98284
21665 -98284 -94440 -43679 -22232 -29773 -52153 -9876 24157 -24900 -42846 -9383 54754 74347
21653 74347 12217 -68602 -64111 -99257 -150482 -142442 -52413 -90741 -100392 -89359 -65594 -62379
21641 -62379 58725 77593 9696 -79228 23919 9720 44203 77337 95335 130899 80368
21630H0368j33631L621M6386l5407n332J552J7k1598O8181N018N6578l6340j10046
21617h0633J350o0912J4337R1249N9643J2224j5179l6182q2640L8728N906p2672
21605a24781J66J26521J11394L770j00201l1934K8822O0346j1044l3384j7118
21594A2557m3964m8730k9947J19694J11198J5851K588q452m4205k1729p313Kn8431
21581h81K2280m2J6635J1295J5278K3989m0450n763P8741m9103j4318j0248n0693
21568c280n9657M1578l0014j3326N3170n0333k5405n8434o3259j1133J8948P0845
21556a30300J01759o058O768P747j3619m5163n859P5780J305o5125J4137N1780
21544f848n761k1116N2803j9063r580L8044Q2785n3860n8139M2578n5444q1208
$$ plain form
21630 80368 -53263 -49642 -3256 -38663 -43995 -42443 -42426 -64024 4157 9175 65753 29413 -80633
21617 -80633 -79283 -140195 -125858 -34609 25034 37258 22079 -14103 -96743 -58015 -52109 -124781
21605 -124781 -124615 1906 113300 117070 16869 -15065 13757 74103 63059 29675 12557
21594 12557 -31407 -80137 -110084 9610 120808 136659 139247 130795 86590 64861 57548 57550 -881
21581 -881 21399 21357 37992 49287 64565 88554 48104 42341 121082 71979 57661 47413 -3280
21568 -3280 -62937 -21359 -51373 -64699 -11529 -61862 -87267 -145701 -208960 -220093 -201145 -130300
21556 -130300 -28541 -34599 -27831 -20084 -33703 -78866 -84725 -8945 -7640 -72765 -58628 -6848
21544 -6848 -12609 -33725 19078 15 -9565 28479 111264 57404 -735 41843 -13601 -94809
21532i4809J6710R2634M0103n731J4650j6103m5259m8405k1590k8864N5317m2135
21520h3482p6702K7152L1157n082q189l0894J48123Q3262m1955r3696o6916M4768
21508g2454J00597J5257l9055j2803j3708p5043o304J6465J3644k9183P8592M2370
21496A8375k0449q7898j8737M7598l0339M1151n6855r250O5779n3086q300J09975
21484b036r134o2397j18J3507N5002O1212q5827q8823K6612M8102k3511P5755
21472H344P0191q0698j6030M0819N8524p4650O3P9520L7558n4026m4426m2613
21460a7424O563K3929L4091P8661J8011q9593p50L4967R216m643M7878m1483n3094
21447D6329k8930l9703O80M0515m8762m411L6658o9732k8092J00085O3036M0663
$$ plain form
21532 -94809 -78099 14535 54638 48907 63557 47454 2195 -46210 -67800 -96664 -41347 -83482
21520 -83482 -160184 -133032 -101875 -106957 -115146 -146040 2083 85345 43390 -50306 -117222 -72454
21508 -72454 28143 43400 4345 -8458 -22166 -97209 -103513 -87048 -73404 -102587 -23995 18375
21496 18375 -2074 -89972 -108709 -61111 -91450 -50299 -107154 -116404 -50625 -103711 -112011 -2036
21484 -2036 -11170 -73567 -73685 -60178 -5176 56036 -29791 -118614 -92002 -43900 -67411 8344
21472 8344 78535 -2163 -18193 22626 81150 6500 6563 86083 123641 69615 25189 -17424
21460 -17424 -10861 13068 47159 125820 143831 54238 53488 88455 97671 93028 140906 99423 46329
21447 46329 17399 -22304 -21624 18891 -29871 -34282 2376 -67356 -95448 4637 67673 108336
21435A08336l1076j29148o6357M6908M6630J8566J994k2112p4289Q756O8897n131
21423b8026L3597M0143K5579l3064o0983n6099J03836j6177N9812o0195k4919
21412a6496K5892L0668k2785r558M0939J8462n0148l9768j4292M3438L3134m8703
21400i217l9607q962m9044K8969K3818K6650O4293p97m312Q2135k8991j9522P9420
21387A44833o02j09551k9692m3428N1802j9899J6293J0832k7280k6902M7906m4696
21375c0384l7503M065j8803l0658K3106Q5897r8641o0844Q713L1307O5122K2439
21363c6184P5227J3080m5751n112m880N1842K5358m366M6235k7028m7244p10o2249
21350b1782O6048J0138j4926l8410L9238R0639j28119l5140q487m4067j2186L0379
$$ plain form
21435 108336 77260 -51888 -118245 -71337 -24707 -6141 -4147 -26259 -100548 -91792 -22895 -28026
21423 -28026 5571 45714 71293 38229 -22754 -78853 24983 8806 68618 8423 -16496
21412 -16496 9396 40064 17279 7721 48660 67122 16974 -22794 -37086 6352 39486 -9217
21400 -9217 -48824 -57786 -106830 -77861 -54043 -27393 36900 36103 31791 113926 84935 65413 144833
21387 144833 144231 34680 4988 -38440 13362 -6537 9756 20588 -6692 -33594 14312 -30384
21375 -30384 -67887 -63822 -82625 -113283 -90177 -4280 -102921 -163765 -155052 -123745 -58623 -36184
21363 -36184 39043 52123 6372 1260 -3620 48222 73580 69214 115449 88421 41177 40467 -21782
21350 -21782 44266 54404 39478 1068 40306 130945 2826 -32314 -40801 -84868 -97054 -66675
21338f6675L9908K8136K6513m8660q9338R8120R6069m0120l5569k7930J5165n173
21326i554M531M442M2917n268o0425M3165l928m0002N3856k3367o4997J5542L2811
21313a0277M3948K0486n2997L9867J0699N1240M4175k6601j6133l6018K511Q0730
21301A51630J032n5622r1396n4238j01010j9569N7150Q1426N4371o4511p049P4037
21289B6251N0155p690q2996l942L0145K9859k7264m1129o8931n2036k3109Q2331
21277h8356M3377K0867p6071M694J1457N9272J04792k3390J07969L1035m3019
21266A52627J5295M1301j47452j49946n2980p7056L4055K5308L8985K0607J9850
21255g9406r918R6431J15388L8320j6196o4555j24005m9531n1946k6331l1682
$$ plain form
21338 -66675 -26767 1369 27882 -20778 -110116 -11996 84073 43953 8384 -19546 -4381 -9554
21326 -9554 -5023 -581 42336 37068 -23357 19808 15880 -24122 29734 6367 -58630 -43088 -10277
21313 -10277 33671 54157 1160 41027 51726 102966 147141 120540 104407 68389 70900 151630
21301 151630 152662 97040 5644 -48594 -149604 -169173 -112023 -30597 23774 -40737 -47786 26251
21289 26251 76406 68716 -14280 -18222 11923 41782 14518 -26611 -95542 -147578 -170687 -88356
21277 -88356 -44979 -24112 -100183 -95489 -84032 -24760 80032 56642 164611 195646 152627
21266 152627 167922 209223 61771 -88175 -141155 -218211 -184156 -158848 -119863 -99256 -79406
21255 -79406 -89324 7107 122495 160815 144619 80064 -43941 -93472 -145418 -171749 -203431
21244b03431Q2340j819l2039J70L3749K6385J01881L0832O550M4023j5891p7002
21232d252l8808q1702k2531O0148l035j7621l1452m919O1771L3120k8812l952
21220h2045J9759n6324M229L0803j1676J03892P9758J4908n0358o5177k0702O7624
21208C4691j1848l3527J1411j0208O7749k0073r767K6702j4063p1730J7499k0758
21196c3922o450P9024O631k1985P674l8790p0889J2543M1357j8363P5145J0072
21184D2047J5966l366l3170J0655n529m8649K7935P3220l5814p3004N8499K0023
21172D8813o0239n3919m4445l042J2731M3652N0810j842J7773p6582J215J22608
21160E7533Q0477j05331k9148P142j4578m2202j1029r68n4284n5440K1391L0306
$$ plain form
21244 -203431 -121091 -122910 -154949 -154779 -121030 -94645 7236 38068 44618 88641 72750 -4252
21232 -4252 -43060 -124762 -147293 -87145 -90180 -107801 -139253 -144172 -82401 -49281 -78093 -82045
21220 -82045 -62286 -118610 -114381 -83578 -95254 8638 88396 103304 52946 -12231 -32933 34691
21208 34691 22843 -10684 727 -9481 58268 38195 28428 55130 41067 -30663 -13164 -33922
21196 -33922 -40372 38652 45283 23298 30972 -7818 -78707 -66164 -24807 -43170 31975 42047
21184 42047 58013 54647 21477 32132 26603 -22046 5889 79109 43295 -29709 28790 48813
21172 48813 -11426 -65345 -109790 -112832 -100101 -56449 -5639 -7481 10292 -66290 -65075 57533
21160 57533 138010 32679 3531 10673 -3905 -46107 -57136 -58104 -112388 -167828 -146437 -116131
21148a16131M0603M569K7668J0726r734j1524J0266N7774k1505l852o625N0277
21136C2512q084R0787q486l8287q0422n5498l5035J5513K1685M2227m1430l1925
21124i6443m3052R4041J3107N0294L930j689J2774k6814q3351k9210n6881K7466
21112a35828K3832L0712O5740N4737P980r839n735n9419k5256O1902L0036q6807
21100d7945j4057n94j7101O1865O0143l9078l759J0775l0868k1115J6850L2587
21088G703N2306J0902k4541k5461m7517l0960O8593J0558k1089j809n8550m851
21076f4716J2776j3699j6567N3533q971J9824L3057O9329J5491j9084l6808n5619
21064a1454J7612j9258o2412m248K0719L9422m600p1001o3616j6017Q8805Q5466
$$ plain form
21148 -116131 -75528 -70959 -43291 -32565 -42299 -53823 -43557 14217 -7288 -11140 -17765 32512
21136 32512 24428 115215 106729 68442 -11980 -67478 -102513 -87000 -65315 -23088 -64518 -96443
21124 -96443 -139495 -45454 -32347 17947 21877 20188 32962 6148 -77203 -106413 -163294 -135828
21112 -135828 -111996 -81284 -15544 39193 47173 37334 31599 -27820 -53076 8826 38862 -47945
21100 -47945 -62002 -62596 -79697 -17832 42311 3233 -526 10249 -20619 -41734 -24884 7703
21088 7703 60009 70911 46370 20909 -26608 -57568 11025 21583 494 -1315 -59865 -64716
21076 -64716 -51940 -65639 -82206 -28673 -37644 -17820 15237 84566 100057 80973 44165 -11454
21064 -11454 6158 -13100 -75512 -79760 -59041 -19619 -24219 -95220 -158836 -174853 -86048 -582
21052e82K2214J9265L5060j9406l5500l2911J8825J492p2604o0326r244P1013
21040f2704K5308l0084M9968J9938j4689O6437q231j10519j9848J09572M2442
21029F7590P223k9906K1236M6495m1501m9257j0193L9774M5475m3795o8741P136
21017h464k6345m5540K8835m9096n953Q3174N154o9495q1291M9553O1853O6300
21005H685N8201L2165j3449r3234K580k2454m5452P104O7647q856k4790L2286
20993D33J07794O3152O0872k5452k0494n2338l9577k8324O042n4339j0171M3287
20981E0885o7578J8216l6212l5958O1251J14274J3024l2388k0397q0435J4645
20970f73M2682N499J03870L0526l6118l0479q4407j26664l6708Q8824M8905N942
$$ plain form
21052 -582 21632 40897 75957 56551 21051 -11860 6965 8457 -64147 -124473 -133717 -62704
21040 -62704 -37396 -67480 -17512 2426 -12263 54174 45943 -64576 -84424 25148 67590
21029 67590 74813 44907 66143 112638 71137 21880 11687 51461 96936 53141 -15600 -8464
21017 -8464 -34809 -80349 -51514 -100610 -106563 -23389 -18235 -87730 -169021 -119468 -57615 8685
21005 8685 66886 99051 85602 -7632 -5052 -27506 -72958 -65854 1793 -7063 -31853 433
20993 433 108227 171379 232251 206799 186305 133967 94390 66066 72108 17769 7598 50885
20981 50885 -16693 1523 -34689 -70647 -9396 104878 117902 85514 65117 -15318 -673
20970 -673 42009 47508 151378 181904 145786 115307 30900 -95764 -132472 -43648 5257 11199
20958A1199K0798M1195K5781l629n051m9545N1554n0973r0635M1626L4584o5586
20946c8682k7099j7824M5116N799k3577q6550K6277O7128J7123K5147J3186J4554
20934B0598N9733n594n6999M620l0815J5173P6389m2188q4312k5836R06m1894
20922a10219j692K0635k5670J723P344O5381M7449J1276l5640j1089O5276Q9034
20910A23808q4580q6501J02744O1853m6787J01815l2586r725r3367o7314M5672
20899A5032L7631n7680P168Q2885k950m3424j888j2875n5802l677M3977N1491
20887E9888j05176n9992M8321Q3084L504k9109R083P263l0313m1295L0175j5248
20875c9815M0228P3753P2514l9198q0564P3602P250p4012k2301J0175J6934m4508
$$ plain form
20958 11199 31997 73192 98973 95344 90293 40748 92302 41329 -49306 -7680 26904 -38682
20946 -38682 -65781 -83605 -38489 -32690 -56267 -142817 -116540 -49412 -32289 -7142 6044 20598
20934 20598 80331 74737 17738 22358 -8457 6716 83105 40917 -43395 -69231 -68325 -110219
20922 -110219 -111911 -91276 -116946 -115223 -107879 -42498 4951 16227 -19413 -30502 34774 123808
20910 123808 39228 -47273 55471 117324 70537 172352 139766 130041 36674 -30640 15032
20899 15032 52663 -5017 2151 85036 82086 38662 36774 23899 -31903 -35580 8397 59888
20887 59888 -45288 -105280 -56959 26125 29629 520 9603 16866 -13447 -54742 -24567 -39815
20875 -39815 413 74166 146680 107482 26918 100520 107770 33758 11457 21632 38566 -5942
20863e942m8883N5306Q0931K4211k6590j5931j09016k5803l9143o0019L0767L5666
20851a04446N6840o77j052J8816j5722j8593J7408p6890k1053N4813q116L2842
20839f5830J5480o9689j2958J00161J8550K5489K3783L7503K5861o7439j80689
20828a49778p2827Q2331J61239J15888N5631r9799j20628q0405o0207n7192M4488
20817a81259O4471J9216J2273l0330K8803j0735L4711J2484o1333K8932p538k1535
20805a11840J00074J49855n9876l9103o9317q559k7809j5878J8441o4939K2430
20794a06521L9463L9018L6685L2272P4821l9918j00529n1386Q0096m6121m9909
20783i2029K1842j0759K2667J6630q989K6803K7681k0647J6299N055N5476O3941
$$ plain form
20863 -5942 -54825 481 81412 105623 79033 63102 -45914 -71717 -110860 -170879 -140112 -104446
20851 -104446 -47606 -48283 -49335 -30519 -46241 -64834 -47426 -124316 -145369 -90556 -98672 -65830
20839 -65830 -50350 -120039 -132997 -32836 -14286 11203 34986 72489 98350 30911 -149778
20828 -149778 -222605 -140274 20965 136853 192484 92685 -27943 -108348 -168555 -225747 -181259
20817 -181259 -116788 -97572 -85299 -115629 -86826 -97561 -62850 -50366 -111699 -82767 -90305 -111840
20805 -111840 -11766 138089 78213 39110 -30207 -38766 -66575 -82453 -64012 -128951 -106521
20794 -106521 -67058 -28040 8645 40917 115738 75820 -24709 -76095 4001 -42120 -92029
20783 -92029 -70187 -80946 -58279 -41649 -50638 -23835 3846 -16801 -502 4553 60029 123970
20771A23970K3492K5583k7576m396m6618o0577j6978o9841n9435L7126k2988o7174
20759a65412L4065J23294J16147j24681j31924j9873N654R3295j18L858J7089
20748d8606M8524L4824K6372M8718q143m1400N4557n4784j06982k5117R7661k3306
20736B318l2906M6970M5022p0429j59363l5255Q7462P6020N9154N321J0884k5400
20724I798k4263K2167J4248N843k9885j9202j9693l1680Q8116M6657K0666l3102
20712D9670n747n2672k2238L2206J8810K7394j4281L5507Q097N0513j9845o8646
20700C8768L6923k5940j9684M0658Q7459J1279j03687o8787L898j0776K1589l8719
20688b7019o5344j8328K730J3345K4058M431j4602Q7623L9947o6811l9331q4739
$$ plain form
20771 123970 147462 173045 145469 141073 94455 33878 16900 -52941 -112376 -75250 -98238 -165412
20759 -165412 -131347 -8053 108094 -16587 -148511 -168384 -162730 -69435 -69553 -65695 -48606
20748 -48606 -82 34742 61114 109832 101689 60289 114846 60062 -46920 -72037 25624 2318
20736 2318 -30588 16382 61404 -9025 -168388 -203643 -116181 -40161 18993 24314 35198 9798
20724 9798 -14465 7702 21950 27793 -2092 -21294 -40987 -72667 15449 62106 82772 49670
20712 49670 43923 -8749 -30987 1219 20029 47423 33142 68649 76746 127259 107414 38768
20700 38768 75691 49751 30067 70725 158184 169463 65776 -3011 887 -9889 11700 -27019
20688 -27019 -92363 -110691 -107961 -94616 -70558 -66127 -80729 6894 46841 -19970 -59301 -144040
20676a44040N9395O6016K6986l7107m282J8550m1339l5660k3826P961N1678M6015
20664i653l9865k0622k4320k3555k7830J0350O1570M7516O9544Q4274m3989j02821
20652a9401J9762P8897l4593o2728L8521l1809j7708l0138m101J06889k7812m0965
20640b5186l8046o0047q841j2164k5315J7494L7377j1678J3861O2585P075L0878
20628a2007K1713m4353M985K0648j00804j8374J01864P8791m1263r4377L0321
20617e2856P1180l4089O034N7762K5193j6555J9429m6502p5852k071Q8572M2099
20605H2344j0047Q09n4167p9739j7678M1482L9238j0178l8695p79J02147j8548
20593C6189o836r274m8581q5168M529P0105O0998L350O326p3709o2083M363l5266
$$ plain form
20676 -144040 -84645 -18629 8357 -28750 -33032 -14482 -55821 -91481 -115307 -107346 -55668 -9653
20664 -9653 -49518 -70140 -94460 -118015 -145845 -135495 -73925 -26409 43135 127409 83420 -19401
20652 -19401 361 79258 44665 -18063 20458 -11351 -29059 -59197 -63298 43591 15779 -25186
20640 -25186 -63232 -123279 -132120 -144284 -169599 -152105 -114728 -126406 -112545 -49960 -42885 -12007
20628 -12007 9706 -34647 -29662 -9014 -109818 -128192 -26328 52463 11200 -83177 -52856
20617 -52856 18324 -15765 -9731 48031 73224 56669 76098 29596 -46256 -48327 40245 82344
20605 82344 72297 73106 18939 -60800 -78478 -36996 2242 -7936 -46631 -47410 54737 36189
20593 36189 29353 20079 -28502 -113670 -109141 -39036 21962 25312 31638 -42071 -104154 -99791 -135057
20580a35057m418L3896L321l9057n2149L3324J9556P9835K8389l9834N5758N2774
20568C6338o1581m8015l8877J30727N748j03889M8702Q5488k6796k2036o178K3512
20556B3143r0162M7722J5114p3217Q4880J18422j3025m8268q7271k6282N5190
20545F246J2312j8170P1235k1922K1558m3136m611K7067K5648m4157o8293P9964
20533D3741N4673j13087k268L5382j3626n4076N8606L8661j0836r1442l640M3686
20521a4226J5570J146L9251o9654J33738M3559j17130m7056j3664j9568l84l1273
20509g9691m0587j815K4824K016L0930Q7863j7496j1860K9493L562p760l7165
20497a7686j9381O0055P789n519q8508J1879M7583k7361K0620k8410k9074m2349
$$ plain form
20580 -135057 -139475 -105579 -102258 -141315 -193464 -160140 -140584 -60749 -32360 -72194 -16436 36338
20568 36338 -25243 -73258 -112135 18592 24340 -79549 -30847 54641 27845 5809 -369 23143
20556 23143 -67019 -19297 -4183 -77400 7480 125902 112877 64609 -22662 -48944 6246
20545 6246 18558 388 71623 49701 71259 28123 23512 50579 76227 32070 -36223 43741
20533 43741 98414 -14673 -16941 18441 4815 -49261 9345 48006 37170 -54272 -57912 -14226
20521 -14226 1344 2490 41741 -27913 105825 149384 32254 -14802 -28466 -48034 -48418 -79691
20509 -79691 -120278 -122093 -97269 -95253 -64323 23540 6044 -5816 23677 27239 19479 -17686
20497 -17686 -37067 22988 30777 25258 -63250 -51371 -3788 -31149 -10529 -38939 -68013 -110362
20485a10362N0248r522m3572J3142J08637m528K1371M9556N4669k560q9520o8841
20473c1282K7917O9945Q9776m5322o7966n0246j4823O861l6357l6962o562j3348
20461a08369J8817J2296K7060J6069L1799K1434m3906O2992j524o1702n8907k8000
20449a11941P0666P1820l5526m7548P6266P4615k2824o3938n7634q636o8220K4486
20437i8414O4282K7767k4083N2001m538O8O6387P2690P2902m6577l5074J9769
20425A67180k7457q7774K1373J1448n870l3236n4681o5829j5911j63282K4298
20414b29741Q7454Q6458N7622L0247n8927P875l7710n902O2288l736L5853M7665
20402G9446j6627l8442L1600P5147k0610n7138m3348J3979p387n8074k8298K4730
$$ plain form
20485 -110362 -60114 -69636 -113208 -100066 8571 4043 25414 74970 129639 127079 37559 -31282
20473 -31282 -3365 66580 156356 111034 43068 -7178 -22001 -15140 -51497 -88459 -95021 -108369
20461 -108369 -89552 -77256 -50196 -34127 -2328 19106 -24800 38192 36668 -25034 -83941 -111941
20449 -111941 -41275 30545 -4981 -52529 23737 98352 75528 11590 -46044 -54680 -122900 -98414
20437 -98414 -34132 -6365 -30448 21553 17015 17083 83470 156160 229062 182485 147411 167180
20425 167180 139723 51949 73322 84770 78900 45664 -9017 -74846 -90757 -254039 -229741
20414 -229741 -142287 -55829 1793 32040 -26887 -19012 -56722 -62624 -336 -4072 31781 79446
20402 79446 62819 24377 55977 131124 110514 53376 10028 24007 16620 -41454 -69752 -45022
20390d5022O9557k545J02940R393o7134k4925O4550M5702n2918j37466n5170r461
20378a02499M3692O5107K2416l4242L364L3924n2921n5808j01252m7251J27583
20367i7887P6572P1996M4783P3185k330m5717j04684n8866n770K763K1871Q7519
20355F3435k6475M755o1735k3142M149Q462m5983m3335o9533J02179L9679M2896
20343d648P3553o529J2218l5794j7499P2945Q5562Q660p8188p5962o895O399M4199
20330G8021o1389K9381j9578j1056p2365J9964k6962M2154r838J0868p928n6238
20318h4966N0563L0963R700K0815K4485o6058o0784J2821J21319N2387p6894n300
20306B9051m5690p7528k2355P4013L5106m1862j7405L8006m2877O4621K8084J7714
$$ plain form
20390 -45022 24535 21990 124930 134323 67189 42264 106814 152516 99598 -37868 -93038 -102499
20378 -102499 -58807 6300 28716 -5526 -2162 31762 -21159 -76967 -178219 -225470 -97887
20367 -97887 -21315 50681 95464 168649 166319 120602 15918 -42948 -48718 -45955 -24084 63435
20355 63435 36960 41715 -20020 -43162 -39013 -30551 -76534 -119869 -189402 -87223 -47544 -4648
20343 -4648 68905 62376 74594 38800 21301 94246 179808 188468 110280 34318 27423 33822 78021
20330 78021 16632 46013 26435 15379 -56986 -37022 -63984 -21830 -31668 -20800 -28728 -84966
20318 -84966 -34403 -3440 6260 27075 51560 -14498 -75282 -62461 58858 111245 34351 29051
20306 29051 -16639 -94167 -116522 -42509 -7403 -49265 -66670 -28664 -71541 -6920 21164 38878
20294C8878L2973o1188n5416K1801j163Q7857O3862n1002j00281L7925P7730K9742
20282A21718P0144r0230o3896o0169N1359l8125Q25n1975O4798J0198r292M3285
20270D8640J2116m5595k5345j7493J1801N4179K0539k9327l7004j00659J2125
20259i6023N1452L0820j6165K9542L4458j8327o8601J4805P0520R0666q650p4333
20247D0164m896p590j7786J5269m1300l4082K1542K4884L347l1042K2470Q1997
20235G2977l9082j1393K8948L637L1571j1178j8830n5631K867p9061k9667N1969
20223e2873Q315J1708l834M2253J23821N5661o5849j48912j16659N2782R8162
20212D575P2362K46n5236J8106n9797k6825L0840K5897J3517p4587r835R2700
$$ plain form
20294 38878 71851 10663 -44753 -22952 -24115 63742 127604 76602 -23679 14246 91976 121718
20282 121718 191862 101632 37736 -22433 28926 -9199 -8374 -60349 4449 14647 5355 48640
20270 48640 60756 15161 -10184 -27677 -15876 38303 58842 29515 -7489 -108148 -96023
20259 -96023 -44571 -13751 -29916 -374 34084 15757 -52844 -38039 32481 123147 114497 40164
20247 40164 35268 27678 9892 25161 -16139 -50221 -28679 -3795 -448 -31490 -9020 72977
20235 72977 33895 22502 51450 55087 86658 75480 56650 1019 3886 -75175 -104842 -52873
20223 -52873 -44558 -32850 -36684 5569 129390 185051 119202 -29710 -146369 -93587 4575
20212 4575 76937 77183 21947 40053 -19744 -46569 -15729 10168 23685 -50902 -60737 31963
20200C1963N8418k5818r998M243j4307n5357L7921n849J8773j37388q6307M5806
20188a37900m5778j786J3919P6681N3814J5800J2008o906n0763N486J1151N1325
20176b949k181m2787L1621M8156m4451o7588K0956J5609R6792L740k1956L0244
20164F5206R4m8766q0042k716K8671J8906l5244l4740q901l0599j9310K0306L5435
20151i1700j628M7171P3222J8103k7208J8894N2491j16267o8957K9772n6709N8980
20139f3836Q8303l8770p0223N4466M2554L145l8646l6258m4230K9897R6861p7628
20127e4365l6516Q233k854L6604N0425L2710k5472l3850n9040k1182R4264O5816
20115E4773M6588k8072o4679j21484l2782L7637M1078o0227P7573J03055k917
$$ plain form
20200 31963 90381 64563 54565 58808 44501 -10856 27065 21216 39989 -97399 -183706 -137900
20188 -137900 -183678 -185464 -171545 -94864 -41050 -25250 -13242 -20148 -70911 -65425 -54274 -2949
20176 -2949 -5130 -47917 -16296 31860 -12591 -80179 -59223 -43614 53178 56918 34962 65206
20164 65206 65300 16534 -63508 -66224 -37553 -18647 -53891 -88631 -97532 -128131 -147441 -127135 -91700
20151 -91700 -93328 -46157 27065 45168 17960 36854 89345 -26922 -95879 -66107 -122816 -63836
20139 -63836 24467 -14303 -84526 -30060 12494 15639 -23007 -59265 -103495 -73598 23263 -54365
20127 -54365 -90881 -82648 -85502 -48898 1527 34237 8765 -25085 -84125 -105307 -11043 54773
20115 54773 101361 73289 8610 -112874 -145656 -108019 -66941 -127168 -49595 53460 50543
20104E0543p5939k3372o6655O6201J23130R372j29134n4205j2399O2338J318k847
20092e1649L0115P7140K7312m1915M5835N7618M5787m8710j11858m3395j3100
20081b6820l4229l8845K9671J8297j7239M2054n3053M7279J07861J5738J1576
20070A02290j0165k050L6612l7675o4781m3935j4246J8969M6738M7274o7480m2840
20058c1289K0575k1767O664K7911o1522j029K8727P6133K265n6019j22904M2955
20046h9300P5850M7583p7608p2488l4221P2844Q2090J3244n219L9548j7347L1555
20034F6531j6535o3047r9887P134L3948M7587q0158K1003R3837n6532L4235N8825
20022D6941l5144k5572l1013o5651K233L0269M8160L8291J0255k4427j0580K3823
$$ plain form
20104 50543 -25396 -48768 -115423 -49222 73908 83280 -45854 -100059 -112458 -50120 -48802 -51649
20092 -51649 -21534 55606 82918 41003 86838 144456 190243 141533 29675 -13720 -26820
20081 -26820 -61049 -99894 -70223 -51926 -69165 -27111 -80164 -32885 74976 90714 102290
20070 102290 92125 90075 126687 89012 24231 -19704 -33950 -14981 31757 79031 11551 -31289
20058 -31289 -10714 -32481 -25817 2094 -59428 -60457 -31730 44403 46668 -9351 -132255 -89300
20046 -89300 -13450 34133 -43475 -115963 -150184 -77340 4750 17994 12775 52323 34976 66531
20034 66531 49996 -13051 -112938 -105804 -71856 -24269 -104427 -83424 10413 -46119 -11884 46941
20022 46941 11797 -13775 -44788 -110439 -108206 -77937 -29777 8514 18769 -5658 -16238 7585
20010G585m09q6533l9791L7434L0646N9718p043q5847K959j0239p562o459J1164
19997i4377P3583m6099l3060K5414J6975O360M7940p732r369k6938K393P2849
19985B7939J0445p742p4495j0485K5860Q643O8033m5186r9998n6829J1825O2139
19973g9851J2746L0286L0346m5386O2320J2388K5406j6756K6916J7409j03991
19962b8167m4518J9339K6039M6632R3011M5216l926M589j07613J9385r150p2490
19950a1653j2945J6986m886K8677r479q495N6059L2942j8602o1401N2911k7001
19938C3113o4164o0083M5277J0788M9372K8099r6885n7326k5201K4587J23913
19927A1490N0640j9739j07234j0377M9343J0541k1329k8998N7454n5483l8097
$$ plain form
20010 7585 7176 -79357 -119148 -81714 -51068 8650 1607 -84240 -81281 -91520 -99082 -105541 -94377
19997 -94377 -20794 -66893 -99953 -74539 -57564 -51204 -3264 -10996 -20365 -47303 -44910 27939
19985 27939 38384 30642 -43853 -54338 -28478 -19835 48198 3012 -96986 -153815 -141990 -79851
19973 -79851 -67105 -36819 -6473 -51859 10461 22849 48255 31499 58415 75824 -28167
19962 -28167 -72685 -53346 -27307 19325 112336 157552 153626 158215 50602 69987 60837 -11653
19950 -11653 -24598 -7612 -12498 16179 6700 -1795 54264 87206 68604 7203 60114 33113
19938 33113 -31051 -91134 -45857 -35069 14303 42402 -54483 -111809 -137010 -112423 11490
19927 11490 62130 42391 -64843 -75220 -25877 -15336 -36665 -65663 -8209 -63692 -101789
19916a01789L7476L0142n4705N2681N5747j5239o3795Q0489K9314l8505j9603
19905g787M652P9316l6954j6687N5196N3323l1571p4776l6358O4825J19347k3276
19893A49250p5502q3933l1926J37m4851l5549L029L1603N2003K890P8507P8843
19881A24501M740k7108l7357J3094k4966l7103j0151m2376k3173n1607N9329j8273
19869g0450M0987m419MP3352K1091j3181k740L102K8082N572N0307m2855r815
19856G9037K0196K2392n9807q1526j12093j8537J13443Q7825l0169m4015N2645
19845B9391l3910q9923M4252L6339n9030Q175L7797R0067J9479m1584p4503M1392
19833G942p9825j36162N394Q7237P923K151J06809o1326k3782l439m887J11105
$$ plain form
19916 -101789 -64313 -34171 -88876 -36195 19552 4313 -59482 21007 50321 11816 -7787
19905 -7787 -3135 76181 39227 22540 77736 131059 99488 24712 -11646 53179 172526 149250
19893 149250 73748 -10185 -42111 -41974 -86825 -122374 -119345 -87742 -35739 -32849 45658 124501
19881 124501 129241 102133 64776 77870 52904 15801 5650 -36726 -59899 -111506 -52177 -70450
19869 -70450 -29463 -33882 -33878 39474 60565 47384 44644 47746 75828 81400 131707 88852 79037
19856 79037 99233 121625 61818 -19708 -131801 -150338 -36895 50930 20761 -23254 29391
19845 29391 -4519 -94442 -50190 -13851 -72881 -64706 -26909 63158 82637 41053 -33450 7942
19833 7942 -71883 -208045 -202651 -115414 -107491 -105340 1469 -59857 -83639 -87078 -91965 19140
19821A9140J14675n656K487l6398L0225k252k5555k4806j12207k9075o64k0524
19809i0610O2704R663j6380M1981N2594o4485L6213L4926q864J3278Q7605J33216
19797B91841o3182m7369P995p457n7966J7253j8125k6782N9544O0284O0668M0900
19785C17604r879j2844M8386J19364K26044K38466K65935K19372j21896k71519
19775A019033j94089j55368j61880m5620j3334N3218J30041J75744K36274K98748
19765A342767J53771N3780q0059k586m1274k44437k33953n0013P1589J62353j23772
19754A008166k44787L3891K10482P0266j38084j13746Q7511J75994M2850k41778
19744H90765k27504k27366j49640q686j33447k913k9925o6437n3301N7303Q9948
$$ plain form
19821 19140 133815 128159 130646 94248 124473 122221 96666 71860 -40347 -69422 -70086 -90610
19809 -90610 -27906 -18243 -34623 7358 59952 -4533 31680 66606 57742 71020 158625 291841
19797 291841 228659 181290 189285 181828 123862 141115 122990 96208 155752 216036 276704 317604
19785 317604 307725 294881 343267 462631 688675 927141 1193076 1412448 1290552 1019033
19775 1019033 824944 669576 507696 462076 448742 501960 632001 807745 1044019 1342767
19765 1342767 1496538 1550318 1470259 1467673 1426399 1181962 948009 897996 969585 1131938 1008166
19754 1008166 763379 797270 1007752 1078018 939934 826188 913699 1089693 1132543 890765
19744 890765 663261 435895 286255 277569 144122 141209 111284 44847 -8454 48849 138797
19733A38797j6631l4765k7451l3492o3116o5423o7465n290L2723Q6950J8180J9299
19721a7684l2883k1833M8834k7527l0479P3279O2974j6044j17636n6264N3071
19710h2192P7482k8012k0703j0812l1358P7684R0384l3318M3986o6680J2319J4008
19698D2788O551N9284J1451j07649j14087m8254K1008O128P0627J6864J8378j4336
19686c1247J2087Q5778O7832l4848q2563r476J6154o0934K1517J03411m3171M4143
19674H8683N3295p1930n6917k7095L2074M6826m5719q3263J6005J5224k7089J5218
19662d4688L3551j3188l255J5756P986j315J5175P628j4515O1619L1556j9548
19650G6762n3429L8796K982l3112K7324p4294k4398N9002J5782j58930l3341J3988
$$ plain form
19733 138797 122166 87401 59950 26458 -36658 -102081 -169546 -174836 -142113 -55163 -36983 -17684
19721 -17684 -50567 -72400 -23566 -51093 -81572 -8293 54681 38637 -78999 -135263 -82192
19710 -82192 -4710 -32722 -53425 -64237 -95595 -17911 72473 39155 83141 16461 28780 42788
19698 42788 49339 108623 120074 12425 -101662 -149916 -128908 -122780 -52153 -35289 -16911 -31247
19686 -31247 -19160 66618 134450 99602 17039 7563 23717 -37217 -15700 87711 44540 88683
19674 88683 141978 70048 13131 -13964 18110 64936 19217 -64046 -48041 -32817 -59906 -44688
19662 -44688 -11137 -24325 -27580 -11824 -3838 -5153 10022 17650 3135 64754 96310 76762
19650 76762 23333 62129 65111 31999 59323 -14971 -39369 19633 35415 -123515 -156856 -142868
19638a42868J25944J7099j01598K5310M2131P0963Q5285O916j6862l973k6030
19627H2317j122N0907q8520k6981q766j5250m0405j02761P396K1100R4701k987
19615c0371J2901J4741J00307M8876k0464m6314j4816L8350j947j55232q9954
19604a43923R3287J85503Q3057j07366k1803J24338J77869L46602M24608m1803
19594A120369l86302l02694j94555m0990l8574p8088q492M8819m9598r3069l3309
19583e6483m3936q901M7575K5814j2574m4025k0751J11825N2620K8545L8497o01
19571A17605q301p6852l8440L5919R4148K8633r1409m8255n0114J3624O1321J2485
19559E0364Q759N8716L7906n0672L4782j8319p3031o3717L7922J7401N1841m4137
$$ plain form
19638 -142868 -16924 175 -101423 -76113 -33982 36981 122266 129182 112320 108347 82317
19627 82317 81195 132102 43582 16601 7835 -7415 -47820 -150581 -143185 -122085 -27384 -30371
19615 -30371 -17470 -2729 97578 146454 125990 79676 64860 103210 101263 -53969 -143923
19604 -143923 -50636 134867 217924 110558 88755 213093 390962 737564 1162172 1120369
19594 1120369 734067 431373 236818 195828 157254 79166 70674 119493 69895 -23174 -56483
19583 -56483 -100419 -109320 -61745 -35931 -48505 -92530 -113281 -1456 51164 79709 118206 117605
19571 117605 109304 32452 -5988 29931 124079 152712 61303 13048 -37066 -23442 37879 50364
19559 50364 59123 117839 155745 105073 139855 121536 48505 -15212 22710 40111 91952 47815
19547D7815j02152p9120j7842M7773O3259j2863m3184j401J09234M3670P26K4717
19535H0632L5180k7772j3889M8117J9571p9656J532Q1369O4154p0888j37455q5388
19523h4493j1567O5711O0130j9130j8602k1119p862k669L268O9875j7338L4543
19511E0747j3869k2929m0467N8246K9816J341l2677j6603R407k5213N4035r584
19499D2250k4929J2087m1148k0426j162n9049L3195K0734J5144M8641p402J29956
19487A47891j0874P1136n5956j31467l2925j1894M2804P5252L9515k4503Q7r4741
19475A4325j9400P283j736j7938K7054k1290k3097J011J17571P1737p0072q8384
19463b936o0676j9985J0555M6209l6409j4692O2185K8890m0643P9337R0546l7769
$$ plain form
19547 47815 -54337 -133457 -151299 -103526 -40267 -53130 -96314 -97715 11519 55189 55915 80632
19535 80632 115812 88040 74151 122268 141839 62183 63715 145084 209238 138350 895 -84493
19523 -84493 -96060 -30349 29781 10651 -7951 -29070 -36932 -39601 -36333 33542 16204 50747
19511 50747 36878 13949 -26518 31728 61544 62885 30208 13605 23012 -2201 51834 42250
19499 42250 17321 29408 -11740 -32166 -33328 -92377 -59182 -38448 -23304 25337 17935 147891
19487 147891 137017 208153 152197 20730 -12195 -24089 18715 93967 133482 108979 109066 14325
19475 14325 -5075 2208 472 -17466 9588 -11702 -34799 -33788 83783 155520 85448 -2936
19463 -2936 -63612 -83597 -73042 -26833 -63242 -77934 -15749 13141 -27502 51835 142381 104612
19451A04612j42287j24372Q8332P3479O0677Q0999j4848j2568p7213J2082Q097
19440E6990k2604n5203k8462M8349J64809K5476o8249p9647K7807O2424L0748
19429A62438o4398p6015N4173P7484k2513j04480M1387O2093J1730k9750O3451
19418A75600r170k3376k3620K33m3311n0189l8857K4188Q8591n2113O3586O0271
19406A71833r7664k3137o2765l3846L9773k2747j1576p5064j7318Q0020q580k972
19394f4043j4272j0555K0143R7025m0514p612N9141j9717M3954O1990M022l0433
19382I9129J3939p5445k1670Q6026L0562L3574O1224p034p5103N9788J2575K3604
19370B41169L6921Q719r4517n6766K4473k7383P8561M8249L964p4520q4307n9784
$$ plain form
19451 104612 -37675 -162047 -73715 -236 60441 141440 126592 114024 36811 48893 56990
19440 56990 34386 -20817 -49279 -930 163879 189355 121106 41459 69266 131690 162438
19429 162438 98040 22025 76198 153682 131169 26689 68076 130169 141899 112149 175600
19418 175600 166430 143054 119434 119667 76356 26167 -12690 11498 100089 47976 111562 171833
19406 171833 74169 51032 -11733 -45579 -5806 -28553 -40129 -115193 -132511 -52491 -61071 -64043
19394 -64043 -78315 -88870 -68727 28298 -12216 -19828 39313 19596 63550 125540 129562 99129
19382 99129 113068 37623 15953 101979 132541 166115 227339 220305 145202 204990 217565 241169
19370 241169 278090 286809 192292 135526 159999 132616 211177 259426 263390 188870 104563 44779
19358D4779j8325Q0968P0914O8694j16413m2434k3522n8457K7886Q6877O1832
19347A82799K6008k9026o9395p9430n3588n2626j4433n8304K1613Q1249J1476
19336c3657M5713l4300J2102K650k1433Q726J495R9755O0550l1700n6320l5794
19324A7787r3964o6768j3713J25347J09626r943O9884N2535k0488m1835l7746
19313I0722l3343k8948j2959k7945n366l5429K9413L4833Q2921J04815J8492m1728
19301A75478j3278j16782l5939M5639K0570q408K6048M2393j17273r4827n0056
19290a26435O3312J49988P8278l1583n8745n6409p954q9547n1109o9399N1972
19279a47631O9497J32530Q6478K5590j05264j04776P2697O9030l790J06865j4731
$$ plain form
19358 44779 26454 107422 178336 247030 130617 88183 64661 6204 34090 120967 182799
19347 182799 208807 179781 110386 30956 -22632 -75258 -89691 -147995 -126382 -45133 -33657
19336 -33657 12056 -22244 -10142 -7492 -28925 -20199 -18704 81051 141601 109901 53581 17787
19324 17787 -76177 -142945 -156658 -31311 78315 68372 138256 190791 170303 128468 90722
19313 90722 57379 28431 15472 -12473 -17839 -53268 -23855 10978 93899 198714 217206 175478
19301 175478 162200 45418 9479 55118 75688 67280 93328 135721 18448 -76379 -126435
19290 -126435 -63123 86865 165143 133560 74815 18406 10452 -79095 -130204 -199603 -147631
19279 -147631 -78134 54396 140874 166464 61200 -43576 29121 98151 94361 201226 186495
19268A86495j50534j9289L7381Q4753J377p9463o7663K3175l3672k7200j2063
19257e6703L5483J6269m4682k3564P4380L343r563m1950J49514K47294K8949q623
19245C70147R1400P6514J8414N6785M0177O861k0955j79986j03040O162M3269
19234D05748J32469N7980P6396K2843j4326q8522l1090R7213J60836k6195j23250
19223F70102j62878p3772j09317O885J9266m9284r5213K9236M7781M5327P78k8869
19211C00042n6836j1874N7025K2337O4184P9138Q558o2875q4078M1803M8891l3130
19199C73185n7523n8660l812J6039K9492M0101m7374J4592P1059N4081j2203q527
19187D10450m0441m8000K5651K89L0956Q1986Q8775k6602k7136j5268r021k7899
$$ plain form
19268 186495 35961 16672 54053 138806 140183 60720 -6943 16232 -17440 -44640 -56703
19257 -56703 -21220 -4951 -49633 -73197 1183 4526 -5037 -46987 102527 349821 378770 370147
19245 370147 461547 538061 556475 613260 653437 660298 639343 459357 356317 362479 405748
19234 405748 538217 596197 672593 695436 681110 592588 561498 658711 819547 793352 670102
19223 670102 507224 433452 324135 331020 350286 301002 205789 235025 282806 328133 328911 300042
19211 300042 243206 231332 288357 310694 374878 454016 462574 399699 315621 357424 406315 373185
19199 373185 315662 257002 253190 269229 298721 338822 291448 306040 377099 431180 418977 410450
19187 410450 370009 322009 347660 347949 378905 460891 549666 523064 495928 480660 471639 443740
19175D43740Q1339M4310R4852J1616l9605J4736J3482P8459O4907R7316j3853
19164H91299k7759m9775K5615J47301J18307J36770J10416J73776K53026L22246
19154B101222M33461K66652j36293l87877k67542N9249R8631k6808K9064R1308
19144B261067K90107L90628N25321R38053J276944O69316m80947p43550m00529
19135D726410J08539L24937N98882Q27121P28834J50255Q4520N59828J123937
19126I233263J454114J061309R07270J407178K341693L638214N615471Q783502
19118C4442014J4487239K4127770M2618287P8958042J27821535O0582137q3305784
19111B99731240j08839019o7908596l7314472j9675225r665846k482968M549847
$$ plain form
19175 443740 525079 569389 664241 675857 636252 650988 664470 742929 807836 905152 891299
19164 891299 863540 813765 839380 986681 1104988 1241758 1352174 1525950 1778976 2101222
19154 2101222 2534683 2801335 2665042 2277165 2009623 2068872 2167503 2140695 2169759 2261067
19144 2261067 2551174 2941802 3467123 4405176 5682120 6351436 5870489 5126939 4726410
19135 4726410 4834949 5159886 5758768 6585889 7314723 7464978 7549498 8109326 9233263
19126 9233263 10687377 11748686 12655956 14063134 16404827 20043041 25658512 34442014
19118 34442014 48929253 73057023 115675310 194633352 322454887 383037024 299731240
19111 299731240 190892221 122983625 85669153 65993928 56328082 53845114 58394961
19104E8394961J3958635K9495752N7348805J06423121J16905966k5008321j18111934
19097B39406985r2207331n2775339l0125010j8531800j1934083p918744n489246
19090B0425432l802614k624235j575180p61056j063242j503488j124843l84638
19082G586136l05943r48852j105020q17830l75660j92872o4043K10568N68914
19073D555398O86542N2013l63454o09408p62338o37027n25337l26726j56019J8546
19063A932190K3058M8039O0757J03099K08684K46566k3945k75875l39979l99542
19053A583052k61186k27116j60530J5932l6792j7268j15498j38153r6769j521
19043E44151P7971J574l3368Q801k7732m4662p2763k0926j549k7132n6672M9739
$$ plain form
19104 58394961 72353596 101849348 159198153 265621274 382527240 357518919 239406985
19097 239406985 147199654 94424315 64299305 45767505 33833422 25914678 20425432
19090 20425432 16622818 13998583 12423403 11662347 10599105 9095617 7970774 7586136
19082 7586136 7280193 6331341 5226321 4408491 4032831 3839959 3775916 3986484 4555398
19073 4555398 5241940 5293953 4930499 4321091 3558753 2921726 2396389 2069663 1913644 1932190
19063 1932190 1955248 2003287 2064044 2167143 2375827 2622393 2598448 2322573 1982594 1583052
19053 1583052 1321866 1094750 934220 950152 913360 896092 780594 642441 545672 544151
19043 544151 622122 623696 590328 599129 571397 526735 453972 433046 431497 404365 347693 397432
19031C97432M0687q098n594K9171j15881o4266M7383L6977Q144l9373o779k6259
19019B93544K8157k8944k878L9142r0312o1975k1132J4218k3107j3542k6287J4837
19007A21721m301J5152L3084L70O4496J0630l2303q073q4235J2597J17083Q3837
18995C30058j3535j11247l9327k7431k7893o0890j36992l4544L3078Q3841R564
18984D682J324l1310p8758L6340J8916m2896J30135J56114J5095j68743j60765
18973a19866N1517N2488L760J21586K7200m6399l2146j9490P0605J46978K4231
18962B80464j63968p9268p6616J0778J16792J11251P487n5343P7838M2892K1556
18951B93863j635M7019m9075n2833L8686L0421K36985L29961o4607k04546j62523
$$ plain form
19031 397432 438119 430021 424427 453598 337717 273451 320834 357811 365955 326582 319803 293544
19019 293544 321701 292757 289879 329021 238709 176734 155602 169820 146713 133171 106884 121721
19007 121721 117420 132572 165656 166026 230522 241152 208849 200776 116541 129138 246221 330058
18995 330058 316523 205276 165949 138518 110625 49735 -87257 -121801 -88723 -4882 4682
18984 4682 6006 -25304 -104062 -67722 -48806 -91702 38433 194547 209642 40899 -119866
18973 -119866 -68349 -15861 -12101 109485 136685 90286 58140 38650 109255 256233 280464
18962 280464 116496 37228 -39388 -28610 88182 199433 206920 151577 229415 272307 293863
18951 293863 292228 339247 290172 237339 276025 306446 543431 873392 808785 604239 441716
18940D41716l8076j9159m9240L2906J75578L67214L84828J60034L872k83273l27213
18929H49187k07601j44615r2228n1782p3901J26923L33640K58662j41575k88784
18919E67926j30462r717O0915o3499j75694q2046l0413p794q0853j9844K384K3662
18907E4565M0505L5989J8796j4228J8182J5977J0680o0078j3654n2553l1016N018
18895B8183K1304j2476N8730j01412p4853N8009J1249O8107K546p9756O7016M8064
18883I4711l2462P0509O7706J8578k8123J2306p701q5915j3114p2589n6635j2701
18871d5430k6919M1334q181m5996m8767k6380Q267J25622K7870M539O5956L7002
18859A08917L121k2720l8053m7090l853N4729n0951n6968K4047J33752Q2116n4433
$$ plain form
18940 441716 403640 384481 335241 368147 543725 910939 1295767 1455801 1459673 1176400 849187
18929 849187 641586 496971 404743 352961 279060 405983 739623 998285 856710 567926
18919 567926 437464 427747 488662 425163 249469 167423 137010 129216 48363 28519 30903 54565
18907 54565 95070 131059 149855 135627 153809 169786 180466 120388 106734 54181 23165 28183
18895 28183 49487 37011 95741 -5671 -80524 -22515 -11266 56841 59387 -20369 46647 94711
18883 94711 62249 132758 200464 219042 190919 203225 195524 109609 96495 23906 -32729 -45430
18871 -45430 -72349 -31015 -39196 -85192 -133959 -160339 -152072 -26450 1420 5959 71915 108917
18859 108917 112038 89318 51265 4175 322 55051 4100 -52868 -28821 104931 187047 132614
18847A32614j32815O7545N1305p9390j24161k6397N9543J6277K3226K9769j0316
18836G200k7314r3390j365k1005P1019K0018m8463R9745R5486J2690k6403q8809
18824e91l7072j9632J2449L7443O1657K3642J6674r7166n2772j7634k8198R347
18812i1853K2357L5695K8098j6393K1713J531O4189J0477r9403L9327L9139j08160
18800e3283r2213l8923J38313L1046l5613M0727K8641l8013L4785L6519n9913
18789g927j8118O6784j4608n8289J15632M1612p6642n7080P7597M6008p5493j53307
18777a13831j01961K2296P4039L4476J08056P5699J8249K2635O566J5134k7899
18766A33459m1385p8031l2079J5954Q8979O4532J4041l2424j6534m0319k7545
$$ plain form
18847 132614 -201 67344 118649 39259 -84902 -111299 -51756 -35479 -12253 17516 7200
18836 7200 -20114 -113504 -114869 -135874 -64855 -44837 -93300 6445 101931 114621 88218 -591
18824 -591 -37663 -57295 -44846 -7403 54254 77896 94570 -2596 -55368 -73002 -101200 -91853
18812 -91853 -69496 -33801 -5703 -22096 -383 1148 65337 75814 -23589 15738 54877 -53283
18800 -53283 -145496 -184419 -46106 -15060 -50673 -9946 18695 -19318 15467 51986 -7927
18789 -7927 -26045 40739 26131 -32158 83474 125086 48444 -8636 68961 114969 39476 -113831
18777 -113831 -215792 -193496 -119457 -84981 23075 98774 117023 139658 146224 161358 133459
18766 133459 92074 14043 -18036 -2082 86897 151429 165470 133046 116512 76193 48648
18755D8648m8935j6119j3066l1047l0856K1267m8969p680J01002L9846L2907n884
18743D1114n2302K8102N1936k3225m1259m2029N8727L927K1096q2604J0970k3368
18731d8915J0351L3962R5248M0284N1622j6703l4226k0326j8790L833o5441l5188
18719d289m6659L6975J4390l5290k410n09j8691l7333q1282L6393M1338K3555
18707g3812L971l513L8006n889k9335J9998K2886n3821m0120M5230P2619j5451
18695a9231l7274Q832M7082N3569N1855p775l0752j00796r7067q7076J48397J37373
18683F7137q294k728L9425l0360r8439M2312J6695l8848l9542n8281m2970M1908
18671a11985P7547N6515j7656r3158n32Q1363M0099l9784l4847m9338K3301J7947
$$ plain form
18755 48648 -287 -16406 -29472 -60519 -91375 -70108 -119077 -126757 -25755 14091 46998 41114
18743 41114 -11188 16914 68850 45625 4366 -37663 21064 24991 46087 -36517 -25547 -48915
18731 -48915 -38564 -4602 90646 130930 182552 165849 131623 111297 92507 96340 30899 -4289
18719 -4289 -50948 -13973 417 -34873 -37283 -37792 -56483 -93816 -175098 -138705 -97367 -73812
18707 -73812 -69841 -73354 -35348 -41237 -70572 -50574 -27688 -81509 -121629 -76399 -3780 -19231
18695 -19231 -56505 -47673 -591 52978 104833 97058 66306 -34490 -131557 -218633 -70236 67137
18683 67137 58843 56115 95540 65180 -33259 9053 25748 -13100 -52642 -110923 -153893 -111985
18671 -111985 -34438 22077 4421 -88737 -89269 -7906 32193 -7591 -42438 -91776 -68475 -50528
18659e0528O9296M1925k0096K9852m9333k0286k2941J0509J3364o4594j0979M2157
18647c1654J25222k0054o4649K7188p5795m2043P5602O986K8579J2139n2033p5546
18635h6058J0838j3313P8125J67473K531j17698l0130m767J5975p479n403Q3265
18623I3359J2915O3314p190r5781o5357K5184M1738M3062O5778n406L77l0446
18611A41547r0091k5316R2598N6615o9860j21465k2061J9832p6281l0393J06359
18600a8516Q8668O2343j521J2984j17558o2993p0659q4597n924J54607J03769
18589F0603k3297j13223j08590m0006K3499O9233N1472P0643r051o0198M1936
18578c6979Q182R948K089M1995O4429N6525r146l5004r3108j01411Q3014N3933
$$ plain form
18659 -50528 18768 60693 40597 70449 21116 830 -22111 -11602 1762 -62832 -73811 -31654
18647 -31654 93568 73514 8865 36053 -39742 -81785 -6183 803 29382 41521 -10512 -86058
18635 -86058 -75220 -88533 -10408 157065 159596 41898 11768 7001 22976 15497 10094 93359
18623 93359 106274 169588 162398 66617 1260 26444 68182 111244 177022 171616 171993 141547
18611 141547 51456 26140 118738 175353 105493 -15972 -38033 -18201 -94482 -124875 -18516
18600 -18516 70152 132495 130974 143958 26400 -36593 -107252 -191849 -197773 -43166 60603
18589 60603 37306 -75917 -184507 -224513 -201014 -131781 -80309 -9666 -18717 -78915 -36979
18578 -36979 -28797 -18849 -16760 25235 89664 146189 137043 102039 8931 -92480 -9466 44467
18566D4467Q786j3652k7850n8554l2634J7750R5817L7983o501l2539L3600k9884
18554C6789m6946l0083K530K0726j543m4121L1976M2317J6410R075p7231N77Q6320
18541D6796O730l0172L713J2835p699l0187l2156L9920J130k7994m1681j2257
18529g1022O4365J6147L8287k8302K1453r4609r2152l1162K3857P4454L7011p0833
18517a12506M9766M0826n9984R3895O0699N5911m3519n6114O5264Q4508K616j06046
18505G5316q8657k513N7314m9778M2922j7243m3746N9986M5683Q074M6689l4097
18493I9950o0855o6225m1991K9116M1503n6143l1350n893M4317J463K3421p424
18481c0111k6970J8301R1028k1668N0579J6349j46159m0976J5543J039M3316P9452
$$ plain form
18566 44467 53253 39601 11751 -46803 -79437 -61687 34130 72113 65612 33073 66673 36789
18554 36789 -10157 -40240 -37710 -16984 -18527 -62648 -30672 11645 28055 37130 -40101 -39524 46796
18541 46796 53526 23354 27067 39902 32203 2016 -30140 9780 10910 -17084 -58765 -71022
18529 -71022 -6657 9490 47777 19475 40928 -53681 -145833 -176995 -153138 -78684 -41673 -112506
18517 -112506 -62740 -21914 -81898 11997 72696 128607 85088 28974 94238 178746 181362 75316
18505 75316 -13341 -15854 41460 -8318 34604 17361 -26385 33601 79284 87358 134047 99950
18493 99950 39095 -27130 -69121 -40005 1498 -54645 -85995 -91888 -47571 -46108 -22687 -30111
18481 -30111 -57081 -38780 52248 30580 81159 97508 -48651 -89627 -74084 -73045 -29729 49723
18469D9723j9020q5392j8582J1572Q3942N3239j9073J899k0262N2508N9419Q4766
18457B34739o1976m5868j0329j5504k1867m1760J3331M6060j7429L7505O6306
18446A83208L3279l6314O6344J15520J27522K60649L48491K91052L156l09224
18436A083683l59450k46722j11278m3330j8889M1427J54251K24049J37971K04252
18426A065964L18799J75623j87198l17414l15609j14497j17802j24696q7282j10026
18416A85862j19272p1313J5960J02851j0711j1480J435K1868J092o9290l9264
18405G738j8168j643N9977J7474J3268J01920M3004j28297l4425M0865L7793n2767
18393H6739j35247J2189J1487J7376K9088m2650l6595o733m5762M4181O4329m0609
$$ plain form
18469 49723 30703 -54689 -73271 -61699 22243 75482 56409 58308 38046 90554 149973 234739
18457 234739 172763 126895 116566 101062 79195 37435 50766 96826 79397 116902 183208
18446 183208 216487 180173 246517 362037 489559 750208 1098699 1389751 1392907 1083683
18436 1083683 724233 477511 366233 322903 304014 345441 499692 723741 861712 1065964
18426 1065964 1384763 1560386 1373188 1055774 740165 625668 507866 383170 295888 185862
18416 185862 66590 -4723 11237 114088 103377 91897 93332 115200 116292 47002 7738
18405 7738 -10430 -12073 47904 65378 78646 180566 223570 95273 60848 101713 139506 86739
18393 86739 -48508 -36319 -24832 -7456 21632 -21018 -57613 -64346 -110108 -65927 -1598 -42207
18381d2207p842O7110J4352n6900o7761j3543j1866j8063J12585K4592Q6507M3382
18369A30346L5494n3048j02455n2052k0013m8542m5470J31232P7746K7483J3465
18358I4186m0884k3727o367J7131L0966m681j1324n1657o827M4450n3958l7595
18346e0287q54l3890k1902P705O6540K9643N264J5103o0877k1777j4160m2332
18334a21824M9506J01093l1810j16416L4500J07253K6110k8147K4746k7495j12938
18323i5422j01844O5814J17201Q6209l7706K43p358j6208Q6854Q105k5284l8543
18311D2061n1560Q6899O6070n623l5354R718k1990q1346j26341n7626k7239L5794
18299a66537k405r176J7114K326O6832L4349N0561P8496M3228k1121p0080q0962
$$ plain form
18381 -42207 -50049 17061 31413 -25487 -93248 -106791 -118657 -136720 -24135 457 86964 130346
18369 130346 165840 112792 10337 -41715 -61728 -110270 -155740 -24508 53238 80721 94186
18358 94186 53302 29575 23208 40339 71305 66624 55300 3643 -3184 41266 -12692 -50287
18346 -50287 -51141 -85031 -106933 -99228 -32688 -3045 2219 17322 -43555 -65332 -79492 -121824
18334 -121824 -72318 28775 -3035 -119451 -84951 22302 48412 20265 45011 17516 -95422
18323 -95422 -197266 -131452 -14251 71958 34252 34495 27137 10929 97783 105888 80604 42061
18311 42061 -9499 77400 143470 137847 102493 112211 90221 8875 -117466 -175092 -202331 -166537
18299 -166537 -168942 -178118 -161004 -158678 -91846 -57497 -6936 71560 114788 93667 23587 -57375
18287e7375j4509N266m9073J5564L9807O2605L2485n0133j7132k7109l5133M6092
18275d8645N2102Q48o1319M8069O4193j234o1740k2341M525j808J8794j4857K7768
18262D355N556L9933L6241m5625m6369P7530o1495l3664l6987q885o467M2164
18250c3713Q5349o8285p8897o3027L6790N9084J4697J0298L951J7750J993J25633
18238A11623J8214o3101K3709n4423m6623o1042K7534j9121K7400p2913J4093
18227i4650m12r1475k7018L8949Q1669M5030j1065P0128l3108l5662j1970J533
18215f8051q2537r08K6421J3553J0168P585l6726N5266K7766L9448l9599L9433
18203h181N4517N8463P9563O242j83789j04998K3892j3657N6634M0420j7451k8351
$$ plain form
18287 -57375 -71884 -66618 -115691 -100127 -60320 2285 34770 -15363 -32495 -59604 -94737 -48645
18275 -48645 3457 4305 -57014 -8945 55248 54014 -7726 -30067 -25542 -27350 -8556 -23413 4355
18262 4355 9911 49844 86085 40460 -5909 71621 10126 -23538 -60525 -69410 -75877 -33713
18250 -33713 51636 -16649 -95546 -158573 -121783 -62699 -48002 -37704 -33753 -16003 -14010 111623
18238 111623 129837 66736 90445 36022 -10601 -71643 -44109 -63230 -35830 -108743 -94650
18227 -94650 -95062 -186537 -213555 -174606 -92937 -47907 -58972 11156 -21952 -57614 -69584 -68051
18215 -68051 -150588 -151496 -125075 -111522 -101354 -93769 -130495 -75229 -47463 -8015 -47614 -8181
18203 -8181 46336 104799 184362 190604 6815 -98183 -74291 -87948 -31314 9106 -8345 -36696
18191c6696Q6893P4784q5759j47024M251P1839j9107m54L2751R646l3967j5122
18179e7965m3246J290J3545j5607m7103p1592N218Q0028R6446o6273M326N6299
18167d4634m3604Q615P8110N8940N1188k6796l9213o912p9689k5057k5200k9068
18155a23320J8653J38641J8337o1962q9055O8810Q5555l1655j04283k614P6774
18144f119Q3801K5348r2589J02306K3744Q02J6680k7918j12295m3739n4200M4812
18132c9367J36285L6080p4835n7437j3512l6826P904N3257m8809k6369J9913M5494
18120A778n937k9001j1418L1837N6363o3025J4483m0843k791J7702l6714K2152
18108d5414m1004k619R1207J3654J9052k1376j05670K3291R1478Q3818m0023n4987
$$ plain form
18191 -36696 50197 124981 39222 -107802 -103551 -31712 -50819 -51273 -18522 -8876 -42843 -57965
18179 -57965 -101211 -99921 -86376 -101983 -149086 -220678 -215460 -135432 -38986 -105259 -100933 -44634
18167 -44634 -88238 -79623 -1513 57427 108615 81819 42606 35694 -43995 -69052 -94252 -123320
18155 -123320 -104667 33974 52311 -9651 -98706 -29896 55659 24004 -80279 -82893 -6119
18144 -6119 77682 103030 10441 112747 136491 137293 153973 126055 13760 -29979 -84179 -39367
18132 -39367 96918 132998 58163 726 -12786 -49612 -41708 11549 -37260 -63629 -43716 1778
18120 1778 -4159 -33160 -44578 -12741 43622 -19403 -4920 -45763 -48554 -30852 -67566 -45414
18108 -45414 -86418 -89037 2170 15824 34876 13500 -92170 -68879 22599 106417 66394 11407
18096A1407m7098M0673R3812K7097m1900j03501j05053o419M8403M6656R317O7495
18084D0889J4431N5509m5245m5j12139r7751J9150Q8741k1197m5012K4761R7477
18072A9569n597q9736j9551M1731P1677O1711N4113m4753m4939j0542m789n2464
18060b3570n5740l4905m6270Q923J9142P7897Q5593q030l3172q9361j6347N2236
18048f3604m8505K2348Q0095r6873l7050L6875O7107j4303p028N0078J1616N7366
18036E8122p1724l3409J7504m704K5524L0017l531m0948J9685N1272K5259j0477
18024F2590r632j634o160N241J3225l4682M6838N1208K6559q977r051j9501l6508
18011G9516m6131j0804Q8137J9309k2088j4252L2063k873N539N1040M7953J06808
$$ plain form
18096 11407 -35691 4982 98794 125891 83991 -19510 -124563 -130982 -82579 -35923 -26606 40889
18084 40889 55320 110829 65584 65539 -46600 -144351 -125201 -36460 -57657 -102669 -77908 19569
18072 19569 13972 -75764 -95315 -53584 18093 79804 133917 89164 44225 33683 28894 -23570
18060 -23570 -79310 -114215 -160485 -151562 -132420 -54523 31070 23040 -10132 -99493 -115840 -63604
18048 -63604 -112109 -89761 -9666 -106539 -143589 -106714 -39607 -53910 -60938 -10860 756 58122
18036 58122 -13602 -47011 -29507 -34211 -8687 21330 17799 -23149 -3464 47808 73067 62590
18024 62590 52958 51324 45164 50405 63630 28948 75786 126994 153553 144576 135525 116024 79516
18011 79516 33385 22581 110718 130027 107939 93687 125750 122877 128416 179456 227409 334217
17999C34217J31679J67591K08228L02395L87446J31696k96161l56113k47642j45338
17989F17998j55536m3488N608J6071M6964K30632L10611L56604K39860j31218
17979A494106l33981l57119k39901j00566j13404p9700r5240m1809r6156r7982
17969f1752L0562L2950L0434J2867j1356l1258l231L6554L9489j944l7969r1439
17957e6093m3983j7280J8264N3821O8216R6662q336n1705n555J7080J0389L0501
17945A11981L8171p3845m0899j0169p492n2452n49Q0250R2602k5790j1563Q239
17933A08484L8673k3359K6396P2862k7957j1987o5716m9257r1711R005J08540
17922I3973L7589r9722n5969j0281P517L325L3847j3896J7697J8777l734M0828
$$ plain form
17999 334217 465896 633487 841715 1144110 1531556 1663252 1367091 1010978 763336 617998
17989 617998 462462 418974 424582 440653 487617 718249 1028860 1385464 1625324 1494106
17979 1494106 1160125 803006 563105 462539 349135 269435 174195 132386 36230 -61752
17969 -61752 -31190 1760 32194 45061 33705 2447 -784 35770 75259 73315 35346 -56093
17957 -56093 -100076 -117356 -99092 -45271 22945 119607 111271 59566 54011 71091 81480 111981
17945 111981 150152 76307 35408 25239 17747 -34705 -35254 44996 137598 111808 100245 108484
17933 108484 147157 123798 150194 223056 195099 183112 117396 68139 -23572 -14567 93973
17922 93973 131562 31840 -24129 -34410 -26893 -23568 10279 -3617 14080 32857 29123 69951
17910F9951L6647k0538p4268R37L7510l0607n9475j02922P5511L5173O0283P6107
17898A04309l2287k8179O8051n594o2813J322j6287R435p3733j2191R8984M386
17886E5403o2808q9386l40O4709n806J8385K977q349L2559J3358l6712k2223j06618
17873a44851m694R4798O6159k7323N9603L7483N2899J0740n8000k8717k9459N0598
17861G9236N0190J4262M913q0583j8642k3408O1621k5852p2591q2898m7805K6556
17849a15001M196L7137K1047n5846K5565K7265p856n81n6779N7534n733l1223
17837a00275O6223R4911L0329l8739j1820j4264N7606J643K616N5014L6402k290
17825A77356l3948r1558l2898j604M5842p8817o6528N3519K4592R6527j8883k2917
$$ plain form
17910 69951 106598 86060 11792 12729 50239 19632 -39843 -142765 -67254 -32081 28202 104309
17898 104309 72022 43843 111894 106300 43487 44809 28522 37957 -35776 -47967 51017 55403
17886 55403 -7405 -96791 -97131 -32422 -38228 -19843 -16866 -25215 7344 20702 -16010 -38233 -144851
17873 -144851 -149545 -54747 11412 -15911 43692 81175 134074 144814 86814 58097 28638 79236
17861 79236 129426 143688 148601 68018 49376 25968 87589 61737 -10854 -93752 -141557 -115001
17849 -115001 -110805 -73668 -52621 -108467 -82902 -55637 -63493 -64074 -120853 -63319 -69052 -100275
17837 -100275 -34052 60859 91188 52449 40629 26365 83971 85614 88230 143244 179646 177356
17825 177356 143408 51850 18952 17348 63190 -15627 -82155 -28636 -4044 92483 73600 50683
17813E0683l8747j23017L1661R2995J09026J8458o2018j18993q3497K2011k1238
17802a22676L8409k5353J9554K1147P2633M803k2245j7508r689l7851n991j1280
17790i6047k5268Q6353J21409m2092l5888j942L7378q294j8882J2838J9652L2539
17778H1756O34J1394J8244P265Q3650o819j01062L065j1457j43915j13398l8438
17766b09081O0995O3508L5813N0896m9710L7528J0973k3632k2157P201n735O9340
17754B5939J03560N7669p236q7760p7034l5060p343p8437O497P7627M9582M0390
17742F8394l7318p8279n5068R4412L8297R105n4548K8828n059n1126J1910J1438
17730a9014M5652M0844l3625R184M37k7371K6071l733p1104Q2088N5371p4179
$$ plain form
17813 50683 11936 -111081 -79420 13575 122601 141059 79041 -39952 -123449 -101438 -122676
17802 -122676 -84267 -109620 -90066 -68919 3714 8517 -13728 -31236 -40925 -78776 -84767 -96047
17790 -96047 -121315 -34962 86447 44355 8467 6525 43903 35609 16727 29565 49217 81756
17778 81756 82390 93784 112028 119293 202943 196124 95062 98127 86670 -57245 -170643 -209081
17766 -209081 -148086 -84578 -48765 2131 -47579 -10051 922 -22710 -44867 -37666 -43401 25939
17754 25939 129499 187168 179932 92172 15138 -19922 -27265 -105702 -99205 -21578 28004 68394
17742 68394 31076 -47203 -102271 -7859 30438 39543 -15005 13823 8764 -42362 -30452 -19014
17730 -19014 26638 67482 33857 43041 43478 16107 42178 38445 -32659 49429 104800 30621
17718C0621n6473M9835M8250N7913j4440J2792o0688q9164M9008N4963K3585j6488
17706H9714N5519q563j20062j48698j2398M7411M4762j3585K6868J9111M2607
17695B2686K2806j8393o844l2608Q6083l6965j01319Q4324Q0257J4159L2747N3121
17683B00054M0011m6504m961j8153j8890P9134N7002j8089n7562j37840k5124
17672D9078N5932O5345Q792k9573m4458L1667L1593r318j07842j05866L7990Q6389
17660F9729N4038q1894o1356P2240P4416M1404J5183j7495o4681o4301n7839n7500
17648g8056J5583O0390O2015M6134M3393J14786P8063J12259L7864j76939j59732
17637A55760l8419N5668j7687j074K4437m1114j28186n3520l372l8766J7545J4424
$$ plain form
17718 30621 -25852 23983 72233 130146 115706 128498 67810 -21354 27654 82617 106202 89714
17706 89714 145233 136670 16608 -132090 -144488 -97077 -52315 -65900 -39032 -19921 22686
17695 22686 45492 27099 20255 -12353 73730 36765 -64554 19770 100027 114186 146933 200054
17683 200054 240065 193561 188600 170447 151557 230691 287693 269604 212042 74202 49078
17672 49078 105010 170355 179147 149574 105116 136783 168376 159058 51216 -54650 -16660 69729
17660 69729 123767 41873 -19483 52757 127173 168577 183760 166265 101584 37283 -20556 -78056
17648 -78056 -62473 -2083 59932 106066 149459 264245 342308 454567 492431 315492 155760
17637 155760 117341 173009 155322 154248 178685 137571 9385 -44135 -47507 -86273 -68728 -54304
17625e4304m971L0182Q1979O2641N546q202n4938q9039p2775l6819R8530J05639
17613F3469P1306P9579K2647r0016q4933q5723m9036k1082n9176J2139j5509k9429
17601a85764J20131N8680J03747M0730j5180M3964j30427p8604p3766k3918O9800
17590g0607M2356j8317K3810N9641M3043K8419L6487O8758k0569L0071K9688p6423
17578A76357n9750l8669J4034j0482q6388r5916k6961m6130r0385N2268P8692
17567a33330N4041M0793Q2695M2113l2942p537j3083r7317L2299J32182P7133
17556A77047J1756J41232J15304p6438L32O3307O9869J13649L1444j21803j58525
17545C67174J7368R3089k193M1200J44858k214r247j0983k9635N4850k7321j22069
$$ plain form
17625 -54304 -59275 -29093 52886 115527 121073 112871 57933 -31106 -103881 -140700 -42170 63469
17613 63469 134775 214354 237001 146985 62052 -23671 -72707 -93789 -152965 -140826 -156335 -185764
17601 -185764 -65633 -6953 96794 137524 122344 166308 35881 -42723 -116489 -140407 -70607
17590 -70607 -28251 -46568 -22758 36883 79926 108345 144832 213590 193021 223092 252780 176357
17578 176357 116607 77938 91972 81490 -4898 -100814 -127775 -173905 -264290 -212022 -133330
17567 -133330 -79289 -38496 44199 86312 53370 45833 32750 -64567 -32268 99914 177047
17556 177047 188803 330035 445339 368901 369233 432540 502409 616058 647502 525699 367174
17545 367174 384542 477631 475438 516638 661496 659282 650035 639052 609417 664267 636946 514877
17533E14877n5627j16664r1969o9698m2746J36260R7664M3044O024n595M7602
17522D63172n0911l6788k0996k5626N454n3100p2802K198Q9718N6758J757q4351
17510B74483K0415N3898J7941k8223O177L3764j6392r3581m3973N8406M4677O5645
17498C93237N4129n1714J923n3049P6100P7067N7633j9326O241m1203P0560M8649
17486F20247m7071l2649K3501K0610k0675p0369J1416J14161m3652k5471R9071
17475F49119K3514M9234N6288P3991N6629M9881J31391j4158j7208O5782l0796
17464A093667k6313n741J40559J08204Q1624P1379K74909K50698K88385L46830
17454B624201M20273N09699N30082M97066N11709K7804n07637m26856j19262J25425
$$ plain form
17533 514877 459250 342586 250617 180919 138173 274433 372097 415141 421165 415570 463172
17522 463172 412261 375473 354477 328851 334305 281205 208403 210601 300319 357077 358834 274483
17510 274483 294898 348796 366737 338514 344691 378455 362063 268482 224509 282915 327592 393237
17498 393237 447366 395652 397575 344526 420626 497693 555326 536000 542241 501038 571598 620247
17486 620247 573176 540527 564028 584638 563963 493594 505010 619171 575519 550048 649119
17475 649119 672633 721867 778155 852146 908775 958656 1090047 1075889 1058681 1124463 1093667
17464 1093667 1067354 1061613 1202172 1310376 1392000 1463379 1738288 1988986 2277371 2624201
17454 2624201 3044474 3554173 4084255 4581321 5093030 5120834 4613197 4186341 4067079 4192504
17444D192504K10433L92062O04167O28862Q50411J029219Q90716J033024J188008
17435A1019406P53240R48993J945031K565013K682463L872938O644266J1086020
17427D1517370J8877549L2285497N8111021J06950003J20395840j7999473j14154286
17420B45983521r0674359n0339992k7507657j5210573o657157O81995R077651
17413F5353429K0811493L9664442P5780390J24839168N7533602q5873041j12059582
17406A86049901o9866621l9375470k3150158j4391469r330712o197624m042264
17399A9695583k590991k085857j730746j226885j694274j813508j336176q56916
17391F360230o10040l06743K1942N337k59422m51762l73935k5426M32947k8877
$$ plain form
17444 4192504 4402937 4794999 5399166 6028028 6878439 7907658 8798374 9831398 11019406
17435 11019406 11772646 12721639 14666670 17231683 19914146 23787084 30431350 41517370
17427 41517370 60394919 92680416 150791437 257741440 378137280 360137807 245983521
17420 245983521 155309162 104969170 77461513 62250940 55593783 56275778 65353429
17413 65353429 86164922 125829364 201609754 326448922 383982524 298109483 186049901
17406 186049901 116183280 76807810 53657652 39266183 29935471 23737847 19695583
17399 19695583 17104592 15018735 13287989 12061104 10366830 8553322 7217146 6360230
17391 6360230 5750190 5443447 5465389 5470726 5211304 4759542 4385607 4360181 4793128 4764251
17381D764251p19784o74294m07689j87015n802J15152N1599j16110k91513l07341
17371B221454j98152k30385j44793k35502j95330j25114p4836l2070n4421j29167
17361H01684M8367L1323k0171q7143r1730l8693k20J0158k421o1464k7646j8190
17349E43854O2143J9826k7211J6911J2154m3577p5093m0334Q935m5737j20124
17338C11747j4054J77224l0746j29872p3695j8879P2052J5180n0692l269L3629
17327B88625K0984j3764q2317l9021k9205p23J05190N6399l0129J7364p6024o5993
17315A51386M7948l657n788J0242j10961k3159P1385J06915J5482m770k286M783
17303B57520k567j5809k6370J6864L4698k12911j47601P6670P040k3523J24096
$$ plain form
17381 4764251 4044467 3370173 2962484 2775469 2769667 2884819 2936418 2820308 2528795 2221454
17371 2221454 2023302 1792917 1648124 1412622 1217292 1092178 1017342 985272 930851 801684
17361 801684 850051 881374 861203 774060 682330 643637 643417 653575 651154 589690 562044 543854
17349 543854 605997 625823 598612 615523 627677 584100 509007 468673 477608 431871 311747
17338 311747 297693 474917 444171 314299 240604 221725 293777 308957 258265 254996 288625
17327 288625 309609 295845 213528 174507 145302 144579 249769 306168 276039 293403 217379 151386
17315 151386 199334 195677 189889 200131 89170 66011 137396 244311 259793 255023 252737 257520
17303 257520 254953 239144 212774 229638 264336 51425 -96176 -19506 -12466 -35989 88107
17292H8107O2045j5245J34015J33818J84788L67510M0750l09967j75769J73957
17282F84009K83168O9763k81186j11869n8169O2263K64374K69304o0226j80868
17272I40563j46423L6972J83050K6833k05081k21720j69760p6074n4079q7468
17262B26813p895J2061m7635p9977o6403N3844m4416n9873K1628J2864q7707l8266
17250a04962J06978N5290r39M8000N9021P8599M4465R419L5018k3047M1902m8488
17238C01256j21349q0634K494k1485K0651P6690Q7671J12482o6219o5105k6389
17227B20063p3977K7275j6539o7481m4217k2559K8613l177L4697M4128n2394m7447
17215B6985k9052N698O8771p3123j4503L2131N8863J2124n4016q5398Q158O3012
$$ plain form
17292 88107 150152 134907 268922 402740 587528 955038 995788 685821 510052 684009
17282 684009 967177 1036940 755754 643885 585716 647979 912353 1181657 1121431 940563
17272 940563 794140 831112 1014162 1040995 835914 614194 444434 368360 314281 226813
17262 226813 218918 230979 183344 103367 36964 90808 46392 -13481 8147 21011 -66696 -104962
17250 -104962 2016 57306 56367 104367 163388 241987 286452 295871 330889 307842 349744 301256
17238 301256 179907 99273 101767 80282 100933 177623 265294 377776 311557 246452 220063
17227 220063 146086 173361 156822 89341 45124 22565 51178 48001 82698 126826 74432 26985
17215 26985 -2067 3631 72402 -721 -15224 16907 75770 87894 33878 -51520 -43362 19650
17203A9650L14K2286J00025p1158j20789n3353N7419J5592l5304J2622P1482N1976
17191G0762P966o2995p5137o552N6622k8410M8034j1306n9357J5455K6938J8522
17179E42M252q4J4200M8744M682q9756J9785O302l7996N9339P5918l5381j1944
17166E8603K1226J3185K7023k011o5464n9165Q2295K8207k0169L0231M2618K2897
17154A79476p8631m6604m6650R76k3032K5497O3268o5434q2315Q0268K8125J00967
17142A35911o2685j04727Q7206j3329n763k5894m8480P0205l2616k5485M0099
17131A4442K4101n6314o5550Q3854m7787k1522N6351K7642K800o4973P321L7301
17119b334R53K997J2069N0053P0340L4542l8403p736L7289k3664q6291k2018Q0788
$$ plain form
17203 19650 19964 42250 142275 71117 -49672 -103025 -45606 -30014 -65318 -52696 18786 70762
17191 70762 78728 15733 -59404 -65956 -9334 -37744 10290 -1016 -60373 -44918 -17980 542
17179 542 4794 4710 18910 67654 72336 -17420 2365 8667 -29329 30010 105928 70547 58603
17166 58603 79829 93014 120037 118026 52562 -6603 75692 103899 83730 113961 156579 179476
17154 179476 100845 54241 7591 8567 -14465 11032 74300 8866 -73449 6819 34944 135911
17142 135911 73226 -31501 55705 42376 36613 10719 -37761 32444 -172 -25657 14442
17131 14442 38543 -17771 -83321 533 -47254 -68776 -12425 15217 18017 -46956 -39635 -2334
17119 -2334 -1381 1616 13685 63738 134078 168620 130217 122481 159770 136106 49815 27797 108585
17106A08585o1412p1420r6304P6414P9939M3151p1162r2810K5408J0937L627Q392
17094c6655k89J3032O2955K286M1568p7282q5029K1844M6569J3198j5187O0783
17082D7793n552o9369k2139j4425P146J1522P225K7126J6983J13820p221n7074
17070E5835m0389J00105l3518n1366l6963m3490J2686J1064m0558k1618O0153
17059b8059k5695p1069r5226k0008Q2864O0078j1761Q5003J05088k23m5733K6394
17047F1653o1359L3304p423j3392j2026N1381O1715J8794o6799M4274l8002N1675
17035A23795L0468J5285p3882n3187p2739m2686R66M7842l4791M0212j9661O7590
17023B9212Q5071m4307M5509n5430n7797n4444M9435M9835p4394l0756n1970N4114
$$ plain form
17106 108585 47173 -24247 -120551 -44137 35802 78953 7791 -85019 -59611 -48674 -45047 -36655
17094 -36655 -36944 -23912 39043 41329 82897 5615 -79414 -57570 -11001 2197 -12990 47793
17082 47793 42241 -27128 -49267 -63692 -56546 -45024 -37799 -10673 6310 120130 112909 55835
17070 55835 15446 115551 82033 30667 -6296 -49786 -37100 -26036 -66594 -88212 -28059
17059 -28059 -53754 -124823 -220049 -240057 -157193 -97115 -108876 -23873 81215 80992 35259 61653
17047 61653 294 33598 26175 12783 757 52138 113853 132647 65848 110122 72120 123795
17035 123795 154263 169548 95666 42479 -30260 -72946 -71980 -24138 -58929 -18717 -38378 29212
17023 29212 114283 69976 115485 60055 2258 -52186 -2751 47084 -27310 -58066 -110036 -55922
17011e5922R1677O176j39641k6823P9973l3511n175L5507k6744K7242J3305P565
16999b6371k3634R264K7062k7815m5380J09376P4873k6702O588p6623p4904m1674
16987a15940N7587K7352J265Q1434M3978j8939r209k628q8582m2534Q8687N4407
16975G6878R744n1485j24274Q6525l7476J8096M3738L3213p30j02658k1740O1368
16963h801K600k2414K8728J4981k5670l1825m341l2468k1602j1834J632M3118
16951f7896M6649o101N1469M1300j2112m4496Q3698N7298p9780r2518l7034J08057
16939D8534M5509o5845o7471M762N4462K6411k4447l5582K9571n0117R76N5456
16927B2219J6376l9145r7301n9081J929R9696J02367M3418m6428j3960o81O999
$$ plain form
17011 -55922 35755 41931 -97710 -124533 -44560 -78071 -83246 -47739 -74483 -47241 -33936 -26371
16999 -26371 -50005 -40741 -13679 -41494 -86874 22502 97375 70673 77261 638 -74266 -115940
16987 -115940 -58353 -31001 -29736 51698 95676 76737 67528 64900 -23682 -66216 22471 76878
16975 76878 86622 35137 -89137 -2612 -40088 -21992 21746 54959 54229 -48429 -70169 -8801
16963 -8801 -6201 -28615 113 15094 -10576 -42401 -46742 -79210 -100812 -112646 -111014 -67896
16951 -67896 -21247 -27348 24121 65421 53309 8813 92511 149809 70029 -22489 -59523 48534
16939 48534 94043 28198 -39273 -34511 19951 46362 21915 -13667 15904 -34213 -33237 22219
16927 22219 38595 -550 -97851 -156932 -155003 -55307 47060 90478 44050 30090 29409 36408
16915C6408K7294j6315l8135o1744l6927N0047n372k4070N6106L8669n7775r4133
16903a25947m2444J9200N2819P4839K9075l0479K5315L2595m9554n5872j1k2338
16891i2802P2L6405K7890N0911p676J5506K277Q3167j3048p1625j2847j0259N6564
16878F4535J6133q4274l2511K2968k3787N4577M005j4427o9643M8499J1110n9154
16866f1969R2116N9328O379P3892O2791l2973j47756m6432J4591K6931J04537
16855A51435k2518k9492l6876J7049J07515P8401R9031J77929K91125L22407L37875
16844A493881J1135k21209k16998k34344k36781r5402n824N530M0955M5303J16096
16833G02342L39741L50992J88643j42819k79373l35084l49310j57200p8001o6444
$$ plain form
16915 36408 63702 47387 9252 -52492 -89419 -39372 -44744 -68814 -12708 25961 -31814 -125947
16903 -125947 -168391 -149191 -96372 -21533 7542 -22937 2378 34973 -14581 -70453 -70464 -92802
16891 -92802 -92730 -56325 -28435 22476 14800 30306 32583 115750 102702 31077 18230 7971 64535
16878 64535 80668 -3606 -36117 -13149 -36936 17641 21646 7219 -62424 -13925 -2815 -61969
16866 -61969 30147 89475 95854 169746 232537 199564 51808 5376 19967 46898 151435
16855 151435 128917 99425 62549 79598 187113 265514 364545 542474 833599 1156006 1493881
16844 1493881 1505016 1283807 1066809 832465 595684 500282 494458 499988 540943 586246 702342
16833 702342 1042083 1393075 1581718 1438899 1159526 824442 475132 317932 239931 173487
16823A73487n6559p9689q3567m0797J1244m3853L7595J20293n856p0380L8392
16812C10M4026p7772p4578J05182J27250k5387r642M8769m5278l1853m9988L204
16800A4243k7730M7181K0048K435o970q1757j1339P309n026R800K5547M357N658
16787C756J986J0182j09627K5567L91o2671O787k9266M8678L5074l394j9042P6519
16774a5060R5143J8247j9786j6820k7167n0681J4486j3399q609O109j9720k4172
16762f1429l130n5184N2511Q6830O0236m0975j0202k7313j0398O3923L1803p1067
16750A5605m729J6565N9239m5138j25592k570O7604m6903N0396m1596r1789K2995
16738a25913K4230M3511O7753L9941j8580N2166k7696p0350m6114K4808K0603
$$ plain form
16823 173487 116928 37239 -46328 -87125 -75881 -119734 -82139 38154 32298 -38082 310
16812 310 44336 -33436 -108014 -2832 124418 99031 89389 138158 92880 61027 11039 14243
16800 14243 -13487 33694 53742 56177 49207 -32550 -43889 -36580 -41606 -31806 -6259 -1902 3756
16787 3756 5742 15924 -93703 -68136 -67745 -130416 -123629 -152895 -104217 -69143 -72537 -91579 -15060
16774 -15060 80083 98330 78544 61724 34557 -16124 -1638 -15037 -23646 -17537 -37257 -61429
16762 -61429 -64559 -119743 -67232 19598 79834 38859 28657 1344 -9054 54869 86672 15605
16750 15605 10876 27441 86680 41542 -84050 -86620 -19016 -65919 -15523 -57119 -148908 -125913
16738 -125913 -101683 -58172 9581 49522 30942 83108 55412 -14938 -61052 -36244 -15641
16727a5641J7955j9103P174R7347K4661k934O43l5217l0296k9619k3265M6852
16715C8557J9600q1941l8941K9137J3979l0381J3091K0119P314K2225K7366m9930
16703i805k3001q4670n0474M2905N7257n8776J2974P7405j5426j0192J047n4500
16691a15256o3251Q4921J15102L340m0532j1850O1682m5607q8528k596L3153J7600
16679e1822L0971q2120n0299L0528m7835n0466O2024J21957J34425k9075j27480
16668e9192K7929N290O096n1651K3Q691N4156K932N6174Q5133j8104p4606o3091
16655b0220M9909j189m5270J5656l598M3051r919K653J560N5479O4706n0080q7146
16642A5592l979j2597J4634j0491m5473L3838R5771j14688j05105Q0924J38577
$$ plain form
16727 -15641 2314 -16789 -9615 87732 112393 109459 110102 74885 44589 14970 -8295 38557
16715 38557 58157 -23784 -62725 -33588 -19609 -49990 -36899 -16780 -9466 12759 40125 -9805
16703 -9805 -32806 -117476 -167950 -125045 -67788 -126564 -113590 -36185 -51611 -61803 -60756 -115256
16691 -115256 -178507 -93586 21516 24856 -15676 -27526 34156 -11451 -99979 -102575 -69422 -51822
16679 -51822 -20851 -102971 -153270 -122742 -170577 -221043 -159019 -37062 97363 68288 -59192
16668 -59192 -31263 -25973 -19877 -71528 -71505 -62814 -8658 -5726 50448 135581 117477 42871 -20220
16655 -20220 29689 28500 -16770 -1114 -4712 38339 28420 31073 32633 88112 152818 102738 15592
16642 15592 11613 -984 13650 3159 -42314 -8476 87295 -27393 -132498 -51574 87003
16631H7003M0010k2793n4939j43020J8595M307J3075J3979P186k0556p4675K7381
16619a04447M1557J5289L7423J3438l1877n805J8592o2934K039J1742K9518M1338
16607E873K569j5234k2219K2664j7894O85j8500m9099m866j9511K616J09982O0804
16594E7870n5921l5079l9265j7469K9996N9671j2518k9634O6656k0839L2906l2963
16582C411j6768R200k7956O7312j07938r2656J33193L5264n9383M053N7894j3911
16570h285K9103o2546n5916N2839r410K9960n1533k113M7014J0933K8949k2344
16558a3349o1698K9315P6180n352j3014K5367m4490P5928j1573o4869j2491k7661
16546d7707J0951k1105Q7601P9677k4201r7740K0828K8699j30522q6180O0804
$$ plain form
16631 87003 127013 104220 49281 -93739 -75144 -70837 -57762 -43783 -36597 -57153 -131828 -104447
16619 -104447 -62890 -47601 -10178 3260 -28617 -34422 -15830 -78764 -76725 -64983 -35465 5873
16607 5873 8442 -6792 -29011 -6347 -24241 -23556 -42056 -91155 -96021 -115532 -112916 -2934 57870
16594 57870 1949 -33130 -72395 -89864 -59868 -197 -12715 -42349 24307 3468 36374 3411
16582 3411 -13357 -4157 -32113 35199 -72739 -165395 -32202 3062 -56321 -52268 5626 -8285
16570 -8285 20818 -41728 -97644 -44805 -54215 -24255 -75788 -77901 -30887 -19954 8995 -13349
16558 -13349 -75047 -45732 30448 25096 12082 37449 -7041 68887 57314 -7555 -20046 -47707
16546 -47707 -36756 -57861 29740 109417 85216 -12524 8304 37003 -93519 -179699 -118895
16535a18895Q2234o642n4141m1052L962K2042J9639J5106J4156J8101R5813K7829
16523G8152l0292o9473J1973j001p7252l3309P680N8223Q4269q1275j8632L4094
16511c6843N7097K4492o4616l3008k9599O5095p755l168j7524j08874o1072J11381
16499a04394O5102o2290j0165l6137l0918K6388J1968k2127p7275P798Q1671R9537
16487e0842j20466j9027Q0699J20756M1102n307q6250k387N5521P3968K8824n7691
16475E8900m9882o345m8840L1216J2026J418N6220m2339Q121j14949r2998K6204
16463a61248J11601n9427l7994N7163O9043m3921J1745J17564R712n2946o9467
16452d8175k4276J2819N9100L0432p079o2623p1847K6395j3184k3596k0452M8465
$$ plain form
16535 -118895 -36661 -43303 -97444 -138496 -134534 -112492 -92853 -77747 -63591 -45490 50323 78152
16523 78152 47860 -21613 -9640 -10641 -87893 -121202 -113522 -55299 28970 -52305 -70937 -36843
16511 -36843 20254 44746 -19870 -52878 -82477 -17382 -25137 -28305 -45829 -154703 -215775 -104394
16499 -104394 -39292 -101582 -111747 -147884 -178802 -152414 -140446 -162573 -239848 -232050 -150379 -50842
16487 -50842 -171308 -190335 -109636 11120 52222 46915 -39335 -41722 13799 87767 116591 58900
16475 58900 9018 2673 -46167 -14951 -2925 -1507 54713 12374 20495 -94454 -187452 -161248
16463 -161248 -49647 -109074 -147068 -89905 -20862 -64783 -53038 64526 74238 21292 -48175
16452 -48175 -72451 -59632 -532 29900 22821 -39802 -111649 -85254 -98438 -122034 -142486 -94021
16440i4021J024M152n1917J0271k3212k6181Q071L0239M1006M6775k903m6893
16428a03589L9979l7762K0820L7976p7520J9525L5200L1469J2191m7879L743j401
16416f7248k4911Q821O5268K1571l902j0786l5522M4658L7046Q299J7504L3861
16404I4659Q215l8082j7094o3274j3846K0180o7667K3857P1198L4654K2129q2467
16392g538m8560K616L3100K4194J10381l2263k7515J6342m3606j2774L047J4623
16380C2047n2261j03530r422M5800L0558L8142m848l3295k774n5703K8926L4215
16368e2145M5200N7208j6776o1706q682j645m7104O3380N6201j5607j7486r561
16356h723Q0240j048Q0l333m9253M2446J8528o8021o8772M7406J8316J4665j7633
$$ plain form
16440 -94021 -92997 -88845 -140762 -130491 -153703 -179884 -171813 -141574 -100568 -53793 -56696 -103589
16428 -103589 -63610 -101372 -80552 -42576 -120096 -100571 -65371 -33902 -21711 -69590 -65847 -67248
16416 -67248 -92159 -83338 -18070 3501 -401 -11187 -46709 -2051 34995 43294 60798 94659
16404 94659 102874 64792 47698 -15576 -29422 -9242 -76909 -53052 18146 52800 74929 -7538
16392 -7538 -56098 -53482 -20382 3812 114193 81930 54415 70757 27151 14377 17424 32047
16380 32047 -20214 -123744 -133166 -87366 -56808 -18666 -23514 -56809 -59583 -115286 -86360 -52145
16368 -52145 -6945 50263 33487 -28219 -36901 -38546 -85650 -22270 33931 18324 838 -8723
16356 -8723 71517 70469 70549 67216 17963 60409 78937 10916 -57856 -10450 7866 22531 4898
16343D898L728N3815K3355J1241j12984l8799p9078l016M5483N0367l4947J3001
16331f2936L8827q345m5876q665l392M5024n3272k1232L4291J05364L7265j22383
16319f5330K6052P1372M4872j0578p668l6865o8010J6620m3563k9836J00980k294
16307d248q074K4806j8856k1990M1137J00070J6502r1727o4205m8914m4160K9974
16295h9685K3140J8694J3458N077M5493J08766J3242N225m8490j50791m7945j3011
16283a16827k495O1803L8715M8298m9674j3891M4541r4031M1333N0202J7922j5889
16271A0007k6433J5378J3705l4022M3175K4042Q435j7637n6527m6357l4154L5101
16259f5287l0361M375P5900L1574L6707m0792q8076j2191P0526L4165j04514l8322
$$ plain form
16343 4898 8626 62441 85796 97037 -15947 -54746 -133824 -136840 -91357 -40990 -75937 -62936
16331 -62936 -24109 -32454 -78330 -86995 -90387 -45363 -98635 -119867 -85576 19788 57053 -65330
16319 -65330 -39278 32094 76966 66388 58720 21855 -46155 -29535 -73098 -102934 -1954 -4248
16307 -4248 -12322 12484 -6372 -28362 12775 112845 129347 37620 -26585 -75499 -119659 -89685
16295 -89685 -66545 -47851 -34393 -29316 16177 124943 138185 143410 94920 -55871 -103816 -116827
16283 -116827 -119322 -57519 -18804 29494 -20180 -34071 10470 -83561 -42228 7974 25896 10007
16271 10007 -16426 -1048 12657 -21365 21810 45852 54287 36650 -19877 -66234 -100388 -65287
16259 -65287 -95648 -91273 -15373 16201 52908 12116 -75960 -88151 -17625 16540 -87974 -126296
16247a26296J4051J13964Q4508r401M2345O634j00976j64586O0164N2353r317
16236c6557J30345J7807j22281K7404l0836j18844m0005M8616K9179L0993K901
16225f1278j44598k9298O3359Q5728K124p6307K6543L6918J4372N8976J8244K7483
16213B2266k3629o111K3015n8899l9687N265M2827K3799K3057M459K3496j8561
16201B1297j964K2081L7940j7465q2772n7570n3960K5484j9295R5542Q8518L3005
16189I0841q054L2577j2526p8950p3554L7037K6607n3338K8754l6988o7562j2474
16177a27630Q0002L7728J7387k1241K4185N0773k8450O0127K5536m9836j18506
16166d9925O795l9889o2424J5500k1604N7534L8100N5634l2230n5583M9352Q4388
$$ plain form
16247 -126296 -112245 1719 86227 76826 119171 125805 24829 -139757 -79593 -27240 -36557
16236 -36557 93788 111595 -10686 16718 -14118 -132962 -172967 -124351 -95172 -64179 -61278
16225 -61278 -205876 -235174 -171815 -86087 -83963 -160270 -133727 -96809 -82437 -23461 -5217 22266
16213 22266 -1363 -7474 15541 -43358 -83045 -77780 -34953 -11154 11903 16362 39858 21297
16201 21297 19333 41414 79354 61889 -20883 -78453 -132413 -106929 -126224 -30682 57836 90841
16189 90841 82787 115364 102838 23888 -49666 -12629 13978 -39360 -10606 -47594 -115156 -127630
16177 -127630 -47628 -9900 7487 -13754 10431 61204 32754 92881 118417 68581 -49925
16166 -49925 -43130 -83019 -145443 -129943 -151547 -94013 -55913 -279 -32509 -88092 -38740 45648
16154D5648L2523j5434k5778n138r8676j09836L6731J8363J55894J9516k7512
16143B6301N2670j3298o8834o8912l6492N3311P8504r9573j02396M6762K5254
16132a06703k5760M4753N6147P0996J0758n2499k6975M7192n143m4499n8833R107
16120h1459j18070o3857P0967J14376L1300l1776r662J06889n5942K6469P2250
16109F1485K4575L4990j13637j29703o370N2597l613J3315q015K1614O739k1339
16097f7362j3967l1512l2330L9414q527L4171K6426K170l3383j5063m7814P5278
16085g2499O1000J6554m4653j391J1800r406n1042j2569O7287P2048l8631Q3925
16073H2423Q6244R1960j5842q0697j94859j18454j9298M1654P4626M6073O6338
$$ plain form
16154 45648 78171 62737 36959 31821 -66855 -176691 -139960 -121597 34297 53813 26301
16143 26301 78971 65673 -3161 -72073 -108565 -55254 23250 -76323 -178719 -131957 -106703
16132 -106703 -132463 -87710 -31563 39433 50191 -2308 -29283 17909 12766 -31733 -90566 -81459
16120 -81459 -199529 -263386 -192419 -78043 -46743 -78519 -88181 18708 -37234 -10765 61485
16109 61485 86060 121050 7413 -122290 -128660 -76063 -79676 -66361 -74376 -52762 -46023 -67362
16097 -67362 -81329 -112841 -145171 -105757 -114284 -80113 -53687 -51517 -84900 -99963 -147777 -72499
16085 -72499 -11499 5055 -39598 -40989 -29189 -38595 -89637 -102206 -34919 37129 -1502 82423
16073 82423 168667 260627 244785 164088 -30771 -149225 -168523 -126869 -52243 -6170 60168
16062F0168L5462L3036n7108O236j5379o5284N8458L5066l4346J6091O687j7538
16050F1549L8327j7515m419m98j3900j63388j1743K3664q58J1120J14123K457
16038C8919j4032L3953l1273m1717l2566j2870K4751J7578Q498m6856n4412M4642
16026f5385O0858M8818p5846j9708K9626m9576o7361K1451N6405J0824K5503Q7617
16014F3226M0616M6036m4216r3548q1955k1966L8039q295l4538O2051P4553K5577
16002F5580L3245l0408j22552p0451K731J23190J7511q8539K6670J42648R921
15991A09546q2462j01864l9102L0998O9024R6508J8499l1058p0460o6152l7303
15980a03826L3366J16389K432n4111r3997k319j3009O231J08619K7811M9024k9744
$$ plain form
16062 60168 95630 128666 71558 77794 62415 -2869 55589 90655 56309 72400 79087 61549
16050 61549 99876 82361 77942 77444 63544 -99844 -111587 -87923 -88781 -77661 36462 38919
16038 38919 24887 58840 27567 -14150 -46716 -59586 -34835 -17257 -8759 -55615 -110027 -65385
16026 -65385 -4527 44291 -31555 -51263 -21637 -71213 -138574 -117123 -60718 -49894 -24391 63226
16014 63226 103842 149878 105662 12114 -69841 -91807 -53768 -62063 -96601 -34550 40003 65580
16002 65580 98825 68417 -54135 -124586 -121855 1335 18846 -69693 -43023 99625 109546
15991 109546 27084 -74780 -113882 -82884 -13860 82648 101147 70089 -371 -66523 -103826
15980 -103826 -70460 45929 48361 -5750 -99747 -102066 -115075 -108844 -225 27586 76610 46866
15968D6866k4323K4474l5290k0422P8126N2784n6732q9168M5058o9736p4754K531
15956a20586K6751L9186L1844M2669j00918p7312N9090J00279o6155m7476m3769
15945a56397J3308L6094J08400K7532l7700p4381J3788K2877L6527L9424m5479
15934a6007L4650M3514k872J4367P0946L4643l8070j4257j3792j14562K5025M4628
15922F8213p4386l7121K2319K9461p920k5165l5570o7053n0054R0563O0930P972
15910a7811L7265J8537m7827n0321m0422j5571r729k392l749L9447r364M2636
15898e9301L8250m409O1373M2271l3323o5122k6505K1093l5042N6008J576l5454
15886c8585l5293j01121M9081k0837J1625O631l1593P9580J8673l3828J6560j7276
$$ plain form
15968 46866 22543 47017 11727 -8695 69431 122215 65483 -23685 21373 -48363 -123117 -120586
15956 -120586 -93835 -54649 -22805 19864 -81054 -158366 -99276 1003 -65152 -112628 -156397
15945 -156397 -143089 -106995 1405 28937 -8763 -83144 -69356 -46479 -9952 29472 -16007
15934 -16007 18643 62157 59285 73652 144598 179241 141171 126914 113122 -1440 23585 68213
15922 68213 -6173 -43294 -20975 8486 566 -24599 -60169 -127222 -177276 -86713 -25783 -17811
15910 -17811 19454 37991 -9836 -60157 -100579 -116150 -125879 -128271 -132020 -92573 -101937 -59301
15898 -59301 -21051 -25460 35913 78184 44861 -20261 -46766 -25673 -60715 -4707 -3131 -38585
15886 -38585 -73878 -174999 -125918 -146755 -135130 -128499 -160092 -80512 -61839 -95667 -79107 -96383
15874i6383J1191J7802N8988Q1110k7913l1204m6588J9024j9754j02817L5158
15863a01386L3043J7801p6522J5953J185J8330l4795l3243O0361R1540P492r353
15851i594l0764P108P3038J811M2370L6906j1499p150j4037k2556l41q330l1486
15838B5476n2404l6017L0542q586N433K1476K5613r143n411o1223n7326j57J2437
15825a09290r026n4410J640j2215K1135J4616R27J7534L6182M4930j0831n124
15813f3932k0264n0128J22141J70359R8383j04634o0648m2791M0152k374j4022
15802G2242o2155L244K9288M7957J9808j29465R783L758L7161k5703n2902q8955
15790a35939L0074L8042l8080L3783O3315J3582K3141n1481k287M0061j8657q8616
$$ plain form
15874 -96383 -85192 -67390 -8402 72708 44795 13591 -32997 -13973 -33727 -136544 -101386
15863 -101386 -68343 -50542 -127064 -111111 -109926 -91596 -126391 -159634 -99273 -7733 -241 -9594
15851 -9594 -40358 -33250 39788 41599 83969 120875 109376 102226 88189 65633 65292 56962 25476
15838 25476 -26928 -62945 -32403 -40989 -35556 -14080 11533 2390 -3021 -64244 -121570 -121727 -109290
15825 -109290 -118316 -172726 -171086 -183301 -162166 -147550 -146623 -129089 -92907 -47977 -58808 -63932
15813 -63932 -84196 -134324 -12183 158176 256559 151925 91277 48486 88638 86264 72242
15802 72242 10087 13331 42619 90576 110384 -19081 -9298 -5540 31621 5918 -46984 -135939
15790 -135939 -105865 -67823 -105903 -72120 -8805 4777 27918 -23563 -25850 14211 -4446 -93062
15778i3062j0650N6682J0325j7071r383j5932k5216k2938L4509Q6035K6376P350
15766B7025L3347m0512K2355l2744k8546L6847J9275j3746j9971q0772j3208l4525
15754a25175k6601l2425L4749J07475p374K4331l2980l8717k2665m4354P9965
15743h3771R406n867p0110R753P2446M5174j313q8378O3128R7040Q152P935o605
15730E6990r7025K0573o9395K8830L3091q157l470o9595K4347k1779O1011J06844
15718F2265K0280j6649n77J9076j1214l2101r3050l5434K2113m6295L5574L7129
15706c8883k7754M22j1776L8338n75k7189K7634l5286m4558L2099K9171p882n6099
15693a22338J7091N0496j4375j2813J16175P8171j1472q6144p8741O389K6441
$$ plain form
15778 -93062 -103712 -47030 -36705 -53776 -63159 -79091 -104307 -127245 -92736 -6701 19675 27025
15766 27025 60372 19860 42215 9471 -19075 17772 37047 23301 3330 -77442 -90650 -125175
15754 -125175 -151776 -184201 -149452 -41977 -49351 -25020 -58000 -96717 -119382 -163736 -83771
15743 -83771 -74365 -80232 -150342 -140589 -68143 -22969 -24282 -112660 -49532 47508 55660 63595 56990
15730 56990 -40035 -19462 -88857 -60027 -26936 -35093 -38563 -108158 -83811 -105590 -44579 62265
15718 62265 82545 65896 65319 84395 73181 41080 -51970 -87404 -65291 -111586 -76012 -38883
15706 -38883 -66637 -66215 -77991 -39653 -40228 -67417 -39783 -75069 -119627 -87528 -58357 -66239 -122338
15693 -122338 -105247 -54751 -69126 -81939 34236 112407 100935 14791 -63950 -57561 -31120
15682c1120l7479j6319M2083o498l9929k8311L1313n6749L0014O858M98n4015
15670a59654k5508j258P2613J46399R34m4400M7887N2288m1292n3862L7266m6924
15658a5511l4493L2699P0403M9627L151j06445J8468L6127k5862p4824O172R173
15646c1315K9625J6198j604r0909p998O9637J01130k9275o5504r0320o2912j1431
15634a74678N3466R2649Q429K8328l7335p248n1057J919M9484L5521l2178p8537
15622a11237L6396J38848M3476j7666K7653j4342p3294M760k0678l9395m4378
15611f9857j1579K8465P015R0850J24614p529R749q0962k9805p276O0209L2234
15599A46128r8619p3091P7696P5179J930m9949r7577P224l2864L437R8375j8067
$$ plain form
15682 -31120 -68599 -84918 -42835 -49333 -89262 -117573 -86260 -143009 -112995 -106137 -105639 -159654
15670 -159654 -185162 -186420 -113807 32592 33526 -10874 37013 89301 48009 -5853 31413 -15511
15658 -15511 -50004 -17305 53098 102725 105876 -569 17899 54026 28164 -46660 -40488 -31315
15646 -31315 -1690 14508 12904 -78005 -86003 -16366 84764 55489 -10015 -100335 -163247 -174678
15634 -174678 -121212 -28563 -20134 8194 -29141 -36389 -87446 -85527 -36043 -522 -32700 -111237
15622 -111237 -74841 64007 107483 89817 117470 103128 29834 34594 13916 -25479 -69857
15611 -69857 -81436 -52971 -45956 44894 169508 161979 171728 90766 60961 53685 113894 146128
15599 146128 47509 -25582 52114 127293 129223 79274 -18303 -11079 -43943 -40506 57869 39802
15587C9802q0581P5150Q3027n174j06687q409l4100q9087J21639Q7638k8328r5685
15575d0795p3304l7295m1498k6801P2914J07471J6402r579L6566o5569N2855K273
15563f360n2609q4116L5924j2765J1667J8394L6700k4374l2664L001J5410m7211
15551a39003K2579J12874M8855o6649n6255k3835P7985J7890n9980l7938N1863
15540e1614P5632O7238K3189o3097j46281o6902J9652L0775R2225M3832k2659
15529A990J1768j5210P3599J9661j5651q7889q2868p9664l5370L2544N0818L0213
15517i6059O0031M9199N9049N1129q0484k9977R2911P958n1519q8075j3536j08164
15505a47537J9796J0486P3013Q1868k0173P654r988l7463p0210k9697J10602Q7341
$$ plain form
15587 39802 -40779 34371 117398 112224 5537 -2872 -36972 -126059 -4420 83218 54890 -40795
15575 -40795 -114099 -151394 -192892 -219693 -146779 -39308 -22906 -32485 4081 -61488 -8633 -6360
15563 -6360 -58969 -143085 -107161 -119926 -108259 -89865 -53165 -77539 -110203 -107202 -91792 -139003
15551 -139003 -116424 -3550 45305 -21344 -77599 -101434 -23449 -5559 -65539 -103477 -51614
15540 -51614 24018 91256 114445 51348 -94933 -161835 -142183 -111408 -19183 24649 1990
15529 1990 13758 -1452 72147 91808 76157 -11732 -94600 -174264 -209634 -177090 -126272 -96059
15517 -96059 -36028 13171 72220 123349 42865 12888 105799 113757 62238 -25837 -39373 -147537
15505 -147537 -127741 -117255 -44242 37626 17453 25107 15119 -22344 -92554 -122251 -11649 75692
15493G5692N8767j2386j10830r2132R3694Q3679p530l2425k8433l3097o3844L6872
15481c1973P3349j5588k5616L3501n3578J2609K2701J8673K7626K9123R436q211
15469I2052J8582k3754n0676r5728n5989K918J7504K0938N6003J25561J1248n0753
15457F7906M9065l4748j8302J3973l5969J2432j9407o0745k0313J01425j217j7552
15445C6548m5766M9008L5166J1087L5750m4541k4316l1299r6292j7002j9137J9461
15433i1333K5394r007N4216N1585j5770n5142o3658p512Q9153J03172M0608m7509
15421G4197p7294n8350l7194N0408N1428n6575L1713l2208K1822J28026J4923
15410A10896r0771n5583K369J6804J26r8927m5822O0185J20293N1738M2052l6661
$$ plain form
15493 75692 134459 122073 11243 -80889 12805 96484 88954 56529 28096 -5001 -68845 -31973
15481 -31973 41376 25788 172 33673 -19905 -7296 15405 34078 61704 90827 100263 92052
15469 92052 110634 86880 36204 -59524 -115513 -112595 -95091 -74153 -18150 107411 118659 67906
15457 67906 116971 82223 63921 77894 41925 54357 34950 -25795 -46108 55317 54100 36548
15445 36548 -9218 39790 74956 86043 121793 77252 52936 21637 -74655 -91657 -110794 -91333
15433 -91333 -65939 -74946 -20730 30855 15085 -40057 -103715 -111227 -22074 81098 121706 74197
15421 74197 -3097 -61447 -98641 -48233 3195 -53380 -21667 -53875 -32053 95973 110896
15410 110896 20125 -35458 -33089 -16285 -16159 -115086 -160908 -100723 19570 71308 113360 76699
15398G6699j36424l4326L9645n540k1431L1902P6957P827q2542m0583N0702K7976
15386i138k0956l4420j2478M5204J02776M4489J2881K5646q528L8679l4780m6403
15374A02972J1936J5265J3903k1739k9536l9660l0402k4106l5934k262J2172N0863
15362B3472L6515j8172j01866p5325P018n8686l1909J9602R2304N8259O5018l6589
15350b0359m8886L7537J5752k4504p4107j990k9572M4414k2475j11N8278M2195
15338b3828Q2139M4200q2147l0539k5277j4825Q24O189l2217j1682M6879p4390
15326a14674L2920P2446M1489q871r527m0753k4265j7813n612k5981k9000O784
15314a22857K0662o1828M569J4088M5056M1064K6899M3520q2362q2861M8656J0282
$$ plain form
15398 76699 -59725 -94051 -54406 -59946 -81377 -49475 27482 35309 -47233 -87816 -37114 -9138
15386 -9138 -30094 -64514 -76992 -31788 70988 115477 128358 154004 145476 184155 149375 102972
15374 102972 114908 130173 144076 122337 92801 53141 22739 -1367 -37301 -39563 -27391 23472
15362 23472 59987 41815 -60051 -135376 -128358 -187044 -218953 -199351 -107047 -48788 16230 -20359
15350 -20359 -69245 -31708 -15956 -40460 -114567 -116557 -146129 -101715 -124190 -124301 -66023 -23828
15338 -23828 58311 102511 20364 -10175 -35452 -50277 -49453 -43264 -75481 -87163 -40284 -114674
15326 -114674 -81754 -9308 32181 23310 13783 -26970 -51235 -69048 -74660 -100641 -129641 -122857
15314 -122857 -102195 -164023 -159454 -145366 -100310 -59246 -32347 11173 -71189 -154050 -105394 -95112
15302i5112O9626j3655j02577J4724l0292J6802P2458K3189k8152L166M9048Q1750
15290F0975k4841l3887k3492J1202k8702o561l299L8409l8953K1389q4136r1702
15278b03598M6331Q5804j041n1809j3251N6276R2413J03185l6553k827r1862L2144
15266A5212M1168o6855k7326L2987N7862N783r739K3549J234m1475n8739P1567
15254D5228J2501l0701L6573K3838k2139k6779L038M4316l9599o0615K6566N4100
15242F6327l5366l1713O5235M1285m5553o3763K7594R406J6688o6863k4818n190
15230d6731L4836J358k9806r4173p2943j7570m314K6883N2282O8259N7284N9223
15218C4588J7197L9697J0480r9512n4869Q6970J02071k7819L4429K1876l9219
$$ plain form
15302 -95112 -25486 -39141 -141718 -126994 -157286 -140484 -68026 -44837 -72989 -69823 -20775 60975
15290 60975 36134 2247 -21245 -10043 -38745 -45306 -48605 -10196 -49149 -27760 -111896 -203598
15278 -203598 -157267 -71463 -72504 -124313 -137564 -81288 11125 114310 77757 74930 -16932 15212
15266 15212 56380 -10475 -37801 -4814 53048 58831 49092 72641 73875 32400 -26339 45228
15254 45228 57729 27028 63601 87439 65300 38521 41559 85875 46276 -14339 12227 66327
15242 66327 30961 -752 64483 105768 60215 -3548 24046 33452 50140 -16723 -41541 -46731
15230 -46731 -11895 -10537 -40343 -134516 -207459 -225029 -229343 -202460 -150178 -81919 -24635 34588
15218 34588 51785 91482 101962 2450 -52419 34551 136622 108803 143232 165108 125889
15207A25889J7333R06n3026l765r3819q703O3432L6396M5002L2018l8902J278
15195A24039j4856q35n8610N4123m2503l5815q633Q926J5279j04925p1331M5201
15183h9940k0137O2234L117J1964m871n4801N848L6219J09510P1868M5504K5926
15171B02441l3128m5360o0253k7460K860m243K4769O0829o9017r6409m1512M3181
15159d3302m7734M0791m6900j0965N5776j4774n4879L2430J2822m8335N9917L2691
15147c2462r890p0181o939J36546O5744n3823k6699R2652J0336o3255K3855j7219
15135D8665j726j8752O0473p0168k4167l1543m6678L3731o1951K8973P0763m006
15123a6386j5984K6085Q8080k3365m1242J0979j9815J34047l7420o7984O5419
$$ plain form
15207 125889 143222 144128 91102 87337 -6482 -15185 48247 84643 129645 161663 122761 124039
15195 124039 109183 108348 49738 103861 61358 25543 16910 25836 41115 -63810 -135141 -89940
15183 -89940 -110077 -47843 -44726 -32762 -37633 -92434 -86586 -50367 59143 131011 176515 202441
15171 202441 169313 123953 63700 36240 39100 34857 59626 120455 51438 -44971 -86483 -43302
15159 -43302 -91036 -50245 -97145 -108110 -52334 -67108 -121987 -89557 -76735 -125070 -65153 -32462
15147 -32462 -42352 -112533 -119472 17074 82818 28995 2296 94948 105284 42029 65884 48665
15135 48665 46939 28187 88660 18492 -5675 -37218 -83896 -50165 -112116 -83143 -12380 -16386
15123 -16386 -32370 -6285 81795 58430 17188 28167 8352 142399 104979 36995 102414
15112A02414J2280N307M580l4157O9515m6623n5530k4275O889L4934k9647n0874
15100e187P342L8618o475l6590p7712k6583M5280J32868P993R11j11351N263L3333
15087G710n9272L5497K1553l2437L2078N2135O0621j7328m8272k3836m8516r9832
15075a19899j2963R0503L9291M8999k1944o442L4645p5898l3618M1695O134J7964
15063H467j8238p8642m0770m6786o9535P985J64615J02679M1834L4448k5873m0573
15051C9611n5370k0357J06435L0412n5440n0902k7057M2869j5675O0995M1241
15040I6762o4401k3738J4933j3258R4484K8415k7545j04101j9874L7396q906p3805
15028f3638K6279P2341K8421J6787p0749O0183O186K4805m2702M1044O8122j352
$$ plain form
15112 102414 114694 120001 124581 90424 159939 113316 57786 33511 40400 75334 45687 -5187
15100 -5187 2155 40773 34298 -2292 -80004 -106587 -61307 71561 79554 80465 -30886 -25623 7710
15087 7710 -51562 -16065 5488 -26949 5129 57264 117885 100557 52285 28449 -20067 -119899
15075 -119899 -132862 -42359 -3068 45931 23987 17545 52190 -23708 -57326 -15631 -9497 8467
15063 8467 -9771 -88413 -129183 -175969 -245504 -237519 -72904 29775 71609 106057 80184 39611
15051 39611 -15759 -36116 70319 100731 45291 -5611 -32668 10201 -5474 55521 96762
15040 96762 32361 8623 23556 10298 104782 133197 105652 1551 -18323 19073 10167 -63638
15028 -63638 -37359 34982 63403 80190 9441 69624 75810 100615 57913 98957 167079 165727
15016A65727q2601j6241l6566k523J169M6639j8066l1762J3451Q60j8783P338
15004B8642l7509j7643Q6884J9924P201M4167m3208j023Q326k0257J0855Q539
14992I4898j0399j4262n9399o5028K4513l533j958j07148K1681O5455K2035q0136
14980a13281k5595Q8700K5221P5623J7702k3836J7904j9390l3523N5227j6617
14969D8135q2811N722l294r6492j4666O5234K0204k4729Q096R7924K8946m0174
14957A2095m3429J5108k6899j7794p2634q5523M0630R6840M2790j6390J0480j2300
14945e7026M2785J2775L0375J0633P259n5191L0036R5142M3361j6514k4318j13910
14933E407m2451N7287P0258K5018j34482j14667M9199K0651J3626O0889q8393
$$ plain form
15016 165727 83126 66885 30319 27796 28965 75604 57538 25776 39227 40087 21304 28642
15004 28642 -8867 -26510 60374 80298 87499 131666 88458 87435 95761 75504 86359 94898
14992 94898 84499 70237 10838 -54190 -29677 -33210 -35168 -142316 -120635 -55180 -33145 -113281
14980 -113281 -138876 -50176 -24955 50668 68370 44534 62438 43048 9525 64752 48135
14969 48135 -34676 -28954 -32248 -128740 -143406 -78172 -57968 -82697 -74601 23323 52269 12095
14957 12095 -31334 -16226 -43125 -60919 -133553 -219076 -178446 -81606 -38816 -55206 -44726 -57026
14945 -57026 -14241 -1466 28909 39542 46801 -8390 21646 116788 160149 143635 119317 5407
14933 5407 -37044 20243 90501 115519 -18963 -133630 -84431 -63780 -50154 10735 -77658
14922g7658n5260k2536O085n1983M2133P4253M371l1774L3753J9088P0807k2010
14910a0731p2585n515O0988R429M0722j7520n7499j8214k456k9791o170J38532
14898B9190R4699M6510j5946r6244l4316m0229O2211J6608l0097m9233l3616N3870
14886C407o2193j566N2884M8594J13778j5782j11606j80487k8065K5659P9682
14875g5695J5331P1510k465j9094R8J4399k736L8486j0697p2681M334j5433m302
14862e8945K3222O2751m713m3190n7824n1681M8448M2130K5142L750K0749Q0891
14850I0730o4196n4175J1969N0229J1911m7127j8715J8478P1449P8928j6248q6746
14838D6487p7854o445M8556J5594j199Q8724k1262m8441K6042K5895J1940l6549
$$ plain form
14922 -77658 -132918 -155454 -149369 -201352 -159219 -84966 -80595 -112369 -78616 -59528 11279 -10731
14910 -10731 -83316 -88831 -27843 -18414 22308 4788 -52711 -70925 -73381 -103172 -109342 29190
14898 29190 123889 170399 154453 58209 23893 -16336 45875 62483 32386 -16847 -50463 3407
14886 3407 -58786 -60352 -7468 41126 154904 139122 27516 -152971 -181036 -155377 -75695
14875 -75695 -60364 11146 8681 -10413 -10315 4084 1348 39834 29137 -43544 -39210 -54643 -58945
14862 -58945 -35723 27028 22315 -20875 -78699 -130380 -81932 -39802 -14660 -10910 9839 90730
14850 90730 26534 -27641 -15672 34557 46468 -659 -19374 -896 70553 149481 133233 46487
14838 46487 -31367 -37812 10744 26338 25139 113863 92601 44160 70202 96097 108037 71488
14826G1488q2121m0587J58699J0193j06320l8120J8405J9438m7675m8574K9954
14815e5220O6511N6563L5674r4148j12502N7032q830q7702j9332J27490P4289
14804C9825m7820m4203k8185n3267N3310m1948k5459O5924O0063k4179R258N2100
14792A5419o1421m3930L5491N8443J7028O571M0351j24560K8351O7659O1917p6934
14780B4385k5025N2694K1500N651M3402l3354n1591p5782p0185l1999P94J26312
14768a3198Q1248j6633n1816j03247o9945P3901L252L6333N0380K6618j704M1686
14756E6875j2157l5499L1599l884r346l3246j3527k724P7267K9353l7409m374
14744D2928J7743K176n046k8932O5030K3310j8910o9388r4002l5582j2948q939
$$ plain form
14826 71488 -10633 -51220 107479 117672 11352 -26768 -8363 11075 -36600 -85174 -55220
14815 -55220 11291 67854 103528 9380 -103122 -46090 -54920 -142622 -161954 -34464 39825
14804 39825 -7995 -52198 -80383 -133650 -80340 -122288 -147747 -81823 -21760 -45939 -36681 15419
14792 15419 -46002 -89932 -54441 4002 21030 27601 67952 -56608 -28257 39402 101319 24385
14780 24385 -640 52054 73554 79205 122607 89253 37662 -38120 -108305 -140304 -139510 -13198
14768 -13198 68050 51417 -399 -103646 -173591 -99690 -96438 -60105 -9725 16893 15189 56875
14756 56875 44718 9219 40818 36934 27588 -5658 -19185 -21909 55358 84711 47302 42928
14744 42928 60671 62847 57801 28869 93899 117209 98299 28911 -65091 -100673 -113621 -122560
14732a22560l6610J5732N9805J81946R8177q3685k9384k8993p0485q0476J3634
14721h2899N789L3357j1770Q159P1534K6154M3689M5218j09408m5861m4548m5563
14709a06149p6535N3728R4762l403j0244N9172k418N128Q5400j1055j7149j8757
14697E2480j4256o821K0828l9054N3578j8689M7101J758q4627l2982O1786j00511
14685e9409p8867L8973J6745r053j0621k1661O6330R676P9730O750j43314o8586
14673a73307J21181K3075n1381l0275k2557P5805R7450j7968m9233m6274R845
14662f3639J33601l8368J1755M1708k7071n9337j429k8851L0356K0992L2905L6871
14650H9493j8562j1783N8149n3337p6620r6902r2702l3671J10745Q9648M6531
$$ plain form
14732 -122560 -159170 -143438 -83633 98313 196490 112805 83421 54428 -16057 -96533 -82899
14721 -82899 -77110 -43753 -55523 -47364 24170 50324 94013 139231 29823 -16038 -60586 -106149
14709 -106149 -182684 -128956 -34194 -37597 -47841 11331 8913 14041 99441 88386 71237 52480
14697 52480 38224 31403 52231 13177 66755 48066 95167 96925 12298 -20684 41102 -59409
14685 -59409 -138276 -99303 -82558 -91611 -102232 -123893 -57563 -47887 31843 38593 -104721 -173307
14673 -173307 -52126 -29051 -80432 -110707 -133264 -57459 39991 22023 -27210 -73484 -63639
14662 -63639 69962 31594 43349 85057 57986 -1351 -2780 -31631 -1275 19717 52622 89493
14650 89493 70931 59148 117297 63960 -12660 -109562 -202264 -235935 -125190 -35542 10989
14639A0989P2251J9178p3445k6494m8377j04166M24M1024J5878q268L0551J5483
14627e4972J6601M1795J8410j9045j2721k0128Q327p488J5223n7087o0973J1896
14615a20162N1448K4286Q4712P091o5193n735m6281l3029L740J5290k8743K6187
14603h6389N2664J8601k971m4980k2966J4109o1380l4684K6729M3833L7556Q8276
14591B8398j1877O0393o5104N529M9581p9326L3727k2929o3218J0326L751L1086
14579a9663m0808l9186N0051K9178l1919N4794K4628l3010k7121M8201J23670
14568A38815M7211J9596l0782q5964k3719m2141j5284N0822j5130L9604O0158
14557A43186p4854l3610r5128l9261L1074J9679M9361O8803n2893n8611L8325
$$ plain form
14639 10989 83240 102418 28973 2479 -45898 -150064 -149640 -108616 -92738 -101006 -70455 -54972
14627 -54972 -38371 3424 21834 2789 -9932 -30060 -21733 -29221 -13998 -71085 -132058 -120162
14615 -120162 -68714 -44428 40284 47375 -17818 -23553 -69834 -102863 -99123 -83833 -112576 -86389
14603 -86389 -33725 -15124 -18095 -63075 -86041 -71932 -133312 -167996 -141267 -97434 -59878 28398
14591 28398 16521 76914 11810 17339 66920 -12406 21321 -1608 -64826 -54500 -50749 -19663
14579 -19663 -60471 -99657 -49606 -20428 -52347 2447 27075 -5935 -33056 15145 138815
14568 138815 186026 205622 174840 88876 65157 23016 7732 58554 43424 83028 143186
14557 143186 68332 34722 -60406 -99667 -68593 -48914 447 69250 16357 -42254 -3929
14546c929K7317l9367m0796o7982k7345L0761R2037N7840j09152k7846p9248l1747
14534b19457O3232K4593j1798K3115K0799K2200M5459j0550J1644L8949N8505
14523F6691o6441l1148j5788pJ5981j66P1378j9488l5233P2312j0379l1731K8126
14510D4107m7737k1888J2516P853j0743l1691l9250K644L2262K7091J364J2107
14498a1365J25555o2861q3486K0013L2683P818l4005M0280J434M0003M4722L1032
14486A51823o8324m7941j61383K1475J09222q536K9701n3638l7609K958n0805
14475a13057p6517M5817R0247K7417l2029p9583M0991K2066l0572P90m6556M9595
14463a01391L9381k187m7260L409P8706L3258R852M1458Q807M6286j4855k8924
$$ plain form
14546 -3929 23388 -15979 -56775 -124757 -152102 -121341 -29304 28536 -80616 -108462 -187710 -219457
14534 -219457 -156225 -131632 -143430 -120315 -99516 -77316 -31857 -42407 -30763 8186 66691
14523 66691 250 -30898 -46686 -46693 -30712 -30878 40500 21012 -14221 58091 47712 15981 44107
14510 44107 -3630 -25518 -13002 -5149 -15892 -47583 -86833 -84189 -51927 -24836 -23472 -11365
14498 -11365 114190 51329 -32157 -12144 20539 28357 -5648 34632 36066 76069 120791 151823
14486 151823 83499 35558 -125825 -104350 4872 -3664 26037 -27601 -65210 -62252 -113057
14475 -113057 -189574 -143757 -53510 -26093 -58122 -137705 -96714 -74648 -105220 -104430 -150986 -101391
14463 -101391 -62010 -64197 -111457 -108048 -29342 3916 13768 55226 64033 110319 95464 66540
14451F6540K431J8269j9379n327R862M3383K0325k2631q4091k6932L7544l6840
14439C154j15381j7802M0735j3990l9622m7521k1519K6368J03971J1547p5763
14428a45823M1722R4432j8291o9736k7368P2486Q898j03345N3484J32449K5935
14417F4843n417j5669r203j990K7725q152K5653K1926l6923N4513l8589o8013
14405A0704K4493K3163L4394N7545p3264k1087J3575j8830J3511l2470n1786K0610
14393E58O4842J23419l6239l0883K6190J981j5447L8959j37294n5378k2068n8506
14381i9866P6703R2054P7013l7040n3713k8353o4300J8639r105k2277k2521Q7393
14369A4627Q4705o3111l6570j6664J638K1339M8394j8012O8345q472r872N945
$$ plain form
14451 66540 68971 87240 67861 62534 72396 115779 136104 113473 29382 2450 39994 3154
14439 3154 -112227 -130029 -89294 -103284 -142906 -190427 -211946 -185578 -81607 -70060 -145823
14428 -145823 -104101 -9669 -27960 -97696 -125064 -52578 -43680 -147025 -93541 38908 64843
14417 64843 59426 43757 34554 32564 60289 52137 77790 99716 62793 117306 78717 10704
14405 10704 35197 58360 92754 150299 77035 55948 69523 50693 64204 31734 -20052 558
14393 558 65400 188819 152580 121697 147887 149868 134421 173380 36086 -19292 -41360 -99866
14381 -99866 -23163 68891 145904 108864 55151 26798 -37502 -18863 -27968 -50245 -72766 14627
14369 14627 99332 36221 -349 -17013 -15375 5964 54358 36346 104691 96219 86347 92292
14357I2292J9926q3916K8319O2060k3435l1248p6289q7850J6229K2489k2853M7865
14345c6411J9947j8483p2440L909O9045L3868j2492l0398M8566J1077l362K6715
14333C9541R0493q633K1466n4783j25673M0593J02825k0917r2181j7666J9949
14322d986L9882R6574j1326k5477k4328l7255J7073J3894M1099K9256M7577n7042
14310A24941m1266J221K7931q4350o8661l4087J4989K6808M5877O6437l6992m7657
14298d809L1627k2957j9512J1611k5203n2639L8761j5591n4099n499J57708l2707
14286F691r16M9097K4099K746l5669l9983l177K3848L7551n459O4680M2646q3747
14273H2407j08633j924K3789K8658L1275j00028j4591j9789q437K87l5590K0857
$$ plain form
14357 92292 112218 28302 56621 118681 95246 63998 -12291 -100141 -83912 -61423 -84276 -36411
14345 -36411 -16464 -34947 -107387 -103478 -34433 -565 -13057 -43455 5111 16188 12826 39541
14333 39541 130034 121401 142867 88084 -37589 3004 105829 84912 -7269 -24935 -4986
14322 -4986 34896 131470 120144 94667 70339 33084 50157 64051 105150 134406 181983 124941
14310 124941 83675 84896 112827 28477 -40184 -74271 -59282 -32474 13403 79840 42848 -4809
14298 -4809 26818 3861 -15651 -4040 -29243 -81882 -43121 -58712 -112811 -118310 39398 6691
14286 6691 5775 54872 78971 81717 46048 6065 2888 26736 64287 58828 123508 166154 82407
14273 82407 -26226 -28150 -4361 24297 55572 -44456 -59047 -78836 -87273 -86986 -122576 -101719
14261a01719N5249L3094q636N8220r0344J390j1441M2193M8429J06869P08l3797
14249A00215l6087J6228j5180O7944r6665j38640k4810J32955P2619m9961p8175
14238d9557k9757M4534l4697J02019K807j1873J21310O8884j14078p6013J993
14227B5572P1997j8270J7529l3886M4124k8276j21209p9541K7026K1174L7429
14216c6331n0797j7695o9998M2893O0180N3053O28N351K2597m4182l3639J7101
14204e0839O3459J8718j0107N7571Q367o9574n2501p363N0995N5695M0095m990
14192I9526J3727L8282l9836j35942l4485J3320L9765r272L7374J0220J5932J6497
14180F5108j22259o0352k7519N3822j9290M6828K2248m2019J2253j3372J5727
$$ plain form
14261 -101719 -46470 -13376 -22012 36208 -54136 -52746 -64187 -21994 26435 133304 134012 100215
14249 100215 64128 80356 65176 133120 36455 -102185 -126995 5960 78579 28618 -49557
14238 -49557 -79314 -34780 -69477 32542 35349 23476 144786 213670 99592 23579 25572
14227 25572 97569 79299 96828 62942 107066 78790 -42419 -121960 -94934 -73760 -36331
14216 -36331 -87128 -104823 -174821 -131928 -71748 -18695 -18067 -12716 9881 -34301 -67940 -50839
14204 -50839 12620 31338 21231 78802 87169 17595 -34906 -42269 8726 64421 104516 99526
14192 99526 113253 151535 111699 -24243 -58728 -45408 -5643 -14915 22459 32679 48611 65108
14180 65108 -57151 -117503 -145022 -91200 -110490 -63662 -41414 -83433 -71180 -84552 -68825
14169f8825k9204M8494n671O504P2942O4741K1305o2857l7115P1213J7094j5248
14157H3373m7618r11o7560L7081N0090p0956k4989l9656Q682J06247K4747J2159
14145G0689J2521M2791K036k6666n6194o3821o12K3994k2940K909L3310N5660
14133G3677q9235j12054r7927R9716L9526N0390P5185K7220l7028M9719l1998
14122D7191n9352l0366l0948L8743Q6080m2129k8074N0338p889J4570O0297J2202
14110A10663j5885M9o5631j0623O6588n2773r5860q4259k8040R3933J9255k7880
14098i0463L7970M0975n5571m3851r177k5174k0871j7342J65174Q6186J8980p1716
14086A5120l5048O7134O9895l1857q5503o5700J397O2010k0537K2037J1051K4964
$$ plain form
14169 -68825 -98029 -49535 -55206 -48702 24240 88981 110286 47429 10314 81527 98621 83373
14157 83373 35755 34844 -32716 4365 54455 -16501 -41490 -81146 -72464 33783 58530 70689
14145 70689 83210 126001 128037 101371 45177 -18644 -19256 4738 -18202 -15293 18017 73677
14133 73677 -15558 -127612 -225539 -125823 -86297 -35907 39278 66498 29470 79189 47191
14122 47191 -12161 -42527 -73475 -34732 51348 9219 -18855 31483 23594 38164 98461 110663
14110 110663 94778 94827 29196 18573 85161 32388 -63472 -147731 -175771 -81838 -62583 -90463
14098 -90463 -52493 -11518 -67089 -110940 -120117 -145291 -166162 -183504 -18330 67856 86836 15120
14086 15120 -19928 47206 117101 85244 -259 -65959 -64562 -2552 -23089 -1052 9999 34963
14074C4963k5231J5572N2432P0102k5401o0279j3608j04913l0094N7088J5768
14063a3601m9526l007j2057O6985P435l4014l3730m5734k2944L158M8449k6555
14051a15141l1180R5079J14761O3791K5757j03754r1880Q725L2816k8803N7724
14040B7895J11548J16381o0336j33102n6556L8109k5216M2821l8313m6839R793
14029a3815q655q888K7275J0379J09258j9696m0644J5228k0229N1425O7630N6665
14017B25933k0182q8901j04641p7485J33324Q2969K460j67593l2857J7905J9382
14006i686k439j3252R685J8700L394q278M8001J09051n6364p3299k0199l7608
13994c2294N1728O5287J9388o6376m4084K4020K092L9043J29310o565q6231j01683
$$ plain form
14074 34963 9732 25304 77736 147838 122437 62158 48550 -56363 -86457 -29369 -13601
14063 -13601 -63127 -66134 -78191 -11206 -3771 -37785 -71515 -117249 -140193 -137035 -88586 -115141
14051 -115141 -146321 -51242 63519 127310 153067 49313 -42567 -33842 -1026 -29829 27895
14040 27895 139443 255824 195488 62386 5830 43939 18723 61544 23231 -23608 -13815
14029 -13815 -22470 -31358 -4083 6296 115554 95858 55214 70442 50213 101638 169268 225933
14017 225933 205751 116850 12209 -65276 68048 151017 153477 -14116 -46973 -29068 -9686
14006 -9686 -12125 -25377 -15692 3008 6402 -1876 46125 155176 98812 25513 5314 -32294
13994 -32294 19434 84721 104109 37733 -6351 17669 19761 58804 188114 181549 95318 -6365
13982f365j2746M2310M0440J7775o5981p8752k3931J02509k52m7350j018L4357
13970I96L8262K2762p3425j02613N1179P2365K7420n5645k771M3250K7724j6283
13958C3221L3797N1260N2797q8669l7240l6367l0669M0755O9688k8380j46226
13947h6033K1507M5516k1312M4150K6606p9673M0761p202L6227J0482J4161j2825
13935C2365J9738K4633L914o8778M9299L71P284o9329k3821R9383J0467q1913
13923C613q4656k0515O2273N5048j1792k6994j8527L2025p8130k620M4944J8238
13911b7093k3924j0038k1451R2340M6361J3624K3018l7797p1328n8849N3843L382
13899a7912J5531j9718m8301P3776K6552K4407o2307l9266r804Q241l4595q147
$$ plain form
13982 -6365 -19111 23199 63639 81414 15433 -63319 -87250 15259 15007 -32343 -33361 996
13970 996 39258 62020 -11405 -114018 -62839 9526 36946 -18699 -21470 21780 49504 33221
13958 33221 67018 118278 171075 82406 45166 8799 -21870 18885 88573 60193 -86033
13947 -86033 -64526 -19010 -40322 3828 30434 -49239 -8478 -15680 20547 31029 45190 32365
13935 32365 52103 76736 80650 11872 61171 61542 68826 -503 -24324 75059 85526 3613
13923 3613 -81043 -101558 -39285 15763 3971 -23023 -41550 -9525 -87655 -90275 -45331 -27093
13911 -27093 -51017 -61055 -82506 9834 56195 69819 92837 55040 -16288 -75137 -21294 -17912
13899 -17912 -2381 -22099 -70400 3376 29928 54335 -7972 -47238 -57042 -48801 -83396 -91543
13887i1543k3768o7969K6224Q5393R8551M7113L8925n6808m607J97m1978o473
13875C257K8565j0138m1128o3625n4689M7512K9632m1162k3854n400M2442M4093
13863d4495k8737Q713M0316l7946j7010L1133j68k5234K9429K5551j0441q4532
13851a13421O3869J7162k794m0785J1382N3191n6157K7620R4303P79M0482M1875
13839A37506k6687p9940K7143N8444K6863l4784Q95j7119K308k6003n6892k8253
13827a6519l4571L3970o984l5571j0442J9548L6134k3487Q5425k5542j2513M1940
13815E1388q640p0669k6372o320K4620O1400j223J1079p8229k7073Q6786P2006
13803H8753p1988q8276l5911J6116q082L3834K9000J1353j9749N6913Q1628q6752
$$ plain form
13887 -91543 -115311 -183280 -157056 -71663 26888 74001 112926 56118 51511 51708 9730 3257
13875 3257 31822 21684 -19444 -83069 -137758 -90246 -60614 -101776 -125630 -131030 -88588 -44495
13863 -44495 -73232 -64519 -24203 -62149 -79159 -48026 -48194 -73428 -43999 -18448 -28889 -113421
13851 -113421 -49552 -32390 -35184 -75969 -64587 -11396 -67553 -39933 54370 55149 95631 137506
13839 137506 110819 30879 58022 116466 143329 108545 109440 92321 94629 68626 11734 -16519
13827 -16519 -51090 -17120 -24104 -59675 -70117 -50569 -14435 -37922 47503 21961 9448 51388
13815 51388 42748 -27921 -54293 -60613 -35993 25407 24184 35263 -42966 -70039 16747 88753
13803 88753 16765 -71511 -107422 -91306 -99388 -65554 -36554 -25201 -44950 11963 93591 6839
13791F839j1450j1850q9235Q077N1084P4682N4474m0556n5138M3625M6770J3888
13779I1210P345j05144n5640P861K5071j8017j9878m2729O178J8958O1956Q4922
13767F2093P1113m2840L258M0138p1881m0896J8911k4407l3367L1621J1598P6578
13755A01919j5671R619l7246m0447J1031M7465j2662J9856K432k7344p434n4144
13743b626o1373q3488k0732O0426K237N2375Q8539p585K3174J6737m561q3169
13731b0046j47047k0197N2510P8841M4454K0185r631J9812N1354K5110m6623m5260
13719C462K8020O128o1966j0578J03371K36N9820k1581n1603M3090l0285L9444
13707A07558O943p5982r3673r445O4073K585r834m6089k1879k1070K1428L1221
$$ plain form
13791 6839 -4611 -16461 -105696 -97619 -46535 28147 82621 42065 -13073 30552 77322 91210
13779 91210 98555 -6589 -62229 -54368 -29297 -47314 -67192 -109921 -103743 -84785 -22829 62093
13767 62093 133206 90366 93624 133762 61881 20985 39896 15489 -17878 13743 25341 101919
13755 101919 86248 95867 58621 18174 29205 76670 64008 83864 86296 58952 51518 -2626
13743 -2626 -63999 -147487 -168219 -107793 -105556 -53181 35358 27773 50947 67684 63123 -20046
13731 -20046 -167093 -187290 -134780 -55939 -11485 8700 -931 18881 70235 95345 48722 3462
13719 3462 31482 37610 -24356 -34934 68437 68673 128493 106912 55309 98399 68114 107558
13707 107558 114501 38519 -55154 -64599 -526 2059 -7775 -53864 -75743 -96813 -75385 -44164
13695d4164L0603M5114N9666o5371p1169M4074M2479K9379p263q5182m0879J10231
13683D7518Q0580j06124j3245L8727J03470Q538L5371O219n5525l3076L7076J917
13671A51446j10798p4551o3290K3617O9844K226N1536l399M5162K3860j50558
13660c4905k7353j7913M8515N2594p2030m1913N6234K6612M7111l8499o287N0001
13648D2167l731m5926j3350M5295O0472m8455m5386m3435M9907j1490O3191p919
13636D1340k3803n3347k9851O67K8542j7063l5604N3440r566J2205P2378P8548
13624A17886m064j25129j9496o7394j05677n9923J21000J37142P034j451O5467
13613F5395M1031J0686l0469K9119n0371o5037k6516M4875M2089N1205l4793m2577
$$ plain form
13695 -44164 -13561 31553 91219 25848 -45321 -1247 41232 70611 63348 -21834 -62713 47518
13683 47518 128098 21974 8729 47456 150926 159464 194835 201054 145529 112453 149529 151446
13671 151446 40648 -33903 -97193 -73576 -3732 -1506 50030 46631 91793 115653 -34905
13660 -34905 -62258 -80171 -31656 20938 -51092 -93005 -36771 -10159 36952 -1547 -7834 42167
13648 42167 38436 -7490 -20840 24455 84927 36472 -8914 -52349 -2442 -13932 49259 41340
13636 41340 17537 -35810 -65661 -64994 -36452 -53515 -89119 -35679 -45245 -33040 39338 117886
13624 117886 113822 -11307 -30803 -98197 -203874 -263797 -142797 -5655 1379 -72 65395
13613 65395 106426 117112 86643 115762 65391 354 -26162 18713 60802 112007 77214 34637
13601C4637p8966j8240K9832Q57K0616j23022M5881K4085j0346L7040K4297L0758
13589A7429J05208l2773J0023l1147n1044L843K643L8785k0524j1729o7841o0696
13577i7823j4745l521L9172J25549K4820J5571N714K0389m1534k6725r2463J8956
13565b6640O6245p5267j01416J1544P0545R610N8349N1311Q7788k8281N2781N1429
13553B27998l8573r4064j46143l9027L9496O4637K4892M703O1694K813J9763J5242
13541A43431n9630p3074k5895K7955k612J7826l0639L0424M368q3399O580O8663
13529B3998J01185m3692q0698N5220M4351r030m5402N8414L3865l4671k526p9992
$$ plain form
13601 34637 -44329 -62569 -32737 -31880 -11264 -134286 -88405 -64320 -74666 -37626 -13329 17429
13589 17429 122637 89864 99887 68740 17696 21539 24182 62967 42443 30714 -37127 -97823
13577 -97823 -112568 -116089 -76917 48632 73452 89023 94737 115126 73592 46867 -45596 -26640
13565 -26640 39605 -35662 -137078 -125534 -54989 -45379 12970 64281 152069 123788 176569 227998
13553 227998 189425 95361 -50782 -89809 -50313 14324 39216 43919 105613 108426 128189 143431
13541 143431 83801 10727 -15168 12787 10175 28001 -2638 27786 32154 -51245 -44665 23998
13529 23998 125183 81491 793 56013 100364 91334 45932 104346 138211 103540 101014 21022
$$ [...]
##END NTUPLES=NMR SPECTRUM
##END=
