##TITLE=Analysis number 328373
Compound Code cc 64704
Book Reference 508/96
Project Code adrs
Chemist Name antons
##JCAMPDX= 6.0         $$ Bruker NMR JCAMP-DX V2.0
##DATA TYPE= NMR SPECTRUM
##DATA CLASS= NTUPLES
##ORIGIN= Bruker BioSpin GmbH
##OWNER= nmr
$$ XWIN-NMR		Version 3.5
$$ Wed May 30 13:01:54 2007 GMT Daylight Time (UT+1h)  MAYBRIDGE\nmr@NMR_250MHZ
##.OBSERVE FREQUENCY= 250.131544655141
##.OBSERVE NUCLEUS= ^1H
##.ACQUISITION MODE= SIMULTANEOUS (DQD)
##.ACQUISITION SCHEME= undefined
##.AVERAGES= 16
##.DIGITISER RES= 18
##SPECTROMETER/DATA SYSTEM= dpx250
##.PULSE SEQUENCE= zg30
##.SOLVENT NAME= CDCl3
##.SHIFT REFERENCE= (INTERNAL, CDCl3, 0, 16.522)
##AUDIT TRAIL= $$ (NUMBER, WHEN, WHO, WHERE, WHAT)
$$ ##TITLE= Audit trail, XWIN-NMR		Version 3.5
$$ ##JCAMPDX= 5.01
$$ ##ORIGIN= Bruker BioSpin GmbH
$$ ##OWNER= nmr
$$ C:\u/data/dgb/nmr/ADRS/1720/pdata/1/auditp.txt
$$ ##AUDIT TRAIL=  $$ (NUMBER, WHEN, WHO, WHERE, WHAT)
(   1,<2007-05-30 13:01:32.62 +100>,<MAYBRIDGE\nmr>,<NMR_250MHZ>,
      <created by zg, POWCHK disabled, PULCHK disabled
       configuration hash MD5:
       76 6E 9A 78 1E 09 19 81 EC 84 63 8F B0 6A 59 2D
       data hash MD5: 64K
       BE DF 93 C1 22 EC 8F 2D A1 9B C5 A2 42 76 9C A5>)
(   2,<2007-05-30 13:01:44.84 +100>,<MAYBRIDGE\nmr>,<NMR_250MHZ>,
      <Start of raw data processing
       ef LB = 0.3 FT_mod = 6 PKNL = 1 SI = 32K 
       data hash MD5: 32K
       5A 5C D2 A4 89 D1 D7 F7 6A 74 E3 AF EE 54 C5 FF>)
(   3,<2007-05-30 13:01:46.49 +100>,<MAYBRIDGE\nmr>,<NMR_250MHZ>,
      <apk 
       data hash MD5: 32K
       4A 2F CD 48 52 FB DA 6E 53 BA BB B1 52 89 39 F6>)
(   4,<2007-05-30 13:01:47.32 +100>,<MAYBRIDGE\nmr>,<NMR_250MHZ>,
      <abs ABSG = 5 
       data hash MD5: 32K
       7E 37 7D C2 EB 94 96 62 48 E4 A5 DD 4F AB 44 48>)
$$ ##END=
$$ 
$$ hash MD5
$$ DD B5 06 7C 3B 38 9A 40 16 36 E0 51 D7 49 F7 A2
##$RELAX= 
##$RELAX= 
##$RELAX= 
##$RELAX= 
##$RELAX= 
##$RELAX= 
##$RELAX= 
$$ Bruker specific parameters
$$ --------------------------
##$DU= <C:\u>
##$EXPNO= 1720
##$NAME= <ADRS>
##$PROCNO= 1
##$TYPE= <nmr>
##$USER= <dgb>
##$AMP= (0..31)
100 100 100 100 100 100 100 100 100 100 100 100 100 100 100 100 100 100 
100 100 100 100 100 100 100 100 100 100 100 100 100 100 
##$AQSEQ= 0
##$AQ_mod= 3
##$AUNM= <au_zg>
##$AUTOPOS= <17 >
##$BF1= 250.13
##$BF2= 250.13
##$BF3= 250.13
##$BF4= 250.13
##$BF5= 500.13
##$BF6= 500.13
##$BF7= 500.13
##$BF8= 500.13
##$BYTORDA= 1
##$CFDGTYP= 0
##$CFRGTYP= 5
##$CHEMSTR= <none>
##$CNST= (0..31)
1 1 145 1 1 1 1 1 1 1 1 1 1 1 1 1 1 1 1 1 1 1 1 1 1 1 1 1 1 1 1 1 
##$CPDPRG= <>
##$CPDPRG1= <>
##$CPDPRG2= <>
##$CPDPRG3= <>
##$CPDPRG4= <mlev>
##$CPDPRG5= <mlev>
##$CPDPRG6= <mlev>
##$CPDPRG7= <mlev>
##$CPDPRG8= <mlev>
##$CPDPRGB= <>
##$CPDPRGT= <>
##$D= (0..31)
0 1 0 0 0 0 0 0 0 0.06 0 0 0 0 0 0 0.0002 0 0 0 0 0 0 0 0 0 0 0 0 0 0 
0 
##$DATE= 1180526491
##$DBL= (0..7)
120 120 120 120 120 120 120 120 
##$DBP= (0..7)
150 150 150 150 150 150 150 150 
##$DBP07= 0
##$DBPNAM0= <>
##$DBPNAM1= <>
$$ [...]
##$SUBNAM7= <"">
##$SUBNAM8= <"">
##$SUBNAM9= <"">
##$SW= 20.6930455092707
##$SWIBOX= (0..15)
0 0 3 0 0 0 0 0 0 0 0 0 0 0 0 0 
##$SW_h= 5175.983436853
##$TD= 65536
##$TD0= 1
##$TE= 683.16
##$TE2= 300
##$TE3= 300
##$TEG= 300
##$TL= (0..7)
0 120 120 120 120 120 120 120 
##$TP= (0..7)
150 150 150 150 150 150 150 150 
##$TP07= 0
##$TPNAME0= <>
##$TPNAME1= <>
##$TPNAME2= <>
##$TPNAME3= <>
##$TPNAME4= <>
##$TPNAME5= <>
##$TPNAME6= <>
##$TPNAME7= <>
##$TPOAL= (0..7)
0.5 0.5 0.5 0.5 0.5 0.5 0.5 0.5 
##$TPOFFS= (0..7)
0 0 0 0 0 0 0 0 
##$TUNHIN= 0
##$TUNHOUT= 0
##$TUNXOUT= 0
##$USERA1= <user>
##$USERA2= <user>
##$USERA3= <user>
##$USERA4= <user>
##$USERA5= <user>
##$V9= 5
##$VALIST= <valist>
##$VCLIST= <CCCCCCCCCCCCCCC>
##$VD= 0
##$VDLIST= <DDDDDDDDDDDDDDD>
##$VPLIST= <PPPPPPPPPPPPPPP>
##$VTLIST= <TTTTTTTTTTTTTTT>
##$WBST= 1024
##$WBSW= 4
##$XGAIN= (0..3)
0 0 0 0 
##$XL= 0
##$YL= 0
##$YMAX_a= 462294
##$YMIN_a= -408952
##$ZGOPTNS= <>
##$ZL1= 120
##$ZL2= 120
##$ZL3= 120
##$ZL4= 120
##$ABSF1= 16.522
##$ABSF2= -4.171173
##$ABSG= 5
##$ABSL= 3
##$ALPHA= 0
##$AQORDER= 0
##$ASSFAC= 0
##$ASSFACI= 0
##$ASSFACX= 0
##$ASSWID= 0
##$AUNMP= <proc_1d>
##$AZFE= 0.1
##$AZFW= 0.1
##$BCFW= 0
##$BC_mod= 0
##$BYTORDP= 0
##$COROFFS= 0
##$CY= 12.5
##$DATMOD= 1
##$DC= 0
##$DFILT= <>
##$DTYPP= 0
##$F1P= 14.0000005364418
##$F2P= -0.99999901652339
##$FCOR= 0.5
##$FTSIZE= 32768
##$FT_mod= 6
##$GAMMA= 0
##$GB= 0
##$INTBC= 1
##$INTSCL= 1
##$ISEN= 128
##$LB= 0.3
##$LEV0= 0
##$LPBIN= 0
##$MAXI= 10000
##$MC2= 0
##$MEAN= 0
##$ME_mod= 0
##$MI= 0
##$NCOEF= 0
##$NC_proc= -4
##$NLEV= 6
##$NOISF1= 0
##$NOISF2= 0
##$NSP= 0
##$NTH_PI= 0
##$NZP= 0
##$OFFSET= 16.522
##$PC= 1
##$PHC0= -54.07904
##$PHC1= 5.289124
##$PH_mod= 1
##$PKNL= yes
##$PPARMOD= 0
##$PSCAL= 4
##$PSIGN= 0
##$REVERSE= no
##$SF= 250.13
##$SI= 32768
##$SIGF1= 0
##$SIGF2= 0
##$SINO= 400
##$SIOLD= 32768
##$SREGLST= <1H.CDCl3>
##$SSB= 0
##$STSI= 32768
##$STSR= 0
##$SW_p= 5175.98343685301
##$SYMM= 0
##$S_DEV= 0
##$TDeff= 65536
##$TDoff= 0
##$TI= <Analysis number 999999
Compound Code 99
Book Reference 9
Project Code 9>
##$TILT= no
##$TM1= 0
##$TM2= 0
##$TOPLEV= 0
##$USERP1= <user>
##$USERP2= <user>
##$USERP3= <user>
##$USERP4= <user>
##$USERP5= <user>
##$WDW= 1
##$XDIM= 32768
##$YMAX_p= 520166556
##$YMIN_p= -121816
$$ End of Bruker specific parameters
$$ ---------------------------------
##NTUPLES= NMR SPECTRUM
##VAR_NAME=  FREQUENCY,     SPECTRUM/REAL,   SPECTRUM/IMAG
##SYMBOL=    X,             R,               I
##VAR_TYPE=  INDEPENDENT,   DEPENDENT,       DEPENDENT
##VAR_FORM=  AFFN,          ASDF,            ASDF
##VAR_DIM=   32768,         32768,           32768
##UNITS=     HZ,            ARBITRARY UNITS, ARBITRARY UNITS
##FACTOR=    0.157963299565203, 1,           1
##FIRST=     4132.6476996994, 0,             0
##LAST=      -1043.33573715361, 0,           0
##MIN=       -1043.33573715361, -121816,     0
##MAX=       4132.6476996994, 520166556,     0
$$ Real data points
##PAGE= N=1
##DATA TABLE= (X++(R..R)), XYDATA
$$ [...]
$$ plain form
28197 14642 24963 31612 627 6314 31434 39816 30619 15391 4517 13681 20648 31116 27993
28184 27993 724 -21927 -15272 19471 41572 25226 20323 14068 738 -19039 -20613 -4804
28172 -4804 10357 -12689 -10364 8975 -8642 -2142 4884 13808 24266 25601 35214 53807 68496
28159 68496 52697 27888 36256 15013 -6445 637 9574 6375 -23229 -20963 -21864 -38157 -58556
28146 -58556 -51525 -51741 -13509 -10241 -27848 -11895 9220 4691 -19377 -19595 -18953 5193 16855
28133 16855 -8431 13374 22663 6757 -11845 -10632 6000 9567 -8434 -36987 -52282 -29448
28121 -29448 -6806 -1845 18174 61143 71023 86078 74476 46828 13574 2170 15133 33361
28109 33361 37718 24563 29263 19761 16084 -7309 -8346 -5124 -365 1949 5828 18418 16747 6287
$$ packed form
28197A4642J0321O649l0985N687K5120Q382r197j5228j0874R164O967J0468l123
28184B7993k7269k2651O655L4743K2101j6346m903o255j3330j9777j574J5809
28172d804J5161k3046K325J9339j7617O500P026Q924J0458J335R613J8593J4689
28159F8496j5799k4809Q368k1243k1458P082Q937l199k9604K266r01j6293k0399
28146e8556P031k16L8232L268j7607J5953K1115m529k4068k18O42K4146J1662
28133A6855k5286K1805R289j5906j8602J213J6632L567j8001k8553j5295K2834
28121b9448K2642M961K0019M2969R880J5055j1602k7648l3254j1404J2963J8228
28109C3361M357j3155M700r502l677k3393j037L222M759K314L879J2590j671j0460
$$ plain form
28095 6287 4451 29532 42292 8031 -2471 -6844 3029 -10394 -18167 3684 9084 -1453 10686
28082 10686 24218 45674 55316 36545 43938 22022 2528 12085 22032 3794 9000 12043 23934
28069 23934 15617 35630 18356 -2579 23312 3849 -4270 3489 13593 16253 -17871 -37575
28057 -37575 -34193 -31502 -11254 -6483 -25506 -17735 6051 29150 27863 -3635 -23210 -3673 19306
28044 19306 11075 10755 -1976 -20513 -11558 -9192 391 -2989 -6177 5998 -225 956 21117 54766
28030 54766 62702 39322 19172 35657 23685 18856 31032 49833 59187 46161 44975 16785
28018 16785 6667 -4552 469 12458 17357 30710 21450 35049 30524 22699 19346 -11368 -29723
28005 -29723 -9707 13004 31054 17513 -2509 7648 19406 20847 -3352 -1584 3617 18814
$$ packed form
28095F287j836K5081J2760l4261j0502m373R873j3423p773K1851N400j0537J2139
28082A0686J3532K1456R642j8771P393k1916j9494R557R947j8238N206L043J1891
28069B3934q317K0013j7274k0935K5891j9463q119P759J0104K660l4124j9704
28057c7575L382K691K0248M771j9023P771K3786K3099j287l1498j9575J9537K2979
28044A9306q231l20j2731j8537Q955K366R583l380l188J2175o223J181K0161L3649
28030E4766P936k3380k0150J6485j1972m829J2176J8801R354j3026j186k8190
28018A6785j0118j1219N021J1989M899J3353r260J3599m525p825l353l0714j8355
28005b9723K0016K2711J8050j3541k0022J0157J1758J441k4199J768N201J5197
$$ plain form
27993 18814 38640 15034 21349 34996 10939 -1999 5191 21820 36192 26207 -23166 -38696
27981 -38696 -40192 -28565 -19496 -1717 42280 58629 58825 32885 9943 2748 -17606 -18812 -16943
27968 -16943 -3102 -9327 -10081 14013 4166 17637 18371 17137 12648 8538 14045 32008 17838 8765
27954 8765 20755 29900 15213 2385 -33650 -49833 -30720 -7243 -18934 -32011 -32710 -38724 -38607
27941 -38607 -30207 -26713 -16091 -10171 -28283 -27762 -19692 -12700 -10593 -31388 -49505 -51475 -29857
27928 -29857 4164 20015 5523 -31324 -30004 -14719 -15880 -11700 -1852 16276 12616 -15451 -13923
27915 -13923 -5134 17778 38763 29189 29490 36441 24159 -594 -12167 644 21335 32743 42020
27902 42020 37901 41993 39471 18293 -12504 -26696 -12254 -2543 5141 -11465 -2966 -8012 -10940
$$ packed form
27993A8814J9826k3606O315J3647k4057j2938P190J6629J4372r985m9373j5530
27981c8696j496J1627R069J7779M3997J6349J96k5940k2942p195k0354j206J869
27968a6943J3841o225p54K4094r847J3471P34j234m489m110N507J7963j4170r073
27954H765J1990R145j4687j2828l6035j6183J9113K3477j1691j3077o99o014J17
27941c8607Q400L494J0622N920j8112N21Q070O992K107k0795j8117j970K1618
27928b9857L4021J5851j4492l6847J320J5285j161M180R848J8128l660k8067J528
27915a3923Q789K2912K0985r574L01O951j2282k4753j1573J2811K0691J1408R277
27902D2020m119M092k522k1178l0797j4192J4442R711P684j6606Q499n046k928
$$ plain form
27889 -10940 2045 19168 24545 -11524 8978 41606 37433 28271 8416 9539 -2817 5847 2062
27876 2062 -10324 -29367 -20640 13075 46866 30284 25969 20445 13789 28546 30111 30525 20634
27863 20634 29367 32499 27045 25922 27047 41188 17667 8175 13979 39716 43097 32736 22632
27850 22632 18483 -8638 -25018 -26967 -19741 -35309 -14206 -12716 -23168 3845 3064 -4943 -6469
27837 -6469 -9653 -9706 18443 51993 43847 27342 18252 18662 -13554 -25440 -30753 -11312 -13426 -10937
27823 -10937 15855 19934 5444 -16393 -19940 -27249 -29547 -45506 -37780 -13074 -11401 -22660 -28616
27810 -28616 -23356 -22383 -26368 -3330 10986 -7580 -5606 7470 3123 -12946 -8728 -748 1701
27797 1701 9433 1713 38321 62668 37447 -4123 -19541 -2908 11865 7323 -3180 -4961 3287
$$ packed form
27889a0940J2985J7123N377l6069K0502L2628m173r162j9855J123j2356Q664l785
27876B062j2386j9043Q727L3715L3791j6582m315n524o656J4757J565M14r891
27863B0634Q733L132n454j123J125J4141k3521r492N804K5737L381j0361j0104
27850B2632m149k7121j6380j949P226j5568K1103J490j0452K7013p81q007j526
27837f469l184n3K8149L3550q146j6505r090M10l2216j1886n313J9441k114K489
27823a0937K6792M079j4490k1837l547p309k298j5959P726K4706J673j1259n956
27810b8616N260R73l985K3038J4316j8566J974J3076m347j6069M218P980K449
27797A701P732p720L6608K4347k5221m1570j5418J6633J4773m542j0503j781Q248
$$ plain form
27784 3287 3822 17614 31865 39747 25673 480 -23994 -35387 -34345 -20297 12506 4589 -24881
27771 -24881 -3016 25800 37735 4309 -12864 -5130 -1795 -758 1378 -13178 -3905 22389 59543
27758 59543 61747 47708 39419 10992 2916 15158 9210 11042 3223 21061 15320 -1172 -7465
27745 -7465 -14154 -3248 19304 22361 14591 24169 32704 16629 5803 1184 -9928 8546 -2835
27732 -2835 195 7313 16345 10666 13976 7895 -13607 -14702 -5865 -4879 -4059 7157 -7735 -7434 -746
27717 -746 236 21091 28894 36614 18599 12348 -2751 20960 33701 30449 32561 20375 32918
27704 32918 30081 4973 9041 20227 10656 11639 21238 24163 4359 -7009 647 15441 -4962
27691 -4962 -1305 13091 22273 41764 54262 38355 37670 41074 24649 2089 8377 6174 -11819
$$ packed form
27784C287N35J3792J4251P882j4074k5193k4474j1393J042J4048L2803p917k9470
27771b4881K1865K8816J1935l3426j7173P734L335J037K136j4556R273K6294L7154
27758E9543K204j4039q289k8427q076J2242n948J832p819J7838n741j6492o293
27745g465o689J0906K2552L057p770R578Q535j6075j0826m619j1112J8474j1381
27732b835L030P118R032n679L310o081k1502j095Q837R86Q20J1216j4892L01O688
27717g46R82K0855P803P720j8015o251j5099K3711J2741l252K112j2186J2543
27704C2918k837k5108M068J1186r571R83R599K925j9804j1368P656J4794k0403
27691d962L657J4396R182J9491J2498j5907o85L404j6425k2560O288k203j7993
$$ plain form
27678 -11819 -18831 -13427 -18120 2459 17969 28586 28264 -8543 -9026 -8603 -10900 14530 40426 44986
27664 44986 41384 33170 32749 35679 34273 8276 1896 22255 -6836 -23431 -1334 13384 5781
27651 5781 14679 8629 7032 15172 16503 15864 15573 10132 39903 47267 17601 -17626 -21790 431
27637 431 28087 17294 -28547 -35422 -56985 -50095 -36363 -17296 -3589 -14471 3495 14915
27625 14915 -26412 -54871 -68060 -53915 -31351 -12519 -29661 -27401 -17800 250 366 -9978
27613 -9978 -290 -36937 -23522 14281 8376 2861 -4881 -8988 -4567 20973 28899 32049 31357 28655
27599 28655 7971 -16006 -25176 -29258 -48104 -53565 -44480 -31504 -4967 -2663 -11016 5318 10932
27586 10932 11122 14042 19865 36773 22323 12377 24201 29721 19872 3929 -1668 -13565 18205
$$ packed form
27678a1819p012N404m693K0579J5510J0617l22l6807m83M23k297K5430K5896M560
27664D4986l602q214m21K930j406k5997o380K0359k9091j6595K2097J4718p603
27651E781Q898o050j597Q140J331o39k91n441K9771P364k9666l5227m164K2221
27637D31K7656j0793m5841o875k1563O890J3732J9067J3707j0882J7966J1420
27625A4915m1327k8459j3189J4145K2564J8832j7142K260R601J8050J16j0344
27613i978R688l6647J3415L7803n905n515p742m107M421K5540P926L150o92k702
27599B8655k0684k3977r170m082j8846n461R085J2976K6537K304q353J6334N614
27586A0932J90K920N823J6908j4450r946J1824N520r849j5943n597j1897L1770
$$ plain form
27573 18205 22200 6552 5282 22293 47183 40084 3414 13660 40685 43226 17104 29549
27561 29549 46599 64354 67079 43306 36017 49236 53966 59439 60773 51051 15729 -3282 -19478
27548 -19478 -2047 -6356 12056 24511 10223 -6414 -15784 4720 -8560 -6756 -15079 7143
27536 7143 9285 -21026 -4001 16674 19610 2771 9957 24718 27412 16030 5392 -4209 -19632
27523 -19632 -19503 -3305 5344 6776 19332 22848 6907 -8746 -18469 -13596 -5292 -5422 1754 -10156
27509 -10156 700 21157 1012 -13167 -31366 -31417 -8803 -13876 2003 22932 23594 -8002 -30410
27496 -30410 -5290 3132 -14220 -37690 -52180 -38353 -20996 -10172 -27156 -29797 -21473 -3917
27484 -3917 8819 17326 50108 63966 49849 26713 30674 17442 -20869 -39034 -12392 20822
$$ packed form
27573A8205L995j5648j270J7011K4890p099l6670J0246K7025K541k6122J2445
27561B9549J7050J7755K725k3773p289J3219M730N473J334r722l5322j9011j6196
27548a9478J7431m309J8412J2455j4288j6637r370K0504j3280J804q323K2222
27536G143K142l0311J7025K0675K936j6839P186J4761K694j1382j0638r601j5423
27523a9632J29J6198Q649J432J2556L516j5941j5653r723M873Q304j30P176j1910
27509a0156J0856K0457k0145j4179j8199n1K2614n073J5879K0929O62l1596k2408
27496c0410K5120Q422j7352k3470j4490J3827J7357J0824j6984k641Q324J7556
27484c917J2736Q507L2782J3858j4117k3136L961j3232l8311j8165K6642L3214
$$ plain form
27472 20822 13062 -3086 -4434 -16527 -23283 -40495 -26332 3807 -7002 -28726 -3554 4172
27460 4172 -8296 16451 27252 -1633 -23061 -40244 -24036 -13508 -23416 -16354 -5148 -3827
27448 -3827 -1873 -7440 -11523 8040 6833 -18325 -16205 -10680 18252 32854 38430 42628 35375 16881
27434 16881 19451 26438 41347 27930 -1038 -7885 -2366 24262 39077 58690 57622 45686 19949
27421 19949 9202 17196 680 620 -5785 -1756 -7980 -2941 -22101 -18014 -19555 -17380 -22086 894
27407 894 5281 9263 12892 21919 23067 5185 -7919 -15048 -17453 1690 15267 12207 25736 8124
27393 8124 -10892 -22990 14957 22641 36620 54306 10155 -44391 -54072 -17887 18599 28011
27381 28011 13886 16435 6863 -5153 853 -25896 -16462 21640 51625 63274 70684 38319 7631
$$ packed form
27472B0822p760j6148j348j2093o756j7212J4163L0139j0809k1724K5172P726
27460D172j2468K4747J0801k8885k1428j7183J6208J0528r908P062J1206J321
27448c827J954n567m083J9563j207k5158K120N525K8932J4602N576M198p253j8494
27434A6881K570O987J4909j3417k8968o847N519K6628J4815J9613j068j1936k5737
27421A9949j0747P994j6516o0o405M029o224N039j9160M087j541K175m706K2980
27407H94M387L982L629R027J148j7882j3104p129k405J9143J3577l060J3529j7612
27393H124j9016j2098L7947P684J3979J7686m4151n4546r681L6185L6486R412
27381B8011j4125K549r572j2016O006k6749R434L8102K9985J1649P410l2365l0688
$$ plain form
27368 7631 15682 4108 -33655 -58911 -27459 -21136 -14768 19454 27282 14995 -4373 17290 17895
27355 17895 -2771 -33980 -13996 -3396 -16975 -24970 -9442 17733 36559 54777 40012 -1604
27343 -1604 -25492 -29934 -35983 -31265 -8912 28269 44383 51991 64606 64224 39311 30017 34518
27330 34518 21456 6839 8881 11893 11892 8835 5736 12744 29283 18532 9211 24515 6248 31486
27316 31486 35243 8945 -23053 -7509 -4442 18703 34474 32834 29981 14291 12980 12662 -2980
27303 -2980 16975 -643 -36324 -56465 -41817 -28133 -34003 -21744 7119 -6840 23858 36682
27291 36682 -8088 -28342 -49501 -69790 -45780 -13521 3783 24522 14496 -8590 -29515 -15949
27279 -15949 -26687 -13174 693 -23327 -11870 -28446 -27585 -683 14278 15739 -6454 4068
$$ packed form
27368G631Q051j1574l7763k5256L1452O323O368L4222P828j2287j9368K1663O05
27355A7895k0666l1209J9984J0600j3579p995J5528K7175J8826J8218j4765m1616
27343a604k3888m442o049M718K2353L7181J6114P608J2615l82k4913r294M501
27330C4518j3062j4617K042L012jl057l099P008J6539j0751r321J5304j8267K5238
27316C1486L757k6298l1998J5544L067K3145J5771j640k853j5690j311l18j5642
27303b980J9955j7618l5681k0141J4648J3684n870J2259K8863j3959L0698J2824
27291C6682m4770k0254k1159k0289K4010L2259J7304K0739j0026k3086k0925J3566
27279a5949j0738J3513J3867k4020J1457j6576Q61K6902J4961J461k2193J0522
$$ plain form
27267 4068 13427 -13959 -43098 -35400 -18230 -12097 -884 19411 21141 -8256 -17231 -11852 -11535
27254 -11535 -11867 -34372 -49238 -32287 -35220 -51989 -39244 -13532 -5534 -18180 -32150 -29525 -19755
27241 -19755 865 39308 52237 27538 30328 35308 19205 23125 20383 31507 60677 44920
27229 44920 31900 25315 18101 -6178 -8832 14232 6698 -28633 -23427 7387 34806 31252 20524
27216 20524 22306 42030 33640 6435 7071 6455 -4207 6545 16097 -3942 -20826 -4852 10693
27203 10693 32706 45261 30248 13072 6553 6323 18291 22471 23564 31822 18071 7071 -18099
27190 -18099 -20238 10614 9829 752 21920 55150 51104 55991 45842 22516 -9194 -30682 -14795
27177 -14795 -8377 -513 9204 11281 -33739 -40185 -32496 -40416 -29962 -20038 -146 4944 -23051
$$ packed form
27267D068R359k7386k9139P698J7170O133J1213K0295J730k9397q975N379L17
27254a1535l32k2505j4866J6951k933j6769J2745K5712P998j2646j3970K625R770
27241a9755K0620L8443J2929k4699K790M980j6103L920k742J1124K9170j5757
27229D4920j3020o585p214k4279k654K3064p534l5331N206L0814K7419l554j0728
27216B0524J782J9724q390k7205O36o16j0662J0752R552k0039j6884J5974J5545
27203A0693K2013J2555j5013j7176o519k30J1968M180J093Q258j3751j1000k5170
27190a8099k139L0852p85r077K1168L3230m046M887j0149k3326l1710k1488J5887
27177a4795O418P864R717K077m5020o446P689p920J0454R924J9892N090k7995
$$ plain form
27164 -23051 -21875 -962 -24625 -17906 -25111 -16955 7803 14607 24054 39391 65250 74858 57753
27151 57753 46984 23999 5249 6148 20209 9582 9729 19274 22978 7467 17048 32524 36278
27138 36278 44239 14848 -320 44396 60978 32982 34800 50927 43255 29090 35548 45186 38538
27125 38538 40978 54512 55506 36410 22026 1471 23432 37712 29017 27046 23661 6540 15770
27112 15770 43865 33130 19690 34986 41827 26980 16033 6690 771 8920 19485 21781 -2201
27099 -2201 -25152 -32989 -33738 -719 -5053 -18908 -30816 -36868 -20331 2578 -8578 -14178 11213
27086 11213 17135 4295 22136 10646 -11874 -13450 -3636 -7297 11489 6524 -45010 -46389 -17851
27073 -17851 -15184 -27127 -16146 -4755 -11723 -16428 -54970 -35183 14227 32337 28050 19871 4855
$$ packed form
27164b3051J176K0913k3663O719p205Q156K4758O804R447J5337K5859R608j7105
27151E7753j0769k2985j8750Q99J4061j0627J47R545L704j5511R581J5476L754
27138C6278P961k9391j5168M4716J6582k7996J818J6127p672j4165O458R638o648
27125C8538K440J3534R94j9096j4384k0555K1961J4280q695j971l385j7121R230
27112A5770K8095j0735j3440J5296O841j4847j0947r343n919Q149J0565K296k3982
27099b201k2951p837p49L3019m334j3855j1908o052J6537K2909j1156n600K5391
27086A1213N922j2840J7841j1490k2520j576R814l661J8786m965n1534j379K8538
27073a7851K667j1943J0981J1391o968m705l8542J9787M9410J8110m287q179j5016
$$ plain form
27060 4855 4406 21009 15172 -1225 -38336 -32428 -9090 17754 11295 35144 27535 13607 -2538
27047 -2538 8253 26665 26310 45803 32067 9840 -11568 -25093 -35680 -26128 -18208 -14929 12427
27034 12427 24112 12748 -722 -33042 -33224 -7109 1020 12202 27039 33507 14154 19995 4714
27021 4714 -18469 -3949 15670 -4225 9659 10885 6225 9745 34290 40085 21438 -2430 -18568
27008 -18568 -40355 -33997 -13122 -8600 345 16043 34077 29948 41164 34824 21196 26534 58766
26995 58766 50150 39886 23837 4015 -12576 2481 -6892 -18942 1398 -3431 -8955 -21029
26983 -21029 -38665 -10627 12147 11293 -631 -1388 16310 38369 31906 13772 10709 18593 55222
26970 55222 56228 28930 12858 -13370 -17695 -22794 -22951 -27953 -23437 2100 -2069 -5856 20416
$$ packed form
27060D855m49J6603n837j6397l7111N908K3338K6844o459K3849p609j3928j6145
27047b538J0791J8412l55J9493j3736k2227k1408j3525j0587R552P920L279K7356
27034A2427J1685j1364j3470l2320j82K6115Q129J1182J4837O468j9353N841j5281
27021D714k3183J4520J9619j9895J3884J226m660L520K4545N795j8647k3868j6138
27008a8568k1787O358K0875M522Q945J5698J8034m129J1216o340j3628N338L2232
26995E8766q616j0264j6049j9822j6591J5057r373j2050K0340m829n524j2074
26983b1029j7636K8038K2774q54j1924p57J7698K2059o463j8134l063P884L6629
26970E5222J006k7298j6072k6228m325n099j57n002M516K5537m169l787K6272
$$ plain form
26957 20416 22662 25812 13070 -815 17896 12631 11468 11354 12605 10226 19753 15683 23870 31948
26943 31948 18567 -255 -18492 -26173 8114 33470 -14134 -42973 -10510 6736 3806 17139
26931 17139 24758 19320 19107 23584 36919 73374 65117 19754 9505 34210 14957 -6796 -20674
26918 -20674 -9087 4525 12613 -2581 -8077 2650 -19660 -17153 -671 10406 22048 44883
26906 44883 30339 543 17918 32722 11567 8038 -1927 -11482 -9532 -26433 -46120 -45280 -4682
26893 -4682 8582 -6379 -30241 -10976 8632 36997 31548 31128 32486 27861 25335 18096 7407
26880 7407 8696 30138 40441 32204 18446 20455 3679 3456 -10249 -9886 5868 8173 -1706 -2257
26866 -2257 -13726 -7580 18099 35536 24313 19759 11430 1753 -2944 5207 15226 37975 46452
$$ packed form
26957B0416K246L150j2742j3885J8711n265j163j14J251k379R527m070Q187Q078
26943C1948j3381j8822j8237p681L4287K5356m7604k8839L2463J7246k930J3333
26931A7139P619n438k13M477J3335L6455q257m5363j0249K4705j9253k1753j3878
26918b0674J1587J3612Q088j5194n496J0727k2310K507J6482J1077J1642K2835
26906D4883j4544k9796J7375J4804k1155l529r965r555J950j6901j9687Q40M0598
26893d682J3264j4961k3862J9265J9608K8365n449m20J358m625k526p239j0689
26880G407J289K1442J0303q237j3758K009j6776k23j3705L63J5754K305r879n51
26866b257j1469O146K5679J7437j1223m554q329r677m697Q151J0019K2749Q477
$$ plain form
26853 46452 21909 10167 11109 -3313 -19761 -16107 10577 31214 43407 28275 -24618 -22026
26841 -22026 2603 16450 15711 1052 18967 49501 61687 51268 53863 54590 41982 9111 13683
26828 13683 -8690 -5711 -4053 -16420 -22341 -8935 -9791 -4379 -20341 -45519 -27478 6446 -4060
26815 -4060 -9155 -7330 -12919 -4049 -6907 -13069 -17860 -11041 5616 28623 27553 44523 59456 66243
26801 66243 44499 7988 -6906 6478 -16753 -35194 -28062 -17603 -12119 -13181 -44933 -39959
26789 -39959 -31844 -40277 -31355 -24345 -8713 -8295 10462 13484 17107 23248 30598 68688 82247 65264
26775 65264 29683 13292 10733 10942 15012 2765 5013 21851 37689 5714 -1797 12247 -2870
26762 -2870 12499 421 22463 18621 -11821 -25604 -40817 -38856 -21750 -17044 -35121 -36551 -22885
$$ packed form
26853D6452k4543j1742R42j4422j6448L654K6684K0637J2193j5132n2893K592
26841b2026K4629J3847p39j4659J7915L0534J2186j0419K595P27j2608l2871M572
26828A3683k2373K979J658j2367n921J3406q56N412j5962k5178J8041L3924j0506
26815d060n095J825n589Q870k858o162m791O819J6657K3007j070J6970J4933O787
26801F6243k1744l6511j4894J3384k3231j8441P132J0459N484j062l1752M974
26789c9959Q115q433Q922P010J5632M18J8757L022L623O141P350L8090J3559j6983
26775F5264l5581j6391k559K09M070j2247K248J6838J5838l1975p511J4044j5117
26762b870J5369j2078K2042l842l0442j3783j5213J961J7106M706j8077j430J3666
$$ plain form
26749 -22885 -7629 2404 -32734 -32055 -16327 -3618 16639 7171 1712 -8822 -3148 11986 24645
26736 24645 35476 60502 61755 43532 45853 30196 18987 1001 -3304 121 -13163 -26004
26724 -26004 -17382 -22250 -1637 -10174 -19316 -27625 -18322 1000 -14150 -48415 -20832 21970 11595
26711 11595 -4193 -27186 -35455 -9068 994 -5098 -20289 5086 -18317 -31796 -31183 -27310 -17344
26698 -17344 -49683 -63956 -67588 -64377 -49450 -24316 -37583 -29481 -19956 -2270 11704 -6318
26686 -6318 -31872 -37100 -15022 -573 -14540 -20596 -12083 8171 14429 8493 9747 4700 20389
26673 20389 24003 27428 27783 20935 15813 -10925 -26391 -1789 40778 46512 68032 70973 74077
26660 74077 53038 22858 26226 19367 19430 34733 25056 19208 17693 12274 14356 26338 38203 45167
$$ packed form
26749b2885J5256J0033l5138O79J5728J2709K0257r468n459j0534N674J5134J2659
26736B4645J0831K5026J253j8223K321j5657j1209j7986m305L425j3284j2841
26724b6004Q622m868K0613q537r142q309R303J9322j5150l4265K7583M2802j0375
26711A1595j5788k2993q269K6387J0062o092j5191K5375k3403j3479O13L873R966
26698a7344l2339j4273l632L211J4927K5134j3267Q102R525J7686J3974j8022
26686f318k5554n228K2078J4449j3967o056Q513K0254O258n936J254n047J5689
26673B0389L614L425L55o848n122k6738j5466K4602M2567N734K1520K941L104
26660G4077k1039l0180L368o859O3J5303r677n848j515n419K082J1982J1865O964
$$ plain form
26646 45167 32016 16090 15584 -3574 -29332 -32499 -45731 -42722 -37178 1833 25861 19060 -13479
26633 -13479 -33491 -10512 -26308 -42536 -48342 -35033 -24973 7220 22277 9115 23744 13341
26621 13341 10104 18684 8295 2311 8881 20397 47577 64211 52304 42167 36097 30996 30755
26608 30755 23807 8963 -6643 -9361 -9907 6120 4853 8553 -7039 3014 32939 34096 40921
26595 40921 49520 36408 37502 4767 -37019 -50251 -41512 -12243 -27591 -21214 -21859 -15975 -10137
26582 -10137 -7374 -1460 30879 2516 -8648 -15963 -12412 -3604 18258 12570 -20873 -49305 -22597
26569 -22597 -16515 -55803 -20427 -26882 -8306 4850 -787 4302 2997 8020 8904 13271 16264 19454
26555 19454 18463 42954 57388 23991 31373 33687 -3543 9937 30131 283 -18398 -10070 -7871
$$ packed form
26646D5167j3151j5926n06j9158k5758l167j3232L009N544L9011K4028o801l2539
26633a3479k0012K2979j5796j6228n806J3309J0060L2193J5057j3162J4629j0403
26621A3341l237Q580j0389n984O570J1516K7180J6634j1907j0137o070n101k41
26608C0755o948j4844j5606k718n46J6027j267L700j5592J0053K9925J157O825
26595D0921Q599j3112J094l2735m1786j3232Q739K9269j5348O377o45N884N838
26582a0137K763N914L2339k8363j1164p315L551Q808K1862n688l3443k8432K6708
26569b2597O082l9288L5376o455J8576J3156n637N089j305N023Q84M367K993L190
26555A9454r91K4491J4434l3397P382K314l7230J3480K0194k9848j8681Q328K199
$$ plain form
26542 -7871 19588 27460 14727 -8402 -16071 9586 17147 27107 32302 31600 -2051 -5923 -12651 -48861
26528 -48861 -51596 -28056 939 6871 13416 -1301 -13950 -13653 14036 37497 30062 17562 8438
26515 8438 -6384 2050 17994 13711 4168 15727 4252 372 -10038 -3860 966 -7520 14977
26502 14977 35524 38821 40173 27122 -11374 -41845 -24868 -11024 7960 11759 9133 11165 22871
26489 22871 13965 -5436 -25878 -8826 23652 42376 44544 28623 6123 7286 30981 26871
26477 26871 -10411 -35493 -25819 13490 9732 1903 19886 39453 53087 54455 45092 -559 -35226
26464 -35226 -51934 -45722 -22839 -27477 -29713 -15714 -11504 -24001 -20187 6996 31124 64031 88081
26451 88081 55590 51627 54296 -2229 -8631 5044 15225 -2232 7073 40095 58749 27944
$$ packed form
26542g871K7459P872j2733k3129p669K5657P561R960N195p02l3651l872o728l6210
26528d8861k735K3540K8995N932O545j4717j2649K97K7689K3461p435j2500r124
26515H438j4822Q434J5944m283r543J1559j1475l880j0410O178M826q486K2497
26502A4977K0547L297J352j3051l8496l0471J6977J3844J8984L799k626K032J1706
26489B2871q906j9401k0442J7052L2478J8724K168j5921k2500J163K3695m110
26477B6871l7282k5082R674L9309l758p829J7983J9567J3634J368r363m5651l4667
26464c5226j6708O212K2883m638k236J3999M210j2497L814K7183K4128L2907K4050
26451H8081l2491l963K669n6525o402J3675J0181j7457R305L3022J8654l0805
$$ plain form
26439 27944 9343 4235 -4342 -3052 15499 22565 16098 3185 6702 2399 -2239 -6664 -11650 -23467
26425 -23467 1253 -3421 -14015 -3816 -2713 16012 -2913 -11795 3064 25434 35966 41341
26413 41341 20204 6662 22656 7960 12248 -1755 -18333 -8823 19851 21161 -13 -8965
26401 -8965 -19402 -14747 -13025 -26700 -31998 -27336 1675 9846 13109 -1454 -7058 2921 1780 -17480
26387 -17480 -15681 20304 14025 7922 -3239 -24027 -28888 -20845 -13606 -12238 -7349 8759 1782
26374 1782 19076 39354 20798 42240 36010 19991 45535 53245 33137 5692 -15206 -7616
26362 -7616 -31347 -29805 -39951 -54481 -57864 -57254 -69306 -77437 -47024 -11334 8738 14717 20334
26349 20334 -8194 -21150 -6813 4459 -17152 -39438 -33472 -16860 587 7823 2995 -1862
$$ packed form
26439B7944j8601n108q577J290J8551P066o467j2913L517m303m638m425m986j1817
26425b3467K4720m674j0594J0199J103J8725j8925q882J4859K2370J0532N375
26413D1341k1137j3542J5994j4696M288j4003j6578R510K8674J310k1174q952
26401h965j0437M655J722j3675n298M662K9011Q171L263j4563n604R979j141j9260
26387a7480J799L5985o279o103j1161k0788m861Q043P239J368M889J6108o977
26374A782J7294K0278j8556K1442o230j6019K5544P710k0108k7445k0898P590
26362g616k3731J542j0146j4530l383O10j2052q131L0413L5690K0072N979N617
26349B0334k8528j2956J4337J1272k1611k2286N966J6612J7447P236m828m857
$$ plain form
26337 -1862 -20681 -35188 -14490 -22368 -22660 -25829 -9435 -29003 -40899 -38287 -15945 23651 17254
26324 17254 6291 29143 22903 23338 21926 3759 1110 7669 -19878 -40584 -46926 -19098 -26554
26311 -26554 -30881 -27471 -54086 -36730 -6563 -8276 -24673 -25238 -5986 18063 11797 325 -11821
26298 -11821 -22286 -9097 20760 15908 17313 9374 18527 3243 -18938 -12794 -26186 -35468 -31149
26285 -31149 -12078 16504 25841 -3236 -14175 9333 36349 28377 14092 30813 55589 43007
26273 43007 24971 40072 14672 -767 -18303 -36276 -25030 6911 -4982 -18028 -20655 -15238
26261 -15238 -33874 -41498 -4167 9026 3925 -10588 7528 15730 4514 32424 40051 26745
26249 26745 15890 31041 41388 17074 -20372 -43201 -21729 -4788 5850 -22357 -16075 11885
$$ packed form
26337a862j8819j4507K0698p878k92l169J6394j9568j1896K612K2342L9596o397
26324A7254j0963K2852o240M35j412j8167k649O559k7547k0706o342K7828p456
26311b6554m327L410k6615J7356L0167j713j6397n65J9252K4049o266j1472j2146
26298a1821j0465J3189K9857m852J405p939R153j5284k2181O144j3392r282M319
26285c1149J9071K8582R337k9077j0939K3508K7016p972j4285J6721K4776j2582
26273D3007j8036J5101k5400j5439j7536j7973J1246L1941j1893j3046k627N417
26261a5238j8636p624L7331J3193n101j4513J8116Q202j1216K7910P627j3306
26249B6745j0855J5151J0347k4314l7446k2829K1472J6941J0638k8207O282K7960
$$ plain form
26237 11885 12042 995 20778 40058 18128 9043 3332 16321 17310 17194 20571 15316 17208 23328
26223 23328 -6710 1312 -11494 -24671 -16476 -11422 9530 10305 25054 53956 53075 16802 -3698
26210 -3698 -27160 -28243 -25669 -14414 -17642 -32450 -51419 -50261 -34666 -28416 -17115 -16668 33560
26197 33560 60423 47554 33221 34825 28788 4647 -16258 -22094 -403 19674 37027 41390
26185 41390 6393 11968 16929 4463 2149 -12789 -22331 -6110 -9496 12096 5852 -16299 -42566
26172 -42566 -55778 -34884 -10400 1786 3190 -20905 -18394 2559 19467 24222 1530 -10864
26160 -10864 1053 7897 12198 6083 25565 37386 29494 50398 41606 25186 15245 27689 29536
26147 29536 3024 -26053 -46723 -46582 -14483 10871 -741 -10700 -10934 -22678 -10340 10380 -3901
$$ packed form
26237A1885J57j1047J9783J9280k1930r085n711J2989R89j16L377n255J892O120
26223B3328l0038Q022j2806j3177Q195N054K0952P75J4749K8902q81l6273k0500
26210c698k3462j083K574J1255l228j4808j8969J158J5595O250J1301M47N0228
26197C3560K6863j2869j4333J604o037k4141k0905n836K1691K0077J7353M363
26185D1390l4997N575M961j2466k314j4938r542J6221l386K1592o244k2151k6267
26172d2566j3212K0894K4484J2186J404k4095K511K0953J6908M755k2692j2394
26160a0864J1917O844M301o115J9482J1821p892K0904q792j6420r941J2444J847
26147B9536k6512k9077k0670J41L2099K5354j1612r959k34j1744J2338K0720j4281
$$ plain form
26134 -3901 -8588 12365 1768 -24893 -17501 -29905 -54387 -58886 -54222 -37894 -24931 -12363 -35547
26121 -35547 -23178 -12886 10759 17960 -22630 -14915 299 -6396 17186 18097 14641 15522 33242
26108 33242 46071 50294 30155 12648 -3224 10228 10562 9337 -19903 -39740 -31124 -29765 -31468
26095 -31468 -16643 -52385 -88393 -67531 -69921 -51821 -32236 -58509 -58674 -24445 49 15257
26083 15257 47583 49393 34073 15320 -3172 30422 60173 53228 11343 -16706 -11877 -17103
26071 -17103 -30134 -29700 -36438 -33399 -32222 -31106 -15046 -1815 2632 -3815 -14047 -10484 1511
26058 1511 -1459 -28126 -36134 -21455 -34190 -46646 -32954 -20163 -10433 -2772 30024 28129 46466
26045 46466 40900 13431 -19657 -50871 -66467 -33937 -6119 46536 41414 31149 20040 -6576
$$ packed form
26134c901m687K0953j0597k6661P392j2404k4482m499M664J6328J2963J2568k3184
26121c5547J2369J0292K3645P201m0590P715J5214o695K3582R11l456Q81J7720
26108C3242J2829M223k0139j7507j5872J3452L34j225k9240j9837Q616J359j703
26095c1468J4825l5742l6008K0862k390J8100J9585k6273j65L4229K4494J5208
26083A5257L2326J810j5320j8753j8492L3594K9751o945m1885k8049M829n226
26071a7103j3031M34o738L039J177J116J6060J3231M447o447j0232L563J1995
26058A511k970k6667q008J4679j2735j2456J3692J2791R730P661L2796j895J8337
26045D6466n566k7469l3088l1214j5596L2530K7818N2655n122j0265j1109k6616
$$ plain form
26033 -6576 -31654 2483 3970 17059 4539 -26595 -22587 -14430 -8523 11833 7117 28967 33904
26020 33904 39467 1473 -38488 -6903 -489 -3835 8586 22986 12258 2804 24397 36910
26008 36910 26680 23660 19649 21085 27669 47150 55127 29219 1093 2420 201 2055 -10260
25995 -10260 -15222 -32169 -6445 -313 -27785 -28942 23602 29701 3512 -4914 11663 46671 27517
25982 27517 20640 20316 14387 39156 12363 -22693 -45595 -61824 -67976 -74835 -55581 -55797 -27117
25969 -27117 -33768 -37612 -32779 -16479 17450 6647 -26776 -53017 -26895 13036 8804 -20798
25957 -20798 -35398 -9531 -9248 -21049 -28622 -4074 41182 55903 39841 22039 17864 6314
25945 6314 5953 19430 6313 -22060 -23498 -23735 -12770 6551 8476 2109 -7642 -11874 -17968 -53211
$$ packed form
26033f576k5078L4137J487J3089j2520l1134M008Q157N907K0356m716K1850M937
26020C3904N563l7994l9961L1585O414l346J2421J4400j0728r454K1593J2513
26008C6910j0230l020m011J436O584J9481P977k5908k8126J327k219J854j2315
25995a0260m962j6947K5724O132k7472j157N2544O099k6189q426J6577L5008j9154
25982B7517o877l24n929K4769k6793l5056k2902j6229o152o859J9254k16K8680
25969b7117o651l844M833J6300L3929j0803l3423k6241K6122L9931m232k9602
25957b0798j4600K5867K83j1801p573K4548M5256J4721j6062j7802m175j1550
25945F314l61J3477j3117k8373j438k37J0965J9321J925o367r751m232o094l5243
$$ plain form
25931 -53211 -69911 -53251 -44286 -22439 1209 19269 239 -17677 -36537 -9541 7111 -6100
25919 -6100 -1514 -4410 -18259 -26681 -30878 -27568 -21612 -15926 -22108 -5462 1593 -10004 -29869 -37880
25905 -37880 -36677 7818 13169 -16201 -9048 807 -35187 -60577 -30144 -23381 -23321 -13875 -719
25892 -719 31874 55624 51879 16284 -18497 -11087 5442 4369 15533 2259 -27181 -52948 -23738
25879 -23738 -19047 -35404 -61293 -54539 -29874 -5226 13903 31035 36927 32217 13799 3030
25867 3030 -1258 -23746 -19301 -23939 -11165 3483 -21470 -29449 284 -14571 -20316 -26102 -43422
25854 -43422 -33936 -29424 -45561 -39543 -24984 -16366 -32782 -31839 -13984 -1824 6903 -17437 -25694
25841 -25694 -34409 -40964 -24005 9984 16838 2156 -7640 3092 9938 -1178 6922 -17365 -16246
$$ packed form
25931e3211j6700J6660Q965K1847K3648J8060j9030j7916j8860K6996J6652j3211
25919f100M586k896j3849q422m197L310N956N686o182J6646P055j1597j9865q011
25905c7880J203M4495N351k9370P153R855l5994k5390L0433O763O0R446J3156
25892g19L2593K3750l745l5595l4781P410J6529j073J1164j3274k9440k5767K9210
25879b3738M691j6357k5889O754K4665K4648J9129J7132N892m710j8418j0769
25867C030m288k2488M445m638J2774J4648k4953p979K9733j4855n745n786j7320
25854d3422R486M512j6137O018J4559Q618j6416R43J7855J2160Q727k4340q257
25841b5694q715o555J6959L3989O854j4682r796J0732O846j1116Q100k4287J119
$$ plain form
25828 -16246 -7796 3304 23834 33503 16523 9089 13235 -3508 -15574 -14304 -9553 -2488 9336
25815 9336 3912 10217 10278 4104 -7517 -12522 -31161 2193 31604 10665 6055 10673 10981 6344
25801 6344 1772 21896 35969 30360 29512 35951 38977 5144 -5188 11791 46268 34862 15940
25788 15940 17617 17585 27784 36626 28726 1847 -14393 -23533 -22686 -19518 -25778 -27510 -6244 4427
25774 4427 -23398 -49345 -37259 -36268 -61792 -46404 -36168 -47182 -38769 -26938 -36891 -24288 -5473
25761 -5473 7567 17328 49284 33743 10731 -1957 -1908 -4637 -16543 -23243 -7200 -10371 -10250 -2777
25747 -2777 -26735 -40393 -34414 142 -21261 -39947 -34026 -56851 -28718 -40624 -52068 -63764
25735 -63764 -62679 -50579 -30130 -21945 -42281 -44316 -15910 -1527 21406 9655 28569 34127
$$ packed form
25828a6246Q450J1100K0530R669j6980p434M146j6743j2066J270M751P065J1824
25815I336n424O305O1o174j1621n005j8639L3354K9411k0939m610M618L08m637
25801F344m572K0124J4073n609q48O439L026l3833j0332J6979L4477j1406j8922
25788A5940J677l2J0199Q842p900k6879j6240r140Q47L168o260j732K1266J0671
25774D427k7825k5947J2086R91k5524J5388J0236j1014Q413J1831r953J2603J8815
25761e473J3040R761L1956j5541k3012j2688M9k729j1906o700J6043l171J21P473
25747b777k3958j3658N979L4556k1403j8686N921k2825K8133j1906j1444j1696
25735f3764J085J2100K0449Q185k0336k035K8406J4383K2933j1751J8914N558
$$ plain form
25723 34127 39230 47659 43080 40662 15068 3597 25060 1654 -8252 -8987 -12906 21557 29613
25710 29613 16222 1283 -16296 -16908 -36131 -39084 -32966 -9794 -11297 -15668 5203 10569 4385
25697 4385 -20950 -13452 16289 32610 14279 21004 16497 -15856 13766 45683 48155 31686 -2692
25684 -2692 -7530 -14485 -20603 -35469 -26698 10496 21599 19855 19442 7191 28553 62472 55893
25671 55893 32014 15195 23370 11067 12353 -7730 -39468 -30990 -39855 -29991 -6109 9501 15998
25658 15998 -8113 1291 12282 12957 -11622 -36762 -33642 -36213 -34228 -55163 -69013 -32871 -34350
25645 -34350 -50885 -29025 -9637 -32887 -54742 -47536 -53606 -73402 -49511 -18450 -20263 -29884
25633 -29884 -47180 -78127 -77487 -62690 -30959 -4030 -22578 -52450 -61235 -59609 -35366 2245
$$ packed form
25723C4127N103Q429m579k418k5594j1471K1463k3406r906p35l919L4463Q056
25710B9613j3391j4939j7579o12j9223k953O118K3172j503m371K0871N366o184
25697D385k5335P498K9741J6321j8331O725m507l2353K9622L1917K472j6469l4378
25684b692m838o955o118j4866Q771L7194J1103j744m13j2251K1362L3919o579
25671E5893k3879j6819Q175j2303J286k0083l1738Q478q865R864K3882J5610O497
25658A5998k4111R404J0991O75k4579k5140L120k571J985k0935j3850L6142j479
25645c4350j6535K1860J9388k3250k1855P206o070j9796K3891L1061j813r621
25633b9884j7296l0947O40J4797L1731K6929j8548k9872q785J626K4243L7611
$$ plain form
25621 2245 9385 -6484 -30582 -33186 -30432 -21746 -6490 9940 9303 3953 -12653 -12952 -18581 -133
25607 -133 -10788 -27010 -19755 -8020 7361 1443 1424 -1761 -6894 -2397 919 -9970 -18994 -35398
25593 -35398 -39625 -9622 7470 -28518 -26384 -26402 -14057 2759 131 -12840 -10288 -14500 6694
25580 6694 15219 981 31312 28074 5568 -10214 -22530 -9591 33403 8782 -31761 -56527
25568 -56527 -44619 -28752 -7300 4341 -4357 -6600 -14885 -27131 -47727 -32775 -19770 -20788
25556 -20788 -23518 -6319 1838 -1960 -15767 -17035 10983 12210 10084 -247 5255 -15599 -49135
25543 -49135 -22851 -41256 -49067 -31483 8524 48334 52934 41667 46680 -2134 -31048 -19249
25531 -19249 -16802 6866 8246 19395 27942 17229 22321 26210 36336 43406 46649 43115 56529
$$ packed form
25621B245P140j5869k4098k604K754Q686J5256J6430o37n350j6606k99n629J8448
25607a33j0655j6222P255J1735J5381n918j9l185n133M497L316j0889r024j6404
25593c5398m227L0003J7092l5988K134j8J2345J6816k628j2971K552m212K1194
25580F694Q525j4238L0331l238k2506j5782j2316J2939M2994k4621m0543k4766
25568e6527J1908J5867K1452J1641q698k243q285j2246k0596J4952J3005j018
25556b0788k730J7199Q157l798j3807j268K8018J227k126j0331N502k0854l3536
25543d9135K6284j8405p811J7584M0007L9810M600j1267N013m8814k8914J1799
25531a9249K447K3668J380J1149Q547j0713N092L889J0126P070L243l534J3414
$$ plain form
25518 56529 47169 34671 15974 -61 17751 25375 24730 -1594 -4155 5805 20395 20684 6537
25505 6537 -486 3609 -44911 -81167 -39178 -9562 -28353 -32056 -26158 11457 24052 24597 34535
25492 34535 48612 42125 31289 45235 38159 9275 -27429 -24813 -34934 -30105 -10281 12215
25480 12215 32438 29069 4740 -8998 -20271 -40726 -48250 -30538 -4621 7411 19915 13804
25468 13804 19903 -5590 -18534 -10830 1238 -8930 -10219 -8524 138 5160 11375 11959 24258
25455 24258 19498 4593 8041 9981 -4716 -45000 -72092 -31415 -14840 -13341 -9612 1313 27323
25442 27323 55488 56851 45388 22554 -6287 -12551 9034 39141 38652 37657 27890 -3712 -20822
25429 -20822 -12444 -18097 -2092 6667 -6192 -14023 -17857 -17523 -6027 -16425 -45987 -61622 -27655
$$ packed form
25518E6529r360j2498j8697j6035J7812P624o45k6324k561R960J4590K89j4147
25505F537p023M095m8520l6256M1989K9616j8791l703N898L7615J2595N45R938
25492C4535J4077o487j0836J3946p076k8884l6704K616j0121M829J9824K2496
25480A2215K0223l369k4329j3738j1273k0455p524J7712K5917J2032J2504o111
25468A3804O099k5493j2944P704J2068j0168j289J695Q662N022O215N84J2299
25455B4258m760j4905L448J940j4697m0284k7092M0677J6575J499L729J0925K6010
25442B7323K8165J363j1463k2834k8841o264K1585L0107m89r95r767l1602j7110
25429b0822Q378n653J6005Q759j2859p831l834L34J1496j0398k9562j5635L3967
$$ plain form
25416 -27655 -3889 12208 17105 14096 -6894 3284 25455 26754 6841 -640 1874 5418 11775
25403 11775 -3702 1335 -20078 -37195 -11055 -11963 -25263 -25005 -23519 -35217 -29171 -28836 -10553
25390 -10553 16002 937 10494 30733 48293 20821 -6390 4339 -26515 -48439 -44340 -27879
25378 -27879 -7940 199 17597 18375 -25272 -44509 -19540 -4942 8370 35831 31190 12742
25366 12742 -1997 10597 12906 20752 17770 25654 23802 1869 -11053 6404 14512 17592 21285
25353 21285 -215 -1323 15039 39293 34760 15954 10351 102 -1483 -7751 -1319 -5543 -12996
25340 -12996 -3187 -110 -17587 -43820 -55512 -40621 -42478 -49753 -20501 16170 27898 -1244
25328 -1244 -19965 -34134 -19770 -17326 -1409 -3937 3576 -19911 -30711 -23087 -23124 -27213 -2082
$$ packed form
25416b7655K3766J6097M897l009k0990J0178K2171J299j9913p481K514L544O357
25403A1775j5477N037k1413j7117K6140r08j3300K58J486j1698O046L35J8283
25390a0553K6555j5065R557K0239J7560k7472k7211J0729l0854k1924M099J6461
25378b7879J9939Q139J7398P78m3647j9237K4969J4598J3312K7461m641j8448
25366A2742j4739J2594K309P846k982P884j852k1933j2922J7457Q108L080L693
25353B1285k1500j108J6362K4254m533j8806n603j0249j585o268O432m224p453
25340a2996R809L077j7477k6233j1692J4891j857p275K9252L6671J1728k9142
25328a244j8721j4169J4364K444J5917k528P513k3487j0800P624l7m089K5131
$$ plain form
25315 -2082 9406 3976 15687 27047 44980 40762 13488 11996 13553 -212 -32516 -35835 -6460
25302 -6460 -213 6299 -4528 -2418 17993 22758 -5102 -29706 -15956 -14443 -21860 -16009 -23115
25289 -23115 -28115 -828 -5625 -11169 645 4025 25399 24173 51678 68330 59502 38443 9081
25276 9081 -12294 2908 -4892 -14096 -14376 -22815 -24338 -29641 -36202 -29296 -33480 -46687 -51243 -46086
25262 -46086 -22117 -942 1263 4770 27441 23170 13117 10738 6537 -1293 -4832 -18175 -13151
25249 -13151 -4507 8723 14585 11558 -2251 -1019 15234 22546 24925 47901 20823 -3580 21616
25236 21616 38844 11817 -23932 -32798 1964 3408 1109 -16191 -22395 5429 11327 15118 -7929
25223 -7929 -6166 -4546 -3964 13228 28048 25676 41400 26382 11585 3895 15513 13279 7697
$$ packed form
25315b082J1488n430J1711J1360J7933m218k7274j492J557j3765l2304l319K9375
25302f460O247O512j0827K110K0411M765k7860k4604J3750J513p417N851p106
25289b3115n000K7287m797n544J1814L380K1374j226K7505J6652q828k1059k9362
25276I081k1375J5202p800r204k80q439j523n303o561O906m184j3207m556N157
25262d6086K3969K1175K205L507K2671m271j0053k379m201p830l539j3343N024
25249a3151Q644J3230N862l027j3809J232J6253P312K379K2976k7078k4403K5196
25236B1616J7228k7027l5749q866L4762J444k299j7300o204K7824N898L791k3047
25223g929J763J620N82J7192J4820k372J5724j5018j4797p690J1618k234n582
$$ plain form
25210 7697 -6653 -5981 -4352 -14792 -11937 -7661 8612 45419 16068 -29836 -27492 -14345 -14207
25197 -14207 -24400 -38955 -42498 -46023 -24716 10926 10960 12037 308 -40321 -36855 -28321 -9420
25184 -9420 10001 -18667 -52425 -45983 -19948 -7477 18790 11923 -12738 -8025 -26948 -40433
25172 -40433 -5154 36890 34466 12228 19774 41841 32409 18214 2239 -9963 13948 48310
25160 48310 55588 40764 21998 -6734 -16534 -13944 -3910 -24365 -57640 -27718 -11638 -8318
25148 -8318 -34874 -28982 -29333 -24900 -14148 581 -6687 10906 -27346 -41867 -26703 -25635 -5482
25135 -5482 -6771 -49639 -16341 17875 1845 -37215 -46113 -23539 -14631 -6137 -3668 13382 34380
25122 34380 -4841 -20216 -21122 4474 9551 1068 5960 17233 19503 29877 23827 42023 47583
$$ packed form
25210G697j4350O72J629j0440K855M276J6273L6807k9351m5904K344J3147J38
25197a4207j0193j4555l543l525K1307L5642L4J077j1729m0629L466Q534J8901
25184i420J9421k8668l3758O442K6035J2471K6267o867k4661M713j8923j3485
25172d0433L5279M2044k424k2238P546K2067r432j4195j5975j2202K3911L4362
25160D8310P278j4824j8766k8732r800K590J0034k0455l3275K9922J6080L320
25148h318k6556N892l51M433J0752J4729p268J7593l8252j4521J5164J068K0153
25135e482j289m2868L3298L4216j6030l9060q898K2574Q908Q494K469J7050K0998
25122C4380l9221j5375r06K5596N077q483M892J1273K270J0374o050J8196N560
$$ plain form
25109 47583 34574 32413 14871 -467 -20189 -42323 -37228 -23652 -16178 -38512 -41482 -35223 -29858
25096 -29858 -23554 -37638 -7870 5222 -7635 -13389 -28673 -28180 -45513 -47423 -52137 -40383 -27884
25083 -27884 -6995 -17539 -2708 11749 -9338 -36599 -22542 -23082 24173 34147 30698 20018
25071 20018 8874 12203 30284 25653 1202 -7707 -21323 -30327 10866 48058 48712 44700 870
25058 870 -19866 -27142 -43757 -28868 -22592 -38376 -36726 -21306 -35523 -11711 -16765 -12221 -11071
25045 -11071 -7962 -1313 21103 8116 -34718 -49880 -26163 -3453 10659 4342 6202 24214
25033 24214 49364 52952 65794 42163 20372 -4350 -24789 -14003 -18639 -32498 -23755 7650
25021 7650 35579 34287 15542 4421 -7361 -16338 -5145 -3416 -15741 -47079 -56912 -31011 -3660
$$ packed form
25109D7583j3009k161j7542j5338j9722k2134N095J3576P474k2334k970O259N365
25096b9858O304j4084K9768J3092j2857n754j5284M93j7333j910m714J1754J2499
25083b7884K0889j0544J4831J4457k1087k7261J4057n40M7255R974l449j0680
25071B0018j1144L329J8081m631k4451q909j3616r004M1193L7192O54m012m3830
25058H70k0736p276j6615J4889O276j5784J650J5420j4217K3812n054M544J150
25045a1071L109O649K2416j2987m2834j5162K3717K2710J4112o317J860J8012
25033B4214K5150L588J2842k3631k1791k4722k0439J0786m636j3859Q743L1405
25021G650K7929j292j8745j1121j1782q977J1193J729j2325l1338r833K5901K7351
$$ plain form
25008 -3660 -12300 -7884 2187 -12896 -10002 -15023 -17246 -46280 -49742 -53594 -37315 -33184 -44765
24995 -44765 -29142 -26828 -21383 -1491 11663 -32679 -37332 -15365 -8471 16174 15844 -1932 -28531
24982 -28531 -46520 -24031 -15765 -3347 5495 -18707 8367 19045 2056 7466 -18079 -28158
24970 -28158 -41752 -45709 -20991 -23345 -19153 -12390 -14625 -33659 -30784 -25171 -12964 -8707 -28539
24957 -28539 -11517 13125 27008 31097 11373 13256 -7806 -43604 -35524 -31617 -20715 -4920
24945 -4920 -17120 -35262 -33703 -33046 -24067 -25300 -16060 4800 26166 27514 -3326 2563 -19299
24932 -19299 -8307 11967 -4273 -27565 -31162 -25398 -15138 -5546 7955 35765 35333 27225 10466
24919 10466 -9073 960 4064 -29578 -16534 33278 38961 32613 18443 10841 -3632 5354 6306
$$ packed form
25008c660q640M416J0071j5083K894n021k223k9034l462l852J6279M131j1581
24995d4765J5623K314N445J9892J3154m4342m653K1967O894K4645l30j7776k6599
24982b8531j7989K2489Q266J2418Q842k4202K7074J0678j6989N410k5545j0079
24970b8158j3594l957K4718k354M192O763k235j9034K875N613J2207M257j9832
24957b8539J7022K4642J3883M089j9724J883k1062l5798Q080L907J0902J5795
24945d920j2200j8142J559O57Q979j233R240K0860K1366J348l0840N889k1862
24932a9299J0992K0274j6240k3292l597N764J0260R592J3501K7810m32q108j6759
24919A0466j9539J0033L104l3642J3044M9812N683o348j4170p602j4473Q986R52
$$ plain form
24906 6306 13748 885 -16259 4859 5131 17116 17533 5924 18477 6323 -7530 -8385 -466
24893 -466 -12569 -14477 -14755 -13452 -23542 -34645 -10716 -2748 -25110 -48056 -21016 26180 19381
24880 19381 -11197 -4530 14283 9653 27704 13347 -19709 -8773 244 8860 10194 -20614 -4041
24867 -4041 10083 10822 5068 -1728 13171 32796 21521 101 -13653 -10683 -38548 -31263 14598
24854 14598 17384 -4133 13781 36544 26470 31448 34397 40834 17213 -14931 -31653 -21668 -31077
24841 -31077 -37333 -355 -2473 -15077 2634 -404 -318 215 -4335 -11501 3929 36016 42549 15465
24827 15465 -4023 -5068 -7842 -12894 -8271 23693 24024 2820 5612 13242 -6998 -16755 8086
24814 8086 26593 55195 42588 35307 22522 18102 17743 22365 3695 -12503 -10119 14862 16765
$$ packed form
24906F306P442j2863j7144K1118K72J1985M17j1609J2553j2154j3853q55P919
24893d66j2103j908k78J303j0090j1103K3929P968k2362k2946K7040M7196o799
24880A9381l0578O667J8813m630J8051j4357l3056J0936R017Q616J334l0808J6573
24867d041J4124P39n754o796J4899J9625j1275k1420j3754K970k7865P285M5861
24854A4598K786k1517J7914K2763j0074M978K949O437k3621l2144j6722R985r409
24841c1077o256L6978k118j2604J7711l038Q6N33m550p166J5430L2087O533k7084
24827A5465j9488j045k774n052M623L1964L31k1204K792P630k0240r757K4841
24814H086J8507K8602j2607p281j2785m420l59M622j8670j6198K384K4981J903
$$ plain form
24801 16765 9815 41133 32548 21305 4859 -27337 -37448 -34634 -10575 -4300 -5324 -4008 1057
24788 1057 -9347 -38148 -42478 -33558 -35583 -19124 -13099 -11375 -11131 5688 -91 -2782 26238 23043
24774 23043 5393 -21674 -16294 -21447 -47715 -52515 -27193 -1041 4391 9334 -21491 -37677 -39282
24761 -39282 -12384 6502 25890 33402 4172 -43273 -42369 -37895 -43732 -14969 9280 7212 -7577
24748 -7577 5577 -22561 -18351 -4242 -4593 1487 -1283 -14864 -11939 19571 32679 33401 23871 9717
24734 9717 8761 -1592 -28246 -48663 -48489 -34153 -6861 -22005 -29708 4224 -8232 -15468 -25007
24721 -25007 -43627 -12656 7375 25800 21271 7719 40187 64848 33797 4065 705 7653
24709 7653 4515 -23323 -31127 -24566 -18351 18167 12299 1392 -12111 10843 7993 7951 1687 -10016
$$ packed form
24801A6765o950L1318q585j1243j6446l2196j0111K814K4059O275j024J316N065
24788A057j0404k8801m330Q920k025J6459O025J724K44J6819n779k691K9020l195
24774B3043j7650k7067N380n153k6268m800K5322K6152N432M943l0825j6186j605
24761c9282K6898J8886J9388P512k9230m7445R04M474n837K8763K4249k068j4789
24748g577J3154k8138M210J4109l51O080k770j3581K925L1510J3108P22r530j4154
24734I717r56j0353k6654k0417J74J4336K7292j5144p703L3932j2456p236r539
24721b5007j8620L0971K0031J8425m529j3552L2468K4661l1051k9732l360O948
24709G653l138k7838p804O561O215L6518n868j0907j3503K2954k850m2o264j1703
$$ plain form
24695 -10016 16825 13570 10742 16464 29089 39573 35142 48604 40323 175 -20119 -45210 -60513
24682 -60513 -50207 -9917 25159 15005 -20785 -45390 -39630 -26375 -15173 -1565 -17973 -18496
24670 -18496 -49454 -69920 -28484 3275 -6293 -20442 -23103 -4882 -13155 -44918 -53546 -52418 -52041
24657 -52041 -52038 -25883 226 -1154 -29940 -40383 -44771 -51742 -17745 -16071 -28199 -48400 -45550
24644 -45550 -29421 -23712 -25518 2497 9931 11518 -5434 2823 1374 -20837 -32121 -11066 8231
24631 8231 -6272 -25121 -17565 1267 26840 14982 1877 7531 -8099 -12974 -323 -24121
24619 -24121 -36971 -21761 -16575 -3538 -11581 -25512 -20051 -4374 -20982 -39014 -39308 -24958 -10658
24606 -10658 -11575 -19022 -29926 -8778 -12807 -15857 -12474 -28850 -64697 -64466 -24049 -9378 -7099
$$ packed form
24695a0016K6841l255k828N722J2625J0484m431J3462q281m0148k0294k5091j5303
24682f0513J0306M0290L5076j0154l5790k4605N760J3255J1202J3608j6408n23
24670a8496l0958k0466M1436L1759r568j4149k661J8221q273l1763q628J128L77
24657e2041LK6155K6109j380k8786j0443m388o971L3997J674j2128k0201K850
24644d5550J6129N709j806K8015P434J587j6952Q257j449k2211j1284K1055J9297
24631H231j4503j8849P556J8832K5573j1858j3105N654j5630m875J2651k3798
24619b4121j2850J5210N186J3037q043j3931N461J5677j6608j8032k94J4350J4300
24606a0658r17p447j0904K1148m029l050L383j6376l5847K31M0417J4671K279
$$ plain form
24593 -7099 -9622 -8606 -13598 -29313 -28125 -28646 698 6631 -15799 -25009 -34954 -24546 -11830 -6788
24579 -6788 -44805 -55939 -29807 893 -8744 -47937 -38699 2121 27769 11385 -3700 12579
24567 12579 -3654 -32315 -20623 -952 15985 -13868 -17662 -12160 -11344 -9327 -5915 17937 17729
24554 17729 28411 18120 -6177 -3179 -10856 -27403 -10711 -6498 -40133 -35897 -16098 -9888 -26419
24541 -26419 -5863 -5270 -16907 -10271 2987 -6628 -31505 -26799 -40914 -5653 1031 -21803 -21911
24528 -21911 -17596 -16167 -33830 -30241 -26168 -27260 -32722 -47864 -16754 40112 59964 15045 5938
24515 5938 -10456 -27348 -40207 -34025 -15346 -20335 -25681 -10076 -11493 -16067 -18393 -29446 -34533
24502 -34533 -33314 -20343 20512 7120 -6176 -1471 1054 -35847 -36440 -12463 4471 33826 25020
$$ packed form
24593g099k523J016m992j5715J188n21K9344N933k2430r210r945J0408J2716N042
24579f788l8017j1134K6132L0700r637l9193R238M0820K5648j6384j5085J6279
24567A2579j6233k8661J1692J9671J6937k9853l794N502Q16K017L412K3852k08
24554A7729J0682j0291k4297K998p677j6547J6692M213l3635M236J9799O210j6531
24541b6419K0556N93j1637O636J3258r615k4877M706j4115L5261O684k2834j08
24528b1911M315J429j7663L589M073j092n462j5142L1110N6866J9852m4919r107
24515E938j6394j6892j2859O182J8679m989n346J5605j417m574k326j1053n087
24502c4533J219J2971M0855j3392j3296M705K525l6901n93K3977J6934K9355q806
$$ plain form
24489 25020 5354 8507 24393 38804 19270 12181 1797 3807 8383 17422 -9846 -41932 -35142
24476 -35142 -32433 -62554 -63949 -30162 11533 13245 22810 28254 31886 17728 -18262 -28484 -19993
24463 -19993 10926 30801 21493 24530 14607 -2419 -17937 5387 24013 12156 491 17205
24451 17205 19686 30135 -232 -48331 -55052 -52557 -47538 -29859 -4357 10455 22612 15784 -2361
24438 -2361 -28827 -15831 -12783 -8106 26588 43759 49685 37234 35892 18961 33975 18393 7290
24425 7290 2902 -3942 25171 24478 -599 2085 2250 -3357 -14476 -32520 -47989 -47370 -39502 -3793
24411 -3793 11519 7444 5652 36004 4773 -31619 -38051 -11476 15097 30902 6861 -3125 21103
24398 21103 29594 22588 -22671 -29393 -26890 -3157 12878 -14090 -30448 -13533 -17586 -26515 -27803
$$ packed form
24489B5020j9666L153J5886J4411j9534p089j0384K010M576R039k7268l2086O790
24476c5142K709l0121j395L3787M1695J712R565N444L632j4158l5990j0222Q491
24463a9993L0919J9875r308L037r923j7026j5518K3324J8626j1857j1665J6714
24451A7205K481J0449l0367m8099o721K495N019J7679K5502J4812J2157o828j8145
24438b361k6466J2996L048M677L4694J7171N926j2451j342j6931J5014j5582j1103
24425G290m388o844K9113o93k5077K684J65n607j1119j8044j5469O19P868L5709
24411c793J5312m075j792L0352l1231l6392o432K6575K6573J5805k4041r986K4228
24398B1103Q491p006m5259o722K503K3733J6035k6968j6358J6915m053q929j288
$$ plain form
24385 -27803 -24155 -14301 -5631 -28864 -47404 -32697 -32190 -13313 -24661 -13854 -20510 -21616 -20454
24372 -20454 559 16234 -513 -28132 -13765 22821 45848 37422 20376 21127 19349 22329 11384
24359 11384 9825 -185 423 18411 52647 29617 6548 -25694 -24112 -21016 -32361 -3346 -2631
24346 -2631 -3095 -7316 -16309 -25241 -17191 -28374 -21003 5926 9070 9320 8724 37894 28604 48615
24332 48615 71927 60779 50017 32067 30477 34818 1638 -26276 -15084 -13156 -22600 -11391
24320 -11391 12188 7060 16890 8406 9387 -9781 -31041 -52214 -30435 -10307 -18350 -436 30675
24307 30675 28839 -12945 -18646 -12769 -17909 -22808 -28 -5563 -27870 -30342 -28072 -49352 -43081
24294 -43081 -8197 21679 12851 37976 28685 2677 -17649 -50514 -54549 -66386 -58713 -22565
$$ packed form
24385b7803L648R854Q670k3233j8540J4707N07J8877j1348J0807o656j106J162
24372b0454K1013J5675j6747k7619J4367L6586K3027q426j7046P51j778K980j0945
24359A1384j559j0010O08J7988L4236k3030k3069l2242J582L096j1345K9015P15
24346b631m64m221q993q932Q050j1183P371K6929L144K50n96K9170r290K0011
24332D8615K3312j1148j0762j7950j590M341l3180k7914J1192J928r444J1209
24320a1391K3579n128R830q484R81j9168k1260k1173K1779K0128q043J7914L1111
24307C0675j836m1784n701N877n140m899K2780n535k2307k472K270k1280O271
24294d3081L4884K9876q828K5125r291k6008k0326l2865m035j1837P673L6148
$$ plain form
24282 -22565 7450 3941 11987 11829 9786 9795 -16989 -12292 14576 -17700 -27585 12763 33312 22205
24268 22205 16352 12487 25253 20648 2099 -18609 -17651 5619 6835 -14614 -1471 -6294 6810
24255 6810 43384 47247 28795 52250 44035 42281 48485 71588 46287 4353 3866 23533 20888
24242 20888 28026 37358 37895 3211 -17117 -20980 -7907 4601 9812 5967 5536 13962 18862 11906
24228 11906 -2300 9046 10234 -13179 -7513 14003 43213 55145 54455 36954 30097 33046 32374
24215 32374 22175 16766 6080 8817 33033 16572 -11247 -31856 -28572 -42503 -25272 -5197
24203 -5197 -14749 -12595 -13887 -3980 -637 -11402 -32688 -49573 -41264 -29140 -24976 -27035 -40510
24190 -40510 -13714 -4640 -7725 15511 6949 -25056 -20959 -8965 14743 10288 -12356 -22303 -19271
$$ packed form
24282b2565L0015l509Q046j58k043Rk6784M697K6868l2276r885M0348K0549j1107
24268B2205n853l865J2766m605j8549k0708R58K3270J216k1449J3143m823J3104
24255F810L6574L863j8452K3455q215j754O204K3103k5301m1934m87J9667k645
24242B0888P138R332N37l4684k0328l863J3073J2508N211l845m31Q426M900o956
24228A1906j4206J1346J188k3413N666K1516K9210J1932o90j7501o857K949o72
24215C2374j0199n409j0686K737K4216j6461k7819k0609L284j3931J7231K0075
24203e197r552K154j292R907L343j0765k1286j6885Q309J2124M164k059j3475
24190d0510K6796R074l085K3236q562l2005M097J1994K3708m455k2644r947L032
$$ plain form
24177 -19271 -230 16979 -1592 -19520 -13164 -5790 -3077 -14146 -9769 35315 51902 27252
24165 27252 28282 13482 -9270 -8055 -13338 -16013 -10161 -4463 -2568 -1015 -8032 -16220 -4065 1976
24151 1976 -15053 -15528 13390 15052 7715 24044 22987 12229 18880 25986 25475 39142 33869 5107
24137 5107 30407 14621 -6105 -3254 -1902 -10538 -16549 -30530 -38710 -36135 -46273 -42204 -17671
24124 -17671 -19619 -32829 -11906 -4205 -15344 -11353 -13407 -1075 -7814 6812 6840 -4634 -30872
24111 -30872 -41106 -43948 -38987 -25179 -44381 -56283 -64686 -33528 -8281 -14840 -6244 -20100 -24571
24098 -24571 -26245 -31778 -17444 -20993 -32413 -29677 -22096 -2918 3966 -5228 -5958 -19096 -23072 -49985
24084 -49985 -62286 -25651 7960 -3455 -18801 -8605 14201 17145 24478 18672 29262 35958
$$ packed form
24177a9271J9041J7209j8571j7928O356P374K713j1069M377M5084J6587k4650
24165B7252J030j4800k2752J215n283k675N852N698J895J553p017q188J2155O041
24151A976j7029m75K8918J662p337J6329j057j0758O651P106n11J3667n273k8762
24137E107K5300j5786k0726K851J352q636o011j3981q180K575j0138M069K4533
24124a7671j948j3210K0923P701j1139L991k054J2332o739J4626K8j1474k6238
24111c0872j0234k842M961J3808j9202j1902q403L1158K5247o559Q596j3856m471
24098b4571j674n533J4334l549j1420K736P581J9178O884r194p30j3138l976k6913
24084d9985j2301L6635L3611j1415j5346J0196K2806K944P333n806J0590O696
$$ plain form
24072 35958 15720 8313 -14488 -21200 -6150 23849 25286 23413 -4218 -21357 -10253 22520
24060 22520 31597 38707 25202 2007 -4017 10290 43857 26377 26739 18691 -6974 -4455 -9121
24047 -9121 -17849 -30342 -54843 -38132 -31646 -11000 3532 1665 5263 -10407 -30040 -23103 -32657
24034 -32657 -28180 -23100 -8625 -17818 -17760 -232 11132 -4229 -12164 -12282 -15873 -25281 -53767 -45219
24020 -45219 -33998 -15379 8610 8499 17814 8425 -7834 -48071 -28165 -19937 -30612 -28947 -23474
24007 -23474 -10741 -20796 -21462 4046 17766 -8265 -3728 878 -22339 -55674 -88073 -54581
23995 -54581 -2960 5697 13897 12347 -5094 -6335 -10613 7609 19032 33115 -4994 -55120 -73406
23982 -73406 -55965 -16505 6557 8733 11635 29514 38108 44282 13590 -13448 -16263 -44221 -46114
$$ packed form
24072C5958k0238p407k2801o712J5050K9999J437j873k7631j7139J1104L2773
24060B2520R077P110j3505k3195o024J4307L3567j7480L62q048k5665K519m666
24047i121q728j2493k4501J6711O486K0646J4532j867L598j5670j9633O937r554
24034c2657M477N080J4475r193N8J7528J1364j5361p935j18l591r408k8486Q548
24020d5219J1221J8619K3989j11R315r389j6259m0237J9906Q228j0675J665N473
24007b3474J2733j0055o66K5508J3720k6031M537M606k3217l3335l2399L3492
23995e4581N1621Q657Q200j550j7441j241m278J8222J1423J4083l8109n0126j8286
23982g3406J7441L9460K3062K176K902J7879Q594O174l0692k7038k815k7958j893
$$ plain form
23969 -46114 -42627 -53605 -41094 -29401 -16873 838 -3087 -38779 -23926 -13867 -33416 -58491
23957 -58491 -58888 -44327 -19565 -4442 -7977 12968 12564 2893 -18735 -22790 -26784 -12308 -6050
23944 -6050 -10688 -24506 -26208 -32234 -32846 -25945 -6815 25877 243 -11265 -13269 -34913 -14009
23931 -14009 -20007 -26043 -14528 -8936 20623 46218 22095 8608 -48 -7831 -1906 -6558 17468
23918 17468 22585 18781 23299 27038 13380 -7697 6737 17202 27161 3797 12255 22029 36760
23905 36760 53556 29809 2891 4860 -6479 -11482 -31821 -33277 -29542 -34953 -45719 -49088 -22206
23892 -22206 -27044 -40105 -14260 4953 -7210 -21815 -3751 2276 -6198 -12098 -1512 4889 6628
23879 6628 -215 -6025 -12173 -2752 24132 24910 52987 62118 68623 60112 19863 -4149 10469 -10444
$$ packed form
23969d6114L487j0978J2511J1693J2528J7711l925l5692J4853J0059j9549k5075
23957e8491l97J4561K4762J5123l535K0945m04r671k1628m055l994J4476O258
23944f050m638j3818j702o026o12O901J9130L2692k5634j1508k004k1644K0904
23931a4009n998o036J1515N592K9559K5595k4123j3487q656p783N925m652K4026
23918A7468N117l804M518L739j3658k1077J4434J0465R959k3364Q458R774J4731
23905C6760J6796k3747k6918J969j1339n003k0339j456L735n411j0766l369K6882
23892b2206m838j3061K5845J9213j2163j4605J8064O027q474n900J0586O401J739
23879F628o843n810o148R421K6884P78K8077R131O505q511m0249k4012J4618k0913
$$ plain form
23865 -10444 -31601 -31299 -9580 36620 65107 48186 25290 1461 996 18484 23799 4884 -11612
23852 -11612 -778 -14933 -11818 1670 -10909 1407 1060 -2752 3950 -10703 -208 24995 30705
23839 30705 21322 25114 46621 60092 46955 28326 31489 28140 12995 17233 5875 -24512 -25520
23826 -25520 6966 1437 1993 1875 12011 11667 3547 -8246 -27974 -32228 -21211 -11138 -14012 -4582
23812 -4582 11326 7280 7255 378 -16583 -7426 -6698 -15784 -18864 -11686 13823 19270 10609 20299 2626
23797 2626 -25871 -43403 -51236 -42755 -38799 -37153 -12732 5978 -23153 -50428 -43573 -63359 -65530
23784 -65530 -26856 -8137 -6328 11685 28079 49832 27551 8533 14289 15294 22065 33077
23772 33077 36912 25057 10446 7277 7543 17373 27630 13201 14183 18223 -7236 -9837 -19609 -24216
$$ packed form
23865a0444k1157L02K1719M6200K8487j6921k2896k3829m65J7488N315j8915j6496
23852a1612J0834j4155L115J3488j2579J2316l47l812O702j4653J0495K5203N710
23839C0705r383L792K1507J3471j3137j8629L163l349j5145M238j1358l0387j008
23826b5520L2486n529N56j18J0136l44q120j1793j9728m254J1017J0073k874R430
23812d582J5908m046k5o877j6961R157P28r086l080P178K5509N447q661R690j7673
23797B626k8497j7532p833Q481L956J646K4421J8710k9131k7275O855j9786k171
23784f5530L8674J8719J809J8013J6394K1753k2281j9018N756J005O771J1012
23772C3077L835j1855j4611l169K66R830J0257j4429R82M040k5459k601r772m607
$$ plain form
23758 -24216 -13285 -12512 10934 19921 10352 356 -24819 -59243 -14021 20620 5664 -22135 -28570
23745 -28570 -16959 -13280 9180 28458 5110 -10024 -19407 -42496 -39951 -38562 -40388 -19650 19831
23732 19831 21296 8426 6689 -10654 -56548 -62853 -11483 15884 11818 -17314 -12093 -27986 -26534
23719 -26534 -24794 -4975 -21375 -10524 -580 11559 16430 50071 52791 18396 7973 11405 8464
23706 8464 -9051 -12845 16462 3348 4649 -6051 -874 880 4 -18928 -55359 -64095 -45533
23693 -45533 -18215 -29697 -38868 -30293 5252 27139 30191 39274 25728 -9577 -27299 -15415
23681 -15415 -18052 -23735 -33302 -31472 -31596 -31269 -36378 -13913 -9001 -1232 15856 6539 17773 14632
23667 14632 3174 1716 59 28703 4245 -25899 -38096 -41161 -29766 -22244 -21334 -25175 -3832
$$ packed form
23758b4216J0931P73K3446Q987r569r996k5175l4424M5222L4641j4956k7799o435
23745b8570J1611L679K2460J9278k3348j5134r383k3089K545J389j826K0738L9481
23732A9831J465j2870j737j7343m5894o305N1370K7367m066k9132N221j5893J452
23719b6534J740J9819j6400J0851R944J2139M871L3641K720l4395j0423L432k941
23706H464j7515l794K9307j3114J301j0700N177J754q76j8932l6431q736J8562
23693d5533K7318j1482r171Q575L5545K1887L052R083j3546l5305j7722J1884
23681a5415k637n683r567J830j24L27n109K2465M912P769J7088r317J1234l141
23667A4632j1458j458j657K8644k4458l0144j2197l065J1395P522R10l841K1343
$$ plain form
23654 -3832 20163 30133 21617 13868 801 11384 23985 19465 18852 38339 21158 3708 -10045
23641 -10045 -10265 5322 -471 -19574 -19565 -19367 -10469 -14364 -10609 16666 29828 4200 -15023 -22022
23627 -22022 -23781 -12970 -19240 -22937 -4912 8015 7599 7866 -10244 -5293 -8914 -19493 -11063 12273
23613 12273 17008 -8388 5967 8441 -18958 -32041 -24813 2627 28070 23166 35033 27449 -27756
23600 -27756 -29652 -18635 -15657 125 6213 -19885 -38217 -45977 -73094 -68001 -76118 -83061 -63713
23587 -63713 -35510 -35313 -46046 -47794 -69126 -77660 -51932 -53607 -26891 -6163 17 4835 7441
23574 7441 11904 21202 19396 2250 -27151 -47514 -28057 -22957 -29891 -28558 -21074 4968 36200
23561 36200 25993 13568 20274 22292 18573 37430 33005 19691 7503 -20105 -30622 -15241
$$ packed form
23654c832K3995R970q516p749j3067J0583J2601m520o13J9487j7181j7450j3753
23641a0045k20J5587n793j9103RJ98Q898l895L755K7275J3162k5628j9223o999
23627b2022j759J0811o270l697J8025J2927m16K67j8110M951l621j0579Q430K3336
23613A2273M735k5396J4355K474k7399j3083P228K7440K5443m904J1867p584n5205
23600b7756j896J1017K978J5782O088k6098j8332p760k7117N093q117o943J9348
23587f3713K8203J97j0733j748k1332q534K5728j675K6716K0728O180M818K606
23574G441M463R298j806j7146k9401k0363J9457N100o934J333P484K6042L1232
23561C6200j0207j2425O706K018l719J8857m425j3314j2188k7608j0517J5381
$$ plain form
23549 -15241 -6677 -15445 -24071 -22419 -6197 -951 1972 -21616 -33260 -25564 -4162 -8671 -21216
23536 -21216 -40293 -51454 -23264 1654 368 -25036 -35720 -27847 -22273 -38851 -43928 -19493
23524 -19493 -12698 -28728 -23994 -2422 -11471 -251 9347 8947 -32316 -49674 -42345 -38330 -31732
23511 -31732 -18875 -9236 -887 -7277 -11671 6968 10006 5635 -2815 -14154 -55905 -50889 -15108
23498 -15108 -6736 8616 29660 29776 30453 15357 -2815 1735 17222 17438 1637 -13650 -17312
23485 -17312 -14362 -6847 22148 25592 17595 12146 35946 22703 2905 -21535 -16481 22202 60892
23472 60892 58703 44416 52837 52453 37100 14425 4247 8745 6083 -14641 -19773 -3819 -8632
23459 -8632 -20058 -13852 -19414 -17242 -43203 -52692 -43906 -28046 -13556 6040 9021 13123 6377
$$ packed form
23549a5241Q564q768q626J652J6222N246K923k3588j1644P696K1402m509j2545
23536b1216j9077j1161K8190K4918j286k5404j0684P873N574j6578n077K4435
23524a9493O795j6030M734K1572r049J1220R598m00m1263j7358P329M015O598
23511c1732J2857R639Q349o390m394J8639L038m371q450j1339m1751N016L5781
23498a5108Q372J5352K1044J16O77j5096j8172M550J5487K16j5801j5287l662
23485a7312K950P515K8995L444p997n449K3800j3243j9798k4440N054L8683L8690
23472F0892k189j4287Q421l84j5353k2675j0178M498k662k0724n132J5954m813
23459h632j1426O206n562K172k5961r489Q786J5860J4490J9596K981M102o746
$$ plain form
23446 6377 -4576 -12063 1120 -2169 31957 53159 43134 39622 13618 -10450 -12034 -16985 -31008
23433 -31008 -41973 -34650 -25108 -34582 -31846 -33328 -23663 7728 5122 -351 -6026 -8975 -41407 -51946
23419 -51946 -37639 -33154 -43751 -49004 -42945 -32215 -19843 -24317 -37487 -21030 21455 16203 -19566
23406 -19566 -12022 -20566 13129 19428 8851 -10431 -12573 -5120 2630 -14239 -8272 -8200 -23323 -39579
23392 -39579 -55861 -18797 -6994 -16891 -11177 -4175 -25667 -17047 -21932 -19413 -23431 -20437 23329
23379 23329 24005 2414 -13382 -10695 -14470 5961 30238 20665 11380 8085 40012 49155 44869
23366 44869 16021 -4761 -14293 -23162 -21691 -4809 9350 -4771 -11906 -15137 -36479 -27921 6013
23353 6013 33221 26029 3527 -17995 -11217 6049 16565 479 -7495 5719 19338 28800 19041
$$ packed form
23446F377j0953p487J3183l289L4126K1202j0025l512k6004k4068j584m951j4023
23433c1008j0965P323R542r474K736j482R665L1391k606n473n675k949l2432j0539
23419e1946J4307M485j0597n253O059J0730J2372m474j3170J6457M2485n252l5769
23406a9566P544q544L3695O299j0577j9282k142P453P750j6869N967P2j5123j6256
23392c9579j6282L7064J1803r897N714P002k1492Q620m885K519m018K994M3766
23379B3329O76k1591j5796K687l775K0431K4277r573r285l295L1927R143m286
23366D4869k8848k0782r532q869J471J6882J4159j4121p135l231k1342Q558L3934
23353F013K7208p192k2502k1522O778J7266J0516j6086p974J3214J3619R462r759
$$ plain form
23340 19041 24004 -4659 -5769 -2480 19214 43483 23785 24262 -2015 31113 33554 17728 -26634
23327 -26634 -14635 19281 -10966 -44440 -45132 -41807 -41925 -17230 15657 9258 -4911 -8422 -8282
23314 -8282 -10118 -25997 -24320 -25265 -2951 -6557 -7470 -18816 -14184 -10899 -13655 -8790 -20674 -41812
23300 -41812 -27299 -23161 -5042 15541 26831 41863 29926 27774 -3347 -3951 -9301 -3735 26266
23287 26266 30787 -8049 -30465 -19318 -24571 -14904 24124 16897 -28171 -21891 -11143 -29181 -33158
23274 -33158 -21571 862 5248 -1762 20830 32017 16753 32152 14910 -9854 2012 5874
23262 5874 8924 -13712 -42480 -62801 -49856 -35078 -26388 23282 26399 14382 14951 20447 3429
23249 3429 -18693 2588 -5301 -30390 -62793 -50801 -13298 -17808 -8333 9676 -15840 -229
$$ packed form
23340A9041M963k8663j110L289K1694K4269j9698M77k6277L3128K441j5826m4362
23327b6634J1999L3916l0247l3474o92L325j18K4695L2887o399j4169l511J40
23314h282j836j5879J677r45K2314l606r13j1346M632L285k756M865j1884k1138
23300d1812J4513M138J8119K0583J1290J5032j1937k152l1121o04n350N566L0001
23287B6266M521l8836k2416J1147n253R667L9028p227m5068O280J0748j8038l977
23274c3158J1587K2433M386p010K2592J1187j5264J5399j7242k4764J1866L862
23262E874L050k2636k8768k0321J2945J4778Q690M9670L117j2017N69N496j7018
23249C429k2122K1281p889k5089l2403J1992L7503m510R475J8009k5516J5611
$$ plain form
23237 -229 28168 36433 43511 72011 61980 43350 45148 28263 2367 -23243 -41713 -66474 -71394
23224 -71394 -69217 -43669 -14137 14056 -8356 -15752 -7991 -7606 -17925 -41172 -26965 -25048 -24535
23211 -24535 -24318 -22366 -27036 -3627 15765 2674 -15379 -13250 15184 34897 15298 -29152 -24736
23198 -24736 4986 18230 25438 10534 -761 -27546 -40618 -37319 -45306 -36044 -15313 -17565 -16294
23185 -16294 -6056 18940 -7721 -48494 -20013 -8 -3572 -30155 -28972 -21852 -415 -6699
23173 -6699 -25300 -32065 -25016 24509 27287 6194 -8276 18749 26752 5577 27906 13060 22264
23160 22264 24069 26843 28450 1756 -15937 -4860 -602 -10122 -13927 -33276 -16132 -667 -31157
23147 -31157 -34806 -31134 -36592 -51800 -59573 -28474 5579 11785 -6711 -20953 -3092 5117 -935
$$ packed form
23237b29K8397Q265P078K8500j0031j8630J798j6885k5896k5610j8470k4761m920
23224g1394K177K5548K9532K8193k2412p396P761L85j0319k3247J4207J917N13
23211b4535K17J952m670K3409J9392j3091j8053K129K8434J9713j9599m4450M416
23198b4736K9722J3244P208j4904j1295k6785j3072L299p987R262K0731k252J271
23185a6294J0238K4996k6661m0773K8481K0005l564k6583J183P120K1437o284
23173f699j8601o765P049M9525K778k1093j4470K7025Q003k1175K2329j4846R204
23160B2264J805K774J607k6694j7693J1077M258r520l805j9349J7144J5465l0490
23147c1157l649L672n458j5208p773L1099L4053O206j8496j4242J7861Q209o052
$$ plain form
23134 -935 -9728 -1564 -9038 -19576 -14080 -33823 -38745 -47631 -42610 -38706 -41970 -35480 -15920 14298
23120 14298 -2180 -25054 -18189 15971 16427 -18906 -1543 6899 -11508 -9477 443 15614 12625
23107 12625 -6252 -11785 11844 18840 10287 7403 -1053 -3478 -5038 -12801 -48063 -28387 1431
23094 1431 8725 -8363 -25672 -30286 -50803 -45562 -26329 -2181 -1615 2897 26192 12932 11757
23081 11757 198 5046 5485 -24258 -20578 -15944 -14733 1111 30237 36910 38258 13308 10962
23068 10962 28585 45394 25567 19727 24738 21900 30243 43531 36174 32314 68124 53496 26616
23055 26616 19108 12188 5947 -14440 8717 39612 52771 45526 9455 -20315 7790 6607 28602
23042 28602 15842 -14686 -20057 -8463 5549 25921 30307 -8111 -38865 -48737 -38329 -24004
$$ packed form
23134i35q793Q164p474j0538N496j9743m922q886N021L904l264O490J9560L0218
23120A4298j6478k2874O865L4160M56l5333J7363Q442j8407K031R920J5171k989
23107A2625j8877n533K3629O996q553k884q456k425j560p763l5262J9676K9818
23094A431P294j7088j7309m614k0517N241J9233K4148N66M512K3295j3260j175
23081A1757j1559M848M39k9743L680M634J211J5844K9126O673J348k4950k346
23068A0962J7623J6809j9827n840N011k838Q343J3288p357l860L5810j4628k6880
23055B6616p508o920o241k0387K3157L0895J3159p245l6071k9770K8105j183K1995
23042B8602j2760l0528n371J1594J4012K0372M386l8418l0754r872J0408J4325
$$ plain form
23030 -24004 85 6500 911 -19030 -14504 -8335 -24265 -18888 971 28872 33642 39261 23548
23017 23548 -3058 9129 18960 19049 19703 35326 38059 11777 -13718 -22953 -21191 -20511 8395 45676
23003 45676 26517 -5896 -34641 -36124 -30704 -25642 -11839 9897 15654 36136 49112 52114 36326
22990 36326 36863 16746 15132 25766 40012 45914 13417 -37939 -27354 -28977 -43672 -40764 -25432
22977 -25432 -45541 -24125 12679 22571 4420 -3176 -3076 -28206 -21651 -2301 -22927 -33534 -18291
22964 -18291 -9955 -23239 -12131 -528 -27224 -53461 -46393 11524 46285 61328 53761 47674
22952 47674 41411 21168 228 -1520 11840 48929 50100 28234 11184 -7350 -17919 -10531
22940 -10531 1727 15056 -9040 -9300 -19335 -23964 -14272 -4651 -37968 -41057 -33972 -20381 -24788
$$ packed form
23030b4004K4089O415n589j9941M526O169j5930N377J9859K7901M770N619j5713
23017B3548k6606J2187R831Q9O54J5623K733k6282k5495r235J762O80K8906L7281
23003D5676j9159l2413k8745j483N420N062J3803K1736N757K0482J2976L002j5788
22990C6326N37k0117j614J0634J4246N902l2497n1356J0585j623j4695K908J5332
22977b5432k0109K1416L6804R892j8151p596J00k5130O555J9350k0626j0607J5243
22964a8291Q336j3284J1108J1603k6696k6237P068N7917L4761J5043p567o087
22952D7674o263k0243k0940j748J3360L7089J171k1866j7050j8534j0569P388
22940a0531J2258J3329k4096k60j0035m629R692R621l3317l089P085J3591m407
$$ plain form
22927 -24788 -23261 -18090 1135 2463 -36030 -18772 22562 17889 -956 -14068 -11034 -4038 -8459
22914 -8459 -9893 1272 -5719 -5673 2883 4494 -20361 -44619 -26640 -13076 1129 10947 8075 13107
22900 13107 13349 -5676 -9984 -23004 -1036 6100 3478 -6329 -13635 -15989 -36881 -45270 -26587
22887 -26587 -17095 -96 -11742 17404 12462 16458 15281 15379 10993 13536 -17627 -44468 -28520
22874 -28520 14244 23549 20393 -7618 2235 3419 -11878 -17947 -5279 -2132 -3700 244 419 8940
22860 8940 7750 19993 -3823 -2952 -16465 -25974 -27480 -50000 -39021 -56642 -32443 -14725 -38385
22847 -38385 -26455 5033 52222 24330 4130 18949 29496 2091 -2452 -1095 -2897 -4495
22835 -4495 -5146 4065 20266 5329 -14145 -40453 -12812 -99 -9390 -4742 -488 4779 17536
$$ packed form
22927b4788J527N171J9225J328l8493J7258M1334m673j8845j3112L034O996m421
22914h459j434J1165o991M6Q556J611k4855k4258J7979J3564J4205R818k872N032
22900A3107K42j9025m308j3020K1968P136k622r807p306k354k0892q389J8683
22887b6587R492J6999j1646K9146m942L996j177R8m386K543l1163k6841J5948
22874b8520M2764R305l156k8011R853J184j5297o069J2668L147j568L944J75Q521
22860H940j190J2243k3816Q71j3513r509j506k2520J0979j7621K4199J7718k3660
22847c8385J1930L1488M7189k7892k0200J4819J0547k7405m543J357j802j598
22835d495o51R211J6201j4937j9474k6308K7641J2713r291M648M254N267J2757
$$ plain form
22822 17536 28523 35569 27911 7561 -15338 -37722 -13818 -19082 -12168 -16036 -27388 -43931 -54555
22809 -54555 -48728 -30111 -39141 -50383 -40170 -41865 -14552 -875 7190 5535 -14280 -3144 3349
22796 3349 18718 23127 18291 12170 19474 6482 7560 -277 4400 8935 18773 23281 26592 40033
22782 40033 23889 42159 17335 1257 17234 16302 43475 61662 42558 52555 65831 58675
22770 58675 46503 15176 -4800 -11420 -8824 1540 5865 21648 25441 35620 46541 53523 40268
22757 40268 39596 9185 -7658 -11866 -40743 -51924 -32385 -45696 -35283 16455 23033 11307
22745 11307 21530 14066 10741 14702 27653 62587 52457 25473 13000 11231 9443 3279 42366
22732 42366 33027 15530 53968 80921 79828 83866 81316 68793 59453 48095 24262 17247 10422
$$ packed form
22822A7536J0987P046p658k0350k2899k2384K3904n264O914l868j1352j6543j0624
22809e4555N827J8617r030j1242J0213j695K7313J3677Q065j655j9815J1136O493
22796C349J5369M409m836o121P304j2992J078p837M677M535R838M508L311J3441
22782D0033j6144J8270k4824j6078J5977r32K7173J8187j9104R997J3276p156
22770E8675j2172l1327j9976o620K596J0364M325J5783L793J0179J0921O982j3255
22757D0268o72l0411j6843m208k8877j1181J9539j3311J0413N1738O578j1726
22745A1307J0223p464l325L961J2951L4934j0130k6984j2473j769j788o164L9087
22732D2366r339j7497L8438K6953j093M038k550j2523r340j1358k3833p015o825
$$ plain form
22719 10422 21082 30560 26544 59490 91134 76887 71157 102593 135801 160022 191506 221123
22707 221123 231636 270988 311423 339120 375995 428202 474509 523708 539800 544041 602427 692553
22695 692553 803041 971944 1188713 1449192 1752826 2109235 2446141 2732947 2957404 2995574
22685 2995574 2988036 2882463 2630740 2360279 2018333 1694711 1359044 978781 711173 563003
22675 563003 452905 388868 345355 345503 339467 334000 334485 313330 274260 252810 256788 235035 226367
22662 226367 237134 215948 190942 165593 144519 122632 123450 141326 150324 143362 138053 136243 133784
22649 133784 125517 123796 119070 102791 97123 94614 76445 42493 35696 61407 84068 75672 27352
22636 27352 -3127 -7802 38444 65104 59890 56825 79659 104655 102252 73736 53535 51145 59103
$$ packed form
22719A0422J0660R478m016L2946L1644j4247n730L1436L3208K4221L1484K9617
22707B21123J0513L9352M0435K7697L6875N2207M6307M9199J6092M241N8386R0126
22695F92553J10488J68903K16769K60479L03634L56409L36906K86806K24457L8170
22685B995574p538j05573k51723k70461l41946l23622l35667l80263k67608j48170
22675E63003j10098o4037m3513J48o036n467M85k1155l9070k1450L978k1753q668
22662B26367J0767k1186k5006k5349k1074k1887Q18J7876Q998o962n309j810k459
22649A33784q267j721m726j6279n668k509j8169l3952o797K5711K2661q396m8320
22636B7352l0479m675M6246K6660n214l065K2834K4996k403k8516k0201k390P958
$$ plain form
22623 59103 24171 3856 34810 56052 47731 51480 55557 57894 41594 58896 50316 31944 20795
22610 20795 21769 -9523 -39658 -38312 -24136 966 13436 64143 92180 68992 42304 24419
22598 24419 -8958 -9634 524 5056 -11510 -23923 -21899 20277 53567 46612 38180 48220 50451
22585 50451 38016 45173 71492 64576 63994 72954 52763 44041 57591 67152 63229 57743 53865 41146
22571 41146 38208 22062 11130 12170 29234 55263 57369 40210 24405 20904 43004 74482
22559 74482 63522 41076 12829 -3455 -7392 5144 17936 25452 12925 20134 44496 54187
22547 54187 66143 67060 67288 55127 60543 45412 21124 34902 18165 30626 69692 77494 68427
22534 68427 53888 23384 -3361 20784 37504 36713 34554 48314 47866 43209 32419 34950 67079
$$ packed form
22623E9103l4932k0315L0954K1242q321L749M077K337j6300J7302q580j8372j1149
22610B0795R74l1292l0135J346J4176K5102J2470N0707K8037k3188k6688j7885
22598B4419l3377o76J0158M532j6566j2413K024M2176L3290o955q432J0040K231
22585E0451j2435P157K6319o916n82Q960k0191q722J3550R561l923n486l878j2719
22571D1146k938j6146j0932J040J7064K6029K106j7159j5805l501K2100L1478
22559G4482j0960k2446k8247j6284l937J2536J2792P516j2527P209K4362R691
22547E4187J1956R17K28j2161N416j5131k4288J3778j6737J2461L9066P802r067
22534F8427j4539l0504k6745K4145J6720p91k159J3760m48m657j0790K531L2129
$$ plain form
22521 67079 112739 121121 94238 89893 70691 61596 53679 53554 71720 70839 60649 66625 72684 77085
22507 77085 76645 70970 95406 91624 53528 46196 66448 104948 106671 93768 75667 93162 97903
22494 97903 91389 84831 54453 66234 83639 73358 69314 70844 85635 67752 46507 45181 76656
22481 76656 109837 119309 131009 118572 92937 80010 92645 95805 72181 63599 51717 23861
22469 23861 34224 47824 56541 70052 88337 102502 77499 49972 31814 34311 28567 28313 12218
22456 12218 22575 10592 16706 27594 74277 78267 59191 47467 40027 26286 33199 50530
22444 50530 85270 122369 114054 74741 76170 87354 93897 124083 133802 150131 161946 140291
22432 140291 120182 115975 133154 174071 185641 205292 232685 232853 254607 266478 238179 214016
$$ packed form
22521F7079M5660Q382k6883m345j9202r095p917j25J8166q81j0190N976O059M401
22507G7085m40n675K4436l782l8096p332K0252L8500J723j2903j8101J7495M741
22494I7903o514o558l0378J1781J7405j0281m044J530J4791j7883k1245j326L1475
22481G6656L3181R472J1700j2437k5635j2927J2635L160k3624q582j1882k7856
22469B3861J0363J3600Q717J3511J8285J4165k5003k7527j8158K497n744k54j6095
22456A2218J0357j1983O114J0888M6683L990j9076j1724p440j3741O913J7331
22444E0530L4740L7099q315l9313J429J1184O543L0186R719J6329J1815k1655
22432A40291k0109m207J7179M0917J1570J9651K7393J68K1754J1871k8299k4163
$$ plain form
22420 214016 195008 184125 164713 147697 149271 128023 141602 155532 192670 212117 184044 171644
22408 171644 157515 154472 177533 168280 155809 157493 160086 143014 154532 184214 194920 245401
22396 245401 278673 294151 329303 338726 359355 346224 319297 307714 282781 291735 309786 298936
22384 298936 286746 277080 298764 318316 339682 308326 293416 322430 336831 337819 331103 326220
22372 326220 330234 314309 288355 254112 231754 223813 206091 193340 158605 141561 146602 156773
22360 156773 147613 144167 148441 122015 126598 150628 158771 179497 181111 178738 190343 246053 284070
22347 284070 337645 361494 375034 377583 382463 417923 420148 451744 472308 494213 531548 562424
22335 562424 604687 673553 746690 764412 764512 755003 696480 604171 528613 450542 392490 327947
$$ packed form
22420B14016j9008j0883j9412j7016J574k1248J3579J3930L7138J9447k8073j2400
22408A71644j4129l043K3061r253j2471J684K593j7072J1518K9682J0706N0481
22396B45401L3272J5478L5152R423K0629j3131k6927j1583k4933Q954J8051j0850
22384B98936j2190r666K1684J9552K1366l1356j4910K9014J4401R88o716m883
22372C26220M014j5925k5954l4243k2358p941j7722j2751l4735j7044N041J0171
22360A56773r160l446M274k6426M583K4030Q143K0726J614k373J1605N5710L8017
22347B84070N3575K3849J3540K549M880L5460K225L1596K0564K1905L7335L0876
22335E62424M2263O8866P3137J7722J00r509n8523r2309p5558p8071n8052o4543
$$ plain form
22323 327947 254501 204559 173441 175844 187764 185387 185417 152524 134271 101525 52995 -8006
22311 -8006 -76705 -87926 -100544 -111342 -79202 -64654 -69026 -60046 -3260 39601 40847 21214
22299 21214 24031 74333 143812 168526 156821 143983 150301 139338 130996 140416 125784 155397
22287 155397 201160 220879 196581 207058 247443 303058 376463 429322 472168 520891 572718
22276 572718 614145 641084 666558 727285 780575 831708 883039 905450 950651 993532 1019664
22265 1019664 1025131 1002405 985853 967426 885153 798323 698538 591748 488257 389340 318211
22254 318211 257314 194762 125226 125477 155530 129874 51476 31208 28236 10942 -88 -35916
22242 -35916 -51134 -39474 -50969 -52357 -23736 27561 82660 98530 113849 141335 177894 205709
$$ packed form
22323C27947p3446m9942l1118K403J1920k377L0l2893j8253l2746m8530o1001
22311h006o8699j1221j2618j0798L2140J4548m372Q980N6786M2861J246j9633
22299B1214K817N0302O9479K4714j1705j2838O318j0963q342R420j4632K9613
22287A55397M5763J9719k4298J0477M0385N5615P3405N2859M2846M8723N1827
22276E72718M1427K6939K5474O0727N3290N1133N1331K2411M5201M2881K6132
22265A019664N467k2726j6552j8427q2273q6830r9785j06790j03491r8917p1129
22254C18211o0897o2552o9536K51L0053k5656p8398k0268k972j7294j1030l5828
22242c5916j5218J1660j1495j388K8621N1297N5099J5870J5319K7486L6559K7815
$$ plain form
22230 205709 228531 272786 312340 389951 453470 480224 512189 570854 646978 715772 778698
22219 778698 836049 916364 997372 1064498 1133627 1242113 1416971 1622314 1850639 2090394
22209 2090394 2397740 2747439 3092889 3421663 3538601 3532639 3526784 3339277 3104277 2862412
22199 2862412 2577969 2368002 2087841 1833004 1698245 1668552 1667227 1676152 1685864 1725900 1756394
22188 1756394 1779376 1787534 1832854 1863264 1899824 1921542 1965728 2002131 2056976 2104004 2188540
22177 2188540 2273217 2340923 2429872 2538288 2628423 2729347 2856376 2949398 3028009 3122560 3243866
22166 3243866 3406414 3589595 3779496 4012059 4277481 4645517 5065966 5516487 6059899
22157 6059899 6662332 7359532 8209314 9220403 10453943 11949731 13788237 16036555 18818187
$$ packed form
22230B05709K2822M4255L9554P7611O3519K6754L1965N8665P6124O8794O2926
22219G78698N7351Q0315Q1008O7126O9129J08486J74858K05343K28325K39755
22209B090394L07346L49699L45450L28774J16938n962n855j87507k35000k41865
22199B862412k84443k09967k80161k54837j34759k9693j325Q925R712M0036L0494
22188A756394K2982Q158M5320L0410L6560K1718M4186L6403N4845M7028Q4536
22177B188540Q4677O7706Q8949J08416R0135J00924J27029R3022P8611R4551J21306
22166C243866J62548J83181J89901K32563K65422L68036M20449M50521N43412
22157F059899O02433O97200Q49782J011089J233540J495788J838506K248318K781632
$$ plain form
22148 18818187 22186010 26295656 31288794 37190603 43860939 51173082 58932015 66920390
22140 66920390 74619657 81984593 88963685 95332627 101417139 107838312 116378447 129575343
22132 129575343 151132754 182006472 221077805 267314715 317768084 373213068 432267706
22125 432267706 486889934 520166556 517855006 514817028 496430301 452728905 407618385
22118 407618385 345216844 293065390 237574060 167373733 121465268 97602396 84200700
22111 84200700 75717029 69952513 65700801 62043381 58807709 55814047 52891882 49960583
22103 49960583 46764111 43582950 40505378 37442529 34483950 31708894 29176869 26857795
22095 26857795 24704273 22762052 21021042 19458872 18061249 16747402 15594673 14558187
$$ packed form
22148A8818187L367823M109646M993138N901809O670336P312143P758933P988375
22140F6920390P699267P364936O979092O368942O084512O421173Q540135J3196896
22132A29575343K1557411L0873718L9071333M6236910N0453369N5444984N9054638
22125D32267706N4622228L3276622k311550l037978j8386727m3701396m5110520
22118D07618385o2401541n2151454n5491330p0200327m5908465k3862872j3401696
22111H4200700q483671n764516m251712l657420l235672k993662k922165k931299
22103D9960583l196472l181161l077572l062849k958579k775056k532025k319074
22095B6857795k153522j942221j741010j562170j397623j313847j152729j036486
$$ plain form
22087 14558187 13654185 12870450 12162955 11515054 10903609 10274870 9704519 9173627 8646600
22078 8646600 8130617 7652999 7245357 6830622 6456446 6133808 5856243 5594342 5334944
22069 5334944 5069608 4847038 4658614 4445374 4237440 4072002 3956551 3841231 3717892
22060 3717892 3584048 3474291 3363346 3278402 3198912 3113469 3056993 2966349 2918596 2915763 2948956
22049 2948956 3011474 3111843 3264487 3478035 3739619 3978851 4242649 4482919 4612222 4515356
22039 4515356 4432456 4249635 3943449 3626480 3237661 2940591 2586116 2180270 1934598 1802773
22029 1802773 1696037 1584609 1520074 1480358 1444214 1417638 1392468 1385569 1405337 1392238 1366663
22018 1366663 1347625 1359387 1376844 1352039 1301363 1293653 1320412 1357995 1373667 1375727 1398108 1422904
$$ packed form
22087A4558187r04002p83735p07495o47901o11445o28739n70351n30892n27027
22078H646600n15983m77618m07642m14735l74176l22638k77565k61901k59398
22069E334944k65336k22570j88424k13240k07934j65438j15451j15320j23339
22060C717892j33844j09757j10945q4944p9490q5443n6476r0644m7753k833L3193
22049B948956O2518J00369J52644K13548K61584K39232K63798K40270J29303r6866
22039D515356q2900j82821l06186l16969l88819k97070l54475m05846k45672j31825
22029A802773j06736j11428o4535l9716l6144k6576k5170o899J9768j3099k5575
22018A366663j9038J1762J7457k4805n0676p710K6759L7583J5672K060K2381K4796
$$ plain form
22006 1422904 1412671 1377583 1313141 1264350 1190900 1134506 1086850 1034783 966675 935140 901207
21995 901207 901991 903671 866633 781178 718203 692364 623142 508103 358269 226985 138651
21984 138651 67522 1850 10261 34238 20491 30688 79078 117024 159994 175398 220695 253197
21972 253197 284611 362927 422975 500858 560608 558570 570003 589512 629918 678036 692667 702118
21960 702118 710396 721920 694153 677781 667411 606988 582475 578719 549080 541187 552401 550357
21948 550357 587812 605410 635824 662591 689326 718106 723585 740278 739989 729344 746377 745875
21936 745875 733893 696083 681948 648151 602751 570101 506455 446215 404770 401077 389436 352652
21924 352652 328929 319437 324680 298326 252346 214323 203953 205598 186761 162410 128047 107137
$$ packed form
22006A422904j0233l5088o4442m8791p3450n6394m7656n2067o8108l1535l3933
21995I01207P84J680l7038q5455o2975k5839o9222j15039j49834j31284q8334
21984A38651p1129o5672Q411K3977j3747J0197M8390L7946M2970J5404M5297L2502
21972B53197L1414P8316O0048P7883N9750k038J1433J9509M0406M8118J4631R451
21960G02118Q278J1524k7767j6372j0370o0423k4513l756k9639p893J1214k044
21948E50357L7455J7598L0414K6767K6735K8780N479J6693k89j0645J7033n02
21936G45875j1982l7810j4135l3797m5400l2650o3646o0240m1445l693j1641l6784
21924C52652k3723r492N243k6354m5980l8023j0370J645j8837k4351l4363k0910
$$ plain form
21912 107137 84504 95309 118211 98650 85685 72483 80698 79728 96958 93140 82349 78844
21900 78844 94194 103410 138256 155631 127724 127766 184457 215224 224972 219664 186257 166352 145495
21887 145495 165100 177105 178136 171885 143763 137648 125050 134911 160728 146586 149693 130720
21875 130720 91711 71454 83653 96220 96507 90401 92460 78199 89687 96329 91635 80000 84179
21862 84179 105709 109128 128266 119543 105330 125873 92727 69267 55777 51883 71461 94185
21850 94185 78949 76549 64708 70951 68333 75986 84156 78605 79251 78943 94020 103411 87928 47041
21836 47041 34515 20007 5989 -9433 -9569 0 21791 13866 -9325 -29724 -32753 10969 31092
21823 31092 37444 1711 -13278 14936 23363 28648 75503 76804 67592 66009 62045 87431 81697
$$ packed form
21912A07137k2633J0805K2902j9561j2965j3202Q215r70J7230l818j0791l505
21900G8844J5350R216L4846J7375k7907M2N6691L0767R748n308l3407j9905k0857
21887A45495J9605J2005J031o251k8122o115j2598R861K5817j4142L107j8973
21875A30720l9009k0257J2199J2567K87o106K059j4261J1488O642m694j1635M179
21862H4179K1530L419J9138q723j4213K0543l3146k3460j3490l894J9578K2724
21850I4185j5236k400j1841O243k618P653Q170n551O46l08J5077R391j5483m0887
21836D7041j2526j4508j4018j5422j36R569K1791p925k3191k0399l029M3722K0123
21823C1092O352l5733j4989K8214Q427N285M6855J301r212j583l964K5386n734
$$ plain form
21810 81697 88023 113187 142431 138879 137280 116227 116500 121056 146724 169787 153268 132204 116862
21797 116862 118834 113572 102206 113934 146377 143136 131316 130841 122934 105855 108405 142995 114803
21784 114803 113183 121217 88560 60295 62375 73993 67102 60080 52278 57408 79686 63500 36265
21771 36265 25744 -10535 -7627 47683 40442 17744 -15262 -20946 -2732 10236 22148 28774
21759 28774 13414 45135 54930 18407 -14218 -26792 -18586 -1856 15988 18750 16883 38725
21747 38725 8048 -31407 -27340 -22283 -15180 4984 6390 9583 -3731 -10313 9033 -7464 -16331
21734 -16331 -17629 -16959 -23152 -41260 -37143 -22255 -40834 -51650 -35439 -30207 -14183 -15405 -37680
21721 -37680 -36117 7413 4657 -3558 -21300 -37935 -35126 -21460 1249 -5315 -6612 3959 883
$$ packed form
21810H1697O326K5164K9244l552j599k1053K73M556K5668K3063j6519k1064j5342
21797A16862J972n262j1366J1728L2443l241j1820m75p907j7079K550L4590k8192
21784A14803j620Q034l2657k8265K080J1618o891p022p802N130K2278j6186k7235
21771C6265j0521l6279K908N5310p241k2698l3006n684J8214J2968J1912O626
21759B8774j5360L1721R795l6523l2625j2574Q206J6730J7844K762j867K1842
21747C8725l0677l9455M067N057P103K0164J406L193j3314o582J9346j6497q867
21734a6331j298O70o193j8108M117J4888j8579j0816J6211N232J6024j222k2275
21721c7680J563M3530k756q215j7742j6635K809J3666K2709o564j297J0571l076
$$ plain form
21708 883 -4854 -9993 -5539 7635 23055 9775 8203 10613 43887 68382 50153 19255 17689
21695 17689 30435 48735 29373 31910 47930 34434 22059 19463 42043 49531 55710 52689 38056
21682 38056 14552 29403 36423 41192 61485 54774 62203 63284 28652 10707 20048 30164 45436
21669 45436 68442 52910 17608 10111 9683 -8554 5364 26405 41203 24008 30973 53297
21657 53297 57922 35956 11458 21223 64111 69709 62029 53090 26985 35977 48140 41859 21368
21644 21368 26384 25603 36590 56776 68168 34969 15674 26497 46856 70095 65047 47734
21632 47734 31753 30633 53244 61397 71802 21699 -18582 -24993 -31511 4674 43209 33277 28855
21619 28855 42866 41748 23421 21075 10404 14069 22648 26714 47401 39585 22910 8836 15311
$$ packed form
21708H83n737n139M454J3174J5420j3280j572K410L3274K4495j8229l0898j566
21695A7689J2746J8300j9362K537J6020j3496j2375k596K2580P488O179l021j4633
21682C8056k3504J4851P020M769K0293o711P429J081l4632j7945R341J0116J5272
21669D5436K3006j5532l5302p497m28j8237J3918K1041J4798j7195O965K2324
21657E3297M625k1966k4498R765M2888N598p680q939k6105Q992J2163o281k0491
21644B1368N016p81J0987K0186J1392l3199j9295J0823K0359K3239n048j7313
21632D7734j5981j120K2611Q153J0405n0103m0281o411o518L6185L8535r932m422
21619B8855J4011j118j8327k346j0671L665Q579M066K0687p816j6675j4074O475
$$ plain form
21606 15311 20972 30471 30271 61624 61120 28932 7110 -17105 -24704 9466 23722 40655 47141
21593 47141 52833 40584 30090 36950 61840 81284 105685 120399 78812 64885 74480 43574
21581 43574 53695 68771 74623 90902 105626 143805 169220 197745 220529 240024 278867 333236
21569 333236 385983 417816 458019 516362 545024 591141 615941 643482 693859 777239 913161
21558 913161 1119251 1392367 1692882 1982112 2293961 2641106 2914541 2989635 2967342 2906785
21548 2906785 2680931 2444380 2140169 1810810 1538110 1162506 832916 667250 569675 511711
21538 511711 481089 442801 412471 416437 409584 378053 360101 339293 281698 251137 247159 203299
21526 203299 186239 187351 162749 160094 146511 124462 118774 116479 123047 102489 109713 129109 106176
$$ packed form
21606A5311N661R499k00L1353n04l2188k1822k4215p599L4170J4256J6933O486
21593D7141N692j2249j0494O860K4890J9444K4401J4714m1587j3927R595l0906
21581D3574J0121J5076N852J6279J4724L8179K5415K8525K2784J9495L8843N4369
21569C33236N2747L1833M0203N8343K8662M6117K4800K7541N0377Q3380J35922
21558I13161K06090K73116L00515K89230L11849L47145K73435P5094k2293o0557
21548B906785k25854k36551l04211l29359k72700l75604l29590j65666r7575n7964
21538E11711l0622l8288l0330L966o853l1531j7952k0808n7595l0561l978m3860
21526B03299j7060J112k4602k655j3583k2049n688k295O568k0558P224J9396k2933
$$ plain form
21513 106176 89950 80955 103986 111134 71056 50990 43758 39464 18377 715 1096 4750 24499
21500 24499 49369 23227 -12693 -14997 1377 25774 41751 30063 35123 47776 51856 32227
21488 32227 19047 11016 4105 8928 23156 43298 9131 -3481 5855 3995 1804 18549 17046
21475 17046 23266 34978 45848 48904 38056 16887 19444 36613 73227 34780 -20046 -12439
21463 -12439 22706 6144 -2271 -3378 -6881 3609 19051 13244 20194 28160 7444 -20091 -27112
21450 -27112 -32454 -27471 2556 9234 -20657 -39484 -24416 1272 30666 27106 2663 -7033 -26274
21437 -26274 -20061 -27326 -32762 4952 7625 -14322 -9235 33095 40796 17327 32694 39841 39087
21424 39087 31055 19155 12395 34344 15310 7412 -29053 -51013 -23780 -1515 -16998 -6208
$$ packed form
21513A06176j6226q995K3031P148m0078k0066p232m294k1087j7662L81L654J9749
21500B4499K4870k6142l5920k304J6374K4397J5977j1688N060J2653M080j9629
21488C2227j3180q031o911M823J4228K0142l4167j2612R336j860k191J6745j503
21475A7046O220J1712J0870L056j0848k1169K557J7169L6614l8447n4826P607
21463a2439L5145j6562q415j107l503J0490J5442n807O950P966k0716k7535p021
21450b7112n342M983L0027O678k9891j8827J5068K5688K9394l560k4443r696j9241
21437b6274O213p265n436L7714K673k1947N087M2330P701k3469J5367P147p54
21424C9087q032j1900o760K1949j9034p898l6465k1960K7233K2265j5483J0790
$$ plain form
21412 -6208 21922 30339 -5366 -1514 17376 -814 -37748 -1688 15052 -8108 6266 16759
21400 16759 28739 29342 12817 -17414 -10689 -20269 -44218 -50753 -30777 14486 -7736 11090 20595
21387 20595 18100 10674 4769 -15903 4079 19605 24911 36143 33073 16813 15381 -15196 -2497
21374 -2497 4507 19222 24685 22477 18049 -4859 -19477 -18676 -13429 -16291 -20527 -22123 -24441 733
21360 733 9287 1703 11063 -3842 -11877 -16176 -26946 -30237 -9704 -30092 -29214 -17072 -17376 -19694
21346 -19694 -17391 -17055 -33966 -22756 5176 1643 16500 22899 3241 8870 13977 -4162 -3595
21333 -3595 6414 3727 -9374 -32223 -28098 -16666 2967 -1136 731 -7807 -15483 -10694 -8283
21320 -8283 10619 50895 61902 64156 66170 44200 30343 19454 32780 35450 18669 -13381
$$ packed form
21412f208K8130Q417l5705L852J8890j8190l6934L6060J6740k3160J4374J0493
21400A6759J1980O03j6525l0231O725r580k3949o535J9976M5263k2222J8826R505
21387B0595k495p426n905k0672J9982J5526N306J1232l070j6260j432l0577J2699
21374b497P004J4715N463k208m428k2908j4618Q01N247k862m236j596k318K5174
21360G33Q554p584R360j4905q035m299j0770l291K0533k0388Q78J2142l04k318
21346a9694K303L36j6911J1210K7932l533J4857O399j9658N629N107j8139N67
21333c595J0009k687j3101k2849M125J1432J9633m103J867q538p676M789K411
21320h283J8902M0276J1007K254K014k1970j3857j0889J3326K670j6781l2050
$$ plain form
21308 -13381 -15241 -16020 -53916 -80087 -39711 -24923 17506 36570 32504 9305 -2254 -29038
21296 -29038 -46182 -31724 -9255 -8472 -48533 -67281 -71845 -53387 -38352 -23009 666 -10281
21284 -10281 11879 12899 7761 6702 -15 16914 20615 3210 -8089 -17468 -31426 -41739 -30921
21271 -30921 -11252 -25100 -39033 -20558 -29372 -15019 4658 -430 3512 34277 21516 -3409
21259 -3409 -8356 26927 45008 38548 24046 21346 2046 -36360 -13380 15990 18226 4264 -17774
21246 -17774 -2432 6652 -6890 -18228 19109 36238 35083 30000 12414 -19548 -42373 -13073
21234 -13073 -30707 -31316 -45469 -28812 -23831 -20938 -34965 -32717 -31401 -4163 -5696 1092 30496
21221 30496 29665 3664 875 -1296 -3176 -9910 16901 10883 339 -1359 5766 4200 10811 7155
$$ packed form
21308a3381j860p79l7896k6171M0376J4788M2429J9064m066k3199j1559k6784
21296b9038j7144J4458K2469P83m0061j8748m564J8458J5035J5343K3675j0947
21284a0281K2160J020n138j059o717J6929L701j7405j1299r379j3958j0313J0818
21271c0921J9669j3848j3933J8475q814J4353J9677n088L942L0765j2761k4925
21259c409m947L5283J8081o460j4502k700j9300l8406K2980K9370K236j3962k2038
21246a7774J5342R084j3542j1338L7337J7129j155n083j7586l1962k2825K9300
21234a3073j7634o09j4153J6657M981K893j4027K248J316K7238j533O788K9404
21221C0496q31k6001k789k171j880o734K6811o018j0544j698P125j566O611l656
$$ plain form
21207 7155 15961 10982 426 10868 29037 45959 20067 6242 11970 40485 44725 17133 18232
21194 18232 3732 10067 21816 20696 12290 7705 -2112 -13967 14723 26726 14394 -2530 -23778
21181 -23778 -23121 -28433 -21485 -4053 8284 39871 27903 5780 -10331 17544 32436 12356
21169 12356 -7632 -9679 -4690 -19622 10614 32872 16540 10130 5507 -2555 -14284 -16854 -19296
21156 -19296 -1299 -25075 -39462 -26755 -29219 -20366 -3168 8027 23520 30970 37582 21412
21144 21412 40957 29303 -1257 -32736 6435 34447 15529 31727 27192 14886 -1313 -7952
21132 -7952 -7488 -15159 -46690 -59125 -46187 -14683 -10935 -21517 -32974 -30969 -28617 -22992 -13357
21119 -13357 -9957 -12435 -114 16131 24667 1769 -13409 -42161 -45625 -33497 -20385 -21421 -35199
$$ packed form
21207G155Q806m979j0556J0442J8169J6922k5892j3825N728K8515M240k7592J099
21194A8232j4500O335J1749j120q406m585r817j1855K8690J2003j2332j6924k1248
21181b3778O57n312O948J7432J2337L1587j1968k2123j6111K7875J4892k0080
21169A2356j9988k047M989j4932L0236K2258j6332o410m623q062j1729k570k442
21156a9296J7997k3776j4387J2707k464Q853J7198J1195J5493P450O612j6170
21144B1412J9545j1654l0560l1479L9171K8012j8918J6198m535j2306j6199o639
21132g952M64p671l1531j2435J2938L1504L748j0582j1457K005K352N625R635
21119a3357L400k478J2321J6245Q536k2898j5178k8752l464J2128J3112j036j3778
$$ plain form
21106 -35199 -16761 -11435 -28616 -20270 -34830 -19451 -13594 -39941 -23413 8428 6052 -11916
21094 -11916 -8976 24637 25260 19114 10603 -7567 -17636 -4091 17954 11716 9304 2245 -1543
21081 -1543 1350 -1740 -10675 -2408 9558 8782 18224 13126 -22366 -51251 -51321 -18799 2513 2007
21067 2007 -10495 -13667 -22290 -25454 -10665 -2026 9713 -9890 -23673 -24500 -9987 -26989 -10073
21054 -10073 21278 15851 6696 23782 -4813 3012 29407 18605 -4807 -20488 -29034 -14104
21042 -14104 -15595 -38679 -46574 -43540 -61964 -55618 -48518 -35956 -36054 -27617 -32312 -52344 -33905 -9491
21028 -9491 -5964 -20843 -30366 -31724 -8553 -23030 -10976 -8734 -7572 -16807 -36971 -28785 -9711
21015 -9711 -13743 -19380 -8645 3299 25076 21153 21384 13464 -1294 15917 4530 21105 11798
$$ packed form
21106c5199J8438N326j7181Q346j4560J5379N857k6347J6528L1841k376j7968
21094a1916K940L3613O23o146q511j8170j0069J3545K2045o238k412p059l788
21081a543K893l090q935Q267J1966p76R442n098l5492k8885p0L2522K1312n06
21067B007j2502l172q623l164J4789Q639J1739j9603j3783q27J4513j7002J6916
21054a0073L1351n427r155J7086k8595P825K6395j0802k3412j5681q546J4930
21042a4104j491k3084p895L034j8424O346P100J2562r8Q437m695k0032J8439K4414
21028i491L527j4879r523j358K3171j4477J2054K242J162r235k0164Q186J9074
21015i711m032n637J0735J1944K1777l923K31p920j4758J7211j1387J6575r307
$$ plain form
21002 11798 -10761 -27470 -35769 -43252 -4042 42083 42843 59896 73874 80673 83564 59178 46042
20989 46042 26945 5983 -4882 -5728 -13741 -34050 -23087 -19588 -12943 -943 25569 56235 40129
20976 40129 -8739 -25633 -17833 3840 26310 10172 -24657 -25344 -17161 -4070 13157 -7656
20964 -7656 -15718 -17670 -19546 -27265 -38541 -41537 -10560 -6762 -14382 -13751 7547 9304 9036 11274
20950 11274 5765 -1476 492 -16991 -2853 -13670 -54634 -43458 -18559 20703 28033 20765 8647
20937 8647 441 30838 39284 28424 1918 3493 10934 15748 2621 -3636 7254 -2895 -14958
20924 -14958 -24792 -31088 7128 50387 48269 6990 -17752 -19114 -10604 14408 6207 16224 -3911
20911 -3911 -6017 9694 -2348 -15435 2884 20708 10469 14875 -2705 -20198 -36071 -50529
$$ packed form
21002A1798k2559j6709q299p483L9210M6125P60J7053J3978O799K891k4386j3136
20989D6042j9097k0962j0865q46q013k0309J0963L499O645J2000K6512L0666j6106
20976D0129m8868j6894P800K1673K2470j6138l4829o87Q183J3091J7227k0813
20964g656q062j952j876p719j1276k996L0977L798p620O31K1298J757k68K238
20950A1274n509p241J968j7483J4138j0817m0964J1176K4899L9262P330p268j2118
20937H647q206L0397Q446j0860k6506J575P441M814j3127o257J0890j0149j2063
20924a4958r834o296L8216M3259k118m1279k4742j362Q510K5012q201J0017k0135
20911c911k106J5711j2042j3087J8319J7824j0239M406j7580j7493j5873j4458
$$ plain form
20899 -50529 -29267 -6360 -20388 -23813 -5120 9957 28220 33596 32489 40476 30521 18437 -11674
20886 -11674 -19491 -13181 -14135 6748 5600 -16 -947 -9733 -25976 -33877 8595 20148 8331 6307
20872 6307 -698 -27117 -51010 -37718 -11460 -219 35728 23176 17052 11716 -13579 -8773 -10676
20859 -10676 -13791 -28404 15902 18596 20915 4005 -17095 -44459 -24694 -3310 -20063 -30949
20847 -30949 -22899 -20472 -22418 -8417 -9468 -27484 -18485 -7858 5880 17150 23947 16399 -9448
20834 -9448 -24478 -13423 -6476 -19592 -8930 5285 12662 12660 -712 -11584 -13853 -11561 8009
20821 8009 2413 228 13130 6322 -18873 5409 15606 -3766 8672 10588 8470 -2031 -4440
20808 -4440 -13347 -41470 -55126 -19398 -18563 -13335 -20094 -18021 -20739 -21111 -20773 -39318 -53576 -9058
$$ packed form
20899e0529K1262K2907j4028l425J8693J5077J8263N376j107P987r955j2084l0111
20886a1674p817O310r54K0883j148n616r31q786j6243p901M2472J1553j1817k024
20872F307p005k6419k3893J3292K6258J1241L5947j2552o124n336k5295M806j903
20859a0676l115j4613M4306K694K319j6910k1100k7364J9765K1384j6753j0886
20847c0949Q050K427j946J4001j051j8016Q999J0627J3738J1270O797p548k5847
20834i448j5030J1055O947j3116J0662J4215P377kj3372j0872k269K292J9570
20821H009n596k185J2902o808k5195K4282J0197j9372J2438J916k118j0501k409
20808d440q907k8123j3656L5728Q35N228o759K073k718l72L38j8545j4258M4518
$$ plain form
20794 -9058 -5313 -29285 -44768 -44563 -22998 -24074 -22785 525 -5875 10542 30520 48260 77877
20781 77877 51094 4860 -28391 -37453 -13261 -13862 -10337 -3177 11747 -10087 -62647 -64952 -42723
20768 -42723 -24626 -17894 2698 -4088 4497 -15219 -28280 -16511 -6132 -51472 -49852 -29008
20756 -29008 -25943 -25338 -1669 -5686 -20233 -40262 -31986 -4390 1993 -1074 -18168 -43740 -76862
20743 -76862 -79385 -64870 -45910 -35447 -44358 -35132 -11709 -30068 -41302 -27359 -7259 -18214
20731 -18214 -40782 -21546 -2276 7453 10061 -756 -5952 -12569 -18591 -8935 6517 22996 19266
20718 19266 -1924 -19923 -10308 -20882 -50760 -48783 -35556 -32779 -6189 13274 -3680 -31189
20706 -31189 -24356 -6083 5979 -16214 -11947 8568 -6793 -26480 -17374 -10525 -27333 -27774 -25225
$$ packed form
20794i058L745k3972j5483K05K1565j076J289K3310o400J6417J9978J7740K9617
20781G7877k6783m6234l3251r062K4192o01L525P160J4924k1834n2560k305K2229
20768d2723J8097O732K0592o786Q585j9716j3061J1769J0379m5340J620K0844
20756b9008L065O05K3669m017j4547k0029Q276K7596O383l067j7094k5572l3122
20743g6862k523J4515J8960J0463q911R226K3423j8359j1234J3943K0100j0955
20731a8214k2568J9236J9270R729K608j0817n196o617o022R656J5452J6479l730
20718A9266k1190j7999R615j0574k9878J977J3227K777K6590J9463j6954k7509
20706c1189O833J8273J2062k2193M267K0515j5361j9687R106O849j6808m41K549
$$ plain form
20693 -25225 -36647 -43649 -32098 -20619 -20342 -10354 11863 17056 4946 -8917 -44387 -47863 -58934
20680 -58934 -36384 -4346 15898 494 16682 -14533 -42918 -37517 -1083 15181 5312 7977
20668 7977 -2120 27658 38403 352 -2097 -4229 -3206 -8341 -14680 -2649 -9434 -36609 -63015
20655 -63015 -53036 -44061 -43646 -34177 -57542 -43420 -34921 -8602 12556 -1238 -32705 -34680 -17421
20642 -17421 1574 -2172 -8162 -8810 -15978 -25575 -2431 9254 41641 57702 39636 23291 -584
20629 -584 -4294 24601 43941 30611 25971 6980 -10877 -23700 -25684 -27869 -5568 2686 -924
20616 -924 -41353 -47870 -35066 -56733 -53552 -41422 -30390 -19467 -21782 -10396 -16412 -21764 -26594
20603 -26594 -6027 -4851 -8838 16102 5776 -32122 -46279 -16432 -2326 -915 -13515 -9726
$$ packed form
20693b5225j1422p002J1551J1479K77R988K2217N193j2110j3863l5470l476j1071
20680e8934K2550L2038K0244j5404J6188l1215k8385N401L6434J6264r869K665
20668G977j0097K9778J0745l8051k449k132J023n135o339J2031o785k7175k6406
20655f3015R979Q975M15R469k3365J4122Q499K6319K1158j3794l1467j975J7259
20642a7421J8995l746n990o48p168r597K3144J1685L2387J6061j8066j6345k3875
20629e84l710K8895J9340j3330m640j8991j7857j2823j984k185K2301Q254l610
20616i24m0429o517J2804k1667L181J2130J1032J0923k315J1386o016n352m830
20603b6594K0567J176l987K4940j0326l7898j4157K9847J4106J411j2600L789
$$ plain form
20591 -9726 -1494 23785 23712 19870 -12887 -24693 -9331 25032 5849 -10801 -19655 -11904 -18472
20578 -18472 -12791 731 8411 -4703 -25279 -31055 -16946 15060 30142 9556 -18369 -29082
20566 -29082 -19142 -21445 -49973 -55487 -45740 -29353 -21080 -2042 42736 42151 32481 33217 9230 -20231
20552 -20231 -31566 -37646 -31959 -24058 -18834 -10706 -3624 13334 5022 -23676 -45447 -48023 -37101
20539 -37101 -15394 533 25499 22296 39746 7638 -8862 -25361 -10136 -13725 -16317 -19359
20527 -19359 17873 31968 20949 11943 21786 22239 6225 -18246 -24091 -21597 -10113 -14110 -19643
20514 -19643 -26315 -36714 -40591 -53746 -40781 -29062 -2571 32537 17064 -9050 -12707 -15125
20502 -15125 -23901 -22982 -480 26996 42766 40234 36785 24131 4179 15191 12657 15891 -15522
$$ packed form
20591i726Q232K5279p3l842l2757j1806J5362L4363j9183j6650q854P751o568
20578a8472N681J3522P680j3114k0576n776J4109L2006J5082k0586k7925j0713
20566b9082R940k303k8528n514R747J6387Q273J9038M4778n85r670P36k3987k9461
20552b0231j1335o080N687P901N224Q128P082J6958q312k8698k1771k576J0922
20539c7101K1707J5927K4966l203J7450l2108j6500j6499J5225l589k592l042
20527a9359L7232J4095j1019r006R843M53j6014k4471n845K494J1484l997n533
20514a9643o672j0399l877j3155J2965J1719K6491L5108j5473k6114l657k418
20502a5125q776R19K2502K7476J5770k532l449j2654j9952J1012k534L234l1413
$$ plain form
20489 -15522 -23336 -6690 14618 8180 -12979 -37651 -41278 -22692 3731 -2079 13872 -9816
20477 -9816 -27069 -21037 -9301 -12436 -32243 -36755 -27070 -15612 -7855 -10591 -29450 -34798 2113
20464 2113 5837 6456 -6160 2889 17491 23094 33015 19682 -1277 -1337 -6317 -12521 -18136 -4346
20450 -4346 -3316 -13722 -24154 -17416 -5723 -1347 -23679 -41615 -62573 -76564 -58446 -25665
20438 -25665 12920 19068 15964 -21311 -33771 -36301 -15998 -3865 -12348 -16796 -29861 -28684 -30745
20425 -30745 -33447 -24735 -19330 -21067 -7089 -7431 -9372 -11434 -2384 -22259 -44701 -62774 -41384
20412 -41384 -34243 -13373 -8684 -26464 -44838 -30735 -20718 -7336 541 -10038 4069 -3506
20400 -3506 -18359 -13775 -17202 -25706 -25125 -9868 -13081 -17561 11467 472 -5168 3554 -12962 -26905
$$ packed form
20489a5522p814J6646K1308o438k1159k4672l627J8586K6423n810J5951k3688
20477i816j7253O032J1736l135j9807m512R685J1458P757k736j8859n348L6911
20464B113L724O19j2616R049J4602N603R921j3333k0959o0m980o204n615J3790
20450d346J030j0406j0432O738J1693M376k2332j7936k0958j3991J8118L2781
20438b5665L8585O148l104l7275j2460k530K0303J2133q483m448j3065J177k061
20425c0745k702Q712N405j737J3978l42j941k062R050j9875k2442j8073K1390
20412d1384P141K0870M689j7780j8374J4103J0017J3382P877j0579J4107p575
20400c506j4853M584l427q504N81J5257l213m480K9028j0995n640Q722j6516j3943
$$ plain form
20386 -26905 -26774 -22086 -6250 505 -15306 -26903 -30551 8081 18442 4243 1505 24981 28982
20373 28982 334 -4548 21783 36699 -10615 -47327 -54431 -59967 -67166 -50902 -2939 16257
20361 16257 5846 -4657 8680 2279 15557 14811 3639 -14531 -6441 -53282 -48373 -32431 -22321
20348 -22321 -22786 -10215 8120 -1279 -1174 -922 -12379 -28346 -60489 -79279 -56880 -27063 -6661
20335 -6661 -792 -15363 -29217 -22453 -4599 -3339 -6632 9678 22422 5698 20037 22528 22559
20322 22559 20350 7645 -3988 -3390 -4340 -25529 -21721 -4609 -7286 -21922 -41682 -37477 -49813
20309 -49813 -54421 -52594 -41056 -32012 -28846 -23784 -43586 -47943 -38371 -19740 -12037 -24448 -20194
20296 -20194 377 -11638 -29606 -12622 -6556 -33537 -54089 -60669 -39975 -44648 -19835 -19453 -6049
$$ packed form
20386b6905J31M688J5836O755j5811j1597l648L8632J0361j4199k738K3476M001
20373B8982k8648m882K6331J4916m7314l6712p104n536p199J6264M7963J9196
20361A6257j0411j0503J3337o401J3278p46j1172j8170Q090m6841M909J5942J0110
20348b2321m65J2571J8335r399J05K52j1457j5967l2143j8790K2399K9817K0402
20335f661N869j4571j3854O764J7854J260l293J6310J2744j6724J4339K491L1
20322B2559k209j2705j1633N98r50k1189L808J7112k677j4636j9760M205j2336
20309d9813m608J827J1538R044L166N062j9802m357R572J8631P703j2411M254
20296b0194K0571j2015j7968J6984O066k6981k0552o580K0694m673K4813L82J3404
$$ plain form
20283 -6049 5117 5079 -6550 -19886 -23556 -49429 -27743 -16633 -6292 18871 19223 12207 6721
20270 6721 -3138 16796 1664 -6232 -8104 -13965 -7205 12554 6726 -399 -20361 -14496 2460
20257 2460 -10957 4885 26637 15561 16057 3439 -19630 2357 4726 -26930 -12414 12434
20245 12434 -938 -25712 -39211 -40276 -53535 -43759 -9220 -9752 -17670 366 4666 -15320 -6785
20232 -6785 -6835 -603 10460 4771 -16057 -16684 -17605 -17512 -24087 -23602 -30840 -35607 -2602 -3072 -37702 -33346
20216 -33346 -32803 -31936 -17259 -22962 -1378 1343 -24102 -55372 -79166 -48827 -6690 9458 35926
20203 35926 36187 -5280 -16885 19747 68374 73485 43019 20227 8260 3296 -12845 25698
20191 25698 41147 36823 24959 29389 18308 8802 18004 26122 19311 -10101 -13320 -24601 -29404
$$ packed form
20283f049J1166l8j1629j3336l670k5873K1686J1110J0341K5163L52p016n486
20270F721r859J9934j5132p896j872n861O760J9759n828p125j9962N865J6956
20257B460j3417J5842K1752j1076M96j2618k3069K1987K369l1656J4516K4848
20245A2434j3372k4774j3499j065j3259R776L4539n32p918J8036M300j9986Q535
20232f785n0O232J1063n689k0828o27r21R3o575M85p238m767L3005m70l4630M356
20216c3346N43Q67J4677n703K1584K721k5445l1270k3794L0339M2137J6148K6468
20203C5926K61m1467j1605L6632M8627N111l0466k2792j1967m964j6141L8543
20191B5698J5449m324j1864M430j1081r506R202Q118o811k9412l219j1281m803
$$ plain form
20178 -29404 -44870 -46467 1695 -6178 -10793 -27236 -36323 -20635 -18050 -34372 -58778 -73316 -60961
20165 -60961 -27820 -8565 7349 -13462 -32003 -22586 -15021 -11173 -39607 -48589 -30934 -7351
20153 -7351 -24894 -44861 -40498 -31411 -12812 5012 -16516 -37692 -39847 -18071 -21777 -45139 -41618
20140 -41618 -8481 6096 -10398 -5772 11173 -5301 -20652 -30042 -34618 -47827 -70496 -44466
20128 -44466 -43262 -25578 -34240 -45682 -26178 6934 13520 -12037 -13929 -15838 -17874 -6600 -1894
20115 -1894 11480 15605 13849 5774 -3315 29519 39809 24853 -3197 -5693 -700 24578 18181
20102 18181 -1011 -15655 -7575 375 -7105 -19411 -29479 -37110 -41300 -33215 -24726 -8607 -17805
20089 -17805 -23430 -18484 -35534 -48530 -39384 -18304 -25654 -28024 -17610 3302 17814 34067 13193
$$ packed form
20178b9404j5466j597M8162p873m615j6443r087J5688K585j6322k4406j4538J2355
20165f0961L3141J9255J5914k0811j8541R417P565L848k8434q982J7655K3583
20153g351j7543j9967M363R087J8599J7824k1528k1176k155K1776l706k3362L521
20140d1618L3137J4577j6494M626J6945j6474j5351r390m576j3209k2669K6030
20128d4466J204J7684q662j1442J9504L3112O586k5557j892j909k036J1274M706
20115a894J3374M125j756q075r089L2834J0290j4956k8050k496M993K5278o397
20102A8181j9192j4644Q080P950p480j2306j0068p631m190Q085Q489J6119r198
20089a7805n625M946j7050j2996R146K1080p350k370J0414K0912J4512J6253k0874
$$ plain form
20076 13193 10425 -4734 -6943 16644 27308 4434 -33631 -86191 -85389 -48635 -46965 -24827 -3822
20063 -3822 1495 3271 6546 -859 398 13787 38760 30982 5507 -2420 -50805 -65998 -60828
20050 -60828 -56890 -45508 -31765 -20208 -9578 572 -759 -17551 -8170 -7906 -210 -128 -16425
20037 -16425 -25302 7313 -7815 -23683 -40244 -47394 -53278 -38738 -15812 -16575 -17195 -10825 -25191
20024 -25191 -31246 -27382 -5079 26242 22290 15883 12060 -5891 -36855 -56296 -74865 -50424 -21247
20011 -21247 -6831 -39984 -66145 -59053 -36692 -10083 -15583 -43803 -57405 -59298 -60313 -70824
19999 -70824 -75984 -49944 -40829 -56518 -49299 -41290 -34741 -30727 -33686 -30638 -37881 -1008 -1227 -27937
19985 -27937 -32786 -28277 -28010 -22060 -29876 -35432 -41584 -39260 -50015 -72643 -80852 -84576 -81531 -79471
$$ packed form
20076A3193k768j5159k209K3587J0664k2874l8065n2560Q02L6754J670K2138K1005
20063c822N317J776L275p405J257J3389K4973p778k5475p927m8385j5193N170
20050f0828L938J1382J3743J1557J0630J0150j331j6792R381K64P696Q2j6297
20037a6425q877L2615j5128j5868j6561p150n884J4540K2926p63o20O370j4366
20024b5191o055L864K2303L1321l952o407l823j7951l0964j9441j8569K4441K9177
20011b1247J4416l3153k6161P092K2361K6609n500k8220j3602j893j015j0511
19999g0824n160K6040R115j5689P219Q009O549M014k959L048p243L6873k19k6710
19985b7937m849M509K67N950p816n556o152K324j0755k2628q209l724L045K060
$$ plain form
19971 -79471 -75967 -39261 9835 -12122 -20624 -8463 -3255 16133 17895 24960 27930 13902 -25831
19958 -25831 -15695 -13627 -10450 -21997 -32273 -23540 -30150 -18269 -1604 -19232 -22193 -17742 -1201
19945 -1201 -7834 -37021 -13819 8746 -18745 -32063 -13334 -24298 -11302 -17034 -29687 -13287
19933 -13287 -2229 7195 -15039 -9346 -20131 -6365 4645 10474 8654 -1754 1936 -10234 -20319
19920 -20319 -26212 -42995 -23342 -18162 9742 -1982 -13470 -30584 -26726 -47194 -34697 -33232
19908 -33232 -30898 1010 -12661 -28564 -26964 -51238 -55021 -34862 -23534 -4074 -3188 -26734 -44505
19895 -44505 -48505 -34098 -31543 -30315 -42768 -44597 -3927 9213 -39554 -18580 11896 17730 18921
19882 18921 12190 15956 2255 -18162 -25854 -40957 -32692 1560 24163 17025 9388 -25833 -54324
$$ packed form
19971g9471L504L6706M9096k1957q502J2161N208J9388J762P065K970j4028l9733
19958b5831J0136K068L177j1547j0276Q733o610J1881J6665j7628k961M451J6541
19945a201o633k9187K3202K2565k7491j3318J8729j0964J2996n732j2653J6400
19933a3287J1058R424k2234N693j0785J3766J1010N829j820j0408L690j2170j0085
19920b0319n893j6783J9653N180K7904j1724j1488j7114L858k0468J2497J465
19908c3232K334L1908j3671j5903J600k4274l783K0159J1328J9460Q86k3546j7771
19895d4505m000J4407K555J228j2453j829M0670J3140m8767K0974L0476N834J191
19882A8921o731L766j3701k0417p692j5103Q265L4252K2603p138p637l5221k8491
$$ plain form
19869 -54324 -75265 -58781 -55218 -54560 -78226 -85058 -60985 -26774 -31529 -19398 2098 24379 -4120
19856 -4120 -15010 2328 15393 -26102 -37062 -33138 -34164 -40608 -48865 -43979 -14811 -5972 -3672
19843 -3672 -26967 -9354 9479 5860 -1293 -3845 -1914 -3447 -29733 -31672 -18836 -28722 -19819
19830 -19819 -24871 -37518 -71514 -76461 -26035 450 8922 -29317 -52780 -32382 -35864 -11548
19818 -11548 20576 7066 2810 -5092 9301 -12096 -11288 18803 37969 35238 1023 -32827 -37176
19805 -37176 -53192 -34278 -32956 -9250 737 1738 287 -5253 -8854 -17155 -36617 -61405 -62092
19792 -62092 -53678 -43744 -54867 -41419 -17488 -23743 -51116 -46939 -13864 2289 3461 -40103 -45591
19779 -45591 -35750 -9430 10324 10469 16705 30382 36442 17153 38143 39372 43049 31331 26236
$$ packed form
19869e4324k0941J6484L563O58k3666o832K4073L4211m755J2131K1496K2281k8499
19856d120j0890J7338J3065m1495j0960L924j026o444q257M886K9168Q839K300
19843c672k3295J7613J8833l619p153k552J931j533k6286j939J2836r886Q903
19830a9819n052j2647l3996m947N0426K6485Q472l8239k3463K0398l482K4316
19818a1548L2124j3510m256p902J4393k1397Q08L0091J9166k731l4215l3850m349
19805c7176j6016J8914J322K3706R987J001j451n540l601q301j9462k4788o87
19792f2092Q414R934j1123J3448K3931o255k7373M177L3075J6153J172m3564n488
19779d5591R841K6320J9754J45O236J3677O060j9289K0990J229L677j1718n095
$$ plain form
19766 26236 18351 5643 2987 -3887 -15790 -12624 15992 -2181 -20101 25890 74422 54739
19754 54739 19699 -7737 -4252 -11491 -20661 387 -15652 -38236 -54951 -36969 -51991 -56496
19742 -56496 -22332 10370 1580 -16389 -36233 -23525 -8015 -4237 3097 6599 -2356 -10815 -5725
19729 -5725 -6263 -22963 -16139 3423 -1576 -16229 5868 29660 11923 -20254 -37297 -20576 -98
19716 -98 15161 -10611 -47548 -44433 -16671 -22107 -26243 1745 -13415 -33374 -15529 -33130 -30814
19703 -30814 -22811 -14334 -15837 -49058 -14464 20438 -9086 -26826 -7432 3598 22674 40730
19691 40730 47433 57109 13069 -15744 -28490 -34090 -15887 14986 -1686 920 16110 7236 25635
19678 25635 53406 43547 11814 4362 12706 -4003 -12668 -23606 -16930 -12857 -8342 -14889 -42369
$$ packed form
19766B6236p885j2708k656o874j1903L166K8616j8173j7920M5991M8532j9683
19754E4739l5040k7436L485p239r170K1048j6039k2584j6715J7982j5022m505
19742e6496L4164L2702q790j7969j9844J2708J5510L778P334L502q955q459N090
19729e725n38j6700O824J9562m999j4653K2097K3792j7737l2177j7043J6721K0478
19716i8J5259k5772l6937L115K7762n436m136K7988j5160j9959J7845j7601K316
19703c0814Q003Q477j503l3221L4594L4902k9524j7740J9394J1030J9076J8056
19691D0730O703R676m4040k8813j2746n600J8203L0873j6672K606J5190q874J8399
19678B5635K7771r859l1733p452Q344j6709q665j0938O676M073M515o547k7480
$$ plain form
19665 -42369 -35432 -12011 9778 -21227 -20635 5670 2635 2877 29400 9934 -4626 -12824 20171
19652 20171 28444 -32485 -46784 -52496 -31723 -23328 -30308 -27215 -17116 -11217 -15873 -14624 20469
19639 20469 57531 43945 17888 1229 7630 -13954 -22577 5551 9233 -8416 -11269 5777
19627 5777 16173 45350 41478 14013 17296 11794 -12489 -41468 -19764 -800 1877 -11299 4309
19614 4309 5815 -22103 -45855 -49054 -21647 1936 11117 17388 10364 14665 6149 -10689 -32211
19601 -32211 -53246 -28657 -13459 7461 37370 14538 2094 9724 19675 1591 -35121 -17576
19589 -17576 -32086 -44468 -32547 -4798 119 -12705 -21538 -43251 -20642 -11003 24097 9462
19577 9462 -12440 -29071 -53109 -23462 -16471 -24160 -52998 -53085 -48586 -43727 -2876 32921 39085
$$ packed form
19665d2369O937K3421K1789l1005N92K6305l035K42K6523j9466j4560q198L2995
19652B0171Q273o0929j4299n712K0773Q395o980L093J0099N899m656J249L5093
19639B0469L7062j3586k6057j6659O401k1584q623K8128L682j7649k853J7046
19627E777J0396K9177l872k7465L283n502k4283k8979K1704J8964K677j3176J5608
19614D309J506k7918k3752l199K7407K3583R181O271p024M301q516j6838k1522
19601c2211k1035K4589J5198K0920K9909k2832j2444P630R951j8084l6712J7545
19589a7576j4510j2382J1921K7749M917j2824q833k1713K2609R639L5100j4635
19577I462k1902j6631k4038K9647O991p689k8838q7M499M859M0851L5797O164
$$ plain form
19564 39085 10417 -5998 -25601 -35451 -28604 -20875 -17853 -2439 -28073 -28314 -40916 -40375 -4033
19551 -4033 -10841 -30868 -18648 5658 25865 30551 37545 29766 -537 4539 4520 -194 775 16235
19537 16235 21719 -4089 -15199 -24245 -44084 -21850 18020 31853 7490 -10062 6749 14554
19525 14554 -404 -9653 1351 18631 19516 12650 8712 -6226 -20567 -15320 -20059 -28163 -37231
19512 -37231 -51754 -63978 -66153 -41983 -47609 -55956 -62134 -37966 -14904 -23691 -36799 -37918 -37740
19499 -37740 -24779 -31129 -30541 -6468 -27824 -41010 -48450 -37764 -7891 10657 23400 7550
19487 7550 8093 25055 13829 -1563 -15057 9929 21231 9912 -22636 -63066 -68131 -14478
19475 -14478 -13662 -40243 -46554 -42418 -36776 -23755 -12892 -1754 -8815 -17897 -13427 2451 6987
$$ packed form
19564C9085k8668j6415j9603r850O847P729L022J5414k5634k41j2602N41L6342
19551d033o808k0027J2220K4306K0207M686O994p779l0303N076j9m714R69J5460
19537A6235N484k5808j1110r046j9839K2234L9870J3833k4363j7552J6811P805
19525A4554j4958r249J1004J7280Q85o866l938j4938j4341N247m739q104r068
19512c7231j4523j2224k175K4170n626q347o178K4168K3062q787j3108j119J78
19499c7740J2961o350N88K4073k1356j3186p440J0686K9873J8548J2743j5850
19487G550N43J6962j1226j5392j3494K4986J1302j1319l2548m0430n065N3653
19475a4478Q16k6581o311M136N642J3021J0863J1138p061r082M470J5878M536
$$ plain form
19462 6987 10326 13775 16662 18968 10492 26229 30142 28602 -829 5317 10580 24861 5255 -14746
19448 -14746 -26739 -46173 -41162 -7636 18509 25491 24205 44151 40188 27439 12091 6172 -9138
19435 -9138 -29475 -20891 4914 -11593 -56253 -79493 -45352 -33782 -57290 -80256 -67254 -40408
19423 -40408 -30908 -18093 -13063 -2136 584 -10251 -8880 -4337 -18025 -49767 -19087 -7133 15806
19410 15806 24913 25572 16129 34432 38202 42642 50294 56704 85502 104311 116397 108892 123149
19397 123149 155369 167290 195509 227259 250466 239228 230497 265922 290749 319063 361643 362625
19385 362625 345469 373083 390390 355448 344982 345470 362849 338663 296405 264831 223326 198791
19373 198791 158369 110750 62039 44130 40049 42065 42679 26856 29049 49292 50686 63356 100677
$$ packed form
19462F987L339L449K887K306q476J5737L913j540k9431O146N263J4281j9606k0001
19448a4746j1993j9434N011L3526K6145O982j286J9946l963j2749j5348n919j5310
19435i138k0337Q584K5805j6507m4660k3240L4141J1570k3508k2966J3002K6846
19423d0408R500J2815N030J0927K720j0835J371M543j3688l1742L0680J1954K2939
19410A5806R107O59r443J8303L770M440P652O410K8798J8809J2086p505J4257
19397A23149L2220J1921K8219L1750K3207j1238q731L5425K4827K8314M2580R82
19385C62625j7156K7614J7307l4942j0466M88J7379k4186m2258l1574m1505k4535
19373A98791m0422m7619m8711j7909m081K016O14j5823K193K0243J394J2670L7321
$$ plain form
19360 100677 95253 88174 92799 111349 114681 84667 59229 41162 26321 15003 28593 39882
19348 39882 37390 20127 -7169 -6127 25424 49423 34211 13660 2675 -1846 -17650 -11492
19336 -11492 5343 -8237 1540 13537 27355 33241 15670 20150 37631 32087 31348 37461 36613
19323 36613 31169 61542 87194 87416 75268 73774 88779 90560 77324 46976 45906 45617 67853
19310 67853 81332 66024 52847 71720 55183 40635 31200 43769 43797 43371 54705 62957 77837
19297 77837 70397 47214 10764 5653 22341 36720 43712 19675 15928 47553 60067 47153
19285 47153 47095 51090 44617 36468 27044 39439 31983 25845 56040 66175 70931 70309 56197 63478
19271 63478 49561 12087 20857 63164 59093 47277 43255 25022 17344 22787 25715 15037 25331
$$ packed form
19360A00677n424p079M625J8550L332l0014k5438j8067j4841j1318J3590J1289
19348C9882k492j7263k7296J042L1551K3999j5212k0551j0985m521j5804O158
19336a1492J6835j3580R777J1997J3818N886j7571M480J7481n544p39O113q48
19323C6613n444L0373K5652K22j2148j494J5005J781j3236l0348j070k89K2236
19310F7853J3479j5308j3177J8873j6537j4548r435J2569K8m26J1334Q252J4880
19297G7837p440k3183l6450n111J6688J4379O992k4037l747L1625J2514j2914
19285D7153n8L995o473q149r424J2395p456o138L0195J0135M756o22j4112P281
19271F3478j3917l7474Q770M2307m071j1816m022j8233p678N443K928j0678J0294
$$ plain form
19258 25331 14186 6805 -2562 13638 7792 10830 16687 7665 -5229 -9580 -21868 -24825 -11790
19245 -11790 -15865 -41420 -27435 -27388 -10082 -16371 4650 -8507 -7572 -5278 -15008 -17018 -25083 -24204
19231 -24204 913 -8578 4258 7728 763 -17802 -10049 20102 8844 27062 53995 33764
19219 33764 29592 17891 -9397 2248 10433 13023 35098 39332 21993 29113 54762 52296 62414
19206 62414 45480 61977 87373 60780 39040 18989 -10977 -32667 1033 7193 -16891 3001
19194 3001 12460 -148 -20693 -20031 11113 8397 8276 -90 -17530 -28773 -34332 2747 24756
19181 24756 28223 27961 9175 -10663 -8406 17009 36722 33321 20998 7901 -12536 10512 18053
19168 18053 32542 14534 2845 -22611 15270 26793 25932 41569 70351 86386 88146 64041
$$ packed form
19258B5331j1145p381r367J6200n846L038N857r022j2894m351j2288k957J3035
19245a1790m075k5555J3985M7J7306o289K1021j3157R35K294r730k010q065Q79
19231b4204K5117r491J2836L470o965j8565P753L0151j1258J8218K6933k0231
19219C3764m172j1701k7288J1645Q185K590K2075M234j7339P120K5649k466J0118
19206F2414j6934J6497K5396k6593k1740k0051k9966k1690L3700O160k4084J9892
19194C001R459j2608k0545O62L1144k716j21q366j7440j1243n559L7079K2009
19181B4756L467k62j8786j9838K257K5415J9713l401j2323j3097k0437K3048P541
19168A8053J4489j8008j1689k5456L7881J1523q61J5637K8782J6035J760k4105
$$ plain form
19156 64041 40622 36540 40779 30528 33376 50120 86053 110737 127026 143644 173326 186895
19144 186895 220989 237133 270838 279180 304550 334930 352503 351674 342888 409040 479202 549199
19132 549199 615435 764334 921765 1090185 1271884 1436919 1637607 1823802 1869616 1733734
19122 1733734 1570850 1495417 1488826 1440818 1300400 1202823 1223761 1291697 1394068 1526171 1677322
19111 1677322 1824725 1816275 1595554 1422802 1350257 1287187 1140061 852382 630368 479675
19101 479675 400873 376850 340481 293215 272412 256585 249229 240401 237043 228947 223170 202052
19089 202052 198224 177138 161781 150919 148965 161958 164934 156473 125459 126031 131931 127003 112289
19076 112289 79547 35583 65461 75410 57608 36471 34703 54897 45896 38562 27865 24281
$$ packed form
19156F4041k3419m082M239j0251K848J6744L5933K4684J6289J6618K9682J3569
19144A86895L4094J6144L3705Q342K5370L0380J7573q29q786O6152P0162O9997
19132E49199O6236J48899J57431J68420J81699J65035K00688J86195M5814j35882
19122A733734j62884p5433o591m8008j40418r7577K0938O7936J02371J32103J51151
19111A677322J47403q450k20721j72752p2545o3070j47126k87679k22014j50693
19101D79675p8802k4023l6369m7266k0803j5827p356q828l358q096n777k1118
19089B02052l828k1086j5357j0862j954J2993K976q461l1014N72N900m928j4714
19076A12289l2742m3964K9878R949j7802k1137j768K0194r001p334j0697l584
$$ plain form
19064 24281 45689 36150 25658 27882 14373 7959 8082 19754 43588 48185 45406 42186 31276
19051 31276 30377 35559 25671 28880 55034 39826 30725 56805 47795 39067 31026 43776 69335
19038 69335 73468 40040 23620 10810 50194 54477 34231 30086 13731 15992 26085 30059 15845
19025 15845 5849 11506 7717 3203 -5367 8379 41680 10838 27051 38336 21418 22140 26193
19012 26193 30125 28977 15714 21478 18457 10474 -14975 -23449 -19356 -5806 -29735 -19574 24390
18999 24390 54323 48333 35764 50263 62648 75401 80008 44104 -5232 -27926 -15745 41923
18987 41923 42813 15591 17090 18571 17545 17352 34135 32323 26812 -1219 -2990 8548 -16396 -5747
18973 -5747 8927 -1547 -7262 4241 50242 64833 51475 63050 41008 26519 -8284 2105
$$ packed form
19064B4281K1408r539j0492K224j3509o414J23J1672K3834M597k779l220j0910
19051C1276q99N182r888L209K6154j5208r101K6080r010q728q041J2750K5559
19038F9335M133l3428j6420j2810L9384M283k0246m145j6355K261J0093L974j4214
19025A5845r996N657l789m514q570J3746L3301l0842J6213J1285j6918P22M053
19012B6193L932j148j3263N764l021p983k5449q474M093J3550k3929J0161M3964
18999B4390K9933n990j2569J4499J2385J2753M607l5904m9336k2694J2181N7668
18987D1923Q90k7222J499J481j026j93J6783j812n511k8031j771J1538k4944J0649
18973e747J4674j0474n715J1503M6001J4591j3358J1575k2042j4489l4803J0389
$$ plain form
18961 2105 -245 15221 36009 14478 11043 9235 33864 51366 31087 13059 23508 17530 -7237
18948 -7237 -11889 -14765 -7940 -7593 9903 -844 1235 12357 -21311 -47481 -29755 -114 10298
18935 10298 28117 23374 10265 -17205 -36891 -36577 -24270 10455 33118 64507 68554 63956 74132
18922 74132 72267 92909 107859 77490 46998 62598 58253 61773 55510 17145 35992 33289 40873
18909 40873 79408 84651 86511 76817 73004 73048 73792 78582 72802 68588 81029 90817 89178 105315
18895 105315 99132 72458 54472 15183 33243 53575 74008 62821 24106 51530 56689 64336
18883 64336 60592 50549 50985 51219 50610 47008 38990 27160 38344 34859 38974 57727 74196 97887
18869 97887 96256 80966 67578 70815 50220 79382 82757 85463 110090 102913 86505 69796 76157
$$ packed form
18961B105k350J5466K0788k1531l435j808K4629J7502k0279j8028J0449n978k4767
18948g237m652k876O825L47J7496j0747K079J1122l3668k6170J7726K9641J0412
18935A0298J7819m743j3109k7470j9686L14J2307L4725K2663L1389M047m598J0176
18922G4132j865K0642J4950l0369l0492J5600m345L520o263l8365J8847k703P584
18909D0873L8535N243J860r694l813M4P44M790n780m214J2441R788j639J6137
18895A05315o183k6674j7986l9289J8060K0332K0433j1187l8715K7424N159P647
18883F4336l744j0043M36K34o09l602q018j1830J1184l485M115J8753J6469K3691
18869I7887j631j5290j3388L237k0595K9162L375K706K4627p177j6408j6709O361
$$ plain form
18856 76157 64547 64586 72612 64430 68140 76069 77859 90130 101119 100582 93526 97903 83613 85869
18842 85869 68854 74425 96082 103166 84254 68979 77588 73464 89534 127637 147410 132211
18830 132211 125257 117373 126670 126762 89674 74377 52935 28929 13954 10678 19984 37596 52661
18817 52661 48931 25360 28540 35193 51787 36021 57512 74953 85384 59190 68848 87110
18805 87110 80128 71490 52651 31654 21323 45123 57567 55594 68770 44223 67988 73078
18793 73078 73670 57743 58241 68789 63719 52337 64489 50421 18708 34264 70858 107174 101794
18780 101794 77979 60928 67924 44109 51162 85256 110241 118072 159823 181108 191704 227145
18768 227145 249575 274006 272885 273695 292152 282742 217586 176469 176854 204272 206623 196783 190582
$$ packed form
18856G6157j1610L9Q026q182L710P929J790J2271J0989n37p056M377j4290K256
18842H5869j7015N571K1657P084j8912j5275Q609m124J6070L8103J9773j5199
18830A32211o954p884R297R2l7088j5297k1442k4006j4975l276R306J7612J5065
18817E2661l730k3571L180O653J6594j5766K1491J7441J0431k6194R658J8262
18805H7110o982q638j8839k0997j0331K3800J2444j973J3176k4547K3765N090
18793G3078N92j5927M98J0548n070j1382J2152j4068l1713J5556L6594L6316n380
18780A01794k3815j7051O996k3815P053L4094K4985P831M1751K1285J0596L5441
18768B27145K2430K4431j121Q10J8457r410o5156m1117L85K7418K351r840o201
$$ plain form
18755 190582 193979 207070 243974 232553 217975 226956 212681 182024 182207 188758 181509 166564 196225
18742 196225 231063 232717 217415 214700 207893 233779 248495 253299 252379 234851 218521 205999 224507
18729 224507 244205 260070 275128 284085 274029 282898 310454 310218 314308 338359 339075 344048 336183
18716 336183 329230 362085 371514 359552 353158 334071 309318 300636 280594 270021 269371 262391 282048
18703 282048 271124 227693 212942 232456 243636 257610 232004 175454 166998 192175 179268 144503
18691 144503 138924 158383 181407 190368 190383 196960 211981 199933 170826 183358 189552 184553 218772
18678 218772 239518 213749 198856 246750 264798 262374 263369 283690 283651 273189 261726 216579 214635
18665 214635 212186 189074 190532 203570 209910 200832 205840 180654 160896 164349 158395 123115 64996
$$ packed form
18755A90582L397J3091L6904j1421j4578Q981j4275l0657J83O551p249j4945K9661
18742A96225L4838J654j5302k715o807K5886J4716M804r20j7528j6330j2522J8508
18729B24507J9698J5865J5058Q957j0056Q869K7556k36M090K4051P16M973p865
18716C36183o953L2855R429j1962o394j9087k4753q682k0042j0573o50o980J9657
18703B82048j0924m3431j4751J9514J1180J3974k5606n6550q456K5177j2907l4765
18691A44503n579J9459K3024Q961J5O577J5021j2048k9107J2532O194m999L4219
18678B18772K0746k5769j4893M7894J8048k424R95K0321l9j0462j1463m5147j944
18665B14635k449k3112J458J3038O340r078N008k5186j9758L453n954l5280n8119
$$ plain form
18652 64996 35297 21479 24059 30432 43931 46079 35001 49486 63378 75114 74500 68447 78592
18639 78592 54848 39000 32804 32341 25993 32424 47404 66504 45843 29667 72401 124531 147051
18626 147051 162382 173230 169316 159769 168520 186766 209979 269693 358669 380046 405726 422416
18614 422416 433524 496785 499626 529094 578005 604607 646992 684949 716969 762049 803796 800042
18602 800042 796750 783833 757884 706941 665027 640163 616576 635332 633302 593931 553422 516571
18590 516571 465888 423618 416472 366122 293235 223171 209728 167445 96743 48130 41718 33531
18578 33531 -2056 -12986 21602 74420 84747 39904 42987 70010 85022 83700 61043 60411
18566 60411 78839 121755 133708 192991 257270 286018 297966 308351 357170 425315 493967 507975
$$ packed form
18652F4996k9699j3818K580O373J3499K148j1078J4485J3892J1736o14o053J0145
18639G8592k3744j5848o196m63o348O431J4980J9100k0661j6176M2734N2130K2520
18626A47051J5331J0848l914r547Q751J8246K3213N9714Q8976K1377K5680J6690
18614D22416J1108O3261K841K9468M8911K6602M2385L7957L2020M5080M1747l754
18602H00042l292j2917k5949n0943m1914k4864k3587J8756k030l9371m0509l6851
18590E16571n0683m2270p146n0350p2887p0064j3443m2283p0702m8613o412q187
18578C3531l5587j0930L4588N2818J0327m4843L083K7023J5012j322k2657o32
18566F0411J8428M2916J1953N9283O4279K8748J1948J0385M8819O8145O8652J4008
$$ plain form
18554 507975 497389 477652 501628 520909 509749 495791 543208 616272 629012 615616 636348
18543 636348 661641 677045 717120 753331 829158 908821 967793 1007808 1046151 1053837 1065017 1071740
18531 1071740 1109918 1143687 1208528 1264676 1339493 1397360 1481073 1595433 1701784 1803388 1890188
18520 1890188 1964885 2048806 2136432 2249901 2349564 2457405 2577983 2734383 2907874 3103650
18510 3103650 3345777 3648880 3965085 4236431 4515332 4831754 5172967 5473277 5628393
18501 5628393 5831419 6191080 6629317 7120080 7499786 7976813 8705849 9605518 10666652
18492 10666652 11897798 13332086 14878524 16683557 18786176 21365728 24471761 28004121
18484 28004121 31922978 36022030 40190630 44415800 48479758 52463934 56476957 60314957
$$ packed form
18554E07975j0586j9737K3976J9281j1160j3958M7417P3064J2740j3396K0732
18543F36348K5293J5404M0075L6211P5827P9663N8972M0015L8343P686J1180O723
18531A071740L8178L3769O4841N6148P4817N7867Q3713J14360J06351J01604Q6800
18520A890188P4697Q3921Q7626J13469R9663J07841J20578J56400J73491J95776
18510C103650K42127L03103L16205K71346K78901L16422L41213L00310J55116
18501E628393K03026L59661M38237M90763L79706M77027P29036Q99669J061134
18492A0666652J231146J434288J546438J805033K102619K579552L106033L532360
18484B8004121L918857M099052M168600M225170M063958L984176M013023L838000
$$ plain form
18476 60314957 64185091 68982499 76096449 87279540 105181288 130578903 160372096
18469 160372096 191048325 220402993 250613265 285652673 319586150 337541139 314293776
18462 314293776 283435384 272051680 271172241 266477166 235592173 208101228 206860022
18455 206860022 219539552 237200108 259675287 289089665 317452249 327155489 295333724
18448 295333724 261352811 246710274 239096283 220721052 168287579 117194052 88825346
18441 88825346 73292982 63694346 57425266 53064215 49756544 47022881 44543827 42311656
18433 42311656 40309549 38357400 36245254 34058891 31960120 30042732 28240697 26429933
18425 26429933 24826264 23468953 22215299 20869929 19270505 17829313 16669248 15595755
$$ packed form
18476F0314957L870134M797408P113950J1183091J7901748K5397615K9793193
18469A60372096L0676229K9354668L0210272L5039408L3933477J7954989k3247363
18462C14293776l0858392j1383704q79439m695075l0884993k7490945j241206
18455B06860022J2679530J7660556K2475179K9414378K8362584R703240l1821765
18448B95333724l3980913j4642537p613991j8375231n2433473n1093527k8368706
18441H8825346j5532364r598636o269080m361051l307671k733663k479054k232171
18433D2311656k002107j952149k112146k186363k098771j917388j802035j810764
18425B6429933j603669j357311j253654j345370j599424j441192j160065j073493
$$ plain form
18417 15595755 14526855 13302019 12274521 11577495 11057455 10598061 10195493 9879388 9585223
18408 9585223 9195713 8649713 8139701 7691606 7288059 6807689 6224462 5741321 5357648
18399 5357648 5021070 4715351 4480352 4284959 4080232 3909673 3727923 3565495 3406376
18390 3406376 3277367 3165165 3047170 2927497 2821945 2704961 2578436 2457451 2371240 2278711
18380 2278711 2194363 2113696 2016504 1937937 1896016 1849026 1790607 1765950 1741433 1740333 1710046
18369 1710046 1656131 1598320 1556845 1538243 1517613 1470357 1416197 1411879 1399762 1430665 1426982 1421205
18357 1421205 1413027 1390916 1385459 1435643 1451682 1466365 1487094 1511704 1566520 1585574 1583875 1551035
18345 1551035 1559869 1583341 1619208 1668004 1705027 1723784 1828927 1965190 2100086 2126321 2092802
$$ packed form
18417A5595755j068900j224836j027498o97026n20040m59394m02568l16105k94165
18408I585223l89510n46000n10012m48095m03547m80370n83227m83141l83673
18399E357648l36578l05719k34999j95393k04727j70559j81750j62428j59119
18390C406376j29009j12202j17995j19673j05552j16984j26525j20985q6211r2529
18380B278711q4348q0667r7192p8567m1921m6990n8419k4657k4517j100l0287
18369A710046n3915n7811m1475j8602k0630m7256n4160m318j2117L0903l683n777
18357A421205q178k2111n457N0184J6039J4683K0729K4610N4816J9054j699l2840
18345A551035Q834K3472L5867M8796L7023J8757J05143J36263J34896K6235l3519
$$ plain form
18334 2092802 2079661 2051892 1958860 1794103 1661536 1569542 1499269 1417280 1375396 1408174 1479418
18323 1479418 1525931 1469602 1372199 1317716 1242700 1120645 967292 849260 742783 656341
18313 656341 551391 471505 458642 487699 491509 475341 473960 479408 531731 564596 570231 577408
18301 577408 578711 604187 647236 683501 693839 700941 734599 739057 730752 705993 699261 730194
18289 730194 747216 745106 736403 728580 727112 733772 733660 743055 790223 786724 747903 711253 703670
18276 703670 707952 675694 665801 634149 596965 590181 576862 602317 633074 605422 614863 627848
18264 627848 616023 614505 596425 532116 500942 485734 466152 397131 339871 333224 327249 328104
18252 328104 315838 328498 354019 350687 316118 264946 279731 301027 276874 234457 210811 183776
$$ packed form
18334B092802j3141k7769r3032j64757j32567r1994p0273q1989m1884L2778P1244
18323A479418M6513n6329r7403n4483p5016j22055j53353j18032j06477q6442
18313F56341j04950p9886j2863K9057L810j6168j381N448N2323L2865N635P177
18301E77408J303K5476M3049L6265J0338P102L3658M458q305k4759o732L0933
18289G30194J7022k110q703p823j468O660j12R395M7168l499l8821l6650p583
18276G03670M282l2258r893l1652l7184o784j3319K5455L0757k7652R441J2985
18264F27848j1825j518j8080o4309l1174j5208j9582o9021n7260o647n975Q55
18252C28104j2266J2660K5521l332l4569n1172J4785K1296k4153m2417k3646k7035
$$ plain form
18240 183776 179889 142494 119531 97209 73398 90447 126812 133965 114411 112338 120916 82263
18228 82263 80838 78364 81876 101787 123275 163895 189497 195647 168509 157885 142236 136827 135268
18215 135268 142004 132077 134910 132590 132857 148380 146626 156151 153119 151401 156065 166737 152179 163140
18201 163140 166016 148031 128695 124029 105854 96876 119812 145355 161259 161551 142850 102394
18189 102394 85229 74683 94999 125054 155714 153154 148225 146595 154294 134523 117443 111274
18177 111274 109492 123927 124631 136115 144299 144474 116376 95992 100387 129203 123512 117168 119753
18164 119753 124046 134960 129517 134057 145830 135840 152337 136328 130857 151224 155559 168779 200603
18151 200603 210701 188671 203635 202039 198616 224290 231449 238510 235695 244450 273752 331896 366088
$$ packed form
18240A83776l887l7395k2963k2322k3811J7049L6365P153j9554k073Q578l8653
18228H2263j425k474L512J9911K1488M0620K5602O150k7138j0624j5649n409j559
18215A35268O736r927K833k320K67J5523j754R525l032j718M664J0672j4558J0961
18201A63140K876j7985j9336m666j8175q978K2936K5543J5904K92j8701m0456
18189A02394j7165j0546K0316L0055L0660k560m929j630P699j9771j7080o169
18177A11274j782J4435P04J1484Q184J75k8098k0384M395K8816n691o344K585
18164A19753M293J0914n443M540J1773r990J6497j6009n471K0367M335J3220L1824
18151B00603J0098k2030J4964j596l423K5674P159P061k815Q755K9302N8144L4192
$$ plain form
18138 366088 396119 458077 510941 585693 641375 701965 778599 871915 1016497 1209513 1456624
18127 1456624 1755961 2086527 2448176 2880033 3270750 3594213 3906572 4125243 4235952
18118 4235952 4335484 4405384 4522308 4788932 5364619 6484967 8533842 11821146 15746744
18109 15746744 19617257 22721167 24859855 26715894 28233824 28075976 21809268 13104418
18101 13104418 8204637 5865480 4615400 3823884 3316978 2983493 2749211 2573267 2465631
18092 2465631 2376084 2300006 2243079 2159204 2081872 1963854 1816251 1715744 1581487 1429739
18082 1429739 1321198 1225243 1116689 1014227 964943 913347 854755 753208 681563 648846
18072 648846 592358 529834 511341 502300 468011 441705 429244 415856 367399 341675 334021 335008
$$ packed form
18138C66088L0031O1958N2864P4752N5682O0590P6634R3316J44582J93016K47111
18127A456624K99337L30566L61649M31857L90717L23463L12359K18671J10709
18118D235952R9532O9900J16924K66624N75687J120348K048875L287304L925598
18109A5746744L870513L103910K138688J856039J517930j57848o266708q704850
18101A3104418m899781k339157j250080p91516n06906l33485k34282j75944j07636
18092B465631q9547p6078n6927q3875p7332j18018j47603j00507j34257j51748
18082A429739j08541r5955j08554j02462m9284n1596n8592j01547p1645l2717
18072F48846n6488o2524j8493r041l4289k6306j2461j3388m8457k5724p654R87
$$ plain form
18060 335008 326923 296510 276553 263599 236084 233303 234842 205425 170668 128893 124555 122456
18048 122456 147061 138820 142367 143034 149684 130478 119155 98408 96057 100706 94452 91258 94067
18035 94067 78781 79981 112392 119039 130920 124196 117921 109349 81637 67059 77081 117193 122025
18022 122025 107210 87829 97395 109630 120375 130129 98027 77161 99772 142596 179007 167288
18010 167288 155161 129031 120012 105515 70066 41212 62866 77593 75414 84558 113221 132048
17998 132048 116850 89432 66108 57112 99272 126503 136807 141700 120076 117691 88562 67832
17986 67832 77582 77288 92764 104922 98150 84105 103838 127408 110048 137172 166289 176285 130827
17973 130827 106374 79941 68511 29418 22902 35638 32626 29726 33725 40907 29693 25003 12846
$$ packed form
18060C35008q085l0413j9957j2954k7515k781J539k9417l4757m1775m338k099
18048A22456K4605q241L547O67O650j9206j1323k0747k351M649o254l194K809
18035I4067j5286J200L2411O647J1881o724o275q572k7712j4578J0022M0112M832
18022A22025j4815j9381R566J2235J0745R754l2102k0866K2611M2824L6411j1719
18010A67288j2127k6130r019j4497l5449k8854K1654J4727k179R144K8663J8827
17998A32048j5198k7418k3324q996M2160K7231J0304M893k1624k385k9129k0730
17986F7832R750k94J5476J2158o772j4045J9733K3570j7360K7124K9117R996m5458
17973A30827k4453k6433j1430l9093o516J2736l012k900L999P182j1214m690j2157
$$ plain form
17960 12846 18662 28713 88000 97064 102044 111284 77136 63345 84744 87098 82613 73777 92786
17947 92786 94026 62108 29692 13617 38351 78624 93523 99030 137235 130012 115514 125414
17935 125414 113937 130927 157590 167928 172402 168804 223460 268931 274451 285103 293198 313906
17923 313906 361886 383773 397717 427887 451220 477183 506166 549752 608279 746846 932812
17912 932812 1137973 1377768 1644787 1897409 2099874 2234480 2179682 1953056 1772702 1521008
17902 1521008 1186054 1033885 1044570 1137137 1294595 1465383 1629311 1812807 1936418 2011134
17892 2011134 1921318 1691988 1462911 1149432 833236 661309 541961 460783 402739 350532
17882 350532 332981 311708 292040 285864 261287 264797 265389 267862 254448 270717 237662 201572
$$ packed form
17960A2846N816J0051N9287R064M980R240l4148j3791K1399K354m485q836J9009
17947I2786J240l1918l2416j6075K4734M0273J4899N507L8205p223j4498R900
17935A25414j1477J6990K6663J0338M474l598N4656M5471N520J0652Q095K0708
17923C13906M7980K1887J3944L0170K3333K5963K8983M3586N8527J38567J85966
17912I32812K05161K39795K67019K52622K02465J34606n4798k26626j80354k51694
17902A521008l34954j52169J0685R2567J57458J70788J63928J83496J23611P4716
17892B011134q9816k29330k29077l13479l16196j71927j19348q1178n8044n2207
17882C50532j7551k1273j9668o176k4577L510N92K473j3414J6269l3055l6090
$$ plain form
17870 201572 196215 193336 179861 179729 201166 200433 206066 210187 204124 183578 202103 177323 142753
17857 142753 130568 137314 163063 168618 126948 85857 85320 95508 96324 87034 98360 98710 102792
17844 102792 89504 99753 114448 118439 143536 132909 119736 81157 78733 77990 55615 54039
17832 54039 63014 63782 74983 89953 105155 106961 113290 118932 123149 134272 131423 113569 109146
17819 109146 106612 142961 141616 178148 226453 242693 268842 309964 330155 346078 354481 384775
17807 384775 390813 408410 441236 451474 507486 621545 768923 922262 1098302 1269680 1442825
17796 1442825 1638441 1824138 1860281 1728113 1587355 1557742 1570581 1483000 1281158 1184139
17786 1184139 1216998 1300308 1412883 1550180 1738186 1934522 1937440 1716610 1563546 1497656
$$ packed form
17870B01572n357k879j3475j32K1437p33N633M121o063k0546J8525k4780l4570
17857A42753j2185O746K5749N555m1670m1091n37J0188Q16r290J1326L50M082
17844A02792j3288J0249J4695L991K5097j0627j3173l8579k424p43k2375j576
17832E4039Q975P68J1201J4970J5202J806O329N642M217J1123k849j7854m423
17819A09146k534L6349j345L6532M8305J6240K6149M1122K0191J5923Q403L0294
17807C84775O038J7597L2826J0238N6012J14059J47378J53339J76040J71378J73145
17796A442825J95616J85697L6143j32168j40758k9613J2839q7581k01842r7019
17786A184139L2859Q3310J12575J37297J88006J96336K918k20830j53064o5890
$$ plain form
17776 1497656 1421047 1201138 904187 693534 545282 456983 429776 403211 379075 379993 370381
17765 370381 362124 320106 285614 283180 251482 225271 210372 220116 254428 265559 234628 189413
17753 189413 181258 198074 211939 205664 213010 247750 245190 214893 193382 190777 192437 187755 176512
17740 176512 176196 170721 191540 191592 173709 171713 165206 162701 155045 156100 154829 140494 150815 151021
17726 151021 144342 145658 131679 107585 94990 79814 73290 79031 72732 80674 81503 76688 107648
17713 107648 116628 119369 133445 130117 112198 104794 76635 61219 84353 102706 120873 158762
17701 158762 145003 110233 84561 83090 75941 88184 101500 118953 95162 58942 41587 51115
17689 51115 58788 66816 61371 66217 51749 70781 80177 84418 84551 56426 14357 13797 40129 63283
$$ packed form
17776A497656p6609k19909k96951k10653j48252q8299k7207k6565k4136R18r612
17765C70381q257m2018l4492k434l1698k6211j4899R744L4312J1131l0931m5215
17753A89413q155J6816J3865o275P346L4740k560l0297k1511k605J660m682j1243
17740A76512l16n475K0819N2j7883j996o507k505p656J055j271j4335J0321K06
17726A51021o679J316j3979k4094j2595j5176o524N741o299P942Q29m815L0960
17713A07648Q980K741J4076l328j7919p404k8159j5416K3134J8353J8167L7889
17701A58762j3759l4770k5672j471p149J2243J3316J7453k3791l6220j7355R528
17689E1115P673Q028n445M846j4468J9032R396M241J33k8125m2069n60K6332K3154
$$ plain form
17675 63283 66485 68120 76098 70323 51829 58313 80236 87382 86927 78520 82605 75786 82521 94763
17661 94763 114306 129586 120231 115773 95635 98227 102562 79888 62917 68321 77909 72910 69989
17648 69989 81744 93463 97653 89396 110088 154909 189687 191388 153262 124908 142224 152243
17636 152243 131308 151604 161997 124012 116984 141493 180932 209586 224018 234096 241355 266552
17624 266552 263520 256443 237574 233874 201176 191595 187678 201995 228267 224088 215586 212247 214583
17611 214583 239361 253682 234520 204189 179164 201699 226173 236287 229293 209952 206674 233282
17599 233282 258107 257629 263230 275733 272087 275768 287136 295417 270154 290035 320365 345161 344653
17586 344653 336007 321592 312788 322904 316623 276442 257686 276760 295898 301217 277070 271145
$$ packed form
17675F3283L202J635P978n775j8494O484K1923P146m55q407M085o819O735J2242
17661I4763J9543J5280r355m458k0138K592M335k2674j6971N404R588m999k921
17648F9989J1755J1719M190q257K0692M4821L4778J701l8126k8354J7316J0019
17636A52243k0935K0296J0393l7985p028K4509L9439K8654J4432J0078P259K5197
17624B66552l032p077j8869l700l2698r581l917J4317K6272m179q502l339K336
17611B14583K4778J4321j9162l0331k5025K2535K4474J0114o994j9341l278K6608
17599B33282K4825m78N601J2503l646L681J1368Q281k5263J9881L0330K4796n08
17586C44653q646j4415q804J0116o281m0181j8756J9074J9138N319k4147n925
$$ plain form
17574 271145 275376 272229 271764 272615 262620 207192 162557 155265 161910 152697 165576 162929 148043 166202
17560 166202 162769 172274 193901 213053 233970 250482 264236 282559 278360 269243 260013 242940
17548 242940 222563 233420 266352 296021 288423 274741 268501 255500 232042 240422 253472 245810
17536 245810 221787 225406 224180 207728 197201 196999 197688 168424 156433 151274 157576 107943 69061
17523 69061 49909 30774 13152 -1091 17742 38662 44439 34533 61910 67929 76519 60597
17511 60597 49529 58449 22393 16773 37287 36089 29016 42018 38625 66387 96098 101236 98576
17498 98576 112746 117421 136333 178917 236558 289486 299234 296430 326610 354756 380622 415645
17486 415645 440529 466647 457645 466110 488049 525331 588310 636330 693801 774466 854525 887919
$$ packed form
17574B71145M231l147m65Q51r995n5428m4635p292O645r213J2879k647j4886J8159
17560A66202l433R505K1627J9152K0917J6512J3754J8323m199r117r230j7073
17548B42940k0377J0857L2932K9669p598j3682o240j3001k3458Q380J3050p662
17536B45810k4023L619j226j6452j0527k02O89k9264j1991n159O302m9633l8882
17523F9061j9152j9135j7622j4243J8833K0920N777r906K7377O019Q590j5922
17511F0597j1068Q920l6056n620K0514j198p073J3002l393K7762K9711N138k660
17498I8576J4170M675J8912M2584N7641N2928R748k804L0180K8146K5866L5023
17486D15645K4884K6118r002Q465K1939L7282O2979M8020N7471Q0665Q0059L3394
$$ plain form
17474 887919 886306 827793 779933 744982 706626 654390 603300 590971 590651 585860 568367 563291
17462 563291 536574 561785 553425 456847 387935 321722 224311 134067 104335 45181 -11044 -16234
17450 -16234 -36754 -36462 -6286 36239 64066 91986 139317 138187 153869 159045 160247 172319 180411
17437 180411 181279 190552 169014 171384 225058 262977 274230 285519 315981 353742 374924 389330
17425 389330 416997 413116 403875 407539 427766 455473 468837 529472 562526 573659 605973 629228
17413 629228 650571 682189 728467 793635 857497 900464 949481 991102 1041380 1048175 1075394 1071080
17401 1071080 1101325 1130598 1196868 1255638 1304813 1358224 1445984 1554988 1657278 1705160 1739825
17390 1739825 1815819 1881463 1928521 2015495 2127734 2262074 2422371 2562648 2700266 2834818
$$ packed form
17474H87919j613n8513m7860l4951l8356n2236n1090j2329l20m791j7493n076
17462E63291k6717K5211q360r6578o8912o6213r7411r0244k9732n9154n6225n190
17450a6234k0520K92L0176M2525K7827K7920M7331j130J5682N176J202J2072Q092
17437A80411Q68R273k1538K370N3674L7919J1253J1289L0462L7761K1182J4406
17425C89330K7667l881r241L664K0227K7707J3364O0635L3054J1133L2314K3255
17413F29228K1343L1618M6278O5168O3862M2967M9017M1621N0278O795K7219m314
17401A071080L0245K9273O6270N8770M9175N3411Q7760J09004J02290M7882L4665
17390A739825P5994O5644M7058Q6974J12239J34340J60297J40277J37618J34552
$$ plain form
17380 2834818 2963372 3068803 3152021 3284236 3445546 3666342 3919787 4192963 4574120 5052407
17370 5052407 5662476 6378893 7189474 8064479 8948582 9896303 10904381 11876676 12773478
17361 12773478 13769315 14951051 16426718 18410154 21041696 24449668 28711431 33596734
17353 33596734 38841138 44268476 49647663 54635129 58799183 62383121 65514010 68451021
17345 68451021 72269862 78157415 87691233 103930935 130241666 165194735 206721236
17338 206721236 251601889 294170227 332429887 363659669 381453520 367047829 324836125
17331 324836125 289614902 237829812 184609949 163578631 168687790 188972072 219114068
17324 219114068 254276786 288132883 318950804 343406561 354494927 332291503 287310410
$$ packed form
17380B834818J28554J05431Q3218J32215J61310K20796K53445K73176L81157M78287
17370E052407O10069P16417Q10581Q75005Q84103R47721J008078R72295Q96802
17361A2773478R95837J181736J475667J983436K631542L407972M261763M885303
17353C3596734N244404N427338N379187M987466M164054L583938L130889K937011
17345F8451021L818841N887553R533818J6239702K6310731L4953069M1526501
17338B06721236M4880653M2568338L8259660L1229782J7793851j4405691m2211704
17331C24836125l5221223n1785090n3219863k1031318N109159K0284282L0141996
17324B19114068L5162718L3856097L0817921K4455757J1088366k2203424m4981093
$$ plain form
17317 287310410 248570124 189567871 130794031 97540440 79534894 68396257 60974074
17310 60974074 55815238 52059614 49175187 46783969 44790806 42793892 40620438 38466495
17302 38466495 36226586 33971015 31826325 29754109 27677497 25827888 24090423 22396159
17294 22396159 20937308 19710847 18619929 17491079 16367590 15363501 14370110 13489557
17286 13489557 12777945 12063037 11232925 10481717 9768576 8971718 8312901 7816725 7329881
17277 7329881 6894165 6484210 6148849 5828218 5503328 5234100 4974959 4708199 4514344
17268 4514344 4341412 4110610 3886534 3728174 3575828 3399080 3243914 3105811 2996487
17259 2996487 2905279 2797654 2688662 2605108 2515507 2400403 2274428 2163521 2052018 1959658
$$ packed form
17317B87310410l8740286n9002253n8773840l3253591j8005546j1138637p422183
17310F0974074n158836l755624k884427k391218j993163j996914k173454k153943
17302C8466495k239909k255571k144690k072216k076612j849609j737465j694264
17294B2396159j458851j226461j090918j128850j123489j004089r93391q80553
17286A3489557p11612p14908q30112p51208p13141p96858o58817m96176m86844
17277G329881m35716m09955l35361l20631l24890k69228k59141k66760j93855
17268D514344j72932k30802k24076j58360j52346j76748j55166j38103j09324
17259B996487r1208j07625j08992q3554q9601j15104j25975j10907j11503r2360
$$ plain form
17249 1959658 1917531 1912107 1870457 1796011 1768339 1732791 1683875 1665314 1599795 1525660 1465866
17238 1465866 1439430 1407163 1399776 1355333 1325904 1308275 1298421 1297259 1316916 1328890 1299410 1297287
17226 1297287 1274041 1238649 1225062 1241517 1256973 1259229 1281278 1291933 1297346 1286968 1263340 1217698
17214 1217698 1166583 1141418 1121507 1050833 1010321 999910 1007130 1036955 1089587 1133217 1172713
17203 1172713 1169947 1101024 992201 909840 790108 640164 492499 416718 391469 363063 389200
17192 389200 431975 480466 511509 520033 478166 409338 328735 282181 245622 207470 195544 194170
17180 194170 190774 249647 345890 411871 410686 396369 408554 431916 434832 443419 474681 501435
17168 501435 528102 562907 603631 638103 649228 658280 700093 713967 703716 668274 655702 693746
$$ packed form
17249A959658m2127n424m1650p4446k7672l5548m8916j8561o5519p4135n9794
17238A465866k6436l2267p387m4443k9429j7629r854j162J9657J1974k9480k123
17226A297287k3246l5392j3587J6455J5456K256K2049J0655N413j0378k3628m5642
17214A217698n1115k5165j9911p0674m0512j0411P220K9825N2632M3630L9496
17203A172713k766o8923j08823q2361j19732j49944j47665p5781k5249k8406K6137
17192C89200M2775M8491L1043Q524m1867o8828q0603m6554l6559l8152j1926j374
17180A94170l396N8873R6243O5981j185j4317J2185K3362K916Q587L1262K6754
17168E01435K6667L4805M0724L4472J1125R052M1813J3874j0251l5442j2572L8044
$$ plain form
17156 693746 721018 720459 729307 706054 671025 669206 682272 667071 663120 668255 656226 618305 561816
17143 561816 549648 554630 554043 529355 533407 527771 536911 558939 552036 542954 517207 493611 453543
17130 453543 404831 385122 352922 281572 238725 228307 208863 195773 168610 162970 156285 171098
17118 171098 172655 147872 161055 146826 150269 129997 114608 99318 80415 84740 123901 132738
17106 132738 128518 118387 109782 127246 156319 143540 117212 113227 112494 125688 128276 134805 150677
17093 150677 152558 147609 175751 196503 220573 198368 160268 159623 137568 112546 113399 139650 142956
17080 142956 155448 176024 185967 191134 165514 157968 159785 150626 130351 106192 105406 103699 79948
17067 79948 60265 71624 78737 90521 110601 165252 155975 150878 126431 115677 113944 102762
$$ packed form
17156F93746K7272n59Q848k3253l5029j819J3066j5201l951N135j2029l7921n6489
17143E61816j2168M982n87k4688M052n636R140K2028o903r082k5747k3596m0068
17130D53543m8712j9709l2200p1350m2847j0418j9444j3090k7163n640o685J4813
17118A71098J557k4783J3183j4229L443k0272j5389j5290j8903M325L9161Q837
17106A32738m220j0131q605J7464K9073j2779k6328l985p33J3194K588O529J5872
17093A50677J881m949K8142K0752K4070k2205l8100o45k2055k5022Q53K6251L306
17080A42956J2492K0576R943N167k5620p546J817r159k0275k4159p86j707k3751
17067G9948j9683J1359P113J1784K0080N4651r277n097k4447j0754j733j1182
$$ plain form
17055 102762 115593 103502 84833 56570 53463 62565 43896 44687 78911 73064 50126 32149
17043 32149 45586 52360 44960 34171 33935 29558 26936 23700 52116 63555 28607 13285 22847
17030 22847 16861 7171 52603 51922 58247 63897 82248 83673 52350 46390 48996 66511 61026 63820
17016 63820 54068 52585 56964 78213 97483 117746 132226 153517 171473 164568 155286 160702 172300
17003 172300 157132 128322 130946 138614 112674 101117 92038 85074 108677 128435 141641 155759
16991 155759 174674 140596 126609 122438 106648 127221 147459 130083 126662 119941 117529 105576
16979 105576 101511 108748 58222 39128 38876 48212 51006 61011 31318 40992 43753 30958 34683
16966 34683 40980 59538 93395 67407 35107 69661 68958 34519 16254 29035 8092 19201
$$ packed form
17055A02762J2831j2091j8669k8263l107R102j8669P91L4224n847k2938j7977
17043C2149J3437O774p400j0789k36m377k622l236K8416J1439l4948j5322R562
17030B2847n986r690M5432o81O325N650J8351J425l1323n960K606J7515n485K794
17016F3820r752j483M379K1249J9270K0263J4480K1291J7956o905r282N416J1598
17003A72300j5168k8810K624P668k5940j1557r079o964K3603J9758J3206J4118
16991A55759J8915l4078j3987m171j5790K0573K0238j7376l421o721k412j1953
16979A05576m065P237n0526j9094k52R336K794J0005k9693R674K761j2795L725
16966C4683O297J8558L3857k5988l2300L4554p03l4439j8265J2781k0943J1109
$$ plain form
16954 19201 16524 14715 22696 18792 52505 100820 123044 124176 78343 48140 50764 58693 55305
16941 55305 23537 12630 16786 27483 11960 18484 16318 28167 28759 10350 15940 29031 23475
16928 23475 30732 47597 76617 94521 96969 111620 126656 143732 162227 163166 181678 182054 198459
16915 198459 248931 285872 354377 432470 540041 662682 776992 858038 949068 981392 953646
16904 953646 891478 764957 668822 593285 534565 524741 591563 700320 798027 866182 912148
16893 912148 923171 902500 852001 690091 540972 425965 318709 260472 231476 231672 218667
16882 218667 188705 181293 203394 214754 197379 204085 194214 178574 163561 170449 176161 163639
16870 163639 153191 169770 163703 162703 158240 173301 163001 151800 178614 177909 156778 166645 178931
$$ packed form
16954A9201k677j809P981l904L3713M8315K2224J132m5833l0203K624P929l388
16941E5305l1768j0907M156J0697j5523O524k166J1849N92j8409N590J3091n556
16928B3475P257J6865K9020J7904K448J4651J5036J7076J8495R39J8512L76J6405
16915A98459N0472L6941O8505P8093J07571J22641J14310Q1046R1030L2324k7746
16904I53646o2168j26521r6135p5537n8720r824O6822J08757R7707O8155M5966
16893I12148J1023k0671n0499j61910j49119j15007j07256n8237k8996J96j3005
16882B18667k9962p412K2101J1360j7375O706r871j5640j5013O888N712j2522
16870A63639j0448J6579o067j000m463J5061j0300j1201K6814p05k1131R867J2286
$$ plain form
16857 178931 193062 181934 173551 196324 216140 225384 238617 249353 246790 230939 213295 209639
16845 209639 214008 207560 160513 144731 145427 135512 111726 129073 165445 178983 190818 213446
16833 213446 209564 173368 151958 152993 132636 115580 97618 78639 88365 120473 145702 135731
16821 135731 103343 87882 81628 65503 88192 104314 110803 98077 90766 89753 102220 95796
16809 95796 72565 78001 80678 71386 66364 87992 66408 29863 43714 53621 41592 22193 28317
16796 28317 35259 47630 41702 61009 68719 84581 106789 91770 75916 85024 90048 92256 98038
16783 98038 90536 106300 156336 168817 172939 177080 195589 219924 236230 224579 233675 261722
16771 261722 284828 285279 311677 357805 373387 404800 450454 490090 565198 700118 856281
$$ packed form
16857A78931J4131j1128q383K2773J9816R244J3233J0736k563j5851j7644l656
16845B09639M369o448m7047j5782O96r915k3786J7347L6372J3538J1835K2628
16833B13446l882l6196k1410J035k0357j7056j7962j8979R726L2108K5229r971
16821A35731l2388j5461o254j6125K2689J6122O489j2726p311j013J2467o424
16809I5796k3231N436K677r292n022K1628k1584l6545J3851R907j2029j9399O124
16796B8317O942J2371n928J9307P710J5862K2208j5019j5854R108N024K208N782
16783I8038p502J5764N0036J2481M122M141J8509K4335J6306j1651R096K8047
16771B61722K3106M51K6398M6128J5582L1413M5654L9636P5108J34920J56163
$$ plain form
16760 856281 1058327 1266793 1518563 1768164 1967384 2093797 2123790 1999517 1795503 1597273
16750 1597273 1279693 1011263 961473 1059175 1190980 1373831 1565226 1722637 1891157 2008362
16740 2008362 2027313 1837273 1602335 1356700 994131 749401 591111 505209 459423 392722
16730 392722 337234 318350 336412 304951 294570 293923 276517 249071 227704 212407 198610 180135
16718 180135 177515 197171 152148 115799 121860 126173 114135 91376 83429 89289 115367 119997 113952
16705 113952 118876 114379 112279 82293 65087 70864 81936 76581 55016 38774 34517 28426 36930
16692 36930 62315 93968 84098 84637 56942 83143 75521 54113 24378 25536 29611 25300 38384
16679 38384 55780 48516 32218 11638 -167 6130 6929 25591 44003 18596 10956 6080 16122
$$ packed form
16760H56281K02046K08466K51770K49601J99220J26413K9993j24273k04014j98230
16750A597273l17580k68430m9790R7702J31805J82851J91395J57411J68520J17205
16740B008362J8951j90040k34938k45635l62569k44730j58290q5902m5786o6701
16730C92722n5488j8884J8062l1461j0381o47j7406k7446k1367j5297j3797j8475
16718A80135k620J9656m5023l6349O061M313j2038k2759p947N860K6078M630o045
16705A13952M924m497k100k9986j7206N777J1072n355k1565j6242m257o091Q504
16692C6930K5385L1653r870N39k7695K6201p622k1408k9735J158M075m311J3084
16679C8384J7396p264j6298k0580j1805O297P99J8662J8412k5407p640m876J0042
$$ plain form
16666 16122 17044 13314 23264 16225 14707 -1032 -11708 -29849 -58033 -44290 -63404 -64960 -69262
16653 -69262 -55618 -7009 14946 23068 32054 42137 5848 -19559 -10144 -6572 8642 -7137
16641 -7137 -13483 -4986 -1405 -6515 -7590 -10909 -4218 -26004 -44646 -6248 22396 42825 38837
16628 38837 37250 40601 60000 52788 27880 -2528 -23160 -21617 -13052 14184 12354 22674 58947
16615 58947 61311 5004 -29543 -9709 8949 36387 35918 30704 28713 72822 76902 81160 94925
16602 94925 96112 90361 98017 59530 37263 23031 773 -5832 10130 9692 1534 14683 9055
16589 9055 15332 30651 39852 35182 40521 23315 30070 33212 20354 1758 1185 26159 41443
16576 41443 44178 46686 49014 53756 41440 25620 24749 28501 43571 49005 51926 69363 73225 54236
$$ packed form
16666A6122R22l730R950p039j518j5739j0676j8141k8184J3743j9114j556m302
16653f9262J3644M8609K1955Q122Q986J0083l6289k5407R415L572J5214j5779
16641g137o346Q497L581n110j075l319O691k1786j8642L8398K8644K0429l988
16628C8837j587L351J9399p212k4908l0408k0632J543Q565K7236j830J0320L6273
16615E8947K364n6307l4547J9834J8658K7438m69n214j991M4109M080M258J3765
16602I4925J187n751P656l8487k2267j4232k2258o605J5962m38q158J3149n628
16589I055O277J5319R201m670N339j7206O755L142j2858j8596n73K4974J5284
16576D1443K735K508K328M742j2316j5820q71L752J5070N434K921J7437L862j8989
$$ plain form
16562 54236 43797 42093 37224 45454 52483 51064 19043 16042 27177 10732 16317 8559 -30546
16549 -30546 -54115 -42921 -25863 5504 25128 5197 -14008 -6597 -17616 -11038 -22485 -36135
16537 -36135 -40760 -18743 645 23752 31055 33401 15041 7808 -3791 11230 17525 23601 14484
16524 14484 8104 23844 43185 50292 44273 13210 -16373 -12620 -18973 -19526 1166 -6070 -15521
16511 -15521 -48242 -42013 -16180 -29005 -2940 17094 -8387 -38212 -18844 -4196 -1781 26133
16499 26133 22408 16620 1142 -21551 -22841 -11394 -201 25260 51139 23127 -21927 -38705
16487 -38705 -53414 -47277 -42151 -18588 -18484 11443 44433 67546 77523 73610 66899 48833 15748
16474 15748 23040 15656 10024 582 -15531 -12118 -27026 -40487 -33445 -16966 -4695 -10491 -28474
$$ packed form
16562E4236j0439j704m869Q230P029j419l2021l001J1135j6445N585p758l9105
16549c0546k3569J1194J7058L1367J9624j9931j9205P411j1019O578j1447j3650
16537c6135m625K2017J9388K3107P303K346j8360p233j1599J5021O295O076r117
16524A4484o380J5740J9341P107o019l1063k9583L753o353n53K0692p236r451
16511a5521l2721O229K5833j2825K6065K0034k5481k9825J9368J4648K415K7914
16499B6133l725n788j5478k2693j290J1447J1193K5461K5879k8012m5054j6778
16487c8705j4709O137N126K3563J04K9927L2990K3113R977l913o711j8066l3085
16474A5748P292p384n632r442j6113L413j4908j3461P042J6479J2271n796j7983
$$ plain form
16461 -28474 -26725 -32876 -47124 -30475 -33420 -30299 -23000 -5473 -5777 -6992 1935 -25123 -20119 -17560
16447 -17560 8285 27401 16104 23917 12984 40787 25680 20903 18649 2979 -15830 -12958
16435 -12958 -24237 -18153 -10165 -3821 -4127 5001 325 10023 4171 -16361 -23454 5968 -9813 5210
16421 5210 30820 11505 -10376 -2313 21161 17595 23577 7703 -1147 23253 19297 -16906 -9301
16408 -9301 16552 5506 -26589 -15418 4422 32652 47802 35826 4782 -622 -14459 -20960
16396 -20960 -19103 -22970 -1412 21719 22476 23932 15734 12538 3481 -23234 -56321 -70710 -69710
16383 -69710 -52035 -54893 -26632 -3145 18784 25556 3593 -13177 -15129 -20034 -45266 -58144
16371 -58144 -71332 -50664 -35137 -19524 24675 39508 10210 -26736 -29615 -32364 -27811 -28408 -12080
$$ packed form
16461b8474J749o151j4248J6649k945L121P299J7527l04j215Q927k7058N004K559
16447a7560K5845J9116j1297P813j0933K7803j5107m777k254j5670j8809K872
16435a2958j1279O084P988O344l06R128m676R698n852k0532p093K9422j5781J5023
16421E210K5610j9315k1881Q063K3474l566N982j5874q850K4400l956l6203P605
16408i301K5853j1046l2095J1171J9840K8230J5150j1976l1044n404j3837o501
16396b0960J857l867K1558K3131P57J456q198l196r057k6715l3087j4389J000
16383f9710J7675k858K8261K3487K1929O772k1963j6770j952m905k5232j2878
16371e8144j3188K0668J5527J5613M4199J4833k9298l6946k879k749M553n97J6328
$$ [...]
##END NTUPLES=NMR SPECTRUM
##END=
