##TITLE=Analysis number 328574
Compound Code cc 64716
Book Reference 508/102
Project Code adrs
Chemist Name antons
##JCAMPDX= 6.0         $$ Bruker NMR JCAMP-DX V2.0
##DATA TYPE= NMR SPECTRUM
##DATA CLASS= NTUPLES
##ORIGIN= Bruker BioSpin GmbH
##OWNER= nmr
$$ XWIN-NMR		Version 3.5
$$ Tue Jun 19 10:06:31 2007 GMT Daylight Time (UT+1h)  MAYBRIDGE\nmr@NMR_250MHZ
##.OBSERVE FREQUENCY= 250.131544655141
##.OBSERVE NUCLEUS= ^1H
##.ACQUISITION MODE= SIMULTANEOUS (DQD)
##.ACQUISITION SCHEME= undefined
##.AVERAGES= 16
##.DIGITISER RES= 18
##SPECTROMETER/DATA SYSTEM= dpx250
##.PULSE SEQUENCE= zg30
##.SOLVENT NAME= CDCl3
##.SHIFT REFERENCE= (INTERNAL, CDCl3, 0, 16.4525)
##AUDIT TRAIL= $$ (NUMBER, WHEN, WHO, WHERE, WHAT)
$$ ##TITLE= Audit trail, XWIN-NMR		Version 3.5
$$ ##JCAMPDX= 5.01
$$ ##ORIGIN= Bruker BioSpin GmbH
$$ ##OWNER= nmr
$$ C:\u/data/dgb/nmr/ADRS/1050/pdata/1/auditp.txt
$$ ##AUDIT TRAIL=  $$ (NUMBER, WHEN, WHO, WHERE, WHAT)
(   1,<2007-06-19 10:06:09.93 +100>,<MAYBRIDGE\nmr>,<NMR_250MHZ>,
      <created by zg, POWCHK disabled, PULCHK disabled
       configuration hash MD5:
       76 6E 9A 78 1E 09 19 81 EC 84 63 8F B0 6A 59 2D
       data hash MD5: 64K
       34 AC F7 18 E3 14 27 AF F9 50 C6 71 1B 46 CE 54>)
(   2,<2007-06-19 10:06:21.73 +100>,<MAYBRIDGE\nmr>,<NMR_250MHZ>,
      <Start of raw data processing
       ef LB = 0.3 FT_mod = 6 PKNL = 1 SI = 32K 
       data hash MD5: 32K
       07 15 DF 3C B0 9A BF 0D C4 B8 A9 52 5A 4B 63 4E>)
(   3,<2007-06-19 10:06:23.71 +100>,<MAYBRIDGE\nmr>,<NMR_250MHZ>,
      <apk 
       data hash MD5: 32K
       D4 2A A8 F9 8E FC 2F D1 33 8F B8 B6 15 81 A1 B2>)
(   4,<2007-06-19 10:06:24.43 +100>,<MAYBRIDGE\nmr>,<NMR_250MHZ>,
      <abs ABSG = 5 
       data hash MD5: 32K
       81 84 3B EF D6 59 87 8D 5D 72 D5 87 D2 87 81 FE>)
$$ ##END=
$$ 
$$ hash MD5
$$ C8 53 43 96 4F 29 F1 0A DC 07 93 27 B1 B8 56 2A
##$RELAX= 
##$RELAX= 
##$RELAX= 
##$RELAX= 
##$RELAX= 
##$RELAX= 
##$RELAX= 
$$ Bruker specific parameters
$$ --------------------------
##$DU= <C:\u>
##$EXPNO= 1050
##$NAME= <ADRS>
##$PROCNO= 1
##$TYPE= <nmr>
##$USER= <dgb>
##$AMP= (0..31)
100 100 100 100 100 100 100 100 100 100 100 100 100 100 100 100 100 100 
100 100 100 100 100 100 100 100 100 100 100 100 100 100 
##$AQSEQ= 0
##$AQ_mod= 3
##$AUNM= <au_zg>
##$AUTOPOS= <55 >
##$BF1= 250.13
##$BF2= 250.13
##$BF3= 250.13
##$BF4= 250.13
##$BF5= 500.13
##$BF6= 500.13
##$BF7= 500.13
##$BF8= 500.13
##$BYTORDA= 1
##$CFDGTYP= 0
##$CFRGTYP= 5
##$CHEMSTR= <none>
##$CNST= (0..31)
1 1 145 1 1 1 1 1 1 1 1 1 1 1 1 1 1 1 1 1 1 1 1 1 1 1 1 1 1 1 1 1 
##$CPDPRG= <>
##$CPDPRG1= <>
##$CPDPRG2= <>
##$CPDPRG3= <>
##$CPDPRG4= <mlev>
##$CPDPRG5= <mlev>
##$CPDPRG6= <mlev>
##$CPDPRG7= <mlev>
##$CPDPRG8= <mlev>
##$CPDPRGB= <>
##$CPDPRGT= <>
##$D= (0..31)
0 1 0 0 0 0 0 0 0 0.06 0 0 0 0 0 0 0.0002 0 0 0 0 0 0 0 0 0 0 0 0 0 0 
0 
##$DATE= 1182243968
##$DBL= (0..7)
120 120 120 120 120 120 120 120 
##$DBP= (0..7)
150 150 150 150 150 150 150 150 
##$DBP07= 0
##$DBPNAM0= <>
##$DBPNAM1= <>
$$ [...]
##$SUBNAM8= <"">
##$SUBNAM9= <"">
##$SW= 20.6930455092707
##$SWIBOX= (0..15)
0 0 3 0 0 0 0 0 0 0 0 0 0 0 0 0 
##$SW_h= 5175.983436853
##$TD= 65536
##$TD0= 1
##$TE= 296.16
##$TE2= 300
##$TE3= 300
##$TEG= 300
##$TL= (0..7)
0 120 120 120 120 120 120 120 
##$TP= (0..7)
150 150 150 150 150 150 150 150 
##$TP07= 0
##$TPNAME0= <>
##$TPNAME1= <>
##$TPNAME2= <>
##$TPNAME3= <>
##$TPNAME4= <>
##$TPNAME5= <>
##$TPNAME6= <>
##$TPNAME7= <>
##$TPOAL= (0..7)
0.5 0.5 0.5 0.5 0.5 0.5 0.5 0.5 
##$TPOFFS= (0..7)
0 0 0 0 0 0 0 0 
##$TUNHIN= 0
##$TUNHOUT= 0
##$TUNXOUT= 0
##$USERA1= <user>
##$USERA2= <user>
##$USERA3= <user>
##$USERA4= <user>
##$USERA5= <user>
##$V9= 5
##$VALIST= <valist>
##$VCLIST= <CCCCCCCCCCCCCCC>
##$VD= 0
##$VDLIST= <DDDDDDDDDDDDDDD>
##$VPLIST= <PPPPPPPPPPPPPPP>
##$VTLIST= <TTTTTTTTTTTTTTT>
##$WBST= 1024
##$WBSW= 4
##$XGAIN= (0..3)
0 0 0 0 
##$XL= 0
##$YL= 0
##$YMAX_a= 559129
##$YMIN_a= -487569
##$ZGOPTNS= <>
##$ZL1= 120
##$ZL2= 120
##$ZL3= 120
##$ZL4= 120
##$ABSF1= 16.45254
##$ABSF2= -4.240633
##$ABSG= 5
##$ABSL= 3
##$ALPHA= 0
##$AQORDER= 0
##$ASSFAC= 0
##$ASSFACI= 0
##$ASSFACX= 0
##$ASSWID= 0
##$AUNMP= <proc_1d>
##$AZFE= 0.1
##$AZFW= 0.1
##$BCFW= 0
##$BC_mod= 0
##$BYTORDP= 0
##$COROFFS= 0
##$CY= 12.5
##$DATMOD= 1
##$DC= 0
##$DFILT= <>
##$DTYPP= 0
##$F1P= 14.0000005364418
##$F2P= -0.99999901652339
##$FCOR= 0.5
##$FTSIZE= 32768
##$FT_mod= 6
##$GAMMA= 0
##$GB= 0
##$INTBC= 1
##$INTSCL= 1
##$ISEN= 128
##$LB= 0.3
##$LEV0= 0
##$LPBIN= 0
##$MAXI= 10000
##$MC2= 0
##$MEAN= 0
##$ME_mod= 0
##$MI= 0
##$NCOEF= 0
##$NC_proc= -2
##$NLEV= 6
##$NOISF1= 0
##$NOISF2= 0
##$NSP= 0
##$NTH_PI= 0
##$NZP= 0
##$OFFSET= 16.45254
##$PC= 1
##$PHC0= -33.19611
##$PHC1= -39.53874
##$PH_mod= 1
##$PKNL= yes
##$PPARMOD= 0
##$PSCAL= 4
##$PSIGN= 0
##$REVERSE= no
##$SF= 250.130017373931
##$SI= 32768
##$SIGF1= 0
##$SIGF2= 0
##$SINO= 400
##$SIOLD= 32768
##$SREGLST= <1H.CDCl3>
##$SSB= 0
##$STSI= 32768
##$STSR= 0
##$SW_p= 5175.98343685301
##$SYMM= 0
##$S_DEV= 0
##$TDeff= 65536
##$TDoff= 0
##$TI= <Analysis number 999999
Compound Code 99
Book Reference 9
Project Code 9>
##$TILT= no
##$TM1= 0
##$TM2= 0
##$TOPLEV= 0
##$USERP1= <user>
##$USERP2= <user>
##$USERP3= <user>
##$USERP4= <user>
##$USERP5= <user>
##$WDW= 1
##$XDIM= 32768
##$YMAX_p= 339356918
##$YMIN_p= -158700
$$ End of Bruker specific parameters
$$ ---------------------------------
##NTUPLES= NMR SPECTRUM
##VAR_NAME=  FREQUENCY,     SPECTRUM/REAL,   SPECTRUM/IMAG
##SYMBOL=    X,             R,               I
##VAR_TYPE=  INDEPENDENT,   DEPENDENT,       DEPENDENT
##VAR_FORM=  AFFN,          ASDF,            ASDF
##VAR_DIM=   32768,         32768,           32768
##UNITS=     HZ,            ARBITRARY UNITS, ARBITRARY UNITS
##FACTOR=    0.157963299565203, 1,           1
##FIRST=     4115.27397696543, 0,            0
##LAST=      -1060.70945988758, 0,           0
##MIN=       -1060.70945988758, -158700,     0
##MAX=       4115.27397696543, 339356918,    0
$$ Real data points
##PAGE= N=1
##DATA TABLE= (X++(R..R)), XYDATA
$$ [...]
25005G085p06O145k439p230l518k17K974j260j2391l018R944J6273m939L387K764
24990A2854j0502L976O554J600l083q946k184j779l489k64m301m635n157J2551
24976f805j389l301k960m2K917J4222p637j4446K171M796J1366M028P573k019
24962H474n225p112j0491m514J6478O526L781l157K079L750q147j8922L48J6684
24948E52K898K749r758j533J8439Q921q925K658n441J787n601L94M602O051p137
24933A0656j5270J1929M685m633j5705m635N939R201l816R1m864M875K096P756
24919H305q764o407R727J7440n003j4306K992K96q54l275j2263j180Q151m444
24905i585j1569l410J5431Q013M027J2097o88o525q937R700M06R838m407M16m84
$$ plain form
25005 7085 6379 12524 10085 2855 -663 -880 2094 834 -11557 -14575 -4631 11642 6703 10090 12854
24990 12854 2352 6328 12882 14482 11399 2453 269 -1510 -4999 -5263 -9564 -14199 -19356 -6805
24976 -6805 -8194 -11495 -14455 -14497 -11580 2642 -4995 -19441 -17270 -12474 -1108 2920 10493 8474
24962 8474 3249 -3863 -14354 -18868 -2390 4136 7917 4760 6839 10589 2442 -16480 -16132 552
24948 552 3450 6199 -3559 -5092 13347 22268 13343 16001 10560 12347 6746 7140 11742 17793 10656
24933 10656 -4614 7315 12000 7367 -8338 -12973 -7034 2167 -1649 -1558 -6422 -1547 549 8305
24919 8305 -459 -6866 2861 20301 15298 992 3984 4280 3426 151 -12112 -13292 -5141 -9585
24905 -9585 -21154 -24564 -9133 -1120 2907 15004 14316 7791 -1146 8554 8960 18798 14391 14807 14323
24890A4323n027Q73Q01J575j611j0256k736r59L331q137N575M196R050P830J317
24875B0145l217p157o023j0644L673J3802L625l001K456j538r479q367N421L576
24861C272j3953J977J0482N276j1603N259q67q996p357l922O25P468J427q045
24847a8957o943Q213N633N848R308p370P328O954P064j3717k971n004q449q262
24833b1325k172R963J0626j0448J232M600N612P430j992q477o732J2357K962j5642
24819a2006n063O081l620l759J8778J598o544J1525J3338L938j3455j5946k560
24806g695M889J7585j4519j5183Q983l956n779N993J2541K605n699M867L513o989
24792A156k253o43M010J1269K858o939m144j8601p233J853r971m355J6661P618
$$ plain form
24890 14323 9296 10169 10970 12545 10934 678 -2058 -3017 314 -7823 -2248 1948 10998 18828 20145
24875 20145 16928 9771 3748 -6896 -3223 10579 14204 11203 13659 12121 2642 -5725 -304 3272
24861 3272 -10681 -8704 1778 7054 -4549 710 -157 -9153 -16510 -20432 -19807 -12339 -10912 -18957
24847 -18957 -25900 -17687 -12054 -6206 3102 -4268 3060 10014 17078 3361 390 -4614 -13063 -21325
24833 -21325 -23497 -13534 -2908 -13356 -12124 -7524 -1912 5518 3526 -4951 -11683 674 3636 -12006
24819 -12006 -17069 -10988 -14608 -18367 411 2009 -4535 6990 20328 24266 10811 -5135 -7695
24806 -7695 -2806 14779 260 -14923 -5940 -9896 -15675 -9682 2859 5464 -235 4632 8145 1156
24792 1156 -1097 -1740 2270 13539 16397 9458 5314 -13287 -20520 -18667 -28638 -32993 -16332 -8714
24778h714p666Q156P596J1998J1012K575j2934p229Q85M23n494n202P39N809J0342
24763A2296l660M78L928q982L080P014k608j2200k0181o04J2497k043k374P480
24749e879j1202M12m64j606l86o877j0330J2682J2913Q188n501m567O824M972
24735h21J0490N770q974R227P4k0883M325p956J1616P505q327j694m114p019J1502
24720G21J4214j2098j0370m373j7495N819K2101K834M573J2570p3j0750q25O337
24706A3185o52j7060p939k837j0793J7407K1858K053m276O37l961l426j6888p683
24692b0375L94J4228J1624p181j0991L759J2291Q430M164J1605L749k493p876
24679B1328O14q977Mo854j1905P624p58k817n410j1918r767O907J5014q98N755
$$ plain form
24778 -8714 -16380 -8224 -628 11370 22382 24957 12023 4794 5679 6102 608 -4594 -3855 1954 12296
24763 12296 8636 9114 13042 4060 7140 14154 11546 -654 -20835 -21439 -8942 -10985 -13359 -5879
24749 -5879 -17081 -16669 -17133 -18739 -19125 -26002 -36332 -23650 -10737 -2549 -8050 -12617 -5793 -821
24735 -821 9669 15439 6465 15692 15766 -5117 -792 -8748 2868 10373 2046 352 -3762 -10781 721
24720 721 14935 2837 -7533 -11906 -29401 -23582 -1481 1353 5926 18496 18423 7673 6848 13185
24706 13185 12533 -4527 -12466 -15303 -26096 -8689 13169 15222 10946 11583 7622 4196 -12692 -20375
24692 -20375 -19981 -5753 5871 -1310 -12301 -8542 3749 12179 16343 27948 31697 29204 21328
24679 21328 21942 12965 12969 6115 -5790 1834 1076 -1741 -7151 -19069 -28836 -21929 -6915 -7813 -2058
24664b058O978p677j3551L254J1957o82j0030R763K020r404j424R763O60p241
24650g672J3476R457j494q764K343r137J0652K733l007j5108j5024P974R251P611
24636C291J0084j3352o841n999J188J4312J6744j1672m241J311o027l789K123
24623b868O594n218n307N67L007o907k629K831P473J0362M917L264n63o235j599
24608G689J491o097j4747p435N878P770J180m188p801O822O654j929j1009Q600
24594g122J5153n709K847L990K464L745K156R173l368k5118j8559J7518o40k383
24580e853Q258r345O897m284P524l98J356j610o080k954L550l450R077m688L335
24565A335O715j454n103k555J0502Q670o324n578N917j066o276p090J276M881
$$ plain form
24664 -2058 4920 -2757 -16308 -13054 -1097 -1779 -11809 -2046 -26 -9430 -10854 -1091 -431 -7672
24650 -7672 5804 15261 13767 5003 7346 -1791 8861 11594 8587 -6521 -21545 -13571 -4320 3291
24636 3291 13375 23 -6818 -12817 -11629 2683 19427 7755 3514 4825 -1202 -4991 -2868
24623 -2868 3726 -1492 -6799 -6232 -3225 -10132 -12761 -9930 -2457 7905 12822 16086 15523 9288 7689
24608 7689 9180 3083 -11664 -19099 -13221 -5451 -4271 -8459 -16260 -9438 -2784 -4713 -15722 -7122
24594 -7122 8031 2322 5169 9159 11623 15368 17524 26697 23329 -1789 -20348 -2830 -3470 -5853
24580 -5853 2405 -6940 -43 -4327 3197 2799 4155 2545 -3535 -6489 -2939 -6389 2688 -2000 1335
24565 1335 8050 6596 1493 -1062 9440 18110 11786 6208 12125 11059 4783 -2307 -1031 3850
24551C850l480p235R864P650j2474l275l940k571J0374J646L346r591j2153n574
24537b3563N164J2379l848J0292L234L693J1480j274q384J213J297j0131k874
24524a322J1245P217q695q224q556N127j0859k675R358N008L195j889j588N93
24510b065J611J1114L879K09o260N13j118j0027k5103k805P476L918M601k609
24496a6666j657K932Q624O758J0132l878r395K333k412j2800J2798j87K341q656
24482i733l055r7m258Q954O18J0036P339J457k206j316p691L320j6911p46M283
24467a0006P328Q198P162J3403J005k699m735j3671j7176J013Q766p232j1526
24454b0170l011J7526n252j0855O978q405M486N123q97r567k577L395M649M405
$$ plain form
24551 3850 370 -6865 2999 10649 -1825 -5100 -9040 -11611 -1237 409 3755 -5836 -17989 -23563
24537 -23563 -18399 -6020 -9868 424 3658 7351 18831 17557 9173 10386 11683 1552 -1322
24524 -1322 9923 17140 8445 221 -8335 -3208 -14067 -16742 -7384 -2376 819 -1070 -2658 -2065
24510 -2065 -454 10660 14539 14748 8488 9001 7883 -2144 -27247 -30052 -22576 -18658 -14057 -16666
24496 -16666 -18323 -15391 -6767 -9 10123 6245 -3150 -817 -3229 -16029 -3231 -3418 -1077 -9733
24482 -9733 -12788 -12885 -17143 -8189 -7571 2465 9804 11261 9055 7739 48 3368 -13543 -14289 -10006
24467 -10006 -2678 5520 12682 26085 27090 24391 19656 5985 -11191 -10178 -1412 -8644 -20170
24454 -20170 -23181 -5655 -10907 -21762 -14784 -23189 -18703 -13580 -14477 -24044 -26621 -23226 -18577 -14172
24440a4172K603k097P758K215o026M187J0238K090J3883o769q977l915o917M182
24426a717O502K605N263R250K778o844p544m372k934J5817j015n544o548j270
24412D427j2360k670J820O599J0499P077k093L136p444J0604O294J575n374j5657
24398F433j1943J3164o88l194q448L427J358k553m510k3968j0328R924J8106N035
24384h185J3086J1200k0082j9540M229J1574O304j0759k453O50J355Q220Q222
24371C821j977j3101Q79J3867r19j8404j3883J5539J5946Q08J2451p357J060J0889
24357A9619l862o164n423n733O544p48P772L202m354j5097m201l478j180R910
24343c193j976r227J4663P415o157m394o617R270p58o742o098L76N177N822J1593
$$ plain form
24440 -14172 -11569 -13666 -5908 -3693 -9719 -5532 4706 6796 20679 13910 4933 1018 -5899 -1717
24426 -1717 4785 7390 12653 21903 24681 17837 10293 5921 2987 18804 17789 12245 5697 4427
24412 4427 -7933 -10603 -8783 -2184 8315 15392 13299 16435 8991 19595 25889 27464 22090 6433
24398 6433 -5510 7654 6966 3772 -4676 -1249 109 -2444 -6954 -30922 -41250 -31326 -13220 -8185
24384 -8185 4901 16101 -3981 -23521 -19292 -7718 -1414 -12173 -14626 -13976 -12621 -4401 3821
24371 3821 1844 -11257 -10378 3489 2570 -15834 -29717 -14178 1768 2576 15027 7670 8730 19619
24357 19619 15757 9593 4170 -1563 4981 4233 12005 15207 10853 -4244 -8445 -11923 -13103 -3193
24343 -3193 -5169 -14396 267 7682 1525 -2869 -9486 -216 -974 -7716 -13814 -13438 -8261 -2439 9154
24328I154R634j1561q823m563K052m267J6201K5018l952r697p068m536n088p396
24314d892j1348o13P472K0312j459K34o328p415j1550L851J261p589M23J173J6002
24299d66R496q715j6282m488J5264l487k361j0782l921Q603J3115L526N68l291
24285c221n624J3589K39K034n161M690L109o181m274K351j0452J4753q792j4663
24271a7603J891j160N171m174l539Q153J2074l13K545R693M362M68j126j3697
24257B745j1173j1077J2316j914K232j45N413J4759o402q30k709o663j190P467
24243B829J0423l527N88Q585j75r475K927q417k1895M954J3387k382q730j2610
24229b3518J0846N505N344n627r6J289k749k242J0101J2095n009j5759J6001J0665
$$ plain form
24328 9154 18788 7227 -1596 -6159 -4107 -8374 7827 32845 28893 19196 12128 7592 2504 -4892
24314 -4892 -16240 -16853 -9381 10931 9472 9706 3378 -4037 -15587 -11736 -10475 -18064 -17641 -16468 -466
24299 -466 9030 315 -15967 -20455 -5191 -8678 -11039 -21821 -25742 -17139 -4024 -498 70 -3221
24285 -3221 -8845 4744 4983 7017 1856 6546 9655 3474 -800 1551 -8901 5852 -2940 -17603
24271 -17603 -15712 -16872 -11701 -15875 -19414 -11261 813 500 3045 12738 17100 17568 16442 2745
24257 2745 -8428 -19505 -7189 -9103 -6871 -7016 -1603 13156 6754 5924 3215 -3448 -4638 2829
24243 2829 13252 9725 10313 18898 18723 9248 12175 3758 -18137 -13183 204 -2178 -10908 -23518
24229 -23518 -12672 -7167 -1823 -7450 -7546 -6257 -9006 -11248 -1147 10948 5939 -9820 6181 16846
24215A6846r844r56k466r881J20o879j659J2541K193q671Q171Q088j0191J760
24201h28m88o581P210j793N64J0357o846P077J822N601j091j1348m354O564L841
24186I707M523O232l113o176K135o790O509J5454M937j6828j1996l708o478j0257
24172a5849Q445Q750O55J0620p154r623J5329N578l785M617r866L932N66n623
24158F592o086K551L637P966L849q24j0541j78k935j3603M485P145l772K534L763
24143D583M253J136p897j471Q45O710J348J4900N059j4307p133j2846j2876L912
24129a3784r051o283K724k94J1085J585p910K0349K415j188J528p049Q643K180
24115D950j434r085o866L25p671R340Q26q704n424Q112J0131L911j5528j2753
$$ plain form
24215 16846 7002 6046 3580 -6301 -6181 -13060 -14719 -2178 15 -8656 -485 7603 -2588 -828
24201 -828 -1316 -7897 -687 -2480 -1916 8441 1595 8672 10494 16095 15004 3656 -698 5866 9707
24186 9707 14230 20462 17349 11173 13308 6518 13027 28481 33418 16590 4594 886 -5592 -15849
24172 -15849 -7404 1346 2001 12621 5467 -4156 11173 16751 12966 17583 7717 11649 12215 6592
24158 6592 506 3057 6694 14660 18509 17685 7144 6966 4031 -9572 -5087 2058 -1714 820 4583
24143 4583 8836 9972 2075 604 1449 8159 9507 24407 29466 15159 8026 -4820 -17696 -13784
24129 -13784 -22835 -29118 -26394 -26688 -15603 -14018 -21928 -1579 836 -352 1176 -5873 2770 4950
24115 4950 3516 -5569 -12435 -12110 -19781 -10441 -9615 -18319 -23743 -15631 -5500 -1589 -17117 -29870
24101b9870K2019M077J404l802q85J2952p19l143r237r898L923L3K807j082P373
24086d048J4309k573j8452L739M400k366L278p884j2609p940K8599J0356r221
24073d12O45m28m596J447N132P982J3775n323n383K401r42J826K742o348K919
24058A5437N042r520m228m316j0311n65O474n959M550M886J691o169k977J586
24044d379Q283L910j0885r777p286K73m118Q692J706J1903M660n954k507K823
24030b656L795K959M54j224M855n984R026K14j3979l280o632j01N345n036N21
24015a1723O996J4464q301q182K13J744J910n497J3530J2042j5661m9m098P204
24001D592n757M243j6905j7113L046P348k30L985q212q159J691J7510L681r504
$$ plain form
24101 -29870 -7851 -3774 -2370 -6172 -7057 5895 5176 2033 -7204 -17102 -13179 -13146 -10339 -11421 -4048
24086 -4048 10261 7688 -10764 -7025 -2625 -4991 -1713 -9597 -22206 -30146 -1547 8809 -412
24073 -412 233 -195 -4791 -3344 1788 9770 23545 18222 12839 15240 14298 16124 18866 12518 15437
24058 15437 20479 10959 6731 2415 -7896 -8461 -1987 -7946 -3396 1490 3181 -2988 -5965 -4379
24044 -4379 3904 7814 -3071 -12848 -20134 -19861 -23979 -15287 -13581 -1678 2982 -2972 -5479 -2656
24030 -2656 1139 4098 4552 3328 8183 2199 11225 11439 -2540 -5820 -12452 -12553 -7208 -12244 -11723
24015 -11723 -4727 9737 1436 -6746 -6533 -4789 -2879 -8376 5154 17196 1535 1486 -2612 4592
24001 4592 -1165 3078 -13827 -30940 -27894 -20546 -20776 -16791 -25003 -33162 -31471 -13961 -10280 -19784
23987a9784q294P257J0528N197N38Q443N857O277m221j4207m730j968J799k346
23973i654p153N531O7l141L836N939l430N803J456K017J689N100P816P19o733
23958I862m29M202o386l760k878J3447N016r050k984n576K959o081r182M123J2963
23943F246o300l270J0607q081q19j577M2M072j2462J0494J1781k818N721J0704
23929B4340j5913n601M237O836N228p14j0470r444r42r701L220J764K315P06k920
23914g059n202K481K2686N179J570r345m962K733J0712R853k0158k7610k620p77
23900b2519R206Q625m229p763P476o709p41J6379L404J864P867J2072R53k0164
23886E721l437J108J183j1766j4497o033K326q25J693J2728M209l633R222K28
$$ plain form
23987 -19784 -28078 -20821 -10293 -5096 -4558 3885 9742 16019 11798 -2409 -7139 -9107 -7308 -9654
23973 -9654 -16807 -11276 -11209 -14350 -10514 -4575 -8005 -2202 -746 1271 2960 8060 15876 16595 9862
23958 9862 9433 13635 7249 3489 611 14058 19074 10024 7040 1464 4423 -1658 -10840 -6717 6246
23943 6246 -54 -3324 7283 -798 -1617 -3194 -3152 920 -11542 -1048 10733 7915 13636 24340
23929 24340 8427 2826 7063 13899 19127 18413 7943 -1501 -2443 -12144 -8924 -7160 -4845 -4139 -7059
23914 -7059 -12261 -9780 12906 18085 19655 10310 5348 8081 18793 28646 8488 -19122 -21742 -22519
23900 -22519 -13313 -4688 -8917 -16680 -9204 -15913 -16654 -275 3129 4993 12860 24932 25885 5721
23886 5721 2284 3392 4575 -7191 -21688 -27721 -25395 -26220 -24527 -11799 -7590 -11223 -2001 -1773
23872a773q249R967R194K040k8n683m95K059Q81L830k835m768q77p372L685O446
23856F022j565M662L400Q354N293o458j5027L997o4n644M985n68q023o677j383
23841h696m907j346M272J446j165k443k200N600l071Q170L037q329n450K536q005
23826b0551P728J657o681j744K254k002P216Q715L941m649J0563n745R24k593
23812i67n853N929N906L498J228n198P630Q283n964p642j4427M074N905P77j075
23797B104R983O626K177k659o536q706r437j0261k449J0497J3059l994j3586k100
23783a5282J0314j1921J479R384O925k829q935n195o33J4904K1722k0476p822
23770h365K18J0864Q90Q48j619l395p84q102J277J3828j2787j4025J0775J19L456
$$ plain form
23872 -1773 -10022 -55 9139 11179 11151 5468 4973 7032 7913 11743 8908 4140 3263 -4109 -424 6022
23856 6022 4457 9119 12519 20873 26166 19708 4681 8678 8614 2970 7955 7387 -636 -7313 -8696
23841 -8696 -13603 -14949 -10677 -9231 -10396 -12839 -15039 -9439 -12510 -4340 -1303 -9632 -15082 -12546 -20551
23826 -20551 -12823 -11166 -17847 -19591 -17337 -19339 -12123 -3408 533 -4116 6447 702 1626 -967
23812 -967 -6820 -891 5015 8513 9741 4543 12173 20456 14492 6850 -7577 -3503 2402 3179 2104
23797 2104 12087 18713 20890 18231 11695 2989 -6448 -16709 -19158 -8661 4398 404 -13182 -15282
23783 -15282 -4968 -16889 -15410 -6026 899 -1930 -10865 -16060 -16693 -1789 19933 -543 -8365
23770 -8365 -8147 2717 3607 4455 2836 -559 -1343 -9445 -8168 5660 -7127 -21152 -10377 -10258 -6802
23755f802J4302J453n72P62k109o274l635p140j207Q086O916o184M630j0359j5560
23740b3693K594P450k849o740L304J3937k843n017o48P388M269j4318j5265j2700
23726d5131J1183J5024J0535J0011J2517P278k43N607M302j5001j1982k954M880
23713F026J3001r306j9883p396Q873L549r50L720j931r70N397K649L694n538L489
23698D424r207k302J1119p593m28o039P683R922p184o98O4o54q558Q366k209o890
23682a0184J5366p109p719J108Q177n019K851M055M896o052l549l833l916J2475
23668A547N020J104n130j334j6683j2875K0329J0185J0833M50o352k82Q19J349
23654H980J051J1523l991j2121J3972l760j925n752j4709j1265K970J7507k91
$$ plain form
23755 -6802 7500 8953 8381 9143 7034 760 -2875 -10015 -11222 -3136 3780 -2404 2226 -8133 -23693
23740 -23693 -21099 -13649 -16498 -23238 -19934 -5997 -8840 -13857 -14505 -7117 -2848 -17166 -32431 -45131
23726 -45131 -33948 -18924 -8389 1622 14139 21417 21174 26781 31083 16082 4100 1146 6026
23713 6026 19027 9721 -10162 -17558 -8685 -5136 -6086 -2366 -4297 -5267 130 2779 6473 935 4424
23698 4424 -4783 -7085 4034 -3559 -3987 -10026 -2343 7579 395 -303 -239 -893 -9451 -1085 -3294 -10184
23682 -10184 5182 -1927 -9646 -8538 -361 -5380 -2529 1526 6422 370 -3179 -7012 -10928 1547
23668 1547 6567 7671 2541 1207 -15476 -28351 -8022 2163 12996 13446 7094 6812 7631 8980
23654 8980 10031 21554 17563 5442 19414 15654 13729 7977 -6732 -17997 -15027 2480 2189
23641B189K204Q228J378o042l160j0408o576M227p904L02L817m455J2236J338
23627b626M910k132L627j0427q312J3021M947o468M394J2715r822p166k996J9547
23613A3212Q785p537K687P116J3229r238j1685r633j2106o841P918P331R130K805
23599A5173q583l297N477Q558j4605r433j1710P344K943o068J0643J1436l058
23586D820O528O826p541o692l046p32k25K390q925j538J1834k567j0328J5045
23572E849J001q411q757N716J0522K182r006j4268n602K0688M263j710j234n810
23558d577k055L866j0382o622J5233L769J6831k557r052l86N63K905m617n141
23544b222n063j3210M192N258J322J5773J1824j2115o292j0476p755N282N281
$$ plain form
23641 2189 4393 12621 13999 7957 4797 -5611 -12187 -7960 -15864 -15562 -11745 -16200 -3964 -2626
23627 -2626 2284 152 3779 -6648 -14960 -1939 3008 -3460 934 13649 3827 -3339 -6335 13212
23613 13212 21997 14460 17147 24263 37492 28254 16569 6936 -5170 -12011 -4093 3238 12368 15173
23599 15173 6590 3293 8770 17328 2723 -6710 -18420 -11076 -8133 -14201 -3558 7878 4820
23586 4820 11348 18174 10633 3941 895 163 -62 2328 -6597 -8135 3699 1132 -9196 5849
23572 5849 6850 -1561 -10318 -4602 5920 8102 -904 -15172 -20774 -86 4177 2467 1233 -4577
23558 -4577 -6632 -2766 -13148 -19770 -4537 -768 16063 13506 4454 4068 4631 7536 2919 -2222
23544 -2222 -7285 -20495 -16303 -11045 -9723 6050 17874 5759 -533 -11009 -18764 -13482 -8201
23531h201k182O413M414p001L892P168O296Q96L229p443j8351N549L656j1585
23517a3250p171N327Q339l776r760n534M178N958K969L223P00n482j2659Q758
23503a8180Q428M08k723N23M53P221o30p846o463J0254P414l165K504N323L217
23488F738p16L91P802O527j5458j77P121n593r138j515m172P641J839p38J1985
23473A2537j0582q708n582K010M227k867j8371J1262O327j0174O10J5999L851
23460E39m049j701q374K522L229L908K621R696J6831R23j4156j6123l070q9O104
23445a189p107K895K020J1967L113R67P510l694l321J346j5014r189N400K882
23431a414K685m691j3584J0478m24k338m456J3078J1424p947m107P818r969L110
$$ plain form
23531 -8201 -10383 -3970 444 -6557 -2665 4503 10799 11695 14924 7481 -10870 -5321 -1665 -13250
23517 -13250 -20421 -15094 -6755 -10531 -20291 -25825 -21647 -15689 -12720 -9497 -8797 -14279 -26938 -18180
23503 -18180 -9752 -9344 -12067 -11544 -11091 -3870 -4500 -12346 -18809 -8555 -1141 -4306 -1802 3521 6738
23488 6738 6022 6413 14215 20742 5284 5107 12228 6635 -2503 -4018 -8190 -549 1290 552 12537
23473 12537 1955 -6753 -12335 -10325 -6098 -8965 -27336 -16074 -9747 -19921 -19311 -3312 539
23460 539 -3510 -5211 -13585 -11063 -7834 -3926 -1305 8391 25222 26145 11989 -4134 -7204 -7293 -1189
23445 -1189 -8296 -5401 -3381 8586 11699 12666 20176 16482 13161 14507 -507 -9696 -4296 -1414
23431 -1414 1271 -3420 -17004 -6526 -6950 -9288 -13744 -666 10758 2811 -1296 6522 -3447 -337
23417c37q66p882Q05j2786P500K0465M43n695j4969m56M861j916N11J2555q016
23402e783j181p071j0089p509p31J2786J2276M453m263R09J201J27p602n874L081
23387a5270M402q44L489l954J175J1577p365j45j0832k804R045O115k198j547
23373i156L612K931N12j682j0337q520J9584J2697j9406O23N631J1574J0403n627
23359A2839n835M858k944r815N296O241j2637j399m717J117m406N15K028J364
23345g495J1389k210q065j468q581l255Q963J2935K384K087Q603J2604o152p850
23331A3889j971K032l157K704p171l644N619N926j1695j0845J0369P843L176j9173
23317f098j905p849Q359J1302Q280L271m989M705o591j4393q216n99J427k722
$$ plain form
23417 -337 -1203 -9085 -8280 -21066 -13566 6899 7342 1647 -13322 -13778 -8917 -10833 -10322 2233 -5783
23402 -5783 -6964 -14035 -24124 -31633 -32364 -19578 -7302 -2849 -7112 -6203 -5002 -4875 -12477 -18351 -15270
23387 -15270 -10868 -11712 -8223 -12177 -11002 575 -6790 -6935 -17767 -20571 -11526 -5411 -7609 -9156
23373 -9156 -5544 -2613 -2101 -3783 -14120 -22640 -3056 9641 -9765 -9142 -3511 8063 18466 12839
23359 12839 7004 11862 8918 -897 4399 10640 -1997 -3396 -8113 -6996 -11402 -10887 -8859 -7495
23345 -7495 3894 1684 -6381 -7849 -16430 -19685 -10722 2213 4597 6684 15287 27891 21739 13889
23331 13889 11918 13950 10793 13497 6326 2682 8301 14227 2532 -8313 2056 9899 13075 -6098
23317 -6098 -8003 -15852 -7493 3809 12089 15360 10371 15076 8485 -5908 -14124 -14723 -13296 -16018
23303a6018J3620J5072p710k670k13k756j2687K840J4478j896j1639M138P424
23290A983J564L893L409J203o005q032k598O646k66r909k657Q16j0141o442n285
23275c1821J2387N284J356M274L684j3508L420J3526n405L430p405p197P449J852
23261h674N37O312K594L609o591j9103o249J817L670q31Q318K680J507N52m092
23246a3944l828L347j376N921J4354Q921N621L750j4836l289L371q511K988r61
23232A528r670k885K619P940N193Q095l180r077L854o982L580M817m228K21j057
23217G68n298R418Q930j4111q042N484K285R17q124q805P837J1870r274L289J2570
23202I714N695L181N260r908p074k759l258J4813R328q591j3102q024q666L360
$$ plain form
23303 -16018 -2398 12674 4964 2294 2081 -675 -13362 -10522 3956 2060 -9579 -5441 1983
23290 1983 3547 7440 10849 12052 6047 -1985 -4583 2063 1797 -8112 -10769 -9953 -20094 -26536 -31821
23275 -31821 -19434 -14150 -12794 -8520 -4836 -18344 -14924 -1398 -6803 -3373 -10778 -17975 -10526 -8674
23261 -8674 -8137 -1825 769 4378 -2213 -21316 -27565 -25748 -22078 -22909 -14591 -11911 -10404 -9852 -13944
23246 -13944 -17772 -14425 -15801 -9880 4474 13395 19016 22766 7930 4641 8012 -499 2489 1528
23232 1528 -8142 -11027 -8408 -468 4725 12820 9640 563 4417 -2565 1015 5832 1604 1825 768
23217 768 -4530 4888 13818 -293 -8335 -2851 -566 351 -7773 -16578 -8741 3129 -6145 -2856 9714
23202 9714 15409 18590 23850 13942 6868 4109 851 15664 24992 16401 3299 -4725 -13391 -10031
23188a0031k499l394P100J0438p51N107M394N902q530j1722q283j3169K678J6528
23174f232L319M334J1010M675j2158p220m178M759L991j1099p761q34J4926j664
23160d132l570N754J641k533q448m333P817K5151K077p251L578p508q546j4181
23146a4484K256K0741L078k2636m841r054j929J2337k337r598J0870l161q382
23133b7140J7872K159j165O349m429j0443j967j2727M596J1870Q218Q217n91J473
23119B292q765l123M265K316P53O523J16m748N977j3813q578j783Q647J0456R557
23104A0092k1685j2992q90Q889Q506j355R35r782k778P018R249J834q765n851
23090a7575j1438Q731J2141J48l356L32Q655Q79q03j058P882L170m183j1027m559
$$ plain form
23188 -10031 -12530 -15924 -8824 1614 863 5970 10364 16266 7736 -3986 -12269 -25438 -22760 -6232
23174 -6232 -2913 1421 12431 17106 4948 -2272 -6450 -1691 2300 -8799 -16560 -17394 -2468 -4132
23160 -4132 -7702 -1948 -307 -2840 -11288 -15621 -7804 17347 19424 12173 15751 8243 -303 -14484
23146 -14484 -12228 8513 11591 -11045 -15886 -24940 -26869 -14532 -16869 -26467 -15597 -18758 -27140
23133 -27140 -9268 -7109 -8274 -1925 -6354 -16797 -18764 -31491 -26895 -15025 -6807 1410 819 2292
23119 2292 -6473 -9596 -5331 -3015 -2262 4261 4377 -371 5606 -8207 -16785 -18568 -9921 535 10092
23104 10092 -11593 -24585 -25475 -16586 -8080 -9435 -8500 -18282 -21060 -14042 -4793 -2959 -11724 -17575
23090 -17575 -29013 -20282 -8141 -7993 -11349 -11017 -2362 -1483 -2286 -3344 4538 7708 3525 -7502 -12061
23075a2061p590O487L831n49P209n342n971J249J0025J1666o824o6o576K692P140
23060E320K267o703j0133J32j444P688N055j009J349j8304N664J6030J033j1345
23046d400P437r038j8750R222J0244K037p617j0965r226Q663O720O581j0233K68
23032a9057l034p607N460j323k244J3315O978j0146k469Q334J2759O225P834k072
23018A2953p995n150j5369r089P549O679R754L367J6179n538k0271l545J1799
23005A323j056o776q30J0472J3996O952j2507J186N228M437j32k099j4p012p549
22990E619m704m238L794l248O842N739k502n819r064l347P922J725P9j484N224
22975B538O510N318l203p846J1694J35n49j3400l516j099o916o00R862N262M570
$$ plain form
23075 -12061 -19651 -13164 -9333 -9882 -2673 -8015 -13986 -12737 -2712 8954 2130 2064 -4512 -1820 5320
23060 5320 7587 884 -9249 -9117 -10561 -2873 2182 1173 2522 -15782 -10118 5912 6945 -4400
23046 -4400 3037 -6001 -24751 -15529 -5285 -3248 -10865 -21830 -31056 -22393 -15673 -9092 -19325 -19057
23032 -19057 -22091 -29698 -24238 -25561 -27805 -14490 -7512 -17658 -20127 -11793 966 7191 15025 12953
23018 12953 4958 -192 -15561 -24650 -17101 -10422 -668 2699 18878 13340 -6931 -10476 1323
23005 1323 267 -6509 -7339 3133 17129 24081 11574 12760 17988 22425 22293 20194 20180 13168 5619
22990 5619 915 -3323 471 -2777 4065 9804 7302 1483 -7581 -10928 -3006 -1281 -1202 -2686 2538
22975 2538 9048 14366 11163 3317 15011 15146 14597 1197 -2319 -3418 -10334 -10934 -1072 4190 8760
22960H760n953j8987p845m868L341J1164N813p219K913j530m045o504J3448K1115
22946I603J5467j1053j6897j1913p319J5300P483n046o957J0294n06o760L294
22933e010k925M496P995Q328j046q152j6687J0042J0059j853M536k76q59n595
22919C053n507Q754P641l707j4552q203P670K977R414N840p075l294J173J786
22905E970M117l417o664L801P696J1966K22j5638n944k283K42q557n50q420m015
22890b1474M079P20J402k005R223J8015R817j4526q726k139O608q978o342p682
22876b2008L237J6451J3443k137n223j18l261N600P002j7013j7573O16O442L677
22862a0865N275n752o844J163J3583K568m12J783R788K762o410r29o13k459q310
$$ plain form
22960 8760 2807 -16180 -24025 -28893 -25552 -14388 -8575 -15794 -12881 -14411 -18456 -24960 -11512 9603
22946 9603 25070 14017 -2880 -14793 -22112 -6812 671 -4375 -11332 -1038 -1544 -8304 -5010
22933 -5010 -7935 -3439 4556 12884 11838 3686 -13001 -2959 7100 5247 9783 9507 8648 3053
22919 3053 -2454 6300 13941 10234 -4318 -12521 -4851 -1874 7540 13380 6305 3011 4184 5970
22905 5970 10087 6670 6 3807 11503 23469 23691 8053 2109 -174 68 -8489 -9039 -17459 -21474
22890 -21474 -17395 -16675 -15273 -17278 -8055 9960 19777 5251 -3475 -5614 994 -7984 -14326 -22008
22876 -22008 -18771 -2320 11123 8986 3763 3645 384 5984 12986 -4027 -21600 -20984 -14542 -10865
22862 -10865 -5590 -11342 -18186 -17023 -3440 -872 -1284 499 10287 13049 6639 5710 5097 2638 -5672
22847e672m045P401L331n251M159J7875O142p517j4133o782J44r086L624J2541
22833B731k658j0219J1486O681o32q517R528p97L500r244q889M500o088p050N222
22818a0446P269J4827M449q533L686l974J078n273n493J17k537j612J7128J5654
22804B6340N661j1237j3970o891K600r446m179J251n788P822M470L690L424lm456
22789g12l886k43L750J2009o164q764K510J496K516M930n1n94J222m215N384M673
22773A3861J0743k471l139m969j1037j4058l986q043J43J732N854J930j9199l354
22759c5993M441Q584J6970Q084K495k6977j3761R227P807k113J066J7882K589
22746C01M404l84m684K054j2486l485o480l57R445O489Q042q44N480n860j0292
$$ plain form
22847 -5672 -9717 -2316 1015 -4236 -77 17798 23940 16423 2290 -4492 -4348 -13434 -9810 2731
22833 2731 73 -10146 1340 8021 7389 -1128 8400 7603 11103 1859 -7030 -2530 -8618 -15668 -10446
22818 -10446 -3177 11650 16099 7566 11252 7278 8356 3083 -2410 -2293 -4830 -6442 10686 26340
22804 26340 32001 20764 6794 -97 2503 -6943 -11122 -9871 -15659 -7837 -3367 323 3747 3744 -712
22789 -712 -4598 -4841 -1091 10918 4754 -4010 -1500 -4 2512 7442 7391 6797 8019 3804 9188 13861
22773 13861 24604 22133 18994 14025 2988 -11070 -15056 -23099 -22956 -21224 -15370 -13440 -32639 -35993
22759 -35993 -31552 -22968 -5998 2086 4581 -22396 -36157 -26930 -19123 -21236 -20170 -2288 301
22746 301 4705 4321 -363 1691 -10795 -14280 -20760 -21117 -11672 -5183 2859 2015 7495 1635 -8657
22731h657J7517R672M538j9932j4625J4921M196k8335j5092O075K0321J8760l738
22718E621l375j3879L195M632k760J0950J3154J0613j217j1479M05l004p845K771
22704G782J1151o107n122K401m268q928o047j179k068J0308R380L147o526m694
22690g70k742J0439r52L118p605j659m026Q237k44p362R054L298j1541M318m130
22675b567j83l64M287l680r545m704K460N549L775r96M17M833J5K77P123j38L808
22658A0367k253P93m773q415L571J0640J635n734O338N620k5153j1301n116R098
22644a4683J1050J5105o014j3085J364M988o941l095M888m16J6266O396j7798
22631a975l967o345N485P08M295Q432j2305j2376n039k434J6773J642k580L973
$$ plain form
22731 -8657 8860 18532 23070 3138 -11487 3434 7630 -20705 -35797 -29722 -9401 9359 5621
22718 5621 2246 -11633 -8438 -3806 -6566 4384 17538 28151 26934 15455 15860 12856 5011 7782
22704 7782 18933 12826 7704 10105 5837 -3091 -9138 -10317 -12385 -2077 7303 10450 3924 -770
22690 -770 -3512 6927 5975 9093 1488 -171 -4197 4040 3796 -3566 5488 8786 -2755 1563 -2567
22675 -2567 -2750 -3114 1173 -2507 -12052 -16756 -14296 -8747 -4972 -5968 -5551 -718 -703 -426 6697 6559 10367
22658 10367 8114 8907 4134 -4281 -710 9930 11565 5831 12169 17789 -7364 -18665 -23781 -14683
22644 -14683 -3633 11472 5458 -7627 -6263 -1275 -8216 -11311 -6423 -6839 9427 15823 -1975
22631 -1975 -5942 -12287 -6802 -6094 -1799 6633 -5672 -18048 -23087 -25521 -8748 -7106 -9686 -5713
22617e713K965p88R348k4K715k232L414P758o235k4594Q7J0806j2413K802K0917
22602H813Q213r319o928n479K6473O290l664q553k0843p412L663L727m153k519
22588a1691j4674j1913M604R224N262N970j164k662q409P849O585k181n217K752
22574a5665Q21K150K476J2191Q07j2597L838L142j0470L395j721m41Q452L527
22560i5P417L76j7187j509j0533m756L845N479P11J95J5610L682m839Q72j222
22545a954L277K092o14n963M564o587q000J2477j072n084o376l237J4010O748
22531D281J047J0101n454o581M922q384j1899j0844q646J0336L346L251Q855n113
22517a0782l421k973O220J0650O44m935J454k588m172k105O149j206P010p922
$$ plain form
22617 -5713 -2748 -3536 5812 5788 8503 6271 9685 17443 11208 -13386 -13299 -2493 -14906 -12104 8813
22602 8813 17026 7707 779 -4700 21773 28063 24399 15846 -4997 -12409 -8746 -5019 -9172 -11691
22588 -11691 -26365 -38278 -33674 -24450 -19188 -13218 -14382 -17044 -25453 -17604 -11019 -13200 -18417 -15665
22574 -15665 -14844 -12694 -10218 1973 2780 -9817 -5979 -2837 -13307 -9912 -11633 -12074 -3622 -95
22560 -95 7322 7698 -9489 -10998 -21531 -26287 -22442 -16963 -16252 -16057 -447 3235 -1604 -732 -1954
22545 -1954 1323 3415 2801 -3162 1402 -5185 -13185 -708 -1780 -6864 -13240 -16477 -2467 4281
22531 4281 5328 15429 9975 3394 8316 -68 -11967 -22811 -31457 -21121 -17775 -14524 -5669 -10782
22517 -10782 -14203 -17176 -10956 -306 338 -4597 -3143 -5731 -9903 -12008 -5859 -7065 -55 -7977
22503g977P822q93m214j674O459N221N34l371q104k638J140L791k162q282K336
22488a2012J744M319m582Q706k532p307O324O238j925j0716k388N91L570Q75l631
22473a2726M312R423J3481J496j0603j2062P779q762j6891P23J0434N167J2522
22460D293n21j2698P02N064o926m991M740l770j2292j115k102J443N242J6635
22446f296R389r810j0282J571L582J0088k377J296J2948o978N748J00l075p328
22432a424Q302n629j3606J9058J5626n823r969j5847p192L141N875j878q92l299
22418a3557L614N853M154j503k389j2159n383J9489O363k401k425P250q885K058
22404G9J092o124n317J2299k482q068n76k273m439L915O140J0108j400k626M011
$$ plain form
22503 -7977 -155 -1048 -5262 -6936 -477 4744 5278 1907 -6197 -8835 -7695 -3904 -6066 -14348 -12012
22488 -12012 -10268 -5949 -10531 -1825 -4357 -11664 -5340 898 -1027 -11743 -14131 -13540 -9970 -9095 -12726
22473 -12726 -8414 1009 14490 15986 5383 -6679 1100 -7662 -24553 -23830 -13396 -8229 4293
22460 4293 3772 -8926 -8224 -3160 -10086 -15077 -10337 -14107 -26399 -27514 -29616 -28173 -22931 -6296
22446 -6296 3093 -6717 -16999 -15428 -11846 -1758 -4135 -2839 10109 3131 8879 8979 5904 -1424
22432 -1424 6878 1249 -12357 6701 22327 16504 6535 -9312 -16504 -13363 -7488 -9366 -10258 -13557
22418 -13557 -9943 -4090 64 -1439 -3828 -15987 -21370 -1881 4482 2081 -344 6906 -1979 79
22404 79 1171 -4953 -10270 2029 -453 -8521 -9097 -11370 -15809 -11894 -5754 4354 2954 328 4339
22389D339L904o63r985r451J403O241j248k042p332M889M898M203K353P663k2366
22374a3194k1270K743K1639J1665J604M01j0477q089K153J674N904N657M851j852
22360C409r325k986Q739M831o965r728O823j3250p024M677J0825P893p56n015
22346g852l027J2080j0074j2095k280Q492k155Q970M316J304R272Q67n790L449
22332E477L833j128j0069J441K219k312m237M879k791O993o083O077J9484K329
22318B6112o092o584o568P476L909j3829j2497N961P610L291k040j119M855p179
22304C306M76J48P479Q835k2569J77Q300L197N899K0706l499j4107j8644R599
22290I303M95n355m271j736Q965M629n358j6913l005M809O716J642K609p014j5843
$$ plain form
22389 4339 8243 7580 -2405 -11856 -10453 -4212 -5460 -7502 -14834 -9945 -5047 -844 1509 9172 -13194
22374 -13194 -34464 -31721 -10082 1583 3187 3588 -6889 -14978 -12825 -11151 -5247 410 5261 3409
22360 3409 -5916 -8902 -163 4668 -2297 -12025 -5202 -18452 -25476 -20799 -9974 -2081 -2837 -7852
22346 -7852 -10879 1201 -8873 -20968 -23248 -14756 -16911 -7941 -3625 -2321 6951 7818 2028 5477
22332 5477 9310 8182 -1887 -446 1773 -539 -4776 103 -2688 4305 -1778 4299 23783 26112
22318 26112 20020 13436 6868 14344 18253 4424 -8073 -2112 5498 8789 6749 5630 10485 3306
22304 3306 3782 3930 11409 20244 -2325 -2148 6152 9349 15248 35954 32455 18348 -296 9303
22290 9303 9798 4443 172 -1564 7401 12030 6672 -10241 -13246 -8437 -1721 -79 2530 -4484 -20327
22275b0327n839Q00J1037l84J456R431J913j184m673m635N015n433r678j958k321
22260b6780O878J4494l6j1147L686J59q878J2321K512j4488O843O269l403P053
22246d517q411l396L703N627r23k573j725P892K846l198o551j689Q921M027j2417
22231a2384p327Q008L248n185q673o393o045J881J1484N768q863L794R717m858
22217a5828o443j913P065J1090j3506M162J8044M488l665j0760j2804Q477J4767
22204C174L241q594j457L342k212n945N443P497q780N475Q414n770K529M801o05
22189A0553r142R81j567j710N824M356O29j1738j156l636j030l147m115k663O792
22174a0769R989q100m538J6853P665j0416j2267j2903l99J2525L166P024m096
$$ plain form
22275 -20327 -26166 -25366 -14329 -14713 -13257 -3826 -1913 -3097 -7770 -12405 -7390 -12823 -22501 -24459 -26780
22260 -26780 -19902 -5408 -5444 -16591 -12905 -12746 -21624 -9303 -6791 -21279 -14436 -8167 -11570 -4517
22246 -4517 -12928 -16324 -12621 -6994 -7917 -10490 -12215 -4323 -1477 -4675 -11226 -12915 -3994 33 -12384
22231 -12384 -19711 -11703 -8455 -13640 -22313 -28706 -34751 -32870 -21386 -15618 -24481 -20687 -10970 -15828
22217 -15828 -22271 -24184 -17119 -6029 -19535 -15373 2671 7159 3494 -7266 -20070 -11593 3174
22204 3174 6415 -2179 -3636 -294 -2506 -8451 -3008 4489 -4291 1184 9598 3828 6357 11158 10553
22189 10553 1411 2392 825 -885 4939 9295 9924 -1814 -2970 -6606 -7636 -10783 -14898 -17561 -10769
22174 -10769 -780 -8880 -13418 3435 11100 684 -11583 -24486 -24885 -12360 -9194 -2170 -6266
22161f266n841R314J1398m364j565M39r702o555m340M0P820M702r12J1002K011
22146G181J728P614m641j1127j2794O516J0875J2130m264j1356Q774l006o598
22133A032m100n776r150N929Q048m479J721J441p869j1048J5856P275o058J3713
22119F535j66j0601J124N727o65l529j941K0139o919j2693R30J1753K263r146
22105B811k209o106J946k537M700J0520j2707p973N316P178J195K006k7652O138
22091a7374N155L777J0801R090o320k651M892J555n752m077n519k396J6998J528
22077I707j5201j5337L167N639m657M810j912K850J0268L201j245o248J16j4911
22063a9753k051J0903M598j1792N609Q305j3947O796q010J1009J9886k052j329
$$ plain form
22161 -6266 -12107 -2793 8605 4241 2676 3115 -6587 -13142 -17482 -17442 -9622 -4920 -5832 5170 7181
22146 7181 8909 16523 11882 755 -12039 -5523 5352 17482 13218 1862 10636 7630 1032
22133 1032 -3068 -8844 -17994 -12065 -4017 -8496 -6775 -5334 -13203 -24251 -8395 -1120 -7178 6535
22119 6535 6369 -4232 -3108 2619 1954 -1575 -3516 16623 9704 -2989 -2059 9694 11957 2811
22105 2811 602 -5504 -3558 -6095 -1395 9125 -3582 -11555 -6239 939 2134 4140 -23512 -17374
22091 -17374 -12219 -8442 2359 11449 5129 2478 7370 8925 3173 -904 -6423 -8819 8179 9707
22077 9707 -5494 -20831 -17664 -12025 -16682 -11872 -13784 -10934 -666 2535 1290 -4958 -4842 -19753
22063 -19753 -21804 -10901 -6303 -18095 -12486 -4181 -18128 -11332 -19342 -8333 11553 9501 8172
22050H172k889q408j255K073k69N355M311r926m163k456P28J053J2156J4j1259
22035f763J662J0637K742j7141J256m740j785R752R150K441p466j399L89M945
22021C680n569P74L689J112Q0Q683j6528j994j230K217j2942l984J563l451K537
22006b1363O901M116P190j435q431J4560L470K798K452o700k187M034O393R792
21992B1590J0795j0625j8740j446j517j6346k623J3289J6786Q632O48r765j1763
21979a085Q44l870j4463N956J749O744N318Q541R99N844j1517m962l13N94L567
21964C946L702o683r063l832m891l390m96Q814l358o927O683J2332n473m781j328
21949a4745O900K2725q490j9331L086m348j755L096Q866N080o088M412O889j1174
$$ plain form
22050 8172 5283 -3125 -4380 -2307 -2576 2779 7090 -2836 -6999 -9455 -8727 -7674 4482 4496 -6763
22035 -6763 -5101 5536 8278 -8863 -7607 -12347 -14132 -4380 4770 7211 -255 -1654 -1265 3680
22021 3680 -1889 -1115 2574 3686 3766 12449 -4079 -6073 -7303 -5086 -18028 -22012 -20449 -23900 -21363
22006 -21363 -14462 -10346 -3156 -4591 -13022 1538 5008 7806 10258 3558 1371 5405 11798 21590
21992 21590 32385 21760 3020 1574 57 -16289 -18912 -5623 11163 19795 20443 10678 -1085
21979 -1085 -241 -4111 -18574 -12618 -10869 -4125 1193 9734 10733 16577 5060 98 -215 379 3946
21964 3946 7648 965 -8098 -11930 -16821 -20211 -20707 -11893 -15251 -22178 -15495 -3163 -8636 -13417 -14745
21949 -14745 -7845 14880 6390 -12941 -9855 -14203 -15958 -12862 -3996 1084 -5004 -592 6297 -4877
21935d877j2699j769J0902Q271N014O88L536L616j5062j1695o558R801K468P98
21921g566M083o22j6205m445l892K039K141R346P366k043K293P237j0215j084
21907a1567J0754K172j1976o850K253j1090n871l306J0981J1267P529K06L224
21894b274m94n794J2495o099j2012J5511j1187p895j244l89M174k590q827J2673
21880a3952k766M533l191j039K007K228j0225J2232o691o731J3372J1641M596
21867F014N528m629O1J438j1275q675j828K992k033L293P764j9365O26O660p30
21852a4159P333M742j2688j0144J832L973J1168l844j0610M372O038O892j1825
21839a6920M913J5640P502o427r022j6992K56J286Q688J3382j1454j011Q627P890
$$ plain form
21935 -4877 -17576 -19345 -8443 -172 4842 5530 9066 12682 -2380 -14075 -20633 -10832 -8364 -7566
21921 -7566 -3483 -4105 -20310 -24755 -28647 -26608 -24467 -15121 -7755 -9798 -7505 -268 -10483 -11567
21907 -11567 -813 1359 -10617 -17467 -15214 -26304 -32175 -35481 -24500 -13233 -5704 -5498 -2274
21894 -2274 -2768 -8562 3933 -2166 -14178 1333 -9854 -17749 -18993 -19382 -15208 -17798 -26625 -13952
21880 -13952 -16718 -12185 -15376 -16415 -14408 -12180 -22405 -10173 -16864 -23595 -10223 1418 6014
21867 6014 11542 6913 6974 8412 -2863 -11538 -13366 -10374 -12407 -9114 -1350 -20715 -20089 -13429 -14159
21852 -14159 -6826 -2084 -14772 -24916 -23084 -19111 -7943 -11787 -22397 -18025 -11987 -5095 -16920
21839 -16920 -12007 3633 11135 4708 -4314 -21306 -21050 -19764 -11076 2306 -9148 -10159 -1532 6358
21825F358j4477K381k128p641o093J607J130P448M308K867l435K546K806L100
21811G77q145Q449J3195L768j4928P481p913j5206m168K551l572J5422R276l062
21797C925j7721k610J635J4907K2154p392j986M51j1603j4827O776p022l933J2433
21783d813J2546q021j1546J0212R870m870j806k149J258M308l432l528j1620p7
21769a3668J1986M735p024k189J63p613L054K699N744O834p054j949L250Q851
21755G819Q980r871n968J4434n504k1005J884Q036L695n782O621L527n562J428
21741B732J330J9778M655p158o896K727Q706P135J340j5293j2395K81J3010j1128
21727H824j5006j0950K914K152k535R592l942o142o552P353J3861O374j9556j6540
$$ plain form
21825 6358 -8119 -5738 -7866 -15507 -21600 -19993 -18863 -11415 -7107 -4240 -7675 -5129 -2323 777
21811 777 -7368 1081 14276 18044 3116 10597 2684 -12522 -16690 -14139 -17711 -2289 6987 3925
21797 3925 -13796 -16406 -14771 136 22290 14898 12912 13363 1760 -13067 -6291 -13313 -17246 -4813
21783 -4813 7733 -288 -11834 -1622 8248 3378 1572 -577 681 4989 1557 -1971 -13591 -13668
21769 -13668 -1682 3053 -3971 -6160 -5997 -13610 -10556 -7857 -2113 4721 -2333 -4282 -1032 7819
21755 7819 16799 6928 960 15394 9890 -11115 -9231 -1195 2500 -3282 3339 6866 1304 2732
21741 2732 4062 23840 28495 21337 14441 17168 25874 33009 34349 19056 6661 6942 19952 8824
21727 8824 -6182 -17132 -14218 -12066 -14601 -5009 -8951 -15093 -21645 -14292 -431 5943 -13613 -30153
21713c0153M657N739m876P190O644K097Q44q045m658K380M458k379l18r64m406
21698b1790R873Q235O287Q619r091j205l350J6213P60j4039l805n254n84j1106
21684b0237J414k156j0280Q784Q240R893N280j7260k030P1M263P244N408l772
21670e138O526P28j5966j730j132l425R905J181j3475L881J7508L171q837p200
21656a4003n434j0027m874k298R480O122n001J8746J6671N181o881j7148O057
21643c409R391q642j5572J2824J0796J0136r836j659J925k689q30k977Q86q754
21629h410N99J20O154O658n436r58K420P652P700k1398n342N226P042n117p379
21614a0469o420l315N994j089N13J4156M731n653m498J5720P272k358M271J191
$$ plain form
21713 -30153 -25496 -19757 -24633 -17443 -10799 -8702 -7858 -15903 -20561 -18181 -13723 -16102 -16420 -17384 -21790
21698 -21790 -11917 -3682 2605 11224 2133 928 -2422 13791 14551 512 -3293 -8547 -9131 -20237
21684 -20237 -18823 -20979 -31259 -22475 -14235 -4342 938 -16322 -18352 -18281 -14018 -6774 -1366 -5138
21670 -5138 1388 2116 -13850 -15580 -16712 -20137 -10232 -9051 -22526 -18645 -1137 2034 -6803 -14003
21656 -14003 -19437 -29464 -34338 -36636 -27156 -21034 -26035 -7289 9382 14563 7682 -9466 -3409
21643 -3409 5982 -2660 -18232 -5408 5388 15524 5688 4029 5954 3265 2435 -542 344 -8410
21629 -8410 -7811 -7691 -1537 5121 -315 -1273 1147 8799 16499 -4899 -10241 -5015 2027 -3090 -10469
21614 -10469 -16889 -20204 -14210 -15299 -14786 -630 4101 -1552 -6050 9670 16942 14584 18855 20046
21600B0046J8l476J368k789N045o335j4193p24O599l371k196J2276N958j1438
21586F788l811L137J2291j1629j2065n494N084R500J759M940P790j531n893J31
21572A0997J943j0897Q292L745j3049j4620R479R371P180N267o697j3039K574
21559E46m173O386N178j3717r612q411j991k74K591n647J2518J3918k642n862
21545a1192R029p71J1271P921q563o595J670R66j1265J368J1057r834j3961O181
21531a2718O765P558m625k681N324M635P422P468p28j2806n889Q48p928p837L634
21516a1558Q572j4812j0842R868m286P307J4760J8031j3303p217R537O34j6025
21503i334j0147O953J9338N36n859M177k943n766L207j34r669k588k713j0567
$$ plain form
21600 20046 20064 16588 17956 15167 20212 13877 -316 -1040 5559 2188 -8 12268 18226 6788
21586 6788 2977 6114 18405 6776 -5289 -10783 -5699 3801 5560 10500 18290 16759 10866 10997
21572 10997 12940 2043 10335 14080 1031 -13589 -4110 5261 12441 17708 11011 -2028 546
21559 546 -3627 2759 7937 -5780 -15392 -23803 -25794 -26068 -23477 -29124 -16606 -2688 -5330 -11192
21545 -11192 -2163 -2934 8337 16258 7695 1100 2770 3736 -7529 -6161 4896 -4938 -18899 -12718
21531 -12718 -5953 1605 -3020 -5701 -377 4258 11680 19148 18420 5614 -275 573 -7355 -15192 -11558
21516 -11558 -2986 -17798 -28640 -18772 -23058 -15751 -991 17040 3737 -3480 6057 6691 -9334
21503 -9334 -19481 -12528 6810 7346 1487 5664 2721 -3045 162 28 -9641 -12229 -14942 -25509
21489b5509J069n911R364K0046K906n506j5327k657O495N653L458k111k209j357
21475a1596O470J3071K248R409L804m661n967l568j201r500j0157o851O789J1063
21461f47O454k365k727n800n939r61o367l029q177l130J1975R225M229K222j4810
21446a9847j9326N927M380m55p259k462J2445J3171P946J6354M910o797j218L058
21432A0827l199K326o471j0246o675L818K070J5617j214j3863j5638m445J0093
21419a7000J840O223O81Q141N149k922j1589M185J0391K400m214j896J0413p390
21405D412k668o9K456J1077o722o488J160O35o172k236l832Q059J4464k0684j5378
21390b1986K024j274P820J6152M561o553n718J2604j1412j2481K415J2243J4549
$$ plain form
21489 -25509 -24440 -30351 -20987 -941 1965 -3541 -18868 -21525 -15030 -9377 -5919 -8030 -10239 -11596
21475 -11596 -5126 7945 10193 19602 23406 18745 12778 9210 8009 -1491 -11648 -18499 -11710 -647
21461 -647 5807 3442 715 -5085 -11024 -11985 -18352 -21381 -29558 -32688 -20713 -11488 -7259 -5037 -19847
21446 -19847 -39173 -33246 -28866 -29321 -36580 -39042 -26597 -13426 -5480 10874 15784 8987 7769 10827
21432 10827 7628 9954 3483 -6763 -13438 -9620 -7550 8067 6853 -7010 -22648 -27093 -17000
21419 -17000 -15160 -8937 -8256 -115 5034 2112 -9477 -5292 5099 7499 3285 1389 11802 4412
21405 4412 1744 1675 4131 15208 8486 1998 3158 3793 -2379 -4615 -8447 -388 14076 -6608 -21986
21390 -21986 -19962 -21236 -13416 2736 7297 744 -4974 7630 -3782 -16263 -13848 -1605 12944
21377A2944j704j3314j57J4134L437J405J4976j1804k862o912j0584j2075j0335
21364b2851m050N025k806P405Q733O707m554j5652J365J5484N325m772l689P92
21350g538k561j566Q477l335j2890J4216R425J0918K13j4496q944l55q52O829
21336b459N975j369l766N16j1671O135k142J370J0841P179J768q915k096P717
21322I083J391O888K260j1812j0849m738N655J4552n039l436J093j0844k0035
21309b5831N880j8630R566O683J4451M111n184j2951q181J4954M534k745m381
21296a7724o108m523n710M562J1635j066Q851l160K091n035l080o953L013j293
21282b4500M333j174Q448N933p865N945p250J0305K0774j654j3991j1198l067
$$ plain form
21377 12944 11240 -2074 -2231 11903 15340 16745 31721 19917 17055 10143 -441 -12516 -22851
21364 -22851 -26901 -21876 -24682 -17277 -8544 -1837 -6391 -22043 -20678 -5194 131 -4641 -8330 -7538
21350 -7538 -10099 -11665 -3188 -6523 -19413 -5197 4228 15146 15359 863 -8081 -8436 -9288 -2459
21336 -2459 3516 2147 -1619 -1103 -12774 -6639 -8781 -7411 3430 10609 12377 3462 1366 9083
21322 9083 10474 17362 19622 7810 -3039 -7777 -2122 12430 7391 3955 5048 -5796 -25831
21309 -25831 -19951 -38581 -29015 -22332 -7881 -3770 -8954 -21905 -30086 -15132 -10598 -13343 -17724
21296 -17724 -23832 -28355 -34065 -29503 -17868 -18934 -10083 -13243 -11152 -16187 -19267 -26220 -23207 -24500
21282 -24500 -20167 -21341 -12893 -6960 -14825 -8880 -16130 -5825 14949 13295 -696 -11894 -14961
21269a4961n833j531M359J537o579P774O458p657Q018K2895K4368l332j7708j7556
21255B52j2259l575J345J4826O288k962m088R786j0909m742M194J1001K78P90
21241A0225j0606r053M359O979n791j6261m820L256K020J0503K362P366J0459
21228A0998l75n060j1998q975K227J663q232j149O952J3022L732N322r365J125
21214a13M292l292J500j018p350m812J8789q531l335M172J0521M390L878j3337
21200E754r152N743l085n097m187J0806k957N738J3672r48L236M025j3588j1448
21186a488M981m215M703L862K41j5544j9260j598J1234O087j183J39J591J0560
21172A10p263j0239K251J5330P72l213L01M145k440j2611j6672j700J9905O094
$$ plain form
21269 -14961 -20794 -22325 -17966 -16429 -23008 -15234 -8776 -16433 -8415 14480 38848 35516 17808 252
21255 252 -12007 -15582 -14237 589 6877 3915 -173 9613 -1296 -6038 -1844 9157 9435 10225
21241 10225 -381 -9434 -5075 1904 -3887 -20148 -24968 -21712 -19692 -9189 -6827 539 10998
21228 10998 10623 5563 -6435 -15410 -13183 -11520 -19752 -20901 -13949 -927 2805 8127 -1238 -113
21214 -113 4179 887 2387 1369 -5981 -10793 7996 -535 -3870 302 10823 15213 19091 5754
21200 5754 -3398 2345 -740 -5837 -10024 782 -2175 3563 17235 16287 19523 23548 9960 -1488
21186 -1488 3493 -722 3981 7843 8084 -7460 -26720 -28318 -17084 -10997 -12180 -12041 -10450 110
21172 110 -7153 -17392 -15141 189 961 -2252 -1951 2194 -246 -12857 -29529 -31229 -11324 -5230
21158e230l990J9594l831r776q477r551J0780J5270r120j2438j56k508K61O808
21144a2364J5175J328j3542L527J4890k39l294n914K61J1511l944r620k536n717
21130a0478P751M239n729r502o540M869M168j024P22k371m100R861J579k773q5
21115i413Q149J0055n623J814J691j6489j7653k93K2480J3716j896j3054j6495
21102b3011J6988R61Q17J6591l548k0543Q454P161o360j474P576o962J9459N430
21088B1539m061j579m984j6754o43K537j868l704n339J4338N556O364k320j7479
21074h397o701J6411M282Q587k049j8397n591O573o325j1522L035J3755K0859
21061A4520r48n858K267J776q553q882k98r9J652k674J238O271J1964o976j5478
$$ plain form
21158 -5230 -9220 10374 6543 -3233 -11710 -21261 -10481 4789 -4331 -16769 -16925 -19433 -19172 -12364
21144 -12364 2811 4139 -9403 -5876 9014 8775 5481 -433 -172 11339 7395 -2225 -4761 -10478
21130 -10478 -2727 1512 -4217 -13719 -20259 -15390 -11222 -12246 -11524 -13895 -17995 -8134 -6555 -9328 -9413
21115 -9413 -1264 8791 3168 4982 6673 -9816 -27469 -27762 -5282 8434 6538 -6516 -23011
21102 -23011 -6023 -5062 -4245 12346 8798 -11745 -3291 3870 -2490 -3964 3612 -3350 16109 21539
21088 21539 17478 15899 10915 -5839 -6482 -3945 -5813 -9517 -14856 -518 5038 11402 9082 -8397
21074 -8397 -15098 1313 5595 14182 12133 -6264 -11855 -5282 -11607 -23129 -20094 -6339 14520
21061 14520 13572 7714 9981 11757 3204 -5678 -5976 -6075 -4423 -7097 -5859 412 12376 5400 -10078
21046a0078J148M309M359O981o834j4764r079O613J1384J207j3057l748J234r658
21032b9983J10J7485J1729j2875j9085Q621R135q85O21R655p783n721M513J7769
21018C306P684O571o432p389r373M790j46J639j2452l739M24J4161O356p872j2239
21003a4711o683N228N405J4030k560j3470O47Q034O413p281M470J1865j1173j1729
20989a1515L432o086r423K2309R168r214Q506R407k139k980q122m628m359m847
20975a0491K35O443J0693p942l547j6M161j4m479J273L378p344L419J0302K994
20960I065n387M092M116j5549j5041M753J4181m393r473L396J2398L238j3717
20947h321q303R256J3488j439o074j1080k8490n837l21J0876Q320p32J5532O547
$$ plain form
21046 -10078 -8930 -4621 -262 6719 -115 -14879 -23958 -17345 -5961 -4754 -17811 -21559 -20325 -29983
21032 -29983 -29873 -12388 -659 -13534 -32619 -23998 -14863 -15748 -15127 -5472 -13255 -18976 -14463 3306
21018 3306 10990 17561 11129 3740 -5633 -843 -989 650 -11802 -15541 -15117 -956 5400 -2472 -14711
21003 -14711 -21394 -16166 -10761 3269 709 -12761 -12114 -4080 2333 -4948 -478 11387 214 -11515
20989 -11515 -8083 -14169 -23592 -1283 7885 -1329 7177 16584 14445 11465 3343 -1285 -5644 -10491
20975 -10491 -10256 -3813 6880 -1062 -4609 -4625 -464 -478 -4957 -3684 -306 -7650 -4231 6071 9065
20960 9065 3678 7770 11886 -3663 -18704 -13951 230 -4163 -13636 -10240 2158 5396 -8321
20947 -8321 -16624 -7368 6120 4681 -1393 -12473 -40963 -46800 -47121 -36245 -27925 -28657 -13125 -6578
20933f578K432p154j6509P975J3317j568M134N183J941J0046J003l610k897j368
20919F347K304J176j2996o209J919j2524k887K447Q686K414m36R889k898R941
20905G173P906J0164M486j458j6945j6031l040J0230J195j832r86N522J2566r975
20891H975P238q725q785r125k605n583q982K272L103J2934P998n290Q201J4568
20877A6194O598q24j5209q978K903J869J61j495n414p826l574q643J932n778K360
20862b5724O102j610j735j526q213R954J4150N198j77l032P846J2204q699m558
20848A80j2740k33q119j0562J1318J1934M864o8m715j34M07J2086k920R677o691
20833D284j5670J051O361l699j1174O673n977Q117J311n313J805Q485O98J943
$$ plain form
20933 -6578 -4146 -11300 -27809 -19834 -6517 -8085 -3951 1232 3173 13219 14222 10612 7715 6347
20919 6347 8651 9827 -3169 -9378 -7459 -19983 -22870 -20423 -11737 -9323 -9759 130 -2768 7173
20905 7173 15079 25243 29729 28271 11326 -4705 -7745 2485 3680 1848 862 6384 18950 8975
20891 8975 16213 7488 -1297 -10422 -13027 -18610 -27592 -25320 -22217 -9283 -1285 -6575 1626 16194
20877 16194 22792 21968 6759 -2219 684 2553 2714 1219 -4195 -12021 -15595 -24238 -22306 -28084 -25724
20862 -25724 -19622 -21232 -22967 -24493 -32706 -22752 -8602 -3404 -3581 -6613 1233 13437 4738 180
20848 180 -12560 -12793 -20912 -31474 -20156 -8222 -3358 -3426 -8141 -8275 -7868 4218 1298 10975 4284
20833 4284 -11386 -10335 -3974 -7673 -18847 -12174 -18151 -10034 -8723 -14036 -12231 -3746 -3048 -1105
20819a105J322n990M887M026p1k326o747M009J1379Q345n306m023N429j538j3633
20804a342R68k848m520n614P392R203O633q998m458q134o02M212r785j903l878
20789b3674m474J8987R779l576n640J853L2L338N412Q926O55j6232M103j391Q299
20774F397n408o915N568p93p109J1868p610o338R129J3068K726O567j1699j3926
20760d475p258q96n030J5251K509j7679l560R626J752k240K783K874R890J6859
20746B0406J6316j9446p857J0061Q167j8059q248J1352O435r02r917o776j452
20733H0l476J33l168j9718k2632j277J7094J7424J5819p976J035P079J036R06
20719B359m596k643Q139J154o961q624m803R038J2204j57P585L194j5481q559
$$ plain form
20819 -1105 217 -5773 -886 3140 3069 743 -6004 -1995 9384 17729 12423 8400 13829 12291 -1342
20804 -1342 -374 -3222 -7742 -13356 -5964 3239 9872 874 -3584 -11718 -12320 -8108 -17893 -19796 -23674
20789 -23674 -28148 -9161 618 -2958 -8598 -6745 -6713 -3375 2037 10963 11618 -4614 -511 -1902 6397
20774 6397 989 -5926 -358 -1151 -8260 3608 -4002 -10340 -1211 11857 14583 21150 9451 -4475
20760 -4475 -11733 -12629 -17659 -2408 101 -17578 -21138 -11512 -9760 -12000 -9217 -6343 3547 20406
20746 20406 36722 17276 9419 19480 27647 9588 1340 12692 19127 18225 8308 1532 80
20733 80 -3396 -3263 -6431 -26149 -48781 -50058 -32964 -15540 279 -7697 -6662 417 1453 2359
20719 2359 -2237 -4880 3259 4413 -2548 -11172 -15975 -6937 5267 5110 12695 15889 408 -8151
20705h151J088L042k631r558j0790K604M156K212j884J0863K45N857P550P431
20691A2034L501q306R472O896j1092o572r304p228m751r666J024J320P521O371
20677h780q049k469L885k238R986P736p410L003K736j5866p265J0400N86j855
20663a5600Q000O479o005N202J0631K382k338r231Q19q389j1840R116J9902J4335
20649B3463M688m291q205K196o816j7884j6593Q280n56J4188P410k237n680J067
20635i70K354p17j1026n366M296M430O474M701p83j7846o650K4624j562j3397
20621a1438l740p018r528n225R389M913J5780j783R500O48j666j1843j1506n25
20607b4042M349L736j926k305Q078J3949L107Q224j0769j0113M000p0q314j641
$$ plain form
20705 -8151 -7063 -4021 -6652 -16210 -27000 -24396 -20240 -18028 -19912 -9049 -8804 -2947 4603 12034
20691 12034 15535 7229 16701 23597 12505 5933 -3371 -10599 -15350 -25016 -23992 -22672 -15151 -8780
20677 -8780 -16829 -19298 -15413 -17651 -7665 71 -7339 -4336 -1600 -17466 -24731 -14331 -13745 -15600
20663 -15600 -7600 -1121 -7126 -1924 8707 11089 8751 -480 339 -8050 -19890 -10774 9128 23463
20649 23463 28151 23860 15655 17851 11035 -6849 -23442 -15162 -15718 -1530 5880 3643 -2037 -970
20635 -970 1384 667 -10359 -15725 -11429 -6999 -525 4176 3393 -14453 -21103 3521 1959 -11438
20621 -11438 -15178 -22196 -31724 -36949 -27560 -22647 -6867 -8650 850 1498 -168 -12011 -23517 -24042
20607 -24042 -19693 -15957 -17883 -20188 -12110 1839 4946 13170 2401 -7712 -3712 -3782 -12096 -13737
20593a3737r582n565M742P861k081j907N546P645R603P669o884L42k010j4411
20579a2769j907Q532n846L513N306L912J990K899j735Q877j856j0035r131p215
20565a5465K96J6412J6549j91j1978m795k963K492M558N932K810q443p127k523
20551d436j0125o275O419k678l834M512J1361J5865j325K924K78j7363k800j9490
20537b6967j366o34J480J1172J5463j0414O65J4338O914j3140o981k693l564K977
20523a2750R246M29m973J4128P122k99l77k200K568q937k407K995M4j493K920
20508F016J251J5354N396j8043j6188j23OM014N645o445j9183q411o591M751J6849
20493a5702J0393L851O965o341R29L407p928k724J4103Q809j2335o383r521j498
$$ plain form
20593 -13737 -23319 -28884 -24142 -16281 -18362 -20269 -14723 -7078 2525 10194 3310 3652 1642 -12769
20579 -12769 -14676 -6144 -11990 -8477 -3171 741 2731 5630 3895 12772 10916 881 -8250 -15465
20565 -15465 -15169 1243 17792 17601 5623 828 -2135 357 4915 10847 13657 5214 -1913 -4436
20551 -4436 -14561 -20836 -14417 -17095 -20929 -16417 -5056 10809 9484 12408 12686 -4677 -7477 -26967
20537 -26967 -28333 -28967 -27487 -16315 -852 -11266 -10601 3737 10651 -2489 -9470 -12163 -15727 -12750
20523 -12750 -3504 -3075 -8048 6080 13202 12903 12526 10326 12894 3957 1550 4545 4589 3096 6016
20508 6016 7267 22621 28017 9974 -6214 -6337 -6331 -2317 3328 -3117 -22300 -30711 -37302 -32551 -15702
20493 -15702 -5309 -1458 5507 -834 95 3502 -4426 -7150 6953 15762 3427 -2956 -12477 -13975
20479a3975Q487L238j0241n045r078n378M962J2495R558J6376l398j2796k853
20466g648o259J089J1538J641P085N442N034m979r385M706K688n913j5250O128
20452d083r34O339Q380L47J28j634k1j2773M723M734n998p350p902O907R689J0043
20436A0595J796r750r363j5740P605J1117Q02p490M037k04r458K849J7488L992
20422H276j7461k244J266m471M095J1061O237J0542r121m326N20Q866J901P814
20408B2955K897n617r213p877l774j4208p347j569O503n326q332L068N453k422
20394b4809M838O187m74l297Q387r328K601m896J554J1007P083P000r416l92L152
20379h03P486M007l709j2652P01j477J44Q534L978j270l090q185p46K857J2904
$$ plain form
20479 -13975 -5488 -2250 -12491 -17536 -26614 -31992 -27030 -14535 -4977 11399 8001 -4795 -7648
20466 -7648 -13907 -12818 -1280 361 7446 12888 17922 12943 3558 8264 10952 5039 -10211 -4083
20452 -4083 -5017 1322 9702 10049 10177 8543 8522 -4251 472 5206 -792 -8142 -16044 -9137 552 10595
20436 10595 12391 2641 -6722 -22462 -14857 -3740 -2938 -10428 -6391 -6595 -16053 -13204 4284 8276
20422 8276 -9185 -11429 -10163 -14634 -10539 522 6759 17301 8180 3854 4374 13240 15141 22955
20408 22955 25852 20235 11022 3145 -629 -14837 -22184 -23753 -17250 -22576 -30908 -27840 -22387 -24809
20394 -24809 -19971 -13784 -14258 -17555 -9168 -18496 -15895 -20791 -19237 -8230 -1147 5853 -3563 -3955 -803
20379 -803 6683 10690 6981 -5671 -4970 -6447 -6303 2231 6209 4939 1849 -6336 -7082 -4225 8679
20364H679L429n475p789j0526J5024J8034j29j675r28n662k182j007k242L812
20350A1363L382p916q755K280k846j182J2674Q299j1515j4109P8J9180J5543l314
20336B3162j9833j5830k995R735N319r714p036P946n597P460J059r159J659K586
20322a1238q21J3577m378Q789L219Q18K630p495j8557m24K533J490j943P978Q634
20307D812M658L736q404j1999J474M812r901n379n223n601J2596R906J6812L87
20293A2686j2901m305O744j498O399O999r90L503p777o317J2375m713k349k093
20279E763J3104K488O131j0209j9504q065J1325O146J880L397J722j965r874p204
20265d865Q201J1238o828l526k006j5307k662j3418J440m094j982Q074J3390M044
$$ plain form
20364 8679 12108 6633 -1156 -11682 3342 21376 21247 19572 18644 12982 10800 9793 7551 11363
20350 11363 14745 6829 -1926 354 -2492 -3674 9000 17299 5784 -8325 -8247 10933 26476 23162
20336 23162 3329 -12501 -15496 -5761 -442 -10156 -17192 -9246 -14843 -7383 -6324 -15483 -13824 -11238
20322 -11238 -12059 1518 -2860 5929 9148 9966 12596 5101 -13456 -13880 -11347 -9857 -11800 -3822 4812
20307 4812 9470 13206 4802 -7197 -5723 -911 -10812 -16191 -21414 -27015 -14419 -4513 12299 12686
20293 12686 -215 -4520 2224 726 7125 14124 13134 16637 8860 2543 14918 10205 7856 5763
20279 5763 18867 21355 27486 17277 -2227 -10292 1033 7179 9059 12456 14178 12213 2339 -4865
20265 -4865 3336 14574 7746 4220 2214 -13093 -15755 -29173 -27733 -31827 -33809 -25735 -12345 -8301
20251h301m651j1607R626K1056P479l740r990o892J1873N568L426q493j2475P284
20237A63M973L955J0220j650j5067p338l441l959J201K046k870m403P194J2714
20223C738M553k782q659k912J677j19P670r001k889J0225J700j0162j349r09N082
20208d137J1584k362n984r417m59j209J0086O63p132R60K378k23J0496J130M912
20193A1286P377m516j8113j9833m124m619R616O595k273N737J1067J043M580j259
20179B564j003L227K766j8192q155J3735P043K452n194j1589j414R275N186n309
20165d608O481l556l585O320k791j1303L35Q762N219m288o083O808N747o001j0040
20150a2583K226J973J0611M271J225j398L870l738O558k397o774m509n787K405
$$ plain form
20251 -8301 -12952 -24559 -14933 6123 13602 9862 -128 -7020 4853 10421 13847 5354 -7121 163
20237 163 5136 9091 19311 17661 2594 -4744 -8185 -12144 -10943 -8897 -11767 -16170 -8976 3738
20223 3738 8291 5509 -3150 -6062 -4385 -4504 3166 -5835 -8724 1501 3201 -6961 -8310 -9219 -4137
20208 -4137 7447 5085 -899 -10316 -10775 -11984 -1898 -1235 -8367 -7407 -5029 -5252 5244 6374 11286
20193 11286 18663 14147 -3966 -23799 -27923 -32542 -22926 -16331 -18604 -12867 -1800 -757 3823 2564
20179 2564 1561 4788 7554 -10638 -18793 -5058 1985 4437 -757 -12346 -13760 -4485 701 -4608
20165 -4608 1873 -1683 -5268 1052 -1739 -13042 -12707 -3945 1274 -3014 -9097 -2289 3458 -2543 -12583
20150 -12583 -10357 -8384 2227 6498 7723 6325 10195 6457 13015 10618 3844 -665 -6452 -4047
20136d047M907O020K407Q984O650m407r838r129N3Q596Q325M998J94j1363o029
20121F321Q285P026j0212q278R99p285j7620P174J4331Q603j204m193o334j4040
20107a6427J3543J6816j8977k681J8515M207j5128J836Q037L676j017J120l1J1191
20093B4680o129j2794j0911M354K923O20k402j753L665n118j1022J649R611k038
20079d665p198r183M050J5107o350n085M839M280m523l458p611J6369J6528N26
20065A3626N800o44Q731M101j124j1470k1232k1152K867N773J0215J0250j1704
20052e963O875J0486J731J379P546K168m866m569Q623n358L979L208M51o419j2354
20037F917p943p955n595l814l74J5923n460R974P962l643m376m378n058p99k79
$$ plain form
20136 -4047 860 6880 9287 18271 24921 20514 10676 1547 1600 10196 18521 23519 23713 12350 6321
20121 6321 14606 21632 11420 3142 4141 -3144 -20764 -13590 741 9344 8140 3947 -2387 -16427
20107 -16427 -2884 13932 -5045 -7726 10789 14996 -132 1704 9741 13417 12400 13520 13489 24680
20093 24680 18551 5757 -5154 -800 2123 2743 341 -1412 2253 -2865 -13887 -12238 -2627 -4665
20079 -4665 -11863 -21046 -16996 -1889 -8239 -13324 -8485 -4205 -8728 -12186 -19797 -3428 13100 13626
20065 13626 19426 18782 27513 31614 30490 19020 -2212 -23364 -20497 -14724 -4509 5741 -5963
20052 -5963 912 11398 13129 14508 22054 24222 19356 14787 23410 18052 22031 25239 25690 19271 6917
20037 6917 -1026 -8981 -14576 -18390 -18764 -2841 -8301 1673 9635 5992 1616 -2762 -7820 -8619 -8898
20022h898j675J7468J2630J0570Q01j8521j5457o60J1639m353k283k630o399Q103
20008C35q47j020r852P803o88j3331k44k169J337J2680P545R083O485j990r376
19993E751P0j434m21M431j4431k99N615p289j6465n246J1818O907n480L441Q314
19978d718L150j343m804r453K845J294j0303K670J8079r58j625o025J1781J5281
19964A5871k0546k0402J1056J6338n84L259o304N639k92p196q3nj362R929N466
19949A0784Q54N517j8708j3685J5629K017M324R835q775j1417J706J6307k830
19936A1558k097R265j0004P82n902o737j2203m962J1077J0479K000p081j1158
19923a4983L114L621j2460r61J4704j1101q000L773O024L048L887j190k974O932
$$ plain form
20022 -8898 -10573 6895 19525 30095 30896 12375 -3082 -3742 7897 3544 1261 -1369 -7768 335
20008 335 -512 -1532 -11384 -3581 -4269 -17600 -17844 -20013 -18676 -5996 1549 10632 17117 15127 5751
19993 5751 5821 4387 3966 8397 -6034 -6333 -718 -8007 -24472 -29718 -17900 -10993 -16473 -13032 -4718
19978 -4718 -1568 -2911 -7715 -17168 -14323 -13029 -23332 -20662 -2583 -3541 -5166 -11191 590 15871
19964 15871 -4675 -25077 -14021 2317 1733 4992 -1312 4327 4035 -3161 -3244 -3249 -4611 5318 10784
19949 10784 11638 17155 -1553 -15238 391 2408 6732 16567 7792 -3625 -1919 14388 11558
19936 11558 9461 18726 8722 9504 3602 -3135 -15338 -20300 -9223 1256 3256 -3825 -14983
19923 -14983 -11869 -8248 -20708 -21669 -6965 -18066 -26066 -22293 -16269 -13221 -9334 -10524 -13498 -6566
19909f566o600j4487R56N922J4666j276k519m351m897P672J9152J1385j2868p682
19895a493m130R265Q100k141j3367j1495P627K227n029M92J4795O405p976r324
19881f044L011N94p740o872j740K137P117K374L60k004J682P634N667n12p326
19866a662J2487J1468J499j0171j6418j0306L5094K0850j5025k4148j226P146
19854I588q808n017l115j2638K214M643J5276J5127P437k0538k8004k161J8388
19841g608M525k448N274r586L282L936L77J591n488k311J261O821J6321P673M350
19826B7970p172q420j096O845n586j056o398p090j4184j1303l793m191M580J966
19812b8928j129J0598J148J4730K0730M285q424r989j2223j8535m318K1635J7555
$$ plain form
19909 -6566 -13166 -27653 -26697 -20775 -6109 -7385 -9904 -14255 -19152 -11480 7672 19057 6189 -1493
19895 -1493 -5623 3642 11742 9601 -3766 -15261 -7634 -5407 -10436 -9944 4851 11256 3280 -6044
19881 -6044 -3033 -2439 -10179 -17051 -18791 -16654 -9537 -7163 -6803 -8807 -7125 509 6176 5664 -1662
19866 -1662 10825 22293 23792 13621 -2797 -13103 21991 42841 27816 3668 2442 9588
19854 9588 780 -4237 -7352 -19990 -17776 -13133 2143 17270 24707 4169 -23835 -25996 -7608
19841 -7608 -3083 -5531 -257 -9843 -6561 -2625 -2248 -657 -6145 -8456 -7195 -374 15947 23620 27970
19826 27970 20798 12378 11282 18127 12541 11485 5087 -2003 -16187 -27490 -31283 -35474 -30894 -28928
19812 -28928 -30057 -19459 -18311 -3581 17149 21434 13010 3021 -9202 -27737 -32055 -10420 7135
19799G135N694q571r674J6246N804j095n227j2103k0015O098K0379M793K862P456
19785A9782j3898k838J1046q42n849j1935j4255n128R701J943p254P095J792k171
19771a2811J0651J1545j111P392l705O849j047o769m235j4496j4587q480Q474
19758b2330J4115P899m88o353K495M018J950k560J802N903K590Q960J092K548
19744B1641J071n365j0418l019j351K02O805n369K55k655K236K843k209k123p980
19729e436J733n662j998L309j549j1791M333R212j1304N904J6961J3399P58o63
19715A7206j6398q754m875n964N712J4709j515O505K199R09J0080j210k0064p252
19701h712L867M753J1207n422Q450R721p017j7263O412n693N919J1815j2105L74
$$ plain form
19799 7135 12829 4258 -5416 10830 16634 15539 10312 -1791 -21806 -15708 4671 9464 12326 19782
19785 19782 5884 3046 14092 13250 7401 -4534 -18789 -23917 -14216 -12273 -19527 -12432 -10640 -12811
19771 -12811 -2160 9385 8274 15666 11961 18810 17763 10994 6759 -7737 -22324 -30804 -22330
19758 -22330 -8215 -316 -804 -7157 -4662 -644 1306 -1254 548 6451 9041 18001 19093 21641
19744 21641 22712 17347 6929 3910 2559 2761 9566 4197 4452 1797 4033 6876 4667 2544 -5436
19729 -5436 -3703 -9365 -11363 -8054 -9603 -21394 -17061 -7849 -19153 -13249 3712 17111 17869 17206
19715 17206 808 -7946 -12821 -18785 -13073 1636 121 6626 8825 9734 19814 18604 -1460 -8712
19701 -8712 -4845 -92 11115 5693 14143 23864 16847 -416 5996 303 6222 18037 5932 6306
19687F306N826L447P073j378P609M669o113k441k799J781o350k937p834l210j77
19672C472o023J1560J9623K13q617q275r660K47O066m098J1625l644j4188l935
19658e634M810J3020l151j3804o985j032J1686R627m957n808l853l741K729R383
19644B290J450K01N460R023j144m786K779O618k057j4365p084n035P258l022O32
19629a782L125r25Q973P042q397o174L093k630k147J3800o556o645o065P071M189
19614E972m323P664l312N137n30L916j3995j1617O145P94N227j340n914j1114
19600a7290o165l323R289K1727M600k434q245l21r449K498Q332m733r294P068
19586g740P382L961N767l196m993j0151N139P364j7238Q668R280n458k452J363
$$ plain form
19687 6306 12132 15579 22652 21274 28883 33552 27439 24998 22199 23980 17630 14693 6859 3649 3472
19672 3472 -2551 9009 28632 28845 20228 11953 2293 2540 8606 4508 16133 12489 -1699 -5634
19658 -5634 -824 12196 9045 -4759 -11744 -12776 -1090 8537 3580 -2228 -6081 -9822 -7093 2290
19644 2290 3740 3941 9401 18424 17280 12494 15273 21891 19834 5469 -1615 -6650 608 -2414 -1782
19629 -1782 1343 418 9391 16433 8036 1862 4955 2325 178 13978 7422 777 -5288 1783 5972
19614 5972 1649 9313 6001 11138 10608 14524 529 -11088 -4943 -4149 1078 -262 -6176 -17290
19600 -17290 -23455 -26778 -17489 4238 8838 6404 -1841 -2162 -11611 -9113 -781 -5514 -14808 -7740
19586 -7740 -358 3603 9370 6174 1181 -8970 -3831 3533 -13705 -5037 4243 -1215 -3667 -2304
19572b304P397L399n448l814L812j96K438J847Q909k511n482o225J62L259j1522
19557f279q051R762P590r015O248N111J608j554K357q820m832L810j0r590q32
19542a2497J29Q803O702O806n666q361L578O364P436j653q827l683J831J970P193
19527A0125j0918j2381m448q457l619P318J0044q45r731n435O331P42K188P904
19513a1182J5334l768m11J683L777J0151m955m088P266J5248J4190j703j4883
19500B6659j7622q208j4783n096M772J155j907O680k551j667m384M783M742R65
19486f462J124L941J0386m706k068J3581K678j6108k562j556q691N677L181j3934
19472a5519j919p660P729J5200r169M507N148J3855J3072j4042J762j510L65j198
$$ plain form
19572 -2304 5093 8492 3044 -770 3042 2846 5284 7131 16040 13529 8047 1822 1984 5243 -6279
19557 -6279 -14330 -4568 3022 -5993 255 5366 6974 5420 7777 -1043 -5875 -2065 -2075 -11665 -12497
19542 -12497 -12368 -3565 3137 9943 4277 -4084 -506 5858 13294 11641 2814 -869 962 2932 10125
19527 10125 -793 -13174 -17622 -26079 -29698 -22380 -12336 -13181 -22912 -28347 -22016 -21274 -19086 -11182
19513 -11182 4152 384 -27 1656 5433 15584 10629 6541 13807 29055 43245 41542 26659
19500 26659 9037 829 -13954 -19050 -14278 -13123 -15030 -8350 -10901 -12568 -16952 -12169 -7427 -6462
19486 -6462 -5338 -1397 8989 4283 2215 15796 18474 2366 -196 -1752 -10443 -4766 -1585 -15519
19472 -15519 -17438 -25098 -17369 -2169 -11338 -6831 -1683 12172 25244 11202 12964 11454 11819 10621
19458A0621j6557J697Pk214r267J191p277n202P514J7529q30p110L40Q999l729
19443d288J0777r5m002k298N875J4031j821j9703n538O215L340m340O58q93J004
19428a078l172j0294o555q39K0953R014K2641P315j221j5224o483N790m04n222
19414A5221m444K782J385j7269q69M808k510r70J0725P780J983j4554j0082J115
19400d899L644P305Q237j5273k137L944j1761J626k49m707J0078J4737l250L15
19386G610J5768K740o475j7874n827R513l564n576n769Q445N493J2038O76o440
19372A0758j2089o871j4056q608O839Q010L07p278l744J0184l095Q224P720j486
19358e185M699K766o999p161n557K569J6435K060J752n393P014N282L358Q488
$$ plain form
19458 10621 -5936 -4239 -4232 -6446 -15713 -14522 -21799 -27001 -19487 -1958 -2788 -9898 -9558 -559 -4288
19443 -4288 6489 6394 2392 94 5969 20000 18179 -1524 -7062 -847 2493 -1847 -1189 -2082 -1078
19428 -1078 -4250 -14544 -21099 -21938 -985 8029 30670 37985 36764 21540 15057 20847 20443 15221
19414 15221 10777 13559 14944 -2325 -3194 1614 -896 -1866 8859 16639 18622 4068 -6014 -4899
19400 -4899 -1255 6050 14287 -986 -3123 821 -10940 -9314 -9563 -14270 -4192 10545 7295 7610
19386 7610 23378 26118 19643 1769 -4058 5455 1891 -3685 -9454 -1009 4484 16522 17198 10758
19372 10758 -1331 -8202 -22258 -30866 -24027 -16017 -15710 -22988 -26732 -16548 -19643 -11419 -3699 -5185
19358 -5185 -486 2280 -4719 -11880 -17437 -14868 1567 3627 5379 -14 7000 12282 15640 24128
19344B4128L736p26j2300j2717l74L706J3349j1947j0234j1996K904P213j133
19331f391J3140M551O214n452K37L563r533r025L580n113n682R824Q326J125Q241
19316A7605M111L599r569j0028j0752m528J4314J4130l141p488l89r107o880J532
19302f591K645K125m205j855Q277j780j4055J57R902J5399L100l22O757J808p949
19287A3413q112p675J546K534J295O362q189j4970Q814Q864P802L13p230J988
19273F755M190m66k933o264O382k61k455p101Q535N326P445p376j8479P029L121
19258C448o461J44J0490L307l539r437m414M467K530J0160j170Q71n389j736J9561
19243B2832o063j8770k218J071Q81O92j609J7022M655J582O212j2094R07m896
$$ plain form
19344 24128 27864 27138 14838 2121 1747 5453 18802 6855 -3379 -15375 -12471 -5258 -6391
19331 -6391 6749 11300 17514 12062 12299 15862 6329 -2696 884 -4229 -9911 -87 8239 9364 17605
19316 17605 21716 25315 15746 5718 -5034 -9562 4752 18882 15741 8253 7864 -1243 -8123 -6591
19302 -6591 -3946 -1821 -6026 -7881 396 -1384 -15439 -15282 -5380 10019 13119 12797 19554 21362 13413
19287 13413 5301 -2374 -828 1706 3001 9363 1174 -13796 -4982 3882 11684 11997 4767 6755
19273 6755 10945 10479 7546 1282 7664 7403 4948 -2153 6382 11708 19153 11777 -6702 327 3448
19258 3448 -3013 -2869 7621 10928 7389 -2048 -6462 -1995 535 10695 9525 10396 5007 3271 22832
19243 22832 16769 -2001 -4219 -3148 -2267 -1575 -3184 13838 18493 20075 26287 14193 15100 10204
19229A0204K023K905l996P583N271J883j880j3099o56k842k229L486L334p993
19215C994N550J0710p440R257j035J444J2113L509J6405j3154j1036n08j7669
19202A2140J2956J0603j7239j633O297P926j5743j0410j0521M463P329N578M566
19189A6312p24J6567l827q706q880K280J0918O699Q279k391J273l393q633N43
19175B6317K885m730J1955J6436J3210j2077j7097L484m803m229M521J8588N024
19162E9484K86J4488K978R174L3302K5760L8593R2592J44312K71835M76495N29414
19150A698713L6097m61333m86507k78278j51468p8945l7508K795K7809O8340J34923
19139D74638K91068M87224N33120K60n01597n05726l04330j52623p5028m8772
$$ plain form
19229 10204 12227 15132 11136 18719 23990 25873 23993 10894 10238 7396 5167 8653 11987 3994
19215 3994 9544 20254 12814 22071 21036 22480 34593 38102 54507 41353 30317 29809 12140
19202 12140 25096 35699 18460 16827 23124 31050 15307 4897 -5624 -1161 6168 11746 16312
19189 16312 15588 32155 28328 19622 10742 13022 23940 30639 38918 36527 37800 34407 25774 26317
19175 26317 29202 24472 36427 52863 66073 53996 36899 40383 35580 31351 35872 54460 59484
19162 59484 59770 74258 77236 86410 119712 145472 184065 276657 420969 692804 1169299 1698713
19150 1698713 1734810 1273477 786970 508692 357224 278279 240771 243566 271375 339715 474638
19139 474638 765706 1252930 1786050 1786310 1284713 778987 474657 322034 247006 198234
19129A98234n1096l3470q079L37q197k2906k592j1489O790k562j1190j2246J0794
19116E2328L232o134j2593K688l608j3611n38J2379Q039p937j409q542j7748m385
19102B161J179O63R670J1076M942m553j0305m654J5770Q134l099l040j383n444
19088B1117m314r046J1526N525O579j0006k617k056P159J1823n747q868j44K375
19074B3306n57p761n737j418j161L989j395r263l95J5419J1091K224j0609r01
19060A6832o33M540J0454n39j0630n804m730O767Q792L690l877j7856p084R874
19046I796O269r241K23R452J0956j576n825m458J970j026K246J5998N622j3938
19032B6468K659j1992j0353q339J056O046N545L361J788q447j5652k263P913J8704
$$ plain form
19129 198234 147138 113668 105589 105926 97729 74823 72231 60742 67532 64970 53780 41534 52328
19116 52328 55560 49426 36833 39521 35913 22302 21764 34143 42182 34245 32836 24294 6546 2161
19102 2161 3340 4003 13673 24749 29691 25138 14833 10179 25949 34083 30984 27944 26561 21117
19088 21117 16803 7757 19283 24808 31387 21381 18764 16708 23867 35690 29943 21075 20931 23306
19074 23306 22749 14988 9251 7833 6672 10661 9266 3 -392 15027 26118 28342 17733 16832
19060 16832 16199 20739 31193 30654 20024 14220 9490 16257 25049 28739 24862 7006 -78 9796
19046 9796 16065 6824 7047 16499 27455 25879 20054 15596 17566 16540 18786 34784 40406 26468
19032 26468 29127 17135 6782 -1557 -501 5545 11090 14451 16239 7792 -7860 -10123 -2210 16494
19018A6494J0957l863J1046J61q454p072j7123j4885K605Q134J8065j075p329
19005G661Q63L10K0279k216j0124o396j5255j3566J8433J0898J028N623J5537
18992C3075p650O816o97K832n432j1867k389K848j629j2822K145Q989j721l550
18978H948j743J8181O539o788L179n011k0782O822R734P856r951J068M890N63
18964B3505P774K741k234K654J3702j5804j7421j5476o46J618Q829M468R261P188
18950C0159o438M148J3913L936o582L289K443j4095n665k0365m372K872K26l267
18936B02L420J0803J2133l607j1810k1011P732P044O82L492N626J263k65O169
18922B1873o599p375k254L36r020J1202O671L588P164K247J2893j516j4835p553
$$ plain form
19018 16494 27451 23588 34634 34795 26341 19269 2146 -12739 -10134 -2000 16065 14990 7661
19005 7661 8524 8834 29113 26897 16773 10377 -4878 -18444 -11 10887 11915 17538 33075
18992 33075 25425 32241 31544 34376 28944 17077 14688 17536 15907 3085 5230 14219 12498 8948
18978 8948 7205 25386 31925 25137 28316 23305 2523 9345 19079 26935 16984 18052 22942 23505
18964 23505 31279 34020 31786 34440 48142 32338 14917 -559 -1205 413 9242 13710 22971 30159
18950 30159 23721 27869 41782 45718 39136 42425 44868 30773 25108 4743 371 3243 3469 202
18936 202 3622 14425 26558 22951 11141 -9870 -2138 4906 5588 9080 14706 15969 15704 21873
18922 21873 15274 7899 5645 5981 -3039 8163 14834 18422 25586 27833 40726 39210 24375 16822
18908A6822m620j435j059J3068j49j3425q221J985K876k193k568Q03K011L115
18894G010R732J3740q684L114m398J479P532n056j3932m741j0483q987R638J6691
18880A2655K0574L633n654K078o25R069p851q560n819m731q933k607r85J101J81
18865C526O552Q024P602k300R581Q539k671J203j620l946j1444L423l331r042
18851A4096j1160J0862p14N78K271N475O324N137L665N59m324j502O9m334J1172
18836C8174j0760l904q078O994R5P880q863p019j4900j232R423j955m456O460
18822G859l663J5045k12j108k994J782L127m101R071N436j586J9648J106k293
18808D7117l910j1686N480m031m485J98j585M426J639p795M853J508j2043j2299
$$ plain form
18908 16822 12202 10767 9708 22776 22627 9202 981 2966 5842 3649 1081 1884 3895 7010
18894 7010 16742 30482 21798 24912 20514 21993 29525 24469 10537 5796 -4687 -13674 -4036 12655
18880 12655 33229 36862 31208 33286 32661 41730 33879 25319 19500 14769 5836 3229 2244 3345 3526
18865 3526 10078 18102 25704 23404 32985 41524 38853 40056 38436 34490 23046 26469 23138 14096
18851 14096 2936 13798 13084 13662 15933 21408 27732 32869 36534 37093 32769 31267 31336 27002 38174
18836 38174 27414 23510 15432 22426 22521 30401 21538 14519 -381 -1613 7810 5855 1399 7859
18822 7859 4196 19241 19029 17921 14927 16709 19836 15735 24806 30242 28656 48304 49410 47117
18808 47117 43207 31521 37001 32970 28485 28683 27098 31524 33163 25368 30221 31729 19686 7387
18794G387O922k294n25R261J0090j410J1207N107N885k638k0102j597P319j3513
18780B1099l316n97l47J4609K3060J1888j2797j9438p3N114J4966K7666M0216
18767A22050N0248K1521l1611n8634l6621k1389j5n249j0414M449N702N133l311
18754D1859j237L258P328K507m894m972k093n403j1388O496J6783J2766K5810
18741H6820L1658J7826L3517L7769K2710k8473k5405j7143j8741k5749k5187o381
18729H3221R720M947J3743J6115K3280L4774L3252l2071k6045k2516l0184k7341
18717H0895j2800j1064n495j0997j1612j7771q875J1286R427j083j125j2166j15
18704H505n206J302N105J9092m592o386j673N603J3778L3509k526k6816k4282
$$ plain form
18794 7387 14309 12015 11490 20751 30841 29431 40638 45745 51630 48992 28890 27293 34612 21099
18780 21099 17783 17186 16839 31448 54508 66396 53599 34161 34088 39202 54168 81834 122050
18767 122050 172298 193819 162208 103574 66953 45564 45549 40300 29886 34335 40037 45170 41859
18754 41859 40622 43880 51208 53715 48821 43849 41756 36353 24965 31461 48244 61010 86820
18741 86820 118478 136304 169821 207590 230300 201827 176422 159279 140538 114789 89602 83221
18729 83221 92941 97888 111631 127746 151026 185800 219052 186981 160936 138420 108236 80895
18717 80895 68095 57031 51536 40539 28927 11156 2281 13567 22994 21911 20786 8620 8505
18704 8505 3299 4601 9706 28798 24206 17820 16147 21750 35528 69037 66511 39695 15413
18691A5413q110K089M739R762J008o105J889J7508L1603J5871J8276K111m889
18678A01165j770k4136k7092k7529p650J4974J5287j0318p434J5155J7514J4273
18666G2439P177J0026J558o381j4684p451m125L196j3067j8497J1050J0826k451
18653D9616k217P592r099J3157J2409m349J9384J6559j527m867N837J4148M756
18640A21399K0123j666J45j084k3682k3277j1942L470R421K059L233j891J1593
18627A07901K9962Q439j1393k333J5111k953j0526j3068J4286K9712K9989K3362
18615B18489K7538M6108K7016j7580p2045j09058p6364R213J0482K2440J002J4670
18603A01911K1356J8799J8220L5575L8365p929o9850j13892p6058J3948p5j1437
$$ plain form
18691 15413 7303 9392 14131 23893 24901 18796 20685 38193 69796 85667 103943 106054 101165
18678 101165 99395 75259 48167 20638 12988 27962 43249 32931 25497 40652 58166 72439
18666 72439 79616 89642 91200 84819 70135 62684 58559 61755 48688 30191 41241 52067 49616
18653 49616 47399 54991 45892 59049 71458 67109 86493 103052 101525 96658 102495 116643 121399
18640 121399 141522 139856 140001 138917 115235 91958 80016 83486 92907 94966 98199 96308 107901
18627 107901 137863 146302 134909 132576 147687 144734 134208 121140 135426 165138 195127 218489
18615 218489 246027 292135 319151 301571 229526 120468 44104 53317 63799 86239 87241 101911
18603 101911 123267 142066 160286 195861 234226 226297 156447 42555 -33503 -19555 -19630 -31067
18591c1067j3769j2186P847K3764K5018P915J6218K6099J510p310n872k187m70
18578C5510J2519j045j527k929j6129k1760r528J9978L5206J2903P9k896J2553
18565G2934K4798K9080J7624Q225K2929M2354M4879j6137n4953l6056N240M568
18553A65485K861K864J2776J0801J856Q677j807O168J6930L7277L2502K3209R369
18540C28968N28J0407K0089K0351K6139M4088K6792L5820N0409N9717P0556R7098
18528G90962J93551L57895N29239N20359k1672m38679l97815k24270q2547n364
18518A221659M7849J08670J57397K58177M91568Q57724J197831Q02422k79484
18509D863813p68453m83081J3725M86760O14823L1290l25048j85908P9237M08557
$$ plain form
18591 -31067 -44836 -57022 -49175 -25411 -393 7522 23740 49839 51349 44039 38167 35980 35510
18578 35510 48029 46984 45457 42528 26399 4639 -4889 15089 50295 63198 63277 60381 72934
18565 72934 97732 126812 144436 152661 175590 217944 262823 246686 191733 155677 160917 165485
18553 165485 168346 171210 183986 194787 196643 205320 203513 209681 226611 263888 296390 319599 328968
18540 328968 329496 339903 359992 380343 406482 450570 477362 513182 563591 623308 693864 790962
18528 790962 984513 1342408 1871647 2392006 2370334 1931655 1533840 1309570 1227023 1221659
18518 1221659 1269508 1378178 1535575 1793752 2285320 3143044 4340875 5143297 4863813
18509 4863813 4095360 3612279 3626004 4112764 4727587 4758877 4433829 4247921 4327158 4735715
18499D735715Q82051J181192Q62502N05565P92141J433798K198057L302054M464806
18490B0357881N582763Q541827J5072304K8089840N3851149R3989788R6424137
18483C21909689j3143210r4386137q6153474m6651037k3276250j1419453m826886
18476D2053242m2387N258718J3006342K6702819N3008611R3558710R6228089j4692837
18468C15081307r7435075q9882677m9803356k6073146j4357579q546445n945998
18461B3037031m532852l323203k347162j596238j004254n55585n30512r70891
18453H176334j113283q73738n18832q0084J56257k72210p41778o97448l62751
18444C672467k5420L71362P67967P76632p0465r36177j022946o74447m01919k43385
$$ plain form
18499 4735715 5617766 6798958 7661460 8167025 8959166 10392964 12591021 15893075 20357881
18490 20357881 25940644 34482471 49554775 77644615 131495764 225485552 321909689
18483 321909689 308766479 214380342 128226868 81575831 58299581 46880128 42053242
18476 42053242 42010855 47269573 60275915 86978734 139987345 233546055 329774144 315081307
18468 315081307 217646232 127763555 77960199 51887053 37529474 28983029 23037031
18461 23037031 18504179 15180976 12833814 11237576 10233322 9677737 9147225 8176334
18453 8176334 7063051 6189313 5670481 5590397 5746654 5474444 4732666 4035218 3672467
18444 3672467 3647047 4018409 4786376 5563008 5492543 4556366 3533420 2858973 2457054 2213669
18434B213669j56597j42737j03745m9296M7667J60498L30248N02224K18952l73800
18424B647083n82133m07460k12933r3735n8619m7654j2556K5209J01734K30619
18414A589555M25846N60004J56910m24007n59651l49495j75950j05246n6106m3079
18404A018781k939P7019J71235L55301N76899M40154j93249n85234n06345k80005
18394A071617j65013j12502p8188n3969k9688p197N621j0845k4944k4272o298
18383E64322J9569J7063k4860m1223k1923k1961q943k719N776j0356P24j226r752
18370D64491O77P197J8407R900l754M059J6980J5459L1964M9973M2308R085Q605
18357F75351O92m1563j32865r3582k7878J3623J1073J5528J2107K0127M5616L8612
$$ plain form
18434 2213669 2057072 1914335 1810590 1761294 1808961 1969459 2299707 2801931 3020883 2647083
18424 2647083 2064950 1657490 1444557 1350822 1292203 1244549 1231993 1257202 1358936 1589555
18414 1589555 2015401 2575405 2732315 2308308 1748657 1399162 1223212 1117966 1061860 1018781
18404 1018781 1015842 1092861 1264096 1619397 2196296 2636450 2443201 1857967 1351622 1071617
18394 1071617 906604 794102 715914 661945 632257 625060 630681 619836 594892 570620 564322
18383 564322 583891 600954 576094 534871 512948 490987 482044 479325 485101 474745 475469 474243 464491
18370 464491 465168 472365 490772 500672 496918 500977 517957 533416 565380 615353 657661 666746 675351
18357 675351 676043 634480 501615 408033 380155 393778 404851 420379 432486 452613 498229 536841
18345E36841J6021n808p356l6800j06025r0775l8925j7161j5977o060J670k278
18333B27367j3609l3188j5998m72J0289N508k074O336L222Q088R251K485j515
18320B05690l5j2671k0711k8437j3654p119o076q319j3849J0262K3649J8224j6392
18307A30562o908K7679L8539J8543K341N743j9073j6712O310n067j1754o744Q468
18294A71927J1328j4190j4802q015p183M244j224J0440L959K0038P699R174R118
18281B02513k078o286j3231k9211k9827j2513j4183n899N992n097K495L5873L6994
18268A65542K5474J3769j5287k8316J15L71l05j5004l4911k6226R325K9035P953
18255A31535o548J485R401j884m427J0270K278k300J557p447o456N133M493J5717
$$ plain form
18345 536841 552862 547054 539698 502898 396873 306098 267173 250012 234035 227975 229645 227367
18333 227367 213758 180570 164572 164100 174389 179897 177823 184159 187381 195469 204720 207205 205690
18320 205690 205655 192984 172273 143836 130182 123063 116987 108668 94819 105081 128730 146954 130562
18307 130562 123654 151333 189872 208415 210756 216499 197426 180714 187024 181957 170203 163459 171927
18294 171927 183255 169065 154263 146248 139065 143309 142085 152525 156484 176522 184221 193395 202513
18281 202513 200435 194149 180918 151707 121880 109367 95184 89285 95277 90180 92675 128548 165542
18268 165542 191016 204785 189498 161182 161297 161668 161363 146359 111448 85222 94547 123582 131535
18255 131535 124987 126472 135873 133989 129562 139832 142110 139810 141367 133920 127464 132597 137090 152807
18241A52807N533n887p434j391J3391J9121J9163o959j7933q268l008K0011K942
18228A82088k2150k2716j8778M926P178l578k749o368k964Q717R662q775j582
18215A22911J0468o545j9613q077j252L509J4237j596M501j485j123K17J483m594
18201A13041n972O76p30m04k759J713J2456J125m674J3307l422o975l604j5915
18187I7863q189P320K0684J4918k171J522j1168j3476K496Q412L410m591k18o6
18173A16746k486m407l543N18q065j0519q714j309K4191J3243o408J464L744l578
18159A10877M929J915j1041l932P168l787p511R106N080j545l051P045O546L375
18145A25174J0415M203o158Q969J4392Q177j102N088l372q681J1507K2320J0367
$$ plain form
18241 152807 158340 152453 145019 143628 157019 176140 195303 188344 170411 162143 159135 179146 182088
18228 182088 159938 137222 118444 123370 130548 126970 124221 117853 114889 123606 133268 124493 122911
18215 122911 133379 126834 107221 99144 97892 101401 115638 114042 118543 117058 115935 116152 117635 113041
18201 113041 107069 107745 107015 106611 103852 105565 118021 119146 114472 127779 124357 117382 113778 97863
18187 97863 89674 96994 117678 132596 130425 131947 120779 107303 109799 118211 121621 117030 116812 116746
18173 116746 114260 109853 106310 106828 98763 88244 79530 78221 102412 115655 109247 110711 114455 110877
18159 110877 115806 117721 106680 102748 109916 106129 98618 107724 112804 111259 108208 115253 121799 125174
18145 125174 135589 139792 133634 142603 156995 165172 164070 169158 165786 157105 168612 190932 201299
18132B01299J6460J0813J0884K2584J9977J9948K5303P934Q293L1938M9076O4431
18120D88940P2467Q9709J22329J55657K10345L05049M21802O60753J097055J954000
18110E578106L800834P313092J0632786M271355p269754r961270o202233l093404
18102E069512j634675r49908o07540l95608k74242k14734j52696j00626q0874
18093F58609p5425p2140m8414n0421n7108n4882l6225n699r666k2441k6570n063
18081A94555j025j8162j9612l75p300j2978l688J5413R012k870l832o48L587j70
18067A51907j4024J0592p175q537j3967m042M973R78l329j7752j193J3799K337
18054A14567R532j6260j0473r018L349k137K268R656l986o145R469N136j6421
$$ plain form
18132 201299 217759 228572 239456 262040 282017 301965 327268 335202 343495 375433 424509 488940
18120 488940 561407 651116 773445 929102 1139447 1444496 1866298 2527051 3624106 5578106
18110 5578106 9378940 16692032 27324818 31596173 24326419 14365149 8162916 5069512
18102 5069512 3434837 2484929 1877389 1481781 1207539 992805 840109 739483 658609
18093 658609 583184 511044 462630 412209 355101 300219 263994 258295 248629 226188 199618 194555
18081 194555 193530 175368 155756 155381 148081 135103 131415 146828 155840 152970 149138 148490 152077 151907
18067 151907 137883 148475 141300 132763 118796 114754 119727 120705 117376 99624 98431 112230 114567
18054 114567 124099 107839 97366 88348 91697 89560 91828 101484 97498 91353 100822 105958 89537
18041H9537j2670R491J6526J5042Q197r306j0773J85m358j5243P103J3171l982
18028A02920N00m404j7675R339J3243m269p578p933o439J1928L978q10Q56k087
18014I1569q758j8400k934J6637L639P444p084p033P098J0171J207l766n13P598
18000I6875J796L258l109j5460j4475j237j459P137K008o15k246K347Pk152Q959
17985H1634J5759j44j153J2133M138l704p256j8270p293j192R003L589n026q75
17971H1343R499J1350r938j1602m489l049m181l186O570J0295J4097p094K327
17958I1942J1259k669j0302p490R567q284n299j0974J413j0004J360R496j181
17945F8834k870m517q341q486J2706K911L654J292O490o05L516J701m009o569
$$ plain form
18041 89537 76867 86358 102884 117926 126123 116817 106044 106229 101871 86628 93731 106902 102920
18028 102920 103420 99016 81341 90680 103923 99654 92076 84143 77704 89632 93610 92800 93656 91569
18014 91569 82811 64411 61477 78114 81753 89197 82113 75080 82178 92349 93556 89790 89277 96875
18000 96875 98671 101929 98820 83360 68885 67648 66189 73326 75334 74719 72473 74820 74827 72675 81634
17985 81634 97393 97249 96096 108229 112367 108663 101407 83137 75844 74652 83655 87244 82218 81343
17971 81343 90842 102192 92254 80652 76163 73114 68933 65747 72317 82612 96709 89615 91942
17958 91942 103201 100532 90230 82740 92307 84023 78724 67750 69163 59159 60519 70015 68834
17945 68834 65964 61447 53106 44620 57326 60237 63891 65183 71673 71068 74584 76285 72276 65707
17931F5707n168r253Q044K4142l654q738k466L24n958N73p456Q093J3226q831
17917F8585N506J0629N231j5466N559l26J055j07M501k657k101Q655j604j571
17903H5889j2547j2026j5580r006q40O235R879O113L54R828P188N334q387M734
17889G7168p55l213l888J1800r765j4267q585J0900J8543J7373n954j0615J0560
17876H9302k768K118Q938j7503j376j029l478K977J0949r41L815o596k0524Q424
17862G2308M285k690o771k206L576L997q897P822O731L581N596J4551J0030K093
17848A14006p947j4582n009N99M597m581Q169P002j4082n332J589J5905J6079
17835A16413R217n059j5200L75l766O852J3645j3865q472P89m803K5954J3201
$$ plain form
17931 65707 60539 51286 59330 83472 79818 71080 68614 68938 62980 63553 56097 64190 77416 68585
17917 68585 74091 84720 89951 74485 80044 79718 80773 80666 85167 82510 80409 89064 87460 85889
17903 85889 73342 61316 45736 36730 35890 42125 52004 58117 58471 68299 75487 80821 72434 77168
17889 77168 76413 73200 69312 81112 71347 57080 48495 59395 77938 95311 89357 78742 89302
17876 89302 86534 88652 97590 80087 78711 77682 74204 77181 88130 87189 91004 84408 63884 72308
17862 72308 76593 73903 67132 64926 68502 72499 63602 71424 78155 81736 87332 101883 111913 114006
17848 114006 106059 91477 86468 87067 91664 87083 95252 102254 88172 82840 84429 100334 116413
17835 116413 125630 120571 105371 105746 101980 108832 122477 108612 100140 100929 96126 122080 135281
17822A35281P351J2242O745O245K68j525J6156K1777J3285M7610J01111J57092
17810E23638K55128M54773N35334M9830m59886n00920k89172j53617m8228k7527
17800C39353o948K1201O6444J28520K67068M65871N40643M0584m80835n20916
17790H60985l05961j58711q0364n9575m1916l4727k9182j2407k2779N543k650
17779A18256j5822M421o646l392N976N775j474m358j0673J5745p11m799M712j384
17765A05626P35R013N266q2k0322j5929k747R918M339J8569o191r250M35q560
17751I0820P711k894q946J888J8223R573l416j0662j1201o165n319J1274O268
17738I7154J668j4859m052p760J2002Q996r309j0240K979K666O361J1611l593
$$ plain form
17822 135281 142632 154874 161619 167864 168132 166607 182763 204540 217825 265435 366546 523638
17810 523638 778766 1233539 1768873 1818703 1358817 857897 568725 415108 366880 339353
17800 339353 332405 353606 420050 548570 815638 1281509 1822152 1862736 1381901 860985
17790 860985 555024 396313 315949 256374 214458 179731 150549 138142 115363 120906 118256
17779 118256 102434 106855 100209 96817 102793 108568 107094 102736 92063 107808 107097 102298 107010 105626
17765 105626 106361 115374 120640 120558 100236 84307 81560 91478 95817 114386 108195 98945 99380 90820
17751 90820 98531 95637 86691 88579 106802 116375 112959 102297 91096 84931 79612 90886 97154
17738 97154 98822 83963 79911 72151 84153 93149 83840 73600 76579 79245 85606 97217 93624
17725I3624k172M741o70J700P618M943M773R652J3069L275j8530j7574R85q380
17711I7054r954k283R546O370J0498Q877J930o02J0666J6343r08J0592J2480K4298
17697A94907J9995K0131K0763N8128Q7795J65487L07126N16987N32957n8983n36244
17686A329049n03630k67167j32666o4145j3385M549K5152O2523J49902K76491
17676H66673M87417M94749p9529n19166m82442k76536j37669p2661m4109m1462
17666A95265k1337j1238j3190q718j1629p122k016j7780P26K914L537r157o340
17653I3915J3471N204r492n181o03o367k10j028M781M02K811Q203J101K095j678
17638A07424m068k947J0895q836k598o98p756j2560m028P637J8681jK946n690
$$ plain form
17725 93624 91452 96193 95523 97223 104841 109784 114557 124209 137278 140553 122023 104449 105434 97054
17711 97054 87100 84817 94363 100733 111231 120108 122038 121436 132102 148445 147537 158129 170609 194907
17697 194907 214902 235033 255796 313924 401719 567206 874332 1391319 1924276 1865293 1329049
17686 1329049 825419 558252 425586 361441 348056 352605 377757 440280 590182 866673
17676 866673 1354090 1848839 1769310 1250144 767702 491166 353497 280836 236727 195265
17666 195265 173928 162690 149500 140782 129153 122031 120015 102235 102961 105875 109412 100255 93915
17653 93915 107386 112590 103098 97917 97314 90947 90737 89709 94490 94892 97703 105906 107007 109102 107424
17638 107424 103356 100409 111304 102468 99870 99172 91416 78856 74828 82465 101146 101145 104091 98401
17624I8401j1997Q643j771J0352J8558o835r537p97o479q240k553l103J630J6833
17610A03105J0750L244l340Q36l896j4921j2493l302J0708Q401K062l895R611
17597A06870J0108J543k582k4986j4551p312K697P778PK685L56M085M434k579
17583H8553J7092l688m473p210r64J4691n53l1547j5369J4832K0862Q963j0178
17570I1011j386J2395Q325j61n995j5298n476j557Q338k06M5P849j119Q830r711
17555I5884k0028L406R645L719n744m515J1765j216j801N161k733j931K289J504
17541I5405m080P710J4768L392M73P557j0282j4698k837m093n441N708J2434J324
17527A07340j1374j833q892Q026o383M154M872l859Q534J2633L815J1520N00j5604
$$ plain form
17624 98401 86404 95047 93276 103628 122186 115351 105814 105017 98538 90298 87745 84642 86272 103105
17610 103105 113855 117099 113759 114595 110699 95778 83285 79983 90691 99092 101154 97259 106870
17597 106870 116978 118521 115939 90953 76402 69090 71787 79565 79572 82257 82613 86698 91132 88553
17583 88553 105645 101957 97484 90274 89310 104001 103448 71901 56532 71364 92226 101189 91011
17570 91011 89625 102020 110345 110184 104189 88891 83415 81858 90196 89990 90035 97884 96765 105595 95884
17555 95884 75856 79262 88907 92626 86882 82367 94132 92916 91115 96276 93543 91612 93901 95405
17541 95405 91325 99035 113803 117195 117668 125225 114943 100245 97408 93315 87874 93582 106016 107340
17527 107340 95966 94133 85241 93267 86884 91038 95910 92051 100585 113218 117033 128553 129053 113449
17513A13449j8704q082Q338O045J842J728N987o511K936J6664K8701Q736q889
17500A52240L820O239j2590r299N66j3399l708J1032P057j2568N235j614r328
17487A23683M859K0571J157k872J1915N822l657o852j394nL836L664j1308J377
17473A50796J621j753J322R232R906o015j8924r320p611q455K762L339L097J1251
17459A41248J6260N567L772n891m212j242o254j041J064J1832O993R614k372j0829
17445A64509P836K3945L0653M4431O4363L7855k7975m5070k9358j3650k0706l546
17433B33287R679K6462K2584M1305O8691J25173K53779M70180O57738K21113m80144
17422A649847n99323l56261j59945q3292l9505k460L0428P4416J63941L36579
$$ plain form
17513 113449 94745 86663 95001 101046 102888 104616 110603 104092 107028 123692 152393 161129 152240
17500 152240 156060 162299 149709 140410 140976 127577 123869 134901 141958 129390 134625 133011 123683
17487 123683 128542 149113 150270 147398 159313 165135 161478 154626 153232 153227 157063 160727 149419 150796
17473 150796 152417 150664 151986 161218 171124 165109 146185 136865 129254 120799 123561 126900 129997 141248
17459 141248 157508 163075 166847 160956 156744 155502 149248 148207 149271 161103 168096 177710 175338 164509
17445 164509 172345 196290 226943 271374 335737 373592 345617 300547 271189 257539 236833 233287
17433 233287 242966 269428 292012 333317 402008 527181 780960 1251140 1908878 2129991 1649847
17422 1649847 1050524 694263 534318 451026 411521 409061 439489 513905 677846 1014425
17412A014425N77251N15193k02302o26587m81255k46777j32884p8518l6602k6094
17402B75850k0166j0242j3871m080n976j4364N41o904q368N565O726O610l542
17389B07779j4753l198q568m217J710j059j3705Q348n648L620J3264L225l624
17376A83174N520N171r839j0232K641m454N197K180J5872J5621J8430L1188L6380
17363B96849L8026M0303Q30l3113k6868k0932k4744k3643j5225r895K181R920
17351B33689J8924K4770M6303M0533n865m9706j1983j2609l3192k8557o243r979
17339B06085p248j072j8336p725J7720J4379P908n144q470j4500l683J5301K1633
17326B16848l474P234M288j6980R656K5588J5700J255m1k5947m0838m227J591
$$ plain form
17412 1014425 1591676 2106869 1904567 1277980 796725 549948 417064 338546 301944 275850
17402 275850 255684 245442 231571 227491 221515 207151 207692 200788 192420 197985 204711 211321 207779
17389 207779 193026 189828 181260 177043 178753 177694 163989 172337 166689 170309 183573 186798 183174
17376 183174 188694 193865 184026 173794 176435 171981 177178 179358 195230 210851 229281 260469 296849
17363 296849 334875 375178 376008 342895 316027 295095 270351 246708 231483 221588 223769 233689
17351 233689 252613 277383 323686 364219 358354 308648 296665 284056 250864 222307 216064 206085
17339 206085 198837 197765 179429 171704 189424 203803 211711 206567 198097 183597 179914 195215 216848
17326 216848 213374 220608 224896 207916 217572 243160 258860 260115 260074 234127 193289 189062 190653
17313A90653K187p05J1921j066O938J2318J8966K0743P738Q509k886j459j8398
17300B55459k1717l1874r215J7265J0406m51J657J7636K6324J4940J7257M334
17288C02021m011q74m433j8789n658j24r835l146R057O316P207J6189J5098M681
17274C13699j2520j2527m404P191K796Q909N955J2512R686J7239L862K5607J9682
17261C97687q932k1722j0203N12L13o347k899P814Q034m416K5895K2965K0712
17248D29413L089M424p705J339J509K308J5450K7195L1436L5494L6610J6689k2843
17235E74408p8319j01166m3666N762J7030J0868J2279P285L0516L3915N2666N0398
17223E71976J6304m4336r6027j16085l0452J6753O002n010q534p46p43K7645K1151
$$ plain form
17313 190653 192840 192135 204056 202990 209928 222246 241212 261955 269693 278202 275316 273857 255459
17300 255459 233742 201868 192653 209918 220324 219873 221530 239166 265490 280430 297687 302021
17288 302021 298010 297136 292703 273914 268256 268132 258297 255151 264208 270524 277731 293920 309018 313699
17274 313699 301179 288652 284248 291439 294235 303144 309099 321611 331297 348536 352398 378005 397687
17261 397687 388755 367033 356830 357342 357655 351308 348409 356223 364257 359841 385736 408701 429413
17248 429413 432502 436926 429221 430560 432069 434377 449827 477022 508458 543952 580562 597251 574408
17235 574408 496089 394923 351257 357019 374049 384917 397196 404481 434997 468912 521578 571976
17223 571976 588280 543944 447917 331832 301380 318133 324135 319125 310591 309845 309102 336747 357898
17210C57898J9393K2474K8815k548o973J1129K3478P786K034Q678N158q725q531
17197D60066n865N928J9955J8202K4119m726L418J3888L0924L5398J2873j286
17185F12894k485m179r658n085J7629K4978L0433J3584J4852J6441L2320K1159
17173G62883M444L343R878J1847K2697K6326K7981L5708L0545J3234L0902M2675
17161A022463M1525L4810K9823K5019M2545N4525N1558L1496L7945O0232P3742
17150A505683N3920P5485Q5295Q0338O5075O5403R1225J07739J24085J51677K08228
17139B614153L35592N77757Q89379J023659O23392p6049n89332n56600k56809
17130D585142J8518J93504K63410L31318L93012N54638R18926J462027J754480
$$ plain form
17210 357898 377291 399765 428580 426032 419059 430188 453666 461452 463486 472164 477322 468597 460066
17197 460066 454201 460129 480084 498286 522405 517679 521097 534985 565909 601307 614180 612894
17185 612894 610409 606230 596572 591487 609116 634094 664527 678111 692963 709404 741724 762883
17173 762883 767327 770670 780548 792395 815092 841418 869399 905107 935652 948886 979788 1022463
17161 1022463 1063988 1098798 1128621 1153640 1196185 1250710 1302268 1333764 1371709 1431941 1505683
17150 1505683 1559603 1635088 1720383 1800721 1865796 1931199 2022424 2130163 2254248 2405925 2614153
17139 2614153 2949745 3527502 4416881 5440540 6063932 5987883 5398551 4841951 4585142
17130 4585142 4603660 4797164 5060574 5391892 5784904 6339542 7258468 8720495 10474975
17121A0474975J416973J000561J100349J887968K767937L435880M786356P275791
17113C4146790J1258576J9387483L6980003P0531055J07056010N9997001o1392381
17106B77964537j04172187o9955172l3384310j5481667p625505k791608K179272
17099D6733360Q020380J7067094L4213866O6560751J02417338N7132018o2072489
17092B70072318j04333616p1276146l5742466j8489940j1012847p329746m714915
17085A7172642k702414j478723j187520j389508j717135j578999j061627n31261
17077E525455j43654j60613p02961r20037o68870l40010j37268M9823L09840K99025
17067C110730k60800n38720l01234R5868L56014K35172l36477o16962m82890l01470
$$ plain form
17121 10474975 11891948 12892509 13992858 15880826 18648763 22084643 26870999 34146790
17113 34146790 45405366 64792849 101772852 172303907 279359917 339356918 277964537
17106 277964537 173792350 103837178 70452868 54971201 47345696 44554088 46733360
17099 46733360 54753740 71820834 106034700 172595451 275012789 332144807 270072318
17092 270072318 165738702 94462556 58720090 40230150 29217303 21887557 17172642
17085 17172642 14470228 12991505 11803985 10414477 8697342 7118343 6056716 5525455
17077 5525455 5381801 5221188 4518227 3598190 2929320 2589310 2452042 2501865 2811705 3110730
17067 3110730 2849930 2311210 2009976 2105844 2461858 2697030 2360553 1743591 1260701 959231
17057I59231j83339j32599r7340m2619j2293k9962m7425l8842l5355m0646m4463
17046B54348q006r340k7612m1400j2286J3894J1121j5395k3362m108J0057M186
17034A52097M222m014K528q999l1815k1449p767M419R122O360P250n267n278P998
17020A09407k043q473j0188l0152k3011p341K497K0999L094j1520q191j4438R50
17007B1590J8090Q963m171p160J529o430j4445q415K340K4944K0076Q676O956
16994G2543J9469M0036O6727N6410j6707l6442r016M941K1581K5205K6725J2142
16982B83614j8448j8827p1432j13607n8958j0786L1671K4087L0112J4154K0329
16971A11909K5531M0976L4783o325k3043p7252j05111n3270k4836j5934J518o359
$$ plain form
17057 959231 775892 643293 545953 503334 491041 461079 413654 374812 339457 298811 254348
17046 254348 246342 237002 209390 167990 155704 169598 180719 165324 141962 137854 147911 152097
17034 152097 156319 152305 154833 145834 114019 92570 84803 89222 98344 104704 111954 106687 101409 109407
17020 109407 107364 98891 88703 58551 35540 28199 30696 51695 54789 43269 35078 20640 21590
17007 21590 39680 48643 44472 37312 38841 32411 17966 9551 11891 36835 56911 65587 72543
16994 72543 92012 132048 198775 255185 238478 202036 193020 197961 219542 244747 271472 283614
16982 283614 265166 246339 174907 61300 2342 -8444 23227 47314 77426 91580 111909
16971 111909 137440 178416 213199 206874 183831 106579 1468 -51802 -76638 -92572 -91054 -97413
16959i7413J485q444j0348j6386j7866l346J0175m454p07J2607J9781J2276M419
16946i8221q605o053n116J197r740q408q573m236o826m119J6609K4071J0683L574
16932a03763L653j148J5840J0525n584M977r6P277N525q530j8887q499P094o438
16918i8054N430J397j8048o200k4862k155J9961L3296J7552k569K9752N943j0761
16905d9318R175M338j2462j8842k0317l0266j8960j699J8721J3246O598L1454
16893f8332K8612J0324M517o395J0347j821R12j2244k2781k5356j7912R50K7856
16880g1323R928Q024J3243n798r388N988J0399L155o847k4053r627J6182J4093
16867d6024J5812J4005J3402n668j6770j7490n946M331p322R771J7489r995r379
$$ plain form
16959 -97413 -95928 -104372 -114720 -131106 -148972 -152318 -142143 -146597 -147304 -134697 -114916 -102640 -98221
16946 -98221 -106826 -112879 -117995 -116798 -126538 -134946 -143519 -147755 -154581 -158700 -142091 -118020 -107337 -103763
16932 -103763 -100110 -101258 -85418 -74893 -80477 -75500 -75596 -68319 -62794 -71324 -90211 -98710 -91616 -98054
16918 -98054 -92624 -91227 -109275 -115475 -140337 -142492 -122531 -89235 -71683 -74252 -44500 -38557 -49318
16905 -49318 -40143 -35805 -48267 -67109 -87426 -117692 -136652 -138351 -119630 -106384 -99786 -68332
16893 -68332 -39720 -29396 -24879 -31274 -20927 -22748 -21836 -34080 -56861 -82217 -100129 -99179 -71323
16880 -71323 -61395 -53371 -40128 -45926 -55314 -49326 -38927 -35772 -42619 -66672 -76299 -60117 -46024
16867 -46024 -30212 -16207 -2805 -8473 -25243 -42733 -48679 -44348 -51670 -41899 -24410 -34405 -43784
16854d3784J7892J1859o197M83j086j5033n018o383j464M154O593K036Q55P906
16840b7187J1334j3325j6690l428l045M112J7566n886j6855L222J5042k747r663
16827d7550m53L730M005j3781N396M72j0358P099k982q902K927l671m976j728
16813g0772K826J0878J1231j5210p078N555J2745q52q248J1673J4728K795R047
16800b0682K955Q233j43j1033k6800n667N056O754M456n709J467k457K690l634
16786d4514p3K2837K8854P297o135j0918q159K718J7840L5602N5291K291n6140
16773D6791m1082n944o742j2347K343nj7408n655J1995j0665n391J6563L179n803
16759c0171k60k919q441Q080k126k622P21k294L833J3240l675r146m934N108K561
$$ plain form
16854 -43784 -25892 -14033 -20230 -19747 -20833 -35866 -40884 -47267 -48731 -44577 -37984 -35948 -35093 -27187
16840 -27187 -15853 -29178 -45868 -49296 -52341 -48229 -30663 -36549 -53404 -50182 -35140 -37887 -47550
16827 -47550 -48003 -44273 -40268 -54049 -48653 -48181 -58539 -51440 -54422 -63324 -60397 -64068 -69044 -70772
16813 -70772 -67946 -57068 -45837 -61047 -68125 -62570 -49825 -50677 -58925 -47252 -32524 -29729 -20682
16800 -20682 -17727 -9494 -9637 -20670 -47470 -53137 -48081 -41327 -36871 -42580 -41113 -43570 -40880 -44514
16786 -44514 -44587 -21750 7104 14401 8266 -2652 -10811 -8093 9747 45349 100640 102931 46791
16773 46791 5709 -235 -6977 -19324 -16981 -16986 -34394 -40049 -28054 -38719 -44110 -27547 -24368 -30171
16759 -30171 -30431 -33350 -41791 -33711 -35837 -38459 -37738 -40032 -36199 -22959 -26634 -35780 -40714 -35606 -33045
16744c3045J404J4251Q47L748r713j6744N254N457q046M299n814q862J6557K0466
16730i941Q451M842J047j270M69j3440j7856L426j0138r520p733l971O437J237
16716d7960J2086J4965M044l11p963l901J4955R185J1656R214O366j885k353j1760
16702F338k1214j184j185J415L010R165J0298r760k6152n490k295R578J1379m865
16688b0962l709J2978J6956k756p914o536K277J954K664j7290m78R926P79J8383
16674F272K1368l453j4299k096l088J552m823o706p797n717K1618K2982K005n508
16660B2310K958J3357J503k767j0371p511r080M951L032p434N404O579o960p891
16646H080l939O384j801R673L307r085R088j0033q066j0194J098P329N709P912
$$ plain form
16744 -33045 -31641 -17390 -16543 -12795 -22508 -39252 -33998 -28541 -36587 -32288 -38102 -46964 -30407 -9941
16730 -9941 -1490 3352 4399 3129 3598 -9842 -27698 -24272 -34410 -43930 -51663 -55634 -49197 -47960
16716 -47960 -35874 -20909 -16865 -17176 -25139 -29040 -14085 -4900 6756 15970 22336 20451 18098 6338
16702 6338 -14876 -16060 -17245 -15830 -12820 -3655 6643 -3117 -29269 -34759 -37054 -27476 -16097 -20962
16688 -20962 -24671 -11693 5263 2507 -5407 -11943 -9666 -7712 -5048 -22338 -22816 -12890 -12111 6272
16674 6272 27640 24187 9888 7792 4704 6256 1433 -5273 -13070 -18787 2831 25813 27818 22310
16660 22310 25268 38625 40128 37361 26990 19479 10399 15350 18382 10948 16352 22931 15971 8080
16646 8080 4141 10525 8724 18397 21704 12619 21707 11674 3608 -6586 -5488 1841 7550 15462
16632A5462p793q254J907p233O720K3157P35m678n228j128N180j1444p993o141
16618f731J4786Q767J381K123l550k292n083k281J775p3Q178j974l073Q486J0899
16603C1338Q063J0910K339j1492j4864o457L416J818m376m916K827l801M29O838
16589B2072m489l909L129J6194r79m751J0292L304q581L797n275o447M573m647
16575B4283k526M574N136K278o476M984K877m697n252o456j0867n805L32N649
16561H034Q552N061p848L396J2162L759q206J49O27J0332O839M538m045P907K767
16546E4024J393O214K138k623q82j0173P46n585k48Q522P656Q109J0180O137J099
16531H6707J5179K1088J1234O470L1660N5011Q8657J39863K49666M65324N75880
$$ plain form
16632 15462 7669 -585 1322 -5911 809 23966 24701 20023 14795 13667 18847 7403 -590 -6731
16618 -6731 8055 16822 18203 20326 16776 14484 9401 7120 8895 8822 17000 15026 11953 20439 31338
16603 31338 39401 50311 52650 41158 26294 19837 23253 25071 20695 15779 18606 14805 15234 22072
16589 22072 17583 13674 16803 32997 32018 27267 37559 40863 32282 36079 30804 24357 28930 24283
16575 24283 21757 26331 31467 33745 27269 32253 35130 30433 25181 18725 7858 2053 2385 8034
16561 8034 16586 21647 13799 17195 29357 33116 24910 25059 25686 36018 42857 47395 43350 51257 54024
16546 54024 55417 61631 63769 61146 60264 50091 50837 45252 45004 53526 61182 69291 79471 85608 86707
16531 86707 101886 122974 134208 140678 172338 227349 316006 455869 705535 1170859 1746739
16520A746739P6543m85127n25233k95761j43204o9922l3658o979K3342O5193J30043
16509D81976K51668M42758N46515N0624m97865n29894l04011j50656r8824n7987
16499A34304k2608k1425j5536m517M094o825k1517j6115r600J866L127k578m145
16486A8525L488m814r105P777m37j4874n76l76O398J0503j762J862j348j6455
16472a194n919R40l49J1953J2226j8053KJ1429L147k474j1165l46P332o963j5826
16457a5260R838K639M57j943L091O683K168r743O174J0197k204m566l124q349
16443c942N210N364o860j229q250j0258p518N472P75P094Q354L320q268N404K785
16428b547o228m810Q949o305n424M511R3j2569N687J0173j062n300o32K601J311
$$ plain form
16520 1746739 1823282 1338155 812922 517161 373957 304035 270377 263398 286740 351933 481976
16509 481976 733644 1176402 1722917 1773541 1275676 745782 441771 291115 192291 134304
16499 134304 111696 90271 74735 70218 74312 67487 45970 29855 20255 22121 25248 22670 18525
16486 18525 22013 17199 8094 15871 15434 560 -16 -392 6006 16509 14747 16609 15261 -1194
16472 -1194 -7113 -6173 -6522 5431 17657 -396 -394 11035 14182 11708 543 197 7529 566 -15260
16457 -15260 -5422 -2783 -2326 -4269 -1178 5505 7673 -2070 4104 14301 12097 7531 4407 -3942
16443 -3942 1268 6632 -228 -1457 -9707 -19965 -27483 -22011 -21236 -14142 -5788 -2468 -10736 -5332 -2547
16428 -2547 -8775 -13585 -4636 -10941 -16365 -11854 -11761 -24330 -18643 -8470 -9532 -14832 -15464 -12863 -11552
16413a1552j004j6952K099K5296n611n520n567j4782J870J322M519L879Rm716
16399b6710Q635L018j98Q998L223n979n265J023M379k383M876m502n19j8Q257
16384c165k399L579R12n403Q919K946j5127j3087q583N042R932J2303l950j994
16370a0075r694o284J177j277J0570O230M04K004J0298P484o987j0866n376L241
16356i151o953J792J501j1547M165N666m747k755N299K474J0573k880k912m492
16342a3967O249K124r760p990J1382o567j548M6P272O98r165m277N613q739M626
16327b4003R501J2913R629Q545J303q689n326Q70L739O157k330j283m698n056
16313A272n882q49J3496o028j1653j6027J2422J3914k587m893j2540p552R661
$$ plain form
16413 -11552 -12556 -29508 -27409 -2113 -7724 -13244 -18811 -33593 -31723 -30401 -25882 -22003 -21994 -26710
16399 -26710 -18075 -15057 -15255 -6257 -3034 -9013 -14278 -13255 -8876 -11259 -6383 -10885 -11404 -11422 -3165
16384 -3165 -5564 -1985 -1073 -6476 2443 5389 -9738 -22825 -31408 -26366 -16434 -4131 -8081 -10075
16370 -10075 -19769 -26053 -24876 -26153 -15583 -9353 -8949 -6945 3353 10837 3850 -7016 -12392 -9151
16356 -9151 -16104 -14312 -12811 -24358 -20193 -14527 -19274 -22029 -16730 -14256 -3683 -6563 -9475 -13967
16342 -13967 -7718 -5594 -15354 -23344 -11962 -18529 -20077 -20031 -12759 -12061 -21226 -25503 -19890 -28629 -24003
16327 -24003 -14502 -1589 8040 16585 17888 9199 3873 4743 8482 14639 12309 11026 6328 1272
16313 1272 -4610 -5459 8037 2009 -9644 -25671 -13249 665 -1922 -6815 -19355 -26907 -17246
16300a7246o250M52K390O731L417r870n325O145o100l548O040O005q850Q34J4406
16285a0769L324P634o806j1769k714O741J1290J044L829o427j6725j9803J037
16272d0114P607r405K990R340M624Q016J0659L651L706P257R60o205p069j0127
16258a4110n653n614N71R066k228m811R085n728p397m348O57J482J42l745M160
16243b8471J962M320L411J0002j558j233l081K576L972R32k296l694n894k314
16229b1366O778J753P119L921L762j103n961n000j1329Q864K85J454j2778j207
16215b4808M034j624J3110J3229p18o094J70q803k646J5973J3552j2711n784M785
16201A665o222j0290J0386m856L866n65j087j304l141l194j318L143O849P32r989
$$ plain form
16300 -17246 -23496 -23044 -20654 -13923 -10506 -20376 -25701 -19556 -25656 -29204 -23164 -17159 -26009 -25175 -10769
16285 -10769 -7445 189 -6617 -18386 -21100 -14359 -3069 -2025 1804 -4623 -21348 -41151 -40114
16272 -40114 -32507 -41912 -38922 -29582 -24958 -16942 -6283 -2632 1074 8331 9291 3086 -3983 -14110
16258 -14110 -19763 -25377 -24806 -15740 -17968 -22779 -13694 -19422 -26819 -31167 -30510 -29028 -28886 -32631 -28471
16243 -28471 -26509 -22189 -18778 -8776 -10334 -11567 -14648 -12072 -8100 -7168 -9464 -13158 -19052 -21366
16229 -21366 -14588 -12835 -5716 -1795 1967 864 -5097 -10097 -21426 -12562 -12277 -10823 -23601 -24808
16215 -24808 -20774 -22398 -9288 3941 3223 -2871 -2701 -11504 -14150 1823 15375 2664 -3120 1665
16201 1665 -4557 -14847 -4461 -9317 -5451 -6016 -7103 -8407 -11548 -14742 -16060 -12917 -6068 -5336 -15325
16186a5325q278k611o767n581J0642k249m019L175M919P300j380r679R469k178
16172b2562L077L084j790r733j50K36L294l340M233N612P325l982p262J0515o227
16157a7670k715J321o732l454J2186K337j335L560q559J2291M955o624k987q178
16143b1604j2408Q769Q260o78P97M357O625P912N818r594p251j3378Rm593K0859
16128f100j399J072J3656l315k5875J1550J9969o151j0203n631n924k458M546
16115a6263j0126J817j865N498k76M295J5391J0811p393o075J7603J1208j4183
16102A0442p259k906k509L433p466r461q761k751q097N494J0212R818O907l947
16088f851j673m154l002Q165J8977m860j4982k156k422m50k589k955N624L748
$$ plain form
16186 -15325 -23603 -26214 -32981 -38562 -27920 -30169 -34188 -31013 -26094 -18794 -20174 -29853 -20384 -22562
16172 -22562 -19485 -16401 -18191 -27924 -28074 -27838 -24544 -27884 -23651 -18039 -10714 -14696 -21958 -11443 -17670
16157 -17670 -20385 -19064 -25796 -29250 -17064 -14727 -16062 -12502 -21061 -8770 -3815 -10439 -13426 -21604
16143 -21604 -34012 -25243 -16983 -17661 -16864 -12507 -5882 2030 7848 -1746 -8997 -22375 -22366 -26959 -6100
16128 -6100 -7499 -6427 7229 3914 -21961 -10411 9558 3407 -6796 -12427 -18351 -20809 -16263
16115 -16263 -26389 -24572 -26437 -20939 -21215 -16920 -1529 9282 1889 -4186 13417 24625 10442
16102 10442 3183 277 -2232 1201 -6265 -15726 -24487 -27238 -35335 -29841 -19629 -9811 -2904 -6851
16088 -6851 -8524 -12678 -15680 -7515 11462 6602 -8380 -10536 -12958 -13408 -15997 -18952 -13328 -9580
16074i580P059M762o29j0511o801K034q981j190N774Q223q33q813j0829O100K7469
16059C254M994q21l936J850m362k0004l26N805l15J1620M548k592R28l664J239
16044a782L854n03j0990l109l746o74j155K723K730J0646N236n336J5847L804
16030A7545p699m935l635p195j437J0144J2283q592j1391j4829Q887P931J5737
16017A2814r210j0566K327J175K559J1N313k189q056j634J91j215j0731r212M347
16002b4076K2936K037m218o463K143p819l489K914J6542L42J0112l453K249o166
15988C591P189M071J074J334L735j7225k0311L422J1092J5232J1974k836j0338
15975A2004m027j4916r152j306J5201J2478o986q558M411q65j4452M619m089j3259
$$ plain form
16074 -9580 -2521 2241 1612 -8899 -15700 -13666 -22647 -23837 -18063 -9840 -10673 -19486 -30315 -24215 3254
16059 3254 8248 7427 3491 5341 979 -19025 -19351 -13546 -13861 -2241 2307 -285 643 -3021 -1782
16044 -1782 2072 1569 -9421 -12530 -16276 -16950 -18105 -15382 -12652 -2006 3230 -2106 13741 17545
16030 17545 9846 4911 1276 -5919 -7356 2788 15071 6479 -4912 -19741 -10854 -2923 12814
16017 12814 3604 -6962 -4635 -3460 -901 -890 4423 2234 -5822 -7456 -7265 -8480 -19211 -28423 -24076
16002 -24076 -1140 897 -3321 -9784 -7641 -15460 -18949 -16035 507 849 10961 7508 9757 3591
15988 3591 10780 14851 15925 17259 20994 3769 -16542 -13120 -2028 13204 25178 22342 12004
15975 12004 7977 -6939 -16091 -17397 -2196 10282 3296 -5262 -851 -1716 -16168 -11549 -15638 -28897
15961b8897J3528J8459M331n309p752j627K230P650l871O376J2416k829j4120
15948E85j5144m27J931M762J707k232L091J2239M162m217J3185m277q365O497
15934A3497J505j1782q952M306J641P089N681j25l965o337q298r676L075J0195
15920b146Q300N667Q314o699Q79M778q109j697j1584j0975L390q625Q133J8301
15906G927N212n651j2750o713P388J0233M15J402K027j6p813J5809P565M499k820
15891B6714p530n479l68l034k654%k076K632l493M82K95l935j0968K617R963L379
15875F545N23J2221r6m971L946p272j1008L97K348N182q961n629o423j2391O362
15860a9227Q228K27L466N416J5340P474J2393r526O5Q611j1438j0606q858M156
$$ plain form
15961 -28897 -15369 3090 7421 2112 -5640 -7267 -5037 2613 -1258 5118 17534 14705 585
15948 585 -14559 -14986 -13055 -8293 -6586 -8818 -5727 6512 10674 6457 19642 15365 7000 13497
15934 13497 15002 3220 -5732 -1426 215 7304 12985 12860 8895 2558 -5740 -15416 -12341 -2146
15920 -2146 6154 11821 20135 13436 14315 19093 10984 9287 -2297 -13272 -9882 -18507 -10374 7927
15906 7927 13139 7488 -5262 -11975 -4587 5646 6061 7463 9490 9474 1661 17470 25035 29534 26714
15891 26714 19184 13705 13337 10303 7649 7649 5573 8205 4712 5194 5489 1554 -9414 -6797 3166 6545
15875 6545 7068 19289 19193 14222 18168 10896 -112 285 2633 7815 -1146 -6775 -13198 -25589 -19227
15860 -19227 -10999 -10772 -7306 -1890 13450 20924 33317 23791 23856 32467 21029 10423 1565 5721
15846E721j4732q331J0233N831N027l594Q65n702k199j866R327J5398J5058p499
15832B3537j4710L545k45M36r852q539J949R512n171M199p53O379j0599o902J160
15817f054j689l569j342J8664Q034J0054o017n658j2873p913l854k097M171N697
15803d446J86M515j463K099K960O355M79J986p322L980m283O160n846J948J3710
15788B1018P716j4464j0101p479O7L759P940O155j362j3310K892j317j6896O206
15774i176J2988J1758n784j0840q302r543O882O991K952Q564N800n54p206M97
15760E027J2832l315l433j3426M005R651j0052L613n026j2421J1633J152k0816
15747b0576N1J0691Q796N617O057j160p662q531M565K2576J3380N407q562J412
$$ plain form
15846 5721 -9011 -17342 -7109 -1278 3749 155 1020 -4682 -6881 -8747 580 15978 31036 23537
15832 23537 8827 12372 12127 12563 2711 -5828 -3879 5633 462 4661 3908 10287 -312 -7214 -6054
15817 -6054 -7743 -11312 -12654 6010 14044 24098 18081 12423 -450 -8363 -12217 -14314 -10143 -4446
15803 -4446 -4260 255 -1208 891 3851 10206 10685 12671 5349 9329 5046 11206 5360 7308 21018
15788 21018 28734 14270 4169 -3310 -3243 516 8456 14611 13249 -61 2831 1514 -15382 -9176
15774 -9176 3812 15570 9786 -1054 -9356 -18899 -12017 -5026 -2074 6490 12290 11736 4530 5027
15760 5027 17859 14544 11111 -2315 1690 11341 1289 4902 -124 -12545 -912 240 -20576
15747 -20576 -20525 -9834 -1038 4579 10636 9476 1814 -6717 -2152 20424 33804 39211 30649 32061
15733C2061K0231k3637l7788n370M001J2078O567Q560m114q75r56q167m447R962
15719H106J2548l881j2387k368J2j1769j606J4643Q14R014q332q66J788j2306
15705f590j5901j337K2336O020j7936j2609Q313J4056M568m482J032N765m767
15692a532P612R570J0630j2539j974k958P155J2817M515j5537m564M592N464l75
15678B2876q68j2364k920R634M563p32r607j609q491Q827l020N807R103o881l446
15663A0872M885r894p032N264o045P453J196n759L759J285q522J186l571J002
15649c921J957Q772P263K714M735j052q123j607o092j2428M21O482J0157Q38J0938
15634B1054J4099M198p582j7175p681N839M266J920R524p993p437N281k303o465
$$ plain form
15733 32061 52292 28655 -9133 -14503 -10502 1576 8143 16703 12589 11714 10758 2591 -1856 8106
15719 8106 20654 16773 4386 2018 2030 -9739 -11345 3298 4112 13126 4794 3928 5716 -6590
15705 -6590 -22491 -23828 -1492 4528 -13408 -26017 -17704 -3648 920 -3562 -2530 3235 -1532
15692 -1532 6080 15650 26280 13741 11767 8809 15964 28781 33296 17759 13195 17787 23251 22876
15678 22876 22008 9644 6724 16358 20921 20189 10582 8973 482 9309 6289 12096 21199 14318 10872
15663 10872 15757 5863 -1169 4095 -1950 5503 6699 940 4699 5984 -2538 -1352 -4923 -3921
15649 -3921 -1964 6808 14071 16785 21520 20468 12345 10738 4646 -7782 -7361 -879 9278 10116 21054
15634 21054 35153 39351 31769 14594 6913 12752 17018 18938 28462 20469 13032 18313 16010 9545
15620I545R527q91l020J5410j423k2185p564N464M99j1148m82J7252J19O926q696
15605I333k448J333P060m624r944P915K726Q740o528J3109M143j468n962j269
15591B2116p345p015M833J300L222n14p71K569J4257J0756j0242m703Q552p209
15577B9806k336J632q598l22k067L03n817J1013N462q813r612p628P180J7997
15563B8200o68j4246n177L795k954l350J8615K773J431k448j1682o471J9060J6086
15549D2964k886l183j6455j3637J4210J2116P031J3099p779k431j0493k338J3481
15536D3699k068q186n242j4689O062M261N900J4098J072p236n725J3800J5019
15523F0765n582j4237j2054n981O515j0070l281P241J0070J9630p94p689j0427
$$ plain form
15620 9545 19072 18181 15161 30571 29148 6963 -601 4863 5362 -5786 -6268 10984 11103 18029 9333
15605 9333 6885 8218 15278 10654 710 8625 11351 20091 13563 26672 30815 29347 23385 22116
15591 22116 14771 7756 12589 13889 17111 16597 15826 18395 32652 43408 33166 28463 37015 29806
15577 29806 27470 29102 20504 20182 18115 18418 12601 23614 29076 20263 10651 3023 10203 28200
15563 28200 27532 13286 8109 11904 8950 5600 24215 26988 28419 25971 14289 7818 26878 42964
15549 42964 40078 36895 20440 6803 21013 33129 40160 53259 45480 43049 32556 30218 43699
15536 43699 41631 33445 28203 13514 19576 23837 29737 43835 44907 37671 31946 45746 60765
15523 60765 55183 40946 28892 22911 29426 19356 16075 23316 33386 53016 52222 44533 34106
15510C4106j812K667m039N997K250k473R454o69J758q94o732k404p24M549Q724
15495D9758m205j3400k275P181J1144j517r29J1348R033r341q261q266m622K177
15481C7825L18Q939J2962M610r92m364r513l607q732P147K0086L445M745l135
15467F9734q85k98j580n63j318k8063r005J7754p674j1290K885L395O371j412
15453C8051j0941P255N713O528M644L253J584o098o023j2729j1874L839J2772
15440C5974R010P506K906o984k280n517M706J6567J6827R88p181N912Q170O201
15426I2805j287m119k1728p562j0024r071K049L164P783r009n295P678j49O540
15412E1775K707J554N302j1850q054j5214L860k61L615j458q436j160P878J637
$$ plain form
15510 34106 32294 34961 30922 36919 39169 36696 46150 45481 47239 46345 39613 37209 36485 41034 49758
15495 49758 45553 32153 29878 37059 48203 46686 45757 57105 66138 56797 48536 40270 35648 37825
15481 37825 38143 47082 60044 64654 63662 59298 49785 46178 37446 44593 64679 68124 72869 69734
15467 69734 68849 68551 66971 66408 65090 37027 28022 45776 38102 26812 29697 33092 39463 38051
15453 38051 27110 34365 40078 46606 51250 54503 56087 49989 43966 31237 19363 23202 35974
15440 35974 44984 52490 55396 48412 46132 40615 45321 61888 78715 79703 72522 78434 86604 92805
15426 92805 91518 87399 65671 58109 48085 39014 41063 44227 52010 43001 37706 45384 45235 51775
15412 51775 54482 56036 61338 49488 41434 26220 30080 29819 33434 31976 23540 22380 30258 31895
15398C1895j179J0377l197J289J388k924L118j150p35k726k353K337q966j2204
15384A4970K451M010p118Q435Q184Q566P607J50j4780j2618L458R880r12j244
15370C1039K069N330o542j4929M268J4337P263j8117j0892n69J1979n483J0352
15357C0105o761r453L058O440k468J87N445O097k986q250m910p342K1383P074
15343C7619n317j3643j0571J2353P177L742Q293R707r630j9407j0828Q562q83
15330A7174N818N024J6027L960j0255j8503j8688J344J415K85Q243m17j5717J0424
15316F134M933r833N538R606L048j8100j3720r85J4173J0878p869o857J0317L120
15302A0383J6790m70r626J4230J11o737m355Q04l474n341J8751n631j4026m282
$$ plain form
15398 31895 30716 41093 37896 39185 40573 37649 40767 39617 38882 36156 33803 36140 27174 14970
15384 14970 17421 21431 14313 22748 30932 39498 47105 47255 32475 19857 23315 33195 32283 31039
15370 31039 33108 38438 31896 16967 21235 35572 42835 24718 13826 13257 25236 19753 30105
15357 30105 23344 13891 16949 23389 20921 21108 26553 32650 29664 21414 16504 9162 30545 37619
15343 37619 32302 18659 8088 20441 27618 31360 39653 49360 39730 20323 9495 18057 17174
15330 17174 22992 28016 44043 48003 37748 19245 557 1901 3316 3601 11844 11427 -4290 6134
15316 6134 11067 1234 6772 16378 19426 1326 -12394 -13379 794 11672 3803 -3054 7263 10383
15302 10383 27173 26703 17077 31307 31418 24681 20326 21130 17656 12315 31066 25435 11409 7127
15288G127l888n591J4623n850m160N528J141K200n028P239J1304P2k312j4523
15274G882K01R137O029j5839k498J0677M206J145j2982n164L350O17k712K42o806
15259b515k68O348L94o499p70J0984J6541N932n283n721l954L492j0771q965L543
15244B488L192q068m598O2l766J0349J4227O314o520n010J982p776j7938K351
15230a2711r63N575M777L336P550o182J7379j096n725r41K427l948J3823J0335
15216C3636o635O107J389j5318j135q137o358o285j421J185n716k4915Q011J137
15202b4455l83P158J0859J295O385j952P178l357l701o902K64P246J181l649K090
15187g43j608J4345R20k959L325k579K728r190m144p085m25m467J3239p3N33J3190
$$ plain form
15288 7127 3239 -2352 12271 6421 2261 7789 8930 11130 6102 13341 24645 24717 22405 7882
15274 7882 8083 17220 23249 7410 4912 15589 19795 20940 7958 2794 6144 6761 4049 4291 -2515
15259 -2515 -2783 3565 3959 -2540 -3310 7674 24215 30147 24864 19143 15189 18681 7910 -1055 2488
15244 2488 5680 -2388 -6986 -6924 -10690 -341 13886 20200 13680 8670 10652 2876 -15062 -12711
15230 -12711 -13674 -8099 -3322 14 7564 1382 18761 17665 11940 10999 13426 9478 23301 33636
15216 33636 27001 33108 34497 19179 18044 9907 3549 -2736 -4157 -2972 -8688 -33603 -25592 -24455
15202 -24455 -24838 -17680 -6821 -5526 859 -1093 6085 2728 -973 -7875 -7611 -365 816 -2833 -743
15187 -743 -2351 11994 12914 9955 13280 10701 13429 4239 95 -6990 -7415 -11882 1357 1284 1817 15007
15171A5007Q640J546k870k795r449m722j3987m35J3054k504K001J7819q331j0934
15157B040J548M90j443O083q048r837o560O913L481j096j698p266m215M131K208
15142a3269n392J8959l350j2335j92l377J401J1083j704m356j902m276j521Q40
15128a9391P297q362n74Q885N223J3448K467r00j04l22K230L239k488k903N145
15113A2890k878r111j1508R536R148K647j0166n373P684P630l282M524j1891m699
15099d849J60K0407l201j3003j1552j4898m005N127M794j3368K088Q078Q179K458
15085a3585l390m062l144N377J4539j87j4298L590J5826O03o49k235n61m947l409
15070a0532n013P316q10j7869l121P055J6463N858j0386k472m108R934j0945m782
$$ plain form
15171 15007 23647 25193 22323 19528 10079 5357 -8630 -9065 3989 1485 3486 21305 12974 2040
15157 2040 3588 4078 2635 8718 670 -9167 -15727 -8814 -5333 -6429 -8127 -15393 -19608 -15477 -13269
15142 -13269 -18661 298 -3052 -15387 -15579 -18956 -17555 -6472 -8176 -12532 -14434 -18710 -20231 -19391
15128 -19391 -12094 -20456 -21030 -12145 -6922 6526 8993 8093 7989 7667 9897 13136 10648 7745 12890
15113 12890 10012 901 -10607 -1071 8077 10724 558 -4815 2869 10499 7217 11741 -150 -4849
15099 -4849 -4689 15718 12517 -486 -12038 -26936 -30941 -25814 -21020 -34388 -32300 -24222 -16043 -13585
15085 -13585 -16975 -21037 -24181 -18804 -4265 -4452 -18750 -15160 666 1269 620 -1615 -2176 -7123 -10532
15070 -10532 -15545 -8229 -9039 -26908 -30029 -22974 -6511 -653 -11039 -13511 -17619 -7685 -18630 -23412
15056b3412K1713J0790j1201o867M137L493k471J2242R033n583o494j803J008
15043D585j2545l893l613q113j2770L135P955M674P215O863N12P947J0827k752
15029A0027l475p583j5477l486J609j764N933O02r779M376O509J239K214k624
15015a1679J2621J6930M029j3267n948J500j4367k252q91M358J158K354o851j0966
15001b3271J5154R804J115j0392n371o216K467O753N091M478n374k441l477l248
14987a4928p333N08M534J362j570j3339J0646L635j796K4608J8054o300o885L113
14973A4309k492L240M338N193j0339p795j3072l892k116r702j0967J7529J5903
14960A37m410P671N091p206R18j424J209L432K084P607j1329l655K805q319J6169
$$ plain form
15056 -23412 -1699 9091 -2110 -8977 -4840 -1347 -3818 8424 17457 11874 5380 3577 4585
15043 4585 -7960 -11853 -15466 -23579 -36349 -33214 -25259 -20585 -13370 -6507 -5995 1952 12779 10027
15029 10027 6552 -1031 -16508 -19994 -18385 -20149 -14216 -13614 -23393 -19017 -12508 -11269 -9055 -11679
15015 -11679 942 17872 21901 8634 2686 4186 -10181 -12433 -13324 -8966 -7808 -5454 -12305 -23271
15001 -23271 -8117 1687 2802 -7590 -12961 -19177 -16710 -9957 -4866 -388 -5762 -8203 -11680 -14928
14987 -14928 -22261 -21753 -17219 -15857 -17427 -30766 -20120 -16485 -18281 6327 24381 18081 11196 14309
14973 14309 11817 15057 19395 24588 14249 6454 -6618 -10510 -12626 -22328 -33295 -15766 137
14960 137 -4273 3398 8489 1283 2201 777 1986 5418 7502 15109 3780 125 2930 -5389 10780
14945A0780Q627q358o609j719k863j5729K409J4260l403j1160J500O747q772k0079
14931c4369j1029J3349J3847m236q577n601P587l981P269R074O56o912m404l069
14917c0396J0700J7077J007j1536k281J4374R215J926M845j3747r200o752O665
14904h103J1436n506j6749K991J1444R363P073l410j6511j483j929n736J1936
14891e184M029n929J481j3101j679J8564Q485n199k663P565L285k998m537k44
14877A875n376n272N213L059N64n825j8173N043J6918P302o833o125j6233J3075
14863a0788P513J6729J3340j3851j5316m011p339N831J271j411j1391l024M302
14850a8145J0884K5560O989j951j3708n881o116r394K510j0683K369r678r784
$$ plain form
14945 10780 19407 11049 4440 2721 -142 -15871 -13462 798 -2605 -13765 -12265 -5518 -14290 -34369
14931 -34369 -45398 -32049 -18202 -22438 -31015 -36616 -29029 -33010 -25741 -16667 -16011 -22923 -27327 -30396
14917 -30396 -19696 -2619 -1612 -13148 -15429 -1055 8160 10086 14931 1184 -8016 -14768 -8103
14904 -8103 3333 -2173 -18922 -15931 -4487 4876 11949 8539 -7972 -9455 -11384 -17120 -5184
14891 -5184 -1155 -7084 -5603 -18704 -20383 -1819 6666 1467 -1196 6369 9654 6656 2119 1875
14877 1875 -3501 -8773 -3560 -501 63 -5762 -23935 -18892 -1974 5328 -1505 -7630 -23863 -10788
14863 -10788 -3275 13454 26794 12943 -2373 -6384 -13723 -7892 -6621 -8032 -19423 -22447 -18145
14850 -18145 -7261 18299 25288 23337 9629 3748 -2368 -11762 -9252 -19935 -17566 -27244 -37028
14837c7028L376R005j1264L401J3773J3092J1788r615m628o26k152j825j884q452
14823b3039j85L986R025J014M044P80O019r384p145p234q35P135N677J2274p433
14808e301n734J441M678K94R566o236K963o773n002N175q56M176O55l516k383
14793f853M844j0656m818Q828L951n762N92J7166M390n198j6147k1031o602Q976
14779b8320J4476l867r700J4108J3188O588j830n037J321J122j3241j5820k808
14766b9820M513N403L282N806M003K607M391p302n561m729n239J868j24j1926
14752c2828N828J3972p668N175o263N327p992o431M866J3083J0343j508l012j0031
14738a7139P392K365q906j1453n789k136J151N376M020J4492O947M711j4036j4310
$$ plain form
14837 -37028 -33652 -24647 -35911 -32510 -18737 -5645 6143 -3472 -8100 -8726 -10878 -12703 -14587 -23039
14823 -23039 -23224 -19238 -10213 -9199 -5155 -4375 1644 -7740 -14885 -22119 -22954 -15819 -10142 2132 -5301
14808 -5301 -11035 -9594 -4916 -4622 4944 -1292 1671 -5102 -10104 -4929 -5785 -1609 -954 -4470 -6853
14793 -6853 -2009 -12665 -17483 -8655 -4704 -10466 -9874 7292 11682 6484 -9663 -30694 -37296 -28320
14779 -28320 -13844 -17711 -27411 -13303 -115 6473 4643 -394 927 2049 -11192 -27012 -29820
14766 -29820 -25307 -19904 -16622 -10816 -6813 -4206 185 -7117 -12678 -17407 -22646 -20778 -20902 -32828
14752 -32828 -27000 -13028 -20696 -15521 -21784 -16457 -24449 -30880 -26014 -12931 -2588 -4096 -7108 -17139
14738 -17139 -9747 -7382 -16288 -27741 -33530 -35666 -34515 -29139 -25119 -10627 -3680 1031 -13005 -27315
14724b7315l238J3284k645L9J6644Q246j6505M559J0748O1j19r38m177k599K464
14709a491r525k36N261L138k360q792r018k567l188o28M124J0122M941j1928m148
14694b6295J2477n136K131Q221O769j5969o030R387J2561k790j6360k997P032
14681a6999J1695N880j2829k475P585O727R813P848r710q526P387J2558j25p615
14667A1214n962j3255O662k31O58L371j8189m464j058M956R284P72j0681k851
14653a9774Q956J2695m502j6112O930n058p532J1579J0513P871r605m636l237
14640a1912J0661J696j1070q333P393p083j3483k881l889J5512P173J0303J0813
14627D900J926j5532k424Q44j1029q649r748M709R766J0075M912L104j014m048
$$ plain form
14724 -27315 -30553 -17269 -19914 -19875 -3231 5015 -11490 -6931 3817 3878 3759 2821 -1356 -3955 -1491
14709 -1491 -11016 -11252 -5991 -2853 -5213 -14005 -23023 -25590 -28778 -29406 -25282 -15160 -10219 -22147 -26295
14694 -26295 -13818 -18954 -16823 -8602 -1833 -17802 -23832 -14445 -1884 -4674 -21034 -24031 -16999
14681 -16999 -5304 576 -12253 -14728 -7143 -416 9397 17245 7535 -991 6396 18954 18829 11214
14667 11214 5252 -8003 -1341 -1572 -914 2457 -15732 -20196 -21254 -16298 -7014 -6242 -16923 -19774
14653 -19774 -10818 1877 -2625 -18737 -11807 -16865 -24397 -12818 -2305 5566 -4039 -8675 -11912
14640 -11912 -1251 445 -10625 -18958 -11565 -18648 -32131 -35012 -38901 -23389 -16216 -5913 4900
14627 4900 6826 -8706 -11130 -10286 -21315 -29964 -39712 -35003 -25237 -15162 -10250 -7146 -8160 -12208
14613a2208M975M662M534K2542Q217q124n122K022k869L755j2040j0979j0770
14600a1405k011j475p846o97J3219J2035j2809j6993q698L224J2184P298P580
14587f394m598n533j3683N113J1512L067O973P306R68j2448p434M523M208l395
14573i815j1626R024m591l210r484r14J8320J4599j0661P517J3613P042O9j4548
14559E335q666J0312J519N938r608j3318O415N292j2692j5044j053Q045J334J7960
14545A769M838L784j989j0093N053r681k290n525q979J850R439J2329m598q08
14531d901m288j2965p669K857J7899Q572r932q907j267N885k848J443m134p851
14517b8106P506J5468J4126J2925r22j2307Q088J1612K53k976j7538r751j1879
$$ plain form
14613 -12208 -7233 -2571 1963 24505 32722 24598 19476 21498 18629 22384 10344 -635 -11405
14600 -11405 -13416 -14891 -22737 -23434 -10215 1820 -10989 -27982 -36680 -33456 -21272 -13974 -6394
14587 -6394 -10992 -16525 -30208 -25095 -13583 -10516 -3543 3763 4731 -7717 -15151 -10628 -6420 -9815
14573 -9815 -21441 -12417 -17008 -20218 -29702 -30616 -12296 2303 -8358 -841 12772 19814 19883 5335
14559 5335 -3331 6981 8500 14438 4830 -8488 -2073 3219 -9473 -24517 -25570 -17525 -16191 1769
14545 1769 6607 10391 8402 -1691 3362 -6319 -8609 -14134 -23113 -21263 -11824 505 -4093 -4901
14531 -4901 -9189 -22154 -29823 -26966 -9067 -495 -10427 -19334 -20601 -14716 -17564 -16121 -20255 -28106
14517 -28106 -20600 -5132 8994 21919 20997 8690 16778 28390 28643 25667 8129 -1622 -13501
14504a3501Q645R951j8355q751N421O707J23P34J7973M718j5383n853M224N979
14490B632j962m818Q680J2481j603J0055L681p921k2585j2926N021L183J114J009
14476c959r559M77k567j380O844L012O514P095r868R234J4992o503j6487K460
14462C05m55j0965R125J5816L816r361j867j5565j1268j28M330M445j066J803
14448a1035L089K156L138J480k727m021Q938r606o327p125L807M838N309O000
14434b086k826l84P532P826l558j2851n114J395l202L544l179j3720M213J1497
14420a0913L35k402M980k439l667j525p35J1916J431j864j0360J458K571J0055
14406a159o340J878P657j355l212O642l671j3426j7756Q084Q226O612p012o275
$$ plain form
14504 -13501 -4856 5095 -13260 -22011 -16590 -9883 -9760 -9026 8947 13665 -1718 -7571 -3347 2632
14490 2632 670 -4148 4532 17013 15410 25465 29146 21225 -1360 -14286 -9265 -6082 -4968 -3959
14476 -3959 -13518 -13041 -15608 -16988 -10144 -7132 -618 6477 -3391 5843 20835 14332 -2155 305
14462 305 -150 -11115 -1990 13826 17642 8281 6414 -9151 -20419 -20547 -16217 -11772 -12838 -11035
14448 -11035 -7946 -5790 -2652 -1172 -3899 -7920 1018 -8588 -14915 -22040 -18233 -13395 -8086 -2086
14434 -2086 -4912 -5296 2236 10062 6504 -6347 -11461 -10066 -13268 -9724 -12903 -26623 -22410 -10913
14420 -10913 -10578 -12980 -8000 -10439 -14106 -15631 -16366 -4450 -3019 -4883 -15243 -13785 -11214 -1159
14406 -1159 -7499 -5621 2036 681 -2531 4111 440 -12986 -30742 -22658 -14432 -7820 -14832 -21107
14392b1107k542R861k893k363J0520l253P64Q486r127k196n44P181j9604n214
14378c2031J8330O499J320o15l994M962J4334O829o848j1836j3463O549J4325
14365D361j424j2322q305N81J1871j6335j2847m218J772J5653J3455j4376Q48
14352b1286Q318J3470L681J0010l733k040r773j6833j0034j4894J4288J6201L631
14339h994Q197R465J1579n11j1169j6529k3979R278K1226K5294O315j3850j6782
14326d60j3387J2955l248p532J0289J0016J0592p72j1794j4435k623m34p477J974
14312a6336q348k448O104L432j2309j6696j905R965J8556Q100l267j855K808j578
14298a5777J6897J1244n282K335n854N886o817j2864k0282j054M189J0238P098
$$ plain form
14392 -21107 -23649 -13788 -16681 -19044 -8524 -11777 -11013 -2527 -11654 -13850 -14394 -7213 -26817 -32031
14378 -32031 -13701 -7202 -5882 -6497 -10491 -5529 8805 15634 8786 -3050 -16513 -9964 4361
14365 4361 2937 -9385 -17690 -17109 -5238 -21573 -34420 -38638 -36866 -21213 -7758 -22134 -21286
14352 -21286 -12968 502 4183 14193 10460 8420 -1353 -18186 -28220 -43114 -28826 -12625 -8994
14339 -8994 -797 8668 20247 19736 8567 -7962 -31941 -22663 -1437 23857 30172 16322 -460
14326 -460 -13847 -892 -4140 -11672 -1383 8633 19225 18453 6659 -7776 -10399 -10833 -18310 -16336
14312 -16336 -24684 -27132 -21028 -17596 -29905 -46601 -48506 -38541 -19985 -11885 -15152 -17007 -14199 -15777
14298 -15777 1120 12364 7082 9417 3563 9449 2632 -10232 -30514 -31568 -27379 -17141 -10043
14285a0043J240n76l076q333N71J70O681P34J683j298J9084J5853L204j7876m568
14270C450L203p642m950n054j3229m475J4961L149j914O115r846k431P793J81
14256a0689L668k526j0003j007R61K028J2448Q589j2603M812j1137j6915q91Q072
14242b5193J0369J475M942J6612j1362o758k516J3579j1265j1649N878K250J2240
14229a398L769N70l431j262M481j955q547j2202n312J1003J056j316L278K364
14215h902o24N279p656k071K861q193Q862P846m987k865J3522O435P49K405o097
14200F564j1147Q701m063j4337J109r65k072l171J4631J3921m837m078K541l710
14186i13l874j3030L215R338k822M323N405k0189o111J3607j256K966J356M536
$$ plain form
14285 -10043 -8803 -9379 -12455 -20788 -20217 -20047 -13366 -12632 -10949 -12247 6837 22690 25894 8018 3450
14270 3450 6653 -989 -5939 -10993 -24222 -28697 -13736 -10587 -12501 -6386 -16232 -18663 -10870 -10689
14256 -10689 -7021 -9547 -19550 -20557 -19596 -17568 -5120 3469 -9134 -4322 -15459 -32374 -33265 -25193
14242 -25193 -14824 -13349 -8407 8205 -3157 -9915 -12431 1148 -10117 -21766 -15888 -13638 -1398
14229 -1398 2371 2941 -490 -1752 2729 774 -7773 -19975 -25287 -14284 -13228 -14544 -11266 -8902
14215 -8902 -9526 -4247 -11903 -13974 -11113 -19306 -10444 -2598 -7585 -10450 3072 9507 10256 12661 6564
14200 6564 -4583 4118 55 -14282 -13173 -14138 -16210 -19381 -4750 9171 4334 256 2797 -913
14186 -913 -4787 -17817 -14602 -5264 -8086 -3763 1642 -18547 -24658 -11051 -12307 -9341 -7985 -3449
14172c449p587M984L071m03L989O85j2015M190J808l437q468P29R636j481j6183
14157b3931N635L195q513J049N516K2991o106j3913J0402K361P306R95j2421M070
14143a364k231j455O98J097q317j709M030J8500L887j1910l237K436L124j026
14129B523j0038L031L766l341j7724L31J6259J9054o099n411j0607j3182L68J9936
14115a134N957K977J5758P038K86j3331j8904j2438j323J2418l620k3339o488
14102c6143R896k744J1690J1619K235p157J686M928R92K345j155J510J8596N43
14088A8841r139j2190P916j676j319R420k217m621K008O632J6029l373j3651j3835
14074a175r003K869l098M086J0399Q791L330q838j1937j6631j0671Q3R405Q636
$$ plain form
14172 -3449 -11036 -6052 -2981 -3384 605 1290 -10725 -6535 -4727 -8164 -16632 -15903 -6267 -7748 -23931
14157 -23931 -18296 -15101 -23614 -22565 -17049 5942 -164 -14077 -3675 -1314 5992 6987 -5434 -1364
14143 -1364 -3595 -5050 -4352 -3255 -11572 -13281 -9251 9249 13136 1226 -2011 425 3549 2523
14129 2523 -7515 -4484 -718 -4059 -21783 -21452 -5193 13861 7762 2351 -8256 -21438 -21070 -1134
14115 -1134 4823 7800 23558 30596 30882 17551 -1353 -13791 -15114 -2696 -6316 -29655 -36143
14102 -36143 -26247 -28991 -17301 -5682 -3447 -10604 -8918 -3990 -2998 -653 -1808 -298 18298 18841
14088 18841 9702 -2488 5428 3752 2433 11853 9636 5015 7023 13655 29684 26311 12660 -1175
14074 -1175 -10178 -7309 -10407 -6321 4078 12869 16199 7361 -4576 -21207 -31878 -31795 -22390 -13754
14060a3754J327K129R282j2961M686j110o838o893P529K2108J5097n525k243m875
14046G959J250j2893J1040N632o351p1q688K643J3358O602P77j4478j6581j1911
14032b1712M094J1495q052j1596P550J079J628J778O086J4868J9248l045r378
14019A4043o034P21l61m140l591R098n200j4494K308M451p897j2147k739J3635
14005a2347J4121r531o947J979r150j212J9284K892P838n772j6295P284R160j847
13991e43R352P0j1895k730m303O533L467J1089J1016j4295o679R950O261L329
13977B0622j3764n982J251N889J1375n196j4203n509P383m522n606n383q8m847
13963a8580q647J0876p197N481M142J1412n009J458q035M409M905l100Q37J3394
$$ plain form
14060 -13754 -12427 -10298 -1016 -13977 -9291 -10401 -17239 -24132 -16603 5505 20602 15077 12834 7959
14046 7959 9209 -3684 7356 12988 6637 6566 -2122 521 13879 20481 21258 6780 -9801 -21712
14032 -21712 -17618 -6123 -14175 -25771 -18221 -17142 -15514 -13736 -7650 7218 26466 23421 14043
14019 14043 8009 8730 8369 4229 638 9736 4536 -9958 -7650 -3199 -11096 -23243 -25982 -12347
14005 -12347 1774 -7757 -14704 -12725 -21875 -23087 -3803 -911 6927 1155 -15140 -7856 1304 -543
13991 -543 8809 8879 -3016 -5746 -10049 -3516 -49 11040 22056 7761 1082 11032 17293 20622
13977 20622 6858 876 2127 8016 19391 14195 -8 -5517 1866 -2656 -8262 -13645 -13733 -18580
13963 -18580 -27227 -16351 -23548 -18067 -13925 -2513 -7522 -6064 -14099 -9690 -4785 -7885 -7048 6346
13949F346J0520L747j0338j2846j5255j0319L82N641O362J1403j178l501k894
13936a1930J0229j651j500l635J948L597m38l94Q593j3439j0098k946K443J0251
13922h970O302J320n832Q81J0869J0658K361k675j8130K760P312m921J681j24
13908C492r606M299m73L024m389l522m911M77J543k161J047M656K0263j32j0804
13893B803q142j5604M638J4175J0056J7306Q721n811r287o671p172j2190P68j4455
13879b0865j2312J7687P070m035j570P3j85J4791k358j0669q517j1338K352J5527
13865a4349M928P837L450J0645P77j0633j1828j7203J0998P728Q085O110J1342
13852A7887l4J257K086n188j6991o538k652O079J0226P234N993O568r224L704
$$ plain form
13949 6346 16866 20613 10275 -2571 -17826 -28145 -27763 -22122 -15760 -4357 -5535 -9036 -11930
13936 -11930 -1701 -3352 -4852 -8487 -6539 -2942 -3380 -3774 4819 -8620 -18718 -21664 -19221 -8970
13922 -8970 -2668 -1348 -7180 -6299 4570 15228 17589 14914 -3216 -456 6856 1935 3616 3492
13908 3492 -6114 -1815 -2288 736 -3653 -7175 -12086 -11609 -10066 -12227 -11180 -6524 13739 13607 2803
13893 2803 -5339 -20943 -16305 -2130 7926 25232 33953 28142 18855 12184 5012 -7178 -6410 -20865
13879 -20865 -33177 -15490 -8420 -12455 -14025 -13952 -14137 654 -1704 -12373 -20890 -32228 -29876 -14349
13865 -14349 -9421 -1584 1866 12511 13288 2655 -9173 -26376 -15378 -7650 435 6545 17887
13852 17887 17853 19110 21196 16008 -983 -7521 -10173 -4094 6132 13366 19359 25927 16703 20407
13838B0407q191j9329K235l848J395o899J0628Q543Q064M260j1177k800J1372
13825A4660N533o795j1680n664q635l405l838M725O336P530M968J390p02l904
13811E19M523m185K345P605j0497J962K463Q384n335m987o888j3592P255O598
13797c830M683M898J2431n823j2502K93K611j308q062m474J340K879O075J0969
13783A0180p320j424J845l613k611r099Q063R475q883m892J380q084N506M624
13769d853P477K305p429l835N292J3902L873k029O812j5433j0535l457j5188q035
13755c1133R385N377J4919J4515L488j7163j6042R848J7225J453m771O503L144
13742A6748k2471J459o9p725m24K094R655N482m425p593n367q123L419R518N405
$$ plain form
13838 20407 12216 -7113 -4878 -8726 -7331 -14230 -3602 4941 13005 17265 6088 3288 14660
13825 14660 20193 13398 1718 -3946 -12581 -15986 -19824 -15099 -8763 -1233 3735 5125 4423 519
13811 519 5042 857 3202 10807 310 2272 4735 13119 7784 2797 -4091 -17683 -10428 -3830
13797 -3830 853 5751 18182 12359 -143 150 2761 1453 -6609 -11083 -9743 -6864 -789 10180
13783 10180 2860 1436 3281 -332 -2943 -12042 -3979 5496 -3387 -8279 -6899 -14983 -9477 -4853
13769 -4853 2624 4929 -2500 -6335 -1043 12859 16732 14703 21515 6082 -4453 -7910 -23098 -31133
13755 -31133 -21748 -16371 -1452 13063 16551 -612 -16654 -6806 10419 11872 7101 13604 16748
13742 16748 -5723 -4264 -4333 -12058 -12482 -10388 -733 4749 324 -7269 -12636 -20759 -17340 -7822 -2417
13727b417K581m33J7355m33j6529n31j4742k346k029J3271Q265k113k512j5618
13713a8231r878L123Q862K473l582o866k518R826L557O789M389L508J0630R629
13699B1711O772q498j4434q680N215N617o945l92M746J4803K63q227K245M705
13685A8901L784n505j1281j4082r273l147J7441J8332o075l462R152R808J3769
13672C8362r81k1458j8816n070L658l090j571R113J358Q682R457R678P474q953
13658B7843j4842j1678o49m682l026j855r321J4467M403l478j4370M47J041M450
13644a1250N351O876Q66j6850j5005M005P531J4463J7795k011m71o261j0284j3
13630e258n948L902Q672N917j8768j4263J6256l610J898L2075R953r910n508p957
$$ plain form
13727 -2417 164 -269 17086 16653 124 -407 -15149 -17495 -19524 -6253 2012 -101 -2613 -18231
13713 -18231 -28109 -24986 -16124 -13651 -17233 -24099 -26617 -16791 -13234 -6445 -2056 1452 12082 21711
13699 21711 28483 19985 5551 -3129 2086 7703 758 366 5112 19915 20178 11951 14196 18901
13685 18901 22685 17180 5899 -8183 -17456 -20603 -3162 15170 9095 5633 14785 24593 38362
13672 38362 37381 15923 -2893 -7963 -4305 -7395 -8966 147 1505 10187 19644 29322 36796 27843
13658 27843 13001 1323 674 -4008 -7034 -8889 -18210 -3743 660 -2818 -17188 -16741 -15700 -11250
13644 -11250 -5899 977 1843 -15007 -30012 -26007 -18476 -4013 13782 11771 11300 5039 -5245 -5258
13630 -5258 -11206 -7304 1368 7285 -11483 -25746 -9490 -13100 -11202 20873 30826 20916 15408 7451
13616G451J137M363N22j1574L360l456J3708K729m620p660m543l38j2311R88J465
13601h779K4067P776q766J43K118o272l891K95j554k7j5358Q278J796K560J120
13586C506l028l529j912J063l216j438J188L802m919m982J280N211J4552J0342
13572A7920q83j1514j5452j0224o471J7000J7553K371j274n150K436P290O47j506
13558A2743M82M114J388k084p197q491J0257J0079p346j0899j1896O158L539P248
13544H095J5457k048j4764K887n650m292n642J807J652l016j180Q814J5590j0335
13530G375j6462Q901J2810J755R38r191L942O739J224j596j1765l82q414L90J1785
13515H049O972J65K10P944O117n191j6852q822j1881M988O871n162p404q529J8093
$$ plain form
13616 7451 8588 12951 13473 1899 5259 1803 15511 18240 13620 5960 1417 1079 -11232 -10244 -8779
13601 -8779 15288 23064 14298 14441 16559 10287 6396 6691 5137 5110 -10248 -1970 -174 2386 3506
13586 3506 478 -3051 -4963 -3900 -7116 -8554 -7366 -3564 -8483 -13465 -12185 -6974 7578 17920
13572 17920 17037 5523 -9929 -20153 -26624 -9624 7929 10300 9026 3876 6312 13602 14249 12743
13558 12743 13225 17339 18727 16643 9446 955 11212 21291 13945 3046 -8850 -2692 847 8095
13544 8095 23552 21504 6740 9627 3977 -315 -5957 -4150 -2498 -5514 -6694 2120 17710 7375
13530 7375 -9087 -186 12624 14379 15317 6126 10068 16807 18031 16435 4670 4288 -4126 -3736 8049
13515 8049 15021 15186 15396 23340 29457 24266 7414 -1408 -13289 -8301 -1430 -6592 -13996 -22525 -4432
13500d432K830J3573L264p510k0479j5457j6806K327K3962K6846j4226l994K379
13487g723n889j75j062l827P489J250P31j015j4582o790L665Q269R73p467J730
13472b4423L176n832Q95J9856J2953j485N996j2271j319P989Mr0J7877l140j5486
13457D700j1690O646J2051j4133q352m40j616j5l07M37k669N29j4382Q970J6360
13442c911K956l049J0449m284p449Q535P055l776K092j0380K890o256N926J1796
13428A2594p687p609p059p190m26k265K010L33J0909J0942q315k6331R250L749
13414a7095K827N699R24j3369J472L543J0933R112r628l956J345J1756O089p983
13400A669m962n366R591m746j000J0503j667j7452j9142l06J4953R416o646j912
$$ plain form
13500 -4432 -1602 11971 15235 7725 -12754 -28211 -45017 -42690 -18728 8118 -6108 -10102 -7723
13487 -7723 -13612 -13787 -14849 -18676 -11187 -9937 -9206 -10221 -24803 -31593 -27928 -19659 -18686 -26153 -24423
13472 -24423 -21247 -27079 -26184 -6328 6625 5140 11136 -1135 -2454 5535 5539 5449 23326 20186 4700
13457 4700 -6990 -344 11707 -2426 -10778 -11218 -12834 -12849 -13156 -12719 -15388 -14859 -29241 -20271 -3911
13442 -3911 -955 -4004 6445 2161 -5288 3247 10302 6526 8618 -1762 1128 -5128 798 12594
13428 12594 4907 -2702 -9761 -16951 -17377 -19642 -17632 -17299 -6390 4552 -3763 -30094 -20844 -17095
13414 -17095 -14268 -8569 -7645 -21014 -19542 -15999 -5066 4046 -5582 -9538 -8193 3563 9652 1669
13400 1669 -3293 -8659 932 -3814 -4814 5689 4022 -13430 -32572 -32878 -17925 -8509 -15155 -17067
13386a7067Q510R68j3803M331p86N964K006J5344J445j1481N345K843j3872n733
13372a5986j3867k187J374J7947k118k123n648J0015J1840P433p738p679J1203
13359B466m695P934m062j3335o2O24R410k122l08l592J385J9096o256j4549l147
13344a1213M046M03J0086r20q197P230Q82J684J757j1010J102M14j2268o565J0712
13329a1857N080N587O635M418J634l437O503L888K84j5961j2698J1376J1780K845
13315A6077J142O258r106j0780j0258j433J2585j115r958r320j6479N051J5839
13302a1497r100k101K148Q44O429L945m559k822K0649N201o213q586j2375J112
13288a6925O152j1125L074J0468J3168L744p666N291j3088j030K521r330k412
$$ plain form
13386 -17067 -8557 -7589 -21392 -17061 -17847 -11883 -9877 5467 6912 -4569 776 3619 -10253 -15986
13372 -15986 -29853 -32040 -30666 -12719 -14837 -16960 -22608 -12593 -753 6680 -1058 -8737 2466
13359 2466 -2229 5705 1643 -11692 -11754 -11130 -1720 -3842 -4150 -7742 -6357 12739 6483 -8066 -11213
13344 -11213 -7167 -6764 3322 2402 -5795 1435 2317 4001 5758 -5252 -4150 -3736 -16004 -22569 -11857
13329 -11857 -6777 -1190 5445 9863 11497 8060 14563 18451 18735 2774 -9924 1452 13232 16077
13315 16077 17219 23477 14371 3591 -6667 -8100 4485 3370 -6588 -15908 -32387 -27336 -11497
13302 -11497 -20597 -22698 -20550 -19706 -13277 -9332 -13891 -16713 3936 9137 2924 -5662 -18037 -16925
13288 -16925 -10773 -21898 -18824 -8356 4812 8556 890 6181 -6907 -7937 -5416 -14746 -17158
13275a7158O218P14J638J5694q041j1980K243K666o155K212M587N777J2433l614
13261G234p548K975j397q126J271m582r274L73K170k28M861m977K703J69J323
13246a3053J2921j0386l90J0044k761j336L75L02k155l975K155j2458q446P716
13232b1447J1856L805n05K209N185M971J1079o862p093k843j5638j414N780P347
13218c570M181N283m374O148J2330M888k319k710m065j2731M008J1933j4027o470
13204a495L955P74m765o053K164p310P596j768J757L904K130K280l67K134q053
13189c117k0678j868J1332M053O951o851r406O466j568J175Q805L85r75k085j357
13174h738j843j940p501J4402N921Q958l51j5957l327K319J507j0245K43J3755
$$ plain form
13275 -17158 -10940 -10226 -8588 7106 -935 -12915 -10672 -8006 -14161 -11949 -7362 -1585 10848 7234
13261 7234 -314 2661 1264 -6862 -5591 -10173 -19447 -19074 -16904 -17132 -12271 -17248 -14545 -14376 -13053
13246 -13053 -132 -10518 -10908 -864 -3625 -4961 -4586 -4284 -6439 -10414 -8259 -20717 -29163 -21447
13232 -21447 -9591 -5786 -6291 -4082 1103 6074 17153 10291 3198 355 -15283 -16697 -10917 -3570
13218 -3570 611 5894 1520 7668 19998 24886 22567 19857 15792 3061 7069 19002 4975 -1495
13204 -1495 2460 3234 -1531 -7584 -5420 -12730 -5134 -6902 -5145 -1241 889 3169 2802 4936 -3117
13189 -3117 -23795 -25663 -14331 -10278 -3327 -10178 -19584 -13118 -14686 -13511 -4706 -4321 -5296 -7381 -8738
13174 -8738 -10581 -12521 -20022 -5620 301 9259 8908 -7049 -10376 -8057 -6550 -16795 -16552 -2797
13160b797m159p341l663j058K960Q496n07l171O951O368K36R724m796K86J2938
13145B0467n221j2251L057J1898o752j2716o595p920j2648M28j053J1462O06J798
13131a5440N265j584M302n857o70R49K191Q93l033M368J716J0361J0249Q541m261
13116A7990j2290n480l490O189J773Q83k57k05o04o309J640N128j9953j6872p161
13101c9018P299K0001J4062L831j5791L434P222j4960k737p227O194J3945M000
13088B55J1330m395j8444j0545P973J3174Q259N132l621j038J2138n632r673j668
13074C245m46k106M611N136o587L95K569l746J0669J1927l04j0280J237o583J43
13059I880l82l470K613J5330k236j3835k673P324L761n061j8640r371N104O336
$$ plain form
13160 -2797 -6956 -14297 -17960 -19018 -16058 -7562 -8069 -11240 -4289 2079 2315 12039 7243 7529 20467
13145 20467 15246 2995 6052 17950 11198 -1518 -8113 -16033 -28681 -28253 -29306 -17844 -17238 -15440
13131 -15440 -10175 -11759 -7457 -13314 -13984 -13035 -10844 -9951 -12984 -8616 -6900 3461 13710 22251 17990
13116 17990 5700 220 -3270 2919 4692 5575 5318 5113 4509 -1800 -160 4968 -14985 -31857 -39018
13101 -39018 -31719 -11718 2344 6175 -9616 -6182 1040 -13920 -16657 -23884 -17690 -3745 255
13088 255 11585 7190 -11254 -21799 -13826 -652 7607 12739 9118 8080 20218 14586 4913 3245
13074 3245 2799 693 5304 10440 3853 4248 6817 3071 13740 25667 25363 15083 16320 9737 9880
13059 9880 9498 6028 8641 23971 21735 7900 5227 12551 16312 11251 -7389 -16760 -11656 -5320
13045e320M005M228J652J0093m368p311J525k943N537J7443N071m809l710L728
13031B4821n180j4968Q942j173o358j702L152j352o935n650r814r97J3455L321
13017d38j7921N1N697J1282j499N365Q281k524j5745K742L077j0401K369M639
13003e025K209N08k299O061J707l303m344k184o890j5965p173J690L985J0154
12989b0869J785J8320k315M625o673P214P509M420j0632o313M585J723p87K526
12975E118K805k931R102l734o449o03J45p482J1707j6303n499l491J3208R564
12961E157m094j2479J4763j663q957j0659L150J8777J3072n557k5852k012J4765
12948a589R855j420j2552p036L996J5889p62j3831n739r248l681N148O871J0476
$$ plain form
13045 -5320 -1315 2913 4565 14658 10290 2979 4504 1561 7098 24541 29612 24803 21093 24821
13031 24821 19641 4673 13615 12442 6084 4382 7534 6182 -753 -6403 -16217 -17214 -3759 -438
13017 -438 -18359 -18308 -12611 -1329 -2828 2537 10818 8294 -7451 -4709 -1632 -12033 -9664 -5025
13003 -5025 -2816 -2308 -4607 1454 3161 -142 -4486 -6670 -13560 -29525 -36698 -35008 -31023 -20869
12989 -20869 -19084 -764 -3079 1546 -5127 2087 9596 14016 3384 -2929 1656 3379 2592 5118
12975 5118 7923 4992 14094 10360 3911 3308 3453 -4029 7678 -8625 -14124 -17615 -4407 5157
12961 5157 1063 -11416 3347 1684 -7273 -17932 -14782 3995 17067 11510 -14342 -16354 -1589
12948 -1589 8266 6846 -5706 -12742 -8746 7143 6381 -7450 -13189 -22437 -26118 -20970 -14099 -3623
12934c623k426k773R5J3820P083P039M994j2617L405J531j638Q341j898N54N615
12919B7502j2004l546Q090K535n39j2522j418J3525l2j6651m310J077m792K494
12905e91n75j2463N453M306j217K336n670J1732o546j978n487M56j78m525o618
12890b1565K091N156o035M241O856M960N662o405R664J519M453m032j5281p667
12876a6383K074J6811O139O291o116j1938m455j307L829r011Q140R953r512n315
12862a0800K136J5238R539J2948N655j4235l0124k301J0489j041m812L675l06
12849c939N477N07k099n621j850j1884q939Q017K465Q602J5794P329M407P968
12835B6234l641o573N19n40o657j2203m806P267P791n087p015J516M54o805M060
$$ plain form
12934 -3623 -6049 -8822 -8727 5093 12176 19215 24209 11592 14997 16528 14890 23231 21333 21887 27502
12919 27502 15498 11952 20042 22577 22038 9516 8098 21623 21591 4940 630 1707 -3085 -591
12905 -591 -1166 -13629 -8176 -3870 -5087 -2751 -8421 3311 -3235 -5213 -10700 -10244 -10422 -14947 -21565
12890 -21565 -19474 -14318 -20353 -16112 -9256 -4296 1366 -5039 4625 6144 10597 6565 -8716 -16383
12876 -16383 -14309 2502 8641 14932 8816 -3122 -7577 -8884 -5055 -14066 -5926 4027 -5485 -10800
12862 -10800 -8664 6574 16113 29061 34716 20481 -9643 -11944 -1455 -2496 -7308 -3633 -3939
12849 -3939 1538 2045 -54 -5675 -7525 -19409 -28348 -20331 -17866 -9264 6530 13859 18266 26234
12835 26234 22593 16020 16539 15999 9342 -2861 -7667 -400 7391 2304 -4711 -3195 -2741 -9546 -5486
12820e486N325r751q260P577R440j582P167J4935P442j001J295q739q256k341
12806G765k159J0302k83m024Q652L846j3177p251p843L171J1951J1889k543m422
12792A5874r052j1922j2311M782J4041R503r358k273P064j7818r428J3968J7411
12779A0481J2048l429R27M240n833r480J776qj763N734m171j45L117j0585j5331
12764a2422j5370N455J7641M193M331o38n64P832R52o404j9437J0005J5941M804
12750A6319k4757q950R940J8281N188r340m819K184J571L404m173J7248J394N399
12736B8889k979p388k523j0490m926J2559j3258r984l78J573o45O926j567j2961
12722a7152j3562N331K5483M695P068j795q333L131N430j0789j3258k279l367
$$ plain form
12820 -5486 -161 -9912 -18172 -10595 -1155 -2737 4430 19365 26807 25806 27101 18362 10106 7765
12806 7765 5606 15908 15625 11601 20253 24099 10922 3671 -4172 -1001 10950 22839 20296 15874
12792 15874 6822 -5100 -17411 -12629 1412 10915 1557 -716 6348 -11470 -20898 -6930 10481
12779 10481 22529 19100 20027 24267 18434 8954 10730 10722 8959 14693 10522 10377 13494 2909 -12422
12764 -12422 -27792 -22337 -4696 -503 3828 3190 2626 10458 11410 5006 -14431 -4426 11515 16319
12750 16319 -8438 -17388 -7448 10833 16021 6681 1862 4046 5617 9021 4848 22096 23490 28889
12736 28889 25910 18522 15999 5509 583 13142 -116 -10100 -10478 -8905 -9550 -2624 -4191 -17152
12722 -17152 -30714 -25383 100 4795 11863 10068 1735 4866 10296 -493 -13751 -16030 -19397
12709a9397Q626L965n104o407K2518P292j134Q167L26q33j0334j4529m571Q333
12695c082N807j380p86M165L831l13p96q967J392P477L028Q859j3181r782N72
12680c156L768j292M878j410m673r907J809N918J0923M24r861j618J1929r35j2732
12665e935k30Q033J8067J4444j8466j0748r080L600j158o053r242n755o467J9511
12651i479J7997L809J334p759l564n00Q894J0606l390o626q049n697r354k756
12637a4534J6394Q569j3165o791J3737k573j4789Q921R719L727n983n72r142M763
12623a719L748M638Q99L586r326l60P807m578j1766p486J585K5639P469P71m638
12608A6269j06p544j2762o991N279O200o863r73O027j009L688J5781J411k326
$$ plain form
12709 -19397 -10771 -6806 -11910 -18317 4201 11493 10359 18526 18852 18019 7685 -6844 -11415 -3082
12695 -3082 2725 1345 559 4724 8555 8242 7446 -1521 -129 7348 10376 19235 6054 -3728 -3156
12680 -3156 612 -680 4198 2788 -1885 -11792 -9983 -4065 6858 7282 -2579 -4197 7732 6797 -5935
12665 -5935 -6165 1868 19935 34379 15913 5165 -3915 -315 -1473 -7526 -16768 -22523 -28990 -9479
12651 -9479 8518 12327 13661 5902 2338 1838 10732 21338 17948 11322 3273 -2424 -11778 -14534
12637 -14534 1860 10429 -2736 -9527 4210 1637 -13152 -4231 5488 9215 3232 2660 -6482 -1719
12623 -1719 2029 6667 7566 11152 1826 1466 9273 4695 -7071 -14557 -12972 12667 20136 20907 16269
12608 16269 16163 8619 -4143 -11134 -5855 345 -6518 -7491 -1464 -2473 1215 16996 18407 16081
12594A6081j1397j0718j073J0938O536n786n339P670q436k13p318jo362O47J9668
12579D897k469P285o815j7217P963n166O660m335M794Q548o553j0774J3895O496
12565G209J656q492o923n746p743k848J8801O603p827K943P539r068o094L470
12551f520J3710L89q709j013R080O403j4484K251j411L896m087K1654K813j9247
12537D725j4273N393j20q461R292Q457J263r973l332o52p895J3188K968q503J5043
12522G120M28J425q214J4389N276p183r970r582J2K56L088L214L804j1149P879
12507G93J955j2211l745J059K228J0587J5677L478j6270j5527N122J2301K097
12494G544o243n396o524j2618K984K955K640r96M035N660j947j0482N952J0530
$$ plain form
12594 16081 4684 -6034 -7107 3831 10367 4581 -758 6912 -1524 -1737 -9055 -9056 -15418 -14771 4897
12579 4897 2428 9713 2898 -14319 -6356 -11522 -4862 -9197 -4403 4145 -2408 -13182 713 7209
12565 7209 8865 373 -6550 -12296 -20039 -22887 -4086 2517 -5310 -2367 5172 -3896 -9990 -6520
12551 -6520 7190 7579 -1130 -2143 6937 13340 -1144 1107 -304 3592 -495 21159 23972 4725
12537 4725 -9548 -4155 -4275 -12736 -3444 5013 6276 -3697 -7029 -7681 -15576 -2388 580 -7923 7120
12522 7120 7548 8973 759 15148 20424 13241 3271 -6311 -6299 -6043 -2955 259 4063 -7086 793
12507 793 2748 -9463 -13208 -12149 -9921 666 16343 19821 3551 -11976 -6854 5447 7544
12494 7544 1301 -4095 -10619 -23237 -20253 -17298 -14658 -15654 -11619 -5959 -7906 -18388 -12436 -1906
12480a906q997r722K412L934N0P381J618j1512K819k473k267M388Q349M476q160
12465i610j7609n413J0369L161J1254L375o665Q209J0376p50j2451j2147M835
12452a3066M703K516n289r316j267R840M569J2799J5586l054r914l00K566K39
12438A0612k042j0979N076M481j2341j0400M014J8216M521J952N05K747p417K885
12424A1830k375j817r937o041m985J53J3851J0311j844j0186l627m167J2379K263
12410E808k0391k813J3798J0887o863k0522n438J0399K945R681L279J231n817
12397c816J580j3565Q723L878n227J2238J4262J4788j3589j5298M09r19k066J631
12383C029J0787Q328j830l467k499q602J688p085j567j743Q3r120J558o90Q54
$$ plain form
12480 -1906 -10903 -20625 -18213 -14279 -14229 -6848 -5230 -16742 -13923 -16396 -18663 -14275 -5926 -1450 -9610
12465 -9610 -27219 -32632 -22263 -19102 -7848 -4473 -11138 -2929 7447 6697 -5754 -17901 -13066
12452 -13066 -8363 -5847 -11136 -20452 -21719 -11879 -7310 5489 21075 18021 8107 7807 10373 10612
12438 10612 8570 -2409 2667 7148 -5193 -15593 -11579 6637 11158 13110 13615 16362 8945 11830
12424 11830 9455 7638 -2299 -8340 -13325 -13172 679 10990 9146 -1040 -4667 -8834 3545 5808
12410 5808 -14583 -17396 -3598 7289 426 -20096 -25534 -15135 -12190 -2509 770 2001 -3816
12397 -3816 -2236 -15801 -7078 -3200 -8427 3811 18073 32861 19272 3974 4383 3464 1398 3029
12383 3029 13816 22144 20314 16847 14348 5746 7434 349 -1218 -2961 -2878 -11998 -10440 -11130 -10276
12368a0276J7429K794j5141r500O249Q882j2140n759J1141j318j051K846N777
12355f7J2629L911K84O376j3112p303J4222J2260j1440q012p839N577J7930O198
12341C1614j0308J0115J477k1019m905O824R48O209j298n851P70j2948N598R294
12327A6520k053j2158k218R4J4199O616k261r734L610N473l298O200n328p812
12313G850J311K830Q320j1681n397o544J635J2538Q703L90j2706j782L541J1675
12299B0683j506P66o075j2285p194R619K306k762L804q499o854J0388R451o728
12285E114m795J587n480j765M238N752P193K929j677j9117r938k653j94J717J5183
12270a906Q941M909l821l517q667N594J6315O422j549n023m149q287l503j980
$$ plain form
12368 -10276 7153 9947 -5194 -14694 -8445 437 -11703 -17462 -6321 -7639 -8690 -5844 -67
12355 -67 12562 16473 16757 23133 10021 2718 16940 29200 17760 9748 1909 7486 25416 31614
12341 31614 21306 31421 32898 11879 6974 13798 14746 20955 19657 13806 14576 1628 7226 16520
12327 16520 14467 2309 91 185 14384 21000 18739 9005 12615 18088 14790 20990 15662 7850
12313 7850 9161 11991 20311 8630 3233 -3311 -1676 10862 19565 19955 7249 5467 9008 20683
12299 20683 19177 19943 13868 1583 -5611 4008 6314 3552 7356 -1143 -7997 2391 11842 5114
12285 5114 319 1906 -3574 -5339 -1101 4651 11844 14773 13096 -6021 -15959 -18612 -18806 -17089 -1906
12270 -1906 7035 11944 8123 4606 -4061 1533 17848 24270 22721 17698 13549 5262 1759 -221
12256b21Q43K786j470j704K29o938L018k765M815j384J2678j790p356L596N195
12241I532R513r477j7832m4O865k458J562P669K067O382L298m809M52q178l803
12226G39L772k488n411O868P559M08j1133K896L335j2039o36K328N078K143j3747
12211a0328L092N66l246l92J2216n935n882P33m89n493R900K2706k545j494N143
12196A8552k575p178L972P91j840P227r637j0614l757J5693J869n022o554o062
12182e135J971O830K076j226K79l515O509k901o007M998J809k76P752r686k407
$$ plain form
12256 -221 622 3408 1938 234 463 -6475 -3457 -6222 -1407 -2791 9887 8097 741 4337 9532
12241 9532 19045 9568 -8264 -8308 -1443 -3901 -2339 5330 7397 13779 17077 12268 12720 4542 739
12226 739 4511 2023 -3388 3480 11039 11447 314 3210 6545 -5494 -6130 -3802 1276 3419 -10328
12211 -10328 -7236 -6670 -9916 -10308 1908 -4027 -9909 -9176 -9665 -15158 -5258 17448 14903 13409 18552
12196 18552 15977 8799 12771 13562 11722 18949 9312 -1302 -5059 10634 12503 7481 927 -5135
12182 -5135 -3164 3666 5742 4516 4795 1280 7789 4888 -1119 3879 5688 5412 13164 3478 1071
$$ [...]
##END NTUPLES=NMR SPECTRUM
##END=
