##TITLE=Analysis number 327597
Compound Code cc 65003
Book Reference 464/124/2
Project Code adrs
Chemist Name chrisr
##JCAMPDX= 6.0         $$ Bruker NMR JCAMP-DX V2.0
##DATA TYPE= NMR SPECTRUM
##DATA CLASS= NTUPLES
##ORIGIN= Bruker BioSpin GmbH
##OWNER= nmr
$$ XWIN-NMR		Version 3.5
$$ Tue Mar 27 15:10:51 2007 GMT Daylight Time (UT+1h)  MAYBRIDGE\nmr@NMR_250MHZ
##.OBSERVE FREQUENCY= 250.131544655141
##.OBSERVE NUCLEUS= ^1H
##.ACQUISITION MODE= SIMULTANEOUS (DQD)
##.ACQUISITION SCHEME= undefined
##.AVERAGES= 16
##.DIGITISER RES= 18
##SPECTROMETER/DATA SYSTEM= dpx250
##.PULSE SEQUENCE= zg30
##.SOLVENT NAME= CDCl3
##.SHIFT REFERENCE= (INTERNAL, CDCl3, 0, 16.4261)
##AUDIT TRAIL= $$ (NUMBER, WHEN, WHO, WHERE, WHAT)
$$ ##TITLE= Audit trail, XWIN-NMR		Version 3.5
$$ ##JCAMPDX= 5.01
$$ ##ORIGIN= Bruker BioSpin GmbH
$$ ##OWNER= nmr
$$ C:\u/data/dgb/nmr/ADRS/2260/pdata/1/auditp.txt
$$ ##AUDIT TRAIL=  $$ (NUMBER, WHEN, WHO, WHERE, WHAT)
(   1,<2007-03-27 15:10:24.46 +100>,<MAYBRIDGE\nmr>,<NMR_250MHZ>,
      <created by zg, POWCHK disabled, PULCHK disabled
       configuration hash MD5:
       49 4B E0 1D 92 C2 6B 37 9F E6 65 BC 52 41 86 1D
       data hash MD5: 64K
       35 4B 2A 2D AA E8 31 FC AF F0 7D F6 91 DC BE 89>)
(   2,<2007-03-27 15:10:41.69 +100>,<MAYBRIDGE\nmr>,<NMR_250MHZ>,
      <Start of raw data processing
       ef LB = 0.3 FT_mod = 6 PKNL = 1 SI = 32K 
       data hash MD5: 32K
       58 88 8F 53 63 6E 33 E9 C5 D3 88 40 1E 1A 3D B8>)
(   3,<2007-03-27 15:10:43.60 +100>,<MAYBRIDGE\nmr>,<NMR_250MHZ>,
      <apk 
       data hash MD5: 32K
       42 61 B6 77 4B 8A 51 D3 8C 08 1C ED 0D D8 CA E2>)
(   4,<2007-03-27 15:10:44.25 +100>,<MAYBRIDGE\nmr>,<NMR_250MHZ>,
      <abs ABSG = 5 
       data hash MD5: 32K
       E9 84 01 60 82 E9 77 AE 1D 3E BC 59 43 C6 06 90>)
$$ ##END=
$$ 
$$ hash MD5
$$ AC 57 9E 77 25 A2 6B C6 22 CB 5A B4 9A 00 05 7E
##$RELAX= 
##$RELAX= 
##$RELAX= 
##$RELAX= 
##$RELAX= 
##$RELAX= 
##$RELAX= 
$$ Bruker specific parameters
$$ --------------------------
##$DU= <C:\u>
##$EXPNO= 2260
##$NAME= <ADRS>
##$PROCNO= 1
##$TYPE= <nmr>
##$USER= <dgb>
##$AMP= (0..31)
100 100 100 100 100 100 100 100 100 100 100 100 100 100 100 100 100 100 
100 100 100 100 100 100 100 100 100 100 100 100 100 100 
##$AQSEQ= 0
##$AQ_mod= 3
##$AUNM= <au_zg>
##$AUTOPOS= <47 >
##$BF1= 250.13
##$BF2= 250.13
##$BF3= 250.13
##$BF4= 250.13
##$BF5= 500.13
##$BF6= 500.13
##$BF7= 500.13
##$BF8= 500.13
##$BYTORDA= 1
##$CFDGTYP= 0
##$CFRGTYP= 5
##$CHEMSTR= <none>
##$CNST= (0..31)
1 1 145 1 1 1 1 1 1 1 1 1 1 1 1 1 1 1 1 1 1 1 1 1 1 1 1 1 1 1 1 1 
##$CPDPRG= <>
##$CPDPRG1= <>
##$CPDPRG2= <>
##$CPDPRG3= <>
##$CPDPRG4= <mlev>
##$CPDPRG5= <mlev>
##$CPDPRG6= <mlev>
##$CPDPRG7= <mlev>
##$CPDPRG8= <mlev>
##$CPDPRGB= <>
##$CPDPRGT= <>
##$D= (0..31)
0 1 0 0 0 0 0 0 0 0.06 0 0 0 0 0 0 0.0002 0 0 0 0 0 0 0 0 0 0 0 0 0 0 
0 
##$DATE= 1175004622
##$DBL= (0..7)
120 120 120 120 120 120 120 120 
##$DBP= (0..7)
150 150 150 150 150 150 150 150 
##$DBP07= 0
##$DBPNAM0= <>
##$DBPNAM1= <>
$$ [...]
##$SUBNAM7= <"">
##$SUBNAM8= <"">
##$SUBNAM9= <"">
##$SW= 20.6930455092707
##$SWIBOX= (0..15)
0 0 3 0 0 0 0 0 0 0 0 0 0 0 0 0 
##$SW_h= 5175.983436853
##$TD= 65536
##$TD0= 1
##$TE= 683.16
##$TE2= 300
##$TE3= 300
##$TEG= 300
##$TL= (0..7)
0 120 120 120 120 120 120 120 
##$TP= (0..7)
150 150 150 150 150 150 150 150 
##$TP07= 0
##$TPNAME0= <>
##$TPNAME1= <>
##$TPNAME2= <>
##$TPNAME3= <>
##$TPNAME4= <>
##$TPNAME5= <>
##$TPNAME6= <>
##$TPNAME7= <>
##$TPOAL= (0..7)
0.5 0.5 0.5 0.5 0.5 0.5 0.5 0.5 
##$TPOFFS= (0..7)
0 0 0 0 0 0 0 0 
##$TUNHIN= 0
##$TUNHOUT= 0
##$TUNXOUT= 0
##$USERA1= <user>
##$USERA2= <user>
##$USERA3= <user>
##$USERA4= <user>
##$USERA5= <user>
##$V9= 5
##$VALIST= <valist>
##$VCLIST= <CCCCCCCCCCCCCCC>
##$VD= 0
##$VDLIST= <DDDDDDDDDDDDDDD>
##$VPLIST= <PPPPPPPPPPPPPPP>
##$VTLIST= <TTTTTTTTTTTTTTT>
##$WBST= 1024
##$WBSW= 4
##$XGAIN= (0..3)
0 0 0 0 
##$XL= 0
##$YL= 0
##$YMAX_a= 309458
##$YMIN_a= -333265
##$ZGOPTNS= <>
##$ZL1= 120
##$ZL2= 120
##$ZL3= 120
##$ZL4= 120
##$ABSF1= 16.42605
##$ABSF2= -4.26712
##$ABSG= 5
##$ABSL= 3
##$ALPHA= 0
##$AQORDER= 0
##$ASSFAC= 0
##$ASSFACI= 0
##$ASSFACX= 0
##$ASSWID= 0
##$AUNMP= <proc_1d>
##$AZFE= 0.1
##$AZFW= 0.1
##$BCFW= 0
##$BC_mod= 0
##$BYTORDP= 0
##$COROFFS= 0
##$CY= 12.5
##$DATMOD= 1
##$DC= 0
##$DFILT= <>
##$DTYPP= 0
##$F1P= 14.0000005364418
##$F2P= -0.99999901652339
##$FCOR= 0.5
##$FTSIZE= 32768
##$FT_mod= 6
##$GAMMA= 0
##$GB= 0
##$INTBC= 1
##$INTSCL= 1
##$ISEN= 128
##$LB= 0.3
##$LEV0= 0
##$LPBIN= 0
##$MAXI= 10000
##$MC2= 0
##$MEAN= 0
##$ME_mod= 0
##$MI= 0
##$NCOEF= 0
##$NC_proc= -3
##$NLEV= 6
##$NOISF1= 0
##$NOISF2= 0
##$NSP= 0
##$NTH_PI= 0
##$NZP= 0
##$OFFSET= 16.42605
##$PC= 1
##$PHC0= 234.907
##$PHC1= 5.081918
##$PH_mod= 1
##$PKNL= yes
##$PPARMOD= 0
##$PSCAL= 4
##$PSIGN= 0
##$REVERSE= no
##$SF= 250.130023998006
##$SI= 32768
##$SIGF1= 0
##$SIGF2= 0
##$SINO= 400
##$SIOLD= 32768
##$SREGLST= <1H.CDCl3>
##$SSB= 0
##$STSI= 32768
##$STSR= 0
##$SW_p= 5175.98343685301
##$SYMM= 0
##$S_DEV= 0
##$TDeff= 65536
##$TDoff= 0
##$TI= <Analysis number 999999
Compound Code 99
Book Reference 9
Project Code 9>
##$TILT= no
##$TM1= 0
##$TM2= 0
##$TOPLEV= 0
##$USERP1= <user>
##$USERP2= <user>
##$USERP3= <user>
##$USERP4= <user>
##$USERP5= <user>
##$WDW= 1
##$XDIM= 32768
##$YMAX_p= 398835105
##$YMIN_p= -191465
$$ End of Bruker specific parameters
$$ ---------------------------------
##NTUPLES= NMR SPECTRUM
##VAR_NAME=  FREQUENCY,     SPECTRUM/REAL,   SPECTRUM/IMAG
##SYMBOL=    X,             R,               I
##VAR_TYPE=  INDEPENDENT,   DEPENDENT,       DEPENDENT
##VAR_FORM=  AFFN,          ASDF,            ASDF
##VAR_DIM=   32768,         32768,           32768
##UNITS=     HZ,            ARBITRARY UNITS, ARBITRARY UNITS
##FACTOR=    0.157963299565203, 1,           1
##FIRST=     4108.64832725596, 0,            0
##LAST=      -1067.33510959705, 0,           0
##MIN=       -1067.33510959705, -191465,     0
##MAX=       4108.64832725596, 398835105,    0
$$ Real data points
##PAGE= N=1
##DATA TABLE= (X++(R..R)), XYDATA
$$ [...]
16567B9452N891k2216j2878L2267l6386l9175j406M936j4846K204L9945L5897
$$ 29452 35343 13127 249 32516 -3870 -43045 -44451 -39515 -54361 -52157 -12212 23685
16555B3685k2202l5829j0596K7827M266l5543J0893j3394j2269P947K0269R258
$$ 23685 1483 -34346 -44942 -17115 -12849 -48392 -37499 -50893 -63162 -55215 -34946 -25688
16543b5688n304p3139l3506P5651N6147j9240n567M7224q415p501p986r255J6656
$$ -25688 -30992 -104131 -137637 -61986 -5839 -25079 -30646 16578 8163 662 -7324 -16579 77
16530G7K3301N744q4391n1415M0355j9800k0004L3743N1989J9436j5195j3112
$$ 77 23378 29122 -55269 -106684 -66329 -86129 -106133 -72390 -20401 -965 -16160 -29272
16518b9272J2248J4092L7125n186o963j4319K6230J793n1671J8772J7236k0361
$$ -29272 -17024 -2932 34193 29007 22044 7725 33955 35748 -15923 2849 20085 -276
16506b76o007j7160l3904j5426R412m721K7694L7243J0860J7051o3449m4901M5200
$$ -276 -6283 -23443 -57347 -72773 -63361 -68082 -40388 -3145 7715 24766 -38683 -83584 -38384
16493c8384J4078O323n984K5461J5521R750l601L9868q16k4922m9973j5275J9364
$$ -38384 -24306 -17983 -23967 1494 17015 26765 23164 63032 62216 37294 -12679 -27954 -8590
16480h590k415m2106k3334L1020j8491J7996J3887J7210k238J97P482l336p5333
$$ -8590 -11005 -53111 -76445 -45425 -63916 -45920 -32033 -14823 -17061 -16864 -9382 -12718 -88051
16467h8051m7146J6910k16L4872N9876N695N5261J5978n7747m3441k2313N5439
$$ -88051 -135197 -118287 -118503 -83631 -23755 -18060 37201 53179 -4568 -48009 -70322 -14883
16455a4883l894j1887J8346K1435k2656m4727q818L6053L7234o807L2332n6397
$$ -14883 -18777 -30664 -12318 9117 -13539 -58266 -67084 -31031 6203 -604 31728 -24669
16443b4669J8047M805l1117k8901n3887J1593L0265K2022K1496J2265l8236m3444
$$ -24669 -6622 -1817 -32934 -61835 -115722 -104129 -73864 -51842 -30346 -18081 -56317 -99761
16431i9761J8390P2608K7064M3934l7909p8848j4490J9846K0846P2976P7322N168
$$ -99761 -81371 -8763 18301 62235 24326 -54522 -69012 -49166 -28320 44656 121978 127146
16419A27146k3095L882J9916p8118l9117J1663J7524n8723k6003J8946K334J2961
$$ 127146 104051 107933 127849 49731 10614 22277 39801 -18922 -44925 -25979 -23645 -10684
16407a0684L2670m4328m3711J8885N6788k4088l3942O341J4085J7663J6127k4387
$$ -10684 21986 -22342 -66053 -47168 9620 -14468 -48410 -42069 -27984 -10321 5806 -18581
16395a8581l4704j785L6331l430q803l6009p437O1544P7508l294j7468l6881l2639
$$ -18581 -53285 -55070 -18739 -22169 -30972 -66981 -74418 -12874 64634 61340 43872 6991 -25648
16382b5648o94K736K653k1914j5316j7070L161M4687M9008O2491o7457j6114K8663
$$ -25648 -26342 -23606 -20953 -42867 -58183 -75253 -72092 -27405 21603 84094 16637 523 29186
16369B9186O462j917J8904j7167j4283l4797P701K106J1890K208K7126N3147J7916
$$ 29186 35648 33731 52635 35468 21185 -13612 -5911 -3805 8085 10293 37419 90566 108482
16356A08482l7252m2172k0350l629j2032k4330n744j3229N1372l251k6887n0406
$$ 108482 71230 29058 8708 5079 -6953 -31283 -37027 -50256 1116 -2135 -29022 -79428
16344g9428k2598n96L9062M7342K682l1765k3936k2268J0612o93J2240L3133J1192
$$ -79428 -102026 -102622 -63560 -16218 -13536 -45301 -69237 -91505 -80893 -81586 -69346 -36213 -25021
16331b5021j7103J7524m9214o1341N876K9518M6284L2143J2818k7163l8686J5900
$$ -25021 -42124 -24600 -73814 -135155 -129279 -99761 -53477 -21334 -8516 -35679 -74365 -58465
16319e8465K4101O127k1917L940q924L9939K5979k0175K1912J2685j509m8693
$$ -58465 -34364 -28237 -50154 -46214 -55138 -15199 10780 -9395 12517 25202 23693 -25000
16307b5000m8617o4292K6984P6544L7483P010Q574J3236j5849r834M1846j2267
$$ -25000 -73617 -137909 -110925 -34381 3102 10112 18686 31922 16073 6239 48085 35818
16295C5818m4224O698N768J9202j574k6716J4083K6437j1957k1766l669J951k8989
$$ 35818 -8406 -1708 4060 23262 21688 -5028 9055 35492 23535 1769 -1900 51 -28938
16282b8938p461M1362j8055k3400J7766q330L3337j8882K3725K4833m247O9375
$$ -28938 -36399 4963 -13092 -36492 -18726 -27056 6281 -12601 11124 35957 31710 101085
16270A01085J1570l4053k4202n0941n4717K4917L7455Q820j6776J6188P315l1608
$$ 101085 112655 78602 54400 3459 -51258 -26341 11114 19934 3158 19346 26661 -4947
16258d947j824R187J3781j2908N0286P6365q164j4215j655j2130k042N588L3523
$$ -4947 -6771 2416 16197 3289 53575 129940 121776 107561 105906 93776 91734 97322 130845
16245A30845n2557l3147k8451J7618N223P913k2343m4257m1454L1670N5125l6070
$$ 130845 78288 45141 16690 34308 39531 47444 25101 -19156 -60610 -28940 26185 -9885
16233i885J1933k0023K0392l5718n7967M4698K3653J182K4852k446m884P1482
$$ -9885 2048 -17975 2417 -33301 -91268 -46570 -22917 -21735 3117 671 -4213 67269
16221F7269M5473J3732q0423o5501k1966M5925P1146J0639m4746l6518r051k918
$$ 67269 112742 126474 46051 -19450 -41416 4509 75655 86294 41548 5030 -4021 -6939
16209f939l4657j7302L7686J0236j2854o2768R418K0860M5138M1845m0353K4739
$$ -6939 -41596 -58898 -21212 -10976 -23830 -86598 -77180 -56320 -11182 30663 -9690 15049
16197A5049M0615n6416m5434J4800j8451J4405K1317O1612L1515l6177n9346j5246
$$ 15049 55664 -752 -46186 -31386 -49837 -35432 -14115 47497 79012 42835 -16511 -31757
16185c1757P831K5422Q107q078k815M696L4212K1347k9158o8189k4000M7107K2326
$$ -31757 -23926 1496 9603 1525 -1290 3406 37618 58965 29807 -38382 -62382 -15275 7051
16172G051J6783n4697p9588K4946P5550P949j4654J5152r142m0662k6145m4974
$$ 7051 23834 -30863 -110451 -85505 -9955 -2006 -16660 -1508 -10650 -51312 -77457 -122431
16160a22431K6649M2568j7710k210M5337L8759k6186m4535k6141K0859L5453l429
$$ -122431 -95782 -53214 -70924 -73134 -27797 10962 -15224 -59759 -85900 -65041 -29588 -33017
16148c3017L6015L4657J1454n91j02201o2149L4440Q0904K4912J0858j9468j0781
$$ -33017 2998 37655 49109 48518 -53683 -115832 -81392 -488 24424 35282 15814 5033
16136E033L1181K5158k5058r59k5910J3605M1650O9458M2393o6316m4324l7562
$$ 5033 36214 61372 36314 35355 9445 23050 64700 134158 176551 110235 65911 28349
16124B8349m4055j5527q359K4914n577M257M0982j9405j0067j4899l5467M3726
$$ 28349 -15706 -31233 -39592 -14678 -20255 -15998 24984 5579 -4488 -19387 -54854 -11128
16112a1128O914n0901J6377j5146j7220P1909l3700m2473J3960K3059K0756N0180
$$ -11128 -4214 -55115 -38738 -53884 -71104 805 -32895 -75368 -61408 -38349 -17593 32587
16100C2587j3667p7304K87O0464L4442j11m0654j4612K8382j4326j6646L23j3449
$$ 32587 18920 -58384 -58097 2367 36809 36698 -3956 -18568 9814 -4512 -21158 -20835 -34284
16087c4284l3418O0528J7918l5522j6573J8449J4049k6919m1336j2042O7546k927
$$ -34284 -67702 -7174 10744 -24778 -41351 -22902 -8853 -35772 -77108 -89150 -21604 -24531
16075b4531l875K112K9113J2790o73m6946k4473J1443K3320r282K2882L4493j224
$$ -24531 -28406 -26294 2819 15609 14936 -32010 -56483 -45040 -21720 -31002 -8120 26373 25149
16062B5149Q538L1665l7570k5264J4322k6428k5505J9034K1351J3673K0998k9706
$$ 25149 33687 65352 27782 2518 16840 -9588 -35093 -16059 5292 18965 39963 10257
16050A0257n8812l8725O4280N7920j1361O162L6979m5060j190P138J8314l7895
$$ 10257 -48555 -87280 -23000 34920 23559 29721 66700 21640 20450 27588 45902 8007
16038H007k5857m909k2791k5229L3415R8790M7330n9061n9179K7850L2386k5272
$$ 8007 -17850 -22759 -45550 -70779 -37364 61426 108756 49695 -9484 18366 50752 25480
16026B5480K484M2481p9978m3924L0771J5249j8027l7366P332N1826J1313l1358
$$ 25480 27964 70445 -9533 -53457 -22686 -7437 -25464 -62830 -55498 -3672 7641 -23717
16014b3717m690k327M3021J3268k2933K7561J8327m4380j1733M2386J6909J2232
$$ -23717 -28407 -30734 12287 25555 2622 30183 48510 4130 -7603 34783 51692 63924
16002F3924L6669Q998j0700l8485p0453m6325J8366L0260K4154l7037P4511M5845
$$ 63924 100593 109591 98891 60406 -10047 -56372 -38006 -7746 16408 -20629 53882 99727
15990I9727l8279n171P130n8667j3559R561n553j6820k8212O302N2997K2219j7257
$$ 99727 61448 56277 63407 4740 -8819 742 -4811 -21631 -49843 -43541 9456 31675 14418
15977A4418n862K2021k4067m98K9983J7766Q523j1934m1236n462J0062M0284K659
$$ 14418 8556 30577 6510 6012 35995 53761 62284 50350 9114 3652 13714 53998 56657
15964E6657J3103j2337k9654K4251o3507p2554J8426J0727J5372m4738M605Q2875
$$ 56657 69760 57423 27769 52020 -11487 -84041 -65615 -54888 -39516 -84254 -79649 3226
15952C226j2585k8176k6416J4622M1890K4405J0867r782j2038l3173M6843m941
$$ 3226 -9359 -37535 -63951 -49329 -7439 16966 27833 18051 6013 -27160 19683 14742
15940A4742k2860N0126L1461k0083K0964O9095O749m2901l8775m4930k2327K0408
$$ 14742 -8118 42008 73469 53386 74350 143445 150194 107293 68518 23588 1261 21669
15928B1669j3364k6676r469K1322L4596L52R342L3539R604l4598r1531j3387M4784
$$ 21669 8305 -18371 -27840 -6518 28078 28430 37772 71311 80915 46317 -45214 -58601 -13817
15915a3817R579k3925L125k0428M0097p838O407k0675j0860L6115J858j4864J9996
$$ -13817 -4238 -28163 -25038 -45466 -5369 -13207 -6800 -27475 -38335 -2220 -362 -15226 4770
15902D770q350m683o2070k9721L0288L4573O1300N312k7251kK7698l0906p050
$$ 4770 -3580 -8263 -70333 -100054 -69766 -35193 26107 31419 4168 4166 31864 958 -6092
15889f092k5819K8467k3856J9880L9025j0429l3798m4208m7511P142O4775L1495
$$ -6092 -31911 -3444 -27300 -7420 31605 21176 -12622 -56830 -104341 -97199 -32424 -929
15877i29m0636k5099L7700J5252k989Q412j590k9483J8867J5550Q2919O5385k3441
$$ -929 -41565 -66664 -28964 -13712 -16701 -8289 -9879 -39362 -20495 -4945 77974 143359 119918
15864A19918o5182n7931l6276M2983j4961m3001q204N1193N1841l9380n4844j8115
$$ 119918 54736 -3195 -39471 3512 -11449 -54450 -62654 -11461 40380 1000 -53844 -71959
15852g1959J8467K8615K848J6642o0225J280M149L8424j5712K9943N165j7503
$$ -71959 -53492 -24877 -22029 -5387 -65612 -64332 -60183 -21759 -37471 -7528 -2363 -19866
15840a9866J4451j9198k5182l3457j2178L5892l7408N3730K7081l3505p267L7915
$$ -19866 -5415 -24613 -49795 -83252 -95430 -59538 -96946 -43216 -16135 -49640 -56907 -18992
15828a8992J7526m0381q296r31K6752K2421M386j1700l5606j3025K7719l0711
$$ -18992 -1466 -41847 -50143 -51074 -24322 -1901 2485 -9215 -44821 -57846 -30127 -60838
15816f0838K224j4986p421K0813J711M8144J7844k6706j8860M1202L0934k1049
$$ -60838 -58614 -73600 -81021 -60208 -58497 -10353 7491 -19215 -38075 3127 34061 13012
15804A3012K5533j8310m252j374k0111m4170M410N1923M4304n6450M573K232J0025
$$ 13012 38545 20235 15983 14609 -5502 -49672 -45262 6661 50965 -5485 -912 1320 11345
15791A1345N086l082k6659j9314k1107J9070l759O687n60L5700m573r68J181m947
$$ 11345 16431 13349 -13310 -32624 -53731 -34661 -38420 -31733 -32293 3407 -1166 -2134 -953 -5900
15777e900j7565o5974j4519N0607O4590m2375k7400J7665O8096J264o836J0694
$$ -5900 -23465 -89439 -103958 -53351 11239 -31136 -58536 -40871 27225 28489 21653 32347
15765C2347j222L0728Q766n665k4010l9908P984K6033J5318m3562j7740j6947
$$ 32347 31125 61853 70619 64954 40944 1036 9020 35053 50371 6809 -10931 -27878
15753b7878l4278N08N995N204J3681k4312K4820o430R76m470P5532K3560L691
$$ -27878 -62156 -61648 -55653 -50449 -36768 -61080 -36260 -42690 -41714 -46184 29348 52908 56599
15740E6599J6421R84k4342j5778l6790K5675L013k8614r770K5362K9674j6068
$$ 56599 73020 74004 49662 33884 -2906 22769 25782 -2832 -12602 12760 42434 26366
15728B6366m2529n5553L711L3901Q381k0540L7016P1300m169J5421L926k715j9352
$$ 26366 -16163 -71716 -68005 -34104 -25723 -46263 -9247 62053 57884 73305 77231 74516 55164
15715E5164o1754o2517L4975L1331J1827p268J7981k4130l4010m324k805j398
$$ 55164 -6590 -69107 -34132 -2801 9026 1758 19739 -4391 -38401 -42725 -45530 -46928
15703d6928M2288L897k9592l0805K0947L6417r009l5572J7166J2282j7697j2515
$$ -46928 -4640 -743 -30335 -61140 -40193 -3776 -12785 -48357 -31191 -18909 -36606 -49121
15691d9121Q312O7213L9889n2574r693J1538j8595o571j5539n1482k6035J6353
$$ -49121 -40809 26404 66293 13719 4026 15564 -3031 -9602 -25141 -76623 -102658 -86305
15679h6305L1876r25O6617M4437k4718k2722O89N1299M0018p9031n5258k8685
$$ -86305 -54429 -55354 11263 55700 30982 8260 8949 60248 100266 21235 -34023 -62708
15667f2708j8262P079L8486L0554J9553M0222k7702r09R945l0307r1459J4626
$$ -62708 -80970 -73891 -35405 -4851 14702 54924 27222 26313 36258 5951 -85508 -70882
15655g0882O9555J9650K8040k339p42P915l6436j8587J3639o92M2089k5038k5808
$$ -70882 -1327 18323 46363 44024 43282 51197 14761 -3826 9813 9121 51210 26172 364
15642C64K1871k2636M4741L4351m8389l6654J2839L2288j2367m8713Q143O7991
$$ 364 22235 -401 44340 78691 30302 -6352 6487 38775 26408 -22305 -14162 53829
15630E3829M5224J3235L406j8826q7192j8311k2752j7286J567J4060K7935J4106
$$ 53829 99053 112288 115694 96868 9676 -8635 -31387 -48673 -47106 -33046 -5111 8995
15618H995k1079L24M45N577j8996K3532m3459l5552K5102O8490O147K4467Q845
$$ 8995 -12084 -11760 -11315 -5738 -24734 -1202 -44661 -80213 -55111 13379 19526 43993 52838
15605E2838o8157m6558n611J1971L0015k3224K7569K5003r402m0407K2304P057
$$ 52838 -15319 -61877 -67488 -55517 -25502 -48726 -21157 3846 -5556 -45963 -23659 -16602
15593a6602J5175K0777K2922l6917n9729L976L3455J4998J3173L7456o524m9017
$$ -16602 -1427 19350 42272 5355 -54374 -50398 -16943 -1945 11228 48684 42160 -6857
15581f857m906K0801j9764K3153j8418l6515l7942Q822M1979L4365j9365j7421
$$ -6857 -11763 9038 -10726 12427 -5991 -42506 -80448 -71626 -29647 4718 -14647 -32068
15569c2068k265J8606O1227K4086K5432n0733l9586M557l066R439k6384j0631
$$ -32068 -34333 -15727 45500 69586 95018 44285 4699 9256 6190 15629 -10755 -21386
15557b1386L1024M0607l1470Q940J0500n7655j4217L7861K0802l4477M411N6767
$$ -21386 9638 50245 18775 27715 38215 -19440 -33657 4204 25006 -9471 -5060 51707
15545E1707j0518k5551o346J84o3918L3231K0584L4824O342j2546j9614K965Q023
$$ 51707 41189 15638 9292 9476 -54442 -21211 -627 34197 40539 27993 8379 11344 19367
15532A9367J4714K5372J8539j7583k3119j3257N831l1467l7095k8392j077O348
$$ 19367 34081 59453 77992 60409 37290 24033 29864 -1603 -38698 -67090 -68167 -61819
15520f1819J0823O674N1339O875J7326j9172L002M2560k7633j7388k7071j827
$$ -61819 -50996 -44322 7017 13892 31218 12046 15048 57608 29975 12587 -14484 -16311
15508a6311K9517J7819K4756n4607k8272R4099M6370J9005l5997k228j036m5785
$$ -16311 13206 31025 55781 1174 -27098 67001 113371 132376 96379 94151 93115 47330
15496D7330j4320K2016K1767l3853M7034n4079p3118m4440j7150O0463L0259j5131
$$ 47330 33010 55026 76793 42940 89974 35895 -37223 -81663 -98813 -38350 -8091 -23222
15484b3222J2424j26J5636L4189K857l9255J6712N1577n189m5375l8335L0239
$$ -23222 -10798 -10924 4712 38901 41758 2503 19215 70792 65603 20228 -18107 12132
15472A2132J2880m0882j6134P673M9371k5672l7163K2273K5398M2388j9550l970
$$ 12132 25012 -15870 -32004 -24331 25040 -632 -37795 -15522 9876 52264 32714 28744
15460B8744L9210Q058r475M481O69n9046l8589j256K5556J4065l8372j4853P881
$$ 28744 67954 76012 66537 71018 71687 12641 -25948 -27204 -1648 12417 -25955 -40808 -32927
15447c2927J8247J2312J6409L9769L0389m4991p0738K9058J8323k3712n2472m223
$$ -32927 -14680 -2368 14041 53810 84199 39208 -31530 -2472 15851 -7861 -60333 -64556
15435f4556N8101R992J8067l8364k6089J6401j1543l363N800K2202L1851k6949
$$ -64556 -6455 3537 21604 -16760 -42849 -26448 -37991 -41354 -35554 -13352 18499 -8450
15423h450J5131K7672l1586j4939N298j0712J0N2166j6765l8186P698r733J2600
$$ -8450 6681 34353 2767 -12172 -6874 -17586 -17576 34590 17825 -20361 -12663 -22396 -9796
15410i796K4698m7560j2578r950j0907m1240M8437O1247O2234o1107j7675M8034
$$ -9796 14902 -32658 -45236 -55186 -66093 -107333 -58896 2351 64585 3478 -14197 33837
15398C3837k9688k2650J2377L4067j5205k6166O3723J6395m3153q836p733J0595
$$ 33837 4149 -18501 -6124 27943 12738 -13428 50295 66690 23537 14701 6968 17563
15386A7563j9198n4608j0976l8779K474J0027M868K7443L9970k5536m3479L3410
$$ 17563 -1635 -56243 -67219 -105998 -103524 -93497 -88629 -61186 -21216 -46752 -90231 -56821
15374e6821J5465o335M348J0973J478k686N5067J2578j7169m2364L1347O0053
$$ -56821 -41356 -47691 -43343 -32370 -30892 -33578 21489 34067 16898 -25466 5881 65934
15362F5934q675n9039m7003j043N2K7944J6818K2583O4878l317m3146o2218k1959
$$ 65934 57259 -1780 -48783 -49826 -49774 -21830 -5012 17571 82449 79132 35986 -26232 -48191
15349d8191L4070k1619o3797K9750N8313l5088n8203l953J0699k2095L9095P8198
$$ -48191 -14121 -35740 -99537 -69787 -11474 -46562 -104765 -108718 -98019 -120114 -81019 -2821
15337b821n538j8177P033J7972K087k3553k0747p826J3773O144k5273M1584R150
$$ -2821 -8359 -26536 -19503 -1531 556 -22997 -43744 -51570 -37797 -31653 -56926 -15342 -6192
15324f192l7304j0241L2988K5245j8507m5273J6638K3020k8584k8428L2471J6825
$$ -6192 -43496 -53737 -20749 4496 -14011 -59284 -42646 -19626 -48210 -76638 -44167 -27342
15312b7342J8133m2390k0801J4727J7995Q932N4900j2360J1955L9874L594j9441
$$ -27342 -9209 -51599 -72400 -57673 -39678 -30746 24154 11794 23749 63623 67217 47776
15300D7776m1035J0521J4529N3678N0152k0685k0466l9096p0956o10L5269k9827
$$ 47776 6741 17262 31791 85469 135621 114936 94470 55374 -15582 -16192 19077 -10750
15288a0750j7673p245j1866O8825J6802j1097l021o769k7408L8074j4756J6046
$$ -10750 -28423 -35668 -47534 21291 38093 26996 23975 17206 -10202 27872 13116 29162
15276B9162m3620L7159l4351j5818M6346M0774j7910o2727J2726K5867L1233J9117
$$ 29162 -14458 22701 -11650 -27468 18878 59652 41742 -20985 -8259 17608 48841 67958
15264F7958j4694l5752j2743O655q934n7134j9268P5872J7973M8J3659K4181R668
$$ 67958 53264 17512 4769 11424 2490 -54644 -73912 1960 19933 19981 33640 57821 67489
15251F7489l5750J0135J9945j5945k9223L9311j3885m7853J6137N551n069J8155
$$ 67489 31739 41874 61819 45874 16651 55962 42077 -5776 10361 15912 10843 28998
15239B8998j6160l7350L0571N0816j8501l0641J60R152k9946k3987K0750j5401
$$ 28998 12838 -24512 6059 56875 38374 7733 7893 17045 -12901 -36888 -16138 -31539
15227c1539j0671j7638R436l9778K24M3293J012J6054L044j4669N0486k0636K618
$$ -31539 -42210 -59848 -50412 -90190 -89966 -46673 -45661 -29607 -26563 -41232 9254 -11382 -8764
15214h764L7560q248j7400R516l2835K184K7414l6022R204l4921j842O5475N3266
$$ -8764 28796 20548 3148 12664 -20171 -17987 9427 -26595 -17391 -52312 -54154 11321 64587
15201F4587k3374J5486k1496k4115J9438k1446k4594J4088j1149P1566p053l8212
$$ 64587 41213 56699 35203 11088 30526 9080 -15514 -1426 -12575 58991 51938 13726
15189A3726l0376L8280O343l3250J0554K3183J738L559M151J1689n6985k7944
$$ 13726 -16650 21630 27973 -5277 5277 28460 30198 33757 37908 49597 -7388 -35332
15177c5332L9758R686l3782k1065J3425Q5144M624j0032o0279m6679k515n819
$$ -35332 4426 14112 -19670 -40735 -27310 57834 62458 52426 -7853 -54532 -57047 -62866
15165f2866j5200P921M0433L4644l0173K6934j7208k0147L5290n926K2393O9413
$$ -62866 -78066 -70145 -29712 4932 -25241 1693 -15515 -35662 -372 -6298 16095 85508
15153H5508K0022j00477k8181K7839R327L0215m1620l4428K4495j2506m463K6011
$$ 85508 105530 5053 -23128 4711 14038 44253 2633 -31795 -7300 -19806 -24269 1742
15141A742M66k5578k5756r729K651l1190J9234P8431K1048j2632K8011J9903j4256
$$ 1742 2208 -23370 -49126 -58855 -56204 -87394 -68160 10271 31319 18687 46698 66601 52345
15128E2345j8368p788l9033K9409o516J1541P172j0162j3400n558j8955k9953
$$ 52345 33977 26189 -12844 16565 10049 21590 28762 18600 5200 -358 -19313 -49266
15116d9266j8366m612K4940J2005J6605L1222n918m6693L2752N6301j2809m059
$$ -49266 -67632 -72244 -47304 -35299 -18694 12528 6610 -40083 -7331 48970 36161 32102
15104C2102l0577n252J0021m134k8436n7182J4002N2074j2751J5131L0723J888
$$ 32102 1525 -3727 6294 2160 -26276 -83458 -69456 -17382 -30133 -15002 15721 17609
15092A7609k0683J2979K0742j3664o4337m021M354P4461j4821m1265k2647j2841
$$ 17609 -3074 9905 30647 16983 -47354 -51375 -47021 27440 12619 -28646 -51293 -64134
15080f4134J1292J6594k615q121j1599l944j5928O508K2722J4164J1572L5425
$$ -64134 -52842 -36248 -38863 -46984 -58583 -62527 -78455 -71947 -49225 -35061 -23489 11936
15068A1936J798j3708o1791m1857j7580Q875N2317M3073K7094K0524j5937L328
$$ 11936 13734 26 -61765 -103622 -121202 -112327 -60010 -16937 10157 30681 14744 18072
15056A8072l314o066k263j2574k1996k3896K727l2688k1309K9409L830j1705M603
$$ 18072 14758 8692 6429 -6145 -28141 -52037 -49310 -81998 -103307 -73898 -70068 -81773 -77170
15043g7170j929J8018N4485m531j4676K5395l7343O841P448l4849m1554l2736
$$ -77170 -79099 -61081 -6596 -11127 -25803 -408 -37751 -30910 -23462 -58311 -99865 -132601
15031a32601j7597M8572M6249q828Q40R436N4375K0685L28j9301j9833L1125m618
$$ -132601 -150198 -101626 -55377 -64205 -63365 -53929 446 21131 21459 2158 -17675 13450 8832
15018H832k9993J2687J4713J1924K4074Q1094k2085J3340o436k9166J631J5957
$$ 8832 -21161 -8474 6239 18163 42237 123331 101246 114586 108150 78984 80615 96572
15006I6572j6176m0143j237J1476k2878k8628o0788l4948L0950K7635M2199L9258
$$ 96572 80396 40253 39016 50492 27614 -1014 -61802 -96750 -65800 -38165 4034 43292
14994D3292J1140k8832k8368k906M2209P830p451j080O2565L2237j2105o6188
$$ 43292 54432 25600 -2768 -5674 36535 44365 36914 35834 98399 130636 118531 52343
14982E2343j9346K5324L3849K725j0378n431o0965l9534j7014J0477M955O9971
$$ 52343 32997 58321 92170 94895 84517 79086 18121 -21413 -38427 -27950 -22995 46976
14970D6976J7555K8088n825O300K363l4245L9450K3240j7414L7089p484k1487
$$ 46976 64531 92619 86794 93094 95457 61212 100662 123902 106488 143577 136093 114606
14958A14606l7645o855N533K5349l857r284k3877m2123l4511M9292K0526l7933
$$ 114606 76961 70106 75639 100988 97131 87847 63970 21847 -12664 36628 57154 19221
14946A9221l4307L5060K3076m0041k9014J9413Q370j004j3569K5451r563l774
$$ 19221 -15086 19974 43050 3009 -26005 -6592 1778 774 -12795 12656 3093 -681
14934f81L7120j2318m484j1682l6304M2896O864q223l7872m1331n921K6307N5887
$$ -681 36439 24121 19637 7955 -28349 14547 21411 13188 -24684 -66015 -71936 -45629 10258
14921A0258m3145j4014K9805k247l1734M986j0387k3138J2642k1990O409L5021
$$ 10258 -32887 -46901 -17096 -19343 -51077 -46091 -56478 -79616 -66974 -88964 -82555 -47534
14909d7534L3131r418K9991J6961k020K3944j257L9194m6071n1464k3294J3191
$$ -47534 -14403 -23821 6170 23131 21111 45055 43798 82992 36921 -14543 -37837 -24646
14897b4646K71k2439k4948P363n147O641k747o530J3660K1958O772Q866L5144
$$ -24646 -24375 -46814 -71762 -64399 -69546 -62905 -65652 -72182 -58522 -36564 -29792 -20926 14218
14884A4218k3741o0703j7489N6291k8204N691L7542K0253m3093l9159j9107L9584
$$ 14218 -9523 -70226 -87715 -31424 -59628 -53937 -16395 3858 -39235 -78394 -97501 -57917
14872e7917K9984P6702J9829j1744k3772o7768J4051L0461K5284k4781m0502k034
$$ -57917 -27933 48769 68598 56854 33082 -34686 -20635 9826 35110 10329 -30173 -32207
14860c2207L1000O939J2716O6211J294k4175n2475l2345Q906K4943O236O754R630
$$ -32207 -1207 5732 18448 84659 85953 61778 9303 -23042 -14136 10807 17043 23797 33427
14847C3427k8029m4518J5552Q622N7182J4464j2605k8331L7165K607o4017m4326
$$ 33427 5398 -39120 -23568 -14946 42236 56700 44095 15764 52929 55536 -8481 -52807
14835e2807P935L3251n6752o3324N9554K3221K8509J1468j9767J9584j1390L3017
$$ -52807 -44872 -11621 -68373 -131697 -72143 -48922 -20413 -8945 -28712 -9128 -20518 12499
14823A2499Q5j6296j5063m2608J0274R604N1087k0537l925k0311J6844L2519J6139
$$ 12499 12584 -3712 -18775 -61383 -51109 -41505 9582 -10955 -14880 -35191 -18347 14172 30311
14810C0311l1426m6458j2522K47N809j5329J7598M4512L1892L2602M9334K6044
$$ 30311 -1115 -47573 -60095 -59848 -54039 -69368 -51770 -7258 24634 57236 106570 132614
14798A32614q2728p2853K069K7999N076M4575J5566q7042m1633j4135j365L5830
$$ 132614 49886 -22967 -20898 7101 12177 56752 72318 -14724 -56357 -70492 -71857 -36027
14786c6027O8495L530J2234l9086j9316K0872J6618O9245j7607p4368o1542k6003
$$ -36027 32468 35998 48232 9146 -10170 10702 27320 96565 78958 4590 -56952 -82955
14774h2955j0483J9914j2546N290P1643K6856J4063k2501L30k6794n5026k7213
$$ -82955 -93438 -73524 -86070 -80780 -9137 17719 31782 9281 9611 -17183 -72209 -99422
14762i9422K7407Q0388P8813j2456k2432J5871j7565n24J5317Q214l7482q951
$$ -99422 -72015 8373 87186 74730 52298 68169 50604 50080 65397 73611 36129 27178
14750B7178O363j1395m666K444L3234o8329j270J8048N6808M2837K0369k6005
$$ 27178 33541 22146 17480 19924 53158 -15171 -16441 1607 58415 101252 121621 95616
14738I5616k7120k3764k2975m9846j8721K0900K6284J3417l0399K8661L5812K3562
$$ 95616 68496 44732 21757 -28089 -46810 -25910 374 13791 -16608 12053 47865 71427
14726G1427j5061j1052n2913k0688K0669k3977o114J6161o090M8291N1014J1908
$$ 71427 56366 45314 -7599 -28287 -7618 -31595 -37709 -21548 -27638 20653 71667 83575
14714H3575m4506L0049q521j8780j2905m0421j5398J0160k3649M024J329l0619
$$ 83575 39069 69118 60597 41817 28912 -11509 -26907 -16747 -40396 -36372 -35043 -65662
14702f5662q251j8433K1391K0508O0860j825k8942P935K7918l036m3185K1091
$$ -65662 -73913 -92346 -70955 -50447 10413 8588 -20354 -12419 15499 12463 -30722 -9631
14690i631n419l975m721L359j143l9162j6223J5841L3153O3338J9935n6898m7875
$$ -9631 -15050 -19025 -23746 -20387 -21530 -60692 -76915 -61074 -27921 35417 55352 -1546 -49421
14677d9421K0881J2422J3569l4341j0492k928P5n0698J3351J5118j2253K8587
$$ -49421 -28540 -16118 -2549 -36890 -47382 -50310 -50235 -100933 -87582 -72464 -84717 -56130
14665e6130L6889O5291k0527p5197k8730N1523N4812l981L1175Q572k6008l2027
$$ -56130 -19241 46050 25523 -49674 -78404 -26881 27931 23950 55125 63697 37689 5662
14653E662m9530J5431Q48O568Q658j8622k1341K8164m8316j6975n635K3042J3237
$$ 5662 -43868 -28437 -27589 -21021 -12363 -30985 -52326 -24162 -72478 -89453 -95088 -72046 -58809
14640e8809L6198M688j9273k7274R961J864N0032K9304l4865J5325K7762j0441
$$ -58809 -22611 -17923 -37196 -64470 -54509 -52645 -2613 26691 -8174 7151 34913 24472
14628B4472R334J8901M8379k3045k6460J1371j9943j8508p990j7083K5347L6538
$$ 24472 33806 52707 101086 78041 51581 62952 43009 24501 16511 -572 24775 61313
14616F1313P443m1278n0183k3339K2344j3036K0282K1878L1627l4304L653M3497
$$ 61313 68756 27478 -22705 -46044 -23700 -36736 -16454 5424 37051 2747 6400 49897
14604D9897q8035k0541L9796J1656o330m3994j7791L2473L4723J3182J4686l6988
$$ 49897 -38138 -58679 -18883 -7227 -13557 -57551 -75342 -42869 -8146 5036 19722 -17266
14592a7266J0009J0254j4314J9399K2498k2209M712k2027j2489J4488L9423k3606
$$ -17266 -7257 2997 -11317 8082 30580 8371 13083 -8944 -21433 -6945 32478 8872
14580H872k6299L1942K0723m1253J0465k5865K7426M5428k3424m0117k6840k0056
$$ 8872 -17427 14515 35238 -6015 4450 -21415 6011 51439 28015 -12102 -38942 -58998
14568e8998m1850M1211J9835n424M5708J7433L405k5104J141n9922K1542N783
$$ -58998 -100848 -59637 -39802 -45226 482 17915 21320 -3784 -2643 -62565 -41023 -35240
14556c5240P783J1184m5272j0795P5348n2494k6041M4856J9458k3909r685N1098
$$ -35240 -27457 -16273 -61545 -72340 3008 -49486 -75527 -30671 -11213 -35122 -44807 6291
14544F291K7168q034p6820J9692K1689M8111N0984o9291K20r632k5647P120M011
$$ 6291 33459 25425 -51395 -31703 -10014 38097 89081 19790 20010 10378 -15269 -8149 -4138
14531d138j6561j0766k5547J3501M8554J1910J046K3488j175j6262j7391k1392
$$ -4138 -20699 -31465 -57012 -43511 5043 16953 17999 41487 40312 24050 6659 -14733
14519a4733J6447L53N0170N1644j952o047l2504m5648l1331j3540J3176p7244
$$ -14733 1714 2067 52237 103881 101929 95882 63378 17730 -13601 -27141 -13965 -91209
14507i1209K0726N7030K809j4411K8244L245j6917N7977k6362j8803K9256j0090
$$ -91209 -70483 -13453 -10644 -25055 3189 6434 -10483 47494 21132 2329 31585 21495
14495B1495o0010J9068J4072N717J6218m602m090K6855J2954n4394J03J2521J8213
$$ 21495 -38515 -19447 -5375 342 16560 11958 7868 34723 47677 -6717 -6614 5907 24120
14482B4120K1287r552r900m08k1636j3987K8363m420Q461J7782j4418k9438k5132
$$ 24120 45407 35855 25955 25547 3911 -10076 18287 13867 22328 40110 25692 -3746 -28878
14469b8878J928j157P73L2447K0479j3402j8052M3748K048J2468L222m0509j523
$$ -28878 -26950 -28107 -27334 5113 25592 12190 -5862 37886 39934 52402 55624 15115 13592
14456A3592L0399m4521J3337K4992m5550r458M628k5647j7154M0478K6966k6400
$$ 13592 43991 -530 12807 37799 -7751 -17209 -12581 -38228 -55382 -14904 12062 -14338
14444a4338L657N2861n1213k3816M5480k13J4745q140j6432l420J0272l519l1749
$$ -14338 -10681 42180 -9033 -32849 12631 12418 27163 19023 2591 -829 9443 5924 -25825
14431b5825M8668M7369O096m1734l7039L3578K7116n0337o3131J1403J436m2440
$$ -25825 22843 70212 76308 34574 -2465 31113 58229 7892 -55239 -43836 -42400 -84840
14419h4840k8868K9079K5398J6942k3313Q213O1410r525k8184K3042n447n5762
$$ -84840 -113708 -84629 -59231 -42289 -65602 -57389 4021 -5504 -33688 -10646 -16093 -71855
14407g1855N4288j5717l3455L4546M9506N4019n024l8007k1255r772K3587J6558
$$ -71855 -17567 -33284 -66739 -32193 17313 71332 66308 28301 7046 -2726 20861 37419
14395C7419j5817M372K0203m407L64M794K83o491L9496K4130m4707l6343r869
$$ 37419 21602 25974 46177 41770 42134 46928 47211 40720 80216 104346 59639 23296 13427
14382A3427m8318M556J7670l5n921N215N3888J5761q9158j5123k2928J8339N1879
$$ 13427 -34891 -30335 -12665 -12700 -18621 -13406 40482 56243 -32915 -48038 -70966 -52627 -748
14369g48O1225r717r898L2706j8750m5770k4407N4081L5916J1862r019o3718p259
$$ -748 60477 50760 40862 73568 54818 9048 -15359 38722 74638 86500 77481 13763 6504
14356F504M0387L3155L534q0675m7940L4253P2356j2315m1493k3259K0463R187
$$ 6504 46891 80046 83580 2905 -45035 -10782 61574 49259 7766 -15493 4970 14157
14344A4157n712K980j3424r720m688N0676o948n4199j2516K3683L6060k4815k7772
$$ 14157 8445 11425 -1999 -11719 -16407 34269 27321 -26878 -39394 -15711 20349 -4466 -32238
14331c2238j129K0931j598n611L5172q56j6878n0933j8387q595K7868k6892K3274
$$ -32238 -33367 -12436 -14034 -19645 15527 14671 -2207 -53140 -71527 -80122 -52254 -79146 -55872
14318e5872M0180M5712J4934m1568k5043q717O420l1624M1507J0563J923o1443
$$ -55872 -15692 30020 44954 3386 -21657 -30374 -23954 -55578 -14071 -3508 -1585 -63028
14306f3028k2418k3982P5025K9505k0184R926L8002J9367K4187K0624O387P930
$$ -63028 -85446 -109428 -34403 -4898 -25082 -15156 22846 42213 66400 87024 93411 101341
14294A01341k417l1958j6464k4691o645J4764j4900k0497L5126j5265k7623j475
$$ 101341 98924 66966 50502 25811 19166 33930 19030 -1467 33659 18394 -9229 -10704
14282a0704K216K2534R827k2091j284k9357m2364R360N4193J0722R76l9043O336
$$ -10704 -8488 14046 23873 1782 498 -28859 -71223 -61863 -7670 3052 4028 -35015 -28679
14269b8679q711k1337r36Q479p3J9955k131k4277n0885m9501M831K9061N2070
$$ -28679 -37390 -58727 -59663 -51184 -51257 -31302 -33433 -57710 -108595 -158096 -153265 -124204 -72134
14256g2134M3594O63L0751J4583L1800m5941k4121L1364L5395m9586R385k197
$$ -72134 -28540 -27877 2874 17457 49257 3316 -20805 10559 45954 -3632 5753 3556
14244C556j791j7897p473O1702k6057O577L7249k596m7938j7389K441k4722K5333
$$ 3556 1765 -16132 -23605 38097 12040 18617 55866 53270 5332 -12057 -9616 -34338 -9005
14231i005N2913j8559L1320R578n7478q7577l5165L0134K3463N8971N568m6399
$$ -9005 43908 25349 56669 66247 8769 -78808 -113973 -83839 -60376 -1405 4163 -42236
14219d2236q533M2057N4573O453m1618k4540M650j0492j5619K863q900j8892L4417
$$ -42236 -50769 -8712 45861 52314 10696 -13844 -9194 -19686 -35305 -32442 -41342 -60234 -25817
14206b5817P437j0707j1605j0545J2122N0612J8009J3123m7282J052k1796j8418
$$ -25817 -18380 -29087 -40692 -51237 -39115 11497 29506 42629 -4653 -3601 -25397 -43815
14194d3815k8824N2700J7539k74J6704m6505l9861K3546J9727l8702m9811l240
$$ -43815 -72639 -19939 -2400 -2674 14030 -32475 -72336 -48790 -29063 -67765 -117576 -120816
14182a20816o704K4814N7866k6851j7750N1631K8655K0508J1964Q997k4218n4135
$$ -120816 -127520 -102706 -44840 -71691 -89441 -37810 -9155 11353 23317 32314 8096 -46039
14170d6039k6146r973l88k6664j9705M9751J4945J2909J5805M154J6559J0338
$$ -46039 -72185 -82158 -82546 -109210 -128915 -79164 -64219 -51310 -35505 -31351 -14792 -4454
14158d454k5596l3230O530L2726K3073L4620j674K9592m2252k0434q199k6993
$$ -4454 -30050 -63280 -56750 -24024 -951 33669 31995 61587 19335 -1099 -9298 -36291
14146c6291L832M487l4460K854Q830J8174K7614k2406J9964K2002K4106l274j6949
$$ -36291 -32459 -27972 -62432 -59578 -50748 -32574 -4960 -27366 -7402 14600 38706 35432 18483
14133A8483k450J1609j890k6448l8872K6967K81K1665k7795r954j9623P950n692
$$ 18483 16033 27642 25752 -696 -39568 -12601 -12320 9345 -18450 -28404 -48027 -40077 -45769
14120d5769J151P0438L3810l5457m0352m6314j7304K4241K9185m367l3169o112
$$ -45769 -44618 25820 59630 24173 -16179 -62493 -79797 -55556 -26371 -30738 -63907 -70019
14108g0019L7644k8439J8834O023n5783Q014m721J9315P2763m418l6303j5230
$$ -70019 -32375 -60814 -41980 -35957 -91740 -83726 -88447 -69132 3631 -787 -37090 -52320
14096e2320o633K6763P8410N3884n9042j0240K4298k4090l1235O680k5017J3063
$$ -52320 -58953 -32190 46220 100104 41062 30822 55120 31030 -205 6475 -18542 -5479
14084e479k4420l2718N0603M4952J0891M890J8544L62J3223k031k111p2911m9358
$$ -5479 -29899 -62617 -12014 32938 43829 48719 67263 67625 80848 78817 76706 3795 -45563
14071d5563J5459L4326L2083m332m8506l8733l0286k8163K5959N2302J5874o222
$$ -45563 -30104 4222 36305 31973 -16533 -55266 -85552 -113715 -87756 -35454 -19580 -25802
14059b5802L88J6341j9216l6731J9178j3928L8698J1967k5085m1171l3718M3210
$$ -25802 -25414 -9073 -28289 -65020 -45842 -59770 -21072 -9105 -34190 -75361 -109079 -65869
14047f5869K9417K3264Q783N909M6840n0309r2870l4931N0188N3761M6919k3027
$$ -65869 -36452 -13188 -4405 1504 48344 -1965 -94835 -129766 -79578 -25817 21102 -1925
14035a925r414L2928P210k1911J3055k4773K3887N5487j8129k1487l0178j1742
$$ -1925 -11339 21589 28799 6888 19943 -4830 19057 74544 56415 34928 4750 -6992
14023f992J8036O4111L3446j2977n1910n5948l306K6747R626K4448L5588p8316
$$ -6992 11044 75155 108601 95624 43714 -12234 -15540 11207 20833 45281 80869 2553
14011B553n3478N1195j3452j6920j3332N927j982J7952J1654O0628J983m3115
$$ 2553 -50925 270 -13182 -30102 -43434 -37507 -39489 -21537 -9883 50745 52728 9613
13999I613m7390J1709J1130l0613R591L5702k3586k5350L5735l475K3705M5449
$$ 9613 -37777 -26068 -14938 -45551 -35960 -258 -23844 -49194 -13459 -16934 6771 52220
13987E2220j7586l72M899K147J4330j896P241J196n255R1927M7073n6272n5249
$$ 52220 34634 34262 39161 41308 55638 53742 60983 62179 56924 148851 195924 139652 84403
13974H4403j4927l462K4571L896q326m5473l7426j3973j0451k0217J2867L6218
$$ 84403 69476 66014 90585 94481 86155 40682 3256 -10717 -21168 -41385 -28518 7700
13962G700K7491j2936m3764O990M993j0191M7389O4779P785m5367J7131L2359
$$ 7700 35191 22255 -21509 -14519 -9526 -19717 27672 92451 100236 54869 72000 104359
13950A04359k2255R494l8071l6307k1875l2494k3571L4948M8089J2236l3238j0022
$$ 104359 82104 91598 53527 17220 -4655 -37149 -60720 -25772 22317 34553 1315 -8707
13938h707J7501K9682k5007J0296K694k7142o070k1917k2196m0M6043n041J4551
$$ -8707 8794 38476 13469 23765 26459 -683 -6753 -28670 -50866 -50906 -4863 -9904 4647
13925D647o219k1209j3067Q725J4962J905k8810k4672M1059K2510l0721J3293
$$ 4647 -1572 -22781 -35848 -27123 -12161 -10256 -39066 -63738 -22679 -169 -30890 -17597
13913a7597N5278L1011L3280Q343j5374j0974l0982Q610k0135j8381q98L9176
$$ -17597 37681 68692 101972 110315 94941 83967 52985 61595 41460 23079 22181 61357
13901F1357j1667Q319L1272j0977k996l4891J1709L8449r378o7749p6051J6864
$$ 61357 49690 58009 89281 78304 75308 40417 52126 90575 81197 13448 -62603 -45739
13889d5739P4897L2237L116l9115j2719m5742L147M8394J4448J3156L9705l3855
$$ -45739 29158 61395 64511 25396 12677 -33065 -29918 18476 32924 46080 85785 51930
13877E1930L021k5697k5303J3230l3464K4382j0143l1800j0435J5596j4063P0317
$$ 51930 54951 29254 3951 17181 -16283 8099 -2044 -33844 -44279 -28683 -42746 27571
13865B7571J7931m2819N125l5334l4413L2857J5691l7176r567J0626L0226l510
$$ 27571 45502 2683 7808 -27526 -61939 -29082 -13391 -50567 -60134 -49508 -19282 -22792
13853b2792K5028k3328k9800J1449N19L412L2102N5512J3200p6255n3141k0354
$$ -22792 2236 -21092 -50892 -39443 -38924 -35512 -3410 52102 65302 -10953 -64094 -84448
13841h4448l4875N4885J3833K6188L8144K857j9985J0400K525j3259J2066J1978
$$ -84448 -119323 -64438 -50605 -24417 13727 16584 -3401 6999 9524 -3735 8331 20309
13829B0309n4199k2351J4494R926O537J1569j9323M3008J7691l5347J9257J0265
$$ 20309 -33890 -56241 -41747 -31821 -25284 -13715 -33038 9970 27661 -7686 11571 21836
13817B1836j2569q590m3798j8836k522K1539J3580N5206J9136R989M2563q407
$$ 21836 9267 677 -43121 -61957 -64479 -42940 -29360 25846 44982 54971 97534 89127
13805H9127o1286L399K2241j9045p4253o0185M9666l539j1577K2825K4832j8642
$$ 89127 27841 31240 53481 34436 -39817 -100002 -50336 -53875 -65452 -42627 -17795 -36437
13793c6437J2071M2367L1097k6868k8543K1946r239l1330m2817j0511M7211K7472
$$ -36437 -24366 18001 49098 22230 -6313 15633 6394 -24936 -67753 -78264 -31053 -3581
13781c581l5902N170L9381O4597J3862J4135j1111l3999l4692j2326j4288j0509
$$ -3581 -39483 -34313 5068 69665 83527 97662 86551 52552 17860 5534 -8754 -19263
13769a9263J4206K1468L202K4061K3549M8608O454o9217m7454J6518K8738j1201
$$ -19263 -5057 16411 19613 43674 67223 115831 122285 53068 5614 22132 50870 39669
13757C9669k2075L0933K6252L180M69P15J1961m3420q4089l7244J0895K1391L9188
$$ 39669 17594 48527 74779 77959 78428 79143 91104 47684 -36405 -73649 -62754 -41363 -2175
13744b175J9136R091k5465k8775j0347M242M597o375J9472L1805p783k3955m7166
$$ -2175 16961 26052 587 -28188 -38535 -34293 -29696 -36071 -16599 15206 7423 -16532 -63698
13731f3698O318J1832L1233k8871K7467L9636L830L986r280j8013J8981l8949
$$ -63698 -57380 -45548 -14315 -43186 -15719 23917 27747 31733 22453 4440 23421 -15528
13719a5528K8722M3228k524J7215R507L3594l4465j7888O0145J0342l0614k0073
$$ -15528 13194 56422 53898 71113 80620 114214 79749 61861 122006 132348 101734 81661
13707H1661n3618l6530K8178L1467J704o55Q0k8598j8976O580o186j3477k2101
$$ 81661 28043 -8487 19691 51158 52862 52207 52287 23689 4713 11293 5107 -8370 -30471
13694c0471J0826j0391j6673p434L4682J8677K513J004l3796k4389j5961R663
$$ -30471 -19645 -30036 -46709 -54143 -19461 -784 1729 2733 -31063 -55452 -71413 -61750
13682f1750N2121J1286O803M1959J5220K1885j48L7923O4130M9164J7175p8835
$$ -61750 -9629 1657 8460 50419 65639 87524 87376 125299 189429 238593 255768 176933
13670A76933r7950k9002J792m6800j3336J6875M2102m4635n6030k3003L5418L6959
$$ 176933 78983 49981 51773 4973 -8363 8512 50614 5979 -50051 -73054 -37636 -677
13658f77L228m1984Q99K9550j0783M118K6981M8090M6564M8023r267j3678r9175
$$ -677 2551 -39433 -38534 -8984 -19767 -15649 11332 59422 105986 154009 144742 131064 31889
13645C1889q464Q823N706j4928j7869K2588n419J7979k6450P4907M7806K8098
$$ 31889 23425 32248 37954 23026 5157 27745 22326 40305 13855 88762 136568 164666
13633A64666k160J3097k5874M7562M1045M7633m3758j14293q7866j5005m231j9836
$$ 164666 162506 175603 149729 197291 238336 285969 242211 127918 40052 25047 20816 980
13621I80l7969o1551R45K8755L8445O3213M7788l2640n1989K1459L2406j1476
$$ 980 -36989 -98540 -97595 -68840 -30395 32818 80606 47966 -4023 17436 49842 38366
13609C8366k1861R184Q453M4416P8611O5154R057o8468j7701n0699j4048o6203
$$ 38366 16505 25689 34142 78558 157169 222323 231380 162912 145211 94512 80464 14261
13597A4261n9469l0896L1129J6708J8045J2726L2879J4547Q3001L629Q593l100
$$ 14261 -45208 -76104 -44975 -28267 -10222 2504 35383 49930 132931 136560 145153 142053
13585A42053K0587L985n504p466n9765j8479j9154o5029l0382n552j6290Q082
$$ 142053 162640 166625 161121 153655 93890 75411 56257 -8772 -39154 -44706 -60996 -52914
13573e2914K5870J0609j2688J1707L7762K5533K6770K1180L9368J8997l4005k631
$$ -52914 -27044 -16435 -29123 -17416 20346 45879 72649 93829 133197 152194 118189 115558
13561A15558N1217P5419J36023Q1064n4584n485J04878J36504K01010J73436p7284
$$ 115558 166775 242194 378217 459281 404697 399212 504090 640594 841604 1015040 937756
13550I37756k97464k74109j73986p9848m2003j6453M5665p724j0375l4240l0237
$$ 937756 640292 366183 192197 112349 70346 53893 99558 91834 81459 47219 16982
13539A6982J6964M2677j626k7651N4853N2613K004n5785o8186L2347L2572L1367
$$ 16982 33946 76623 74997 47346 102199 154812 156816 101031 32845 65192 97764 129131
13527A29131k4127l4175j5259Q474K9569l7796K4699Q6126P1278N4431O3202O3663
$$ 129131 105004 70829 55570 64044 93613 55817 80516 166642 237920 292351 355553 419216
13515D19216K2937M5448L6763R0155K33193L50830M81877O78791P24964m3961
$$ 419216 442153 487601 524364 614519 847712 1198542 1680419 2359210 3084174 3040213
13505C040213r52321q18147m86941k90240j44703r8878m3149l2072m568M3563
$$ 3040213 2087892 1269745 782804 492564 347861 248983 205834 173762 169194 212757
13495B12757k1566n5362l0671K4699J050k6489j96J2726K3294K481K0896j5312
$$ 212757 191191 135829 105158 129857 130907 104418 104222 116948 140242 142723 163619 148307
13483A48307j3530J7822j9460M2694J6625m1841o2060j3922M1194L998K7583R3903
$$ 148307 134777 152599 133139 175833 192458 150617 88557 74635 115829 119827 147410 241313
13471B41313N6206K6915N1507Q4078J46387K17253K69417M61629O86535Q12575
$$ 241313 297519 324434 375941 460019 606406 823659 1093076 1554705 2241240 3053815
13461C053815J25041r22116r62088n49370k72762j44062n1923O667K0106j963
$$ 3053815 3178856 2256740 1294652 745282 472520 328458 276535 283202 303308 301345
13451C01345j0508m4350J0365m7651m8473m9429j8605k4224r694P596j9118K6857
$$ 301345 290837 246487 256852 209201 160728 111299 92694 68470 58776 66372 47254 74111
13439G4111J02143J8775n4538l6089K4939l8677l5825l298J2436K9040k3148r904
$$ 74111 176254 195029 140491 104402 129341 90664 54839 51541 63977 93017 69869 59965
13427E9965J6786J1886L4745L0874N4623P2873P0426N1795Q3469K11438K80605
$$ 59965 76751 88637 123382 154256 208879 281752 352178 403973 487442 698880 979485
13416I79485M6266k32291k93137j45014r1296j05913k0270R17N367j0483k5926
$$ 979485 1025751 793460 500323 355309 264013 158100 137830 138747 144114 133631 107705
13405A07705J1986j6979l9434k2496J9315M2191j9211l626J00221Q4242P8173
$$ 107705 119691 102712 63278 40782 60097 102288 83077 79451 179672 263914 342087
13394C42087O5957L5338R288p1221p6230r3249o8079m9021l2052k3742k9773R375
$$ 342087 408044 443382 452670 381449 305219 211970 143891 94870 62818 39076 9303 18678
13382A8678L9889j9730r388K0902j6025j9127k734N4247l011J1307L3688l4294
$$ 18678 58567 38837 29449 50351 34326 15199 12465 66712 63701 75008 108696 74402
13370G4402j4448k6612k6259k249J4455K4816N1530M0472r77m7742o0430j2290
$$ 74402 59954 33342 7083 4834 19289 44105 95635 136107 135130 87388 26958 14668
13358A4668L5657O7524K9017m4248K1770L8774J8920L8573M6820P2010K1691J3006
$$ 14668 50325 117849 146866 102618 124388 163162 182082 220655 267475 339485 361176 374182
13346C74182q4444j45272o4639l1387k6547j4275j5M3469J954K2337k5255j0832
$$ 374182 289738 144466 79827 48440 21893 7618 7603 51072 53026 75363 50108 39276
13334C9276k4083l7151J8853J5115o558k410j7j9135Q715L4491L1426k8995j706
$$ 39276 15193 -21958 -3105 12010 5452 3042 3025 -16110 -7395 27096 58522 29527 27821
13321B7821L6387q446l4496p2006k1727O7489Q0089j4201J2283M540P557M5020
$$ 27821 64208 55762 21266 -50740 -72467 -4978 75111 60910 73193 77733 85290 130310
13309A30310K6650l3118R419r963j4439M1509K3277J603m146l3112o116J1891
$$ 130310 156960 123842 133261 123298 108859 150368 173645 175248 171102 137990 131874 143765
13297A43765l499n4772l1496j6466P4922J11458L5895j10173m6051k290k4844
$$ 143765 140266 85494 53998 37532 112454 223912 259807 149634 103583 101293 76449
13286G6449n9141r1642p785M7941O726L0075J7684M0141r695k4240m6226m6131
$$ 76449 17308 -74334 -82119 -34178 -27452 2623 20307 60448 50753 26513 -19713 -65844
13274f5844J434K4233Q967M6981O5014p877k7348M6849O3562l370m4292j7865
$$ -65844 -64410 -40177 -31210 15771 80785 72908 45560 92409 155971 152601 108309 90444
13262I0444l0629m6900P682M4357L0569m2887k1421J3759Q8357L4755K6484J4204
$$ 90444 59815 12915 20597 64954 95523 52636 31215 44974 133331 168086 194570 208774
13250B08774K9809R7956R6429J74651J12853j41111k44884j22618o0643n1264
$$ 208774 238583 336539 432968 607619 720472 579361 334477 211859 151216 99952
13240I9952J8l8119l5746p532j8402m667p502J6428Q9898k2505n8773N3588q737
$$ 99952 99970 61851 26105 18573 171 -4496 -11998 4430 94328 71823 13050 66638 57901
13227E7901P367O4914L4277m0156j1098P338m6892n2735o2671k1277L5823J3194
$$ 57901 65268 130182 164459 124303 113205 120543 73651 20916 -41755 -63032 -27209 -14015
13215a4015L1529K3924k2032O82M5529J3049J5346k2917N0492Q1871K5734K9850
$$ -14015 17514 41438 19406 20088 65617 78666 94012 71095 121587 203458 229192 259042
13203B59042J19567K34016J35831j28383k58571j78404l325K493k3820m4513m201
$$ 259042 378609 612625 748456 620073 361502 183098 179773 182266 158446 113933 109732
13192A09732j7354k5866J5537j9404o5887J8522m5170M0319J3954k7286m8910
$$ 109732 92378 66512 82049 62645 -3242 15280 -29890 10429 24383 -2903 -51813
13181e1813n4527L989L5084J6277N6850n110k181K0500M2768K2777n0391j9546
$$ -51813 -106340 -102351 -67267 -50990 5860 750 -1431 19069 61837 84614 34223 14677
13169A4677M8779n2046l2989Q47P9482R6116K9102l6380n6122r288M4590L4535
$$ 14677 63456 11410 -21579 -20732 58750 154866 183968 147588 91466 82178 126768 161303
13157A61303Q6898K2152o1424q2856n4726L1564m764p7013m6059P262M1438K4879
$$ 161303 248201 270353 208929 126073 71347 102911 98147 21134 -24925 -17663 23775 48654
13145D8654k8308J8453L289j3932J4188o846l8944Q156K8645j040j6156K5978
$$ 48654 20346 38799 42088 28156 42344 35498 -3446 4710 33355 32315 16159 42137
13133D2137K5095l4766m1939l294L4190k6950l4800N264m1555j3743j6272L8322
$$ 42137 67232 32466 -9473 -12767 21423 -5527 -40327 -35063 -76618 -90361 -106633 -68311
13121f8311K849K0795M519R434k2753J6891k2224j751J3558O4977R4978K7528
$$ -68311 -65462 -44667 -40148 -30714 -53467 -36576 -58800 -60551 -46993 17984 112962 140490
13109A40490p2131l3298l2174l6472J4407k084l9909j8469N0778L0513k0017j0536
$$ 140490 68359 35061 2887 -33585 -19178 -21262 -61171 -79640 -28862 1651 -18366 -28902
13097b8902j8288J0565o558k0502K1279p260l0239o213N112L1265L7707J0435
$$ -28902 -47190 -36625 -43183 -63685 -42406 -49666 -79905 -86118 -81006 -49741 -12034 -1599
13085a599L0699J9897N327p2662l6784J8253J3124j7423k6073L2366O0834M2864
$$ -1599 29100 48997 54324 -18338 -55122 -36869 -23745 -41168 -67241 -34875 25959 68823
13073F8823k2651m0137k0892n0188l948K9593L9366K5031J7354K7009j005l0694
$$ 68823 46172 6035 -14857 -65045 -68993 -39400 -34 24997 42351 69360 68355 37661
13061C7661k9585K8177J0821n782j4134n5200l012M8380l6890N733M2403N060
$$ 37661 8076 36253 47074 41292 27158 -28042 -31054 17326 -19564 -13831 28572 33632
13049C3632l0001n554J6717J9603J0705j4689J8956L0283k5853o4039J5719L7583
$$ 33632 3631 -1923 14794 34397 45102 30413 49369 79652 53799 -10240 5479 43062
13037D3062l5341J0821L250K7063l784p8848l5497K0255j1347J9044L8449P742
$$ 43062 7721 18542 21792 48855 45071 -33777 -69274 -49019 -60366 -41322 -2873 4869
13025D869o0763l9678L9565O5527M2k0042j2560L0584K2564J8554q977j2186k4543
$$ 4869 -55894 -95572 -56007 9520 9562 -10480 -23040 7544 30108 48662 39685 27499 2956
13012B956J1597j9838M6020k2122J1271j2695k309P215p808J9977m6957l5781
$$ 2956 14553 -5285 40735 18613 29884 17189 14880 22095 14287 34264 -12693 -48474
13000d8474K7540R0702J8905j0724n0233n2115K895J1769L7043j8614j4320k370
$$ -48474 -20934 69768 88673 77949 27716 -24399 -21504 -9735 27308 8694 -5626 -7996
12988g996l6014q071j161M2684j2273J6193k7310Q060M6489J821J8556r006k2012
$$ -7996 -44010 -52081 -53242 -10558 -22831 -6638 -33948 -25888 20601 22422 40978 31972 9960
12975I960Q933j3242J797J5121O838m0704n0642k9264J8742j1259p068O8145N6719
$$ 9960 18893 5651 7448 22569 29407 -11297 -61939 -91203 -72461 -83720 -90788 -22643 34076
12962C4076J1188j3588R007K2618n5579n4194J1285J619n714M1965K4223k3994
$$ 34076 45264 31676 40683 63301 7722 -46472 -35187 -33568 -39282 2683 26906 2912
12950B912N990M2873j3185l0451k1936N945M5656q741j4110j7655k8271j8858
$$ 2912 8902 51775 38590 8139 -13797 -7852 37804 29063 14953 -2702 -30973 -49831
12938d9831J7494J3979n2120k71K2354k0338l8654K8799J9175j8504k640K3381
$$ -49831 -32337 -18358 -70478 -70749 -48395 -68733 -107387 -78588 -59413 -77917 -80557 -57176
12926e7176n042K2646M3112L1477m193L9337p169n0494m0696J8054K9924Q621
$$ -57176 -62218 -39572 3540 35017 30824 70161 62992 12498 -28198 -10144 19780 28401
12914B8401k8250K7507o805j7123J9831j267l5170R811J2791P435k4349j1136
$$ 28401 151 27658 20853 3730 23561 22294 -12876 -3065 9726 17161 -7188 -18324
12902a8324J8198l585M0733k656M306l1458l7351l8730J8752K4515J2651J2761
$$ -18324 -126 -3711 37022 34366 38672 7214 -30137 -68867 -50115 -25600 -12949 -188
12890a88m7365m4377j2942K9230K9756M3140o732p2627K9307L7027j7051j8878
$$ -188 -47553 -91930 -104872 -75642 -45886 -2746 -9478 -82105 -52798 -15771 -32822 -51700
12878e1700l8418n234N8077P0581j7870J8531M03m5826k8955R595J3229m2509
$$ -51700 -90118 -95352 -37275 33306 15436 33967 34370 -11456 -40411 -30816 -17587 -60096
12866f0096j2599K1292j0551n0076N102O5299K0332Q951J8370J4396R579n3452
$$ -60096 -72695 -51403 -61954 -112030 -106928 -41629 -21297 -12346 6024 20420 29999 -23453
12854b3453n5935N9947k169n2534l330O2330J9020l304k6205K178J8090K8436
$$ -23453 -79388 -19441 -21610 -74144 -77474 -15144 3876 572 -25633 -23455 -5365 23071
12842B3071m4678n0018k544L1004J7168L2575K6381k4764l7367l9826P265K2896
$$ 23071 -21607 -71625 -74169 -43165 -25997 6578 32959 8195 -29172 -68998 -61733 -38837
12830c8837j557j2936P28J0984J3621j0150o0037j1774O1903j873K7426M4141
$$ -38837 -40394 -53330 -52602 -41618 -27997 -38147 -98184 -109958 -48055 -49928 -22502 21639
12818B1639J362l5504J6925j8481k2584Q644l8329l078K2580J6097m3177R029
$$ 21639 23001 -12503 4422 -14059 -36643 -27999 -66328 -69406 -46826 -30729 -73906 -64877
12806f4877J500q987K0090L9700K2867k6984n006l63j1396k6958J5080m899n5814
$$ -64877 -63377 -72364 -52274 -12574 10293 -16691 -21697 -22060 -33456 -60414 -45334 -50233 -106047
12793a06047j1006P1485J5884k1775O660Q704J382L7501K4710j1357L442m7400
$$ -106047 -117053 -45568 -29684 -51459 -44799 -36095 -34713 2788 27498 16141 19583 -27817
12781b7817J2964J351m8721Q994N0091O0290k1621p2572M315J1339M1824k1516
$$ -27817 -14853 -13502 -62223 -53229 -3138 57152 35531 -37041 -32726 -21387 20437 -1079
12769a079m3717J2787J5789j8474l7228J9239J3222j9279j8371Q5768R408l0889
$$ -1079 -44796 -32009 -16220 -34694 -71922 -52683 -39461 -58740 -77111 8657 18065 -12824
12757a2824j5512M780N0199n08j7385o062m2529q972j2287L3832O4128K4551q950
$$ -12824 -28336 -23556 26643 26135 8750 2688 -39841 -48813 -61100 -27268 36860 61411 52461
12744E2461o4182j1494J3729L579j2544k4040K0475J7069m0352o736L093j2382
$$ 52461 -11721 -23215 -9486 -5907 -18451 -42491 -22016 -4947 -45299 -52035 -48942 -61324
12732f1324l8915J4197P4840P8490m1237K3697j806M024N0929P25k1014m9671
$$ -61324 -100239 -86042 -11202 67288 26051 49748 47942 51966 102895 103620 82606 32935
12720C2935q0126J4714L0302J1382O1246j1602o4075m4698J2560l8016J1636N7487
$$ 32935 -47191 -32477 -2175 9207 70453 58851 -5224 -49922 -37362 -75378 -63742 -6255
12708f255l2581m6447K1598K9884K0629k2056l0001J1966N0249j5708N8423k711
$$ -6255 -38836 -85283 -63685 -33801 -13172 -35228 -65229 -53263 -3014 -18722 39701 36990
12696C6990p0304r8539j2132P1949L0942N8927J2613N724j1279n6502m6573L3651
$$ 36990 -33314 -131853 -143985 -72036 -41094 17833 30446 36170 24891 -31611 -78184 -44533
12684d4533N7K2019O3412k3219o798r13j6226J5018j5087n224M2949L136k2725
$$ -44533 -44476 -22457 40955 17736 10938 10025 -6201 8817 -6270 -11494 31455 34591 11866
12671A1866k1585m7609K4135M3132R533j3992l8713j0644L4163K3959r084m5868
$$ 11866 -9719 -57328 -33193 9939 19472 5480 -33233 -43877 -9714 14245 5161 -40707
12659d0707j3354M0996J4205j9463j7836l4245P5519M839o1391k7177M900M9881
$$ -40707 -54061 -13065 1140 -18323 -36159 -70404 5115 9954 -51437 -78614 -73714 -23833
12647b3833M5085r23P546M166L052L9730m7467o6105L1525K1954k1321o7122j8645
$$ -23833 21252 20329 27875 32041 35093 74823 27356 -38749 -7224 14730 -6591 -73713 -92358
12634i2358J9027M2252Q184k6289l8477K7669N7553M7449j8762o5794l1808R376
$$ -92358 -73331 -31079 -22895 -49184 -87661 -59992 -2439 45010 26248 -39546 -71354 -61978
12622f1978K4177r163r213N2236J5150n8013K458N6607K8802J3596o784k815k27
$$ -61978 -37801 -46964 -56177 -3941 11209 -46804 -44346 12261 41063 54659 47875 45060 44833
12609D4833k9608o188m5471o3422j8250O329J0489J0074K9664K9389J1182m6992
$$ 44833 15225 9037 -36434 -99856 -118106 -111777 -101288 -91214 -61550 -32161 -20979 -67971
12597f7971m8008K2497M5943L0427o0098J6869R1598N1514k169K1656n0998q3605
$$ -67971 -115979 -93482 -47539 -17112 -77210 -60341 31257 82771 80602 102258 51260 -32345
12585c2345J0188L0875L2419m1387P873k7606k2220j2018K9684N0143O893J5750
$$ -32345 -22157 8718 41137 -250 7623 -19983 -42203 -54221 -24537 25606 32499 48249
12573D8249k8947J6715O148l05l1311N560J4455L4339L9609J7080k8660k4437
$$ 48249 19302 36017 42165 41860 10549 16109 30564 64903 104512 121592 92932 68495
12561F8495j8652n5023m3152p719O1647L6893k882j0421L0724O5027j9691n4213
$$ 68495 49843 -5180 -48332 -56051 5596 42489 39607 29186 59910 124937 105246 51033
12549E1033l7356k5706M172k2688K1280N0453L2884k3004m7341r908K6507O9402
$$ 51033 13677 -12029 -7857 -30545 -9265 41188 74072 51068 3727 -6181 20326 89728
12537H9728J5394l7034J0050j1409K274l4061m9805k5526K8498K6862l2545m8065
$$ 89728 105122 68088 78138 66729 69003 34942 -14863 -40389 -11891 14971 -17574 -65639
12525f5639j1235N8648M937m4145k1376O1718N9987k0925p828j5609L6113j3161
$$ -65639 -76874 -18226 -13289 -57434 -78810 -17092 42895 21970 14142 -1467 34646 21485
12513B1485l0966l8850J5720p472K285L7511k2158k0387N1850k1690j8256K1094
$$ 21485 -9481 -48331 -32611 -40083 -37798 -287 -22445 -42832 9018 -12672 -30928 -9834
12501i834j403l152j4932n433M6350l800j7028L5482O2820N4044k6093m4591k5725
$$ -9834 -11237 -14389 -29321 -34754 11596 7796 -9232 26250 89070 143114 117021 72430 46705
12488D6705o674K5373k7046k2762L0482L0805P165m5737l3703M1766J4569m0612
$$ 46705 40031 65404 38358 15596 46078 76883 84048 38311 4608 46374 60943 20331
12476B0331k6551O8959j238q790p8533m9564K0139K0823O8317M1853L0918o3136
$$ 20331 -6220 62739 61501 52711 -25822 -75386 -55247 -34424 33893 75746 106664 43528
12464D3528l7317m117K0314k3179j4220k1648N52M2982J1253P799k3576j1189
$$ 43528 6211 2094 22408 -771 -14991 -36639 -36087 6895 18148 25947 2371 -8818
12452h818k581J2864M5033j0438k4888k3610M4094K9123n2910m5064k606L1854
$$ -8818 -11399 1465 46498 36060 11172 -12438 31656 60779 7869 -37195 -39801 -7947
12440g947L009K7815R513n0861k1999N1455J6268j0317l7161m2451P7M1334o785
$$ -7947 -4938 22877 32390 -18471 -40470 10985 27253 16936 -20225 -62676 -62599 -21265 -28050
12427b8050J5856j9947j0087M2036J3894m9673n9866l1810K9444k0386K6691O9994
$$ -28050 -12194 -32141 -42228 -192 13702 -35971 -95837 -127647 -98203 -118589 -91898 -21904
12415b1904k216m6956K4723J6739l284m3846l3248J5888L0110O031K9233L9687
$$ -21904 -24120 -71076 -46353 -29614 -32898 -76744 -109992 -94104 -63994 -57963 -28730 10957
12403A0957j4209j4174J0039M525m0903l0505L2915N410M481j5546J5005k0686
$$ 10957 -3252 -17426 -7387 -2862 -43765 -74270 -41355 -35945 -31464 -47010 -32005 -52691
12391e2691j5286L1455L5903K4557K2137j1517J4891m1187k0382J8559p402l5618
$$ -52691 -67977 -36522 -619 23938 46075 34558 49449 8262 -12120 6439 -963 -36581
12379c6581K505L6783q854j7216J4727k2910L385k719P4109J8719L427p33j659
$$ -36581 -34076 2707 -6147 -23363 -8636 -31546 -28161 -30880 43229 61948 65375 64642 62983
12366F2983l4237m6878l1278p7355N959L5053N6477K5888L4887J8185m5891P675
$$ 62983 28746 -18132 -49410 -126765 -120806 -85753 -29276 -3388 31499 49684 3793 11468
12354A1468k6438j1086m3829k6129M4858J8079K7003K2501j6884o7567J4028j4845
$$ 11468 -14970 -26056 -69885 -96014 -51156 -33077 -6074 16427 -457 -68024 -53996 -68841
12342f8841R943K2398K5674K1827J1405R054o3530l3376O2436M7260Mn2685n3981
$$ -68841 -58898 -36500 -10826 11001 22406 31460 -32070 -65446 -3010 44250 44254 -8431 -62412
12329f2412L563J4088K8098j4112j1125j4060n9558o770M7091K2603K0189L136
$$ -62412 -58849 -44761 -16663 -30775 -41900 -55960 -115518 -122288 -75197 -52594 -32405 -29269
12317b9269k1760J3755m971K8107p426m9531k9581l1702M6196N4074o989k1170
$$ -29269 -51029 -37274 -42245 -14138 -21564 -71095 -100676 -132378 -86182 -32108 -39097 -60267
12305f0267J5347J4337j6217j8072q229l5699j5452K7071K0744J1301O1607N5710
$$ -60267 -44920 -30583 -46800 -64872 -73101 -108800 -124252 -97181 -76437 -65136 -3529 52181
12293E2181Q449j5282l5942k2714o452K847r859j213N2903K3447l783j1919l9272
$$ 52181 60630 45348 9406 -13308 -19760 -16913 -26772 -27985 24918 48365 44582 32663 -6609
12280f609l0662K9698J2748K076L661K5278k6828m9735k0192J1237L0809M9551
$$ -6609 -37271 -7573 5175 7251 10912 36190 9362 -40373 -60565 -49328 -18519 31032
12268C1032j4786j1752l1428L1597K1703j4138O464l6167m8929K774L2590Q017
$$ 31032 16246 4494 -26934 4663 26366 12228 18692 -17475 -66404 -63630 -31040 -23023
12256b3023l0785m2082J5584L5373J1443J1186j2337j486R470J0931O3458M2634
$$ -23023 -53808 -95890 -80306 -44933 -33490 -22304 -34641 -36127 -26657 -15726 47732 90366
12244I0366m1518n3708J4916K023j3949k4923P177N8152N8787k9107o8859J385
$$ 90366 48848 -4860 10056 12079 -1870 -26793 -19616 38536 97323 68216 -643 742
12232G42j4722q561p002M5809j3846k9100J5434M7276N0346j5036m3953j3384
$$ 742 -13980 -22541 -29543 16266 2420 -26680 -11246 36030 86376 71340 27387 14003
12220A4003r0257n2039O8932R9080K0356l9867p333L7035o166L8698J6823j0659
$$ 14003 -76254 -128293 -59361 39719 60075 20208 12875 49910 43744 82442 99265 88606
12208H8606l1874m8747j9126P724q412n938M111L974j1496k4211j6415l2589M6405
$$ 88606 56732 7985 -11141 -3417 -11829 -17767 -13656 -9682 -21178 -45389 -61804 -94393 -47988
12195d7988O9116J343P921j38m062m9755M2990j7246Q046J2629N757k9230J6047
$$ -47988 21128 22471 30392 30254 26192 -23563 19427 2181 10227 22856 28613 -617 15430
12182A5430K13o8997l4598R674P809L2408K0022N0037J108j6021J4986J2544m0450
$$ 15430 15643 -53354 -87952 -78278 -70469 -38061 -18039 31998 33106 17085 32071 44615 4165
12169D165l2891k5539L7483K2788K1343k0331p8217J8286K8833j2569k1271P550
$$ 4165 -28726 -54265 -16782 6006 27349 7018 -71199 -52913 -24080 -36649 -57920 -50370
12157e0370J6494K2445j1045K6201n967M0949j0291m6210l8101Q1703L4968J5977
$$ -50370 -33876 -11431 -22476 3725 -2242 38707 28416 -17794 -55895 25808 60776 76753
12145G6753J3550m8973n4266L4743M9241J0224m379l7354n2318l5854J0499r134
$$ 76753 90303 41330 -12936 21807 71048 81272 76893 39539 -12779 -48633 -38134 -47268
12133d7268J655k4303l543M94k6183J5230K5103L1339J2879p567n1631L9917l4488
$$ -47268 -45613 -69916 -73459 -72965 -99148 -83918 -58815 -27476 -14597 -22164 -73795 -33878 -68366
12120f8366K5258K2063j783m1693n0660L7354K9924M6051O3298J0847k6487j8032
$$ -68366 -43108 -21045 -22828 -64521 -115181 -77827 -47903 -1852 61446 72293 45806 27774
12108B7774l327J4529k1995k5475Q70j3341L8786j3961m334k1887K622j5077q7280
$$ 27774 24447 38976 16981 -8494 -7624 -20965 17821 3860 -474 -22361 -19739 -34816 -122096
12095a22096R889O3532K3393N0010m199n3773j1160k0053L42K7695j1500j6280
$$ -122096 -112207 -48675 -25282 24728 20529 -33244 -44404 -64457 -64115 -36420 -47920 -64200
12083f4200P06L4709P365p472m2189K7223N1406J8425K1056J5123L1910q535o9441
$$ -64200 -63494 -28785 -21420 -28892 -71081 -43858 7548 25973 47029 62152 94062 85527 16086
12070A6086l7578K0138p051K213j9544n0196J0679k1494L6156K1047M6071l9455
$$ 16086 -21492 -1354 -8405 -6192 -25736 -75932 -65253 -86747 -50591 -29544 16527 -22928
12058b2928m2186O244L3962K8188Q970K390n3970m344K3456J0000L301O075N7926
$$ -22928 -65114 -58870 -24908 3280 12250 14640 -39330 -43674 -20218 -10218 -6917 -842 57084
12045E7084K8015L942k9275J4001J4232k2758K4155m7380o5523J2273L2605P032
$$ 57084 85099 89041 59766 73767 87999 65241 89396 42016 -23507 -11234 21371 28403
12033B8403M1749J4634p0062J6475j2214m4143o687P436J8513M0743K4078o3602
$$ 28403 70152 84786 14724 31199 18985 -25158 -31845 -24409 -5896 34847 58925 -4677
12021d677k9619R905P5395o3125o3944Q601J7874K8466j428K052N6781K0589q7012
$$ -4677 -34296 -24391 51004 -12121 -76065 -67464 -49590 -21124 -22552 -20500 36281 56870 -30142
12008c0142p7860L0771Q240l805N650J0523K2179k1392m771p819O93k369K3340
$$ -30142 -108002 -77231 -68991 -72796 -67146 -56623 -34444 -55836 -60607 -68426 -67733 -70102 -46762
11995d6762L3519J8789k5324K1316j4092k7718N4960p040l8514Q288M1061L6172
$$ -46762 -13243 5546 -19778 1538 -12554 -40272 14688 7648 -30866 -22578 18483 54655
11983E4655k5788k1276j2418J5521j1728m3313J676K1776K6391l0154j7758L882
$$ 54655 28867 7591 -4827 10694 -1034 -44347 -42671 -20895 5496 -24658 -42416 -38534
11971c8534k3836j0590J8991M8625k2240l9402K4668K9566j0364l759L1806P423
$$ -38534 -62370 -72960 -53969 -5344 -27584 -66986 -42318 -12752 -23116 -26875 4931 12354
11959A2354k4384J9968M4306q688J6906m6452j2309Q1876k135n4804l3940o106
$$ 12354 -12030 7938 52244 43556 60462 14010 1701 83577 81442 26638 -7302 -13408
11947a3408L4938q659q00l5115Q192L0233j3769l0689J4083M4703m776k6739O568
$$ -13408 21530 12871 12071 -23044 -14852 15381 1612 -29077 -14994 29709 24933 -1806 4762
11934D762l1408L0425p481j5241k054K2890j4370q384n1290K7525N1349L9112
$$ 4762 -26646 3779 -3702 -18943 -20997 1893 -12477 -20861 -72151 -44626 6723 45835
11922D5835j8061j8745p750K6495k2210K8665n036L499L0693K979n3897j8230
$$ 45835 27774 9029 1279 27774 5564 34229 29193 32692 63385 66364 12467 -5763
11910e763l6352m8301j4072K7418P9347M1785Q8062l1716o5543j0591j9074k0103
$$ -5763 -42115 -90416 -104488 -77070 2277 44062 132124 100408 34865 24274 5200 -14903
11898a4903j5780j4540m5687J4355L0602K6709L9282k7332M3339j0189l5223l7723
$$ -14903 -30683 -45223 -90910 -76555 -45953 -19244 20038 -7294 36045 25856 -9367 -47090
11886d7090n0861o48J1681L5945M3357R069l2522L572J4857j904J5802k7016K7125
$$ -47090 -97951 -98599 -86918 -50973 -7616 1453 -31069 -27497 -12640 -14544 1258 -25758 1367
11873A367L8070l5844k1430K572j8316P989L4670j1910K8881j9823k4051l3799
$$ 1367 39437 3593 -17837 -15265 -33581 -25592 9078 -2832 26049 6226 -17825 -51624
11861e1624l4360N4143Q3661J1506k2378j1192l6406J4373m020J5811O771n2784
$$ -51624 -85984 -31841 51820 63326 40948 29756 -6650 7723 3703 19514 26285 -26499
11849b6499O358O354m032L0700N2982m9257r409R289K0075J5963N6838j3713m4810
$$ -26499 -20141 -13787 -17819 12881 65863 16606 7197 16486 36561 52524 109362 95649 50839
11836E0839l1208k7641M198m522k1863k1780O643n194j5124M399N594j9969K2272
$$ 50839 19631 -8010 -3812 -8334 -30197 -51977 -45334 -50528 -65652 -61253 -55659 -75628 -53356
11823e3356K1774m1988R895K1651M7506J5769m0200m8290l0548K8050P0684J1811
$$ -53356 -31582 -73570 -63675 -42024 5482 21251 -18949 -67239 -97787 -69737 947 12758
11811A2758j6563k9659j7327p8819k0584N0102O0544J4298n146n8189K814J4897
$$ 12758 -3805 -33464 -50791 -129610 -150194 -100092 -39548 -25250 -30396 -88585 -85771 -70874
11799g0874L2021J8597k5894J5126m2786j0329k409L5764L3272K4514k8400o2723
$$ -70874 -38853 -20256 -46150 -31024 -73810 -84139 -86548 -50784 -17512 7002 -21398 -84121
11787h4121k3270J1954K6685j25K6033O1636N47k8572j755K6050k4116l361j1197
$$ -84121 -107391 -95437 -68752 -68877 -42844 18792 19339 -9233 -10988 15062 -9054 -12415 -23612
11774b3612q006j1467O346l6113J9200K1355K0716r032j8939k765L3205J4088
$$ -23612 -31618 -43085 -36739 -72852 -53652 -32297 -11581 -20613 -39552 -42317 -9112 4976
11762D976j6131l6484K6214k4901J967M0165o142k5263k4461j9150M3606L5825
$$ 4976 -11155 -47639 -21425 -46326 -44359 -4194 -10336 -35599 -60060 -79210 -35604 221
11750B21l160P090k5837k6358K3615L0601M6489L9415k3728j8062J9874l6759
$$ 221 -2939 4151 -21686 -48044 -24429 6172 52661 92076 68348 50286 70160 33401
11738C3401k5265M604L0105J6218m1686k9083m0643k1630l6130L024N2340Q742
$$ 33401 8136 12740 42845 59063 17377 -11706 -52349 -73979 -110109 -107085 -54745 -46003
11726d6003m8715j8315R2128M299k7153K9383K6263j3253k6449k0871M1752L8474
$$ -46003 -94718 -113033 -20905 -16606 -43759 -14376 11887 -1366 -27815 -48686 -6934 31540
11714C1540n0040k5784M0583J6490N334l659J9638L1588m7938o350j7114J2602
$$ 31540 -18500 -44284 -3701 12789 18123 14464 34102 65690 17752 11402 -5712 6890
11702F890k9502k9595j2199J00803M4254j12465l5349k276J3477L2853j0056j0862
$$ 6890 -22612 -52207 -64406 36397 80651 -31814 -67163 -69439 -55962 -23109 -33165 -44027
11690d4027j2936j104M4612J1691M819l8032J1335K1862j8646J9106J5832K2974
$$ -44027 -56963 -58067 -13455 -1764 3055 -34977 -23642 -1780 -20426 -1320 14512 37486
11678C7486R288j4053K6300n343m9877j6587m018O190p467J742m1382m602J2675
$$ 37486 46774 32721 59021 53678 3801 -12786 -16804 -10614 -18081 -16339 -57721 -62323 -49648
11665d9648M2281j5694M153L2683K1620l3327K6006k1985K2614L852m309J3869
$$ -49648 -7367 -23061 -18908 13775 35395 2068 28074 6089 28703 32555 28246 42115
11653D2115l687l9117m2945J6287K5951N2069L6613J4345p178k1533n4377L9369
$$ 42115 38428 -689 -43634 -27347 -1396 50673 87286 101631 94453 72920 18543 57912
11641E7912K7769j3287Q06J2219p5500m5756L0833J1695L0434k507k7834O614
$$ 57912 85681 72394 73200 85419 9919 -35837 -5004 6691 37125 34618 6784 13398
11629A3398j2921k3831O862L6581M4960J761L5957L7700m0787l2124Q977K3012
$$ 13398 477 -23354 -16492 20089 65049 66810 102767 140467 99680 67556 76533 99545
11617I9545o35k1874O7793k6537J4535R1380L5451K3812Q0045J01548J41342J28700
$$ 99545 98910 77036 144829 118292 132827 224207 259658 283470 363515 465063 606405 735105
11605G35105R2478K7566K2335k5945k9403l2260r9852j77709j36958q4128j9517
$$ 735105 827583 855149 877484 851539 822136 789876 690024 512315 375357 291229 271712
11594B71712n3577l2382j1105m6580R456n1597o6462M682Q784l0239J8310P721
$$ 271712 218135 185753 174648 128068 137524 85927 19465 24147 32931 2692 21002 28723
11582B8723l039n4717Q025O4735L9195j7646l7626r434m1937K6447O458j8083
$$ 28723 25684 -29033 -21008 43727 82922 65276 27650 18216 -23721 2726 9184 -8899
11570h899n3769J0856K1844K6516M5171J5950l984q1859M335J9070j4944L947
$$ -8899 -62668 -51812 -29968 -3452 41719 57669 53685 -28174 -23839 -4769 -19713 -15766
11558a5766J945o495J7122l306N7820o2359k6609J9564K4796O488J838L273M0711
$$ -15766 -13821 -20316 -3194 -6500 51320 -11039 -37648 -18084 6712 13200 15038 18311 59022
11545E9022M3589n5458J0584J7980k2356q736K5906j0620n2221K1306j2328k9772
$$ 59022 102611 47153 57737 75717 53361 44625 70531 59911 7690 28996 16668 -13104
11533a3104o606L3504J9282K5106l4375k0155j4078l315K1127n28j1780J099L5963
$$ -13104 -19710 13794 33076 58182 23807 3652 -10426 -13741 7386 6858 -4922 -3823 32140
11520C2140L4478q92l7427k1762j5019J8161L5774j0182j9012j9193K341M380
$$ 32140 66618 65726 28299 6537 -8482 9679 45453 35271 16259 -2934 -593 3787
11508C787n559j7600n8335O0924L4910M531l1136j4507N3753K9651j4085n0730
$$ 3787 -1772 -19372 -77707 -16783 18127 22658 -8478 -22985 30768 60419 46334 -4396
11496d396k1591L1940k075n168q803o286J4479n265q38K0838J3749M3946K1760
$$ -4396 -25987 5953 3878 -1290 -10093 -16379 -1900 -7165 -8003 12835 26584 70530 92290
11483I2290j2375n121l8408k8155r225J0682n053o065K1372M83j05733l1630K6542
$$ 92290 79915 74794 36386 8231 -994 9688 4635 -1430 19942 20425 -85308 -116938 -90396
11470i0396N0604K5704p127j9801R713J0479M6439Q2581j0479k7985K9589o801
$$ -90396 -39792 -14088 -21215 -41016 -31303 -20824 25615 108196 97717 69732 99321 92520
11458I2520k8991n4285J1582l705J1395O3416M7761K4855J7753K2663k029L159
$$ 92520 63529 9244 20826 17121 28516 91932 139693 164548 182301 204964 202935 206094
11446B06094M9011K20k2612k9743R8980J15386R6818N7415J12236J27189K750
$$ 206094 255105 255325 232713 202970 301950 417336 514154 571569 683805 810994 813744
11435H13744N37J2995K97k1448o0307r6260j45597j64361r1168m2748l0547k6816
$$ 813744 814281 827276 827573 806125 745818 649558 503961 339600 248432 205684 175137 148321
11423A48321j3797J5331l9477l4894J293k8657J8797M576m3333j737J574M938
$$ 148321 134524 149855 110378 75484 76777 48120 66917 71493 28160 26423 27997 32935
11411C2935o0702L0740o388k7065j690M8161O3825j8154j8551j9798j1121K1052
$$ 32935 -27767 2973 -3415 -30480 -32170 15991 79816 61662 43111 23313 12192 33244
11399C3244P298m994J783J7345l0017l5740M9976j2453m0014M0607j0598n128
$$ 33244 40542 35548 37331 54676 24659 -11081 38895 26442 -13572 27035 16437 11309
11387A1309m4637j9263K7241K2342k1798L3902M5726k3011K1137J2552Q738N251
$$ 11309 -33328 -52591 -25350 -3008 -24806 9096 54822 31811 52948 65500 74238 79489
11375G9489k1813k7660o069J7713p441Q893l059j6825r777l2947j8119J4981M969
$$ 79489 57676 30016 23947 41660 34219 43112 40053 23228 13451 -19496 -37615 -22634 -17665
11362a7665j1030K104m3720L0321M2313n587k1837N5050L6351L2401K502l8091
$$ -17665 -28695 -26591 -70311 -39990 2323 -3264 -25101 29949 66300 98701 101203 63112
11350F3112q131r066N305j0635K6653M7991j5843l2261K1936K0630J202m0709
$$ 63112 54981 45915 51220 40585 67238 115229 99386 67125 89061 109691 110893 70184
11338G0184m4277M6476o019m7736P454j226l706Q902J4368l979J6100J203M2397
$$ 70184 25907 72383 66364 18628 26082 24856 21150 30052 44420 40441 56541 57744 100141
11325A00141k888k6275o446l891n4256k1116M934m1354K5664Q0754r902m468l5328
$$ 100141 97253 70978 64532 60641 6385 -14731 -9797 -51151 -25487 55267 45365 40897 5569
11312E569k9487P508l23n0386K1545j7175k5249O2043J0851j3602P51N8425J4091
$$ 5569 -23918 -16410 -16733 -67119 -45574 -62749 -87998 -25955 -15104 -28706 -27955 30470 44561
11299D4561m9766j0213N8500k9743M560K0566k3397L0956L1120l2612j7728n490
$$ 44561 -5205 -15418 43082 13339 17899 38465 15068 46024 77144 44532 26804 21314
11287B1314R786m4839l089J8863M3296L0560l7262j3689j9545l4928O759J4368
$$ 21314 31100 -13739 -16828 2035 45331 75891 38629 24940 5395 -29533 -22774 -8406
11275h406K4752m5257l94J2558K3614K7615N2762K5943M7701K7938Q260L2352
$$ -8406 16346 -28911 -29305 -16747 6867 34482 87244 113187 160888 188826 197086 229438
11263B29438L4903l2575l427J03965J08122J90663J21559q670j03249j74472j64037
$$ 229438 264341 231766 228339 332304 440426 631089 752648 743978 640729 466257 302220
11252C02220j27206l509j7400k7123l2627j0219l0139m9846j1191m1607O17r054
$$ 302220 175014 171505 154105 126982 94355 84136 53997 4151 -7040 -48647 -48030 -57084
11240e7084K1168L0577J1883O0816K84L0801k6366m6840J1054M1671L4494J2450
$$ -57084 -35916 -5339 6544 67360 67644 98445 72079 25239 36293 77964 112458 124908
11228A24908n1429m1662M2253m3625k1912j5580k1653k3662J0617q554L128J3834
$$ 124908 73479 31817 74070 30445 8533 -7047 -28700 -52362 -41745 -50299 -47171 -33337
11216c3337K1050j4128l6666L2192J1504K1122O6027q244o2087K035M810q513
$$ -33337 -12287 -26415 -63081 -30889 -19385 1737 67764 59520 -2567 -532 4278 -4235
11204d235l4398k7345M3873j9543J1517O1359o057L992P967j1628K0106k1887
$$ -4235 -38633 -65978 -22105 -41648 -30131 31228 25171 29163 37130 25502 45608 23721
11192B3721k089M4142N8661J7147j04459J2346M4562P616m1100K0560j2178j6237
$$ 23721 21632 65774 124435 141582 37123 49469 94031 101647 60547 81107 68929 52692
11180E2692L7500j6115j4822L5713K6219k0056m0059J6462k8784m8093N8081M2627
$$ 52692 90192 74077 59255 94968 121187 101131 61072 77534 48750 657 58738 101365
11168A01365O9308P2463L1528K3615J21128P8716Q4174J49164K19533L02478M24480
$$ 101365 170673 243136 274664 298279 419407 498123 582297 731461 950994 1253472 1677952
11157A677952L84587J09844L5463r2389k74013q9517J78429P6865j28105j20365
$$ 1677952 2062539 2172383 2207846 2115457 1841444 1751927 1930356 2007221 1879116 1758751
11147A758751l58472m83241l21741j48188j20033j01633k2544q1579l2806L766
$$ 1758751 1400279 917038 595297 447109 327076 225443 202899 121320 88514 92280
11137I2280M5585M7758m9502k5235L8765L5136l2162l7982l3540r0412O663k3635
$$ 92280 137865 185623 136121 110886 149651 184787 152625 114643 81103 -9309 -2646 -26281
11125b6281J8802K3469K4009J1018r426q7163l0597K8700N6004o010R621J6868
$$ -26281 -7479 15990 39999 51017 41591 -45572 -76169 -47469 8535 2525 12146 29014
11113B9014R743M656k977K1613n8726o4830J2349L9513K7871J6754J9628J6760
$$ 29014 38757 43413 40436 62049 3323 -61507 -49158 -9645 18226 34980 54608 71368
11101G1368j2431L2278p53p2321l1742J3635J5040K7335l35p2401J6317K3600
$$ 71368 58937 91215 90462 18141 -13601 34 15074 42409 42074 -30327 -14010 9590
11089I590K2407L1729K9723L208m796m0601j7165P7892M4882N9758O3858J4510
$$ 9590 31997 63726 93449 96657 91861 51260 34095 111987 156869 216627 280485 294995
11077B94995M7652P7513L957N4957J71090K12131K76198M07610P56544J014861
$$ 294995 342647 420160 424117 479074 650164 862295 1138493 1546103 2302647 3317508
11067C317508N58010k05285q74000j115453o99202m17812j96691r3590q2347m4633
$$ 3317508 3875518 3670233 2796233 1680780 981578 563766 367075 273485 191138 146505
11057A46505n8435o6042r0718l0623J8917L7330M0425O3189J3883j9052K2978
$$ 146505 88070 22028 -68690 -99313 -80396 -43066 -2641 60548 74431 55379 78357
11046G8357Q5435Q0723M0040M5175j8284n809K8692j6359j7426J3961j199J3672
$$ 78357 163792 244515 284555 329730 311446 305637 334329 317970 300544 314505 313306 326978
11034C26978Q325j8415m2846r8309O378O2184K1325k8752k5712M8455L8172p655
$$ 326978 335303 316888 274042 175733 182111 244295 265620 236868 211156 259611 297783 290128
11022B90128J1419p026p0346J6613L7289K1784L2727m5517o073J4339k3330K5245
$$ 290128 301547 294521 224175 240788 278077 299861 332588 287071 280998 295337 272007 297252
11010B97252m8611j8055J8413k7023n6115m8960o75M6214O9037J3395n3407m6154
$$ 297252 248641 230586 248999 221976 165861 116901 116226 162440 231477 244872 191465 145311
10998A45311j6171j7075k3470l7480k7157L1205J1248k6545K9881o1075K8354
$$ 145311 129140 112065 88595 51115 23958 55163 66411 39866 69747 8672 37026
10987C7026M2430n354k780K0561j0172K4586J9123K6048M7744m6061j061k4018
$$ 37026 79456 74102 71322 91883 81711 106297 125420 151468 199212 153151 152090 128072
10975A28072K1217m387L2485J8589k9654J9366J5572Q8034N3569l6567p9061k2412
$$ 128072 149289 144902 177387 195976 166322 185688 201260 289294 342863 306296 227235 204823
10963B04823j4474j304n221k1359J0734j3451k8312K9351l4777J2607N560j4733
$$ 204823 190349 189045 183824 162465 173199 159748 131436 160787 126010 138617 144177 129444
10951A29444o017k9044M207L2786J2524N390l4817k3090j0258K2420k0985m5145
$$ 129444 123427 94383 98590 131376 143900 149290 114473 91383 81125 103545 82560 37415
10939C7415J0707M8262L9635L0562L4272n016j9608L3130o456o7089m053J8188
$$ 37415 48122 96384 136019 166581 200853 195837 176229 209359 202903 135814 131761 149949
10927A49949N5574q785k5969l935j9316k3348l3604L1854l394k4640N4365N0109
$$ 149949 205523 196738 170769 166834 147518 124170 90566 122420 119026 94386 148751 198860
10915A98860r960n9664l7120J2110K8825M0266J5153k8891k3797k584N0756L7650
$$ 198860 188900 129236 92116 104226 133051 173317 188470 159579 135782 133198 183954 221604
10903B21604k856K3954k8631K0291R8255N2059k8955j0873L9702K6714L2531L1111
$$ 221604 218748 242702 214071 234362 332617 384676 355721 344848 384550 411264 443795 474906
10891D74906J04628J11209R1358j604p9770p3564j0907k0969J4970n8121j29318
$$ 474906 579534 690743 782101 780497 700727 627163 616256 595287 610257 552136 422818
10880D22818j97104j47448j65113o9090N1688m663k965R8580O6896q835P2388
$$ 422818 225714 78266 -86847 -155937 -104249 -108912 -111877 -13297 53599 44764 117152
10869A17152L0542P7314J67481Q0982n111j4770j7980J2395n4000j9199J2521
$$ 117152 147694 225008 392489 473471 468360 453590 435610 448005 394005 374806 387327
10858C87327k7723k8860K3741l5048J3726j3123k7733L5125K7738N691k297k233
$$ 387327 359604 330744 354485 319437 333163 320040 292307 327432 355170 360861 358564 356331
10846C56331n739k5422O605J416K364L8307M478J1238k3148j0373J4937J9465
$$ 356331 350592 325170 331775 333191 335555 373862 378340 389578 366430 356057 370994 390459
10834C90459O4419M7705m1041k6409j6036L507O6566M5023J5317q507R051N998
$$ 390459 454878 502583 461542 435133 419097 422604 489170 534193 549510 541003 550054 556052
10822E56052q754K6819K3837Q1464J8224j9085j7216J2498J9608L9527m5554j4174
$$ 556052 547298 574117 597954 679418 697642 678557 661341 673839 693447 732974 687420 673246
10810F73246M1836O7135K7348M4959K3367Q2714O6216L3718L7391N1109L1801
$$ 673246 715082 782217 809565 854524 877891 960605 1026821 1060539 1097930 1149039 1180840
10799A180840N7205M5628M0178N5875Q0120Q5034N0968R2270P1623J14928Q0266
$$ 1180840 1238045 1283673 1323851 1379726 1459846 1544880 1595848 1688118 1759741 1874669 1954935
10788A954935L4556M0644J16276J11662J49100J54557J21798K02916J79177K77648
$$ 1954935 1989491 2030135 2146411 2258073 2407173 2561730 2683528 2886444 3065621 3343269
10778C343269K72775L40149M51884N03273O11378P65606R82110J389416J534791
$$ 3343269 3616044 3956193 4408077 4911350 5522728 6288334 7270444 8659860 10194651
10769A0194651J438770J712130J148874J67094L74647M09811O91555J692338K269017
$$ 10194651 11633421 13345551 14494425 14661519 15036166 15445977 16137532 17829870 20098887
10760B0098887K597558L226039L973357N001794O587175Q196769J0168160J2820588
$$ 20098887 22696445 25922484 29895841 34897635 41484810 49681579 59849739 72670327
10752G2670327J6886602K3818631L5339914N4083656Q1108827Q3678939K6587008
$$ 72670327 89556929 113375560 148715474 202799130 283907957 367586896 394173904
10745C94173904M661201o605486m6575596j6830986L5393798K2030252k3992126
$$ 394173904 398835105 392229619 345654023 328823037 364216835 386247087 362254961
10738C62254961k5795257o8826572r4753218o2582133l3858254j9623199j2514654
$$ 362254961 336459704 267633132 172879914 110297781 76439527 56816328 44301674
10731D4301674q312815n936714m448290l506499k758782j804356j040029j025330
$$ 44301674 35988859 30052145 25603855 22097356 19338574 17534218 16494189 15468859
10723A5468859j211559j127969j479992j545972r48425n50383o35059o16128o64372
$$ 15468859 14257300 13129331 11649339 10103367 9154942 8604559 7969500 7353372 6689000
10714F689000q87481q35242n95066m17531k99027k27239k17543k06248j67832
$$ 6689000 5801519 4966277 4371211 3953680 3654653 3427414 3209871 3003623 2835791
10705B835791j36812j62997j56593j32254j54170j05504j05347j06463j20942
$$ 2835791 2698979 2535982 2379389 2247135 2092965 1987461 1882114 1775651 1654709
10696A654709j33480j13010n8487k3603k6561n2705q705k4908o4131p2348M4916
$$ 1654709 1521229 1408219 1349732 1326129 1299568 1246863 1238158 1213250 1149119 1076771 1121687
10685A121687o0877r1761m9344K6498M9928J0126o7649n6647l6924j146L9844
$$ 1121687 1060810 969049 919705 946203 996131 1006257 938608 881961 845037 843891 883735
10674H83735M1231K4588L1697M3900K9804O3777J76281K49059K74006J39297j2600
$$ 883735 924966 949554 981251 1025151 1054955 1118732 1295013 1544072 1818078 1957375 1944775
10663A944775N2528j07214r9592O7984O4065j0192q7388j75523l14576k47033
$$ 1944775 1997303 1890089 1790497 1858481 1922546 1912354 1824966 1649443 1334867 1087834
10653A087834j13102Q574q963q5387r9391k3775J7870M6873Q4239O7485j02711
$$ 1087834 974732 983306 974343 888956 789565 765790 783660 830533 914772 982257 879546
10642H79546j23800n8997p9089j34634n9499J8730M751J3477K2112j4167q8295
$$ 879546 755746 696749 617660 483026 423527 442257 447008 460485 482597 468430 380135
10631C80135q4943o7708j8319N7390N7701l2417o8625J7230M1693j3501K4560
$$ 380135 295192 227484 209165 266555 324256 291839 223214 240444 282137 268636 293196
10620B93196K4579L239j5475J6335R1230O1291N3768P0728J168K3436j6872K1282
$$ 293196 317775 321014 305539 321874 413104 474395 528163 598891 600059 623495 606623 627905
10608F27905N2249R8300j16628r5163j49563j54630j24703j4937L6179J0214l9540
$$ 627905 680154 778454 661826 566663 417100 262470 137767 122830 159009 169223 129683
10597A29683r3591o1987L4656R7506P7312O2095P2894J09270O120Q2552P2872
$$ 129683 36092 -25895 8761 106267 183579 245674 318568 427838 433958 516510 589382
10586E89382O3184Q2749P7280P0341L7233P7943J51827K72695K23260O4787l0399
$$ 589382 652566 735315 812595 882936 920169 998112 1149939 1422634 1645894 1710681 1680282
10575A680282j46209k13492q0181O7035J81193O5398o3212k70207l20770j96545
$$ 1680282 1534073 1320581 1240400 1307435 1488628 1554026 1490814 1220607 899837 703292
10565G03292l0696k5906l4601J559o031L1351J0478p9252o7572j4736k7525q6162
$$ 703292 672596 646690 612089 613648 607617 638968 649446 570194 502622 487886 460361 374199
10553C74199j2696j9673k9613n8085j5808l9914m8206L8500N8697j8269j5534
$$ 374199 361503 341830 312217 254132 238324 198410 150204 188704 247401 229132 213598
10542B13598p147j912r062K3909m3634J7322k518k4409m3555k6444q8221J2879
$$ 213598 206451 204539 195477 219386 175752 193074 190556 166147 122592 96148 7927 20806
10530B0806M6153J6325p0854q181K4518L5931q21l2003j9696j7132k218J6138
$$ 20806 66959 83284 12430 4249 28767 64698 63877 31874 12178 -4954 -7172 8966
10518H966K6753N399M866j5354K3047J4860N0398K1676k6716j8044J6273O8813
$$ 8966 35719 41118 45984 30630 53677 68537 118935 140611 113895 95851 112124 180937
10506A80937l8940m9894j733j7516l3190K6514K013q9713m5280Q493R169L4041
$$ 180937 141997 92103 90370 72854 39664 66178 68191 -21522 -66802 -58309 -49140 -15099
10494a5099J8142l110K1398N3274L202j0820l2959J8957O7985J149l4697l8519
$$ -15099 3043 -67 21331 74605 77807 66987 34028 52985 120970 122119 87422 48903
10482D8903J8605k106j1795J4501k6614j9742J8189j577l0712n1544o315M2042
$$ 48903 67508 65402 53607 68108 41494 21752 39941 38364 7652 -43892 -50207 -8165
10470h165l6105j1693J01449L2721j812m181n0438j6819J1536j0391o778k4953
$$ -8165 -44270 -55963 45486 78207 76395 72214 21776 4957 16493 6102 -676 -25629
10458b5629k630k0637J2339K0899j1574L0334J405m6536o2064J2660Q114l0910
$$ -25629 -28259 -48896 -36557 -15658 -27232 3102 4507 -42029 -104093 -91433 -83319 -114229
10446a14229P654j074m7525l6291K457N8732N6043O3491Q4764L3751m311N8194
$$ -114229 -106575 -107649 -155174 -191465 -189008 -130276 -74233 -10742 74022 107773 103462 161656
10434A61656M5026J0312j6338K1341O3338J670k8106n2480O00q770M4151m154
$$ 161656 206682 216994 200656 221997 285335 287005 258899 206419 207019 198249 242400 238246
10422B38246n1660m4234l0628K7370N311k6803k8389O2254K6265m1554k5784k9614
$$ 238246 186586 142352 111724 139094 144405 117602 89213 151467 177732 136178 110394 80780
10410H0780j7187L4134k1087m0991p2003m003L3474O9452O657m4587J0510O793
$$ 80780 63593 97727 76640 35649 -36354 -40357 -6883 62569 69226 24639 35149 41942
10398D1942l9154L5754L7278n3991n963L643J9951P341J1799j4867K9993K8020
$$ 41942 2788 38542 75820 21829 15866 19509 39460 46801 58600 43733 73726 101746
10386A01746l8770k8692k0585J9071j7528J952K3003L8158L2018l5138n6987J5953
$$ 101746 62976 34284 13699 32770 15242 17194 40197 78355 110373 75235 18248 34201
10374C4201J4767n8444K1545K6245j4895L206R050j6672J6938J8198j2022l085
$$ 34201 48968 -9476 12069 38314 23419 26625 35675 19003 35941 54139 42117 39032
10362C9032P248k0080k2643M8157m0716L3371N0907M6227M018J8450m157n5236
$$ 39032 46280 26200 3557 51714 10998 44369 95276 141503 145521 163971 159814 104578
10350A04578k5682r169n55k2496M4790J8870L92N2811R4155N6905J4837L1637
$$ 104578 78896 69727 69172 46676 91466 110336 110728 163539 257694 314599 329436 361073
10338C61073M2258R2965Q2500J75455K60777L03099M19863L86875J01053Q159
$$ 361073 403331 496296 578796 754251 1015028 1318127 1737990 2124865 2225918 2234077
10328B234077j10041k24451l3559J79111K2783j18447j04779m31869m95363l04256
$$ 2234077 2124036 1899585 1866026 2045137 2067920 1949473 1844694 1412825 917462 613206
10318F13206j19306o3385q6826o1263k7252j9523k4302n4408n2533L1154K0624
$$ 613206 493900 430515 343689 282426 255174 235651 211349 156941 104408 135562 156186
10307A56186k0619p3235k6003m5551j4132L9943j2065o1704l977J7259L8448K2373
$$ 156186 135567 62332 36329 -9222 -23354 16589 4524 -57180 -61157 -43898 -5450 16923
10295A6923n185l891O640k2128k4744n947K2448J9310M374J4829M8161j5366n6957
$$ 16923 11738 7847 14487 -7641 -32385 -38332 -15884 3426 7800 22629 70790 55424 -1533
10282a533n2931l9986J2128N2900n815l425P106k917k2968J4147M8343m937j4396
$$ -1533 -54464 -94450 -82322 -29422 -35237 -38662 -31556 -34473 -57441 -43294 5049 112 -14284
10269a4284k6679K6610L6505K6657M4032m847n8580n9253k260N0456K9340j1882
$$ -14284 -40963 -14353 22152 48809 92841 87994 29414 -29839 -32099 18357 47697 35815
10257C5815p3867J0410L1950L4055j9265J714K3709k0249l1453j9078j4866j076
$$ 35815 -38052 -27642 4308 38363 19098 20812 44521 24272 -7181 -26259 -41125 -42201
10245d2201M312J7116l6321J2553M1885J9827m632j7130L55k0446j9171k9292
$$ -42201 -37889 -20773 -57094 -44541 -2656 17171 12539 -4591 -4236 -24682 -43853 -73145
10233g3145J5701M1537K3603m5538J8106J3891k774l6706n411q247J9419R851
$$ -73145 -57444 -15907 7696 -37842 -19736 -5845 -8619 -45325 -50736 -58983 -39564 -29713
10221b9713J6309J8046L1352j5673O735L1318k2806K2246L2575j3168o7281l0550
$$ -29713 -13404 4642 35994 20321 27056 58374 35568 57814 90389 77221 9940 -20610
10209b0610M7166K2761j9038J0539p1942j8633L9883K2759L3025k9959k2759m3404
$$ -20610 26556 49317 30279 40818 -31124 -49757 -9874 12885 45910 15951 -6808 -50212
10197e0212k9829r439N2699J0748J6661k1354n277l2578J8168J07151L3050o916
$$ -50212 -80041 -89480 -36781 -26033 -9372 -30726 -36003 -68581 -50413 56738 89788 82872
10185H2872j7780k1443K5220K9584k3510j53J7085l1068o3336k5225K0967J6221
$$ 82872 65092 43649 68869 98453 74943 74790 91875 60807 -2529 -27754 -6787 9434
10173I434L8273J2840l6345N731L6132J637k1399l8607k9895k9461Q758K6171
$$ 9434 47707 60547 24202 29933 66065 67702 46303 7696 -22199 -51660 -42902 -16731
10161a6731k4018n7157j9481K4590k1920L6502J01943R2027l9589r6000n3624
$$ -16731 -40749 -97906 -117387 -92797 -114717 -78215 23728 115755 76166 -19834 -73458
10150g3458j1641O1814J1967K4588m0820o3656K0052K9178L9062M886k1678r873
$$ -73458 -85099 -23285 -11318 13270 -27550 -91206 -71154 -41976 -2914 1972 -19706 -29579
10138b9579M2353J0766L9737M892l5744j1800l4581k2379J3249k5286L0178J6786
$$ -29579 12774 23540 63277 68169 32425 20625 -13956 -36335 -23086 -48372 -18194 -1408
10126a408o873K1732k5513k4881M3604j6815m6893j3944J6478M5613Q369j5528
$$ -1408 -8281 13451 -12062 -36943 6661 -10154 -57047 -70991 -54513 -8900 -531 -16059
10114a6059R406k8168o458M836m1096j3752O1411K0875k3265J082K3527k6354
$$ -16059 -6653 -34821 -41279 -36443 -77539 -91291 -29880 -9005 -32270 -31188 -7661 -34015
10102c4015K019j714O937m5756J8213N4073J01761n4638q437m7955l404K4427
$$ -34015 -31996 -33710 -26773 -72529 -54316 -243 101518 46880 38443 -9512 -12916 11511
10090A1511N1681R446j6838L9308m0930n5132K7339m4252L6021J1841M5555j5541
$$ 11511 63192 72638 55800 95108 54178 -954 26385 -17867 18154 29995 75550 60009
10078F0009o9077o0525L137K0435J2013m020N2323k9482J7627j626j6754k5368
$$ 60009 -9068 -69593 -66456 -46021 -34008 -38028 14295 -15187 2440 814 -15940 -41308
10066d1308k970Q685j9984K8637K9407o3661j0045M1186K4428j3178K0764L2131
$$ -41308 -44278 -35593 -55577 -26940 2467 -61194 -71239 -30053 -5625 -18803 1961 34092
10054C4092p55J2374L6036J4271l3033J681K7354l7911k3631p6833l4205N1107
$$ 34092 33337 45711 81747 96018 62985 64666 92020 54109 30478 -46355 -80560 -29453
10042b9453K1373M1198L108m1616j6703k3926J4435p119k5609K9864M9067L0534
$$ -29453 -8080 33118 36226 -5390 -22093 -46019 -31584 -38703 -64312 -34448 14619 45153
10030D5153j6682k2680n929m7440l7538J4621K4887K4998Q31k0620j962J317k1767
$$ 45153 28471 5791 -138 -47578 -85116 -70495 -45608 -20610 -19779 -40399 -42361 -41044 -62811
10017f2811q234O964J3484m592L4048M0706j1158O731J3041M7215K4938l0061
$$ -62811 -71045 -64081 -50597 -55189 -21141 19565 8407 15138 28179 75394 100332 70271
10005G0271j2216J2116m2177r9697j9083L2931M5372O4220j3473l1564j834L4057
$$ 70271 58055 70171 27994 -71703 -90786 -57855 -12483 51737 38264 6700 4866 38923
9993C8923j2351k9354L4154J0291m8069k8488l13k664k3105J7426L4508K3613
$$ 38923 26572 -2782 31372 41663 -6406 -34894 -35207 -37871 -60976 -43550 -9042 14571
9981A4571J2913K5254R816j4505j3319l2147J9092K6847l5353n4783K4886j3724
$$ 14571 27484 52738 62554 48049 34730 2583 21675 48522 13169 -41614 -16728 -30452
9969c0452K2858K8483m384k8919r088K582n042J2404K1519j2146K5688M3630j1243
$$ -30452 -7594 20889 16505 -12414 -21502 -18920 -23962 -11558 9961 -2185 23503 67133 55890
9956E5890j0947j1841l0862J3016q264O4274K9235q6214m7362K5255M7432K5827
$$ 55890 44943 33102 2240 15256 6992 71266 100501 14287 -33075 -7820 39612 65439
9944F5439k4250j7257m9855M141L0659R654J8895j0214k0785m1227j6231M6004
$$ 65439 41189 23932 -25923 -21782 8877 18531 37426 27212 6427 -34800 -51031 -5027
9932e027L1234K1448Q925k4034j9548K8595K5722o456l2903n6719l4873j033J8419
$$ -5027 26207 47655 56580 32546 12998 41593 67315 60859 27956 -28763 -63636 -64669 -46250
9919d6250N7862j9516l2842k4909j1932L8626j1611L0654k5268n0829k3070L6987
$$ -46250 11612 -7904 -40746 -65655 -77587 -38961 -50572 -19918 -45186 -96015 -119085 -82098
9907h2098K6223q999J3712L2371K5175J6805J5918k9628K123Q7262M3411L6833
$$ -82098 -55875 -64874 -51162 -18791 6384 23189 39107 9479 11602 98864 142275 179108
9895A79108n4380k1723O822n8435m9519K132k654n699L1654N9376O180k8878l2101
$$ 179108 124728 103005 109827 51392 1873 4005 1351 -4348 27306 86682 92862 63984 31883
9882C1883k0085L712J706J4289m380l1875O255j1012l5065n3917Q799L3409K4517
$$ 31883 11798 15510 17216 31505 27125 -4750 1505 -9507 -44572 -98489 -89690 -56281 -31764
9869c1764J9729N8100N790m0026l8855K5695M0418m720L074K6202J2548M2050
$$ -31764 -12035 46065 51855 11829 -27026 -1331 39087 34367 37441 63643 76191 118241
9857A18241J3567n0492m4979j0874K0938L3395q191J77L3634N0114k6695o8187
$$ 118241 131808 81316 36337 25463 46401 79796 71605 71782 105416 155530 128835 60648
9845F0648k4751K1309L7704J7487k7792l0888K6710R149p2312l1641K0171N5488
$$ 60648 35897 57206 94910 112397 84605 53717 80427 89576 17264 -14377 5794 61282
9833F1282K0002p5038J2457K2894j8266k0643M29O665k1571m7188l8878J2164
$$ 61282 81284 6246 18703 41597 23331 2688 3117 9782 -11789 -58977 -97855 -85691
9821h5691K0498M6630P364O2384R597n207n8548q867L1229j5646j7710K8674j4025
$$ -85691 -65193 -18563 -11199 51185 60782 55575 -2973 -11840 19389 3743 -13967 14707 682
9808F82j4777M2062K4112K8255N5289J7609k0819L0334n9862l1202L287l5356
$$ 682 -14095 27967 52079 80334 135623 153232 132413 162747 102885 71683 74970 39614
9796C9614n5424J6381j3121k5539M6716K6641J5919l0205J1178m2500o9291J7702
$$ 39614 -15810 571 -12550 -38089 8627 35268 51187 20982 32160 -10340 -79631 -61929
9784f1929Q4131N8374j0879n5572m2536M6593j0322l834N4501M075n896k0055
$$ -61929 22202 80576 69697 14125 -28411 18182 7860 4026 58527 62602 56706 36651
9772C6651M56m770k961J4327o9732n823N5007L8805k7918j8369M5876J5115J906
$$ 36651 37107 32337 29376 43703 -26029 -31852 23155 61960 34042 15673 61549 76664 78570
9759G8570k0731l3232q650J7288P644N9883O075l5732K4568j1124j3100k6133
$$ 78570 57839 24607 15957 33245 40889 100772 106847 71115 95683 84559 71459 45326
9747D5326J1731k2187m7481L3368k8768M660N8849K3232j9080l9424j2070J4282
$$ 45326 57057 34870 -12611 20757 -8011 -3351 55498 78730 59650 20226 8156 22438
9735B2438O907J6021m14m5555J6851Q762K3211J3700J4515J2237p448J5299L3086
$$ 22438 29345 45366 44952 -603 16248 25010 48221 61921 76436 88673 81225 96524 129610
9722A29610l3319J7782M7917J8907j1762o95j7605k0867j2967j2117J196P803
$$ 129610 96291 114073 161990 180897 169135 168440 150835 129968 117001 104884 106080 113883
9710A13883l7245l8883m34N3200N4888k3461o1799n038k4178K0209J5609m7818
$$ 113883 76638 37755 37321 90521 145409 121948 60149 55111 30933 51142 66751 18933
9698A8933J2320K2945M6744L240K2670N3779n1604k5340l7254k675J6761M2836
$$ 18933 31253 54198 100942 104182 126852 180631 129027 103687 66433 63758 80519 123355
9686A23355R572R750N9328J4844l4640n0651m9361l68K5125M2257L478k6139p9945
$$ 123355 132927 142677 202005 216849 182209 131558 82197 81829 106954 149211 152689 126550 46605
9673D6605J1019P0221K4280q35k4960j0575N3391q577j102K5085K4171J1398J5567
$$ 46605 57624 127845 152125 151290 126330 115755 169146 160569 159467 184552 208723 220121 235688
9660B35688k3671O597L230m566J0133M2624J134O6698j5776m6469r706J8924j6892
$$ 235688 212017 218614 221844 217278 227411 270035 271169 337867 322091 275622 265916 284840 267948
9647B67948L6021L9283M1034q973m9213l8685L7686j6021j466j442L6538M4472
$$ 267948 303969 343252 384286 375313 326100 287415 325101 309080 307614 306172 342710 387182
9635C87182J7742J1943K898L2829K3561J3057N8104K2901L8527J317O659O694
$$ 387182 404924 416867 419765 452594 476155 489212 547316 570217 608744 610061 616720 623414
9623F23414r273J1277R234K8099N3450M8110L2766M2022M5022O4371O9873P9110
$$ 623414 614141 625418 634652 662751 716201 764311 797077 839099 884121 948492 1018365 1097475
9611A097475K6972M2416R6606R3188Q1202N1734P1783Q1182N8605P5478J24855
$$ 1097475 1124447 1166863 1263469 1356657 1437859 1489593 1561376 1642558 1701163 1776641 1901496
9600A901496J93271J22952J00843J39167J99667J56270J57691J19866K32875K62063
$$ 1901496 2094767 2217719 2318562 2457729 2657396 2813666 2971357 3091223 3324098 3586161
9590C586161J86072K48478L20355K67505K98417L04952K87331K90997L04125K64257
$$ 3586161 3772233 4020711 4341066 4608571 4906988 5211940 5499271 5790268 6094393 6358650
9580F358650K54329K45905K26648K08768J19397P8546M6174p7668j89081j77766
$$ 6358650 6612979 6858884 7085532 7294300 7413697 7492243 7538417 7460749 7271668 7093902
9570G093902k10634k42580l21814l28484l21335k64786l28425l36302l07959k96995
$$ 7093902 6883268 6640688 6318874 5990390 5669055 5404269 5075844 4739542 4431583 4134588
9560D134588k49588k50913k25810j42356j72522k08051j71742k13641k12221j36187
$$ 4134588 3885000 3634087 3408277 3265921 3093399 2885348 2713606 2499965 2287744 2151557
9550B151557j25219j08977q8421r0760r5081j00018j39391p6417o9844m3218p0488
$$ 2151557 2026338 1917361 1828940 1738180 1643099 1543081 1403690 1327273 1257429 1214211 1143723
9539A143723j12082n0851k4806j6982k0096m8660m2369M30N303m62m7559m3690
$$ 1143723 1031641 980790 955984 939002 918906 870246 827877 828307 833610 833148 785589 741899
9527G41899j7841j5532n5145j15869M543k6059j0234k8609m7894J2873k5050N783
$$ 741899 724058 708526 653381 537512 542055 515996 505762 477153 429259 442132 417082 422865
9515D22865K6991n094o7296q113N099l5305o539l6766J5619M4635K5172j6189
$$ 422865 449856 444762 377466 369353 374452 339147 332608 295842 311461 356096 381268 365079
9503C65079o6337l0311K2028J3002l1555J2995M2898j702k5434j6693l215l5858
$$ 365079 298742 268431 290459 303461 271906 284901 327799 326097 300663 283970 280755 244897
9491B44897l3987k2566j6436m1235m9338J2728L5745P8753O023J7049J0807J5631
$$ 244897 210910 188344 171908 130673 81335 94063 129808 208561 214584 231633 242440 258071
9479B58071k1937n4323q37K8005J233Q253M021J3784M580p569O541l6085k8107
$$ 258071 236134 181811 180974 208979 210212 218465 222486 236270 240850 233281 239822 203737 175630
9466A75630j9584l887r330j2235k4645n024L4602o608L6802J0338j8082k6773
$$ 175630 156046 152159 142829 130594 105949 100925 135527 128919 165721 176059 157977 131204
9454A31204M1090r854J746n514L2019j8334n9648k5206L0314J8647K5263j7966
$$ 131204 172294 162440 164186 158672 190691 172357 112709 87503 117817 136464 161727 143761
9442A43761m9926q098J8301l3334n85K7142l2809k9646m4550l3649K0906L0334
$$ 143761 93835 85737 104038 70704 70119 97261 64452 34806 -9744 -43393 -22487 7847
9430G847k5815J4255J8759L8257M3798K6250p776m7164j6684K1325M11M081K9171
$$ 7847 -17968 -3713 15046 53303 97101 123351 115575 68411 51727 73052 73463 77544 106715
9417A06715J5502J3204m7335l3704R766j4250k563j9948j9169N7880L9574j6840
$$ 106715 122217 135421 88086 54382 64148 49898 47335 27387 8218 66098 105672 88832
9405H8832m5651k7724J0421J8389L820o432k0760J2030K491P4753N3941m6249
$$ 88832 43181 15457 25878 44267 48087 41655 20895 32925 35416 110169 164110 117861
9393A17861o689m6068k7324J8875K0285m6175k8495L5579M927m88J5687q111k4178
$$ 117861 111172 65104 37780 56655 76940 30765 2270 37849 42776 42288 57975 49864 25686
9380B5686K5569o915K4640K5517m7129o9184L4039K2182K0315K9646m207k5978
$$ 25686 51255 44340 68980 94497 47368 -21816 12223 34405 54720 84366 80159 54181
9368E4181k9386k5089p199j1691m858J8945N4100k2311j6306N8501J1118j5065
$$ 54181 24795 -294 -7493 -19184 -24042 -5097 49003 26692 10386 68887 80005 64940
9356F4940l729J3131Q495J5324k8449j2290J1269l9210J9967N6906m424J1849
$$ 64940 61211 74342 82837 98161 69712 57422 68691 29481 49448 106354 101930 113779
9344A13779k5943m8786n1058K0192M7941j774p130O924j6899o062j1517K2920
$$ 113779 87836 39050 -12008 8184 56125 54351 47221 54145 37246 31184 19667 42587
9332D2587N9611k9369p4606m8282l40L7554Q6423N5166J3648m699o328L0718j0810
$$ 42587 102198 72829 -1777 -50059 -50399 -12845 73578 128744 142392 137693 131365 162083 151273
9319A51273m4484K0796m5806k3645r247k3555r628L4504p628J369k6922l6752
$$ 151273 106789 127585 81779 58134 48887 25332 15704 50208 42580 43949 17027 -19725
9307a9725M9652J6981l5849k452j5692m7247j6159j4976M3213M8593K1641l523
$$ -19725 29927 46908 11059 8607 -7085 -54332 -70491 -85467 -42254 6339 27980 24457
9295B4457N9932P837p81k1348K1588m0570n0060K9562J77j1780j221L8874K5752
$$ 24457 84389 92226 91445 70097 91685 51115 1055 30617 30794 19014 17793 56667 82419
9282H2419k5732l377n7464r556J4927L58q618o629M5610L4253L989K5976p0885
$$ 82419 56687 53310 -4154 -13710 1217 1575 -7043 -13672 31938 66191 70180 96156 25271
9269B5271k4619L8164o876J1829L787m8687l6249N7453L5740L6544J6071K2173
$$ 25271 652 38816 31940 43769 47556 -1131 -37380 20073 55813 92357 108428 130601
9257A30601k7354n2481K977J5602K0261k8395k5935m1542k7047L6026l3548J8530
$$ 130601 103247 50766 53743 69345 89606 61211 35276 -6266 -33313 2713 -30835 -12305
9245a2305L3480l6795l6585k112N5157O1700r944j4584K78m608L3479j5392o107
$$ -12305 21175 -15620 -52205 -54317 840 62540 52596 38012 38290 33682 67161 51769 45662
9232D5662M3190L0137m0369p9687n3818m46q740N195P5481M4227l4029k9746J0181
$$ 45662 88852 118989 78620 -1067 -54885 -55331 -64071 -58876 16605 60832 26803 -2943 7238
9219G238k6894j032K8535L2041j0374m2290J280j976q2571K5223M3212j2177j1244
$$ 7238 -19656 -20688 7847 39888 29514 -12776 -11496 -13472 -96043 -70820 -27608 -39785 -51029
9206e1029K3702M3895J4780k0290l3110M236p148l83J3129m022L0192l7740j3308
$$ -51029 -27327 16568 31348 11058 -22052 -17816 -24964 -25347 -12218 -16240 13952 -23788 -37096
9193c7096K5978j2401l488J3625J0093K7697K4710m0213p036P244l9779r739O7460
$$ -37096 -11118 -23519 -27007 -13382 -3289 24408 49118 8905 1869 9113 -30666 -40405 27055
9180B7055j6307J0026K9609M971m4183m499J4422J159J0084M5849L6427N342l6845
$$ 27055 10748 20774 50383 55354 11171 6672 21094 22253 32337 78186 114613 119955 83110
9167H3110m1227O446O717k6000q274K4507J4780K6360k4000r2821k8819M8980
$$ 83110 41883 48329 55046 29046 20772 45279 60059 86419 62419 -30402 -59221 -10241
9155a0241l9298Q522P3659O1787k1955n1287j5811J6333L8401n9921n8141m3907
$$ -10241 -49539 -41017 32642 94429 72474 21187 5376 21709 60110 189 -57952 -101859
9143a01859J0355N9783K5890k6457r811j8687O262K8795L0581J6296l9364j1704
$$ -101859 -91504 -31721 -5831 -32288 -42099 -60786 -54524 -25729 4852 21148 -18216 -29920
9131b9920R2979M3182q0672l9506N27K8984J6983M2811k9016j2579K1897O626
$$ -29920 63059 106241 25569 -13937 -13410 15574 32557 75368 46352 33773 55670 62296
9119F2296L7218j2233j6356j3240l4766M1967J1832K9012J1703K137j8449m3767
$$ 62296 99514 87281 70925 57685 22919 64886 76718 105730 117433 119570 101121 57354
9107E7354m2945l5296K7134M2330J8064L2671k4201k2041J3559l3126j20258N1276
$$ 57354 14409 -20887 6247 48577 66641 99312 75111 53070 66629 33503 -86755 -35479
9095c5479M2172k1326P897O440P475M215K2140k8715J6459K8409k7830k9155l002
$$ -35479 6693 -14633 -6736 -296 7179 11394 33534 4819 21278 49687 21857 -7298 -10300
9082a0300n0041l1300L4859L9711L0161O5879J9936m7666p100j3738j5489J4027
$$ -10300 -60341 -91641 -56782 -17071 13090 78969 98905 51239 44139 30401 14912 28939
9070B8939J9655J9860J6853l7483r669k5979j41L2372J8060K294l0257j1223m147
$$ 28939 48594 68454 85307 47824 38155 12176 12035 44407 62467 64761 34504 23281 19134
9057A9134j8909J2035j0487K692J9556j5036n6604l1792N394L3614J6766R404
$$ 19134 225 12260 1773 4465 24021 8985 -47619 -79411 -74017 -40403 -23637 -14233
9045a4233J8793K2994N120O9875P9129M5811k7091m3701j9395j9627k1056j8172
$$ -14233 4560 27554 32674 102549 181678 227489 200398 156697 137302 117675 96619 78447
9033G8447N9736L7841N3573Q6410Q4951M4857k8062r7378j18813j8843j9474l7909
$$ 78447 138183 176024 229597 316007 400958 445815 417753 320375 201562 182719 163245 125336
9021A25336R314Q7178N7565N200p7264m6822j7670j4814m7991k0164k7570k3691
$$ 125336 134650 221828 279393 284593 207329 160507 142837 128023 80032 59868 32298 8607
9009H607K599n043k9617K337K9041J6040J2930M4429q583j2593k903M0236r941
$$ 8607 11206 6163 -23454 -21117 7924 23964 36894 81323 72740 60147 57244 97480 87539
8996H7539j517q638K2859J6445M3456J2089l0853L5134k808M1698M1833O8843
$$ 87539 86022 77384 100243 116688 160144 172233 141380 176514 173706 215404 257237 326080
8984C26080J76332K28135n1705j96718j40588p4683K0201M3308P5517J38306J12527
$$ 326080 502412 730547 678842 482124 341536 266853 287054 330362 405879 544185 656712
8973F56712j68448k39912q8577m4523o136k1581M350j8527P047r12k2214p246
$$ 656712 488264 248352 159775 115252 109116 87535 91885 73358 80405 79493 57279 50033
8961E0033O927P643o167N5582J5766n6693p6303Q269L4521l159M3453L6028k2229
$$ 50033 56960 64603 58436 114018 129784 73091 -3212 5057 39578 36419 79872 115900 93671
8948I3671m7031L3496M5275J6296L614K7694j7162N3750P8434N0407J8225L7324
$$ 93671 46640 80136 125411 141707 145321 173015 155853 209603 288037 338444 356669 393993
8936C93993l7792k9826k2494K7216M6862J25012R1926N6025J1945l0640P374J29898
$$ 393993 356201 326375 303881 331097 377959 502971 594897 650922 662867 632227 639601 769499
8924G69499K65227L53885N29925P43435P74843k41898j079702q02505m88398k17512
$$ 769499 1034726 1388611 1918536 2661971 3436814 3194916 2115214 1312709 824311 606799
8914F06799j50998j05486o9188k9472k7757m4408J1583N3707k9753p4048l1710
$$ 606799 455801 350315 281127 251655 223898 179490 191073 244780 215027 140979 109269
8903A09269J3675p80j586M491J9377K7799M0348p0144j3006L3818K0982O2756
$$ 109269 122944 122164 120578 125069 144446 172245 212593 142449 129443 163261 184243 246999
8891B46999J343k6792L9357P0324R8594P5122L2111J09610J64510J09763J21287
$$ 246999 248342 221550 260907 331231 429825 504947 537058 646668 811178 920941 1042228
8880A042228K72672M06719O22658J027798J667884J764496j71093k218994j768682
$$ 1042228 1314900 1721619 2344277 3372075 5039959 6804455 6633362 4414368 2645686
8871B645686r75652n48750l46374j95130j71383q2861l0142J8106Q401k1381k1715
$$ 2645686 1670034 1121284 774910 579780 408397 325536 295394 313500 321901 300520 278805
8860B78805L748o5539p2890l2955N7693L6370R2616K6059o3736j0942p592K2538
$$ 278805 282553 217014 144124 111169 168862 205232 297848 323907 260171 249229 241637 264175
8848B64175K0784L4850O5484M9754J06848J23937N00l4218o0307p6094L6630P7532
$$ 264175 284959 319809 385293 435047 541895 665832 666332 632114 571807 495713 532343 609875
8836F09875K8131J01140J34469K21725M49673P72664Q97715J61098r41359r84320
$$ 609875 638006 739146 873615 1095340 1545013 2317677 3215392 3376490 2435131 1450811
8826A450811n29315k65811j51139o3982o2605l0020n3735p3377n8969j5420Q556
$$ 1450811 921496 655685 504546 440564 377959 347939 294204 220827 161858 146438 154994
8815A54994j6508L5985k881p5464l5533M1912P042J2803K6969M2775j5J6388K5208
$$ 154994 138486 174471 171590 96126 60593 102505 109547 122350 149319 192094 192079 208467 233675
8802B33675N3152J28408J07304Q8072K33048J55470j83518k81838j95625p7657
$$ 233675 286827 415235 522539 610611 843659 999129 815611 533773 338148 260491
8792B60491m4036p4890l5284O2453K0356o8317Q994K7066N6524K4796o1329l441
$$ 260491 216455 141565 106281 168734 189090 120773 129767 156833 213357 238153 176824 173383
8780A73383N0407O6260l7146j5705O0238J62373J96060J50603j4069k00060k25663
$$ 173383 223790 290050 252904 237199 297437 459810 655870 806473 792404 592344 366681
8769C66681q4780O061m2262m0260j2263n1291j7674m1897k4125j9874M3152N2688
$$ 366681 281901 287962 245700 205440 193177 141886 124212 82315 58190 38316 81468 134156
8757A34156M3386N3335Q0258N2957J4192N5354o8197r8876p8696l0366k7745r633
$$ 134156 177542 230877 311135 364092 378284 433638 365441 266565 187869 157503 129758 120125
8745A20125L7600j5827j4781N985k828K6776L497j629j7323K6446N8469J05087
$$ 120125 157725 141898 127117 133102 130274 157050 160547 158918 141595 168041 226510 331597
8733C31597Q4864N9855Q1050K40583L87300L52302j73419n05059l71017k15918
$$ 331597 416461 476316 557366 797949 1185249 1537551 1364132 859073 488056 272138
8723B72138m7485o4294o6559P816p644k0108p1086P908K6870Q058L8377q399j5406
$$ 272138 224653 160359 93800 101616 93972 73864 2778 10686 37556 45614 83991 75592 60186
8710F0186j1384R091J7321K9019J9110n2605N356j3776m5494o410M5417J7801
$$ 60186 48802 57893 75214 104233 123343 70738 76094 62318 16824 10414 55831 73632
8698G3632k349j7433k76J5058J2604J7865k4666j0918N6889L4412k065N0564J15613
$$ 73632 71283 53850 53574 68632 81236 99101 74435 63517 120406 154818 152753 203317 318930
8685C18930J42855J34275J49301o1374k81214j91590j23863n4833j4778k7254
$$ 318930 461785 596060 745361 683987 402773 211183 87320 32487 17709 -9545
8675i545K7319L8234Q084l9301j3702J2446k7296k984j2821k8925p153J4315k2704
$$ -9545 17774 56008 64092 24791 11089 23535 -3761 -6745 -19566 -48491 -55644 -41329 -64033
8662f4033N897R903N5782r260J706L1732k1948k7898J2839K0486k9826K9506k456
$$ -64033 -58136 -48233 7549 -1711 -5 31727 9779 -18119 -5280 15206 -14620 14886 12430
8649A2430k9561k397Q913L1674P6076n8441l1454M5578P872M756m8812j2149M3278
$$ 12430 -17131 -19528 -10615 21059 97135 38694 7240 52818 60690 65446 16634 4485 47763
8636D7763J7884O506K0513j9315J4060j187L2182M3092n2111p5000m6393Q533
$$ 47763 65647 72153 92666 73351 87411 86224 118406 161498 109387 34387 -12006 -3473
8624c473N7127k6817m208L7906j7350K1291k9000L0589K6762K509J6640K080l629
$$ -3473 53654 26837 22629 60535 43185 64476 35476 66065 92827 95336 111976 114056 110427
8611A10427r077k6884p9060J8569N8904L0504n19L0972J1930Qq812O266N0451
$$ 110427 101350 74466 -4594 13975 72879 103383 102864 133836 145766 145774 136962 143228 193679
8598A93679k212J6154j3933L9494j5479k2868p250K3777k3959q3961m6485K0397
$$ 193679 191467 207621 193688 233182 217703 194835 187585 211362 187403 103442 56957 77354
8586G7354L9442O8894J0421n3453k7704l5730l8568o7093L729L2060L7136P9463
$$ 77354 116796 185690 196111 142658 114954 79224 40656 -26437 -22708 9352 46488 125951
8574A25951o434J0572l4152k0275k2313M29J4l3442n2176k4843M427K5223j7745
$$ 125951 119517 130089 95937 75662 53349 53778 53792 20350 -31826 -56669 -52242 -27019 -44764
8561d4764L2300K1470k9626k3892O2034J6688l7468k8497K2108L9253K6051K46
$$ -44764 -12464 9006 -20620 -44512 17522 34210 -3258 -31755 -9647 29606 55657 55903
8549E5903m5551l0654j300M1434K3519L0351k3506O209J5375k0916l7430l3049
$$ 55903 10352 -20302 -21602 19832 43351 73702 50196 56405 71780 50864 13434 -19615
8537a9615R269j9487J7954Q247j4217J3919j2996n5503k6726L3598k546M1388
$$ -19615 -10346 -29833 -11879 -3632 -17849 -3930 -16926 -72429 -99155 -65557 -68103 -26715
8525b6715R5436R4782l8179j02643R266M964j0808J1332q504m5600j682K7850
$$ -26715 68721 163503 125324 22681 31947 36911 26103 37435 28931 -16669 -18351 9499
8513I499j7188L3042L8615J6879p493o5818J1029j2553j7482K0997J8400K4252
$$ 9499 -7689 25353 63968 80847 73354 7536 18565 6012 -11470 9527 27927 52179
8501E2179m348o3095l3064J6169j2892k73j195N3097J6624k1707m0070j469M714
$$ 52179 47831 -15264 -48328 -32159 -45051 -45324 -46519 6578 23202 1495 -38575 -40044 -35330
8488c5330j8945j4304L3768k182l207o862L3306M830l0578l8309L7109K4436J6894
$$ -35330 -54275 -68579 -34811 -36993 -40200 -47062 -13756 -8926 -39504 -77813 -40704 -16268 626
8475F26L377n547r745L1794M874p0192J8435L7310l5013K4644k7449j5233J5102
$$ 626 4003 -1544 -11289 20505 25379 -44813 -26378 10932 -24081 563 -26886 -42119 -27017
8462b7017J3025o798J9161K4080L612j1174p267j3500j6987K458O1352k3415k3624
$$ -27017 -13992 -20790 -1629 22451 26063 14889 7622 -5878 -22865 -20407 40945 17530 -6094
8449f094K7277J7204M166P7013n8260j06426k3078P054Q410K1974L538Q838k4444
$$ -6094 21183 38387 42553 119566 61306 -45120 -68198 -61144 -52734 -30760 -27222 -18384 -42828
8436d2828K2823Q267o606l9134L9071O0135k5577k2065m8269j8884l9268k485
$$ -42828 -20005 -11738 -18344 -57478 -18407 41728 16151 -5914 -54183 -73067 -112335 -114820
8424a14820J8107q115M7802N7134L2004N4963K4724k9660n9731L5230q066k0186
$$ -114820 -96713 -104828 -57026 108 32112 87075 111799 82139 22408 57638 49572 29386
8412B9386l9305l2926n8103l2616K2472J04851M8909j2050l7074J3824k2442j5157
$$ 29386 -9919 -42845 -100948 -133564 -111092 -6241 42668 30618 -6456 7368 -15074 -30231
8400c0231M252j37j3344m068K6000m102K8333N4824qn238O59o2665m5102J5142
$$ -30231 -25979 -26116 -39460 -43528 -17528 -21630 6703 61527 61519 56281 56940 -5725 -50827 -35685
8386c5685J8962K424p435n292J694K2256J7829m593k1207J120l2224j5764K5430
$$ -35685 -16723 -14299 -21734 -27026 -25332 -3076 14753 10160 -11047 -9927 -42151 -57915 -32485
8373c2485K0495n116L1953L4897l027o6287n6412j0354N8522k340M3906M6827
$$ -32485 -11990 -17106 14847 49744 46717 -19570 -75982 -86336 -27814 -30154 13752 60579
8361F0579j3273m666m3440J8552O7039n0386j02839l9420j3178M2492L258K3999
$$ 60579 47306 42640 -800 17752 84791 34405 -68434 -107854 -121032 -78540 -75282 -51283
8349e1283L987O94K681R365M0977o907l2272K2952l441J044p013P184P490k2177
$$ -51283 -47296 -46602 -43921 -34556 6421 -486 -32758 -9806 -13247 -12203 -19216 -12032 -4542 -26719
8335b6719m655P937l6652k298j7968K7896O5748k1537m3791K5259J9482P4689
$$ -26719 -31374 -23437 -60089 -62387 -80355 -52459 13289 -8248 -52039 -26780 -7298 67391
8323F7391k527j5391j8077n5082j860J2672M725j4759j3980L7697J0096j4066
$$ 67391 64864 49473 31396 -23686 -25546 -12874 -8149 -22908 -36888 809 10905 -3161
8311c161K3529l283q161K0531K0584j4261m5378J0799P4523L6344p8202O14l6493
$$ -3161 20368 17085 8924 29455 50039 35778 -9600 1199 75722 112066 33864 34478 -2015
8298b015l4884p44P611L1552J8777j363R205J2169J3981N4638k2016k0408k5922
$$ -2015 -36899 -37643 -30032 1520 20297 18934 28139 40308 54289 108927 86911 66503 40581
8285D0581p0343j0581P3302L2861J4413O063l0418m2245J337Q003j7950q910J6348
$$ 40581 -29762 -40343 32959 65820 80233 86296 55878 13633 14970 22973 5023 -3887 12461
8272A2461K5428l4860J7747j7927J7271L4471R306l3906m1518P600j9133p033
$$ 12461 37889 3029 20776 2849 20120 54591 63897 29991 -11527 -3927 -23060 -30093
8260c0093K8295J6494k6033l1791m279J7672J7759L5807K71j3363L6348j7848
$$ -30093 -1798 14696 -11337 -43128 -47407 -29735 -11976 23831 24102 10739 47087 29239
8248B9239j0163K6773j7631k0549j2311K200J9163n152N743J8532n740k6601j7977
$$ 29239 19076 45849 28218 7669 -4642 -2442 16721 11569 17312 35844 30104 3503 -14474
8235a4474J9641O526l11J5508j4744l5458J8359L7330M6694l0572K2396R257k7454
$$ -14474 5167 11693 11382 26890 12146 -23312 -4953 32377 79071 48499 70895 80152 52698
8222E2698l9012o279J7850J1758m6315K173O4802K1356M8349J5418k2142j2947
$$ 52698 13686 7407 25257 37015 -9300 -7127 57675 79031 127380 142798 120656 107709
8210A07709J092l6042n447N318j0979n8008j2973Q219o560K0396L4836j3041L4295
$$ 107709 108801 72759 67312 72630 61651 3643 -9330 -1111 -7671 12725 47561 34520 68815
8197F8815J2221r560n0858R806r259l455j0766K3679N4940K4047j2226n6728j4281
$$ 68815 81036 71476 20618 30424 21165 17710 6944 30623 85563 109610 97384 40656 26375
8184B6375J5430O849j3191J0825M972n3810j2198M3153L4197k5j1922J7718j5800
$$ 26375 41805 48654 35463 46288 51260 -2550 -14748 28405 62602 62577 50655 68373 52573
8171E2573J401l7870p383N930j4169r491N0172J5563q954m30j6209k0401j3429
$$ 52573 53974 16104 8721 14651 482 -9009 41163 56726 47772 47342 31133 10732 -2697
8158b697J6163L6101j2886m2981J5359j8762l5897k6200j6805K3014K1349j1670
$$ -2697 13466 49567 36681 -6300 9059 -9703 -45600 -71800 -88605 -65591 -44242 -55912
8146e5912O836r838P570J7170o113K886L2895M5086K4877j2387R648M684j1571
$$ -55912 -49076 -58914 -51344 -34174 -40287 -37401 -4506 40580 65457 53070 62718 67402 55831
8133E5831K4001K7200L6677n7989m4658K278L9870M6361k1220p6425l3278J3425
$$ 55831 79832 107032 143709 85720 41062 43340 83210 129571 108351 31926 -1352 12073
8121A2073L3119M238k7015O010q833j3336K0002K3564o146J6554J6500k0146N321
$$ 12073 45192 49430 22415 28425 19592 6256 26258 49822 43676 60230 76730 56584 61905
8108F1905k8504O064K5766l0235j0976K8247p256n7461K841L5163J6265k1300
$$ 61905 33401 39465 65231 34996 24020 52267 45011 -12450 -9609 25554 41819 20519
8096B0519o73r107o610j9379K1930J5102J2267p5171j9395N044M4332j1498J8556
$$ 20519 19846 10739 4129 -15250 6680 21782 34049 -41122 -60517 -55473 -11141 -22639 -4083
8083d083L7021j5309m232j5360l4342p359o441q142J0150N9519L2947j7065M112
$$ -4083 32938 17629 13397 -1963 -36305 -43664 -50105 -58247 -48097 11422 44369 27304 31416
8070C1416J8980P759j1902J0604l0227j2234K2269m1236J0761N1576q146j1299
$$ 31416 50396 58155 46253 56857 26630 14396 36665 -4571 6190 57766 49620 38321
8058C8321k2017K615M292K894m260r008K7517k2875P7J8311k5198l2580K1186
$$ 38321 16304 18919 23211 26105 21845 12837 40354 17479 17556 35867 10669 -21911 -725
8045g25L5631P9545K3004n4639m510N5557j1927k5236l4259m2700P1054O3895
$$ -725 34906 114451 137455 82816 78306 133863 121936 96700 62441 19741 90795 154690
8033A54690k2365q7206q1892K8250K9859K2240L1457l3309l1843j2853l7932J9009
$$ 154690 132325 45119 -36773 -8523 21336 43576 75033 41724 9881 -2972 -40904 -21895
8021b1895M3559M6473O677k2396J8120k4035J6067k5595k5529l7590l9056j7010
$$ -21895 21664 68137 74814 52418 70538 46503 62570 36975 11446 -26144 -65200 -82210
8009h2210M9781R81O4288j1195j0739J603j6324R363R962M3389M4740M0580l7911
$$ -82210 -32429 -31448 32840 21645 10906 12509 -3815 5548 15510 58899 103639 144219 106308
7996A06308J283o501k5939m0312k2883m988L6402M79l8529l1119n3733N7046J3921
$$ 106308 107591 101090 75151 34839 11956 6968 43370 43849 5320 -25799 -79532 -22486 -8565
7983h565K6839J3798K8682j4295M634K6014J3789j7042L1558K3287l2704J7054
$$ -8565 18274 32072 60754 46459 51093 77107 90896 73854 105412 128699 95995 113049
7971A13049j7064j1815K2503K851L4508j4250m043n7124j4517L0617O8095J1756
$$ 113049 95985 84170 106673 109524 144032 129782 125739 68615 54098 84715 152810 164566
7959A64566n2593L1237K1332n1153k4390k7970K1443L8173j3918n3411J8259M5682
$$ 164566 111973 143210 164542 113389 88999 61029 82472 120645 106727 53316 71575 117257
7947A17257J4406l5275K006k899J7781m8520O22q977J4767J8154j6256m8890l352
$$ 117257 131663 96388 98394 95495 113276 64756 65378 56401 71168 89322 73066 24176 20824
7934B0824M0612L9121K2665j2831l7093j3198l0843J7169J2599J9671j9026L023
$$ 20824 61436 100557 123222 110391 73298 60100 29257 46426 59025 78696 59670 62693
7922F2693K6966N5042L3184k4195K1281J9620Q447j1166J4662k1527n0441q9798
$$ 62693 89659 144701 177885 153690 174971 194591 203038 191872 206534 185007 134566 44768
7910D4768l9787L6688O0565K5064o1950j1873M841J6676M555m5225L2192N3536
$$ 44768 4981 41669 102234 127298 65348 53475 58316 74992 79547 34322 66514 120050
7898A20050k8777j9235l81m0700j2088R621q015k8180j0239M0546O932K9963K7795
$$ 120050 91273 72038 71657 30957 18869 28490 20475 -7705 -17944 22602 29534 59497 87292
7885H7292l7540j865K7836l3841j7005J8034L117k8871L7969K4770L0625Q773
$$ 87292 49752 47887 75723 41882 24877 42911 46028 17157 55126 79896 110521 119294
7873A19294l6499n2622K8450l2306k7130K8044L1790K323l5879n6158R443Q202
$$ 119294 82795 30173 58623 26317 -813 27231 59021 61344 25465 -30693 -21250 -13048
7861a3048N323M2465O6010o527k7285l5112j8357J7258l592k5633j8573R594L9824
$$ -13048 -7725 34740 100750 94223 66938 31826 13469 30727 27135 1502 -17071 -7477 32347
7848C2347L6258j9127j5184K6912k5867j9920k9082j4925J5927n297L338J004
$$ 32347 68605 49478 34294 61206 35339 15419 -13663 -28588 -12661 -17958 -14620 -13616
7836a3616p426k1200K2964L1125M9487J7744m3051m3021l4458M784M050j5263
$$ -13616 -21042 -42242 -19278 11847 61334 79078 36027 -6994 -41452 -36668 -32618 -47881
7824d7881J6932J2853N909Q970j5352l491P762l3081p088k4716j5276o303M1330
$$ -47881 -30949 -18096 -12187 -3217 -18569 -22060 -14298 -47379 -54467 -79183 -94459 -100762 -59432
7811e9432P2446k336J6281P371J2109n818p9039j5100k5173j0742L6304O96J913
$$ -59432 13014 10678 26959 34330 46439 40621 -38418 -53518 -78691 -89433 -53129 -52433 -50520
7798e0520m4389J5279L4735n3180l48N5717J0965p457j566k308J1487L2073O0453
$$ -50520 -94909 -79630 -44895 -98075 -98423 -42706 -31741 -39198 -40764 -43072 -31585 488 60941
7785F0941M9406l4057n3293m1144K0057l2295k4383k2904K0231R948m0249N899
$$ 60941 110347 76290 22997 -18147 1910 -30385 -54768 -77672 -57441 -47493 -87742 -81843
7773h1843P954K2050L3680o6470J4387o517r049k3005m829M6565N8791L7532J9174
$$ -81843 -73889 -51839 -18159 -84629 -70242 -76759 -85808 -108813 -113642 -67077 -8286 29246 48420
7760D8420l4242M1879J8195o8755l5215l4352k8060M0720L475J1520L4743j7795
$$ 48420 14178 56057 74252 5497 -29718 -64070 -92130 -51410 -47935 -36415 -1672 -19467
7748a9467p328k225Q662l373K070m284l6485J574N5923l3958k0746K6093L4412
$$ -19467 -26795 -29020 -20358 -23731 -21661 -25945 -62430 -60856 -4933 -38891 -59637 -33544 868
7735H68L2316k9509l976k7241J1622r104q498J1008O164J4025J9051o627p6805
$$ 868 33184 3675 -301 -27542 -15920 -25024 -33522 -22514 -16350 -2325 16726 10099 -66706
7722f6706l2002O4333L9060O5620j8413R326j7602K2564O601k7468M5798m5617
$$ -66706 -98708 -34375 4685 70305 51892 61218 43616 66180 72781 45313 91111 45494
7710D5494n5413M1717L5499n9770K499k6217l5500o858M7395J5600j3899k889
$$ 45494 -9919 31798 67297 7527 10026 -16191 -51691 -58549 -11154 4446 -9453 -12342
7698a2342K9852p626k4560j2767L1239k73l4721J4483p696k339J7334m0166N131
$$ -12342 17510 9884 -14676 -27443 3796 3523 -31198 -16715 -24411 -26750 -9416 -49582 -44451
7685d4451J4024L810R646m12K2760K4662l200j4021L8943K5673j4381o986M1715
$$ -44451 -30427 -26617 -16971 -17383 5377 30039 26839 12818 51761 77434 63053 56067 97782
7672I7782k6962k7494O780K9840M7333J7061o8978l7005J9256j8818j8478m2047
$$ 97782 70820 43326 50106 79946 127279 144340 75362 38357 57613 38795 20317 -21730
7660b1730o680O538q884M1419J0334m6206j9545K6678K5300K5023R454N195l5586
$$ -21730 -28410 -21872 -30756 10663 20997 -25209 -44754 -18076 7224 32247 41701 46896 11310
7647A1310q634k8655k6648L977j6735O9361O5404L891p9050l0976j9631k7678
$$ 11310 2676 -25979 -52627 -48650 -65385 3976 69380 73271 -5779 -36755 -56386 -84064
7635h4064k306K4438k8027r702p717k84M7728q975L8448K5084p865j2152K8850
$$ -84064 -86370 -61932 -89959 -99661 -107378 -107662 -59934 -68909 -30461 -5377 -13242 -25394 3456
7622C456J7450j998j5036n092J0044J0060J3561J0674j5558n5765l888l0758P740
$$ 3456 20906 18908 3872 -1220 8824 18884 32445 43119 27561 -28204 -32092 -62850 -55110
7609e5110K269j5213j7163J6823J321l405L2979K3544m3782l6939j3687J3143
$$ -55110 -52841 -68054 -85217 -68394 -67073 -70478 -37499 -13955 -57737 -94676 -108363 -95220
7597i5220K3268K1419J2574O1814J5543J4146m7192m541l3872N436p156J2728
$$ -95220 -71952 -50533 -37959 23855 39398 53544 6352 1811 -32061 -26625 -33781 -21053
7585b1053M0092j0715j867K3616L6222j6087o0678m3912J6041J8206O258m0928
$$ -21053 19039 8324 6457 30073 66295 50208 -10470 -54382 -38341 -20135 -13877 -54805
7573e4805K888K3500N255K4008j8722l392M1719J0656Q494j9814j5510l0571K4306
$$ -54805 -51917 -28417 -23162 846 -17876 -21268 20451 31107 39601 19787 4277 -26294 -1988
7560a988K3926Q198l8595k218J2115M3855k3443p5357L3293M125J0738R511J4511
$$ -1988 21938 30136 -8459 -10677 1438 45293 21850 -53507 -20214 -16089 -5351 4160 18671
7547A8671n0834k2922k2873Q342K4435l5972L8780J17M7336j1147j6944j5424
$$ 18671 -32163 -55085 -77958 -69616 -45181 -81153 -42373 -42256 5080 -6067 -23011 -38435
7535c8435K7903M5533K6845l6033o3465p2700k6079N8603P267m899J7326J4719
$$ -38435 -10532 35001 61846 25813 -37652 -110352 -136431 -77828 -70561 -75460 -58134 -43415
7523d3415J9188L5178K9679l0530k4378J4834k2528K0759Q823p1015M50M0329
$$ -43415 -24227 10951 40630 10100 -14278 556 -21972 -1213 7610 -63405 -62955 -22626
7511b2626R983o973k2194O091N2197r135r652r66j8305n4977K6002M1008N1197
$$ -22626 -12643 -19616 -41810 -35719 16478 7343 -2309 -3275 -21580 -76557 -50555 -9547 41650
7498D1650K2025O615m2976M608j1153J8075M6326n4024n7765j0799r689j8920
$$ 41650 63675 70290 27314 31922 20769 38844 85170 31146 -26619 -37418 -47107 -66027
7486f6027l9430M9127J9107K0011K9759k1822j9321N0886K1848j3875o750n157
$$ -66027 -105457 -56330 -37223 -17212 12547 -9275 -28596 22290 44138 30263 23513 18356
7474A8356k2009m9761l8743r601n5835M566P498J9499N8523L1631l4024k9093
$$ 18356 -3653 -53414 -92157 -101758 -157593 -153027 -145529 -126030 -67507 -35876 -69900 -98993
7462i8993N715K9566N552j6791n1829Q877R1960K0467J3845j5263o0164P085J9686
$$ -98993 -93278 -63712 -58160 -74951 -126780 -117903 -25943 -5476 8369 -6894 -67058 -59973 -40287
7449d0287L6794J757l1641j4027m8450M8833L8621p123j8823j9995N463M2724
$$ -40287 -3493 -1736 -33377 -47404 -95854 -47021 -8400 -15523 -34346 -54341 -48878 -6154
7437f154J1510m3630j9949o1908k8301K6645J3999J8962M9158L9888j4101k5534
$$ -6154 5356 -38274 -58223 -120131 -148432 -121787 -107788 -88826 -39668 220 -13881 -39415
7425c9415k204j1733M9464j162l5634J3299R562m395m0890K6615P5794P0214j166
$$ -39415 -41619 -53352 -3888 -5050 -40684 -27385 -17823 -22218 -63108 -36493 39301 109515 108349
7412A08349l9318m3006m851L3245k4329l6417m1058K0108M2191K4181J5532K0528
$$ 108349 69031 26025 21174 54419 30090 -6327 -47385 -27277 14914 39095 54627 75155
7400G5155p441J356k84l1485M036k2224k5334j7226L2003K2043K8058L5904j9931
$$ 75155 67714 69070 68786 37301 41337 19113 -6221 -23447 8556 30599 58657 94561 74630
7387G4630o3318m8526J632J9435K5969l9263j0187n233K6478R21m6971o0490J8003
$$ 74630 11312 -37214 -35582 -16147 9822 -29441 -39628 -44861 -18383 -17462 -64433 -124923 -106920
7374a06920M7195m3654k4477O4839M8371l1379J8168P038k8156L2803K6775n257
$$ -106920 -59725 -103379 -127856 -63017 -14646 -46025 -27857 -20819 -48975 -16172 10603 5346
7362E346O920l6986l6279k8797J9240J5712K4934j5936k4095j0527j1071P073
$$ 5346 12266 -24720 -60999 -89796 -70556 -54844 -29910 -45846 -69941 -80468 -91539 -84466
7350h4466K1733K3840L8953j7371k8037j7232L5993N9776N6640L2518P049m817
$$ -84466 -62733 -38893 60 -17311 -45348 -62580 -26587 33189 89829 122347 129396 124579
7338A24579q0463r0892J8610L174N3553L4871N797j3458l9307l6505l0238j568
$$ 124579 44116 -46776 -28166 -24992 28561 63432 69229 55771 16464 -20041 -50279 -51847
7326e1847J1072j3813P066L7229m1417k3520O3600K9760k8742o5319J6116N041
$$ -51847 -40775 -54588 -47522 -10293 -51710 -75230 -11630 18130 -10612 -75931 -59815 -54774
7314e4774q7612j7996P8953Q0918k048o8548J1081K3435J6603L096j1849K130
$$ -54774 -142386 -160382 -81429 -511 -2559 -71107 -60026 -36591 -19988 -16892 -28741 -26611
7302b6611j7772k6128l3512j8894M5479L7671J9521j8165K7284R587q6389m4866
$$ -26611 -44383 -70511 -104023 -122917 -77438 -39767 -20246 -38411 -11127 -1540 -87929 -132795
7290a32795K4430L1217J2612l5989M6944L6918l5843J0872L2955j8893J3512J1785
$$ -132795 -108365 -77148 -64536 -100525 -53581 -16663 -52506 -41634 -8679 -27572 -14060 -2275
7278b275j9603m5477N1238L2063J085J5574q592j4346K3185l8510Q029m7813p542
$$ -2275 -21878 -67355 -16117 15946 17031 32605 24013 9667 32852 -5658 2371 -45442 -52984
7265e2984J2277N1109K0388q585k5269m080o761j3884n860K9541j5852j6358m1821
$$ -52984 -40707 10402 30790 22205 -3064 -7144 -13905 -27789 -33649 -4108 -19960 -36318 -78139
7252g8139J0320O5890O5938o7713o002O719K3283j5904m201l662j6136j8474m6346
$$ -78139 -67819 -1929 64009 -3704 -9706 -2987 20296 4392 191 -3471 -19607 -38081 -84427
7239h4427l975M2532N5268O1476J105k8275P979J2140l5682k2682K2038j0256
$$ -84427 -88402 -45870 9398 70874 71979 43704 51683 63823 28141 5459 27497 17241
7227A7241o1188n465M1492L8841L9733J169n3706n2792n790L9746J1728q267l0389
$$ 17241 -43947 -49412 -7920 30921 70654 71823 18117 -34675 -40465 -719 11009 2742 -27647
7214b7647J1217M0010j3547J0872K3380N982l4688J6966n698m2403k7884k4927
$$ -27647 -16430 23580 10033 20905 44285 50267 15579 32545 26847 -15556 -43440 -68367
7202f8367L3087j8337k9590J3236N5276k7355j2251L4790J6167J1668l4101k6023
$$ -68367 -35280 -53617 -83207 -69971 -14695 -42050 -54301 -19511 -3344 8324 -25777 -51800
7190e1800L8120M3599O1876J1855n909k0235J0692j5266j6909k1719r402o5453
$$ -51800 -13680 29919 91795 103650 97741 77506 88198 72932 56023 34304 24902 -40551
7178d0551k6616M7749N9482J5265j9650l4859p99j9882J1647Q448j3949M500l018
$$ -40551 -67167 -19418 40064 55329 35679 820 21 -19861 -8214 234 -13715 -9215 -12233
7165a2233K0925K0240m71m7928p5530j6034l067P192M4377p45k356L3027K7420
$$ -12233 8692 28932 28461 -19467 -94997 -111031 -114098 -106906 -62529 -63274 -65630 -32603 -5183
7152e183k1013p466P715J7237j4902K4650j1597j9397N9036K0257l7793l5226
$$ -5183 -26196 -33662 -25947 -8710 -23612 1038 -10559 -29956 29080 49337 11544 -23682
7140b3682O888K3772j271l6374K5343K4543j0382n2318J4631M9529L3171P628
$$ -23682 -16794 6978 5707 -30667 -5324 19219 8837 -43481 -28850 20679 53850 61478
7128F1478o4175k9477M098n17k8374J9803K826j4651J5030L3354o47k9434J083
$$ 61478 -2697 -32174 -28076 -28593 -56967 -37164 -34338 -48989 -33959 -605 -1252 -30686 -29603
7115b9603Q8581K8684R440j4700n3965l3299l8842M1264N4174L1668o8577o8506
$$ -29603 58978 87662 97102 82402 28437 -4862 -43704 -2440 51734 83402 14825 -53681
7103e3681K5834L0071L5506M460L2123R194J0752j6299p0356l7926K2672l8216
$$ -53681 -27847 2224 37730 42190 74313 83507 94259 77960 7604 -30322 -7650 -45866
7091d5866J1483M7949p75J2806q804J3438J6015n5066r102J8426J8772J4059L860
$$ -45866 -34383 13566 12791 25597 16793 30231 46246 -8820 -17922 504 19276 33335 37195
7078C7195J719n3885J4595M8075o390l2821m5846j6557N438O474J5334L9308J3219
$$ 37195 38914 -14971 -376 47699 41309 8488 -37358 -53915 -48477 -42003 -26669 12639 25858
7065B5858l3261j8313j4586r273J1471L426J6059Q744r632k3110L4152L662K393
$$ 25858 -7403 -25716 -40302 -49575 -38104 -34678 -18619 -9875 -19507 -42617 -8465 -4803 -2410
7052b410k4239l2486L5680K8049j2621K9439L403m0772p6098Q037N6097O512o074
$$ -2410 -26649 -59135 -23455 4594 -8027 21412 24815 -15957 -92055 -84018 -27921 -21409 -27483
7039b7483k8660J8723J9360J3401j3233k246n863L9470p974n0226P43L8324J6316
$$ -27483 -56143 -37420 -18060 -4659 -17892 -20138 -26001 13469 5495 -44731 -43988 -5664 10652
7026A0652m1203o1395J561L7883K6670K2055R311M53K3181j3025J8950N0158K3609
$$ 10652 -30551 -91946 -90385 -52502 -25832 -3777 5534 5987 29168 16143 35093 85251 108860
7013A08860n7381k4114J4393k1098l3599J5502k8763l7340L2956L266N0051l2168
$$ 108860 51479 27365 41758 20660 -12939 2563 -26200 -63540 -30584 -27318 22733 -9435
7001i435p007q676n338j9811m7144L3180L2342M1117M2162j4184M262L3366l0154
$$ -9435 -16442 -25118 -30456 -50267 -97411 -64231 -31889 9228 51390 37206 41468 74834 44680
6988D4680k106k964L776k6382l4283J6941J0038l2440K8937N3174J1735m3412
$$ 44680 42574 39610 43386 17004 -17279 -338 9700 -22740 6197 59371 71106 27694
6976B7694j8390M4084q874r83K2294K1124m407k4309k1152K112l7855l229L490
$$ 27694 9304 53388 44514 43531 65825 86949 82542 58233 37081 39193 1338 -1891 1599
6963A599j0613k0788j1206K4120l764l3094K6802l2735M75N2062l2019k5051J6237
$$ 1599 -9014 -29802 -41008 -16888 -20652 -53746 -26944 -59679 -59204 -7142 -39161 -64212 -47975
6950d7975J9235K0709j8070N708M001j3012k8425K9506M1201o605k7179k7817
$$ -47975 -28740 -8031 -26101 -20393 -16392 -29404 -57829 -28323 12878 6273 -20906 -48723
6938d8723k4842J0401J2275N9050j7034K5685k9977k5979k0971L6463j2530N637
$$ -48723 -73565 -63164 -50889 8161 -8873 16812 -13165 -39144 -60115 -23652 -36182 -30545
6926c0545j4563J9803P531j8557j7036K4657k6153J5422R381J7038O594l8663
$$ -30545 -45108 -25305 -17774 -36331 -53367 -28710 -54863 -39441 -30060 -13022 -6428 -45091
6914d5091K2734K2123o30J1785Q883q6221o9764p22P1242J3408L0007M2530l199
$$ -45091 -22357 -234 -864 10921 19804 -66417 -136181 -136903 -65661 -52253 -22246 20284 17085
6901A7085l1623P843J3147k5062J4969J6582l3624k180K2180n2511l7481Q176
$$ 17085 -14538 -6695 6452 -18610 -3641 12941 -20683 -22863 -683 -53194 -90675 -82499
6889h2499k3231k152M3604O1563q208k1590K2999p923l868q188r292J1883K9378
$$ -82499 -105730 -107882 -64278 -2715 -10923 -32513 -9514 -17437 -21305 -29493 -38785 -26902 2476
6876B476K1364m0140J2728M4694J335n4940j9855J54M9643R19l7596J6536M4391
$$ 2476 23840 -16300 -3572 41122 42457 -12483 -32338 -32184 17459 18378 -19218 -2682 41709
6863D1709K076n8274j3158L0373k5938J1299J7386J7763j3744L8382O025j0333
$$ 41709 43785 -14489 -27647 2726 -23212 -11913 5473 23236 9492 47874 53899 43566
6851D3566l0599j4985p435k2072K203O141k0316j9238K8702L7500k3465o4141
$$ 43566 12967 -2018 -9453 -31525 -29322 -23181 -43497 -62735 -34033 3467 -19998 -84139
6839h4139L4690J6502K3532J4791Q78m6459L0083N1707R908k7085j3975j2244
$$ -84139 -49449 -32947 -9415 5376 6254 -40205 -10122 41585 51493 24408 10433 -1811
6827a811J0244m558j3368K1957k426L211N3244J1064l7803k5798k4997K203K5236
$$ -1811 8433 3875 -9493 12464 10038 13249 66493 77557 39754 13956 -11041 -8838 16398
6814A6398M215p609K9225l2704p0218j7245j1836N6260K61O250L2655L993j3884
$$ 16398 20613 13004 42229 9525 -60693 -77938 -89774 -33514 -33253 -27003 5652 9645 -4239
6801d239J8548L748L5992j4937l9859J4877L3855J2966m6080M4792j6901l7522
$$ -4239 14309 18057 54049 39112 -747 14130 47985 60951 14871 59663 42762 5240
6789E240j139j8171l8561K8279J0433j5543J3721o114O2084N1179r243k5778q768
$$ 5240 4101 -14070 -52631 -24352 -13919 -29462 -15741 -21855 40229 91408 82165 56387 47619
6776D7619K4499J777j5094L259j7332N709M2868N8583M9292l1642k9255N4458
$$ 47619 72118 73895 58801 62060 44728 50437 93305 151888 201180 169538 140283 194741
6764A94741k23P285P8720J05586J77451K51343L04146J76995k23255l81465l00619
$$ 194741 194518 201803 280523 386109 563560 814903 1119049 1296044 1072789 691324 390705
6753C90705j67023n1109j1463j9213n077n715j9078J4787o637j0009k4638n13
$$ 390705 223682 172573 161110 141897 136820 131105 112027 126814 120177 110168 85530 85017
6741H5017j2175K6132M2941J1021K4694P4430P7770P0963M6495n5493j55842q2898
$$ 85017 72842 98974 141915 152936 177630 252060 329830 400793 447288 391795 235953 153055
6729A53055l1447M4189k7586r3316m0860K8829K4034L804m3074O8R561r674l1172
$$ 153055 121608 165797 138211 44895 4035 32864 56898 60702 17628 17696 27257 17583 -13589
6716a3589p470P386P9060M3308k5412n5132J9036J9349j0135L8369k2727l0626
$$ -13589 -21059 -13673 65387 108695 83283 28151 47187 66536 56401 94770 72043 41417
6704D1417J1429L284k6296r0701l3143o708Q938J8268L5193q761j138l1621j1409
$$ 41417 52846 56130 29834 -60867 -94010 -100718 -91780 -73512 -38319 -47080 -48218 -79839 -91248
6691i1248M6571J9889k3681j8312K7162L9454k5377k6856K2993J7132K6465j8470
$$ -91248 -44677 -24788 -48469 -66781 -39619 -165 -25542 -52398 -29405 -12273 14192 -4278
6679d278r1764j6257N6851o792M061M4N359M6938L913j8528k8546j206J3084o023
$$ -4278 -96042 -112299 -55448 -62240 -58179 -58135 -52776 -5838 -1925 -20453 -48999 -50205 -37121 -43144
6665d3144k2069P4409L1608m4084j3704J4018m5486N662N2946m8434k0853J1380
$$ -43144 -65213 9196 40804 -3280 -16984 -2966 -48452 -42790 10156 -38278 -59131 -47751
6653d7751J0284o290J0068J0874J3722K5815j3115j3175j730J383L3286J815J1748
$$ -47751 -37467 -43757 -33689 -22815 -9093 16722 3607 -9568 -11298 -9915 23371 25186 36934
6640C6934j0239k7828j2893L0855J8070n4066j7633m2459O010M9579l984k4273
$$ 36934 26695 -1133 -14026 16829 34899 -19167 -36800 -79259 -73249 -23670 -27654 -51927
6628e1927O140K1390j7912k1978k1416j8329J894K5374M508p556R954N8238k0196
$$ -51927 -45787 -24397 -42309 -64287 -85703 -104032 -102138 -76764 -72256 -79812 -69858 -11620 -31816
6615c1816j5009K7471l0299K9366K990K9855K277k9599o039M831j183N9547n5328
$$ -31816 -46825 -19354 -49653 -20287 -17297 12558 14835 -14764 -20803 -15972 -17155 42392 -12936
6602a2936q1857O7408N2839m3299n5064m6320O592K0050P1396J0392l7906L0548
$$ -12936 -94793 -27385 25454 -17845 -72909 -119229 -112637 -92587 -21191 -10799 -48705 -18157
6590a8157K9595p373j7598K2677K18L1134l1630k7927M8707L1523n672r7855j8032
$$ -18157 11438 4065 -13533 9144 9362 40496 8866 -19061 29646 61169 55497 -42358 -60390
6577f0390P175j9362l3138L3847O6392q874L2539M388j0080J607j2256j2929j9314
$$ -60390 -53215 -72577 -105715 -71868 -5476 -14350 18189 22577 12497 14104 1848 -11081 -30395
6564c0395M5911L3821k0878n1935l1908J1545k0020K3449J9956L3010M3913k1602
$$ -30395 15516 49337 28459 -23476 -55384 -43839 -63859 -40410 -20454 12556 56469 34867
6552C4867m0731j6257R082O4360m797k7436J6541l3074m508J6901R26k0541o4606
$$ 34867 -5864 -22121 -13039 51321 46524 19088 35629 2555 -1953 14948 15874 -4667 -69273
6539f9273k5459J2192K7092L6338J5145m6380m669L732k1108K4914O27j2240R960
$$ -69273 -94732 -82540 -55448 -19110 -3965 -50345 -55014 -51282 -72390 -47476 -46849 -59089 -49129
6526d9129L6581k4270J2600K0084J323j7096k2548j4829k3302J0154K6201n1402
$$ -49129 -12548 -36818 -24218 -4134 -2811 -19907 -42455 -57284 -80586 -70432 -44231 -95633
6514i5633l4585K9142K2614p176M345R919k0525O515J5491M3163j9477m9272K9623
$$ -95633 -130218 -101076 -78462 -85638 -81293 -71374 -91899 -85384 -69893 -26730 -46207 -95479 -65856
6501f5856M6837K6107K4191L9585j6528p6294m6517P3724K4316l2870m6905L5242
$$ -65856 -19019 7088 31279 70864 54336 -21958 -68475 5249 29565 -3305 -50210 -14968
6489a4968J4485m3741j9144R256Q9K3985k7314O566K0995K8351n14o333m120l5525
$$ -14968 -483 -44224 -63368 -54112 -54023 -30038 -57352 -50786 -29791 -1440 -1954 -8287 -12407 -47932
6475d7932l3721K5831j3942k8467L7929N1604l2935k3224k0173l096M1055N1320
$$ -47932 -81653 -55822 -69764 -98231 -60302 -8698 -41633 -64857 -85030 -88126 -47071 4249
6463D249L3673k7942k1143j5265j8670k8584L1587L384l2644M4926O5832K62n8860
$$ 4249 37922 9980 -11163 -26428 -45098 -73682 -42095 -38711 -71355 -26429 39403 39665 -19195
6450a9195l7288J5343P952K7781j8869J1286O705J7340L102j450K9777N452j2621
$$ -19195 -56483 -41140 -33188 -5407 -24276 -12990 -6285 11055 14157 12707 42484 47936 35315
6437C5315l5328n14J3557k1014k5295p24l119K7303j0897m2026M415m1499J0926
$$ 35315 -13 -527 13030 -7984 -33279 -34003 -37122 -9819 -20716 -62742 -58327 -99826 -88900
6424h8900K5497L8062J7428K3733K4777J3783j227l3911l0567m2403R648M2242
$$ -88900 -63403 -25341 -7913 15820 40597 54380 53153 19242 -11325 -53728 -44080 -1838
6412a838M3581m703l1973M546J7460K826P769k4400K5065j9023r9257j6497M74
$$ -1838 41743 37040 5067 9613 27073 29899 37668 13268 38333 19310 -79947 -96444 -95970
6399i5970J6506L7391L6513M3326p180j8715N446J71K4416R857j5l012k5285k6810
$$ -95970 -79464 -42073 -5560 37766 30586 11871 17317 17488 41904 51761 51746 48734 23449 -3361
6385c361J3480M2117k5952n4154n6659P911N2099J10J2664l594j6702J8231k5708
$$ -3361 10119 52236 26284 -27870 -84529 -76618 -24519 -24409 -11745 -15339 -32041 -13810 -39518
6372c9518m7520l540l3529J7881R595Q750N3398j787l6697L4808L6614N871j9542
$$ -39518 -87038 -90578 -124107 -106226 -96631 -87881 -34483 -36270 -72967 -38159 -1545 4326 -15216
6359a5216k5189j4757L2497K9160L3835K5909l4038K1450J7505k699n4027k7354
$$ -15216 -40405 -55162 -22665 6495 40330 66239 32201 53651 71156 68457 14430 -12924
6347a2924R286N1938O2357L6357o7659p8758r683K3079K45K0414L555p251M73
$$ -12924 -3638 48300 110657 147014 79355 597 -9086 13993 14238 34652 38207 30956 31429
6334C1429k3325m6257j3703K4399J2026K54j9526k9013j0576J4411M1586K4081
$$ 31429 8104 -38153 -51856 -27457 -15431 -15177 -34703 -63716 -74292 -59881 -18295 5786
6322E786O3497M3272n5127j4623j5995m4519j8257j1762l2075K0849J1709k4600
$$ 5786 69283 112555 57428 42805 26810 -17709 -35966 -47728 -79803 -58954 -47245 -71845
6310g1845P156j7089M602O0285J1376j5799J8582M4043o976J4810M363N366K382
$$ -71845 -64689 -81778 -77176 -16891 -5515 -21314 -2732 41311 34335 49145 53508 58874 61256
6297F1256J280M269n4732m6427K5363j7522j7259K5256J6584J8158L1327j8006
$$ 61256 62536 66805 12073 -34354 -8991 -26513 -43772 -18516 -1932 16226 47553 29547
6285B9547R17J2996k8480K231K0198J9270l4681o1739J6097K4221L1125j7870
$$ 29547 30464 43460 14980 17211 37409 56679 21998 -39741 -23644 577 31702 13832
6273A3832k3486K4856k8450P229n893j9681m1549J3666P8558J5633l7968J9780
$$ 13832 -9654 15202 -13248 -6019 -11912 -31593 -73142 -59476 19082 34715 -3253 16527
6261A6527O0675l7570l1154J5909j0967j3478k8335r308J2048l215K1752J1835
$$ 16527 77202 39632 8478 24387 13420 -58 -28393 -37701 -25653 -28868 -7116 4719
6249D719P173M930l1674K0802l9698q2535J5156L506K9270o636Q779N7948P5552
$$ 4719 11892 16822 -14852 5950 -33748 -116283 -101127 -97621 -68351 -74987 -66208 -8260 67292
6236F7292j7428k6598J4300j4955p139K9644J2836K9868N54l4058m369l5330P455
$$ 67292 49864 23266 37566 22611 15472 45116 57952 87820 88374 54316 49947 14617 22072
6223B2072K114J9294j0979j9453K1293k253K960J7824n39O4355K1265n4597n9057
$$ 22072 24186 43480 32501 13048 34341 32088 35048 52872 52333 116688 137953 83356 24299
6210B4299l5581m5074M59j8804m772P5427O211n9526k4519O3881J7006J264N1342
$$ 24299 -11282 -56356 -55897 -74701 -79473 -4046 2165 -57361 -81880 -17999 -993 271 51613
6197E1613k5867k7770J0326J2535R772N6412k1766j02338q024J7211L1589P52
$$ 51613 25746 -2024 8302 20837 30609 87021 65255 -37083 -45107 -27896 3693 4445
6185D445N1591K6147k1064k3814k8458M6021j6145o672K7948l615M756j533n0350
$$ 4445 56036 82183 61119 37305 8847 54868 38723 32051 59999 56384 61140 59607 9257
6172I257J0842R058m07J0585l0371k3491k7240j1718J0605L1001K2850k7839l8591
$$ 9257 20099 29157 28750 39335 8964 -14527 -41767 -53485 -42880 -11879 10971 -16868 -55459
6159e5459l450k6402p582M7307l451N229N2943Q104m5606l5869J4948l5697J480
$$ -55459 -58909 -85311 -92893 -45586 -49037 -43808 9135 17239 -28367 -64236 -49288 -84985 -83505
6146h3505n218K7293Q238K7693K7902j8615n042k573J6113m5514J643K0199n186
$$ -83505 -88723 -61430 -53192 -25499 2403 -16212 -21254 -23827 -7714 -53228 -51585 -31386 -36572
6133c6572J9118J5412j6232Q266L6514j6947n7060j03737K1001M6242k0044m0415
$$ -36572 -17454 -2042 -18274 -10008 26506 9559 -47501 -151238 -130237 -83995 -104039 -144454
6121a44454N7924Q5566k8744p840l3572O752O2209j6974J0951O703k4729O97K1677
$$ -144454 -86530 -964 -29708 -37548 -71120 -64368 -2159 -19133 -8182 -1479 -26208 -25511 -3834
6108c834l2427m8754l8619K7050O8466K0417l6311m5756q580L4430K3353K8815
$$ -3834 -36261 -85015 -123634 -96584 -28118 -7701 -44012 -89768 -98348 -63918 -40565 -11750
6096a1750J470j6620n4489J2386O7488j924k2458K2120j0018J113l7154m4164
$$ -11750 -10280 -26900 -81389 -69003 -1515 -3439 -25897 -3777 -13795 -12682 -49836 -94000
6084i4000K337M1973P5271J2288K8558m1217o493k5755J094r180K2602M7150M609
$$ -94000 -91663 -49690 25581 37869 66427 25210 18717 -7038 -5944 -15124 7478 54628 59237
6071E9237M960m1416r4623m7870O5404M8385J4932P588k4734K2385q92k3069J572
$$ 59237 64197 22781 -71842 -119712 -54308 -5923 9009 16597 -8137 14248 13356 -9713 -8141
6058h141O614o2279m5715O246K8632L1848k1004J6795Q821j5255J9123M0150Q437
$$ -8141 -1527 -63806 -109521 -103275 -74643 -42795 -63799 -47004 -38183 -53438 -34315 5835 14272
6045A4272J0333j60j3286j5519Q979L810L5012k0462K6485J5407J1076k2529K2843
$$ 14272 24605 24445 11159 -4360 4619 8429 43441 22979 49464 64871 75947 53418 76261
6032G6261j222K0587l0344j0753l0229l9061q1090K4789L9018N8220R287J2O778
$$ 76261 75039 95626 65282 54529 24300 -14761 -95851 -71062 -32044 26176 35463 35475 42253
6019D2253k5140q999k906O75K5685m040k5164L4443J6640j123R715l8825k1265
$$ 42253 17113 8114 5208 5883 31568 27528 2364 36807 53447 52324 62039 23214 1949
6006A949j5002J4369k8960n835N238N709j2832K5141L4308K6265J1443K9p205
$$ 1949 -13053 1316 -27644 -33479 -28241 -22532 -35364 -10223 24085 50350 61793 61822 54617
5993E4617k930j9168J0486k0598J3725L1530o52q7799m9511L4321j9945k4601
$$ 54617 51687 32519 43005 22407 36132 67662 67010 -20789 -70300 -35979 -55924 -80525
5981h0525N0231r4l022l2400j4360R2644Q7585l4161Q140l1287j4259J4449k496
$$ -80525 -30294 -30388 -33410 -65810 -80170 12474 100059 65898 74038 42751 28492 42941 40445
5968D0445m0207K3313m897k5996L001o568l4784k4963K9058K8654J1155L0160
$$ 40445 238 23551 18654 -7342 -4341 -10909 -45693 -70656 -41598 -12944 -1789 28371
5956B8371J1054m9266n531K0815M2963K7833k558k205j7742m8100m22J3751N3552
$$ 28371 39425 -9841 -15372 5443 48406 76239 73681 71476 53734 5634 5212 18963 72515
5943G2515O809j7848l8538K52K0329L6356n5710l3632j8734m5248k3348K4673
$$ 72515 79324 61476 22938 23190 43519 79875 24165 -9467 -28201 -73449 -96797 -72124
5931g2124R912L6494K9943M189M6223m0785M4031j7326Q328k1781j7973J0146
$$ -72124 -62212 -25718 4225 8414 54637 13852 57883 40557 48885 27104 9131 19277
5919A9277r432L9488m472L7819J6037l6711l5768n3103n137J2046k7855K0914
$$ 19277 9845 49333 44861 82680 98717 62006 26238 -26865 -32002 -19956 -47811 -26897
5907b6897K6541L3274K3251k1992n2541J3576L596n1950J0363j9263l4731L3985
$$ -26897 -356 32918 56169 34177 -18364 -4788 -1192 -53142 -42779 -62042 -96773 -62788
5895f2788R24j765L9659k2460j8945J6096M7998q21k2199P252L4489O9538R682
$$ -62788 -61864 -63629 -23970 -46430 -65375 -49279 -1281 -2102 -24301 -17049 17440 86978 96660
5882I6660j761o9503k9809l9267L2892L0989L186n5464k2534K9890K1875J0645
$$ 96660 94899 25396 -4413 -43680 -10788 20201 23387 -32077 -54611 -24721 -2846 7799
5870G799j9023J5773J6165j9919k9060o1036l7929K4891M3461J2041j8829m107
$$ 7799 -11224 4549 20714 795 -28265 -89301 -127230 -102339 -58878 -46837 -65666 -69773
5858f9773J5988j7292j1965l1069J7964P7805J5022k5517j2385L2955q629k9906
$$ -69773 -53785 -71077 -83042 -114111 -96147 -18342 -3320 -28837 -41222 -8267 -16896 -46802
5846d6802L1191K1361J869K0547o5627q9166r969N4491j5732K9226N2536L019
$$ -46802 -15611 5750 7619 28166 -37461 -126627 -136596 -82105 -97837 -68611 -16075 -13056
5834a3056k2152l3258J0783L4410N1551p7557j4305L5250j0834N134N633K1802
$$ -13056 -35208 -68466 -57683 -23273 28278 -49279 -63584 -28334 -39168 -34034 -28401 -6599
5822f599J5600j6825M2755P402n6662K7725J7540j3388J3860j2469J7942L5257
$$ -6599 9001 -7824 34931 42333 -14329 13396 30936 17548 31408 18939 36881 72138
5810G2138p878o120k8993m3965k7728Q7K0918K0355j245l6580j9737J3061l3403
$$ 72138 64260 58140 29147 -14818 -42546 -42459 -21541 -1186 -2431 -39011 -58748 -45687 -79090
5797g9090r126K2388J5910M6424p12k2452n5061J1230M4767p224R90J2563J0225
$$ -79090 -88216 -65828 -49918 -3494 -4206 -26658 -81719 -70489 -25722 -32946 -31956 -19393 -9168
5784i168L2966M863K7197K0938m1566n5579Q858J4462L5749K9148j6143o5936
$$ -9168 23798 28661 55858 76796 35230 -20349 -11491 2971 38720 67868 51725 -14211
5772a4211k9500L0332N6060j2588m8342M72M1901M5557N502J3354o8761o2703
$$ -14211 -43711 -13379 42681 30093 -18249 -17777 24124 69681 75183 88537 19776 -42927
5760d2927P686j0299J2332l7309j4885k678O2908J1710J5373l55j8079O171o061
$$ -42927 -35241 -45540 -33208 -70517 -85402 -88080 -25172 -13462 1911 1556 -16523 -10352 -16413
5747a6413k4782L0872J4510J4167K6921l668l9282m0387j1164l907n5556J31R0712
$$ -16413 -41195 -10323 4187 18354 45275 41607 2325 -38062 -49226 -53133 -108689 -108558 -17846
5734a7846J8388J706N603o0793J1189J4378J6345O4890k2473k0206l3551n4848
$$ -17846 542 2248 7851 -52942 -41753 -27375 -11030 53860 31387 11181 -22370 -77218
5722g7218k709J5159j3913J1127J7378J7970q936K5819J8874K8883K6228l2702
$$ -77218 -79927 -64768 -78681 -67554 -50176 -32206 -41142 -15323 3551 32434 58662 25960
5710B5960m7666K5517J3905m0190J888j0460K5313L1381j9052J6931L1263j4745
$$ 25960 -21706 3811 17716 -22474 -20586 -31046 -5733 25648 6596 23527 54790 40045
5698D0045m8813l51k9162m0321J6651K2228n563L9913J5386J1615j7020l0838
$$ 40045 -8768 -9119 -38281 -78602 -61951 -39723 -45286 -5373 10013 21628 4608 -26230
5686b6230K8297K9364J5438J2765j9310L8354P399l6274n1096k4980L096J1451
$$ -26230 2067 31431 46869 59634 40324 78678 86077 49803 -1293 -26273 -23177 -11726
5674a1726J5283L622L9665k0754n8399m6422K5458K2606M5373K1417l1554k2519
$$ -11726 3557 7179 46844 26090 -32309 -78731 -53273 -30667 14706 36123 4569 -17950
5662a7950O4540J743m4118K7748K2818J751R975o0984k7069k2030J1599L0292
$$ -17950 46590 48333 4215 31963 54781 56532 66507 5523 -21546 -43576 -31977 -1685
5650a685n146n13L5788J0576q787J4574j3756j9725k8555L9083J3585j1866K059
$$ -1685 -6831 -7344 28444 39020 30233 44807 31051 11326 -17229 21854 35439 23573 25632
5637B5632k9560k4646j4589k6086L359M0435L7298R498j5416j8381j1059j6395
$$ 25632 -3928 -28574 -43163 -69249 -65890 -25455 11843 21341 5925 -12456 -23515 -39910
5625c9910m509k130L0788L0453K7849l2848j7466j3273Q982M8165N290P270l521
$$ -39910 -44419 -46549 -15761 14692 42541 9693 -7773 -21046 -12064 36101 41391 48661 45140
5612D5140J8473J5077j8574l3119K2486L650l0227Q14M1183J3046q3373n4229
$$ 45140 63613 78690 60116 26997 49483 53133 22906 23720 64903 77949 -5424 -59653
5600e9653L5435O457m2898j7680L5362L8893j3606R791N6940j1141j2550N757
$$ -59653 -24218 -17761 -60659 -78339 -42977 -4084 -17690 -7899 49041 37900 25350 31107
5588C1107K388o3311k9971m529n8106j7780r207M0477J1236K3182O189N749N5111
$$ 31107 33495 -29816 -59787 -64316 -122422 -140202 -149409 -108932 -97696 -74514 -68325 -62576 -7465
5575g465j133J4635J53j4834J8415m6348n872L7943K9762K832j2289l2826l5864
$$ -7465 -8598 6037 6190 -8644 9771 -36577 -42449 -4506 25256 28088 15799 -17027 -52891
5562e2891K1898j9958m8867r298K8769K6065L817m9642j5259N0082P946K7862
$$ -52891 -30993 -50951 -99818 -109116 -80347 -54282 -50465 -100107 -115366 -65284 -57338 -29476
5550b9476k417o6793k361N5589k5505j414j439k1693R089K4152L6608R244k0657
$$ -29476 -31893 -98686 -101047 -45458 -70963 -72377 -73816 -95509 -86420 -62268 -25660 -16416 -37073
5537c7073j3164Q533Q216K4976O1595J9715k9534M872N259k8807n544K647j0803
$$ -37073 -50237 -41704 -33488 -8512 53083 72798 43264 48136 53395 24588 19044 21691 10888
5524A0888j9252P871M7335J084o5735o4819r935N0970L995j8242j6639m0862L1
$$ 10888 -8364 -493 46842 47926 -17809 -82628 -92563 -41593 -37598 -55840 -72479 -113341 -113310
5511a13310K5247J2495M3968M9667L2534Q8J1762R192j3226K4978n0326j691L0669
$$ -113310 -88063 -75568 -31600 18067 50601 50689 62451 71643 58417 83395 33069 31378 62047
5498F2047m1423n0102o991R04l687j3431k7704R31K7356M5361j6995k3335m668
$$ 62047 20624 -29478 -36469 -35565 -39252 -52683 -80387 -79456 -52100 -6739 -23734 -47069 -51737
5485e1737m3061j2568M519Q194N9120M9010j7543J247P184J5063l9134J6868j547
$$ -51737 -94798 -107366 -102847 -94653 -35533 13477 -4066 -2819 4365 19428 -19706 -2838 -4385
5472d385k4866p919K1945J080M1749J2022n4201J294O1289J7628m4255k4087j3907
$$ -4385 -29251 -37170 -15225 -14145 27604 39626 -14575 -13281 48008 65636 21381 -2706 -16613
5459a6613k7863K1614N5976M6916n729j1910l7440r390m965J1310p263l1454r624
$$ -16613 -44476 -22862 33114 80030 74301 62391 24951 15561 10596 21906 14643 -16811 -26435
5446b6435J6278J2428J4186M4462j9923j03829m1537P0883L4501L6473j6476k8468
$$ -26435 -10157 2271 16457 60919 40996 -62833 -104370 -33487 1014 37487 21011 -7457
5434g457r36J6957K3020l7197l7487o843L90L7893j770J4817L489j4965j3255
$$ -7457 -8393 8564 31584 -5613 -43100 -49943 -49553 -11660 -13430 1387 4876 -10089 -23344
5421b3344l8165j5183O176l3637J1071N4395J1899k6010k1263J4695M491k1095
$$ -23344 -61509 -76692 -70516 -104153 -93082 -38687 -26788 -52798 -74061 -59366 -54875 -75970
5409g5970j0860q529N00Q5811R6383J9169l6258m6755l2728j258M2180J1637k1685
$$ -75970 -86830 -95359 -94859 -9048 87335 106504 70246 23491 -9237 -10495 31685 43322 21637
5396B1637j0511l4373J4945R308J159j1734K6997P449J8346m1080j4541j6854
$$ 21637 11126 -23247 -8302 1006 2165 -9569 17428 24877 43223 2143 -12398 -29252
5384b9252k6414n1452L0374N4459k0980n207K8859L9197J5200K6551R28o5230
$$ -29252 -55666 -107118 -76744 -22285 -43265 -48472 -19613 19584 34784 61335 62263 -2967
5372b967J7184K7448l7735q2326l3875M1001L9734L813j8775l5970J4152L2671
$$ -2967 14217 41665 3930 -78396 -112271 -71270 -31536 -27723 -46498 -82468 -68316 -35645
5360c5645k613K3496J6434l2264N668r691k5750N803k799N711K0403K2142m4086
$$ -35645 -38258 -14762 1672 -30592 -24924 -34615 -60365 -54562 -57361 -51650 -31247 -9105 -53191
5347e3191l3823O2654M7672l4462J9083K1483R22k3094j6040J0874O166P1221
$$ -53191 -87014 -24360 23312 -11150 7933 29416 30338 7244 -8796 2078 8244 79465
5335G9465R20n4692n6598j612o83m1439M7778R712k9740r649J4331K8710P3467
$$ 79465 80385 25693 -30905 -32517 -33200 -74639 -26861 -17149 -46889 -56538 -42207 -13497 59970
5322E9970J3274n5949l9398l9460l9416j110N2905n4502k4844M1551M4977L5096
$$ 59970 73244 17295 -22103 -61563 -100979 -102089 -49184 -103686 -128530 -86979 -42002 -6906
5310f906J6372j1208L2422m052M869j9402k5423k1937r772j0683M520M7303L7598
$$ -6906 9466 -1742 30680 26628 31497 12095 -13328 -35265 -45037 -55720 -51200 -3897 33701
5297C3701K7407k1782l2611R01j8724n915K6293l4327N3948L4767n8815l5664
$$ 33701 61108 39326 6715 7616 -11108 -17023 9270 -25057 28891 63658 4843 -30821
5285c0821L7835J4651k0913p259L2542L254n1784M634O2961k4266n3423j3109
$$ -30821 7014 21665 752 -6507 26035 29289 -22495 -17861 45100 20834 -32589 -45698
5273d5698M2041j496K7785k359l07n757m553m0207k2531k1450J5558j8951J5982
$$ -45698 -3657 -5153 22632 20273 19966 14209 9656 -30551 -53082 -74532 -58974 -77925 -61943
5260f1943P8350K4997l3284l2238m1789j6503k2684Q4901O2103J2612k8535m6581
$$ -61943 16407 41404 8120 -24118 -65907 -82410 -105094 -20193 41910 54522 25987 -20594
5248b0594j7113M0512J5270n1071k5134q431K9659L6266J9887l081k8069m558
$$ -20594 -37707 2805 18075 -32996 -58130 -66561 -36902 -636 19251 16170 -11899 -16457
5236a6457O994p3162k2239L2015k6789j0971K1048O892K6032K2265N9055K8803
$$ -16457 -9463 -82625 -104864 -72849 -99638 -110609 -89561 -82669 -56637 -34372 24683 53486
5224E3486n572j3968l784J3915J8679n0773l2930n913L379J1122k861J1879P168
$$ 53486 47914 33946 30162 44077 62756 11983 -20947 -26860 -23481 -12359 -15220 -3341 3827
5211C827R235J5084J791M6680K2364n7764k5545N853L9021J0130J2789m5044q789
$$ 3827 13062 28146 29937 76617 98981 41217 15672 21525 60546 70676 83465 38421 29632
5198B9632j8168l5099n0989J5039L3316N041l2945N2584N2893l4191o7166j7529
$$ 29632 11464 -23635 -74624 -59585 -26269 -21228 -54173 -1589 51304 17113 -50053 -67582
5186f7582K32K0508L1317l127j1068M2584j1736N1732j7189j3545J7200J1968
$$ -67582 -67350 -46842 -15525 -18652 -29720 12864 1128 52860 35671 22126 39326 51294
5174E1294j8702k515j5267k2631R990j2181M432L0785P996J0316n819L4303m314
$$ 51294 32592 30077 14810 -7821 2169 -10012 -5580 25205 33201 43517 37698 72001 67687
5161F7687m6088m5498p025M4086O1305k202k0073n1070j7529K2551M702j1432
$$ 67687 21599 -23899 -30924 13162 74467 72265 52192 1122 -16407 6144 10846 -586
5149e86L405L0006M364J2517J5940j4387k8165K0291l639l5003j6033k0427K8534
$$ -586 2819 32825 37189 49706 65646 51259 23094 43385 39746 4743 -11290 -31717 -3183
5136c183k0297k4260J4486N6050l5623k4080j1939q928K549J06K604J902O879
$$ -3183 -23480 -47740 -33254 22796 -12827 -36907 -48846 -57774 -55225 -55119 -52515 -50613 -43734
5123d3734J477j3464K533J8064k2503m0806j545N4247P4890N531J619J4503k8279
$$ -43734 -42257 -55721 -53188 -35124 -57627 -98433 -99978 -45731 29159 34690 36309 50812 22533
5110B2533m0810q233L0612K3318K567l6437l4995K8196l8413j0920K591p608l510
$$ 22533 -18277 -26510 4102 27420 29987 -6450 -41445 -13249 -51662 -62582 -59991 -67599 -71109
5097g1109L7274K2731k3281K6372N0467l4412m8715K4446J9754J6382K2553l9337
$$ -71109 -33835 -11104 -34385 -8013 42454 8042 -40673 -16227 3527 19909 42462 3125
5085C125n79J76K57k2480J2110L7459J8619m3768J5498j7632k2600L3024j0149
$$ 3125 2546 2722 2979 -19501 -7391 30068 48687 4919 20417 2785 -19815 13209 3060
5072C060N904J3921j8229K0755K3298J0148l6116L7692l1304k0949L1745k4144
$$ 3060 8964 22885 4656 25411 48709 58857 22741 60433 29129 8180 39925 15781
5060A5781p997J9516L6935N9486j3208n4742j6371K4217j0239q229M81k9292J286
$$ 15781 7784 27300 64235 123721 110513 55771 39400 63617 53378 45149 45630 16338 17624
5047A7624k1456r713P988k2092m872j4081k0836L65J1589K9771o037l5571k2485
$$ 17624 -3832 -13545 -5557 -27649 -32521 -46602 -67438 -67073 -55484 -25713 -31750 -67321 -89806
5034h9806N6869J08282j728k680J1490J1697K928p5177m8755K94M998l3843j7124
$$ -89806 -32937 75345 73617 70937 82427 94124 97052 21875 -26880 -26586 -21588 -55431 -72555
5021g2555L9855n6216N2737K5813L611M1922R733k4756o6251k127P566M0577K2823
$$ -72555 -32700 -88916 -36179 -10366 -6755 35167 44900 20144 -46107 -48234 -40668 -91 22732
5008B2732o0297o3301K7835O4860N68J3461J3815j1571j9760J4272P4211M917
$$ 22732 -37565 -100866 -73031 -8171 -7603 5858 19673 8102 -11658 2614 76825 81742
4996H1742q8994O8393M237j5474l7987n1249K9659l0079k0827N08L042m758k3861
$$ 81742 -7252 61141 65378 49904 11917 -39332 -9673 -39752 -60579 -60071 -57029 -61787 -85648
4983h5648n9939J4905N2726L9452k036P232K6023P640j8101l485k1067J3919o912
$$ -85648 -145587 -130682 -77956 -38504 -40540 -33308 -7285 355 -17746 -21231 -42298 -28379 -35291
4970c5291j4526J3454Q738J798J0991J3495K2440J1916J7798J63Q336j3714m0842
$$ -35291 -49817 -36363 -27625 -25827 -14836 -1341 21099 33015 50813 50976 59312 45598 4756
4957D756j6268j908K2745j8250o020L5908K456m735m1952k5704O2023N3736R852
$$ 4756 -11512 -13420 9325 -8925 -14945 20963 23419 18684 -23268 -48972 13051 66787 76639
4944G6639J1260j8892l0648K4701n3076O707L0647K4972J3633K6367k7053q2411
$$ 76639 87899 69007 38359 63060 9984 16691 47338 72310 85943 112310 85257 2846
4932B846l8755K972J4848L7595O003l7516J0258M9518j2180R084n0050K445j4664
$$ 2846 -35909 -32937 -18089 19506 25509 -12007 -1749 47769 35589 44673 -5377 -2932 -17596
4919a7596k1783K6787K466j13556l2079Q7038K4349j2366o571K8122O2589J8824
$$ -17596 -39379 -12592 -10126 -123682 -155761 -68723 -44374 -56740 -63311 -35189 27400 46224
4907D6224k0037j1582L0552R352o7681l7513j8098K5207M2398K1915k1061N097
$$ 46224 26187 14605 45157 54509 -13172 -50685 -68783 -43576 -1178 20737 -324 4773
4895D773l2157J3997K7118j9539k3384n413k2433J5847J0826K3462K0332p775
$$ 4773 -27384 -13387 13731 -5808 -29192 -34605 -57038 -41191 -30365 -6903 13429 5654
4883E654J212M6632n910j8674n0107k4187K0599m9799j1300N4417Q2520N694r883
$$ 5654 6866 53498 47588 28914 -21193 -45380 -24781 -74580 -85880 -31463 51057 56751 46868
4870D6868j8483j5820r579K269L5405l7406l5039m1937l257K3049M9725l7389
$$ 46868 28385 12565 2986 5255 40660 3254 -31785 -73722 -76979 -53930 -4205 -41594
4858d1594n1313L2014K5986O829J4919N9544m2252m594p888m85j9805K0415K0877
$$ -41594 -92907 -60893 -34907 -28078 -13159 46385 4133 -461 -8349 -8834 -28639 -8224 12653
$$ [...]
##END NTUPLES=NMR SPECTRUM
##END=
