##TITLE=Analysis number 327947
Compound Code cc 65063
Book Reference 464/122/4
Project Code adrs
Chemist Name chrisr
##JCAMPDX= 6.0         $$ Bruker NMR JCAMP-DX V2.0
##DATA TYPE= NMR SPECTRUM
##DATA CLASS= NTUPLES
##ORIGIN= Bruker BioSpin GmbH
##OWNER= nmr
$$ XWIN-NMR		Version 3.5
$$ Mon Apr 23 09:56:08 2007 GMT Daylight Time (UT+1h)  MAYBRIDGE\nmr@NMR_250MHZ
##.OBSERVE FREQUENCY= 250.131544655141
##.OBSERVE NUCLEUS= ^1H
##.ACQUISITION MODE= SIMULTANEOUS (DQD)
##.ACQUISITION SCHEME= undefined
##.AVERAGES= 16
##.DIGITISER RES= 18
##SPECTROMETER/DATA SYSTEM= dpx250
##.PULSE SEQUENCE= zg30
##.SOLVENT NAME= DMSO
##.SHIFT REFERENCE= (INTERNAL, DMSO, 0, 16.522)
##AUDIT TRAIL= $$ (NUMBER, WHEN, WHO, WHERE, WHAT)
$$ ##TITLE= Audit trail, XWIN-NMR		Version 3.5
$$ ##JCAMPDX= 5.01
$$ ##ORIGIN= Bruker BioSpin GmbH
$$ ##OWNER= nmr
$$ C:\u/data/dgb/nmr/ADRS/1780/pdata/1/auditp.txt
$$ ##AUDIT TRAIL=  $$ (NUMBER, WHEN, WHO, WHERE, WHAT)
(   1,<2007-04-23 09:55:39.04 +100>,<MAYBRIDGE\nmr>,<NMR_250MHZ>,
      <created by zg, POWCHK disabled, PULCHK disabled
       configuration hash MD5:
       49 4B E0 1D 92 C2 6B 37 9F E6 65 BC 52 41 86 1D
       data hash MD5: 64K
       F3 39 26 37 00 EA C8 AB 90 2F 9F 39 3E 3A B6 EA>)
(   2,<2007-04-23 09:55:57.63 +100>,<MAYBRIDGE\nmr>,<NMR_250MHZ>,
      <Start of raw data processing
       ef LB = 0.3 FT_mod = 6 PKNL = 1 SI = 32K 
       data hash MD5: 32K
       54 47 9F BA 92 B2 67 43 F3 0D CC CA C6 A8 06 D8>)
(   3,<2007-04-23 09:55:59.29 +100>,<MAYBRIDGE\nmr>,<NMR_250MHZ>,
      <apk 
       data hash MD5: 32K
       91 C0 07 9E 68 5D 30 EB 8A FC 14 18 32 D6 C8 C6>)
(   4,<2007-04-23 09:55:59.97 +100>,<MAYBRIDGE\nmr>,<NMR_250MHZ>,
      <abs ABSG = 5 
       data hash MD5: 32K
       E3 C7 85 F9 D4 79 94 25 89 35 57 84 73 16 8C FE>)
$$ ##END=
$$ 
$$ hash MD5
$$ 13 1D D1 19 C3 47 07 06 89 2C DE AC 5D 88 61 F0
##$RELAX= 
##$RELAX= 
##$RELAX= 
##$RELAX= 
##$RELAX= 
##$RELAX= 
##$RELAX= 
$$ Bruker specific parameters
$$ --------------------------
##$DU= <C:\u>
##$EXPNO= 1780
##$NAME= <ADRS>
##$PROCNO= 1
##$TYPE= <nmr>
##$USER= <dgb>
##$AMP= (0..31)
100 100 100 100 100 100 100 100 100 100 100 100 100 100 100 100 100 100 
100 100 100 100 100 100 100 100 100 100 100 100 100 100 
##$AQSEQ= 0
##$AQ_mod= 3
##$AUNM= <au_zg>
##$AUTOPOS= <3 >
##$BF1= 250.13
##$BF2= 250.13
##$BF3= 250.13
##$BF4= 250.13
##$BF5= 500.13
##$BF6= 500.13
##$BF7= 500.13
##$BF8= 500.13
##$BYTORDA= 1
##$CFDGTYP= 0
##$CFRGTYP= 5
##$CHEMSTR= <none>
##$CNST= (0..31)
1 1 145 1 1 1 1 1 1 1 1 1 1 1 1 1 1 1 1 1 1 1 1 1 1 1 1 1 1 1 1 1 
##$CPDPRG= <>
##$CPDPRG1= <>
##$CPDPRG2= <>
##$CPDPRG3= <>
##$CPDPRG4= <mlev>
##$CPDPRG5= <mlev>
##$CPDPRG6= <mlev>
##$CPDPRG7= <mlev>
##$CPDPRG8= <mlev>
##$CPDPRGB= <>
##$CPDPRGT= <>
##$D= (0..31)
0 1 0 0 0 0 0 0 0 0.06 0 0 0 0 0 0 0.0002 0 0 0 0 0 0 0 0 0 0 0 0 0 0 
0 
##$DATE= 1177318537
##$DBL= (0..7)
120 120 120 120 120 120 120 120 
##$DBP= (0..7)
150 150 150 150 150 150 150 150 
##$DBP07= 0
##$DBPNAM0= <>
##$DBPNAM1= <>
$$ [...]
##$SUBNAM7= <"">
##$SUBNAM8= <"">
##$SUBNAM9= <"">
##$SW= 20.6930455092707
##$SWIBOX= (0..15)
0 0 3 0 0 0 0 0 0 0 0 0 0 0 0 0 
##$SW_h= 5175.983436853
##$TD= 65536
##$TD0= 1
##$TE= 683.16
##$TE2= 300
##$TE3= 300
##$TEG= 300
##$TL= (0..7)
0 120 120 120 120 120 120 120 
##$TP= (0..7)
150 150 150 150 150 150 150 150 
##$TP07= 0
##$TPNAME0= <>
##$TPNAME1= <>
##$TPNAME2= <>
##$TPNAME3= <>
##$TPNAME4= <>
##$TPNAME5= <>
##$TPNAME6= <>
##$TPNAME7= <>
##$TPOAL= (0..7)
0.5 0.5 0.5 0.5 0.5 0.5 0.5 0.5 
##$TPOFFS= (0..7)
0 0 0 0 0 0 0 0 
##$TUNHIN= 0
##$TUNHOUT= 0
##$TUNXOUT= 0
##$USERA1= <user>
##$USERA2= <user>
##$USERA3= <user>
##$USERA4= <user>
##$USERA5= <user>
##$V9= 5
##$VALIST= <valist>
##$VCLIST= <CCCCCCCCCCCCCCC>
##$VD= 0
##$VDLIST= <DDDDDDDDDDDDDDD>
##$VPLIST= <PPPPPPPPPPPPPPP>
##$VTLIST= <TTTTTTTTTTTTTTT>
##$WBST= 1024
##$WBSW= 4
##$XGAIN= (0..3)
0 0 0 0 
##$XL= 0
##$YL= 0
##$YMAX_a= 406027
##$YMIN_a= -391959
##$ZGOPTNS= <>
##$ZL1= 120
##$ZL2= 120
##$ZL3= 120
##$ZL4= 120
##$ABSF1= 16.522
##$ABSF2= -4.171173
##$ABSG= 5
##$ABSL= 3
##$ALPHA= 0
##$AQORDER= 0
##$ASSFAC= 0
##$ASSFACI= 0
##$ASSFACX= 0
##$ASSWID= 0
##$AUNMP= <proc_1d>
##$AZFE= 0.1
##$AZFW= 0.1
##$BCFW= 0
##$BC_mod= 0
##$BYTORDP= 0
##$COROFFS= 0
##$CY= 12.5
##$DATMOD= 1
##$DC= 0
##$DFILT= <>
##$DTYPP= 0
##$F1P= 14.0000005364418
##$F2P= -0.99999901652339
##$FCOR= 0.5
##$FTSIZE= 32768
##$FT_mod= 6
##$GAMMA= 0
##$GB= 0
##$INTBC= 1
##$INTSCL= 1
##$ISEN= 128
##$LB= 0.3
##$LEV0= 0
##$LPBIN= 0
##$MAXI= 10000
##$MC2= 0
##$MEAN= 0
##$ME_mod= 0
##$MI= 0
##$NCOEF= 0
##$NC_proc= -4
##$NLEV= 6
##$NOISF1= 0
##$NOISF2= 0
##$NSP= 0
##$NTH_PI= 0
##$NZP= 0
##$OFFSET= 16.522
##$PC= 1
##$PHC0= 218.2802
##$PHC1= 7.063668
##$PH_mod= 1
##$PKNL= yes
##$PPARMOD= 0
##$PSCAL= 4
##$PSIGN= 0
##$REVERSE= no
##$SF= 250.13
##$SI= 32768
##$SIGF1= 0
##$SIGF2= 0
##$SINO= 400
##$SIOLD= 32768
##$SREGLST= <1H.DMSO>
##$SSB= 0
##$STSI= 32768
##$STSR= 0
##$SW_p= 5175.98343685301
##$SYMM= 0
##$S_DEV= 0
##$TDeff= 65536
##$TDoff= 0
##$TI= <Analysis number 999999
Compound Code 99
Book Reference 9
Project Code 9>
##$TILT= no
##$TM1= 0
##$TM2= 0
##$TOPLEV= 0
##$USERP1= <user>
##$USERP2= <user>
##$USERP3= <user>
##$USERP4= <user>
##$USERP5= <user>
##$WDW= 1
##$XDIM= 32768
##$YMAX_p= 462917331
##$YMIN_p= -202178
$$ End of Bruker specific parameters
$$ ---------------------------------
##NTUPLES= NMR SPECTRUM
##VAR_NAME=  FREQUENCY,     SPECTRUM/REAL,   SPECTRUM/IMAG
##SYMBOL=    X,             R,               I
##VAR_TYPE=  INDEPENDENT,   DEPENDENT,       DEPENDENT
##VAR_FORM=  AFFN,          ASDF,            ASDF
##VAR_DIM=   32768,         32768,           32768
##UNITS=     HZ,            ARBITRARY UNITS, ARBITRARY UNITS
##FACTOR=    0.157963299565203, 1,           1
##FIRST=     4132.6476996994, 0,             0
##LAST=      -1043.33573715361, 0,           0
##MIN=       -1043.33573715361, -202178,     0
##MAX=       4132.6476996994, 462917331,     0
$$ Real data points
##PAGE= N=1
##DATA TABLE= (X++(R..R)), XYDATA
$$ [...]
16120c5259J1881N7132L9364L725q0827r4j2386n2858J4451j0908O303L5988j3042
16107c6530K5944K8832O0975r341k1327M9796m4902J7716O680n6468l6603P242
16095g986l337r335L6753M0333m0730n9551o1601k3816N053J6566J6400N507l6277
16082a22021O4197O233M356j6644n8430K0208N4723N3901K4264l0168k9995o124
16070c5500k6719n1298k6509N4003N3574L455l6567J015M0567L6874j1616o1129
16058e9850j660n3860o023k6950J5073l809l532K9235M6504o920J1875l1556N1658
16045c9815Q3534L573j6237m7630k8754m5072o4029r344K5723O3257M9110O5825
16033D0141m009l5925M412j7824k6379o235r635j6255J6030n119l496k911j2746
$$ plain form
16120 -35259 -23378 33754 73118 76843 -3984 -4078 -16464 -69322 -54871 -65779 -59476 -23488 -36530
16107 -36530 -10586 18246 79221 69880 48553 98349 53447 71163 77843 21375 -15228 -7986
16095 -7986 -11323 -20658 16095 56428 15698 -43853 -105454 -129270 -124217 -107651 -91251 -85744 -122021
16082 -122021 -57824 -51591 -47235 -63879 -122309 -102101 -47378 6523 30787 619 -29376 -35500
16070 -35500 -62219 -113517 -140026 -86023 -32449 -28994 -65561 -64546 -23979 12895 1279 -59850
16058 -59850 -61510 -115370 -121393 -148343 -133270 -137079 -140611 -111376 -64872 -71792 -59917 -91473 -39815
16045 -39815 43719 47292 31055 -16575 -45329 -90401 -154430 -163774 -138051 -74794 -25684 40141
16033 40141 36132 207 4619 -13205 -39584 -45819 -55454 -71709 -55679 -60798 -64294 -67205 -79951
16020g9951M9452j5516o3539J0732P3462n939J4785N5677M920k1246N850o628
16008B2059J5378j6498m8559k9166R424l3587K1624m5460J8284J3231P6819K8054
15996C1603r090K4609P756k3185l8750n3483J503N3759M6599K403K104m944j6561
15983B4323k2009k0535n4528K8846L2185M543K9244J6761p2799J0184l2006J0303
15971d5488P311J5447J1500m4215O50m6568J620K224N4249M131L114l9021m8297
15958a23343j3383Q3517m559j0310J3348k7878J3612K3225l325J044m709O2784
15946A0023M2871P403l1137J4064Q752k2093l0796J6605j7143K8186m413m5726
15934b3404j955J8060l4079j2730j2786q902J0829r239q431K3364O8453N597J8663
$$ plain form
16020 -79951 -30499 -46015 -109554 -98822 -25360 -31299 -16514 39163 44083 22837 28687 22059
16008 22059 37437 20939 -27620 -56786 -47362 -80949 -59325 -104785 -86501 -73270 3549 31603
15996 31603 22513 47122 54878 31693 -7057 -60540 -59037 -5278 41321 43724 45828 40884 24323
15983 24323 2314 -18221 -72749 -43903 -11718 -7175 22069 38830 -33969 -23785 -55791 -45488
15971 -45488 -38177 -22730 -11230 -55445 -54795 -101363 -99743 -97519 -43270 -39139 -36025 -75046 -123343
15958 -123343 -136726 -53209 -57768 -68078 -54730 -82608 -68996 -45771 -49096 -48052 -52761 10023
15946 10023 52894 60297 29160 43224 51976 29883 -913 15692 -1451 26735 22322 -23404
15934 -23404 -25359 -7299 -41378 -54108 -66894 -75796 -64967 -74206 -82637 -59273 9180 14777 33440
15921C3440R429J1248l6956l0911J4857Q853j8306L5788o148k6270j313L9657
15909C3368J2734m027l8206n9694J0576K0213K8602l7517j6781J6928J1206L8670
15897A6072J1483M1864L0153m1839m9287l5358K926Q302K6044k891Q842J0976
15885B7287j8423m679m3382l6235Q2345N6724n6854p0533k3762L792k061M00r725
15872i5106L0918M1333Q997j352L4072R557O4258j2999q0410l2826L1441K9941
15860B7824m9662Q461l473j2133l423o282j9798k763K9204N0605q085j1455k4317
15847b5297l3172k4878L924k9444P586m7755J119M6325P0623J9534j2304M524
15835a9215J9935J1888l5516j8751N733l2232K3869r423j7984L8964K5747J276
$$ plain form
15921 33440 42869 54117 17161 -13750 1107 9960 -8346 27442 21294 -4976 -6289 33368
15909 33368 46102 42075 3869 -55825 -45249 -25036 3566 -33951 -50732 -33804 -22598 16072
15897 16072 27555 69419 99572 57733 8446 -26912 -23986 -15684 10360 7469 16311 27287
15885 27287 8864 4185 -39197 -75432 6913 63637 6783 -63750 -87512 -83720 -85781 -85381 -95106
15872 -95106 -64188 -22855 -13858 -15210 18862 28419 92677 79678 -732 -33558 -2117 27824
15860 27824 -21838 -13377 -16850 -28983 -32406 -38688 -58486 -61249 -32045 18560 10475 -980 -25297
15847 -25297 -58469 -83347 -79423 -108867 -101281 -149036 -147917 -101592 -30969 -11435 -23739 -19215
15835 -19215 720 12608 -22908 -41659 -35926 -68158 -44289 -53712 -71696 -32732 -6985 -5709
15823e709J2232R356J5535J181o2152L1557J14320l3691j15372l797Q0444k9755
15811A4149j1157m4806n1725j771o495J9698J6266L2973M0640j7549m7735m4350
15799a01862P1084K2763l6233J6787J3687L0617P3993k6502k8534j6455m6556
15788b7211k961J3871O9363k1383p5545K0388M2970l640j2894Q539k871l0239
15776b1613m0166l2331R0753M0577m1642M9433K3722p2501o9124K1490K7916M4711
15764B1225K2270J9412r838o1118l2841K6848j2593K4047K3343j1958m7004m5213
15752h3420m362O3139L4085j1661o478N482k930j2436k1350l1145M1618M3412
15740A3954K5075o5946k9725M8634M6127K0773n646k3531k1356J0475l7936l3575
$$ plain form
15823 -5709 6523 15879 31414 32595 -29557 2000 116320 82629 -32743 -36540 43904 14149
15811 14149 2992 -41814 -93539 -95310 -101805 -82107 -65841 -32868 7772 -9777 -57512 -101862
15799 -101862 -30778 -8015 -44248 -27461 -13774 16843 90836 64334 35800 19345 -27211
15788 -27211 -30172 -16301 53062 31679 -43866 -23478 19492 15852 2958 11497 8626 -21613
15776 -21613 -61779 -94110 -3357 37220 -4422 45011 68733 -3768 -72892 -51402 -23486 21225
15764 21225 43495 62907 53069 -8049 -40890 -14042 -26635 -2588 20755 8797 -38207 -83420
15752 -83420 -87782 -24643 9442 -2219 -8697 -3215 -6145 -18581 -39931 -71076 -29458 13954
15740 13954 39029 -26917 -56642 -8008 38119 58892 53246 29715 8359 18834 -19102 -52677
15728e2677l6960R509j6827J1257k2577j8846N7687K8383J4183M5016J0295l040
15716B5403m707J534k1252k1451k0701L5353K3947o8663o2027O2476O2869K8845
15704D1626K6483K629M8139L4960R322n3666o2482o6035l1317K0382K0935J9654
15692A0630J3813n3091j1371j0429j2506q259J9376j175l0794m3907M6892L3997
15680d6824L4330P025O6986j1098o0431n9843n3766M6051j2401L4918L0789L0831
15668F567J8571j2837j4553P58J2394j8903j8453Q902j5353J5529L9994O4699
15656H7315q382l1060m9998p7499J3680L237O9651N8567n9962k0269o2906j9669
15644i7295k4964Q140K9159M6505k079j1176o7053l664J5522L3617J2784M2352
$$ plain form
15728 -52677 -89637 -80128 -96955 -85698 -108275 -127121 -69434 -41051 -26868 18148 28443 25403
15716 25403 20696 22230 978 -20473 -41174 -5821 18126 -50537 -112564 -50088 12781 41626
15704 41626 68109 70738 118877 153837 163159 109493 47011 -19024 -50341 -29959 -9024 10630
15692 10630 24443 -28648 -40019 -50448 -62954 -71213 -51837 -53012 -83806 -127713 -80821 -46824
15680 -46824 -12494 -5469 61517 50419 -10012 -69855 -123621 -77570 -89971 -55053 -24264 6567
15668 6567 25138 12301 -2252 -1494 10900 -8003 -26456 -17554 -32907 -17378 22616 87315
15656 87315 78933 47873 -2125 -79624 -65944 -62707 6944 65511 5549 -14720 -77626 -97295
15644 -97295 -122259 -114119 -84960 -38455 -40534 -51710 -118763 -122427 -106905 -73288 -60504 -18152
15632a8152J8396l7710k742j303k8782k3242k184M8262L2144L3496K8156j5928
15620C0411n9325n8807M2821K9838Q0867M6529m1912o5609k7293j9194R628L3442
15608A396L4137K5785p0675k6656L5506l0151l5113M494M290J4745k676l0815
15596g5733L7665M2522K6844M5161m3800q4367l1878J3435j3883p715L0356n454
15584f6847j0846L1329O5057J4960N659j3707l1912l2030k5839j5756P604j8781
15572i1109k2872M0963J2814m427K6653J3576P860L838O738J5808m8408Q095Q0696
15559E0225K1189j4557l6766l6836l2144L6645M869n9671J7749J0838Q259J014
15547b9186j8063n6030k624J5248M3173o407m4064J4141L4043M1335l458l2227
$$ plain form
15632 -18152 244 -37466 -40208 -41511 -70293 -93535 -95719 -47457 -15313 18183 46339 30411
15620 30411 -28914 -87721 -44900 -15062 65805 112334 70422 4813 -22480 -41674 -32046 1396
15608 1396 35533 61318 -9357 -36013 -507 -30658 -65771 -61277 -56987 -42242 -44918 -75733
15596 -75733 -38068 4454 31298 76459 32659 -51708 -83586 -70151 -84034 -91749 -61393 -66847
15584 -66847 -77693 -46364 18693 33653 39312 25605 -6307 -38337 -64176 -79932 -72328 -91109
15572 -91109 -113981 -73018 -60204 -64631 -37978 -24402 -16542 -12704 -5966 9842 -38566 -30471 50225
15559 50225 71414 56857 20091 -16745 -48889 -12244 -7375 -67046 -49297 -38459 -30200 -29186
15547 -29186 -47249 -103279 -105903 -90655 -47482 -53889 -97953 -83812 -49769 -8434 -11892 -44119
15535d4119P593n208p432k3096M5493J1395j0194m4207L3152O7001P858l058J1367
15522D6545l3718l546J5175N512k074j7798o9162k0191L5848o025K3321n086p533
15509c8732L6958j8249k7851k8020J3782J6468J1802j5937k2388m0888j9756J9406
15497a13405O4057k026J5708J6204k8694l85R7466o001K394l8497k6701L654o727
15484b2953K1065k0466L7840K6740L7678Q674n7363R157l0030r01j652k1162l4074
15471d7447k0006m62P880L5624l8570j4003J5256L1232K7584P1213L265o0410
15459A1156j9167j9323k5949J5989k9930j6734K416J7598j2680M604L6190j1288
15447d7118k0420J464L7336J3295j2723m2873K7601N8165q836o3281m312m107
$$ plain form
15535 -44119 -36526 -41734 -49166 -72262 -26769 -15374 -25568 -69775 -36623 30378 38236 35178 46545
15522 46545 12827 9281 24456 29968 27894 10096 -59066 -79257 -43409 -49434 -26113 -31199 -38732
15509 -38732 -1774 -20023 -47874 -75894 -62112 -45644 -33842 -49779 -72167 -113055 -132811 -113405
15497 -113405 -49348 -51374 -35666 -19462 -48156 -48541 48925 42924 45318 6821 -19880 -16226 -22953
15484 -22953 -1888 -22354 15486 42226 79904 88578 31215 40372 10342 9441 7789 -13373 -47447
15471 -47447 -67453 -67915 -60035 -24411 -62981 -76984 -61728 -30496 -2912 68301 71566 11156
15459 11156 -8011 -27334 -53283 -37294 -67224 -83958 -81542 -63944 -76624 -72020 -35830 -47118
15447 -47118 -67538 -66074 -28738 -15443 -28166 -71039 -43438 14727 5891 -57390 -61702 -65809
15435f5809K548N1655m553k9165j5468r272j1388k5043P122K0300O324k3034P438
15422h8345N1282M5525J321n9984j6594K2057l2231k7214j8775N1227R4531j3785
15410I015J4606k1176j7256k7515l956J4611j5756j2773L4438L5465k7760L691
15398a4366M004l2756m9466m6463N061L1773P1707M2402M0984J0988l5993r586
15386A8289j4852o3482j5406K1665j8133l0546J7337O2342n094k0581k0769L3002
15374c6228L5241J8646k5852l2573k6826J4391J1028j7114P080O0470j0687l1497
15362c3921j7524K6345J3663J9175l9958n0984J3967K8492k2736M813l1332n255
15350i5255j5636J3554O3934K5631J3489L0235k9680n3601n7984l639L922L5429
$$ plain form
15435 -65809 -63261 -11606 -16159 -45324 -60792 -70064 -81452 -106495 -99373 -79073 -72749 -95783 -88345
15422 -88345 -37063 8462 9783 -50201 -66795 -44738 -76969 -104183 -122958 -71731 22800 9015
15410 9015 23621 2445 -14811 -42326 -46282 -31671 -47427 -60200 -25762 9703 -18057 -14366
15398 -14366 -10362 -43118 -92584 -139047 -133986 -102213 -30506 11896 52880 63868 27875 18289
15386 18289 3437 -60045 -75451 -53786 -71919 -102465 -85128 -22786 -27880 -48461 -69230 -36228
15374 -36228 -987 17659 -8193 -40766 -67592 -53201 -42173 -59287 -52207 8263 -2424 -33921
15362 -33921 -51445 -25100 -11437 7738 -32220 -83204 -69237 -40745 -63481 -58668 -90000 -95255
15350 -95255 -110891 -97337 -33403 -7772 5717 35952 6272 -47329 -105313 -108952 -105030 -69601
15338f9601J0381m604q169J518m852r476J2685o681M9528j279p6390k1170K6320
15325a01790M0992K282K9927l875L1575o791M396j3696q3734m1086m2405M5696
15313a38509M5923L5790L672K3771m5554o3546M0412J04023k531l0608k4333q568
15301f0058o253N2664k3437m1032k459J8870m432p508N4813J7669j0248k4840
15289c6251O555q797J3487O1974n7979k7582j6249J4493l021j4921l0599O07L4250
15276f4033P443j9918n564j4165P4361L7863l3976j5060J0862J7028l4157m71
15264c9787L5111k2256l4940M097j1160k4600L8436j6291J0952L3765J0737k6899
15252d2835j922N0716R417J5613n1834J31o368J8939j6461L910o477m523N2199
$$ plain form
15338 -69601 -59220 -63824 -71993 -70475 -75327 -84803 -72118 -78799 -29271 -30550 -106940 -128110 -101790
15325 -101790 -60798 -58516 -28589 -32464 -889 -7680 -3284 -16980 -100714 -141800 -184205 -138509
15313 -138509 -92586 -56796 -53124 -29353 -74907 -138453 -98041 5982 3451 -27157 -51490 -60058
15301 -60058 -66311 -13647 -37084 -78116 -80575 -61705 -66137 -73645 -18832 -1163 -11411 -36251
15289 -36251 -29696 -38493 -25006 36968 -21011 -48593 -64842 -50349 -53370 -68291 -98890 -98283 -64033
15276 -64033 -56590 -76508 -82072 -96237 -21876 15987 -17989 -33049 -22187 -5159 -39316 -39787
15264 -39787 -4676 -26932 -61872 -57775 -68935 -93535 -55099 -71390 -60438 -26673 -15936 -42835
15252 -42835 -44757 5959 15376 30989 -20845 -20714 -27082 -8143 -24604 -20694 -27171 -31694 20505
15239B0505J052o8633P944p076l9070J0186M4487Q027j0780q478n5913k5216L2725
15226i0240L1424n979J398k434l5500o300N3461L2927p126K1772J532j2573J3395
15213d243O6549o506k6023J5756k0791k3992N700j571J1600J7924k6333j7052
15201h982L210k2238K2799L344j1678k3298j0908k3253m1638J3199P5014P590
15189a6839l3430K2056J0828j3619n961p014o198n396Q2977n492n4179k0824J5580
15176c7511m878K5298M93R128q622k4931M8789j1299m7151L005j0410p1184J2470
15163a16803K9349K9437N639K9669M2242J8025m0243o5192K2012M9755K4385J7440
15151D5715J4178M2654l1610n7698j8702K2744j9186l2195J877O0248Q671o4776
$$ plain form
15239 20505 21557 -47076 -39132 -46208 -85278 -75092 -30605 -22578 -33358 -41836 -97749 -122965 -90240
15226 -90240 -58816 -64795 -63397 -65831 -101331 -107631 -54170 -21243 -28369 -6597 -5065 -17638 -4243
15213 -4243 62306 55800 29777 45533 24742 750 6450 4879 16479 34403 8070 -8982
15201 -8982 -5772 -28010 -5211 -1867 -13545 -36843 -47751 -71004 -112642 -99443 -24429 -16839
15189 -16839 -50269 -28213 -17385 -31004 -36965 -43979 -50177 -55573 27404 21912 -32267 -53091 -37511
15176 -37511 -42389 -17091 -16598 -7470 -16092 -41023 7766 -3533 -50684 -47679 -58089 -129273 -116803
15163 -116803 -87454 -58017 -52378 -22709 19533 37558 -2685 -67877 -45865 3890 28275 45715
15151 45715 59893 102547 70937 13239 -5463 17281 -1905 -34100 -32223 28025 36696 -28080
15139b8080K4695Q614l9372j1947O2904r337m5859k1022J3784K7748M001L5040
15127B1169p950j3585j3278m7222p122J5463J3532N5974o753j4106K1020j7302
15115a60r026r840j4223n1891j8906N1210R1067o714l1551J6622K681m7691l4946
15102f3368L9737L6682J7479l0890j2287L1644J2468m3839m3168k2167r104j5689
15090a02502k2830k6039L8191m91n7939M7672M2837O6403L1216n9299k2051K9095
15078c5737j5850j8243l358L1388J6408K4244j537n1946P98l969P6857P4148l8580
15065E4623n2922k9664r671p658J1837m3803k8606L266J5136M1937k549J1295
15053c6779L3033L3706m598p3418O670J3961J7502K1848K2332q493n1535j6000
$$ plain form
15139 -28080 -3385 5229 -34143 -46090 16814 7477 -38382 -59404 -45620 -17872 -13871 21169
15127 21169 13219 -366 -13644 -60866 -67988 -52525 -38993 16981 10228 -3878 17142 -160
15115 -160 -9186 -19026 -33249 -85140 -104046 -52836 38231 31517 -34 16588 19269 -28422 -63368
15102 -63368 -23631 13051 30530 -360 -12647 18997 31465 -12374 -55542 -77709 -86813 -102502
15090 -102502 -125332 -151371 -113180 -113671 -171610 -123938 -81101 -14698 16518 -42781 -64832 -35737
15078 -35737 -51587 -69830 -73188 -41800 -25392 -1148 -2685 -54631 -53833 -57802 19055 93203 54623
15065 54623 1701 -27963 -37634 -45292 -33455 -77258 -105864 -102598 -87462 -45525 -48074 -36779
15053 -36779 -3746 29960 25362 -48056 -41386 -27425 -9923 11925 34257 25764 -25771 -41771
15041d1771L4926M3888l9155n3422p3190m6977N85O1441O0187M0553P631m1588
15029d6892k9872J6929R131m6976Q620L9013L8126o116o0701O673M3201L2125
15017C261O609j0305J0120k1532k9687K182r787j4597J0102m699L4411l2473j128
15004e7523L6116J3581k7259m7842O4368J300n2497P534M2241k3303j2737K552
14992e3469k7766j7840M0118N2941q667m5014O2467M3556n3880m8093O119k5531
14980g5059l467K6163L2231Q918R968o1728n0360L9972J6684L4393N856j0404
14968b6833K1901k6510m1054N2708P0529M932m457r209m0364l0017L0365K5293
14956B7284k2371j1998K2050j0469l8754N3672J9692l9709J8344k6915N8385P0829
$$ plain form
15041 -41771 -6845 37043 -2112 -55534 -128724 -175701 -175116 -113675 -53488 -12935 -5304 -46892
15029 -46892 -76764 -59835 -50704 -97680 -89060 -50047 -11921 -18037 -78738 -72065 -28864 3261
15017 3261 9870 -435 9685 -11847 -41534 -39352 -49139 -63736 -53634 -58333 -23922 -56395 -57523
15004 -57523 -21407 -7826 -35085 -82927 -18559 -17259 -69756 -62222 -19981 -43284 -56021 -53469
14992 -53469 -81235 -99075 -58957 -6016 -14683 -59697 2770 46326 -7554 -55647 -49528 -75059
14980 -75059 -78526 -52363 -20132 -11214 -1246 -62974 -113334 -73362 -56678 -22285 -16429 -26833
14968 -26833 -4932 -31442 -72496 -19788 50741 55673 51216 42007 1643 -28374 1991 27284
14956 27284 4913 -7085 14965 4496 -34258 19414 39106 -603 17741 -9174 49211 120040
14944A20040n0387o6102m8752j1647l2892l4340L5676L3732L964J1298k2245K1705
14932c9950J327o127j3374J3799M902K4605M9257j821j3656l2972l930k4773N581
14919c7132P552k5705j5715k874K8203N560n5235k9077L9748J0744K5036J6689
14907c2206N3699o1037l2447j4362O6005m633m1429L5495J60k0765k2640L8087
14895c6073L5310j1759q525L2215o37j4525Q242j606j2025j7134J3260m6757n650
14882f5664K8813M7403j6637k745l3349l1403R623p944J7133Q361K2411j3126
14870c7124k1306r367O1311L7640p0991j2681N721K113J6694K3600j6580m2010
14858f2980K5714Q004L4500k0260m6011j7040j8661M6478L640k2535j2266J4413
$$ plain form
14944 120040 69653 3551 -45201 -56848 -89740 -124080 -88404 -54672 -50708 -39410 -61655 -39950
14932 -39950 -38623 -44750 -58124 -44325 -39423 -14818 34439 32618 18962 -14010 -17940 -42713 -37132
14919 -37132 -29580 -55285 -71000 -73874 -45671 -40111 -95346 -124423 -84675 -73931 -48895 -32206
14907 -32206 21493 -39544 -71991 -86353 -20348 -24981 -66410 -30915 -30755 -51520 -74160 -36073
14895 -36073 -763 -12522 -21047 11168 10531 -3994 4248 2642 -9383 -26517 -13257 -60014 -65664
14882 -65664 -36851 10552 -6085 -8830 -42179 -73582 -63959 -71903 -54770 -46409 -23998 -37124
14870 -37124 -58430 -67797 -6486 31154 -39837 -52518 -46797 -44684 -27990 -4390 -20970 -62980
14858 -62980 -37266 -29262 5238 -15022 -61033 -78073 -96734 -50256 -46616 -69151 -81417 -67004
14846f7004K385l9226N090M2270o841M1976Q6428K6299m7691j8254k8639k5794
14834b9001J3605K7926k5180k6772l2287j9264O5658J7360m4356k1996j9002L8762
14822e4547K5235l611j179j1627L0268j5189k6795r583M8805n462L7811K4941
14810C9067j7959p8766l4772L2681l147L580k5631K1279J7302J8637k334n429
14798c5492J260j3900J3180K6599k2646k935p702o118k9606k6109n750M1287P191
14785f0741l243Q802K6634j7998k6181N850J4387k8499K7464J9579l952L4141
14773c757L461l5744K6561N3976k0363j0809l1708K3575M0083j8412k8214k3144
14761b4495j1643P039j0181K5066Q480J410n5424m0670N5571J6962k4286J0281
$$ plain form
14846 -67004 -64619 -103845 -98755 -56485 -63326 -21350 65078 91377 43686 25432 -3207 -29001
14834 -29001 -15396 12530 -12650 -39422 -71709 -90973 -25315 -7955 -52311 -74307 -93309 -54547
14822 -54547 -29312 -32923 -34102 -45729 -15461 -30650 -57445 -67028 -18223 -23685 14126 39067
14810 39067 21108 -57658 -92430 -59749 -62896 -59316 -84947 -63668 -46366 -27729 -30063 -35492
14798 -35492 -34232 -48132 -34952 -8353 -30999 -33934 -41636 -47754 -77360 -103469 -109219 -67932 -60741
14785 -60741 -63984 -55182 -28548 -46546 -72727 -66877 -52490 -80989 -53525 -33946 -37898 -3757
14773 -3757 -296 -36040 -9479 44497 24134 13325 -18383 5192 45275 26863 -1351 -24495
14761 -24495 -36138 -29099 -39280 -14214 -5734 -4324 -59748 -100418 -44847 -27885 -52171 -41890
14749d1890j3737l4733N8583J2737J0294K6314M829p6465j3494L0487K7343M3459
14737C3727K7392m8814q9580n2628j0159J7648L320K2474K065L5777J3262J7745
14725b7771M5199M9560n5149m0336J3687l266K6965k6865k6790k7054J6144L1864
14713b3812K3161M5522K171J8936l2923n895j6072l5272m0069J7556K1366p454
14701c2785k8199k6452N369K021k4056N1175L3833L9893k3672m1416J5093K9234
14689C8m1583L4550P546l3631k7734J669M9719Q949j4771J3963L1514j567k1589
14676G073j725K1832r443o114l2261k0924J0172M872J9644K356p902l8639J705
14663d9354Q461N4513p9519J771M1894k6251O863L900J6752K0876J6286k4218
$$ plain form
14749 -41890 -55627 -90360 -31777 -19040 -8746 17568 22397 -54068 -67562 -37075 -9732 33727
14737 33727 61119 12305 -77275 -129903 -140062 -122414 -119094 -96620 -94555 -58778 -45516 -27771
14725 -27771 17428 66988 11839 -28497 -14810 -18076 8889 -17976 -44766 -71820 -55676 -23812
14713 -23812 -651 44871 47042 65978 33055 27160 11088 -24184 -64253 -46697 -25331 -32785
14701 -32785 -60984 -87436 -82067 -80046 -104102 -52927 -19094 20799 -2873 -44289 -29196 38
14689 38 -41545 -6995 551 -33080 -60814 -59145 -9426 -477 -15248 -1285 30229 28662 7073
14676 7073 5348 27180 17737 11623 -20638 -41562 -31390 -26518 -6874 -4518 -12420 -51059 -49354
14663 -49354 -40893 13620 -65899 -64128 -22234 -48485 -41622 -37722 -20970 -94 16192 -8026
14651h026k3265k2903l1019k4809J6174K2990j7292j8714K9533P9132k7067k7171
14639e2437l5161Q282J6641M888m251Q769J603l4914J8746M3642K2712N2564L2183
14626H3267k7954l8261m1925j9502J0523j7620J3457K246J6241j0659l1175K6057
14614c5305P1715j2816k6256K1627L794j5731m7503l6641K8228J4588k8532L9278
14602b3554J1222J4134J8564m6152L5791K919j0818j0346j4691K2387K4813j1222
14590A3047j5234k4159L225p2579o0770M998K8193k1391p445j26K2956k168M0890
14577i0563k6037P000L932K4019K5012N434K9085k8359O843l6879m3957K1254
14565a03216J1425r262K0718L5890O0552L9350k6274k0408o067K9211k0207r218
$$ plain form
14651 -8026 -31291 -54194 -85213 -110022 -93848 -70858 -88150 -106864 -77331 1801 -25266 -52437
14639 -52437 -87598 -79316 -62675 -57787 -62038 -53269 -51666 -86580 -67834 -24192 -1480 51084 83267
14626 83267 55313 17052 -24873 -44375 -33852 -51472 -38015 -35769 -19528 -30187 -61362 -35305
14614 -35305 36410 23594 -2662 18965 22759 7028 -40475 -77116 -48888 -34300 -62832 -23554
14602 -23554 -12332 1802 20366 -25786 10005 12924 2106 -8240 -22931 -544 24269 13047
14590 13047 -2187 -26346 -23121 -95700 -156470 -151472 -123279 -144670 -152115 -152241 -129285 -131453 -90563
14577 -90563 -116600 -109600 -105668 -81649 -56637 -51203 -22118 -50477 -43634 -80513 -124470 -103216
14565 -103216 -91791 -101053 -80335 -44445 16107 55457 29183 8775 2708 31919 11712 2494
14553B494P1188n486k9261R664l5904n5329J0686m4014L6358R0348L3857m9854
14541C4747m3153q106K300o947R734J4245p0581N761M8393l7219l6339J1732M9004
14528b6429K44J1705K5965J8656J8658k7789m3829O510j397Q242l2099j6630M6432
14515a1761M6966j3653l1578k9656j9342L334j7789k700Q9255M2384p964n3808
14503f312m6181r238K8234L9300k0850j3537k7307O099j2756j1658J3542O6813
14491F149l593k8434L002j3294q658L1086l6063m9815O4662O7631K1413j9077
14479C5009r3370J1773L8965J4586N9137O6379k5581j6884j20710o0428K6558
14468f4566M8742k0660J8882J1069r663m6537L912K1171J157n9851J3063O8817
$$ plain form
14553 2494 73682 68196 38935 48599 12695 -42634 -31948 -75962 -39604 50744 84601 34747
14541 34747 -8406 -16512 -14212 -21159 -11425 2820 -67761 -62000 -13607 -50826 -87165 -75433 -26429
14528 -26429 -26185 -14480 11485 30141 48799 21010 -22819 -16309 -17706 -9464 -41563 -58193 -11761
14515 -11761 35205 21552 -10026 -39682 -59024 -55690 -73479 -76179 13076 55460 47496 -6312
14503 -6312 -52493 -61731 -33497 5803 -15047 -28584 -55891 -49792 -62548 -74206 -60664 6149
14491 6149 2556 -25878 -22876 -36170 -44828 -13742 -49805 -99620 -34958 32673 54086 35009
14479 35009 -58361 -46588 -7623 6963 66100 132479 106898 90014 -30696 -91124 -64566
14468 -64566 -15824 -36484 -17602 -6533 -16196 -62733 -58821 -37650 -36493 -96344 -83281 -14464
14456a4464N31m0969k0052k512j497L0585N7623J2273K9362j6584k0857N8328
14444G1767r083j6632K007k0225l6325n7670k5323M0809J5704M486K2068O0390
14432E1973r861n1821M110J0426K1022J0795j7831l2577J9328N753n227J1410
14420A7500m9700k0881L7782K9611k1738k6592m0561O36M5691K4268j5578j8011
14408c7573p61q0L452k9758l8954M6262P790K6615m6812j9069K0902k8911K9205
14395f7692k551k2963j8121L4265O2697j5823J2011Q5985N6173l975m9190l8999
14383C1817j4364m2770k9361j3882J145K8669J0302o7568j2080L2062Q0592Q102
14371A2664j6026K835j4989k2496L3140K0332l4626n4269j8873M9885L2877o410
$$ plain form
14456 -14464 -13933 -54902 -74954 -77466 -78963 -48378 9245 21518 50880 34296 13439 71767
14444 71767 62684 46052 48059 27834 -8491 -66161 -91484 -50675 -34971 -30485 -8417 51973
14432 51973 42112 -9709 -5599 4827 25849 36644 18813 -13764 5564 11317 6090 17500
14420 17500 -32200 -53081 -15299 14312 -7426 -34018 -74579 -73943 -28252 -3984 -19562 -37573
14408 -37573 -38334 -38414 -34962 -64720 -103674 -57412 -49622 -23007 -69819 -88888 -67986 -96897 -67692
14395 -67692 -70243 -93206 -111327 -77062 -14365 -30188 -18177 67808 123981 120006 70816 31817
14383 31817 17453 -25317 -54678 -68560 -67415 -38746 -28444 -96012 -108092 -76030 4562 12664
14371 12664 -3362 -527 -15516 -38012 -4872 15460 -19166 -73435 -92308 -42423 -9546 -15956
14359a5956K8375n5018m0938J8095K1981n268j3963m309q573M3336J5814o2236
14347g8660K0375N0743j0559l9211K5736M2254r271o4499L6623O118m8846l547
14335g2744k4744O1976K6841n0262J5275M2374O0013M075k7591m5056N371J6161
14323A1689k1854k2068k477n755L7807l6629n0322N8578j7226j9711L2899P685
14311b7384K9980R102K8093O50k9494l5792N845J2431j4155j2157K1120O3731
14299E1970j2115o1381n2488l0625L0676J6243j9207m424L5866L6144J8981j7899
14287h259m7664L8036L3802p462K7866O6141K1276O83L786J2475K0414l7357k0532
14274A03205J328l4897M670p584K2877j9117J6018Q880R079k9931M125O623k1339
$$ plain form
14359 -15956 12419 -42599 -83537 -65442 -43461 -48729 -62692 -67001 -75574 -32238 -16424 -78660
14347 -78660 -58285 -7542 -18101 -57312 -31576 10678 1407 -63092 -26469 -20351 -69197 -72744
14335 -72744 -97488 -35512 -8671 -58933 -43658 -1284 58729 62804 35213 -9843 -4472 11689
14323 11689 -10165 -32233 -34710 -40465 -2658 -39287 -89609 -31031 -48257 -67968 -35069 -27384
14311 -27384 2596 11698 39791 40441 10947 -24845 -19000 -6569 -20724 -32881 -11761 51970
14299 51970 39855 -21526 -74014 -104639 -73963 -57720 -76927 -81351 -45485 -9341 9640 -8259
14287 -8259 -55923 -17887 15915 8453 36319 102460 123736 124419 128205 140680 161094 123737 103205
14274 103205 104533 69636 74306 66722 89599 70482 86500 95380 104459 74528 78653 85276 63937
14261F3937o4677k4772L4437p0668j7773N6041O0799n0170J8700N7782K4768o7425
14249B0979j5767J1228M6859K6320J6706l564k2825m2483l2987J7588L8782J9093
14237G9929j9254j0563L272j4638o0445p93N5683L0644l1670j1614k932p868L0837
14224D0588k914j3385K6734j5718k3175J0663R61j0021N8925N1388o1655p0963
14212h572l1498K3775N2230K0510o0845L3521K2676m5535J2838n032J1468P918
14200C3454m9327j6147K4287j3006Q185K6792K2536l2211j5465j1212l4594J0083
14188d6625m370M832L352k1436J1619M0987J4158j6415l159L2246N808k0457O782
14175G322O195k7666l5914R99J172k1609M5283N7149M5q440o8105n2553K0912
$$ plain form
14261 63937 -740 -25512 8925 -61743 -79516 -23475 37324 -12846 5854 63636 88404 20979
14249 20979 5212 16440 63299 89619 106325 102761 79936 37453 4466 22054 60836 79929
14237 79929 60675 50112 53384 38746 -21699 -22492 33191 63835 32165 20551 17619 9751 40588
14224 40588 37674 24289 51023 35305 12130 22793 23754 13733 72658 124046 62391 -8572
14212 -8572 -40070 -16295 35935 56445 -4400 29121 51797 6262 19100 14068 25536 33454
14200 33454 -15873 -32020 -7733 -20739 -12554 14238 36774 4563 -10902 -22114 -56708 -46625
14188 -46625 -50995 -46163 -42811 -64247 -52628 -11641 2517 -13898 -17057 15189 20997 540 7322
14175 7322 13517 -14149 -50063 -49064 -47892 -69501 -24218 32931 32976 24536 -43569 -96122 -75210
14162g5210O4801J7821l4865n3724n0650K1802Q4195J5500j8013K3440j9361k2042
14150d6306k1084K111L8257O2600k3789l8313J6084m1482k1809M1127j8190m4229
14138i5023J5572O8862P138m2626k2245m532L3194o950N4800M5107j6512o2284
14126b5499l1115L2769O9042L0287m6106p900L4012J3016L2698j7407l8251k7832
14114A7714j1978K3269K8196m7230l8901j6270R832J4323n548K9569Q831M6743
14102E8550k4224k2072k9793l0508k6594L757N4524O3167K7536j457j6420l1282
14090B5184l8031j4210j6344L1885M8524l0468j5456j5006J2512j2873N8368J3376
14078D7461K1255n363m3093j6411J5727K3084k1748k6581Q295L6356R978j4319
$$ plain form
14162 -75210 -10409 7412 -27453 -81177 -131827 -110025 -25830 -10330 -28343 -4903 -24264 -46306
14150 -46306 -67390 -65279 -27022 35578 11789 -26524 -10440 -51922 -73731 -32604 -50794 -95023
14138 -95023 -79451 -10589 -3451 -46077 -68322 -72854 -39660 -46610 8190 53297 36785 -25499
14126 -25499 -56614 -23845 45197 75484 29378 21478 55490 68506 101204 83797 45546 17714
14114 17714 5736 29005 57201 9971 -28930 -45200 -35368 -21045 -26593 2976 11807 58550
14102 58550 34326 12254 -17539 -48047 -74641 -70884 -16360 46807 74343 72886 56466 25184
14090 25184 -12847 -27057 -43401 -11516 37008 6540 -8916 -23922 -11410 -24283 34085 47461
14078 47461 68716 63353 20260 3849 19576 42660 20912 -5669 2626 38982 48960 34641
14066C4641k0959l3446M2059J2755m5703j6090l2707N2176j7966K7301k6878m0832
14054f5649O3279J3636l2122p74L1688k0320n5418O639o23m6097K031L0745J0957
14041f2028l3965M7821O1526k0448K3556K9766K0953k079m0386k6556N7436m418
14029E1178j5099m08j077N1809L697L1909j5321r1978n5564r678N9787Q390j7926
14016b81R328m804J8466n411N795J5434L8250l5005o0714O544M5856M5485J8983
14003I7926j8510K267l1550m6727o2978M9737L3980m7870l5546K5077O7168K5719
13991E8693J5313o9568n7347N945K1649n290K779J7891K1969K0478K7469K3071
13979H3052j9120k5980N2533m122m3199n3796k8385K7674M8920O510n4818q732
$$ plain form
14066 34641 13682 -19764 22295 35050 -10653 -26743 -59450 -7274 -25240 2061 -24817 -65649
14054 -65649 -2370 11266 -20856 -21630 10058 -10262 -65680 -59041 -59664 -105761 -103730 -72985 -62028
14041 -62028 -95993 -48172 13354 -7094 16462 46228 67181 65102 24716 -1840 55596 51178
14029 51178 36079 35671 34594 86403 90100 122009 106688 14710 -40854 -50532 9255 17645 -281
14016 -281 9047 4243 22709 17298 23093 38527 76777 41772 -18942 -12398 33458 78943 97926
14003 97926 79416 81683 50133 3406 -59572 -9835 24145 -23725 -59271 -34194 32974 58693
13991 58693 74006 4438 -52909 -46964 -25315 -30605 -27826 -9935 12034 32512 59981 83052
13979 83052 63932 37952 90485 86363 43164 -10632 -39017 -11343 37577 44087 -10731 -19463
13967a9463k852K3138K4282n3183n1374K4158K6070M8428J6648k0408k8479j7649
13955c0684L404l6655l0906O1363K8269m5782K7754L5155N7889J984l0816k170
13943C8805l0364L7271L3365j9619K638J7112j7117L882J3659l6967n3304K0607
13931I968K8636j2559o517k846M2718r640R531q2478m0639j4971M1827O005j0905
13918d1870n704k0633k2969K1846J1435j8021K6952m2290o7168k550M3999P698
13906a09275N87M7201Q2831K2625k8367p8534l4170M4489M2345j2036K1482r673
13894a0495l970j7387O5952P4781p24j4904j0692j1023q862j7111K4426j6582
13882E3409q4946l1119j0547j6461m1721M0838L7901r760M2861j8000j9359N3681
$$ plain form
13967 -19463 -22315 823 25105 -28078 -79452 -55294 -29224 19204 35852 15444 -13035 -30684
13955 -30684 -27280 -63935 -94841 -33478 -5209 -50991 -23237 11918 69807 71791 40975 38805
13943 38805 8441 45712 79077 59458 62096 79208 62091 65973 79632 42665 -10639 9968
13931 9968 38604 26045 19528 16682 59400 49760 59291 -23187 -63826 -78797 -36970 -30965 -41870
13918 -41870 -47574 -68207 -91176 -69330 -57895 -75916 -48964 -91254 -158422 -160972 -116973 -109275
13906 -109275 -108688 -61487 21344 43969 15602 -62932 -97102 -52613 -10268 -22304 -822 -10495
13894 -10495 -14465 -31852 34100 108881 108157 93253 82561 71538 62676 45565 69991 53409
13882 53409 -31537 -62656 -73203 -89664 -131385 -90547 -52646 -62406 -19545 -37545 -56904 -3223
13870c223N6898J2744o0434o1156o332J5067L1986k0833O291L4130L4912J0285
13858E0335k6401j9106M2659K2392r312k1922j9853J3041k472j6203O638Q82j7695
13845B983K7594J300k2240k8615k0039J0630O1885K7067j0135j762o6393l4000
13833e1725L3563O3665n520m7024j6364J9950m5760j4183L4172L4023L2437K0667
13821E7901k51r006r1344j5592K0034K094K0933k5751O897J9781l175R027l4729
13808d3181K1360l5745j7684N0296K172l2548j8958J474K0077J9419L6501Q284
13796A1467J1929k4084L1258j9233L9733O017o9183j9389M1221L0857M4764j80
13784H5177o4068o2188k917j2526K9828N1782m122l1921l7139M4405j3245L8429
$$ plain form
13870 -3223 53675 66419 5985 -55171 -61503 -46436 -14450 -35283 -28992 5138 40050 50335
13858 50335 23934 4828 47487 69879 60567 38645 18792 31833 29361 13158 19796 20678 2983
13845 2983 30577 31877 9637 -18978 -39017 -28387 33498 60565 50430 48668 -17725 -51725
13833 -51725 -18162 45503 39983 -7041 -23405 -3455 -49215 -63398 -29226 4797 37234 57901
13821 57901 57650 48644 -42700 -58292 -38258 -36164 -15231 -40982 -34085 -14304 -17479 -8452 -43181
13808 -43181 -21821 -57566 -75250 -24954 -22782 -55330 -74288 -72814 -52737 -33318 3183 11467
13796 11467 23396 -688 30570 11337 51070 57087 -12096 -31485 9736 40593 85357 85177
13784 85177 21109 -41079 -43996 -56522 -26694 25088 20966 -10955 -48094 -3689 -16934 21495
13772B1495j0761L4436j8958K4820P007l4432m7357k3890n209l329R734j8065
13760f4509m0172N872M6955K2621k5652p230j5062O1010M0054l2002k0611J8648
13748a0078N9502P917J2253j9214l8417o0579K7226J02823l1383n1945J9306M84
13736A7895j8967K0114K3506k1061l2667J6301N2694k1934N447L042m9723j9727
13724b5080L7539L3720j282J1139p636q3407M7213K9531l7468j1815K3448m7882
13712c1980J454N0522K7157j0928Q243k6672k4219M0377o228l2054l5765j6259
13700e6352O0921K5701J9475k006j13776r3931L8472J04971J03348p0075n2382
13689c5634j1418j5188k71j5738P1557M4102N7854J5911j9347L4371o0916j8371
$$ plain form
13772 21495 10734 45170 26212 51032 58039 23607 -23750 -47640 -52849 -56178 -46444 -64509
13760 -64509 -104681 -98809 -51854 -29233 -54885 -62115 -77177 -16167 23887 -8115 -28726 -10078
13748 -10078 49424 57341 69594 50380 11963 -48616 -21390 81433 50050 -1895 17411 17895
13736 17895 -1072 19042 42548 21487 -11180 5121 57815 35881 41328 44370 -5353 -25080
13724 -25080 12459 46179 44897 56036 48400 -35007 12206 41737 4269 -7546 15902 -31980
13712 -31980 -30526 19996 47153 36225 44468 17796 -6423 33954 27726 -4328 -40093 -56352
13700 -56352 4569 30270 49745 47739 -66037 -159968 -121496 -16525 86823 16748 -35634
13689 -35634 -47052 -62240 -62511 -78249 -6692 37410 95264 111175 91828 126199 65283 46912
13677D6912K210n3705K2860L2184k6606K9165k1559J5652M6911j2642L002l2395
13665E1989l7198j2722n6279j3524K0206J1882K5580j5585j6502K2786J2043K3258
13653A5934k9408Q583L8483q978k5021K9730M4385n194p596J6529K0591r361m6717
13640D1960J9416Q2956O059l7683j9236m807M1917j0964k5018l101l4023L1976
13628H9452L4452j2163j5276k8274j5439L5952P8294P1952l1347k4319P0552Q77
13616B54713j6281k5519r310K9281N9092N6257k8532n0709J7624L0296J0882m0065
13604B87729j7887M3950N0528N6809L97J9326L2513o8855J5940K6432J9925L0099
13592D96906J8700k2707n4782j095J7691P019M7934M7394L4534p3620n1038m044
$$ plain form
13677 46912 49122 -4583 18277 50461 23855 53020 31461 47113 94024 81382 84384 51989
13665 51989 14791 2069 -54210 -67734 -47528 -35646 -10066 -25651 -42153 -19367 -7324 15934
13653 15934 -13474 -4891 33592 24614 -407 29323 73708 68514 60918 77447 98038 88677 41960
13640 41960 61376 144332 150391 112708 93472 88665 130582 119618 94600 91499 57476 89452
13628 89452 123904 111741 96465 68191 52752 88704 166998 238950 207603 183284 253836 254713
13616 254713 238432 212913 203603 232884 291976 348233 319701 268992 286616 316912 327794 287729
13604 287729 269842 313792 364320 421129 421526 440852 473365 404510 420450 446882 466807 496906
13592 496906 515606 492899 438117 437022 454713 461732 509666 557060 591594 517974 466936 462892
13580D62892J2508l0506m3409J8213k6307k5782L8582l6801r809k0058l060o42
13568C35821p730k157m631M80j8753j9012j0771J8947k1287O508k9602k8177k496
13555B17140l4309K1509J1452L0179k7820k8893P267j9261N164j4227K88M5339
13543B13828m9318l689K2765m7546k1074l1762J8853m274K5159M2887n1543r5319
13531A8967K4723M8849j7794P773J6831K4801j8155M391k8462k7669n948k4960
13519B3347j5592N3949J7577j5198J7205L9716j9146l7142r630P643K0193p54
13507H2168j9022K8877l8003k8015K784l863j5643m5653j2318L8146L9487J9826
13495D8771J4620L8539L0115K8422J7396l7968n3924k9474r316M1739K9502j7461
$$ plain form
13580 462892 475400 444894 401485 419698 393391 367609 406191 369390 359581 339523 336463 335821
13568 335821 328091 325934 321303 321783 303030 284018 273247 292194 270907 277415 247813 219636 217140
13555 217140 182831 204340 215792 245971 218151 189258 196525 177264 182428 168201 168489 213828
13543 213828 164510 160821 183586 136040 114966 83204 102057 97783 122942 165829 114286 18967
13531 18967 43690 92539 74745 82518 99349 124150 105995 110386 81924 54255 48307 23347
13519 23347 7755 61704 79281 64083 81288 121004 101858 64716 55086 62729 82922 82168
13507 82168 63146 92023 54020 26005 28789 24926 9283 -36370 -48688 -10542 28945 48771
13495 48771 63391 101930 132045 160467 177863 139895 85971 56497 47181 88920 118422 100961
13483A00961m1980p7271o709K3181L0987l7316l4348J3108M0699m4575M5488J4007
13471B6232m067k3295j0197M6104N114k3085K8742m0830m4656j1432p196n198
13459f3764M9717L9345m289P189K0275l6069n2571J5454K5439l4427l7981q743
13447h0425N2233N6627K7880J2556j9004J5161k4977N2630N1m5450L9503l7636
13435D9149q8805k9638N9257M9924L4984P523J8758l7811n4703p694L2653Q058
13423D1655K498q342n0097J3599K8447J5855L8737j4095l0868l8758n360R223
13411B494O3988j888k8353J2153k9232j5785M688o554K6106j0971j1186O6983
13399G2443J4123j0758k2589P7768N0628J2392K8960m7306o4Q796n6024m0771
$$ plain form
13483 100961 58981 -18290 -24999 -1818 29169 -8147 -42495 -29387 11312 -33263 12225 26232
13471 26232 22165 -1130 -11327 34777 39891 16806 45548 4718 -39938 -51370 -58566 -63764
13459 -63764 -14047 25298 21009 28198 48473 12404 -40167 -24713 726 -33701 -71682 -80425
13447 -80425 -28192 28435 56315 68871 49867 65028 40051 92681 92732 47282 86785 49149
13435 49149 -39656 -69294 -10037 39887 74871 82394 101152 63341 8638 944 33597 41655
13423 41655 44153 35811 -14286 -687 27760 43615 82352 68257 37389 -1369 -6729 2494
13411 2494 66482 64594 36241 48394 19162 3377 8065 1511 27617 16646 5460 72443
13399 72443 86566 75808 53219 130987 181615 194007 222967 175661 175597 184393 128369 87598
13387H7598r570L6865M0888j9175J5909k6713l3141J2188M0399l9197q7869P6497
13375I4679Q9289N3m2250L9386j6179J6565k2523n084l8963l8527K653K2683K901
13362A04683J5233L6682l5227m4641N4275K8891l7317j7354K7495O0666L8580
13351B31966n314n2691J3403L7610K26l8267m5838j5284L7061K8403O862L3685
13339B31822Q341m9632L0786L4910j8173l553N0693q920j495k8475k1019M1774
13327B67059J4746j1289k996q345K1229M5984J3845k9117L0699K2903K0272k3894
13315C61096n699N3301M6800J9545K2633j3150J5902J8523Q867l2828J3804J7837
13303E26631K8855M2052J008m6682J654j0600K2020J3038L3438j5903P681k4752
$$ plain form
13387 87598 78028 114893 155781 136606 152515 125802 92661 104849 145248 106051 18182 94679
13375 94679 183968 184021 141771 181157 164978 181543 159020 153936 114973 76446 79099 101782 104683
13362 104683 119916 156598 121371 76730 131005 159896 122579 105225 132720 193386 231966
13351 231966 226652 173961 187364 224974 225200 186933 141095 125811 162872 191275 198137 231822
13339 231822 240163 190531 221317 256227 238054 234501 285194 276274 274779 246304 225285 267059
13327 267059 281805 270516 267520 259175 280404 326388 340233 311116 341815 364718 384990 361096
13315 361096 355397 408698 455498 475043 497676 484526 500428 518951 527818 494990 508794 526631
13303 526631 555486 597538 598546 551864 553518 542918 564938 577976 611414 595511 603192 578440
13291E78440M1157O0040o030r4466J1985j5864k8574m057N273J4090N5145L687
13279F20826k4859o8262n2552j0139k1165M6672O7564J2756L4776p658l0638J2038
13267E79359J8210k3980K543p940m1880l5896K7742M1470N5744N9842k2468K6696
13255F79442M7108K9600n974l7338R415j0054j8313P8887O2798J1499j4748L6292
13243H68614Q1869J00534p179l0936J1135L0530Q8661P7896L3669N231L8259O7957
13231A366240M2936N4362O1223P1083M1837M3286K7638O1147J02640R1348J05959
13220B069699J33505M3542O8546J24595J50847J27574J13052J58689J29358J52044
13210C271451K26470J22213J33346J60898K59462K59481K71502K83608K75826
$$ plain form
13291 578440 619597 679637 673607 579141 591126 575262 546688 542631 547904 561994 617139 620826
13279 620826 595967 527705 475153 465014 443849 490521 558085 570841 605617 597959 567321 579359
13267 579359 597569 573589 576132 568192 526312 490416 518158 559628 615372 675214 652746 679442
13255 679442 726550 756150 750176 712838 722253 712199 693886 772773 835571 847070 832322 868614
13243 868614 950483 1051017 1043838 1012902 1024037 1054567 1143228 1221124 1254793 1260024 1298283 1366240
13231 1366240 1409176 1463538 1524761 1595844 1637681 1680967 1708605 1769752 1872392 1963740 2069699
13220 2069699 2203204 2246746 2315292 2439887 2590734 2718308 2831360 2990049 3119407 3271451
13210 3271451 3497921 3620134 3753480 3914378 4173840 4433321 4704823 4988431 5264257
13201E264257K48852K30382K90335L62765L32043L84612M16818M15122N27811
13192H472997N21670M73830N45715N24371N62123N91662O19017O63454O84563
13183A3659402P36682P38443P88107Q55897R01896R19561R57751R83612J022250
13174B1563601J064217J120993J128615J205057J237303J262560J352499J375669
13166C1310514J427462J390001J471771J546651J562327J581936J633444J621548
13158D3545654J672202J680010J704536J720937J740663J684143J699660J690191
13150E7137996J684625J675369J600311J586188J534097J422075J342293J322103
13142F9305057J242387J131591J068467J017122Q53106P45404P23783N87381M29889
$$ plain form
13201 5264257 5513109 5743491 6033826 6396591 6728634 7113246 7530064 7945186 8472997
13192 8472997 8994667 9468497 10014212 10538583 11100706 11692368 12311385 12974839 13659402
13183 13659402 14396084 15134527 15922634 16778531 17680427 18599988 19557739 20541351 21563601
13174 21563601 22627818 23748811 24877426 26082483 27319786 28582346 29934845 31310514
13166 31310514 32737976 34127977 35599748 37146399 38708726 40290662 41924106 43545654
13158 43545654 45217856 46897866 48602402 50323339 52064002 53748145 55447805 57137996
13150 57137996 58822621 60497990 62098301 63684489 65218586 66640661 67982954 69305057
13142 69305057 70547444 71679035 72747502 73764624 74617730 75363134 76086917 76674298 77104187
13133G7104187K93306L04526J88059M8860n6449j81452k63261l23137m63879n83636
13123G6067124o24467p38456r19873r84788j019509j134749j191722j295399j366962
13114F6791199j409915j477333j573942j591613j612747j585577j649567j709121
13106E4181384j753091j691397j673514j722697j619003j615029j650706j606778
13098D0849169j571648j548590j512773j460940j372564j405967j352559j267344
13090B9356784j268443j184839j168796j152456j092672j051422r82503j007486
13082B0448167r94151r10867q59720q37497q70917q02905o99018o83509o35016
13073A3154567o02711o36840o07331n66526n33969n24638n43548n05226l77873
$$ plain form
13133 77104187 77397493 77702019 77890078 77938938 77882489 77701037 77437776 77114639 76650760 76067124
13123 76067124 75442657 74704201 73784328 72799540 71780031 70645282 69453560 68158161 66791199
13114 66791199 65381284 63903951 62330009 60738396 59125649 57540072 55890505 54181384
13106 54181384 52428293 50736896 49063382 47340685 45721682 44106653 42455947 40849169
13098 40849169 39277521 37728931 36216158 34755218 33382654 31976687 30624128 29356784
13090 29356784 28088341 26903502 25734706 24582250 23489578 22438156 21455653 20448167
13082 20448167 19454016 18543149 17683429 16845932 15975015 15172110 14473092 13789583 13154567
13073 13154567 12551856 11915016 11307685 10741159 10207190 9682552 9139004 8633778 8255905
13064H255905l75060m28283l48862l13608l89720l29268k76539k61592k32363
13055E300610k25088k20112k47407k15094j86686k36887j92545j22775j28879
13046C525137j42027q4972j37398j40334j24097j48122j69589j23182o1772p8988
13036B314656r1168o9251l972o5311n9219n6360q6038j01987n7308l2982o4152
13025A626908p3877p2030q5155n2160o8725l869k2321m7031m8784j7567o526k38
13013A128625M7677o2668p2397k1431o0621q0589l5931L0582N1227m206m3063
13002H77205o5023j3078M7862J8206m9053q0132K4350L6200o2545m2648l8629
12991F52715l7909N8338J3828j6609j7341l2052L8205R553n018k8899j1251m3952
$$ plain form
13064 8255905 7880845 7452562 7103700 6790092 6400372 6071104 5794565 5532973 5300610
13055 5300610 5075522 4855410 4608003 4392909 4206223 3969336 3776791 3654016 3525137
13046 3525137 3383110 3298138 3160740 3020406 2896309 2748187 2578598 2455416 2393644 2314656
13036 2314656 2223488 2154237 2150265 2084954 2025735 1969375 1883337 1781350 1724042 1691060 1626908
13025 1626908 1553031 1481001 1395846 1343686 1274961 1271092 1248771 1201740 1152956 1135389 1128863 1128625
13013 1128625 1176302 1113634 1041237 1019806 959185 878596 842665 873247 924474 920268 877205
13002 877205 812182 799104 846966 865172 816119 735987 760337 796537 733992 691344 652715
12991 652715 614806 673144 686972 670363 653022 620970 659175 668728 663710 634811 623560 579608
12979E79608j8723l1042k2535M8331L4422j8555L2982L286l5406j2775L7886l1455
12967E66024l1640N781j7185l5969j9984M507j3755n6119m7347K8238M1581o498
12955D17634n1235k4235j0763K9258M9345n0085o7735n0370j4978M9013M7134
12944C22983j8535p028K6760L254k9256l4385m5000M9999L0633L5931m0094o610
12932B88652q856j7254n9264Q362L8500N1982m969k1470j0710j5138m5204J9329
12920B23960M3570O462N460j4276o9110L038J5670j7670o877o3148K4938P7704
12908B29721R828n7247l1792N6158J575m9012J2742L2717r699k5031J8009R024
12896A96993k009J0919M2413K7163L98M992M0619j0722m2766k0727k9123j3935
$$ plain form
12979 579608 560885 529843 507308 555639 590061 571506 604488 607774 572368 559593 597479 566024
12967 566024 534384 540165 522980 487011 467027 471534 457779 401660 354313 382551 424132 417634
12955 417634 366399 342164 331401 360659 410004 359919 292184 241814 226836 275849 322983
12944 322983 304448 297420 324180 327434 298178 263793 218793 268792 299425 335356 295262 288652
12932 288652 279796 262542 203278 211640 250140 302122 297153 275683 264973 249835 204631 223960
12920 223960 267530 273992 279452 265176 196066 199104 214774 197104 190227 127079 152017 229721
12908 229721 239549 182302 150510 206668 208243 159231 171973 204690 194991 169960 187969 196993
12896 196993 194984 205903 248316 275479 275877 280869 321488 310766 268000 247273 218150 204215
12884B04215r2304K9381K9823j5944j7824j3307j1935M5728K0666o214j4247l2563
12872A25475K8330m5408L0122L8115M9761m177j3594k361J1217J6194j0345P514
12860B30843J0848k900l4173n676k6443J0843J9434P905p047O238J4230q8l2897
12847A91117l3641j8373j2717q974k7694k337M5464N1568j740P592r448J3109
12835A93926j2703j1956k3937K269L5428K5738j8548O332J6713K7046m454p609
12823B28245j9413m4366j3925K1354K3759R543k894j08691l5643J8593M8841j3807
12811A11596j1363L275K7890j1533M3558P3546J2137q7197o4267J3236K0254K7009
12799A58141K4857P352n3867p257l902J7161M121j1755m7852O043J9954L88j1715
$$ plain form
12884 204215 111911 141292 171115 155171 137347 124040 112105 157833 178499 172285 158038 125475
12872 125475 153805 108397 138519 176634 226395 222218 208624 206263 217480 233674 223329 230843
12860 230843 241691 238791 204618 198942 172499 183342 202776 210681 203634 209872 224102 224014 191117
12847 191117 157476 139103 126386 117412 89718 87381 132845 184413 182673 190265 180817 193926
12835 193926 181223 169267 145330 147599 183027 208765 190217 196549 213262 240308 235854 228245
12823 228245 208832 164466 150541 171895 195654 205197 202303 93612 57969 76562 125403 111596
12811 111596 100233 103508 131398 119865 163423 236969 249106 161909 97642 110878 131132 158141
12799 158141 182998 190350 136483 129226 125324 142485 146606 134851 86999 93042 112996 113384 101669
12786A01669m1076k3610j6594J0853L2766O853K0936J5597K9767m1661L5506K9045
12774A60051j7982m4054M330J0600N768m0615q818N905l150J1718Q5r670M968
12761G9136j2837J3785J4169L7502N259K2194p606l6303k1267O5105K706j7609
12749A44234M342j2329l5301o573n869L690K9178R703k0757k136O326j0459l2366
12736G1683J001L3240K8232L1626k9337L1575L2212m5987K2270N759Q102j8514
12724A71862L2689K666M1957j5871j4899k0942R185Q200j6653l2873l3885l7130
12712I4306K1199L1246K3915K1809L1513q607l6636R033N3070L4999o074K9869
12700B99642L364n1844p249M1084P5891L0278l5816m2185o2073M974K6708k6698
$$ plain form
12786 101669 60593 36983 20389 31242 64008 70861 91797 107394 137161 95500 131006 160051
12774 160051 142069 98015 102345 112945 118713 78098 69280 75185 72035 83753 83838 74168 79136
12761 79136 66299 80084 94253 131755 137014 159208 151602 115299 94032 159137 161843 144234
12749 144234 148576 136247 100946 94373 88504 92194 121372 131075 110318 108182 114508 104049 71683
12736 71683 72684 105924 134156 165782 136445 168020 200232 154245 176515 182274 190376 171862
12724 171862 204551 207217 249174 233303 218404 197462 206647 214847 198194 165321 131436 94306
12712 94306 115505 146751 170666 192475 223988 215381 178745 187778 240848 275847 269773 299642
12700 299642 303006 251162 243913 284997 360888 391166 355350 313165 251092 256066 282774 256076
12688B56076K2327O8275M258k621J8190M2464l0876j0669Q358J3562O1001K4868
12676D75213l4131j5387J8098m9244P198K2891N2423L0993j4177j7255l2543L2068
12664D76147O261Q680l4594k6445l3770n842k3716j3996J3631L910K3438n3436
12652C40268l5715P182l4713J920J9123o096J4872j783J1139k0611m8771K4949
12640B71764L6084j8221k6107n4485L1490J8319m607r2821L1393L5718l4907n7336
12628A36284K5454J9851J2756N0700j4641m1342l6903m5173L9317L7456M3773
12617B27532j7734o7470k9734l88K7227L0915k2967n8529k4673m095J6099J4990
12605I1173K6201L0814j7583p3722o1853O8338J1215J0159P878m9299P80l0289
$$ plain form
12688 256076 278403 346678 350936 348315 366505 408969 378093 367424 375782 389344 450345 475213
12676 475213 441082 425695 443793 394549 401747 424638 477061 508054 493877 476622 444079 476147
12664 476147 482408 491088 456494 430049 396279 390437 366721 352725 366356 370266 393704 340268
12652 340268 304553 311735 277022 278942 298065 291969 306841 305058 316197 295586 246815 271764
12640 271764 307848 289627 263520 209035 240525 258844 254237 161416 192809 228527 193620 136284
12628 136284 161738 181589 194345 245045 230404 189062 152159 106986 146303 183759 227532
12617 227532 209798 142328 112594 112206 139433 170348 147381 88852 64179 60084 76183 91173
12605 91173 117374 148188 130605 56883 -4970 63368 74583 84742 92620 43321 44101 13812
12593A3812k0302P7043J1508k3283J9677j9819J1907J9238N0189k078p0973J674
12581F8593J7187o8345k5458r434L8183M1839j0520M7577M0805j0566j5145K7081
12569A41797n711r3401n9022N0112M6602L2651K4750k5159j9159J9799j6189n3874
12557D3196j4457p546J8478O127N1501J1020l7327m8399j6939M104N1621M1507
12545A02886L6274N310l859n8705m4804l8691j2440q362L2701M8856n5490j9821
12533a6145j5487m8087l4731L1412P0358R245Q8544N3574n0917o2699k9955K4719
12521A9831n609J8737j6380q1601k8812j9040J8022L2452K6367N1453J0111p585
12509A7946J2555K9431O545n3574l7292M0421P8935l557N239O333K926K0539m1014
$$ plain form
12593 13812 -6490 70553 82061 58778 78455 58636 70543 89781 139970 137892 66919 68593
12581 68593 85780 17435 -8023 -17457 20726 62565 52045 99622 140427 129861 114716 141797
12569 141797 136086 42685 -16337 33775 80377 113028 137778 112619 93460 113259 97070 43196
12557 43196 28739 21193 39671 45798 97299 108319 70992 22593 5654 9758 61379 102886
12545 102886 139160 144470 140611 81906 37102 -1589 -14029 -22391 10310 59166 3676 -16145
12533 -16145 -31632 -79719 -114450 -83038 -12680 -3435 85109 138683 87766 25067 -4888 19831
12521 19831 14222 32959 16579 -65022 -93834 -112874 -94852 -62400 -36033 15420 25531 17946
12509 17946 30501 59932 66477 12903 -24389 16032 94967 91410 96649 102982 105908 126447 85433
12496H5433m7977n6619m5634M0748J6451R950k355N216O241Q059k4541J8592K1239
12483C4803L5673O531J8018Q501k2934o8633k6358L3301L1015j0886K0919J328
12471F1278l0701K3832P8518j4438R449k2923r7926j3887r808j2804J4010L2231
12459A6831K1886J5846K896k8696q884K8670j5115q04Q9198j3483j2744K1888
12447A17489M641n0754m2027k0728j0616k2020j9499P821J6954K9513K0226J0700
12435D1700J0752k088L2829J2972m64j4961k7775p5580M301n082j9M7493j8277
12422E801M489L4687M6595n6574k7983j8796K3450k7907k3865L0535J2445m818
12410a941J926K0983q162K732Q602k2250k933L2454M1638L3858O987n4121l8973
$$ plain form
12496 85433 37456 -19163 -64797 -24049 -7598 2352 -3 5213 11454 19513 -5028 13564 34803
12483 34803 70476 77007 95025 103526 80592 11959 -14399 18902 49917 39031 59950 61278
12471 61278 30577 54409 132927 118489 127938 105015 7089 -6798 -16606 -29410 -15400 16831
12459 16831 38717 54563 57459 28763 19879 48549 33434 32630 121828 108345 95601 117489
12447 117489 122130 71376 29349 8621 -1995 -24015 -43514 -35693 -18739 10774 31000 41700
12435 41700 52452 50364 83193 96165 95701 80740 52965 -22615 -18314 -23396 -23415 24078 5801
12422 5801 10290 44977 91572 34998 7015 -11781 11669 -16238 -40103 -9568 2877 -1941
12410 -1941 -15 20968 12806 15538 24140 1890 -1043 31411 73049 106907 113894 59773 20800
12397B0800j051L1141L5239J1976L1773O598K565p098k3031p1202n1730k3792
12385c7812n08J3157L9572K8981L7002o1395r2081k6176O5119O0357l451j1681
12373A1084l6153k6861k8678L1149N9717M3206J3426l0635m6312P43L1002l2386
12361a0698r627J6853N9506K6031K3016K3003k8394l5969n171O852j2210K2109
12349G5301L3887k2190m8550k0738J0942J0101q35k4529J9655k1586q159m942
12337a643j8379J2883O319k2499J5663N3416K904k8121L5711k6695m7058M0955
12325B3456j3599l8315M992j1508J2329K2644J5149k0608m2966p2103J907L3900
12313h4722L0044N5823N4535p287j7152k5197K6001N9213l7461j07189m985N2824
$$ plain form
12397 20800 19749 50890 86129 98105 129878 136476 139041 131943 108912 37710 -14020 -37812
12385 -37812 -38320 -25163 14409 43390 80392 18997 -73084 -99260 -34141 26216 22765 11084
12373 11084 -25069 -51930 -80608 -49459 10258 53464 66890 36255 -10057 -9314 21688 -10698
12361 -10698 -20325 -3472 56034 82065 105081 128084 99690 63721 58550 65402 53192 75301
12349 75301 109188 86998 38448 17710 28652 38753 37918 13389 33044 11458 3299 -1643
12337 -1643 -20022 -7139 -820 -23319 -7656 45760 48664 20543 56254 29559 -17499 23456
12325 23456 9857 -28458 -23466 -34974 -22645 -1 15148 -5460 -48426 -120529 -118622 -84722
12313 -84722 -54678 1145 55680 48393 31241 6044 32045 91258 53797 -53392 -58377 -5553
12301e553M5365L6627K4684m4418k6088K6397k9209k2634m879J4851n5100p7001
12289a16958L239J06447L1925K9654q104m1971j2885K13k42j6233J5793M3304
12277C4182M6949m2613k9874J8810K9037k0583L6194K0698n4502q211Q112J5455
12265E3654K5726J9434O7804L8827m0952o9895j4147K1625M472J443L64l819n1042
12252E3494j0169K7103j363j998j0418K9010O954k2715o3245m5850J040N1625
12240A3468l6553j2167J4673j4614k2680L0039o393M1961P23k0659l9572l499
12228e5273L702N7282M6499L095n1378k0041M8165K7094J8547m0453m2312O068
12216I95L3937j715L9746L2410p8063l2546L8782j1373J214L4693L1164l9656
$$ plain form
12301 -5553 39812 76439 101123 56705 30617 57014 27805 5171 292 15143 -39957 -116958
12289 -116958 -113719 -7272 24653 54307 46203 4232 -8653 -8440 -8682 -24915 -9122 34182
12277 34182 81131 38518 8644 27454 56491 35908 72102 92800 38298 30087 38199 53654
12265 53654 79380 98814 166618 205445 164493 94598 80451 102076 106548 107991 108355 104536 53494
12252 53494 43325 70428 69065 67067 56649 85659 92613 69898 6653 -39197 -38157 13468
12240 13468 -23085 -35252 -20579 -35193 -57873 -27834 -34227 7734 8457 -12202 -51774 -55273
12228 -55273 -51571 5711 52210 55305 3927 -16114 32051 59145 77692 37239 -5073 995
12216 995 34932 33217 72963 105373 27310 -5236 33546 22173 23387 58080 89244 49588
12204D9588j7637j2860L0457J9145O865O843l4553o1645j7477M5069K6506p479
12192C2822K1338M403L1069O1919K2494J0614K7185j9001k6996J6624n3634m5912
12180H2925j6497M6553Q632K6874O418R338n292l8681L2584l2521L203M6829j7850
12167A52515J9232L230l3401M011J0917l7780p7904k6548l869j3471K6317J7927
12155D1176L3452M4158o842k4428k5082K3733M5569l3322k1568j5357r97r742
12143E0750N6975L4512q593j5693K3466K3462l193o1365j1045L2386m5056m2643
12131C3963k0897K0561M6814M7236J0544o8011j9342K1115J0944Q771n02K6423
12119A17619J6801J7753P158K2451K66J3084K6314K3041r065M240M738p871J0225
$$ plain form
12204 49588 31951 19091 49548 68693 75558 82401 47848 -13797 -31274 13795 40301 32822
12192 32822 54160 58563 89632 151551 174045 184659 211844 192843 165847 182471 128837 82925
12180 82925 66428 112981 121613 148487 154905 164243 158951 120270 152854 120333 123536 170365 152515
12167 152515 171747 174977 141576 145587 156504 118724 40820 14272 10403 -3068 23249 41176
12155 41176 74628 118786 111944 87516 62434 86167 131736 98414 76846 61489 60492 50750
12143 50750 107725 142237 133644 117951 141417 164879 161686 100321 89276 121662 76606 33963
12131 33963 13066 33627 80441 127677 138221 70210 50868 71983 82927 91698 91196 117619
12119 117619 134420 152173 159331 181782 182048 195132 221446 244487 235422 239662 244400 236529 246754
12106B46754L3729P969M695n8293m2401K9666j3440n2425l5620M3039M7715P3697
12094B85085L294l1004P140j2473K5631j4868j9571p505K2502J4912N4105K6881
12082C54129M5707k81m1079Q366K3834K2877M192r867N401k880M3680j5068n0667
12069C88344L0498M1542j9041K0700M4504J8883k0206L0676P4024L2288M9990
12058F92202J3194J3142K9727K1687N7404n726L616P3213O5396N521J06520J06425
12046A182321J00889J04693L3833j9304l2450M7201P6174j3718o382J02051L7835
12035A613143M4004Q4671N4103J23263J53317J58467J58710J84267J65595J88865
12025B928405K22464K51621K43540K79755L27291L30566L76495M48297M82454
$$ plain form
12106 246754 280483 288452 293147 234854 192453 222119 208679 156254 120634 163673 211388 285085
12094 285085 288379 257375 264515 252042 277673 262805 243234 235729 258231 273143 327248 354129
12082 354129 399836 399555 358476 366842 390676 413553 417745 407878 413279 410399 454079 439011 388344
12069 388344 418842 460384 441343 462043 506547 525430 505224 535900 609924 642212 692202
12058 692202 705396 718538 748265 769952 827356 821630 825246 898459 963855 969376 1075896 1182321
12046 1182321 1283210 1387903 1421736 1402432 1369982 1417183 1493357 1479639 1473257 1575308 1613143
12035 1613143 1657147 1741818 1795921 1919184 2072501 2230968 2389678 2573945 2739540 2928405
12025 2928405 3150869 3402490 3646030 3925785 4253076 4583642 4960137 5408434 5890888
12016E890888N89106P20325P92546R38892J095358J305107J624302J952192K311141
12007A7219857K876175L509072M311384N308964O384465P271454P785445P580984
11999F2247800O608157M826705K321874n89480l390159n532672o768287p098383
11991E2625555o831054o224802n464180m744942m003786l311349k784039k374886
11983A6886517j980688j652052j414199j206642j064717r61724q03557o68636
11975G134302o28503n50838m31033l55317m05322l07357k92104k90413k77958
11966C595457k05763j72699j95666j66383j30338j9225K1197N1300J39865M420
11956B922165j84393l03678k28314k29284j68129j29674j45639j25972m0092m8286
$$ plain form
12016 5890888 6479994 7200319 7992865 8931757 10027115 11332222 12956524 14908716 17219857
12007 17219857 20096032 23605104 27916488 33225452 39609917 46881371 54666816 62247800
11999 62247800 68855957 73682662 76004536 75415056 72024897 66492225 59723938 52625555
11991 52625555 45794501 39569699 34105519 29360577 25356791 22045442 19261403 16886517
11983 16886517 14905829 13253777 11839578 10632936 9568219 8606495 7802938 7134302
11975 7134302 6505799 5954961 5523928 5168611 4763289 4455932 4163828 3873415 3595457
11966 3595457 3389694 3216995 3021329 2854946 2724608 2705383 2726580 2777880 2917745 2922165
11956 2922165 2737772 2434094 2205780 1976496 1808367 1678693 1533054 1407082 1366990 1318704
11946A318704r794o1093m7501j7937q102p593p6334o3580k4600k1223l6349o5799
11934H78799M745m551p0122r4771k9017k250R004J5406k876J6352J7157j9721
11922G18155K3892l3766r6902r135N2987O1770K8240M9705O6426L908n0776m5614
11910G68890r9652r3064p7405n1030o0884j2454j5525r8558K2246L6240o7648
11899B51156k0796N6553M5913K7399k9006q3799m8451L8574o369K574j370k3686
11887B08692P557M8349j5485l7221j3304L4082L593k0969J1892m0331o0712k0535
11875A05608N6325K6959j2146n444j771j2949J623O7274L3734K9823L915J3447
11863C06398J1207P142K8094Q233m2132p4306N929j3121m8297l2257K4197n384
$$ plain form
11946 1318704 1308910 1247817 1200316 1182379 1174277 1166684 1090350 1026770 1002170 980947 944598 878799
11934 878799 883544 878993 808871 714100 685083 682833 691837 707243 704367 720719 737876 718155
11922 718155 742047 708281 611379 602244 655231 717001 745241 794946 861372 865280 814504 768890
11910 768890 669238 576174 498769 447739 386855 374401 358876 260318 282564 318804 251156
11899 251156 230360 286913 332826 360225 331219 247420 198969 237543 231174 233748 232378 208692
11887 208692 216249 264598 249113 211892 198588 232670 236263 215294 227186 186855 126143 105608
11875 105608 161933 188892 176746 171302 169531 156582 158205 225479 259213 289036 292951 306398
11863 306398 317605 324747 352841 361074 318942 244636 250565 237444 189147 156890 181087 175703
11851A75703j5775J612O95j1103m455K7892L9798N0413L2826J7464m6837p8494
11839A89739l0618l7450j4513k3418l0949J1034L7561L087j2620m2277L8862J2086
11827A00524K5164k832q689n46j1158m2840o155L2607M246k5641R893M4644K1841
11814A41058k8255l099K3945l4836l9207J2132K3255M9425j6924k0222n469R468
11802A11271L3943M9824K811k4871n7516o7525L2337J6841k9263L9534J2737p380
11790A12743J9235N078q039J0211k7503q1257k603K7440M2379K4514o5870l8854
11778A7474J2354J042L263J894L6565J6351J6648M7920k3514k4619J1860N796
11766A23034K3541K662P56m8096o5469l1884N2857L0688j9606m6319o290M2051
$$ plain form
11851 175703 159928 161540 162235 151132 146677 174569 214367 264780 297606 315070 268233 189739
11839 189739 159121 121671 107158 83740 52791 63825 101386 104473 91853 49576 88438 100524
11827 100524 125688 122856 114167 113621 102463 59623 53468 86075 90321 64680 74573 119217 141058
11814 141058 112803 109704 133649 98813 59606 71738 94993 144418 127494 107272 101803 111271
11802 111271 145214 195038 197849 172978 115462 47937 80274 97115 67852 107386 120123 112743
11790 112743 131978 137056 129017 139228 111725 30468 27865 55305 97684 122198 56328 17474
11778 17474 29828 30870 34133 36027 72592 88943 105591 153511 129997 105378 117238 123034
11766 123034 146575 149237 149993 101897 36428 4544 57401 88089 68483 22164 15874 57925
11754E7925N0534L6050K6781m2668k6345j7889L0876l5944p2876o6960L2463K6030
11742b023L964j3018j2904J9981J8840K7573q182J736J1136m337k204q323J1446
11729D3685M8768J5908k1791j5111j6273l6349O007M5761O1046k3819m8503j8646
11717D0683j0436J1460N624o386J9706L0599m1911o176J4532Q980n4745o0108
11705d8178l7205j2061K6652J3341P8791L3754l2538J9385p31Q393M1425j0783
11693H0245k2182J0449L4875r307n0813J5997L0558l2195k0627l075j7875l3491
11681a7441J4652K9968P638l1232j0632K6544L6005j4024O1081L2456m3445m5152
11669D6418P48M3785l475o736J6143K7079l738m6173m3883j7093J0376L5851j2464
$$ plain form
11754 57925 108459 144509 171290 128622 102277 84388 115264 79320 6444 -60516 -28053 -2023
11742 -2023 1941 -11077 -23981 -4000 14840 42413 34231 35967 47103 42766 40562 32239 43685
11729 43685 92453 108361 86570 71459 55186 18837 24844 70605 131651 107832 59329 40683
11717 40683 30247 41707 47331 40945 60651 91250 49339 43163 57695 66675 11930 -48178
11705 -48178 -85383 -97444 -70792 -57451 21340 55094 22556 41941 41210 49603 91028 80245
11693 80245 58063 68512 103387 94080 43267 59264 89822 57627 37000 33925 16050 -17441
11681 -17441 -2789 27179 34817 3585 -7047 19497 55502 41478 102559 135015 91570 46418
11669 46418 47166 90951 87476 80740 96883 123962 120224 74051 30168 13075 23451 59302 46838
11656D6838j1883m5681m665o538l383J7974O1360k4999K6947J8925n4481l6104
11644a5690K1607R414M5929K6377p21J0812o992q851k2713j5738j1691Q620l3943
11631F420m1160K0405K4859N561N9099P102k3582k1085K3159N021r284m5038k3714
11618a2237L8772k333j8854L7353N0999J9591o0383K1826m743k2096k5298j3416
11606I181J722Q280m692k3371l4305l2619n4680k2938J8660M6440K4284J1413
11594e2625O549N4560K2035M4152J0708p664l5419o1110k2971O6777N0605J3071
11582H8668j8922J8962O563j9249m7867m1164L4148k0867j3141M4184K575j3634
11570B0256k5721j9304L9271M5323J064J2908J3857o108o9259J676m2676n32L4049
$$ plain form
11656 46838 34955 -10726 -15391 -21929 -25312 -7338 54022 29023 55970 74895 20414 -15690
11644 -15690 5917 15331 61260 87637 86916 97728 90736 81885 59172 43434 31743 40363 6420
11631 6420 -34740 -14335 10524 16085 75184 82286 58704 37619 60778 65799 56515 11477 -12237
11618 -12237 26535 24202 5348 42701 93700 113291 52908 74734 69991 47895 22597 9181
11606 9181 10903 19183 14491 -8880 -43185 -75804 -130484 -153422 -134762 -88322 -64038 -52625
11594 -52625 -46076 8484 30519 74671 85379 77715 42296 -18814 -41785 24992 75597 88668
11582 88668 69746 88708 95271 76022 28155 -13009 21139 272 -12869 31315 33890 20256
11570 20256 -5465 -24769 14502 59825 60889 73797 87654 81546 12287 13963 -28713 -29245 4804
11557D804q137k4503K0562o822n7598l6493K2408n670o629m0281L7678Q9794N7591
11544D6704N333l257m5269l522j5377O7856j1160j9854l7705m1922j6920K0736
11532e4357L0649P7588K7573n1066n5068m9150M095N7037m6590l8050J8891p622
11520h6070J0186P8555l4178j8542k560J4494j2557l1435j9188N3631P5130O495
11508C3961J0574N8l7184J7003m5520l6980L891M8206K3990k768k5186k4907J2767
11495b2095l1202L5132k497j4851N9577k8741J022Q188L753j8645m9244k3846
11483h3449L19N3425P7242n70M663p469l795l0071j8356O3615N2254k1302l9947
11470D6559m4350m0195j6268N0152M2472o1693q3961K3677K8069M6335K9401J0132
$$ plain form
11557 4804 -3333 -27836 -7274 -14096 -71694 -108187 -85779 -91449 -98078 -138359 -100681 -10887 46704
11544 46704 52037 48780 3511 -11 -15388 52468 41308 21454 -16251 -58173 -75093 -54357
11532 -54357 -23708 53880 81453 30387 -24681 -73831 -69736 -12699 -59289 -97339 -78448 -86070
11520 -86070 -75884 2671 -31507 -50049 -52609 -38115 -50672 -82107 -101295 -47664 27466 33961
11508 33961 44535 44593 7409 24412 -21108 -58088 -54197 -5991 17999 15231 -9955 -34862 -22095
11495 -22095 -53297 -18165 -20662 -35513 24064 -4677 -3655 4533 8286 -10359 -59603 -83449
11483 -83449 -83130 -29705 47537 46967 51630 44161 40366 10295 -8061 55554 107808 86506 46559
11470 46559 2209 -37986 -54254 -4102 38370 -23323 -107284 -83607 -55538 -9203 20198 30330
11458C0330m7309q0564m413P6225M5399K33k5467O798j0255p315n715k4247J4384
11445c1916p968J6499l113j889N4653r915n775N9970O498R801o487j7924k9846
11432C2588K4675L2231l3946m693j0575k1517j0672J0814N5000K2848J7988l9470
11420G5271k1708l3191o9868q769L0867K5888l418m5265m518P4475j0520L356
11408A2600N0005M7331l7884j8687o09K5881k1319p9701k4540q884Q545j8010
11396f5272l7598M4937R4869k8677p5666r920L6209N580R049O196N087J3489J3080
11383A1363m1949o1273j4590M7648j1068o743J3291K2106K9432J4890J0468N569
11371A9144R940j3958m3077J0750m3870n2509L8580L8269J8924L8077N150K9364
$$ plain form
11458 30330 -16979 -97543 -101956 -25731 19668 19901 -5566 1232 -9023 -16338 -22053 -46300 -31916
11445 -31916 -39884 -23385 -26498 -28387 26266 16351 10576 70546 77044 86845 80358 62434 32588
11432 32588 57263 89494 55548 50855 40280 18763 8091 18905 73905 96753 114741 75271
11420 75271 53563 20372 -49496 -58265 -27398 -1510 -4928 -50193 -54711 19764 9244 12600
11408 12600 62605 109936 72052 53365 52756 78637 57318 -22383 -46923 -55807 -47262 -65272
11396 -65272 -102870 -57933 36936 8259 -67407 -77327 -41118 -35538 -26489 -20293 -15206 -1717 11363
11383 11363 -30586 -91859 -106449 -58801 -69869 -76612 -63321 -41215 -11783 3107 13575 19144
11371 19144 29084 15126 -27951 -17201 -61071 -113580 -75000 -36731 -17807 20270 25420 54784
11359E4784J196k0362L3856m9121j74n255o6412L3440L0619l0548N9767L7013
11347G8803j9637n7010m9237Q837l8708k719l3974K167J5793M8550L9736L3942
11335B6543k8632q823n731L3526J0960J5461l3088m5559N288L344L2761P00k9960
11322b3210j6267N3525P66m4649O760q576N4158J6753j9415o299n103N2690J95
11309F1328m0905o7348K1192k94k3290L2170J8983l7727K203J083J289J9280K5826
11296A3790l1020j4515N402L8921L010j0902j9448l121L0561J3355k115J5914
11284C9832K1476K2022n8158l5536M4116m364l8839J4085K6369O621J5573l9207
11272A3990P741K4262j6089K9964L4646K9854m0169j9837k4521o1597N986K257
$$ plain form
11359 54784 55980 35618 69474 20353 20179 14924 -51488 -18048 12571 -17977 41790 78803
11347 78803 59166 2156 -47081 -38244 -76952 -79671 -113645 -111478 -95685 -47135 -7399 26543
11335 26543 -2089 -10912 -16643 16883 27843 43304 10216 -35343 -30055 -26711 6050 6750 -23210
11322 -23210 -39477 14048 14814 -29835 -23075 -31651 22507 39260 19845 13546 8443 61133 61328
11309 61328 20423 -46925 -25733 -26027 -49317 -17147 1836 -35891 -33688 -32605 -31316 -12036 13790
11296 13790 -17230 -31745 -26343 12578 15588 4686 -14762 -17883 12678 26033 23918 39832
11284 39832 61308 83330 25172 -10364 33752 29388 -9451 4634 31003 37624 53197 13990
11272 13990 21731 45993 29904 59868 94514 124368 84199 64362 39841 -21756 -15770 -13513
11260a3513j1777J1934l943j521O20k4743J5966M0671j2453l4334r325K7605M2164
11247B7351K6851k1402l4142j3914J6563M5942k4949m087L0309J5238r282K1886
11235G6364O31l7634p0994m7220k3618k1134L5997l010k6k617P081J9698J77j227
11221f7532J9541J6635j2948j1740J8288N1841M1355K8001l6196l7242k0369l429
11209a3795J1349J9423J7244R105l4727k8812J0849J878o617M9389P674m0238
11197B722l8246l1226J2390J3845K4542L3432p921J6631J495k6017Q537K8591
11185C8775m9872m786l3257K2553M7675n025K578l1893J7007N1737N330k5039
11173C5783m8622k0459l237L490l638j6552L827q722m507L9196M8690l8049q0052
$$ plain form
11260 -13513 -25290 -13356 -17299 -18820 -18200 -42943 -26977 13694 1241 -33093 -42418 -14813 27351
11247 27351 54202 32800 -1342 -15256 1307 47249 22300 18213 48522 63760 54478 76364
11235 76364 76995 39361 -31633 -78853 -102471 -123605 -87608 -90618 -90644 -93261 -86180 -66482 -66305 -67532
11221 -67532 -47991 -31356 -44304 -56044 -37756 14085 55440 83441 47245 10003 -10366 -13795
11209 -13795 -2446 16977 34221 43326 8599 -20213 -9364 -7486 -14103 35286 42960 2722
11197 2722 -35524 -66750 -54360 -40515 -15973 17459 9538 26169 27664 1647 10184 38775
11185 38775 -11097 -15883 -49140 -26587 21088 16063 18641 -13252 3755 55492 60822 35783
11173 35783 -12839 -33298 -36535 -33045 -36683 -53235 -49408 -58130 -62637 -23441 25249 -12800 -92852
11160i2852J7933N0196K0785r645L3018j6111k5538J5474k3105m5824k68L761
11148g2176j7821L422P7317J1847l4332pk3717n551l9943j0219N1914M2503N9422
11135D2659P203k4971K1315l4494q548M4397j9693m7926m6285k937O5335N6204
11123E2259J2634n0424p0581k0418M3216l983O127j8399m4545n868j0505K8712
11111h1775M7980M4650L8791l2461k8224n624o904k526j0444J5786R752n9134
11099g0133O7289K2104j5737k4095j51o875J2738m0075R099M8163M1141q442K4735
11086E9761K9625j7392l8705l0777K5196J1143N5641J1472q6134o870K0377M99
11074C3836p25l3153o2122K5158l3086j1161J2061L7353K6044j4242K1514L8301
$$ plain form
11160 -92852 -74919 -24723 -3938 -13583 19435 3324 -22214 -6740 -29845 -75669 -75937 -72176
11148 -72176 -89997 -86575 -9258 2589 -31743 -31750 -55467 -61018 -100961 -111180 -59266 -16763 42659
11135 42659 49862 24891 46206 11712 3164 47561 27868 -20058 -66343 -69280 -3945 52259
11123 52259 64893 14469 -56112 -76530 -33314 -37297 -31170 -49569 -94114 -99982 -110487 -81775
11111 -81775 -33795 10855 49646 17185 -11039 -16663 -23567 -26093 -36537 -20751 -10999 -70133
11099 -70133 -2844 19260 3523 -20572 -20723 -27598 -14860 -54935 -45836 2327 43468 35026 59761
11086 59761 89386 71994 33289 2512 27708 38851 94492 105964 19830 12960 33337 33836
11074 33836 33111 -42 -62164 -37006 -70092 -81253 -69192 -31839 -5795 -20037 1477 39778
11062C9778J5565M17p4866j0759M383R561J1802M855l7315J9041r658m847R649
11049b2394q597j4058N4878O2317L2608n932N89K3912k4480k2645o318Q731j2899
11036F5712j8877K1835N4983M5249j944J8779j1694k4359n1270J3976M6735P5325
11024B34450N1169K669n877L6235P521j8066r284M314k6507m4335j7846k5525
11012A88918L8214K180l0072N1672J3811n1295J8519M0190m1896o0447o2652j974
11000A05168L2777J8655J6806l9695M2819j672l5229l4419P968n3973j6245K0267
10988F3227j0972n2173j8743q058K5049K9928q055k0480l5825k2533M213K7162
10976b7260J3883m1007j1004J0147P4638M6155M9807J343o1979m8249n1978J962
$$ plain form
11062 39778 55343 55760 -19106 -29865 -25482 -15921 -4119 736 -36579 -17538 -27196 -32043 -22394
11049 -22394 -30991 -45049 9829 72146 104754 98822 99411 123323 98843 76198 69880 78611 65712
11036 65712 46835 68670 123653 168902 166958 185737 174043 149684 98414 112390 159125 234450
11024 234450 285619 288288 282411 318646 326167 308101 298817 303131 276624 232289 214443 188918
11012 188918 227132 229312 199240 250912 264723 213428 231947 272137 230241 169794 107142 105168
11000 105168 137945 156600 173406 133711 176530 174858 139629 105210 113178 59205 42960 63227
10988 63227 52255 82 -18661 -26719 -1670 28258 20203 -277 -36102 -58635 -54422 -27260
10976 -27260 -13377 -54384 -65388 -55241 19397 65552 115359 116702 54723 6474 -45504 -43542
10964d3542O1759L6011n290k0915k8446K507K8411j6553j2484M0719K0m5353J2032
10951H876L220K5186L3641K1661p88l215k4274R185j6484K7339j4405l7847J0163
10938D2258N4291L6077L2302j1523o6056r254K9416k2426k2280N8873j8304j3360
10926I0014l5602q6920L7267k731k9889M980L0172O935O353q744J2773m7084j7634
10913d0110P882m0580l512P6854J2606j2143K4552L8417k7753j5628O6308m9505
10901C7388j3745j5552j8024O7889P3511L0084r572j4716J1551J9778N9244J4377
10889B42213J12507Q8146R2870K34591L33041L12114L04238L14589K04430Q2103
10879B320842K5454k434j870j5576M1023K0244j55740k72609l00294l18453k66119
$$ plain form
10964 -43542 18217 54228 48938 28023 -423 2084 30495 13942 1458 42177 42197 -3156 8876
10951 8876 12096 37282 70923 92584 91796 88581 64307 73492 57008 84347 69942 32095 42258
10938 42258 96549 132626 164928 153405 87349 78095 107511 85085 62805 121678 103374 90014
10926 90014 54412 -32508 4759 2028 -27861 -22881 7291 14226 20579 11835 24608 -22476 -40110
10913 -40110 -32228 -72808 -76320 534 13140 997 25549 63966 36213 20585 86893 37388
10901 37388 23643 8091 -9933 57956 131467 161551 151979 137263 148814 168592 227836 242213
10889 242213 354720 442866 535736 770327 1103368 1415482 1719720 2034309 2238739 2320842
10879 2320842 2346296 2343862 2341992 2326416 2367439 2387683 2231943 1959334 1659040 1340587 1074468
10868A074468j91558j47199j63344j38562o0370m0681o5994l0537Q43q725l6733
10857A91608N930n459k8102j8261k2859j1233M6174j5282N808M2663m56j5813
10845A74718j6101n364l768J0047K6514P40K1353k7279n5606l1711l9843m0469
10833A3231M6127M3555L3453o918j8448L54l509l177n9136j1901K1455K232j9452
10820C7866M453J1206J1448M6227o1671k3334L6286J5847k8683j5124K893k2134
10808A5280j8021J6827J8209L514k9835K382Q504k1537J2265j157J5549M0924
10796F2904N174l7155j7917n9535J6161L224J8910p461L367m624k5033P402K7754
10783f829K3640n7209K1828K1189J4133L936K1612M306l556k6030j8293q736K1924
$$ plain form
10868 1074468 882910 735711 572367 433805 373435 332754 266760 236223 237066 228341 191608
10857 191608 197538 192079 163977 145716 122857 111624 157798 142516 148324 190987 190531 174718
10845 174718 158617 153253 149485 159532 186046 186786 208139 180860 125254 93543 53700 13231
10833 13231 59358 102913 136366 129448 111000 111354 107845 104668 45532 33631 55086 57318 37866
10820 37866 42319 53525 64973 111200 49529 26195 62481 78328 49645 34521 37414 15280
10808 15280 -2741 14086 32295 35809 5974 8356 16860 -4677 7588 6431 21980 62904
10796 62904 68078 30923 13006 -46529 -30368 -27144 -8234 -15695 -12328 -16952 -41985 -34583 -6829
10783 -6829 16811 -40398 -18570 2619 16752 20688 42300 46606 43050 17020 -1273 -10009 11915
10770A1915J652J878o0736k2429M2237P8417j7553n4180J5210J4558m5021l9707
10758g3759N0686N0318J4554o6449o5377N9369J1496J0599O3383Q240R918j7243
10746E5735P85O4727M5898L2294M7118J4279N7918L2279o1981j20980k3367J8513
10734A63218L8410N2885J1000N033K404M0892l0774k7758q873l5905j05637m2705
10722F2190O942K4081J05488J4769o1804Q70o276q965n3616n3364k4895L1332
10710C6752N5741K7195L0919P224l5682q472k0560j1667k1891k8405p735K7859
10698E1278J5031k3030j7305N2503L6839k6102n6954J9778N1499K7559l0754R072
10686A09414J1725k831q998l7164K4797L2193J5142N8842P4483J1916N0193N8314
$$ plain form
10770 11915 13567 15445 -45291 -67720 -25483 52934 35381 -18799 -3589 10969 -34052 -73759
10758 -73759 -23073 27245 41799 -24650 -90027 -30658 -19162 -8563 54820 63060 72978 55735
10746 55735 56520 121247 167145 199439 246557 260836 318754 351033 289052 168072 144705 163218
10734 163218 201628 254513 265513 270546 272950 313842 283068 255310 246437 210532 104895 62190
10722 62190 69132 93213 198701 213470 151666 152536 146260 137295 83679 30315 5420 36752
10710 36752 92493 119688 150607 157831 122149 113677 93117 81450 59559 31154 23419 51278
10698 51278 66309 43279 25974 78477 115316 89214 32260 52038 103537 131096 100342 109414
10686 109414 121139 118308 109310 72146 96943 129136 144278 203120 277603 289519 339712 398026
10674C98026O0546Q7747O1206J2457L1149M37M7455L9431K6264j0705l3420k5402
10662F95191m8955m4700n3890j9614j6912l4796o3556k6677N2712L9477K6088
10651E04368k5308m9172q934M2151L8560m3406l427P6755O6137j7591p3030o7085
10639D40018M3982k3527K2943J14276J40951J00752O5372J01982J09161J50651
10629A266561R7147J76240K14262K23663K76091L46349N03245P27306J008669
10620D839533J329955J868171K547223L265501L702309L443949K207239N02954
10612B3706834q57887j366173j013683j36579J081923K611013M388130O166695
10604C4580273P368325O694911L330224j139954l926369m413995l341466j518630
$$ plain form
10674 398026 458572 546319 607525 619982 651131 651568 699023 738454 764718 754013 720593 695191
10662 695191 646236 601536 547646 528032 511120 476324 412768 386091 438803 478280 504368
10651 504368 479060 429888 420954 463105 501665 458259 454832 531587 597724 580133 507103 440018
10639 440018 484000 460473 483416 597692 738643 839395 904767 1006749 1115910 1266561
10629 1266561 1363708 1539948 1754210 1977873 2253964 2600313 3103558 3830864 4839533
10620 4839533 6169488 8037659 10584882 13850383 17552692 20996641 23203880 23706834
10612 23706834 22848947 21482774 20469091 20332512 21414435 24025448 28413578 34580273
10604 34580273 41948598 48643509 51973733 50833779 46907410 42493415 39151949 37633319
10596C7633319O70412L038491N583695Q042495R356835P575129K023691m430609
10588F9493458q204036q656453p021786m681987k242606J48848K362201M171196
10580D5368835M894669L318377n58258m780941o946492o804949n435178l712851
10572B5343212k142505p94746L23805J050871J149683L54365j242108k760284
10564B1282293l481106l381883k882906k263547j709937j280679r04201o63927
10556D714107n15458m10047l12410j88039j97515k10753j56381j61933r4959q8198
10546B378414m1639P258J8m4466p1144J3788J7310l4459K0616k1463J341R594
10534B235168k2780m2457j1163P4743J06415R338M341J5268K8254M2859M8501
$$ plain form
10596 37633319 38303731 41342222 46925917 54968412 64325247 71900376 73924067 69493458
10588 69493458 61289422 52632969 45611183 40929196 38686590 38835438 41197639 45368835
10580 45368835 50263504 53581881 53023623 48242682 41296190 34491241 29056063 25343212
10572 25343212 23200707 22405961 22729766 23780637 24930320 25284685 24042577 21282293
10564 21282293 17801187 14419304 11536398 9272851 7562914 6282235 5378034 4714107
10556 4714107 4198649 3788602 3476192 3288153 3090638 2879885 2723504 2561571 2466612 2378414
10546 2378414 2336775 2344033 2344051 2299585 2228441 2242229 2259539 2225080 2245696 2224233 2225574 2235168
10534 2235168 2212388 2169931 2158768 2233511 2339926 2349264 2353605 2368873 2397127 2439986 2488487
10523B488487P7667O2594k788k0777N080R1288N4081R0258J04675J02939J55158
10512C208662J58002K16516K02533K15728K67735L16620M15071M20049N56350
10503E977266O45390O84180P98202R53134J131962J210568J273270J338599J418622
10494A5431193J535675J779981K141021K528403K789881L184899L809279M902062
10486C8102394O531209Q957128J2511888J7953596K5850405L6598849M9027198
10479A95532667O0403858O6996701O1573331M3642623K2721212L250674n031975
10472D49089091j429507O863650Q394097l150043k1813082m4490315o0444427
10465C33019464o3876277n8034441m7561741l6418432k6766218j9458879j4202701
$$ plain form
10523 2488487 2566154 2628748 2625960 2605183 2610263 2701551 2755632 2845890 2950565 3053504 3208662
10512 3208662 3366664 3583180 3785713 4001441 4269176 4585796 5000867 5420916 5977266
10503 5977266 6622656 7306836 8105038 9058172 10190134 11400702 12673972 14012571 15431193
10494 15431193 16966868 18746849 20887870 23416273 26206154 29391053 33200332 38102394
10486 38102394 44633603 53590731 66102619 84056215 109906620 146505469 195532667
10479 195532667 255936525 322933226 384506557 428149180 450870392 454121066 449089091
10472 449089091 447659584 454523234 462917331 459767288 437954206 393463891 333019464
10465 333019464 269143187 211108746 163547005 127128573 100362355 80903476 66700775
10458F6700775j0545367p876544n899619m538842l762483l330203k888825k588180
10450B5270712k339149k044720j757691j459937j240700j274607j257381j066764
10442A2829763j052639r34166q00933o40342n24639n27351m21310l66465m42293
10433G119625l96297k93127k89480l07496l09004k45881k45530l13941k46827
10424D472042j44206j47172j67522k03969j25345q4107j32479j89450j63849j21113
10414B992830j25876q1258j10074p3485m7283q6530j00300n6464o9204r5479k4189
10403B122688r738k1996m6424p7101l918j396l848q3293l9572m862k4878n9881
10391A745781n2280j7965m29L31j8727m3340r0812l1781n6839p6661j4630j4272
$$ plain form
10458 66700775 56155408 48278864 42379245 37840403 34077920 30747717 27858892 25270712
10450 25270712 22931563 20886843 19129152 17669215 16428515 15153908 13896527 12829763
10442 12829763 11777124 10842958 10042025 9401683 8877044 8349693 7928383 7561918 7119625
10433 7119625 6723328 6430201 6140721 5833225 5524221 5278340 5032810 4718869 4472042
10424 4472042 4327836 4180664 4013142 3809173 3683828 3599721 3467242 3277792 3113943 2992830
10414 2992830 2866954 2785696 2675622 2602137 2554854 2468324 2368024 2311560 2242356 2146877 2122688
10403 2122688 2112950 2090954 2044530 1967429 1963511 1962115 1958267 1874974 1835402 1830540 1805662 1745781
10391 1745781 1693501 1675536 1675107 1675438 1656711 1613371 1522559 1490778 1433939 1357278 1342648 1328376
10379A328376k9368m7904J0445m8308o9715j1782j6929j8605m3971j4797k5649
10368A011793n004J5368j9541n6075K2048k1460n0880k8088l7180J751k8473j174
10356H03085K3800o5552k5813j9856j5041R680q889Q0932N2908O8489J40320J73979
10344A218042R9786N0189L2092n718m2444j4035K0172N1845j7780m2596p4452
10333A275101j24637j38073j38648j30306l2576j4926m1408J3659j8598k6810
10323F22778o946j4984j592L3048o242j1578K2596k0774r232n0558K212N526Q832
10310E73086k2879k5765N156k6604k5505r247l9827r056k9592j3601k9507p555
10298C39104k195k4931L8094q544k7085P4488J3929m275m5688o0902L861M0915
$$ plain form
10379 1328376 1299008 1251104 1261549 1213241 1143526 1131744 1114815 1096210 1052239 1037442 1011793
10368 1011793 1006789 1022157 1002616 946541 968589 947129 896249 868161 830981 832732 804259 803085
10356 803085 826885 761333 735520 715664 700623 710303 701414 782346 835254 903743 1044063 1218042
10344 1218042 1317828 1368017 1400109 1394391 1351947 1337912 1358084 1409929 1392149 1349553 1275101
10333 1275101 1150464 1012391 873743 743437 710861 695935 654527 668186 649588 622778
10323 622778 615832 600848 599256 632304 626062 614484 637080 616306 607074 556516 558728 564254 573086
10310 573086 550207 524442 529598 502994 477489 468242 428415 419359 389767 376166 346659 339104
10298 339104 336909 311978 350072 341528 314443 388931 402860 398585 352897 291995 295856 336771
10286C36771l5975k5324r2216j9137L8108N288N370J05064N5765r473R881M9330
10274D23452L5944k6071o5929n4010J0746l4794k9404M0554k4010j158L2402J9407
10262C27129J5835k021m6595P355K6561M1295L3281m9737k0551L5350J9785j9212
10250C68475K421k7030L705M585k6178R96j0233J4131l544j9114K4405l4884J0693
10237C08428K2747n1925j4071m0507N295M9447j3076P518M5925j1361L7515K2227
10225C68162K114l3072j06992M724M2909J2461M8195J8028l5468m0745k207j5721
10213B62388K4219M1752M4257K458j9975k3407m3847K1364J7512m2383k9052L194
10201B58480J724L2863n9496l8265N0608N4240K2660n5043l650l7009L2427M5408
$$ plain form
10286 336771 300796 275472 183256 164119 202227 207515 212885 317949 373714 364241 374122 423452
10274 423452 459396 433325 367396 313386 324132 289338 259934 300488 276478 275320 307722 327129
10262 327129 342964 340943 294348 301703 328264 369559 402840 353103 332552 367902 387687 368475
10250 368475 370896 343866 347571 352156 325978 326974 316741 330872 327328 308214 332619 297735 308428
10237 308428 331175 279250 265179 224672 229967 279414 266338 273856 319781 308420 345935 368162
10225 368162 370276 337204 230212 234936 277845 290306 338501 356529 321061 280316 278109 262388
10213 262388 286607 328359 372616 375074 355099 331692 287845 309209 326721 284338 255286 258480
10201 258480 260204 293067 233571 195306 245914 300154 322814 267771 264121 227112 259539 304947
10189C04947j0271r971p433K7144K2184J5790L4504R7937J59812J50753J34045
10178I19441K13708K58903J85017J04970p8902j82252k07235k32592j66383p2534
10168G42141l5010l2827l7633o9780k0807P613m0083q6262K5233N5943q78P87
10156E08437N5269P3166O6137J1969l4635j09581l9499m7933l3192m7144l0717
10145C72277M7219Q0171Q3507m6459r3684k8519j7072m4805l1196n3220k7064
10134B41155j1005J1275K1324Q099J1928L6389K4860n9805n1224J2102p80n3721
10122A90597n1488L9630q755n694o083L565j6977K1371k2490L55K1458K9129L5115
10109B29733k6730L1272J1288j8519n4609M832J4637L0341l2020m2242m3034M02
$$ plain form
10189 304947 294676 284705 277272 304416 326600 342390 376894 474831 634643 785396 919441
10178 919441 1133149 1392052 1577069 1682039 1603137 1420885 1213650 981058 814675 742141
10168 742141 707131 674304 636671 566891 546084 553697 513614 427352 452585 508528 507650 508437
10156 508437 563706 636872 703009 714978 680343 570762 531263 483330 450138 402994 372277
10145 372277 419496 499667 583174 536715 443031 414512 397440 352635 321439 268219 241155
10134 241155 230150 241425 262749 270848 282776 319165 344025 284220 232996 245098 244318 190597
10122 190597 139109 178739 169984 164290 158207 161772 144795 166166 143676 144031 165489 194618 229733
10109 229733 203003 234275 245563 227044 172435 177267 191904 222245 190225 147983 104949 105351
10097A05351N9369N3058L5677J8708l3829m947o592N1862N004m0859k2513k5570
10085A94719M8970N7212m448q375m633l4834L5327K4276M3461L9620l7131L3360
10073C87524O8962J05079J85676K04579K02572L44938L77656K69882J87035J08778
10063B442681M3998N3297p71J7669k5797n4353j29561k39586k75812l22598k74226
10052A234941k53302j73987j37803q3238o0667j15016m3102K6539k0613j2092
10042C61660o3876q5n2248j3646J1088M8380K5585j4589l0796R34n0895L5293
10030B56805j1408o4153M4160L1230j3872l4029J842k4303Q225k1131l8431J1376
10018A46311Q2P338p506j4731j2986m5403m0800P651k381L1282O216K0827j3266
$$ plain form
10097 105351 164720 217778 253455 272163 238334 233387 226795 278657 283661 242802 220289 194719
10085 194719 243689 300901 296453 288078 283445 248611 283938 308214 351675 391295 354164 387524
10073 387524 456486 561565 747241 951820 1154392 1499330 1876986 2146868 2333903 2442681
10063 2442681 2486679 2539976 2539205 2556874 2531077 2476724 2347163 2107577 1831765 1509167 1234941
10052 1234941 981639 807652 669849 586611 525944 410928 367826 394365 373752 361660
10042 361660 297784 297699 245451 231805 242893 291273 316858 302269 271473 272407 221512 256805
10030 256805 245397 181244 225404 256634 242762 208733 210575 186272 194497 173366 134935 146311
10018 146311 146393 153731 146225 131494 118508 73105 32305 39956 37575 68857 75073 95900 82634
10005H2634P037l1360m2658J1828j0643l5578J1645N0660L8623j1634K121L428
9993G6103k476m603p7912J1261P0465M1715J18l2068k6509k4684P867K2964O3601
9980A25842R607l3882k175l4474K447k3795n45P272J544M9170O3991r7020n9130
9967H852J1238J2207J4445q163J5429J9029o89j3019m1691K6659q417J9031R821
9954F4732j0661j0061Q013N750M478j9954O926P500L773m0690l1679j0140P4452
9941E2439J9426J649p17j2091K4190O135r549M9904N036k6207m796m3889M1665
9928A03195P1248K1685L6501n1917o5100j0112K1828o866K825k5577m7171L857
9916E4396j8304l549p27k8705J8714J055o190K4200L9889r746K0318K3727o912
$$ plain form
10005 82634 89671 58311 15653 27481 16838 -18740 -7095 43565 82188 70554 72675 76103
9993 76103 73627 69024 -8888 2373 72838 114553 114671 82603 56094 31410 39277 62241 125842
9980 125842 135449 101567 99392 64918 67365 43570 43025 50297 51841 101011 165002 67982 8852
9967 8852 20090 32297 46742 38579 54008 73037 72348 59329 17638 44297 35880 54911 64732
9954 64732 54071 44010 52023 57773 62251 42297 49223 56723 60496 19806 -11873 -22013 52439
9941 52439 71865 73514 72797 60706 84896 91031 81482 131386 136422 110215 105419 61530 103195
9928 103195 174443 196128 232629 180712 115612 105500 127328 120462 123287 97710 50539 54396
9916 54396 36092 32543 31816 3111 21825 22880 16690 40890 80779 71033 91351 115078 108166
9903A08166l3255m2525l9436O2072M5510K060l3476l1090k1762K1664P505L7798
9891H3231M3550n878l7194o499k0449j8736J2217j3533l4730L0532J8361j9536
9879C1336l532l7166J5003J2963K4422K7922L6799j602q2170l5963L7754Q2287
9867A08053K3110k062O096p28M7394r824m2560j2861M150J2151J7062j5102q701
9854A26178M255n3764j9751L3938K6078N2098k7560n0365l2969l2896m900K0293
9842D0635J103j2061L315M7517J3740l5054q083J3258O8818m8689l3544K4618
9830G5573J7649n7891k1722K5530M7735K9046K325m2405k4762o694o760R680L7455
9817H4759M652p09j1690K615J270j3913n0910K4392N4228J991n4143K4695k0054
$$ plain form
9903 108166 74911 32386 -7050 55022 100532 102592 69116 38026 16264 37928 45433 83231
9891 83231 126781 120903 83709 77210 56761 38025 50242 36709 1979 32511 50872 31336
9879 31336 27804 -9362 5641 18604 43026 70948 107747 106145 23975 -11988 25766 108053
9867 108053 131163 129101 135197 134469 181863 172039 129479 116618 120768 132919 149981 134879 126178
9854 126178 130433 76669 56918 90856 116934 169032 141472 91107 58138 25242 20342 40635
9842 40635 41738 29677 32992 80509 94249 59195 51112 64370 133188 84499 50955 75573
9830 75573 93222 35331 13609 39139 86874 115920 118245 75840 51078 44384 37624 47304 84759
9817 84759 89411 88702 77012 79627 80897 66984 16074 40466 94694 96685 42542 67237 47183
9804D7183j655j118k5334l3699O3901P8893K9964m1282k8745j9409l4262j279
9792C3158M0811J0646k4821K0553K0436l1860K0132L467k9454m0459k3227j0584
9780a1202N34M0080O3187O9114K0381n7436o6675K2470J46K3597k5009l1291R544
9767E7440k7826J5591k5516k8683l088k0667k5350J5898J0418K2099L4878L5483
9755F0677K2682j1953m2190Q570M186K0108m615k1584j5544J7835L9340J7282
9743I4794k6935m980l5060k1637m5364J9605K6388q081M1721P921k0581m7499
9731a9708J7604M4851M0104l2723q0197m594J7517K8198L0409J7477m4327o6543
9719e1932k4932O3789N9550R337o008k7437k5157M2066L7635j6196K8145k5753
$$ plain form
9804 47183 45528 44410 19076 -14623 49278 128171 158135 116853 88108 68699 34437 33158
9792 33158 73969 84615 59794 80347 100783 68923 89055 92522 63068 22609 -618 -11202
9780 -11202 -10668 29412 92599 161713 182094 124658 57983 80453 80599 104196 79187 47896 57440
9767 57440 29614 45205 19689 -8994 -12082 -32749 -58099 -42201 -31783 -9684 25194 60677
9755 60677 83359 71406 29216 37786 41972 62080 57465 35881 20337 38172 77512 94794
9743 94794 67859 62879 27819 6182 -39182 -19577 6811 -1270 40451 48372 27791 -19708
9731 -19708 -2104 42747 82851 50128 -30069 -34663 -17146 11052 41461 58938 14611 -51932
9719 -51932 -76864 -13075 46475 55812 49804 22367 -2790 39276 76911 60715 88860 63107
9707F3107J5318J0132K223k2028j4695J624k310K5035K7421K2427j92o2697k5890
9694C9475k3407l3518K5046j5575n3964m4753L0695N0716K8176o935L0962K589
9682B9507l5791O0570O6640J244k5614m2227k7928O41L9275L5598q9962q8896
9670g6943m3617K1056O3392K0354J6350K3735O1011K6179o0187P023J6750k3710
9658E1393J4942K7947k7631n7150l6580M0445O0751J060j5452k5924L87n945l8862
9645a0619j567q109J4123K2851N6153J6850j1895j1864M340l7132m6767k5715
9633c9351J5525K1856r472J8700L6426L845k4145m9314J368k1764K1657n853r840
9620d0362K0861J2444M0211N9538k2680l2467L1451j0037n0082m6930J8542L275
$$ plain form
9707 63107 78425 88557 90780 68752 54057 55681 53371 78406 105827 128254 128062 65365 39475
9694 39475 16068 -17450 7596 -7979 -61943 -106696 -76001 -25285 2891 -4044 26918 29507
9682 29507 -6284 54286 120926 122170 96556 54329 26401 27042 66317 101915 11953 -76943
9670 -76943 -120560 -99504 -36112 -15758 592 24327 85338 111517 51330 58353 75103 51393
9658 51393 66335 94282 66651 9501 -27079 13366 74117 75177 59725 33801 34188 28243 -10619
9645 -10619 -12186 -20295 -6172 16679 72832 89682 77787 65923 70263 33131 -13636 -39351
9633 -39351 -23826 -1970 -11442 7258 43684 47529 23384 -25930 -24562 -46326 -24669 -30522 -40362
9620 -40362 -19501 -7057 33154 92692 70012 37545 68996 58959 8877 -38053 -19511 -16236
9608a6236L6902j5286L2380J2341q1083k2843M2119O9253P2402k0737l9341m2412
9596B7459L1356N1954j2143l309n1703k8745l2920O415O1736N4728l3715m0370
9584C0743n298j6015K5329l097j3436m1059j0969M9087M5720m942p5879K2122
9572B306M2247L1917k658m2355K196J157j2804K1689l544j6128L1992k4628Q797
9559D0184M5434P8624K4871n0037o5277j6286l4940m5328L019N1060O4464q0742
9547A5046R868J5637L3925Q284j2405L0711m9566r480K0411q694k8849j5657o825
9534B406j3999K9792j9942k215K9474N0608k7292l4015m6311J9061N41K1809k103
9521G814j3300o79K8814k7804l826K7604M6474o576m9453K9982J3537j8550k4
$$ plain form
9608 -16236 20666 5380 37760 50101 -30982 -53825 -11706 57547 129949 109212 69871 27459
9596 27459 58815 110769 98626 95317 43614 14869 -18051 -11636 50100 104828 71113 30743
9584 30743 25445 9430 34759 31662 18226 -22833 -33802 15285 61005 56063 -19816 2306
9572 2306 44553 76470 73812 31457 33653 34810 22006 43695 40151 24023 56015 31387 40184
9559 40184 85618 164242 189113 139076 73799 57513 22573 -22755 -19736 31324 95788 15046
9547 15046 24914 40551 74476 82760 70355 101066 51500 42020 62431 53737 24888 9231 2406
9534 2406 -11593 18199 -1743 -3958 25516 76124 48832 14817 -31494 -12433 -11892 9917 7814
9521 7814 -5486 -6165 22649 -5155 -8981 18623 65097 58521 9068 39050 52587 34037 34013
9508C4013l0849N2875j5120L4827l3809q6731L5542L4189k1685k7371j6966k588
9496d3673J6127l1689J8532J1006j6157j5018P580J1545p376l387r868j2822K0288
9483e4912J4941l4214j6141N6511L8447J8060j1386l1596K6380K7428M8761j845
9471H0434N9795K3492o1103l8851K24k8822Q212J0995k9944k4664J6687N7156
9459G3611K8879p278M7748l5092m6836n7322O387L0572l34l2386l5214L0035L9930
9446D2700j7978k9651J4119j26M5041K9170j1421j1957m902j4854r400m2934p594
9433a9787R198o324L0661K0770J6125k8630R102K0017n88J0112q634m6855K079
9420G246K9399J9017m0404j3497J8820n9318o923N6780K6537P7601k5142l5643
$$ plain form
9508 34013 3164 56039 40919 75746 41937 -44794 -9252 24937 3252 -24119 -41085 -43673
9496 -43673 -27546 -59235 -40703 -29697 -45854 -60872 -53292 -41747 -49123 -52510 -62378 -75200 -54912
9483 -54912 -39971 -74185 -90326 -33815 4632 22692 11306 -20290 6090 33518 82279 80434
9471 80434 140229 163721 102618 63767 63991 35169 43381 54376 24432 -232 16455 73611
9459 73611 102490 95212 142960 107868 61032 3710 10097 40669 40335 7949 -27265 2770 42700
9446 42700 24722 -4929 9190 9064 54105 83275 71854 59897 54995 40141 30741 -12193 -19787
9433 -19787 -10589 -16913 13748 34518 50643 22013 31115 51132 50544 60656 52022 5167 7246
9420 7246 36645 55662 15258 1761 20581 -38737 -45660 11120 37657 115258 90116 54473
9408E4473o1291k6813l6488m2339K0537N7252J07487K0316j05075n4242J3731
9397e2452O8554N3563r739j2042N35K0207O2680M0805n170k4016j379j2292J1721
9384A40975m605o6125n985J0560L4153j3412k5o6109q8118L0427L6356L5297Q230
9371E1619l2115k0589k2773l3542k2841o328O2008J9167M531K3851M132R432K5483
9358F2035j1509l828K2446k0003p4223k1482K6783M7553m5924k6465J2123L0463
9346b031O9608R7314J5366o2270n6112j5017k6245r157k9546K4620K8681M756
9334C9967k577k3441j659Q835N9089Q024m1623l8057j5805M7770J9967J204L2983
9321I4677m926K1583k866j0813J8771P411l505m5906n1905j3417p775r390l8223
$$ plain form
9408 54473 -6818 -33631 -70119 -112458 -91921 -34669 72818 93134 -11941 -66183 -52452
9397 -52452 16102 69665 59926 47884 48419 68626 131306 172111 166941 142925 141546 129254 140975
9384 140975 136370 70245 64260 74820 108973 95561 95536 29427 -58691 -28264 8092 43389 51619
9371 51619 19504 -1085 -23858 -57400 -80241 -86569 -24561 -5394 -863 22988 27120 36552 62035
9358 62035 50526 46698 69144 49141 -25082 -46564 -19781 27772 -18152 -44617 -32494 -2031
9346 -2031 67577 164891 180257 117987 61875 46858 20613 11456 -18090 6530 35211 39967
9334 39967 37390 13949 12290 21125 80214 88238 46615 8558 -7247 40523 60490 61694 94677
9321 94677 89751 111334 108468 97655 116426 123837 120332 74426 22521 9104 1329 -8061 -46284
9308d6284k0577M3057M8498j7758j0165N7324M8671o8356k4156L8800J7575l1444
9296C5185K8773n02m5447l5285m459N5898L6102j028l287l578m0544k0380J5635
9283A7083J2139j4657m2431K9751j4969M7249O3330k237k5732o326Q596J5784
9271H7580m9729m7207o2941J9035N8651L0737L813k7495r472J6463m706N694M351
9258B4774p199l3811m591m6278l0214J2820L4437R613m2728k8894M2230K5280
9246d4561L7420J4787j15j1618p68j3221N7279J6619k5286K1173o072m8969K1765
9233A8433l4559j1607k2333J764P2548K3761m5216J0208L0235M4186m5978n6194
9221a4752k306L7316L2063N568M089l0002j5615q458m2707j6415M0107M3231J4223
$$ plain form
9308 -46284 -66861 -23804 24694 6936 -3229 54095 102766 34410 10254 49054 66629 35185
9296 35185 63958 63456 18009 -17276 -21735 34163 70265 69237 65950 62372 21828 1448 17083
9283 17083 29222 14565 -27866 1885 -13084 34165 97495 95258 69526 63200 71796 87580
9271 87580 37851 -9356 -72297 -53262 5389 36126 39939 12444 2972 19435 14729 20423 24774
9258 24774 17575 -16236 -20827 -67105 -97319 -84499 -50062 -40449 -83177 -112071 -69841 -44561
9246 -44561 -7141 7646 7531 -4087 -4855 -18076 39203 55822 30536 51709 45637 -3332 18433
9233 18433 -16126 -27733 -50066 -48302 24246 48007 2791 12999 43234 87420 41442 -14752
9221 -14752 -17058 20258 52321 57889 61978 31976 16361 7903 -34804 -51219 -11112 32119 46342
9208D6342l1559L5023L6585n0517o35N197K7824L8246l121p0920m9503J4848K4781
9195B2591N2173L4186l0341R588j2036q99M368J3406J3572j0428q927k3208m3308
9182B0737p185L190m64L8477K82R548j4864J8826J8340m1233J0241M0479N070
9169A01444k3037k2776j9284l0091q200l875j9817Q245J7579k8888l5156R731
9157e4125O2473O3605J2508k5054l5236l6614N099q425K8655O2968K2654q3972
9145A4536j4062k2228K8536M0362K0295j3388k0671j4073N0618J9508l5906m3214
9133A0313M2772N083n845J1519k0582K0744j4816k3487j0087j9437K804o705l7310
9120d5034K5396N6800k0860k5405J1795K959j8740R650J1881q8936m0505P1544
$$ plain form
9208 46342 14783 49806 86391 35874 35239 40436 68260 106506 103385 32465 -17038 -2190 22591
9195 22591 74764 108950 78609 88197 76161 75262 79630 93036 106608 96180 87253 64045 20737
9182 20737 13552 16742 16278 54755 55037 64585 49721 68547 86887 45654 55895 96374 101444
9169 101444 78407 55631 36347 6256 -1944 -5819 -25636 -17391 188 -28700 -63856 -54125
9157 -54125 8348 71953 84461 59407 24171 -12443 -7344 -15769 12886 75854 98508 14536
9145 14536 474 -21754 6782 47144 67439 54051 33380 19307 69925 89433 53527 10313
9133 10313 53085 58168 52323 63842 43260 64004 49188 25701 15614 -3823 -1019 -7724 -45034
9120 -45034 -19638 37162 16302 -9103 2692 5651 -13089 -3439 8442 -80494 -120999 -49455
9108d9455K1081M648J0973N341L7381k8902o711j4002j3957j7341K1829M3684
9096A4569q903k8915K5937P7380P232k6336M8752p1054l0979P627n82j9947K2486
9083A7267M3609O689p4843k3031M461k926L2834L197J1712k1333J6056K736K659
9070A9087j8407n0729J6391P7325L5750m6817J812p808J3214M0068L04n1573j1107
9057A7510k8632M219K1207k3186m3878M7128M1060j3778J4517J6512j5600k1217
9045A5862J8911L997M2046N4828K0336n8843p8948q888L488m9012k6184k3083
9033h5490n54R2559M8809K5254k3477L038o6178j4373O1294n763k4307O860M145
9020B1817K2623J045k1682n7352j3773N6909L1320j3331N049k3457j1885j4378
$$ plain form
9108 -49455 -28374 -23726 -12753 -7412 29969 1067 -5644 -19646 -33603 -50944 -29115 14569
9096 14569 5666 -23249 2688 80068 87300 60964 109716 38662 7683 15310 14728 -5219 17267
9083 17267 60876 67565 -7278 -30309 -25848 -28774 4060 7257 18969 -2364 13692 16428 19087
9070 19087 680 -50049 -33658 43667 79417 32600 34412 26604 39818 79886 80190 28617 17510
9057 17510 -11122 -6903 14304 -8882 -52760 -5632 35428 21650 36167 52679 37079 15862
9045 15862 34773 38770 80816 135644 155980 97137 18189 9301 12789 -36223 -62407 -85490
9033 -85490 -86044 6515 55324 80578 57101 60139 -6039 -20412 40882 35119 10812 17672 21817
9020 21817 44440 45485 23803 -33549 -47322 9587 40907 27576 32625 9168 -2717 -17095
9008a7095J0082K7327j2611k9366o44n96K6628j0258n3939L1812M7445L7613J9844
8995G6242K3323o249p0691j2590J5323j0785M9140L1169k780j2305p458o3826
8983H513j0399l748n777J9873k1773L0500M5174k2969k4920o6362J9351K0909
8971a1628L2004P802j8670K3810J681J4224K7368N5784R926m6034m7088j0527
8959C8652k697J402m7319k4734l4394m9106k3621P5322P3697L5099l461O227j9810
8946B5257k3022K5073N737m981l0020J6762J6605k5748K333J7012O985M155l7333
8933a185P880J7640j8993m966j6498k3882l3534j8709M2192k5314k0849N497l813
8920i4534R251j3321N2192O7976j0148O19j6833J023M7992n345N4379M1305l0470
$$ plain form
9008 -17095 -7013 20314 7703 -21663 -22307 -22903 3725 -6533 -60472 -28660 18785 56398 76242
8995 76242 99565 93316 22625 10035 25358 14573 63713 94882 92102 79797 72339 8513
8983 8513 -1886 -5634 -11411 8462 -13311 17189 62363 39394 14474 -51888 -32537 -11628
8971 -11628 20376 28178 9508 33318 34999 49223 76591 132375 142301 96267 49179 38652
8959 38652 35955 37357 -9962 -34696 -69090 -118196 -141817 -66495 7202 42301 38840 45067 25257
8946 25257 2235 27308 33045 28064 -1956 14806 31411 5663 7996 25008 31993 36148 -1185
8933 -1185 6695 24335 5342 376 -16122 -40004 -73538 -92247 -50055 -75369 -96218 -90721 -94534
8920 -94534 -85283 -98604 -46412 21564 11416 12035 -4798 -3775 44217 38872 93251 134556 104086
8907A04086o898o8237j08289j089M7180M6184k507k2481m1077L6352o672j6122
8895c9570N519j930o085n0914O861p9635J2614M2702J5636J7314P3210K9892K0449
8882D6063p87k214m2593J0592M6956k1810j8929R138j0008m407j5188l6923q517
8869d8627j394M6165l1537L726J1520k6268O728q886K7151K8480K8606L423m1284
8856b197l7116l851J8128K1220L9853j2335Q80K4216o8835k6940M5215O547K0199
8843B4984k4645P233K7207k0595J7461M516l1547j8804K1565L5254j4395K0824
8831D9058J0318K73p941k4211m8139j06n134K9937O9412J3509m672m275J8531
8818I6560M597n9311o3413q84L0773k4753l8514j5111r807K5412L5795J9310J9885
$$ plain form
8907 104086 97188 28951 -79338 -80427 -33247 12937 10430 -12051 -53128 -16776 -23448 -39570
8895 -39570 -34051 -35981 -42066 -92980 -86119 -165754 -153140 -110438 -94802 -77488 -4278 25614 46063
8882 46063 45276 43062 469 11061 58017 36207 17278 26416 16408 12001 -3187 -40110 -48627
8869 -48627 -50021 -3856 -35393 -31667 -20147 -46415 -39687 -48573 -21422 7058 35664 39087 -2197
8856 -2197 -39313 -43164 -25036 -3816 36037 23702 24582 48798 -20037 -46977 -1762 4785 24984
8843 24984 339 7572 34779 14184 31645 36161 4614 -14190 7375 42629 28234 49058
8831 49058 59376 59649 51708 27497 -20642 -20748 -25882 4055 73467 86976 82304 78029 96560
8818 96560 101157 41846 -21567 -22451 8322 -16431 -54945 -70056 -79863 -54451 -18656 654 20539
8805B0539J9016j1667k091J4442M2608M4891o4091j6465j3705l5140J2476j2179
8793a366j5115K6713K6538l862k4925j9854K735K5459k0963M6214l0712o6100
8781e5238O0783K6979L8248R939k6492n4850k3033J4559O192L3411j4998j258
8769A4242K3147k3293o1269J6912K1872l420L9912n2142m7900J7143j0479P4859
8757I584K1628r110K6664o5695p994O361K1641L4131M1386l7414j9241o407K2811
8744C8345M7464J6356n6417l9605j5250J7275j1787J4014N4556j3794k8984k258
8732A9915M174p1k037k0909P060k8869j5743o108J2086r689P4930M1266O968m9458
8718C3515m3318n0739k7741M0203M1665K336j2494K7750M8663n064k8355J5599
$$ plain form
8805 20539 39555 27888 25797 40239 82847 127738 63647 47182 33477 -1663 10813 -1366
8793 -1366 -16481 10232 36770 32908 7983 -11871 -9136 16323 -4640 41574 10862 -55238
8781 -55238 5545 32524 70772 80711 54219 -631 -23664 -9105 -2913 30498 15500 14242
8769 14242 37389 14096 -47173 -30261 -8389 -11809 28103 -24039 -71939 -54796 -65275 9584
8757 9584 31212 22102 48766 -16929 -24923 -18562 3079 37210 78596 41182 21941 15534 38345
8744 38345 85809 102165 45748 6143 -9107 8168 -3619 10395 64951 51157 22173 19915
8732 19915 24089 24018 21981 1072 8132 -20737 -36480 -42588 -30502 -40191 34739 76005 82973 33515
8718 33515 -9803 -60542 -88283 -48080 -6415 -4079 -16573 11177 59840 54776 26421 42020
8706D2020k7832k863K737j0835l9597o630K4923M8353R561n5786K6434K1407r020
8693B2872j8390J093m702K7792L4114l2884k3189J042k43L5794K1385r050k3793
8680C1841J9001J9776m9281K3605l673J3246k4779o5054k7169K2604L2281k5488
8668c3090M3167K564j7411m5466J1963K3333j8676O620Q972j363k2418j979n0206
8655i3990l1322M8153L8776J6592p0015K723L9645K52q314P521l0694K6K1117
8642e9530J7138M001j2172L1293M8547J0935k1346K6493j6357k7471N283K703
8630I517N567N825L215N967J3413R888J6042j6317k0229l2123q760J5848k911
8617D942q600q667K6736j0024R763P556M7554j6342o6900j7687k541O447N1205
$$ plain form
8706 42020 14188 11325 14062 3227 -36370 -43000 -18077 30276 39837 -15949 10485 31892 22872
8693 22872 4482 5575 873 28665 62779 29895 6706 7748 7505 43299 64684 55634 31841
8680 31841 50842 70618 21337 44942 41269 54515 29736 -35318 -62487 -39883 -7602 -33090
8668 -33090 10077 12641 -4770 -50236 -38273 -14940 -33616 -26996 -18024 -19387 -41805 -43784 -93990
8655 -93990 -125312 -77159 -38383 -21791 -91806 -89083 -49438 -49186 -57500 -49979 -80673 -80647 -59530
8642 -59530 -42392 -38391 -50563 -19270 29277 40212 18866 45359 29002 1531 6814 9517
8630 9517 15084 20909 24124 30091 43504 53392 69434 53117 32888 765 -7995 7853 4942
8617 4942 -3658 -12325 14411 4387 14150 21706 69260 52918 -13982 -31669 -34210 -27763 23442
8604B3442J8406j7774n2657l1749M6097K8989J0240k3386l0965K354J4702l167
8592a5468K3755k2302j1246J3689k858K7605K4872K0429K6434K1535l8867o5498
8580B080K4738M0224L627J8010J753Q04o0128l884j4474J9150j5864m393K2464
8567C4107k383q0661J4939L9963J355j3418J6686j2040L1916J5943o5192n1182
8555f9967j3692L1632N6362L5563K2495M2004k7138p0654J0099k0898m1991K1557
8543b4628m050p504R120J4320J0699K766l220P9425l1726m0640K6468L1857k9323
8530C3564O607L0072J8271k7321j2266m7461k1469J7827R204R257l9652m647L0566
8517B552n525o7344N596J7588K7068m3501J3448K0518k1675N357P521J6467K816
$$ plain form
8604 23442 41848 24074 -28583 -60332 -14235 14754 24994 1608 -29357 -27003 -12301 -15468
8592 -15468 8287 -14015 -25261 -11572 -14430 13175 38047 58476 84910 106445 67578 2080
8580 2080 26818 67042 70669 88679 90432 91236 31108 27224 12750 31900 16036 11643 34107
8567 34107 31724 -48937 -33998 5965 7320 -6098 10588 -1452 30464 46407 -18785 -69967
8555 -69967 -83659 -52027 4335 39898 62393 104397 77259 6605 16704 -4194 -46185 -24628
8543 -24628 -28678 -36182 -27062 -12742 -2043 723 -2497 76928 45202 4562 31030 62887 33564
8530 33564 40171 70243 88514 61193 48927 1466 -20003 -2176 7028 16285 -23367 -28014 2552
8517 2552 -2973 -70317 -64721 -47133 -20065 -63566 -50118 -29600 -51275 -45918 -38397 -21930 -19114
8504a9114N742J4883L747L4160k8213o7660K4174k490j2498M3860K7008O906J857
8491C2362R429j8670l1899m8670J8397O9137M3997m9737J5471n151J6480q861
8479D2285l27M5955J1804l5132m1308m2317J4461M2609j8191m5257j3793K3471
8467a5740J1743P7664j1966m3210k8697O594N8011L9707o9088m6542K3446k441
8455e19k0950k6537K1668l6462m0400N7584P7729N3447p420m2357j8028J2308
8443C0063j4507K0457K1194n2369j02j035K420K8075M6965Q237j7583J7325m9985
8430C9155m1442J0511K8201M0713q377l1754r1112J6550j9742j1200J065K0229
8418d7203M3536K0066l0537l7665M4201j557Q844j8672o5012r162N8273L6883
$$ plain form
8504 -19114 -13372 1511 5258 39418 11205 -56455 -32281 -34771 -47269 -3409 23599 30505 32362
8491 32362 41791 23121 -8778 -57448 -39051 30086 74083 24346 39817 34666 51146 42285
8479 42285 41958 87913 99717 64585 23277 -19040 -4579 38030 19839 -25418 -39211 -15740
8467 -15740 -3997 73667 61701 18491 -10206 -3612 54399 94106 25018 -21524 1922 -519
8455 -519 -21469 -48006 -26338 -62800 -103200 -45616 32113 85560 78140 35783 17755 30063
8443 30063 15556 36013 57207 4838 4736 3701 6121 34196 81161 89398 71815 89140 39155
8430 39155 -2287 8224 36425 77138 68761 37007 -54105 -37555 -57297 -68497 -67432 -47203
8418 -47203 -3667 16399 -14138 -51803 -7602 -9159 -315 -18987 -83999 -93161 -34888 1995
8406A995K3538J0145l7848L9023M2860P0283O8746k818q672R1093K03448K94212
8394G96005J56466p5536k34645k37655q5761q4072r1726l9864j1523j1777j7303
8383F2609p0419k5038J1744J4758L100j7381j8459L063M0224K4833j3170j9751
8371c887l0101J6995J7069k7980M9918R771J4195M4775N003k7064j0708R449j4847
8358E2588J2186L0826K3962Q2825J46371J54383L45925N70644M86542m7896l93802
8347A464554m68406l17612k47077j62439q1877L517J4937l4611k7481k0589j8050
8336A04866m2296l4332k421L4924K7042k3342K384m9044J6279J809o0638l4587
8324e9356r868L0215j6462j1783K0862L0752j0250m7071K8183O0492J9690M381
$$ plain form
8406 1995 25533 35678 -2170 36853 79713 149996 218742 215924 207252 298345 501793 796005
8394 796005 952471 876935 642290 404635 318874 234802 143076 103212 91689 79912 62609
8383 62609 -7810 -32848 -21104 -6346 -3246 -20627 -39086 -36023 4201 29034 15864 -3887
8371 -3887 -33988 -16993 76 -27904 22014 31785 45980 90755 95758 68694 57986 67435 52588
8358 52588 64774 95600 119562 202387 348758 503141 849066 1419710 1906252 1858356 1464554
8347 1464554 996148 678536 431459 269020 187143 190660 205597 170986 143505 122916 104866
8336 104866 62570 28238 25817 60741 87783 64441 66825 17781 34060 35869 -24769 -59356
8324 -59356 -69224 -39009 -55471 -67254 -46392 -15640 -25890 -72961 -44778 15714 35404 39785
8312C9785L5667O6017Q4244J10997M2034K00264K62854Q6576j31088j64431j65331
8301D67588j67254r3742m7396l2224m4752l8353M455j9358J8477J3829M462j4517
8289E1215L3297J1236j2121q1235l0285J1809P5596M069m0596p632m198j6425
8277e270J4751j091q556J2028P226q338m5855k9711L3559M3870j4214p239o974
8264a5814J704n956k6884m2351p938l516R075N9340J0266k7713K0992M0855j6092
8251d032R542L7995R664o258j01777p542J2352J7686K9521j2003N576J1502k9928
8238b7702k7178J7044L1983P0994k5426n5224j5939o09m2011K9963l4637R033
8226f9709K3091O4860J3084o039L975M119l6029J4897P086m0367M5782J2215K8894
$$ plain form
8312 39785 75452 141469 225713 336710 378744 579008 841862 928438 797350 632919 467588
8301 467588 300334 206592 159196 126972 82220 43867 48322 28964 47441 61270 65732 51215
8289 51215 84512 95748 83627 2392 -27893 -16084 59512 63581 22985 15353 11155 -5270
8277 -5270 9481 8390 -166 11862 19088 10750 -35105 -64816 -31257 12613 -1601 -8840 -15814
8264 -15814 -14110 -20066 -46950 -89301 -97239 -100755 -91680 -32340 -22074 -49787 -28795 12060 -4032
8251 -4032 5510 43505 53169 46911 -54866 -62408 -50056 -32370 -2849 -14852 -9276 2226 -27702
8238 -27702 -54880 -37836 -5853 65141 39715 -15509 -31448 -32057 -74068 -44105 -78742 -69709
8226 -69709 -46618 18242 31326 25287 29262 33381 -2648 12249 19335 -21032 24750 36965 65859
8213F5859r462K0935M0623l0611m9834q467J386l665K309N8807l7714k4267J0795
8200C6694K3209p208k3662j4131j1010n503J6499J255l4382p343N6073J8658M8264
8187I7413m9953k0936j7893L9718Q388k1126N0176J1433j8636n2816J089N8198
8175H5055j7790R187l1783j4770L2976P9373J6758n6207l4622N3013J8191o8695
8163G0686l6434p941k7458N583j4109m9287k4404K8472j0650l0395K8110L5028
8151c2799J5675k0756l0564l079N9067L3175J4165j1145j1363O195k5894J4006
8139F683L0372M8983m438m4492p0480l4334L6858O4588j2665m7065J5669J0362
8127D1j7786n975L8044l2665J9703K8278N2739L700J826l7205j707k5706k6763
$$ plain form
8213 65859 56397 77332 117955 87344 37510 29043 30429 26764 29073 87880 50166 25899 36694
8200 36694 59903 52695 29033 14902 3892 -1611 14888 16143 -18239 -25582 30491 49149 97413
8187 97413 47460 26524 8631 48349 56737 35611 85787 97220 78584 25768 26857 85055
8175 85055 67265 76452 44669 29899 62875 142248 159006 102799 68177 121190 139381 70686
8163 70686 34252 26311 -1147 4436 -9673 -58960 -83364 -54892 -65542 -95937 -67827 -32799
8151 -32799 -17124 -37880 -68444 -71523 -12456 20719 34884 23739 12376 18571 -7323 6683
8139 6683 37055 86038 81600 37108 -33372 -67706 -30848 33740 21075 -25990 -10321 41
8127 41 -17745 -23720 14324 -18341 1362 29640 82379 86079 87905 50700 48993 23287 -3476
8114c476j5653m1665l3679j0160L7337N7415J4017K9567O115l4991j3743k7967
8102c6883k7501K5372L978K7588L4924N6257L3343m1443l5807m301l1592p2001
8090f8066n1711J7928M0846L6232l8381q112J728K4823K8582j0378K1207P598
8078B296J2144l1673P362n711J6884M3803L8170l7776n8662l6305J8036M7000
8066A5568l0300k5353M9368L1664k4482m2799m7734j0143R1904N0058J5516l7083
8054C6184J9909J7756k0283p8238K1097J5501m2699K8031L887r655P406n952j6454
8041b3510R686L3910m096p8808n7914K3182K3695K037M2311L7462l843l2244p484
8028c5616J2043J6626l0257L1115K5702K8550m8378k6720l1401r785K8261K7921
$$ plain form
8114 -3476 -19129 -60794 -94473 -104633 -67296 -9881 4136 33703 39818 4827 -8916 -36883
8102 -36883 -64384 -39012 -35034 -7446 27478 83735 117078 75635 39828 35527 3935 -68066
8090 -68066 -119777 -101849 -61003 -24771 -63152 -71264 -69536 -44713 -16131 -26509 -5302 2296
8078 2296 14440 -17233 -9871 -15582 1302 45105 83275 45499 -13163 -49468 -31432 15568
8066 15568 -14732 -40085 9283 40947 16465 -26334 -74068 -84211 7693 57751 73267 36184
8054 36184 56093 73849 53566 -24672 -3575 11926 -30773 -2742 1145 -8510 -1104 -7056 -23510
8041 -23510 -13824 20086 15990 -62818 -120732 -97550 -73855 -71818 -29507 7955 4112 -28132 -35616
8028 -35616 -23573 -6947 -37204 -6089 19613 48163 -215 -26935 -58336 -68121 -39860 -11939
8016a1939j5110K1744K017j3528J6309k0611o314L242M3237R364J1229n3958n342
8003a9660m1124n9259j1012N5519M0492k666k5271m719k307N5353Q165m2585J5577
7990c3497O9960N8710M8885q082k6435q1749k7512k1076O632J8043k1444P496
7978a0069j0110L482r833k0286L0991N1737k1129j9928j2253l4868l9760N991
7966h6035J3698Q4714M4691l8333k2286k1713K81K488n703P1509J898k4156n7634
7953c6581p521k5134P3109L5088n3655K1380N2069K2399j5908m2509k4501R181
7941G417n976K748j0412k4453K2189l517J7282k2328M7537m440p713M038j6156
7928F216r699N625L380l3323j709l4981K8872J8764L2638M1946j41j8027k5234
$$ plain form
8016 -11939 -27049 -5305 -3288 -16816 -507 -21118 -27432 -24190 19047 28411 39640 -14318 -19660
8003 -19660 -60784 -120043 -131055 -75536 -35044 -37710 -62981 -67700 -70007 -14654 -6489 -49074 -33497
7990 -33497 36463 95173 144058 135976 109541 27792 280 -20796 -14164 3879 -17565 -10069
7978 -10069 -20179 -16697 -26530 -46816 -15825 35912 14783 -5145 -17398 -52266 -92026 -86035
7966 -86035 -72337 12377 57068 18735 -3551 -25264 -24983 -22495 -28198 43311 45209 21053 -36581
7953 -36581 -44102 -69236 3873 38961 -14694 6686 58755 81154 65246 22737 -1764 7417
7941 7417 1441 4189 -6223 -30676 -8487 -12004 5278 -17050 30487 26047 18334 22372 6216
7928 6216 -3483 2142 5522 -27801 -29510 -64491 -35619 -16855 15783 57729 57588 39561 14327
7915A4327J544n822j5813M7676k3560l8524J2542n159j51n1937k9257N7887m973
7902d1220j3951j2069N6228o613K2214J9579l6209r094L9341M892J7040N73Q565
7889D9276J9120J9766l5174L6919k1486o81j3303o3464p967L2140M837j9503k0907
7876b0427k4416k441k446K3398J9413r587q5896K756K9155k1275N2676M7383l1792
7863b3499L0981N0224K6710l7276m9453n8253K8630J9283l9703j9468J2334M8770
7851a0720J1905j5418K4671l4561k4232K166j0492p135J7145J0777l7278K9386
7839d3786J6056O413J7879P546M2854K8588k0824m1508N6323R741P287n8912q6968
7826e9311k6013k8432N8433K7792K290K1382J007J3726l3300K040J9682K1795
$$ plain form
7915 14327 15871 10049 -5764 41912 18352 -20172 -7630 -12789 -12940 -64877 -94134 -36247 -41220
7902 -41220 -55171 -67240 -11012 -17625 4589 24168 -12041 -21135 18206 23098 40138 40711 49276
7889 49276 68396 88162 52988 89907 68421 67740 54437 -9027 -16994 15146 19983 480 -20427
7876 -20427 -44843 -47284 -49730 -26332 -6919 -16506 -102402 -99646 -70491 -91766 -39090 8293 -23499
7863 -23499 7482 57706 84416 47140 -2313 -60566 -31936 -12653 -52356 -71824 -59490 -10720
7851 -10720 1185 -14233 10438 -24123 -48355 -46189 -56681 -63816 -46671 -35894 -73172 -43786
7839 -43786 -27730 -21317 -3438 4108 46962 75550 54726 13218 69541 79282 86569 27657 -59311
7826 -59311 -85324 -113756 -55323 -27531 -25241 -3859 -2852 10874 -22426 -20386 -704 21091
7814B1091O0657l4931k6334l9722q139j5446N201L028K3776k0729r5544M2621
7802h4471N7893j5065J5066J9679j7425l9198l3782M4097M1423l0755l0179j4172
7790h6889M5113Q2377k4294k9797k5905Q827L4793l3222l4673p767J7609M9094
7778d734J2981k431q352n3740J8408M3507j9081r551j1357j6954K4449j5161j8166
7765f0182J9387k7204l0467K9601Q3811M8102l8745m4937k2626j0926Q393J6592
7753b9201P741K3616L4143J5883k8943L7978K6604q379p2135j2901Q402j8762
7741a5954J7299L0560J845j4927L9716j2643m8926o9728l162J5148N3825j5928
7729b2875l016N4217o332n3411N2833j8167k9575m1337J6947j0689j5647k0166
$$ plain form
7814 21091 81748 46817 20483 -19239 -27378 -42824 -37623 -34595 -10819 -31548 -127092 -84471
7802 -84471 -26578 -41643 -26577 -6898 -24323 -63521 -97303 -53206 -11783 -42538 -72717 -86889
7790 -86889 -41776 40601 16307 -13490 -39395 -30568 4225 -28997 -63670 -71437 -53828 -4734
7778 -4734 8247 5816 -2536 -56276 -37868 5639 -13442 -22993 -34350 -51304 -26855 -42016 -60182
7765 -60182 -40795 -67999 -98466 -68865 14946 63048 24303 -20634 -43260 -54186 -45793 -29201
7753 -29201 -21460 2156 36299 52182 23239 61217 87821 79442 7307 -5594 2808 -15954
7741 -15954 1345 31905 33750 18823 58539 45896 -3030 -72758 -75920 -60772 -6947 -22875
7729 -22875 -25891 28326 21994 -31417 21416 3249 -26326 -67663 -50716 -61405 -77052 -97218
7717i7218N2581M0530l902N012l328R270l9905K2510N9930K9746L946n7684j7181
7704D307K7525L5955J4502k8505k3115n354l3213k1358l8177K8958M1380M6304
7692D9209q428r653j2299r782K0426n1132L5582O268o4589k7813J0641j4991j6499
7679i3060K8637L6966K430l6940J4052L3529k4984p1708M0050m8K6754P5443N4623
7666H5744m5122j13622p974n266L3111N1786k3278N223k9209j282O0012j2059
7654a936J9895K4069R967k296J2468m323l9372r983m3911K5355L3413m422Q091
7641B7015N091k8786k4668K0292k6468m9951K5622j5173n3519o1006O7390M7493
7629f6668Q0810K4843k3130k2645k9357l0859M7631L8415l7935L2979K7746M2238
$$ plain form
7717 -97218 -44637 -4107 -8009 -2997 -6325 2945 -36960 -14450 45480 75226 79172 21488 4307
7704 4307 31832 67787 82289 53784 30669 25315 -7898 -29256 -67433 -38475 2905 49209
7692 49209 40781 31128 18829 9047 29473 -21659 13923 20191 -44398 -72211 -61570 -76561 -93060
7679 -93060 -64423 -27457 -25027 -61967 -47915 -14386 -39370 -111078 -71028 -71076 -44322 31121 85744
7666 85744 40622 -73000 -80974 -86240 -53129 -1343 -24621 -19398 -48607 -49889 10123 -1936
7654 -1936 17959 42028 51995 49699 62167 57844 18472 8489 -35422 -10067 23346 18924 27015
7641 27015 32106 3320 -21348 -1056 -27524 -77475 -51853 -67026 -120545 -181551 -114161 -66668
7629 -66668 14142 38985 15855 -6790 -36147 -67006 -19375 19040 -18895 14084 41830 84068
7617H4068k6539j20j1679J5225j3407o0653K9172K8852q673R98J843k9449m1590
7604c1952J8510j8716o575J4468k8496N2048l9386k6643L0674M5926J3172j0953
7592A2077k2082Q463j0249J0416k6378K5782j9662K1095K1297R796M5448n5823
7580B0180m7019k756K4489r601J3716J3184L1148j7930k4938k1458L5317k5820
7568a1488k1813P5066L1156j9501l2208K5006J1421m2639j0441j5922J1464l355
7556c254m2347o323J4380K6069k9693j8097n439P569M592j3963J2186N534Q722
7543d0064M5474N2236k4608p477O991j0528k071k6605J4523M7372j93k3365l859
7530B7826K4619K1176L611k8514j2070K8771j2745n4346k8110j5019j0593J3051
$$ plain form
7617 84068 57529 57409 45730 60955 47548 -13105 16067 44919 36246 37244 39087 9638 -31952
7604 -31952 -13442 -32158 -38733 -24265 -52761 -713 -40099 -66742 -36068 9858 23030 12077
7592 12077 -10005 -1542 -11791 -1375 -27753 -1971 -21633 -538 20759 30555 76003 20180
7580 20180 -26839 -29595 -5106 -14707 -991 12193 43341 25411 473 -20985 14332 -11488
7568 -11488 -33301 41765 72921 53420 21212 46218 57639 15000 4559 -11363 101 -3254
7556 -3254 -45601 -51924 -37544 -11475 -41168 -59265 -64704 -57135 -52543 -66506 -54320 -48786 -40064
7543 -40064 5410 57646 33038 25561 32552 22024 19953 -6652 7871 55243 55050 31685 27826
7530 27826 52445 73621 77232 48718 36648 65419 52674 -1672 -29782 -44801 -55394 -42343
7518d2343P7060O9646M6655q619n3328k5910l2133M468L0157Q874k5288K2570
7506G1809M7005M1852l7513o5025K0002J625o6998j2932J1836J7896K1037j2255
7494C8339m7773O24J4318L6290J7870P21k8230q236l630Q273K2448j2436n7950
7481a9372J4650l8228n094N7523l728k1659J6295K2991J5895L624J7611j958j0695
7468D7855k2967Q042j223m9891l5258J9197P454L680M0472k9694j7211K6247L6501
7455C3204J7530n0439o1737M08K1605J0444n7162M5664M8670j2124j9938k8037
7443e1912l2804j0585j3401M0333R759j0570k1112K5789M5528j0909P493J9312
7431c079j3077l346l6544K4779N9436K931L5567J1341m2410J8064J628k7189n7606
$$ plain form
7518 -42343 34717 104363 151018 142399 89071 63161 31028 35496 65653 74527 49239 71809
7506 71809 118814 160666 123153 58128 78130 79755 12757 -175 11661 29557 50594 38339
7494 38339 -9434 -8810 5508 41798 59668 60389 32159 23923 20293 28566 51014 38578 -19372
7481 -19372 -4722 -42950 -48044 9479 5751 -15908 387 23378 39273 42897 60508 58550 47855
7468 47855 24888 32930 31707 -18184 -53442 -34245 -26791 -23111 17361 -12333 -29544 -3297 33204
7455 33204 50734 295 -61442 -61034 -39429 -28985 -86147 -40483 8187 -3937 -23875 -51912
7443 -51912 -84716 -95301 -108702 -68369 -58610 -69180 -90292 -64503 -18975 -29884 -22391 -3079
7431 -3079 -16156 -19502 -56046 -31267 28169 31100 66667 78008 35598 53662 55290 28101 -29505
7418b9505l3365K8430J959j225n989O029J74j4951M5219q264k7093k480O39P024
7404c3398j813k1135K7410L9167R963J0419N960K0160M0399k9257K8734j94n0516
7391D5899o1695l6403j2815P759L2000L2398L4676k2169l6651M160k9770K1552
7379b1059P459o1756M4008L2820J5397j2085j8047j2884k77o300M9103N723O547
7366B8649o3627n8511O640J2372J2413L5741M1591N897m2832k8207P1934K4165
7354D6225p5701p1971M894R0516J3930n6011k2521J8203P047l368n012k508J2873
7341d3404n2441o379P8742n623k3796k7761N3903L1687L2329o27j2956n9065j1776
7328d7167K6917l2244m984N7191L5710j0711m2215l6769J8305l1236j00373M1013
$$ plain form
7418 -29505 -62870 -34440 -32481 -33706 -39695 -33666 -33492 -48443 -3224 -11488 -38581 -41061 -40422 -33398
7404 -33398 -35211 -56346 -28936 10231 20194 30613 36573 56733 97132 67875 96609 96415 45899
7391 45899 -15796 -52199 -65014 -57255 -25255 7143 41819 19650 -17001 -12841 -42611 -21059
7379 -21059 -13600 -75356 -31348 1472 16869 4784 -13263 -26147 -26424 -32724 16379 22102 28649
7366 28649 -34978 -93489 -86849 -74477 -62064 -26323 15268 21165 -21667 -49874 22060 46225
7354 46225 -29476 -101447 -96553 -6037 7893 -48118 -70639 -52436 -45389 -48757 -53769 -56277 -43404
7341 -43404 -95845 -102224 -23482 -29105 -52901 -80662 -26759 4928 37257 36630 23674 -35391 -47167
7328 -47167 -20250 -52494 -57478 -287 35423 24712 -17503 -54272 -35967 -67203 -167576 -126563
7316a26563P7027j0809m7919j2489N1832K2104J7013m7338l7493l51q43j9486
7304a35315J0214O1995j8249l0927L6282P2688Q5733k9605m7835N2318q906j3333
7292C5060m687l8695j813J2569K7932k3735m678m6698o2725l220K3887N1979K9210
7279e614p9576l4538M6244R0107M261m3022l0629J0821N8158q123K0140k4212
7267D017m0568k6622J1183k297K0705P6219P8106r575j6078r566j8473k1405m2571
7254C075Q940k2668j3549R343J358q93Q956k175K0413n562K8175J0639o2848K8187
7240A1391p244K154l5279j5155m066j0380k1527l465l9893K8154P0212j3158k2244
7227f0500P0577J9883n1342K7116M2908M8333L4973p451m6303j15616o921R1991
$$ plain form
7316 -126563 -49536 -60345 -108264 -120753 -68921 -46817 -29804 -77142 -114635 -114986 -115829 -135315
7304 -135315 -125101 -63106 -81355 -112282 -76000 -3312 82421 52816 4981 57299 48393 35060
7292 35060 30373 -8322 -10135 2434 30366 6631 1953 -44745 -107470 -110690 -86803 -34824 -5614
7279 -5614 -85190 -119728 -73484 16623 20884 -22138 -52767 -41946 16212 8089 28229 4017
7267 4017 -36551 -63173 -51990 -54287 -33582 42637 120743 111168 95090 85524 67051 45646 3075
7254 3075 12015 -10653 -24202 -14859 -13501 -14394 -5438 -7613 12800 7238 35413 46052 -16796 11391
7240 11391 4147 6301 -28978 -44133 -48199 -58579 -80106 -83571 -123464 -95310 -25098 -38256 -60500
7227 -60500 10077 29960 -21382 5734 48642 96975 131948 124497 78194 -37422 -44343 47648
7215D7648O0703M2521p6270p9409k409K5391J9857j2117m5846p832j4503M8022
7203E756L4678r758L2514l5920l7146K3197j400O3693J3145l1293L0066J8602
7191A06134n0554k0630k9854k2232K3581N471P913j7227P686R440k2859m2984
7179d6115l6798J945M4092K4254l1002P816L8750P7534j3020o2344l3655L4513
7167E970j148l3695M021l1115J0894k190O3228L5653m3413L7121M9530j1934k2052
7154F0870l7414k1382n251n1269k0176L8686K2347j8387k0906L6111N782L0314
7142A9325K8936l265l3248J0514P331j4797J2726J0981k230j9763J2K7219k5057
7129A8684N2473L6174J1193k4055n5874j4867k0965l4912j7131K3077k8105j787
$$ plain form
7215 47648 108351 150872 74602 -4807 -7216 18175 38032 25915 -19931 -27763 -42266 5756
7203 5756 40434 30676 63190 27270 -9876 13321 11921 75614 88759 57466 87532 106134
7191 106134 55580 34950 5096 -17136 6445 11916 19829 2602 10288 19728 -3131 -46115
7179 -46115 -82913 -80968 -36876 -12622 -43624 -35808 2942 80476 67456 5112 -28543 5970
7167 5970 4822 -28873 -24852 -55967 -45073 -47263 15965 51618 8205 45326 94856 82922 60870
7154 60870 23456 2074 -3177 -54446 -74622 -35936 -13589 -31976 -52882 -16771 -10989 19325
7142 19325 48261 44996 11748 22262 29593 14796 27522 38503 36273 16510 16522 43741 18684
7129 18684 71157 107331 118524 94469 38595 23728 2763 -32149 -49280 -26203 -54308 -56095
7117e6095P5368k2155K8774M9413l3831j0683q752J1173j8682K2869J147J0500
7105D9046k7542m6859j4866L5743l722k9975R460j0036M0585J2535o944j0703
7093c278L608L5210k0319j420k2343n0634J3122N4323j8867j3124J8659m575L6284
7080B6646N8002J5469k3247l3171l6247k9128k908n2933j0548L0623N0465K9304
7068B2327Q23l4340K637J9046J7307l5516m9513M4777R4345N5568n0300p9563
7056G598J0638R3j2187p1132k3032J1839M6888J4364P5783k20p8796m8446j3656
7043h0266J4146O6161K1842m9782p7311N440M3650N9934P379j7942M219L91j3836
7030a5975J8762K479n959k3998j1805O666R772k4307k6867M3207M6480l3277j2338
$$ plain form
7117 -56095 19273 -2882 25892 75305 41474 30791 22039 33212 14530 37399 38546 49046
7105 49046 21504 -25355 -40221 -4478 -8200 -38175 -28715 -38751 1834 14369 7425 -3278
7093 -3278 330 35540 15221 13801 -8542 -59176 -46054 8269 -10598 -23722 -5063 -9638 26646
7080 26646 84648 100117 76870 43699 7452 -21676 -24584 -77517 -88065 -57442 -6977 22327
7068 22327 23150 -11190 -8553 10493 27800 -7716 -57229 -12452 81893 137461 87161 7598
7056 7598 18236 18329 6142 -64990 -88022 -76183 -29295 -14931 60852 60632 -18164 -66610 -80266
7043 -80266 -66120 41 21883 -27899 -105210 -99770 -56120 3814 11193 -6749 -2530 -2139 -15975
7030 -15975 2787 5266 -693 -24691 -36496 -29830 -20058 -44365 -71232 -28025 18455 -14822 -27160
7017b7160l0910J0981l94m5485m4031j2542K5783O9722L034R120K9790N5376m216
7004C9068J574J1895j7266M0339n9218r2555L665P555p236p0311J4806O5805L0085
6991c1794K700j285k119J5959M2361k8400l2612m7465J3978M8336L0514k8610
6979a8437J3080J2611j9536l7906k4003L402N9500r5m0501o311j2240j588J9633
6966e2391O7239K5066n5304j2024L1704J591K6545J9678K7239k1284o0000l4470
6954c6411Q903k3140j6605K2624j3988l5950k5651K9415J8758R839L7900M5605
6942B1299n395l9257m1616j0018L4551P530K5715r788J972l2552J1054M985J5899
6929a5621O1878L8708j0052m5806j8405K4420M920O384k2022n8984l007P3032
$$ plain form
7017 -27160 -58070 -47089 -47483 -92968 -136999 -149541 -123758 -54036 -51002 -41882 -12092 43284 39068
7004 39068 40642 52537 35271 75610 16392 -76163 -72498 -64943 -72179 -142490 -127684 -61879 -31794
6991 -31794 -29094 -30379 -32498 -16539 25822 -2578 -35190 -82655 -68677 -20341 10173 -18437
6979 -18437 -5357 7254 -12282 -50188 -74191 -70789 -11289 -11384 -51885 -58196 -70436 -72024 -52391
6966 -52391 14848 39914 -15390 -27414 4290 5881 32426 52104 79343 58059 -1941 -36411
6954 -36411 -27508 -50648 -67253 -44629 -58617 -94567 -120218 -90803 -72045 -62206 -24306 21299
6942 21299 15904 -23353 -64969 -74987 -40436 -32906 -7191 -16979 -15007 -47559 -36505 -31520 -15621
6929 -15621 46257 84965 74913 29107 10702 35122 40042 46426 24404 -34580 -37587 35445
6917C5445l541m4628J1202j5050k8795J4191m220J1462q459j3597N5104L2000
6905D1114M4929k3001l083l6667M30o605m9933J5309k8047O6456M0842m9586n1488
6892c9330R509k4189m1633R02O1554L7804k1746o0210l6232J693j13K542J7332
6879i2117L7769j9343k6372K8235N7880p013o254K0681l853Q340m5887q944N3215
6866c663K0000K8892K1721m5900q492k0057j4511n538L198j2475m417N907k672
6853c8007J7885M8285N151K5758O78m8841k7837Q532k3432l22K0495K0989L0817
6840D0151k9m40k9724J728n177l0225j8848K1794K1482j2060l8919m5554j0326
6827a06147M8990O6162K9680l3753k2026M6000L309j0045j8509M5783k5933m8763
$$ plain form
6917 35445 31904 -12724 -1522 -16572 -45367 -31176 -35396 -23934 -32393 -45990 9114 41114
6905 41114 86043 63042 59959 23292 23722 17117 -32816 -17507 -45554 20902 61744 12158 -39330
6892 -39330 -29821 -54010 -95643 -94741 -33187 4617 -17129 -77339 -113571 -111878 -111991 -109449 -92117
6879 -92117 -54348 -73691 -100063 -71828 -13948 -20961 -27215 -6534 -10387 -2047 -47934 -56878 -3663
6866 -3663 16337 45229 66950 21050 12558 -7499 -22010 -27548 -24350 -36825 -41242 -35335 -38007
6853 -38007 -20122 28163 33314 59072 59750 10909 -16928 -8396 -31828 -32150 -11655 9334 40151
6840 40151 40122 39682 9958 11686 6509 -23716 -42564 -20770 712 -11348 -50267 -95821 -106147
6827 -106147 -57157 9005 38685 4932 -17094 28906 32215 22170 3661 49444 23511 -25252
6815b5252k4022l634K3990K3315P458J2004j0785l6006R271M2823r78l430J7513
6802C2267J6375K2595l6667k8913j834J141R69k1535R434P0855j3533m0223j00936
6789i0005l5666L8087j8550J3282K6044K8734K3980l6836l0448K0656N0378J0841
6777D97l4275K7569k1653J1206J6914L468l5745l9057k0517L4806l802M1350K4643
6764E404M1768p281k7163j371l5547j151J4785K3916m427P141K3681m3388J1505
6751G872M5692M0012j8782l5055m1981K4185K1512p3141J2509n077K1692K1280
6739B0718p2272r015j3575j4096J1138L0130J8729Q878l0145q634J8595K0342
6727a9207m2505L233K5091j7022P933j2J4215J5496J2753N4362O4227O847n8385
$$ plain form
6815 -25252 -49274 -52908 -28918 -5603 1855 13859 3074 -32932 -23661 19162 18184 14754 32267
6802 32267 48642 71237 34570 5657 3823 4964 5933 -15602 -6168 64687 51154 10931 -90005
6789 -90005 -125671 -87584 -106134 -92852 -66808 -38074 -14094 -50930 -81378 -60722 -10344 497
6777 497 -33778 -6209 -27862 -16656 258 3726 -32019 -71076 -91593 -56787 -60589 -19239 5404
6764 5404 47172 39891 12728 11357 -24190 -25341 -10556 13360 8933 16074 39755 -3633 7872
6751 7872 53564 93576 74794 39739 -2242 21943 43455 -29686 -17177 -22254 -562 20718
6739 20718 -51554 -60569 -74144 -88240 -77102 -46972 -28243 -19365 -49510 -58144 -39549 -19207
6727 -19207 -61712 -58479 -33388 -50410 -42477 -42489 -28274 -12778 -25 54337 118564 125411 67026
6714F7026l1295j6568P700R507o3778n0070L5791P0220q542J3017L5041j9305
6702D8744l0897L43N604k4295J3191l1551J350K5746k0586l7817n6252K9921O3995
6689a2504K9349M2145J5608L974j9107n1538l5508j1079m1522l1693M6740N0817
6677a4318m042n667M948l4058L303q507L1433k758j1182J7552P38K25J8838K2786
6663A9291R348J358j7998L4564m892o567J5211n3618k4200k2058l0259j3838Q3600
6650a0058K0307L2100p791j8094L3286m1167l2179j8842k6093K3673Q948M1116
6638E206j8828J5757K6327J7911L7076l5335p8104j2978L2348j3422J4034j1739
6626b1747o0343K4912M4992L9537k6987L0519M2129M392l3709l2349k6436k8834
$$ plain form
6714 67026 35731 19163 26863 36370 -27408 -77478 -41687 28533 19991 33008 68049 48744
6702 48744 17847 18190 23794 -501 12690 -18861 -17511 8235 -12351 -50168 -106420 -76499 -12504
6689 -12504 16845 58990 74598 78572 59465 7927 -27581 -38660 -80182 -111875 -65135 -14318
6677 -14318 -18360 -24027 -19079 -53137 -49834 -58341 -26908 -29666 -40848 -23296 -22558 -22333 -3495 19291
6663 19291 28639 29997 11999 46563 41671 35104 50315 -3303 -27503 -49561 -79820 -93658 -10058
6650 -10058 10249 42349 34558 16464 49750 8583 -23596 -42438 -68531 -44858 -35910 5206
6638 5206 -13622 2135 28462 46373 83449 48114 -29990 -42968 -10620 -24042 -10008 -21747
6626 -21747 -82090 -57178 -12186 27351 364 30883 73012 77404 43695 11346 -15090 -43924
6614d3924P02J7126P315k2582l883k253J8960L1992j2512m8035J22395M6371l7295
6601G4377m0357J6765R468j1872m9475l7041N6692j12J5445J8152n2797l6558
6589c7313l2706N4959K1476m267L3980L6444l0547m3750l5066O276L8609J9454
6577B7549J794j1978r619O699R024l8196k1363P015j8371j2207J8386L1376L7521
6564B7630K319J956j0953J1668l7094o343L7953L9598l6591m590J1134j8017M508
6551B3178q57j770j3511J4172K5532j7584J6864J4937n5069o677J1813N5583L3904
6538A00515q6814J0852O1262n2622k8018K607J8412N2875K3036m3007n0438m6503
6526c7843j8937M4806M9018q958l397k7048n9457o3660L604P0588J3237K118K9092
$$ plain form
6614 -43924 -43222 -26096 -18781 -41363 -45246 -47499 -28539 3453 -9059 -57094 65301 111672 74377
6601 74377 34020 50785 60253 48381 -1094 -38135 18557 18445 33890 52042 -755 -37313
6589 -37313 -70019 -15060 6416 2149 36129 72573 42026 -1724 -36790 -30514 8095 27549
6577 27549 29343 17365 7746 14445 23469 -14727 -36090 -29075 -47446 -59653 -41267 -9891 27630
6564 27630 29949 31905 20952 32620 -4474 -10817 27136 66734 30143 25553 36687 18670 23178
6551 23178 22321 20551 7040 21212 46744 29160 46024 60961 5892 -785 11028 66611 100515
6538 100515 13701 24553 85815 33193 5175 7782 26194 79069 102105 59098 8660 -37843
6526 -37843 -56780 -11974 37044 28086 24689 -2359 -61816 -125476 -121872 -51284 -38047 -35929 -6837
6513f837J2821M0517J0720L908P337o5267m272J1469l992r582J4021j9183N2658
6500D4318R015k6680l4563M3391l0449m3772n1447K5036O2011K7563j5981l8279
6488b9837P623L0091R304m1455k6918L3836P1175M6194l8133r4741k4935P2816
6476A5020O5443k7244k2935l4930n1325m5819L934J6762q499K9719J222j5471
6464g4123M7835n2409K2724m6858L2484K3509J8333J6343K3135k4770j7816J573
6452c0040K3804M4339J9529K7011o0339j06255l0636K8522O72k304K788k3211
6440a06120K3622K0548n835K0615M5141O136k679J9874l4447k3874L1567O38J8578
6427A3764n9281j5632L2148j1317m4141O896M6943J7557M393K9635k6732n4528
$$ plain form
6513 -6837 5984 46501 57221 61129 68466 3199 -1073 10396 6404 -3178 10843 -8340 44318
6500 44318 53333 26653 -7910 35481 5032 -38740 -90187 -65151 -3140 24423 8442 -29837
6488 -29837 -22214 7877 17181 -24274 -51192 -17356 53819 100013 61880 -32861 -57796 15020
6476 15020 80463 53219 30284 -4646 -55971 -101790 -97856 -81094 -89593 -59874 -58652 -74123
6464 -74123 -26288 -78697 -55973 -102831 -70347 -46838 -28505 -12162 10973 -13797 -31613 -30040
6452 -30040 -6236 38103 57632 84643 24304 -81951 -112587 -84065 -83393 -85697 -82909 -106120
6440 -106120 -82498 -61950 -67785 -47170 -2029 4107 1428 21302 -13145 -37019 -5452 -4814 13764
6427 13764 -45517 -61149 -29001 -40318 -84459 -77563 -30620 -13063 -8670 20965 -5767 -60295
6415f0295N2072J3295p534m273O879J6305J3114m2435q802K0259p050l8801r37
6402d8203K2151j8180k2434m3635P7509R9174l8279k497J3103L2584j7446o4297
6390a0450j794J4185P582n6236k4300R283l1029j1764Q3107M1116J3270O758l111
6377C6617j3269l9119o0454J165K2688K7144K2762k3215K9624J2705J4303j4899
6365A6052r4930k1190O7021P190m0183J2899l1980L315q992M9629Q1463K7988
6353F8282p4482m8885K6764O956J8575j8262k6505M6255J5262m6603J3015O5577
6341D5949j5082q2584j1862L2114L4094N8188O514K63J8534K781J078l4519l3821
6328B1647l1256m798j7436M3179K1390L436J6238l5549k8627L1001k3443k9698
$$ plain form
6415 -60295 -8223 5072 -2462 -6735 144 16449 29563 -12872 -21674 -1415 -8465 -47266 -48203
6402 -48203 -26052 -44232 -66666 -110301 -32792 66382 28103 25606 38709 71293 53847 -10450
6390 -10450 -12244 1941 9523 -46713 -71013 -61730 -92759 -104523 -21416 19700 32970 39728 36617
6377 36617 23348 -15771 -76225 -75060 -52372 -25228 -2466 -25681 3943 16648 30951 16052
6365 16052 -78878 -100068 -33047 -25857 -66040 -53141 -85121 -81806 -90798 -41169 40294 68282
6353 68282 -6200 -55085 -28321 -21365 -2790 -21052 -47557 -1302 13960 -32643 -19628 45949
6341 45949 30867 -51717 -63579 -31465 2629 60817 67331 67594 86128 88909 89987 55468 21647
6328 21647 -9609 -14407 -31843 11336 32726 36162 52400 16851 -11776 19225 -4218 -33916
6316c3916n3403J9352M6441N0186J7823p999k9405J1966r904L1375K3676o866
6304E9326p966k9585n620k1709J709j8773L1616o113m9259l1772L7343N0311r691
6291a83m985K7210j5750p1823K4657O3687K953o6554j6753L8927l7513R050J1089
6278c5988k7575K0422k699J4016J1953l2743K4895M4555j4365j7838J2703K0547
6266A7883j5139j5366l9384m1451R495M3298L2212l1545k1898j5658R728R218
6254e8607N4895l221k0325k5458j0590j4133k4609k0391k700L9184N1024j4110
6242d9041j9280K9838p973p2549l316R1513N668N9161L5187J0020q7679o4976
6230g3427m1595L9980N7627N6023l2083n853J4851q573m232K2008k707o555l3606
$$ plain form
6316 -33916 -87319 -67967 -21526 28660 46483 38484 9079 21045 11141 42516 66192 59326
6304 59326 51360 21775 16155 -5554 -3845 -22618 8998 2885 -46374 -78146 -40803 9508 -183
6291 -183 -5168 22042 6292 -65531 -40874 22813 25766 -40788 -57541 -18614 -56127 -47077 -35988
6278 -35988 -63563 -43141 -45840 -31824 -19871 -52614 -27719 16836 2471 -15367 -2664 17883
6266 17883 2744 -12622 -52006 -93457 -83962 -40664 -8452 -39997 -61895 -77553 -67825 -58607
6254 -58607 -3712 -6933 -27258 -52716 -63306 -77439 -102048 -122439 -125139 -85955 -34931 -49041
6242 -49041 -68321 -38483 -46456 -119005 -122321 -30808 -25140 34021 69208 79228 -8451 -73427
6230 -73427 -115022 -75042 -17415 38608 6525 672 15523 6950 2718 24726 22019 15464 -18142
6217a8142J3022K6643k4458k1299O560K7280n336j5156M647K7968o186K4753M7627
6204H7923k9804p2291J7344M0899j5065m950j0392j836L3791K9943k4734o466
6192D4362m1220r400j8342l980M985n7733M2120M4064j06k5688K6997J3362k3065
6179c644j8130M5484N7942k8893j9623j4034J3572k5180J2468M536q8542o0614
6167a24658L1494J6979j7073Q162M6631P8171N2672m5756n7136k9235l6944j3732
6155i0425N4706J2276k5742k9249L4035M4857J4043R826M777N941m2556k7936
6143c5447M2084M1669m5928j3215m7278J8398J0398P193L5137j0226j2844j0255
6131b0314k4303k2505n311o552J6614Q8149l9326o1789J0489K0049p619L6973
$$ plain form
6217 -18142 -5120 21523 -2935 -24234 -17674 9606 4270 -10886 -6239 21729 15543 40296 87923
6204 87923 58119 -14172 3172 44071 29006 24056 13664 11828 45619 75562 50828 44362
6192 44362 3142 -6258 -24600 -28580 -23595 -81328 -39208 4856 4750 -20938 6059 19421 -3644
6179 -3644 -21774 23710 81652 52759 33136 19102 32674 7494 19962 24498 -64044 -124658
6167 -124658 -93164 -76185 -93258 -85096 -38465 39706 92378 46622 -10514 -39749 -76693 -90425
6155 -90425 -35719 -23443 -49185 -78434 -44399 458 14501 24327 29104 35045 -7511 -35447
6143 -35447 6637 48306 2378 -10837 -58115 -39717 -29319 -22126 13011 2785 -10059 -20314
6131 -20314 -44617 -67122 -72433 -78985 -62371 25778 -13548 -75337 -64848 -44799 -52418 -15445
6119a5445L6288k3089n6836K01K8022L5367J519p0345l4957K2961K1146l0364
6107h5532M7727N3497k8181o663j5412J2487K317j4791l662n9397o0884J5705
6095a42789l04M7716j6398J2351J2344j9810j5713O6411L9518J2336k1681l2405
6083e8424J1799M7551L4322j0712m8747j2519M8728l2538J267p618J1048J0035
6071e808j009M6712j8056j2033l9186m6886J0356j8687M0661J5452q1250j5958
6059a25692J3491j5789J5114N5613K3158J69L5031j0607M0937J3076n4744J0232
6047a1J0064O33l9695J1091N8443J3115j2869l0647j374P8788J4356n2863n7766
6034h735l1616j9059J2721K478K7998J390O249J2898R990K481k2156L7291K5790
$$ plain form
6119 -15445 20843 -2246 -59082 -58881 -30859 4508 6027 -64318 -99275 -76314 -55168 -85532
6107 -85532 -37805 15692 -12489 -19152 -34564 -22077 -19760 -34551 -38213 -97610 -158494 -142789
6095 -142789 -143093 -95377 -111775 -99424 -87080 -106890 -122603 -56192 -16674 -4338 -26019 -58424
6083 -58424 -46625 926 35248 24536 -24211 -36730 11998 -20540 -19273 -26891 -15843 -5808
6071 -5808 -6817 39895 21839 9806 -29380 -76266 -65910 -84597 -43936 -28484 -109734 -125692
6059 -125692 -112201 -127990 -112876 -57263 -34105 -33936 1095 -9512 31425 44501 -10243 -11
6047 -11 10053 10686 -29009 -17918 40525 53640 40771 10124 8750 87538 101894 49031 -8735
6034 -8735 -40351 -59410 -46689 -44211 -16213 -14823 -8574 4324 14314 16795 -5361 31930 57720
6021E7720j8893m2319R15L8156l7012L6427K6652j4032m3512k5811k6758o6268
6009a14735M7371n339m2296P410N8306j5550K1977J9208J2820N0705l9334j5352
5997a4809r282o4048n829K6996J1616J1670M9886J1427o181J8197j2859j957j919
5984A2908j1445k0326j8326k4975J2186O077k0962k5872R367K3444J2678J1965
5972c3281J7117M1696J667m7803k249O1859J5989l6778J1095L6070J3030R251
5960H7663k1213j3K8070l2319l635j4481k5280J2416j0068j8921j6333N7497L8345
5947H1728j3610k1900k3391j0159K7515R030L7307q628o7182k5677K7079J9422
5935C1534k193j2497K4158L3139l9200m6667R558r987k8744q828m3422O3883k3157
$$ plain form
6021 57720 38827 -3492 -2577 35579 -1433 34994 61646 47614 4102 -21709 -48467 -114735
6009 -114735 -67364 -72703 -114999 -107589 -49283 -64833 -42856 -23648 -10828 39877 543 -14809
5997 -14809 -24091 -88139 -93968 -66972 -55356 -43686 6200 17627 11446 29643 16784 14827 12908
5984 12908 1463 -18863 -37189 -62164 -49978 -43901 -64863 -90735 -81368 -57924 -45246 -33281
5972 -33281 -16164 25532 27199 -20604 -22853 39006 54995 18217 29312 65382 78412 87663
5960 87663 66450 66437 94507 62188 58553 44072 18792 31208 21140 2219 -14114 43383 81728
5947 81728 68118 46218 22827 12668 40183 49213 86520 77892 10710 -14967 12112 31534
5935 31534 29341 16844 41002 74141 34941 -11726 -2168 -12155 -40899 -49727 -93149 -29266 -52423
5922e2423j8265P396M4375o900K19J6033k2352j1052l2019m9286l1952n538J6874
5909a44890K1547L6459K3039N2359o92k79K8774k8486j9231J4373M285k732N3902
5896C8428M2289l1393m5787N545N2639L0188J135j0372l9563j8877P643O065j5727
5883B2213n916j4416J7818j4243M3397k7620r719l068L5525k1478L26m2725j5587
5870c5493K2268J5711q234m727N2613J0984p3428o1284o8299M3213L6690K8752
5858d1234L9416M5373J5104L1850n234m7445n4802K145M247k6807O3518j2222
5846A3909l6970J6177N378k9216N1797M8516k5853l4127P3858J1305m0251k6561
5834B7962J660j7786r8271o8255J8569K3456J9470M6786m8553Q346J9541l72L0097
$$ plain form
5922 -52423 -70688 -63292 -18917 -25817 -25598 -9565 -31917 -42969 -74988 -124274 -156226 -161764 -144890
5909 -144890 -123343 -86884 -63845 -11486 -12178 -12457 16317 -12169 -31400 -17027 -12742 -15474 38428
5896 38428 80717 49324 3537 9082 61721 91909 93044 82672 43109 24232 31875 37940 22213
5883 22213 16297 1881 19699 5456 48853 21233 11514 8446 43971 22493 22819 -19906 -35493
5870 -35493 -13225 2486 -5748 -10475 42138 53122 -20306 -81590 -149889 -106676 -69986 -41234
5858 -41234 -1818 43555 58659 90509 85275 37830 -16972 -14827 -10580 -37387 26131 13909
5846 13909 -23061 -6884 -1506 -30722 21075 69591 43738 9611 83469 94774 54523 27962
5834 27962 29622 11836 -86435 -154690 -136121 -112665 -93195 -46409 -94962 -86616 -67075 -67447 -37350
5821c7350K2915j5661N024J2589m003M7335j4358l2782m8367n2388j0631l827
5809a31504L1657Q1366L7502n695k4659J836N3593O63n9656l2213K8888K1135
5797B913M978j8010p889o4201M3904O335r8275O5451Q1351j1042l3586j692m0315
5784g0078l4668L7775M8990k7947J7805N0821j7087o884m458j9530L2959p607
5772I1J932K5481l9363k2072j7776P148Q077O827k2913o474j2236M0516J6132
5759a4630K3668J601n147J8974m4099n0969K0798L1858j1136j9974J8670K0754
5747i632l1974J6087l1618P593M7817R931R90R279k1855L5160L6188O033p0839
5734C160n4431M4138K3587r332J3416K083J9356k4534J5781M7774l7635r6098
$$ plain form
5821 -37350 -14435 -30096 -25072 -12483 -16486 30849 16491 -16291 -64658 -117046 -127677 -131504
5809 -131504 -99847 -18481 19021 13326 -11333 -9497 44096 44759 -14897 -47110 -18222 2913
5797 2913 7891 -10119 -18008 -82209 -38305 -31970 -130245 -64794 16557 5515 -28071 -29763 -70078
5784 -70078 -104746 -66971 -17981 -45928 -28123 22698 5611 -1273 -5731 -25261 7698 91
5772 91 2023 27504 -11859 -33931 -51707 -44559 -36482 -29655 -52568 -59042 -71278 -30762 -14630
5759 -14630 9038 10639 5492 24466 -19633 -70602 -49804 -17946 -29082 -49056 -30386 -9632
5747 -9632 -41606 -25519 -57137 -49544 -1727 8204 9194 18473 -3382 31778 67966 73999 3160
5734 3160 -51271 -7133 16454 7122 20538 22621 41977 17443 33224 80998 43363 -52735
5722e2735L1719p385L4900P488k840J0419k3262k4839j9115L2759M9274P191q364
5709C5210P500K2386Q180J0759p694L5325m6627k6701n8861O426k6883J2238L6496
5696G754K0637J553j9233P0454L419m0552n650L2440m1309n1668J9861N5332o1785
5683h747j7443K2090L1361J5095M361k135n0829L3602M445L633K995p1543m6792
5670g9907Q742M1925K0760j6056k9401K145j0107K3389O049p08P897o085n0627
5657h1984O464J8257N1053o812k2233p932O794N2584K689n8673k5668N1197N5416
5644D1152j4103k2954J0m6980k7369j2238M1300j7733r688O0434K9467j9764k8776
5631b7242k6706j0601J1155k0877o722Q4378K1136L748l824k4737M915k3062m0633
$$ plain form
5722 -52735 -21016 -28401 6499 13987 11147 21566 -1696 -26535 -45650 -12891 36383 43574 35210
5709 35210 42710 65096 73276 84035 76341 111666 65039 38338 -20523 -14097 -40980 -28742 7754
5696 7754 28391 29944 10711 81165 84584 44032 38382 70822 29513 -22155 -2294 53038 -8747
5683 -8747 -26190 -4100 27261 42356 46717 44582 -6247 27355 31800 35433 38428 -33115 -79907
5670 -79907 -71165 -29240 -8480 -24536 -53937 -51792 -61899 -38510 -32461 -33169 -25272 -31357 -81984
5657 -81984 -75520 -57263 -6210 -13022 -35255 -43187 -36393 16191 18880 -39793 -65461 -14264 41152
5644 41152 27049 4095 4105 -42875 -70244 -82482 -41182 -58915 -68603 -8169 21298 1534 -27242
5631 -27242 -53948 -64549 -53394 -74271 -80993 3385 24521 28269 24445 -292 4623 -18439 -59072
5618e9072j8268K9807O0651k256l070l2842M628p032K4330j2335L4224K3012J3033
5605E4810k0666p0508r821K4338L0625L775o6461L895q001l4214N7634R0878j3254
5592D3030k6990m1736M9511N030Q498K4807J0194j4387k3201o604q209n5715j375
5579c7147K8037L6974N5248J6556J2780k8096o6005m2227M2294N8932p7525o4175
5567f4354j3301L6222M0877K6591o3005k2745j4717j3549K0254O9522P7382j2595
5555F6582m9940m5719J8605r468o956L352K995j851J7699N85j6813k7291K6580
5542b1640K3698m0800k6498k0231p749L2880K456J338j4223J5699K6620j393K6559
5529c284J5435L9061K9890n3638l9360O23m017j6688K1749j7927j3011L5361L0644
$$ plain form
5618 -59072 -77340 -47533 13118 10862 7792 -25050 -20422 -27454 -3124 -15459 18765 41777 54810
5605 54810 34144 -36364 -46185 -21847 8778 12553 -53908 -50013 -58014 -92228 -34594 56284 43030
5592 43030 16040 -25696 23815 28845 37343 62150 72344 57957 34756 28152 19943 -35772 -37147
5579 -37147 -9110 27864 83112 99668 112448 84352 18347 -23880 18414 77346 -179 -64354
5567 -64354 -77655 -41433 -556 26035 -36970 -59715 -74432 -87981 -67727 1795 79177 66582
5555 66582 16642 -29077 -10472 -19940 -26896 -23544 -20549 -22400 -4701 -4116 -20929 -48220 -21640
5542 -21640 2058 -38742 -65240 -85471 -93220 -60340 -57884 -56546 -70769 -55070 -28450 -29843 -3284
5529 -3284 12151 51212 81102 27464 -11896 -11273 -15290 -31978 -10229 -28156 -41167 -5806 24838
5516B4838l3668l5148j0756R549M9086M4065K4102o2720O434r91q546J8874k7719
5503b600l5392j761K4333M4459r266l0498P222K4616L2559J2340l5723m7498j1752
5490b8961Q4180M214l2081k6437l7023J7103L6642l500J1367K5497l9469J6303
5478B7835N3127l2952l1547N445L7213j7098N810O257p424o5854k6577P012J1926
5465b6827R3870O1585j8435o4084k1158K5162k9455n614j6781n4986m239O1861
5453H99O4119k080n4749k3455J1536J4785P0360n89J7778j4764j6477l1985K9165
5440F4543J5640q3612k7915M3084l3476k4259j2345n9878Q632K4717M8313N955
5428c0601k6525j6105l3402O3112P4937l8900k7160k2377M8434L9817j0746l2985
$$ plain form
5516 24838 -8830 -43978 -54734 -45185 3901 47966 72068 9348 15782 14791 6245 25119 -2600
5503 -2600 -37992 -39753 -15420 29039 19773 -10725 -3503 21113 53672 66012 30289 -17209 -28961
5490 -28961 55219 59433 27352 915 -36108 -19005 17637 14137 25504 51001 11532 27835
5478 27835 80962 48010 16463 21908 59121 42023 47833 54090 46666 -19188 -45765 -38753 -26827
5465 -26827 67043 128628 110193 46109 24951 50113 20658 15044 -1737 -56723 -60962 899
5453 899 65018 62938 8189 -15266 -3730 11055 81415 80826 98604 83840 67363 35378 64543
5440 64543 80183 -3429 -31344 11740 -21736 -45995 -58340 -118218 -109586 -84869 -36556 -30601
5428 -30601 -57126 -73231 -106633 -43521 31416 -7484 -34644 -57021 -8587 31230 20484 -12501
5416a2501m684M5560P3025k3036n3690l1569p052k2372k1658N5310L697M619j5680
5403a0031k5517N93P525J1075N797r230l5191L9236n56k651j1362n273N7605J4719
5389C6739n518N373M615j2006l6121L4318J6437k5002m6353k5154J2042J7135
5377b3495J6031o071l857L1949k662j5415k9915J6964q85N1305K2286j6630J5496
5364E5101j0432R583J2000n1876j4840j6165l7461K0238J2896J274N767J4582
5352F67l149m5668J5530L0114Q343n4333k2870p2214j6330Q2853P2379L3496K0506
5339D9324l5846j7857K5832R997j2574n7606K3061q443r2l338M225N7469J7676
5326E1828l6398k4988J5477m0430l2912L8473K614k7387k6912l109l0179M9835
$$ plain form
5416 -12501 -17185 28375 101400 78364 24674 -6895 -13947 -36319 -57977 -2667 1030 5649 -10031
5403 -10031 -35548 -34955 -27430 -16355 -10558 -19788 -54979 -15743 -16299 -18950 -30312 -35585 22020 36739
5389 36739 31221 36594 41209 29203 -6918 27400 43837 18835 -27518 -52672 -40630 -23495
5377 -23495 -7464 -13535 -17392 14557 11895 -3520 -33435 -16471 -17356 33949 56235 39605 55101
5364 55101 44669 54252 66252 14376 -464 -16629 -54090 -33852 -20956 -19682 -13915 667
5352 667 -2482 -48150 -32620 -2506 5837 -48496 -71366 -143580 -159910 -77057 -4678 28818 49324
5339 49324 13478 -4379 21453 31450 18876 -38730 -15669 -24112 -24204 -27542 -23317 34152 51828
5326 51828 15430 -9558 5919 -34511 -67423 -28950 -26336 -53723 -80635 -83744 -113923 -64088
5314f4088J0940J698K0107M2870j7325m6475K0083j7373L130K5859O726K8423
5302A4575m1833n7099J7140J3400j9398k5066K6351k7309J0410N4271M8398Q566
5290B2406n5070L29p615j3426L7388M1940J7913k1042p4493J3798n0141J8000
5278g0013L8886J2004M0502k696K8021J4561m0658n1682o187k4180QL2423k8925
5265e7936K1881K2205N297k9286J1548J3365l7341M8063L2769o305P142k8960
5253B442n264J7970j9291n8874L2881N6530k8118K8641N2372k4381l2074m5006
5241b2172l350K3414L8561J018N8195j2268m9709j1431J8325m1235p3025J3388
5229f0289j0103l6718N0844J1105J3250L4420m232p380k6603K2590K2998M0798
$$ plain form
5314 -64088 -53148 -51450 -31343 11527 -5798 -52273 -32190 -49563 -46433 -20574 -13848 14575
5302 14575 -27258 -84357 -67217 -53817 -73215 -98281 -71930 -99239 -88829 -34558 13840 22406
5290 22406 -32664 -32335 -39950 -53376 -15988 25952 43865 22823 -51670 -37872 -88013 -70013
5278 -70013 -31127 -19123 21379 18683 46704 61265 20607 -31075 -37262 -61442 -61434 -29011 -57936
5265 -57936 -36055 -13850 -8553 -37839 -26291 -12926 -50267 -2204 30565 24260 31402 2442
5253 2442 -2822 15148 -4143 -63017 -30136 26394 -1724 26917 79289 54908 22834 -22172
5241 -22172 -25522 -2108 36453 37471 95666 83398 33689 22258 40583 -652 -73677 -60289
5229 -60289 -70392 -107110 -56266 -45161 -31911 2509 -1723 -9103 -35706 -13116 9882 50680
5217E0680J5552k1221j2406j3463L4761M515j8160J9145J2172k0128m4195p063
5205A89J8700m1098M8292K7081m4852m1426O2657Q288l2776p082q943l1459k1933
5192f4362J4060Q6315L370k4591n5488q830l234j8785K3569N9423j0189m784j0141
5179a3667L9754L8718j3141m6303j0570K1270q348m2868l7794L5548K0410M843
5167a2148k6076j1622l5821K782K2529J1708m0186j2861j0624N6705k7281K7118
5155e5777N8598l0512m0088P832N9717J9274l1107k275m613k9501N4974L534J0949
5142B1005l580p3968K6427L2520K6486Q111o3194l3854K1920J1482n804J9779
5130a2670l1851O0872q953k0896n0032k0970L3371M6366L599k1833J9409K8771
$$ plain form
5217 50680 66232 45011 32605 19142 53903 58418 40258 59403 71575 51447 7252 189
5205 189 18889 -22209 26083 53164 8312 -33114 29543 37831 5055 -2027 -10970 -42429 -64362
5192 -64362 -50302 36013 39383 14792 -40696 -49526 -52760 -71545 -47976 11447 1258 -3526 -13667
5179 -13667 26087 64805 51664 5361 -5209 16061 7713 -35155 -72949 -37401 -16991 -12148
5167 -12148 -38224 -49846 -85667 -82885 -60356 -48648 -88834 -101695 -112319 -55614 -82895 -55777
5155 -55777 2821 -27691 -67779 -59947 -230 19044 -12063 -14338 -18951 -48452 6522 10056 21005
5142 21005 17425 -56543 -30116 2404 28890 37001 -26193 -60047 -38127 -26645 -32449 -12670
5130 -12670 -44521 16351 7398 -13498 -63530 -84500 -51129 -4763 -1164 -22997 -3588 25183
5118B5183M7675M1464N585p5564l6078k7653n1966r625o670L5729N0480j438J1063
5105H185J3958J4544m1874k2154k5460k6869L9585K4699O870k8464J6363j4361
5093c4978K6892k6474K890j8438n2743m114N4363L9805j2710p274j8920j8365
5081g0066N2139M4083K8135l079o3454k9471j6304P368K8913j0417J8809N4437
5069D1093O3845k5710p4260n0152j5707M447r647L1716K7720J8974N6324J6646
5057H5289l8006k8748l0863%l8103K3072L5634m153l7456m1349M4419M4594k213
5044A2117K9888l3246k804k3059n5919r753M7893m7522j4723k868L0079L3564
5032c6353m5668j7226M451k5207L2278J4906L2795Q565K8569q227j6503K2349
$$ plain form
5118 25183 72858 114322 119907 44343 8265 -19388 -71354 -80979 -87649 -51920 -1440 -2878 8185
5105 8185 22143 36687 -5187 -27341 -52801 -79670 -40085 -15386 -8516 -36980 -20617 -34978
5093 -34978 -8086 -34560 -31670 -50108 -102851 -106965 -52602 -12797 -25507 -32781 -51701 -70066
5081 -70066 -17927 26156 54291 51212 -12242 -41713 -58017 -50649 -21736 -32153 -13344 41093
5069 41093 104938 79228 4968 -45184 -60891 -56444 -66091 -34375 -6655 12319 68643 85289
5057 85289 47283 18535 -12328 -12328 -50431 -27359 8275 4122 -33334 -74683 -30264 14330 12117
5044 12117 42005 8759 5955 -17104 -73023 -82776 -34883 -82405 -97128 -99996 -69917 -36353
5032 -36353 -82021 -99247 -94796 -120003 -87725 -72819 -40024 -31459 -2890 -11117 -27620 -5271
5020e271M2527N125j0844o6666l7072J2231O8392M9701O914J9941Q465o039j1414
5007G5990k5502n2373l548M4383q056r852m4127j6475L835N9971L8501L0634j468
4994I1913o1733l5836N3061J3752o6198k1516j6406o711M0823Q2618M4099p8300
4982C9566p4136k5229N1865N615J0582L6975O235m0948K96q822j9340Q009J6957
4969G625j9701M62p26O930J3234O822j1257N3200o192l1019J4169o2475k7507
4956e6435p558R936O1625r531p3043l0801L2600J9439R774O9220j9407K439j1194
4943b936J5291k846j7610j639L8937N5967n3954l2353j5265j9604n807m8148k509
4930i2476L6532L7523k9638N6157Q3313L133l3700l8647K1443P37k1182k5935
$$ plain form
5020 -5271 37256 42381 31537 -35129 -72201 -59970 8422 58123 65037 84978 93443 87404 75990
5007 75990 50488 -1885 -5433 38950 30894 21042 -23085 -39560 -35725 24246 62747 93381 91913
4994 91913 30180 -5656 47405 61157 -5041 -26557 -42963 -49674 -8851 73767 117866 39566
4982 39566 -34570 -59799 -7934 -2319 8263 45238 51473 10525 10821 1999 -17341 -9332 7625
4969 7625 -12076 -11614 -12340 -5410 7824 14646 3389 56589 50397 19378 33547 -28928 -56435
4956 -56435 -63993 -54057 7568 -1963 -75006 -105807 -73207 -53768 -43994 25226 5819 8258 -2936
4943 -2936 12355 9509 -8101 -9740 29197 85164 31210 -1143 -16408 -36012 -41819 -89967 -92476
4930 -92476 -55944 -18421 -48059 8098 91411 94544 60844 22197 43640 44377 23195 -2740
4918b740k7560l6463L1293j8416R264N7361J9958j3237O405o309j3007Q406o507
4905H448J874l0753J3078N5806k479p1144j1776m2044N4400L2127K7472j6401
4893A8608L1205m5564K2960m2459k5900m401R41P9136j441k8703P561N7961O950
4880G6854J85k4235j4313J2102J8341l503o3459m860q271m1600O381O9883N1267
4867G4772l1152k1738K04N620k1175k0117p1081n9833L5054P8051N0419K7329
4855D6353L087m0924r048l6272l710K1118j5335q236J3967M677L1504r9488m5997
4842a38304L7776O451K2981N7331P417j1139j4447j4098m3424K7748N3373k4425
4830c2760Q614J4334o00K5930l9147J26k908K8129M1502K4684l0615R962J5643
$$ plain form
4918 -2740 -30300 -66763 -35470 -53886 -44622 12739 32697 19460 25865 19556 6549 14955 8448
4905 8448 10322 -20431 -7353 48453 45974 -25170 -36946 -78990 -24590 7537 35009 18608
4893 18608 49813 4249 27209 -15250 -41150 -45551 -44610 34526 33085 4382 11943 69904 76854
4880 76854 77039 52804 38491 50593 68934 65431 1972 -2888 -11159 -52759 -46378 23505 74772
4867 74772 43620 21882 22086 27706 6531 -13586 -84667 -144500 -109446 -31395 19024 46353
4855 46353 49440 8516 -532 -36804 -40514 -19396 -34731 -42967 -29000 -24323 7181 -92307 -138304
4842 -138304 -100528 -94077 -71096 -13765 -6348 -17487 -31934 -46032 -89456 -61708 -8335 -32760
4830 -32760 -24146 -9812 -10412 15518 -23629 -23503 -26411 1718 43220 67904 37289 47251 62894
4817F2894k0854r721m6944j4763K5234k744L0531K4856q2084J165J0808j6793
4805c8415J3153k0426o300K1578K6358m4620K101L9043l971K8483K4967J3595
4793E5546l5693J4411J2308M0509K574n3257n1943n8303L4855N0998L4329m8220
4781a886j3579J2149j5827Q714N0220J5385L6486j5350j9115P788j6186j5317
4769C3482J6988l8478m3699L9945O0472j1039q8745k1673K4046m794N580P429
4757b0486o6449j0906N7472N5708R713m2363j7770J3368j1441j0165q892J2305
4745c9906K2579o304j8427K4348j5873O554O7228m061l6877k5318l5267m1490
4733a02814P399L1253K5000K7070k8426n0074M3659K1057J3606J0892l442Q949
$$ plain form
4817 62894 42040 32319 -14625 -29388 -4154 -6898 23633 48489 -33595 -32430 -21622 -38415
4805 -38415 -25262 -45688 -51988 -30410 -4052 -48672 -46571 -7528 -11499 16984 41951 55546
4793 55546 19853 34264 46572 87081 89655 36398 -15545 -73848 -38993 12005 46334 -1886
4781 -1886 -15465 -3316 -19143 -10429 39791 55176 91662 76312 57197 64985 48799 33482
4769 33482 50470 11992 -31707 8238 68710 57671 -31074 -52747 -28701 -33495 -27915 -20486
4757 -20486 -86935 -97841 -40369 15339 25052 -17311 -35081 -21713 -33154 -43319 -52211 -39906
4745 -39906 -17327 -23631 -42058 -17710 -33583 -27029 40199 36138 -739 -26057 -61324 -102814
4733 -102814 -95415 -64162 -39162 -12092 -40518 -90592 -46933 -25876 -12270 -1378 -4820 4129
4721D129N1921j6883m8405m2045N0061L8795o8531l8927L9886M3303m0179j763
4709b8638J054L5067Q6752K164r6715l6455l1388k9089N8119N6599P702J2393
4697C7565k9859o012q328k7007j1010k1402k6500k1000k7952P023J6449Q6249
4685c1784o921L872N7158j4002k0541J9741P889K5440j3571m3195k353M2238K0999
4672D4970j3868k1541j8610m8775L8276P0553K2488m4261j1044K9431r796m7842
4660a0019L3917j3736k1048L3190j9141j7652j0147P840q84L8035J6317m9606
4648a2934j6541j4626j903l2273L9015O5241K4190K1033l6422L3989j056n9182
4636H531p0442k0793K5333J6248j6661J138o905j8205k5131j4725l587J4513J180
$$ plain form
4721 4129 56050 39167 -9238 -51283 -1222 37573 -30958 -69885 -29999 13304 -26875 -28638
4709 -28638 -27584 7483 94235 96399 -316 -36771 -68159 -97248 -39129 17470 25172 37565
4697 37565 7706 1694 -6634 -33641 -44651 -66053 -92553 -113553 -141505 -134482 -118033 -31784
4685 -31784 -38705 -34833 22325 8323 -12218 7523 15412 40852 27281 -15914 -18267 23971 44970
4672 44970 31102 9561 -9049 -57824 -19548 51005 73493 29232 18188 47619 37823 -10019
4660 -10019 23898 10162 -10886 22304 3163 -14489 -24636 -16796 -17680 20355 36672 -12934
4648 -12934 -29475 -44101 -46004 -78277 -39262 25979 50169 71202 34780 68769 67713 8531
4636 8531 -61911 -82704 -57371 -41123 -57784 -56646 -63551 -81756 -106887 -121612 -125199 -110686 -109506
4623a09506N4437l723o889J1439K7526L2968j1292Q932J4441J4703K1337K2800
4611G7173o3853p1184L2067K1332K1285j0973j8582K869m1072p578o016K8145
4599c6387R167J7191r945j6565K4465n5822l743L8278K0374Q769K4753m589K7044
4586D2990l1976j5237L4342R844k6473p499R577j4912n9784J6818L4246m1418
4574d9482m1538k7392L677K7275K6835N437K3812J0198j2756j1077O635J6585
4562b1791J2424n411M3099L3832R736k8063M430M4655k2807l5701J6553q129O763
$$ plain form
4623 -109506 -55069 -58792 -65681 -54242 -26716 6252 -5040 3892 18333 33036 54373 77173
4611 77173 13320 -57864 -25797 -4465 16820 5847 -12735 -9866 -50938 -58516 -64532 -36387
4599 -36387 -27220 -10029 -19974 -36539 -12074 -67896 -71639 -33361 -12987 -4218 20535 15946 42990
4586 42990 11014 -4223 30119 39963 13490 5991 15568 656 -59128 -42310 -8064 -49482
4574 -49482 -91020 -118412 -114735 -87460 -60625 -55188 -31376 -21178 -33934 -45011 -38376 -21791
4562 -21791 -9367 -14778 28321 62153 71889 43826 48256 92911 70104 34403 50956 42827 49590
$$ [...]
##END NTUPLES=NMR SPECTRUM
##END=
