##TITLE=Analysis number 328371
Compound Code cc 67103
Project Code adrs
Chemist Name fudan
##JCAMPDX= 6.0         $$ Bruker NMR JCAMP-DX V2.0
##DATA TYPE= NMR SPECTRUM
##DATA CLASS= NTUPLES
##ORIGIN= Bruker BioSpin GmbH
##OWNER= nmr
$$ XWIN-NMR		Version 3.5
$$ Wed May 30 12:46:59 2007 GMT Daylight Time (UT+1h)  MAYBRIDGE\nmr@NMR_250MHZ
##.OBSERVE FREQUENCY= 250.131544655141
##.OBSERVE NUCLEUS= ^1H
##.ACQUISITION MODE= SIMULTANEOUS (DQD)
##.ACQUISITION SCHEME= undefined
##.AVERAGES= 16
##.DIGITISER RES= 18
##SPECTROMETER/DATA SYSTEM= dpx250
##.PULSE SEQUENCE= zg30
##.SOLVENT NAME= CDCl3
##.SHIFT REFERENCE= (INTERNAL, CDCl3, 0, 16.4545)
##AUDIT TRAIL= $$ (NUMBER, WHEN, WHO, WHERE, WHAT)
$$ ##TITLE= Audit trail, XWIN-NMR		Version 3.5
$$ ##JCAMPDX= 5.01
$$ ##ORIGIN= Bruker BioSpin GmbH
$$ ##OWNER= nmr
$$ C:\u/data/dgb/nmr/ADRS/1700/pdata/1/auditp.txt
$$ ##AUDIT TRAIL=  $$ (NUMBER, WHEN, WHO, WHERE, WHAT)
(   1,<2007-05-30 12:46:36.57 +100>,<MAYBRIDGE\nmr>,<NMR_250MHZ>,
      <created by zg, POWCHK disabled, PULCHK disabled
       configuration hash MD5:
       76 6E 9A 78 1E 09 19 81 EC 84 63 8F B0 6A 59 2D
       data hash MD5: 64K
       E6 D8 5B 87 F7 BC 85 C9 B3 98 7A A1 21 AF 60 00>)
(   2,<2007-05-30 12:46:50.60 +100>,<MAYBRIDGE\nmr>,<NMR_250MHZ>,
      <Start of raw data processing
       ef LB = 0.3 FT_mod = 6 PKNL = 1 SI = 32K 
       data hash MD5: 32K
       47 9D AC FF E0 03 61 69 06 D6 39 A1 9F 8A DC C6>)
(   3,<2007-05-30 12:46:52.39 +100>,<MAYBRIDGE\nmr>,<NMR_250MHZ>,
      <apk 
       data hash MD5: 32K
       48 AA 1D 31 2B 8D 2D FA 1A C7 84 97 47 3A 01 24>)
(   4,<2007-05-30 12:46:53.07 +100>,<MAYBRIDGE\nmr>,<NMR_250MHZ>,
      <abs ABSG = 5 
       data hash MD5: 32K
       9E F7 7F EA 41 ED C2 85 2F 90 6B 70 48 88 45 19>)
$$ ##END=
$$ 
$$ hash MD5
$$ 3F 10 19 3E 44 F0 7A E4 30 C6 31 9D FB 7F D5 67
##$RELAX= 
##$RELAX= 
##$RELAX= 
##$RELAX= 
##$RELAX= 
##$RELAX= 
##$RELAX= 
$$ Bruker specific parameters
$$ --------------------------
##$DU= <C:\u>
##$EXPNO= 1700
##$NAME= <ADRS>
##$PROCNO= 1
##$TYPE= <nmr>
##$USER= <dgb>
##$AMP= (0..31)
100 100 100 100 100 100 100 100 100 100 100 100 100 100 100 100 100 100 
100 100 100 100 100 100 100 100 100 100 100 100 100 100 
##$AQSEQ= 0
##$AQ_mod= 3
##$AUNM= <au_zg>
##$AUTOPOS= <15 >
##$BF1= 250.13
##$BF2= 250.13
##$BF3= 250.13
##$BF4= 250.13
##$BF5= 500.13
##$BF6= 500.13
##$BF7= 500.13
##$BF8= 500.13
##$BYTORDA= 1
##$CFDGTYP= 0
##$CFRGTYP= 5
##$CHEMSTR= <none>
##$CNST= (0..31)
1 1 145 1 1 1 1 1 1 1 1 1 1 1 1 1 1 1 1 1 1 1 1 1 1 1 1 1 1 1 1 1 
##$CPDPRG= <>
##$CPDPRG1= <>
##$CPDPRG2= <>
##$CPDPRG3= <>
##$CPDPRG4= <mlev>
##$CPDPRG5= <mlev>
##$CPDPRG6= <mlev>
##$CPDPRG7= <mlev>
##$CPDPRG8= <mlev>
##$CPDPRGB= <>
##$CPDPRGT= <>
##$D= (0..31)
0 1 0 0 0 0 0 0 0 0.06 0 0 0 0 0 0 0.0002 0 0 0 0 0 0 0 0 0 0 0 0 0 0 
0 
##$DATE= 1180525595
##$DBL= (0..7)
120 120 120 120 120 120 120 120 
##$DBP= (0..7)
150 150 150 150 150 150 150 150 
##$DBP07= 0
##$DBPNAM0= <>
##$DBPNAM1= <>
##$DBPNAM2= <>
$$ [...]
##$SUBNAM7= <"">
##$SUBNAM8= <"">
##$SUBNAM9= <"">
##$SW= 20.6930455092707
##$SWIBOX= (0..15)
0 0 3 0 0 0 0 0 0 0 0 0 0 0 0 0 
##$SW_h= 5175.983436853
##$TD= 65536
##$TD0= 1
##$TE= 683.16
##$TE2= 300
##$TE3= 300
##$TEG= 300
##$TL= (0..7)
0 120 120 120 120 120 120 120 
##$TP= (0..7)
150 150 150 150 150 150 150 150 
##$TP07= 0
##$TPNAME0= <>
##$TPNAME1= <>
##$TPNAME2= <>
##$TPNAME3= <>
##$TPNAME4= <>
##$TPNAME5= <>
##$TPNAME6= <>
##$TPNAME7= <>
##$TPOAL= (0..7)
0.5 0.5 0.5 0.5 0.5 0.5 0.5 0.5 
##$TPOFFS= (0..7)
0 0 0 0 0 0 0 0 
##$TUNHIN= 0
##$TUNHOUT= 0
##$TUNXOUT= 0
##$USERA1= <user>
##$USERA2= <user>
##$USERA3= <user>
##$USERA4= <user>
##$USERA5= <user>
##$V9= 5
##$VALIST= <valist>
##$VCLIST= <CCCCCCCCCCCCCCC>
##$VD= 0
##$VDLIST= <DDDDDDDDDDDDDDD>
##$VPLIST= <PPPPPPPPPPPPPPP>
##$VTLIST= <TTTTTTTTTTTTTTT>
##$WBST= 1024
##$WBSW= 4
##$XGAIN= (0..3)
0 0 0 0 
##$XL= 0
##$YL= 0
##$YMAX_a= 343446
##$YMIN_a= -263852
##$ZGOPTNS= <>
##$ZL1= 120
##$ZL2= 120
##$ZL3= 120
##$ZL4= 120
##$ABSF1= 16.45448
##$ABSF2= -4.238693
##$ABSG= 5
##$ABSL= 3
##$ALPHA= 0
##$AQORDER= 0
##$ASSFAC= 0
##$ASSFACI= 0
##$ASSFACX= 0
##$ASSWID= 0
##$AUNMP= <proc_1d>
##$AZFE= 0.1
##$AZFW= 0.1
##$BCFW= 0
##$BC_mod= 0
##$BYTORDP= 0
##$COROFFS= 0
##$CY= 12.5
##$DATMOD= 1
##$DC= 0
##$DFILT= <>
##$DTYPP= 0
##$F1P= 14.0000005364418
##$F2P= -0.99999901652339
##$FCOR= 0.5
##$FTSIZE= 32768
##$FT_mod= 6
##$GAMMA= 0
##$GB= 0
##$INTBC= 1
##$INTSCL= 1
##$ISEN= 128
##$LB= 0.3
##$LEV0= 0
##$LPBIN= 0
##$MAXI= 10000
##$MC2= 0
##$MEAN= 0
##$ME_mod= 0
##$MI= 0
##$NCOEF= 0
##$NC_proc= -4
##$NLEV= 6
##$NOISF1= 0
##$NOISF2= 0
##$NSP= 0
##$NTH_PI= 0
##$NZP= 0
##$OFFSET= 16.45448
##$PC= 1
##$PHC0= -55.31313
##$PHC1= 10.72552
##$PH_mod= 1
##$PKNL= yes
##$PPARMOD= 0
##$PSCAL= 4
##$PSIGN= 0
##$REVERSE= no
##$SF= 250.13001688864
##$SI= 32768
##$SIGF1= 0
##$SIGF2= 0
##$SINO= 400
##$SIOLD= 32768
##$SREGLST= <1H.CDCl3>
##$SSB= 0
##$STSI= 32768
##$STSR= 0
##$SW_p= 5175.98343685301
##$SYMM= 0
##$S_DEV= 0
##$TDeff= 65536
##$TDoff= 0
##$TI= <Analysis number 999999
Compound Code 99
Book Reference 9
Project Code 9>
##$TILT= no
##$TM1= 0
##$TM2= 0
##$TOPLEV= 0
##$USERP1= <user>
##$USERP2= <user>
##$USERP3= <user>
##$USERP4= <user>
##$USERP5= <user>
##$WDW= 1
##$XDIM= 32768
##$YMAX_p= 361049874
##$YMIN_p= -216036
$$ End of Bruker specific parameters
$$ ---------------------------------
##NTUPLES= NMR SPECTRUM
##VAR_NAME=  FREQUENCY,     SPECTRUM/REAL,   SPECTRUM/IMAG
##SYMBOL=    X,             R,               I
##VAR_TYPE=  INDEPENDENT,   DEPENDENT,       DEPENDENT
##VAR_FORM=  AFFN,          ASDF,            ASDF
##VAR_DIM=   32768,         32768,           32768
##UNITS=     HZ,            ARBITRARY UNITS, ARBITRARY UNITS
##FACTOR=    0.157963299565203, 1,           1
##FIRST=     4115.75916457438, 0,            0
##LAST=      -1060.22427227863, 0,           0
##MIN=       -1060.22427227863, -216036,     0
##MAX=       4115.75916457438, 361049874,    0
$$ Real data points
##PAGE= N=1
##DATA TABLE= (X++(R..R)), XYDATA
$$ [...]
25603E876r88L2142l9292J4942N3343l3705o9646m9052J1700J637l9559m3014
25591a55616R438J15284N6373j7805m6831J9538K3295j2488K9875k243K1619M5987
25579H6426O376l7273n7544o228o059K7418j0861r346L779j7605P4596N313j01123
25566d2131l0029J7151n710k3450l2681M7278L6997L8675m5207k8764L2920P0961
25554C6010M7720n5278l1714L528K3540J375L1741k7349m6559M5233J875n380
25542B4742M988K436J553m4987n0737j2739J0857L5508K3983k1025N1533J7808
25530D3920k9074j7233J6191o4912J5126P821k977n5945k5100L5965P669L5699
25518c2850L2098J3504K1371R456l510J2060M7988M0550J578j9111l3379k323
$$ plain form
25603 5876 4888 37030 -2262 12680 66023 32318 -37328 -86380 -74680 -73043 -112602 -155616
25591 -155616 -146178 -30894 25479 7674 -39157 -19619 3676 -8812 21063 18820 40439 86426
25579 86426 92802 55529 -2015 -8243 -14302 13116 2255 -7091 -3312 -20917 53679 58992 -42131
25566 -42131 -72160 -55009 -60719 -84169 -116850 -69572 -32575 6100 -39107 -67871 -34951 36010
25554 36010 83730 28452 -3262 266 23806 25181 56922 29573 -16986 28247 30122 24742
25542 24742 29730 32166 33719 -11268 -62005 -74744 -63887 -28379 -4396 -25421 26112 43920
25530 43920 14846 -2387 13804 -51108 -35982 -28161 -31138 -87083 -112183 -76218 -68549 -32850
25518 -32850 -752 12752 34123 43579 40069 52129 100117 140667 142245 123134 89755 87432
25506H7432o2738n2813m2828K6106Q1187M8531l0941m5358J9821J8546k617O013
25494E0341j2485j8249r86K596N4125l934l3036k8603j8417J7749K4738J9487
25482E3326K27p881m6175L8064M1250K0999l4879l6628j3001K9018k9748o5499
25470e0927j5176K9434j3149R6923M5843K8233j5688l8929P048l2502N918r959
25458C7069J4301r713J1743N7631n5591o4379k6097j4918j1240M8383m9153o991
25446f8955l8640l0096L7636J8614k158N1270N6319m282J4506N735M684k1888
25434B2745l0529m3987j6233K8139L9552k9207R41K7418M840K8918k1070n141
25422F386M464n0406J9726K9199j2625M2071j046J2308o68O380l7147m0346l0534
$$ plain form
25506 87432 24694 -28119 -70947 -44841 36346 84877 53936 8578 28399 46945 44328 50341
25494 50341 37856 19607 18621 21217 75342 71408 38372 9769 -8648 9101 33839 53326
25482 53326 53553 45672 -503 37561 78811 99810 64931 28303 15302 44320 14572 -50927
25470 -50927 -66103 -36669 -49818 47105 92948 121181 105493 66564 73612 41110 47028 37069
25458 37069 51370 41657 53400 111031 55440 -8939 -35036 -49954 -61194 -12811 -61964 -68955
25446 -68955 -107595 -137691 -100055 -81441 -83599 -32329 23990 19708 34214 39949 44633 22745
25434 22745 -7784 -51771 -68004 -39865 -313 -29520 -28579 -1161 3679 32597 11527 6386
25422 6386 10850 -39556 -19830 9369 -3256 38815 37769 50077 49409 55789 18642 -21704 -52238
25409e2238K801L3116J0069m2666k0720J6717M5492M3301J4420j9576k4385r7620
25397i1289q958M0520K784M5428J4989k3516K7080k1756o1973k2637O2794j723
25385c8257k5096l4996K1559O2373J2776l43L1703q535n8087J9703M3954k9487
25373b733m1514P298N0181L626m7584q2998l6872L1828k5435L5042P8530O014
25361b4617k2017l4523M1747L1819K4309J3283J9813O998l6800j7914j0149L1593
25349B3542P7061o3154r4778m453M8060J6678l5587L6771J0620l044M2572L4839
25337H9127R016L4669n729n2756n2781l6594J2508J2388l2262j3386Q0k5139L6361
25324b4498M6138l5962q217K9182K7783o5591l2992P8059o128j8619o3262j8393
$$ plain form
25409 -52238 -49437 -16321 -6252 -48918 -69638 -52921 -7429 35872 50292 30716 6331 -91289
25397 -91289 -100247 -59727 -56943 -11515 3474 -20042 7038 -14718 -76691 -99328 -36534 -38257
25385 -38257 -63353 -98349 -76790 -14417 -1641 -1984 29719 21184 -36903 -17200 26754 -2733
25373 -2733 -44247 -36949 13232 16858 -30726 -113724 -150596 -118768 -144203 -109161 -30631 -24617
25361 -24617 -46634 -81157 -39410 -7591 16718 30001 49814 56812 20012 2098 -8051 23542
25349 23542 100603 37449 -57329 -61782 -13722 2956 -32631 4140 14760 11716 54288 89127
25337 89127 98143 132812 127083 74327 21546 -15048 -2540 9848 -22414 -35800 -35720 -60859 -24498
25324 -24498 21640 -14322 -22539 6643 34426 -31165 -64157 13902 7774 -10845 -74107 -92500
25312i2500n2971P7945M0499K5157K4479N3190R819l6142q7610J9397M0073n0510
25300b9174o3198l6957O8746M2047J3791j6961K2672K9355K3577j837k9575n0818
25288b8332O162J6577q927J5372j5409n370K4770K3836j5480O705L5858k39O1857
25275A17380j4671p8959j2744j3420N589K6192L705l126L9163J1576m3636r7164
25263f0115m2388O4756M3613K0988j5656K2813k4658k3607M7160j0963k7604K415
25251c246O1379K9132N633p254J9549n7893p4456k3584k4675m5566M2158L2352
25239d6471O6871P0657j4274n1715j3071n344j4324n6794o4965L2618j202k4693
25227a22707N0048J08790Q9350K5201o4518k6600l9100n43j2458N0914J8580p0153
$$ plain form
25312 -92500 -145471 -67526 -27027 -1870 22609 75799 85618 49476 -38134 -18737 21336 -29174
25300 -29174 -92372 -129329 -60583 -18536 -4745 -21706 966 30321 53898 52061 22486 -28332
25288 -28332 -22170 -5593 -14520 852 -14557 -19927 4843 28679 13199 19904 55762 55523 117380
25275 117380 102709 23750 11006 -2414 3175 29367 33072 29946 69109 80685 37049 -60115
25263 -60115 -102503 -37747 5866 26854 11198 34011 9353 -14254 32906 21943 -5661 -3246
25251 -3246 58133 87265 92898 85644 105193 47300 -27156 -50740 -75415 -120981 -78823 -46471
25239 -46471 20400 91057 76783 25068 11997 6653 -7671 -64465 -129430 -96812 -98014 -122707
25227 -122707 -72659 36131 125481 150682 86164 59564 20464 19921 7463 58377 76957 6804
25215F804k725N4761j2931m7954m113K5988K9107l1198o8447l3389J3375J0438
25203f0284j888J8873j1280N5235M0680q972l8589R812K1851q4435j5000O9833
25191d164K0768m3161J2564M3730M2777Q068j506k964p9072k2820j8135L2157
25179a1758J3011J6794j5499L6202k0688J0450j5791o076K200L19j4143n0832
25167e5811l6768j5174J0226L2225K2140K781k3078O3584L5133p9608j7513j2432
25155g4295O5535J01089L5471m1020q7474k209K9332K4277J0265O999o3994n2549
25143d8573m7507k8131k1279o88K3252j537J4451N8775M7574k1250m8136j6047
25131h9096l733K1989N9643J7799l0023p607L1788m3229r031L6568J1301P2028
$$ plain form
25215 6804 4079 58840 45909 -2045 -6158 19830 48937 17739 -50708 -84097 -70722 -60284
25203 -60284 -62172 -43299 -54579 656 41336 32364 -6225 3587 25438 -58997 -73997 -4164
25191 -4164 16604 -26557 -13993 29737 72514 80582 79076 76112 -2960 -25780 -43915 -11758
25179 -11758 1253 18047 2548 38750 18062 28512 12721 6645 8845 9164 -4979 -55811
25167 -55811 -92579 -107753 -97527 -65302 -43162 -40381 -63459 125 35258 -44350 -61863 -74295
25155 -74295 -8760 92329 127800 86780 -694 -2903 26429 50706 60971 67970 3976 -48573
25143 -48573 -96080 -124211 -145490 -146178 -122926 -124463 -110012 -51237 -3663 -24913 -73049 -89096
25131 -89096 -92829 -70840 -11197 6602 -23421 -31028 760 -42469 -51500 -14932 -3631 68397
25119F8397J7035k007j6203k6634n7956p258j8138K1636R998k4791j415k104J7847
25106b1593J3644m535n6222L5847m371j5041m5994K4833M7185L011q200L3751
25094B315K0536N040Q126J006K0727K9955m4294o7376l5402R5224l068k1958l919
25081F912l9353J4241N0813j7009l7491J1374K0082j5619r1302j8050P6177N9116
25069A9891L5442k7908r057K1119o2169o4143O5806J5888K7520Q931j5184J2635
25057B8771j4891L410K2989k6362o8932k2059M5290N7114K2125J9877q0053k571
25045a5292L2077K9704J0989K6312J1414n2298k5021k450p5894p1710L5210K7010
25033f9949r22R296L256O202M2002K7247J3476k7823l5888l2598k2297M9680J7916
$$ plain form
25119 68397 85432 83425 67222 40588 -17368 -24626 -42764 -21128 -11130 -35921 -37336 -39440 -21593
25106 -21593 -7949 -12484 -68706 -32859 -37230 -52271 -98265 -73432 -26247 -23236 -31436 2315
25094 2315 22851 27891 36017 37023 57750 87705 43411 -23965 -59367 35857 32789 10831 6912
25081 6912 -32441 -18200 32613 15604 -21887 -10513 9569 -6050 -97352 -115402 -39225 19891
25069 19891 55333 27425 18368 39487 -22682 -86825 -21019 -5131 22389 31320 16136 28771
25057 28771 13880 17290 40279 13917 -55015 -77074 -31784 25330 47455 67332 -12721 -15292
25045 -15292 16785 46489 57478 83790 95204 42906 17885 15435 -60459 -132169 -96959 -69949
25033 -69949 -70871 -61575 -58319 -52117 -10115 17132 30608 2785 -33103 -65701 -87998 -38318 -20402
25020b0402K6453m1416J1299K9151J3498J241K3926k7308l5113L4355N7516m2859
25008C0341k2418J8328K3143j3090j2604k0638R634k1024M050J7032M1291J0443
24996F4488K3923J2651n320n4500n2530m7232Q788K8254L6861n615J8426J8028
24984D6222N3989P2456l329q0182k9795l0381L4354J2978R731M1884j0500n5037
24972F2390l8025n262J3697m886K0906k0725p8045K9258M0462k0981J8322j1261
24960E850j83K9648J9017l2737o2220M8653M4873k9323o8749J3059K2166n0950
24948f0896L18J6317k9193K4953J6992l6892l2616J3183J0541M9488L9834L720
24936A5749l0750N0286l191l2868M587k8824M855J8637L0692L8889m0206n43K8266
$$ plain form
25020 -20402 6051 -35365 -24066 5085 18583 19824 43750 16442 -18671 15684 73200 30341
25008 30341 7923 26251 49394 36304 23700 3062 12696 -8328 -4278 12754 54045 64488
24996 64488 88411 101062 95742 41242 -11288 -58520 -49732 -21478 15383 9768 28194 46222
24984 46222 100211 172667 169338 89156 59361 28980 63334 76312 86043 127927 117427 62390
24972 62390 24365 19103 32800 27914 48820 28095 -49950 -20692 19770 -1211 17111 5850
24960 5850 5667 35315 54332 21595 -40625 8028 52901 23578 -45171 -32112 -9946 -60896
24948 -60896 -60578 -44261 -73454 -48501 -31509 -68401 -101017 -87834 -77293 -27805 12029 15749
24936 15749 -15001 35285 32094 -774 3813 -25011 -20156 -1519 29173 68062 27856 27313 55579
24923E5579K6475K3893q0133m6696l3114N9917M6779l5483l1696M1922m6374m1615
24911f0546k2348J8513n731J9824P0341P6362k5004l7989R533J5994J625L082
24899F3656j1656j7832J002o2030m8153K4372R484j5531M7496M6681m2874l2941
24887c8326k9615q410J8200k8338K8437J8054L2230M7405J6117k0887n0609k3068
24875c8810N269J7317R874M9450o2699P5316Q1792k1085j19898m3358P1456l5377
24863a0753j1511M4899R272j8944k3911n0538K3305M6156l4670q534q1639N5606
24851f1262R8990O794L1905M5915J1442k8797r037l4218l7405k4223M8247M1092
24839H9443l2378l7753m1973k2343K1451k6211j572M2965j5119L1417K84N565
$$ plain form
24923 55579 82054 105947 25814 -20882 -53996 5921 52700 17217 -14479 27443 -18931 -60546
24911 -60546 -82894 -64381 -70112 -50288 20053 96415 71411 33422 42955 58949 60574 63656
24899 63656 52000 34168 35170 -26860 -75013 -50641 -41157 -56688 -9192 37489 -5385 -38326
24887 -38326 -67941 -76351 -58151 -86489 -58052 -39998 -7768 39637 55754 34867 -15742 -38810
24875 -38810 -33541 -16224 -6350 43100 -19599 55717 137509 116424 -3474 -46832 24624 -10753
24863 -10753 -22264 22635 31907 12963 -10948 -61486 -38181 7975 -26695 -35229 -116868 -61262
24851 -61262 37728 44522 76427 122342 133784 104987 95950 61732 24327 104 48351 89443
24839 89443 57065 19312 -22661 -45004 -23553 -49764 -51336 -8371 -23490 7927 8211 13776
24827A3776J2812L1114k7178k1091j4505m2945R009N0315L7827K5650k87o6596
24815G901R370L4129L5673m3269l4850Q3348L0939m1172n1170j6728r025N0588
24803E5734O64j191O440q3548j0543M9222L6193O367K196k4922n6638k3421om278
24789d7731R5339L9275n659p1016o3452J0892L3541J3375j7181o5175k3177R0524
24777a0445R8436l3881n813M4334k8731J2118N166k5000L9758l808m9457o8487
24765b5810J3740l3249m2441K9465L9165j9495M860m2737q698N6657j113N4972
24753B5316L2204o0646j9773m0181k2409K0230L7406j6475K8387K4814L4836J636
24741D5345K3686K0804M1461j2446p1775p5917L3210R97L6190m5270L442M4751
$$ plain form
24827 13776 26588 57702 30524 9433 -5072 -48017 -39008 11307 49134 74784 74497 7901
24815 7901 17271 51400 87073 43804 8954 92302 123241 82069 30899 14171 5146 55734
24803 55734 56398 55207 61647 -21901 -32444 16778 52971 59338 61534 36612 -20026 -43447 -43453 -47731
24789 -47731 47608 86883 81224 10208 -53244 -42352 -8811 4564 -12617 -77792 -100969 -10445
24777 -10445 87991 54110 48297 92631 63900 76018 81184 56184 95942 92134 42677 -25810
24765 -25810 -12070 -45319 -87760 -58295 -19130 -38625 -33765 -76502 -85200 -28543 -29656 25316
24753 25316 57520 -3126 -22899 -63080 -85489 -65259 -27853 -44328 -15941 8873 43709 45345
24741 45345 69031 89835 131296 118850 47075 -28842 4368 5365 41555 -3715 -273 44478
24729D4478J4771J54m3533j6008m2033m4767R2459M0126k7681P396K4960K1797
24717G2119k8621n0784J4355k3718K9284R260K7278Q878n4327J8612J4677j0173
24705B6840o383p138n0974o7191p907L4835Q7252K1792j2936M994J2886J3906
24693D9976n2327j4554K937K7902r956M8352j5042m4290J3900l5270R691N628
24681a3053m7193L6584M4283J1987M6406j7842j1500n0763o7268J4424M0470L7252
24669B3787k5223p2472k1487K9429L8825M3848M8766L258p0303m7378J3848L6118
24657A016M0090j7023l1075j3173j3785k0963L2189O7460N398p3832k1994K0516
24645b5176K2657k0334K0922J2808K976Q568l5980q107R300j4427j6497o503O8608
$$ plain form
24729 44478 59249 59403 15870 -138 -42171 -86938 5521 45647 17966 25362 50322 72119
24717 72119 43498 -7286 7069 -16649 12635 21895 49173 58051 3724 22336 37013 26840
24705 26840 20457 13319 -37655 -104846 -112753 -77918 9334 31126 18190 23184 36070 49976
24693 49976 -2351 -16905 -13968 13934 3978 52330 37288 -7002 6898 -28372 -18681 -13053
24681 -13053 -60246 -23662 20621 32608 79014 61172 49672 -1091 -68359 -53935 -13465 23787
24669 23787 -1436 -73908 -95395 -65966 -27141 16707 65473 68731 -1572 -48950 -35102 1016
24657 1016 41106 24083 -6992 -20165 -33950 -54913 -22724 44736 50134 -23698 -45692 -25176
24645 -25176 -2519 -22853 -1931 10877 13853 22421 -13559 -21666 -12366 -26793 -43290 -49793 18815
24632A8815M5039m212k2671K617K8783j8690k5951o103k6409L799R908j9417p626
24619b2118m371n3628j4399P132p970M8554J8296O8877J1661k4994L7251j2327
24607E1964J4590N30j06488o6900O8832L4020r085n3451J196M5482J8854J9642
24595A9186J2003K9120M968M697J8028L459n1085k7081L9735m9035J2896L7038
24583E3929m3909k0141N973n015n850L3920L9626n6937k6041M6743J3995l2181
24571D112l8386J9875J1872n5994L813K0125j8437N487O7742J5568m6077n4783
24559f5083m0108K5296J01925j3493K356k1189j7189m1179p3056M9338N5633J6080
24547b0669Q413j7845N329M1461K4558m6366j578L631M9149P9300m6796o1884
$$ plain form
24632 18815 63854 59642 36971 39588 68371 49681 23730 17627 -8782 -4983 4925 -14492 -22118
24619 -22118 -26489 -80117 -94516 -87384 -95354 -46800 -28504 40373 52034 27040 64291 51964
24607 51964 66554 67084 -39404 -106304 -37472 -3452 -12537 -65988 -64792 -19310 -456 19186
24595 19186 31189 60309 65277 69974 88002 91461 40376 13295 53030 3995 16891 53929
24583 53929 10020 -10121 -4148 -9163 -15013 18907 58533 1596 -24445 22298 36293 4112
24571 4112 -34274 -14399 -2527 -58521 -54708 -34583 -53020 -47533 20209 35777 -10300 -65083
24559 -65083 -105191 -79895 22030 8537 10893 -10296 -27485 -68664 -141720 -92382 -36749 -20669
24547 -20669 -12256 -30101 -24772 16689 41247 -5119 -6697 -3066 46083 125383 78587 16703
24535A6703m2242k3475M0756L5197J3192k5706L2333m400l8786O984q690j9255
24523a7389k1602L5696K6766L912J3805J6983K4413l4199m0741k5198p508k4417
24511d9479j7542N2508M8278N5811L3854n2318l9359o831k6686K2374J4933N116
24499D0659l44j9554j2092n328J824L0475q24m8742r931k2715m1144K9332J2396
24486d5988l3242m224M1155j574j2487M4156N383m1900J4947j3155n3364R214
24474i1079K5825J1188M9551j0389l5340j4724j9495l0658k6901J4436M6429O8954
24462a2203O6838R29L256j8163j1180m333j9027K6665O45K331j3066m4775J3388
24449h695L3307o3927m3372l2462J6745L396J0668K9367L9696L6721j3742o2822
$$ plain form
24535 16703 -25539 -49014 -8258 26939 40131 14425 46758 42358 3572 10556 1866 -17389
24523 -17389 -38991 -3295 23471 27383 41188 58171 82584 48385 7644 -17554 -25062 -49479
24511 -49479 -67021 -14513 33765 89576 123430 71112 31753 24922 -1764 20610 35543 40659
24499 40659 40315 20761 8669 3341 5165 35640 34816 -13926 -23857 -46572 -87716 -58384 -45988
24486 -45988 -79230 -83454 -42299 -43873 -56360 -12204 -6821 -48721 -33774 -46929 -100293 -91079
24474 -91079 -65254 -54066 -4515 -14904 -50244 -64968 -84463 -115121 -142022 -127586 -81157 -12203
24462 -12203 54635 55564 58820 40657 29477 25144 6117 32782 33427 35758 22692 -22083 -8695
24449 -8695 24612 -39315 -82687 -115149 -98404 -95008 -84340 -54973 -15277 21444 7702 -55120
24437e5120l9908r565L9513J6834n2156K5991J670l562K7397j6399M6792K3874
24425E361l6225o574j6848J4292j4427R976r931M3301N0936n56J2492k9037L3059
24412E5819k5862j0333k2787J1746r458j4809P906n6641J9600K6177O1350L0321
24400G3029o5957n5604j2507Q949K5712j6803M6768k308j9995N3243K5630L9o7405
24387g209R975L9933n9483k6375l8988J8083K9720m8048j6196N4202M9969M441
24375A0024q0635L9627R9079m844p2894j7352P4292J3109j1669k6674l8828l5582
24363e2347k5814M758J1968L8275M1896j3227m3245k482k1665P8111R4425K508
24351A13161o5521n3164M6974k2535j6519R627l9015J8948q487M221M79J5127
$$ plain form
24437 -55120 -95028 -104593 -65080 -48246 -100402 -74411 -72741 -76303 -48906 -65305 -18513 5361
24425 5361 -30864 -37438 -54286 -39994 -54421 -44445 -54376 -11075 39861 39305 51797 22760 55819
24412 55819 29957 19624 -3163 8583 -875 -15684 -7778 -64419 -44819 -18642 42708 73029
24400 73029 7072 -48532 -61039 -52090 -26378 -43181 3587 1279 -18716 34527 60157 60196 -7209
24387 -7209 2766 42699 -16784 -43159 -82147 -64064 -34344 -82392 -98588 -44386 5583 10024
24375 10024 -70611 -30984 68095 63251 -9643 -26995 47297 60406 48737 22063 -16765 -52347
24363 -52347 -78161 -73403 -61435 -23160 18736 5509 -37736 -40218 -61883 16228 110653 113161
24351 113161 47640 -5524 41450 18915 2396 12023 -26992 -8044 -16531 -12310 -11831 3296
24339C296J6330M0323o6844l4763J2754N0612O060L9177l8552p7343l8275j0127
24327i7352K9646N0951p433o9957l2804P549M900K4150N815J7921M0236O798k405
24314b1985m903k852l3255m3066M3766l585O6489P9518J1820n8714m0792m8795
24302e6354l5795J04745N3275L3606M674n5252n0806J8007J5518m0417k140L1742
24290B0803K5045j3664k4071j3491M1999O208j5572m5211j2800k1797R238K9969
24278a3344J512K4587k4211K5104j7169l5653n596J9179L9039j8269l1731K4855
24266a1697Q219J9143o3251k1465Q5101L4139n9401m8028j2172J03150J973J5045
24254E0756k5729n6229j5555M0208Q0110J522J464j6279J5158n7427n9763l838
$$ plain form
24339 3296 19626 59949 -6895 -41658 -28904 21708 27768 66945 28393 -48950 -87225 -97352
24327 -97352 -67706 -16755 -24188 -94145 -126949 -119400 -114500 -90350 -84535 -66614 -26378 -19580 -21985
24314 -21985 -26888 -29740 -62995 -106061 -62295 -65880 609 80127 91947 33233 -7559 -56354
24302 -56354 -92149 12596 65871 99477 104151 48899 -1907 16100 31618 -8799 -10939 20803
24290 20803 45848 32184 8113 -5378 36621 42829 27257 -17954 -30754 -52551 -43313 -13344
24278 -13344 -11832 12755 -11456 13648 -3521 -39174 -44770 -25591 13448 -4821 -36552 -11697
24266 -11697 -3478 15665 -47586 -69051 16050 50189 -9212 -57240 -69412 33738 35711 50756
24254 50756 25027 -31202 -46757 -6549 73561 75083 76547 60268 75426 17999 -41764 -45602
24242d5602O1234M5356m746n7270n3296j8913N7554O4501J3995m4898k5498J8560
24230A0977Q3582J9217l4150o5101n4934M7N4007J2899q8759M8063O4834q4025
24218c3343l9208k4578k3187m1297O7487Q2015j4968P221N0073J4781m2496j8375
24206a5875R0350k9651k2946M638m852k5886L1168K6477p586j5481q723k7345
24194e712r951L96O0683K3553M3463j8411N912j9265J4936o3339m9009M497L4129
24181B1882M04m932N2099j6159n791j0878J3891L7969J1598n537K2964m5390l6698
24168C5422k7994j1856j1702k3822L1482M775L9987j7038m858M094l364l0905
24156a5779L0013k309K5852q039j7310m5137M2416K2762j5044N401P962J353k5158
$$ plain form
24242 -45602 15632 60988 56242 -1028 -54324 -73237 -15683 48818 62813 17915 -7583 10977
24230 10977 94559 113776 79626 14525 -40409 -40362 13645 26544 -62215 -14152 50682 -33343
24218 -33343 -72551 -97129 -120316 -161613 -94126 -12111 -27079 -19858 30215 44996 2500 -15875
24206 -15875 74475 44824 21878 26516 21664 -4222 26946 53423 45837 30356 21633 -5712
24194 -5712 -15663 -15267 45416 68969 112432 94021 99933 80668 95604 32265 -16744 -12247 21882
24181 21882 22286 17354 69453 53294 47503 36625 50516 88485 100083 94546 117510 72120 35422
24168 35422 7428 -4428 -16130 -39952 -8470 -3695 36292 19254 14396 18490 15126 -15779
24156 -15779 14234 11925 37777 29738 12428 -32709 9707 32469 17425 22826 30788 32141 6983
24143F983n1001m9598m8310O9771P4332P5667L7625m655m2515j5292k945L0775
24131H0837n241j1103l92K0728J3200n498n1357J76J4284k6319l7651m4246m497
24118e7079Q032L1598L9794r265l1194L3598k1018J4502L1324m1443M5002j5697
24106B8154m3884K8019m0507n3738k1529L7933j3942j3895R14K7393R0360N4301
24094G9579j5465k402k0070l0404m861J4299P7302j822K3433J286q5200l1983
24082C692K7918n356P446l4005O502n7894N4251N135j7771j3642L2294j9439j0197
24069b1066L9161L1936o269k4738J8625m8383n2103k2203L4091N2093K7008m1772
24057a3620o7929j6814L7788M9584l5223j9487N2001q117p4099M812O1112K8027
$$ plain form
24143 6983 -44018 -93616 -141926 -72155 2177 77844 115469 110814 68299 53007 50062 80837
24131 80837 75596 64493 64101 84829 98029 92531 41174 41350 55634 29315 -8336 -52582 -57079
24118 -57079 -49047 -17449 22345 13080 -18114 15484 -5534 8968 40292 -1151 43851 28154
24106 28154 -15730 12289 -28218 -81956 -103485 -65552 -79494 -93389 -92475 -65082 25278 79579
24094 79579 64114 61712 41642 11238 6377 20676 97978 96156 119589 120875 35675 3692
24082 3692 31610 26254 33700 -305 6197 -51697 2554 7689 -10082 -23724 8570 -10869 -21066
24069 -21066 18095 50031 43762 19024 37649 -10734 -62837 -85040 -50949 1144 28152 -13620
24057 -13620 -81549 -98363 -60575 -10991 -46214 -65701 -13700 -21817 -95916 -91104 -29992 -1965
24045a965o5753k5383L1323M3441L6929k5368j1761L4144j6091j2631O44K5074
24033A2603k2118J4266Q5241j828m0023n6657k6240K9770Q004k3259n7379N3779
24021b3841P4963K2350j4971K4799K0302j3635p4573J1165j2917L0258l963m8952
24009i015K4119K1733p7974k2365l371P9870O7214k1546o2538l1179K1842K1689
23997H479j7203L2741K7405p1469k1775M0533L9113l221L8915q919l9324m7030
23985b1755j5378K5656M4217J7593l511o2040j9082j6347J7863j8058K0239P1108
23973D0505l237n0553j7324K1881n1488N81M8205n251j458R026k0166n6081N0839
23960c4521J056J5362k4509k1092J0958O7063N9022J9576j7822l1816k1783L725
$$ plain form
24045 -1965 -67718 -93101 -61778 -18337 18592 -6776 -18537 15607 -484 -13115 -12471 12603
24033 12603 -9515 4751 89992 88164 48141 -8516 -34756 -4986 3018 -20241 -77620 -23841
24021 -23841 51122 73472 58501 83300 103602 89967 15394 26559 13642 43900 39937 -9015
24009 -9015 15104 36837 -41137 -63502 -66873 12997 80211 58665 -3873 -35052 -13210 8479
23997 8479 -8724 24017 51422 -20047 -41822 -1289 37824 34603 73518 64599 25275 -21755
23985 -21755 -37133 -11477 32740 50333 46822 -15218 -34300 -50647 -32784 -50842 -30603 40505
23973 40505 37268 -13285 -30609 -8728 -60216 -59635 -11430 -16681 -18139 -9113 -29279 -85360 -34521
23960 -34521 -33465 -18103 -42612 -63704 -52746 14317 73339 92915 75093 43277 21494 25219
23948B5219o582j1082J500j4826k5702N8337L5121l6302l7275J241N8061j5872
23936C1838n8006p171o575R070J2350K8998l1815J6163L7991j3294j2486j0108
23924c045n758k151J3215K6233K1402m1750O230k8876n778J1037j8867j1233l431
23911d2772K6541K7466J8718M0761j3993j6366j1469J9760J3325K9540l8092m4238
23899I181J7228J0889l1342P6869j5714k3571O39r772k9658K7078P3896j433j4502
23886H9788j0204K105J6410J5057j2485j39789p3612O2771O9575m6082j4564J5807
23874b5223k7764O222R6951K7346O8J0699n0657R350J6940j5443l086o7512j6520
23861c8629J1012J0767J9647J7707L3527O17j7902n889j4360k0328j2276L870
$$ plain form
23948 25219 18637 7555 9055 -5771 -31473 26864 61985 25683 -11592 -10351 47710 31838
23936 31838 -26168 -33339 -39914 -30844 -18494 10504 -21311 -5148 32843 19549 7063 -3045
23924 -3045 -8803 -10954 2261 28494 49896 8146 14376 -14500 -20278 -9241 -28108 -39341 -42772
23911 -42772 -16231 11235 29953 70714 56721 40355 28886 48646 61971 91511 53419 9181
23899 9181 26409 37298 5956 82825 67111 43540 44179 34407 4749 31827 105723 104290 89788
23886 89788 79584 81689 98099 113156 100671 -39118 -112730 -49959 19616 -26466 -41030 -25223
23874 -25223 -52987 -46765 50186 77532 77600 88299 37642 46992 63932 48489 45403 -22109 -38629
23861 -38629 -27617 -16850 2797 20504 54031 54648 36746 30857 16497 -3831 -16107 -12237
23849a2237o218N3357M3577j257n2882k1662l6343J2353j5319m3830m9227n831
23837a35519N2448R5927K1250J303K5253l087N5672K8120k3273p6076m6899Q316
23825C435n5875L6670O2915K1514k7519l7808M4795M8822l6008l8436K596r53
23813B4148l4187p265P2638N1287J5518k3986m6911M6077p266l7777J1136L423
23801F6835k5111M4466O843J3584l4427K2228J6824K6793l0368o8427k9402q529
23789A309q1378R538L9726m2602l2116O6409l815M321K9701P095O6118p713j055
23776E5538N479m5526l2033P1088M458k6368r452k312M769q7580p8927K4009L0480
23763h6377Q296K6670p317J0752L8583K6537L6319O372J0169J2381N4M0689K6095
$$ plain form
23849 -12237 -18455 34902 78479 77222 24340 2678 -33665 -21312 -36631 -80461 -129688 -135519
23837 -135519 -83071 12856 34106 35409 60662 57575 113247 141367 118094 42018 -4881 3435
23825 3435 -52440 -15770 47145 68659 41140 3332 48127 96949 60941 22505 25101 24148
23813 24148 -10039 -17304 55334 106621 122139 98153 51242 97319 90053 52276 63412 66835
23801 66835 41724 86190 93033 106617 72190 94418 111242 138035 107667 39240 9838 1309
23789 1309 -80069 -70531 -30805 -73407 -105523 -39114 -42929 -38608 -8907 -1812 64306 56593 55538
23776 55538 61017 15491 -16542 54546 59004 32636 23184 20872 25641 -61939 -140866 -116857 -86377
23763 -86377 -78081 -51411 -58728 -47976 -9393 17144 53463 59835 70004 82385 82439 123128 149223
23750A49223l3812o5926m2849k2071L9118k5441o7115K5057L1816k6130k0466
23739e8596M4783O4013m5586p9895J1668O5915q176J8693P3360P375n5823j4530
23727B3201p492k3131o731L6193P295L4480j5109m4440M3816k447k9621J401j1883
23714E532N136L5456M4961m9059m8717m6912m5900J5511O1824j4849K4643Q0860
23702F8486k0234n6757j874J1708M437L500R882n1143k3456m2733L4954N5851
23690g379M4713N6996j6663l5927l6218n9261j7148J8310M4989L3960M8903K6030
23678A01305l4776m4637j5316J4027K5437k949K3163j4768m3487n602L997L070
23666I464J603J3360k2722j2304K0880m1885K559J5561J6727o7124n0245K0259
$$ plain form
23750 149223 115411 49485 6636 -15435 23683 -1758 -68873 -43816 -12000 -38130 -58596
23739 -58596 -13813 50200 4614 -75281 -63613 2302 -5874 12819 86179 93554 37731 23201
23727 23201 15709 -7422 -14153 22040 29335 63815 48706 4266 48082 45635 16014 17415 5532
23714 5532 10668 46124 91085 42026 -6691 -53603 -99503 -83992 -22168 -37017 -12374 68486
23702 68486 48252 -8505 -10379 1329 5766 9266 19148 -31995 -55451 -98184 -63230 -7379
23690 -7379 37334 94330 77667 41740 5522 -53739 -70887 -52577 -7588 26372 75275 101305
23678 101305 66529 21892 6576 20603 46040 43091 66254 51486 7999 2397 6394 9464
23666 9464 11067 24427 1705 -10599 10281 -31604 -29045 -13484 3243 -63881 -114126 -93867
23654i3867Q3494P5298l1077j4374L9110k7506m5281O62k2219J2890l2940j818
23642e7628N547P651L9938M0857j3189l3515K5872N802K8984m6101r9771K4189
23630g1364N7255Q890l068m8438j1819P5787k0924k4604J3147Q860j4578l920
23618c4776J2131l7380J611k4411P19O7768P5280k4374m6979q819l3407K419m897
23605e5115L4829j1300m4084K4303M5027J9709k481n7503j4555Q6622l4083k1328
23593b9959J3249J8767L6038k2748k7744j7335j7708K2019m150p262K8265L5328
23581B6760o52l5730n4384K2887q6k3285R22O5949J5614j4854J839l0947n7795
23568h3762L8681J00654M1023n8650K4808M2014p9241l2609O268j5846J9496k0558
$$ plain form
23654 -93867 -10373 64925 33848 19474 58584 31078 -14203 -13541 -35760 -22870 -55810 -57628
23642 -57628 -52081 -44430 -4492 36365 23176 -10339 15533 21335 50319 4218 -95553 -71364
23630 -71364 -14109 -5219 -8287 -56725 -68544 7243 -13681 -38285 -25138 -16278 -30856 -34776
23618 -34776 -22645 -60025 -58414 -82825 -82106 -14338 60942 36568 -10411 -19230 -52637 -50218 -55115
23605 -55115 -20286 -31586 -75670 -51367 -6340 13369 10888 -46615 -61170 25452 -8631 -29959
23593 -29959 -16710 2057 38095 15347 -12397 -29732 -47440 -25421 -29571 -36833 -8568 26760
23581 26760 26108 -9622 -64006 -41119 -41205 -64490 -63568 2381 17995 3141 4980 -25967 -83762
23568 -83762 -45081 55573 96596 37946 62754 104768 25527 -7082 -814 -16660 2836 -17722
23556a7722l0513N5775O2535q1221n392K5733j7308k7408M0086J6597l9428o315
23544b4581J0522n0234P400K8446m756j9333l6428m2356K6165k6123L722l9025
23532a66581m2875Q7214R0248L169J2173L9900k4659m3898m0908j6623m90M068
23520i9262L2755N0180J3374K5830q917o9361L0582j2491K3801L7799M9407J255
23508G4952l1171K5106L5961k4223M6725O739k9767l1417j2199j0489j9182j6875
23496A4160k083L3423L6468J5061M9397l0244k5567l3252l7975j8665j6644o8776
23484h4697j8728P0916P5447L9377K1228m5256p9884m1034o832O574j6425M971
23472g4343j777R327M1963N0093m2410l1460k1147J6523L1764k6489k8787J1107
$$ plain form
23556 -17722 -48235 7540 70075 -11146 -16538 9195 -8113 -35521 4565 21162 -18266 -24581
23544 -24581 -14059 -64293 -56893 -28447 -33203 -52536 -88964 -131320 -105155 -131278 -127556 -166581
23532 -166581 -209456 -122242 -31994 -28825 -16652 23248 -1411 -45309 -86217 -102840 -103330 -99262
23520 -99262 -66507 -16327 -2953 22877 13960 -55401 -24819 -37310 -13509 24290 73697 74952
23508 74952 43781 68887 104848 80625 127350 134089 104322 72905 60706 50217 31035 14160
23496 14160 12077 45500 81968 97029 146426 116182 90615 57363 19388 723 -15921 -84697
23484 -84697 -103425 -32509 42938 82315 103543 58287 -21597 -62631 -69463 -62889 -79314 -74343
23472 -74343 -76120 -66793 -24830 25263 -17147 -48607 -69754 -53231 -21467 -47956 -76743 -65636
23460f5636l2153j142j1989Q581Q087M5035M5769o195j9954j4362n094m1432J6333
23447g4152L6736j55n7310m2182j2600M470J9649M003L1404L7526p762J7751n451
23434d8073J2402J8636L1697K9401j1390n3433j9376k0391N5923q141m4357j7557
23422g4659K2434J5077O695j2248K205k960l9076m7159K9119O0639J0813L5091
23410E971O766l2447k7392M064k1367j0640p0197l198p468P483l2213p741O6313
23397a22066N0924P2327J6729k4180n3603l049P6222K4007O715p6652j3509l9397
23385h5532P921P9016N3107r131J4502r100k1521J0559j2846m3317l7069j3855
23373f7266L7232m5096M8820P4534L2575m1899o259J6788K0146o3376j9707M1603
$$ plain form
23460 -65636 -97789 -98931 -110920 -102339 -94252 -49217 -3448 -9643 -29597 -43959 -49053 -90485 -74152
23447 -74152 -37416 -37571 -94881 -137063 -149663 -145193 -125544 -121541 -90137 -52611 -60373 -42622 -48073
23434 -48073 -35671 -17035 14662 44063 32673 -20760 -40136 -60527 -4604 -12745 -57102 -74659
23422 -74659 -52225 -37148 -30453 -42701 -40496 -43456 -82532 -129691 -100572 -39933 -29120 5971
23410 5971 12737 -19710 -47102 -43038 -64405 -75045 -145242 -148440 -155908 -148425 -180638 -188379 -122066
23397 -122066 -71142 1185 17914 -6266 -59869 -62918 13304 37311 44026 -32626 -46135 -85532
23385 -85532 -77611 1405 54512 45381 59883 50783 29262 39821 26975 -16342 -53411 -67266
23373 -67266 -30034 -75130 -26310 48224 80799 38900 32641 49429 69575 6199 -13508 28095
23361B8095K9519Q779n3751m0084P011K1007L5157J7229l0963K8702l7008o0517
23349d6824L7155p261m5150j2439O5482K7649n1918j7468J3261n2782J6354M9145
23337b4796M2067J8868J1000K116j8798j5023k9474n2058K3325P4374L2603J0242
23325G4446L7877K9724r338K3022l0212J0195n2971m3665O041q4284n1391M3542
23313d7014O9640J7739q619M6322r609k3314k3581p4054j8908K0504J4070P3789
23301C6965L3458l2711m7473J4820P5094k8308m9928K6402P156l1443j0069J7624
23289A1587k6492j4486N2827K0528j5712k8368k5480n2574j5937M0447Q191j6541
23277f2010K3059j0506K770M8330K7155Q207j316K3135l9490k1484P2988o328
$$ plain form
23361 28095 57614 66393 12642 -27442 -20431 576 35733 52962 21999 50701 13693 -46824
23349 -46824 -9669 -16930 -62080 -74519 -9037 18612 -33306 -50774 -37513 -90295 -73941 -24796
23337 -24796 17271 36139 47139 49255 30457 15434 -14040 -66098 -42773 31601 64204 74446
23325 74446 112323 142047 132709 155731 125519 135714 82743 39078 45119 -39165 -90556 -47014
23313 -47014 22626 40365 31746 78068 68459 45145 21564 -52490 -71398 -50894 -36824 36965
23301 36965 70423 37712 -9761 5059 80153 51845 1917 28319 35475 4032 -6037 11587
23289 11587 -14905 -29391 23436 43964 28252 -116 -25596 -78170 -94107 -53660 -45469 -62010
23277 -62010 -38951 -49457 -46687 1643 28798 37005 35689 58824 19334 -2150 70838 64510
23265F4510l7400l495J135L2518N31k0012k4349k2077k8256M2799J2104R196M3947
23252G1151j0348n3978o0872M9724P7307R560k8174M145o098K7294L4502l3017
23240H1196p2402n011j5797J6207J0447m3535J2860N4478L8338r903o2078K6195
23228C0995J5008L2997K657J0808k1960k5833j6572m0115m639J4003K2750p784
23216A2315M3637m7562j9616P384L4220L198K0924N2006p0645j0079J6592k9560
23204A2814q087o614M46k5177J183N1811L5152l3451L7569M269m1807l3590j8558
23191b4040L249K8525l799R710m9316k3659N0689M7245O458k9929o0205O7378
23179B2306N0428L7608P826j8941j8604j4120J6324l1233j4064k528j3610K623
$$ plain form
23265 64510 27110 23615 24750 57268 57799 37787 13438 -8639 -36895 5904 18008 27204 71151
23252 71151 60803 6825 -54047 -4323 72984 82544 54370 58515 52417 79711 114213 81196
23240 81196 8794 3783 -12014 4193 14640 -28895 -16035 38443 76781 66878 4800 30995
23228 30995 46003 79000 81657 92465 70505 44672 28100 -12015 -16654 -2651 20099 12315
23216 12315 55952 8390 -11226 -3842 30378 33576 54500 106506 35861 25782 42374 12814
23204 12814 4727 -1887 -1441 -26618 -25435 26376 61528 28077 65646 69915 28108 -5482 -24040
23191 -24040 -20791 7734 3935 13645 -35671 -59330 -8641 38604 45062 15133 -45072 22306
23179 22306 72734 110342 118168 99227 80623 66503 82827 51594 37530 35002 21392 24015
23167B4015K2182R285L7015m4516r977j3262K1294N4741o251o6143n087k6965
23155c669k5821J8483M5897K841k8828j332J3401J4513Q871j4382m7967m6877
23143f4870M8635O6264l3109j1358N992N480j6606K972K980j5128J8774L4343
23131D4369k4968M2483K6744j5713k1293m0574m0986k8371N69k603M4126j4262
23119c0479k5117K5187n887J1669M4447K9893n173N198p24m2523n1253M3659N6031
23106E4928J1959l2733k8215j4864l2716k9865N719M2954o5440n1582L1413P3679
23094c4763M2160O1975n41n2090N259L6957J0118J306j0932q6929j11171L1037
23082a07614O0455N6858J6102M0066J0023q302J7389k6169o5232L1773R0192j022
$$ plain form
23167 24015 46197 55482 92497 47981 38004 24742 46036 100777 94526 28383 23296 -3669
23155 -3669 -29490 -11007 34890 37731 8903 7571 20972 35485 44356 29974 -17993 -64870
23143 -64870 -16235 50029 16920 5562 11554 17034 428 3400 6380 -8748 10026 44369
23131 44369 19401 61884 88628 72915 51622 11048 -29938 -58309 -57740 -60343 -16217 -30479
23119 -30479 -55596 -30409 -36296 -24627 19820 49713 44540 49738 49014 6491 -44762 -1103 54928
23106 54928 66887 34154 5939 -8925 -41641 -71506 -65787 -22833 -88273 -139855 -108442 -34763
23094 -34763 7397 69372 68831 16741 22000 58957 69075 70381 59449 -27480 -138651 -107614
23082 -107614 -47159 9699 25801 65867 75890 67588 84977 58808 -6424 25349 115541 114519
23070A14519r4423o7566k1125N0357K3397m6267m2633K500M9222O8672K4475j2970
23058D8158J7713K1201O408K92j5503o3245n2408n4480j2402N5441N1089L3332
23046C5596j8839j4641n3241k0110k8486N823L0352L5969l2343k8955j168N9511
23034c0532m66K2607L0282L1241P230o1288K5701n0035K2975P9785K456l3831
23022D6125l2296J2541j3790o982j0966M6933l4011j2157M6958l6008l4047P7005
23010D9305N0624k3026r5100l7520j6712k616P807P3302k3638k5236N9314o2127
22998d5623P15M7587L815J397L7445L62k7101K4659R387l7482k9843K6017M52
22985A1787m0229K9453N1316L8371o852m0474j7025K8077j4485j5458n462L4679
$$ plain form
23070 114519 20096 -47470 -68595 -18238 5159 -41108 -83741 -81241 -32019 36653 61128 48158
23058 48158 65871 87072 93480 93772 78269 15024 -37384 -91864 -104266 -48825 2264 35596
23046 35596 16757 2116 -51125 -71235 -99721 -93898 -63546 -27577 -59920 -88875 -90043 -30532
23034 -30532 -30998 -8391 21891 53132 60362 -926 24775 -25260 -2285 77500 79956 46125
23022 46125 13829 26370 12580 5598 -5368 41565 7554 -4603 42355 6347 -27700 49305
23010 49305 99929 76903 -18197 -55717 -72429 -75045 -67238 6064 -17574 -42810 16504 -45623
22998 -45623 -44908 2679 6494 7891 45336 45698 18597 43256 52643 15161 -14682 11335 11787
22985 11787 -28442 1011 52327 90698 83846 43372 26347 54424 39939 24481 19019 53698
22973E3698l7501J2675M5218J1720J0822n3318j2862o0729l6211M4526L9422j4554
22961B906L8104P4740j1398j3479o7442k9853M1465Q5K1866q7074l3118L8707
22949b4491O330m3978m6146J119P7461M253j5384j8298L9141m6712l5841K3762
22937g8784P2786N3097j3950m711K051K3149n573L8444K1759k4807j4358K918
22925G2021O040n8515m3898l5893R0796O0035j8542k5568k7950L3298J4965L7433
22913A04222L2866K5023m4319o3125j1098K379L5857P408n6166m056j244J405
22901B9152L806M0682l1241k9280O5778J6890l3968l7752m8765m028J8037K9036
22889A8347l934N0797l3822K5132m9955j30985K00O4977L1246N4978K7336J1532
$$ plain form
22973 53698 16197 28872 74090 85810 96632 43314 30452 -30277 -66488 -21962 17460 2906
22961 2906 41010 115750 104352 90873 23431 -6422 35043 35128 56994 -30080 -63198 -24491
22949 -24491 -18161 -62139 -108285 -107166 -29705 -25452 -40836 -59134 -19993 -66705 -102546 -78784
22937 -78784 -5998 47099 33149 28438 30489 53638 48065 86509 108268 83461 69103 72021
22925 72021 78061 19546 -24352 -60245 30551 90586 72044 46476 18526 51824 66789 104222
22913 104222 137088 162111 117792 54667 43569 45948 81805 89213 33047 28991 27747 29152
22901 29152 32958 73640 42399 13119 78897 95787 61819 24067 -24698 -28726 -10689 18347
22889 18347 14413 65210 31388 56520 6565 -124420 -124220 -59243 -27997 26981 54317 65849
22877F5849k4300n7691k5183n189K3463k0919j4783K1792Q347L4743o587j5329
22865a5787k1936n1761K0388N8537K3727m4594J6222N2255m6114l8967j0388O783
22853e1635J9935m4201k2458K3928L773N9195M3955j3355q38L8191L8880L479
22841I8849o6641m1047N1584L8417l7410L559N0953L55j08674n0487R045M8490
22829c007O1698j758k2455L0979J616j5134J5499j4538r2571j482j3838K5854
22817b9137K7111N9567k0070O911l3354k7696O978M1315k459k0198k8640j9334
22805c9006M5747p770k6178R663R356l940k2578O755l9610K4178M5100L7309o2540
22792b3514o7176J7393L3545N1953J5379m7925j07665K0144K2938L9479K9335
$$ plain form
22877 65849 41549 -16142 -41325 -46514 -23051 -43970 -58753 -36961 -28614 6129 -458 -15787
22865 -15787 -37723 -89484 -69096 -10559 13168 -31426 -15204 37051 -9063 -48030 -58418 -51635
22853 -51635 -31700 -75901 -98359 -74431 -70658 -11463 32492 19137 18299 56490 95370 98849
22841 98849 32208 -8839 42745 81162 43752 47311 98264 98619 -10055 -60542 -51497 -3007
22829 -3007 58691 56933 34478 65457 67073 51939 67438 52900 -39671 -41153 -54991 -29137
22817 -29137 -2026 57541 37471 44382 11028 -16668 -9690 31625 29166 8968 -19672 -39006
22805 -39006 6741 -1029 -27207 -17544 -8188 -12128 -34706 -27951 -67561 -43383 1717 39026 -23514
22792 -23514 -90690 -73297 -39752 12201 27580 -20345 -128010 -107866 -84928 -45449 -16114
22781a6114L5114K025j7687m8057K736K6956K0228k2698l3752K5730J6662j023
22769i880j3471m7612N2597L3537J2686K2191K5835M3821J619q8773r8255J5888
22757d9817N0705n552k8644O826M736M7107J2939K0492J340k3043J1585K8812
22745G7486j3660j6374l5244k5415p8576j9651Q2861j0504K2407J7523l6968O088
22733c0027R7640r480l6420J2912K8077K425j2673n6712l5920k4876J007j6666
22721h0713o840l1127K2146M7170l5081L0128O2848j2099N348N7445q662Q95j9619
22708C1839l2004J6409Q665j28o4842l1695M1503J9249j1056k526J2945K9508
22696A7867M9931J7020J0044k0428m310l8554o7156o820L3981j1812l1272m1794
$$ plain form
22781 -16114 19000 21025 3338 -44719 -41983 -15027 5201 -17497 -51249 -25519 -8857 -9880
22769 -9880 -23351 -70963 -18366 15171 27857 50048 75883 119704 121323 32550 -65705 -49817
22757 -49817 888 -4664 -33308 -26482 -21746 25361 38300 58792 60132 37089 48674 77486
22745 77486 63826 47452 12208 -13207 -91783 -111434 -28573 -39077 -16670 853 -36115 -30027
22733 -30027 67613 58133 21713 34625 62702 65127 52454 -4258 -40178 -65054 -64047 -80713
22721 -80713 -87553 -118680 -96534 -49364 -84445 -54317 8531 -3568 1780 59225 50563 51458 31839
22708 31839 -165 16244 24909 24781 -40061 -71756 -30253 -11004 -22060 -24586 -11641 17867
22696 17867 67798 84818 94862 74434 70124 31570 -35586 -42406 -8425 -20237 -51509 -93303
22684i3303j9439j438N9802P9272K5235L7722N4246N5516j6746o0664n4263o2529
22672C411k9371k3366r574J7210J8353K6298m4504k1804n620j1090P581N1006
22660b1470q644q0880N3079O9232M3020L0608m2358N721j1166J0166l8373P419
22648A6354J6237o234o1713m049M3227n8165N0106K4714L3238l4595q064P6740
22636H7796L5478j9929j6274O8970m8589j02740k4129K4007k9963l5855L3030
22625b8198L1591M1498K320L4238m1375R848o8795m8477N2305J6707j3370K6950
22613A5242K0124j9154K8801l8365j4475k3854k3319N9979k9939k4460K3897M0846
22601A5323O8587m7434o7764L0502P0539n9685n983l0732L4614q6M5879O0935
$$ plain form
22684 -93303 -112742 -114180 -54378 24894 50129 87851 142097 197613 180867 120203 65940 3411
22672 3411 -25960 -49326 -58900 -41690 -23337 2961 -41543 -63347 -68967 -80057 -72476 -21470
22660 -21470 -30114 -110994 -57915 11317 54337 84945 42587 48308 37142 47308 8935 16354
22648 16354 32591 26357 -35356 -39405 3822 -54343 -4237 20477 53715 19120 11056 87796
22636 87796 123274 103345 87071 156041 107452 4712 -19417 4590 -25373 -61228 -28198
22625 -28198 3393 44891 47211 81449 40074 49922 -18873 -67350 -15045 1662 -11708 15242
22613 15242 35366 16212 45013 6648 -7827 -31681 -55000 4979 -24960 -49420 -25523 15323
22601 15323 83910 36476 -31288 -786 69753 10068 4085 -26647 7967 7881 53760 114695
22589A14695K1955j8959k890j3637m8487j2687j6925k7126j8123m5344K8669J0169
22577b8690k6686L7967L880M2248L1448M184q046j5748q599n4003l5495n766M2256
22564b1050K0891l2551o49L6589L0295L2681J1485r4725m4711K056J9330j4774
22552e5133l7683N0246M6914j0416l2171n6496l4638K8602O5081L2290M5036K9567
22540G1199q779j7835q6294n4540J896L8145n124P298L4766j8509k7015J4782
22528e0010L8990K3683m36R924J2286N1178K4419n96m7959l5333j6865K3110O8750
22515A01141l191j9949K711m6388j5448j5938P85N9001j0793j6177L3613L3058
22503A02425k0034n656J6068q0105k1246K7637J00400K0015o0397k7947J9284
$$ plain form
22589 114695 136650 117691 114801 101164 52677 39990 23065 -4061 -22184 -67528 -38859 -28690
22577 -28690 -55376 -17409 -13529 28719 60167 64351 56305 40557 31958 -22045 -57540 -63306 -21050
22564 -21050 -159 -32710 -33359 3230 33525 66206 77691 -17034 -61745 -59689 -40359 -55133
22552 -55133 -92816 -42570 4344 -6072 -38243 -94739 -129377 -100775 -35694 -3404 41632 71199
22540 71199 62420 44585 -41709 -96249 -94353 -56208 -61332 -54034 -19268 -37777 -64792 -50010
22528 -50010 -11020 12663 12227 22151 34437 85615 110034 109438 61479 26146 9281 32391 101141
22515 101141 97950 78001 80712 34324 18876 2938 3723 62724 51931 35754 69367 102425
22503 102425 82391 76735 92803 12698 -8548 19089 119489 139504 79107 51160 70444
22492G0444N284p898Q148n4837J2051K6817n4328o4028l8351l0583L7943N5700
22480c3638Q5438l3304n4955J0114J0249j0766l6698M3777K1494l971m2684M1302
22468c642L5658k6780O4487q589J2991K5210l0283L3266L7668m3889n5241K3374
22456F4230k8001k4371j6922j6214n177m4202M2027Q0658M9768K2240J4716l8716
22444A00036j941k8096O7815j3770m3169l6554M851n5433K506R128k2116j0635
22432b7378k196j1960R4876P9328m8159m2677l2576k7127r504N5535j8782l4616
22420b5236N4084N0713L3301k0028q9306n4102K4123K4642J2286n6862O509M1548
22408A672L9578n402n230K3358m228K1759J1086j1144J8384M0809l199k72J8554
$$ plain form
22492 70444 75728 67830 75978 21141 33192 60009 5681 -58347 -96698 -127281 -89338 -33638
22480 -33638 51800 18496 -36459 -26345 -16096 -26862 -63560 -19783 1711 -2260 -44944 -3642
22468 -3642 32016 5236 69723 61134 74125 99335 69052 102318 139986 96097 40856 64230
22456 64230 36229 11858 -5064 -21278 -26455 -70657 -28630 52028 101796 124036 138752 100036
22444 100036 98095 69999 137814 124044 80875 44321 49172 -6261 -3755 5373 -16743 -27378
22432 -27378 -29574 -41534 53342 132670 84511 41834 9258 -17869 -27373 28162 9380 -25236
22420 -25236 28848 79561 112862 92834 3528 -50574 -26451 -1809 10477 -46385 -39876 1672
22408 1672 41250 35848 30618 53976 49748 71507 82593 71449 89833 130642 127443 127171 145725
22395A45725n1516o6779k4821M6291J6129r45M6872n5082k2227J531j7808o7272
22383d9902K2231K9377J6511p259m9402L826j6714K7001j1487M8000M2198p668
22371D6712J3900K820N1023p372q593l4051o1908j5385r698J205j925O988N831
22358a0453N3283J3452l8584o308m9783j6442L7291J0470m1005p2516P7679J05265
22346F2349K0133K3616J4046m580l9336R710p1449p0228L875J15511N2932n7881
22334E8698k5578L4478M6676J3915p0154k0395J3162N4001L7487J1570q272m9181
22322I6407K75Q809j3121j7940P041M103l5699l2787K1479l1571k6343l0068q7227
22309a36642L600R8161O5923J9324K9026M7979L3424N18l4353m0900l308l9777
$$ plain form
22395 145725 94209 27430 2609 48900 65029 64084 110956 55874 33647 35178 17370 -49902
22383 -49902 -27671 1706 18217 10958 -38444 -34618 -51332 -24331 -35818 12182 54380 46712
22371 46712 60612 63432 114455 107083 98490 64439 2531 -12854 -22552 -21347 -23272 -16284 -10453
22358 -10453 42830 56282 17698 11390 -38393 -54835 -17544 -7074 -48079 -120595 -42916 62349
22346 62349 82482 106098 120144 115564 76228 85938 14489 -55739 -51864 63647 116579 58698
22334 58698 33120 67598 114274 128189 58035 37640 50802 104803 142290 153860 145588 96407
22322 96407 96682 105491 92370 74430 81471 85574 49875 17088 38567 6996 -19347 -49415 -136642
22309 -136642 -133042 -34881 31042 50366 79392 127371 160795 161313 126960 86060 82752 42975
22297D2975P290J4098P8451J4560m8669K1654Q1263m8833j14875m5613J0950M0801
22285E4052L0572Q0j3891J854M0414j4538j2475j876m5801m8774n9839m1307M2453
22272f9076O2704L1186j4031L5730K3112M2130K9415k0240L534k5371l4098L5075
22260A00070l4518j17219K5694m469M0341J8777j0478L7829M7230N2908k0115
22249A36050p2732j6599L6739j8971m0542q6574P052J1975K4496j0567Q6812P8724
22237A35863l9407N078N315k3325j097k7202j5651K2506K6468Q578j2695M869
22225H9300k6615n7981l1189o1104K8511N9017l6689J0735J1131P0148K5096n2752
22213B7608k7776j4233o4712l1362M1609M6121o350O3682j8962j1265j9835K4276
$$ plain form
22297 42975 50265 64363 142814 157374 108705 130359 211622 162789 47914 2301 13251 54052
22285 54052 84624 84704 70813 72667 113081 98543 86068 84192 38391 -10383 -70222 -111529 -69076
22272 -69076 -6372 24814 10783 46513 69625 111755 141170 120930 124464 99093 64995 100070
22260 100070 65552 -51667 -25973 -30442 9899 28676 18198 56027 103257 156165 136050
22249 136050 63318 46719 83458 64487 23945 -62629 -55577 -43602 -19106 -29673 57139 135863
22237 135863 96456 101534 106849 83524 82427 55225 39574 62080 88548 97126 84431 89300
22225 89300 62685 4704 -26485 -87589 -59078 -61 -36750 -26015 -14884 55264 80360 27608
22213 27608 -168 -14401 -79113 -110475 -68866 -22745 -29095 34587 15625 4360 -15475 8801
22201H801l505m743N0970J9730K9275k0317l3298m610L6063M9380K442M2919n8415
22188A14692j7194j2902L5748m1090l6860n0072l9162o774N452K2687L3803j7531
22176i203m5967K7306j2272k0051O9077L5298K447Q436m2508l8209O3277K5393
22164F3024J7859P976m2264k2281N2892l864k8093R03l6771J5921n2607l4247
22152f1552j2916R619j7547K7166P0667L0848m065K0691k4585o53M6252N4235
22140A38160o7545j1279L233j9029k3142p3699J8058J7134L472L5183L8002J8384
22128G6932l5212m1210L0253k9896K7953J3657m4525J3929Q1282J4770l4540l065
22116G0328j3762J2463r956Q6227P014j3694r333j022J1921m7903m299O0276j5662
$$ plain form
22201 8801 5296 553 51523 71253 100528 80211 46913 42303 78366 127746 130188 173107 114692
22188 114692 97498 84596 120344 79254 42394 -7678 -46840 -53614 -48162 -25475 8328 -9203
22176 -9203 -55170 -27864 -40136 -60187 8890 44188 46635 55071 12563 -25646 37631 63024
22164 63024 80883 88859 46595 24314 77206 73342 45249 46152 9381 25302 -27305 -61552
22152 -61552 -74468 -64849 -82396 -55230 15437 46285 42220 62911 38326 37673 83925 138160
22140 138160 70615 59336 62569 43540 20398 -53301 -35243 -18109 -14637 20546 58548 76932
22128 76932 41720 510 30763 867 28820 42477 -2048 11881 93163 107933 73393 70328
22116 70328 56566 69029 59073 145300 152314 138620 129287 128265 140186 92283 87984 148260 132598
22103A32598o2700o6082j1594j1395j1443K0104j8398L3222L0800J7152j5174
22092C7090L7230M0375j3674k7191n1461n0204K750N4910m5701P079j7668R960
22080a6505M9763K5809M2211p247p833K7842L4756n359m1350m9206n3031m999
22068e149K0440J2521k2094m0610K9627q0K1295n9072k2110K0441n758j0581J3617
22055d7513O0012k9126l0161M389O2535M4940l4655m5863J1124N9709N9061J4199
22043A28651k3076o5695k641M2972L4889o408J9112j4763l2441j10989l7789L3066
22031c5112N7393M2901n060O3138R241k3868M5683L1979m1727j6395n2530o0591
22019A5052m1298r102k8j4202L3601L7713L2733L7476O124P94l3146k219N1918
$$ plain form
22103 132598 69898 3816 -7778 -19173 -30616 -10512 -28910 4312 35112 52264 37090
22092 37090 74320 114695 101021 73830 22369 -27835 -25085 29825 -15876 -8797 -26465 -16505
22080 -16505 33258 59067 101278 94031 86198 114040 148796 143437 102087 52881 -150 -5149
22068 -5149 15291 27812 5718 -34892 -5265 -5345 15950 -43122 -65232 -44791 -50549 -61130 -47513
22055 -47513 12499 -16627 -46788 -42399 20136 65076 30421 -15442 -4318 55391 114452 128651
22043 128651 105575 39880 37239 80211 115100 108692 127804 113041 80600 -30389 -68178 -35112
22031 -35112 22281 65182 60122 123260 132501 108633 154316 186295 144568 128173 75643 15052
22019 15052 -26246 -35348 -35376 -49578 -15977 21736 54469 91945 98069 98863 65717 63498 115416
22006A15416m9456m4813J78O711k1212K9108N4847k5150l4356j7523J0698j4M0914
21993F5348O094p775L678K7995Q805k1541n4255n551L2538K6223M3295m5815j1449
21980F7590Q77j895L5523O8382m3051n7086l9625M2187P9646K8717k8240l4397
21968A18628k7061q3983K099K9205M5113N525m2517k1011J8147K7643J5296k2342
21956F4742k2120k5531o6529L3559L5514N1458J5931m4661k5137L5545Q7372l8744
21944A01399j30734J8543N3065p240K9899J8819K3234k5652l1616J0750l8343
21933B2124K6728J6171j3471J191p152m2868m3674J1920N7086K3021m7488L3397
21921C6985m3K1408N2170k6953l2205m313k9069J6317K5654J091K5371j8444N703
$$ plain form
22006 115416 65960 21147 21325 28036 6824 35932 90779 65629 31273 13750 24448 24434 65348
21993 65348 71442 63667 67345 95340 104145 82604 28349 22798 55336 81559 124854 79039 67590
21980 67590 68467 66572 102095 170477 127426 70340 30715 72902 152548 181265 153025 118628
21968 118628 91567 7584 9683 38888 84001 89526 47009 25998 44145 71788 87084 64742
21956 64742 42622 17091 -49438 -15879 19635 71093 87024 42363 17226 52771 140143 101399
21944 101399 -29335 -10792 42273 35033 64932 83751 106985 81333 49717 60467 22124
21933 22124 48852 65023 51552 52743 45591 2723 -40951 -29031 28055 51076 3588 36985
21921 36985 36942 58350 110520 83567 51362 47049 17980 34297 59951 61042 86413 67969 73672
21908G3672N8025L1992J5762m0986K7783Q522l5020l5743K4212k0586k1677m513
21896H1443N6276L1205L297j15209j5571J5336J7327n0826l2533P5685K2602p1290
21884A7742k0826j9920L0294K7793L6773O6987n2017n0605j5972k1693m7489l0690
21872g9623K4189j6080P705J7942N2961P0599m0386k6910k4074J0896J8296O2214
21860G7729M896J0402L2124j8926J617N9298p687l9856k1377O4032K2555m4597
21848A40210r9146o9236M5188O1748K7522K0504J3844m9724l4540M8402j8569
21837H6203j9225j1112k6610j7075j4516j4187P0588L6410m8057n0064j0806j3260
21825c1711j4595N9256M8379K2701k9744K1893p835m4161P285k6818R0042J5627
$$ plain form
21908 73672 131697 163689 179451 138465 166248 174770 139750 104007 128219 107633 85956 81443
21896 81443 137719 168924 172221 57012 41441 56777 74104 23278 -9255 66430 89032 17742
21884 17742 -3084 -23004 7290 35083 71856 138843 86826 36221 20249 -1444 -48933 -79623
21872 -79623 -55434 -71514 -63809 -45867 7094 77693 37307 10397 -13677 -2781 15515 77729
21860 77729 82625 93027 125151 106225 107842 167140 159453 119597 98220 162252 184807 140210
21848 140210 41064 -28172 17016 78764 106286 126790 140634 90910 56370 104772 86203
21837 86203 66978 55866 29256 12181 -2335 -16522 54066 90476 42419 -7645 -18451 -31711
21825 -31711 -46306 12950 61329 84030 54286 76179 68344 24183 31468 4650 94692 110319
21813A10319k5962j6763n489L2863K6509l581m4912K5020O1009J0798n9533q0500
21801B9778J9050J9206j2453N6010r011R646N0583j5977o1351M020j977J9617
21789A07141J3526m0205n5609k284k6106K8439K5841j4570L5989M6579j4079l5408
21777F9254l4046K225L5901N3249J4099k3163n2060j5310P3482L7529J6044k8270
21765A48934l5702k8563J3641J2520J7394j8224n367R132m7813L3277M8447m5431
21753A02245L5416L693k5401M312M0871k3363o4101k5425k8101M9075K7177k1290
21741G5108m591N9230L5683J4728J5252M2134J0927K7698M2406K0511j1963q229
21729C18894J46215Q3481Q3034K18872K32553K11997J70416R7022j0676r7066
$$ plain form
21813 110319 84357 67594 62105 94968 121477 117896 72984 98004 159013 169811 110278 29778
21801 29778 48828 68034 55581 111591 102580 112226 162809 146832 85481 89501 87524 107141
21789 107141 120667 80462 24853 22569 -3537 24902 50743 36173 72162 118741 104662 69254
21777 69254 35208 37433 73334 126583 140682 117519 65459 50149 123631 161160 177204 148934
21765 148934 113232 84669 98310 110830 128224 110000 104633 113765 65952 99229 147676 102245
21753 102245 137661 141354 115953 120265 161136 137773 73672 48247 20146 69221 96398 75108
21741 75108 70517 129747 165430 180158 195410 237544 248471 276169 318575 339086 327123 318894
21729 318894 465109 548590 631624 850496 1083049 1295046 1465462 1562484 1551808 1454742
21719A454742k25409j56171j31144m9721L7415O9736J00549J50743J04966J20352
21709A476058J07593n2646j43865j66174j88457k03431j75861j28958q7710J8296
21699D54845J3561j16863l8916l1602K559j9582k3019k1519j1755j3816R1323
21688B85216M2980O3908l1325l3380l0411R244k5649m5832K6804L5283l1116j5524
21676B50198K178k2943j2481k8861K3533m425j731K2474l131K502K5520R236n7112
21663B04957k6568N539J9240l9678J079k2170J4409J6941p228l1396j3349L3113
21651A54889J4277K2138l7216r0224J2726L5801l5501k8548n125N581M5617K2079
21639A16494k6788J9199J0718j3718N0278k134R510N4511j1884n7724q4566o5417
$$ plain form
21719 1454742 1229333 1073162 942018 892297 929712 999448 1099997 1250740 1355706 1476058
21709 1476058 1583651 1531005 1387140 1220966 1032509 829078 653217 524259 436549 454845
21699 454845 468406 351543 312627 281025 283584 264002 240983 219464 207709 193893 285216
21688 285216 328196 392104 360779 327399 296988 306232 280583 234751 261555 296838 265722 250198
21676 250198 252376 229433 216952 188091 211624 207199 205468 227942 224811 227313 252833 262069 204957
21663 204957 178389 183928 203168 163490 164569 142399 156808 173749 166521 135125 121776 154889
21651 154889 169166 191304 154088 63864 76590 112391 76890 48342 43217 48798 94415 116494
21639 116494 89706 108905 119623 105905 156183 154049 163559 218070 206186 148462 63896 -1521
21627a521Q535O5083M2098j5654J4011J6110J3413J0292l8484j7920L9420J0932
21615A46315o0371k4661O9838R982j1293m5078J9399J5943k8571O2260J6119l1069
21603A38813J3448M0673k940l7291l7970L8883L1424K0477M6636m1331m4859J7148
21591A83111J6733L820p2547j06849j9763O3782M7138K200J8631Q2081k2286o4032
21579A32019l0048k4924n958J7728m8947L8271P8159j2815j9209k6341K1153L7116
21567A56204L4403Q361J7059o6960q5550L6604J2843l2099j2468M1830L5115k3591
21555A21751M2030j6427o6075m416k963n685k764J8848J5798K7361L0337N703
21543A63498M3785p126j3603k1342J9334J3037M7962M6830l294l5582l731p688
$$ plain form
21627 -1521 7014 72097 114195 98541 112552 128662 142075 152367 113883 95963 135383 146315
21615 146315 85944 61283 131121 141103 129810 84732 104131 120074 91503 153763 169882 138813
21603 138813 152261 192934 189994 152703 114733 153616 185040 205517 252153 210822 165963 183111
21591 183111 199844 203664 131117 24268 4505 68287 115425 117625 136256 218337 196051 132019
21579 132019 101971 77047 71089 88817 39870 78141 156300 143485 124276 97935 119088 156204
21567 156204 190607 198968 216027 149067 63517 100121 112964 80865 68397 110227 145342 121751
21555 121751 163781 147354 81279 76863 73900 68215 65451 84299 100097 127458 157795 163498
21543 163498 207283 200157 186554 165212 184546 197583 245545 292375 289081 253499 249768 242080
21531B42080n172j2365O3004L7921j4905m1241m1733M6594K533j03033j5187K7830
21519A86326Q37Q9409O6j2547N4726J7996m110k8717r6547K41L5851k3846M0723
21506B60408M945M2077K6332M5196K0182J21842J24116J63861J89534K43469J45370
21495A387332J00515n070o5684q3668j61574j40859j18703N4930N386J2684J42270
21484A127559K48558J50118R8799J2715q5929j85662k36956j36818k26265j32478
21474F33641j25652o1044P547K572l964m3734l4818m1997K064j0523M4568M2821
21462D11481m3656k7021m0383M5090j0805k3118l0124p99P863L9170L6707j7066
21450C47339m7172O660J3044k2677p436j3831j8648l102K1268k6274m9774l9585
$$ plain form
21531 242080 236908 224543 287547 325468 310563 269322 227589 274183 276716 173683 158496 186326
21519 186326 187163 276572 276638 264091 318817 336813 332703 303986 207439 207680 243531 219685 260408
21506 260408 265353 307430 333762 378958 399140 520982 645098 808959 998493 1241962 1387332
21495 1387332 1487847 1482777 1417093 1333425 1171851 1030992 912289 967219 972605 985289 1127559
21484 1127559 1376117 1526235 1625034 1637749 1551820 1366158 1129202 992384 766119 633641
21474 633641 507989 446945 454492 457064 453100 409366 374548 332551 334615 324092 368660 411481
21462 411481 367825 340804 300421 345511 334706 311588 281464 280665 288528 327698 364405 347339
21450 347339 300167 306827 319871 297194 289758 275927 257279 254177 275445 249171 199397 159812
21438A59812j3981m364L5909M2013M2079J4975L0912j2693o1043j4634J9861j483
21426B37363k3824m0894Q1337K0022J8060k886L776m9787l1972M6838j6930j6275
21414B24828Q9882L6925k4598k7950m9666j1071l8109j2112n0230j5030N845K1617
21402A50331J7899r982J0639J198m869K4048k574k7385J8395N3297O3949J9982
21390C14928l9523o719M188Q910K1523M7580L5214m1241j6042K8107l2695j5677
21378C08553j3688L2690P1349K3343L3681N982L6058l9421o6958K7663K7667m0933
21366D05986j8274o354K2844r634K0399j0748o0544j6531k144l1592j4791J0239
21354B88856P36O544J394n3285n190j6721L504K3794K1817N0450M1283j6953k8335
$$ plain form
21438 159812 145831 141467 177376 219389 261468 276443 307355 294662 233619 218985 238846 237363
21426 237363 213539 172645 253982 274004 292064 289178 292954 243167 211195 258033 241103 224828
21414 224828 314710 351635 327037 299087 249421 238350 200241 188129 137899 122869 128714 150331
21402 150331 168230 158248 168887 170085 165216 189264 186690 159305 177700 230997 294946 314928
21390 314928 275405 268686 272874 281784 303307 350887 386101 344860 328818 356925 324230 308553
21378 308553 294865 327555 398904 422247 455928 461910 497968 458547 391589 419252 446919 405986
21366 405986 387712 381358 404202 394568 414967 404219 343675 327144 325000 293408 278617 288856
21354 288856 289592 296136 297530 244245 239055 222334 225838 249632 271449 321899 363182 346229 317894
21341C17894N8829o762l1826J681m2372j9899P4500J2358Q830N2164m035m9000
21329C72362j1318M0499L1300L329l7505M6028K3105J9753m104o5641k6611L4338
21317D25535M882q167q0457m3102k0965K656M2730m583j7043M5028J0207n772
21305C50949N1657k2330L0869O7631m5992l1821j5004K8328N281R515p5943m6236
21293C06904O2655K1734l0025l406l1102j6936J7019j996M0884L0097P886l681
21281D00033k2352J6063M98n597K105L8595J7214k498j8845o3080l3348P0609
21269C99397O5744j5009k5224P365J0165J3182k5945l5319Q920j6737m3719J3824
21257C56644N0795L9251J5776L6412L8970M1862J4338j895L863K8545k5521l6756
$$ plain form
21341 317894 376723 369961 338135 339816 297444 277545 352045 364403 373233 425397 421362 372362
21329 372362 361044 401543 432843 436172 398667 444695 467800 487553 483449 417808 391197 425535
21317 425535 430417 422250 341793 298691 277726 280382 323112 318529 301486 346514 356721 350949
21305 350949 402606 380276 411145 478776 432784 400963 385959 414287 419568 429083 353140 306904
21293 306904 369559 391293 361268 357862 326760 309824 326843 324847 365731 395828 403714 400033
21281 400033 377681 393744 394242 388645 390750 429345 446559 444061 425216 362136 328788 399397
21269 399397 465141 450132 424908 432273 442438 455620 429675 394356 403276 386539 342820 356644
21257 356644 407439 446690 462466 498878 537848 579710 594048 592153 596016 624561 599040 562284
21245E62284j3108M1592P1046M7892k7303L6251k633L5789n876n4455J0974L0600
21233G33053J7760p783q796l5813m3600p2279O4582K6511j8378N8499R3277n9546
21221G47487j0095N3735K7381k6450l168n651N574L366K8103k854m424L251M1179
21208H57434Q3679J07959L4363J0723k0260n9394l9654J6901N7822R008K8418
21197A086999M2382M5438L6419L6927K0485M3748P359J4026J5690J9938j6855
21186A352556q279O7024P5675J6748j1561k6297Q930L4279P0650N0934L3134P1117
21174A734910Q3489R0342P6796L8522J9337N4777P9627J64871J29142J6801L1976
21163B520590J40889J00209R0156J71562J69431K20852L02790L55039M21082K94052
$$ plain form
21245 562284 549176 590768 661814 709706 682403 718654 716021 751810 745934 691479 702453 733053
21233 733053 750813 743030 734234 698421 654821 582542 647124 673635 655257 713756 807033 747487
21221 747487 737392 791127 818508 792058 788890 783239 788813 792179 820282 817428 813004 816255 857434
21208 857434 941113 1049072 1083435 1094158 1073898 1014504 974850 991751 1049573 1058581 1086999
21197 1086999 1129381 1174819 1211238 1248165 1268650 1312398 1319757 1333783 1349473 1369411 1352556
21186 1352556 1344277 1411301 1486976 1503724 1492163 1465866 1474796 1509075 1579725 1630659 1663793 1734910
21174 1734910 1818399 1908741 1985537 2024059 2043396 2098173 2177800 2342671 2471813 2488614 2520590
21163 2520590 2661479 2761688 2851844 3023406 3192837 3413689 3716479 4071518 4492600 4786652
21153D786652K49439K01221L2096k1214M0041O1791L3609J32501K16378L88253
21143F120767N38860O24084P19977P88738Q21618P94261O83675P13526Q09993
21134A2615499Q38188R10973J102782J497304J893662K494495L223746M370755
21126B8947404N794565P791838J0689110J5189299K2075793L1489970M0525632
21119A62503611M1458639L2576714J7460401j72392j4753980k7835810l6403773
21112A74833410l1269243j7788368m658975P301119J9818671L1992702L7724104
21105B17953420L2287735J8932270J017875j5253704k9205123m1507124m2189828
21098A42035521l1768199k1259317j4239342r982107p348579n652199m509339
$$ plain form
21153 4786652 5036091 5237312 5269408 5248194 5288235 5350026 5383635 5516136 5732514 6120767
21143 6120767 6659627 7283711 8003688 8792426 9614044 10408305 11091980 11805506 12615499
21134 12615499 13453687 14364660 15467442 16964746 18858408 21352903 24576649 28947404
21126 28947404 34741969 42533807 53222917 68412216 90488009 121977979 162503611
21119 162503611 203962250 236538964 253999365 253826973 239072993 211237183 174833410
21112 174833410 143564167 125775799 121116824 128417943 148236614 180229316 217953420
21105 217953420 250241155 269173425 270191300 254937596 225732473 184225349 142035521
21098 142035521 110267322 89008005 74768663 64786556 57437977 51785778 47276439
21091D7276439l641934l019037k480769k007647j624520j270913j119587r98878
21083C1113154r20187j019931j117330j335873j645581j748115j813716j713497
21075A9798924j511875j301338j082462q94578o50988n03242m31102l40667k37000
21066A2845672k92969l64105m82526o82270p74568p34596p59512p26733o45783
21057G382610m40547l56292k72260j88866j9164N8865O9207o6452j66316k81450
21047E719335m12283m07759m56596m07688l17988k91764k19317j62430j59530
21038B883980j53080j42418j32367o6738j1281n2505q1286n7093r9890q5286o6800
21027A935236n9275p8654o9392p5823k5778J2801l0870p5073p2332j3282M6825
$$ plain form
21091 47276439 43634505 40615468 38134699 36127052 34502532 33231619 32112032 31113154
21083 31113154 30192967 29173036 28055706 26719833 25074252 23326137 21512421 19798924
21075 19798924 18287049 16985711 15903249 15008671 14357683 13854441 13423339 13082672 12845672
21066 12845672 12552703 12188598 11706072 11023802 10249234 9514638 8755126 8028393 7382610
21057 7382610 6942063 6585771 6313511 6124645 6105481 6164346 6233553 6167101 6000785 5719335
21047 5719335 5307052 4899293 4442697 4035009 3717021 3425257 3205940 3043510 2883980
21038 2883980 2730900 2588482 2456115 2389377 2378096 2325591 2244305 2187212 2087322 2002036 1935236
21027 1935236 1875961 1797307 1727915 1652092 1626314 1639115 1608245 1533172 1460840 1447558 1494383
21016A494383l3942J4721o749j4774O627L9674q5261q3474k0776m7330q8331n8491
21004A116277J0794R290J6737l9697J073P1157j4540l12L1401L3675k357L1785
20992A265283Q9599O681n0682k0205q299j6401M3289J4272L5765L9741L7344K7500
20980A463887O5855q68k1035N2596N827J6285L1084N8070J6523R855j2830r472
20968A675777J60M610q939k7960m5883O4365R6892O1907Q4144N7288K426K0848
20956A985635K3548j5844m7586P131P1569M4731P4039J02831N3862Q9084O5473
20945B454473Q3104R0750Q5428M1016O2942J33655J84763J85116K55133L34783
20935C911163L16282K45329K09417J75371J59971K9951j286N5120L2001K1880
$$ plain form
21016 1494383 1460441 1475162 1468413 1453639 1460266 1499940 1414679 1331205 1310429 1263099 1174768 1116277
21004 1116277 1127071 1136361 1153098 1113401 1114474 1185631 1171091 1170779 1202180 1235855 1233498 1265283
20992 1265283 1354882 1361563 1310881 1290676 1282377 1265976 1309265 1323537 1359302 1399043 1436387 1463887
20980 1463887 1529742 1528874 1507839 1560435 1566262 1582547 1613631 1671701 1688224 1698079 1685249 1675777
20968 1675777 1675937 1680547 1671608 1643648 1597765 1662130 1759022 1820929 1905073 1962361 1964787 1985635
20956 1985635 2009183 1993339 1945753 1952884 2024453 2069184 2143223 2246054 2299916 2389000 2454473
20945 2454473 2537577 2628327 2713755 2754771 2817713 2951368 3136131 3321247 3576380 3911163
20935 3911163 4227445 4472774 4682191 4857562 5017533 5047484 5046198 5101318 5133319 5155199
20925E155199J16322J92224K99113M40324N47723N57882N72451N45155M97389
20916H923782N78239O92405R64722J123368J143200J257088J354483J580404J894605
20907A9512296K330253L053966M170003N637509P775443J0922500J5538731K2450115
20899I1390816L1768910M0376690M1110839L1793360J6259555j276965j5272241
20892B36150964k7281462l5104675l0378947j7655737m970140O688863J8744368
20885A46193234L0869475L7603748L3150610K0088925K489251j3950284k7350167
20878B29094792l9354587m2057660l3071936k2610944j5342201j0704371p766200
20871E8186893n871679m470221l550994k849480k340579j974475j737743j599648
$$ plain form
20925 5155199 5271521 5463745 5762858 6203182 6750905 7308787 7881238 8426393 8923782
20916 8923782 9502021 10194426 11159148 12282516 13425716 14682804 16037287 17617691 19512296
20907 19512296 21842549 24896515 29066518 34704027 42479470 53401970 68940701 91390816
20899 91390816 123159726 163536416 204647255 236440615 252700170 251423205 236150964
20892 236150964 208869502 173764827 143385880 125730143 120760003 127448866 146193234
20885 146193234 177062709 214666457 247817067 267905992 270395243 256444959 229094792
20878 229094792 189740205 147682545 114610609 91999665 76657464 65953093 58186893
20871 58186893 52315214 47844993 44293999 41444519 39103940 37129465 35391722 33792074
20863C3792074j435570j303275j225416j127593j110166j233121j427456j602320
20855B3327157j662688j611574j559200j487709j286562j083617q51966o06625
20847A3177216m82003m38577m47886m36517n23942p05107p72299q14304p59232
20838G797349n89902m99667m53337l94663l51499l24084k71372j76912k13970
20829D521943k03743k04073j91566j70799j69253j89217j09323j12633j93302
20820B978034j33647j16519j64306r3958j74802j32799l8832r4316j34752j32489
20810A761614j01234j07653k5149o9858j14747m8359m0349p2006n5751k4338R633
20799A111803k3315m5847q2972m3880k9516l2507m7484o6280l7425j2780L5555
$$ plain form
20863 33792074 32356504 31053229 29827813 28700220 27590054 26356933 24929477 23327157
20855 23327157 21664469 20052895 18493695 17005986 15719424 14635807 13783841 13177216
20847 13177216 12695213 12256636 11808750 11372233 10848291 10143184 9370885 8556581 7797349
20838 7797349 7207447 6707780 6254443 5859780 5508281 5184197 4912825 4735913 4521943
20829 4521943 4318200 4114127 3922561 3751762 3582509 3393292 3283969 3171336 2978034
20820 2978034 2844387 2727868 2563562 2469604 2294802 2162003 2123171 2028855 1894103 1761614
20810 1761614 1660380 1552727 1527578 1457720 1342973 1294614 1254265 1182259 1126508 1102170 1111803
20799 1111803 1088488 1042641 959669 915789 886273 853766 806282 740002 702577 689797 725352
20788G25352p437k0094l0895l8860j1997j9579J7313l0518n4557N1904Q9508Q3719
20776G53859k6741n0069N5172N7562M5597M7107o1278r9697L153N6436L5792p1665
20764G45228o2340K5757L9049j6917l9758m9150k7261J3904M1116M1204K9303
20753G40135K3703K4421L1199m817L1986j9351k9817k9104j2652N9922R7912J07780
20741A021317J63850J92934K64126K23857K60028J99943L6129j25666k40189l34582
20731A661747k97858j71697l197O7690J24154J34911K17505K74232K67295J50702
20721B425484n8399j80681k59811k70186l29758j82163j62854k01209k9689n6214
20711F94520j51J2802j0053J691o0518n7669o7559N108k7797J0878l847l4511
$$ plain form
20788 725352 717915 697821 666926 628066 616069 596490 613803 583285 528728 580632 670140 753859
20776 753859 727118 677049 732221 789783 835380 882487 821209 721512 724665 781101 816893 745228
20764 745228 682888 708645 747694 730777 691019 641869 614608 628512 669628 710832 740135
20753 740135 763838 788259 819458 814641 846627 827276 797459 768355 755703 815625 913537 1021317
20741 1021317 1185167 1378101 1642227 1866084 2126112 2326055 2362184 2236518 1996329 1661747
20731 1661747 1363889 1192192 1188995 1256685 1380839 1515750 1733255 2007487 2274782 2425484
20721 2425484 2367085 2186404 1926593 1656407 1326649 1144486 981632 780423 750734 694520
20711 694520 694369 707171 697118 698809 638291 580622 513063 518171 490374 501252 497405 462894
20699D62894n2828N93j4181j4596K2407k9041k2823j8122j9835J6571k104k2418
20687C06517j4725L0833j5975K076j2862q4706j9242K2680j0494K1757l7122n4105
20675A34632J8950j1406k0247l0871K5139M5295M5853n8722p1388k6243P4181
20664A25173K5663j5529M119l3971o899N4454j4416p9480L9827L0336m6248J3139
20652I6168J3657P828N958O5576o9670l9366R725Q375K1367p903O140l6314j6052
20639F5489Q329Q7857l3055n6899m786N918J3061J8043L7969N3228k0956o1754
20627A12444o9013M7170O2926j1942j2623j5r23l2360n6168j6549J9567k9945
20615A2569m2444J053L8734k0947l3791J8265k2849O9537O5758N8145J2835r151
$$ plain form
20699 462894 410066 410659 396478 381882 404289 375248 352425 334303 314468 331039 328935 306517
20687 306517 291792 322625 306650 308726 295864 211158 191916 214596 204102 225859 188737 134632
20675 134632 153582 142176 121929 91058 116197 161492 207345 148623 77235 50992 125173
20664 125173 150836 135307 139426 105455 98556 153010 138594 59114 98941 129277 83029 96168
20652 96168 109825 117653 123611 189187 119517 80151 89876 98251 119618 111715 117855 81541 65489
20639 65489 73818 161675 128620 71721 66935 72853 85914 103957 141926 195154 174198 112444
20627 112444 43431 90601 153527 141585 128962 128947 128024 95664 39496 22947 42514 12569
20615 12569 -29875 -28822 9912 -11035 -44826 -26561 -49410 20127 85885 144030 156865 147714
20603A47714K4o6506m0033J8416P0668M8572n2562N9387j4549m9810n7434J8658
20591H2545n9528o3954K4916O1013L5565k7631m0377p045L0213j688K7763L3257
20579I5049n8460k8945K4787K4935m122K5201M6651l347j07296q3242L1996P5088
20567C8295J1867K3671j6476K1376M380n2532n670M908K1428M6736k1135N6772
20555A33620L054J3675K1810M4118M034k7520m7549R27J0604j3345N2430O1837
20543B57695O2279K28661K94445J70729J19827J9596j61429k12715j58843r5994
20533E24251k7092J7348O7524R7051J59698K49031M09273L79932J11918j64488
20523A824446l82174l28219k25448j21085r4298o2505L5680P0380J67836K14704
$$ plain form
20603 147714 147738 81232 41199 59615 130283 178855 126293 185680 171131 121321 63887 82545
20591 82545 23017 -40937 -16021 44992 80557 52926 12549 5504 35717 34029 61792 95049
20579 95049 36589 7644 32431 57366 53244 78445 125096 121749 14453 -68789 -36793 38295
20567 38295 50162 73833 57357 78733 83113 30581 24911 29819 51247 97983 76848 133620
20555 133620 136674 150349 172159 216277 220311 192791 145242 146169 156773 143428 195858 257695
20543 257695 319974 548635 843080 1013809 1133636 1153232 991803 779088 620245 524251
20533 524251 497159 514507 582031 679082 838780 1087811 1497084 1877016 1988934 1824446
20523 1824446 1442272 1114053 888605 767520 673222 610717 646397 716777 884613 1099317
20513A099317J68595J46203Q9497o5523p1944L9267J20453J38184J1917o9527
20503A606439j08374j65037j49969j54635l7025m7016n1505R0949J42488J99108
20493A325423K06618O2842M3069r4070j63045k07796j82015j96639j53021j03957
20483E37409k8549k8873j6411q0700n1777q4786m0364K6911K3220m722K2571j7774
20471B56155k2661K0635J5628J6465p093Q37l0264n8063M720n9760N86K1525J0179
20458A68889k6648n3409m455L7050M5050l1175n4067k3967K7194J8758M1800k1363
20446A23657l240j5991l1814k1258L311O2000O2447n0610n092L3506L1478J577
20434A89971n5214l4165L5618L6261q6694p2626q2248o096L0034L1491K2513M8888
$$ plain form
20513 1099317 1267912 1414115 1503612 1438089 1366145 1405412 1525865 1664049 1675966 1606439
20503 1606439 1498065 1333028 1183059 1028424 991399 944383 892878 983827 1126315 1325423
20493 1325423 1532041 1594883 1637952 1543882 1380837 1173041 991026 794387 641366 537409
20483 537409 508860 479987 463576 382876 331099 246313 205949 232860 256080 251358 273929 256155
20471 256155 233494 254129 269757 286222 279129 279966 249702 191639 196359 136599 137185 158710 168889
20458 168889 142241 88832 84377 121427 166477 135302 81235 57268 84462 103220 145020 123657
20446 123657 120417 104426 72612 51354 54665 116665 179112 128502 123410 156916 188394 189971
20434 189971 134757 100592 136210 172471 85777 13151 -69097 -75193 -45159 -13668 8845 57733
20422E7733O7558j2760o7687m3275l3018j1627K1762O4467P7951j5568k7799k2200
20410E5537r1470m2774K1226K1994L101q347N6631J1306m316k5227j8344l5261
20398e5944k8119P687P4620R084n995L0294L050m24n875N3039j3292L6886L0057
20385A35068l1334n8157l2575K0P174p8074n4060N2973L4688J2272N0962M2758
20373H1715l6674m4003j6671K0215m0713K0099J1773K3140m6413l0622K6970L7294
20361F110L9990N283J7924O1369M4599Q987j8539O87k9587p4695j1883L5532l9170
20348D6607K2689q61K329J0552Q142M4917J4987j03270n2596N3104O2169J053
20336A09822j5828o0049o6020j1901Q4897P4226k2010K4544O206p2561m0660k2986
$$ plain form
20422 57733 125291 112531 44844 1569 -31449 -43076 -21314 43153 121104 105536 77737 55537
20410 55537 -35933 -78707 -57481 -35487 -32386 -40733 15898 27204 22888 -2339 -20683 -55944
20398 -55944 -84063 -76376 -1756 7328 1333 31627 34677 34253 28378 81417 68125 105011 135068
20385 135068 103734 45577 13002 13022 20196 -57878 -111938 -58965 -24277 -12005 38957 81715
20373 81715 45041 1038 -15633 4582 -36131 -16032 -4259 18881 -27532 -58154 -31184 6110
20361 6110 46100 51383 69307 130676 175275 184262 165723 166410 136823 62128 50245 85777 46607
20348 46607 69296 68435 70764 81316 89458 134375 149362 46092 -6504 46600 108769 109822
20336 109822 93994 33945 -32075 -43976 40921 115147 93137 117681 123887 51326 10666 -12320
20324a2320M7608L8509k0145j7828K0298O7004M4282k3992m83n5760J9288q45
20312A05616j8829M4602k6837k1411N3820M9917K9065m5336m8606J4509J5554
20301A52064K720M8873J9869P990M4009O1612Q6081O2550J10927J79441K24827
20290A000963K17928J34876M4425N2937j14632j50336j67858j57654n8668R0481
20280H92462J38561J42594J34414J71904J16793N7208L2693r5476j40300j60909
20270A289944j30198q0413l8849j7024L3495N257l8759k0789n7161j53620j19131
20259F72752j8033l2143K687R1911M3354N1818P4838N5681M1996R704r9075j08307
20247G87183j14166j21922l6161j1335K9820r763l0938n1814k5768K8114K7104
$$ plain form
20324 -12320 35288 73797 53652 35824 56122 123126 167408 143416 142933 87173 106461 105616
20312 105616 86787 131389 104552 83141 136961 186878 215943 170607 122001 136510 152064
20301 152064 154784 203657 223526 231516 275525 337137 423218 485768 596695 776136 1000963
20290 1000963 1218891 1353767 1398192 1451129 1336497 1186161 1018303 860649 801981 892462
20280 892462 1031023 1173617 1308031 1479935 1596728 1653936 1686629 1591153 1450853 1289944
20270 1289944 1159746 1079333 1040484 1023460 1056955 1062212 1023453 1002664 945503 791883 672752
20259 672752 654719 622576 625263 717174 760528 812346 887184 942865 984861 994565 895490 787183
20247 787183 673017 551095 514934 503599 533419 523656 492718 440904 415136 443250 470354
20236D70354m6135l9773M6818P0166m1222n1419m2798J202m1511L7775k3519j8997
20224C20941K0666K3908K3114n9456k6359k7657k8346O5836N3674N4985n1234
20213C70072m1886Q619J00959M6590K615P2457R5840M2320P300j7189o9055p1105
20201E47537j8955J5638K5125K0490P0595P1450O7974J9582n5643j20156o4672
20190E78965m5772m2734p4676l4206l4168K3651k4375j9651l3057J9457J4803
20179C28237o6989l8627k6692J3841L8838K295j2386l7609p1810l0381M5762J3587
20167A58066L179J5421k353q5705r618P5725M515p44O4323L5152M5079k1797m5699
20154B35544M8363K074j4972o5901O924M5311J2594r0234J729M3984J6330J9649
$$ plain form
20236 470354 424219 384446 431264 501430 460208 408789 365991 367193 325682 363457 339938 320941
20224 320941 341607 365515 388629 329173 302814 275157 246811 312647 366321 421306 370072
20213 370072 328186 336805 437764 484354 486969 559426 655266 697586 704886 687697 618642 547537
20201 547537 528582 544220 569345 589835 660430 731880 799854 819436 763793 643637 578965
20190 578965 533193 490459 415783 381577 347409 371060 346685 327034 293977 313434 328237
20179 328237 261248 222621 195929 209770 248608 250903 238517 200908 129098 98717 144479 158066
20167 158066 161245 176666 174313 88608 78990 154715 159230 158486 222809 257961 303040 281243 235544
20154 235544 283907 285981 271009 205108 212032 257343 269937 179703 181432 225416 241746 261395
20142B61395o2818l8965j7998j2965M8516N4555M2733N2090N0213j4844j20034
20131B41878p7604k4107j7098R510m286J1351J3452J12284N9271N8674N1622L1046
20119D65993N4316N2947K1291L3144M7905O5303R85j8215k4944M6252O685J9744
20107G71406l8243J6556m9107q927j1082M9714P5592O9705M6819o4894p2180p3700
20095G11659q8309J7181L701o5470l9839j1262m1912k9423P1425K5124n9147o9578
20083D24150l7470L0505K3646K5782m240J1254J4241P4308O0786j2621j364R182
20071F18159L1482P194l2657K866J0724L5708o674K5787n11N2141J3162J3254
20059G70635L3025J0216m5966P012J8353Q034M9168O2459M3879O9022M219m8167
$$ plain form
20142 261395 198577 159612 141614 128649 177165 231720 274453 326543 376756 361912 241878
20131 241878 164274 140167 123069 132579 128293 139644 153096 265380 324651 383325 434947 465993
20119 465993 520309 573256 594547 627691 675596 740899 741884 723669 698725 744977 751662 771406
20107 771406 733163 749719 700612 691685 680603 730317 805909 875614 922433 857539 785359 711659
20095 711659 623350 640531 644232 578762 538923 527661 485749 456326 527751 552875 493728 424150
20083 424150 386680 417185 440831 466613 462373 473627 487868 562176 622962 610341 608977 618159
20071 618159 649641 656835 624178 627044 637768 673476 666802 692589 692078 744219 757381 770635
20059 770635 803660 813876 767910 774922 793275 801309 850477 912936 956815 1025837 1030056 981889
20047I81889p9839M0524J0328N1943K1886r068j2127R1903N9271P1094M4331Q9350
20035A361485l1055o5863M1440R0509K1380L8538M6963L7239O175O5507M2216
20024A654534M6413O5458M7966P8558J06660M2166K2682P8192J32352J06483P4613
20013B456077R2049R1909Q9642J47077J85081L29490L78612M11539M62621N04879
20003E148976P91674Q95699R37555Q53226Q00770Q06927R85424J356662J752895
19994A4329808K463273L494472M889935P047179J0552800J6742317K6883065M0079990
19986A26482839M2755072K3191926q096391l8533792m0036911k3363385j0120613
19979G2278745j572883N039904J2275280K2724417L9336158O4246511Q2182748
$$ plain form
20047 981889 902050 942574 952902 1004845 1026731 1017663 1005536 1097439 1156710 1227804 1272135 1361485
20035 1361485 1330430 1264567 1306007 1396516 1417896 1456434 1503397 1540636 1546811 1612318 1654534
20024 1654534 1700947 1766405 1814371 1892929 1999589 2041755 2064437 2142629 2274981 2381464 2456077
20013 2456077 2548126 2640035 2729677 2876754 3061835 3391325 3769937 4181476 4644097 5148976
20003 5148976 5940650 6836349 7773904 8627130 9427900 10234827 11220251 12576913 14329808
19994 14329808 16793081 20287553 25177488 32224667 42777467 59519784 86402849 126482839
19986 126482839 169237911 192429837 184333446 145799654 105762743 82399358 72278745
19979 72278745 70705862 75745766 88021046 110745463 150081621 214328132 296510880
19972B96510880N9799526M739468o0331159q9192383o3684911l5711488j8782787
19965I3347146q844664j996180M050759J1555981K2929270L5773549L3993921
19958A90809782J1568397j9784377m4775430l9687331k4449329j4383811q623424
19951E0674477n234201l681857l286990k971811k568081k051410j692288j592451
19943B7595388j785064j775705j685457j438642j120779q75154p32025q48010
19935A7334552j073150j176933j069227r60538r23092r05801q02834p15265o84832
19926I022880n98655n55956m67229m20117l55803l88725l91388l20141l27337
19917E197529l69136l07241k40432k81603k09994j93752j61081k42701k02145
$$ plain form
19972 296510880 356310406 361049874 300718715 211526332 147841421 112129933 93347146
19965 93347146 84502482 82506302 86557061 98113042 121042312 156815861 190809782
19958 190809782 202378179 182593802 137818372 98131041 73681712 59297901 50674477
19951 50674477 45440276 41758419 38471429 35499618 32931537 30880127 29187839 27595388
19943 27595388 25810324 24034619 22349162 20910520 19789741 18914587 18182562 17334552
19935 17334552 16261402 15084469 14015242 13054704 12131612 11225811 10422977 9707712 9022880
19926 9022880 8424225 7868269 7401040 6980923 6625120 6236395 5845007 5524866 5197529
19917 5197529 4828393 4521152 4280720 3999117 3789123 3595371 3434290 3191589 2989444
19908B989444j69499j17777r6911j03186j47262m6242o9663j92695j09162p4975
19898A862072p4352n3582q2975j23288j67324j33734l4529k6432l5973n9524n589
19887A064770p7498n7011m8516k8967l5297L1715k0860q8367p3888K899k7265
19876F41715K358n6459l5354r0443o1452J3366O1731k1628o367J3182M6252J5070
19864E21971k1868j2061m425L3793j4458j4646m638j5611m211o01j4030K8479
19852D77694N8144K0007j026j1399q537l1970K8438K9632R537j7954l8847j8998
19840D94721O222M4505n169k0269l0697o9177j680K3141R2728N2830o5189o0537
19828D61429k6925J9357l2149k2830M4017R348m9057j6304m0069K8127Q2066L9080
$$ plain form
19908 2989444 2819945 2702168 2605257 2502071 2354809 2308567 2238904 2046209 1937047 1862072
19898 1862072 1787720 1734138 1651163 1527875 1360551 1226817 1192288 1165856 1129883 1070359 1064770
19887 1064770 987272 930261 881745 852778 817481 849196 828336 739969 666081 668980 641715
19876 641715 644073 587614 552260 461817 400365 413731 475462 453834 447467 460649 506901 521971
19864 521971 500103 488042 483617 517410 502952 488306 483668 468057 463846 463245 449215 477694
19852 477694 535838 555845 554819 543420 534883 502913 531351 560983 570520 552566 513719 494721
19840 494721 500943 545448 540279 520010 489313 420136 418456 441597 534325 587155 521966 461429
19828 461429 434504 453861 421712 398882 442899 452247 403190 386886 346817 374944 457010 496090
19816D96090j7298o1633Q305m468o8540m9947o1467p211k1444R205J2691J6665
19804B50948J02613L1866o8008o1205o3733J717J3193j4946j0786J4878P7240
19793B73777J7817K0396L5225J9892J9694n0290p9791j0340J9400K4695K5342
19782C15817N339l6897j7211k4735n1947m0510j3671O6370K1925m1281J3270M3078
19770B39547l6565l4707j6659L4020N7351P278L6806J19320P2624Q6158J72784
19759G37957L35960L29847J38151j90796l24349k59852j95450n0519N4664N5067
19749F30680N3714J35566L10933M38903N20828M27149O6610l75141o46485n47227
19739A015530l26142j73583J4725N9827L1604M0980P0049K48516K97190J87726
$$ plain form
19816 496090 478792 417159 425464 420996 352456 302509 241042 233831 212387 221592 234283 250948
19804 250948 353561 385427 317419 256214 192481 194198 207391 192445 181659 196537 273777
19793 273777 291594 311990 347215 367107 386801 336511 256720 246380 265780 290475 315817
19782 315817 321156 284259 267048 242313 190366 149856 136185 202555 224480 183199 196469 239547
19770 239547 202982 168275 151616 185636 242987 250265 287071 406391 479015 565173 737957
19759 737957 1073917 1403764 1541915 1351119 1026770 766918 571468 520949 575613 630680
19749 630680 684394 819960 1130893 1569796 2090624 2517773 2584383 2209242 1562757 1015530
19739 1015530 689388 515805 530530 590357 621961 662941 732990 981506 1278696 1466422
19729A466422n7860k94671k55463k15443j58970r1615o6940k1305o1164k141L2838
19718B73688M1961J6836Q260j1929l3470o6631k3446P578q9294K908N0995j693
19706A75763l7735k2746O61j521j1940K8739n2859n6646k4863k330L824R631m5182
19693c7204Q104L9301J3613M136J4703l9650M566M4903P65m343M9846O2688k2577
19680A38851n2829p7709l3411L0827M5862K6905r751j6114k7059J0294J2127L512
19668E1505j7870m2631l9530m2322j4618O2656N8950J0323p727O54l7767r988
19656b8365j492k4823o1860O9319K6143m230l210q09k1516p030n253K8661J977
19643c2488K7682M6301o019K5434k2663l9655j7281j86O333k366m6034N9414j9360
$$ plain form
19729 1466422 1408562 1113891 858428 642985 484015 392400 325460 304155 242991 240850 273688
19718 273688 315649 332485 340745 328816 295346 228715 205269 212847 123553 126461 177456 175763
19706 175763 138028 115282 115943 114422 102482 131221 78362 21716 -3147 -5477 -1653 7978 -37204
19693 -37204 -29100 10201 23814 27950 42653 3003 7569 52472 53237 48894 98740 161428 138851
19680 138851 86022 8313 -25098 5729 51591 78496 68745 52631 25572 35866 47993 51505
19668 51505 33635 -8996 -48526 -90848 -105466 -42810 16140 26463 18736 19390 -18377 -28365
19656 -28365 -29857 -54680 -116540 -47221 -21078 -25308 -28518 -29327 -50843 -57873 -63126 -34465 -32488
19643 -32488 -4806 41495 35476 60910 38247 -1408 -18689 -18875 -12542 -14908 -60942 -1528 -20888
19630b0888J1649o872K9162l5883n904j1635k0546k2067J4080J0891M0963j3163
19618c0213n4845j7914j9411p933N2734N4015M5569J1461K8381J9192m0524l7970
19606B542M0720J902l951n793k2047R891p111k6132m6727M321K7630J5494Q867
19593c94n3714m8470K7125L45k588J6686M9948j0005k2201n2205K3060L5914n4446
19580i0945k9794O1310K4760M2556K3378J671K371K1289k9084l604j7200m2679
19568c5971j6261J816m2351j210O9603L1442J5531o3024m0128J2489r071N2830
19556b4305J2617P221p680m1686N3616J6403l0589n0967j1518O67k4833m488n9215
19543a64757j2940O8762R367K5907L3273q973m9719l262K7810J2930J2238l688
$$ plain form
19630 -20888 -9239 -16111 13051 -22832 -28736 -40371 -60917 -82984 -68904 -58013 -17050 -30213
19618 -30213 -85058 -102972 -122383 -130316 -77582 -23567 22002 33463 61844 81036 40512 2542
19606 2542 43262 45164 41213 35420 13373 23264 16153 -9979 -56706 -52385 -24755 -9261 -394
19593 -394 -54108 -102578 -75453 -75108 -77696 -61010 -11062 -21067 -43268 -95473 -72413 -36499 -90945
19580 -90945 -120739 -59429 -34669 7887 31265 32936 35307 56596 27512 23908 6708 -35971
19568 -35971 -52232 -50416 -92767 -93977 -24374 7068 22599 -40425 -80553 -68064 -77135 -24305
19556 -24305 -11688 -4467 -12147 -53833 -217 16186 -14403 -65370 -76888 -76221 -101054 -105542 -164757
19543 -164757 -177697 -108935 -99568 -73661 -40388 -49361 -99080 -102342 -74532 -61602 -49364 -53052
19531e3052J2379j3713m9574l8103j4668N3960N5331M8398n4125m0536N9314J2038
19519b2351K3133P6779J6877J1978n4354o6556j5805J2552K2798L4520j1518P2177
19507A00230m5818j8925k7592L1351N0363q344p9026o0050n3487j3660K8156Q2116
19495a4686q7628k6470N6170N1460L733m4751N1265L3226L8917M7108n4364q1985
19483b8005j4246K8306K1k9604l5198K3305L3037M2511l122j9724L2361n2777
19471b3135k8287l6232k5704P6960P506L2924J3341k1959J2188o805k6136K1926
19459c413r939l2408k2086L1064L0640m2773j7137l7585J1159R4775L6770l9956
19447h89K1748K0910m3552k7359N8692M4436l2319m4841M1636k8863n2489p328
$$ plain form
19531 -53052 -40673 -54386 -103960 -142063 -156731 -102771 -47440 958 -53167 -93703 -34389 -22351
19519 -22351 782 77561 94438 106416 52062 -14494 -30299 -17747 5051 39571 28053 100230
19507 100230 54412 35487 7895 39246 89609 81265 2239 -57811 -111298 -124958 -96802 -14686
19495 -14686 -102314 -128784 -72614 -21154 -17421 -62172 -10907 22319 61236 108344 53980 -28005
19483 -28005 -42251 -13945 -13924 -43528 -78726 -55421 -22384 20127 17005 -2719 29642 -23135
19471 -23135 -51422 -87654 -113358 -36398 -28892 4032 17373 -4586 7602 797 -25339 -3413
19459 -3413 -13352 -45760 -67846 -36782 -6142 -48915 -66052 -103637 -92478 2297 39067 -889
19447 -889 20859 41769 -1783 -29142 29550 73986 41667 -3174 38462 9599 -42890 -50218
19435e0218L0636R8873J9498K6322O9444R2744J23463J28104J96739K17971J34129
19424A087705r5466k46455j98545j19397J5704j9152L852P5801K00750K49377
19414I54174L39040M30983K62764o8651l45522l78536l46377k03435l8646p9860
19404E25934o5610n626J45001J83434K16971K02645J07785j27297k26373k45575
19394G11289j06792j15920q6602k5199M7628k3526l8619L8840P8321J12781L7621
19383F29822k4118o9409j02137k0526m9669q8059o7997k9909l9837J8506M7219
19372B03886J9226j0781k914j5998n692m4199k4684j3520n5964R850L7276o7092
19360B9394k2197j2371L2887M1078J3202J7508j2875m6742l6888J4216k107J3343
$$ plain form
19435 -50218 -19582 79291 98789 125111 194555 287299 410762 538866 735605 953576 1087705
19424 1087705 992239 745784 547239 427842 443546 424394 428246 504047 704797 954174
19414 954174 1293214 1724197 1986961 1918310 1572788 1194252 847875 644440 605794 525934
19404 525934 460324 454698 599699 783133 1000104 1202749 1310534 1183237 956864 711289
19394 711289 604497 488577 401975 376776 424404 400878 362259 401099 479420 592201 629822
19383 629822 605704 536295 434158 413632 363963 275904 207907 177998 138161 156667 203886
19372 203886 223112 212331 209417 193419 187727 143528 118844 105324 49360 59210 96486 29394
19360 29394 7197 -5174 27713 68791 81993 99501 86626 39884 2996 17212 15105 28448
19348B8448M9840k5541p9318n0811o1368M1124L5883k0986l6992K1428P3354J2397
19336a2542L8080L6401P40k0809o411m7825m4263M7321J1555j1537Q640P109N450
19323A1909m3524K336J437k9026M367N1086N1695K723l9786p8653l985J21268
19311E1847L6606r841p770j6148m3576k267K9347P024j2332j9510j884j73R705
19298B1028K5629m9676k3180P2113M0436k8130J3266j299r8012l6163j4850k0469
19286i9307K2940K1179k0474K0098M2505M132P203N22p089K3915K4210L019m0367
19273B486l6705L1451J9848p7773j1226N5113K2378m6707k0805J3393L4873o4150
19261g7824N1166j9571o4337l9938L3233L6743L3081K82k7558L2518K2922J0520
$$ plain form
19348 28448 78288 52747 -26571 -77382 -138750 -97626 -61743 -82729 -119721 -98293 -24939 -12542
19336 -12542 25538 61939 62679 41870 35459 -12366 -56629 -9308 2247 -9290 -650 6459 11909
19323 11909 -31615 -29279 -27842 -56868 -52501 -1415 50280 53003 13217 -65436 -69421 51847
19311 51847 88453 78612 70842 54694 11118 8851 38198 45222 32890 13380 11496 11323 21028
19298 21028 46657 -3019 -26199 45914 86350 58220 71486 70187 -27825 -63988 -78838 -99307
19286 -99307 -76367 -55188 -75662 -55564 -13059 -8927 -1724 -1202 -8291 15624 39834 42853 2486
19273 2486 -34219 -2768 17080 -60693 -71919 -16806 5572 -41135 -61940 -48547 -13674 -77824
19261 -77824 -26658 -46229 -110566 -150504 -117271 -80528 -47447 -47165 -74723 -42205 -19283 -8763
19249h763K1300j5062j9311m423L1623n4258o5611J4467j3346P5718M4388J911
19237H633j3230K9890k5927k2254q655o499K0842J7851l7821j2050O1626N7432
19225F9838j0207q479J9969M5653n291m7027p7327j8679j7345k4903O005L2369
19213c5424K2514j5297J0066J1672K9624m2294K7293N2574K104k1649J6458o843
19201E0798k3944l3924O54n9154k5490J5078J5846j0598P835L177k538m8164L4623
19188g5801J1588K825M8669J2345N7760N2031l6007o9967l8737K4322L382k0444
19176b8034j2385j4226M3569L1460O2646j1977k0396j4003k7122m7123k5146R669
19164e3068j11K1608j013O7427M3899J6246M5541N8029M5219j6467L365k4249
$$ plain form
19249 -8763 12537 -2525 -21836 -26259 5364 -48894 -114505 -100038 -113384 -37666 6722 8633
19237 8633 -4597 25293 -634 -22888 -31543 -38042 -17200 651 -37170 -49220 12406 69838
19225 69838 59631 51152 71121 116774 111483 64456 -12871 -31550 -48895 -73798 -67793 -35424
19213 -35424 -12910 -28207 -18141 -6469 23155 -19139 8154 60728 62832 41183 57641 50798
19201 50798 26854 -7070 -6416 -65570 -91060 -75982 -60136 -70734 -62899 -59722 -62260 -110424 -75801
19188 -75801 -64213 -61388 -12719 -374 57386 109417 73410 3443 -35294 -10972 -7590 -28034
19176 -28034 -40419 -54645 -11076 20384 83030 71053 50657 36654 9532 -37591 -62737 -53068
19164 -53068 -53179 -31571 -32584 34843 78742 94988 140529 198558 243777 227310 230675 206426
19152B06426J7826M837J2995J7656k8142q947J8540O8310J58718O1307q638L8401
19140E59289m6160j23885p4141p3518k6991J5457n986l1540M2507M1342n940J4253
19128B84687m6227q020k2472o996o6366m4793l2523j02443m4266L7792k20M2179
19116i668J1188M7377J2377n720l9o8044q892J05981L7575n7160n0555L9796J5119
19103F9335M9759o0313n2572k1834J1510K4123N925P747k6506l448J4243L6663
19091E4632K434p5409m8248l3658L5489O5215j0816o0206m0341N510Q0285N0675
19079B5562K7205j5540m6443m670L6900j4049j0961n026N9886m8339j3036K1320
19067A2809P623K1528O2538M5898N4858j01874o0210J0547n3122n9714m020j5005
$$ plain form
19152 206426 224252 229089 242084 259740 231598 222651 241191 309501 468219 529526 520888 559289
19140 559289 513129 389244 315103 241585 214594 230051 224065 192525 235032 276374 270434 284687
19128 284687 238460 230440 207968 200972 134606 89813 57290 -45153 -89419 -51627 -51847 -9668
19116 -9668 1520 48897 61274 55554 55515 -12529 -21421 84560 122135 64975 14420 54216 69335
19103 69335 119094 58781 6209 -15625 -4115 20008 25933 33680 7174 3726 17969 54632
19091 54632 57066 -18343 -66591 -100249 -64760 455 -10361 -70567 -110908 -105398 -25113 25562
19079 25562 52767 37227 -9216 -13886 23014 8965 -1996 -7022 52864 4525 -8511 12809
19067 12809 20432 41960 104498 150396 205254 103380 43170 53717 595 -59119 -63139 -78144
19055g8144K0665p237K7668L6547n36O4014k4263l592k0213p0766o6385M9035
19043g3207K8448j6874J0868m223j579j1951l273L8572N0045k4278n326L0257
19031A7479M9473o5765o315l7923n0535j8803j9502M2811J1638M770n8709k508
19019a33889J3269R197O6068K8191J5251M8900J1227l8236r4900p7602Q7749Q9985
19007B5210p975m3457j9488l3136R533N3405O8029K787r0118k0869O3039k1465
18995a4505J726K2396p8758l4018l2024p886Q7213O2941k3097k1282k3119l1229
18983i1642k3364j9397L3819M1568O8446k5267q410k1331R01p4941l247P9019
18971d3846N186j4405l5199k9009K6184l328L6531j8365k2893K105j4470L5372
$$ plain form
19055 -78144 -57479 -64716 -37048 -501 -1037 62977 38714 35122 14909 -55857 -122242 -73207
19043 -73207 -44759 -61633 -50765 -54988 -56567 -68518 -71791 -33219 16826 -7452 -12778 17479
19031 17479 66952 1187 -5128 -43051 -93586 -112389 -131891 -89080 -77442 -72672 -131381 -133889
19019 -133889 -120620 -111423 -45355 -17164 -1913 46987 58214 19978 -74922 -152524 -64775 25210
19007 25210 17235 -26222 -45710 -78846 -69313 -15908 52121 54908 -35210 -56079 6960 -14505
18995 -14505 -12779 9617 -69141 -103159 -135183 -143069 -55856 7085 -16012 -37294 -60413 -91642
18983 -91642 -115006 -134403 -100584 -59016 9430 -15837 -24247 -45578 -44677 -119618 -122865 -43846
18971 -43846 -38660 -53065 -88264 -117273 -91089 -94417 -57886 -76251 -99144 -97039 -111509 -76137
18959g6137L7105l1361N3810K5015k4979l1127M0698l5868J9205K5884q058p75
18947f588R705j9504K624J3742j7883J6426L1600j7049o0636l4946N7939L9743
18935A5173O600k910k0367L4386K6525k7112r1964k3699N3603L4103l8952o2416
18923i7030M6962J6518K0080m6171j3758l733K4681P0489M7958R661l9598j7048
18911A9011O977K8279k0714n5727R472M0248J5751J1484J2620j3476n8876m9494
18899e4445O0213O9667L9968q5495q6187M6321P8006j5256j6187m7397j2073q024
18887c0889J8643R493K365J6585l521O677L4530m0793O901K5806k0919p23l9326
18874a5171m3185K4290K0713n064N3075j5016l1969M7798k4784m1574M1964k1180
$$ plain form
18959 -76137 -39032 -70393 -16583 8432 -16547 -47674 -6976 -42844 -23639 2245 -5813 -6588
18947 -6588 3117 -16387 -13763 -21 -17904 -1478 30122 13073 -47563 -82509 -24570 15173
18935 15173 21773 18863 -1504 32882 59407 32295 -59669 -83368 -29765 4338 -34614 -97030
18923 -97030 -50068 -33550 -13470 -59641 -73399 -77132 -52451 18038 65996 75657 36059 19011
18911 19011 25988 54267 33553 -22174 -12702 27546 43297 54781 67401 53925 -4951 -54445
18899 -54445 5768 75435 115403 29908 -56279 -9958 68048 52792 36605 -10792 -22865 -30889
18887 -30889 -12246 -2753 -388 16197 12676 19353 53883 13090 19991 45797 24878 24155 -15171
18874 -15171 -58356 -34066 -13353 -18417 34658 19642 -12327 35471 10687 -30887 11077 -10103
18862a0103m3866L372K6831n943M686k2172j8639N2521k5526k7513l438J8757
18850e1033k6410J4972K628L4873j7577m9457k3368M0152O8469N3695R682k93
18838E6333n5064k1916L6633o928o5989K600M7509o089l696l6071J6446j9212
18826e5444L7643N2223k3045n0592J6142J4249K6747M1305k3621n4940K2355O7518
18814G0540L2173l4897m3231p876J3413o6119r2347J427N6360K1963K9458J5106
18802d030L128k2967n7895n4226J8290N4310J7865m6371m9331L4746N695J4904
18790h5882l853O4559J1800J4043l5780p046k9086O263N1426P850o6467o640L5647
18777d3166L8247P463l5059L4479m7945o676M1971J11206R8389J00907Q7728M5131
$$ plain form
18862 -10103 -53969 -50597 -23766 -29709 -25023 -47195 -65834 -13313 -38839 -66352 -69790 -51033
18850 -51033 -77443 -62471 -59843 -24970 -42547 -92004 -115372 -75220 -6751 46944 56626 56333
18838 56333 1269 -20647 15986 9058 -56931 -54331 -6822 -12911 -16607 -52678 -36232 -55444
18826 -55444 -17801 34422 11377 -39215 -23073 -8824 17923 59228 35607 -19333 3022 70540
18814 70540 102713 67816 24585 16709 30122 -35997 -128344 -126917 -70557 -48594 -19136 -4030
18802 -4030 -902 -23869 -81764 -135990 -117700 -63390 -45525 -91896 -141227 -106481 -100786 -85882
18790 -85882 -89735 -25176 -13376 667 -35113 -42159 -71245 -64982 -13556 -5706 -72173 -78813 -43166
18777 -43166 -4919 2544 -32515 1964 -45981 -52657 -10686 100520 198909 299816 387544 432675
18765D32675l6664j16057m2744n8745q3684o5575K141K4750O866k9310k961K5562
18753E6254N9720k6395k9252r052l722o900m7398K7528M1239k2736m4386L7670
18741C2570M1246n4333l0546M0982M6840j7414l1587J234q862L9166l5244J19
18729B4171L3762k486k6897l3580M194L7306k2638l9226n0284k7919L4805l1295
18717a00087m4969O3095J435m0992O4176M9133M2913M403k9716m2722m2320N553
18705g0098j7498j4159J4413J7137K6683O1400K9371L8150m7961r426j3084n6340
18693d1412p223j8122k2160L9522K2127k1266m5683N0936N2800l1773k7221k5369
18681g4844L9708Q4655l9490K3683l9945n8303J8868K2500N5385j2447l9007m1871
$$ plain form
18765 432675 396011 279954 237210 178465 94781 29206 31347 56097 62963 33653 30692 56254
18753 56254 115974 89579 60327 51275 47553 40653 -6745 20783 62022 39286 -5100 32570
18741 32570 73816 19483 -11063 29919 76759 59345 27758 28992 20130 59296 24052 24171
18729 24171 57933 55447 28550 -5030 -836 36470 13832 -25394 -75678 -103597 -68792 -100087
18717 -100087 -145056 -81961 -80526 -121518 -57342 -8209 34704 39107 9391 -33331 -75651 -70098
18705 -70098 -87596 -101755 -87342 -70205 -43522 17878 47249 85399 37438 28012 14928 -41412
18693 -41412 -48635 -66757 -88917 -49395 -27268 -48534 -94217 -43281 9519 -22254 -49475 -74844
18681 -74844 -35136 49519 10029 33712 -6233 -64536 -45668 -23168 32217 19770 -19237 -61108
18669f1108p0115J7652O8160M8966J6050J3966p0328o129j2346q841j9613J8185
18657f5501N2150m4539J2972K3230j8132k4683J6420k6967k6799k981Q0425K6139
18645A734p094M2891n2473k4206L2006L6695l1135L4600j098l8361n7987m4715
18633a09143J6926j8296O8642P2890p0959K5320M991p1346n9722M5213M317K2940
18621f8227M7499l3022o6214J7356M4457m9204L769Q0063J5313k8472N8030k3856
18609b508o213k1091m0818l4670l2173j908M1076P933R097R70M2810j1546J3006
18596c6035K5468j1657n7720N2737J09910J3026l0397j5385m2567m0885m3422
18585g6927M1492J3841K78M1818k6649m6360J8264J1972K6001K2765l9845k0607
$$ plain form
18669 -61108 -131223 -113571 -45411 3555 19605 33571 -36757 -42886 -55232 -64073 -83686 -65501
18657 -65501 -13351 -57890 -44918 -21688 -39820 -64503 -48083 -75050 -101849 -104830 -24405 1734
18645 1734 -5360 37531 -14942 -39148 -7142 29553 -1582 33018 31920 -6441 -64428 -109143
18633 -109143 -92217 -110513 -41871 31019 -39940 -14620 -9629 -80975 -140697 -95484 -91167 -68227
18621 -68227 -20728 -53750 -119964 -102608 -58151 -107355 -103586 -23523 -8210 -36682 21348 -2508
18609 -2508 -8721 -29812 -70630 -105300 -137473 -139381 -98305 -90372 -81275 -80305 -37495 -49041 -36035
18596 -36035 -10567 -22224 -79944 -27207 82703 95729 65332 49947 7380 -33505 -76927
18585 -76927 -35435 -21594 -21316 20502 -6147 -52507 -34243 -22271 3730 26495 -13350 -33957
18573c3957N3597K4819o143l638M26Q838o9936o1144K5670R753J2982N3662k3138
18560h209K9692k5571n0864L4299k6041k7858l8486k8750M0461J9294K5030K7168
18548b9835K3914k2677p3148O787L0228o77m9237o758l4340L9322J01098L1366
18536A6043r690J88J5237n2694L231N3048L2696J9093j0039k876j7875j4079m472
18523B7811k6722l6372n2936L3181O1622M534j1957M800p6990q2380M7409M2041
18511f5959J3498K9431j2967m8964J941K3956k2581K5963O6929K2331n5427m0676
18499f2525o728Q770l2343k3894L3097K8488O6867j0848n7573m3228j8621N069
18487a13469L7546Q514J2393K3012L4485J0461k6503n6045j2528J08433K8381
$$ plain form
18573 -33957 19640 44459 38316 34678 35104 43942 -25994 -87138 -61468 -51715 -38733 14929 -8209
18560 -8209 21483 -4088 -54952 -20653 -46694 -74552 -113038 -141788 -101327 -82033 -57003 -29835
18548 -29835 -5921 -28598 -101746 -94959 -64731 -65408 -114645 -121403 -155743 -116421 -15323 16043
18536 16043 6353 6541 21778 -30916 -27685 25363 58059 77152 67113 64237 46362 32283 27811
18523 27811 1089 -35283 -88219 -55038 6584 11118 -839 3961 -73029 -155409 -108000 -65959
18511 -65959 -52461 -23030 -35997 -84961 -83020 -59064 -81645 -55682 11247 33578 -21849 -62525
18499 -62525 -69253 -60483 -92826 -116720 -83623 -55135 11732 884 -56689 -99917 -118538 -113469
18487 -113469 -75923 -67409 -55016 -32004 2481 12942 -13561 -69606 -82134 26299 54680
18476E4680o2380p4644M80N4631m004K0314M748m1766N1142K5324j009n3365m239
18463c0088K8856J9644j8749M080j4255r0463m4266L7062L3708P025L0244O3778
18451B6576M0136n9450P168J0325k2408l8678l5105M5037M1622K1462j0292J2487
18439C8880j5526j5644l325N214Q963O2573o6819j25113J3723M899O4545K3500
18427d130L730j8802j9367R4395p835k731J6383l0429J6015R500k8027l1526L8421
18414C5597J4708n5990l5240o473n864l1352L6569l0989m06L0516M8411L2649
18402C2136n2428l3518N6268O891L3730j4568m873j9689n902N3230J3260l6232
18390B8305o182l4562K7164N4816n4039J7367N2400j7458m4808k5372l6038J496
$$ plain form
18476 54680 -7700 -82344 -81864 -27233 -31237 -10923 -6175 -47941 3201 28525 27516 -25849 -30088
18463 -30088 -1232 18412 -337 3743 -10512 -100975 -145241 -108179 -74471 -67446 -37202 26576
18451 26576 66712 7262 14430 24755 2347 -36331 -71436 -26399 15223 36685 26393 38880
18439 38880 23354 7710 4385 9599 18562 81135 14316 -110797 -97074 -92175 -27630 -4130
18427 -4130 -400 -19202 -38569 55826 47991 45260 61643 31214 47229 56729 28702 -2824 35597
18414 35597 50305 -5685 -40925 -47398 -53262 -84614 -48045 -79034 -79440 -48924 -513 32136
18402 32136 -20292 -53810 2458 9349 43079 28511 23638 3949 -1953 51277 64537 28305
18390 28305 22123 -12439 14725 69541 15502 32869 85269 67811 23003 -2369 -38407 -36911
18378c6911M846L6108k7955k4295j6533K1008Q06j0576l5280L856M4085J1038
18366b9803k8741m633L5599l0026O523K0032K7302l5939o5010M6785O9292J8814
18354C0195n1203N175L4850l7843l4230P1264J1390l8448k9289l1117K697J9975
18342d6584R636L116k7989K934L9024k1750p0772o950Q0329N9039O46m4095J6120
18329g296j4430k8623r780N946Q6819Q3920k1826M4810o956p0490l4184Q266q3493
18316d7317k9821l030J2131L9241L3709M3110K8513j3056m1301m9485j8500j9320
18304f5126L0002J4858o0575K3037P706j4086J450j7528q632K8909N6888Q078
18292D981m7102k4570J7987O1672J8690k1606j9353K0323j2410n2911Q777M5713
$$ plain form
18378 -36911 -32065 4043 -23912 -48207 -64740 -43732 -42926 -53502 -88782 -84926 -40841 -29803
18366 -29803 -58544 -63177 -27578 -57604 -51081 -31049 -3747 -39686 -104696 -57911 11381 30195
18354 30195 -21008 -15833 19017 -18826 -53056 18208 29598 -8850 -38139 -69256 -66559 -46584
18342 -46584 -36948 -33832 -61821 -58887 -19863 -41613 -112385 -119335 -39006 20033 20679 -23416 -7296
18329 -7296 -21726 -50349 -60129 -54183 32636 116556 94730 139540 132584 62094 27910 36176 -47317
18316 -47317 -77138 -80168 -68037 -28796 4913 48023 76536 63480 22179 -27306 -45806 -65126
18304 -65126 -35124 -20266 -80841 -57804 -50098 -64184 -62734 -80262 -88894 -59985 -3097 4981
18292 4981 -42121 -66691 -48704 12968 31658 10052 -9301 11022 -1388 -54299 -45522 191
18280A91k3142L8J6004K3806M813o5206P815n592J2212N4277m8276k5224k019
18267e0303M8720M9864K2055l0452k2918j2337l6378k8699l053k3445R43L5695
18255e0308K1476M1066J5828L3828K5802j8077Q360l1297n7406q866M1739O8313
18243I0458n8792n2407N2533R4843j867K2381N539M925r0492l97M6040J1771J8028
18230A42563o1676q0436k8560l75o703N9096L868k7934J940l9338l8928J1639
18218f4844N4710N706p0441r481q613J1035N009P9441J8640Q2513J2059m0214
18206G5520k6669l4928K4547j6879m9015m9767j0785R2204L8397M3420J1580k5746
18194G1879j2292O058l0328M6541K5410M2991k997j101L9187l9876l8581L8545
$$ plain form
18280 191 -22951 -22913 -6909 16897 21710 -43496 -35681 -41273 -29061 25216 -23060 -48284 -50303
18267 -50303 -1583 48281 70336 39884 16966 4629 -31749 -60448 -63501 -86946 -86003 -50308
18255 -50308 -28832 12234 28062 61890 87692 69615 77975 46678 -10728 -19594 22145 90458
18243 90458 31666 -20741 31792 126635 124768 147149 152688 157613 67121 66724 112764 124535 142563
18230 142563 80887 451 -28109 -28484 -35187 23909 27777 -157 1783 -37555 -76483 -64844
18218 -64844 -10134 -4428 -74869 -84350 -92963 -81928 -76919 2522 21162 103675 115734 75520
18206 75520 48851 13923 38470 21591 -27424 -77191 -87976 4228 42625 86045 97625 71879
18194 71879 59587 65645 35317 81858 107268 150259 147262 146161 185348 145472 106891 145436
18182A45436j7892o4049k972k743J0196J3803P62m19N1288o996J1923J2617L1512
18169A82466q691m889n6241N0324N8190k6397j1842L4791m2193n6839L8329L8692
18157A95700P9845k0690m5280L2240L7386n3588n9147Q9822J33168n965k6112
18146C57379p2420k2596K680L9861Q5728j0251l6926J01030M1465n1953J3408
18135D47405l5577q647M0042R3188J27504J15274P6460J04386Q1604J22914J96884
18124A361437K55244K95917L34247M01776M59244N86989P75306R98614J393123
18115F861897K042889K945903M549483P437892J2286140J9656251K3198858J4160699
18107I3140012k707004k0833495k4489763j5550187q770405n164080l244800k127792
$$ plain form
18182 145436 127544 63495 60523 57780 67976 81779 82541 82122 133410 126414 138337 150954 182466
18169 182466 173775 168886 112645 162969 221159 194762 182920 217711 175518 118679 157008 195700
18157 195700 275545 254855 209575 241815 279201 225613 166466 256288 389456 383491 357379
18146 357379 284959 262363 265043 304904 390632 380381 343455 444485 485950 433997 447405
18135 447405 411828 403181 443223 536411 663915 779189 855649 960035 1041639 1164553 1361437
18124 1361437 1616681 1912598 2246845 2648621 3107865 3694854 4470160 5468774 6861897
18115 6861897 8904786 11850689 16400172 23838064 36124204 55780455 78979313 93140012
18107 93140012 90433008 69599513 45109750 29559563 20789158 15625078 12380278 10252486
18099A0252486j418262j071843q04300m98103l74413l41452k56662j97803k06185
18090E083463j70718j26181o9873L6810k014k15694k68822l17125l50148k66169
18080C333529k06431k68812k39837j89884j85138j96223j32024j51094r4960p1608
18070A597518j01507n6778j48910j24766j9402k3396r7504j50250r8356m8091
18060G28558m8631o092r714l0179j9301q8208j7150L3162l3108r8859q8779o412
18048C15287M6564L0366n5719m2515m459L8534k9856j8507K1614l8406k9936q5112
18036A47855k9605M0569l9521q523k4225M0757j8085L0478M4039K5663J4755n6234
18024A67923o9429L730L2020m720k1630p6184K2271k4147P974L7353l4766k9065
$$ plain form
18099 10252486 8834224 7762381 6958081 6459978 6085565 5744113 5487451 5289648 5083463
18090 5083463 4912745 4786564 4716691 4753501 4751487 4535793 4266971 3949846 3599698 3333529
18080 3333529 3127098 2858286 2618449 2428565 2243427 2047204 1915180 1764086 1669126 1597518
18070 1597518 1496011 1439233 1290323 1165557 1146155 1122759 1025255 875005 776649 728558
18060 728558 679927 673835 664121 633942 614641 526433 509283 542445 509337 410478 321699 315287
18048 315287 361851 392217 336498 293983 289524 328058 298202 279695 301309 262903 232967 147855
18036 147855 118250 158819 119298 110775 86550 127307 109222 139700 183739 209402 224157 167923
18024 167923 98494 102224 134244 129524 107894 31710 53981 29834 37808 75161 40395 11330
18012A1330O5550j3668l9501n276M4070K8038J69n7708l0852J0322j7464J1427
18000F437l6794M374O448j3522L8973P1407R655p1722j7271L7773J0795K6273
17988G2826N7980J3367o7207L0696K1976m8645l7942M1476J3133k2498m9902N653
17976C0913M1640k4566l1198L892k3777K1356J7249N8090j7970K02p707j5942
17964E2182J5910k6433r646J9472l2024l5690J4125N0957J3236l1960J9254k4463
17952B4920k2362j8600L1400J6760j5790N2171k6056k3383O8261j0181K6721n193
17940I8668n3805l0273m4118j588J5036J07392R2140o511m0536m1186o1495j8565
17928A5159l641j4054j562k6738K2681r666J3559J1414P1232P125j6447m7748
$$ plain form
18012 11330 76880 63212 23711 18435 62505 90543 90712 33004 2152 12474 -4990 6437
18000 6437 -30357 -25983 -19535 -33057 5916 77323 86978 15256 -2015 35758 46553 72826
17988 72826 130806 144173 76966 107662 129638 80993 43051 84527 97660 75162 25260 30913
17976 30913 72553 47987 16789 20681 -3096 18260 35509 93599 75629 75831 68124 52182
17964 52182 68092 41659 32013 51485 19461 -16229 -2104 48853 62089 30129 49383 24920
17952 24920 2558 -16042 15358 32118 16328 68499 42443 19060 87321 77140 103861 98668
17940 98668 44863 14590 -29528 -31116 -16080 91312 183452 176941 136405 95219 33724 15159
17928 15159 11518 -2536 -4098 -30836 -8155 -17821 -4262 7152 78384 85509 69062 21314
17916B1314k6679Q629M4586n284k8056k1095R839J6995P138l6940k6806k1566
17904e7925k6042l351J589L1373P255m0057m5228l2319M1391J06002Q378L4190
17892B5256O304l0638j938R5753N7145n1335n6187p1642O290J2697M875J046m3677
17879d6051M4361l5225m4644M1842N6466J6939n8276l1175k0115R99M9876m5389
17867g0392j1640l407M5965K9097j0895k874k290p683l4520m6964N6129k4724
17855h4198K6391K0449J9737L9605j2035K2932M0783j6680p6902k65L4579J7412
17843C1808m7184n5996k1221l4096j4820N3183j0831N4116L3518n0314j5608J1056
17831f6389K6876j6710q1495p714O1093K3194J2930O987M2387J3848K574n4383
$$ plain form
17916 21314 -5365 3264 47850 42566 14510 -6585 3254 20249 27387 -9553 -36359 -57925
17904 -57925 -83967 -87318 -85729 -54356 -47101 -87158 -132386 -164705 -123314 -17312 -8934 25256
17892 25256 31560 922 -1016 94737 151882 100547 44360 -27282 -20992 -8295 -3420 -2374 -46051
17879 -46051 -1690 -36915 -81559 -39717 16749 33688 -24588 -55763 -75878 -74879 -25003 -70392
17867 -70392 -82032 -85439 -39474 -10377 -21272 -24146 -26436 -34119 -68639 -115603 -59474 -84198
17855 -84198 -57807 -37358 -17621 21984 9949 32881 73664 56984 -19918 -20183 14396 31808
17843 31808 -15376 -71372 -92593 -126689 -141509 -88326 -99157 -45041 -11523 -61837 -77445 -66389
17831 -66389 -39513 -56223 -137718 -145432 -84339 -61145 -48215 -41228 1159 15007 17581 -36802
17819c6802l0506l444j5360L3471M0753j0676k8798j6515j9105N0092P4902l7420
17807E92j0508p147p265J805L8297L8779O2515j2455k5767J3039J6927l1700m3735
17794C3377l8134J7345m5534n6714M2545O9257O6403j5857j4091m1623m4161J3157
17782a4030J8845J7390n0825j754K1520M2303K6153o6796j7381P159J1183K5051
17770A8818J2752J2091o4869q4324p425O7762M7824k9221o2944p346J12198J429
17758A6745k1883l424o9570n8340K4945P4050M6996L1834K5386m6263o0039J664
17746c7899N9750J5401r4443k9567M7896O1019k356p060J5540j1448l1369J460
17734a3076L3937n356j4393l238m7543k6678m4904J5766L1791K6126k4079J931
$$ plain form
17819 -36802 -67308 -70752 -86112 -52641 -11888 -22564 -51362 -67877 -86982 -36890 38012 592
17807 592 -9916 -17063 -24328 -22523 15774 54553 117068 104613 78846 91885 108812 77112 33377
17794 33377 -4757 12588 -32946 -89660 -47115 22142 88545 72688 58597 16974 -27187 -14030
17782 -14030 4815 22205 -28620 -30374 -8854 33449 59602 -7194 -24575 -17416 -6233 18818
17770 18818 31570 43661 -21208 -105532 -112957 -45195 2629 -26592 -89536 -96882 15316 16745
17758 16745 -5138 -8562 -78132 -136472 -111527 -37477 9519 41353 66739 20476 -39563 -37899
17746 -37899 21851 37252 -57191 -86758 -38862 22157 19801 12741 28281 16833 -14536 -13076
17734 -13076 20861 15505 1112 -2126 -49669 -76347 -121251 -105485 -73694 -47568 -71647 -69716
17722f9716R769j7568j187N085N1336J9091l2726p3094K9716Q9312K1524n2860
17710b1318m917J04104k0726m6153l0407l1057M2205J3884l8676O332M9195m0152
17698a7686o0986m7607P2163L1605J9031j2046j987j6283R677M7582K4843n7885
17686i579L966M4332j575l8764J7829K5804L3731p086l3695k7709j4347p523P143
17673g473k2618R946L0961O300l4461k2359j8463j8982l7662L7268M240J2641
17661f0662k096j8151O031K173M4610J005n1688L5899N0501M2426j1953k6109
17649A1986r135K238K1773k7319j6423l1004j9159l882L7609K4422K6760O8418
17637H6284k3796m3715q761Q758j639j9339o859l1364q9809L8110J47633m8325
$$ plain form
17722 -69716 -59947 -77515 -78702 -73617 -22281 -3190 -35916 -109010 -79294 10018 31542 -21318
17710 -21318 -26235 77869 57143 10990 -19417 -50474 -8269 5615 -33061 -26729 22466 -17686
17698 -17686 -78672 -126279 -54116 -22511 -3480 -15526 -17513 -33796 -24119 23463 48306 -9579
17686 -9579 -5613 38719 37144 -1620 16209 42013 75744 68658 34963 7254 -7093 -14616 -7473
17673 -7473 -30091 -20145 10816 17116 -17345 -39704 -58167 -77149 -114811 -77543 -73303 -60662
17661 -60662 -62758 -80909 -74878 -72705 -28095 -27090 -78778 -42879 7622 50048 38095 11986
17649 11986 2851 5089 26862 -457 -16880 -47884 -67043 -70925 -33316 -8894 17866 86284
17637 86284 62488 18773 10012 18770 17131 -2208 -9067 -40431 -130240 -92130 55503 7178
17625G178k1107k370k6811j1314R303K9688P061n0909j7700m870N465K7824K0014
17612b8548r828k1498k6123M967N5223M5625k5654o0927k6834J9709M3683J9470
17600a0735M3658R522L4737J2148j2970l018l7115l7370J3856L0835q9242j1091
17588e6785M6631P662m250J2373O208m8353L2220k9740l5613J7638K4373r575
17576c7211k3794k317L1596K8036o932k9633j7588K5011L0954J4424o3667J4096
17564c7025M2055L618p0879j2942Q703K7514M634p318J7584l3985K163k6446L2562
17551d9762K7963j9074o134L3621r979K8491M47J2158L1619n5979l6369k8795
17539g1793j2209K8552J3039N6795J2584o0371J6735J5095P545L3559P7212k7832
$$ plain form
17625 7178 -13929 -16299 -43110 -54424 -45121 -15433 -8372 -59281 -76981 -81851 -76386 -48562 -28548
17612 -28548 -38376 -59874 -85997 -81030 -25807 19818 -5836 -66763 -93597 -73888 -30205 -10735
17600 -10735 32923 42445 77182 89330 76360 73342 36227 -1143 12713 43548 -45694 -56785
17588 -56785 -10154 -2492 -6742 5631 11839 -36514 -4294 -34034 -69647 -52009 -27636 -37211
17576 -37211 -61005 -63322 -31726 -3690 -10622 -40255 -57843 -32832 -1878 12546 -51121 -37025
17564 -37025 5030 8648 -62231 -75173 -66470 -38956 -34322 -41640 -24056 -58041 -55878 -82324 -49762
17551 -49762 -21799 -40873 -47007 -13386 -23365 5126 5573 17731 49350 -6629 -42998 -71793
17539 -71793 -84002 -55450 -42411 14384 26968 -33403 -16668 -1573 5972 39531 116743 88911
17527H8911r7028r795J7823L3947n1491o5720l5725j9540M61M5503L0416n167
17515f7405k593L0336J4861O0091L7312o0324m4995l3233k2813J4798K7867n239
17503e1337J4790k5334k6707J05334L5105j7199j8927J1899m9119k0228M0084
17492a639m7799k1254O1854J4104l8714n7115M7904N2357n1348j3114L6894J2896
17480d974K4652L4196L4315R454j4379j0358n0325k4113l9182L0819O2061k7343
17468B4823J6491J7486j6413m8589j3000l1413m5195l3109q064J1126J00621K5296
17456F0q661n25J8078q1529k3821N015M2450j409N4133N5737M8013O6457P8419
17443B52417J34315J13977L1702p9822j39673j18961q4141k1207k125N7987P445
$$ plain form
17527 88911 -8117 -17912 -89 33858 -17633 -83353 -119078 -138618 -138157 -92654 -62238 -67405
17515 -67405 -69998 -39662 -24801 35290 72602 12278 -32717 -65950 -88763 -73965 -46098 -51337
17503 -51337 -36547 -61881 -88588 16746 51851 34652 15725 27624 -21495 -41723 -1639
17492 -1639 -49438 -70692 -8838 5266 -33448 -90563 -42659 9698 -41650 -54764 -17870 -4974
17480 -4974 19678 53874 88189 97643 83264 72906 22581 -1532 -40714 -9895 52166 24823
17468 24823 41314 58800 42387 -6202 -19202 -50615 -95810 -128919 -136983 -125857 -25236 60
17456 60 -8601 -9126 8952 -72577 -96398 -91383 -48933 -50342 3791 59528 107541 173998 252417
17443 252417 386732 500709 532411 452589 312916 193955 109814 88607 86482 144469 151914
17432A51914j5204l925n4987j0274k6614m2341m2724n6221L0284J1942J5291j713
17420d4572l500R513n4621L0232N7798K9229J4760j0274j4146p603l8225l768
17408c5177K7663J5832j2356l0548l6929L3129J3348M6765j3101k9406O7127L8160
17396H4507q852J724j9292o1022q5783L9590K7203M2283Q116j6284l5977l4633
17384e8420P5434R2630k5190q6273m2815q3595Q0P4410N8109J1625Q679M2918
17372F7592M6074k6005m0097q6194j3899J4243K7085r443j0746k1140n188M7035
17360a0683K1923K2081P709l9025j3113m8328n2031K9871n584n262L2506M4114
17348a5822j7215r4N3315N1173k0348j5949K0566n5359N917r611j4505K44O3354
$$ plain form
17432 151914 136710 132785 77798 67524 40910 -1431 -44155 -100376 -70092 -58150 -42859 -44572
17420 -44572 -48072 -38559 -93180 -62948 -5150 24079 38839 28565 14419 6816 -31409 -35177
17408 -35177 -7514 8318 -4038 -34586 -71515 -38386 -25038 21727 8626 -20780 46347 84507
17396 84507 75655 77379 58087 -2935 -88718 -49128 -21925 20358 28474 12190 -23787 -58420
17384 -58420 17014 109644 84454 -1819 -44634 -128229 -128149 -53739 4370 15995 24674 67592
17372 67592 113666 87661 47564 -38630 -52529 -38286 -11201 -20644 -31390 -52530 -57718 -10683
17360 -10683 11240 33321 41030 2005 -11108 -59436 -111467 -81596 -87180 -92442 -59936 -15822
17348 -15822 -33037 -33131 20184 71357 51009 35060 55626 267 6184 -3427 -17932 -17688 45666
17335D5666m009l2475k0204m3669L0345N8198l2847l7059j9079j0106K9977O4928
17323B9666j2680Q568m5712P705j3602n2926N15K1671J8949L7699J6187k8646
17311a2606O2921q117l4126n75j4112q0357l7273l0061J8150J4989Q7140L7595
17299C568L2659P334l7424J221l7872j1321J0778J5600O311J9801L8229m665l5241
17286H978L8534k0648M627n2898L5883N6177k4575r6508n8523J3076M3966K4564
17274b7347K0627l9132L7873K2433k1049K5276L5609L0735j2764l7616o345J9847
17262D8147o9497q941l0928L4157N2584j2957n22N0863M5388j460q895l4121m1380
17249B2438k3201o221L2029M2604l5503k4363k084K7830m2064k4144L3916N1297
$$ plain form
17335 45666 41657 9182 -11022 -54691 -24346 33852 1005 -36054 -55133 -65239 -35262 29666
17323 29666 16986 25554 -20158 -12453 -26055 -78981 -78466 -56795 -37846 -147 16040 -12606
17311 -12606 50315 42198 8072 7497 -6615 -86972 -124245 -154306 -136156 -121167 -34027 3568
17299 3568 36227 43561 6137 7358 -30514 -41835 -31057 -15457 -9146 10655 48884 44219 8978
17286 8978 47512 26864 31491 -21407 14476 70653 46078 -50430 -108953 -95877 -51911 -27347
17274 -27347 -6720 -45852 -7979 14454 -6595 18681 54290 85025 72261 34645 28300 48147
17262 48147 -21350 -30291 -61219 -27062 25522 12565 12043 62906 108294 106834 97939 63818 22438
17249 22438 -763 -6984 25045 67649 32146 7783 5699 33529 -8535 -32679 1237 52534
17237E2534p781k1133K3963k2425k485J7472K8528j3888K219j8675K4055k7439
17225C4945k1694L3539K2148n0143L7717j9017q533m9386n241n966j2707j3892
17213e8230r340M3016K7841l7730m3038K0425J5615l2339q85K4000R361J141r642
17200d9805M8285N2992J7065j6666q8789o2497K4523J7842n4436R609L1279N2966
17188a7632R2227K4134j1046k4963p6546o1118j7254N2768k4913J8913K6554J3315
17176e561J149J8984j5530K8262J8412L8921k638n5540l8384Q295J4399p5477
17164f4708k2138N7255k6844l1460L3332J5533K2595j5172n980l5923o7069L9440
17152a01139R8036O8420M8769K7571l3098J284q9632n0554K677L7218K2681j8904
$$ plain form
17237 52534 44753 23620 47583 25158 22673 40145 68673 54785 57004 38329 62384 34945
17225 34945 13251 46790 68938 18795 56512 37495 28962 -20424 -25665 -31631 -44338 -58230
17213 -58230 -67570 -24554 3287 -34443 -77481 -57056 -41441 -73780 -74665 -50665 -41304 -40163 -49805
17200 -49805 -1520 51472 68537 51871 -36918 -99415 -74892 -57050 -111486 -101877 -70598 -17632
17188 -17632 74595 98729 87683 62720 -13826 -74944 -92198 -39430 -64343 -45430 -18876 -5561
17176 -5561 -4412 14572 -958 27304 45716 84637 81999 26459 -11925 -3630 10769 -64708
17164 -64708 -86846 -29591 -56435 -87895 -54563 -39030 -16435 -31607 -37587 -73510 -140579 -101139
17152 -101139 -3103 65317 114086 141657 108559 109843 20211 -30343 -27666 9552 32233 13329
17140A3329O6210K2591n6855L3608J3449o9857m4675o6306l655P5976Q7429o0566
17128A0678l0558K3365j2937N1825L0332k6186n7305j0254J0434j105k4604j874
17116c8189n309Q5308o97k0024K589k8671l7844M8457L0119J9455n360j6311R768
17103D3291k6519k7865j3985O5864K0557j8377j8015L862n1075j7257K66l9835
17091g9088m7092L7247M7831N5970M003j1431j7471l088p3159J6858P6362J268
17079H210k9443J2911l37k9316n5742L1605K4657L7123Q9712k2581j4076p556
17067D5167q0784k5487O8711m788l6647J4475O0976L51o233r409J5052K0071M5446
17054A06901R468k8655p028o0316k2376l844j0835O263M7178p263j8317K5565
$$ plain form
17140 13329 79539 102130 45275 78883 92332 22475 -22200 -88506 -92161 -16185 71244 10678
17128 10678 -19880 3485 -9452 42373 72705 46519 -10786 -21040 -10606 -11711 -36315 -38189
17116 -38189 -43498 41810 41113 21089 23678 -4993 -42837 5620 35739 55194 49834 33523 43291
17103 43291 16772 -11093 -25078 40786 61343 42966 24951 28813 -22262 -39519 -39253 -79088
17091 -79088 -126180 -88933 -41102 14868 18871 7440 -10031 -13119 -86278 -69420 6942 8210
17079 8210 -21233 -8322 -8659 -37975 -93717 -62112 -37455 -332 89380 66799 52723 45167
17067 45167 -35617 -61104 7607 2819 -33828 -19353 41623 41974 35741 26332 41384 61455 106901
17054 106901 116369 87714 80686 20370 -2006 -5850 -16685 -10422 36756 29493 11176 36741
17042C6741P6761k6162k185o0517m3488j4044q70q117M6795j1042l0948L2604
17030d472n207k3645k3635j8984P9525Q5418M2040m5754q6269o3441p7384K1359
17018a20449K3021K9611Q9425J1857l621N613j202L7551M7590m3665m3589l2869
17006g27M2783j4293m355n7509m2652K4392k1709r593P0309L3478k7454k1434
16994b8764J8499M2842L6292j9346j3960o7163l6480L2599N6269j0812m4831m4306
16982g9161K0517K6683k9854J08299K4489M758K3699K8272M696q4076j9110M763
16970C3975k3867R396M5014M4300j3285n9032n3672L507p044m5858l804M2473
16958b7897J5884j0206K3332n0073o2265L3963r129L31M4224O575O5148N2217
$$ plain form
17042 36741 113502 87340 85155 24638 -18850 -32894 -33764 -41881 4914 -6128 -37076 -4472
17030 -4472 -9679 -33324 -56959 -75943 3582 89000 131040 85286 -983 -64424 -141808 -120449
17018 -120449 -97428 -67817 21608 33465 29844 35457 34255 71806 119396 75731 32142 -727
17006 -727 42056 27763 23408 -34101 -76753 -52361 -74070 -83663 -13354 20124 -7330 -28764
16994 -28764 -10265 32577 68869 49523 35563 -31600 -68080 -35481 20788 9976 -34855 -79161
16982 -79161 -58644 -31961 -61815 46484 70973 75731 99430 127702 132398 48322 29212 33975
16970 33975 10108 19504 64518 108818 95533 36501 -17171 -13664 -20708 -66566 -70370 -27897
16958 -27897 -12013 -22219 1113 -48960 -111225 -77262 -86391 -86060 -41836 -35261 29887 82104
16946H2104l9194l7770J3210L8046J2147k9009n2483K092j3823k7502N2805J2114
16934A2737p3641N822j9526l7211j0169J4201N1279N3423N4155n5999k3899K3570
16922e258L7373Q568Q35J5783q732r877o7642M043O1715P8972j2183m0399m4825
16909A8373N20k9108m3146k3904K8516K3558N2607m785l5560j9492j021K9514
16897c928n068k4118o211n177J5327N9553m533m9581k1181j1169n256o37j1155
16884g3134K0091J7041N915O286k9079l3187J5201J7855j976m5379j8669k80N9101
16871f0214L8558r4558L8585O0750L2282O526J6920R529j02538j2751k8422K0145
16859g5188J9354K8664P3784Q0669L9682m0961l9187j04350l9173P2240K8336
$$ plain form
16946 82104 42910 5140 18350 56396 68543 39534 -12949 -10857 -24680 -52182 623 12737
16934 12737 -60904 -55082 -74608 -111819 -121988 -107787 -56508 -3085 51070 -4929 -28828 -5258
16922 -5258 32115 40683 41518 57301 48569 38692 -28950 -24907 36808 115780 103597 63198 18373
16909 18373 18893 -10215 -53361 -77265 -48749 -25191 27416 22631 -12929 -32421 -33442 -3928
16897 -3928 -8996 -33114 -39325 -44502 -29175 30378 25845 -23736 -44917 -56086 -61342 -61979 -73134
16884 -73134 -53043 -36002 -30087 -23801 -52880 -86067 -70866 -53011 -54987 -100366 -119035 -119315 -60214
16871 -60214 -21656 -116214 -77629 -16879 15403 21929 38849 48378 -54160 -66911 -95333 -75188
16859 -75188 -55834 -27170 46614 127283 166965 126004 86817 -17533 -56706 15534 43870
16848D3870j8406k3987K2049l6246r69N046K5190q397j9079L682L7563L9543N7907
16835A27766m8566j09294j3793J03168J4009l1626k9105n5633l9553K0687J2073
16824d9867K7343m6587o497k0746j0892j1882P9917L4487m771l0803J355j1505
16812e0448o7789k6252K6800L0867l835o3350J9062N027K4078J8236M7621k0790
16800f0773K6571M3167j8725L4376o023m188M7405P569P132J5676n2646o9304
16788b9763l9564j1964M1809M9070k4510L382L3806Q919j1946l9974J9062N2874
16776E1201J4656j3594l1029k0190j3718j5698K5668n0696l3354K5791J7461K7350
16764a6152K9497k8544M1513M9290K8853m6477p2819n3815J9861K1775K6323l6783
$$ plain form
16848 43870 25464 1477 23526 -12720 -13689 -8643 16547 8150 -10929 -7247 30316 69859 127766
16835 127766 79200 -30094 -43887 59281 73290 41664 12559 -43074 -82627 -61940 -49867
16824 -49867 -22524 -69111 -75608 -96354 -107246 -119128 -39211 -4724 -9495 -40298 -38943 -50448
16812 -50448 -118237 -144489 -117689 -86822 -90657 -154007 -134945 -129918 -105840 -87604 -39983 -60773
16800 -60773 -34202 8965 -9760 24616 18593 14405 61810 69379 76511 92187 39541 -29763
16788 -29763 -69327 -81291 -39482 9588 -14922 -11540 22266 31185 19239 -20735 -1673 51201
16776 51201 65857 52263 21234 1044 -12674 -28372 -2704 -53400 -86754 -60963 -43502 -16152
16764 -16152 13345 -15199 26314 75604 104457 57980 -14839 -68654 -48793 -27018 -695 -37478
16752c7478K6625N1112R715N431n652k2455j6721j6931K4017q229P7029M0494
16740A26957k8500j9742o6394j7239m6771j2789k6096O9100o038k6171j9067j623
16728g4373N6154K5142k2218R132K0019J2486R264N2589K4707J181m0310n7198
16716A6575m3052Q470K4270K7061O902k3963m9265L1197m0576k501R0906k9333
16704A6691q268q873q054k8180l1683o964K7411M7746L8517M6607j06330o6171
16692h7551j4432N9218Q034m1166M142j5566J2657O038Q864N4720K6159k0705
16680D12l5535k8551M0284N1113M7188k6947o086J315Q681K4167n477n088m5418
16667B0058m6288J9749j6208R171L4925m168L4154m3498k6715l4418j3236M1575
$$ plain form
16752 -37478 -10853 40259 49974 55405 49753 27298 10577 -6354 17663 9434 86463 126957
16740 126957 98457 78715 12321 -4918 -51689 -64478 -90574 -21474 -27512 -53683 -72750 -74373
16728 -74373 -18219 6923 -15295 -6163 13856 26342 35606 88195 112902 114083 73773 16575
16716 16575 -26477 -18007 6263 33324 40226 16263 -33002 -1805 -42381 -44882 46024 16691
16704 16691 8423 -450 -8504 -36684 -68367 -75331 -47920 -174 38343 84950 -21380 -87551
16692 -87551 -101983 -42765 -34731 -75897 -71755 -87321 -74664 -68626 -59762 -5042 21117 412
16680 412 -35123 -63674 -23390 27723 74911 47964 41878 43193 51874 76041 70564 65476 20058
16667 20058 -26230 -6481 -22689 -13518 21407 17239 51393 7895 -18820 -53238 -66474 -24899
16655b4899P2157k1835n2268M8J2555R180M0353J4264L6997q066J9173n6784k6660
16642A4215k8411q6672R449J5333K0449M2722l05j1774m2806P346N5273K5392
16630B0211j939L33o6836n4397l9196M4001J02906n932p184j8297N90L5385Q869
16617A8514k7211l665o539P0011Q118p8565p8128r460K8984j9291J3821P8232
16605e179L6608N6291m2602n2891k6239l9463M2212o292P1329L5154J6434O176
16593I1538j3028K0031l5211l107j9039j9407o5856K1907k7749J0050R227K5426
16581e218m4231j4550L8240J5905k6214l463K4811M473M5787P4445k5032l7265
16569D7688M871p1420k8712m4540K3563Q0519N2304K902m3202m4793k8645L093
$$ plain form
16655 -24899 47258 25423 -26845 -26797 -14242 -5062 35291 49555 86552 78486 97659 40875 14215
16642 14215 -14196 -100868 -91419 -76086 -55637 -12915 -13220 -24994 -67800 -60454 -5181 20211
16630 20211 18272 18605 -48231 -102628 -141824 -97823 5083 -849 -8033 -26330 -25740 9645 18514
16617 18514 -8697 -12362 -18901 51110 59228 -19337 -97465 -106925 -77941 -97232 -83411 -5179
16605 -5179 31429 87720 45118 -7773 -34012 -73475 -31263 -37555 33774 68928 85362 91538
16593 91538 78510 98541 63330 60223 41184 21777 -44079 -22172 -49921 -39871 -30644 -5218
16581 -5218 -49449 -63999 -25759 -9854 -36068 -39531 -14720 -10247 35540 109985 84953 47688
16569 47688 52559 -18861 -47573 -92113 -68550 11969 64273 67175 23973 -20820 -49465 -46372
16557d6372p541O0198N253l8101K7853J2686J904m7595l0175L392m6016P717K4641
16544g2156Q0462N2834L0229k0100M1660J407j14530j1821K2511L371K6307N2870
16532I3044j0519m2614k4258l1144l28K2722O1361K0658o8239m9587m1807n620
16520g6331N7924n111q409o059N470K6454j9949m524k9585M2591L6511M7223o083
16507F0122J8472m2978m9366J3169m2501n5033K0962j3781m77K3776M1833J4265
16495a1537l107j3002k9683m0960J9694N4830P0775q731n0885M520K5838K9803
16483D7555K4346M4274j0645n7312o4136l6879j6039N942N4854O8487l934o2152
16471e639M014j3776j0819j3627P637Q6888J6662k5908n1090m9724L5632k42p491
$$ plain form
16557 -46372 -53913 6285 11538 -26563 1290 13976 15880 -31715 -61890 -58498 -104514 -96797 -72156
16544 -72156 8306 61140 91369 71269 112929 114336 -194 -12015 10496 13867 40174 93044
16532 93044 82525 39911 15653 -15491 -15819 6903 68264 88922 20683 -28904 -70711 -76331
16520 -76331 -18407 -23518 -31927 -37986 -32516 -6062 -26011 -30535 -60120 -17529 18982 66205 60122
16507 60122 78594 35616 -13750 -581 -43082 -98115 -77153 -90934 -91411 -67635 -25802 -11537
16495 -11537 -14644 -27646 -57329 -98289 -78595 -23765 47010 38279 -12606 -8086 17752 47555
16483 47555 71901 116175 105530 48218 -15918 -52797 -68836 -62894 -8040 60447 56513 -5639
16471 -5639 -1625 -15401 -26220 -39847 -32210 54678 71340 45432 -5658 -55382 -19750 -19992 -27483
16458b7483P478J4797l873J6058K1415M5582J7703m2560m1431q8609J0442M704
16446f5777J2189O1744m6156L5430J3734M2837j4181k7210j6876J379L4932l0391
16434A654k0159Q009P03K354k498J842k6271j0687N801L4374J3627k2928Q2110
16421F7931M1318j083j01712p6306L8730N1141j635J9443j6269j3717k6755l2073
16409e0987j2590l2224p6137K6540P5212M3908K0402j975Q47J8785K1815q3721
16397e0125j4509K2564p625o052n629J6491l0419l9970j058Q524N2962J8581L4357
16384a908K2236l5170k0271J2294O2965m9338n0477P865K2247k5264K3085L0836
16372i00k6910J368k8165m818N5772N7690R364n2339K1932M965P895j4351M1343
$$ plain form
16458 -27483 -20005 -5208 -9081 6977 28392 73974 91677 49117 7686 -80923 -70481 -65777
16446 -65777 -53588 8156 -38000 -2570 11164 54001 39820 12610 -4266 -2887 32045 1654
16434 1654 -18505 -10496 -9793 -7439 -9937 -8095 -34366 -45053 -39252 -4878 8749 -14179 67931
16421 67931 109249 108166 6454 -69852 -31122 20019 18384 37827 21558 7841 -18914 -50987
16409 -50987 -63577 -95801 -171938 -145398 -70186 -26278 -5876 -7851 -7004 11781 33596 -50125
16397 -50125 -64634 -42070 -49695 -55747 -61376 -44885 -75304 -115274 -116332 -107808 -54846 -36265 -1908
16384 -1908 20328 -14842 -35113 -22819 40146 -9192 -59669 -51804 -29557 -54821 -31736 -900
16372 -900 -27810 -26442 -54607 -59425 -3653 54037 63401 11062 32994 37959 45854 31503 72846
16359G2846l9768l3480j1032K2155N5173m050m4422p4248O1667K6557Q202k0713
16347A8887k3498K4778j865P510N423M2790k4380m0384j8703l3220K160m7653
16335h8155J0221P0205N1381l3970O1836j9053k2927K66K7086k5765j2104j7141
16323A880j2971P410N7549N8639P057p1437k8371j5295j1442k787j4148K2062
16311a854m8549L6209N7496k2464N6051J0689o2644p2362l0085J5634N8768q722
16299a1833K7549O2191m774j543o0987j782j8523J2723r81o5221J0973L4377J3735
16286d096l9421j2273K5683L2479k4242K7902L7442M5249l2067r348l6398J1435
16274B2345k8659n7557j7442N9123j3451j7531M667M0043L6171J8946p5558m9992
$$ plain form
16359 72846 33078 -402 -11434 10721 65894 61844 17422 -56826 4841 31398 39600 18887
16347 18887 -4611 20167 18302 25812 31235 74025 49645 9261 -9442 -42662 -40502 -88155
16335 -88155 -77934 -7729 43652 9682 71518 52465 29538 29804 56890 31125 19021 1880
16323 1880 -11091 -3681 53868 112507 119564 48127 19756 4461 -6981 -9768 -23916 -1854
16311 -1854 -50403 -14194 43302 20838 76889 87578 24934 -47428 -77513 -61879 -3111 -11833
16299 -11833 15716 77907 73133 71590 10603 8821 -9702 3021 2040 -63181 -52208 -17831 -4096
16286 -4096 -43517 -55790 -30107 2372 -21870 6032 43474 88723 56656 47308 10910 22345
16274 22345 -6314 -63871 -81313 -22190 -35641 -53172 -48505 -8462 27709 46655 -28903 -78895
16262g8895l728K2006O593k4012J7521o976l532K475k9168J0244O6287J8255L415
16249D85q1776K4937M7229k4185r837L653p334P8558L0988k4333j6983M0108K136
16236F3646K7606m8459k2723R549k8597m5129R301R652N715M2961L8846o6933
16224d565k9363L3637R969K1680O7376K7452j2862q647p4800q2709K9959J4770
16212h103m0321J07266L6290j3979l0622l3264n2540l9242j678M6753L4572J9424
16200B4556K2890q659k5546l3833l1840K56l1282j456M0730q195l4205L1481k1751
16187g6854j5904L5945P8412j5273j9178k8040O219L1307j9185k7939M3824J4326
16175G660l31k6700j4187O0137N8938J8750p6387n4832l9394L9271J9236r501
$$ plain form
16262 -78895 -82623 -60617 -54024 -78036 -60515 -67491 -71023 -68548 -97716 -87472 -21185 -2930 485
16249 485 -81291 -56354 -9125 -33310 -43147 -39494 -46828 31730 62718 38385 21402 61510 63646
16236 63646 91252 42793 20070 29619 1022 -44107 -34806 -25154 -19439 23522 62368 -4565
16224 -4565 -33928 -291 9678 31358 98734 126186 113324 104677 29877 -52832 -22873 -8103
16212 -8103 -48424 58842 95132 81153 50531 17267 -35273 -74515 -76193 -29440 5132 24556
16200 24556 47446 38787 13241 -20592 -52432 -52176 -83458 -84914 -44184 -52379 -86584 -55103 -76854
16187 -76854 -92758 -56813 21599 6326 -12852 -40892 -34673 -3366 -22551 -50490 -6666 7660
16175 7660 7329 -19371 -33558 26579 85517 104267 27880 -26952 -66346 -27075 -7839 -17340
16163a7340k619N6844k8392n1536K7357M4275K59l0622L6030j5729o8019j6272
16151f5764M6156K1392p0902k701k0210k4793O8356P0103K7664n4903r7871J6236
16139h7237N7201M0788m019R305k4072l7345l95J5484M718k8409J2840L6823O2174
16126E7856K9798n7488n7432j0253m768j0366Q7004N9290j695n1757m9526K0980
16114A1643N8958l5860o0077P35L5362p906L2188K6533J8550j9009m7605j5769
16102b257M6460L251j8143l1063l1190K9009L0138k757l1618L6859l249p092k0387
16089b039l8933k0923K3722K299J1287J3087J2590M5275r728j2668J0432r399
16077B5002n0236L2827P317J6700L4469O3621r760p5762j8136l4028j2743l3967
$$ plain form
16163 -17340 -19959 36885 8493 -43043 -15686 28589 28848 -1774 34256 18527 -49492 -65764
16151 -65764 -19608 1784 -69118 -71819 -92029 -116822 -48466 21637 49301 -5602 -103473 -87237
16139 -87237 -30036 10752 6733 16038 -8034 -45379 -45774 -30290 -25572 -53981 -41141 -4318 57856
16126 57856 87654 30166 -27266 -37519 -42287 -52653 34351 93641 91946 40189 -9337 11643
16114 11643 70601 34741 -25336 -24601 10761 2855 35043 61576 80126 61117 13512 -2257
16102 -2257 44203 47454 29311 -1752 -32942 -3933 26205 23448 -8170 28689 25440 18348 -2039
16089 -2039 -40972 -61895 -38173 -35874 -24587 -11500 1090 46365 36637 23969 34401 25002
16077 25002 -25234 7593 14910 31610 66079 129700 119940 44178 26042 -7986 -20729 -54696
16065e4696k4594L7486M751l6540K299Q065J8917N1376k4618k8596k2043K2574
16053d5619N9812m524j2286J563O7294j7722j7736L2699m8970n7793l2961J8935
16041e7308J6063K7038K1458k1708l1469M4689K1600j3684m6693m3553m819J074
16029h7312k1419J5039O3173j8102p0123l6554N0148O0081N1310Q3563m2931j1542
16017C5331J5628l6550J64m36m773K2596N3910r331p3200l4679l3421k3917j3373
16004a02051J632M0300L8741l141L7102o739J4199J1468Mm7583k2617M8586O7596
15991G7497k9660n3518m866k2815K6899n9597m599J5801J6521q184j7097K1385
15979d2233K2417J7581K4495M4582J0116k7320k8280R249M8595k400k5945l7621
$$ plain form
16065 -54696 -79290 -41804 -37053 -73593 -71294 -63229 -44312 7064 -17554 -46150 -68193 -45619
16053 -45619 14193 9669 -2617 -1054 66240 48518 30782 63481 14511 -43282 -76243 -57308
16041 -57308 -41245 -14207 7251 -14457 -45926 -1237 20363 6679 -40014 -83567 -88386 -87312
16029 -87312 -108731 -93692 -30519 -48621 -118744 -155298 -105150 -45069 6241 89804 46873 35331
16017 35331 50959 14409 14573 14137 9364 31960 85870 76539 3339 -31340 -64761 -88678 -102051
16004 -102051 -100419 -60119 -21378 -24519 12583 5844 20043 31511 31515 -16068 -38685 9901 77497
15991 77497 47837 -5681 -10547 -33362 -6463 -66060 -70659 -54858 -38337 -46521 -63618 -42233
15979 -42233 -19816 -2235 22260 66842 76958 49638 21358 30607 79202 76802 50857 13236
15967A3236L1853o470l8637O259k4410K373K2626N8716J842o4461k0814L5926
15955A8039p018j2928j4435j1879N6768K5085k3603K0218M86m0039m1817J2557
15943a8566l855J4288J1948K1141L8341o7347o1705m2772L5367j6973L9712P2731
15931B2310K335k0887L6319L6494m1397Q227N307j6577M059J1356J1660N0125
15919A09331M3825p5552j4702L4809l8366p5640m8035K4967J8517K0109j6140
15908a6877L667L0891k8782N84K7214K7446k1299k2474k2883p360j2038M8558
15896F647K0191j4404K6398o135k5499l735L6649M1482j2778K2970m738l1170
15884E5878L710j337j0632j7022l1772L1736N587K361k8837K9713N1m6242K3730
$$ plain form
15967 13236 45089 38619 -18 6241 -18169 -15796 6830 65546 67388 2927 -17887 18039
15955 18039 11021 -1907 -16342 -28221 28547 53632 30029 50247 50733 10694 -31123 -18566
15943 -18566 -22421 -8133 3815 24956 63297 -4050 -65755 -108527 -73160 -90133 -50421 22310
15931 22310 24645 3758 40077 76571 35174 43401 48708 32131 36190 47546 59206 109331
15919 109331 153156 77604 62902 97711 59345 -16295 -64330 -39363 -20846 -737 -16877
15908 -16877 -13210 17681 -11101 -10517 16697 44143 22844 370 -22513 -29873 -41911 6647
15896 6647 26838 12434 38832 32697 7198 3463 40112 81594 68816 91786 87048 55878
15884 55878 59588 58251 47619 30597 -1175 30561 36148 38509 9672 39385 39436 -6806 16924
15871A6924O0390P040L4739K4799k4010m9664l3836l4559j5271n0466k8784N6793
15859c5905J379m1970o618M9449K0030L588o989k6133K8283M4474J5076p5312
15847c0648l0315N0174N3379L4778p488J0435j5980r8831k0599P4275k2431n433
15835h684K9930N2487L940J841N342m4110l0974l6813l7550k2942m6633K6533
15823a07633p047M0614O4631K6290N3188j7907O599M151J7178P823m9095k0150
15811A8642O240k3503o3631m517K4723M811O4548m5939J1047K9609O309K7486
15799E5825M0719n2752j19734J2075j6072l7350K0842N4617j9477K8584J0686
15788b2037M5942J29K262m4968J319M6343l1460j00675j8620M7433K0891p862
$$ plain form
15871 16924 77314 84354 119093 143892 119882 70218 36382 1823 -13448 -63914 -92698 -35905
15859 -35905 -34526 -76496 -83114 -33665 -13635 -10047 -17036 -43169 -14886 29588 44664 -30648
15847 -30648 -60963 -10789 42590 77368 69880 80315 64335 -34496 -55095 19180 -3251 -8684
15835 -8684 21246 73733 77673 79514 84856 40746 9772 -27041 -64591 -87533 -134166 -107633
15823 -107633 -114680 -74066 -9435 16855 70043 52136 58735 62886 80064 87887 38792 18642
15811 18642 24882 1379 -62252 -66769 -42046 -37235 27313 -18626 -7579 22030 28339 55825
15799 55825 96544 43792 -75942 -63867 -79939 -117289 -96447 -41830 -61307 -32723 -22037
15788 -22037 23905 24034 26296 -18672 -17353 28990 -2470 -103145 -121765 -74332 -53441 -61303
15776f1303P5531L4304p15j7126k4573O7121M4411l1637l0988k3002j4507m2085
15764b4569K2957r607J979j0084k2481J3497J9959l846N9250J1826j9841p0438
15752c1398J695J8382k6855k0293J1330K6129J0447r72K963k3675M6071J3532
15740B7356m7640n9764K5575l051k759K2835J4987J6882l6321j1241O295j1740
15728e8586m3974L6607M9147j1561k1084N1546L3901K2977l3525k7591o117R839
15716A579q025l4536J4832k007m0963M7077J5843J9117k2595k5478L6668m754
15704c242L1060J6101N411o9357m4598O749l480J4971L0675J3904J7309k1140
15692e637m2980L1474L6502j2638J8406n3329M211M8353N954J8274K120r463J4275
$$ plain form
15776 -61303 14228 48532 47817 30691 6118 73239 117650 86013 55025 32023 17516 -24569
15764 -24569 -1612 -11219 -9240 -19324 -41805 -28308 -8349 -12195 47055 58881 39040 -31398
15752 -31398 -29703 -11321 -38176 -58469 -47139 -21010 -10563 -11535 -8572 -32247 13824 27356
15740 27356 -20284 -80048 -54473 -57524 -60283 -37448 -22461 -5579 -41900 -53141 -46846 -58586
15728 -58586 -102560 -65953 -16806 -28367 -49451 2095 35996 58973 25448 -2143 -8260 1579
15716 1579 -6446 -40982 -26150 -28157 -69120 -22043 -6200 12917 -9678 -35156 1512 -3242
15704 -3242 27818 43919 49330 -20027 -64625 -57876 -61356 -46385 -15710 -1806 15503 -5637
15692 -5637 -48617 -17143 19359 6721 25127 -28202 -23991 24362 30316 48590 50710 41247 55522
15679E5522Q419k2095L683k8398J4799R981L0434j5943N214q6849n2820K4212
15667e3841L9061j8312N7735l4709o0227J4334K5987P222J3902R643o3427K1597
15655d1035R063l6916J9737n693l1584k9749m0037R564N6072j7506K6870J02641
15643B1427M1170J6934n5585o1322J4259J8155K4767O0340K0052j0100m0131J9125
15631F9091K0890l5712j3469R362m3570l3151k1306P2211P2755q0837k0069M4041
15619D0236o7002K6062j2752m4873j7527N7274J9004P7044l4731m1114J3102j7242
15607b519J4836J4712K3550K5420j1554J2068j7472k3045k2866J04j7364j8981
15595b3111o394N532J837k9040J8574N5209j2341M0645M252j5800n301j3290J2700
$$ plain form
15679 55522 63941 41846 45529 17131 31930 41911 72345 56402 61616 -25233 -78053 -53841
15667 -53841 -14780 -33092 24643 -10066 -70293 -55959 -29972 -22750 -8848 795 -62632 -41035
15655 -41035 -31972 -68888 -49151 -54844 -86428 -116177 -156214 -146650 -90578 -108084 -81214 21427
15643 21427 62597 79531 23946 -37376 -23117 -4962 19805 80145 100197 90097 49966 69091
15631 69091 89981 54269 40800 50162 6592 -26559 -47865 24346 97101 16264 -3805 40236
15619 40236 -26766 -704 -13456 -58329 -75856 -18582 422 77466 42735 1621 14723 -2519
15607 -2519 12317 27029 50579 75999 64445 76513 59041 35996 13130 13234 -4130 -23111
15595 -23111 -29505 -23973 -22136 -51176 -32602 22607 10266 50911 55163 39363 34062 20772 33472
15582C3472l6396q4069l0927O2507L5693l2451p461O6972L2536q826J8322k3323
15570B6049K9429r717k8309N067K5082l7192L1409N1563K3726J507J8188j8249
15558A18553m8728m9721J584Q3803P144q5703m5207q949k0527N6358L9016j7888
15546B9735k7888K113m443m992P591Q63l8605K7485L1661J7281j5417M2599J9296
15533H7279p0445n683K3115N8273O80K0690n2744p2669p0056M0819J03597L5000
15521I7856J4109j0112K4211M9717n0636n1089j8471J4336J0906J8241j774J060
15509I8354o4294l3304q074J1649n4823M496L7302N3428M175j4581p505l1909
15497e086l990j2740m2539j8002K7338P0872k488O896J5035m7391q1630J8122
$$ plain form
15582 33472 -2924 -86993 -117920 -55413 -19720 -52171 -59632 7340 39876 31050 49372 26049
15570 26049 55478 45761 17452 22519 47601 10409 41818 93381 117107 118614 136802 118553
15558 118553 69825 20104 21688 105491 112635 26932 -18275 -27224 -47751 8607 47623 29735
15546 29735 1847 3960 -483 -5475 2116 2979 -35626 -8141 23520 40801 25384 67983 87279
15533 87279 16834 11151 34266 92539 93219 113909 61165 -11504 -81560 -40741 62856 97856
15521 97856 111965 101853 126064 175781 125145 74056 55585 69921 80827 99068 97294 98354
15509 98354 34060 756 -7318 4331 -50492 -45996 -8694 44734 48909 34328 26823 -5086
15497 -5086 -9076 -21816 -64355 -82357 -55019 15853 13365 20261 35296 -12095 -93725 -75603
15485g5603M796k5336K4840L7478j7651l0573l399k0545K4788P085J4778L989
15473e5353K8112K7738k0273j3000K6999K939l1530O3225P7033K7203M1254l7785
15461A36562J4149p5256j18457o4355j5415k157j4661N5498P0618N1392J3829
15450E1747j3988p785j8775j8933K7173M3497P407n2173o5185K7479Q0884J4582
15438G5930k527O013K0324K2971m1384n2031l9223k874J8618m6850P359J6656
15426a7018o2071J5014N7862J18419L4089o823k4922j2616m6150n9950N9332N6679
15414A11845n944m4417j613m348m912k6897n9658L5983K2587O0211j6712j1253
15402E4872m3411r2407J9929M8588r242l7068q930J4160k1883L9292q253M6600
$$ plain form
15485 -75603 -70807 -96143 -71303 -33825 -51476 -82049 -85448 -105993 -81205 -74120 -59342 -55353
15473 -55353 -27241 497 -19776 -32776 -5777 -2838 -34368 28857 105890 133093 174347 136562
15461 136562 150711 75455 -43002 -107357 -122772 -124929 -139590 -84092 -13474 37918 51747
15450 51747 37759 29974 11199 -7734 19439 62936 70343 18170 -47015 -19536 61348 75930
15438 75930 73403 79416 99740 122711 81327 29296 -9927 -12801 5817 -41033 -33674 -17018
15426 -17018 -79089 -64075 -6213 112206 146295 139472 114550 101934 55784 -4166 55166 111845
15414 111845 105901 61484 59871 55523 50611 23714 -35944 39 22626 82837 66125 54872
15402 54872 11461 -80946 -61017 -12429 -21671 -58739 -67669 -53509 -75392 -36100 -44353 2247
15390B247N1252L2135P703m1098p035K0407j2729r090J2378m6255m97j3427k381
15377f390O781J0751P4600j4985l0333l7969o019J6539R009Q039k2440p2824m4800
15364a10041M6656L994J1435K9189R534K5890m3609J2190L9844q114O4676K9343
15352A10987o2726k4438m3318N4825l4630N42l1627l349p018M9246O0875k7170
15340D2199P642J3189l5360m7609o8282K9717P4647L6262n4346j8181L5742J3797
15328B9417j7501N23O3665q783m3844m1586N470K0169K132N154k0425K4666K0873
15315C9930j8730j1138K8474N9326m0723p2545m3737l4904K1601j7655n671j6702
15303a12474J2276L278M7965L1880p691J9282P5498O7980L8537r187q7757o5681
$$ plain form
15390 2247 53499 85634 93337 52239 45204 65611 52882 43792 56170 9915 9418 -4009 -6390
15377 -6390 391 11142 85742 70757 40424 2455 -3564 12975 21984 30023 7583 -65241 -110041
15364 -110041 -63385 -59391 -47956 -18767 -9233 16657 -26952 -14762 25082 16968 81644 110987
15352 110987 48261 23823 -19495 35330 700 1242 -30385 -33734 -40752 8494 69369 42199
15340 42199 49841 63030 27670 -19939 -88221 -58504 16143 52405 -1941 -20122 15620 29417
15328 29417 11916 12439 76104 67321 23477 -18109 -12639 7530 9662 14816 -5609 19057 39930
15315 39930 21200 10062 38536 97862 57139 -15406 -59143 -94047 -72446 -90101 -95772 -112474
15303 -112474 -100198 -96920 -48955 -17075 -24766 -5484 70014 137994 176531 167344 79587 13906
15291A3906l6315J9656M6424j1976l0593j4517M8190J0960l9487J2720J8379n0854
15279a3507j1487j3819M72K671Q125k0306q7756o6927K4596Q801j5850L1582K5238
15266a28167J1385J9633O4235N53M8879N8877o1530q1731L1986K8934l2426m829
15254d4201j762M8134O0267M8440l0590j15751l4936K7892M2082N8348j6154l9269
15242B500m6842r640N3902k503J999j5726o2588o792M2902l324N935L5706P9849
15229G5378J7327n5854q4577L3756M5509J0149k5915m801J4999J8195J2658l236
15217E3588k8727n6581L0293J1572Q476l0571k7763j019O8619N2531K7833m2806
15205F5445p5312k1320J06705m6628n0701j2551o2837J6705L4324N0562L3229
$$ plain form
15291 13906 -22409 -2753 43671 31695 1102 -13415 34775 45735 6248 18968 37347 -13507
15279 -13507 -24994 -38813 -38341 -35670 -27545 -47851 -135607 -202534 -177938 -169137 -184987 -153405 -128167
15266 -128167 -116782 -97149 -32914 -32361 16518 75395 13865 -67866 -35880 -6946 -39372 -44201
15254 -44201 -45963 2171 62438 110878 80288 -35463 -70399 -42507 -425 57923 41769 2500
15242 2500 -44342 -53982 -80 -2583 -584 -16310 -78898 -85690 -42788 -46112 -40177 -4471 75378
15229 75378 92705 36851 -47726 -13970 31539 41688 15773 10972 25971 44166 56824 53588
15217 53588 24861 -31720 -1427 10145 18621 -11950 -39713 -40732 27887 80418 108251 65445
15205 65445 -9867 -31187 75518 28890 -21811 -34362 -97199 -80494 -46170 4392 37621
15194C7621j2325k157j5765k3654O6071L4863l6380m3591j1999K542k6948J7587
15182a4135L8180l3896J6299k4137p631q651L5436m4923m342L0358n1572k301
15170g1315J01028Q917n3256k3108K2823M3792P194p5950l1952j9651p801J6572
15158h2707j776M534L0763Q387j2106k95L2729J3201l8845N6982P1972L7015j1306
15145A08548m4749k5021O5911j3559p243J7746l1972j5192m9345Q181k5528L4967
15133B2744k6755j0454J0038M2035K4598K1478n6j9335m018J5178j077L4342k2736
15120H5982k7399l1893J7401k2264k067K5193J9023j3251J607L8472j511J9290
15108A08583L8452l348n8998l474k8364k0705J5746n664L1863k7806m9916K9449
$$ plain form
15194 37621 25296 23139 7374 -16280 49791 84654 48274 4683 -7316 -4774 -31722 -14135
15182 -14135 24045 -9851 6448 -17689 -25320 -33971 1465 -43458 -47800 -17442 -69014 -71315
15170 -71315 29713 38630 -14626 -37734 -14911 28881 36075 -39875 -71827 -91478 -99279 -82707
15158 -82707 -84483 -79949 -49186 -40799 -52905 -53200 -20471 -7270 -46115 10867 82839 119854 108548
15145 108548 63799 38778 104689 91130 83887 101633 69661 54469 5124 13305 -12223 22744
15133 22744 -4011 -14465 -4427 37608 62206 83684 83628 64293 60275 75453 74376 108718 85982
15120 85982 58583 26690 44091 21827 19760 44953 63976 50725 52332 90804 89293 108583
15108 108583 147035 143687 84689 81215 52851 32146 47892 42228 74091 46285 -3631 25818
15096B5818m4503m542P3255l337m2310m494N121l0214N06R449L1342N8165j0833
15083F3423l5589k7427L949K485J5239J5910l2880K885K0989J3453l1950N0607
15071F1094O2846J7443n5793k5409n3043J0582K1733J0384j1220k2485p911n313
15059B908L731m5298m0474m2737L5423P0786J9843k8521L99l4557p211j01l4397
15046a00206l1026o3054K822L9693Q0987m437K5340k0028M187j4264q630O9949
15034a8667N2722N928k1056J8029m0727k577J1252M9338k1766r150n257j2934
15022E135R550j2094q831l4082j858Qo5408L5966O0130O5087m26O913K2233N833
15008H8156J2256m0036Q049k0845J2724N0516J06861J34675K44625K27898J36389
$$ plain form
15096 25818 -18685 -23227 50028 46691 4381 -113 5008 -25206 -24700 -15251 16091 74256 63423
15083 63423 27834 407 4356 6841 22080 37990 5110 7995 28984 42437 10487 61094
15071 61094 123940 141383 85590 60181 7138 17720 39453 49837 38617 16132 8221 2908
15059 2908 6639 -38659 -79133 -121870 -86447 -15661 4182 -24339 -23940 -58497 -65708 -65809 -100206
15046 -100206 -131232 -194286 -191464 -151771 -70784 -75221 -49881 -69909 -65722 -79986 -88616 -18667
15034 -18667 34055 39983 18927 36956 -3771 -6348 4904 54242 32476 23326 18069 5135
15022 5135 14685 2591 -6240 -40322 -42180 -42172 -107580 -71614 -11484 53603 53177 60090 82323 88156
15008 88156 100412 60376 68425 47580 60304 110820 217681 352356 596981 824879 961268
14997I61268r329k63184k93541j81244m5335n1189n7779o0025K1493O4222P385
14986I2742R0K7645l0344p8847M6072K1126o7742k6663r290J2184L7212J8350
14974D2535j075k5295K032k3169K3433N633j346L7923n7356K1474N0214l95m5096
14961B9512l1266m4205j0236K5732J4300L7010j2114N8621o4638k1109M2012L2704
14949E6323k385o5966p775l049l1338L0184J1948k6519J5730Q55q070K9803P325
14936G066L145N869O5760L015l2619M4904M9726n1984k5494p4642k5198j4513
14924d4965J7661N4930L4174J4804m1737o0932l4098j6768N001M4459K7214n138
14912e395n7729J6693J6819j3457p117n3814J8745L9659L0449j2626k2847r781
$$ plain form
14997 961268 951939 688755 395214 213970 168635 117446 59667 -358 21135 85357 92742
14986 92742 92832 120477 90133 11286 57358 78484 10742 -15921 -25211 -13027 24185 42535
14974 42535 41460 16165 18197 -4972 18461 24094 22748 60671 3315 24789 75003 74608 29512
14961 29512 -1754 -45959 -56195 -30463 -16163 20847 8733 67354 2716 -18393 23619 56323
14949 56323 53938 -12028 -19803 -22852 -54190 -24006 -12058 -38577 -22847 -21992 -30062 -259 7066
14936 7066 10211 16080 81840 84855 52236 97140 146866 94882 69388 -5254 -30452 -44965
14924 -44965 -27304 27626 61800 76604 34867 -26065 -60163 -76931 -71930 -27471 -257 -5395
14912 -5395 -63124 -46431 -29612 -43069 -50186 -104000 -85255 -45596 -15147 -27773 -50620 -60401
14900f0401O6752J1565j2808M4935k2403m0699l4417L1438N0540J4448k6167k1231
14888A552L3003J8746J1071l1699j975L853l2216l1248n1346l5181L6348M7497
14876c1595O5712j6818k7390l7504k2927M6187j7515N7761K6949l026k1439n9376
14864d0981J8956K275m7316j9433Q5059p705j6537M2885n4075L533K2233Q65Q593
14851a648m517K4342J6962k128l5374R669j5097K8912q058l4212p827L6044J4681
14838B1749K6971J02587o234j8930j3401p703m487j1676j2073k1854k3678L3752
14826F5023J9049J5650O714j8008J923j7776n969j1851j9641j5900m6136J0462
14814a6460m9781l9504M9702Q8437R543j402l0373k1987P295k6003k599m4578
$$ plain form
14900 -60401 6351 17916 5108 50043 27640 -13059 -47476 -16038 34502 48950 22783 1552
14888 1552 34555 53301 64372 32673 30698 34551 2335 -28913 -80259 -115440 -79092 -31595
14876 -31595 34117 17299 -10091 -47595 -70522 -24335 -41850 15911 42860 39834 18395 -40981
14864 -40981 -22025 -19750 -67066 -86499 -1440 -9145 -25682 17203 -36872 -33339 -11106 -10241 -1648
14851 -1648 -6165 18177 35139 33011 -2363 7306 -7791 21121 13063 -21149 -28976 7068 21749
14838 21749 48720 151307 145073 126143 112742 105039 100552 88876 76803 54949 31271 65023
14826 65023 84072 99722 106436 88428 90351 72575 66606 54755 35114 19214 -26922 -16460
14814 -16460 -66241 -105745 -56043 32394 41937 40535 10162 -11825 -4530 -30533 -33132 -77710
14802g7710K4816K4483M4002R482o0260l6847j3444M2846M2056K1144J6118J3176
14790D9862N4411k1783r6523r950K6854j6143q763M329M038n5054p073l9851M2739
14777g2907P3019L7625N5125M2450K9793k5059m8756o7110j8000o3177K859K9144
14765b4994o370N0573L0980j5922n6748l9113R889j0536K9174j0831j2707M190
14753e2415l9454M6970M2706k9258j2616K8739L564K085J4422J2083l3366J4183
14741b357L6777k1315n4438N4183P6147j4000r0007o9998J8067J1169J0726P1556
14729B6510m181k9011r1319K2296M4668M246J4033J8721L9452N2841j0846j00566
14717a3156j5662J9712K6299M1989Q35j2081P1814k0790m3471P651n459o2168
$$ plain form
14802 -77710 -52894 -28411 15591 25073 -35187 -72034 -85478 -42632 -576 20568 36686 49862
14790 49862 104273 82490 -14033 -23983 2871 -13272 -22035 -17706 -13668 -68722 -75795 -115646 -72907
14777 -72907 112 37737 92862 135312 165105 140046 91290 24180 6180 -56997 -54138 -24994
14765 -24994 -31364 19209 50189 34267 -22481 -61594 -51705 -62241 -33067 -43898 -56605 -52415
14753 -52415 -91869 -44899 -2193 -31451 -44067 -15328 -11764 -9679 4743 16826 -16540 -2357
14741 -2357 34420 13105 -41333 12850 88997 74997 -15010 -85008 -66941 -55772 -45046 26510
14729 26510 22329 -6682 -98001 -75705 -31037 -26791 -12758 5963 45415 98256 87410 -13156
14717 -13156 -28818 -9106 17193 59182 60017 47936 119750 98960 55489 63140 57681 -4487
14705d487k1189K9995k0875J0051P507m5079J2183P2229M6326k7737m818J7402
14693G1508M518n9182J7915L3959j4520r087j9146n0125k856K7504j5598m1649
14681e6759K2427j3683o6707J670r75j742K2738N5905K7058o220J4650Q1458p916
14668G1904O022k667o3202o6985j1313O7573N0189L8108M0338l2568r8672p0896
14656g2169n0845N2043J7517J7147K5593O797L5321n6280N162L9901P4043J7048
14644A11278l1681o1698Q888J2259q0426J1922J8086n829J4524J3907l8989K1206
14632f553M8884j4138o4099J5832Q0618N4754l6450j5314m1082j0559m4740P205
14620b5642k0402L2177K1076J1005M389m609K4919N0019k7108m2663m4946n8649
$$ plain form
14705 -4487 -25676 4319 -16556 -6505 1002 -44077 -31894 40335 86661 58924 54106 71508
14693 71508 76026 16844 34759 68718 54198 45111 25965 -24160 -27016 488 -15110 -56759
14681 -56759 -34332 -48015 -114722 -113052 -114027 -115769 -93031 -37126 -10068 -16288 -1638 79820 71904
14668 71904 77926 75259 12057 -54928 -66241 1332 51521 89629 129967 97399 -1273 -72169
14656 -72169 -123014 -70971 -53454 -36307 -10714 -3917 31404 -24876 -19714 20187 94230 111278
14644 111278 79597 17899 26787 39046 -41380 -29458 -11372 -17201 -2677 11230 -27759 -6553
14632 -6553 42331 28193 -35906 -20074 60544 115298 78848 63534 22452 11893 -32847 -25642
14620 -25642 -46044 -13867 7209 18214 22603 17994 42913 92932 65824 23161 -21785 -80434
14608h0434K2646Q6781K3334l3854j3446L3296j6463R053k5587k3340j5182k3261
14596e6457K3224K8581M2384O9586J0312M61k53l4419n5276l6962M1349O731j0826
14583B8435Q506J5909q369j02K1714l4031m4077L7276M9410n9141k2049K332K7752
14570B3565J3163K1424J7883m2093j1259j6694Q170L3369m417J522l8525m4954
14558c8846n7085L5528J06002j6304l0943l1259k0336K2957j9606J9825O8854
14547C8787J0620m557N295l7708l961p3607k7556N8901N6178L5242p333n1721
14535a420M3259M3832j00207r2591k1330P3178N4028L0149J1533J1072j2656k4394
14523A4453n7838l5832O4594L1322o639M413l6947l1123O73j0477k9816J920k9653
$$ plain form
14608 -80434 -57788 28993 52327 18473 5027 38323 21860 30913 5326 -18014 -33196 -56457
14596 -56457 -33233 -4652 37732 107318 117630 118091 117838 83419 28143 -8819 32530 39261 28435
14583 28435 36941 52850 44481 44379 66093 32062 -12015 25261 74671 15530 -6519 -4187 23565
14570 23565 36728 58152 76035 33942 22683 5989 14159 47528 43111 44633 6108 -38846
14558 -38846 -95931 -60403 45599 29295 -1648 -32907 -53243 -30286 -49892 -30067 38787
14547 38787 49407 44850 50145 12437 8476 -65131 -92687 -33786 22392 57634 50301 -1420
14535 -1420 41839 85671 -14536 -107127 -128457 -55279 -1251 28898 40431 51503 38847 14453
14523 14453 -43385 -79217 -14623 16699 10060 14473 -22474 -53597 -52924 -63401 -93217 -91297 -120950
14510a20950K264N8895P3953K0227l7467L9531j8978j0334m9670m4726p628m7888
14498a42771J6011J03840L5188j0007J1935J0767k9075j6065o632j0528j704N4081
14486A5040n6951M9512L7349j4246l5007k0186J1698L2416L4477j1242m9067J4722
14474H515M0026O930N59p270k6680p9996m7900J7599L4861K8624j0212K1113O0536
14461D6705K1216J1949O143p7263j1474K6413N6418l6072l1274l8569k7000N8830
14449F022K3790j5384l154L8543L4839P176j7170n8305m0963k4684q006K4613
14437c2683K2757M3665K2373k6804k7738O660O1341N9716J6658l2725j09226o8236
14425f4242M508k9069j3923l5376O1268N0860q205k4106k3682J7574P3367R895
$$ plain form
14510 -120950 -118686 -59791 14162 34389 -3078 36453 17475 7141 -42529 -87255 -94883 -142771
14498 -142771 -126760 -22920 12268 2261 14196 24963 -4112 -20177 -26809 -37337 -39041 15040
14486 15040 -41911 7601 44950 30704 -4303 -24489 -12791 19625 54102 42860 -6207 8515
14474 8515 48541 55471 56030 48760 22080 -57916 -105816 -88217 -53356 -24732 -34944 -13831 46705
14461 46705 67921 79870 86013 8750 -2724 23689 80107 44035 12761 -25808 -52808 6022
14449 6022 29812 14428 11274 49817 84656 91832 74662 16357 -24606 -49290 -57296 -32683
14437 -32683 -9926 33739 56112 29308 1570 8230 69571 129287 145945 113220 3994 -64242
14425 -64242 -59734 -88803 -102726 -138102 -76834 -25974 -34179 -58285 -81967 -64393 8974 18869
14413A8869l8843J5912k3869Q260M8926r484l1533j9002k5521M587l793N0344
14401e147L3910K1083k8341m2078M867P199J7054N100J694N7612n4776n3780o976
14388d2579k9109J8497J8478l162L1643q516K1482K1803m2302J5625M0253J331
14376D3444m7319M736l0963J6213O361L8925l8910j3023L5313j8333j8704n8015
14364h0275p510P2113O7513o226r9812l5361j0669J3432N0630O877p0190K1350
14352g8128O1161J2858Q953K7715n417k3700j212O72j5457L6117N982l5775K1320
14339A5089M2476M4463m9261l4195l0067j2436k6338J5193q649o552L0706o954
14327b6525k1582N9998N2780n892l1390k0457l348j6547m032K3982P586L4745
$$ plain form
14413 18869 -19974 -4062 -27931 -19671 29255 19771 -11762 -30764 -56285 -51698 -55491 -5147
14401 -5147 28763 49846 21505 -20573 -15706 -8507 8547 13647 15341 72953 18177 -35603 -42579
14388 -42579 -71688 -53191 -34713 -37875 -6232 -14748 6734 28537 -13765 1860 42113 43444
14376 43444 -3875 861 -30102 -13889 -7528 31397 -7513 -20536 14777 -3556 -22260 -80275
14364 -80275 -87785 -15672 51841 45615 -54197 -89558 -100227 -86795 -36165 -29288 -99478 -78128
14352 -78128 -16967 -4109 4844 32559 27142 3442 2230 2902 -12555 23562 29544 -6231 15089
14339 15089 57565 102028 52767 18572 -11495 -23931 -50269 -35076 -43725 -50277 -19571 -26525
14327 -26525 -48107 11891 64671 58779 27389 6932 3584 -12963 -16995 6987 14573 49318
14315D9318o102j4946L7248O011m6243o8440p592L4062L1499k2764m3027J8399
14303c2577L5751Q586J3521J9760J5664p9344q6234j1518P2624M2952n188o8717
14291g4720n083J4272M7468L3856K4832K082m2813p144k2648k7771M5293N2305
14279C9929K2137k1099j3676J5958j3781k4409l8O0923j7606Q651l5122Q303k5768
14266D402r10L4286n0211Q447P866j8411n0736L8891O8402L9922l8365j968k9414
14253A2201j7469k5058L7408k1870l0759k459m0903K6816K5662O3662j8999m8469
14241d0237m954O1281o8330K2525j965j5573K2044L839l7886M5496M8785M8845
14229H3870o4657j7002L6793L2871K8358j9616n7118O88j5686l5328j4566L6203
$$ plain form
14315 49318 43216 28270 65518 71529 25286 -43154 -50746 -16684 14815 -7949 -50976 -32577
14303 -32577 3174 11760 25281 45041 60705 -18639 -104873 -116391 -43767 -815 -6003 -74720
14291 -74720 -79803 -65531 -18063 15793 40625 42707 -106 -7250 -29898 -57669 -12376 39929
14279 39929 62066 40967 27291 43249 29468 5059 5021 65944 48338 56989 21867 30170 4402
14266 4402 3492 37778 -12433 -3986 3880 -14531 -65267 -26376 42026 81948 43583 41615 12201
14253 12201 -5268 -30326 7082 -14788 -45547 -48006 -88909 -62093 -36431 27231 8232 -40237
14241 -40237 -45191 16090 -52240 -29715 -31680 -47253 -25209 -21370 -59256 -13760 35025 83870
14229 83870 19213 2211 39004 71875 100233 80617 23499 24187 8501 -26827 -41393 -5190
14217e190P312k136k1074R533K6942N8699J6827o696J319P707l5617l643q8968
$$ plain form
14217 -5190 2122 -14 -21088 -11555 15387 74086 90913 84217 85536 93243 57626 53983 -34985
$$ [...]
##END NTUPLES=NMR SPECTRUM
##END=
