##TITLE=Analysis number 328307
Compound Code cc 67146
Book Reference 510/52
Project Code adrs
Chemist Name jimp
##JCAMPDX= 6.0         $$ Bruker NMR JCAMP-DX V2.0
##DATA TYPE= NMR SPECTRUM
##DATA CLASS= NTUPLES
##ORIGIN= Bruker BioSpin GmbH
##OWNER= nmr
$$ XWIN-NMR		Version 3.5
$$ Wed May 23 11:04:42 2007 GMT Daylight Time (UT+1h)  MAYBRIDGE\nmr@NMR_250MHZ
##.OBSERVE FREQUENCY= 250.131544655141
##.OBSERVE NUCLEUS= ^1H
##.ACQUISITION MODE= SIMULTANEOUS (DQD)
##.ACQUISITION SCHEME= undefined
##.AVERAGES= 16
##.DIGITISER RES= 18
##SPECTROMETER/DATA SYSTEM= dpx250
##.PULSE SEQUENCE= zg30
##.SOLVENT NAME= CDCl3
##.SHIFT REFERENCE= (INTERNAL, CDCl3, 0, 16.522)
##AUDIT TRAIL= $$ (NUMBER, WHEN, WHO, WHERE, WHAT)
$$ ##TITLE= Audit trail, XWIN-NMR		Version 3.5
$$ ##JCAMPDX= 5.01
$$ ##ORIGIN= Bruker BioSpin GmbH
$$ ##OWNER= nmr
$$ C:\u/data/dgb/nmr/ADRS/1380/pdata/1/auditp.txt
$$ ##AUDIT TRAIL=  $$ (NUMBER, WHEN, WHO, WHERE, WHAT)
(   1,<2007-05-23 11:04:13.21 +100>,<MAYBRIDGE\nmr>,<NMR_250MHZ>,
      <created by zg, POWCHK disabled, PULCHK disabled
       configuration hash MD5:
       76 6E 9A 78 1E 09 19 81 EC 84 63 8F B0 6A 59 2D
       data hash MD5: 64K
       52 7F A3 E2 70 95 90 38 70 8B DA 13 1C 6E 8B D4>)
(   2,<2007-05-23 11:04:26.35 +100>,<MAYBRIDGE\nmr>,<NMR_250MHZ>,
      <Start of raw data processing
       ef LB = 0.3 FT_mod = 6 PKNL = 1 SI = 32K 
       data hash MD5: 32K
       39 EF 41 E0 3E FF 67 B0 1D FE 13 BF CE D1 CF 31>)
(   3,<2007-05-23 11:04:28.00 +100>,<MAYBRIDGE\nmr>,<NMR_250MHZ>,
      <apk 
       data hash MD5: 32K
       F6 F6 D6 FD 68 39 96 E1 91 7B 62 1E 15 16 12 35>)
(   4,<2007-05-23 11:04:28.75 +100>,<MAYBRIDGE\nmr>,<NMR_250MHZ>,
      <abs ABSG = 5 
       data hash MD5: 32K
       5A 80 4E 10 D3 30 D9 E4 D4 2B ED 4F D8 D8 74 81>)
$$ ##END=
$$ 
$$ hash MD5
$$ 31 5F 4C 81 3E 3D 47 9C 17 55 18 65 EF A1 6C F4
##$RELAX= 
##$RELAX= 
##$RELAX= 
##$RELAX= 
##$RELAX= 
##$RELAX= 
##$RELAX= 
$$ Bruker specific parameters
$$ --------------------------
##$DU= <C:\u>
##$EXPNO= 1380
##$NAME= <ADRS>
##$PROCNO= 1
##$TYPE= <nmr>
##$USER= <dgb>
##$AMP= (0..31)
100 100 100 100 100 100 100 100 100 100 100 100 100 100 100 100 100 100 
100 100 100 100 100 100 100 100 100 100 100 100 100 100 
##$AQSEQ= 0
##$AQ_mod= 3
##$AUNM= <au_zg>
##$AUTOPOS= <12 >
##$BF1= 250.13
##$BF2= 250.13
##$BF3= 250.13
##$BF4= 250.13
##$BF5= 500.13
##$BF6= 500.13
##$BF7= 500.13
##$BF8= 500.13
##$BYTORDA= 1
##$CFDGTYP= 0
##$CFRGTYP= 5
##$CHEMSTR= <none>
##$CNST= (0..31)
1 1 145 1 1 1 1 1 1 1 1 1 1 1 1 1 1 1 1 1 1 1 1 1 1 1 1 1 1 1 1 1 
##$CPDPRG= <>
##$CPDPRG1= <>
##$CPDPRG2= <>
##$CPDPRG3= <>
##$CPDPRG4= <mlev>
##$CPDPRG5= <mlev>
##$CPDPRG6= <mlev>
##$CPDPRG7= <mlev>
##$CPDPRG8= <mlev>
##$CPDPRGB= <>
##$CPDPRGT= <>
##$D= (0..31)
0 1 0 0 0 0 0 0 0 0.06 0 0 0 0 0 0 0.0002 0 0 0 0 0 0 0 0 0 0 0 0 0 0 
0 
##$DATE= 1179914652
##$DBL= (0..7)
120 120 120 120 120 120 120 120 
##$DBP= (0..7)
150 150 150 150 150 150 150 150 
##$DBP07= 0
##$DBPNAM0= <>
##$DBPNAM1= <>
$$ [...]
##$SUBNAM7= <"">
##$SUBNAM8= <"">
##$SUBNAM9= <"">
##$SW= 20.6930455092707
##$SWIBOX= (0..15)
0 0 3 0 0 0 0 0 0 0 0 0 0 0 0 0 
##$SW_h= 5175.983436853
##$TD= 65536
##$TD0= 1
##$TE= 683.16
##$TE2= 300
##$TE3= 300
##$TEG= 300
##$TL= (0..7)
0 120 120 120 120 120 120 120 
##$TP= (0..7)
150 150 150 150 150 150 150 150 
##$TP07= 0
##$TPNAME0= <>
##$TPNAME1= <>
##$TPNAME2= <>
##$TPNAME3= <>
##$TPNAME4= <>
##$TPNAME5= <>
##$TPNAME6= <>
##$TPNAME7= <>
##$TPOAL= (0..7)
0.5 0.5 0.5 0.5 0.5 0.5 0.5 0.5 
##$TPOFFS= (0..7)
0 0 0 0 0 0 0 0 
##$TUNHIN= 0
##$TUNHOUT= 0
##$TUNXOUT= 0
##$USERA1= <user>
##$USERA2= <user>
##$USERA3= <user>
##$USERA4= <user>
##$USERA5= <user>
##$V9= 5
##$VALIST= <valist>
##$VCLIST= <CCCCCCCCCCCCCCC>
##$VD= 0
##$VDLIST= <DDDDDDDDDDDDDDD>
##$VPLIST= <PPPPPPPPPPPPPPP>
##$VTLIST= <TTTTTTTTTTTTTTT>
##$WBST= 1024
##$WBSW= 4
##$XGAIN= (0..3)
0 0 0 0 
##$XL= 0
##$YL= 0
##$YMAX_a= 299800
##$YMIN_a= -344345
##$ZGOPTNS= <>
##$ZL1= 120
##$ZL2= 120
##$ZL3= 120
##$ZL4= 120
##$ABSF1= 16.522
##$ABSF2= -4.171173
##$ABSG= 5
##$ABSL= 3
##$ALPHA= 0
##$AQORDER= 0
##$ASSFAC= 0
##$ASSFACI= 0
##$ASSFACX= 0
##$ASSWID= 0
##$AUNMP= <proc_1d>
##$AZFE= 0.1
##$AZFW= 0.1
##$BCFW= 0
##$BC_mod= 0
##$BYTORDP= 0
##$COROFFS= 0
##$CY= 12.5
##$DATMOD= 1
##$DC= 0
##$DFILT= <>
##$DTYPP= 0
##$F1P= 14.0000005364418
##$F2P= -0.99999901652339
##$FCOR= 0.5
##$FTSIZE= 32768
##$FT_mod= 6
##$GAMMA= 0
##$GB= 0
##$INTBC= 1
##$INTSCL= 1
##$ISEN= 128
##$LB= 0.3
##$LEV0= 0
##$LPBIN= 0
##$MAXI= 10000
##$MC2= 0
##$MEAN= 0
##$ME_mod= 0
##$MI= 0
##$NCOEF= 0
##$NC_proc= -2
##$NLEV= 6
##$NOISF1= 0
##$NOISF2= 0
##$NSP= 0
##$NTH_PI= 0
##$NZP= 0
##$OFFSET= 16.522
##$PC= 1
##$PHC0= -54.11463
##$PHC1= 3.121925
##$PH_mod= 1
##$PKNL= yes
##$PPARMOD= 0
##$PSCAL= 4
##$PSIGN= 0
##$REVERSE= no
##$SF= 250.13
##$SI= 32768
##$SIGF1= 0
##$SIGF2= 0
##$SINO= 400
##$SIOLD= 32768
##$SREGLST= <1H.CDCl3>
##$SSB= 0
##$STSI= 32768
##$STSR= 0
##$SW_p= 5175.98343685301
##$SYMM= 0
##$S_DEV= 0
##$TDeff= 65536
##$TDoff= 0
##$TI= <Analysis number 999999
Compound Code 99
Book Reference 9
Project Code 9>
##$TILT= no
##$TM1= 0
##$TM2= 0
##$TOPLEV= 0
##$USERP1= <user>
##$USERP2= <user>
##$USERP3= <user>
##$USERP4= <user>
##$USERP5= <user>
##$WDW= 1
##$XDIM= 32768
##$YMAX_p= 296628823
##$YMIN_p= -185136
$$ End of Bruker specific parameters
$$ ---------------------------------
##NTUPLES= NMR SPECTRUM
##VAR_NAME=  FREQUENCY,     SPECTRUM/REAL,   SPECTRUM/IMAG
##SYMBOL=    X,             R,               I
##VAR_TYPE=  INDEPENDENT,   DEPENDENT,       DEPENDENT
##VAR_FORM=  AFFN,          ASDF,            ASDF
##VAR_DIM=   32768,         32768,           32768
##UNITS=     HZ,            ARBITRARY UNITS, ARBITRARY UNITS
##FACTOR=    0.157963299565203, 1,           1
##FIRST=     4132.6476996994, 0,             0
##LAST=      -1043.33573715361, 0,           0
##MIN=       -1043.33573715361, -185136,     0
##MAX=       4132.6476996994, 296628823,     0
$$ Real data points
##PAGE= N=1
##DATA TABLE= (X++(R..R)), XYDATA
$$ [...]
17237g603P414L561o478n274l041j818J789L849Q42P00p46m37k971K534P863n641
$$ -7603 -189 3372 -3106 -8380 -11421 -13239 -11450 -7601 -6759 -6059 -6805 -7242 -10213 -7679 184 -5457
17221e457m011K672K549K057o422k453l927L543P055K602p838l39P162M77p83
$$ -5457 -9468 -6796 -4247 -2190 -8612 -11065 -14992 -11449 -4394 -1792 -9630 -9969 -2807 -2330 -3113
17206c113j281j868j804N279J818j655M622k421k967J26o642p18l551j701L533
$$ -3113 -4394 -6262 -8066 -2787 -969 -2624 1998 -423 -3390 -3264 -9906 -10624 -14175 -15876 -12343
17191a2343J1003Q672k62m486l428q23L313k803q563P291P852K785l747m656l454
$$ -12343 -1340 7332 7070 2584 -844 -1667 1646 -1157 -9720 -2429 5423 8208 4461 -195 -3649
17176c649R846O449m599K965L564o861j5015n643J690K524J655l06P606J558k628
$$ -3649 6197 12646 8047 11012 14576 7715 -7300 -12943 -11253 -8729 -7074 -7380 226 1784 -844
17161h44pk093K622l309o187l813K27J87R48Q591Q537j200q091l093N37n704J761
$$ -844 -851 -2944 -322 -3631 -9818 -13631 -13404 -13217 -12269 -3678 4859 3659 -4432 -7525 -6988 -12692 -10931
17144a0931P70j382l05K439K53J137J723n114N108J183k747J079P605N295l909
$$ -10931 -10161 -11543 -11848 -9409 -9156 -8019 -6296 -11410 -6302 -5119 -7866 -6787 818 6113 2204
17129B204k426p982k602J389P144Q374M593l982j793k504M86q67J417n451o14
$$ 2204 -222 -8204 -10806 -9417 -2273 6101 10694 6712 4919 2415 2901 2034 3451 -2000 -2614
17114b614k433l047j708K792j186L359P317L251j669l953k270J324J557o62l377
$$ -2614 -5047 -8094 -9802 -7010 -8196 -4837 2480 5731 4062 109 -2161 -837 720 58 -3319
17099c319l382j219l298r51Q70J667m0l47P205o218J912J591N926m00p566m667
$$ -3319 -6701 -7920 -11218 -12169 -11299 -9632 -9672 -10019 -2814 -9032 -7120 -5529 397 -3 -7569 -12236
17083a2236o86J765K980K011o000l727l67Q620P788K44M321N611p549j1009n680
$$ -12236 -12922 -11157 -8177 -6166 -12166 -15893 -16260 -7640 148 392 4713 10324 2775 -8234 -13914
17068a3914m366L258O104K782J315j829R86M212L432l671L400M740l363n185m638
$$ -13914 -18280 -15022 -8918 -6136 -4821 -6650 -5664 -1452 1980 -1691 1709 6449 3086 -2099 -6737
17053f737L985l011m72k576k633j417l488L647R678O56r52k173M114L255n811
$$ -6737 -2752 -5763 -6235 -8811 -11444 -12861 -16349 -12702 -3024 -2368 -3320 -5493 -1379 1876 -3935
17038c935k262k270k013k566l180N799K806J112m732l150l609k561M453k82J561
$$ -3935 -6197 -8467 -10480 -13046 -16226 -10427 -7621 -6509 -11241 -14391 -18000 -20561 -16108 -16390 -14829
17023a4829K027J826L442J343J468q203l168j558k792k552J024Q604Q412k593
$$ -14829 -12802 -10976 -7534 -6191 -4723 -12926 -16094 -17652 -20444 -22996 -21972 -13368 -4956 -7549
17009g549L875J768L872m426l868o157k653Q525j04o780K476m97p062j024Q751
$$ -7549 -3674 -1906 1966 -2460 -6328 -12485 -15138 -6613 -6717 -13497 -11021 -11518 -18580 -19604 -10853
16994a0853N963r51j186n477K251JN944K370p653r498j684Q64j0398N9J1709Q268
$$ -10853 -4890 -5841 -7027 -12504 -10253 -10252 -4308 -1938 -9591 -19089 -20773 -19909 -30307 -30248 -18539 -10271
16978a0271N14r28j646l221r57N050N428j608q87L380k00r91j946m445K893J958
$$ -10271 -9757 -10685 -12331 -15552 -16509 -11459 -6031 -7639 -8526 -5146 -5346 -6337 -8283 -12728 -9835 -7877
16962g877N582J497j094p51l764n276J128L638L566n271m193J516O563m24j570
$$ -7877 -2295 -798 -1892 -2643 -6407 -11683 -10555 -6917 -3351 -8622 -12815 -11299 -4736 -5160 -6730
16947f730J333J942j282l45k924M155O63l940m439J944j131m260l68P274J57M86
$$ -6730 -5397 -3455 -4737 -5082 -8006 -3851 -3188 -7128 -11567 -9623 -10754 -15014 -15382 -8108 -7951 -7465
16931g465k164L416j11R068k439j1668r090P662Q489N224r22j0755q111p45N193
$$ -7465 -9629 -6213 -6324 2744 305 -11363 -20453 -12791 -4302 922 0 -10755 -18866 -19611 -14418
16916a4418M627J188j0628j797K946M972N548K955r82K326q80n861K456K181K242
$$ -14418 -9791 -8603 -19231 -21028 -18082 -13110 -7562 -4607 -5589 -3263 -4143 -10004 -7548 -5367 -3125
16901c125J748K753O811M231k928m000o651j266n46j498j537P76q908m126L000
$$ -3125 -1377 1376 8187 12418 9490 5490 -1161 -2427 -2973 -4471 -6008 -5232 -14140 -18266 -15266
16886a5266j984l63O053L031L471j3j67j883K06L806k39K545j403n632k047l314
$$ -15266 -17250 -17613 -11560 -8529 -5058 -5071 -5238 -7121 -6915 -3109 -3348 -803 -2206 -7838 -9885 -13199
16870a3199Q63Q699J196l42J750K710K45J231K520j723j0017q409K618k506p77
$$ -13199 -12336 -3637 -2441 -2783 -1033 1677 1922 3153 5673 3950 -6067 -14476 -11858 -14364 -15141
16855a5141J0351j685L626K388N11J99l611j655L438L637j686m553j327J228N75
$$ -15141 -4790 -6475 -2849 -461 50 249 -3362 -5017 -1579 2058 372 -4181 -5508 -4280 -3705
16840c705L090l832p687k853M11L583J2073J12r674o145k529K317J079j079M8
$$ -3705 -615 -4447 -12134 -14987 -14576 -10993 1080 1192 -8482 -14627 -17156 -14839 -13760 -14839 -14791
16825a4791M65k323L534p75O74P377J129K847o17j639N582L103R37k962q612l857
$$ -14791 -14326 -16649 -13115 -13890 -13216 -5839 -4710 -1863 -2480 -4119 1463 4566 5503 2541 -6071 -9928
16809i928M253m265L63J864n421o690K708R457m087o492l540P97Q395k007p5M440
$$ -9928 -5675 -9940 -9577 -7713 -13134 -19824 -17116 -7659 -11746 -18238 -21778 -20981 -12586 -14593 -14668 -10228
16793a0228o658k381k000N610L181n33K032L397k371l440r84l994J737N163J441
$$ -10228 -16886 -19267 -21267 -15657 -12476 -13009 -10977 -7580 -9951 -13391 -14375 -18369 -16632 -11469 -10028
16778a0028N249K624l24m151L219j101J859l082m917j173P71K148Q97q29p542
$$ -10028 -4779 -2155 -2479 -6630 -3411 -4512 -2653 -5735 -10652 -11825 -11054 -8906 -8009 -8838 -16380
16763a6380M423K976m267m102J208O250O392K1l706j176l168L750K058n085j459
$$ -16380 -11957 -8981 -13248 -17350 -16142 -9892 -3500 -3479 -7185 -8361 -11529 -7779 -5721 -10806 -12265
16748a2265J29M587K532Q239O677l422j0553j0394j605L815N373J848l119M375
$$ -12265 -12136 -7549 -5017 3222 9899 6477 -4076 -14470 -16075 -12260 -6887 -5039 -8158 -3783
16734c783L332L75q59Pp237k218L425M166o514L932P089J659n219m534L066k212
$$ -3783 -451 -76 -935 -928 -8165 -10383 -6958 -2792 -9306 -5374 1715 3374 -1845 -6379 -3313 -5525
16718e525K298R584n83l878k51j334n174j24J50O250m132o673l544K742O384M966
$$ -5525 -3227 6357 5774 1896 1645 311 -4863 -4987 -4837 1413 -2719 -9392 -12936 -10194 -3810 1156
16702A156j10k61n953o847j178Q031N497k695l533n983J597L20k338M58L770J457
$$ 1156 1046 785 -5168 -12015 -13193 -5162 335 -2360 -5893 -11876 -10279 -9959 -12297 -11839 -8069 -6612
16686f612J060K289Q335k55j6278o899O911M443l552k639J141N120j099J650n540
$$ -6612 -5552 -3263 5072 4817 -11461 -18360 -11449 -7006 -10558 -13197 -12056 -6936 -8035 -6385 -11925
16671a1925K409K565N309K608j254j05Q198K90K710j845j457j963j424r749j230
$$ -11925 -9516 -6951 -1642 966 -288 -393 7805 8095 10805 8960 7503 5540 4116 -5633 -6863
16656f863Q75K82J480M121J720oQ65n994k676j944M38Q52k427n991o183L031j866
$$ -6863 -5988 -5706 -4226 -105 1615 1609 2474 -3520 -6196 -8140 -7702 -6850 -9277 -15268 -21451 -18420 -20286
16639b0286j516J389J750o997M917M528o010M889Q164J784r9k913k858k326K854
$$ -20286 -21802 -20413 -18663 -25660 -20743 -16215 -22225 -17336 -9172 -7388 -7487 -10400 -13258 -15584 -12730
16624a2730J610J0169K789q363l252Q91o492j918K509N399K602Q109L687m672
$$ -12730 -11120 -951 1838 -6525 -9777 -8886 -15378 -17296 -14787 -9388 -6786 1323 5010 338
16610C38k346n624j463J28j141n367N91K478J029O566N633k075l430K337R38j647
$$ 338 -2008 -7632 -9095 -8967 -10108 -15475 -14884 -12406 -11377 -4811 822 -1253 -4683 -2346 -1408 -3055
16594c055l687k970j876M759N378l389r400l868L155R303J490N997K814m150m631
$$ -3055 -6742 -9712 -11588 -6829 -1451 -4840 -14240 -18108 -14953 -5650 -4160 1837 4651 501 -4130
16579d130J098J904M62L568K975K605j1664l627L787k3p040J043O288l002J268
$$ -4130 -3032 -1128 -666 2902 5877 8482 -3182 -6809 -3022 -3045 -10085 -9042 -2754 -5756 -4488
16564d488k606m326M595M964o2j687K345l7l013j116k773L48N297J845j684k898
$$ -4488 -7094 -11420 -6825 -1861 -1923 -3610 -1265 -1302 -4315 -5431 -8204 -7856 -2559 -714 -2398 -5296
16548e296m481l885L919Q292k756M543O043J725o864L243p320k671K596k346l699
$$ -5296 -9777 -13662 -9743 -1451 -4207 336 6379 8104 1240 4483 -2837 -5508 -2912 -5258 -8957
16533h957R58K181k176l882k934M713L314l756M200N419Q44N250J255m521n296
$$ -8957 -7999 -5818 -7994 -11876 -14810 -10097 -6783 -10539 -6339 -920 -76 5174 6429 1908 -3388
16518c388j408r97j59k148k908j74J051K864J95j258l125J96J661N42M936Q64
$$ -3388 -4796 -5793 -5952 -8100 -11008 -11182 -10131 -7267 -7072 -8330 -11455 -11259 -9598 -9056 -4120 -3256
16502c256n96M263P124m383q775L033J1376l921n860j770M513j8n108K124J379
$$ -3256 -3852 411 7535 3152 -5623 -2590 8786 4865 -995 -2765 1748 1730 -3378 -1254 125
16487A25p09J503k554L52j160q820l655N407L845j488j705l060O407j526L066
$$ 125 -584 919 -1635 -1283 -2443 -11263 -14918 -9511 -5666 -7154 -8859 -11919 -5512 -7038 -3972
16472c972k658k425j37j72j303j239k46Q401M124q180K180O301N915K747m244
$$ -3972 -6630 -9055 -9192 -9364 -10667 -11906 -12152 -3751 373 -7807 -5627 674 6589 9336 5092
16457E092l464j207j655N6o569n094m607M466L49J766K640K670L265O00l299K060
$$ 5092 1628 421 -1234 -1178 -7747 -12841 -17448 -12982 -12633 -10867 -8227 -5557 -2292 -1692 -4991 -2931
16441b931J97M905m013P02j640k947k456n257k91O171N146O815l683L441J178
$$ -2931 -2734 2171 -1842 -1140 -2780 -5727 -8183 -13440 -13731 -7560 -2414 4401 718 4159 5337
16426E337m141J273K048j969o626k583M172j603m720l706Q091O968K390O375r63
$$ 5337 1196 2469 4517 2548 -4078 -6661 -2489 -4092 -8812 -12518 -4427 2541 4931 11306 10343
16411A0343O461j988j2041j803Q487m177j340j241j884r85j741q254o34L734J093
$$ 10343 16804 14816 2775 972 9459 5282 3942 2701 817 -168 -1909 -10163 -10797 -7063 -5970
16396e970l905N79O337q68k011J022j996j616R44Q305O229j904j469p40m058M86
$$ -5970 -9875 -9296 -2959 -3827 -5838 -4816 -6812 -8428 -7484 821 7050 5146 3677 2937 -1121 -635
16380f35j853K66J208k776O67k022j381K252L747M90l38L727P467j009p252j342
$$ -635 -2488 -2222 -1014 -3790 -3123 -5145 -6526 -4274 -527 -37 -375 3352 10819 9810 2558 1216
16364A216k471n438J043j436j274M550N245P03m55l416j263p049o96j390M085
$$ 1216 -1255 -6693 -5650 -7086 -8360 -3810 1435 2138 1683 -1733 -2996 -10045 -10741 -12131 -8046
16349h046K500m46K386L928n943j403j91M291n202j258j240l677j626L158K737
$$ -8046 -5546 -5992 -3606 322 -5621 -7024 -7215 -2924 -8126 -9384 -10624 -14301 -15927 -12769 -10032
16334a0032K749j079k410J536M074K240l316R68O20n64j172l703o442K429M122
$$ -10032 -7283 -8362 -10772 -9236 -5162 -2922 -6238 -5270 -4650 -5214 -6386 -10089 -16531 -14102 -9980
16319i980N797l541r724m229N392L748Q381L437j910j872J341K215L283r76l726
$$ -9980 -4183 -7724 -17448 -21677 -16285 -12537 -4156 -719 -2629 -4501 -3160 -945 2338 1362 -2364
16304b364M520P429j109j2024M844j940n843n63L07L609L394l95m725q662j352
$$ -2364 2156 9585 8476 -3548 1296 -644 -6487 -7050 -6743 -3134 260 -135 -4860 -13522 -14874
16289a4874m87K14Q570P95Q95O178J430o99j575M25m491J956M668m074m985k550
$$ -14874 -15361 -15147 -6577 -5782 -4887 1291 2721 2022 447 872 -3619 -1663 3005 -1069 -6054 -8604
16273h604M419j401J233j92P32P728Q246m322n619J2j042m10j487L49o090K452
$$ -8604 -4185 -5586 -4353 -4545 -3813 3915 12161 7839 2220 2232 1190 780 -707 -358 -6448 -3996
16257c996l36N403j045M34L03m809m186o294m999l002M291N958L896j35K814j916
$$ -3996 -4332 1071 26 460 763 -4046 -8232 -14526 -19525 -22527 -18236 -12278 -8382 -8517 -5703 -7619
16241g619j404j562q19j011k983K82L74P460P45K669M408m916j968n396N593j477
$$ -7619 -9023 -10585 -11404 -12415 -15398 -15116 -14742 -7282 -6537 -3868 540 -4376 -6344 -11740 -6147 -7624
16225g624J113l95P65l460j837K997Q015K528j000m80j776n24m990J319o285o541
$$ -7624 -6511 -6906 -6141 -9601 -11438 -8441 -426 2102 1102 622 -1154 -1678 -6668 -5349 -11634 -18175
16209a8175J1011R406K002l520m174J283N495P382k536p258n340L683o715o233
$$ -18175 -7164 2242 4244 724 -3450 -2167 3328 10710 8174 916 -4424 -741 -7456 -13689
16195a3689j167k783K729Q378Q668O581m64m326n122l639j326l044J210k303K314
$$ -13689 -14856 -17639 -14910 -6532 2136 8717 8253 3927 -1195 -4834 -6160 -9204 -7994 -10297 -7983
16180g983P194L996L03n037n56R07m874j607Q459l47k515p441L370Q873m107k174
$$ -7983 -789 3207 3510 -1527 -2083 -1176 -6050 -7657 802 455 -2060 -9501 -6131 2742 -1365 -3539
16164c539l605J594M869l070n522j650Q861m218Q8M07n625m058P555k296Q11L152
$$ -3539 -7144 -5550 -681 -3751 -9273 -10923 -2062 -6280 -6192 -5785 -11410 -15468 -7913 -10209 -9398 -6246
16148f246k746M732M371J348K473j575j48j373k736M521K422m929m419k37N989
$$ -6246 -8992 -4260 111 1459 3932 2357 2209 836 -1900 2621 5043 114 -4305 -4542 1447
16133A447R79L930O2j336j676n508l531l634j895J016Q046J721n410M063j369
$$ 1447 2426 6356 6418 5082 3406 -2102 -5633 -9267 -11162 -10146 -2100 -379 -5789 -1726 -3095
16118c095O79j578j0290k996L607j9k352q897J008J1725N496k639L322J055k742
$$ -3095 -2416 -3994 -14284 -17280 -13673 -13692 -16044 -24941 -23933 -12208 -6712 -9351 -6029 -4974 -7716
16103g716n24K337k303m134lL256M975N53l637K798m628o120j993K06J748J909
$$ -7716 -8240 -5903 -8206 -12340 -12343 -9087 -4112 -3559 -7196 -4398 -9026 -15146 -17139 -16933 -15185 -13276
16087a3276M399q181m706M566J1658J638k177K384J056K519J296J919Q33J553
$$ -13276 -8877 -17058 -21764 -17198 -5540 -3902 -6079 -3695 -2639 -120 1176 3095 3928 5481
16073E481j20p605q210M482O391P786r512l999k231M924K565L23j726k484l938
$$ 5481 5361 -2244 -10454 -5972 419 8205 -1307 -5306 -7537 -2613 -48 275 -1451 -3935 -7873
16058g873oM383L464L063l61r676k101J0103N492m282q3j814L353M085j478m195
$$ -7873 -7879 -3496 -32 3031 2670 -7006 -9107 996 6488 2206 2123 309 3662 7747 6269 2074
16042B074j042O472K936j388o334r952N36M716l673j564Q36j338J128j788J376
$$ 2074 1032 7504 10440 9052 2718 -7234 -6698 -1982 -5655 -7219 -6383 -7721 -6593 -8381 -7005
16027g005J549k667n832m076j221M247p318m641J5362M484l223M145J469K389
$$ -7005 -5456 -8123 -13955 -18031 -19252 -15005 -22323 -26964 -11602 -7118 -10341 -6196 -4727 -2338
16013b338n553J93O76O688L199l724r080q31Q486N199k078m155J15O69o287l577
$$ -2338 -7891 -7698 -7022 -334 2865 -859 -9939 -10770 -2284 2915 837 -3318 -3203 -2534 -8821 -12398
15997a2398j399L947P732N081j985k739M277o491j711O07r61M80k94l57J841N089
$$ -12398 -13797 -9850 -2118 2963 978 -1761 2516 -3975 -5686 -5079 -6040 -5560 -5854 -6211 -4370 719
15981G19l133l000k87J598L675l957o560J490K964k038j826K926O185l822k625
$$ 719 -2414 -5414 -5701 -4103 -428 -4385 -10945 -9455 -6491 -8529 -10355 -7429 -1244 -5066 -7691
15966g691N120k945j0360M070N209j589M21N967O087l912m37j321j326k934M659
$$ -7691 -2571 -5516 -15876 -11806 -6597 -8186 -7765 -1798 4289 377 -60 -1381 -2707 -5641 -982
15951i82K892k575q54K498q65m992j759j035L972N262O275j796r824k030N445
$$ -982 1910 -665 -1519 979 114 -4878 -6637 -7672 -3700 1562 7837 6041 -3783 -5813 -368
15936c68O201m117n881k457J648K827K892l591J004k310l308j822j93O098N762
$$ -368 5833 1716 -4165 -6622 -4974 -2147 745 -2846 -1842 -4152 -7460 -9282 -9475 -3377 2385
15921B385Q77J843k153m962l500J32K138L813O480k039K727j17j74k717q174k468
$$ 2385 3262 5105 2952 -2010 -5510 -5378 -3240 573 7053 5014 7741 7624 7450 4733 -3441 -5909
15905e909K599K344m344J596M528l61N608J168n86r42o301n453k557j107N687
$$ -5909 -3310 -966 -5310 -3714 814 453 6061 7229 6643 5701 -600 -6053 -8610 -9717 -4030
15890d030L739N97N726P318J675k162k647k398r52r832j579m724j733J2436K177
$$ -4030 -291 306 6032 13350 15025 12863 10216 7818 6866 -2966 -4545 -9269 -11002 1434 3611
15875C611p457J268L815N54l970K579l874O22N35p366j8K913k477N237P600J474
$$ 3611 -3846 -2578 1237 1791 -2179 400 -3474 -2852 -2317 -9683 -9701 -6788 -9265 -4028 3572 5046
15859E046m207o582M466j460m755r62N832N15O646m588k512N302l413l348j0430
$$ 5046 839 -5743 -1277 -2737 -7492 -8454 -2622 -2107 4539 -49 -2561 2741 -672 -4020 -14450
15844a4450L665K784N589J5176o280q515m43r98r795j096L518L064K246n21k869
$$ -14450 -10785 -8001 -2412 12764 6484 -2031 -2474 -3472 -13267 -14363 -10845 -7781 -5535 -6056 -8925
15829h925O98j771J204K259p92j413K209n93k288k74P228l92m143l081n148K44
$$ -8925 -8227 -9998 -8794 -6535 -7327 -8740 -6531 -7124 -9412 -9686 -2458 -2850 -6993 -10074 -15222 -14978
15813a4978K737m608L498L910J386N616K100J563j241m637Q043M864l901J636
$$ -14978 -12241 -16849 -13351 -9441 -8055 -2439 -339 1224 -17 -4654 3389 8253 4352 5988
15799E988N102P35K119M94l491k413j346k492j078l166p066l073J248m41j143
$$ 5988 11090 11825 13944 14438 10947 8534 7188 4696 3618 452 -6614 -9687 -8439 -8880 -10023
15784a0023J2414J524o402J599o781K105R186L666O142J738l297m690k691p879
$$ -10023 2391 3915 -2487 -888 -7669 -5564 3622 7288 13430 15168 11871 7181 4490 -3389
15770c389q000k72N367j392M102L521l960r37R145J1345Q72l644l372o619M59
$$ -3389 -11389 -11661 -6294 -7686 -3584 -63 -4023 -4960 4185 15530 16402 12758 9386 2767 3226
15755C226o24L632k243l7p67nK442k371K103j184p374o244O254k49l054M884N2
$$ 3226 2602 6234 3991 3954 3187 3182 5624 3253 5356 4172 -3202 -9446 -3192 -3441 -6495 -1611 -1559
15738a559j557K011L344K764k823K237J146j944M474J47n560p204l730N128L96
$$ -1559 -3116 -1105 2239 5003 2180 4417 5563 3619 8093 8240 2680 -4524 -8254 -3126 -2730
15723b730l255J270N115J643K96k298K888K260q53l484j469o95K68J0656R128
$$ -2730 -5985 -4715 400 2043 2339 41 2929 5189 4336 852 -617 -1312 -1044 9612 18740
15708A8740L855J540m257q984k635k518Q28O48J817p283k208m693K892Q597L894
$$ 18740 22595 24135 19878 10894 8259 5741 6569 7217 9034 1751 -457 -5150 -2258 6339 10233
15693A0233j503o722K999M08k902K424N185n037q728L943R617N34n370l468K59
$$ 10233 8730 2008 5007 5415 2513 4937 10122 5085 -3643 300 9917 10451 5081 1613 1872
15678A872K125L729M770%k061J508M324p918l940j395j585J381j149Q176n29k293
$$ 1872 3997 7726 12496 12496 10435 11943 16267 8349 4409 3014 1429 2810 1661 9837 9308 7015
15662G015j663J431K295M701N839k792o626p34k46j898l620K558P704k085K94
$$ 7015 5352 6783 9078 13779 19618 16826 10200 9466 9220 7322 3702 6260 13964 11879 12173
15647A2173l830m178L156M43p778l260K761L225J161M805p543n002j788j005M442
$$ 12173 8343 4165 7321 7764 -14 -3274 -513 2712 3873 8678 1135 -3867 -5655 -6660 -2218
15632b218L715M094L930r60O57p624K32K441K196j341j720k256K818L371O558
$$ -2218 1497 5591 9521 8561 9218 1594 1826 4267 6463 5122 3402 1146 3964 7335 13893
15617A3893K586k121p201P478K893j418l957j688O13m391p400k63k8j976K80j25
$$ 13893 16479 14358 7157 14635 17528 16110 12153 10465 11078 6687 -713 -976 -1004 -2980 -2700 -2825
15601b825o142k774O520J810L706M229J597M379M742k542k428k366l784q64L281
$$ -2825 -8967 -11741 -5221 -3411 295 4524 6121 10500 15242 12700 10272 7906 4122 3258 6539
15586F539M403k829N094n211m884O781r16N77O771N280k491q507J055N161O62
$$ 6539 10942 8113 13207 7996 3112 9893 8977 9554 16325 21605 19114 10607 11662 16823 17485
15571A7485n386j003J008p60m697J315O474P224K707n786l031k778K118j898k328
$$ 17485 12099 11096 12104 11344 6647 7962 14436 21660 24367 18581 15550 12772 14890 12992 10664
15556A0664R37q664K416M247m13K536O992j248n569j881L874J982K508q61k933
$$ 10664 11601 2937 5353 9600 9187 11723 18715 17467 11898 10017 13891 15873 18381 17520 14587
15541A4587P89Q04L315P927J382K719r114q436m703l60M560O278P842k923j860
$$ 14587 15376 16180 19495 27422 28804 31523 22409 13973 9270 8910 13470 19748 27590 24667 22807
15526B2807L414K005j049l046o954K114L448k312k415m490o107M961L329n950
$$ 22807 26221 28226 27177 24131 17177 19291 22739 20427 18012 13522 7415 12376 15705 9755
15512I755O339M927O262o250p545m796n264O097Q665J267n323k2q74k371l13O087
$$ 9755 16094 21021 27283 21033 13488 8692 3428 9525 18190 19457 14134 14112 13238 10867 10554 16641
15496A6641N735J515O395J184j0954n961l400j268N660L653M89l891o664P369
$$ 16641 22376 23891 30286 31470 20516 14555 11155 9887 15547 19200 19689 15798 9134 16503
15482A6503Q750j063q707k552l49J666m405p60K693O659M731k494J204R99M25
$$ 16503 25253 24190 15483 12931 12582 14248 9843 9083 11776 18435 23166 20672 21876 22875 23300
15467B3300K196m568j150l029L373j027Q84J203n416m586L514L106K78J19K372
$$ 23300 25496 20928 19778 16749 20122 19095 19979 21182 15766 11180 14694 17800 18078 18197 20569
15452B0569K090p407m46L836l752J303n273o871P093P29K795Q480o073k578j967
$$ 20569 22659 15252 14806 18642 14890 16193 10920 4049 11142 11871 14666 23146 17073 14495 12528
15437A2528L211j454k77K005n757L509K499k882l820K737O346J763j923j001k044
$$ 12528 15739 14285 14008 16013 10256 13765 16264 13382 9562 12299 18645 20408 18485 17484 15440
15422A5440O72K098m600K136K723k284j506L715m670K470J050n530p75M916l764
$$ 15440 16112 18210 13610 15746 18469 16185 14679 18394 13724 16194 17244 11714 10939 15855 12091
15407A2091R56O462J822n435n900K378J722J883J768J657k971J902N50q595o941
$$ 12091 13047 19509 21331 15896 9996 12374 14096 15979 17747 19404 16433 18335 18885 10290 3349
15392C349P783L813p998K909J833j912N142M819o345m705J206j293o127M232R628
$$ 3349 11132 14945 6947 9856 11689 9777 14919 19738 13393 8688 9894 8601 2474 6706 16334
15377A6334K860J117k426n905N171M252J054q019o984M78L559j523l644J341m404
$$ 16334 19194 20311 17885 11980 17151 21403 22457 14438 7454 7932 11491 9968 6324 7665 3261
15362C261M230R242k471m748l62K49n043j125j220K304Q180J0285O202M585l344
$$ 3261 7491 16733 14262 9514 9152 9401 4358 3233 2013 4317 12497 22782 28984 33569 30225
15347C0225j4046j626o708L262O631j460l235o209l259J23N030O992J865M769
$$ 30225 16179 14553 7845 11107 17738 16278 13043 6834 3575 3698 8728 15720 17585 22354
15333B2354j094m163o453j686r520j847l532P152J1722K165L93k241O54J097j834
$$ 22354 21260 17097 10644 8958 -562 -2409 -5941 1211 12933 15098 15491 13250 13904 15001 13167
15318A3167l303o063M276L226L131m282j860J337k484j576K055j847l388K920
$$ 13167 9864 3801 8077 11303 14434 10152 8292 9629 7145 5569 7624 5777 2389 5309
15304E309N61J532R77Q76j072R94M39q778J868R06M04p749M883R548K977J345
$$ 5309 5870 7402 8379 9255 8183 9177 9616 838 2706 3612 4016 -3733 1150 10698 13675 15020
15288A5020o911o520j21K593N325k447J609M188M156J958O196n959l890j216p103
$$ 15020 8109 1589 1468 4061 9386 6939 8548 12736 16892 18850 25046 19087 15197 13981 6878
15273F878q169L882Q523o675K028O49K337J214J881M013J689n561o046k262Q08
$$ 6878 -1291 2591 11114 4439 6467 7116 9453 10667 12548 16561 18250 12689 6643 4381 5189
15258E189j641k344K196N298o27n86O060L436k803J23K022k948J364O463q41j516
$$ 5189 3548 1204 3400 8698 8071 7485 13545 16981 14178 14301 16323 13375 14739 21202 20361 18845
15242A8845m534m024o175j829m84J269L634N712J148l728j038j041M164J404J271
$$ 18845 14311 10287 4112 2283 1799 3068 6702 12414 13562 9834 8796 7755 11919 13323 14594
15227A4594Q542q46l330m355k841l912m925j084N92k893M580J698k907o33m13
$$ 14594 23136 22290 18960 14605 11764 7852 2927 1843 2435 -458 4122 5820 2913 2280 1867
15212A867p66J535l747k187R36j601l714L314j209N25m739R04P013J20M951n95
$$ 1867 1101 2636 -1111 -3298 -2362 -3963 -7677 -4363 -5572 -5047 -9786 -8882 -1869 -1749 3202 2607
15196B607M014M506k791o932n845j603j212M142m659j845L043J586N827N447l232
$$ 2607 6621 11127 8336 1404 -4441 -6044 -7256 -3114 -7773 -9618 -6575 -4989 838 6285 3053
15181C053O12M514Q462K359p090N39p597m553M035M097k2k099j347K498K771m692
$$ 3053 3665 8179 16641 19000 11910 12449 4852 299 4334 8431 8409 6310 4963 7461 10232 5540
15165E540r917j475N957L539j619l43j361n649L216p42j678K297m877k78Q682
$$ 5540 -4377 -5852 105 3644 2025 1682 321 -5328 -2112 -2854 -4532 -2235 -7112 -7390 1292
15150A292K299l860p486N54L688M35m53P972Q833m594o537O230p43m396l265L797
$$ 1292 3591 -269 -7755 -7201 -3513 -3078 -3531 4441 13274 8680 2143 8373 7630 3234 -31 3766
15134C766m68j986M679o96J848L99o918m60N432m810p49K616k677K241O376n228
$$ 3766 3298 1312 5991 5295 7143 7542 624 164 5596 786 37 2653 -24 2217 8593 3365
15118C365p467K148o714M047M938l93n741J477J267N328L034l431k186Q45J732
$$ 3365 -4102 -1954 -8668 -4621 317 -76 -5817 -4340 -3073 2255 5289 1858 -328 517 2249
15103B249n789m917L738J226k429J347O496o18M195O572q904l482l115K446J597
$$ 2249 -3540 -8457 -4719 -3493 -5922 -4575 1921 1303 5498 12070 3166 -316 -3431 -985 612
15088F12n035L076N006N135L92k592p729k748N733M268P674K904l399m672m536
$$ 612 -4423 -1347 3659 8794 9186 6594 -1135 -3883 1850 6118 13792 16696 13297 8625 4089
15073D089M282m936M245K154p068l496N29k957k568N889n64o893M992J770l023
$$ 4089 8371 3435 7680 9834 2766 -730 -201 -3158 -5726 163 -401 -7294 -2302 -532 -3555
15058c555O11j267p97M32l061k245L789J4035P074J052r56l585J856q263l554
$$ -3555 -2944 -4211 -5008 -4576 -7637 -9882 -6093 7942 15016 16068 15112 11527 13383 5120 1566
15043A566r025K304O850k194K16n432j44M876n92j46j71L680J824l371N700n196
$$ 1566 -7459 -5155 1695 -499 -283 -5715 -5859 -983 -1575 -1721 -1892 1788 3612 241 5941 745
15027G45j379m588K20P26N449J049K664n904m161J894L582k579k381R34J46Q338
$$ 745 -634 -5222 -5002 -4276 1173 2222 4886 -1018 -5179 -3285 297 -2282 -4663 -3729 -3583 4755
15011D755J473m041l381L105M781J12o42M447o830K76j894j18L026n351J321j493
$$ 4755 6228 2187 -1194 1911 6692 6804 6162 10609 3779 4055 2161 2043 5069 -282 1039 -454
14995d54m221l582j656M036j262N49j312P419N660j470L478l772l02m718o23k943
$$ -454 -4675 -8257 -9913 -5877 -7139 -6590 -7902 -483 5177 3707 7185 3413 3111 -1607 -2230 -5173
14979e173j834K247R08k487l460L552k59J81L365k950J103Q369O316m885p660
$$ -5173 -7007 -4760 -3852 -6339 -9799 -6247 -6506 -6325 -2960 -5910 -4807 3562 9878 4993 -2667
14964b667l173N274M408n780n011M015K245M280L289k021N82K476l221J936P543
$$ -2667 -5840 -566 3842 -1938 -6949 -2934 -689 3591 6880 4859 5441 7917 4696 6632 14175
14949A4175k520m062O051k82q280j173J852l490o537L14M596m01J52L900J372
$$ 14175 11655 7593 13644 13362 5082 3909 5761 2271 -4266 -3952 644 243 395 4295 5667
14934E667q49M639N200M683k216q849j275k490p372J800L175o662P03O24J984
$$ 5667 4818 9457 14657 19340 17124 8275 7000 4510 -2862 -1062 2113 -4549 -3846 -3222 -1238
14919a238n168J116k704l550O612K858n52n814k68K856L65M406M266J885M218
$$ -1238 -6406 -5290 -7994 -11544 -4932 -2074 -2626 -8440 -8708 -5852 -5487 -1081 3185 5070 9288
14904I288l642m105J802o362n915M008Q300m694j346J573N735P77k337j003O80
$$ 9288 5646 1541 3343 -3019 -8934 -4926 3374 -1320 -2666 -1093 4642 5419 3082 2079 2759
14889B759o187K822J415R892Q72n468m99j840j795J353J320m108k462k52P572
$$ 2759 -3428 -606 809 10701 11573 6105 5606 3766 1971 3324 4644 536 -1926 -2178 5394
14874E394J233q691k218J102M390J977k369l474o0P426P65m710m457k36O244O25
$$ 5394 6627 -2064 -4282 -3180 1210 3187 818 -2656 -2716 4710 5475 765 -3692 -3928 2316 2941
14858B941m359N946P129p568L18O32q461J406k863k966J285P829P902q415k184
$$ 2941 -1418 4528 11657 4089 4407 5039 -3422 -2016 -4879 -7845 -6560 1269 9171 756 -1428
14843a428M906L273n470l750K791k686L60n632k703J383n881o52L698J1593P940
$$ -1428 3478 6751 1281 -2469 322 -2364 -2004 -7636 -10339 -8956 -14837 -15489 -11791 -198 7742
14828G742J062m734l719J140M927n916k965J87K312M903L864q405O083M971K394
$$ 7742 8804 4070 351 1491 6418 502 -2463 -2276 36 4939 8803 398 6481 11452 13846
14813A3846J893l682o475l385K079k298K84M018R56l992m490J966m506L501J107
$$ 13846 15739 12057 5582 2197 4276 1978 2262 6280 7236 3244 -1246 720 -3786 -285 822
14798H22N20J470k823M5k203k989j622P416J239n848m116M806R60m949l930q58
$$ 822 1342 2812 -11 34 -2169 -5158 -6780 636 1875 -3973 -8089 -3283 -2323 -7272 -11202 -12060
14782a2060n548N986O130O64j837O718K716K378o169l176n671Q513P913k520p32
$$ -12060 -17608 -11622 -5492 -4828 -6665 53 2769 5147 -1022 -4198 -9869 -1356 6557 4037 3305
14767C305K172n767l455K294M679j241K592l530r658m6K769M841J489N112M667
$$ 3305 5477 -290 -3745 -1451 3228 1987 4579 1049 -8609 -8655 -5886 -1045 444 5556 10223
14752A0223J440j805l3L88m160K662J701o259l084j196L786k322J373P160K436
$$ 10223 11663 9858 9825 10213 6053 8715 10416 4157 1073 -123 3663 1341 2714 9874 12310
14737A2310m879l845n841j467N807N242m178k134k096l694M70L344M283N534J249
$$ 12310 7431 3586 -2255 -3722 2085 7327 3149 1015 -1081 -4775 -4305 -961 3322 8856 10105
14722A0105j554L761k334j658m185l376K448J600M385j167j0738n650J496J1868
$$ 10105 8551 12312 9978 8320 4135 759 3207 4807 9192 8025 -2713 -8363 -6867 5001
14708E001L357j097j0144M477P288j549m002J661K888K192j912J445n569q53k346
$$ 5001 8358 7261 -2883 1594 8882 7333 3331 4992 7880 10072 8160 9605 4036 3183 837
14693H37Q60m97Q26j913J983K537J834j422K96l771m003K354P3p69p95l62L236
$$ 837 1697 1200 2026 113 2096 4633 6467 5045 5341 1570 -2433 -79 -6 -775 -1570 -1932 1304
14676A304L675P393K72j360J313m279k006M322m271o949k356j002L00M244k489
$$ 1304 4979 12372 12644 11284 12597 8318 6312 10634 6363 -586 -2942 -3944 -3644 600 -1889
14661a889m133p9j167L626P652J427o49K309k69j239k901m030Q3k784l195R297
$$ -1889 -6022 -6101 -7268 -3642 4010 5437 4788 7097 6828 5589 2688 -1342 -1259 -4043 -7238 2059
14645B059Q036O30l659l521M96K728j990K914J179j383O672J039p42J065r97O75
$$ 2059 10095 10725 7066 3545 4041 6769 4779 7693 8872 7489 14161 15200 14458 15523 14526 15201
14629A5201k074r037n309L028j25M91K847Q177M640j091K798o737J132l183j0779
$$ 15201 13127 4090 -1219 1809 1684 2175 5022 13199 17839 16748 19546 12809 13941 10758 -21
14614b1j90m242l97L424l034l164k716j219L616N817L460o830J089M47M688O616
$$ -21 -211 -4453 -4850 -1426 -4460 -7624 -10340 -11559 -7943 -2126 1334 -5496 -4407 -3960 728 7344
14598G344R278l878J912J726j654L133l003l320o794m358N25M656O739L297k881
$$ 7344 16622 12744 14656 16382 14728 17861 14858 11538 4744 386 911 5567 12306 15603 12722
14583A2722p004k618K596R548J172j936l079M104M913j00m780j46r021o831J415
$$ 12722 5718 3100 5696 15244 16416 14480 11401 15505 20418 20318 15538 15392 6371 -460 955
14568I55m661P598N955j00l140P72L821L431m308n605l481p233m051R971L404
$$ 955 -3706 3892 9847 9747 6607 7379 11200 14631 10323 4718 1237 -5996 -10047 -76 3328
14553C328l734j562L720m556j270J772N928K100l462n998K257J452J634Q5r07
$$ 3328 -406 -1968 1752 -2804 -4074 -2302 3626 5726 2264 -3734 -1477 -25 1609 1694 787
14538G87M584p334R47O376K162j126o82n641L966l28M410J365K99j778r397l748
$$ 787 5371 -1963 -1016 5360 7522 6396 5714 73 4039 3711 8121 9486 9785 8007 -1390 -5138
14522e138K425k521p30L796L987k536o631L458N021L997J102l589k377R91L460
$$ -5138 -2713 -5234 -5964 -2168 1819 -717 -7348 -3890 1131 5128 6230 2641 264 1255 4715
14507D715k277N968L708k792k985M71R01q63K603j844K461j706m851k905k911
$$ 4715 2438 8406 12114 9322 6337 6808 7709 6846 9449 7605 10066 8360 3509 604 -2307
14492b307K221K758P485k988j178K6K72K514l270Q13k287o462n890j593N922p49
$$ -2307 -86 2672 10157 7169 5991 6017 6289 8803 5533 6346 4059 -2403 -8293 -9886 -3964 -4713
14476d713j783j831K908N78K446l119l281J1728Q170r769j490P961L078k431n137
$$ -4713 -6496 -8327 -5419 -4841 -2395 -5514 -8795 2933 11103 1334 -156 7805 10883 8452 3315
14461C315L100K603L631J365M851p70l416l42j0450k771k377L577J997R3M62J177
$$ 3315 6415 9018 12649 14014 18865 18095 14679 14337 3887 1116 -1261 2316 4313 4406 4868 6045
14445F045m73j73K136n042j2388K900P993j994m292l373o879k65Q913N216M004
$$ 6045 5572 5399 7535 2493 -9895 -6995 998 -996 -5288 -8661 -15540 -15805 -6892 -1676 2328
14430B328K672r007m191J399J337L246P844Q109q076n313J630q532l03N446j32
$$ 2328 5000 -4007 -8198 -6799 -5462 -2216 5628 13737 5661 348 1978 -6554 -6857 -1411 -1543
14415a543J323P46J579J499J470j751K762P87k022m407J501O784J41l499J621
$$ -1543 -220 526 2105 3604 5074 3323 6085 6872 4850 443 1944 8728 8869 5370 6991
14400F991J662r40o176N095Q007r27k871K448J480j897k351j21J97K589l06n677
$$ 6991 8653 7713 1537 6632 14639 13712 10841 13289 14769 12872 10521 10400 10597 13186 12880 7203
14384G203K673L076q030o390k626J757J101L205P72j555j40j664Q8k408Q26Q572
$$ 7203 9876 12952 4922 -1468 -4094 -2337 -1236 1969 2741 1186 1046 -618 -530 -2938 -2112 6460
14368F460L164P620K957q746p106N412q32o84p33j041O175n727q73l672n261l829
$$ 6460 9624 17244 20201 11455 4349 9761 8929 8245 7512 6471 12646 6919 6046 2374 -2887 -6716
14352f716k421o16K500m49O241k028p563o498Q95P335O701J301k957j483J590
$$ -6716 -9137 -9753 -7253 -7702 -1461 -3489 -11052 -17550 -16655 -9320 -2619 -1318 -4275 -5758 -4168
14337d168M636O994K245l693K943j276p087o30J387L488k948r3j941K79O723l277
$$ -4168 468 7462 9707 6014 8957 7681 594 -36 1351 4839 1891 1798 -143 136 6859 3582
14321C582j700j695L184J241q46J498J142J05o795l46Q2K47m66o89K952L164K958
$$ 3582 1882 187 3371 4612 3766 5264 6406 6511 -284 -630 -548 -301 -767 -1456 1496 4660 7618
14304G618M71O203k369k377l584m927J329l321j892j742m72J2686M636j943L68
$$ 7618 8089 14292 11923 9546 5962 1035 2364 -957 -2849 -4591 -5063 7623 12259 10316 10684
14289A0684l602o221K862M736m85K082k651j2934l704O246K284J091J198k228
$$ 10684 7082 861 3723 8459 7974 10056 7405 -5529 -9233 -2987 -703 388 1586 -642
14275f42j933n090R90N384q9j641J60K821M26j285k116N14J169J585M043p76N50
$$ -642 -2575 -7665 -6675 -1291 -1380 -3021 -2861 -40 386 -899 -3015 -2501 -1332 253 4296 3520 4070
14258D070L334l967K706K200m69j479l017L147J399n26Q26M363L064l143q209
$$ 4070 7404 3437 6143 8343 7874 6395 3378 6525 7924 7398 8224 12587 15651 12508 4299
14243D299r149o15N114K053l876q10P908J711k32Q86j50K820j76j392m173J404
$$ 4299 -4850 -5465 -351 1702 -2174 -2984 4924 6635 6403 7289 7139 9959 9783 8391 4218 5622
14227E622K64N48q124q780m915j186M215N172R396j750j0716k171P698J660j026
$$ 5622 5886 6434 -1690 -10470 -15385 -16571 -12356 -7184 2212 462 -10254 -12425 -4727 -3067 -4093
14212d093J102M453n066j757K802N729L474L792r75j338k300j436J619n921J343
$$ -4093 -2991 1462 -3604 -5361 -2559 3170 6644 10436 9461 8123 5823 4387 6006 85 1428
14197A428L406R36L757R01l994p00k393L523k442k09J534k909k735K485M038j618
$$ 1428 4834 5770 9527 10428 6434 5734 3341 6864 4422 4213 5747 2838 103 2588 6626 5008
14181E008j471k236o120L824l37M854K392O586l834j0K82N749l300j777N053N46
$$ 5008 3537 1301 -4819 -995 -1332 3522 5914 12500 8666 8656 8938 14687 11387 9610 14663 15209
14165A5209j0761o915j2504J77M557N021l277L053J1839M712j582M385l08m182
$$ 15209 4448 -2467 -14971 -14794 -10237 -5216 -8493 -5440 6399 11111 9529 13914 13606 9424
14151I424m800l09L141j32k225n326J61J628k485k183J608k792N519O333k898
$$ 9424 4624 4315 7456 7324 5099 -227 -66 1562 -923 -3106 -1498 -4290 1229 7562 4664
14136D664m800Q22M949N288l297Q54K198J925M819R42r416k87Q283l659l919l017
$$ 4664 -136 686 5635 10923 7626 8480 10678 12603 17422 18364 8948 8661 16944 13285 9366 6349
14120F349N426K579l650m666k22j232R77n14o29j589q81J897j892J0342O469N391
$$ 6349 11775 14354 10704 6038 5816 4584 5561 5047 4418 2829 1948 3845 1953 12295 18764 24155
14104B4155p50p987r867n878J064O518J956R10q61k551j962J205J357q58M70J433
$$ 24155 23405 15418 5551 -327 737 7255 9211 10121 9260 6709 4747 5952 7309 6451 6921 8354
14088H354o58Q71J179J950j113J543M873K69m942j1132k907K148j122p70J962
$$ 8354 7696 8567 9746 11696 10583 12126 16999 17268 12326 1194 -1713 435 -687 -1457 505
14073E05L575O670j077o060K401L504q222Q68r21l961m720l520N678M735M591
$$ 505 4080 10750 9673 3613 6014 9518 1296 2164 1243 -2718 -7438 -10958 -5280 -545 4046
14058D046K097p19l266n357j285j336m918Q222O665M443q209J363K443K356J192
$$ 4046 6143 5424 2158 -3199 -4484 -5820 -10738 -2516 4149 8592 383 1746 4189 6545 7737
14043G737J292J781p927j839m918R0M720N441k70o224K563N164k380L668r588
$$ 7737 9029 10810 2883 1044 -3874 -3784 936 6377 6107 -117 2446 7610 5230 8898 -690
14028f90l864M152K068R237L329k503L38K027r69n495l15l359L8l883m632k172
$$ -690 -4554 -402 1666 10903 14232 11729 12067 14094 13125 7630 7315 3956 3994 111 -4521 -6693
14012f693J2709P3K37j2124K02P053K288p700k996P949L033j623L02m358j683
$$ -6693 6016 6089 6326 -5798 -5596 1457 3745 -3955 -6951 998 4031 2408 2710 -1648 -3331
13997c331r58L438L034m299Q802K973J291k389M49p195o026K928N266j383K62
$$ -3331 -4289 -851 2183 -2116 6686 9659 10950 8561 9010 1815 -4211 -1283 3983 2600 2862
13982B862J187l779l08N65J727N343N64m305n307M583J2793j944n509J12m25p912
$$ 2862 4049 270 -38 527 2254 7597 8161 3856 -1451 3132 15925 13981 8472 8584 8159 247
13966B47m923M447k864K906J811J238J414j61k372N51l349K08L297p173Q98J88
$$ 247 -4676 -229 -3093 -187 1624 2862 4276 4115 1743 2294 -1055 -847 2450 -4723 -3825 -3637
13950c637N107O717N07L60K047M301k49m111r604k663M093K779K537n906J357
$$ -3637 1470 8187 8694 9054 11101 15402 15153 11042 1438 -1225 2868 5647 8184 2278 3635
13935C635N084J0330j93o037Q114N977k161o568o060m34j310o334K655M841k189
$$ 3635 8719 19049 18856 12819 20933 26910 24749 18181 12121 11687 10377 4043 6698 11539 9350
13920I350k52k908J986n571q566k546N600P829J057j763qL099N764L472L21m843
$$ 9350 9098 6190 8176 2605 -5961 -8507 -2907 4922 5979 4216 4208 7307 13071 16543 16864 12021
13904A2021O022k561p295l595N129r87k943O634L367n608m400K296j831M407l248
$$ 12021 18043 15482 8187 4592 9721 8734 5791 12425 15792 10184 5784 8080 6249 10656 7408
13889G408o924k964R602L580j748j99n545k228R87K431o499j136M998K08K079
$$ 7408 484 -2480 7122 10702 8954 8755 3210 982 1969 4400 -2099 -3235 1763 1971 4050
13874D050j63k45k12J478N248J334m33k612l934o000k795o349O302L477J197L384
$$ 4050 3887 3642 3430 4908 10156 11490 11057 8445 4511 -1489 -4284 -10633 -4331 -854 343 3727
13858C727j626M313K660l432j0002o016k215M866k757J296K762J2127Q142L651
$$ 3727 2101 6414 9074 5642 -4360 -10376 -12591 -7725 -10482 -9186 -6424 5703 13845 17496
13844A7496m62k909l410N65k006n272O86P188k507l741q986O0P011m425q177L070
$$ 17496 17034 14125 10715 11280 9274 4002 4688 11876 9369 5628 -3358 -3298 3713 -712 -8889 -5819
13828e819L924N369J532k030J909o65p522J252O528K095K408j040l029J001N252
$$ -5819 -1895 3474 5006 2976 4885 4220 -3302 -2050 4478 6573 8981 7941 4912 5913 11165
13813A1165N222p13r82K321M207k917K919K067l309o694O016k010r87K127J487
$$ 11165 16387 15674 14692 17013 21220 18303 21222 23289 19980 13286 19302 17292 16305 18432 19919
13798A9919q202m793k309k934l520P14K754M796P887K612l657p271J982j797j073
$$ 19919 11717 6924 4615 1681 -1839 -1125 1629 6425 14312 16924 13267 5996 7978 6181 5108
13783E108Q99L979J147P38j028j10K43J839j059K624M268j937q048o659l077l18
$$ 5108 6007 9986 11133 11871 10843 10733 10976 12815 11756 14380 18648 16711 8663 2004 -1073 -1391
13767a391N451m282l757K094K372O24l695J026L326K642J810k33j578J835j538
$$ -1391 4060 -222 -3979 -1885 487 1111 -2584 -1558 1768 4410 6220 5987 4409 6244 4706
13752D706J889M844l661j315J099l142l243j454L019J61m058M661O353Lj0323
$$ 4706 6595 11439 7778 6463 7562 4420 1177 -277 2742 2903 -1155 3506 9859 9862 -461
13737d61n139J991j581N627N733l451m53J1318N523n993r458l963M229K181Q664
$$ -461 -5600 -3609 -5190 437 6170 2719 2266 13584 19107 13114 3656 -307 3922 6103 14767
13722A4767K436k82M56o422p241k490K590n84J792m550O115K398N11m605k456
$$ 14767 17203 16921 17377 10955 3714 1224 3814 3230 5022 472 6587 8985 9496 4891 2435
13707B435j250J958Q046L353K408J520m704l151L5K083n430m454M800L467K820
$$ 2435 1185 3143 11189 14542 16950 18470 13766 10615 10650 12733 7303 2849 7649 11116 13936
13692A3936o383j2120J87N304J1353N707l541k639K20K748O151j138l547N432
$$ 13936 7553 -4567 -4380 924 12277 17984 14443 11804 12024 14772 20923 19785 16238 21670
13678B1670R67K883m776m934n390Q65N345j145P8j482r51m069o489k696P524P839
$$ 21670 22637 25520 20744 15810 10420 11285 16630 15485 15563 14081 13130 9061 2572 -124 7400 15239
13662A5239L980k609m359j1824m615N336M495M347J199L357J432p40J097k300
$$ 15239 19219 16610 12251 427 -4188 1148 5643 9990 11189 14546 15978 15238 16335 14035
13648A4035l642N158N2J544j106p298l951n197J394O549m563p424O579R970J883
$$ 14035 10393 15551 15603 17147 16041 8743 4792 -405 989 7538 2975 -4449 2130 12100 13983
13633A3983j364K348M951q93l689n645p457q8K125N859L812L968N29j781O20q76
$$ 13983 12619 14967 19918 19025 15336 9691 2234 2146 4271 10130 13942 17910 18439 16658 17278 16402
13617A6402k765k795n925J764M66N575K442j082j965M749m880p678o16R40k596
$$ 16402 13637 10842 4917 6681 7147 12722 15164 14082 12117 16866 11986 4308 3692 4632 2036
13602B036k011k310J806L035K723M901l167k89n810m054M062p18J281J28j53M363
$$ 2036 25 -2285 -479 2556 5279 10180 7013 6724 914 -3140 922 204 1485 1613 1460 5823
13586E823P419L912p345j1142n98N303L264J353N184N778K516p317j1234J336
$$ 5823 13242 17154 9809 -1333 -1931 3372 6636 7989 13173 18951 21467 14150 2916 4252
13572D252N106O435P877K614k080m593p793J870m557r36L374R00q711Q50l33L595
$$ 4252 9358 15793 23670 26284 24204 19611 11818 13688 9131 8195 11569 12469 3758 4608 4275 7870
13556G870K582n880l735O72k049K619J0854J590k057l394K455j064l207P07N447
$$ 7870 10452 4572 837 1509 -540 2079 12933 14523 12466 9072 11527 10463 7256 7963 13410
13541A3410K015O87k255q595r26J582l696l202k086M966O421o33n39L927k05k812
$$ 13410 15425 16112 13857 5262 4336 5918 2222 -980 -3066 1900 8321 7688 7149 11076 10871 8059
13525H059j0568L274N429j63j758Q346K361j588q22j192Q21m84j405j149j169
$$ 8059 -2509 765 6194 6031 4273 12619 14980 13392 12570 11378 12199 11715 10310 9161 7992
13510G992K428N99l341o157K237L352l666q75p2J557L96L937n249N930O556j94
$$ 7992 10420 11019 7678 1521 3758 7110 3444 2569 2497 4054 4450 8387 3138 9068 15624 15430
13494A5430j384q297n178j74j912O017L159L827J175m388L867l309m398L976O292
$$ 15430 14046 5749 571 397 -1515 4502 7661 11488 12663 8275 12142 8833 4435 8411 14703
13479A4703M95J125M55j0260l793j854N849l450p262O328O149k827K644O510P006
$$ 14703 15198 16323 16778 6518 2725 871 6720 3270 -3992 2336 8485 5658 8302 14812 21818
13464B1818j20k450o858J112l935m43J707m393J474R61K323k740j2Q029P350K52
$$ 21818 21698 19248 12390 13502 9567 9124 10831 6438 7912 8873 11196 8456 8444 16473 23823 24075
13448B4075l290n642l351J304k517N31l889pl44L734N041k038l984o620M61N109
$$ 24075 20785 15143 11792 13096 10579 11110 7221 7214 6870 10604 15645 13607 9623 3003 3464 8573
13432H573Q891N465j1546M84M4n444k313L913K815Q311K116p706q179p425N879
$$ 8573 17464 22929 11383 11867 11911 6467 4154 8067 10882 19193 21309 13603 5424 -2001 3878
13417C878L811J5l300j156m636j265N225K78J637Q556j951K323m925j394J223
$$ 3878 7689 7704 4404 3248 -1388 -2653 2572 2850 4487 13043 11092 13415 8490 7096 8319
13402H319J529n454k384R090r39K029J083J290J868J832Lm223q96K383M386K62
$$ 8319 9848 4394 2010 11100 10161 12190 13273 14563 16431 18263 18266 14043 13147 15530 19916 20178
13386B0178m432p193j101l721L53m92K606l136k543M52o64j07R528L755L904M424
$$ 20178 15746 8553 7452 3731 4084 3592 6198 3062 519 971 307 200 9728 13483 17387 21811
13370B1811K882l452k862J299m734l441K081J520q30l501m42N718J961m784k479
$$ 21811 24693 21241 18379 19678 14944 11503 13584 15104 14274 10773 10331 16049 18010 13226 10747
13355A0747j913m767j195R5r44r40M792J102k258l654L007j39M610Q12o29l258
$$ 10747 8834 4067 2872 2967 2023 1083 5875 6977 4719 1065 4072 3933 8543 9355 8726 5468
13339E468M980O498k355p767n652N803K834Q602m710k032m305K263O071J553k972
$$ 5468 10448 16946 14591 6824 1172 6975 9809 18411 13701 11669 7364 9627 15698 17251 14279
13324A4279L4P84j049o340N31J752K475K661M479L100n832r794j941k69n41L006
$$ 14279 14313 15097 14048 7708 8239 9991 12466 15127 19606 22706 16874 7080 5139 4870 4329 7335
13308G335L126q448p38k297L725O334R530j521k845k693J59J953O570j123k230
$$ 7335 10461 2013 1275 -1022 2703 9037 18567 17046 14201 11508 11667 13620 20190 19067 16837
13293A6837k016j041J657k577j122q170J620Q328N396O629K710n278n75k46o65
$$ 16837 14821 13780 15437 12860 11738 3568 5188 13516 18912 25541 28251 22973 22398 22152 21487
13278B1487m95q09j865k602p842l741k092J63N254J211N394r97k946k549l248
$$ 21487 20992 20183 18318 15716 7874 4133 2041 2204 7458 8669 14063 13066 10120 7571 4323
13263D323J087J006p506M779Q318J507N342J715r72m926M608J687K638O56n538
$$ 4323 5410 6416 -1090 3689 12007 13514 18856 20571 19599 14673 19281 20968 23606 24262 18724
13248A8724m775J186K007j508L812P769p017o115k228k481J501O773N804k172
$$ 18724 13949 15135 17142 15634 19446 27215 20198 14083 11855 9374 10875 17648 23452 21280
13234B1280p541l569j321L248m55K546L83j865Q931M06m034m764k41p7j224j149
$$ 21280 13739 10170 8849 12097 11642 14188 14571 12706 21637 22043 18009 13245 13004 12927 11703 10554
13218A0554K919N153L882k664L612M29l490n356J004m84P389k689K29M760n611
$$ 10554 13473 18626 22508 19844 23456 23885 20395 15039 16043 15559 22948 20259 20488 25248 19637
13203A9637n68k052M106M026l750k566K527k91j838K344P304Q10k221k724p276
$$ 19637 19069 17017 21123 25149 21399 18833 21360 21069 19231 21575 28879 29689 27468 24744 17468
13188A7468l592L737O088R707N0o813J083l557r360n550M51J1729M353m016j820
$$ 17468 13876 17613 23701 33408 33458 26645 27728 24171 14811 9261 9712 21441 25794 21778 19958
13173A9958R69M340K615k512j656l567k584k228n777L756M307k744j068N431Q028
$$ 19958 20927 25267 27882 25370 23714 20147 17563 15335 9558 13314 17621 14877 13809 19240 27268
13158B7268L498p21o077m307O962L730L700p599m688M63m619o916j143M905O031
$$ 27268 30766 30045 23968 19661 26623 30353 34053 26454 21766 22229 17610 10694 9551 14456 20487
13143B0487l391O06r372k572K537j529L730M564n470O966L515r793j3p2m08J178
$$ 20487 17096 17702 8330 5758 8295 6766 10496 15060 9590 16556 20071 10278 10265 10193 9785 10963
13127A0963J910Q21Q023O539J431l411j0904r64N091J640N144m184l543m547k189
$$ 10963 12873 13694 21717 28256 29687 26276 15372 14408 19499 21139 26283 22099 18556 14009 11820
13112A1820K454R743O866q817j707j555r68p316p295N201O382J293m72J281m32
$$ 11820 14274 24017 30883 22066 20359 18804 17836 10520 3225 8426 14808 16101 15629 16910 16478
13097A6478J087l083l762R843Q242M394p69j1951k343q753m393n246K063Q337
$$ 16478 17565 14482 10720 20563 28805 33199 32430 20479 18136 9383 4990 -256 1807 10144
13083A0144M897K949J272L308j654N89l033J00K14K092L280N074J060l168k076
$$ 10144 15041 17990 19262 22570 20916 21505 18472 18572 18786 20878 24158 29232 30292 27124 25048
13068B5048n180q59j503j45J991J570N490m759k144K723L053j657j932l555O513
$$ 25048 19868 19009 17506 17361 19352 20922 26412 21653 19509 22232 25285 23628 21696 18141 24654
13053B4654M597J289K218n400p842M981M644o037k478L293J818j388N213J237
$$ 24654 29251 30540 32758 27358 19516 24497 29141 23104 20626 23919 25737 24349 29562 30799
13039C0799M04k22j45m24J214R83l938o765L113j397k497Q689L302j399k582k214
$$ 30799 31203 30981 30836 30412 31626 32609 28671 21906 25019 23622 21125 29814 33116 31717 29135 26921
13023B6921M646rj0467J84N623L508j544k75J54N84k022k412K739L224Q41K490
$$ 26921 31567 31558 21091 21275 26898 30406 28862 28587 28741 29325 27303 24891 27630 30854 31695 34185
13007C4185l37m358l113Q683j311j364o508l804k997L340K241N22L706m049K748
$$ 34185 33848 29490 26377 35060 33749 32385 25877 22073 19076 22416 24657 25179 28885 24836 27584
12992B7584N121P486L774L483j569l266k160K559k565n44N733o215J345N983l367
$$ 27584 32705 40191 43965 47448 45879 42613 40453 43012 40447 39903 45636 39421 40766 46749 43382
12977D3382o376L623n5P12n97r62j081M105M487L74K840k502O436J122N136P832
$$ 43382 37006 40629 40574 41286 40689 39727 38646 42751 47238 47612 50452 47950 54386 55508 60644 68476
12961F8476K926N542K939J5592K4223L0656M1566N0883O5504O4053O8266P1762
$$ 68476 71402 76944 79883 95475 119698 150354 191920 242803 308307 372360 440626 512388
12949E12388N2777J7741k308m123l2601o0686o9985o4826o3295n7822n3599l1724
$$ 512388 565165 582906 580598 576475 543874 483188 413203 348377 285082 227260 173661 141937
12937A41937k5961j7907j1275p995j2493o400K196m108q480l790j464j028n340
$$ 141937 115976 98069 86794 78799 66306 59906 62102 57994 49514 45724 44260 43232 37892
12924C7892k0N710J305k695j829O534l07l894M765p069o262J105n304L884J458
$$ 37892 37872 43582 44887 42192 40363 46897 46590 42696 47461 40392 34130 35235 29931 33815 35273
12909C5273n541J634J0077O686j424m02k194n845n997L301j342k746M417j316
$$ 35273 29732 31366 41443 48129 46705 46303 44109 38264 32267 35568 34226 31480 35897 34581
12895C4581k665o96n346j129K143Q819M512k266n368P083O208Q536m651p376m851
$$ 34581 31916 31220 25874 24745 26888 35707 40219 37953 32585 39668 45876 54412 49761 42385 37534
12880C7534l970K03Q016k94K276N216K891r788n314J901J953q66l106L922M538
$$ 37534 33564 33767 41783 41489 43765 48981 51872 42084 36770 38671 40624 39758 36652 40574 45112
12865D5112P67l124J732J353K792j231p760N6M404N432l986j494K70L97M212q32
$$ 45112 45879 42755 44487 45840 48632 47401 39641 39697 44101 49533 45547 44053 44323 44720 48932 48100
12849D8100l829l508n303j487N065N997k509k038M919K157J895O861J5664J3594
$$ 48100 44271 40763 35460 33973 39038 45035 42526 40488 45407 47564 49459 56320 71984 85578
12835H5578m382N884J1252J1931P46o02N325J135p462n452j4399o296m916n908
$$ 85578 81196 87080 98332 110263 111009 110407 115732 116867 109405 103953 89554 83258 78342 72434
12821G2434j1245o642l406J20N671J41L247l059q605o284j117N10M011P424R35
$$ 72434 61189 54547 51141 51261 56932 57073 60320 57261 48656 42372 41255 41765 45776 53200 54135
12806E4135p196o221Q633Q162L065l946Q59L030N739J565M130J2260k841o306
$$ 54135 46939 40718 49351 57513 60578 56632 57491 60521 66260 67825 71955 84215 81374 75068
12792G5068j737l704R13q13L417j428k824L124M561r48J888J04M130K063k255
$$ 75068 73331 69627 70540 69727 73144 71716 68892 72016 76577 75629 77517 77621 81751 83814 81559
12777H1559n025k720L354k978l015p026q68J13j91j027k060M562K902j260o51
$$ 81559 76534 73814 77168 74190 71175 64149 63281 63394 63203 62176 60116 64678 67580 66320 65669
12762F5669p79l307J418j53J275m453l333J537N733K179k572J264l108L086K215
$$ 65669 64890 61583 63001 62848 64123 59670 56337 57874 63607 65786 63214 64478 61370 64456 66671
12747F6671P74n302M189L094j306m322m561o848j927P554n89L834O483m831J44
$$ 66671 67445 62143 66332 69426 68120 63798 59237 52389 50462 58016 57427 61261 67744 62913 63057
12732F3057j882L012Q372N209k586n087l059m179n987O641O518K905m321L590
$$ 63057 61175 64187 72559 77768 75182 70095 67036 62857 56870 63511 70029 72934 68613 72203
12718G2203O571J4160K110J484k289k244M915j594l541m727m113p50j621j371
$$ 72203 78774 92934 95044 96528 94239 91995 96910 95316 91775 87048 82935 82185 80564 79193
12704G9193L738p396j177O289o736l31K57j413o200k071L640O622k85k393k970
$$ 79193 82931 75535 74358 80647 73911 73580 73837 72424 66224 64153 67793 74415 74130 71737 68767
12689F8767k225l334k29j502P934L048k189M193L204n091N669N923L184O571J2857
$$ 68767 66542 63208 62979 61477 69411 72459 70270 74463 77667 72576 78245 84168 87352 93923 106780
12674A06780k088k522R587J0896O267Q157J0545P922N166N340O695N194J756n133
$$ 106780 104692 102170 111757 122653 128920 137077 147622 155544 160710 166050 172745 177939 179695 174562
12660A74562K62n50K116l763M26j854N025q237m603J177L049M812K642K977k026
$$ 174562 174824 174274 176390 172627 173053 171199 176224 167987 163384 164561 167610 172422 175064 178041 176015
12645A76015J368l7m909J0246R137p76J807J0158l966p808o701p143O719K144
$$ 176015 177383 177346 172437 182683 191820 191044 192851 203009 199043 191235 184534 177391 184110 186254
12631A86254j0750M158O702J938N52K54o714L244M341K27K539j833L437L754Q23
$$ 186254 175504 179662 186364 188302 188854 189108 182394 185638 189979 190206 192745 190912 194349 198103 198926
12616A98926J342J5696J1416O83J508j43J491Q647R05L289K880l965N559M623
$$ 198926 200268 215964 227380 228063 229571 229428 230919 239566 240471 243760 246640 242675 248234 252857
12602B52857J0433K601K578O759J749J320M260n250j033M296Q432J1105R929J4067
$$ 252857 263290 265891 268469 275228 276977 278297 282557 277307 276274 280570 289002 300107 310036 324103
12588C24103J2719Q456L431L772Q657J4582K0158J3502J1617J0692J3219J6991
$$ 324103 336822 345278 348709 352481 361138 375720 395878 409380 420997 431689 444908 461899
12576D61899J8222K3954J5377J5181K3485L0539K7003K5351K8544L7606L8419
$$ 461899 480121 504075 519452 534633 558118 588657 615660 641011 669555 707161 745580
12565G45580L8232L9300L9309M7854N6274N9551O3797O9632P4937P8576Q9539
$$ 745580 783812 823112 862421 910275 966549 1026100 1089897 1159529 1234466 1313042 1402581
12554A402581J11468J28244J60240J98098K54458L36952M30037N25681O37830
$$ 1402581 1514049 1642293 1802533 2000631 2255089 2592041 3022078 3547759 4185589
12545D185589P08935P30944P54046P73194P43854O77899O71401P94235J041557
$$ 4185589 4894524 5625468 6379514 7152708 7896562 8574461 9245862 10040097 11081654
12536A1081654J513485K445981M140710O747748R757781J1489655J1486352J2440877
$$ 11081654 12595139 15041120 19181830 25929578 35687359 47177014 58663366 71104243
12528G1104243J4491225J2975416O675873J626526L92147k632415r257260j3717922
$$ 71104243 85595468 98570884 105246757 106873283 107265430 104633015 95375755 81657833
12520H1657833j3253531j1826860j1864230j1294593q985722o175780l988732
$$ 81657833 68404302 56577442 44713212 33418619 24432897 18257117 14268385
12513A4268385k571882j760446j331394j057186q50788p45727p43261p13623o24319
$$ 14268385 11696503 9936057 8604663 7547477 6696689 5950962 5207701 4494078 3869759
12504C869759n44700m99494m34292l59876k85093k16642j70825j44900j14802
$$ 3869759 3325059 2825565 2391273 2031397 1746304 1529662 1358837 1213937 1099135
12495A099135r9957q5617p6081o8334o4762n2971m7978m6959m2829l2218k7046
$$ 1099135 999178 913561 837480 769146 704384 651413 603435 556476 513647 481429 454383
12484D54383k0203j6856j8461k7636k0782j4835j1341j5580j0185m361q522j9059
$$ 454383 434180 417324 398863 371227 350445 335610 324269 308689 298504 294143 285621 266562
12472B66562k1496j8343j3278p765l571m023j489j0301j1230p910j670p043n396
$$ 266562 245066 226723 213445 205680 202109 198086 196597 186296 175066 167156 165486 158443 153047
12459A53047m644j0300j5059l710r83r878r415q987q464J663l36m671j2805k722
$$ 153047 148403 138103 123044 119334 118351 108473 99058 90071 81607 83270 82934 78263 65458 62736
12445F2736M963j576j0770q287j294m374j233J783k703J796N855N022m738k224
$$ 62736 67699 66123 55353 47066 45772 41398 40165 41948 39245 41041 46896 51918 47180 44956
12431D4956k709k891l570l763K670j0131r598l816K2N266L165M434P795O094k586
$$ 44956 42247 39356 35786 32023 34693 24562 14964 11148 11170 16436 19601 24035 31830 37924 35338
12416C5338K990k597p093m64j157J146K32J319m73j3188L24J391M800M994R865
$$ 35338 38328 35731 28638 28174 27017 28163 28395 29714 29241 16053 16377 17768 22568 27562 37427
12401C7427J1860r2k283K915O600O323l337n109j121M029l939p895j2741p704
$$ 37427 49287 49195 46912 49827 56427 62750 59413 54304 53183 57212 53273 45378 32637 24933
12387B4933k319k847o065m598p455l935Q292O811l86k681M035Q033M19l171Q84
$$ 24933 22614 19767 13702 9104 1649 -2286 6006 12817 12431 9750 13785 21818 22237 19066 19950
12372A9950J731M976K267q00m39R094q3j923m475j582k326k935J300K377m59l809
$$ 19950 21681 26657 28924 28124 27685 36779 36696 34773 30298 28716 26390 23455 24755 27132 26673 22864
12356B2864P0L719l040p948m320k0O266M017L12m641p26j1882j5233p671l137
$$ 22864 22934 26653 23613 15665 11345 11325 17591 21608 21920 17279 16553 4671 -10562 -18233 -21370
12341b1370J60M55j113k540J999N389M220M779m588J69M935r97j741m412P574
$$ -21370 -21210 -20755 -21868 -24408 -22409 -17020 -12800 -8021 -12609 -12440 -7505 -8502 -10243 -14655 -7081
12326g081J1783O23j218n002J973l500j862n621m385L420J542j552O112l023m0
$$ -7081 4702 5325 4107 -895 1078 -2422 -4284 -9905 -14290 -10870 -9328 -10880 -4768 -7791 -7831
12311g831J436Q552j148K135K851l134m335j1978K257k865k06R496J326K005M74
$$ -7831 -6395 2157 1009 3144 5995 2861 -1474 -13452 -11195 -14060 -14266 -4770 -3444 -1439 -965
12296i65p47j10j162k800j064K947N05l639N92J258J713O067m174k135L660M20
$$ -965 -1712 -1822 -2984 -5784 -6848 -3901 -3396 -7035 -6443 -5185 -3472 2595 -1579 -3714 -54 366
12280C66l01J919M783p223l572M810k228l976O425M427P83J851n225O662P796
$$ 366 65 1984 6767 -456 -4028 782 -1446 -5422 1003 5430 6213 8064 2839 9501 17297
12265A7297K603k373k79L360N68m645N366j127k532J788j357J134n187n403Q70
$$ 17297 19900 17527 17248 20608 21176 16531 21897 20770 18238 20026 18669 19803 14616 9213 10083
12250A0083M280j49o89J190q459k083k148o051j27Q512k782j0340k151j09O57
$$ 10083 14363 14214 13525 14715 6256 4173 2025 -4026 -4153 4359 1577 -8763 -10914 -11023 -10366
12235a0366J543M744m049o261k95l194q03N774O95j3538j4928o535j2496m609
$$ -10366 -8823 -4079 -8128 -14389 -14684 -17878 -18681 -12907 -12212 -25750 -40678 -47213 -59709 -64318
12221f4318p580p244p470L831P222R882J3473J4073J0154O444k210O326K912m10
$$ -64318 -71898 -79142 -86612 -82781 -75559 -65677 -52204 -38131 -27977 -21533 -23743 -17417 -14505 -14915
12207a4915J960J327k828N642L318q69L809K774N532k616n179n565j328N316J695
$$ -14915 -12955 -11628 -14456 -8814 -5496 -6365 -2556 218 5750 3134 -2045 -7610 -8938 -3622 -1927
12192a927M380j649j1542L728M645K074j381n240o583m714m935L426N685L868
$$ -1927 2453 804 -10738 -7010 -2365 -291 -1672 -6912 -13495 -18209 -23144 -19718 -14033 -10165
12178a0165j769J0178L816l855k606L180M149l20n8m607k461K186L383l83l304
$$ -10165 -11934 -1756 2060 -1795 -4401 -1221 2928 2608 2550 -2057 -4518 -2332 1051 668 -2636
12163b636L362M03l420L252N86j834j089n072o321L53O55o54M523k395K064L292
$$ -2636 726 1129 -2291 961 1547 -287 -1376 -6448 -12769 -12416 -11761 -12415 -7892 -10287 -8223 -4931
12147d931N025L009Q14k280M631J753l090p652m414J503L816l945q85O979K452
$$ -4931 94 3103 3917 1637 6268 8021 4931 -2721 -7135 -5632 -1816 -5761 -6646 333 2785
12132B785P553O645m913m019j535j275L675j876p628n49K812j45J860K808K143
$$ 2785 10338 16983 12070 8051 6516 5241 8916 7040 -588 -1137 1675 1530 3390 6198 8341
12117H341L885L695R392J923n216M339J4392J349L249L414Q628K2985K9632L6399
$$ 8341 12226 15921 25313 27236 22020 26359 40751 42100 45349 48763 57391 80376 110008 146407
12103A46407N2797O1754N5305N8027P1533O1980L5246J0975J289k4751m8601o6939
$$ 146407 199204 260958 316263 374290 445823 507803 543049 554024 555313 530562 481961 415022
12091D15022p0288o1550o0445o0846m2877k3955j0779p625k497p935m015k330
$$ 415022 344734 283184 222739 161893 119016 95061 84282 76657 74160 66225 62210 59880
12079E9880P04P318O238R213K3541N7509J16590K08652K09631m2776k06109j83707
$$ 59880 60584 67902 74140 83353 106894 164403 280993 489645 699276 656500 450391 266684
12067B66684r8705n7037m1095k2422r141p358j1849k835L217n318o968k447N636
$$ 266684 167979 110942 69847 47425 38284 30926 19077 16242 19459 14141 7173 4726 10362
12054A0362L173J465n01J211o221q873k958m586n218J772R948J0650l942l747
$$ 10362 13535 15000 14499 15710 9489 616 -2342 -6928 -12146 -10374 -426 10224 6282 2535
12040B535k961j400L597R10p724L424n784J637R935N003m827p41j544l699m128
$$ 2535 -426 -1826 1771 2681 -5043 -1619 -7403 -5766 4169 9172 4345 3604 2060 -1639 -5767
12025e767L75N48k624L468L35K102L292p313l462l781k003N461K197m653L848
$$ -5767 -5392 -4844 -7468 -4000 -3665 -1563 1729 -5584 -9046 -12827 -14830 -9369 -7172 -11825 -7977
12010g977J775M806R26Kj574k086k28L758P247J220p845j328N787j584j657p48
$$ -7977 -6202 -1396 -470 -468 -2042 -4128 -4356 -598 6649 7869 24 -1304 4483 2899 1242 494
11994D94R33q12J437P882M374k904N04J475J550R227O506P36J2093J5534R927
$$ 494 1427 615 2052 9934 14308 11404 11908 13383 14933 24160 30666 31402 43495 59029 68956
11979F8956R019Q561k332j2195j8504n734o553j076j0431o700j750m706j076k14
$$ 68956 77975 86536 84204 72009 53505 47771 41218 40142 29711 23011 21261 16555 15479 15265
11965A5265n88r84m097L41p218J244m128O463R264o45j172K697q225j547Q67l671
$$ 15265 14677 13693 9596 9937 2719 3963 -165 6298 15562 14917 13745 16442 8217 6670 7537 3866
11949C866m732J327k871m50J0378P410J527k335j379K50k213k850K203J001k967
$$ 3866 -866 461 -2410 -2860 7518 14928 16455 14120 12741 12991 10778 7928 10131 11132 8165
11934H165J861L247o189p564p9m107K837K095P960P351l900n359k355M179l24
$$ 8165 10026 13273 7084 -480 -559 -4666 -1829 266 8226 15577 11677 6318 3963 8142 7818
11919G818j823o419j62M945L415j061n41J538j869l720n745N634N803J786q017
$$ 7818 5995 -424 -586 4359 7774 6713 6172 7710 5841 2121 -3624 2010 7813 9599 1582
11904A582o426J2018P449n420k456j835k120K929m8J794q177l760J573K430k363
$$ 1582 -4844 7174 14623 9203 6747 4912 2792 5721 5673 7467 -710 -4470 -2897 -467 -2830
11889b830K886O112N130n40k144m649m514K927Q153J914K264J089m029o252m278
$$ -2830 56 6168 11298 10758 8614 3965 -549 2378 10531 12445 14709 15798 11769 5517 1239
11874A239K041K481J70N132N131o1l816j0100J106M770r67n841m611L565k736
$$ 1239 3280 5761 5931 11063 16194 16133 12317 2217 3323 8093 7126 1285 -3326 239 -2497
11859b497J295M480l676j056N361R020N097n227o246q761j1k909P142Q521n51
$$ -2497 -1202 3278 -398 -1454 3907 12927 18024 12797 6551 -2210 -2221 -5130 2012 10533 9982
11844I982o102m050k749L23L454J52j17R060Q079l57k136l374l848J322K070K197
$$ 9982 3880 -170 -2919 -2596 858 1010 893 9953 18032 17675 15539 12165 8317 9639 11709 13906
11828A3906O182k597k623K708k986N2r26j451O342L611j699R39K392M91n507m505
$$ 13906 20088 17491 14868 17576 14590 14642 13716 12265 18607 22218 20519 21458 23850 24341 18834 14329
11812A4329J93n594J379l256n417M587J024o64K666K045j962m01J626J999k200
$$ 14329 14522 8928 10307 7051 1634 6221 7245 6581 9247 11292 9330 8929 10555 12554 10354
11797A0354J267k079L585M979p97n583m800n583j307M325K631O065O818j929r918
$$ 10354 11621 9542 13127 18106 17309 11726 6926 1343 36 4361 6992 13057 19875 17946 8028
11782H028k185j10L133n763o540Q00O040J2869P201n044o841K977K51J334l696
$$ 8028 5843 5733 8866 3103 -3437 -2637 3403 16272 23473 18429 11588 14565 14816 16150 12454
11767A2454r401l64p49J129L135j798J474k071o239J774L823O471J840m887k292
$$ 12454 3053 2689 1940 3069 6204 4406 5880 3809 -2430 -656 3167 9638 11478 6591 4299
11752D299J541J356j148j99k624L642M589n460j3220k247K17l761P032L217N869
$$ 4299 5840 7196 6048 5849 3225 6867 11456 5996 -7224 -9471 -9254 -13015 -5983 -2766 3103
11737C103j287l13Q97l275K712J323N992M982o581q098q182L559O155m077l865
$$ 3103 1816 1503 2400 -875 1837 3160 9152 14134 7553 -545 -8727 -5168 987 -3090 -6955
11722f955J691J822K456o071K096J581R171L923Q08j519j945J067N805O123j79
$$ -6955 -5264 -3442 -986 -7057 -4961 -3380 5791 9714 10522 9003 7058 8125 13930 20053 19874
11707A9874k912n981J350m856l065q446J038N244R22M226N374M936J765J921J972
$$ 19874 16962 10981 12331 7475 4410 -4036 -2998 2246 3168 7394 12768 17704 19469 21390 23362
11692B3362l149o900m593j762Q093q325l968k947K499O869J1656k405r118q325
$$ 23362 20213 13313 8720 6958 15051 6726 2758 -189 2310 9179 20835 18430 9312 987
11678I87L57j22K657K420l286Q59K356k788M335J931k942J983O763J318l705l471
$$ 987 1344 1222 3879 6299 3013 3872 6228 3440 7775 9706 6764 8747 15510 16828 13123 9652
11662I652k774k750k791j474j893O536j265M990p0o944K991l44L530M695M799
$$ 9652 6878 4128 1337 -137 -2030 4506 3241 8231 8161 1217 4208 3864 7394 12089 16888
11647A6888L318l600j158p53o796m309k102L249o21K066N000K209k588o287J593
$$ 16888 20206 16606 15448 14695 7899 3590 1488 4737 4116 6182 11182 13391 10803 4516 6109
11632F109K344k042l732L022o120o87O156Q943N407k068k218l826r04Q969p7p252
$$ 6109 8453 6411 2679 5701 -419 -1106 5050 13993 19400 17332 15114 11288 10384 19353 19276 12024
11616A2024l376k117M511j619l71o53L643j071j36L457l67l459o249j45L415J396
$$ 12024 8648 6531 11042 9423 9052 8399 12042 10971 10835 14292 13925 10466 4217 4072 7487 8883
11600H883L816l781k790m812O649L753K375n664j119n12L908J43K662M142o413
$$ 8883 12699 8918 6128 1316 7965 11718 14093 8429 7310 6798 10706 10849 13511 17653 11240
11585A1240o51M167K603N25j350m742K226M929L998L553J630l279o814K170L166
$$ 11240 10589 14756 17359 17884 16534 11792 14018 18947 22945 26498 28128 24849 18035 20205 23371
11570B3371k649l503j75r68p92o742l517N3j27k6M132K463j643j400M242j452
$$ 23371 20722 17219 17044 16076 15284 8542 5025 5078 4951 4925 9057 11520 9877 8477 12719 11267
11554A1267j0172l129Q76k269M973J383o622K287O974P177J608r418k546P290
$$ 11267 1095 -2034 -1158 -3427 1546 2929 -3693 -1406 5568 12745 14353 4935 2389 9679
11540I679O74j182O480j71q46L344m686n438l76p92N015n999L147J0998K21n713
$$ 9679 10353 9171 15651 15480 14634 17978 13292 7854 7478 6686 11701 5702 8849 19847 20068 14355
11524A4355m725L817K79l990P480l090j421K318J468k465o577j9N819j357n199
$$ 14355 9630 13447 13726 9736 17216 14126 12705 15023 16491 14026 7449 7430 13249 11892 6693
11509F693q69j178l082n43k249M702J2002N12l388m040L521J775N978k626L628
$$ 6693 5824 4646 1564 1021 -1228 3474 15476 15988 12600 8560 12081 13856 19834 17208 20836
11494B0836N304p665k205o378O61R67J921Q703M973l537n430j0214k782M413L512
$$ 20836 26140 18475 16270 9892 10553 11520 13441 22144 27117 23580 18150 7936 5154 9567 13079
11479A3079j597m578j432L586N92r34N770M024m649K167O061l171P635r9k641
$$ 13079 11482 6904 5472 9058 9650 8716 14486 18510 13861 16028 22089 18918 26553 26454 23813
11464B3813o422m860N720L216O672q74J56J70r09M07M682n017n489L394N958M565
$$ 23813 17391 12531 18251 21467 28139 27265 27421 27591 26682 27089 31771 26754 21265 24659 30617 35182
11448C5182k600n344m52O064J2066k406p698m535J134J760j209n04l738n888M249
$$ 35182 32582 27238 26786 32850 44916 42510 34812 30277 31411 33171 31962 31458 27720 21832 26081
11433B6081J0182q17l878J552k571l713l448q001o803j605O742P428K979j824
$$ 26081 36263 35446 31568 33120 30549 26836 23388 15387 8584 6979 13721 21149 24128 22304
11419B2304l332n951l340Q949L6n639j611K428J864L651j21J983J321j241L836
$$ 22304 18972 13021 9681 18630 18666 13027 11416 13844 15708 19359 19238 21221 22542 21301 25137
11404B5137j443n099k122N418q99k870k26k81j099L99Q25q95m8J147l563K843
$$ 25137 23694 18595 16473 21891 20992 18122 17896 17615 16516 16915 17740 16845 16797 17944 14381 17224
11388A7224Q38n004K749k48k1N569m695m484j544M644j571O181P746j690n548
$$ 17224 18062 13058 15807 15559 15538 21107 16412 11928 10384 15028 13457 19638 27384 25694 20146
11373B0146O109J891k285m725l173q9k62L691L999j620J906k669k922m472r78
$$ 20146 26255 28146 25861 21136 17963 17874 17612 21303 25302 23682 25588 22919 19997 15525 14547
11358A4547M531O829l044l516K213o983m497J1183R022J722l533l394k978N943
$$ 14547 19078 25907 22863 19347 21560 14577 10080 21263 30285 32007 28474 25080 22102 28045
11344B8045k065L764r76j2601l729r86m46J694N761N272k070p624O33Q926M510
$$ 28045 25980 29744 28768 16167 12438 11452 11006 12700 18461 23733 21663 14039 14672 23598 28108
11329B8108o579J525k355J44M63J230k297k230o166J18P554O673p804r49M43J978
$$ 28108 21529 23054 20699 20843 21306 22536 20239 18009 11843 11961 19515 26188 18384 17435 17878 19856
11313A9856K525m06N465l285Q59k610j286m641J05Q408N374p037m651N141l420
$$ 19856 22381 21975 27440 24155 25014 22404 21118 16477 16582 24990 30364 23327 18676 23817 20397
11298B0397m480K991L688L903L323K643k64k559k231O489N434k695r19k489O35
$$ 20397 15917 18908 22596 26499 29822 32465 32201 29642 27411 33900 39334 36639 35720 33231 33866
11283C3866J745k34m007K252P334P246N631J201K238M132J2634J3390M912Q727
$$ 33866 35611 35377 31370 33622 40956 48202 53833 55034 57272 61404 74038 87428 92340 101067
11269A01067J1165Q295J2693K4982L1504N2648J09967K11845L65719N31091M58599
$$ 101067 112232 120527 133220 158202 189706 242354 352321 564166 929885 1460976 1919575
11258A919575J87740L9805p1810l41114n17386m45625k76384j55317q6408n4421
$$ 1919575 2107315 2147120 2075310 1734196 1216810 771185 494801 339484 253076 198655
11248A98655l5386k0520j9707j8212j4294q979j705n552n201j0151m955m21o449
$$ 198655 163269 142749 123042 104830 90536 81557 79852 74300 69099 58948 53993 53572 47123
11235D7123j259P777J530L953o98q81k308l957p330P058K14q412P7j92L11J561
$$ 47123 45864 53641 55171 59124 58426 57545 55237 51280 43950 51008 51222 42810 42887 42695 43006 44567
11219D4567o36k706j939K248M925k596n524o001N616N545n4m23k211N490L104
$$ 44567 43931 41225 39286 41534 46459 43863 38339 32338 37954 43499 43445 43022 40811 46301 49405
11204D9405l435j171l584K88P288O082o4O38J360K747l22k459m09N77j796k252
$$ 49405 45970 44799 41215 41503 48791 54873 54809 55447 56807 59554 59232 56773 56364 56941 55145 52893
11188E2893J516j013k069M798J486m762J70N49j618k692K935M457Q625K873k194
$$ 52893 54409 53396 51327 56125 57611 52849 53019 53568 51950 49258 52193 56650 65275 68148 65954
11173F5954J476N833L886Q229P066L030l120q174p098N56J618J311P08O160J1330
$$ 65954 67430 73263 77149 85378 92444 95474 92354 84180 77082 77638 79256 80567 81275 87435 98765
11158I8765Q724j152m044l01L502K629O150J2062J2261K3311L6579N3351Q6211
$$ 98765 107489 106337 102293 101992 105494 108123 114273 126335 138596 161907 198486 251837 338048
11145C38048J59897L05201M83154M29745Q7615j04062L7831J20226j66588m54804
$$ 338048 497945 803146 1286300 1716045 1803660 1699598 1737429 1857655 1691067 1236263
11135A236263m48181k79438j39860q1050o0016m0683k7407j5188o549m178o176
$$ 1236263 788082 508644 368784 287734 227718 187035 159628 144440 137891 133713 127537
11124A27537q295q040j1025r390j6445l441j102N165J2020J4542J7j3066j0040
$$ 127537 119242 111202 100177 90787 74342 70901 69799 74964 86984 101526 101543 88477 78437
11111G8437K912J752L92r349n724m124M51M116j667q235L164k265p329q169n046
$$ 78437 81349 83101 83493 74144 68420 64296 64747 68863 67196 58961 62125 59860 52531 44362 39316
11096C9316n877J083K335M603L492l777j630l917j104N243L134P695J4202J4505
$$ 39316 33439 34522 36857 41460 44952 41175 39545 35628 34524 39767 42901 50596 64798 79303
11082G9303O066l608n876K675L481L230j2598j2309r846p585k882L422L305P6
$$ 79303 85369 81761 75885 78560 82041 85271 72673 60364 50518 42933 40051 43473 46778 46854
11068D6854K007l050m763j81N687N121P899p335m64K246l913r75K216J634J841
$$ 46854 48861 45811 41048 40867 46554 51675 59574 52239 51775 54021 50108 49133 51349 52983 54824
11053E4824O72n642p715l15K433Q442P404l793r14P912K684O375J196M821J2813
$$ 54824 55496 49854 42139 41824 44257 52699 60103 56310 55396 63308 65992 72367 73563 78384 91197
11038I1197Q546J2284P452K5564M4459O8678J17968J71837J98019K32070K13893
$$ 91197 99743 112027 119479 145043 189502 258180 376148 547985 746004 978074 1191967
11027A191967Q6937K6971p5043k04471k25397j98601j66605j23329p0422m7779
$$ 1191967 1278904 1305875 1230832 1026361 800964 602363 435758 312429 242007 194228
11017A94228l4080k9080j2673l705o755o353L953K540l720N08M064M561J7137
$$ 194228 160148 131068 118395 114690 107935 101582 105535 108075 104355 104863 108927 113488 130625
11004A30625L2289M4534Q2126J30356J75269K01761K38947J84727N3014J1318
$$ 130625 162914 207448 289574 419930 595199 796960 1035907 1220634 1273648 1284966
10994A284966j10427k10434k12094j99240j65406j17334o8433m0211k7908j9800
$$ 1284966 1174539 964105 752011 552771 387365 270031 201598 161387 133479 113679
10984A13679j3875j0957j3247j2404j990J664O550k438o575n791k405J924j765
$$ 113679 99804 88847 75600 63196 61206 62870 69420 66982 60407 54616 52211 54135 52370
10971E2370L69L599p26m257R09r26m3k07q208m228r343j874M280P584O722O029
$$ 52370 52739 56338 55612 51355 52264 51338 51295 51088 42880 38652 29309 27435 31715 39299 46021 52050
10955E2050P958m95o809q819j918n79n002n621N316K464p27K297K866P66n54L656
$$ 52050 60008 59513 52704 43885 41967 41388 36386 30765 36081 38545 37818 40115 42981 43747 43193 46849
10939D6849L065K870l317k26m906l948q28r30O226Q029K397k578q004K867K749
$$ 46849 49914 52784 49467 49241 44335 40387 39559 38629 44855 52884 55281 52703 44699 47566 50315
10924E0315P396J1118k538L398n22L60K49p742k767O348k164J324M003M400p725
$$ 50315 57711 68829 66291 69689 69167 69527 69776 62034 59267 65615 63451 64775 68778 73178 65453
10909F5453n871l765j736M616N073M489J734L400J1402P826N02M459J1908P850
$$ 65453 59582 55817 54081 58697 63770 68259 69993 73393 84795 92621 93123 97582 109490 117340
10895A17340Q625L396N035K3036K5620L1430N5027Q6446J41324K46621L70259
$$ 117340 125965 129361 134396 157432 183052 214482 269509 355955 497279 743900 1114159
10884A114159L88230J55453j98507l74234l37353k22938j34708r1759o3023m0502
$$ 1114159 1502389 1657842 1459335 1085101 747748 524810 390102 298343 235320 194818
10874A94818l2838k4895k3734j5417j968m701o280j426q33j231l157k733p140
$$ 194818 161980 137085 113351 97934 95966 91265 84985 83559 82726 81495 78338 75605 68465
10861F8465o834J8q76J521J054M366k218J867k996N406M60J247j0275l006L260
$$ 68465 61631 61649 60773 62294 63348 67714 65496 67363 64367 69773 70233 71480 61205 58199 61459
10846F1459J111p633q118l128Q537Q413N196L606K28p228o686r472k175J003O551
$$ 61459 62570 54937 46819 43691 52228 60641 65837 69443 69671 62443 55757 46285 44110 45113 51664
10831E1664k93j819M869j077j409k903K70N848L148O23J4694J0335J48p629r282
$$ 51664 51371 49552 54421 53344 51935 49032 49302 55150 58298 58921 73615 83950 84098 76469 67187
10816F7187r085l078J071k033k181M184N524J584R66K40L577Q70K897k365p982
$$ 67187 58102 55024 56095 54062 51881 56065 61589 63173 64139 64379 67956 68826 71723 69358 61376
10801F1376q590n413o882r79P87M822N071P91M050O867j347k801K997k362j745
$$ 61376 52786 47373 40491 39512 40299 45121 50192 50983 55033 61900 60553 57752 60749 58387 56642
10786E6642O487Q073M646j375k29L493J3350K344k597M393Q403J3207J6250J0752
$$ 56642 63129 71202 75848 74473 74244 77737 91087 93431 90834 95227 103630 116837 133087 143839
10772A43839Q043J8332L5084M6852K2529k2481m6601m1209l2510k1748j4150j2605
$$ 143839 151882 170214 205298 252150 274679 252198 205597 164388 131878 110130 95980 83375
10760H3375p50m707M35K777K26L264k685n08M630l872n991N10o94p67K875N790
$$ 83375 82625 77918 78353 81130 81356 84620 81935 81427 86057 82185 76194 76704 76010 75243 78118 83908
10744H3908j093j434n95R287J5049J0955O97O14P37Q977o27j1864m741j152r18
$$ 83908 82815 81381 80786 90073 105122 116077 116774 117388 118125 127102 126475 114611 109870 108718 107800
10729A07800Q415N107K115m345j86K901q788J0298Q169N352M554Q100J0256n306
$$ 107800 116215 121322 123437 119092 118906 121807 113019 123317 131486 136838 141392 149492 159748 154442
10715A54442j2309j9267j4628j5715j820J984O06N678K479M263q147K422R802
$$ 154442 142133 122866 108238 92523 90703 92687 93293 98971 101450 105713 97566 99988 109790
10702A09790O870M491P92p653o300q478j608N433L797p373M89P157K483k780k547
$$ 109790 116660 121151 121943 114290 107990 99512 97904 103337 107134 99761 100250 107407 109890 107110 104563
10687A04563m347K198K714J365n21j189n117l70j757M975K381o17K894L555L583
$$ 104563 100216 102414 105128 106493 105972 104783 99666 99296 97539 102514 104895 104278 107172 110727 114310
10672A14310k69n190k010k26m869o97M894m421l198O76K880P374M992K969R929
$$ 114310 114041 108851 106841 106615 101746 101049 105943 101522 98324 99000 101880 109254 114246 117215 127144
10657A27144J076K71J1864J4702J1468K155k906j0531l431M631j965q73Q51j925
$$ 127144 128220 128491 140355 155057 166525 168680 165774 155243 151812 156443 154478 153605 154456 152531
10643A52531j8685k1624p237M65Q434R442J131L997K978r560r471p670j900J47
$$ 152531 133846 112222 104985 105450 113884 123326 124457 128454 131432 121872 112401 104731 102831 102978
10629A02978m691j2451J711M898Q293P102O158J2647J1612N247j361k442J0307
$$ 102978 98287 85836 87547 92445 100738 107840 113998 126645 138257 143504 142143 139701 150008
10616A50008O032k60l933l3J4090J3502J1861P086Q093J1944J1261R546J8485
$$ 150008 156040 155780 151847 151814 165904 179406 191267 198353 206446 218390 229651 239197 257682
10603B57682J1681J1222J7029J9827J6811N626j3312l7945l0765J590K1159J1637
$$ 257682 269363 280585 297614 317441 334252 339878 326566 288621 257856 259446 280605 292242
10591B92242n433o568L076Q439J1052o690p492O06M006M873k27k703l364p556
$$ 292242 286809 280241 283317 291756 302808 296118 288626 289232 293238 298111 297884 295181 291817 284261
10577B84261r271j1050n486m617l488o6L762J3117J7462J8484J2408L489M891
$$ 284261 274990 263940 258454 253837 250349 250283 254045 267162 284624 303108 315516 319005 323896
10564C23896l200q169o251n067m474o697P819J4937J5701N056J1300J5573J8756
$$ 323896 320696 312527 306276 301209 296735 290038 297857 312794 328495 333551 344851 360424 379180
10551C79180J3560K595n910N536M81L438K982O402N825J0247R889R896K895J504
$$ 379180 392740 395335 389425 394961 395442 398880 401862 408264 414089 424336 434225 444121 447016 448520
10537D48520N471o113M65N436J2367J0117J5335J4552N419J387o411l194J2545
$$ 448520 453991 447878 448343 453779 466146 476263 491598 506150 511569 512956 506545 503351 515896
10524E15896K9046K8129K5165L2751L4336K5876K0885R239R919K0983K5914K8930
$$ 515896 544942 573071 598236 630987 665323 691199 712084 721323 731242 752225 778139 807069
10512H07069L7172M0901M0968L5718L6885M6788O2752N4211M2732M1557M5347
$$ 807069 844241 885142 926110 961828 998713 1045501 1108253 1162464 1205196 1246753 1292100
10501A292100N6760P4936Q6428Q2967Q3459R2733R1272Q9961R7584J40770J74639
$$ 1292100 1348860 1423796 1510224 1593191 1676650 1769383 1860655 1950616 2048200 2188970 2363609
10490B363609J93429K19620K62920L11790L61843M34752N65757P54470Q77116
$$ 2363609 2557038 2776658 3039578 3351368 3713211 4147963 4713720 5468190 6345306
10481F345306P74764O08140O69177J001763J414722J524952J416136J636071K273967
$$ 6345306 7120070 7728210 8397387 9399150 10813872 12338824 13754960 15391031 17664998
10472A7664998L306735M972578P712490J2456581K1017335L6043355N8572412
$$ 17664998 20971733 25944311 33656801 46113382 67130717 103174072 161746484
10465A61746484P6792116N8090223m845706o0096424p2109206n4606084l4144930
$$ 161746484 238538600 296628823 291783117 231686693 159577487 104971403 70826473
10458G0826473k0763029j3162744q752459o034138m322696l233617k513815j997541
$$ 70826473 50063444 36900700 28148241 22114103 17791407 14557790 12043975 10046434
10450A0046434j580081j201921p90558l79323j74458l43404o59427p79358o78934
$$ 10046434 8466353 7264432 6473874 6094551 5920093 5576689 4917262 4137904 3458970
10441C458970n23991l91473k95158k25972j80295j46408j27630j20540j35308
$$ 3458970 2934979 2543506 2248348 2022376 1842081 1695673 1568043 1447503 1312195
10432A312195j33395j09024q8762p3411n7088m2168m4845m4004l9945m7259l6605
$$ 1312195 1178800 1069776 981014 907603 850515 808347 763502 719498 679553 632294 595689
10421E95689k1798n803m619j7372k1308j8725j1214k4045l1483k7862k5022l6679
$$ 595689 573891 568088 563469 546097 524789 506064 494850 470805 439322 411460 386438 349759
10409C49759l7315k4157n449k087l05K962Q296J011j7936l6206l0895j7695p515
$$ 349759 312444 288287 282838 280751 280446 283408 291704 292715 274779 238573 207678 189983 182468
10396A82468J38j1319j2271j4305n493M799j0571j9179j6405o777o872P64N710
$$ 182468 182606 171287 159016 144711 139218 144017 133446 114267 97862 91085 84213 84977 90687
10383I0687m889j847j0563o119n535j2019n151Q273J8510J5169J2608L645o527
$$ 90687 85798 83951 73388 67269 61734 49715 44564 52837 71347 86516 99124 102769 96242
10370I6242j0313l540n803q110j7629j6874m422j8112j4912n261J165R966R549
$$ 96242 85929 82389 76586 68476 50847 33973 29551 11439 -3473 -8734 -7569 2397 11946
10357A1946J6391J3740Q84j55m290m417K618k304j4699j1604q102p076O337O785
$$ 11946 28337 42077 42961 42806 38516 34099 36717 34413 19714 8110 8 -7068 -731 6054
10343F054J778R456Q565L116J6038L2666J5587j1460M530R481J747o589k3972
$$ 6054 7832 17288 25853 28969 45007 77673 93260 81800 86330 95811 97558 90969 66997
10330F6997l1870k7655r369m970R67l259j1293k849L005K986Q102Kj454J854J104
$$ 66997 35127 7472 -1897 -6867 -5900 -9159 -20452 -23301 -20296 -17310 -9208 -9206 -10660 -8806 -7702
10315g702R645R461P744l726o593o413J912L413M78L923P391J4043N925j737n65
$$ -7702 1943 11404 19148 15422 8829 2416 4328 7741 8219 12142 19533 33576 39501 37764 37199
10300C7199J087j65q37o443q186q520l672L332n131n157M626O740M167N605M77
$$ 37199 38286 38121 37284 30841 22655 14135 10463 13795 8664 3507 8133 14873 19040 24645 25122
10285B5122q190j0396k402m274p796j126J209J0612J4517J5877P012J4114L5148
$$ 25122 16932 6536 4134 -140 -7936 -9062 -7853 2759 17276 33153 40165 54279 89427
10272H9427M5623J7892j7667r097J5211J2817k3818l1633j3419j1441j2221j6147
$$ 89427 135050 152942 135275 126178 141389 154206 130388 98755 85336 73895 61674 45527
10260D5527j4205o688n295q256j7501n807j593M592O121l212l125M032L771r003
$$ 45527 31322 24634 19339 11083 -6418 -12225 -13818 -9226 -3105 -6317 -9442 -5410 -1639 -10642
10246a0642o46r05p499m135q507L517N753N979k756N99o95L027m907r03K632M489
$$ -10642 -11288 -12193 -19692 -23827 -32334 -28817 -23064 -17085 -19841 -19242 -19937 -16910 -21817 -22720 -20088 -15599
10230a5599J17P32j215m367j234k913M178J1039K894r639o695m588K850L512O436
$$ -15599 -15482 -14750 -15965 -20332 -21566 -24479 -20301 -9262 -6368 -16007 -22702 -27290 -24440 -20928 -14492
10215a4492M377J510k76m490r846j512O062L956Q332M469M118k111p189r94P495
$$ -14492 -10115 -8605 -8881 -13371 -23217 -24729 -18667 -14711 -6379 -1910 2208 97 -7092 -8086 -591
10200e91R228K113j452l30m190l258l560L752o100J971L934L532J464q177l396
$$ -591 8637 10750 9298 8968 4778 1520 -2040 1712 -4388 -2417 1517 5049 6513 -1664 -5060
10185e060J74J083m81K735O269O737J1325J0357J51o366j361Q711J4031n910r872
$$ -5060 -4886 -3803 -4284 -1549 4720 11457 22782 33139 33290 26924 25563 34274 48305 42395 32523
10170C2523l655l376Q69p335j5232j6236j8112k5405k9274m9204m3274p425J9884
$$ 32523 28868 25492 26361 19026 3794 -12442 -30554 -55959 -85233 -134437 -177711 -185136 -165252
10157a65252L7659K7997K4211K5622K2365J3977J2472R021L781J1709J3474J0068
$$ -165252 -127593 -99596 -75385 -49763 -27398 -13421 -949 8072 11853 23562 37036 47104
10145D7104M465K732J2890L0321M7496P4473Q5376M1843k0649o9913p4665n3896
$$ 47104 51569 54301 67191 97512 145008 219481 304857 346700 326051 256138 181473 127577
10133A27577l6086k4679j1045k974j3494j9728r541k137j5383j1987j301M185
$$ 127577 91491 66812 55767 52793 39299 19571 10030 7893 -7490 -19477 -20778 -16593
10121a6593R8N734J041L197N360m871l278L458M621J085K496K797k654m977J118
$$ -16593 -16495 -10761 -9720 -6523 -1163 -6034 -9312 -5854 -1233 -148 2348 5145 2491 -2486 -1368
10106a368o47K890j249N298K42n450n797k338R4l956n672o76L427M894L832m438
$$ -1368 -2015 875 -374 4924 5166 -284 -6081 -8419 -8325 -12281 -17953 -18629 -15202 -10308 -6476 -10914
10090a0914J634M713j872J05l579k780j241N010j638m728K022l558M192N583j75
$$ -10914 -9280 -4567 -6439 -6334 -9913 -12693 -13934 -8924 -10562 -15290 -13268 -16826 -12634 -7051 -7226
10075g226m572l82P905j125K039J830N977L083j76O87o842k100o355p53M36J1060
$$ -7226 -11798 -12180 -4275 -5400 -3361 -1531 4446 7529 7353 8040 1198 -902 -7257 -8010 -7574 3486
10059C486N078J843O317m1K675M401l505p035J0792J4089Q130L089P843K1317
$$ 3486 8564 10407 16724 16683 19358 23759 20254 13219 24011 38100 46230 49319 57162 78479
10045G8479L2958M8421P3406J21427J97227L14437L98902K89031n5099l39314
$$ 78479 111437 159858 233264 354691 551918 866355 1265257 1554288 1499189 1159875
10035A159875l72079k69516j69681j01604o7468m4730l2087k2856j7808j0074
$$ 1159875 787796 518280 348599 246995 179527 134797 102710 79854 62046 51972
10025E1972r220o360k290M10M681M22o728j0373o965q483k251o539j681n314q660
$$ 51972 42752 36392 34102 34512 39193 39615 32887 22514 15549 7066 4815 -1724 -3405 -8719 -17379
10010a7379m476m183m463j60O396R091Q4L085K437k420J638p41N294N291J544
$$ -17379 -21855 -26038 -30501 -30661 -24265 -15174 -15090 -12005 -9568 -11988 -10350 -11091 -5797 -506 1038
9995A038r777j0123O02N600k989k312P330J4337Q45l702j2476n075M971J970m874
$$ 1038 -8739 -18862 -18260 -12660 -15649 -17961 -10631 3706 4551 849 -11627 -16702 -11731 -9761 -14635
9980a4635m640q19O481J821R85j497k101o035l732K290O336M749J476N455q820
$$ -14635 -19275 -20094 -13613 -11792 -10807 -12304 -14405 -20440 -24172 -21882 -15546 -10797 -9321 -3866 -12686
9965a2686k862l512J894N622l698j611J126j944k828Q790M285m02l544k158N311
$$ -12686 -15548 -19060 -17166 -11544 -15242 -16853 -15727 -17671 -20499 -11709 -7424 -7826 -11370 -13528 -8217
9950h217j072o345L463N769P337M158j09P17M700m319k694o184k657L280R299
$$ -8217 -9289 -15634 -12171 -6402 935 5093 4984 5701 10401 6082 3388 -2796 -5453 -2173 7126
9935G126o068p671j901K590q32r285n127QP276O711k646q908o704Q76J2647Q267
$$ 7126 1058 -6613 -8514 -5924 -6756 -16041 -21168 -21160 -13884 -7173 -9819 -18727 -25431 -24555 -11908 -3641
9919c641M413j1717k419J013l77M996K157M579O601L093p342j162n807Q3O163
$$ -3641 772 -10945 -13364 -12351 -12728 -7732 -5575 -996 5605 8698 1356 194 -5613 -5530 633
9904F33k720l601L395N743k51p672l155L251O754k331q346K909R051j97L66K041
$$ 633 -2087 -5688 -2293 3450 3199 -4473 -7628 -4377 2377 46 -8300 -5391 3660 3463 3829 5870
9888E870L733k395J148j020j731K544J926o929p231k125j45O361o64n635r19l99
$$ 5870 9603 7208 8356 7336 5605 8149 10075 3146 -4085 -6210 -6355 6 -658 -6293 -7212 -7611
9872g611J427l32M56l821l896Q404O425J070k928J695M790K818J360k795l645
$$ -7611 -6184 -6516 -6060 -9881 -13777 -5373 1052 2122 -806 889 5679 8497 9857 7062 3417
9857C417q424k673L633n15J0149O346J163n579q253N12L181k705j307m216Q88
$$ 3417 -5007 -7680 -4047 -4562 5587 11933 13096 7517 -736 -224 2957 252 -1055 -5271 -4383
9842d383L653L909K724J440q595p70L364M866k369j0154p08L315k847K863P586
$$ -4383 -730 3179 5903 7343 -1252 -2022 1342 6208 3839 -6315 -7023 -3708 -6555 -3692 3894
9827C894K072R097L732j559L503M995j1407p478k163n998M989j364n210n838m784
$$ 3894 5966 15063 18795 17236 20739 25734 14327 6849 4686 -1312 3677 2313 -2897 -8735 -13519
9812a3519N299P079L108J7J354n432M618R90k020j905k087K124l80M625j86R60
$$ -13519 -8220 -1141 1967 1984 3338 -2094 2524 3514 1494 -411 -2498 -374 -754 3871 3685 4645
9796D645M33M568j443J518L371M559J3223K4191J3459J6140k827k2063j3228j0275
$$ 4645 5078 9646 8203 9721 13092 17651 30874 55065 68524 84664 81837 59774 46546 36271
9782C6271j2999j0315j192m448k5J613J110p527J1771P509j470l352l862q203
$$ 36271 23272 12957 11765 7317 7292 8905 10015 2488 14259 21768 20298 16946 13084 4881
9768D881j286J017j708n488l05M252J677L145m499m28L892K287m169n114n60m10
$$ 4881 3595 4612 2904 -2584 -2889 1363 3040 6185 1686 1258 5150 7437 3268 -1846 -2406 -2816
9752b816J4508R240k21J431m088p97l679o016O77J207j60M728K429J302k210P799
$$ -2816 11692 20932 20711 22142 18054 17257 13578 7562 8239 9446 9286 14014 16443 17745 15535 23334
9736B3334O905n329k553Q12P582M398r92J386k242L7O985O772Q106P821N102j082
$$ 23334 30239 24910 22357 23169 30751 35149 34157 35543 33301 33338 40323 47095 55201 63022 68124 67042
9720F7042J359N381R353N526J9588K7406M2559O4841J05087J90116K92667L67687
$$ 67042 68401 73782 83135 88661 108249 135655 178214 243055 348142 538258 830925 1198612
9708A198612M34918M30414L11099J34891o3207k55316m02983m23552l85740l14256
$$ 1198612 1633530 2063944 2375043 2509934 2446727 2191411 1788428 1364876 979136 664880
9698F64880k16433j33911q3134n0179m0268k5605j7240j3628j0249r676o615r074
$$ 664880 448447 314536 231402 181223 140955 115350 98110 84482 74233 64557 57942 48868
9686D8868q994M35l672K567k700p637o546p090l827j920K509M703K180m071l173
$$ 48868 39874 40309 36637 39204 36504 28867 22321 15231 11404 9484 11993 16696 18876 14805 11632
9671A1632O136o515j233l167o75l029n000m17j49K114k439l667O25P024L165M893
$$ 11632 17768 11253 10020 6853 6178 3149 -1851 -2268 -2417 -303 -2742 -6409 -5784 1240 4405 9298
9655I298M318K8j741l899l647L018O908K108k865r714l752J694J1720M248N174
$$ 9298 13616 13644 11903 8004 4357 7375 14283 16391 13526 3812 60 1754 13474 17722 22896
9640B2896o389j3409o652L329N473q58n550q25j967k088J361j97K187J923L861
$$ 22896 16507 3098 -3554 -225 5248 4390 -1160 -1985 -3952 -6040 -4679 -4876 -2689 -766 3095
9625C095J808K345l763R24L107J342n655o372l565O933M881L591n717k445N123
$$ 3095 4903 7248 3485 4409 7516 8858 3203 -3169 -6734 199 5080 8671 2954 509 5632
9610E632Q501n463m409r75K757l883J262q63l082K480K049J716L053M605J423
$$ 5632 14133 8670 4261 3286 6043 2160 3422 2559 -523 1957 4006 5722 8775 13380 14803
9595A4803l752k647o274N620O151o186j62K144K074l223l667l296N213K424l418
$$ 14803 11051 8404 2130 7750 13901 7715 7553 9697 11771 8548 4881 1585 6798 9222 5804
9580E804J632R541l145q247k645l199O648N848J209L382K074p77l801j234l107
$$ 5804 7436 16977 13832 5585 2940 -259 6389 12237 13446 16828 18902 18125 14324 13090 9983
9565I983L277n293n728K882q83O247M618k091k020k802m148n386O820L919N693
$$ 9983 13260 7967 2239 5121 4238 10485 15103 13012 10992 8190 4042 -1344 5476 9395 15088
9550A5088k123p200J841M201l992j323L926K140l7o451K363j037o29P613M844
$$ 15088 12965 5765 7606 11807 7815 6492 10418 12558 12521 6070 8433 7396 6767 14380 19224
9535A9224L18o917q058k15J3218M577l034l05L107m299o622k960K986P658o332
$$ 19224 19542 12625 4567 4352 17570 22147 19113 18808 21915 17616 10994 8034 11020 18678 12346
9520A2346L151l383m6L381p61R64r64j361m86j947J836n4Q189j246q000k227J858
$$ 12346 15497 12114 12068 15449 14688 15652 14688 13327 12841 10894 12730 12676 20865 19619 11619 9392 11250
9503A1250R646K706l964m893Q709j815k494K376l910j893K087L227k392l989k492
$$ 11250 20896 23602 19638 14745 23454 21639 19145 21521 17611 15718 17805 21032 18640 14651 12159
9488A2159m824M070M703l883K946j647k759j7J477J233l82m229L518p06R13J1492
$$ 12159 7335 11405 16108 12225 15171 13524 10765 10748 12225 13458 13076 8847 12365 11659 12572 24064
9472B4064K020l053l901L289l741m647k531N63K106Q023K191k885R64N498K595
$$ 24064 26084 23031 19130 22419 18678 14031 11500 12063 14169 22192 24383 21498 22462 27960 30555
9457C0555n851k295K324q16l850m672P181K402k083j070M609J240j747j646Q83
$$ 30555 24704 22409 24733 23917 20067 15395 22576 24978 22895 21825 26434 27674 25927 24281 25164
9442B5164L064j464j500J156p501M643r96k421L378L064o12k655J0O704R461j189
$$ 25164 28228 26764 25264 26420 18919 23562 22566 20145 23523 26587 25975 23320 23330 30034 39495 38306
9426C8306o886K034O3O95m373l288K935J064k497J85j460N088o65k448N03m768
$$ 38306 31420 33454 33517 34212 29839 26551 29486 30550 28053 28238 26778 31866 31201 28753 29256 24488
9410B4488r097O244J622j930R664N576r30l390n009J80Q44j560j712k836j319
$$ 24488 15391 21635 23257 21327 30991 36567 35637 32247 27238 27418 28262 26702 24990 22154 20835
9395B0835k673j100K686N715M196p575K245M933j086K864N295k063l163J857l471
$$ 20835 18162 17062 19748 25463 29659 22084 24329 29262 28176 31040 36335 34272 31109 32966 29495
9380B9495p307R83N071L354N776M580m569n582k61r99k247n342Q421O910k29P50
$$ 29495 22188 23171 28242 31596 37372 41952 37383 31801 31540 30541 28294 22952 31373 38283 38054 38804
9364C8804O26J126n054j028n439n24Q79l88m922K354J576l824J107j404J68J017
$$ 38804 39430 40556 35502 34474 29035 28511 29390 29002 24080 26434 28010 24186 25293 23889 24057 25074
9348B5074O817R454K916L539m15L219k863q210p064K195N288K243N42k710p175
$$ 25074 31891 41345 44261 47800 47385 50604 47741 39531 32467 34662 39950 42193 42735 40025 32850
9333C2850o370L658K695l714o228J186K627J2317J3117l743p344j426k202N639
$$ 32850 26480 30138 32833 29119 22891 24077 26704 39021 52138 48395 41051 39625 37423 43062
9319D3062L400n025m345n778l211M162O78k932O42J219N864P68L511Q415j702
$$ 43062 46462 41437 37092 31314 28103 32265 32943 30011 30653 31872 37736 38504 42015 50430 48728
9304D8728O013j128k354L642M316k695L428M437M527r15j109r483j6100k191J1198
$$ 48728 54741 53613 51259 54901 59217 56522 59950 64387 68914 67999 66890 57407 41307 39116 50314
9289E0314J625m120M036M988N502n869o960j757N248L698J330J840J566l349m738
$$ 50314 51939 47819 51855 56843 62345 56476 49516 47759 53007 56705 58035 59875 61441 58092 53354
9274E3354P12j531l22O791m413m009m103l16M194K236k741L086q1m652N899K476
$$ 53354 54066 52535 52213 59004 54591 50582 46479 46163 50357 52593 49852 52938 52857 48205 54104 56580
9258E6580N139L035m491M84K716K759l785k170L533K704l533l769j237k509J892
$$ 56580 61719 64754 60263 60747 63463 66222 62437 60267 63800 66504 62971 59202 57965 55456 57348
9243E7348M979P194j609m595q781L837K872k210k03K099K634K52M35K924k242
$$ 57348 62327 69521 67912 63317 54536 58373 61245 59035 58832 60931 63565 63817 64252 67176 64934
9228F4934n152K282M805k266k551q15o928L663P703P518J628n516l085J199l517
$$ 64934 59782 62064 66869 64603 62052 61237 54309 57972 65675 73193 74821 69305 66220 67419 63902
9213F3902L642J1165P18j127M70k287M754l319L615K748o322m49m190j225J321
$$ 63902 67544 78709 79427 78300 78770 76483 81237 77918 81533 84281 77959 77510 73320 72095 73416
9198G3416j305l42R902J162j1987j862k52l060L103P353J539J919K249M199o233
$$ 73416 72111 71769 81671 82833 70846 68984 68732 65672 68775 76128 77667 79586 81835 86034 79801
9183G9801M887N074q39q6k974j033P37k582J236j828l351l554M000Q30k03J833
$$ 79801 84688 89762 88923 88837 85863 84830 85567 82985 84221 82393 79042 75488 79488 80318 80115 81948
9167H1948J303o48k930k47L332j76m038n908L765N374K990n353j120M375N28N611
$$ 81948 83251 82603 79673 79426 82758 82582 78544 72636 76401 81775 84765 79412 78292 82667 83195 88806
9151H8806J517j96k238P95J542O577k100r960K040L83q41j282M090N528k075r60
$$ 88806 90323 90127 87889 88684 90226 96803 94703 84743 86783 87166 86325 85043 89133 94661 92586 91626
9135I1626K408M809o0n417K932K299M38J997k316n785k281j6L474L503j221m8
$$ 91626 94034 98843 98783 93366 96298 98597 99035 101032 98716 92931 90650 90634 94108 97611 96390 96342
9119I6342M054k079n018J21j144J7M251P48o78K397K92k388J895J399k158M214
$$ 96342 100396 98317 93299 93420 92276 92293 96544 97292 96614 99011 99303 96915 98810 100209 98051 102265
9103A02265Q360k625j971J825l65R30J18p67n106L061O811k16J018m900o036j120
$$ 102265 110625 108000 106029 107854 107489 108419 108537 107770 102664 105725 112536 112320 113338 108438 102402 101282
9087A01282n84k020R280J1050L52o750J992l081k693P583J987o246p90Q739N650
$$ 101282 100698 98678 107958 119008 119360 112610 114602 111521 108828 116411 118398 112152 111362 120101 125751
9072A25751L241J2000l657m634r450q286L318N368J779M518r90K63J105k784k645
$$ 125751 128992 140992 137335 132701 123251 114965 118283 123651 125430 129948 128958 129221 130326 127542 124897
9057A24897J227j080n75L896K763q5j427K212N389L375K088n835o81m982k282
$$ 124897 126124 125044 124469 128365 131128 131043 129616 131828 137217 140592 142680 136845 136164 131182 128900
9042A28900k700R616Q279m587o814N52M376q37n84m99M984M841J757k160q161
$$ 128900 126200 135816 144095 139508 132694 133246 137622 136785 136201 135702 140686 145527 147284 145124 136963
9027A36963K596J0923M217k839K799m30k981l885K94Q931o62m382j642Q057Q862
$$ 136963 139559 150482 154699 151860 154659 154229 151248 147363 147657 156588 155926 151544 149902 157959 166821
9012A66821k11l641J115Q043N169m80k060p49M887r2l206k603m830P66N895M049
$$ 166821 166610 162969 164084 172127 177296 176816 174756 174007 178894 178802 175596 172993 168163 168929 174824 178873
8996A78873M38o097j657J584J224l61L565k89K112R968R01J12O142l20O092M605
$$ 178873 179311 173214 171557 173141 174365 174004 177569 177280 179392 189360 190261 190373 196515 196195 202287 206892
8980B06892m863k918M396j481l220k021k288N568J002j89J03L18P537J256K999
$$ 206892 202029 199111 203507 202026 198806 196785 194497 200065 201067 200878 200981 201299 208836 210092 213091
8965B13091M955O431l590l141r0m155L077O030N672O628L205l531K024R656j861
$$ 213091 218046 224477 220887 217746 217656 213501 216578 222608 228280 234908 238113 234582 236606 246262 244401
8950B44401l684m788k110O815R668N862K622K244O047L02n538k56K262j277k5
$$ 244401 240717 235929 233819 240634 250302 256164 258786 261030 267077 267379 261841 261585 263847 262570 262545
8935B62545J775J696K165j861M349P679K504n205k520Q807J75P193N756m117k230
$$ 262545 264320 266016 268181 266320 270669 278348 280852 275647 273127 281934 282109 289302 295058 290941 288711
8920B88711N852J257m1P789J636q857P640O142N434j274p98O673L788j956J2557
$$ 288711 294563 295820 295779 303568 305204 296347 303987 310129 315563 314289 313491 320164 323952 321996 334553
8905C34553O599l791k71N499R453M330K557J22Q662J6040K214j2520r197J831
$$ 334553 341152 337361 337090 342589 352042 356372 358929 359051 367713 383753 385967 373447 364250 366081
8891C66081M372P414Q882P812K079L403J2559O15n85O726Q718L774m07R714P057
$$ 366081 370453 377867 386749 394561 396640 400043 412602 413217 412632 419358 428076 431850 431443 441157 448214
8876D48214O32K791P495L853N118P277k698Q564O895O282R531k363m341P158O609
$$ 448214 448846 451637 459132 462985 468103 475380 472682 481246 488141 494423 503954 501591 497250 504408 511017
8861E11017J0354J3143O225O657N811J1244P524L629O081J2178J4212J4396K4277
$$ 511017 521371 534514 540739 547396 553207 564451 571975 575604 581685 593863 608075 622471 646748
8848F46748K5472L9037N8859R2690J47812J62289M4762j08901j45228j06066o2302
$$ 646748 672220 711257 770116 862806 1010618 1172907 1217669 1108768 963540 857474 795172
8837G95172l4347j1398q304l206J74M064P258J2836J2902k434j304O246R952J1844
$$ 795172 760825 749427 741123 737917 738091 742155 749413 762249 775151 772717 771413 777659 787611 799455
8823G99455J3536J0759R871Q905J0936Q448J6283J3182R496J0519P786J3246M623
$$ 799455 812991 823750 833621 842526 853462 861910 878193 891375 900871 911390 919176 932422 937045
8810I37045P665P481J8800J9039J2866J1224J4881J4449J2697J6356K3763K2755
$$ 937045 944710 952191 970991 990030 1002896 1014120 1029001 1043450 1056147 1072503 1096266 1119021
8798A119021K2435J4580J9011J4911J5880K3377J8162J9809K6460K4663J8867
$$ 1119021 1141456 1156036 1175047 1189958 1205838 1229215 1247377 1267186 1293646 1318309 1337176
8787A337176J5103K2232K1881K2646K2572K4771J8657K5863K9979K4659K2049
$$ 1337176 1352279 1374511 1396392 1419038 1441610 1466381 1485038 1510901 1540880 1565539 1587588
8776A587588K6952K2888K9886L5939L5726K8111K6187L5334L3518L6561L7303
$$ 1587588 1614540 1637428 1667314 1703253 1738979 1767090 1793277 1828611 1862129 1898690 1935993
8765A935993L3965K5765L0366L8353M4114M4723L8337L7614M3702L8630M1241
$$ 1935993 1969958 1995723 2026089 2064442 2108556 2153279 2191616 2229230 2272932 2311562 2352803
8754B352803M9186M2967M2403M7492N1403N2188M7513M9976N0513N3853N2356
$$ 2352803 2401989 2444956 2487359 2534851 2586254 2638442 2685955 2735931 2786444 2840297 2892653
8743B892653O2199N0153N1104O3434O3463N5665O8412O2402O9138O7015N7643
$$ 2892653 2954852 3005005 3056109 3119543 3183006 3238671 3307083 3369485 3438623 3505638 3563281
8732C563281O3388O4154O4111O9611O7857O8918O3967O8008O6546O8239P0108
$$ 3563281 3626669 3690823 3754934 3824545 3892402 3961320 4025287 4093295 4159841 4228080 4298188
8721D298188O2654P1403O5680O8189N9277O2258O7679O6253N4837N1007N2776
$$ 4298188 4360842 4432245 4497925 4566114 4625391 4687649 4755328 4821581 4876418 4927425 4980201
8710D980201M5675N0595N3477N2025L8516M0686L5467K6582K9719K3861J2713
$$ 4980201 5025876 5076471 5129948 5181973 5220489 5261175 5296642 5323224 5352943 5376804 5389517
8699E389517J2010Q180J5835O022J110n359m349r908k0866j6461k0952k7073k7380
$$ 5389517 5401527 5409707 5425542 5431564 5432674 5427315 5422966 5413058 5392192 5375731 5354779 5327706 5300326
8686E300326l7328l9885l4937m3545m7001m6142n2344n5290m9796n7351n8573
$$ 5300326 5262998 5223113 5188176 5144631 5097630 5051488 4999144 4943854 4894058 4836707 4778134
8675D778134n9044o5911p6486o7191o1285n9740o2945p2483p7519p0988o1479
$$ 4778134 4719090 4653179 4576693 4509502 4448217 4388477 4325532 4253049 4175530 4104542 4043063
8664D043063p0084p1201p3217p2671p3401o4244o5959o9042o1474o1194o0459
$$ 4043063 3972979 3901778 3828561 3755890 3682489 3618245 3552286 3483244 3421770 3360576 3300117
8653C300117n7247o0801o6285o7836n8721o1060o2024n1871m6006n3738n3864
$$ 3300117 3242870 3182069 3115784 3047948 2989227 2928167 2866143 2814272 2768266 2714528 2660664
8642B660664n9325n1734n1662n4366n0771l7195l8787m1105m5250m5320m5392
$$ 2660664 2601339 2549605 2497943 2443577 2392806 2355611 2316824 2275719 2230469 2185149 2139757
8631B139757m4460m5843m3959l9213l7784l5259k8201l1912k8201l1517k2358
$$ 2139757 2095297 2049454 2005495 1966282 1928498 1893239 1865038 1833126 1804925 1773408 1751050
8620A751050k2736m2436l6289l3547l0410k3428k3976k9312k4127k9749l1785
$$ 1751050 1728314 1685878 1649589 1616042 1585632 1562204 1538228 1508916 1484789 1455040 1423255
8609A423255k1557k2731k5391k1228k3936k6756k7528k3156j6496j9911j5145
$$ 1423255 1401698 1378967 1353576 1332348 1308412 1281656 1254128 1230972 1214476 1194565 1179420
8598A179420k0809k2679j1762r804j4079j4538j7200j3685k677J1855K4859L52
$$ 1179420 1158611 1135932 1124170 1114366 1100287 1085749 1068549 1054864 1052187 1064042 1088901 1089253
8586A089253l0347m6226m4668l2337j6327j3853k2651j8523m506n819k1330q013
$$ 1089253 1058906 1012680 968012 935675 919348 905495 882844 864321 859815 853996 832666 824653
8574H24653k599j5764j0347j2195j8566j1915l414l505j0983n602r306j7241j1282
$$ 824653 822054 806290 795943 783748 765182 753267 749853 746348 735365 729763 720457 703216 691934
8561F91934j0011j1868j0193j0818o516q189j3290j1746n760r029q367m209j609
$$ 691934 681923 670055 659862 649044 642528 634339 621049 609303 603543 594514 586147 581938 580329
8548E80329L90l214J4784K3533J6042p258k9196l1409k3621j8909j0777o074o820
$$ 580329 580719 577505 592289 615822 631864 624606 595410 564001 540380 521471 510694 504620 497800
8535D97800j180n625q632j0122n549q17n034q851o910n014r344j0561p556J713
$$ 497800 496620 490995 482363 472241 466692 465875 460841 451990 445080 440066 430722 420161 412605 414318
8521D14318l569n145m433j0134j1320j333O666p498r117m953m587m775k035o837
$$ 414318 410749 405604 401171 391037 379717 378384 385050 377552 368435 363482 358895 354120 352085 345248
8507C45248o289k294J846n562o332j901J307l144m598o000k457k248m700L013
$$ 345248 338959 336665 338511 332949 326617 324716 326023 322879 318281 312281 309824 307576 302876 305889
8493C05889m041q566k321m072l878k219K935p221q365J918L915Q71j872j811j879
$$ 305889 301848 293282 290961 286889 283011 280792 283727 276506 268141 270059 273974 274845 272973 271162 269283
8478B69283j0922n405K784M292k046q866q353l203K027K75J306n624j279N98p863
$$ 269283 258361 252956 255740 260032 257986 249120 240767 237564 239591 239866 241172 235548 234269 234867 227004
8463B27004q394m273J95j985p216L695m586M973l145n603m313k447l967K046o300
$$ 227004 218610 214337 214532 212547 205331 209026 204440 209413 206268 200665 196352 193905 189938 191984 185684
8448A85684J45o53L587O266j404m083k290N108J354J5J889j955o416l435p455
$$ 185684 185829 185176 188763 195029 193625 189542 187252 192360 193714 193729 195618 193663 187247 183812 176357
8433A76357j664N958n12j986k356o114j264m180q68k236k947k797l18L90N115
$$ 176357 174693 180651 180139 178153 175797 169683 168419 164239 163371 161135 158188 155391 155073 155463 160578
8418A60578L662O14p313r68K69j0418q952M578K772l875k83K266R273P831m798
$$ 160578 164240 164854 157541 156573 156842 146424 137472 142050 144822 140947 140664 142930 152203 160034 155236
8403A55236M404N543j915j1174m506p625k102L139n765j1690j2614k436k760k213
$$ 155236 159640 165183 163268 152094 147588 139963 137861 141000 135235 123545 110931 108495 105735 103522
8389A03522r17M694K5L184k929m829L419L455Q64M77J860J74p338j669p004J492
$$ 103522 102605 107299 107324 110508 107579 102750 106169 109624 110488 110965 112825 112999 105661 103992 96988 98480
8373I8480L788R277n500j1876o97j427P21l294k402j150n81k869M052R356L512
$$ 98480 102268 111545 106045 94169 93472 92045 92766 89472 87070 85920 85339 82470 86522 95878 99390
8358I9390n627k047M899K421m920o198l34M142l664j659K650J243j357J862M279
$$ 99390 93763 91716 96615 99036 94116 87918 87584 91726 88062 86403 89053 90296 88939 90801 95080
8343I5080l202o216k371j215N04r70M0J185N489k370r435j694L079K459J937L136
$$ 95080 91878 85662 83291 82076 82580 81610 81650 82835 88324 85954 76519 74825 77904 80363 82300 85436
8327H5436O48p305K40J464l583l497k143J983p18L7Q84j686P797q34p349j449
$$ 85436 86084 78779 79019 80483 76900 73403 71260 73243 72525 72562 73446 71760 79557 78723 71374 69925
8311F9925K132k040m436N908Q383k376k419q487j566P069k418J033J48N27j816
$$ 69925 72057 70017 65581 71489 79872 77496 75077 66590 65024 72093 69675 70708 70856 71383 69567
8296F9567n588m076q62K305j534k342m01J0313J0250o11k291j0881m959l988m88
$$ 69567 63979 59903 59041 61346 59812 57470 57069 67382 77632 77021 74730 63849 58890 54902 54414
8281E4414K485K444K43J99Q87n149m132k906K382N407M398k778m990L311M232
$$ 54414 56899 59343 59586 59785 60672 55523 51391 48485 50867 56274 60672 57894 52904 56215 60447
8266F0447l366n153M271K034n79j758k434J899q1K264P54m853o212l368k880J0440
$$ 60447 57081 51928 56199 58233 57654 55896 53462 55361 55280 57544 58298 53445 47233 43865 40985 51425
8250E1425Q04m031n39M583K118L945M197k611j1590m683J546J710M960m496P51
$$ 51425 52229 48198 47659 52242 54360 58305 62502 59891 48301 43618 45164 46874 51834 47338 48089
8235D8089k012j867q499j401M20P097P485j861l276o448j001J400M665O267o583
$$ 48089 46077 44210 35711 34310 34730 41827 49312 47451 44175 37727 36726 38126 42791 49058 42475
8220D2475k907L440L164k70Q49J08l019j591q70N256R37p39l345j0829R44l863
$$ 42475 39568 43008 46172 45902 46751 46859 43840 42249 41379 46635 47572 46833 43488 32659 33603 29740
8204B9740n340O308M060M863O724l067l302o410j465J676j600M599M320p52p142
$$ 29740 24400 30708 34768 39631 46355 43288 39986 33576 32111 33787 32187 36786 41106 40354 33212
8189C3212o688k174M417p75p05K75k594k634O864M076K475n304o508j690P173
$$ 33212 26524 24350 28767 27992 27287 27562 24968 22334 29198 33274 35749 30445 23937 22247 29420
8174B9420N090j554O01N321O50n636p812j346N993M858J169K943k545p663J210
$$ 29420 34510 32956 33557 38878 39528 33892 26080 24734 30727 35585 36754 39697 37152 29489 30699
8159C0699K934j288L533nJ46O61Q66l373L591Q85l40k792j105J1055j8o368p612
$$ 30699 33633 32345 35878 35873 36019 36680 37546 34173 37764 38649 38309 35517 34412 45467 45449 39081 31469
8142C1469l221n579l50k006k540O570J0344K538J897N211J14K475r799l168L544
$$ 31469 28248 22669 22319 20313 17773 24343 34687 37225 39122 44333 44447 46922 37123 33955 37499
8127C7499j068l564nL538k150j606k298m728q250K299K513n71J871n3J745M038
$$ 37499 36431 32867 32862 36400 34250 32644 30346 25618 17368 19667 22180 21609 23480 23427 25172 29210
8111B9210J292P41n98K898K101L160K266k477j0900m974M749O208M120j0018k849
$$ 29210 30502 31243 30645 33543 35644 38804 41070 38593 27693 22719 27468 33676 37796 27778 24929
8096B4929n389k740m584L214O872N750k78l510l343O56j854n36k059J813K016
$$ 24929 19540 16800 12216 15430 22302 28052 27774 24264 20921 21577 19723 19187 17128 18941 20957
8081B0957K540N931N496J953m505M46j02j542l564P567Q894N338J5939P064K463
$$ 20957 23497 29428 34924 36877 32372 32818 32716 31174 27610 35177 44071 49409 65348 72412 74875
8066G4875p865m333n74N072Q581O790L007o772r116j777j1371p321J669K906L480
$$ 74875 67010 62677 62103 67175 75756 82546 85553 78781 69665 67888 56517 49196 50865 53771 57251
8051E7251k016p779m918O10m370l007m302o260k650p26M539P498L031j062J300
$$ 57251 55235 47456 42538 43148 38778 35771 31469 25209 22559 21833 26372 33870 36901 35839 37139
8036C7139K958L042n06j465j198L886k184L545K523L450J309K957R66n323o273
$$ 37139 40097 43139 42633 41168 39970 43856 41672 45217 47740 51190 52499 55456 56422 51099 44826
8021D4826j752N459J3859J0236K11o366j0722Q56m894r299l046k987k449p55O158
$$ 44826 43074 48533 62392 72628 72839 66473 55751 56607 51713 42414 39368 36381 33932 33177 39335
8006C9335j559j945J039j205n699m736o306j504N29k377L353M564K178p12J37
$$ 39335 37776 35831 36870 35665 29966 25230 18924 17420 17949 15572 18925 23489 25667 24955 25092
7991B5092N443j004m36k149l20M003L96n631M951N696j575o097o018j553J850
$$ 25092 30535 29531 29095 26946 26626 30629 31025 25394 30345 36041 34466 28369 22351 20798 22648
7976B2648n457o238l681K944R829O588k25k774n619Q68J0721p283n688J31K273
$$ 22648 17191 10953 7272 10216 20045 26633 26408 23634 18015 18883 29604 22321 16633 16764 19037
7961A9037L23M78M937M27q345o320k201M013K269M21K451O965j1074k162M517
$$ 19037 19360 19838 24775 25202 16857 10537 8336 12349 14618 15039 17490 24455 13381 11219 15736
7946A5736O622N232J082J442Q51o087k435M229J704q13l278q731L634N67M101
$$ 15736 22358 27590 28672 30114 30965 24878 22443 26672 28376 27563 24285 15554 19188 19755 23856
7931B3856P964k083l673k545n32M29l753K036j837m425r74N234l185m610k474
$$ 23856 31820 29737 26064 23519 22987 23416 19663 21699 19862 15437 14463 19697 16512 11902 9428
7916I428m609n07J4499R185N117m967j1565n221L305k561m882K980P209J5K896
$$ 9428 4819 4312 18811 27996 33113 28146 16581 11360 14665 12104 7222 10202 17411 17426 20322
7901B0322J300m515j934M821J04l237n089k028m974M918N529j982q11r91l371
$$ 20322 21622 17107 15173 19994 20098 16861 11772 9744 4770 9688 15217 13235 12424 11433 8062
7886H062J619P04N4K399K883R265o144p239j351O881k516m172N256K320j0306
$$ 8062 9681 10385 10439 12838 15721 24986 18842 11603 10252 17133 14617 10445 15701 18021 7715
7871G715j846J214o59n590L626N090l012N53J551o258M13R012j902o59o429J423
$$ 7715 5869 7083 6424 834 4460 9550 6538 7091 8642 2384 2797 11809 9907 9248 2819 4242
7855D242j053Q420L922J28j0980p977J742k074k618M284O55o459m417L328P501
$$ 4242 3189 11609 15531 15659 4679 -3298 -1556 -3630 -6248 -1964 -1309 -7768 -12185 -8857 -1356
7840a356O322L318n260n356M929L587K970J86n844l672r61L564L535J727o063
$$ -1356 4966 8284 3024 -2332 2597 6184 9154 9340 3496 -176 -1137 2427 5962 7689 1626
7825A626M603L361J71j236p406J262M469J686j668m913n109M468Q969k681j104
$$ 1626 6229 9590 9761 8525 1119 2381 6850 8536 6868 1955 -3154 1314 10283 7602 6498
7810F498l365l427N000j858j1259J335P1j094K177k854N671P567k404L545J0193
$$ 6498 3133 -294 4706 2848 -8411 -7076 -7005 -8099 -5922 -8776 -3105 4462 2058 5603 15796
7795A5796N196l434o331l822k094k230P518N717o375j631L974J859M661Q15o784
$$ 15796 20992 17558 11227 7405 5311 3081 10599 16316 9941 8310 12284 14143 18804 19619 12835
7780A2835q402k613K702O065m079n727K232N588j743p173o013o851L219m33J988
$$ 12835 4433 1820 4522 10587 6508 781 3013 8601 6858 -315 -6328 -13179 -9960 -10393 -8405
7765h405R467O634k698p54n433J986l605o262M055P48l676N377k896O07R74Q51
$$ -8405 1062 7696 4998 4244 -1189 797 -2808 -9070 -5015 -4267 -7943 -2566 -5462 -4855 -3881 -3030
7749c030R190q34P67o639k65K040J977Q582q728o578N348M340L339n202L222j811
$$ -3030 6160 5326 6093 -546 -811 1229 3206 11788 3060 -3518 1830 6170 9509 4307 7529 5718
7733E718j463J400J747j50q49p203l043L462J822j257j744l24m769l214N079j945
$$ 5718 4255 5655 7402 7252 6403 -800 -3843 -381 1441 184 -1560 -1884 -6653 -9867 -4788 -6733
7717f733l51L458N670N243m292j561r3L152L019o023m881k848L714O448k968l463
$$ -6733 -7084 -3626 2044 7287 2995 1434 1341 4493 7512 1489 -3392 -6240 -2526 3922 954 -2509
7701b509K325J220L96N249J12K44M038j639K826l949o755L326L169l36M762j411
$$ -2509 -184 1036 1432 6681 6793 7037 11075 9436 12262 8313 1558 4884 8053 7717 12479 11068
7685A1068k107K10R19j656j378l905p341K583P477L13n541o914l486K777P739
$$ 11068 8961 9171 10090 8434 7056 3151 -4190 -1607 5870 6183 642 -6272 -9758 -6981 758
7670G58k606l316N90k947m522N878P874P709L677q165m157j633k155j52J0121
$$ 758 -1848 -5164 -4574 -7521 -12043 -6165 1709 9418 13095 4930 773 -860 -3015 -3167 6954
7655F954J0500l999l944j465L94K744R73m831p994K943O851j733n572o7j181k90
$$ 6954 17454 13455 9511 8046 8440 11184 12157 7326 -668 2275 9126 7393 1821 1754 573 283
7639B83O913O710k929m276m903j0554J354N013J416J408O40K016j394P53q37j779
$$ 283 7196 13906 10977 6701 1798 -8756 -7402 -2389 -973 435 1075 3091 1697 2450 1613 -166
7623a66K98k107l134M704R922l207m605K571j303L68O024l244k606K593m90p35
$$ -166 132 -1975 -5109 -405 9517 6310 1705 4276 2973 3341 9365 6121 3515 6108 5618 4883
7607D883J861M25K506j867p154k609O098M357l365o306o085j028j865m28N310
$$ 4883 6744 7169 9675 7808 654 -1955 4143 8500 5135 -1171 -7256 -8284 -10149 -10577 -5267
7592e267q81j755P378j354j0361m219k669J666M519M621K354O271L293l065k230
$$ -5267 -6148 -7903 -525 -1879 -12240 -16459 -19128 -17462 -12943 -8322 -5968 303 3596 531 -1699
7577a699j580M24j001k028K155K324J148L691k078l553q882j513J735Q450N855
$$ -1699 -3279 -2855 -3856 -5884 -3729 -1405 -257 3434 1356 -2197 -11079 -12592 -10857 -2407 3448
7562C448k169N03N949j786J862l629o594m90m283l171J691M339M457K11m813o661
$$ 3448 1279 1782 7731 5945 7807 4178 -2416 -2906 -7189 -10360 -8669 -4330 127 338 -4475 -11136
7546a1136L862P616m463N268P112l732k786k907K203k435q25M005j158o694l861
$$ -11136 -7274 342 -4121 1147 8259 4527 1741 -1166 1037 -1398 -2223 1782 624 -6070 -9931
7531i931O325J2167J117l710r932j912K108K997N112K173m146K740m033K72M009
$$ -9931 -3606 8561 9678 5968 -3964 -5876 -3768 -771 4341 6514 2368 5108 1075 1347 5356
7516E356K885n52p664J670R7O566o53m195m386k346n683K472Q701o45j525L149
$$ 5356 8241 7689 25 1695 1792 8358 7705 3510 -876 -3222 -8905 -6433 2268 1623 98 3247
7500C247N242K505O51j395m717l040m778l731J341N295L625J225p577m275O527
$$ 3247 8489 10994 11645 10250 5533 2493 -2285 -6016 -4675 620 4245 5470 -2107 -6382 145
7485A45l081q14M583N850n720M29j931J452L07m710l608P177L970l469M892K317
$$ 145 -2936 -3750 833 6683 963 1392 -539 913 1220 -3490 -7098 79 4049 580 5472 7789
7469G789j557q192K416M586j201K194K121j0630p464j035L85L727O005M642M326
$$ 7789 6232 -1960 456 5042 3841 6035 8156 -2474 -9938 -10973 -10588 -6861 -856 3786 8112
7454H112n983n130k614K80l529k245K55O15l763M45J315m929m1k734l592L966
$$ 8112 2129 -3001 -5615 -5335 -8864 -11109 -10854 -10239 -14002 -13557 -12242 -17171 -17212 -19946 -23538 -19572
7438a9572O622pN921N75N05j416j560l87m000K416M9n843k445J436J1845k6k594
$$ -19572 -12950 -12957 -7036 -6461 -5956 -7372 -8932 -9319 -13319 -10903 -10854 -16697 -19142 -17706 -5861 -5887 -8481
7421h481P076M796L712n249J123l574l660J810L276k852K709P83m275m255r78
$$ -8481 -1405 3391 7103 1854 2977 -597 -4257 -2447 829 -2023 686 1469 -2806 -7061 -8039
7406h039M961N955m459J118O074R910n39j0599q061J290K014J782J600q916n418
$$ -8039 -3078 2877 -1582 -464 5610 15520 14981 4382 -3679 -2389 -375 1407 3007 -5909 -11327
7391a1327J0912J751L56k924l210m150m347k811m97Q128K335J060O308N016p931
$$ -11327 -415 1336 1692 -1232 -4442 -8592 -12939 -15750 -16247 -8119 -5784 -4724 1584 6600 -1331
7376a331m897j537O758L759K415R76j988k680K274L183J689p639n014J444l103
$$ -1331 -6228 -7765 -1007 2752 5167 6143 4155 1475 3749 6932 8621 982 -4032 -2588 -5691
7361e691k970L694J268J289L658l296j139K525j155k685J403L014N043p14J681
$$ -5691 -8661 -4967 -3699 -2410 1248 -2048 -3187 -662 -1817 -4502 -3099 -85 4958 4244 5925
7346E925j599K156K111r12K98J581m721k137J15o093q272J705L009n148L340P467
$$ 5925 4326 6482 8593 7681 7979 9560 4839 2702 2817 -3276 -11548 -9843 -6834 -11982 -8642 -1175
7330a175j025l16l969o73K496Q399K630p049j302n191l96r02O155O507N78m522
$$ -1175 -2200 -2516 -6485 -7158 -4662 3737 6367 -682 -1984 -7175 -7571 -8473 -2318 4189 4767 245
7314B45m987j135K420M179r16j955M507k985j329M985k796K261o698o37J576m891
$$ 245 -4742 -5877 -3457 722 -194 -2149 2358 -627 -1956 3029 233 2494 -4204 -4841 -3265 -8156
7298h156N27o21J016K755k020N416l777N949k000p66M718M00k653l705K552M298
$$ -8156 -7629 -8250 -7234 -4479 -6499 -1083 -4860 1089 -911 -1677 3041 3441 788 -2917 -365 3933
7282C933k156j701K654L631k372K865J88p507k765j543k666j489M472J335j468
$$ 3933 1777 76 2730 6361 3989 6854 7042 -465 -3230 -4773 -7439 -8928 -4456 -3121 -4589
7267d589J339k493q87O44K698o660m315K591Q221J680j552K176P69l546j311N51
$$ -4589 -3250 -5743 -6630 -5986 -3288 -9948 -14263 -11672 -3451 -1771 -3323 -1147 -378 -3924 -5235 -4684
7251d684l697k534N32L61J22P727P875n774k674j551k24m826M275J205o8j460
$$ -4684 -8381 -10915 -10383 -10022 -9900 -2173 5702 -72 -2746 -4297 -4521 -9347 -5072 -3867 -3935 -5395
7235e395l08j909K019M89l6m565k623M534N605q8J443l468L11J004r274o726K61
$$ -5395 -5703 -7612 -5593 -5104 -5140 -9705 -12328 -7794 -2189 -2277 -834 -4302 -3991 -2987 -12261 -18987 -18726
7218a8726J3978Q155m079m677J907k550l016P43J3263l224k965M552Q125J298
$$ -18726 -4748 3407 -672 -5349 -3442 -5992 -9008 -8265 4998 1774 -1191 3361 11486 12784
7204A2784l183q724m063l369n50O085K77j134M563n73m768l946k272k951l896
$$ 12784 9601 877 -3186 -6555 -7105 -1020 -743 -1877 2686 2113 -2655 -6601 -8873 -11824 -15720
7189a5720K24P587K125N126N801L258L870j44l005j596m506N93K884j2J218o950
$$ -15720 -15496 -7909 -5784 -658 5143 8401 12271 12127 9122 7526 3020 3613 6497 6485 7703 753
7173G53L823J726r691r605J952K240J663K663M555j042P0m39n832n05J67l122
$$ 753 4576 6302 -3389 -12994 -11042 -8802 -7139 -4476 79 -963 -893 -1332 -7164 -7669 -7502 -10624
7157a0624L732n305m75N148N947o017L441J194O45P61k78J774L94l61N67j945
$$ -10624 -6892 -12197 -12672 -7524 -1577 -7594 -4153 -2959 -2314 -1553 -1831 -57 337 -24 543 -1402
7141a402J099J826p40J706L353L462j087q913p470K257Q78m376L849L892L995
$$ -1402 -303 1523 783 2489 5842 9304 8217 -696 -8166 -5909 -5031 -9407 -5558 -1666 2329
7126B329O897K720j489o029l124K350J977j646j0621r08R000R85L275K50k818
$$ 2329 9226 11946 10457 4428 1304 3654 5631 3985 -6636 -7544 1456 2441 5716 5966 3148
7111C148p511L585L752K631m450k575p26m553q012L207K67J222L403N291J577
$$ 3148 -4363 -778 2974 5605 1155 -1420 -2146 -6699 -14711 -11504 -11237 -10015 -6612 -1321 256
7096B56k793J914P07K132n556n313O046k650j357J070K130P98K286P939K100k761
$$ 256 -2537 -623 84 2216 -3340 -8653 -2607 -5257 -6614 -5544 -3414 -2616 -330 7609 9709 6948
7080F948j4800o356j31J908J642M865L578p420j847K520j551L375j563k931P815
$$ 6948 -7852 -14208 -14339 -12431 -10789 -5924 -2346 -9766 -11613 -9093 -10644 -7269 -8832 -11763 -3948
7065c948L035k441L410L804o170j861l614j784j407l132k521j10J06L559J564
$$ -3948 -913 -3354 56 3860 -2310 -4171 -7785 -9569 -10976 -14108 -16629 -16739 -16633 -13074 -11510
7050a1510R6O815l46n794J507L981m85n435J931j004l396j206R15J244P488j165
$$ -11510 -11414 -4599 -4945 -10739 -9232 -5251 -5736 -11171 -9240 -10244 -13640 -14846 -13931 -12687 -5199 -6364
7034f364K669K103K425k637om523K323P045j766j02P1k298n392o683L123J799
$$ -6364 -3695 -1592 833 -1804 -1810 -6333 -4010 3035 1269 1167 1238 -1060 -6452 -13135 -10012 -8213
7018h213l507k37L493M153j213q76n71l758J937r94K944Q593o92p644j011j284
$$ -8213 -11720 -11957 -8464 -4311 -5524 -6400 -6971 -10729 -8792 -9786 -6842 1751 1059 -6585 -7596 -8880
7002h880p13K357j816l028j534n481O505Q983L385n398N745N518m903m610K469
$$ -8880 -9593 -7236 -9052 -12080 -13614 -19095 -12590 -3607 -222 -5620 125 5643 740 -3870 -1401
6987a401j121N826M93m710l063L015l911k145M881l151k749m51J194K201J560
$$ -1401 -2522 3304 3797 -913 -3976 -961 -4872 -7017 -2136 -5287 -8036 -8487 -7293 -5092 -3532
6972c532m752PM699P94l524n19k365RJ793K79j420K918M792K308m025O81m391
$$ -3532 -8284 -8277 -3578 -2784 -6308 -6827 -9192 -9183 -7390 -7111 -8531 -5613 -821 1487 -2538 -1857 -6248
6955f248j896N36J542L585N110L718m3m42m888M39M064j519k260k704K987K461
$$ -6248 -8144 -7608 -6066 -2481 2629 6347 6304 5862 974 1413 5477 3958 1698 -1006 1981 4442
6939D442p440m844j223K407p099K835M087j221n660k664L324L056J079M219K929
$$ 4442 -2998 -7842 -9065 -6658 -13757 -10922 -6835 -8056 -13716 -16380 -13056 -10000 -8921 -4702 -1773
6924a773J212m97j218k213J531n99L312Q088o145m473l761n860J66N928K875K687
$$ -1773 -561 -1058 -2276 -4489 -2958 -3557 -245 7843 1698 -2775 -6536 -12396 -12230 -6302 -3427 -740
6908g40o614O351R131K138j60M335l726o026r39l293L60L0K081R33j515q659K239
$$ -740 -7354 -1003 8128 10266 10106 14441 10715 4689 3750 457 817 847 2928 3861 2346 -6313 -4074
6891d074L209l148p420K233P895M532k684l369O061M083k898l128m860k222L762
$$ -4074 -865 -4013 -11433 -9200 -1305 3227 543 -2826 3235 7318 4420 1292 -3568 -5790 -2028
6876b028N667j028J167O301J374l815k996k209j833q495n823J1128N689n784r16
$$ -2028 3639 2611 3778 10079 11453 7638 4642 2433 600 -7895 -13718 -2590 3099 -2685 -3601
6861c601N279Q17j536J715K458L183m670k126J815j1036k707L301K942O733M043
$$ -3601 1678 2495 959 2674 5132 8315 3645 1519 3334 -7702 -10409 -7108 -4166 2567 6610
6846F610m586j723m807m21J416k507j60K511p76K855j996n12j11N275J310l679
$$ 6610 2024 301 -4506 -4927 -3511 -6018 -6178 -3667 -4443 -1588 -3584 -4096 -4207 1068 2378 -1301
6830a301m7j948j471q72J278k94L239Q82j892P50L581N095k998M39n621q596N08
$$ -1301 -1348 -3296 -4767 -5639 -4361 -4655 -1416 -534 -2426 -1676 1905 7000 4002 4441 -1180 -9776 -9268
6813i268L039K493M180L655m447j996j111l338L218L168K311o076j690J060j497
$$ -9268 -6229 -3736 444 4099 -348 -2344 -3455 -6793 -3575 -407 1904 -4172 -5862 -4802 -6299
6798f299O361k297n315K39K066L10k896J342N230P642J681J930o359m957K112
$$ -6299 62 -2235 -7550 -7311 -5245 -4935 -7831 -6489 -1259 6383 8064 9994 3635 -1322 790
6783G90J146J376k903j952l756K358M522L937j782k001l924k330L330N170R980
$$ 790 1936 3312 409 -1543 -5299 -2941 1581 5518 3736 1735 -2189 -4519 -1189 3981 13961
6768A3961k183p430m699j355o61l391m741q16l767J230Q022l811n984O585Q944
$$ 13961 11778 4348 -351 -1706 -2367 -5758 -10499 -11315 -15082 -13852 -5830 -9641 -15625 -9040 -96
6753i6R376l410q980q585p458m72K173P831N307L795n478o965n85o581J107J200
$$ -96 9280 5870 -3110 -11695 -19153 -19625 -17452 -9621 -4314 -519 -5997 -12962 -13547 -20128 -19021 -17821
6737a7821l124J338J52K999P015K406o39L87M40Q107J447m05n490m485O972J518
$$ -17821 -20945 -19607 -19455 -16456 -9441 -7035 -7674 -7287 -6847 1260 2707 2302 -3188 -7673 -701 817
6721H17J451P37m984k137l715K386Q069q73j183k413q40j137j583J098k5M954
$$ 817 2268 3005 -1979 -4116 -7831 -5445 2624 1751 568 -1845 -2685 -3822 -5405 -4307 -4332 622
6705F22j940O66N488k972k967r69j463R13J957j4577J234N297J696J938R474O127
$$ 622 -1318 -652 4836 1864 -1103 -2072 -3535 -2622 -665 -15242 -14008 -8711 -7015 -5077 4397 10524
6689A0524K43L311o206m637j087n376J580N742j011m248K708K661j547l054n158
$$ 10524 10767 14078 7872 3235 2148 -3228 -1648 4094 3083 -1165 1543 4204 2657 -397 -5555
6674e555P753R185r557q423j116m292Q478N514k655k300k599l072M836K250N550
$$ -5555 2198 11383 1826 -6597 -7713 -12005 -3527 1987 -668 -2968 -5567 -8639 -3803 -1553 3997
6659C997n34j589m120m081L073M191m869k289j041k532M972J1963j22l37k754
$$ 3997 3463 1874 -2246 -6327 -3254 937 -3932 -6221 -7262 -9794 -4822 7141 7019 6682 3928
6644C928m580k318r95P244M514l937N559l814m740j0122k718L219n491k717l91
$$ 3928 -652 -2970 -3965 3279 7793 3856 9415 5601 861 -9261 -11979 -8760 -14251 -16968 -17359
6629a7359M839R05n9j309K817M548L544M828n890K12J481o291o19j03j85k800
$$ -17359 -12520 -11615 -11674 -12983 -10166 -5618 -2074 2754 -3136 -2924 -1443 -7734 -8353 -8456 -8641 -11441
6613a1441N936M086K203J457o094j777j503L953O168P79O106k413m229p2M567
$$ -11441 -5505 -1419 784 2241 -3853 -5630 -7133 -3180 2988 3767 9873 7460 3231 3159 7726
6598G726j100p996m297J326J2138l742n474J716R06N91m654J30K319N57L699j1393
$$ 7726 6626 -1370 -5667 -4341 7797 4055 -1419 297 1203 1794 -2860 -2730 -411 146 3845 -7548
6582g548m896P478N118n576m114N563Q274K63n605o578k304k447N908P25m66Q732
$$ -7548 -12444 -4966 152 -5424 -9538 -3975 4299 4562 -1043 -7621 -9925 -12372 -6464 -5739 -6205 2527
6566B527J095m021l964j162j449m963j0103K014J2016R978J103R43j630m069N981
$$ 2527 3622 -399 -4363 -5525 -6974 -11937 -22040 -20026 -8010 1968 3071 4014 2384 -1685 4296
6551D296O042J692p04n424o01k149j0092l908J075r10L294N038N369N130m240
$$ 4296 10338 12030 11326 5902 5301 3152 -6940 -10848 -9773 -10683 -7389 -2351 3018 8148 3908
6536C908k10j086J975J309N480k653j623n447m964m070N482K120l770N599L982
$$ 3908 3698 2612 4587 5896 11376 8723 7100 1653 -3311 -7381 -1899 221 -3549 2050 6032
6521F032j417o930j0076j619Q602p25P64j17n583M460N672N125j715J091j357
$$ 6032 4615 -2315 -12391 -14010 -5408 -6133 -5369 -5486 -11069 -6609 -937 4188 2473 3564 2207
6506B207j381k119M516K50k630O999k429n764L320j270O651Q32K067Q59l806j709
$$ 2207 826 -1293 3223 3473 843 7842 5413 -351 2969 1699 8350 9182 11249 12108 8302 6593
6490F593n352OO693K498k615n858j460j428L40Q59l02K253L438J390K81l92j545
$$ 6593 1241 1247 7940 10438 7823 1965 505 -923 -583 276 -26 2227 5665 7055 7336 6944 5399
6473E399j143j976K814J083j404k79p408M01q75l602q62M369J066j780n638k555
$$ 5399 4256 2280 5094 6177 4773 4494 -2914 -2513 -3388 -6990 -7852 -3483 -2417 -4197 -9835 -12390
6457a2390N612J857M261Q471k15j58l581k972P882K026m853M837m917n868m036
$$ -12390 -6778 -4921 -660 7811 7596 7438 3857 885 8767 10793 5940 10777 5860 -8 -4044
6442d044l464j021l813l607P69N149k590Q571R820k815j0441L644J830N031p608
$$ -4044 -7508 -8529 -12342 -15949 -15180 -10031 -12621 -4050 5770 2955 -7486 -3842 -2012 3019 -4589
6427d589l221K526j76P89p41l576l863K712J00L193n21j371P05L795L968L838
$$ -4589 -7810 -5284 -5460 -4671 -5412 -8988 -12851 -10139 -10039 -6846 -7367 -8738 -8033 -4238 -270 3568
6411C568l498m661L861J602m49j246k17m115L697J433m72Q74l028p228M321N253
$$ 3568 70 -4591 -730 872 423 -823 -1040 -5155 -1458 -25 -497 377 -2651 -9879 -5558 -305
6395c05L849M243N640p028l568j675K089j495L516k831q105Q89J655N27P80k572
$$ -305 3544 7787 13427 6399 2831 1156 3245 1750 5266 2435 -5670 -4781 -3126 -2599 -1819 -4391
6379d391k160N570j737k855p470P337P146j233m447L649q61J93M264l843m988
$$ -4391 -6551 -981 -2718 -5573 -13043 -5706 1440 207 -4240 -591 -1452 -1259 3005 -838 -5826
6364e826K74J763J790Q42m475M432j668j863L551J944r040m450K943L935N509
$$ -5826 -5552 -3789 -1999 -1157 -5632 -1200 -2868 -4731 -1180 764 -8276 -12726 -9783 -5848 -339
6349c39q899j0513m658j350n53K372j889L027N395K160k99r76N425L259j492R63
$$ -339 -9238 -19751 -24409 -25759 -26312 -23940 -25829 -22802 -17407 -15247 -15546 -16522 -11097 -7838 -9330 -8367
6333h367M866J392J717J227K214m556k601M162K419n277l278N382K514Q65M366
$$ -8367 -3501 -2109 -392 835 3049 -1507 -4108 54 2473 -2804 -6082 -700 1814 2679 7045
6318G045j126p714j864R45J360n25n848p927l663M989O672lL753Q408P129J50
$$ 7045 5919 -1795 -3659 -2714 -1354 -1879 -7727 -15654 -19317 -14328 -7656 -7659 -3906 4502 11631 11781
6302A1781j642m928O483k91m703m954N21l607n106j180N565K04L641P21q170k527
$$ 11781 10139 5211 11694 11403 6700 1746 2267 -1340 -6446 -7626 -2061 -1857 1784 2505 -5665 -8192
6286h192N644R664J786j0k579p884n074p65j955n300K355Q289j19L949P027l600
$$ -8192 -2548 7116 8902 8892 6313 -1571 -6645 -7410 -9365 -14665 -12310 -4021 -4140 -191 6836 3236
6270C236k897m817j661P3K709l010R46M551K09l507m941j560k890l243j742J0509
$$ 3236 339 -4478 -6139 -6066 -3357 -6367 -5421 -870 -661 -4168 -9109 -10669 -13559 -16802 -18544 -8035
6254h035P936M782m636o19K665M822M988Q24o560m855k685k038j425k184O95j650
$$ -8035 -99 4683 47 -572 2093 6915 11903 12727 6167 1312 -1373 -3411 -4836 -7020 -6325 -7975
6238g975k497K569J081J164k162P687K961n3n001m51R757N048l872l031q213p21
$$ -7975 -10472 -7903 -6822 -5658 -7820 -133 2828 2775 -2226 -2677 7080 12128 8256 5225 -2988 -3709
6222c709M726n274o161J293J545K815O525Q028j388n687r261O00j19K732P278
$$ -3709 1017 -4257 -10418 -9125 -7580 -4765 1760 9788 8400 2713 -6548 -5948 -6067 -3335 3943
6207C943l109k805m299K257M657l223o990P01O78M148L348P05p396j814J1490
$$ 3943 834 -1971 -6270 -4013 644 -2579 -9569 -8868 -8190 -4042 -694 11 -7385 -9199 2291
6192B291j580l185l097J515L372K234j875o735J86J3062K70p054l408K52l742
$$ 2291 711 -2474 -5571 -4056 -684 1550 -325 -7060 -6874 6188 6458 -596 -4004 -3752 -7494
6177g494l404J118R32l370J341M339K895J958l557o062L637N348j629n856J353
$$ -7494 -10898 -9780 -8848 -12218 -10877 -6538 -3643 -1685 -5242 -11304 -7667 -2319 -3948 -9804 -8451
6162h451j025k151o443J655L714O808L594m994n342K447M980J974p072k76K163
$$ -8451 -9476 -11627 -18070 -16415 -12701 -5893 -2299 -7293 -12635 -10188 -5208 -3234 -10306 -10582 -8419
6147h419K386J861M499J019p881p764n354L294O600Q582Q0L872P363k465O524
$$ -8419 -6033 -4172 327 1346 -6535 -14299 -19653 -16359 -9759 -1177 -1097 2775 10138 7673 14197
6132A4197m294l278j003j912M97j651m151l334O58J557J203R649K001r630p059
$$ 14197 9903 6625 5622 3710 4207 2556 -1595 -4929 -4271 -2714 -1511 8138 10139 509 -6550
6117f550M591M935k271m044p332m050N223K788l20K395L148N460n59O83k476m371
$$ -6550 -1959 2976 705 -3339 -10671 -14721 -9498 -6710 -7030 -4635 -1487 3973 3414 4097 1621 -2750
6101b750q762m492j981N673M397j365P785n010r566O62P271n31N286k556p8O110
$$ -2750 -11512 -16004 -17985 -12312 -7915 -9280 -1495 -6505 -16071 -15409 -8138 -8669 -3383 -5939 -6017 93
6085I3j443j154K925M094M567j495r901p089L708J49j969K588J654n241k961R078
$$ 93 -1350 -2504 421 4515 9082 7587 -2314 -9403 -5695 -5546 -7515 -4927 -3273 -8514 -11475 -2397
6069b397N053k565L138n372J897O889n890k072j261O159q34n706l19K683K442
$$ -2397 2656 91 3229 -2143 -246 6643 753 -1319 -2580 3579 2745 -2961 -3280 -597 1845
6054A845l536K175O981j133k986k375j945l04j235l253j689N535J284j925n69
$$ 1845 -1691 484 7465 6332 3346 971 -974 -1278 -2513 -5766 -7455 -1920 -636 -2561 -3130
6039c130O165j139p07l890o262n900O539M676P624J242j007o388r312m407R89
$$ -3130 3035 1896 1189 -2701 -8963 -14863 -8324 -3648 3976 5218 4211 -2177 -11489 -15896 -14907
6024a4907J0696K062n108j886J698K834P495L065J246j311k737J190J501l236
$$ -14907 -4211 -2149 -7257 -9143 -7445 -4611 2884 5949 7195 5884 3147 4337 5838 2602
6010B602j0729l075O38m052k159P115K537J974q74r52P992j224l826l567K601
$$ 2602 -8127 -11202 -10564 -14616 -16775 -9660 -7123 -5149 -6023 -6975 1017 -207 -4033 -7600 -4999
5995d999K28J54O851L523k09k366j1031l391R283J463n237j077M317j376j461
$$ -4999 -4771 -4617 2234 5757 5548 3182 -7849 -11240 -1957 -494 -5731 -6808 -2491 -3867 -5328
5980e328M618j108k094k182L091o73J111m266l725K379M870M89k907l62j179J119
$$ -5328 -710 -1818 -3912 -6094 -3003 -3676 -2565 -6831 -10556 -8177 -3307 -2818 -5725 -6087 -7266 -6147
5964f147o216J939p51J94L429J047K092N602R033M660J02k465q482p977k364j488
$$ -6147 -12363 -10424 -11175 -10981 -7552 -6505 -4413 1189 10222 14882 14984 12519 4037 -3940 -6304 -7792
5948g792J794M031L715L298n684r59N432p71j0956l119P591L274j183L186J113
$$ -7792 -5998 -1967 1748 5046 -638 -1597 3835 3064 -7892 -11011 -3420 -146 -1329 1857 2970
5933B970r84n734J372P705o691J701n211K427k019p89N195l780m201P294J370
$$ 2970 1986 -3748 -2376 5329 -1362 339 -4872 -2445 -4464 -5253 -58 -3838 -8039 -745 625
5918F25m456N331J505p368J47J845q143N551J1099M584k666m793l02k905P360
$$ 625 -3831 1500 3005 -4363 -4216 -2371 -10514 -4963 6136 10720 8054 3261 2959 54 7414
5903G414n234l608M104j318p397k295R49k101M541J094n802O06K230R738P71k170
$$ 7414 2180 -1428 2676 1358 -6039 -8334 -7385 -9486 -4945 -3851 -9653 -9047 -6817 2921 3692 1522
5887A522n377n34K901M357K647j765l491K72k089p432N959O736r13j468m908n768
$$ 1522 -3855 -4389 -1488 2869 5516 3751 260 532 -1557 -8989 -3030 3706 2793 1325 -3583 -9351
5871i351J345P561k81k293o74Q912N02j229j993l434m927L563M531o39K991p950
$$ -9351 -8006 -445 -726 -3019 -3693 5219 5721 4492 2499 -935 -5862 -2299 2232 1593 4584 -3366
5855c366L86O130N406n238n794r51j142k161n481O707J5359K925o8r886j3949
$$ -3366 -2980 3150 8556 3318 -2476 -3427 -4569 -6730 -12211 -5504 9855 12780 12712 2826 -11123
5840a1123l708R07J319K153N707N407J573k895j665J351L145m427N459m841l154
$$ -11123 -14831 -13924 -12605 -10452 -4745 662 2235 -660 -2325 -974 2171 -2256 3203 -1638 -4792
5825d792M95l77o50N124M13l418K446R37l646K24k522K029j432J926n28J302j
$$ -4792 -4297 -4674 -5324 -200 213 -3205 -759 178 -3468 -3244 -5766 -3737 -5169 -3243 -3771 -2469 -2470
5808b470Q32O616o459k180M451M149n637p661K491J743J781R586j407q275m425
$$ -2470 -1638 4978 -1481 -3661 790 4939 -698 -8359 -5868 -4125 -2344 7242 5835 -2440 -6865
5793f865R239K735K159n23q024k502q47m370J424L685J2182O203Q66j82o694j484
$$ -6865 2374 5109 7268 6745 -1279 -3781 -4628 -8998 -7574 -3889 8293 14496 15362 15180 8486 7002
5777G002K218n195l960l05n38r02k225N74Q404Q258K121n544n816l041M57k965
$$ 7002 9220 4025 65 -240 -778 -1680 -3905 -3331 5073 13331 15452 9908 4092 1051 1508 -1457
5761a457l054P268J355J576L633o605l587J75n930k32O478l334J451R352j928
$$ -1457 -4511 2757 4112 5688 9321 2716 -871 -696 -6626 -6858 -380 -3714 -2263 7089 5161
5746E161k592J637J156n487k480J57n059m67J907J498o15k074M726N059L97L156
$$ 5161 2569 4206 5362 -125 -2605 -2448 -7507 -7974 -6067 -4569 -5184 -7258 -2532 2527 2924 6080
5730F080l750M16J351m116n736J243j242M005N929j687r375m339N845n60o6p787
$$ 6080 2330 2746 4097 -19 -5755 -4512 -5754 -1749 4180 2493 -6882 -11221 -5376 -5936 -6002 -13789
5714a3789j564Q243j380k934Q213P647l754o465K028J047m631L633P526o368n451
$$ -13789 -15353 -7110 -8490 -11424 -3211 4436 682 -5783 -3755 -2708 -7339 -3706 3820 -2548 -7999
5699g999l418m978M860r77L130R915m044j2838K505J1174K627j149L801K618p328
$$ -7999 -11417 -16395 -11535 -12512 -9382 533 -3511 -16349 -13844 -2670 -43 -1192 2609 5227 -2101
5684b101q45P16k206m560L00J211j586N146M235N91j759l554j833L723K224L431
$$ -2101 -2946 -2230 -4436 -8996 -8696 -7485 -9071 -3925 310 901 -858 -4412 -6245 -2522 -298 3133
5668C133k507l008n736k460l5K517L386M192n079l251n4R878M746K033j41r8o94
$$ 3133 626 -2382 -8118 -10578 -10613 -8096 -4710 -518 -5597 -8848 -8902 976 5722 7755 7614 7516 6822
5651F822n558j0357J087K846K590k280q02P97Q851j7l390l309k907k958o046j203
$$ 6822 1264 -9093 -8006 -5160 -2570 -4850 -5652 -4855 3996 3979 589 -2720 -5627 -8585 -14631 -15834
5635a5834M826P006K659k074L161k891n93K415j257L823O772O271j729j191m169
$$ -15834 -11008 -4002 -1343 -3417 -256 -3147 -3740 -1325 -2582 1241 8013 14284 12555 11364 7195
5620G195l712J314O355J103k511L411K567J298k656m288j1235l408j505o496M10
$$ 7195 3483 4797 11152 12255 9744 13155 15722 17020 14364 10076 -1159 -4567 -6072 -12568 -12158
5605a2158J779J979R1l93l484o829R3L545K401R16K494P866N023r12o157o374
$$ -12158 -10379 -8400 -8309 -8702 -12186 -19015 -18922 -15377 -12976 -12060 -9566 -1700 3323 2411 -3746 -10120
5589a0120l858k95Q518J951J599J265l533p51Q354o039N66L223L397o506l980
$$ -10120 -13978 -14273 -5755 -3804 -2205 -940 -4473 -5224 3130 -2909 -2343 880 4277 -2229 -6209
5574f209N164j787p752k502P009N364q03k863j747M226r3r18l619O392O82K687
$$ -6209 -1045 -2832 -10584 -13086 -6077 -713 -1516 -4379 -6126 -1900 -1993 -2911 -6530 -138 544 3231
5558C231M391l833p62O13J224j419l830k139K600M237q101m372J918m616o675
$$ 3231 7622 3789 3027 3640 4864 3445 -385 -2524 76 4313 -3788 -8160 -6242 -10858 -17533
5543a7533N590M455N556J115m47n471M98K168j103k980j646L253M011J676m752
$$ -17533 -11943 -7488 -1932 -817 -1264 -6735 -6237 -4069 -5172 -8152 -9798 -6545 -2534 -858 -5610
5528e610N702M9L74m398K633k906L923K973m94j577k270m194J489N582L067m457
$$ -5610 92 141 515 -3883 -1250 -4156 -233 2740 2246 669 -1601 -5795 -4306 1276 4343 -114
5512a14k152N716R724j652p229l134L019K27m831JL96O224k941n643K960J002
$$ -114 -2266 3450 13174 11522 4293 1159 4178 4405 -426 -425 -29 6195 3254 -2389 571 1573
5496A573J10K641J230O57p203q58o371n229O432N959k463m72M807K344m302M081
$$ 1573 1683 4324 5554 6211 -992 -1850 -8221 -13450 -7018 -1059 -3522 -3994 813 3157 -1145 2936
5480B936L004K465p402k66O991j416l591n865p86l699l705k284M406J466l057
$$ 2936 5940 8405 1003 737 7728 6312 2721 -3144 -3930 -7629 -11334 -13618 -9212 -7746 -10803
5465a0803m044J049L561n120O031L98j86M59L623K298P39m346N374Q031L439m854
$$ -10803 -14847 -13798 -10237 -15357 -9326 -8928 -9114 -8655 -5032 -2734 -1995 -6341 -967 7064 10503 5649
5449E649o223L11K529L933J165p090o714o687K303J2469O390l124m849M75L83
$$ 5649 -574 -263 2266 6199 7364 274 -6440 -13127 -10824 1645 8035 4911 62 537 920
5434I20l56N322K700M278K544r788j2586j210J1473j379k700j479R800L620Q338
$$ 920 564 5886 8586 12864 15408 5620 -6966 -8176 3297 1918 -782 -2261 7539 11159 19497
5419A9497J807q076K199j4019j2099k8N733m574k114K994j320L481J535j017r536
$$ 19497 21304 13228 15427 1408 -10691 -10719 -4986 -9560 -11674 -8680 -10000 -6519 -4984 -6001 -15537
5404a5537k86J4510N992m232q56p566J31J2376L671l971q044q7j459J853M61k377
$$ -15537 -15823 -1313 4679 447 -409 -7975 -7844 4532 8203 4232 -3812 -3899 -5358 -3505 -3044 -5421
5388e421N685j965Q172K39j221l579l461l756l297R319R25o358q91m871O225j356
$$ -5421 264 -1701 6471 6710 5489 1910 -1551 -5307 -8604 715 1640 -4718 -5609 -10480 -4255 -5611
5372e611J518J604L359J921Q70n000k31P51l232l639n78P525L585O64J754l459
$$ -5611 -4093 -2489 870 2791 3661 -1339 -1570 -819 -4051 -7690 -8268 -743 2842 3506 5260 1801
5356A801O675N91m864j406K339l095k289K024J545J875l764l696k073n054L17
$$ 1801 8476 9067 4203 2797 5136 2041 -248 1776 3321 5196 1432 -2264 -4337 -9391 -9074
5341i074K664J173k664k587K207j376L594N384J559m77m667j116M686k597n747
$$ -9074 -6410 -5237 -7901 -10488 -8281 -9657 -6063 -679 880 403 -4264 -5380 -694 -3291 -9038
5326i038l291M294J885J787L293j40j96K773j389p114M186M254K61l675J627k312
$$ -9038 -12329 -8035 -6150 -4363 -1070 -1210 -1406 1367 -22 -7136 -2950 1304 1565 -2110 -483 -2795
5310b795m284P36j477R74Q10j691j106L991K214Km163m229O370J347p00j415J35
$$ -2795 -7079 -6343 -7820 -6846 -6036 -7727 -8833 -4842 -2628 -2626 -6789 -11018 -4648 -3301 -4001 -5416 -5281
5293e281K344K241K183N691J38l208K53l956q041K477O240M59M74l559j468j528
$$ -5281 -2937 -696 1487 7178 7316 4108 4361 405 -7636 -5159 1081 1540 2014 -1545 -3013 -4541
5277d541n395n092K824J783K053L619J547l959m178M245L409M342N206j94L44
$$ -4541 -9936 -15028 -12204 -10421 -8368 -4749 -3202 -7161 -11339 -7094 -3685 657 5863 5669 6013
5262F013k817k407k116M932J281n531p747n031Q68n2j374M81P047n567P69M852
$$ 6013 3196 789 -1327 3605 4886 -645 -8392 -13423 -12555 -12607 -13981 -13500 -6453 -12020 -11251 -6399
5246f399l58l220N124N859P184M178k330p318m719R00l36N151n193k862j957K956
$$ -6399 -6757 -9977 -4853 1006 8190 12368 10038 2720 -1999 -1099 -1435 3716 -1477 -4339 -6296 -3340
5230c340O454J699j854N072l081j285L150m661n103j136p790O013P380J116K276
$$ -3340 3114 4813 2959 8031 4950 3665 6815 2154 -2949 -4085 -11875 -5862 1518 2634 4910
5215D910J61k140K145q0m738q645k277L456O377j664n2l44j008K227k356O767
$$ 4910 5071 2931 5076 4996 258 -8387 -10664 -7208 -831 -2495 -2547 -2891 -3899 -1672 -4028 2739
5199B739J353L865n23j419o111m297J641O383N10Q68p444m935M261R640L187o070
$$ 2739 4092 7957 7434 6015 -96 -4393 -2752 3631 4141 5009 -2435 -7370 -3109 6531 9718 3648
5183C648l42K33j024O522L673m040m547K912n578p016K689L776m406k870J0644
$$ 3648 3306 3539 2515 9037 12710 8670 4123 7035 1457 -5559 -2870 906 -3500 -6370 4274
5168D274L768m538R9j679p896n601M702R755j465N182k576K840j390Q02j831p564
$$ 4274 8042 3504 3603 1924 -5972 -11573 -6871 2884 1419 6601 4025 6865 5475 6277 4446 -3118
5152c118l064J110m618l010P059K916n99O753l008J955l347n910L019m380k885
$$ -3118 -6182 -5072 -9690 -12700 -5641 -2725 -3324 3429 421 2376 -971 -6881 -3862 -8242 -11127
5137a1127J583Q080L015m555K322k616m70J798k055p08P404N875J608m04m88R4
$$ -11127 -9544 -1464 1551 -3004 -682 -3298 -3768 -1970 -4025 -4733 2671 8546 10154 9750 9262 9356
5121I356j376k294k966l67k914M438K067m149J955k14n693n922k54N243l52l9
$$ 9356 7980 5686 2720 2353 -561 3877 5944 1795 3750 3536 -2157 -8079 -8333 -3090 -3442 -3481
5105c481j895J388o88m401K942k637K380P710K913n183J790O140K474l743n761
$$ -3481 -5376 -3988 -4676 -9077 -6135 -8772 -6392 1318 4231 -952 838 6978 9452 5709 -52
5090e2j510M969M613l002k349r36k47J316P42k328o153p066J041Q794J89p97J906
$$ -52 -1562 3407 8020 5018 2669 1733 1486 2802 3544 1216 -4937 -12003 -10962 -2168 -1979 -2776 -870
5073h70J963j136n745l433J314L685J165p12J126k044j611J796p924K14L530M344
$$ -870 1093 -43 -5788 -9221 -7907 -4222 -3057 -3769 -2643 -4687 -6298 -4502 -12426 -12212 -8682 -4338
5057d338M710r77n152m984J596l94j796m55K711L453M988K590M123k895m739k306
$$ -4338 372 -605 -5757 -10741 -9145 -9539 -11335 -11790 -9079 -5626 -638 1952 6075 3180 -1559 -3865
5041c865l636O621K177n48m543O331P080L918l424o45n97o388m442R88J094J427
$$ -3865 -7501 -880 1297 749 -3794 2537 9617 13535 10111 9466 8869 2481 -1961 -973 121 1548
5025A548K603m166K505Q90k036n942N944N228m931m804K734O572l694k218l163
$$ 1548 4151 -15 2490 3380 1344 -4598 1346 6574 1643 -3161 -427 6145 2451 233 -2930
5010b930l293j292n544K579k54J887M804k669j391Q358P621J59j423j522m212
$$ -2930 -6223 -7515 -13059 -10480 -10734 -8847 -4043 -6712 -8103 255 7876 8035 6612 5090 878
4995H78n625k538q50M620O227O166l366q856L3M594l292m453j728j630j073N072
$$ 878 -4747 -7285 -8135 -3515 2712 8878 5512 -3344 -3311 1283 -2009 -6462 -8190 -9820 -10893 -5821
4979e821J0637o890l409K367J972l828K17P159R43m811N69O50m083J142K057j021
$$ -5821 4816 -2074 -5483 -3116 -1144 -4972 -4755 2404 3347 -1464 -895 -245 -4328 -3186 -1129 -2150
4963b150O056m552o748l906l14j307m09L809L066L773L399M195j841k916m809
$$ -2150 3906 -646 -7394 -11300 -11614 -12921 -13330 -9521 -6455 -2682 717 4912 3071 155 -4654
4948d654J716J246l068p337P40N433Q427K239j066r26J301l83O589R175n026j6350
$$ -4654 -2938 -1692 -4760 -12097 -11357 -5924 2503 4742 3676 2750 4051 3668 10257 19432 14406 -1944
4932a944n042M635M241R34K14o416j387N667L371J714m519N49M255K343n539k846
$$ -1944 -6986 -2351 1890 2824 3038 -3378 -4765 902 4273 5987 1468 2017 6272 8615 3076 230
4916B30m326k719M248K967k943L501l945l800j985O757P742O676j763j4380o934
$$ 230 -4096 -6815 -2567 400 -2543 958 -2987 -6787 -8772 -2015 5727 12403 10640 -3740 -10674
4901a0674M170N009M124n99o368k17L024q470M912L755N053l003o086J536N446
$$ -10674 -6504 -1495 2629 2030 -4338 -4555 -1531 -10001 -5089 -1334 3719 716 -5370 -3834 1612
4886A612L083m526m630p249K333K678K464m193O339l117q221P420J342j635o229
$$ 1612 4695 169 -4461 -11710 -9377 -6699 -4235 -8428 -2089 -5206 -13427 -6007 -4665 -6300 -12529
4871a2529Q0L867L120K534M501N049l41q658l172K218L692j292k039N184Q24J935
$$ -12529 -12449 -8582 -5462 -2928 1573 6622 6281 -2377 -5549 -3331 361 -931 -2970 2214 3038 4973
4855D973q68m61l550m061M703p79p58n039R24J695J290K856j044n848m790r72
$$ 4973 4105 3644 94 -3967 736 -43 -801 -5840 -4916 -3221 -1931 925 -119 -5967 -10757 -11729
4839a1729R156O71q13L781n944O37m913o192N228Q091M098M653J0061n036m725
$$ -11729 -2573 -1902 -2715 1066 -4878 -4241 -9154 -15346 -10118 -2027 2071 6724 16785 11749 7024
4824G024k096l79n539l340J449K55P915q133q845P184J664m987l460J812k331
$$ 7024 4928 4549 -990 -4330 -2881 -2626 5289 -2844 -11689 -4505 -2841 -7828 -11288 -9476 -11807
4809a1807l05R57J663k328j454L401N68K564K047K990O090K58J682m393k478P336
$$ -11807 -12112 -11155 -9492 -11820 -13274 -9873 -9305 -6741 -4694 -1704 4386 4644 6326 1933 -545 6791
4793F791o319o176K1K663l613n96q23p5M027R116n378o203L891L714k883L655
$$ 6791 472 -5704 -5683 -3020 -6633 -7229 -8052 -8127 -4100 5016 -362 -6565 -2674 1040 -1843 1812
4777A812N03k842N591k087k745j935k67m627O117M699J263L687n152j245N87J278
$$ 1812 2315 -527 5064 2977 232 -1703 -1970 -6597 -480 4219 5482 9169 4017 2772 3359 4637
4761D637j743K953J37L683K286m762k784k277n0M491P52o624K90m379j353m71
$$ 4637 2894 5847 5984 9667 11953 7191 4407 2130 2080 6571 7323 699 989 -3390 -4743 -5214
4745e214n521l189L618m938k978L440J813O484M439J912p50n280j810j342Q35
$$ -5214 -10735 -13924 -10306 -15244 -18222 -14782 -12969 -6485 -2046 -134 -884 -6164 -7974 -9316 -8481
4730h481n8Q91Q379M438o570q366K217m81K212m25J77Q5J536J0283M590m175j2146
$$ -8481 -8539 -7648 731 5169 -1401 -9767 -7550 -8031 -5819 -6244 -6067 -5982 -4446 5837 10427 6252 -5894
4713e894N32L476L213J460j391M41p188k652N431k189M866L156l311K168p71m68
$$ -5894 -5362 -1886 1327 2787 1396 1837 -5351 -8003 -2572 -4761 105 3261 -50 2118 1347 879
4697H79o43J787r92n831j951K103K814M284K958j416p61m687N80P622M73q372
$$ 879 236 2023 1031 -4800 -6751 -4648 -1834 2450 5408 3992 3231 -1456 -876 6746 7219 -1153
4681a153p118K880N426o98N733j160p428J246K17K114n332K430L363K896j604
$$ -1153 -8271 -5391 35 -663 5070 3910 -3518 -2272 -2055 59 -5273 -2843 520 3416 1812
4666A812n000J265j067r783k15J1726N692o91q684n752N203N687r666J31O026
$$ 1812 -3188 -1923 -2990 -12773 -12988 -1262 4430 3739 -4945 -10697 -5494 193 -9473 -9342 -3316
4651c316o50N437K190P82n64o151m287n048m696m937K868Q704L784O213J8k814
$$ -3316 -3966 1471 3661 4443 3879 -2272 -6559 -11607 -16303 -21240 -18372 -9668 -5884 329 347 -2467
4635b467k420J328O661j812l586l518j453k189M008O510K557O198j277n266O615
$$ -2467 -4887 -3559 3102 1290 -2296 -5814 -7267 -9456 -5448 1062 3619 9817 8540 3274 9889
4620I889l293r623j806P154J311p522j86M871L798k354p68K135l496l478M419
$$ 9889 6596 -3027 -4833 2321 3632 -3890 -4076 795 4593 2239 1471 3606 110 -3368 1051
4605A051q56j1k740j48r565j575L863J3651L636m460m607J156J789P734L820o245
$$ 1051 195 184 -2556 -2704 -12269 -13844 -9981 3670 7306 2846 -1761 -605 1184 8918 12738 6493
4589F493q624n744L087J1311K886q341K356l372p741M645M983j358l04k762p47
$$ 6493 -2131 -7875 -4788 6523 9409 1068 3424 52 -7689 -3044 1939 581 277 -2485 -3232
4574c232j130M367L291L723k267o583j128M895N496l710m40M809k562n681o91
$$ -3232 -4362 5 3296 7019 4752 -1831 -2959 1936 7432 3722 3282 8091 5529 -152 -843
4559h43Q46K76k57O120M225l477l391l161o725j548N822K258L512n228L799R178
$$ -843 3 279 22 6142 10367 6890 3499 338 -6387 -7935 -2113 145 3657 -1571 2228 11406
4543A1406l896o567r339o186q12j1R085K859p896m693J2740K411L547L362m54
$$ 11406 7510 943 -8396 -14582 -15394 -15405 -6320 -3461 -11357 -16050 -3310 -899 2648 6010 5556
4528E556m482O308Q028M31n164r246l171J524L564k449L95q457p257N508Q433
$$ 5556 1074 7382 15410 15841 10677 1431 -1740 -216 3348 899 1294 -7163 -14420 -8912 -479
4513d79L077M26o351k72L124r84O83m768l24J169Q782N760n432l146m433k623
$$ -479 2598 3024 -3327 -3599 -475 -1459 -776 -5544 -5868 -4699 4083 9843 4411 1265 -3168 -5791
4497e791r84j721k92Q88m79r28P998n854k282P773K523m81l118o527N494P244
$$ -5791 -6775 -8496 -8788 -7900 -8379 -9307 -1309 -7163 -9445 -1672 851 370 -2748 -9275 -3781 3463
4481C463P091K139q674o607M166L254m218J857M699K411j87M58P529j488o517
$$ 3463 10554 12693 4019 -2588 1578 4832 614 2471 7170 9581 9394 9852 17381 15893 9376
4466I376L7q961j5764Q04Q058N333K608k17l574J748m724K335j82r26J332m281
$$ 9376 9413 452 -15312 -14508 -6450 -1117 1491 1274 -2300 -552 -5276 -2941 -3123 -4049 -2717 -6998
4450f998j536Q521J1429K233j642o052l650K380N02K358N204R06K697k730k801
$$ -6998 -8534 -13 11416 13649 12007 5955 2305 4685 5187 7545 12749 13655 16352 13622 10821
4435A0821l102o401J240P285m664n424j716m895J483N310j368N3M382L419L27
$$ 10821 7719 1318 2558 9843 5179 -245 -1961 -6856 -5373 -63 -1431 -1378 3004 6423 6750
4420F750k766p0n929n844J625N851L39J501J1982n688q133j915q93m339J285l55
$$ 6750 3984 3914 -2015 -7859 -6234 -383 -44 1457 13439 7751 -382 -2297 -3190 -7529 -6244 -6599
4404f599O656L87o27J680N421P175l74l664j699k405j200l148o958k064K628J242
$$ -6599 57 444 -183 1497 6918 14093 13719 10055 8356 5951 4751 1603 -5355 -7419 -4791 -3549
4388c549K144N308M295L965m856o145p6l749J004J003J544J165J553L869m449
$$ -3549 -1405 3903 8198 12163 7307 1162 1086 -2663 -1659 -656 888 2053 3606 7475 3026
4373C026O308N713r570k743j395j629l805K567k497k448P458N681J021q789p22
$$ 3026 9334 15047 5477 2734 1339 -290 -4095 -1528 -4025 -6473 985 6666 7687 -1102 -1824
4358a824n04J159M427M461L627p786l213m219l053K397M627k544k265K786J886
$$ -1824 -2328 -1169 3258 7719 11346 3560 347 -3872 -6925 -4528 99 -2445 -4710 -1924 -38
4343c8J467j729K826N930j431o322n616m72J077J042M36p43j710Q39L661Q71M337
$$ -38 1429 -300 2526 8456 7025 703 -4913 -5385 -4308 -3266 -2830 -3573 -5283 -4444 -783 88 4425
4326D425n5l021l921j079l1K027j591N85J626o20k864L527n46k503M592o249r59
$$ 4425 4370 1349 -2572 -3651 -3682 -1655 -3246 -2661 -1035 -1655 -4519 -992 -1538 -4041 551 -5698 -6657
4309f657K923K978o37L144N126O24o459r840k312L073M072J105L772O28L297n900
$$ -6657 -3734 -756 -1393 1751 6877 7501 1042 -8798 -11110 -8037 -3965 -2860 912 1540 4837 -1063
4293a063o088l778j28Q94N408j813L718M499K023l663l703J784N650L513L044
$$ -1063 -7151 -10929 -11057 -10163 -4755 -6568 -2850 1649 3672 9 -3694 -1910 3740 7253 10297
4278A0297L784m572r116m136J981K792M015k173k747j069M205K426l957r092j769
$$ 10297 14081 9509 393 -3743 -1762 1030 5045 2872 125 -944 3261 5687 1730 -7362 -9131
4263i131o06N561M49m214P891O870L568l793q77o986n170N078L478r22O474K678
$$ -9131 -9737 -4176 -3727 -7941 -50 6820 10388 6595 5718 -1268 -6438 -1360 2118 1196 7670 10348
4247A0348n033q26l588l775K725j56k720M67J556R59O039L335o054q773j33R73
$$ 10348 5315 4489 901 -2874 -149 -305 -3025 -2558 -1002 -43 5996 9331 3277 -5496 -5629 -4656
4231d656Q90J92l732P9J617N480M277m452j783l507Q02R491K693o322j462q184
$$ -4656 -3766 -3574 -7306 -7227 -5610 -130 4147 -305 -2088 -5595 -4793 4698 7391 1069 -393 -8577
4215h577n262J395j355K872R904J122J731j876j780j150l847P044j022M041q41
$$ -8577 -13839 -12444 -13799 -10927 -1023 99 1830 -46 -1826 -2976 -6823 221 -801 3240 2399
4200B399k747k143J349L85L119j729K299l053o114o505L376N773K357N595J324
$$ 2399 -348 -2491 -1142 -757 2362 633 2932 -121 -6235 -12740 -9364 -3591 -1234 4361 5685
4185E685p519m795j052M910M507K513n367N264K313q983l103O083o01k422m780
$$ 5685 -1834 -6629 -7681 -2771 1736 4249 -1118 4146 6459 -2524 -5627 456 -145 -2567 -7347
4170g347j635Q587K593j727k048m567l622j056N333Q794p04J005k860J629O46
$$ -7347 -8982 -395 2198 471 -1577 -6144 -9766 -10822 -5489 3305 2601 3606 746 2375 3021
4155C021J025k883l397l866L577l37p4L59Q542M343n508k626J433p141n179p465
$$ 3021 4046 1163 -2234 -6100 -2523 -2860 -2934 -2575 5967 10310 4802 2176 3609 -3532 -8711 -16176
4139a6176l117N183O904J973k610O52q16q59R798O604N11l280L89j865J951O945
$$ -16176 -19293 -14110 -7206 -5233 -7843 -7191 -8007 -8866 932 7536 8047 4767 5156 3291 5242 12187
4123A2187j120m790k128k076K49K681j241o757n925m447m80N915L175K025l333
$$ 12187 11067 6277 4149 2073 2322 5003 3762 -2995 -8920 -13367 -13847 -7932 -4757 -2732 -6065
4108f065N954K246q001P51Q889M022L571l663q818n419l970K189J878k220M203
$$ -6065 -111 2135 -5866 -5115 3774 7796 11367 7704 -1114 -6533 -10503 -8314 -6436 -8656 -4453
4093d453R374o94N595M338N57o271k081l180J489l530K53N273o132J31n457J279
$$ -4453 4921 4227 9822 14160 14717 8446 6365 3185 4674 1144 1397 6670 538 669 -4788 -3509
4077c509k194M830L199K114K062n962J866m348J145R598N625o86K347j295o424
$$ -3509 -5703 -873 2326 4440 6502 540 2406 -1942 -797 8801 14426 13740 16087 14792 8368
4062H368j186m553M79k238n374P148R374l976l704q47l46j496L261j1251k031
$$ 8368 7182 2629 3108 870 -4504 2644 12018 8042 4338 3491 3145 1649 4910 -6341 -8372
4047h372O162K446M28l407k772l932p56Q325N531J572J810j159k573q20l458j180
$$ -8372 -2210 236 664 -2743 -5515 -9447 -10203 -1878 3653 5225 7035 5876 3303 2483 -975 -2155
4031b155l352p853O153K753J154P45Q284L684J512l651l074n9M571o661o301Q87
$$ -2155 -5507 -13360 -7207 -4454 -3300 -2555 5729 9413 10925 7274 4200 4141 8712 2051 -4250 -3363
4015c363L003m184l450J82J597L846k945J196j247R96k129J702K879j38L522Q272
$$ -3363 -360 -4544 -7994 -7812 -6215 -2369 -5314 -4118 -5365 -4369 -6498 -4796 -1917 -2055 1467 9739
3999I739n161k955l415J45q75l119K393r47r78M376J277r804o771L195O493J558
$$ 9739 4578 1623 -1792 -1647 -2522 -5641 -3248 -4195 -5173 -797 480 -9324 -16095 -12900 -6407 -4849
3983d849l352M096N390O58M128J2048O318p819j2783l627k152n031K452Q106n299
$$ -4849 -8201 -4105 1285 1943 6071 18119 24437 16618 3835 208 -1944 -6975 -4523 3583 -1716
3968a716l34J482J1699l395p111M197l103n285l052k106M202L467K087P59k483
$$ -1716 -2050 -568 11131 7736 625 4822 1719 -3566 -6618 -8724 -4522 -1055 1032 1791 -692
3953f92n74O81P166L690J965p900o796J074N208l691l124p177J863J1784k451
$$ -692 -1266 -585 6581 10271 12236 4336 -2460 -1386 3822 131 -2993 -10170 -8307 3477 1026
3938A026m196P13m393k895k551j542M341M329L449J235k605l953O526j708K175
$$ 1026 -3170 -2457 -6850 -9745 -12296 -13838 -9497 -5168 -1719 -484 -3089 -7042 -516 -2224 -49
3923d9K357K922J197p086o529N050N179J810n594R91O497l403K079J500k131m974
$$ -49 2308 5230 6427 -659 -7188 -2138 3041 4851 -743 248 6745 3342 5421 6921 4790 -184
3907a84o85M081J061O097J237o231l916j047o594j943M210O126p81O81O744p23
$$ -184 -869 3212 4273 10370 11607 5376 1460 413 -6181 -8124 -3914 2212 1431 2112 8856 8133
3891H133j0968m931L021O334M93p388j203O026M149J048o311J44N817O700P29
$$ 8133 -2835 -7766 -4745 1589 2082 -5306 -6509 -483 3666 4714 -1597 -1453 4364 11064 11793
3876A1793k389k885o982l270L647n085k853J334l545q24K520N200Q480R791K139
$$ 11793 9404 6519 -463 -3733 -86 -5171 -8024 -6690 -10235 -11059 -8539 -3339 5141 14932 17071
3861A7071N795m104o060p525n44j56k526l175m418R00L053J081N308L598o659
$$ 17071 22866 18762 12702 5177 4633 4477 1951 -1224 -5642 -4742 -1689 -608 4700 8298 1639
3846A639n442p914N09J725J334L562O952M49m010K883k276k361m4P49K762l299
$$ 1639 -3803 -11717 -11208 -9483 -8149 -4587 2365 2814 -1196 1687 -589 -2950 -2994 -2245 517 -2782
3830b782J491M470K435o49K220l267o992j109Q613k854j1056k284R080M835k66
$$ -2782 -1291 3179 5614 4965 7185 3918 -3074 -4183 4430 1576 -9480 -11764 -2684 2151 1885
3815A885r53O445K451j241l942o706J261j967J412l176n02k337M21Q473j598n255
$$ 1885 932 7377 9828 8587 4645 -2061 -800 -2767 -1355 -4531 -5033 -7370 -6949 1524 -74 -5329
3799e329n980j474n183L382O406J008O123L225L943R949k951m581m442K86n879
$$ -5329 -11309 -12783 -17966 -14584 -8178 -7170 -1047 2178 6121 16070 13119 8538 4096 4382 -1497
3784a497J190N491K50k515J32r74m05K95K712K942K995j1201n517J0437K817K341
$$ -1497 -307 5184 5434 2919 3051 2077 1672 1967 4679 7621 10616 -585 -6102 4335 7152 9493
3768I493K908k749k333j122o766l220J589P020k585J957n93j025n951m776N813
$$ 9493 12401 9652 7319 6197 -569 -3789 -2200 4820 2235 4192 3599 2574 -3377 -8153 -2340
3753b340L116L17M003J448n489l461N176m392k451k101k717N765R49p829O91O31
$$ -2340 776 1093 5096 6544 1055 -2406 2770 -1622 -4073 -6174 -8891 -3126 -2177 -10006 -9315 -8684
3737h684j582q26O301o19L012K176p329j599P511L638m478m533m246j160J286
$$ -8684 -10266 -11092 -4791 -5410 -2398 -222 -7551 -9150 -1639 1999 -2479 -7012 -11258 -12418 -11132
3722a1132m154n07N491J372N450M253l21j014n560L215K611m440M756N239n820
$$ -11132 -15286 -15793 -10302 -8930 -3480 773 452 -562 -6122 -2907 -296 -4736 20 5259 -561
3707e61k900M71O053L19q783K851L538K088M085L045k748K237j513K048K996p264
$$ -561 -3461 -2990 3063 3382 -5401 -2550 988 3076 7161 10206 7458 9695 8182 10230 13226 5962
3691E962J801j969N738J009l932o180n75N344M399o249q44K124n074k111l332
$$ 5962 7763 5794 11532 12541 8609 2429 1854 7198 11597 5348 4504 6628 1554 -557 -3889
3676c889J59K3l141K362j302m00N807N493M937n681p747L440K451n845M948K238
$$ -3889 -3730 -3707 -6848 -4486 -5788 -6188 -381 5112 10049 4368 -3379 61 2512 -3333 1615 3853
3660C853n106j2R61k978j167j460p45m04M433K153k130n519K834K21L181M90p54
$$ 3853 -1253 -1265 -304 -3282 -4449 -5909 -6654 -7058 -2625 -472 -2602 -8121 -5287 -5066 -1885 -1395 -2149
3643b149l403M24l83M170J145n034P95L455O641L185J753j009q607l074R459M390
$$ -2149 -5552 -5128 -5511 -1341 -196 -5230 -4435 -980 5661 8846 10599 9590 983 -2091 7368 11758
3627A1758K514m725p564L7l976j640J599N650J582n837l206o853O128O508m652
$$ 11758 14272 9547 1983 2020 -1956 -3596 -1997 3653 5235 -602 -3808 -10661 -4533 1975 -2677
3612b677j044K160O559N351m341k137r30L28k354p125J295J536l116K892J063
$$ -2677 -3721 -1561 4998 10349 6008 3871 2941 3269 915 -6210 -4915 -3379 -6495 -3603 -2540
3597b540J264l094k118K748O708m392k605K404j359n58Q61L073Q28K315N26j100
$$ -2540 -1276 -4370 -6488 -3740 2968 -1424 -4029 -1625 -2984 -3542 -2681 392 1220 3535 4061 2961
3581B961k183M929K159K919q22q84K688J366j023j565m213K919L564o5q72p449
$$ 2961 778 5707 7866 10785 9963 9079 11767 13133 12110 10545 6332 9251 12815 12750 11878 4429
3565D429j0979m48j35j339J238O943K069J52N670O006m974o804n061p10M095k446
$$ 4429 -6550 -6998 -7133 -8472 -7234 -291 1778 1930 7600 13606 8632 1828 -3233 -3943 152 -2294
$$ [...]
##END NTUPLES=NMR SPECTRUM
##END=
