##TITLE=Analysis number 327368
Compound Code cd 10514
Book Reference 470/178
Project Code adrs 
Chemist Name mikem
##JCAMPDX= 6.0         $$ Bruker NMR JCAMP-DX V2.0
##DATA TYPE= NMR SPECTRUM
##DATA CLASS= NTUPLES
##ORIGIN= Bruker BioSpin GmbH
##OWNER= nmr
$$ XWIN-NMR		Version 3.5
$$ Thu Mar 22 13:49:00 2007 GMT Standard Time (UT+0h)  MAYBRIDGE\nmr@NMR_250MHZ
##.OBSERVE FREQUENCY= 250.131544655141
##.OBSERVE NUCLEUS= ^1H
##.ACQUISITION MODE= SIMULTANEOUS (DQD)
##.ACQUISITION SCHEME= undefined
##.AVERAGES= 16
##.DIGITISER RES= 18
##SPECTROMETER/DATA SYSTEM= dpx250
##.PULSE SEQUENCE= zg30
##.SOLVENT NAME= CDCl3
##.SHIFT REFERENCE= (INTERNAL, CDCl3, 0, 16.522)
##AUDIT TRAIL= $$ (NUMBER, WHEN, WHO, WHERE, WHAT)
$$ ##TITLE= Audit trail, XWIN-NMR		Version 3.5
$$ ##JCAMPDX= 5.01
$$ ##ORIGIN= Bruker BioSpin GmbH
$$ ##OWNER= nmr
$$ C:\u/data/dgb/nmr/ADRS/1760/pdata/1/auditp.txt
$$ ##AUDIT TRAIL=  $$ (NUMBER, WHEN, WHO, WHERE, WHAT)
(   1,<2007-03-22 13:48:34.75 +000>,<MAYBRIDGE\nmr>,<NMR_250MHZ>,
      <created by zg, POWCHK disabled, PULCHK disabled
       configuration hash MD5:
       49 4B E0 1D 92 C2 6B 37 9F E6 65 BC 52 41 86 1D
       data hash MD5: 64K
       6C 2F 7D ED 19 C7 4F ED A6 A0 DE 50 85 0B 5D 41>)
(   2,<2007-03-22 13:48:49.99 +000>,<MAYBRIDGE\nmr>,<NMR_250MHZ>,
      <Start of raw data processing
       ef LB = 0.3 FT_mod = 6 PKNL = 1 SI = 32K 
       data hash MD5: 32K
       AB 92 48 EB 7E 19 4E 10 CB 84 5E B8 81 18 97 0C>)
(   3,<2007-03-22 13:48:51.57 +000>,<MAYBRIDGE\nmr>,<NMR_250MHZ>,
      <apk 
       data hash MD5: 32K
       15 51 5D AA F3 E0 20 4B 96 E6 0E 80 C9 92 02 5B>)
(   4,<2007-03-22 13:48:52.25 +000>,<MAYBRIDGE\nmr>,<NMR_250MHZ>,
      <abs ABSG = 5 
       data hash MD5: 32K
       F2 3D 28 78 9E 65 12 7E BA 05 F9 6C BB 08 24 87>)
$$ ##END=
$$ 
$$ hash MD5
$$ 81 E4 6C 6B 68 E8 79 AB A3 79 47 AA BD EA F1 31
##$RELAX= 
##$RELAX= 
##$RELAX= 
##$RELAX= 
##$RELAX= 
##$RELAX= 
##$RELAX= 
$$ Bruker specific parameters
$$ --------------------------
##$DU= <C:\u>
##$EXPNO= 1760
##$NAME= <ADRS>
##$PROCNO= 1
##$TYPE= <nmr>
##$USER= <dgb>
##$AMP= (0..31)
100 100 100 100 100 100 100 100 100 100 100 100 100 100 100 100 100 100 
100 100 100 100 100 100 100 100 100 100 100 100 100 100 
##$AQSEQ= 0
##$AQ_mod= 3
##$AUNM= <au_zg>
##$AUTOPOS= <35 >
##$BF1= 250.13
##$BF2= 250.13
##$BF3= 250.13
##$BF4= 250.13
##$BF5= 500.13
##$BF6= 500.13
##$BF7= 500.13
##$BF8= 500.13
##$BYTORDA= 1
##$CFDGTYP= 0
##$CFRGTYP= 5
##$CHEMSTR= <none>
##$CNST= (0..31)
1 1 145 1 1 1 1 1 1 1 1 1 1 1 1 1 1 1 1 1 1 1 1 1 1 1 1 1 1 1 1 1 
##$CPDPRG= <>
##$CPDPRG1= <>
##$CPDPRG2= <>
##$CPDPRG3= <>
##$CPDPRG4= <mlev>
##$CPDPRG5= <mlev>
##$CPDPRG6= <mlev>
##$CPDPRG7= <mlev>
##$CPDPRG8= <mlev>
##$CPDPRGB= <>
##$CPDPRGT= <>
##$D= (0..31)
0 1 0 0 0 0 0 0 0 0.06 0 0 0 0 0 0 0.0002 0 0 0 0 0 0 0 0 0 0 0 0 0 0 
0 
##$DATE= 1174571313
##$DBL= (0..7)
120 120 120 120 120 120 120 120 
##$DBP= (0..7)
150 150 150 150 150 150 150 150 
##$DBP07= 0
##$DBPNAM0= <>
##$DBPNAM1= <>
$$ [...]
##$SUBNAM7= <"">
##$SUBNAM8= <"">
##$SUBNAM9= <"">
##$SW= 20.6930455092707
##$SWIBOX= (0..15)
0 0 3 0 0 0 0 0 0 0 0 0 0 0 0 0 
##$SW_h= 5175.983436853
##$TD= 65536
##$TD0= 1
##$TE= 683.16
##$TE2= 300
##$TE3= 300
##$TEG= 300
##$TL= (0..7)
0 120 120 120 120 120 120 120 
##$TP= (0..7)
150 150 150 150 150 150 150 150 
##$TP07= 0
##$TPNAME0= <>
##$TPNAME1= <>
##$TPNAME2= <>
##$TPNAME3= <>
##$TPNAME4= <>
##$TPNAME5= <>
##$TPNAME6= <>
##$TPNAME7= <>
##$TPOAL= (0..7)
0.5 0.5 0.5 0.5 0.5 0.5 0.5 0.5 
##$TPOFFS= (0..7)
0 0 0 0 0 0 0 0 
##$TUNHIN= 0
##$TUNHOUT= 0
##$TUNXOUT= 0
##$USERA1= <user>
##$USERA2= <user>
##$USERA3= <user>
##$USERA4= <user>
##$USERA5= <user>
##$V9= 5
##$VALIST= <valist>
##$VCLIST= <CCCCCCCCCCCCCCC>
##$VD= 0
##$VDLIST= <DDDDDDDDDDDDDDD>
##$VPLIST= <PPPPPPPPPPPPPPP>
##$VTLIST= <TTTTTTTTTTTTTTT>
##$WBST= 1024
##$WBSW= 4
##$XGAIN= (0..3)
0 0 0 0 
##$XL= 0
##$YL= 0
##$YMAX_a= 387401
##$YMIN_a= -416597
##$ZGOPTNS= <>
##$ZL1= 120
##$ZL2= 120
##$ZL3= 120
##$ZL4= 120
##$ABSF1= 16.522
##$ABSF2= -4.171173
##$ABSG= 5
##$ABSL= 3
##$ALPHA= 0
##$AQORDER= 0
##$ASSFAC= 0
##$ASSFACI= 0
##$ASSFACX= 0
##$ASSWID= 0
##$AUNMP= <proc_1d>
##$AZFE= 0.1
##$AZFW= 0.1
##$BCFW= 0
##$BC_mod= 0
##$BYTORDP= 0
##$COROFFS= 0
##$CY= 12.5
##$DATMOD= 1
##$DC= 0
##$DFILT= <>
##$DTYPP= 0
##$F1P= 14.0000005364418
##$F2P= -0.99999901652339
##$FCOR= 0.5
##$FTSIZE= 32768
##$FT_mod= 6
##$GAMMA= 0
##$GB= 0
##$INTBC= 1
##$INTSCL= 1
##$ISEN= 128
##$LB= 0.3
##$LEV0= 0
##$LPBIN= 0
##$MAXI= 10000
##$MC2= 0
##$MEAN= 0
##$ME_mod= 0
##$MI= 0
##$NCOEF= 0
##$NC_proc= -3
##$NLEV= 6
##$NOISF1= 0
##$NOISF2= 0
##$NSP= 0
##$NTH_PI= 0
##$NZP= 0
##$OFFSET= 16.522
##$PC= 1
##$PHC0= 230.3545
##$PHC1= 8.313735
##$PH_mod= 1
##$PKNL= yes
##$PPARMOD= 0
##$PSCAL= 4
##$PSIGN= 0
##$REVERSE= no
##$SF= 250.13
##$SI= 32768
##$SIGF1= 0
##$SIGF2= 0
##$SINO= 400
##$SIOLD= 32768
##$SREGLST= <1H.CDCl3>
##$SSB= 0
##$STSI= 32768
##$STSR= 0
##$SW_p= 5175.98343685301
##$SYMM= 0
##$S_DEV= 0
##$TDeff= 65536
##$TDoff= 0
##$TI= <Analysis number 999999
Compound Code 99
Book Reference 9
Project Code 9>
##$TILT= no
##$TM1= 0
##$TM2= 0
##$TOPLEV= 0
##$USERP1= <user>
##$USERP2= <user>
##$USERP3= <user>
##$USERP4= <user>
##$USERP5= <user>
##$WDW= 1
##$XDIM= 32768
##$YMAX_p= 384002892
##$YMIN_p= -72888
$$ End of Bruker specific parameters
$$ ---------------------------------
##NTUPLES= NMR SPECTRUM
##VAR_NAME=  FREQUENCY,     SPECTRUM/REAL,   SPECTRUM/IMAG
##SYMBOL=    X,             R,               I
##VAR_TYPE=  INDEPENDENT,   DEPENDENT,       DEPENDENT
##VAR_FORM=  AFFN,          ASDF,            ASDF
##VAR_DIM=   32768,         32768,           32768
##UNITS=     HZ,            ARBITRARY UNITS, ARBITRARY UNITS
##FACTOR=    0.157963299565203, 1,           1
##FIRST=     4132.6476996994, 0,             0
##LAST=      -1043.33573715361, 0,           0
##MIN=       -1043.33573715361, -72888,      0
##MAX=       4132.6476996994, 384002892,     0
$$ Real data points
##PAGE= N=1
##DATA TABLE= (X++(R..R)), XYDATA
$$ [...]
16351b2800J7297R254p437j1903J3423J7760K934j636n919q341Q498J5422j0222
16338A6330k1015Q663l338o950j1544k2287K741K1923J5265P070j275j0006J266
16325c157N958j6157r309P351Q161O249p779J713J8278j647J1175J6424j4114
16312B3146j1114J3909K92o095m448k1769q581J4377m479K001K3k217J0582J0740
16298A6367J0232j227j7544q479O210N080l768j1361o040O467Q31L285O457P654
16284A4164J0076p398j0284M616l52J3308l002N947j360k667r314j0993P49Q176
16270A1666r824k0121j1220K6J9793N694j994N07L491O925j0438j8934J1044O647
16256f738R341K741j0017p078J8550l708m593m708m870l572J7767J2295l1785
$$ plain form
16351 -22800 -5503 3751 -3686 -15589 -2166 15594 18528 16892 10973 2632 11130 26552 16330
16338 16330 -4685 3978 640 -6310 -17854 -40141 -37400 -15477 -212 6858 5583 -4423 -3157
16325 -3157 2801 -13356 -22665 -15314 -7153 -904 -8683 -6970 11308 9661 20836 37260 23146
16312 23146 12032 25941 26233 20138 15690 -6079 -14660 -283 -4762 -2761 -2738 -4955 5627 16367
16298 16367 26599 25372 7828 -651 5559 10639 6871 -4490 -10530 -4063 -3232 53 6510 14164
16284 14164 24240 16842 6558 11174 10822 24130 21128 27075 25715 23048 13734 2741 3490 11666
16270 11666 1842 -18279 -29499 -29473 -9680 -3986 -5980 -5473 -1982 4943 -5495 -24429 -13385 -6738
16256 -6738 2603 5344 -4673 -11751 6799 3091 -1502 -6210 -11080 -14652 3115 15410 -16375
16243a6375k7767J1460J2581J9104K1066J0751M992q660j8883j0293j8336p727
16231b8087P776K530o25m47P697J511k611N773N151P8j0104J652r315p525K296
16216b4250L910Q080N722L658j0260j333p638n622L411k507l992J4836J1055Q542
16202C612j4186j8168K457n667J375L526l529o754q530Q137L7854L82O933k1460
16188a4018k093J0219k039L518K0450j2426p997L181n571K0997K1510K463k0072
16175A8122j6583J3j3389J3533R169J235l952k287J8511P188k260J1715J2338
16162E3353O681L379m940r023p621l944Q754J3209J6516N574J658r060j1904J7367
16148G9999L7820J1107L3738L2313J7303L5480K1492J7193K1400L1278L7579K0714
$$ plain form
16243 -16375 -44142 -32682 -20101 -997 20069 30820 35812 27152 8269 -2024 -20360 -28087
16231 -28087 -20311 -17781 -18406 -18853 -11156 -9645 -12256 -6483 -1332 -1254 -11358 -9706 -19021 -26546 -24250
16216 -24250 -20340 -12260 -6538 -2880 -13140 -14473 -22111 -27733 -24322 -26829 -30821 -15985 -4930 3612
16202 3612 -10574 -28742 -26285 -31952 -30577 -27051 -30580 -37334 -45864 -37727 127 509 7442 -14018
16188 -14018 -16111 -5892 -7931 -4413 16037 3611 -4386 -1205 -6776 14221 35731 38194 18122
16175 18122 1539 1552 -11837 1696 10865 12100 8148 5861 24372 31560 29300 41015 53353
16162 53353 60034 63413 58473 49450 41829 37885 46639 59848 76364 81938 83596 74536 62632 79999
16148 79999 117819 128926 162664 194977 212280 247760 269252 286445 307845 339123 376702 397416
16136C97416r972k3776j8598n1559l8056r62K2112K5746J2050R403R226M809k0188
16123C17651k0158l1282m6595l0130n3193l4848k8886j5945j3883j1387J9072
16112E0416p468k9489r787j3929J6219L211K441M466R601k326j684J3086j1412
16099B3345r300K074m567j8796R367J5474j5223j5093o579J583J0960P991J0761
16086A1997n448j1874j4936J1526N979j3037J7922J7388j4471j3381j2648M457
16074a6526j9206m837J0738J8711O458l618j5399r159L814K7265J6015j4117j914
16061a775K268N644J996p101j5408P924J0505r070j1588j7138J5602m978j311
16048b4430J6647P942j2244k088L160Q948P744o520J8126L599l1123j9876o744
$$ plain form
16136 397416 387444 363668 345070 293511 255455 254493 276605 302351 314401 323804 333030 337839 317651
16123 317651 297493 266211 219616 189486 136293 101445 72559 56614 42731 31344 50416
16112 50416 42948 13459 3672 -10257 5962 9173 11614 16080 25681 23355 21671 34757 23345
16099 23345 14045 16119 11552 -7244 2123 17597 2374 -12719 -19298 -17715 -6755 1236 11997
16086 11997 6549 -5325 -20261 -8735 -2756 -15793 2129 19517 5046 -8335 -20983 -16526
16074 -16526 -35732 -40569 -29831 -11120 -4662 -8280 -23679 -32838 -29024 -1759 14256 139 -1775
16061 -1775 493 6137 8133 1032 -14376 -6452 4053 -5017 -16605 -33743 -18141 -23119 -24430
16048 -24430 -7783 159 -12085 -14173 -11013 -2065 5679 -841 17285 20884 -10239 -30115 -36859
16035c6859l645O577J4638l187L0603K5573j44k767j1026j2629j1104k0675j6612
16022d1257R576J4088J2815j970o144J434j9054J2343M467o565P741K3181Q950
16009A9605p687R051Q569k2348j0196Q925j3264k1867p865o58Q000J3699J5451
15996e85L2571j0841k1434k098m590j239j2019l870O341n045N181l732p13J4002
15982h071O856N910l538J740r544N605J8888K586L956j496q778j1116l439J5642
15968A5201K930p797r489j9557J764J2325R21J0070j7703j5280j6455n871J5713
15955c3228K1114Q646P952j917p192K929R120K4551j3702k2517n836O866J0536
15942G322R252j1813L155k3790k0949O508J8572J5674n862l78J9713j1872j0794
$$ plain form
16035 -36859 -40504 -33927 -19289 -22476 8127 33700 33556 30789 19763 7134 -3970 -24645 -41257
16022 -41257 -31681 -17593 -4778 -6748 -12892 -11458 -30512 -18169 -13702 -20267 -12526 10655 19605
16009 19605 11918 20969 29538 7190 -3006 5919 -7345 -29212 -37077 -37735 -29735 -16036 -585
15996 -585 31986 21145 -289 -2387 -6977 -8216 -20235 -24105 -17764 -22809 -17628 -21360 -22073 -8071
15982 -8071 -1215 4695 1157 2897 -6647 -1042 17846 20432 24388 22892 14114 2998 -441 15201
15968 15201 18131 10334 845 -18712 -16948 -4623 -3702 6368 -11335 -26615 -43070 -48941 -33228
15955 -33228 -12114 -3468 4484 2567 -4625 -1696 7424 31975 18273 -4244 -10080 -3214 7322
15942 7322 16574 4761 7916 -15874 -36823 -30315 -11743 3931 -1931 -2309 17404 5532 -5262
15929e262J0789Q086O175j20j0553j943l7327l77J4710K6667N869r973j002K1471
15915B7210L616k008k5848q996j958J9732o009R344N190j4118j8150Q161K431
15902a403q430r913M818r603J7994l497n107Q572J050N254O834P315O573l966
15888A6491J397K010j1122l702n162k2419R320l2J1634J4112J296j3693J735p602
15874e737m649J9669j6p400o490K052J607J2016j341k907P58r78m689N175j8057
15859a0987N876J117R543J9261M343q233Q147p942m804k917j7526Q047K488n497
15845I16o755l565l96K120J377J193p946N22Q763R419o235n52j0570j716k892
15830a6317K629J369K6582Q365n811j721j3092j054M111p396l1290P024N254Q039
$$ plain form
15929 -5262 5527 13613 19788 19668 9115 7172 -30155 -30532 -15822 10845 16714 6741 5739 27210
15915 27210 30826 28818 2970 -6026 -7984 11748 5739 15083 20273 6155 -11995 -3834 -1403
15902 -1403 -9833 -19746 -14928 -24531 -6537 -10034 -15141 -6569 -5519 -265 6569 13884 20457 16491
15888 16491 17888 19898 8776 5074 -88 -22507 -13187 -13219 -1585 12527 13823 130 1865 -5737
15874 -5737 -10386 9283 9267 1867 -4623 -2571 -964 11052 9711 6804 7562 6584 1895 7070 -10987
15859 -10987 -5111 -3994 5549 24810 29153 20920 29067 21125 16321 13404 -4122 3925 6413 916
15845 916 -5839 -9404 -9800 -7680 -6303 -5110 -13056 -12534 -3771 5648 -587 -1139 -11709 -13425 -16317
15830 -16317 -13688 -12319 14263 22628 16817 15096 2004 950 5061 -2335 -33625 -26601 -21347 -13308
15816a3308R491m439m892o152n221K412l850L252k142K71N522Q952P171M917o026
15801d042j7387j9609J2213j1164J0391J9940j2433l726J2168q975j2471L828
15789c1267K1010J2878j349j330o27k487j4614L094n54M335J699M088j0678n892
15775b1694l503o056P631K9730j0668k6288p189J2428J4435p933j4672J6969R804
15762g006N042Q09l74j809O126J4647J3070m309j9758K612L467j3683j703J8260
15748A5391J0423j8423j0422L31J4189L406k5482K266J5478L809j3152k592J7730
15735A2952N169J3630j1698j1164q386J716k183j9509j358J635J999J8715L833
15722E351l055M694q916K155j4810L978q74J1286N982j5283j884J8605M270k4352
$$ plain form
15816 -13308 -3817 -8256 -13148 -19300 -24521 -22109 -25959 -22707 -24849 -24578 -19056 -10104 -2933 1984 -4042
15801 -4042 -21429 -41038 -28825 -39989 -29598 -9658 -22091 -25817 -13649 -22624 -35095 -31267
15789 -31267 -10257 2621 1272 -58 -685 -3172 -17786 -14692 -15246 -10911 -9212 -5124 -15802 -21694
15775 -21694 -25197 -31253 -23622 6108 -4560 -30848 -38037 -25609 -11174 -19107 -33779 -16810 -7006
15762 -7006 -1964 -1155 -1529 -3338 2788 17435 30505 26196 6438 9050 12517 -1166 -2869 15391
15748 15391 25814 7391 -3031 -2700 11489 14895 -10587 -8321 7157 10966 -2186 -4778 12952
15735 12952 18121 31751 20053 8889 503 2219 36 -19473 -20831 -19196 -17197 1518 5351
15722 5351 2296 6990 -1926 229 -14581 -10603 -11477 -191 5791 -9492 -11376 7229 11499 -12853
15708a2853k8002j034L160J119K1127K8824j5185m124k639j9885j680R104j1682
15695c3750j1423J1564M641n486K5141K0272j1410r284m626L580K1221O049j2628
15682C861r09M145k4778j5384l56P11j5190j044K073K9105K849j3977J6013K7709
15668A4828q291p310k419J5185j1650k1376J1178R227j0230o529o500R16n320
15655b8291j3895J919j857K1092N419o581L700Q267j296j2814N831L2638j4996
15642h64j0034R535M86J5809J9950p104j0269j2019L327j0039L997R648N255k952
15628A4726J662L941m583Q32j909J1100J244l0207j6371r09J1914M557l524j7564
15614b5091n734M647Q054l996p16O591j9468o57J3977K0382R426p077j339j4776
$$ plain form
15708 -12853 -40855 -41889 -38729 -37610 -16483 12341 -2844 -6968 -9607 -29492 -31172 -22068 -33750
15695 -33750 -45173 -33609 -28968 -34454 -9313 10959 -451 -9735 -14361 -10781 10440 16489 3861
15682 3861 2952 7097 -17681 -33065 -33421 -32710 -47900 -48944 -46871 -17766 -14917 -28894 -12881 14828
15668 14828 6537 -773 -3192 11993 343 -21033 -9855 -628 -10858 -17387 -23887 -22971 -28291
15655 -28291 -42186 -40267 -42124 -21032 -15613 -22194 -18494 -10227 -11523 -24337 -18506 14132 -864
15642 -864 -10898 -1363 -877 14932 34882 27778 17509 5490 8817 -1222 2775 12423 17678 14726
15628 14726 16388 20329 15746 16578 14669 25769 27013 -3194 -19565 -20474 -8560 -4003 -7527 -25091
15614 -25091 -30825 -26178 -18124 -22120 -22836 -16245 -35713 -36370 -22393 -2011 7415 338 -1001 -15777
15600a5777n333K3358P046o294n478o58L133l349J4541J208k112J3775P85k7650
15586b805k2830k776J585K2637M132m945N879R312J970j825Q317M427J795M465
15572B9338j5377k507O146r366j374N449l747P528l867R311K845p706N239r944
15558A1968n331j878P677K210o358j8526j652K1901J6347j8502p95o917O768P842
15544A4754q325P454j0610j7996r990L071J1885K2730J9297J8593q863j8035k0704
15531C261M345M627o798n362M950j864n953K395K6943j3586n128O387k739R14
15517A2392K350j481k1334p431J9493J5844J533P30n878p957J7698J0337p514
15504B8782j1207j8895p861j2114Q242K3851J6204j5433j5436n202j4854J2508
$$ plain form
15600 -15777 -21110 2248 9294 3000 -2478 -3136 -3 -3352 11189 12397 10285 24060 24845 -2805
15586 -2805 -25635 -28411 -26826 -4189 -57 -5002 877 10189 12159 10334 18651 23078 24873 29338
15572 29338 13961 11454 17600 8234 6860 12309 8562 16090 12223 21534 24379 16673 21912 11968
15558 11968 6637 4759 12436 14646 8288 -10238 -11890 10011 26358 7856 7061 144 6912 14754
15544 14754 6429 13883 3273 -14723 -24713 -21642 -9757 12973 32270 50863 42000 23965 3261
15531 3261 7606 12233 5435 73 5023 3159 -2794 -399 26544 12958 7830 14217 11478 12392
15517 12392 14742 13261 -8073 -15504 3989 19833 21366 22096 16218 8261 25959 36296 28782
15504 28782 17575 -1320 -9181 -21295 -13053 10798 27002 11569 -3867 -9069 -23923 -11415
15492a1415K069l56J3518J8232L747k1106m341q700j3743K035j1853J0176K1196
15479e41N15Q710Q166J1598q768j0320j4719J9066n86K633l430O50Q744j8149
15465C569j3582l712K317j3042J176O240J71J725J9381L692j2466j0593L763J9293
15451G932k327j1630O68K1585l918l535J4875k9252q942J280R62J573j6683m471
15437c1883K844L068k587k108j671N186J1327m350K723M49J4059J2639l721J1396
15423A7371J8665j8119j0371K59j8992q279k572j4947J0667K1743j952j141q174
15410a5842m696J4939j0026Q990O441q71J7316n250j2686n599j7698m104R216
15397a9870J4985p077P010o521j363j7952p343O122K5160P745N100L495m320L20
$$ plain form
15492 -11415 -9346 -9702 3816 22048 25795 4689 348 -8352 -22095 -20060 -31913 -21737 -541
15479 -541 -26 8684 16850 28448 19680 9360 -5359 13707 13121 15754 12324 12974 21718 3569
15465 3569 -10013 -13725 -11408 -24450 -23274 -17034 -16863 -15138 4243 7935 -4531 -15124 -11361 7932
15451 7932 5605 -6025 -5357 16228 12310 8775 23650 -5602 -14544 -13264 -12302 -10729 -27412 -31883
15437 -31883 -29039 -25971 -28558 -30666 -32337 -27151 -15824 -20174 -17451 -17002 -2943 9696 5975 17371
15423 17371 36036 17917 7546 7805 -11187 -19466 -22038 -36985 -26318 -4575 -6527 -7668 -15842
15410 -15842 -20538 -5599 -15625 -6635 -194 -1065 16251 11001 -1685 -7284 -24982 -29086 -19870
15397 -19870 -4885 -11962 -4952 -11473 -12836 -30788 -38131 -32009 -6849 896 5996 9491 5171 5491
15383E491N995n788L845o448j3733J1734J251J0426j1168R509J6730p687j9332
15370H25m77j6158n122n910N387O400J4573J0506r442j862K499k251J6732j5694
15356Fj3430j4492j175q24J4290j8397k0613J4971J4327K3985K4856o500q945
15343H059q573j0443j7629j127K0844K6372m979j8500M651R4n18l258j0584K2505
15329F914J1518k3134j6285m430J4694J8219k223j9810J1395J1959k648j1940
15317e771p116K917p619k4917j4133J3644J6161K7621J0860q11k026J4283n389
15304A7704j2517p488l916N832J0354r233L285J1659N468m257J4624k679j6419
15291A2417j86j3425R430m433p3j630q96k501m871j4847J4470J7831j4407j5706
$$ plain form
15383 5491 11486 5698 9543 3095 -10638 1096 2347 12773 1605 11114 27844 20157 825
15370 825 348 -15810 -20932 -26842 -21455 -15055 -482 10024 582 -1280 1219 -1032 15700 6
15356 6 -13424 -27916 -29091 -29915 -15625 -34022 -54635 -39664 -25337 -1352 23504 17004 8059
15343 8059 -514 -10957 -28586 -29713 -8869 17503 12524 -5976 -1325 -1231 -1749 -5007 -15591 6914
15329 6914 18432 -4702 -20987 -25417 -10723 7496 5273 -14537 -3142 8817 6169 -5771
15317 -5771 -12887 -9970 -17589 -42506 -56639 -42995 -26834 787 11647 10836 8810 23093 17704
15304 17704 5187 -2301 -6217 -385 9969 736 4021 15680 21148 16891 31515 28836 12417
15291 12417 12231 -1194 8236 3803 3730 2100 1204 -1297 -6168 -21015 -6545 11286 -3121 -18827
15277a8827K5739P368o198j1279N24Q411r016l7248O162J0279J5555R052p119
15264f597q294j126M14m640N339p517N261o992Q768K3955R820J2455j7337j2815
15250F94P319m810l172Q967J3407J3067n158j1803J1347j721Q814j2351q930M601
15236B0271K784l2840L783J3898l0495k1089N801J4454K96Q310J9597Q091J2809
15223B5670n671k403m42M060K097j7548o762Q477m38j5794o268j429Q278J7585
15209I412J339L268j6435j1807j0393J9334K0247j5913j1752J0568m829p223J5671
15196A487J6760J58j9897l986k936q588l232J6257J0967k688L484R012p151j2555
15182b908n012j5428M529N722o481j017J214J0636K0802J0670K422j4785j3989
$$ plain form
15277 -18827 6912 14280 8082 -3197 -2673 5738 -3278 -40526 -34364 -24085 -8530 522 -6597
15264 -6597 -14891 -16017 -15603 -20243 -14904 -22421 -17160 -24152 -15384 8571 18391 30846 13509 694
15250 694 8013 3203 31 8998 22405 35472 30314 18511 29858 28137 36951 24600 15670 20271
15236 20271 23055 -9785 -6002 7896 -22599 -43688 -37887 -23433 -23137 -14827 4770 12861 25670
15223 25670 19999 17596 17154 21214 23311 5763 -999 7478 7040 -8754 -15022 -16451 -8173 9412
15209 9412 10751 14019 -2416 -14223 -24616 -5282 14965 -948 -12700 -2132 -6961 -14184 1487
15196 1487 18247 18405 -1492 -5478 -8414 -17002 -20234 -3977 6990 4302 7786 16798 9647 -2908
15182 -2908 -7920 -23348 -18819 -13097 -19578 -20595 -19381 -8745 12057 22727 25149 10364 -3625
15169c625n722j3083r234L191K8908J1500j4974L354j2893R832J319P370J4163
15156B0106o087k476r109j0511J116q036K942R417M150J1269K0421J5651J1473
15143F0326j1038k1086k5390k6652K776K1349j0638j1485n861j8399J1780K6721
15131g597k08j8837q142k0053l238J2724M857J4708J1793p685r345J7960L0393
15118A7330l498j587n214j0824J749L332q257P092q19m889k0808j2747L0235J5838
15104F933l098J4365j0633q656j4956l526J9143K4576j597L84k5748n455Q412
15091A44k2838r012K3776M363J226j0357J1308J1020p292L741n895j7227O95P405
15077h943k0487p324O992L6210J8632r140l0135n409K2628N16j8339o994J0656
$$ plain form
15169 -3625 -9347 -22430 -31664 -28473 435 11935 -3039 315 -12578 -2746 -1427 5943 20106
15156 20106 14019 11543 2434 -8077 -6961 -14997 -12055 -2638 1512 12781 33202 48853 60326
15143 60326 49288 28202 2812 -23840 -21064 285 -10353 -21838 -27699 -46098 -34318 -7597
15131 -7597 -7805 -26642 -34784 -54837 -58075 -45351 -40494 -25786 -13993 -21678 -31023 -13063 17330
15118 17330 13832 12245 7031 -3793 -2044 1288 -6969 123 -696 -5585 -26393 -39140 -8905 6933
15104 6933 3835 18200 7567 -1089 -16045 -19571 -428 24148 22551 22935 -2813 -8268 144
15091 144 -22694 -31706 -7930 -3567 -2341 -12698 -1390 9630 2338 6079 184 -17043 -16348 -8943
15077 -8943 -29430 -36754 -29762 6448 25080 15940 -14195 -19604 3024 3540 -14799 -21793 -11137
15064a1137j0342j0056J2555Q500P253m157p915n968Q246J8261J33j2940P974
15051D07J6169J0241p416m663j2193k3548j1749k834M299J8660j835j1800j1626
15038c7888M05J8521j624Q266o027j4310J903K2526K0354n903j0039J92J6142
15025A2518J2049P874j5813K589j4840j444j8394M288K6385L51j0339J851k0359
15012a3284L017K5332N174J367o011k3330k41J874J0153L09j1924P560J6193m345
14998A1844j4064K07j5526j572K0994J2406j2939M547j4422L657O693N006J611
14985H442J5454J309L127J424o650j7523j3040J2521J3853J1819j3824k752J07
14972A4267K4q193k032m659n977q701K338N363J772M481o430j4196J6342J6400
$$ plain form
15064 -11137 -21479 -31535 -18980 -10480 -3227 -7384 -15299 -21267 -13021 5240 5373 -7567 407
15051 407 16576 26817 19401 14738 2545 -21003 -32752 -35586 -31287 -12627 -14462 -26262 -37888
15038 -37888 -37483 -18962 -20586 -12320 -18347 -32657 -30754 -8228 12126 6223 -3816 -3624 12518
15025 12518 24567 32441 16628 19217 4377 2933 -15461 -11173 15212 15563 5224 7075 -13284
15012 -13284 -10267 15065 20239 21606 15595 -7735 -7976 -6102 4051 4360 -7564 -4 16189 11844
14998 11844 -2220 -2013 -17539 -19111 1883 14289 1350 5897 -8525 -4868 1825 6831 8442
14985 8442 23896 25205 28332 29756 23106 5583 -7457 5064 18917 30736 16912 14160 14267
14972 14267 14291 6098 4066 -593 -6570 -15271 -12933 -7570 -5798 -1317 -7747 -21943 -5601 10799
14958A0799k916q287L154J5381M236l0728K743K0810j3257j1709n965M945L362
14945g432K934O196j526q285N939K1341O481L851k3209J589Q25p296o277p054
14931a1923L833m560R359K7095J3237q934k4871j8953P171Q215L005l355N47N260
14917E126J0570l206N22j6445O564M851j1993l297O215K615l541j3966r270r30
14903b6185P290N718J2638J1566j861q476J1789n194O280J3386J2427j2482j7799
14890I097o946p254R128j0939l6521N675M757J8119J8372q127j2078R792J6303
14877I378j5624M32J3551J9241j3298r743j5843P950K1121L237L234o181L32j2878
14863D909R713K504j555J2q43p19j2392J8929p956m181o370m250O386r788K0048
$$ plain form
14958 10799 7883 -404 2750 18131 22367 -8361 -5618 15192 1935 -9774 -15739 -10794 -7432
14945 -7432 -4498 1698 172 -8113 -2174 19167 25648 29499 6290 7879 8704 1408 -4869 -11923
14931 -11923 -8090 -12650 -3291 23804 37041 28107 3236 -15717 -8546 -331 2674 -681 -134 5126
14917 5126 15696 12490 13012 -3433 3131 7982 -4011 -7308 -1093 1522 -2019 -15985 -25255 -26185
14903 -26185 -18895 -13177 -539 11027 9166 690 12479 7285 13565 26951 39378 26896 9097
14890 9097 2151 -5103 4025 -6914 -43435 -37760 -33003 -14884 3488 -4639 -16717 -6925 9378
14877 9378 -6246 -5814 7737 26978 13680 3937 -11906 -3956 17165 20402 23636 17455 17787 4909
14863 4909 14622 17126 15571 15583 14740 14021 1629 20558 12602 8421 2051 -2199 4187 -5601 14447
14848A4447r714j7615J097J3988J2817N005M354N461r919J464r926k667j942m45
14834F405j0515J9020J6560m614n386o60O398j8198j4712l638j2191l123R748
14821a4906L3745J458l2723j4400J7540R925J922N567p04M530p570J2182M703
14808B1269P498Q776m672l5272k3150K8418q370j0691J2330j3166K010J6214j0130
14795h936r4J3711j769j1718J828J3224L092k5611N63J8904M50R462j7267q324
14781a2485J7592J2682R980J1079n703m793J1969J0680q898o85n22j8063l1522
14768h689Q41q999j0911J4534M395J2241J8051k1802R502K0068k1095j6628J1151
14755B659M60r76K010p919j4881n875j3365J3524R18j482j439O723R406m304p854
$$ plain form
14848 14447 4733 -12882 -11785 2203 15020 20025 24379 29840 19921 21385 11459 8792 6850 6405
14834 6405 -4110 14910 31470 26856 21470 20810 27208 9010 -5702 -9340 -21531 -24654 -14906
14821 -14906 18839 20297 -12426 -26826 -9286 639 2561 8128 7424 11954 4384 16566 21269
14808 21269 28767 37543 32871 -2401 -25551 2867 -5503 -16194 -3864 -17030 -15020 1194 -8936
14795 -8936 -9030 4681 2912 -8806 -6978 6246 9338 -16273 -15710 3194 3644 13106 -4161 -12485
14781 -12485 5107 17789 27769 38848 33145 28352 40321 51001 42103 41418 40896 22833 -8689
14768 -8689 -7848 -16847 -27758 -13224 -8829 3412 21463 -339 9163 29231 8136 -8492 2659
14755 2659 3119 2143 4153 -3766 -18647 -24522 -37887 -24363 -23445 -24927 -26366 -19643 -10237 -14541 -22395
14740b2395p914j299Q413Q037j396P811M598l133j5587n687O428k133r161K1013
14726a2405J629q471J0877N992j1731l587J701J30l487O730N830j0899j450o688
14712b5829J376J1187L714M561R499J777k84J4292j5997k0346n416J0838O67L29
14698i632Q459J6398J0090q512k622P797J0369J7049j0627k1634O560M508j0944
14685A7259j9293j843n733r167J0444Q089n722K905J4535J2059j3942j6843k315
14672i567M192K709q703l76Q263R604r151k2081J0402J3235P697K92Q239k1293
14658f538l5181j3324K1529J3591o88L223P160P388L499j575l164J8337J0430
14645B4687o987Q353k686k2156N962J179M321R210Q20K632J7197j527k637O659
$$ plain form
14740 -22395 -30309 -31608 -23195 -15158 -16554 -8743 -4145 -7278 -22865 -28552 -22124 -24257 -33418 -12405
14726 -12405 -10776 -19247 -8370 -2378 -14109 -17696 -15995 -15865 -19352 -12622 -6792 -17691 -19141 -25829
14712 -25829 -24453 -13266 -9552 -4991 4508 6285 6001 20293 4296 -16050 -21466 -10628 -9961 -9632
14698 -9632 -1173 15225 25315 16803 14181 21978 32347 49396 38769 17135 23695 28203 17259
14685 17259 -2034 -3877 -9610 -18777 -8333 -244 -5966 -3061 11474 23533 9591 -7252 -9567
14672 -9567 -5375 -2666 -11369 -11745 -3482 6122 -3029 -25110 -14708 -1473 6224 6516 14755 -6538
14658 -6538 -41719 -55043 -33514 -19923 -20611 -17388 -10228 -2840 659 -916 -4080 14257 24687
14645 24687 17700 26053 23367 1211 7173 8352 12673 21883 22703 25335 42532 41005 38368 45027
14631D5027j323l7497k4660L711J6851K4121j1346n705n083J26j4023j2861l039
14618b5701j826J4456M832Q794k5535k0748R970J0947o086J8240m281K03J4736
14605a999j8J191Q694j1437R111J2558n056O157l29k497j0120j8321J9402L645
14591A0981J0391O585P978J0379k0600O413p531J3811J6558j306o362l596K824
14578D6525J7571j0505k5204R598l759L110J4124J4679K601J5593J6594J0099
14566A11026J1815J4567N670L0719O9318L7603M5544P1562O0863L3187K0232k7261
14554D84845o3696j15508j06897p0939m7358m425k7260k0164k982J7499J65j1201
14542C2079j1713K24l796j1952l961j0971j2240j0748P309J8459K5674r366j8991
$$ plain form
14631 45027 43704 6207 -18453 -14742 2109 26230 14884 9179 4096 4222 -9801 -22662 -25701
14618 -25701 -27527 -13071 -8239 555 -24980 -45728 -35758 -24811 -30897 -12657 -16938 -16735 -1999
14605 -1999 -2017 -826 7868 -3569 5542 18100 13044 19201 18872 16375 6255 -12066 7336 10981
14591 10981 21372 27957 35935 46314 25714 32127 24596 38407 54965 53659 47297 43701 46525
14578 46525 64096 53591 28387 37985 34226 37336 51460 66139 68740 84333 100927 111026
14566 111026 122841 137408 143078 173797 243115 280718 326262 397824 458687 491874 512106 484845
14554 484845 421149 305641 198744 127805 80447 76022 48762 28598 25616 43115 43280 32079
14542 32079 20366 20590 16794 4842 881 -10090 -22330 -33078 -25769 -7310 18364 8998 -9993
14529i993R799K051N808q436N267L786j2993o001N679O087q977j7278m386J4274
14515a5313O149K670R977L822k4203o317j520K2551J6353N609j685j9416n879
14502g202j1161n768J126J9614K7162n073J070k380l095o819j848N349N792N687
14488B2454J4538p515k2323j3531O208J652j6302j3803R467J5221J8169j4229
14476Fk341Q335J7570j4863Q219m587j3801q818n329o488k238o743K8325J5405
14462A2652p275L104Q64l317m914P967l161p602N67O283R412k351k6039k0597
14448c4407Q794L999J303l25L808j723J402K011n042J1859J1436k184j554R616
14434H993O109M142q91Q822p928q95m707j5790j1630J4680J5306K711r378j2922
$$ plain form
14529 -9993 -194 1857 7665 -771 4496 8282 -4711 -10712 -5033 1054 -7923 -25201 -29587 -15313
14515 -15313 -9164 -6494 3483 7305 -16898 -23215 -24735 -2184 14169 19778 18093 -1323 -7202
14502 -7202 -18363 -24131 -23005 -3391 23771 18698 19768 17388 14293 7474 5626 10975 16767 22454
14488 22454 36992 29477 7154 -6377 -169 1483 -14819 -28622 -19155 -3934 14235 6
14476 6 -2335 6000 23570 8707 16926 12339 -1462 -10280 -15609 -22097 -24335 -31078 -2753 12652
14462 12652 5377 8481 9345 6028 1114 9081 5920 -1682 -1115 5168 14580 12229 -13810 -34407
14448 -34407 -25613 -21614 -20311 -20636 -16828 -18551 -17149 -15138 -20180 -8321 3115 931 -623 8993
14434 8993 15102 19244 18353 27175 19247 18352 13645 -2145 -13775 905 16211 18922 9544 -3378
14420c378J2618J6633l503j4415o330k6148K364R612J4219J6071J4348r514n485
14407A7092N314k1477k767q347K167J5968P126L0541q105k7662j3477l16P904
14394C961n569P78O34n205J4281L114q850M615j7978q1J0547Q80J846j8585l267
14379a8879J8205J198m062j6674J709J7076K423j871p95K85Q466k340K554K064
14365I359Q276o526j7021j2595J0806J0213N411J6033o809j7822l579O959K240
14352D945n312q953J4250j0450L045O534J1510j271o613j2954l089J5811R479
14339A6932k0887k4062J828M691M545Q070k876m646J5788K2124J8675M760j2487
14326C2455k5378j940n355J3230o751q588L972K916j0579J1121k166O791Q659
$$ plain form
14420 -3378 9240 25873 22370 7955 1625 -24523 -22159 -12547 1672 17743 32091 22577 17092
14407 17092 22406 929 -1838 -10185 -8018 7950 15076 45617 37512 9850 -3627 -3943 3961
14394 3961 -1608 -830 -196 -5401 8880 11994 3144 7759 -10219 -10300 247 1127 2973 -15612 -18879
14379 -18879 -674 524 -3538 -20212 -18503 -1427 996 -875 -1670 -1385 7081 4741 7295 9359
14365 9359 17635 11109 -5912 -18507 -7701 2512 7923 23956 17147 -675 -4254 2705 4945
14352 4945 -367 -9320 4930 -5520 -2475 4059 15569 14298 7685 -5269 -8358 7453 16932
14339 16932 -3955 -28017 -26189 -21498 -16953 -8883 -11759 -16405 -617 21507 40182 44942 32455
14326 32455 7077 5137 -218 13012 6261 -2327 1645 4561 -6018 5103 2937 9728 18387
14313A8387O732j7610O798m683j1145J1284l787j7876j0391Q17K0743K6306j1899
14300A3676p132k164R625k483k426k9211N994K4362J2104J835K981Q360j033j1446
14286B3042j2130l143j4919j0031k58K3769K3550O451J0654j9327l8478p605J6485
14273a940J4458J9899N969n212j668O40l769o912o080m07r798P511J2968J671
14259B7330l636J2046j544j1470q454N367k138p564Q218N910N127J3021j2190
14246C0023k2335p262n399J145Q42J6597j6627K1518N539j6740n608J1989P523
14233B1205J4671l591k3527r172L782n194l753q69j5980o901m588M386L3672J4053
14219A8194p395k2907o280K6225R747r277l894O913L118J435j814l011L776N053
$$ plain form
14313 18387 25119 7509 14307 9624 -1521 9763 5976 -11900 -22291 -21474 -731 25575 13676
14300 13676 6544 4380 14005 11522 9096 -20115 -14121 10241 22345 24180 27161 35521 34488 23042
14286 23042 10912 7769 -7150 -17181 -17439 6330 29880 36331 46985 27658 -10820 -18425 -1940
14273 -1940 12518 32417 38386 33174 31506 32146 28377 21465 15385 14978 5180 12691 25659 27330
14259 27330 23694 35740 34196 22726 14272 19639 17501 9937 18155 24065 29192 42213 30023
14246 30023 7688 426 -4973 -3828 -2986 13611 -3016 18502 24041 7301 1693 13682 21205
14233 21205 35876 32285 8758 -414 3368 -1826 -5579 -6448 -22428 -29329 -33917 -29531 4141 18194
14219 18194 10799 -12108 -18388 7837 17584 8307 4413 11326 14444 15879 14065 11054 14830 19883
14205A9883Q24K922N505J732r505j6987q661K0767N198Q36M339l128J0734J8911
14191E3370l825j638n871L490q626j249M990N652J5948J1924N646j200k3303j6456
14177C8852O72P904j143R561o853J4491K6374N782K510J5314l430j3998J3727
14164A09763K6429O332m417K2285J6885j639j018J901K9130L4427K5605J0800
14152B76483J9190K6480L4093K9762J142m785L4639Q841J5928j471j315J2705
14140D51692k63J446r33R546O784j3578k4354p190K2712Q883r773P660Q156l899
14126D56889J768k6021j1356l389k4202m0301Qk57j3534j5962l2196l1236j0233
14113B49978k4065n134r062k8999k6822j9177p344k5774j9030n330j5294q593
$$ plain form
14205 19883 20707 23629 29134 30866 21361 4374 -4287 16480 21678 22514 26853 23725 34459 53370
14191 53370 49545 47907 42036 45526 36900 35651 40641 46293 62241 74165 79811 78611 55308 38852
14177 38852 39524 47428 46285 55846 48993 63484 89858 95640 98150 113464 110034 96036 109763
14164 109763 136192 142524 138107 160392 177277 175638 174620 176521 205651 240078 265683 276483
14152 276483 295673 322153 356246 386008 387150 382365 417004 425845 441773 440302 438987 451692
14140 451692 451429 452875 451942 461488 468272 454694 430340 423150 445862 454745 444972 452632 460788 456889
14126 456889 458657 432636 421280 417891 393689 353388 353396 353139 339605 323643 291447 260211 249978
14113 249978 225913 220779 211717 182718 155896 136719 129375 103601 84571 79241 63947 55354
14101E5354J38N983l383o19q142R718q432O472l823O36J2982k761j2332j4099
14087C7692N346O012Q258j2227k6406k1011o601J5057R11M800R194L217q185j035
14073A5022j075j1269J991K3627J9724k6162M27O432r844o102P426J1963o987
14060B5173J2674j8559k2894K466m061M957r241j9254J4756K1541Q35r476j6647
14047a7730o160J1645N108J6663K1972K460q698n442r584Q058J2623K229n478
14034B7666j306J4349L488k5215j9201K2544j2904j4701m189Q562J754K11j865
14021h07J813J0437K522M196J4050J4602k174R59k161j5114l0342j090R139J6725
14007B2755n440n37K327j5935J7260J376N38J8197J1504j3169r843k763P481J3897
$$ plain form
14101 55354 55492 61475 58092 57473 49331 59049 50617 57089 53266 53902 66884 64123 51791 37692
14087 37692 43038 49050 57308 45081 18675 -2336 -8937 6120 7031 11831 21025 24242 16057 15022
14073 15022 13947 2678 4669 28296 48020 21858 22285 28717 18873 12771 20197 32160 25173
14060 25173 37847 19288 -3606 -1140 -5201 -244 -9485 -28739 -13983 7558 8393 -1083 -17730
14047 -17730 -23890 -12245 -7137 9526 31498 33958 25260 19818 10234 18292 30915 33144 27666
14034 27666 26360 40709 44197 18982 -219 22325 9421 -5280 -9469 -907 847 1058 -807
14021 -807 1006 11443 13965 18161 32211 46813 44639 45598 43437 28323 -2019 -3109 6030 22755
14007 22755 17315 16778 19105 3170 20430 21806 22344 40541 52045 38876 29033 26270 33751 47648
13993D7648o37J0718P461o057j2532r763J4318r083l730J1124N809J6171k563
13980F8884J1463n325l306K2731K767l474k1469q538R07K5025P403j0206N725
13967I2587K1887M936k0273k1648L453Q442j3973K57K3381P446j9418P322p374
13954H7025j4845l325R733J4262J1499M908o424M314j0205j1770J1232J5272K901
13941A14577m413r726j0318k6758m248n174k312J9872J7217J675m054n989M966
13928H5315j5450p528j94j0000n901r365k817R607J3691Q58O282q513k144k84
13914E3557l543O724J3341m045l23o188j1738l199N029R70L741J3000J1075J4982
13900I3383j3101n162P145l280m662j1414o190k6349R922J1948J2022m445J983
$$ plain form
13993 47648 47011 57729 65190 59133 46601 36838 51156 42073 38343 49467 55276 71447 68884
13980 68884 80347 75022 71716 94447 97214 93740 72271 63733 64640 89665 97068 86862 92587
13967 92587 114474 119410 99137 77489 80942 89384 75411 75668 99049 106495 87077 94399 87025
13954 87025 72180 68855 78588 92850 104349 109257 102833 107147 96942 85172 96404 111676 114577
13941 114577 110164 100438 90120 63362 59114 53940 51628 71500 88717 90392 86338 80349 85315
13928 85315 69865 62337 62143 52143 46242 36877 34060 43667 57358 58216 64498 55985 53841 53557
13914 53557 50014 56738 70079 66034 65711 59523 47785 44586 49615 50585 54326 67326 78401 93383
13900 93383 80282 75120 82265 78985 74323 62909 56719 30370 40292 52240 64262 59817 61800
13887F1800k562k582k2471J1600J3142J0446Q218P245r644N770J0727j1542k2251
13874E7896j8629J4820K743l210j2122R706J7512k327L556J6266N587K996Q46
13861I5640K853J9413p43j0631O618L2075J1067j516j6719m283M382k0339K851
13848A20668J6482N557J4603K1987r282j3244Q917J5549L114k3686j2604K5563
13836A73624K9807j4368J720J8636L762O394j0395J66l973p604j5875L0055K4954
13823B36903n57m337m177J367M41r437j2581j230K497k732k880P638J4423P035
13809B32373J93L016o918J0170J1925P822j9906m385J4986J6938J1794O366O422
13796B90796P10k117J0228N402Q578J063j1932L047L3188R938P780K0288J2631
$$ plain form
13887 61800 59238 56656 34185 45785 58927 69373 77591 84836 75192 80962 91689 80147 57896
13874 57896 39267 54087 56830 53620 41498 51204 68716 66389 69945 86211 91798 94794 95640
13861 95640 98493 117906 117163 106532 113150 145225 156292 154776 138057 133774 138156 117817 120668
13848 120668 137150 142707 157310 179297 170015 156771 165688 181237 184351 160665 148061 173624
13836 173624 203431 189063 190783 209419 213181 219575 209180 209346 205373 197769 181894 211949 236903
13823 236903 236346 232009 227832 229199 229640 220203 207622 206392 208889 206157 203277 210915 225338 232373
13809 232373 232566 235582 228664 238834 250759 258581 238675 234290 249276 266214 278008 284374 290796
13796 290796 291506 289389 299617 305019 313597 314660 302728 305775 338963 348901 356681 376969 389600
13783C89600R821K0573M3222J9537N764o392J4798L0929L1492J8970J0644J5546
13771F04504K6816L3455L5446L9230J8563R381K2024M4114M2964M8211O6921O4416
13759A056045O3226N7360P5429R0952R9581J00945J00129Q8100R1927J12917J37189
13748B073800J46717J58699J75276J73860J95813K07663K37801K52766K68026
13739C890421K71907K84066L27292L38383L70961L99919M28887M67625M99560
13730G279021N23296N70097O20366O57170O95070P50455Q12927Q93671R56104
13721A3758177J027915J113088J207859J310253J415997J513041J648813J755422
13713B4750565J910980K091206K248066K416100K606309K799358K969238L142172
$$ plain form
13783 389600 399421 419994 463216 482753 488517 482125 496923 527852 559344 578314 588958 604504
13771 604504 631320 664775 700221 739451 758014 767395 789419 833533 876497 924708 991629 1056045
13759 1056045 1119271 1176631 1252060 1343012 1442593 1543538 1643667 1731767 1823694 1936611 2073800
13748 2073800 2220517 2379216 2554492 2728352 2924165 3131828 3369629 3622395 3890421
13739 3890421 4162328 4446394 4773686 5112069 5483030 5882949 6311836 6779461 7279021
13730 7279021 7802317 8372414 8992780 9649950 10345020 11095475 11908402 12802073 13758177
13721 13758177 14786092 15899180 17107039 18417292 19833289 21346330 22995143 24750565
13713 24750565 26661545 28752751 31000817 33416917 36023226 38822584 41791822 44933994
13705D4933994L313279L439615L480721L531903L479209L353840L180404K927004
13697G1639969K629830K299298J910685J513403J129659P81440M54673J91650
13689H2550607k1336j89144k95352l58136m02753m25568m48843m50662m59158
13680G9499655m89486n57177o70731q28716j010145j265275j565357j878205k233814
13671F9000749k559904k891348l206466l466715l662915l762706l792163l761131
13663D1897401l648898l522563l311210l060880k826350k589472k345648k099095
13655A8493285j899348j665815j485961j336248j170426j032462r25214q38520
13647H139291p13381o53525n95284n55881m76759m07287l63933l56242k93101
$$ plain form
13705 44933994 48247273 51686888 55167609 58699512 62178721 65532561 68712965 71639969
13697 71639969 74269799 76569097 78479782 79993185 81122844 81904284 82358957 82550607
13689 82550607 82529271 82340127 82044775 81686639 81283886 80858318 80409475 79958813 79499655
13680 79499655 79010169 78452992 77782261 76953545 75943400 74678125 73112768 71234563 69000749
13671 69000749 66440845 63549497 60343031 56876316 53213401 49450695 45658532 41897401
13663 41897401 38248503 34725940 31414730 28353850 25527500 22938028 20592380 18493285
13655 18493285 16593937 14928122 13442161 12105913 10935487 9903025 8977811 8139291
13647 8139291 7425910 6772385 6177101 5621220 5144461 4737174 4373241 4016999 3723898
13638C723898k70020k49200k02764k01544j94024j58158j43613j42602j33932
13629B028041j09464r0672p7849p6859p1691p5027r1201q8309o3345o2448n4503
13618A166673m0532m9331m3166n2468l1799l7196l4136l4720k6379j1567k5323
13607G80056k3124k6808l0008k5200k7178k8591j3199r322q559o063r779k0870
13595E51355j5405q798l0537k7579j908j4926l172n990j2768j5389k5640n421
13583C83822M641q679j0503j8553k1128m972L917j2519m107J0524J3385l1220
13571C04608J430J1420K86L101j7315r404j3602o102j5804P324j7812k8444p182
13558B12504q554m609j5855j0618J3174M741k332J2753P305N935q191j2788j3513
$$ plain form
13638 3723898 3453878 3204678 3001914 2800370 2606346 2448188 2304575 2161973 2028041
13629 2028041 1918577 1827905 1750056 1673197 1601506 1526479 1435278 1346969 1283624 1221176 1166673
13618 1166673 1126141 1076810 1033644 981176 949377 912181 878045 843325 816946 805379 780056
13607 780056 756932 730124 700116 674916 647738 619147 605948 596626 588067 582004 572225 551355
13595 551355 535950 527152 496615 469036 467128 452202 449030 443040 430272 414883 389243 383822
13583 383822 388463 379784 369281 350728 329600 324628 328545 316026 311919 322443 335828 304608
13571 304608 306038 317458 317744 320845 303530 294126 280524 274422 258618 265942 248130 219686 212504
13558 212504 203950 199341 183486 172868 186042 190783 188451 201204 208509 214444 206253 193465 179952
13545A79952Q660k902j5288j7961Q427J996j0057k7103r797O399o513L948L980
13532A23741r911M153p373L873k4487n477J1335J7630N037l471k511Q550p056
13519A14033Q331K481q75k1710j1273J8136Q462j131j1664M733P823j978m172
13506A11196j2203N633K2176P003r605k0959p432k22J6064J5044n391l145M074
13493A22233j7391q420J8095r18j164Q024J1045M489j4740q239r644J2098n054
13480A10414k4137J6454K1206j0363l1854l922K2439J3693j2758j2190p22j515
13468H6745j0473p331r244O931J3086j140K665p268k4520l57Q734J0778j5935
13455E2671l553l797P234o235L0362K974k567J857J6827q330j2850l2611M148
$$ plain form
13545 179952 188612 185710 170422 152461 160888 162884 152827 125724 115927 122326 115813 119761 123741
13532 123741 113830 117983 110610 114483 89996 84519 95854 113484 118521 115050 112539 121089 114033
13519 114033 122364 124845 123970 102260 90987 109123 117585 116454 104790 109523 117346 115368 111196
13506 111196 98993 104626 126802 133805 124200 103241 95809 95587 111651 126695 121304 118159 122233
13493 122233 104842 96422 114517 113599 112435 120459 131504 135993 121253 113014 103370 115468 110414
13480 110414 86277 102731 123937 113574 81720 77798 100237 113930 101172 88982 88260 86745
13468 86745 76272 68941 59697 66628 79714 78574 81239 73971 49451 49094 57828 68606 52671
13455 52671 49118 45321 52555 46320 76682 79656 77089 78946 95773 87443 74593 41982 46130
13442D6130J8951N778q718j0986M526K7824J0318j2215J219l1095r132P501Q340
13429E8441R731o674k521R241M334n49j069J131j6425k0102j0095J0820J7715
13416E3978R794m818l472p211j6009k0045j0463J0707J1730O356R678J0801l670
13403D7356j0414Q916n63K92J148r390Q24J3420K711p434k680Q003J8756m585
13389F6360n853j3941j2150j5442l719K525K0817L191J0652N261M216q000k0531
13376C3386Q441P837M431k746j4735j9615J5110J3828k3253r204j2047K1823K2282
13363D5538N230J214L403L003K03j0598o366j5504r642k418l483N864P153K657
13349B6254r092K982j0403j1304J680K1301J6966M142o107L621l63j0724k0408
$$ plain form
13442 46130 65081 70859 62141 51155 55681 83505 93823 81608 82827 51732 42600 50101 58441
13429 58441 68172 61498 58977 68218 72552 72003 70934 72065 55640 35538 25443 36263 53978
13416 53978 63772 58954 55482 48271 32262 12217 1754 12461 24191 30547 40225 51026 47356
13403 47356 36942 45858 45295 45587 46735 37345 38169 51589 54300 46866 44186 52189 70945 66360
13389 66360 60507 46566 34416 18974 15255 17780 38597 41788 52440 57701 61917 53917 33386
13376 33386 41827 49664 54095 51349 36614 16999 32109 45937 22684 13480 1433 23256 45538
13363 45538 50768 51982 55385 58388 58591 47993 41627 26123 16481 14063 10580 16444 23597 26254
13349 26254 17162 20144 9741 -1563 117 21418 38384 42526 36419 40040 39677 28953 8545
13336H545J2351R403j8197J2947J5538K50j3495R069O235k2278n547J8558l21
13323C3058l705j0683j1827n686J9581K0201j4185J61J2433r496m186K663R024
13310C7353j8055r000R989R878Q039j0607J3366J5490o417j0017P546L256k3174
13297B7647k1678P87O755K745J2782J7562K872r306q469N116J0266J7250K795
13284F7124J3560j0814j0640J284n019L655j3824M337K308j206J3460J2734L062
13271H0021k306J705Q622J3722R520J5707q426j2700m744J1003J6484L947J4680
13258A47235J4807J5215O294M855R266J0584J7106K5953K0127J8258Q048J855
13246B99603J7748J3623K2468J6592K4638L2376K1510L528J6287J0813Q322m27
$$ plain form
13336 8545 20896 30299 12102 25049 40587 40837 27342 36411 42646 20368 14821 33379 33058
13323 33058 29353 18670 6843 1157 20738 40939 26754 26915 39348 29852 25666 28329 37353
13310 37353 19298 10298 20287 30165 38204 27597 40963 56453 50036 40019 47565 50821 27647
13297 27647 5969 6756 13511 16256 29038 46600 49472 40166 31697 36813 47079 64329 67124
13284 67124 80684 69870 59230 60514 55495 59150 45326 49663 51971 50765 64225 76959 80021
13271 80021 77715 79420 88042 101764 111284 126991 118565 105865 101121 112124 128608 132555 147235
13258 147235 162042 177257 183551 188406 197672 208256 225362 251315 271442 289700 297748 299603
13246 299603 317351 330974 353442 370034 394672 427048 448558 452086 468373 479186 487508 487081
13234D87081n764j5464p245k070q462m492M74N486P92L215j0709j0874j1119O704
13220D27553L0798Q325j7942k6406j7957k0121r270k4909k8176r465l933n903
13208C02594j7391m2353l5396l1056n499r569j831P926m289j2839J9896K9628
13196A99821R878Q419M715K0645J2888J2205j9133k3202m3323n3305k9920j2249
13184H7439m923j6639l382j7154K103j6118K591R941M860L642j449p445Q343J9268
13170G1077n132l356m827M399j666l684K4904Q406n72j170Q030L163R038J5432
13156A24042J3693L3099L7302N1576N4016O0016P3851O7108N8706N1399R300n5909
13144E78199j07778j41600q7690m1362l6203k8795j6083k5663l1158k2426J448
$$ plain form
13234 487081 481317 465853 458608 456538 448076 443584 444058 449544 450336 453551 442842 431968 420849 427553
13220 427553 458351 466676 448734 422328 404371 384250 374980 350071 321895 312430 308497 302594
13208 302594 285203 242850 207454 176398 170899 161330 159499 167425 163136 150297 170193 199821
13196 199821 209699 218118 222833 243478 256366 268571 249438 226236 182913 129608 99688 87439
13184 87439 82516 65877 62495 45341 47444 31326 33917 43858 48718 52360 50911 43466 51809 71077
13170 71077 65945 62589 57762 62161 60495 56811 81715 90121 89549 88379 96409 99572 108610 124042
13156 124042 137735 170834 208136 259712 313728 373744 447595 514703 573409 624808 634108 578199
13144 578199 470421 328821 241131 199769 163566 134771 118688 93025 61867 39441 40889
13133D0889J2438o860j1187O691J7979P217n595m567J4189m569O849o987r507
13120E6980Q555m98J9202L459n99K5188Q028O38J9903Q036O223K2022K9917N6228
13106B63282R2624Q2918N8719M6972L6840L7575j2790q6736j15321j36374q9322
13095A78387n7722k5977J699j3062k3757k3090J6605J3003k4872n793J666J0409
13083D7496n021j251N098P755L656k5720q959n068N127O684j6311j9849J2124
13070E761l330J1865J9837J5281R621j2003N556j141J3794L9431K3603k626R512
13057A35161K4340J6005j1468l7118j5102j9508j3173L559l0478p350K1351j255
13045F4964k8091k159j9693r37K251p064R91l514J434R044M659l727K130R995
$$ plain form
13133 40889 53327 46467 35280 41971 59950 67167 61572 57005 71194 66625 73474 66487 56980
13120 56980 65535 65037 84239 87698 87099 112287 120315 120953 140856 148892 155115 177137 207054 263282
13106 263282 355906 438824 497543 544515 581355 618930 606140 519404 404083 267709 178387
13095 178387 120665 94688 96387 83325 59568 36478 53083 66086 41214 35421 37087 47496
13083 47496 42475 41224 46322 54077 57733 32013 23054 17986 23113 29797 13486 -6363 5761
13070 5761 2431 14296 34133 49414 59035 47032 52588 51447 65241 104672 128275 125649 135161
13057 135161 159501 175506 164038 126920 111818 92310 79137 82696 52218 44868 66219 64964
13045 64964 36873 34714 15021 14084 16335 9271 10262 6748 8182 17226 21885 18158 20288 30283
13031C0283p676j6339j0462P048K9733J6640j3227j6598K305r059m660J5932k0430
13018C490q032J1607J3741Q17Q899J3415k0751j5678L363k384Q760m454L832O384
13004B3009j0693k750n140Q895Q390M324p190q92k4537n02J1010P626k078j7584
12990h112J1207J2879m744j2750N042R206j473K451J6789M531L309m798M109o530
12976C1116p203j3764q146K6068J2188j3711p603o185j2034k326j3806q73P561
12963h718J5197K4878p95j9859q069n525J3619O119k5440k311J066j4012n12J5226
12949i136o992k5832J6006K4354R435p358P041J5126k287j820J050Q435k9573
12936a551k003K5426L923m914k711M16M958k694j2280M470r777m967M94p651j956
$$ plain form
13031 30283 22607 6268 -4194 2854 32587 49227 36000 19402 21707 12648 7988 23920 3490
13018 3490 -4542 7065 20806 21623 30522 43937 23186 7508 10871 8487 17247 12793 16625 23009
13004 23009 12316 9566 4426 13321 21711 26035 18845 17953 -6584 -7086 3924 11550 9472 -8112
12990 -8112 3095 15974 11230 -1520 3522 12728 11255 13706 30495 35026 38335 33537 37646 31116
12976 31116 23913 10149 2003 28071 40259 26548 18945 12760 726 -1600 -15406 -16279 -8718
12963 -8718 6479 31357 30562 10703 2634 -2891 10728 16847 -8593 -10904 -9838 -23850 -24362 -9136
12949 -9136 -16128 -41960 -25954 -1600 7835 477 7518 22644 20357 18537 19587 28022 -1551
12936 -1551 -3554 21872 25795 20881 18170 18586 23544 20850 8570 13040 3263 -1704 -1210 -8861 -10817
12921a0817K163R579J165R535l434n354K5309K858P324J936r306j5666m996j7757
12907g461p460J3765l567L075L771p323R613l68N534n880L573L564O012L596k988
12892A7456j1268J98p47K3867J0683j8059l72k161K046j5731m224J7712j16J3361
12878C2645k487j6565o655J5368J2653Q316R21q591M12N84j0580N679m23j8220
12864A3057M600p949J033O302O937m61j2419j3041q903O307l597j1262R974K3403
12850A3981Q539p157k1683j2913J2172N936J4403p457k919R638J0694m284P912
12837B6862O206j4950O801j1206j0578R87R478j88p778o6J9432J8284m199N137
12823D4222o246O79p026p810q81j335J652Q976L208j6398r098j7510n476K343
$$ plain form
12921 -10817 -8654 925 2090 11625 8191 2837 28146 31004 38328 40264 30958 15292 10296 -7461
12907 -7461 -14921 -1156 -4723 -1648 2123 -5200 4413 4045 9579 3699 7272 10836 16848 20444 17456
12892 17456 6188 6386 5639 29506 40189 22130 21758 19597 21643 5912 1688 19400 19284 32645
12878 32645 30158 13593 6938 22306 34959 43275 44196 35605 36017 36601 26021 31700 31277 13057
12864 13057 17657 9708 10741 17043 23980 23519 11100 -1941 -10844 -4537 -8134 -19396 -9422 13981
12850 13981 22520 15363 -6320 -19233 -7061 -1125 13278 5821 2902 12540 23234 18950 26862
12837 26862 33068 18118 24919 13713 3135 4122 13600 13412 5634 5568 25000 43284 39085 44222
12823 44222 37976 38655 31629 23819 22938 21603 23255 32231 35439 19041 9943 -7567 -13043 -10700
12809a0700L0272J0670o178j4158k827j2037J0063J4721M315j3689r453R83j0670
12796h688j4617J2789K7746J5441l980N386J0103p5K140J1174k481J2104Q845
12783G5887k4538p072K560p980k2833j0315j700j440J1458M644k861l550j304
12770A0956j0822J733N728J8704N222n046J0713o998k7993M853l265K721J2295
12757A8801k108j372R804p545l781O21j214l691j3668J2484K167j0419l217J0491
12743G353P141J6912K7057j195k2920p870p780k790m313J5511J0382p295K073
12730C2266P198n187n585j4764k820J4259J3419Q155K783o185N704J4816j2173
12717E1886J4830J6848N061p973j8177P333j126R670j0010m071L296j948R5J4100
$$ plain form
12809 -10700 19572 30242 24064 9906 7079 -4958 5105 19826 24141 10452 999 1982 -8688
12796 -8688 -23305 -10516 17230 32671 28691 34077 44180 44105 46245 57419 54938 67042 75887
12783 75887 51349 44277 46837 38857 16024 5709 4009 2569 14027 18671 15810 12260 10956
12770 10956 134 1867 7595 26299 31521 26475 37188 30190 2197 7050 3785 6506 18801
12757 18801 16693 15321 25125 17580 13799 14420 13206 9515 -4153 8331 10498 79 -3138 7353
12743 7353 14494 31406 58463 57268 34348 26478 18698 15908 11595 27106 37488 30193 32266
12730 32266 39464 34277 28692 13928 11108 25367 38786 46941 49724 43539 49243 64059 51886
12717 51886 66716 83564 88625 80652 62475 69808 68682 78352 68342 64271 67567 65619 65714 79814
12703G9814p806j0438Q156P969k1096j7713J2865P491m071R83J3656K753N081
12690G7644k0757m959N025N922r210L064K2157o030k9574l2K676p163j8688q254
12676A1821K956L911N955J8956M944K6749J309j6621o841q407j3562Q236K001
12663D1407p762J1854K3025l781J770R758j2727J112J450k2679J5694O075o373
12650E8823J706J5816Q8K919M431o563j0318j2476M379k124N894L828n774j4948
12636D5681R983J355j2125r367J4095J7881k991M36j5343m846K765K0748O954
12623G5226j3990j5888K62O620R571K1087K141p114l175k1922K3639L477J7646
12610I7580K0029L747l231K2480K2894j840j4762K1610J2916J8796k081n311O55
$$ plain form
12703 79814 72008 61570 69726 77695 56599 38886 51751 59242 55171 56154 69810 72563 77644
12690 77644 56887 51928 56953 62875 53665 56729 78886 72856 43282 43250 45926 38763 20075 11821
12676 11821 14777 18688 24643 43599 48543 75292 76601 59980 53139 44732 31170 39406 41407
12663 41407 33645 45499 68524 64743 66513 76271 63544 64656 66106 43427 59121 65196 58823
12650 58823 60529 76345 76433 79352 83783 77220 66902 54426 58805 56681 62575 66403 60629 45681
12636 45681 55664 57019 44894 35527 49622 67503 64512 64948 49605 44759 47524 68272 75226
12623 75226 61236 45348 45610 52230 61801 82888 85029 77915 74740 52818 76457 79934 97580
12610 97580 117609 121356 118125 140605 163499 161659 146897 168507 181423 200219 198138 192827 193482
12597A93482M718R516K3053M1878K7795K8320J3017L0007J7129o751k395J3320
12585C93089O338L2588L6397L3924M217K7806N4416L9620N1800N3753N1606N0286
12573H35840N2174N6313P9612J46818J86945J75548J30221J66790J66439J0131
12563B006831j86036j72066p7630j2400j9989q5814q7531n7228j791K3474M1371
12552A371191P5756Q4158R0854N7205K6927n600j7230N4651Q8259P2921M9501
12541A948593L7020Q6462J00134K5168k716l8741k234M6914R8397J42755J97811
12530B639563J89399K24959L05830L19027K42422J73311K17451K23515m4972m96507
12520C993998o41815m60370k50841j38492j45481j84168j33455q1595o7914l7579
$$ plain form
12597 193482 198200 207716 230769 272647 300442 328762 341779 371786 388915 382164 379769 393089
12585 393089 399427 432015 468412 502336 506553 534359 588775 628395 680195 733948 785554 835840
12573 835840 888014 944327 1023939 1170757 1357702 1533250 1663471 1830261 1996700 2006831
12563 2006831 1820795 1648729 1571099 1558699 1538710 1452896 1365365 1308137 1306346 1329820 1371191
12552 1371191 1446947 1531105 1621959 1679164 1706091 1700491 1683261 1737912 1826171 1899092 1948593
12541 1948593 1985613 2072075 2172209 2197377 2194661 2155920 2153686 2200600 2298997 2441752 2639563
12530 2639563 2828962 3053921 3359751 3678778 3921200 4094511 4311962 4535477 4490505 3993998
12520 3993998 3352183 2891813 2640972 2502480 2356999 2172831 2039376 1957781 1889867 1852288
12510A852288k709R676J4009k6152r5959j12195j10254n3438k8998k0108l2123
12499A394037l0175l827R496j2715n5706o1930k4022k9987J9179O1268O8881Q5597
12487A420096J05166J23867R0009j1499p4174j2127L7392k9340k38933l54285
12477A056172k32835j51241p4334m4395j7902P604J7377k3727o7841p5597n4952
12466C38329k4808l158k2484j0845p757R898J8726k631k7038j7491O84K3010l618
12453B70817j7280l3890k4602j3250K2114L0635m721l682j1135J1708J1079P630
12441B45423p759J344m199P707P02J6599j3757r118M355N449q775j842m909o824
12427B24396k451N82k5113k0914k2615k3401J0957R070J8724j2456j6072l0941
$$ plain form
12510 1852288 1849579 1859255 1873264 1847112 1751153 1638958 1528704 1475266 1446268 1426160 1394037
12499 1394037 1363862 1360035 1369531 1356816 1301110 1239180 1215158 1185171 1204350 1265618 1334499 1420096
12487 1420096 1525262 1649129 1739138 1727639 1653465 1641338 1678730 1649390 1410457 1056172
12477 1056172 823337 672096 597762 553367 535465 543069 560446 536719 468878 393281 338329
12466 338329 313521 310363 287879 277034 269277 279175 297901 295270 268232 250741 251425 274435 270817
12453 270817 253537 219647 195045 181795 203909 234544 229823 226141 215006 226714 237793 245423
12441 245423 237664 239008 234809 242516 243218 259817 246060 236942 241297 246746 237971 236129 231220 224396
12427 224396 221945 222527 197414 176500 153885 130484 141441 150511 169235 156779 140707 109766
12415A09766j1784K3546j908p583n067M843J942j3553j1035j964K930k673j515
12402H5945Q402Q335J5361J9034Q440j4217j3710j8848N557L079k3991k4737o496
12389E2154J9743o810j9006p468j3999J1518J2121r391j5308n678m473k872k1658
12376a1127K510J4703j2141Q264Q901n212l426L993q679L319j0308M880J0633
12363F310k44n649M911J61P615J7951j2193j2646M824j2326j5536J1898J1828
12350F904L382J6707Q340k7859j8866J7481J9860m804k9350k352Q029J7038J1021
12337B5531l3736k2370N703K1386J8977P096J9593p022k4302R76r650J0272K758
12324A5212m234m331r071N010K775N830M366N485l335j1351m22K3932p746k038
$$ plain form
12415 109766 97982 121528 119620 112037 106970 111813 113755 100202 89167 87203 90133 87460 85945
12402 85945 94347 102682 118043 137077 145517 131300 117590 98742 104299 107378 83387 58650 52154
12389 52154 71897 65087 46081 38613 24614 36132 48253 38862 23554 17876 13403 10531 -11127
12376 -11127 -8617 6086 -6055 2209 11110 5898 2472 6465 -2214 1105 -9203 -4323 6310
12363 6310 6066 417 5328 5489 13104 31055 18862 6216 11040 -1286 -16822 -4924 6904
12350 6904 10286 26993 35333 7474 -11392 6089 25949 21145 -8205 -10557 -2528 14510 25531
12337 25531 -8205 -30575 -24872 -3486 15491 22587 42180 35158 10856 11832 2182 12454 15212
12324 15212 10978 6647 -2424 2586 5361 11191 15557 21042 17707 6356 5934 29866 22120 20082
12310B0082l399R926J9038j6746j3497j3133O030J3702O722k271j5265k34J1805
12297B2760J9283j0866l7298m864n273p916j674j637O866P651L312J3903J4315
12284A8562P810l2855j5767M377J0339K709q434o140N552K5211Q9N067j1158n146
12270B16P927j4155j1912N830N749K905j191j009O177P98k222L420n724J8027
12256A4836j369K352L070n37j9516O16L113j086R41n943j7247n797N626J8328
12242b613P104j2296p311L801m778J4449j0376m667J2611j264J587P640p597k772
12228f482k586P51Q530J326J1422J229k1489j3406j2616j1035J027R392K1281
12215a2656M069j3306m229P184L639K842n575L130j5065o135L066j905J0469R722
$$ plain form
12310 20082 16683 26609 45647 28901 15404 2271 8301 22003 28725 26454 11189 10955 22760
12297 22760 42043 31177 -6121 -10985 -16258 -24174 -25848 -27485 -20619 -12968 -9656 4247 18562
12284 18562 26372 -6483 -22250 -17873 -7534 -4825 -13259 -19399 -13847 11364 11453 16520 5362 216
12270 216 8143 -6012 -17924 -12094 -6345 -3440 -4631 -5640 537 1335 -887 2533 -3191 14836
12256 14836 13467 15819 18889 18352 -1164 -548 2565 1479 2420 -3523 -20770 -26567 -20941 -2613
12242 -2613 4491 -7805 -15116 -11315 -16093 -1644 -12020 -16687 -4076 -5340 -3753 3887 -3710 -6482
12228 -6482 -9068 -8317 213 1539 12961 14190 -7299 -20705 -33321 -44356 -43329 -33937 -12656
12215 -12656 -8587 -21893 -26122 -18938 -15299 -12457 -18032 -14902 -29967 -36102 -33036 -34941 -24472 -14750
12201a4750Q823K449p139k7964n487N018J3169n826J8793K8493j4659l0702K1942
12188g840J5327j4426j1362j1124M282J8844J2579n5N282j485R907K568o006O176
12174B2667P790O607j2133R589Q99k5096k1204j097r66o24K076M833J7102k624
12160G819K5N11j1963j7521J4160J9978J2942m155m359J6105k931j6256j2125
12147B230k833J8612j2728p432n296o140M965L423J0204P39o948R637N110n896
12133G647P98J5198r070p595J0953k165j4873q44N774J3998R122J7906M366j3780
12119C7435N856K9516P684j5791J615j1880q50K386J6938k210M055K1280j4468
12106H1566q313K3682P559J6552K380l686p396k7818j2183k8093j0825J2640J0707
$$ plain form
12201 -14750 -5927 -3478 -10617 -38581 -44068 -39050 -25881 -31707 -12914 15579 920 -29782 -7840
12188 -7840 7487 -6939 -18301 -29425 -25143 -6299 6280 6225 11507 10022 19929 22497 16491 22667
12174 22667 30457 37064 24931 34520 35419 10323 -10881 -11978 -12944 -13568 -11492 -6659 10443 7819
12160 7819 7844 8355 -3608 -21129 -6969 13009 25951 21796 17437 33542 30611 14355 2230
12147 2230 -603 18009 5281 -2151 -7447 -13587 -8622 -5199 5005 5744 -1204 8433 13543 7647
12133 7647 8445 23643 14573 6978 17931 15766 893 49 5823 19821 28943 46849 51215 37435
12119 37435 43291 72807 80491 64700 66315 54435 53585 55971 72909 70699 74754 96034 81566
12106 81566 73253 96935 104494 121046 123426 119740 112344 84526 72343 44250 33425 46065 56772
12093E6772k12j8084k4869Q529O344k0239j3610k035P113N617N011j0235J1509
12080A1611j8371r955J0035P058p620q19J2965k78q342O725P623M299k766q618
12066C547l333L064M094k988o864L004r2K5073L506r641K34k5293k403k913K905
12051h100L451N02j466N414M980J878N4O736J0446M730J2442R8k5334j0020k1899
12036a6088j4037K7229K5248k438p530j4241q986O221J0376J3732j5175n907k009
12023c605J120n075K7010K3710j6185k1435o418J1521k1648j3231K0557k145m253
12010a0077n641j8608P008J1479m962j2518J678Q66j5556J0239n728Q564O986
11997b6270N468M660L610r346j0021l321j772j640K5220J9747J1834j7729J8836
$$ plain form
12093 56772 56560 38476 13607 22136 28480 8241 -5369 -7404 -291 5326 10337 102 11611
12080 11611 -6760 -16715 -6680 378 -7242 -8061 4904 4626 -3716 3009 10632 14931 12165 3547
12066 3547 214 3278 7372 4384 -2480 524 432 25505 29011 19370 19604 -5689 -8092 -11005 -8100
12051 -8100 -4649 -4147 -5613 -199 4781 6659 6713 13449 23895 28625 41067 41165 15831 5811 -16088
12036 -16088 -30125 -2896 22352 19914 12384 -1857 -10843 -4622 5754 19486 4311 -1596 -3605
12023 -3605 -2485 -7560 19450 43160 26975 5540 -878 10643 -11005 -24236 -3679 -5824 -10077
12010 -10077 -15718 -34326 -27318 -15839 -20801 -33319 -31641 -30775 -46331 -36092 -41820 -33256 -26270
11997 -26270 -20802 -16142 -12532 -21878 -31899 -35220 -36992 -38632 -13412 6335 18169 440 19276
11984A9276L900r601k3931q356K0231J4036R425j7003j4041j520N048L242L713
11971D419J6238R428r429P778O817j1370j144R812o633k21O079P521k705j4199
11957B2391j0947M908J9606M076k2819j9460O434j826l316P126K288L453j9965
11944h051j768O658q392O520J2318M833P177o936j1163q832N046o928M562Q182
11930C226J2702j4902j2802j5264J99J3064J2982J474p460j084J3374k229L078
11917F358j3830j2472J3803j021o503P972m369l540J2964J7296m333p608p389
11904b672P762N755j5405O415n184K8319J26l2076p281J7237n673r191l1203j3360
11890e6431J2051j142J4531J870J2002J9672o964p840K1359m233K530J1632R434
$$ plain form
11984 19276 23176 13575 -10356 -18712 1519 15555 24980 7977 -6064 -7584 -2536 706 4419
11971 4419 20657 30085 20656 28434 35251 23881 22737 32549 25916 25695 31774 39295 36590 22391
11957 22391 11444 16352 35958 40034 17215 -2245 4189 2363 -953 6173 8461 11914 -8051
11944 -8051 -9819 -3161 -11553 -5033 7285 12118 19295 12359 1196 -7636 -2590 -9518 -4956 3226
11930 3226 15928 1026 -11776 -27040 -26841 -13777 -795 679 -6781 -7865 5509 3280 6358
11917 6358 -7472 -19944 -6141 -7162 -13665 -5693 -10062 -13602 -638 16658 12325 4717 -2672
11904 -2672 5090 10845 -4560 1855 -3329 24990 25116 -6960 -14241 2996 -2677 -11868 -43071 -56431
11890 -56431 -44380 -45522 -30991 -29121 -17119 2553 -4411 -12251 9108 4875 7405 19037 28471
11877B8471q326k6033K56K308n424j2590o405m856J2958J3969j0207n292R962
11864a1209N808K3070R507r430k1281J215j729J4223O496O78J1010L764n808j7761
11850H553o600j2613N452K555Q324J567M939m41j8153J2752P235j4809l587M538
11836b88R723j3384j5808j2397J3555N854J8943J4041j7520j7511J5087J7516
11824A7811j7616k2423K645P286R816j4229o553r23j0503N238J2219Q568O101
11811b563m166R499j5742j8593j8033K1472K7008J497n794j1351J4711m032L938
11798b149l310j087j915k79j2448J3918K1802j6760q454N045J0146K028P423j5764
11784a804M325L487q920O138J8687j1183k9805q463M468K0112J303m183l114j3966
$$ plain form
11877 28471 20145 -5888 -5632 -3324 -8748 -21338 -27743 -32599 -19641 -5672 -15879 -21171 -11209
11864 -11209 -5401 17669 27176 17746 -3535 -2320 -4049 10174 16670 17348 28358 32122 26314 8553
11850 8553 1953 -10660 -5208 -2653 5671 7238 12177 11736 -6417 6335 13570 -1239 -4826 -288
11836 -288 9435 -3949 -19757 -32154 -18599 -12745 6198 20239 2719 -14792 295 17811
11824 17811 195 -22228 -19583 -12297 -2481 -16710 -23263 -24186 -34689 -29451 -17232 -8664 -2563
11811 -2563 -6729 2770 -12972 -31565 -49598 -28126 -1118 379 -5415 -16766 -2055 -6087 -2149
11798 -2149 -5459 -6546 -8461 -8740 -21188 -7270 14532 -2228 -10682 -5637 4509 6537 13960 -1804
11784 -1804 2521 6008 -2912 3226 21913 10730 -19075 -27538 -23070 -2958 -1655 -5838 -8952 -22918
11770b2918o627K2945Q971j0230m967N632l436k0845K083J3738J5944P827R17
11757I034M80k7500j3997K906J4562M933r298o167J3355J0203k383m817n568J4997
11743G40j355l347m789q423K0605J4119k0448k8864n488K2356K78k0752R923J5214
11729a0231l2558l379L636J0689L1598R404n993j1320K025J079l562j9050n372
11716c3034J7193J1575M698n175J877j1560J4269J6380j9500K366j447q397L36
11703a0419O406R180L440j074j7148r664J031M79Q743j0080J2368J3708q28m177
11689A965J0309q251j2120J7925l723k5114j2490J396J4733J7636l790j8880N072
11676a5332J4083j3358k3301j248k578%O375k26J7507J7822k169j335p206o339
$$ plain form
11770 -22918 -29545 -6600 2371 -7859 -12826 -7194 -10630 -31475 -29392 -15654 290 8117 9034
11757 9034 9514 -17986 -31983 -29077 -14515 -9582 -18880 -25047 -11692 -1489 -3872 -8689 -14257 740
11743 740 -615 -3962 -8751 -17174 3431 17550 -2898 -31762 -37250 -14894 -14616 -35368 -25445 -10231
11729 -10231 -42789 -46168 -42532 -31843 -245 9159 3166 -8154 -6129 -5050 -8612 -27662 -33034
11716 -33034 -15841 -4266 432 -4743 -2866 -14426 -157 16223 -3277 -911 -2358 -10755 -10419
11703 -10419 -4013 5167 8607 7533 -9615 -19279 -18248 -17769 -9026 -19106 -6738 6970 6142 1965
11689 1965 12274 4023 -8097 9828 6105 -19009 -31499 -30103 -15370 2266 -1524 -20404 -15332
11676 -15332 -1249 -14607 -37908 -39156 -41734 -41734 -35359 -35585 -18078 -256 -2425 -3760 -10966 -17305
11662a7305j598j14j2859n337K3382j2609q995K155J374k072R070K2090J5041
11649A2223M709k3950M26J8240j4933k3614n269K7929J4517O69q640J6141Q260
11636B6708j3778j1705O620K2738M624k93j6880j9920L35N676j2066r596M34N607
11622a1496M084j6046K823J1743R844q31j1671r14j7512J0576k934j2287R321
11609b5300j694J0492J782J0516o054J6519P830p988m557j3442r571r729N496
11596b5700P378P810n016J5530J7194n137R674l39j3690j0158o413R845p873P406
11582E11J0894m985n427o136o683j1216K194J072J0270J140J5973K483k4311j3277
11568b7498j821J3851J6883r72j1736m514J999k354q368P547K2018J043k4131
$$ plain form
11662 -17305 -18903 -19017 -31876 -37213 -13831 -26440 -35435 -33280 -31906 -33978 -24908 -2818 12223
11649 12223 16932 -7018 -6592 11648 -3285 -26899 -32168 -4239 10278 10947 2307 18448 26708
11636 26708 12930 1225 7845 30583 35207 34914 18034 -1886 -1551 4125 -7941 -17537 -17103 -11496
11622 -11496 -7412 -23458 -20635 -8892 952 121 -11550 -12464 -29976 -19400 -22334 -34621 -25300
11609 -25300 -26994 -16502 -14720 -4204 -10258 6261 14091 6103 1546 -11896 -21467 -31196 -25700
11596 -25700 -18322 -10512 -15528 2 17196 12059 21733 21394 7704 -2454 -8867 978 -6895 511
11582 511 11405 6420 993 -5143 -11826 -23042 -20848 -19776 -9506 -8366 7607 10090 -14221 -27498
11568 -27498 -29319 -15468 1415 443 -11293 -15807 -13808 -16162 -24530 -16983 5035 6078 -18053
11555a8053k2447k0256J1778R974j693j0554Q74J3112K818J9607l628k6767M62
11542d4773J6038p558l746J4044K0016J8972j765r935j4001l829J2943L220n693
11529f067J1145K5481p842j9641j0568m84R39r564m372J6631k500J0830k5050
11516b1062k291J3420o787j4411K905j89Q852k1281j232N033K834n789j110l635
11502d4743J1591J2595p900j1261K364J0098k955k012N329p30q148Q089J5517
11489a2166j5382k7534J9233J8591J765o161J2451L761k853M512L693j5646m213
11476a9949K481o849j641R548R831R026j6169p520J7749K4768j356k3011o55K449
11462a298J381Q072j3063k2100R12K2703K0197J528n329P353m961o308q711j5554
$$ plain form
11555 -18053 -40500 -60756 -48978 -39004 -40697 -51251 -50377 -37265 -34447 -14840 -18468 -45235 -44773
11542 -44773 -28735 -36293 -40039 -25995 -5979 12993 11228 1293 -12708 -16537 -3594 -374 -6067
11529 -6067 5078 30559 22717 3076 -7492 -7976 -7037 -16601 -20973 -4342 -6842 3988 -21062
11516 -21062 -23353 -9933 -16720 -31131 -28226 -28415 -19563 -40844 -42076 -37043 -34209 -39998 -41108 -44743
11502 -44743 -33152 -20557 -28457 -39718 -37354 -27256 -30211 -32223 -26894 -27624 -35772 -27683 -12166
11489 -12166 -27548 -55082 -35849 -17258 -15493 -21654 -9203 -5442 -8295 -3783 -90 -15736 -19949
11476 -19949 -17468 -24317 -25958 -16410 -6579 2447 -13722 -21242 -3493 21275 19919 -3092 -3747 -1298
11462 -1298 83 8155 -4908 -27008 -26096 -3393 16804 18332 13003 20356 15395 9087 376 -15178
11448a5178p386M587O79J3186R580O648o053j1229O726o808l0165m770o643J8694
11434b8132o648m761q193K629K803J0715J5624K0366n202j7956p976N375j988
11421b3344r947L533O165J1219j0693Q604J383P55R421k300J3406O627K530j1354
11407F005n822o044jL630J1523l205m05k0707N08L002K018J9395Q883j1846l5316
11392b8382n364Q030p740R883J6090J6568j6517m674R573j41Q885j0976M283K525
11378B043j798q298K677o04p502r095J6458O302n179o428j1432k1316n176K6373
11364b2975J1519J2521p048j4520l869O498j2500J809J5940K2612P789j9296j2265
11351a3785K165Lj2803J8605m932o910J2493Q392m239q215R882O291k828K296
$$ plain form
11448 -15178 -22564 -17977 -17298 -4112 5468 12116 6063 -5166 1560 -5248 -35413 -40183 -46826 -28132
11434 -28132 -34780 -39541 -47734 -45105 -42302 -31587 -15963 4403 -799 -18755 -26731 -21356 -23344
11421 -23344 -33291 -29758 -23593 -12374 -23067 -14463 -13080 -12325 -2904 -5204 8202 14829 17359 6005
11407 6005 183 -5861 -5862 -2232 9291 6086 5681 -15026 -14518 -11516 -9498 9897 18780 6934 -28382
11392 -28382 -33746 -25716 -33456 -23573 -7483 9085 -7432 -12106 -2533 -2674 6211 -4765 -482 2043
11378 2043 245 -8053 -5376 -5980 -13482 -22577 -6119 183 -4996 -11424 -22856 -44172 -49348 -22975
11364 -22975 -11456 1065 -5983 -20503 -24372 -17874 -30374 -28565 -12625 9987 17776 -1520 -13785
11351 -13785 -11620 -11617 -24420 -5815 -10747 -17657 -5164 3228 -1011 -9226 656 6947 4119 6415
11337F415J526p219k7236l143J0267J4075j3391j9891J929K1676J2966j835j2797
11324a6658j5517Q153J9792O972N446p757M483L315J1593K13j946p095L304o493
11310G805k774k538j0931J2931J1331j118j988j4071q654k552j7211j8254l658
11297e1682o970J380K4506P971m752R452R247J060j662j6100m656p738j817N464
11283c6297K2114K5774J2880J4307l48n522o770n186j4731j6316n035J6717q53
11270G34J3658N76j2340k3141l3612M373o67P215J5897L1377K231j818P641q657
11256C467K255J0540m647n280q296r797J6684J4885N67j1081j2888k203q17J5836
11242I225J8096j7552j5699k382J2466l607k2899k1911J6254J9112J1806J0035
$$ plain form
11337 6415 7941 722 -26514 -29657 -19390 -5315 -18706 -38597 -36668 -14992 -2026 -3861 -16658
11324 -16658 -32175 -24022 -4230 2742 8188 431 4914 8229 19822 20035 18089 10994 14298 7805
11310 7805 5031 2493 -8438 4493 15824 14706 12718 -1353 -10007 -12559 -29770 -48024 -51682
11297 -51682 -58652 -57272 -32766 -24795 -29547 -20095 -10848 -9788 -11450 -27550 -32206 -39944 -41761 -36297
11283 -36297 -14183 11591 24471 38778 38430 32908 26138 20952 6221 -10095 -15130 1587 734
11270 734 14392 14968 2628 -20513 -54125 -49752 -50419 -43204 -27307 4070 6301 4483 12124 3467
11256 3467 5722 16262 11615 6335 -1961 -11758 4926 19811 20378 9297 -3591 -5794 -6611 9225
11242 9225 27321 9769 -5930 -8312 4154 547 -22352 -44263 -28009 -8897 2909 12944
11230A2944j4415J067l757R083j016k0930j345l250l228J9680N007j9157k4362
11217d3679R247O580J6198J4082n966o013J4024K3K972j537r60j6222m935J7855
11203A669q404l0697J2469J4918q268j0454M209k0001j4756J0004P595Q107q34
11190c4443k29N228K469R832O848M525K860J9178n104o807J1847j014q219J0182
11176A7153p758l199q125k384q273M193r265n054J0500K150K715L550K957Q004
11162G164J825p435Q68j0071P72j3290K05J528L26J096J1193m816J3813k1521
11148a8343j3680J3364J7767O356j5684k3109J6790N748n276n669O258J4479J1715
11135A0716j1494r763m615o710q169m867J2317Q283R486K166k520J505q018q000
$$ plain form
11230 12944 -1471 -404 -4161 4922 3906 -17024 -18369 -21619 -24847 -5167 -160 -19317 -43679
11217 -43679 -34432 -27852 -11654 2428 -3538 -9551 4473 4496 7468 5931 4971 -11251 -16186 1669
11203 1669 -6735 -37432 -24963 -10045 -18313 -28767 -24558 -44559 -59315 -49311 -41716 -33609 -34443
11190 -34443 -34672 -29444 -26975 -17143 -10295 -5770 -2910 16268 11164 4357 16204 15190 6971 17153
11176 17153 9395 6196 -1929 -4313 -12586 -8393 -17658 -22712 -12212 -10062 -7347 -3797 -840 7164
11162 7164 8989 1554 2422 -7649 -6877 -20167 -19962 -18434 -18108 -17012 -5819 -10635 3178 -18343
11148 -18343 -32023 -18659 -892 5464 -10220 -33329 -16539 -10791 -16067 -21736 -15478 -999 10716
11135 10716 -778 -10541 -15156 -21866 -30035 -34902 -22585 -14302 -4816 -2650 -5170 -3665 -11683 -19683
11121a9683j0731J2203K2939j0973R525K5269J199p080l6904j7650K1000K2066
11109A1180J3866N164k6974L204J8982M88N107r819j2007J380Q145j4901k5540
11096b1725J009M952o57J1533M567P141o326N721k94j5571k3378J1633O434K879
11082a2082m200p166N15R882J2496J0714l834j2819K518J00o034k160j0125L456
11068a8739K3650K0411j1135r177j6154P737N718M077n294r449j4805o650K1832
11055g978N087j7010j8784k672J4432K5536R756k106O650K948L688r904k8538
11042a8895q614N871L534k140R074k1264o264J7264J3239K490j3769J065P881
11029a0528J6531j6051r864L7430J8149r758k3966j7044j2374P496Q776J3400
$$ plain form
11121 -19683 -30414 -18211 4728 -6245 3280 28549 29748 22668 -14236 -31886 -10886 11180
11109 11180 25046 30210 3236 6440 25422 25910 31017 21198 9191 10571 18716 3815 -21725
11096 -21725 -20716 -15764 -16421 -4888 -321 6820 494 6215 5921 -9650 -33028 -21395 -14961 -12082
11082 -12082 -16282 -23448 -22933 -13051 -555 10159 6325 -6494 -3976 -3876 -9910 -12070 -22195 -18739
11068 -18739 4911 25322 14187 5010 -11144 -3407 2311 6388 1094 -8355 -23160 -29810 -7978
11055 -7978 -2891 -19901 -38685 -41357 -26925 -1389 8367 6261 12911 15859 19547 9643 -18895
11042 -18895 -27509 -21638 -18104 -20244 -11170 -32434 -38698 -21434 -8195 -5705 -19474 -18409 -10528
11029 -10528 6003 -10048 -19912 17518 35667 25909 1943 -15101 -27475 -19979 -11203 2197
11017B197J4354J77J581k557j1414j4353j98k291q869J4507K1038N109n110M292
11003A8463J10j1531j9347n525J4131J0906q437k5359j1592o10J8581l998J0412
10990a3796j332O301j3166P869J132J486K1637L41j659j4692r053J2001M443k127
10976f15j469J994Q031l691j884j4737k347J2026J8571K04L090j7687l460k753
10962d727j661o52r592m361O015m929j466l633J6996K9250J121j2732j2997l002
10948f370n934k9511n14K4393J8071K2023J4271J723N27n547j1371j8319j3289
10935i847k1514q088Q356J1011q58j5355L624K3078J234j3762P33o68J2262j3010
10921b2804m234j8978j0378N230N805N909m09j2526K2562K2532J1869k926m820
$$ plain form
11017 2197 16551 16728 18309 15752 4338 -10015 -10213 -12504 -21373 -6866 14172 19281 14171 18463
11003 18463 18573 7042 -12305 -17830 -3699 7207 -1230 -26589 -38181 -38791 -20210 -24208 -13796
10990 -13796 -15128 -8827 -21993 -14124 -12992 -11506 10131 10472 8813 -5879 -14932 -2931 1512 -615
10976 -615 -2084 -90 7941 4250 2366 -12371 -14718 -2692 15879 16083 19173 1486 -1974 -4727
10962 -4727 -6388 -7040 -16632 -20993 -14978 -19907 -21373 -25006 -8010 21240 22361 9629 -3368 -6370
10948 -6370 -12304 -41815 -42329 -17936 135 22158 36429 38152 38679 33132 21761 3442 -9847
10935 -9847 -31361 -39449 -31093 -20082 -20940 -36295 -32671 -9593 -8359 -22121 -21388 -22056 -9794 -22804
10921 -22804 -27038 -46016 -56394 -51164 -45359 -39450 -39859 -52385 -29823 -7291 4578 1652 -3168
10908c168k2240R539J3000M840k935l5749L576J5543J6710P003Q751K0577j234
10895C4213j9343N313M280k5065j7660l38J4178L09k3215l788q115J7516K0453
10882a262R306l289p141O737J3325j588l238q481j2473J0295j0888q343L024L2898
10868A8882j6331Q93N772P469J2827q091q399m74J7940n22k0652l2800m091j572
10854b9149K9781J7326N95m099o268K0318J4147j0492l551j8936j1321M148j1976
10841i477j3917m745J1700j177Q925l997k1366J5513K0387P408J3770N038j1077
10828A6985j7231o469P420l462k059j1307J4340L6617K295j9898j3259P19o627
10815a936P645k766j4112k4190n845J9549O61R776L152n340K255P763L530N901
$$ plain form
10908 -3168 -25408 -15869 -2869 1971 -964 -36713 -33137 -17594 -884 6119 14870 35447 34213
10895 34213 14870 20183 24463 -602 -18262 -18600 -4422 -4113 -27328 -31116 -39231 -21715 -1262
10882 -1262 8044 4755 -2386 4351 17676 16088 12850 4369 -8104 2191 -8697 -17040 -14016 18882
10868 18882 2551 3444 9216 16685 29512 21421 13022 12548 30488 29966 9314 -23486 -27577 -29149
10854 -29149 632 17958 18553 14454 8186 28504 42651 32159 28608 9672 -1649 2499 -9477
10841 -9477 -23394 -28139 -16439 -17616 -8691 -12688 -34054 -18541 1846 9254 23024 28062 16985
10828 16985 -246 -6715 705 -2757 -4816 -16123 -1783 34834 37129 17231 3972 4691 -1936
10815 -1936 5709 2943 -11169 -35359 -41204 -21655 -20994 -11218 -8066 -13406 -11151 -3388 142 6043
10801F043O78j8031N483J6036J872k09k02K927L550j1791J921p095J0913j4689
10787b594k0128m042J7128K2882k953q997J5999n617p236m607j0927j875k608
10774a5575j742J0220J1917j2000m892J2510o6j994J1590k445o273P521J2820
10761B1591q927r064J537J1946O963l754N545K2012J6460J623j9853N268l363
10748D7984r891J4244J0047k907r271J4287k435P483M578m656p885j0223N571
10735E6926K668J0812J2402K2239K2032J6406R013J5266M2016O6883R8904J19372
10723D94939R3019N9956P1941Q6836J8211k06439k33402j18197p6593n8214j1993
10712A20064k4290j7377k3734k5809j2033r242k041m980L328j4134j0723Q662
$$ plain form
10801 6043 6721 -11310 -5827 10209 12081 11872 11670 14597 18147 6356 8277 1182 12095 -2594
10787 -2594 -22722 -26764 -9636 13246 10293 1296 17295 11678 4442 -165 -11092 -12967 -15575
10774 -15575 -17317 -7097 4820 -7180 -12072 438 372 -1622 9968 7523 1250 8771 21591
10761 21591 12664 3600 5137 17083 24046 20292 25837 47849 64309 65932 46079 51347 47984
10748 47984 38093 52337 62384 59477 50206 64493 62058 69541 74119 69463 61578 51355 56926
10735 56926 59594 70406 82808 105047 127079 143485 152498 167764 209780 276663 375567 494939
10723 494939 587958 647914 719855 806691 824902 618463 385061 266864 190271 132057 120064
10712 120064 95774 78397 54663 28854 16821 7579 5538 558 3886 -10248 -20971 -12309
10700a2309J0079j0939q162K345J065j481l723K643l873j873J0407J0132K5079
10687A9390n94k0510p469o306l899Q593J0299J3718K251Q964p402q222J4750M719
10673B8282L172M299j5251R128K3472L1321j398j9935R918M987J2257k521J0083
10660I7814P911k547K3694J9929N334r081J7104L1568K3647N165J9950J5415K0061
10647B75964K2707J3337K3662K0017M5090L9965M3324O0886R2399J28541J71972
10636I37864K03413K25251K41564K40241K03712R8577o461q3189j94097k73666
10626A593209l03267l09638k54380j99416j52897j06898m3607j3826j6473l6452
10616A56355j7940k8763j4131k0340j2080O885j5681M371N316j1021J3642L364
$$ plain form
10700 -12309 -2230 -13169 -21331 -18986 -17921 -19402 -23125 -20482 -24355 -26228 -15821 -5689 19390
10687 19390 18796 -1714 -9183 -15489 -19388 -10795 -496 13222 15473 24437 17035 8813 23563 28282
10673 28282 31454 35753 20502 29630 53102 84423 83025 63090 73008 77995 90252 87731 97814
10660 97814 105725 103178 126872 146801 152135 143054 160158 191726 215373 220538 240488 255903 275964
10647 275964 298671 312008 335670 355687 400777 440742 484066 544952 637351 765892 937864
10636 937864 1141277 1366528 1608092 1848333 2052045 2150622 2144161 2060972 1866875 1593209
10626 1593209 1289942 980304 725924 526508 373611 266713 223106 209280 192807 156355
10616 156355 138415 109652 95521 75181 63101 69986 54305 58676 63992 52971 66613 69977
10604F9977j2844J949n091l587R435N21j1624k5475k4703r44M157O594R228Q735
10590B6328j3820R340J3982Q071k7315n267r875J3449l167j2364q940R44J5351
10577F717p202l008K0833q522N918r766J1834J1805p990k625L503n10J7236M293
10563D2516j5169j6577J0252N13o406j0110J1526L904r956j0370N534J8364r400
10550A4621K009O902k592j1525k042J5928N8k3934k211K108M866J044J0445Q436
10536B4113J0700k373j4054j3071q68O016R625J1065n33j1939M192K1901K4469
10523F9243J3344J0246n109j5565j05r41l307m504K2779j8773m838J3534L2864
10510A08868J5771Q036n244Q330L205K0915J0769J714K015L741l647p437j7078
$$ plain form
10604 69977 57133 59082 53991 50404 59839 60360 48736 23261 -1442 -2386 1771 8365 17593 26328
10590 26328 12508 21848 35830 43901 16586 11319 1444 14893 11726 -638 -9578 -8634 6717
10577 6717 -485 -3493 17340 8818 14736 4970 16804 28609 20619 17994 21497 20987 38223 42516
10563 42516 27347 10770 21022 21535 15129 5019 16545 20449 10493 123 5657 24021 14621
10550 14621 16630 23532 20940 9415 7373 23301 23359 -575 -2786 -678 4188 5232 15677 24113
10536 24113 34813 32440 18386 5315 4447 10463 20088 31153 30620 18681 22873 44774 69243
10523 69243 82587 92833 87724 72159 72054 71113 67806 63302 86081 67308 62470 76004 108868
10510 108868 124639 132675 127431 135761 138966 159881 170650 172364 174379 178120 174473 167036 149958
10497A49958J31K5200r00j6030j3563N531L96j4784j5778k3249j3355P923M185
10484I5665R636j3499j5638m940j7086j103J4312o706m32J5140J5714j0544j1729
10471F8790o9k557j1713j6742n569J6108Q510j769K8673J6818k8592j7500n720
10458D8668j8262J7817O460Q739m433p182j5753l087K276n275n444p897P226R180
10444C3033k827j3890J2071J9984R408J0994r95j4565p963k1195k7955n020J2519
10431C599J3835p942j7110j6657R398m701m109J6168Q168J6677J6616J425o820
10418B8547M498R633P956o63q644J014q51M487k284j4849p060p00K321K673P949
10403C4027J067R057K8361J6435R916J8022J1095K5638J9805M353K4599l495j4857
$$ plain form
10497 149958 150089 175289 174389 158359 144796 150327 150723 135939 120161 96912 83557 91480 95665
10484 95665 105301 91802 76164 71224 54138 53035 67347 60641 60209 75349 91063 80519 68790
10471 68790 68721 66164 54451 37709 32140 48248 56758 54989 83662 100480 71888 54388 48668
10458 48668 30406 48223 54683 63422 58989 51807 36054 32967 35243 29968 24524 16627 23853 33033
10444 33033 30206 16316 28387 48371 57779 68773 67778 53213 45250 24055 -3900 -8920 3599
10431 3599 17434 9492 -7618 -24275 -14877 -19578 -23687 -7519 649 17326 33942 35367 28547
10418 28547 33045 42678 50634 49971 41327 42341 41490 45977 43693 28844 21784 21084 23405 26078 34027
10403 34027 35094 44151 72512 88947 98863 116885 127980 153618 173423 177776 202375 198880 184023
10390A84023k151N811P686K6941J8302j4618r559r561L932P66j2281l989j7389
10377A77913q661L612K9722p710j295J3139J2383M1557J8102J8658J5609J2371
10365C25400j872K860j2816j6195k6770k8726k3036r133p895o517k8769K5525
10353A92056L1854J3143r368p41L857r527j4854j2298P117K852k0264j487p005
10340A75335o103K7635L1066q91n611P495q631J0261K6495J749l794q799J6641
10327B62848Q056P413L45O665J6563J1424j4635K6061L5448K590J3495R144J2596
10314C98013K5556J0508j007L8828N1073J9607m38K0558K6708L3137J3798J0546
10302F46887L2916J8054K2783L8213M5381L7613P4178P6071P4722N8178N7132
$$ plain form
10390 184023 181872 187683 195369 222310 240612 225994 216435 206874 210806 211572 199291 195302 177913
10377 177913 169252 172864 202586 194876 193581 206720 219103 260660 278762 297420 313029 325400
10365 325400 323528 326388 313572 297377 270607 241881 218845 209712 201817 195300 166531 192056
10353 192056 223910 237053 227685 226944 230801 221274 206420 194122 201239 204091 183827 182340 175335
10340 175335 169232 196867 227933 227042 221431 228926 220295 230556 257051 258800 255006 246207 262848
10327 262848 270904 278317 278662 285327 301890 313314 298679 324740 360188 362778 376273 385417 398013
10314 398013 423569 434077 433070 471898 522971 542578 542140 562698 589406 622543 636341 646887
10302 646887 679803 697857 720640 758853 804234 841847 916025 992096 1066818 1124996 1182128
10291A182128N5845O9551P5318R4215J00901J02351J13249J32290J75891J91978
10281B293717K23341K49047K66893L02802L26607L53523L84399M51116N16514
10272E367959N51411O05389O77061P43440P81424Q24647Q95226R23257R15025
10263A2284839R51952R98966R98556J023590J044584J125376J255266J437895
10255B1121024J628343J860040K092265K298883K499610K693944K841488K866419
10247C9902016K899963K870547K908110L073514L249242L643024M310556N318236
10239F8175208O847661R249692J2546457J6874016K2337263K8304290L4352850
10232A98687437L9629925M2000579L9885047L5444871K4245689M109344q330622
$$ plain form
10291 1182128 1237973 1307524 1382842 1477057 1577958 1680309 1793558 1925848 2101739 2293717
10281 2293717 2517058 2766105 3032998 3335800 3662407 4015930 4400329 4851445 5367959
10272 5367959 5919370 6524759 7201820 7945260 8726684 9551331 10446557 11369814 12284839
10263 12284839 13236791 14235757 15234313 16257903 17302487 18427863 19683129 21121024
10255 21121024 22749367 24609407 26701672 29000555 31500165 34194109 37035597 39902016
10247 39902016 42801979 45672526 48580636 51654150 54903392 58546416 62856972 68175208
10239 68175208 75022869 84272561 96819018 113693034 136030297 164334587 198687437
10232 198687437 238317362 280317941 320202988 355647859 379893548 384002892 375672270
10225C75672270k7227669m6986062m8330318n2531174n0862689l9182019l0278708
10218H0273631k1872716j4302831r360901o455897m713384l482710k650136k024671
10210A5410385j526381j131497q61100o75784n40371n25658n82547n62077n78187
10201H426783o82088p49141p55891o77776n60123m99196m46424l45119k82504
10192C428521k54864j95442j64402j51281j54624j39987j32348j07970r9339q1987
10182A946277o4438o2759o9239n4963n3953n9418k8001k8245k2588k2421m4114
10171A436138m1925l5948n6634m6330m2023m2499k0368l9258l2078j2593n1167
10160A015315j9456j6606m6212k0012M355P84k2852l4549j0666p892m3343j0720
$$ plain form
10225 375672270 348444601 301458539 253128221 200597047 149734358 110552339 80273631
10218 80273631 58400915 44098084 34737183 28281286 23567902 20085192 17435056 15410385
10210 15410385 13884004 12752507 11891407 11215623 10675252 10149594 9567047 9004970 8426783
10201 8426783 7744695 6995554 6239663 5561887 5001764 4502568 4056144 3711025 3428521
10192 3428521 3173657 2978215 2813813 2662532 2507908 2367921 2235573 2127603 2028264 1946277
10182 1946277 1881839 1819080 1749841 1694878 1640925 1581507 1553506 1525261 1502673 1480252 1436138
10171 1436138 1394213 1358265 1301631 1255301 1213278 1170779 1150411 1111153 1079075 1066482 1015315
10160 1015315 995859 979253 933041 913029 917384 918168 895316 860767 850101 842209 798866 788146
10148G88146j4837j5379q081m952j3541j3029k1299M507O740k7258j9097j1606
10136F50314L781j4225j4935l6918j5398Q023r030M633j2543k4551n680j290K3937
10123E56118p62k4632k0048q780j9761r400m65n245R61J4569P162L000m580j9507
10109D68630r796p153j9515k9334k4200k5760j7907J582j9379O867j821q719J7204
10096C30699M146M381j0980k8753k9018l4639k3906L666J5817R683K06J6400K0608
10083B78310j1493P933j0279O388K4478K0423j502k1660Q667O094M94j2596q798
10070B86459m207o72K102K0379j4391k1415Q644J0803J5778K8192K2709K2759
10058C77140K4287J9527J0579J3925J0551R351J4904L678L0831L4401M3186O5277
$$ plain form
10148 788146 773309 757930 749849 744897 731356 718327 697028 701535 708275 681017 661920 650314
10136 650314 654095 639870 624935 588017 572619 580642 571612 576245 563702 539151 533471 532181 556118
10123 556118 555356 530724 510676 501896 482135 472735 472270 467025 467986 482555 489717 492717 488137 468630
10109 468630 458834 451681 432166 402832 378632 352872 334965 336547 317168 324035 322214 313495 330699
10096 330699 334845 339226 328246 299493 270475 235836 211930 215596 231413 241096 241302 257702 278310
10083 278310 266817 274750 264471 270859 295337 315760 314258 292598 301265 307359 307853 295257 286459
10070 286459 282252 281580 283682 304061 289670 268255 276899 287702 303480 331672 354381 377140
10058 377140 401427 420954 431533 445458 456009 465360 480264 483942 514773 549174 592360 657637
10046F57637R3980J62889K39061K26146J67528J30449J74271K24801p2490n47345
10036A456927m83601k97479j61865p0084m4312k3587l0774j4783j2724k5274j4534
10025B77910j4108j9904j2633o494k915p814l255m161k3394j3478o643M914r32
10012A67093l895O554j395q336m697J95J4284R4o055j9636j3021M789J0756P541
9998A54271m199j3640l282j637P261J3188k420j4015l251K0956R141n114j8490
9985A38769J974m402l710K4271J8334r788j3095r937M600J1235m69Q508P481p501
9971A66270j1575j686p07j9653n678K3606M477j6634M477K0702N998k5557j8191
9958A25849J1404J6044l091K156l987q996L240m44Q70l675k955k9265j8618Q551
$$ plain form
10046 657637 751617 914506 1153567 1379713 1547241 1677690 1851961 2076762 2004272 1456927
10036 1456927 973326 675847 513982 443898 399586 375999 345225 330442 317718 292444 277910
10025 277910 263802 243898 231265 224771 221856 214042 210787 206626 183232 169754 163111 168025 167093
10012 167093 163198 169752 168357 160021 155324 155519 169803 169897 163842 144206 131185 135974 146730 154271
9998 154271 150072 136432 133150 131513 138774 151962 149542 135527 132276 153232 162373 157259 138769
9985 138769 140743 136341 132631 156902 175236 165448 152353 142416 147016 158251 157782 166290 173771 166270
9971 166270 154695 153009 152302 132649 126971 150577 155054 138420 142897 163599 169597 144040 125849
9958 125849 137253 153297 150206 152362 148375 139379 142619 142175 143045 139370 136415 107150 88532 97083
9944I7083m520q35R603J5336J509J0414J990m437J7844l318P952l361l0755l1024
9930H3481J6857Q243j290m73o989J147J1162k436L995Q43J1903j9832j1902J4069
9916A08778J4993J0059p881k3435j486P695j0834l617M399j2509J4121K3363O258
9903A29904k0048j8912J8759J1797n722j4215N63O833O227Q41K023J1995k973
9890A27072L148n781P597P139j5241o348o74k633L526m915j1210M75J3053J3358
9876A28566J1299K3604K0506k09K450J5741J7944n99J1233N763P650K7986K2379
9863B94313J1787K8110K8628L8409N632J9093J0762L941O575j8276K0915N602
9851D55491K7074M5796M8849O0858O7047R5103J40290K05458K81545L37069L18449
$$ plain form
9944 97083 92563 91728 101331 116667 118176 128590 130580 126143 143987 140669 148621 145260 114505 83481
9930 83481 100338 108581 107291 106818 99829 100976 112138 109702 113697 114540 126443 106611 94709 108778
9916 108778 123771 133830 125949 102514 101028 108723 97889 94272 98671 86162 100283 123646 129904
9903 129904 109856 90944 109703 121500 115778 101563 102126 108959 115186 116027 118050 130045 127072
9890 127072 130220 124439 132036 139175 123934 117586 116912 114279 117805 112890 101680 102155 115208 128566
9876 128566 139865 163469 183975 183766 186216 201957 219901 219302 230535 236298 243948 271934 294313
9863 294313 306100 334210 362838 401247 406879 425972 436734 440675 447250 428974 449889 455491
9851 455491 482565 528361 577210 638068 705115 800218 940508 1145966 1427511 1764580 2083029
9840B083029K79883K78751K75784J13396k69746o10589o24284m21643k25630q8750
9830G90201k5694m710L6923N1469R5130J33200J82561K24310K34146K21556J65282
9819B104374J18647K2169n8081j88598k82346k60855k78211k66377k21361j76866
9809E12495j22965r2298m7790r923k0009j0890k9630k1016j4551m386O046n974
9797A39109j5213j0950l181m932p06O925j1757k3944j4196j476j0465m364O689
9784E1539R48K0047J2105j66p140j9738n275N301k0951n50K0450Q427m053o845
9770E4099q43J2024J9976R569Q540R82r707k5443j9094j2175M034J978p683J0326
9756D6583J5008j7703j1301R670N247j731l684j262Q742J8j2098o117q750q567
$$ plain form
9840 2083029 2362912 2641663 2917447 3030843 2761097 2150508 1526224 1104581 878951 790201
9830 790201 764507 759797 796720 848189 943319 1076519 1259080 1483390 1717536 1939092 2104374
9819 2104374 2223021 2245190 2187109 1998511 1716165 1455310 1177099 910722 689361 512495
9809 512495 389530 297232 249442 239519 219510 208620 178990 157974 143423 139037 145083 139109
9797 139109 123896 112946 109765 104833 104127 111052 99295 75351 61155 59679 49214 44850 51539
9784 51539 52487 72534 84639 84473 77333 57595 52320 57621 36670 36120 56570 64997 60944 54099
9770 54099 53256 65280 85256 94825 103365 104347 94640 69197 50103 37928 41962 43940 36257 46583
9756 46583 61591 43888 32587 42257 47504 45773 42089 40827 49569 49587 37489 31372 22622 14055
9742A4055j0089L922Q176j321o705K870J4784n500L275Q580K1102J6491k273j9135
9728D8232j1730n165J8258J0443R48L645j0133n988J232n658L599j4361j6128
9715A7194J6847M621J8108N699j9013p398j773r791L161J4406q97j6515m305J0525
9701C0869O131L090J4539J2457L0267r274k0029j8526m551K164R289o094o804
9688D3528j3104M189K2491J9281r615o106P531k9656P8j325P209q166L407J6776
9674E6518m348K1017J8037j4082j4697j2628m169o20K0111R247k0074L833K0743
9661G8888j9270K528j2722J975J3770J018J2390R666R202q42Q3o914m464p16k297
9646H2295K6759J9228p257j2780P025n135P453p482m80M779l762j4506j3120Q582
$$ plain form
9742 14055 3966 7888 16064 14743 8038 10908 25692 20192 23467 32047 53149 69640 67367 48232
9728 48232 36502 31337 49595 60038 60986 64631 54498 48510 49742 44084 47683 33322 17194
9715 17194 34041 38662 56770 62469 43456 36058 34285 24494 27655 42061 41164 24649 20344 30869
9701 30869 37000 40090 54629 67086 97353 88079 68050 49524 44973 47137 56426 50332 43528
9688 43528 30424 34613 57104 76385 66770 60664 68195 38539 38617 37292 44501 36335 39742 56518
9674 56518 52170 73187 91224 77142 62445 49817 45648 45028 65139 74386 54312 58145 78888
9661 78888 59618 62146 49424 51399 65169 66187 78577 88243 97445 96603 96686 89772 85308 84592 82295
9646 82295 109054 128282 121025 108245 115270 110135 117588 110106 109626 114405 110643 96137 83017 91599
9632I1599J7859J3996Q58O307m184n01J0211K2304K1942L132M371J5215Q573J8364
9618B30046J9633m418l472r682n29j7434q977j3478j5722m629Q492n618r543M108
9604A68777j9806J9510L1574K8390L2102K4606J9222K5321J6320J0657J6692J8408
9592C91773K7456K5411M5859P3171P1827O6380N9631M9996M0880K9719M7842R8359
9580A028304J54707J68898J61398J70674J84380J84227Q8936j20966k12204j82947
9570A625407j32218j29719j11195p9827l1758R580L9398J03172J34948J66433
9560A594221K00020K09246J29728J12316J17681Q4332J4098m9337r7326p1818
9550B243161k4419m8447l0345m9198n7861j1761M216K8032L4891J04254J90630
$$ plain form
9632 91599 109458 123454 124312 130619 126435 125934 136145 158449 180391 183523 187894 203109 211682 230046
9618 230046 249679 245261 241789 232107 231578 214144 205167 191689 175967 171338 179830 174212 164669 168777
9604 168777 148971 168481 200055 228445 260547 285153 304375 329696 346016 356673 373365 391773
9592 391773 419229 444640 490499 563670 635497 701877 761508 811504 852384 882103 929945 1028304
9580 1028304 1183011 1351909 1513307 1683981 1868361 2052588 2141524 2020558 1808354 1625407
9570 1625407 1493189 1363470 1252275 1172448 1140690 1150270 1189668 1292840 1427788 1594221
9560 1594221 1794241 2003487 2133215 2245531 2363212 2447544 2461642 2412305 2314979 2243161
9550 2243161 2218742 2170295 2139950 2090752 2032891 2021130 2025346 2053378 2088269 2192523 2383153
9539B383153L07172M44507M97540M44962L74987L25609K77536L0564m87017q50329
9529C748684p82513n59129l43449k10459j37208o6805q207L2861N7674N8313N3189
9518A842951K3991M9064L1020N5692O3484L8856K1097l1136m7086r9877j42243
9507A805813j86139j75337j76728j79013j32959n9923r465J4862N9796P7590J08862
9496A147359J48869J51792R7124M0431K0007Q238l9800j61773l03345k67544j46333
9485F95025r7162n1738n4332l5295j299k5121l9853l9975l8254l9219k6064j4592
9473B32121j6924O584r607j5933j1539j4307k8070N530Q485o233j3860L122k908
9460A36461L18q345O576n31P280j9987m430K2496J7349O216P452J2839R994j394
$$ plain form
9539 2383153 2690325 3134832 3632372 4077334 4452321 4777930 5055466 5086030 4599013 3748684
9529 3748684 2966171 2407042 2063593 1853134 1715926 1649121 1640914 1673775 1731449 1789762 1842951
9518 1842951 1866942 1916006 1947026 2002718 2066202 2105058 2126155 2095019 2047933 1948056 1805813
9507 1805813 1619674 1444337 1267609 1088596 955637 895714 886249 901111 960907 1038497 1147359
9496 1147359 1296228 1448020 1545144 1585575 1605582 1613820 1574020 1412247 1108902 841358 695025
9485 695025 597863 546125 491793 456498 455199 430078 390225 350250 311996 272777 246713 232121
9473 232121 215197 221781 212174 196241 184702 170395 142325 147855 156340 150107 136247 139369 136461
9460 136461 136779 128434 135010 134479 141759 121772 117342 139838 157187 163403 170855 183694 193688 192294
9446A92294j1958Q202l58j6598j6411n840j3649k0918o56m815J6397J6070p414
9433A34346j2356j6726o437J0898N863N622K0234o63p927L294l393n3m46n166
9419A27090k822q094q058q540m635n443M684K2206n292m829N064k2890j7651q361
9405F2429l988M377J6003j38o277o076j616j0842K270K371m06l802K0431O320
9391H1056n731l99p090J2018j27k059m758P265J46r856j2251O858J0490m848J4112
9376H4826K981n832n046J714k78k3452o424q095J971J5243J6903l333N319J5974
9362I2471m904j3010j924K8559Q275J385J5218q659J185O102q31k256j4235k2958
9348H4418m619J1535K5427L898q505L124R046K451J6562K1838P920Q091R940l825
$$ plain form
9446 192294 180336 188538 188180 171582 155171 149331 135682 114764 114108 109293 125690 141760 134346
9433 134346 121990 105264 98827 109725 115588 121210 141444 140781 132854 136148 132755 132702 132256 127090
9419 127090 124268 116174 108116 99576 94941 89498 94182 116388 111096 106267 111331 88441 70790 62429
9405 62429 58441 62818 78821 78683 72406 66330 64714 53872 56142 58513 58107 54305 74736 81056
9391 81056 75325 74926 67836 79854 79727 77668 72910 80175 80321 70465 58214 65072 75562 70714 84826
9376 84826 87807 81975 76929 78643 78365 54913 48489 40394 42365 57608 74511 71178 76497 92471
9362 92471 87567 74557 72633 101192 109467 110852 126070 117411 118596 124698 123867 121611 107376 84418
9348 84418 79799 91334 116761 120659 112154 115278 124324 126775 143337 165175 173095 181186 191126 187301
9334A87301R444K9214K9716l1173j6852J1194K204N558J4453K2195Q029P934k760
9321B76457J3097K9045J1420R673J2565J8984K6029K6732K8372K4652K5811K4501
9309E27338M7146N0308N4410M7064M5455N3138L5168M4965N9951L3392O8397P4674
9297A141406Q5634J16300J03066R2894Q3649J00862J05384J00763J05999J28178
9287B164135J63237J74015J99698K43257K81848L27290L61040L93346M21409M38465
9277E167740M29402L86748L19026K12264Q9137o7565k53214l58953m49786n07772
9267D967027n22378m84897m42642l76025l26592k81924k29543j82623j48346j21216
9257A850841j37757j36374j56371j38705j14209j07787q7019o2749n4858m1827
$$ plain form
9334 187301 196745 225959 255675 224502 207650 218844 221048 226606 241059 263254 271283 279217 276457
9321 276457 289554 318599 330019 339692 352257 371241 397270 424002 452374 477026 502837 527338
9309 527338 574484 624792 679202 726266 771721 824859 860027 904992 964943 998335 1066732 1141406
9297 1141406 1227040 1343340 1446406 1539300 1622949 1723811 1829195 1929958 2035957 2164135
9287 2164135 2327372 2501387 2701085 2944342 3226190 3553480 3914520 4307866 4729275 5167740
9277 5167740 5597142 5983890 6302916 6515180 6604317 6536752 6283538 5924585 5474799 4967027
9267 4967027 4444649 3959752 3517110 3141085 2814493 2532569 2303026 2120403 1972057 1850841
9257 1850841 1713084 1576710 1420339 1281634 1167425 1059638 972619 909870 855012 813185
9247H13185m6040o3053l4479l1711l6265k795J8796l874l2313k5641j807k5177
9235E28826l3717l6798l4005k1607k4076k7167k6053J9582J7232Q754R82j3156
9223C58797L409J5018M586j0339j2320j110l2559k7354j8573j8486m163J1195
9211B68101j212j3789L150N75O011k5772l7584M090P436j478r26k389k390m172
9197A99651k191j4629j0234M527M41m07J838J944j6501j1575P854R06n724R040
9183A64940k7044l965P325J755R127K6312K5437k849j5758k9950j39J6751k970
9170A68972O86R982k608N004n887K021J041r500Q213L038l599n835j4133N498
9156A62893K4967n152j2394k599J0096R16J637N240Q734j3387N091o277j0791
$$ plain form
9247 813185 767145 704092 669613 637902 601637 598842 617638 613764 581451 555810 554003 528826
9235 528826 495109 458311 424306 402699 378623 351456 325403 344985 362217 370971 371953 358797
9223 358797 362206 377224 381810 371471 359151 358041 325482 298128 279555 261069 256906 268101
9211 268101 266889 253100 256250 256825 262836 237064 199480 203570 211006 209528 208602 206213 203823 199651
9197 199651 197460 182831 172597 177124 177565 177158 178996 180940 164439 152864 160718 161624 155900 164940
9183 164940 137896 133931 141256 143011 152138 178450 203887 201038 185280 155330 155191 171942 168972
9170 168972 169658 179640 177032 182036 176149 178170 179211 169711 177924 180962 177363 171528 157395 162893
9156 162893 187860 182708 170314 167715 177811 178727 180364 185604 194338 180951 186042 179765 168974
9143A68974j2811J3374K5581m85J0623n94M475M781J5042R059j0303j1902j3027
9130B02787k0033J798R737Q155J3769J2354N329J1328l040j6352Q782J5357k117
9117B47854j7949J7672J130k30K982M282K2458J7005J248j689K363j926J1204
9104C06404Q10Q436J7471R024r198l551J2272K746k384P511n033K329R471L183
9090C59491r839J0464J6074P64P001K2019R292o823P813K4806L4670N086O353
9077D87171N5915J0770O873J2637J8992K8511K5035L6647K9189L5372N2961K9397
9065H29470K5968N5131O0905K0228L1114O0614O5831O6211O0751O0200O1177N3271
9053A450871O8437Q6971J13011Q0962R3031J19612J35184J35501J47201J48188
$$ plain form
9143 168974 156163 169537 195118 194633 205256 204662 209137 213918 228960 238019 227716 215814 202787
9130 202787 182754 184552 194289 202444 216213 228567 233896 245224 242184 225832 234614 249971 247854
9117 247854 229905 247577 248707 248477 251459 255741 278199 295204 296452 294763 297126 295200 306404
9104 306404 307214 315650 333121 342145 332947 329396 341668 344414 342030 349541 344508 346837 356308 359491
9090 359491 349652 360116 376190 376954 383955 405974 415266 408443 416256 441062 475732 480818 487171
9077 487171 543086 553856 560729 573366 592358 620869 645904 682551 711740 747112 800073 829470
9065 829470 855438 910569 971474 991702 1022816 1083430 1149261 1215472 1276223 1336423 1397600 1450871
9053 1450871 1519308 1606279 1719290 1800252 1893283 2012895 2148079 2283580 2430781 2578969
9043B578969J55358J68899J91399J87153K08744J95399K17138K50720K58167K73902
9033D685848K84998L11585L49477L79471L73441L86786M26849M58391N07158N14933
9023H678937N32710N47422N91083O06780N91687O15621O34123O29871O44235O50467
9013A4722936O18876N94026N90640N78965N45215N28535N25371N00254M84797
9004A9689615N19604M92181N00466N14015N46441O07635O31468O55591P17909
8995B4874925P44127P93376Q73710R05429R37984J009494J020800J025398J013139
8986C3198382R63525Q82690O98300N17229L14032O5788k20825m88306p59642j003640
8976C4167533j191779j312734j414147j456573j443156j401402j342250j251458
$$ plain form
9043 2578969 2734327 2903226 3094625 3281778 3490522 3685921 3903059 4153779 4411946 4685848
9033 4685848 4970846 5282431 5631908 6011379 6384820 6771606 7198455 7656846 8164004 8678937
9023 8678937 9211647 9759069 10350152 10956932 11548619 12164240 12798363 13428234 14072469 14722936
9013 14722936 15341812 15935838 16526478 17105443 17650658 18179193 18704564 19204818 19689615
9004 19689615 20209219 20701400 21201866 21715881 22262322 22869957 23501425 24157016 24874925
8995 24874925 25619052 26412428 27286138 28191567 29129551 30139045 31159845 32185243 33198382
8986 33198382 34161907 35044597 35742897 36260126 36574158 36639946 36419121 35930815 35171173 34167533
8976 34167533 32975754 31663020 30248873 28792300 27349144 25947742 24605492 23354034
8968B3354034j165284j071326j011525r01066q20636p51593o73329o20985n70671
8959A5767619n13669m83229m69841m46777m19314l89095l96932l93850m11164
8950A1843748m10934m31766m27274m04626m38798m67464m64104m45892m59428
8941G893462m66873m40941m25178m11839l96048l87439l89109l39518l02557l03097
8931D030863k78727k52377k24420k08840j95285j83811j69383j59335j35694j32950
8921B090041j06354q7719j03837q8553p3960q7341o1509m4196n3631k7280k9741
8910A325920j9424j6085k0675m8678l6719j7061l1632l006R857J389N759j589
8898A148056j564L2676L4138K2996J848M4089P9689P3879O7650O2693P0550Q6105
$$ plain form
8968 23354034 22188750 21117424 20105899 19204833 18384197 17632604 16959275 16338290 15767619
8959 15767619 15253950 14770721 14300880 13854103 13434789 13045694 12648762 12254912 11843748
8950 11843748 11432814 11001048 10573774 10169148 9730350 9262886 8798782 8352890 7893462
8941 7893462 7426589 6985648 6560470 6148631 5752583 5365144 4976035 4636517 4333960 4030863
8931 4030863 3752136 3499759 3275339 3066499 2871214 2687403 2518020 2358685 2222991 2090041
8921 2090041 1983687 1895968 1792131 1703578 1629618 1542277 1480768 1436572 1382941 1355661 1325920
8910 1325920 1306496 1290411 1269736 1221058 1184339 1167278 1135646 1132640 1142497 1143886 1149645 1148056
8898 1148056 1146492 1179168 1213306 1236302 1238150 1282239 1361928 1435807 1503457 1566150 1636700 1722805
8886A722805P3068P2358O6492Q7752J31313J91632K41150L43488N07271P33800
8876D171129R76530J037228R57399Q44590P84284O77777o170j452110k190034
8867E800623j773537j134448o96150m30467k67204j97157j74211j29304q4203
8858I13942o5602p0826o7669o5856m9762l3229l2993n2539n6185m3699j0224O969
8846C72327J81j460j9444l5495k1331j1197L910L622j2034l2873j1006j7031k144
8833B16025J2127J0853M279j6431k878J1005q143j2426n623p046k0225j3425Q40
8820A68932p005o66N484M996J4897K5068j3821r675j0455k6453j3421K933J7749
8807A58563j0487q701r072j6051M487R835j052J7108p106m843r770J318k521n056
$$ plain form
8886 1722805 1795873 1868231 1934723 2022475 2153788 2345420 2586570 2930058 3437329 4171129
8876 4171129 5147659 6184887 7142286 7986876 8771160 9448937 9442767 7990657 5800623
8867 5800623 4027086 2892638 2196488 1766021 1498817 1301660 1127449 998145 913942
8858 913942 848340 777514 709845 643989 594227 560998 528005 475466 419281 375582 365358 372327
8846 372327 372508 371048 351604 316109 294778 283581 287491 291113 279079 246206 235200 218169 216025
8833 216025 228152 239005 243284 226853 223975 234980 226837 214411 208788 201742 181517 168092 168932
8820 168932 161927 161261 166745 171741 186638 211706 197885 188210 177755 151302 137881 140814 158563
8807 158563 148076 139375 130303 114252 118739 128574 127522 144630 137524 132681 122911 124229 121708 116652
8793A16652k767j0674O513J0210P481j2295j2499q736J2317L0659K4728O809k2472
8780A45926J096J1574K117j5416k2196l734p934n46o545m699j5842L805J6887
8767A04493Q38j0071n772J4694L826R430j4362j1941N076R912J4323k748j3181
8754A04517m427j3362j8571j882J2786M936j0868k0164P053L116R946J6357J9361
8741A08798P476l909L600q14j0438k6519j0066J1061l153j757Q881M548J835J4815
8727A04358N695o263n102q035j0048R525P87j3759k1112K0626J0375J0494N509
8714A03050j0252P840J8268j8210k5644J3249J4700R202p999k3253o475m369L409
8701G3516M498j5457j2973J2067J5643L034J0496n228j3602j0054Q03J962J1873
$$ plain form
8793 116652 113885 103211 109724 119934 127415 115120 102621 93885 106202 136861 161589 168398 145926
8780 145926 147022 158596 160713 145297 123101 119367 111433 110887 104342 99643 83801 87606 104493
8767 104493 105331 95260 89488 104182 108008 117438 103076 91135 96211 106123 120446 117698 104517
8754 104517 100090 86728 68157 66275 79061 83997 73129 52965 60018 63134 73080 89437 108798
8741 108798 116274 112365 115965 115151 104713 78194 68128 79189 76036 74279 83160 87708 89543 104358
8727 104358 110053 103790 98688 90653 80605 90130 90917 77158 56046 76672 87047 97541 103050
8714 103050 92798 100638 118906 100696 75052 88301 103001 112203 104204 80951 74476 70107 73516
8701 73516 78014 62557 49584 61651 77294 80328 90824 85596 71994 61940 62743 64705 76578
8688G6578J9218J2642j2498n813j1249N118O658J5337O905j0796j5283r030n83
8675G7204J0734J7267J1186P339k923R696P099j7341J149Q361J1245m013q663
8662A28340j5436R166K725J3445j4284l566K710k775J2197R974K1887P77M89L2198
8648A97847M3164O2754Q4614R5836Q5806M1751M2672O5227N8737n9646j81180
8637E37582j44854p5600n4365m5654l8115k2305j2890j7622p172J0193L3R459
8625A38690J0515k3520o877J3375K546j9070R74K0469P032J8877J3516J2763Q117
8612A97407K9978L1047J3427M808K3383K5883Q087K4350L2879O7341Q9638J18821
8600F67049J46299J75151J30567J01862J42354J37735p1665l57588l63539k07740
$$ plain form
8688 76578 95796 108438 95940 90127 78878 83996 90654 105991 112896 102100 86817 77787 77204
8675 77204 87938 105205 116391 123730 120807 130503 137602 120261 121410 129771 141016 137003 128340
8662 128340 112904 122070 124795 138240 123956 120390 123100 120325 132522 142496 164383 165160 165649 197847
8648 197847 241011 303765 388379 484215 570021 611772 654444 719671 778408 718762 537582
8637 537582 392728 317128 262763 217109 178994 156689 143799 126177 119005 129198 129231 138690
8625 138690 149205 125685 118808 132183 134729 115659 116633 137102 144134 163011 176527 189290 197407
8612 197407 227385 258432 271859 276667 300050 325933 334020 358370 391249 458590 548228 667049
8600 667049 813348 988499 1119066 1220928 1363282 1501017 1429352 1071764 708225 500485
8590E00485j18564q1559n9737m9893k2346j0097j1411O95K170J1606R227J2717
8578A83293n274K830m124O074k3104l0861j4014P058q605J6276J9369r537n745
8565A33636J2217j4021K471K7815K6282J1547Q966J8637J9271O1094R6297J06730
8553E10942O7136L7593N3924N2172J362j37895j90260j19680m0302l1056j4549
8542A89387j4001j5663k4441q708j96Q895J4947n128m2653k0661j9937l2768m950
8529B4123L1294k418J2314M713l566j0182p304l383p474J4461K356Q455J4988
8516G8377j0243K772J7582Q953J6993j2890j5480P669N267K637j7399r414N137
8503G9961J8879j8696j0217r492n527R097J7338P852j4516k0384m36L769J4772
$$ plain form
8590 500485 381921 300362 240625 190732 168386 158289 146878 147573 149743 161349 170576 183293
8578 183293 178019 180849 176725 182799 159695 128834 114820 121878 113273 129549 148918 139381 133636
8565 133636 145853 131832 134303 162118 188400 199947 208913 227550 246821 307915 404212 510942
8553 510942 578078 615671 669595 721767 723129 585234 394974 275294 234992 203936 189387
8542 189387 175386 159723 135282 126574 126378 135273 150220 145092 102439 81778 61841 29073 24123
8529 24123 55417 52999 65313 70026 66460 56278 48974 45591 38117 52578 54934 63389 78377
8516 78377 68134 70906 88488 97441 114434 101544 86064 93733 99000 101637 84238 74824 79961
8503 79961 98840 80144 69927 60435 54908 64005 81343 89195 74679 54295 53859 57628 72400
8490G2400Q174q27j6449j0216q680r003Q954P195J4657m516j2711P299j069j0296
8476D4912j250J0742R861J357K982o950m438J7072j21j4903M127j6191j8648J6618
8462D5170R933l243j3431p444P514N509K0697K7589J481p306o392p028p986j095
8448F3968n497P10m473j7012j4142K577J51j9163l103J083k596K5437L3332j573
8434E9699r855m291j1610p144L466q690J0549J934P93O478L8905K9900k8917k6268
8420E4949j388l919j0410J0328J3177L176n645j3779q730L496n109J0790o804
8407D0132j0969m774J3689K0898r085k6116j0736K935O793O522K300Q198k105
8394C7682p719L10R103L898j5942p247K385k977J463L876o841L611K0346N315
$$ plain form
8490 72400 80574 79747 63298 53082 44402 35399 44353 51548 66205 61689 48978 56277 55208 44912
8476 44912 43662 54404 64265 65622 68604 61654 57216 74288 74167 59264 63391 47200 28552 45170
8462 45170 55103 51860 38429 30985 38499 44008 64705 92294 93775 86469 80077 73049 65063 63968
8448 63968 58471 59181 54708 37696 23554 26131 26282 7119 4016 5099 2503 27940 61272 59699
8434 59699 49844 45553 33943 26799 30265 21575 32124 34058 34851 41329 80234 110134 81217 54949
8420 54949 53561 49642 39232 49560 62737 65913 60268 46489 37759 41255 36146 46936 40132
8407 40132 29163 24389 38078 58976 49891 23775 13039 15974 22767 29289 31589 39787 37682
8394 37682 29963 30273 39376 43274 27332 20085 22470 19493 20956 24832 17991 21602 41948 47263
8380D7263K811n19j8912O892P331p23k1722n846J0607J0804p914o877J2804J6856
8366E2855M249N410M231r968j2985q773k0966j6007P279J6416J8496K4150p139
8353E7248q599l804n450r864P148P675o599L673n363j7897K269q901j791L226
8339A2971J6168q490q614k181l147l354J0435o067l996O303n936P017J6913r497
8325A8525j1110N721Q909J1121k756p408J0744J9290L164r066j2012r475R156
8312C4803J8441l559l157M233k3084j4759n893M92J346O306L914m413J2981O385
8298C4036J4652m025j1500j6064N738J8757L292M331O271j6421n269n445l0523
8285b170r862M140M255M800J3830P253r444M458K54j753J3645R529p85j2750j6346
$$ plain form
8380 47263 50074 49555 30643 37535 44866 44143 22421 16575 27182 37986 30072 23195 35999 52855
8366 52855 57104 62514 66745 56777 43792 35019 14053 -1954 5325 21741 40237 64387 57248
8353 57248 48649 44845 39395 29531 36679 44354 37755 41428 36065 18168 20437 11536 9745 12971
8339 12971 29139 20649 12035 9854 6707 3353 13788 7721 3725 10028 4092 11109 28022 18525
8325 18525 7415 13136 22045 33166 30410 23002 33746 53036 56200 47134 35122 25647 34803
8312 34803 53244 49685 46528 50761 27677 12918 7025 7517 8863 15169 19083 14670 27651 34036
8298 34036 48688 44663 33163 17099 22837 41594 44886 49217 55488 39067 33798 28353 -2170
8285 -2170 -12032 -7892 -3637 1163 14993 22246 12802 17260 17514 15761 29406 38935 38150 25400 9054
8270I054J8749J2966O517n439P183n601j3195l381r643m344J546o122j4403Q86
8256e227j315J2J9112R495M761P861n098O500M25J051l95q50j233Q491M007k3000
8240B4597q985J1839k960N709j692o857j1414Q36l852N587N404j3694J0755J2848
8226B8121J3220j3768j6557Q031j676P029j0710P973J9486J0009j0955j8001l016
8213A9186j294m217m209j1461o225o410P945P982K4030J5482j0274j6414o458
8200G663l606K0189k842n480l448p30O32j2114J089R563K1904J5129j0396n973
8186C1580q46O347J1978k638P220L012n875j306o769K557J975N438j1491L888
8172D5070J993k818l203p815n733l581J0531K1990p990k4032r266Q093j1219r475
$$ plain form
8270 9054 27803 40769 47286 41847 49030 43429 30234 26853 17210 12866 14412 8290 -6113 -5227
8256 -5227 -6542 -6530 12582 22077 26838 34699 29601 36101 36526 37577 37182 36332 35099 43590 47597 24597
8240 24597 15612 27451 24491 30200 28508 21651 10237 11073 7221 12808 18212 4518 15273 28121
8226 28121 41341 27573 11016 19047 17371 24400 13690 21663 41149 51158 40203 22202 19186
8213 19186 17892 13675 9466 -1995 -8220 -14630 -6685 1297 25327 40809 30535 14121 7663
8200 7663 4057 24246 21404 15924 12476 11746 12378 264 1353 10916 32820 47949 37553 31580
8186 31580 30734 37081 49059 46421 53641 56653 50778 49472 42703 45260 47235 52673 41182 45070
8172 45070 47063 44245 41042 33227 27494 23913 34444 56434 48444 24412 15146 23239 12020 2545
8158B545j9721K4927R65j9237N695J6089J7234n978r111J0744J5051r755M13M149
8144C4010r18r004K55O716Q911J653P804n945O412l967o304o612q299k0652r532
8129e472P397j268J44K0098N014j881j3944l557j1138j0633j346K3874K865J4473
8115B4626P082K788j2122k21N355K526k437j2618l680r465l992M269J9826J4701
8101C6638J383k0647m098o61l026j0863O003J5762J0193J0606j5584P295M517
8088C7518n483o403J1193J6280m05q735N798j5701j2264j970p980L787j6592j7755
8074a8712M157J6841L644J0657K7923j404j0768m734j2047O142L007N945L304
8061C3955k4254J806J4830J0451j1265m681j8184k344P693L477l082k438k6239
$$ plain form
8158 2545 -17176 7751 8716 -10521 -4826 11263 28497 22519 13408 24152 39203 29448 29861 34010
8144 34010 33092 24088 24343 31059 39970 41623 49427 43482 49894 45927 39623 33011 24712 4060 -5472
8129 -5472 1925 657 801 20899 25913 24032 10088 6531 -4607 -15240 -16586 7288 10153 24626
8115 24626 31708 34496 22374 22153 27508 30034 27597 14979 11299 1834 -2158 2111 21937 36638
8101 36638 38021 17374 13276 12615 9589 -1274 4729 20491 30684 41290 25706 33001 37518
8088 37518 32035 25632 36825 53105 52700 43965 49763 34062 21798 19828 11848 15635 -957 -18712
8074 -18712 -14555 2286 5930 16587 44510 43106 32338 27604 15557 21699 24706 30651 33955
8061 33955 9701 11507 26337 36788 25523 20842 2658 314 8007 11484 8402 5964 -20275
8048b0275j459J2082K6194K0617P954j307j0983L376j7227J1603J1996j0109N49
8035C3011m803j7069q438O203m131N471o621N121J1356p320J3665J2197j88j7753
8021B0701j2267o448J443k274P64M333m715o790M371J7829k012o569L757J6140
8007B8263P38J5J0576J2245R048M063M753j3643j7060J7536K728j05R17k0323
7993C9751j0842j8113k0649k956K5968J1890r419q682L324m546m423J8090n824
7980A3569P917k65Q668l87o453L787R993j480J0205L340J6542j5455K030k7j7501
7965C4483k3407P075R093m835M739K061n156p194j5878j1783J8348L2222q27R313
7951D8254J1228R745j2278q680o413r864K5586p984n529N935J678n477l2116k4607
$$ plain form
8048 -20275 -21734 -9652 16542 37159 45113 43806 32823 36199 18972 30575 42571 32462 33011
8035 33011 28208 11139 2701 8904 4773 10244 3623 8744 20100 12780 26445 38642 38454 20701
8021 20701 8434 1986 3429 1155 1919 6252 1537 -5253 -882 16947 14935 8366 12123 28263
8007 28263 29001 29016 39592 51837 60885 64948 69701 56058 38998 56534 59262 59157 60074 39751
7993 39751 28909 10796 -9853 -12809 13159 25049 15630 6948 10272 5726 1303 19393 13569
7980 13569 21486 21221 29889 29502 23049 26836 36829 35349 45554 48894 65436 49981 52011 51984 34483
7965 34483 11076 18151 27244 22409 27148 29209 24053 16859 981 -10802 7546 39768 38941 48254
7951 48254 59482 69227 56949 48269 41856 31992 57578 49594 44065 50000 51678 46201 14085 -10522
7937a0522K16J2736K4447J9533L629l267n048j4446P229m006N748q925j8551j4329
7923e556J0597J5272M810j3509j6973k063J4570L811J9515J4615j03m621j0379
7910B9986L369j131K3508O476q925j9467K850P211L150q890K349K715J555l930
7896D0826j6391m293k049N326R087j7989j2774K722L357K400L319L052M685o286
7882A4992j710l207m710j49J6685o304l287n741r578O539J6727N156q733K3271
7868C9951J385j1146k0945K833j3047k3622j9303K5658K7262N087j2687j5176
7856a3750j3837o492J3722K7654J7896k814l73M156j0171p203R983J9208p555
7843C0424M174k5316k9421Q836J8502P574J1796N282m505M058j533k339R292m007
$$ plain form
7937 -10522 -10306 2430 26877 46410 50039 46772 41724 27278 34507 30501 36249 27324 8773 -5556
7923 -5556 5041 20313 25123 11614 -5359 -7422 7148 10959 30474 45089 44986 40365 29986
7910 29986 33355 32224 55732 62208 53283 33816 36666 43877 47027 38137 40486 43201 44756 40826
7896 40826 24435 20142 18093 23419 32506 14517 1743 4465 7822 10222 13541 16593 21278 14992
7882 14992 13282 10075 5365 5216 21901 15597 12310 6569 -3009 3530 20257 25413 16680 39951
7868 39951 41336 30190 9245 12078 -969 -24591 -43894 -18236 9026 14113 1426 -13750
7856 -13750 -27587 -34079 -20357 7297 25193 22379 22006 26162 15991 8788 18771 37979 30424
7843 30424 34598 9282 -20139 -11303 7199 14773 26569 31851 27346 31404 29871 27532 36824 32817
7829C2817k2633k9956J082L300J5232R196j3101N069k5104m501K0466J1659P259
7816A0785m961m818M93J1337l287j6751l517j6253K831K7168K3456p220k3459
7803d196J1254J1186j3820J5233m196l531M058j5064O082r39k1138J4753M472
7790D154j6975J2694n4j8071Q773J810J6683J3762o741k8021p247J1952j174K060
7776f395r0J5152K7702j2623j5005P933j1226j721K3071N654j7510o516m446j331
7762B649Q130J6221J953j3019J0189j5981k8338r567m654j0311Q142J7383K5737
7749H534J2526L47K894n373j7606j2054o450J7613J711j5112O495Q65J3986J6940
7735B5316p768O747m50M441n732k416l297J7697r397l2829j3352N746K2673J2018
$$ plain form
7829 32817 10184 -19772 -18690 -15390 -158 9038 -4063 1006 -24098 -28599 -8133 3526 10785
7816 10785 5824 1006 1499 12836 9549 -7202 -10719 -26972 -24141 3027 26483 19263 -4196
7803 -4196 7058 18244 4424 19657 15461 11930 15988 924 7006 6067 -15071 -318 4154
7790 4154 -12821 -127 -181 -18252 -9479 -7669 9014 22776 16035 -11986 -19233 -7281 -8455 -6395
7776 -6395 -6485 8667 36369 23746 8741 16674 5448 3727 26798 32452 14942 8426 3980 2649
7762 2649 10779 27000 28953 15934 26123 10142 -18196 -27763 -32417 -42728 -34586 -17203 8534
7749 8534 21060 21407 24301 18928 1322 -10732 -17182 431 2142 -12970 -6475 -5610 8376 25316
7735 25316 17548 24295 23845 28286 22554 20138 16841 34538 25141 -7688 -21040 -15294 7379 19397
7721A9397j0410j1592J9000O875q270J2121K924J395j1850q468P629k3423L896
7708g76R887m343l281j4961j645k419K1304J6432J0422R123j1213r508p321J4277
7694B5978m192j7427k79O422p030k449K2307k7126k3890N070Q143l905l701J1192
7680a0887J662J6892J0834q721j003K314N825l931n675m311Q773J0148j6596j6276
7666a0952M136K5108K055m562n137k0154k9048J45J8376j728M3L4656M4264R573
7652F6775j8725k2992l5452k126J1496P897j0731j6256l367n074J6146J8652M50
7639F693j4426j4054O553J2484Q374j2706k83q932r514J807J2429p81J3075j3012
7625a2293j3503k751k721J5441K527K5889J0677J519j6823Q908j331J348J6316
$$ plain form
7721 19397 8987 -2605 16395 23270 15000 27121 30045 31440 19590 11122 18751 -4672 -776
7708 -776 9111 4768 1487 -13474 -15119 -17538 3766 20198 30620 39743 28530 19022 11701 25978
7694 25978 21786 4359 4080 10502 3472 1023 23330 -3796 -27686 -22616 -14473 -18378 -22079 -10887
7680 -10887 -9225 7667 18501 9780 8777 11091 16916 12985 7310 2999 11772 21920 5324 -10952
7666 -10952 -6816 18292 20347 15785 10648 -9506 -38554 -38409 -20033 -21761 -21718 12938 57202 66775
7652 66775 48050 25058 -10394 -12520 -1024 6873 -3858 -20114 -23481 -28555 -12409 6243 6693
7639 6693 -7733 -21787 -15234 -2750 5624 -7082 -7365 -16297 -25811 -24004 -11575 -12356 719 -12293
7625 -12293 -25796 -28547 -31268 -15827 -13300 12589 23266 24785 7962 16870 15539 16887 33203
7612C3203L04j2809J1622K2360L946j6172j8502j3734j8920l769O141P783j1716
7599a0263j5931N312J8187J2632N847p325j0721q959Q002J6251K895q086O451
7586A4292Q49j4060k712M956o1p751P030Q984O850m420o879P527P038p295L965
7571A8313J309K081n148o100j0985j978l498j0676r476q08N742P672Q430M397
7557g25K230j0421J3250K2744j2299k2781k566J0258J5722Q050m82j5467j7629
7544a0116l088J6241J3029j3684M546J7508J0073J3765j7213j7693k1748j5389
7532b3769J1204K366J3039J2785K850p091j3499q865J3702J1621l532j2304K1752
7519B0259Q889j2455j6818L583O594L193j0850M199J2078J5529j6151k6306r955
$$ plain form
7612 33203 33507 20698 32320 54680 58626 42454 23952 10218 -8702 -12471 -6330 1453 -10263
7599 -10263 -26194 -20882 -2695 9937 15784 8459 -2262 -11221 -3219 13032 15927 7841 14292
7586 14292 15141 1081 -1631 3325 3264 -4487 2543 11527 18377 13957 7078 14605 21643 14348 18313
7571 18313 19622 21703 16555 10455 -530 -2508 -6006 -16682 -26158 -26966 -21224 -13552 -5122 -725
7557 -725 1505 -8916 4334 27078 14779 -8002 -10568 -310 15412 23462 22980 7513 -10116
7544 -10116 -13204 3037 16066 2382 6928 24436 34509 48274 31061 13368 -8380 -23769
7532 -23769 -12565 -10199 2840 15625 18475 11384 -2115 -10980 2722 14343 10811 -1493 20259
7519 20259 29148 16693 -125 3458 10052 13245 2395 6594 18672 34201 18050 -8256 -18211
7506a8211K5435K0675N65l2086p949j257Q813L5534M579j7542j4415l628p14Q852
7492H651p169p994M117l81R585K607M276q19j5216j2427J549J7964n290P089k430
7477D112m804K177O561N016j563K769r807j1084j693m381k597K13m431J10L587
7462a5815J2735J4233J9663P891n363j6614o669q22R847l0237j5057j0829R763
7449b7274P406J4167Q648k0017k5365L504q07N439J9107P411J601J8563n053n465
7435A865n219r76q619k305q473J4416K5966Q587o686j2502j3316j3204k436K1041
7421a861L919n720j2114k1718j2828L4870K8654M267j1684j5532n424R581J3387
7408G797j4969J040J6311p679k0279K1163O618k865j2224k7690J194J2372L2007
$$ plain form
7506 -18211 7224 27899 28464 -3622 -11571 -12828 -4015 31519 36098 18556 4141 513 -201 8651
7492 8651 1482 -6512 -2395 -2776 6809 9416 13692 12873 -2343 -14770 -13221 4743 -547 6542 4112
7477 4112 -692 1485 8046 13062 11499 14268 4461 -6623 -8316 -12697 -15294 -15081 -19512 -19402 -15815
7462 -15815 -3080 11153 30816 38707 33344 16730 10061 9239 19086 -11151 -26208 -37037 -27274
7449 -27274 -19868 -5701 2947 -17070 -42435 -38931 -39738 -34299 -15192 -7781 -6180 12383 7330 1865
7435 1865 -3354 -4330 -12949 -15254 -23727 -9311 16655 25242 18556 6054 -7262 -20466 -22902 -1861
7421 -1861 2058 -3662 -15776 -37494 -50322 -15452 13202 17469 5785 -9747 -15171 -5590 7797
7408 7797 -7172 -6132 10179 2500 -17779 3384 10002 7137 -5087 -32777 -31583 -19211 12796
7395A2796L774P822r89k0594Q964J5214j220l768n798K058r49j595P554q323K59
7380A5205j0788j3186r340L522J4740K015l699j223o01n101q500j2871j5381m413
7366d9621L761J1748k725r325R171j97K1552K769j0447j660J1968J0676M710r366
7352f986R65P958R020J720K2176P673l040j6096k5900J475K099m929J0376R230
7338A5741J360m484n282k719q553J909J454R861J3045J209O773o486O919j1011
7324A9736j113k339M910j2691j969L430M414p385j9776q324J6601K6051n137M135
7310B0543P61j4010r291N229p140j9270L0269l453L612j018j9320p8k1203K503
7296c1866J3163l000J8917L478M11J2737P33n026j0978J2451Q027j3729l014N645
$$ plain form
7395 12796 16570 24392 23403 2809 11773 26987 25767 21999 16201 18259 17310 15715 23269 14946 15205
7380 15205 4417 -8769 -18109 -14587 153 2168 -1531 -2754 -3355 -8456 -16956 -29827 -45208 -49621
7366 -49621 -45860 -34112 -36837 -46162 -36991 -37188 -15636 -12867 -23314 -24974 -13006 -2330 2380 -6986
7352 -6986 -6021 1937 10957 12677 34853 42526 39486 23390 -2510 -1035 1064 -3865 6511 15741
7338 15741 17101 12617 7335 4616 -3937 -2028 -574 9287 22332 23541 30314 23828 30747 19736
7324 19736 18623 16284 21194 8503 6534 9964 14378 6993 -12783 -21107 -4506 21545 16408 20543
7310 20543 21304 7294 -1997 3232 -3908 -23178 7091 3638 7250 6232 -13088 -13166 -34369 -31866
7296 -31866 -18703 -21703 -2786 692 1103 13840 14573 9547 -1431 11020 19047 5318 2304 7949
7282G949j3517j7949j0150j554Q529O103K0802Q313R132j801j0066j319J8416
7269B2888J8848n650j8077J7901j2874l530K87k1745o306o687K065O896n555O99
7255a0840p281J2004J481N333q704j7430q515M805o43J3525J8938J1230k732O60
7241A1831j5225j1595n313N592L368J5160J7946R102m907J9456J4308j5235j9917
7228B4571j8411n22J1244j0664O063J268j4294j4813l230M072Q214j0441J3939
7215c004J0161j9977l592L721J4694Q320p330j831p008j4472l464O681J6515l526
7201d112J1384j7503j0676J565K3626K2015M686j1083L438j8258n721m635j3640
7188a8914m248l366L2307j3261l042j410L37J4195J2839o817O16K762o541k1661
$$ plain form
7282 7949 -5568 -23517 -33667 -35221 -26692 -20589 213 8526 17658 15857 5791 4472 22888
7269 22888 41736 36086 18009 35910 23036 19506 19793 -1952 -8258 -14945 -12880 -5984 -11539 -10840
7255 -10840 -18121 -6117 -4636 697 -8007 -25437 -33952 -29147 -29790 -16265 2673 13903 11171 11831
7241 11831 -3394 -14989 -20302 -14710 -11342 3818 21764 30866 25959 45415 59723 44488 24571
7228 24571 6160 5638 16882 6218 12281 13549 -745 -15558 -18788 -14716 -6502 -16943 -3004
7215 -3004 7157 -12820 -16412 -12691 2003 10323 2993 1162 -5846 -20318 -23782 -17101 -586 -4112
7201 -4112 7272 -10231 -20907 -19342 4284 26299 30985 19902 23340 5082 -639 -5274 -18914
7188 -18914 -23162 -26528 5779 -7482 -10524 -11934 -11597 2598 15437 8620 9236 11998 5457 -16204
7174a6204j069Q678q135M10K2804l540o570J8651L969O616o967K841n423m82j0950
7159D629j0559l121J4958j604j0261k28J141K16j638J05Q389N400j3287q182j650
7144a5692m404j2155J3476m347j7190j718L9563J2775j109r493O684J564j3713
7131e759Q32j0836j7261k800K9230K292O649N151j6549l575m601k0401l147K0386
7117b0389J3643k335p417J2602M544p106j814N198p860r695P284K2592m852p484
7103c089j0644M771N242P904O021j0827m885j2249J3680K1650j6064j0307J489
7090g308J6123N385k8346j4107K3841J2287p649l6495p735L8663J4809k3990o36
7077a5158k001j3546j5699J4220J2066K866j153j824k955Q197M371M886R856R822
$$ plain form
7174 -16204 -17273 -8595 -16730 -16320 6484 2944 -3626 15025 18994 25610 18643 21484 16061 15579 4629
7159 4629 -5930 -9051 5907 4303 -5958 -6186 -5045 -4829 -6467 -6362 2027 7427 -5860 -14042 -15692
7144 -15692 -20096 -32251 -18775 -23122 -40312 -42030 -2467 10308 9199 -294 6390 7954 -5759
7131 -5759 -4927 -15763 -33024 -35824 -6594 -4302 2347 7498 -9051 -12626 -17227 -37628 -40775 -20389
7117 -20389 -6746 -9081 -16498 -3896 648 -6458 -8272 -3074 -10934 -20629 -13345 9247 4395 -3089
7103 -3089 -13733 -8962 -3720 4184 10205 -622 -5507 -17756 -4076 17574 1510 -8797 -7308
7090 -7308 8815 14200 -14146 -28253 -4412 7875 226 -36269 -44004 -5341 9468 -14522 -15158
7077 -15158 -17159 -30705 -46404 -32184 -20118 -17252 -18405 -20229 -23184 -14987 -10616 -5730 4126 13948
7063A3948k3357j0916q661J519K9076K1224o33j5146J0786O240k3547j2832j2582
7050b4881K683L338J1045p002j6270j7879n632K4647K5288L402j2952P746J337
7037e130j1834m303K7111O5l088k855P972k448L776K7253J463j7600r663Q587
7023A9306R46k178j8343Q13o356J5674m647k0356r405N90J2120P31K753J2962
7009D610O682J1378o89o367J8206J2264p014j4241l4050P098q139p506J0970J087
6995e711j677K696Q750Q871J941j5750j1211j2341J826J2808K2290q613k626m346
6981c093M97J4663j4359n159l661n046n789L891J0380J8006o168K266k837M731
6967H322r600j3951m044P072L034p953p860K699K7806R25j7765r669r792K2935
$$ plain form
7063 13948 -9409 -20325 -28986 -27467 1609 22833 22200 7054 17840 24080 533 -12299 -24881
7050 -24881 -22198 -18860 -7815 -14817 -31087 -48966 -54598 -29951 -4663 -1261 -14213 -6467 -5130
7037 -5130 -16964 -21267 5844 5909 2821 -34 7938 5490 9266 36519 37982 20382 10719 19306
7023 19306 20252 18074 -269 544 -5812 9862 5215 -15141 -24546 -23956 -11836 -11105 -8352 4610
7009 4610 11292 22670 21981 15614 33820 46084 39070 24829 -9221 -2123 -10262 -17768 -6798 -5711
6995 -5711 -7388 -4692 4058 12929 14870 -880 -12091 -24432 -22606 -9798 12492 3879 1253 -3093
6981 -3093 -2596 12067 -2292 -7451 -11112 -16158 -21947 -18056 -7676 10330 4162 6428 3591 8322
6967 8322 -1278 -15229 -19273 -12201 -9167 -17120 -24980 -22281 5525 6450 -11315 -20984 -30776 -7841
6953g841J3091p606j877K261q589K2528J3250J671k827N207J7716j9080m2946
6940a5042o722J0347j6176L65M308J3194K817J1308K0113R914k872J888j9107
6927A4335m092L367q650k8825j1046J0107J6736m314L280O500K3187J1657p790
6914B4452q102J5766k645j1622j3301L755M258o43K272r54p448P182l734j4541
6900e305k173p125Q809j2715O983L0995m624o938j0926j2958m127J1605j500J3573
6886C574M790J5790j2600P967J1750j6447k359P933J0358q096r960m697N87l748
6872D842J5621K1569k097j9516j1425j0312j2671J4208r268P528k1465j0297K842
6859c0441J7154K5833K2567n904k1279k880M80M548J8925R758n090j0056j8789
$$ plain form
6953 -7841 5250 -2356 -4233 -1972 -10561 11967 25217 26888 24061 29268 46984 27904 -15042
6940 -15042 -21764 -11417 -27593 -27228 -22920 -9726 -6909 4399 24512 34426 31554 33442 14335
6927 14335 10243 13610 4960 -23865 -34911 -24804 -8068 -12382 -9102 -2602 20585 32242 24452
6914 24452 16350 32116 29471 17849 4548 8303 12561 11918 14190 13236 5788 12970 9236 -5305
6900 -5305 -7478 -14603 -5794 -18509 -11526 19469 14845 7907 -3019 -15977 -20104 -8499 -9999 3574
6886 3574 8364 24154 11554 19521 31271 14824 12465 20398 30756 22660 12700 8003 8590 4842
6872 4842 20463 42032 39935 20419 8994 -1318 -13989 219 -9049 -1521 -22986 -33283 -30441
6859 -30441 -13287 12546 35113 29209 7930 5050 5530 10078 29003 38761 33671 23615 4826
6846D826O864J4078m237k121J479o791j1157n197Q9J6013p001K463r293k8315
6832b8300K3224K4791r058j6929m043J5913R336j8296j0518p379Q923M285P305
6819g46q075j0915Q408K3063J827j2127L064K360K0060n488l3708j398J2793M092
6805C210j2065j9600J0040k604J633K2385J1869J3698j2737j8454J228J6238j3247
6792A594J666j513N579J904J0729K86j5271N879O427L620Q585o689j2159m323
6778F314n874K2720k0957j5882J3572J2371p803J1758Q315o055n536l11K662L922
6764A9216J0452p124o69p304j4075j5484o883K3336J7062j4744J276j404L513
6751G168K314j1k849J2862N097m139M503J3506j8088j4599p373M511l518P196
$$ plain form
6846 4826 11690 25768 21531 19410 20889 14098 2941 -2256 -2167 13846 6845 9308 15 -28300
6832 -28300 -5076 19715 10657 -6272 -10315 5598 14934 -3362 -13880 -21259 -12336 -8051 -746
6819 -746 -8821 -19736 -11328 11735 13562 1435 4499 6859 26919 21431 -12277 -13675 -882 3210
6805 3210 -8855 -28455 -18415 -21019 -19386 2999 14868 28566 15829 -2625 -1397 14841 1594
6792 1594 3260 1747 7326 9230 19959 20245 4974 10853 17280 20900 29485 22796 10637 6314
6778 6314 440 23160 2203 -13679 -107 12264 4461 16219 24534 18479 12943 12632 15294 19216
6764 19216 29668 22544 21875 14571 496 -14988 -21871 1465 18527 3783 5059 3655 7168
6751 7168 9482 9471 6622 19484 24581 20442 24945 38451 20363 5764 -1609 2902 -616 6580
6737F580M508K6118q129k1558J514K0110j2434P729N37j5555l497P714J5087J346
6723C0070k9891p298j4762j5049K071J5472J5821l74Q062P000J5764l1081k0754
6710b4949P214l345P867J5451l143j6399k0396K3436J5665q704o921P43J2166
6697a315N153o997P399o295J3386n611o95N257n635k806P395j585m049r176J1756
6682F182k031n588L347L438L093K3061K170q721p505J0690M893k4103L966K3532
6668C6424j4491k0517j0281j6821J2761J1645o909K570m996o233J8949P913O955
6655A6969j0539r711J1184K2899o026k6767j7748q705J4608L1525j3271k7353
6643b2935P939J918k0376l854L0074J0274J4682l640k869j8726j8249K0348L279
$$ plain form
6737 6580 11088 37206 29077 7519 9033 29143 16709 24438 24975 9420 5923 13637 28724 30070
6723 30070 179 -7119 -21881 -36930 -34859 -19387 -3566 -3940 4122 11122 26886 -4195 -24949
6710 -24949 -17735 -21080 -13213 2238 -905 -17304 -37700 -14264 1401 -7303 -14224 -13481 -1315
6697 -1315 3838 -3159 4240 -2055 11331 5720 5025 10282 4647 1841 9236 7651 3602 -5574 6182
6682 6182 4151 -1437 1910 5348 8441 31502 33672 24951 17446 28136 33029 8926 12892 36424
6668 36424 21933 1416 -8865 -25686 -12925 -1280 -8189 -5619 -10615 -16848 2101 10014 16969
6655 16969 6430 -3281 7903 30802 24776 -1991 -19739 -28444 -13836 17689 4418 -22935
6643 -22935 -14996 -13078 -33454 -37308 -7234 3040 17722 14082 11213 -7513 -25762 -5414 -2135
6630b135P81j2098J5373P34j8592k1700n515j740L635m548J4344R321Q466m2J4068
6615C52R489N195L838o913k854L159J3100O013r162j4880k0628l57j8522N937
6601b6233N242m468l893J1411K4299k2555k1485J0944K1796J6009r794J285M569
6588G127o642L666J0557p757j0533l806L021p222O195R780p542m431j2582M911
6574a5258J5884O776j927p348j5274k437J9096P804n185Q267J66r963o535N409
6560e25J2050Q287Q847j7469k3936j0576J2070J801j310P549R262J0435J3392
6547B9877q485l636L87P551J829j7631k9932P670J5091R25m108K232J3581K025
6533A7376k059J2479O977J6246J055j3375j3103k1804j3605p530J8942L8j1352
$$ plain form
6630 -2135 -1354 -13452 1921 2655 -15937 -37637 -43152 -44892 -41257 -45805 -31461 -22140 -13674 -13716 352
6615 352 9841 15036 18874 11961 9107 12266 25366 31379 22217 7337 -13291 -13648 -32170 -26233
6601 -26233 -20991 -25459 -29352 -17941 6358 -16197 -37682 -26738 -4942 11067 1273 2558 7127
6588 7127 485 4151 14708 6951 -3582 -7388 -4367 -11589 -5394 4386 -3156 -7587 -20169 -15258
6574 -15258 626 7402 5475 -1873 -17147 -19584 -488 7316 2131 10398 10564 601 -5934 -525
6560 -525 11525 19812 28659 11190 -12746 -23322 -11252 -9451 -10761 -3212 6050 16485 29877
6547 29877 21392 17756 18143 25694 27523 9892 -20040 -12370 2721 3646 -462 1770 15351 17376
6533 17376 15317 27796 34773 51019 52074 38699 25596 3792 -9813 -17343 1599 1637 -9715
6520i715j5339j028m299j0430J8111m400j5500K1659J0680j1874m545N892J1063
6507i725R054L709M658j6753j098O843Q418R49p326O414K1858P144k135j6622
6493A5388q139o93p635k2704R047r840j0132k057K2728K994j4881L143J2809L0542
6479B0570M318j3680o174p027l23O21L915J1597j5891J074J0164R602K084O606
6465B7456K803k5960j4507K0892m193P978L724j7907j2493J0461J3021L930o419
6452H786j692Q302J9527k0299j0771J866j0508M874o618N047J1671P886k347n37
6438A5187m235j678Q453o051m154p444j6473o779R751J5008J4494M78R059M69
6424B6085l3260j097L6642J0095q576k4811r571O812Q155M351L756O283j0823
$$ plain form
6520 -9715 -25054 -26082 -30381 -40811 -22700 -27100 -42600 -20941 -10261 -22135 -26680 -20788 -9725
6507 -9725 -671 3038 7696 -9057 -10155 -3312 5106 6055 -1271 5143 27001 34145 32010 15388
6493 15388 7249 6556 -1079 -23783 -14736 -24576 -34708 -36765 -14037 -11043 -25924 -22781 -9972 20570
6479 20570 24888 11208 5034 -1993 -2316 -1695 2220 13817 -2074 -1000 9164 18766 20850 27456
6465 27456 30259 4299 -10208 10684 6491 14469 18193 286 -12207 -1746 11275 15205 8786
6452 8786 7094 15396 34923 14624 3853 5719 -4789 85 -6533 -1486 10185 18071 15724 15187
6438 15187 10952 9274 17727 11676 7522 78 -16395 -23174 -13423 1585 16079 16557 25616 26085
6424 26085 -7175 -8272 28370 38465 29889 5078 -4493 2319 10474 14825 18581 24864 14041
6411A4041q831P205J1459o41j9893R706l775n894m916J3270J4786p538j2673N294
6397A1600K6394k1843k6264Q112p404j9990p057j955Q820J1106k906O034J6316
6384I63J828q430J451P663k0832j4160O604K8996M980P005K3909m509l3994j9788
6370a8314p193l456L404J7506N311q712j0377j3846J6404K2243N376L265j5245
6357c634O396N701o201j6196j470J3476Q461K192J3671l495P87l46k4992j3993
6343a9643K2717J8034M079K441k0353J1389K1814R026j5754j2003J380j4451j9449
6330a0773Q091k133N93o625k4106J9053K3808j2113j3631j0447J6183J3051J456
6317B407j3564M526l906j865R792j6185M895J0970L831r787o657K667J0800k5590
$$ plain form
6411 14041 5210 12415 23874 23233 3340 13046 9271 3377 -1539 11731 26517 18979 6306 11600
6397 11600 37994 16151 -10113 -2001 -9405 -29395 -36452 -38407 -29587 -18481 -21387 -15353 963
6384 963 2791 -5639 -4188 3475 -17357 -31517 -24913 4083 9063 16068 39977 35468 1474 -18314
6370 -18314 -25507 -28963 -25559 -8053 -2742 -11454 -21831 -35677 -19273 2970 8346 11611 -3634
6357 -3634 2762 8463 2262 -13934 -15404 -1928 6533 8725 22396 18901 19688 19342 -5650 -19643
6343 -19643 3074 21108 25187 27628 7275 18664 40478 49504 33750 21747 23127 8676 -10773
6330 -10773 -2682 -4815 -4222 -10847 -34953 -15900 7908 -4205 -17836 -28283 -12100 951 2407
6317 2407 -11157 -6631 -10537 -12402 -2610 -18795 -13900 -2930 901 -8886 -15543 -12876 -2076 -27666
6303b7666k5755J9802J9843R7J9578n542r692K280l277j3971k107K6671Q023j3668
6289e384K675O106K193L347J6380K4911j0434j6987R374J913j2085l226m482j2586
6275A715k3828K517K7220J8491j3130k8204n783Q501Q307M171J3897K0687l501
6262C1060j6820O566j1174q601Q18j8512n573j034k347R866Q503Q174r483j4523
6248b3080K039j087n910q590j2238j8434J4247J9482R263O724J7350J298R058
6235A0122P409k092q60r129K575J025N217P65j0588q107J0543m022o515J5932
6221A2275q100Q025l841j2483J2K472j47J7066Q089j1429k4389O025j1614k2926
6207d0965J775l700k924K7529J6872o831k008J1676j96k761N571l82n536j661
$$ plain form
6303 -27666 -53421 -33619 -13776 -13679 5899 357 -9335 -7055 -10332 -24303 -26410 261 8284 -5384
6289 -5384 -2709 3397 5590 8937 25317 50228 39794 22807 32181 34094 22009 18783 14301 1715
6275 1715 -22113 -19596 7624 26115 12985 -15219 -21002 -12501 -4194 -23 13874 34561 31060
6262 31060 14240 20806 9632 1031 1849 -16663 -22236 -23270 -25617 -15751 -7248 926 -8557 -23080
6248 -23080 -21041 -22128 -28038 -36628 -48866 -67300 -53053 -33571 -24308 -17584 -234 1064 10122
6235 10122 17531 15439 14579 5450 8025 9050 14267 15032 4444 -3663 6880 2858 -3657 12275
6221 12275 4175 12200 8359 -4124 -4112 -1640 -1787 15279 23368 11939 -12450 -6425 -18039 -40965
6207 -40965 -39190 -42890 -45814 -18285 -1413 -8244 -10252 1424 1228 -1533 4038 3656 -1880 -3541
6193c541k4955l269J4021L571k706q967j0497J2459P120J7757K252j4234j1629
6180b2618N765K470J4700K5656j292q853q712n384n584J9947Q403m900q46j062
6166A7690J2112J3052j1679k8569m161q465j5747K4611J5765L3607k179l6180
6154I857m222L03j429r995O980L160n320J7192Q903r896k3183k2205p106J6587
6140b0374J2191k642R466n306k2038J680O19K254L263K7177J0054P181j0906O192
6126A8811J3209j3899j9188p578J0755j156O639O836o967L882l178Q557j989j708
6112A3026n8j3149J0110J0487j0261j8725K284k353K187O841q581j1850L1617
6099A1575O767j1320J0494k161j0559l1460K009m583j0999N098K0646J2529k65
$$ plain form
6193 -3541 -28496 -31765 -17744 -14173 -16879 -25846 -36343 -23884 -16764 993 3245 -10989 -22618
6180 -22618 -16853 -14383 317 25973 24681 15828 7116 1732 -3852 16095 24498 19598 18752 17690
6166 17690 29802 42854 31175 2606 -1555 -10020 -25767 -1156 14609 48216 46037 9857
6154 9857 5635 5938 4509 -5486 1494 4654 -666 16526 25429 15533 -7650 -29855 -36961 -20374
6140 -20374 -8183 -10825 -1359 -6665 -28703 -27023 -26404 -24150 -20887 6290 16344 23525 12619 18811
6126 18811 32020 18121 -1067 -8645 2110 954 7593 14429 7462 11344 8166 16723 14734 13026
6112 13026 12968 -181 9929 20416 10155 -8570 -6286 -8639 -6452 389 -8192 -20042 11575
6099 11575 18342 7022 17516 15355 4796 -26664 -24655 -29238 -40237 -35139 -14493 -1964 -2229
6086b229J3707M584j2493P98N505J076n911J3770R711R449j386k242j2501k8451
6072f613j4707J2158M461M267N714m209M514K0885k705j9098o890j6424p974J5250
6058a1371P663O532J1838R231j1901j0641M466K34j8609n408j1679o370J7343
6045a8672O909m862n512P138J0497o145j8374R782n274K8467K1628P848R121M296
6031D6847j7891j8626j0274L246M960L376l045k8965j6104j805k931J3825K652
6018b4735j3207l450J4603J4774J6503J6622J4853n511j999k4785k7020j6761
6006d0113j4060J2254J2066R247O560N41M464r743J5510J2699p761j9597N303
5993a2630J6568J3375M031J9395P404q884q619l902k0054o236J4409K7677K472
$$ plain form
6086 -2229 11478 16062 3569 4367 9872 10948 5037 18807 28518 37967 36581 34339 21838 -6613
6072 -6613 -21320 -9162 -4701 -434 5280 1071 5585 26470 23765 4667 -2223 -18647 -26621 -11371
6058 -11371 -3708 2824 14662 23893 11992 1351 5817 6051 -12558 -17966 -29645 -36015 -18672
6045 -18672 -11763 -16625 -22137 -14999 -4502 -10647 -29021 -19239 -24513 3954 25582 33430 42551 46847
6031 46847 28956 10330 56 3302 8262 11638 8593 -20372 -36476 -38281 -41212 -27387 -24735
6018 -24735 -37942 -41392 -26789 -12015 4488 21110 35963 30452 28453 3668 -23352 -40113
6006 -40113 -54173 -41919 -29853 -20606 -14046 -13505 -9041 -18784 -3274 9425 1664 -17933 -12630
5993 -12630 3938 17313 21344 40739 48143 39259 30640 26738 6684 448 14857 42534 45006
5980D5006k4774k3885j6672j0233n187m57J112P641J3623j03p620R140L9265J0245
5966C7101j9244o458o320m574N172j1889N558J6339j27r384j059L352K981J0340
5952B1788k3951J5210J4593K430j3579k5064m062O976L479k098o969O627Q13j0795
5938a4602M802N746J1048o676j3294j5745p071l216K3057K5703j2471l666j3055
5925a9440J3049K2891J6935j6148l2219j2403K6984M868k644j0334R878J4722
5913A6139o725k273J1116k0671j6254P653O81j691r06p743Q871N666P109K1656
5899B2628m176j5170q395l97J0784J839j401L592M12j0580j6889p950l359Q661
5885b0401J3209J0251O390O091J4323j2481N946L927j337m490k0436N092P801
$$ plain form
5980 45006 20232 -3653 -20325 -30558 -35745 -36202 -35090 -27449 -13826 -13929 -21549 -12409 26856 37101
5966 37101 17857 11399 5079 505 5677 -6212 -654 15685 15558 6174 5115 8467 11448 21788
5952 21788 -2163 13047 27640 30070 16491 -8573 -12635 -5659 -2180 -4278 -11247 -4620 -3807 -14602
5938 -14602 -9800 -4054 6994 318 -12976 -28721 -35792 -39008 -15951 9752 -2719 -6385 -19440
5925 -19440 -6391 16500 33435 17287 -14932 -27335 -351 4517 1873 -8461 1417 16139
5913 16139 9414 7141 18257 -2414 -18668 -11015 -10334 -12025 -12931 -20674 -11803 -6137 972 22628
5899 22628 18452 3282 -5113 -5510 5274 7113 5712 9304 9716 -864 -17753 -25703 -29062 -20401
5885 -20401 -7192 3059 9449 15540 29863 17382 23328 27255 25918 21428 992 6084 13885
5872A3885O35P842k1362l272n922m013q030O285J3358j704R34j2586j1819q279
5858c4048r37K9816L244k784Q554o012n827P52j9670j0301J0599J5609J8048m167
5844B876K591K374J992j7716k969P222n081m898j421J938J3703L61M032L960q986
5829b2k161J3034n723k991Q711P350n554j3455j1931j1244M796O159K3949m546
5815F372j4154P153J2671m706p947L681J0295j3774r375P606N818P642M207j5250
5801B39j232o449n624q843o248J1388J3124J391J788p125M695J0195k1665L035
5787a1331J2617k967q533N988O446m074k2158J0512K7228J0639j1003j2523j1414
5774a0573j378p301j3650j146K7497J2249q74r296J8009P830k896n113j4431j0000
$$ plain form
5872 13885 14520 22362 1000 -2272 -8194 -12207 -20237 -13952 -594 -2298 -1364 -13950 -25769 -34048
5858 -34048 -34985 -5169 -1925 -4709 3845 -2167 -7994 -7242 -26912 -37213 -26614 -11005 7043 2876
5844 2876 5467 7841 9833 -7883 -10852 -3630 -8711 -13609 -15030 -13092 611 972 5004 8964 -22
5829 -22 -2183 10851 5128 2137 10848 18198 12644 -811 -12742 -23986 -19190 -13031 10918 6372
5815 6372 -7782 -629 12042 7336 -611 3070 13365 -409 -9784 -2178 3640 11282 15489 239
5801 239 -993 -7442 -13066 -21909 -28157 -16769 -3645 -2254 -466 -7591 -2896 7299 -14366 -11331
5787 -11331 1286 -1681 -10214 -4226 2220 -1854 -24012 -13500 13728 24367 13364 841 -10573
5774 -10573 -11951 -19252 -32902 -34048 -6551 5698 4824 -4472 13537 21367 18471 13358 -1073 -11073
5760a1073M06K179N353j6311P637m042j9164J2715P512J7345J767j5108P606J1206
5746H028O173k6078N22J3131o19j8266J231R524J9454J2491n123J362Q129k1058
5732H901P813j5351k5787J0646Q588j2325j927J0886K0228l061m348n171N222
5719D314J8277p722j6285J3854O863K845j3602j8615J8031P326j736r562l620
5706C68R85J1005j5069r676o982J3427J4228n79J3462L179l923m997j3107j1088
5692h767k2114J9249m608o240P068n727j1095J2668m970l075Q419J326o33J1951
5678f548K089J2802o031n793r279p399n292O88J4947J0316P812k37O821k0097
5664e201o76O814J6971j504j4348j1405J3463j5468J969K8774j686q469Q795J5468
$$ plain form
5760 -11073 -10667 -8488 -3135 -19446 -11809 -15851 -35015 -22300 -14788 2557 4324 -10784 -3178 8028
5746 8028 14201 -11877 -11355 1776 1157 -17109 -15878 -6354 13100 25591 20468 21830 29959 8901
5732 8901 16714 1363 -24424 -13778 -5190 -17515 -19442 -8556 11672 8611 4263 -908 4314
5719 4314 22591 14869 -1416 12438 19301 22146 8544 -10071 7960 15286 13550 3988 368
5706 368 1353 12358 -2711 -12387 -19369 -5942 8286 7707 21169 24348 20425 15428 2321 -8767
5692 -8767 -30881 -11632 -16240 -22480 -15412 -21139 -32234 -19566 -24536 -27611 -19192 -17866 -18499 -6548
5678 -6548 -4459 8343 2312 -3481 -12760 -20159 -25451 -24763 -9816 500 8312 8075 14896 -5201
5664 -5201 -5877 937 17908 16404 2056 -9349 4114 -11354 -9385 19389 17703 9234 18029 33497
5650C3497j7044j528L498j8131J5247N725q840k3029k3413j0694J7159Q435J1643
5637g475Q614K7m30k759J1604R805k998k443J5470J0331j0646j3609l077n400
5623G014R164O961r032k1950P619R509n799j5089j6270m912J1532K43J1258J1108
5609A356j0932j076J9314L710n797p393m879J775j0525J0685K1750j0076l1528
5596b3616J2864K0676q524J5242P119o189j5640L280J7118q219k534m590m853
5583B134j1227k2874P605J2039K0618L0575L25j2696R599j0949o925o064j782
5570A0378M842k544J1446n688k1053j2349l705M856J2615r38O391L187k273K68
5556E433k816N034j8179r370o612N837K5838q06K506m899r816j4937P2o105l63
$$ plain form
5650 33497 16453 14925 18423 292 15539 21264 12424 -10605 -34018 -44712 -27553 -19118 -7475
5637 -7475 1139 1166 736 -2023 9581 19386 16388 13945 29415 39746 29100 15491 12414 7014
5623 7014 16178 23139 14107 -7843 -224 9285 3486 -11603 -27873 -32785 -21253 -21010 -9752 1356
5609 1356 -9576 -10652 8662 12372 6575 -818 -5697 -3922 -14447 -3762 17988 7912 -23616
5596 -23616 -10752 9924 1400 16642 23761 17572 1932 5212 22330 14111 11577 6987 2134
5583 2134 -9093 -31967 -24362 -12323 8295 38870 39195 26499 36098 25149 18224 12160 10378
5570 10378 15220 12676 24122 18434 -2619 -14968 -18673 -13817 -1202 -2140 4251 7438 5165 5433
5556 5433 2617 7651 -10528 -19898 -26510 -20673 5165 4359 6865 1966 -7850 -22787 -22715 -28820 -29183
5541b9183J3396K818o412R101O964j271n132k998K8873J1699j8390o932j0931
5528h398m967L901n931O848Q987J7240P933J1369M396r650n030L968j9719j7482
5514f535j2059r930j4478J9380K8684j751J2446O467L554j3631r306R046K618
5501A4505n853j493K133J593O998l240J818o972N121R732j629J71j2250p476J302
5486D460l804n694q273J4586J7618j228q107l472j5912k478j27K820j2016N422
5472a6205J0558L661n861J3037N169j8460j1209K6362K6923j0612j8198j6041
5460a0876J560R77j1413m465k144p774l541J4027k2082P070K6732J4862k637j8067
5446a7771j449n503l861P375K0589j4292J2857q038K161J849j2452m690l829J3841
$$ plain form
5541 -29183 -15787 -12969 -19381 -10280 -3316 -4587 -9719 -12717 16156 27855 9465 2533 -8398
5528 -8398 -13365 -9464 -15395 -8547 440 17680 25613 36982 41378 31728 26698 30666 10947 -6535
5514 -6535 -18594 -28524 -43002 -23622 5062 3311 15757 22224 25778 12147 2841 11887 14505
5501 14505 8652 7159 9292 10885 17883 14643 16461 9489 14610 24342 22713 22884 10634 3158 4460
5486 4460 656 -5038 -13311 1275 18893 17665 9558 6086 -9826 -12304 -12431 -9611 -21627 -16205
5472 -16205 -5647 -1986 -7847 5190 10359 -8101 -19310 7052 33975 23363 5165 -10876
5460 -10876 -9316 -8339 -19752 -24217 -26361 -34135 -37676 -23649 -45731 -38661 -11929 2933 296 -17771
5446 -17771 -19220 -24723 -28584 -21209 -620 -14912 -2055 -10093 -7932 -6083 -18535 -23225 -27054 -13213
5432a3213J7272l351K603j1950j0506P048P199k646j3498J4854R205j594j4277
5419a2854o830j15J0015J562j485K687j9324n557K2478R697j860o487l196O23
5405a0646K261O699j2894r986J4668K111J069j3594m091J8147R53k993L849j1483
5391a5930q475p216J3145l917j1294J7280J9175j2958K1362L972j4201n737m635
5378i429n649M323K3489O13j7320r516L892L848J074j3296q596M19Q82N129M659
5363a5478k598J1039K0307j363j8686J112J7317J1333j2769j1698m301j3010J1661
5350g134J8316q474j2005j468j5958L249J1859J4999J486l08j2116k5294l641
5337c6489L304l350J4708J8561J6821l978k667J6103j9249k430K88M200k839j2911
$$ plain form
5432 -13213 4059 708 3311 -8639 -19145 -12097 -4898 -7544 -21042 -6188 3017 1423 -12854
5419 -12854 -19684 -19799 -9784 -8222 -9707 -7020 -26344 -31901 -9423 274 -1586 -8073 -11269 -10646
5405 -10646 -8385 -1686 -14580 -24566 -9898 -7787 -6718 -20312 -24403 -6256 -5303 -8296 -4447 -15930
5391 -15930 -24405 -31621 -18476 -22393 -33687 -16407 2768 -10190 11172 15144 943 -4794 -9429
5378 -9429 -15078 -10755 12734 13347 -3973 -13489 -9597 -5749 -4675 -17971 -26567 -26148 -25266 -20137 -15478
5363 -15478 -18076 -7037 13270 11907 -6779 -5667 11650 22983 10214 -1484 -5785 -18795 -7134
5350 -7134 11182 2708 -9297 -10765 -26723 -23474 -11615 3384 4870 4562 -7554 -32848 -36489
5337 -36489 -33185 -36535 -21827 -3266 13555 9577 6910 23013 3764 1334 1622 5822 2983 -9928
5323i928o019l893J448n050O559J5465p359J0040J4662R844k772J2032j3791j3846
5309G392P89j254L169O387M098r943n412Q127M296p046k1561l1778l777K3012
5295b3501K5536k787n231j395N626k0281j2482J0679J6042P421J0576O263k045
5282A4421r667k831J8043Q707m393k4501p64J3176L2635L065k4590j4511q985
5269a95j1576m555J0650j0030m188K2564J1727l286N4n799j7462J6787R780l296
5255A1175n304k5864p785j031O230K2912n055j4836k426J342j1538K47m491j7212
5241e3636Q432K0538J7292P3j8260L892P095O70N616P771O025j8436r833l671
5227b6432J1466K8491l759l5599r256k029K1288J9699k59k5200J2989Q170K162
$$ plain form
5323 -9928 -15947 -19840 -18392 -23442 -16883 -1418 -8777 1263 15925 25769 22997 35029 21238 7392
5309 7392 8181 6927 10096 16483 20581 10638 5226 13353 17649 10603 -10958 -42736 -46513 -23501
5295 -23501 2035 -752 -5983 -7378 -1752 -22033 -34515 -23836 -7794 -373 10203 16466 14421
5282 14421 4754 1923 19966 28673 24280 -221 -985 12191 44826 47891 23301 8790 -195
5269 -195 -11771 -16326 -5676 -15706 -19894 2670 14397 11111 11165 5366 -12096 4691 14471 11175
5255 11175 5871 -19993 -27778 -28809 -22579 333 -4722 -19558 -21984 -20642 -32180 -31933 -36424 -53636
5241 -53636 -45204 -24666 -7374 -7301 -25561 -21669 -14574 -13904 -8288 -517 5508 -12928 -22761 -26432
5227 -26432 -14966 13525 9766 -25833 -35089 -37118 -15830 3869 3610 -21590 -8601 -431 1731
5214A731K6876M43j7555k1804o652J3107l274r593l93j4755k255J8957J2710m567
5200g024J177p766j0906K4593J0437q385q059o812M990O319K775m036M471N896
5186G670r602j8668Q323J7600Q461j1415J725j919N329m305Q525l224L503k489
5172I514r368r971R012K3673j3303k2417l848J32N239N300L0604l32j210R65l162
5157B0828j1033j0696R48j6597j0977K1898J2827K663q107M376q6j5032j1569
5144b0557l246J7154J5751P209j2839l0799l764K0905J1787m46P461K18K4514
5131C3348j049j4808j3960J7749L214j5111k1810j0901l383p697K9958K5627n21
5118B0656j0208j4283m356p353K1346K3085M380j3212r808O709L096j3479j7074
$$ plain form
5214 1731 28607 29050 11495 -10309 -16961 -3854 -7128 -16721 -17114 -31869 -34124 -15167 -2457 -7024
5200 -7024 -5847 -13613 -24519 74 10511 2126 -5933 -12745 -7755 -1436 1339 -2697 1774 7670
5186 7670 -1932 -20600 -12277 5323 13784 2369 4094 2175 7504 3199 11724 8500 12003 9514
5172 9514 146 -9825 -813 22860 9557 -12860 -16708 -16576 -11337 -6037 24567 24235 23025 23990 20828
5157 20828 9795 -901 47 -16550 -27527 -5629 7198 9861 1754 6130 6044 -8988 -20557
5144 -20557 -23803 -6649 9102 16311 3472 -27327 -31091 -10186 1601 1155 8616 8834 33348
5131 33348 32299 17491 3531 21280 24494 9383 -12427 -23328 -26711 -34408 -4450 21177 20656
5118 20656 10448 -3835 -8191 -15544 5802 28887 33267 20055 10247 16956 20052 6573 -10501
5105a0501Q916k120J78P86J629L183k237m572o304j3786P678J4976q081Q407L017
5090A169N858J3364P131k680p305n152j617j9886j0229J4741K0597p754m541K4798
5076B8494P60k1246k403N383M279j3077l601O683n47Q265m759l650j1026j4539
5062b0984r855j2336J1019J2278k9304l129J2555Q227K5809P299j0102j280K0025
5049A0222p882j3004o035j0717K994N575J1728L2O854P352j2562j4319M316J1279
5035d167P009J1281K063n528k591K062P008j407J213o127k84p303p990j4167r728
5020b8656j2272P783M168Q625m146J8859j189K1845J9582r80j7917j9431q635
5007a2364k530p350J4425N890j9110l917J7322j787k0100K381K6784J2413p746
$$ plain form
5105 -10501 -1585 -3705 -3527 -2741 -1112 2071 -166 -4738 -11042 -24828 -17150 -2174 -10255 -1848 1169
5090 1169 7027 20391 27522 24842 17537 12385 10768 -9118 -19347 -4606 15991 8237 3696 28494
5076 28494 29254 8008 5605 10988 15267 2190 -1411 5272 4725 12990 8231 4581 -6445 -20984
5062 -20984 -30839 -43175 -32156 -19878 -49182 -52311 -39756 -31529 -5720 1579 -8523 -9803 10222
5049 10222 2340 -10664 -16699 -27416 -24422 -18847 -7119 -7087 -233 7119 -5443 -19762 -15446 -4167
5035 -4167 2842 14123 16186 10658 8067 10129 17137 15730 16943 10816 10532 3229 -4761 -18928 -28656
5020 -28656 -40928 -33145 -28977 -20352 -24498 -5639 -6828 15017 34599 33619 15702 -3729 -12364
5007 -12364 -14894 -22244 -7819 -1929 -21039 -24956 -7634 -9421 -29521 -27140 -356 12057 4311
4994D311j8556k3554q882K0489J4291J8032O127O435o940q716l5327j302M339
4981b9253L4479J9896n672K059j254j037O201k248p231k1698k510J2385J810n505
4967D22k3209j6630N891N099K7791J9953r98k960j5625j0093k5517P986K8055
4954A65o905l180R970L458J6324Q876j2523k2180N182p670L969J1574J7156J8667
4940D2883j2607q669q48j0814j8198r221o549M092K4114J6042m694P913J0522
4927C3966k2682j2258m638n126K0585K354L557q114l387r008k4637L708J3532
4914a2148L191l619j5235o344j1617L654R974K714K0077K0491n12p091J0056N479
4900A9070n951J5376L826j1199j3269l625M060Q827j043k115j1691j3213J6410
$$ plain form
4994 4311 -14245 -37799 -46681 -26192 -11901 6131 12258 18693 11753 3037 -32290 -33592 -29253
4981 -29253 5226 25122 19450 21509 20255 19218 25419 23171 15940 -5758 -8268 4117 5927 422
4967 422 -22787 -39417 -33526 -28427 -636 19317 18319 15359 -266 -10359 -35876 -27890 165
4954 165 -6740 -9920 50 3508 19832 28708 16185 -5995 -813 -8483 -4514 7060 24216 42883
4940 42883 30276 21607 20759 9945 -8253 -17474 -24023 -19931 4183 20225 15531 23444 33966
4927 33966 11284 -974 -5612 -10738 9847 12201 15758 7644 4257 -4751 -29388 -25680 -12148
4914 -12148 -8957 -12576 -27811 -34155 -45772 -42118 -32144 -29430 -9353 11138 10626 3535 13591 19070
4900 19070 13119 28495 32321 21122 7853 4228 8288 17115 16072 13957 2266 -10947 5463
4887E463J6100j4475N534j7472p207l507j858R252M941J5589j4734q124Q196k4084
4873b6386k0287P864L541J9598p768J0397M759j2922M863r859j93K0683p802j1802
4859b5314Q487j42O01j0453J15L727N866J1690J8715p046j1792l397r180Q966
4845i157j5537P988Q530o896J1611J4723L836k0011k357j6489k0633n244J5530
4832c4106K345J5889J907M041j1J157j4812j4061P938M780J265m875n522J2927
4818b1138J4750J1273N508r37o588Q494j4155J261J057J2674k664j0743l336J7047
4804A2503J985k747J0784N424q853m844l032P803J5913k103k6912k3829j0821
4791b8729N63O997O84p816J6623M712j4704J1663L600K348O487J4171j1279K477
$$ plain form
4887 5463 21563 7088 12622 -4850 -12057 -15564 -17422 -8170 -3229 12360 -2374 -10498 -2302 -26386
4873 -26386 -46673 -38809 -35268 -15670 -23438 -13041 -8282 -21204 -16341 -26200 -26393 -5710 -13512 -25314
4859 -25314 -16827 -16969 -16368 -26821 -26706 -22979 -17113 -5423 13292 6246 -5546 -8943 -18123 -9157
4845 -9157 -24694 -16706 -8176 -15072 -3461 11262 15098 -4913 -7270 -23759 -44392 -49636 -34106
4832 -34106 -31761 -15872 -13965 -9924 -9935 -8778 -23590 -37651 -29713 -24933 -23668 -28543 -34065 -21138
4818 -21138 -6388 4885 10393 9456 2868 11362 -2793 -1532 -475 12199 9535 -1208 -4544 12503
4804 12503 14488 11741 22525 27949 19096 14252 11220 19023 34936 32833 5921 -17908 -28729
4791 -28729 -28166 -21169 -20485 -28301 -11678 -6966 -21670 -10007 -6407 -4059 2428 16599 5320 7797
4777G797M611j1097P705J4790r506K281j0786j5523J0135O850j2242J0364J3741
4764A9120J0175j4177l922M044R514N582j798j5492j8679k362r859o442R456n846
4750b0686M53J1757K226K3615K81l1700j5633K2893L725m090j1350Q227J4769
4737D487N219j0813P266j832j4793J3192Q059r361j0480q976K3251J9869q094
4724A6994p816J6675K104J0909q955j0248P80q997j0425N375K136j5133J41K3269
4710A6809J4661j6271j7553q790l306j877o942J2168J5114m695l8155j2674L0028
4697b1483L298L2090J1095k4389n02m943k0286p533O823N051k751J9597J1786
4684G853j6487o024k2635k0341M821R636J8052q633J7502M730R224J6247R774
$$ plain form
4777 7797 12408 1311 9016 23806 14300 16581 5795 -9728 407 7257 -4985 5379 19120
4764 19120 29295 15118 11196 15240 24754 30336 28538 13046 -5633 -7995 -17854 -24296 -14840 -20686
4750 -20686 -20233 -8476 -6250 17365 17646 -14054 -29687 -6794 -3069 -7159 -18509 -10282 4487
4737 4487 9706 -1107 6159 4327 -10466 2726 10785 1424 -9056 -18032 5219 25088 16994
4724 16994 9178 25853 27957 38866 29911 19663 20443 11446 1021 6396 8532 -6601 -6460 16809
4710 16809 31470 15199 -2354 -11144 -14450 -16327 -23269 -11101 4013 -682 -38837 -51511 -21483
4697 -21483 -18185 13905 25000 611 109 -4834 -25120 -32653 -25830 -20779 -23530 -3933 7853
4684 7853 -8634 -14658 -37293 -57634 -52813 -43177 -25125 -33758 -16256 -11526 -2302 13945 23719
4671B3719k1439k769J1778j1173j5319K814M064j7402p163M628M2729K109l7939
4658b1363K19J0078K16N900m641j5431J64J2227L2349O531k1874k0189P503O791
4644a520m764p078k0878N715K8502L1463K925k179j455r357K748l726o855P616
4630B1157q37l0206k3781J2425J4268j0031N389N999L676j328j0863m220l925
4617b2277J882J0094n929J7790Q857l886L755j3206o060q945r091K3100J7233
4604A3317J1240P153r905j8291j317k633j42N573J9777n845j2385k0536q830K771
4590b0053J0472j6267Q573J086k2425L192J8452J2483K0895o528k8730j1026K5615
4577d261l95p861J571J370L672j698P524K2159o994j1244J5854j293j1917K73
$$ plain form
4671 23719 2280 -489 11289 116 -15203 -12389 -8325 -25727 -32890 -28262 14467 16576 -21363
4658 -21363 -21144 -11066 -10850 -4950 -9591 -25022 -24858 -12631 19718 26249 4375 -15814 -8311 -1520
4644 -1520 -6284 -13362 -34240 -28525 -23 31440 34365 32186 30731 21374 24122 20396 13541 21157
4630 21157 20320 -9886 -33667 -21242 -6974 -17005 -11616 -5617 -1941 -3269 -14132 -18352 -22277
4617 -22277 -20395 -10301 -16230 1560 10417 6531 10286 -2920 -8980 -17925 -27016 -3916 13317
4604 13317 24557 31710 21805 3514 2197 -436 -578 4995 24772 18927 6542 -13994 -22824 -20053
4590 -20053 -9581 -25848 -17275 -16189 -38614 -35422 -16970 -4487 16408 9880 -18850 -29876 -4261
4577 -4261 -4656 -12517 -10946 -9576 -5904 -7602 -78 22081 15087 3843 19697 18404 6487 6760
4563F760P643l57K837j4247j0848l82O868M713J05l302q347K375M793o653M73
4548g569j8506o380J4574K7970J1859j6652j4835Q707k347j038K492R635j1091
4535c181k5449J3546K0632J5596J4495j2254k9888Q562j9025k3196J1935L5057
4523F830K3716K942k8571j4070M38j6345j4791J6576o26J1458J1126j1660l486
4510a6463J690j4345O834n840q428M619K0303K1289j0707j2461J341J1427K96
4497d45n359J6664k414N005n2k976k019R090L591n039j406R668o536l273l832
4482A0667k3907p993J2087K6568K3043k299k2764k376l671j4997j3500m865J1858
4469a2149J1052r84p403L061J477J0238n255j5246K82Q69m199J6261n29L333p316
$$ plain form
4563 6760 14403 14046 16883 2636 -8212 -8594 -1726 2987 3092 -210 -8557 -6182 -1389 -8042 -7569
4548 -7569 -26075 -32455 -17881 10089 21948 5296 -9539 -832 -3179 -4217 -1725 7910 -3181
4535 -3181 -28630 -15084 5548 21144 35639 23385 -6503 2059 -16966 -40162 -28227 6830
4523 6830 30546 33488 4917 -9153 -8715 -25060 -39851 -23275 -23901 -12443 -1317 -12977 -16463
4510 -16463 -14773 -29118 -22284 -28124 -36552 -31933 -11630 9659 -1048 -13509 -12168 -741 -445
4497 -445 -5804 10860 8446 13451 13399 10423 8404 17494 21085 16046 14640 24308 17772 14499 10667
4482 10667 -13240 -21233 -9146 17422 40465 38166 15402 13026 9355 -5642 -19142 -24007 -12149
4469 -12149 -1097 -2081 -9484 -6423 -4946 5292 37 -15209 -14927 -14058 -18257 -1996 -2525 808 -6508
4454f508k2595j2411J4477J7856k417q558J6928J0672K71P42j1075q953j690P23
4440a2538M905Q495j0489p924K696K6445R120K075j5191k807J2417O224j1518
4427A1910j3416n81J3958j6777k2988J3088J2771J882L388L111k428l6k1454j5076
4413c2648m06J082K1852j288K370j1221O786j1571J6983J1070J5879j3800N517
4400A0605j0407k4603R20J2219n24j5145k503J7111K2688M952j7999k326k616
4387g628L478J7635K3433o986l3154j1101j808j7502O370K0722R42j9667k8795
4374e4061q65J1714j068K711P558J0556J0280J4590q853K920J9989o235k7145
4361a7909m567K6235O927k601j1771q35n989K825O01M661J8636j869k663o147
$$ plain form
4454 -6508 -29103 -41514 -27037 -9181 -11598 -20156 -3228 7444 7715 8457 -2618 -11571 -13261 -12538
4440 -12538 -7633 862 -9627 -17551 -14855 11590 20710 22785 7594 4787 17204 23428 11910
4427 11910 -1506 -2087 11871 -4906 -27894 -14806 -2035 -153 3235 6346 3918 3882 -17572 -32648
4413 -32648 -33054 -31972 -10120 -11408 -9038 -20259 -13473 -25044 -8061 3009 18888 5088 10605
4400 10605 198 -24405 -23485 -11266 -11790 -26935 -29438 -12327 10361 15313 -2686 -5012 -7628
4387 -7628 -4150 13485 36918 29932 -3222 -14323 -16131 -33633 -27263 -6541 -5599 -25266 -54061
4374 -54061 -54926 -43212 -44280 -41569 -34011 -23455 -13175 1415 -7438 -4518 15471 9236 -17909
4361 -17909 -22476 3759 10686 8085 -3686 -4521 -10510 -7685 -7084 -2423 16213 14344 11681 5534
4347E534k2311K388N33r467l194k446k136Q171N914Q197j7600J3371K6245J0434
4333B3633N04p365K664j8057m907J2757k000o296l979J487J6257R501L965j9896
4319H268L147L125n280j6947j8109p611o729j2122J307J4138J1803J310J5576
4306h124M263o623P808q536j0458O461J1277m753j2893J240K1343m616j3088o68
4292a7367M60r113P674J494m036k741j2580q533K2356K975q359L347K5963j2820
4278a1280n763M104J2337N667o147o864o485J0588P859p774l982q457o769K519
4264b0447Q927r120l132J5895P302M413N69j0792m151q921J4712J7277Q839N368
4250B6739q594n593j1705p912O208M607J9829p33k1766l628J0811K068j4144k3110
$$ plain form
4347 5534 -16777 -14389 -13856 -23323 -26517 -28963 -31099 -22928 -17014 -8817 -26417 -13046 13199 23633
4333 23633 24137 16772 19436 1379 -3528 9229 7229 933 -3046 -1559 14698 24199 28164 8268
4319 8268 11415 14540 9260 -7687 -25796 -33407 -40136 -52258 -50951 -36813 -25010 -23700 -8124
4306 -8124 -3861 -10484 -2676 -11212 -21670 -15209 -3932 -8685 -21578 -20338 1005 -3611 -16699 -17367
4292 -17367 -16907 -26020 -18346 -16852 -20888 -23629 -36209 -44742 -22386 -19411 -27770 -24423 1540 -11280
4278 -11280 -17043 -12939 -602 5065 -1082 -7946 -14431 -3843 4016 -3758 -7740 -16197 -22966 -20447
4264 -20447 -11520 -20640 -23772 -7877 -575 3838 4407 -6385 -10536 -19457 -4745 12532 21371 26739
4250 26739 18145 12552 847 -7065 -857 3750 23579 22846 1080 -2548 8263 10331 -3813 -26923
4236b6923p195M740Q932l197P539J5122M53R512j2357j0127J9091j1519j7528
4223b3457K030K890J0863O786l67j024N825P602J0372K233O06l526j6529j0130
4209e826K1841M972P584L160j0686j5951j4627J1545K928j454L030K393Q493l647
4195A3755P033M583k8240K737l042P143K996j0906J2342k673M91L341r873L518
4181C205p014j232p091r444p777J4267J1455k600O50j848J6210K1774m479j8433
4167G643O568L610j743j2018l2391M900P887K379j76J8683j2491j1126l68o642
4153b5285J7199K4221Q89j3732j0166K0010J1914R072j4226k60K99j9643R595
4140I887q477J0129L6807m884l1840o856N46k4021j187n064j0676P467M7893j1717
$$ plain form
4236 -26923 -34118 -29378 -20446 -23643 -16104 -982 -529 8983 -3374 -13501 5590 -5929 -23457
4223 -23457 -21427 -18537 -7674 -888 -1255 -2279 3546 11148 21520 23753 24359 20833 4304 -5826
4209 -5826 16015 20987 28571 31731 21045 5094 -9533 2012 4940 3486 6516 8909 17402 13755
4195 13755 20788 25371 -2869 -132 -3174 3969 6965 -3941 8401 5728 6219 9560 -313 3205
4181 3205 -3809 -5041 -12132 -21576 -29353 -15086 -3631 -6231 -5581 -7429 8781 30555 26076 7643
4167 7643 14211 17821 16078 4060 -28331 -23431 -15544 -13165 -13341 5342 -7149 -18275 -18643 -25285
4153 -25285 -8086 16135 17024 3292 -6874 13136 25050 34122 19896 19636 19935 292 9887
4140 9887 1410 11539 48346 43462 11622 4766 5312 -18709 -19896 -24960 -35636 -28169 19724 8007
4126H007j0769p299o970l76K1596q501j2148N833K660k808L751Q629l0235j0459
4112c9089J809K2011J4718Q225J8563l214m692O766P931j6397j2959P76n410j6531
4098a7493n434K5599P959j9448n403J3565K3962j0127l1390k588J3546J7071K70
4085A0089l485k1169L486K2602p042O393O174p377j1750o502m916J0577O362L374
4071F816M854o471K895O317N314o031p162k950p428R561k490r92k83J0419Q818
4056B1187K951p186j5849K129j8129J3110J6012O557j0475n738j0503P210r538
4043h262j0069N455l112N525O377n039p152o760J6704J2590j0410p410J5343L313
4029G093j5901J963K326J3612P195k4075j2072O259j617p647K547P839K958l278
$$ plain form
4126 8007 -2762 -10061 -17031 -17407 4189 -4312 -16460 -10627 -7967 -10775 -7024 1605 -28630 -39089
4112 -39089 -37280 -15269 -551 7674 26237 23023 18331 25097 33028 16631 3672 4448 -962 -17493
4098 -17493 -22927 2672 10631 -8817 -14220 -655 23307 13180 -18210 -20798 -7252 9819 10089
4085 10089 6604 -14565 -11079 11523 4481 10874 17048 9671 -2079 -8581 -13497 -2920 3442 6816
4071 6816 11670 5199 8094 14411 19725 13694 6532 3582 -3846 5715 3225 2233 1950 12369 21187
4056 21187 24138 16952 1103 3232 -14897 -1787 14225 20782 10307 4569 -5934 1276 -8262
4043 -8262 -18331 -12876 -15988 -10463 -4086 -9125 -16277 -23037 -6333 6257 -4153 -11563 3780 7093
4029 7093 -8808 -6845 -4519 9093 16288 -7787 -19859 -13600 -15217 -22864 -20317 -12478 -9520 -12798
4015a2798O181J6885J3548R10j4016j5397m831p509k5075J4647N36k321q404L041
$$ plain form
4015 -12798 -6617 10268 23816 24726 10710 -4687 -9518 -17027 -42102 -27455 -26919 -29240 -37644 -34603
$$ [...]
##END NTUPLES=NMR SPECTRUM
##END=
