##TITLE=Analysis number 328544
Compound Code km 00316
Project Code adrs
Chemist Name ugmt
##JCAMPDX= 6.0         $$ Bruker NMR JCAMP-DX V2.0
##DATA TYPE= NMR SPECTRUM
##DATA CLASS= NTUPLES
##ORIGIN= Bruker BioSpin GmbH
##OWNER= nmr
$$ XWIN-NMR		Version 3.5
$$ Thu Jun 14 10:11:19 2007 GMT Daylight Time (UT+1h)  MAYBRIDGE\nmr@NMR_250MHZ
##.OBSERVE FREQUENCY= 250.131544655141
##.OBSERVE NUCLEUS= ^1H
##.ACQUISITION MODE= SIMULTANEOUS (DQD)
##.ACQUISITION SCHEME= undefined
##.AVERAGES= 16
##.DIGITISER RES= 18
##SPECTROMETER/DATA SYSTEM= dpx250
##.PULSE SEQUENCE= zg30
##.SOLVENT NAME= CDCl3
##.SHIFT REFERENCE= (INTERNAL, CDCl3, 0, 16.522)
##AUDIT TRAIL= $$ (NUMBER, WHEN, WHO, WHERE, WHAT)
$$ ##TITLE= Audit trail, XWIN-NMR		Version 3.5
$$ ##JCAMPDX= 5.01
$$ ##ORIGIN= Bruker BioSpin GmbH
$$ ##OWNER= nmr
$$ C:\u/data/dgb/nmr/ADRS/900/pdata/1/auditp.txt
$$ ##AUDIT TRAIL=  $$ (NUMBER, WHEN, WHO, WHERE, WHAT)
(   1,<2007-06-14 10:10:57.79 +100>,<MAYBRIDGE\nmr>,<NMR_250MHZ>,
      <created by zg, POWCHK disabled, PULCHK disabled
       configuration hash MD5:
       76 6E 9A 78 1E 09 19 81 EC 84 63 8F B0 6A 59 2D
       data hash MD5: 64K
       B6 3D 02 6C 0F 81 C8 60 DB 64 19 22 C9 CB 0B 00>)
(   2,<2007-06-14 10:11:10.20 +100>,<MAYBRIDGE\nmr>,<NMR_250MHZ>,
      <Start of raw data processing
       ef LB = 0.3 FT_mod = 6 PKNL = 1 SI = 32K 
       data hash MD5: 32K
       6F 67 ED CC AF CE BB F8 14 26 31 14 BF 53 03 18>)
(   3,<2007-06-14 10:11:12.84 +100>,<MAYBRIDGE\nmr>,<NMR_250MHZ>,
      <apk 
       data hash MD5: 32K
       E1 30 87 A0 F7 BC 7B 83 C9 F0 54 0E E3 8E 93 F1>)
(   4,<2007-06-14 10:11:13.64 +100>,<MAYBRIDGE\nmr>,<NMR_250MHZ>,
      <abs ABSG = 5 
       data hash MD5: 32K
       A5 BD FB 9B 47 2E 8E D9 90 AC 0F 52 8C C6 6B 00>)
$$ ##END=
$$ 
$$ hash MD5
$$ 3A 02 D8 2C E5 C8 7F 3B 4A 8C 44 3B 98 66 60 8F
##$RELAX= 
##$RELAX= 
##$RELAX= 
##$RELAX= 
##$RELAX= 
##$RELAX= 
##$RELAX= 
$$ Bruker specific parameters
$$ --------------------------
##$DU= <C:\u>
##$EXPNO= 900
##$NAME= <ADRS>
##$PROCNO= 1
##$TYPE= <nmr>
##$USER= <dgb>
##$AMP= (0..31)
100 100 100 100 100 100 100 100 100 100 100 100 100 100 100 100 100 100 
100 100 100 100 100 100 100 100 100 100 100 100 100 100 
##$AQSEQ= 0
##$AQ_mod= 3
##$AUNM= <au_zg>
##$AUTOPOS= <8 >
##$BF1= 250.13
##$BF2= 250.13
##$BF3= 250.13
##$BF4= 250.13
##$BF5= 500.13
##$BF6= 500.13
##$BF7= 500.13
##$BF8= 500.13
##$BYTORDA= 1
##$CFDGTYP= 0
##$CFRGTYP= 5
##$CHEMSTR= <none>
##$CNST= (0..31)
1 1 145 1 1 1 1 1 1 1 1 1 1 1 1 1 1 1 1 1 1 1 1 1 1 1 1 1 1 1 1 1 
##$CPDPRG= <>
##$CPDPRG1= <>
##$CPDPRG2= <>
##$CPDPRG3= <>
##$CPDPRG4= <mlev>
##$CPDPRG5= <mlev>
##$CPDPRG6= <mlev>
##$CPDPRG7= <mlev>
##$CPDPRG8= <mlev>
##$CPDPRGB= <>
##$CPDPRGT= <>
##$D= (0..31)
0 1 0 0 0 0 0 0 0 0.06 0 0 0 0 0 0 0.0002 0 0 0 0 0 0 0 0 0 0 0 0 0 0 
0 
##$DATE= 1181812256
##$DBL= (0..7)
120 120 120 120 120 120 120 120 
##$DBP= (0..7)
150 150 150 150 150 150 150 150 
##$DBP07= 0
##$DBPNAM0= <>
##$DBPNAM1= <>
##$DBPNAM2= <>
##$DBPNAM3= <>
$$ [...]
##$SUBNAM7= <"">
##$SUBNAM8= <"">
##$SUBNAM9= <"">
##$SW= 20.6930455092707
##$SWIBOX= (0..15)
0 0 3 0 0 0 0 0 0 0 0 0 0 0 0 0 
##$SW_h= 5175.983436853
##$TD= 65536
##$TD0= 1
##$TE= 297.16
##$TE2= 300
##$TE3= 300
##$TEG= 300
##$TL= (0..7)
0 120 120 120 120 120 120 120 
##$TP= (0..7)
150 150 150 150 150 150 150 150 
##$TP07= 0
##$TPNAME0= <>
##$TPNAME1= <>
##$TPNAME2= <>
##$TPNAME3= <>
##$TPNAME4= <>
##$TPNAME5= <>
##$TPNAME6= <>
##$TPNAME7= <>
##$TPOAL= (0..7)
0.5 0.5 0.5 0.5 0.5 0.5 0.5 0.5 
##$TPOFFS= (0..7)
0 0 0 0 0 0 0 0 
##$TUNHIN= 0
##$TUNHOUT= 0
##$TUNXOUT= 0
##$USERA1= <user>
##$USERA2= <user>
##$USERA3= <user>
##$USERA4= <user>
##$USERA5= <user>
##$V9= 5
##$VALIST= <valist>
##$VCLIST= <CCCCCCCCCCCCCCC>
##$VD= 0
##$VDLIST= <DDDDDDDDDDDDDDD>
##$VPLIST= <PPPPPPPPPPPPPPP>
##$VTLIST= <TTTTTTTTTTTTTTT>
##$WBST= 1024
##$WBSW= 4
##$XGAIN= (0..3)
0 0 0 0 
##$XL= 0
##$YL= 0
##$YMAX_a= 383136
##$YMIN_a= -439894
##$ZGOPTNS= <>
##$ZL1= 120
##$ZL2= 120
##$ZL3= 120
##$ZL4= 120
##$ABSF1= 16.522
##$ABSF2= -4.171173
##$ABSG= 5
##$ABSL= 3
##$ALPHA= 0
##$AQORDER= 0
##$ASSFAC= 0
##$ASSFACI= 0
##$ASSFACX= 0
##$ASSWID= 0
##$AUNMP= <proc_1d>
##$AZFE= 0.1
##$AZFW= 0.1
##$BCFW= 0
##$BC_mod= 0
##$BYTORDP= 0
##$COROFFS= 0
##$CY= 12.5
##$DATMOD= 1
##$DC= 0
##$DFILT= <>
##$DTYPP= 0
##$F1P= 14.0000005364418
##$F2P= -0.99999901652339
##$FCOR= 0.5
##$FTSIZE= 32768
##$FT_mod= 6
##$GAMMA= 0
##$GB= 0
##$INTBC= 1
##$INTSCL= 1
##$ISEN= 128
##$LB= 0.3
##$LEV0= 0
##$LPBIN= 0
##$MAXI= 10000
##$MC2= 0
##$MEAN= 0
##$ME_mod= 0
##$MI= 0
##$NCOEF= 0
##$NC_proc= -1
##$NLEV= 6
##$NOISF1= 0
##$NOISF2= 0
##$NSP= 0
##$NTH_PI= 0
##$NZP= 0
##$OFFSET= 16.522
##$PC= 1
##$PHC0= -94.2009
##$PHC1= 79.14168
##$PH_mod= 1
##$PKNL= yes
##$PPARMOD= 0
##$PSCAL= 4
##$PSIGN= 0
##$REVERSE= no
##$SF= 250.13
##$SI= 32768
##$SIGF1= 0
##$SIGF2= 0
##$SINO= 400
##$SIOLD= 32768
##$SREGLST= <1H.CDCl3>
##$SSB= 0
##$STSI= 32768
##$STSR= 0
##$SW_p= 5175.98343685301
##$SYMM= 0
##$S_DEV= 0
##$TDeff= 65536
##$TDoff= 0
##$TI= <Analysis number 999999
Compound Code 99
Book Reference 9
Project Code 9>
##$TILT= no
##$TM1= 0
##$TM2= 0
##$TOPLEV= 0
##$USERP1= <user>
##$USERP2= <user>
##$USERP3= <user>
##$USERP4= <user>
##$USERP5= <user>
##$WDW= 1
##$XDIM= 32768
##$YMAX_p= 308602862
##$YMIN_p= -5621640
$$ End of Bruker specific parameters
$$ ---------------------------------
##NTUPLES= NMR SPECTRUM
##VAR_NAME=  FREQUENCY,     SPECTRUM/REAL,   SPECTRUM/IMAG
##SYMBOL=    X,             R,               I
##VAR_TYPE=  INDEPENDENT,   DEPENDENT,       DEPENDENT
##VAR_FORM=  AFFN,          ASDF,            ASDF
##VAR_DIM=   32768,         32768,           32768
##UNITS=     HZ,            ARBITRARY UNITS, ARBITRARY UNITS
##FACTOR=    0.157963299565203, 1,           1
##FIRST=     4132.6476996994, 0,             0
##LAST=      -1043.33573715361, 0,           0
##MIN=       -1043.33573715361, -5621640,    0
##MAX=       4132.6476996994, 308602862,     0
$$ Real data points
##PAGE= N=1
##DATA TABLE= (X++(R..R)), XYDATA
$$ [...]
19773 4884 3519 2300 2154 2964 4690 2444 -1902 -537 -3584 -4479 -4163 -1331 -927 1772 2614 2535 5075
19756 5075 2898 4777 4450 3152 -1023 -3647 -3548 -853 1420 1864 1501 3365 4373 5105 2972 1147
19740 1147 1758 913 -2648 -2129 -2980 -179 -1225 -1743 -1881 -2022 -3809 -3317 -2051 -4131 -4908 -2766 1561
19723 1561 4749 2119 450 2253 1479 2734 2291 438 445 -1777 -1109 -1237 -1098 -2237 -1814 -2394 -2643
19706 -2643 -2170 -2513 -1912 -1885 752 2053 912 -802 -2039 -3005 -2455 929 746 3439 1379 -1628 -1581
19689 -1581 -784 72 -1747 -52 1732 4557 3590 1666 -688 -936 875 -1271 -45 1646 1698 1082
19673 1082 -797 -1252 -2680 -2571 -3303 -4235 -4345 -4810 -7928 -6957 -2390 3954 4777 1624 839 429 2442
19656 2442 4377 1288 -845 -2429 -734 1584 4066 5598 6072 9014 11761 11960 8401 6523 6716
19641 6716 4869 4462 2958 2481 2297 130 -1432 2226 4845 7438 5435 6335 7355 6685 6532 6202
19625 6202 7340 5157 513 -2759 -3739 -3999 -2409 2259 3786 1738 -34 863 1549 1695 1458 6314
19609 6314 6628 3702 3835 645 -1723 13 134 -171 569 221 -2281 -2653 -4292 -6091 -6966 -5309 -3501
19592 -3501 -583 1890 4030 2713 3068 2218 2057 4393 5703 4774 1588 -1298 1061 -235 2216 -1040
19576 -1040 -2766 -1946 -1469 2398 5092 3145 696 2439 1457 1557 3250 3502 3814 4829 3312 1970
19560 1970 1843 4145 6976 6749 3294 4701 6495 2047 309 -3047 -1380 1969 1907 303 -866 -3589
19544 -3589 -7696 -5955 -2142 2676 2973 2459 2190 2967 5167 6332 5275 3794 3737 3149 4053 7018 6260
19527 6260 5737 4879 804 -2189 39 3255 4297 2794 2785 2970 -1961 -1850 -2770 -1587 -2566 -3553 -1321
19510 -1321 -528 1752 558 1945 4617 7796 7372 5523 3306 2776 4530 3139 1175 798 -1895 -2309
19494 -2309 877 784 -1654 471 -1643 -2022 37 -74 -2054 -3804 647 -639 -1375 -589 -1039 1511
19478 1511 1761 736 669 925 2690 2372 3428 3510 6188 4259 3951 5421 5649 5088 5197 5686 2774 2217
19460 2217 2188 1920 2634 5086 4820 2714 1540 217 -1602 -3901 1546 1426 -956 704 3069 -2228
19444 -2228 -4997 -4226 -1957 1995 5742 9229 5353 1194 -1270 -2045 -1780 -539 755 4104 7094
19429 7094 8446 8066 8337 7031 7677 5410 3781 4475 5115 7681 7733 6586 6648 2636 1996 777 2575
19412 2575 3330 918 1601 3423 5019 7109 3023 -1535 -423 -748 2398 4179 1700 208 2687
19397 2687 1444 2164 4175 2670 -863 -1285 1369 114 -2344 1108 2998 5512 7027 6664 6911 6199
19381 6199 7204 1956 -1995 -2116 -871 1929 6409 6285 4083 2354 2762 804 1148 -1302 -576 3014
19365 3014 -1287 -2627 -311 -45 -1420 530 2678 4118 3656 3426 -57 -3932 -2294 1256 -1468
19350 -1468 -865 3634 2657 1191 -11 -1095 -2242 -2688 -2216 -936 42 -1991 -1995 -113 4362 4472 3959
19333 3959 2966 4337 4335 -951 -2700 -3629 -3631 -838 -478 1692 -598 -3971 -1317 -482 -1658 -2935 -1190
19316 -1190 -1864 -920 5373 5429 2121 2020 -1935 -6668 -4889 -5674 -6224 -3483 3202 6141 6792 6458 6049
19299 6049 2059 -269 1714 9625 7049 409 38 2560 6862 6479 4407 3336 3934 4290 2283 2408
19283 2408 2850 3759 1272 -737 -1171 1924 5451 5890 5279 3519 2806 6008 7825 8024 9015 7907 7688
19266 7688 7248 7211 5488 1366 -2463 -1264 4453 6733 8567 8498 6524 4068 385 -1004 941 1950
19250 1950 2608 1344 -235 390 867 -914 -2267 -1553 -1347 -137 2658 6163 7179 6479 4752 -517
19234 -517 -1689 626 -776 -658 2678 -580 -4901 -4472 -1884 1281 2558 1241 3260 5218 7473
19219 7473 4758 1283 771 2429 2902 659 2275 694 1816 557 -1091 -1830 -1959 2827 2162 -2040
19203 -2040 -1312 541 2291 -1553 -2272 830 2814 2152 1864 325 2287 4718 5321 6350 8110 4545
19187 4545 3818 3036 2512 390 -193 1152 -680 533 2820 3223 3358 5242 4865 5518 2598 0 3283
19170 3283 7474 7950 7668 4981 1846 -204 -1002 1766 2289 -1334 -686 3315 3655 97 904 1249 -324
19153 -324 606 -269 -784 -493 1025 -103 194 1031 -420 -482 494 3218 4229 6944 8157 7403 7541 3366
19135 3366 117 -490 2612 4836 2850 1954 898 303 587 -1577 -1541 -2070 1836 3729 3661 4808 6036
19118 6036 4533 4324 1819 -600 1483 242 -2118 -773 -623 235 -2305 -3884 -972 -1580 -1476 1128
19102 1128 -288 1525 1384 411 4039 2594 3021 3963 7234 8091 8662 7743 8223 4784 2356 1294 -557
19085 -557 -871 -528 415 1307 -1630 -3594 -3264 -1189 1328 3243 3675 -213 -4421 -1213 208 -115 -66
19068 -66 1174 1300 2275 188 -2336 -1577 -845 3168 8580 8448 6455 4037 4064 3168 3800 5025 2735
19051 2735 5548 5266 5867 6233 3668 1562 381 -953 -2020 -180 3787 3910 727 1218 742 2785
19035 2785 3330 753 -849 -2313 -445 4089 6405 7639 8644 6081 4955 3569 3985 2427 -3691
19020 -3691 -4388 -3947 -1711 -1343 868 1177 -1199 -233 2884 6170 4110 4661 4431 3359 1647 1189 -858
19003 -858 -2188 512 2956 2016 3084 6311 2884 2662 1825 1004 1086 3558 4349 4061 7217 5747 3533
18986 3533 6183 6423 5095 1972 3220 6336 6915 6905 6590 4303 6079 9397 8680 6401 4656 3145
18970 3145 3046 4239 5968 4012 4538 8598 12370 15324 15593 11808 9030 8443 6882 6960 7552 4006 1422
18953 1422 1977 -451 1765 2677 2407 -693 -500 -1132 -630 -142 4092 8052 8990 8118 6505 4464 4810
18936 4810 3528 3723 2782 4311 3573 4108 3075 258 120 -679 -243 940 3724 4390 5425 8433 9311
18919 9311 11416 9803 7363 7394 4616 6633 4034 2572 3115 4812 5852 4513 4391 6886 4053 3310
18903 3310 3663 1982 3013 7548 8674 8504 7161 6833 6343 5356 5593 5110 3852 4042 5255 8293 6392
18886 6392 2083 2188 3176 3720 1596 158 -2204 -799 2426 348 -684 2966 6516 8354 8237 7851
18870 7851 7014 8378 5810 5101 8021 8442 8009 7870 7897 8448 8365 7264 8025 9361 7409 4961 2250
18853 2250 -1586 -214 855 3057 2752 -1536 -2285 728 2186 3758 5707 5059 2756 -1336 162
18838 162 4701 4283 2702 3825 4735 8847 11346 8210 5909 5601 6399 7713 7792 8629 5056 752 883
18821 883 3059 2941 -165 -490 -229 64 1876 3608 5084 5049 5736 5174 7350 9298 8346 8853 6941
18804 6941 7861 10025 8347 3785 3316 6910 3834 -432 2728 5589 4387 2408 -1615 -2807 -2213
18789 -2213 -3729 2257 6774 4352 1969 2836 3932 5026 3453 2889 3769 3871 3584 6633 6089 7300
18773 7300 8054 9983 12168 20144 24515 28654 32564 35158 30013 25673 17430 8648 5004 3625 5248
18758 5248 5992 4282 3768 6131 7126 5338 2587 2812 5728 7625 7555 4123 1708 2791 4182 4203 4775
18741 4775 3875 2972 2212 1969 3363 4685 5410 8215 8062 8594 8362 8198 8402 8808 5172 4923 6150 5954
18723 5954 6404 5617 5800 2235 2085 2159 1824 2678 3292 3643 3042 3194 861 130 4799 5976 6188 7538
18705 7538 9883 8078 5218 5366 5084 3064 831 4101 6990 5726 3701 2077 2034 4563 8536 9567
18689 9567 7489 5237 4108 3293 6328 9036 4745 3512 7155 10719 11263 7949 4286 2963 5951
18674 5951 4779 3961 4682 5400 6485 6261 9235 10871 7966 9207 7799 3886 4997 2900 -1385 2242
18658 2242 6209 6686 6956 8145 7312 4218 4477 9039 6924 5440 3686 2602 2112 5356 7595 6704
18642 6704 6830 6724 2352 -462 -55 2814 4237 4300 5702 6330 3573 -662 183 -896 2493 4362
18626 4362 5182 6716 8757 7965 6079 5021 3820 3016 2697 268 -1564 -2605 -33 3361 6669 7237
18610 7237 6842 4632 2144 2141 4039 4987 9818 11823 11926 10854 11530 8632 6195 5446 7341 3861 2265
18593 2265 4020 2366 4007 4311 5931 7680 6193 1453 -834 496 1704 3823 7639 9756 11439
18578 11439 9331 5759 2368 2450 3902 5338 7968 11890 11642 7293 3428 1577 3742 4111 2560
18563 2560 6347 5804 5250 5129 7364 8039 4817 2791 5306 10385 12426 14853 15474 12632 10699 9187
18547 9187 6883 5414 6962 7155 5527 2470 5664 8010 6563 3080 5342 9854 7906 4634 5090
18532 5090 4582 1268 1714 5585 10033 9309 6060 4563 3129 3234 6213 5656 6228 8271 5524 1685
18516 1685 1709 2448 4114 5833 7135 6349 5767 6877 2163 522 2159 3907 5867 3098 4650 5957
18500 5957 7250 5675 9181 10160 14467 15064 12106 9109 4758 2013 6182 7986 5127 3346 3043
18485 3043 4389 6256 10059 9705 4509 3587 9248 10544 9149 8663 8763 8076 8150 7204 7729 6307 2158
18468 2158 1649 3689 2357 5681 6826 5949 4361 5440 5829 6532 9585 11262 9946 10791 10851 8240
18452 8240 5035 4373 8143 10533 14929 13720 10650 5325 6906 9382 11652 10554 5540 2497 4060
18437 4060 5966 7924 8638 8549 8893 10781 14932 17927 18922 14422 10092 10356 9481 10309 10509 12025 13212
18420 13212 15282 12486 13625 15212 15148 14644 12351 11632 11053 8484 8320 7627 10017 13226 13647 9626
18404 9626 7634 8603 10867 12449 11443 9982 10528 12862 12596 13454 11348 7050 2990 2098 5253 8197
18388 8197 9971 10680 10724 10558 7036 5585 5581 8566 12901 14287 12856 14088 16210 13786 11756 12555 12280
18371 12280 9323 9907 10159 11503 12396 14355 13440 8633 7013 9252 10376 13379 13209 12366 9326 5848
18355 5848 4437 6255 8594 9912 12284 12589 15278 14108 15163 16754 18160 16018 14089 11281 11533
18340 11533 10797 9011 14311 14179 13230 11937 11258 13217 14778 14077 9091 9763 8684 8514 10018 11792
18324 11792 7705 4224 6986 11261 10174 9200 9712 10925 13063 14206 11775 12882 16233 13734 12470
18309 12470 11995 12529 12876 12905 10124 9373 14432 14798 12867 12342 10695 9931 8125 12505 13649 12081 10700
18292 10700 10250 9542 11579 9518 11464 15434 18489 15857 16510 17994 16768 15574 13368 11463 9154
18277 9154 13992 15584 14025 12332 11736 11284 13513 15670 15359 15283 13397 14931 14791 16750 15800 15634 16507
18260 16507 16172 14139 15274 14681 16595 13117 13079 17541 19864 19334 16766 16882 18188 17281 16519 16986 18047
18243 18047 18633 18619 19221 20901 21527 21980 20601 23504 27867 26380 29294 29676 27639 27030 28193 25981
18227 25981 25187 24244 24160 24376 24127 20543 16687 14698 15311 16547 20796 23082 24482 25319 25262 26304 26854
18210 26854 27328 24821 22372 20808 25634 25026 22897 23969 24629 24605 23298 20663 18767 18536 23858 26786
18194 26786 26279 28342 27194 25718 26016 26871 27289 29312 29244 30034 32722 33823 32222 33020 36221 38460
18178 38460 36905 36627 38793 37988 35390 35143 36978 36957 36812 35673 34088 34603 35076 34199 34059 39282 41565
18161 41565 44017 45019 44391 42930 40019 41131 44650 47155 52006 57236 60980 64537 66200 65128 67804
18146 67804 68947 67999 68787 67738 72487 78319 80526 80353 81447 83376 88643 95363 102420 109699 114907
18131 114907 117958 125719 133101 141796 150394 158755 167777 179476 194707 216682 237378 264100 299402
18118 299402 347081 408686 487392 599254 758473 1006423 1418193 2142316 3439890 5300463
18108 5300463 6273477 5688610 4445739 2764510 1504734 869413 548315 363752 254038
18099 254038 188283 144944 107900 83106 64850 47545 29109 17984 6281 3370 -2305 -5693
18087 -5693 -12034 -16118 -15632 -18104 -21264 -22067 -23633 -21194 -19193 -17667 -16806 -20188 -21273 -23041 -23572 -20488
18071 -20488 -18161 -18857 -18066 -18724 -19873 -20515 -20319 -18133 -16926 -17116 -19306 -15507 -14552 -16329 -14870 -15126
18055 -15126 -18137 -18295 -19319 -17148 -11959 -11652 -15105 -19676 -22331 -24287 -25443 -24261 -21711 -20510 -20629
18040 -20629 -17397 -15369 -13618 -11872 -10427 -14160 -14543 -13723 -14340 -16656 -21173 -20412 -17469 -17944 -18387 -16664
18024 -16664 -19274 -19777 -18031 -14651 -14481 -14222 -15270 -16366 -13071 -9744 -9671 -11832 -13798 -12380 -14335 -17102
18008 -17102 -17558 -15734 -15439 -20338 -19167 -15482 -10807 -7640 -7409 -5554 -5556 -7736 -10133 -12180 -10652 -8794
17992 -8794 -7313 -6935 -8369 -8309 -7994 -6831 -7068 -7147 -7739 -7544 -10460 -10405 -9013 -6199 -4384 -5425 -7511
17975 -7511 -7956 -9706 -10545 -8285 -8867 -10099 -8060 -6899 -6176 -6341 -6813 -4550 -3380 -3855 -4483 -8208 -10976
17958 -10976 -11634 -11667 -5310 -4540 -6205 -5625 -5351 -4730 -4087 -6078 -6410 -5939 -4654 893 -3269 -5810 -6015
17941 -6015 -4371 -6733 -6303 -7408 -10284 -10356 -9687 -8439 -6775 -7347 -10615 -10460 -9438 -8904 -7801 -7409 -6741
17924 -6741 -4351 -3600 -6304 -9562 -4906 -5375 -6092 -7085 -9179 -7547 -3682 -479 2434 -1116 -5752 -3872
17908 -3872 -610 -5268 -9608 -9004 -4478 175 2822 4275 3766 -585 -2614 -2410 -2292 -1128 351 2972
17892 2972 3145 -1585 -4986 -7024 -9116 -5856 -2310 -1413 -2551 -1534 -2884 -3641 -2242 -1948 -1679 -2705
17876 -2705 -4144 -2423 -3217 -4140 -3043 -3921 -4559 -3450 -2933 -1109 -411 -2010 -2634 -5048 -6121 -3582
17860 -3582 -2190 -3684 -5635 -3216 -4726 -3457 -3760 -3454 -2272 -1534 -1029 1580 236 -3582 -6904 -8367
17844 -8367 -7114 -4390 -3348 -539 -458 269 708 -2216 -2044 -3226 -3555 -3849 -2089 -1256 1042 1944 322
17827 322 1216 1293 -2021 -2464 -293 -686 -550 -2546 -509 1121 1852 708 1665 2333 873 -638 -782
17810 -782 -982 -3595 -5693 -8003 -6605 -6146 -3366 -2089 -3082 -5172 -5101 -1873 1953 1308 4733 5076 690
17793 690 -2996 -5274 -2260 -1508 1528 -549 -4123 -3818 -3074 -2380 -4913 -2811 -136 4122 100 -2794
17777 -2794 -3745 -3579 -3858 -7450 -4554 -1070 157 -2343 -3875 -4070 -3588 -1326 -694 1041 1055 -619 -838
17760 -838 -3332 -3394 -3407 -4809 -4109 -363 -120 2263 3403 -15 -2141 -3808 -3989 -4019 -5014 -4358 -3151 -3093
17742 -3093 -2767 -1895 -2021 -5264 -6010 -4869 -4007 -6066 -6608 -4012 -1743 -523 -185 -203 3242 6417 4540
17725 4540 4350 5150 4082 1467 -234 -2128 -3424 383 -732 -2828 -4139 -2784 1454 2030 3177
17710 3177 2998 1463 -779 -494 347 3461 3157 1141 -473 -1504 -1450 -303 -944 -1972 -1556 -1597 -2183
17693 -2183 -2111 -2137 -4296 -2472 -287 1346 2890 -798 -447 -647 -5789 -4571 -2825 -29 3907 930
17677 930 -2788 -3476 -2360 -6828 -5703 -3711 -3847 -3376 -2059 -716 -1534 1501 1247 858 1450 2696 4503
17660 4503 5534 5690 4723 2175 179 -430 997 -1298 -709 2902 6339 8283 5818 6037 2140 -2710
17644 -2710 -6304 -7133 -5553 -3996 -1423 1725 1213 -1743 -870 5589 9558 9164 5040 3649 2215 902
17628 902 409 -2367 -4370 -3286 -2439 -2559 -3571 -7179 -4846 -3138 -1322 1580 1466 -1540 -2268 -731
17612 -731 -3132 -3502 -1043 1820 5516 3481 2272 2513 2522 5386 6096 4143 -110 -2884 -625 -1877
17596 -1877 -2074 -1563 -586 659 2353 1706 2086 -333 -1770 -2820 -3778 -4689 -3642 -2232 -15 -785 -124
17579 -124 2448 765 -1811 -2339 -1154 -2213 -1715 -4108 -2290 -1266 -896 2710 3435 3338 4178 2501 -282
17562 -282 514 1854 2067 2272 1502 1141 -341 663 1078 -1498 -3073 -3666 -1656 -1324 -310 2136 3129
17545 3129 2683 2135 2024 1255 3129 8417 8763 5167 581 -1432 1668 3684 3415 1504 1951 0
17529 0 -2052 -1417 -1240 -682 -2676 -4124 -1001 222 4248 4032 2728 7313 9611 6076 4833 5957
17513 5957 2267 4510 7622 2237 -1641 2164 2801 1273 1171 -369 -3995 -2303 1588 2233 -1479
17498 -1479 -4035 -2016 -3266 -3074 -914 1705 2435 5937 6678 7459 5165 3364 3649 4170 1272 1154
17482 1154 2610 308 -559 -1861 -875 -374 -542 -1575 -879 282 1332 912 1410 2705 1183 -1261
17466 -1261 -452 170 -1092 -1333 2191 3257 2352 1990 1446 1329 6156 7466 6681 9235 7125 7683 9182
17449 9182 8959 10020 8901 7932 10035 15855 24725 34051 33618 27335 19045 9707 7421 6177 6963 6225
17433 6225 4133 5167 5360 6850 5179 3169 -120 3108 3220 5726 5385 3460 3109 5094 4056 3743
17417 3743 2117 -1249 1199 1743 -945 1115 2905 631 -1978 1093 4104 2705 4633 7340 4489
17402 4489 2681 -2076 451 4576 4652 3520 1460 2814 2453 4541 1972 514 3092 5434 4102
17387 4102 2944 3171 4002 8898 9121 6984 8182 8621 9226 10082 6154 5508 1597 820 2028 2620 272
17370 272 -1176 -362 -126 202 -844 -40 1172 568 1933 2204 2038 2170 -1379 -1739 -351 3137 6394
17353 6394 2270 73 693 422 1256 1116 -44 1290 2630 2844 -106 -2313 -1659 162 540 1808
17337 1808 2662 3433 1068 3191 4375 887 -1960 -306 2393 7332 7698 7730 7481 7291 7707 7080 6552
17320 6552 6990 5283 2488 3938 2581 530 1915 1476 2360 6005 6692 7604 5385 3610 2610 2351
17304 2351 5480 8687 7703 6816 3070 1721 -577 -1444 2577 6933 8480 6047 4161 3594 3862 74
17288 74 584 2375 2769 4729 7651 8458 8011 8507 8452 6192 5080 2584 646 463 2806 1069 2280
17271 2280 5624 5510 3379 856 3600 6046 3784 1398 -491 -3161 -2166 2304 3438 5069 7392
17256 7392 6509 3276 1135 216 2669 6339 8335 6830 8470 9783 9454 9926 8887 8987 4280 -169
17240 -169 2079 897 -1185 2912 3710 3058 4961 9192 9839 9661 4271 3579 5069 3573 4747 3654
17224 3654 3055 3649 2889 2571 1396 -61 -1517 -3700 -3226 1057 5354 8283 9226 7854 5020 5884
17208 5884 7468 6128 7992 10799 10799 7722 11629 9254 8271 8029 9402 6182 3649 3482 1602 3591
17192 3591 4731 6508 5962 5626 6305 7122 8142 7363 8770 8950 6601 4975 3678 3009 3074 3041 2736 -629
17174 -629 -3236 -2083 1718 4732 3817 5124 6442 7283 3873 2197 5728 7462 7092 10333 9836 6307
17158 6307 7040 4821 3520 1675 2607 3137 3621 5859 7080 4268 2901 4463 1278 -2529 -1000 -884
17142 -884 -160 2861 5521 6691 6231 5718 5178 1214 201 3325 3574 2058 -271 280 4254 6057
17126 6057 4312 4358 5450 4902 6143 8136 7385 8230 7761 6525 5751 6257 3317 248 4851 10870 10780
17109 10780 7410 7502 10286 7885 3977 2091 1266 1524 4443 6257 2811 1672 2402 4981 4383 3069
17093 3069 3291 7196 11655 11659 9783 12294 12324 8735 8963 7407 8496 11373 11354 9798 6540 2997 7220
17076 7220 9088 5659 2532 3495 7399 8999 6093 1690 196 551 -2557 -77 1628 1863 887 -895
17060 -895 2361 6246 7109 8212 7205 5854 7873 7997 9387 9870 8410 9329 4337 2639 2063 3498
17044 3498 2617 6693 7004 6738 10797 10261 9402 8476 5948 5488 6164 4838 3147 5491 6037 6353 4294
17027 4294 2985 2906 3188 6916 8095 10042 10228 7301 8080 11967 12054 9126 7322 1878 -2692 -2371 1867
17010 1867 853 -910 3394 4839 6951 6705 8078 8989 7234 5199 2635 3423 3446 4480 6227 5439
16994 5439 7212 8203 10293 9476 8428 5584 5288 5545 6147 7390 7384 6588 4222 6515 7273 8628 10739
16977 10739 11753 11870 9162 9263 9482 7681 6681 9710 12349 10057 7942 7730 5789 3973 3828 7120
16961 7120 6230 8990 10013 10986 6854 5998 5608 3099 2128 818 3666 4162 1889 -120 1164 3108
16945 3108 5017 3999 1061 1925 5771 8583 11747 12218 12808 9179 7235 8938 8467 8542 9533 9114 5725
16928 5725 6191 9644 8544 5528 5059 5681 7207 5590 7159 7344 11562 14240 14087 10606 9731 11463
16912 11463 8008 6627 5966 4460 6545 7389 6672 6706 9030 10140 6884 8111 5485 4967 5695 8372
16896 8372 10563 12850 12719 7488 8681 9036 5908 6016 9328 11258 9644 8960 7949 6611 5202 7011
16880 7011 2875 2832 4893 9876 11652 9177 9213 10598 10701 10734 9024 7514 7633 9079 10993 7455 4212
16863 4212 3724 7374 8876 7697 6301 8056 6665 6437 5304 3169 2702 5941 6037 5726 7290 4082
16847 4082 3820 5860 10152 9324 10710 10590 10442 12659 15380 15493 12775 9744 11887 11626 11478 9670
16831 9670 9156 9372 11205 10727 7997 7103 7983 6360 8070 6889 6018 4005 5508 6119 4272 3389 247
16814 247 2784 3541 393 1703 7334 10150 6637 4046 6614 12466 9550 11484 15028 11325 8582
16799 8582 10937 5110 887 3923 5080 8033 11169 10303 8720 5993 5596 7132 6967 5302 7007
16784 7007 10030 11629 11309 7550 3679 3830 7927 12075 12123 10022 8717 8729 7801 8256 8728 9042 7534
16767 7534 8421 9446 8568 8094 10826 12050 8600 7477 8118 7877 6298 5789 8204 8860 6530 5877 6552
16750 6552 8490 10010 10034 9223 7886 5543 9015 12088 12533 7614 8454 12975 12738 12337 12162 7782 7065
16733 7065 5515 6092 6835 9114 11767 15089 12420 8070 5221 6318 7294 6528 7472 8072 5609 6181
16717 6181 9525 11256 13186 11578 11383 9360 8468 9080 7802 10195 12915 13624 11825 13153 9838 10385
16701 10385 11830 9053 8676 8353 5561 6014 8778 10080 8624 5309 4369 6438 6465 8092 12972 15984
16685 15984 11338 8298 7819 7002 11630 14796 13281 8743 5992 6690 7990 6559 7466 8248 8800 7045
16669 7045 5657 7349 7691 8236 8347 6340 7082 9016 9381 10065 11541 13797 12761 11352 10964 10384 8773
16652 8773 7610 6556 7380 10364 15120 17899 21080 24404 24483 21058 16672 15511 15501 17733 17100 11942
16636 11942 11458 11668 12030 13110 12155 13582 13321 13196 13119 11063 10557 10962 10867 10455 11080 10763 8922 10918
16618 10918 10999 14485 12543 11353 14205 14498 12791 9860 8868 10418 13469 13513 10058 9117 13213 15339
16602 15339 16749 15294 11044 12089 11543 12234 10276 7438 7199 10111 11239 8938 9074 8618 6912 10391
16586 10391 11716 10319 6838 5990 4299 5947 8381 10998 13126 9897 8279 11086 11399 13682 11423
16571 11423 8113 7875 10521 10704 10034 11328 14040 14278 14327 11516 10484 11243 13565 15926 16795 18616
16555 18616 14026 12240 12145 12347 13316 15869 16198 14774 12771 11664 8156 7865 8714 11495 11012 8346
16539 8346 6139 6571 5825 11508 13564 11452 9497 11752 13840 15302 15063 16503 15046 12913 12425 12923
16523 12923 8971 6071 9325 11167 8862 8733 12645 12246 8039 3838 3793 6222 9704 10533 9267 9214
16507 9214 10091 11071 13126 12126 11576 10333 11514 12887 14824 15978 12638 12684 10528 8284 6108 5024
16491 5024 5618 6136 10105 11174 9818 8514 11941 13559 15654 15456 14047 11407 14693 13602 10335
16476 10335 6730 7145 7128 11066 13656 13283 12806 13287 11116 8935 10091 11470 11935 11929 15150 16530 10341
16459 10341 10095 8751 7684 10398 12183 10044 9644 9952 13208 13361 13241 11285 9455 11108 9833 10141
16443 10141 12242 13852 13114 11014 8956 12292 12049 10548 9575 8774 10338 12083 12123 15089 16100 14496
16427 14496 15265 15256 15718 12406 10396 9423 10617 11647 15680 13868 11179 9344 6646 5703 8389 9319
16411 9319 11855 13093 12280 14044 17231 18451 17826 14140 11161 13573 14058 16631 19587 20149 21287 20279
16395 20279 18829 19272 17681 16392 15003 13750 12557 11560 9459 9345 13227 14411 13861 10801 6290
16380 6290 7680 13735 15569 16807 15097 15876 15486 15477 14762 15528 18743 16344 13646 17499 19643 19794 20576
16363 20576 19910 17506 16026 17234 18558 16694 11950 7837 6492 6474 9097 7668 7733 6788 5743 8969
16347 8969 9702 10511 11882 11972 10208 10207 13356 14039 11008 13374 11955 12614 12504 13219 14037 14896 17700 20381
16329 20381 19703 18795 20462 19176 16474 13890 11193 6815 2953 6531 9653 11049 12208 16391 19624
16314 19624 20220 22611 21202 19297 16178 16218 17363 17413 18231 16457 14256 16620 17910 16635 17759 17841
16298 17841 18153 16165 12870 12578 13778 13645 13512 14560 15065 19122 19893 17183 14373 15802 17183 19599
16282 19599 20209 19731 16800 16812 18758 16538 15122 13235 11267 14643 15356 11259 13278 16813 18771 19074
16266 19074 20183 21970 21527 17648 16140 16121 17713 17742 15678 17587 17737 13503 11877 14269 17444 15499
16250 15499 10397 7933 11383 13902 15732 19317 17557 18668 16173 16205 18054 18437 17320 14827 14266
16235 14266 12776 13860 13669 12475 13074 13995 16343 16950 17151 15719 17800 18622 18358 17023 16228 17063 17321
16218 17321 18364 16522 15281 17806 24450 24950 22302 20848 18352 16354 12709 13703 16637 16197 17593
16203 17593 18891 20001 21083 22714 23769 22364 23171 24564 22387 21700 20262 17303 15400 17760 17393
16188 17393 18428 17125 18435 18336 17046 15427 13894 13696 16661 16360 17355 15561 14824 17675 20634 20954
16172 20954 20215 21353 22001 22936 18861 12767 12107 10783 8671 11049 12845 16068 16584 16920 16063 16731
16156 16731 21841 19934 17482 14814 12377 14192 17157 19619 19272 20486 17973 16913 15065 17053 18256
16141 18256 19627 20731 16588 18757 19911 20165 19688 20505 18785 19023 20585 19007 21359 22008 21665 20713
16125 20713 19414 16777 13609 12589 12897 14110 17063 17640 17395 17903 17430 16008 15322 16188 16248 16790 17697
16108 17697 17127 19531 21321 19969 18069 15078 15745 17708 19167 17463 17910 20064 16795 15627 17900
16093 17900 20048 23338 23273 21411 19305 21513 23414 22726 19835 18014 18033 18734 20970 21704 21230 18105
16077 18105 17897 17750 16705 17512 18551 16089 16034 20701 22201 23133 23536 24175 21808 18168 22199 23358
16061 23358 22630 20752 18175 18268 22134 24729 24404 22761 22420 23210 24536 23908 20104 18598 16649 15435
16045 15435 14882 15682 17681 22663 21404 16553 19297 21103 18841 18265 19224 20615 20904 19055 17980 21167
16029 21167 22008 21486 21119 20657 22613 18901 17988 20737 21448 19632 19658 22306 21754 21110 19781 17933 19297
16012 19297 21933 20523 17545 19211 22958 22352 21424 21297 22668 21639 16064 13275 17126 18281 16625
15997 16625 16237 14583 11996 14823 21009 22102 21193 19804 19001 15518 14682 13683 14189 13248 13168 14413 17642
15980 17642 22824 20773 13226 11789 15502 15064 15752 18212 17032 17538 18714 21609 19803 15018 16609
15965 16609 17058 17047 18517 20456 20047 17951 17987 18594 19469 18804 18800 16843 14855 13433 12530 15549 21181 22997
15947 22997 19865 16403 18404 19817 17493 17963 18049 18893 20811 20140 18715 19753 20440 19926 20369 20875 20986
15930 20986 19479 21269 24467 25318 25231 24113 25608 26078 25232 25890 28093 27626 26103 29269 28916 25946
15914 25946 26859 23062 19025 18248 18536 19985 19930 22941 25408 22129 22826 25734 23171 22700 23213 22358 24474
15897 24474 25882 23469 21873 24097 26807 29196 28668 26678 24322 22678 24317 26636 25747 26328 26556
15882 26556 23237 20409 20913 19919 20116 20148 22875 23014 21449 25138 27996 26403 26469 28204 31551 33012
15866 33012 32415 30595 29502 27952 28810 30890 29721 26383 27043 26403 22172 23588 25422 20268 18378
15851 18378 20300 20711 21367 24878 25671 24269 21098 22541 23812 23619 23672 23612 22847 25581 30085 32754 31519
15834 31519 32090 30931 27987 27592 25007 24873 23908 24086 27561 31479 31887 28849 29537 30188 30161 29633 29838
15817 29838 24649 25697 27114 26407 28497 30433 29839 29357 29842 32230 31967 32183 30916 27901 23706 23125
15801 23125 25593 27100 28886 29935 29853 29252 26593 25293 26465 26337 26371 25689 24620 28096 29342 29573
15785 29573 33219 31753 31243 32405 32339 34909 36100 41067 43863 45095 49019 58273 72490 90205 121365
15770 121365 171892 215578 219671 197700 155753 110523 81355 62019 48243 42748 40879 38169
15758 38169 36286 35782 35421 34307 32406 32191 32315 31266 28802 29267 27091 26219 26339 28905 27180 28289
15742 28289 29929 27245 24463 25054 27585 29914 29553 28167 27977 31097 32143 29701 27241 28677 26558
15727 26558 27308 29213 31551 31107 29038 28415 26219 27443 29350 30460 27785 24533 24422 23427 22725 24025
15711 24025 25797 27302 27537 26533 28062 29619 27976 27637 26678 27638 26194 27156 27634 28153 26856 27169
15695 27169 26896 24776 25366 30101 30772 29509 28210 26992 28683 28927 28720 32977 35099 32201 29903 27831
15679 27831 27720 26360 25324 20393 22669 26551 28454 26558 26005 27467 28900 34053 37824 34937 32453
15664 32453 33566 33766 30243 28723 27019 27445 29311 34969 38639 36807 31861 30073 28146 29288 27801
15649 27801 24774 25988 28002 26736 25610 28121 26852 24141 25103 23279 24043 28679 27384 27216 27559
15634 27559 26993 29477 29186 30563 31109 30605 31214 31728 29025 25220 25922 24742 26553 30287 33749 35071
15618 35071 30545 27086 26527 22921 22027 24133 23911 22323 25462 29539 30767 33971 35803 34070 33435
15603 33435 34598 33029 32834 32539 30642 31075 33352 35495 34769 32977 32636 30682 28537 32042 33723 30786
15587 30786 31499 32272 34719 35376 35196 35904 33465 35298 36329 35311 35380 38003 37372 34120 33441 33854 36176
15570 36176 36819 38400 36354 35904 34611 34078 33195 35909 34967 34217 33090 33101 35464 34255 34985 35472 35854
15553 35854 33045 35501 36583 35932 36838 37856 41124 41881 41853 40262 37561 36438 39471 40098 35271 32689
15537 32689 31686 35061 36368 37379 36882 35914 33246 30313 32523 35880 41389 41849 44158 42021 38558
15522 38558 39159 39808 38519 39729 38207 36371 36785 36184 37817 39121 40372 38971 35611 35139 33993 35450
15506 35450 37344 38029 36073 36025 35071 39007 41643 41780 42564 41957 41664 41386 39798 37480 36880 38670 38506
15489 38506 36553 38222 43958 43053 38895 39257 40449 44917 45063 45462 55529 64109 66311 61954 60198
15474 60198 56466 50328 43098 41608 40887 43580 44613 40275 38525 35932 38011 42072 40905 40251 44071
15459 44071 45485 38262 33813 32624 32624 35212 38978 38720 35935 35225 35781 37662 36398 37644 38197 38310
15443 38310 39792 39209 41456 43607 45015 44394 44660 45346 44820 44775 44236 46270 45802 43829 42440 40879 41176
15426 41176 44957 46632 46687 45198 45301 41256 39411 40034 45276 46362 44058 46296 51534 52030 51947 49222
15410 49222 46697 43528 40530 37587 36388 37176 36816 36590 39917 43903 42846 40500 38953 40309 39843
15395 39843 38872 40028 43823 41402 38330 42389 42383 39153 38655 40941 41207 41273 39364 39283 36039 36321 40488
15378 40488 42760 45022 48159 50685 47003 44611 43861 42360 37791 40646 47555 51363 51154 51416 53822
15363 53822 53476 52359 50085 48807 49647 51987 50962 52290 55577 58351 66027 84376 103735 112803
15349 112803 111147 105365 93813 85293 80234 74809 72010 72236 68931 65171 65438 67159 66078 64595
15335 64595 64128 63435 66647 68397 66485 67574 70554 69934 67062 64116 59131 58709 56968 61453 63992
15320 63992 65406 66686 71042 74052 72208 77569 77523 76538 81642 81658 78123 80254 82357 84117 84513 81543
15304 81543 79986 81207 81233 81955 82590 83093 83311 86983 88537 87660 88821 89340 88778 90694 93582 100386 102857
15287 102857 100895 98477 99047 103008 107761 107262 104841 105016 107819 114678 117492 116630 115844 115663 115391 115329
15271 115329 120418 127504 136115 145876 155692 158960 163985 172042 175708 183067 190639 198722 208504 219548
15257 219548 230565 246570 258755 277031 299010 323709 352523 385205 421602 476169 553855
15246 553855 645664 713927 748782 771955 780945 795471 838398 916370 1035681 1200768 1375826
15235 1375826 1554744 1777350 2088036 2543647 3222453 4244092 5869355 8616735 13420055
15226 13420055 21735603 32927034 39143473 36927487 30235219 20699387 12948330 8474300
15218 8474300 5941273 4397488 3407586 2749524 2288102 1944526 1694253 1521382 1409012
15209 1409012 1299098 1181917 1062495 928463 807907 716488 651584 623218 630463 624075 580453
15198 580453 516729 441604 378913 337232 312089 294249 275058 256538 236816 219936 205661
15187 205661 197322 192482 181632 167190 155551 146472 142836 136462 132477 129387 125590 120935 117032
15174 117032 112411 107777 101698 94311 92548 92517 89818 89540 90032 84042 77279 72899 73688 73486 70476 69683
15158 69683 68907 67379 65648 65902 68828 69050 65508 61402 59276 56870 54086 50796 47914 46657 48738
15143 48738 48423 46815 45689 43634 44053 47212 49325 48189 47914 47140 45528 45995 50224 53477 52912 53395
15127 53395 53207 53081 52087 53980 53249 53160 48583 43714 43669 41934 40563 42961 48518 48625 45536 44588 42977
15110 42977 46219 48225 50632 52816 50676 49681 49788 44747 40770 39270 38413 34917 34816 36761 48329
15095 48329 56492 58726 55560 50937 45982 46546 49909 52089 52063 54873 53427 51196 49972 50415 49437 46679
15079 46679 44315 42580 40690 39579 40166 39483 38411 39720 41907 48047 57211 64155 64779 60255 57088
15064 57088 53794 50139 48157 44518 47150 49005 53529 53897 51977 49093 47617 47644 46724 46870 48615 48600
15048 48600 50215 50335 52080 54343 52606 50698 50442 48093 46865 46570 42728 37644 38757 40404 43573
15033 43573 45569 47633 48320 52147 55736 50595 43725 44420 45042 45959 44341 40496 40527 39467 41879 42149
15017 42149 42654 43324 41941 39723 41729 41797 40918 41088 42133 45579 46269 43675 38720 39706 43103 44062 42044
15000 42044 43570 44602 43391 41187 43694 46629 47326 50980 50767 48283 46038 43721 41336 40566 42164
14985 42164 44365 47680 48885 47603 45614 44591 43264 41738 41956 38100 34739 40015 42930 42031 44289
14970 44289 45631 46038 43158 42225 42105 48341 50290 49580 50361 48129 45703 45953 45279 43986 42331 41221
14954 41221 41261 41169 41075 42621 43354 43947 44511 42821 42591 42839 41533 41337 43821 44348 42259 41158 40981 42031
14936 42031 39714 38965 40898 44679 49079 45064 43447 45342 44576 44069 46690 44964 42773 40936 43333
14921 43333 44676 44833 43814 39776 41786 42851 42047 42143 45280 48658 48356 48266 46644 46438 48215 51384
14905 51384 49266 48074 49012 50843 50617 52645 51414 49077 48417 49339 48518 45840 46158 46273 44478 45380
14889 45380 46308 48051 49292 49852 48967 48722 44367 40955 40799 42058 43967 45467 46800 48663 52435 54312
14873 54312 48288 42120 41434 42329 43378 45222 50088 47702 42758 46928 48543 49026 50032 51535 52215
14858 52215 53644 51976 47892 47693 49621 47763 45609 47426 50342 52828 53789 54214 55190 55817 54718 53919
14842 53919 50634 49334 49812 52359 52986 54632 53166 51625 49037 45836 44569 46847 49187 47029 45635
14827 45635 47519 50371 50546 51495 46836 42826 43049 45496 46089 43095 46144 46016 44203 41530 42809 46570
14811 46570 49310 51046 52498 55323 51371 47098 43201 46926 47439 45919 47999 50051 53118 53371 52822
14796 52822 53740 53823 52353 51161 52884 51544 49336 51693 54141 54397 53716 54308 56494 56802 57916 60487
14780 60487 56100 51655 50670 51740 52669 53864 54024 47099 41660 40587 44932 48729 49800 47973 46005
14765 46005 47676 50470 53273 54390 53684 50827 47702 48702 50688 51127 50022 51165 54297 52801 49018
14750 49018 49108 54146 53329 50669 51899 54045 50622 49554 52715 57776 60255 58532 54271 51774 52328
14735 52328 52161 51340 51543 54601 54738 50358 48810 48749 49066 53098 54030 54849 57612 57436 56032 56420 57619
14718 57619 57899 57316 58005 59557 57706 55947 55375 57001 58483 61459 60701 59520 57687 57779 57093 52517
14702 52517 51214 51922 51270 49706 51926 54555 57314 58143 53836 49905 52970 57257 57370 59473 57443
14687 57443 59122 57679 56596 61350 62691 66053 72030 78494 85954 96230 112603 141773 182863
14674 182863 226732 250031 239201 204798 160125 122741 99686 86914 78599 78026 74614 73545
14662 73545 71342 66938 66065 64405 62063 62065 65234 67714 64805 63783 63672 62925 60570 59890 60614 58873
14646 58873 59602 59650 61369 63158 63872 65574 61356 56323 54999 55539 55377 53129 54425 54388 55608 56448 56645
14629 56645 57631 60424 59593 57824 58411 60148 59233 57399 56804 53616 54838 54034 50708 53882 59485 61955
14613 61955 63210 63457 60177 59444 60075 56393 56261 58087 59620 61486 64002 65264 63868 62983 62025 59756
14597 59756 64449 63033 60728 61946 62402 62939 62755 64682 63772 60546 58944 57539 55314 55207 57974 59743
14581 59743 62309 61630 61170 57353 54815 55308 58249 59481 57511 60600 62171 63029 61445 62199 61676 60554
14565 60554 61153 61740 59834 61801 63888 64652 64645 62114 63593 65588 63734 62371 62855 67001 68773 67397
14549 67397 63827 60423 61117 59243 53776 55623 60812 61125 61973 62367 64540 65170 64023 60485 61040 58729
14533 58729 55808 54020 57291 62834 64705 63364 65053 67173 67764 69320 67163 65842 67578 68561 68453
14518 68453 66520 65926 63786 64539 64807 65343 64298 64585 62611 63999 62884 64250 68702 68216 67494 63339
14502 63339 59184 60282 62463 61773 62364 65527 66597 67841 68280 69493 71677 72132 71798 69025 64653 62036
14486 62036 61805 59889 61775 61357 61512 61496 65238 65391 64303 64424 67080 68822 68461 64400 64834 64998 67457
14469 67457 65439 64057 63081 61337 61857 63694 63177 61977 61660 62029 64227 64692 64974 65469 67859 67859 64856
14452 64856 61317 59264 62592 67115 70205 70847 70345 68627 66253 64153 63258 61768 62637 65054 68570
14437 68570 70027 66022 65534 68607 65850 66984 67369 65094 62630 61381 64655 66602 67163 69026 69867
14422 69867 69917 68818 68535 68938 65954 64184 63061 62540 62805 65752 66467 68087 69496 68236 68535 70375
14406 70375 67878 65108 64849 63156 62079 63166 64355 65746 66856 65557 63474 65976 67735 67815 65029
14391 65029 64878 67654 66590 65694 65792 65199 66867 69718 67922 66598 68002 67726 69727 73798 73921 69088
14375 69088 69329 68109 70125 71230 71463 69830 68712 70284 74223 76706 74996 70801 67256 67758 68928
14360 68928 71584 70315 69049 69246 68639 69953 70768 71378 72117 71637 71062 68092 68414 66768 66385 68250 69421
14343 69421 66433 66351 69554 67533 68162 69709 71361 70557 69421 65855 63977 64816 67475 70284 71128 72207
14327 72207 70646 70961 72367 73148 75738 74861 71499 68008 68272 70040 68755 67543 68096 65798 66744 71392
14311 71392 74659 74124 74932 74835 75758 76062 76092 76054 74434 74919 77101 77769 76360 74831 74550 74566 74785 74714 73448
14292 73448 71425 71160 69934 73129 76008 74860 73080 70020 71424 73289 70645 71938 76360 74343 68197
14277 68197 67982 68882 71193 73593 74216 74375 73111 72351 71254 68997 70796 72241 74784 75895 74731 75368
14261 75368 75385 72116 69780 73341 75384 75824 76050 76063 77890 80684 76621 77854 77849 78970 77253 76690 77650
14244 77650 77691 75394 72308 72290 72202 71002 72116 72097 73004 74652 76051 75038 74491 74079 76050 79286 80959
14227 80959 81029 78343 75765 76291 75439 74030 75733 75196 74531 73976 75378 78842 80259 81861 77828 78539
14211 78539 74779 74900 74440 76083 77302 77293 78302 79468 79984 80763 83315 82760 79630 74866 73362 77891
14195 77891 79593 78032 74092 70236 71399 73822 77267 78239 77343 74393 74078 73272 73164 73613 73639 75601
14179 75601 75312 75250 73405 76072 76814 76732 77189 79731 79015 78433 77441 79244 81876 80287 80007 81145 81610
14162 81610 78054 76571 75108 75475 78788 82957 80717 77061 76719 80519 80485 77255 77187 78889 79304 77786
14146 77786 79023 82358 81279 77762 77012 78439 76292 76511 74597 76616 77403 77452 74844 74366 77641 82977
14130 82977 83076 82767 84106 83525 82851 81011 77331 73825 72426 72827 76644 78653 78404 74490 72269 71480
14114 71480 71250 74594 76859 78438 76228 75615 77759 75447 75168 78620 80362 81417 78408 77048 77713
14099 77713 80198 81366 82769 83833 83827 81467 77543 74952 77009 77740 73906 76117 80894 79278 79332 78221
14083 78221 77321 81177 84401 82688 80387 78891 78609 79790 83334 82591 80633 80408 83425 83362 80000 81522
14067 81522 83394 81426 79534 78428 79276 84530 83761 82604 79369 78348 80402 82943 82331 81756 82754 81571
14051 81571 83452 85129 85011 85570 84501 82188 82216 82849 82932 83053 83901 81320 79378 80474 79760 79951 79387
14034 79387 81059 83168 84139 85916 82304 79434 81742 82484 80301 80321 82383 83981 85406 85358 81854 81164
14018 81164 83628 83749 80500 80714 80617 80791 81949 82980 84398 83967 83906 83901 82940 82316 80842 81266 80712 81279
14000 81279 79707 76977 81522 84394 85563 83301 82364 84017 83512 87731 87680 86811 87327 91015 92292 87920
13984 87920 85410 83387 83864 82348 81572 84466 86447 85269 83212 82908 82907 84067 83518 86240 89292 88224
13968 88224 88245 88358 85788 82026 76339 76078 83100 86438 87977 89782 90552 90205 89477 84793 81626 82669
13952 82669 81861 81594 82757 84980 82797 83849 81942 81687 80978 82428 87154 87969 90157 90737 87479 85237
13936 85237 86725 88970 90966 89598 89360 90532 92281 90619 85471 82245 84187 90153 91990 88521 86841
13921 86841 87294 89273 92262 90161 88437 85167 81176 79260 82060 84483 85845 86660 88700 88847 88942 86991
13905 86991 85078 84497 83439 87166 88381 87410 85033 86326 87053 87733 86560 84761 85071 83533 86676 86725
13889 86725 87351 85916 84383 85018 86521 84311 82872 81809 80765 83502 83765 85031 91015 91906 90107
13874 90107 88170 88160 89685 86520 84885 85513 88944 87993 85967 89061 89796 88439 88595 88630 86217 85294 85119
13857 85119 85781 84150 84210 82496 81134 84005 83775 84734 90314 89872 85848 85158 85159 85507 87988 92757 94956
13840 94956 93201 91731 95600 94727 91315 90199 88617 88078 89514 91287 88444 90640 91052 88398 87227
13825 87227 88304 88150 85221 85442 85700 84615 86804 90616 89892 89038 88623 89322 93248 92591 92082 90029 85900
13808 85900 84049 83438 86393 89604 88658 90221 93327 94965 94083 90255 90018 93086 91912 91539 92496 90046
13792 90046 86941 87862 83304 84231 83504 84792 90255 90663 86462 86707 89749 90284 91102 92209 94357 91999
13776 91999 88160 87419 85843 85409 83219 86134 90328 88718 89356 91446 92078 86610 86215 88517 89463 88338
13760 88338 86483 86661 89351 91562 92060 91528 92173 95171 93370 89438 90343 91954 91623 93681 93662 93080 90506
13743 90506 89534 89039 85813 82822 84465 87419 88872 87795 91922 94806 92784 89620 87409 91167 90130
13728 90130 87680 88043 90884 90935 91743 91198 88090 85669 86932 84477 87670 89201 86378 86291 88782 88888
13712 88888 89589 89367 87899 88464 87872 88420 88997 89175 84150 81665 83928 86329 85531 85332 88156 86625 84651
13695 84651 85626 87242 92024 90678 90298 88366 89830 90585 93796 96236 94139 92970 93082 91105 90103
13680 90103 89717 87269 88847 91970 89265 88463 90060 89149 91554 90086 85012 81162 79724 82040 85250
13665 85250 87289 90935 92319 92595 91985 93674 94396 93852 92701 91972 90980 92068 89472 88902 86761 88971
13649 88971 93405 95051 94642 93811 93229 91504 91336 92090 92533 91969 91360 90487 88958 89270 91355 95479 95416
13632 95416 94941 94573 94158 92418 88568 85570 88922 86787 83812 84934 82876 82975 87043 89188 91484 93308
13616 93308 92414 95194 97636 93765 89433 89546 89877 91111 89700 91241 94397 93807 89379 88821 88640 87574
13600 87574 89451 91731 90986 89977 87824 87713 88767 90213 89021 93327 93366 91534 92023 95475 92421 89966
13584 89966 88701 90159 93908 93469 93303 94172 92351 88478 90786 91986 91282 91095 88713 87749 90297 91963
13568 91963 92421 88715 84729 86780 89290 91957 90515 90479 91844 88431 91114 92073 91350 93141 91421 94300
13552 94300 95811 94022 92120 89339 86567 88830 90947 89050 90200 89712 84118 81097 81603 84008 84902
13537 84902 84598 84853 86929 88340 87441 87703 87580 85564 85380 88708 87479 87136 87686 86512 86513 87673 89587
13520 89587 91150 92782 93470 91184 92677 93156 90049 86023 86899 89416 88370 89255 92436 92842 90584 87992
13504 87992 84368 84509 88315 89918 89587 90304 90164 93432 91684 88364 88333 89845 89093 89453 90390 90555 87028
13487 87028 85119 86922 88147 92902 92579 91395 93105 88393 88429 93743 95902 94394 91219 89456 87426
13472 87426 88629 89544 86793 87934 89023 92829 90406 89830 87978 89621 91436 91679 91176 89889 88083
13457 88083 89215 91161 89031 85472 86525 88384 86910 85679 86066 85726 86155 88045 90026 92798 99587
13442 99587 99067 97001 95192 89799 86942 85033 82985 83450 84372 85971 88192 86405 84222 84720 84394 84022
13426 84022 86780 91286 88759 88925 89793 94151 93245 90288 88457 86642 89614 93759 95405 92002 88400
13411 88400 86929 86894 86805 89674 90256 91215 90880 89067 89429 83647 80529 81149 81616 83287 83341 83429 83039 84628
13393 84628 86099 86862 85246 85075 86578 88373 91857 90588 93831 95473 91148 90739 90269 91927 92744 94769
13377 94769 92615 89831 86694 86646 87677 86429 88168 92332 89482 90561 91121 93130 93404 90501 89297
13362 89297 88812 92047 92177 88901 87948 86475 83024 83914 83450 83182 83115 83205 83035 88248 86859 87823 87504 85079
13344 85079 83544 81923 83290 88944 89507 87463 84367 85493 87546 86775 86316 83806 83848 87291 84703 84138
13328 84138 86869 88543 85853 87945 89149 87478 86001 87178 86593 85345 84065 81525 84427 86262 88521
13313 88521 86807 87606 88500 86813 87994 90142 90541 87484 86889 89329 91637 87632 85870 88177 88648 84996
13297 84996 81148 81593 83567 84568 83911 80655 79484 80421 77618 79816 80347 83627 85154 87178 86186 86598
13281 86598 84958 81743 79173 78532 79298 80188 82704 84239 84034 84777 84731 81459 81928 81561 80380 77345 78148
13264 78148 78352 79944 82817 84329 83824 81901 80947 81534 83541 81496 79665 78276 76811 76713 76345 75339
13248 75339 77586 78455 79400 81083 84948 83555 81957 82047 81119 80662 80484 79528 79083 78079 78084 78248 80709 82389
13230 82389 83035 80799 76913 78868 80536 79290 81926 84219 83813 84827 81633 79643 79854 76658 78927
13215 78927 80314 78469 80961 83997 81235 79435 76920 79228 85556 85646 82241 78128 81277 80477 81206
13200 81206 85724 86491 82121 82526 83707 80795 79295 75294 76375 78350 74702 73767 75857 79666 80204
13185 80204 81031 78695 75626 74783 72888 74161 76173 77499 79295 73246 70641 73853 76339 75523 76281
13170 76281 79731 82569 80976 79352 81890 83581 80885 76154 74084 74850 78727 78242 79578 81056 80541
13155 80541 79071 76141 75271 75158 76397 77511 76925 74938 75384 77305 74505 74585 74218 74631 76903 77781 76456
13138 76456 76195 77683 75924 74734 74181 77775 79825 81166 77058 74128 75172 77221 78162 74727 76190
13123 76190 77217 77250 76596 73538 69708 70750 75016 77567 77664 76460 75701 77463 80583 79035 79432 80790
13107 80790 80487 76422 73747 69025 69558 71669 77020 78196 78440 79534 80229 78067 73127 76957 81762
13092 81762 77797 70174 69989 73870 76026 77730 74580 73499 73667 73330 72932 71827 71796 70883 73321 73775
13076 73775 77209 79240 77611 75943 73650 72324 69322 68349 70746 69713 69739 69384 69897 68578 68458 67504
13060 67504 67710 71408 70606 69468 69618 69678 71498 70229 66052 61744 62867 65132 69445 70560 70791 70283
13044 70283 65369 61750 63368 69695 70214 70162 71358 69693 67795 64904 64495 68489 69835 66514 66784 67277
13028 67277 65390 64750 67350 67824 64643 67703 71228 69784 68707 67701 67258 65660 65761 62720 64496
13013 64496 67104 68411 67801 67157 64777 65738 67119 65783 66015 66293 68152 71085 72504 73047 71538 69630
12997 69630 66600 65387 64623 61359 60783 61973 63964 67057 67679 67631 65929 67062 66692 65534 65971 68059
12981 68059 65546 64650 66429 66394 64561 64760 63045 61388 60103 58275 60325 64127 69291 68780 67755 68921
12965 68921 70476 70609 68689 69695 70115 63869 61166 61010 64225 63967 64499 63989 61670 60844 62004 61238
12949 61238 62975 66738 67608 68723 64997 64393 65972 67396 64009 63957 65907 66059 62007 60330 59663 60169
12933 60169 59413 61129 61491 61407 60483 59758 58804 58714 58648 59935 61269 57096 54246 56483 61988 63420 66025
12916 66025 67411 66459 65627 60172 58503 56493 60382 60230 60922 59365 59513 57529 55920 55081 58012 55806
12900 55806 52501 54853 57061 55312 54509 57406 60424 59649 55898 55357 54525 53233 52455 53034 53528 54874
12884 54874 55782 52822 53038 56537 55848 55341 58170 58285 57506 59607 57329 57414 57989 57870 58757 58643 57817 57779
12866 57779 57864 58395 57458 57373 56598 53957 52857 52773 54897 55506 54632 56497 59530 62870 59115 55085 52672
12849 52672 54531 55587 52355 50633 50732 51846 56565 55553 52077 53548 54159 56453 55924 51630 49628
12834 49628 50162 47965 48728 49976 53365 58107 56522 54776 55333 52889 51986 51862 52171 54059 55360 54849
12818 54849 51423 50455 52192 54099 53520 53737 53660 54159 54156 55277 56709 56801 55204 55128 54366 54596 54053 57727
12800 57727 54504 48106 45112 48207 51041 50363 46253 45479 47930 54187 53806 52932 50360 49465 49305 49182
12784 49182 49614 50997 52103 50510 49196 50061 51559 49693 46007 44627 43742 43309 45175 50151 49975 50335
12768 50335 49074 45780 44254 45340 45870 44736 46086 44574 43620 43093 43423 46737 45138 46865 47697 47399
12752 47399 46972 47661 48549 46643 45869 46226 47772 48707 46153 46340 46851 47195 48033 43304 44400 45408 45539
12735 45539 45797 44141 43124 42543 44797 45307 43271 42236 46154 47176 44573 44599 44830 47433 48241 49751
12719 49751 51029 50077 47222 44942 45447 41700 38654 41649 41329 41670 40757 39939 40041 38606 43796 44563
12703 44563 43828 42537 44288 43487 37133 36588 39345 38677 36102 38849 40531 38925 40098 40838 40540 40770
12687 40770 37457 38948 42120 44117 46531 47990 43407 39008 38456 37015 37504 39310 38865 41462 42107
12672 42107 40172 39011 42045 45600 42301 40175 44463 42277 39088 38164 37371 34610 34662 36717 37599 36587
12656 36587 38855 39689 38656 40620 41371 39001 37723 36862 37444 37196 39309 41768 41041 40811 41054 44613
12640 44613 48481 52129 59050 61026 58834 55847 51724 44756 40712 40324 40471 39748 41172 42139 39346
12625 39346 38770 37089 35582 32135 32809 33926 34973 34853 30678 30583 29481 32100 33802 32165 33976 36653
12609 36653 36207 36409 36505 36857 38221 38632 34409 32251 33464 36987 37356 37830 35448 29392 26300 30355
12593 30355 32048 32115 35286 34532 30899 26829 26119 29229 30916 27978 26415 25282 26489 30399 32111
12578 32111 29686 29006 30865 28401 26223 27461 25872 27146 30696 30440 31509 31103 30412 30299 29436 29568
12562 29568 29798 27495 29907 32516 28557 25059 23084 22434 22720 21620 21094 21298 22490 23533 25029 28129
12546 28129 26089 23990 23026 24889 25118 25780 23455 26339 25981 25757 23603 24319 22743 21941 21137 23987
12530 23987 24832 21036 23536 25780 23238 20452 19842 24753 29459 29244 29028 26765 26690 24797 21915 20581
12514 20581 20166 20883 22871 27049 29019 29811 28967 30171 29323 25063 22782 21063 18304 18453 19859 19614
12498 19614 19772 20253 21278 22413 24221 21979 23087 24780 24949 24461 22772 23342 24110 22955 23316 21918
12482 21918 22421 20322 18228 17291 16414 16143 16082 18081 20785 20466 18647 21443 24480 24878 22665 18966
12466 18966 20042 24771 25837 23657 21618 20542 19803 17554 16369 14870 15604 18123 17221 16218 16621
12451 16621 21525 21510 19171 21660 22222 19840 13428 10078 8531 12274 14670 15111 14171 15631 16653 18175
12435 18175 20119 17343 13096 11325 10590 13980 14701 12621 14975 15667 16229 16270 14800 15040 17982 16230
12419 16230 15364 13962 14987 13290 11282 16808 23156 23130 24189 26883 26340 26231 21129 15264 13388 12330
12403 12330 12884 15828 17860 15314 11955 13407 14905 17530 17708 23273 27693 23535 22973 24227 22291
12388 22291 19217 17402 18759 15812 12983 12375 13415 13157 14892 16936 14971 13887 14508 13133 13355
12373 13355 11142 10712 10079 10670 14848 13232 9804 10258 8670 7734 9666 12588 16406 12204 8067 5823
12357 5823 6251 3682 3419 5227 5007 11083 15960 20200 21106 22863 18842 11696 12954 11627 9904 8802
12341 8802 9649 10295 11096 9663 8944 7481 7865 4767 9168 12661 11615 12983 18095 20913 18530 14012
12325 14012 10199 12005 11860 11320 10487 7848 8537 10139 8034 8601 10114 7843 9103 9793 8981 6806
12309 6806 3955 4781 3803 3913 6187 7372 6909 3556 4111 5393 3136 901 -113 2745 4272 4521
12293 4521 837 99 -417 159 3893 7187 4931 3552 5337 2950 5568 8079 5803 5260 6691 6111
12277 6111 4143 3724 5475 8151 9825 3319 421 -756 302 166 113 -168 3768 5511 1057 -1056
12261 -1056 -3490 -6417 -5728 -4228 -3180 -5837 -8967 -6847 -3344 -1918 -1456 1566 2470 -1063 -1333 -1656
12245 -1656 -1043 1317 101 -1527 -1913 -4310 -5876 -6527 -4423 -4752 -3996 -4731 -3383 -2777 -3123 -739 1513
12228 1513 -1694 -4741 -6862 -8885 -11264 -9085 -8451 -5743 -1066 756 -1787 -6414 -6245 -6168 -3371 -3849
12212 -3849 -3391 -2614 -3108 -1007 1005 3 795 1088 -63 -5032 -6131 -5447 -5159 -5146 -6824 -8161 -8104
12195 -8104 -4934 -4437 -9847 -12640 -11497 -9813 -14433 -15906 -12931 -11600 -12688 -11012 -10189 -11236 -10888
12180 -10888 -11389 -10131 -11662 -11682 -9359 -10516 -10013 -9010 -9540 -6783 -3880 -4819 -5728 -8426 -6889 -9215
12164 -9215 -9656 -11089 -15008 -13497 -12940 -11554 -9362 -8446 -7076 -6319 -6551 -6521 -8822 -9969 -9450 -7528 -9385
12147 -9385 -13232 -14912 -15941 -11483 -7029 -6423 -7610 -8116 -9995 -8679 -10285 -15612 -16092 -14101 -13332 -15418
12131 -15418 -13810 -13175 -14259 -15766 -14278 -11365 -8769 -11906 -16585 -14896 -11975 -13596 -14333 -13119 -12947
12116 -12947 -15158 -17472 -18768 -19390 -21156 -20288 -15265 -9554 -10012 -12458 -14756 -16823 -16999 -16496 -13491 -10543
12100 -10543 -7020 -3362 -245 2146 1905 -3103 -6459 -11887 -13229 -10762 -14067 -15672 -16877 -15727 -15844
12085 -15844 -18120 -19353 -21089 -21117 -20948 -17885 -18569 -20572 -24150 -20827 -18395 -20814 -21137 -19684 -20477 -18294
12069 -18294 -16919 -16980 -12846 -13927 -18600 -20353 -17920 -18100 -12959 -10801 -12488 -14599 -15137 -12902 -12513 -13162
12053 -13162 -19304 -21140 -20995 -18793 -18712 -19543 -19738 -19119 -22787 -26741 -26749 -27005 -26520 -26643 -24329 -20004 -22795
12036 -22795 -24802 -26098 -22945 -22976 -24047 -23006 -24454 -21157 -19915 -19661 -19093 -19432 -16569 -18159 -19496 -19736
12020 -19736 -18678 -13888 -14705 -15674 -16006 -14970 -15131 -16101 -19298 -20453 -22406 -26381 -28771 -27865 -28560 -28609 -24983
12003 -24983 -23154 -23888 -23557 -25079 -22593 -22838 -24406 -28286 -30640 -30487 -27001 -22514 -22088 -21893 -24786 -24870
11987 -24870 -24603 -21611 -22144 -26318 -30782 -29474 -27078 -23552 -21048 -18217 -17875 -19809 -22104 -23585 -22224
11972 -22224 -24749 -28742 -27240 -27713 -28237 -32504 -34582 -32895 -30282 -28047 -23822 -24004 -22967 -24280 -24508
11957 -24508 -26741 -27935 -28945 -29411 -29874 -32199 -28486 -23497 -24722 -26265 -28670 -31947 -32319 -28530 -25105
11942 -25105 -23167 -23802 -25621 -27654 -27218 -28075 -30421 -30542 -32481 -32438 -31694 -34232 -32692 -31312 -28196 -27183
11926 -27183 -28271 -31297 -33987 -31528 -30659 -29862 -31331 -31284 -28550 -29403 -29702 -30871 -32589 -32036 -28516 -29414
11910 -29414 -32308 -34783 -34512 -33122 -31429 -28647 -27222 -32400 -33089 -34566 -35944 -37354 -38900 -38278 -33263
11895 -33263 -32627 -33055 -33772 -32055 -32126 -30035 -28644 -32124 -32464 -27473 -27998 -28451 -28597 -28452 -27967 -30095 -32487
11878 -32487 -33669 -36408 -35099 -32980 -33337 -30991 -31170 -30221 -33068 -35377 -32947 -30400 -31139 -32655 -34347
11863 -34347 -31894 -33957 -36329 -37631 -32801 -32279 -31982 -33261 -33053 -36637 -40369 -39761 -37714 -38441 -37224 -39277
11847 -39277 -41945 -39771 -36289 -36241 -36845 -39105 -40142 -41868 -42040 -38690 -36539 -36435 -37104 -36884 -41035 -40756
11831 -40756 -42026 -42261 -44511 -47818 -45276 -41903 -37694 -39767 -43971 -44642 -44636 -43811 -42681 -41260 -41663 -40780
11815 -40780 -40654 -42515 -41272 -39982 -38862 -37357 -38589 -39793 -41322 -43312 -43751 -43295 -44301 -40991 -40459
11800 -40459 -41536 -40962 -40583 -40554 -39005 -41452 -44101 -44418 -42463 -42080 -45059 -46390 -46381 -44632 -45772 -43524 -43215
11783 -43215 -42459 -42553 -44649 -45592 -47790 -46223 -41329 -41315 -45209 -45168 -43616 -40341 -40306 -41129 -39938 -39656 -38138
11766 -38138 -40863 -39734 -38333 -41609 -47511 -47694 -45794 -44325 -40221 -42941 -44199 -43226 -43455 -41798 -41889 -43889
11750 -43889 -45385 -47571 -47442 -46019 -44031 -45956 -46735 -43765 -44976 -45200 -46118 -47998 -48029 -47903 -45351 -46370
11734 -46370 -47143 -50355 -52324 -49521 -44551 -43260 -43613 -44077 -46150 -47449 -45814 -45904 -46094 -45125 -44767 -44348 -44204
11717 -44204 -46622 -47040 -47566 -44283 -44206 -45472 -44454 -44953 -42234 -40471 -41326 -43930 -43445 -46634 -48150 -48565
11701 -48565 -49826 -52654 -50760 -49657 -51494 -51379 -46543 -45437 -45900 -47760 -51449 -48879 -48544 -51383 -54652
11686 -54652 -54518 -56263 -57913 -56633 -56175 -53615 -51285 -51441 -52305 -52175 -53305 -54661 -51950 -51582 -53138 -50410
11670 -50410 -47850 -47623 -50001 -48792 -50244 -50187 -55324 -54685 -52543 -51604 -54453 -54967 -53528 -53518 -54302 -56080 -55382
11653 -55382 -55530 -52719 -48729 -52114 -54583 -54689 -55031 -57350 -54587 -51187 -49186 -46343 -46203 -48544 -49330 -50722
11637 -50722 -52120 -54191 -58967 -58588 -59036 -57304 -54898 -56800 -57724 -55909 -55118 -55567 -55848 -56889 -55227 -57437
11621 -57437 -58004 -55325 -53804 -52831 -52237 -51994 -48604 -50925 -53024 -52810 -52217 -52168 -51860 -55502 -53582 -50079 -51657
11604 -51657 -55358 -58797 -59968 -59342 -57803 -57963 -59436 -57742 -59187 -59922 -54094 -52621 -55228 -59505 -61915
11589 -61915 -63292 -64250 -62835 -62496 -61158 -58714 -56658 -55923 -57878 -59558 -59362 -58282 -56672 -57257 -58261 -58194
11573 -58194 -57404 -59715 -60405 -60261 -60266 -59889 -59754 -56865 -53642 -55125 -53173 -56243 -61210 -63666 -60966 -58903
11557 -58903 -57114 -58285 -62743 -63618 -65245 -66486 -63321 -62085 -60208 -60847 -59415 -54981 -52059 -59031 -63849
11542 -63849 -63123 -63419 -66720 -66386 -65072 -60835 -61486 -60684 -57326 -54571 -54341 -58448 -60248 -59872 -61062 -58816
11526 -58816 -58682 -61620 -59233 -57628 -57066 -58877 -59903 -63294 -62151 -60693 -62477 -61936 -61060 -61905 -63521 -70893
11510 -70893 -73771 -70238 -68650 -69974 -68963 -65674 -64072 -63959 -63616 -61715 -62110 -63327 -66488 -67525 -66903
11495 -66903 -70231 -67821 -63896 -60841 -62596 -63980 -64764 -64412 -64478 -64893 -63547 -59722 -59625 -63098 -61574 -60105
11479 -60105 -61145 -63200 -65461 -64323 -62723 -61557 -64892 -68053 -67742 -67350 -65295 -64973 -66193 -69675 -70078
11464 -70078 -69422 -65625 -63603 -64340 -66239 -65926 -64390 -64553 -65901 -66417 -65551 -68856 -71871 -70688 -67722 -67884
11448 -67884 -70510 -70893 -71982 -71058 -67719 -67898 -67354 -69269 -70932 -69291 -69438 -68387 -67050 -67566 -68302 -69478
11432 -69478 -69544 -70666 -69890 -71729 -72865 -72250 -70474 -70992 -71079 -75439 -77011 -78563 -77422 -76088 -74184 -74568
11416 -74568 -69078 -65835 -66757 -70747 -69605 -62406 -62325 -62783 -65005 -67966 -70241 -70288 -68034 -67775 -72371 -72852
11400 -72852 -72535 -74569 -75414 -76643 -77566 -75551 -76386 -74272 -76188 -77454 -76256 -75513 -73775 -72680 -73859 -72975
11384 -72975 -72964 -72475 -75091 -77168 -75284 -76085 -78645 -79092 -76265 -75041 -74082 -73630 -74270 -73179 -71765 -69921
11368 -69921 -68332 -70247 -76102 -76814 -76452 -77338 -73917 -74202 -74547 -75511 -80065 -79895 -78895 -75886 -75133 -75363 -75581
11351 -75581 -75830 -75996 -76044 -77389 -79636 -80228 -79079 -75352 -73684 -74722 -76362 -76132 -78691 -82359 -83214 -82533
11335 -82533 -78213 -77332 -78134 -78859 -77316 -75929 -71379 -70718 -72599 -74007 -78005 -79263 -79268 -80228 -80243 -77722 -76661
11318 -76661 -75725 -74008 -76030 -77233 -77158 -76012 -74838 -73027 -70831 -70330 -74011 -77162 -78720 -75553 -74624 -78023
11302 -78023 -80037 -79185 -81017 -82483 -80762 -80982 -79532 -77055 -77124 -78685 -79107 -79029 -80667 -83212 -81455 -81839
11286 -81839 -82258 -82573 -81734 -80996 -81629 -81780 -83118 -88596 -88776 -88941 -83594 -78566 -76110 -76181 -75081 -72129 -72410
11269 -72410 -77144 -80441 -80253 -82138 -81046 -78230 -76842 -79488 -84412 -88011 -85024 -85904 -84766 -82016 -81057
11254 -81057 -82513 -81186 -78279 -80992 -79248 -80842 -79306 -79127 -77915 -77790 -80627 -80650 -80576 -82703 -86513 -87508
11238 -87508 -83930 -80010 -77517 -80608 -85899 -85960 -83670 -83289 -85790 -87830 -83323 -79570 -80014 -79957 -78993 -79481
11222 -79481 -80564 -80992 -78662 -75487 -80203 -82869 -82841 -82117 -80503 -80013 -80621 -82358 -83611 -83783 -85469 -84339
11206 -84339 -85299 -87705 -86780 -86655 -85019 -86745 -87799 -88314 -87211 -86049 -85996 -87211 -87353 -85445 -79019 -81350
11190 -81350 -84865 -89881 -90254 -88894 -86992 -86075 -88773 -93922 -90685 -90010 -92581 -90470 -86610 -91172 -97017
11175 -97017 -98159 -93075 -91374 -86846 -83303 -82355 -84970 -85793 -82206 -82853 -85417 -87855 -86341 -82622 -79086
11160 -79086 -77782 -81464 -84553 -87079 -86039 -87456 -90378 -90745 -89045 -86556 -87421 -88797 -88653 -87359 -84751
11145 -84751 -86721 -89334 -87036 -85885 -87875 -88482 -87021 -89979 -92460 -93352 -95212 -95468 -91498 -91935 -94349
11130 -94349 -94255 -95042 -96521 -93985 -90580 -94743 -95594 -93855 -89235 -87004 -90844 -93020 -94903 -91137 -89534
11115 -89534 -89043 -90966 -92052 -90773 -89121 -92014 -95463 -97796 -92381 -86251 -89261 -89354 -88667 -90613 -91145 -91096
11099 -91096 -95657 -99924 -99229 -101672 -102935 -101850 -102895 -99165 -94400 -92699 -90017 -89881 -90138 -89900 -93980
11084 -93980 -91662 -92631 -93761 -91856 -88467 -89917 -89961 -87021 -86963 -92134 -93599 -94205 -95481 -93249 -91923 -94231
11068 -94231 -98602 -96253 -94496 -90300 -91967 -96058 -96762 -100528 -101142 -98727 -101052 -104698 -103103 -97840 -97251
11053 -97251 -99976 -98407 -97743 -98876 -98053 -96900 -97875 -97917 -100627 -100800 -101031 -96225 -95893 -97653 -103486 -102147
11037 -102147 -101006 -102216 -98479 -97354 -99343 -97739 -101704 -103513 -96443 -94508 -99004 -99719 -100181 -100123 -98422
11022 -98422 -101654 -101574 -102983 -106810 -105649 -100873 -101447 -105158 -103299 -99783 -101522 -105361 -104429 -103458 -102800 -99717
11006 -99717 -100957 -103624 -104397 -101107 -100315 -100807 -100483 -98991 -99174 -101623 -100852 -99813 -96792 -96998 -100200 -102314
10990 -102314 -102418 -100160 -102387 -102726 -100480 -102550 -101078 -97712 -98669 -103500 -106944 -106072 -103922 -104690 -103558
10975 -103558 -103623 -106934 -108204 -110381 -110893 -109421 -108582 -105996 -106428 -107498 -106240 -102848 -101667 -101110 -99392 -97763
10959 -97763 -96963 -98783 -99717 -102322 -102287 -102145 -103633 -105750 -106161 -105594 -105793 -105041 -105864 -105918 -103493 -104542 -105404 -105101
10941 -105101 -104377 -103724 -106174 -109916 -112077 -108977 -106654 -106446 -107454 -106801 -102469 -99566 -98774 -98653 -101631 -106726
10925 -106726 -109478 -107237 -103359 -102025 -102863 -105276 -105028 -105294 -104685 -102549 -102108 -104129 -106076 -105703 -107198 -106246
10909 -106246 -107270 -106142 -106922 -105039 -103417 -107369 -112356 -113329 -113224 -111892 -107357 -107617 -110300 -110318 -116112 -117333
10893 -117333 -112440 -111715 -114353 -113368 -111149 -107749 -106327 -109335 -111998 -110215 -110162 -112531 -111444 -111913 -113174
10878 -113174 -114895 -113972 -112708 -109968 -108779 -108832 -110947 -107277 -102203 -101824 -102872 -103773 -106355 -108134 -109501
10863 -109501 -112070 -118627 -116406 -118579 -120208 -118067 -116760 -114351 -113641 -111749 -111945 -115863 -116388 -116187 -110767
10848 -110767 -108803 -108250 -108349 -110633 -111899 -109867 -108573 -109555 -113953 -119262 -120527 -119747 -116163 -114942 -115092 -116871
10832 -116871 -119990 -119709 -120272 -121498 -120424 -117841 -116960 -117602 -116827 -117423 -118373 -116737 -117787 -118504 -118400 -113501
10816 -113501 -111457 -113779 -116487 -117737 -119969 -120162 -119312 -118744 -118867 -115139 -117254 -118360 -117090 -114720 -111673
10801 -111673 -110287 -113234 -119457 -120586 -120281 -121816 -119393 -115539 -116686 -116758 -115234 -115764 -116054 -115927 -117051 -115451
10785 -115451 -112944 -113920 -113400 -116284 -124277 -124486 -117532 -116597 -116829 -117722 -118295 -116348 -113043 -112531 -114413 -111163
10769 -111163 -113282 -117282 -118379 -115176 -113515 -114915 -115476 -116030 -117958 -119908 -118158 -113490 -114210 -117408 -117315
10754 -117315 -114032 -112661 -110034 -109858 -112598 -113194 -113578 -116156 -118997 -120098 -118583 -118167 -116948 -120452 -123669
10739 -123669 -121198 -119687 -119731 -119178 -117534 -120418 -124279 -125520 -120206 -122472 -125241 -120394 -113929 -113876 -118927
10724 -118927 -121129 -120955 -121062 -121278 -124656 -124593 -122959 -118955 -117971 -121649 -125873 -126180 -125157 -122638 -120978 -119917
10708 -119917 -123244 -126930 -127482 -125207 -122667 -118911 -119963 -119692 -119480 -122118 -122196 -124595 -127078 -128177 -128379 -130511
10692 -130511 -127892 -130871 -132238 -133821 -135035 -133735 -129363 -126125 -121663 -119369 -120985 -121411 -120535 -118729 -120284
10677 -120284 -121066 -121310 -123723 -126521 -125030 -123269 -121809 -120508 -124151 -127308 -128572 -125433 -121688 -119280 -119193
10662 -119193 -116360 -116611 -121166 -125462 -128223 -126964 -126206 -125631 -126314 -129635 -131752 -130702 -128734 -133059 -135276
10647 -135276 -134300 -131328 -130585 -129073 -129829 -126049 -124839 -125904 -130209 -131751 -131269 -131013 -134945 -132254 -128048
10632 -128048 -128372 -131441 -130503 -128937 -127778 -127141 -125986 -123049 -123284 -125008 -126846 -129031 -126817 -125955 -129933
10617 -129933 -131733 -131625 -132243 -131115 -127492 -125121 -126657 -130105 -133656 -134932 -133287 -130915 -130902 -131382 -129892
10602 -129892 -129176 -127852 -127658 -128467 -127326 -127507 -125137 -124161 -129331 -128713 -130134 -130423 -134654 -137322 -133820 -128502
10586 -128502 -126070 -127618 -128625 -133302 -132226 -126579 -118950 -112233 -110887 -113213 -116142 -119562 -121694 -124650
10572 -124650 -124868 -125633 -126410 -125879 -127331 -128577 -127086 -126471 -126030 -122480 -120759 -120635 -119627 -117953 -115065 -116334
10556 -116334 -118402 -121944 -123463 -121982 -122045 -123761 -123649 -121896 -122636 -124758 -125987 -126101 -128975 -131309 -135578
10541 -135578 -137243 -133811 -132888 -133733 -133333 -135198 -133984 -132821 -130552 -132971 -133878 -133379 -133814 -138682 -140552 -140636
10525 -140636 -139134 -138204 -139632 -139315 -137662 -135275 -134106 -134071 -136619 -137455 -138630 -137916 -138366 -140120 -139431 -137528
10509 -137528 -139679 -139325 -141324 -142943 -142737 -140132 -133435 -127197 -123581 -121272 -117475 -121665 -123957 -127178 -129056
10494 -129056 -133072 -135131 -134282 -137513 -137814 -141106 -140870 -138289 -136785 -135980 -137468 -139138 -140260 -144156 -144501
10479 -144501 -142351 -138968 -139691 -140802 -140622 -139770 -141382 -142295 -138276 -137884 -140864 -142198 -142157 -144171 -145644 -142872
10463 -142872 -144034 -143748 -143833 -143729 -145201 -140139 -137617 -139313 -143056 -142319 -144425 -143548 -143324 -146627 -148734 -145669
10447 -145669 -142733 -139616 -141484 -138036 -134517 -130769 -125556 -121811 -121682 -124237 -127486 -133541 -136966 -137333 -140323
10432 -140323 -138660 -138616 -141568 -142315 -139581 -139147 -140110 -144009 -144743 -143484 -142204 -142660 -142880 -142522 -143954 -144934 -146954
10415 -146954 -151079 -151571 -148512 -146082 -148501 -148039 -145368 -143172 -140301 -142318 -145530 -148521 -147547 -145267 -143044
10400 -143044 -142383 -140601 -141684 -142053 -141948 -141518 -141535 -144804 -146700 -146723 -146258 -147979 -144960 -142223 -143367 -144490
10384 -144490 -145101 -144434 -143517 -146703 -147343 -150562 -154205 -156160 -153017 -148860 -148157 -148766 -150605 -150682 -144942 -145221
10368 -145221 -143313 -142412 -147434 -151704 -146950 -142627 -144305 -145763 -145660 -144956 -145147 -147691 -145949 -146432 -148304
10353 -148304 -151120 -152151 -150159 -148010 -146773 -148236 -148460 -150168 -152147 -156143 -157484 -156933 -157972 -157797 -155913
10338 -155913 -153550 -152265 -150994 -148064 -146495 -149087 -150255 -152689 -154073 -151316 -150138 -152309 -151040 -150379
10324 -150379 -151168 -148803 -148254 -152124 -153316 -153756 -153224 -155894 -156841 -155030 -157249 -154780 -155458 -156326 -156885 -152136
10308 -152136 -151153 -154078 -155950 -156059 -156936 -158098 -157249 -156192 -156607 -157086 -160724 -160882 -162103 -162067 -162189 -163835 -163748
10291 -163748 -161470 -157606 -157011 -153876 -151164 -154594 -153701 -155623 -156332 -155670 -156248 -158583 -160673 -161536 -159698 -159889
10275 -159889 -158077 -155743 -155075 -158127 -159688 -158131 -158008 -159814 -163904 -161447 -157378 -157772 -160432 -161287 -158344
10260 -158344 -157408 -158580 -160527 -159406 -156839 -159388 -158082 -159139 -159945 -160599 -165091 -162876 -163049 -162447 -163658
10245 -163658 -165410 -167536 -167209 -163886 -161720 -163013 -167410 -165584 -166546 -163454 -159134 -159968 -158375 -156550 -157168
10230 -157168 -158960 -161457 -161605 -162693 -162190 -162244 -162335 -162334 -163751 -163038 -162574 -165107 -167338 -167539 -167600 -165989 -165246 -166450
10212 -166450 -164380 -165908 -169597 -166616 -165474 -168394 -171344 -171075 -168968 -171074 -173074 -173460 -174015 -172242 -170814
10197 -170814 -171775 -168233 -168399 -171091 -173089 -171284 -169315 -168901 -169597 -169090 -168298 -171427 -171819 -170977 -170326 -168518
10181 -168518 -169823 -165937 -163017 -165316 -167089 -169214 -169763 -171693 -171547 -168737 -165461 -168376 -171949 -171104 -169367
10166 -169367 -170750 -169205 -168683 -168169 -167871 -169311 -171066 -171628 -171258 -169395 -170080 -170537 -170094 -174329 -175430 -173219
10150 -173219 -170733 -166169 -166483 -170373 -174518 -176001 -177468 -174478 -172669 -174153 -174355 -177367 -181265 -180840 -175022
10135 -175022 -174601 -177175 -175653 -170400 -170491 -169623 -169379 -167957 -166120 -168458 -169306 -168738 -168580 -171076 -171351 -170441 -173685
10118 -173685 -175870 -173318 -171162 -171815 -172941 -175075 -175700 -175393 -174429 -174905 -175541 -176127 -179918 -178875 -177412 -176107
10102 -176107 -177081 -176878 -176793 -179226 -179243 -178032 -177496 -177662 -173479 -173169 -175005 -176655 -176899 -177571 -178897 -178479 -177823
10085 -177823 -176938 -176889 -177566 -181448 -185795 -184558 -182816 -184682 -184763 -182875 -183328 -181778 -180048 -180401 -179881 -180408 -182261
10068 -182261 -183796 -181173 -187135 -188227 -185614 -185356 -185780 -184475 -184451 -185000 -184729 -183630 -185982 -186647 -188206 -185727
10052 -185727 -184240 -182835 -182659 -179999 -182236 -185300 -186541 -184524 -185180 -187118 -185358 -185262 -182486 -178066 -175032
10037 -175032 -180000 -180310 -180274 -181259 -184657 -188449 -187447 -188155 -189450 -188465 -190370 -189318 -189468 -183828 -182512 -180168
10021 -180168 -178846 -182013 -183767 -185628 -189143 -189469 -188597 -189314 -190646 -188614 -187396 -186263 -188789 -190233 -194896
10006 -194896 -195479 -192583 -190887 -191496 -191658 -189620 -188495 -183999 -184062 -185529 -184878 -188009 -189738 -190454 -193326 -194931
9990 -194931 -193820 -191861 -191988 -192993 -196133 -200717 -199913 -194587 -188667 -187873 -188349 -185684 -187195 -187748 -190225 -193470
9974 -193470 -192217 -190685 -189394 -194071 -195331 -194940 -193685 -194294 -191782 -190769 -190055 -188405 -191708 -195758 -196388
9959 -196388 -193462 -191439 -193034 -193540 -192767 -192020 -193713 -197155 -198805 -200808 -196591 -191871 -192709 -194308 -195479
9944 -195479 -195496 -195324 -196065 -196798 -199324 -200021 -201748 -204197 -201003 -199507 -201046 -199898 -198382 -201297 -202555 -201772
9928 -201772 -200814 -199220 -201806 -200471 -197943 -197328 -195475 -198280 -200769 -198399 -195679 -199325 -200585 -201825 -203927
9913 -203927 -202380 -200376 -200175 -200558 -204605 -208089 -206749 -205985 -204902 -206013 -205986 -206046 -207960 -205283 -203063 -203862
9897 -203862 -201686 -199857 -198675 -200276 -198010 -198533 -197052 -199773 -198997 -196884 -194431 -194320 -196281 -200254 -200157 -200110
9881 -200110 -202443 -202317 -198154 -194117 -192304 -195550 -196580 -196720 -196866 -201820 -202027 -202920 -206689 -208991 -206721 -203780
9865 -203780 -202636 -201474 -201262 -204819 -206944 -207097 -206912 -207783 -208231 -211257 -214621 -213520 -212578 -213442 -212911 -214055
9849 -214055 -210319 -207721 -209867 -208782 -208056 -209299 -208326 -207507 -206606 -204399 -201530 -197536 -198470 -202520 -204055 -206271
9833 -206271 -207687 -209146 -208252 -208204 -211815 -213017 -213949 -212423 -214578 -216501 -215574 -213863 -217213 -218956 -215258 -213479
9817 -213479 -214341 -218390 -216828 -211533 -212747 -213858 -215213 -215134 -219986 -222157 -223305 -223008 -222421 -222074 -222355 -221737
9801 -221737 -220440 -216556 -218264 -221703 -222087 -223088 -221748 -217690 -215504 -213073 -207499 -206312 -208854 -210801 -213810
9786 -213810 -216963 -216218 -214657 -214282 -215629 -217138 -217999 -218721 -221765 -219243 -217618 -215872 -217809 -218177 -217925 -222357
9770 -222357 -225609 -227882 -223813 -219959 -219457 -218447 -221537 -221518 -221040 -222114 -223445 -222799 -225359 -224424 -224004 -226556
9754 -226556 -226537 -224874 -227213 -228479 -230778 -231242 -231662 -231343 -230183 -229124 -224964 -223117 -218618 -218646 -222097 -225652
9738 -225652 -226266 -224165 -225589 -224580 -223471 -225026 -225716 -227678 -228639 -227408 -231468 -233594 -228700 -228648 -232987 -235113
9722 -235113 -234689 -233227 -232120 -230233 -231629 -231213 -230186 -229896 -230931 -231417 -233918 -233415 -235614 -238529 -237678 -234719
9706 -234719 -229998 -229989 -232867 -235692 -233538 -232554 -233289 -229131 -232266 -234975 -237426 -234877 -235958 -239146 -241377 -240282
9690 -240282 -236667 -234263 -236027 -237595 -238039 -237458 -236248 -239023 -238648 -236534 -238988 -242837 -242943 -238417 -236275
9675 -236275 -240429 -242746 -241125 -239229 -242276 -245510 -245620 -244225 -243416 -244402 -242191 -239586 -239654 -243038 -247329 -249291
9659 -249291 -246981 -246823 -248821 -248789 -248611 -249303 -248935 -250035 -248296 -243661 -244883 -243400 -241796 -241304 -241237 -239423 -243903
9642 -243903 -249702 -252897 -254633 -255323 -252671 -250007 -245990 -244619 -246518 -247741 -249960 -251777 -252228 -253564 -252771
9627 -252771 -250288 -247472 -249449 -249285 -246964 -246714 -249834 -249511 -248709 -247041 -245995 -249810 -246479 -245548 -247679 -250351
9611 -250351 -253024 -256423 -256081 -253689 -248715 -247867 -249302 -248904 -250882 -250978 -250736 -252719 -252688 -252227 -252541 -251719 -253924
9594 -253924 -256906 -256810 -257446 -256271 -256992 -257708 -254732 -254416 -255057 -260166 -263968 -263895 -262752 -263424 -263368 -264770 -265925
9577 -265925 -261081 -258253 -264440 -264395 -265562 -272029 -273516 -268631 -263898 -265953 -269470 -269037 -266675 -264729 -266953
9562 -266953 -270230 -269473 -265112 -264358 -267720 -268887 -267308 -266732 -267081 -268827 -272036 -276222 -276643 -272204 -272685 -270705
9546 -270705 -268718 -269865 -269819 -270425 -274127 -276457 -277212 -276745 -276028 -275354 -272806 -273402 -273832 -273690 -272854 -271343 -268729
9529 -268729 -267959 -265943 -265260 -265571 -269489 -275802 -274224 -272180 -272362 -271938 -273515 -276185 -279599 -282389 -282063 -279416
9513 -279416 -278463 -278895 -273881 -269148 -271073 -273161 -276991 -278241 -278456 -279506 -280236 -281215 -280272 -282402 -282707 -280869
9497 -280869 -280753 -283442 -286819 -289589 -286859 -287579 -289622 -292181 -292402 -289986 -288591 -293112 -294620 -292087 -290416
9482 -290416 -287299 -287136 -286308 -289349 -289522 -291591 -290837 -289108 -288973 -290893 -292760 -294262 -294670 -293618 -297582 -298229
9466 -298229 -292586 -289704 -292005 -294282 -297440 -298659 -300052 -298061 -296372 -294261 -297780 -297705 -297457 -299963 -303926
9451 -303926 -300519 -300083 -300200 -299655 -298159 -295969 -296513 -298212 -300847 -300636 -300895 -303508 -305756 -307825 -307460 -307205
9435 -307205 -305911 -305266 -306096 -309094 -311279 -311037 -306515 -302998 -302417 -304879 -312014 -313401 -311272 -308709 -309939
9420 -309939 -308476 -308520 -306006 -308025 -309387 -306283 -305692 -311200 -314198 -312920 -312563 -315850 -321159 -324116 -321762
9405 -321762 -320379 -318847 -318532 -317357 -315518 -311007 -309661 -306087 -304829 -309945 -313161 -314877 -314854 -315238 -314621 -319985
9389 -319985 -320817 -315179 -315006 -314854 -317462 -320766 -322626 -322825 -321474 -321769 -321619 -323686 -323096 -321465 -323483 -322070
9373 -322070 -320589 -324520 -327883 -326669 -324654 -326076 -326768 -328910 -329358 -329596 -329800 -329236 -329092 -328810 -328043 -329941
9357 -329941 -330358 -330202 -330249 -328810 -332361 -336508 -337472 -336485 -334497 -338070 -342037 -346356 -346408 -345422 -346330 -345465 -345927
9340 -345927 -343117 -342314 -343331 -341258 -343001 -343982 -340424 -337082 -335777 -339251 -341156 -343035 -343415 -344349 -346489
9325 -346489 -346741 -345501 -346221 -344564 -345014 -352852 -351572 -349515 -350134 -351266 -352896 -353330 -355009 -354120 -355684 -357337
9309 -357337 -360791 -361857 -362315 -361386 -360025 -358247 -360186 -359728 -358760 -361585 -362264 -363403 -364217 -365098 -366074 -364099
9293 -364099 -362121 -363205 -358865 -356563 -360707 -363018 -363555 -366169 -363448 -361232 -360058 -359376 -359559 -358774 -363118
9278 -363118 -364892 -365346 -367066 -367997 -367697 -370554 -371008 -370411 -372502 -374622 -372669 -372157 -372267 -370625 -370905 -373189
9262 -373189 -374118 -375933 -380958 -382315 -385014 -385401 -384741 -381926 -379651 -380598 -380176 -374988 -375609 -378336 -382806 -387880
9246 -387880 -389718 -387170 -389786 -389523 -388146 -387519 -387316 -387185 -391040 -397641 -398816 -395100 -392011 -396164 -397130 -394986
9230 -394986 -393200 -391878 -393616 -394162 -395307 -398242 -403472 -406691 -406505 -404957 -405915 -402112 -398828 -399881 -407253
9215 -407253 -410683 -411741 -411987 -409164 -405058 -406417 -407398 -407365 -411175 -413142 -415117 -413865 -411184 -413578 -413838 -413301
9199 -413301 -414943 -415395 -416547 -420434 -420179 -417837 -423568 -426448 -422597 -422136 -423465 -423931 -423968 -424730 -426362 -427454
9183 -427454 -428303 -429604 -428367 -429162 -433028 -434931 -432558 -431262 -427361 -422320 -425305 -426122 -427733 -430641 -428614
9168 -428614 -428709 -431772 -436881 -438026 -436836 -433090 -434944 -435537 -433925 -434142 -437987 -437817 -440563 -439773 -440026 -442090
9152 -442090 -444529 -446390 -449742 -453174 -453552 -454302 -454791 -456412 -456292 -457227 -459932 -462331 -460088 -458878 -460737 -461275
9136 -461275 -459266 -457099 -455076 -456064 -459073 -459961 -459924 -462317 -466553 -468093 -465649 -464858 -466213 -465652 -464923 -467369
9120 -467369 -477173 -482810 -480251 -476942 -471292 -465448 -468697 -470510 -475865 -483090 -482358 -481485 -483710 -488582 -493113
9105 -493113 -492763 -489847 -489973 -494135 -490351 -487917 -488689 -492411 -493443 -494790 -496878 -499318 -499941 -501208 -501763 -504630
9089 -504630 -505464 -505042 -507165 -509911 -513261 -515303 -511731 -509911 -509430 -506818 -507431 -509578 -510692 -512925 -515586
9074 -515586 -515416 -513369 -513546 -514124 -516230 -518421 -519563 -518906 -518588 -521184 -526362 -531696 -531613 -531307 -534706 -537252
9058 -537252 -538990 -540838 -543774 -544633 -548366 -552846 -556732 -554925 -555392 -561951 -564874 -566261 -567368 -566316 -564553
9043 -564553 -564926 -568099 -565698 -566445 -571781 -571343 -572252 -575553 -576588 -573565 -575597 -577139 -579559 -580785 -580080 -577070
9027 -577070 -575097 -573839 -574889 -572334 -569783 -566257 -558474 -544772 -513997 -470808 -406008 -304897 -172623
9014 -172623 -8774 174603 347832 490082 573556 582225 522979 406866 261342 108753
9004 108753 -30418 -141022 -229957 -296280 -339058 -369701 -394686 -413893 -428573 -443324 -456787
8993 -456787 -469104 -482861 -497141 -507207 -518539 -526186 -529800 -538558 -547024 -550282 -555034 -563755 -569581
8980 -569581 -573580 -580169 -588098 -591445 -592038 -591685 -588099 -589767 -595840 -601634 -604623 -607739 -615257 -621710 -623039
8965 -623039 -625897 -627995 -631273 -635390 -634290 -630453 -633364 -638182 -643252 -646644 -646634 -646417 -649298 -653351 -651552
8950 -651552 -653529 -660132 -664940 -666783 -662106 -659713 -662592 -665041 -665643 -665430 -667261 -670739 -675169 -676730 -682437
8935 -682437 -688229 -691232 -696692 -698888 -696495 -696968 -703169 -707253 -710295 -716417 -722483 -724893 -727201 -727279 -724035
8920 -724035 -721998 -727345 -729018 -724139 -717748 -719636 -722577 -724878 -731977 -736641 -733430 -731903 -732728 -733335 -733571
8905 -733571 -731225 -722285 -707705 -696077 -696067 -707504 -730171 -751037 -764537 -770933 -770342 -770761 -775663 -776852
8891 -776852 -779646 -785657 -791838 -796791 -799609 -804400 -811687 -816300 -819999 -822271 -824191 -827250 -831022 -833057
8877 -833057 -834486 -834900 -834362 -836122 -836285 -836292 -828020 -810681 -778480 -720064 -673237 -662315 -685642 -712869
8863 -712869 -724292 -753970 -782333 -789726 -807105 -828834 -850934 -864861 -872961 -875685 -880377 -885456 -888673
8850 -888673 -899136 -908200 -915747 -925228 -932382 -933804 -936352 -942181 -939749 -935042 -939667 -951205 -961518 -973581
8836 -973581 -982120 -990169 -996976 -995733 -991297 -994975 -1004415 -1012296 -1016599 -1019681 -1020131 -1019039 -1018595 -1025730 -1032859
8821 -1032859 -1036302 -1038395 -1041876 -1046270 -1049155 -1051337 -1051415 -1051186 -1054919 -1063099 -1076819 -1093372 -1108502 -1116895
8807 -1116895 -1118841 -1115215 -1111378 -1106051 -1106239 -1107223 -1114603 -1131233 -1151140 -1172108 -1193460 -1212294 -1221194
8794 -1221194 -1221600 -1212219 -1203854 -1197490 -1195742 -1203034 -1217761 -1232334 -1246161 -1254987 -1264278 -1277240 -1293470
8781 -1293470 -1310644 -1321141 -1327642 -1334182 -1341201 -1347917 -1355882 -1364844 -1385035 -1411134 -1438506 -1464513 -1471775
8768 -1471775 -1449754 -1418364 -1389768 -1369026 -1367390 -1380978 -1398140 -1418505 -1435430 -1451916 -1468304 -1481677
8756 -1481677 -1494446 -1508879 -1524352 -1537207 -1550464 -1561224 -1569384 -1580982 -1595553 -1607751 -1620601 -1636158
8744 -1636158 -1647022 -1634696 -1551386 -1361665 -1235995 -1194207 -1202752 -1273324 -1374593 -1449522 -1504207
8733 -1504207 -1549657 -1585940 -1619095 -1648739 -1672440 -1694186 -1712049 -1718710 -1713981 -1698545 -1692014 -1705696
8721 -1705696 -1732939 -1769726 -1803483 -1837495 -1870336 -1901324 -1927967 -1947167 -1961790 -1973462 -1982156 -1995273
8709 -1995273 -2009517 -2024282 -2037119 -2037801 -2033429 -2042614 -2068247 -2102061 -2135728 -2168939 -2193681 -2212230
8697 -2212230 -2230087 -2248599 -2261053 -2267977 -2269875 -2269371 -2279751 -2313147 -2365747 -2433931 -2501760 -2560033
8685 -2560033 -2612401 -2657657 -2690716 -2718183 -2735840 -2750375 -2767403 -2793694 -2832449 -2877016 -2930360
8674 -2930360 -2994831 -3069103 -3147015 -3212164 -3264049 -3311320 -3357941 -3408216 -3475351 -3549040 -3622729
8663 -3622729 -3702846 -3782736 -3854531 -3920061 -3979755 -4029069 -4072259 -4117512 -4177196 -4255981 -4348137
8652 -4348137 -4446269 -4529110 -4602447 -4678479 -4770480 -4878879 -4991663 -5086161 -5156531 -5208997 -5248494
8641 -5248494 -5278538 -5323457 -5390884 -5477507 -5555167 -5607103 -5621640 -5572000 -5427429 -5161635 -4731590
8630 -4731590 -4084603 -3203155 -2097255 -1023676 -296078 -18590 -87456 124993 1127695
8621 1127695 3492949 7988029 16025569 30620182 57687742 107448804 188564824 273359946
8613 273359946 308602862 298399659 255243027 190727347 137743129 103234702 80839905
8606 80839905 65663957 55058716 47474871 42012200 38248165 35907314 34157048 32175869
8598 32175869 29924561 27369031 24768447 22431104 20370902 18578725 17066846 15801314
8590 15801314 14734747 13806609 13004475 12319538 11716208 11185303 10718859 10295126 9908050
8581 9908050 9540040 9175010 8817272 8477034 8180861 7919353 7677537 7433682 7181689 6932267
8571 6932267 6703833 6505024 6334882 6178624 6032827 5886365 5738882 5587699 5438501 5297796
8561 5297796 5177632 5064957 4945641 4833460 4725025 4621677 4519788 4411316 4303196 4202511
8551 4202511 4122551 4054747 3986978 3918771 3851164 3790090 3730134 3669924 3608218 3547375 3492489
8540 3492489 3431522 3364496 3300919 3241538 3182030 3125903 3077442 3031806 2986136 2937451 2891961
8529 2891961 2843657 2798035 2766183 2739218 2707740 2680343 2650392 2619055 2589650 2567805 2550697
8518 2550697 2536444 2522951 2514212 2499997 2474346 2445887 2413402 2375578 2340335 2311282 2289007 2283494
8506 2283494 2300781 2323262 2322299 2294214 2248649 2194637 2150107 2112467 2081031 2055622 2035344 2011755
8494 2011755 1989152 1963695 1934160 1900030 1864528 1823756 1792960 1792864 1824214 1854347 1863785 1857680
8482 1857680 1835133 1810400 1790311 1780426 1767968 1753853 1743908 1736356 1729038 1715802 1699173 1682615
8470 1682615 1668600 1652769 1637676 1620203 1601433 1576730 1546319 1516183 1494609 1487718 1496315 1525922
8458 1525922 1557327 1577627 1578727 1556953 1525773 1495873 1478024 1460596 1449707 1442465 1438551 1433567
8446 1433567 1423539 1412299 1398259 1388883 1376128 1366052 1357475 1350197 1341767 1333011 1325608 1325443 1327150
8433 1327150 1326667 1324833 1318597 1303835 1286052 1274376 1254963 1226166 1202830 1186294 1177807 1178124 1186350
8420 1186350 1204010 1216939 1216846 1205788 1177587 1152398 1134592 1120261 1108674 1104614 1099798 1093810 1090122
8407 1090122 1084888 1081439 1081760 1081176 1077303 1073347 1075759 1081325 1080860 1073441 1059604 1046495 1035760 1030237
8393 1030237 1031282 1031902 1031956 1025420 1012973 1000628 988215 977584 970588 970844 967580 964449 962969 964660
8379 964660 961133 953810 944468 935103 928821 923778 924707 925911 927895 925788 917484 904405 892833 881425
8365 881425 870126 862329 863079 863999 866628 869086 875410 878041 870849 863940 861953 854340 848386 848019 845874
8350 845874 838985 834701 834699 832340 829363 827567 822635 818561 813166 807949 802435 797777 787213 777995 773112
8335 773112 767584 762273 759827 759865 760305 762009 762842 763178 761796 756519 752618 750532 750485 747982 737738 727776
8319 727776 721241 715552 709584 706147 706535 707001 702404 695070 692127 687676 687541 690153 691284 693678 695343
8304 695343 695179 693545 694185 690826 685077 680623 677102 670044 659990 656755 660654 660725 657680 654636 649638
8289 649638 644749 640346 636179 635286 631811 629128 626473 627052 628989 625786 621545 619427 623182 621334 615189
8274 615189 612139 610116 609062 608904 602331 597471 598170 595897 594693 595512 592509 590325 590104 588442 588249 585146
8258 585146 581549 578724 571191 565951 565857 563206 561889 559410 559450 561519 561904 561271 558517 555886 551704 547276
8242 547276 543654 537198 533379 532489 529719 527460 525201 525072 521180 516173 512915 511813 514515 521881 528789
8227 528789 537733 545231 550173 551950 552024 551097 552531 562589 584289 623413 690341 787705 920428
8214 920428 1088212 1275704 1456616 1597571 1673321 1684864 1623947 1509921 1369309 1220784
8204 1220784 1085260 971181 883013 814946 765462 731770 706039 687478 673327 660130 646352
8193 646352 635004 622506 609750 595993 584814 580790 576207 570514 565643 559509 553788 550790 546623
8180 546623 542001 536860 534899 532587 530558 531803 528269 524323 519904 513666 506139 507512 506626 504667 501862
8165 501862 500249 496574 493589 491957 500863 519025 549690 588723 630777 653069 650625 626089 588648
8152 588648 558427 538341 521251 509317 498165 488500 483058 479020 478647 478721 477343 471275 465255 464568
8138 464568 465988 464741 463045 459596 455698 453935 450826 451453 449984 445863 440428 434113 432213 429206 428373
8123 428373 427984 430649 432673 428229 421320 419541 423450 426006 423071 419335 419844 421564 421931 422181 417444
8108 417444 412568 412671 415034 413484 413590 411098 409332 408870 408885 407948 406145 404839 401984 398714 396295 394872
8092 394872 393536 390693 391002 392963 394963 393417 391613 390239 390517 387839 388945 388924 391041 398123 409871
8077 409871 432313 476204 553352 675973 807451 868289 851224 778905 682487 602477 545153
8066 545153 507412 483938 467694 452536 441370 435588 432126 426613 421966 418289 413317 408636 406915
8053 406915 403751 401062 395596 389510 385944 385364 387140 387555 388364 389114 389925 390100 387385 382273 378994 381174
8037 381174 378797 376651 376547 376381 377457 375105 371290 371499 373061 378011 384178 381880 378400 371108 364811
8022 364811 362363 359267 356450 357719 359325 358326 354426 352156 357723 359768 359062 356876 355748 349744 342887
8007 342887 340026 341062 344648 340913 338979 340521 340557 338659 336628 337444 340119 346635 351350 353501 353430 352542
7991 352542 349906 342311 342076 341352 338965 336379 333167 333016 334408 334270 335399 332901 328524 324869 320765
7976 320765 320112 319951 322642 324721 325415 325722 322375 319448 318433 318551 318344 317649 315733 311552 311477 313732 315892
7959 315892 316021 314860 315052 313666 312602 311368 313234 317000 320364 318385 315065 313203 311774 312136 311836
7944 311836 311064 308947 310102 308714 307386 305385 304244 301819 299071 299599 300950 301128 302059 301695 301434 299043
7928 299043 296190 296038 294243 293268 292163 289417 285451 285976 286879 286870 288674 288446 287704 289528 288281 286595 287518
7911 287518 286055 288413 291670 289030 288003 286564 287985 290177 285096 283109 280281 281337 281065 279761 281796
7896 281796 280976 277525 276323 277211 276293 273952 276776 276915 277225 278033 275726 272113 268258 267503 270432 270596
7880 270596 269877 271066 271168 269510 263606 263490 264016 260602 256936 255770 256764 258359 262936 265439 265217 264757
7864 264757 261885 257383 254901 255972 258480 256948 252465 253160 254648 255301 254536 254597 252830 252727 254852 257202
7848 257202 254194 253598 250821 246244 247593 250388 253133 248831 249790 252026 250313 245517 243464 244568 247206
7833 247206 246663 245201 244440 242350 240817 237858 240656 240912 239375 237113 240157 243450 243028 240299 238967
7818 238967 242006 246689 244255 244386 244302 241233 238508 237909 237321 237553 236666 235783 231347 231747 233422 232254 232643
7801 232643 235910 235303 234197 230455 227681 226970 228701 230778 236086 234318 232844 229907 230116 231752 231754 231257
7785 231257 229422 225224 223834 225190 226865 229011 228388 223685 218935 218617 220275 218772 219130 218597 219064 219875
7769 219875 221757 225665 225311 224685 227441 225540 220784 220533 219329 219106 218726 215267 213933 216049 223994 223333
7753 223333 219862 214699 211242 213951 216036 215139 215471 212728 211082 213625 215533 214585 213543 216029 215585
7738 215585 217524 217403 219302 216362 212515 209698 208605 209029 208345 211209 211826 210892 210352 208815 206049 209490
7722 209490 208813 210296 209391 205198 201638 203760 205070 202489 204833 207793 203027 202192 204055 201185 198884
7707 198884 199261 200313 199698 202329 205256 202337 202124 198729 199996 205193 203883 201680 200953 197205 194739
7692 194739 196606 196497 195042 194433 195405 198624 197942 198374 198085 197589 199853 203250 203208 199423 194411 191321 191385
7675 191385 191237 194285 199158 201874 199233 196874 196961 199479 200637 197911 192664 190016 187271 188916 191015
7660 191015 193358 194876 193812 192402 191210 190379 191965 192689 191336 187977 187577 190005 189071 187308 189304
7645 189304 190758 190691 188707 187326 187317 187676 189325 190291 188665 187645 184633 182313 182960 186549 186770 189138 188618
7628 188618 186771 183662 181591 181075 179650 177674 179758 182009 184198 181509 178377 176748 176028 175398 173734
7613 173734 171753 172938 175968 176666 178108 177717 177784 176898 173254 172167 168609 168854 173335 176170 175514 174853
7597 174853 178113 177101 174156 171107 171733 173049 173854 170686 171674 172376 168967 168277 168561 168223 169516 173551
7581 173551 172796 172389 174292 175335 174861 176137 176912 172607 168894 170834 173348 174956 173477 173323 173329 171205
7565 171205 169218 169840 170848 171577 167291 169387 169828 166331 164075 163560 164841 165530 167599 169059 169571 168379
7549 168379 166400 163945 163519 164943 165224 163388 161158 161026 163456 161273 160039 163350 165378 164338 165495
7534 165495 159762 156692 160267 161017 156976 157428 162252 160517 157695 156710 156017 156389 157196 157391 159520 162205
7518 162205 162572 162073 166538 168077 163051 159576 159331 157454 156731 158075 156653 154679 155549 158430 158032 156164
7502 156164 159816 160188 159589 156646 154934 154471 152854 152358 150543 150862 152525 155038 157992 159103 154169 151937
7486 151937 152380 152341 149964 146118 148436 150462 150165 150290 149674 148484 146521 148047 150126 152048 152631 154101
7470 154101 155458 154786 153727 153641 150453 151409 152171 150818 151247 149249 146800 147593 146507 149616 152218 151089
7454 151089 145908 143994 143274 145694 146653 146589 144569 144183 143547 146196 144989 143810 143289 145181 149242 149260 149002
7437 149002 145581 143853 143775 144273 145662 148210 148986 145765 144709 146890 145859 144081 142287 143239 145975 145533
7421 145533 145866 144968 143029 140678 137552 138717 142575 143302 142690 141597 139418 142409 144353 142934 142930 142532
7405 142532 140634 139180 137022 138867 140619 142642 140751 140418 139394 137230 135652 133640 133400 138216 134966
7390 134966 133091 134041 137120 139035 141746 135010 133437 133496 136120 134452 134144 135770 132279 131022 131270 129960
7374 129960 127527 128424 134421 136271 134140 132935 131031 130268 131807 130909 129891 131824 133942 135659 132388
7359 132388 131504 134011 135680 134229 133329 133239 130822 131586 132863 131270 129197 131254 130834 130676 133401 132049
7343 132049 132468 131391 129818 127988 124317 122503 128049 133079 134415 135543 136330 134708 131109 128855 129484
7328 129484 130491 129022 123727 122787 125566 128051 127609 130406 128479 124876 122859 124817 129414 128668 126459
7313 126459 128009 127153 123522 122598 122575 124097 126536 126262 123416 123298 125124 124107 119252 119940 123080 122785
7297 122785 123410 123980 122033 118028 119767 124071 125401 124423 124145 128324 128891 125416 119802 119117 119456 118776
7281 118776 121073 122948 119534 120909 123802 127099 125629 122711 122681 123906 124414 122796 121655 120585 120898
7266 120898 120689 119892 116917 114713 114392 115673 114759 117154 120219 119043 119440 118896 116553 114859 116199 114278
7250 114278 110411 109682 110818 114236 114973 113490 112132 112852 115353 117725 116368 112098 110161 112561 113371
7235 113371 113732 113610 114511 113172 110927 110842 113062 112463 116615 116994 116253 118616 116465 118238 118679 118247 114940
7218 114940 114108 113440 111721 113142 113308 113928 116457 114128 109568 108981 109273 111153 112767 112880 108681 104986
7202 104986 106907 109271 110778 109734 111858 109497 110441 113018 115953 117078 112947 111728 109812 110028 114117
7187 114117 115966 115886 113139 106378 100472 101618 103612 104023 102885 103601 105662 102614 101706 100492 101290 101218
7171 101218 103843 106229 108340 106443 108467 108131 105427 104967 102877 101992 103721 106060 109716 108427 108341 104127
7155 104127 101087 100620 100343 100367 101347 104303 102209 99544 100628 102680 106200 110614 113991 113238 107537 105987
7139 105987 105793 104667 106464 104655 102501 99903 101283 99891 100432 103250 104054 100553 104058 107844 106672
7124 106672 103141 100499 103302 103300 103466 102082 100723 99150 99507 98492 100402 102187 99717 99272 99291 100979
7108 100979 101564 100252 97897 98769 101885 101225 98591 96561 97178 98047 93563 91614 93506 95386 92353 92905
7092 92905 95501 95995 96830 97678 96322 94745 98851 99180 99984 101483 102694 105799 104091 102013 98257 99218
7076 99218 102365 97471 98223 99662 96107 94197 92801 94879 97742 97346 94627 94960 94416 94089 95440 98141
7060 98141 99159 96743 93817 92140 89972 89755 87943 86040 85901 89802 93592 95687 95880 95584 93164 94293
7044 94293 96414 98220 100934 100666 99071 98399 99297 99375 100426 101694 98975 97298 97257 96391 99247 100810 98940
7027 98940 96692 95246 96177 93554 90403 92289 94452 94855 92064 90469 91629 94182 94208 88939 86823 91028
7011 91028 90249 91381 92688 91327 90626 94610 96610 91384 87969 91834 91470 91990 91026 88639 88372 86393
6995 86393 88076 89663 90285 90777 93142 96122 94266 93236 91982 88981 85113 84277 83195 84980 87769
6980 87769 89002 87142 85819 82663 85798 86717 89538 89913 90853 90078 87218 86929 86620 86592 88029 87830 85662
6963 85662 85746 84129 84651 82290 83408 82776 83918 83339 84315 84885 86177 85538 82134 78528 77658 79294 83431
6946 83431 86373 85989 82613 82522 82490 86174 84163 81000 81382 82949 83629 82200 81199 80701 82690 86415 87212
6929 87212 84072 82865 83700 82729 84381 85253 84599 84114 83192 80927 84228 85120 85377 84069 84500 82461 82759
6912 82759 85322 85971 82992 81255 84533 87789 87576 82267 81008 81465 82063 83871 84751 84569 83024 77007
6896 77007 74690 79200 80840 80090 81989 83335 82462 84200 86082 87987 88982 88428 85299 85191 83304 81576
6880 81576 80411 78790 78495 80638 81831 78136 77274 78021 78584 77775 79161 80636 78893 78365 79060 76945
6864 76945 77064 79490 82556 77821 76192 77790 78999 75760 74308 76078 78751 76283 76362 78078 76914
6849 76914 72467 73149 75883 79728 81466 81057 81331 81158 80185 75227 74348 74888 75450 78256 77730 74782 76362
6832 76362 77134 75502 78190 77435 74685 78399 77646 79365 76266 74572 73946 72025 72538 75089 76590 77467
6816 77467 75706 73629 75252 76374 78394 79773 82116 78782 76901 76417 72412 69922 68737 67109 67577
6801 67577 71505 74421 72274 77151 79250 77398 74230 72535 72135 74574 74472 71114 69848 72649 74221
6786 74221 73806 77546 81927 79128 73463 73614 75511 76050 78255 78088 74740 75658 77671 78662 76628 74784
6770 74784 73602 72092 70995 71062 70836 68895 69818 72672 74725 73892 71320 68844 69560 71446 71024 71000 71500
6753 71500 72222 69521 69411 73243 76488 76045 74175 73920 72371 72750 72389 70254 71878 72159 70967 71067 71880
6736 71880 69889 70631 68354 65715 62606 64605 66855 69997 68855 68421 68204 65229 66031 69803 69500 65110
6720 65110 63932 65017 64177 67879 70623 69502 69043 68830 66636 66444 66692 64689 65650 63674 65417 68376
6704 68376 63839 61795 58328 59151 64150 69390 70360 69317 68247 66482 65161 64800 66279 61548 59199
6689 59199 60994 63618 66396 66887 64628 62066 61651 63647 63256 63025 62039 60040 62794 62946 62545 62425 63969
6672 63969 63005 60810 62020 60703 60484 63232 64624 63916 62749 64072 60921 58086 62208 66935 63361
6657 63361 62011 64107 64726 63100 62792 62215 61946 61898 59932 60158 62188 61482 60513 59636 59882 60897 65420
6640 65420 64263 63017 66235 63345 62479 64000 66002 66482 66324 68273 63642 58120 58227 58987 60687 62455
6624 62455 62465 61452 58949 58776 61273 60193 58267 57372 60355 66206 64504 58126 60420 63307 65737 63021
6608 63021 61622 62360 62020 60668 59752 61816 64801 64353 61799 63160 63561 65539 64322 62898 63558 63920
6592 63920 63812 65041 65464 64233 62226 61385 60423 60923 58203 56087 57063 58573 58784 61697 64314 65813
6576 65813 64505 60900 56624 54862 59863 61302 61924 63898 64738 66137 66155 65059 64657 59186 56305 58987
6560 58987 58243 58866 61405 62381 60024 61672 62055 61156 60826 59595 57619 58058 57698 55774 53057 50885 53627
6543 53627 59759 63549 61675 56765 59139 60868 60386 58892 58597 59491 59699 61152 59616 58552 58548 56510
6527 56510 54457 55120 55086 54081 55421 54815 55057 53619 55733 56514 56318 51476 52085 55653 54434 56632 57751
6510 57751 53024 52706 54519 56218 58077 55440 53520 54591 55048 54979 56076 56158 57466 54114 50735 47375
6494 47375 52504 57515 59327 59636 58192 58478 58315 57764 57740 55761 54701 53168 51697 50539 53326 56251
6478 56251 55442 54231 54810 57434 55283 54453 57947 55916 52551 51368 50708 51655 49611 46622 50122 50640
6462 50640 50679 53305 52853 49966 48569 50982 54526 53708 49590 49012 48787 48765 49674 51180 51379 47693 50251
6445 50251 55502 56503 56832 53443 51522 51905 51829 50634 49436 48938 49164 49229 50420 51528 52118 53443 51210
6428 51210 48913 46967 49029 53504 57094 54900 49421 50350 51244 50281 52688 53182 55138 56322 53222 56091
6412 56091 56438 50248 48172 52260 54152 50998 44442 42968 44857 44843 42913 43381 43908 44351 46656 49106
6396 49106 51867 50929 50639 52177 55011 54162 50476 54184 55266 53723 53328 53244 52006 51288 52245 52354 50880
6379 50880 52720 53943 52626 53297 51105 48442 47482 48052 49237 49872 50426 50403 50398 49430 47584 46828 47449 51540
6361 51540 55114 53293 49909 49235 47710 46890 47901 46708 49368 49329 52427 52970 51500 52108 50778 46160
6345 46160 43464 42994 46650 46096 48435 50857 50287 49759 47801 45500 45976 48190 49996 47354 45188 43566
6329 43566 42094 44547 46362 47125 45029 47224 46043 42047 42266 41648 42542 44652 44850 43414 40011 42366
6313 42366 46141 48535 48897 47704 47932 52284 50247 48233 47183 42433 40536 41391 42982 43546 44817 45073
6297 45073 46191 45897 42944 42032 44302 47059 46145 44382 40885 44098 47749 45963 45001 44361 41948 44178
6281 44178 43440 43370 45104 44385 43917 44159 43595 44626 48797 48076 46624 45883 47003 48573 48817 46848 46359
6264 46359 50420 47165 46054 46478 44256 45134 49778 47527 45822 46852 48669 48745 46730 45791 47593 50322
6248 50322 49689 46587 44519 46184 41660 41095 41770 41044 42216 41832 41936 43278 42427 42504 42504 40661 40721 41111
6230 41111 40949 38161 39848 40886 38601 35208 33195 37326 40983 42472 41925 41226 39539 39864 40977 43018
6214 43018 39207 36247 39445 39950 41363 43808 44905 46537 48187 48456 48586 45155 42742 43453 43390 43988
6198 43988 46630 46711 45490 45146 45866 44697 43786 42641 41702 42459 42126 44803 46215 42379 38936 38556 40557
6181 40557 42723 45192 44774 45280 45801 42801 38201 38136 40809 44232 42868 41579 41044 42691 43722 47965
6165 47965 48707 48605 49166 47938 47316 43480 40719 38403 36800 41083 44723 42717 43895 44867 42301 39205
6149 39205 40549 42095 43255 43056 40920 39200 37879 38629 39105 36176 34805 36788 37270 38909 38640 34785
6133 34785 34052 33223 31463 34992 37145 37846 39413 38988 37622 38279 37807 41061 42004 37259 35804 38066
6117 38066 38884 36994 38932 40198 41521 41645 39178 37443 37284 37239 37874 34336 31525 33195 36498 40948
6101 40948 37221 38060 38930 40595 35915 36922 39663 38607 37059 35422 36369 36457 37163 37193 38925 40637 38864
6084 38864 36552 35923 36534 37693 37626 35633 30367 28168 32551 36963 35867 37295 38117 38556 38066 36320
6068 36320 38912 40778 39493 39821 40384 39601 38226 36858 39350 40219 39670 35133 36615 40793 42627 39920
6052 39920 37653 34968 35763 35862 33340 34347 33937 31756 32303 35338 32646 33645 32164 34074 36214 36300 36333
6035 36333 32780 33049 35828 38400 39713 36607 35383 36196 36400 34375 34341 36304 37655 34122 35321 37971
6019 37971 38139 37684 37704 37773 35282 34257 34245 32167 36712 36289 35202 35124 36234 33968 32678 30808 32158
6002 32158 32087 30338 31980 30906 34065 33870 33093 34639 36405 36857 33779 30089 26701 29785 30022 31858
5986 31858 34567 35669 36073 34162 30793 29603 30564 30764 30623 32623 33647 30178 32265 33926 32482 31810
5970 31810 32675 35239 38679 39021 35278 34465 34944 36119 36310 32928 32875 34230 31869 31870 37162 37366 34922
5953 34922 37870 37958 35489 34953 34056 33305 31166 30446 33890 35215 33901 30056 28775 30103 30768 31109 33545
5936 33545 33196 31380 29339 30852 32536 31455 27449 26652 26168 26555 29363 33081 31173 31344 30234 29947
5920 29947 32114 30601 29350 29358 30872 29684 29073 31419 31268 29929 29995 29993 28866 32932 33630 31340 28550
5903 28550 27135 26491 25679 21701 22884 28698 31442 35133 38951 36493 33704 33457 30674 29294 31862
5888 31862 30338 29301 29937 30674 31588 33573 33091 33382 34775 34380 31559 28614 33234 33778 31591 30388
5872 30388 30825 28218 25662 27221 25748 22443 22460 28307 29140 26204 24446 25141 25707 27128 30979 30828
5856 30828 25743 21247 25302 28946 29930 30537 32698 33022 29111 27247 27362 30419 28723 27185 28112 29189
5840 29189 29059 31625 31626 29910 29363 31434 29333 29851 26621 25642 26793 27291 28588 28352 28429 27638 29432 29692
5822 29692 29856 30712 33181 33249 33739 32693 34481 36071 35411 30790 30096 28298 27443 26847 28398 29478 30327
5805 30327 26699 21315 25256 27037 28197 27176 24499 26212 29290 30337 30576 29605 30775 33115 32006
5790 32006 27119 26340 27498 31345 33331 31166 31161 30844 28846 27515 28534 30241 33061 34681 36899 34480
5774 34480 33262 29282 28100 26222 27131 28622 32554 28852 28828 32153 32822 31664 30224 30581 29951 26380
5758 26380 24192 22780 21890 21977 23626 26274 31541 30344 24902 23601 24892 24007 24529 25334 27690 32832
5742 32832 33116 29444 28379 30466 30775 28003 26728 25367 26241 26689 25633 27748 28559 28657 27783 28609 30398
5725 30398 29900 28818 27686 29371 30428 31868 26322 23730 23059 22564 23152 22269 22678 25843 23130 23948
5709 23948 27754 28183 26479 27118 28689 23842 22680 26776 25216 22891 21216 19848 21776 22714 23218 22404
5693 22404 22334 23160 25679 27660 27791 26672 27361 26815 25073 30189 32439 30771 28709 26890 26378 27076 26524
5676 26524 25745 23053 20880 21723 25961 24648 23749 26348 27150 25783 24640 23686 25092 28614 29581 28317
5660 28317 25487 25160 27498 30540 29134 28827 30266 27864 30675 33224 30742 28308 27723 31095 32288
5645 32288 28619 25057 23160 21041 19180 16468 18731 21288 22225 23630 22355 20822 20993 21806 21587 19617
5629 19617 21717 22407 23875 26098 27326 26045 20973 17307 15925 18303 22398 24236 25083 24130 22807
5614 22807 23186 24668 25382 22883 22566 25293 25857 20335 19073 22297 24044 21455 16041 17250 18764 20899
5598 20899 18808 15287 14243 16366 19240 19751 20187 26798 26968 26693 24931 22907 23614 24711 26448 24740
5582 24740 20174 18579 17037 19521 22721 24653 24730 18764 14902 17533 21001 22126 20980 20225 17894
5567 17894 17113 20453 24247 26442 26279 25030 22067 18522 18873 19553 19288 16978 19876 23878 21939 19008
5551 19008 18502 21998 21199 22302 22874 22178 20952 23664 25194 23932 23342 22624 20240 16736 14786 16413
5535 16413 20072 19090 18827 21277 23126 20936 19265 18404 16767 19589 24317 24503 20120 18605 16117 16663
5519 16663 16612 19817 24272 25085 24900 23946 22143 19623 17097 20642 20472 18765 13858 14652 19291 19905 19180
5502 19180 19948 19865 19255 20080 23111 23718 21022 20587 21448 20505 21009 25446 27670 29472 28244 27071 25536
5485 25536 27595 28495 22093 19850 20817 22737 25536 23462 19744 19310 21142 19970 15878 16375 16366 18337
5469 18337 21267 23233 22871 19141 18295 20851 18760 19200 18541 17389 17337 18446 20043 18381 17757 19258
5453 19258 19258 21944 24502 22806 19734 19168 19798 18878 16300 17969 20767 22784 21213 19287 19123 19423 18686
5436 18686 19753 20746 20464 18567 15626 16294 16541 17002 19016 17799 18050 18558 18012 18285 17777 14768 13567
5419 13567 13063 13181 14941 15664 18656 18595 16970 18396 20062 18370 20656 20333 19586 19608 19919 22640 26042
5402 26042 25879 21039 21440 18718 16493 17987 17693 17168 19703 20998 20345 19445 18991 20105 18300 19159 16883
5385 16883 16213 17515 20308 20863 17698 16301 16849 17674 17559 18109 18079 16186 16586 19334 23252 22149 20936
5368 20936 20179 21819 20782 17020 15705 18328 18590 21387 22565 23948 23566 19252 19777 19067 15922 18221
5352 18221 18908 19004 19337 17180 14379 14962 17014 13275 11395 13576 15449 17355 17849 14541 13386 12765
5336 12765 11740 15624 19434 19971 17804 15717 15438 19383 20508 19420 19681 17016 15397 14341 17379
5321 17379 18189 15155 14214 15995 14322 14921 15561 15109 11604 9364 11432 13517 16376 19152 21055 19761
5305 19761 18286 17775 19496 19693 20593 20017 18158 17209 17148 17446 15047 14075 13864 12039 17456 20226 19691
5288 19691 19386 22040 23169 20872 18860 17803 16695 16439 17134 16665 14954 14509 14868 16518 18753 21659
5272 21659 20645 18621 18467 17656 15968 16229 18263 20523 19956 18334 16392 13830 10330 12347 16038 16799
5256 16799 15875 15119 14179 15863 18944 16617 15612 17443 23784 23725 19886 21126 19163 18656 14637 11269
5240 11269 10405 9182 11724 15406 17146 19094 20303 19038 17261 17656 15077 13033 12139 10726 8097
5225 8097 12623 15659 16209 16025 16335 18965 19177 18251 19586 17105 10728 9999 11902 13880 15572 17470
5209 17470 16031 16856 16050 13787 15061 16016 13074 10869 8107 10440 12326 13514 15093 18138 18369 19651
5193 19651 17286 15370 13178 14702 17647 16409 16747 18107 17385 15734 15679 17461 19827 21026 18922 17761
5177 17761 14997 12538 9245 10196 16298 16240 13649 14017 13084 10633 7513 8449 9959 13989 15963 16648
5161 16648 16775 14821 15192 19914 20644 13306 12153 11143 13652 14207 17214 20207 21000 20525 20055 15375
5145 15375 10328 12161 13867 13056 14260 16035 16403 11139 7593 13290 17131 16556 10531 7592 8089 9591
5129 9591 10686 12493 13381 13307 10054 12501 11107 9717 12485 11693 12741 17886 21014 18876 18808 14279
5113 14279 15492 16067 17602 18405 18298 15099 10030 8231 9560 12436 12784 10158 9022 9933 12804 10666
5097 10666 8472 6682 4884 3804 6088 9356 9639 9529 10965 11737 11860 11615 11281 10012 7576 8883
5081 8883 7754 8030 5700 8045 13594 15597 18981 18909 17553 13633 13161 13831 13828 12247 13198 12785 12997 14679
5063 14679 12502 11786 16001 20607 21664 19274 17780 15124 16217 17405 16254 17079 15735 13143 12182
5048 12182 11956 12325 10671 10324 10887 13054 16829 18341 16928 12943 13759 12137 11057 10697 6884 3829
5032 3829 5539 8101 13155 16251 14695 11686 9873 9623 8971 7441 8006 11658 12697 11837 12865 11330
5016 11330 10273 11440 8879 11280 15446 15557 13689 12767 11749 13152 13044 12365 14414 14214 11845 10334
5000 10334 8844 10864 10438 9678 8025 7931 10158 11479 10206 9355 13476 16169 15222 13674 11482 8769
4984 8769 6697 6490 8294 11344 13120 12515 11276 8921 9066 11630 13361 14714 16645 16225 12959 11306
4968 11306 10866 15566 18099 14025 11885 9503 9216 9976 11774 12109 9995 12091 13748 15195 12980 10573
4952 10573 11376 13532 14986 14523 13291 11536 8925 8035 12215 10443 12416 13691 14818 13106 13223 14846
4936 14846 15448 14396 13719 13412 14074 11848 13377 14641 11655 8875 8154 6633 8640 9104 10318 12305
4920 12305 10793 10325 8965 9182 8347 7054 6455 7070 6070 6178 9164 11317 10205 10649 9334 9702 12096
4903 12096 10563 9950 7879 6110 7368 8464 6247 7854 10674 9407 6041 4092 5858 6747 8423
4888 8423 8394 12031 11951 12347 13483 11269 12345 12370 10675 7787 7030 1865 2783 5851 6247 8648 11672
4871 11672 12301 11663 7394 6952 7250 9597 12878 8615 6590 9324 10104 10461 10034 10468 10676 10086 11611
4854 11611 10879 10368 12224 10880 8071 9650 10244 7399 7860 12674 13083 11935 11179 11053 8993 8669 7766
4837 7766 9618 7457 9298 13474 12006 12371 15953 17151 16386 12524 8359 5087 4216 5041 3319 5244
4821 5244 7038 9312 8664 7040 7955 10611 9161 4759 4164 4659 5133 7752 8044 8370 7205 6171 11601
4804 11601 13235 11917 11483 11640 10573 8422 7032 9260 12058 10519 6459 6626 8383 8704 7116 6462
4788 6462 7426 9708 6654 3911 4552 4485 5843 5339 4608 5375 7931 3875 2366 3043 6497 5708 4893
4771 4893 7260 7608 9071 8527 10832 12225 11582 8674 8237 7948 6865 4173 3907 5506 8100 8564 6968
4754 6968 5635 5327 6501 7308 11870 12631 10057 8085 10508 12166 9565 6309 5414 6014 7671 9486
4738 9486 10076 13650 14644 12797 11251 9976 8262 4591 3294 6907 8011 11289 13234 10460 10271 10201
4722 10201 8055 8044 9765 9780 6009 3495 3004 6821 6295 7422 7982 6132 6944 6630 8091 7898 6704
4705 6704 6316 6256 7796 7725 7047 4724 2601 3122 2419 1785 1371 3558 5664 8386 10577 10492 9813 12674
4687 12674 15261 11921 7315 4101 5604 9951 7812 9664 6624 5472 6614 6374 8344 7665 7295
4672 7295 5726 3726 5807 4902 8094 8688 9235 8142 6594 3625 4149 4325 4459 4686 6662 7349 5514
4655 5514 4027 4101 5343 4707 6895 9946 7514 5693 8210 10612 8316 8455 9903 9491 13350 11793
4639 11793 8808 4115 1770 1286 2770 2223 3945 4027 5975 6315 4391 -1603 -2498 2356 3547 5142
4623 5142 8515 12943 13379 8274 5927 5682 4877 6774 8292 7045 6233 7223 8930 9605 10544 12979 11533
4606 11533 8670 6535 4873 4266 6415 11211 9650 7745 5194 7113 10940 11880 11494 8936 6311
4591 6311 3365 3529 5475 6569 6339 6725 4336 4532 5544 4884 4561 7301 13443 11456 9435 8066
4575 8066 7610 9996 8907 9056 11947 12851 10938 10471 7974 6227 7271 5110 4643 3229 1888 2517
4559 2517 1312 1948 4520 7003 6728 5335 6849 7742 6616 6174 5648 6648 7435 6820 4712 5104 9600
4542 9600 12912 11251 7662 6368 4871 3112 1767 3351 5413 10019 10441 4141 -1954 -3204 -5136
4527 -5136 -531 5179 8156 10447 10568 7186 7260 9459 8096 7318 5443 7306 5033 6513 7121 7750
4511 7750 9522 8563 6902 5533 6090 8026 8946 7399 5070 1498 944 1935 2394 2399 1600 235 775 3077
4493 3077 4144 5792 7742 6182 4293 6429 8599 10696 9581 10386 10354 9201 6747 5993 7261 5381
4477 5381 3916 7291 10153 12290 12177 8492 5043 8037 7306 5473 5920 4983 5720 5593 5491 3599 2249
4460 2249 2201 2241 3231 2520 2202 4718 5118 2787 4087 3461 -297 -1339 -1512 -2790 -2404 2983 2668 3608
4442 3608 6286 949 -1898 -43 3164 7354 5681 3971 4989 4870 4410 3055 2811 3386 5575 3608
4426 3608 4066 3534 2942 3010 5843 7344 6894 2688 2400 3244 2346 -40 188 -880 409 4662 5635 6424
4408 6424 4605 4194 2942 3300 5667 3283 2036 1889 2777 2741 4883 7365 6255 4311 6661 7782
4392 7782 4816 4817 6373 1889 1113 523 -556 -3067 -3585 -3279 -1582 3202 3692 262 1559 6218 8324
4375 8324 7463 7856 5505 4500 6710 6104 4267 2831 850 2077 861 2766 2370 1499 2798 1901
4359 1901 1809 1553 1962 4454 4328 576 -847 -1039 -3 1222 1094 -226 -1573 -1168 1708 1817 2859
4342 2859 3701 2480 4058 3315 -2364 -4615 -7702 -5582 -1185 2574 2983 -131 2172 1785 -681 2606
4326 2606 1229 1715 5100 5556 4928 6266 6474 3948 4944 5427 3734 4855 7790 8125 5870 5489 3494
4309 3494 2221 -581 -2078 -326 4510 8079 4855 3146 4558 4698 6202 7121 7295 7165 8089 7307
4293 7307 1920 2774 2009 572 2958 741 2405 6842 6156 3401 3955 5140 4467 3017 3015 4114 4169
4276 4169 6104 4097 4229 3548 3378 3448 2018 2003 1512 -845 -45 924 556 547 1187 4 3278 3694 3885
4257 3885 3987 5346 5529 2074 971 3984 8697 6064 5662 4594 3188 5781 6479 6022 2570 -157
4241 -157 -1442 -2858 -2430 2359 1952 1072 -2126 -2324 -1080 -1528 335 3124 -267 -1495 -379 2932
4225 2932 1346 -386 1671 640 -573 -1791 788 4048 2293 -2179 -3758 -2777 -3 2925 5056
4210 5056 3353 3202 2906 1464 2019 3047 2979 3102 1469 5 -4513 -6288 -3601 -867 -1891 -681
4194 -681 1634 3943 1630 -780 257 -1396 -1100 869 4252 2713 5093 6863 5131 1511 1211 501
4178 501 2567 4174 3735 5521 8833 5997 -172 78 1101 74 4370 7063 8320 5367 3704 2358
4162 2358 1712 678 942 3417 4703 2144 1289 3632 619 -1173 1910 2305 2342 3710 3913 2512 3224
4145 3224 4309 6955 3416 3612 4015 6233 3715 -951 -2187 -3220 -2822 -3855 -5394 -1707 2338 3410
4129 3410 1683 259 1605 2 -1100 2787 7097 6107 5351 5318 2558 487 926 1942 2987 5598
4113 5598 7075 8629 9979 5367 5634 6286 4175 2027 -739 478 2496 3151 4702 7008 5515 2498
4097 2498 1815 3617 5111 9558 9983 9520 2953 -2520 -5219 -5183 -2725 -1072 -2039 -2215 -933 -30 3251
4080 3251 4129 4845 3600 2951 365 -4901 -3630 -3386 -1851 -2755 -4326 -272 537 1655 2218 2204 1836
4063 1836 2100 1693 1733 2879 1835 770 -94 153 -1590 138 1698 749 727 1252 2019 3771 4345 1324
4045 1324 1539 1829 411 -1427 -1730 -129 1451 5472 8769 8528 7166 8367 7416 4120 3060 -491
4029 -491 -2903 44 -1660 -2343 -4101 -1142 -348 961 1340 128 -927 1872 667 1538 1846 567
4013 567 -91 -2388 -1761 -320 938 81 -1853 -596 -305 -578 5045 9321 6446 1901 -3855 -3180 1870
3996 1870 4591 5525 6221 4349 2711 1945 2721 -4255 -6801 -4964 1663 3781 2848 6073 5997 1950 1793
3979 1793 1600 -1054 1427 2215 2241 930 -1227 -3863 -5716 -3136 3909 4801 -108 -250 307 -1161 1911
3962 1911 2307 1142 165 2424 5788 4538 2199 2200 -1439 -1310 -1193 783 2898 2648 5194 4392 838
3945 838 -1164 -3281 -1764 2542 2409 1576 1147 1482 2061 1650 5680 4467 -1805 -5065 -2441 -1341 -251
3928 -251 1041 1597 3708 6279 6184 1350 -2506 -5134 -6743 -5368 -6317 -5924 -3933 -2006 -1589 606 3602
3911 3602 3806 1931 671 -515 -2278 -1350 2306 1344 -33 4215 3916 797 -1220 1244 4477 4989
3895 4989 1895 1287 -1865 -5323 -5855 -5960 -6747 -4165 -350 -139 -1814 -3291 -5999 -4479 -3333 -3895
3879 -3895 -3155 -3968 -1847 -983 -1953 -1701 -1658 149 -193 -3509 -5283 -2897 3736 6791 8620 6305 2724
3862 2724 2568 1438 1459 3032 1566 -3667 -2418 3224 2872 1189 -425 -752 -41 -2240 -1436 -209 -111
3845 -111 3854 963 -2322 -1845 -2106 -2289 -2409 -1011 -1693 -670 1025 3993 6031 4407 1295 -2765
3829 -2765 -3718 -2856 -3264 -1272 -681 -2545 -637 4942 2760 -2635 -802 3071 1487 237 584 -2501
3813 -2501 -3616 -3968 -2897 347 -2034 -2911 -2761 -2988 -2435 -3584 -1415 -2373 -3000 -1595 -457 -1530 -1706
3796 -1706 -512 -1143 -674 855 2473 1507 -1558 -1778 408 1481 -328 -1224 -2652 -2391 1189 611 -242
3779 -242 -1551 -1794 -4130 -6811 -4694 -3036 -3084 -4772 -2924 -620 -95 -1381 -1855 472 2427 1365
3763 1365 -501 637 1464 -703 -207 1413 -354 -3082 -4330 -1132 2512 3586 -1029 -6787 -5930 -3716
3747 -3716 -2717 -3828 755 102 -2560 -541 5172 5681 4625 7925 8836 2877 -1202 -2806 -3006 -4106
3731 -4106 -6417 -5804 -4399 -4026 -114 6289 4789 4385 5107 5597 5022 4644 1152 -793 276 1275 580
3714 580 1189 688 186 137 2830 80 -1770 198 -976 -3800 -430 499 1278 3301 2745 979 -2844
3697 -2844 -4585 -2575 -2144 -2962 274 2604 272 -1376 -1800 -2760 -4533 -3981 -2722 -2056 -3337 -2221
3681 -2221 -1874 -4263 -2827 1679 1103 -119 -54 -394 -1697 -769 504 575 1122 1743 2372 3782 2812 2434
3663 2434 983 148 1555 957 -2839 -3743 -3579 -1021 2016 3414 2784 1969 1609 4921 4671 3775 5038
3646 5038 3001 1836 350 4492 5681 3452 314 2225 2808 2354 1386 1515 -2627 -4576 -2397 -2331
3630 -2331 763 3612 7270 7893 5747 3769 377 -871 -2509 -829 2007 3296 5147 5274 4036
3615 4036 580 -2459 -5350 -5507 -7408 -3098 880 1723 -1488 -6097 -5188 -504 -436 11 3368 4932
3599 4932 1549 -2548 -804 566 1262 4626 6513 8476 6576 4075 2781 864 2274 1304 438 2442
3583 2442 1365 3586 2896 -159 517 3783 4790 5690 5005 4114 2445 2396 3592 2768 3139 2756 -3042
3566 -3042 -3956 -2442 -432 816 306 1868 4419 3787 1014 -3403 -3669 -2624 -553 -1459 -6303 -6411
3550 -6411 -5168 -6139 -3345 -688 -398 -1095 1880 231 2909 4032 3211 598 311 3335 2283 -1558
3534 -1558 -1585 252 2436 2893 2884 517 -355 -4273 -6490 -8121 -6956 -3967 -860 2155 2568 -674 -10
3517 -10 -390 -1038 2254 1098 1876 4647 6957 6327 311 -3016 -895 979 2131 2894 736 927 586
3500 586 -887 -4938 -6646 -4674 -3263 -3838 -3881 -5897 -2017 1018 -356 -2151 -3490 -3357 -2746 722
3484 722 2652 441 -789 -2015 -3497 -2691 -4495 -4234 -2413 -3536 -4030 -3741 -2749 -2423 -4111 -6720 -9875
3467 -9875 -9140 -7194 -4538 -2394 -2598 -473 -1440 -2150 -5182 -4970 -6629 -5992 -5147 -5259 -5279 -4058 -2264
3450 -2264 -3972 -7125 -5487 -3677 -758 -2720 -4330 -6183 -6806 -2517 -2894 -3272 -340 -1581 -3712 -5504
3434 -5504 -6908 -4959 -2323 286 -1507 -4068 -5098 -6006 -4454 -743 -591 -1436 -2752 -7490 -11437 -11437
3418 -11437 -7273 -2259 -1292 -4471 -6580 -3590 -1887 -1591 -4847 -9725 -9082 -5408 -4394 -2932 -2840 -4701
3402 -4701 -5514 -4860 -5963 -2096 -469 -1683 -574 -169 -653 997 2156 1067 -709 -4087 -5089 -2915
3386 -2915 -1429 -602 420 1147 2066 -1394 -3855 -436 -2865 -287 285 -1508 -623 -2869 -4989 -5605
3370 -5605 -4098 -3063 -4042 -6024 -8824 -10512 -9332 -8807 -8366 -5339 -2816 1654 4154 1869 4272 4826
3354 4826 2218 -2573 1725 3192 -381 -5698 -5313 -1926 352 164 -1914 -4111 -4658 -1647 -71 2425
3338 2425 2978 928 -2868 -5829 -7251 -6337 -1028 -1640 -2744 -3832 -4085 -2405 -1525 -3831 -4471 -2534
3322 -2534 -863 -376 342 1908 2853 2729 3486 2960 1430 -1302 -3199 -2457 -3626 -3812 -6570 -5662 -1785
3305 -1785 -2575 -5834 -2395 1816 2856 991 -1443 -1580 849 -1094 -3598 -8144 -9453 -9265 -6219 -3811
3289 -3811 -2653 -3513 -874 -947 69 -1162 -921 -156 -3119 -5620 -1621 1478 -70 -3096 -9595 -9229
3273 -9229 -8362 -8212 -5688 515 5226 5039 2995 1152 -1062 -2467 -2834 -233 745 -764 -1530 -2377 -4190
3256 -4190 -4419 -3181 -431 -1598 -1550 -859 -1458 -1591 -1991 11 675 -3801 -5374 -3368 -5338 -5372 -4226
3239 -4226 -4218 -2100 -4161 -2969 -2887 -3149 -766 318 42 1087 -1075 -3930 -1295 -2018 -2197 -3220 -5414
3222 -5414 -6381 -3796 -2089 -869 548 -1010 -1609 -5172 -3332 -1278 -1554 357 3991 4781 2900 128
3206 128 2278 -633 -1458 -1274 -2078 -8278 -8979 -5879 -3777 191 1478 -525 -1691 -4110 -3308 -4550
3190 -4550 -3579 -787 -2324 -6658 -9556 -8345 -4721 -3106 -1381 -2172 -292 896 -955 -2515 -4260
3175 -4260 -6205 -6975 -2998 36 -2633 -3965 -800 -840 1892 2793 -443 -1801 -3109 -2082 -3631 -5239
3159 -5239 -6805 -3218 -2866 -823 771 977 2648 -1707 -5305 -2992 -4709 -8464 -6355 -5964 -9420 -7784
3143 -7784 -5441 -6482 -9588 -9086 -4187 -3434 -4140 -3433 -493 -1121 564 176 926 -419 -1585 -2011 -3077
3126 -3077 251 -376 -2032 -2017 -2786 -2882 -845 -5684 -7743 -7045 -6615 -7951 -8944 -9058 -7326 -6718 -4149 -1701
3108 -1701 -2032 -386 -2439 474 1467 908 3506 551 -762 -664 -2464 -2732 -4101 -5361 -6440 -6545 -3019
3091 -3019 -17 -1854 -7377 -8812 -8591 -8824 -8558 -10105 -7539 -3779 -3299 -3866 -5778 -7488 -5514 -3950
3075 -3950 -4775 -4012 -4905 -732 -1349 1291 1960 -3375 -3516 -488 -246 -3753 -1836 -924 -3195 -4611 -2600
3058 -2600 -1411 -283 819 2250 580 -343 800 4313 1330 -960 -888 767 -318 -3121 -4976 -5457
3042 -5457 -2292 -466 -2015 1960 3787 1583 3046 2020 1625 -2012 -4934 -6597 -4987 -243 -2194
3027 -2194 -3457 -3812 -6708 -5050 -3296 -3992 -5125 -5972 -5673 -8086 -9190 -7636 -3890 -765 -2467 -3502
3011 -3502 -3685 -5206 -4934 -5349 -5111 -3834 -1908 -7218 -9467 -8525 -4619 -1711 -1435 -2570 -2435 -3712 -2971
2994 -2971 614 1297 1694 1759 1775 1051 3127 4405 2369 -2186 -2836 -4677 -4345 -886 -2739 -7782 -7116
2977 -7116 -4091 -2852 236 505 -1752 -2359 -4005 -2684 1598 2292 -685 -2123 -6157 -4727 -2618 -2511
2961 -2511 -4042 -3169 -5544 -5385 -5594 -7399 -6231 -3273 -2312 -2830 -2203 -260 -82 -3118 -5012 -5279 -2749
2944 -2749 -457 -38 -2673 -1784 -2781 -3239 -3424 -5540 -2790 1114 1193 458 -1677 -3044 -2583 -1184 -5095
2927 -5095 -4652 -6078 -8784 -8552 -7134 -5916 -7652 -6408 -2760 -1720 -879 1319 1454 -2593 -3772 -5043
2911 -5043 -6751 -4992 -2926 -1424 2407 2186 1576 1774 522 -3139 -2910 958 1116 819 158 326 877
2894 877 178 -1215 -806 1276 -609 -4356 -5344 -7074 -9268 -6155 -6735 -7648 -6067 -4278 -6258 -9661
2878 -9661 -11789 -11828 -7385 -2987 -209 -1550 -2954 -3968 -3606 -1914 1548 -2240 -7989 -8035 -4951 -2436
2862 -2436 -2686 -3787 -1510 -249 0 146 -2237 -4889 -5654 -1854 -766 -3333 -3250 -5178 -7716 -6577
2846 -6577 -1625 -2053 -2626 -2112 -3904 -6250 -4235 -5333 -7952 -7062 -7692 -8212 -4394 -3255 -2654 -2881 -3787
2829 -3787 -7737 -8831 -9030 -6409 -3446 -1359 843 2661 1288 -2925 -3424 -1559 -2537 -2146 -3589 -5165
2813 -5165 -4837 -1366 3894 -866 -6700 -5018 -2058 -2225 -1288 -576 -465 1462 841 -85 -367 -2950 -3774
2796 -3774 -4796 -3825 -3769 -4952 -7121 -10213 -9667 -6033 -4030 -2151 -875 -209 1120 1000 -2362 -2145 -2821
2779 -2821 -382 1255 -2932 -3617 -4858 -7298 -5906 -1142 687 -450 756 -1026 -5494 -6970 -4456
2764 -4456 -2491 -1560 -1857 1633 -89 -678 -2172 -5844 -3478 -3776 -7666 -8003 -6730 -2128 -989 -125
2748 -125 -104 642 3226 3990 2659 3874 786 -4096 -8536 -8394 -3115 -2638 -6032 -7425 -7278 -5861 -5135
2731 -5135 -6358 -6795 -4990 -6162 -6161 -2160 455 2004 1788 998 3360 3420 1542 -2481 -4357 -3175 -2772
2714 -2772 -5727 -9378 -6343 -2019 -326 -564 -3795 -8813 -11447 -9416 -4679 -1803 -1133 -891 -1928 -972
2698 -972 -2499 -3838 -3412 -3378 -2089 -1765 -2573 -2825 -4279 -4778 -827 1296 1760 -1158 -1449 2450 496
2681 496 -2936 -4951 -5747 -5589 -5248 -5234 -3971 -4856 -4494 -1706 -1188 -396 -2786 -3070 -1272 -123 1560 4193
2663 4193 2079 180 256 1635 -1184 -5125 -2215 -2811 -4271 -6526 -4265 -4057 -3021 -3875 -7208 -9799
2647 -9799 -8001 -7281 -8155 -6234 -3608 -2587 -3060 -1011 -694 -932 -1307 -842 -1914 -2919 -3743 -5101 -6056
2630 -6056 -5809 -5396 -2602 -2625 -5171 -4332 -5088 -5023 -3543 -4663 -2540 -1649 -5833 -7542 -3523 -3723 -1913
2613 -1913 -3602 -209 850 -2069 1214 2384 -1298 -3943 -5471 -7251 -9182 -7132 -6170 -4241 -3173
2598 -3173 -5296 -7183 -2968 -2666 -4521 -3253 -129 -1249 -2699 -2441 -4212 -6345 -6247 -5473 -4715 -1011
2582 -1011 842 -2401 -4129 -2683 -3346 -1777 -964 -2102 -915 -1917 -3028 -5114 -5260 -2186 -1414 1102
2566 1102 2179 -1159 -2715 -3832 -5078 -7276 -7592 -6501 -4725 -6121 -6552 -7490 -7505 -5355 -2485 -2963
2550 -2963 -5540 -4498 -5650 -7808 -7677 -2920 -786 3837 2231 -1954 -5697 -8403 -8664 -5059 -1428
2535 -1428 -341 -141 -988 -1326 -1678 -1570 709 2737 1522 -1605 -5505 -6762 -5344 -5019 -5361 -4925 -843
2518 -843 2047 -3484 -6928 -8879 -7301 -6347 -1311 -1727 -2671 -388 3140 4066 1080 -508 -6407 -9748
2502 -9748 -4535 -1449 -1164 -1422 -2085 -3458 -5003 -5522 -6807 -6757 -4830 -5407 -6593 -7364 -6920 -5368 -4202
2485 -4202 -2907 -5116 -6038 -3261 -2137 -4356 -7137 -7429 -5303 -3863 -614 1664 3313 577 -1458
2470 -1458 -3315 -4238 -4389 -5145 -5820 -6210 -6687 -6958 -7643 -4100 -2074 -4413 -5265 -3006 -3025 -2904 -3480 -4229
2452 -4229 -5101 -4526 -5776 -4151 -4185 -5596 -3824 -2465 -697 -650 -4006 -5223 -1787 639 2301 925
2436 925 2121 607 -533 -3666 -3238 -1946 -2398 -3547 -3272 -5230 -6037 -6263 -5392 -6053 -4726 -3140 -1351
2419 -1351 2974 3928 3288 541 -3611 -6627 -9693 -6320 -2771 -5407 -7805 -7021 -5092 -2341 -1877 -2841
2403 -2841 -1422 -1489 -3833 -5059 -5461 -5750 -6680 -6416 -1632 -2557 -4953 -5851 -3172 -1542 -2476 -4595 -4556 -7409
2385 -7409 -5403 -2878 340 -1340 -2749 -62 354 -193 -1227 -4355 -4030 -3059 -1503 -10 -1523 -4820
2369 -4820 -7913 -8168 -6837 -3074 -3317 -4544 -5516 -7901 -4493 -2070 -3410 -4420 -2997 -2447 -1509 -2778
2353 -2778 -1873 -1986 -375 -1226 -2217 -3376 -5111 -8984 -10681 -10782 -8427 -6328 -8182 -7006 -6736 -8648
2337 -8648 -5636 -2798 164 -442 -2893 -4414 -3373 -6487 -3426 -4570 -4195 -6572 -6517 -4656 -4843 -4910 -7129
2320 -7129 -9246 -7237 -6536 -4724 -5636 -7221 -8627 -6857 -4748 -3847 -2569 -784 -671 -513 -1869 -2028
2304 -2028 -5753 -6233 -5990 -3454 735 563 -1884 -2332 -933 1702 1737 -2199 -5784 -7638 -7541 -5236 -1847
2287 -1847 -1633 -2937 -6301 -3778 2196 3049 1052 -49 -32 177 -176 199 -207 -1475 -3552 -3407 -1402
2270 -1402 471 983 3234 2307 1183 -562 -3582 -838 -1186 -2838 -3546 -4848 -8488 -6626 -5422 -4217
2254 -4217 -2732 -784 -1569 -3155 -5073 -3659 -1832 -111 -9 -2171 -5480 -8562 -4925 -3035 -3651 -1885
2238 -1885 -6056 -5460 -6054 -4518 -2150 -1090 -4254 -5485 -5011 -4961 -2202 -5626 -10759 -8043 -7327 -6455 -2918
2221 -2918 -930 -167 -1492 -4084 -7112 -7020 -4913 -5629 -4607 -8624 -10374 -8645 -5373 -4284 -4508 -5578
2205 -5578 -7419 -7920 -5606 -4291 -2783 -5538 -9017 -6976 -4101 -3277 -4526 -3610 1394 2300 3810 1124
2189 1124 -817 -688 -1772 -3128 -2800 -5583 -3956 -2310 -1795 -5107 -5747 750 311 -2153 -3703 -3345
2173 -3345 -3982 -4761 -1613 4177 2940 -2635 -3952 -3372 -3658 -1696 -2442 -2905 -1661 -6309 -8907 -7856
2157 -7856 -6888 -7940 -7600 -6083 568 3726 4653 3333 37 -1572 -2546 -2878 -4184 -1775 742 3488
2141 3488 2258 2894 -383 -1046 -3686 -3284 -2845 2009 2474 960 -382 -2434 -4528 -4333 -5211 -5245 -4988
2124 -4988 -2443 19 -2541 -6841 -6497 -5478 -4046 -2768 -1685 -112 2332 -2169 -3201 -950 -4343
2109 -4343 -6947 -5934 -6570 -6462 -6996 -5907 -328 -413 -3645 -5213 -4692 -3437 -849 1634 -3566 -7373
2093 -7373 -5995 -4816 -5328 -5615 -5062 -5585 -4317 -2231 -4434 -8576 -6562 -4902 -5644 -3850 -2242 -2115
2077 -2115 -2660 -3354 -1389 1198 4217 4260 -361 -1499 177 -1512 -2522 186 430 -1264 -3820 -960
2061 -960 1908 760 -1425 -3693 -4334 -2806 1417 1845 629 -4490 -3617 -7795 -6818 -2421 -39 -2051
2045 -2051 -350 2073 842 1166 -618 107 291 454 -1196 -466 926 -1045 -955 -211 -271 -2241 -1522 -405
2027 -405 -2047 -3852 -4671 -3548 -4296 -1598 425 4042 4418 3541 417 -242 -2734 -1829 -2914 -3563 -2147
2010 -2147 2286 5334 2972 -1858 -9039 -5662 6577 7310 5423 4066 2003 -2248 -3835 -2643 -1600
1995 -1600 -1546 -1586 204 2563 -1476 -331 -934 -5663 -7723 -7937 -4177 -2062 -537 1664 -252 -1052 -35
1978 -35 447 -442 -2259 -3130 -2388 -2486 -4444 -1649 -442 5078 6627 3010 1072 -335 -2554 -3919 -1398
1961 -1398 -24 1027 3073 439 -1688 323 1766 1011 917 3429 645 -142 -650 -1984 -550 3226
1945 3226 4376 1111 -950 -1741 -6860 -9962 -8895 -6753 -6260 -3713 -2470 -1725 -6030 -8804 -5290 -1884
1929 -1884 -693 -3118 -4755 -5102 -2856 -925 424 855 -600 -1565 366 933 -2137 -4858 -10489 -8428
1913 -8428 -6007 -6286 -4710 -2763 -4849 -3937 -699 2930 1757 -1863 -3272 1479 2290 1890 268 -1980
1897 -1980 -3433 -3742 -2135 -425 -990 -2600 -5885 -7724 -3310 -710 1233 -434 -335 -2183 -6421 -4756
1881 -4756 19 1167 -1835 -5522 -1614 282 -341 -1044 1162 -782 -3754 -3535 -5439 -5039 1883 5857
1865 5857 4946 4562 6450 7817 1751 -3561 -5427 -6119 -5026 -2752 -3078 -410 2214 -1858 -3990 -587
1849 -587 3364 5109 -537 -1826 -4046 -5636 -4481 -5580 -6537 -4381 -2872 -3612 -2127 -3121 -1404 1005
1833 1005 3070 686 -2119 -768 -786 -1578 -891 286 544 41 -298 1943 2372 940 -4478 -6918 -4662
1816 -4662 -1972 -6386 -6173 -3808 -3282 -2842 -2866 547 2748 1280 -1535 300 -593 -3303 -2284 -4865
1800 -4865 -7179 -6514 -4242 -1551 72 364 272 1149 2175 616 -461 -454 2775 3047 5471 6361 2611
1783 2611 -835 -239 -803 534 2168 -1912 -1023 407 -342 -3530 -1617 1518 535 1073 2828 3298 2350
1766 2350 291 -149 -1310 -3720 -4260 -4639 -4291 -3204 1162 3466 2400 -181 -3612 -5071 -5012 -2745
1750 -2745 -792 3898 6314 6642 6422 4860 3367 974 170 1574 1356 -974 764 848 1318 -2086 -1371
1733 -1371 -2840 -1233 -161 -1880 -1515 -4082 -3137 224 2412 2158 2289 2098 139 74 901 2080 687
1716 687 2710 5583 4409 -42 -1320 365 1572 2338 1640 422 887 978 3952 7037 5836 5676 5196
1699 5196 4445 -599 20 823 3354 2142 1769 -756 -937 -1400 -3717 -2786 588 890 -959 -503 -618
1682 -618 2218 3378 4255 3240 545 713 383 -94 806 2608 4970 5926 4541 4433 2374 -782 -452
1665 -452 1844 1999 2469 1514 -40 415 3288 3516 1804 3653 4427 3702 5661 8176 7512 3818 -117
1648 -117 -395 2632 2039 -1042 -3209 -2622 -4086 -2203 -649 -808 -5525 -4355 1788 1434 -5977 -4884
1632 -4884 -1356 -1669 -3818 -7146 -7523 -5557 -3227 -3591 -2516 -1296 -2937 -1736 -125 -581 -1822 571
1616 571 6445 7858 6972 3090 1417 192 -2711 -2086 380 275 -705 -1751 -2548 159 2564 94
1600 94 604 1561 4165 4296 749 913 252 759 967 -1118 170 2424 1740 -1356 -680 -473 -2177 -3026
1582 -3026 -2689 -1245 -1652 -3562 -1075 1355 2710 2649 -1064 -2677 -5767 -6075 -3561 -2594 -6270 -8840
1566 -8840 -7641 -3205 -348 -888 -2653 683 -623 286 2085 4875 4167 4350 4368 373 -2623 1024
1550 1024 -127 -1571 -964 -1656 -464 729 3654 7972 7123 5190 3576 2774 4634 940 602 3167
1534 3167 2432 2568 3947 3804 1007 -695 4116 2016 -1198 571 -795 -1539 -758 3689 4703 3579
1518 3579 1091 -560 -2397 -745 335 -290 1330 4673 5063 3465 1125 1117 -684 -2647 -2818 -6082
1502 -6082 -4411 -2415 -2581 -2174 -1687 320 622 314 -79 2338 1778 4312 5081 2547 484 828 1406
1485 1406 782 554 2901 283 -3415 -1660 420 2397 4549 4532 1867 -4755 -4089 211 300 -2160 -2076
1468 -2076 1300 3234 3547 3845 1120 -2132 -2332 -1861 1874 1975 -826 -1037 -1193 -2614 -3271 -2804 -4752
1451 -4752 -303 -1887 -4568 -2285 -983 -1943 2520 5781 6102 6097 5632 5420 2428 1885 1802 1794 -1303 -1057
1433 -1057 -3229 -4131 -4845 -2937 -3782 510 2083 -854 -1632 -1418 -692 -2062 -1255 -1501 -1864 -2730 -502
1416 -502 2415 2262 1874 3326 -295 -2018 -2163 -1076 1987 3356 860 -1039 -2125 1799 4407 1518
1400 1518 -399 -1627 -1356 -177 -2715 -3441 -3575 -4768 -5148 -5710 -4118 -3391 -558 1606 1730 3218 3393
1383 3393 2869 3115 4828 3580 1011 -2382 2514 2291 1374 1373 7127 7484 6393 3886 1129 1584 -225
1366 -225 606 3420 2766 3523 6081 7299 4849 1426 -1639 -2402 793 -8 -189 -2141 -1711 1424 312
1349 312 2039 3180 5237 4381 304 1784 2934 3917 5781 9637 7492 5079 2224 -341 1291 1424
1333 1424 3475 3602 4681 3946 2968 1432 2 -3304 -3389 -5115 -6601 -3938 -516 2933 4309 7594
1317 7594 6422 4298 4744 6668 6975 5894 1118 -534 -1118 -1773 518 1271 3056 2741 6627 6615 1005
1300 1005 -3344 -2267 68 96 1411 2314 2161 3841 2203 510 928 3862 5654 6179 3400 1008
1284 1008 -1600 1095 4391 6178 7628 7816 8451 4424 1675 -194 -638 -1545 -383 1552 3815 773
1268 773 -1033 181 2861 7275 7607 3886 2588 3596 5486 9623 9543 10046 13477 13461 8550 5317 6177
1251 6177 5035 4806 2972 6435 6802 4228 1786 1446 1909 4931 5540 4866 6501 4562 789 2486
1235 2486 6017 4245 -311 -2358 1511 4304 2149 2097 4269 4054 3206 3139 2503 3631 6631 6795 6680
1218 6680 4315 3222 3683 3733 5805 5672 4263 882 4515 8293 7196 2564 4314 4624 6102 5172
1202 5172 3556 5141 4715 5761 5401 1700 1 -193 333 771 -847 -338 1719 1300 2266 2470 1177
1185 1177 1957 2405 4119 5852 5249 6869 6053 6813 8603 6512 4393 5762 4378 653 3309 4196
1169 4196 3007 3654 2305 1609 1494 676 3063 3366 2372 5355 7370 4434 2762 3012 246 -1048 2667
1152 2667 4660 2168 1754 3477 1529 590 -859 -3797 -5587 -3336 -695 418 249 -335 709 1995
1136 1995 1710 -2243 -1489 848 4680 6740 8129 5756 369 1813 3201 7627 9712 5434 4054
1121 4054 4711 3169 2657 5506 7061 3194 1228 2721 7451 9909 10017 10464 8751 6874 4866 7454
1105 7454 7702 7385 6310 8542 5482 4627 3501 4048 2961 1151 1521 3778 4469 2081 835 2061
1089 2061 921 -61 -197 296 2601 3181 3399 5586 5845 7903 9090 6525 6080 4950 3638 3845 2385
1072 2385 1576 1908 2240 2783 2412 4144 4545 5833 5657 89 1502 6478 7050 7281 9820 11812 10121
1055 10121 7128 2637 2233 1440 -244 935 89 -1222 1141 459 -1861 -14 -1001 2120 197 567
1039 567 3252 1545 865 -1553 -1574 -194 2501 5144 5312 5038 4720 5488 5169 2161 3284 5869 10085
1022 10085 11924 10335 8860 6941 6028 5057 7662 10986 9263 8692 7847 3908 1476 3154 257 -14
1006 -14 2961 2415 -2640 -1327 3968 8000 4635 1042 152 1985 1220 -89 4200 8631 8955 5725
990 5725 814 2735 6320 6517 8261 8406 5559 3591 3940 6916 5943 672 1045 3690 4285 2829 3016
973 3016 3540 4514 4957 3354 2287 3026 4402 7524 10861 12347 13672 11670 12097 7945 3399 2434 2566
956 2566 4660 4978 686 -281 279 -518 1390 3330 3123 1756 628 1936 317 1731 2418 3728 5461
939 5461 6219 6549 5908 5752 2037 514 1304 3550 3428 3746 1459 3814 5449 3623 2829 2150 5951
922 5951 4165 2792 1667 1074 -4 510 3013 5112 3761 3823 4738 8703 12082 10295 5687 3113
906 3113 3599 2393 3199 2765 507 1232 5174 9226 13988 13777 8370 4887 6684 9854 10778 12425 12355
889 12355 10734 8707 7934 6177 4870 5768 8077 9155 6186 6172 5316 4122 4484 5254 3363 2658 4095
872 4095 2569 5305 8285 7286 6118 7133 4924 3658 4834 2977 1053 819 755 -536 -1630 2073
856 2073 2835 4657 9064 6903 2379 -23 1217 5126 9902 11633 11597 10571 9259 8228 7294 5771
840 5771 4742 4223 3886 4444 2924 3538 7776 12179 11913 13030 10860 7633 5918 8636 10955 9327
824 9327 5195 6269 5811 4141 5833 7989 10303 9342 4834 1497 181 4011 7558 5139 4956 3865
808 3865 3124 6887 6739 8820 8999 11540 9674 8901 9440 3248 1240 1049 1725 1875 3709 7376 5142
791 5142 7063 7140 4766 5651 8549 7493 4864 6935 5197 4677 7247 10149 8784 7970 7132 6080 6451
774 6451 5003 4626 5728 7772 8733 6991 3441 2286 3052 2507 4602 7765 7649 9701 9071 5944 4505
757 4505 6041 7225 8716 11382 10975 11922 13487 8924 4732 6122 8302 6709 7665 7262 5791 4569
741 4569 2315 6199 6528 7496 7151 7499 7652 6063 7193 7919 6981 7904 9693 8376 6385 9816 14497
724 14497 13732 11421 9996 10262 7274 6616 6952 5974 6304 6177 2847 1552 3106 2004 3202 6907 8001
707 8001 8742 7744 4536 3610 3318 5433 6721 6068 8717 8481 8923 8226 10717 12624 11027 10988 12517 12348
689 12348 11741 8751 5439 5475 10368 13071 7220 3419 3490 3294 6098 10329 8035 7330 10254 11382 11173
672 11173 9087 9402 5366 2533 4618 6590 6045 5580 4682 4427 5867 8229 9611 8653 5518 6363 6572
655 6572 10406 10228 11469 13808 9911 6673 8936 11941 11570 11406 11275 11282 9204 7498 8105 6510 6420 3789
637 3789 3672 4083 2193 5451 6352 6662 8243 10848 10474 9744 8921 9155 9111 10483 10904 6719 1477 2849
619 2849 4389 6455 10005 9096 7314 7629 3633 6478 9039 7523 8425 9526 8168 5564 5091 5961
603 5961 8336 7178 4053 7538 9322 10906 11763 11493 8165 6851 8321 10209 9187 8382 5520 8249
587 8249 10155 5839 2391 679 1334 3934 4359 5217 6304 4530 3559 379 1265 1515 3368 4987 4513
570 4513 3581 6182 8768 9373 9597 8035 5862 3550 2616 2289 1136 1828 2722 2785 5421 6819 9085
553 9085 11557 12213 12659 11610 10260 8974 8230 8417 8196 12117 9338 4191 5537 4534 4558 1732 2625
536 2625 3523 3034 1312 1346 1872 4168 5137 5627 6907 4153 2730 4935 7438 8335 8452 4047 4615 3577
518 3577 2002 3891 9900 13148 11669 7159 7975 6413 5625 9199 13818 16334 18508 16869 12602 11335
502 11335 9004 6854 7942 7115 10005 11194 11079 8912 9511 12722 10883 11188 10364 9722 9961 8586 5416
485 5416 4464 4758 3428 3337 4339 4607 3052 3388 3970 6226 7006 9193 11401 12923 15713 15273 12631
468 12631 11583 9161 10745 10630 9581 9079 6735 7866 8622 8676 11224 12496 12931 13289 9464 9986 9730
451 9730 9247 9271 8002 7654 9265 9877 11073 10123 5242 7448 10460 8010 7081 7019 6400 5178 6776 7366
433 7366 5391 6653 8526 8018 5418 3258 5257 6521 7439 9672 6885 5105 8045 6181 5507 7218
417 7218 12141 15970 13228 9346 11030 11910 13438 13930 8578 6843 9042 12940 15098 12555 9717 9784
401 9784 9878 10049 11213 10728 10222 5947 4497 6945 6881 7590 8499 10390 12499 12092 6440 2935 282 4979
383 4979 8577 9321 10826 9163 5877 8507 12912 14488 13807 11098 10234 10561 11326 9093 5209 4233 3174
366 3174 3470 3823 2569 3186 5161 4435 6837 7455 6369 5073 3214 9238 12820 12670 11044 6786 6244
349 6244 9588 12527 12773 11816 9635 9389 10527 10218 8120 6647 6705 6272 6092 6753 7569 5173 5836 6023
331 6023 4545 6418 6499 5244 5099 8585 10149 10360 9950 12147 11496 9368 7610 7795 9137 9826 9431
314 9431 10120 13869 12083 10566 11381 13429 8359 8204 9929 5394 6819 6571 7512 6183 5663 6686 7440
297 7440 9943 7303 7047 8355 9561 10366 9861 6750 5818 7411 11013 14747 14037 12283 10916 11322 11827
280 11827 12594 11335 10130 10941 10564 10347 7866 6333 7813 7786 7245 6704 7265 8890 10066 10435 9302
263 9302 6971 8378 8255 9957 9792 8813 10138 9631 9377 8743 10883 13082 11513 8122 8094 9656 8650
246 8650 6921 8636 9706 9889 9918 13589 14014 13199 11399 9014 6606 7017 6722 9539 11510 10516 11568
229 11568 12014 11312 12846 12598 12773 13754 12666 13071 11632 10163 9266 9383 9729 9805 10854 11620 11047 9842
211 9842 9911 11248 10800 10359 11229 10935 10744 9137 5126 4290 7399 8068 5346 5818 7410 8085 8510 7248
193 7248 9172 9590 7557 6978 8517 6716 7493 8750 9673 9554 9831 10047 9526 7765 7334 8676 10011
176 10011 9419 8114 7942 10282 10150 8370 8105 9779 7633 6102 7317 9453 11038 10569 7593 7090
160 7090 7375 8778 8354 7403 7091 9175 10256 10885 9645 9545 10767 9685 9729 11413 9796 9294 10311
143 10311 10679 7348 4272 2627 5317 7790 8809 11186 12650 11390 9452 8780 9845 11472 9841
128 9841 8847 8456 9072 7422 5475 8504 8346 6728 7060 9467 9311 8592 8774 8301 7415 8327 9366 13024
110 13024 13317 12928 10149 10536 13385 12873 9465 8101 8201 7995 7276 6726 9434 10324 9509 10177 10388 10471
92 10471 9391 8676 6795 7102 11013 10259 7554 7381 8962 8750 9581 12191 10271 10307 12652 13295 13609 14139
74 14139 14860 13074 8843 8265 9415 8435 8805 11729 10579 9549 8352 7981 8665 7521 7026 9090 12445
57 12445 12496 12421 10728 9447 9347 10240 10669 9592 8031 11065 13191 12320 10259 8263 8875 7914 5571 6955
39 6955 9373 10588 10411 10627 11131 10394 9994 10549 9451 8385 7805 9332 10485 11301 11657 9283 9935 12116
21 12116 11772 9628 8986 8336 8975 9100 11209 13981 16557 16567 14961 11939 13095 13430 10949 8460 9453
4 9453 9637 8382 7140 6165
0 6165
$$ Imaginary data points
##PAGE= N=2
##DATA TABLE= (X++(I..I)), XYDATA
32767 46194 44487 45333 45636 46806 47942 47486 46500 46364 45134 45976 47139 49990 52174 50449 48742 46021
32751 46021 46569 46659 45651 49183 47595 45614 46947 46769 44851 44199 45680 46325 48880 50906 49521 47647
32735 47647 48630 48650 46649 45500 47628 48682 50679 50824 50437 50084 48941 50267 48416 46378 44145 45977
32719 45977 44571 43821 47115 49090 50292 51857 49010 47454 47697 47485 49569 47134 46747 49039 48681 49020
32703 49020 48677 48775 49063 49796 49195 47206 47709 48814 48736 47807 47600 48376 49288 50953 50187 50659 49799 49372 48329
32684 48329 45979 47444 45466 46911 48839 49016 52281 53850 52898 52978 52950 49453 47463 48070 49367 48219
32668 48219 47620 47006 48071 49654 50959 50190 50529 51137 50542 50414 49491 50294 48128 47435 44944 45813 48959
32651 48959 50639 49745 48522 46886 45913 46384 45709 47378 50548 53047 52913 52721 51137 49986 49876 50918
32635 50918 50524 49402 52248 54863 54434 52862 54017 55308 51638 48896 48206 48529 51026 51965 53456 54669
32619 54669 55375 53479 52690 51550 50510 48279 49740 51642 51486 52149 51761 48646 47348 48254 51247 51772
32603 51772 53244 52523 51960 51837 51641 52776 53735 52816 54288 55514 54726 54736 52332 51206 51951 52959 53156
32586 53156 54563 56021 58447 59629 55311 51273 49997 49426 50800 53823 54925 52979 51867 50375 49410
32571 49410 49721 50318 51212 50526 52625 50057 49160 51003 56295 55626 53755 52984 52722 54608 55424 53750 51872
32554 51872 51155 51742 52549 54791 56389 55543 52244 51933 53167 54196 54284 53700 54780 54248 51605 51754 49799
32537 49799 52733 52526 50700 50504 53182 52572 52448 54841 54330 52244 52758 54074 52079 52365 52611 53563 55240
32520 55240 56092 54189 53163 53692 56713 57722 53734 52632 56245 56569 57083 54383 55207 53456 49621 52351
32504 52351 54290 56331 56371 58316 58929 58483 57528 58201 57900 54424 50784 51432 53140 55719 55394 54673 56806
32487 56806 55861 54352 54816 53970 54984 54696 55803 57064 59083 60694 55331 50061 51971 53107 54981
32472 54981 53952 53662 56087 56566 55500 54944 57356 59438 57956 57772 56284 54680 55045 56246 59623 59668
32456 59668 57584 57740 60182 60602 57463 56519 56556 54783 52689 52289 56140 54531 52573 51476 51440 51667 54296
32439 54296 51302 49042 50394 51138 54426 57957 56388 55907 55893 58246 58473 58680 59439 55123 53968 51449
32423 51449 52466 52602 52850 54537 54994 57644 59262 59750 59558 60904 60415 60209 61037 59387 55651 53317
32407 53317 52696 53828 53659 54559 55785 57151 58546 57479 59841 60052 57890 56178 57059 56452 55610 56817
32391 56817 57810 58671 57571 55007 51540 52261 51804 52665 55457 53873 50599 53591 59796 59077 58827 60033
32375 60033 58973 56648 56325 55773 54256 53962 53672 52396 53512 54340 57998 62348 61718 61072 59693 58668
32359 58668 60466 60992 61324 63217 63795 62864 59192 56385 56124 59119 59765 63233 62145 58456 57634 57556 56828
32342 56828 55324 57387 58714 58265 57479 60577 60478 59397 59070 57911 56303 56406 55310 54639 59086 59711
32326 59711 59427 59935 57348 59146 60876 56537 51667 49601 52096 54710 55648 54424 53871 52433 52921 53083
32310 53083 53805 54018 55431 56392 56093 58167 58896 59382 60092 61121 62965 61304 57619 57045 56822 53138 50268
32293 50268 52335 52681 52994 53630 54253 56206 58840 58414 57716 58991 61589 60418 59983 59936 63167 66046 64752
32276 64752 62116 64094 63002 62924 62946 62061 60690 60388 61752 59574 56784 56859 57157 53522 50079 53631 58657
32259 58657 60009 59411 60760 59797 55991 54485 56790 57280 57947 59448 60617 58439 56140 58204 62580
32244 62580 66239 62076 58056 58435 64041 66673 64467 61930 64195 66284 61370 58457 59424 63323 63939
32229 63939 63197 62371 62873 63904 63031 61946 61608 62118 61145 61667 61945 62389 60156 63489 63254 62420 59197
32212 59197 57609 55787 55121 59352 61889 61379 55984 50402 50289 53385 53532 56391 59381 58480 58644 56215
32196 56215 57446 59078 63402 64846 63246 64506 64961 64684 68564 64763 58848 58314 60179 62875 60762
32181 60762 57300 58362 57427 57240 59046 60628 61573 60269 60280 59742 60792 64067 63583 62476 65933 64580
32165 64580 62743 63825 64790 62866 57992 56673 61860 62867 65200 66506 64701 63245 62193 62342 63073
32150 63073 64926 63859 62072 62143 60488 59607 60236 61954 59939 60148 60722 58725 58352 61225 63712 64852
32134 64852 63970 61194 56926 55820 53691 52221 52774 50333 51978 55102 59118 60250 61310 64118 63251
32119 63251 60482 60479 59857 63339 63285 60696 59958 57088 52095 51523 58675 59547 58331 60361 61282 60233 60098
32102 60098 61878 63261 60564 59291 59998 56776 57547 57618 59653 59761 59856 59903 56815 54288 55955 60008 58941
32085 58941 57779 60233 59825 59565 56875 55005 56738 56733 57104 56949 61081 62400 60547 61116 60551 59451 59066
32068 59066 59235 61208 60755 58561 57960 54782 52804 56453 57939 59584 61197 60633 58943 62495 64134
32053 64134 62852 59379 58512 60117 60713 63624 58885 54906 56016 53427 54583 58351 60099 60630 61929
32038 61929 59773 58156 57209 59024 58485 58551 60751 60578 60859 58069 57548 58977 57341 57147 57097 52624 55240
32021 55240 58731 60682 60416 59926 58775 54618 58357 64380 62518 60706 58028 59185 56892 58358 62464
32006 62464 61289 56662 56348 56708 56494 58694 64050 63677 62199 57558 56612 58292 58142 55336 54671 57749
31990 57749 60073 60575 57288 53350 55127 57823 59466 57106 55023 54333 58682 62378 61756 59964 60733
31975 60733 64091 66809 68414 66438 61995 62151 63272 62778 61365 62380 61397 61984 59456 58107 58900 60170
31959 60170 58483 58215 58589 60079 58389 57582 57811 59121 58317 56657 62421 64911 61998 59909 59369 57733
31943 57733 59927 63756 64802 64086 61958 58705 57982 57959 59753 60023 60929 63033 64317 62738 64441 63985
31927 63985 61552 59893 59141 60366 64273 63936 60764 60650 61574 60218 56927 56829 57970 61465 61586 59320
31911 59320 56773 56346 53442 53728 56160 56470 58331 59905 63108 63745 60372 53560 51386 53579 59183
31896 59183 62831 61979 63048 63795 60856 61370 61605 60398 58273 60573 63574 60430 61996 62451 61414 64584
31880 64584 61126 59852 58844 59691 61409 60984 57038 59519 59812 61457 63075 62367 62780 60628 62295 64159
31864 64159 66075 66822 64793 62167 59601 59759 62282 62629 62579 63659 65751 65117 64074 65795 65959 62963
31848 62963 62066 59502 59027 62375 62627 63153 65897 63950 60200 59163 63660 67132 70675 66662 64613
31833 64613 64328 65076 64676 63274 61905 61468 62553 63516 63131 62651 61796 61431 60872 60984 61241 60548 61817 66335
31815 66335 65396 67085 64415 61847 61105 58789 57415 59639 60874 59951 58667 58924 58172 59264 60778 61440
31799 61440 62266 61230 61672 60851 58633 61109 59606 59177 60610 59920 61192 65303 65940 59743 57168 58322
31783 58322 59827 60802 64322 59506 59214 56046 54533 54469 53501 55911 61501 62427 61847 58212 60771 62063
31767 62063 59950 61730 62994 59506 60039 62139 62795 63934 65145 63079 64358 62600 61739 61923 63014
31752 63014 60320 61196 58811 58189 60663 60529 60396 60206 58803 60071 62363 63142 58131 58498 60006 61442
31736 61442 60460 61677 63162 61002 60522 59137 59740 63368 65102 63830 58994 57191 55494 57075 61029
31721 61029 61179 58608 58439 61188 63495 63591 64109 63766 65455 70309 65618 60615 62898 61624 58244 61220
31705 61220 63263 61228 58984 58957 59243 61457 64438 63303 59943 59113 56333 54572 59371 61641 60268
31690 60268 58947 60178 59917 62155 61820 56285 54469 56425 59904 63470 62165 59693 56985 57861 60843
31675 60843 61315 59903 63444 69501 67994 61719 61439 64719 65156 63119 60807 60625 60150 59553 60607 61351
31659 61351 59280 61266 64133 64046 61644 61824 63349 65028 65870 66041 63803 63281 60549 59915 63093 63480
31643 63480 66439 66887 63522 64001 64666 62140 60858 63618 63431 65847 67156 66875 62025 61083 65461 67141
31627 67141 65022 63067 62040 60419 59031 63238 64951 65387 64629 63015 64563 64374 68138 68175 65437 65356
31611 65356 63319 59969 59257 62435 63556 62839 63968 64426 67665 67011 68970 68404 65826 61843 66195 64384
31595 64384 64744 66691 61950 58724 62621 63718 59890 58679 62136 62939 62592 65563 62586 59051 57017
31580 57017 57615 57448 57579 58591 59063 58884 59492 59276 58424 60766 62677 62396 61759 62957 60380 60705 61914
31563 61914 58853 54628 57739 62542 67818 66742 64611 64384 65125 61243 56861 55863 57860 58803 55429
31548 55429 55224 59335 63418 62289 58883 61610 61801 61806 56852 54637 55215 56784 59063 61999 62587 66926
31532 66926 69036 68331 62992 60492 62967 66658 65675 63107 62561 62270 59407 58123 58417 58604 56653 57773
31516 57773 61086 62419 59208 58428 59860 62156 63265 60183 56707 55424 58743 63762 64235 63981 65886
31501 65886 68644 69221 66442 63087 63666 63697 63196 61006 61415 65253 61485 56550 60835 62642 63136 64265
31485 64265 65688 63357 60989 61762 62998 63172 63293 64242 63475 64756 61584 61670 63158 64291 64913 62834
31469 62834 61243 63411 65437 63700 64838 63535 63324 66783 67353 65168 62623 65792 68493 66083 68482
31454 68482 68203 62012 60973 62309 62374 63142 63042 63315 61930 63018 62244 63552 64689 60992 57151 59727
31438 59727 62617 62224 60640 63306 64298 63485 64480 60156 60036 62205 61149 61313 61255 58514 60338 60284 62025
31421 62025 63096 60039 59376 59608 60335 63167 66189 65954 63099 62564 65394 61746 58789 60885 62851 64090
31405 64090 63965 64839 66430 68288 66313 64322 64486 64385 65186 66322 67971 67350 65593 63748 62400 62466
31389 62466 64927 66821 64219 63283 63986 62338 59169 66177 68127 68109 70049 72106 69359 70032 66248 66668
31373 66668 68155 65619 63851 63242 62901 64209 67442 68747 68071 65238 59243 56875 57522 60373 62834
31358 62834 61679 59816 62347 63774 61528 60560 65248 66849 64406 64160 60760 60076 61161 60186 59764 60519
31342 60519 63983 62914 63833 65978 65555 63283 65088 65549 64751 63311 61625 64464 64823 66171 66761 67418
31326 67418 67423 66991 65941 64155 61609 63358 66735 63723 62866 61234 63363 65464 65168 63765 61229 62028
31310 62028 62572 60872 60163 61935 64359 64315 63313 62215 58795 59256 62472 66366 67123 64873 65129 65306
31294 65306 64182 62184 65243 64870 62947 60129 60810 62551 63735 64241 66512 63684 62364 63407 62781
31279 62781 62741 62788 62560 64870 66648 67885 65623 62350 63680 65517 66949 66113 65356 64906 63645 63468 63995
31262 63995 67950 67960 65162 61494 59193 61977 62553 60817 60891 66246 67530 66243 62895 65727 62351 59715
31246 59715 59485 62867 63736 64529 63000 61691 64469 66725 66776 65880 61348 59081 60839 60939 62568 63900
31230 63900 63868 62671 60281 58101 61461 63269 63302 63517 64326 67867 68248 67582 65655 64214 62378 63608
31214 63608 68674 69535 64237 59693 61759 62660 63028 64921 66441 68248 69963 68330 65908 63192 61100
31199 61100 64507 66255 63698 63094 61963 61319 64184 64535 62736 62579 64732 64445 66930 66020 65407 65753
31183 65753 68449 66350 65358 66532 63156 61234 59571 61318 63037 66580 65467 62683 65532 67191 66067
31168 66067 67055 65424 61254 59927 61531 62507 63008 66497 69820 69893 65437 59973 59321 62726 64165 63964
31152 63964 62222 62832 64841 64560 63877 64817 65370 63791 61240 61919 61907 62977 64650 64666 66383 66741 68719
31135 68719 62735 59388 61019 65460 67910 69784 68038 65964 64137 60156 61304 64635 69329 67099
31121 67099 64795 65037 65246 60556 60106 61390 60899 56650 58613 61538 63667 63511 62864 61183 59991 61986
31105 61986 66155 64921 61942 61437 65252 67768 68366 65017 65703 68132 69693 70168 67406 62782 61846 64619
31089 64619 65879 67893 69088 64778 62233 61019 62192 62938 62759 63674 65241 65237 68283 66677 68534 71368
31073 71368 70427 69819 67899 66442 64215 65363 70313 71446 68926 67861 66099 66370 68461 69702 66549
31058 66549 67357 66897 66524 65541 64689 64740 62596 61412 61005 62761 66310 66919 63553 62839 62610 60649 58848
31041 58848 58397 60274 61673 65522 67376 65896 67846 69688 64955 64565 66655 68337 67907 64038 64708
31026 64708 65182 64906 65714 63784 63775 66386 68011 68205 65456 65214 66070 66763 67029 66621 66121 66729 64114 63471
31008 63471 68196 73043 72824 69914 68232 67295 67530 66478 63230 63479 61896 60380 60551 58549 61129 63380
30992 63380 62862 62774 60497 57923 59923 60840 62752 63285 61513 61381 60097 63369 65223 61943 63331 62359
30976 62359 59798 61551 63682 63599 64270 63195 64018 66036 67514 66517 65598 68047 68164 67432 66206 66350 63426
30959 63426 63847 65194 60597 59327 60503 61193 61465 63343 64411 63270 65216 68086 67373 67653 66896 68519
30943 68519 69031 67428 65045 65647 67324 67951 66283 67606 66983 67538 66498 67605 66428 64752 66694 65330
30927 65330 63349 66407 69185 71291 70529 65535 63124 62170 61984 65293 67853 69123 68587 63249 61819
30912 61819 66816 68138 64227 61348 64868 66408 67794 65698 63390 63269 63724 61265 58296 60593 65424
30897 65424 66690 69377 71623 73488 72891 68179 67721 63958 60950 62103 60542 61385 63783 62666 62800
30882 62800 63509 68799 71100 68627 65314 63673 64622 66615 68412 68352 67215 66450 66228 65859 65752 70256
30866 70256 67612 65935 71311 70662 68962 64277 59071 58452 58987 63507 66595 67767 66479 64611 62350
30851 62350 63353 65312 66897 67392 66114 61119 56705 59342 61172 62836 60811 59613 59671 61241 61288 61176
30835 61176 60183 61808 64889 67882 66968 62244 58294 61826 65732 65090 66158 67653 67861 70664 65398
30820 65398 62645 61878 59484 60825 64308 62429 67572 69398 66647 67741 65387 65201 69052 70558 67131
30805 67131 63600 60659 60097 63118 63870 65770 67584 68971 66439 62928 62369 63812 67694 70580 69291
30790 69291 65805 64403 63835 65476 66110 68798 69378 66965 64034 61968 63354 62448 62170 62816 64510 65316
30774 65316 62517 62912 65409 63953 64480 65777 68017 70187 67772 69531 68420 69469 71206 67366 64274
30759 64274 60388 58934 61028 64207 66738 71092 74622 75449 74719 74492 76183 73474 68712 67390 67120
30744 67120 66976 64553 64808 63616 64638 66983 69339 69670 69085 70310 72122 71174 69375 70515 74047 70973
30728 70973 67254 63388 64799 67744 68125 68013 68655 66289 64279 64735 63207 62260 59523 60847 63615 65923
30712 65923 65742 65660 68205 69558 71604 71436 71540 70235 67179 66019 67204 69524 70734 67057 68171 67539
30696 67539 68747 71250 75162 77844 76436 72923 69462 65501 63361 67566 67355 68203 71786 72787 70791
30681 70791 68441 66317 64217 65525 69308 71240 69444 68270 66886 64236 64337 64735 65537 64702 68087
30666 68087 71285 71083 70679 72632 68292 64082 66032 67036 66993 66560 64968 63982 63278 64011 66732 63654
30650 63654 62736 66948 65752 63470 63847 67126 68951 67007 64633 64143 64333 63732 61663 61814 64496 64875
30634 64875 66884 66674 69580 68446 66168 66991 68026 68596 70384 70716 66820 65231 65091 65525 66766 67454
30618 67454 66807 67087 70228 69076 62795 60210 58507 57883 62772 65268 65207 63488 64394 66915 65714 65768
30602 65768 66689 65262 63230 61700 64074 68713 70598 68454 69383 69260 64999 60826 62118 64346 67522
30587 67522 69298 69711 68494 64874 65246 68134 69958 69545 68238 69256 69996 69244 67131 67677 68463 68006
30571 68006 69320 65776 65061 69580 68443 63576 63351 63012 61598 66208 65777 64035 66829 69521 72243
30556 72243 71981 69911 65299 64105 68697 73774 72831 68321 65595 63483 63109 66061 69124 68968 68170 65586
30540 65586 62955 61677 62819 62866 62976 63304 66649 68456 65957 62740 64634 64259 62695 60924 61190 65174
30524 65174 65737 65180 66434 65719 65406 66109 65914 64292 65078 64968 62552 64426 65736 67134 67824 67141 66500
30507 66500 69763 72164 74234 73253 68328 66464 65684 64682 62418 61403 62633 65313 65089 66857 68830
30492 68830 68261 69671 67960 69276 70233 67962 64991 62043 63649 65771 68658 71249 72903 72512 69838
30477 69838 69718 66576 66157 68007 65040 66674 66984 65801 68082 68796 66415 65683 66311 66174 66734 66743 66621
30460 66621 68313 70053 70632 69328 68073 67574 66966 70887 72923 74089 70747 66596 66597 63403 65157 68581
30444 68581 70221 69938 71263 73374 71774 71267 72815 70868 71704 71729 70407 67340 66914 64527 62453 63220
30428 63220 65883 67778 66953 69058 70435 71236 68938 71005 70065 69555 71685 75505 77047 72708 71680
30413 71680 70622 65030 61237 63608 68222 68895 70143 71683 72033 70447 66133 65589 67022 67067 67413 66269
30397 66269 65788 69781 69380 68889 68449 68005 66945 66893 66879 67173 65819 66614 68093 65805 65240 67314 72421
30380 72421 75668 74398 75178 73487 66430 64851 67211 68466 67781 68085 67304 68448 71871 68838 68059 68640
30364 68640 70669 69993 66823 63349 63379 66388 64687 64467 67362 63385 62655 67523 72019 68201 61929 60206
30348 60206 63841 66909 66039 65060 67498 68009 67476 67088 67189 67884 63935 60293 61408 65819 66432 67386 65792
30331 65792 68271 72892 73492 69289 68142 64423 61626 63478 64428 63400 63146 67589 67597 68365 71843 75207
30315 75207 77589 78358 75212 72477 71941 72004 69574 68279 67562 65390 66397 68174 69221 67909 63851 67271
30299 67271 70538 71465 71629 70811 71443 70013 68288 67043 67618 68016 68256 67041 65561 68602 69269 66280
30283 66280 64824 65918 67702 67670 67411 68435 70696 67995 68378 67807 71126 69384 64284 60526 57981 57391
30267 57391 59294 61894 64636 64970 69182 70702 67056 68488 70195 68029 65991 64989 66291 66353 69003
30252 69003 68641 69391 70814 69378 69157 67273 65360 64048 65318 67171 67619 66133 63593 64782 68515
30237 68515 69394 72037 71491 67702 64536 65874 67417 68348 69266 67910 67890 65794 66111 67313 66056 69001
30221 69001 70700 70608 71677 69760 70818 71571 71888 70446 69417 65442 62141 63022 64227 65527 67822 69217
30205 69217 69304 66868 64942 64553 65391 67809 69898 69361 66983 65540 64763 65240 63558 63796 65428 65575 67528
30188 67528 68968 66923 67344 67960 68490 69206 68843 69128 68932 69952 71993 71194 69254 68374 69078 67262 65107
30171 65107 66978 69522 72514 73032 71766 69367 68348 68333 68697 69849 67937 68601 73708 74000 70707 72210
30155 72210 71657 72751 72169 70195 69228 69247 70888 72805 70106 68653 64223 64986 64122 64541 69494 73375
30139 73375 73590 71400 67763 68023 66025 65131 67400 68059 70971 71059 72189 71612 68560 68823 72690 75798
30123 75798 74723 73251 71080 73613 76301 78555 78257 74660 67487 65359 66602 64118 61833 61261 61955
30108 61955 63546 65605 67552 69276 70899 71275 71673 73539 73362 72322 69761 68464 65985 67962 67780
30093 67780 64667 61851 65922 68994 68806 68771 70677 68200 66682 66535 67311 70916 74451 70278 67769 65997
30077 65997 66992 69202 72017 72601 70817 69133 69708 67723 70281 71875 71711 70252 66043 63340 64577
30062 64577 63613 61630 64660 68391 70771 68903 70985 71310 69775 69954 70736 67285 66199 68688 70968
$$ [...]
##END NTUPLES=NMR SPECTRUM
##END=
