##TITLE=Analysis number 328489
Compound Code mo 07535
Project Code adrs
Chemist Name cuschem
##JCAMPDX= 6.0         $$ Bruker NMR JCAMP-DX V2.0
##DATA TYPE= NMR SPECTRUM
##DATA CLASS= NTUPLES
##ORIGIN= Bruker BioSpin GmbH
##OWNER= nmr
$$ XWIN-NMR		Version 3.5
$$ Mon Jun 11 09:22:20 2007 GMT Daylight Time (UT+1h)  MAYBRIDGE\nmr@NMR_250MHZ
##.OBSERVE FREQUENCY= 250.131544655141
##.OBSERVE NUCLEUS= ^1H
##.ACQUISITION MODE= SIMULTANEOUS (DQD)
##.ACQUISITION SCHEME= undefined
##.AVERAGES= 16
##.DIGITISER RES= 18
##SPECTROMETER/DATA SYSTEM= dpx250
##.PULSE SEQUENCE= zg30
##.SOLVENT NAME= CDCl3
##.SHIFT REFERENCE= (INTERNAL, CDCl3, 0, 16.522)
##AUDIT TRAIL= $$ (NUMBER, WHEN, WHO, WHERE, WHAT)
$$ ##TITLE= Audit trail, XWIN-NMR		Version 3.5
$$ ##JCAMPDX= 5.01
$$ ##ORIGIN= Bruker BioSpin GmbH
$$ ##OWNER= nmr
$$ C:\u/data/dgb/nmr/ADRS/570/pdata/1/auditp.txt
$$ ##AUDIT TRAIL=  $$ (NUMBER, WHEN, WHO, WHERE, WHAT)
(   1,<2007-06-11 09:22:01.77 +100>,<MAYBRIDGE\nmr>,<NMR_250MHZ>,
      <created by zg, POWCHK disabled, PULCHK disabled
       configuration hash MD5:
       76 6E 9A 78 1E 09 19 81 EC 84 63 8F B0 6A 59 2D
       data hash MD5: 64K
       FC 5D 38 AF A6 EA 35 B5 E8 2E EE 7D 5E AB 94 13>)
(   2,<2007-06-11 09:22:12.63 +100>,<MAYBRIDGE\nmr>,<NMR_250MHZ>,
      <Start of raw data processing
       ef LB = 0.3 FT_mod = 6 PKNL = 1 SI = 32K 
       data hash MD5: 32K
       D7 21 F2 58 AB 1D 05 F7 62 9A CB C9 96 D4 A7 C2>)
(   3,<2007-06-11 09:22:14.27 +100>,<MAYBRIDGE\nmr>,<NMR_250MHZ>,
      <apk 
       data hash MD5: 32K
       5E F1 CC 4D 73 4A 68 DE 88 CE E9 4F 68 D8 71 0A>)
(   4,<2007-06-11 09:22:15.00 +100>,<MAYBRIDGE\nmr>,<NMR_250MHZ>,
      <abs ABSG = 5 
       data hash MD5: 32K
       D5 47 36 B0 4E 21 03 10 A4 AB F1 F6 BE 95 A4 44>)
$$ ##END=
$$ 
$$ hash MD5
$$ 53 C8 1F DC 04 BF 2C 2B D1 7D 82 7D D0 48 98 C5
##$RELAX= 
##$RELAX= 
##$RELAX= 
##$RELAX= 
##$RELAX= 
##$RELAX= 
##$RELAX= 
$$ Bruker specific parameters
$$ --------------------------
##$DU= <C:\u>
##$EXPNO= 570
##$NAME= <ADRS>
##$PROCNO= 1
##$TYPE= <nmr>
##$USER= <dgb>
##$AMP= (0..31)
100 100 100 100 100 100 100 100 100 100 100 100 100 100 100 100 100 100 
100 100 100 100 100 100 100 100 100 100 100 100 100 100 
##$AQSEQ= 0
##$AQ_mod= 3
##$AUNM= <au_zg>
##$AUTOPOS= <44 >
##$BF1= 250.13
##$BF2= 250.13
##$BF3= 250.13
##$BF4= 250.13
##$BF5= 500.13
##$BF6= 500.13
##$BF7= 500.13
##$BF8= 500.13
##$BYTORDA= 1
##$CFDGTYP= 0
##$CFRGTYP= 5
##$CHEMSTR= <none>
##$CNST= (0..31)
1 1 145 1 1 1 1 1 1 1 1 1 1 1 1 1 1 1 1 1 1 1 1 1 1 1 1 1 1 1 1 1 
##$CPDPRG= <>
##$CPDPRG1= <>
##$CPDPRG2= <>
##$CPDPRG3= <>
##$CPDPRG4= <mlev>
##$CPDPRG5= <mlev>
##$CPDPRG6= <mlev>
##$CPDPRG7= <mlev>
##$CPDPRG8= <mlev>
##$CPDPRGB= <>
##$CPDPRGT= <>
##$D= (0..31)
0 1 0 0 0 0 0 0 0 0.06 0 0 0 0 0 0 0.0002 0 0 0 0 0 0 0 0 0 0 0 0 0 0 
0 
##$DATE= 1181550120
##$DBL= (0..7)
120 120 120 120 120 120 120 120 
##$DBP= (0..7)
150 150 150 150 150 150 150 150 
##$DBP07= 0
##$DBPNAM0= <>
##$DBPNAM1= <>
##$DBPNAM2= <>
$$ [...]
##$SUBNAM7= <"">
##$SUBNAM8= <"">
##$SUBNAM9= <"">
##$SW= 20.6930455092707
##$SWIBOX= (0..15)
0 0 3 0 0 0 0 0 0 0 0 0 0 0 0 0 
##$SW_h= 5175.983436853
##$TD= 65536
##$TD0= 1
##$TE= 297.16
##$TE2= 300
##$TE3= 300
##$TEG= 300
##$TL= (0..7)
0 120 120 120 120 120 120 120 
##$TP= (0..7)
150 150 150 150 150 150 150 150 
##$TP07= 0
##$TPNAME0= <>
##$TPNAME1= <>
##$TPNAME2= <>
##$TPNAME3= <>
##$TPNAME4= <>
##$TPNAME5= <>
##$TPNAME6= <>
##$TPNAME7= <>
##$TPOAL= (0..7)
0.5 0.5 0.5 0.5 0.5 0.5 0.5 0.5 
##$TPOFFS= (0..7)
0 0 0 0 0 0 0 0 
##$TUNHIN= 0
##$TUNHOUT= 0
##$TUNXOUT= 0
##$USERA1= <user>
##$USERA2= <user>
##$USERA3= <user>
##$USERA4= <user>
##$USERA5= <user>
##$V9= 5
##$VALIST= <valist>
##$VCLIST= <CCCCCCCCCCCCCCC>
##$VD= 0
##$VDLIST= <DDDDDDDDDDDDDDD>
##$VPLIST= <PPPPPPPPPPPPPPP>
##$VTLIST= <TTTTTTTTTTTTTTT>
##$WBST= 1024
##$WBSW= 4
##$XGAIN= (0..3)
0 0 0 0 
##$XL= 0
##$YL= 0
##$YMAX_a= 285267
##$YMIN_a= -225831
##$ZGOPTNS= <>
##$ZL1= 120
##$ZL2= 120
##$ZL3= 120
##$ZL4= 120
##$ABSF1= 16.522
##$ABSF2= -4.171173
##$ABSG= 5
##$ABSL= 3
##$ALPHA= 0
##$AQORDER= 0
##$ASSFAC= 0
##$ASSFACI= 0
##$ASSFACX= 0
##$ASSWID= 0
##$AUNMP= <proc_1d>
##$AZFE= 0.1
##$AZFW= 0.1
##$BCFW= 0
##$BC_mod= 0
##$BYTORDP= 0
##$COROFFS= 0
##$CY= 12.5
##$DATMOD= 1
##$DC= 0
##$DFILT= <>
##$DTYPP= 0
##$F1P= 14.0000005364418
##$F2P= -0.99999901652339
##$FCOR= 0.5
##$FTSIZE= 32768
##$FT_mod= 6
##$GAMMA= 0
##$GB= 0
##$INTBC= 1
##$INTSCL= 1
##$ISEN= 128
##$LB= 0.3
##$LEV0= 0
##$LPBIN= 0
##$MAXI= 10000
##$MC2= 0
##$MEAN= 0
##$ME_mod= 0
##$MI= 0
##$NCOEF= 0
##$NC_proc= -4
##$NLEV= 6
##$NOISF1= 0
##$NOISF2= 0
##$NSP= 0
##$NTH_PI= 0
##$NZP= 0
##$OFFSET= 16.522
##$PC= 1
##$PHC0= -49.03621
##$PHC1= 4.176883
##$PH_mod= 1
##$PKNL= yes
##$PPARMOD= 0
##$PSCAL= 4
##$PSIGN= 0
##$REVERSE= no
##$SF= 250.13
##$SI= 32768
##$SIGF1= 0
##$SIGF2= 0
##$SINO= 400
##$SIOLD= 32768
##$SREGLST= <1H.CDCl3>
##$SSB= 0
##$STSI= 32768
##$STSR= 0
##$SW_p= 5175.98343685301
##$SYMM= 0
##$S_DEV= 0
##$TDeff= 65536
##$TDoff= 0
##$TI= <Analysis number 999999
Compound Code 99
Book Reference 9
Project Code 9>
##$TILT= no
##$TM1= 0
##$TM2= 0
##$TOPLEV= 0
##$USERP1= <user>
##$USERP2= <user>
##$USERP3= <user>
##$USERP4= <user>
##$USERP5= <user>
##$WDW= 1
##$XDIM= 32768
##$YMAX_p= 334679933
##$YMIN_p= -396288
$$ End of Bruker specific parameters
$$ ---------------------------------
##NTUPLES= NMR SPECTRUM
##VAR_NAME=  FREQUENCY,     SPECTRUM/REAL,   SPECTRUM/IMAG
##SYMBOL=    X,             R,               I
##VAR_TYPE=  INDEPENDENT,   DEPENDENT,       DEPENDENT
##VAR_FORM=  AFFN,          ASDF,            ASDF
##VAR_DIM=   32768,         32768,           32768
##UNITS=     HZ,            ARBITRARY UNITS, ARBITRARY UNITS
##FACTOR=    0.157963299565203, 1,           1
##FIRST=     4132.6476996994, 0,             0
##LAST=      -1043.33573715361, 0,           0
##MIN=       -1043.33573715361, -396288,     0
##MAX=       4132.6476996994, 334679933,     0
$$ Real data points
##PAGE= N=1
##DATA TABLE= (X++(R..R)), XYDATA
$$ [...]
$$ plain form
24256 -91898 -68588 10360 -17467 18449 40660 78882 171849 151298 82160 53762 53546 -122567
24244 -122567 -155160 -68631 26943 33567 82916 51428 -24587 -81149 -18091 76805 60050 -21521
24232 -21521 -42308 49954 104944 112311 31779 71468 102032 164106 78664 -39843 -83404 -92894
24220 -92894 35529 50668 -6476 85224 100947 124594 139238 127837 73061 34976 14619
24209 14619 -50863 -76133 -108762 -22389 57314 5397 6711 -19161 74567 88566 105353 126535
24197 126535 78833 153354 166074 3811 -159209 -300100 -324981 -210473 -101018 -41859
24187 -41859 -153559 -63946 -58850 -140678 -203781 -141257 -119405 1382 106803 65396 -71935
24176 -71935 -165419 -200192 -128235 -102836 -101967 -46485 7300 -5142 -150921 -182874 -115298 -88721
$$ packed form
24256i1898K3310P8948k7827L5916K2211L8222R2967k0551o9138k8398k16j76113
24244a22567l2593Q6529R5574O624M9349l1488p6015n6562O3058R4896j6755q1571
24232b1521k0787R2262N4990P367q0532L9689L0564O2074q5442j18507m3561r490
24220i2894J28423J5139n7144R1700J5723K3647J4644j1401n4776l8085k0357
24209A4619o5482k5270l2629Q6373P9703n1917J314k5872R3728J3999J6787K1182
24197A26535m7702P4521J2720j62263j63020j40891k4881J14508J09455N9159
24187d1859j11700Q9613N096q1828o3103O2524K1852J20787J05421m1407j37331
24176g1935r3484l4773P1957K5399Q69N5482N3785j2442j45779l1953O7576K6577
$$ plain form
24164 -88721 -25262 60151 11258 26668 129552 228755 261730 285807 231960 224708 261568 92907
24152 92907 -97993 -104350 -108923 -182447 -220464 -177125 -159738 -23956 -880 -60300 -57829 -31567
24140 -31567 35433 -20250 -55557 24059 78403 136918 91673 24883 18569 75442 138759 129927
24128 129927 63898 100617 149534 -4845 -87501 -118970 -65098 -36519 61981 104623 74166
24117 74166 69896 143796 236967 170305 133960 160075 131852 154161 214372 180572 49469 52676
24105 52676 -68884 -79272 -31350 5175 -16451 -55805 -95726 -143806 -36642 63805 102123
24094 102123 49269 12796 -83139 -150750 -161966 -198945 -192864 -126916 -93107 -73215 88267
24083 88267 177733 112936 137690 178887 182325 102484 30264 76776 88431 74075 115930 106464
$$ packed form
24164h8721O3459Q5413m8893J5410J02884R9203L2975K4077n3847p252L6860j68661
24152I2907j90900o357m573p3524l8017M3339J7387J35782K3076n9420K471K6262
24140c1567O7000n5683l5307P9616N4344N8515m5245o6790o314N6873O3317q832
24128A29927o6029L6719M8917j54379q2656l1469N3872K8579R8500M2642l0457
24117G4166m270P3900R3171o6662l6345K6115k8223K2309O0211l3800j31103L207
24105E2676j21560j0388M7922L6525k1626l9354l9921m8080J07164J00447L8318
24094A02123n2854l6473r5935o7611j1216l6979O081O5948L3809J9892J61482
24083H8267Q9466o4797K4754M1197L438p9841p2220M6512J1655j4356M1855r466
$$ plain form
24071 106464 121098 24549 -92736 -67631 10881 -8301 -6769 -52250 5382 7601 -21786 36372
24059 36372 34263 79312 47720 60397 64897 -10209 89 -46263 -53394 -32359 -72260 -57637
24047 -57637 56787 37399 -6356 -27127 -14939 -78205 -123291 -151288 -114562 -97251 -104620 -85689
24035 -85689 -117569 -33047 2058 -52248 -90573 -67254 90164 149759 122524 90460 116467
24024 116467 187968 162194 -14165 -10734 77164 150671 143063 17550 26870 86073 111648 77087
24012 77087 71860 -55608 -48489 8256 12936 41791 164733 193260 190633 212894 221050 160478
24000 160478 82061 124134 98207 71470 -12477 -34920 -63137 8897 116674 99995 21545
23989 21545 91181 188112 177202 160534 65102 74173 18729 45215 127800 63355 -4402 3659
$$ packed form
24071A06464J4634r6549j17285K5105P8512j9182J532m5481N7632K219k9387N8158
24059C6372k109M5049l1592J2677M500p5106J0298m6352p131K1035l9901J4623
24047e7637J14424j9388m3755k0771J2188o3266m5086k7997L6726J7311p369J8931
24035h5689l1880Q4522L5105n4306l8325K3319J57418N9595k7235l2064K6007
24024A16467P1501k5774j76359L431Q7898P3507p608j25513R320N9203K5575l4561
24012G7087n227j27468P119N6745M680K8855J22942K8527k627K2261Q156o0572
24000A60478p8417M2073k5927k6737q3947k2443k8217P2034J07777j6679p8450
23989B1545O9636R6931j0910j6668r5432R071n5444K6486Q2585o4445o7757Q061
$$ plain form
23977 3659 -2480 -54992 4112 -26699 68791 91518 44416 15290 57975 17263 56977 23825
23965 23825 -50456 -15609 121384 141023 119461 20956 -47981 34086 23345 -36644 -66760
23954 -66760 -146791 -78895 10939 75831 -49623 -38657 15858 79345 76032 40786 24010 11216
23942 11216 -39641 -6950 -122329 -149717 -162658 -135337 -109910 -154612 -100336 50005 75579
23931 75579 25150 61117 17185 29139 -24621 -123789 -38284 76590 58065 90064 46012
23920 46012 -22999 16844 194601 221584 225641 85115 36396 -63517 -47514 -50717 -40781 -109036
23908 -109036 -114925 -92321 -81369 -85457 -69543 40313 132862 95561 114499 63744 -29963 -107603
23896 -107603 -55418 42171 75160 130372 24084 -30512 -66301 -91826 -183416 -248807 -112231
$$ packed form
23977C659o139n2512N9104l0811R5490K2727m7102k9126M2685m0712L9714l3152
23965B3825p4281L4847J36993J9639k1562r8505o8937Q2067j0741n9989l0116
23954f6760q0031O7896Q9834O4892j25454J0966N4515O3487l313l5246j6776j2794
23942A1216n0857L2691j15379k7388j2941K7321K5427m4702N4276J50341K5574
23931G5579n0429L5967m3932J1954n3760r9168Q5505J14874j8525L1999m4052
23920D6012o9011L9843J77757K6983M057j40526m8719r9913J6003l203R936o8255
23908a09036n889K2604J0952m088J5914J09856R2549l7301J8938n0755r3707p7640
23896a07603N2185R7589L2989N5212j06288n4596l5789k5525r1590o5391J36576
$$ plain form
23885 -112231 34426 -67993 -46796 8446 72303 94908 -3589 -133157 -208999 -136956 12451
23874 12451 124079 85756 -11447 -104913 -134157 -48949 -45633 -64526 14709 99534 97862 88884
23862 88884 25923 27952 -426 38168 64542 37595 137425 117736 -1925 -66091 -73772 -43524
23850 -43524 -113309 -65537 -129261 -174962 -126085 -39248 -130322 -149481 -71967 -71984 -4520 36909
23838 36909 100499 60251 154 9659 -71867 -96780 -63382 -35145 -10496 28228 132717 79259
23826 79259 17234 -1203 -103728 -86488 -34282 -129805 -133930 -77458 -85108 -96703 -4016 80258
23814 80258 117800 36025 -31192 -57264 -115316 -198482 -121476 -77104 -92781 -82418 -76621 -54033
23802 -54033 52514 121215 -56703 -59186 22308 92277 177468 114909 -22694 -90593 -96560
$$ packed form
23885a12231J46657j02419K1197N5242O3857K2605r8497j29568p5842P2043J49407
23874A2451J11628l8323r7203r3466k9244Q5208L316j8893P9235Q4825j672q978
23862H8884o2961K029k8378L8594K6374k6947R9830j9689j19661o4166p681L0248
23850d3524o9785M7772o3724m5701M8877Q6837r1074j9159P7514j7O7464M1429
23838C6909O3590m0248o0097R505q1526k4913L3398K8237K4649L8724J04489n3458
23826G9259o2025j8437j02525J7240N2206r5523m125N6472p650j1595R2687Q4274
23814H0258L7542q1775o7217k6072n8052q3166P7006M4372j5677J0363N797K2588
23802e4033J06547O8701j77918k483Q1494O9969Q5191o2559j37603o7899n967
$$ plain form
23791 -96560 -108435 -36620 51871 80581 -13619 -37905 15397 -12630 -105998 -14207 32656 95856
23779 95856 190536 62227 6636 -11863 -40998 50764 42108 121590 175046 199687 97118
23768 97118 52917 25665 -12982 34731 70479 -55048 -53324 19755 15347 77887 137395 108939
23756 108939 108091 96126 81143 42051 26377 910 -7052 37610 99634 42658 -14964 1155
23744 1155 -154507 -221922 -127107 -129259 -157615 15384 105950 -12594 -141030 -30948 50625
23733 50625 112085 181813 242800 92391 -34381 4809 -101736 -151270 -85466 -35300 -7268
23722 -7268 89338 93588 30635 -9015 78427 156718 115097 32430 -66789 -51008 -32517 -101364
23710 -101364 -30498 75319 137815 151106 170186 121959 104869 94732 119846 31055 -21948
$$ packed form
23791i6560j1875P1815Q8491K8710r4200k4286N3302k8027r3368R1791M6863O3200
23779I5856R4680j28309n5591j8499k9135R1762q656P9482N3456K4641j02569
23768I7118m4201k7252l8647M7713L5748j25527J724P3079m408O2540N9508k8456
23756A08939q48j1965j4983l9092j5674k5467p962M4662O2024n6976n7622J6119
23744A155j55662o7415R4815k152k8356J72999R0566j18544j28436J10082Q1573
23733E0625O1460O9728O0987j50409j26772L9190j06545m9534O5804N0166K8032
23722g268R6606M250o2953l9650Q7442P8291m1621q2667r9219J5781J8491o8847
23710a01364P0866J05817O2496J3291J9080m8227j7090j0137K5114q8791n3003
$$ plain form
23699 -21948 -32227 -82739 -129949 -143162 -103814 -88451 -73521 -58194 18632 53414 163938
23688 163938 174480 231274 294569 289428 204388 108822 85888 16423 39351 -6513 -12085 48797
23676 48797 75196 86326 75683 16226 -17595 20946 72588 120651 162794 161770 140589 101614
23664 101614 151867 126473 76439 12480 75098 132329 115189 82227 57314 -764 38002
23653 38002 89726 -49838 -88468 -64996 -58332 -60831 -83802 -65202 -46952 -82610 -32492 5587
23641 5587 60012 104270 74680 24736 96766 106577 112172 71685 14907 -37737 -64504 -124850
23629 -124850 -103748 -67256 60563 59855 -622 -51461 44729 65748 141564 180129 197327 167836
23617 167836 152654 50467 -48777 -30963 51072 139239 218196 204487 105772 35189 -19368
$$ packed form
23699b1948j0279n0512m7210j3213L9348J5363J4930J5327P6826L4782J10524
23688A63938J0542N6794O3295n141q5040r5566k2934o9465K2928m5864n572O0882
23676D8797K6399J1130j0643n9457l3821L8541N1642M8063M2143j024k1181l8975
23664A01614N0253k5394n0034o3959O2618N7231j7140l2962k4913n8078L8766
23653C8002N1724j39564l8630K3472O664k499k2971J8600J8250l5658N0118L8079
23641E587N4425M4258k9590m9944P2030R811N595m0487n6778n2644k6767o0346
23629a24850K1102L6492J27819p08o0477n0839R6190K1019P5816L8565J7198k9491
23617A67836j5182j02187r9244J7814Q2035Q8167P8957j3709r8715p0583n4557
$$ plain form
23606 -19368 -133941 -196246 -58596 47962 66258 -8521 -57979 -49364 -89764 -53912 -24901
23595 -24901 15782 -42346 -149353 -101015 -39495 -95585 -4385 7051 -93029 -208399 -173499
23584 -173499 -123213 -87491 -73673 -84501 -148328 -174404 -181388 -41186 65242 38396 3127
23573 3127 -43366 -20750 -26674 32629 19161 54399 -744 -45650 -96215 -160997 -235930 -287947
23561 -287947 -214241 -54964 55026 131519 159914 218030 203477 122393 86030 95132 123413
23550 123413 178446 168131 61363 99630 68463 -9917 -30932 26978 94101 101381 90502
23539 90502 82712 105980 104958 151283 171236 138696 43748 13538 64106 102677 25213 -32099
23527 -32099 -2725 63690 -7908 -46840 6222 -19812 -65690 -125277 -82895 -4648 -19945 -94355
$$ packed form
23606a9368j14573o2305J37650J06558J8296p4779m9458Q615m0400L5852K9011
23595b4901M0683n8128j07007M8338O1520n6090R1200J1436j00080j15370L4900
23584a73499N0286L5722J3818j0828o3827k6076o984J40202J06428k6846l5269
23573C127m6493K2616n924N9303j3468L5238n5143m4906n0565o4782p4933n2017
23561b87947P3706J59277J09990P6493K8395N8116j4553q1084l6363R102K8281
23550A23413N5033j0315j06768L8267l1167p8380k1015N7910O7123P280j0879
23539I0502p790K3268j022M6325J9953l2540r4948l0210N0568L8571p7464n7312
23527c2099K9374O6415p1598l8932N3062k6034m5878n9587M2382P8247j5297p4410
$$ plain form
23515 -94355 -120697 -32371 93844 179872 144070 74553 93328 129596 129633 121823 183859 116624
23503 116624 32216 52425 230244 210152 174117 160640 146645 192193 150050 36108 18194
23492 18194 -28382 29079 -525 43020 96481 -19458 -80840 -100798 -53503 -59930 -148902 -139879
23480 -139879 -176895 -141082 -157479 -67884 -53175 -156557 -75126 -25319 -40334 42825 -9473
23469 -9473 -115748 -39645 60354 36953 63269 42777 60702 90906 75977 129105 180334 139445
23457 139445 -40682 -164411 -165344 -7944 110326 201912 102622 63802 63169 95719 106043
23446 106043 108338 26387 -27677 112088 195390 108778 18575 -12214 -141005 -122899 -45030
23435 -45030 -53682 -97518 -48567 59448 110082 18829 36978 110578 108508 87043 108915 83771
$$ packed form
23515i4355k6342Q8326J26215Q6028l5802o9517J8775L6268L7p810O2036o7235
23503A16624q4408K0209J77819k0092l6035j3477j3995M5548m2143j13942j7914
23492A8194m6576N7461k9604M3545N3461j15939o1382j9958M7295o427q8972R023
23480a39879l7016L5813j6397Q9595J4709j03382Q1431M9807j5015Q3159n2298
23469i473j06275P6103R9999k3401K6316k0492J7925L0204j4929N3128N1229m0889
23457A39445j80127j23729r33J57400J18270R1586r9290l8820o33L2550J0324
23446A06043K295q1951n4064J39765Q3302q6612r0203l0789j28791J8106P7869
23435d5030q652m3836M8951J08015N0634r1253J8149P3600k070k1465K1872k5144
$$ plain form
23423 83771 -34424 41707 43904 79879 91698 109216 44414 9097 10259 45201 12062 8694
23411 8694 -9501 -90628 -127976 -46385 31483 56394 20402 29241 4213 838 31223 145233
23399 145233 92650 57679 -118868 -189427 -115636 -15719 -91345 -54153 74817 58618 -11659
23388 -11659 -120769 -49825 -19197 -95151 -130649 -117625 -55241 8486 7129 -742 12005 38699
23376 38699 16271 39628 32328 51864 34224 -77559 -72676 -33335 103095 64692 98085 113704
23364 113704 89996 77685 71572 108584 114581 48312 63190 136671 136514 76350 15 -167349
23352 -167349 -198246 -85664 -54956 -54651 6861 -17805 -44294 -1954 40949 70087 197541
23341 197541 172438 103318 61234 -52027 -85337 -108680 -129917 -79342 12236 49379 17510
$$ packed form
23423H3771j18195P6131K197L5975J1819J7518o4802l5317J162L4942l3139l368
23411H694j8195q1127l7348Q1591P7868K4911l5992Q839k5028l375L0385J14010
23399A45233n2583l4971j76547p0559P3791R9917p5626L7192J28970j6199p0277
23388a1659j09110P0944L0628p5954l5498J3024O2384O3727j357p871J2747K6694
23376C8699k2428K3357p300J9536j7640j11783M883L9341J36430l8403L3393J5619
23364A13704k3708j2311o113L7012N997o6269J4878P3481j57o0164p6335j67364
23352a67349l0897J12582L0708L05O1512k4666k6489M2340M2903K9138J27454
23341A97541k5103o9120m2084j13261l3310k3343k1237N0575R1578L7143l1869
$$ plain form
23330 17510 2902 -101534 -128040 -110372 -74738 -64828 -114434 -98318 -24134 -49112 -59955 -10419
23318 -10419 -50856 -88358 -16848 -51885 -54137 8469 33012 114979 216495 160539 126834 -18972
23306 -18972 -40770 -17911 73289 64414 21632 37419 134179 187772 99371 131265 101431 83361
23294 83361 17815 -148991 -226538 -187366 -169875 -87419 -53843 -51089 5490 140547 147576 111496
23282 111496 151414 161342 110626 44486 -1058 -35298 -94338 -87706 -111223 -34023 -37624 -42130
23270 -42130 -35824 33783 46939 71251 61332 162288 158859 53184 9272 -23107 -101697 -137811
23258 -137811 -54348 29531 92528 105673 126733 -62969 -107540 30859 119638 134010 177264
23247 177264 174545 108492 -45183 -30021 -91571 -125633 -65770 -18302 38094 108843 93949
$$ packed form
23330A7510j4608j04436k6506J7668L5634R910m9606J6116P4184k4978j0843M9536
23318a0419m0437l7502P1510l5037k252O2606K4543Q1967J01516n5956l3705j45806
23306a8972k1798K2859R1200q875m2782J5787R6760N3593q8401L1894k9834j8070
23294H3361o5546j66806p7547L9172J7491Q2456L3576K754N6579J35057P029l6080
23282A11496L9918R928n0716o6140m5544l4240n9040O632k3517P7200l601m506
23270d2130O306O9607J3156K4312r919J00956l429j05675m3912l2379p8590l6114
23258a37811Q3463Q3879O2997J3145K1060j89702m4571J38399Q8779J4372M3254
23247A77264k719o6053j53675J5162o1550l4062N9863M7468N6396P0749j4894
$$ plain form
23236 93949 19558 -49220 -32886 -21889 66685 50147 35042 50716 -56695 -66758 -596
23225 -596 53798 53163 7470 57208 -23166 -117050 -83607 -40864 53783 120026 100690 91726 67219
23212 67219 -57416 -103114 -93501 -7157 79285 66780 31108 71018 118513 128080 91852 38403
23200 38403 31954 38656 110691 234866 231785 122530 -43005 -124561 -54959 71434 142504
23189 142504 84252 -68281 -9001 -1561 -39508 -35707 -114981 -170817 -181647 -138237 -53223 -8507
23177 -8507 -367 771 -59732 -30893 5029 -65889 -42376 -34421 42594 17496 126784 73120
23165 73120 35573 39382 119888 117202 82169 6630 -12494 -46902 -1709 -10861 -79998 -110255
23153 -110255 -123868 -12692 -33391 -61312 -14778 37030 131716 137545 105300 130037 149785
$$ packed form
23236I3949p4391o8778J6334J0997Q8574j6538j5105J5674j07411j0063O6162
23225e96N4394o35m5693M9738q0374r3884L3443M2743R4647O6243j9336q964k4507
23212F7219j24635m5698R613Q6344Q6442j2505l5672L9910M7495R567l6228n3449
23200C8403o449O702P2035J24175l081j09255j65535q1556O9602J26393P1070
23189A42504n8252j52533N9280P440l7947L801p9274n5836j0830M3410Q5014M4716
23177h507Q140J138o0503K8839L5922p0918K3513P955P7015k5098J09288n3664
23165G3120l7547L809Q0506k686l5033p5539j9124l4408M5193r152o9137l0257
23153a10255j3613J11176k0699k7921M6534N1808R4686N829l2245K4737J9748
$$ plain form
23142 149785 57729 17244 -39100 -92290 -79098 -4298 54737 -71019 -101675 26904 68125
23131 68125 127905 119640 87221 117839 69994 -24998 -45586 -80879 -29842 55250 46163 78666
23119 78666 45924 67018 8271 -38143 81732 208461 83444 -4791 -13759 30950 99723
23108 99723 121056 100547 71038 35037 19040 -29941 105189 117382 143254 79526 17517
23097 17517 27633 84647 133253 65641 49467 -12475 42396 137526 134238 100642 26376 -42635
23085 -42635 -11381 19474 -99418 -271147 -246872 -129547 -44935 77218 141943 87835 19468
23074 19468 88050 133263 52770 39861 35809 61469 68581 35071 11288 -27711 12353 115894
23062 115894 138269 52241 -66462 -111242 -54321 59608 98319 7491 -49261 -24321 -4558
$$ packed form
23142A49785r2056m0485n6344n3190J3192P4800N9035j25756l0656J28579M1221
23131F8125N9780q265l2419L0618m7845r4992k0588l5293N1037Q5092r087L2503
23119G8666l2742K1094n8747m6414J19875J26729j25017q8235q968M4709O8773
23108I9723K1333k0509k9509l6001j5997m8981J35130J2193K5872o3728o2009
23097A7517J0116N7014M8606o7612j6174o1942N4871R5130l288l3596p4266o9011
23085d2635L1254L0855j18892j71729K4275J17325Q4612J22153O4725n4108o8367
23074A9468O8582M5213q0493j2909m052K5660P112l3510k3783l8999M0064J03541
23062A15894K2375q6028j18703m4780N6921J13929L8711r0828n6752K4940J9763
$$ plain form
23051 -4558 -25294 -14521 -20761 -22968 14569 99834 68923 104525 129479 169525 257128 272384
23039 272384 361904 571304 879695 1266872 1537887 1734880 1826952 1811501 1692845 1473624
23029 1473624 1147766 830693 537981 315637 218714 204027 95539 77562 111497 132226
23019 132226 193486 212515 152854 82755 -50450 -58411 -65659 -126835 -121415 -28783 44832 5010
23007 5010 -35973 -14770 86709 52700 -11990 1886 72180 2820 -13467 -16311 20775 17968
22995 17968 -47779 -20373 4118 21281 42490 34736 134217 111596 69181 40138 65685 61482
22983 61482 34783 38432 -643 -11736 39097 65407 104331 41124 -44440 -50126 -57341 -129386
22971 -129386 -93682 -63085 -123824 -139756 -108743 -54402 38976 72769 95277 75462 69970 61477
$$ packed form
23051d558k0736J0773o240k207L7537Q5265l0911L5602K4954M0046Q7603J5256
23039B72384Q9520K09400L08391L87177K71015J96993R2072j5451j18656k19221
23029A473624l25858l17073k92712k22344r6923j4687j08488j7977L3935K0729
23019A32226O1260J9029n9661p0099j33205p961p248o1176N420R2632P3615l9822
23007E010m0983K1203J01479l4009o4690J3876P0294o9360j6287k844L7086k807
22995A7968o5747K7406K4491J7163K1209p754R9481k2621m2415k9043K5547m203
22983F1482k6699L649l9075j1093N0833K6310L8924o3207q5564n686p215p2045
22971a29386L5704L0597o0739j5932L1013N4341R3378L3793K2508j9815n492q493
$$ plain form
22959 61477 56189 37998 97135 85977 24091 56761 -1156 -74548 -20252 31489 118024 102181
22947 102181 149874 119404 15684 6734 -22721 6824 95380 158678 181416 114529 16575
22936 16575 -40422 21571 103413 55446 -46106 -122311 -145666 -83450 28146 74899 123965
22925 123965 141170 105922 143294 156770 105371 60367 82253 96479 93860 102817 119009 132496
22913 132496 101512 87317 221628 223854 209609 135573 75940 169003 264366 174132 172748 53469
22901 53469 -9936 1676 -62884 -75701 -49381 14823 29207 -7316 -70157 -7323 82633 104124
22889 104124 96995 37141 85183 79680 46860 12440 56858 66225 77637 37699 50720 -10935
22877 -10935 -28678 -129928 -142115 -82600 20416 64032 95923 -32927 -139587 -27808 88858
$$ packed form
22959F1477n288j8191N9137j1158o1886L2670n7917p3392N4296N1741Q6535j5843
22947A02181M7693l0470j03720q950k9455K9545Q8556O3298K2738o6887r7954
22936A6575n6997O1993Q1842m7967j01552p6205k3355O2216J11596M6753M9066
22925A23965J7205l5248L7372J3476n1399m5004K1886J4226k619Q957J6192J3487
22913A32496l0984j4195J34311K226j4245p4036n9633R3063R5363r0234j384j19279
22901E3469o3405J1612o4560j2817K6320O4204J4384l6523o2841O2834Q9956K1491
22889A04124p129n9854M8042n503l2820l4420M4418R367J1412l9938J3021o1655
22877a0935j7743j01250j2187N9515J03016M3616L1891j28850j06660J11779J16666
$$ plain form
22866 88858 118455 160595 148709 83842 71341 -1138 21993 97124 145991 164858 106265 74972
22854 74972 28708 78189 1630 -62120 20963 133158 114700 65231 129984 125821 60800 44796
22842 44796 56972 61305 61317 100331 131656 64340 -130954 -112345 -28479 -3971 -14349 -63757
22830 -63757 -152173 -148025 -108279 -16180 63495 81828 70747 52804 53749 167264 148148 109111
22818 109111 85220 68624 193207 284849 191350 52545 -44803 6788 72604 139220 116445
22807 116445 56890 -53400 -103921 -55243 14578 22657 36068 28980 -3961 -62814 -46848 -53734
22795 -53734 -51815 60144 134560 52972 95986 243153 194895 205838 20564 6691 88121
22784 88121 32067 13540 27901 -7288 117683 179087 79479 37046 -72947 -173718 -193977
$$ packed form
22866H8858K9597M2140j1886o4867j2501p2479K3131P5131M8867J8867n8593l1293
22854G4972m6264M9481p6559o3750Q3083J12195j8458m9469O4753m163o5021j6004
22842D4796J2176M333J2L9014L1325o7316j95294J8609Q3866K4508j0378m9408
22830f3757q8416M148L9746R2099P9675J8333j1081j7943R45J13515j9116l9037
22818A09111k3891j6596J24583R1642r3499j38805r7348N1591O5816O6616k2775
22807A16445n9555j10290n0521M8678O9821Q079J3411p088l2941n8853J5966o886
22795e3734J919J11959P4416q1588M3014J47167m8258J0943j85274j3873Q1430
22784H8121n6054j8527J4361l5189J24971O1404r9608m2433j09993j00771k0259
$$ plain form
22773 -193977 -172294 -100105 23203 41232 75832 27789 43727 99567 85844 54343 34587
22762 34587 -40008 -116039 -58319 63202 76117 2472 -179713 -227230 -105807 -76106 -84520
22751 -84520 -124015 -122471 -9479 36474 -8534 -22647 -60147 -102407 -75999 -64009 51522
22740 51522 122173 165349 137336 205619 128821 67308 -19508 -118115 -226428 -299386 -212573
22729 -212573 -27370 122145 278221 386063 633535 886017 983440 1043763 1102874 1088030
22719 1088030 1138777 1148718 994339 656851 421971 326939 357048 338370 363714 346543 382256
22708 382256 492658 521230 436372 356338 315364 231857 228791 160884 25155 -47575 5140
22697 5140 20132 105120 120095 145221 142633 40397 12232 94274 96688 65572 81575 125968
$$ packed form
22773a93977K1683P2189J23308J8029L4600m8043J5938N5840j3723l1501j9756
22762C4587p4595p6031N7720J21521J2915p3645j82185m7517J21423K9701q414
22751h4520l9495J544J12992M5953m5008j4113l7500m2260K6408J1990J15531
22740E1522P0651M3176k8013O8283p6798o1513q6816r8607j08313p2958Q6813
22729b12573J85203J49515J56076J07842K47472K52482R7423O0323N9111j4844
22719A088030N0747R941j54379l37488k34880r5032L0109j8678K5344j7171L5713
22708C82256J10402K8572q4858q0034m0974q3507l066o7907j35729p2730N2715
22697E140J4992Q4988J4975K5126k588j02236k8165Q2042K414l1116J6003M4393
$$ plain form
22685 125968 146546 230083 273849 301323 168824 90463 178895 187670 92314 100359 166629 158804
22673 158804 60216 47558 150688 208684 143579 204814 321317 345023 303338 204604 148201
22662 148201 131567 82924 -12504 22259 170494 178467 108489 136619 205525 220475 177740
22651 177740 207596 190395 118558 442 39443 126260 157331 188967 185199 186394 267135 226991
22639 226991 120024 26534 34780 38966 91417 135814 211207 256422 223344 186717 89069 43854
22627 43854 76938 92983 112373 99817 177902 240484 306927 296321 199939 150302 61578 49719
22615 49719 46003 -65320 51324 113875 165475 148789 132322 81231 120338 169839 168436 126664
22603 126664 167498 166743 178660 60675 29110 112295 175801 203723 241120 251889 285658 360853
$$ packed form
22685A25968K0578Q3537M3766K7474j32499p8361Q8432Q775r5356Q045O6270p825
22673A58804r8588j2658J03130N7996o5105O1235J16503K3706m1685r8734n6403
22662A48201j6634m8643r5428L4763J48235P973o9978K8130O8906J4950m2735
22651A77740K9856j7201p1837j18116L9001Q6817L1071L1636l768J195Q0741m0144
22639B26991j06967r3490Q246M186N2451M4397P5393M5215l3078l6627r7648m5215
22627D3854L3084J6045J9390j2556P8085O2582O6443j0606r6382m9637q8724j1859
22615D9719l716j11323J16644O2551N1600j6686j6467n1091L9107M9501j403m1772
22603A26664M0834p55J1917j17985l1565Q3185O3506K7922L7397J0769L3769P5195
$$ plain form
22591 360853 347389 403669 514190 598571 704226 644014 489494 550329 623034 597146 545725
22580 545725 535674 588566 639755 603722 545618 601903 669387 578393 456133 400302 348228
22569 348228 387916 458850 494609 543262 562800 498881 497491 533639 546079 368734 351124
22558 351124 490712 512969 520941 415607 373224 374774 355079 403413 413151 350629 348397 424868
22546 424868 456960 469054 569471 567682 443771 393301 379579 470881 552304 524027 615439
22535 615439 626004 815007 1144690 1560028 1872228 1908125 1935972 1897484 2017515 2144177
22525 2144177 1909612 1568244 1344432 1133305 964412 837398 750769 680096 612925 530758
22515 530758 548898 618062 619583 735684 761332 801356 916877 999404 1060998 1054059 937873
$$ packed form
22591C60853j3464N6280J10521Q4381J05655o0212j54520O0835P2705k5888n1421
22580E45725j0051N2892N1189l6033n8104N6285O7484r0994j22260n5831n2074
22569C48228L9688P0934L5759M8653J9538o3919j390L6148J2440j77345j7610
22558C51124J39588K2257P972j05334m2383J550j9695M8334R738o2522k232P6471
22546D24868L2092J2094J00417j789j23911n0470j3722R1302Q1423k8277R1412
22535F15439J0565J89003L29683M15338L12200L5897K7847l8488J20031J26662
22525B144177k34565l41368k23812k11127j68893j27014q6629p0673o7171q2167
22515E30758J8140O9164J521J16101K5648M0024J15521Q2527O1594o939j16186
$$ plain form
22504 937873 845396 803128 939684 1119275 1156680 1137519 1107153 1207424 1298221 1311492 1328695
22493 1328695 1454282 1553018 1572258 1712655 1805013 1819971 1865968 2019101 2214450 2454269
22483 2454269 2637290 2689926 2814966 3075625 3287560 3591971 3960449 4361513 4778259 5314365
22473 5314365 5964498 6638031 7453255 8418765 9674756 11314845 13388672 16056255 19289383
22464 19289383 23526850 29382430 38083395 51580476 73902184 113326575 176643680
22457 176643680 243961554 286788294 300145914 306313043 314632022 306357469 265935825
22450 265935825 203996414 146566744 103605367 72032082 50937485 37596057 29092309
22443 29092309 23197034 18666845 15198699 12696811 10694009 9125890 7930704 6914249
$$ packed form
22504I37873r2477m2268J36556J79591L7405j9161l0366J00271R0797J3271J7203
22493A328695J25587R8736J9240J40397R2358J4958M5997J53133J95349K39819
22483B454269J83021N2636J25040K60659K11935L04411L68478M01064M16746N36106
22473E314365O50133O73533Q15224R65510J255991J640089K073827K667583L233128
22464A9289383M237467N855580Q700965J3497081K2321708L9424391O3317105
22457A76643680O7317874M2826740J3357620O167129Q318979q274553m0421644
22450B65935825o1939411n7429670m2961377l1573285k1094597j3341428q503748
22443B9092309n895275m530189l468146k501888k002802j568119j195186j016455
$$ plain form
22435 6914249 6048745 5341695 4754374 4260762 3846634 3442712 3172845 2924843 2732923
22426 2732923 2497805 2380458 2284849 2200702 1996438 1810603 1806102 1780197 1637057 1523895
22416 1523895 1348583 1253389 1265834 1219065 1144026 1086734 1038772 912538 865776 913997 867591
22405 867591 822564 853567 911074 915888 915142 887556 797970 765674 613279 533620 470780 527081
22393 527081 532421 523826 451232 470207 528259 529419 472141 465482 551439 758461 983043 1336730
22381 1336730 1775349 2007184 2115016 2161882 2084604 1830513 1607539 1331106 1047679 928725
22371 928725 704484 442132 363921 341824 282146 348021 376356 383621 366511 336395 244219
22360 244219 162550 108169 74316 86305 120831 96498 42881 -6339 11606 21909 10296
$$ packed form
22435F914249q65504p07050n87321m93612m14128m03922k69867k48002j91920
22426B732923k35118j17347r5609q4147k04264j85835m501k5905j43140j13162
22416A523895j75312r5194J2445m6769p5039n7292m7962j26234m6762M8221m6406
22405H67591m5027L1003N7507M814p46k7586q9586l2296j52395p9659o2840N6301
22393E27081N340q595p2594J8975N8052J160n7278o659Q5957K07022K24582L53687
22381A336730M38619K31835J07832M6866p7278k54091k22974k76433k83427j18954
22371I28725k24241k62352p8211k2097n9678O5875K8335P265j7110l0116r2176
22360B44219q1669n4381l3853J1989L4526k4333n3617m9220J7945J0303j1613
$$ plain form
22349 10296 16415 78918 95823 -40026 -72147 105063 175687 127191 31789 121077 150846
22338 150846 165224 186609 121213 77945 26951 73734 101896 160076 169426 147717 160481 206002
22326 206002 160137 185940 153168 158798 156329 154777 101999 152326 187356 234063 162707 167782
22314 167782 178287 134906 13135 -9393 29060 121432 55868 -82067 -66241 -62930 -6830
22303 -6830 -18811 -62605 -37314 -5073 -858 -28701 46237 53536 25935 87627 59387 146126
22291 146126 163585 164309 112943 43156 28177 153009 214024 132172 101983 112140 117632 175755
22279 175755 228949 80419 32690 63777 107281 100545 39468 19003 104562 184433 200529
22268 200529 106421 -26498 -100905 -78848 9151 33210 95284 151769 158392 163641 143830 22892
$$ packed form
22349A0296O119O2503J6905j35849l2121J77210P0624m8496r5402Q9288K9769
22338A50846J4378K1385o5396m3268n0994M6783K8162N8180R350k1709J2764M5521
22326B06002m5865K5803l2772N630k469j552n2778N0327L5030M6707p1356N075
22314A67782J0505m3381j21771k2528L8453R2372o5564j37935J5826L311N6100
22303f830j1981m3794K5291L2241M215k7843P4938P299k7601O1692k8240Q6739
22291A46126J7459P24n1366o9787j4979J24832O1015q1852l0189J0157N492N8123
22279A75755N3194j48530m7729L1087M3504o736o1077k0465Q5559P9871J6096
22268B00529r4108j32919p4407K2057Q7999K4059O2074N6485O623N249j9811j20938
$$ plain form
22256 22892 -21216 -28977 -45296 91501 92227 145447 178088 198553 206603 192055 139691 109816
22244 109816 111721 93005 82943 66385 -11268 -88425 3272 64569 20035 23376 25337 -69856
22232 -69856 -17006 -45111 -146828 -197136 -99774 -91901 -207624 -201477 -81179 -67466 -56180
22221 -56180 30098 78362 82528 115378 64389 -10630 -62386 61550 125153 30864 88134 98732
22209 98732 -36772 -105422 -16928 57046 45606 45339 54244 48319 5552 -33958 14189 -41097
22197 -41097 -57102 -28218 -30552 -63112 1357 114371 131636 145263 251896 154778 12229
22186 12229 15636 -18436 -33260 40513 50782 58653 32652 68886 121130 69652 -15337 -4177
22174 -4177 -3896 98490 71578 -13299 -67807 -111694 -95654 -92771 -42162 -1099 72969 33181
$$ packed form
22256B2892m4108p761j6319J36797P26N3220L2641K0465Q050j4548n2364k9875
22244A09816J905j8716j0062j6558p7653p7157R1697O1297m4534L341J961r5193
22232f9856N2850k8105j01717n0308R7362P873j15723O147J20298J3713J1286
22221e6180Q6278M8264M166L2850n0989p5019n1756J23936O3603r4289N7270J0598
22209I8732j35504o8650Q8494P3974j1440k67Q905n925m2767l9510M8147n5286
22197d1097j6005K8884k334l2560O4469J13014J7265J3627J06633r7118j42549
22186A2229L407l4072j4824P3773J0269P871k6001L6234N2244n1478q4989J1160
22174d177K81J02386k6912q4877n4508m3887J6040K883N0609M1063P4068l9788
$$ plain form
22162 33181 -32475 -49442 31432 133394 163208 96142 138786 169878 264521 224133 174107
22151 174107 144038 119953 21519 -15322 -33399 -71629 -168468 -179929 -76148 -102840 -119791
22140 -119791 -171355 -198533 -164110 -85400 -65210 -12881 9390 -29302 -97485 -98086 -116362 -100220
22128 -100220 -5823 -35215 -75924 -110947 -162406 -96829 -13441 -65012 -115196 -107627 -48315 76460
22116 76460 63162 60955 130294 192420 145244 20133 -102760 -61157 -48912 -91639 -117509
22105 -117509 -97292 -133480 -95263 -168420 -93877 -50605 -42247 -7866 -5541 33825 15827 -28772
22093 -28772 -101718 -145768 -96563 -149967 -119724 -35697 -10812 -24356 -26800 -30119 11720 34896
22081 34896 -59504 -86485 -12149 11237 -21599 -18805 -20063 35310 70564 -17096 -84708 -72917
$$ packed form
22162C3181o5656j6967Q0874J01962K9814o7066M2644L1092R4643m0388n0026
22151A74107l0069k4085r8434l6841j8077l8230r6839j1461J03781k6692j6951
22140a19791n1564k7178L4423P8710K0190N2329K2271l8692o8183o01j8276J6142
22128a00220R4397k9392m0709l5023n1459O5577Q3388n1571n0184P569N9312J24775
22116G6460j3298k207O9339O2126m7176j25111j22893M1603J2245m2727k5870
22105a17509K0217l6188L8217p3157P4543M3272Q358L4381K325L9366j7998m4599
22093b8772p2946m4050M9205n3404L0243Q4027K4885j3544k444l319M1839K3176
22081C4896r4400k6981P4336K3386l2836K794j258N5373L5254q7660o7612J1791
$$ plain form
22069 -72917 -84067 -125685 -90460 -50320 -91815 -120915 -84619 -96928 -53348 77186 90592
22058 90592 9926 -121143 -101178 -68448 -38866 148805 198245 188116 129085 -4517 -121417
22047 -121417 -77802 -84391 -136223 -76290 -72849 -90249 -36105 22611 101889 49721 -4857 -51106
22035 -51106 32491 31457 -9890 -49329 -62054 38781 54651 10944 -22609 -50715 -131365 -160142
22023 -160142 -26411 8922 -112003 -166193 -125880 -63282 -97320 -121575 -75104 45351 -7073
22012 -7073 -27584 -86809 -128738 -88964 -128857 -103722 -112841 -66556 -48774 -116605 -91247 20365
22000 20365 167594 152237 6496 -85295 33804 70149 46327 -20265 19861 7652 -32350
21989 -32350 12927 -72926 -47320 -45744 -88578 -110069 -108550 -63368 4475 -21806 -105209 -97646
$$ packed form
22069g2917j1150m1618L5225M0140m1495k9100L6296j2309M3580J30534J3406
22058I0592q0666j31069J9965L2730K9582J87671M9440j0129n9031j33602j16900
22047a21417M3615o589n1832N9933L441j7400N4144N8716P9278n2168n4578m6249
22035e1106Q3597j034m1347l9439j2725J00835J5870m3707l3553k8106q0650k8777
22023a60142J33731L5333j20925n4190M0313O2598l4038k4255M6471J20455n2424
22012g073k0511n9225m1929L9774l9893K5135r119M6285J7782o7831K5358J11612
22000B0365J47229j5357j45741r1791J19099L6345k3822o6592M0126j2209m0002
21989c2350M5277q5853K5606J576m2834k1491J519M5182O7843k6281q3403P563
$$ plain form
21977 -97646 65392 79621 7924 22806 51124 71298 86015 120132 52554 -74448 -18427
21966 -18427 31118 29023 9611 3871 43143 73615 71221 -6031 -33527 8076 -44428 -67229
21954 -67229 -48364 -2501 11452 -7937 -88875 -142120 -148925 -32496 -103021 -122079 -78723 -90195
21942 -90195 -106563 -92955 -89570 -94387 -43257 -52577 -23539 -126688 -159418 -62065 6726 33197
21930 33197 86809 54589 97117 220498 254227 225552 213256 185822 154786 67649 -40809
21919 -40809 -2270 85326 140100 136991 92398 -5207 -156363 -239263 -165399 -87733 -69925 -51558
21907 -51558 -72579 -6459 -80963 -128577 -125869 -191579 -215549 -237602 -162858 -157672 -109609 -26764
21895 -26764 -28853 -77370 -37314 -13197 34689 115063 141555 107727 106237 30017 -85342 -26141
$$ packed form
21977i7646J63038J4229p1697J4882K8318K0174J4717L4117o7578j27002N6021
21966a8427M9545k095j9412n740L9272L0472k394p7252k7496M1603n2504k2801
21954f7229J8865M5863J3953j9389q0938n3245o805J16429p0525j9058M3356j1472
21942i0195j6368J3608L385m817N1130r320K9038j03149l2730R7353O8791K6471
21930C3197N3612l2220M2528J23381L3729k8675j2296k7434l1036q7137j08458
21919d0809L8539Q7596N4774l109m4593r7605j51156q2900P3864P7666J7808J8367
21907e1558k1021O6120p4504m7614K708o5710k3970k2053P4744N186M8063Q2845
21895b6764k089m8517M0056K4117M7886Q0374K6492l3828j490p6220j15359N9201
$$ plain form
21883 -26141 108019 86316 -66468 -104268 -104993 -21122 157920 228349 275339 280502 182572 255998
21871 255998 437183 782297 1189762 1514150 1604709 1674047 1724065 1657602 1446415 1113825
21861 1113825 862600 662630 402975 241417 163068 129877 125974 38895 77278 142899 114945
21850 114945 82957 67863 82439 89826 31247 123124 139590 125791 148655 131137 166051 74058
21838 74058 55484 125861 143356 129582 114636 132178 151592 131767 147237 109576 65683 2187
21826 2187 -11526 84512 79622 13382 -163027 -292036 -221723 -30439 107422 139780 35256
21815 35256 -3941 -108425 -127783 -56578 13090 -10940 25123 95395 35232 -41867 -22599
21804 -22599 4024 -16893 -47226 -83648 9018 -13080 -39147 -123191 -106962 -81407 22085
$$ packed form
21883b6141J34160k1703j52784l7800p25Q3871J79042P0429M6990N163r7930P3426
21871B55998J81185L45114M07465L24388R0559O9338N0018o6463k11187l32590
21861A113825k51225j99970k59655j61558p8349l3191l903q7079L8383O5621k7954
21850A14945l1988j5094J4576P387n8579R1877J6466j3799K2864j7518L4914r1993
21838G4058j8574P0377J7495j3774j4946J7542J9414j9825J5470l7661m3893o3496
21826B187j3713R6038m890o6240j76409j29009P0313J91284J37861L2358j04524
21815C5256l9197j04484j9358P1205O9668k4030L6063P0272o0163p7099J9268
21804b2599K6623k0917l0333l6422R2666k2098k6067q4044J6229K5555J03492
$$ plain form
21793 22085 102036 85763 74294 63204 34280 -43956 -42896 -5810 -51130 -30342 75135 10504
21781 10504 10485 -54843 -76455 -131033 -158918 -180760 -87737 -53279 -102620 -8871 -67005 -102493
21769 -102493 9824 30433 -40351 -86384 -94881 -143703 -158371 -144850 -91822 -61550 -107950
21758 -107950 -72800 -112145 -101743 -134109 -115260 -139211 -76605 -120191 -91263 -26698 -26288 -16812
21746 -16812 -42387 -104348 -189544 -135899 -68937 -19792 7495 39776 650 8012 87015 39947
21734 39947 -24639 -54187 -12599 -8787 -22099 -95359 -100484 -54654 -21541 1067 -22773 -46401
21722 -46401 -40053 10660 116920 104055 65371 87448 125246 162820 103740 52797 100928 162237
21710 162237 127648 48170 62194 148232 85311 70432 152010 140034 34541 15101 7776
$$ packed form
21793B2085P9951j6273j1469j1090k8924p8236J060L7086m5320K0788J05477o4631
21781A0504j9o5328k1612n4578k7885k1842R3023L4458m9341R3749n8134l5488
21769a02493J12317K0609p0784m6033q497m8822j4668J3521N3028L0272m6400
21758a07950L5150l9345J0402l2366J8849k3951O2606m3586K8928O4565M10R476
21746a6812k5575o1961q5196N3645O6962M9145K7287L2281l9126P362P9003m7068
21734C9947o4586k9548M1588L812j3312p3260n125M5830L3113K2608k3840k3628
21722d6401O348N0713J06260j2865l8684K2077L7798L7574n9080n0943M8131O1309
21710A62237l4589p9478J4024Q6038o2921j4879Q1578j1976j05493j9440p325
$$ plain form
21699 7776 -18476 109794 198240 123141 29519 -21480 -65506 -18644 86704 95196 36500 119714
21687 119714 165738 163360 145137 120769 130131 98130 9786 -75233 -26549 -14587 -77759 -1209
21675 -1209 19534 19922 -13994 -88628 -23605 63050 121571 29565 -23231 -45606 61091 -30007
21663 -30007 -79398 -134552 -125061 -170408 -224091 -266871 -257734 -168413 -42636 -72242 -156641 -205585
21651 -205585 -310221 -335660 -202297 -86601 -47832 -160312 -206822 -163225 -67641 -148659 -139094
21640 -139094 -136021 -143183 -119191 -107117 -44886 -6758 3627 1866 -22519 71465 59748 2185
21628 2185 -65421 -72548 -33054 -33043 -37835 -66506 -38778 17377 31591 -24471 -130345 -227444 -184997
21615 -184997 -29913 32557 17602 -36620 -22230 -56619 -21781 87397 8941 -79663 -44523
$$ packed form
21699G776k6252J28270Q8446p5099r3622n0999m4026M6862J05348Q492n8696Q3214
21687A19714M6024k378j8223k4368R362l2001q8344q5019M8684J1962o3172P6550
21675a209K0743L88l3916p4634O5023Q6655N8521r2006n2796k2375J06697r1098
21663c0007m9391n5154R491m5347n3683m2780R137Q9321J25777k9606q4399m8944
21651b05585j04636k5439J33363J15696L8769j12480m6510M3597R5584q1018R565
21640a39094L073p162K3992J2074O2231L8128J0385j761k4385R3984j1717n7563
21628B185o7606p127L9494J1m792k8671K7728N6155J4214n6062j05874r7099M2447
21615a84997J55084O2470j4955n4222J4390l4389L4838J09178p8456q8604L5140
$$ plain form
21604 -44523 -27177 -28931 -69209 -39097 -52705 -29682 -32064 -80386 -99750 -41019 60869 185337
21592 185337 233921 100804 56698 -3274 -25331 18333 102153 148324 57170 -36013 -23029
21581 -23029 48279 54256 105131 33578 44796 71536 -6476 -8494 21585 -8098 -68234 -4332
21569 -4332 26229 16424 -35611 -37564 17031 -75261 -151038 -141209 -119056 -134120 -51564 -3394
21557 -3394 -71166 -154704 13376 131150 111996 10104 -37867 -27700 93777 168326 37878
21546 37878 11481 69977 52632 26620 47243 13770 -1313 26643 -13805 -64474 -120414 -49222
21534 -49222 -63515 -75574 -105350 -55006 -106555 -222801 -176296 -119589 5559 69455 57922
21523 57922 71326 97218 103903 55236 -26288 -110684 -117239 -54307 -22909 -4590 -15761 -115511
$$ packed form
21604d4523J7346j754m0278L0112j3608K3023k382m8322j9364N8731J01888J24468
21592A85337M8584j33117m4106n9972k2057M3664Q3820M6171r1154r3183J2984
21581b3029P1308N977N0875p1553J1218K6740p8012k018L0079k9683o0136O3902
21569d332L0561r805n2035j953N4595r2292p5777R829K2153j5064Q2556M8170
21557c394o7772q3538J68080J17774j9154j01892m7971J0167J21477P4549j30448
21546C7878k6397N8496j7345k6012K0623l3473j5083K7956m0448n0669n5940P1192
21534d9222j4293j2059k9776N0344n1549j16246M6505N6707J25148O3896j1533
21523E7922J3404K5892O685m8667q1524q4396o555O2932L1398J8319j1171r9750
$$ plain form
21511 -115511 -102305 -72177 -25379 17677 -35318 -43948 55496 17540 -82440 -104705 -57427 77132
21499 77132 168257 139660 12114 -129794 -93011 3021 24857 21604 25759 -14773 69040 62638
21487 62638 -71043 -14886 61615 72029 25991 49440 39921 31388 14619 99148 51356 -101511
21475 -101511 -27971 -70902 -45103 -81630 27098 93244 73575 49903 -40360 -82813 -42202
21464 -42202 -6702 -35866 -1611 -30083 29122 47948 14796 65486 53566 48125 4603 -35721
21452 -35721 -31068 -4114 15807 48434 116370 116246 87887 129608 164587 113654 53934 8097
21440 8097 76691 152215 54154 -6228 36267 -17971 -19744 13352 97875 57085 12191 -9698
21428 -9698 -116070 -152906 -167958 -115375 -49707 -15993 32545 89314 97748 36701 -749 -63266
$$ packed form
21511a15511J3206L0128M6798M3056n2995q630R9444l7956r9980k2265M7278J34559
21499G7132R1125k8597j27546j41908L6783R6032K1836l253M155m0532Q3813o402
21487F2638j33681N6157P6501J0414m6038K3449r519q533j6769Q4529m7792j52867
21475a01511P3540m2931K5799l6527J08728O6146j9669k3672r0263m2453M0611
21464d2202L5500k9164L4255k8472N9205J8826l3152N0690j1920n441m3522m0324
21452c5721M653K6954J9921L2627O7936j24k8359M1721L4979n0933n9720m5837
21440H097O8594P5524r8061o0382M2495n4238j773L3096Q4523m0790m4894k1889
21428i698j06372l6836j5052N2583O5668L3714M8538N6769Q434o1047l7450o2517
$$ plain form
21416 -63266 -47132 -111343 -99054 -4979 -15443 -77837 -66682 -47153 -68846 -54861 32035 86864
21404 86864 132833 109086 8172 -72598 -92786 -63628 -86107 -165198 -179275 -182757 -176989 -215811
21392 -215811 -101987 -69151 -93845 -98488 -110761 -111329 47805 95599 -42358 -27606 -66134
21381 -66134 -6124 -23035 -82414 -51161 -86158 -65755 -5048 -35343 -30574 -27651 -44669 -67040
21369 -67040 -28062 -48606 -125974 -137070 -68051 72780 127589 191235 172925 141738 14308
21358 14308 10837 -20187 23184 67596 1141 -43956 -36833 -14991 28881 3682 1912 -53487
21346 -53487 33789 112580 114172 -17212 -55918 91576 95226 13614 -86765 -185379 -153626
21335 -153626 -116743 -22016 -12170 -68368 6985 23239 -20531 -56603 -44503 10539 108272 40897
$$ packed form
21416f3266J6134o4211J2289R4075j0464o2394J1155J9529k1693J3985Q6896N4829
21404H6864M5969k3747j00914q0770k0188K9158k2479p9091j4077l482N768l8822
21392b15811J13824L2836k4694m643j2273n68J59134M7794j37957J4752l8528
21381f6134O0010j6911n9379L1253l4997K0403O0707l0295M769K923j7018k2371
21369f7040L8978k0544p7368j1096O9019J40831N4809O3646j8310l1187j27430
21358A4308l471l1024M3371M4412o6455m5097P123K1842M3872k5199j770n5399
21346e3487Q7276P8791J592j31384l8706J47494L650q1612j00379r8614L1753
21335a53626L6883R4727R846n6198P5353J6254m3770l6072J2100N5042R7733o7375
$$ plain form
21323 40897 -68326 -112879 -47945 23210 -10616 -116135 -127313 3306 -3059 5502 45300
21312 45300 103470 74620 -90234 -139280 -166870 -140231 -62983 -25925 16574 25648 15663 -6889
21300 -6889 -70169 -153334 -124156 -92083 -22165 -33762 -70510 -66745 -75972 -54725 -42210 29862
21288 29862 157363 148720 -67297 -199285 -85359 -46805 -150915 -256816 -226732 -117890
21278 -117890 -150941 -216202 -217528 -176405 -98584 -61182 -31251 92248 82410 1507 -23661 -62553
21266 -62553 -57128 -94256 -52843 -7746 -49793 -155904 -116880 -56702 -101665 -153346 -134466 -46452
21254 -46452 -40372 -4154 -28726 -122941 -180488 -143668 -109875 -117426 -166929 -109755 74792 85082
21242 85082 -44950 -74527 -146454 -173278 -268355 -263193 -220167 -242846 -109322 -22562 -66120
$$ packed form
21323D0897j09223m4553O4934P1155l3826j05519j1178J30619o365Q561L9798
21312D5300N8170k8850j64854m9046k7590K6639P7248L7058M2499R074r985k2552
21300f889o3280q3165K9178L2073O9918j1597l6748L765r227K1247J2515P2072
21288B9862J27501q643k16017j31988J13926L8554j04110j05901L0084J08842
21278a17890l3051o5261j326M1123P7821L7402K9931J23499r838q0903k5168l8892
21266f2553N425l7128M1413M5097m2047j06111L9024O0178m4963n1681J8880Q8014
21254d6452O080L6218k4572r4215n7547L6820L3793p551m9503N7174J84547J0290
21242H5082j30032k9577p1927k6824r5077N162M3026k2679J33524Q6760m3558
$$ plain form
21231 -66120 -105125 -99455 -49821 -133132 -155418 -53207 97300 47385 17059 38031 -46899
21220 -46899 -14537 17318 43578 -17129 -135193 -124824 -65518 -1824 11352 73000 57610
21209 57610 -18153 -26105 9315 19515 94902 103076 5206 -51748 -45001 20392 49015 7916
21197 7916 -18374 -16209 69891 186630 188616 88659 87347 197116 160030 42940 101023 149162
21185 149162 58911 -54792 -54381 -3296 15491 25294 74743 48697 -28245 12704 -8119 21699
21173 21699 -33704 -131171 -54557 36848 109120 59333 -53855 -115242 -113593 -22371 -54362 -106816
21161 -106816 -49410 -68265 -104150 -193051 -262815 -163220 -66597 -32246 7478 61422 29131
21150 29131 -82800 -83339 -106575 -168760 -112698 -1198 74736 -46666 -102349 -11587 15853
$$ packed form
21231f6120l9005N670M9634q3311k2286J02211J50507m9915l0326K0972q4930
21220d6899L2362L1855K6260o0707j18064J0369N9306O3694J3176O1648j5390
21209E7610p5763p952L5420J0200P5387Q174r7870n6954O747O5393K8623m1099
21197G916k6290K165Q6100J16739J986r9957j312J09769l7086j17090N8083M8139
21185A49162r0251j13703M11N1085J8787R803M9449k6046p6942M0949k0823K9818
21173B1699n5403r7467P6614R1405P2272m9787j13188o1387J649R1222l1991n2454
21161a06816N7406j8855l5885q8901o9764R9595R6623L4351L9724N3944l2291
21150B9131j11931n39k3236o2185N6062J11500P5934j21402n5683R0762K7440
$$ plain form
21139 15853 -59483 -50724 -184837 -130617 -91711 -6862 -36902 -148241 -209737 -174377 -44704
21128 -44704 72390 -3694 -60330 7453 -23954 -182506 -187703 -159709 -181813 -141114 -163727
21117 -163727 -202445 -146756 -15737 64456 51882 56285 -5326 -95421 -127208 -114624 -189253
21106 -189253 -268267 -178227 -47842 5419 7004 -21274 17114 21695 -5386 62450 144345 36367
21094 36367 -71568 -71033 -16569 -11682 -107126 -155231 -112869 -34779 28106 -56859 -148665 -143937
21082 -143937 -103594 -87431 18074 21372 15315 -66652 -19753 -10446 -32886 -99273 -124814 -51490
21070 -51490 10391 -31445 -116183 -130632 -155930 -145526 -94159 -102371 -87614 -107498 -111258 -146764
21058 -146764 -162125 -120710 -121863 -9168 42045 33182 -56091 -56182 12298 68992 65195 20702
$$ packed form
21139A5853p5336Q759j34113N4220L8906Q4849l0040j11339o1496L5360J29673
21128d4704J17094p6084n6636O7783l1407j58552n197K7994k2104M0699k2613
21117a63727l8718N5689J31019Q0193j2574M403o1611r0095l1787J2584p4629
21106a89253p9014R0040J30385N3261J585k8278L8388M581k7081O7836Q1895j07978
21094C6367j07935N35N4464M887r5444m8105M2362P8090O2885q4965r1806M728
21082a43937M0343J6163J05505L298o057q1967M6899R307k2440o6387k5541P3324
21070e1490O1881m1836q4738j4449k5298J0404N1367q212J4757j9884l760l5506
21058a46764j5361M1415j153J12695N1213q863q9273r1O8480N6694l797m4493
$$ plain form
21046 20702 -22066 -4005 7752 25525 84886 55623 3740 1781 27835 -42836 -44286 -89989
21034 -89989 -127962 -68527 -38571 -3519 -8119 -24783 -51478 -112454 -206488 -199663 -125429 -22945
21022 -22945 50360 101830 59291 43616 -16480 -86734 -150225 -124220 -114187 -134060 -107372 39110
21010 39110 157821 126139 154596 185668 151508 111467 34797 -12213 -28075 -62130 -101485
20999 -101485 -128204 -122218 -168666 -131875 13716 62400 131735 108954 55421 59507 101735 99970
20987 99970 56660 51855 112954 94164 81098 -47611 -148584 -152408 -43878 -20891 -44523
20976 -44523 11695 44902 38859 14508 5071 -32333 11016 3857 -75375 -73739 -101813 -35994
20964 -35994 -45127 -111558 -45633 76536 78806 44023 80221 104410 51639 -44479 -50121 -70238
$$ packed form
21046B0702m2768J8061J1757J7773N9361k9263n1883j959K6054p0671j450m5703
21034h9989l7973N9435K9956L5052m600j6664k6695o0976r4034O825P4234J02484
21022b2945P3305N1470m2539j5675o0096p0254o3491K6005J0033j9873K6688J46482
21010C9110J18711l1682K8457L1072l4160m0041p6670m7010j5862l4055l9355
20999a01485k6719N986m6448L6791J45591M8684O9335k2781n3533M086M2228j765
20987I9970m3310m805O1099j8790j3066j28709j00973l824J08530K2987k3632
20976d4523N6218L3207o043k4351r437l7404M3349p159p9232J636k8074O5819
20964c5994r133o6431O5925J22169K270l4783L6198K4189n2771r6118n642k0117
$$ plain form
20952 -70238 -92244 -30336 -28880 -17227 79071 91382 88220 104427 87364 6657 -129634 -149016
20940 -149016 -146832 -45397 16553 -8334 26524 -72310 -47083 -23995 289 154834 231368
20929 231368 230773 198596 70752 -26834 -140568 -162373 -66286 -28789 -17601 -6939 24922
20918 24922 115243 88826 48477 -47353 -16263 69139 103107 96186 34474 61271 64915 134192
20906 134192 115295 -2088 -31164 5879 43496 -15455 -45523 53983 1422 -114142 -123133
20895 -123133 -87282 -67201 -11139 32151 62398 54814 6249 -25183 -13173 -65706 -181684
20884 -181684 -66559 60203 18262 48460 81320 -24085 -140509 -27810 22039 -17086
20874 -17086 18224 85816 67630 -142900 -169069 -95638 2565 -38740 -57057 37046 109965
$$ packed form
20952g0238k2006O1908J456J1653R6298J2311l162J6207j7063q0707j36291j9382
20940a49016K184J01435O1950k4887L4858r8834K5227K3088K4284J54545P6534
20929B31368n95l2177j27844r7586j13734k1805R6087L7497J1188J0662L1861
20918B4922R0321k6417m0349r5830L1090Q5402L3968o921o1712K6797L644O9277
20906A34192j8897j17383k9076L7043L7617n8951l0068R9506n2561j15564q991
20895a23133L5851K0081N6062M3290L0247p584m8565l1432J2010n2533j15978
20884a81684J15125J26762m1941L0198L2860j05405j16424J12699M9849l9125
20874a7086L5310O7592j8186k10530k6169P3431R8203m1305j8317R4103P2919
$$ plain form
20863 109965 123700 85980 121255 89522 90630 26608 -55957 -42223 32051 55999 120181 74490
20851 74490 -3019 18600 38355 -56902 -146193 -82329 15021 212068 333248 202711 109891
20840 109891 33972 51139 66343 60467 59669 14214 33212 30863 -49279 -147239 -235100 -291235
20828 -291235 -198763 -192940 -147830 54119 140194 132222 99644 20135 33961 -49418 -56366 23764
20816 23764 30719 -127053 -60695 -25424 -62592 -113886 -96478 -75245 -63995 -163775 -195249 -148273
20804 -148273 -225943 -233736 -152875 -152937 -70466 60776 82764 14556 -169841 -241852 -155167 -82232
20792 -82232 -40099 67368 49130 86647 172306 236278 203566 46758 -44630 -132212 -158400
20781 -158400 -144436 -33556 35779 -50012 -68032 58145 100266 23722 -40009 -6289 -43662
$$ packed form
20863A09965J3735l7720L5275l1733J108o4022q2565J3734P4274K3948O4182m5691
20851G4490p7509K1619J9755r5257q9291O3864R7350J97047J21180j30537r2820
20840A09891p5919J7167J5204n876p98m5455J8998k349q0142r7960q7861n6135
20828b91235R2472N823M5110K01949Q6075p972l2578p9509J3826q3379o948Q0130
20816B3764O955j57772O6358L5271l7168n1294J7408K1233J1250r9780l1474M6976
20804a48273p7670p793Q0861o2Q2471J31242K1988o8208j84397p2011Q6685P2935
20792h2232M2133J07467j8238L7517Q5659O3972l2712j56808r1388q7582k6188
20781a58400J3964J10880O9335q5791j8020J26177M2121p6544o3731L3720l7373
$$ plain form
20770 -43662 -17387 123438 104006 7376 -71410 -47759 -56107 -47495 24477 3186 23017 -84550
20758 -84550 -112507 -104486 -135982 -66979 1505 -6013 -42024 -93068 -54108 -42526 -118539 -121617
20746 -121617 -144665 -71610 52214 88034 51744 40828 33520 45145 -71627 -101558 -43972
20735 -43972 -39697 -36052 -9260 -63434 -152291 -115200 -71352 -54573 -42691 -94132 -137953 -65652
20723 -65652 -70482 -101843 -73518 -93393 -57668 42600 48804 64809 68634 63613 -59876 -17720
20711 -17720 -18411 -11138 53009 78463 -30498 -78773 -185632 -232350 -98576 21831 -57127
20700 -57127 -167634 -125853 -76161 -39161 30001 -63503 -175987 -146256 -115038 -33212 -30007
20689 -30007 -55370 -134918 -144082 -73388 36599 51064 -50024 -125987 -65067 -57722 16359 2224
$$ packed form
20770d3662K6275J40825j9432r6630p8786K3651q348Q612P1972k1291J9831j07567
20758h4550k7957Q021l1496O9003O8484p518l6011n1044L8960J1582p6013l078
20746a21617k3048P3055J23824L5820l6290j0916p308J1625j16772k9931N7586
20735d3972M275L645K6792n4174q8857L7091M3848J6779J1882n1441m3821P2301
20723f5652m830l1361K8325j9875L5725J00268O204J6005L825n021j23489M2156
20711a7720o91P273O4147K5454j08961m8275j06859m6718J33774J20407p8958
20700e7127j10507M1781M9692L7000O9162r3504j12484K9731L1218Q1826L205
20689c0007k5363p9548r164P0694J09987J4465j01088p5963O0920P345P4081j4135
$$ plain form
20677 2224 64823 64787 87073 -32656 -50764 -28178 54567 36582 -44355 -70920 -32397 -74442
20665 -74442 43662 148166 47502 -15810 -46484 26869 139317 56079 -8944 38863 14081
20654 14081 -77481 -220122 -163455 -92495 -39467 -97378 -89051 -41679 2806 20766 -12011 -13458
20642 -13458 -21184 -84912 -94502 -7142 28122 -22586 -72989 -141134 -118855 -52672 -72062 -106964
20630 -106964 -136112 -125124 352 60525 85926 7881 802 -62516 -83384 -117266 -125932 -135989
20618 -135989 -121903 -128783 -232930 -256171 -236518 -239979 -270001 -124905 -74814 -132106 -240392
20607 -240392 -225348 -154310 -141687 -131325 -107223 -163287 -152791 -115565 -75750 -36895 29200
20596 29200 -14779 -121711 -115105 9558 82086 65675 -1486 -5065 1354 8329 -26433 -6254
$$ packed form
20677B224O2599l6K2286j19729j8108K2586Q2745j7985q0937k6565L8523m2045
20665g4442J18104J04504j00664o3312l0674P3353J12448q3238o5023M7807k4782
20654A4081r1562j42641N6667P0960N3028n7911Q327M7372M4485J7960l2777j447
20642a3458p726o3728r590Q7360L5264n0708n0403o8145K2279O6183j9390l4902
20630a06964k9148J0988J25476O0173K5401p8045p079o3318k0868l3882q666j0057
20618a35989J4086o880j04147k3241J9653l461l0022J45096N0091n7292j08286
20607b40392J5044P1038J2623J0362K4102n6064J0496L7226L9815L8855O6095
20596B9200m3979j06932O606J24663P2528j6411o7161l579O419O975l4762K0179
$$ plain form
20584 -6254 -23021 46906 85803 73948 -79438 -89667 1199 18255 -15532 -12165 9824 -31124
20572 -31124 -95043 -63097 39801 156727 141290 94484 138897 110988 166090 119620 56523
20561 56523 39917 -40226 48702 118189 139264 -217 -80060 -5770 33011 -67987 -28429
20550 -28429 72147 85868 46989 31555 73039 61166 73880 117591 61479 91051 54892
20539 54892 -33796 -12052 43783 37066 -77472 -158650 -89300 15497 18046 52891 -17366 57478
20527 57478 47174 75318 -8066 -104455 -72377 -82389 -190660 -293196 -196136 -154132 -65876
20516 -65876 -568 4697 1931 -25585 1438 -22485 70055 126465 173554 78352 -13728 -2529
20504 -2529 55938 -29350 -112135 -119515 -124488 -139809 -61160 -48412 -38930 -38242 -81438 -73366 -20581
$$ packed form
20584f254j6767O9927L8897j1855j53386j0229R0866J7056l3787L367K1989m0948
20572c1124o3919L1946J02898J16926j5437m6806M4413k7909N5102m6470o3097
20561E6523j6606q0143Q8928O9487K1075j39481p9843P4290L8781j00998L9558
20550b8429J00576J3721l8879j5434M1484j1873J2714M3711n6112K9572l6159
20539E4892q8688K1744N5835o717j14538q1178O9350J04797K549L4845p0257P4844
20527E7478j0304K8144q3384r6389L2078j0012j08271j02536R7060M2004Q8256
20516f5876O5308N265k766k7516K7023k3923R2540N6410M7089r5202r2080J1199
20504b529N8467q5288q2785p380m973j5321P8649J2748R482O88m3196Q072N2785
$$ plain form
20491 -20581 10394 -6715 15646 42998 22089 191 -64842 -19651 17270 -7059 -24085 -20275
20479 -20275 -41666 -95642 -162791 -176186 -113707 1278 36561 -5442 -30674 -36244 -4408 115225
20467 115225 100521 20906 20552 -78015 -157061 -103277 -24865 71981 55633 17408 -6139 -29546
20455 -29546 -39398 -42326 -62360 15268 6901 -76072 -117210 -85483 84661 38569 -27105 -52889
20443 -52889 -93513 -15573 2020 55175 59505 131482 118244 10895 36743 64217 103724 152695
20431 152695 83096 5270 63470 31710 57391 106387 100035 70771 35290 18293 6017 171150
20419 171150 182033 127617 93430 54079 59869 6824 65537 199318 89770 -5327 -88866
20408 -88866 16433 112767 35224 41649 41915 108426 127532 201075 143370 63475 23916 63796
$$ packed form
20491b0581L0975j7109K2361K7352k0909k1898o5033M5191L6921k4329j7026L810
20479b0275k1391n3976o7149j3395O2479J14985L5283m2003k5232n570L1836J19633
20467A15225j4704p9615l54r8567p9046N3784P8412R6846j6348l8225k3547k3407
20455b9546r852k928k0034P7628q367q2973m1138L1727J70144m6092o5674k5784
20443e2889m0624P7940J7593N3155M330P1977j3238j07349K5848K7474L9507M8971
20431A52695o9599p7826N8200l1760K5681M8996o352k9264l5481j6997j2276J65133
20419A71150J0883n4416l4187l9351N790n3045N8713J33781j09548r5097q3539
20408h8866J05299R6334p7543O425K66O6511J9106P3543n7705p9895l9559L9880
$$ plain form
20396 63796 53978 3282 -28308 35754 17761 57532 74591 103847 126963 68256 142980 209173
20384 209173 214596 121340 12002 -29313 35390 3639 22095 61494 29355 69625 109982
20373 109982 96840 142601 18687 -40212 54191 29573 4593 -79529 -137394 -32920 34390
20362 34390 34121 -43090 -28259 -3873 -18996 -109829 -118011 -109687 -126635 -22601 95177 98096
20350 98096 131324 -16398 -218678 -282694 -337602 -224360 -22341 27231 -23385 69519 51138
20339 51138 -17049 -748 -17818 4675 4900 -56136 -59663 -48881 -19336 31512 -33728 -47511
20327 -47511 28645 30421 -45213 -2107 -33561 -54212 -2500 28275 -85393 -40806 13784 -26240
20315 -26240 21818 92707 33776 -7433 10994 20401 15876 125067 57210 -63600 -57469 -51334
$$ packed form
20396F3796r818n0696l1590O4062j7993L9771J7059K9256K3116n8707P4724O6193
20384B09173N423r3256j09338m1315O4703l1751J8456L9399l2139M0270M0357
20373A09982j3142M5761j23914n8899R4403k4618k4980q4122n7865J04474O7310
20362C4390k69p7211J4831K4386j5123r0833q182Q324j6948J04034J17778K919
20350I8096L3228j47722k02280o4016n4908J13242K02019M9572n0616R2904j8381
20339E1138o8187J6301j7070K2493K25o1036l527J0782K9545N0848o5240j3783
20327d7511P6156J776p5634M3106l1454k0651N1712L0775j13668M4587N4590m0024
20315b6240M8058P0889n8931m1209J8427R407m525J09191o7857j20810O131O135
$$ plain form
20303 -51334 2841 39850 -42082 -198826 -237504 -150741 -26971 67115 127176 155724 82679
20292 82679 62263 25460 32486 71049 139483 115660 42907 184337 324161 246515 139365
20281 139365 136121 117813 74774 113045 132424 36448 -57215 -121141 -90688 -67467 -91139 -91641
20269 -91641 -126385 -88234 -86320 -459 29158 -36679 -24187 35198 61477 14916 57384 79490
20257 79490 82113 -14028 -41013 92964 131386 110970 120250 100357 88289 175394 155438 25902
20245 25902 149234 174734 99349 45677 101356 72544 3766 -40619 -25812 71010 119230
20234 119230 -36759 -96776 36456 43119 32769 75784 151241 247151 194312 176673 188277
20223 188277 152930 -62861 -34505 72767 86989 138991 128883 68204 12770 -32935 3220
$$ packed form
20303e1334N4175L7009q1932j56744l8678Q6763J23770R4086O0061K8548p3045
20292H2679k0416l6803P026L8563O8434k3823p2753J41430J39824p7646j07150
20281A39365l244j8308m3039L8271J9379r5976r3663o3926L0453K3221k3672n02
20269i1641l4744L8151J914Q5861K9617o5837J2492N9385K6279m6561M2468K2106
20257G9490K623r6141k6985J33977L8422k0416R280j9893j2068Q7105j9956j29536
20245B5902J23332K5500p5385n3672N5679k8812o8778m4385J4807R6822M8220
20234A19230j55989o0017J33232O663j0350M3015P5457R5910n2839j7639J1604
20223A88277l5347k15791K8356J07272J4222N2002j0108o0679n5434m5705L6155
$$ plain form
20212 3220 58866 -599 -3608 73792 85106 131233 84143 6784 -26118 -45854 49426 38918
20200 38918 -95001 -166799 -181531 -138094 -115375 -87140 -143013 -276486 -291109 -255931 -252899
20189 -252899 -255088 -199284 -127015 -121944 -197395 -200949 -140275 4964 104328 112138 101253 161751
20177 161751 71750 67285 187474 212598 116634 45089 62490 29363 31662 10524 -100680
20166 -100680 -53080 -16471 67607 94094 127491 32714 -107797 -5169 82763 -49275 -117922
20155 -117922 11767 -46696 -99501 -46031 72403 20745 -5299 -6850 17134 -44597 -31833
20144 -31833 -27329 -20511 66227 96472 99683 98652 98127 -2998 -123810 -108771 846 -25362
20132 -25362 -40052 78189 215315 12897 -42418 -58482 -41945 12707 65941 87950 30747
$$ packed form
20212C220N5646n9465l009P7400J1314M6127m7090p7359l2902j9736R5280j0508
20200C8918j33919p1798j4732M3437K2719K8235n5873j33473j4623L5178L032
20189b52899k189N5804P2269N071p5451l554O0674J45239R9364P810j0885O0498
20177A61751r0001m465J20189K5124r5964p1545J7401l3127K299k1138j11204
20166a00680M7600L6609Q4078K6487L3397r4777j40511J02628Q7932j32038o8647
20155a17922J29689n8463n2805N3470J18434n1658k6044j551K3984o1731J2764
20144c1833M504O818Q6738L0245L211j031n25j01125j20812J5039J09617k6208
20132b5362j4690J18241J37126k02418n5315j6064J6537N4652N3234K2009n7203
$$ plain form
20121 30747 -69486 -42759 11589 -1189 36080 42183 -42447 -71629 -45421 -75794 -66345 18233
20109 18233 92172 99792 78423 20284 8476 27437 40244 84322 100282 195924 118136 -48888
20097 -48888 -215975 -237253 -221712 -201616 -42209 -62784 -74618 -61418 -71001 -141871 -233117
20086 -233117 -283151 -173169 -170240 -116444 -117056 -148915 -159483 -147670 -34636 31457 5852 -66113
20074 -66113 -105556 -100279 -83714 -61725 26006 44312 19406 -28129 -20861 31797 27098 19192
20062 19192 14864 -2637 -28827 2976 51297 23877 58018 116574 95543 116165 217249 117640
20050 117640 -9238 -63261 98495 96018 47286 126712 113669 27810 29286 98333 149280
20039 149280 101470 71438 57312 49163 57070 110246 87651 63626 42906 3410 -82042 -171463
$$ packed form
20121C0747j00233K6727N4348j2778L7269O103q4630k9182K6208l0373R449Q4578
20109A8233P3939P620k1369n8139j1808J8961J2807M4078J5960R5642p7788j67024
20097d8888j67087k1278J5541K0096J59407k0575j1834J3200r583p0870r1246
20086b33117n0034J09982K929N3796o12l1859j0568J1813J13034O6093k5605p1965
20074f6113l9443N277J6565K1989Q7731J8306k4906m7535P268N2658m699p906
20062A9192m328j7501k6190L1803M8321k7420L4141N8556k1031K0622J01084r9609
20050A17640j26878n4023J61756k477m8732P9426j3043q5859J476O9047N0947
20039A49280m7810l0032j4126q149P907N3176k2595k4025k0720l9496q5452q9421
$$ plain form
20027 -171463 -234222 -169334 -92076 -22243 37384 -6779 -10887 -27355 60673 47653 -59671
20016 -59671 -175642 -238817 -286598 -232184 -109918 -33669 -66323 -32898 61292 20631 24565
20005 24565 83383 93940 10995 -71360 -28659 51368 151884 145418 73084 57896 86521 96652
19993 96652 102945 81959 75256 103324 94205 79743 32486 39990 78421 39774 59005 -20155
19981 -20155 -40302 2069 1120 -75979 -129642 -115698 -28715 -36784 611 -114629 -205873 -164161
19969 -164161 -142444 -91214 98838 205050 284322 116819 -54699 -185884 -124132 -11347
19959 -11347 110170 115849 -87957 -13596 78167 18378 55592 94748 -78080 -117214 -20492
19948 -20492 -36232 48638 55706 74333 42316 6163 15810 -112776 -225733 -247933 -203552 -95565
$$ packed form
20027a71463o2759O4888P7258O9833N9627m4163m108j6468Q8028j3020j07324
20016e9671j15971o3175m7781N4414J22266P6249l2654L3425R4190m0661L934
20005B4565N8818J0557q2945q2355M2701Q0027J00516o466p2334j5188K8625J0131
19993I6652O293k0986o703K8068r119j4462m7257P504L8431l8647J9231p9160
19981b0155k0147M2371r49p7099n3663J3944Q6983q069L7395j15240r1244M1712
19969a64161K1717N1230J90052J06212P9272j67503j71518j31185O1752J12785
19959a1347J21517N679k03806P4361R1763n9789L7214L9156j72828l9134R6722
19948b0492j5740Q4870P068J8627l2017l6153R647j28586j12957k2200M4381J07987
$$ plain form
19936 -95565 -25011 68774 92349 111236 107892 85862 87717 127122 -13265 -124605 -164492 -153679
19924 -153679 -92034 -109331 -121053 -60854 -3603 39814 80069 59475 81257 162288 180615
19913 180615 140910 78881 -22781 -31417 87015 137529 128730 127700 111041 -12690 -60386
19902 -60386 -102718 -85450 22844 -4116 -41125 -31438 61748 89493 59608 12438 17955 64991
19890 64991 33696 58821 60335 160579 184721 175183 127616 91011 -27661 54375 121538 209460
19878 209460 207066 178415 74161 32374 47554 107167 129175 66439 16646 13238 -65430 -99450
19866 -99450 34897 8668 28568 98570 116120 50696 -32196 -130890 -38383 4478 -10665
19855 -10665 37627 30388 18411 60384 26053 21219 66833 36851 3695 -4526 -9147 -39803
$$ packed form
19936i5565P0554R3785K3575J8887l344k2030J855L9405j40387j11340l9887J0813
19924a53679O1645j7297j1722O0199N7251M3417M0255k0594K1782Q1031J8327
19913A80615l9705o2029j01662q636J18432N0514q799j030j6659j23731m7696
19902f0386m2332J7268J08294k6960l7009R687R3186K7745k9885m7170N517M7036
19890F4991l1295K5125J514J00244K4142r538m7567l6605j18672Q2036O7163Q7922
19878B09460k394k8651j04254m1787J5180N9613K2008o2736m9793l408p8668l4020
19866i9450J34347k6229J9900P0002J7550o5424q2892r8694R2507M2861j5143
19855a0665M8292p239j1977M1973l4331m834M5614k9982l3156q221m621l0656
$$ plain form
19843 -39803 11634 77758 88411 45833 -39237 -37014 42576 164627 55812 13475 34632
19832 34632 64479 55756 128593 210171 197836 151407 140664 188262 162362 56564 66687 138966
19820 138966 68588 -88655 -99353 -59995 -19164 -48902 41869 168104 241068 293703 228975
19809 228975 202753 156631 108724 114815 143331 134338 185359 40739 53061 127873 195715 155854
19797 155854 112027 101742 44170 21915 29003 81322 144277 193675 182143 105248 159644 208158
19785 208158 152127 148776 176583 110401 38945 -31129 -99175 -55893 -11955 -35816 15741 34550
19773 34550 91267 164086 115400 45510 69889 79971 162847 204186 194833 168995 168113 193118
19761 193118 166673 148045 97343 53508 80197 31884 2407 15265 -2198 10224 -5554
$$ packed form
19843c9803N1437O6124J0653m2578q5070K223P9590J22051j08815m2337K1157
19832C4632K9847q723P2837Q1578j2335m6429j0743M7598k5900j05798J0123P2279
19820A38966p0378j57243j0698L9358M0831k9738R0771J26235P2964N2635o4728
19809B28975k6222m6122m7907O091K8516q993N1021j44620J2322P4812O7842l9861
19797A55854m3827j0285n7572k2255P088N2319O2955M9398j1532p6895N4396M8514
19785B08158n6031l351K7807o6182p1456p0074o8046M3282M3938k3861N1557J8809
19773C4550N6717P2819m8686o9890K4379J0082Q2876M1339r353k5838q82K5005
19761A93118k6445j8628n0702m3835K6689m8313k9477J2858j7463J2422j5778
$$ plain form
19750 -5554 32424 19895 -20112 -3419 74959 87858 51468 -5292 23356 82668 121164 143133
19738 143133 53876 39485 93163 103908 163625 184896 100763 18513 85377 170615 107244
19727 107244 168375 151661 156105 342162 552603 555518 506838 481695 473947 380488 282809 259536
19715 259536 299453 227168 235200 266813 289499 299983 355756 309881 278298 251330 282355 312716
19703 312716 436774 541514 433132 420405 425621 375856 223697 111700 111792 200898 260622
19692 260622 312632 305649 473993 546825 475141 531722 462461 384256 272629 253197 243403
19681 243403 186800 187040 220745 184305 88822 49038 102009 164699 85208 72455 184627 384599
19669 384599 588343 732403 690590 512952 478472 383945 276575 187764 196952 133621 158857
$$ packed form
19750e554L7978j2529m0007J6693P8378J2899l6390n6760K8648N9312L8496K1969
19738A43133q9257j4391N3678J0745N9717K1271q4133q2250O6864Q5238o3371
19727A07244O1131j6714M444J86057K10441K915m8680k5143p748r3459r7679k3273
19715B59536L9917p2285Q032L1613K2686J0484N5773m5875l1583k6968L1025L0361
19703C12716J24058J04740j08382j2727N216m9765j52159j11997R2Q9106N9724
19692B60622N2010o983J68344P2832p1684N6581o9261p8205j11627j9432r794
19681B43403n6603K40L3705l6440r5483l9784N2971O2690p9491j2753J12172J99972
19669C84599K03744J44060m1813j77638l4480r4527j07370q8811R188o3331K5236
$$ plain form
19658 158857 179946 325583 189248 47305 56381 56552 -19913 -25570 65198 125328 149871 83130
19646 83130 -14230 -27937 -33949 -29825 33464 130616 150601 173247 261356 241318 231835 207582
19634 207582 50029 -42410 -11762 67604 46746 76342 127904 231548 224303 217825 190957
19623 190957 39819 16875 138685 155442 114793 15175 -71734 -67895 -17952 -176342 -171429
19612 -171429 -26999 79147 46305 -10387 17583 -12766 -48782 65880 156950 320737 372626
19601 372626 370573 438616 468624 411542 309522 238423 86566 64582 45662 111967 208209
19590 208209 283788 154453 82210 106174 59874 -21703 -19890 -4565 100008 195377 234363
19579 234363 212840 141276 32488 -6831 -42507 11905 42430 50161 62401 66964 46773 115795
$$ packed form
19658A58857K1089J45637j36335j41943R076J71p6465n657R0768O0130K4543o6741
19646H3130r7360j3707o012M124O3289R7152J9985K2646Q8109k0038r483k4253
19634B07582j57553r2439L0648P9366k0858K9596N1562J03644p245o478k6868
19623A90957j51138k2944J21810J6757m0649r9618q6909L839M9943j58390M913
19612a71429J44430J06146l2842n6692K7970l0349l6016J14662R1070J63787N1889
19601C72626k053O8043L0008n7082j02020p1099j51857k1984j8920O6305R6242
19590B08209P5579j29335p2243K3964m6300q1577J813J5325J04573R5369L8986
19579B34363k1523p1564j08788l9319l5676N4412L0525P731J2240M563k0191O9022
$$ plain form
19567 115795 117678 37406 43541 56255 185491 209487 305200 341810 318878 334800 361846 348327
19555 348327 256534 217997 327642 448402 611340 753579 812719 816100 759902 763256 857962
19544 857962 784576 732232 685757 584663 480752 313124 190515 120179 118878 207171 223070
19533 223070 177967 146162 200653 172876 99588 47380 15350 53425 34633 -29627 -54017
19522 -54017 -14123 45789 77051 90229 98049 43261 -16664 73427 191691 136453 -3053
19511 -3053 40014 84589 106979 56274 31283 3198 59193 120321 179179 176569 177818 134863
19499 134863 73582 -33272 -84402 -75684 -12890 36609 152722 174970 260773 263221 320004
19488 320004 277991 194032 186888 141490 109588 173221 238837 156460 -12790 -51522 -113199
$$ packed form
19567A15795J883q0272O135J2714J29236K3996R5713L6610k2932J5922K7046j3519
19555C48327r1793l8537J09645J20760J62938J42239N9140L381n6198L354R4706
19544H57962p3386n2344m6475j01094j03911j67628j22609p0336j301Q8293J5899
19533B23070m5103l1805N4491k7777p3288n2208l2030L8075j8792o4260k4390
19522e4017L9894N9912L1262J3178P820n4788n9925R0091J18264n5238j39506
19511c053M3067M4575K2390n0705k4991k8085N5995O1128N8858k610J249m2955
19499A34863o1281j06854n1130Q718O2794M9499J16113K2248Q5803K448N6783
19488C20004m2013q3959p144m5398l1902O3633O5616q2377j69250l8732o1677
$$ plain form
19477 -113199 -78804 -41112 -76330 -64146 2036 147521 236853 257364 230480 324029 432097
19466 432097 454561 398431 394276 530878 625034 606701 607105 490592 394708 295897 228136 208435
19454 208435 189640 335640 337802 247884 151206 84570 30010 12831 85865 176199 181029 162775
19442 162775 162255 175654 288732 367014 333426 293347 250052 203789 211414 228991 185439 305804
19430 305804 414649 474477 466397 457684 476678 577137 723631 955659 1068332 1179729 1237210
19419 1237210 1237574 1356903 1459765 1549584 1558386 1438324 1296345 1056193 850700 710812
19409 710812 733571 735049 625825 514268 525468 546342 585060 559067 482796 425686 350400
19398 350400 328136 297680 259135 280096 283993 310485 385572 436754 374355 321859 314453 204055
$$ packed form
19477a13199L4395L7692l5218J2184O6182J45485Q9332K0511k6884R3549J08068
19466D32097K2464n6130m155J36602R4156j8333M04j16513r5884r8811o7761j9701
19454B08435j8795J46000K162q9918r6678o6636n4560j7179P3034R0334M830j8254
19442A62775n20J3399J13078P8282l3588m0079m3295m6263P625J7577m3552J20365
19430C05804J08845N9828q080q713J8994J00459J46494K32028J12673J11397N7481
19419A237210L64J19329J02862Q9819Q802j20062j41979k40152k05493j39888
19409G10812K2759J478j09224j11557J1200K0874L8718k5993p6271n7110p5286
19398C50400k2264l0456l8545K0961L897K6492P5087N1182o2399n2496p406j10398
$$ plain form
19386 204055 150130 222073 198717 105429 194999 348695 361575 464473 458306 453334 448468 597905
19374 597905 832977 1056310 1135192 1128068 1187721 1272563 1307571 1355701 1409313 1430364 1306673
19363 1306673 1107289 971168 812996 626956 398021 371078 357197 283123 202685 237894
19353 237894 260350 317055 286691 139998 51604 100112 201619 273812 266016 326150 392828
19342 392828 296137 196770 137471 79622 159546 211578 196610 154311 133536 169784 242811
19331 242811 259840 338962 352603 461310 431864 300616 218042 241000 312130 382367 378998
19320 378998 368140 287203 261310 258366 215353 313657 367125 276907 288599 289282 287937 310921
19308 310921 309094 271763 215910 186135 257317 312773 425175 505634 493345 474236 385952
$$ packed form
19386B04055n3925P1943k3356r3288Q9570J53696J2880J02898o167m972m866J49437
19374E97905K35072K23333P8882p124N9653Q4842L5008M8130N3612K1051j23691
19363A306673j99384j36121j58172j86040k28935k6943j3881p4074q0438L5209
19353B37894K2456N6705l0364j46693q8394M8508J01507P2193p796O0134O6678
19342C92828r6691r9367n9299n7849P9924N2032j4968m2299k0775L6248P3027
19331B42811J7029P9122J3641J08707k9446j31248q2574K2958P1130P0237l369
19320C78998j0858q0937k5893k944m3013R8304N3468r0218J1692O83j345K2984
19308C10921j827l7331n5853k9775P1182N5456J12402Q0459j2289j9109q8284
$$ plain form
19297 385952 401710 423793 359631 399014 437897 414120 410327 537504 588770 552060 420025
19286 420025 376774 503192 588578 537318 489842 495904 554523 567945 580730 543140 547459 501951
19274 501951 508980 524713 527478 633101 612300 583137 530359 532967 642431 703837 734223 766857
19262 766857 777591 617208 539597 591322 646347 539740 465048 489255 587116 669435 695122
19251 695122 672414 674924 673624 574729 537919 634653 675567 611503 516365 625566 724263 796357
19239 796357 904885 1038083 1142105 1211590 1454997 1695758 1983401 2350177 2998706 3919170
19229 3919170 4725260 5255407 5384520 5019368 4211376 3501745 2995185 2536616 2267417
19220 2267417 2171751 2153488 2057145 2045463 2149343 2342299 2619671 2707332 2735776 2754407 2843857
$$ packed form
19297C85952J5758K2083o4162L9383L8883k3777l793J27177N1266l6710j32035
19286D20025m3251J26418Q5386n1260m7476O062N8619J3422J2785l7590M319m5508
19274E01951P029J5733K765J05623k0801k9163n2778K608J09464O1406L0386L2634
19262G66857J0734j60383p7611N1725N5025j06607p4692K4207R7861Q2319K5687
19251F95122k2708K510j300r8895l6810R6734M0914o4064r5138J09201R8697P2094
19239G96357J08528J33198J04022O9485K43407K40761K87643L66776O48529R20464
19229C919170Q06090N30147J29113l65152q07992p09631n06560m58569k69199
19220B267417r5666j8263r6343j1682J03880J92956K77372Q7661K8444J8631Q9450
$$ plain form
19209 2843857 2993500 3250153 3597798 3873385 4088221 4356404 4648503 5106604 5859742
19200 5859742 6962966 8600996 10887628 13897317 18084802 24855238 36983156 58164602
19192 58164602 84035692 95900363 87556978 68319331 51661658 38734145 29769721
19185 29769721 24700101 22234675 21485640 22324182 25027565 31120560 42865413 61693330
19177 61693330 82706734 93122401 86265440 68943557 51580322 37885856 28097301
19170 28097301 21655740 17480103 14765854 13131724 12116334 11353220 10973775 11073787
19162 11073787 11457087 12366827 13912318 16015902 19168100 24375730 33626366 50091901
19154 50091901 75576969 101170155 113845110 105463531 84964198 63464449 47167652
$$ packed form
19209B843857J49643K56653L47645K75587K14836K68183K92099M58101P53138
19200E859742J103224J638030K286632L009689M187485O770436J2127918K1181446
19192E8164602K5871090J1864671q343385j9237647j6657673j2927513q964424
19185B9769721n069620k465426p49035Q38542K703383O092995J1744853J8827917
19177F1693330K1013404J0415667o856961j7321883j7363235j3694466r788555
19170B8097301o441561m175637k714249j634130j015390p63114l79445J00012
19162A1073787L83300R09740J545491K103584L152198N207630R250636J6465535
19154E0091901K5485068K5593186J2674955q381579k0499333k1499749j6296797
$$ plain form
19147 47167652 35947360 29398741 26708503 26810355 29031979 33208281 41207030 56931852
19139 56931852 85370339 121758895 139654270 128006473 98513686 72125526 51359162
19132 51359162 36216952 26363450 19874889 15461872 12342066 10074863 8353506 7131774
19124 7131774 6285749 5833831 5447677 5051008 4625340 4196384 3881145 3555200 3485975 3562755
19114 3562755 3663050 3644601 3619458 3774155 4264372 5168081 6129947 6571317 6526212 6793626
19104 6793626 7960123 9879366 11680455 12815025 13411880 13747128 13236387 11934889 10232754
19095 10232754 8508097 6940220 5547873 4342527 3387104 2605213 2177302 1793842 1534878
19086 1534878 1342870 1249661 1178807 1029153 878873 875999 780690 684141 690537 687196 651002
$$ packed form
19147D7167652j1220292o548619k690238J01852K221624M176302P998749J5724822
19139E6931852K8438487L6388556J7895375j1647797k9492787k6388160k0766364
19132E1359162j5142210r853502o488561m413017l119806k267203j721357j221732
19124G131774q46025m51918l86154l96669m25668m28956l15239l25945o9225P6780
19114C562755J00295j8449k5143J54697M90217R03709R61866M41370m5105K67414
19104F793626J166497J919243J801089J134570N96855L35248n10741j301498j702135
19095A0232754j724657j567877j392347j205346r55423p81891m27911l83460k58964
19086A534878j92008r3209p0854j49654j50280k874r5309r6549O396l341l6194
$$ plain form
19075 651002 583440 605935 734302 808270 814068 837711 855265 790847 728913 712492 678746
19064 678746 645522 647625 691703 680335 574982 570256 563116 804254 1139102 1588118 1938243
19053 1938243 2157560 2257890 2187211 2229272 2394849 2414416 2238477 1858397 1450586 1237363
19043 1237363 1042026 842505 667425 557462 495242 530465 556129 566789 607033 507017
19033 507017 412163 422853 492472 506839 548229 565409 513301 457200 501654 638071 672254
19022 672254 566515 578372 614535 642479 600657 590736 643447 664608 628233 654248 620698
19011 620698 625138 720990 823852 994180 1231396 1343648 1310934 1201150 1132376 1080115 1061606
19000 1061606 1050101 1101193 1140862 1015893 938576 944709 970904 1021015 944584 781131 803451
$$ packed form
19075F51002o7562K2495J28367P3968N798K3643J7554o4418o1934j6421l3746
19064F78746l3224K103M4078j1368j05353m726p140K41138L34848M49016L50125
19053A938243K19317J00330p0679M2061J65577J9567j75939l80080m07811k13223
19043A237363j95337j99521j75080j09963o2220L5223K5664J0660M0244j00016
19033E07017r4854J0690O9619J4367M1390J7180n2108n6101M4454J36417L4183
19022F72254j05739J1857L6163K7944m1822r921N2711K1161l6375K6015l3550
19011F20698M440R5852J02862J70328K37216J12252l2714j09784o8774n2261j8509
19000A061606j1505N1092L9669j24969p7317O133K6195N0111p6431j63453K2320
$$ plain form
18989 803451 879327 834278 801882 814782 828327 785613 857140 903487 1023506 1168051 1270655
18978 1270655 1300624 1308845 1277705 1289823 1382474 1507556 1602771 1585439 1549513 1516940 1580477
18967 1580477 1676899 1767532 1795215 1791187 1858180 1959810 1947019 1908903 2036595 2258123 2513646
18956 2513646 2841255 3215512 3874914 4579586 5567319 7190099 9977419 14848988 22280484
18947 22280484 29631439 32344821 30793528 29712031 31524877 32521695 29599382 23516272
18939 23516272 17821718 13214118 9739288 7634997 6406846 5600855 5091274 4636836
18931 4636836 4252882 4104730 4064983 4070125 4054227 4028137 3849425 3777321 3834773 3859902 3959048
18920 3959048 4055550 4216043 4328952 4371818 4556603 4824597 5231746 5735753 6092347 6502085
$$ packed form
18989H03451P5876m5049l2396J2900J3545m2714P1527M6347J20019J44545J02604
18978A270655K9969Q221l1140J2118R2651J25082R5215j7332l5926l2573O3537
18967A580477R6422R0633K7683m028O6993J01630j2791l8116J27692K21528K55523
18956B513646L27609L74257O59402P04672R87733J622780K787320M871569P431496
18947B2280484P350955K713382j551293j081497J812846R96818k922313o083110
18939B3516272n694554m607600l474830k104291j228151q05991n09581m54438
18931D636836l83954j48152l9747N142j5898k6090j78712p2104N7452K5129R9146
18920C959048R6502J60493J12909M2866J84785K67994M07149N04007L56594M09738
$$ plain form
18910 6502085 7037185 7914194 9114506 10391171 11707131 13358497 15710543 18775203
18902 18775203 23276996 30425423 42250532 62353794 92267518 119432216 129499519
18895 129499519 125493111 125215645 135646553 140415234 127789465 101779965 77050034
18888 77050034 57801385 43427220 33664167 27513264 23805068 21500893 20114184 19428730
18880 19428730 19498275 20508621 22061674 24125615 27008255 31342997 38116028 48902231
18872 48902231 67180100 98849222 148362556 198620007 214896819 191023645 150726249
18865 150726249 116419872 90442378 74491471 68374882 71157186 84393010 111429805
18858 111429805 152900823 197422125 241829581 290473994 331584651 334679933 289963851
$$ packed form
18910F502085N35100Q77009J200312J276665J315960J651366K352046L064660
18902A8775203M501793P148427J1825109K0103262K9913724K7164698J0067303
18895A29499519m006408k77466J0430908M768681j2625769k6009500k4729931
18888G7050034j9248649j4374165r763053o150903l708196k304175j386709o85454
18880A9428730O9545J010346J553053K063941K882640M334742O773031J0786203
18872D8902231J8277869L1669122M9513334N0257451J6276812k3873174m0297396
18865A50726249l4306377k5977494j5950907o116589K782304J3235824K7036795
18858A11429805M1471018M4521302M4407456M8644413M1110657L095282m4716082
$$ plain form
18851 289963851 223617089 161444653 113573301 79394983 57109849 42946340 33764449
18844 33764449 27479411 22976231 19619848 17249051 15496945 14123862 12882606 11848661
18836 11848661 10766992 9661074 8742710 7858805 7268676 6873014 6729614 6752501 6980054
18827 6980054 7119533 7311394 7846455 8831013 10740610 14186034 20167631 29466495 38084537
18818 38084537 39655565 33669466 25405949 18630992 13315125 9754104 7571671 6250278
18810 6250278 5470848 5059279 4930172 5151067 5987595 7256692 8143837 8165440 7227804
18801 7227804 5918614 4647483 3609206 2937998 2371063 1942111 1648164 1461089 1362110
18792 1362110 1255439 1051534 981581 973462 967259 1001139 1027628 932006 891810 779147 654533
$$ packed form
18851B89963851o6346762o2172436m7871352l4178318k2285134j4163509r181891
18844C3764449o285038m503180l356383k370797j752106j373083j241256j033945
18836A1848661j081669j105918r18364q83905n90129l95662j43400K2887K27553
18827F980054J39479J91861N35061R84558J909597L445424N981597R298864Q618042
18818C8084537J571028n986099q263517o774957n315867l561021k182433j321393
18810F250278p79430m11569j29107K20895Q36528J269097Q87145K1603r37636
18801G227804j309190j271131j038277o71208n66935m28952k93947j87075r8979
18792A362110j06671k03905o9953q119o203L3880K6489r5622m0196j12663j24614
$$ plain form
18781 654533 487540 456174 504091 559050 523244 478526 534063 510976 468045 503181 517959
18770 517959 526954 709081 985131 1272786 1408756 1396158 1160968 971966 756966 532639
18760 532639 425158 456170 488355 441216 362504 337430 338319 285094 227403 180191 207574 234016
18748 234016 254960 208842 229185 167681 160767 236839 237485 191175 220269 346599 291319 263450
18736 263450 272271 334307 313270 244633 125240 56797 80422 116632 150545 182661 218076
18725 218076 308834 287994 259701 183377 189133 215033 203693 271756 295392 284094 227772 217101
18713 217101 233120 297710 241579 207119 289280 272678 217970 212767 171803 73485 161562 285655
18701 285655 273904 241586 178579 163286 239288 285766 322775 335461 347549 258772 256460 249733
$$ packed form
18781F54533j66993l1366M7917N4959l5806m4718N5537k3087m2931L5136J4778
18770E17959Q995J82127K76050K87655J35970j2598k35190j89002k15000k24327
18760E32639j07481L1012L2185m7139p8712k5074Q89n3225n7691m7212K7383K6442
18748B34016K0944m6118K0343o1504o914P6072O46m6310K9094J26330n5280k7869
18736B63450Q821O2036k1037o8637j19393o8443K3625L6210L3913L2116L5415
18725B18076R0758k0840k8293p6324N756K5900j1340O8063K3636j1298n6322j0671
18713B17101J6019O4590n6131l4460Q2161j6602n4708n203m0964r8318Q8077J24093
18701B85655j1751l2318o3007j5293P6002M6478L7009J2686J2088q8777k312o727
$$ plain form
18689 249733 198529 84927 164 -1104 57175 93804 151197 55408 -9385 -67928 -12953
18678 -12953 118991 124587 54909 2282 16864 94180 248206 321181 284127 192899 48546
18667 48546 9684 80455 125057 141289 262995 218925 200020 249426 297409 288769 149256
18656 149256 79419 96178 279684 475183 465440 452276 553844 844782 1120850 1195889 992882
18645 992882 832966 913907 912864 1083285 1524009 2174597 2420767 2298084 2082455 1845680
18635 1845680 1615832 1342841 1232513 1154339 1189561 1418093 1805633 2037444 1896770 1598415
18625 1598415 1272288 859913 590620 473867 380175 241707 158077 72836 996 149722
18615 149722 174617 181719 261017 242014 279377 428359 554168 600190 657853 622348 618679
$$ packed form
18689B49733n1204j13602q4763j268N8279L6629N7393r5789o4793n8543N4975
18678a2953J31944N596o9678n2627J4582P7316J54026P2975l7054r1228j44353
18667D8546l8862P0771M4602J6232J21706m4070j8905M9406M7983q640j39513
18656A49256o9837J6759J83506J95499r743j3164J01568K90938K76068P5039k03007
18645I92882j59916Q0941j043J70421M40724O50588K46170j22683k15629k36775
18635A845680k29848k72991j10328p8174L5222K28532L87540K31811j40674k98355
18625A598415l26127m12375k69293j16753r3692j38468q3630q5241p1840J48726
18615A49722K4895P102P9298j9003L7363J48982J25809M6022N7663l5505l669
$$ plain form
18604 618679 612529 601658 570970 628254 635187 660423 829839 1060994 1393576 1973035 2313171
18593 2313171 2250394 1832786 1369743 1180434 995559 730737 652966 756544 970698 1369257
18583 1369257 1671353 1487798 1138252 860449 598778 499906 492817 453944 385360 373919
18573 373919 251933 219925 159667 128292 20508 97598 117237 -8150 -95791 19440 26684
18562 26684 18864 18236 73811 31188 -40013 -10843 51786 170128 246058 156498 83090 60559
18550 60559 66789 17677 41237 -46403 36440 63099 19715 -9240 -43385 -41604 -32085 -141630
18538 -141630 -86132 48906 152112 93922 52121 135425 182574 243004 186981 157426 82182
18527 82182 48075 -9267 23416 -14352 -11875 55890 127869 126194 155112 204829 200633 172437
$$ packed form
18604F18679o150j0871l0688N7284O933K5236J69416K31155L32582N79459L40136
18593B313171o2777m17608m63043j89309j84875k64822p7771J03578K14154L98559
18583A369257L02096j83555l49546k77803k61671r8872p089l8873o8584j1441
18573C73919j21986l2008o0258l1375j07784P7090J9639j25387q7641J15231P244
18562B6684p820o28N5575m2623p1201K9170O2629J18342P5930q9560p3408k2531
18550F0559O230m9112K3560q7640Q2843K6659m3384k8955l4145J781R519j09545
18538a41630N5498J35038J03206n8190m1801Q3304M7149O0430n6023k9555p5244
18527H2182l4107n7342L2683l7768K477O7765P1979j675K8918M9717m196k8196
$$ plain form
18515 172437 87876 91885 57449 44994 58188 135104 168877 157010 156333 172701 41663 35387
18503 35387 -1465 -2761 14426 -21557 94702 111650 30405 21421 41014 -17967 2077 76146
18491 76146 -36247 -167574 -179776 -217019 -184476 -111548 -142747 -112058 -104874 -93686 -88295 -116021
18479 -116021 -62806 91195 115942 35220 5181 -7197 -54097 -67130 -82551 -55950 10880
18468 10880 -13591 43664 38637 -73040 -110161 -95215 -5229 73860 -56374 -60344 -55477 -40673
18456 -40673 -99242 -94615 -91788 -102995 -38615 -26081 -20128 23044 -33750 -96770 -30727 -10900
18444 -10900 24580 52234 57976 99716 67464 85232 52742 -24473 45591 144840 144831 203647 284000
18431 284000 244263 80180 -2100 18198 37072 -14474 -118793 -51236 59161 74311 74328
$$ packed form
18515A72437q4561M009l4436j2455J3194P6916L3773j1867o77J6368j31038o276
18503C5387l6852j296J7187l5983J16259J6948q1245q984J9593n8981K0044P4069
18491G6146j12393j31327j2202l7243L2543P2928l1199L0689P184J1188N391k7726
18479a16021N3215J54001K4747q0722l0039j2378m6900j3033j5421K6601O6830
18468A0880k4471N7255n027j11677l7121J4946Q9986P9089j30234l970M867J4804
18456d0673n8569M627K827j1207O4380J2534N953M3172n6794o3020O6043J9827
18444a0900L5480K7654N742M1740l2252J7768l2490p7215P0064R9249rN8816Q0353
18431B84000l9737j64083q2280K0298J8874n1546j04319O7557J10397J5150J7
$$ plain form
18420 74328 31629 47004 51150 69378 18763 68785 165699 144362 95310 82521 68228 201697
18408 201697 302204 471531 597639 618413 427741 374428 335863 331497 298184 200558 92254
18397 92254 71720 100855 91468 64893 -5363 -31624 -126164 -224505 -235971 -257566 -194677 -53255
18385 -53255 44317 -5749 -10735 104266 65595 37892 71272 50521 41050 75726 97511 73441
18373 73441 29201 7057 -101785 -207140 -179327 14484 154519 151699 37511 108139 149576
18362 149576 303362 458925 640203 784562 961254 917589 847050 801350 868080 811726
18352 811726 751674 739069 783250 654561 490023 397542 291965 194695 139393 85193 145062
18341 145062 182925 223359 325240 294326 194194 124001 11507 -14227 159352 222895 271266
$$ packed form
18420G4328m2699J5375M146J8228n0615N0022R6914k1337m9052j2789j4293J33469
18408B01697J00507J69327J26108K0774j90672n3313l8565m366l3313r7626j08304
18397I2254k0534K9135r387k6575p0256k6261r4540r8341j1466k1595O2889J41422
18385e3255R7572n0066m986J15001l8671k7703L3380k0751r471L4676K1785k4070
18373G3441m4240k2144j08842j05355K7813J93811J40035k820j14188P0628M1437
18362A49576J53786J55563J81278J44359J76692m3665p0539m5700O6730n6354
18352H11726o0052j2605M4181j28689j64538r2481j05577r7270n5302n4200N9869
18341A45062L7863M0434J01881l0914j00132p0193j12494k5734J73579O3543M8371
$$ plain form
18330 271266 297277 383736 606047 746560 773942 691148 632511 647542 676282 808273 707607
18319 707607 571142 449485 364202 276702 102437 84693 99931 162677 208687 243951 315488
18308 315488 319781 291949 344373 287509 201401 160818 200298 197865 199340 208101 141244 82737
18296 82737 85226 54729 39434 68969 150064 119040 52822 3293 -74174 -87182 -50654 -68785
18284 -68785 50818 100878 112482 207141 316765 429666 582860 736636 667868 663401 670642
18273 670642 745143 875041 875176 750014 531438 401961 244092 95197 58302 26502 147782
18262 147782 49279 -69529 -98889 -28587 94734 105975 126871 111208 66759 130467 17614
18251 17614 -125542 -113713 -80294 -72802 -125351 -73257 -75667 -77599 27839 115251 39400 -26
$$ packed form
18330B71266K6011Q6459K22311J40513K7382q2794n8637J5031K8740J31991j00666
18319G07607j36465j21657q5283q7500j74265j7744J5238O2746M6010L5264P1537
18308C15488M293k7832N2424n6864q6108m0583L9480k433J475Q761o6857n8507
18296H2737K489l0497j5295K9535Q1095l1024o6218m9529p7467j3008L6528j8131
18284f8785J19603N0060J1604R4659J09624J12901J53194J53776o8768m467P241
18273F70642P4501J29898J35j25162k18576j29477j57869j48895l6895l1800J21280
18262A47782r8503j18808k9360P0302J23321J1241K0896j5663m4449O3708j12853
18251A7614j43156J1829L3419P492n2549N2094k410j932J05438Q7412p5851l9426
$$ plain form
18239 -26 49232 75100 -58736 -41007 60677 168069 154541 68374 -40715 -67768 -46791
18228 -46791 -70018 -61099 23635 47887 109246 140389 91674 79955 59527 194750 215758 169675
18216 169675 153471 102059 124916 150289 185201 158871 203488 219973 176915 178226 218956 242972
18204 242972 149626 138511 164665 60762 174113 234915 94713 46019 80548 98307 208368
18193 208368 283163 307900 248114 201580 112471 82175 138613 119578 102149 143568 171964
18182 171964 149176 225147 242140 155642 150593 83728 73919 46977 83293 54178 -31783 -12168
18170 -12168 173110 306863 255566 217961 251585 366846 424878 354123 408723 371874 339967
18159 339967 303849 361363 457063 443604 477049 455464 443168 430379 546789 498978 455468
$$ packed form
18239b6M9258K5868j33836J7729J01684J07392j3528q6167j09089k7053K0977
18228d6791k3227Q919Q4734K4252O1359L1143m8715j1719k0428J35223K1008m6083
18216A69675j6204n1412K2857K5373L4912k6330M4617J6485m3058J311M0730K4016
18204B42972r3346j1115K6154j03903J13351O0802j40202m8694L4529J7759J10061
18193B08368P4795K4737n9786m6534q9109l0296N6438j9035j7429M1419K8396
18182A71964k2788P5971J6993q6498n049o6865r809k6942L6316k9115q5961J9615
18170a2168J85278J33753n1297l7605L3624J15261N8032p0755N4600l6849l1907
18159C39967l6118N7514R5700j3459L3445k1585j2296j2789J16410m7811m3510
$$ plain form
18148 455468 470014 638874 675944 605214 599904 678048 717369 770196 755469 870601 1018850
18137 1018850 1092969 1166175 1239169 1197883 1260465 1425279 1599941 1820797 2027631 2176282
18127 2176282 2273638 2414809 2667361 3048700 3528723 3998067 4612386 5384430 6266755 7325743
18117 7325743 8776812 10925261 13897064 18322877 25204878 36378246 56181721 92810178
18109 92810178 150114236 193669313 191588420 150491577 107664471 74578789 49371874
18102 49371874 33133798 23213402 16963046 13074893 10364578 8269706 6743276 5625652
18094 5625652 4831847 4110025 3564173 3133176 2722835 2369669 2047688 1884495 1819946 1632612
18084 1632612 1337420 1118734 1004366 978350 958872 962840 892548 784768 658531 652785 636599
$$ packed form
18148D55468J4546J68860L7070p0730n310P8144L9321N2827j4727J15132J48249
18137A018850P4119P3206P2994m1286O2582J64814J74662K20856K06834J48651
18127B176282R7356J41171K52552L81339M80023M69344O14319P72044Q82325J058988
18117G325743J451069K148449K971803M425813O882001J1173368J9803475L6628457
18109I2810178N7304058M3555077k080893m1096843m2827106l3085682k5206915
18102D9371874j6238076r920396o250356l888153k710315k094872j526430j117624
18094E625652p93805p21822n45852m30997m10341l53166l21981j63193o4549j87334
18084A632612k95192k18686j14368k6016j9478L968p0292j07780j26237n746j6186
$$ plain form
18073 636599 650597 629851 576112 587825 515372 363043 367289 321987 280225 255645 324419
18062 324419 259097 145780 219411 356375 350373 243806 109686 150917 124620 141183 128432
18051 128432 233873 299968 272574 251882 204626 244434 306203 167416 179158 152421 82218
18040 82218 25376 23366 30538 39229 114700 92541 118617 95946 111751 73953 99163 100015 57944
18027 57944 -28372 -65052 -142877 -179840 -100547 -36446 -29402 44321 157362 90078 -12016
18016 -12016 -88540 -160365 -246830 -217132 -90955 -89506 -65538 -45199 39420 5294 30638 67418
18004 67418 -20270 -52643 -44487 1831 48852 -19526 -36192 -21616 -81443 -146182 -229130 -212854
17992 -212854 -96510 499 46162 11130 -38701 72454 81789 109215 146991 257002 194511
$$ packed form
18073F36599J3998k0746n3739J1713p2453j52329M246m5302m1762k4580O8774
18062C24419o5322j13317P3631J36964o002j06567j34120M1231k6297J6563j2751
18051A28432J05441O6095k7394k0692m7256L9808O1769j38787J1742k6737p0203
18040H2218n6842k010P172Q691P5471k2159K6076k2671J5805l7798K5210Q52m2071
18027E7944q6316l6680p7825l6963P9293O4101P044P3723J13041o7284j02094
18016a2016p6524p1825q6465K9698J26177J449K3968K0339Q4619l4126K5344L6780
18004F7418q7688l2373Q156M6318M7021o8378j6666J4576n9827o4739q2948J6276
17992b12854J16344R7009M5663l5032m9831J11155R335K7426L7776J10011o2491
$$ plain form
17981 194511 106969 52402 34479 14682 84916 163366 163779 157182 109682 23716 -36487 7413
17969 7413 2767 12154 -25010 -71682 -27611 -12904 22258 38336 25935 -37031 -109483 -20461
17957 -20461 9357 -35114 -143487 -158648 -193097 -238136 -155737 -115176 -90440 -105728 -124299
17946 -124299 -149737 -43557 -49429 -101026 -148267 -189506 -180382 -112576 -91109 8911 1203 15097
17934 15097 122974 72903 80704 65202 67889 6949 49894 -25223 -72883 -107519 -114889 -147410
17922 -147410 -279001 -289205 -208641 -175628 -120208 -96012 -56262 -120099 -54347 -74552 -109459
17911 -109459 -80423 -80752 -209958 -229752 -253909 -324709 -354672 -273475 -183968 -183138 -146264 -87928
17899 -87928 -79007 -175024 -263826 -327842 -289867 -255475 -324187 -266973 -177239 -162181 -148260 -184651
$$ packed form
17981A94511q7542n4567j7923j9797P0234P8450M13o597m7500q5966o0203M3900
17969G413m646R387l7164m6672M4071J4707L5162J6078j2401o2966p2452Q9022
17957b0461K9818m4471j08373j5161l4449m5039Q2399M0561K4736j5288j8571
17946a24299k5438J06180n872n1597m7241m1239R124O7806K1467J00020p708J3894
17934A5097J07877n0071P801j5502K687o0940M2945p5117m7660l4636p370l2521
17922a47410j31591j0204Q0564L3013N5420K4196L9750o3837O5752k0205l4907
17911a09459K9036l29j29206j9794k4157p0800k9963Q1197Q9507Q30L6874N8336
17899h7928Q921r6017q8802o4016L7975L4392o8712N7214Q9734J5058J3921l6391
$$ plain form
17887 -184651 -225307 -206742 -127252 -6800 48992 -55706 -96761 -98747 -129085 -161403 -142267
17876 -142267 -121824 -60498 48774 65733 19439 -43750 -35679 -12401 3851 8261 -28489 -31561
17864 -31561 -111555 -180774 -218739 -194382 -89573 68437 162349 159283 123628 82194 37318
17853 37318 56403 40630 2947 42402 -4767 -45993 -76713 -112249 -113768 -22497 41176 58327
17841 58327 91656 65705 40656 3767 -35748 -35806 82294 88128 -17412 -61441 -91840 -131475
17829 -131475 -168944 -107705 -71263 -875 147641 171939 66640 32385 -72970 -109308 -66625
17818 -66625 -41255 107917 127687 83089 24976 169016 130070 7552 7933 78983 127597
17807 127597 64693 8448 70995 99224 -64239 -119022 -104975 -30390 59352 42015 -76163
$$ packed form
17887a84651m0656J8565P9490J20452N5792j04698m1055j986l0338l2318J9136
17876a42267K0443O1326J09272J6959m6294o3189Q071K3278J6252M410l6750l072
17864c1561p9994o9219l7965K4357J04809J58010R3912l066l5655m1434m4876
17853C7318J9085j5773l7683L9455m7169m1226l0720l5536j519R1271O3673J7151
17841E8327L3329k5951k5049l6889l9515n8J18100N834j05540m4029l0399l9635
17829a31475l7469O1239L6442P0388J48516K4298j05299l4255j05355l6338M2683
17818f6625K5370J49172J9770m4598n8113J44040l8946j22518L81P1050M8614
17807A27597o2904n6245O2547K8229j63463n4783J4047P4585Q9742j7337j18178
$$ plain form
17796 -76163 -62554 -110811 -194281 -191394 -159602 -149921 -116367 -96402 15816 -68861 -118819 -114933
17784 -114933 -75958 -160801 -60245 -5532 -50750 -37241 -12619 -36584 -150002 -180419 -232144
17773 -232144 -278230 -249133 -153675 -69346 -69072 -53108 -23868 38105 48962 113412 49425 47211
17761 47211 22260 -9704 31229 20131 -51467 -63765 -20658 31446 -29594 -55450 -75457 -58980
17749 -58980 -16336 45311 836 -51409 -83128 -127709 -124183 -98174 -77636 -46146 90417 136460
17737 136460 68939 130082 160709 99278 84765 99847 45619 -23933 -100737 -50953 -44712 44168
17725 44168 76092 110192 81837 -1484 27707 36545 40266 23444 17413 -53147 -45865 -9834
17713 -9834 -58207 -87454 -99161 -34519 89763 47271 -42442 -82448 -109741 -191169 -172145 -173970
$$ packed form
17796g6163J3609m8257q3470K887L1792R681L3554J9965J12218q4677m9958L886
17784a14933L8975q4843J00556N4713m5218J3509K4622k3965j13418l0417n1725
17773b32144m6086K9097R5458Q4329K74J5964K9240O1973J0857O4450o3987k214
17761D7211k4951l1964M0933j1098p1598j2298M3107N2104o1040k5856k0007J6477
17749e8980M2644O1647m4475n2245l1719m4581L526K6009K0538L1490J36563M6043
17737A36460o7521O1143L0627o1431j4513J5082n4228o9552p6804M9784O241Q8880
17725D4168L1924L4100k8355q3321K9191Q838L721j6822o031p0560P282L6031
17713i834m8373k9247j1707O4642J24282m2492q9713m0006k7293q1428J9024j825
$$ plain form
17701 -173970 -49880 -795 -59500 -46291 -16343 -28898 16789 -37322 -52267 -24878 -16202
17690 -16202 87900 79127 -34655 -121784 -32502 42124 25089 3801 123945 155818 140885
17679 140885 96093 -25819 -123612 -186105 -252544 -209088 -120018 -122707 2752 6944 -17030
17668 -17030 -71204 -169137 -203939 -197020 -88636 -71477 -78249 -102707 -53869 -45385 -97281 -52232
17656 -52232 -35583 28532 118407 168481 107590 80740 -19809 -54062 -109213 -58113 -11153
17645 -11153 4674 14753 -78295 -141756 -177718 -90463 -64064 -34037 -102324 -117116 -89555 -114761
17633 -114761 -123847 -39626 36865 67988 72150 26120 -26061 -72588 -91335 -19013 -33817 -70161
17621 -70161 -64361 18974 -8635 -40093 -67239 -19383 82365 24992 53170 3226 63364 165842
$$ packed form
17701a73970J24090M9085n8705J3209K9948j2555M5687n4111j4945K7389Q676
17690a6202J04102q773j13782q7129Q9282P4626j7035k1288J20144L1873j4933
17679A40885m4792j21912r7793o2493o6439M3456Q9070k689J25459M192k3974
17668a7030n4174r7933l4802O919J08384J7159o772k4458M8838Q484n1896M5049
17656e2232J6649O4115Q9875N0074o0891k6850j00549l4253n5151N1100M6960
17645a1153J5827J0079r3048o3461l5962Q7255K6399L0027o8287j4792K7561k5206
17633a14761r086Q4221P6491L1123M162m6030n2181m6527j8747P2322j4804l6344
17621g0161N800Q3335k7609l1458k7146M7856J01748n7373K8178m9944O0138J02478
$$ plain form
17609 165842 246575 194768 2016 -76129 -37363 47683 32443 -16880 -63762 90150 186271
17598 186271 52135 -1879 -60259 -81088 2679 -58944 -79269 -124061 -116287 -55712 -59204 -61679
17586 -61679 -94583 -118585 -116255 -65773 -35640 -66164 -204879 -266355 -193194 -121772 -120790 -99426
17574 -99426 -118685 -47667 -19301 -25528 -34602 15987 -34694 -62731 -51810 -115446 -150461 -158689
17562 -158689 -113819 -133762 -75816 16449 63919 22638 -39600 -54480 83206 121512 30273
17551 30273 -106439 -173205 -97943 -15928 87840 114713 28366 -6590 -68146 -42678 -47603
17540 -47603 -8171 31940 3615 71031 99991 66737 -12957 -47312 -50460 -35334 -124797 -169316
17528 -169316 -116908 -12722 15202 33308 -7147 -146802 -206468 -87941 10928 -72765 -119635
$$ packed form
17609A65842Q0733n1807j92752p8145L8766Q5046j5240m9323m6882J53912R6121
17598A86271j34136n4014n8380k0829Q3767o1623k0325m4792P774O0575l492k475
17586f1679l2904k4002K330N0482L0133l0524j38715o1476P3161P1422R82K1364
17574i9426j9259P1018K8366o227r074N0589n0681k8037J0921o3636l5015q228
17562a58689M4870j9943N7946R2265M7470m1281o2238j4880J37686L8306r1239
17551C0273j36712o6766P5262Q2015J03768K6873q6347l4956o1556K5468m925
17540d7603L9432M0111k8325O7416K8960l3254p9694l4355l148J5126q9463m4519
17528a69316N2408J04186K7924J8106m0455j39655n9666J18527R8869q3693m6870
$$ plain form
17517 -119635 -166094 -41093 18696 -12290 50715 -49193 -77695 -18798 32060 47887 21744
17506 21744 63104 20107 -72490 -159879 -135087 -32935 -31092 7030 -21228 -78807 -146051 -86566
17494 -86566 -48109 -64624 -39387 -90326 -76209 -132824 -195604 -301432 -338113 -358281 -287511
17483 -287511 -135611 -81660 -155858 -204837 -126373 -154293 -211560 -197493 -182911 -121367 -91768
17472 -91768 -147757 -242342 -268436 -173146 -90279 -36725 -30662 -39920 -102123 -31142 80939 19938
17460 19938 -32354 -78135 -53513 909 14953 40999 70089 104891 138897 82482 69567 71410
17448 71410 74541 79906 64091 145281 291001 648424 1022470 1015592 756842 532984 309933
17437 309933 108764 103621 122046 103763 109119 161767 68402 -92624 -86836 -3263 33329 68105
$$ packed form
17517a19635m6459J25001N9789l0986O3005r9908k8502N8897N0858J5827k6143
17506B1744M1360m2997r2597q7389K4792J02152J843L8122k8258n7579o7244N9485
17494h6566L8457j6515K5237n0939J4117n6615o2780j05828l6681k0168P0770
17483b87511J51900N3951p4198m8979P8464k7920n7267J4067J4582O1544K9599
17472i1768n5989r4585k6094R5290Q2867N3554O063r258o2203P0981J12081o1001
17460A9938n2292m5781K4622N4422J4044K6046K9090L4802L4006n6415j2915J843
17448G1410L131N365j5815Q1190J45720L57423L74046o878k58750k23858k23051
17437C09933k01169n143J8425j8283N356N2648r3365j61026N788Q3573L6592L4776
$$ plain form
17425 68105 40403 96650 118787 78601 -17959 -34227 57247 28850 59329 153644 114398 33688
17413 33688 -67826 -56523 -12684 12746 -61117 -55866 8900 41872 -18657 2223 56846 15687
17401 15687 -29918 -86554 -88947 -37429 35469 108632 64090 -3020 -77882 -160555 -90124 -11610
17389 -11610 -67655 -60615 -3473 -18065 29726 -36435 -150193 -245880 -203088 -180732 -273887 -209795
17377 -209795 -153321 -119074 -95720 -187795 -196231 -175258 -37749 116506 32396 -107741 -123136
17366 -123136 -90111 -67496 -40776 -66362 -71882 -63461 -61369 -73830 -54628 -62060 -6774 22051
17354 22051 -59199 15914 71498 50696 -1292 -2996 20032 41332 6386 17379 87464 105789
17342 105789 51746 -11768 91618 249490 171650 7421 -55866 56321 19751 -92633
$$ packed form
17425F8105k7702N6247K2137m0186r6560j6268R1474k8397L0479R4315l9246q0710
17413C3688j01514J1303M3839K5430p3863N251O4766L2972o0529K0880N4623m1159
17401A5687m5605n6636k393N1518P2898P3163m4542o7110p4862q2673P0431P8514
17389a1610n6045P040N7142j4592M7791o6161j13758r5687M2792K2356r3155O4092
17377b09795N6474L4247K3354r2075q436K0973J37509J54255q4110j40137j5395
17366a23136L3025K2615K6720k5586n520Q421K092j2461J9202p432N5286K8825
17354B2051q1250P5113N5584k0802n1988j704K3028K1300l4946J0993P0085J8325
17342A05789n4043o3514J03386J57872p7840j64229o3287J12187l6570j12384
$$ plain form
17332 -92633 -154124 -209668 -76034 -36790 -25287 96139 105408 39836 64905 49676 -21044
17321 -21044 -6426 -86856 -161196 -109894 -22822 8233 -71164 -137530 -27647 65842 8360
17310 8360 -40464 -94250 -120254 -14193 29575 -5225 -2499 -25761 -48117 -38783 -52124 -106032
17298 -106032 -133053 -80354 -98310 -120400 -109882 -145653 -119272 -26659 -84166 -97185 5513
17287 5513 -15257 -50788 -109124 -164855 -256587 -261317 -245573 -114994 -20467 -45132 3951 43235
17275 43235 47971 33714 35689 118518 126707 -43994 -84915 -69438 -76540 -146867 -144216 -43461
17263 -43461 -9477 -9452 -26399 -161360 -235763 -185868 -102208 -80517 -63321 -87136 -134820 -173412
17251 -173412 -193694 -83209 -108109 -42030 92656 35687 -30239 -21691 16753 62036 42205
$$ packed form
17332i2633o1491n5544J33634L9244J1503J21426R269o5572K5069j5229p0720
17321b1044J4618q0430p4340N1302Q7072L1055p9397o6366J09883R3489n7482
17310H360m8824n3786k6004J06061M3768l4800K726k3262k2356R334j3341n3908
17298a06032k7021N2699j7956k2090J0518l5771K6381R2613n7507j3019J02698
17287E513k0770l5531n8336n5731r1732m730J5744J30579R4527k4665M9083L9284
17275D3235M736j4257J975Q2829Q189j70701m0921J5477p102p0327K651J00755
17263d3461L3984K5j6947j34961p4403M9895Q3660K1691J7196k3815m7684l8592
17251a73412k0282J10485k4900O6079J34686n6969o5926Q548L8444M5283j9831
$$ plain form
17240 42205 -84224 -62188 -84756 -75579 -96723 -111602 -177703 -135315 -65214 -21053 -16339 -104569
17228 -104569 -188206 -217292 -160302 -9736 -13606 -32120 7495 -77349 -163497 -160332 -167464 -165457
17216 -165457 -58699 -50744 17187 34699 -9891 -33835 25572 -8187 -55508 -71561 -57756
17205 -57756 -52016 -4504 -43309 -78935 -68816 -191546 -182603 -14553 34570 -61973 -103447 -78856
17193 -78856 3341 47585 101164 136056 92819 40336 83739 43539 24091 -13407 -25815 -90271
17181 -90271 -42113 -49754 -95830 -106206 -168901 -213876 -209216 -147353 -132189 -111641 -49875 49437
17169 49437 3543 -1765 -28821 -37289 -41124 -57860 -93674 -151641 -140431 -99983 -113986 -120250
17157 -120250 -10234 -6481 33186 17777 6515 29727 86003 37878 -13913 -109942 -101688 -5699
$$ packed form
17240D2205j26429K2036k2568R177k1144j4879o6101M2388P0101M4161M714q8230
17228a04569q3637k9086N6990J50566l870j8514L9615q4844q6148L165p132K007
17216a65457J06758P955O7931J7512m4590k3944N9407l3759m7321j6053J3805
17205e7756N740M7512l8805l5626J0119j22730Q943J68050M9123r6543m1474K4591
17193g8856Q2197M4244N3579L4892m3237n2483M3403m0200j9448l7498j2408o4456
17181i0271M8158p641m6076j0376o2695m4975M660O1863J5164K0548O1766R9312
17169D9437m5894n308k7056q468l835j6736l5814n7967J1210M0448j4003o264
17157a20250J10016L753L9667j5409j1262K3212N6276m8125n1791r6029Q254R5989
$$ plain form
17145 -5699 43624 68618 49763 7456 48180 -75153 -140669 -196791 -273536 -287546 -190202 -61151
17133 -61151 33137 38289 -114249 -164436 -186185 -153733 -166176 -3261 18380 -85475 -158798
17122 -158798 -148900 -57669 -2680 -12707 -30475 -53065 -52534 -19997 5474 76876 341 -72282
17110 -72282 -113769 -68189 24961 39936 59327 141737 210150 173728 123467 71515 79633 58658
17098 58658 -59428 -80901 -33560 -64467 -17373 -37770 -100126 -66142 -86933 -96848 -57386 -62522
17086 -62522 16977 -593 -69789 -93517 5969 11260 4196 85730 158741 139277 100800 -13144
17074 -13144 36154 -14163 -36931 -63886 -116075 -188021 -156130 -98834 -174679 -201893 -231157 -119515
17062 -119515 -116321 -117575 -202942 -103092 -70296 -120575 -156513 -99370 -71626 -73196 -73267 -33126 -122458
$$ packed form
17145e699M9323K4994j8855m2307M0724j23333o5516n6122p6745j4010R7344J29051
17133f1151R4288N152j52538n0187k1749L2452j2443J62915K1641j03855p3323
17122a58798R898R1231N4989j0027j7768k2590N31L2537K5471P1402p6535p2623
17110g2282m1487M5580R3150J4975J9391Q2410O8413l6422n0261n1952Q118k0975
17098E8658j18086k1473M7341l0907M7094k0397o2356L3984k0791r915L9462n136
17086f2522P9499j7570o9196k3728R9486N291p064Q1534P3011j9464l8477j13944
17074a3144M9298n0317k2768k6955n2189p1946L1891N7296p5845k7214k9264J11642
17062a19515L194j254q5367R9850L2796n0279l5938N7143K7744j570p1M0141q9332
$$ plain form
17049 -122458 -144500 -41959 29198 82302 60211 5264 -5556 -25275 55579 71108 9278
17038 9278 -64997 -210428 -247509 -202723 -128920 -110328 -86655 -47192 -152877 -233203 -170661
17027 -170661 -132367 -92077 5495 57819 55536 27219 9311 -167809 -288002 -300535 -233130
17016 -233130 -166847 -106139 19208 67601 87102 106036 194779 159145 47710 -14014 14429
17005 14429 23956 8101 -54190 -51677 -90386 -76861 -60091 -180830 -177829 -90039 -125531 -112628
16993 -112628 -66257 -110683 -232070 -205899 -208745 -152768 -57178 -46620 -11411 -98902 -120211
16982 -120211 -15490 117017 -46371 -101523 -125334 -80988 -136127 -102804 -13646 -3207 -56231
16971 -56231 -74391 -139858 -116810 -55467 -22779 -51388 -50331 -42067 -10138 -156956 -226143 -236387
$$ packed form
17049a22458k2042J02541P1157N3104k2091n4947j0820j9719Q0854J5529o1830
17038I278p4275j45431l7081M4786P3803J8592K3673L9463j05685q0326O2542
17027a70661L8294M0290R7572N2324k283k8317j7908j77120j20193j2533O7405
17016b33130O6283O0708J25347M8393J9501J8934Q8743l5634j11435o1724K8443
17005A4429R527j5855o2291K513l8709J3525J6770j20739L001Q7790l5492J2903
16993a12628M6371m4426j21387K6171k846N5977R5590J0558L5209q7491k1309
16982a20211J04721J32507j63388n5152k3811M4346n5139L3323Q9158J0439n3024
16971e6231j8160o5467K3048O1343L2688k8609J057Q264L1929j46818o9187j0244
$$ plain form
16959 -236387 -198692 -166893 -160460 -74627 -58358 -39147 -39296 -214723 -396288 -379477 -249592
16948 -249592 -197988 -154334 -171267 -190243 -219743 -112847 -112548 -123595 -33579 35956 45848 23218
16936 23218 -94712 -95404 -68264 -49238 -67128 -96770 -170177 -187434 -137262 -41114 -95206 -33340
16924 -33340 31939 22806 54907 109440 100205 116863 154400 148284 86764 2790 -63977 -70799
16912 -70799 -164646 -101930 -8528 -18921 -6920 -51441 -164275 -106819 50635 116894 32354
16901 32354 -91128 -60324 -99946 -102673 -133151 -180685 -200119 -250090 -214729 -102426 -48381
16890 -48381 -225244 -264387 -101218 3630 33462 -43843 3396 -1985 -49622 -134475 -97828
16879 -97828 -74722 -115670 -229628 -233146 -263541 -293090 -253019 -226613 -235327 -236088 -225475 -126471
$$ packed form
16959b36387L7695L1799O433Q5833J6269J9211j49j75427j81565J6811J29885
16948b49592N1604M3654j6933j8976k9500J06896K99j1047R0016O9535R892k2630
16936B3218j17930o92K7140J9026j7890k9642p3407j7257N0172R6148n4092O1866
16924c3340O5279r133L2101N4533r235J6658L7537o116o1520q3974o6767o822
16912g0799r3847O2716R3402j0393J2001m4521j12834N7456J57454O6259q4540
16901C2354j23482L0804l9622k727l0478m7534j9434m9971L5361J12303N4045
16890d8381j76863l9143J63169J04848K9832p7305M7239n381m7637q4853L6647
16879i7828K3106m0948j13958l518l0395k9549M0071K6406q714p61J0613R9004
$$ plain form
16867 -126471 -75362 -23681 41696 69536 47202 -44993 -90818 -55010 -20781 -97562 -30159
16856 -30159 -2766 -41717 -74382 -59537 14393 61410 100953 61749 41076 27923 64566 -2802
16844 -2802 -19727 15882 -7500 -61631 -71811 -116109 -203228 -174519 -64690 -73012 -65073 -37391
16832 -37391 -161857 -218424 -110454 -127131 -90536 -67420 -48435 -29359 -16269 -19959 9935
16821 9935 4989 2964 45071 81590 22251 -104776 -47815 10644 56566 65561 52831 98065
16809 98065 51021 -19129 -128876 -208392 -255545 -119698 37685 -42203 -106961 -182634 -236255
16798 -236255 -133180 -56208 -64408 -150043 -192716 -51170 -25085 -26836 -43103 -102562 -55993
16787 -55993 -26555 -94931 -115226 -18206 -9296 -51107 -98493 -75439 -168516 -199294 -212852 -231154
$$ packed form
16867a26471N1109N1681O5377K7840k2334r2195m5825L5808L4229p6781O7403
16856c0159K7393l8951l2665J4845P3930M7017L9543l9204k0673j3153L6643o7368
16844b802j6925L5609k3382n4131j0180m4298q7119K8709J09829q322P939K7682
16832c7391j24466n6567J07970j6677L6595K3116J8985J9076J3090l690K9894
16821I935m946k025M2107L6519n9339j27027N6961N8459M5922Q995j2730M5234
16809I8065m7044p0150j09747p9516m7153J35847J57383p9888o4758p5673n3621
16798b36255J03075P6972q200q5635m2673J41546K6085j751j6267n9459M6569
16787e5993K9438o8376k0295R7020Q910m1811m7386K3054r3077l0778j3558j8302
$$ plain form
16775 -231154 -134283 -157635 -139914 -147152 -29050 74031 -6147 -110459 -110832 -99808 -26015
16764 -26015 -86330 -152058 -104720 -184713 -240205 -206381 -105114 -8095 100135 116095 157338
16753 157338 86521 -59622 -155804 -156688 -172273 -213593 -249284 -155556 -56682 -24727 -34319 -93898
16741 -93898 -200241 -130895 -106503 -119239 -68408 22005 -13436 -138920 -169352 -83813 91575
16730 91575 87949 143397 148033 159991 68932 -103641 -46551 103376 14565 -51762 -94640 -150943
16718 -150943 5371 99183 37455 15422 110666 135014 89571 108737 70192 79947 13058
16707 13058 -69304 -89315 -125391 -188708 -169112 -182952 -128031 -181901 -160071 -54795 -116864
16696 -116864 -108601 -56617 10650 -53997 -155631 -211147 -202293 -237847 -239881 -161946 -264470 -200047
$$ packed form
16775b31154R6871k3352J7721p238J18102J03081q0178j04312l73J1024P3793
16764b6015o0315o5728M7338p9993n5492L3824J01267R7019J08230J5960M1243
16753A57338p0817j46143r6182q84j5585m1320l5691R3728R8874L1955r592n9579
16741i3898j06343O9346K4392j2736N0831R0413l5441j25484l0432Q5539J75388
16730I1575l626N5448M636J1958r1059j72573N7090J49927q8811o6327m2878n6303
16718a50943J56314R3812o1728k2033R5244K4348m5443J9166l8545R755o6889
16707A3058q2362k0011l6076o3317J9596j3840N4921n3870K1830J05276o2069
16696a16864Q263N1984O7267o4647j01634n5516Q854l5554k034P7935j02524O4423
$$ plain form
16684 -200047 -163160 -164104 -72987 -9362 82725 15727 -8775 21290 -28381 1444 40459 65876
16672 65876 93347 50675 -36781 -52405 72109 79664 78233 97853 20695 -43382 -144301 -145721
16660 -145721 -112149 -13334 -7287 -107571 -105955 -98339 -159000 -103888 -69082 -42012 45922 -20009
16648 -20009 -37065 -20029 -81643 -132055 24963 76647 11226 -2044 40693 51819 146292
16637 146292 149934 126252 62249 33833 83579 95494 72051 24802 -46782 -81438 -134178 -122818
16625 -122818 -6689 44876 51988 57359 108396 66614 67707 110943 84963 -41415 -71248 -51070
16613 -51070 -22560 -24970 29031 127895 81405 -2338 -29593 -49143 108112 124975 82000 48457
16601 48457 91843 91792 29075 -7466 -22827 -8509 -12351 -62304 -50402 -42973 -122164 -110238 -42744
$$ packed form
16684b00047L6887r44R1117O3625R2087o6998k4502L0065m9671K9825L9015K5417
16672F5876K7471m2672q7456j5624J24514P555j431J9620p7158o4077j00919j420
16660a45721L3572R8815O047j00284J616P616o0661N5112L4806K7070Q7934o5931
16648b0009j7056J7036o1614n0412J57018N1684o5421j3270M2737J1126R4473
16637A46292L642k3682o4003k8416M9746J1915k3443m7249p1584l4656n2740J1360
16625a22818J16129N1565P112N371N1037m1782J093M3236k5980j26378k9833K0178
16613e1070K8510k410N4001R8864m6490q3743k7255j9550J57255J6863m2975l3543
16601D8457M3386n1o2717l6541j5361J4318l842m9953J1902P429p9191J1926O7494
$$ plain form
16588 -42744 -22035 -65160 -89299 -69115 -37990 -9536 -685 -31474 23683 46019 -85729 -165824
16576 -165824 -91428 -49417 2896 -38975 -13888 32276 -59017 -159993 -178429 -38664 -32135
16565 -32135 -65957 -94983 -125520 -135205 -49817 3467 -895 30022 -43212 -52967 103330 65642
16553 65642 -16717 -20461 16191 44322 -4462 -71278 -86905 -126960 29865 81652 -52290
16542 -52290 -215820 -208585 -119360 -93225 -123363 -24327 23441 -18133 -55183 -149203 -151226 -33573
16530 -33573 -86330 -143612 -138704 -114759 -99621 -19856 -3970 -21007 15595 38010 58737 86376
16518 86376 72147 108611 130437 103086 -43878 -149070 -123490 38720 114847 154690 209769
16507 209769 164833 73437 56740 57656 53848 21351 -62782 38468 85236 11244 -61039 -107917
$$ packed form
16588d2744K0709m3125k4139K0184L1125K8454Q851l0789N5157K2336j31748q0095
16576a65824P4396M2011N2313m1871K5087M6164r1293j00976j8436J39765O529
16565c2135l3822k9026l0537r685Q5388N3284m362L0917p3234r755J56297l7688
16553F5642q2359l744L6652K8131m8784o6816j5627m0055J56825N1787j33942
16542e2290j63530P235Q9225K6135l0138R9036M7768m1574l7050r4020k023J17653
16530c3573n2757n7282M908K3945J5138P9765J5886j7037L6602K2415K0727K7639
16518H6376j4229L6464K1826k7351j46964j05192K5580J62210P6127L9843N5079
16507B09769m4936r1396j6697R16l808l2497q4133J01250M6768p3992p2283m6878
$$ plain form
16495 -107917 -135088 -96412 -12359 -62604 13042 94477 133536 80381 3371 -35581 -14373
16484 -14373 53646 6504 -28396 -71531 -112131 -174916 -238617 -249484 -137480 -72008 5118
16473 5118 45604 21540 -93363 -178433 -121841 -72808 -80070 -123971 -59097 -110010 -131044 -107353
16461 -107353 -113691 -100781 -154146 -123153 5077 5579 1960 -56023 -61693 4786 25728 -92515
16449 -92515 -139197 -23458 94037 85175 95562 35490 51981 61332 -57215 -140610 -116776
16438 -116776 -32391 3590 69544 121911 59833 -40433 -71115 -122790 -161055 -160380 -171297 -134326
16426 -134326 -83429 -41625 13902 54080 17439 -5629 50174 6834 -7814 21502 -19280
16415 -19280 -146279 -69581 44003 42676 36533 14466 88888 182067 205090 54642 -57357
$$ packed form
16495a07917k7171L8676Q4053n0245P5646Q1435L9059n3155p7010l8952K1208
16484a4373O8019m7142l4900m3135m0600o2785o3701j0867J12004O5472P7126
16473E118M0486k4064j14903q5070N6592M9033p262m3901O4874n0913k1034K3691
16461a07353o338J2910n3365L0993J28230N02l619n7983n670O6479K0942j18243
16449i2515m6682J15739J17495q862J0387o0072J6491R351j18547q3395K3834
16438a16776Q4385L5981O5954N2367o2078j00266l0682n1675l8265O75j0917L6971
16426a34326N0897M1804N5527M0178l6641k3068N5803m3340j4648K9316m0782
16415a9280j26999P6698J13584j327o143k2067P4422R3179K3023j50448j11999
$$ plain form
16404 -57357 7497 40376 81836 79820 -25034 -19960 -5177 30904 59733 103386 183458 133610
16392 133610 148496 145706 -16870 -206652 -104630 2114 65407 55749 -62187 -147435 -89862
16381 -89862 31416 15749 -83643 -60221 -66901 -25736 39060 -27605 -149924 -90724 -75238
16370 -75238 80372 60816 -131872 -166813 -38630 20293 -15002 -56839 32605 11278 -86448
16359 -86448 -98934 -64659 -15819 4064 -33609 -26959 -78871 -77669 -137628 -229891 -360829 -384418
16347 -384418 -243863 -125612 -48237 -48031 -102243 -113231 -117130 -12725 56481 22667 -34017
16336 -34017 -37613 7737 -13998 -46276 -216642 -195586 -161218 -105754 -64432 75714 179353
16325 179353 120505 18801 -58266 -90007 -101245 -59609 -94475 -210557 -102995 -40966 -21968
$$ packed form
16404e7357O4854L2879M1460k016j04854N074J4783L6081K8829M3653Q0072m9848
16392A33610J4886k790j62576j89782J02022J06744O3293r658j17936q5248N7573
16381h9862J21278j5667r9392K3422o680M1165O4796o6665j22319N9200J5486
16370g5238J55610j9556j92688l4941J28183N8923l5295m1837Q9444k1327r7726
16359h6448j2486L4275M8840J9883l7673O650n1912J202n9959r2263j30938k3589
16347c84418J40555J18251P7375K06n4212j0988l899J04405O9206l3814n6684
16336c4017l596M5350k1735l2278j70366K1056L4368N5464M1322J40146J03639
16325A79353n8848j01704p7067l1741j1238M1636l4866j16082J07562O2029J8998
$$ plain form
16314 -21968 6011 -21928 -10330 -57745 -108442 -113913 52368 36694 -28883 -77526 -89680 -67311
16302 -67311 -66317 -90321 -132567 -54259 44624 25549 46437 79503 100817 171760 87184 -78031
16290 -78031 -38527 -50455 -110857 -62654 10690 -24955 33611 -14903 -100754 -160448 -150070 -142882
16278 -142882 -168064 -131250 -74960 53210 143733 116999 -9820 -33056 -73654 -27681 126456
16267 126456 147164 -67291 -106260 -71248 -18810 32186 -59962 -53525 7804 70251 8483
16256 8483 -88258 -210402 -93720 2072 -8444 -13721 -6813 11258 -72094 -84075 -76442 -83797
16244 -83797 -45107 -11507 3062 16740 38890 63707 -28075 -137013 -153716 -105422 -98175 -111734
16232 -111734 -157533 -105589 -74768 11732 -1338 -123662 -72229 -14537 -55502 -160957 -187171
$$ packed form
16314b1968K7979k7939J1598m7415n0697n471J66281j5674o5577m8643j2154K2369
16302f7311R94k4004m2246P8308R8883j9075K0888L3066K1314P0943q4576j65215
16290g8031L9504j1928o0402M8203P3344l5645N8566m8514q5851n9694J0378P188
16278a42882k5182L6814N6290J28170R0523k6734j26819k3236m0598M5973J54137
16267A26456K0708k14455l8969L5012N2438N0996r2148O437O1329O2447o1768
16256H483r6741j22144J16682R5792j0516n277O908J8071q3352j1981P633p355
16244h3797L8690L3600J4569J3678K2150K4817r1782j08938j6703M8294P247j3559
16232a11734m5799N1944L0821Q6500j3070j22324N1433N7692m0965j05455k6214
$$ plain form
16221 -187171 -142630 -197230 -191583 -163361 -147815 -85182 -135336 -113038 -72111 -37547 -107987 -141892
16209 -141892 -150695 -113163 -193304 -185650 -177983 -129265 -88657 -54385 -38592 -88943 -87693 -113757
16197 -113757 -201254 -212447 -220395 -286922 -203335 -276494 -316628 -307246 -240121 -204552 -174719 -225956
16185 -225956 -272485 -187627 -160451 -158557 -147209 -111704 6197 91562 113133 94642 173009
16174 173009 211744 89576 -30979 -102656 -62543 59098 81320 42579 135273 184186 106315
16163 106315 125727 141354 60936 -33181 -172579 -239005 -224771 -221573 -144980 -100790 -135506
16152 -135506 -142539 -89310 -29309 -75419 -133540 -208321 -277070 -210782 -77018 -108018 -60320
16141 -60320 53310 60840 43813 19933 -98605 -78461 -121825 -75147 -54670 -87909 -39268
$$ packed form
16221a87171M4541n4600N647K8222J5546O2633n0154K2298M0927L4564p0440l3905
16209a41892q803L7532q0141P654P667M8718M0608L4272J5793n0351J250k6064
16197a13757q7497j1193p948o6527Q3587p3159m0134R382O7125L5569K9833n1237
16185b25956m6529Q4858K7176J894J1348L5505J17901Q5365K1571j8491P8367
16174A73009L8735j22168j20555p1677M0113J21641K2222l8741R2694M8913p7871
16163A06315J9412J5627q0418r4117j39398o6426J4234L198P6593M4190l4716
16152a35506p033N3229O0001m6110n8121p4781o8749O6288J33764l1000M7698
16141f0320J13630P530j7027k3880j18538K0144m3364M6678K0477l3239M8641
$$ plain form
16130 -39268 -62942 -70568 -137346 -157506 -82743 -18543 36884 -54447 -136380 -76714 -60870 46036
16118 46036 50117 46118 154469 257507 210127 89543 27019 68310 108591 65553 42398
16107 42398 181511 243247 211973 151382 73217 89592 156904 157795 155461 105854 -9158 -47000
16095 -47000 -80448 -122819 -188725 -188730 -123372 -190378 -161956 -162064 -107145 -98834 -71614 -143286 -214718
16082 -214718 -161729 -87479 -12195 11293 6490 7984 35538 12801 114623 196393 163069 119158
16070 119158 96295 61252 40075 75378 30844 32269 121643 -43774 -95394 -26096 124259
16059 124259 159600 123339 129821 68023 119846 126785 62398 65721 56629 -29447 -62644 -143774
16047 -143774 -105980 4839 -30909 15619 49894 -37033 -125586 -197193 -73425 10845 58943
$$ packed form
16130c9268k3674p626o6778k0160P4763O4200N5427r1331q1933N9666J5844J06906
16118D6036M081l999J08351J03038m7380j20584o2524M1291M0281m3038k3155
16107D2398J39113O1736l1274o0591p8165J6375O7312Q91k334m9607j15012l7842
16095d7000l3448m2371o5906nO5358o7006K8422j08N4919Q311K7220p1672p1432
16082b14718N2989P4250P5284K3488m803J494K7554k2737J01822Q1770l3324m3911
16070A19158k2863l5043k1177L5303m4534J425Q9374j65417n1620O9298J50355
16059A24259L5341l6261O482o1798N1823O939o4387L323r092q6076l3197q1130
16047a43774L7794J10819l5748M6528L4275q6927q8553p1607J23768Q4270M8098
$$ plain form
16036 58943 118311 159200 47267 -137423 -130913 -30091 -83817 -94743 -38606 6507 -3499
16025 -3499 -13978 -66719 26894 40811 99115 82852 -1419 -83580 60051 31507 92887 637
16013 637 -41889 -426 71434 25419 90394 18897 -109349 -103527 -132711 -158838 -146002 -89531
16001 -89531 -69921 -60381 -71649 -62551 -34910 13798 -59671 -156285 -84026 -28745 50257 46269
15989 46269 86924 125429 169018 176037 126142 85722 38319 43146 -60790 -81924 -93591 -33232
15977 -33232 88629 465 -59539 -64719 12470 104816 104309 95812 58321 31598 84152 36300
15965 36300 39462 77464 29821 -70869 -78363 39074 179753 153301 -46673 -48535 89557
15954 89557 136157 84782 78228 99338 85319 -48515 -183180 -114668 -87051 -104485 -36267
$$ packed form
16036E8943N9368M0889j11933j84690O510J00822n3726j0926N6137M5113j0006
16025c499j0479n2741R3613J3917N8304j6263q4271q2161J43631k8544O1380r2250
16013F37m2526M1463P1860m6015O4975p1497j28246N822k9184k6127J2836N6471
16001h9531J9610R540j1268R098K7641M8708p3469r6614P2259N5281P9002l988
15989D6269M0655L8505M3589P019m9895m0420m7403M827j03936k1134j1667O0359
15977c3232J21861q8164o0004n180P7189R2346n07q497l7491k6723N2554m7852
15965C6300L162L8002m7643j00690p494J17437J40679k6452j99974j862J38092
15954H9557M6600n1375o554K1110j4019j33834j34665O8512K7617j7434O8218
$$ plain form
15943 -36267 -23547 -30528 -106724 -114669 -113537 -117287 -113499 -104979 -42048 -26865 -47670 20494 41466
15930 41466 40084 123349 119946 55929 59583 38051 -34413 -69814 -88139 -49516 69174 54336
15918 54336 92702 159850 118566 -28369 -76658 -91737 -152398 -165667 -201035 -193555 18520
15907 18520 42067 -32490 -53594 -64307 -3623 70189 120928 121006 92903 143996 161517 117011
15895 117011 -34693 -156773 -139984 -9236 26308 -25341 -2756 -34088 -59806 -77318 -110212
15884 -110212 -73690 -74265 -161218 -86720 -1757 46847 6235 -25591 17824 -25047 -110553 -236204
15872 -236204 -224804 -75958 7005 -44287 -44025 -20405 -3302 -7326 -72220 -125304 -185069 -155316
15860 -155316 -73600 -947 111813 105037 115852 57636 31933 -48753 -55046 -17778 -28868 -111106
$$ packed form
15943c6267J2720o981p6196p945J132l750L788Q520O2931J5183k0805O8164K0972
15930D1466j382Q3265l403o4017L654k1532p2464l5401j8325L8623J18690j4838
15918E4336L8366O7148m1284j46935m8289j5079o0661j3269l5368P480K12075
15907A8520K3547p4557k1104j0713O0684P3812N0739P8k8103N1093J7521m4506
15895A17011j51704j22080J6789J30748L5544n1649K2585l1332k5718j7512l2894
15884a10212L6522n75q6953P4498Q4963M8604m0612l1826M3415m2871q5506j25651
15872b36204J1400J48846Q2963n1292K62K3620J7103m024o4894n3084n9765K9753
15860a55316Q1716P2653J12760o776J0815n8216k5703q0686o293L7268j1090q2238
$$ plain form
15848 -111106 -144384 -122415 -162623 -117695 -131651 -78651 26983 19352 -36357 -22948 -49570
15837 -49570 -51736 -58492 -92155 -157027 -160041 -142045 -39300 -35858 -41103 -3087 52038 69686
15825 69686 140535 241937 153900 -22802 -11548 62277 81378 83950 25137 -42444 52949
15814 52949 27952 2302 -53716 -102243 -147705 -133698 -157221 -177542 -165077 -66944 -69080 -28578
15802 -28578 -16350 -30936 34927 116671 122629 63631 -41591 -95423 -85866 -90106 44575 95495
15790 95495 41437 -2447 11455 -40325 -13721 38394 84904 8510 11302 -7283 -105677 -6631
15778 -6631 13270 49854 84110 -3110 -48745 -122451 -116347 -111630 -78376 -70201 -127508 -109359
15766 -109359 -102540 -100657 -148055 -131461 -111019 -80912 -17756 55355 88700 57939 -13823 -33635
$$ packed form
15848a11106l3278K1969m0208M4928j3956N3000J05634p631n5709J3409k6622
15837d9570k166o756l3663o4872l014J7996J02745L442n245L8016N5125J7648
15825F9686P0849J01402q8037j76702J1254P3825J9101K572n8813o7581R5393
15814E2949k4997k5650n6018m8527m5462J4007k3523k0321J2465R8133k136M0502
15802b8578J2228j4586O5863Q1744N958n8998j05222n3832R557m240J34681N0920
15790I5495n4058m3884J3902n1780K6604N2115M6510p6394K792j8585r8394R9046
15778f631J9901L6584L4256q7220m5635p3706O104M717L3254Q175n7307J8149
15766a09359O819J883m7398J6594K0442L0107O3156P3111L3345l0761p1762j9812
$$ plain form
15754 -33635 64091 94294 -70777 -161531 -133554 -86436 -62917 6467 -35065 -82352 -39122
15743 -39122 -80132 -129187 -166084 -100698 -114347 -93239 -39392 -6798 -717 -39652 -37435 5805
15731 5805 96904 66075 -30801 -103992 -70192 -19079 -6101 -10072 39184 62460 56605 6697
15719 6697 -3665 25587 -17250 -110150 -241451 -205274 -119376 -8696 17014 -5580 -117253
15708 -117253 -129890 -175173 -101775 35522 21138 -6272 42675 39984 -35528 33675 101383
15697 101383 69367 40572 -72049 -85650 -21562 47650 -3019 2647 -89300 -98405 -96582 -26733
15685 -26733 -22086 20764 38463 -3762 34479 64194 99502 72534 131625 132327 127618 79083
15673 79083 -59757 -122292 28619 122290 -43188 10907 59122 -1652 -58831 -67843 -80767
$$ packed form
15754c3635R7726L0203j65071r0754K7977M7118K3519O9384m1532m7287M3230
15743c9122m1010m9055l6897O5386j3649K1108N3847L2594O081l8935K217M3240
15731E805R1099l0829r6876p3191L3800N1113J2978l971M9256K3276n855m9908
15719F697j0362K9252m2837r2900j31301L6177Q5898J10680K5710k2594j11673
15708a17253j2637m5283P3398J37297j4384k7410M8947k691p5512O9203O7708
15697A01383l2016k8795j12621j3601O4088O9212n0669N666r1947r105J823O9849
15685b6733M647M2850J7699m2225L8241K9715L5308k6968N9091P02m709m8535
15673G9083j38840o2535J50911R3671j65478N4095M8215o0774n7179r012j2924
$$ plain form
15662 -80767 -32105 -14875 119938 115339 126164 46776 -46885 13688 5003 -111323 -142227 52900
15650 52900 120316 117665 178819 144484 -6587 -38308 27837 91284 91111 139420 100272 73081
15638 73081 1514 -16416 -39585 -12273 31171 180395 132474 18310 -11814 -74084 -55028
15627 -55028 -49331 -81543 8982 102437 50652 -79473 -103644 -142698 -91143 4880 24626 -77111
15615 -77111 -213407 -186702 -6216 28541 -4932 48013 170746 148259 101521 63181 -21411
15604 -21411 -200219 -229436 -82314 69852 83549 62293 -12733 -49817 -120319 -146216 -60600
15593 -60600 -70136 -64533 -65638 -80804 -41200 34940 463 22778 83602 124984 110673 145783
15581 145783 120159 -8697 48311 229496 170839 8902 128692 235956 217991 93404
$$ packed form
15662h0767M8662J7230J34813m599J0825p9388r3661O0573q685j16326l0904J95127
15650E2900O7416k651O1154l4335j51071l1721O6145O3447j73M8309l9148k7191
15638G3081p1567j7930k3169K7312M3444J49224m7921j14164l0124o2270J9056
15627e5028N697l2212R0525R3455n1785j30125k4171l9054N1555R6023J9746j01737
15615g7111j36296K6705J80486L4757l3473N2945J22733k2487m6738l8340q4592
15604b1411j78808k9217J47122J52166J3697k1256p5026l7084p0502k5897Q5616
15593f0600r536N603j105j5166L9604P6140l4477K2315O0824M1382j4311L5110
15581A45783k5624j28856N7008J81185n8657j61937J19790J07264j7965j24587
$$ plain form
15571 93404 -38445 -119425 -70917 5897 28587 8221 -63425 -79162 -42470 -60343 -62945 2420
15559 2420 45073 26353 5169 -57178 -44154 -20755 -1974 -46454 -20638 25943 13260 18163
15547 18163 -37286 -190517 -222001 -162585 -52045 35502 42460 5093 -18357 -50842 -53689 -98665
15535 -98665 -87557 -143231 -217801 -235824 -141069 -199210 -154738 -16636 -11092 -107407 -115340 -65919
15523 -65919 -130711 -141779 -125057 -181311 -101960 -58206 -40754 47364 34220 -48339 -79400 -155684
15511 -155684 -39132 45974 47348 31668 1477 16599 29056 77558 32679 52215 156816
15500 156816 124333 69667 -1689 -69912 -39729 -13720 -89842 -66647 2495 -21557 -57207
15489 -57207 61790 70296 -19268 -81741 -41423 2370 -52278 -42702 -101139 -92691 -87725 -86346
$$ packed form
15571I3404j31849q0980M8508P6814K2690k0366p1646j5737L6692j7873k602O5365
15559B420M2653j8720k1184o2347J3024K3399J8781m4480K5816M6581j2683M903
15547A8163n5449j53231l1484N9416J10540Q7547O958l7367k3450l2485k847m4976
15535i8665J1108n5674p4570j8023R4755n8141M4472J38102N544r6315p933M9421
15523f5919o4792j1068J6722n6254P9351M3754J7452Q8118j3144q2559l1061p6284
15511a55684J16552Q5106J374j5680l0191J5122J2457M8502m4879J9536J04601
15500A56816l2483n4666p1356o8223L0183K6009p6122K3195O9142k4052l5650
15489e7207J18997Q506q9564o2473M0318M3793n4648R576n8437Q448M966J379
$$ plain form
15477 -86346 -80338 -21077 -40703 -9791 24234 -79145 -106924 -28790 81549 23549 -103807
15466 -103807 -91488 48397 178238 304951 198215 162143 164804 136430 50831 61584 11152
15455 11152 16318 14107 -31903 -57839 18058 1151 -30444 92851 124630 45627 77184 117277
15443 117277 122043 33399 -234 24083 110009 106313 162621 93465 -65165 -38627 72247
15432 72247 54621 11273 86869 133221 120054 46015 61450 186387 243697 219486 154145
15421 154145 -53237 -94260 -116651 -120542 -72871 -58418 -101794 -85864 -62172 -128101 -51204
15410 -51204 86499 109808 90781 78647 -11138 -49681 -7095 38599 37457 -16539 -25146 80459
15398 80459 55017 107086 94308 87071 66045 -36386 -125691 -137039 -98758 -79047 -64826 -15892
$$ packed form
15477h6346O008N9261j9626L0912L4025j03379k7779P8134J10339n8000j27356
15466a03807J2319J39885J29841J26713j06736l6072K661k8374q5599J0753n0432
15455A1152N166k211m6010k5936P5897j6907l1595J23295L1779p9003L1557M0093
15443A17277M766q8644l3633K4317Q5926l696N6308o9156j58630K6538J10874
15432G2247j7626m3348P5596M6352j3167p4039J5435J24937N7310k4211o5341
15421A54145k07382m1023k2391l891M7671J4453m3376J5930K3692o5929P6897
15410e1204J37703K3309j9027j2134q9785l8543M2586M5694j142n3996q607J05605
15398H0459k5442N2069j2778p237k1026j02431q9305j1348L8281J9711J4221M8934
$$ plain form
15386 -15892 -26581 18805 2482 -30385 914 1121 27640 -2522 -4017 72826 44964 9861
15374 9861 48737 -48098 -98175 -43954 17114 -28068 15605 37629 21431 81346 100198 80450
15362 80450 67862 105952 -32129 -64845 193 -3568 -29589 8092 11908 -23234 -648 64737
15350 64737 66668 38740 43304 34008 11607 19455 94662 99802 198792 110386 76533 40040 26168
15337 26168 103465 75294 -19455 -146775 -106461 -97549 -81845 -19711 38751 28265 -51562 -104975
15325 -104975 -93047 -54503 15436 22123 91011 190880 183815 170396 116616 186473 147412 51014
15313 51014 68016 110029 219875 119764 -8547 26310 81505 74150 1552 -21224 -21778 -53491
15301 -53491 36589 58894 -7832 7143 47626 -9560 -22313 -36019 -13409 1985 -22607 -7905
$$ packed form
15386a5892j0689M5386j6323l2867L1299K07K6519l0162j495P6843k7862l5103
15374I861L8876r6835n0077N4221O1068m5182M3673K2024j6198N9915J8852j9748
15362H0450j2588L8090j38081l2716O5038l761k6021L7681L816l5142K2586O5385
15350F4737J931k7928M564r296k2401P848P5207N140R8990q8406l3853l6493j3872
15337B6168P7297k8171r4749j27320M0314Q912J5704O2134N8462j0486p9827n3413
15325a04975J1928L8544O9939O687O8888R9869p065j3419n3780O9857l9061r6398
15313E1014J7002M2013J09846j00111j28311L4857N5195p355p2598k2776n54l1713
15301e3491R0080K2305o6726J4975M0483n7186j2753j3706K2610J5394k4592J4702
$$ plain form
15289 -7905 16584 118756 72831 7849 -50481 -21799 73862 50755 138815 -5732 60689
15278 60689 175283 51077 -38571 -32415 -8773 50174 -628 22021 40584 79871 79909 169741
15266 169741 206973 211469 158952 43880 66136 -11485 57744 25558 -60948 -122217 -102493
15255 -102493 -83937 -177058 -186822 -134798 -34206 -47059 -50041 -24983 -53181 -75376 -215090
15244 -215090 -232928 -211571 -130961 -77731 -158648 -78827 38747 -3633 -5695 28997 13566
15233 13566 -5177 41885 7968 -66837 -11643 85829 89508 25641 -22838 -62704 -56527 -71695
15221 -71695 -44335 6775 58539 56217 9133 47918 31576 13555 121493 64922 -9888 38523
15209 38523 -5782 -22405 -38733 -119478 -175576 -180270 -151811 -88826 -67726 -89391 -42446 -35433
$$ packed form
15289g905K4489J02172m5925o4982n8330K8682R5661k3107Q8060j44547O6421
15278F0689J14594j24206q9648O156K3642N8947n0802K2649J8563L9287L8Q9832
15266A69741L7232M496n2517j15072K2256p7621O9229l2186q6506o1269J9724
15255a02493J8556r3121r764N2024J00592j2853k982K5058k8198k2195j39714
15244b15090j7838K1357Q0610N3230q0917P9821J17574m2380k062L4692j5431
15233A3566j8743M7062l3917p4805N5194R7472L679o3867m8479l9866O177j5168
15221g1695K7360N1110N1764k322m7084L8785j6342j8021J07938n6571p4810M8411
15209C8523m4305j6623j6328q0745n6098m694K8459O2985K1100k1665M6945P013
$$ plain form
15197 -35433 -3602 2910 -55430 45214 49904 21724 35975 -22616 -94147 -110200 -97683 23610
15185 23610 29675 22546 -50454 -7553 19011 75104 121534 100604 85281 121461 133216 113169
15173 113169 37734 17241 51996 55841 36714 26660 -4374 -33739 -23770 -22884 -126848 -165756
15161 -165756 -204018 -199053 -86974 -160627 -162077 -79815 -100693 -22171 -1269 34116 82259 68976
15149 68976 -22444 -63665 77276 124752 90043 82360 42723 -38105 -110869 -19274 -2315 -55378
15137 -55378 -91389 -106851 -83896 -16075 -2856 -27452 -8245 -15645 26053 -40372 21370 50198
15125 50198 152028 250862 241955 177008 129315 91443 -4196 37069 117331 81831 58783 59261
15113 59261 25572 -98932 -73909 -40760 -5663 19731 -54559 -112951 -155437 -92552 -28339
$$ packed form
15197c5433L1831O512n8340J00644M690k8180J4251n8591p1531j6053J2517J21293
15185B3610O065p129p3000M2901K6564N6093M6430k0930j5323L6180J1755k0047
15173A13169p5435k0493L4755L845j9127j0054l1034k9365R969Q86j03964l8908
15161a65756l8262M965J12079p3653j450Q2262k0878P8522K0902L5385M8143j3283
15149F8976r1420m1221J40941M7476l4709p683l9637q0828p2764R1595J6959n3063
15137e5378l6011j5462K2955O7821J3219k4596J9207p400M1698o6425O1742K8828
15125E0198J01830R8834q907o4947m7693l7872r5639M1265Q0262l5500k3048M78
15113E9261l3689j24504K5023L3149L5097K5394p4290n8392m2486O2885O4213
$$ plain form
15102 -28339 -31584 -40043 22225 19546 -53325 -109924 -48622 -21895 -26765 -67429 -2784 107163
15090 107163 100563 1670 10746 -23475 -43583 21529 -20644 -9893 47734 75970 10640 7221
15078 7221 -24958 -23329 -10454 -6627 -47315 -28956 32009 131960 91093 54830 60921 43420
15066 43420 -15051 124852 196863 257231 173509 244135 236192 136771 58686 -25997 -49849 -50664
15054 -50664 -4915 121146 145614 31871 -5798 25811 6487 -22173 28261 -34128 -49457
15043 -49457 -42923 31767 53513 1100 25305 39700 16187 37672 -13950 39270 -37073 -117949
15031 -117949 -93437 -109218 -70920 30261 70951 64035 60615 -50396 -49114 -31535 -84042 -36141
15019 -36141 40320 82044 134819 216288 217872 151242 8982 -4054 103768 124636 4372
$$ packed form
15102b8339l245q459O2268k679p2871n6599O1302K6727m870m0664O4645J09947
15090A07163o600r8893R076l4221k0108O5112m2173J0751N7627K8236o5330l419
15078G221l2179J629J2875L827m0688J8359O0965R9951m0867l6263O091j7501
15066D3420n8471J39903P2011O0368q3722P0626p943r9421p8085q4683k3852q15
15054e0664M5749J26061K4468j13743l7669L1609j9324k8660N0434o2389j5329
15043d9457O534P4690K1746n2413K4205J4395k3513K1485n1622N3220p6343q0876
15031a17949K4512j5781L8298J01181M0690o916l420j11011J282J7579n2507M7901
15019c6141P6461M1724N2775Q1469J584o6630j42260j3036J07822K0868j20264
$$ plain form
15008 4372 -108101 -64283 86743 153597 203049 25003 -120768 -110805 -11414 19934 19981 92397
14996 92397 55270 -19593 52641 148788 187835 160696 54628 -10524 -62699 -9109 -1635 -26732
14984 -26732 8914 -9627 17472 39943 25986 -165313 -261642 -150634 -67833 -54264 -63621
14973 -63621 -33744 5649 6430 20701 15066 -59816 -44003 19790 -67214 -131261 -16761 19718
14961 19718 21592 -47944 -116465 -40883 -2148 9245 27805 -5265 -17372 28480 -18527 11157
14949 11157 125470 160880 80639 30377 105654 95121 7381 6263 67059 63560 -21997 -24469
14937 -24469 -50128 -6595 247 19940 112760 114371 137879 117128 32938 -28843 15363 110725
14925 110725 131421 77202 135527 79761 120863 32795 -46824 -68284 -10183 -767 32291 136238
$$ packed form
15008D372j12473M3818J51026O6854M9452j78046j45771R963R9391L1348M7P2416
14996I2397l7127p4863P2234R6147L9047k7139j06068o5152n2175N3590P474k5097
14984b6732L5646j8541K7099K2471j3957j91299r6329J11008Q2801J3569r357
14973f3621K9877L9393P81J4271n635p4882J5813O3793q7004o4047J14500L6479
14961A9718J874o9536o8521P5582L8735J1393J8560l3070j2107M5852m7007K9684
14949A1157J14313L5410q0241n0262P5277j0533q7740j118O0796l499q5557k472
14937b4469k5659M3533O842J9693R2820J611K3508k0751q4190o1781M4206R5362
14925A10725K0696n4219N8325n5766M1102q8068p9619k1460N8101R416L3058J03947
$$ plain form
14913 136238 129820 10397 -69 -62651 -90295 -48355 -112538 -53189 -56010 -33805 91282
14902 91282 131447 -2996 -41532 -111596 -137018 -195638 -136326 -34270 -30943 52104 76235
14891 76235 -21908 -84326 -6056 87851 65959 -24127 -146614 -185745 -205190 -322167 -300930
14880 -300930 -198611 -184323 -94065 -14293 -95595 -48811 -28451 -68888 -128609 -62446 63248
14869 63248 76455 19967 1229 -45577 -47994 -102014 -183422 2096 160821 158954 101144 63333
14857 63333 65987 71707 -407 -129320 -159434 -139214 -115738 -87023 6216 44414 -34310 -45437
14845 -45437 -16329 -45426 -11692 37040 -115505 -195880 -204850 -232015 -194802 -130439 30749
14834 30749 47045 -23468 -4698 131421 149505 127945 73847 63557 65689 52746 6763 -54368
$$ packed form
14913A36238o418j19423j0466o2582k7644M1940o4183N9349k821K2205J25087
14902I1282M0165j34443l8536p0064k5422n8620N9312J02056L327Q3047K4131
14891G6235r8143o2418P8270R3907k1892r0086j22487l9131j9445j16977K1237
14880c00930J02319J4288R0258P9772q1302M6784K0360m0437n9721O6163J25694
14869F3248J3207n6488j8738m6806k417n4020q1408J85518J58725j867n7810l7811
14857F3333K654N720p2114j28913l0114K0220K3476K8715R3239L8198p8724j1127
14845d5437K9108k9097L3734M8732j52545q0375q970k7165L7213O4363J61188
14834C0749J6296p0513J8770J36119J8084k1560n4098j0290K132j2943m5983o1131
$$ plain form
14822 -54368 -66017 28948 -13040 -89520 -114852 -62024 3561 55315 60367 48892 43831 151799
14810 151799 189495 196512 113717 41512 -108522 -23798 133420 222976 170143 113651 56804
14799 56804 -36220 -67694 -95469 -86893 -70066 -27759 77867 17951 -98767 -86446 -83222 -85441
14787 -85441 -52961 54631 -7644 -63108 -50926 36744 139176 91174 111478 35748 -104608
14776 -104608 -102772 -51473 -48348 8908 60660 52705 -15808 -19839 23853 81877 94217 98909
14764 98909 43738 10618 -13520 57200 105727 122737 93186 107033 120295 -9110 -40188
14753 -40188 -42694 -152523 -140670 -67371 19024 72510 157939 143290 96887 151754 141943 119139
14741 119139 67965 -33657 -83186 -180597 -144226 -119091 -102448 -22708 27931 -48836 -76541
$$ packed form
14822e4368j1649R4965m1988p6480k5332N2828O5585N1754N052j1475n061J07968
14810A51799L7696P017q2795p2205j50034Q4724J57218Q9556n2833n6492n6847
14799E6804r3024l1474k7775Q576J6827M2307J05626n9916j16718J2321L224k219
14787h5441L2480J07592o2275n5464J2182Q7670J02432m8002K0304p5730j40356
14776a04608J836N1299L125N7256N1752p955o8513m031M3692N8024J2340M692
14764I8909n5171l3120k4138P0720M8527J7010k9551J3847J3262j29405l1078
14753d0188k506j09829J1853P3299Q6395N3486Q5429j4649m6403N4867r811k2804
14741A19139n1174j01622m9529r7411L6371K5135J6643P9740N0639p6767k7705
$$ plain form
14730 -76541 -112177 -155823 -126289 -101572 -184448 -254712 -176955 -139348 -202741 -187906 -121388 -79127
14718 -79127 -107689 -89690 -93447 -134788 -42164 -58878 -163760 -61395 11147 15866 14928 -122219
14706 -122219 -148816 -136842 -83690 -84207 -3707 47462 -1614 -22407 -12723 -16359 -50652 25789
14694 25789 96611 73413 175539 217497 107926 66979 33049 18618 -28878 -15796 15569
14683 15569 69164 132456 132380 162857 100245 54664 53247 -98880 -129042 -75258 -55671 -5702
14671 -5702 19874 23167 101518 163890 26861 48000 89512 89667 175308 191117 179758 157803
14659 157803 174312 112947 73367 40998 26426 26564 -32244 -107530 -71716 -82078 -140268 -173582
14647 -173582 -153193 -63074 44376 69891 29654 15862 -54882 -98622 -74264 -55829 -130281
$$ packed form
14730g6541l5636m3646K9534K4717q2876p0264P7757L7607o3393J4835O6518M2261
14718g9127k8562J7999l757m1341R2624j6714j04882J02365P2542M719r38j37147
14706a22219k6597J1974N3152n17Q0500N1169m9076k0793R684l636l4293P6441
14694B5789P0822k3198J02126M1958j09571m0947l3930j4431m7496J3082L1365
14683A5569N3595O3292p6L0477o2612m5581j417j52127l0162N3784J9587M9969
14671e702K5576L293P8351O2372j37029K1139M1512J55Q5641J5809j1359k1955
14659A57803J6509o1365l9580l2369j4572J38n8808p5286L5814j0362n8190l3314
14647a73582K0389R0119J07450K5515m0237j3792p0744m3740K4358J8435p4452
$$ plain form
14636 -130281 -131681 -3523 70030 34103 19693 14651 -32177 -122557 -40027 10861 40556 80835
14624 80835 35116 43910 -13695 -97125 -135251 -148979 -90685 -12702 56117 -37285 -127036 -16001
14612 -16001 26401 -116001 -141632 -154015 -167418 -86889 -59182 -50690 -102705 -73448 56186
14601 56186 104003 89864 64281 11589 96715 115105 18299 70691 143309 76516 186436
14590 186436 221160 146442 23626 -79205 -76980 -41284 -39487 -24883 36196 -42887 -158555
14579 -158555 -139685 -84436 -10024 -49912 12008 103667 113998 191363 179529 94292 -68030
14568 -68030 -95837 -48760 -181 101508 64882 -89680 -198234 -187078 -141360 16310 106493
14557 106493 242423 235970 228484 304347 305884 216325 168373 231627 121535 35462 57282 67806
$$ packed form
14636a30281j400J28158P3553l5927j4410n042m6828r0380Q2530N0888K9695M0279
14624H0835m5719Q794n7605q3430l8126j3728N8294P7983O8819r3402q9751J11035
14612a6001M2402j42402k5631j2383j3403Q0529K7707Q492n2015K9257J29634
14601E6186M7817j4139k5583n2692Q5126J8390r6806N2392P2618o6793J09920
14590A86436L4724p4718j22816j02831K225L5696J797J4604O1079p9083j15668
14579a58555J8870N5249P4412l9888O1920R1659J0331P7365j1834q5237j62322
14568f8030k7807M7077M8579J01689l6626j54562j08554J1156M5718J57670R0183
14557A06493J35930o453p486P5863J537q9559m7952O3254j10092q6073K1820J0524
$$ plain form
14545 67806 -11281 -32767 60323 130633 110530 85842 90416 134781 112330 74563 65626 -38981
14533 -38981 -68791 -12649 53130 69968 53028 106117 70496 75986 82511 133812 218210 163647
14521 163647 105311 -33260 -25171 -85286 -87760 -100560 -35481 2416 21352 80667 229342
14510 229342 211618 190339 166748 132516 31020 3919 649 31611 44562 9451 -129874
14499 -129874 -40650 85123 39531 79631 65548 30143 121338 161429 68313 73049 147324
14488 147324 113144 -15778 -56991 13224 9722 -17672 -41630 6426 -123373 -93020 41832
14477 41832 11048 -38601 -12369 -3698 -2343 -66758 -162917 -152248 -166468 -97258 -66660 -99310
14465 -99310 -29805 125182 85206 62214 39723 -2306 51242 20710 -22890 6640 77162
$$ packed form
14545F7806p9087k1486R3090P0310k0103k4688M574M4365k2451l7767q937j04607
14533c8981k9810N6142O5779J6838j6940N3089l5621N490O525N1301Q4398n4563
14521A63647n8336j38571Q089o0115k474j2800O5079L7897J8936N9315J48675
14510B29342j7724k1279k3591l4232j01496k7101l270L0962J2951l5111j39325
14499a29874Q9224J25773m5592M0100j4083l5405R1195M0091r3116M736P4275
14488A47324l4180j28922m1213P0215l502k7394k3958M8056j29799L0353J34852
14477D1832l0784m9649K6232Q671J355o4415r6159J0669j4220O9210L0598l2650
14465i9310O9505J54987l9976k2992k2491m2029N3548l0532m3600K9530P0522
$$ plain form
14454 77162 36605 26145 19048 504 47657 -15338 20938 7889 94179 156152 34583 -76753
14442 -76753 -125275 -141642 -19856 111853 170051 123260 72154 59298 -30259 -133893 -80205
14431 -80205 -53737 -37270 -98589 -90965 -110645 -30226 -35249 -92897 -73232 -108899 -135688 -130825
14419 -130825 -125122 -80894 -108770 -100037 -170234 -173741 -134628 -86925 -77508 -83873 1512 88783
14407 88783 5736 32746 83346 50836 28772 70975 156813 80020 -39180 13033 -45396
14396 -45396 355 42636 -4339 26142 107729 34214 -96510 -32359 82565 113824 4715
14385 4715 6222 100189 73935 -89551 -133629 -113512 -22135 36960 26567 93773 109510 57550
14373 57550 30112 29286 167192 98372 -44449 -91984 72346 100728 93886 29883 -48553 -115253
$$ packed form
14454G7162m0557j0460p097j8544M7153o2995L6276j3049Q6290O1973j21569j11336
14442g6753m8522j6367J21786J31709N8198m6791n1106j2856q9557j03634N3688
14431h0205K6468J6467o1319P624j9680Q0419n023n7648J9665l5667k6789M863
14419a30825N703M4228k7876Q733p0197l507L9113M7703R417o365Q5385Q7271
14407H8783q3047K7010N0600l2510k2064M2203Q5838p6793j19200N2213n8429
14396d5396M5751M2281m6975L0481Q1587p3515j30724O4151J14924L1259j09109
14385D715J507R3967k6254j63486m4078K0117R1377N9095j0393O7206J5737n1960
14373E7550k7438q26J37906o8820j42821m7535J64330K8382o842o4003p8436o6700
$$ plain form
14361 -115253 -106417 -124465 -167143 -116676 1003 -13798 -135372 -194364 -133572 -94290 -162802
14350 -162802 -90131 -48379 -58735 -123892 -58539 41641 94801 142432 174618 154400 216211
14339 216211 161646 122389 128801 159027 80396 20839 133195 39180 14166 -22955 -75512
14328 -75512 113637 206554 173523 90694 -10568 -18536 15059 85320 -47286 -15678 -4511
14317 -4511 54008 102026 152201 147582 15961 -56928 37608 10866 -47882 -36192 -52705 42884
14305 42884 150177 153633 156280 158122 38027 -28291 2706 -37969 -140598 -150740 -91922 -75940
14293 -75940 -64870 40423 95450 120276 157316 140755 95953 136057 142466 134049 99344 18118
14281 18118 23972 5267 -16283 77131 112870 179374 244530 217998 109224 115008 188960 140311
$$ packed form
14361a15253Q836j8048m2678N0467J17679j4801j21574n8992O0792L9282o8512
14350a62802P2671M1752j0356o5157O5353J00180N3160M7631L2186k0218O1811
14339B16211n4565l9257O412L0226p8631n9557J12356r4015k5014l7121n2557
14328g5512J89149R2917l3031q2829j01262p968L3595P0261j32606L1608J1167
14317d511N8519M8018N0175m619j31621p2889R4536k6742n8748J1690j6513R5589
14305D2884J07293L456K647J842j20095o6318L0997m0675j02629j0142N8818J5982
14293g5940J1070J05293N5027K4826L7040j6561m4802M0104O409q417l4705q1226
14281A8118N854j8705k1550R3414L5739O6504O5156k6532j08774N784P3952m8649
$$ plain form
14269 140311 45360 -13305 8182 -5696 11525 -12139 48518 -12648 -65578 13241 64990
14258 64990 2601 -17602 -27247 -112019 -49001 5005 68457 129219 180204 142386 72599 107851
14246 107851 115257 -35988 -166183 -156384 -159048 -108675 -142887 -169556 -89427 -32946 -44379 -24171
14234 -24171 -82187 -42803 71456 145612 114078 77319 -106532 -75856 -14693 25597 -14851
14223 -14851 -53791 -40184 36750 47087 -51951 -50736 -37739 -69620 -130389 -96220 -49149 -7067
14211 -7067 32637 76679 -32724 -40268 9858 -15982 76165 150980 104020 48080 -45357 -101454
14199 -101454 -63809 -99924 -147275 -87466 34257 25224 94161 143587 43064 8894 32497
14188 32497 6585 45939 37084 -5064 27241 70748 119508 167596 117203 149532 142105 3484
$$ packed form
14269A40311r4951n8665K1487j3878J7221k3664O0657o1166n2930P8819N1749
14258F4990o2389k0203r645q4772O3018N4006O3452O0762N0985l7818o9787L5252
14246A07851P406j51245j30195R799k664N0373l4212k6669Q0129N6481j1433K0208
14234b4171n8016L9384J14259P4156l1534l6759j83851L0676O1163M0290m0448
14223a4851l8940J3607P6934J0337r9038J215J2997l1881o0769L4169M7071M2082
14211g067L9704M4042j09403p544N0126k5840R2147P4815m6960n5940r3437n6097
14199a01454L7645l6115m7351N9809J21723r033O8937M9426j00523l4170K3603
14188C2497k5912L9354q855m2148L2305M3507M8760M8088n0393L2329p427j38621
$$ plain form
14176 3484 -99383 -35914 12846 60205 102632 -4371 -94264 -100569 -54382 -40524 -73318 -79564
14164 -79564 -57213 -5166 41448 45252 43159 -3318 10320 -28357 62115 58686 56753 74498
14152 74498 60327 77575 11774 -53064 -18754 93352 154275 166271 46666 1927 46788
14141 46788 105222 226250 190587 194685 185749 256887 271753 177203 122100 211658 179046 153298
14129 153298 323504 364547 228938 60926 -26701 -27573 94729 109204 142208 105874 28803
14118 28803 -21341 -37713 -71548 28073 86334 38051 -79222 -69335 -35432 -35105 -44677 -65096
14106 -65096 30531 103971 131064 122648 139223 92670 70811 57359 31221 38654 115763 144946
14094 144946 87373 -3273 -45399 -102849 -15831 -31529 21606 44654 -20754 -20092 30421 95840
$$ packed form
14176C484j02867O3469M8760M7359M2427j07003q9893o305M6187J3858l2794o246
14164g9564K2351N2047M6614L804k093m6477J3638l8677R0472l429j933J7745
14152G4498j4171J7248o5801o4838L4310J12106O0923J1996j19605m4739M4861
14141D6788N8434J21028l5663M098q936P1138J4866r4550n5103Q9558l2612k5748
14129A53298J70206M1043j35609j68012q7627q72J22302J4475L3004l6334p7071
14118B8803n0144j6372l3835R9621N8261m8283j17273R887L3903L27r572k0419
14106f5096R5627P3440K7093q416J6575m6553k1859j3452k6138P433P7109K9183
14094A44946n7573r0646m2126n7450Q7018j5698N3135K3048o5408O62N0513O5419
$$ plain form
14082 95840 143279 119283 133094 130102 47320 18329 30849 79132 159632 107680 48057 3888
14070 3888 -23445 -55932 -78453 -88914 -66058 -28065 -12202 -4876 41813 30726 -5227 -26901
14058 -26901 -38953 27859 8400 6645 47635 48411 84167 60276 24983 95742 144368 137190
14046 137190 105351 11875 108125 161934 39256 69421 95946 91325 36273 -95095 -102517
14035 -102517 -59380 -33985 -12239 95218 21997 69242 34429 -65452 -60214 -62375 -68842 3830
14023 3830 111319 59355 10378 -42548 19176 -19202 -94758 -31357 73643 172923 53997
14012 53997 20275 -5929 60143 23332 59836 -6125 -82981 -47797 28022 148688 79241
14001 79241 51467 11840 17958 -64155 23142 90266 80235 104932 62972 27163 73071 22319
$$ packed form
14082I5840M7439k3996J3811k992q2782k8991J2520M8283Q0500n1952n9623m4169
14070C888k7333l2487k2521j0461K2856L7993J5863P326M6689j1087l5953k1674
14058b6901j2052O6812j9459j755M0990P76L5756k3891l5293P0759M8626p178
14046A37190l1839r3476R6250N3809j22678L0165K6525m621n5052j31368p422
14035a02517M3137K5395K1746J07457p3221M7245l4813r9881N238k161o467P2672
14023C830J07489n1964m8977n2926O1724l8378p5556O3401J05000R9280j18926
14012E3997l3722k6204O6072l6811L6504o5961p6856L5184P5819J20666o9447
14001G9241k7774l9627O118q2113Q7297O7124j0031K4697m1960l5809M5908n0752
$$ plain form
13989 22319 66733 -7381 11559 195399 255611 235269 158145 -30163 -81961 -32218 10745
13978 10745 113838 18847 -74467 -86856 -69436 -45817 12958 18963 -31478 -15018 -44224 3986
13966 3986 23541 13600 -29413 -92622 -4820 962 29241 -26241 -52839 20015 119343 17538
13954 17538 -32049 -9664 -19636 -133874 -150609 -103481 5966 52219 12105 -38883 -11438
13943 -11438 -14223 27890 45611 -80680 -157514 -28994 26396 -9956 -26673 -51762 27901
13932 27901 109827 154831 121558 -16783 -72402 -81973 -50109 -52232 -23821 23401 -76066 -108335
13920 -108335 -126771 -113197 -112920 -47035 -34386 57251 31548 24281 -66648 -68693 -155094 -161721
13908 -161721 -149990 -248051 -215515 -63102 25134 105675 55446 3344 -37145 -1758 32678
$$ packed form
13989B2319M4414p4114J8940J83840O0212k0342p7124j88308n1798M9743M2963
13978A0745J03093r4991r3314j2389J7420K3619N8775O005n0441J6460k9206M8210
13966C986J9555r941m3013o3209Q7802N782K8279n5482k6598P2854R9328j01805
13954A7538m9587K2385r972j14238j6735M7128J09447M6253m0114n0988K7445
13943a1438k785M2113J7721j26291p6834J28520N5390l6352j6717k5089P9663
13932B7901Q1926M5004l3273j38341n5619r571L1864k123K8411M7222r9467l2269
13920a08335j8436J3574K77O5885J2649R1637k5703p267r0929k045q6401o627
13908a61721J1731r8061L2536J52413Q8236Q0541n0229n2102m0489L5387L4436
$$ plain form
13897 32678 19695 45603 8328 84836 55840 4449 -131646 -111684 -64268 -180793 -246159
13886 -246159 -234143 -183502 -117938 -37911 14581 -53682 -39558 -66775 19282 105637 203853
13875 203853 274107 319775 205013 148493 94180 25096 -655 79914 149623 33851 136497
13864 136497 244043 136418 39242 79488 97242 72552 -29650 -10463 -119306 -154002 -30929
13853 -30929 23639 35110 44601 53519 83578 -11362 -78117 -51986 -48578 34350 50482 66074
13841 66074 224969 253308 186311 42375 31360 160969 231248 188002 185041 192291 202230 135925
13829 135925 106803 -36175 -100354 -101091 -129359 -67135 32174 74837 -526 14521 61547 68983
13817 68983 100525 -21143 -71298 -224 39830 39833 84333 100287 -20715 45465 140976 252912
$$ packed form
13897C2678j2983K5908l7275P6508k8996n1391j36095J9962M7416j16525o5366
13886b46159J2016N0641O5564Q0027N2492o8263J4124k7217Q6057Q6355R8216
13875B03853P0254M5668j14762n6520n4313o9084k5751Q0569O9709j15772J02646
13864A36497J07546j07625r7176M0246J7754k4690j02202J9187j08843l4696J23073
13853c0929N4568J1471R491Q918L0059r4940o6755K6131L408Q2928J6132J5592
13841F6074J58895K8339o6997j43936j1015J29609P0279m3246k961P250R939o6305
13829A35925k9122j42978o4179p37k8268O2224R9309M2663p5363J5047M7026P436
13817F8983L1542j21668n0155P1074M0054LM4500J5954j21002O6180R5511J11936
$$ plain form
13805 252912 263917 243378 131105 19550 -53066 -19253 -12663 -62743 -33979 -154174 -195646
13794 -195646 -209580 -164185 -10413 64298 93830 52035 122494 157700 131025 22988 11440
13783 11440 -5884 -104224 -62706 -118190 -145437 -32699 51122 64841 74485 9716 57843 5532
13771 5532 -6525 -26169 -86982 22234 24357 144145 153681 55321 108166 127437 47705 10038
13759 10038 -28044 -30010 -26412 -134677 -152539 4412 67994 109604 -41299 -103998 -41764
13748 -41764 -106405 -140039 -54491 94955 61743 -60192 -91140 -36686 43300 23068 82337
13737 82337 148540 44060 19837 -7691 72440 128064 115829 157240 155135 151748 147505 96161
13725 96161 106278 59873 -31440 -108725 26765 108764 114661 140948 74705 2107 65538 81437
$$ packed form
13805B52912J1005k0539j12273j11555p2616L3813O590n0080K8764j20195m1472
13794a95646j3934M5395J53772P4711K9532m1795P0459L5206k6675j08037j1548
13783A1440j7324r8340M1518n5484k7247J12738Q3821J3719R644o4769M8127n2311
13771E532j2057j9644o0813J09216K123J19788R536r8360N2845J9271p9732l7667
13759A0038l8082j966L598j08265j7862J56951O3582M1610j50903o2699O2234
13748d1764o4641l3634Q5548J49446l3212j21935l0948N4454P9986k0232N9269
13737H2337O6203j04480k4223k7528Q0131N5624j2235M1411k105l387m243n1344
13725I6161J0117m6405r1313p7285J35490Q1999N897K6287o6243p2598O3431J5899
$$ plain form
13713 81437 67751 26216 -20439 -16591 85082 215922 272699 347789 308163 308364 242471 166900
13701 166900 135852 50047 126660 201162 128957 140945 173631 148628 204366 146374 -74435
13690 -74435 -178585 -185218 -60129 -129883 -161348 -64242 -7289 -69374 -68056 -64695 -47752 38991
13678 38991 149442 187164 172633 128035 69477 37437 48139 41013 45655 -51221 -88349 -92661
13666 -92661 -148713 -98095 -10671 -4072 -32064 -9010 -641 9007 -10100 44772 25175 -93853
13654 -93853 -99936 -31196 51913 38534 -25711 -37469 -103060 136 -33728 -57563 -32744 -58139
13642 -58139 -10905 45893 119868 134535 146428 66827 -21311 13856 70509 138716 140725 62551
13630 62551 -14009 -54797 -65073 -77476 -56543 -66246 -57699 -78002 -127730 -58622 -46688 -47717
$$ packed form
13713H1437j3686m1535m6655L848J01673J30840N6777P5090l9626K01o5893p5571
13701A66900l1048q5805P6613P4502p2205J1988L2686k5003N5738n7992k20809
13690g4435j04150o633J25089o9754l1465R7106N6953o2085J318L361J6943Q6743
13678C8991J10451L7722j4531m4598n8558l2040J0702p126M642r6876l7128m312
13666i2661n6052N0618Q7424O599k7992K3054Q369R648j9107N4872j9597j19028
13654i3853o083O8740Q3109j3379o4245j1758o5591J03196l3864k3835K4819k5395
13642e8139M7234N6798P3975J4667J1893p9601q8138L5167N6653O8207K009p8174
13630F2551p6560m0788j0276j2403K0933r703Q547k0303m9728O9108J1934j029
$$ plain form
13618 -47717 21416 60589 -35111 -47177 38020 109588 98806 110118 112026 76159 53971 47461
13606 47461 -25915 -64505 -103529 -48536 -28640 65501 117271 65988 -30341 -8125 103103
13595 103103 80161 28440 76544 129866 87429 164357 170566 122309 95590 180127 128048 25737
13583 25737 -27963 -44838 -36089 -71689 -159995 -252838 -82378 24217 29160 -71148 -11136
13572 -11136 -19425 -32692 15475 -10534 -29176 -86384 -90936 -84729 -42738 -101214 -24317 39720
13560 39720 52151 -38055 -29789 23304 3535 -4449 -52363 -95697 -23597 69823 79494 156156
13548 156156 153843 766 -101554 -54546 1250 -21096 -115154 -124640 -164688 -173194 -141864 -106764
13536 -106764 -72949 -64253 -21662 -48706 -119112 -201492 -107076 -16131 95127 45220 -63626
$$ packed form
13618d7717O9133L9173r5700j2066Q5197P1568j0782J1312J908l5867k2188o510
13606D7461p3376l8590l9024N4993J9896R4141N1770n1283r6329K2216J11228
13595A03103k2942n1721M8104N3322m2437P6928O209m8257k6719Q4537n2079j02311
13583B5737n3700j6875Q749l5600q8306r2843J70460J06595M943j00308O0012
13572a1136q289j3267M8167k6009j8642n7208m552O207M1991n8476P6897O4037
13560C9720J2431r0206Q266N3093j9769p984m7914m3334P2100R3420R671P6662
13548A56156k313j53077j02320M7008N5796k2346r4058r486m0048q506L1330L5100
13536a06764L3815Q696M2591k7044p0406q2380R4416R0945J11258m9907j08846
$$ plain form
13525 -63626 -118612 -61954 18704 74018 98689 61131 124043 155181 103043 27872 9045 -3913
13513 -3913 -15731 -77162 -117299 -146390 -33078 11778 29780 12458 51656 114952 76441 9742
13501 9742 57573 -18439 17791 13531 27399 67112 121953 161300 83169 29944 120281 119184
13489 119184 53650 43530 32887 -51770 -48863 -97219 -51972 -77403 -98469 -57799 -51390 -63008
13477 -63008 -46825 -31903 -64828 4020 40448 143872 144898 16927 -60643 -112807 -122386 -87528
13465 -87528 49278 105811 42774 -20983 47415 61022 18514 20197 -34366 -60088 -86711 -94677
13453 -94677 -68655 -14139 81120 119562 61350 -49827 -105152 -123838 -64514 -131144 -121154 -10310
13441 -10310 37703 38382 -5669 -119061 -53363 -72972 -121006 -52424 -20871 -12751 -6904 7548
$$ packed form
13525f3626n4986N6658Q0658N5314K4671l7558O2912L1138n2138p5171j8827j2958
13513c913j1818o1431m0137k9091J13312M4856J8002j7322L9198O3296l8511o6699
13501I742M7831p6012L6230m260J3868L9713N4841L9347p8131n3225R0337j097
13489A19184o5534j0120j0643q4657K907m8356M5247k5431k1066M0670O409j1618
13477f3008J6183J4922l2925O8848L6428J03424J026j27971p7570n2164r579L4858
13465h7528J36806N6533o3037o3757O8398J3607m2508J683n4563k5722k6623p966
13453i4677K6022N4516R5259L8442n8212j11177n5325j8686N9324o6630R990J10844
13441a0310M8013O79m4051j13392O5698j9609m8034O8582L1553Q120N847J4452
$$ plain form
13429 7548 38338 -35700 -60833 -75009 -50567 25231 48108 67674 52936 141940 206434 190874
13417 190874 73046 -19806 -9308 -12446 -26 -51787 -9351 -25334 -21818 -68097 -91134 -102908
13405 -102908 -79708 -25275 -58066 -130951 -174795 -251396 -158914 -71500 -33109 17249 86517
13394 86517 71273 71152 120753 77510 61921 76090 93447 66318 52200 -2969 1258 -73877
13382 -73877 -66836 -14675 57676 -1877 -118636 -98737 -49439 -109189 -117691 -130406 -132097 -46625
13370 -46625 -5542 -45159 -62839 -52892 13576 78311 125888 48132 -7539 7728 -25792 6936
13358 6936 47059 81803 22628 34407 67956 168835 159517 226121 186633 110155 160649 203323
13346 203323 117728 38138 129378 132380 164022 206727 177307 217097 227996 181749 215456 121539
$$ packed form
13429G548L0790p4038k5133j4176K4442P5798K2877J9566j4738Q9004O4494j5560
13417A90874j17828r2852J0498l138J2420n1761M2436j5983L516m6279k3037j1774
13405a02908K3200N4433l2791p2885m3844p6601R2482Q7414L8391N0358O9268
13394H6517j5244j21M9601m3243j5589J4169J7357k7129j4118n5169M227p5135
13382g3877P041N2161P2351n9553j16759J9899M9298n9750q502j2715j691Q5472
13370d6625M1083l9617j7680R947O6468O4735M7577p7756n5671J5267l3520L2728
13358F936M0123L4744n9175J1779L3549J00879r318O6604l9488p6478N0494M2674
13346B03323q5595p9590R1240L002L1642M2705k9420L9790J0899m6247L3707r3917
$$ plain form
13334 121539 133063 155750 51711 24369 67826 116801 33457 3107 53370 142901 109903
13323 109903 191723 198698 135239 57118 -18381 -1007 3972 4204 72102 75850 25252 111801
$$ packed form
13334A21539J1524K2687j04039k7342M3457M8975q3344l0350N0263Q9531l2998
13323A09903Q1820O975o3459p8121p5499J7374M979K32O7898L748n0598Q6549
$$ [...]
##END NTUPLES=NMR SPECTRUM
##END=
