##TITLE=Analysis number 327913
Compound Code mo 07963
Book Reference 510/44
Project Code adrs
Chemist Name jimp
##JCAMPDX= 6.0         $$ Bruker NMR JCAMP-DX V2.0
##DATA TYPE= NMR SPECTRUM
##DATA CLASS= NTUPLES
##ORIGIN= Bruker BioSpin GmbH
##OWNER= nmr
$$ XWIN-NMR		Version 3.5
$$ Wed Apr 18 11:32:59 2007 GMT Daylight Time (UT+1h)  MAYBRIDGE\nmr@NMR_250MHZ
##.OBSERVE FREQUENCY= 250.131544655141
##.OBSERVE NUCLEUS= ^1H
##.ACQUISITION MODE= SIMULTANEOUS (DQD)
##.ACQUISITION SCHEME= undefined
##.AVERAGES= 16
##.DIGITISER RES= 18
##SPECTROMETER/DATA SYSTEM= dpx250
##.PULSE SEQUENCE= zg30
##.SOLVENT NAME= DMSO
##.SHIFT REFERENCE= (INTERNAL, DMSO, 0, 16.522)
##AUDIT TRAIL= $$ (NUMBER, WHEN, WHO, WHERE, WHAT)
$$ ##TITLE= Audit trail, XWIN-NMR		Version 3.5
$$ ##JCAMPDX= 5.01
$$ ##ORIGIN= Bruker BioSpin GmbH
$$ ##OWNER= nmr
$$ C:\u/data/dgb/nmr/ADRS/1620/pdata/1/auditp.txt
$$ ##AUDIT TRAIL=  $$ (NUMBER, WHEN, WHO, WHERE, WHAT)
(   1,<2007-04-18 11:32:35.36 +100>,<MAYBRIDGE\nmr>,<NMR_250MHZ>,
      <created by zg, POWCHK disabled, PULCHK disabled
       configuration hash MD5:
       49 4B E0 1D 92 C2 6B 37 9F E6 65 BC 52 41 86 1D
       data hash MD5: 64K
       6A F5 43 F2 63 5E 64 64 74 AA 35 48 1E AE 99 37>)
(   2,<2007-04-18 11:32:48.58 +100>,<MAYBRIDGE\nmr>,<NMR_250MHZ>,
      <Start of raw data processing
       ef LB = 0.3 FT_mod = 6 PKNL = 1 SI = 32K 
       data hash MD5: 32K
       4C 8D A2 F2 88 9B A3 5B AB 9D 4B 06 C1 13 F2 25>)
(   3,<2007-04-18 11:32:50.24 +100>,<MAYBRIDGE\nmr>,<NMR_250MHZ>,
      <apk 
       data hash MD5: 32K
       A4 8C 55 8D E1 C0 1F DC 3E 22 1C D5 08 70 E5 0F>)
(   4,<2007-04-18 11:32:50.97 +100>,<MAYBRIDGE\nmr>,<NMR_250MHZ>,
      <abs ABSG = 5 
       data hash MD5: 32K
       45 42 DC 32 68 3B E8 79 C4 BD 5F 15 CD 92 44 7F>)
$$ ##END=
$$ 
$$ hash MD5
$$ D7 0E B1 06 40 B5 A1 C8 3A 09 52 50 6E BC D9 E5
##$RELAX= 
##$RELAX= 
##$RELAX= 
##$RELAX= 
##$RELAX= 
##$RELAX= 
##$RELAX= 
$$ Bruker specific parameters
$$ --------------------------
##$DU= <C:\u>
##$EXPNO= 1620
##$NAME= <ADRS>
##$PROCNO= 1
##$TYPE= <nmr>
##$USER= <dgb>
##$AMP= (0..31)
100 100 100 100 100 100 100 100 100 100 100 100 100 100 100 100 100 100 
100 100 100 100 100 100 100 100 100 100 100 100 100 100 
##$AQSEQ= 0
##$AQ_mod= 3
##$AUNM= <au_zg>
##$AUTOPOS= <10 >
##$BF1= 250.13
##$BF2= 250.13
##$BF3= 250.13
##$BF4= 250.13
##$BF5= 500.13
##$BF6= 500.13
##$BF7= 500.13
##$BF8= 500.13
##$BYTORDA= 1
##$CFDGTYP= 0
##$CFRGTYP= 5
##$CHEMSTR= <none>
##$CNST= (0..31)
1 1 145 1 1 1 1 1 1 1 1 1 1 1 1 1 1 1 1 1 1 1 1 1 1 1 1 1 1 1 1 1 
##$CPDPRG= <>
##$CPDPRG1= <>
##$CPDPRG2= <>
##$CPDPRG3= <>
##$CPDPRG4= <mlev>
##$CPDPRG5= <mlev>
##$CPDPRG6= <mlev>
##$CPDPRG7= <mlev>
##$CPDPRG8= <mlev>
##$CPDPRGB= <>
##$CPDPRGT= <>
##$D= (0..31)
0 1 0 0 0 0 0 0 0 0.06 0 0 0 0 0 0 0.0002 0 0 0 0 0 0 0 0 0 0 0 0 0 0 
0 
##$DATE= 1176892353
##$DBL= (0..7)
120 120 120 120 120 120 120 120 
##$DBP= (0..7)
150 150 150 150 150 150 150 150 
##$DBP07= 0
##$DBPNAM0= <>
##$DBPNAM1= <>
$$ [...]
##$SUBNAM7= <"">
##$SUBNAM8= <"">
##$SUBNAM9= <"">
##$SW= 20.6930455092707
##$SWIBOX= (0..15)
0 0 3 0 0 0 0 0 0 0 0 0 0 0 0 0 
##$SW_h= 5175.983436853
##$TD= 65536
##$TD0= 1
##$TE= 683.16
##$TE2= 300
##$TE3= 300
##$TEG= 300
##$TL= (0..7)
0 120 120 120 120 120 120 120 
##$TP= (0..7)
150 150 150 150 150 150 150 150 
##$TP07= 0
##$TPNAME0= <>
##$TPNAME1= <>
##$TPNAME2= <>
##$TPNAME3= <>
##$TPNAME4= <>
##$TPNAME5= <>
##$TPNAME6= <>
##$TPNAME7= <>
##$TPOAL= (0..7)
0.5 0.5 0.5 0.5 0.5 0.5 0.5 0.5 
##$TPOFFS= (0..7)
0 0 0 0 0 0 0 0 
##$TUNHIN= 0
##$TUNHOUT= 0
##$TUNXOUT= 0
##$USERA1= <user>
##$USERA2= <user>
##$USERA3= <user>
##$USERA4= <user>
##$USERA5= <user>
##$V9= 5
##$VALIST= <valist>
##$VCLIST= <CCCCCCCCCCCCCCC>
##$VD= 0
##$VDLIST= <DDDDDDDDDDDDDDD>
##$VPLIST= <PPPPPPPPPPPPPPP>
##$VTLIST= <TTTTTTTTTTTTTTT>
##$WBST= 1024
##$WBSW= 4
##$XGAIN= (0..3)
0 0 0 0 
##$XL= 0
##$YL= 0
##$YMAX_a= 223065
##$YMIN_a= -357121
##$ZGOPTNS= <>
##$ZL1= 120
##$ZL2= 120
##$ZL3= 120
##$ZL4= 120
##$ABSF1= 16.522
##$ABSF2= -4.171173
##$ABSG= 5
##$ABSL= 3
##$ALPHA= 0
##$AQORDER= 0
##$ASSFAC= 0
##$ASSFACI= 0
##$ASSFACX= 0
##$ASSWID= 0
##$AUNMP= <proc_1d>
##$AZFE= 0.1
##$AZFW= 0.1
##$BCFW= 0
##$BC_mod= 0
##$BYTORDP= 0
##$COROFFS= 0
##$CY= 12.5
##$DATMOD= 1
##$DC= 0
##$DFILT= <>
##$DTYPP= 0
##$F1P= 14.0000005364418
##$F2P= -0.99999901652339
##$FCOR= 0.5
##$FTSIZE= 32768
##$FT_mod= 6
##$GAMMA= 0
##$GB= 0
##$INTBC= 1
##$INTSCL= 1
##$ISEN= 128
##$LB= 0.3
##$LEV0= 0
##$LPBIN= 0
##$MAXI= 10000
##$MC2= 0
##$MEAN= 0
##$ME_mod= 0
##$MI= 0
##$NCOEF= 0
##$NC_proc= -6
##$NLEV= 6
##$NOISF1= 0
##$NOISF2= 0
##$NSP= 0
##$NTH_PI= 0
##$NZP= 0
##$OFFSET= 16.522
##$PC= 1
##$PHC0= 222.6131
##$PHC1= 9.691341
##$PH_mod= 1
##$PKNL= yes
##$PPARMOD= 0
##$PSCAL= 4
##$PSIGN= 0
##$REVERSE= no
##$SF= 250.13
##$SI= 32768
##$SIGF1= 0
##$SIGF2= 0
##$SINO= 400
##$SIOLD= 32768
##$SREGLST= <1H.DMSO>
##$SSB= 0
##$STSI= 32768
##$STSR= 0
##$SW_p= 5175.98343685301
##$SYMM= 0
##$S_DEV= 0
##$TDeff= 65536
##$TDoff= 0
##$TI= <Analysis number 999999
Compound Code 99
Book Reference 9
Project Code 9>
##$TILT= no
##$TM1= 0
##$TM2= 0
##$TOPLEV= 0
##$USERP1= <user>
##$USERP2= <user>
##$USERP3= <user>
##$USERP4= <user>
##$USERP5= <user>
##$WDW= 1
##$XDIM= 32768
##$YMAX_p= 522984170
##$YMIN_p= -1301506
$$ End of Bruker specific parameters
$$ ---------------------------------
##NTUPLES= NMR SPECTRUM
##VAR_NAME=  FREQUENCY,     SPECTRUM/REAL,   SPECTRUM/IMAG
##SYMBOL=    X,             R,               I
##VAR_TYPE=  INDEPENDENT,   DEPENDENT,       DEPENDENT
##VAR_FORM=  AFFN,          ASDF,            ASDF
##VAR_DIM=   32768,         32768,           32768
##UNITS=     HZ,            ARBITRARY UNITS, ARBITRARY UNITS
##FACTOR=    0.157963299565203, 1,           1
##FIRST=     4132.6476996994, 0,             0
##LAST=      -1043.33573715361, 0,           0
##MIN=       -1043.33573715361, -1301506,    0
##MAX=       4132.6476996994, 522984170,     0
$$ Real data points
##PAGE= N=1
##DATA TABLE= (X++(R..R)), XYDATA
$$ [...]
$$ plain form
15489 173134 279035 323822 127628 24448 -171092 -511605 -415750 -287235 -594205 -437234
15479 -437234 -163275 -440235 -443510 -636469 -854895 -1113597 -849210 -539735 -465360 -619826
15469 -619826 -561717 -230014 -141509 -384821 -387166 -414824 -543321 -430929 -459421 -502373 -608816
15458 -608816 -357735 -61279 -239141 -74144 -223412 -173498 -224536 -300920 -428634 -544993
15448 -544993 -382215 -30982 -54015 -66389 -73088 188365 263367 335579 275200 17287 -196387
15437 -196387 240252 366670 254061 323854 247643 -112185 -239074 -180588 -352065 -520914
15427 -520914 -406609 -337577 -396574 -241415 -99641 -177851 -257696 -261762 -220242 -211979 -307088
15416 -307088 -490320 -580664 -619416 -215964 114981 390390 351582 199533 36671 154887
$$ packed form
15489A73134J05901M4787j96194j03180j95540l40513R5855J28515l06970J56971
15479d37234K73959k76960l275j92959k18426k58702K64387L09475P4375j54466
15469f19826N8109L31703Q8505k43312k345k7658j28497J12392k8492m2952j06443
15458f08816K51081K96456j77862J64997j49268M9914n1038p6384j27714j16359
15448e44993J62778L51233k3033j2374o699K61453P5002P2212o0379k57913k13674
15437a96387M36639J26418j12609O9793p6211l59828j26889N8486j71477j68849
15427e20914J14305O9032n8997J55159J41774p8210p9845m066M1520Q263r5109
15416c07088j83232r0344l8752M03452L30945K75409l8808j52049j62862J18216
$$ plain form
15406 154887 253344 174669 131224 90817 86844 139518 -182111 -476911 -528070 -272610 -8110
15395 -8110 7055 -135225 -112727 92883 268886 212130 227109 53534 -134069 -687 14018
15384 14018 -189847 -345191 -84243 29808 -178682 -1186 2546 -278220 -461706 -434463
15374 -434463 -466994 -243998 39995 -479788 -628377 -332040 -52046 -128140 -128644 -296108
15364 -296108 -108580 146355 360732 118108 -228936 -333956 -690777 -651548 -497818 -304721
15354 -304721 -221525 67581 278754 271016 -124921 -312577 -245432 -213388 -306732 -554628 -631351
15343 -631351 -470626 -267443 -219928 7881 476543 724864 289399 -156271 -76637 -57507
15333 -57507 10797 281174 166749 40078 -221220 -694659 -870553 -775340 -185696 110448
$$ packed form
15406A54887R8457p8675m3445m0407l973N2674l21629k94800n1159K55460K64500
15395h110J5165j42280K2498K05610J76003n6756J4979j73575j87603J33382J4705
15384A4018k03865j55344K60948J14051k08490J77496L732k80766j83486K7243
15374d34463l2531K22996K83993n19783j48589K96337K79994p6094n04j67464
15364b96108J87528K54935K14377k42624l47044j05020l56821L9229J53730J93097
15354c04721Q3196K89106K11173p738l95937j87656O7145L2044r3344k47896p6723
15343f31351J60725K03183M7515K27809M68662K48321m35465m45670P9634J9130
15333e7507O8304K70377j14425j26671k61298m73439j75894R5213N89644K96144
$$ plain form
15323 110448 -3929 -179552 -384994 -123119 114802 192133 198032 90859 124090 -122160
15313 -122160 -204306 197824 283283 -54846 -245132 -57663 13863 74912 211994 182337
15303 182337 208423 45570 74161 133182 -102626 -337023 -612282 -775779 -727510 -433871
15293 -433871 -273578 -284493 -468663 -40872 159265 -77784 1779 -497954 -401171 -223527
15283 -223527 -215115 -81554 18212 -274480 -537694 -468269 -498895 -306179 -142520 -14352
15273 -14352 32823 65658 267951 200452 261191 188049 -295221 -282414 -150177 3875 105886
15262 105886 74172 15170 -21943 201236 183301 103142 -76503 -530194 -526056 -295014 -240335
15251 -240335 -275391 -232369 -179493 -310628 -446991 -126856 -299568 -561369 -583762 -466881
$$ packed form
15323A10448j14377j75623k05442K61875K37921P7331N899j07173L3231k46250
15313a22160q2146M02130Q5459l38129j90286J87469P1526O1049J37082k9657
15303A82337K6086j62853K8591N9021k35808k34397k75259j63497M8269K93639
15293d33871J60293j0915j84170M27791K00137k37049P9563m99733R6783J77644
15283b23527Q412J33561R9766k92692k63214O9425l0626J92716J63659J28168
15273a4352M7175L2835K02293o7499O0739p3142m83270J2807J32237J54052J02011
15262A05886l1714n9002l7113K23179j7935q0159j79645m53691M138K31042N4679
15251b40335l5056M3022N2876j31135j36363L20135j72712k61801k2393J16881
$$ plain form
15241 -466881 -143750 179410 22613 -127436 -460586 -572137 -425162 -319889 -140064 -79107
15231 -79107 -94249 -33771 -219212 -199516 -198930 -535790 -505930 -200217 -531998 -288590 -307005
15220 -307005 -239036 -220563 -133372 -291450 -445013 -462804 -438612 -551338 -824556 -726685 -557272
15209 -557272 -396422 -155143 156147 -29995 50375 189445 -19491 -185845 -159695 -256732
15199 -256732 -174354 -158587 -234523 -379052 -336831 -28111 -92455 -240843 -114391 -272592
15189 -272592 -299993 -345397 -216067 -117302 -124139 -45890 -374390 -398861 -347231 -278880 -452735
15178 -452735 -59619 433019 219492 -48719 126835 -36885 39766 220498 -33282 158927
15168 158927 330866 332484 -4283 -473929 -694628 -502543 -178986 -235991 -381879 -240021
$$ packed form
15241d66881L23131L23160j56797j50049l33150j11551J46975J05273J79825O0957
15231g9107j5142O0478j85441J9696N86l36860K9860L05713l31781K43408j8415
15220c07005O7969J8473Q7191j58078j53563j7791K4192j12726k73218R7871J69413
15209e57272J60850K41279L11290j86142Q0370J39070k08936j66354K6150r7037
15199b56732Q2378J5767p5936j44529M2221L08720o4344j48388J26452j58201
15189b72592k7401m5404J29330R8765o837P8249l28500k4471N1630O8351j73855
15178d52735L93116M92638k13527k68211J75554j63720P6651J80732k53780J92209
15168A58927J71939J618l36767m69646k20699J92085L23557n7005j45888J41858
$$ plain form
15158 -240021 -258629 -360245 -416628 -531596 -600698 -555057 -504814 -592154 -511185 -492998 -329417
15147 -329417 -166263 -27092 -126512 -384939 -46985 -62623 -79226 -414106 -192514 -142162
15137 -142162 -113960 -376578 -309859 -246114 -335297 -398011 -87740 -72807 -101924 8571 9344
15126 9344 225151 -95952 -507726 -363615 -384847 -36588 74405 118465 9556 -165557
15116 -165557 -51239 -36846 -325879 -655707 -362756 -338843 -188580 -4298 255822 256987
15106 256987 134672 363519 474117 560030 528696 577741 402374 264852 104610 11362
15096 11362 -191513 -386674 -135065 -228785 -128297 -252003 -238849 140021 325655 88423
15086 88423 64287 51001 -83657 -178404 -73278 196976 119944 241948 438325 153364
$$ packed form
15158b40021j8608j01616n6383j14968o9102M5641N0243q7340Q0969J8187J63581
15147c29417J63154J39171r9420k58427L37954j5638j6603l34880K21592N0352
15137a42162K8202k62618O6719O3745q9183o2714L10271J4933k9117J10495P73
15126I344K15807l21103m11774J44111k1232L48259J10993M4060j08909j75113
15116a65557J14318J4393k89033l29828K92951K3913J50263J84282K60120J165
15106B56987j22315K28847J10598Q5913l1334M9045j75367j37522j60242r3248
15096A1362k02875j95161K51609r3720J00488j23706J3154L78870J85634k37232
15086H8423k4136j3286j34658r4747J05126K70254p7032J22004J96377k84961
$$ plain form
15076 153364 196083 97359 -330421 -767249 -886339 -624954 -334921 -287690 -315501 -247238
15066 -247238 -177604 -272933 -409629 -462515 -21246 128839 6449 43579 449630 158259
15056 158259 40231 109226 50421 312766 134346 153719 94116 99256 15616 -260244 -248719
15045 -248719 -586356 -566385 -394511 -489676 -584957 -511489 -306623 -389774 -377967 -64246 35340
15034 35340 -117094 -352251 -552457 -668187 -597348 -387226 -118009 -223656 -147048 -289354
15024 -289354 -7123 434226 415508 92335 -357854 -310956 -201688 -48945 16325 -66239
15014 -66239 -126966 -377083 -392049 -301168 -229588 2193 213631 195381 -13461 -481471 -717311
15003 -717311 -665859 -509642 -181824 -1761 -93758 162185 169933 185489 361347 255561
$$ packed form
15076A53364M2719r8724m27780m36828j19090K61385K90033M7231k7811O8263
15066b47238O9634r5329j36696n2886M41269J50085j22390L7130M06051k91371
15056A58259j18028O8995n8805K62345j78420J9373n9603N140q3640k75860J1525
15045b48719l37637J9971J71874r5165r5281P3468K04866q3151J1807L13721R9586
15034C5340j52434k35157k00206j15730P0839K10122K69217j05647P6608j42306
15024b89354K82231M41349j8718l23173m50189M6898J09268J52743O5270q2564
15014f6239o0727k50117j4966R0881P1580K31781K11438j8250k08842m68010k35840
15003g17311N1452J56217L27818J80063r1997K55943P748J5556J75858j05786
$$ plain form
14993 255561 154417 90870 57968 51651 -15858 102840 153059 253707 160938 213628 172694
14982 172694 184129 280718 307117 408233 475672 534938 238250 260422 -151269 -568443 -680104
14971 -680104 -484515 -427951 -256685 -289479 -44230 -32801 6937 -91478 -394349 -70790
14961 -70790 66462 65582 -90129 -34828 -200094 -450052 -491980 -434158 -185166 103973 356855
14950 356855 123378 -9704 -196213 -399758 -306702 -338847 -403102 -398475 -752596 -790547 -484585
14939 -484585 -308241 -208920 -207752 -34256 -163000 -316331 -212357 -254274 -117457 -216551
14929 -216551 -544779 -666304 -730342 -433095 -194589 -325238 -697067 -593725 -40474 -137235
14919 -137235 -328153 -249567 -278851 -539622 -606903 -655450 -586906 -776068 -509258 -254487
$$ packed form
14993B55561j01144o3547l2902o317o7509J18698N0219J00648r2769N2690m0934
14982A72694J1435R6589K6399J01116O7439N9266k96688K2172m11691m17174j11661
14971f80104J95589N6564J71266l2794K45249J1429L9738r8415l02871L23559
14961g0790J37252q80j55711N5301j65266k49958m1928N7822K48992K89139K52882
14950C56855k33477j33082j86509k03545R3056l2145o4255M627l54121l7951L05962
14939d84585J76344R9321J168J73496j28744j53331J03974m1917J36817r9094
14929b16551l28228j21525o4038K97247K38506j30649l71829J03342N53251r6761
14919a37235j90918P8586k9284k60771o7281m8547O8544j89162K66810K54771
$$ plain form
14909 -254487 -253653 -253399 -418342 -53138 840 -94266 42501 60660 108023 227303 244619
14898 244619 267286 69082 183289 -88379 -170038 -267763 -362754 -229116 36141 337882
14888 337882 369948 293438 412776 193289 66116 205958 124737 -1866 -132819 -132125 -127609
14877 -127609 -229653 -336535 11586 365090 30213 -69315 -59050 -303706 -121355 -143493
14867 -143493 -159733 84266 -249388 -502896 -457680 -435821 -403104 -288096 -143180 -22779
14857 -22779 -83132 -257198 -288661 -162093 288918 372382 -150528 -67359 -13490 -188678 -139984
14846 -139984 -309506 -495879 -281166 14366 -275134 -284495 -129438 99983 356267 284310
14836 284310 420811 551942 309029 -58539 -366912 -108354 123652 314268 -77481 -319837
$$ packed form
14909b54487Q34K54j64943L65204N3978r5106J36767J8159M7363J19280J7316
14898B44619K2667j98204J14207k71668q1659r7725r4991J33638K65257L01741
14888C37882L2066p6510J19338k19487j27173J39842q1221j26603j30953O94M516
14877a27609j02044j06882L48121L53504l34877r9528J0265k44656J82351k2138
14867a43493j6240K43999l33654k53508M5216K1859L2717J15008J44916J20401
14857b2779o0353j74066l1463J26568M51011Q3464n22910Q3169N3869j75188M8694
14846a39984j69522j86373K14713K95532k89500r361J55057K29421K56284p1957
14836B84310J36501J31131k42913l67568l08373K58558K32006J90616l91749k42356
$$ plain form
14826 -319837 -118485 19773 409097 509528 330135 246015 240937 -304252 -281207 75670
14816 75670 4862 216556 166713 272920 192596 151178 53294 -282236 -129252 218750 245220
14805 245220 238999 159074 -230020 -236434 -91791 -22476 103433 256530 234825 -133803 -296598
14794 -296598 -125440 -118583 -92898 -132549 -241776 -512760 -519382 -291573 227469 320980 143699
14783 143699 8207 148388 410415 472615 198994 -74047 -98143 -195074 -205556 -367287
14773 -367287 -37226 111212 182000 301823 174684 492422 810553 327782 -230164 -420959
14763 -420959 -113468 14138 -22293 -107999 22397 -18761 34492 82448 -353592 -475845
14753 -475845 -252216 -250592 -280392 -36436 -97797 -35396 -169203 -231991 112773 -22221 -320305
$$ packed form
14826c19837K01352J38258L89324J00431j79393q4120n078n45189K3045L56877
14816G5670p0808K11694m9843J06207q0324m1418r7884l35530J52984L48002K6470
14805B45220o221p9925l89094o414J44643O9315J25909J53097k1705l68628j62795
14794b96598J71158O857K5685l9651j09227k70984o622K27809N19042R3511j77281
14783A43699j35492J40181K62027O2200k73621k73041k4096r6931j0482j61731
14773c67287L30061J48438P0788J19823j27139L17738L18131m82771n57946j90795
14763d20959L07491J27606l6431q5706J30396m1158N3253M7956m36040j22253
14753d75845K23629J624k9800K43956o1361O2401j33807o2788L44764j34994k98084
$$ plain form
14742 -320305 -307967 -182607 -594345 -753716 -323566 -108714 -7769 173864 621301 811765
14732 811765 807281 392125 3970 -275458 -633583 -428296 -149044 -171948 -56199 -15995
14722 -15995 41394 146251 211323 223778 122052 106809 169673 1796 122848 485273 559852
14711 559852 361667 40146 236089 365762 149958 204869 268977 110107 -82756 -81869
14701 -81869 80765 438614 221307 43846 -50799 -313274 -376565 -100452 47157 139916
14691 139916 189111 265296 146964 48842 34331 -85036 -334754 -329081 -112756 -53138 194824
14680 194824 432184 414964 127107 -99176 -266851 -8339 142046 -89616 -367279 -426814
14670 -426814 -295097 -748841 -320829 -112292 138948 369188 306017 83146 -23199 -15261
$$ packed form
14742c20305J2338J25360m11738j59371M30150K14852J00945J81633M47437J90464
14732H11765m484m15156l88155k79428l58125K05287K79252k2904J15749M0204
14722a5995N7389J04857O5072J2455j01726j5243O2864j67877J21052L62425P4579
14711E59852j98185l21521J95943J29673k15804N4911O4108j58870j92863Q87
14701h1869J62634L57849k17307j77461r4645k62475o3291K76113J47609R2759
14691A39916M9195P6185j18332r8122j4511j19367k49718N673K16325N9618K47962
14680A94824K37360j7220k87857k26283j67675K58512J50385k31662k77663n9535
14670d26814J31717m53744M28012K08537K51240K30240o3171k22871j06345P938
$$ plain form
14660 -15261 51587 319264 436491 223612 -34860 -48413 76286 32352 -321155 -132578
14650 -132578 -221933 -276387 -329072 -181860 3149 -296419 -416132 65745 415157 328942
14640 328942 -5733 211771 -54746 -24341 194628 229445 207139 317184 507251 316563
14630 316563 -245548 -397703 -254790 -125295 -125743 -188121 -478916 -413130 -300054 -294132 -320070
14619 -320070 -204282 -403613 -303354 -388123 -298899 26777 38575 -178710 -137978 -98138
14609 -98138 -61704 -53612 -32098 -143047 -30501 129630 -80250 -141673 -139176 -447 35037
14598 35037 -118988 -200758 -107254 124513 225233 61395 -290908 -167218 78919 2501
14588 2501 -180532 -172126 180669 328733 353520 100324 62925 -206741 -73745 -117577 -166486
$$ packed form
14660a5261O6848K67677J17227k12879k58472j3553J24699m3934l53507J88577
14650a32578q9355n4454n2685J47212J85009k99568j19713M81877L49412q6215
14640C28942l34675K17504k66517L0405K18969L4817k2306J10045J90067j90688
14630C16563n62111j52155J42913J29495m48o2378k90795O5786J13076N922k5938
14619c20070J15788j99331J00259q4769Q9224L25676J1798k17285M0732L9840
14609i8138L6434Q092K1514j10949J12546J60131k09880o1423K497J38729L5484
14598C5037j54025q1770R3504K31767J00720j63838l52303J23690K46137p6418
14588B501j83033Q406L52795J48064K4787k53196l7399k69666J32996m3832m8909
$$ plain form
14577 -166486 -182104 -191377 -350208 -145280 167117 258217 -16074 -291361 -169226 190635
14567 190635 330368 464755 538594 385419 161759 -121515 -377266 -180987 9712 105521
14557 105521 253896 361982 633162 607011 649042 557714 520925 348777 457685 553565
14547 553565 612467 503590 246017 -11357 -457018 -625440 -716262 -560253 -174131 -22347
14537 -22347 -59821 24815 208798 377262 472885 668881 562548 306137 69128 -260801
14527 -260801 -204480 46447 209565 351167 153453 -188851 -472983 -779327 -687356 -598111
14517 -598111 -649968 -253727 -156039 2195 -287791 -124515 144925 156283 829 -156429
14507 -156429 -167422 163718 525725 296303 -80357 -279237 -162005 -285956 -137876 -104260
$$ packed form
14577a66486j5618r273j58831K04928L12397R1100k74291k75287J22135L59861
14567A90635J39733J34387P3839j53175k23660k83274k55751J96279J90699R5809
14557A05521J48375J08086K71180k6151M2031r1328l6789j72148J08908R5880
14547E53565N8902j08877k57573k57374m45661j68422r0822J56009L86122J51784
14537b2347l7474Q4636J83983J68464R5623J95996j06333k56411k37009l29929
14527b60801N6321K50927J63118J41602j97714l42304k84132l06344R1971Q9245
14517e98111n1857L96241R7688J58234k89986J63276K69440J1358j55454j57258
14507a56429j0993L31140L62007k29422l76660j98880J17232j23951J48080L3616
$$ plain form
14497 -104260 -289690 -117886 211176 321392 226528 304748 145477 68168 287329 90057
14487 90057 -5526 378514 702589 806108 755331 293646 363419 177806 -93182 172801
14477 172801 622791 611329 334281 198241 160498 18700 189258 300918 316937 86264
14467 86264 -259942 -409523 -371010 -388012 -249790 -7770 -43240 -39833 -245566 -257385 -60679
14456 -60679 -32932 -70132 -204407 -394851 -466737 -623618 -454185 -6096 135662 175074
14446 175074 -177000 -329278 -903683 -974841 -656117 -337456 -332349 -272647 -371781 -538249
14436 -538249 -708175 -440318 -184739 -204610 -244202 -236418 -50166 -95375 -94093 -65897 -69906
14425 -69906 -380580 -134018 -6621 8769 -243638 -418176 -90064 306346 202902 -172398
$$ packed form
14497a04260j85430J71804L29062J10216r4864P8220j59271p7309K19161j97272
14487I0057r5583L84040L24075J03519n0777m61685O9773j85613k70988K65983
14477A72801M49990j1462k77048j36040l7743j41798J70558J11660J6019k30673
14467H6264l46206j49581L8513j7002J38222K42020l5470L407k05733j1819J96706
14456f0679K7747l7200j34275j90444p1886j56881J69433M48089J41758L9412
14446A75074l52074j52278n74405p1158L18724L18661N107N9702r9134j66468
14436e38249j69926K67857K55579j9871l9592P784J86252m5209J282K8196m009
14425f9906l10674K46562J27397J5390k52407j74538L28112L96410j03444l75300
$$ plain form
14415 -172398 -28682 108113 66151 2639 -246627 -63377 -221757 -120232 6937 204647
14405 204647 427651 440613 321762 467227 464968 210043 -39516 -500411 -573765 -388108
14395 -388108 -403745 -560062 -410148 -84277 111287 -42648 -488634 -395507 9635 136217
14385 136217 38660 -7701 201929 164269 92471 -149053 -225189 -68030 108924 -56719
14375 -56719 -71364 -88997 -66463 -352438 -388621 -111359 178231 -16911 -276925 -268733 -720489
14364 -720489 -585110 -590128 -852910 -390197 53074 336004 376498 395037 437028 345687 402119
14353 402119 257288 118295 305624 -143296 -693212 -279508 -12571 148626 98840 346942
14343 346942 557966 462917 260275 -46052 -269641 42147 -155 43339 191372 -136884
$$ packed form
14415a72398J43716J36795m1962o3512k49266J83250j58380J01525J27169J97710
14405B04647K23004J2962j18851J45465k259k54925k49559m60895p3354J85657
14395c88108j5637j56317J49914L25871J95564j53935m45986R3127M05142J26582
14385A36217r7557m6361K09630l7660p1798k41524p6136J57159J76954j65643
14375e6719j4645j7633K2534k85975l6183K77262K89590j95142k60014Q192m51756
14364g20489J35379n018k62782M62713M43271K82930M0494J8539M1991r1341N6432
14353D02119j44831j38993J87329m48920n49916M13704K66937J61197m9786K48102
14343C46942K11024r5049k02642l06327k23589L11788m2302M3494J48033l28256
$$ plain form
14333 -136884 -463693 -594948 -446554 -465009 -296726 -90009 -482506 -528132 -191605 292784
14323 292784 470804 364448 171409 197090 348062 222086 321048 330130 110686 218423
14313 218423 476539 414988 114820 119477 3819 -364885 -526070 -169446 271464 682686
14303 682686 575834 39944 -168552 -313443 -191844 -359016 -282419 -4692 24253 54337
14293 54337 140616 -83187 -279170 -265730 -358491 -259623 137947 61559 -152244 -438272 -358980
14282 -358980 -151346 240810 466454 464282 606500 458384 525814 674371 339502 -44603
14272 -44603 10403 273801 356609 150205 217753 141373 143974 89399 66237 264575 764175
14261 764175 821523 401271 -11475 -109421 -270059 -144793 -148023 -304592 -286796 -237204 -214949
$$ packed form
14333a36884l26809j31255J48394j8455J68283K06717l92497m5626L36527M84389
14323B92784J78020j06356j93039K5681J50972j25976R8962R082k19444J07737
14313B18423K58116o1551l00168M657j15658l68704j61185L56624M40910M11222
14303F82686j06852n35890k08496j44891J21599j67172P6597K77727K8945L0084
14293E4337Q6279k23803j95983J3440r2761R8868L97570p6388k13803k86028P9292
14282c58980K07634L92156K25644k172J42218j48116O7430J48557l34869l84105
14272d4603N5006K63398Q2808k06404O7548p6380K601n4575k3162J98338M99600
14261G64175N7348m20252m12746r7946j60638J25266l230j56569J7796M9592K2255
$$ plain form
14250 -214949 -312467 -179889 -234127 -158622 -15965 97773 187878 163855 -28244 -124614 -17861
14239 -17861 45848 -89983 -166068 -331295 -225560 60525 -215294 -232595 -44405 -170744
14229 -170744 62605 149851 143637 391709 601340 389567 347093 292228 550602 338395
14219 338395 96577 -91403 -32312 -15791 -13624 163245 36766 -41714 174295 338074
14209 338074 484585 469824 433920 289471 259852 599959 293239 575054 540862 80643
14199 80643 -25918 -94417 -12631 -81636 -65660 148763 621091 263919 267391 625907 558493
14188 558493 588659 597971 882553 927110 1046037 1011103 1054284 922027 1275706 1475791 1244946
14177 1244946 942034 301497 115021 185663 449508 393174 590691 675373 481228 203597
$$ packed form
14250b14949r7518J32578n4238P5505J42657J13738R0105k4023j92099r6370J06753
14239a7861O3709j35831p6085j65227J05735K86085k75819j7301J88190j26339
14229a70744K33349Q7246o214K48072K09631k11773m2474n4865K58374k12207
14219C38395k41818j87980N9091J6521K167J76869j26479p8480K16009J63779
14209C38074J46511j4761l5904j44449k9619L40107l06720K81815l4192m60219
14199H0643j06561o8499Q1786o9005J5976K14423M72328l57172L472L58516o7414
14188E58493L0166R312K84582M4557J18927l4934M3181j32257L53679K00085k30845
14177A244946l02912o40537j86476P0642K63845n6334J97517Q4682j94145k77631
$$ plain form
14167 203597 69884 105520 313960 324306 248960 287435 663086 853484 585300 520947
14157 520947 453492 234086 222369 169250 390260 954096 1309204 973969 534793 164865
14147 164865 217403 516098 908757 1192692 1327356 1275037 1378098 1607585 1569336 1316586
14137 1316586 1006985 795585 860859 937200 792271 748330 632515 344759 238343 372222
14127 372222 339647 508046 695395 686663 612707 609740 622234 50958 29266 82421 280534
14116 280534 350938 48242 233032 379319 -29554 58359 472044 633411 407583 309571
14106 309571 -8313 -238867 -87132 111004 504180 482943 202258 -221672 -246673 -205736
14096 -205736 -242358 -14940 298959 447711 247321 161935 74050 277106 392117 280716
$$ packed form
14167B03597j33713L5636K08440J0346p5346L8475L75651J90398k68184o4353
14157E20947o7455k19406j1717n3119K21010N63836L55108l35235m39176l69928
14147A64865N2538K98695L92659K83935J34664n2319J03061K29487l8249k52750
14137A316586l09601k11400O5274P6341j44929m3941j15815k87756j06416J33879
14127C72222l2575J68399J87349q732p3956k967J2494n71276k1692N3155J98113
14116B80534P0404l02696J84790J46287m08873Q7913M13685J61367k25828r8012
14106C09571l17884k30554J51735J98136L93176k1237k80685m23930k5001M0937
14096b05736l6622K27418L13899J48752k00390q5386q7885K03056J15011j11401
$$ plain form
14086 280716 429134 645625 841961 967817 980391 1049279 1135224 1207077 1390590 1380815 1255860
14075 1255860 1443209 1685774 1336783 934179 1025536 1008933 1224826 1072684 723490 989435
14065 989435 1083328 870573 1037263 809357 1122220 1260844 644852 231426 345592 402330
14055 402330 470083 641570 439932 570746 579707 355648 304813 478806 486029 678230 919884
14044 919884 688544 845800 1024156 1261133 1221854 1367708 1481555 1678965 1931540 1948296
14034 1948296 1653077 1370118 1242654 1075220 966902 1029667 1016174 804767 514360 583197
14024 583197 613645 440141 435434 721870 835664 577457 584661 753551 618086 528128 590982
14013 590982 289023 -78466 155407 440490 771290 777500 559906 287551 130956 132199
$$ packed form
14086B80716J48418K16491J96336J25856J2574O8888Q5945P1853J83513r775j24955
14075A255860J87349K42565l48991m02604R1357j6603K15893j52142l49194K65945
14065I89435R3893k12755J66690k27906L12863J38624o15992m13426J14166N6738
14055D02330O7753J71487k01638J30814Q961k24059n0835J73993P223J92201K41654
14044I19884k31340J57256J78356K36977l9279J45854J13847J97410K52575J6756
14034A948296k95219k82959j27464j67434j08318O2765j3493k11407k90407O8837
14024E83197L0448j73504m707K86436J13794k58207P204J68890j35465q9958O2854
14013E90982l01959l67489K33873K85083L30800O210k17594k72355j56595J243
$$ plain form
14003 132199 77156 -110817 -283502 -122806 -13441 64121 95480 129393 193297 234535 362702
13992 362702 229907 198425 479472 970198 1234085 978487 545444 271269 432967 852799
13982 852799 812915 655669 717830 580819 451941 481904 298758 382636 609904 639453
13972 639453 504018 355310 146494 345127 683399 517822 567796 546276 307778 310428
13962 310428 368710 416208 667375 433763 376158 449479 159371 42929 107450 -21681
13952 -21681 -33582 606 22466 109827 311667 230154 264446 447320 291189 102181 85794
13941 85794 379689 366819 325013 422855 503086 845887 932186 870153 403811 281820 386340
13930 386340 553794 545676 603231 336383 532418 693356 613541 708047 711174 688782 740623
$$ packed form
14003A32199n5043j87973j72685J60696J09365P7562L1359L3913O3904M1238J28167
13992C62702j32795l1482K81047M90726K63887k55598m33043k74175J61698M19832
13982H52799l9884j57246O2161j37011j28878K9963j83146Q3878K27268K9549
13972F39453j35435j48708k08816J98633L38272j65577M9974k1520k38498K650
13962C10428N8282M7498K51167k33612n7605P3321k90108j16442O4521j29131
13952b1681j1901L4188K1860Q7361K01840q1513L4292J82874j56131j89008j6387
13941H5794K93895j2870m1806R7842Q0231L42801Q6299o2033m66342j21991J04520
13930C86340J67454q118N7555k66848J96035J60938p9815R4506L127k2392N1841
$$ plain form
13919 740623 974768 873107 608654 477726 158371 -176972 -76979 276366 408952 444941
13909 444941 672669 631241 311149 410594 729670 615612 436667 568761 535285 444344
13899 444344 241102 491853 725951 547256 627214 540890 515720 448037 425694 344482 352365
13888 352365 250944 427794 663573 524525 617031 664360 720570 788853 921970 952691
13878 952691 1085738 1130779 1095943 1521004 1727472 1587420 1450364 1534636 1382753 1479917
13868 1479917 1644364 1614971 1327557 1170738 1309794 1131404 909624 959379 897791 825118
13858 825118 1114687 1436634 1317544 979042 821951 879893 527218 341592 803609 972247
13848 972247 1208380 1203902 821572 716478 868778 943428 897199 1167192 1158817 675607 440123
$$ packed form
13919G40623K34145j01661k64453j30928l19355l35343R9993L53345J32586L5989
13909D44941K27728m1428l20092R9445L19076j14058j78945J32094l3476r0941
13899D44344k03242K50751K34098j78695P9958q6324k5170o7683k2343q1212P883
13888C52365j01421J76850K35779j39048R2506M7329N6210O8283J33117L0721
13878I52691J33047M5041l4836M25061K06468j40052j37056Q4272j51883R7164
13868A479917J64447k9393k87414j56819J39056j78390k21780M9755o1588p2673
13858H25118K89569L21947j19090l38502j57091N7942l52675j85626M62017J68638
13848I72247K36133m478l82330j05094J52300P4650m6229K69993q375m83210k35484
$$ plain form
13837 440123 551716 798007 1007796 1072720 928337 989986 1002889 1471557 1728180 1805902
13827 1805902 1802352 1936537 1660738 1439084 1328620 1559855 1704983 1738394 2039997 1854753
13817 1854753 1748613 1985484 2154411 2506246 2388083 2164482 2340529 2653967 2866196
13808 2866196 2948114 2999261 2894364 2398022 2364383 2359184 2223450 2635872 2729534 2606255
13798 2606255 2522056 2366242 2285411 2449969 2882057 2772802 2714334 2546286 2355284 1923684
13788 1923684 2010994 2140646 2238898 2404886 2378241 2567488 2981518 3022633 3354015 3670717
13778 3670717 3801325 3960388 4010455 4106064 4118422 4293803 4042669 4030925 3959811 4550892
13768 4550892 4911753 5027409 4983849 4797400 4425894 4326972 4646802 4858036 5035215 4949896
$$ packed form
13837D40123J11593K46291K09789O4924j44383O1649J2903M68668K56623P7722
13827A805902l550J34185k75799k21654j10464K31235J45128L3411L01603j85244
13817A854753j06140K36871J68927L51835j18163k23601J76047L13438K12229
13808B866196Q1918N1147j04897m96342l3639n199j35734M12422R3662j23279
13798B606255q4199j55814q0831J64558M32088j09255n8468j68048j91002m31600
13788A923684Q7310J29652R8252J65988k6645J89247M14030M1115L31382L16702
13778C670717J30608J59063N0067R5609J2358J75381k51134j1744p1114N91081
13768D550892L60861J15656m3560j86449l71506r8922L19830K11234J77179q5319
$$ plain form
13758 4949896 4748133 5227397 5471481 5493250 5384063 5459281 5861255 6663249 6703622 6528668
13748 6528668 6979973 7346893 8077045 8636798 9319102 9906730 10458252 11212118 11746551
13739 11746551 12655016 13492166 14538476 15678272 16917001 18534035 20427867 22710366
13731 22710366 24930131 27468368 30381329 34161053 38842978 43660085 49551557 57116573
13723 57116573 65610162 75977404 87846332 101313362 115904557 130454499 143170660
13716 143170660 152109471 157424650 159858954 159736190 157186256 151463814 142078542 129564496
13708 129564496 115587940 102359295 90298731 79502978 70976550 63580875 57604672
13701 57604672 52711212 48572693 45493791 43217280 41260495 39621705 38171675 37225602
$$ packed form
13758D949896k01763M79264K44084K1769j09187P5218M01974Q01994M0373j74954
13748F528668M51305L66920P30152N59753O82304N87628N51522P53866N34433
13739A1746551R08465Q37150J046310J139796J238729J617034J893832K282499
13731B2710366K219765K538237K912961L779724M681925M817107N891472P565016
13723E7116573Q493589J0367242J1868928J3467030J4591195J4549942J2716161
13716A43170660Q938811N315179K434304j22764k549934n722442r385272j2514046
13708A29564496j3976556j3228645j2060564j0795753q526428p395675n976203
13701E7604672m893460m138519l078902k276511j956785j638790j450030r46073
$$ plain form
13693 37225602 36806956 37172083 38023387 39394131 41016314 43045533 45718037 49485082
13685 49485082 53978182 59168284 65176485 72322273 81064515 91479439 104283633 120057664
13677 120057664 138360405 159269827 182105309 204656579 224128685 238267343 245595405
13670 245595405 244638991 235629844 219899339 199192306 175794916 152690520 131956476
13663 131956476 114136527 98846463 85931137 75453045 66488836 58739931 52167652
13656 52167652 46486732 41599301 37622854 34407390 31031401 28207940 25628535 23336772
13648 23336772 21625288 19696561 18090721 17019378 15650227 14103743 13217551 12789041
13640 12789041 12317259 11582276 10971623 10717893 10424003 10067743 9357598 8736835 8336598
$$ packed form
13693C7225602m18646L65127Q51304J370744J622183K029219K672504L767045
13685D9485082M493100N190102O008201P145788Q742242J0414924J2804194J5774031
13677A20057664J8302741K0909422K2835482K2551270J9472106J4138658P328062
13670B45595405r56414r009147j5730505k0707033k3397390k3104396k0734044
13663A31956476j7819949j5290064j2915326j0478092q964209p748905o572279
13656E2167652n680920m887431l976447l215464l375989k823461k579405k291763
13648B3336772j711484j928727j605840j071343j369151j546484q86192m28510
13640A2789041m71782p34983o10653k53730k93890l56260p10145o20763m00237
$$ plain form
13631 8336598 8021119 7963625 8003614 7563993 6963195 6492178 6092924 5944080 5576979 5362673
13621 5362673 5399102 5335733 5113781 4862981 4898175 4593125 4228825 4173609 4301602 4090791
13611 4090791 3989079 3954010 3571122 3409885 3466062 3543172 3480174 3447396 2989415 2832942
13601 2832942 2711946 2735055 2668752 2859954 3154113 3268921 3396677 3718932 3376245 2934729
13591 2934729 2866402 2916868 3003578 3140648 3072761 3005205 3067687 2820581 2438999 2295539
13581 2295539 2073596 2016951 2008743 2354326 2847940 3035544 3002971 2531451 2219003 1927429
13571 1927429 1893736 1551156 1258325 1446533 1504034 1646221 1633010 1304145 1165367 1287112
13561 1287112 1382465 1627566 1739720 1674113 1788259 1623756 1494742 1553352 1885365 2120088
$$ packed form
13631H336598l15479n7494L9989m39621o00798m71017l99254j48844l67101k14306
13621E362673L6429o3369k21952k50800L5194l05050l64300n5216J27993k10811
13611D090791j01712l5069l82888j61237N6177P7110o2998l2778m57981j56473
13601B832942j20996K3109o6303J91202K94159J14808J27756L22255l42687m41516
13591B934729o8327N0466Q6710J37070o7887o7556O2482k47106l81582j43460
13581B295539k21943n6645q208L45583M93614J87604l2573m71520l12448k91574
13571A927429l3693l42580k92831J88208N7501J42187j3211l28865j38778J21745
13561A287112R5353K45101J12154o5607J14146j64503j29014N8610L32013K34723
$$ plain form
13551 2120088 2299100 2250948 2154577 1986315 2019479 2271884 2354963 2144623 1978895 1897355
13541 1897355 1874317 1852632 1920633 1923387 1957059 1944468 1762180 1746562 1798418 1713177 1617125
13530 1617125 1762860 2091958 2541726 2676902 2808930 2804077 3046483 3432097 3612932 3511681
13520 3511681 3526013 3409823 3826206 4275363 4733820 4967820 5434556 6193411 6721647 7403455
13510 7403455 8040192 8858052 9793681 10938347 12478469 14376793 16462054 19037129 21969730
13501 21969730 25460114 29187743 33163485 37632832 42050354 46362739 50714022 54708775
13493 54708775 57920505 61035450 63035985 64141592 64045434 63052954 61308782 58619827
13485 58619827 55310362 51320995 46603472 42112551 37992615 34405555 30775246 27591037
$$ packed form
13551B120088J79012m8152r6371j68262L3164K52405Q3079k10340j65728q1540
13541A897355k3038k1685O8001K754L3672j2591j82288j5618N1856q5241r6052
13530A617125J45735L29098M49768J35176J32028m853K42406L85614J80835j01251
13520C511681J4332j16190M16383M49157M58457K34000M66736P58855N28236O81808
13510G403455O36737Q17860R35629J144666J540122J898324K085261K575075K932601
13501B1969730L490384L727629L975742M469347M417522M312385M351283L994753
13493E4708775L211730L114945K000535J105607r6158r92480j744172k688955
13485E8619827l309465l989367m717523m490921m119936l587060l630309l184209
$$ plain form
13477 27591037 24988346 22661937 20742471 19210516 18273828 17673064 17205230 17185510 16887688
13468 16887688 16647815 16903011 17637439 19060973 21334704 24050244 27245075 30687726
13460 30687726 34840976 39876301 45440435 51663372 58192290 64620547 70598175 76236944
13452 76236944 81263607 85213132 87918887 89480426 90230838 89582776 87315463 84316421
13444 84316421 80419160 75792195 70406865 64657937 59344980 54005790 48766277 43295098
13436 43295098 38585836 34329214 30738098 27235058 24318072 21931806 20084674 18133452
13428 18133452 16645223 15645455 14747541 14060125 13516196 12913797 12793637 12992922 13072356
13419 13072356 13409098 13955688 14766788 16014144 17929549 19698881 21443748 23468747
$$ packed form
13477B7591037k602691k326409j919466j531955r36688o00764m67834j9720k97822
13468A6887688k39873K55196P34428J423534K273731K715540L194831L442651
13460C0687726M153250N035325N564134O222937O528918O428257N977628N638769
13452G6236944N026663L949525K705755J561539P50412o48062k267313k999042
13444H4316421l897261m626965n385330n748928n312957n339190n239513n471179
13436D3295098m709262m256622l591116l503040k916986k386266j847132j951222
13428A8133452j488229r99768q97914o87416n43929o02399j20160J99285P9434
13419A3072356L36742N46590Q11100J247356J915405J769332J744867K024999
$$ plain form
13411 23468747 25353400 27467021 29032659 30458713 31976392 32947924 33248833 32739676
13403 32739676 32124519 30970329 29276183 27511578 25528019 23033496 20715794 18605098
13395 18605098 16286098 14067264 12173565 10479869 8953406 7898902 7145099 6448022
13387 6448022 5222962 4446914 3846896 3518904 3348398 3209858 3166941 2978291 2819666
13378 2819666 2661361 2739116 2571911 2403200 1914362 1570831 1669293 1711372 1423549 1629813
13368 1629813 1345271 900301 727269 901664 1238559 1140910 815406 896718 1124249 1376541
13358 1376541 1396443 1296880 1147704 1410426 1134013 667715 394405 524876 566053 545943
13348 545943 667274 1136713 1128386 1209045 974724 1155927 1275539 955930 803295 676867
$$ packed form
13411B3468747J884653K113621J565638J426054J517679R71532L00909n09157
13403C2739676o15157j154190j694146j764605j983559k494523k317702k110696
13395A8605098k319000k218834j893699j693696j526463j054504p53803o97077
13387F448022j225060p76048o00018l27992j70506j38540m2917j88650j58625
13378B819666j58305P7755j67205j68711m88838l43531R8462M2079k87823K06264
13368A629813k84542m44970j73032J74395L36895r7649l25504Q1312K27531K52292
13358A376541J9902r9563j49176K62722k76413m66298k73310J30471M1177k0110
13348E45943J21331M69439q327Q0659k34321J81203J19612l19609j52635j26428
$$ plain form
13338 676867 780230 710572 672973 604934 462268 193104 250621 411735 498863 293398
13328 293398 417431 489958 361416 500134 503399 750538 953606 452628 299937 523401
13318 523401 627727 502708 283163 513064 603697 699375 636498 597012 370286 363207 392061
13307 392061 189200 289033 426364 664047 570178 509183 379545 343561 32338 -330265
13297 -330265 -236509 -45321 -359950 -95883 87859 -108187 325916 520583 558285 664846
13287 664846 623168 561504 309197 313099 318221 -61594 -396972 -123431 -38929 -163322 -252396
13276 -252396 5865 244252 250016 31904 -98397 -49792 221508 288140 255477 390074
13266 390074 948586 1284702 842124 366999 155787 428703 769379 1028230 1019223 643168
$$ packed form
13338F76867J03363o9658l7599o8039j42666k69164N7517J61114Q7128k05465
13328B93398J24033P2527j28542J38718L265K47139K03068n00978j52691K23464
13318E23401J04326j25019k19545K29901R0633R5678o2877l9486k26726p079K8854
13307C92061k02861R9833J37331K37683r3869o0995j29638l5984l11223l62603
13297c30265R3756J91188l14629K64067J83742j96046M34103J94667L7702J06561
13287F64846m1678o1664k52307L902N122l79815l35378K73541Q4502j24393q9074
13276b52396K58261K38387N764k18112j30301M8605K71300O6632l2663J34597
13266C90074N58512L36116m42578m75125k11212K72916L40676K58851r007l76055
$$ plain form
13256 643168 630079 413783 199915 257155 251389 455078 415445 509250 414371 610927 485042
13245 485042 400055 399883 463555 428643 385104 556179 721310 831502 1037745 1393748 1561606
13234 1561606 1358566 1316512 1153673 1138905 1010058 943568 1204592 1271850 1260756 975097
13224 975097 831093 733822 683732 510836 360740 103056 -8830 295032 311989 467290
13214 467290 366988 384205 368673 460952 579511 311119 191657 334231 487765 454597
13204 454597 552065 542750 598856 313036 262940 390868 697393 596979 375305 133150
13194 133150 19815 315357 781519 1030966 967276 1228565 945439 818854 852746 620608
13184 620608 155762 172922 -19593 -32551 207991 132981 238943 697897 692732 368398
$$ packed form
13256F43168j3089k16296k13868N7240n766K03689l9633R3805r4879J96556j25885
13245D85042q4987j72O3672l4912m3539J71075J65131J10192K06243L56003J67858
13234A561606k03040m2054j62839j4768j28847o6490K61024O7258j1094k85659
13224I75097j44004r7271n0090j72896j50096k57684j11886L03862J6957J55301
13214D67290j00302J7217j5532R2279J18559k68392j19462J42574J53534l3168
13204D54597R7468r315N6106k85820n0096J27928L06525j00414k21674k42155
13194A33150j13335K95542M66162K49447o3690K61289k83126j26585L3892k32138
13184F20608m64846J7160j92515j2958K40542p5010J05962M58954n165l24334
$$ plain form
13174 368398 601088 582480 210659 306905 123035 85543 68636 -6941 -302339 -169586
13164 -169586 287288 387766 353018 534381 743421 628480 623098 488402 687124 1199041
13154 1199041 1208798 1111866 874427 728346 479832 401634 459764 211547 246469 258990 159575
13143 159575 161389 98072 221471 106871 189533 -35542 34298 383261 453942 253327 61676
13132 61676 304256 355591 375603 214047 239819 56101 -132863 -346348 -109863 18197
13122 18197 -277 161765 277057 -19349 11642 -52593 -107437 -377972 -624895 -447290
13112 -447290 -332883 -166224 -131998 225262 178629 -33170 -41913 -262648 -599985 -634564
13102 -634564 -157174 260462 200689 145807 227067 299385 263632 190487 -11904 -63539 -97853
$$ packed form
13174C68398K32690j8608l71821R6246j83870l7492j6907p5577k95398J32753
13164a69586M56874J00478l4748J81363K09040j14941n382j34696J98722N11917
13154A199041R757r6932k37439j46081k48514p8198N8130k48217L4922J2521r9415
13143A59575J814o3317J23399j14600Q2662k25075O9840L48963P0681k00615j91651
13132F1676K42580N1335K0012j61556K5772j83718j88964k13485K36485J28060
13122A8197j8474J62042J15292k96406L0991o4235n4844k70535k46923J77605
13112d47290J14407J66659L4226L57260m6633k11799q743k20735l37337l4579
13102f34564M77390M17636n9773n4882Q1260P2318l5753p3145k02391n1635l4314
$$ plain form
13091 -97853 -225229 -387242 -187568 133772 475606 309963 -107132 -325738 -71618 348794
13081 348794 606965 878084 640093 492292 612599 695867 482090 392364 407709 426234
13071 426234 414306 295529 653559 612371 243647 49415 -71850 68874 190772 -198998
13061 -198998 -341091 -235816 -135121 108973 -112513 1932 87829 203975 111551 -116065
13051 -116065 -179091 44230 215562 129296 -55150 -24871 91800 102643 328244 491137
13041 491137 534868 447035 357287 402664 512920 278940 190880 616832 1096307 826851
13031 826851 573306 581167 350804 532951 806160 690620 526766 259306 -104413 -74621
13021 -74621 195195 520842 516650 427405 488516 616708 355929 269545 -131793 -210315 -310357
$$ packed form
13091i7853j27376j62013J99674L21340L41834j65643m17095k18606K54120M20412
13081C48794K58171K71119k37991j47801J20307Q3268k13777q9726J5345J8525
13071D26234j1928j18777L58030m1188l68724j94232j21265J40724J21898l89770
13061a98998j42093J05275J00695K44094k21486J14445Q5897J16146r2424k27616
13051a16065o3026K23321J71332q6266j84446L0279J16671J0843K25601J62893
13041D91137M3731q7833q9748M5377J10256k33980q8060M25952M79475k69456
13031H26851k53545P861k30363J82147K73209j15540j63854k67460l63719K9792
13021g4621K69816L25647m192q9245O1111J28192k60779q6384m01338p8522j00042
$$ plain form
13010 -310357 -210204 100464 443017 628140 939561 862374 507066 382513 207610 60210
13000 60210 -359702 -269805 99276 350829 93841 36303 42398 8257 42051 335068 343992
12989 343992 475896 738364 601680 313926 333554 403430 695242 522872 323412 97152
12979 97152 -80889 -266088 -188547 35793 173120 -250301 -81155 249259 485156 606291
12969 606291 510789 142765 -106328 -100736 -271557 -430818 -340419 38820 501988 682337
12959 682337 713893 646472 725228 455229 219883 -93875 -106858 191328 248238 218425 181253
12948 181253 204227 380142 429084 554994 595313 351331 425917 647455 527716 285466
12938 285466 282352 124128 -28544 -322346 -375221 -175669 -266281 -105676 48845 251909
$$ packed form
13010c10357J00153L10668L42553J85123L11421p7187l55308j24553j74903j47400
13000F0210m19912Q9897L69081K51553k56988n7538O095l4141L3794K93017Q924
12989C43992J31904K62468j36684k87754J9628O9876K91812j72370j99460k26260
12979I7152j78041j85199P7541K24340J37327m23421J69146L30414K35897J21135
12969F06291r5502l68024k49093N592j70821j59261R0399L79239M63168J80349
12959F82337L1556o7421P8756k69999k35346l13758j2983K98186N6910k9813l7172
12948A81253K2974J75915M8942J25910M0319k43982P4586K21538j19739k42250
12938B85466l114j58224j52672k93802n2875J99552r0612J60605J54521K03064
$$ plain form
12928 251909 137368 8240 -300842 -162576 100229 324042 401159 199290 189955 415345
12918 415345 377340 545440 370597 214009 260367 177000 299895 183120 168883 376126
12908 376126 789118 415354 93488 96115 133515 165544 395370 267903 -10403 -343920
12898 -343920 -446762 -56844 -80726 -333756 -250991 -56540 30955 -147814 -355661 -411899
12888 -411899 -59761 285297 152350 239898 52603 -144574 -278398 -71521 -41034 -223278
12878 -223278 -177245 -54021 -401646 -220741 -191614 -265003 -397846 -139761 248800 436681
12868 436681 180198 90104 38260 123550 244283 586604 845030 596923 201345 432193
12858 432193 283448 420666 384306 149040 158281 243786 421270 456976 359734 307466 220857
$$ packed form
12928B51909j14541j29128l09082J38266K62805K23813P7117k01869r335K25390
12918D15345l8005J68100j74843j56588M6358q3367J22895j16775j4237K07243
12908C76126M12992l73764l21866K627L7400L2029K29826j27467k78306l33517
12898c43920j02842L89918k3882k53030Q2765J94451Q7495j78769k07847n6238
12888d11899L52138L45058j32947Q7548j87295j97177j33824K06877L0487j82244
12878b23278M6033J23224l47625J80905K9127p3389j32843K58085L88561J87881
12868D36681k56483r0094n1844Q5290J20733L42321K58426k48107l95578K30848
12858D32193j48745J37218l6360k35266R241Q5505J77484L5706r7242n2268q6609
$$ plain form
12847 220857 205760 13741 -189093 -103747 99454 119461 208755 407209 333500 1044
12837 1044 -218690 -70108 139502 275212 639571 619757 151232 61957 65566 66182 110598
12826 110598 143818 -28762 -135253 222236 171786 1708 -185364 -171850 -97701 -7165
12816 -7165 48971 34583 -182349 -345688 -408654 -205543 -120215 143690 83145 -110544 -76955
12805 -76955 11090 38721 39691 -7200 -134552 94489 271294 337353 350734 316096 219663
12794 219663 102376 95707 145998 282065 301316 424582 429823 274010 179077 368491 423148
12783 423148 29826 71551 209121 -77215 -198712 -36691 187341 76921 -68641 -152509
12773 -152509 21861 303094 220417 14723 -27361 120106 175598 19758 40279 94615
$$ packed form
12847B20857j5097j92019k02834Q5346K03201K0007Q9294J98454p3709l32456
12837A044k19734J48582K09610J35710L64359j9814m68525q9275L609O16M4416
12826A10598L3220j72580j06491L57489n0450j70078j87072J3514P4149R0536
12816g165N6136j4388k16932j63339o2966K03111Q5328K63905o0545j93689L3589
12805g6955Q8045K7631R70m6891j27352K29041J76805O6059J3381l4638r6433
12794B19663j17287o669N0291J36067J9251J23266N241j55813r4933J89414N4657
12783D23148l93322M1725J37570k86336j21497J62021K24032j10420j45562q3868
12773a52509J74370K81233q2677k05694m2084J47467N5492j55840K0521N4336
$$ plain form
12763 94615 44568 356349 316991 -135343 -453710 -305427 -263096 -225602 -228648 -119843 -134268
12752 -134268 -423390 -698521 -391930 76556 449404 317085 -50070 -45687 80738 442615
12742 442615 740063 490111 293622 362213 461083 251306 -9361 93864 48470 17435
12732 17435 -74608 -305792 -266875 -26856 -20806 -163611 -117962 -93318 -119951 -102509 -49493
12721 -49493 173663 8726 43549 -121151 -530294 -642472 -520067 -499225 -403545 -420569
12711 -420569 -490320 -346718 -40699 388353 523521 -54495 -281084 -340400 -441605 -396839
12701 -396839 -342101 -159875 -361384 -136973 26384 35683 -58178 137265 234709 155829 197785
12690 197785 -214127 -466854 -349593 -359262 16952 320234 276606 666713 524584 40489
$$ packed form
12763I4615n0047L11781l9358m52334l18367J48283M2331L7494l046J08805j4425
12752a34268k89122k75131L06591M68486L72848j32319l67155M383J26425L61877
12742D42615K97448k49952j96489O8591R8870k09777k60667J03225m5394l1035
12732A7435r2043k31184L8917K40019O050j42805M5649K4644k6633J7442N3016
12721d9493K23156j64937L4823j64700m09143j12178J22405K0842R5680j7024
12711d20569o9751J43602L06019M29052J35168n78016k26589n9316j01205M4766
12701c96839N4738J82226k01509K24411J63357R299r3861J95443R7444p8880M1956
12690A97785m11912k52727J17261r669L76214L03282m3628L90107j42129m84095
$$ plain form
12680 40489 -103331 -124488 137832 112176 149137 -13588 139111 230251 -146822 -106199 220117
12669 220117 532423 499922 460932 528381 386627 255489 359401 414451 347224 331940 -9768
12658 -9768 225070 381495 227677 42059 -275592 -264886 -248394 -163196 -158204 -229072 9483
12647 9483 98905 -90340 7201 -37000 88201 104263 150648 243744 259317 264999 392703
12636 392703 236616 15190 -205155 -290448 25216 149264 108212 216032 415735 470094
12626 470094 200312 -157993 8385 218248 310822 -80229 -13715 283493 223303 -84561
12616 -84561 90384 132518 252117 532837 556131 351729 -108993 15427 203981 -87986
12606 -87986 -245787 -211671 -51745 -195970 -534860 -587001 -554565 -344360 -5264 207277
$$ packed form
12680D0489j43820k1157K62320k5656L6961j62725J52699R1140l77073M0623L26316
12669B20117L12306l2501l8990O7449j41754j31138J03912N5050o7227j5284l41708
12658i768K34838J56425j53818j85618l17651J0706J6492Q5198M992p0868K38555
12647I483Q9422j89245R7541m4201J25201J6062M6385R3096J5573N682J27704
12636C92703j56087k21426k20345q5293L15664J24048m1052J07820J99703N4359
12626D70094k69782l58305J66378K09863R2574l91051O6514K97208o0190l07864
12616h4561J74945M2134J19599K80720K3294k04402m60722J24420J88554k91967
12606h7986j57801L4116J59926j44225l38890n2141L2436K10205L39096K12541
$$ plain form
12596 207277 437216 346982 170258 161609 214170 386886 489528 94519 -221090 -103283
12586 -103283 -88980 65996 339776 188447 221422 466596 421830 210837 -261232 -179002
12576 -179002 220951 667293 970374 706289 288796 -111339 -45153 -211438 -68394 90507
12566 90507 -24023 315646 414430 517169 119407 170108 176565 -125206 -108818 13473 495455
12555 495455 475993 168616 45250 -4862 5885 -160121 -185659 139089 -17759 -181431
12545 -181431 210682 589465 775188 656755 75678 8587 -80166 -164477 -57100 68438
12535 68438 302720 382832 218986 128749 -121193 -283492 -326922 -174946 -28537 179910
12525 179910 178218 177074 239689 14323 43908 276033 334735 86707 -146756 -147374 -102406
$$ packed form
12596B07277K29939r0234j76724q649N2561J72716J02642l95009l15609J17807
12586a03283J4303J54976K73780j51329L2975K45174m4766k10993m72069Q2230
12576a79002L99953M46342L03081k64085m17493m00135O6186j66285J43044J58901
12566I0507j14530L39669R8784J02739l97762N0701O457l01771J6388J22291M81982
12555D95455j9462l07377j23366n0112J0747j66006k5538L24748j56848j63672
12545a81431L92113L78783J85723j18433n81077o7091q8753q4311J07377J25538
12535F8438K34282Q0112j63846r0237k49942j62299m3430J51976J46409K08447
12525A79910j692j144O2615k25366K9585K32125N8702k48028k33463o18M4968
$$ plain form
12514 -102406 -52898 65666 -1059 -59819 -146546 -293929 -81534 88441 28828 -59612 -65321
12503 -65321 -213016 -323878 -238288 -151161 19844 53597 -72151 -113448 -311353 -270444 -334142
12492 -334142 -27489 371786 316443 -43659 59109 234120 127404 64500 -137157 14933
12482 14933 53590 -156615 -90893 -6596 165154 473746 456730 536118 483436 307224 203276
12471 203276 -28667 238525 389948 284132 174449 153769 241633 320149 300047 361948
12461 361948 23919 447 -62859 -292205 -445883 -785530 -462162 -516084 -310051 -151747
12451 -151747 -61279 -13149 -101912 -87821 -6594 343816 508060 207075 -143309 -110347 133473
12440 133473 282034 530026 545237 737945 701553 305369 250048 465116 345410 32960
$$ packed form
12514a02406M9508J18564o6725n8760q6727j47383K12395J69975n9613q8440n709
12503f5321j47695j10862Q5590Q7127J71005L3753j25748m1297j97905M0909o3698
12492c34142L06653L99275n5343l60102J02768J75011j06716o2904k01657J52090
12482A4933L8657k10205O5722Q4297J71750L08592j7016P9388n2682j76212j03948
12471B03276k31943K67192J51423j05816j09683k0680Q7864P8516k0102O1901
12461C61948l38029k3472o3306k29346j53678l39647L23368n3922K06033J58304
12451a51747R0468M8130q8763J4091Q1227L50410J64244l00985l50384L2962K43820
12440A33473J48561K47992J5211J92708l6392l96184n5321K15068j19706l12450
$$ plain form
12430 32960 -69242 146900 506077 641416 421592 304937 273262 223571 163343 -305876
12420 -305876 -274805 -237845 -445869 -562479 -580051 -499572 -464764 -85560 227284 -41014
12410 -41014 58488 185627 357033 314767 646452 825634 28614 -184222 -217157 -643121
12400 -643121 -707148 -315128 -175041 -171897 -398855 -745542 -563731 -485277 -606466 -578821
12390 -578821 76914 473974 555539 525959 658282 690178 626095 362330 -227204 -276177
12380 -276177 -242627 230245 117292 -16018 -43527 -38130 -117729 8418 133460 30249
12370 30249 149190 31257 -245645 -385532 1678 -103671 -134849 -96073 227368 104087
12360 104087 -114090 -271277 -193703 286998 405596 349053 87800 -161684 -124299 91890
$$ packed form
12430C2960j02202K16142L59177J35339k19824j16655l1675m9691o0228m69219
12420c05876L1071L6960k08024j16610j7572Q0479L4808L79204L12844k68298
12410d1014R9502J27139J71406m2266L31685J79182p97020k12836l2935m25964
12400f43121o4027L92020J40087L144k26958l46687J81811P8454j21189K7645
12390e78821O55735L97060Q1565k9580J32323L1896o4083k63765n89534m8973
12380b76177L3550M72872j12953j33310k7509N397p9599J26147J25042j03211
12370C0249J18941j17933k76902j39887L87210j05349l1178L8776L23441j23281
12360A04087k18177j57187P7574M80701J18598n6543k61253k49484L7385K16189
$$ plain form
12350 91890 200652 -39772 -232706 -623371 -266881 -37271 -162247 -272076 -96120 -231945
12340 -231945 -217605 -378072 33368 395842 501594 317761 -96932 62454 213294 -30686
12330 -30686 -63508 -40193 268074 523572 693812 528028 487636 442610 318243 60859
12320 60859 26283 296949 310263 543602 695606 546510 116504 -22410 -211946 -93295
12310 -93295 -36575 75670 545832 645399 424896 657727 483095 161838 200142 247250
12300 247250 261317 394241 260896 409196 596116 474795 410977 478729 496577 317956
12290 317956 127662 187676 148219 276984 697529 1134185 1534691 2217851 3059618 3974815
12280 3974815 5211446 7967921 13348584 23181165 36342442 40236903 31200322 17915115
$$ packed form
12350I1890J08762k40424j92934l90665L56490K29610j24976j09829J75956j35825
12340b31945J4340j60467M11440L62474J05752j83833m14693J59386J50840k43980
12330c0686l2822K3315L08267K55498J70240j65784m0392m5026j24367k57384
12320F0859l4576K70666J3314K33339J52004j49096m30006j38914j89536J18651
12310i3295N6720J12245M70162R9567k20503K32831j74632l21257L8304M7108
12300B47250J4067J32924j33345J48300J86920j21321o3818O7752J7848j78621
12290C17956j90294O0014l9457J28765M20545M36656M00506O83160Q41767R15197
12280C974815J236631K756475N380663R832581J3161277L894461r036581j3285207
$$ plain form
12272 17915115 10504146 7303686 5541742 4107579 3111400 2353673 1835875 1552502 1275100
12263 1275100 1258434 840989 784414 745588 612940 523603 412852 540590 522968 272965
12253 272965 466649 318819 217731 259678 277999 425810 272232 267072 496442 433639
12243 433639 420805 597256 524911 384252 441567 706275 662855 770828 536564 134448
12233 134448 -128035 192168 371817 558779 699064 828864 602659 212975 310065 525096
12223 525096 256351 -91555 -77713 31585 -217268 -458034 -317370 -45448 268546 604358
12213 604358 661121 648308 743551 409253 263195 70171 72243 184583 231631 223036 205290
12202 205290 442790 405793 359099 248770 -48503 228553 270509 22877 -28405 324180
$$ packed form
12272A7915115p410969l200460j761944j434163r96179p57727n17798k83373k77402
12263A275100j6666m17445n6575l8826j32648q9337j10751J27738j7622k50003
12253B72965J93684j47830j01088M1947J8321J47811j53578n160K29370o2803
12243D33639j2834J76451p2345j40659N7315K64708m3420J07973k34264m02116
12233A34448k62483L20203J79649J86962J40285J29800k26205l89684R7090K15031
12223E25096k68745l47906J3842J09298k48853k40766J40664K71922L13994L35812
12213F04358N6763j2813R5243l34298j46058j93024K072J12340M7048q595j7746
12202B05290K37500l6997m6694j10329k97273K77056M1956k47632n1282L52585
$$ plain form
12192 324180 240615 56728 -69 83333 46810 75276 -42473 -136961 93173 154711 406661
12181 406661 646717 556623 275619 555488 699383 688331 714666 811032 327386 130683
12171 130683 392476 569315 697069 605141 346686 409741 626381 628897 861815 1161581
12161 1161581 1093971 973396 889907 787310 696718 762967 998492 949564 1052227 1257932
12151 1257932 964355 517039 603127 839478 712789 348297 391954 306134 369891 531605
12141 531605 582072 484920 700086 727829 791892 682631 450758 421773 781568 809060 700808
12130 700808 754848 679041 449212 637494 859229 819902 764112 246698 24429 452063
12120 452063 832780 1005677 1230067 1428654 788687 487721 566561 402725 343643 229929
$$ packed form
12192C24180q3565j83887n6797Q3402l6523K8466j17749r4488K30134O1538K51950
12181D06661K40056r0094k81004K79869J43895j1052K6335R6366m83646j96703
12171A30683K61793J76839J27754r1928k58455O3055K16640K516K32918K99766
12161A161581o7610j20575q3489j02597r0592O6249K35525m8928J02663K05705
12151A257932k93577m47316Q6088K36351j26689l64492M3657q5820O3757J61714
12141E31605N0467r7152K15166K7743O4063j09261k31873k8985L59795K7492j08252
12130G00808N4040p5807k29829J88282K21735l9327n5790n17414k22269M27634
12120D52063L80717J72897K24390J98587o39967l00966P8840j63836n9082j13714
$$ plain form
12110 229929 429382 489147 390787 216184 238359 531115 670024 541922 394159 405298
12100 405298 447202 617321 507344 455228 657065 558032 943326 1043550 816366 513142
12090 513142 290990 191160 197803 338860 644500 791383 751773 556101 476859 444739 567906
12079 567906 747218 820602 790556 870910 957417 984657 1019088 1292960 1362250 1210536 1288331
12068 1288331 1132481 921484 644538 626923 824543 890365 624808 672258 864332 978073
12058 978073 1295079 1472685 1407947 1379697 1427148 1502367 1849579 1766823 1338659 1102333
12048 1102333 885936 1200445 1657000 1712412 1668344 1641137 1775460 1911581 2057269 2028646
12038 2028646 1754899 1581817 1535897 1660270 1807082 2494560 2547848 2153439 2161063 2339641
$$ packed form
12110B29929J99453N9765r8360j74603K2175K92756J38909j28102j47763J1139
12100D05298M1904J70119j09977n2116K01837r9033L85294J00224k27184l03224
12090E13142k22152r9830O643J41057L05640J46883l9610j95672p9242l2120J23167
12079E67906J79312P3384l0046Q0354Q6507K7240L4431K73872O9290j51714P7795
12068A288331j55850k10997k76946j7615J97620O5822k65557M7450J92074J13741
12058I78073L17006J77606o4738k8250M7451P5219L47212q2756m28164k36326
12048A102333k16397L14509M56555N5412m4068k7207J34323J36121J45688k8623
12038B028646k73747j73082m5920J24373J46812O87478N3288l94409P624J78578
$$ plain form
12028 2339641 2341567 2522493 2264131 1852455 1713453 1973744 2361837 2337412 2527735 2712979
12018 2712979 2549272 2084952 2186222 2450624 2391190 2407000 2357215 2442530 2688226 2547339
12008 2547339 2517935 2829336 2944727 2877367 3126186 3137250 3104401 3096545 3187879 3064627 3095915
11997 3095915 3505151 3679317 3905844 3963678 4036197 4253571 4322263 4317715 4297771 4542793
11987 4542793 5077754 5234691 5476796 5570816 5639246 6141211 6460132 6536268 6790799 6885434
11977 6885434 6749807 6885498 7389750 7644917 7753687 7991426 8151231 8390055 9006423
11968 9006423 9579051 10100686 10367584 10807230 11379917 12171937 12752815 13141058 13537954
11959 13537954 13880576 14413364 15538326 16341196 17035837 18001520 19077925 20167559 21207612
$$ packed form
12028B339641J926J80926k58362m11676j39002K60291L88093k4425J90323J85244
12018B712979j63707m64320J01270K64402n9434J5810m9785Q5315K45696j40887
12008B547339k9404L11401J15391o7360K48819J1064l2849p856R1334j23252L1288
11997C095915M09236J74166K26527N7834P2519K17374O8692m548j9944K45022
11987D542793N34961J56937K42105R4020O8430N01965L18921P6136K54531R4635
11977F885434j35627J35691N04252K55167J08770K37739J59805K38824O16368
11968I006423N72628N21635K66898M39646N72687P92020N80878L88243L96896
11959A3537954L42622N32788J124962Q02870O94641R65683J076405J089634J040053
$$ plain form
11950 21207612 22346767 23826299 25662447 27383544 29071100 31211534 33389012 35530674
11942 35530674 38279361 41496195 45112819 49000431 53367995 58234212 64231496 71069541
11934 71069541 78380338 86567212 95523371 106157125 118325494 132248835 147743471
11927 147743471 165358859 185702301 208421407 232753291 257915636 283168039 306311213
11920 306311213 325787441 338889116 344332089 341353301 330412789 313171857 291664501
11913 291664501 267656868 243115784 219293484 196939966 176022726 157683063 141675888
11906 141675888 127565264 114861163 103825614 93926190 85103347 77636874 70930119
11899 70930119 64772797 59521750 54861645 50902012 47338649 43879366 40318876 37363244
$$ packed form
11950B1207612J139155J479532J836148J721097J687556K140434K177478K141662
11942C5530674K748687L216834L616624L887612M367564M866217N997284O838045
11934G1069541P310797Q186874Q956159J0633754J2168369J3923341J5494636
11927A47743471J7615388K0343442K2719106K4331884K5162345K5252403K3143174
11920C06311213J9476228J3101675N442973k978788j0940512j7240932k1507356
11913B91664501k4007633k4541084k3822300k2353518k0917240j8339663j6007175
11906A41675888j4110624j2704101j1035549r899424q822843p466473o706755
11899G0930119o157322n251047m660105l959633l563363l459283l560490k955632
$$ plain form
11891 37363244 35087295 32779639 30846512 29377065 27913612 26317035 24706984 23520938
11883 23520938 22424807 21537079 20743137 19821722 18904423 17843519 17146065 16271047 15299660
11874 15299660 14817766 14400918 13800691 13252047 12703165 12049322 11417471 11117426 10928609
11865 10928609 10425542 9577481 9156708 9111611 9041661 8841989 8343640 7873931 7348562 7110077
11855 7110077 7006510 6893922 6727551 6331206 6057148 5996927 6174710 6157542 5661097 5703770
11845 5703770 5439515 5220670 4998268 4982367 4985782 5234294 5163590 4784851 4599876 4655639
11835 4655639 4203483 3929282 3746975 4109405 4406785 4355906 4376169 4113323 3870640 4206337
11825 4206337 4533222 4191257 3811358 3531270 3321138 3108073 3078935 3087790 3215918 3283130
$$ packed form
11891C7363244k275949k307656j933127j469447j463453j596577j610051j186046
11883B3520938j096131q87728p93942r21415r17299j060904o97454q75018r71387
11874A5299660m81894m16848o00227n48644n48882o53843o31851l00045j88817
11865A0928609n03067q48061m20773m5097o9950j99672m98349m69709n25369k38485
11855G110077j03567j12588j66371l96345k74058o0221J77783j7168m96445M2673
11845E703770k64255k18845k22402j5901L415K48512p0704l78739j84975N5763
11835D655639m52156k74201j82307L62430K97380n0879K0263k62846k42683L35697
11825D206337L26885l41965l79899k80088k10132k13065k9138Q855J28128O7212
$$ plain form
11815 3283130 3210244 3116822 2872511 2468069 2363647 2543241 2650301 2795623 2692158 2676773
11805 2676773 2777109 2371424 2037634 1785455 1547962 1736751 1961634 2090605 2249830
11796 2249830 1992112 1698567 1807361 1624799 1662277 1847692 2032259 2137518 1940141 2164221
11786 2164221 2303854 1867793 1321393 1160023 1262451 1603536 1456850 1475786 1444837 1572469
11776 1572469 1620541 1602481 1237549 1376965 1732769 1878662 1684591 960997 692665 573106
11766 573106 786456 1281495 1357292 1127964 1025139 1102116 1198901 980915 920886 850616
11756 850616 835671 872539 826925 698963 678607 825988 937356 860771 878367 1142117 1105327
11745 1105327 1389565 1319233 1154804 1324999 1304166 1113510 725537 543046 620567 817683
$$ packed form
11815C283130p2886r3422k44311m04442j04422J79594J07060J45322j03465j5385
11805B676773J00336m05685l33790k52179k37493J88789K24883J28971J59225
11796B249830k57718k93545J08794j82562L7478J85415J84567J05259j97377K24080
11786B164221J39633m36061n46400j61370J02428L41085j46686J8936l0949J27632
11776A572469M8072j8060l64932J39416L55804J45893j94071p23594k68332j19559
11766E73106K13350M95039P5797k29328j02825P6977R6785k17986o0029p0270
11756H50616j4945L6868m5614j27962k0356J47381J11368p6585J7596K63750l6790
11745A105327K84238p0332j64429J70195k0833j90656l87973j82491P7521J97116
$$ plain form
11735 817683 1146080 1591022 1227856 1018617 1016756 918910 776436 208157 47591 390905
11725 390905 844126 993113 835470 672134 524961 497364 299398 391164 500147 556982
11715 556982 671312 952942 915417 679846 650171 719142 422604 202344 276339 334807
11705 334807 223611 280533 455495 666244 463773 182479 392438 699893 782983 565855
11695 565855 701610 502742 414250 513163 918617 1324893 1214777 921766 676139 430903
11685 430903 460768 496119 497823 552912 481502 434332 574456 281740 -5336 277809 559943
11674 559943 761863 559690 756430 891698 614972 403086 567221 673558 502873 260834
11664 260834 117454 217274 517863 561029 527277 267344 36279 108049 453933 1042427
$$ packed form
11735H17683L28397M44942l63166k09239j861r7846j42474n68279j60566L43314
11725C90905M53221J48987j57643j63336j47173k7597j97966R1766J08983N6835
11715E56982J14330K81630l7525k35571k9675O8971k96538k20260P3995N8468
11705C34807j11196N6922J74962K10749k02471k81294K09959L07455Q3090k17128
11695E65855J35755j98868q8492R8913M05454M06276j10116k93011k45627k45236
11685D30903K9865L5351J704N5089p1410m7170J40124k92716k87076K83145K82134
11674E59943K01920k02173J96740J35268k76726k11886J64135J06337j70685k42039
11664B60834j43380R9820L00589M3166l3752k59933k31065P1770L45884N88494
$$ plain form
11654 1042427 1493149 1500787 1303017 993217 648186 556454 876520 956451 552061 239248
11644 239248 430270 529472 597377 726155 420389 257160 370679 271148 229138 46517
11634 46517 83072 31814 -29289 147112 442666 397006 194167 173635 -93679 -34411 219833
11623 219833 191087 160325 87845 223102 500957 612042 535374 253960 522575 773209
11613 773209 847800 777290 736641 824141 672087 488186 181358 185976 -265973 -527130 -303544
11602 -303544 -421215 -507932 -161218 -16517 -110260 221848 554899 763494 725585 449835
11592 449835 298538 425919 489491 296109 227044 -98613 -289460 -46873 -98859 -6347
11582 -6347 93980 205516 -7127 -143950 -29171 142154 497640 503963 350152 171505
$$ packed form
11654A042427M50722P638j97770l09800l45031r1732L20066P9931m04390l12813
11644B39248J91022R9202O7905J28778l05766j63229J13519r9531m2010j82621
11634D6517L6555n1258o1103J76401K95554m5660k02839k0532k67314N9268K54244
11623B19833k8746l0762p2480J35257K77855J11085p6668k81414K68615K50634
11613G73209P4591p0510m0649Q7500j52054j83901l06828M618m51949k61157K23586
11602c03544j17671q6717L46714J44701r3743L32108L33051K08595l7909k75750
11592D49835j51297J27381O3572j93382o9065l25657j90847K42587n1986R2512
11582f347J00327J11536k12643j36823J14779J71325L55486O323j53811j78647
$$ plain form
11572 171505 -55282 -240014 -265599 -234048 45451 608309 369820 -193013 -18059 210689
11562 210689 356929 508463 403482 127490 -73196 -74181 29998 -13182 -76881 22451 -8138
11551 -8138 -9577 -84528 -136335 -63799 -35788 -40574 1557 99105 104757 176801 382444 395687
11539 395687 299191 208976 21933 83265 276222 446548 346814 643833 721919 610372
11529 610372 449257 157733 -128194 86528 235729 494751 349674 457706 322231 358688
11519 358688 480533 255555 42382 -75176 99175 348629 228087 258901 204977 245588
11509 245588 181383 17707 183029 392542 519681 547610 770399 807477 433314 163597
11499 163597 57260 -23317 -69832 -135535 129372 70896 183388 169948 -308807 -551299
$$ packed form
11572A71505k26787j84732k5585L1551K79499N62858k38489n62833J74954K28748
11562B10689J46240J51534j04981k75992k00686r85J04179m3180o3699R9332l0589
11551h138j439p4951n1807P2536K8011m786M2131R7548N652P2044K05643J3243
11539C95687r6496r0215j87043O1332J92957J70326r9734K97019P8086j11547
11529F10372j61115k91524k85927K14722J49201K59022j45077J08032j35475L6457
11519C58688J21845k24978k13173j17558J74351K49454j20542L0814n3924M0611
11509B45588o4205j63676J65322K09513J27139K7929K22789L7078l74163k69717
11499A63597j06337q0577m6515o5703K64907n8476J12492j3440m78755k42492
$$ plain form
11489 -551299 -725476 -682029 -594702 -624134 -485759 -68198 178432 -69334 155772 461602
11479 461602 172182 -303278 -515122 -178608 85959 63009 -71824 -139137 -226101 -15799
11469 -15799 67707 104783 327883 433864 263250 18929 350015 388585 498737 808238
11459 808238 500587 445984 602456 415640 153783 18033 124214 311687 516082 683632
11449 683632 577689 627275 262876 31287 130932 427501 344586 473228 334484 303683
11439 303683 152790 26029 102273 255107 210567 269504 384385 126559 114316 308693
11429 308693 198025 198263 236891 379816 400910 91078 116272 134048 95172 109990 335289
11418 335289 380698 513088 570888 431387 344728 587533 736390 589647 572843 366706
$$ packed form
11489e51299j74177M3447Q7327k9432J38375M17561K46630k47766K25106L05830
11479D61602k89420m75460k11844L36514K64567k2950j34833o7313q6964K10302
11469a5799Q3506L7076K23100J05981j70614k44321L31086L8570J10152L09501
11459H08238l07651n4603J56472j86816k61857j35750J06181J87473K04395J67550
11449F83632j05943M9586l64399k31589R9645K96569q2915J28642j38744l0801
11439C03683j50893j26761P6244J52834m4540N8937J14881k57826j2243J94377
11429C08693j10668K38L8628J42925K1094l09832K5194J7776l8876J4818K25299
11418C35289M5409J32390N7800j39501q6659K42805J48857j46743j6804k06137
$$ plain form
11408 366706 251889 2030 67062 272780 213683 60444 -112541 -61141 -86869 -208274
11398 -208274 -205140 10968 126936 254148 61592 19639 -255474 -216035 -467500 -492189
11388 -492189 -72909 104182 194765 141620 -61061 -135715 -73518 -123230 56350 81362 110166
11377 110166 356033 551815 357690 76707 -132610 -827 83374 57864 166127 114740
11367 114740 61948 8873 2739 -74259 -286885 -172631 -152129 33370 172219 -28525 -90122
11356 -90122 -308798 -211721 -30155 216610 -19882 -402681 -308361 -217615 -275277 74199
11346 74199 318048 406730 315332 391891 417966 237818 -316671 -554897 -372542 -260002
11336 -260002 -243905 -421181 -699480 -596069 -270785 -85757 -133268 -258738 -551933 -322877
$$ packed form
11408C66706j14817k49859O5032K05718n9097j53239j72985N1400k5728j21405
11398b08274L134K16108J15968J27212j92556m1953k75113L9439k51465k4689
11388d92189M19280J77091R0583n3145k02681p4654O2197m9712J79580K5012K8804
11377A10166K45867J95782j94125k80983k09317J31783Q4201k5510J08263n1387
11367A14740n2792n3075o134p6998k12626J14254K0502J85499J38849k00744o1597
11356i0122k18676R7077J81566K46765k36492l82799R4320R0746n7662L49476
11346G4199K43849Q8682r1398P6559K6075j80148n54489k38226J82355J12540
11336b60002J6097j77276k78299J03411L25284J85028m7511j25470k93195K29056
$$ plain form
11326 -322877 -86629 304623 444385 386533 -47975 -99127 -60605 92478 12046 -119617
11316 -119617 9824 -214626 179694 137804 89332 295571 117045 96056 -262287 -47759
11306 -47759 -31707 -140040 73938 82079 7112 26205 57816 -282362 -328330 -102028 511952
11295 511952 432299 472885 472796 383544 330908 580855 253075 333033 418042 265415 266324 131245
11283 131245 153500 29660 81847 -77713 4413 50236 -116154 -224798 75703 -45633
11273 -45633 -44652 -78205 52214 80949 148591 100131 178406 228642 147608 -35514 -202667
11262 -202667 -338589 -177280 -64509 390922 719426 737421 515086 283184 183022 15854
11252 15854 -5061 -243386 -417296 65074 470408 291500 -23956 -75945 -136247 -57913
$$ packed form
11326c22877K36248L91252J39762n7852m34508n1152L8522J53083q0432j31663
11316a19617J29441k24450L94320m1890m8472K06239j78526k0989l58343K14528
11306d7759J6052j08333K13978Q141p4967J9093L1611l40178m5968K26302O13980
11295E11952p9653M0586q9q9252n2636K49947l27780P9958Q5009j52627R09j35079
11283A31245K2255j23840N2187j59560Q2126M5823j66390j08644L00501j21336
11273d5633R81l3553J30419K8735O7642m8460P8275N0236q1034j83122j67153
11262b02667j35922J61309J12771M55431L28504J7995k22335k31902j00162j67168
11252A5854k0915k38325j73910M82370M05334j78908l15456n1989o0302P8334
$$ plain form
11242 -57913 -2343 121079 -15117 -52315 -139384 -316752 -188442 -1052 -55266 45819
11232 45819 -85635 41354 214743 -25229 -302926 -31897 712880 676244 446491 276630
11222 276630 304433 414486 194638 270565 119029 97519 59434 227238 29679 73745
11212 73745 97651 266239 407462 409529 253937 343854 -73627 -215722 -243478 -75069 126107
11201 126107 114681 193937 137225 104290 185086 254041 57730 200286 187631 276138 376750
11190 376750 302253 348601 472889 462545 267982 -57967 -372617 -311853 -130133 301929
11180 301929 130766 -210122 -385401 -335800 -334147 -348799 -258757 -100965 110575 188948 256221
11169 256221 227776 98739 51253 222459 453469 604982 319409 356857 210818 109640
$$ packed form
11242e7913N5570J23422j36196l7198q7069j77368J28310J87390n4214J01085
11232D5819j31454J26989J73389k39972k77697K71029P44777l6636k29753j69861
11222B76630K7803J10053k19848P5927j51536k1510l8085J67804j97559M4066
11212G3745K3906J68588J41223K067j55592Q9917m17481j42095k7756J68409K01176
11201A26107j1426P9256n6712l2935Q0796O8955j96311J42556j2655Q8507J00612
11190C76750p4497M6348J24288j0344j94563l25949l14650O0764J81720M32062
11180C01929j71163l40888j75279M9601J653j4652R0042J57792K11540P8373O7273
11169B56221k8445j29037m7486J71206K31010J51513k85573L7448j46039j01178
$$ plain form
11159 109640 306169 89961 -97345 -421812 -366062 12641 112428 64868 174867 -63783
11149 -63783 -316811 -323963 -70482 229119 261416 -182764 -253201 -240897 -25734 -118580 32757
11138 32757 67315 123918 171062 -171036 -567694 -814569 -596876 -182290 -51403 348880
11128 348880 464313 199823 77665 122485 154118 -12583 -219641 42954 25401 205931
11118 205931 172879 77975 259577 272516 16389 7699 9678 13623 -194441 64218 173747
11107 173747 58494 77593 55703 140952 223417 287894 110690 -69779 -201648 -248537 -111277
11096 -111277 172228 -235265 -392827 -99394 95602 409278 198443 -95996 -661277 -589229
11086 -589229 -311004 -431349 -220398 0 31936 174759 60438 28748 35142 -182113
$$ packed form
11159A09640J96529k16208j87306l24467N5750L78703R9787m7560J09999k38650
11149f3783k53028p152K53481K99601L2297m44180p0437J2304K15163r2846J51337
11138C2757L4558N6603M7144l42098l96658k46875K17693M14586J30887M00283
11128C48880J15433k64490j22158M4820L1633j66701k07058K62595j7553J80530
11118B05931l3052r4904J81602J2939k56127q690J979L945k08064K58659J09529
11107A73747j15253J9099k1890Q5249Q2465O4477j77204j80469j31869m6889J37260
11096a11277K83505m07493j57562K93433J94996L13676k10835k94439n65281P2048
11086e89229K78225j20345K10951K20398L1936J42823j14321l1690O394k17255
$$ plain form
11076 -182113 -161471 -407074 -287730 -102295 -252770 40318 -44574 -487319 -591760 -599245
11066 -599245 -402411 184379 277142 1961 7905 114806 352975 644412 498543 433813
11056 433813 223503 181089 522386 386137 313020 341449 337050 300394 576061 1054748 1131856
11045 1131856 1048677 982588 1047880 960062 1030784 948074 917204 963478 788034 905189 1271877
11034 1271877 1677628 2151186 2464590 2376142 1796716 1624587 1962896 1986249 1745936 1648667
11024 1648667 1690351 1908513 2343104 2876197 3124101 2904083 2508303 1859943 1437691 1459330
11014 1459330 1310286 1564919 1444226 1702412 1779688 2021311 2254412 1884073 1499242 1402791
11004 1402791 1357344 992015 1032847 1178991 909995 657282 747448 768956 680369 690795
$$ packed form
11076a82113K0642k45603J19344J85435j50475K93088q4892m42745j04441p485
11066e99245J96834N86790R2763k75181N944J06901K38169K91437j45869o4730
11056D33813k10310m2414L41297j36249p3117K8429m399l6656K75667M78687P7108
11045A131856q3179o6089O5292q7818P0722q2710l0870M6274j75444J17155L66688
11034A271877M05751M73558L13404q8448n79426j72129L38309K3353k40313r7269
11024A648667M1684K18162M34591N33093K47904k20018l95780o48360m22252K1639
11014A459330j49044K54633j20693K58186P7276K41623K33101l70339l84831r6451
11004A402791m5447l65329M0832J46144k68996k52713R0166K1508q8587J0426
$$ plain form
10994 690795 732104 487428 382967 312634 -145392 -393887 -137623 -237405 -224398 11807
10984 11807 -80167 -34988 -27714 -234911 -110802 -343948 -489702 -588872 -799998 -540634 -155133
10973 -155133 7795 244880 169357 299218 494786 589434 799437 891030 673096 378791
10963 378791 264322 351145 389441 214113 157895 329183 93796 -358098 -614301 -562080
10953 -562080 -793053 -758418 -426975 -210772 -312972 -184962 -307080 -528637 -456747 -329948
10943 -329948 -139625 -125695 -332580 -156439 -18649 4595 -44909 42841 -156097 -89494
10933 -89494 -50747 -478630 -306233 -339803 -302429 108555 -19086 -21192 135923 159144 -106067
10922 -106067 -82929 -18761 16846 -276047 -684603 -726142 -516540 -304774 117092 270413
$$ packed form
10994F90795M1309k44676j04461p0333m58026k48495K56264r9782J3007K36205
10984A1807r1974M5179P274k07197J24109k33146j45754r9170k11126K59364L85501
10973a55133J62928K37085p5523J29861J95568R4648K10003R1593k17934k94305
10963C78791j14469Q6823L8296j75328n6218J71288k35387m51894k56203N2221
10953e62080k30973L4635L31443K16203j02200J28010j22118k21557P1890J26799
10943c29948J90323J3930k06885J76141J37790K3244m9504Q7750j98938O6603
10933h9494L8747m27883J72397l3570L7374M10984j27641k106J57115K3221k65211
10922a06067K3138O4168L5607k92893m08556m1539K09602K11766M21866J53321
$$ plain form
10912 270413 154951 241765 423471 430740 371251 276809 -127953 -201661 -312811 -310342 -44572
10901 -44572 -275443 -333824 -191989 -342725 -426551 -232992 -291993 -219134 -319179 121867
10891 121867 421647 324817 484731 287228 218232 130123 23594 383365 574942 548665
10881 548665 -1654 -90341 -240507 -396414 -441526 -512137 -445205 -118592 -167103 -128679 -228430
10870 -228430 -104798 -48121 -95004 151783 316512 258402 355679 281760 215429 -58743 -249063
10859 -249063 -406734 -441378 -388950 -167339 -23246 45294 116570 62068 267619 355821 602224
10848 602224 595972 532279 304734 465029 322332 181054 305656 90452 232196 439282
10838 439282 540524 441370 195413 267740 194214 132396 228656 -16870 179503 451520
$$ packed form
10912B70413j15462Q6814J81706P269n9489r4442m04762p3708j11150K469K65770
10901d4572k30871n8381J41835j50736q3826J93559n9001P2859j00045M41046
10891A21867K99780r6830J59914j97503o8996q8109j06529L59771J91577k6277
10881E48665n50319q8687j50166j55907m5112p0611O6932L26613m8511L8424r9751
10870b28430J23632N6677m6883K46787J64729n8110R7277p3919o6331k74172j90320
10859b49063j57671l4644N2428K21611J44093O8540P1276n4502K05551Q8202K46403
10848F02224o252o3693k27545J60295j42697j41278J24602k15204J41744K07086
10838D39282J01242r9154k45957P2327p3526o1818R6260k45526J96373K72017
$$ plain form
10828 451520 102499 22056 44995 371544 536394 446876 121556 -5529 218482 411226
10818 411226 530482 533694 323646 334944 150439 223541 603255 433978 331631 -43123
10808 -43123 -205524 -28732 107087 7702 35155 -108048 33411 -195757 -170020 -53432
10798 -53432 -9759 90178 234471 -128734 -279911 -177617 -318782 -542941 -315184 -371171
10788 -371171 -495630 -263918 -52306 43301 139197 89564 -6822 -160643 -159902 -176045 -2557
10777 -2557 92502 27322 231578 148050 -141849 -222640 65941 122645 56239 105093 43832
10766 43832 53687 -14903 160912 92699 -65793 160495 234035 277296 28780 -205564 74764
10755 74764 76122 -45627 4436 185790 274903 347008 156800 45487 -12098 -49323 -37874
$$ packed form
10828D51520l49021q0443K2939L26549J64850q9518l25320j27085K24011J92744
10818D11226J19256L212k10048J1298j84505P3102L79714j69277j02347l74754
10808d3123j62401J76792J35819r9385K7453j43203J41459k29168K5737J16588
10798e3432M3673R9937J44293l63205j51177J02294j41165k24159K27757n5987
10788c71171j24459K31712K11612R5607R5896m9633r6386j53821P41j6143J73488
10777b557R5059o5180K04256q3528k89899q0791K88581N6704o6406M8854o1261
10766D3832R855o8590J75815o8213j58492K26288P3540M3261k48516k34344K80328
10755G4764J358j21749N0063J81354Q9113P2105j90208j11313n7585l7225J1449
$$ plain form
10744 -37874 42062 -215410 -336553 -253508 90571 355325 322764 205838 226986 330004
10734 330004 265284 102545 -146161 -232023 34570 -258156 -138144 -126830 -14545 173410
10724 173410 176078 4360 46722 104241 384053 513795 357631 515869 627973 529507
10714 529507 650549 567063 732122 942548 913111 691425 373375 293585 287690 595917
10704 595917 647333 507013 345477 56010 -256470 -400521 -292624 -48978 122225 260690
10694 260690 414513 208157 78588 302133 257320 150012 -30785 -81800 159569 152246
10684 152246 -94650 -323895 -218837 -205625 28352 -88387 -179076 -246372 -284605 -226761
10674 -226761 -94552 204106 116836 -25033 133389 198144 165420 232574 195615 483315
$$ packed form
10744c7874P9936k57472j21143Q3045L44079K64754l2561j16926K1148J03018
10734C30004o4720j62739k48706q5862K66593k92726J20012J1314J12285J87955
10724A73410K668j71718M2362N7519K79812J29742j56164J58238J12104r8466
10714E29507J21042q3486J65059K10426k9437k21686l18050p9790n895L08227
10704E95917N1416j40320j61536k89467l12480j44051J07897K43646J71203J38465
10694B60690J53823k06356j29569K23545m4813j07308j80797n1015K41369p323
10684A52246k46896k29245J05058J3212K33977j16739r0689o7296l8233N7844
10674b26761J32209K98658q7270j41869J58422O4755l2724O7154l6959K87700
$$ plain form
10664 483315 588604 584262 698728 894204 1125211 927603 661493 989574 1213800 1418275
10654 1418275 1485839 1221209 1083960 1448532 1385281 1146932 1187462 1166918 1153301 1281313
10644 1281313 1705125 1779889 1870099 2143819 2188358 2333794 2390609 2630552 3057241 3702258
10634 3702258 3892998 4226216 5090535 6103673 7048441 7856916 8667794 9834287 11227393
10625 11227393 12733851 14877471 17898641 21886728 27707779 36289792 48302824 64523997
10617 64523997 86243586 112998140 140056927 159272103 164641997 157615096 145978153
10610 145978153 136506292 133141286 138285356 154237721 183232864 226312675 280890199
10603 280890199 335127423 368001883 364766072 332270652 291835003 260177288 243787477
$$ packed form
10664D83315J05289m342J14466J95476K31007j97608k66110L28081K24226K04475
10654A418275O7564k64630j37249L64572o3251k38349M0530k0544j3617J28012
10644A281313M23812P4764R0210K73720M4539J45436N6815K39943M26689O45017
10634C702258J90740L33218Q64319J013138R44768Q08475Q10878J166493J393106
10625A1227393J506458K143620L021170L988087N821051Q582013J2013032J6221173
10617F4523997K1719589K6754554K7058787J9215176N369894p026901j1636943
10610A45978153r471861l365006N144070J5952365K8995143M3079811N4577524
10603B80890199N4237224L2874460l235811l2495420m0435649l1657715j6389811
$$ plain form
10596 243787477 244225016 262692065 300463335 357989564 429663307 494888662 522984170
10589 522984170 496809662 431859360 360288421 303304493 266950429 249299426 249239902
10582 249239902 266096802 297564493 336922296 369117844 373745105 342497751 288228009
10575 288228009 233209214 190672934 162816258 147502540 142139799 145140076 154253130
10568 154253130 165381012 171362166 166081027 147673216 121107765 94747151 72868724
10561 72868724 55934030 43780574 35060657 29291686 24985167 21496679 18686879 16665992
10553 16665992 15044686 13552810 12304972 10990861 9767369 8998879 8251994 7577826
10545 7577826 6798160 6126396 5577755 5357573 5266794 5380700 5017510 4444760 4397152 4210088
$$ packed form
10596B43787477M37539J8467049L7771270N7526229P1673743O5225355K8095508
10589E22984170k6174508o4950302p1570939n6983928l6354064j7651003n9524
10582B49239902J6856900L1467691L9357803L2195548M627261l1247354n4269742
10575B88228009n5018795m2536280k7856676j5313718n362741L000277R113054
10568A54253130J1127882N981154n281139j8407811k6565451k6360614k1878427
10561G2868724j6934694j2153456q719917n768971m306519l488488k809800k020887
10553A6665992j621306j491876j247838j314111j223492p68490p46885o74168
10545G577826p79666o71764n48641k20182r0779J13906l63190n72750m7608j87064
$$ plain form
10535 4210088 4115640 3757898 3261651 3280095 3339547 3082893 3403958 3190133 2905668 3146593
10525 3146593 3163470 2700557 2527896 2531810 2387425 2387952 2452230 2314781 2123491 2184967 2201609
10514 2201609 2289144 2123286 1672061 1289467 1015261 1175523 1603338 1551712 1343380 1234111
10504 1234111 1618633 1988325 2009225 2059476 2083509 1786725 1643185 1183644 1390289 1339592
10494 1339592 1404534 1901084 2053868 1800884 1651093 1649736 1873936 1988742 1858420 1616894
10484 1616894 1568314 1421669 1271438 1468012 1585923 1278671 1097228 1113625 1002812 740640
10474 740640 938674 957583 961531 1079196 1293568 1051795 748732 643071 868608 1106859
10464 1106859 1020725 946055 922381 682573 611110 835283 740927 516752 843094 1213134
$$ packed form
10535D210088r4448l57742m96247J8444N9452k56654L21065k13825k84465K40925
10525C146593J6877m62913j72661L914j44385N27O4278j37449j91290O1476J6642
10514B201609Q7535j65858m51225l82594k74206J60262M27815n1626k08332j09269
10504A234111L84522L69692K0900N0251K4033k96784j43540m59541K06645n0697
10494A339592O4942M96550J52784k52984j49791j357K24200J14806j30322k41526
10484A616894m8580j46645j50231J96574J17911l07252j81443J6397j10813k62172
10474G40640J98034J8909L948J17665K14372k41773l03063j05661K25537K38251
10464A106859q6134p4670k3674k39808p1463K24173r4356k24175L26342L70040
$$ plain form
10454 1213134 1042520 1003261 1309395 1134584 1041368 865565 431189 238081 403803 621983
10444 621983 671256 541831 685440 922050 1096659 1059258 1060406 1243953 1167275 1135513 1089475
10433 1089475 819319 539474 42378 153463 356471 706376 580193 328340 186697
10424 186697 -3301 388266 916312 1110629 881618 578412 279145 227924 292043 662787
10414 662787 566114 321829 374666 766859 621607 67872 254848 767148 574882 508383
10404 508383 473664 654208 452525 283140 287808 157431 143801 412526 543745 539489 566091
10393 566091 629861 510891 460603 291187 273327 116698 257729 385418 414862 764681
10383 764681 1120722 1048931 906968 766623 291887 160887 209641 183112 -23033 -89144
$$ packed form
10454A213134j70614l9259L06134j74811r3216j75803m34376j93108J65722K18180
10444F21983M9273j29425J43609K36610J74609l7401J148J83547p6678l1762m6038
10433A089475k70156k79845m97096J11085K03008L49905j26183k51853j41643
10424A86697j89998L91567N28046J94317k29011l03206k99267n1221O4119L70744
10414F62787r6673k44285N2837L92193j45252n53735J86976N12300j92266o6499
10404E08383l4719J80544k01683j69385M668j30377j3630K68725J31219m256K6602
10393E66091O3770j18970n0288j69416j7860j56629J41031J27689K9444L49819
10383G64681L56041p1791j41963j40345m74736j31000M8754k6529k06145o6111
$$ plain form
10373 -89144 -57839 101190 -33013 -307020 -500118 -223412 -212174 71074 313285 506794
10363 506794 449202 -12897 -198571 -116344 20880 473033 530557 247862 88142 137696
10353 137696 -90555 -475060 -582734 -185052 -20473 -235696 -341400 -63517 406706 440996
10343 440996 426293 465735 397860 305248 540391 727721 636511 646603 628517 596869 282473
10332 282473 98007 514859 740662 775336 532953 524516 569825 369130 221635 104692
10322 104692 65991 312750 352735 142424 161645 94168 304939 168327 454983 668674
10312 668674 644685 585336 649126 648552 300674 95359 93901 166952 -37054 -146896 2733
10301 2733 -43203 245248 512460 382087 237829 225428 42066 265876 579354 545044
$$ packed form
10373h9144L1305J59029j34203k74007j93098K76706J1238K83248K42211J93509
10363E06794n7592m62099j85674Q2227J37224M52153N7524k82695j59720M9554
10353A37696k28251l84505j07674L97682J64579k15223j05704K77883M70223L4290
10343D40996j4703L9442o7875r2612K35143J87330r1210J0092j8086l1648l14396
10332B82473j84466M16852K25803L4674k42383q437M5309k00695j47495j16943
10322A04692l8701K46759L9985k10311J9221o7477K10771j36612K86656K13691
10312F68674k3989n9349O3790n74l47878k05315j458P3051k04006j09842J49629
10301B733m5936K88451K67212j30373j44258j2401j83362K23810L13478l4310
$$ plain form
10291 545044 51258 -220167 -60916 344828 230858 136791 -273957 -258887 289235 299283
10281 299283 121298 210016 190359 330254 245869 268115 495315 653545 499989 60683
10271 60683 90338 238728 336807 152862 170924 116672 -94341 -254509 -37914 270233
10261 270233 131230 -291349 -336716 -298927 -147169 -174976 -185238 -440243 -459642 -13561
10251 -13561 421416 699103 596916 525921 381434 411300 385550 475506 407208 562275 636191
10240 636191 327804 36312 146767 340470 93718 -72791 -161288 16780 -73593 53839
10230 53839 134084 -282025 -595065 -366075 -255759 -42132 199167 228786 86186 121428
10220 121428 301221 311961 216347 181355 213821 -22295 -148719 -458205 -397700 -620206
$$ packed form
10291E45044m93786k71425J59251M05744j13970r4067m10748J5070N48122J0048
10281B99283j77985Q8718j9657J39895q4385K2246K27200J58230j53556m39306
10271F0683K9655J48390R8079j83945J8062n4252k11013j60168K16595L08147
10261B70233j39003m22579m5367L7789J51758k7807j0262k55005j9399M46081
10251a3561M34977K77687j02187p0995j44487K9866k5750Q9956o8298J55067P3916
10240F36191l08387k91492J10455J93703k46752j66509q8497J78068r0373J27432
10230E3839Q0245m16109l13040K28990J10316K13627K41299K9619j42600L5242
10220A21428J79793J0740r5614l4992L2466k36116j26424l09486O0505k22506
$$ plain form
10210 -620206 -404772 -18557 -29017 -21782 -80309 -337580 -176583 26718 198936 -74741
10200 -74741 -160130 103085 206067 168440 315736 403569 225672 115631 -215915 -180666
10190 -180666 77618 5495 -48138 145880 24915 179902 232279 80606 34562 406459
10180 406459 884445 611767 935169 1346306 1691434 1936208 1610123 997653 626979 411745
10170 411745 194097 351404 809511 1104246 1396696 1585322 1706546 1524449 1096893 1008690
10160 1008690 1240138 1489842 1599355 1652139 1751908 1976624 2135028 2203466 2070804 1852789
10150 1852789 1780184 1902511 2165860 2018710 1523548 1383299 1690056 1887777 2152737 1834623
10140 1834623 1593393 1570921 1306572 993440 684199 997133 1197394 1352659 1590922 1470975
$$ packed form
10210f20206K15434L86215j0460P235n8527k57271J60997K03301J72218k73677
10200g4741q5389K63215J02982l7627J47296Q7833j77897j10041l31546L5249
10190a80666K58284p2123n3633J94018j20965J54987N2377j51673m6044L71897
10180D06459M77986k72678L23402M11137L45128K44774l26085o12470l70674k15234
10170D11745k17648J57307M58107K94735K92450J88626J21224j82097m27556q8203
10160A008690K31448K49704J09513N2784R9769K24716J58404O8438j32662k18015
10150A852789p2605J22327K63349j47150m95162j40249L06757J97721K64960l18114
10140A834623k41230k2472k64349l13132l09241L12934K00261J55265K38263j19947
$$ plain form
10130 1470975 1394288 1490033 1000525 727137 476418 398614 519151 670273 485651 446464
10120 446464 613296 352458 160533 160206 139975 296109 241442 302105 94959 137585 -119667
10109 -119667 42347 175089 253335 525051 416399 -83109 128651 306497 205182 140439
10099 140439 314502 243929 -32853 234467 185026 307520 289541 91076 -61422 128203
10089 128203 252441 -129044 -160949 -11947 -78577 -15534 5399 -168038 -207606 -155843 -93480
10078 -93480 240627 300393 155697 307211 580954 535817 133081 -49665 364447 635908
10068 635908 352243 368405 71007 -240395 -111302 81568 312505 404159 285822 101672
10058 101672 83151 -158050 67827 123568 81011 -55393 -122960 -180919 -473316 -666355
$$ packed form
10130A470975p6687R5745m89508k73388k50719p7804J20537J51122j84622l9187
10120D46464J66832k60838j91925l27k0231J56134n4667O0663k07146M2626k57252
10109a19667J62014J32742P8246K71716j08652m99508K11760J77846j01315o4743
10099A40439J74063p0573k76782K67320m9441J22494j7979j98465j52498J89625
10089A28203J24238l81485l1905J49002o6630O3043K0933j73437l9568N1763O2363
10078i3480L34107N9766j44696J51514K73743m5137m02736j82746M14112K71461
10068F35908k83665J6162k97398l11402J29093J92870K30937R1654j18337j84150
10058A01672j8521k41201K25877N5741m2557j36404o7567n7959k92397j93039
$$ plain form
10048 -666355 -400152 -329575 -9646 -214245 -629206 -394820 -414320 -563391 -696049 -484878
10038 -484878 -366309 -137920 -180533 -302763 -165784 -137248 -28769 487682 904728 803466
10028 803466 288017 300878 11829 -156073 -320182 -450067 -449558 -600854 -508479 -39432
10018 -39432 407254 438708 520783 372366 187728 94645 38507 -37385 13287 319429 321179
10007 321179 103043 266741 153966 256334 328377 216100 -51941 -66762 76780 -80540
9997 -80540 -293391 -137488 -54645 100216 4107 -169791 -276966 100196 349736 143928
9987 143928 -269557 -214040 -263561 -298630 -259862 50035 139249 41787 114593 95194 28545
9976 28545 -371275 -253951 123962 -17907 -176472 -31036 -106920 -28288 -45658 -2860 -180379
$$ packed form
10048f66355K66203P0577L19929k04599m14961K34386j9500j49071j32658K11171
10038d84878J18569K28389m2613j22230J36979K8536J08479N16451M17046j01262
10028H03466n15449J2861k89049j67902j64109j29885N09j51296R2375M69047
10018c9432M46686L1454Q2075j48417j84638r3083n6138p5892N0672L06142J750
10007C21179k18136J63698j12775J02368P2043j12277k68041j4821J43542j57320
9997h0540k12851J55903Q2843J54861r6109j73898j07175L77162K49540k05808
9987A43928m13485N5517m9521l5069L8768L09897Q9214r7462P2806j9399o6649
9976B8545l99820J17324L77913j41869j58565J45436p5884P8632j7370M2798j77519
$$ plain form
9965 -180379 -211019 -162093 19437 116950 461647 576788 448941 334536 146528 -263546
9955 -263546 -309065 -157364 318841 364016 50357 -346547 -341705 -218847 -207626 -106096 204842
9944 204842 314295 -59858 -404678 -342486 -469045 -286267 -192925 -548689 -225149 131564
9934 131564 485658 259781 14474 168379 88514 32851 -231507 77045 259769 539262
9924 539262 501183 362235 446087 628012 710437 1175616 2277421 4050684 6759955 8360390
9914 8360390 6750373 3772124 1946720 1052191 797632 734480 725029 220643 536203 848191
9904 848191 643983 348407 422942 258708 -45121 -191234 -286013 -367583 -62161 -115776
9894 -115776 -461557 -323347 -67340 -32347 -49619 -352122 -334275 -405658 -422491 -540030 -295903
$$ packed form
9965a80379l0640M8926J81530R7513L44697J15141j27847j14405j88008m10074
9955b63546m5519J51701M76205M5175l13659l96904M842J22858J1221J01530L10938
9944B04842J09453l74153l44820O2192j26559J82778R3342l55764L23540L56713
9934A31564L54094k25877k45307J53905p9865n5663k64358L08552J82724K79493
9924E39262l8079j38948Q3852J81925Q2425M65179J101805J773263K709271J600435
9914H360390j610017k978249j825404q94529k54559o3152r451n04386L15560L11988
9904H48191k04208k95576P4535j64234l03829j46113r4779q1570L05422n3615
9894a15776l45781J38210K56007L4993j7272l02503J7847p1383j6833j17539K44127
$$ plain form
9883 -295903 -66296 -261983 -308779 -125783 160493 579334 551739 294915 -204674 -501031
9873 -501031 -378316 -198618 -114715 -216603 -404796 -470309 -225506 -120691 199140 338040
9863 338040 322388 18048 -264507 -353271 -48902 187872 267562 76448 -294060 -246328
9853 -246328 210466 316178 232354 82919 22151 -162868 -269984 -333506 -272866 -70232
9843 -70232 152017 295666 289221 402614 283724 315840 309567 188112 -30113 -302252 -256867
9832 -256867 -670621 -637779 -120302 271759 22260 -386053 -338824 -337264 -413648 -347896 -196105
9821 -196105 -92136 -290965 -583637 -682747 -243881 15753 -430425 -491962 -259198 -155109
9811 -155109 -236982 96021 183985 391307 310501 469028 407688 251711 134204 -216027
$$ packed form
9883b95903K29607j95687m6796J82996K86276M18841k7595k56824m99589k96357
9873e01031J22715J79698Q3903j01888j88193o5513K44803J04815L19831J38900
9863C38040j5652l04340k82555q8764L04369K36774P9690j91114l70508M7732
9853b46328M56794J05712q3824j49435o0768j85019j07116o3522O0640K02634
9843g0232K22249J43649o445J13393j18890L2116o273j21455k18225k72139M5385
9832b56867m13754L2842N17477L92061k49499m08313M7229J560p6384O5752J51791
9821a96105J03969j98829k92672r9110M38866K59634m46178o1537K32764J04089
9811a55109q1873L33003Q7964K07322q0806J58527o1340j55977j17507l50231
$$ plain form
9801 -216027 -489487 -306502 -307618 -99034 -123551 -125992 -95216 -296379 -242247 -46502 -77833
9790 -77833 -380058 -270965 -14759 199391 309224 631823 764555 815749 655810 446461
9780 446461 543825 557587 217906 373238 534050 482065 150394 -71903 237875 304480
9770 304480 209919 462886 454638 276474 181946 -113036 -210778 -344211 139397 628881 408664
9759 408664 155656 200538 297959 -216203 -266543 -316881 -264714 -203175 7265 -131760 -328845
9748 -328845 -32044 -31662 -254225 -324261 -359723 -214222 -58923 -253178 -177616 -29419 -329274
9737 -329274 -520613 -633436 -496250 -412744 -424563 -437730 -445992 -425375 -424279 -527540 -332797
9726 -332797 -53453 -67573 -94220 -148373 -365073 -516248 -382604 -184234 -260357 -174472 -628403
$$ packed form
9801b16027k73460J82985j116K08584k4517k441L0776k01163N4132J95745l1331
9790g7833l02225J09093K56206K14150J09833L22599J32732N1194j59939k09349
9780D46461R7364J3762l39681J55332J60812n1985l31671k22297L09778O6605
9770C04480r4561K52967q248j78164r4528k94982r7742j33433M83608M89484k20217
9759D08664k53008M4882R7421n14162n0340n0338N2167O1539K10440j39025j97085
9748c28845K96801L82k22563p0036l5462J45501J55299j94255P5562J48197k99855
9737c29274j91339j12823J37186Q3506j1819j3167q262K0617J096j03261J94743
9726c32797K79344j4120k6647n4153k16700j51175J33644J98370p6123Q5885m53931
$$ plain form
9715 -628403 -532561 -651973 -571314 -335442 -217049 -374775 -368007 -125392 -290067 -409658
9705 -409658 -287761 -295316 -36344 -99741 -150633 -237119 -117860 -410699 -507302 -535273 -190602
9694 -190602 314314 153220 -204235 -381130 44781 173903 373221 481490 627835 533382
9684 533382 374442 391289 753455 865793 504356 309885 74833 78716 -41163 -181853
9674 -181853 -37936 124378 108284 105974 109853 102174 -166987 -500327 -205193 -10354 -290219
9663 -290219 -394865 -178254 -237344 -279519 -105855 339622 447076 531399 692422 802695
9653 802695 846748 1071191 946817 606280 98841 -216764 -120830 -400341 -228781 -55318
9643 -55318 -113469 109528 289517 443706 369551 57352 -63854 -189336 -247981 -337419 -391021
$$ packed form
9715f28403R5842j19412Q0659K35872J18393j57726O768K42615j64675j19591
9705d09658J21897p555K58972o3397n0892q6486J19259k92839r6603k7971L44671
9694a90602N04916j61094l57455j76895M25911J29122J99318J08269J46345r4453
9684E33382j58940J6847L62166J12338l61437j94471k35052L883j19879j40690
9674a81853J43917J62314j6094k310L879p679k69161l33340K95134J94839k79865
9663b90219j04646K16611n9090m2175J73664M45477J07454Q4323J61023J10273
9653H02695M4053K24443j24374l40537n07439l15605R5934k79511J71560J73463
9643e5318n8151K22997J79989J54189p4155l12199j21206j25482n8645q9438n3602
$$ plain form
9632 -391021 -270597 -38031 -79992 -444995 -657912 -373897 -72374 -94350 82773 -16002
9622 -16002 -351367 -255941 -53613 -107115 -183570 -162338 -182875 -266304 -200733 -42649 101108
9611 101108 49974 99381 354021 341622 319860 -47034 152874 30345 -35279 -126883 -266049
9600 -266049 -291647 -158032 -91038 -200294 -429043 -430752 -305515 -145310 -100735 -112753 -136497
9589 -136497 -226282 -213625 -208036 -100575 20019 -95420 -64095 -22927 56783 -305751 -211072
9578 -211072 -250182 -336371 -27425 -117121 -182635 -22428 44643 151260 -171709 -412016 -213023
9567 -213023 48616 187484 133623 -76587 -348122 -313944 -238786 -30466 -74535 -83228 -153592
9556 -153592 -171058 -165460 -205494 -390372 -412868 -372371 -386768 -303455 -305375 -518033 -638588
$$ packed form
9632c91021J20424K32566m1961l65003k12917K84015L01523k1976J77123r8775
9622a6002l35365R5426K02328n3502p6455K1232k0537q3429O5571J58084J43757
9611A01108n1134M9407K54640j2399k1762l66894J99908j22529o5624r1604j39166
9600b66049k5598J33615O6994j09256k28749j709J25237J60205M4575j2018k3744
9589a36497q9785J2657N589J07461J20594j15439L1325M1168P9710l62534R4679
9578b11072l9110q6189L08946q9696o5514J60207O7071J06617l22969k40307J98993
9567b13023K61639J38868n3861k10210k71535L4178P5158K08320m4069q693p0364
9556a53592j7466N598m0034j84878k2496M0497j4397Q3313j920k12658j20555
$$ plain form
9545 -638588 -544903 -218218 -27845 467731 447917 192767 -189779 -79973 -39071 188396
9535 188396 452125 913179 873547 215210 333345 169764 -155386 -52630 -196192 -156769
9525 -156769 187689 568336 594501 483955 464776 -98424 -327178 -193911 -26026 49449
9515 49449 -216744 3914 -61161 43304 -191340 -439184 -92381 -70755 -55392 -87871 -312219
9504 -312219 -100349 -85602 -233281 -99692 27503 -122085 118788 265546 -58878 -56793
9494 -56793 -204330 -188073 -343735 -438661 -283982 15722 85775 -393277 -464072 -84380 -104528
9483 -104528 -33588 47826 140696 192651 102868 -40505 -89453 -124960 -253991 -29121 138954
9472 138954 228309 197672 35822 -336846 -622547 -616510 -345721 492 -239943 -452320
$$ packed form
9545f38588R3685L26685J90373M95576j9814k55150l82546J09806M0902K27467
9535A88396K63729M61054l9632o58337J18135j63581l25150J02756j43562L9423
9525a56769L44458L80647K6165j10546j9179n63200k28754J33267J67885P5475
9515D9449k66193K20658o5075J04465k34644k47844L46803K1626J5363l2479k24348
9504c12219K11870J4747j47679J33589J27195j49588K40873J46758l24424K085
9494e6793j47537J6257j55662r4926J54679K99704P0053m79052p0795L79692k0148
9483a04528P0940Q1414R2870N1955q9783j43373m8948l5507j29031K24870J68075
9472A38954Q9355l0637j61850l72668k85701O037K70789L46213k40435k12377
$$ plain form
9462 -452320 -267919 -29614 218159 -137226 -70024 -15295 166068 59924 -180129 47884
9452 47884 34687 302182 541585 401431 371181 -18811 138566 52660 -170774 -190931 -310524
9441 -310524 -442305 -514186 -267343 -111074 159862 99559 -7458 38585 172686 88051
9431 88051 92689 271279 62773 -166467 -298896 -515858 -327452 -386966 -765259 -996860
9421 -996860 -708015 -445235 -313667 -417252 -274741 -136624 158628 -111444 -366976 -368940
9411 -368940 -259394 -346669 -72737 -149644 168906 235223 267572 250733 321470 325153 323864
9400 323864 -54859 -282043 144926 181249 -30974 -80881 8927 175244 -58409 -265625
9390 -265625 -421264 -216387 -49437 276441 288249 306098 -6855 -166860 42083 34000
$$ packed form
9462d52320J84401K38305K47773l55385O7202N4729J81363j06144k40053K28013
9452D7884j3197K67495K39403j40154l0250l89992J57377q5906k23434k0157j19593
9441c10524j31781p1881K46843J56269K70936o0303j07017M6043J34101q4635
9431H8051M638J78590k08506k29240j32429k16962J88406n9514l78293k31601
9421i96860K88845K62780J31568j03585J42511J38117K95252k70072k55532j964
9411c68940J09546q7275K73932p6907L18550O6317L2349j6839P0737L683j289
9400C23864l78723k27184M26969L6323k12223m9907Q9808J66317k33653k07216
9390b65625j55639K04877J66950L25878J1808J7849l12953j60005K08943q083
$$ plain form
9380 34000 391814 507250 635745 280151 115674 -86990 -160893 -329143 -100310 411549
9370 411549 669679 337747 -65855 -71900 -36943 -50282 31031 -71306 -25403 245888 471192
9359 471192 359813 164331 183834 173449 476622 837863 833947 809402 577520 176887 254583
9348 254583 613786 924444 578898 165130 20791 82910 137658 -82779 -40382 234151
9338 234151 318861 726975 825544 263556 106304 293829 328953 10263 17046 -70142 280383
9327 280383 408531 106121 -88426 -242340 -44523 351957 238758 161968 310663 312251
9317 312251 10728 -290351 -412886 -343388 -668938 -873941 -229680 -84632 -180452 -189688
9307 -189688 -198709 -698279 -827460 -827477 -428445 -154161 -163623 -225247 -112496 -21609 207538
$$ packed form
9380C4000L57814J15436J28495l55594j64477k02664p3903j68250K28833N11859
9370D11549K58130l31932m03602o045L4957j3339Q1313j02337M5903K71291K25304
9359D71192j11379j95482J9503j0385L03173L61241l916k4545k31882m00633P7696
9348B54583L59203L10658l45546m13768j44339O2119N4748k20437M2397K74533
9338B34151Q4710M08114R8569n61988j57252J87525L5124l18690O783q7188L50525
9327B80383J28148l02410j94547j53914J97817L96480j13199p6790J48695J588
9317C12251l01523l01079j22535O9498l25550k05003O44261J45048r5820r236
9307a89688r021m99570j29181j7L99032K74284r462o1624J12751R0887K29147
$$ plain form
9296 207538 484836 487433 203684 311278 171121 115292 199967 -108048 52071 137318 257301
9285 257301 186618 -34741 -29817 -20470 -369695 -476507 -533206 -79531 247245 139082 -13638
9274 -13638 -206774 -286715 -195828 -259532 -424513 -493586 -288475 131688 368995 577902 492955
9263 492955 40225 -151314 -344161 -342921 -211975 -209197 -239976 -321846 -462495 -642645 -344530
9252 -344530 -226012 -478775 -377602 -403535 -415669 -510016 -742996 -798923 -483342 -416517 -723576
9241 -723576 -467733 -171173 -235658 -369902 -734866 -633999 -288246 -65030 -8856 -149387
9231 -149387 -205842 39360 111813 280281 125460 -136838 -266601 62894 234437 386100
9221 386100 215175 337299 88086 -422217 -513916 -239828 -195372 -93062 -30419 -156255
$$ packed form
9296B07538K77298K597k83749J07594j40157n5829Q4675l08015J60119Q5247J19983
9285B57301p0683k21359M924R347l49225j06812n6699M53675L26776j08163j52720
9274a3638j93136p9941R0887o3704j64981o9073K05111M20163K37307K08907q4947
9263D92955m52730j91539j92847J240J30946K778l0779q1870j40649j80150K98115
9252c44530J18518k52763J01173k5933j2134r4347k32980n5927L15581O6825l07059
9241g23576K55843K96560o4485j34244l64964J00867L45753K23216N6174j40531
9231a49387n6455K45202P2453J68468j54821k62298j29763L29495J71543J51663
9221C86100j70925J22124k49213n10303r1699K74088M4456J02310O2643j25836
$$ plain form
9211 -156255 -111084 -343 110965 272482 273487 118900 51760 -96506 -105667 -196620 -54434
9200 -54434 -124615 15886 48517 -284373 -347383 -429190 -343511 -234633 15033 -187404 -396406
9189 -396406 -552442 -117287 222067 225055 383360 391319 -34093 -474256 -472648 -193000 -313397
9178 -313397 -416778 -550268 -678830 -233869 55974 397192 390517 215985 187073 363205
9168 363205 199162 -92567 49671 234733 354897 224405 263144 107683 209299 566654
9158 566654 479867 173521 198877 120893 278623 542743 559680 177737 -11238 -49303 -240506
9147 -240506 -327415 45185 174428 35638 71344 -132283 -155554 209762 212987 -115440 -398376
9136 -398376 -421735 -183471 262093 486783 384226 121367 152269 115726 134869 130239 116507
$$ packed form
9211a56255M5171J10741J11308J61517J005j54587o7140j48266r161r0953J42186
9200e4434p0181J40501L2631l32890o3010q1807Q5679J08878K49666k02437k09002
9189c96406j56036M35155L39354K988J58305P959m25412m40163J608K79648j20397
9178c13397j03381j33490j28562M44961K89843L41218o675j74532k8912J76132
9168C63205j64043k91729J42238J85062J20164j30492L8739j55461J01616L57355
9158E66654q6787l06346K5356p7984J57730K64120J6937l81943j88975l8065j91203
9147b40506q6909L72600J29243j38790L5706k03627k3271L65316L225l28427k82936
9136c98376k3359K38264M45564K24690j02557k62859L0902l6543J9143m630j3732
$$ plain form
9125 116507 -13345 -228313 -150243 -187814 -329688 -74964 -112572 -115918 -97656 -33732 -9461
9114 -9461 130268 208158 164638 84200 -138558 -162431 -75468 -134099 -23804 106940 -17870
9103 -17870 -75995 -182251 -276291 -524422 -634793 -318398 -8468 -83719 -227117 -235275 -214166
9092 -214166 -247448 -417311 -172874 138717 917 -8445 -199429 -192072 -167017 -180570 -215486
9081 -215486 -210304 79857 -131810 -338132 -580087 -297103 -154490 -549536 -518504 -199452
9071 -199452 -235103 -336580 -313281 -272603 -354423 -323720 -532623 -483957 -290840 125323 43906
9060 43906 -445752 -540398 -74238 68105 40412 236813 424080 53620 411038 737083
9050 737083 786695 794327 562218 617441 477720 195825 -72904 -7368 131279 -229517 -263001
$$ packed form
9125A16507j29852k14968P8070l7571j41874K54724l7608l346J8262O3924K4271
9114i461J39729P7890m3520q0438k22758k3873Q6963n8631J10295J30744j24810
9103a7870n8125j06256r4040k48131j10371L16395L09930p5251j43398q158K1109
9092b14166l3282j69863K44437L11591j37800r362j90984P357K5055j3553l4916
9081b15486N182K90161k11667k06322k41955K82984J42613l95046L1032L19052
9071a99452l5651j01477K3299M0678q1820L0703k08903M8666J93117M16163q1417
9060D3906m89658r4646M66160J42343k7693J96401J87267l70460L57418L26045
9050G37083M9612P632k32109N5223j39721k81895k68729O5536J38647l60796l3484
$$ plain form
9039 -263001 -47976 -271802 -31776 129823 269140 437056 738179 345548 175798 481760
9029 481760 424698 307484 210169 79629 251955 211265 280012 70466 -268245 -414898
9019 -414898 -634091 -589830 -589753 -500078 -274129 -738095 -747612 -392891 -44481 -72310 -367300
9008 -367300 -282382 -203887 -308758 -219781 -95764 -55350 288244 205723 390248 574172 437977
8997 437977 75985 -138980 -151508 -139391 -118649 -191960 -46116 89365 68905 -268381 -336793
8986 -336793 127209 511498 422872 246909 202919 287672 318234 138562 324016 671067
8976 671067 825135 650241 169797 114742 417646 322704 -129846 -246631 11111 251892
8966 251892 234373 173547 216898 -83429 -72118 234595 186847 307805 129406 -197170 13617
$$ packed form
9039b63001K15025k23826K40026J61599J39317J67916L01123l92631j69750L05962
9029D81760n7062j17214r7315j30540J72326m0690O8747k09546l38711j46653
9019d14898k19193M4261P7Q9675K25949m63966r517L54721L48410k7829k94990
9008c67300Q4918P8495j04871Q8977J24017M0414L43594q2521J84525J83924j36195
8997D37977l61992k14965j2528J2117K0742p3311J45844J35481k0460l37286o8412
8986c36793M64002L84289q8626j75963m3990Q4753L0562j79672J85454L47051
8976F71067J54068j74894m80444n5055L02904r4942m52550j16785K57742K40781
8966B51892j7519o0826M3351l00327J1311L06713m7748J20958j78399l26576K10787
$$ plain form
8955 13617 34968 -186764 7138 261078 561529 533686 666600 271140 -120156 -271343
8945 -271343 -434946 -118169 414564 610673 300334 -213415 -228359 -34686 65868 -114224
8935 -114224 -124001 336149 374175 -41109 -595467 -355684 169279 273632 158848 60525
8925 60525 24406 -115121 11201 64191 -114589 -323941 -621491 -731023 -512679 -610571
8915 -610571 -908992 -619509 -421405 -436441 -639837 -778027 -644634 -355127 -192904 -218080
8905 -218080 -6517 -115259 108144 131355 -268602 -140218 31079 -90215 79846 416293
8895 416293 27512 -138728 120056 -193239 -151881 -274452 -305340 -361451 -421381 -182405
8885 -182405 -21553 -6688 130161 44007 -1741 -441707 58554 447845 241687 183471
$$ packed form
8955A3617K1351k21732J93902K53940L00451k7843J32914l95460l91296j51187
8945b71343j63603L16777N32733J96109l10339n13749j4944J93673J00554j80092
8935a14224r777M60150L8026m15284n54358K39783N24963J04353j14784r8323
8925F0525l6119j39527J26322N2990j78780k09352k97550j09532K18344r7892
8915f10571k98421K89483J98104j5036k03396j38190J33393K89507J62223k5176
8905b18080K11563j08742K23403K3211l99957J28384J71297j21294J70061L36447
8895D16293l88781j66240K58784l13295M1358j22571l0888n6111n9930K38976
8885a82405J60852J4865J36849q6154m5748m39966N00261L89291k06158n8216
$$ plain form
8875 183471 121001 -119555 -180221 -318321 -420316 -156562 -7623 -97181 -10030 42779 135042
8864 135042 479849 396311 254047 193049 154837 134275 -222320 -127464 101941 185728 107508
8853 107508 10146 -297172 -498928 -338337 -247385 -351259 -522940 -406377 -315873 -225677
8843 -225677 -163947 -14151 61107 22322 111333 23133 7326 68333 359699 494517 111450
8832 111450 221188 83150 -73268 33190 344252 401830 419007 482246 393777 358728 159362
8821 159362 -291937 -437753 -375199 -341794 -182934 -312419 -163476 -21588 -19660 -95098 -343416
8810 -343416 -407757 -486733 -50002 90882 -149253 -315082 -448231 -467648 -384183 -169232
8800 -169232 177797 222538 53709 127346 -77802 -273949 -162276 -142253 365853 504152
$$ packed form
8875A83471o2470k40556o0666j38100j01995K63754J48939q9558Q7151N2809R2263
8864A35042L44807q3538j42264o0998l8212k0562l56595R4856K29405Q3787p8220
8853A07508r7362l07318k01756J60591R0952j03874j71681J16563R0504R0196
8843b25677O1730J49796P5258l8785Q9011q8200j5807O1007K91366J34818l83067
8832A11450J09738j38038j56418J06458L11062N7578J7177O3239q8469l5049j99366
8821A59362m51299j45816O2554L3405J58860j29485J48943J41888J928p5438k48318
8810c43416o4341p8976M36731J40884k40135j65829j33149j9417Q3465K14951
8800a69232L47029M4741j68829P3637k05148j96147J11673K0023N08106J38299
$$ plain form
8790 504152 407621 54393 298205 624243 601419 521682 354026 5497 -339337 -268025
8780 -268025 -179898 -60638 144310 -183566 -150204 -70295 27659 -146702 -251433 -436882
8770 -436882 -444912 -438036 -280867 -187056 -129559 -140982 -81731 245757 130892 959 218327
8759 218327 422190 160802 400978 360685 304291 174453 85994 -152087 -85101 -130501 -121801
8748 -121801 -113578 -236398 -293141 -445415 -150403 144776 211221 -83568 -322048 -231772 184792
8737 184792 413416 324123 234160 -44995 -399935 -497338 -382975 -442341 -544180 -367121
8727 -367121 -245343 -121004 -51136 -131810 -362234 -115667 293043 488148 88920 -23844
8717 -23844 66998 -132674 -436430 -211369 -280 72673 208122 135946 -94772 -290470
$$ packed form
8790E04152r6531l53228K43812L26038k2824p9737j67656l48529l44834P1312
8780b68025Q8127J19260K04948l27876L3362P9909R7954j74361j04731j85449
8770d36882q030O876J57169R3811N7497j1423N9251L27488j14865j29933K17368
8759B18327K03863k61388K40176m0293n6394j29838q8459k38081O6986m5400Q700
8748a21801Q223j22820n6743j52274K95012K95179O6445k94789k38480R0276M16564
8737A84792K28624q9293q9963k79155l54940r7403J14363n9366j01839J77059
8727c67121J21778J24339O9868q0674k30424K46567M08710J95105l99228j12764
8717b3844R0842j99672l03756K25061K11089P2953J35449p2176k30718j95698
$$ plain form
8707 -290470 -139666 1159 75086 -8136 37650 17003 -11385 -122668 322082 601644 379964
8696 379964 215375 193936 72218 43898 38476 256056 351210 205712 146048 -103714 -355555
8685 -355555 -148479 -28067 -107206 -118058 -84255 -216579 -172756 -186369 -411361 -287948 -96432
8674 -96432 -30481 -93306 -357254 -550929 -412567 -406119 -33777 8934 -3252 59955 263191
8663 263191 248514 172966 -79036 -128775 -381124 -748459 -531769 -261515 -611995 -768792
8653 -768792 -158772 -21967 -263914 -338498 -270790 66848 237761 5991 -194377 -82369
8643 -82369 30985 -158540 -528850 -669198 -449699 -300188 -484670 -643584 -528039 -244904
8633 -244904 -29324 -255635 -367717 -267768 -210145 -52518 126453 25820 192102 11405
$$ packed form
8707b90470J50804J40825P3927q3222M5786k0647k8388j11283M44750K79562k21680
8696C79964j64589k1439j21718k8320n422K17580R5154j45498n9664k49762k51841
8685c55555K07076J20412p9139j0852L3803j32324M3823j3613k24992J23413J91516
8674i6432O5951o2825k63948j93675J38362O448L72342M2711j2186O3207K03236
8663B63191j4677p5548k52002m9739k52349l67335K16690K70254l50480j56797
8653g68792O10020J36805k41947p4584O7708L37638J70913k31770k00368J12008
8643h2369J13354j89525l70310j40348K19499J49511j84482j58914J15545K83135
8633b44904K15580k26311j12082R9949N7623J57627J78971j00633J66282j80697
$$ plain form
8623 11405 18389 48344 75587 120184 129363 123028 126806 129365 232652 -24476 -262774 -258516
8611 -258516 -352685 -461501 -485309 -327676 -207130 -292058 -256836 -114749 285314 368668 416917
8600 416917 251159 141223 97432 -254180 -38217 121634 97598 -34437 -154157 -356228
8590 -356228 -192889 -116971 88713 122440 6254 50760 15288 -90769 -54477 40869 475533
8579 475533 569318 602589 507584 402236 501596 137513 -47446 -358303 -540462 -343935
8569 -343935 -303150 -189554 -187010 -116558 -56699 14640 105449 23258 133045 -35119 -54959
8558 -54959 379780 411829 549440 528141 109181 313700 337727 400925 226067 -26140 -87561
8547 -87561 -391675 -109564 112109 187439 -32781 55577 427737 417783 361798 213950 140131
$$ packed form
8623A1405O984K9955K7243M4597R179o335L778K559J03287k57128k38298M258
8611b58516r4169j08816k3808J57633J20546q4928L5222J42087M00063Q3354M8249
8600D16917j65758j09936m3791l51612K15963J59851k4036j32035j19720k02071
8590c56228J63339P5918K05684L3727j16186M4506l5472j06057L6292R5346M34664
8579D75533R3785L3271r5005j05348R9360l64083j84959l10857j82159J96527
8569c43935M0785J13596K544P0452N9859P1339R0809q2191J09787j68164j9840
8558e4959M34739L2049J37611k1299m18960K04519K4027O3198j74858k52207o1421
8547h7561l04114K82111K21673P5330k20220Q8358L72160r954n5985j47848p3819
$$ plain form
8536 140131 335267 249496 281279 348375 501536 324341 345775 343207 246671 228238 49646
8525 49646 182759 308286 83207 -645091 -747259 -484370 -195847 -117406 25117 233635
8515 233635 607573 585018 355857 391118 429218 77892 124808 220866 -100034 -96252 -312373
8504 -312373 -239420 -91720 -123441 -332168 25859 110154 60796 259191 391520 376030 194219
8493 194219 212755 -49725 -207118 -320955 103294 570367 651900 313915 294115 570732
8483 570732 490174 357553 55628 -213872 -195576 -135899 -229530 -215966 -266963 -413004 -401401
8472 -401401 -233989 -97778 -54344 74101 209224 222792 276841 429853 235946 169062
8462 169062 -49171 -423866 -692338 -608904 -552297 -289488 -207930 -24258 44666 -241682
$$ packed form
8536A40131J95136q5771L1783O7096J53161j77195K1434k568r6536j8433j78592
8525D9646J33113J25527k25079p28298j02168K62889K88523P8441J42523K08518
8515B33635L73938k2555k29161L5261L8100l51326M6916R6058l20900L782k16121
8504c12373P2953J47700l1721k08727L58027Q4295m9358J98395J32329j5490j81811
8493A94219J8536k62480j57393j13837M24249M67073Q1533l37985j9800K76617
8483E70732q0558j32621l01925k69500J8296N9677r3631J3564n0997j46041J1603
8472d01401J67412J36211M3434J28445J35123J3568N4049J53012j93907o6884
8462A69062k18233l74695k68472Q3434N6607K62809Q1558J83672O8924k86348
$$ plain form
8452 -241682 -158498 102107 320857 373107 383287 556704 424415 249885 311757 125706
8442 125706 271545 766266 563091 350415 386751 272416 380509 7768 -486156 -411929
8432 -411929 -183392 -105584 112902 192757 134256 -116573 -147410 68174 399028 172467
8422 172467 -226243 -271751 -182782 44160 164001 195886 397550 165134 -256147 -305268
8412 -305268 -486550 -303328 -204547 -216091 -241224 -320776 -496267 -525182 -230749 121474 469596
8401 469596 439841 188381 159487 -127548 -69812 -223181 -100796 -11034 -191292 -206553 -591552
8390 -591552 -562289 -586656 -499619 -398467 -113131 -13657 34157 30296 -29795 64295 6207
8379 6207 -53019 17830 -199855 -347853 -300755 59151 -148086 -648781 -728625 -573481 -556317
$$ packed form
8452b41682Q3184K60605K18750N2250J0180J73417j32289j74530O1872j86051
8442A25706J45839M94721k03175k12676L6336j14335J08093l72741m93924P4227
8432d11929K28537P7808K18486P9855n8501k50829l0837K15584L30854k26561
8422A72467l98710m5508Q8969K26942J19841L1885K01664k32416m21281m9121
8412c05268j81282J83222R8781j1544k5133p9552j75491k8915K94433L52223L48122
8401D69596k9755k51460k8894k87035N7736j53369J22385Q9762j80258j5261l84999
8390e91552K9263k4367Q7037J01152K85336R9474M7814l861o0091R4090n8088
8379F207n9226P0849k17685j47998M7098L59906k07237n00695p9844J55144J7164
$$ plain form
8368 -556317 -368671 -247508 -459372 -475108 -564086 -501973 -405682 -614886 -690719 -585963 -575723
8357 -575723 -425706 -455319 -659597 -630598 -417107 -384059 -403601 -37064 -25398 -273630 -335497
8346 -335497 -34257 126024 -40411 -291638 -439147 -310391 188540 263376 389578 187302
8336 187302 -20565 -13436 89852 -166607 -569267 -721428 -321805 -39230 -246219 -154265
8326 -154265 -111228 -188490 64682 30568 -580606 -849105 -520717 122206 186019 -56985
8316 -56985 -356380 -429246 -233802 202574 681996 492400 53011 200297 429279 434494
8306 434494 372854 99842 -12485 298839 281734 297101 52203 8651 -76326 -368038 -540300
8295 -540300 -581336 -427927 -184887 -80565 -280368 -191886 210685 491873 269790 217872
$$ packed form
8368e56317J87646J21163k11864j5736q8978O2113R6291k09204p5833J04756J0240
8357e75723J50017k9613k04278K8999K13491L3048j9542L66537J1666k48232o1867
8346c35497L01240J60281j66435k51227j47509J28756M98931P4836J26202k02276
8336A87302k07867P129J03288k56459m02660j52161L99623K82575k06989R1954
8326a54265M3037p7262K53172l4114o11174k68499L28388O42923O3813k43004
8316e6985k99395p2866J95444M36376M79422j89596m39389J47286K28982N215
8306D34494o1640k73012j12327L11324j7105J5367k44898m3552q4977k91712j72262
8295e40300m1036J53409K43040J04322j99803Q8482M02571K81188k22083n1918
$$ plain form
8285 217872 399997 253663 137461 349302 421254 143282 -203778 -112936 182621 -2421
8275 -2421 -209079 -2031 42368 340510 318955 436914 567301 344847 219902 111420
8265 111420 265340 273926 307800 447238 482805 537889 569062 700206 574120 273482 -83149
8254 -83149 -56056 142913 222006 320874 662314 711776 802967 782932 426205 -358174 -378583
8243 -378583 141777 127987 -144173 37116 285766 431614 180613 141205 539 -217458
8233 -217458 -50291 -181519 -193562 -165986 56741 220453 273448 14522 -185361 -11378
8223 -11378 45453 58257 -19536 397131 840663 633215 235947 -73111 -138239 -180909 -311183
8212 -311183 -158341 29746 198301 56011 -178050 -206383 -122835 -156302 -263772 -135142
$$ packed form
8285B17872J82125j46334j16202K11841P1952k77972l47060R0842K95557j85042
8275b421k06658K07048M4399K98142k1555J17959J30387k22454j24945j08482
8265A11420J53920Q586L3874J39438L5567N5084L1173J31144j26086l00638l56631
8254h3149K7093J98969P9093R8868L41440M9462R1191k0035l56727p84379k0409
8243c78583N20360j3790k72160J81289K48650J45848k51001l9408j40666k17997
8233b17458J67167j31228j2043K7576K22727J63712N2995k58926j99883J73983
8223a1378N6831J2804p7793M16667M43532k07448l97268l09058o5128m2670j30274
8212c11183J52842J88087J68555j42290k34061k8333Q3548l3467j07470J28630
$$ plain form
8202 -135142 -79048 76513 -23308 -40242 104288 134569 294880 419075 419985 91187 180069
8191 180069 101626 -107434 -358881 -416685 -595326 -567872 -391373 -375231 -131534 208910
8181 208910 365900 382234 298679 254560 113706 285794 339278 165130 -177418 -394302
8171 -394302 -46145 89078 -78781 -199354 -110451 -8255 74484 211359 408448 346070
8161 346070 222439 218433 460489 239572 -207171 81556 342362 97460 -184235 -409115
8151 -409115 -394195 78848 7707 -201641 -17868 85753 -301798 -1031258 -931635 -795208
8141 -795208 -206186 -37847 -143383 -185918 6900 -117596 -3686 -263725 -357076 -75298
8131 -75298 -138154 -10325 -134349 -78918 314899 318743 -61603 -332992 -361334 -529074 -440547
$$ packed form
8202a35142N6094J55561r9821j6934J44530L0281J60311J24195R10l28798Q8882
8191A80069p8443k09060k51447n7804j78641K7454J76499J6142K43697L40444
8181B08910J56990J6334q3555m4119j40854J72088N3484j74148l42548k16884
8171c94302L48157J35223j67859j20573Q8903J02196Q2739J36875J97089o2378
8161C46070j23631m006K42056k20917m46743K88727K60806k44902k81695k24880
8151d09115J4920M73043p1141k09348J83773J03621l87551p29460R9623J36427
8141g95208N89022J68339j05536m2535J92818j24496J13910k60039r3351K81778
8131g5298o2856J27829j24024N5431L93817L844l80346k71389k8342j67740Q8527
$$ plain form
8120 -440547 -383008 -327140 129897 395026 300474 -165622 -399957 -251325 -263885 -10701
8110 -10701 348894 123967 -266614 -575067 -835500 -581895 -461539 -475045 -262747 -67892
8100 -67892 21059 -55260 -128244 -187993 -65168 -331517 -230460 62968 64780 -96692 -270012
8089 -270012 -357316 -259484 -323865 -365834 -506814 -573020 -206796 18439 -529643 -590735 -495545
8078 -495545 -460429 -472908 -236676 -319047 -823265 -815164 -585402 -217038 88650 225830 170918
8067 170918 46578 222235 419282 435575 354868 603502 534594 342547 281367 133704
8057 133704 291025 214001 46738 203079 602560 442987 166035 201690 53062 90450
8047 90450 166782 -199980 -356244 -56766 -20069 -326955 -335207 -13393 281319 192446 255869
$$ packed form
8120d40547N7539N5868M57037K65129r4552m66096k34335J48632j2560K53184
8110a0701L59595k24927l90581l08453k60433K53605J20356j3506K12298J94855
8100f7892Q8951p6319p2984n9749J22825k66349J01057K93428J812j61472j73320
8089b70012q7304R7832o4381m1969j40980o6206L66224K25235n48082o1092R5190
8078d95545L5116j2479K36232q2371n04218Q101K29762L68364L05688J37180n4912
8067A70918j24340J75657J97047J6293q0707K48634o8908j92047o1180j47663
8057A33704J57321p7024j67263J56341L99481j59573k76952L5655j48628L7388
8047I0450P6332l66762j56264K99478L6697l06886q252L21814K94712q8873O3423
$$ plain form
8036 255869 255349 -49585 -125557 -58516 11943 108586 -24610 22616 -45771 -64718 114430
8025 114430 95409 37979 -329351 -182398 60871 64358 180925 61810 54217 18963 193990
8014 193990 67186 -422734 -352945 109946 181227 -23576 -445757 -323967 109896 113718
8004 113718 -61479 -289695 -524940 -257766 114721 277529 145886 144741 396211 599706
7994 599706 277541 180425 491828 654289 522820 350800 304364 127003 161454 147810
7984 147810 87825 290221 318180 233941 35663 -207707 -108346 41076 138698 105862 -86482
7973 -86482 -43441 -129780 -264598 -59801 370884 352057 -80926 -240305 94782 163793 146289
7962 146289 -17244 -109465 -335154 -268958 -154877 224469 113099 218993 243008 -24102
$$ packed form
8036B55869n20l04934p5972O7041P0459R6643j33196M7226o8387j8947J79148
8025A14430j9021n7430l67330J46953K43269L487J16567j19115p593l5254J75027
8014A93990j26804m89920O9789M62891P1281k04803m22181J21790M33863L822
8004A13718j75197k28216k35245K67174L72487J62808j31643j145K51470K03495
7994E99706l22165r7116L11403J62461j31469j72020m6436j77361L4451j3644
7984A47810n9985K02396K7959q4239j98278k43370R9361J49422R7622l2836j92344
7973h6482M3041q6339j34818K04797M30685j8827m32983j59379L35087O9011j7504
7962A46289j63533r2221k25689O6196J14081L79346j11370J05894K4015k67110
$$ plain form
7952 -24102 -422487 -152004 100620 25491 -235876 146059 298827 98125 -140310 -86749
7942 -86749 -7148 25382 219075 107177 -36812 -250265 15023 327978 345208 669190
7932 669190 675874 436723 185982 -53888 -156964 44639 354569 65318 -92933 72029
7922 72029 193517 187989 391816 398650 518652 491094 156688 359907 180808 23080 15233
7911 15233 -342792 -437326 -405250 117656 125258 -151339 76842 61101 -22950 235725 451272
7900 451272 326459 71767 97832 111006 150058 41637 115438 -123137 -327970 48332
7890 48332 68102 -142157 -489449 -430563 -83850 112500 -48508 -230448 -85732 4802
7880 4802 -176885 -254122 -93182 151872 55623 -60513 -58834 -160404 -379824 -440034 -289557
$$ packed form
7952b4102l98385K70483K52624p5129k61367L81935J52768k00702k38435N3561
7942h6749P9601L2530J93693j11898j43989k13453K65288L12955J7230L23982
7932F69190O684k39151k50741k39870j03076K01603L09930k89251j58251J64962
7922G2029J21488n528K03827O834J20002k7558l34406K03219j79099j57728p847
7911A5233l58025r4534L2076N22906P602k76597K28181j5741q4051K58675K15547
7900D51272j24813k54692K6065J3174L9052j08421P3801k38575k04833L76302
7890D8332J9770k10259l47292N8886L46713J96350j61008j81940J44716R0534
7880D802j81687p7237J60940K45054r6249j16136J679j01570k19420o0210J50477
$$ plain form
7869 -289557 -392317 -585883 -468835 -267252 17001 61158 -329067 -452078 -332740 13117
7859 13117 298072 278140 335418 187031 23965 54695 -4950 -450632 -423229 -243876 -133058
7848 -133058 -97170 -217419 -178266 -135257 118566 -99733 -193658 -231230 -111610 -46444 -268451
7837 -268451 -293425 -220966 -152012 -56579 -41374 -276683 -269327 16339 465222 511131 -112567
7826 -112567 -511370 -267059 -229213 -326029 -104643 132862 139203 -20610 -176314 162831
7816 162831 529353 386074 351420 197534 261833 264086 223801 217809 265331 16649 -76722
7805 -76722 -229522 -489235 -486512 -164549 119540 478998 147859 -222074 88441 327835
7795 327835 96826 -325580 -226605 -20092 -195818 -304191 -71145 -48225 -411740 -434225
$$ packed form
7869b89557j02760j93566J17048K01583K84253M4157l90225j23011J19338L45857
7859A3117K84955j9932N7278j48387j63066L0730n9645m45682K7403J79353J10818
7848a33058L5888j20249L9153M3009K53823k18299r3925l7572J19620O5166k22007
7837b68451k4974P2459O8954R5433J5205k35309P356K85666M48883M5909o23698
7826a12567l98803K44311L7846r6816K21386K37505O341j59813j55704L39145
7816A62831L66522j43279l4654j53886O4299K253m0285n992M7522k48682r3371
7805g6722j52800k59713K723L21963K84089L59458l31139l69933L10515K39394
7795C27835k31009m22406R8975K06513j75726j08373K33046K2920l63515k2485
$$ plain form
7785 -434225 -250460 -495701 -748869 -549294 -257816 -342536 -379927 -147059 -126548 -204348
7775 -204348 -99593 416340 246009 30850 -78915 -60945 -289340 -458211 -790645 -851783
7765 -851783 -384089 16321 -32588 -244375 -272765 -77659 -308361 -718862 -960120 -1027900
7755 -1027900 -525379 -211664 -156090 -23508 -93121 -302817 -8791 -15008 -36795 -48986 -192296
7744 -192296 -358990 -14329 -253796 -983411 -1075228 -650434 -74451 -269714 -218523 -175838
7734 -175838 -318859 -482529 -507860 -215839 -51569 132946 73332 -190124 -366887 -414783
7724 -414783 -295085 -62715 -149471 -514208 -591074 -768022 -645947 -654002 -460976 -69699
7714 -69699 46510 -121109 -332133 -616618 -516675 -140925 177308 147546 297249 275787
$$ packed form
7785d34225J83765k45241k53168J99575K91478q4720l7391K32868K0511p7800
7775b04348J04755N15933j70331k15159j09765J7970k28395j68871l32434o1138
7765h51783M67694M00410m8909k11787k8390J95106k30702m10501k41258o7780
7755a027900N02521L13715N5574J32582o9613k09696K94026o217k1787j2191j43310
7744a92296j66694L44661k39467p29615r1817M24794N75983j95263N1191M2685
7734a75838j43021j63670k5331K92021J64270J84515n9614k63456j76763m7896
7724d14783J19698K32370q6756l64737p6866j76948J22075q055J93026L91277
7714f9699J16209j67619k11024k84485R9943L75750L18233k9762J49703k1462
$$ plain form
7704 275787 -113372 -560834 -74246 -201500 -636966 -793521 -763466 -589993 -165382 211185
7694 211185 -57598 42003 322928 265983 355137 558074 358338 342931 522919 436999 61334
7683 61334 57405 215934 -149864 -286184 39441 -15209 -130864 -39103 -308855 -482259 -627721
7672 -627721 -545135 -605606 -633304 -646848 -209043 -19208 153855 201541 155129 -142042 -2606
7661 -2606 -23340 -222893 -166151 -499719 -123611 193806 207267 344754 441894 328719 61467
7650 61467 8549 -395731 -223549 332086 270181 -27317 -337042 -151972 -69805 -153116 -488370
7639 -488370 -872924 -600037 -97127 499807 290043 -68879 107108 70829 -213571 -113389
7629 -113389 -270598 -198362 -387681 -369349 -13599 116323 25111 -409641 -274143 -278625 -446596
$$ packed form
7704B75787l89159m47462M86588j27254m35466j56555L0055J73473M24611L76567
7694B11185k68783R9601K80925n6945Q9154K02937j99736j5407J79988q5920l75665
7683F1334l929J58529l65798j36320L25625n4650j15655R1761k69752j73404j45462
7672f27721Q2586o0471k7698j3544M37805J89835J73063M7686m6412k97171J39436
7661b606k0734j99553N6742l33568L76108L17417J3461J37487R7140j13175k67252
7650F1467n2918m04280J72182N55635o1905k97498l09725J85070Q2167q3311l35254
7639d88370l84554K72887N02910N96934k09764l58922J75987l6279k84400J00182
7629a13389j57209P2236j89319J8332L55750J29922r1212m34752J35498m482j67971
$$ plain form
7618 -446596 -718426 -589313 -164919 -127602 -302241 9914 153669 189039 109914 47674
7608 47674 -205941 -481535 -355254 -278688 -60809 -222397 -192443 -362691 -600072 -502466
7598 -502466 -494823 -87143 36394 -34742 -234253 -258259 -202333 -483232 -12336 110776 260921
7587 260921 364297 208202 -51489 -248995 -337452 -18382 -24109 -250369 -359449 -314376
7577 -314376 -223121 34407 -186633 -418336 -542440 -511557 -449660 -316529 -179842 240659
7567 240659 300529 356830 188155 101416 176311 459139 308623 267240 188010 49244 -6729
7556 -6729 103068 379569 268692 -102072 -257268 -422897 -599948 -419625 -174375 -137479
7546 -137479 -151797 -47964 223117 21268 156533 298951 211978 205683 69385 287052
$$ packed form
7618d46596k71830J29113M24394L7317j74639L12155J43755L5370p9125o2240
7608D7674k53615k75594J26281P6566K17879j61588K9954j70248k37381R7606
7598e02466P643M07680J23537p1136j99511k4006N5926k80899M70896J23112J50145
7587B60921J03376j56095k59691j97506q8457L19070n727k26260j09080M5073
7577c14376R1255K57528k21040k31703j24104L0883O1897J33131J36687M20501
7567B40659N9870N6301j68675q6739P4895K82828j50516m1383p9230j38766n5973
7556f729J09797K76501j10877l70764j55196j65629j77051J80323K45250L6896
7546a37479j4318J03833K71081k01849J35265J42418q6973o295j36298K17667
$$ plain form
7536 287052 497298 352726 75030 -86741 -442705 -165282 166178 12152 172829 307763
7526 307763 509303 445673 19476 36372 -100648 -29587 77099 -3459 -303340 -386323 -200341
7515 -200341 -62009 -38820 -3188 -181209 -43057 -285410 -386266 -64742 -202238 -399590
7505 -399590 -484613 -389513 -235434 -186812 -353424 -611818 -354041 -82647 92700 110788
7495 110788 88694 157457 255634 370493 333486 249962 317260 71834 -206069 -336544 -423187
7484 -423187 -361499 -243675 -191480 -151535 -8960 56051 -56594 79558 351897 319568 213419
7473 213419 494043 651201 655642 483587 552596 461040 393517 229390 -144218 -260066 -45136
7462 -45136 190135 167708 56976 85196 314378 80365 73126 234696 157492 -166442 -94699
$$ packed form
7536B87052K10246j44572k77696j61771l55964K77423L31460j54026J60677J34934
7526C07763K01540o3630m26197J6896j37020P1061J06686q0558k99881q2983J85982
7515b00341J38332K3189L5632j78021J38152k42353j00856L21524j37496j97352
7505c99590q5023R5100J54079M8622j66612k58394K57777K71394J75347J8088
7495A10788k2094O8763R8177J14859l7007q3524O7298k45426k77903j30475q6643
7484d23187O1688J17824N2195L9945J42575O5011j12645J36152K72339l2329j06149
7473B13419K80624J57158M441j72055O9009r1556o7523j64127l73608j15848K14930
7462d5136K35271k2427j10732K8220K29182k34013p239J61570p7204l23934P1743
$$ plain form
7451 -94699 161762 182118 344956 390068 628408 400318 -58671 -379531 -76576 307470
7441 307470 495090 581232 210914 -201815 -440852 -358098 45260 -30441 -280348 -159681
7431 -159681 -210552 -229707 -333068 -68396 34361 -182800 149057 260898 212390 289609
7421 289609 155594 274221 264464 401322 134161 -103136 -149485 138391 320602 331209
7411 331209 91066 265600 606094 476692 266755 203345 72879 144675 120604 307082
7401 307082 472853 483923 -99481 -184231 -367462 -569286 -514656 -426289 -336411 -215233 -319764
7390 -319764 -388828 -327249 -506918 -700664 -425934 -375465 -364730 -469199 -401876 55001 264717
7379 264717 -73414 176196 772559 608026 98853 -426912 -378872 -128189 310720 451149
$$ packed form
7451i4699K56461K0356J62838M5112K38340k28090m58989l20860L02955L84046
7441C07470J87620Q6142l70318m12729k39037Q2754M03358p5701k49907J20667
7431a59681n0871j9155j03361K64672J02757k17161L31857J11841m8508P7219
7421B89609j34015J18627r757J36858k67161k37297m6349K87876J82211J0607
7411C31209k40143J74534L40494j29402k09937o3410j30466P1796k4071J86478
7401C07082J65771J1070n83404q4750j83231k01824N4630Q8367Q9878J21178j04531
7390c19764o9064O1579j79669j93746K74730N0469J0735j04469O7323M56877K09716
7379B64717l38131K49610N96363j64533n09173n25765M8040K50683M38909J40429
$$ plain form
7369 451149 208503 93135 141934 3589 160562 247775 -48 113778 34909 -319356
7359 -319356 -397841 -207233 -180305 -554020 -443486 -329906 -192867 -13436 -268973 -560929
7349 -560929 -276971 -259025 -32671 17612 -227170 181208 559094 360228 330851 145339
7339 145339 -11355 344871 202379 -27899 -57479 -328681 -304292 -196594 59311 -112162
7329 -112162 -208389 -145099 251425 341404 340399 138877 -68566 -247508 -269276 -268658 -292313
7318 -292313 -6418 261419 448282 435134 71293 -394467 -571015 -445854 -299330 -273198
7308 -273198 -298361 17582 194490 139850 -7484 132802 -113196 -298118 92287 219339
7298 219339 498039 529752 496634 246413 -151013 -48749 252478 180993 426987 196374
$$ packed form
7369D51149k42646j15368M8799j38345J56973Q7213k47823J13826p8869l54265
7359c19356p8485J90608K6928l73715J10534J13580J37039J79431k55537k91956
7349e60929K83958J7946K26354N0283k44782M08378L77886j98866k9377j85512
7339A45339j56694L56226j42492k30278k9580k71202K4389J07698K55905j71473
7329a12162r6227O3290L96524Q9979j005k01522k07443j78942k1768O18k3655
7318b92313K85895K67837J86863j3148l63841m65760j76548J25161J46524K6132
7308b73198k5163L15943J76908n4640j47334J40286k45998j84922L90405J27052
7298B19339K78700L1713l3118k50221l97426J02264L01227p1485K45994k30613
$$ plain form
7288 196374 31920 -316313 -155059 -45218 -187607 9602 45813 -123154 17921 198567
7278 198567 65667 -311414 -91895 37618 158592 190898 -186339 -402432 -713256 -554804
7268 -554804 -554830 -157991 157965 258546 -136526 -294770 -306100 -334369 -503088 -466353 -233536
7257 -233536 -244526 -358607 -124899 -3331 -76780 21460 61758 79967 59068 19967 -90434
7246 -90434 -57397 -23488 -210806 -262807 -99268 -203763 -25019 232065 222731 94591 -357424
7235 -357424 -225571 148860 342365 158841 -211600 -538970 -24593 4664 -156291 -399872
7225 -399872 -194456 -55597 50822 -18951 -185380 -275439 -25562 303911 514106 281661
7215 281661 -228999 -604922 -665109 -411090 -241024 -263159 43666 40683 -115197 178333
$$ packed form
7288A96374j64454l48233J61254J09841j42389J97209L6211j68967J41075J80646
7278A98567j32900l77081K19519J29513J20974L2306l77237k16093l10824J58452
7268e54804k6L96839L15956J00581l95072j58244j1330k8269j68719L6735K32817
7257b33536j0990j14081K33708J21568p3449R8240M0298J8209k0899l9101j10401
7246i0434L3037L3909j87318n2001J63539j04495J78744K57084r334j28140m52015
7235c57424J31853L74431J93505j83524l70441l27370N14377K9257j60955k43581
7225c99872K05416J38859J06419o9773j66429r0059K49877L29473K10195k32445
7215B81661n10660l75923o0187K54019J70066k2135L06825k983j55880K93530
$$ plain form
7205 178333 618405 919044 687213 301747 308957 335976 416953 388880 123402 356144 416067
7194 416067 175251 143518 -23489 -21712 236059 220680 192250 -54363 -139233 -78209 53256
7183 53256 172909 85891 176286 127923 137024 -124227 -290043 -100162 174346 187969 -185389
7172 -185389 -544128 -373721 -238422 -351213 -336359 280431 282719 -169701 -491771 -315031
7162 -315031 -173652 3161 53124 85719 368890 628561 763857 786004 857111 253547
7152 253547 -12706 107257 -119984 -425382 -393043 -20802 -74876 62397 -66945 -367278
7142 -367278 -538680 -574713 -36915 253107 225762 67553 -41581 231921 362982 -24177
7132 -24177 -304050 -94504 205008 101418 -351073 -499625 -393501 -201663 -288788 -339639
$$ packed form
7205A78333M40072L00639k31831l85466P210K7019Q0977k8073k65478K32742N9923
7194D16067k40816l1733j67007J777K57771j5379k8430k46613q4870O1024J31465
7183E3256J19653q7018R0395m8363R101k61251j65816J89881K74508J3623l73358
7172a85389l58739J70407J35299j12791J4854O16790K288m52420l22070J76740
7162c15031J41379J76813M9963L2595K83171K59671J35296K2147P1107o03564
7152B53547k66253J19963k27241l05398L2339L72241n4074J37273j29342l00333
7142c67278j71402l6033N37798K90022k7345j58209j09134K73502J31061l87159
7132b4177k79873K09546K99512j03590m52491j48552J06124J91838q7125n0851
$$ plain form
7122 -339639 -229188 -169441 199254 237496 -82553 -76047 458727 415001 346888 282859 282154
7111 282154 62396 225685 205880 -45327 -197245 114203 149452 399793 -3153 -138352
7101 -138352 60026 162938 165690 197558 218167 387565 490460 498740 194786 194910 195107 9163
7089 9163 -162639 -232000 -94621 -287604 -414371 -248979 -215405 -368086 -348656 -270892 -12001
7078 -12001 55583 -95820 -128191 162725 99724 -57716 67374 -35939 119843 -65180
7068 -65180 34895 86770 116101 219179 238469 173596 188362 327419 385217 79752 -408696
7057 -408696 -327676 -33261 227058 180386 31121 -132517 -220893 -122809 181760 -79172
7047 -79172 -335241 -72166 -44365 -93721 -255842 -201090 -387590 -614317 -626764 -270275 -214544
$$ packed form
7122c39639J10451N9747L68695L8242l20049O506N34774m3726o8113o4029p05
7111B82154k19758J63289j9805k51207j51918L11448L5249K50341m02946j35199
7101a38352J98378J02912K752L1868K0609J69398J02895Q280l03954J24J97j85944
7089I163j71802o9361J37379j92983j26767J65392L3574j52681J9430P7764K58891
7078a2001O7584j51403l2371K90916o3001j57440J25090j03313J55782j85023
7068f5180J00075N1875K9331J03078J9290o4873J4766J39057N7798l05465m88448
7057d08696Q1020K94415K60319m6672j49265j63638q8376R8084L04569k60932
7047g9172k56069K63075K7801m9356j62121N4752j86500k26727j2447L56489N5731
$$ plain form
7036 -214544 -526963 -313558 -209954 -165794 -430055 -335329 -245898 -344478 -353702 -13802 -250366
7025 -250366 -443504 20775 75251 7668 207065 82543 -176072 104670 156609 -558320
7015 -558320 -721750 -380365 -111986 -856 210727 388242 367557 418706 164857 -55488
7005 -55488 -174113 -301056 -82110 229916 76990 237593 5372 27967 194355 25404
6995 25404 -35889 -193906 13466 -21338 -536594 -454499 -308480 -207065 -325509 -155831
6985 -155831 -93898 -36990 20308 32911 -68785 -238370 26170 -109196 -378246 -219227
6975 -219227 -62357 266380 313498 358919 14824 -155305 -15305 -126382 -292141 -366053
6965 -366053 -344585 -88846 -131656 -489717 -402050 -475867 -273737 -225181 48539 432196 515200
$$ packed form
7036b14544l12419K13405J03604M4160k64261R4726Q9431r8580r224L39900k36564
7025b50366j93138M64279N4476o7583J99397j24522k58615K80742N1939p14929
7015e58320j63430L41385K68379J11130K11583J77515k0685N1149k53849k20345
7005e5488j18625j26943K18946L12026j52926J60603k32221K2595J66388j68951
6995B5404o1293j58017K07372l4804n15256Q2095J46019J01415j18444J69678
6985a55831O1933N6908N7298J2603j01696j69585K64540j35366k69050J59019
6975b19227J56870L28737M7118M5421l44095j70129J40000j11077j65759p3912
6965c66053K1468K55739m2810l58061Q7667p3817K02130M8556K73720L83657Q3004
$$ plain form
6954 515200 -59628 -420212 -376513 205353 446717 261602 18341 -275293 -397730 -359803
6944 -359803 -217542 -284849 -356823 -225742 -406574 -471948 -403584 -317872 33547 369326 373606
6933 373606 336910 537836 275932 -200467 -258607 -352248 -413388 -498766 -311841 -280264 -313446
6922 -313446 -517151 -312766 -198753 151394 198871 304240 185773 -77334 -201512 -77209
6912 -77209 -173990 -117720 258342 239628 297163 453967 403157 619739 612177 467735 581518
6901 581518 513673 313241 499567 404416 357583 -24961 327826 717775 919227 705833
6891 705833 323179 -48443 7107 30609 123603 435923 447153 319468 470390 613064
6881 613064 229646 15698 -189455 -349923 -79160 61614 89352 -44094 -111021 -598900
$$ packed form
6954E15200n74828l60584M3699N81866K41364j85115k43261k93634j22437L7927
6944c59803J42261o7307p1974J31081j80832o5374O8364Q5712L51419L35779M280
6933C73606l6696K00926k61904m76399n8140r3641o1140q5378J86925L1577l3182
6922c13446k03705K04385J14013L50147M7477J05369j18467k63107j24178J24303
6912g7209r6781N6270L76062j8714N7535J56804n0810K16582p562j44442J13783
6901E81518o7845k00432J86326r5151m6833l82544L52787L89949K01452k13394
6891G05833l82654l71622N5550K3502R2994L12320J1230j27685J50922J42674
6881F13064l83418k13948k05153j60468K70763J40774K7738j33446o6927m87879
$$ plain form
6871 -598900 -597066 -337316 -137418 20430 362154 443264 591219 522349 323233 -126321
6861 -126321 -242797 177892 341736 431761 607871 518112 288081 -294858 -565361 -17027
6851 -17027 183677 171706 114178 35646 -221904 3942 238187 194762 93601 29271 398046
6840 398046 433409 189591 202373 -74475 103880 256233 187726 81778 426619 172410
6830 172410 -279235 -378997 -432866 -540581 -160524 -132164 70861 261922 300239 24080
6820 24080 -78059 135963 573572 656251 219191 -150131 -121588 -124127 -228225 -433807 -248498
6809 -248498 -221807 66609 2780 -135896 -327946 -298479 -122429 13774 74467 205004
6799 205004 297424 233700 379847 360320 158680 -52140 -126446 7098 -67697 70464 256141
$$ packed form
6871e98900J834K59750J99898J57848L41724Q1110J47955o8870j99116m49554
6861a26321j16476M20689J63844R0025J76110q9759k30031n82939k70503N48334
6851a7027K00704j1971n7528p8532k57550K25846K34245m3425j01161o4330L68775
6840C98046L5363k43818J2782k76848J78355J52353o8507j05948L44841k54209
6830A72410m51645r9762n3869j07715L80057K8360K03025J91061L8317k76159
6820B4080j02139K14022M37609Q2679m37060l69322K8543k539j04098k05582J85309
6809b48498K6691K88416o3829j38676j92050K9467J76050J36203O0693J30537
6799B05004R2420o3724J46147j9527k01640k10820p4306J33544p4795J38161J85677
$$ plain form
6788 256141 280615 367648 133390 -44199 -103979 -101569 181872 149551 -5579 -174855 -326454
6777 -326454 -439503 -575967 -426926 -323677 -44414 106782 87359 56121 124813 -55440
6767 -55440 235326 293108 314461 393556 326855 -111441 -382392 -414912 -466140 -138692 -30222
6756 -30222 -139346 -208349 30026 481480 364689 79558 3304 -268466 -76560 131703
6746 131703 31321 201668 339472 282231 -44009 -167038 -100473 87489 102289 282863
6736 282863 322532 146152 36160 184908 245361 81395 -171669 -349018 -157527 6405
6726 6405 -37412 -406387 -296625 -279150 -542426 -309937 -78444 202368 450113 542168 406767
6715 406767 120613 174851 -83657 -317554 -140550 116375 299068 277063 363202 58386
$$ packed form
6788B56141K4474Q7033k34258j77589n9780K410K83441l2321j55130j69276j51599
6777c26454j13049j36464J49041J03249K79263J51196j9423l1238O8692j80253
6767e5440K90766N7782K1353P9095o6701m38296k70951l2520n1228L27448J08470
6756c0222j09124o9003K38375M51454j16791k85131p6254k71770J91906K08263
6746A31703j00382J70347J37804n7241l26240j23029O6565J87962J4800J80574
6736B82863L9669j76380j09992J48748O0453j63966k53064j77349J91491J63932
6726F405m3817l68975J09762J7475k63276K32489K31493K80812K47745R2055j35401
6715D06767k86154N4238k58508k33897J77004K56925J82693k2005Q6139l04816
$$ plain form
6705 58386 -88129 -92413 -291251 -433707 -484143 -264399 196699 171197 207621 -77329 -180990
6694 -180990 -112640 77037 -159420 -29980 -187353 -316491 -176055 -55738 -173207 -421278
6684 -421278 -570116 -428806 -275800 12949 272304 295880 165816 50100 -120111 -164832
6674 -164832 -11329 169903 77465 256167 196427 342155 384454 315491 213566 230590 101390
6663 101390 36188 293143 74628 76570 -187578 -238732 48894 114754 -252077 -231369 -261945
6652 -261945 45213 -201127 -229459 -171959 -142578 16807 -108330 136640 -84407 79539
6642 79539 269613 232338 437728 358812 -174183 -278690 -255809 -178023 -10346 -3899 -192693
6631 -192693 -383689 -157787 -101395 -21120 228605 289525 230338 121503 103491 -80017 43118
$$ packed form
6705E8386j46515m284j98838j42456n0436K19744M61098k5502L6424k84950j03661
6694a80990O8350J89677k36457J29440j57373j29138J40436J20317j17469k48071
6684d21278j48838J41310J53006K88749K59355K3576j30064j15716j70211m4721
6674a64832J53503J81232r2438J78702n9740J45728M2299o8963j01925J7024j29200
6663A01390o5202K56955k18515J942k64148n1154K87626O5860l66831K0708l0576
6652b61945L07158k46340k8332N7500K9381J59385j25137K44970k21047J63946
6642G9539J90074l7275K05390p8916n32995j04507K2881P7786J67677O447j88794
6631a92693j90996K25902N6392Q0275K49725O0920n9187j08835j8012j83508J23135
$$ plain form
6620 43118 350468 176959 -44441 -237084 -234962 -161838 -63372 -229525 -494486 -412682 -242179
6609 -242179 -384757 -351146 -234642 -291015 77353 92319 -243138 -136115 53399 171141
6599 171141 117828 -157831 -552014 -703465 -320869 -29695 -124250 -41003 54334 77320 125278
6588 125278 -37565 59841 -155438 -262510 -565001 -473576 -302197 -11917 149205 334300
6578 334300 123571 -106419 106081 589156 174554 -126710 -31796 -20951 -92707 34633
6568 34633 374552 338807 174525 134044 188924 74723 50167 36392 -173901 -261689 -269411
6557 -269411 -99590 -24243 -295103 -78574 -170240 -193438 67947 116804 423472 815361
6547 815361 717291 380462 140133 347072 177029 162893 4089 293037 413278 414488
$$ packed form
6620D3118L07350j73509k21400j92643K122P3124R8466j66153k64961Q1804J70503
6609b42179j42578L3611J16504n6373L68368J4966l35457J07023J89514J17742
6599A71141n3313k75659l94183j51451L82596K91174r4555Q3247R5337K2986M7958
6588A25278j62843R7406k15279j07072l02491R1425J71379K90280J61122J85095
6578C34300k10729k29990K12500M83075m14602l01264R4914J0845p1756J27340
6568C4633L39919l5745j64282m0481N4880j14201k4556j3775k10293q7788p722
6557b69411J69821P5347k70860K16529r1666k3198K61385M8857L06668L91889
6547H15361r8070l36829k40329K06939j70043j4136j58804K88948J20241J210
$$ plain form
6537 414488 109879 -39348 -215799 -272326 28792 222484 243796 69642 -61736 -77836
6527 -77836 -217777 171300 476341 627223 501320 379081 128762 -371723 -452203 -67040
6517 -67040 -69742 -482556 -642274 -176511 -18732 -15433 78903 -43870 220510 582358 532116
6506 532116 224312 -229078 -49149 272448 378912 445946 462018 373768 87960 109997
6496 109997 285592 269346 303519 308979 161614 -38996 -183002 -139021 -244931 -184922 -9921
6485 -9921 141308 115325 -62876 -521796 -346812 -26565 -53069 -242486 16057 -17525 -96994
6474 -96994 -389396 -511652 -817701 -823925 -736306 -774848 -386066 -422872 -319935 218324 314420
6463 314420 183315 288892 325861 132204 139758 19440 64299 -150946 -21208 -243612
$$ packed form
6537D14488l04609j49227j76451n6527L01118J93692K1312j74154j31378j6100
6527g7836j39941L89077L05041J50882j25903j22239k50319n00485q0480L85163
6517f7040k702m12814j59718M65763J57779L299R4336j22773K64380L61848n0242
6506E32116l07804m53390J79929L21597J06464O7034J6072q8250k85808K2037
6496A09997J75595j6246L4173N460j47365k00610j44006M3981j05910O0009J75001
6485i921J51229k5983j78201m58920J74984L20247k6504j89417K58543l3582p9469
6474i6994k92402j22256l06049o224Q7619l8542L88782l6806J02937N38259R6096
6463C14420j31105J05577L6969j93657P554j20318M4859k15245J29738k22404
$$ plain form
6453 -243612 -565733 -329247 17893 -58165 -92760 -124235 -140342 -223011 -211760 38541 -237379
6442 -237379 -420819 -280716 -84259 -52910 10815 15725 12787 20151 57357 -200130 -114857
6431 -114857 332379 297324 -3786 12742 125579 293187 383184 353028 505134 230614
6421 230614 -210419 152382 396290 337961 652180 858217 386143 -64669 -530467 -691046
6411 -691046 -595870 -636196 -653927 -393464 -8249 -59139 -324762 -273084 -283982 -240009 -34633
6400 -34633 208322 483335 444613 582700 244761 176177 474518 647333 201018 115819
6390 115819 -79152 32729 22773 212179 444928 345753 -84358 278053 -11358 -246744
6380 -246744 -114476 -133680 -69334 65251 136686 81812 26013 3597 54409 116897 -178688
$$ packed form
6453b43612l22121K36486L47140p6058l4595l1475j6107q2669J1251K50301k75920
6442b37379j83440J40103J96457L1349O3725M910k938P364L7206k57487Q5273
6431a14857M47236l5055l01110J6528J12837J67608Q9997l0156J52106k74520
6421B30614m41033L62801K43908n8329L14219K06037m72074m50812m65798j60579
6411f91046R5176m0326j7731K60463L85215n0890k65623N1678j0898M3973K05376
6400c4633K42955K75013l8722J38087l37939o8584K98341J72815m46315q5199
6390A15819j94971J11881r956J89406K32749r9175m30111L62411k89411k35386
6380b46744J32268j9204O4346J34585P1435n4874n5799k2416N0812O2488k95585
$$ plain form
6369 -178688 -563920 -660267 -604257 -441755 -203297 -148244 -11076 -31802 -137999 -122255 -211896
6358 -211896 -303045 -33365 236519 106605 -62762 -495826 -560569 -438133 -103457 -110667
6348 -110667 -247681 -135165 -339738 -400454 -479638 -505257 -174858 -307969 -532632 -715868
6338 -715868 -630033 -506566 -695190 -402593 79279 118005 -226857 -475150 -677206 -415913
6328 -415913 -113521 106457 186001 -11930 -304643 -485852 -204293 -123267 -11348 85725
6318 85725 -102975 79101 167774 411888 102604 -154357 -213619 -402011 -269700 -599557
6308 -599557 -615434 -427968 -127244 48127 -126690 -40191 22664 235431 457376 165308
6298 165308 335019 72130 -289842 -407389 -354790 -279871 -330679 -668566 -559488 -387287
$$ packed form
6369a78688l85232r6347N6010J62502K38458N5053J37168k0726j06197J5744q9641
6358b11896r1149K69680K69884j29914j69367m33064o4743J22436L34676p210
6348a10667j37014J12516k04573o0716p9184k5619L30399j33111k24663j83236
6338g15868Q5835J23467j88624K92597M81872L8726l44862k48293k02056K61293
6328d15913L02392K19978P9544j97931k92713j81209K81559Q1026J11919R7073
6318H5725j88700J82076Q8673K44114l09284k56961n9262j88392J32311l29857
6308e99557j5877J87466L00724J75371j74817Q6499O2855K12767K21945k92068
6298A65308J69711k62889l61972j17547N2599P4919n0808l37887J09078J72201
$$ plain form
6288 -387287 -276734 -302229 -302390 -499957 -224468 -89272 -133134 -260954 -333758 -81968 -113650
6277 -113650 -156856 67229 182105 -21076 -27533 43773 341724 457955 394995 313689 -6578
6266 -6578 -114769 22448 -7616 -145123 67653 361937 -80321 -84045 -192625 -88615 143976
6255 143976 296557 399402 244410 211239 360243 168068 357742 170632 -25737 173223
6245 173223 97129 158541 83247 -2511 -232680 -259974 166807 169121 -331474 -490925 8927
6234 8927 125217 88461 -454435 -575418 -390459 -364899 63577 295131 79493 201209
6224 201209 -86395 -302072 -158589 184342 30937 -421673 -164232 -165733 61690 168769
6214 168769 -199544 -107060 -44824 -193996 -252848 -132295 185614 348754 285523 -140634
$$ packed form
6288c87287J10553k5495j61j97567K75489J35196m3862j27820p2804K51790l1682
6277a13650m3206K24085J14876k03181o457P1306K97951J16231o2960q1306l20267
6266f578j08191J37217l0064j37507K12776K94284m42258l724j08580J04010K32591
6255A43976J52581J02845j54992l3171J49004j92175J89674j87110j96369J98960
6245A73223p6094O1412p5294q5758k30169k7294M26781K314n00595j59451M99852
6234H927J16290l6756n42896j20983J84959K5560M28476K31554k15638J21716
6224B01209k87604k15677J43483L42931j53405m52610K57441j501K27423J07079
6214A68769l68313R2484O2236j49172n8852J20553L17909J63140o3231m26157
$$ plain form
6204 -140634 -62284 345232 345430 33177 -38083 -201847 -424964 -573874 -702641 -209723 43635
6193 43635 -6951 82155 339581 467758 461608 525548 200787 22044 112445 49341 -153070
6182 -153070 -142977 -266196 -76948 65129 93779 290414 298918 379991 826617 916478 578884
6171 578884 226392 66483 178944 437440 78873 169821 153136 161495 240436 183034 74042
6160 74042 135212 49443 -43397 130482 -15424 -82500 -243815 -572883 -433983 -222988 -41382
6149 -41382 -223249 -249081 -124082 -71457 -71929 -308087 -25220 147386 115026 -98955 13980
6138 13980 64687 -37061 97963 160405 314703 486551 144401 229638 100402 -170583
6128 -170583 -275847 -277087 -474401 -84023 -217292 -590157 -199117 9911 19565 -277347
$$ packed form
6204a40634P8350M07516J98l12253p1260j63764k23117j48910j28767M92918K53358
6193D3635n0586Q9106K57426J28177o150O3940l24761j78743R0401o3104k02411
6182a53070J0093j23219J89248J42077K8650J96635Q504Q1073M46626Q9861l37594
6171E78884l52492j59909J12461K58496l58567R0948j6685Q359P8941n7402j08992
6160G4042O1170q5769r2840J73879j45906o7076j61315l29068J38900K10995J81606
6149d1382j81867k5832J24999N2625m72k36158K82867J72606l2360k13981J12935
6138A3980N0707j01748J35024O2442J54298J71848l42150Q5237j29236k70985
6128a70583j05264j240j97314L90378j33269l72865L91040K09028R654k96912
$$ plain form
6118 -277347 -567576 -583374 -389232 -381 -135984 -378089 -323046 -109860 33595 -118885
6108 -118885 -127519 -13142 952 55742 270069 570400 251880 215547 229858 258611 447101
6097 447101 399293 88487 -134905 -266899 -328419 -323515 -272640 9698 535242 403150 -116256
6086 -116256 -358994 -584206 -496347 -288750 -352374 -601272 -127003 77524 210188 343027
6076 343027 -3357 99915 205585 244300 -32100 -315007 -377085 -229986 -306478 -563020
6066 -563020 -496467 -505219 -814094 -312901 13405 -255940 -266241 -135133 -214905 -211720 -311241
6055 -311241 -271020 -53414 2270 101689 -240876 -233400 -309859 -198690 -162128 65921 228492
6044 228492 21614 -212609 143647 106239 -69852 219041 346927 164682 263670 362638
$$ packed form
6118b77347k90229j5798J94142L88851j35603k42105N5043K13186J43455j52480
6108a18885q634J14377J4094N4790K14327L00331l18520l6333J4311K8753J88490
6097D47101m7808l10806k23392j31994o1520M904N0875K82338N25544j32092n19406
6086a16256k42738k25212Q7859K07597o3624k48898M74269K04527J32664J32839
6076C43027l46384J03272J05670L8715k76400k82907o2078J47099p6492k56542
6066e63020O6553q752l08875N01193L26306k69345j0301J31108p9772L185r9521
6055c11241M0221K17606N5684R9419l42565P476p6459J11169L6562K28049J62571
6044B28492k06878k34223L56256l7408j76091K88893J27886j82245R8988R8968
$$ plain form
6034 362638 629766 618368 453517 -16697 -369263 -344559 172710 275159 102312 155863
6024 155863 303857 138571 -15825 -87112 -361687 -417792 -542785 -864098 -876248 -444874
6014 -444874 -386294 -313206 -292012 -326747 138438 228491 182814 5052 -113795 48974 -169608
6003 -169608 -217437 -239521 50341 390992 485370 767513 807522 806262 636711 303558 356685
5992 356685 104759 20243 -58386 -226586 -504037 -507678 -94155 -170384 -236820 -209129 -374637
5981 -374637 -269324 -122877 -284985 -506334 -761494 -674727 -245727 -524279 -440870 -243368
5971 -243368 -194409 -234625 -302162 -255382 -18368 25909 66473 -35162 -181074 -60499 -279069
5960 -279069 -167917 -193506 -198217 112455 125323 92519 41776 -32922 133905 19521 267182
$$ packed form
6034C62638K67128j1398j64851m70214l52566K4704N17269J02449j72847N3551
6024A55863J47994j65286j54396p1287k74575n6105j24993l21313j2150M31374
6014d44874N8580P3088K1194l4735M65185R0053m5677j77762j18847J62769k18582
6003a69608m7829k2084K89862L40651R4378K82143M0009j260j69551l33153N3127
5992C56685k51926q4516p8629j68200k77451l641M13523p6229o6436K7691j65508
5981c74637J05313J46447j62108k21349k55160Q6767M29000k78552Q3409J97502
5971b43368M8959m0216o7537M6780K37014M4277M0564j01635j45912J20575k18570
5960b79069J11152k5589m711L10672J2868l2804n0743p4698J66827j14384K47661
$$ plain form
5949 267182 93031 -62005 -274662 -123763 189816 -4432 -295414 -307159 -36296 -19246
5939 -19246 -279686 -545146 -997278 -819506 -592834 -445315 -167512 13037 -119812 -512790
5929 -512790 -534230 -378715 -183485 430808 387988 270154 -24441 12531 63194 -3930 80776
5918 80776 57874 171738 320819 526941 462781 -91136 78036 296878 606357 644898
5908 644898 356305 22005 24771 -156094 -281424 -161837 -134972 -189374 19087 729 -67702
5897 -67702 -139741 -193659 158793 62155 -523563 -1165726 -1018170 -791994 -434091 -235041
5887 -235041 -222550 179795 199986 427512 404832 269376 230273 285024 330446 88703 -180190
5876 -180190 243227 794758 880754 700423 354841 304963 219989 65430 130439 177059 -150615
$$ packed form
5949B67182j74151j55036k12657J50899L13579j94248k90982j1745K70863J7050
5939a9246k60440k65460m52132J77772K26672J47519K77803J80549j32849l92978
5929e12790k1440J55515J95230O14293m2820j17834k94595L6972N0663o7124Q4706
5918H0776k2902J13864J49081K06122o4160n53917J69172K18842L09479L8541
5908F44898k88593l34300K766j80865j25330J19587K6865n4402K08461j8358o8431
5897f7702p2039n3918L52452r6638n85718o42163J47556K26176L57903J99050
5887b35041J2491M02345K0191K27526k2680j35456l9103N4751M5422k41743k68893
5876a80190M23417N51531Q5996j80331l45582m9878q4974j54559O5009M6620l27674
$$ plain form
5865 -150615 -653676 -739393 -450043 -516424 -412929 -278032 -55335 44879 -30790 -109417
5855 -109417 -535324 -650193 -265671 -163134 -182520 -180225 -121678 -152505 -413620 -473514 -645342
5844 -645342 -302408 -285738 -429050 -385197 -120892 -62002 51246 -138733 -535879 -687787
5834 -687787 -680864 -333729 -281389 -469733 -519236 -343194 -156421 -13308 -166320 -17144
5824 -17144 293574 511027 451895 521036 446292 33665 -399124 -612661 -725675 -869061
5814 -869061 -645202 -473393 -261029 -327470 -478506 -421495 -3222 255218 181672 12542
5804 12542 -101895 -336153 -330704 -353872 -485923 -355708 -133098 -34074 -25217 259212 407615
5793 407615 636938 679188 422051 414661 347986 192637 27158 40509 47868 6381 3446
$$ packed form
5865a50615n03061q5717K89350o6381J03495J34897K22697J00214p5669p8627
5855a09417m25907j14869L84522J02537j9386K295N8547l0827k61115n9894j71828
5844f45342L42934J6670j43312M3853K64305N8890J13248j89979l97146j51908
5834f87787O923L47135N2340j88344m9503J76042J86773J43113j53012J49176
5824a7144L10718K17453n9132O9141p4744m12627m32789k13537j13014j43386
5814h69061K23859J71809K12364o6441j51036N7011M18273K58440p3546j69130
5804A2542j14437k34258N449k3168j32051J30215K22610R9024Q857K84429J48403
5793D07615K29323M2250k57137p390o6675j55349j65479J3351P359m1487k935
$$ plain form
5782 3446 56891 -38891 -107446 21884 34806 -136922 -364945 -469581 -259609 94009 455560
5771 455560 142159 241621 264755 352357 63894 -67881 93153 268825 317598 5562
5761 5562 76649 142984 220927 469034 91052 -158730 -99182 -36480 -63189 90583 190020
5750 190020 120769 -280184 -519933 -290499 -122999 -413448 -612498 -371461 -41809 -135345
5740 -135345 -391451 -323512 -237670 -203850 202776 66605 197459 88667 -52939 -281369
5730 -281369 -65669 124306 -215018 -173654 -90891 14384 171082 114943 349919 435893
5720 435893 217068 302640 334031 248340 564635 818759 360699 -21764 59181 383784
5710 383784 430365 390557 115766 245495 189828 70180 398005 189919 -227087 -212253
$$ packed form
5782C446N3445r5782o8555J29330J2922j71728k28023j04636K09972L53618L61551
5771D55560l13401R9462K3134Q7602k88463j31775J61034J75672M8773l12036
5761E562P1087O6335P7943K48107l77982k49782N9548O2702k6709J53772R9437
5750A90020o9251m00953k39749K29434J67500k90449j99050K41037L29652r3536
5740a35345k56106O7939Q5842L3820M06626j36171J30854j08792j41606k28430
5730b81369K15700J89975l39324M1364Q2763J05275J56698n6139K34976Q5974
5720D35893k18825Q5572L1391q5691L16295K54124m58060l82463Q0945L24603
5710C83784M6581l9808k74791J29729n5667j19648L27825k08086m17006J4834
$$ plain form
5700 -212253 51911 -9057 195098 478134 468707 422582 374730 43313 56974 226511 -42083
5689 -42083 -375427 -426307 -19004 -12486 -57727 -131952 -49584 307889 157381 -204824 -199035
5678 -199035 4173 -176853 -531160 -464914 -278499 86197 19775 -169520 -263031 -300416
5668 -300416 -403107 -442234 -76513 -44676 -57168 -157439 25123 178566 704476 728128
5658 728128 649064 663317 471087 226700 -12306 -224130 103396 73502 -254954 -297093
5648 -297093 -387490 -369344 -35024 -143677 -219570 -274639 -201961 169601 174621 261265 12768
5637 12768 -268999 77851 404626 591464 357247 78445 -7915 33677 -194075 -164089
5627 -164089 -32672 -70033 76943 146486 149947 481579 529210 287304 307299 243132 60589
$$ packed form
5700b12253K64164o0968K04155K83036r427m6125m7852l31417J3661J69537k68594
5689d2083l33344n0880M07303O518m5241p4225Q2368L57473j50508l62205N789
5678a99035K03208j81026l54307O6246J86415L64696o6422j89295r3511l7385
5668c00416j02691l9127L65721L1837j2492j00271J82562J53443N25910K3652
5658G28128p9064J4253j92230k44387k39006k11824L27526k9894l28456m2139
5648b97093r0397J8146L34320j08653p5893n5069P2678L71562N020Q6644k48497
5637A2768k81767L46850L26775J86838k34217k78802q6360M1592k27752K9986
5627a64089J31417l7361J46976O9543L461L31632M7631k41906J9995o4167j82543
$$ plain form
5616 60589 -23914 159079 12214 -242496 -428463 95512 138152 -31511 141327 42152
5606 42152 -256171 -544594 -400610 -518030 -639221 -302536 -7627 198026 299141 393269
5596 393269 394025 308022 19984 116980 -12766 -299826 -494108 -458318 -239553 -288929 -333549
5585 -333549 -470553 -452191 -521580 -844318 -484730 -265473 -280536 339668 547068 269445
5575 269445 138998 38762 487159 461328 9779 20885 -63238 -316227 -615391 -345480
5565 -345480 -264377 -209160 -183348 -17478 260112 80789 -4026 -146108 -483677 -434467 -217835
5554 -217835 -294093 -449974 -135713 -259159 -366528 -534492 -754172 -594082 -101751 -4307
5544 -4307 55502 156594 77328 34648 -147400 -87250 80755 151396 -20670 -50430 185760
$$ packed form
5616F0589q4503J82993j46865k54710j85967N23975M2640j69663J72838r9175
5606D2152k98323k88423J43984j17420j21191L36685K94909K05653J01115R4128
5596C93269P56q6003k88038R6996j29746k87060j94282L5790K18765m9376m4620
5585c33549j37004J8362o9389l22738L59588K19257j5063O20204K07400k77623
5575B69445j30447j00236M48397k5831m51549J1106q4123k52989k99164K69911
5565c45480Q1103N5217K5812J65870K77590j79323q4815j42082l37569M9210K16632
5554b17835p6258j55881L14261j23446j07369j67964k19680J60090M92331R7444
5544d307N9809J01092p9266m2680j82048O0150J68005P0641j72066k9760K36190
$$ plain form
5533 185760 34416 -306047 -199682 -266517 -250365 -382737 -594392 -369100 -194890 -207964
5523 -207964 -209523 -252487 -262474 17073 172248 130466 -191584 14028 -82544 -342380 -343293
5512 -343293 -203071 -49033 -148069 -517010 -504690 -212183 -339368 -379232 -379251 -173729 -211895
5501 -211895 -8721 254690 219418 70294 397 139300 262441 182261 -270707 -593960
$$ packed form
5533A85760j51344l40463J06365o6835J6152j32372k11655K25292J74210j3074
5523b07964j559m2964r987K79547J55175m1782l22050K05612r6572k59836r13
5512c43293J40222J54038r9036l68941J2320K92507j27185l9864j9K05522l8166
5501b11895K03174K63411l5272j49124o9897J38903J23141q0180m52968l23253
$$ [...]
##END NTUPLES=NMR SPECTRUM
##END=
