##TITLE=Analysis number 327802
Compound Code mo 07975
Book Reference 510/25/4
Project Code jimp
Chemist Name adrs
##JCAMPDX= 6.0         $$ Bruker NMR JCAMP-DX V2.0
##DATA TYPE= NMR SPECTRUM
##DATA CLASS= NTUPLES
##ORIGIN= Bruker BioSpin GmbH
##OWNER= nmr
$$ XWIN-NMR		Version 3.5
$$ Thu Apr 12 12:58:32 2007 GMT Daylight Time (UT+1h)  MAYBRIDGE\nmr@NMR_250MHZ
##.OBSERVE FREQUENCY= 250.131544655141
##.OBSERVE NUCLEUS= ^1H
##.ACQUISITION MODE= SIMULTANEOUS (DQD)
##.ACQUISITION SCHEME= undefined
##.AVERAGES= 16
##.DIGITISER RES= 18
##SPECTROMETER/DATA SYSTEM= dpx250
##.PULSE SEQUENCE= zg30
##.SOLVENT NAME= DMSO
##.SHIFT REFERENCE= (INTERNAL, DMSO, 0, 16.522)
##AUDIT TRAIL= $$ (NUMBER, WHEN, WHO, WHERE, WHAT)
$$ ##TITLE= Audit trail, XWIN-NMR		Version 3.5
$$ ##JCAMPDX= 5.01
$$ ##ORIGIN= Bruker BioSpin GmbH
$$ ##OWNER= nmr
$$ C:\u/data/dgb/nmr/ADRS/1330/pdata/1/auditp.txt
$$ ##AUDIT TRAIL=  $$ (NUMBER, WHEN, WHO, WHERE, WHAT)
(   1,<2007-04-12 12:58:04.31 +100>,<MAYBRIDGE\nmr>,<NMR_250MHZ>,
      <created by zg, POWCHK disabled, PULCHK disabled
       configuration hash MD5:
       49 4B E0 1D 92 C2 6B 37 9F E6 65 BC 52 41 86 1D
       data hash MD5: 64K
       4E 63 16 D8 1F E3 18 09 7E AD D0 72 51 24 FF BB>)
(   2,<2007-04-12 12:58:21.62 +100>,<MAYBRIDGE\nmr>,<NMR_250MHZ>,
      <Start of raw data processing
       ef LB = 0.3 FT_mod = 6 PKNL = 1 SI = 32K 
       data hash MD5: 32K
       47 DF 26 F5 15 0D A7 A5 9E 30 64 78 67 47 5F 16>)
(   3,<2007-04-12 12:58:24.09 +100>,<MAYBRIDGE\nmr>,<NMR_250MHZ>,
      <apk 
       data hash MD5: 32K
       87 A5 3D 09 B5 A2 05 0F 17 66 50 91 6A BC 89 14>)
(   4,<2007-04-12 12:58:24.82 +100>,<MAYBRIDGE\nmr>,<NMR_250MHZ>,
      <abs ABSG = 5 
       data hash MD5: 32K
       2A 3B 88 7F 86 53 F4 CE 95 A2 DC 7B 7E DF 43 7F>)
$$ ##END=
$$ 
$$ hash MD5
$$ 6E 97 53 2B 51 BA E6 38 71 EE D4 0F 5F 40 EB D4
##$RELAX= 
##$RELAX= 
##$RELAX= 
##$RELAX= 
##$RELAX= 
##$RELAX= 
##$RELAX= 
$$ Bruker specific parameters
$$ --------------------------
##$DU= <C:\u>
##$EXPNO= 1330
##$NAME= <ADRS>
##$PROCNO= 1
##$TYPE= <nmr>
##$USER= <dgb>
##$AMP= (0..31)
100 100 100 100 100 100 100 100 100 100 100 100 100 100 100 100 100 100 
100 100 100 100 100 100 100 100 100 100 100 100 100 100 
##$AQSEQ= 0
##$AQ_mod= 3
##$AUNM= <au_zg>
##$AUTOPOS= <12 >
##$BF1= 250.13
##$BF2= 250.13
##$BF3= 250.13
##$BF4= 250.13
##$BF5= 500.13
##$BF6= 500.13
##$BF7= 500.13
##$BF8= 500.13
##$BYTORDA= 1
##$CFDGTYP= 0
##$CFRGTYP= 5
##$CHEMSTR= <none>
##$CNST= (0..31)
1 1 145 1 1 1 1 1 1 1 1 1 1 1 1 1 1 1 1 1 1 1 1 1 1 1 1 1 1 1 1 1 
##$CPDPRG= <>
##$CPDPRG1= <>
##$CPDPRG2= <>
##$CPDPRG3= <>
##$CPDPRG4= <mlev>
##$CPDPRG5= <mlev>
##$CPDPRG6= <mlev>
##$CPDPRG7= <mlev>
##$CPDPRG8= <mlev>
##$CPDPRGB= <>
##$CPDPRGT= <>
##$D= (0..31)
0 1 0 0 0 0 0 0 0 0.06 0 0 0 0 0 0 0.0002 0 0 0 0 0 0 0 0 0 0 0 0 0 0 
0 
##$DATE= 1176379083
##$DBL= (0..7)
120 120 120 120 120 120 120 120 
##$DBP= (0..7)
150 150 150 150 150 150 150 150 
##$DBP07= 0
##$DBPNAM0= <>
##$DBPNAM1= <>
$$ [...]
##$SUBNAM7= <"">
##$SUBNAM8= <"">
##$SUBNAM9= <"">
##$SW= 20.6930455092707
##$SWIBOX= (0..15)
0 0 3 0 0 0 0 0 0 0 0 0 0 0 0 0 
##$SW_h= 5175.983436853
##$TD= 65536
##$TD0= 1
##$TE= 683.16
##$TE2= 300
##$TE3= 300
##$TEG= 300
##$TL= (0..7)
0 120 120 120 120 120 120 120 
##$TP= (0..7)
150 150 150 150 150 150 150 150 
##$TP07= 0
##$TPNAME0= <>
##$TPNAME1= <>
##$TPNAME2= <>
##$TPNAME3= <>
##$TPNAME4= <>
##$TPNAME5= <>
##$TPNAME6= <>
##$TPNAME7= <>
##$TPOAL= (0..7)
0.5 0.5 0.5 0.5 0.5 0.5 0.5 0.5 
##$TPOFFS= (0..7)
0 0 0 0 0 0 0 0 
##$TUNHIN= 0
##$TUNHOUT= 0
##$TUNXOUT= 0
##$USERA1= <user>
##$USERA2= <user>
##$USERA3= <user>
##$USERA4= <user>
##$USERA5= <user>
##$V9= 5
##$VALIST= <valist>
##$VCLIST= <CCCCCCCCCCCCCCC>
##$VD= 0
##$VDLIST= <DDDDDDDDDDDDDDD>
##$VPLIST= <PPPPPPPPPPPPPPP>
##$VTLIST= <TTTTTTTTTTTTTTT>
##$WBST= 1024
##$WBSW= 4
##$XGAIN= (0..3)
0 0 0 0 
##$XL= 0
##$YL= 0
##$YMAX_a= 254261
##$YMIN_a= -458538
##$ZGOPTNS= <>
##$ZL1= 120
##$ZL2= 120
##$ZL3= 120
##$ZL4= 120
##$ABSF1= 16.522
##$ABSF2= -4.171173
##$ABSG= 5
##$ABSL= 3
##$ALPHA= 0
##$AQORDER= 0
##$ASSFAC= 0
##$ASSFACI= 0
##$ASSFACX= 0
##$ASSWID= 0
##$AUNMP= <proc_1d>
##$AZFE= 0.1
##$AZFW= 0.1
##$BCFW= 0
##$BC_mod= 0
##$BYTORDP= 0
##$COROFFS= 0
##$CY= 12.5
##$DATMOD= 1
##$DC= 0
##$DFILT= <>
##$DTYPP= 0
##$F1P= 14.0000005364418
##$F2P= -0.99999901652339
##$FCOR= 0.5
##$FTSIZE= 32768
##$FT_mod= 6
##$GAMMA= 0
##$GB= 0
##$INTBC= 1
##$INTSCL= 1
##$ISEN= 128
##$LB= 0.3
##$LEV0= 0
##$LPBIN= 0
##$MAXI= 10000
##$MC2= 0
##$MEAN= 0
##$ME_mod= 0
##$MI= 0
##$NCOEF= 0
##$NC_proc= -5
##$NLEV= 6
##$NOISF1= 0
##$NOISF2= 0
##$NSP= 0
##$NTH_PI= 0
##$NZP= 0
##$OFFSET= 16.522
##$PC= 1
##$PHC0= 232.8945
##$PHC1= -13.47862
##$PH_mod= 1
##$PKNL= yes
##$PPARMOD= 0
##$PSCAL= 4
##$PSIGN= 0
##$REVERSE= no
##$SF= 250.13
##$SI= 32768
##$SIGF1= 0
##$SIGF2= 0
##$SINO= 400
##$SIOLD= 32768
##$SREGLST= <1H.DMSO>
##$SSB= 0
##$STSI= 32768
##$STSR= 0
##$SW_p= 5175.98343685301
##$SYMM= 0
##$S_DEV= 0
##$TDeff= 65536
##$TDoff= 0
##$TI= <Analysis number 999999
Compound Code 99
Book Reference 9
Project Code 9>
##$TILT= no
##$TM1= 0
##$TM2= 0
##$TOPLEV= 0
##$USERP1= <user>
##$USERP2= <user>
##$USERP3= <user>
##$USERP4= <user>
##$USERP5= <user>
##$WDW= 1
##$XDIM= 32768
##$YMAX_p= 268153742
##$YMIN_p= -1969751
$$ End of Bruker specific parameters
$$ ---------------------------------
##NTUPLES= NMR SPECTRUM
##VAR_NAME=  FREQUENCY,     SPECTRUM/REAL,   SPECTRUM/IMAG
##SYMBOL=    X,             R,               I
##VAR_TYPE=  INDEPENDENT,   DEPENDENT,       DEPENDENT
##VAR_FORM=  AFFN,          ASDF,            ASDF
##VAR_DIM=   32768,         32768,           32768
##UNITS=     HZ,            ARBITRARY UNITS, ARBITRARY UNITS
##FACTOR=    0.157963299565203, 1,           1
##FIRST=     4132.6476996994, 0,             0
##LAST=      -1043.33573715361, 0,           0
##MIN=       -1043.33573715361, -1969751,    0
##MAX=       4132.6476996994, 268153742,     0
$$ Real data points
##PAGE= N=1
##DATA TABLE= (X++(R..R)), XYDATA
$$ [...]
23394H801507j09671J11225J55268R2647J3859p6588j4000R4656O6133L6491n5553
23383I115974l6795M7456J5642M4583k9851J9042P3967N1267j9217j2609P9229
23372I348688M2171k4444j4356k3629j8732L389R8757L4007K1514j4180j852J43474
23360I594807N5490n2535N2499O0991j50378N2044J47656N8375L429O0735J5141
23349I898254R1537K2293O133o4508o2279K2332M7707R7766p693n105O6980J6060
23337A0129477K2440m8913l0605M6131J4909M3967O3785O2507k523r0469j8020
23326A0192686m8870K7742L5299N5103J34214M5467R1715O2711K4614M1311j15719
23315A0546273k5834O1826J33806O4970L8769P6507j8228j03666m2341K4207N5246
$$ y = [8801507, 8691836, 8803061, 8958329, 9050976, 9064835, 8988247, 8974247, 9068903, 9135036, 9171527, 9115974, 9079179, 9126635, 9142277, 9186860, 9157009, 9176051, 9250018, 9301285, 9282068, 9269459, 9348688, 9390859, 9366415, 9352059, 9328430, 9309698, 9313087, 9411844, 9445851, 9467365, 9453185, 9451333, 9594807, 9650297, 9597762, 9650261, 9711252, 9560874, 9612918, 9760574, 9818949, 9822378, 9883113, 9898254, 9989791, 10012084, 10018217, 9953709, 9891430, 9913762, 9961469, 10059235, 10051542, 10046437, 10113417, 10129477, 10151917, 10103004, 10072399, 10118530, 10133439, 10177406, 10241191, 10303698, 10301175, 10210706, 10192686, 10143816, 10171558, 10206857, 10261960, 10396174, 10441641, 10533356, 10596067, 10620681, 10661992, 10546273, 10520439, 10582265, 10716071, 10781041, 10819810, 10896317, 10878089, 10774423, 10732082, 10756289, 10811535]
23304A0811535R0556N0460j0225N4804Q7004J31270l2226m0596J2057J02556J5253
23293A1272448j3980K7670l0899n1529p7649q635J55130J69761m3638p9511j8536
23282A1300632P7257N623K9715N3818O8757J5467L0533K92j6388R868Q2044O1489
23270A1719107k4540L2077J49656o2981J999k2621R9614P7186O5075m5077q760
23259A1980735Q6953L8280N2155O5649p7524n5324N3420J18314J74651K310l4259
23248A2405360j8610M0588P9319J6529K2109K6942Q1094P7888J8151l0561p449
23237A2711360o6172j04034M9094P3929J63653J763n8919j1417M7692J2935J18666
23226A2938550P0387L5252N4140R333k5221K4175n5886m6371N2820m8344J22497
$$ y = [10811535, 10902091, 10952551, 10942326, 10997130, 11084134, 11215404, 11183178, 11142582, 11154639, 11257195, 11272448, 11258468, 11286138, 11255239, 11203710, 11126061, 11117426, 11272556, 11442317, 11398679, 11319168, 11300632, 11377889, 11383512, 11413227, 11467045, 11535802, 11551269, 11581802, 11582094, 11565706, 11575574, 11657618, 11719107, 11694567, 11726644, 11876300, 11813319, 11815318, 11792697, 11892311, 11969497, 12034572, 11989495, 11980735, 12067688, 12105968, 12158123, 12223772, 12146248, 12090924, 12144344, 12262658, 12437309, 12439619, 12405360, 12386750, 12427338, 12506657, 12523186, 12545295, 12572237, 12653331, 12731219, 12749370, 12718809, 12711360, 12645188, 12541154, 12590248, 12664177, 12827830, 12829593, 12770674, 12759257, 12806949, 12819884, 12938550, 13008937, 13044189, 13098329, 13107662, 13082441, 13106616, 13050730, 13004359, 13057179, 13008835, 13131332]
23215A3131332J01760O9421O6864n5514r2006P8336J55883R1441M1819J4527j7319
23204A3586544R0001k1391L3124J07094j3092p2530L0666J6028J10776R4966j16296
23193A3845890J9001Q6371J17713L4080m7629p4250M1944l6686r8983J09348J01367
23182A4098166L5727Q8106L5967K9948m6303O925K5553L8065P9126Q5848J816
23171A4478944j0275J9594J6961k4546n78M4588K5982N4127O4231M3848j1402
23160A4701474q8220J11937J5244p289K3416O0752n557J03920J02831R673q1366
23149A4946815k8561m2012l5333O205P8557J24479J9677l4305r1018M3714Q6789
23138A5075007L8243k1162N473J657m1363l255J6615R4592J06484R2127n0394
$$ y = [13131332, 13233092, 13302513, 13369377, 13313863, 13221857, 13300193, 13456076, 13547517, 13589336, 13603863, 13586544, 13676545, 13655154, 13688278, 13795372, 13782280, 13709750, 13740416, 13756444, 13867220, 13962186, 13845890, 13864891, 13951262, 14068975, 14103055, 14055426, 13981176, 14023120, 13986434, 13887451, 13996799, 14098166, 14133893, 14221999, 14257966, 14287914, 14241611, 14248536, 14274089, 14312154, 14391280, 14477128, 14478944, 14468669, 14488263, 14505224, 14480678, 14480100, 14524688, 14550670, 14604797, 14669028, 14712876, 14701474, 14613254, 14725191, 14740435, 14733146, 14756562, 14817314, 14811757, 14915677, 15018508, 15028181, 14946815, 14918254, 14876242, 14840909, 14847114, 14925671, 15050150, 15069827, 15035522, 14944504, 14988218, 15075007, 15113250, 15092088, 15097561, 15099218, 15057855, 15054600, 15071215, 15165807, 15272291, 15364418, 15314024]
23127A5314024L740N4671N4579K096J38403P4638o3874k2492O7020N8325J0659
23116A5691789m3925M5399m8823r7427M3367P9885K0467l6188L9443J4801J03833
23105A5812621k3778l9995L0323r554l9939J10958J47599L5282l4278n2181L769
23094A5940827l2098J3642R3250k6890m5124M930K8068O528n3254k6682J19931
23083A6023128J14653Q382K3783L97j8106o1526o3546M5513Q3279j4253M7611
23072A6189315L768n2237P3438n663l7158K1512J20787k5731l6007K3306L5132
23061A6310462P889J14589O9277q3338j7510K3343P4650J04763K5875p9801Q1051
23050A6631250P4990L4062p6429p9663l1272J4564j090Q0133O7716q778n0400
$$ y = [15314024, 15317764, 15372435, 15427014, 15429110, 15567513, 15642151, 15578277, 15555785, 15622805, 15681130, 15691789, 15647864, 15693263, 15644440, 15547013, 15590380, 15670265, 15690732, 15654544, 15693987, 15708788, 15812621, 15788843, 15748848, 15779171, 15769617, 15729678, 15840636, 15988235, 16023517, 15989239, 15937058, 15940827, 15908729, 15922371, 16015621, 15988731, 15943607, 15948537, 15976605, 15983133, 15929879, 15903197, 16023128, 16137781, 16146163, 16169946, 16170343, 16152237, 16090711, 16027165, 16072678, 16155957, 16141704, 16189315, 16193083, 16140846, 16214284, 16208621, 16171463, 16192975, 16313762, 16288031, 16252024, 16275330, 16310462, 16318351, 16432940, 16502217, 16418879, 16401369, 16424712, 16499362, 16604125, 16630000, 16550199, 16631250, 16706240, 16740302, 16663873, 16584210, 16552938, 16567502, 16566412, 16646545, 16714261, 16705483, 16655083]
23039A6655083k7539k2391j3027P8656N2034o8491K0932P1804m168l6433l3871
23028A6672589l7199K8275k6804L177l858p0134N2088N4624Q406j9847j23420
23017A6537897O0808R3598j2248n4470J8900N1775K3288N7381O7607j0835n4724
23006A6778977K5236m0356n6534J1719M326O5235o0356k4044p20Q825J08340k7048
22994A6793600J7667j45146M4402J05376m9400p4283p5628M7429O831P812j9053
22983A6659607J8292N1868L8430J6878p1602p646j4696N5478J12638J1537K5459
22972A6896243j23046o0351J427j2137K7146o4076m0008J01680m6660L1043P2053
22961A6783314L7715n3799m5340l402o382J02826n5880m5346p2492j9206P9168
$$ y = [16655083, 16627544, 16605153, 16592126, 16670782, 16722816, 16654325, 16675257, 16747061, 16742893, 16706460, 16672589, 16635390, 16663665, 16636861, 16640038, 16636180, 16566046, 16618134, 16672758, 16681164, 16661317, 16537897, 16598705, 16692303, 16680055, 16625585, 16644485, 16696260, 16719548, 16776929, 16844536, 16833701, 16778977, 16804213, 16763857, 16707323, 16719042, 16723368, 16788603, 16728247, 16704203, 16703483, 16712308, 16820648, 16793600, 16811267, 16666121, 16710523, 16815899, 16766499, 16692216, 16616588, 16664017, 16670848, 16678660, 16659607, 16677899, 16729767, 16768197, 16785075, 16713473, 16705827, 16691131, 16746609, 16859247, 16870784, 16896243, 16773197, 16712846, 16714273, 16702136, 16729282, 16665206, 16625198, 16726878, 16680218, 16711261, 16783314, 16821029, 16767230, 16721890, 16718488, 16712106, 16814932, 16759052, 16713706, 16641214, 16622008, 16701176]
22950A6701176m2106Q2770k1469l6312j12750l9337O0655J05414N015k2122J21432
22939A6802366K3250j04231j51942K0807J13340J6018l5932j01110n3118K9907
22929A6559355R7650L4256L4461j6938m1740L9567J0124l6861p6752L8758J14777
22918A6756657o6346j33421m6961K5692J2645l4345n2996P0078N6708j2530j7178
22907A6558003n0843j04481j7521L4742N079j2276N7652N6047O6190j29619j02057
22896A6360916r384O9910N6022J9572j03310n3331m2377j3724O4101M0327P1944
22885A6460666N2974p6917O0305K0926K0264p462j9038j1505n8387r1546n6940
22874A6293340j4518N7755m1969n2821n2140P5901J5953Q2532J4246m6842p4449
$$ y = [16701176, 16659070, 16741840, 16720371, 16684059, 16571309, 16531972, 16592627, 16698041, 16703056, 16680934, 16802366, 16825616, 16721385, 16569443, 16590250, 16703590, 16719608, 16683676, 16582566, 16529448, 16559355, 16657005, 16691261, 16725722, 16708784, 16667044, 16706611, 16716735, 16679874, 16603122, 16641880, 16756657, 16690311, 16556890, 16509929, 16535621, 16548266, 16513921, 16460925, 16531003, 16587711, 16575181, 16558003, 16507160, 16402679, 16385158, 16419900, 16424979, 16412703, 16470355, 16526402, 16592592, 16462973, 16360916, 16351532, 16421442, 16477464, 16497036, 16393726, 16340395, 16298018, 16284294, 16348395, 16388722, 16460666, 16513640, 16436723, 16497028, 16517954, 16538218, 16530756, 16511718, 16500213, 16441826, 16350280, 16293340, 16278822, 16336577, 16294608, 16241787, 16189647, 16265548, 16281501, 16364033, 16378279, 16331437, 16256988]
22863A6256988J1544J648o355l8827J8783M283o1054m1627n893p2579L3476K3256
22851A6123643R254J9531J10621l0320o2070j6257p195l2518o4400K695O5072
22840A6118056r2938o1635O113M3968l3722O2872N6602r2973q2033j8433k2930
22829A5882947J04307o1330j64790k0641k749M2781m9954l6029r1554n7924O6009
22818A5611073J39592j8421k4007N6225P6288j996p2026j10862K0014J8153l4569
22807A5659464j8437O9307k7533K5325P4952o717j1844K2327P171j0028K8333
22796A5812320n5985j7677j4342o8464j1758M9692k6506r7675M8866N6808j6291
22785A5658988o0085j2844J0160R564j2793m181O0393m6607o5553N1061N6712
$$ y = [16256988, 16268532, 16270180, 16263825, 16224998, 16243781, 16248064, 16187010, 16145383, 16139490, 16066911, 16100387, 16123643, 16132897, 16152428, 16263049, 16232729, 16170659, 16154402, 16147207, 16114689, 16050289, 16052984, 16118056, 16025118, 15963483, 15969596, 16013564, 15979842, 16042714, 16099316, 16006343, 15924310, 15905877, 15882947, 15987254, 15925924, 15761134, 15740493, 15737744, 15780525, 15730571, 15694542, 15602988, 15545064, 15611073, 15750665, 15732244, 15708237, 15764462, 15840750, 15838754, 15766728, 15655866, 15675880, 15694033, 15659464, 15641027, 15710334, 15682801, 15708126, 15783078, 15776361, 15764517, 15786844, 15794015, 15783987, 15812320, 15756335, 15738658, 15724316, 15655852, 15644094, 15693786, 15667280, 15569605, 15618471, 15675279, 15658988, 15598903, 15586059, 15596219, 15605783, 15592990, 15588809, 15649202, 15602595, 15537042, 15588103, 15644815]
22774A5644815j01158n958l9550r8168r1747K8416K5939k5036K4192N3479j5555
22763A5399669R4065K927q4568j41293j5805M3801n0819q8433n0324O6914o9310
22752A5106824l8272L0472R4113J13007k5313n6814j9959l2825q508m3034j2865
22741A5106826N6434J5764M4551Q6873m8946r4666m2396k0495j6230l8409j3519
22730A5035787P7012P6181l0470j44719p7519J1060l2946q5281m2548J1106N9035
22719A4856698m0470n991N6527M2138m3564N6964o4341o2556p17N6273N2100O4904
22707A4967965k7180j41576n8806N4901n7562p4643o4182M4395J4824K6175n9373
22696A4624938j807M2989L6410P0129o5061p051Q2296K6761m5826K8469m5781
$$ y = [15644815, 15543657, 15537699, 15498149, 15399981, 15308234, 15336650, 15362589, 15337553, 15361745, 15415224, 15399669, 15493734, 15496661, 15412093, 15270800, 15254995, 15298796, 15247977, 15159544, 15109220, 15176134, 15106824, 15068552, 15099024, 15193137, 15306144, 15280831, 15224017, 15204058, 15171233, 15162725, 15119691, 15106826, 15163260, 15179024, 15223575, 15310448, 15261502, 15166836, 15124440, 15103945, 15087715, 15049306, 15035787, 15112799, 15188980, 15158510, 15013791, 14936272, 14947332, 14914386, 14829105, 14786557, 14797663, 14856698, 14816228, 14810237, 14866764, 14908902, 14865338, 14922302, 14857961, 14795405, 14794688, 14850961, 14903061, 14967965, 14940785, 14799209, 14740403, 14795304, 14737742, 14663099, 14598917, 14643312, 14658136, 14684311, 14624938, 14623131, 14666120, 14702530, 14772659, 14707598, 14700547, 14782843, 14809604, 14763778, 14792247, 14746466]
22685A4746466j2329o6216l8248j7456K2929m9864j23745j17603j8418P3653n1215
22674A4347954k2781j0827J4571P9842K696k846J00788l1994j24274L3247O3921
22663A4450297J4642K4893n7455o0708m1833j4822n850m1635o530Q88M4459l6273
22651A4270073j7403P1869K1420o9908p3459r4983m4312j3193L782Q1891L6266
22640A4172043O6492j0033m1410l6930j3542k8135q9602M129P761L8156j18165
22629A3950764o031Q0369K595o727K6256J8782l1302N0264M6033m1589p0768K0376
22617A4039022P7902l0647q1116l2598N7024J0428o1639p0153l0790n472p2980
22606A3798981k300O1692N2681O9881l2947M1244M3216n1819j05292k6130p5077
$$ y = [14746466, 14734137, 14667921, 14629673, 14612217, 14635146, 14585282, 14461537, 14343934, 14325516, 14399169, 14347954, 14325173, 14314346, 14328917, 14408759, 14411455, 14408609, 14509397, 14477403, 14353129, 14386376, 14450297, 14464939, 14489832, 14432377, 14371669, 14329836, 14315014, 14309164, 14267529, 14260999, 14261887, 14306346, 14270073, 14252670, 14324539, 14345959, 14276051, 14202592, 14107609, 14063297, 14050104, 14053886, 14135777, 14172043, 14238535, 14228502, 14187092, 14150162, 14136620, 14108485, 14018883, 14023012, 14030773, 14068929, 13950764, 13944733, 14025102, 14027697, 14020970, 14047226, 14066008, 14034706, 14084970, 14131003, 14089414, 14018646, 14039022, 14116924, 14086277, 14005161, 13972563, 14029587, 14040015, 13978376, 13908223, 13877433, 13871961, 13798981, 13796681, 13858373, 13911054, 13980935, 13947988, 13989232, 14032448, 13980629, 13875337, 13849207, 13774130]
22595A3774130n3194j33129O6053Q1568J0577j02062j09956J8825J16615O4496
22585A3733923J1041o5444l1583r876k8679N2550L822o7577n3765J08357N2444
22574A3705213n5857p5391j10686K0785j225o1104P2592N9177L6729k6199l2772
22563A3531262l4226M0833n3378k7320m4636N3086L9073j2550j5232l4027p3064
22552A3369821n6441o1167J8730k012P0082o400N995R0824j9537o9733m0714M8437
22540A3347885L9137j07689l2350k3021n3251J9479m318R3467M0612m9770O60
22529A3270841k9906p6897l4240L2466j7706L265l8538l8484J7737o7724j14n7475
22517A2963225N8600R445r575n927P5388m0564r5416J1911n201k3923r1792k448
$$ y = [13774130, 13720936, 13587807, 13653860, 13735428, 13746005, 13643943, 13533987, 13552812, 13669427, 13733923, 13744964, 13679520, 13647937, 13638061, 13609382, 13661932, 13665754, 13598177, 13544412, 13652769, 13705213, 13649356, 13573965, 13463279, 13484064, 13482839, 13421735, 13494327, 13553504, 13590233, 13564034, 13531262, 13497036, 13537869, 13484491, 13457171, 13412535, 13465621, 13504694, 13492144, 13476912, 13442885, 13369821, 13313380, 13252213, 13270943, 13268931, 13339013, 13332613, 13338608, 13429432, 13409895, 13340162, 13299448, 13347885, 13387022, 13279333, 13246983, 13223962, 13170711, 13190190, 13185872, 13279339, 13319951, 13270181, 13270841, 13240935, 13164038, 13129798, 13162264, 13144558, 13147823, 13109285, 13070801, 13088538, 13020814, 13020700, 12963225, 13021825, 13031270, 13021695, 13015768, 13091156, 13050592, 12955176, 12967087, 12961886, 12937963, 12846171, 12843723]
22505A2843723J8284j0259o632k8450K7003Q9547L7896p5544k5206J1043j7938
22494A2863467k3969j22468n8524K2721Q5489J629K9907M0108j1068l653r9840
22483A2723799o7618l5445L079m136j1287P5129j1332j5497o6589l3671j6508
22472A2539924O4148P9420N2850J2157k0313k8206j14652K5257R5894n2529j30122
22461A2523828L8297K4923m342k5919r0455o6706r87K9564j8454J656N7039N3094
22449A2521538R2481n1249l2617n8964q108j7064m0251j01274l9342J4395Q6135
22438A2365680N8445j9253r1690r7525j02793P4j5767N6641r0139M6666J02450
22427A2212789o0299l0458m0230r2182J6637K0184R5234j9330m2209l9152j418
$$ y = [12843723, 12862007, 12851748, 12845116, 12816666, 12843669, 12933216, 12971112, 12895568, 12870362, 12881405, 12863467, 12839498, 12717030, 12658506, 12681227, 12766716, 12768345, 12798252, 12838360, 12827292, 12823639, 12723799, 12656181, 12620736, 12623815, 12619679, 12608392, 12683521, 12672189, 12656692, 12590103, 12556432, 12539924, 12604072, 12683492, 12736342, 12748499, 12728186, 12699980, 12585328, 12610585, 12706479, 12653950, 12523828, 12562125, 12587048, 12582706, 12556787, 12466332, 12399626, 12398639, 12428203, 12409749, 12411405, 12468444, 12521538, 12614019, 12562770, 12530153, 12471189, 12463081, 12446017, 12405766, 12304492, 12265150, 12279545, 12365680, 12424125, 12404872, 12313182, 12215657, 12112864, 12112938, 12097171, 12153812, 12063673, 12110339, 12212789, 12152490, 12122032, 12081802, 11989620, 12006257, 12026441, 12121675, 12102345, 12060136, 12020984, 12019566]
22416A2019566R726N9802L9478j2680n346o8374l1338k4540m4592L5404N7709
22405A2034815j1689q1322p1625L9130Q7584j3501p4940j45442n6507N3308K053
22394A1761864J476J7654j4513Q0100N6002M8305P2141o4726o1457q1381o5699
22383A1749766m1507N5078J28182J9710j12802j38068p8175K88j434L2005M754
22372A1617797q232M8247J243k0963k8566O0584Q1188l5566j8630o7627j16005
22361A1513470n1577J0391L6891k7419j58406M9527k3571O2604Q6808N4232K0389
22350A1573339j24694n1511M2273k7091K5988l5448O862L6891O043o8707k4814
22339A1359131r8027l1111J8107l1376l6385J28323J16253j4279J3728q769o8385
$$ y = [12019566, 12029292, 12089094, 12128572, 12115892, 12110546, 12042172, 12010834, 11986294, 11941702, 11977106, 12034815, 12023126, 11941804, 11870179, 11909309, 11996893, 11983392, 11908452, 11763010, 11706503, 11759811, 11761864, 11763340, 11780994, 11766481, 11846581, 11902583, 11950888, 12023029, 11958303, 11896846, 11815465, 11749766, 11708259, 11763337, 11891519, 11911229, 11798427, 11660359, 11582184, 11582472, 11581038, 11613043, 11617797, 11609565, 11657812, 11659055, 11638092, 11609526, 11670110, 11751298, 11715732, 11697102, 11629475, 11513470, 11461893, 11472284, 11509175, 11481756, 11323350, 11372877, 11349306, 11411910, 11498718, 11552950, 11573339, 11448645, 11397134, 11439407, 11412316, 11438304, 11402856, 11409718, 11446609, 11452652, 11383945, 11359131, 11261104, 11229993, 11248100, 11216724, 11180339, 11308662, 11424915, 11410636, 11424364, 11415595, 11347210]
22328A1347210o6328n8397j3281j1135q0910L9832R2627L1520j5478k6324j1239
22317A1228097p9057l3130o9693K451J337M0947N8109P0435k6706j35610M8354
22306A1105534O7509r0021o5921m8569O2195O0621o192m0992K963l0375J0934
22295A1027686N6004n1237j01818n7031j2235j5992N874n0045J6040N9816l543
22284A0873519j8597N472r0581o0840L4493K3193l4838O0353M9285O4280L8643
22273A0944382l3712k7664L1958p2023r2282n7872p4129L988R0026M7537k9901
22262A0730308k580J5768m0108q5553M3486K7081N126j07109m4811J13542J5253
22251A0670403j23345o6074K8107P7017J16944j7852n4107q1353P596l1045j08840
$$ y = [11347210, 11280882, 11222485, 11209204, 11198069, 11117159, 11156991, 11249618, 11281138, 11265660, 11239336, 11228097, 11149040, 11115910, 11046217, 11048668, 11050005, 11090952, 11149061, 11219496, 11192790, 11057180, 11105534, 11173043, 11083022, 11017101, 10968532, 11030727, 11091348, 11085156, 11044164, 11047127, 11016752, 11027686, 11083690, 11032453, 10930635, 10873604, 10861369, 10845377, 10851251, 10801206, 10817246, 10877062, 10873519, 10854922, 10860394, 10769813, 10708973, 10743466, 10766659, 10731821, 10792174, 10841459, 10905739, 10944382, 10910670, 10883006, 10914964, 10842941, 10750659, 10692787, 10618658, 10622646, 10712672, 10760209, 10730308, 10727728, 10743496, 10703388, 10617835, 10661321, 10688402, 10693528, 10586419, 10541608, 10655150, 10670403, 10547058, 10480984, 10509091, 10586108, 10703052, 10685200, 10631093, 10549740, 10557336, 10526291, 10417451]
22240A0417451k0381J7568M6582o0697k6752M6057p5203q8041j00494K5579J13923
22229A0295592L5276K681L1138l6316k512r555j8354l0703n582P4094k180j1040
22217A0322539J3658n2942k5052k7174m2132m6760l2266k3372J2766m847K7104
22206A0121522J3027j5149l6725l8585O8007m8389p5329j16548J3783L895P6298
22195I965807P8545p8184n0237P0147J2220L3238N1418J8952p5234n339r171J1557
22183A0023719j4417n3158o7553k415l4555l3974l3829p7175J8999J27251O0905
22172I913798K1120o377j6475N990o5276l5258m7832m7497K8783P4710N8495M3085
22160I927266l7159L2759j8311j14802j2575q327J6609M21q9890n3771L2834L9819
$$ y = [10417451, 10397070, 10414638, 10461220, 10400523, 10373771, 10419828, 10344625, 10256584, 10156090, 10181669, 10295592, 10330868, 10333549, 10364687, 10328371, 10325859, 10316304, 10297950, 10267247, 10261665, 10335759, 10333579, 10322539, 10336197, 10283255, 10258203, 10231029, 10188897, 10142137, 10109871, 10086499, 10099265, 10094418, 10121522, 10134549, 10119400, 10082675, 10044090, 10112097, 10063708, 9988379, 9871831, 9885614, 9889509, 9965807, 10044352, 9966168, 9915931, 9986078, 9998298, 10031536, 10082954, 10101906, 10026672, 10021333, 10012162, 10023719, 10009302, 9956144, 9888591, 9886176, 9851621, 9817647, 9783818, 9706643, 9725642, 9852893, 9913798, 9934918, 9928541, 9912066, 9918056, 9852780, 9817522, 9769690, 9722193, 9750976, 9825686, 9884181, 9927266, 9890107, 9922866, 9904555, 9789753, 9777178, 9768851, 9785460, 9785881, 9695991, 9642220, 9675054, 9714873]
22148I714873M6389j6972r6098J4653K75k9185m8964r4151r064k613o6603K4133
22136I436673K3951J14997J5794J3202o0870m9568m6490K57m6182l6527o5969
22125I299268O958O0974M5855q4379L2559R034q7507r538N2182k1857l033J8041
22113I318557P4479P0844l6244q0143j59740r1473K8173M7218o6619L8480O3553
22102I207085M3186P6726n058k5062j1837p0511o8069J0258O7471O4405l3329
22091I255265j19591j9122J14314J4519J4471o5844j33994p4590K3639k7993o2755
22080H918319k4947K349M4223L4950o2999o1579m1311n0563O7531J12743K8975
22069H967691J08733j2652o6162K7558L0494l5487K213m9806o0307O2984o8458
$$ y = [9714873, 9761262, 9744290, 9648192, 9662845, 9663120, 9633935, 9584971, 9490820, 9481756, 9479143, 9412540, 9436673, 9460624, 9575621, 9591415, 9604617, 9543747, 9494179, 9447689, 9447946, 9401764, 9365237, 9299268, 9306226, 9367200, 9413055, 9328676, 9361235, 9370269, 9282762, 9273224, 9325406, 9303549, 9300516, 9318557, 9393036, 9463880, 9427636, 9347493, 9187753, 9096280, 9124453, 9171671, 9105052, 9143532, 9207085, 9250271, 9326997, 9321939, 9296877, 9285040, 9214529, 9146460, 9156718, 9224189, 9288594, 9255265, 9135674, 9116552, 9230866, 9245385, 9259856, 9194012, 9060018, 8985428, 9009067, 8981074, 8918319, 8893372, 8895721, 8939944, 8974894, 8911895, 8850316, 8809005, 8758442, 8825973, 8938716, 8967691, 9076424, 9063772, 8997610, 9025168, 9055662, 9020175, 9022388, 8972582, 8912275, 8975259, 8906801]
22058H906801q4968L1221N517K0030m0146r4714N3203N1298M597o6130m2523N5270
22046H799456r851J1995j39046j00289k749k7744N4520J6455Q2875r9121l8926
22035H547575O356j3575j1660P2443K7284k8158j23787j22462m3874M9246J06530
22024H465918N5857N2392M9026o03q9483L3863p5719l2291L3431K4921j7192j3041
22012H487079K4874L2560N854m7098j42107m8102O366M3373Q0018k4119q5975
22001H332723m2219P0247o265p7913N9366J34283j22454J0307K1565j16087R046
21990H272599l861l3045Q382k2303p8073L0340O7143j2212J7636l66m539L9180
21978H280881n425o7017m8114m4378p618j35078n3585N6133k5379O8718M5496
$$ y = [8906801, 8821833, 8853054, 8858571, 8878601, 8838455, 8743741, 8796944, 8848242, 8852839, 8786709, 8744186, 8799456, 8789605, 8801600, 8662554, 8562265, 8559516, 8531772, 8586292, 8602747, 8685622, 8586501, 8547575, 8553931, 8540356, 8528696, 8601139, 8628423, 8600265, 8476478, 8354016, 8310142, 8359388, 8465918, 8521775, 8574167, 8623193, 8622590, 8533107, 8566970, 8491251, 8458960, 8492391, 8517312, 8500120, 8487079, 8511953, 8544513, 8550367, 8503269, 8361162, 8313060, 8319426, 8362799, 8442817, 8418698, 8332723, 8290504, 8360751, 8354486, 8276573, 8335939, 8470222, 8347768, 8358075, 8379640, 8263553, 8272599, 8268738, 8235693, 8244075, 8221772, 8143699, 8174039, 8241182, 8228970, 8246606, 8246240, 8241701, 8280881, 8275456, 8208439, 8160325, 8115947, 8108329, 7973251, 7919666, 7975799, 7950420, 8019138, 8064634]
21967H064634J1479l5N6099o3350m4335N6315m4821o8670L1300J9920M8963L2024
21955H099523q8393m3833M7943l3984j56077j1659O3959J31512M7427o1742n296
21944G989380M3163r7584j36840j1970R1992N9565q7688l8195K8622j12410N643
21933G733678j0586j6617O466L7772N3543p071M5755J07612j02126o4518o2281
21922G721627o5018o8323k6935O2497J11849j2023r0312j22658n7650k9494P3427
21911G496987J77602P1201o8480j22270L1967p138M3841M2413n7894j00789r5087
21900G412353K8116k0508p7131l8162J10740J08883M4276q1181l1304q8162M0273
21889G408193K5578m6217K517O9602L6257L4733L716n9373J11538L9547r9302
$$ y = [8064634, 8076113, 8076078, 8132177, 8068827, 8024492, 8080807, 8035986, 7967316, 7998616, 8018536, 8067499, 8099523, 8011130, 7967297, 8015240, 7981256, 7825179, 7813520, 7877479, 8008991, 8056418, 7994676, 7989380, 8032543, 7934959, 7798119, 7786149, 7878141, 7937706, 7850018, 7811823, 7840445, 7728035, 7733678, 7723092, 7706475, 7712941, 7750713, 7804256, 7797185, 7842940, 7950552, 7848426, 7783908, 7721627, 7656609, 7588286, 7561351, 7623848, 7735697, 7723674, 7633362, 7510704, 7453054, 7423560, 7496987, 7674589, 7745790, 7677310, 7555040, 7587007, 7579869, 7623710, 7666123, 7608229, 7507440, 7412353, 7440469, 7419961, 7342830, 7304668, 7415408, 7524291, 7568567, 7487386, 7456082, 7367920, 7408193, 7433771, 7387554, 7390071, 7459673, 7495930, 7530663, 7534379, 7475006, 7586544, 7626091, 7526789]
21878G526789p6653k6967n2927m9996k3986P873L3323L277K8124q581o8577J7977
21866G309676m0442n5380q8649P6991K8420j04121r331L9035O4060j1714L1398
21855G239943L5735l8952l9932n8244q2188M4825p30q8056m9723o136R1907o636
21843G041813O636m0027j6734l6503n664N2635p558L1718M2177j9638k0034N0763
21831G079584k5953k3204k1619k3890L0006K0776o8266n2599m7012n6394p9364
21820F732065J20495R5434M0984o0606l2113k1572l937j1374p2992n7885P153
21809F735652l6917Q263l0367k7714M7626N9194n0914j7150K9524M9177L4466
21798F800840n2574l089j1191o0561P534N2549M36N4396q9229l3577L5940P6076
$$ y = [7526789, 7450136, 7423169, 7370242, 7320246, 7296260, 7304133, 7337456, 7340733, 7368857, 7360276, 7291699, 7309676, 7269234, 7213854, 7125205, 7202196, 7230616, 7126495, 7117164, 7156199, 7220259, 7208545, 7239943, 7275678, 7236726, 7196794, 7138550, 7056362, 7101187, 7100457, 7012401, 6962678, 6956542, 7048449, 7041813, 7048449, 7008422, 6991688, 6955185, 6949521, 7002156, 6994598, 7026316, 7068493, 7048855, 7028821, 7079584, 7053631, 7030427, 7008808, 6984918, 7014924, 7035700, 6967434, 6914835, 6867823, 6811429, 6732065, 6852560, 6947994, 6988978, 6928372, 6896259, 6874687, 6870750, 6859376, 6786384, 6728499, 6735652, 6698735, 6706998, 6676631, 6648917, 6696543, 6755737, 6704823, 6687673, 6717197, 6766374, 6800840, 6748266, 6745177, 6733986, 6673425, 6680959, 6733508, 6733944, 6788340, 6699111, 6665534, 6701474, 6777550]
21786F777550J3303p799m4445m3626N0322Q8758m9197j7867m6348j21525K8444
21775F627570K1185l961L0148n4053K8476k2506p7147p1568o2582j3580L6166
21764F438148p0126l2849J16339L1643l2836o1032Q537J6159R3581l3550j3635
21753F460379P3038m7256m4426K7493J7273J7999J3570l8094j5325J7733M234
21742F486618j40819p2311q166l9951n432M805L6707L3339P951M9834j20464q875
21730F223236K4503N7493K5982q2267m2292p8112m2687J161L5117M1617m3219
21719F120532L8152Q4867P648J06917n4575r2464M3172r3726j31657Q4658J16857
21708F230381K5937k9573m8410K0071M8853j30031K6451o387m2257j3285K8804
$$ y = [6777550, 6790853, 6783054, 6738609, 6694983, 6745305, 6834063, 6784866, 6766999, 6720651, 6599126, 6627570, 6648755, 6644794, 6674942, 6620889, 6649365, 6626859, 6549712, 6478144, 6415562, 6401982, 6438148, 6368022, 6335173, 6451512, 6483155, 6450319, 6389287, 6397824, 6413983, 6507564, 6474014, 6460379, 6533417, 6486161, 6441735, 6469228, 6486501, 6504500, 6518070, 6479976, 6464651, 6482384, 6486618, 6345799, 6273488, 6265322, 6225371, 6219939, 6224744, 6261451, 6294790, 6302741, 6352575, 6232111, 6223236, 6247739, 6305232, 6331214, 6248947, 6206655, 6128543, 6085856, 6087017, 6122134, 6163751, 6120532, 6158684, 6243551, 6251199, 6358116, 6303541, 6211077, 6254249, 6160523, 6028866, 6113524, 6230381, 6256318, 6226745, 6178335, 6198406, 6247259, 6117228, 6143679, 6137292, 6095035, 6081750, 6110554]
21697F110554j13003j77714K886R2496l9918M4764P570L7519L2491Q7620n7977
21686F027288j16170N9836J03594K0369j02067l6758l4795o2336J0678K8815M1727
21675E940181j5830j0776P5445j54335l2608j1840l6404k1106N3516J8731M9876
21664E854850j8455q727L7884q602P0736r6268n4592M4418L9579j5282n8154K9421
21652E816808N7751M2797k5829o3462P0992j5619p6883Q860Q2858k7119j28209
21641E742945J4462R4771J265r5739j25230Q1615R6310Q211k8553j75584l3796
21630E580677M474K6836O3587P4506o954q9420o5267M9914J07901m0464n0866
21619E654924n7211p662k2342O1003J0072q9230m0534L3273J0093Q1059J5617
$$ y = [6110554, 5997551, 5819837, 5822723, 5915219, 5875301, 5920065, 5927635, 5965154, 5997645, 6085265, 6027288, 5911118, 5970954, 6074548, 6094917, 5992850, 5956092, 5921297, 5858961, 5869639, 5898454, 5940181, 5924351, 5913575, 5989020, 5834685, 5802077, 5790237, 5753833, 5732727, 5786243, 5804974, 5854850, 5836395, 5827668, 5865552, 5856950, 5927686, 5831418, 5776826, 5821244, 5860823, 5845541, 5787387, 5816808, 5874559, 5917356, 5891527, 5828065, 5899057, 5883438, 5806555, 5815415, 5898273, 5871154, 5742945, 5757407, 5852178, 5853443, 5757704, 5632474, 5714089, 5810399, 5818610, 5790057, 5614473, 5580677, 5585151, 5611987, 5675574, 5750080, 5743126, 5653706, 5588439, 5638353, 5746254, 5705790, 5654924, 5597713, 5590051, 5567709, 5628712, 5638784, 5549554, 5509020, 5542293, 5552386, 5633445, 5649062]
21608E649062q4819k5M0382j8070K5315m8043k3649n9050q291r401L1204N2878
21596E547493q3468n8534K145n3260P3835L1509L2141J6242J07157k350N67j4501
21584E598976j15745j06262j1984R409P486N1887l0659p4023q6116q445O0252
21573E294776L5923j06J2965P4139P1077n1928o5725N5601N4268j511j22174n7141
21561E300164j4898O5254q6736j47371J4917l6676m4952O9981O2255O573P7879
21550E266390L9939r5292N297R7126n9844l1897n011n1881j4214j08249m2655
21539D999709N0661Q4629l3667m5334M5493K3897k7430k7272k9226K0564k1530
21528E040494n2020l8544L4282k0687N3123N3143N749Q228j6126m0164K6238o3590
$$ y = [5649062, 5564243, 5564218, 5604600, 5586530, 5611845, 5563802, 5540153, 5481103, 5472812, 5463411, 5494615, 5547493, 5464025, 5405491, 5407636, 5354376, 5428211, 5459720, 5491861, 5508103, 5615260, 5612910, 5613477, 5598976, 5483231, 5376969, 5364985, 5374394, 5381880, 5433767, 5403108, 5329085, 5242969, 5234524, 5294776, 5330699, 5330593, 5343558, 5417697, 5488774, 5436846, 5371121, 5426722, 5480990, 5479479, 5357305, 5300164, 5285266, 5350520, 5263784, 5116413, 5131330, 5094654, 5049702, 5119683, 5181938, 5188511, 5266390, 5306329, 5211037, 5216334, 5313460, 5253616, 5221719, 5216708, 5164827, 5150613, 5042364, 4999709, 5050370, 5134999, 5101332, 5055998, 5101491, 5125388, 5097958, 5070686, 5041460, 5062024, 5040494, 4988474, 4949930, 4984212, 4963525, 5016648, 5069791, 5075540, 5083768, 5067642, 5027478, 5053716, 4990126]
21516D990126j1241R158O6815m1013m2272P3593M3392o0616j56011p9281J5816
21505D808466R2027J10400k3380k311L0961L5811J0567r121q2305r5579j2885
21494D862651J483J4574M0536n4260N154j05555m2515N5514k757P1990L3743J6320
21482D896878K6465l5996j75343O996j0771J3214L5674M4900J9345j27942j3616
21471D679804J97529L6047j72949j7193M4473J0664m2503r9041r0145n0363M3912
21460D540235N4341j7365j6087R9533K5005j9028o2528K0584n0924L8385O750
21449D618901m016N790j1184K8212K4454j4136m6428R8863J66272M7249j17091
21438D796886m0087m7024j64773n2639N3859k1451J4747M7086O8308K7364j16450
$$ y = [4990126, 4978885, 4988043, 5054858, 5013845, 4971573, 5045166, 5088558, 5027942, 4871931, 4792650, 4808466, 4900493, 5010893, 4987513, 4985202, 5016163, 5051974, 5062541, 5053420, 4971115, 4875536, 4862651, 4864134, 4878708, 4919244, 4864984, 4870138, 4764583, 4722068, 4777582, 4774825, 4846815, 4880558, 4896878, 4923343, 4887347, 4712004, 4719000, 4708229, 4721443, 4757117, 4802017, 4821362, 4693420, 4679804, 4877333, 4913380, 4740431, 4723238, 4767711, 4778375, 4735872, 4636831, 4546686, 4496323, 4540235, 4594576, 4577211, 4561124, 4660657, 4685662, 4666634, 4604106, 4624690, 4573766, 4612151, 4618901, 4614885, 4620675, 4609491, 4637703, 4662157, 4648021, 4601593, 4700456, 4866728, 4913977, 4796886, 4756799, 4709775, 4545002, 4492363, 4546222, 4524771, 4539518, 4586604, 4654912, 4682276, 4565826]
21427D565826j07379L0792o6466R389r5516R3792J19455O6046M559j09202j02051
21416D409245m9699N4929N3493O3778o7745J745Q827J2838J6607j0781n5340r0628
21404D347269m557N3713K9380o1980K1752M3861M318p1423P6877j3176o6634j7506
21392D341894L8975l1862K869k0520K0288k1991p3431L1347N0654K242l1283p5695
21380D233487m6507O6401o4979M0290K4646j2678o0383n0738o1807l1138R9479
21369D136073m4372n2350l103m034k6641J19286M7501k1399k9548K4795j4412
21358D131796n8870K2399J48539J15132o0410r4210j6872m9726L584J51218r2522
21347D200058p8990l3656j7036j8940J06867N5036j03791l9473L7602J9644J4262
$$ y = [4565826, 4458447, 4489239, 4422773, 4432162, 4336646, 4430438, 4549893, 4615939, 4620498, 4511296, 4409245, 4359546, 4414475, 4467968, 4531746, 4464001, 4465746, 4474573, 4487411, 4504018, 4493237, 4437897, 4347269, 4342712, 4396425, 4425805, 4363825, 4385577, 4429438, 4433756, 4362333, 4439210, 4426034, 4359400, 4341894, 4380869, 4349007, 4351876, 4331356, 4351644, 4329653, 4256222, 4287569, 4338223, 4340465, 4309182, 4233487, 4186980, 4253381, 4188402, 4228692, 4253338, 4240660, 4180277, 4129539, 4067732, 4036594, 4136073, 4091701, 4039351, 4036248, 4032214, 4005573, 4124859, 4172360, 4150961, 4121413, 4146208, 4131796, 4072926, 4095325, 4243864, 4358996, 4298586, 4204376, 4187504, 4137778, 4141362, 4292580, 4200058, 4121068, 4087412, 4070376, 4051436, 4158303, 4213339, 4109548, 4070075, 4107677, 4127321, 4141583]
21336D141583l4237N2062O019l901M6011l6514k4136m7637N1563Q1506o6864q8572
21324D076883j14239m405L6276M9575p7201l2655m0431O4055O8452J7439q5754
21313C957995m75k750O4141K8743M8415o723j6063k8835N2938R52k8416j5902
21301D054020q3742q3474O004Q8004N4986Q517r4557j5648l6235o0979O3669J0020
21289C910585m9591R0302N3264J0500j27919n0145L3316p721M4604n9506Q7174
21278C934863m6064M1024k1204j0174m1413r212N2214K3672o959K8660j1806M6769
21266C980370J6044p9062o027L2869k4793n5155j7756O2556K0348j29293O424
21255C806525L8325P072n319p9183P511O2562K8117l2339K1207l794q5785n516
$$ y = [4141583, 4107346, 4159408, 4165427, 4161526, 4207537, 4171023, 4146887, 4099250, 4150813, 4232319, 4165455, 4076883, 3962644, 3958239, 3994515, 4044090, 3966889, 3934234, 3893803, 3957858, 4026310, 4043749, 3957995, 3957520, 3954770, 4018911, 4047654, 4096069, 4089346, 4073283, 4044448, 4097386, 4098338, 4069922, 4054020, 3970278, 3886804, 3892808, 3980812, 4035798, 4044315, 3949758, 3934110, 3897875, 3836896, 3900565, 3910585, 3860994, 3951296, 4004560, 4015060, 3887141, 3836996, 3870312, 3862591, 3907195, 3847689, 3934863, 3888799, 3929823, 3908619, 3898445, 3857032, 3847820, 3900034, 3923706, 3916747, 3945407, 3933601, 3980370, 3996414, 3917352, 3911325, 3944194, 3919401, 3864246, 3846490, 3909046, 3929394, 3800101, 3806525, 3844850, 3851922, 3846603, 3767420, 3774931, 3837493, 3865610, 3833271, 3854478, 3850684, 3764899, 3759383]
21243C759383P1033l0054k8459n7960p5200l1972n0540M6782P9040m4773k4875
21232C612405N152k1774o762J8338L7510J9207L7057j5908k7492K9851l0003l479
21220C654102M3569j135r224l1762k0357M0232j6990M5976r9595J1282O2945N066
21208C684109m3008Q3065J4129r0879p6262o3553n7391k6855J15489O3697q0043
21197C522498m4109m0329j6499O0570M7412L2112k1128m673j1723O5306K1653
21186C611090l7387p9805o9380j3834o8971L1669N5423K8507k6527N8034R6306
21175C585125M421p5611j605j7119o0784L4267J03782N3252l4326m3301k282L9392
21163C585211O4239K5824j5541j20986o4554L0389j06427L1843O5236j4325l0784
$$ y = [3759383, 3830416, 3800362, 3771903, 3713943, 3638743, 3606771, 3556231, 3603013, 3682053, 3637280, 3612405, 3617557, 3595783, 3589021, 3607359, 3644869, 3664076, 3701133, 3685225, 3657733, 3687584, 3657581, 3654102, 3697671, 3696536, 3687312, 3655550, 3635193, 3675425, 3658435, 3704411, 3604816, 3616098, 3679043, 3684109, 3641101, 3724166, 3738295, 3647416, 3571154, 3507601, 3450210, 3423355, 3538844, 3602541, 3522498, 3478389, 3438060, 3421561, 3482131, 3529543, 3561655, 3540527, 3535854, 3524131, 3589437, 3611090, 3573703, 3493898, 3424518, 3410684, 3341713, 3373382, 3428805, 3457312, 3430785, 3488819, 3585125, 3589546, 3513935, 3512330, 3495211, 3434427, 3468694, 3572476, 3625728, 3591402, 3548101, 3545819, 3585211, 3649450, 3675274, 3659733, 3538747, 3474193, 3504582, 3398155, 3429998, 3495234, 3480909, 3450125]
21152C450125J6176l5017L5570m8592O2373M9415l5439j57797n4727K3705j0365
21141C295427J16184k6514q1787j21620p0735Q3042J0076J21719L9671q2451p1865
21130C211147n6475M5969J6256o515n2110M6015L4409R7325K3994n7046r468j8165
21118C275336l4248l1907J1587m658o3151k4408L6603P0687j31312L7089J10828
21107C252446L014j7695J8023L3150p390r3914K9949L6799l6357n9347l9634k940
21095C116104J12321O1190K7646L892k3803l3812j6893m9286k4782m6916K226
21084C127887K0104j36732R995J29836K1880o1645M165K4542k1949r767p3616
21073C034700K0750Q3059O4071l7115J3027M1741l0104l5339m0224k5869J1743
$$ y = [3450125, 3466301, 3431284, 3466854, 3418262, 3480635, 3530050, 3494611, 3336814, 3282087, 3305792, 3295427, 3411611, 3385097, 3303310, 3181690, 3110955, 3193997, 3204073, 3325792, 3365463, 3283012, 3211147, 3154672, 3200641, 3216897, 3210382, 3158272, 3204287, 3238696, 3336021, 3360015, 3302969, 3293501, 3275336, 3241088, 3209181, 3220768, 3216110, 3152959, 3128551, 3165154, 3235841, 3104529, 3141618, 3252446, 3255460, 3237765, 3255788, 3288938, 3281548, 3187634, 3217583, 3254382, 3218025, 3158678, 3119044, 3116104, 3228425, 3289615, 3317261, 3321153, 3297350, 3263538, 3246645, 3197359, 3172577, 3125661, 3127887, 3147991, 3011259, 3021254, 3151090, 3172970, 3111325, 3115490, 3140032, 3118083, 3108316, 3034700, 3055450, 3138509, 3202580, 3165465, 3178492, 3220233, 3190129, 3154790, 3114566, 3088697, 3100440]
21062C100440J12616K6115L1848m7999q5237o4184j9139j1259L0669k9447k1894
21051C022529O630k8089P4484O800n6625j5212n4188N1534N54J6198P9102l8282
21039C065435n6664o7121m1169O5751J3714K552R4741j8903k7784N8881M4159
21028C133592L4110j332n0317q5607n2930p311k4316o3505M6999O3328L8565p530
21016C023746j11717r9418o904R1072R3909p2437n1903l518Q7625P813Q489o6001
21004B900756o4014R8625Q5116J8277j00165j10099j32306O4359L2486K6731M4460
20993B864226j9030o7227K1945O1144k5214k8556K1896K7091o3190m2019q432
20982B742634O3941m3381p4767J04364J7081J04511M9250L0415n6630o0670p3300
$$ y = [3100440, 3213056, 3239171, 3271019, 3223020, 3137783, 3073599, 3054460, 3043201, 3073870, 3044423, 3022529, 3029159, 3001070, 3075554, 3082354, 3025729, 3010517, 2956329, 3007863, 3008417, 3024615, 3103717, 3065435, 3008771, 2941650, 2900481, 2966232, 2979946, 2982498, 3077239, 3058336, 3030552, 3089433, 3133592, 3167702, 3166370, 3116053, 3030446, 2977516, 2970205, 2945889, 2882384, 2929383, 2992711, 3031276, 3023746, 2912029, 2812611, 2805707, 2896779, 2990688, 2918251, 2866348, 2862830, 2950455, 2958268, 2966757, 2900756, 2836742, 2935367, 3020483, 3038760, 2938595, 2828496, 2696190, 2760549, 2793035, 2819766, 2864226, 2845196, 2777969, 2799914, 2861058, 2835844, 2807288, 2829184, 2856275, 2793085, 2751066, 2742634, 2806575, 2763194, 2688427, 2792791, 2809872, 2914383, 2963633, 2994048, 2937418, 2876748, 2803448]
20971B803448M2965J69507p8157j2028l2388L9081O7002j5278k3989r1590m242
20960B864331o7376p3521l603j8402L818l969k2525J5881k8342K8900P0104K8233
20948B793529j2918J1528K2821n5265K4664J09536n2542L5885K0679q8810k0097
20937B789010N0906j2450O8913o5511n4834M3563N4311j4563j19422o7549M7124
20926B719498L9103N1787N6711j01763j43645n6065K2377J15882N7729o2270n0247
20915B649097O2056P4146k4024o9321l4179r269q3964L878O745M4702m9260m9343
20903B521264j2330P9701L1578N4068R955j03498k9373j06091M8828J67127M7661
20892B708890l0249j0249j00064l0505J9296O4063L5515j6997m7834K8725L3178
$$ y = [2803448, 2846413, 3015920, 2937763, 2925735, 2893347, 2932428, 2999430, 2984152, 2960163, 2868573, 2864331, 2796955, 2723434, 2719831, 2701429, 2705247, 2701278, 2678753, 2694634, 2666292, 2695192, 2765296, 2793529, 2780611, 2792139, 2814960, 2759695, 2784359, 2893895, 2841353, 2877238, 2897917, 2809107, 2789010, 2839916, 2827466, 2896379, 2830868, 2776034, 2819597, 2873908, 2859345, 2739923, 2672374, 2719498, 2758601, 2810388, 2867099, 2765336, 2621691, 2565626, 2588003, 2703885, 2761614, 2699344, 2649097, 2711153, 2785299, 2761275, 2691954, 2657775, 2648506, 2564542, 2568420, 2575165, 2619867, 2570607, 2521264, 2508934, 2588635, 2620213, 2674281, 2684236, 2580738, 2551365, 2445274, 2494102, 2661229, 2708890, 2678641, 2668392, 2568328, 2537823, 2557119, 2621182, 2656697, 2639700, 2591866, 2620591, 2653769]
20881B653769l2773q7839j01158k7318P8696K2347K5777P5249L0763K9874r0078
20870B577309n4523P3549j3234p1355n7333R3854R5875j2320o7520n7576K8143
20859B534869L1769o032j689n2567O031l4575K0435O0814J1766q3930m5420k0366
20847B421105k1983J9740k6377J9764J2872L1085K0990k3308n3496j4534K4995
20836B410853l158o3519n8141J1371N9839J3471q7794N87M7185J11461k3776k2541
20824B395838k5459j8050K8150P2834J00015j9833q4233j08218m212J20858k5437
20813B432253n0667k5143p1368m08R4911L8652O4142N7207j20692k3063m5641
20802B350183l6610J601n2285J3001K11249j2167k22663m0751J22923N2606l8611
$$ y = [2653769, 2620996, 2533157, 2431999, 2404681, 2483377, 2505724, 2531501, 2606750, 2637513, 2667387, 2577309, 2522786, 2596335, 2583101, 2511746, 2454413, 2548267, 2644142, 2631822, 2564302, 2506726, 2534869, 2566638, 2560606, 2558917, 2506350, 2512381, 2477806, 2498241, 2559055, 2570821, 2486891, 2441471, 2421105, 2399122, 2418862, 2392485, 2412249, 2425121, 2456206, 2477196, 2453888, 2400392, 2385858, 2410853, 2407695, 2344176, 2286035, 2297406, 2357245, 2370716, 2282922, 2283509, 2330694, 2442155, 2418379, 2395838, 2370379, 2352329, 2380479, 2453313, 2553328, 2533495, 2449262, 2341044, 2336832, 2457690, 2432253, 2381586, 2356443, 2285075, 2284667, 2379578, 2418230, 2482372, 2539579, 2418887, 2395824, 2350183, 2313573, 2315174, 2262889, 2275890, 2487139, 2474972, 2252309, 2211558, 2334481, 2387087, 2348476]
20791B348476m8761k7704m1477k5867N8846O4398O9072j525J0575m9901q3525
20780B272607n755Q4659N1924j07740l3929N1161l2327r128M0167J096l0638l7577
20768B244520m0097q4618o8247M5724P0111P3908J34030l9142l334J5278l861
20757B344272J0384q0939j69816L8917Q4367O1689K5768j3693n9461j3959K2218
20746B249747n0728M1945j6602K815j6628L2727M1771J9072l8572r429Q7698J24371
20734B468187p4628l0656K4497r986o5723q3856n9342J9371n3044j11063N2788
20723B076545M5612N6465Q1085J0844q7435k8545M8775J8827k3218o3148j8661
20712B117146k6597O5384P381n5463J1107n1159O868J9454J21649P2975r6339
$$ y = [2348476, 2299715, 2272011, 2230534, 2204667, 2263513, 2327911, 2396983, 2395458, 2406033, 2356132, 2272607, 2266852, 2351511, 2403435, 2295695, 2261766, 2312927, 2280600, 2271472, 2311639, 2312735, 2282097, 2244520, 2204423, 2119805, 2051558, 2097282, 2167393, 2241301, 2375331, 2336189, 2332855, 2348133, 2344272, 2354656, 2273717, 2103901, 2142818, 2227185, 2288874, 2314642, 2300949, 2241488, 2227529, 2249747, 2199019, 2240964, 2224362, 2227177, 2210549, 2243276, 2285047, 2304119, 2265547, 2256118, 2343816, 2468187, 2393559, 2362903, 2387400, 2377414, 2311691, 2227835, 2168493, 2187864, 2134820, 2023757, 2076545, 2122157, 2178622, 2259707, 2270551, 2183116, 2154571, 2203346, 2222173, 2198955, 2135807, 2117146, 2090549, 2155933, 2163314, 2107851, 2118958, 2067799, 2074667, 2094121, 2215770, 2288745, 2192406]
20701B192406n1190k4950k9076o349J829n3289l9747r755k116N0774K6886L262
20689B058685J09890J03273M5751m1598j04686n6804O7500L0377j06939o7505
20679B037944j5724K50o7511l3399P9165O7621Q3345Q960k6027K7700K692K5558
20667B190574l4124j07196k1716J2947R2601p5335j45180R7944N907J09378n0051
20656B075749m8224k7521k4783K6833k8004r8134P8690P0133O1611O4715K6136
20645B177201j47873o8998P8755j8034q100q603K6323N519M9666N829p0312K7869
20633B049242P9334M4935q0976k3270o0402j8690N2286O2695n2106J4353N812
20622B073213q9747j27465O0212P151k8795P190J3459j4263j0950N2945J28459
$$ y = [2192406, 2141216, 2116266, 2087190, 2080841, 2082670, 2029381, 1989634, 1979879, 1977763, 2028537, 2055423, 2058685, 2168575, 2271848, 2317599, 2276001, 2171315, 2114511, 2182011, 2212388, 2105449, 2037944, 2022220, 2022470, 1954959, 1921560, 2000725, 2068346, 2151691, 2160651, 2134624, 2162324, 2165016, 2190574, 2156450, 2049254, 2027538, 2040485, 2133086, 2057751, 1912571, 2010515, 2016422, 2125800, 2075749, 2027525, 2000004, 1975221, 2002054, 1974050, 1875916, 1954606, 2024739, 2086350, 2151065, 2177201, 2029328, 1960330, 2039085, 2021051, 2012951, 2004348, 2030671, 2036190, 2085856, 2091685, 2021373, 2049242, 2128576, 2173511, 2092535, 2069265, 2008863, 1990173, 2042459, 2105154, 2053048, 2067401, 2073213, 1983466, 1856001, 1916213, 1923364, 1894569, 1901759, 1915218, 1900955, 1890005, 1942950, 2071409]
20611B071409J37666L0227q3521k31396j27271J0277J5193N4829l037n49p60M7030
20599A920097j4990m8474j7823l2633J6355R0303J8653j21153k1528R4012P2793
20588A955612n788J13241K0232j68599j63455j1420J26397J11437M8667L5173
20578B061497K9327m6670L5342l3599j11231m7147M5420k6544O5714J0585j726
20567A980968J5458r980n9999j46486k3721R3231J64463K8042n8745n0840M3986
20556A976377k5496q1024M8427M6959j00118L719L5893p5781J7061L3094m3847
20545A835264J06115O5081m9566m0710N400k9262K4858M2545K3024m8636q59r2696
20533A840558l420K4166j0548n1063n2466K9978O3958k1555K7655l1133k1291
$$ y = [2071409, 2209075, 2239302, 2155781, 1924385, 1797114, 1807391, 1822584, 1877413, 1874376, 1873827, 1873067, 1920097, 1905107, 1856633, 1838810, 1806177, 1822532, 1912835, 1931488, 1810335, 1788807, 1882819, 1955612, 1949824, 2063065, 2083297, 1914698, 1751243, 1739823, 1866220, 1977657, 2026324, 2061497, 2090824, 2044154, 2079496, 2045897, 1934666, 1887519, 1932939, 1906395, 1972109, 1982694, 1980968, 1996426, 1986446, 1926447, 1779961, 1756240, 1849471, 2013934, 2041976, 1983231, 1932391, 1976377, 1950881, 1869857, 1918284, 1965243, 1865125, 1868844, 1904737, 1828956, 1846017, 1879111, 1835264, 1941379, 2006460, 1956894, 1916184, 1921584, 1892322, 1917180, 1959725, 1982749, 1934113, 1933254, 1840558, 1837138, 1861304, 1850756, 1799693, 1747227, 1777205, 1841163, 1819608, 1847263, 1816130, 1794839]
20522A794839J8758Q130l2222q1740k7833J11190O5403m2919l8347J0407l5953
20511A749713n178o2684m4436J9982q8692k4820J33425O2736p4394j7598n585
20500A642469n543n108P4099O6327o6111k1851Q7338m9383k253P3505P1605L1289
20488A896383n1458m3382k3500k9525O7451o7686j58748j07195j0533k8866O228
20477A449169J72051P8064r452m3213N5226P5547j8451l3535n6918R176J20009
20466A797673J9621k2273k6226j15269p7653k6275M3796N3179O2188R635P172
20455A725568N453O7144J18873o3912n8785j05166j10300M3813m5316J1610R1025
20444A680007P841n4664l4887K8521Q3465N7211l9847R9005m783m0097j355k4676
$$ y = [1794839, 1813597, 1821727, 1789505, 1707765, 1679932, 1791122, 1856525, 1813606, 1775259, 1785666, 1749713, 1744535, 1681851, 1637415, 1657397, 1568705, 1543885, 1677310, 1740046, 1665652, 1648054, 1642469, 1636926, 1631818, 1705917, 1772244, 1706133, 1684282, 1771620, 1722237, 1719984, 1793489, 1865094, 1896383, 1844925, 1801543, 1778043, 1748518, 1815969, 1748283, 1589535, 1482340, 1471807, 1442941, 1449169, 1621220, 1699284, 1689832, 1646619, 1701845, 1777392, 1758941, 1725406, 1668488, 1677664, 1797673, 1817294, 1795021, 1768795, 1653526, 1575873, 1549598, 1593394, 1646573, 1708761, 1718396, 1725568, 1731021, 1798165, 1917038, 1853126, 1794341, 1689175, 1578875, 1622688, 1577372, 1588982, 1680007, 1687848, 1633184, 1598297, 1626818, 1710283, 1767494, 1727647, 1826652, 1821869, 1781772, 1780417, 1755741]
20432A755741r8196r8606l38N3300J44661o508p4170r9169r249P2399O3597p3570
20420A629892o2449o345O0587N6899k4322K0463M8164n3607m2588o6908m7952
20409A511834N5131m372l3796R8331K1368N4430j4477k7390q0908k3859k9546
20398A526746J2869K5620Q41m3191l4162m5637J02139J33284Q6478l3402p8372
20387A653213n7801j6889k7797J8259Q8943N9499j4345n8332J9606q7203l7465
20376A539688o2958M531O6904M9534n4922P2932j2636j28682r2742P379J0124
20365A399152Q4440K1552N0343Q5278K1655M3180O3374o2346q3219k1592K552
20354A604369k5828n08K7214M4555J3784l0013j28038K9342J463q5741k2372M3609
$$ y = [1755741, 1657545, 1558939, 1558601, 1611901, 1756562, 1750054, 1675884, 1576715, 1567466, 1639865, 1703462, 1629892, 1567443, 1561098, 1621685, 1678584, 1654262, 1674725, 1722889, 1669282, 1626694, 1559786, 1511834, 1566965, 1562593, 1528797, 1627128, 1648496, 1702926, 1688449, 1661059, 1580151, 1556292, 1526746, 1539615, 1565235, 1566076, 1522885, 1488723, 1443086, 1545225, 1678509, 1764987, 1731585, 1653213, 1595412, 1578523, 1550726, 1568985, 1657928, 1717427, 1703082, 1644750, 1664356, 1577153, 1539688, 1476730, 1481261, 1548165, 1597699, 1542777, 1615709, 1603073, 1474391, 1381649, 1389028, 1399152, 1483592, 1505144, 1555487, 1640765, 1662420, 1705600, 1768974, 1706628, 1623409, 1601817, 1604369, 1578541, 1578033, 1605247, 1649802, 1663586, 1633573, 1505535, 1534877, 1536340, 1450599, 1428227, 1471836]
20342A471836j3924l9537o7938M9220Q3176L4736q0645k2721l1800m930n1648
20331A325825l3193L8646Q1465Q053j02743N8793J31603N5545m7208k5713J4297
20320A505370Q255J2982m5104M014j7249m3768k5577O74O512P2861N7964j7465
20308A519469o8734K1610L4630r5004j06934K6510N106K8768m4781N0602O2765
20297A434007k2094l2354P0833O3938j01960j28020j3984Q5808J08279m5291r3625
20286A325537o6893m371M6332N6205k1338r232R0595k3903j5314j1461R6243K5686
20274A488086J3686R80o407K7084l7781n1386n9075L5077r5756K3259m644m0526
20262A292597K8893J10257K9638o5557l527P426K4363J5524j3160q3180k8737
$$ y = [1471836, 1457912, 1418375, 1350437, 1399657, 1482833, 1517569, 1436924, 1414203, 1382403, 1377473, 1325825, 1292632, 1331278, 1412743, 1420796, 1318053, 1376846, 1508449, 1563994, 1516786, 1491073, 1505370, 1513625, 1526607, 1481503, 1485517, 1468268, 1424500, 1398923, 1399597, 1406109, 1478970, 1536934, 1519469, 1450735, 1472345, 1506975, 1411971, 1305037, 1331547, 1336653, 1365421, 1320640, 1371242, 1434007, 1411913, 1379559, 1450392, 1514330, 1412370, 1284350, 1270366, 1356174, 1464453, 1419162, 1325537, 1258644, 1254273, 1300605, 1356810, 1335472, 1326240, 1416835, 1392932, 1377618, 1366157, 1462400, 1488086, 1501772, 1502752, 1496345, 1523429, 1485648, 1434262, 1375187, 1410264, 1314508, 1337767, 1333123, 1292597, 1321490, 1431747, 1461385, 1395828, 1392301, 1399727, 1424090, 1439614, 1426454, 1343274, 1314537]
20251A314537j23563n4483R8599Q6561M6176j3185J7463q3244k6416P0283j4875
20240A317853l0243k7610K7917O1870n9338l9684P7816N3340N8621N506J8921
20229A464969m0026l3016q5993L652K1886k3141o424n3159O031j7542o0226N4451
20217A231462l5172q9195l49M0808J39352N5902p0339M015N8100k209J6485J8759
20205A367619R7538M5117K9721n7228o7369l5741NJ2441q3164k2027l2340K8958
20193A283530M9625N7J4513M6350k136n1577r610M6617K3871l730k1760o4720
20181A311030j1769j0016J5560n1779J6071k0267N0256L7143K1103O4005l1211
20170A390126m5746j6858N064k8879j07814j8014k7978l5258K2429q9878M536
$$ y = [1314537, 1190974, 1136491, 1235090, 1321651, 1367827, 1354642, 1372105, 1288861, 1262445, 1332728, 1317853, 1287610, 1260000, 1287917, 1349787, 1290449, 1250765, 1328581, 1381921, 1440542, 1446048, 1464969, 1424943, 1391927, 1305934, 1309586, 1331472, 1308331, 1301907, 1248748, 1254779, 1237237, 1177011, 1231462, 1196290, 1107095, 1106746, 1147554, 1286906, 1342808, 1272469, 1276484, 1334584, 1332375, 1348860, 1367619, 1465157, 1510274, 1539995, 1482767, 1415398, 1379657, 1379662, 1392103, 1308939, 1286912, 1254572, 1283530, 1333155, 1333212, 1347725, 1394075, 1391939, 1340362, 1330752, 1377369, 1401240, 1397510, 1375750, 1311030, 1299261, 1289245, 1304805, 1253026, 1269097, 1248830, 1299086, 1336229, 1357332, 1421337, 1390126, 1344380, 1327522, 1332586, 1303707, 1195893, 1177879, 1149901, 1114643, 1137072, 1047194, 1051730]
20159A051730J21324J29032M1902m0913l2366L7319j7766p4080o1326j8591O4550
20148A200815J978N5920K5942n4533K6526o1795j14805J018N7406J18656N5092
20137A312220o6122k4008l8P7977M8840m7187M6085P4755k4681j36206j51275
20126A110360l2470J8690L2936M2735O7282J6639o920l3001m0595R6246R146j60272
20114A120776o9506K9440R941p391l153L5859j2302O9560P7957P148N8143p3673
20102A242799r3815m6716N5273j611k2536L4679l0919n1146K2398K3757k8588
20091A103575K0019J00529Q5718N9889j78990p3973l5478q87k4919J1009M594
20080A071086R1530j2648n7229L8644M6492l1432J07533J4408o2196K5814N7005
$$ y = [1051730, 1173054, 1302086, 1343988, 1303075, 1270709, 1308028, 1290262, 1216182, 1154856, 1136265, 1200815, 1202793, 1258713, 1284655, 1230122, 1256648, 1194853, 1080048, 1081066, 1138472, 1257128, 1312220, 1246098, 1222090, 1222052, 1300029, 1348869, 1301682, 1347767, 1422522, 1397841, 1261635, 1110360, 1077890, 1096580, 1129516, 1172251, 1239533, 1256172, 1249252, 1216251, 1175656, 1271902, 1281048, 1120776, 1051270, 1080710, 1090651, 1083260, 1080107, 1115966, 1103664, 1173224, 1251181, 1258329, 1316472, 1242799, 1148984, 1102268, 1157541, 1155930, 1133394, 1168073, 1137154, 1086008, 1108406, 1132163, 1103575, 1123594, 1224123, 1309841, 1369730, 1190740, 1116767, 1081289, 1080402, 1055483, 1066492, 1071086, 1162616, 1149968, 1092739, 1131383, 1177875, 1146443, 1253976, 1268384, 1206188, 1232002, 1289007]
20069A289007o0869q7477L5680R8076L498n0845q7023j3433p885k3968o2574L0862
20057A063049j0585P61J923j3683M1225n4598j52J71031k4652j17304j0001O5329
20045A112343R3474j32240q56M8815O3634k8705k4174q823o3130K5222l6794n6899
20033I91867j334J4297J11511k34q7444J0229j4277M9929k4047n377J12632l101
20021A154651j23662K541L0560j03725l7506j872Q5666R591o1128P2037N6334
20010A083487K724k404J16414O2143P408n2547j24693o2025O4813j4815k0927
19999A059578n599K4196N4570j7804J6894J9192k1098m2884l8797L8026J3850
19988A100124j35949p2541q115N5083J14720Q4822m3352q7397k2816j197j13868
$$ y = [1289007, 1228138, 1140661, 1176341, 1274417, 1277915, 1227070, 1140047, 1126614, 1118729, 1094761, 1032187, 1063049, 1052464, 1053225, 1055148, 1041465, 1082690, 1028092, 1027940, 1198971, 1174319, 1057015, 1047014, 1112343, 1205817, 1073577, 1072721, 1121536, 1185170, 1156465, 1132291, 1123468, 1060338, 1085560, 1048766, 991867, 990533, 1004830, 1116341, 1116107, 1028663, 1038892, 1024615, 1074544, 1050497, 1045120, 1157752, 1154651, 1030989, 1033530, 1064090, 960365, 922859, 920987, 1006653, 1016244, 955116, 1027153, 1083487, 1086211, 1083807, 1200221, 1262364, 1269772, 1217225, 1092532, 1030507, 1095320, 1080505, 1059578, 1053979, 1078175, 1132745, 1114941, 1131835, 1151027, 1129929, 1087045, 1048248, 1086274, 1100124, 964175, 891634, 883519, 938602, 1053322, 1138144, 1094792, 1007395, 984579, 983382, 869514]
19977H69514n8517R7793J37425R8300J553k2791k03417n2974N7139k72k033J00261
19965A021981L9349l129L241k4688j4858P1161o6788J4165o384L4258J3903j5165
19953A067046o1386j7685o0374k4778q0154l5561R9616J7497k829M508o8899J03868
19941I40869K251L5578p4474r897O0361j21267L0847J28608o74j33412L6329R8204
19929I93323M1867o6774o1288l0160J3416L1140k8987K0293M7064m860J7018n7287
19917I14765P3019Q9386q847M7202J5939j09473o1133K1074M7633n0012M1856
19906A021409J15936j1127j13181l2633L2774p353J9082j8051j12440n457p0819
19895H18140j05914K5091K5114K1548Q5790O6817L8654m4374o4703l7851k5444
$$ y = [869514, 810997, 908790, 1046215, 1144515, 1146068, 1123277, 919860, 866886, 924025, 923753, 921720, 1021981, 1061330, 1058201, 1061442, 1036754, 1021896, 1093057, 1026269, 1040434, 1034050, 1068308, 1082211, 1067046, 1005660, 987975, 927601, 902823, 822669, 787108, 886724, 904221, 901392, 905900, 837001, 940869, 943120, 978698, 904224, 894327, 954688, 833421, 864268, 992876, 992202, 858790, 895119, 993323, 1035190, 968416, 907128, 876968, 890384, 921524, 892537, 912830, 959894, 955034, 972052, 914765, 987784, 1077170, 1068323, 1115525, 1131464, 1021991, 960858, 981932, 1029565, 979553, 1021409, 1137345, 1126218, 1013037, 980404, 1013178, 1005825, 1024907, 1006856, 894416, 888959, 818140, 712226, 737317, 762431, 783979, 869769, 936586, 975240, 930866, 866163, 828312, 802868]
19884H02868J24132K2222n0241j2449o148L9427K8400N5284l1348o4666J7519
19873I25000J41746M8004n0164l1960K9471j44019j64665Q5454O7667k4144l2455
19862H49935P4529Q6560j01068j36159k9399J18074L8100J17382p6027l8850q1341
19851H21736k3258K4802j7644l8241J12504R1795O1643M9134o2998j39764K056
19840H81765l3130J3724J03560m0183m1319n7142j1258K3178m7q4652j2569Q6294
19828H28221m958q7139r435O8349j9973n6087l7540J5016M485R9907O3625P781
19816H72252l3838R214L2506j1927O481K7008p5439l2894n504J1948p9795o094
19804G13918M8660N2319l5756M3744j2362j0208L8300l2723M6694L8133j15295
$$ y = [802868, 927000, 949222, 898981, 886532, 880384, 919811, 948211, 1003495, 972147, 907481, 925000, 1066746, 1114750, 1064586, 1032626, 1062097, 918078, 753413, 838867, 906534, 882390, 849935, 924464, 1011024, 909956, 773797, 744398, 862472, 900572, 1017954, 941927, 903077, 821736, 798478, 823280, 805636, 767395, 879899, 971694, 1033337, 1082471, 1019473, 879709, 881765, 848635, 862359, 965919, 925736, 884417, 827275, 816017, 839195, 839148, 754496, 741927, 828221, 823263, 736124, 726689, 795038, 775065, 718978, 681438, 696454, 700939, 800846, 864471, 872252, 838414, 847628, 880134, 868207, 874688, 901696, 826257, 793363, 787859, 799807, 720012, 713918, 762578, 814897, 779141, 822885, 810523, 800315, 838615, 805892, 852586, 890719, 775424]
19793G75424m4179J28337L6303n3932J2280K4642l6704L169o19J2548k2256l3020
19781H01993k4282k0392L5585k74O794l9625o4754o0650k0664l3389O2355N8117
19769G00814J7713K1795Q4634N5102l4352K5400r9978j9674O7378j5138n5334
19758G48360L7885k9887n6795L2355N047k914Q24p097m5020L124K1924l7847K5893
19745F95852K8783l4860l2373P353l6756M4718j886O2966M3869L463o620j2888
19733G61621L3704L6439R656q9861L5814k9085j36270L275P433K3092n1927m2978
19721E60913m2140k6873Q2456Q8325J15934k7329l3405o2752j12791j612M7456
19710E88182L1304q795L5476J16876j1988M292m4060J9681K1363k0523r6055k7145
$$ y = [775424, 731245, 859582, 895885, 841953, 854233, 878875, 842171, 845340, 844721, 857269, 835013, 801993, 777711, 757319, 792904, 792630, 799424, 759799, 695045, 634395, 613731, 580342, 642697, 700814, 718527, 740322, 824956, 880058, 845706, 871106, 771128, 751454, 818832, 803694, 748360, 786245, 756358, 699563, 731918, 736965, 734051, 734875, 727778, 682758, 685882, 707806, 669959, 695852, 724635, 689775, 657402, 664755, 627999, 672717, 670831, 733797, 777666, 781129, 774509, 761621, 795325, 831764, 841420, 751559, 787373, 758288, 622018, 625293, 632726, 655818, 603891, 560913, 518773, 491900, 574356, 662681, 778615, 751286, 717881, 655129, 542338, 540726, 588182, 619486, 610691, 646167, 763043, 751055, 755347, 711287, 730968, 752331, 731808, 635753, 608608]
19698F08608R1525l0690M337K0140l9379p036J02745k6594k8919L3640m3039l4601
19686F50737l8703k7590L9896Q2962l9027o0P0411p2336P722o7011N6974J06293
19674G70268k0796j55935K8811q544q8177J0592R5701O0546O0764Q3807k3571
19663H13466j5310m2157k2062j26495q2895Q3376L78L624K7611r829M40N3870
19651F84017P4965K1266o7133J524M5356q2748j8573j7468n7582o3622N2725j1222
19639E61505L2647J39963R6590j39773p6278P2912n9291j03748K4915q2047Q2858
19628E50253N5461p1859N6428P2132O2197R21m7276o8598k8007O1286J2215j9368
19616F35785J4816M7799J08401m7526k2030r2793r0691k6047J59866O1876k0250
$$ y = [608608, 700133, 669443, 673780, 693920, 654541, 647505, 750250, 723656, 694737, 728377, 685338, 650737, 612034, 584444, 624340, 707302, 668275, 668215, 738626, 666290, 674012, 607001, 663975, 770268, 749472, 593537, 622348, 613804, 525627, 536219, 631920, 692466, 753230, 837037, 813466, 798156, 755999, 733937, 607442, 524547, 607923, 608301, 611925, 639536, 629707, 630147, 684017, 758982, 780248, 713115, 714639, 759995, 677247, 658674, 641206, 583624, 520002, 572727, 561505, 594152, 734115, 830705, 690932, 614654, 687566, 628275, 524527, 549442, 467395, 550253, 605714, 533855, 590283, 662415, 724612, 725533, 678257, 609659, 581652, 642938, 655153, 635785, 650601, 698400, 806801, 759275, 737245, 644452, 553761, 527714, 687580, 749456, 729206]
19605G29206m0883l4779l40r5036r4415L1714R4465J0k1500O3950J07822M7206
19593G87420m6730q9799j06197k3212K7631n9557M2803K2194N2930K1157j4172
19582F14468K467N1621o8947m6338l745l5531K7397L7941N6220P1639q338k8164
19570F70690k3093P5372p514j05240m874L534N6375m9699m9550m8064N2740K3932
19558E94609L3456J5788N8985N1534K7288k2343k8366o332k7056l9000M2077J0072
19546G10712j3598m65j24552o3978K3653L0541P9669J23777j30242q3588m743
19535E47186j6396K7175l2117k9975k4805j1481L7930q0770R8502J01129r7986
19524E18392L5245k320l823k2551m3150R479J02723M5721j8774k350n9033j850
$$ y = [729206, 688323, 653544, 653204, 558168, 463753, 495467, 589932, 589942, 568442, 632392, 740214, 787420, 740690, 650891, 544694, 521482, 549113, 489556, 532359, 554553, 607483, 628640, 614468, 616935, 668556, 599609, 553271, 549526, 513995, 541392, 579333, 635553, 707192, 698854, 670690, 647597, 722969, 715455, 610215, 605341, 608875, 665250, 615551, 566001, 517937, 570677, 594609, 628065, 643853, 702838, 754372, 781660, 759317, 730951, 724619, 697563, 658563, 700640, 710712, 697114, 696649, 572097, 508119, 531772, 562313, 641982, 765759, 635517, 551929, 547186, 530790, 557965, 525848, 495873, 471068, 459587, 497517, 416747, 515249, 616378, 518392, 553637, 551317, 547494, 524943, 481793, 491272, 593995, 639716, 620942, 618592, 559559, 557709]
19512E57709J1760n3949k8945K0124N6969K6740j01801j2485M3481M1857M6449
19501F07909l639l7405J1066L9659Q4581l5372j61416N0773N0469n5148j3114
19490E38363K9790q822m1965n2707L6946M1474m0396j5513O4638j04177J4360
19479D61991M5721L6584M9551L2169n7041j30132n0901p2862L2514L6136R1922
19468D75652L3082K2590L6157p1449j4588j6726M355Q6549o796o2739j23559o7644
19456B94884N4692M4790l1041O3886K4408M400n1259O930J05823j3059m939m1810
19444D57705k9667L1867R6273J00821k1516k3599m7825k2123L3422j4576j16896
19433D43886J2269M2683J5111q0458j5966P5282n5854o4935m329R3530L2398L0465
$$ y = [557709, 569469, 515520, 486575, 506699, 563668, 590408, 488607, 476122, 519603, 561460, 607909, 604270, 566865, 577931, 617590, 702171, 666799, 505383, 556156, 606625, 551477, 538363, 568153, 559331, 517366, 464659, 501605, 543079, 502683, 487170, 551808, 447631, 461991, 507712, 544296, 593847, 626016, 568975, 438843, 387942, 315080, 347594, 383730, 475652, 508734, 531324, 567481, 496032, 481444, 464718, 469073, 555622, 548826, 486087, 362528, 294884, 349576, 394366, 363325, 427211, 451619, 456019, 404760, 411690, 517513, 504454, 499515, 457705, 428038, 459905, 556178, 656999, 635483, 611884, 564059, 541936, 575358, 560782, 443886, 456155, 498838, 513949, 433491, 417525, 492807, 436953, 372018, 367689, 461219, 493617, 524082]
19421E24082K562N8873o8494p1338j13214r4144r5542J495J83279N7554R3681
19410D78794m5700j09330P3919M8801m2136O0R1973M9182n2780j2367l8452l1932
19398D10032N743J5033j0603p9005O1598J7450k1567J39196m3170j00246P072
19387D01533R6759k516J9726N1955p1571n2300K0209J8045Q475Q5063j2303m4110
19375E18965j7153k7145n5583p9928J0012j19821m952Q9732M2919P4914q1148
19364C50812m4216Q0081K9061l8797j6994K096m193q4696M2444R7728n9603N4024
19352D07747k5169N1185M9859n13L3856K5001m7458m5200K5674o0088o6273J854
19340C50475K0438L4245M2789J8710J2769n8361j8294O1266m5921n8564o1952
$$ y = [524082, 526644, 585517, 517023, 445685, 332471, 238327, 142785, 144280, 327559, 385113, 478794, 433094, 323764, 397683, 446484, 404348, 404408, 496381, 545563, 492783, 480416, 441964, 410032, 415775, 430808, 420205, 341200, 402798, 420248, 398681, 537877, 494707, 394461, 401533, 498292, 495776, 515502, 567457, 495886, 443586, 463795, 481840, 490315, 575378, 563075, 518965, 501812, 474667, 419084, 339156, 349168, 229347, 224395, 314127, 357046, 431960, 350812, 306596, 386677, 415738, 376941, 359947, 362043, 357850, 273154, 315598, 413326, 353723, 407747, 382578, 433763, 483622, 483109, 516965, 541966, 494508, 449308, 474982, 414894, 348621, 350475, 370913, 405158, 447947, 466657, 479426, 421065, 402771, 464037, 418116, 359552, 297600]
19329B97600n1557o754R141Q448L2727O4382N6573J6887K0181m0781n0856K1418
19317C77409k552k0120J6536r9711l042N4377n2445O519n3713Q7312J3875K5955
19305C50400j529q893j4557j51128L424J08908L9031l7935J445L2441J8666k6721
19293C13552l4483l0567N3871J08066J07265p9058q2802j04778q8104R4035j5944
19282B41053N0178K0050M1325j6768l2123L5298m2625l1938P5575j4726K690q0482
19270B47507N2415P2046m3400m8086O0806j0166K0378J4666n3495j5429k204L5777
19258C30815M8953M1104K970k2360q1187n819o3131k6837J9307l1373m328L8127
19246B46241N5281L4702L7625L2305o0783j7730R9157J0283m961l0944l7009o3416
$$ y = [297600, 246043, 239289, 248430, 256878, 289605, 353987, 410560, 427447, 447628, 406847, 355991, 377409, 374857, 354737, 371273, 271562, 268520, 322897, 270452, 276971, 223258, 310570, 324445, 350400, 348871, 339978, 325421, 174293, 177717, 286625, 325656, 287721, 289166, 321607, 340273, 313552, 279069, 248502, 302373, 410439, 517704, 438646, 355844, 251066, 162962, 256997, 241053, 291231, 311281, 352606, 335838, 303715, 339013, 296388, 264450, 340025, 325299, 327989, 247507, 299922, 371968, 328568, 280482, 341288, 331122, 351500, 366166, 312671, 297242, 295038, 330815, 379768, 420872, 423842, 401482, 320295, 314476, 251345, 224508, 243815, 212442, 208114, 246241, 301522, 336224, 373849, 406154, 345371, 327641, 426798, 437081, 432120, 401176, 364167, 300751]
19234C00751K152N0936k454N8750J3884k7328j4788l2115r600K8453j2650j08791
19222B47200J2677Q183m4998L3518M4620n5416O142O928l7549M0674k3489n1737
19210A86753r1400Q5183Q1576Q241N4548N7585M8189j9917q7035m5397n0025k512
19198B25789j8805M6640L4473J4382k2305m5147l0398L516K3300J23524k1106
19187C33863l3728Q6735j1059n6278j9212l1709n0832O9876M3829l3194N258k0746
19175B82803k2981P0130j4251q6252o3244j0746K3294p783k4955J6258j7030O4436
19163B09679K6692M7436Q4292j3114n1253k0300J5710J9615J11666J3683k6723
19152D17383n0721n6695o7119j60636o9414L1636j5433m962J06929R6390m5094
$$ y = [300751, 302903, 353839, 351385, 410135, 424019, 396691, 381903, 349788, 340188, 368641, 355991, 247200, 259877, 268060, 223062, 256580, 301200, 245784, 251926, 258854, 221305, 261979, 238490, 186753, 95353, 180536, 262112, 270353, 324901, 382486, 430675, 410758, 323723, 278326, 228301, 225789, 206984, 253624, 288097, 302479, 280174, 235027, 204629, 208145, 231445, 354969, 333863, 300135, 386870, 375811, 319533, 300321, 268612, 217780, 287656, 331485, 298291, 303549, 282803, 259822, 329952, 315701, 229449, 166205, 155459, 178753, 170970, 146015, 162273, 145243, 209679, 236371, 283807, 368099, 354985, 303732, 283432, 299142, 318757, 430423, 444106, 417383, 366662, 309967, 242848, 82212, 12798, 44434, 29001, 24039, 130968, 227358, 182264]
19141A82264L9445L2224k5766j55075l9511j2517l88Q2473J52583R9025k1829
19130C32928n713K0152j2675k2550L5005M126n6970m7975n5178K2889k4731R0004
19118B79312N3468j24759j49130m0333R2663N6666K0919J5055j8302P8318P0776
19107C34653k0213l9016j13252l9094Q8545l06p160K2005Q2885Q0620L6592p4419
19095C51840j2989N7933r1518n9219p1891O0903j5563J8721n8866m0757M6785
19084A85379m0600m2808p940j5199n2212k5836k4079R168Q1239J16961P5952J09358
19072C69383N3742j12039j49015n6252N0085O4332P0902o8155k0752Q079l5614
19061A74696m722J9471n4025o9518P5706O0379R2114o8595o6427N7525m5032k9836
$$ y = [182264, 221709, 253933, 228167, 73092, 33581, 21064, 20676, 103149, 255732, 354757, 332928, 327215, 347367, 334692, 312142, 347147, 351273, 294303, 246328, 191150, 214039, 189308, 279312, 332780, 208021, 58891, 18558, 111221, 167887, 188806, 203861, 185559, 263877, 334653, 314440, 275424, 162172, 123078, 211623, 211317, 204157, 226162, 309047, 389667, 426259, 351840, 338851, 396784, 305266, 246047, 174156, 235059, 219496, 238217, 179351, 138594, 185379, 144779, 101971, 94031, 78832, 26620, 784, -23295, -14127, 67112, 184073, 260025, 369383, 423125, 311086, 162071, 105819, 155904, 220236, 291138, 222983, 202231, 210310, 174696, 169974, 189445, 135420, 65902, 141608, 201987, 294101, 225506, 159079, 216604, 171572, 141736]
19049A41736o1618j9904N5392M9708P656j4483k7875k4147N1583L6359K339k2914
19037A73832n8109p3731J9056J9441n2086l9088J2658J25078Q298J7203J794l8716
19025A15630k6854j7681R277R2692q8158l2635K2474m3621k3926p2171J9486R3814
19013D8327M844J1399N0725K6000m1699m5939R3665q3814k5941Q456k7281L8035
19001E6777M4042J6096K505p0012n4398J575R1712k6993O685L2517j533N2609
18989A51582q3065p3618L3035M8984M2746Q484J792N6l7078o905m8841P068k1873
18976B2367r956O6343Q6390M6962j4343K4995m431k7305j27965j01512N3947O677
18964B2169o1567O6768m992l5951L8146N2012O1669m663q0282O4245N0068L2554
$$ y = [141736, 80118, 60214, 115606, 165314, 172970, 158487, 130612, 106465, 158048, 194407, 196746, 173832, 115723, 41992, 61048, 80489, 28403, -10685, 1973, 127051, 135349, 152552, 154346, 115630, 88776, 71095, 80372, 173064, 84906, 52271, 74745, 31124, 7198, -64973, -45487, 48327, 53171, 64570, 115295, 141295, 99596, 53657, 147322, 63508, 37567, 46023, 18742, 56777, 100819, 116915, 119420, 49408, -4990, -3415, 88297, 61304, 67989, 100506, 98973, 151582, 68517, -5101, 27934, 76918, 119664, 128148, 129940, 129996, 92918, 86013, 37172, 44240, 22367, 12411, 78754, 165144, 212106, 197763, 222758, 218327, 191022, 63057, -38455, 15492, 22169, -39398, 27370, 22378, -13573, 24573, 76585, 138254, 133591, 53309, 117554, 167622, 200176]
18952B00176o8583l4644n0577Q7894M4651j03449m1719N1882p9649m7461J1305
18941c0174K357r296j3654P746Q664o1121l6719l6207r0014J01729J70104J3986
18929B7401J5563k1893r574R0269r125n5863J2874Q6725N4098L7667p5862p2276
18917H0004J0941K2510m7331o9722J8936J4904J07744Q1116L0554q8685j06689
18906E4282n8324O8608k2828l2572M3907j4204M2115k4681j01039m9578O877R4813
18894G376p0283l4068P3913R1657l4959k3705m9194j6495Q5285Q228n5562l643
18882b1450K2278M5510m7316j9055M1633m3217o1965M8231O3048q6208k7577J9259
18870f6829j9170m1955M8699J1097K6002j8610j158L9451L427j8222l8106p610
$$ y = [200176, 131593, 96949, 46372, 134266, 178917, 75468, 33749, 85631, 5982, -41479, -30174, -27817, -37113, -50767, -43021, -34357, -95478, -132197, -168404, -258418, -156689, 13415, 27401, 42964, 21071, 11497, 101766, 92641, 36778, 49652, 136377, 190475, 228142, 152280, 80004, 90945, 113455, 66124, -3598, 15338, 30242, 137986, 219102, 249656, 160971, 54282, -4042, 64566, 41738, 9166, 53073, 38869, 80984, 56303, -44736, -94314, -87437, 7376, -62907, -96975, -23062, 68595, 33636, 9931, -39263, -55758, 29527, 37755, -17807, -21450, 828, 46338, -978, -20033, 21600, -21617, -83582, -35351, 27697, -58511, -86088, -66829, -85999, -127954, -79255, -68158, -42156, -60766, -61924, -22473, -19046, -37268, -75374, -82984]
18858h2984R721k4056j43157j9748j2177N2128J57678J85140j6436n384j6210
18847H4515j36561j49053k0082R9848K6159L6072L4800L6748O0994l5018o7607
18836b9185O9190N274j29874q3264n2044N836N4292J0236l7513L3937Q6327L3052
18824c3736K489m2118l2278K087j4094M4921N1084j9598j14431o6610n3797j7550
18812b93631R2024J01454l1679j6594n700L8881n3847n9797L6387P2813P2710
18801d6979K7891j6220k9861k3982K7541J3386q772K0717J9581J1179k1252m6060
18789g2831m4633L210l6663l5267K7833p7732l1534M1024j897J15292R8444M2891
18777B8137l2959j0726k9692k3447K4673L438l6341k2070r1166O3316J41485O5714
$$ y = [-82984, -73263, -97319, -240476, -260224, -272401, -220273, -62595, 122545, 106109, 100725, 84515, -52046, -201099, -221181, -121333, -95174, -59102, -24302, 12446, 73440, 38422, -29185, 40005, 45279, -84595, -167859, -219903, -214067, -159775, -149539, -187052, -153115, -66788, -33736, -31247, -73365, -105643, -103556, -117650, -72729, -21645, -41243, -155674, -222284, -276081, -293631, -201607, -100153, -131832, -148426, -154126, -115245, -169092, -228889, -192502, -119689, -46979, -19088, -35308, -65169, -89151, -61610, -48224, -56996, -36279, -16698, -5519, -26771, -72831, -117464, -114254, -150917, -186184, -158351, -236083, -267617, -226593, -228490, -113198, -14754, 28137, -4822, -15548, -45240, -68687, -44014, -40576, -76917, -98987, -190153, -126837, 14648, 80362]
18765H0362L0375j8632N8215Q9128Q5893P9133n3384O7505N6738K8358L347P0062
18753E77100K1801o8975N6494R5846k4559M6636J00691j26118n264N0040K6658
18742G50350m1915k2408L397K3121j3512M478j1228k6079j02383n4009P6983k5332
18730E61463n1688p9500j1610J9443N571L2862L2344J9291l8924Q3684P3899n5835
18718E91000j2316m4650m7572J02242N5621n333N422J14812j1273J5548L9911
18707H03412K4849l1194P652j57864j06363L6334k6246m5673k8770q5737k4806
18696C65594P502n9546n6875o2504L131k1983p6422r971J4397M2274j15806m6764
18684a6973J1960M5316k3716k5933p824l4409j6604N7638m8586N376k8312j45605
$$ y = [80362, 110737, 92105, 150320, 239448, 325341, 404474, 351090, 418595, 475333, 503691, 507038, 577100, 598901, 529926, 586420, 682266, 657707, 704343, 805034, 678916, 673652, 723692, 750350, 708435, 686027, 689424, 712545, 699033, 703511, 692283, 666204, 563821, 509812, 586795, 561463, 509775, 430275, 418665, 438108, 443679, 476541, 508885, 528176, 489252, 572936, 646835, 591000, 578684, 534034, 486462, 588704, 644325, 638992, 644414, 759226, 747953, 763501, 803412, 828261, 797067, 804719, 646855, 540492, 576826, 550580, 504907, 476137, 390400, 365594, 373096, 313550, 256675, 194171, 197302, 175319, 98897, 88926, 103323, 145597, 29791, -16973, -5013, 40303, 16587, -9346, -17170, -51579, -68183, -10545, -59131, -53755, -82067, -227672]
18672b27672L465k4340J0394j5105R2286J30644r6125k6142P3833j457J3166K0245
18660d6808m6471k8698R2697k9048K6813P8149J2370J9289K7983r8530p4894l8566
18648a05714K7741N3039L4477p7306k3538O831m508j38330N4749K9817m2667o0120
18636b45529o8575l5276l9410l415Q2415k7745p6275J8489l9345K8151N3603O1310
18624b91602J7114m794J34n7104j17092O2269J08594j27796j39326N3613K0188
18613d75802m8938L7970P3942R8694R1986l1222k6946p6054m7383J3092O8514
18602c22147M3218j9803K7916k054m6128l8120k5661J4609J18396O0652l6217
18591b25339j0791O894l9323j14372N3817L3020j10570r2694o6582L3778R8337
$$ y = [-227672, -224207, -248547, -238153, -253258, -160972, -30328, -126453, -152595, -78762, -80219, -67053, -46808, -93279, -121977, -29280, -58328, -31515, 46634, 59004, 78293, 106276, 7746, -67148, -105714, -77973, -24934, 9543, -67763, -91301, -84470, -88978, -227308, -172559, -142742, -185409, -245529, -314104, -349380, -388790, -392205, -309790, -337535, -413810, -395321, -434666, -406515, -352912, -291602, -274488, -279282, -279148, -336252, -453344, -391075, -282481, -410277, -549603, -495990, -475802, -524740, -486770, -412828, -314134, -222148, -253370, -280316, -356370, -403753, -390661, -322147, -278929, -298732, -270816, -272870, -318998, -357118, -382779, -368170, -249774, -189122, -225339, -236130, -229236, -268559, -382931, -329114, -296094, -406664, -499358, -565940, -532162, -433825]
18580d33825J0266o1977p0553L9112M880j4222R5125J9690l6540o288m9621m3534
18568e47487j0804J29579L5856m6386K1747M2297N4692M895j69320j30575m3043
18557f58549K2210J03161j1919K9206n2970m9865L801R9833j2163K6890L8016
18546d62349n0266K5207l565J1851L7291q323M6824O3311j6938n9817o7687j1748
18534d96209N7312m0390n5945o2766l6838Q8877Q3757J32K8148p349N264L0903
18522d05104p5409j34326j3312Q7890L5075L3554m7034P03K6550p7965O161M3007
18510e20210o716l5L3872o232l2572L7706j1967j7665k9279M6656M8563m431l0262
18497d92572m8376j9406L9527l4038q3671P4989J7760J905J576p750p9838o4437
$$ y = [-433825, -423559, -485536, -556089, -516977, -512097, -526319, -431194, -411504, -448044, -454332, -503953, -547487, -558291, -428712, -392856, -439242, -417495, -375198, -320506, -315611, -484931, -615506, -658549, -636339, -533178, -545097, -515891, -568861, -618726, -614925, -515092, -527255, -500365, -462349, -512615, -487408, -490973, -479122, -441831, -450154, -403330, -340019, -356957, -416774, -484461, -496209, -438897, -479287, -535232, -597998, -634836, -545959, -462202, -462070, -433922, -441271, -436007, -405104, -480513, -614839, -628151, -540261, -505186, -471632, -518666, -517963, -491413, -569378, -563217, -520210, -526926, -526961, -493089, -499321, -531893, -494187, -506154, -523819, -553098, -506442, -457879, -462310, -492572, -540948, -560354, -520827, -554865, -638536, -563547, -545787, -543882, -542306, -550056, -629894, -694331]
18485f94331m6989J8143j1507q661O4377R5992O7928r862M4231j2297k1591L1436
18473d83131K4127p7724p1580J29j12078j0179j7927j6467m4130j4621L7098M0590
18461g45893K9154R758j0875q3144n6826L3448J06132k1842p9557j2762k3435
18450h55842k9212n8315K220L6062M9828M0709l6324l9010n0519O7519k93J9221
18438h53956k6718O898o509l1723r7784l9487M488O3407J6326l1598r430M4365
18426i61721j9617m1110j14478q924l3027k5567R6196R895l0101O8083K2986k1269
18414a058654N017j2250J6192K8639O677j2239L0513N4808m6711m1059k3351l7398
18402a089816o205K0876j7588q130k0677P7870N3466R486j9924p008j6340j2060
$$ y = [-694331, -741320, -723177, -734684, -743345, -678968, -582976, -515048, -524910, -480679, -492976, -514567, -483131, -459004, -536728, -608308, -608179, -720257, -730436, -748363, -764830, -808960, -823581, -786483, -745893, -716739, -706981, -717856, -801000, -857826, -824378, -718246, -740088, -819645, -832407, -855842, -885054, -943369, -941149, -905087, -855259, -814550, -850874, -889884, -940403, -872884, -873177, -853956, -880674, -873776, -880285, -912008, -1009792, -1049279, -1044791, -981384, -965058, -996656, -1006086, -961721, -981338, -1022448, -1136926, -1145850, -1178877, -1204444, -1108248, -1098353, -1128454, -1060371, -1037385, -1058654, -1053637, -1065887, -1049695, -1021056, -1014379, -1026618, -996105, -941297, -988008, -1029067, -1052418, -1089816, -1096021, -1075145, -1092733, -1100863, -1121540, -1043670, -990204, -980718, -1000642, -1007650, -1023990, -1036050]
18390a036050p4924o5376M5276P366p653P2296P3021j7038P2644P9068J01027
18379g50343m7704M2541N2172k2527L374O8596O8505O8743Q8451J68177N0171
18368b09844K071r440q558J03116K0312l4721k6486N3170J32322N3242n9899N3137
18356F8422O5836o4533j0269k5189o0822j1555n6331P5221m0676q7860k3317p0268
18344b41341L3442J6171q4968j29180M2220M3683Q4488N2038j01540j22265k3770
18333d31022p4462n4866j9585j0059j19673o6357j27893L3081J9801R880j06132
18322i47287k17463m9795o0466n1736k9839R925n4759n9434j12412l9451J2626
18311a600091o8587p5443k384j32569j9074j5843N1727K4884k2299L188Q0171
$$ y = [-1036050, -1110974, -1176350, -1131074, -1123708, -1131361, -1059065, -986044, -1003082, -930438, -851370, -750343, -798047, -755506, -703334, -725861, -722487, -653891, -585386, -516643, -428192, -260015, -209844, -207773, -217213, -225771, -122655, -102343, -137064, -163550, -110380, 21942, 75184, 15285, 68422, 134258, 69725, 59456, 34267, -26555, -38110, -94441, -19220, -59896, -147756, -171073, -241341, -207899, -191728, -276696, -405876, -363656, -319973, -235485, -183447, -284987, -407252, -431022, -505484, -560350, -579935, -589994, -709667, -776024, -903917, -870836, -851035, -841155, -947287, -1164750, -1214545, -1275011, -1326747, -1356586, -1346661, -1401420, -1460854, -1573266, -1612717, -1600091, -1668678, -1744121, -1746505, -1879074, -1898148, -1913991, -1862264, -1837380, -1859679, -1856491, -1776320]
18300a776320P6418j9790n8539k8172o8272L4344L7953l123n9611k0670o9479
18289a955261j4490J50508J44605L1916K2021k086k3318p024N1030L4864N4490
18278a512745N4416j8695P3849P6431M7313O1790J29159M2905Q9039J08242O7715
18267g80581Q6049J05067J86609J37605J44826J83516L50651L56275L44068M66269
18257A580354N77780N46465P14336P49964Q86355R30336J054144J203410J443410
18248I686554J726873J959409K208761K476655K939610L361403L961211M695709
18240C3016185N625476O696949P888983Q981682R967107J1296902J2964466J4207377
18232A10645127J3162625Q840592M424919M317162P589292J1260577J4992512
$$ y = [-1776320, -1699902, -1719692, -1778231, -1806403, -1874675, -1840331, -1802378, -1805501, -1865112, -1885782, -1955261, -1969751, -1819243, -1674638, -1642722, -1620701, -1622787, -1646105, -1653129, -1602099, -1567235, -1512745, -1458329, -1477024, -1403175, -1326744, -1279431, -1217641, -1088482, -1045577, -956538, -848296, -780581, -694532, -589465, -402856, -265251, -120425, 63091, 413742, 770017, 1114085, 1580354, 2158134, 2704599, 3418935, 4168899, 5055254, 5985590, 7039734, 8243144, 9686554, 11413427, 13372836, 15581597, 18058252, 20997862, 24359265, 28320476, 33016185, 38641661, 45338610, 53227593, 62209275, 72176382, 83473284, 96437750, 110645127, 123807752, 132648344, 137073263, 141390425, 148979717, 160240294, 175232806]
18225A75232806J8601356K0025508J5995671N805804m062621p052071o479061
18218B18067392p353513p112655k718343L108734Q301512J2963224J6830848J6782016
18210B58869215R284527k808523r165007m960635J516941J092753q104159j7033238
18202B28691874j6758079j0720370m269724J289254O198368R025898P557148J957009
18194B22971378k044343J32127N452917P471905J442029j1627806k1341896k0410284
18186A82046027j4403543r193963m816359j647169j056846n082260j2210102j6417658
18178A17218127j4874618j1190501q110110o242846m973342m064497l252272k864373
18170F1645568k661970k422271k187888j914230j773302j641785j467033j431190
$$ y = [175232806, 193834162, 213859670, 229855341, 235661145, 231598524, 224546453, 218067392, 210713879, 203601224, 200882881, 203991615, 212293127, 225256351, 242087199, 258869215, 268153742, 265345219, 256180212, 251219577, 252736518, 253829271, 245725112, 228691874, 211933795, 201213425, 196943701, 198232955, 204431323, 213457221, 221014369, 222971378, 220927035, 221059162, 226512079, 233983984, 235426013, 223798207, 202456311, 182046027, 167642484, 158448521, 153632162, 151984993, 150928147, 145845887, 133635785, 117218127, 102343509, 91153008, 83042898, 76800052, 71826710, 67762213, 64509941, 61645568, 58983598, 56561327, 54373439, 52459209, 50685907, 49044122, 47577089, 46145899]
18162D6145899j357291j129583j280748j294169j103878j040801q85660q34849
18154C7218920q40235p70261p40363p11030o31554o16471o99225n77143m29676
18145C1202962m70089n71853m72880m25025l30208m41579m37658l89684l72960
18136B7291026m33265l85148l55424l36314l17712j85350k33214m21233l67129
18127B4256237l44099l27267l49535l89285k67766l88634l16839k61463j80663
18118B1430686j58481l02673k96104k70827l49929l60200l34932l82331k79421
18109A8695788k25531k36127l15953l19751k47662l14516l55848l88587l77841
18100A5913972l63347l46498k84244l12380l85308l14902k02844l39451l90372
$$ y = [46145899, 44788608, 43659025, 42378277, 41084108, 39980230, 38939429, 38053769, 37218920, 36378685, 35608424, 34868061, 34157031, 33525477, 32909006, 32209781, 31632638, 31202962, 30732873, 30161020, 29688140, 29263115, 28932907, 28491328, 28053670, 27663986, 27291026, 26857761, 26472613, 26117189, 25780875, 25463163, 25277813, 25044599, 24623366, 24256237, 23912138, 23584871, 23235336, 22846051, 22578285, 22189651, 21872812, 21611349, 21430686, 21272205, 20969532, 20673428, 20402601, 20052672, 19692472, 19357540, 18975209, 18695788, 18470257, 18234130, 17918177, 17598426, 17350764, 17036248, 16680400, 16291813, 15913972, 15550625, 15204127, 14919883, 14607503, 14222195, 13907293, 13704449, 13364998, 12974626]
18091A2974626l76154k14330j82792k01928k54981j94160l52010k84873j56426
18082A0756972k40355k55114k12761k22839k37146l27347j88202j75903k70966
18073H626339l00071j59052r1720k63956k20937j54702k44957k64854k73475k05182
18063F447433j79160j30554k09823k00838j37218j33421k39293j98039n3182n1625
18053D914280k33656j84885p7910j02733o952o7321j75987j96236p0874J6397
18043C814123j68946k13740n1327N0421K984N326j20565j41913q6193r9461n2517
18032B938192j0385k4927l2626j27148n2588m9875q1062P3982P0300M456o1658
18021B646661n4051j5176J607Q480N5922J5854j6326q7735M1754M4874J8064p8637
$$ y = [12974626, 12598472, 12384142, 12201350, 11999422, 11744441, 11550281, 11198271, 10913398, 10756972, 10516617, 10261503, 10048742, 9825903, 9588757, 9261410, 9073208, 8897305, 8626339, 8326268, 8167216, 8075496, 7811540, 7590603, 7435901, 7190944, 6926090, 6652615, 6447433, 6268273, 6137719, 5927896, 5727058, 5589840, 5456419, 5217126, 5019087, 4965905, 4914280, 4680624, 4495739, 4417829, 4315096, 4308144, 4240823, 4064836, 3868600, 3797726, 3814123, 3645177, 3431437, 3380110, 3430531, 3433515, 3438841, 3318276, 3176363, 3090170, 2990709, 2938192, 2927807, 2902880, 2870254, 2743106, 2690518, 2640643, 2559581, 2633563, 2703863, 2708319, 2646661, 2592610, 2577434, 2579041, 2587521, 2643443, 2659297, 2642971, 2555236, 2596990, 2641864, 2659928, 2581291]
18009B581291L0086P3933L5515n9775J7237K5874N381M2511j6134L264k5846p615
17997B705722M6233M7669L8254j0677p029O8379N7622J43619O376P4743J31610
17986C302521J77315O2006P4186J32073P2213r3940r9217M6146q0394j3716n1203
17975C527990n801J08125j7169j21322L5092J5171P1677P0441p8916j53492j33329
17964C318467j84309j51719q2125j23174J5850n2531L0657Q1510m0762O9518k5191
17953B856191j37498m3168j8176L3972o3491j6836o1807r3422m7375J0170N5904
17942B474464N7586j11633r3815L8732j5626K9045k4047j45114j5263K6220q470
17931B212079L2359k8300p2625J3667o1331q3902P12K1441l9474P1386M1118L8710
$$ y = [2581291, 2611377, 2685310, 2720825, 2661050, 2678287, 2704161, 2709542, 2752053, 2735919, 2739183, 2713337, 2705722, 2751955, 2799624, 2837878, 2827201, 2820172, 2888551, 2946173, 3089792, 3096168, 3170911, 3302521, 3479836, 3541842, 3616028, 3748101, 3820314, 3726374, 3627157, 3673303, 3592909, 3579193, 3527990, 3522189, 3630314, 3613145, 3491823, 3526915, 3542086, 3613763, 3684204, 3605288, 3451796, 3318467, 3134158, 2982439, 2900314, 2777140, 2792990, 2740459, 2771116, 2852626, 2811864, 2881382, 2856191, 2718693, 2675525, 2657349, 2691321, 2627830, 2610994, 2549187, 2455765, 2408390, 2418560, 2474464, 2532050, 2420417, 2326602, 2365334, 2349708, 2378753, 2354706, 2209592, 2194329, 2220549, 2212079, 2244438, 2216138, 2143513, 2157180, 2095849, 2011947, 2012659, 2034100, 1994626, 2066012, 2107130, 2145840]
17919B145840o6500M995L0166N1104M993J24849Q0902l9796j03071l6282r533
17908B187667J3985P255l0777R415K1560N2736p1586L6871j9112p1032m5345l1964
17896B059673o3218j03641j1596O0642o6676m4102j1499q6960n5332R522n5738
17885A631075n6432l3444o6107P2078K2007j28772r2002j54813m2446j1818j47169
17874I92157l1556k9939L1856K9481j25457o6630M9827k8274n0749K3059m876
17863G88899o7695L3889j9040o8085m2852M0092J10925n6113j8372J06057N3431
17852H61136r2201p0277l418q4971p8986o8718M7299J43393R8749p254o903j01838
17840F36011K9788O1008j4036K4177J3634J3176l785L6733p1930n181Q3143O6327
$$ y = [2145840, 2079340, 2084335, 2114501, 2165605, 2170598, 2295447, 2376349, 2336553, 2233482, 2197200, 2187667, 2201652, 2208907, 2178130, 2187545, 2209105, 2261841, 2190255, 2227126, 2208014, 2136982, 2091637, 2059673, 1996455, 1892814, 1881218, 1941860, 1875184, 1831082, 1819583, 1732623, 1677291, 1686813, 1631075, 1574643, 1541199, 1475092, 1547170, 1569177, 1440405, 1348403, 1193590, 1151144, 1139326, 992157, 960601, 930662, 962518, 991999, 866542, 799912, 849739, 821465, 770716, 793775, 788899, 721204, 755093, 736053, 667968, 625116, 665208, 776133, 720020, 701648, 807705, 861136, 768935, 698658, 695240, 610269, 531283, 462565, 509864, 653257, 752006, 744752, 737849, 636011, 665799, 726807, 712771, 736948, 750582, 763758, 759973, 796706, 724776, 719595, 802738, 869065]
17828H69065N3206J1636p077l0957J425J18859m9149M227L8740O0266k2521k3507
17816A024213O7020J3815M5312J02034M9973o7897N8082J06805J35477R9032J62806
17805A796672K23196J56997J30624K31177K06228L77261M22925L82980L70096
17796D298156N88002P00282P39851P95977R77970R84080J115331J259067J388006
17787A2846722J569398J806080K118726K490094K792327L151877L752702M494094
17779C5022020N112201N906742O781998P628807Q430282Q816794R165288J0364050
17771I7228182J2291466J3937329J2186279N432227l189260p377679n345891j062917
17763A24099736L015198N984782Q027917R873500J1928737J3872024J4976117
$$ y = [869065, 922271, 933907, 926830, 895873, 897298, 1016157, 967008, 971235, 1009975, 1070241, 1047720, 1024213, 1091233, 1105048, 1150360, 1252394, 1302367, 1234470, 1292552, 1399357, 1534834, 1633866, 1796672, 2019868, 2176865, 2307489, 2538666, 2744894, 3122155, 3545080, 3928060, 4298156, 4886158, 5586440, 6326291, 7122268, 8100238, 9084318, 10199649, 11458716, 12846722, 14416120, 16222200, 18340926, 20831020, 23623347, 26775224, 30527926, 35022020, 40134221, 46040963, 52822961, 60451768, 68882050, 77698844, 86864132, 97228182, 109519648, 123456977, 135643256, 141075483, 137886223, 130508544, 125162653, 124099736, 127114934, 133099716, 141127633, 151001133, 162929870, 176801894, 191778011]
17756A91778011J2468539M787319n445297j4385919j9863473j9697521j5148322
17749A34493337r781104n511711k600835q18840R00371K740877M304907M042401
17741A27769403m27263q441462j4792164j5634271j2670519r401473p041569n211901
17733E4148781m031332l216947k688778k445399k194542j826608j706278j640732
17725C4398165j577218j418899j309879j220241j172343r63792p97510p66410
17717B5171873p45740p05128o56321o32850o00270n51583n33747n48272l48973
17708A9848989l58535m94707m07608j84754j71048j70190j85800k62794k19119
17699A7394434j81656o9103n2892j29617j81495j4640j77271j28955p4349r7756
$$ y = [191778011, 204246550, 209033869, 203588572, 189202653, 169339180, 149641659, 134493337, 124712233, 119200522, 116599687, 115780847, 116681218, 119422095, 123727002, 127769403, 127342140, 118900678, 104108514, 88474243, 75803724, 66402251, 59360682, 54148781, 50117449, 46900502, 44211724, 41766325, 39571783, 37745175, 36038897, 34398165, 32820947, 31402048, 30092169, 28871928, 27699585, 26735793, 25938283, 25171873, 24426133, 23721005, 23064684, 22431834, 21831564, 21279981, 20746234, 20197962, 19848989, 19490454, 18995747, 18588139, 18403385, 18232337, 18062147, 17876347, 17613553, 17394434, 17212778, 17143675, 17090783, 16961166, 16779671, 16765031, 16587760, 16458805, 16384456, 16286700]
17689A6286700j84585j04977j03703o0908p0737o3932j76636j09665q7709p2195
17679A5251653j94515k45721l49065k35935j75122k01756k11283j96952k80831
17670A3160473k53335j16835j99626k24610r2759k44570l20894k78393l33786
17661A1095665k77171j58530j09057j78889k30281j78717j43058j55627j42149
17652I522186k81321k10019j83587k04626r2751j06038j76056j46471j00604j07994
17642G912719k6809p8211j31571j98132j72343j50372j72390k54645j26042j15000
17632F487204j61343k16608j27385m7706j44845j13528q0558j09187k3066j26292
17622E336686k49342k20099j02629j74423k06190j09797q7276L6066l7187j32464
$$ y = [16286700, 16102115, 15997138, 15893435, 15832527, 15761790, 15697858, 15521222, 15411557, 15323848, 15251653, 15057138, 14811417, 14462352, 14226417, 14051295, 13849539, 13638256, 13441304, 13160473, 12907138, 12790303, 12590677, 12366067, 12273308, 12028738, 11707844, 11429451, 11095665, 10818494, 10659964, 10550907, 10372018, 10141737, 9963020, 9819962, 9664335, 9522186, 9240865, 9030846, 8847259, 8642633, 8549882, 8443844, 8267788, 8121317, 8020713, 7912719, 7885910, 7807699, 7676128, 7477996, 7305653, 7155281, 6982891, 6728246, 6602204, 6487204, 6325861, 6109253, 5981868, 5934162, 5789317, 5675789, 5595231, 5486044, 5462978, 5336686, 5087344, 4867245, 4764616, 4590193, 4384003, 4274206, 4186930, 4222996, 4185809, 4053345]
17612D053345j43732j89172j44292L8831j6954q5895o6477j15830j94429q6071
17602C049324P9057j03663j00239l7007n2440m3515q327m5739q6677r7170o0390
17591B493214j01718M6999O0027M1765r0893j71982j33114M1015O8135k3110l5271
17580B195067N0235J8750q1452l2483J8404O100O202l3032o8221l9376m5306j1952
17568A982936o7119P8098R7501n3884J1504Q457K23O6542q606k9388k4472Q9010
17556B150802J38445P8581k6169j25725j38303j3913K6981O6619j4011m0191k8064
17545B075052K9943K2643J2056L4910L3456R6589K1092K2058j01479l2719L49
17534B213950K3606M9863N0230L4118k2077j09346J260k6417K2671K2376M796
$$ y = [4053345, 3909613, 3720441, 3576149, 3614980, 3598026, 3512131, 3445654, 3329824, 3135395, 3049324, 3128381, 3024718, 2924479, 2887472, 2835032, 2791517, 2783190, 2737451, 2650774, 2553604, 2493214, 2391496, 2438495, 2498522, 2540287, 2449394, 2277412, 2144298, 2185313, 2253448, 2230338, 2195067, 2245302, 2264052, 2182600, 2150117, 2168521, 2174621, 2180823, 2147791, 2079570, 2040194, 1994888, 1982936, 1915817, 1993915, 2091416, 2037532, 2049036, 2057493, 2057716, 2124258, 2115652, 2086264, 2061792, 2150802, 2289247, 2367828, 2341659, 2215934, 2077631, 2063718, 2090699, 2157318, 2143307, 2103116, 2075052, 2104995, 2127638, 2139694, 2174604, 2208060, 2304649, 2325741, 2347799, 2246320, 2213601, 2213950, 2237556, 2287419, 2337649, 2371767, 2349690, 2240344, 2241604, 2215187, 2237858, 2260234, 2265030]
17523B265030L5802J00924K8236L3106m0590j23471j22887O5611l9348q9682k7858
17512B084873O3374J3396k5836o8881N8967K12077m7301j36512m2110R464P190
17501B128701J1658j06220r3220L0255J15147R5000o4928j24623o9467K6876M2819
17490A991998n8965p686k3699M4413M2155j7218l834q3323r5514l2512p362j2146
17478A736307n0714P266j6683n0315N7780Q1594l4671n0971n2420j11613n1563
17467A463997l9149O0371J12086J3037l877M9778l7091k288N8990O9719J7698
17456A763271j793k0620n8142j3711N9985j2542l8160q9526j19158K269O8125
17445A539998N7703Q2873J61751J03848j2372n8449O043N4168j0345M586l2255
$$ y = [2265030, 2300832, 2401756, 2429992, 2463098, 2422508, 2299037, 2176150, 2241761, 2202413, 2112731, 2084873, 2148247, 2161643, 2135807, 2066926, 2125893, 2337970, 2290669, 2154157, 2112047, 2121511, 2128701, 2140359, 2034139, 1940919, 1971174, 2086321, 2181321, 2116393, 1991770, 1922303, 1949179, 1991998, 1933033, 1925347, 1901648, 1946061, 1988216, 1970998, 1967164, 1883841, 1788327, 1755815, 1748453, 1736307, 1685593, 1692859, 1676176, 1625861, 1683641, 1765235, 1730564, 1679593, 1627173, 1515560, 1463997, 1424848, 1485219, 1597305, 1610342, 1606465, 1656243, 1619152, 1616864, 1675854, 1745573, 1763271, 1761478, 1740858, 1682716, 1669005, 1728990, 1716448, 1678288, 1588762, 1469604, 1471873, 1539998, 1597701, 1680574, 1842325, 1946173, 1933801, 1875352, 1881395, 1935563, 1925218, 1929804, 1897549]
17434A897549j27346n2291l5920l6418k841p7987Q1213L0929J4487l2783k0216
17423A638376k7654p9729j65110k8716R968k0730P4465M355j1656N7748Q3198
17412A534515L316J9847q0599n4065L4685j5620K2108K7100K3512O7471R9354
17401A681624K00012J9788J01079J61640J73416J25534o2634j89450k21299j76224
17391A813486O898m7804k8275O3764N1602J09975J95191J38064O0080J3971r758
17380B367194j57479j44614j04518m8743j46423k45948k1996J09483l5514n4974
17370A516468R6841l4519q8310k5153m9613q677n4252n9413R6041K4277N247L932
17358A422869p9262p0376P5293L6079m7633l8197o6557j2454P6733p671K6641
$$ y = [1897549, 1770203, 1717912, 1681992, 1645574, 1642733, 1564746, 1645959, 1676888, 1691375, 1658592, 1638376, 1610722, 1530993, 1365883, 1337167, 1347135, 1326405, 1400870, 1405225, 1393569, 1451317, 1534515, 1537831, 1557678, 1477079, 1423014, 1457699, 1442079, 1464187, 1491287, 1514799, 1582270, 1681624, 1881636, 1901424, 2002503, 2164143, 2337559, 2463093, 2400459, 2211009, 1989710, 1813486, 1820384, 1772580, 1744305, 1808069, 1859671, 1969646, 2164837, 2302901, 2362981, 2376952, 2367194, 2209715, 2065101, 1960583, 1911840, 1765417, 1519469, 1497473, 1606956, 1571442, 1516468, 1613309, 1578790, 1490480, 1465327, 1415714, 1407037, 1352785, 1293372, 1389413, 1413690, 1418937, 1422869, 1343607, 1273231, 1348524, 1384603, 1336970, 1298773, 1232216, 1219762, 1296495, 1288824, 1315465]
17347A315465L0717J4540o5658J2494o443K68K6921K3156Q721n9070m9140o4687
17335A187284q1366n333L7792j09456p2533R5758p2351l4605M6946O2923M3662
17324A098721L383q710l3271j320K2711K132j08563l2479k1817L7029K2377R416
17312I89609M7562P1350J948k9818K1713o785l5366P0582j5451r6359L4820j640
17300A052165m695r576J537o163R5635L3683k7569L7628J40693j22892j50303
17289A040143L955P4839J7839n4584K1843J05643M4994j03783j25354o9399J25199
17278A081335R9993P4362p1348l2842P8454l070l5056j2571q1112M6161J65831
17267A310137l0801o447n0586m5101j9738k9133M3769K24185P3247K4506j8575
$$ y = [1315465, 1346182, 1360722, 1295064, 1307558, 1301115, 1301383, 1328304, 1351460, 1360181, 1301111, 1251971, 1187284, 1105918, 1100585, 1138377, 1028921, 956388, 1052146, 979795, 945190, 992136, 1055059, 1098721, 1102104, 1093394, 1060123, 1058803, 1081514, 1083646, 975083, 942604, 920787, 957816, 980193, 989609, 1037171, 1108521, 1110469, 1080651, 1102364, 1095579, 1060213, 1130795, 1115344, 1018985, 1053805, 1052165, 1047470, 1037894, 1039431, 1033268, 1128903, 1162586, 1135017, 1172645, 1313338, 1190446, 1040143, 1044098, 1118937, 1136776, 1082192, 1104035, 1209678, 1254672, 1150889, 1025535, 956136, 1081335, 1181328, 1255690, 1184342, 1151500, 1229954, 1226884, 1191828, 1179257, 1098145, 1144306, 1310137, 1279336, 1272889, 1222303, 1177202, 1157464, 1128331, 1172100, 1396285, 1469532, 1494038, 1475463]
17256A475463N0726R4173J4962n1965m6992P843K5809Q3360R7789N4820n0438
17245A755550j4187m5786K6561J01357q6514J7372J4624p7556j08236n2441M0522
17234A571266m3178j21658o8445M2086N525n1044L0506L7309p3406p2997j7541
17223A238423L9122n3117k0684M6506Q902m0695K3233k4171o4464K1200k9175
17212A145080p4750r2722o7512O1224P2791M7761k3424L15n811n6875M7192l8347
17200A014922q9722j5263P3396L9199n0816m0646j3985P9132O051j9237k8383
17189I54648L0364R0839n5995l9102o4421K4149M147j07256p0732J13192M5106
17178I24939M7049K3581l8232q2430p1373M4l2381j26349N1578N2073o601J38486
$$ y = [1475463, 1526189, 1620362, 1635324, 1583359, 1536367, 1544210, 1570019, 1653379, 1751168, 1805988, 1755550, 1741363, 1695577, 1722138, 1823495, 1736981, 1754353, 1768977, 1691421, 1583185, 1530744, 1571266, 1528088, 1406430, 1337985, 1380071, 1385596, 1334552, 1365058, 1402367, 1328961, 1255964, 1238423, 1277545, 1224428, 1203744, 1250250, 1259152, 1218457, 1241690, 1217519, 1153055, 1174255, 1145080, 1070330, 977608, 910096, 971320, 1044111, 1091872, 1068448, 1068763, 1062952, 1006077, 1053269, 1014922, 925200, 909937, 983333, 1022532, 971716, 931070, 917085, 996217, 1002268, 983031, 954648, 985012, 1075851, 1019856, 980754, 916333, 940482, 944629, 837373, 766641, 879833, 924939, 971988, 995569, 957337, 874907, 803534, 803578, 771197, 644848, 696426, 748499, 741898, 880384]
17166H80384Q3919K300j20156o9936k5400j2565R576q7885J30373P504j41010
17155F57104j9710J20874J05151N3896l0503o9147j478o6k0111O5805j3237p2247
17143G76331L8929N8780n7871r6546n4037J21643Q0223k286N3604m9760j46015
17132G22995n6445P537L1905L5573P5318M2164r578q9714j00264r3047m5664j8949
17120E01831Q7231P1227p4299J0381p588L8296L7880k7151R6997Q671O704Q911
17108G59091o3050J834J6854K7925l253l6945n002k3987l906L9583o7726Q0265
17096G21683M4869n8472r775r8323l4367J4680p7695O1020J19726M6734P1366
17085H01446Q0664p9085p1029P3374Q2731k2057o0344L0930J7341n4661M892J6804
$$ y = [880384, 964303, 966603, 846447, 776511, 751111, 738546, 748122, 660237, 790610, 798114, 657104, 637394, 758268, 863419, 917315, 886812, 817665, 816187, 816121, 796010, 861815, 848578, 776331, 815260, 874040, 816169, 719623, 665586, 787229, 867452, 865166, 918770, 869010, 722995, 666550, 674087, 705992, 741565, 816883, 859047, 849469, 759755, 659491, 566444, 520780, 501831, 589062, 660289, 585990, 596371, 588783, 627079, 664959, 637808, 734805, 743476, 750180, 759091, 696041, 697875, 714729, 742654, 739401, 702456, 697454, 673467, 669561, 709144, 641418, 721683, 766552, 708080, 698305, 599982, 565615, 580295, 502600, 563620, 683346, 730080, 801446, 882110, 803025, 731996, 805370, 888101, 866044, 805700, 836630, 853971, 799310, 804202, 821006]
17073H21006j8291r2285Q5400o6306m6088k7443j30326P325k2355J998P2527m5614
17061E39548Q735J10889O3152L0144j9143N4287k1850l5029N5520n2304L9127
17050G73076K4336j02125m9225K6133L903o4052l3460N8455M2293m8639M3708
17039F74403K7939M2127P6594j02294o7049L6563n1951q6096L4897P4989K7741
17028F87863r1567j6667N7094K8872O0556N5142j2337N2983J6699j467p5834n3546
17016G07791n30J02991p1887n7791o890j2142j3826m5329j6266J30665J21413
17005H38199K0488j34315j53214J8200o442n2646P2391l3048M6387j1492l8745
16994E65763M1887o9737j53361K2062J20079O5630N3612p0957L7091L1922l601
$$ y = [821006, 802715, 710430, 795830, 729524, 683436, 655993, 525667, 532992, 510637, 512635, 585162, 539548, 548283, 659172, 722324, 752468, 733325, 787612, 765762, 730733, 786253, 733949, 773076, 797412, 695287, 646062, 672195, 676098, 612046, 578586, 637041, 679334, 630695, 674403, 702342, 744469, 821063, 718769, 651720, 688283, 636332, 550236, 585133, 660122, 687863, 596296, 579629, 636723, 665595, 726151, 781293, 768956, 821939, 838638, 837171, 761337, 707791, 707261, 810252, 738365, 680574, 673684, 661542, 647716, 602387, 586121, 716786, 838199, 858687, 724372, 571158, 589358, 582916, 530270, 602661, 569613, 616000, 604508, 565763, 607650, 537913, 384552, 406614, 526693, 592323, 645935, 574978, 612069, 643991, 640390]
16983F40390R5284l6840l2450k926k6671K4389J5920j8808k8657r31k6011n2643
16971E50046l6046o2875Q3624l271p396Q4283J5752L6656j0033o9976k2869M5716
16959F03611n3271J01582N5867o352K1075J3347o1253j04410m2129P360n476p654
16947E22297p0401k5637J00230J5937Q3509P1398o8192p8078k6485L1742j6498
16936E39822m8678o3826l4170N335Q0843L2118J9554j35r6486m5080M7135L1787
16924D68219n7413k8507P1072o2250j1706O012J3319J16333J785j04563R3631
16913E05932J67338k5485r4671k4076l0737n5368O4823N4894Q2499P2402l1089
16902F86462J7836J4017K2206p5586l8752n885j619m8266k3921n6593o3518K2949
$$ y = [640390, 735674, 698834, 666384, 663458, 636787, 661176, 677096, 658288, 629631, 628700, 602689, 550046, 514000, 451125, 534749, 531478, 524082, 608365, 624117, 660773, 650740, 580764, 557895, 603611, 550340, 651922, 707789, 701437, 722512, 735859, 674606, 570196, 528067, 535427, 529951, 522297, 451896, 426259, 526489, 542426, 625935, 697333, 629141, 551063, 524578, 556320, 539822, 491144, 427318, 393148, 398483, 479326, 511444, 530998, 530863, 434377, 389297, 436432, 468219, 410806, 382299, 453371, 391121, 379415, 385427, 398746, 515079, 516864, 412301, 505932, 673270, 647785, 553114, 529038, 498301, 442933, 507756, 562650, 645149, 717551, 686462, 704298, 718315, 740521, 664935, 626183, 620298, 618679, 570413, 546492, 489899, 426381, 449330]
16890D49330Q565j8884M9191L5911j7011l5239O8069L0553N2109O1874n1522P53
16878F33699j4770Q791n924p70l6705l6584m7156q5736O2732N2183M1963l0677
16866E41046j157o7740n6240L8313p887r1266j6913N4181K8631j5113K6241J11070
16854E43166m804L5088Q09j04689P1539k0802k7705n287l5823k1885Q742M5963
16842D84312n043J4647K4491R5633K4569L2737o0927k7021L397n4675k4883q7797
16830D19440n8235Q4975J37323j6739J0891P1212N996l8581M5539P838n7337p6503
16818E35819O687R3148J75024p159o2680p0126O1053N9330J05044P7311j0895
16807I62556l5728k7702l9997j26494j7311M461m0086j08212j3788N8787J68989
$$ y = [449330, 457895, 439011, 488202, 524113, 507102, 471863, 539932, 570485, 622594, 684468, 632946, 633699, 618929, 627720, 621796, 621026, 584321, 547737, 500581, 414845, 477577, 529760, 571723, 541046, 539889, 472149, 415909, 454222, 446335, 355069, 338156, 392337, 420968, 405855, 432096, 543166, 538362, 573450, 574259, 469570, 541109, 520307, 492602, 487315, 451492, 429607, 438349, 484312, 479269, 493916, 518407, 614040, 638609, 671346, 610419, 583398, 586795, 532120, 507237, 419440, 361205, 446180, 583503, 566764, 577655, 648867, 654863, 616282, 661821, 669659, 612322, 535819, 542506, 635654, 810678, 803519, 740839, 670713, 731766, 791096, 896140, 973451, 962556, 926828, 899126, 859129, 732635, 715324, 719785, 679699, 571487, 557699, 616486, 785475]
16796G85475L6792K6858l3238q0931o4392L0024O3021p0625j05821p889o5334
16785E13940m7606J3479l6598K2840O9787l2883M7411p2461J0082J07813k7483
16774E68321p2679m7362R6097n4908r4849l3851N6146J01342K4641m9964m4668
16763D48266m4008L2537N4448O4300k8872j808M4471M9771p2516j06706j3084
16752D26799J11725N0878m5776J3347K3966j18952l3452J0918M1559L9262R588
16741E29862l4651o2619r2175O0668M0613m2313o203k2625J24294N5566m3154
16730E07263Q140o5630n5414J1688P5165R3357O9453N281j12235n4832Q6752k8198
16718E40790n6533J35017q1680j03397K0457J35146m3701m7654n474J01869l6520
$$ y = [785475, 822267, 849125, 815887, 734956, 670564, 700588, 763609, 692984, 587163, 579274, 513940, 466334, 479813, 443215, 466055, 535842, 502959, 550370, 477909, 487991, 595804, 568321, 495642, 448280, 544377, 489469, 394620, 360769, 416915, 518257, 542898, 492934, 448266, 404258, 436795, 491243, 555543, 526671, 524863, 569334, 619105, 546589, 439883, 426799, 538524, 589402, 543626, 556973, 580939, 461987, 428535, 439453, 481012, 520274, 529862, 495211, 432592, 340417, 401085, 441698, 399385, 393182, 370557, 494851, 550417, 507263, 515403, 449773, 394359, 406047, 481212, 574569, 644022, 649303, 537068, 482236, 568988, 540790, 484257, 619274, 537594, 434197, 454654, 589800, 546099, 498445, 492971, 594840, 558320]
16707E58320j31479L6739k5354J4074o3735j0801M7687M8882j03875M9013m4204
16696C75267O5445K1812J5823j9069K4643O6873P7095K7466K221m9975p6223r6370
16684D35008l4438J7J4615L4293N8071n6277N7522P8544k3165o2646n3059K2791
16672D71276Q990N2464l2161o0892j05804J4978P6041l4522n6991n7085L8992
16661C15286N1232j303K0985k7021n0014J5553j6395l4219j3152K9380K2924M0816
16649C54072R7122n836j41758q4084l052N6865Q5864j9813n1458L0625k3871o303
16637B88373K1362k8095o3318m0364O1456R8386R8154m4814j09609m7586m8085
16626A85860K6880R0172R0573L6121k9923p0833j4845K969N3369K3473k9154m7867
$$ y = [558320, 426841, 463580, 438226, 452300, 388565, 377764, 425451, 474333, 370458, 419471, 375267, 440712, 462524, 478347, 459278, 483921, 550794, 627889, 655355, 657576, 607601, 531378, 435008, 400570, 400587, 415202, 449495, 507566, 451289, 508811, 587355, 564190, 501544, 448485, 471276, 480266, 532730, 500569, 439677, 333873, 348851, 424892, 390370, 333379, 276294, 315286, 366518, 365215, 386200, 359179, 309165, 324718, 308323, 274104, 260952, 290332, 313256, 354072, 451194, 445358, 303600, 219516, 216464, 273329, 359193, 339380, 287922, 318547, 294676, 288373, 309735, 281640, 218322, 177958, 239414, 337800, 435954, 391140, 281531, 233945, 185860, 212740, 302912, 393485, 429606, 399683, 328850, 314005, 316974, 370343, 393816, 364662, 316795]
16614C16795Q8655M4579k0529K5249l7327K8402K2297o8581Q2344R3615M0161
16603F15660j01890q8811r8730j41052j2293N5507l2905L5298J23353j8817n596
16592C29724Q0869N1605Q3818q0163o1693K4532p9080n8464O9363k2160N514J3009
16580C56874O6330J10327J503q1814q3147j9120J0710j7934K6839O3989P3738
16569E08295m5759p5071J5813j6988m3714q7555O2456J5803K8478M5965Q2084
16558D89807j6405O3900M7616M624o5044q9928M769r0423N4761J6679l1377j3851
16546C75128o2844L2910P956j51891k4782M7880Q5450Q1937l583K312K3089m4080
16534C69482q7522q0326O779L355R2538L5492N3494p0297l4778k7303K261J9911
$$ y = [316795, 405450, 450029, 429500, 454749, 417422, 445824, 468121, 399540, 481884, 575499, 615660, 513770, 424959, 326229, 185177, 172884, 228391, 195486, 230784, 354137, 335320, 329724, 410593, 462198, 546016, 465853, 404160, 428692, 349612, 291148, 360511, 338351, 343865, 356874, 423204, 533531, 535034, 453220, 370073, 350953, 361663, 343729, 370568, 434557, 508295, 462536, 387465, 403278, 386290, 342576, 255021, 317477, 333280, 361758, 407723, 489807, 473402, 537302, 584918, 589542, 524498, 434570, 439339, 348916, 403677, 420356, 388979, 375128, 312284, 345194, 353150, 201259, 176477, 224357, 309807, 391744, 388161, 390473, 413562, 369482, 281960, 201634, 208413, 211768, 304306, 339798, 393292, 322995, 288217, 260914, 263175, 283086]
16522B83086N0909j2483m5355J27892M4653k8443J2590O4849l7666M750o8731
16511C96051j7712J13542P6225j15610j32418j15642m588k979N2291N3237L1506
16500C33903k1325p1865r3355J07650N7927l9303L8011K4207p4318L9037Q8317
16489C88886m4893l5080n5767k3359M252O4242j7156J8M0707l5015M1548L8898
16477C67281o3503M5218J7924J7114q787N4281l0748j31460R2175J04993j6958
16466D47530j2021k9347j3478M221j3114O7893j4552m9563m1117j2453N6631j90293
16454B00337o2244P7933L152j9384k9397K0216O0364L5739Q4167l585M5593P6537
16442D89428J2428n4014q6278K8341J02909j2551j0560j11448P727M572j4294
$$ y = [283086, 333995, 321512, 276157, 404049, 448702, 420259, 432849, 497698, 460032, 464782, 396051, 378339, 491881, 568106, 452496, 320078, 204436, 199848, 196869, 249160, 302397, 333903, 312578, 240713, 147358, 255008, 312935, 273632, 311643, 335850, 261532, 300569, 388886, 343993, 308913, 253146, 229787, 234039, 298281, 281125, 281143, 321850, 286835, 328383, 367281, 303778, 348996, 366920, 384034, 375247, 429528, 398780, 267320, 359495, 464488, 447530, 435509, 406162, 392684, 396905, 383791, 451684, 437132, 387569, 346452, 333999, 390630, 200337, 138093, 216026, 219178, 199794, 170397, 190613, 250977, 286716, 370883, 367298, 412891, 489428, 501856, 447842, 361564, 389905, 492814, 480263, 469703, 358255, 365982, 370554, 356260]
16431C56260M0679q5747K048M0964M4869m9454j4698L6000k9537l5975l9192N9429
16419C25646o5772K5208L2574k5847m36k7436k3643j7760m2515Q6637J9232k5982
16407B59906l2501Q767N3454L1866o2467p9914p2990N6460J37971O8593l5330
16396C33815K9745q054L9343o3265n4137L4679k8442L291N988P543l361Q6378
16384C83523L2935j28717k7730K6071j1332K2682m490o6633p2939n3862J7702
16373A17210N1604O7646R0497L5599k763K7217m7325r8835j01895J2489J87490
16362C38934M1785K2327J05163L2343j40831k3470r372j02582j8984J37776L6249
16351D19338k2449m4920l6965P0220l0521Q926k3696J4897N4579J527j23132m3209
$$ y = [356260, 396939, 311192, 313240, 354204, 399073, 349619, 334921, 370921, 341384, 305409, 266217, 325646, 259874, 285082, 317656, 291809, 291373, 263937, 240294, 222534, 180019, 266656, 285888, 259906, 227405, 236172, 289626, 321492, 259025, 179111, 106121, 162581, 300552, 369145, 333815, 363560, 355506, 394849, 331584, 277447, 312126, 283684, 286975, 292963, 300506, 297145, 383523, 416458, 287741, 260011, 286082, 274750, 297432, 292942, 226309, 153370, 99508, 117210, 168814, 236460, 326957, 362556, 359793, 387010, 339685, 240850, 138955, 151444, 338934, 380719, 403046, 508209, 540552, 399721, 376251, 366879, 264297, 245313, 383089, 419338, 396889, 351969, 315004, 385224, 354703, 363629, 339933, 354830, 409409, 410936, 287804, 244595]
16339B44595n3282N3145p4692r8950M241N9420J52095M8132P0459K6472l0731
16328D00904J1962n8101p0517k6058L4656j5266k9543j9012L1149J33603P7278
16317D71055o9222j2436o7789J7336l3338J6502M9167k9722k1656o8034l6607
16306B15256j46816J214L2169O8426O7651j1551L4663J6405K4968Q0052K8569
16295D11006P431m3771O425n135k2327Q152Q3821o5006q0501m5288J50290J03304
16283E08401l404j26058l7002K9275p673J3523Q5662r5299m3837k9436p169j8907
16271B68076O0758O4641l6033n9323n3981P2013j2126j2637J6434N3109j9794
16260C41137n7884J52K4983o3877o6273o4043K7254O5358P4278M6580R2597N0
$$ y = [244595, 191313, 244458, 169766, 70816, 75057, 134477, 286572, 334704, 405163, 431635, 400904, 412866, 354765, 284248, 258190, 292846, 277580, 248037, 229025, 260174, 393777, 471055, 401833, 389397, 321608, 338944, 305606, 322108, 371275, 341553, 319897, 251863, 215256, 68440, 69654, 101823, 170249, 237900, 226349, 261012, 277417, 302385, 382437, 411006, 418437, 374666, 381091, 375956, 353629, 361781, 445602, 380596, 300095, 254807, 405097, 508401, 504997, 378939, 341937, 371212, 363539, 377062, 462724, 367425, 323588, 294152, 286983, 268076, 328834, 393475, 357442, 298119, 244138, 316151, 304025, 291388, 307822, 360931, 341137, 283253, 283405, 308388, 244511, 178238, 114195, 141449, 206807, 281085, 327665, 420262, 420312]
16248D20312j55154j11824L276K1140O4440R0375J0086K5118j09599p6570Q2373
16237B63973L548r9550N6666R1089N1600j17356m6135j1033K5681N2530R2945
16226C63958k5354j24601k6193P357M5003l5105L3723Q2362o551k5418r2238q7553
16214A09390l4395O9816O8734K553l3696l8761P2667O0743L4712M1177L21J3164
16202C66425n965R290q5739l6107j6609O4416k038l6792K4386P449n8315l033
16190B27368k3969j9831O5044l4595n2258K4626j01115m1781L6416J18230Q6063
16179B84198M2831k531N2095j00989n9513m740J3007J59386J530j02940N5872
16168C38206L5617k1524p9575k4059Q1544n665j17298L0502J7378l7176n958O8162
$$ y = [420312, 265158, 153334, 156610, 177750, 242190, 332565, 342651, 367769, 258170, 181600, 263973, 267521, 167971, 224637, 315726, 367326, 249970, 203835, 192802, 218483, 271013, 363958, 338604, 214003, 187810, 195167, 240170, 205065, 238788, 321150, 314599, 289181, 196943, 109390, 74995, 144811, 213545, 216098, 182402, 143641, 216308, 277051, 311763, 352940, 353261, 366425, 360460, 369750, 284011, 247904, 231295, 295711, 293673, 256881, 281267, 288716, 230401, 227368, 203399, 183568, 248612, 214017, 161759, 186385, 85270, 43489, 79905, 198135, 284198, 327029, 324498, 376593, 275604, 216091, 211351, 224358, 383744, 385274, 282334, 338206, 373823, 352299, 272724, 248665, 330209, 324544, 207246, 237748, 255126, 217950, 211992, 280154]
16156B80154j5679p829r694j0087o562R518l8172r4018o1525l452L1719L9582
16144A13955L7275J0786o760n7143L2785J41649O4792p2586n7945Q899Q4309N8746
16132C58762k5871k1506J7832l7203j68610p2289k0198j14585N9843J12191O143
16121I4509O2278K3832R498m4360M1417K5909j8371K018K7759p6597o708p902
16109A33282K3559P8064o0806K2211R337R490K944M1215K9902K6906l9554q9531
16097A87019Q97R0108J10620L1050m5496K762k7261k9029l0974m6523j3084M1196
16085B71285o0475o5815L0146K0437K2209J32262n7341m6051N5219j5349n522
16074B81005m7304L0103P5508J0784k518n6945n314Q7446J8509L6141j5113j01760
$$ y = [280154, 264475, 256646, 246952, 236865, 230303, 239821, 201649, 107631, 46106, 42654, 74373, 113955, 151230, 162016, 155256, 98113, 130898, 272547, 337339, 264753, 206808, 215707, 300016, 358762, 332891, 311385, 329217, 292014, 123404, 51115, 30917, -83668, -23825, 88366, 94509, 156787, 180619, 190117, 145757, 187174, 213083, 194712, 196730, 224489, 147892, 141184, 133282, 156841, 234905, 174099, 196310, 205647, 215137, 218081, 259296, 289198, 316104, 276550, 187019, 187916, 278024, 388644, 419694, 374198, 376960, 349699, 320670, 289696, 243173, 230089, 271285, 210810, 144995, 175141, 195578, 217787, 350049, 292708, 246657, 301876, 286527, 281005, 233701, 263804, 339312, 350096, 347578, 290633, 285319, 372765, 391274, 427415, 412302, 310542]
16062C10542j42777k06997n7242J1525J29635J29377P0821K0166n5509n6842m9969
16051A02730r458K6044Q3028P9865k8898n4418n5540L3610l684j7399l1995O5197
16039A89082P4709o0742j23954J8706O7519l9869K9554o3187R618O1732K0524
16028A83692Q9946K9924R325O0204l6173k083n0832m0980k9202r6157M6112J4851
16016A78627m0008j4168m958o2797R383j460o589R1805O835R512l7927m4713P4753
16003A58295R7337K42o3225J7714m7046J5422O493R7609M9439n3605n7414M0065
15991B61326M3864o7212r676n000j21151n0499O6829O7701j2906J8342l4809l4693
15979A22116m548P0018j5831q1464J17671M2179j6437M1595q0100m0735p395k9762
$$ y = [310542, 167765, -39232, -96474, -84949, 44686, 174063, 244884, 265050, 209541, 152699, 102730, 93272, 119316, 202344, 282209, 253311, 198893, 143353, 176963, 173279, 155880, 123885, 189082, 263791, 203049, 79095, 97801, 165320, 125451, 155005, 91818, 101436, 163168, 183692, 273638, 303562, 312887, 373091, 336918, 334835, 284003, 243023, 213821, 117664, 163776, 178627, 138619, 124451, 119493, 56696, 66079, 64619, 58030, 149835, 156670, 166182, 128255, 83542, 158295, 255632, 255874, 192649, 210363, 163317, 178739, 185232, 282841, 332280, 278675, 221261, 261326, 305190, 237978, 228302, 223302, 102151, 51652, 118481, 186182, 173276, 191618, 156809, 122116, 117568, 187586, 171755, 90291, 207962, 250141, 233704, 275299, 195199, 154464, 147069, 117307]
15967A17307M3144j6256J3994o394L2297Q2083r224J2006M1051R2J0324L5161
15955C55585l9258N320j13303p6302k797M7979m8253n2691J0112K5357L4545k6529
15943A19765N1391J34300J9320q8269n1652N002j05202m7654P1494k9480L1058
15932A10073J67336O5753m0749o4729l1060N993R4901j9743r2414l9799m7573
15921A07989M163J39488L5849K9588L6933J3245o0195l5509l6136K8037j9247
15910B44205l9458k6402M6554J2332m1756L3789k8411l7557R9245N6886j42711
15899A76716o1084q7318N5910J22597R6329n7676m9111o2520l7893l3934M9691
15888A11707P8935Q3341R1205k1865j20073p4450o4222j2863P2724O4570p3278
$$ y = [117307, 160451, 144195, 158189, 151795, 184092, 266175, 256951, 268957, 310008, 310100, 320424, 355585, 316327, 321647, 208344, 132042, 129245, 177224, 128971, 76280, 86392, 111749, 146294, 119765, 171156, 305456, 324776, 236507, 184855, 189857, 84655, 37001, 108495, 79015, 110073, 277409, 343162, 302413, 237684, 206624, 212617, 307518, 287775, 195361, 155562, 107989, 112152, 251640, 287489, 317077, 354010, 367255, 307060, 271551, 235415, 263452, 244205, 204747, 178345, 224899, 237231, 195475, 229264, 200853, 163296, 262541, 319427, 176716, 115632, 28314, 84224, 206821, 303150, 245474, 196363, 133843, 95950, 62016, 111707, 190642, 273983, 365188, 343323, 223250, 148800, 84578, 71715, 144439, 209009, 135731]
15877A35731J6392l6772j7748Q3323k8038o8387k5746J36570M4662N8021n6061
15866B41947k770L2853q5874j5166J26624m4404r5694m893K8497J134j18968J919
15854F5205O5272l2958K7469M5556N1894l0467j02667r069R6776j0656J6422L7385
15842B20162O4734m1919l5777M2435R5279L9186j10817q2077N395M0488l6332
15831B00757l7553J3157J18630N0885q2953r4854k1121K6006J03716J9599j72124
15820A24145j1478K0786L923J7502L0932p487q3076p3574j5689P4168Q417J234
15808H9803R1131N1120m9389K7190p0798m0440l1719M8412M6637p7494l3742o73
15796E0038M4337O9603j0677J60K3403p3623j47890k3144M8175K6535J6600O0790
$$ y = [135731, 152123, 115351, 97603, 180926, 152888, 84501, 58755, 195325, 239987, 298008, 241947, 239177, 272030, 186156, 170990, 297614, 253210, 157516, 152623, 181120, 182254, 63286, 65205, 130477, 97519, 124988, 170544, 222438, 191971, 89304, 80235, 177011, 166355, 182777, 220162, 284896, 242977, 207200, 249635, 344914, 384100, 273283, 191206, 196601, 237089, 200757, 163204, 176361, 294991, 345876, 262923, 168069, 146948, 172954, 276670, 296269, 124145, 112667, 133453, 137376, 154878, 185810, 178323, 95247, 21673, 5984, 80152, 88569, 89803, 180934, 232054, 182665, 209855, 139057, 98617, 66898, 115310, 161947, 84453, 50711, 50038, 94375, 163978, 153301, 153461, 176864, 103241, -44649, -67793, -19618, 6917, 23517, 84307]
15784H4307J30304R992m1833K0581k3411p2069l5213N074p0635L0790n6994j2975
15772c2082j856m3967J7312J8647O6807M0959Q2774L1280M5722m8141m9632j3340
15760A14483L4596L9535Q4186O7642j7168l7630o9364n6641L5007J7549j9454
15749A92741k5526o7542O9751J5153K3057k5408r4134P921j5350k6549J8633j6872
15737E5875O4800l1037r9671k8237O7149P3597N0388j7354n3771n0350m7834L5415
15725A8970J08036J77005j0923n1726j05123l8228l5244O4130L7842p4427L3910
15714A24222M6846J8063l158J8901k9141M2353K0945m7719M2646j0174K982O7149
15702B93915n2031r0995J4358L876q1304m3804l4506J00704M2714L0809l7774
$$ y = [84307, 214611, 224603, 182770, 203351, 179940, 107871, 72658, 77732, 7097, 37887, -19107, -32082, -33938, -77905, -60593, -41946, 24861, 65820, 148594, 179874, 225596, 177455, 127823, 114483, 149079, 188614, 272800, 340442, 323274, 285644, 216280, 159639, 194646, 212195, 192741, 167215, 99673, 169424, 184577, 207634, 182226, 88092, 96013, 80663, 54114, 72747, 55875, 120675, 89638, -10033, -38270, 28879, 102476, 152864, 135510, 81739, 31389, -16445, 18970, 127006, 304011, 293088, 241362, 136239, 98011, 62767, 126897, 164739, 90312, 124222, 171068, 189131, 185973, 204874, 175733, 218086, 239031, 191312, 233958, 223784, 226766, 293915, 241884, 150889, 165247, 169123, 87819, 44015, 9509, 110213, 152927, 183736, 145962]
15691A45962m8545J8485k394m884l1498k7625N1623l655K4531j0181l8329O3590
15679A37080J01002J0623n270M1764q1410K8578p5985m3578M2230L3367K0418
15668B08819J1798J6875j6908m5528R6870k7254n0446M1084M0937N3591L9529
15657C69367o4089p6584j5543l3798m9106k5880R4397p671m1279O8856l3568K7946
15645B13048o713J2713J3259l8944n1040n3327n101L9388k7535k2058n128l4700
15633C3862M2333N5437n2448n2444m2261K9024M7591N4946J54341L5536n8428
15622B47489O568J8895N899K9501j51036j00000P5203K482l1400j226K0789N3183
15610A76347J4929q413p6372k6238M298M2311M169K5420m4263k6191L5847o7351
$$ y = [145962, 97417, 115902, 113508, 108624, 77126, 49501, 101124, 97469, 122000, 111819, 73490, 137080, 238082, 248705, 243435, 285199, 203789, 232367, 156382, 112804, 155034, 188401, 208819, 220617, 237492, 220584, 175056, 271926, 244672, 194226, 235310, 276247, 329838, 369367, 305278, 228694, 213151, 179353, 130247, 104367, 198764, 191093, 149814, 218670, 185102, 213048, 206335, 219048, 232307, 193363, 142323, 88996, 83895, 123283, 95748, 73690, 68562, 33862, 76195, 131632, 79184, 26740, -15521, 13503, 61094, 116040, 270381, 305917, 247489, 254057, 272952, 278851, 308352, 157316, 57316, 132519, 135001, 103601, 102375, 123164, 176347, 191276, 182863, 106491, 80253, 84551, 126862, 131031, 156451, 112188, 85997, 121844, 54493]
15598E4493k9542l9796l3463l4784J17269N2162j4045J8496O4014M889J3204m3999
15586A28898k4816l4624p021k2995M3252J2557j6262J8794J0469R2489n0974r944
15574A39823l4458J5384m4994r7366J77566L6077n3901O3k5416k7659M7943N7336
15562A90398J4693n11l6743r1774j02160j0456O5953N3808K7221J5056P4444r4559
15550A05370q6896J07958J48740j16007j35873k0547k2240m1689M861K72K4868
15539c1183R7355k1230M041j2924j3543O6277K7714p2902k4443q5585K6851O8708
15527B9136M2170J1583N4032R9249j8629L5049O240l9423o16o204n6273J8770
15515A75084l9600m3331O124J7332M388m4589P4283j568l6197M2991l6291k8054
$$ y = [54493, 24951, -14845, -48308, -83092, 34177, 86339, 72294, 90790, 154804, 159693, 172897, 128898, 104082, 69458, 62437, 39442, 82694, 95251, 78989, 97783, 108252, 200741, 149767, 139823, 105365, 120749, 75755, -21611, 155955, 192032, 138131, 138194, 112778, 85119, 133062, 190398, 205091, 204580, 167837, 76063, -26097, -36553, 29400, 83208, 110429, 125485, 199929, 105370, 18474, 126432, 275172, 159165, 23292, 2745, -19495, -61184, -56323, -56051, -31183, 66172, 44942, 48983, 36059, 22516, 88793, 116507, 43605, 19162, -66423, -39572, 29136, 71306, 82889, 136921, 236170, 217541, 252590, 258830, 219407, 218791, 212587, 156314, 175084, 135484, 92153, 98277, 115609, 119997, 75408, 149691, 148123, 111926, 154917, 118626, 90572]
15503I0572n6283p392M6003N8779j2230n9279L3506J1350q3794m2529P0140P00
15491D9543L8118O3240l0837O3226N8602n8925j9541m9579L7620J5561o1121n8213
15479D7694q92N6294L3482K2245j542k3770m8744J4679R2258Q0593k2655L2160
15467B81802j4592j5606q8230q8169n9352M7211P7266n4472l8173r5806l7376
15456h5497L3454K2857P49k6826J24224O261l5162P9079J45067Q4425r2547o8775
15444A87309p567J6910k9470r2126o9999K3873O0593l8102q496J7624K064M4036
15432A06649J1062p1486l5861m561j6725n212P5831M7186N7375P5745r134J5685
15420B46554r81q8024p540k1969K3994K3779L5126J4543Q492l6609n3279q5803
$$ y = [90572, 34289, 26897, 72900, 131679, 119449, 60170, 93676, 105026, 21232, -21297, 48843, 49543, 87661, 150901, 120064, 183290, 241892, 182967, 163426, 113847, 151467, 167028, 105907, 47694, 46802, 103096, 136578, 158823, 157281, 133511, 84767, 99446, 191704, 272297, 249642, 281802, 267210, 251604, 163374, 75205, 15853, 63064, 140330, 85858, 47685, -48121, -85497, -52043, -29186, -28437, -55263, 68961, 75222, 40060, 119139, 264206, 348631, 256084, 187309, 179742, 196652, 167182, 75056, 5057, 28930, 89523, 51421, 42925, 60549, 62613, 106649, 117711, 46225, 10364, 5803, -10922, -16134, 59697, 106883, 164258, 240003, 230869, 246554, 245573, 157549, 150009, 128040, 152034, 175813, 210939, 225482, 233974, 197365, 144086, 58283]
15408E8283o0661r412P1462M5176J2128K6189l961L1335M8396L6755r344o5570
15396A80776q355o1222m1123Q0892l7450n106P865j17931q827L9457k5689Q6642
15384H9929M3546N9324K4012n2534N0396L2439J0096m7242j8580l2702m0914l6374
15372H1396o563p5387m375j8643J0515O0776R0367L6400n4540q8612k9849K5294
15360B6779J6937l7546N1796M0759M086j6519m2565J3199j1020L3041K4714K6721
15348A30382J1681n650L7454j14501M7009Q3885L7763m6375q5325p3909p2131
15337d9717l0890P2527P0840k2588l0360K0321q2323p4433P8039Q0033L594O276
15325D1319j9278M6906M6872j0024n2666j44964p1918O8478J36461p2700j225
$$ y = [58283, -2378, -11790, 59672, 104848, 116976, 143165, 139204, 170539, 218935, 255690, 246346, 180776, 172421, 111199, 70076, 150968, 113518, 108412, 116277, -1654, -10481, 28976, 3287, 89929, 133475, 192799, 216811, 164277, 214673, 247112, 257208, 209966, 191386, 158684, 117770, 81396, 74833, -554, -4929, -23572, -13057, 47719, 138086, 174486, 119946, 31334, 1485, 26779, 43716, 6170, 57966, 98725, 102811, 86292, 43727, 56926, 45906, 78947, 103661, 130382, 142063, 136413, 173867, 59366, 106375, 190260, 228023, 181648, 96323, 22414, -49717, -80607, -8080, 62760, 40172, 9812, 30133, -52190, -126623, -48584, 31449, 35043, 41319, 22041, 68947, 115819, 105795, 53129, -91835, -163753, -95275, 41186, -31514, -32739]
15314c2739P3382L7364j8232M8535j9480j5730l5228o5243k8605J38287Q0955
15303A63266J5059j2566k6732l5114J7898M9626o5261N5408K8059P1593K5154
15292B86390n8117k903K0019m2017q332J3984Q882j1276q867j5370k9248m4279
15280A08866n2902J9090K8578q0496o6940j5489M5326R1177J41649J2159n2424
15269A78594J7098J1069j02907K5440J1438o7937k9331j0568J0928P0717M3937
15258A58478N6016J0620l6122o0088o2335n5781L265l116m6651m8627P257R6488
15246A9404M0186K2191J1140Q868j00957l2047L5608M5432P1502Q4724M9766O270
15234B62087m8495n7834r0994l1347Q8684P8102L9309N9825J9672o2935p6914
$$ y = [-32739, 40643, 78007, 59775, 108310, 88830, 73100, 37872, -27371, -55976, 82311, 163266, 178325, 165759, 139027, 103913, 121811, 171437, 106176, 161584, 189643, 261236, 286390, 228273, 225370, 245389, 203372, 195040, 209024, 217906, 206630, 197763, 182393, 153145, 108866, 55964, 75054, 103632, 23136, -43804, -59293, -13967, 77210, 218859, 231018, 178594, 195692, 206761, 103854, 129294, 140732, 72795, 43464, 32896, 43824, 114541, 158478, 214494, 225114, 188992, 128904, 66569, 10788, 14053, 10937, -35714, -84341, -77084, 19404, 59590, 81781, 92921, 101789, 832, -31215, 4393, 49825, 121327, 206051, 255817, 262087, 213592, 155758, 64764, 33417, 122101, 200203, 239512, 299337, 319009, 256074, 179160]
15223A79160p5791o5967J16334K7634k3308j6104m3362J9104P6113L0736j56204
15212F8345l7188l0766o4443J9471J08751J8110l2585j6255M4956j280j0929J8940
15200H5127M1494q8998j5239O9113n017j48230j8798L3224N1785n538R4268P2572
15188A65763K5660p668l7482n6011j2787L3976m7128k7094k106Q5354J37928n2882
15176B05523m6204j16963o2859J7672K3522j01127N6109L2765J995O7326O5531
15165A43290O965m8153j5456j9871K7710O0382J3496j44028r5214M4129Q4843
15154E8093R8109J8930R0540N6279j46238j20632j3757m9421L0510N0622L7835
15143A10870M7310J7050q0186q9413j9430l827N9961J1498m282r508J31962N9910
$$ y = [179160, 103369, 37402, 153736, 181370, 158062, 141958, 98596, 117700, 193813, 224549, 68345, 31157, 391, -64052, -44581, 64170, 82280, 49695, 33440, 78396, 77116, 66187, 85127, 126621, 37623, 22384, 91497, 86480, -61750, -80548, -47324, 4461, -1077, 93191, 165763, 191423, 183755, 146273, 90262, 77475, 111451, 64323, 37229, 35123, 120477, 258405, 205523, 159319, 42356, -20503, -2831, 20691, -80436, -24327, 8438, 10433, 77759, 143290, 150255, 102102, 86646, 66775, 94485, 154867, 168363, 24335, -70879, -26750, 58093, 156202, 175132, 265672, 321951, 175713, 55081, 41324, -8097, 22413, 73035, 110870, 158180, 175230, 95044, 5631, -13799, -17626, 42335, 53833, 49551, 40043, 172005, 231915]
15131B31915n1186p0888o2841O4769N8124k1719m7485n1150n7807q787Q9597M1314
15119A13856R89q4678K4171J11176l2384K4587k0556L0828q1869l6346P0709Q6725
15107B07208p9840o9172L7259l3276l4081j33233o6474P8882R2448J39384M9976
15096A89081j7869o4959K559K3177p2659l4063j2063K8870n3894O0959M8668n7118
15084D0689m0914p3319m451j2831O0584P7305n5552p1127J10994P7298k6008l8060
15072D4608J9298Q2082K2005k6433n7522n1046R2169K464R2429k4651k493r0806
15060A02104p7359M8716J05608O9028N487m1013q8088o7569l6926J04499J11081
15049B35568j31245j05377J9998J313J4701P214j3624R944K8609P3447K6510j947
$$ y = [231915, 180729, 109841, 47000, 111769, 169893, 148174, 100689, 49539, -8268, -17055, 72542, 113856, 114845, 30167, 54338, 165514, 133130, 157717, 137161, 167989, 86120, 49774, 120483, 207208, 127368, 58196, 95455, 62179, 28098, -105135, -171609, -92727, -279, 139105, 189081, 171212, 106253, 108812, 131989, 59330, 25267, 13204, 42074, -11820, 49139, 97807, 40689, -225, -73544, -77995, -90826, -30242, 47063, -8489, -79616, 31378, 108676, 82668, 44608, 63906, 145988, 167993, 141560, 84038, 32992, 125161, 127625, 220054, 195403, 192910, 102104, 24745, 73461, 179069, 248097, 253584, 212571, 124483, 56914, 19988, 124487, 235568, 104323, -1054, 18944, 20257, 34958, 42172, 28548, 38492, 67101, 140548, 167058, 165111]
15037A65111n6776L6058P6874O1864p1445n9526k5169K1593k0189m6554P0516
15026A52357k9816l3432j9299j5755J4220R390o3162N289j4064j04637m312R1181
15014a2040J92189P3219q546J8071p4458j4986L6726m4178r3679j02537M228j9523
15002d5514Q3647L0516O236L0927p4091n6858p095J9649L7160K8048M1314p3432
14990B0507n6328j6276Q1600P0143J3719L4965M444p6541m3650O8979J9161j9082
14978A01641J5349l0159o8466J6527j3309R4326R8733L8522l3764m8805L7545
14967B08140O4913j5676j39854j4086J2462m7406j12759Q0619R6799M1081K276
14956A76509o8887j3575P0381m5760j9761r350K3413n4718k7916J11628l2279
$$ y = [165111, 108335, 144393, 221267, 283131, 211686, 152160, 126991, 148584, 128395, 81841, 152357, 122541, 89109, 69810, 54055, 68275, 77665, 14503, 19792, 5728, -98909, -103221, -12040, 180149, 253368, 244822, 262893, 188435, 173449, 210175, 165997, 72318, -30219, -25991, -45514, 38133, 68649, 74885, 105812, 31721, -25137, -32232, -12583, 24577, 52625, 93939, 20507, -35821, -52097, 29503, 99646, 113365, 148330, 152774, 76233, 32583, 101562, 120723, 101641, 116990, 86831, 18365, 34892, 21583, 115909, 214642, 253164, 219400, 170595, 208140, 273053, 257377, 117523, 103437, 115899, 68493, -44266, 36353, 133152, 174233, 176509, 107622, 94047, 164428, 118668, 98907, 89557, 112970, 58252, 30336, 141964, 109685]
14945A09685m8292J8149N737K2116N4273n7616p9054O1005O401j23915R1789K8867
14933H9145m4339j5489l5949R5244K4070k3447o2821m2522m6475j4786Q2425J5225
14921B0281j6326o095Q054R8113O7486J67654j83531j77223R165j8182K8996o2728
14909f4336m4727Q4760P2028m1597m0845M9575L3404k2540P8826L989m0168J4009
14897H2378l4159K9515j4097l6501j9518n8463O2333M8432K1836l964p309L4813
14885A05296j5989l3640p812J27258J6576p7911p0137R04n973j38641l6394M6211
14873i0252L4805M3071M6906j9982j1655R9880L1826q633K4909j2625P1112j3524
14861A95838j13836p0243L1997Q4421O5030k2725m3790K6942p590J3209N875o6745
$$ y = [109685, 61393, 79542, 85279, 107395, 161668, 104052, 24998, 86003, 92404, -31511, 60278, 89145, 44806, 29317, -6632, 88612, 112682, 89235, 26414, -16108, -62583, -77369, 5056, 20281, 3955, -2140, 5914, 104027, 171513, 339167, 155636, -21587, -12422, -30604, -1608, -64336, -109063, -24303, 47725, 6128, -34717, 14858, 48262, 25722, 104548, 108537, 68369, 82378, 48219, 77734, 63637, 27136, 7618, -50845, 11488, 59920, 81756, 77792, 70483, 105296, 89307, 55667, 47855, 175113, 191689, 113778, 43641, 44545, 38572, -100069, -136463, -90252, -55447, -12376, 34530, 14548, 2893, 102773, 134599, 125966, 150875, 138250, 209362, 195838, 82002, 11759, 43756, 128177, 193207, 170482, 126692, 153634, 146044, 159253, 165128, 98383]
14849I8383M3231n9324k6705j2617n1006N0651n5815p406n5043J24660k8087j01315
14837h0393j8071j5451n430J3657N1476J4846L7334M8573O1704p134m9342q5811
14825c4042L4628j8944j689K3942k0651Q3526J1016P0170K6575K8040j3722j9262
14813A69587k1423l618l3315J4168n6892k0682l7143J5999k0028L06P7362J23163
14801B07484J0199r3937j25341m2336J7182j9079O1473r868K0145J4110j1920
14790B8112J6834K128K4494l1443j9264o3879o9409O9603J34385L1278O717n3531
14778G6025J2994l0014m4878j2950j5566L0832R4778l1157o7899l1270P9920n039
14766E5776n5566J1938N2074L1964l1052K6602J0055j37775j41292M4375J50744
$$ y = [98383, 141614, 82290, 55585, 42968, -8038, 42613, -13202, -20608, -75651, 49009, 20922, -80393, -98464, -113915, -119345, -105688, -54212, -39366, -2032, 46541, 108245, 101111, 51769, -34042, 586, -18358, -20047, 3895, -16756, 66770, 77786, 147956, 174531, 202571, 188849, 169587, 148164, 144546, 111231, 125399, 68507, 47825, 10682, 26681, 6653, 6959, 84321, 207484, 217683, 123746, -1595, -43931, -26749, -45828, 15645, 5777, 25922, 40032, 28112, 44946, 47074, 71568, 40125, 20861, -43018, -112427, -42824, 91561, 122839, 129556, 76025, 89019, 59005, 14127, 1177, -14389, 16443, 111221, 80064, 12165, -19105, 60815, 55776, 210, 12148, 64222, 96186, 65134, 91736, 101791, -35984, -177276, -132901, 17843]
14755A7843J216O1155K4344l3559j7971k3937O0979l4897j5578R3191J5381k5433
14743A22734o0976j9196p7186N6539j5635K5632N4112k0031l7691m687N3217R832
14731H6664p3569l0338P4573M1340m1041m0048J0094P1389L6865n2503m0676J9415
14719F2165L1740j6006k0146N6625Q4181p4470n3685M6554j00091J7915J33507
14708A68289J6686j14380p2090L8739K7242p620N1453J06157l1713m4370K321
14697A40714K5744P8943L7910k3603j30369j31290J8081j9243j00668N7410n8235
14686a04606j5470P3750N624n2676K3400j502N3115K541l0353o2376L4669K9504
14674d4380N3456O7448o885J6272J00996l3718q6485k0261k460M9373j010l0047
$$ y = [17843, 19059, 80214, 104558, 70999, 53028, 29091, 90070, 55173, 39595, 132786, 148167, 122734, 61758, 42562, -34624, 21915, 6280, 31912, 86024, 65993, 28302, 23615, 76832, 86664, 13095, -17243, 57330, 98670, 57629, 17581, 27675, 99064, 135929, 83426, 42750, 62165, 93905, 77899, 57753, 114378, 198559, 124089, 70404, 116958, 16867, 34782, 168289, 184975, 70595, -1495, 37244, 64486, 56866, 108319, 214476, 182763, 138393, 140714, 166458, 245401, 283311, 259708, 129339, -1951, 16130, -3113, -103781, -46371, -104606, -120076, -46326, -40702, -93378, -69978, -71480, -18365, -15824, -46177, -108553, -73884, -44380, 9076, 76524, 69639, 85911, 186907, 153189, 66704, 46443, 43983, 93356, 92346, 62299]
14662F2299n62M4195N4186R619n7530j7764l8462n4143k5436J2812K5030M7159
14650F1403l7484n8240q7745R6062N8087k8917n2141R0591K1325p8282m0876J27857
14638G1640n8620k5049M0670K0324m1358q2037q459Q042O5385j5635r3867O4840
14626e4124O4820j4865n2541K8189J720j02129L627K4163J0606p4675J36416P9980
14614E1187m777J2135k2010n5900J1781J0475J8761P8654q3721l4382J38428l2706
14602H7925m4874J2596l2401j8613J13252P2320o4138r953k2852o9913K1198N1150
14590I5697N8067r1504r7085J4512Q3295l4328m8922R286l5544k9782M5729K1632
14578h947P6027K4028p6274M7497k6164l7277n5988r988J32823J22427j59880
$$ y = [62299, 61737, 105932, 160118, 169737, 112207, 94443, 55981, 1838, -23598, -10786, 14244, 61403, 23919, -34321, -122066, -26004, 32083, 3166, -48975, 41616, 62941, -15341, -56217, 71640, 13020, -12029, 28641, 48965, 7607, -74430, -82889, -74847, -9462, -25097, -118964, -54124, 10696, -4169, -56710, -28521, -26801, -128930, -125303, -101140, -90534, -165209, -28793, 51187, 46410, 58545, 36535, -19365, -7584, 2891, 21652, 100306, 16585, -17797, 120631, 87925, 43051, 55647, 23246, 4633, 117885, 190205, 126067, 116114, 93262, 23349, 44547, 95697, 153764, 62260, -34825, -20313, 62982, 28654, -20268, -10982, -46526, -76308, -30579, -8947, 67080, 91108, 14834, 62331, 36167, -1110, -57098, -67086, 65737, 188164, 28284]
14567B8284j15699R4350L2766p3850N6012P2492n3401n5899Q3577N2021K8907
14556A49560K9399K4486j8190p7643M2027M0724m6539q0698p1030l6114J00048
14545E6030L2064l2351N7147O3590J7652l4691j38649m3901P4534k0327k5949
14534E149l3437m3265J3896O6451j9777p3904j1201L1023L8850j7359N0942J8169
14522B5537Q9551L5982j7417m9714n4175m708P1868L8761r8532p3583j07161l5827
14510a79418N3105P0157N4030J1341Q0591n8452o4542J0173m6945j0058r397K8213
14498f1202p1049P731m5440k0265J05529j183J047L5997L2733J37862l0442n9662
14486C1656k0883L3924q1874n0339l3686k4565L6440J603N776o9284P0836N3511
$$ y = [28284, -87415, 6935, 39701, -34149, 21863, 94355, 40954, -14945, 68632, 120653, 149560, 178959, 203445, 185255, 107612, 149639, 190363, 143824, 63126, -7904, -44018, 56030, 88094, 55743, 112890, 176480, 194132, 159441, 20792, -23109, 51425, 31098, 5149, -28288, -71553, -57657, 8794, -10983, -84887, -96088, -65065, -26215, -43574, 7368, 25537, 115088, 151070, 133653, 83939, 29764, 25056, 96924, 135685, 37153, -36430, -143591, -179418, -126313, -56156, -2126, 9215, 89806, 31354, -33188, -23015, -69960, -80018, -89415, -61202, -132251, -124520, -169960, -190225, -84696, -85879, -84832, -48835, -16102, 121760, 91318, 31656, 10773, 44697, -37177, -87516, -121202, -145767, -109327, -107724, -101948, -171232, -100396, -46885]
14474d6885l2012j7305j8015k2362j1651n0576M5829M7011j3897K5840J0622m2736
14462a26137K0443O3958N1800L9022o9368L6518p18M6981p67J4401n745l4414
14450C5974m779j4302j5013j6558p221J06810j6961m7547k7912n3644l5049J0478
14438h5724K2392J06042M8110j0812k2993m1192N560j2174M023Q26n964J8335
14426B6429p2217n2974M9207M5271J01072M6561j8868n2865j3307k2529j5719
14415B0061J5466Q01N3522j7569o7801J8369K9974N5453o4356j26118O567N0461
14403b5170L6435K2414n2501j1024l6320j0714m4182k5363P5583Q3195J665n7927
14391d3909l9497M0906K2526l6433N1344L7895J5655K1299j1868k2324l8666N3046
$$ y = [-46885, -78897, -96202, -114217, -136579, -148230, -198806, -152977, -105966, -119863, -94023, -83401, -126137, -105694, -41736, 10064, 49086, -20282, 16236, 15518, 62499, 61732, 76133, 70388, 35974, 31195, 16893, 1880, -14678, -21899, 84911, 67950, 20403, -7509, -61153, -96202, -85724, -63332, 42710, 90820, 80008, 57015, 15823, 21383, 9209, 13232, 14058, 8094, 26429, -45788, -98762, -49555, -4284, 96788, 143349, 124481, 71616, 58309, 35780, 20061, 35527, 36328, 89850, 72281, 4480, 22849, 52823, 108276, 43920, -82198, -75631, -25170, 11265, 33679, -18822, -29846, -66166, -76880, -121062, -146425, -70842, 12353, 14018, -43909, -83406, -42500, -19974, -56407, -5063, 32832, 48487, 69786, 57918, 35594, -3072, 49974]
14379D9974l3536m9404N8117N7564M5319j09769O1331N0937p2928N965l0718m1907
14367i055j4627R1299L2228q2224j842P1688M8161o8810l8819m9754L1078L8206
14355D7529l6380l0804Q0530J2491n5670O4691P9720o3480m7648n001n4835J3065
14343D208Q2906k8558m3292o837n7270P231N7854O1339L1478l9531Q777K1963
14331A00268k8260q897m5613P62O6566l4788p1275p2999K0012M4875M5287R6554
14319A12492K8029j8549r2501k4249m7895J3714J873j435P8450K6909L5521P2194
14307A84553q2630p1568m8900j6333j5477k769L5109R028l881j770j9855q515
14295d3008M8268O6924m045k6616J2166m9877j885L4739P953P1969n83k1479J2024
$$ y = [49974, 16438, -32966, 25151, 82715, 128034, 18265, 79596, 130533, 57605, 63570, 32852, -9055, -23682, 67617, 99845, 17621, 15779, 87467, 135628, 66818, 27999, -21755, 9323, 47529, 11149, -19655, 60875, 73366, 17696, 82387, 162107, 98627, 50979, 45978, -8857, 4208, 87114, 58556, 15264, 8427, -48843, -41612, 16242, 77581, 109059, 69528, 78305, 100268, 72008, 63111, 17498, 18260, 84826, 50038, -21237, -94236, -74224, -29349, 15938, 112492, 140521, 121972, 29471, 5222, -42673, -28959, -27086, -28521, 49929, 76838, 112359, 184553, 101923, 30355, -18545, -34878, -50355, -53124, -18015, -8987, -12868, -14638, -34493, -43008, 5260, 72184, 68139, 41523, 53689, 3812, 1927, 36666, 44619, 116588, 116005, 94526, 106550]
14282A06550N1905m0653m7808m8666P9143N2974m4150m2030m7593P1430N7882
14271A48984P6699O9188k3480o3570q1829j09081m7336Q14J3889J2919L066j3857
14259a3594o2082l9655P0041m1893o9855n02l2100J7608M0214K2795Q8539j1935
14247c2419m7497Q977J0023J2077N0053j3412p786J17O6009O9642l3441p9284
14235C059l001l6380r1947j9238l2123J5665P3522L0638R9538j00075m0297Q7688
14223a2951O5976n2554r481j2630M0263K7025L9228r5429r5098P0356J01642j43443
14211g7096j21181M1753Q5035P586M4016P4166J07456J25074j4260q1989j33354
14200E7206p5272M508R0524J1459o4191p671M3622N1676p2111l3449R9320L8906
$$ y = [106550, 158455, 117802, 69994, 21328, 100471, 153445, 109295, 67265, 19672, 91102, 148984, 225683, 294871, 271391, 207821, 125992, 16911, -30425, -29611, -15722, -2803, 263, -13594, -75676, -115331, -45290, -87183, -157038, -157540, -189640, -172032, -131818, -109023, -20484, -32419, -79916, -70939, -60916, -48839, 1214, -12198, -19984, -19867, 46142, 115784, 82343, 3059, 58, -36322, -128269, -147507, -179630, -163965, -90443, -59805, 39733, -60342, -100639, -12951, 53025, 471, -9010, -21640, 18623, 45648, 84876, -10553, -105651, -35295, 66347, -77096, -198277, -156524, -71489, -63903, -19887, 54279, 161735, 286809, 272549, 190560, 57206, -18066, -13558, 76966, 88425, 24234, 16563, 60185, 111861, 39750, 6301, 105621, 144527]
14188A44527K0585R492L0403m1429n7764j54246o6381p595L1621J3335L5089M0014
14176b349k7835M0624l8551n3489K7989L6690k4626R1134J7996m9656n4597J9915
14164a6755L7919m2205m7883j0153L2078Q09j7992J255o648O6226L4957K2048
14152E3656M9652K8835j7097N2620J4369l9382N490m6801j55370q6900N2947L0987
14140e6994J1970n6575O1659Q6747M4996p365l3529j5156l5268o5796o2025m2703
14128a70039P132j2412Q5332O8106L0907M0005N6390j46612l8441j5077k6166
14117a20875J331L647L0604N8009N4755o1051L508m56R146O2794o1485q3373K5860
14104g7586N0952L5606J0266M4826p4872k5820l5560J1573j3462O9854J5814J07536
$$ y = [144527, 165112, 174604, 205007, 163578, 105814, -48432, -114813, -122408, -90787, -77452, -42363, -2349, -30184, 10440, -28111, -81600, -53611, -16921, -41547, 49587, 67583, 17927, -36670, -16755, 21164, -21041, -68924, -79077, -46999, -46190, -64182, -62927, -69575, -3349, 31608, 53656, 103308, 132143, 115046, 167666, 182035, 142653, 148143, 101342, -54028, -140928, -87981, -56994, -45024, -101599, -39940, 46807, 91803, 84438, 50909, 35753, 485, -65311, -127336, -170039, -162907, -175319, -89987, -21881, 9026, 49031, 105421, -41191, -79632, -94709, -120875, -119544, -115897, -85293, -27284, 27471, -33580, -30072, -30528, -21382, 41412, -20073, -103446, -77586, -26634, 8972, 19238, 64064, -10808, -36628, -72188, -60615, -74077, -4223, 11591, 119127]
14092A19127j3244j03657o4568n4325O0164M4447l8788j36672N2691J27582J9699
14081A2456p1411J1474L2490k7799j5653oO3168R0657m6105l6733m9027j0081
14069d6570K8282j0858j1594j4562L0334j9681j3719r7767M8517J29934Q892K4534
14057E5742p6841q6557J6348N289N6020K1807K0388M3150n1886K9242N480n1197
14045a3015l8875K9774J60810L3544qr1672n7761L0565j5511J929r765p931J8295
14032D0379m8528Q8069K2843R154r41q9941K9639o0840m7928m9482L0466N7444
14020a9666K6653L364m479o113l8322L4618j7351n8797N391M7572J16236J03041
14008A92147j6956m8617k825j7938m6815m0758K7592L2003j8590m4046n419K8929
$$ y = [119127, 105883, 2226, -62342, -116667, -56503, -12056, -50844, -187516, -134825, -7243, 12456, -58955, -47481, -14991, -42790, -58443, -58449, 4719, 95376, 49271, 12538, -36489, -46570, -18288, -29146, -40740, -55302, -24968, -44649, -58368, -156135, -107618, 22316, 31208, 55742, -21099, -107656, -91308, -86019, -29999, -8192, 12196, 55346, 3460, 32702, 38182, -13015, -51890, -22116, 138694, 172238, 172230, 80558, 22797, 53362, 37851, 39780, 30015, 22084, 40379, -8149, 79920, 102763, 111917, 110976, 21035, 50674, -10166, -58094, -107576, -77110, -19666, 6987, 10351, 5872, -241, -38563, -3945, -21296, -80093, -74702, -27130, 89106, 192147, 175191, 126574, 123749, 105811, 58996, 18238, 45830, 77833, 59243, 15197, 9778, 38707]
13996C8707O617j05105K4199k800j00771K39153R242l3885m1983M1742J6373k7598
13984F3891m0821q1181r9290K6385Q3021K3817q889L0520M2318K0207O9712p1199
13972E8491k6665j8238Q0598R5447j03079J5284J1529o5106k7196O0619J0928
13961I2612q1319P400P6124O2461K6995L1758p5114m6411j8686k2051P662M6106
13949A07537k616m1072K2789M6861M5796l0617m1582l6785n5688l4327l6308Q5692
13937B9680J07741m4663j16057Q069L6345q1398J31878Q8130n0010o312N9153
13926A62556r4218n2433L3377p513m4847j6878k0551Q8218M6057m4529j4735L5190
13914F9694M5605j17199j910L6882J04354P727o8319O00J851r1467J4453j4140
$$ y = [38707, 45324, -59781, -35582, -38382, -139153, 100000, 109242, 75357, 33374, 75116, 91489, 63891, 23070, -58111, -157401, -131016, -47995, -24178, -33067, -2547, 39771, 59978, 129690, 58491, 31826, 13588, 94186, 189633, 86554, 101838, 113367, 48261, 21065, 81684, 92612, 11293, 18693, 94817, 157278, 184273, 216031, 140917, 94506, 75820, 53769, 61431, 107537, 104921, 63849, 86638, 133499, 179295, 148678, 107096, 70311, 14623, -19704, -56012, 29680, 137421, 92758, -23299, -15230, 21115, -60283, 71595, 159725, 109715, 103403, 162556, 68338, 15905, 49282, 41769, -3078, -19956, -40507, 47711, 93768, 49239, 34504, 69694, 115299, -1900, -3810, 33072, 137426, 145153, 76834, 77434, 79285, -12182, 2271, -11869]
13902a1869q7623O0648J2408k3016L1380l0439k0250O3501J20017j4462l0089
13891G0206j3171l2973q0595j66991o5088R0723J59l7439J7646J6515J40059N2074
13879h875K0796R4588O3888r3375o1519o5919j2529P3362J2312q1554J8245K7836
13867a2744P2465N1845r5672k7233j19852n8799J95788L5802l2742K4774J2682
13856D6314n9390K6581l2211l9984N7621M365R257P4163N9392L0573r295o0892
13844A06494k4919K2458M9037P4567m6528j14726j88112Q261J7019L2939O3301
13833b09j8466k2056o6237j2796J48881Q8173N9236P3351j15824j31850K3652
13822B5855O1740J0058K6561j67703k8459M2393K6783N2251m2050J0109r682J0513
$$ y = [-11869, -99492, -38844, -26436, -49452, -18072, -48511, -68761, -5260, 114757, 100295, 70206, 57035, 24062, -56533, -223524, -288612, -197889, -197730, -235169, -217523, -201008, -60949, -8875, 11921, 106509, 170397, 77022, 15503, -50416, -62945, 10417, 22729, -58825, -40580, -12744, 59721, 111566, 15894, -11339, -131191, -189990, 5798, 41600, 8858, 33632, 46314, -13076, 13505, -18706, -58690, -1069, 3296, 12553, 86716, 146108, 176681, 167386, 106494, 81575, 104033, 153070, 227637, 181109, 66383, -121729, -113468, -96449, -63510, -209, -18675, -40731, -106968, -119764, 29117, 117290, 176526, 249877, 134053, 2203, 25855, 87595, 97653, 124214, -43489, -71948, -29555, -2772, 49479, 7429, 17538, 7856, 18369]
13810A8369O4029L2405P7811m8935n5274k8855l5210j2522n7882O98q9654o2277
13798a97297P2287J2972N924J22032M4317j01838q138j7135l5913l2564P3765
13787f1588P1070J40236M9907k786r565l6802n6833n3295j6912O2299m5988K35
13775C9978n1940K4623l9027m0018K0177p9036O1034R7518m9343k7693N1939K6750
13763C4962K3905l4492l362M7029p4483l6397J379o104m8183J2177N188J0042
13751f8339n34L001j6441K2043P1822J0266k1248K2737Q4920o241k2798L3085
13739A12273P6715L5359n8044j57527j1l9o9952q8121M5282N595o1370K2645N9533
13726g7662p8228j09390K9098J33773P6368k447K449J9196j1770n556j8255J9439
$$ y = [18369, 82398, 114803, 192614, 143679, 88405, 59550, 24340, 11818, -46064, -45366, -135020, -197297, -125010, -112038, -106114, 15918, 60235, -41603, -49741, -66876, -102789, -135353, -61588, 9482, 149718, 199625, 196839, 187274, 150472, 93639, 40344, 23432, 85731, 39743, 39978, -11962, 12661, -26366, -66384, -46207, -125243, -64209, 33309, -16034, -43727, 8212, 34962, 58867, 24375, 21013, 68042, -6441, -42838, -41459, -47563, -95746, -83569, -78381, -68339, -68873, -65872, -82313, -60270, 11552, 21818, 570, 23307, 108227, 101986, 79188, 112273, 188988, 224347, 166303, 8776, 8765, 8726, -61226, -149347, -104065, -98470, -159840, -137195, -77662, -155890, -265280, -236182, -102409, -26041, -28488, -26039, -6843, -18613, -24169, -42424, -22985]
13714b2985k7075l6233O9948m9753l5382J8628O9558n5873m0437O2239K5680n6618
13702g8303M2023L7696o47N8126K7742k3706o2199o1680m9808l8968k9810P33
13690a78801j7232m716P2698O7410J46846l3951j37439J8774N226L6646J14466
13679H9927j0298K0181l5425j39481N731N6329j4042n1192L8310L8251j0162o1717
13667g3588l7356J37189L5289K6624k6623j48345r4330m9082Q9809Q9050p2732
13656a24095J3480Q5361J0621M266n9896R4512O8026q1294n1875L9975m082m0491
13644d5492O0842J04785l8449j37657l0108j4189m4785N4834O2877m8512n170
13633h1024N1226o44k3903o2574N2667l2501m2901J3081r296L8661N7615J2591
$$ y = [-22985, -50060, -86293, -16345, -66098, -101480, -82852, -13294, -69167, -109604, -47365, -21685, -78303, -36280, 1416, 769, 58895, 86637, 62931, 732, -60948, -110756, -149724, -179534, -178801, -196033, -200749, -128051, -60641, 86205, 52254, -85185, -66411, -61185, -24539, 89927, 79629, 99810, 64385, -75096, -69365, -13036, -27078, -78270, -39960, -1709, -11871, -73588, -110944, 26245, 61534, 88158, 61535, -86810, -181140, -230222, -140413, -51363, -124095, -110615, -25254, -14633, -10367, -70263, 24249, 92275, 10981, -40894, -919, -5001, -45492, 15350, 120135, 81686, -55971, -86079, -100268, -145053, -90219, -27342, -75854, -81024, -29798, -30442, -54345, -116919, -64252, -96753, -139654, -126573, -135869, -97208, -39593, -27002]
13621b7002o4137M5980k0160n6964l9866J60704j5611l3872l8777P4661N2457
13610C7413O109j42892J6903O8300n378R1122J3983j06939K0799J2791j3399O9182
13598F7994J3018p4282p2001L517p5079r6381Q3772P2372M4730L1451J87m7856
13586d8558r0127R1722n468J6665J5744j675N0535M2921p5897K990l3989J687
13574c3450N1965L995k3678p3135m1788L1814Q580o0340j23591K9647K5847p792
13562b11926J05079Q8737j5407p7108K7229P800J6673R2802j941k7237j9301k2529
13550c7129m0612K8228J3806k6024n881r8133n9306R2709P8849L082k0075O3010
13538g476l5550l469M0267O6725K1782K1920k5660n5972q2587J0443N1694j5333
$$ y = [-27002, -91139, -45159, -65319, -122283, -162149, -1445, -17056, -50928, -89705, -15044, 37413, 43522, -99370, -82467, -14167, -19545, 71577, 85560, -21379, -580, 12211, -1188, 67994, 81012, 6730, -65271, -61754, -136833, -233214, -149442, -77070, -32340, -889, -702, -48558, -138685, -46963, -52431, -35766, -20022, -21697, 28838, 71759, -4138, -1148, -35137, -33450, 18515, 22510, -1168, -74303, -116091, -84277, -75697, -136037, -259628, -229981, -204134, -211926, -106847, -18110, -33517, -110625, -83396, -75596, -58923, 33879, 31938, 4701, -14600, -37129, -77741, -49513, -35707, -61731, -67612, -165745, -225051, -132342, -53493, -50411, -70486, -7476, -43026, -46495, -6228, 60497, 82279, 104199, 78539, 22567, -60020, -49577, 2117, -13216]
13526a3216K6360M5717O409p6908j1843r547m4830P7761O579k6679p3720m8399
13514a42316j5585K4800O7514k9496p4048j4512O8196P7129J39744J4842r266
13503A07002q6058J3820n1558m0368l0215N4185N6427p6812p2119q1827J0577
13492a96946Q7368P488n5209O8369m1072j7449O7663M0642O2390J1126p1341j8604
13480e5575P5129J23629Q0669j51666q9181k9993n338m4435l4946k5997k1169
13469a78873M4247L1327J8826N768r205l7826J41P0534J439Q586p47j6163k567
13456f4513q5315L2330l3863O5458j1418p459O0792M7300P1939J18410K4817K3024
13444B41502j62497j44811Q800p0976l9246N0424P5450K7934m5477L9492K8421
$$ y = [-13216, 13144, 58861, 65270, -11638, -23481, -33028, -77858, -97, 6482, -20197, -93917, -142316, -157901, -133101, -65587, -95083, -169131, -183643, -115447, -38318, 101426, 116268, 107002, 20944, 34764, -16794, -57162, -87377, -33192, 23235, -53577, -125696, -207523, -196946, -109578, -102090, -157299, -88930, -130002, -147451, -79788, -39146, 23244, 34370, -36971, -55575, 19554, 143183, 223852, 72186, -16995, -46988, -52326, -96761, -131707, -157704, -178873, -134626, -103299, -84473, -78705, -87910, -125736, -125595, -55061, -53622, -45036, -45783, -61946, -64513, -149828, -117498, -151361, -85903, -97321, -104780, -43988, 3312, 75251, 193661, 218478, 241502, 79005, -65806, -57006, -127982, -167228, -116804, -41354, -13420, -58897, -19405, 9016]
13433I016J1502p49M5011O7912K4563n8692j19439j09833j13218j4222p9562k7472
13421c65183J27117L6683P9919m982m93K9338q1508O5836J6489Q3785j1322r2711
13409a17032k4092O2230N1942O1921M5177K8595r9507j08745O2738q002n6224
13398a00999Q3979j757k0574r6677L7876O716j6049M2259J720n4387k9304J26152
13386b1045J2103k5621l4956j8359K7078j9155O1461Q7894k7165p5850k2654n8968
13374a15237J03483j8727j10745j8674P6066Q5997O5008J3578N4366m1018j7373
13363G6724r5739m2091j12820n6183R5354K2842o6673J6233N7195R5220Q3508
13352G3570l1184p8666p3947L9687Q186l688j6040K8985M7947J45589J4631j42580
$$ y = [9016, 20518, 19769, 64780, 132692, 157255, 98563, -20876, -130709, -243927, -258149, -337711, -365183, -238066, -201383, -121464, -126446, -126939, -97601, -179109, -113273, -96784, -12999, -24321, -117032, -141124, -78894, -26952, 34969, 80146, 108741, 9234, -99511, -36773, -44775, -100999, -17020, -18777, -39351, -136028, -98152, -91436, -107485, -65226, -63506, -117893, -147197, -21045, -8942, -34563, -69519, -87878, -60800, -79955, -18494, 69400, 42235, -33615, -56269, -115237, -11754, -30481, -141226, -159900, -83834, 2163, 67171, 80749, 135115, 94097, 76724, -19015, -61106, -173926, -230109, -134755, -111913, -178586, -162353, -105158, -9938, 73570, 42386, -36280, -110227, -70540, -62354, -66042, -82082, -53097, -5150, 140439, 155070, 12490]
13340A2490j72131j8741J72469N1432m1313n8504j3937o7257M5069R0961j0396
13329i858p4352j0463J24511R4651n6555m8641K0510m6031N4767O8474q2075j10755
13317g5817Q5622J6672p618J7164K2232J14096l419r281j18542p5733j11930Q24
13305a45730Q6602k9776m110M8747M4028j9961j3032K7478p0497N615M5125K1992
13293c519Q175k2056J5326P6957O6950n8338k71P4328j2757n537j1521p6431K5082
13280G6388j7626n7858j03548l4012J4223m2335K9716P142N0010M3336n4750q276
13268i7590j6671K9639P1041k5479o9895L1348P4113k7642n5151m3303M3377L6423
13256d9790N797K2125R9243M7805j12959j05217p4977L9010L4212J4712L2566
$$ y = [12490, -159641, -178382, -5913, 45519, 4206, -54298, -68235, -135492, -90423, 538, -9858, -84210, -94673, 29838, 124489, 67934, 19293, 39803, -6228, 48539, 117013, 34938, -75817, 9805, 26477, 18859, 36023, 58255, 172351, 168932, 159651, 41109, -34624, -146554, -145730, -59128, -88904, -93014, -44267, -239, -20200, -33232, -5754, -76251, -70636, -25511, -3519, 4656, -17400, -2074, 74883, 141833, 83495, 83224, 157552, 144795, 139258, 127737, 51306, 76388, 58762, 904, -102644, -136656, -122433, -164768, -135052, -127910, -77900, -34564, -89314, -97590, -114261, -84622, -13581, -39060, -108955, -77607, -3494, -31136, -86287, -129590, -86213, -49790, -43993, -21868, 77375, 125180, 12221, -92996, -167973, -128963, -94751, -80039, -47473]
13245d7473R507k4547j4486P5357l8763j8580l9438L8768O7455O5224j7772n5337
13233h5M909J4025l7082n9630N0413p29q5393j30639M0932P0201K8629q661L7363
13220g5747R580P597m2539o8321Q6400N6406N7747N9514K8106m4832m1408l9120
13208f617L1826l6267j29304m8103j2603N5193M3843O4320l7493r7831K0403J681
13196a50952L1970N6849R1546J2010n2513K9820J24806R007o5736l4510K7036
13185G9333j3715M3325K8851m0627p9665L698N509l7838j13770J2009k3222q09
13173a36921J31575J16023N5501r6004n6933N285j1306L1033O9656p2387m7738
13162a2216Q2458Q534n0189j29172m0679R7775N5420J7597j6600j0149R325m030
$$ y = [-47473, -37966, -62513, -76999, -1642, -40405, -58985, -98423, -59655, 7800, 73024, 55252, -85, 4824, 18849, -18233, -77863, -27450, -28179, -113572, -244211, -203279, -133078, -104449, -113110, -75747, -66167, -58570, -101109, -169430, -83030, -26624, 31123, 90637, 118743, 73911, 32503, -6617, 25209, -11058, -140362, -188465, -201068, -145875, -102032, -37712, -75205, -173036, -152633, -150952, -118982, -62133, 29413, 41423, -11090, 18730, 143536, 152543, 86807, 52297, 79333, 65618, 108943, 137794, 97167, 17502, 21200, 26709, -11129, -124899, -112890, -136112, -136921, -5346, 110677, 166178, 70174, 13241, 18526, 7220, 38253, 107909, 35522, -12216, 70242, 78776, 28587, -100585, -141264, -43489, 11931, 29528, 12928, 2779, 12104, 8074]
13150H074p7241q8434k1085m352O2975M9755L9694R4912J0006n2864o1556M6785
13138F669K0233k4197k009K3415n6306l0922J81149P8440m2970p9128p3983L9350
13126C9741o018P0837J9168M0582o1785J4368N721j8845p4788o3572q2792o1449
13114a78832J8092M3309m6099N7761N2321J2028M0160j23135j13980Q4974K7136
13103a26265j3490k5675J77036Q8098n8878o8442Q237q7875O2714J3861n0626
13092h1305J3250j334L1180J00220M561K256Q415L6376j16912j74442m6650L1520
13080a92865J5664J07847K558q5635n5855k3407Q1170K2551k3188j3584j9906
13069a84650O1356J1718J1439L1968K0698M8550P6820k7067L2102j1473m9606
$$ y = [8074, -69167, -157601, -178686, -183038, -120063, -70308, -30614, 64298, 74304, 21440, -40116, 6669, 26902, 2705, 696, 24111, -32195, -63117, 118032, 196472, 153502, 74374, 391, 39741, 33723, 104560, 123728, 164310, 102525, 116893, 122614, 103769, 28981, -34591, -117383, -178832, -160740, -117431, -163530, -105769, -53448, -41420, -1260, -124395, -238375, -153401, -126265, -139755, -165430, 11606, 99704, 40826, -27616, -19379, -107254, -44540, -30679, -81305, -68055, -69389, -38209, 62011, 66572, 68828, 77243, 113619, -3293, -177735, -224385, -192865, -177201, -69354, -66796, -152431, -208286, -231693, -150523, -127972, -151160, -164744, -184650, -123294, -111576, -100137, -68169, -47471, 1079, 77899, 50832, 82934, 71461, 21855]
13058B1855j5490n1492q0089Q414Q3798j6501j3109O5620O9910p5284k2402R7434
13046G2664k8284j07024K6518j5394j0483N0858K8077M089k753J496K9242N0752
13034I9758m2678p7865o6004N8034O2137k407K9788N4437n5834N6771N931O0819
13022A82887M7658l2930o9674o3217M4077Q67p2854q7158p9598O815M825J04208
13010a4094N4967m4978j00680m4349n1447r4817K9014P8916J09968J13664m4314
12999h150J1863o4775l1062Q731L8121K0943m2145M4190Q5686K7118o5044r0854
$$ y = [21855, 6365, -45127, -125216, -116802, -33004, -49505, -62614, 3006, 72916, -2368, -24770, 72664, 44380, -62644, -36126, -51520, -62003, -11145, 16932, 21021, 18268, 19764, 49006, 99758, 57080, -20785, -86789, -28755, 33382, 30975, 60763, 115200, 59366, 116137, 122068, 182887, 230545, 197615, 127941, 64724, 108801, 109668, 36814, -50344, -129942, -123127, -118302, -14094, 40873, -4105, -104785, -149134, -200581, -295398, -266384, -187468, -77500, 36164, -8150, 3713, -61062, -92124, -83393, -45272, -24329, -66474, -22284, 63402, 90520, 25476, -65378]
$$ [...]
##END NTUPLES=NMR SPECTRUM
##END=
