##TITLE=Analysis number 328171
Compound Code mo 07998
Book Reference 486/144
Project Code adrs
Chemist Name simons
##JCAMPDX= 6.0         $$ Bruker NMR JCAMP-DX V2.0
##DATA TYPE= NMR SPECTRUM
##DATA CLASS= NTUPLES
##ORIGIN= Bruker BioSpin GmbH
##OWNER= nmr
$$ XWIN-NMR		Version 3.5
$$ Thu May 10 10:45:12 2007 GMT Daylight Time (UT+1h)  MAYBRIDGE\nmr@NMR_250MHZ
##.OBSERVE FREQUENCY= 250.131544655141
##.OBSERVE NUCLEUS= ^1H
##.ACQUISITION MODE= SIMULTANEOUS (DQD)
##.ACQUISITION SCHEME= undefined
##.AVERAGES= 16
##.DIGITISER RES= 18
##SPECTROMETER/DATA SYSTEM= dpx250
##.PULSE SEQUENCE= zg30
##.SOLVENT NAME= CDCl3
##.SHIFT REFERENCE= (INTERNAL, CDCl3, 0, 16.522)
##AUDIT TRAIL= $$ (NUMBER, WHEN, WHO, WHERE, WHAT)
$$ ##TITLE= Audit trail, XWIN-NMR		Version 3.5
$$ ##JCAMPDX= 5.01
$$ ##ORIGIN= Bruker BioSpin GmbH
$$ ##OWNER= nmr
$$ C:\u/data/dgb/nmr/ADRS/700/pdata/1/auditp.txt
$$ ##AUDIT TRAIL=  $$ (NUMBER, WHEN, WHO, WHERE, WHAT)
(   1,<2007-05-10 10:44:48.35 +100>,<MAYBRIDGE\nmr>,<NMR_250MHZ>,
      <created by zg, POWCHK disabled, PULCHK disabled
       configuration hash MD5:
       76 6E 9A 78 1E 09 19 81 EC 84 63 8F B0 6A 59 2D
       data hash MD5: 64K
       27 6C 90 85 E9 77 9D 59 00 C6 31 EE C7 7A F0 75>)
(   2,<2007-05-10 10:45:02.69 +100>,<MAYBRIDGE\nmr>,<NMR_250MHZ>,
      <Start of raw data processing
       ef LB = 0.3 FT_mod = 6 PKNL = 1 SI = 32K 
       data hash MD5: 32K
       40 99 5F 45 B1 C2 AE 20 E3 16 F9 46 40 A1 6F 6B>)
(   3,<2007-05-10 10:45:04.42 +100>,<MAYBRIDGE\nmr>,<NMR_250MHZ>,
      <apk 
       data hash MD5: 32K
       F5 3F 9E 20 B5 68 14 FA 9D 0A 24 3B 36 14 14 8F>)
(   4,<2007-05-10 10:45:05.14 +100>,<MAYBRIDGE\nmr>,<NMR_250MHZ>,
      <abs ABSG = 5 
       data hash MD5: 32K
       30 2B D0 5C 96 F4 D8 FD D8 35 01 D9 98 90 A6 1D>)
$$ ##END=
$$ 
$$ hash MD5
$$ A8 A9 24 19 D0 C5 26 AF 29 20 F6 5D 70 94 D2 66
##$RELAX= 
##$RELAX= 
##$RELAX= 
##$RELAX= 
##$RELAX= 
##$RELAX= 
##$RELAX= 
$$ Bruker specific parameters
$$ --------------------------
##$DU= <C:\u>
##$EXPNO= 700
##$NAME= <ADRS>
##$PROCNO= 1
##$TYPE= <nmr>
##$USER= <dgb>
##$AMP= (0..31)
100 100 100 100 100 100 100 100 100 100 100 100 100 100 100 100 100 100 
100 100 100 100 100 100 100 100 100 100 100 100 100 100 
##$AQSEQ= 0
##$AQ_mod= 3
##$AUNM= <au_zg>
##$AUTOPOS= <8 >
##$BF1= 250.13
##$BF2= 250.13
##$BF3= 250.13
##$BF4= 250.13
##$BF5= 500.13
##$BF6= 500.13
##$BF7= 500.13
##$BF8= 500.13
##$BYTORDA= 1
##$CFDGTYP= 0
##$CFRGTYP= 5
##$CHEMSTR= <none>
##$CNST= (0..31)
1 1 145 1 1 1 1 1 1 1 1 1 1 1 1 1 1 1 1 1 1 1 1 1 1 1 1 1 1 1 1 1 
##$CPDPRG= <>
##$CPDPRG1= <>
##$CPDPRG2= <>
##$CPDPRG3= <>
##$CPDPRG4= <mlev>
##$CPDPRG5= <mlev>
##$CPDPRG6= <mlev>
##$CPDPRG7= <mlev>
##$CPDPRG8= <mlev>
##$CPDPRGB= <>
##$CPDPRGT= <>
##$D= (0..31)
0 1 0 0 0 0 0 0 0 0.06 0 0 0 0 0 0 0.0002 0 0 0 0 0 0 0 0 0 0 0 0 0 0 
0 
##$DATE= 1178790286
##$DBL= (0..7)
120 120 120 120 120 120 120 120 
##$DBP= (0..7)
150 150 150 150 150 150 150 150 
##$DBP07= 0
##$DBPNAM0= <>
##$DBPNAM1= <>
$$ [...]
##$SUBNAM7= <"">
##$SUBNAM8= <"">
##$SUBNAM9= <"">
##$SW= 20.6930455092707
##$SWIBOX= (0..15)
0 0 3 0 0 0 0 0 0 0 0 0 0 0 0 0 
##$SW_h= 5175.983436853
##$TD= 65536
##$TD0= 1
##$TE= 683.16
##$TE2= 300
##$TE3= 300
##$TEG= 300
##$TL= (0..7)
0 120 120 120 120 120 120 120 
##$TP= (0..7)
150 150 150 150 150 150 150 150 
##$TP07= 0
##$TPNAME0= <>
##$TPNAME1= <>
##$TPNAME2= <>
##$TPNAME3= <>
##$TPNAME4= <>
##$TPNAME5= <>
##$TPNAME6= <>
##$TPNAME7= <>
##$TPOAL= (0..7)
0.5 0.5 0.5 0.5 0.5 0.5 0.5 0.5 
##$TPOFFS= (0..7)
0 0 0 0 0 0 0 0 
##$TUNHIN= 0
##$TUNHOUT= 0
##$TUNXOUT= 0
##$USERA1= <user>
##$USERA2= <user>
##$USERA3= <user>
##$USERA4= <user>
##$USERA5= <user>
##$V9= 5
##$VALIST= <valist>
##$VCLIST= <CCCCCCCCCCCCCCC>
##$VD= 0
##$VDLIST= <DDDDDDDDDDDDDDD>
##$VPLIST= <PPPPPPPPPPPPPPP>
##$VTLIST= <TTTTTTTTTTTTTTT>
##$WBST= 1024
##$WBSW= 4
##$XGAIN= (0..3)
0 0 0 0 
##$XL= 0
##$YL= 0
##$YMAX_a= 487226
##$YMIN_a= -420747
##$ZGOPTNS= <>
##$ZL1= 120
##$ZL2= 120
##$ZL3= 120
##$ZL4= 120
##$ABSF1= 16.522
##$ABSF2= -4.171173
##$ABSG= 5
##$ABSL= 3
##$ALPHA= 0
##$AQORDER= 0
##$ASSFAC= 0
##$ASSFACI= 0
##$ASSFACX= 0
##$ASSWID= 0
##$AUNMP= <proc_1d>
##$AZFE= 0.1
##$AZFW= 0.1
##$BCFW= 0
##$BC_mod= 0
##$BYTORDP= 0
##$COROFFS= 0
##$CY= 12.5
##$DATMOD= 1
##$DC= 0
##$DFILT= <>
##$DTYPP= 0
##$F1P= 14.0000005364418
##$F2P= -0.99999901652339
##$FCOR= 0.5
##$FTSIZE= 32768
##$FT_mod= 6
##$GAMMA= 0
##$GB= 0
##$INTBC= 1
##$INTSCL= 1
##$ISEN= 128
##$LB= 0.3
##$LEV0= 0
##$LPBIN= 0
##$MAXI= 10000
##$MC2= 0
##$MEAN= 0
##$ME_mod= 0
##$MI= 0
##$NCOEF= 0
##$NC_proc= -2
##$NLEV= 6
##$NOISF1= 0
##$NOISF2= 0
##$NSP= 0
##$NTH_PI= 0
##$NZP= 0
##$OFFSET= 16.522
##$PC= 1
##$PHC0= -54.91811
##$PHC1= 4.042708
##$PH_mod= 1
##$PKNL= yes
##$PPARMOD= 0
##$PSCAL= 4
##$PSIGN= 0
##$REVERSE= no
##$SF= 250.13
##$SI= 32768
##$SIGF1= 0
##$SIGF2= 0
##$SINO= 400
##$SIOLD= 32768
##$SREGLST= <1H.CDCl3>
##$SSB= 0
##$STSI= 32768
##$STSR= 0
##$SW_p= 5175.98343685301
##$SYMM= 0
##$S_DEV= 0
##$TDeff= 65536
##$TDoff= 0
##$TI= <Analysis number 999999
Compound Code 99
Book Reference 9
Project Code 9>
##$TILT= no
##$TM1= 0
##$TM2= 0
##$TOPLEV= 0
##$USERP1= <user>
##$USERP2= <user>
##$USERP3= <user>
##$USERP4= <user>
##$USERP5= <user>
##$WDW= 1
##$XDIM= 32768
##$YMAX_p= 421324635
##$YMIN_p= -152706
$$ End of Bruker specific parameters
$$ ---------------------------------
##NTUPLES= NMR SPECTRUM
##VAR_NAME=  FREQUENCY,     SPECTRUM/REAL,   SPECTRUM/IMAG
##SYMBOL=    X,             R,               I
##VAR_TYPE=  INDEPENDENT,   DEPENDENT,       DEPENDENT
##VAR_FORM=  AFFN,          ASDF,            ASDF
##VAR_DIM=   32768,         32768,           32768
##UNITS=     HZ,            ARBITRARY UNITS, ARBITRARY UNITS
##FACTOR=    0.157963299565203, 1,           1
##FIRST=     4132.6476996994, 0,             0
##LAST=      -1043.33573715361, 0,           0
##MIN=       -1043.33573715361, -152706,     0
##MAX=       4132.6476996994, 421324635,     0
$$ Real data points
##PAGE= N=1
##DATA TABLE= (X++(R..R)), XYDATA
$$ [...]
19613G0669L020l590p381K68J650m396r94M230K559K953J4447J2318J0806K1876
$$ 70669 73689 70099 62718 62986 64636 60240 59246 63476 66035 68988 83435 95753 106559 128435
19599A28435J6672J3775J8339L1332L5870J9259l1741n2992l0702l469l964N408
$$ 128435 145107 158882 177221 208553 244423 263682 231941 178949 148247 144778 140814 146222
19587A46222J7273K8179K2391K2776M876m9397o2331l5231j8557j3144p506M633
$$ 146222 163495 191674 214065 236841 241717 192320 129989 94758 76201 63057 55551 60184
19575F0184O558o091j7063o454J783l273l545RJ819M316O523n09l298M070l537
$$ 60184 66742 60651 43588 37134 38917 35644 32099 32108 33927 38243 44766 44257 40959 45029 41492
19560D1492p868l315p252L32J0085N621L905M873m267o261K130P1o658o646n303
$$ 41492 33624 30309 23057 23389 33474 39095 43000 47873 43606 37345 39475 39546 32888 26242 20939
19545B0939K003K184N407J806o425q896o73K219L716K731j2073q070M915M75K020
$$ 20939 22942 25126 30533 32339 25914 17018 16345 18564 22280 25011 12938 4868 9783 10258 12278
19530A2278m356r558K351K656j609k984j208j236M429J0049Q046l151r848l891
$$ 12278 7922 -1636 715 3371 1762 -1222 -2430 -3666 763 10812 18858 15707 5859 1968
19516A968L499K425L454K331M343K99L111P651L831n294l092p244K416k004K154
$$ 1968 5467 7892 11346 13677 18020 18319 21430 29081 32912 27618 24526 17282 19698 17694 19848
19501A9848J850n024m976q76K952O465j135l810q34m294j847J851j538J725j788
$$ 19848 21698 16674 11698 10822 13774 20239 19104 15294 14460 10166 8319 10170 8632 10357 8569
19486H569o580M148O946n594m622K98M238r356m262K353K009n768k503k893m922
$$ 8569 1989 6137 13083 7489 2867 3165 7403 -1953 -6215 -3862 -1853 -7621 -10124 -13017 -17939
19471a7939o361J272Q686N099L107q990k840J0464L951K985N291J754j021J655
$$ -17939 -24300 -23028 -14342 -9243 -6136 -15126 -17966 -7502 -3551 -566 4725 6479 5458 7113
19457G113l027n655o151l662Q52j672K383Q846J0685n907p201o775n31N749R517
$$ 7113 4086 -1569 -7720 -11382 -10530 -12202 -9819 -973 9712 3805 -3396 -10171 -10702 -4953 4564
19442D564K385m32j704n016M072Q00l482Q94M780L509N65Q67j316p058J03J88
$$ 4564 6949 6517 4813 -203 3869 4669 1187 2081 6861 10370 10935 11802 10486 3428 3531 3719
19426C719l551R8L853K66N948K851J106n216l842L862K483L7M173k732o797q44
$$ 3719 168 266 4119 4385 10333 13184 14290 9074 5232 9094 11577 11614 15787 13055 6258 5414
19410E414N048k456k023L742l533l338j016j244Q243j214n16K394L264j2800q672
$$ 5414 10462 8006 5983 9725 6192 2854 1838 594 8837 7623 7107 9501 12765 -35 -8707
19395h707k822P739P600P92N82j785k388K033n1l704K518k940j052l18K114m48
$$ -8707 -11529 -3790 3810 4602 5184 3399 1011 3044 2993 -711 1807 -1133 -2185 -2503 -389 -837
19379h37k04j563k216k130k099j006J271J006K179J748l003K53M756k076M57K194
$$ -837 -1041 -2604 -4820 -6950 -9049 -10055 -8784 -7778 -5599 -3851 -6854 -6601 -1845 -3921 -3464 -1270
19363a270O529N53o76P8p92O852J307k599j184n52n75J916k76m445M185N086J658
$$ -1270 5259 5812 5136 5214 4422 11274 12581 9982 8798 8246 7671 9587 9311 4866 9051 14137 15795
19346A5795m313j771j701M269M919J150P77k922m564q904L217N588L456l268J773
$$ 15795 11482 9711 8010 12279 17198 18348 19125 16203 11639 2735 5952 11540 14996 11728 13501
19331A3501K607J114m583j003K467J672K147J0215J0390N599J0813K2910K1149
$$ 13501 16108 17222 12639 11636 14103 15775 17922 28137 38527 44126 54939 77849 98998
19318I8998J4993k35j9611j0380L508J2499J6607J1036K0443J1934J331m069j6016
$$ 98998 113991 113756 94145 83765 87273 99772 116379 127415 147858 159792 161123 157054 141038
19305A41038k4690j8090p417K078P555L565k174j3238k0795j8102q647o791q467
$$ 141038 116348 98258 90841 92919 100474 104039 101865 88627 67832 49730 41083 34292 25825
19292B5825k384k099Q75r000q256K412J228k763J375L859L117L76N857J494L110
$$ 25825 23441 21342 22217 13217 4961 7373 8601 5838 7213 11072 14189 14565 20422 21916 25026
19277B5026L966K358L487M193J1088J8660K1166J6702K2118J0755q707j7577o946
$$ 25026 28992 31350 34837 39030 50118 68778 89944 106646 128764 139519 130812 113235 106289
19264A06289K700J0786K0110K3110J7028n407n365j4867j9797k3222j8476M388
$$ 106289 108989 119775 139885 162995 180023 174616 169251 154384 134587 111365 92889 97277
19252I7277O288M040K377N25j8220k2918j5546j603J539k20P396K401R700J3764
$$ 97277 103565 107605 109982 110507 92287 69369 53823 52220 53759 53539 60935 63336 73036 86800
19238H6800J5023J8153K5557L4925M2849K9130J0073J760j0731l7216n4343l6508
$$ 86800 101823 119976 145533 180458 223307 252437 262510 264270 253539 216323 161980 125472
19226A25472q895R185J2523J1506j0466j4675l342N873M193j4779k0695j2832
$$ 125472 116577 125762 138285 149791 139325 124650 121308 127181 131374 116595 95900 83068
19214H3068n914L494O868R997k949j8771j7705j2180l024n310L76j521j0878n958
$$ 83068 77154 80648 87516 97513 94564 75793 58088 45908 42884 37574 37950 36429 25551 19593
19200A9593l470k106L453Q496R081J2347J0005Q015J1935J6366K3559K0510K1921
$$ 19593 16123 14017 17470 25966 35047 47394 57399 65414 77349 93715 117274 137784 159705
19187A59705M1754N0470M8776N0091K7634M850O545k7436o0518o7277m4872k2573
$$ 159705 201459 251929 300705 350796 378430 383280 389825 362389 301871 234594 189722 167149
19175A67149k005L834J1446O62n987k822j491j3358l0009j9273m233L568l567
$$ 167149 165144 168978 180424 181086 175099 172277 170786 157428 127419 108146 103913 107481 103914
19162A03914N975P905n508k6576k5041j2863n162n180q600o271L21N173J376j250
$$ 103914 109889 117794 112286 85710 60669 47806 42644 37464 28864 22593 22914 28087 29463 28213
19148B8213J250L290R23J245M32o266m887N438R074Q435J7644J2507J8941J4667
$$ 28213 29463 32753 33676 34921 35353 29087 24200 29638 38712 47147 64791 77298 96239 110906
19134A10906R056j765j589k053r923k2254k8702p748k125r655l458n216j0256
$$ 110906 119962 118197 116608 114555 104632 82378 53676 45928 43803 34148 30690 25474 15218
19121A5218k210K29o628m169K196J04m548m901j911M154k167J563P3M947p889
$$ 15218 13008 13237 6609 2440 4636 4740 192 -4709 -6620 -2466 -4633 -3070 -2997 1950 -5939
19106e939L026R087j450r892o75J0004q03j392K406m675j496j801K209L422pj007
$$ -5939 -2913 6174 4724 -5168 -5843 4161 3358 1966 4372 -303 -1799 -3600 -1391 2031 2024 1017
19090A017K864R155o484q260q36M070J82J807o35P101M423K046L251n075q520
$$ 1017 3881 13036 6552 -1708 -2544 1526 1708 3515 2880 9981 14404 16450 19701 14626 6106
19075F106l816q165j245j630K316L561P170j061k326r24L909p9o537j280J209
$$ 6106 2290 -5875 -7120 -8750 -6434 -2873 4297 3236 910 -14 3895 3816 -2721 -4001 -2792
19060b792L892M879o931l427M577m606J862J773l785J954m716K836L383Q773P516
$$ -2792 1100 5979 -952 -4379 198 -4408 -2546 -773 -4558 -2604 -7320 -4484 -1101 7672 15188
19045A5188n393n402L269K862m458m675K256P412L051j471O75k533L960k629p872
$$ 15188 9795 4393 7662 10524 6066 1391 3647 11059 14110 12639 13314 10781 14741 12112 4240
19030D240q078N618J0690M162K086j026J646l531m955l381o122O496M38m055M293
$$ 4240 -3838 1780 12470 16632 18718 17692 19338 15807 10852 7471 1349 7845 8283 4228 8521
19015H521L226L308n877o445M742j919l126j310j949o245k636Q390k388O198M537
$$ 8521 11747 15055 9178 2733 7475 5556 2430 1120 -829 -7074 -9710 -1320 -3708 2490 7027
19000G027J519L212L704J297j332n103L45n609k606M720o685n851P782N190P17
$$ 7027 8546 11758 15462 16759 15427 10324 10669 5060 2454 7174 489 -5362 2420 7610 8327
18985H327N89M35L11K619m709J935N632O291M601O233j912J475J917J656N853
$$ 8327 8916 9351 9662 12281 7572 9507 15139 21430 26031 32264 30352 31827 33744 35400 41253
18970D1253J659p395l972k333l683l773k518O25o002j1037r1L720J444J11N540
$$ 41253 42912 35517 31545 29212 25529 21756 19238 19863 13861 2824 2733 6453 7897 8008 13548
18955A3548L954m920R23k938K428J458n20M45J040K088J818k639M750P379n369
$$ 13548 17502 12582 13505 10567 12995 14453 13933 14378 15418 17506 19324 16685 21435 28814 23445
18940B3445l526J041J71o695J928P360N592M345J958n202k161L579L864j41P587
$$ 23445 19919 20960 21131 14436 16364 23724 29316 33661 35619 30417 28256 31835 35699 35558 43145
18925D3145L052n656l374J373o112l382j052M555P989N537K225n525p590p17R45
$$ 43145 46197 40541 37167 38540 32428 29046 27994 32549 40538 46075 48300 42775 35185 34468 35413
18910C5413o638k552l840M406M597k867k395r04k658M396J909k477k29L418K332
$$ 35413 28775 26223 22383 26789 31386 28519 26124 25220 22562 26958 28867 26390 26161 29579 31911
18895C1911Q798Q676N562l18O045Q880R191M675J4844R536J7654K7161M0466M1764
$$ 31911 40709 49385 54947 54629 60674 69554 78745 83420 98264 107800 125454 152615 193081 234845
18881B34845M6291O4852Q9860Q1312j701n2574j8019m3197j12281j02486n1721
$$ 234845 281136 345988 435848 517160 515459 462885 444866 401669 289388 186902 135181
18870A35181l2304k0282j0941n598j1719n589o044J544l727j0135k917L421R255
$$ 135181 102877 82595 71654 66056 54337 48748 42704 44248 40521 30386 27469 30890 40145
18857D0145N974j855m22J90N979N434L855q68J259K983N244N183M483J6045J5329
$$ 40145 46119 44264 43842 44032 50011 55445 59300 58432 59691 62674 67918 73101 77584 93629 108958
18842A08958L914J0797O924N388J5738J9202K7282L3348M3908O6883Q8307R7367
$$ 108958 112872 123669 130593 135981 151719 170921 198203 231551 275459 342342 430649 528016
18830E28016J20757J28514P2333K3677m388p5178j27405j30702j40678j30175
$$ 528016 648773 777287 849620 873297 868909 793731 666326 535624 394946 264771
18820B64771p4044m3873k1094j3062j1237m993j2428j1356q915L241k746l4N209
$$ 264771 190727 146854 125760 112698 101461 96468 84040 72684 63769 67010 64264 64230 69439
18807F9439K937M875R36j55L467O962N98o67o90L397P694N530P801Q873P934J2993
$$ 69439 72376 77251 78187 78032 81499 88461 89059 88392 87702 91099 98793 104323 112124 120997 128931 141924
18791A41924J3040O325j119j604R09L759P602K0083K9101L8382M9494O0532P4872
$$ 141924 154964 161289 160170 158566 159475 163234 170836 190919 220020 258402 307896 368428 443300
18778D43300P1463J1788l3458j7748l2821r1285q8851m5258k1270n448M039L094
$$ 443300 514763 526551 493093 475345 442524 351239 262388 217130 195860 190412 194451 197545
18766A97545J6402J0627J855j9725k3820p117o714J155M672O830M771N291J5709
$$ 197545 213947 224574 226429 206704 182884 175767 169053 170208 174880 181710 186481 191772 207481
18753B07481J9900J7700J7066K0635K0216J7503K6308K2691L7500M2993M9577
$$ 207481 227381 245081 262147 282782 302998 320501 346809 369500 407000 449993 499570
18742D99570P5781R2625P7887M9971J7461K6190L6773K2519K4218O1539J03372
$$ 499570 575351 667976 745863 795834 813295 839485 876258 898777 922995 984534 1087906
18731A087906J53521J99887K44490K84263L40283M08578M83968N68593O98959
$$ 1087906 1241427 1441314 1685804 1970067 2310350 2718928 3202896 3771489 4470448
18722D470448R13751J232519J661827K131587K696335L375395M205052N147304
$$ 4470448 5384199 6616718 8278545 10410132 13106467 16481862 20686914 25834218
18714B5834218M094269p04420k785072j126674k627080o466044o074835l493466
$$ 25834218 29928487 29224067 26438995 25312321 22685241 16219197 10144362 6650896
18706F650896j881063j168331p64888n04576l68577k95139k05224j31313p5540
$$ 6650896 4769833 3601502 2836614 2332038 1963461 1668322 1463098 1331785 1256245
18697A256245l5038o854K3295N5962R2245J32103J60627J50229J09660M6818J7806
$$ 1256245 1221207 1214353 1237648 1293610 1385855 1517958 1678585 1828814 1938474 1985292 2003098
18686B003098K4088L641m019N0873J58211K59604L59481M58160N32851O40725
$$ 2003098 2027186 2030827 2026808 2077681 2235892 2495496 2854977 3313137 3845988 4486713
18676D486713P70901R26195J115066J400510J851544K507383L299159M210719
$$ 4486713 5257614 6183809 7298875 8699385 10550929 13058312 16357471 20568190
18668B0568190N282746O597460Q197909Q582459M168591k259210l767450l222595
$$ 20568190 25850936 32448396 40646305 49228764 53397355 51138145 47370695 44148100
18660D4148100p272198j1207685r456933n538664l083910j919060j254144q67266
$$ 44148100 36875902 25668217 16211284 10672620 7588710 5669650 4415506 3548240
18652C548240o62303n09674l61468k57445j87611j21322o7343l7979J93L4604
$$ 3548240 2885937 2376263 2014795 1757350 1569739 1448417 1381074 1343095 1343288 1377892
18642A377892O3423J10821J18323M8587j8025l6351m2516q0770j01571o0771J6450
$$ 1377892 1441315 1552136 1670459 1719046 1701021 1664670 1622154 1541384 1439813 1379042 1395492
18631A395492Q7561J44899J98489K37787K89145L61385M43823N32971O73805R08933
$$ 1395492 1483053 1627952 1826441 2064228 2353373 2714758 3158581 3691552 4365357 5274290
18621E274290J243432J627039K051445K600738L222500M054122M156291R65875
$$ 5274290 6517722 8144761 10196206 12796944 16019444 20073566 24229857 25195732
18613B5195732k342991j500291j214603m583229n716772l716374j949994j146321
$$ 25195732 22852741 21352450 20137847 15554618 9837846 6121472 4171478 3025157
18605C025157p42448m92757l51664k69737k07535j52751j08579q0478n2497l1294
$$ 3025157 2282709 1789952 1438288 1168551 961016 808265 699686 619208 566711 535417
18595E35417k0437j5030l542J2061J2812J5344K930l6668l5305l3916o1524p1116
$$ 535417 514980 499950 496408 508469 521281 536625 539555 502887 467582 433666 372142 301026
18583C01026m7597l0855k7637j4653J004k79m994n067M65N487Q503Q074L980J0816
$$ 301026 253429 222574 194937 180284 181288 181009 176015 170948 171413 176900 185403 193477 197457 208273
18569B08273P61j1033n352j3290k2235k8766k3801j4969p675L258m573j3650l961
$$ 208273 209034 198001 192649 179359 157124 128358 104557 89588 81913 85171 80598 66948 62987
18556F2987K134m656l088R998m57r342O08N620N62j108k767m901R42K384k879
$$ 62987 65121 60465 57377 67375 66918 57576 58184 63804 64366 63258 60491 55590 56532 58916 56037
18541E6037l996o098r383p889q516k547n120K811J1023J6946J5284P005Q666N216
$$ 56037 52041 45943 36560 28671 20155 17608 12488 15299 26322 43268 58552 65557 74223 79439
18527G9439jN210J5613J8452K3802K4055P372l786k411p432j7282j1712k5121
$$ 79439 79438 84648 100261 118713 142515 166570 173942 170156 167745 160313 143031 131319 106198
18514A06198k9580k4716j4391n366n096k98j416n29L907K881k109m675m669m579
$$ 106198 76618 51902 37511 32145 27049 26751 25335 24806 28713 31594 29485 24810 20141 15562
18500A5562K313q98O842K987K73l747o210K055L229p054p836Q59M291L51j712
$$ 15562 17875 16977 23819 26806 27079 23332 17122 19177 22406 15352 7516 8375 12666 13017 11305
18485A1305p44k152j88L910M559J3303J3893N033j525N76J0479P044M507R848
$$ 11305 10561 8409 8221 12131 16690 29993 43886 48919 47394 47970 58449 65493 70000 79848
18471G9848j474n737n48j191r008j1097j2598j2006k099m368r727o6K397N829
$$ 79848 78374 72637 72089 70898 61890 50793 38195 26189 24090 19722 9995 9929 12326 18155
18457A8155K238P42l491q259o068q451N471N0K39L685K657n895j628Q0J491K545
$$ 18155 20393 21135 17644 9385 3317 -5134 337 387 626 4311 6968 1073 -555 -475 1016 3561
18441C561J023l592o424K450O858m359Q47L214n106k688J961L067N485o158J337
$$ 3561 4584 992 -5432 -2982 3876 -483 364 3578 -1528 -4216 -2255 812 6297 139 1476
18426A476Q373M138k371K808M604l245q943M99K097k505o99r61K180K278P234
$$ 1476 9849 13987 11616 14424 19028 15783 6840 7339 9436 6931 6232 5271 7451 9729 16963
18411A6963m018p383n657o170K18K388j280m806k521K050K128k81k594k131K541
$$ 16963 12945 5562 -95 -6265 -6047 -3659 -4939 -9745 -12266 -10216 -8088 -8369 -10963 -13094 -10553
18396a0553M344L179j850L557O289l47l194l379l871j01n764O85J006O098L632
$$ -10553 -6209 -3030 -4880 -1323 4966 4619 1425 -1954 -5825 -5926 -11690 -11005 -9999 -3901 -269
18381b69k000l000O124L221r30o757J221N716J380q239J29l027J484k498j613
$$ -269 -2269 -5269 855 4076 3146 -3611 -2390 3326 4706 -3533 -3404 -6431 -4947 -7445 -9058
18366i058L995R570l364k660k679o408r699l772J889O583k744M62m090L046J698
$$ -9058 -5063 4507 1143 -1517 -4196 -10604 -20303 -24075 -22186 -15603 -18347 -17885 -21975 -18929 -17231
18351a7231M024O774R246o630n710J9N570J833m703K095M619N062L751q861q823
$$ -17231 -13207 -6433 2813 -3817 -9527 -9508 -3938 -2105 -6808 -4713 -94 4968 8719 -142 -8965
18336h965O340M863K150k654J101j989j542m88m28P8l47L63j591j934M582J0286
$$ -8965 -2625 2238 4388 1734 2835 846 -696 -1184 -1612 -1534 -1881 -1518 -3109 -5043 -461 9825
18320I825l169l664L828M78n928m509J39M799L45j841o744n063J919N303n41K190
$$ 9825 6656 2992 6820 7298 1370 -3139 -3000 1799 2144 303 -6441 -11504 -9585 -4282 -4823 -2633
18304b633M282J221l387l696m405k004K068O222k226K804L589r114M12J141N606
$$ -2633 1649 2870 -517 -4213 -8618 -10622 -8554 -2332 -4558 -1754 1835 -7279 -6867 -5726 -120
18289a20L848j81r745l552O07K738N294R961K893o217o30o114k791M480o80L073
$$ -120 3728 3547 -6198 -9750 -9143 -6405 -1111 8850 11743 5526 4896 -1218 -4009 471 -209 2864
18273B864L177L982P44J193j125k966l022l109j490k123L63L735O0M058l34l555
$$ 2864 6041 10023 10767 11960 10835 7869 4847 1738 248 -1875 -1512 2223 2283 6341 6007 2452
18257B452o45l865l577p97K974L24M84L304K043n330J740n77L135J775m755p775
$$ 2452 1807 -2058 -5635 -6432 -3458 -3134 -2650 654 2697 -2633 -893 -1470 1665 3440 -1315 -9090
18241i090K264Q871k633r95M774R0N895O974n375m348N969K922l505n321j97Q60
$$ -9090 -6826 2045 -588 -1583 3191 3281 9176 16150 10775 6427 12396 15318 11813 6492 6295 7155
18225G155k671J159M817l22M7J110l789L444j01O53L462m664q631Q82K675R29
$$ 7155 4484 5643 10460 10138 10185 11295 7506 10950 10849 11502 14964 10300 1669 2551 5226 6155
18209F155Q916j249j794J080N201j48j1176n275P01O780J4627K811M70O391M597
$$ 6155 15071 13822 12028 13108 18309 18161 6985 1710 2411 9191 23818 26629 27099 33490 38087
18194C8087O004R762J1299J2434K4534K6440K0536R45r264r499j0335k2137k5949
$$ 38087 44091 53853 65152 77586 102120 128560 149096 150041 140777 131278 120943 98806 72857
18181G2857k9866j1593l007m232m424j006n680k199K331l59l397o795N123n856
$$ 72857 42991 31398 28391 24159 19735 18729 13049 10850 13181 12822 9425 2630 7753 1897
18167A897l170P955M541O986P039R152K135r482L424L848p351o610q51M660l03
$$ 1897 -1273 6682 11223 18209 25248 34400 36535 27053 30477 34325 26974 20364 19513 24173 23870
18152B3870P767J0445J636J314J0002R964J3447J5376J8649K9045L2524L8129
$$ 23870 31637 42082 43718 45032 55034 64998 78445 93821 112470 141515 174039 212168
18140B12168M7012M2060K3195L765j4604j3963k1676l7556l9138k3128o040Q740
$$ 212168 259180 301240 324435 328200 313596 299633 277957 240401 201263 178135 172095 180835
18128A80835J4551K1629K2972K9120M1716O3494P7825R4321J04850J08840J24577
$$ 180835 195386 217015 239987 269107 310823 374317 452142 546463 651313 760153 884730
18117H84730J53446J93592K34299L22042M62095O73298Q76837J122986J421634
$$ 884730 1038176 1231768 1466067 1788109 2250204 2923502 3800339 4923325 6344959
18108F344959J702282K263467K067636j457069m261890l140006j489464p20854
$$ 6344959 8047241 10310708 12378344 10921275 6659385 3519379 2029915 1309061
18100A309061l89107k19293j46392j08847q4922n6978l8427k2006q038k594m96
$$ 1309061 919954 700661 554269 445422 360500 303522 265095 243089 235051 232457 231961
18089B31961M08j229j8325j5485q848k6055l4482k6069j7907j0941o205p332l643
$$ 231961 232369 231140 212815 197330 188482 162427 127945 101876 83969 73028 66823 59491 55848
18076E5848j921N15k301q38j0241o016K892J954J052J596p063l133l450j895k349
$$ 55848 53927 54442 52141 51303 41062 35046 37938 39892 40944 42540 35477 32344 28894 26999 24650
18061B4650o016m776K217j224o02j632m320M95L070n031k847j331J12q39J557
$$ 24650 18634 13858 16075 14851 14249 12617 8297 8792 11862 6831 3984 2653 2765 1926 3483
18046C483P877K33m29L694M171m754o109l129q93N16K237l938j0150k848P779
$$ 3483 11360 11593 11164 14858 19029 14275 8166 5037 4144 4660 6897 2959 -7191 -10039 -2260
18031b260L291L444P248O759Q168K013p718p036k867N381O281n682j1717o298
$$ -2260 1031 4475 11723 18482 26650 28663 20945 13909 11042 16423 22704 17022 5305 -993
18017i93k829Q49J148K758L451J426n725k962M68O028K195K518j577j0737o015
$$ -993 -3822 -2973 -1825 933 4384 5810 85 -2877 -2409 3619 5814 8332 6755 -3982 -9997
18002i997j212M27O7K382J803J692j936M352Q62J009L005N45n158m990k382J58
$$ -9997 -11209 -10782 -10715 -8333 -6530 -4838 -6774 -2422 -1560 -551 2454 2999 -2159 -7149 -9531 -9373
17986i373K744L235N018M939k435p913m787J860q71L56r33Q031R277J0138j616
$$ -9373 -6629 -3394 1624 6563 4128 -3785 -8572 -6712 -7583 -7227 -8160 -129 9148 19286 17670
17971A7670p288N6p51l240N115J020j467J185P984L787L995L412J836o82Q80M399
$$ 17670 10382 10438 9687 6447 11562 12582 11115 12300 20284 24071 28066 31478 33314 32632 33512 37911
17955C7911J477m724p712k396P83j602j0492k359o093J925K243l170m556j1412
$$ 37911 39388 34664 26952 24556 25339 23737 13245 10886 4793 6718 8961 5791 1235 -10177
17941a0177O02P969j428L487M005L311O054J954r477l078r63P237M877l740j012
$$ -10177 -9575 -1606 -3034 453 4458 7769 13823 15777 6300 3222 2259 9496 14373 10633 9621
17926I621n846l112J417J791M442j604k649O19m23P17P690l189k421L296K503
$$ 9621 3775 663 2080 3871 8313 6709 4060 4679 4256 4973 12663 9474 7053 10349 12852
17911A2852j83j549n666k059J827O39l2l462j552k048QJ488r37J882m566p057
$$ 12852 12669 11120 5454 3395 5222 5861 5829 2367 815 -1233 -1225 263 -674 1208 -3358 -10415
17895a0415k040J718K997K811k988K63J724K296N120k872l631K046P220M36l631
$$ -10415 -12455 -10737 -7740 -4929 -7917 -7654 -5930 -3634 1486 -1386 -5017 -2971 4249 4685 1054
17880A054j680j465j806M551l576n076m132m82M334J25m133J524J0144O137o396
$$ 1054 -626 -2091 -3897 654 -2922 -7998 -12130 -12612 -8278 -8153 -12286 -10762 -618 5519 -877
17865h77k057R825L819k327r935l490O98p0N337J015j049m127o665P46L778k697
$$ -877 -2934 6891 10710 8383 -1552 -5042 -4344 -4414 923 1938 889 -3238 -9903 -9157 -5379 -8076
17849h076K674K416k44J321q43K62o376o7n111j406K246J206N204L561m392j476
$$ -8076 -5402 -2986 -3230 -1909 -2752 -2490 -8866 -8933 -14044 -15450 -13204 -11998 -6794 -3233 -7625 -9101
17833i101J870L88j902n275O471P120M29o419M90o88k769k81M58r35l322J848
$$ -9101 -7231 -6843 -8745 -14020 -7549 -429 0 -6419 -5929 -6617 -9386 -9667 -9209 -10144 -13466 -11618
17817a1618P82k478j756J217M909K346j32L806p31J169n923P8L512l04N418k50
$$ -11618 -10836 -13314 -15070 -13853 -8944 -6598 -6730 -2924 -3655 -2486 -8409 -8331 -4819 -5123 295 45
17801D5M19P37n866k234l184K518j307j932Q815L259Q002p711n639M15M47l19
$$ 45 464 1201 -4665 -6899 -10083 -7565 -8872 -10804 -1989 1270 9272 1561 -4078 -3663 -3216 -3535
17785c535L99l898k199l525K004J325R787Q549J291l563L987P62p220L58l805
$$ -3535 -3136 -7034 -9233 -12758 -10754 -9429 358 8907 10198 6635 10622 11384 4164 4522 717
17770G17j659j1820o064M030M856O156m246k073j087N912n25n006J960Q14K801
$$ 717 -942 -12762 -18826 -14796 -9940 -3784 -8030 -10103 -11190 -5278 -5803 -10809 -8849 -8035 -5234
17755e234Q43K047j909j993K97R448L615o742n477o42L827j86p997M992N362L558
$$ -5234 -4391 -2344 -4253 -6246 -5949 3499 7114 372 -5105 -5747 -1920 -2106 -10103 -5111 251 3809
17739C809m619k542o790l753M926k669K490O794r0J407j27R30q58k082o014J93
$$ 3809 -810 -3352 -10142 -13895 -8969 -11638 -9148 -2354 -2444 -1037 -1164 -234 -1092 -3174 -9188 -8995
17723h995M695p9k563M434L842k59r198l810P476L762n97O1r33j0081k419n4J747
$$ -8995 -4300 -4379 -6942 -2508 1334 1075 -8123 -11933 -4457 -695 -1292 -1231 -2164 -12245 -14664 -14718 -12971
17706a2971K300j284k383N512j940O448J258j339J96J831K536N022J931L47j851
$$ -12971 -10671 -11955 -14338 -8826 -10766 -4318 -3060 -4399 -4203 -2372 164 5186 7117 7464 5613
17691E613o653M108p66j4O05p41n790o548l756q23L544L303j286K10j2222o279
$$ 5613 -1040 3068 2302 2288 2893 2152 -3638 -10186 -13942 -14765 -11221 -7918 -9204 -8994 -21216 -27495
17675b7495L651O960R066l555J775N195N96k054k185O155m97n808m511j308k843
$$ -27495 -23844 -16884 -7818 -11373 -9598 -4403 -3807 -5861 -8046 -1891 -2388 -8196 -12707 -14015 -16858
17660a6858j560M098M013K535Q6r02L2l832P001K130k232n864L343k745K573O034
$$ -16858 -18418 -14320 -10307 -7772 -7686 -8588 -8556 -12388 -5387 -3257 -5489 -11353 -8010 -10755 -8182 -2148
17644b148k992M971J207o535l697k69k853J367L667j736k425P932P815Q71r852
$$ -2148 -5140 -169 1038 -5497 -9194 -9463 -12316 -10949 -7282 -9018 -11443 -3511 4304 5175 -4677
17629d677J764p67p417J872R88J665j95l289m513L477O354K271l220L013J484
$$ -4677 -2913 -3680 -11097 -9225 -8237 -6572 -6767 -10056 -14569 -11092 -4738 -2467 -5687 -2674 -1190
17614a190n370P159Q78k603k622l198N18R50M19M492J558n007j736J2P074k225
$$ -1190 -6560 599 1477 -1126 -3748 -6946 -6428 -5478 -5059 -567 991 -4016 -5752 -5740 1334 -891
17598h91r32J145j59k735K150N536o429o366o207K128N928k912l957m074J627
$$ -891 -1823 -678 -837 -3572 -1422 4114 -2315 -8681 -14888 -12760 -6832 -9744 -13701 -17775 -16148
17583a6148N806K022J689N415N409J227J910Q208l410o366J404m307L12J538n937
$$ -16148 -10342 -8320 -6631 -1216 4193 5420 7330 15538 12128 5762 7166 2859 3171 4709 -1228
17568a228k798l301r54J331o34L40K379M094N34k998q22%K991l67l627l511J904
$$ -1228 -4026 -7327 -8281 -6950 -7584 -7244 -4865 -771 -237 -3235 -4057 -4057 -1066 -1433 -5060 -8571 -6667
17551f667m86J293O091Q831K890k391m977L195J898k923J005j666j551p165k391
$$ -6667 -7153 -5860 231 9062 11952 9561 4584 7779 9677 6754 7759 6093 4542 -2623 -5014
17536e014j809n738p98N564M440K255J218o822n894K088J0780N779o149p00K617
$$ -5014 -6823 -12561 -13359 -7795 -3355 -1100 118 -6704 -12598 -10510 270 6049 -100 -800 1817
17521A817j872R523M10o910K059J061P148l564n723m632o701m801M919L952n294
$$ 1817 -55 9468 9878 2968 5027 6088 13236 9672 3949 -683 -7384 -12185 -7266 -3314 -8608
17506h608M950J970p376p310L782K287J50K433L000O289L458j695n630l571p578
$$ -8608 -3658 -1688 -9064 -16374 -12592 -10305 -10155 -7722 -4722 1567 5025 3330 -2300 -5871 -13449
17491a3449k664O688J535o3l837n802L247K79k144N765M117j626l851j063M759
$$ -13449 -16113 -9425 -7890 -7953 -11790 -17592 -14345 -14066 -16210 -10445 -6328 -7954 -11805 -12868 -8109
17476h109J333k73k241j332j205j46j690K435M374N063M700q135k182o986l045
$$ -8109 -6776 -7049 -9290 -10622 -11827 -11973 -13663 -11228 -6854 -1791 2909 -5226 -7408 -14394 -17439
17461a7439O442R790N853l191k8j946L95N525l010n110L9K191K529O606K742j039
$$ -17439 -10997 -1207 4646 1455 1427 -519 -124 5401 2391 -2719 -2680 -489 2040 8646 11388 10349
17445A0349n42J2155J1194K851K895J7750Q837j5941k3374j7404o896J602K242
$$ 10349 9807 21962 33156 36007 38902 56652 65489 49548 26174 8770 1874 3476 5718
17432E718L591j000l836l309q164N41k544l414N034N085O036n227l318j920n29
$$ 5718 9309 8309 4473 1164 -7000 -6459 -9003 -12417 -7383 -2298 3738 -1489 -4807 -6727 -7256
17417g256M465K943K668L43k861J566r42K914j251l526k069n151m190l523L583
$$ -7256 -2791 152 2820 3163 302 1868 926 3840 2589 -937 -3006 -8157 -12347 -15870 -12287
17402a2287O685M08J769n025k600l574l159L015O690j6j296L908n31n933n825
$$ -12287 -5602 -5194 -3425 -8450 -11050 -14624 -17783 -14768 -8078 -8094 -9390 -5482 -6013 -11946 -17771
17387a7771M187O740l040K010O973J364j793L24o453K28q56l391j155K057M243
$$ -17771 -13584 -6844 -9884 -7874 -901 463 -1330 -1006 -7459 -7231 -8087 -11478 -12633 -10576 -6333
17372f333k77J668j951m579j111L33m128L708M801R65l577j03k724l220Q725N190
$$ -6333 -6610 -4942 -6893 -11472 -12583 -12250 -16378 -12670 -7869 -6904 -10481 -10584 -13308 -16528 -7803 -2613
17356b613mL32k480o671q01N027R823m46O74m873n056j004K118N17N93L4P89r41
$$ -2613 -2617 -2285 -4765 -11436 -12237 -7210 2613 2167 2841 -2032 -7088 -8092 -5974 -5457 -4864 -4830 -4041 -4982
17338d982N180n54j469k07P97k019K94M46J065m78J107j916m580J188n588m224
$$ -4982 198 -356 -1825 -2032 -1235 -3254 -2960 -2514 -1449 -1927 -820 -2736 -7316 -6128 -11716 -15940
17322a5940J113K079J364K755L462j38L478r75m527M3J89L720M56J0025k784p655
$$ -15940 -14827 -12748 -11384 -8629 -5167 -5305 -1827 -2802 -7329 -7286 -7097 -3377 -2921 7104 4320 -3335
17306c335O19r74P724L149k512l129q87K822k803n426j374P15r31M114J667m005
$$ -3335 -2716 -3690 4034 7183 4671 1542 655 3477 674 -4752 -6126 -5411 -6342 -2228 -561 -4566
17290d566n124r0M206K261j490L89L0n726L464L641j205p97N743J754M549n246
$$ -4566 -9690 -9780 -5574 -3313 -4803 -4414 -4384 -10110 -6646 -3005 -4210 -5007 736 2490 7039 1793
17274A793q161L758K24p231o926k28M862Q515j241j004R22o25M47l468m148l834
$$ 1793 -6368 -2610 -2386 -9617 -16543 -16771 -11909 -3394 -4635 -5639 -4717 -5342 -4895 -8363 -12511 -16345
17258a6345P214P757M364j673J68L05k309P31m842p396k595j483Q892j455M021
$$ -16345 -9131 -1374 2990 1317 1485 1790 -519 212 -4630 -12026 -14621 -16104 -7212 -8667 -4646
17243d646K198q403n349L826P268P4k921k143k137M91k386N038R550J168k060
$$ -4646 -2448 -10851 -16200 -12374 -5106 -5032 -7953 -10096 -12233 -11742 -14128 -9090 460 1628 -432
17228d32o76j07o374k302J302l173L120k026M05J335J022k259M777N559K775p416
$$ -432 -1108 -1215 -7589 -9891 -8589 -11762 -8642 -10668 -10263 -8928 -7906 -10165 -5388 171 2946 -4470
17212d470m644P079N507l255r844M162K914l787J426K670J01k90m824Q90j651
$$ -4470 -9114 -2035 3472 217 -9627 -5465 -2551 -6338 -4912 -2242 -2141 -2431 -7255 -6365 -8016
17197h016j13k156J152K327m697L994O66R41K97N765L224j814L884R41k346k190
$$ -8016 -8129 -10285 -9133 -6806 -11503 -7509 -6843 -5902 -5605 160 3384 1570 5454 6395 4049 1859
17181A859j409j128l259o144N504M165k250l959m333j598L455N12J392P753m08
$$ 1859 450 -678 -3937 -10081 -4577 -412 -2662 -6621 -10954 -12552 -9097 -8585 -7193 560 152
17166A52Kk421j864K087M074o814J590q504n187N330R045J882q899J32L212O877
$$ 152 154 -2267 -4131 -2044 2030 -4784 -3194 -11698 -16885 -11555 -2510 -628 -9527 -9395 -6183 694
17150F94j133o473K289L476L882K172m605k721q70p357K449L974K648J735j306
$$ 694 -439 -6912 -4623 -1147 2735 4907 302 -2419 -3289 -10646 -8197 -4223 -1575 160 -1146
17135a146K300n893j1172l857K488M886n03K1P5l298N10j466L615L659P395j262
$$ -1146 1154 -4739 -15911 -19768 -17280 -12394 -12897 -12876 -12801 -16099 -15589 -17055 -13440 -9781 -2386 -3648
17119c648m346j732J021k816J534O82L649m131J031M707J823L302R15r91l738
$$ -3648 -7994 -9726 -8705 -11521 -9987 -9305 -5656 -9787 -8756 -4049 -2226 1076 1991 1000 -2738
17104b738M861o79q587l048N424N004m321q34k452P124K60O155J1726J255l137
$$ -2738 2123 1444 -7143 -10191 -4767 237 -4084 -4918 -7370 -246 14 6169 17895 19150 16013
17089A6013k512m466m959l17k505l255N0m52j615R71l598n448o507L287K780L275
$$ 16013 13501 9035 4076 3759 1254 -2001 -1951 -2403 -4018 -3047 -6645 -12093 -18600 -15313 -12533 -9258
17073i258j947O605O382l003r808k233l963J423O232P93n413m033J326J230L804
$$ -9258 -11205 -4600 1782 -1221 -11029 -13262 -17225 -15802 -9570 -8777 -14190 -18223 -16897 -15667 -11863
17058a1863L291M345m17n467l212j550L642O225L800J284R670N022p972j5008
$$ -11863 -8572 -4227 -4644 -10111 -13323 -14873 -11231 -5006 -1206 78 9748 14770 6798 -8210
17044h210M2K399k384k38K836P311J765o377n881m801Q872Q779m555o133O249
$$ -8210 -8168 -5769 -8153 -8391 -5555 1756 3521 -2856 -8737 -13538 -4666 4113 -442 -6575 -326
17029c26N582K0m852n020m409J999L143m18j235J294M456l772q002J221M06L340
$$ -326 5256 5276 424 -4596 -9005 -7006 -3863 -4281 -5516 -4222 234 -3538 -11540 -10319 -9913 -6573
17013f573L997K212N665p333l088m315k685j239K791j96L463j077j87p689n769
$$ -6573 -2576 -364 5301 -2032 -5120 -9435 -12120 -13359 -10568 -10764 -7301 -8378 -8565 -16254 -22023
16998b2023L04M137K093J361q7O187N575P53p875K656M676J21m754p53M10J82
$$ -22023 -21719 -17582 -15489 -14128 -14215 -8028 -2453 -1700 -9575 -6919 -2243 -2122 -6876 -7629 -7219 -7037
16982g037k497M167j877o436l906k874M910M870J611K931k108j868l488J566N848
$$ -7037 -9534 -5367 -7244 -13680 -17586 -20460 -15550 -10680 -9069 -6138 -8246 -10114 -13602 -12036 -6188
16967f188l908J946k27j844J012P212P01m572m232p97Q845l942P37R880K223m704
$$ -6188 -10096 -8150 -8377 -10221 -9209 -1997 -1296 -5868 -10100 -10897 -2052 -5994 -5257 4623 6846 2142
16951B142j201M450m920p188Q90J203l83l673j1287r46P597R196j313M185M4k850
$$ 2142 941 5391 471 -6717 -5827 -4624 -5007 -8680 -19967 -20913 -13316 -4120 -5433 -1248 -1204 -4054
16935d054j553L272L211L046P080L962q574l660M460o567l825k11k55n603q062
$$ -4054 -5607 -2335 876 3922 11002 14964 6390 2730 7190 623 -3202 -3413 -3668 -9271 -17333
16920a7333M947J0108N25l464r042j1038R520N512o717J046P301l532N745K907
$$ -17333 -12386 -2278 -1753 -5217 -14259 -25297 -15777 -10265 -16982 -15936 -8635 -12167 -6422 -3515
16906c515O2O09l757k880k773P435j949o753j74N878L171j307O506K288J586p237
$$ -3515 -3453 -2844 -6601 -9481 -12254 -4819 -6768 -13521 -13695 -7817 -4646 -5953 553 2841 4427 -2810
16890b810n986J593N113k199O930o9l571j711m907j523K359n18M110j242p09Q08
$$ -2810 -8796 -7203 -2090 -4289 2641 2572 -999 -2710 -7617 -9140 -6781 -7299 -3189 -4431 -5140 -4332
16874d332J098J178J124l849J604K590J344L525m19k887J430j534p36M913k84
$$ -4332 -3234 -2056 -932 -4781 -3177 -587 757 4282 3863 976 2406 872 136 5049 4765
16859D765p019l34L02J027M427l852K845l550r09j895k396K557o370k919j167
$$ 4765 -2254 -2588 -2286 -1259 3168 -684 2161 -1389 -2298 -4193 -6589 -4032 -10402 -13321 -14488
16844a4488N745J948O108j569q168L279K900j860K278J896L726O692K274o001
$$ -14488 -8743 -6795 -687 -2256 -10424 -7145 -4245 -6105 -3827 -1931 1795 8487 10761 4760
16830D760l167k429q14n828k900K943Q148q59m095j97M6p52k0O450M049l208J741
$$ 4760 1593 -836 -1650 -7478 -10378 -7435 713 -146 -4241 -4438 -4392 -5144 -5164 1286 5335 2127 3868
16813C868m4m088l877l25j013o842K367Q350k847q44L878J777k52J68p19m004
$$ 3868 3824 -264 -4141 -4466 -5479 -12321 -9954 -1604 -4451 -5295 -1417 360 108 276 -443 -4447
16797d447j298R39k414l935o245K044J3140Q100R55p431J041q72l86M378J802
$$ -4447 -5745 -4806 -7220 -11155 -17400 -15356 -2216 5884 6839 -592 449 -423 -809 3569 5371
16782E371n523j803K557J686P78J200l148L974J519r18o06n15l09j2182q14m984
$$ 5371 -152 -1955 602 2288 3066 4266 1118 5092 6611 5693 5087 4572 4263 -7919 -8733 -13717
16766a3717m431O097j581k970L848K914M219m224L44N139K97k753K076L894J84
$$ -13717 -18148 -12051 -13632 -16602 -12754 -9840 -5621 -9845 -9501 -4362 -4065 -6818 -4742 -848 -664
16751f64k830j130k910J734J568L863p93j024M740Q578m824o577k426K69P402
$$ -664 -3494 -4624 -7534 -5800 -4232 -369 -1162 -2186 2554 11132 6308 -269 -2695 -2426 4976
16736D976N580j323m453m186l600N178j698p14q146n03o73J000M735K501O13m49
$$ 4976 10556 9233 4780 594 -3006 2172 474 -240 -8386 -8889 -9562 -8562 -3827 -1326 -713 -1162
16720a162o39l03j917j102l965k6L601j189J681O096j523q559L370N299K684m265
$$ -1162 -1801 -2104 -4021 -5123 -9088 -9114 -5513 -6702 -5021 1075 -448 -9007 -5637 -338 2346 -1919
16704a919n599m012O24j941L423n18j742K076R707J442q632j172P52j664P45K373
$$ -1919 -7518 -11530 -10906 -12847 -9424 -9942 -11684 -9608 99 1541 -7091 -8263 -7511 -9175 -8430 -6057
16688f057j131O888N767m225j2490p124k567r53Q699Q396J1970L708j3269l921
$$ -6057 -7188 -300 5467 1242 -11248 -18372 -20939 -21892 -13193 -4797 7173 10881 -2388 -6309
16674f309j736m303l003J14L449J369k982k078L113j165K151Q170N193J449k902
$$ -6309 -8045 -12348 -15351 -15237 -11788 -10419 -13401 -15479 -12366 -13531 -11380 -3210 1983 3432 530
16659E30K148k677j410M258J120J516k940n577N496N130M166J476n558p236K322
$$ 530 2678 1 -1409 2849 3969 5485 2545 -3032 2464 7594 11760 13236 7678 442 2764
16644B764M573l050p958l204K825K359O615O112o87m925m00k072k569J346J420
$$ 2764 7337 4287 -3671 -6875 -4050 -1691 4924 11036 10349 5424 5024 2952 383 1729 3149
16629C149K489o664p638K341k320Q75J299k603K774J861N733J736J428Q180K401
$$ 3149 5638 -1026 -8664 -6323 -8643 -7768 -6469 -9072 -6298 -4437 1296 3032 4460 12640 15041
16614A5041K150j1344k717o673m263m341k449N88O412J71L576K684q05N791m733
$$ 15041 17191 5847 3130 -3543 -7806 -12147 -14596 -14008 -7596 -7425 -3849 -1165 -1970 3821 -912
16599i12l130K226L355k017l648q990m297K892N655k91O80Q090J775k322j676
$$ -912 -4042 -1816 1539 -478 -4126 -13116 -17413 -14521 -8866 -9157 -8477 -387 1388 -934 -2610
16584b610k475K695J305m081m366k524L122J099Q608P28n259J675J0081N068o187
$$ -2610 -5085 -2390 -1085 -5166 -9532 -12056 -8934 -7835 773 1501 -3758 -2083 7998 13066 6879
16569F879q831j234o224l209k041M304m23K671J0609J0673j255j1415m012L025
$$ 6879 -1952 -3186 -9410 -12619 -14660 -10356 -10779 -8108 2501 13174 11919 504 -3508 -483
16555d83M038P097m971j0128l315N885N51p825j557M381J624N865n40j1387J773
$$ -483 3555 10652 5681 -4447 -7762 -1877 -1326 -9151 -10708 -6327 -4703 1162 622 -10765 -8992
16540h992p3N8P31m68K405P146P409j226r571q593L572O003K736k673k599L795
$$ -8992 -9065 -9007 -8276 -8744 -6339 807 8216 6990 -2581 -11174 -7602 -1599 1137 -1536 -4135 -340
16524c40J886K233k427r07o966J567K698O09J670P58J924j840n880n635M503L93
$$ -340 1546 3779 1352 445 -6521 -4954 -2256 -1647 23 781 2705 865 -5015 -10650 -6147 -5754
16508e754M07K886o36K103M696M241N56n986j31J0647j986j2878o783J062J182
$$ -5754 -5347 -2461 -3097 -994 3702 7943 8499 2513 2382 13029 11043 -1835 -8618 -7556 -6374
16493f374K862L282L924r05l110j586l072l447L411J074Q23K678K39k490j643
$$ -6374 -3512 -230 3694 2789 -321 -1907 -4979 -8426 -5015 -3941 -3118 -440 -201 -2691 -4334
16478d334k214k442l575L988N151j053q62P175j776M90k822l248l157j851L514
$$ -4334 -6548 -8990 -12565 -8577 -3426 -4479 -5341 1834 58 548 -2274 -5522 -8679 -10530 -7016
16463g016J402M539m34p71L474N620m281l284O100M583L745L451o290j2108k461
$$ -7016 -5614 -1075 -1509 -2280 1194 6814 2533 -751 5349 9932 13677 17128 10838 -1270 -3731
16448c731J921l383N685R340J407j1354p679M535L439j269m189N137N481j066
$$ -3731 -1810 -5193 492 9832 11239 -115 -7794 -3259 180 -1089 -5278 -141 5340 4274
16434D274J028N532M502L578R04o215r330n37q257l771K672L912k514n258M107
$$ 4274 5302 10834 15336 18914 19818 13603 4273 3736 -4521 -8292 -5620 -1708 -4222 -9480 -5373
16419e373P601M864k104m166O06J389l865m105k955m257j012J0913N599l772j3540
$$ -5373 2228 7092 4988 822 1428 2817 -1048 -5153 -8108 -12365 -13377 -2464 3135 -637 -14177
16404a4177l415Q212K654j481M890N87L032Q847Q80J804j124k075l892k708P37
$$ -14177 -17592 -9380 -6726 -8207 -3317 -2730 302 9149 10029 11833 10709 8634 4742 2034 2771
16389B771j030R2m685J622L958P31q687n570L667O523K524K207l499k965J596
$$ 2771 1741 1833 -2852 -1230 2728 3459 -5228 -10798 -7131 -608 1916 4123 624 -2341 -745
16374g45L998M022q29o01l113M542n174r061l843P59k23L366N282M881K12j766
$$ -745 3253 7275 6446 5845 2732 7274 2100 -6961 -10804 -10045 -10268 -6902 -1620 3261 3473 1707
16358A707l831l737N927L728MR59l303n217M40J831N350J709l861n137k671L033
$$ 1707 -2124 -5861 66 3794 3798 4757 1454 -3763 -3323 -1492 3858 5567 1706 -3431 -6102 -3069
16342c069q5m085J069J254k781q09J107J608L015k356l39J75o19J036J37K567
$$ -3069 -3154 -7239 -6170 -4916 -7697 -8506 -7399 -5791 -2776 -5132 -5471 -5296 -5915 -4879 -4742 -2175
16326b175j051j880m57l158m10K051l264j66N356J73P004N470n448r321o195n530
$$ -2175 -3226 -5106 -5563 -8721 -9131 -7080 -10344 -10510 -5154 -4981 2023 7493 2045 -7276 -13471 -19001
16310a9001M278R396M099k031j786M097L383k28k467q522l872M561r13O773K194
$$ -19001 -14723 -5327 -1228 -3259 -5045 -948 2435 2207 -260 -8782 -12654 -8093 -9006 -2233 -39
16295c9o886j728j383O62j380M781N794L706O225j646r182o737k304O725N005
$$ -39 -6925 -8653 -10036 -9374 -10754 -5973 -179 3527 9752 8106 -1076 -7813 -10117 -3392 1613
16280A613l028m794k961n906L896N427K360j619K406K566o94n301K299O421N726
$$ 1613 -1415 -6209 -9170 -15076 -11180 -5753 -3393 -5012 -2606 -40 -734 -6035 -3736 2685 8411
16265H411l16q163m197q04J795o33M049R9L677m317m020m39L889J434r01m88k054
$$ 8411 8095 -68 -4265 -5069 -3274 -3907 142 241 3918 -399 -4419 -4858 -969 465 -436 -924 -2978
16248b978J696k255L439J134r56N623N457o525j1507m647N940P0k715M942p216
$$ -2978 -1282 -3537 -98 1036 80 5703 11160 4635 -6872 -11519 -5579 -5509 -8224 -3282 -10498
16233a0498k651L906J299N053P286K375J864l730k695J494K271m966l060j872
$$ -10498 -13149 -9243 -7944 -2891 4395 6770 8634 4904 2209 3703 5974 1008 -2052 -3924
16219c924J967J121J288j621J382m086k612m84q74o464q93M446M306M988k89k730
$$ -3924 -1957 -836 452 -1169 213 -3873 -6485 -6969 -7843 -14307 -15200 -10754 -6448 -1460 -1749 -4479
16203d479o31N236K840j421M6j179l235k588J117j097o92M132L244l210L532N920
$$ -4479 -5110 126 2966 1545 1591 412 -2823 -5411 -4294 -5391 -6083 -1951 1293 -1917 1615 7535
16187G535o714K69l448l60j908J754l047J654p955J829M805l89m07L834l348l105
$$ 7535 821 1090 -2358 -2718 -4626 -2872 -5919 -4265 -12220 -10391 -5586 -5975 -6382 -2548 -5896 -9001
16171i001J1025J0352n978l987l192j0097k245J0872L881l750M592L260m545l695
$$ -9001 2024 12376 6398 2411 -781 -10878 -13123 -2251 1630 -2120 2472 5732 1187 -2508
16157b508J698m046k852j087N66O51L141k666k269O61Q770N609n24m459L583N184
$$ -2508 -810 -4856 -7708 -8795 -8229 -7578 -4437 -7103 -9372 -8711 59 5668 5144 685 4268 9452
16141I452m903r409K592K267q77m397R4P05J296q41l378L769O595l23p061k385
$$ 9452 4549 -4860 -2268 -1 -878 -5275 -5181 -4476 -3180 -4021 -7399 -3630 2965 2642 -4419 -6804
16125f804m166q019N10J969M387Q687L287J373n675l90Q7O04l16K096J067L039
$$ -6804 -10970 -18989 -18479 -16510 -12123 -3436 -149 1224 -4451 -4841 -4754 -4150 -4466 -2370 -1303 1736
16109A736K953M2k759l078J150j998m426j272P8K623P008O96K506P27J44K206
$$ 1736 4689 4731 1972 -1106 44 -1954 -6380 -7652 -7574 -4951 2057 2753 5259 5986 6130 8336
16093H336k393k46m924l707J106l707o94j291k535j721J421k13P455n428o15K440
$$ 8336 5943 5697 773 -2934 -1828 -5535 -6229 -7520 -10055 -11776 -10355 -10568 -3113 -8541 -9156 -6716
16077f716K884M994J474M709k001p020k360j921L554l68P516L255j264o17l111
$$ -6716 -3832 1162 2636 7345 5344 -1676 -4036 -5957 -2403 -2771 4745 8000 6736 6119 3008
16062C008k267j871K520n489l047o00k987j81q80Q719L689R68M949l420l007k12
$$ 3008 741 -1130 1390 -4099 -7146 -7746 -10733 -10914 -11794 -3075 614 1582 6531 3111 104 -108
16046a08N81k970K821K111n395l594L942J082L372j439j1164L529O677j634L123
$$ -108 473 -2497 324 2435 -2960 -6554 -2612 -1530 1842 403 -10761 -7232 -555 -2189 934
16031I34j987P16L521J480l992q666P98O19K385j020k933L838P46q094l61N762
$$ 934 -1053 -337 3184 4664 672 -7994 -7196 -6577 -4192 -5212 -8145 -4307 -3561 -11655 -12016 -6254
16015f254M512O988J007l399o812k574O007L705K592j839m889m939q25M251K783
$$ -6254 -1742 5246 6253 2854 -3958 -6532 -525 3180 5772 3933 -956 -5895 -6720 -2469 314
16000C14j404K35J717n59N4J943m583J243l247n725n39m74L77P424m10j360Q26
$$ 314 -1090 -855 862 303 357 2300 -2283 -1040 -4287 -10012 -10551 -11025 -10648 -3224 -3634 -4994 -4168
15983d168M523P996j307j204q10k620J05l936j924N913N075n926p627J126o14
$$ -4168 355 8351 7044 5840 5030 2410 2515 -1421 -3345 2568 7643 1717 -5910 -4784 -5398
15968e398l341o2r03N740L894j598J987j965N148n50K601L763p17j629k922l461
$$ -5398 -8739 -8801 -9704 -3964 -70 -1668 319 -1646 3502 2952 5553 9316 8599 6970 4048 587
15952E87k54J80K649j392K594k373n026J779j653M25J663P647N91o955j944L837
$$ 587 333 513 3162 1770 4364 1991 -3035 -1256 -2909 -2484 -821 6826 7417 462 -1482 2355
15936B355O28n944k037l217P841J928Q52j969m716r23J04nj541L046J4453R889
$$ 2355 2983 -2961 -4998 -8215 -374 1554 2406 437 -4279 -5202 -5098 -5103 -6644 -3598 10855 20744
15920B0744q438r010j124p899m982J1208J901k994l684k271O568L529l430K364
$$ 20744 12306 3296 2172 -5727 -10709 499 2400 -594 -4278 -6549 19 3548 118 2482
15906B482m472L290L992j838j809M242M395k239j837q584M36P831M375K34k420
$$ 2482 -1990 1300 5292 3454 1645 5887 10282 8043 6206 -2378 -1942 5889 10264 10498 8078
15891H078o953j862J469m518O467P555L199o070r966o191N840O008k244o30P155
$$ 8078 1125 -737 732 -3786 2681 10236 13435 7365 -2601 -8792 -2952 3056 812 182 7337
15876G337k281o241p23K578O133N113k756q789J177p161L58K682k368K341j269
$$ 7337 5056 -1185 -1908 670 6803 11916 9160 371 1548 -5613 -5255 -2573 -4941 -2600 -3869
15861c869L61K901M390j413M036l494q278j581R572m160j89N311k721j182k512
$$ -3869 -3508 -607 3783 2370 6406 2912 -5366 -6947 2625 -1535 -1724 3587 866 -316 -2828
15846b828l5K951M849j534L622p72o888J333j919l732q124k725J0383M974L532
$$ -2828 -2863 88 4937 3403 7025 6253 -635 698 -1221 -4953 -13077 -15802 -5419 -445 3087
15831C087j697o114N20q33m177K488J941J0508J482L023r57m704m334k001J654
$$ 3087 1390 -4724 -4204 -5037 -9214 -6726 -4785 5723 7205 10228 9271 4567 233 -1768 -114
15816a14O043l56k115o33K667L086n518n959j889L084J0505M188l332n161m186
$$ -114 5929 5573 3458 2825 5492 8578 3060 -2899 -4788 -1704 8801 12989 9657 4496 310
15801C10k19j412K387L878K270N108j274n424j41N984N164o855k13k887Q67o11
$$ 310 91 -1321 1066 4944 7214 12322 11048 5624 5483 11467 16631 9776 9563 6676 7543 6932
15785F932k027J697k324J292l097j094n14p68K195J527p219k562Q670l12n01j239
$$ 6932 4905 6602 4278 5570 2473 1379 865 97 2292 3819 -3400 -5962 2708 2396 1895 656
15769F56L907M50L045j403j118l355M151R39K627k841j2550r65M620N407n61Q24
$$ 656 4563 5013 8058 6655 5537 2182 6333 7272 9899 7058 -5492 -6457 -1837 3570 3009 3833
15753C833L283k621j350J129l73k440j068p589j541O965l443p690j834P369K062
$$ 3833 7116 4495 3145 4274 3901 1461 393 -7196 -8737 -1772 -5215 -12905 -14739 -7370 -5308
15738e308k119K105M837J262k375j304O153q08J207P566j061N343J591l535m60
$$ -5308 -7427 -5322 -485 777 -1598 -2902 3251 2443 3650 11216 10155 15498 17089 13554 13094
15723A3094L908l189o910p785r925l582M713P197n05l069m758L465K315m57M55
$$ 13094 17002 13813 6903 -882 -10807 -14389 -9676 -2479 -2984 -6053 -10811 -7346 -5031 -5488 -5033
15708e033O907j874q624M705J4233j140l371j924l549k94J109k373j742M677q12
$$ -5033 1874 0 -8624 -3919 10314 9174 5803 3879 330 36 1145 -1228 -2970 1707 895
15693H95l188J095K455J243j357m683j438R35L500j432l079N794n04l130j386
$$ 895 -2293 -1198 1257 2500 1143 -3540 -4978 -4043 -543 -1975 -5054 740 236 -2894 -4280
15678d280O230J072J653j042n81k564N802J987q951l498M019K084N04M62J294
$$ -4280 1950 3022 4675 3633 3052 488 6290 8277 -674 -4172 -153 1931 2435 2897 4191
15663D191N96R55jk731k373k988j887J308L077l65j941M283K340k791P70J129
$$ 4191 4787 5742 5741 3010 637 -2351 -4238 -2930 147 -218 -2159 2124 4464 1673 2443 3572
15647C572m439k443J339L487l557l424L681K209R68O02p60J779j336J201k176
$$ 3572 -867 -3310 -1971 1516 -2041 -5465 -1784 425 1393 1995 1235 3014 1678 2879 703
15632G03n604J120K558L781j988p26K454K453M49L190l982j140K627n199K02M004
$$ 703 -4901 -3781 -1223 2558 570 -156 2298 4751 5200 8390 4408 3268 5895 696 898 4902
15616D902K448O768M755q28n258o484k777Q173K148o485n508j241L346L370l36
$$ 4902 7350 14118 18873 18045 12787 6303 3526 11699 13847 7362 1854 613 3959 7329 6993
15601F993l261K960j0277m620J062Q908L017r42K757l124k989K248L905M232M422
$$ 6993 3732 6692 -3585 -8205 -7143 1765 4782 3840 6597 3473 484 2732 6637 10869 15291
15586A5291p944J737O367j388m657j0334j48N601K677M019l962q332K866M575
$$ 15291 7347 9084 15451 14063 9406 -928 -1076 4525 7202 11221 7259 -1073 1793 6368
15572F368L714L329P41N91p129j322K201j452q280m7Q27J374j302M31K035J26
$$ 6368 10082 13411 14152 14743 7614 6292 8493 7041 -1239 -1286 -459 915 -387 44 2079 2205
15556B205j1286k745O575R249J806k494j253J942J42M200J504o554m044M293M197
$$ 2205 -9081 -11826 -5251 3998 5804 3310 2057 3999 4141 8341 9845 3291 -753 3540 7737
15541G737J219m056K529J0904l310r189K75m779j773K070J074O189J392J931l884
$$ 7737 8956 4900 7429 18333 15023 5834 6109 1330 -443 1627 2701 8890 10282 12213 8329
15526H329R29P68k056j867m558n68N449M175o891k95L708J76p5K039k305o324
$$ 8329 9258 10026 7970 6103 1545 977 6426 10601 3710 3415 7123 7299 7224 9263 6958 634
15510F34l793J532l252q60K27K833L381Q44l362j328L195L969l199j35M811L77
$$ 634 -3159 -1627 -4879 -5739 -5512 -2679 702 1546 -1816 -3144 51 4020 821 686 5497 5874
15494E874K994l22n205k579M05O194N019l408o026p783K877L558Q16J184P38J006
$$ 5874 8868 8546 3341 762 1167 7361 12380 8972 2946 -4837 -1960 1598 2414 3598 4336 5342
15478E342M025j401j132k72K281L434J0258q58r879p02n901o359l845J4409N238
$$ 5342 9367 7966 6834 6562 8843 12277 22535 21677 11798 11096 5195 -1164 -5009 9400 14638
15463A4638o903p168K192N318O829m301m442L067k893p144J939M574j180L167
$$ 14638 7735 567 2759 8077 14906 10605 6163 9230 6337 -807 1132 5706 4526 7693
15449G693m081l919k053K355K575L992J793j382m913m089L449L149P18l490j136
$$ 7693 3612 -307 -2360 -5 2570 6562 8355 6973 2060 -2029 1420 4569 5287 1797 661
15434F61J232K21J31j486j2915j039N963K490J649N282l851n789N073J1527L213
$$ 661 1893 2114 2245 759 -12156 -13195 -7232 -4742 -3093 2189 -1662 -7451 -2378 9149 12362
15419A2362j830o473L243j049m092K837L297r81n587j730M933J687p562k226Q26
$$ 12362 10532 4059 7302 6253 2161 4998 8295 7314 1727 -3 4930 6617 -945 -3171 -2345
15404b345O50J984j52j927k009N309L828O64J166r52l043L057j129M96M153L477
$$ -2345 -1695 289 137 -1790 -3799 1510 5338 6002 7168 6216 3173 6230 5101 5597 9750 13227
15388A3227n358N86k959l421j158j045l750N25L693Q961O034k670L460k572n659
$$ 13227 7869 8455 5496 2075 917 -128 -3878 -3353 340 9301 15335 12665 16125 13553 7894
15373G894p275n5J831K922l703M770L818l181L684O18l231n585j895J843J870
$$ 7894 619 564 2395 5317 1614 6384 10202 7021 10705 11323 8092 2507 612 2455 4325
15358D325O65j09M235j520n608j172N735Q80K115J230l862M448p17j087L265k466
$$ 4325 4990 4881 9116 7596 1988 816 6551 7431 9546 10776 6914 11362 10645 9558 12823 10357
15342A0357m865l875L284n92o544K105P06k648l127k465M734j41j776M0k895l259
$$ 10357 5492 1617 4901 4309 -2235 -130 576 -2072 -5199 -7664 -2930 -3071 -4847 -4807 -7702 -10961
15326a0961K796O284M558n367l170K564O06K351M86n467o090n98M870O293M255
$$ -10961 -8165 -1881 2677 -2690 -5860 -3296 -2690 -339 147 -5320 -11410 -12008 -7138 -845 3410
15311C410k405L769n424k217l438n5Q90K95L166N786j586l350K784K393K173n34
$$ 3410 1005 4774 -650 -2867 -6305 -6360 -5470 -5175 -2009 3777 2191 -1159 1625 4018 6191 5657
15295E657k715j038N57j996O023K994k041j910j0351Q28k692m841n714J169R041
$$ 5657 2942 1904 2461 465 6488 9482 7441 5531 -4820 -3992 -6684 -11525 -17239 -16070 -7029
15280g029M568m799q62j50k858M19K561J698L925M118o88j062j145P66J294M173
$$ -7029 -2461 -7260 -8122 -8272 -11130 -10711 -8150 -6452 -2527 1591 903 -159 -1304 -538 756 4929
15264D929o879l87K217R077K671O30p822p387k495m74J727J558n024M323R486
$$ 4929 -1950 -2337 -120 8957 11628 12258 4436 -2951 -5446 -5920 -4193 -2635 -7659 -3336 6150
15249F150M317N28J18k227j13r062J97J816L411R73K825k387l297OL539K529K1
$$ 6150 10467 10995 11113 8886 8773 -289 -92 1724 5135 6108 8933 6546 3249 3255 6794 9323 9344
15232I344L577O476j111j577l11m296o99J412j553q780o638M722Q007N1j585m10
$$ 9344 12921 19397 18286 16709 16398 12102 11403 12815 11262 2482 -4156 566 8573 8624 7039 6629
15216F629R49p120m737L262Q2M072N67m735j554Q01M84O274Q06l03N66o696j0432
$$ 6629 7578 458 -4279 -1017 -935 3137 3704 -1031 -2585 -1784 -1300 4974 5780 5477 6043 -653 -11085
15199a1085p9O761K86J732O7K302l05N159M427k026l607n234P149O232o012k827
$$ -11085 -11164 -4403 -4117 -2385 -2318 -16 -321 4838 9265 7239 3632 -1602 5547 11779 5767 2940
15183B940j906O13O553J196j0058J296M379K296N375l119o569M058K438j133J436
$$ 2940 1034 1647 8200 9396 -662 634 5013 7309 12684 9565 2996 7054 9492 8359 9795
15168I795m601j370r3K745M97q328L304L242k49k28L91o318L101K861L8R86M806
$$ 9795 5194 3824 3731 6476 6973 -1355 1949 5191 4942 4714 5105 -1213 1888 4749 4787 5773 10579
15151A0579k424l599K763k608O82k027J172O982L246j618l415J617J165J88M741
$$ 10579 8155 4556 7319 4711 5393 3366 4538 11520 14766 13148 9733 11350 12515 12703 17444
15136A7444j834l142p451k084k571R407J552o298j626j747P49P144j848k605L570
$$ 17444 15610 12468 5017 2933 362 9769 11321 5023 3397 1650 2399 9543 7695 5090 8660
15121H660j903Q29j797K105L890l633J225O955n580K40k08m808k210N089R11j957
$$ 8660 6757 7586 5789 7894 11784 8151 9376 16331 10751 10991 10783 5975 3765 8854 9765 7808
15105G808J896J15k831m55j729J63k19j50J932K742K891R0q709l303N364K900
$$ 7808 9704 9819 6988 6533 4804 4967 4748 4598 6530 9272 12163 12253 3544 241 5605 8505
15089H505p14r442l333P70O64K676J424L172L612p663l377L101P23P297O078n026
$$ 8505 7791 -1651 -4984 -4214 -3550 -874 550 3722 7334 -329 -3706 -605 118 7415 13493 8467
15073H467j47Q68j20J784k532l528L71j405o26n770j0120M223O555K784j549J21
$$ 8467 8320 9188 9068 10852 8320 4792 5163 3758 3132 -2638 -12758 -8535 -1980 804 -745 -624
15057f24K099k54J304M24K185Q407M383l483r869L171L430M73l619j106K390m620
$$ -624 1475 1221 2525 2949 5134 13541 17924 14441 4572 7743 11173 11646 8027 6921 9311 4691
15041D691k522l92j653p25J482K847J503n53j039n918L389O025M9N711J822l175
$$ 4691 2169 1777 124 -601 881 3728 5231 4678 3639 -2279 1110 7135 7184 12895 14717 11542
15025A1542L862O39N112j968l576j854J073L63j357p105m390m335M871M767q814
$$ 11542 15404 16043 21155 19187 15611 13757 14830 15193 13836 6731 2341 -1994 2877 7644 -1170
15010a170q383O257J2859K537K397l533l540o912O96N721P284l080o542q03L157
$$ -1170 -9553 -3296 9563 12100 14497 10964 7424 512 1208 6929 14213 11133 4591 3788 6945
14995F945l09r303k175K320O238m219k074L421N236M88L042j154R88L430j365
$$ 6945 6636 -2667 -4842 -2522 3716 -503 -2577 844 6080 6568 9610 8456 9444 12874 11509
14980A1509q729L51M568n244N504K239O6m288k56K22k71m403k724M986J787j537
$$ 11509 2780 3131 7699 2455 7959 10198 10264 5976 5720 5942 5671 1268 -1456 3530 5317 3780
14964C780K29p067l465N452P697P22m940K111o8j491m624k444J520N008K286K04
$$ 3780 4009 -3058 -6523 -1071 6626 7348 2408 4519 4451 2960 -1664 -4108 -2588 2420 4706 4910
14948D910R139K651j0575n050k992l189J159j427P110N62O32M961j988o76j804
$$ 4910 14049 16700 6125 1075 -1917 -5106 -3947 -5374 1736 2298 2930 7891 5903 5227 3423
14933C423Q159K571j382m76m191K842m402q45l100n120K334N893j878l351P157
$$ 3423 11582 14153 12771 12295 8104 10946 6544 5699 2599 -2521 -187 5706 3828 477 7634
14918G634K357k074l414j1525J364R612P168l548o84q744L75Q61J545O345M28
$$ 7634 9991 7917 4503 -7022 -5658 3954 11122 7574 6890 -1854 -1479 -618 927 7272 7700
14903G700M91k521Q151J527l788R30j215J09n329k595J249L385L349K380J142
$$ 7700 8191 5670 13821 15348 11560 12490 11275 11384 6055 3460 4709 8094 11443 13823 14965
14888A4965o12j552k630L88n28n09K92j222m470J284J811J1591L009j1000k238
$$ 14965 14353 12801 10171 10559 10031 9522 9814 8592 4122 5406 7217 18808 21817 10817 8579
14873H579k05M259K703N08n995o764m727M553N336M396l770k338J475J161j743
$$ 8579 8374 12633 15336 15844 9849 3085 -1642 2911 8247 12643 8873 6535 8010 9171 7428
14858G428k043j714j770l283m029M491l72m415j817Q191L919o51p312j238L767
$$ 7428 5385 3671 1901 -1382 -5411 -920 -1292 -5707 -7524 667 4586 3935 -3377 -4615 -848
14843h48O116L217n02k536j558p47J447Q856M678J289j547k050m278n931k698
$$ -848 5268 8485 7983 5447 3889 3142 4589 13445 18123 19412 17865 15815 11537 5606 2908
14828B908N43R38K343j03l293L906M651L094o057l879l391K037P532K382k545
$$ 2908 3451 4389 6732 6629 3336 7242 11893 14987 8930 5051 1660 3697 11229 13611 11066
14813A1066J03K483j729j440l309p170n36Q107Q464K769L11n576j396l28n49n496
$$ 11066 11169 13652 11923 10483 7174 4 -532 7575 16039 18808 19119 13543 12147 11819 11270 5774
14797E774m701j127J796N95k137L101P721j387q51l29m390l533R02O123J234k733
$$ 5774 1073 -54 1742 2337 200 3301 11022 9635 8784 8455 4065 532 1434 7557 8791 6058
14781F058k077N92k133Q17n583k552J394R890K479M631k302o145q245j962L877
$$ 6058 3981 4573 2440 3257 -2326 -4878 -3484 6406 8885 13516 11214 5069 -3176 -5138 -1261
14766a261L483q19P125L561M549n096p419q062M763Q569k40P64j047J892N873
$$ -1261 2222 1403 8528 12089 16638 11542 4123 -3939 824 9393 9153 9917 8870 10762 16635
14751A6635R20l525M36j464m713q19J663k94k626r64j071Q79O131j878l734M9
$$ 16635 17555 14030 14466 13002 8289 7470 9133 8839 6213 5249 4178 5057 11188 9310 5576 5625
14735E625J0799M871p956q891k002l98j530K809l076n386k089N463K376n70j40
$$ 5625 16424 21295 13339 4448 2446 2048 518 3327 251 -5135 -7224 -1761 615 45 -95
14720i5K043N68k456R051k510L082K601N109K510l926m357L593NL662N743q435
$$ -95 1948 2516 60 9111 6601 9683 12284 17393 19903 15977 11620 15213 15218 18880 24623 16188
14704A6188n818j281l048M12O196j791L721j198K042M512j453j275r009r723p443
$$ 16188 10370 9089 6041 6453 12649 10858 14579 13381 15423 19935 18482 17207 8198 -1525 -8968
14689h968L584O766N71M402M410Q459K307q498j952K048K046k524l25K184O808
$$ -8968 -5384 1382 1953 6355 10765 19224 21531 13033 11081 13129 15175 12651 12326 14510 21318
14674B1318l12r187p466j779Q096K070o17o33l890m808J085O30q25Q469l886k618
$$ 21318 21006 11819 4353 2574 10670 12740 12123 11490 7600 2792 3877 4507 3682 12151 8265 5647
14658E647k88l795O285L300M9L403j239m292l427N070J736N073K851n611j535
$$ 5647 5359 1564 7849 11149 11198 14601 13362 9070 5643 10713 12449 17522 20373 14762 13227
14643A3227M184R73k057o44k023J183P59k441r1j050j616q622L585J1443K918
$$ 13227 17411 18384 16327 15683 13660 14843 15602 13161 13070 12020 10404 1782 5367 16810 19728
14628A9728Jq705L065k370p13m84K720J087q45l344o972L348Q134N722J792m726
$$ 19728 19729 11024 14089 11719 11006 10522 13242 14329 13484 10140 3168 6516 14650 20372 22164 17438
14612A7438j025o411M188L881N16J677K052o166j0863j322O632O865l342j207
$$ 17438 16413 10002 14190 18071 18587 20264 22316 16150 5287 3965 10597 17462 14120 12913
14598A2913K009n514k425P23j023K271M583P163n187m490o724l243k527l333O460
$$ 12913 14922 9408 6983 7706 6683 8954 13537 20700 15513 11023 4299 1056 -1471 -4804 1656
14583A656N961l031n675L996N742M401m305m392J974n833l095m337K333J2352
$$ 1656 7617 4586 -1089 2907 8649 13050 8745 4353 6327 494 -2601 -6938 -4605 7747
14569G747L073l31M877L399o269m49J0989j556q938k114J989k490L549j281q867
$$ 7747 10820 10489 15366 18765 12496 12047 23036 21480 12542 10428 12417 9927 13476 12195 3328
14554C328L886L866M653j264o504j3456q122N345L649j312M168M425J0571q79
$$ 3328 7214 11080 15733 14469 7965 -5491 -13613 -8268 -4619 -5931 -1763 2662 13233 12354
14540A2354n898l161M386M988L51m716m200k015j700J438k135K475N897k586l152
$$ 12354 6456 3295 7681 12669 13020 8304 4104 2089 389 1827 -308 2167 8064 5478 2326
14525B326K174N440o133m449O480M991j088m397j0380M79L584L122L549M677J086
$$ 2326 4500 9940 3807 -642 5838 10829 9741 5344 -5036 -4557 -973 2149 5698 10375 11461
14510A1461K548K723k897m025l709n234k870M824J0593Q33r70l986n83n462J084
$$ 11461 14009 16732 13835 9810 6101 867 -2003 2821 13414 14247 13277 9291 8708 3246 4330
14495D330J53K644K056o678m435L636L37L444j317M971N398K243j991k266p478
$$ 4330 4483 7127 9183 2505 -1930 1706 2043 5487 4170 9141 14539 16782 14791 12525 5047
14480E047o618M249K43l653N814O699R16k911k453k412m808K361M542J630j202
$$ 5047 -1571 2678 2921 -732 5082 11781 12697 9786 7333 4921 113 2474 7016 8646 7444
14465G444O08j652L458J406M985j502M137q63l866l999k251k564l003j854N179
$$ 7444 8052 6400 9858 11264 16249 14747 18884 18021 14155 10156 7905 5341 2338 484 5663
14450E663N599k906J533l300J84j676j80J086K767j26P360J195L084M840r345
$$ 5663 11262 8356 9889 6589 6773 5097 4917 6003 8770 8644 16004 17199 20283 25123 15778
14435A5778n695K411Q790J13k465J968L95l568K619o07n290m674J35j423J840
$$ 15778 10083 12494 21284 21397 18932 20900 21295 17727 20346 19739 14449 9775 9910 8487 10327
14420A0327P772M247l326n267o177L915L81R5k390n646M2N166O522L726m345k979
$$ 10327 18099 22346 19020 13753 7576 11491 11872 11967 9577 3931 3973 9139 15661 19387 15042 12063
14404A2063l415M90M082O44k313p688o418L83J0184J1971L340q137K300n37k678
$$ 12063 8648 9138 13220 13864 11551 3863 -2555 -2172 8012 19983 23323 15186 17486 16949 14271
14389A4271j765l464J414K515k716N781l270j814L392j249l523K879P65M294J746
$$ 14271 12506 9042 10456 12971 10255 16036 12766 10952 14344 13095 9572 12451 13216 17510 19256
14374A9256q498o962k824M695M090L361k96J325k567l489k372J450j352p3l658
$$ 19256 10758 3796 972 5667 9757 13118 12822 14147 11580 8091 5719 7169 5817 5744 2086
14359B086K668j258l120J78j125O748J773K247M292L462L95N935L900J593n142
$$ 2086 4754 3496 376 554 -571 6177 7950 10197 14489 17951 18346 24281 28181 29774 24632
14344B4632p970l111l472j0970L553M56m153P432O587M745l900J993J770j313
$$ 24632 16662 13551 10079 -891 2662 3118 -1035 6397 12984 17729 13829 15822 17592 16279
14330A6279r198n25J123L383m2N21j014J279L83l039l392k10j679P857J512J093
$$ 16279 7081 6556 7679 11062 11020 11541 10527 11806 12189 9150 5758 5548 3869 11726 13238 14331
14314A4331k376j779N546j587k177j895Q27N70p52K94L340n668m847m69K869Q407
$$ 14331 11955 10176 15722 14135 11958 10063 10890 11460 10708 11002 14342 8674 3827 3358 6227 14634
14298A4634J168L144m373o403K37R173j716q769Q259J675l335J003l952k031J698
$$ 14634 15802 18946 14573 8170 8407 17580 15864 7095 15354 17029 13694 14697 10745 8714 10412
14283A0412k222M595J204J806K563K844k351l494l302M536N922m095m037J457
$$ 10412 8190 12785 13989 15795 18358 21202 18851 15357 12055 16591 22513 18418 14381 15838
14269A5838k237L240K089P513q531j0104N678P412M281o816n495J656J4P685N511
$$ 15838 13601 16841 18930 26443 17912 7808 13486 20898 25179 18363 12868 14524 14538 22223 27734
14254B7734J574k672p121k035l162l764n214J825M751j910r95P352k90K857k849
$$ 27734 29308 26636 19515 17480 14318 10554 5340 7165 11916 10006 9011 16363 16073 18930 16081
14239A6081K696j579r884m282O812O057k878k863m163j941K752n833J567K35Q495
$$ 16081 18777 17198 7314 3032 9844 15901 13023 10160 5997 4056 6808 975 2542 2777 11272
14224A1272N867J339J755m621k589n467p7J668P370K426K133K517l58q238M109
$$ 11272 17139 18478 20233 15612 13023 7556 7479 9147 16517 18943 21076 23593 23235 14997 19106
14209A9106m555n410O967O774K322p249J716l204p168k025o624p340K883P151
$$ 19106 14551 9141 16108 22882 25204 17955 19671 16467 9299 7274 650 -6690 -3807 3344
14195C344N097q238o851M042Q234P400P135m302N180J029M428J177k818l605n448
$$ 3344 8441 203 -6648 -2606 5628 13028 20163 15861 21041 22070 26498 27675 24857 21252 15804
14180A5804j570K134j542K879M224j494k17m827l190K951P912J343n158o817k697
$$ 15804 14234 16368 14826 17705 21929 20435 20218 15391 12201 15152 23064 24407 19249 12432 9735
14165I735M113j391k308m439K202O199K36K606L230m072j813J679j940p90L443
$$ 9735 13848 12457 10149 5710 7912 14111 14347 16953 20183 16111 14298 15977 14037 13247 16690
14150A6690j725n155L487K770J098k316m007K638l83k287m381p01M082L383L808
$$ 16690 14965 9810 13297 16067 17165 14849 10842 13480 13097 10810 6429 5728 9810 13193 17001
14135A7001N977j426p766j717k291J103J492L843l415k623L458k409k53L304M133
$$ 17001 22978 21552 13786 12069 9778 10881 12373 16216 12801 10178 13636 11227 10974 14278 18411
14120A8411O919QR90j636r239m087K025N146J871l586n854l650L951m20k915M011
$$ 18411 25330 25338 26328 24692 15453 11366 13391 18537 20408 16822 10968 7318 11269 10849 7934 11945
14104A1945K760J202k960o311J0181Km594m622j763M880j860l189M069L617N441
$$ 11945 14705 15907 12947 6636 16817 16819 12225 7603 5840 10720 8860 5671 9740 13357 18798
14089A8798J596M058K9m692n391l366K36O672j973K125m153o42O148j152j052
$$ 18798 20394 24452 24481 19789 14398 11032 11268 17940 15967 18092 13939 13297 19445 18293 17241
14074A7241j682n390k095O614N525O68l436j565l413K721J460l803j770Q946O819
$$ 17241 15559 10169 8074 14688 20213 20881 17445 15880 12467 15188 16648 12845 11075 20021 26840
14059B6840k193q745j876k80O608K0k177K872N302k991k387k742J034K90l913
$$ 26840 24647 15902 14026 13746 20354 20374 18197 21069 26371 23380 20993 18251 19285 19575 15662
14044A5662j0814k732M470N033L5k264J813L536K63O123l202j63O84k067M426
$$ 15662 4848 2116 6586 11619 11654 9390 11203 14739 15002 21125 17923 17760 18444 16377 20803
14029B0803M35n03j168o231m534Q649L028j755k195k674k598K114Q81K139J524
$$ 20803 21238 20735 19567 13336 8802 17451 20479 18724 16529 13855 11257 13371 14252 16391 17915
14014A7915M140J1158J876n068j498m216j959n271r478q59Q9j40Q045K575m189
$$ 17915 22055 33213 35089 30021 28523 24307 22348 17077 7599 6740 6829 6689 14734 17309 13120
13999A3120p7O32J920L226j62j114l715o548J147M617K740j18Q22M133K759m148
$$ 13120 13043 13675 15595 18821 18659 17545 13830 7282 8429 13046 15786 15668 16490 20623 23382 19234
13983A9234M236k961l131J862M852j1572j1569K907M509N537L064l7q63k228k10
$$ 19234 23470 20509 17378 19240 24092 12520 951 3858 8367 13904 16968 16931 16068 13840 13630
13968A3630K88K316O139k678o343n606K599N32K09q46M858M833L490l161m293
$$ 13630 13918 16234 22373 19695 13352 7746 10345 10877 11086 10240 15098 19931 23421 20260 15967
13953A5967k846l124Q39m387m236Q960J4142r04q634L041M583N164n833q432K902
$$ 15967 13121 9997 10836 6449 2213 11173 25315 24411 15777 18818 23401 28565 22732 14300 17202
13938A7202k646Q545N248q062o97j16j9o61k843j9L619j340l034M552l298J467
$$ 17202 14556 23101 28349 20287 19590 19474 19455 18794 15951 15932 19551 18211 15177 19729 16431 17898
13922A7898k50k899K309N141J943j807o540o713M904K171L465k360j13J443m851
$$ 17898 17648 14749 17058 22199 24142 22335 15795 9082 13986 16157 19622 17262 17149 18592 13741
13907A3741q75l590K030P136P257J658j380m392N67o400o467n15N945O495k165
$$ 13741 12866 9276 11306 18442 25699 27357 25977 21585 22152 15752 9285 8770 14715 21210 19045
13892A9045l887k805j0029K445J0715P961L015j42M398K517O44n516m955J139
$$ 19045 15158 12353 2324 4769 15484 23445 26460 26318 30716 33233 33877 28361 23406 24545
13878B4545m727j1860k049L575N243L807p79R78M79J670N982O600J080j951k027
$$ 24545 19818 7958 5909 9484 14727 18534 17755 18733 19212 20882 26864 33464 34544 32593 30566
13863C0566J036K779n741o920l797m07l835J968J0833P075q543j672l73K710Q907
$$ 30566 31602 34381 28640 21720 17923 17516 13681 15649 26482 33557 25014 23342 22969 25679 34586
13848C4586O17r7q0j211j105l673r425K770J546n959J983l618j582J0670Q412
$$ 34586 35203 35106 35026 33815 32710 29037 19612 22382 23928 17969 19952 16334 14752 25422 33834
13833C3834j025K614o678n182r4L616o22L886J700m630m375j039J0729J418j961
$$ 33834 32809 35423 28745 23563 23469 27085 26463 30349 32049 27419 23044 22005 32734 34152 32191
13818C2191j858j716j61j675q572J891l748k36K450J32J46k972J552R44o300M292
$$ 32191 30333 28617 28456 26781 18209 20100 16352 16116 18566 18698 18844 15872 17424 18368 12068 16360
13802A6360P698k102M203K03l073L847m36n192j0511M778O475O873n156m611J854
$$ 16360 24058 21956 26159 26362 23289 27136 26700 21508 10997 15775 22250 29123 23967 19356 21210
13787B1210L302P10L157q978J543k336k462K294j350P930N132m93o515m377M858
$$ 21210 24512 25222 28379 19401 20944 18608 16146 18440 17090 25020 30152 29659 23144 18767 23625
13772B3625K022p011k136M024K591J469Q731M593P18l677p415l902k107l595n7
$$ 23625 25647 18636 16500 20524 23115 24584 33315 37908 38626 34949 27534 23632 21525 17930 17873
13757A7873J587K212N024m477m507O231O597l109j544k815o297R02j700N222K795
$$ 17873 19460 21672 26696 22219 17712 23943 30540 27431 25887 23072 16775 17677 15977 21199 23994
13742B3994p213j633P133M677N999j99o697M90L590K131k698L630L341J584m332
$$ 23994 16781 15148 22281 26958 32957 32758 26061 26551 30141 32272 29574 33204 36545 38129 33797
13727C3797o419P14J1161n9n132j860j149m047k455O939p89J464n2q766m321K376
$$ 33797 27378 28092 39253 39194 34062 32202 31053 27006 24551 31490 30701 32165 32113 23347 19026 21402
13711B1402N164P541m142j906J061P0L03k32K747K17m218r77k766n044O607O689
$$ 21402 26566 34107 29965 28059 29120 29190 29493 29261 32008 32225 28007 27030 24264 19220 25827 32516
13695C2516K671K525m775l605J958J713k643j418l241p134K646O137O26l630O636
$$ 32516 35187 37712 32937 29332 31290 33003 30360 28942 25701 18567 21213 27350 27976 24346 30982
13680C0982J119L36n45k400j861k796m298P41M427r86N895L596j232M026J03p158
$$ 30982 32101 32437 31892 29492 27631 24835 20537 21278 25705 24719 30614 34210 32978 37004 37107 29949
13664B9949m928N077R273J38q626k684k939O85K322R20J365M549K240J714k388
$$ 29949 25021 30098 39371 39509 30883 28199 25260 25945 28267 29187 30552 35101 37341 39055 36667
13649C6667r862m089N543K943J104K543l597K685K185o613L013J50m438M430J809
$$ 36667 26805 22716 28259 31202 32306 34849 31252 33937 36122 29509 32522 32672 28234 32664 34473
13634C4473q379o091O327N996O339K775n089N925N719m230j85K871n136j2529
$$ 34473 26094 20003 26330 32326 38665 41440 36351 42276 47995 43765 43580 46451 41315 28786
13620B8786k072K345L93r60l422M602J0491n170j0996o219J832k638L045M348
$$ 28786 26714 29059 29452 28492 25070 29672 40163 34993 23997 17778 19610 16972 20017 24365
13606B4365l926o323K909N533K118J265m637M894L355L671l41k760r43N919L078
$$ 24365 20439 14116 17025 22558 24676 25941 21304 26198 29553 33224 32883 30123 29180 35099 38177
13591C8177o214o200M168N464l088n309R035L141K00J70j86j584m667q52n34K949
$$ 38177 31963 25763 29931 35395 32307 26998 36033 39174 39374 39544 39358 37774 33107 32255 31721 34670
13575C4670Q412q80p809j232n706R47L790J065n32N401K478m54M179J295m906
$$ 34670 43082 42202 34393 33161 27455 28402 32192 33257 32725 38126 40604 40150 44329 45624 40718
13560D0718L093l760K449N341l441n318L754p51n282k727q701r124K922J509k682
$$ 40718 43811 40051 42500 47841 44400 39082 42836 42085 36803 34076 25375 16251 19173 20682 18000
13545A8000q31L181N566j926l638L170j62K516K470n33J134M635j250j069P623
$$ 18000 17169 20350 25916 23990 20352 23522 23360 25876 28346 27813 28947 33582 32332 31263 38886
13530C8886N233k148m186Q51o0N046O21n0r314r05J382m704r07J41Q197J3180
$$ 38886 44119 41971 37785 38636 38576 43622 44243 44193 34879 33974 35356 30652 29745 29886 38083 51263
13514E1263R00p868o236k986k243m45N19q267m252j944j66R908N614J369K932
$$ 51263 52163 44295 38059 35073 32830 32385 32904 24637 20385 18441 18275 28183 33797 35166 38098
13499C8098l7o23j235P20J398m505m27k638L210O042r71P85k204j447L33k973
$$ 38098 38061 37438 36203 36923 38321 33816 33389 30751 33961 40003 39032 39817 37613 36166 36499 33526
13483C3526q9J410j847j427O959P558J017j625n991j836J478R26o49j058j133
$$ 33526 33437 34847 33000 31573 38532 46090 47107 45482 39491 37655 39133 40059 39410 38352 37219
13468C7219k09M235l656p808M795L538k684M059L702m100M98p06K367J0034J930
$$ 37219 37010 41245 37589 29781 34576 38114 35430 39489 43191 39091 39589 38883 41250 51284 53214
13453E3214J279j540O56P542j622q228K693k299n465m205l855P500M08K834O432
$$ 53214 54493 52953 53609 61151 59529 51301 53994 51695 46230 42025 38170 45670 46078 48912 55344
13438E5344q23L936O615k116n937m905j695l048m038k995O222Q920J450l631j993
$$ 55344 54521 58457 65072 62956 57019 52114 50419 47371 43333 40338 46560 55480 56930 53299 51306
13423E1306o385n822J91M235N019R727M213j539r82l567J716O856M428m777R80
$$ 51306 44921 39099 39290 43525 48544 58271 62484 60945 59963 56396 58112 64968 69396 64619 65599
13408F5599Q747l397j0731q815q006Q331Q090N593R495N774j0564o551l424J595
$$ 65599 74346 70949 60218 51403 43397 51728 59818 65411 74906 80680 70116 63565 60141 61736
13394F1736q5l271M008K386R72O832J311N61J06j341R106J212l279j451J195Q782
$$ 61736 61651 58380 62388 64774 65746 72578 73889 74450 74556 73215 82321 83533 80254 78803 79998 88780
13378H8780M103P206L484k084Q398R191J7222K0341J5787J7709K3537K8810J9050
$$ 88780 92883 100089 103573 101489 109887 119078 136300 156641 172428 190137 213674 242484 261534
13365B61534K9513L7341M2774N3916P8570J01928J38945J86076K28673K85575
$$ 261534 291047 328388 371162 425078 503648 605576 744521 930597 1159270 1444845
13355A444845L36992L94537K52698l29456p06964n59569l00994j65960r7328o5434
$$ 1444845 1781837 2176374 2429072 2099616 1392652 833083 532089 366129 268801 203367
13345B03367m8314l5075k3687j2051m805L551m537p443o045k704n652l844j1042
$$ 203367 155053 119978 96291 84240 79435 82986 78449 71006 64961 62257 56605 52761 41719
13332D1719M605K659Q819J1612m323j3278j0393p570n471J135J979J531k401M35
$$ 41719 46324 48983 57802 69414 65091 51813 41420 33850 28379 29514 31493 33024 30623 31058
13318C1058Q21J925J0658N381L748l473j47J422K125j257n358n40J781j750J804
$$ 31058 31879 33804 44462 49843 53591 50118 49971 51393 53518 52261 46903 46363 48144 46394 48198
13303D8198L997k53o377j2162J057j00q19K640J1106O641L118J094L438j930N94
$$ 48198 52195 51942 45565 33403 34460 34360 33541 36181 47287 53928 57046 58140 61578 59648 60242
13288F0242K28l3J01L338l053k176k836K939M0o674l298k986M23j50J759M048
$$ 60242 60470 60437 60538 63876 60823 58647 55811 58750 58790 52116 48818 45832 46255 46105 47864 51912
13272E1912N472K721M042Q932j679j174M819m621n76N442L199l809p003O413L396
$$ 51912 57384 60105 64147 73079 71400 70226 75045 70424 69848 75290 78489 74680 67677 74090 77486
13257G7486N25N044j230l978o352K94J802m302r050J306j181j639l267P86K028
$$ 77486 78011 83055 81825 77847 71495 71789 73591 69289 60239 61545 60364 58725 55458 56244 58272
13242E8272M63l5o890k698Q431O545j465j0852J424L499M420L184j622J860K280
$$ 58272 58735 58700 51810 49112 57543 64088 62623 51771 53195 56694 61114 64298 62676 64536 66816
13227F6816J52J798L444P077j416p893M0q2J108m409K301l248n687NK283N364
$$ 66816 66968 68766 72210 79287 77871 69978 70018 69936 71044 66635 68936 65688 60001 60006 62289 67653
13211F7653N160R238J1196R529N736O348J9708J6291J1673Q278J8123K7619Q012
$$ 67653 72813 82051 93247 102776 108512 114860 134568 150859 162532 170810 188933 216552 224564
13198B24564n5015n4105R754J5531N300o994j7644q913j4111j2565k342K04k989
$$ 224564 169549 115444 125198 140729 146029 139035 121391 112478 98367 85802 83460 83664 80675
13185H0675o9J113O454K026o96n26m465K86O102O418J0572k21j004n96m727O558
$$ 80675 80606 81719 88173 90199 89503 88977 84512 84798 90900 97318 107890 107669 106665 106069 101342 107900
13169A07900l04m619J372j82L645P016O872N726m857j571N166N294J6036K5384
$$ 107900 107596 102977 104349 104167 107812 114828 121700 127426 122569 120998 126164 131458 147494 172878
13155A72878K6476K0077O465m710q790L544N619k490j802O890J0061l906o572
$$ 172878 199354 219431 225896 221186 212396 215940 221559 219069 217267 224157 234218 230312 223740
13142B23740n899j0447m591J968K787L08j0754j5228k4915k1199o467k866j3000
$$ 223740 217841 207394 202803 204771 207558 207866 197112 181884 156969 135770 129303 126437 113437
13129A13437r030J380L555J847M361N778j250R198j747r312n100n872l10k24n844
$$ 113437 104407 105787 109342 111189 115550 121328 120078 129276 127529 118217 113117 107245 106935 106711 100867
13114A00867n514K051J0233J1363J0395R135L970N794j0572j2444l233k301k391
$$ 100867 95353 97404 107637 119000 129395 138530 142500 148294 137722 125278 122045 119744 117353
13101A17353J762k439j2852m532k568j0235m893N702J1754k092p456j3024o878
$$ 117353 119115 116676 103824 99292 96724 86489 81596 87298 99052 96960 89504 76480 69602
13088F9602j866j396n841p338L854R689J3604K1564K3667P537J2048N495q074
$$ 69602 67736 66340 60499 53161 57015 66704 80308 101872 125539 133076 145124 150619 142545
13075A42545j0448R690K0995L2053K7787M032j1273k1412k5558n105j2451j0266
$$ 142545 132097 141787 162782 194835 222622 226654 215381 193969 168411 163306 150855 140589
13063A40589P812M57L231J2883J3962N193N675P92l382J634j090j787p296k806
$$ 140589 148401 148858 152089 164972 178934 184127 189802 190594 187212 188846 187756 185969 178673 175867
13049A75867K079J5495K2707O826P071m751q579j4645k4696k1497L964J0790M991
$$ 175867 177946 193441 216148 222974 230045 225294 216715 202070 177374 155877 159841 170631 175622
13036A75622k055m383J0629K1787J9592P687K749N03r758j156L7548L1632r72
$$ 175622 173567 169184 179813 201600 221192 228879 231628 232131 222373 221217 258765 290397 289425
13023B89425j1333J4002J02468J56569R4492K8877k8529o5683p2814j10662r6474
$$ 289425 278092 292094 394562 551131 645623 674500 645971 580288 507474 396812 300338
13012C00338l2546O193J1608J4821P254k762K041Q924M374P758K74j966M506J1278
$$ 300338 267792 273985 285593 300414 307668 304906 306947 315871 320245 328003 328277 326311 330817 342095
12998C42095J4n52N339J0166J0360K221l994J012M687j103O80P276J4027K0744
$$ 342095 342109 341557 346896 357062 367422 369643 365649 366661 371348 370245 370925 378201 392228 412972
12984D12972J4700N780J3915K8235L6809K6320J4913J6231J2890N320j13P981
$$ 412972 427672 433452 447367 475602 512411 538731 553644 569875 582765 588085 587972 595953
12972E95953R141Q033J2827N690N912J2663J0663n347j5932j6983k971O29n495
$$ 595953 605094 613127 625954 631644 637556 650219 660882 655535 639603 622620 619649 620278 614783
12959F14783Q576M5442N7486M8565L0411K7249J8977Q704J6893K9048L6464K1448
$$ 614783 623359 668801 726287 774852 805263 832512 851489 860193 877086 906134 942598 964046
12947I64046J6843K6897K8619K8410K8734K2369M1569N9467O1258N9403O0964
$$ 964046 980889 1007786 1036405 1064815 1093549 1115918 1157487 1216954 1278212 1337615 1398579
12936A398579P3573O7786N7752K9529L4888M6792O9696J08302J48408J41989J29173
$$ 1398579 1472152 1539938 1597690 1627219 1662107 1708899 1778595 1886897 2035305 2177294 2306467
12925B306467J30737J51609J79371K03587K43668K60021K78431L35768L98312
$$ 2306467 2437204 2588813 2768184 2971771 3215439 3475460 3753891 4089659 4487971
12916D487971M74911N44036O47552P70073R07112J110573J361521J653536K048908
$$ 4487971 4962882 5506918 6154470 6924543 7831655 8942228 10303749 11957285 14006193
12907A4006193K524591L148443L865087M471089M974690N567269O161232O889832
$$ 14006193 16530784 19679227 23544314 28015403 32990093 38557362 44718594 51608426
12899E1608426Q673804J1863087J6904439K3949082L1622635L9476580M8787585
$$ 51608426 60282230 72145317 89049756 112998838 144621473 184098053 232885638
12892B32885638N6868227O8762654O2808116k0604897j17088578j15517513o6948869
$$ 232885638 289753865 358516519 421324635 400719738 283631160 168113647 101164778
12885A01164778l4968136j9494913j1752483p670015n365152l912604k780764
$$ 101164778 66196642 46701729 34949246 27279231 21914079 18001475 15220711
12878A5220711j787630j408430j705224j753687j385264j018055p77512n76211
$$ 15220711 13433081 12024651 10319427 8565740 7180476 6162421 5384909 4808698
12870D808698m01380l11903k75961k60204k60562k06675j89924j94591j47640
$$ 4808698 4407318 4095415 3819454 3559250 3298688 3092013 2902089 2707498 2559858
12861B559858j02871j12136j10063p9526k7322L809L9559N7109L8843L3400R0348
$$ 2559858 2456987 2344851 2234788 2155262 2127940 2131749 2171308 2228417 2267260 2300660 2391008
12850B391008J87290K39062K82646P4051n26513p60950n14702k53073j36537j07557
$$ 2391008 2578298 2817360 3100006 3174057 2647544 1886594 1371892 1118819 982282 874725
12840H74725p9640n6010l4030l0059m2124m2844m7774n0296l3621l2158j6472
$$ 874725 795085 739075 705045 674986 632862 590018 542244 491948 458327 426169 409697
12829D09697l936o967j7238k6858j0480K227m147K363J2058N510k3671n1428m3683
$$ 409697 405761 398794 381556 354698 344218 346445 342298 344661 356719 362229 338558 287130 243447
12816B43447k1851k7641l6780k0908o632J1781J063j8816j9225j4701j3460K7
$$ 243447 221596 193955 157175 136267 129635 141416 142479 123663 104438 89737 76277 76304
12804G6304j615O096J2046J1423J5090J2382J6398Q377q516n399L632L093j960
$$ 76304 74689 80785 92831 104254 119344 131726 148124 156501 147985 142586 146218 149311 147351
12791A47351o651j0404j6417j1533L06Q344K73P627J3533J612K446J0134O801
$$ 147351 140700 130296 113879 102346 102652 110996 111269 118896 132429 134041 136487 146621 153422
12778A53422l46o12L706l054o312O714R693m785p326m785J517l840m5037j00017
$$ 153422 153076 152464 156170 153116 146804 153518 163211 158426 151100 146315 147832 143992 98955 -1062
12764a062q7511l0685J2924L5631M6877O8586J15295O9808J4039l0342k7367j2621
$$ -1062 -88573 -119258 -106334 -70703 -23826 44760 160055 229863 243902 213560 186193 173572
12752A73572o369j3520j6209j1881j8826j9594O868Q188r99j5898j2440o512j7485
$$ 173572 167203 153683 137474 125593 106767 87173 94041 102229 101230 85332 72892 66380 48895
12739D8895k5101l1922j7290K0020K1043N145R267r554l047P389L994p698O74
$$ 48895 23794 -8128 -25418 -5398 15645 20790 30057 20503 17456 24845 28839 21141 21815
12726B1815j242N36P80k574J325L298m231p73O533K203L124p250j9729k2038j1999
$$ 21815 20573 21109 21889 19315 20640 23938 19707 18934 25467 27670 30794 23544 3815 -18223 -30222
12711c0222j0401p425J177J0889K6435K9751J3425M008q001j7679R754K2462J6196
$$ -30222 -40623 -48048 -46871 -35982 -9547 20204 33629 37637 29636 11957 21711 44173 60369
12698F0369K2394J9772l678n086q782j2922j6823j0723p107o781q057j311k037
$$ 60369 82763 102535 98857 93771 84989 72067 55244 44521 37414 30633 22576 21265 19228
12685A9228M031N351m653j0914p130o027j6586m819N686K619l754l94k261n713
$$ 19228 23259 28610 23957 13043 5913 -114 -16700 -21519 -15833 -13214 -16968 -17362 -19623 -25336
12671b5336N64O050J5048J8923J0254n288q689o695p517r64m251j2984m987o340
$$ -25336 -24772 -18722 -3674 15249 25503 20215 11526 4831 -2686 -3650 -7901 -20885 -25872 -32212
12657c2212J626J2794J2312Q681L643Q06K349n629j0429l968N146N088m119o251
$$ -32212 -30586 -17792 -5480 3201 6844 7650 9999 4370 -6059 -10027 -4881 207 -3912 -10163
12643a0163j440L64J626l339q397l485L221M43L990j8k938L362K761Q940j306
$$ -10163 -11603 -11239 -9613 -12952 -21349 -24834 -21613 -21170 -17180 -17198 -20136 -16774 -14013 -5073 -6379
12628f379q378l182m033R04L784L402O078J889m360p753j136p615m023m43K480
$$ -6379 -14757 -17939 -21972 -21068 -17284 -13882 -7804 -5915 -10275 -18028 -19164 -26779 -30802 -31245 -28765
12613b8765K038K193M782J327m390Q0n64J613n777m256Q736R185J375r33K227
$$ -28765 -26727 -24534 -19752 -18425 -22815 -22735 -23299 -21686 -27463 -31719 -22983 -13798 -12423 -13356 -11129
12598a1129j671L78N60R45k31r884j3305j1519j3382j2393j4161j3061j2285j0778
$$ -11129 -12800 -12422 -11862 -10917 -11148 -21032 -34337 -45856 -59238 -71631 -85792 -98853 -111138 -121916
12584a21916K0406K0662J7711l1893n6055j621M2104L7733K1725J1810O291oQ796
$$ -121916 -101510 -80848 -63137 -95030 -151085 -152706 -110602 -72869 -51144 -39334 -33043 -33049 -24253
12571b4253J2345P262L103q391n643m964O28M513j88n664r55k348r13J188O47
$$ -24253 -11908 -4646 -1543 -9934 -15577 -20541 -19913 -15400 -15588 -21252 -22207 -24555 -25468 -24280 -23633
12556b3633l563n272Q294O446N098M85J289K488L338K64o400k620N716j251o048
$$ -23633 -27196 -32468 -24174 -17728 -12630 -12145 -10856 -8368 -5030 -4766 -11166 -13786 -8070 -9321 -15369
12541a5369L705L070k686j845m431M933K387L728L217m084o790r712o164N279
$$ -15369 -11664 -8594 -11280 -13125 -17556 -12623 -10236 -6508 -3291 -7375 -14165 -23877 -30041 -24762
12527b4762L155n771n054j316P55J254m217J636l71L471k523J985K394L393j380
$$ -24762 -21607 -27378 -32432 -33748 -32993 -31739 -35956 -34320 -34691 -31220 -33743 -31758 -29364 -25971 -27351
12512b7351L741J372K250J677k525Q357P52L272Q168K923n39O89j0200L782N778
$$ -27351 -23610 -22238 -19988 -18311 -20836 -12479 -11727 -8455 -287 2636 2097 2786 -7414 -3632 2146
12497B146M057k845r213k38L630N39j873l027k390m502L978J3204J3504k019r457
$$ 2146 6203 3358 -5855 -6093 -2463 -1924 -3797 -6824 -9214 -13716 -9738 3466 16970 14951 5494
12482E494k445N061o404l218m939K036N22p442J208N511l430n294R40J430J2484
$$ 5494 3049 8110 1706 -1512 -6451 -4415 -3893 -11335 -10127 -4616 -8046 -13340 -12400 -10970 1514
12467A514J3204J577l611N019O28L246L370m778J533l821m148k089M243r25o625
$$ 1514 14718 16295 12684 17703 18331 21577 24947 20169 21702 17881 13733 11644 15887 14962 8337
12452H337n947J531L468R937J6257L624o65q58j10K673N611Q750Q495Q282P62
$$ 8337 2390 3921 7389 17326 33583 37207 36542 35684 35574 38247 43858 52608 61103 69385 70147
12437G0147J2299P503N605P876J3097J0612R621J6861L0475L3626M6204P7335
$$ 70147 82446 89949 95554 103430 116527 127139 136760 153621 184096 217722 263926 341261
12425C41261J23080J71333K07835K55619L03644L63880L86002K8694n66985o52732
$$ 341261 464341 635674 843509 1099128 1402772 1766652 2152654 2181348 1614363 961631
12415I61631m02054k15871j19442o7168l9064l3882j9611j1829j2266j818k927
$$ 961631 559577 343706 224264 157096 118032 84150 64539 52710 40444 38626 35699
12404C5699j0958j0078o739p354p038o774q985qJ0203M407q66m88q985j704K913
$$ 35699 24741 14663 7924 570 -6468 -13242 -22227 -22235 -12032 -7625 -8491 -8979 -17964 -19668 -16755
12389a6755L38N677n59n582J589j723K577n498l134K308Q210K649j61Q343n98
$$ -16755 -16417 -10740 -11299 -16881 -15292 -17015 -14438 -19936 -23070 -20762 -12552 -9903 -10064 -1721 -2319
12374b319k197p230o941l499o74n951L638N819M569L407J79n616k909J568O97
$$ -2319 -4516 -11746 -18687 -22186 -22860 -28811 -25173 -19354 -14785 -11378 -11199 -16815 -19724 -18156 -17459
12359a7459j114O326O807j049o583o45k35l705J798M27j544l512j409k816l89
$$ -17459 -18573 -12247 -5440 -6489 -13072 -13717 -13952 -17657 -15859 -15432 -16976 -20488 -21897 -24713 -25102
12344b5102L452N978m579n177j254j117j417p72J896M349J1642o80j123J421M990
$$ -25102 -21650 -15672 -20251 -25428 -26682 -27799 -29216 -29988 -28092 -23743 -12101 -12781 -13904 -12483 -7493
12329g493n069j0260j961J339M318L693l520k125j719Q724K025N477q948o072
$$ -7493 -12562 -22822 -24783 -23444 -19126 -15433 -18953 -21078 -22797 -14073 -12048 -6571 -15519 -21591
12315b1591M521N375n950M000l309K81k907r37n350L945P084j522J321L882j709
$$ -21591 -17070 -11695 -17645 -13645 -16954 -16673 -19580 -20517 -25867 -21922 -14838 -16360 -15039 -11157 -12866
12300a2866J303M581o553q068j256j602M95P197K18M295k392q435q433L51P962
$$ -12866 -11563 -6982 -13535 -21603 -22859 -24461 -23966 -16769 -16551 -12256 -14648 -23083 -31516 -31165 -23203
12285b3203Q322J470K867j75k410Q06K207k080l100k860l774n6k614P090M391
$$ -23203 -14881 -13411 -10544 -10719 -13129 -12323 -10116 -12196 -15296 -18156 -21930 -21986 -24600 -17510 -13119
12270a3119m543n248P503P370r34l977l928L544J482L002j596k497l242M563M278
$$ -13119 -17662 -22910 -15407 -8037 -8971 -12948 -16876 -13332 -11850 -8848 -10444 -12941 -16183 -11620 -7342
12255g342l226n562p105l909M881J1849O520k742p493o293Q25P31k787K299P894
$$ -7342 -10568 -16130 -23235 -27144 -22263 -10414 -3894 -6636 -14129 -20422 -19597 -18866 -21653 -19354 -11460
12240a1460K672p83J192n40n497q447L375L281L020m979L185O509N908m496p132
$$ -11460 -8788 -9571 -8379 -8919 -14416 -22863 -19488 -16207 -13187 -18166 -14981 -8472 -2564 -7060 -14192
12225a4192k223K078l417j187l950n935M773Q739k146k492L40l016N563m321k092
$$ -14192 -16415 -14337 -17754 -18941 -22891 -28826 -24053 -15314 -17460 -19952 -19612 -22628 -17065 -21386 -23478
12210b3478K538O930k744k673k188lN169Q018M363m198o006J339j29l981O69j135
$$ -23478 -20940 -14010 -16754 -19427 -21615 -21618 -16449 -8431 -4068 -8266 -14272 -12933 -13062 -17043 -16374 -17509
12194a7509m027p473M1P688L457m386L370M250m919N226L071L82l508K011J52
$$ -17509 -21536 -29009 -28968 -21280 -17823 -22209 -18839 -14589 -19508 -14282 -11211 -10829 -14337 -12326 -12174
12179a2174j469K446k284r73M335m13l22q47j171J623k328n220j572K385R403
$$ -12174 -13643 -11197 -13481 -14454 -10119 -10532 -10854 -11701 -12872 -11249 -13577 -18797 -20369 -17984 -8581
12164h581K014k554J058O69k837J642j578l145R07M089K576M20l149l332K40k496
$$ -8581 -6567 -9121 -8063 -7394 -10231 -8589 -10167 -13312 -12405 -8316 -5740 -5320 -8469 -11801 -11561 -14057
12148a4057J748j425P0L80m668m755O388O715l001Q21J575L487P421J089n785
$$ -14057 -12309 -13734 -13664 -13284 -17952 -22707 -16319 -9604 -12605 -11784 -10209 -6722 699 1788 -3997
12133c997o856k19L444K465N201l398l517m336k746J060R760k528r737K078Q418
$$ -3997 -10853 -11072 -7628 -5163 38 -3360 -6877 -11213 -13959 -12899 -3139 -5667 -15404 -13326 -4908
12118d908N04J40m323m445K380P682k880j670o634L72m541J131J3862O088n915
$$ -4908 -4404 -4264 -8587 -13032 -10652 -2970 -5850 -7520 -14154 -13782 -18323 -17192 -3330 2758 -3157
12103c157j199j424k288k208j988J413J235L220n33r117l932l305J0071R465K000
$$ -3157 -4356 -5780 -8068 -10276 -12264 -10851 -9616 -6396 -6929 -16046 -19978 -23283 -13212 -3747 -1747
12088a747q13Q03Qn853J447P013m012m175l395j382l30l137j036J087l611n811
$$ -1747 -2560 -1757 -1749 -7602 -6155 858 -3154 -7329 -10724 -12106 -12436 -15573 -16609 -15522 -19133 -24944
12072b4944K872Q704L119m419j807N033L541j982L8o792l988J115k14q856N629
$$ -24944 -22072 -13368 -10249 -14668 -16475 -11442 -7901 -9883 -9845 -16637 -20625 -19510 -19724 -28580 -22951
12057b2951R562l287o307L179J347m150J021L637k138J936N410N061o943n554
$$ -22951 -13389 -16676 -22983 -19804 -18457 -22607 -21586 -17949 -20087 -18151 -12741 -7680 -14623 -20177
12043b0177q40n80M947M345L869k488j588L91l155n663K652J733j341K375J642
$$ -20177 -21017 -21597 -16650 -12305 -8436 -10924 -12512 -12121 -15276 -20939 -18287 -16554 -17895 -15520 -13878
12028a3878k967k913q54N884L986l134m580J495M700J801m636q255q976o121M100
$$ -13878 -16845 -19758 -20612 -14728 -10742 -13876 -18456 -16961 -12261 -10460 -15096 -23351 -32327 -38448 -34348
12013c4348O689J2001L541K650R26P58n646m623J337m214M863M760L886n195l075
$$ -34348 -27659 -15658 -12117 -9467 -8541 -7783 -13429 -18052 -16715 -20929 -16066 -11306 -7420 -12615 -15690
11998a5690L56L966J124N863p601j3565k591j450M097K336n21L722K227J047j655
$$ -15690 -15334 -11368 -10244 -4381 -11982 -25547 -28138 -29588 -25491 -23155 -23676 -19954 -17727 -16680 -18335
11983a8335J231j285N623N082P94J228L059K054J78p102K621l375p102j795M468
$$ -18335 -17104 -18389 -12766 -7684 -6890 -5662 -2603 -549 -371 -7473 -4852 -8227 -15329 -17124 -12656
11968a2656n52m037q535K030J0451J979l43p05N854K834m087n623m853o583M214
$$ -12656 -13208 -17245 -25780 -23750 -13299 -11320 -11663 -12368 -6514 -3680 -7767 -13390 -18243 -24826 -20612
11953b0612K190N14L189Q98K176m416l584m117P232L552J315l090n48M179o10
$$ -20612 -18422 -17908 -14719 -13821 -11645 -16061 -19645 -23762 -16530 -12978 -11663 -14753 -15301 -11122 -11732
11938a1732l316l13l234M319K969q92n605J097N332k018N269K919m591l845j408
$$ -11732 -15048 -15361 -18595 -14276 -11307 -12199 -17804 -16707 -11375 -13393 -8124 -5205 -9796 -13641 -15049
11923a5049L775r78n67j866J209k704M963Q27j313q05N228J051K889k292Q69P639
$$ -15049 -11274 -12252 -12819 -14685 -13476 -16180 -11217 -10390 -11703 -12508 -7280 -6229 -3340 -5632 -4763 2876
11907B876q3m932j521o272j824n124o578K660R030M348j818Q064J41m739n592
$$ 2876 2793 -2139 -3660 -9932 -11756 -16880 -23458 -20798 -11768 -7420 -9238 -1174 -1033 -5772 -11364
11892a1364m654J25M578m474J217J557k656M72K54L633M656J525l455K850Q61
$$ -11364 -16018 -15893 -11315 -15789 -14572 -13015 -15671 -15199 -14945 -11312 -6656 -5131 -8586 -5736 -4875
11877d875J23j310n373o99M483J085n713o115k595j676O653L143L406N250m592
$$ -4875 -4752 -6062 -11435 -12134 -7651 -6566 -12279 -18394 -20989 -22665 -16012 -12869 -9463 -4213 -8805
11862h805j0335n871j229P55N671M193j356J849L308Q63j462J277j465J256m050
$$ -8805 -19140 -25011 -26240 -25485 -19814 -15621 -16977 -15128 -11820 -10957 -12419 -11142 -12607 -11351 -15401
11847a5401k736j909L587m622l810k428J611M359M804k148O443J642K069j727
$$ -15401 -18137 -20046 -16459 -21081 -24891 -27319 -25708 -21349 -16545 -18693 -12250 -10608 -8539 -10266
11833a0266k661J473r40j354L281L241O98k684j016l118L805J088j418k197m755
$$ -10266 -12927 -11454 -12394 -13748 -10467 -7226 -6528 -9212 -10228 -13346 -9541 -8453 -9871 -12068 -16823
11818a6823O994O823L905n065q13o216q178m182l334M988M580j177R688R108j589
$$ -16823 -9829 -3006 899 -4166 -4979 -11195 -19373 -23555 -26889 -21901 -17321 -18498 -8810 298 -1291
11803a291o617q41L334m76p213K939O352K583m347k983N511K386j236l043R65
$$ -1291 -7908 -8749 -5415 -5891 -13104 -10165 -3813 -1230 -5577 -8560 -3049 -663 -1899 -4942 -3977
11788c977O15j834l094l133j651J374J692R01j424M142J340j131k268M083Q55
$$ -3977 -3362 -5196 -8290 -11423 -13074 -11700 -10008 -9107 -10531 -6389 -5049 -6180 -8448 -4365 -3510
11773c510q783j868Q07L7M789m25o4r01m642P107O305L432o525q464k574m558
$$ -3510 -12293 -14161 -13354 -13317 -8528 -8953 -9017 -9918 -14560 -7453 -1148 2284 -4241 -12705 -15279 -19837
11757a9837k72R65m816N88N251O875K530k138n592m526N241K077j147j716r10
$$ -19837 -20109 -19144 -23960 -23372 -18121 -11246 -8716 -10854 -16446 -20972 -15731 -13654 -14801 -16517 -17427
11742a7427Q323M879j2891M068O406j092o36l717j681k214K641O596M451O58j722
$$ -17427 -9104 -4225 -17116 -13048 -6642 -7734 -8370 -12087 -13768 -15982 -13341 -6745 -2294 -1636 -3358
11727c358K88J853J00K832N540J585J08m013r84l410m227L817k86M7j128l25k175
$$ -3358 -3070 -1217 -1117 1715 7255 8840 8948 4935 3951 541 -3686 131 -155 -108 -1236 -1561 -3736
11710c736m182P821k116p322m183M558O35J309m454N130p063l606J076o19J665
$$ -3736 -7918 -97 -2213 -9535 -13718 -9160 -8525 -7216 -11670 -6540 -13603 -17209 -16133 -16752 -15087
11695a5087N596n765j2525j721R480J803O30M170M984l241k311L881J831o31j50
$$ -15087 -9491 -15256 -27781 -29502 -20022 -18219 -17589 -13419 -8435 -11676 -13987 -10106 -8275 -8906 -9056
11680i056K756K747n859K156l892j187k343K334M630M101K86l709k808j870K618
$$ -9056 -6300 -3553 -9412 -7256 -11148 -12335 -14678 -12344 -7714 -3613 -3327 -7036 -9844 -11714 -9096
11665i096N136l15J156k679m111n365Q81l559k363j469K33M703k785l866J437
$$ -9096 -3960 -4275 -3119 -5798 -9909 -15274 -14393 -17952 -20315 -21784 -21551 -16848 -19633 -23499 -22062
11650b2062M074M725K256L472l99j628M215j240m043N7j760Q10k161o58O62m121
$$ -22062 -17988 -13263 -11007 -7535 -7934 -9562 -5347 -6587 -10630 -10573 -12333 -11523 -13684 -14342 -13680 -17801
11634a7801Q84q17J245l079k433N666M041M25O482J105n359J38j992n391J816
$$ -17801 -16917 -17734 -16489 -19568 -22001 -16335 -12294 -11869 -5387 -4282 -9641 -9503 -11495 -16886 -15070
11619a5070O711L699j058M314n248m025Q659N127K603l54m742p820J645L638L142
$$ -15070 -8359 -4660 -5718 -1404 -6652 -10677 -2018 3109 5712 5358 616 -7204 -5559 -1921 1221
11604A221M771L092m95k485J053O115O765J3252J2259P393J2386P482P249O325
$$ 1221 5992 9084 8589 6104 7157 13272 20037 33289 45548 52941 65327 72809 80058 86383
11590H6383o814k0806k2468j0441r474o973p799L050L600k593o260R38j454l095
$$ 86383 79569 58763 36295 25854 16380 9407 1608 4658 8258 5665 -595 343 -1111 -4206
11576d206m703l313L643M368k146m979n734J285L353J2503O368o214o882j388
$$ -4206 -8909 -12222 -8579 -4211 -6357 -11336 -17070 -15785 -12432 71 6439 225 -6657 -8045
11562h045N755K967L276J314m996m675k071K805L246m94P78j095p498j124K47
$$ -8045 -2290 677 3953 5267 271 -4404 -6475 -3670 -424 -918 -140 -1235 -8733 -9857 -9610
11547i610m595j128P99j922k919M585K050L349M790J273k648M227M484N082J5
$$ -9610 -14205 -15333 -14534 -16456 -19375 -14790 -12740 -9391 -4601 -3328 -5976 -1749 2735 7817 7832
11532G832n693j523M966J188l284m776q20r18o715Q763N373k029N105L018n356
$$ 7832 2139 616 5582 6770 3486 -1290 -2110 -3028 -9743 -980 4393 2364 7469 10487 5131
11517E131o204j084l85l829k471o749K612O732m955r68O243N17J275J326J16k126
$$ 5131 -1073 -2157 -2542 -6371 -8842 -15591 -12979 -6247 -11202 -12170 -5927 -5410 -4135 -2809 -2693 -4819
11501d819j083l521K24O10j705P02K016o505R35M011m446N645J379K836N67r352
$$ -4819 -5902 -9423 -9199 -8589 -10294 -9592 -7576 -14081 -13146 -9135 -13581 -7936 -6557 -3721 -3154 -12506
11485a2506q080p765L589M724k765L254M913K984j729J691j175P824N513O577
$$ -12506 -20586 -28351 -24762 -20038 -22803 -19549 -14636 -11652 -13381 -11690 -12865 -5041 472 7049
11471G049j948l930j0701L795M153n101q714n32Q990L288J070k927k065Q870P020
$$ 7049 5101 1171 -9530 -5735 -1582 -6683 -15397 -15929 -6939 -3651 -2581 -5508 -7573 1297 8317
11456H317Q838M143K909j795K92j684Q708J1559K780J2666J2861J4569J2624l254
$$ 8317 17155 21298 24207 22412 22704 21020 29728 41287 44067 56733 69594 84163 96787 93533
11442I3533j7287j6721k4935j2028l947L21l905k585m145o870l469l835n966K386
$$ 93533 76246 59525 34590 22562 18615 18936 15031 12446 8301 1431 -2038 -5873 -11839 -9453
11428i453r55j263n745J224P952N235P43m713R60l991m023N148L457K512l915
$$ -9453 -10408 -11671 -17416 -16192 -8240 -3005 -2262 -6975 -6015 -10006 -14029 -8881 -5424 -2912 -6827
11413f827l395M821m208K09k15k835q945o053L532N659R843Q615Q286K143p706
$$ -6827 -10222 -5401 -9609 -9400 -9615 -12450 -21395 -27448 -23916 -18257 -8414 201 8487 10630 2924
11398B924k671P218l881m004K436M20n905q206M11K534O3K165J60j213m948M250
$$ 2924 253 7471 3590 -414 2022 2442 -3463 -11669 -11258 -8724 -8661 -6496 -6336 -7549 -12497 -8247
11382h247L036j084m881K737P45R32j020m970j475Q329O10j855k437l911J284
$$ -8247 -5211 -6295 -11176 -8439 -7694 -6762 -7782 -12752 -14227 -5898 -5288 -7143 -9580 -13491 -12207
11367a2207M606L922m885J556J689K035J052J703M498o52k197k872m266o704k356
$$ -12207 -7601 -3679 -8564 -7008 -5319 -3284 -2232 -529 3969 3317 1120 -1752 -6018 -12722 -15078
11352a5078J929O441P655K16k537n707l211L170P49J028J441N604q424K310K318
$$ -15078 -13149 -6708 947 1163 -1374 -7081 -10292 -7122 -6373 -5345 -3904 1700 -6724 -4414 -2096
11337b096j585k550p972k791N632l06J810P627L800l34n716j115j79J949k387
$$ -2096 -3681 -6231 -14203 -16994 -11362 -11668 -9858 -2231 1569 1235 -4481 -5596 -5775 -3826 -6213
11322f213l54M012o916o412k746J231N126R767n335m072l059O55P490O105M401
$$ -6213 -6567 -2555 -9471 -15883 -18629 -17398 -12272 -2505 -7840 -11912 -14971 -14316 -6826 -721 3680
11307C680J317P87K82l815k577p343%k658L487J0124K098j604J834O398j802q493
$$ 3680 4997 5784 6066 2251 -326 -7669 -7669 -10327 -6840 3284 5382 3778 5612 12010 10208 1715
11291A715K61l809J0683J3447J3938L814J231m721k942k81j0429j6889r284k239
$$ 1715 1976 -1833 8850 22297 36235 40049 41280 36559 33617 33336 22907 6018 -3266 -5505
11277e505m717L77M772J304o037k544L681o058J613J848k726Q09M287l570J588
$$ -5505 -10222 -9845 -5073 -3769 -9806 -12350 -8669 -14727 -13114 -11266 -13992 -13183 -8896 -12466 -10878
11262a0878k265n703k47Q37J0405k842K960p73O001P37o470j324Q180K112k071
$$ -10878 -13143 -18846 -19093 -18256 -7851 -10693 -7733 -8506 -2505 -1768 -8238 -9562 -1382 730 -1341
11247a341q150J362N196Q37j24n023N64m438N43R529L498l866o574j266M356O439
$$ -1341 -9491 -8129 -2933 -2096 -2220 -7243 -6679 -11117 -10574 -1045 2453 -1413 -7987 -9253 -4897 1542
11231A542n60K272l088n869J164n486o750n909J146N216J496R24j091n720J1996
$$ 1542 982 3254 166 -5703 -4539 -10025 -16775 -22684 -21538 -16322 -14826 -13902 -14993 -20713 -8717
11216h717J016j403l769j687J340m26M931O580l013l823k848j0561j48R536Q547
$$ -8717 -7701 -9104 -12873 -14560 -13220 -13646 -8715 -2135 -5148 -8971 -11819 -22380 -22528 -12992 -4445
11201d445J549n104J67n48o58l05K154N205O29q147l784L444j058J199o04J004
$$ -4445 -2896 -8000 -7833 -8381 -9039 -9344 -7190 -1985 -1356 -9503 -13287 -9843 -10901 -9702 -10306 -9302
11185i302L638L582k061J433L3l90j436j43J136L017L863L487K342K209q334J898
$$ -9302 -5664 -2082 -4143 -2710 -2677 -3067 -4503 -4646 -3510 -493 3370 6857 9199 11408 3074 4972
11169D972L222L302L157N551M92N941N093L35j275n240m446m914l624k751j0425
$$ 4972 8194 11496 14653 20204 20696 26637 31730 32065 30790 25550 21104 16190 12566 9815 -610
11154f10M37Q118m147l826j343K530K082j649q337o511O186R929j470k227p195
$$ -610 -173 7945 3798 -28 -1371 1159 3241 1592 -6745 -13256 -7070 2859 1389 -838 -8033
11139h033j518Q85N62J360j715M965L5O070O309n530P72n961m842l331K042L987
$$ -8033 -9551 -8666 -8104 -6744 -8459 -3494 -3459 2611 8920 3390 4162 -1799 -6641 -9972 -7930 -3943
11123c943K747Q094q82j0734k914K410k305j684N82J037O89N189k108m408M86
$$ -3943 -1196 6898 6016 -4718 -7632 -5222 -7527 -9211 -8629 -7592 -6903 -1714 -3822 -8230 -7744
11108g744P902n91l017J0563K652o274r394m037R243j668j319R63o096N08M102
$$ -7744 158 -433 -3450 7113 9765 3491 -5903 -9940 -697 -2365 -3684 -2721 -8817 -8309 -4207
11093d207M955N687j830r194r085j408k956K750K411Q180j070n777k024N999M86
$$ -4207 748 6435 4605 -4589 -13674 -15082 -18038 -15288 -12877 -4697 -5767 -11544 -13568 -7569 -7083
11078g083o091n629K578P716K12r113N056j222j933n7O043O999K109l254k865
$$ -7083 -13174 -18803 -16225 -8509 -8297 -17410 -12354 -13576 -15509 -15566 -9523 -2524 -415 -3669 -6534
11063f534j617j046J0928M47m343n254j266j492l521L822M353J024J362l377j8
$$ -6534 -8151 -9197 1731 2178 -2165 -7419 -8685 -10177 -13698 -9876 -5523 -4499 -3137 -6514 -6532
11048f532j626m800L042M42K586m616o208K925L843J1421p657j739P23L798R535
$$ -6532 -8158 -12958 -9916 -9474 -6888 -11504 -17712 -14787 -10944 477 -7180 -8919 -8196 -4398 5137
11033E137L601p663J169L903N173p847L44j763l015r19l283k918j28J157n037
$$ 5137 8738 1075 2244 6147 11320 3473 3817 2054 -961 -1880 -5163 -8081 -8209 -7052 -12089
11018a2089n45J860N548m462j789M797m933j07j003K515N266j696m599j285J1103
$$ -12089 -12634 -10774 -5226 -9688 -11477 -6680 -11613 -11720 -12723 -10208 -4942 -6638 -11237 -12522 -1419
11003a419K69r661j34L117J109l205k167q47j335p517K237Q732L663l160m660
$$ -1419 -1150 -10811 -10945 -7828 -6719 -9924 -12091 -12938 -14273 -21790 -19553 -10821 -7158 -10318 -14978
10988a4978m563K873M077J226J855R316n422k621L198K558o810m095M457O747
$$ -14978 -19541 -16668 -12591 -11365 -9510 -194 -5616 -8237 -5039 -2481 -9291 -13386 -8929 -2182
10974b182p489j0445L092R242Q791l188J713m75o174J706j28r420l714J843N764
$$ -2182 -9671 -20116 -17024 -7782 1009 -2179 -466 -941 -7115 -5409 -5537 -14957 -18671 -16828 -11064
10959a1064K468K363N233p96p204j391L878k949J848j052l671N909L859L424m840
$$ -11064 -8596 -6233 -1000 -1796 -9000 -10391 -6513 -9462 -7614 -8666 -12337 -6428 -2569 855 -3985
10944c985p946k84K379M47L647O86j51L189l961n659N285M669j394l470O570k893
$$ -3985 -11931 -12215 -9836 -9389 -5742 -5056 -5207 -2018 -5979 -11638 -6353 -1684 -3078 -6548 22 -2871
10928b871n092J385K869R08k447k889J986N42j392O690O607o834n537P11k181
$$ -2871 -7963 -6578 -3709 -2801 -5248 -8137 -6151 -5609 -7001 -311 6296 -538 -6075 -5364 -7545
10913g545j905J944R3n787j471N295M579N61m32K397N665L611o858k270l300q35
$$ -7545 -9450 -7506 -7413 -13200 -14671 -9376 -4797 -4236 -4668 -2271 3394 7005 147 -2123 -5423 -6258
10897f258k176J602K578n51o659m565Q544J3897J426Q75n622j122k190j320k518
$$ -6258 -8434 -6832 -4254 -4805 -11464 -16029 -7485 6412 7838 8713 3091 1969 -221 -1541 -4059
10882d059K295L99M673r452j660O36J12M214J352j249L845j157n942l313p19q46
$$ -4059 -1764 -1365 3308 -6144 -7804 -7168 -7056 -2842 -1490 -2739 1106 -51 -5993 -9306 -10025 -10871
10866a0871p25o281j966J0393n74K990O719M462p535o697R16M143R89j287k09
$$ -10871 -11596 -17877 -19843 -9450 -10024 -7034 -315 4147 -3388 -10085 -9169 -5026 -4037 -5324 -5533
10851e533l82k44l747J69J836k186O586M520n060j563j31m488Q033J71N414Q46
$$ -5533 -5915 -6159 -9906 -9737 -7901 -10087 -3501 1019 -4041 -5604 -5735 -10223 -2190 -2019 3395 4241
10835D241m536j1307o26q8k653Q50K631Q20Q94r61M329p366O247R341K000q283
$$ 4241 -295 -11602 -12228 -12316 -14969 -14119 -11488 -10668 -9774 -10735 -6406 -13772 -7525 1816 3816 -4467
10819d467j0341J733m23K091M949M699L128n995K091P395k961q141J48M440O032
$$ -4467 -14808 -13075 -13498 -11407 -6458 -1759 1369 -4626 -2535 4860 1899 -6242 -6094 -1654 4378
10804D378p812k205O071Q667M355k321j1311r809N63M646j073j656M33L336K626
$$ 4378 -3434 -5639 432 9099 13454 11133 -178 -9987 -9424 -4778 -5851 -7507 -7074 -3738 -1112
10789a112O41J244m660l449m059k808K297N827r99j43l972n78L827L643p94p833
$$ -1112 -471 773 -3887 -7336 -11395 -14203 -11906 -6079 -7078 -7221 -11193 -11771 -7944 -4301 -5095 -12928
10773a2928l564K746M804Q326R293k865p356K421K941l309o432k920J192l386
$$ -12928 -16492 -13746 -8942 -616 8677 5812 -1544 877 3818 509 -5923 -8843 -7651 -11037
10759a1037m663N517l143k662L059K767Q680n83l52m108k707K714M885M383k684
$$ -11037 -15700 -10183 -13326 -15988 -12929 -10162 -1482 -2065 -2417 -6525 -9232 -6518 -1633 2750 66
10744F6n468L705L408l247P92N431K228k852l205m349l041k916L194l660j455
$$ 66 -5402 -1697 1711 -1536 -744 4687 6915 4063 858 -3491 -6532 -9448 -6254 -9914 -11369
10729a1369K972K674K73K11J072o223j2017M085Q069P258K628L459K065o41O633
$$ -11369 -8397 -5723 -5450 -5239 -4167 -10390 -22407 -18322 -10253 -2995 -367 3092 5157 4516 11149
10714A1149l204j318l426n182n185M923j808k302K151Q37O745M814l407o656l583
$$ 11149 7945 6627 3201 -1981 -7166 -2243 -4051 -6353 -4202 -3365 3380 8194 4787 -1869 -5452
10699e452m745j667o67j324M558O651q55N59q98N813L283o308k187k051J799R44
$$ -5452 -10197 -11864 -12531 -13855 -9297 -2646 -3501 -2942 -3840 1973 5256 -1052 -3239 -5290 -3491 -2547
10683b547j334J517m99k331j522o60l80k715K702N194O44l008K639l610n461L590
$$ -2547 -3881 -2364 -2863 -5194 -6716 -7376 -7756 -10471 -7769 -2575 -1931 -4939 -2300 -5910 -11371 -7781
10667g781J62L648O350J592n306o182o857k335L693O27J695o11J933M433j605
$$ -7781 -7619 -3971 2379 3971 -1335 -7517 -14374 -16709 -13016 -12389 -10694 -11305 -9372 -4939 -6544
10652f544l579o990K77M562m320P217N949j660m930J644O009K776n8J304m023
$$ -6544 -10123 -17113 -16836 -12274 -16594 -9377 -3428 -5088 -10018 -8374 -2365 411 353 1657 -2366
10637b366J245K2j840L983j212r3K574N62p519L305K505J003l671n062m38N474
$$ -2366 -1121 -1099 -2939 1044 -168 -261 2313 2875 -4644 -1339 1166 2169 -1502 -6564 -7002 -1528
10621a528P805l475o777j604J218O977N858l260j0261k552l935L263M082r41K145
$$ -1528 6277 2802 -3975 -5579 -4361 2616 8474 5214 -5047 -7599 -11534 -8271 -4189 -5130 -2985
10606b985K052K389l655l713k080j112M50L382J809k421M41N290M25k12l68N401
$$ -2985 -933 1456 -2199 -5912 -7992 -9104 -8654 -5272 -3463 -5884 -5443 -153 272 60 -308 5093
10590E093n325q708k753P844m011p107M0P335Q513J937n50k636R97k480o875M099
$$ 5093 -232 -8940 -11693 -3849 -7860 -14967 -14927 -7592 921 2858 2308 -328 669 -1811 -8686 -4587
10574d587K838J638k368k270L50L123l94M462K350n437l070m427M674M653l499
$$ -4587 -1749 -111 -2479 -4749 -4399 -1276 -1670 2792 5142 -295 -3365 -7792 -3118 1535 -1964
10559a964m277l459N270Q110M78P689l010o257m201N12M78o613n062r212L727
$$ -1964 -6241 -9700 -4430 3680 4158 11847 8837 2580 -1621 -1109 -631 -7244 -12306 -21518 -17791
10544a7791N555N965N705j191p388m534O444M797l244m807j637L113K613k526
$$ -17791 -12236 -6271 -566 -1757 -9145 -13679 -7235 -2438 -5682 -10489 -12126 -9013 -6400 -8926
10530h926n926k881j585L330L708N265o323r7N87l17Q388L620K844j219j331J2892
$$ -8926 -14852 -17733 -19318 -15988 -12280 -7015 -13338 -13435 -12848 -13165 -4777 -1157 1687 468 -863 12029
10514A2029L035j0176l312q10J962M103R00o194l306m602L925P914M105L725q408
$$ 12029 15064 4888 1576 766 2728 6831 7731 1537 -1769 -6371 -2446 5468 9573 13298 4890
10499D890p660j885j545o238L834O618O337o02q021l832l40r60J512r47n772j510
$$ 4890 -2770 -4655 -6200 -12438 -8604 -1986 4351 3749 -4272 -8104 -8444 -9404 -7892 -8839 -14611 -16121
10483a6121K874M716m845k58M239N886K177j183j250p158j367K869N908O632O161
$$ -16121 -13247 -8531 -13376 -13634 -9395 -3509 -1332 -2515 -3765 -10923 -12290 -9421 -3513 3119 9280
10468I280l276l844j326J110k910l257J545k07l010j412q00l317k488N053J269
$$ 9280 6004 2160 834 1944 -966 -4223 -2678 -2885 -5895 -7307 -8107 -11424 -13912 -8859 -7590
10453g590k010J904N33L328N29j0282O62Q062J0912J533o251o786Q0L223L505
$$ -7590 -9600 -7696 -7163 -3835 -3306 -13588 -12926 -4864 6048 7581 1330 -5456 -5376 -2153 1352
10438A352M741n301L35K318M143r52r073K76J888K808M618j0700n953L597L184
$$ 1352 6093 792 1127 3445 7588 6636 -2437 -2161 -273 2535 7153 -3547 -9500 -5903 -2719
10423b719l445l134l268j440O731m23J194m110N474R5j594J272k095j986R642
$$ -2719 -6164 -9298 -12566 -14006 -7275 -7698 -6504 -10614 -5140 -5045 -6639 -5367 -7462 -9448 194
10408A94O770n371o013O04N545K696k467n385m716K990P283L421P24r025j283
$$ 194 6964 1593 -4420 -3816 1729 4425 1958 -3427 -8143 -5153 2130 5551 6275 -2750 -4033
10393d033J436N637l83K635q236m807N023K690n389J186N343J292o277L339O368
$$ -4033 -2597 3040 2657 5292 -2944 -7751 -2728 -38 -5427 -4241 1102 2394 -3883 -544 5824
10378E824m231p218M474L57q10K578M56o179N217n103o82m498J307K912K189j851
$$ 5824 1593 -5625 -1151 -794 -1604 974 1430 -4749 468 -4635 -5317 -9815 -8508 -5596 -3407 -5258
10362e258K108K414k636M134J0889k418p122J82J64l193J890l827n450M767L190
$$ -5258 -3150 -736 -3372 762 11651 9233 2111 2293 2457 -736 1154 -2673 -8123 -3356 -166
10347a66k065J398m978N082j418r874J575P522N651m963J70n083J151l809O058
$$ -166 -2231 -833 -5811 -729 -2147 -12021 -10446 -2924 2727 -2236 -2066 -7149 -5998 -9807 -3749
10332c749K394j313j339K487K589L849M753j83j139M59L232O180n022q731p24
$$ -3749 -1355 -2668 -4007 -1520 1069 4918 9671 9488 8349 8808 12040 18220 13198 4467 3743
10317C743P528J2004J8532J1686M084J2049Q126K899P823n07o205o490n862r645
$$ 3743 11271 23275 41807 53493 57577 69626 77752 80651 88474 87967 81762 75272 69410 59765
10303E9765j1042j0934j5080r344m836k670o26L784j921k308L498l774j604k74
$$ 59765 48723 37789 22709 13365 8529 5859 5233 9017 7096 4788 8286 4512 2908 2634
10289B634l932p967O943J307K349j555L823J664Q47K593n557p081n946N700L397
$$ 2634 -1298 -9265 -2322 -1015 1334 -221 3602 5266 6113 8706 3149 -3932 -9878 -4178 -781
10274g81p79J016k825j760J222P923n33m59l575N64N364n81j725l079m2j059m8
$$ -781 -1560 -544 -3369 -5129 -3907 4016 3483 3024 -551 13 5377 4796 3071 -8 -50 -1109 -1157
10257a157J567k361l053K743k894k353M399K180K547l540M191N560J611N6K900
$$ -1157 410 -1951 -5004 -2261 -5155 -7508 -3109 -929 1618 -1922 2269 7829 9440 9496 12396
10242A2396q338k415N134o366q899J433N720K35R18j579n654p830K018M307n84
$$ 12396 4058 1643 6777 411 -8488 -7055 -1335 -1100 -182 -1761 -7415 -15245 -13227 -8920 -9504
10227i504K23M440m62N66j891l195k297K224L587M956k401m996P578L070p513
$$ -9504 -9281 -4841 -5303 -4737 -6628 -9823 -12120 -9896 -6309 -1353 -3754 -8750 -1172 1898 -5615
10212e615M064l66n887J719L463l873j137J960R727l732o698r080n410K843J1082
$$ -5615 -1551 -1917 -7804 -6085 -2622 -6495 -7632 -5672 4055 323 -6375 -15455 -20865 -18022 -6940
10197f940L204N207L342j673j835m837n948K49N153l576n478K996J219N7k740
$$ -6940 -3736 1471 4813 3140 1305 -3532 -9480 -9231 -4078 -7654 -13132 -10136 -8917 -8860 -11600
10182a1600J005M047M085J278k157K458J282n925L763P409L075K592j650M152
$$ -11600 -10595 -6548 -2463 -1185 -3342 -884 398 -5527 -1764 5645 8720 11312 9662 13814
10168A3814J860j2075j2061j2431O554Q933o12j157M526j071l363P529P975k03
$$ 13814 15674 3599 -8462 -20893 -14339 -5406 -6018 -7175 -2649 -3720 -7083 446 8421 8218
10154H218Q56K639j347L841l331J528K398l77m492m256n370l957k030o833m554
$$ 8218 9074 11713 10366 14207 10876 12404 14802 14425 9933 5677 307 -3650 -5680 -12513 -17067
10139a7067P77M003O624J0275J765n771j436q823N516N778l871k025m527m972
$$ -17067 -16290 -12287 -5663 4612 6377 606 -830 -9653 -4137 1641 -2230 -4255 -8782 -13754
10125a3754l171M717P645M286m109j715M666L897n331j505K8n719o162M475K342
$$ -13754 -16925 -12208 -4563 -277 -4386 -6101 -1435 2462 -2869 -4374 -4346 -10065 -16227 -11752 -9410
10110i410K538k202K234n01M4o766N75K623Q099K112o750M096O651p43K4L78n647
$$ -9410 -6872 -9074 -6840 -7341 -7297 -14063 -13488 -10865 -2766 -654 -7404 -3308 3343 2600 2624 3002 -2645
10093b645p059K175P143K179L944np64m159m970p097M905Q405N741o352r53K712
$$ -2645 -9704 -7529 -386 1793 5737 5732 4968 809 -4161 -11258 -6353 2052 7793 1441 488 3200
10077C200N370j0p366n014O413R495K995m7p126J311M11K414N787m697k774K16
$$ 3200 8570 8560 1194 -3820 2593 12088 15083 15036 7910 9221 9632 12046 17833 13136 10362 10578
10061A0578M389k440p703k368J457J52l189l665m331l482j407N094k746K902M942
$$ 10578 14967 12527 4824 2456 3913 4065 876 -2789 -7120 -10602 -12009 -6915 -9661 -6759 -1817
10046a817N34o235q17M633j57m474K838J2787L799J398o50J143J80J3939k451
$$ -1817 -1283 -7518 -8335 -3702 -3859 -8333 -5495 7292 11091 12489 11839 12982 13162 27101 24650
10031B4650k944N05o676o754k833k066l292O8K669k265j614N214J752q24j688
$$ 24650 21706 22211 15535 8781 5948 3882 590 658 3327 1062 -552 4662 6414 5590 3902
10016C902J172r031l01N247k170k412M035K063l02P43M815q137P45M149r80j063
$$ 3902 5074 -3957 -4258 989 -1181 -3593 442 2505 2203 2946 7761 -376 369 4518 3538 2475
10000B475m571L08K866l668j165O71L380J979N376l772K521j876M41O645m202
$$ 2475 -2096 -1788 1078 -2590 -3755 -3084 296 2275 7651 3879 6400 4524 4965 11610 7408
9985G408p143N468M780q082k742m686J776M934J980k387r045J717q37n139j653
$$ 7408 265 5733 10513 2431 -311 -4997 -3221 1713 3693 1306 -7739 -6022 -6859 -11998 -13651
9970a3651L413K481r41K842Q89L135P569Q174o286o860K277O882l768q857m20
$$ -13651 -10238 -7757 -8698 -5856 -4967 -1832 5737 13911 7625 765 3042 9924 6156 -2701 -3121
9955c121j016j854p95P534O666k728l484j4O195j441m25m630l295O346n847q192
$$ -3121 -4137 -5991 -6786 748 7414 4686 1202 1188 7383 5942 5517 887 -2408 3938 -1909 -10101
9939a0101J297k997k230O978Q629L951k393j851M872N522M033q193K76P11l293
$$ -10101 -8804 -11801 -14031 -7053 1576 5527 3134 1283 6155 11677 15710 7517 7793 8504 5211
9924E211K680N095M429m056k538p83o322j129l45n725L729K334L74L120q92j0775
$$ 5211 7891 12986 17415 13359 10821 10038 3716 2587 2242 -3483 246 2580 2954 6074 5182 -5593
9908e593l104J2472J1396M926p308j0565k457Q155l455l561n029M369K683K660
$$ -5593 -8697 3775 15171 20097 12789 2224 -233 7922 4467 906 -4123 246 2929 5589
9894E589k005k565l758N504K02l002L941J833n046j914N125K947l435q243o912
$$ 5589 3584 1019 -2739 2765 2967 -35 3906 5739 693 -1221 3904 6851 3416 -4827 -11739
9879a1739l84J200O520N536J1919o49k626L867L839j199q629j636M8K062k002
$$ -11739 -12123 -10923 -4403 1133 13052 12403 9777 13644 17483 16284 7655 6019 6067 8129 6127
9864F127L00j893o040q45L842n302n396j206K756k43K31O173N580q4L829k516
$$ 6127 6427 4534 -1506 -2351 1491 -3811 -9207 -10413 -7657 -7900 -7669 -1496 4084 4000 7829 5313
9848E313j738Q32j669J092p42K482O542m770k95q691Q478Q781O06m071N676J185
$$ 5313 3575 4407 2738 3830 3088 5570 12112 7342 7047 -1644 6834 15615 16221 12150 17826 19011
9832A9011n695N13K860j061r757n501o787O536Q73q73n75l370k890L404M732J131
$$ 19011 13316 13829 16689 15628 5871 370 -6417 119 992 119 -456 -3826 -6716 -3312 1420 2551
9816B551k963k900K02N832L338l475l105O528M394n664j527m514j307L237Q847
$$ 2551 -412 -3312 -3110 2722 6060 2585 -520 6008 10402 4738 3211 -1303 -2610 627 9474
9801I474P27n064p995l359M279K55N46J179M73K619J313J490j045l031J592J471
$$ 9474 10201 5137 -2858 -6217 -1938 -1683 -1137 42 515 3134 4447 5937 4892 1861 3453 4924
9785D924o37r24K827L648k283l875M547j379o348j846L918Q123M432l424q251
$$ 4924 4287 3363 6190 9838 7555 3680 8227 6848 500 -1346 2572 10695 15127 11703 3452
9770C452k269K75K476J062N097J78k646j521K867L044l424J020l14m809J659p73
$$ 3452 1183 1458 3934 4996 10093 10271 7625 6104 8971 12015 8591 9611 9297 4488 6147 5374
9754E374Q908L846q500p725l257K719J0358O149o542n689r382N700J0052l928
$$ 5374 14282 18128 9628 1903 -1354 1365 11723 17872 11330 5641 -3741 1959 12011 8083
9740H083m207j951Q791Q567k049m437O019m840j554J255q11K238j1424o079j416
$$ 8083 3876 1925 10716 19283 17234 12797 18816 13976 12422 13677 12866 15104 3680 -2399 -3815
9725c815N886L300j126M707k083J180N601L511J477K111j079k952m317o816N321
$$ -3815 2071 5371 4245 8952 6869 8049 13650 17161 18638 20749 19670 16718 12401 5585 10906
9710A0906J901j268l903R30L548j027J3L68N174J747k946m195K971N073m630q410
$$ 10906 12807 11539 7636 8566 12114 11087 11100 11468 16642 18389 15443 11248 14219 19292 14662 6252
9694F252m71L040j27l703O046M98p055k256N014J02k649k92J010j3K949Q409J791
$$ 6252 5781 8821 8694 4991 11037 11535 4480 2224 7238 7340 4691 4399 5409 5396 8345 16754 18545
9677A8545o12J895J546J598l164k065n876j700j039l458n570p828O342L81O071
$$ 18545 17933 19828 21374 22972 19808 17743 11867 10167 9128 5670 100 -7728 -1386 -1005 5066
9662E066M490m089L934L904n697q49M700P134o030m449N682N38k207L235n111
$$ 5066 9556 5467 9401 13305 7608 6759 11459 18593 12563 8114 13796 14334 12127 15362 10251
9647A0251L04k244P190P019k386q808r424L749L681O05K070p344J336R033M879
$$ 10251 10555 8311 15501 22520 20134 11326 1902 5651 9332 9937 12007 4663 5999 15032 19911
9632A9911O85l248j958K826k112p53n470L560K456o364k170M128O070k913m509
$$ 19911 20596 17348 15390 18216 16104 15351 9881 13441 15897 9533 7363 11491 17561 14648 10139
9617A0139P28p538N923R837M927n736o81k434P75O827k986l917j073J878q51l82
$$ 10139 10867 3329 9252 19089 24016 18280 17599 15165 15940 22767 19781 15864 14791 16669 15818 15436
9601A5436j348j704K516O031J324k166R30K02j636j681m065m372o69K147n58J892
$$ 15436 14088 12384 14900 20931 22255 20089 21019 21221 19585 17904 13839 9467 8798 10945 10387 12279
9585A2279l091m983q464K881L878J765O082K238J936J795L102k78N505M045n219
$$ 12279 9188 4205 -4259 -1378 2500 4265 10347 12585 14521 16316 19418 19140 24645 28690 23471
9570B3471k815L928L664n96m308o768j983N444R97m631k485P083K906q6o8l452
$$ 23471 20656 24584 28248 27652 23344 16576 14593 20037 21034 16403 13918 21001 23907 23821 23753 20301
9554B0301L423J604l322j185K772J997L40n229J935L556n960J892J853J747m703
$$ 20301 23724 25328 22006 20821 23593 25590 25930 20701 22636 26192 20232 22124 23977 25724 21021
9539B1021k359P065M333j23K030j690k720K056O9l683o5J371L96k283k141k543
$$ 21021 18662 25727 30060 29937 31967 30277 27557 29613 29682 25999 25934 27305 27701 25418 23277 20734
9523B0734L087K977n90J988K032P199J544j24l26l112k984l687j856j905L864
$$ 20734 23821 26798 26208 28196 30228 37427 38971 38847 38521 35409 32425 28738 26882 24977 28841
9508B8841L728r96L372J926k006k918O68K036k225O39J564K55P871J876k562q561
$$ 28841 32569 31573 34945 36871 34865 31947 32615 34651 32426 33065 34629 34884 42755 44631 42069 33508
9492C3508J809M11O40N585j816o372p518Q661P28k457j693Q052M071k17o413o598
$$ 33508 35317 35728 36368 41953 40137 33765 26247 34908 35636 33179 31486 39538 43609 43392 36979 30381
9476C0381l488M825j002P16K998R387r46m06K883O967k764n347k352q066J406
$$ 30381 26893 31718 30716 31432 34430 43817 42871 42465 45348 52315 49551 44204 41852 33786 35192
9461C5192J035K250J0306M746l363o055K165k349J71N215M126N011J454n559j919
$$ 35192 36227 38477 48783 53529 50166 44111 46276 43927 44098 49313 53439 58450 59904 54345 52426
9446E2426j068k87n82O911j023K31m525M076L480m051P59M128p50N617L014j50
$$ 52426 51358 51071 50489 57400 56377 56608 52083 56159 59639 55588 56347 60475 59725 65342 68356 68206
9430F8206k013J62K056l017n237J280j446o71R56K048K26k051P14N619R0k916
$$ 68206 66193 66355 68411 65394 60157 61437 59991 59320 60276 62324 62550 60499 61213 66832 66922 64006
9414F4006L513k249J0244J413n745k168M864j19J714Q839K584o929K6k837o622
$$ 64006 67519 65270 75514 76927 71182 69014 73878 73759 75473 84312 86896 79967 79993 77156 70534
9399G0534K996R147M392K863j409k497K422k604r05P628Q66l732j828l297m773
$$ 70534 73530 82677 87069 89932 88523 86026 88448 85844 84939 92567 93433 89701 87873 84576 79803
9384G9803Q126K411J590o24k445j069n25P417O77o01q00L724O392N734j196j660
$$ 79803 87929 90340 91930 91306 88861 87792 87267 94684 95361 94760 93960 97684 104076 109810 108614 106954
9368A06954p32m214n843O560J0225K815o198n959Q00M20l258N161O573l60p36
$$ 106954 106222 102008 96165 102725 112950 115765 109567 103608 104408 104828 101570 106731 113304 112944 112208
9353A12208J162q486n75M073M405l76k248K556j498k225M850P14J576O058l774
$$ 112208 113370 104884 104309 108382 112787 112411 110163 112719 111221 108996 113846 114560 116136 122194 118420
9338A18420m712P89P548P237k084j29j681q180q172K227P973J819o212j012j347
$$ 118420 113708 114497 122045 129282 127198 127069 125388 117208 109036 111263 119236 121055 114843 113831 112484
9323A12484P438K536Q123j059j0629j611N457Q785j108o245o007k053Q08k197
$$ 112484 119922 122458 130581 129522 118893 117282 122739 131524 130416 124171 118164 116111 116919 114722
9309A14722n01j078q56N628K613l589n727O06K108M132q47j846P762N593p41j1408
$$ 114722 114221 113143 112287 117915 120528 116939 111212 111818 113926 118058 117211 115365 123127 128720 127979 116571
9293A16571l128n847j934M214n416p676J261J663M404N295M147N219l980n894
$$ 116571 113443 107596 105662 109876 104460 96784 98045 99708 104112 109407 113554 118773 114793 108899
9279A08899l878o008k973l016j25N152n134k1P176n310k978m935O144N266j818
$$ 108899 105021 99013 96040 93024 92899 98051 92917 92896 100072 94762 91784 86849 92993 98259 96441
9264I6441j600M421o405l639r30p873p499K826M202k693J118N737L53q18p923
$$ 96441 94841 99262 92857 89218 88288 80415 72916 75742 79944 77251 78369 84106 84459 83641 75718
9249G5718o776Q39Q886j180l824m578K11l41k018o25o65M944N08n050J478L63
$$ 75718 68942 69781 78667 77487 73663 69085 69296 68955 66937 66312 65647 70591 71099 66049 67527 67890
9233F7890L122N548o88J361q21m894M074j0991j2619k591Q234P541j993j671n56
$$ 67890 71012 76560 75872 77233 76412 71518 75592 64601 51982 49391 57625 65166 63173 61502 60946
9218F0946N81l409k265K718O071k20P366k710n528o552M963L044p186k378M661
$$ 60946 61527 58118 55853 58571 64642 64422 71788 69078 63550 56998 61961 65005 57819 55441 60102
9203F0102L72p048n888j272J266Q095k404k395l7o53J668K144j243p147k175K122
$$ 60102 60474 53426 47538 46266 47532 55627 53223 50828 50791 50138 51806 53950 52707 45560 43385 45507
9187D5507n44J046P50l760m472l706M607M134k426J68J077m967l061j159M245
$$ 45507 44963 46009 46759 42999 38527 34821 39428 43562 41136 41304 42381 37414 34353 33194 37439
9172C7439K891K816P58n252j0421l221K020K920j64L504N827M143k899l006R3
$$ 37439 40330 43146 43904 38652 28231 25010 27030 29950 29786 33290 39117 43260 40361 37355 37448
9157C7448p61J944P783Q96p738o153n052l516L336K095M319k865j0148k469M258
$$ 37448 36687 38631 46414 47310 39572 33419 28367 24851 28187 30282 34601 31736 21588 19119 23377
9142B3377k653L146O817q32k694P57j454L862L560r17q825k912K888r58j191J624
$$ 23377 20724 23870 30687 29855 27161 27918 26464 30326 33886 32969 24144 21232 24120 23162 21971 23595
9126B3595K908M027M563l008o42O14K554p015p541m94M808l550n435K292Q479
$$ 23595 26503 30530 35093 32085 31443 32057 34611 27596 20055 19561 24369 20819 15384 17676 26155
9111B6155J13M88m426m071l831m36J197L345M857J272L884q812m35L344j894m8
$$ 26155 26268 26756 22330 18259 14428 13992 15189 18534 23391 24663 28547 19735 19300 22644 20750 20702
9095B0702J069j255k710M548J719o136J764J060k434k90j71K232L17M494m288
$$ 20702 21771 20516 17806 22354 24073 17937 19701 20761 18327 18037 17866 20098 20415 24909 20621
9080B0621m487k57k369O542m85p280M93M406l866k14O646j60n656N690J44n938
$$ 20621 16134 15877 13508 20050 19565 12285 12778 17184 13318 13104 19750 19590 13934 19624 19768 13830
9064A3830K454L400l020J210K278j289O341l828q726R15K25l460M285q05K745
$$ 13830 16284 19684 16664 17874 20152 18863 25204 21376 12650 13565 13790 10330 14615 13810 16555
9049A6555M383k986k274j141L870J892m101n52j0614n44L734l092J96m84o169
$$ 16555 20938 17952 15678 14537 18407 20299 16198 15646 5032 4488 8222 5130 5326 4842 -1327
9034a327L679Q704j284p180J957K298J386O464L824K459L602N78l268r011l374
$$ -1327 2352 11056 9772 2592 4549 6847 8233 14697 18521 20980 24582 25160 21892 12881 9507
9019I507K260M481q98k730k269m340k123L231O782L225k045m326M952o72L663
$$ 9507 11767 16248 15350 12620 10351 6011 3888 7119 13901 17126 15081 10755 15707 15035 18698
9004A8698N482K502l688l092k393l64l526l148M744m996J26l509o750N003j286
$$ 18698 24180 26682 22994 19902 17509 17145 13619 10471 15215 10219 10345 6836 86 5089 3803
8989C803K474J815l744j085J728j649J413p13L700O329l820m181O958K577M24
$$ 3803 6277 8092 4348 3263 4991 3342 4755 4042 7742 14071 10251 6070 13028 15605 16029
8974A6029q07n838n685L220L150O17J829o098n325Q709O018k463l099j319j721
$$ 16029 15222 9384 3699 6919 10069 10686 12515 6417 1092 9801 15819 13356 10257 8938 7217
8959G217j223k282m818q68M001M08P05K988K293K40J439L618M722K253j0895j873
$$ 7217 5994 3712 -1106 -1974 2027 2435 3140 6128 8421 8661 10100 13718 18440 20693 9798 7925
8943G925J739k159q66K100J161k909L505O304J809l818l995P49J490M770k731
$$ 7925 9664 7505 6639 8739 9900 6991 10496 16800 18609 14791 10796 11545 13035 17805 15074
8928A5074l354P583j31q681k558M24m56o769L045M42P82Q87m295P026O076J093
$$ 15074 11720 19303 19172 10491 7933 8357 7901 1132 4177 4619 5401 6288 1993 9019 15095 16188
8912A6188q90j131k978n371j194K176L106k833Q93l576K849N952J178l419l352
$$ 16188 15298 14167 11189 5818 4624 6800 9906 7073 7966 4390 7239 13191 14369 10950 7598
8897G598o780K117R611R63O39n522l962J0161K697l566m231o90J30j439J25k302
$$ 7598 818 2935 12546 13509 14148 8626 4664 14825 17522 13956 9725 9035 9165 7726 7851 5549
8881E549l550m319K992M915k297L413k93k735J371L879l755n188J888P130N607
$$ 5549 1999 -2320 672 5587 3290 6703 6410 3675 5046 8925 5170 -18 1870 9000 14607
8866A4607k780n554L422J980m660O52J045j675k88k100M53R20J346L555O576k653
$$ 14607 11827 6273 9695 11675 7015 7667 8712 7037 6749 4649 5102 6022 7368 10923 17499 14846
8850A4846J89m524L619O145k471n878j632l232j378K054L735K785J774N342o611
$$ 14846 15035 10511 14130 20275 17804 11926 10294 7062 5684 7738 11473 14258 16032 21374 14763
8835A4763o823p197k858P368K361j614k22P3r55n469P91L086k340N36N395L06
$$ 14763 7940 743 -2115 5253 7614 6000 5778 5851 4896 -573 218 3304 964 1500 6895 7201
8819G201J27L743q338n617K838m9K307o16K011P13o139l280J0035J754Q03p92
$$ 7201 7328 11071 2733 -2884 -46 -95 2212 1596 3607 4320 -1819 -5099 4936 6690 7493 6701
8803F701k013p84M015j800o818j884L240M767J553J529J603o775n493m476k388
$$ 6701 4688 3904 7919 6119 -699 -2583 657 5424 6977 8506 10109 3334 -2159 -6635 -9023
8788i023N785L409J296R54R026R066j484n427p326m229K797J576m003N70N422
$$ -9023 -3238 171 1467 2421 11447 20513 19029 13602 6276 2047 4844 6420 2417 2987 8409
8773H409N953k441m470k677m796n421J317o94m601o247N708J4231R370r17o227
$$ 8409 14362 11921 7451 4774 -22 -5443 -4126 -4820 -9421 -15668 -9960 4271 13641 12724 6497
8758F497j839Q890K529l417m336n392J712M836O41j680J083N772J034k118l492
$$ 6497 4658 13548 16077 12660 8324 2932 4644 9480 10121 8441 9524 15296 16330 14212 10720
8743A0720r682q861j654N480k64P889N090n405l065O928N042P70m987m622j281
$$ 10720 1038 -7823 -9477 -3997 -4261 3628 8718 3313 248 7176 12218 12988 8001 3379 2098
8728B098L032J808k70j642J283O768L726k978L973k888n431k380j783K358k1m809
$$ 2098 5130 6938 6668 5026 6309 13077 16803 13825 17798 14910 9479 7099 5316 7674 7653 2844
8712B844k415q67l085o5N034N150J972K873N77k575K512O179m581n232o92j565
$$ 2844 429 -438 -3523 -3588 1446 6596 8568 11441 12018 9443 11955 18134 13553 8321 7629 6064
8696F064K060J327p71k861q15n317j293j593j053J245N347K601L237p001k763
$$ 6064 8124 9451 8680 5819 5004 -313 -1606 -3199 -4252 -3007 2340 4941 8178 1177 -1586
8681a586k327j46m445O35N353r82J836L829O589q19n363k814j067O575j641p974
$$ -1586 -3913 -4059 -8504 -7869 -2516 -3498 -1662 2167 8756 7937 2574 -240 -1307 5268 3627 -4347
8665d347j01M252J272P92O48j140N05n93J036k581M358M305n817l209j247P0K279
$$ -4347 -4448 -196 1076 1868 2516 1376 1881 1288 2324 -257 4101 8406 2589 -620 -1867 -1797 482
8648D82j340N53P481q98j158k284J959L630K169l583p579m297L562K332l916r88
$$ 482 -858 -305 7176 6278 5120 2836 4795 8425 10594 7011 -568 -4865 -1303 1029 -2887 -3875
8632c875M195N009P579m543l302n867j13k435l021L803M611J089J562K283j700
$$ -3875 320 5329 12908 8365 5063 -804 -917 -3352 -6373 -2570 2041 3130 4692 6975 5275
8617E275J283j515k604K044K964L235L142J21q195o451q93j966K363M038o77j98
$$ 5275 6558 5043 2439 4483 7447 10682 13824 13945 5750 -701 -1594 -3560 -1197 2841 2164 1966
8601A966j813p771O102j786j614k916l561L551N026j764P12O932N704L091k032
$$ 1966 153 -7618 -1516 -3302 -4916 -7832 -11393 -7842 -2816 -4580 -3868 3064 8768 11859 9827
8586I827j327q47q215J900L284j821j326L566N479l865m971J812R30K626L965
$$ 9827 8500 7653 -562 1338 4622 2801 1475 5041 10520 6655 1684 3496 4426 7052 11017
8571A1017N238M38m288J270n33m011k257J358J116K763j328o605n122J81r57J178
$$ 11017 16255 16693 12405 13675 13142 9131 6874 8232 9348 12111 10783 4178 -944 -763 -1720 -542
8555e42N781m833n67n391L758J074J348k744j680P6J511N987k976M638M280K157
$$ -542 5239 406 -161 -5552 -1794 -720 628 -2116 -3796 -3720 -2209 3778 802 5440 9720 11877
8539A1877J865O574k350n100j353m762j145J034M478k682j414k807n237j985J817
$$ 11877 13742 20316 17966 12866 11513 6751 5606 6640 11118 8436 7022 4215 -1022 -3007 -1190
8524a190K92J934J912L443k694k938L484J052k893m52k824m787P503n35p782P804
$$ -1190 -898 1036 2948 6391 3697 759 4243 5295 2402 1950 -874 -5661 1842 1307 -6475 1329
8508A329O266j675m00M012L5K894n159n433m161k258L70k656Q995N379Q80j561
$$ 1329 7595 5920 5520 9532 9567 12461 7302 1869 -2292 -4550 -4180 -6836 2159 7538 8418 6857
8492F857N713M687p211m528m126M668p249p292J198Q106n905j558l60k283K435
$$ 6857 12570 17257 10046 5518 1392 6060 -1189 -8481 -7283 823 -5082 -6640 -7000 -9283 -6848
8477f848L654K446m020j874J445k146J411M699N718l786p502k576Q46j583N614
$$ -6848 -3194 -748 -4768 -6642 -5197 -7343 -5932 -1233 4485 699 -6803 -9379 -8533 -10116 -4502
8462d502M740O595J313m308o474L133L011J592J161q863q3k012N033K892j834
$$ -4502 238 6833 8146 3838 -2636 497 3508 5100 6261 -2602 -2685 -4697 336 3228 1394
8447A394M985J374m253l113Q006R263K508m895k45l148m528M52m984K459l337
$$ 1394 6379 7753 3500 387 8393 17656 20164 15269 15024 11876 7348 7800 2816 5275 1938
8432A938l573j428J883k328J71J437l917K05O669l22L095l321o375m935N79M88
$$ 1938 -1635 -3063 -1180 -3508 -3337 -1900 -5817 -5612 1057 735 3830 509 -5866 -10801 -10222 -9734
8416i734L928J504K617j267J105k192m920N141J370Q122j746p25J475r49n174
$$ -9734 -5806 -4302 -1685 -2952 -1847 -4039 -8959 -3818 -2448 5674 3928 3203 4678 3729 -1445
8401a445k250K322M729K84L012q06k360k298M671j487l814j642P369o195p900
$$ -1445 -3695 -1373 3356 3640 6652 5846 3486 1188 5859 4372 558 -1084 6285 90 -7810
8386g810j039j719L250K300Q611J239j643j93J733j636J436O588P943j1428p724
$$ -7810 -8849 -10568 -7318 -5018 3593 4832 3189 2996 4729 3093 4529 11117 19060 7632 -92
8371i2N63N529J900N602j873o924l982j611n453l476M208O270N064K737K578k474
$$ -92 471 6000 7900 13502 11629 4705 723 -888 -6341 -9817 -5609 661 5725 8462 11040 8566
8355H566n737k347q205L208N108P186K954l732j66J052j918p976p8m3j000J11
$$ 8566 2829 482 -7723 -4515 593 7779 10733 7001 6835 7887 5969 -2007 -2085 -2128 -3128 -3017
8339c017M227L047j124q36l057q25J151L201J539J868l950j543K696K42J35K510
$$ -3017 1210 4257 3133 2297 -760 -1585 -434 2767 4306 6174 2224 681 3377 3619 3754 6264
8323F264J08k368n734r411J404J0242O671N94k875r77o60j516p143n870k780K224
$$ 6264 6372 4004 -1730 -11141 -9737 505 7176 7770 4895 3918 3258 1742 -5401 -11271 -14051 -11827
8307a1827J124M436J916q83K943N525o475j004n70K320r98N270R524p429l615
$$ -11827 -10703 -6267 -4351 -5234 -2291 3234 -3241 -4245 -4815 -2495 -3493 1777 11301 3872 257
8292B57P61N266j137p525K235m276l673p898M89R908K978K725r71K828R336P4
$$ 257 1018 6284 5147 -2378 -143 -4419 -8092 -15990 -15501 -5593 -2615 110 -861 1967 11303 11377
8276A1377r16r024o337k490L49J725M69k042Q88K893l677n517j967L770L918O237
$$ 11377 10461 1437 -4900 -7390 -7041 -5316 -4847 -6889 -6001 -3108 -6785 -12302 -14269 -10499 -6581 -344
8260c44J557N82k127l585m456L037L996k260K189K615j259r568l790N063J0356
$$ -344 1213 1795 -332 -3917 -8373 -5336 -1340 -3600 -1411 1204 -55 -9623 -13413 -8350 2006
8245B006L786p4k975m789J792Q96l344k753o89J75j101Q3P504k089j091j377j113
$$ 2006 5792 5718 2743 -2046 -254 642 -2702 -5455 -6144 -5969 -7070 -6987 517 -1572 -2663 -4040 -5153
8228e153J0721l45L645j502l683p54o451j107M468j368k944J383L368n212k877
$$ -5153 5568 5223 8868 7366 3683 2929 -3522 -4629 -161 -1529 -4473 -3090 278 -4934 -7811
8213g811k350K122L622K891k560j0149n506L808N744N591j003J05N343k26q55
$$ -7811 -10161 -8039 -4417 -1526 -4086 -14235 -19741 -15933 -10189 -4598 -5601 -5496 -153 -379 -1234
8198a234J707L180L25j850l919q026p2P98P96M482O573J592N017l88m889n543
$$ -1234 473 3653 3978 2128 -1791 -9817 -9889 -9091 -8295 -3813 2760 4352 9369 8981 4092 -1451
8182a451p39J94N941r90K334M654k12j158l139m479J440l686j1986m831N045P622
$$ -1451 -2190 -1996 3945 2955 5289 9943 9731 8573 5434 955 2395 -1291 -13277 -18108 -13063 -5441
8166e441K289K762P149R25K910j0213r079N105J1054l215l376K564k664l092O010
$$ -5441 -3152 -390 6759 7684 10594 381 -8698 -3593 7461 4246 870 3434 770 -2322 3688
8151C688l104q89m650n024K745K345M117J441R95M86N938L143n828m846O834P083
$$ 3688 584 -305 -4955 -9979 -7234 -4889 -772 669 1664 2150 8088 11231 5403 557 7391 14474
8135A4474n293n802J036P011J108n426m058o381m704L849j433M21n940K182O066
$$ 14474 9181 3379 4415 11426 12534 7108 3050 -3331 -8035 -4186 -5619 -5198 -11138 -8956 -2890
8120b890N664Q17J876M20O7M099l706l395J942L563l086n916J309J223n774l97
$$ -2890 2774 3591 5467 5887 5954 10053 6347 2952 4894 8457 5371 -545 764 1987 -3787 -4184
8104d184J704J0970L178k388m534L83n799j903m120L74P638M472j836j721O120
$$ -4184 -2480 8490 11668 9280 4746 5129 -670 -2573 -6693 -6319 1319 5791 3955 2234 8354
8089H354N178l927l941k60K474J50k128n52J117m963m297l800K979L741k225n714
$$ 8354 13532 9605 5664 5404 7878 8028 5900 5348 6465 1502 -2795 -6595 -3616 125 -2100 -7814
8073g814L622O601N308k008m53l649L934l98n61l869n63J010p133j16Q995k794
$$ -7814 -4192 2409 7717 5709 5256 1607 5541 5143 4582 713 150 1160 -5973 -6089 2906 112
8057A12M177M468M09J058K906j754k291n336p86k854m254k603N675J235o539K540
$$ 112 4289 8757 9166 10224 13130 11376 9085 3749 2963 109 -4145 -6748 -1073 162 -6377 -3837
8041c837J488L725M328J643q009n500n189L104L285J249K078K85M331J523k176
$$ -3837 -2349 1376 5704 7347 -662 -6162 -11351 -8247 -4962 -3713 -1635 -1350 2981 4504 2328
8026B328m340K72M189N130m276p437j484k165L792L763q82j107k588R239J782
$$ 2328 -2012 -1740 2449 7579 3303 -4134 -5618 -7783 -3991 -228 -1110 -2217 -4805 4434 6216
8011F216o243L301N102n158n071M246P88k190K111m931m378j397L825L423K258
$$ 6216 -27 3274 8376 3218 -1853 2393 3181 991 3102 -1829 -6207 -7604 -3779 -356 1902
7996A902L493L086k113n050j146M754M50m272N938j34K481m909p612R798N527
$$ 1902 5395 8481 6368 1318 172 4926 5376 1104 7042 6908 9389 4480 -3132 6666 12193
7981A2193k797k102K20o254n103J214K82L913R309K295j624k892l27k267l359
$$ 12193 9396 7294 7514 1260 -3843 -2629 -2347 1566 10875 13170 11546 8654 8327 6060 2701
7966B701k249K016l35R45m758J04P21n119p65m313J787Q382J540l544j28M90K135
$$ 2701 452 2468 2133 3078 -1680 -1576 -855 -5974 -6739 -11052 -9265 -883 657 -2887 -3015 -2525 -390
7949c90N36j371K305Q084j751k187P10j098N931O12k601n705K614q28l060K67
$$ -390 146 -1225 1080 9164 7413 5226 5936 4838 10769 11381 8780 3075 5689 4861 1801 2068
7933B068M571K195K166p099k619K386j739k214k836K257M032R79j795p675J78
$$ 2068 6639 8834 11000 3901 1282 3668 1929 -285 -3121 -864 3168 4147 2352 -5323 -5145
7918e145k092M020J720P931n42j1498L338N317l254l549L191J944L594j756j639
$$ -5145 -7237 -3217 -1497 6434 5892 -5606 -2268 3049 -205 -3754 -563 1381 4975 3219 1580
7903A580m005K13M016M531k48P626J566k439K4L513N61q137j913j034l111M377
$$ 1580 -2425 -2212 1804 6335 6087 13713 15279 12840 12864 16377 16938 8801 6888 5854 2743 7120
7887G120k595k447K171J264R7J108k178O35j127R47K217n483o810l866j677N006
$$ 7120 4525 2078 4249 5513 5610 6718 4540 5175 4048 4995 7212 1729 -5081 -8947 -10624 -5618
7871e618O590J309j08K200j20O519j750L283k359p883o361O69p984M59M575L608
$$ -5618 972 2281 2173 4373 4253 10772 9022 12305 9946 2063 -4298 -3629 -11613 -11154 -6579 -2971
7855b971K119P88K427L407q813q319L207j336N399J847n910j881L725K10L896
$$ -2971 -852 -64 2363 5770 -3043 -11362 -8155 -9491 -4092 -2245 -8155 -10036 -6311 -6101 -2205
7840b205M146Q722p15m082M51o297k317k179P239P39j091k189k880P28m052p011
$$ -2205 1941 10663 9948 5866 6317 20 -2297 -4476 2763 3502 2411 222 -2658 -1930 -5982 -12993
7824a2993K418M232Q960M879o339n845j530o166q37N285M230L121L219P718P93
$$ -12993 -10575 -6343 2617 7496 1157 -4688 -6218 -12384 -13221 -7936 -3706 -585 2634 10352 11145
7809A1145p838J788J580r510k31O224K492k339M031L600l68m990m125p83Q60M104
$$ 11145 3307 5095 6675 -2835 -3066 3158 5650 3311 7342 10942 10574 5584 1459 676 1536 5640
7793E640N24m481l109K522o104R97N317Q364l019l688j826k121l67K888J822K479
$$ 5640 6164 1683 -1426 1096 -5008 -4011 1306 9670 6651 2963 1137 -984 -1351 1537 3359 5838
7777E838N611k613j863j776P38m247k681J491J030n313n015n798K953N180J864
$$ 5838 11449 8836 6973 5197 5935 1688 -993 498 1528 -3785 -8800 -14598 -11645 -6465 -4601
7762d601j825n927K606o235K223O534k763O439P434m19J521k030r722m878j83
$$ -4601 -6426 -12353 -9747 -15982 -13759 -7225 -9988 -3549 3885 3466 4987 2957 -6765 -11643 -11826
7747a1826K836M291L733N281l18lj391j344K466O940n460l248K746n449n388k197
$$ -11826 -8990 -4699 -966 4315 3997 3994 2603 1259 3725 10665 5205 1957 4703 -746 -6134 -8331
7731h331J756N719M387l242K607j174p215j376K494P553m2n067m282M101R818
$$ -8331 -6575 -856 3531 289 2896 1722 -5493 -6869 -4375 3178 3136 -1931 -6213 -2112 7706
7716G706K530n457n271N064M104k512N76m682M02M682j595k995o056m861k193
$$ 7706 10236 4779 -492 4572 8676 6164 6740 2058 2460 7142 5547 2552 -3504 -8365 -10558
7701a0558J572k382K778p451n077P669J1998N030J981l513q058n582K000l125
$$ -10558 -8986 -11368 -8590 -16041 -21118 -13449 -1451 3579 5560 2047 -6011 -11593 -9593 -12718
7687a2718j878K21R806L531j584M088O92l528j373J457j670J794j21M07P119l37
$$ -12718 -14596 -14375 -4569 -1038 -2622 1466 2158 -1370 -2743 -1286 -2956 -1162 -1283 -876 6243 5906
7671E906n971M13J648l574p07Q038L645M041L285l883k681Q9K236N850n157p869
$$ 5906 -65 348 1996 -1578 -2285 5753 9398 13439 16724 12841 10160 10249 12485 18335 13178 5309
7655E309l081n304l339r15m172j004l05N225J0609M489o598j562L284r63m149
$$ 5309 2228 -3076 -6415 -7330 -11502 -12506 -12811 -7586 3023 7512 914 -648 2636 1673 -2476
7640b476L398M0j889L042R40l36m434j649p285M48L976N283m510j367R626P83
$$ -2476 922 962 -927 2115 3055 2719 -1715 -3364 -10649 -10201 -6225 -942 -5452 -6819 2807 3590
7624C590m221K99l086o870p30P617L981m201j897L199J191o658K91J1947M734
$$ 3590 -631 -332 -3418 -10288 -11018 -3401 580 -3621 -5518 -2319 -1128 -7786 -7495 4452 9186
7609I186k877r120r88M494m516m324J398J205O202L167m770J040N528m256J065
$$ 9186 6309 -2811 -3799 695 -3821 -8145 -6747 -5542 660 3827 -943 97 5625 1369 2434
7594B434L305j3j576j418K750o334L18L48K716j115l439k186l96j667k623j561
$$ 2434 5739 5726 4150 2732 5482 -852 -534 -186 2530 1415 -2024 -4210 -4606 -6273 -8896 -10457
7578a0457M802M759m217M42L078R99n079k108N87m085l068M007P786k174J336
$$ -10457 -5655 -896 -5113 -4671 -1593 -594 -5673 -7781 -7194 -11279 -14347 -10340 -2554 -4728 -3392
7563c392O606L219l324l803L470O630M236k949n585p832K399J165O41P160r87
$$ -3392 3214 6433 3109 -694 2776 9406 13642 10693 5108 -2724 -325 840 1481 8641 7654
7548G654m485k562l3k4n89l638O023l59j936k35j371m883k042j232K959M100m992
$$ 7654 3169 607 574 550 -39 -3677 2346 1987 51 -184 -1555 -6438 -8480 -9712 -6753 -2653 -7645
7531g645p333k49P522J898n08J238J800J165m85l400O73J465l06j205m394K157
$$ -7645 -14978 -15227 -7705 -5807 -6315 -5077 -3277 -2112 -2597 -5997 -5324 -3859 -4165 -5370 -9764 -7607
7515g607r4l567k018l63K199L309k029M629K91L787M56Q439j746n177j612K632
$$ -7607 -7701 -11268 -13286 -13649 -11450 -8141 -10170 -5541 -5250 -1463 -1007 7432 5686 509 -1103 1529
7499A529K058K776k465j633m49m446Q28J381L902P967j877n710O9J108j745q152
$$ 1529 3587 6363 3898 2265 1816 -2630 -1802 -421 3481 11448 9571 3861 3930 5038 3293 -4859
7483d859q664L126O16k45J651M92L130K80k07O06n176j22K818L850N805r71j491
$$ -4859 -13523 -10397 -9781 -10026 -8375 -7883 -4753 -4473 -4680 -4074 -9250 -9372 -6554 -2704 3101 2130 639
7466F39n553R89j732N25J1449p4l944k65l331k726P025l738P56K877J0577J097
$$ 639 -4914 -3925 -5657 -5132 6317 6243 2299 2034 -1297 -4023 3002 -736 20 2897 13474 14571
7450A4571p641p411l78l268n423J128L701M628j520K093j454J357N643K810o098
$$ 14571 6930 -481 -859 -4127 -9550 -8422 -4721 -93 -1613 480 -974 383 6026 8836 2738
7435B738o244M472o135p766m257L307J414M826k52k662k056N115L623j62Q1M785
$$ 2738 -3506 966 -5169 -12935 -17192 -13885 -12471 -7645 -7897 -10559 -12615 -7500 -3877 -4039 -3958 827
7419H27q64m280J009m641l737K329R701K497m655r15J971k588l060m396J297P319
$$ 827 -37 -4317 -3308 -7949 -11686 -9357 344 2841 -1814 -2729 -758 -3346 -6406 -10802 -9505 -2186
7403b186o02R20N750N658l192o624K56L93m564q3J28k405L35O328j98O676K625
$$ -2186 -2788 -1868 3882 9540 6348 -276 -20 373 -4191 -4274 -4146 -6551 -6216 112 -86 6590 9215
7386I215P68r530J726K472n25N104M664j621N7n693k755m07o893o652J835N179
$$ 9215 9983 453 2179 4651 4126 9230 13894 12273 12330 6637 3882 3475 -3418 -10070 -8235 -3056
7370c056O403n043k650M177J626k064l618J162J047K372m45j740k7N153k795k364
$$ -3056 3347 -1696 -4346 -169 1457 -607 -4225 -3063 -2016 356 -89 -1829 -1856 3297 502 -1862
7354a862N553l095j223K394M581n5m161j511o28J105p51M496l173l743k880j545
$$ -1862 3691 596 -627 1767 6348 6293 2132 621 -7 1098 347 4843 1670 -2073 -4953 -6498
7338f498k502O090q70K076N073m15k154L266k079L071k042j354K156l197K400
$$ -6498 -9000 -2910 -3780 -1704 3369 2954 800 4066 1987 5058 3016 1662 3818 621 3021
7323C021L311j309l305K284J044l324q177j172m09N533j150k885J635m913j796
$$ 3021 6332 5023 1718 4002 5046 1722 -6455 -7627 -8036 -2503 -3653 -6538 -4903 -9816 -11612
7308a1612j849O194k62n243Q913K474L482M724L758n779k882N4k620L903J398
$$ -11612 -13461 -7267 -7529 -12772 -3859 -1385 2097 6821 10579 4800 1918 1972 -648 3255 4653
7293D653m945k804L124l366K82O337K905N900O167l239m976J876o73K567j174
$$ 4653 -292 -3096 28 -3338 -3056 3281 6186 12086 18253 15014 10038 11914 11241 13808 12634
7278A2634r556j0358m552L736Q801N949k491K079L844n61n067q210K073O289l60
$$ 12634 3078 -7280 -11832 -8096 705 6654 4163 6242 10086 9525 4458 -3752 -1679 4610 4250
7263D250J680J552k697J55k754k274n993k885L468J495l478J941L229J363K439
$$ 4250 5930 7482 4785 4940 2186 -88 -6081 -8966 -5498 -4003 -7481 -5540 -2311 -948 1491
7248A491j349m123k513L551R87N430k11J310J952j0426k895O228N116O824L819
$$ 1491 142 -3981 -6494 -2943 -1956 3474 3263 4573 6525 -3901 -6796 -568 4548 11372 15191
7233A5191p972r8j0898o981Q038j798J012N247Q617J056o058k384m348j950R64
$$ 15191 7219 7121 -3777 -10758 -2720 -4518 -3506 1741 10358 11414 5356 2972 -1376 -3326 -2362
7218b362m68O850j152J047q26p212m978N471J1535m32j1127p203j304P073M305
$$ -2362 -2830 4020 2868 3915 3089 -4123 -9101 -3630 7905 7473 -3654 -10857 -12161 -5088 -783
7203g83j582n251L653N423J771p364l908J76L964P217l420j1139K947K500q60
$$ -783 -2365 -7616 -3963 1460 3231 -4133 -8041 -7865 -3901 3316 -104 -11243 -8296 -5796 -6656
7188f656M264o03l40p28K153O0j739Q79J881m031K843M749r2K667k034Q34j8J976
$$ -6656 -2392 -2995 -3335 -4063 -1910 -1850 -3589 -2710 -829 -4860 -2017 2732 2640 5307 3273 4107 4089 6065
7170F065p489l000R517Q085K042M78l459o308o704k396N414M46M071j603o131
$$ 6065 -1424 -4424 5093 13178 15220 15698 12239 5931 -773 -3169 2245 2691 6762 5159 -972
7155i72R91Q26m826J81j830N149K475J779r46n865J584J0381j271k769k372k214
$$ -972 19 845 -3981 -3800 -5630 -481 1994 3773 2827 -3038 -1454 8927 7656 4887 2515 301
7139C01K169K583k753l301M801O333k909q184O01k54R218K498j1712l698M005
$$ 301 2470 5053 2300 -1001 3800 10133 7224 -960 -359 -613 8605 11103 -609 -4307 -302
7124c02J759J24k227J213J136K191M885k426Q93L998k445q741j3445n038R102
$$ -302 1457 1581 -646 567 1703 3894 8779 6353 7246 11244 8799 58 -13387 -18425 -9323
7109i323L434k100J576n01K845J867k992K991j887O2p998J984L583K745O289J159
$$ -9323 -5889 -7989 -6413 -6914 -4069 -2202 -5194 -2203 -4090 -4028 -12026 -10042 -6459 -3714 2575 3734
7093C734N276Q674m717n623l198k673j155N152k605k130K666n063L436K710M826
$$ 3734 9010 17684 12967 7344 4146 1473 318 5470 2865 735 3401 -1662 1774 4484 9310
7078I310k090j553j639p858l929O233k946L480K481L126k77m539J424O517O134
$$ 9310 7220 5667 4028 -3830 -7759 -1526 -4472 -992 1489 4615 4338 -201 1223 7740 13874
7063A3874j0933j720O333M376r44p707p136L236J888j600k320p43n137r61L945
$$ 13874 2941 1221 7554 11930 10986 3279 -3857 -621 1267 -333 -2653 -3396 -8533 -9494 -5549
7048e549R85L986K255M65l843m994R923M6j860r33l440k27j505K373L189J4k813
$$ -5549 -4564 -578 1677 2142 -1701 -6695 3228 3274 1414 481 -2959 -3186 -4691 -2318 871 885 -1928
7031a928P246p05k341K210l822L391M74N93p973o520N04M853O665J77l431P12
$$ -1928 5318 4613 2272 4482 660 4051 4525 5118 -2855 -9375 -8871 -4018 2647 2824 -607 105
7015A05k994p05j090K2N145N089P469k47o38P294q616j2709N147J179n628M095
$$ 105 -2889 -3594 -4684 -4662 483 5572 13041 12794 12156 19450 10834 -1875 3272 4451 -1177 2918
6999B918Q17l607k221L70K479L628J807j768r87m440j689n561K707n4M263L792
$$ 2918 3735 128 -2093 -1723 756 4384 6191 4423 3436 -1004 -2693 -8254 -5547 -5601 -1338 2454
6983B454j049k391N647N640M119q65q070k548J636m623n323o019l982N791J0581
$$ 2454 1405 -986 4661 10301 14420 13555 5485 2937 4573 -50 -5373 -11392 -15374 -9583 998
6968I98P321J773l774J702l501J921O966J719j029m457L050q07n247l771J496
$$ 998 8319 10092 6318 8020 4519 6440 13406 15125 14096 9639 12689 11882 6635 2864 4360
6953D360L129m843m326j434J751J288k911j50N473l548L384L655k617n091j33
$$ 4360 7489 2646 -1680 -3114 -1363 -75 -2986 -3136 2337 -1211 2173 5828 3211 -1880 -2013
6938b013j403o643K978M655n32J503J1047Q881L442j297o043J433J39j688o456
$$ -2013 -3416 -10059 -7081 -2426 -2958 -1455 9592 18473 21915 20618 14575 16008 16147 14459 8003
6923H003j78Q73k58p169k296M452P0O7n159r218L632M190k352M111l970k074q25
$$ 8003 7825 8698 8440 1271 -1025 3427 3497 3564 -1595 -10813 -7181 -2991 -5343 -1232 -5202 -7276 -8101
6906h101O509j117m587j857M641J4481J190K174o97n529K996l211j0264r963N589
$$ -8101 -1592 -2709 -7296 -9153 -4512 9969 11159 13333 12636 7107 10103 6892 -3372 -13335 -7746
6891g746N668L611j449n706K403N257k840J751O035n494l895Q51J581n874K724
$$ -7746 -2078 1533 84 -5622 -3219 2038 -802 949 6984 1490 -2405 -1554 27 -5847 -3123
6876c123N200k641M43J362k424j107K075J085j895L401J61o878r464p976M622
$$ -3123 2077 -564 -121 1241 -1183 -2290 -215 870 -1025 2376 2537 -4341 -13805 -21781 -17159
6861a7159J4436N405K524l380q929m501l119j431Q335O038O29O186j422j569K145
$$ -17159 -2723 2682 5206 1826 -7103 -11604 -14723 -16154 -7819 -1781 -1152 5034 3612 2043 4188
6846D188N989j409l098n049m8L117L149N017k739o393l862l007l226N108R22o122
$$ 4188 10177 8768 5670 621 573 3690 6839 11856 9117 2724 -1138 -4145 -7371 -2263 -1341 -7463
6830g463j953K523L197M018Q615J557l34P017K718o290j3027o631K629K317M119
$$ -7463 -9416 -6893 -3696 322 8937 10494 10160 17177 19895 13605 578 -6053 -3424 -1107 3012
6815C012K915p46L919K443Q29p158l829J60J118J941j002P36l786l210j802K073
$$ 3012 5927 5181 9100 11543 12372 5214 1385 1545 2663 4604 3602 4338 552 -2658 -4460 -2387
6799b387l564n82K741M217J24k447r406k860m8Q160J1544K165n043m900J487j710
$$ -2387 -5951 -6533 -3792 425 549 -1898 -11304 -14164 -14212 -6052 5492 7657 2614 -2286 -799 -2509
6783b509L125L946k897l994n714o5N532k691K153Q589j058q57m465o26O761J411
$$ -2509 616 4562 1665 -2329 -8043 -8108 -2576 -5267 -3114 5475 4417 3560 -905 -1531 5230 6641
6767F641p594j424j465j708P679P768K079n328m264n917p26L557J043L866q29
$$ 6641 -953 -2377 -3842 -5550 2129 9897 11976 6648 2384 -3533 -4259 -702 341 4207 3378
6752C378k270K39L449k509Q315L969N88m118n929m866O635O475l366k561k284
$$ 3378 1108 1347 4796 2287 10602 14571 15159 11041 5112 246 6881 13356 9990 7429 5145
6737E145P499K330m903p245r170K841N458K156M350M187n551l12P416O912M487
$$ 5145 12644 14974 10071 2826 -6344 -3503 1955 4111 8461 12648 7097 6785 14201 21113 25600
6722B5600p400p839j730l235L375P774M250R539K752n223p254l454k08m04l116
$$ 25600 18200 10361 8631 5396 8771 16545 20795 30334 33086 27863 20609 17155 16947 16543 13427
6707A3427o613j446L823L288k77j0976j368o54O10n147k035M547O445M126R84
$$ 13427 6814 5368 9191 12479 12202 1226 -142 -796 -186 -5333 -7368 -2821 3624 7750 8734
6692H734m427j430M168P204j612k685m838r88p440n466Q699M88j087o41m363J351
$$ 8734 4307 2877 7045 14249 12637 9952 5114 4126 -3314 -8780 -81 407 -680 -1321 -5684 -4333
6676d333L887J828O07j012L925M116P620o891q577l058L314l319J157N346o738
$$ -4333 -446 1382 1989 977 4902 9018 16638 9747 1170 -1888 1426 -1893 -736 4610 -2128
6661b128l144M412P757j041m562p895M667J624P040j029j0060J051P83J551k967
$$ -2128 -5272 -860 6897 5856 1294 -6601 -1934 -310 6730 5701 -4359 -3308 -2525 -974 -3941
6646c941l365m1R482O1k517K995Q74Q94m954l861m42q75J105M553j08o136r045
$$ -3941 -7306 -7347 2135 2196 -321 2674 3548 4442 -512 -4373 -4815 -5690 -4585 -32 -140 -6276 -15321
6629a5321N348J0947n272m3J1431L445r472m007q82L221n899o085N605L136M651
$$ -15321 -9973 974 -4298 -4341 7090 10535 1063 -2944 -3826 -605 -6504 -12589 -6984 -3848 803
6614H03j98n653N100L269p698O628N195J372n367m770k682M27N462L203l713l028
$$ 803 605 -5048 52 3321 -4377 2251 7446 8818 3451 -1319 -4001 -3574 1888 5091 1378 -1650
6598a650M473J639m06n440k400L067K208k546L92K528m000m875J510N077P298
$$ -1650 2823 4462 4056 -1384 -3784 -717 1491 -1055 -663 1865 -2135 -7010 -5500 -423 6875
6583F875O54K575n359m261L639N976L587j746q568N861P839l829j0626J564q42
$$ 6875 7529 10104 4745 484 4123 10099 13686 11940 3372 9233 17072 13243 2617 4181 3339
6568C339l54k663p467j555J841J449P323O37m151l710o831K400M167N479O477
$$ 3339 2985 322 -7145 -8700 -6859 -5410 1913 2550 -1601 -5311 -12142 -9742 -5575 -96 6381
6553F381P309k747n010p193n699Q18L784O8k641o794L155O054J174K345Q845k14
$$ 6381 13690 10943 5933 -1260 -6959 -6141 -2357 -2289 -4930 -11724 -8569 -2515 -1341 1004 9849 9635
6537I635J253k058j707M942K907m168m57j593m228m475L914N864K680n674Q11
$$ 9635 10888 8830 7123 12065 14972 10804 10347 8754 4526 51 3965 9829 12509 6835 7646
6522G646k149K045m275n40N718k15O385k402n689Q81j592m987m946l799N105L14
$$ 7646 5497 7542 3267 2727 8445 8230 14615 12213 6524 7405 5813 826 -4120 -7919 -2814 -2500
6506b500N577M16J981R60N118o626l928m22k342p931m073N859O088J130j117l576
$$ -2500 3077 3493 5474 6434 11552 4926 998 576 -1766 -9697 -13770 -7911 -1823 -693 -1810 -5386
6490e386j60o373k483N830j151M832O423r790K511M715K811l71j970l767l031
$$ -5386 -5546 -11919 -14402 -8572 -9723 -4891 1532 -8258 -5747 -1032 1779 1408 -562 -4329 -7360
6475g360J752M908K084M333j365n993l095m688Mn94K887K471L4R30L516J935L542
$$ -7360 -5608 -700 1384 5717 4352 -1641 -4736 -9424 -9420 -10014 -7127 -4656 -4622 -3692 -176 1759 5301
6458E301J905n59j482j320l249p55P437J358n602J701J784j578L534K297o31j696
$$ 5301 7206 6647 5165 3845 596 -159 7278 8636 3034 4735 6519 4941 8475 10772 10141 8445
6442H445r126m412m710o668O084J0049M384M469l462p916p568O75N162q23n04
$$ 8445 -681 -5093 -9803 -16471 -10387 -338 4046 8515 5053 -2863 -10431 -9756 -4594 -5417 -5921
6427e921R64L224Q105l605k008k401M822P660Q361J292j1073j0220p54q176J441
$$ -5921 -4957 -1733 6372 2767 759 -1642 3180 10840 19201 20493 9420 -800 -1554 -9730 -8289
6412h289J1224K112k662m627J021M002N987M146o052n580K723M868m503m018j387
$$ -8289 2935 5047 2385 -2242 -1221 2781 8768 12914 6862 1282 4005 8873 4370 352 -1035
6397a035N259M779p876p712M367K336J045L61k085Q69Q33J190o126N532M575J675
$$ -1035 4224 9003 1127 -6585 -2218 118 1163 1524 -561 308 1141 2331 -3795 1737 6312 7987
6381G987j657k470L767P03j985K796n925p79l745m463N408O382K698p625m972
$$ 7987 6330 3860 7627 8330 6345 9141 3216 2437 -1308 -5771 -363 6019 8717 1092 -3880
6366c880j661n319J14r55M30J0155R28q854N867R649j131l201m094O93k943J963
$$ -3880 -5541 -10860 -10746 -11701 -11271 -1116 -188 -9042 -3175 6474 5343 2142 -1952 -1259 -4202 -2239
6350b239o65P679L234p858l384q58m036l165N858O396j528q2J90M189j132p197
$$ -2239 -2904 4775 8009 151 -3233 -4091 -8127 -11292 -5434 962 -566 -648 -458 3731 2599 -4598
6334d598k290L43J014l788M210O815Q90r949n525K673M194M091Q277J748j695
$$ -4598 -6888 -6545 -5531 -9319 -5109 1706 2596 -7353 -12878 -10205 -6011 -1920 6357 8105 6410
6319F410r415m554l457k155M590Q123K298L980M210j788n427l523j031k205l925
$$ 6410 -3005 -7559 -11016 -13171 -8581 -458 1840 5820 10030 8242 2815 -708 -1739 -3944 -7869
6304g869p88N333n170j89L781L565J133N409k793p216m200k640j349L548O280
$$ -7869 -8657 -3324 -8494 -8683 -4902 -1337 -204 5205 2412 -4804 -9004 -11644 -12993 -9445 -3165
6289c165j80O955J3426O058r061j0785o386r865j538K409J073j781K223J343N965
$$ -3165 -3345 3610 17036 23094 14033 3248 -3138 -13003 -14541 -12132 -11059 -12840 -10617 -9274 -3309
6274c309L597l243M743q33K960J872q16n387l492P36k277k047k525K780J564R829
$$ -3309 288 -2955 1788 955 3915 5787 4971 -416 -3908 -3172 -5449 -7496 -10021 -7241 -5677 4152
6258D152M455m915j862k125k822j836J950p33j498K037L106m617n74N406k389
$$ 4152 8607 3692 1830 -295 -3117 -4953 -3003 -3736 -5234 -3197 -91 -4708 -5282 124 -2265
6243b265J57L377k466j252j559J525k077M583Q264n882l196P09j265l632m097
$$ -2265 -2108 1269 -1197 -2449 -4008 -2483 -4560 23 8287 2405 -791 -82 -1347 -4979 -9076
6228i076L576j834n84Q465M996m145r42l675o65M460P488k615j259M828l690j0171
$$ -9076 -5500 -7334 -7918 547 5543 1398 456 -3219 -3884 576 8064 5449 4190 9018 5328 -4843
6212d843k491j834Q948J364k109J692k698j344J350R63l393Q89N090L80J379K283
$$ -4843 -7334 -9168 -220 1144 -965 727 -1971 -3315 -1965 -1002 -4395 -3506 1584 1964 3343 5626
6196E626m604j259K662K99m094l880J672l900N13L129j426M95m327K237M203J243
$$ 5626 1022 -237 2425 2724 -1370 -5250 -3578 -7478 -6965 -3836 -5262 -4767 -9094 -6857 -2654 -1411
6180a411n031J21j241M7L558L84k414J008k208N125J786L399K596n736k071M706
$$ -1411 -6442 -6321 -7562 -7515 -3957 -3573 -5987 -4979 -7187 -2062 -276 3123 5719 -17 -2088 2618
6164B618m480l928J509L234r543p222J736O061N597j199r72R32K654p2K401P630
$$ 2618 -1862 -5790 -4281 -1047 -10590 -17812 -16076 -10015 -4418 -5617 -6589 -5657 -3003 -3075 -674 6956
6148F956L992j813r58j524N185j498j724l161k584Q23M341k494m936l683p706
$$ 6956 10948 9135 8177 6653 11838 10340 8616 5455 2871 3694 8035 5541 605 -3078 -10784
6133a0784J451M124Q054L769K641p457j908j562L292L342J371m573L190L570k928
$$ -10784 -9333 -5209 2845 6614 9255 1798 -110 -1672 1620 4962 6333 1760 4950 8520 5592
6118E592j0183j52R95k129K332J207R96N797k351k349M644n064J48J399J646J471
$$ 5592 -4591 -4743 -3748 -5877 -3545 -2338 -1342 4455 2104 -245 4399 -665 -517 882 2528 3999
6102C999n816J298K937K644j410O022o298k443M845O908K430r515l379L67O399
$$ 3999 -1817 -519 2418 5062 3652 9674 3376 933 5778 12686 15116 5601 2222 2589 8988
6087H988n69j254j145m304j543O54L317M020j693m72m20p91o29j197J290O576
$$ 8988 8419 7165 6020 1716 173 827 4144 8164 6471 5999 5579 4788 4159 2962 4252 10828
6071A0828n70N313K054j0484r985m661O16O051L413j692j286L304K826J280O5
$$ 10828 10258 15571 17625 7141 -2844 -7505 -6889 -838 2575 883 -403 2901 5727 7007 7072
6056G072m385l661J0603K987l660l851p54k080j178M70j713k633j213M316J574
$$ 7072 2687 -974 9629 12616 8956 5105 4351 2271 1093 1563 -150 -2783 -3996 320 1894
6041A894k163k609K295J5L292k27N22n222m715L464P549l490j853J998m531p785
$$ 1894 -269 -2878 -583 -568 2724 2497 3019 -2203 -6918 -3454 4095 605 -1248 750 -3781 -11566
6025a1566M313Q907J0098q58j0180o898n517L926P141O630O367J912j1010r90
$$ -11566 -7253 1654 11752 10894 714 -6184 -11701 -7775 -634 5996 12363 14275 3265 2275
6011B275q46K7K739K032L04J773J825l680j393m210L168j803m066K824m21p57
$$ 2275 1429 1456 4195 6227 6531 8304 10129 6449 5056 846 4014 2211 -1855 969 548 -209
5995b09K054o777k530N330N315n69o79m602M798J738J814o094j855j134l24K473
$$ -209 1845 -4932 -7462 -2132 3183 2614 1935 -2667 2131 3869 5683 -411 -2266 -3400 -3724 -1251
5979a251N255M651l871J008K54L027K526m497r954m076r10l349k559Q132O59l919
$$ -1251 4004 8655 4784 5792 6046 9073 11599 7102 -2852 -6928 -7838 -11187 -13746 -5614 -4955 -8874
5963h874J57M043N815K130J547J156K892l39K279l112l018m568j904K842K853
$$ -8874 -8717 -4674 1141 3271 4818 5974 8866 8527 10806 7694 4676 108 -1796 1046 3899
5948C899M875J406M30n835k812l345L880j684k330L385K326p04P48m373m159K171
$$ 3899 8774 10180 10610 4775 1963 -1382 2498 814 -1516 1869 4195 3491 4239 -134 -4293 -2122
5932b122J596Q814N100r103m338J756l09j853k796M744J200r506K027Q478J12
$$ -2122 -526 8288 13388 4285 -53 1703 1394 -459 -3255 1489 2689 -6817 -4790 3688 3800
$$ [...]
##END NTUPLES=NMR SPECTRUM
##END=
