##TITLE=Analysis number 326734
Compound Code MO 08006
Book Reference 505/59
Project Code adrs
Chemist Name RobB
##JCAMPDX= 6.0         $$ Bruker NMR JCAMP-DX V2.0
##DATA TYPE= NMR SPECTRUM
##DATA CLASS= NTUPLES
##ORIGIN= Bruker BioSpin GmbH
##OWNER= nmr
$$ XWIN-NMR		Version 3.5
$$ Wed Feb 21 11:10:38 2007 GMT Standard Time (UT+0h)  MAYBRIDGE\nmr@NMR_250MHZ
##.OBSERVE FREQUENCY= 250.131544655141
##.OBSERVE NUCLEUS= ^1H
##.ACQUISITION MODE= SIMULTANEOUS (DQD)
##.ACQUISITION SCHEME= undefined
##.AVERAGES= 16
##.DIGITISER RES= 18
##SPECTROMETER/DATA SYSTEM= dpx250
##.PULSE SEQUENCE= zg30
##.SOLVENT NAME= CDCl3
##.SHIFT REFERENCE= (INTERNAL, CDCl3, 0, 16.522)
##AUDIT TRAIL= $$ (NUMBER, WHEN, WHO, WHERE, WHAT)
$$ ##TITLE= Audit trail, XWIN-NMR		Version 3.5
$$ ##JCAMPDX= 5.01
$$ ##ORIGIN= Bruker BioSpin GmbH
$$ ##OWNER= nmr
$$ C:\u/data/dgb/nmr/ADRS/1360/pdata/1/auditp.txt
$$ ##AUDIT TRAIL=  $$ (NUMBER, WHEN, WHO, WHERE, WHAT)
(   1,<2007-02-21 11:10:10.01 +000>,<MAYBRIDGE\nmr>,<NMR_250MHZ>,
      <created by zg, POWCHK disabled, PULCHK disabled
       configuration hash MD5:
       49 4B E0 1D 92 C2 6B 37 9F E6 65 BC 52 41 86 1D
       data hash MD5: 64K
       94 EB 84 05 24 79 C7 97 2D E8 DD 84 DB 5A C7 32>)
(   2,<2007-02-21 11:10:25.07 +000>,<MAYBRIDGE\nmr>,<NMR_250MHZ>,
      <Start of raw data processing
       ef LB = 0.3 FT_mod = 6 PKNL = 1 SI = 32K 
       data hash MD5: 32K
       C3 9C 01 63 F2 AF 40 39 32 35 BA D0 55 84 9E E9>)
(   3,<2007-02-21 11:10:27.09 +000>,<MAYBRIDGE\nmr>,<NMR_250MHZ>,
      <apk 
       data hash MD5: 32K
       51 4F C8 EB D1 6B F3 CE B9 B6 7B C6 2C 80 4A F0>)
(   4,<2007-02-21 11:10:27.78 +000>,<MAYBRIDGE\nmr>,<NMR_250MHZ>,
      <abs ABSG = 5 
       data hash MD5: 32K
       F4 19 B9 0E 4E B8 F0 21 62 26 8B 07 BC 2E 0F 85>)
$$ ##END=
$$ 
$$ hash MD5
$$ A8 14 57 73 6A C5 D4 4B 28 BA 5B 31 59 06 9F AC
##$RELAX= 
##$RELAX= 
##$RELAX= 
##$RELAX= 
##$RELAX= 
##$RELAX= 
##$RELAX= 
$$ Bruker specific parameters
$$ --------------------------
##$DU= <C:\u>
##$EXPNO= 1360
##$NAME= <ADRS>
##$PROCNO= 1
##$TYPE= <nmr>
##$USER= <dgb>
##$AMP= (0..31)
100 100 100 100 100 100 100 100 100 100 100 100 100 100 100 100 100 100 
100 100 100 100 100 100 100 100 100 100 100 100 100 100 
##$AQSEQ= 0
##$AQ_mod= 3
##$AUNM= <au_zg>
##$AUTOPOS= <3 >
##$BF1= 250.13
##$BF2= 250.13
##$BF3= 250.13
##$BF4= 250.13
##$BF5= 500.13
##$BF6= 500.13
##$BF7= 500.13
##$BF8= 500.13
##$BYTORDA= 1
##$CFDGTYP= 0
##$CFRGTYP= 5
##$CHEMSTR= <none>
##$CNST= (0..31)
1 1 145 1 1 1 1 1 1 1 1 1 1 1 1 1 1 1 1 1 1 1 1 1 1 1 1 1 1 1 1 1 
##$CPDPRG= <>
##$CPDPRG1= <>
##$CPDPRG2= <>
##$CPDPRG3= <>
##$CPDPRG4= <mlev>
##$CPDPRG5= <mlev>
##$CPDPRG6= <mlev>
##$CPDPRG7= <mlev>
##$CPDPRG8= <mlev>
##$CPDPRGB= <>
##$CPDPRGT= <>
##$D= (0..31)
0 1 0 0 0 0 0 0 0 0.06 0 0 0 0 0 0 0.0002 0 0 0 0 0 0 0 0 0 0 0 0 0 0 
0 
##$DATE= 1172056209
##$DBL= (0..7)
120 120 120 120 120 120 120 120 
##$DBP= (0..7)
150 150 150 150 150 150 150 150 
##$DBP07= 0
##$DBPNAM0= <>
##$DBPNAM1= <>
$$ [...]
##$SUBNAM7= <"">
##$SUBNAM8= <"">
##$SUBNAM9= <"">
##$SW= 20.6930455092707
##$SWIBOX= (0..15)
0 0 3 0 0 0 0 0 0 0 0 0 0 0 0 0 
##$SW_h= 5175.983436853
##$TD= 65536
##$TD0= 1
##$TE= 295.16
##$TE2= 300
##$TE3= 300
##$TEG= 300
##$TL= (0..7)
0 120 120 120 120 120 120 120 
##$TP= (0..7)
150 150 150 150 150 150 150 150 
##$TP07= 0
##$TPNAME0= <>
##$TPNAME1= <>
##$TPNAME2= <>
##$TPNAME3= <>
##$TPNAME4= <>
##$TPNAME5= <>
##$TPNAME6= <>
##$TPNAME7= <>
##$TPOAL= (0..7)
0.5 0.5 0.5 0.5 0.5 0.5 0.5 0.5 
##$TPOFFS= (0..7)
0 0 0 0 0 0 0 0 
##$TUNHIN= 0
##$TUNHOUT= 0
##$TUNXOUT= 0
##$USERA1= <user>
##$USERA2= <user>
##$USERA3= <user>
##$USERA4= <user>
##$USERA5= <user>
##$V9= 5
##$VALIST= <valist>
##$VCLIST= <CCCCCCCCCCCCCCC>
##$VD= 0
##$VDLIST= <DDDDDDDDDDDDDDD>
##$VPLIST= <PPPPPPPPPPPPPPP>
##$VTLIST= <TTTTTTTTTTTTTTT>
##$WBST= 1024
##$WBSW= 4
##$XGAIN= (0..3)
0 0 0 0 
##$XL= 0
##$YL= 0
##$YMAX_a= 282684
##$YMIN_a= -329319
##$ZGOPTNS= <>
##$ZL1= 120
##$ZL2= 120
##$ZL3= 120
##$ZL4= 120
##$ABSF1= 16.522
##$ABSF2= -4.171173
##$ABSG= 5
##$ABSL= 3
##$ALPHA= 0
##$AQORDER= 0
##$ASSFAC= 0
##$ASSFACI= 0
##$ASSFACX= 0
##$ASSWID= 0
##$AUNMP= <proc_1d>
##$AZFE= 0.1
##$AZFW= 0.1
##$BCFW= 0
##$BC_mod= 0
##$BYTORDP= 0
##$COROFFS= 0
##$CY= 12.5
##$DATMOD= 1
##$DC= 0
##$DFILT= <>
##$DTYPP= 0
##$F1P= 14.0000005364418
##$F2P= -0.99999901652339
##$FCOR= 0.5
##$FTSIZE= 32768
##$FT_mod= 6
##$GAMMA= 0
##$GB= 0
##$INTBC= 1
##$INTSCL= 1
##$ISEN= 128
##$LB= 0.3
##$LEV0= 0
##$LPBIN= 0
##$MAXI= 10000
##$MC2= 0
##$MEAN= 0
##$ME_mod= 0
##$MI= 0
##$NCOEF= 0
##$NC_proc= -3
##$NLEV= 6
##$NOISF1= 0
##$NOISF2= 0
##$NSP= 0
##$NTH_PI= 0
##$NZP= 0
##$OFFSET= 16.522
##$PC= 1
##$PHC0= 231.2213
##$PHC1= 8.400988
##$PH_mod= 1
##$PKNL= yes
##$PPARMOD= 0
##$PSCAL= 4
##$PSIGN= 0
##$REVERSE= no
##$SF= 250.13
##$SI= 32768
##$SIGF1= 0
##$SIGF2= 0
##$SINO= 400
##$SIOLD= 32768
##$SREGLST= <1H.CDCl3>
##$SSB= 0
##$STSI= 32768
##$STSR= 0
##$SW_p= 5175.98343685301
##$SYMM= 0
##$S_DEV= 0
##$TDeff= 65536
##$TDoff= 0
##$TI= <Analysis number 999999
Compound Code 99
Book Reference 9
Project Code 9>
##$TILT= no
##$TM1= 0
##$TM2= 0
##$TOPLEV= 0
##$USERP1= <user>
##$USERP2= <user>
##$USERP3= <user>
##$USERP4= <user>
##$USERP5= <user>
##$WDW= 1
##$XDIM= 32768
##$YMAX_p= 301852901
##$YMIN_p= -164141
$$ End of Bruker specific parameters
$$ ---------------------------------
##NTUPLES= NMR SPECTRUM
##VAR_NAME=  FREQUENCY,     SPECTRUM/REAL,   SPECTRUM/IMAG
##SYMBOL=    X,             R,               I
##VAR_TYPE=  INDEPENDENT,   DEPENDENT,       DEPENDENT
##VAR_FORM=  AFFN,          ASDF,            ASDF
##VAR_DIM=   32768,         32768,           32768
##UNITS=     HZ,            ARBITRARY UNITS, ARBITRARY UNITS
##FACTOR=    0.157963299565203, 1,           1
##FIRST=     4132.6476996994, 0,             0
##LAST=      -1043.33573715361, 0,           0
##MIN=       -1043.33573715361, -164141,     0
##MAX=       4132.6476996994, 301852901,     0
$$ Real data points
##PAGE= N=1
##DATA TABLE= (X++(R..R)), XYDATA
$$ [...]
23826e6697K697Q866k350m4160j3113K3744K8486M1311J2313J8996K5605m3374
$$ -56697 -54000 -45134 -47484 -91644 -104757 -81013 -52527 -11216 1097 20093 45698 2324
23814B324j4182Q350n4842n3731M9092K1981J324o822L1651k543K4778R414k8414
$$ 2324 -11858 -3508 -58350 -112081 -62989 -41008 -39684 -46506 -14855 -17398 7380 16794 -11620
23801a1620J593L4048P677j0705L160P685J1584k939L4346k3607k0193j6911r368
$$ -11620 -10027 24021 31698 20993 24153 31838 43422 40483 74829 51222 31029 14118 4750
23788D750K1996N7438o649o0080k0471l69K807J9280k5037k2004J6323K6500R188
$$ 4750 26746 84184 77535 17455 -3016 -3385 -578 18702 -6335 -28339 -12016 14484 23672
23775B3672q883L5125l6583N604k8523K0524k1943k6094N1668J1034J4403J4165
$$ 23672 14789 49914 13331 18935 -9588 10936 -11007 -37101 14567 25601 40004 54169
23763E4169m461m6674j1512L2976L786k9066o255k0470r386M6418j2601j085L065
$$ 54169 49708 3034 -8478 24498 28284 -782 -7037 -27507 -36893 9525 -3076 -4161 -1096
23750a096n098k652k9401m8391N3927j158K0620L4713K193k3787l782l2983J1015
$$ -1096 -6194 -8846 -38247 -86638 -32711 -33869 -13249 21464 23657 -130 -3912 -36895 -25880
23737b5880k3414K4411L2016J6987K8474P0674n1172q4529j1151J1753K362J4611
$$ -25880 -49294 -24883 7133 24120 52594 123268 72096 -12433 -23584 -11831 -9469 5142
23725E142J595q656O944m866r103k1921n214L0178m251j0315K5451L1306P327
$$ 5142 6737 -1919 5025 159 -8944 -30865 -36079 -5901 -10152 -20467 4984 36290 43617
23712D3617k6366k3366k0165J2241K008l4941J8052L5986J4470l418m5922m2257
$$ 43617 17251 -6115 -26280 -14039 -12031 -46972 -28920 7066 21536 18118 -27804 -70061
23700g0061P957J4262M3177O2331k2387l5822r116N0695O0788j2487m2600n7372
$$ -70061 -62104 -47842 -4665 57666 35279 -543 -9659 41036 101824 89337 46737 -10635
23688a0635m1563l195M583K4002j879j0955M361K163J3536M5057l5978l259m131
$$ -10635 -52198 -55393 -50810 -26808 -28687 -39642 -35281 -33118 -19582 25475 -10503 -13762 -17893
23675a7893L8575K2115n4126j4735N905l4362j2999K5805L92n258M1402M3228
$$ -17893 20682 42797 -11329 -26064 -20159 -54521 -67520 -41715 -41323 -46581 -5179 38049
23663C8049q731j0182k0893q86l093M4110M592k1970p099J0176K6977j0249m4845
$$ 38049 29318 19136 -1757 -2643 -5736 38374 42966 20996 13897 24073 51050 40801 -4044
23650d044J0004O547J9234j4438k4801l350L9674l8967j1783J2573R046M2973
$$ -4044 5960 12507 31741 17303 -7498 -10848 28826 -10141 -21924 -9351 -305 42668
23638D2668K3949k7493o0191J3621L9621m010Q956j5740K642R233k6753m6397
$$ 42668 66617 39124 -21067 -7446 32175 28165 37121 21381 24023 33256 6503 -39894
23626c9894L613K2974J8774L1812j073k1095j5004o0K7506L2235N323q1101j466
$$ -39894 -36281 -13307 5467 37279 36206 15111 107 47 27553 59788 65111 -15990 -17456
23613a7456n805K5296N2918j5887k3099m38J4058k3250J2148J6513m3069j6829
$$ -17456 -23261 2035 54953 39066 15967 15529 29587 6337 18485 34998 -8071 -24900
23601b4900j8620J4701N6485M1836N019l5255k9686k6951k2260j4590M471P8517
$$ -24900 -43520 -28819 27666 69502 74521 39266 9580 -17371 -39631 -54221 -49750 28767
23589B8767K6455K7912j8925l8516o1546j6772M7685l0k1879M0428j2576M819
$$ 28767 55222 83134 64209 25693 -35853 -52625 -4940 -4970 -26849 13579 1003 5822
23577E822l0244o008j6451J0325O994M882l8469L1106J9483J086K2612M8316k5081
$$ 5822 -24422 -30430 -46881 -36556 -29562 -24680 -63149 -32043 -12560 -11474 11138 59454 34373
23564C4373K0239N09n0054k7411K1586L3003J7158j599J5650N2659m1045o4155
$$ 34373 54612 55121 5067 -22344 -758 32245 49403 47804 63454 116113 75068 10913
23552A0913n5830l472L8657K8070j1756l848K208Q341K2270K001l1632r990N170
$$ 10913 -44917 -48389 -9732 18338 6582 2734 4942 13283 35553 37554 5922 -4068 1102
23539A102m2144j5105k3003J4160J393j697P2158O9976p384J3391k4443l531k0196
$$ 1102 -41042 -56147 -79150 -64990 -63597 -65294 6864 76840 69456 82847 58404 54873 34677
23526C4677j0320q255j7060k5390j0187L2781Q651J6892k560k8082r920L0473
$$ 34677 24357 16102 -958 -26348 -36535 -3754 4897 21789 19229 -8853 -18773 11700
23514A1700k2711l737k49p679k681k7294J3481J4417j9789N41L201l0734L352
$$ 11700 -11011 -14748 -14997 -22676 -25357 -52651 -39170 -24753 -44542 -44001 -40800 -71534 -68182
23501f8182J2054n633J2012L3992K6146L002P333K373j6232O841L6973m392K2657
$$ -68182 -56128 -61761 -49749 -15757 10389 13391 20724 23097 6865 13706 50679 46287 68944
23488F8944M052j3467K5424J446m2234L6044J6905o3245l2160l304K0741P003
$$ 68944 72996 59529 84953 86399 44165 80209 97114 33869 1709 -1595 19146 26149
23476B6149j334L0108N161k9485M953L2379O4672j4469q229j5474l1857q3337
$$ 26149 24815 54923 60084 30599 35552 67931 132603 118134 109905 94431 62574 -20763
23464b0763j8259J7083K45n810l1878k2160j4630K1645L7905K2766M3333k980
$$ -20763 -39022 -21939 -21694 -27504 -59382 -81542 -96172 -74527 -36622 -13856 29477 26497
23452B6497m5915P090L575K5558j5970n6491O430M995J3798R806j5790j1973L1149
$$ 26497 -19418 -12328 -8753 16805 835 -55656 -49226 -44231 -30433 -20627 -36417 -48390 -17241
23439a7241M9870J1747p863l8862N8013L2959l6641l2957k7289k6379J9533M4724
$$ -17241 32629 44376 36513 -2349 55664 88623 51982 19025 -8264 -34643 -15110 29614
23427B9614L6783m1820j328M914o374q647Q792k6840J8673j2896j5144R969l6230
$$ 29614 66397 24577 23249 28163 21789 13142 21934 -4906 13767 871 -14273 -4304 -40534
23414d0534l3140j7814L1840N6328L7072j4978l6680k0162M4164j3320j1108K2311
$$ -40534 -73674 -91488 -59648 -3320 33752 18774 -17906 -38068 6096 -7224 -18332 3979
23402C979J2343L7354J2329j1887k6426L8287L3103k9600l1652k408p051p230
$$ 3979 16322 53676 66005 54118 27692 65979 99082 69482 37830 35422 28371 21141
23390B1141k0030l1739l5462K5297J5237L281k8853j2430l329n001K7595K0386
$$ 21141 1111 -30628 -66090 -40793 -25556 -22275 -51128 -63558 -66887 -71888 -44293 -23907
23378b3907l659K4137m781P169J0595j5225J0425j0764J1121O2760J0536k5807
$$ -23907 -27566 -3429 -8210 -1041 9554 -5671 4754 -6010 5111 67871 78407 52600
23366E2600p953n4376l5132K6076K8284o359M336l724j0767k1749K4734j1940
$$ 52600 44647 -9729 -44861 -18785 9499 3140 7476 3752 -7015 -28764 -4030 -15970
23354a5970l374J2768L870j3713J6744J0783j0541m4534Q695L2838n797K9612
$$ -15970 -19344 -6576 -2706 -16419 325 11108 567 -43967 -35272 -2434 -8231 21381
23342B1381K0568R314j9195J610k399r960p798k979J393j2800l275m482N888Q237
$$ 21381 41949 51263 32068 33678 31279 21319 13521 10542 11935 -865 -4140 -8622 -2734 5503
23328E503j0287J1181J4303N363k711J7433j8285L352k683l515K3038n0011k072
$$ 5503 -4784 6397 20700 26063 23352 40785 22500 25852 23169 19654 42692 -7319 -9391
23315i391J6571J6161L2065l7583k9930l5536J9466j7176l2529K9099J7123k2945
$$ -9391 7180 23341 55406 17823 -12107 -47643 -28177 -45353 -77882 -48783 -31660 -54605
23303e4605M545J5519k1152k1891L2636L3759r952k798k6312K2035L043P589j4320
$$ -54605 -50060 -34541 -55693 -77584 -44948 -11189 -21141 -23939 -50251 -28216 -25173 -17584 -31904
23290c1904P812J9126J6554n271q138l035p559j1366L4941k7180j7716K7149O0509
$$ -31904 -24092 -4966 11588 6317 -1821 -4856 -12415 -23781 11160 -16020 -33736 -6587 53922
23277E3922K3120o6592k6889K2317J0464K74j9641k4794J1384k2470O533M8886
$$ 53922 77042 10450 -16439 5878 16342 16616 -3025 -27819 -16435 -38905 -32372 16514
23265A6514n613J2399K3514n6041j8258Q897M1552p708j9757n809m606o729j5538
$$ 16514 10901 23300 46814 -9227 -27485 -18588 22964 15256 -4501 -10310 -14916 -21645 -37183
23252c7183M1827N192j0042p1k3032M698J2982K8211k6311r099j0140k4860o370
$$ -37183 4644 9836 -206 -277 -23309 -18611 -5629 22582 -3729 -12828 -22968 -47828 -54198
23239e4198J5348L8832M1712N495J3567o950l5165l6043j1804m272J7177L412
$$ -54198 -38850 -18 41694 47189 60756 53806 18641 -17402 -29206 -33478 -16301 -12889
23227a2889p945M5059j0912l8246L3338K2938l6439n8932k3283K0918N0912M9811
$$ -12889 -20834 24225 13313 -24933 8405 31343 -5096 -64028 -87311 -66393 -15481 34330
23215C4330m3568m8790j3538K165J5748L1654J9538L4855M1750l8688j9067j6162
$$ 34330 -9238 -58028 -71566 -69401 -53653 -21999 -2461 32394 74144 35456 16389 227
23203B27n004K7164K2792J7594l7381j3318J7044j1935j6930k3598q856K8178
$$ 227 -4777 22387 45179 62773 25392 12074 29118 17183 253 -23345 -32201 -4023
23191d023O3366N608k8054l4920m188M4765K9612P932k3607n0238M438Q060J253
$$ -4023 59343 64951 36897 1977 -2211 42554 72166 80098 56491 6253 10691 18751 20004
23178B0004J2182J013l3091j3867m325q391J6725J0994K489K3545J6447L287j3095
$$ 20004 32186 33199 108 -13759 -18084 -26475 -9750 1244 3733 27278 43725 47012 33917
23165C3917o937l1446j4593L881N5187K7188k0467j7222J0233J9690P323l2896
$$ 33917 26980 -4466 -19059 -15178 40009 67197 46730 29508 39741 59431 66754 33858
23153C3858k8279J4303J708j5763P198L780q602k4869K7643J6278M997m0784j4989
$$ 33858 5579 19882 21590 5827 13025 16805 8203 -16666 10977 27255 32252 -8532 -23521
23140b3521k7553M1100J1909l4920O202L9374R645k3872K381j432p587L2559o984
$$ -23521 -51074 -9974 1935 -32985 -26783 12591 22236 -1636 745 -687 -8274 24285 17301
23127A7301n5585j5688M2982M5053O655M487k7763J9994J046l4089m6277q506
$$ 17301 -38284 -53972 -10990 34063 40718 45205 17442 37436 38482 4393 -41884 -50390
23115e0390L6482M3637r871p8004J6710J8687L6363l5525l7138L8323N6489N931
$$ -50390 -13908 29729 19858 -58146 -41436 -22749 13614 -21911 -59049 -20726 35763 41694
23103D1694k8190K4830K1176m957k7827n700k0608K3625j3860r748J2039l4770
$$ 41694 13504 38334 59510 54553 26726 21026 418 24043 10183 435 12474 -22296
23091b2296n1709J291P4040L0408K3264l0099j1931R603j444l3426j0932J9086
$$ -22296 -74005 -72714 1326 31734 54998 24899 12968 22571 21127 -12299 -23231 -4145
23079d145K2958N3809l8446l9063P89J5106K4893M917j730Q831N916J3879m1976
$$ -4145 18813 72622 34176 -4887 -4098 11008 35901 40818 39088 47919 53835 67714 25738
23066B5738j9719K4034k9243L3763l1417l5879j3286Q682K8945k0928K4402m160
$$ 25738 6019 30053 810 34573 3156 -32723 -46009 -37327 -8382 -29310 -4908 -9068
23054i068J4319m6133n9485Q731L3693M0231L5372K3319L361o450j5607M77j5519
$$ -9068 5251 -40882 -100367 -91636 -57943 -17712 17660 40979 44340 37890 22283 22760 7241
23041G241K4515Q431k4746j0020K5663J9939L2013m8913o7375M4893P8689j8776
$$ 7241 31756 40187 15441 5421 31084 51023 83036 34123 -33252 11641 90330 71554
23029G1554p5573k0711J8259k0879K4024N9808M9121k2230o0003j7871O819l351
$$ 71554 -4019 -24730 -6471 -27350 -3326 56482 105603 83373 23370 5499 12318 8967
23017H967k8284R25N6457Q852J0558o612l9157k8393L5711J6841l1597l9935K4487
$$ 8967 -19317 -18392 38065 46917 57475 50863 11706 -16687 19024 35865 4268 -35667 -11180
23004a1180N322K9213K1124L6687J2814n6770m7697J998K394K1593N3039M533
$$ -11180 -5858 23355 44479 81166 93980 37210 -10487 -8489 -6095 15498 68537 73070
22992G3070j9716o2032m5168K5256j92q513j4120K6018M0591K779k4475j5477
$$ 73070 53354 -8678 -53846 -28590 -28782 -37295 -51415 -25397 15194 17973 -6502 -21979
22980b1979M3715n046m7270m5652J167k2671J4809J5047j0523k0942J3391N4938
$$ -21979 21736 16690 -30580 -76232 -75065 -97736 -82927 -67880 -78403 -99345 -85954 -31016
22968c1016O4561J3089K9073K5598l7115n1795j347N491l1446j7278q566l213
$$ -31016 33545 46634 75707 101305 64190 12395 11048 16539 -14907 -32185 -40751 -43964
22956d3964M4017m9824k0466P1971O1558l8q637l0472P81j7514n0137K9354K8297
$$ -43964 53 -49771 -70237 1734 63292 63254 54617 24145 24926 7412 -42725 -13371 14926
22943A4926J0956k911p0003n8218q48j0034L8776K4658p686n331L2905M8075M8290
$$ 14926 25882 22971 -47032 -105250 -106098 -116132 -77356 -52698 -60384 -65715 -32810 15265 63555
22930F3555M387K7295K3522J090m0812o6255j1136j3987p191L8205J1200j0454
$$ 63555 67942 95237 118759 119849 79037 12782 1646 -12341 -19532 18673 29873 19419
22918A9419L663r001j1743K354L3380j1774J4164N399j9790j1916j0535j6279
$$ 19419 23082 14081 2338 4692 38072 26298 40462 45861 26071 14155 3620 -12659
22906a2659M66L7114K9637J9788j0995k4989j1673O109n1080j1188O577j5135
$$ -12659 -12193 24921 54558 74346 63351 38362 26689 32798 -18282 -29470 -22893 -38028
22894c8028P653J7057J0487j6961l2592n167k0880Q495L6066J6303J1585j7249
$$ -38028 -30375 -13318 -2831 -19792 -52384 -57551 -78431 -69936 -33870 -17567 -5982 -23231
22882b3231J8785l818k1344j9170k166R317O9393J6780k3332O780K1239k3664
$$ -23231 -4446 -8264 -29608 -48778 -50944 -41627 27766 44546 21214 27994 49233 25569
22870B5569n7190k9243K9468L8069k4712k966p101r472L5239K5348k4656J9571
$$ 25569 -31621 -60864 -31396 6673 -18039 -21005 -28106 -37578 -2339 23009 -1647 17924
22858A7924j0908j0523m965M0133M224K1057l1099o5944l7665M2081M900Q581
$$ 17924 7016 -3507 -8472 31661 35885 56942 25843 -40101 -77766 -35685 -30785 -22204
22846b2204J2825J0243k5385K6215N564j6721j7602l4786M1223J3609o277o0884
$$ -22204 -9379 864 -24521 1694 7258 -9463 -27065 -61851 -20628 -7019 -13296 -74180
22834g4180K2598J4664J3106J3624J1718k7170k6886K1331N4549l5193J666M9227
$$ -74180 -51582 -36918 -23812 -10188 1530 -25640 -52526 -31195 23354 -11839 -10173 39054
22822C9054J3888J3498O627j1169k0387j1418k7031J0448M833l3248J9262P988
$$ 39054 52942 66440 73067 61898 41511 30093 3062 13510 18343 -14905 4357 12345
22810A2345j6157P445j6907m8284j0869R648N2028L4282o512j9823L332k597Q52
$$ 12345 -3812 3633 -13274 -61558 -72427 -62779 -10751 23531 17019 -2804 528 -2069 -1217
22797a217Q139K0690J4638m4288o152K4592r745J7123K5180J3971P864l6933o2489
$$ -1217 6922 27612 42250 -2038 -8190 16402 6657 23780 48960 62931 70795 33862 -28627
22784b8627k7856j0155L9738J4L7491j2529P232j1184n2039l4157N676M7496L8496
$$ -28627 -56483 -66638 -26900 -26886 10605 -1924 5308 -5876 -57915 -92072 -86396 -38900 -404
22771d04L1512k0093n7874J953j1897K3328M2140K4181m838j5852K6965l2302
$$ -404 31108 11015 -46859 -44906 -56803 -33475 8665 32846 28008 12156 39121 6819
22759F819k4742L78J3311k2949L1520L0037N705l2945j6466J9000k9531J1778
$$ 6819 -17923 -17545 -4234 -27183 4337 34374 40079 7134 -9332 9668 -19863 -8085
22747h085p781k3597k0406K3689O7543L1720j2464m6000k8617j1952M610o127
$$ -8085 -15866 -39463 -59869 -36180 31363 63083 50619 4619 -23998 -35950 -31340 -37467
22735c7467J4119M0191K5456Pl0965J3856K1041J7096n565m1824p252j6935k8059
$$ -37467 -23348 16843 42299 42306 11341 25197 46238 63334 57769 15945 8693 -8242 -36301
22722c6301j9523N795N882M7835k0869j9633N4077J9960k1235r504j0819m5387
$$ -36301 -55824 -50029 -44147 3688 -17181 -36814 17263 37223 15988 6484 -4335 -49722
22710d9722l011R366l3498K1374J8151m3366p152J8651J4192l7620L586O5779
$$ -49722 -52733 -43367 -76865 -55491 -37340 -80706 -87858 -69207 -55015 -92635 -89049 -23270
22698b3270L4421l3904K2940M1107J1473l713J2986O56o712j7365m6806j9928
$$ -23270 11151 -22753 187 41294 52767 49054 62040 62696 55984 38619 -8187 -28115
22686b8115J4692K175L5018l4104j9093J6788J8643K838k8378k0425k2808p621
$$ -28115 -13423 -11248 23770 -10334 -29427 -12639 6004 8842 -19536 -39961 -62769 -70390
22674g0390Q626L0627M363n269j8472M5990M344k0784k2247J7983L6153j2198
$$ -70390 -61764 -31137 -26774 -32043 -50515 -4525 -181 -20965 -43212 -25229 10924 -1274
22662a274m2961J3621J7335o234K93K922k941l4416K4685N5318q372o633j1294
$$ -1274 -44235 -30614 -13279 -19513 -19220 -16298 -19239 -53655 -28970 26348 17976 11343 49
22649D9j341j5083L1068J5920n9706p158L2442j3587J9642K1631l3487J812l702
$$ 49 -1292 -16375 14693 30613 -29093 -36251 -3809 -17396 2246 23877 -9610 -7798 -11500
22636a1500k564J4673K2038l9724K2556O170L9k6143n3861j5218L4155N573j457
$$ -11500 -14064 609 22647 -17077 5479 11649 11688 -14455 -68316 -83534 -49379 -43806 -45263
22623d5263o103O228q087Q676k1072P718K4914J2976J7407K6193m5053l9420p372
$$ -45263 -51366 -45138 -53225 -44549 -65621 -57903 -32989 -20013 -2606 23587 -21466 -60886 -68258
22610f8258j874L3877M4082J7067l715l0284l1962j5141k6173L5478J7867l5376
$$ -68258 -70132 -36255 7827 24894 21179 -9105 -41067 -56208 -82381 -46903 -29036 -64412
22598f4412K8590l052K6172M0510j4345J1285L379m2706k2684q539l1373J3067
$$ -64412 -35822 -38874 -12702 27808 13463 24748 28127 -14579 -37263 -45802 -77175 -64108
22586f4108J4022j1999J4303l9391l544O7154K6131M422J5188M772l9829l7548
$$ -64108 -50086 -62085 -47782 -87173 -90717 -23563 2568 6990 22178 26950 -12879 -50427
22574e0427J1927k47j5665K3113m1649N009K6557M0270K8823l8765j5329J707
$$ -50427 -38500 -38747 -54412 -31299 -72948 -67939 -41382 -1112 27711 -11054 -26383 -24676
22562b4676o444L6845L411l812O7482K2064m0049o9967J1406J6121L3833j5532
$$ -24676 -31120 5725 9136 5324 72806 94870 54821 -15146 -3740 12381 46214 30682
22550C0682k7784k7761k038L0314J7398L5783J427k1509j2465k2670K9228r429
$$ 30682 2898 -24863 -26901 3413 20811 56594 58021 36512 24047 1377 30605 21176
22538B1176k9848j2467n485k3347J1725L292j3143K5109K4067K4346k6863m3285
$$ 21176 -8672 -21139 -26624 -49971 -38246 -34954 -48097 -22988 1079 25425 -1438 -44723
22526d4723K6089L073M555J1005K857k928p492l4468p583K9944q11J0594J6730
$$ -44723 -18634 -15561 -11006 -1 2856 -72 -7564 -42032 -49615 -19671 -20482 -9888 6842
22513F842O289n3741p459M4122m309m5433K9431p374l9166J9048L3855j2448J6815
$$ 6842 13131 -40610 -48069 -3947 -8256 -53689 -24258 -31632 -70798 -51750 -17895 -30343 -13528
22500a3528J8633J0256K0767q608j3401j731k8722K7851O759j8039j4861P79J1569
$$ -13528 5105 15361 36128 27520 14119 12388 -16334 11517 18276 237 -14624 -13845 -2276
22487b276K0837k6890K38n632M21j9370o991P545J5059J3116K8505J9948m7490
$$ -2276 18561 -8329 -8091 -13723 -13302 -32672 -39663 -32118 -17059 -3943 24562 44510 -2980
22474b980j0608j1431l1736k9046J7343K9486k8968K4727J5753O567j3563Q938
$$ -2980 -13588 -25019 -56755 -85801 -68458 -38972 -67940 -43213 -27460 -20893 -34456 -25518
22462b5518O738K3438N1430L0774r278j9090K3096k6007n7143P082j7323k5339
$$ -25518 -18780 4658 56088 86862 77584 58494 81590 55583 -1560 5522 -11801 -37140
22450c7140K5927o154k0336J2807P6023J673J3097k2523J2031q355m3550J6381
$$ -37140 -11213 -17367 -37703 -24896 51127 52800 65897 43374 55405 47050 3500 19881
22438A9881L8416q613j5012o579l6250j4111J5756L367k9094k6311K6585J3692
$$ 19881 58297 49684 34672 28093 -8157 -22268 -6512 -3145 -32239 -58550 -31965 -18273
22426a8273o620j7930L6315K4567l292r487l0241k0040Q190n769K5145M7055K9760
$$ -18273 -24893 -42823 -6508 18059 14767 5280 -24961 -45001 -36811 -42580 -17435 29620 59380
22413E9380m935n5198j4551J4785M858o093j711j0499m2157n536o84M9892J9326
$$ 59380 54445 -753 -15304 -519 4339 -1754 -3465 -13964 -56121 -61657 -62341 -12449 6877
22400F877j1242k1808J0172k1624k8237K3653n877J1961M1964J0916o566j7443
$$ 6877 -4365 -26173 -16001 -37625 -65862 -42209 -48086 -36125 5839 16755 10189 -7254
22388g254j1488Q678l431K7470R1860k3873l7982j8883J4934N480l6985L306m322
$$ -7254 -18742 -10064 -13495 13975 105835 81962 43980 25097 40031 45511 8526 11832 7510
22375G510P310O5861l3918l2682k4524l1267M162M853m0265j3046p886L7498J3731
$$ 7510 14820 80681 46763 14081 -10443 -41710 -37548 -32695 -72960 -86006 -93892 -56394 -42663
22362d2663K8931Q791j6080J4701L718r674q311L040J6278l3541J6482j1956r477
$$ -42663 -13732 -4941 -21021 -6320 -2602 -12276 -20587 -17547 -1269 -34810 -18328 -30284 -39761
22349c9761j3287l6328K1395L0487k4916J4888K4801K72K5482N2589J1241j487
$$ -39761 -53048 -89376 -67981 -37494 -62410 -47522 -22721 -22449 3033 55622 66863 65376
22337F5376m6058k6525L3890j914L748l662L620J4028o1243m9478o01L1099N0738
$$ 65376 19318 -7207 26683 24769 28517 24855 28475 42503 -18740 -68218 -68819 -37720 13018
22324A3018l4169n161M3129m178l112j7361M0203j5992n942J4409j7032K23m058
$$ 13018 -21151 -26312 16817 12639 9527 -7834 32369 16377 10435 24844 7812 8035 3977
22311C977K581k6423k6292l483J1829M6787J1730L7650k0996o4996j2332K428
$$ 3977 6558 -19865 -46157 -49640 -37811 8976 20706 58356 37360 -27636 -39968 -37540
22299c7540M8923J0559j3031n485N4636o617r942K6963j0708J6519l010j17j4906
$$ -37540 11383 21942 8911 3426 58062 51445 41503 68466 57758 74277 71267 71150 56244
22286E6244p623l103k0505k9926m4545J7005L1662m129K830J1229L4103N3535
$$ 56244 48621 45518 25013 -4913 -49458 -32453 -791 -4920 -2090 9139 43242 96777
22274I6777L543k9868l7529o7801l7208j6987J7348k7637m6730R918J412M9997
$$ 96777 100320 70452 32923 -34878 -72086 -89073 -71725 -99362 -146092 -136174 -134762 -84765
22262h4765K9790J4897K3792j6875j1495M618m9112k9421J9607L9591O4050L0942
$$ -84765 -54975 -40078 -16286 -33161 -44656 -40038 -89150 -118571 -98964 -59373 4677 35619
22250C5619K6478n837j2812J348k1797l3095k3525L3960L8346J2901j2836m595
$$ 35619 62097 56260 43448 44796 22999 -10096 -33621 339 38685 51586 38750 34155
22238C4155M743j8429l9798l6747n0612N2003N7185l4495k3000J3545L078J8348
$$ 34155 38898 20469 -19329 -56076 -106688 -54685 2500 -31995 -54995 -41450 -38372 -20024
22226b0024L5968K6705m7922l3623P818J1682J102K1013K6279l3343j5356M1497
$$ -20024 15944 42649 -5273 -38896 -31078 -19396 -18294 2719 28998 -4345 -19701 21796
22214B1796J0920l8349R332L1184K2458k6573k0875q828J9764J6413j8786m9354
$$ 21796 32716 -5633 3699 34883 57341 30768 9893 1065 20829 37242 18456 -30898
22202c0898k6607K5986K1174L6359k8691r172j4768K983M1800P953L918j131k0858
$$ -30898 -57505 -31519 -10345 26014 -2677 -11849 -26617 -23634 18166 26119 30037 28906 8048
22189H048k4458q680J0445k8266l1361P383k5744K2799J7104M230J2755q919L8646
$$ 8048 -16410 -25090 -14645 -42911 -74272 -66889 -92633 -69834 -52730 -48500 -35745 -44664 -6018
22176f018j7208j7479P5615K9498l386l0928L4223N26k4815j3883L3347q411m4008
$$ -6018 -23226 -40705 34910 64408 61022 30094 64317 64843 40028 26145 59492 51081 7073
22163G073l4646l0491j7345r904M2496L3687n209j0318P021L9158K478j7231j5096
$$ 7073 -27573 -58064 -75409 -85313 -42817 -9130 -14339 -24657 -17636 21522 24000 6769 -8327
22150h327J773K8586j0296o1307N091P0781K4492k5568j1860K6174m0447k0948
$$ -8327 -6554 22032 11736 -49571 -44480 26301 50793 25225 13365 39539 -908 -21856
22138b1856N0234J1871j5494r883J565k7079p458J7249O138j2919l7319O947K3715
$$ -21856 28378 40249 24755 14872 16437 -10642 -18100 -851 5287 -7632 -44951 -38004 -14289
22125a4289r008n4786J2673J116M5800O6369K355q2478j2158K2569J0291J3516
$$ -14289 -23297 -78083 -65410 -64294 -18494 47875 50230 -32248 -44406 -21837 -11546 1970
22113A970k5223j6002L1527L2064P978l882J9563n373k8337O865n045P8L765m4438
$$ 1970 -23253 -39255 -7728 24336 32314 28432 47995 42622 14285 21150 16105 16183 19948 -24490
22099b4490j2870L1016J0874m810K2545l4356j1825L0187N1655L6162m883o9800
$$ -24490 -37360 -6344 4530 -280 22265 -12091 -23916 6271 57926 94088 89205 19405
22087A9405n5705J1614L7646L7143q4l9172m6619m564j4442M0192L5593K1117
$$ 19405 -36300 -24686 12960 50103 50019 10847 -35772 -40336 -54778 -14586 21007 42124
22075D2124k290m6563m0945k1503K5851J1580r554L2818r419P555L4092K4253
$$ 42124 39834 -6729 -47674 -69177 -43326 -31746 -41300 -8482 -17901 -10346 23746 47999
22063D7999L797o658k6966q3R636J1231K4500j3626m3437J3806P011R179k7217
$$ 47999 51796 45138 18172 18089 27725 38956 63456 49830 6393 20199 27210 36389 9172
22050I172K184K5264J0827J7917k2276J5470n1976l5602K8412J8237O971k004
$$ 9172 11356 36620 47447 65364 43088 58558 6582 -29020 -608 17629 24600 22596
22038B2596J2992q56k9649Q385O1900j7404m8639L909M7333l0819k3847j0116
$$ 22596 35588 34732 5083 13468 75368 57964 9325 13234 60567 29748 5901 -4215
22026d215K7368k4358k9919q584k045j4190N0172N6041j1545j9463L2665j829
$$ -4215 23153 -1205 -31124 -39708 -41753 -55943 -5771 50270 38725 19262 51927 50098
22014E0098l8566J0021j1655m2088q984k0016L3286J6455j0290l921J4764m401
$$ 50098 11532 21553 9898 -32190 -41174 -61190 -27904 -11449 -21739 -25660 -10896 -15297
22002a5297L1817l5659l8796m522J5232j9801O53N3055M3203p837l663l2754l6465
$$ -15297 16520 -19139 -57935 -62457 -47225 -67026 -66373 -13318 29885 22048 18385 -14369 -50834
21989e0834n5196l6486J6314K5505K0079M4839K3345M1725O301l6891l4653K1341
$$ -50834 -106030 -142516 -126202 -100697 -80618 -35779 -12434 29291 35592 -1299 -35952 -14611
21977a4611m350n850k2539M040j2492J5801n0740J802M641J4880M4045N2970L1985
$$ -14611 -18961 -24811 -47350 -43310 -55802 -40001 -90741 -88939 -84298 -69418 -25373 27597 59582
21964E9582j4101n4351k7705k3164J8216L58j6563L1446o73K3948J5597k1165
$$ 59582 45481 -8870 -36575 -59739 -41523 -41165 -57728 -26282 -26955 -3007 12590 -8575
21952h575k7991J5093p077K090K971l0472l8892J2757L2158j3268L878J3469K0662
$$ -8575 -36566 -21473 -28550 -26460 -23489 -53961 -92853 -80096 -47938 -61206 -57328 -43859 -23197
21939b3197M3952j962l4926K2130k2583l3012q107j1344N798J0690O5900r968
$$ -23197 20755 18793 -16133 5997 -16586 -49598 -57705 -69049 -63251 -52561 13339 3371
21927C371l8192q048m663J4833M0842J1166R21k8733N5601K8003m3864k8169j5573
$$ 3371 -34821 -42869 -47532 -32699 8143 19309 20230 -8503 47098 75101 31237 3068 -12505
21914a2505j1589J5581L4364L8578j4450N841j0467k7759L4412k455L9504J4981
$$ -12505 -24094 -8513 25851 64429 49979 55820 45353 17594 52006 49551 89055 104036
21902A04036p0427l5301J859j1508K1016K1566L1877L2331k5719j4147K8238l3760
$$ 104036 33609 -1692 167 -11341 9675 31241 63118 95449 69730 55583 83821 50061
21890E0061k7475K8325J9948R447m2300m1532j5796K4992P2584k2140l1225L832
$$ 50061 22586 50911 70859 80306 38006 -3526 -19322 5670 78254 56114 24889 28721
21878B8721l4444P311j5496Q245Q523K3114n819j5779M549J634N023j3318l8013
$$ 28721 -5723 1588 -13908 -5663 2860 25974 20155 4376 8925 10559 15582 2264 -35749
21865c5749l0924J6775K2960K5151q905q870j4704p509P502O6385L4472J8361
$$ -35749 -66673 -49898 -26938 -1787 -10692 -19562 -34266 -41775 -34273 32112 66584 84945
21853H4945k7389k5735k1403j9311N341l8163J2590J7637L1317M201k8839K2794
$$ 84945 57556 31821 10418 -8893 -3552 -41715 -29125 -11488 19829 24030 -4809 17985
21841A7985N0064q75l0134k7198j3650J6421j8632M479J7l3087n8245K197K2881
$$ 17985 68049 67174 37040 9842 -3808 12613 -6019 -1540 -1523 -34610 -92855 -90658 -67777
21828f7777k984K6552J1688j4329M1147R741k9468n037L6155J74K900j5585j3489
$$ -67777 -70761 -44209 -32521 -46850 -5703 4038 -25430 -30467 5688 5862 8762 -6823 -20312
21815b0312L5153J2130J5854l0734k0129j0312j244L2887l564Q561n500l5863
$$ -20312 14841 26971 42825 12091 -8038 -18350 -19594 13293 9729 18290 12790 -23073
21803b3073J7771j8753j6376J5200j3155J2224k276L1275m413n313Q916j1368
$$ -23073 -5302 -24055 -40431 -25231 -38386 -26162 -28438 2837 -1576 -6889 2027 -9341
21791i341J685P4420R109l6748k2941M0248J0662P752J2565m2498l0484m0762
$$ -9341 -7656 66764 75873 39125 16184 56432 67094 74846 87411 44913 14429 -26333
21779b6333k9860J2071P250L897L2321N3246j3504p0024q657K1602k1745K7477
$$ -26333 -56193 -44122 -36872 -32975 -654 52592 39088 -30936 -39593 -17991 -39736 -12259
21767a2259K7178Q300l6154l6222k1487p385K215J5420N0180L2244j9667l181
$$ -12259 14919 23219 -12935 -49157 -70644 -78029 -75814 -60394 -10214 22030 2363 -818
21755h18J71J4594R432J802J3528L0979j5011j9968k611O82m4069Q556k4962L2413
$$ -818 -647 13947 23379 25181 38709 69688 54677 34709 32098 32780 -11289 -2733 -27695 4718
21741D718N0473K764k2416j6622K78m7709o588l0689j2635K2813K3248j52j4561
$$ 4718 55191 57955 35539 18917 19195 -28514 -35102 -65791 -78426 -55613 -32365 -32517 -47078
21728d7078N1745l345j6952J9084l1004L1033O838J4359l8096k4350k171M608
$$ -47078 4667 1322 -15630 3454 -27550 3483 10321 24680 -13416 -37766 -39937 -35329
21716c5329k0785O7491O570l8191l5669J2000O020j573m683N2466J3822K3642
$$ -35329 -56114 11377 17947 -20244 -55913 -43913 -37893 -39466 -44149 8317 22139 45781
21704D5781p16j9338O565j6873j3081K6191j2092m5147P807O370l1639n211J7382
$$ 45781 45065 25727 32292 15419 2338 28529 16437 -28710 -20903 -14533 -46172 -51383 -34001
21691c4001L5129n649q711J8380L4735k2866K3419K7037m13j5031k4171p070J0439
$$ -34001 1128 -4521 -13232 5148 39883 17017 40436 67473 67060 52029 27858 20788 31227
21678C1227J6622q985l905l3733P864O517K8564L691k2092j3088k823l5404l2025
$$ 31227 47849 38864 34959 1226 9090 15607 44171 47862 25770 12682 9859 -25545 -57570
21665e7570n0129j7384L3888L7535M5439K9409o007k1918l3407M4405K5270q804
$$ -57570 -107699 -125083 -91195 -53660 -8221 21188 15181 -6737 -40144 4261 29531 20727
21653B0727j80m0480j3715R331J452M9079j0427j929J132n5696n981N7921M0607
$$ 20727 20547 -19933 -33648 -24317 -22865 26214 15787 13858 14990 -40706 -46687 11234 51841
21640E1841N016k50L0415j9132j9821n0n649j081l7478j9937J3937K8326K42m786
$$ 51841 56857 56607 87022 67890 48069 48019 42370 41289 3811 -16126 -2189 26137 26379 21593
21626B1593k9508m1043L519L7393M6802Nl4883m1181K3625L363k3630N580J9596
$$ 21593 -7915 -48958 -45439 -8046 38756 38761 3878 -37303 -13678 -10315 -33945 -28365 -8769
21613h769L895j5747k7184o003L5302j549j2153K565l3369L72o232l5088k4966
$$ -8769 -4874 -20621 -47805 -53808 -18506 -20055 -32208 -29643 -63012 -62640 -68872 -103960 -128926
21600a28926K6854K0379L6394O450L938K4354m925k7608j5132J7546q106K3718
$$ -128926 -102072 -81693 -45299 -38849 -34911 -10557 -15482 -43090 -58222 -40676 -48782 -25064
21588b5064L350j4633L2742q074k2356L7276J7019l545l7062K5804J8706j8601
$$ -25064 -21714 -36347 -3605 -11679 -34035 3241 20260 16715 -20347 5457 24163 5562
21576E562j1033L674j1533j2982j1732L7850O502k5917L043q554J7603k856j3586
$$ 5562 -5471 -1797 -13330 -26312 -38044 -194 6308 -19609 -16566 -25120 -7517 -10373 -23959
21563b3959l005q287L5948p852K890k2908L4167j360r559j7497l67N0659M0251
$$ -23959 -26964 -35251 697 -7155 -4265 -27173 6994 5634 -3925 -21422 -21789 28870 69121
21550F9121l5811j419J1634j5190J2840J756p098k3709n9705l7174r17L8718L8503
$$ 69121 33310 31891 43525 28335 41175 42931 35833 12124 -47581 -84755 -85672 -46954 -8451
21537h451l1210k8191M1192L1196k1440K641K974Q037l671j6474K1138K8000l3427
$$ -8451 -39661 -67852 -26660 4536 -16904 -14263 -11289 -3252 -6923 -23397 -2259 25741 -7686
21524g686J1958J3942j448k2795k867J1159J3050j622j6279n099j2832j0738K4187
$$ -7686 4272 18214 16766 -6029 -8896 2263 15313 13691 -2588 -7687 -20519 -31257 -7070
21511g070J9836Q554j8605m3992L601J1582M679M9322k724j0837K1599k0078J2141
$$ -7070 12766 21320 2715 -41277 -37676 -26094 -21415 27907 25183 14346 35945 15867 28008
21498B8008K1220k3405l7971L1632K9739k3387l3628K728L4590j6654m7068P594
$$ 28008 49228 25823 -12148 19484 49223 25836 -7792 -5064 29526 12872 -34196 -26602
21486b6602J3072m1N875o258Q786M4894J9673l6029K6609K790k5114m0380k7508
$$ -26602 -13530 -13571 -7696 -13954 -5168 39726 59399 23370 49979 52769 27655 -12725 -40233
21473d0233P625P7136J3094m4987k2799p630K6060l5916J6627K958m5422m112
$$ -40233 -32608 44528 57622 12635 -10164 -17794 8266 -27650 -11023 -8065 -53487 -57599
21461e7599J5591L2540J4077p964J426L7350r778k3689m198L2630K5110K0823
$$ -57599 -42008 -9468 4609 -3355 -1929 35421 25643 1954 -2244 30386 55496 76319
21449G6319R325j4869n2395q317J8611L5999j7620j8870k1810k9051n712j8121
$$ 76319 85644 70775 18380 10063 28674 64673 47053 28183 6373 -22678 -28390 -46511
21437d6511j5479K3888k0060K3263L7056j4180k6538J5089J9672k1599N459M9180
$$ -46511 -61990 -38102 -58162 -34899 2157 -12023 -38561 -23472 -3800 -25399 -19940 29240
21425B9240J2879l521j8391j8208L0899l863R936L0654n1163p649n275m1881j3143
$$ 29240 42119 38598 20207 1999 32898 29035 38971 69625 18462 10813 5538 -36343 -49486
21412d9486M1654j4543q812P726N048r029J6363M14K90K8899L799j1827J4853
$$ -49486 -7832 -22375 -31187 -23461 -18413 -27442 -11079 -10665 -10375 18524 22323 10496 25349
21399B5349j2383n0595n0634J1998L3274J7774j2856J453K9018L9243K430k0532
$$ 25349 12966 -37629 -88263 -76265 -42991 -25217 -38073 -36620 -7602 31641 34071 13539
21387A3539J4067M624n9827k150n0325j0079L2959L6185J2190L0994k0001k8780
$$ 13539 27606 32230 -27597 -29747 -80072 -90151 -57192 -21007 -8817 22177 2176 -26604
21375b6604K1222N0884o150M3966q921m6652J4258j6333J0171J5620L804n466
$$ -26604 -5382 45502 39352 83318 74397 27745 42003 25670 35841 51461 55265 49799
21363D9799q968n909m3902l1411L778p652J8365J8484j4700J1406J0334O579J2583
$$ 49799 40831 34922 -8980 -40391 -36613 -44265 -25900 -7416 -22116 -10710 -376 6203 18786
21350A8786L7560M4738l1576l2769r127k4644j2982K6944J2902j7604J4430k5830
$$ 18786 56346 101084 69508 36739 27612 2968 -10014 16930 29832 12228 26658 828
21338H28l7512j1639K2919L8102J3805m541J3900j6467j4430K2776j833q058k242
$$ 828 -36684 -48323 -25404 12698 26503 21962 35862 19395 4965 27741 25908 17850 15608
21325A5608J6980L4005o04m6704k2469l244l5585k1756L2779O173K570K0268J6325
$$ 15608 32588 66593 65989 19285 -3184 -6428 -42013 -63769 -30990 -24817 -22247 -1979 14346
21312A4346j6065n312O44Q159q16J1200o885j3248j9267O645N041L3023k0680
$$ 14346 -1719 -7031 -6387 1772 956 12156 5271 -7977 -27244 -20599 -15558 17465 -3215
21299c215m9359N419k0237J4736K9752j6562j3896Q554J1684l716j3128L8896
$$ -3215 -52574 -47155 -67392 -52656 -22904 -39466 -53362 -44808 -33124 -36840 -49968 -11072
21287a1072k3752j3742O636J7043J1525j2693J4184L919K776J1006Q282J9934
$$ -11072 -34824 -48566 -41930 -24887 -13362 -26055 -11871 -7952 -5176 5830 14112 34046
21275C4046l4226l4695j676k7697J5857L8847K589Q31J2356m195J8414l8779J4074
$$ 34046 -180 -34875 -36551 -64248 -48391 -9544 -6955 -6124 6232 2037 20451 -18328 -4254
21262d254k5933k3345L1411l2295L4958N9938K5710o9096j7293K1868M124K0894
$$ -4254 -30187 -53532 -22121 -54416 -19458 40480 66190 -2906 -20199 1669 5793 26687
21250B6687k0389j8648j4908j116P158R118M7691J5327K570k6363K5855k840l3823
$$ 26687 6298 -12350 -27258 -28374 -21216 -12098 35593 50920 53490 27127 52982 50142 16319
21237A6319l0183k4410q725N7747M0658k1892l5546o1258k5429K0829J0074P478
$$ 16319 -13864 -38274 -46999 10748 51406 29514 -6032 -67290 -92719 -71890 -61816 -54338
21225e4338K3261J5131K9358O388n187O202O461j5724l7591J2658K8948k0392
$$ -54338 -31077 -15946 13412 19800 14613 20815 27276 11552 -26039 -13381 15567 -4825
21213d825j3689L5738j3622r401L2318J4552k242q2945l6793l1920n1312M998
$$ -4825 -18514 17224 3602 -5799 26519 41071 38829 -44116 -80909 -112829 -164141 -159143
21201a59143R0801P7451L3848O8830K1385m1164j3813m1395L0596K450n4247L29
$$ -159143 -68342 9109 42957 111787 133172 92008 78195 36800 67396 69846 15599 15928
21189A5928j4570Q635M049K5127o541k8614m547j3168K9059J3137k5104K7482
$$ 15928 1358 9993 14042 39169 32628 4014 -533 -13701 15358 28495 3391 30873
21177C0873J340o050k3873l7229j974j0938K8316K7713J2882k87J7608n1211m2733
$$ 30873 32213 26163 2290 -34939 -36913 -47851 -19535 8178 21060 20773 38381 -12830 -55563
21164e5563J6510k95K6609k2219j8765Q326k6773q778n567N0325L3004l1303l1874
$$ -55563 -39053 -39348 -12739 -34958 -53723 -45397 -72170 -80948 -86515 -36190 -3186 -34489 -66363
21151f6363K533j3293K0455M1783L4335M008j8588l6308m071Q383j6491m0198
$$ -66363 -63830 -77123 -56668 -14885 19450 23458 4870 -31438 -35509 -27126 -43617 -83815
21139h3815J1211K4556J6430j5448k6178J0252O768K6258K3262L2846J8827k427
$$ -83815 -72604 -48048 -31618 -47066 -73244 -62992 -56224 -29966 -6704 26142 44969 42542
21127D2542p903k7599l543j3028j8872p511L2434J1331l3410j3900L3319P475
$$ 42542 34639 7040 3497 -9531 -28403 -35914 -3480 7851 -25559 -39459 -6140 1335
21115A335n5485R147K3978j8667l944Q768M4378M6109O297n1629K04J3085l8510
$$ 1335 -54150 -45003 -21025 -39692 -43636 -34868 9510 55619 61916 10287 10491 23576 -14934
21102a4934k2744J4177J3176K1443M5987L3056k020m5915m0077J3931J1574K7302
$$ -14934 -37678 -23501 -10325 11118 57105 90161 88141 42226 2149 16080 27654 54956
21090E4956m7952Q053K270r65k190j5538J4789K0891M0191j2504m8344l7283o870
$$ 54956 7004 15057 17327 16362 14172 -1366 13423 34314 74505 62001 13657 -23626 -30496
21077c0496J4765K0599P560J3338K2335k6505m1036j1773K0542L9631J5758j7481
$$ -30496 -15731 4868 12428 25766 48101 21596 -19440 -31213 -10671 28960 44718 27237
21065B7237k8266P625M232l7007l403n324J5321M1734K1516l337J851m9010k7562
$$ 27237 -1029 6596 10828 -26179 -29582 -34906 -19585 22149 43665 40328 42179 -6831 -34393
21052c4393q514j5599J2234L4134J0106L8034K8584m2594q256o482j0479J0994
$$ -34393 -42907 -58506 -46272 -12138 -2032 36002 64586 21992 13736 7254 -3225 7769
21040G769M5534m6637p2866l542L1525J279j6269L8965l678o465k5231K9979J3076
$$ 7769 53303 6666 -66200 -69742 -38217 -36938 -53207 -14242 -17920 -24385 -49616 -19637 -6561
21027f561n977j0574M3535L5376l5299n0035q235L3954K138Q346K1538K606k4845
$$ -6561 -12538 -23112 20423 55799 20500 -29535 -37770 -3816 -1678 6668 28206 30812 5967
21014E967r392j4511j7173J7245M091J4619J5905J306L2133j758m5820k0413q05
$$ 5967 -3425 -17936 -35109 -17864 -13773 846 16751 18057 50190 48432 2612 -17801 -18606
21001a8606J4754J1675j1539J747p378j4935N1807j1709P026l7508m6006j6754
$$ -18606 -3852 7823 -3716 -1969 -9347 -24282 27525 15816 22842 -14666 -60672 -77426
20989g7426k1399K7062K0341K5177L4764N4476n914m1996M09M124p094j790J7126
$$ -77426 -98825 -71763 -51422 -26245 8519 62995 57081 15085 15494 19618 12524 10734 27860
20976B7860q914o0485j0094N5734K9714J7861j8659M719l256p4599o327J9858
$$ 27860 18946 -41539 -51633 4101 33815 51676 33017 37736 34480 -40119 -46446 -26588
20964b6588J9280K0153o722J8199K8015k9117l4822m2569L8968M4760K0659j2109
$$ -26588 -7308 12845 6123 24322 52337 23220 -11602 -54171 -15203 29557 50216 38107
20952C8107J4022j709l2117m6573j0767K8346K7803P927j364k1306k0384k6570
$$ 38107 52129 50420 18303 -28270 -39037 -10691 17112 25039 23675 2369 -18015 -44585
20940d4585J1592l413j5757L5837M6499L0079O283q46n3671J2822J5678J5471
$$ -44585 -32993 -36406 -52163 -16326 30173 60252 66535 65689 12018 24840 40518 55989
20928E5989Q406l5938k2830k0675l4750j3632n932K3310J5158r205N249k0017
$$ 55989 64395 28457 5627 -15048 -49798 -63430 -69362 -46052 -30894 -40099 -34850 -54867
20916e4867O335Q259L014k8405k8626K0449L1645L9020j7425J5803j2016j1313
$$ -54867 -48532 -40273 -37259 -65664 -94290 -73841 -42196 -3176 -20601 -4798 -16814 -28127
20904b8127P76M6551M5117j2394J0230O296l1509k7175q676r104N6508J6661j7192
$$ -28127 -27351 19200 64317 51923 62153 68449 36940 9765 1089 -8015 48493 65154 47962
20891D7962l8840n0272L2845K1223j5661k3416J4749q505J3307K9671k0609j7024
$$ 47962 9122 -41150 -8305 12918 -2743 -26159 -11410 -19915 -6608 23063 2454 -14570
20879a4570K1749N517r984M5919J4256k0975R287k1179o1346J4637J7797k3502
$$ -14570 7179 12696 2712 48631 62887 41912 51199 30020 -31326 -16689 1108 -22394
20867b2394P56J2203J3954J8814k2678l5649k8475l5967J3136M3726L1847R543
$$ -22394 -21638 -9435 4519 23333 655 -34994 -63469 -99436 -86300 -42574 -10727 -1184
20855a184l5574N306J5797j7462L654K629l1762Q655L908L0803P222J3578l2265
$$ -1184 -36758 -31452 -15655 -33117 -29463 -26834 -58596 -49941 -46033 -15230 -8008 5570 -26695
20842b6695q618J5266N965N420m5927j8318O0984o147l5225K6687L2346J8500
$$ -26695 -35313 -20047 -14082 -8662 -54589 -72907 -11923 -18070 -53295 -26608 5738 24238
20830B4238K1562r198j6579J5501r40m0844l0653j8314r483L137K5231L5929M0309
$$ 24238 45800 36602 20023 35524 34584 -6260 -36913 -55227 -64710 -61573 -36342 -413 39896
20817C9896j1417j4332N296J4470j3261l757l2885n4324K3672O085L2607k3705
$$ 39896 28479 14147 19443 33913 20652 16895 -15990 -70314 -46642 -40557 -7950 -31655
20805c1655o6131k1708K5595N0458J9346L6565J7111j7733L5421j0092J0724J4824
$$ -31655 -97786 -119494 -93899 -43441 -24095 12470 29581 11848 47269 37177 47901 62725
20793F2725j0888l9149l876m1856l2849o357L3097L5301K0232K1692L6319n366
$$ 62725 51837 12688 8812 -33044 -65893 -72250 -39153 -3852 16380 38072 74391 69025
20781F9025o5636l3677r840P52L1173K4305R926K876j3171l2988m1100Q055M5165
$$ 69025 3389 -30288 -40128 -39376 -8203 16102 26028 28904 15733 -17255 -58355 -50300 -5135
20768e135J5038j8849J717j2122L0312N4018r430j1691p591k1590K4606q065p199
$$ -5135 9903 -8946 -7229 -19351 10961 64979 55549 43858 36267 14677 39283 31218 24019
20755B4019l2338k7970k5002K2315M4493K6507k1713j7789R118J0348o867k3993
$$ 24019 -8319 -36289 -61291 -38976 5517 32024 10311 -7478 1640 11988 5121 -18872
20743a8872j9792L3770K5807j6633k964K2776K75n852m3113L2135J8301j7715
$$ -18872 -38664 -4894 20913 4280 1316 24092 24367 18515 -24598 7537 25838 8123
20731H123J0148K1070J0038L6075p44j5752k9379n8710j7509q236j8439j9253
$$ 8123 18271 39341 49379 85454 84710 68958 39579 -19131 -36640 -44876 -63315 -82568
20719h2568k3824J1640Q2133K5630J594K7495L8587j6740P749k3558j5569J9649
$$ -82568 -106392 -94752 -12619 13011 14605 42100 80687 63947 71696 48138 32569 52218
20707E2218L2580K794j7162j5258n3320K3089J9356m0991m6063L0430R08J6757
$$ 52218 84798 87592 70430 55172 1852 24941 44297 3306 -42757 -12327 -11419 5338
20695E338L9271k4401l4818K2523m794K4789P856L2480l290l3790k3454j8536
$$ 5338 44609 20208 -14610 7913 3119 27908 35764 68244 64954 31164 7710 -10826
20683a0826N16Q0m0374j0659M4010O282J2397N3489J1153P660l4255j8409m44
$$ -10826 -10310 -10230 -50604 -61263 -17253 -10971 1426 54915 66068 73728 39473 21064 20620
20670B0620l2784j1891K6545M1406j731j1409j4690k6448j0262L2461l5694m756
$$ 20620 -12164 -24055 2490 43896 42165 30756 16066 -10382 -20644 11817 -23877 -28633
20658b8633L0823K5459k2312M170k1100l2295r965N246K9024q977N511J7313k8745
$$ -28633 2190 27649 5337 9507 -11593 -43888 -53853 -48607 -19583 -28560 -23049 -5736 -34481
20645c4481M089K8097M3J2130m3726j0602J0498j3903j9883Q3J8792N6959N0385
$$ -34481 -30392 -2295 -2252 9878 -33848 -44450 -33952 -47855 -67738 -67655 -48863 8096 58481
20632E8481k2894j2291p0028k0313L3756K0803J2646K0933K219Q525m9732j2364
$$ 58481 35587 23296 -46732 -67045 -33289 -12486 160 21093 23312 31837 -17895 -30259
20620c0259R405j5557j5200n193J6536P121K032j1989L1484J0938j3003p79j3144
$$ -30259 -20854 -36411 -51611 -56804 -40268 -33147 -31115 -43104 -11620 -682 -13685 -14464 -27608
20607b7608k4699j5715O086j1245p964K4871M6273P3338M9920J496o250n8799
$$ -27608 -52307 -68022 -61936 -73181 -81145 -56274 -10001 63337 113257 114753 108503 49704
20595D9704m7439k6255K5740q564J1131m2098J5422J7966O0311L5333l1919J3037
$$ 49704 2265 -23990 1750 -6814 4317 -37781 -22359 -4393 55918 91251 59332 72369
20583G2369L420q4328k8258J2704L3963O441P8p413j1767J7415P6306Q58m3051
$$ 72369 75789 -8539 -36797 -24093 9870 16311 16389 8976 -2791 14624 90930 91788 48737
20570D8737n6333p277k6087K1822O27L0068L9296j8878J169J6106j5704k0301
$$ 48737 -7596 -14873 -40960 -19138 -18511 11557 50853 31975 33144 49250 33546 13245
20558A3245J7883L4556K8649L0261O291j6271m6803k2183j3678l4913Q818K5943
$$ 13245 31128 65684 94333 124594 130885 114614 67811 45628 31950 -2963 5855 31798
20546C1798j7095m7879J0163N817L7974K1523j8322J7784K4221j2811p929m83
$$ 31798 14703 -33176 -23013 -17196 20778 42301 23979 41763 65984 53173 45244 44761
20534D4761K2276k3958n6539l8846N1004M9271J0833k6952l0591l2895r258k3850
$$ 44761 67037 43079 -13460 -52306 -1302 47969 58802 31850 1259 -31636 -40894 -64744
20522f4744M887K0474o373m2545J2414M755K8579K1666J4593l3666k876K0611
$$ -64744 -59857 -39383 -45756 -88301 -75887 -71132 -42553 -20887 -6294 -39960 -42836 -22225
20510b2225l366m1034k320J6224J150r623l4307P605L9290K5618K2284K0407L1820
$$ -22225 -25591 -66625 -68945 -52721 -51571 -61194 -95501 -87896 -48606 -22988 -704 19703 51523
20497E1523m1793m2008L5417J4345J9371K243K5985k0437l1852k848J6277M3325
$$ 51523 9730 -32278 3139 17484 36855 39098 65083 44646 12794 9946 26223 69548
20485F9548O939m9346j6848L6583M6207K4868o1701l9125K6679P999k3584j8308
$$ 69548 76487 27141 10293 46876 93083 117951 56250 17125 43804 51803 28219 9911
20473I911J068k7277m4478j2397J7274q933j7903L3699L4623K0495j4899n504
$$ 9911 10979 -16298 -60776 -73173 -55899 -64832 -82735 -49036 -14413 6082 -8817 -14321
20461a4321k0863N7441J1511m44j3644K088N3584J2513j7662o0360k8037p669
$$ -14321 -35184 22257 33768 33324 19680 21768 75352 87865 70203 9843 -18194 -25863
20449b5863j2077Q525J7712R320q674p392l598J706J321P441k8359p046N0524
$$ -25863 -37940 -29415 -11703 -2383 -11057 -18449 -22047 -20341 -19020 -11579 -39938 -46984 3540
20436C540M4849l2754l5662j719r472K1896J8201m005m568R998j9126j65K1413
$$ 3540 48389 15635 -20027 -21746 -31218 -9322 8879 4874 306 10304 -8822 -8987 12426
20423A2426q857m47K5958J8802P238k5242k1997K9183J749n9556k1207j5905j7577
$$ 12426 3569 3122 29080 47882 55120 29878 7881 37064 38813 -20743 -41950 -57855 -75432
20410g5432j65l301O878P5682N713J1932k3193o346l101j9267l4499k931N1083
$$ -75432 -75597 -78898 -72020 3662 9375 21307 -1886 -8232 -11333 -30600 -65099 -68030 -16947
20397a6947K8165J8753m9636l3922L7815K0922J2516k9945k2078L4554M3680Q683
$$ -16947 11218 29971 -19665 -53587 -15772 5150 17666 -12279 -34357 197 43877 52560
20385E2560l4945J1635l3095q7379m744N0953K9593K2842K4390N4375J784l8772
$$ 52560 17615 29250 -3845 -91224 -95968 -45015 -15422 7420 31810 86185 87969 49197
20373D9197o2890p641j4228J8419M6233L9566l4950k2185R5O841j3147J7965L9633
$$ 49197 -13693 -21334 -35562 -17143 29090 68656 33706 11521 11616 18457 5310 23275 62908
20360F2908r568p442n7312k196J4185j0845M1015J7997n5333P229p927j2141K1954
$$ 62908 53340 45898 -11414 -13610 575 -10270 30745 48742 -6591 638 -7289 -19430 2524
20347B524K4641j8942m802k7697p293J5103j106n82o848k2537j0603R586K3259
$$ 2524 27165 8223 3421 -24276 -31569 -16466 -17572 -18154 -25002 -47539 -58142 -48556 -25297
20334b5297K7551l5044J0750J0812M96K4732j2264o674L4902n413Q585L3343j6457
$$ -25297 2254 -32790 -22040 -11228 -10732 14000 1736 -4938 29964 24551 33136 66479 50022
20321E0022p241L232N352o171J3992n7780K474J464q37j7760n567K7502J0170
$$ 50022 42781 46013 51365 45194 59186 1406 3880 5344 4507 -13253 -18820 8682 18852
20308A8852k9168N964m219K020J8182K8509K2853k8874J7436N689j4411l0022
$$ 18852 -10316 -4352 -8571 -6551 11631 40140 62993 34119 51555 57244 42833 12811
20296A2811m1483j3910J419l8103N97L2426j5425j3954O2045J1172L1855m298
$$ 12811 -28672 -42582 -41163 -79266 -78669 -46243 -61668 -75622 -13577 -2405 29450 25152
20284B5152Q755n76L2218l628k607k0511l4808m5765l0328K8522L016J4393L2035
$$ 25152 33907 33331 65549 61921 59314 38803 3995 -41770 -72098 -43576 -40560 -26167 5868
20271E868J3906J1693N4775K2339m0268j1641J9730k4191K060l6792k5722r36
$$ 5868 19774 31467 86242 108581 68313 56672 76402 52211 54271 17479 -8243 -9179
20259i179n975j1518q112K8184J1826k3131o922J5948k8287j6477O1307L8374
$$ -9179 -15154 -26672 -34784 -6600 5226 -17905 -24827 -8879 -37166 -53643 7664 46038
20247D6038J399m117K8046J0796m5032J0125j7402q083l3674j550M058J9025k2479
$$ 46038 47437 43320 71366 82162 37130 47255 29853 21770 -11904 -13454 -9396 9629 -12850
20234a2850n7186L3691M3944m463K2997l476J156K1993K5969m5072q885k6884
$$ -12850 -70036 -36345 7599 3136 26133 22657 23813 45806 71775 26703 17818 -9066
20222i066j7116o229K917M164k0768R7N889J7835m8086k9707j128M8669j8410
$$ -9066 -26182 -32411 -29494 -25330 -46098 -46001 -40112 -22277 -70363 -100070 -101198 -52529 -70939
20209g0939l352N2457N5036k7339m0265O901j65N8435L1144L950o865M5590j1305
$$ -70939 -74291 -21834 33202 5863 -34402 -27501 -27666 30769 61913 65863 58998 104588 93283
20196I3283j7687l0354j6137j7217k3949j9371J1429Q831M1676n849j2393L9413
$$ 93283 75596 45242 29105 11888 -12061 -31432 -20003 -11172 30504 24655 12262 51675
20184E1675q28n260m1983k2710K0432J5705k0072j1926K9938L2617L126j6084
$$ 51675 50847 45587 3604 -19106 1326 17031 -3041 -14967 14971 47588 50714 34630
20172C4630l2078J0662l3500l1637L4544J1289k3208K3403P3082J1452j9702p004
$$ 34630 2552 13214 -20286 -51923 -17379 -6090 -29298 -5895 67187 78639 58937 51933
20160E1933j3449l9161j454J2067r124k0712o822K2161j1326j6769J4609J1869
$$ 51933 38484 -677 -2131 9936 812 -19900 -26722 -4561 -15887 -32656 -18047 -6178
20148f178r886L2731J6293k9405m810Q043K9775j0203l7143O314P854j4128k982
$$ -6178 -16064 16667 32960 3555 -1255 6788 36563 26360 -10783 -4469 3385 -10743 -13725
20135a3725m787J886m144%l4809L8684L9736P551J0487o156j2517n2775j8483
$$ -13725 -18512 -16626 -20770 -20770 -55579 -16895 22841 30392 40879 34723 22206 -30569 -49052
20122d9052K2708P915q21P476k95k3574R975P343Q574p887K2895M5329L0666n852
$$ -49052 -26344 -18429 -19250 -11774 -12069 -35643 -25668 -18325 -9751 -17638 5257 50586 81252 75400
20108G5400N061k2966J6157l4751j9579M254j4620P878L3230L188m6812q015L4805
$$ 75400 80461 57495 73652 38901 19322 23576 8956 16834 50064 53252 6440 -1575 33230
20095C3230j0472l2633J0711M6624m4621J5647M242J9300j2130j0953k9902l1485
$$ 33230 22758 -9875 836 47460 2839 18486 22728 42028 29898 18945 -10957 -42442
20083d2442J5132k396j0887J8552J5497K5190K3016j2063j5584N531N076J0148
$$ -42442 -27310 -29706 -40593 -22041 -6544 18646 41662 29599 14015 19546 24622 34770
20071C4770m5216l92M6874j8459k5728j6770k5602o660L0283M0214M961K1834
$$ 34770 -10446 -10838 36036 17577 -8151 -24921 -50523 -57183 -26900 13314 18275 40109
20059D0109M800N649m2941J326l8306l0355O617K7164M6832l228n0595J408K8925
$$ 40109 44909 50558 7617 8943 -29363 -59718 -53101 -25937 20895 17667 -32928 -31520 -2595
20046b595J9864k0274l8867M7018L1170l0024j634J0136j847l2516K8647q1l0877
$$ -2595 17269 -3005 -41872 5146 36316 6292 4658 14794 12947 -19569 9078 8997 -21880
20033b1880J6863L0111L7694k4342p57J8177k053k1030l7912m9815j6492M0320
$$ -21880 -5017 25094 62788 38446 37689 55866 53813 32783 -5129 -54944 -71436 -31116
20021c1116N6718K8987k5886J0214K391m78K3280n925P074j5850l2506l0674r507
$$ -31116 25602 54589 28703 38917 41308 40830 64110 58185 65259 49409 16903 -13771 -23278
20008b3278K0568L1900J9698N065p532N2216M0787n5111k4798j2026N438M962
$$ -23278 -2710 29190 48888 53953 46421 98637 139424 84313 59515 47489 52927 57889
19996E7889L0395j8718l5221j4240j6079k2387R548M1720K9505l2757l3190j0557
$$ 57889 88284 69566 34345 20105 4026 -18361 -8813 32907 62412 29655 -3535 -14092
19984a4092J0999K5770m8114q349j8380J3651L4870L1096J0979j5882k2907k3454
$$ -14092 -3093 22677 -25437 -33786 -52166 -38515 -3645 27451 38430 22548 -359 -23813
19972b3813K5255M7806k0880k1007l1603l7087K3424M0747K3619l2246L8758J0266
$$ -23813 1442 49248 28368 7361 -24242 -61329 -37905 2842 26461 -5785 32973 43239
19960D3239K1315L6763L193n9080j6333j6926k5783k5472j0987L2947K8952K3677
$$ 43239 64554 101317 104510 45430 29097 12171 -13612 -39084 -50071 -17124 11828 35505
19948C5505m731J4279j905j4031k5086j1728n913O4775K7088J6545L8431k4347
$$ 35505 30774 45053 43148 29117 4031 -7697 -13610 51165 78253 94798 133229 108882
19936A08882p3152m2073L945L1724m325m7713L6471r208l2666N553J5385j3636
$$ 108882 35730 -6343 -2398 29326 25001 -22712 13759 4551 -28115 -22562 -7177 -20813
19924b0813j1202M2885O6680q902k8601r752m1286m4267n038O3049L0995o784
$$ -20813 -32015 10870 77550 68648 40047 30295 -10991 -55258 -60296 2753 33748 26964
19912B6964r982P812j4197m301j3611j7389l3228J3084q189K9757K1334m224K1971
$$ 26964 16982 24794 10597 6296 -7315 -24704 -57932 -44848 -53037 -23280 -1946 -6170 15801
19899A5801L7539Q454N92k2301j4584J168J1036J7467L647j5935l7719j3351N3128
$$ 15801 53340 61794 62386 40085 25501 26669 37705 55172 58819 42884 5165 -8186 44942
19886D4942J4721o803J811L261M9776o836n2649p1385J3178P622K0148l4638m3202
$$ 44942 59663 52860 54671 57932 107708 100872 48223 -23162 -9984 -2362 17786 -16852 -60054
19873f0054J2505L8883O977J145r609l2047j7273r953O446L7951J9651k9452k1349
$$ -60054 -47549 -8666 -1689 -544 -10153 -42200 -59473 -69426 -62980 -25029 -5378 -34830 -56179
19860e6179K8538J7673l3124L9891M3658k142j8979J1485j7582j7437q03K8815
$$ -56179 -27641 -9968 -43092 -3201 40457 38315 19336 30821 13239 -4198 -5001 23814
19848B3814J8412k6525m2386P426q232j4246K7486P030L159K3989R373J8272m5385
$$ 23814 42226 15701 -26685 -19259 -27491 -41737 -14251 -7221 -4062 19927 29300 47572 2187
19835B187O304q607j6561L9358L4459m219j3117j1462l4855p306l46J1206j8046
$$ 2187 8491 -116 -16677 22681 57140 52921 39804 28342 -6513 -13819 -14165 -2959 -21005
19822b1005J1364J6719J620L598N610k2394l4080R148L6269J3165o152k2541J8134
$$ -21005 -9641 7078 8698 12296 17906 -4488 -38568 -29420 6849 20014 13862 -8679 9455
19809I455J5551j7410j1049L8327p417j5234l0125j2204K8911L8948j2691k5976
$$ 9455 25006 7596 -3453 34874 27457 12223 -17902 -30106 -1195 37753 25062 -914
19797i14P103J4931j2109j2530k6847L840N2824j1828J6675j7150l994J176J2694
$$ -914 6189 21120 9011 -3519 -30366 -26526 26298 14470 31145 13995 10001 11177 23871
19784B3871K196l7075k2597j7376J9648K9605L1516O1533J9119m301j5494j0642
$$ 23871 26067 -11008 -33605 -50981 -31333 -1728 29788 91321 110440 106139 90645 80003
19772H0003k7116l8243k7578K0722J9246K9838m401k7127J8103J8239m7185J041
$$ 80003 52887 14644 -12934 7788 27034 56872 52471 25344 43447 61686 14501 15542
19760A5542K0895J9427K2152k7680o4827m7195M6123P0131k654l3186q679k40
$$ 15542 36437 55864 78016 50336 -14491 -61686 -15563 54568 51914 18728 10049 9809
19748I809n003m385K0093m49p317J818n863l821P364L4772M794K3536L744J5465
$$ 9809 4806 421 20514 20065 12748 14566 8703 4882 12246 47018 51812 75348 79092 94557
19734I4557n7552k3894M5850N2749j0564j7273j4923k5168J1460M8786L5069j4659
$$ 94557 37005 13111 58961 111710 101146 83873 68950 43782 55242 104028 139097 124438
19722A24438O180j2268K8617P6779M3467j6680N3049P6904J44798K14142L44239
$$ 124438 130618 118350 146967 223746 267213 250533 303582 380486 525284 739426 1083665
19711A083665O22951P63034J87959m97744p19220m03572m8373L6585M0376J77314
$$ 1083665 1706616 2469650 2657609 2159865 1440645 1037073 988700 1025285 1065661 1242975
19701A242975L82176P32135O82262p5391o31487n19416q2089K52018N91363M65237
$$ 1242975 1625151 2357286 3039548 2964157 2332670 1813254 1731165 1983183 2574546 3039783
19691C039783j53848o31486o09811l37685j79904p9306Q4130K52294M87243P33258
$$ 3039783 2885935 2254449 1644638 1306953 1127049 1047743 1131873 1384167 1871410 2604668
19681B604668L05361m11950p81188n40022l04021j94796j38168j05044j26769
$$ 2604668 2910029 2498079 1716891 1176869 872848 678052 539884 434840 308071
19672C08071n8077j4831n5284R786J0438k1409l5624k768O4067M4322m0190m7497
$$ 308071 249994 235163 179879 189665 200103 178694 143070 140302 204369 248691 208501 161004
19660A61004k3667k4096l9704K6461J8599m115j6318L3626Q0644Q5101R0936l2242
$$ 161004 137337 113241 73537 99998 118597 114482 98164 131790 212434 297535 388471 356229
19648C56229j06006q6799k1417k3436n331O0437J5173R917O3093J06967k8745
$$ 356229 250223 163424 142007 118571 113240 173677 188850 198767 261860 368827 340082
19637C40082j10324j7573K5714O5499N5451N548n0825q5603j14465l0936M0353
$$ 340082 229758 212185 237899 303398 358849 364397 313572 227969 113504 82568 122921
19626A22921M0290Q840L4734P5836N7579k7374k1371p5913m9311k8146l7844l9804
$$ 122921 163211 172051 206785 282621 340200 312826 291455 215542 166231 138085 100241 60437
19614F0437j3778J2742N462p728l761K9271k7950K2557J8065n5948l5255K943
$$ 60437 46659 59401 64863 57135 53374 82645 54695 77252 95317 39369 4114 7057
19602G057j5189K9997J0264l8922p231J525K5370P377j7171K6261J7144k785O545
$$ 7057 -8132 21865 32129 -6793 -14024 -12499 12871 20248 3077 29338 46482 43697 50242
19589E0242j5640Q924L008l665j6618j4735K946J8993M1272K3298J1608j3758
$$ 50242 34602 43526 46534 42869 26251 11516 14462 33455 74727 98025 109633 95875
19577I5875m8236j7721j0386j5503K0460K4464K8108k5977j114j5037k5408N8904
$$ 95875 47639 29918 19532 4029 24489 48953 77061 51084 49970 34933 9525 68429
19565F8429K9270o2572o0015j2759M3348J1997j8332o069j1617O904k4864N966
$$ 68429 97699 35127 -24888 -37647 5701 17698 -634 -6703 -18320 -11416 -36280 -30314
19553c0314J6130J5708L4688Q664n2814n417J0412L250N311K5602L7753k852j9099
$$ -30314 -14184 1524 36212 44876 -7938 -13355 -2943 307 5618 31220 68973 66121 47022
19540D7022M795k8671k7261j338M7159P6070Q955k6705l5137k6804J0686j7677
$$ 47022 51817 23146 -4115 -5453 41706 117776 126731 100026 64889 38085 48771 31094
19528C1094j2024J7720j6760j0552L2592Q201m9928J3529J3947k3365M3848J9717
$$ 31094 19070 36790 20030 9478 42070 50271 343 13872 27819 4454 48302 68019
19516F8019j8755q976j0199J9112k226j1281J0828N6137J2436k7324l0342j4126
$$ 68019 49264 40288 30089 49201 46975 35694 46522 102659 115095 87771 57429 43303
19504D3303k1252l0994K2933K5544K6286Q539k5568J0603K8027K8783k7123L833
$$ 43303 22051 -8943 13990 39534 65820 74359 48791 59394 87421 116204 89081 92914
19492I2914l8874m9852J8244M3664O2151J2574J0439o764l3211k9044L4371N9072
$$ 92914 54040 4188 22432 66096 128247 140821 151260 144496 111285 82241 116612 175684
19480A75684R9482Q8775J24033K32296M17068L96038l170l75239m10077j91271
$$ 175684 275166 363941 487974 720270 1137338 1533376 1530206 1154967 744890 553619
19470E53619j37803o2074l3375m0616n3964m6253m6963K9873J1722k0578n0847
$$ 553619 415816 353742 320367 279751 225787 179534 132571 162444 174166 153588 102741
19459A02741p846J3669j2933k3711K8580N7122P004k9621K9059J4193N43l469
$$ 102741 94895 108564 95631 71920 100500 157622 164626 135005 164064 178257 178800 175331
19447A75331L2763P2229J16936K24662L69707M54216K43680j70333m68493l52827
$$ 175331 208094 280323 397259 621921 991628 1445844 1689524 1519191 1050698 697871
19437F97871j96509q6993n8469o6196j2040l9162l4827l3741o7243n348O048j4528
$$ 697871 501362 414369 355900 289704 277664 238502 203675 169934 102691 97343 103391 88863
19425H8863k7211l5430J0320K4959L9519o085j3730J7770O763m0465n4362k1500
$$ 88863 61652 26222 36542 61501 101020 94935 81205 98975 105738 65273 10911 -10589
19413a0589q047j8919N8394K7536j9055R690k5365n807K8086l0859k632R53j2211
$$ -10589 -18636 -37555 20839 48375 29320 39010 13645 7838 35924 5065 2433 3386 -8825
19400h825O509J1133L9975R722M1207M124l0461j8068j4347L7182j7434n054Q4048
$$ -8825 -2316 8817 48792 58514 99721 103845 73384 55316 40969 78151 60717 55663 139711
19387A39711j1355l3071j244m4339j2162J9919l945l893j4014p270K5127k9281
$$ 139711 128356 95285 94041 49702 37540 57459 53514 49621 35607 28337 53464 24183
19375B4183J4191R451l8045j8748k8847N1617M0530m5884j9144K8255K8051k4917
$$ 24183 38374 47825 9780 -8968 -37815 13802 54332 8448 -10696 17559 45610 20693
19363B0693k598N368J8944M7809l6424j6123M4851j5374k940P306k389k9889k1454
$$ 20693 18095 23463 42407 90216 53792 37669 82520 67146 64206 71512 69123 39234 17780
19350A7780l4459L442j2114K9860K7925m4801J0692m477n177J2839J2822o51m178
$$ 17780 -16679 -13237 -25351 4509 32434 -12367 -1675 -6152 -11329 1510 14332 13681 9503
19337I503K2237R14j0299k1451J1964O665M0586L686K4793j0863k7496R15j1746
$$ 9503 31740 32654 22355 904 12868 19533 60119 63805 88598 77735 50239 51154 39408
19324C9408J120L1879L929m979O510K6109J2393K404m766o586L635J1576m5647
$$ 39408 40528 72407 76336 71357 77867 103976 116369 118773 114007 107421 111056 122632 76985
19311G6985k7215K0700k7233k7834R305j0140K7584L0864M1098j6943l8192j0337
$$ 76985 49770 70470 43237 15403 24708 14568 42152 73016 114114 97171 58979 48642
19299D8642Q965L0788l7823l9290l315J9970L755J3318K659j8895j110K7571L5034
$$ 48642 57607 88395 50572 11282 7967 27937 31692 45010 47669 28774 27664 55235 90269
19286I0269M016n3148k9895j8904K8925M2137k0654k3995J6923J4291k5728j0425
$$ 90269 94285 41137 11242 -7662 21263 63400 42746 18751 35674 49965 24237 13812
19274A3812m7081k1294K4898J9901N3247M7662j145l7688J2231k4619k1538L9127
$$ 13812 -33269 -54563 -29665 -9764 43483 91145 90000 52312 64543 39924 18386 57513
19262E7513m170K568m5121l6550K2411N732N070o850N884J8791j9697L9412J9154
$$ 57513 53343 55911 10790 -25760 -3349 2383 7453 603 6487 25278 5581 44993 64147
19249F4147R89k5501j9078K2820j1904K6957L0854J0289M167J819J053k7681J7950
$$ 64147 65136 39635 20557 43377 31473 58430 89284 99573 103740 105559 106612 78931 96881
19236I6881R366n6364o924k4802k6257k5965J5341O772P020L0676N580n039J3131
$$ 96881 106247 49883 42959 18157 -8100 -34065 -18724 -11952 -4932 25744 31324 26285 39416
19223C9416n2233l4066L4172M1139O907m7829K5507M4925q19J5309j6175j7067
$$ 39416 -12817 -46883 -12711 28428 35335 -12494 13013 57938 57119 72428 56253 39186
19211C9186J0423K3695J1482j5894J5304P385K0091k2379l0455J7980p362r929
$$ 39186 49609 73304 84786 68892 84196 91581 111672 89293 58838 76818 69456 59527
19199E9527J2311K1951o813n616p376k0693N091J0539j7652K4M684l7510L6237
$$ 59527 71838 93789 86976 81360 73984 53291 58382 68921 51269 51293 55977 18467 54704
19186E4704J9933j4242J1142L43J4500K441l1444J9473Q922J2749K9705j649l6810
$$ 54704 74637 60395 71537 71880 86380 88821 57377 76850 85772 98521 128226 126577 89767
19173H9767k8780m7829M0971N4281K3929k4450m3926j5178j4264P499k9174j5360
$$ 89767 60987 13158 54129 108410 132339 107889 63963 48785 34521 42020 12846 -2514
19161b514N117n132l64J668l0683L883M2696L1028l5940N7055P8126K9573j8965
$$ -2514 2603 -2529 -2893 -1225 -31908 -28025 14671 45699 9759 66814 144940 174513 155548
19148A55548j1619j9006M4588M6591n729k0671L2968J1269k4099J3338r331O984
$$ 155548 143929 124923 169511 216102 210373 189702 222670 233939 209840 223178 213847 220831
19136B20831K2262O698j6666l5303J046K447Q8666J08251K5025q0686o3235m8878
$$ 220831 243093 249791 233125 197822 198868 201315 289981 398232 423257 342571 279336 230458
19124B30458l6090l2394n2466J8521M8269K6532L9158J8726J1426K6621J6892
$$ 230458 194368 161974 109508 128029 176298 202830 241988 260714 272140 298761 315653
19113C15653k5625M582j3886O428M6754R6573J47668K59965L78531J43553j12300
$$ 315653 290028 294610 280724 287152 333906 430479 578147 838112 1216643 1360196 1247896
19102A247896j89468k5442K34526N84365P93005K80095l95977p60514n05824k72197
$$ 1247896 1058428 1032986 1267512 1851877 2644882 2924977 2529000 1768486 1262662 990465
19092I90465j60647j73295r9855o5933l7476n3134n2676l2344j3902l1085m8588
$$ 990465 829818 656523 556668 490735 453259 400125 347449 315105 301203 270118 221530
19081B21530J3122k3469l5468K0326M22L2378k6317m0344l3195K6919J6513N600
$$ 221530 234652 211183 175715 196041 196463 228841 202524 162180 128985 155904 172417 178017
19069A78017k483j2244K1253j5515K7883M5897l1996m4855m0762j3246K0353Q796
$$ 178017 175534 163290 184543 169028 196911 242808 210812 165957 125195 111949 132302 141098
19057A41098k6116K2903J0554J0875J7449J61l1806J373M5252L5113l2172Q220
$$ 141098 114982 137885 148439 159314 176763 176924 145118 146491 191743 226856 194684 202904
19045B02904k3538l0575M9645R257j5379O570k5074K6124o949J2920r813J9K3318
$$ 202904 179366 148791 198436 207693 192314 198884 173810 199934 192985 205905 196092 196111 219429
19032B19429j239M722j584o5112n8152l876N5515N6398J5522l052P694m0125o7358
$$ 219429 218190 222912 221328 156216 98064 94188 149703 206101 221623 218571 226265 186140 118782
19019A18782K0939L4757O8307K6244j9553l4512M52j141K6718M3373J5651L1406
$$ 118782 139721 174478 242785 269029 249476 214964 215416 214275 240993 284366 300017 331423
19007C31423M320L391J8308L7990J26558M4319n9746j51307r8037k3239R809L335
$$ 331423 335743 339134 357442 395432 521990 566309 506563 355256 257219 233980 243789 247124
18995B47124j9010k7857K9148m155l6134J9203J3609k8067r70L1565N3281k3609
$$ 247124 228114 200257 229405 225250 189116 208319 221928 193861 192891 224456 277737 254128
18983B54128Q203K9645j9503l0780M606P5535O2977P4095O3788K15750L32794
$$ 254128 262331 291976 272473 241693 246299 321834 384811 458906 522694 738444 1071238
18972A071238J86366n3907j79445j02613j07974j32933n0300M2233J18477K06945
$$ 1071238 1257604 1203697 1024252 921639 813665 680732 630432 672665 791142 998087
18962I98087K67596J3266k72251k95016j08205p0274o6262n4N647o864o0996k2725
$$ 998087 1265683 1278949 1006698 711682 603477 533203 466941 466887 472534 465670 404674 381949
18950C81949j4296K0172K6493j5138n3755j4930L70o055J4093O957k2051L8219
$$ 381949 367653 387825 414318 399180 345425 330495 330865 324810 338903 345860 323809 362028
18938C62028L2906L0127N4664J0463J1679p717j4992K5594J8422k0765j9764O0481
$$ 362028 394934 425061 479725 490188 501867 494150 479158 504752 523174 502409 482645 543126
18926E43126K8861L9384P4098L0965Q5076J37173R2603J37711K56450L73731L79371
$$ 543126 571987 611371 685469 716434 801510 938683 1031286 1168997 1425447 1799178 2178549
18915B178549K2954k55470l27535j82179q6195O831K1509P633L3368J14046J35775
$$ 2178549 2201503 1946033 1618498 1436319 1350124 1356955 1378464 1386097 1419465 1533511 1669286
18904A669286R5617L6953L6292J34611K15438K00310K73335M37411O22208N18912
$$ 1669286 1764903 1801856 1838148 1972759 2188197 2388507 2661842 3099253 3721461 4240373
18894D240373J31722j06275J47203M94456O86048Q45774J092499J126476J286189
$$ 4240373 4372095 4265820 4413023 4907479 5593527 6439301 7531800 8658276 9944465
18885I944465J820965K823220M261245O076856R227700J5026222K5493635M5200745
$$ 9944465 11765430 14588650 18849895 24926751 34154451 49180673 74674308 119875053
18877A19875053P7504154P3364163m009375o8935896p5489412l9504469j9557079
$$ 119875053 197379207 270743370 266733995 197798099 122308687 82804218 63247139
18870F3247139j2884086j0385355p888362n735112m146575l026886k076008j141604
$$ 63247139 50363053 39977698 32089336 26354224 22207649 19180763 17104755 15963151
18862A5963151o60647j055831j396836j200463m13529K80900N93633N07711K63076
$$ 15963151 15302504 14246673 12849837 11649374 11235845 11516745 12110378 12618089 12881165
18853A2881165L14114Q03796J782398L098149M821742P840613J3029320K1559563
$$ 12881165 13195279 13999075 15781473 18879622 23701364 31541977 44571297 66130860
18845F6130860L6733339O5370523R3265222L9558558m2690453r0111080o1819264
$$ 66130860 102864199 168234722 261499944 301058502 258368049 168256969 106437705
18838A06437705k9440290j6183004j2267731r958390p761816n744584m046666
$$ 106437705 76997415 60814411 48546680 38588290 30826474 25081890 21035224
18831B1035224k917724k337179j939317j822585j658339j428870r76335m63013
$$ 21035224 18117500 15780321 13841004 12018419 10360080 8931210 7954875 7491862
18823G491862p7008k44814o44152r99450j019204q28062n35626l73833l20982
$$ 7491862 7414854 7170040 6525888 5526438 4507234 3679172 3143546 2769713 2448731
18814B448731l02649k57142j59346r0479j9871o472m4911l7417o204J56077L10320
$$ 2448731 2146082 1888940 1729594 1639115 1619244 1612772 1567861 1530444 1524240 1680317 1990637
18803A990637L40762q053l75865m22472l02813j83084q6480r8663j02587m1134
$$ 1990637 2331399 2323346 1947481 1525009 1222196 1039112 952632 853969 751382 710248
18793G10248O7421Q0467M2671M4564Q3255Q579q2619k00073j03157o3699o8463
$$ 710248 777669 858136 900807 945371 1028626 1037205 954586 754513 651356 587657 519194
18782E19194q8392l9644j5021J1760j9364p757k1412J2028j470k1588l2667j900
$$ 519194 430802 391158 376137 387897 368533 360776 339364 351392 349922 328334 295667 293767
18770B93767M6046R0242J40177J47607L6579q8191j12079o9799q1966m7374p1283
$$ 293767 339813 430055 570232 717839 754418 666227 554148 484349 402383 355009 283726
18759B83726P756M3211J4263jK9927k3344j2159j9142p3987m6944Q056n3421j2750
$$ 283726 291482 334693 348956 348955 378882 355538 343379 324237 250250 203306 211362 157941 145191
18746A45191N0503R59l0264m702J6909J8598K0029L6638J8342l9244r726M2402
$$ 145191 195694 196653 166389 161687 178596 197194 217223 253861 272203 232959 223233 265635
18734B65635J13026J71572P1323j01750j68805q0885K35l0704o7749K5177O9563
$$ 265635 378661 550233 621556 519806 351001 270116 270351 239647 171898 197075 266638
18723B66638k4706L662N7430j913m9819k0944p8215k5898l5129J0009M2274K0295
$$ 266638 241932 245594 303024 301111 251292 230348 152133 126235 91106 101115 143389 163684
18711A63684m955m9846J6460J07026J54413J15819k1566j45628j10205m7015m5267
$$ 163684 158729 108883 125343 232369 386782 502601 481035 335407 225202 178187 132920
18700A32920K8361O6846k4320l2828l9860m1864L222J3411m5851L144j3605K5433
$$ 132920 161281 228127 203807 170979 131119 89255 92477 105888 60037 63181 49576 75009
18688G5009j2138m0265j4357n658L111q758J8807K6487k0242o238k3157L4933
$$ 75009 62871 22606 8249 2591 5702 -3056 15751 42238 21996 15758 -7399 27534
18676B7534L4055k110n216Q481j7203M8831K4837N310J2014l0445J3629J4333
$$ 27534 61589 59479 54263 62744 45541 94372 119209 124519 136533 106088 119717 134050
18664A34050k9070p285m2208j133J8636m164K3336K1836k9983k1716j0836j9397
$$ 134050 104980 97695 55487 54354 72990 68826 92162 113998 84015 62299 51463 32066
18652C2066j9877K1461k0830j3317J1255N541j1649M0215m136J831J2228l1169
$$ 32066 12189 33650 12820 -497 10758 16299 4650 44865 40729 42560 54788 23619
18640B3619k8677J7942J1632O016L1964L7637P9505O9247Q6471N1067J05992K46992
$$ 23619 -5058 12884 24516 30532 62496 100133 179638 248885 335356 386423 492415 739407
18628G39407M23664N17699J07874l36165m94297k36574j78944j27036q2854l9988
$$ 739407 1163071 1680770 1788644 1452479 958182 721608 542664 415628 332774 292786
18618B92786j3696j4429n6289l6975j7100l4095k3711n1300K2213L9542N4248
$$ 292786 279090 264661 208372 171397 154297 120202 96491 45191 67404 106946 161194
18607A61194J5883q340J2808k3099O01L5348M8566J45065J61880J69515J12902
$$ 161194 177077 168737 181545 158446 159047 194395 242961 388026 549906 719421 832323
18596H32323N4416J39432L02308K64727q4889l31552k35213k051J41802J98013
$$ 832323 886739 1026171 1328479 1593206 1508317 1176765 941552 939501 1081303 1279316
18586A279316r6422l21202k12664r2368q5993m5284j0036n6669j8532J5192L2916
$$ 1279316 1182894 861692 649028 556660 470667 425383 415347 358678 340146 355338 388254
18575C88254M6310m635L9737J01200R0031J44834K26807L91853P14657J197098
$$ 388254 434564 429929 469666 570866 660897 805731 1032538 1424391 2139048 3336146
18565C336146J578509O98955m37749r99441l61966N71262J320900R54674k54278
$$ 3336146 4914655 5613610 5175861 4176420 3814454 4385716 5706616 6661290 6407012
18556F407012p86247k5896N91305k80023j248249j378455p84279l33642j68217
$$ 6407012 5620765 5594869 6186174 5906151 4657902 3279447 2495168 2161526 1993309
18547A993309o8864N0490O8560J75101M88696R88681J343068M05266q01607j439302
$$ 1993309 1924445 1974935 2043495 2218596 2707292 3695973 5039041 5444307 4642700 3203398
18537C203398r11629l96242k46394k93372k38297j82232j45329p3009n8597k2360
$$ 3203398 2291769 1895527 1649133 1355761 1117464 935232 789903 716894 658297 635937
18527F35937N3471Q4154J66099J44388K8454j59434j95632k38127j28119n1915
$$ 635937 689408 773562 939661 1084049 1112503 953069 757437 519310 391191 339276
18517C39276l4835m3133m7793j3332M9451K0485J1106Q1969J44005K52488J44037
$$ 339276 304441 261308 213515 200183 249634 270119 281225 363194 507199 759687 903724
18506I03724n9541k17595j89587q5171o2030m4563j10823m3320J1692K2077J2682
$$ 903724 844183 626588 437001 351830 289800 245237 134414 91094 102786 124863 137545
18495A37545k9501o2456o3034L7584R9903K6438J6969K4483k0521m3983n5727
$$ 137545 108044 45588 -17446 20138 120041 146479 163448 187931 167410 123427 67700
18484F7700k1137k7355K7004J2248p478l5183k5900L4800N488N3584j2505m2773
$$ 67700 46563 19208 46212 58460 50982 15799 -10101 24699 30187 83771 71266 28493
18472B8493K968K7759k0627q024J0206k2884l0207k2539K060j0308N9364J6104
$$ 28493 31461 59220 38593 30569 40775 17891 -12316 -34855 -32795 -43103 16261 32365
18460C2365k3655k5954j7378L6526J8501r95j4317K2878j8729n317P119J0656
$$ 32365 8710 -17244 -34622 1904 20405 19410 5093 27971 9242 3925 11044 21700
18448B1700j0430M1574N2670n5349l8863M9737P051J411l2521Q178K9317k8352
$$ 21700 11270 52844 105514 50165 11302 61039 68090 69501 36980 45158 74475 46123
18436D6123j9012K4956p367M0147o919k653J5818k1964J4244l6093L346L9587
$$ 46123 27111 52067 44700 84847 77928 75275 91093 69129 83373 47280 50626 90213
18424I0213J8319j4956k3320j4815j4451q503L4981j3055k01M6241J2138k1375
$$ 90213 108532 93576 70256 55441 40990 32487 67468 54413 54212 100453 112591 91216
18412I1216k4244k391M321l4117M593M5427k047k366J8408M4672K7367l5248m5003
$$ 91216 66972 64581 68902 34785 39378 84805 82758 80392 98800 143472 170839 135591 90588
18399I0588n3624O036j2327k0659n21K6755L6544K621m958J8806l2476N8697O7715
$$ 90588 36964 43000 30673 10014 9493 36248 72792 75413 70455 89261 56785 115482 183197
18386A83197n0544m9194m340j433p567j0024l0911r172j2631l9237l538J6859
$$ 183197 132653 83459 79119 77686 70119 60095 29184 20012 7381 -31856 -35394 -18535
18374a8535O2165P1476N5737L0465o073m8310m416n9081j4265k5702j618M3751
$$ -18535 43630 115106 170843 201308 195235 146925 142509 83428 69163 43461 41843 85594
18362H5594N8186j858j1346J9587j7715L8594K5014j5963l9179l7654j4298p593
$$ 85594 143780 141922 130576 150163 132448 171042 196056 180093 140914 103260 88962 81369
18350H1369j5989j9423o486J5905L3659O219m4358l6118J2572J4578L1566J4803
$$ 81369 65380 45957 39471 55376 89035 95254 50896 14778 27350 41928 73494 88297
18338H8297K238J9886K9752J4397K2365Q805J913o2477n5533M0357O97k3500M0940
$$ 88297 90535 110421 140173 154570 176935 185740 187653 125176 69643 110000 110697 87197 128137
18325A28137K598k462Q681j9803j4538M4826L3659M9257O0960M5454l9895j01352
$$ 128137 130735 128273 136954 117151 102613 147439 181098 230355 291315 336769 296874 195522
18313A95522o0007n009k6859j250R124n5891k7112O047O1038M6835j4604Q00q354
$$ 195522 135515 130506 103647 102397 111521 55630 28518 34565 95603 142438 127834 128634 120280
18300A20280O856j3338r353J9302k9572J7958m856j6472o616M7952K1213l4293
$$ 120280 127136 113798 104445 123747 94175 112133 107277 90805 84189 132141 153354 119061
18288A19061j8586K9715M3664J1764L4274Q2040N2593o2117l6067j1393J931J9413
$$ 119061 100475 130190 173854 185618 219892 301932 354525 292408 256341 244948 246879 266292
18276B66292L8361J8231K9882R1470J53490K96547M32614J09664k08576l49754
$$ 266292 304653 322884 352766 444236 597726 894273 1326887 1436551 1227975 878221
18266H78221k28297j42057o2624r5465p8182l6668j7845K0863J0488Q053n2255
$$ 878221 649924 507867 445243 349778 271596 234928 217083 237946 248434 256487 204232
18255B04232O189K0882K195j8465m2744l2063J1253K3879m998M0710Q1634J4447
$$ 204232 210421 231303 233498 215033 172289 140226 151479 175358 170360 211070 292704 307151
18243C07151M9421N736K5775R7369J93001L85768N52377L89703m7317m86627m90636
$$ 307151 356572 362308 388083 485452 678453 1064221 1616598 2006301 1958984 1472357 981721
18232I81721l05012j60012p6734k8336p2913n9479j7394J1529K7353J9223k2278
$$ 981721 676709 516697 439963 411627 338714 279235 261841 273370 300723 319946 297668
18221B97668l6752n1397l119j7633k3070O993Q244m1535K1452J4788J5941J9448
$$ 297668 260916 209519 206400 188767 165697 172690 180934 139399 160851 175639 191580 211028
18209B11028L0350n5380o5546p609L9718L8038L0089k4505J2401j1079J2571K7708
$$ 211028 241378 185998 120452 112843 152561 190599 220688 196183 208584 197505 210076 237784
18197B37784K638K8631l198J6040N8075N7570P8667J20281l1817j58806j13896
$$ 237784 240422 269053 265855 281895 339970 397540 476207 596488 564671 405865 291969
18186B91969n2752M093J2174j9951j640k5301m0688M683J5901M5836J9346j4864
$$ 291969 239217 243310 255484 235533 233893 208592 167904 172587 188488 234324 253670 238806
18174B38806J2281l25j6387Q723Q21j4613N3095M5795L1009J1810j5720p70L8448
$$ 238806 251087 250762 234375 243098 243919 229306 282401 328196 359205 371015 355295 354525 392973
18161C92973Q084P480Q4721O8308J30357L6302n6811j11060q0958J8593N719O718
$$ 392973 401057 408537 493258 561566 691923 728225 671414 560354 479396 497989 503708 510426
18149E10426J9310l1688j0406j6721K6088N8293M1808k2167p164L7919R867M0340
$$ 510426 529736 498048 487642 470921 497009 555302 597110 574943 567779 605698 615565 655905
18137F55905O4468N7962l0250j3231J0187J4101L5152K6931R6594J00011J25080
$$ 655905 720373 778335 748085 734854 745041 759142 794294 821225 917819 1017830 1142910
18126A142910J28912J23733J53340J57245J92303K19850L39241M23415N69688
$$ 1142910 1271822 1395555 1548895 1706140 1898443 2118293 2457534 2880949 3450637
18117C450637Q38319J083209J611190K534201M107690O744032J1380615K0350790
$$ 3450637 4288956 5372165 6983355 9517556 13625246 20369278 31749893 52100683
18109E2100683L0083035J4851745j2185149k8843805k0838360r926331n421470
$$ 52100683 82183718 97035463 84850314 56006509 35168149 25241818 19820348
18102A9820348l993888l076525k343032j769499j313746r60875o98049m70973
$$ 19820348 15826460 12749935 10406903 8637404 7323658 6362783 5664734 5193761
18094E193761k20860R5296J43198k27582n39054n46244k53303q6870l683R1517
$$ 5193761 4972901 5068197 5211395 4983813 4444759 3898515 3645212 3558342 3554659 3646176
18084C646176K17192M82934O10740L16633j6232j3432L17970N43970O28764Q58474
$$ 3646176 3863368 4346302 4957042 5273675 5257443 5244011 5561981 6105951 6734715 7593189
18074G593189J282845J866961K736147L819878M911903P118863J1562748J9407976
$$ 7593189 8876034 10742995 13479142 17299020 22210923 29329786 40892534 60300510
18066F0300510L2956486N8647345R2136281N7812279k7472323q6845030p0074229
$$ 60300510 93256996 151904341 244040622 301852901 274380578 187535548 117461319
18059A17461319l3789243j7912992j3161541j0636938p745090n646750m489504
$$ 117461319 83672076 65759084 52597543 41960605 34215515 28568765 24079261
18052B4079261l707237k869488k019842j238637r79915j059071r95087o20098
$$ 24079261 20372024 17502536 15482694 14244057 13264142 12205071 11209984 10589886
18044A0589886k03758K22692O16373R63725J107281J492075K506272L837024N582128
$$ 10589886 10386128 10608820 11225193 12188918 13296199 14788274 17294546 21131570 26713698
18035B6713698Q604679J3696112K2589970L9491381P0311560Q1889017J1383573
$$ 26713698 35318377 49014489 71604459 111095840 181407400 263296417 274679990
18028B74679990n8593248q1806265m6294121k2376224j3775529j0784542q148966
$$ 274679990 216086742 134280477 87986356 65610132 51834603 41050061 32901095
18021C2901095n885084m636514l928771l316289k545199j888041j571005j250135
$$ 32901095 27016011 22379497 18450726 15134437 12589238 10701197 9130192 7880057
18013G880057r47912p80919o53975m65016k72017q6634j66609m33901n06078k81838
$$ 7880057 6932145 6151226 5497251 5032235 4760218 4673584 4506975 4073074 3566996 3285158
18003C285158K3904K78935K04627k57829o79436n90116l03485j72309k09243k23065
$$ 3285158 3309062 3587997 3792624 3534795 2855359 2265243 1961758 1789449 1580206 1357141
17993A357141j22026p5915r5981p0603l2280k9466M427J05461J63158l3181j71990
$$ 1357141 1235115 1159200 1063219 992616 960336 930870 935297 1040758 1203916 1170735 998745
17982I98745j37059p5158n6758k939l9207j21161l0870j6928m0639l3249k0275
$$ 998745 861686 786528 729770 726831 687624 566463 535593 518665 478026 444777 424502
17971D24502K8705K1993j9931k511r485j5495j2859K830n524K5512K6162P5057
$$ 424502 453207 475200 455269 452758 443273 427778 414919 417749 412225 437737 463899 538956
17959E38956J59737P3681j02809j48761j20077q8962m4255j487K6911M3300o252
$$ 538956 698693 772374 669565 520804 400727 311765 267510 266023 292934 336234 329982
17948C29982J0596M5516M2240q372m5748n8848K6883R941K1213m136m4482m0239
$$ 329982 340578 386094 428334 419962 374214 315366 342249 352190 373403 369267 324785 284546
17936B84546p9082k7266O051p260k3613K4314m02r208p108O835K7016k6280j2216
$$ 284546 205464 178198 184249 176989 153376 177690 177288 168080 160972 167807 194823 168543 156327
17923A56327J0225M1777j1323l843J3390K2070R3000J83323J36458N772n9373
$$ 156327 166552 208329 197006 193163 206553 228623 321623 504946 641404 647176 587803
17912E87803q1954o8112r4411q0006k7534P497L2892o6642q9242j200j2326j5578
$$ 587803 505849 437737 343326 263320 235786 243283 276175 209533 120291 119091 106765 91187
17900I1187j9360Q081n277L3964k3724j1616j1170l5863q468M9862K8509n7389
$$ 91187 71827 79908 74631 108595 84871 73255 62085 26222 17754 67616 96125 38736
17888C8736j7382L8727K4644Q205K7950J9209L0801M2659P1096J39513J92806
$$ 38736 21354 60081 84725 92930 120880 140089 170890 213549 284645 424158 616964
17877F16964m160j63379j81464j15277k6058P637k7188l3449j1251j3635j6136
$$ 616964 612804 449425 267961 152684 126626 134263 107075 73626 62375 48740 32604
17866C2604j9278L0476K5537m0735l7360n25J7339j0008q759R706L7027P171J0783
$$ 32604 13326 43802 69339 28604 -8756 -9281 8058 -1950 -10709 -1003 36024 43195 53978
17853E3978L8249O616n4876l4628n5N348j5282K4811O4901O546R908k0445p535
$$ 53978 92227 98843 43967 9339 9284 14632 -650 24161 89062 95608 105516 85071 77536
17840G7536j0914L719M075L1565L9399m3857m5266k8954k434j8299m0203R300
$$ 77536 66622 70341 74416 105981 145380 101523 56257 27303 24869 6570 -33633 -24333
17828b4333L0793L2018J2729K829m766r12K3084O868q637K8069K2873n8045m6019
$$ -24333 6460 38478 51207 54036 49270 48358 71442 78310 69673 97742 120615 62570 16551
17815A6551J26j2628J9299P235J2518K848L157o492k6488k593L4298l9372o8160
$$ 16551 16677 4049 23348 30583 43101 45949 49106 42614 16126 13533 47831 8459 -59701
17802e9701L9807J7869k8732L173M5501O5269l9678l6999K1713N439l2858q856
$$ -59701 -19894 -2025 -30757 -27584 17917 83186 43508 6509 28222 33661 803 -8053
17790h053K4122R494M798J7260q163k1385J3280K0092K075J5516L1953O563m0548
$$ -8053 16069 25563 30361 47621 39458 18073 31353 51445 53520 69036 100989 107552 67004
17777F7004n7364N553L8710k6944k53K7785m1705l8099k9340m9422K7371L1932
$$ 67004 9640 15193 53903 26959 26706 54491 12786 -25313 -54653 -104075 -76704 -44772
17765d4772K8608K7834l392j7647m0808j4863P894M2153K6204j6355k0796K0151
$$ -44772 -16164 11670 8278 -9369 -50177 -65040 -57146 -14993 11211 -5144 -25940 -5789
17753e789j4987R761n711l8678P802M3636N4988j3499k2237J8333M886Q645j0459
$$ -5789 -20776 -11015 -16726 -55404 -47602 -3966 51022 37523 15286 33619 38505 47150 36691
17740C6691K5719p796k4076J8668l2187R19r248n8712k9662k2268J1309P5219
$$ 36691 62410 54614 30538 49206 17019 17938 8690 -50022 -79684 -101952 -90643 -15424
17728a5424K3337j7253n726l790j6297j6247J5718r428J9265M1422Q66L8632k0543
$$ -15424 7913 -9340 -15066 -18856 -35153 -51400 -35682 -45110 -25845 15577 16443 55075 34532
17715C4532J577k9717J3094r892j3506k2446k1494K4139K2827j5160p590j7590
$$ 34532 36109 6392 19486 9594 -3912 -26358 -47852 -23713 -886 -16046 -23636 -41226
17703d1226O331M2977M2006N0729J404n0820J1646J8933R495j6918j8030j8887
$$ -41226 -34895 8082 50088 100817 102221 51401 63047 81980 91475 74557 56527 37640
17691C7640m4498k2440K6222K3968j0141j6265J2860j3920k340L1226J6687J0054
$$ 37640 -6858 -29298 -3076 20892 10751 -5514 7346 -6574 -8914 22312 38999 49053
17679D9053q952k0590L2012l0636m5128L4083L9966j0963j553j596k6800m5589
$$ 49053 40101 19511 51523 20887 -24241 9842 49808 38845 37292 35696 8896 -36693
17667c6693k9096k454K261L2097N698j8263J9632j2048K8086J7283j7424M9206
$$ -36693 -65789 -68243 -65982 -33885 -28187 -46450 -26818 -38866 -10780 6503 -10921 38285
17655C8285Q149k8419j5591n118p344k5448o202K1476Q655r08j6649J1409K94
$$ 38285 46434 18015 2424 -2694 -10038 -35486 -41688 -20212 -11557 -12465 -29114 -17705 -17411
17642a7411j265L4963J8680j1960p2187l5953J7185L5831K0368j6328j9668k2097
$$ -17411 -18676 16287 34967 23007 -49180 -85133 -67948 -32117 -11749 -28077 -47745 -69842
17630f9842J3928K4701N2183L1636l36k6373j2145l936l491L741L556Q625k9200
$$ -69842 -55914 -31213 20970 52606 52270 25897 13752 9816 6325 10066 13622 22247 -6953
17617f953j8389K2422K6350k1599k8710K6431M8954M7733k4226n9275j3383K297
$$ -6953 -25342 -2920 23430 1831 -26879 -448 48506 96239 72013 12738 -645 1652
17605A652Q45j0741k6484J4515k77K3840j2741J068J5793j234M83k7614n9191
$$ 1652 2497 -8244 -34728 -20213 -20490 3350 -9391 -8323 7470 6236 6719 -20895 -80086
17592h0086M6204L4163j3286o0375j5924J0946j9070j4501J010M7323K7793M6493
$$ -80086 -33882 281 -13005 -73380 -89304 -78358 -97428 -111929 -110919 -63596 -35803 10690
17580A0690M2143j0330M92j0087M61j1611K173J6735M5194O6519J52666K18261
$$ 10690 52833 42503 42995 32908 33369 21758 23931 40666 85860 152379 305045 523306
17568E23306Q6180j18781j87646j00092j7942r023k8771m5025m6412p1612k4309
$$ 523306 609486 490705 303059 202967 185025 176002 147231 102206 55794 -15818 -40127
17557d0127N4420J3732L7763L4262k047m8143o9224n6922M44m653K5130N9367
$$ -40127 14293 28025 65788 100050 98003 49860 -19364 -76286 -75842 -80495 -55365 4002
17545D002K3986M4841k4964j7234M28M3841J5750L69r2q66N0240m452N2473J35787
$$ 4002 27988 72829 47865 30631 31059 74900 90650 91019 90927 90061 140301 135849 188322 324109
17531C24109Q5834l9902j27637j17445o4874k2403j7991j0330k159N6934K7978
$$ 324109 409943 370041 242404 124959 60085 37682 19691 9361 7202 64136 92114
17520I2114n4926k2243J1670O970k0204q697j1380L5359J8094P995l3226l0187
$$ 92114 37188 14945 26615 33585 13381 4684 -6696 28663 46757 54752 21526 -8661
17508h661M8785J4213M782o304L6062k183l3222K7542J2453L3368O4848R3166
$$ -8661 40124 54337 59119 52815 88877 86694 53472 81014 93467 126835 191683 284849
17496B84849J39359J97734L20673M65164J72641k39285m77132k80684j74602p7009
$$ 284849 424208 621942 942615 1407779 1580420 1341135 864003 583319 408717 331708
17486C31708o4456n0104n8320n3941l0870P090m829K5787M8657j6846o4308j2749
$$ 331708 267252 217148 158828 104887 74017 81107 76278 102065 150722 133876 69568 56819
17474E6819J189n8947r681J2923K4809j6303k123J7062P2543L0506M3587J12861
$$ 56819 58008 -939 -10620 2303 27112 10809 8686 25748 98291 128797 172384 285245
17462B85245J87255K35101L71167L11131o5808l62462l99513j96039r7295l0886
$$ 285245 472500 707601 1078768 1389899 1324091 961629 562116 366077 268782 237896
17452B37896o1881k1439n37k4229o2294O656Q2035N0620R6899J36196J04113k9382
$$ 237896 176015 154576 154039 129810 67516 74172 156207 206827 303726 439922 544035 514653
17440E14653j60236j89648r4610j8729j1061j710J3579l0445n7603l4909J3090
$$ 514653 354417 164769 70159 51430 40369 38659 52238 21793 -35810 -70719 -57629
17429e7629K3164P135k1720k982J3710L4372K6485L2684M9102J8372n3644j6022
$$ -57629 -34465 -27330 -49050 -52032 -38322 -3950 22535 55219 104321 122693 69049 53027
17417E3027N755n2671l2810J3532l259K5318r225K2347J0237k2037m343K7929
$$ 53027 58782 6111 -26699 -13167 -16426 8892 -333 22014 32251 10214 5871 33800
17405C3800k3540k5131j7741k0854K5307k7o2084j135L5578O2769J6464m7453
$$ 33800 10260 -14871 -32612 -53466 -28159 -28186 -90270 -91405 -55827 6942 23406 -24047
17393b4047K484K8775K6415j7246j3557j0769J5291P1009o139m1947k0506o4973
$$ -24047 -21563 7212 33627 16381 2824 -7945 7346 78355 72216 30269 9763 -55210
17381e5210n058o52K4235m400k5969J7929M5305K2538R159m7404K6345k5413L2796
$$ -55210 -60268 -60920 -36685 -41085 -67054 -49125 -3820 18718 27877 -19527 6818 -18595 14201
17368A4201n32J6748P562n596k0086j2364l2212q290J2499m7684m524P5854J5163
$$ 14201 13669 30417 37979 32383 12297 -67 -32279 -40569 -28070 -75754 -80278 -4424 10739
17355A0739o111L0606J8294m6772j8803j3443k6478M528L1497P417j9366j5861
$$ 10739 4628 35234 53528 6756 -12047 -25490 -51968 -47440 -15943 -8526 -27892 -43753
17343d3753q256K1433K6619M5551j7412l5948m0435j0176Q226K1527K5325K3181
$$ -43753 -52009 -30576 -3957 41594 24182 -11766 -52201 -62377 -54151 -32624 -7299 15882
17331A5882J4787o8156j3745r68m616M3275L1273Q678J7698k4803r431k1652j4526
$$ 15882 30669 -37487 -51232 -52200 -56816 -13541 17732 26410 44108 19305 9874 -11778 -26304
17318b6304K4640m4956l4828J8349J6611J7147j0342P729R231Q573j8889K5533
$$ -26304 -1664 -46620 -81448 -63099 -46488 -29341 -39683 -31954 -22723 -14150 -33039 -7506
17306g506L9445J3881j6973M406Q245l263j7990M77N206k5364L9447K5653p1238
$$ -7506 31939 45820 28847 33253 41498 38235 20245 20722 25928 564 40011 65664 -5574
17293e574l8237K0525M32l9544Q553M2271J1214J5465N583j2045o9537k6003q663
$$ -5574 -43811 -23286 -22854 -62398 -53845 -11574 -360 15105 20688 8643 -60894 -86897 -95560
17280i5560j5599p123K9245K2264M6691K2470P065M3066m9904n0585o262J0751
$$ -95560 -111159 -118282 -89037 -66773 -20082 2388 9453 52519 2615 -47970 -54232 -43481
17268d3481L7539J8914j5482l6983j2656j3669p416K874M7895L2913k2090Q322
$$ -43481 -5942 12972 -2510 -39493 -52149 -65818 -73234 -70360 -22465 10448 -11642 -3320
17256c320K0190M512l4354k6869M6806N2514l2060l6646k2760L676J488N4020
$$ -3320 16870 21382 -12972 -39841 6965 59479 27419 -9227 -31987 -28311 -26823 27197
17244B7197j8977k342Q91n2345j5034J6394l5501j0739N0653k2009k4162L6535
$$ 27197 8220 5878 6769 -45576 -60610 -44216 -79717 -90456 -39803 -61812 -85974 -49439
17232d9439M8965L1926l9761k7670k0504j0981N8522M6382m639l9973Q833L1078
$$ -49439 -474 31452 -8309 -35979 -56483 -67464 -8942 37440 32801 -7172 1661 32739
17220C2739j6293q654O5965L7844k3864m4854n6968k6172k2486K0150M4147N353
$$ 32739 16446 7792 73757 111601 87737 42883 -14085 -40257 -62743 -42593 1554 6907
17208F907M5927K1739m2072n0250n535p105L2790L5933j6316p527k9202L2887
$$ 6907 52834 74573 32501 -17749 -23284 -30389 2401 38334 22018 14491 -14711 18176
17196A8176po30k2135j1932N031Q981J6061k3902j1045n308O123q0073o1319K5101
$$ 18176 18169 17539 -4596 -16528 -11497 -2516 13545 -10357 -21402 -26710 -20587 -100660 -161979 -136878
17182a36878O5305O9798L5737k7483n0998j4274O7710K5636m4275P962L5574Q338
$$ -136878 -71573 -1775 33962 6479 -44519 -58793 8917 34553 -9722 -1760 33814 42152
17170D2152k6864m2800k390L7751k309O366j3021q069k6476k3800J4457J2672
$$ 42152 15288 -27512 -29902 7849 5540 11906 -1115 -9184 -35660 -59460 -45003 -32331
17158c2331m271l398R525J9408j5124j5335j649Q615m861j5093m411L3268L2k2785
$$ -32331 -36602 -40000 -30475 -11067 -26191 -41526 -43175 -34560 -39421 -54514 -58925 -25657 -25625 -48410
17144d8410k466M9196j918K088j7188R006L6496J324k5573k5838l1193m673P418
$$ -48410 -50876 -1680 -3598 -1510 -18698 -9692 26804 28128 2555 -23283 -54476 -59149 -51731
17131e1731j7632P2680K414j3607n120L9811o066j1505q263j2505Q66l5068L291
$$ -51731 -69363 3317 5731 -7876 -12996 26815 20749 9244 981 -11524 -10658 -45726 -42435
17118d2435M091r747M2493K910J5776q128m431k5436l883K9293l7590L91M8964
$$ -42435 -38344 -48091 -5598 -2688 13088 4960 529 -24907 -28790 503 -37087 -36696 12268
17105A2268J394P978r66j6299l4286K2313k0350r61j5269n894l8486o9436J5065
$$ 12268 13662 21640 20674 4375 -29911 -7598 -27948 -28909 -44178 -50072 -88558 -157994 -142929
17092a42929L7424N544J9913M3600J6037Q842m9961K4885K6789k1951J2730o108
$$ -142929 -105505 -99961 -80048 -36448 -20411 -11569 -61530 -36645 -9856 -31807 -19077 -25185
17080b5185k9069k3972K7918K7912K5052j2922k7768L9585L2955Q25m8195l6244
$$ -25185 -54254 -78226 -50308 -22396 2656 -10266 -38034 1551 34506 35331 -12864 -49108
17068d9108N9751L7183q030j8498L0307J3241j2242m0960m8862k1898j5525N46
$$ -49108 10643 47826 39796 21298 51605 64846 52604 11644 -37218 -59116 -74641 -74095
17056g4095l258N328J2054j4757K7630K5523j1418m997L1399J3131m2729n763
$$ -74095 -77353 -72025 -59971 -74728 -47098 -21575 -32993 -37990 -6591 6540 -36189 -41952
17044d1952r303J9510N7811l1479k5757J992k2044l0298K4792L0492L1158j2782
$$ -41952 -51255 -31745 26066 -5413 -31170 -29178 -51222 -81520 -56728 -26236 4922 -7860
17032g860k2592L242M4681q827k5403p733J2487p130j1232Q068J0663k7922J8236
$$ -7860 -30452 -27210 17471 8644 -16759 -24492 -12005 -19135 -30367 -22299 -11636 -39558 -21322
17019b1322n858N38Q059K6419p998k270l2190j170r181J123J8824M6508j586o3551
$$ -21322 -27180 -26642 -18583 7836 -162 -2432 -34622 -35792 -44973 -43850 -25026 21482 19896 -43655
17005d3655m6766J3537J8007k6259L1699k2663l5321J3526N2237L7932K5437k8890
$$ -43655 -90421 -76884 -58877 -85136 -53437 -76100 -111421 -97895 -45658 -7726 17711 -11179
16993a1179n8324k1483J729N8896K1444k2953M6826J8348K4625l0093k207Q019
$$ -11179 -69503 -90986 -89257 -30361 -8917 -31870 14956 33304 57929 27836 25629 33648
16981C3648q536n756J1040k0494j0444p284j4253j5078M0349L4886K1002l9877
$$ 33648 25112 19356 30396 9902 -542 -7826 -22079 -37157 3192 38078 59080 19203
16969A9203m1601m3439k7290K7580K7471k5178K9355J7686M0471o816n5609o25
$$ 19203 -22398 -65837 -93127 -65547 -38076 -63254 -33899 -16213 24258 17442 -38167 -38792
16957c8792L2012J9093r286j0404J2047j0501J5697K5835j4121P374j8598p4672
$$ -38792 -6780 12313 3027 -7377 4670 -5831 9866 35701 21580 28954 10356 -64316
16945f4316N0346J7958m8543K916K4639l893k347q46K6594J3170K1207L0625m1118
$$ -64316 -13970 3988 -44555 -41639 -17000 -20893 -23240 -24086 2508 15678 36885 67510 26392
16932B6392k3250K5939J7913p759m2302m5714L1749q933j8342K2185j2896o65
$$ 26392 3142 29081 46994 39235 -3067 -48781 -17032 -25965 -44307 -22122 -35018 -35683
16920c5683P552K3060J4300k8101K0926K8042J5154l591o2684n8326J3837K3317
$$ -35683 -28131 -5071 9229 -18872 2054 30096 45250 41659 -21025 -79351 -65514 -42197
16908d2197k027J1059J1643J0860p919L8192K8319j4161m6400m0310k1176L1362
$$ -42197 -44224 -33165 -21522 -10662 -18581 19611 47930 33769 -12631 -52941 -74117 -42755
16896d2755K0639M701j6858o581M25l356l7468N492L9976L8038J7984l9352k8
$$ -42755 -22116 -17415 -34273 -40854 -40429 -43785 -81253 -75761 -35785 2253 20237 -19115 -19143
16883a9143M21m4758P743K1878K0846J9180J4513J5764L4594J3374m1158Q568
$$ -19143 -18722 -63480 -55737 -33859 -13013 6167 20680 36444 71038 84412 43254 51822
16871E1822k1457J5770k2806k8080j2791j7830N216O7103M7347J226j7107j3593
$$ 51822 30365 46135 23329 -4751 -17542 -35372 -30156 36947 84294 85520 68413 54820
16859E4820j2850k2149m5857k7831K795J8981J7015j3194J4876R337l6743k8006
$$ 54820 41970 19821 -26036 -53867 -51072 -32091 -15076 -28270 -13394 -4057 -40800 -68806
16847f8806k818L799j930K4782Q488j8146k5383J8152o743L3540M1243J5175l7812
$$ -68806 -71624 -67825 -69755 -44973 -36485 -54631 -80014 -61862 -68605 -35065 6178 21353 -16459
16834a6459k31o316L025L6497J3844l1902j9342m1940m5393R06j5453K8981J4765
$$ -16459 -16690 -23006 -19981 16516 30360 -1542 -20884 -62824 -108217 -107311 -122764 -93783 -79018
16821g9018L7139L6442J1051L402l2980Q329J2728J4735k0779k9286k3372J9627
$$ -79018 -41879 -5437 5614 9016 -23964 -15635 -2907 11828 -8951 -38237 -61609 -41982
16809d1982j2118j5343N4320L7166O578k4522k0130L9033N5483n6993l3419j0297
$$ -41982 -54100 -69443 -15123 22043 28621 4099 -16031 23002 78485 21492 -11927 -22224
16797b2224j7377r708k0021J8107J6874q64J1083N7036k4852l2659O578J6382
$$ -22224 -39601 -49309 -69330 -51223 -34349 -35213 -24130 32906 8054 -24605 -18027 -1645
16785a645n158k5824J2196L887J7075N084m9899n526J5430J5408R118k3359Q693
$$ -1645 -6803 -32627 -20431 -16544 531 5615 -44284 -49810 -34380 -18972 -9854 -33213 -24520
16772b4520J3457M93j4491K2998R681n2832p911j41p781J2018M973k3627l4J0516
$$ -24520 -11063 -10570 -25061 -2063 7618 -45214 -53125 -53266 -61047 -49029 -44056 -67683 -67717 -57201
16758e7201k5835J9583J4084P9655N9723l9132k6033K33M524N6967K2210q7054
$$ -57201 -83036 -63453 -49369 30286 90009 50877 24844 25077 29601 86568 108778 21724
16746B1724n1984j4558k030J3972l7260l9230L3397L3058L2517L3830j2272l6473
$$ 21724 -30260 -44818 -46848 -32876 -70136 -109366 -75969 -42911 -10394 23436 11164 -25309
16734b5309l0185J43N4530N7432o6098l8824J3723J4746m9950M977J9020l6562
$$ -25309 -55494 -55351 -821 56611 -9487 -48311 -34588 -19842 -69792 -64815 -45795 -82357
16722h2357J1864P66j6392j7523J1539L2126K863n439k7004J7631j1991j4482
$$ -82357 -70493 -69727 -86119 -103642 -92103 -59977 -57114 -62553 -89557 -71926 -83917 -98399
16710i8399J2513K8590L7221L376J8701R456o555j2967j5056j3592k8657m5214
$$ -98399 -85886 -57296 -20075 -16699 2002 11458 4903 -8064 -23120 -36712 -65369 -110583
16698a10583M5698K9674J0666r896J0824M5113j8536K875p529j6143k4295l6889
$$ -110583 -64885 -35211 -24545 -34441 -23617 21496 2960 5835 -1694 -17837 -42132 -79021
16686g9021J2815J3510r144j7084J7608N4333k6822j9779M5234M0293j5420N138
$$ -79021 -66206 -52696 -61840 -78924 -61316 -6983 -33805 -53584 -8350 31943 16523 21661
16674B1661p358N298J3343l6235K0854k2608k25m1798n105j09J0408J9254m1615
$$ 21661 14303 19601 32944 -3291 17563 -5045 -5270 -47068 -52173 -52282 -41874 -22620 -64235
16661f4235R937L9616L9704j130r519j270l175r920m5454j4096M4832L9879l0361
$$ -64235 -54298 -14682 25022 23892 14373 13103 9928 8 -45446 -59542 -14710 25169 -5192
16648e192r483j3083P065L3555j2573j2998o813m7373k415O0511O0007L5647l1889
$$ -5192 -14675 -27758 -20693 12862 289 -12709 -19522 -66895 -69310 -8799 51208 86855 54966
16635E4966l6784k3872K3443O1545k6909j5280m0847j3120L4576M7315P002J1106
$$ 54966 18182 -5690 17753 79298 52389 37109 -3738 -16858 17718 65033 72035 83141
16623H3141l1612l9294M596J0317j6003m045L406J767j5076Q120k57N0j253O750
$$ 83141 51529 12235 16831 27148 11145 7100 10506 12273 -2803 5317 5060 5110 3857 10607
16609A0607J197j4582J8396j1250j8241o956K2409P3582Q283n422m2778m0903
$$ 10607 11804 -2778 15618 4368 -13873 -20829 1580 75162 83445 78023 35245 -5658
16597e658k0321l0655L4588K4319J002j7354n0752L2289K6494M4056k5581k4420
$$ -5658 -25979 -56634 -22046 2273 3275 -14079 -64831 -32542 -6048 38008 12427 -11993
16585a1993j1075l973j9750J7570O007J1455Q861r860l6592K1233L6349K886m3438
$$ -11993 -23068 -27041 -46791 -29221 -23214 -11759 -2898 -12758 -49350 -28117 8232 11118 -32320
16572c2320j2956L3387m505j0465k041l4480n253J4784K8827K9728J1775j8123
$$ -32320 -45276 -11889 -16394 -26859 -28900 -63380 -68633 -53849 -25022 4706 16481 -1642
16560a642P184J7019O199K963j5417j7681L8293K9510l3625m1404j3150k7631
$$ -1642 5542 22561 28760 31723 16306 -1375 36918 66428 32803 -8601 -21751 -49382
16548d9382L4665j2591k6311k6665J1274L8124j2523j0433J38J4504L345J1172
$$ -49382 -14717 -27308 -53619 -80284 -69010 -30886 -43409 -53842 -53704 -39200 -35855 -24683
16536b4683L1175m1314j9731k5551J5143K0305J9059L460J3169l0332k1335J9562
$$ -24683 6492 -34822 -54553 -80104 -64961 -44656 -25597 -22137 -8968 -39300 -60635 -41073
16524d1073L0852L4636l0031m267L7256k0103l0600l280K8699j575J6897J7558
$$ -41073 -10221 24415 -5616 -9883 27373 7270 -23330 -26610 2089 514 17411 34969
16512C4969j5483j2412j1257J2703l4011k5480J1205M3804J7555M229J392l9831
$$ 34969 19486 7074 -4183 8520 -25491 -50971 -39766 4038 21593 25822 27214 -12617
16500a2617l8039J3637L9598J8051j8573k9599j1373K1727j9261j7128o345J9336
$$ -12617 -50656 -37019 2579 20630 2057 -27542 -38915 -17188 -36449 -53577 -59922 -40586
16488d0586N4685K2428J4181r451r1502n1965O4250k9520l6174L1536K1295N6764
$$ -40586 14099 36527 50708 41257 -50245 -102210 -37960 -67480 -103654 -72118 -50823 5941
16476E941k7312R436M2024J1501J260j2943j9539j8302k5920N969J9546l0460
$$ 5941 -21371 -11935 30089 41590 42850 29907 10368 -7934 -33854 -27885 -8339 -38799
16464c8799n0622K7618R367l3028K1176J4257j2897M118J0942m1685J8124J5811
$$ -38799 -89421 -61803 -52436 -85464 -64288 -50031 -62928 -58810 -47868 -89553 -71429 -55618
16452e5618J3837J5901j3878k4381r819L7252J6469j3266l4310L5012L1668j8892
$$ -55618 -41781 -25880 -39758 -64139 -73958 -36706 -20237 -33503 -67813 -32801 -1133 -20025
16440b0025l2454k0360l2087J3162M5826L6352L5571j4665l0321j9153P644j4141
$$ -20025 -52479 -72839 -104926 -91764 -45938 -9586 25985 11320 -19001 -38154 -30510 -44651
16428d4651j7949K2470Q08M2802L9423P937P026o189n0803P937o892k0042J629
$$ -44651 -62600 -40130 -39322 3480 42903 50840 57866 51677 874 8811 1919 -18123 -16494
16415a6494k0925L0981K7902J2408l1070l3300J919P568J1045j0550j6740L4548
$$ -16494 -37419 -6438 21464 33872 2802 -30498 -28579 -21011 -9966 -20516 -37256 -2708
16403b708J7398l4014j8359O191o462J4282N900M601O712J2730O927r393j0321
$$ -2708 14690 -19324 -37683 -31492 -37954 -23672 -17772 -13171 -6459 6271 13198 3805 -6516
16390f516l6444L4892J9011k4891k382P6788P738m5555N839L623l9662J9663n5512
$$ -6516 -42960 -8068 10943 -13948 -16330 60458 68196 22641 28480 32103 -7559 12104 -43408
16377d3408m2210o701J0202N1287M0674O851m1885N812K5452K3720k5088j7241
$$ -43408 -85618 -92319 -82117 -30830 9844 16695 -25190 -19378 6074 29794 4706 -12535
16365a2535K1391m730J5140L8555m7263m0324J5992K2329o852l4763j4043K3859
$$ -12535 8856 4126 19266 57821 10558 -29766 -13774 8555 1703 -33060 -47103 -23244
16353b3244J597n0490l1202K4202K709K5548P843k4616J4339K4678J1316K423
$$ -23244 -21647 -72137 -103339 -79137 -76428 -50880 -43037 -67653 -53314 -28636 -17320 -14897
16341a4897P20j4295K0503l1226M8548J8335O974K0133l3363m1941R028J386j4698
$$ -14897 -14177 -28472 -7969 -39195 9353 27688 34662 54795 21432 -20509 -11481 -10095 -24793
16328b4793j5105k6713L7717K7783k1902k0993K0006r631M480J916M5802L0533
$$ -24793 -39898 -66611 -28894 -1111 -23013 -44006 -24000 -33631 -29151 -27235 18567 49100
16316D9100j271L874j1251l6016j1206J4420j7090M1898K4095J8989n138n6237
$$ 49100 47829 51703 40452 4436 -6770 7650 -9440 32458 56553 75542 70404 14167
16304A4167q04J3997k506m4286j5916O157J8960M9745J876l6710P267K7756R656
$$ 14167 13363 27360 24854 -19432 -35348 -29191 -10231 39514 41390 4680 11947 39703 49359
16291D9359L4287k0262j0175j8455j5344M3687j0207j194j1985j5394N18q80J7019
$$ 49359 83646 63384 53209 34754 19410 63097 52890 51696 39711 24317 24835 23955 40974
16278D0974j3364J1269J2715k7825j6272p818l2497R664L6116j0832K2060j5814
$$ 40974 27610 38879 51594 23769 7497 -321 -32818 -23154 12962 2130 24190 8376
16266H376q949L5046N208p307m0091o481J0037L0810K2213p416n9340k0651Q519
$$ 8376 -573 34473 39681 32374 -7717 -14198 -4161 26649 48862 41446 -17894 -38545 -30026
16253c0026L1924N216k1506q85m197j3764j8499j4097J2595J6718J8538K6129
$$ -30026 1898 7114 -14392 -15277 -19474 -33238 -51737 -65834 -53239 -36521 -17983 8146
16241H146J1261k0454m3836K0151O0542K6484o1607l3634L2570J8624R802j7888
$$ 8146 19407 -1047 -44883 -24732 35810 62294 687 -32947 -377 18247 28049 10161
16229A0161p084p888p440n018M2752M2014J778j0415p176l417P109k236m6565
$$ 10161 3077 -4811 -12251 -17269 25483 67497 69275 58860 51684 48267 55376 53140 6575
16216F575q381K091p2443J7368K9670K6022O088L976K1616n846O2004Q304q7671
$$ 6575 -1806 285 -72158 -54790 -25120 902 6990 10966 32582 26736 88740 97044 9373
16203I373j1907j9698m235K112K861K215j715K8574k0880j0127K1699O7869J2894
$$ 9373 -2534 -22232 -26467 -24355 -21494 -19279 -20994 7580 -13300 -23427 -1728 66141 79035
16190G9035m8557k3830L0967j1263k6209J3038M814k1264k0877J5642L2313j1325
$$ 79035 30478 6648 37615 26352 143 13181 17995 -3269 -24146 -8504 23809 12484
16178A2484k0499j0273J2808L8414j4814m6538J3343k2754J0072K4833J6473k6123
$$ 12484 -8015 -18288 -5480 32934 18120 -28418 -15075 -37829 -27757 -2924 13549 -12574
16166a2574L9689K2211J4822j5230k0594M595k0678m0905j3140N516N679M5471
$$ -12574 27115 49326 64148 48918 28324 32919 12241 -28664 -41804 -36288 -30609 14862
16154A4862J8207k1920k4130K3247K7992l7522l0655j2226n011Q429K0260k4557
$$ 14862 33069 11149 -12981 10266 38258 736 -29919 -42145 -47156 -38727 -18467 -43024
16142d3024K0248o51j3724L0702J3374R840K5997P106j5141m0552j045K2679k6673
$$ -43024 -22776 -23427 -37151 -6449 6925 16765 42762 49868 34727 -5825 -6870 15809 -10864
16129a0864m1924L7918N9638J7244K9294L0492k6300k8543k336m6420J3380j2048
$$ -10864 -52788 -14870 44768 62012 91306 121798 95498 66955 64619 18199 31579 19531
16117A9531j0939j2084j9054r176K0604M6860J0852j2162R477k8395k5660l8148
$$ 19531 8592 -3492 -22546 -31722 -11118 35742 46594 34432 43909 15514 -10146 -48294
16105d8294k2913M7588J3349K1342k28n1327k5684M6364M4747j0266n0810L1074
$$ -48294 -71207 -23619 -10270 11072 10844 -40483 -66167 -19803 24944 14678 -36132 -5058
16093e058Q683J1356P324P838L95k4061O866J4148j9394l0829N504m7259J6016
$$ -5058 3625 14981 22305 30143 30538 6477 13343 27491 8097 -22732 -17228 -64487 -48471
16080d8471J0862j8532M4635R303k6021O134l6799K4824J4817k4734J2357J5421
$$ -48471 -37609 -56141 -11506 -2203 -28224 -22090 -58889 -34065 -19248 -43982 -31625 -16204
16068a6204L9128R00o9863N5013o806l0529j8075O207L1753K0845N418o092j6698
$$ -16204 22924 23824 -46039 8974 2168 -28361 -46436 -40229 -8476 12369 17787 11695 -5003
16055e003k2810m2404l984L1166K1411M4672K5853l1801n3917J3623j6998P640
$$ -5003 -27813 -70217 -74201 -43035 -21624 23048 48901 17100 -36817 -23194 -40192 -32552
16043c2552K2563L2L6891M6397J4176k6308j6078m9154j4419l521l845m3040J2643
$$ -32552 -9989 -9957 26934 73331 87507 61199 45121 -4033 -18452 -21973 -25818 -68858 -56215
16030e6215K5987K8732M8894k6610o5452l7429L0393k8624j57M1848L2388K1436
$$ -56215 -30228 -1496 47398 20788 -44664 -82093 -51700 -80324 -80481 -38633 -6245 15191
16018A5191R284o0129l6236l541J5490J2861j8438N7246m926J7045k3877q117
$$ 15191 24475 -35654 -71890 -75431 -59941 -47080 -65518 -8272 -13198 3847 -20030 -28147
16006b8147K3787J4999k6939o329q890l3761K3643J0426M3308N1674J997l4753
$$ -28147 -4360 10639 -16300 -22629 -31519 -65280 -41637 -31211 12097 63771 65768 31015
15994C1015J1898O901k2978m0863k5180M481J5071O5132J4243J5945L697j9995
$$ 31015 42913 49814 26836 -14027 -39207 -34726 -19655 45477 59720 75665 79362 59367
15982E9367m7566K5382J2386k1253k0374k2807k611J7025j8774l965j7914K008
$$ 59367 11801 37183 49569 28316 7942 -14865 -17476 -451 -19225 -23190 -41104 -39096
15970c9096J9056m450J7718K3296K0923k1103P294N8538q219m7540j9271k048
$$ -39096 -20040 -24490 -6772 16524 37447 16344 23638 82176 73957 26417 7146 5098
15958E098K2269J1977J9521j5109o0520j4236J3969N215l9668k9954L8251m792
$$ 5098 27367 39344 58865 43756 -16764 -31000 -17031 -11816 -51484 -81438 -43187 -47979
15946d7979K4531L0073l222l7582o915j2354j2936K1487M9230j1006J244j7035
$$ -47979 -23448 6625 3403 -34179 -41094 -53448 -66384 -44897 4333 -6673 -5429 -22464
15934b2464j2035J9647J0461o21q415L5795K253l9204j7606L1004K7334M7699
$$ -22464 -34499 -14852 -4391 -5012 -13427 22368 24621 -14583 -32189 -1185 26149 73848
15922G3848L411l1471k6926j4528K1688L4099r6m326l0569j7977K1057k6540l1736
$$ 73848 77259 45788 18862 4334 26022 60121 60025 55699 25130 7153 28210 1670 -30066
15909c0066K0778K1155m9207K823L2407J5678o822K3285J7062O121j1192O998
$$ -30066 -9288 11867 -37340 -34517 -2110 13568 6746 30031 47093 53214 42022 49020
15897D9020l1939l373L6116N970l9771l1776Q926J8291J9647K7595M148l0217
$$ 49020 17081 13708 49824 55794 16023 -15753 -6827 11464 31111 58706 62854 32637
15885C2637k2571k7524l7333j6769N454j2338n946K1610j4835k4112J2958J6854
$$ 32637 10066 -17458 -54791 -71560 -66106 -78444 -84390 -62780 -77615 -101727 -88769 -71915
15873g1915r162Q436K2628j1930M8863N1707L284k8284J3936J754l7305J1815
$$ -71915 -81077 -72641 -50013 -61943 -13080 38627 41911 13627 27563 29317 -7988 3827
15861C827J7179m032J326K0271m647k0682k6209m447k659K2662m8426o365K1238
$$ 3827 21006 16974 18300 38571 33924 13242 -12967 -17414 -20073 2589 -45837 -52202 -30964
15848c0964k6835J188L9011M937K4130q458j4038p631J9199L3381L2821j0661
$$ -30964 -57799 -56611 -17600 -12663 11467 3009 -11029 -18660 539 33920 66741 56080
15836E6080j8416l3723l768K4795q826p075M486p481J2451J1845K2696j0649k3788
$$ 56080 37664 3941 173 24968 16142 9067 13553 6072 18523 30368 53064 42415 18627
15823A8627K1691P650n6398j0739J245r43j1426m5568k847L7354J8219N2172Q840
$$ 18627 40318 47968 -8430 -19169 -17924 -18867 -30293 -75861 -78708 -41354 -23135 29037 37877
15810C7877l205R96j230J3570L313j7555K7540k7295k4692M4379j347j524M505
$$ 37877 34672 35668 34438 48008 51321 33766 61306 34011 9319 53698 52351 50827 55332
15797E5332P526l9200J3277l5367N451q34l7210j1527K0021K4762k3804j9421
$$ 55332 62858 23658 36935 1568 7019 6185 -31025 -42552 -22531 2231 -21573 -40994
15785d0994k6485k1601J0416P7012M0552P35k2780k2950R0L7241J1525q782k8256
$$ -40994 -67479 -89080 -78664 -1652 38900 39635 16855 -6095 -6005 31236 42761 33979 5723
15772E723n0483l44M3123P210k6951l8591K1917K1654M72J3157K1479k9566M045
$$ 5723 -44760 -45104 -1981 5229 -21722 -60313 -38396 -16742 -16270 -3113 18366 -11200 -7155
15759g155L784j3662L5526N39k4148k5763j4465k6783K3312M6799J5855j0841
$$ -7155 -3371 -17033 18493 19032 -5116 -30879 -45344 -72127 -48815 -2016 13839 2998
15747B998j7723J6232k604l149N3931J0903m390P902j3247J0947L7339oj3196
$$ 2998 -14725 1507 -1097 -4246 49685 60588 56198 64100 50853 61800 99139 99133 85937
15734H5937p083m0531p3810J7692K6151q438K1362J7696L0275k8431k4858j2628
$$ 85937 78854 38323 -35487 -17795 8356 -82 21280 38976 69251 40820 15962 3334
15722C334K2045j0876O322j75p871P388J2119p754k2530R545N4517O335q442l9715
$$ 3334 25379 14503 20825 20650 12779 20167 32286 24532 2002 11547 66064 72399 63957 24242
15708B4242k4694P443K4942J0684L5657J3694l7963J0864J274l4614m4754j2131
$$ 24242 -452 6991 31933 42617 78274 91968 54005 64869 66143 31529 -13225 -25356
15696b5356o245O966J3440m548K692J1656J3417j6174k7327J2094M5525Q108p0551
$$ -25356 -31601 -24635 -11195 -15743 -13051 -1395 12022 -4152 -31479 -19385 26140 34248 -36303
15683c6303n8601N408N5319q106k1810M8462J2320L39j9253o5125P401L9087J3094
$$ -36303 -94904 -89496 -34177 -42283 -64093 -15631 -3311 -2972 -22225 -87350 -79949 -40862 -27768
15670b7768l7276n752L0664K2547M3898k9272k9979J716L3762r58r074o29l646
$$ -27768 -65044 -70796 -40132 -17585 26313 -2959 -32938 -31222 2540 1582 -7492 -8121 -11767
15657a1767k2966j5457k000m864K8999K8880j860p620j9707m2967j0029J1362
$$ -11767 -34733 -50190 -52190 -57054 -28055 825 -1035 -8655 -28362 -71329 -81358 -69996
15645f9996K7660J3478M593l6588J6627Q647L6864K5202k4327J5189J4152p392
$$ -69996 -42336 -28858 -24265 -60853 -44226 -35579 1285 26487 2160 17349 31501 24109
15633B4109l512L8421L2583o0679m2363k6528J5191K9424L4972l646J8909k0110
$$ 24109 20597 59018 91601 30922 -11441 -37969 -22778 6646 41618 37972 56881 36771
15621C6771J7912M8399k8386m4489j4561j1021l9760M4217L9991J3792l889p5220
$$ 36771 54683 103082 74696 30207 15646 4625 -35135 9082 49073 62865 58976 -16244
15609a6244k5915o304J3109m1918k176K3232J5423j7420K6120K4450N240p791
$$ -16244 -42159 -48463 -35354 -77272 -79448 -56216 -40793 -58213 -32093 -7643 -2403 -10194
15597a0194l7528j1095Q837K4247K5570n284k1154K4125R857J389j0158k0133
$$ -10194 -47722 -58817 -49980 -25733 -163 -5447 -26601 -2476 7381 8770 -1388 -21521
15585b1521P935P357J3558k2048l3535K8937j0025q583R636R937q093k112M0115
$$ -21521 -13586 -6229 7329 -14719 -48254 -19317 -29342 -37925 -28289 -18352 -26445 -28557 11558
15572A1558J284L376j3109j5958j5483J1279j241O385L0035m150m0429n3071q870
$$ 11558 12842 16218 3109 -12849 -28332 -17053 -18294 -11909 18126 13976 -26453 -79524 -88394
15559h8394M2514N4683m3034J1888M6452Q948k1949j3839L6453Q372M328j1886
$$ -88394 -45880 8803 -34231 -22343 24109 33057 11108 -2731 33722 42094 46422 34536
15547C4536p343j5183j8576N436m668k2239K637K1224p589o862j4138n056L112
$$ 34536 27193 12010 -6566 -1130 -5798 -28037 -25400 -4176 -11765 -18627 -32765 -37821 -34709
15534c4709L441j0356J4838L1468J701k1187l841L805M7814J1300O403p397J2285
$$ -34709 -31268 -41624 -26786 4682 6383 -14804 -18645 -14840 32974 44274 50677 43280 55565
15521E5565n8417n2242K4285J0480m48L4359Q628j9201J8634J9257o9957j2854
$$ 55565 -2852 -55094 -30809 -20329 -20777 13582 22210 3009 21643 40900 -29057 -41911
15509d1911L371m2625N1043J0654l3240M796M0693N7368o732m4369n1680J7012
$$ -41911 -38540 -81165 -30122 -19468 -52708 -47912 -7219 50149 43417 -952 -52632 -35620
15497c5620M2310P06l0942j5944J3401j4914l305o14J1551M4844L8725j7853n0952
$$ -35620 6690 7396 -23546 -39490 -26089 -41003 -44308 -44922 -33371 11473 50198 32345 -18607
15484a8607J774k0007P699J0049l9417k6884l102L476L6334L4305j5298Q265m434
$$ -18607 -16833 -36840 -29141 -19092 -58509 -85393 -88495 -85019 -48685 -14380 -29678 -21413 -25847
15471b5847J648M2155L4553o597K6831P819n2537l0756m6010k6193J0693K1836
$$ -25847 -24199 17956 52509 45912 72743 80562 28025 -2731 -48741 -74934 -64241 -42405
15459d2405K3094l9024p134N8301N1896N04q255k468k6603p240J9225n796l4844
$$ -42405 -19311 -58335 -65469 -7168 44728 45232 36977 34509 7906 666 19891 14095 -20749
15446b0749J406j3733M410j059l732j8115j0797K15N6709k1312l1474L5310J00959
$$ -20749 -19343 -33076 -28666 -29725 -33457 -51572 -62369 -62154 -5445 -26757 -58231 -22921 78038
15433G8038O132o4232l8849J1141L3485J441j8516J633K1381K4238m773O173P095
$$ 78038 84170 19938 -18911 -7770 25715 27156 8640 10273 31654 55892 51119 57292 64387
15420F4387k1653j7537j6464k9877M4478Q876n6426l2697N5978J3132L893L6556
$$ 64387 42734 25197 8733 -21144 23334 32210 -24216 -56913 -935 12197 16090 52646
15408E2646q411m9409N3k7553J1870k2202K7034M7437m990k4058j4153J7952L4197
$$ 52646 44235 -5174 -5121 -32674 -20804 -43006 -15972 31465 26475 2417 -11736 6216 40413
15395D0413N847m6284r2768M504M7774K1543J0113o895n3538j0706L8003N8559
$$ 40413 46260 -24 -92792 -88288 -40514 -18971 -8858 -15753 -69291 -79997 -41994 16565
15383A6565M5879k2459p737n0782j4543K5990K2568L522j3421L2361j7214O114
$$ 16565 62444 39985 32248 -18534 -33077 -7087 15481 19003 5582 37943 20729 26843
15371B6843O995k972l3104J9991M2628J1605R876o5261n4923J2262M1654O0651
$$ 26843 33838 30866 -2238 17753 60381 71986 81862 16601 -38322 -26060 15594 76245
15359G6245M487k2120m348L577m07j5393l8910l6734K796K5482j882o025l563
$$ 76245 80732 58612 54264 57841 57434 42041 3131 -33603 -30807 -5325 -7207 -13232 -16795
15346a6795L1699m352p716N2435k5332K902p584j5561l8503Q80K0143l8532j8512
$$ -16795 14904 10552 2836 55271 29939 32841 25257 9696 -28807 -27927 -7784 -46316 -64828
15333f4828K5777L4079N5637L7105l2162j4519k0949k1313J3417j0607M062j8975
$$ -64828 -39051 -4972 50665 87770 55608 41089 20140 -1173 12244 1637 5699 -13276
15321a3276o763K0494q608k7992k7551P493Q898m8669J7698J3960k4969k4666
$$ -13276 -20039 455 -8153 -36145 -63696 -56203 -47305 -95974 -78276 -64316 -89285 -113951
15309a13951J3767K7954M0345R781k9503J4110m97K5396K8725k2286k7783L2718
$$ -113951 -100184 -72230 -31885 -22104 -51607 -37497 -37994 -12598 16127 -6159 -33942 -1224
15297a224p389k7182J5164M9877k036l7869l4715P787K1383k2558J0977j8976
$$ -1224 -8613 -35795 -20631 29246 27210 -10659 -45374 -37587 -16204 -38762 -27785 -46761
15285d6761j7234n220K8988N0336k6364k8269N4622J1587P773L2341M051n9521
$$ -46761 -63995 -69215 -40227 10109 -16255 -44524 10098 21685 29458 61799 65850 6329
15273F329q491J9181p383r734K5707R091r250k4470K5445K0224K858j0730l2824
$$ 6329 -2162 17019 9636 -98 25609 34700 25450 980 26425 46649 49507 38777 5953
15260E953K1416K8730k4194l9865K8557j1632l1691m5390k5068J6092R254r929
$$ 5953 27369 56099 31905 -7960 20597 8965 -22726 -68116 -93184 -77092 -67838 -77767
15248g7767P50N8166K9230k2134j3823p234J2289M5526j970j4603j451k0613j7173
$$ -77767 -77017 -18851 10379 -11755 -25578 -32812 -20523 25003 23033 8430 6979 -13634 -30807
15235c0807P061L2224O895m9789o550L4712L5372J0304l8537m84n339p4J3904
$$ -30807 -23746 8478 15373 -34416 -40966 -6254 29118 39422 885 401 -4938 -5012 8892
15222H892r914J0289J7573L130l6029n2255j1678M2671r565n993O2579M3123k2865
$$ 8892 -1022 9267 26840 29970 -6059 -58314 -69992 -27321 -36886 -42879 19700 62823 39958
15209C9958n0981K1530L0312K3683r298l6059k6961j8598J9441Q29k8540k5260
$$ 39958 -11023 10507 40819 64502 55204 19145 -7816 -26414 -6973 -6144 -34684 -59944
15197e9944M0390M0507P265o1503l3197O418N5171p466k5306L7584j8269n793
$$ -59944 -19554 20953 28218 -33285 -66482 -60064 -4893 -12359 -37665 -81 -18350 -24143
15185b4143M4336L781l3809M918J5533l995j280k9155J8510K1275p627L258K8696
$$ -24143 20193 23974 -9835 -4917 10616 6621 5341 -23814 -5304 15971 8344 11602 40298
15172D0298M116j6275j943J3136k2621l2872j8416K7917Q133J0477J599m561L3712
$$ 40298 44414 28139 26196 39332 16711 -16161 -34577 -6660 1473 11950 13549 8988 42700
15159D2700K6233m837j2480j8757k9926K006K8785n593O379j1574R390k9020k3062
$$ 42700 68933 64096 51616 32859 2933 4939 33724 28131 34510 22936 32326 3306 -19756
15146a9756L4991L5727J0648n1040k3521K0379O346P561O531j5901j008n815L4302
$$ -19756 15235 50962 61610 10570 -12951 7428 13774 21335 27866 11965 10957 5142 39444
15133C9444j8602l3070K853R602j9609k1016j3462J3804P0561N7953l3873j3949
$$ 39444 20842 -12228 -9375 227 -19382 -40398 -53860 -40056 30505 88458 54585 40636
15121D0636L019k5505j7584q13K2251n7453j7691K3070j82j6733M6617L5902P260
$$ 40636 43655 18150 566 -247 22004 -35449 -53140 -30070 -30252 -46985 -368 35534 42794
15108D2794j6798P756j5897k8466P178K7130k9984K473k5600p465M518M0225K2243
$$ 42794 25996 33752 17855 -10611 -3433 23697 -6287 -3814 -29414 -36879 -32361 7864 30107
15095C0107L916l2231m4965K7375K4608K0685q998n0444j1066Q225l2345L035
$$ 30107 34023 1792 -43173 -15798 8810 29495 20497 -29947 -41013 -32788 -65133 -62098
15083f2098P040L211K7226R570n758m028m2618M3749P901k3469J3473L0422l0509
$$ -62098 -55058 -51847 -24621 -15051 -20809 -24837 -67455 -23706 -15805 -39274 -25801 4621 -25888
15070b5888j8418J7131K1965j9286J8810j8216j608R941J4003J3567j6334k2464
$$ -25888 -44306 -27175 -5210 -24496 -5686 -23902 -25510 -15569 -1566 12001 -4333 -26797
15058b6797m4175R889K1115J7649L009p386J707l78l207n591K7778k4487n723
$$ -26797 -70972 -61083 -39968 -22319 -19310 -26696 -24989 -25367 -28574 -34165 -6387 -30874 -36597
15045c6597J6322K3954J161O950L6498K003k6067j730J6079O9733J2317l3696
$$ -36597 -20275 3679 4840 11790 48288 50291 24224 22494 38573 108306 120623 86927
15033H6927m2347k7475k475k6905K7746K1356j7468j1442j3319o825M3551m637
$$ 86927 44580 17105 14630 -12275 15471 36827 19359 7917 -5402 -12227 31324 26687
15021B6687j7600j2430N55l3091j4345j2182P909J7766J0041r018j709l210J5244
$$ 26687 9087 -3343 -2788 -35879 -50224 -62406 -54497 -36731 -26690 -35708 -37417 -40627 -25383
15008b5383R034o969l8486q974J7553o961L0597J0666L5253l672K294j8084L2686
$$ -25383 -16349 -23318 -61804 -70778 -53225 -60186 -29589 -18923 16330 12658 14952 -3132 29554
14995B9554k4245l473K9506m858J3854J3448k7598R084K3809j0901m3580k0480
$$ 29554 5309 1836 31342 26484 40338 53786 26188 35272 59081 48180 4600 -15880
14983a5880K6428J6665l8009n748m274N60J5582l2147J7258J5238K6445K2831
$$ -15880 10548 27213 -10796 -16544 -20818 -20258 -4676 -36823 -19565 -4327 22118 44949
14971D4949L8776j2792l4893J536j1650l761j7877K114Q744M593L795j395j5511
$$ 44949 83725 70933 36040 37576 25926 22165 4288 6402 15146 19739 23534 22139 6628
14958F628J0335j750L8663k9334m1677N0848K6392k2800j6882l3182l253k9902
$$ 6628 16963 15213 53876 24542 -17135 33713 60105 37305 20423 -12759 -16012 -45914
14946d5914j2966P7035K6037j1180m1948K245L9631k7326j5464K5289L0439k2285
$$ -45914 -58880 18155 44192 33012 -8936 -6691 32940 5614 -9850 15439 45878 23593
14934B3593j1047l4980l620M7167L9959J2570k4762L835n3662l4179L82j7931
$$ 23593 12546 -22434 -26054 21113 61072 73642 48880 52715 -947 -35126 -34744 -52675
14922e2675l6862J9992O854K3836J3392j2267j5782J7418K4397l9869j0817L276
$$ -52675 -89537 -69545 -62691 -38855 -25463 -37730 -53512 -36094 -11697 -51566 -62383 -59107
14910e9107J8011K8541n490l7041n4639Q761L3699L5748J9701R084r551j2478
$$ -59107 -41096 -12555 -18045 -55086 -109725 -100964 -67265 -31517 -11816 -2732 -12283 -24761
14898b4761L3970J5108r058P686K629m0580j0741J4523J5867k3962q689q013J277
$$ -24761 9209 24317 15259 22945 25574 -15006 -25747 -11224 4643 -19319 -28008 -36021 -34744
14885c4744j1782p855K787P24J3995L3536k3271l5817j5500L1283L8464R984R27
$$ -34744 -46526 -54381 -51594 -50870 -36875 -3339 -26610 -62427 -77927 -46644 -8180 1804 2731
14872B731j5497J9887r243m284j0920q545j5139K215K4914J010j0209J0185Q271
$$ 2731 -12766 7121 -2122 -6406 -17326 -25871 -41010 -38795 -13881 -12871 -23080 -12895 -4624
14859d624O032j3730q869M5976L6882m837o955n3369J1903K2329J0219m4282J7756
$$ -4624 1408 -12322 -21191 24785 61667 56830 49875 -3494 8409 30738 40957 -3325 14431
14846A4431M3856j1012n894k3835k9164l36k3937k1420q720M2513J1311K7510
$$ 14431 58287 47275 41381 17546 -11618 -11954 -35891 -57311 -66031 -23518 -12207 15303
14834A5303r644K6457K8520j6670l6075k0738K4574P813l7598l808N544J486j31
$$ 15303 5659 32116 60636 43966 7891 -12847 11727 19540 -18058 -21866 -16322 -14836 -14967
14821a4967j2128M525M4241k1748K430N4567N235j2370K6404N315K2292O70n0342
$$ -14967 -27095 -22570 21671 -77 2353 56920 62155 49785 76189 81504 103796 104466 54124
14808E4124j541N7975J932n9009j5340k8956K4542L4019p6585n3368j7112M7841
$$ 54124 52583 110558 112490 53481 38141 9185 33727 67746 -8839 -62207 -79319 -31478
14796c1478R3104J7589J7824K5786m9181l1517J606Q06j2617j700n821L5908j2064
$$ -31478 61626 79215 97039 122825 73644 42127 43733 44539 31922 30222 24401 60309 48245
14783D8245k3598L3104j0427M077j4545l7718j3612k589J3889J0898J7232L147
$$ 48245 24647 57751 47324 51401 36856 -862 -14474 -17063 -3174 7724 24956 28103
14771B8103j504j105J9813j6627m8175K2653K3152K0719m285j7166J5892L7659
$$ 28103 26599 25494 45307 28680 -19495 3158 26310 47029 42744 25578 41470 79129
14759G9129j6889o1672k3447k4763j0574k0242N4055M5467p747K8469Q528p449
$$ 79129 62240 568 -22879 -47642 -58216 -78458 -24403 21064 13317 41786 50314 42865
14747D2865j7752k1158L290j1811L7311K0524j492O087N775k7206l3124l687j0872
$$ 42865 25113 3955 7245 -4566 32745 53269 51777 57864 63639 36433 3309 -378 -11250
14734a1250Q647P841l2927L1313k0580j3980J9246J1954m679o279o99K3939L5274
$$ -11250 -2603 5238 -27689 3624 -16956 -30936 -11690 264 -4415 -10694 -11393 12546 47820
14721D7820l8653m4361o490j5691n364l440J7650J3054J5591L9058m660j5852
$$ 47820 9167 -35194 -41684 -57375 -62739 -66179 -48529 -35475 -19884 19174 14514 -1338
14709a338l3605l2817N6256K8756K4092o233j4714K136n059M106l3913j375j7530
$$ -1338 -34943 -67760 -11504 17252 41344 35111 20397 22533 17474 21580 -12333 -13708 -31238
14696c1238r026L0992O4677k5027m7833k258J0239K6106M1473p666j9375r805
$$ -31238 -40264 -9272 55405 30378 -17455 -19713 -9474 16632 58105 50439 31064 21259
14684B1259j4093k885N44K9195O484J0511j3531j9242o726o086k8371J1598j0342
$$ 21259 7166 4281 4825 34020 40504 51015 37484 18242 11516 5430 -22941 -11343 -21685
14671b1685M9235L4797m1849m35m125J0246J539j4384k2614K220O365r164k0198
$$ -21685 27550 62347 20498 20063 15938 26184 27723 13339 -9275 -7055 -690 -9854 -30052
14658c0052M2811L0154J7890p127p899o1788l5382O0741N01J940K1048l7787l5489
$$ -30052 12759 42913 60803 53676 45777 -16011 -51393 9348 9849 11789 32837 -4950 -40439
14645d0439J7048J7533J168j7193k0032P254K6753J8329k2127J2635N6772M023
$$ -40439 -23391 -5858 -4690 -21883 -41915 -34661 -7908 10421 -11706 929 57701 61724
14633F1724m0677n2988j7383j0785J4931j0456j3613L547k995M8892N3374J4998
$$ 61724 21047 -31941 -49324 -60109 -45178 -55634 -69247 -65700 -68695 -19803 33571 48569
14621D8569K5207M6151l644k194l4363J547K458r759k4993L819L7449k9893j4404
$$ 48569 73776 119927 116283 114089 79726 81273 83731 73972 48979 52798 90247 60354 45950
14608D5950j0223m7750m7694o8048O6175J07374q651o099j8271j4175l3674J5317
$$ 45950 35727 -12023 -59717 -127765 -61590 45784 37133 31034 12763 -1412 -35086 -19769
14596a9769K6291k0747j9470M4138J9964l1116n068J5145o008j2887j2010j507
$$ -19769 6522 -14225 -33695 10443 30407 -709 -5777 9368 3360 -9527 -21537 -23044
14584b3044K0616N4100K9693M528j0392j2748l3148l1901k7226J414J9114K3221
$$ -23044 -2428 51672 81365 85893 75501 62753 29605 -2296 -29522 -28108 -8994 14227
14572A4227J5152k5471l3959J0088K3076K58P224r494m4447m2602L7413K4818
$$ 14227 29379 3908 -30051 -19963 3113 3371 10595 1101 -43346 -85948 -48535 -23717
14560b3717j2868J8662J9542O74M6642L2478j6853l1628l3556K870l7503J197
$$ -23717 -36585 -17923 1619 2293 48935 81413 64560 32932 -624 2246 -35257 -34060
14548c4060K995O4884L7325J7772k4609m2712m6739J7985Q218m086k3965K0585
$$ -34060 -31065 33819 71144 88916 64307 21595 -25144 -7159 1059 -3027 -26992 -6407
14536f407N333o6135m1567J6597R430N7253K7345o1134k3758m053J9903K366N4903
$$ -6407 -1074 -67209 -108776 -92179 -82749 -25496 1849 -59285 -83043 -87096 -67193 -64827 -9924
14523i924N0814j2049l3278L831J5027l2525k3029J9330N023m0883J036N1163
$$ -9924 40890 28841 -4437 -606 14421 -18104 -41133 -21803 -16780 -57663 -56627 -5464
14511e464K1799m748K234j9509J929K0241J8224j3566o585K7898m767k9540m8147
$$ -5464 16335 11587 13821 -5688 -3759 16482 34706 21140 14555 42453 37686 8146 -40001
14498d0001o212M7279N2703P110o52k5902j8998k2770o539K7839j8393m0762l7165
$$ -40001 -46213 1066 53769 60879 60227 34325 15327 -7443 -13982 13857 -4536 -45298 -82463
14485h2463L4938N2806O1101L5763l5463m4536o492L8491K0352O365j9389k4564
$$ -82463 -47525 5281 66382 102145 66682 22146 15654 54145 74497 80862 61473 36909
14473C6909J757k793Q659m339k9065n988r813K8282M7403j5374j9598K8572N610
$$ 36909 38666 35873 44532 40193 11128 5140 -4673 23609 71012 55638 36040 64612 70222
14460G0222k10l84O604J6939K857j3339Q746l1540q878o799J9912j6352n823m3536
$$ 70222 70012 69628 76232 93171 96028 82689 91435 59895 51017 44218 64130 47778 41955 -1581
14446a581k6435J9232M1706O283k1606P454J6086j0351l4588l1884J2325R884
$$ -1581 -28016 -8784 32922 39205 17599 25053 41139 30788 -3800 -35684 -23359 -13475
14434a3475K9787K9802q39j403J5068q876K0576k5816j0776J6804m402j0094m1480
$$ -13475 16312 46114 45275 43872 58940 50064 70640 44824 34048 50852 46450 36356 -5124
14421e124j0175N9432n202m4562k183L34K5923k8751n510M8150J7370k4036K1945
$$ -5124 -15299 44133 38931 -5631 -7814 -7480 18443 -10308 -15818 32332 49702 25666 47611
14408D7611K7343j2281k2606J0455j1127n1268j3546L7470L2649l4270k1784L9692
$$ 47611 74954 62673 40067 50522 39395 -11873 -25419 12051 44700 10430 -11354 28338
14396B8338K3528k991m4466k7299L1582M5858j6295m9551m877L8597L9754j2990
$$ 28338 51866 48875 4409 -22890 8692 54550 38255 -11296 -16173 22424 62178 49188
14384D9188l3251L5213P0366J6072p6815o4870J2228J0466j3095J8744j9759N0604
$$ 49188 15937 51150 121516 137588 60773 -4097 8131 18597 5502 24246 4487 55091
14372E5091k0406j9136o901N999j3320j0135j2927J7831O564j9558r107K0801
$$ 55091 34685 15549 8648 14647 1327 -8808 -21735 -3904 2660 -16898 -26005 -5204
14360e204j2014k8577j6829J9314K2520r68M007l9062k1258R114K0832J3046O161
$$ -5204 -17218 -45795 -62624 -43310 -20790 -21758 -17751 -56813 -78071 -68957 -48125 -35079 -28918
14347b8918K9276J2802J7665J0111N08m5118k3559l0616K762P0879J9280M272
$$ -28918 358 13160 30825 40936 41444 -3674 -27233 -57849 -55087 15792 35072 39344
14335C9344j1229j8637l903l6280L3700K0120n7166K6179p585Q650N3964l4433
$$ 39344 28115 9478 5575 -30705 2995 23115 -34051 -7872 -15457 -6807 47157 12724
14323A2724k3800J2650o825K5539L4585j8520m866j6627j5209P555J8578Q761
$$ 12724 -11076 1574 -5251 20288 54873 36353 31487 14860 -349 7206 25784 34545
14311C4545M9327m148q4491k8671L2587K4313k1110L7389J3430j1267k5021l411
$$ 34545 83872 79724 -4767 -33438 -851 23462 2352 39741 53171 41904 16883 13472
14299A3472m7174l4539J2352Q399N8629J8525J3883N195q661p577J8515P082l2450
$$ 13472 -33702 -68241 -55889 -47490 11139 29664 43547 48742 40081 32504 51019 58101 25651
14286B5651j1835j94J6156K442m2752n5590r957R131J1794K3132L7592J2223k3153
$$ 25651 13816 13622 29778 32220 -10532 -66122 -76079 -66948 -55154 -32022 5570 17793 -5360
14273e360R319L0577l8394j7992o796L706N0282J521m3092J8016j188m7595L436
$$ -5360 3959 34536 -3858 -21850 -28646 -24940 25342 26863 -16229 1787 599 -46996 -43560
14260d3560N4772k0400l9648L3595K7449L9945M0087Q290k5067m7600j5232l8699
$$ -43560 11212 -9188 -48836 -15241 12208 52153 92240 100530 75463 27863 12631 -26068
14248b6068J7186R591Q364K2073N070n6748k6547J9418K588K4986L618J7542P798
$$ -26068 -8882 709 9073 31146 36216 -20532 -47079 -27661 -25073 -87 3531 21073 28871
14235B8871L098n481J0967L1291K867j6962k9889j0611l0549N093j7520n364M1324
$$ 28871 31969 26488 37455 68746 71613 54651 24762 14151 -16398 -11305 -28825 -34189 7135
14222G135J908L3041j0623n6879j7027N0660J7348j9845j7498j7842J3304j4470
$$ 7135 9043 42084 31461 -25418 -42445 8215 25563 5718 -11780 -29622 -16318 -30788
14210c0788j2520N82L4448N7324r871k1700j809N170j7087n772K186P967J9884
$$ -30788 -43308 -42726 -8278 49046 39175 17475 15666 20836 3749 -2023 163 8130 28014
14197B8014l3362l0713m1232N0683L5077m4898L5542J3309Q389J7879J6263m0358
$$ 28014 -5348 -36061 -77293 -26610 8467 -36431 -889 12420 20809 38688 54951 14593
14185A4593l7554R953L9168O180L355K1907l8033l2421L8239L487l7539K1854
$$ 14593 -22961 -13008 26160 32340 35695 57602 19569 -12852 25387 28874 -8665 13189
14173A3189M3918K0942N949r528J5675l0954j7206j4405k1815r717P533M093K0091
$$ 13189 57107 78049 83998 74470 90145 59191 41985 27580 5765 -3952 3581 7674 27765
14160B7765o10j3373O548N630m967N199p98j4618m8894M197J0005m4846J2402
$$ 27765 27155 13782 20330 25960 20993 26192 25394 10776 -38118 -33921 -23916 -68762 -56360
14147e6360M7330M2171P581O441k1972R089K5627j1673k3590j3762m0745j2383
$$ -56360 -9030 33141 40722 47163 25191 34280 59907 48234 24644 10882 -29863 -42246
14135d2246k0414p108p296o645K9926N2691J1977L2225l0172n1680j7135K8845
$$ -42246 -62660 -69768 -77064 -83709 -53783 -1092 10885 43110 12938 -38742 -55877 -27032
14123b7032M0607K751J3291j6878k9551L72K2194j8325j8124q624K2118J1284
$$ -27032 13575 16326 29617 12739 -16812 -16440 5754 -12571 -30695 -39319 -17201 -5917
14111e917J8714M3756n962j3924l2517j1088r428N0858K3921m9427n8504L3475
$$ -5917 12797 56553 50591 36667 4150 -6938 -16366 34492 58413 8986 -49518 -16043
14099a6043N4154k3381n9215q282K9213P703k7j6784M0048P718l3211L828R896
$$ -16043 38111 14730 -44485 -52767 -23554 -15851 -15878 -32662 7386 15104 -18107 -14279 -4383
14086d383O706O06p207O2150J9025m4347Q8O043k1998M183L6745K7035q577j5749
$$ -4383 2323 2929 -4278 57872 76897 32550 32638 38681 16683 20866 57611 84646 76069 60320
14072F0320k9818k3352j1495j8882n379N661K2793J6269L4418j9817j5273k7040
$$ 60320 30502 7150 -4345 -23227 -28606 -22945 -152 16117 50535 30718 15445 -11595
14060a1595J3326M6470k1328l0408k5568r389l4778K7033K6115N176N3972j2600
$$ -11595 1731 48201 26873 -3535 -29103 -38492 -73270 -46237 -20122 -14946 39026 26426
14048B6426n504L2299K9665k00m4099l6688k4225J1225J0756k4631o0788J7395
$$ 26426 20922 53221 82886 82686 38587 1899 -22326 -11101 -345 -24976 -85764 -68369
14036f8369Q4788K800l5286J8395L7829j5525J1109N587j9016o988l2626o67P095
$$ -68369 16419 19219 -16067 2328 40157 24632 35741 41328 22312 15324 -17302 -17969 -10874
14023a0874k3914l2391L5666M89N4142N6468j7370p315k390n8103l3763J4291
$$ -10874 -34788 -67179 -31513 -31024 23118 79586 62216 54901 52511 -5592 -39355 -25064
14011b5064l4725j4174J3145K3444r495k5205q057M1646L5752j1271P276O945
$$ -25064 -59789 -73963 -60818 -37374 -46869 -72074 -80131 -38485 -2733 -14004 -6728 217
13999B17K2966k3690N7527k1158j8769O699N087L7446n280J3715O143j9848k1243
$$ 217 23183 -507 57020 35862 17093 23792 28879 66325 61045 74760 80903 61055 39812
13986C9812k6268K0803N473J5602j1319n525N1934n4412m1001k7343J0437n259
$$ 39812 13544 34347 39820 55422 44103 38578 90512 36100 -4901 -32244 -21807 -27066
13974b7066K3584j1627L2233l412l6191o296K7644J6939J6873K883J3829k9024
$$ -27066 -3482 -15109 17124 13712 -22479 -28775 -1131 15808 32681 35564 49393 20369
13962B0369l8258J6998l391l9549Q263L0365L147M406J2782l5430l7882K336p109
$$ 20369 -17889 -891 -4282 -43831 -35568 -5203 -2056 2350 15132 -20298 -58180 -55844 -62953
13949f2953P5567J7287k4583Q358n42p478L7939M3357J9243n7595m7616m15J9152
$$ -62953 12614 29901 5318 13676 13134 5656 43595 86952 106195 48600 984 569 19721
13936A9721J6935M790k0602p555J8874j7673P944j6249K6139R072K6788j9102
$$ 19721 36656 41446 20844 13289 32163 14490 22434 6185 32324 41396 68184 49082
13924D9082l0481K0501o134l4896j8202J3040K1761n1006r705M1699R221M999
$$ 49082 18601 39102 32968 -1928 -20130 -7090 14671 -36335 -46040 -4341 4880 9879
13912I879M2034l0201j9867K2071O70j3522j4203J2443j7934N324j941J254R779
$$ 9879 51913 21712 1845 23916 24586 11064 -3139 9304 -8630 -3306 -5247 -3993 5786
13899E786j6589k0402j9273K8247L3401J7197M4396j5694k5397m4508l2899K6715
$$ 5786 -10803 -31205 -50478 -22231 11170 28367 72763 57069 31672 -12836 -45735 -19020
13887a9020K7524K0917O63n4461k1335K0239J8543k3944K6867K4012j555q018
$$ -19020 8504 29421 30084 -24377 -45712 -25473 -6930 -30874 -4007 20005 18450 10432
13875A0432J5307J726j1074R111J5004K3307L7308j9333n8721n0463K6320J5033
$$ 10432 25739 27465 16391 25502 40506 63813 101121 81788 23067 -27396 -1076 13957
13863A3957k8042j1632J3483M0299q362j896L5497J0260k5555m2836j4103O174
$$ 13957 -14085 -25717 -12234 28065 19703 17807 53304 63564 38009 -4827 -18930 -12756
13851a2756L9598K3105l7649o7816K7651L2485M541R473j7775k4557L0726K6784
$$ -12756 26842 49947 12298 -55518 -27867 4618 9159 18632 857 -23700 7026 33810
13839C3810J8516k8515k5294l212k2827M066J5286j0301K2115k038o738K7791
$$ 33810 52326 23811 -1483 -4695 -27522 -23456 -8170 -18471 3644 1606 -5132 22659
13827B2659N890k6504k9125J083l4364K1688N8268L8012m01m9412l5922j1088
$$ 22659 28549 2045 -27080 -25997 -60361 -38673 19595 57607 57206 7794 -28128 -39216
13815c9216k170L2277l2278r21L5708k188n57p285j073K6594K3988o75n0096n87
$$ -39216 -41386 -9109 -41387 -42308 -6600 -8788 -9345 -16630 -17703 8891 32879 32204 -17892 -18479
13801a8479O797m057l0243J5505K3098j0136l7934J5183j6981j0036K524J3261
$$ -18479 -11682 -15739 -45982 -30477 -7379 -17515 -55449 -40266 -57247 -67283 -64759 -51498
13789e1498K6148K0095k3845n554J5051K1758M1989L4409k9685k0899l830k3422
$$ -51498 -25350 -5255 -29100 -34654 -19603 2155 44144 78553 48868 27969 24139 717
13777G17j3834r166j4638K3892l1364j5372r468k0655N3936N2620k6399k595j786
$$ 717 -13117 -22283 -36921 -13029 -44393 -59765 -69233 -89888 -35952 16668 -9731 -12326 -14112
13764a4112j0389l7218K1334K4841j5021M568L6631Q172m0006J4514k3234j0403
$$ -14112 -24501 -61719 -40385 -15544 -30565 -25997 10634 18806 -21200 -6686 -29920 -40323
13752d0323Q183Q400J1597l3398M627K2448M670J067M492j097M0783J5131j5029
$$ -40323 -32140 -23740 -12143 -45541 -40914 -18466 -13796 -12729 -8237 -9334 31449 46580 31551
13739C1551k0702Q705k2557k9041M3475R313L2361R46J9974n525j2152K6140m036
$$ 31551 10849 19554 -3003 -32044 11431 20744 53105 54051 74025 68500 56348 82488 78452
13726G8452l202J990k6405k1271k488N13l0382p394K3843N82n378K9712L2092
$$ 78452 75250 77240 50835 29564 27076 27589 -2793 -10187 13656 14238 8860 38572 70664
13713G0664Q983O367k9336j1896J6365J1428k2387n301k4582j9122k904P633J5856
$$ 70664 79647 86014 56678 44782 61147 72575 50188 44887 20305 1183 -1721 5912 21768
13700B1768O250j9363K8094M0437k7525j7802K0772k700K4575j4937l5120J3003
$$ 21768 28018 8655 36749 77186 49661 31859 52631 49931 74506 59569 24449 37452
13688C7452k0071k0821j3672j519j8490P036J8738J2611K8494J101j389J831l3918
$$ 37452 17381 -3440 -17112 -18631 -37121 -30085 -11347 1264 29758 30859 29470 31301 -2617
13675b617l2318n785J7514l470M8499K5967l9587n4765K3417N872R818Q789r829
$$ -2617 -34935 -40720 -23206 -26676 21823 47790 8203 -46562 -23145 -17273 -7455 1334 -8495
13662h495M6583N0962k5511j4348o304m4537j7562J2164K0562L8245p995j9209
$$ -8495 38088 89050 63539 49191 42887 -1650 -19212 -7048 13514 51759 43764 24555
13650B4555o260k6093j8098n2465k481P2505K0304j6368J191J1331K5636J0181
$$ 24555 18295 -7798 -25896 -78361 -80842 -8337 11967 -4401 -3210 8121 33757 43938
13638D3938j9002m8488K806J6069J0219M5416j9771n4567J008J0292N7730L8440
$$ 43938 24936 -23552 -20746 -4677 5542 50958 31187 -23380 -22372 -12080 45650 84090
13626H4090n4174K6916j757o6805k7060P889P114p382j5810J0841M2851J6850
$$ 84090 29916 56832 55075 -11730 -38790 -30901 -23787 -31169 -46979 -36138 6713 23563
13614B3563o450j1368J7534k4539l8844P118L3728J6968n0271j2119K2391j8689
$$ 23563 17113 5745 23279 -1260 -40104 -32986 742 17710 -32561 -44680 -22289 -40978
13602d0978J8492M7574O893l495J6506J0610k4172l5841K9645p07K2249J8646
$$ -40978 -22486 25088 31981 28486 44992 55602 31430 -4411 25234 24527 46776 65422
13590F5422j2654n8759l8079J0152K8254M1574n01l6840R781l5801K0229K2242
$$ 65422 52768 -5991 -44070 -33918 -5664 35910 35409 -1431 8350 -27451 -7222 15020
13578A5020L9Q991J0166N466l5619j157M707L4959j7333L9168n6369Q44J0567
$$ 15020 15059 24050 34216 39682 4063 2906 7613 42572 25239 64407 8038 8882 19449
13565A9449m559j8658K77L6789J9365n0597J2019k6319j2286Q97L7327N2639l2277
$$ 19449 14890 -3768 -3491 33298 52663 2066 14085 -12234 -24520 -23623 13704 66343 34066
13552C4066l3673L1997M2536m4945n017J5597L3765L2343O875R292k9746k3885
$$ 34066 393 32390 74926 29981 24964 40561 74326 106669 113544 122836 93090 69205
13540F9205k6678j2413j4390j794J0622j5465p906n295J173R626k8454l9419n1996
$$ 69205 42527 30114 15724 13930 24552 9087 1181 -4114 -2941 6685 -21769 -61188 -113184
13527a13184N6478L6432l1489J783J8257l877L2517Q246p143o742k127l0646J7797
$$ -113184 -56706 -20274 -51763 -49980 -31723 -35600 -3083 5163 -1980 -8722 -10849 -41495 -23698
13514b3698r63O284L1082L4756j7101m869L8699j0376l8604l882j5944j167L156
$$ -23698 -24661 -18377 12705 47461 30360 25491 64190 53814 15210 11328 -4616 -5783 -2627
13501b627L1391k6910k8852M0121o078m015m983L193N135M7313K3844N021j3610
$$ -2627 28764 1854 -26998 13123 7045 3030 -1953 1240 6375 53688 77532 82553 68943
13488F8943J0018k4051m4144j8627j582l1159k1916N3510J3297L9059N3112j2437
$$ 68943 78961 54910 10766 -7861 -9443 -40602 -62518 -9008 4289 43348 96460 84023
13476H4023l9410q552j6143r955L7326L0530l1367j3875L1950q681N67k6817K6183
$$ 84023 44613 36061 19918 9963 47289 77819 46452 32577 64527 55846 56413 29596 55779
13463E5779O805k0305o156J7957J530n6808J2116M4958l2333k8612K1162K089
$$ 55779 62584 42279 36123 54080 55610 -1198 10918 55876 23543 -5069 16093 18182
13451A8182N1531K5210m7850r329N165l1234M0751K3277l4629m2715M899j3997
$$ 18182 69713 94923 47073 37744 42909 11675 52426 75703 41074 -1641 3258 -10739
13439a0739J6339J8593J840m4730N591K247J2556J3896O885r147O843q69r843
$$ -10739 5600 24193 26033 -18697 -13106 -10859 1697 15593 22478 13331 20174 19305 9462
13426I462m51K6344J6404q850R187M474K0228J2561k3932l5624M012k1019L878
$$ 9462 9011 35355 51759 42909 52096 56570 76798 89359 65427 29803 33815 12796 16674
13413A6674K026J328o440m5778j4640j8717J3977K9209K3940j498j6399m4916
$$ 16674 18700 20028 13588 -32190 -46830 -65547 -51570 -22361 1579 81 -16318 -61234
13401f1234k148L7689L9330k0316J7177O192j5669k472K1051r534K363q746K995
$$ -61234 -63382 -25693 13637 -6679 10498 16690 1021 -1451 19600 10066 12429 3683 6678
13388F678J7376J8550k2144O438k0105k1545j9531M0104J7253K365n2369j9617
$$ 6678 24054 42604 20460 26898 6793 -14752 -34283 5821 23074 25439 -26930 -46547
13376d6547K2077K3294L14j5749k03k5247J8808N7085J6001o448l0394l1412J6694
$$ -46547 -24470 -1176 -862 -16611 -16814 -42061 -23253 33832 49833 43385 12991 -18421 -1727
13363a727K0864k383k6328R928K1679k5105j9017O373l0522m96P64K9002L8793
$$ -1727 19137 16754 -9574 354 22033 -3072 -22089 -15716 -46238 -46734 -45970 -16968 21825
13350B1825J1079p45l6051n882J0106m63j4282J5704J1093J4667j1466P269k001
$$ 21825 32904 32159 -3892 -9774 332 -131 -14413 1291 12384 27051 15585 22854 20853
13337B0853q269j0489J9226L7247j9103o545j2151l3306K971P79j2894j1122O620
$$ 20853 12584 2095 21321 58568 39465 32920 20769 -12537 -9566 -8787 -21681 -32803 -26183
13324b6183M153L3025K6883J6988k8803k4747p702K7985M2458j6118p5383l5340
$$ -26183 -22030 10995 37878 54866 26063 1316 -6386 21599 64057 47939 -27444 -62784
13312f2784o837j8623L9003M1958j1555j4478j1760m788N9844K3626l3832m4849
$$ -62784 -69621 -88244 -49241 -7283 -18838 -33316 -45076 -49864 9980 33606 -226 -45075
13300d5075J4043M1618L1517L4794k3827m7902o296J8861J6199Q228k4406l2037
$$ -45075 -31032 10586 42103 76897 53070 5168 -1128 17733 33932 42160 17754 -14283
13288a4283p762J0195K7474K6910N770l2466J8310l49J9772L8862l0133m5403
$$ -14283 -22045 -11850 15624 42534 48304 15838 34148 33799 53571 92433 62300 16897
13276A6897l925r275j0603Q082M4520L836j6493k3926j3456R005K4638J4471j0395
$$ 16897 12972 3697 -6906 1176 45696 49532 33039 9113 -4343 4662 29300 43771 33376
13263C3376k4774N398j133K5057K6251j1403j8524m5324J1470K8658k0797k3558
$$ 33376 8602 14000 12867 37924 64175 52772 34248 -11076 394 29052 8255 -15303
13251a5303L035p087p821K8685N3424N4965k0570l0202m3840k1769k6542J0748
$$ -15303 -12268 -19355 -27176 1509 54933 109898 89328 59126 15286 -6483 -33025 -22277
13239b2277O7441J1579J7267j6193k5447k4199l2533N3630J3477n1643j3707l0013
$$ -22277 45164 56743 74010 57817 32370 8171 -24362 29268 42745 -8898 -22605 -52618
13227e2618k6031l154L9346L474R160q197L0692M4724K8738J2082k0322m2811
$$ -52618 -78649 -81803 -42457 -38983 -29823 -38020 -7328 37396 66134 78216 57894 15083
13215A5083J2512M2754J8535o5517J7501K3557K849l2674m2758k9518l299K4072
$$ 15083 27595 70349 88884 23367 40868 64425 67274 34600 -8158 -37676 -40975 -16903
13203a6903N1203K1657M817q0688r999m20j7061J5016k779k7568K7363k369l4852
$$ -16903 34300 55957 60774 -19914 -29913 -30333 -47394 -32378 -35157 -62725 -35362 -37731 -72583
13190g2583j9525R863L9167J2593O315K5080L2888P210O582P472o5202q886L0004
$$ -72583 -92108 -82245 -43078 -30485 -24170 910 33798 41008 47590 55062 -10140 -19026 10978
13177A0978j6690l9536J3650K8909l7063j6204L0228K090K8796K7247J4772l4635
$$ 10978 -5712 -45248 -31598 -2689 -39752 -55956 -25728 -23638 5158 32405 47177 12542
13165A2542m1691q90M0298M2327M0976J1890n2392p5231J9725N6723k3614l6148
$$ 12542 -29149 -30039 10259 52586 93562 105452 53060 -22171 -2446 54277 30663 -5485
13153e485l5997q38J660K0951k1153n2560p635L6702k818k8071J302J0992j0376
$$ -5485 -41482 -42320 -40660 -19709 -40862 -93422 -101057 -64355 -67173 -95244 -93942 -82950 -93326
13140i3326M1259L7852j4213q241m8676l5027L8214M8023K8272J2421j5359L1706
$$ -93326 -52067 -14215 -28428 -36669 -85345 -120372 -82158 -34135 -5863 6558 -8801 22905
13128B2905J4307m8874j2761M0130L3359q608m719l7242k4160K448J5145K7949
$$ 22905 37212 -11662 -24423 15707 49066 40458 35739 -1503 -25663 -23215 -8070 19879
13116A9879j2588m1390l2682M320j4769M146K980l600j7074r466O7377M3316j8212
$$ 19879 7291 -34099 -66781 -62461 -77230 -73084 -70104 -73704 -90778 -100244 -32867 10449 -7763
13103g763L013J6231l7449l4747L218N4409q761j5669P955K5232K040J5419j7701
$$ -7763 -4750 11481 -25968 -60715 -57497 -3088 -11849 -27518 -19563 5669 7709 23128 5427
13090E427M784k594j3109p628K9253L523L498l3353P127K0889k7474m3482o463
$$ 5427 10211 7617 -5492 -13120 16133 19656 23154 -10199 -3072 17817 -9657 -53139 -59602
13077e9602L8982J4569K7575j6981K8373J7031o904k4862k1762J3168k2418k0152
$$ -59602 -20620 -6051 21524 4543 32916 49947 43043 18181 -3581 9587 -12831 -32983
13065c2983n940l0035o134N9290K3685L9683L6544r920n3097J8604K4505k6787
$$ -32983 -38923 -68958 -75092 -15802 7883 47566 84110 74190 21093 39697 64202 37415
13053C7415l4788j3268Q952k1504l5733k25O0054k5554l102M7642M8982l839j9235
$$ 37415 2627 -10641 -1689 -23193 -58926 -59151 903 -24651 -27753 19889 68871 65032 45797
13040D5797j7481j401j1765L880k2070l8955j3579J6352N8150J8199r426L4523
$$ 45797 28316 26915 15150 19030 -3040 -41995 -55574 -39222 18928 37127 27701 62224
13028F2224j2512J0604J8522J2399k3736n9401n575J159M6841k6437j8740k8138
$$ 62224 49712 60316 78838 91237 67501 8100 2525 3684 50525 24088 5348 -22790
13016b2790K6378J0110l117J3529j3330r999r708j7360l8884M625L4066J8075
$$ -22790 3588 13698 10581 24110 10780 781 -8927 -26287 -65171 -60546 -26480 -8405
13004h405M7819K1573j566k2557p0023r681L6590k9241K527j3615J1812J1367
$$ -8405 39414 60987 59421 36864 -33159 -42840 -6250 -35491 -32964 -46579 -34767 -23400
12992b3400M4840J3336k4577R338N135j3831m3187k026k560j6451k2629O7346
$$ -23400 21440 34776 10199 19537 24672 10841 -32346 -34372 -36932 -53383 -76012 -8666
12980h666N4448J5347m5011l1146k822j1118q487j7045J8108J7261l0280J3889
$$ -8666 45782 61129 16118 -15028 -17850 -28968 -37455 -54500 -36392 -19131 -49411 -35522
12968c5522K3247n309q633M043j9303M6954k6726q301o714L5819M9443j855l4521
$$ -35522 -12275 -17584 -26217 -22174 -41477 5477 -21249 -29550 -36264 -445 48998 47143 12622
12955A2622k7124k7151K6863R464m4425r15N1359K9178l6446l5616O9751J5030
$$ 12622 -14502 -41653 -14790 -5326 -49751 -50666 693 29871 -6575 -42191 27560 42590
12943D2590k5053k0556M833O348j3615J6716j3098j4098L8759J7112m9054l9546
$$ 42590 17537 -3019 1814 8162 -5453 11263 -1835 -15933 22826 39938 -9116 -48662
12931d8662j0924j6318J6664L6933q930k704J8008K5263K2518J4324J0727p545
$$ -48662 -59586 -75904 -59240 -22307 -31237 -33941 -15933 9330 31848 46172 56899 49354
12919D9354l002k7493o2465K734K7731J7866L789k6141M3426L4422k1839j8513
$$ 49354 46352 18859 -43606 -40872 -13141 4725 8514 -17627 25799 60221 38382 19869
12907A9869o980j1930L6875q211k5066l4022n410J1371j3180j3348P927j5459
$$ 19869 12889 959 37834 29623 4557 -29465 -34875 -23504 -36684 -50032 -42105 -57564
12895e7564M2858J0443m6344L5130J1406k021j9179l4647K6864K6706J378K5802
$$ -57564 -14706 -4263 -50607 -15477 -4071 -6092 -25271 -59918 -33054 -6348 -4970 20832
12883B0832K1685m1517m4655O4533J4982k7506K9908K0346p597J1707K3081o365
$$ 20832 42517 1000 -43655 20878 35860 8354 38262 58608 51011 62718 85799 79434
12871G9434o4376n5749o5383K8949l987N1962O4128j850L125M318n1901l0282
$$ 79434 15058 -40691 -106074 -77125 -81112 -29150 34978 33128 36253 40571 -11330 -41612
12859d1612K8424M8872k8353k9192k3116j7182J3310N2648K4448J745K3721N369
$$ -41612 -13188 35684 7331 -21861 -44977 -62159 -48849 3799 28247 29992 53713 59082
12847E9082j7288M112j5289j8662l233K6184J122K3595P183m3130j3321j93N7623
$$ 59082 41794 45906 30617 11955 8722 34906 36028 59623 66806 23676 10355 10162 67785
12834F7785L8856m8695l1101j2209k2342k4323m4646k4815M1808L7925J8821J897
$$ 67785 106641 57946 26845 14636 -7706 -32029 -76675 -101490 -59682 -21757 -2936 -1039
12822a039k4651K735l3077J5996j6628k499N251K1941P811J2705P323j5916m0744
$$ -1039 -25690 -22955 -56032 -40036 -56664 -59163 -53912 -31971 -24160 -11455 -4132 -20048 -60792
12809f0792N271L6697J6045m385R963J1074j8654k3884l550j2893J1638K9393
$$ -60792 -55521 -18824 -2779 -7164 2799 13873 -4781 -28665 -32215 -45108 -33470 -4077
12797d077J4577m0974j2816J321j4749L0564L9535L189J1156K9338k4020m3470
$$ -4077 10500 -30474 -43290 -41969 -56718 -26154 13381 16570 27726 57064 33044 -10426
12785a0426k7898J9197o155L7302m883k5419L5325N2136Q886r657j0203J5202
$$ -10426 -38324 -19127 -25282 12020 7137 -18282 17043 69179 78065 68408 58205 73407
12773G3407J1564j4473l7970k4460Q321J4421n5437j2358K5379j7802j2242M4144
$$ 73407 84971 70498 32528 8068 16389 30810 -24627 -36985 -11606 -29408 -41650 2494
12761B494J982k1779k5137k7738J4006j2026J340L3047M9513L3788k9791l3008
$$ 2494 4476 -17303 -42440 -70178 -56172 -68198 -66858 -33811 15702 49490 19699 -13309
12749a3309J2939K032J9157J2428j7496K0437L0758k5355k9830K2658j637n6647
$$ -13309 -370 1662 20819 33247 15751 36188 66946 41591 11761 34419 32782 -23865
12737b3865l1760K9649K6526Q151R221K9076j784k0009k6408M5885O494n8761
$$ -23865 -55625 -25976 550 8701 17922 46998 45214 25205 -1203 44682 51176 -7585
12725g585M142k4965K2773J6180J6129l215q799J8855k096K3576q447k5351Q468
$$ -7585 -3443 -28408 -5635 10545 26674 23459 14660 33515 31419 54995 46548 21197 29665
12712B9665L2366j4787n524K5683L5172J2799L0772n383j1846j8208n4884o8397
$$ 29665 62031 47244 41720 67403 102575 115374 146146 140763 128917 110709 55825 -12572
12700a2572J1489N4826k0904j3763O834k5193n110J9760k6743l2868R659J2198
$$ -12572 -1083 53743 32839 19076 25910 717 -4393 15367 -11376 -44244 -34585 -22387
12688b2387j2058p221l157M23p263L5371J6984k6133J1825l724N481n5566n13
$$ -22387 -34445 -41666 -44823 -44400 -51663 -16292 692 -25441 -13616 -17340 -11859 -67425 -67938
12675f7938K4050K3817J2914j5581j169J267m6443J3967K8241J5438l5389J5336
$$ -67938 -43888 -20071 -7157 -22738 -23907 -22640 -69083 -55116 -26875 -11437 -46826 -31490
12663c1490n881m280P712m938J4480k3968J5081N0014p599j2084q837j5641O2763
$$ -31490 -37371 -41651 -33939 -38877 -24397 -48365 -33284 16730 9131 -2953 -11790 -27431 35332
12650C5332l2492k8493R215J2603N5237J2845m6509m7297J5663L5626l0386k2715
$$ 35332 2840 -25653 -16438 -3835 51402 64247 17738 -29559 -13896 21730 -8656 -31371
12638c1371L1584p195k2513j2791l8929N3164K8793p875p037j1800J3006r463
$$ -31371 213 -6982 -29495 -42286 -81215 -28051 742 -7133 -14170 -25970 -12964 -22427
12626b2427j0982K9182K5302n158j5153n788J1593N393n0513j9398K4682K2056
$$ -22427 -33409 -4227 21075 15917 764 -5024 6569 11962 -38551 -57949 -33267 -11211
12614a1211M145j6804Q958K8574k7412m210J7437m307n229o1106k1924M5156L3153
$$ -11211 -7066 -23870 -14912 13662 -13750 -17960 -523 -4830 -10059 -71165 -93089 -47933 -14780
12601a4780L7974J0443m83J7441j781k1463l7042M648J7358j2530j2186l609J073
$$ -14780 23194 33637 33154 50595 48814 27351 -9691 -5043 12315 -215 -12401 -16010 -14937
12588a4937L789L5367K194j8390l1335n9107K7654L9982K8529l5525j2760O4142
$$ -14937 -11148 24219 26413 8023 -23312 -82419 -54765 -14783 13746 -21779 -34539 29603
12576B9603K3783l632J6374l1566L1J3309k0476k5070j7994r912J6971N2648j2075
$$ 29603 53386 49754 66128 34562 34593 47902 27426 2356 -15638 -25550 -8579 44069 31994
12563C1994n0372j8568k3294J813K4003n779M5782M4613N3076r902j3858l5139
$$ 31994 -18378 -36946 -60240 -58427 -34424 -40203 5579 50192 103268 93366 79508 44369
12551D4369j7617L771j3693j3888l524L3443L9549l8300m6419m0066j7907J7252
$$ 44369 26752 30523 16830 2942 -582 32861 72410 34110 -12309 -52375 -70282 -53030
12539e3030L3911O574q560r631L512L597j5360N2088L3575J6872J6116j0940k7463
$$ -53030 -19119 -12545 -21105 -30736 -27224 -23627 -38987 13101 46676 63548 79664 68724 41261
12526D1261J2943J3016l8799l5955j494R689K0369J2796k8793n147k108L0543
$$ 41261 54204 67220 28421 -7534 -9028 661 21030 33826 5033 -114 -2222 28321
12514B8321J5327m1080L6697N324O359k1411n1943J380Q233k1486n4979j815L1631
$$ 28321 43648 2568 39265 44589 50948 29537 -22406 -21026 -12793 -34279 -89258 -91073 -59442
12501e9442M2627l9565j0145J7606K3675k0245j5941O6481K6237O530p01N804
$$ -59442 -16815 -56380 -66525 -48919 -25244 -45489 -61430 5051 31288 37818 37117 42921
12489D2921j1711k5087l2599Q19p631p936N3764N3892j2878k6629k7504K8366
$$ 42921 31210 6123 -26476 -25657 -33288 -41224 12540 66432 53554 26925 -579 27787
12477B7787O463K9963l206R948P795k7818J8844J6380J440k0341m418J0656n632
$$ 27787 34250 64213 61007 70955 78750 50932 69776 86156 87596 67255 62837 73493 67861
12464F7861k3661J9533k6321m0543j4592j8557L8457K1357M319j8482k4536j0280
$$ 67861 44200 63733 37412 -3131 -17723 -36280 2177 23534 27853 9371 -15165 -25445
12452b5445K9416K707m2914j6705M3641K6467m6345K297L0605J3027J5285j0698
$$ -25445 3971 6678 -36236 -52941 -9300 17167 -29178 -26881 3724 16751 32036 21338
12440B1338m3012j2379M1884J8903M677M294p59K2133k6539m7943Q573M2596K4570
$$ 21338 -21674 -34053 7831 26734 31411 35705 34946 57079 30540 -17403 -8830 33766 58336
12427E8336J602r804p934J644q725p457l5278j427k874M1960o631n5334l4352
$$ 58336 59938 50134 42200 43844 35119 27662 -7616 -9043 -11917 30043 23412 -31922 -66274
12414f6274R005K2537M4419K1840M777J122l617l7576p8720l640N8430K0555q29
$$ -66274 -57269 -34732 9687 31527 36304 37426 33809 -3767 -82487 -86127 -27697 -7142 -7971
12401g971j2604k8165L7504M115k9873Q780N1904L3913K8725j8335k4247q307
$$ -7971 -20575 -48740 -11236 -7121 -36994 -28214 23690 57603 86328 67993 43746 35439
12389C5439k749m494K213j6289p637j6403p548N264q242J1131L2084K2187j5263
$$ 35439 32690 28196 30409 14120 6483 -9920 -17468 -12204 -20446 -9315 22769 44956 29693
12376B9693j7027J2730m240k1612K3777m47K3746O833m6412j5497j9669L5113
$$ 29693 12666 25396 21156 -456 23321 22874 46620 53453 7041 -8456 -28125 6988
12364F988O4594K4682n254p195m7650m4765k4137Q062O0042M316Q413q65j6730
$$ 6988 71582 96264 91010 83815 36165 -8600 -32737 -24675 35367 39683 48096 47231 30501
12351C0501l4203l3521k5384M7442N1144k756l6244j1244J0300r365l794m710
$$ 30501 -3702 -37223 -62607 -15165 35979 33223 -3021 -14265 -3965 -13330 -17124 -21834
12339b1834m6485K1276K662L1743K8755O849M234J1619q025j4599L8090N485o5061
$$ -21834 -68319 -47043 -44381 -12638 16117 22966 27200 38819 30794 16195 54285 59770 -5291
12326e291Q148L1718P617m1159R92N284l3273J2555K9590K167l760L7517K3696
$$ -5291 2857 34575 42192 1033 2025 7309 -25964 -13409 16181 18348 14588 52105 75801
12313G5801j2623l317j3607M764K9948J7512j0995J4210o2877k2709N261o397
$$ 75801 63178 59861 46254 51018 80966 98478 87483 101693 38816 16107 21368 14971
12301A4971Q233P476l0988R905p234L0642K8274p378k7294j6134l9506n216K6140
$$ 14971 23204 30680 -308 9597 2363 33005 61279 53901 26607 10473 -29033 -34249 -8109
12288h109k5363K266L0539O163L326l872m4423j3051K9586L1922j2841l5307R265
$$ -8109 -33472 -31206 -667 5496 8822 4950 -39473 -52524 -22938 8984 -3857 -39164 -29899
12275b9899M2157n9418k1368N3484K9703L6907l9779m3226K3921M5077j0452o6959
$$ -29899 12258 -47160 -68528 -15044 14659 51566 11787 -31439 -7518 37559 27107 -39852
12263c9852j4655n468K5520K7677N407o246k1939l927K1996p045r248N204Q452
$$ -39852 -54507 -59975 -34455 -6778 -1371 -7617 -29556 -33483 -11487 -18532 -27780 -22576 -14124
12250a4124P601L190K1919K8273p289j6390J8773R449m3309l7945m421Q116L905
$$ -14124 -6523 -3333 18586 46859 39570 23180 41953 51402 8093 -29852 -34273 -26157 -22252
12237b2252J4356l0307n4322J8278L0643K1085j567k5104J107j6353k2698M2287
$$ -22252 -7896 -38203 -92525 -74247 -43604 -22519 -24086 -49190 -48083 -64436 -87134 -44847
12225d4847J1464j3579K3167j6578j4852K3407L0339O66L1243K7453k4519o2640
$$ -44847 -33383 -46962 -23795 -40373 -55225 -31818 -1479 -813 30430 57883 33364 -29276
12213b9276l7519k5945K1550J5499k507O373l448J694L2944L2346j7261k9010
$$ -29276 -66795 -92740 -71190 -55691 -58198 -51825 -55273 -53579 -20635 11711 -5550 -34560
12201c4560K716J6527j8773J6059k5304l6327L2578N5093M0375k4887L490M1655
$$ -34560 -31844 -15317 -34090 -18031 -43335 -79662 -47084 8009 48384 23497 26987 68642
12189F8642j1323m838J2868j2777j2094n831P72j4856R44m1574l8806J8426o205
$$ 68642 57319 52481 65349 52572 40478 34647 35419 20563 21507 -20067 -58873 -40447 -46652
12176d6652J1126J7444M7221l2127l9815l6197P194K6985L5660N835m5620j7769
$$ -46652 -35526 -18082 29139 -2988 -42803 -79000 -71806 -44821 -9161 -3326 -48946 -66715
12164f6715K3558L7816j3281o595K5736j6030j6990L6947j8503k6272k6444M1198
$$ -66715 -43157 -5341 -18622 -25217 519 -15511 -32501 4446 -14057 -40329 -66773 -25575
12152b5575K6522K0407J5648l0932j2585J5267j8115J3064L7166j9096l4856q854
$$ -25575 947 21354 37002 6070 -6515 8752 -9363 3701 40867 21771 -13085 -21939
12140b1939L2045K5915l3040k3354J7805j9414j3097L270K3334L0159J5167k6768
$$ -21939 10106 36021 2981 -20373 -2568 -21982 -35079 -31809 -8475 21684 36851 10083
12128A0083k203M464k8983K4740K3218k5838m2029K3496K7039j9375J8401m609
$$ 10083 7880 12344 -16639 8101 31319 5481 -36548 -13052 13987 -5388 13013 8404
12116H404k0792q680j2199N2528L1849O1723O5n3928n4293j5514Q144J1724k9561
$$ 8404 -12388 -21068 -33267 19261 51110 112833 112898 58970 4677 -10837 -2693 9031 -20530
12103b0530M991J0918k5662K4991L703P819J6617k6805l5790j4519K7350J3437
$$ -20530 -15539 -4621 -30283 -5292 -1589 6230 22847 -3958 -39748 -54267 -26917 -13480
12091a3480K4606j4802k3323o705J4409J1810k4071O516k2217Q432J1818Q784
$$ -13480 11126 -3676 -26999 -33704 -19295 -7485 -31556 -25040 -47257 -38825 -27007 -18223
12079a8223K4620R181K384J1797k397l148J0552M0118L5679j3711m9937m6368
$$ -18223 6397 15578 17962 29759 27362 24214 34766 74884 110563 96852 46915 547
12067E47J2675K9958J3650L440j2219l5425J8449K3158n131l1778K026J1119m4874
$$ 547 13222 43180 56830 60270 48051 12626 31075 54233 49102 17324 19350 30469 -14405
$$ [...]
##END NTUPLES=NMR SPECTRUM
##END=
