##TITLE=Analysis number 327880
Compound Code mo 08016
Book Reference 510/42
Project Code adrs
Chemist Name jimp
##JCAMPDX= 6.0         $$ Bruker NMR JCAMP-DX V2.0
##DATA TYPE= NMR SPECTRUM
##DATA CLASS= NTUPLES
##ORIGIN= Bruker BioSpin GmbH
##OWNER= nmr
$$ XWIN-NMR		Version 3.5
$$ Mon Apr 16 09:13:40 2007 GMT Daylight Time (UT+1h)  MAYBRIDGE\nmr@NMR_250MHZ
##.OBSERVE FREQUENCY= 250.131544655141
##.OBSERVE NUCLEUS= ^1H
##.ACQUISITION MODE= SIMULTANEOUS (DQD)
##.ACQUISITION SCHEME= undefined
##.AVERAGES= 16
##.DIGITISER RES= 18
##SPECTROMETER/DATA SYSTEM= dpx250
##.PULSE SEQUENCE= zg30
##.SOLVENT NAME= DMSO
##.SHIFT REFERENCE= (INTERNAL, DMSO, 0, 16.567)
##AUDIT TRAIL= $$ (NUMBER, WHEN, WHO, WHERE, WHAT)
$$ ##TITLE= Audit trail, XWIN-NMR		Version 3.5
$$ ##JCAMPDX= 5.01
$$ ##ORIGIN= Bruker BioSpin GmbH
$$ ##OWNER= nmr
$$ C:\u/data/dgb/nmr/ADRS/1470/pdata/1/auditp.txt
$$ ##AUDIT TRAIL=  $$ (NUMBER, WHEN, WHO, WHERE, WHAT)
(   1,<2007-04-16 09:13:04.99 +100>,<MAYBRIDGE\nmr>,<NMR_250MHZ>,
      <created by zg, POWCHK disabled, PULCHK disabled
       configuration hash MD5:
       49 4B E0 1D 92 C2 6B 37 9F E6 65 BC 52 41 86 1D
       data hash MD5: 64K
       74 78 70 35 DA 23 6E DB 11 B0 18 6A F6 D1 2D E0>)
(   2,<2007-04-16 09:13:22.82 +100>,<MAYBRIDGE\nmr>,<NMR_250MHZ>,
      <Start of raw data processing
       ef LB = 0.3 FT_mod = 6 PKNL = 1 SI = 32K 
       data hash MD5: 32K
       EF 69 19 59 FF 6D 8A 07 4D 13 39 F9 74 10 7F 43>)
(   3,<2007-04-16 09:13:26.74 +100>,<MAYBRIDGE\nmr>,<NMR_250MHZ>,
      <apk 
       data hash MD5: 32K
       B1 46 1E 46 CD 4B A9 C1 E5 0B DD 2E 65 2E 61 55>)
(   4,<2007-04-16 09:13:27.78 +100>,<MAYBRIDGE\nmr>,<NMR_250MHZ>,
      <abs ABSG = 5 
       data hash MD5: 32K
       11 E0 21 37 0D 68 4C CC C8 32 9D E2 1B 9B EA 71>)
$$ ##END=
$$ 
$$ hash MD5
$$ 57 81 A8 B5 67 14 AA 89 34 15 D5 81 65 00 F9 3E
##$RELAX= 
##$RELAX= 
##$RELAX= 
##$RELAX= 
##$RELAX= 
##$RELAX= 
##$RELAX= 
$$ Bruker specific parameters
$$ --------------------------
##$DU= <C:\u>
##$EXPNO= 1470
##$NAME= <ADRS>
##$PROCNO= 1
##$TYPE= <nmr>
##$USER= <dgb>
##$AMP= (0..31)
100 100 100 100 100 100 100 100 100 100 100 100 100 100 100 100 100 100 
100 100 100 100 100 100 100 100 100 100 100 100 100 100 
##$AQSEQ= 0
##$AQ_mod= 3
##$AUNM= <au_zg>
##$AUTOPOS= <2 >
##$BF1= 250.13
##$BF2= 250.13
##$BF3= 250.13
##$BF4= 250.13
##$BF5= 500.13
##$BF6= 500.13
##$BF7= 500.13
##$BF8= 500.13
##$BYTORDA= 1
##$CFDGTYP= 0
##$CFRGTYP= 5
##$CHEMSTR= <none>
##$CNST= (0..31)
1 1 145 1 1 1 1 1 1 1 1 1 1 1 1 1 1 1 1 1 1 1 1 1 1 1 1 1 1 1 1 1 
##$CPDPRG= <>
##$CPDPRG1= <>
##$CPDPRG2= <>
##$CPDPRG3= <>
##$CPDPRG4= <mlev>
##$CPDPRG5= <mlev>
##$CPDPRG6= <mlev>
##$CPDPRG7= <mlev>
##$CPDPRG8= <mlev>
##$CPDPRGB= <>
##$CPDPRGT= <>
##$D= (0..31)
0 1 0 0 0 0 0 0 0 0.06 0 0 0 0 0 0 0.0002 0 0 0 0 0 0 0 0 0 0 0 0 0 0 
0 
##$DATE= 1176711181
##$DBL= (0..7)
120 120 120 120 120 120 120 120 
##$DBP= (0..7)
150 150 150 150 150 150 150 150 
##$DBP07= 0
##$DBPNAM0= <>
##$DBPNAM1= <>
$$ [...]
##$SUBNAM7= <"">
##$SUBNAM8= <"">
##$SUBNAM9= <"">
##$SW= 20.6930455092707
##$SWIBOX= (0..15)
0 0 3 0 0 0 0 0 0 0 0 0 0 0 0 0 
##$SW_h= 5175.983436853
##$TD= 65536
##$TD0= 1
##$TE= 683.16
##$TE2= 300
##$TE3= 300
##$TEG= 300
##$TL= (0..7)
0 120 120 120 120 120 120 120 
##$TP= (0..7)
150 150 150 150 150 150 150 150 
##$TP07= 0
##$TPNAME0= <>
##$TPNAME1= <>
##$TPNAME2= <>
##$TPNAME3= <>
##$TPNAME4= <>
##$TPNAME5= <>
##$TPNAME6= <>
##$TPNAME7= <>
##$TPOAL= (0..7)
0.5 0.5 0.5 0.5 0.5 0.5 0.5 0.5 
##$TPOFFS= (0..7)
0 0 0 0 0 0 0 0 
##$TUNHIN= 0
##$TUNHOUT= 0
##$TUNXOUT= 0
##$USERA1= <user>
##$USERA2= <user>
##$USERA3= <user>
##$USERA4= <user>
##$USERA5= <user>
##$V9= 5
##$VALIST= <valist>
##$VCLIST= <CCCCCCCCCCCCCCC>
##$VD= 0
##$VDLIST= <DDDDDDDDDDDDDDD>
##$VPLIST= <PPPPPPPPPPPPPPP>
##$VTLIST= <TTTTTTTTTTTTTTT>
##$WBST= 1024
##$WBSW= 4
##$XGAIN= (0..3)
0 0 0 0 
##$XL= 0
##$YL= 0
##$YMAX_a= 372637
##$YMIN_a= -409249
##$ZGOPTNS= <>
##$ZL1= 120
##$ZL2= 120
##$ZL3= 120
##$ZL4= 120
##$ABSF1= 16.56702
##$ABSF2= -4.126154
##$ABSG= 5
##$ABSL= 3
##$ALPHA= 0
##$AQORDER= 0
##$ASSFAC= 0
##$ASSFACI= 0
##$ASSFACX= 0
##$ASSWID= 0
##$AUNMP= <proc_1d>
##$AZFE= 0.1
##$AZFW= 0.1
##$BCFW= 0
##$BC_mod= 0
##$BYTORDP= 0
##$COROFFS= 0
##$CY= 12.5
##$DATMOD= 1
##$DC= 0
##$DFILT= <>
##$DTYPP= 0
##$F1P= 14.0000005364418
##$F2P= -0.99999901652339
##$FCOR= 0.5
##$FTSIZE= 32768
##$FT_mod= 6
##$GAMMA= 0
##$GB= 0
##$INTBC= 1
##$INTSCL= 1
##$ISEN= 128
##$LB= 0.3
##$LEV0= 0
##$LPBIN= 0
##$MAXI= 10000
##$MC2= 0
##$MEAN= 0
##$ME_mod= 0
##$MI= 0
##$NCOEF= 0
##$NC_proc= -3
##$NLEV= 6
##$NOISF1= 0
##$NOISF2= 0
##$NSP= 0
##$NTH_PI= 0
##$NZP= 0
##$OFFSET= 16.56702
##$PC= 1
##$PHC0= 217.2845
##$PHC1= 5.959543
##$PH_mod= 1
##$PKNL= yes
##$PPARMOD= 0
##$PSCAL= 4
##$PSIGN= 0
##$REVERSE= no
##$SF= 250.129988737478
##$SI= 32768
##$SIGF1= 0
##$SIGF2= 0
##$SINO= 400
##$SIOLD= 32768
##$SREGLST= <1H.DMSO>
##$SSB= 0
##$STSI= 32768
##$STSR= 0
##$SW_p= 5175.98343685301
##$SYMM= 0
##$S_DEV= 0
##$TDeff= 65536
##$TDoff= 0
##$TI= <Analysis number 999999
Compound Code 99
Book Reference 9
Project Code 9>
##$TILT= no
##$TM1= 0
##$TM2= 0
##$TOPLEV= 0
##$USERP1= <user>
##$USERP2= <user>
##$USERP3= <user>
##$USERP4= <user>
##$USERP5= <user>
##$WDW= 1
##$XDIM= 32768
##$YMAX_p= 449758340
##$YMIN_p= -146234
$$ End of Bruker specific parameters
$$ ---------------------------------
##NTUPLES= NMR SPECTRUM
##VAR_NAME=  FREQUENCY,     SPECTRUM/REAL,   SPECTRUM/IMAG
##SYMBOL=    X,             R,               I
##VAR_TYPE=  INDEPENDENT,   DEPENDENT,       DEPENDENT
##VAR_FORM=  AFFN,          ASDF,            ASDF
##VAR_DIM=   32768,         32768,           32768
##UNITS=     HZ,            ARBITRARY UNITS, ARBITRARY UNITS
##FACTOR=    0.157963299565203, 1,           1
##FIRST=     4143.90863013262, 0,            0
##LAST=      -1032.07480672039, 0,           0
##MIN=       -1032.07480672039, -146234,     0
##MAX=       4143.90863013262, 449758340,    0
$$ Real data points
##PAGE= N=1
##DATA TABLE= (X++(R..R)), XYDATA
$$ [...]
18513a5137J0055k878r182J0379Q742Q250J1828p293j6206K5027J460q331j0382
$$ -15137 -5082 -7960 -17142 -6763 1979 10229 22057 14764 -1442 23585 25045 16714 6332
18500F332J0934n059r589J4035J558k6501Q971N094K971K962K430K599l964M865
$$ 6332 17266 12207 2618 16653 18211 -8290 681 5775 8746 11708 14138 16737 12773 17638
18486A7638l424k114j194r711q409J3996j9981k3670j1218M115q648K4114M1699
$$ 17638 14214 12100 10906 1195 -7214 6782 -13199 -36869 -48087 -43972 -52620 -28506 13193
18473A3193J828k3977j0994j0356J0280j175R017J2512N099m737j2315m363p407
$$ 13193 15021 -8956 -19950 -30306 -20026 -21201 -12184 328 5427 690 -11625 -15988 -23395
18460b3395j0853J4669J9981p57Q552M73p463k1032m095J2509P816M788j627n346
$$ -23395 -34248 -19579 402 -355 8197 8670 1207 -19825 -23920 -11411 -3595 1193 -434 -5780
18446e780k447O46J945J2435L673r130r016P00O833l303j17J7867m845p490j627
$$ -5780 -8227 -7581 -5636 6799 10472 1342 -7674 -6974 -141 -3444 -3561 14306 9461 1971 344
18431C44P498l06j1040j4617m649j737K091J6224Q473j0783n554n359j1195K880
$$ 344 7842 7536 -3504 -18121 -22770 -24507 -22416 -6192 2281 -8502 -14056 -19415 -30610 -27730
18417b7730Q325o200n92O56J8466J2644j7519p477j3598l414Q965O469J6364K697
$$ -27730 -19405 -25605 -26197 -25541 -7075 5569 -11950 -19427 -33025 -36439 -27474 -21005 -4641 -1944
18403a944J0956l808q881q937J428L901k129k421r22m480K948r945j0656p041
$$ -1944 9012 5204 -3677 -12614 -11186 -7285 -9414 -11835 -12757 -17237 -14289 -24234 -34890 -41931
18389d1931K389Q385J5429J5165P15j2126l121k7672J0119O152M811R75N368q971
$$ -41931 -39542 -31157 -15728 -563 152 -11974 -15095 -42767 -32648 -26496 -21685 -20710 -15342 -24313
18375b4313j7151J0407J3394J77Q29J8103J4967O144m761j0841k9517Q220k74
$$ -24313 -41464 -31057 -17663 -17486 -16657 1446 16413 22557 17796 6955 -22562 -14342 -14616
18362a4616m074M491j6506Q22J1254l467M836p348Q546N839j3773N415J8136j3533
$$ -14616 -18690 -14199 -30705 -29883 -18629 -22096 -17260 -24608 -16062 -10223 -23996 -18581 -445 -13978
18348a3978k414R945J5583j3248j3960N091R542L441K1492M371k4260j3595P783
$$ -13978 -16392 -6447 9136 -4112 -18072 -12981 -3439 2 21494 25865 1605 -11990 -4207
18335d207j255k52j389J0646L290L326P75P724j111l696j7576l024k629p755P025
$$ -4207 -5462 -5714 -7103 3543 6833 10159 10934 18658 17547 13851 -3725 -6749 -9378 -17133 -10108
18320a0108N521K370L467r628o733j955l299j2774q47L300k882J1318p81K4420
$$ -10108 -4587 -2217 1250 -8378 -15111 -17066 -20365 -33139 -33986 -30686 -33568 -22250 -23031 1389
18306A389Q700k0681j0229j4713o805L020J4321K1620J6289j3982j1445P033K104
$$ 1389 10089 -10592 -20821 -35534 -42339 -39319 -24998 -3378 12911 -1071 -12516 -5483 -3379
18293c379K5131j785j9596k1376J0877J4420L791P28n172l875j5347q57K1664
$$ -3379 21752 19967 371 -21005 -10128 4292 8083 8811 3639 -236 -15583 -16440 5224
18280E224m503O248j203k4886q181R936n460J1535L169l000R365J1944J683j3369
$$ 5224 721 6969 5766 -19120 -27301 -17365 -22825 -11290 -8121 -11121 -1756 10188 11871 -1498
18266a498o582j3142M860J6181J6224o386o616P462O676M231m822k0406Q61M42
$$ -1498 -8080 -21222 -16362 -181 16043 9657 3041 10503 17179 21410 16588 -3818 -2957 -2515
18252b515J7498p51M794R034r167j9244J140J4713K0981m332k7042j9073k1092
$$ -2515 14983 14232 19026 28060 18893 -351 789 15502 36483 32151 5109 -13964 -35056
18239c5056j077m630J6463J2620J0233P858N734J2364m671r681K633j686j0898
$$ -35056 -36133 -40763 -24300 -11680 -1447 6411 12145 24509 19838 10157 12790 11104 206
18226B06J0911J226j5013r73J3531o576q615p707N51J7867j7998n7O811M17R850
$$ 206 11117 12343 -2670 -3643 9888 3312 -5303 -13010 -12459 5408 -12590 -12647 -5836 -5419 4431
18211D431M60L117j0074J4036O699j6493P424j248J594L24K970j9275k0429n144
$$ 4431 4891 8008 -2066 11970 18669 2176 9600 8352 9946 10270 13240 -6035 -26464 -31608
18197c1608J2172K7499K588O254O674N872L170k961j2279M78k0450Q84K25k1452
$$ -31608 -19436 8063 10651 16905 23579 29451 32621 29660 17381 17859 -2591 -1707 -1482 -22934
18183b2934O290K1480q655r22J57j3037J2500o879J1076O435j180J249k667j6409
$$ -22934 -16644 4836 -3819 -4741 -4584 -17621 -5121 -12000 -924 5511 4331 5580 2913 -13496
18169a3496j3970j0202l717K0594O391j929J2650J7349J2906o859k2662j0512
$$ -13496 -27466 -37668 -41385 -20791 -14400 -16329 -3679 13670 26576 19717 -2945 -13457
18157a3457P641m873k555O88J1522K9607M499j4150k5254j0381K0595J380k998
$$ -13457 -5816 -10689 -13244 -12556 -1034 28573 33072 18922 -6332 -16713 3882 5262 2264
18144B264r44q205p073N529O694j6097J1194M191k105n621r403m56n935N346R226
$$ 2264 1320 -6885 -13958 -8429 -1735 -17832 -6638 -2447 -4552 -10173 -19576 -20032 -25967 -20621 -11395
18129a1395J0872L492k2064k884J7094J331r088J8780K1453m170j1626o394P917
$$ -11395 -523 2969 -19095 -21979 -4885 -3554 -12642 6138 27591 23421 11795 5401 13318
18116A3318J693k0584j8314q469R256K2502j6180K495k399o297O682N393n502
$$ 13318 15011 -5573 -23887 -32356 -23100 -598 -16778 -14283 -16682 -22979 -16297 -10904 -16406
18103a6406m571k486o073q04n003r14P503K1440N639O82J469Q605M516q930j7956
$$ -16406 -20977 -23463 -29536 -30340 -35343 -36257 -28754 -7314 -1675 -993 476 9081 13597 4667 -13289
18088a3289p011j8297m587K4799K7985J252k4469j1461l475J1086n632m435L96
$$ -13289 -20300 -38597 -43184 -18385 9600 10852 -13617 -25078 -28553 -17467 -23099 -27534 -27138
18075b7138M393R949P339q014L719K122L106o44o240o210r76J649j8511k094m173
$$ -27138 -22745 -12796 -5457 -13471 -9752 -7630 -4524 -5168 -11408 -17618 -18594 -16945 -35456 -37550 -41723
18060d1723r614m068K4592M104j711R384M187M583J5124j823J8344K1129q562
$$ -41723 -51337 -55405 -30813 -26709 -28420 -19036 -14849 -10266 4858 3035 21379 42508 33946
18047C3946p915m654J0445j051k7798q382Q406k248K503J4272k9k8322k176j666
$$ 33946 26031 21377 31822 30771 2973 -5409 2997 749 3252 17524 17495 -10827 -13003 -14669
18033a4669Q971n929K153R104n975J8261N864N05k090p743J0731o69N411j3141
$$ -14669 -5698 -11627 -9474 -370 -6345 11916 17780 18285 16195 8452 19183 18514 23925 10784
18019A0784Q841L01j4729K744j3636K267J3272n88J1861M40k1496R273K3996o751
$$ 10784 19625 19926 5197 7941 -5695 -3428 9844 9256 21117 21557 61 9334 33330 26579
18005B6579j5701j7799k4119q912J2383J1269J4562J579Q308O960l5083j7584
$$ 26579 10878 -6921 -31040 -39952 -27569 -16300 -1738 -159 8149 15109 -19974 -37558
17993c7558N271j502J8407l703K911m768j0535N86M420j3254Q381Q510J835O589
$$ -37558 -32287 -33789 -15382 -19085 -16174 -20942 -31477 -30891 -26471 -39725 -31344 -22834 -20999 -14410
17979a4410l314K2010k805j0927L482J4072N710j2063K977J457M658J189m404
$$ -14410 -17724 4286 1481 -9446 -5964 8108 13818 1755 4732 6189 10847 12036 7632
17966G632M488j3943J537J9395N527O229l225o53k5890j4057R538J3751J2016
$$ 7632 12120 -1823 -286 19109 24636 30865 27640 26987 1097 -12960 -3422 10329 22345
17953B2345l155J174j1738j4289K5457J5570j3191j0004n299L299N966l924j126
$$ 22345 19190 20364 8626 -5663 19794 35364 22173 12169 6870 10169 16135 12211 11085
17940A1085j0540k7344J184K7260J1840L753J881J1598n149r529J0105R162j6027
$$ 11085 545 -26799 -25615 1645 13485 17238 19119 30717 25568 16039 26144 35306 19279
17927A9279j7990J2575n462j7669L263p153j4423o119J3725J2483K1310M382o208
$$ 19279 1289 13864 8402 -9267 -6004 -13157 -27580 -33699 -19974 -7491 13819 18201 11993
17914A1993j344K463j7231r62J930J380J806k708k0075r852J887P702K461j410
$$ 11993 10649 13112 -4119 -5081 -3151 -1771 35 -2673 -22748 -32600 -30713 -23011 -20550 -21960
17900b1960J4382p492M269J4083R569K331K0477r62j8546R329P556j7200j724
$$ -21960 -7578 -15070 -10801 3282 12851 15182 35659 34697 16151 25480 33036 15836 14112
17887A4112k0554l072R526K089o784J770j870o161k744L424l007K6938J870P852
$$ 14112 -6442 -9514 12 2101 -4683 -2913 -4783 -10944 -13688 -10264 -13271 13667 15537 23389
17873B3389J500k345j3744j123k257O506l349J000j2017r248J2651R557j6744
$$ 23389 24889 22544 8800 7677 5420 11926 8577 9577 -2440 -11688 963 10520 -6224
17860f224L646J0130R332j8580k2922R982L454R057m267J921r119J0713L0161
$$ -6224 -2578 7552 16884 -1696 -24618 -14636 -11182 -2125 -6392 -4471 -13590 -2877 27284
17847B7284j4298J05J1710j5937L553J869J1426J2551p403k037m2j1805j3317
$$ 27284 12986 13091 24801 8864 12417 14286 25712 38263 30860 28823 28781 16976 3659
17834C659J909j3316k1939K406J4055l847J1446K0110M257J0667k390r857j1734
$$ 3659 5568 -7748 -29687 -27281 -13226 -17073 -5627 14483 18740 29407 27017 17160 5426
17821E426j2064K0446J6281m884L24j3114L901J3552j3923K560K0014J4661j3022
$$ 5426 -6638 13808 30089 25205 25529 12415 16316 29868 15945 18505 38519 53180 40158
17808D0158j8434j5728R963j1944j5536J556J918P555j728q790m788j724j3028
$$ 40158 21724 5996 15959 4015 -11521 -9965 -8047 -492 -2220 -11010 -15798 -17522 -30550
17795c0550k650K4472Q533m421Q720J0524j4619j1271O789J6050J2300O85j0573
$$ -30550 -33200 -8728 -195 -4616 4104 14628 9 -11262 -4473 11577 23877 24562 13989
17782A3989M208J5497j7013k1531p138N615J6355k591M320J7079j1642k0185n546
$$ 13989 18197 33694 16681 -4850 -11988 -6373 9982 7391 11711 28790 17148 -3037 -8583
17769h583k517J4395q158j3936K1419K093j1911j3211j2544k743J1711j081K146
$$ -8583 -11100 3295 -4863 -18799 2620 4713 -7198 -20409 -32953 -35696 -23985 -25066 -22920
17756b2920J1385K1689O682Q06j0854k3153P469j466q766O111O676m759J7375
$$ -22920 -11535 10154 16836 17642 6788 -16365 -8896 -10362 -19128 -13017 -6341 -11100 6275
17743F275K0003J0087o940j6180L450N326m158K2847M890p800O564j2003m178
$$ 6275 26278 36365 29425 13245 16695 22021 17863 40710 45600 37800 44364 32361 28183
17730B8183M229o142o584K1402m258j2192m562L01J0355J1018J1535P942j5529
$$ 28183 32412 26270 19686 41088 36830 24638 20076 20377 30732 41750 53285 61227 45698
17717D5698o216J9575L8268K2619N694J8936K9441K0662J0772j2005n260p66o564
$$ 45698 39482 59057 97325 119944 125638 144574 174015 194677 205449 193444 188184 187418 180854
17704A80854O458K2839J6860J2022K8896L3867j2638j2781J57k6618l7231p714
$$ 180854 187312 210151 227011 239033 267929 301796 289158 276377 276534 249916 212685 204971
17692B04971r16p031r808J93O901n41k4409k4456k4655o631l2647l6500j7534
$$ 204971 204055 197024 187216 187409 194310 193769 169360 144904 120249 113618 80971 44471 26937
17679B6937j4275Q327r95L388j408o98J6273Q280k918j311M186l476M787m641
$$ 26937 12662 20989 19994 23382 21974 21276 37549 45829 42911 41600 45786 42310 47097 42456
17665D2456j2464M861J4186j1644q460Q511j3344J4507P355l403J1895K1041J834
$$ 42456 29992 34853 49039 37395 28935 37446 24102 38609 45964 42561 54456 75497 77331
17652G7331p643j9075k2553j0722O42j3342O3K222N598p691j9148k00R716J415
$$ 77331 69688 50613 28060 17338 17980 4638 4701 6923 12521 4830 -14318 -14518 -4802 -3387
17638c387J3534J682k5881J7753R386j8445j848M343j718o101p156J4155K8505
$$ -3387 10147 11829 -14052 3701 13087 -5358 -7206 -2863 -4581 -10682 -17838 -3683 24822
17625B4822q905j1651J5023m220l253R663K5600j6526J6501J6768L31j2248p667
$$ 24822 15917 4266 19289 15069 11816 21479 47079 30553 47054 63822 64153 51905 44238
17612D4238l963r042r441j2851J229J3540j8953p169p491o345K608K113J3384
$$ 44238 40275 31233 21792 8941 10170 23710 4757 -2412 -9903 -16248 -13640 -11527 1857
17599A857J9230L0955Q702q756k6508M326P345m491o226p680n776N410r29j1205
$$ 1857 21087 52042 60744 51988 25480 29806 37151 32660 26434 18754 12978 18388 17459 6254
17585F254J0155J648p705p770k2143K037K7227M981J428N352j7174j3239K683
$$ 6254 16409 18057 10352 2582 -19561 -17524 9703 14684 16112 21464 4290 -8949 -6266
17572f266J499J2538Q173R925k17j5203j4071j1404O696K3146J5412m901j8381
$$ -6266 -4767 7771 15944 25869 25652 10449 -3622 -15026 -8330 14816 30228 25327 6946
17559F946j4403q473j63Q74J5668O471r319N560J2148n182j1158O839L3141m518
$$ 6946 -7457 -15930 -16093 -15219 449 6920 -2399 3161 15309 10127 -1031 5808 38949 34431
17545C4431p979J006l469N974K1307K635r656j5826m807M680k125j0840J5512
$$ 34431 26452 27458 23989 29963 51270 53905 44249 28423 23616 28296 26171 15331 30843
17532C0843R231k1728P666J0294L85n593N781j953l053J0135O924n24j8141J4546
$$ 30843 40074 18346 26012 36306 36691 31098 36879 34926 31873 42008 48932 48408 30267 44813
17518D4813L961J3493O04j4461M20K767k714j5632M792J8369L426o402P098J9929
$$ 44813 48774 62267 62871 48410 48830 51597 48883 33251 38043 56412 59838 53436 60534 80463
17504H0463P77p867N617R710K1983J2976J4916K4202P256J3107L296j212j0331
$$ 80463 81240 73373 78990 88700 110683 123659 138575 162777 170033 183140 186436 185224 174893
17491A74893L406J1656K1236J5784N252K4361J9138j0301j3755p736j1123m597
$$ 174893 178299 189955 211191 226975 232227 256588 275726 265425 251670 243934 232811 228214
17479B28214m209k4702q256k0563J4228K2734J96Q942q4j8240j5069j8874l1571
$$ 228214 224005 199303 191047 170484 184712 207446 207642 216584 216500 198260 183191 164317 132746
17466A32746k952m656k4765j3515K1052Q264j551j6469M080O591J371j1727q787
$$ 132746 129794 125138 100373 86858 107910 116174 114623 98154 102234 108825 110196 98469 89682
17453H9682J1753J4902J7313p647j7897K215Q917K327J84q488j3594k6696q792
$$ 89682 101435 116337 133650 126003 108106 110321 119238 121565 121749 113261 99667 72971 64179
17440F4179Q769m889j3467J738l93R136J4844J0190j0173N068J6192L3174N0064
$$ 64179 72948 68059 54592 56330 55937 65073 79917 90107 79934 85002 101194 134368 184432
17427A84432P5745J12946J22215M4136r5241j22702r2767n7088k0054J1298L89
$$ 184432 260177 373123 495338 539474 444233 321531 228764 171676 151622 162920 163309
17416A63309J5670L2245J4069L5531Q8706J19330P6678m4465j40077j08481n2160
$$ 163309 178979 211224 225293 260824 349530 468860 545538 501073 360996 252515 200355
17405B00355n5080k9257J0832l9860m8755m474m281J0206J1907Q447m573K930
$$ 200355 145275 116018 126850 86990 38235 33761 29480 39686 51593 60040 55467 58397
17393E8397N569m102j1642j7163l05m173l04l705J8179J4348J061j6406l1850
$$ 58397 63966 59864 48222 31059 30754 26581 26277 22572 40751 55099 56160 39754 7904
17380G904J576P990J6813O129M563K1780J0554O978k920j4138q702k6504m988
$$ 7904 9480 17470 34283 40412 44975 66755 77309 84287 81367 67229 58527 32023 27035
17367B7035J6452K5332j1769j7473P945K4304J1254J4216n223m433j6494n756
$$ 27035 43487 68819 57050 39577 47522 71826 83080 97296 92073 87640 71146 65390
17355F5390m890j0108K652L035J3873J4652K71K986N663p613J4426M874P189j8285
$$ 65390 60500 50392 53044 56079 69952 84604 84875 87861 93524 85911 100337 105211 112400 94115
17341I4115M477K1740K3346J042N852j070O551l195m522k3585j8760p19K2674
$$ 94115 98592 120332 143678 144720 150572 149502 156053 152858 148336 124751 105991 105272 127946
17328A27946J1766Q297J4673P459L379k1489m365j2805j7215J005K9594r329N107
$$ 127946 139712 148009 162682 170141 173520 152031 147666 134861 117646 118651 148245 138916 144023
17315A44023J9731p597r288j6185j1593j1325l952m875J8274K4585J836J2525
$$ 144023 163754 156157 146869 130684 119091 107766 103814 98939 117213 141798 143634 156159
17303A56159q978j1233p69J6844K789l261r95n810l819L103J5129j715n121j4548
$$ 156159 147181 135948 135179 152023 154812 151551 150556 144746 140927 144030 159159 157444 152323 137775
17289A37775j0019J374O040K0927N721j0796r702J8670k762r610K712j4385K187
$$ 137775 127756 129130 135170 156097 161818 151022 141320 159990 157228 147618 150330 135945 138132
17276A38132J0896K2305R10l5193j1065L0886K8408P414M294K860l171n609p91
$$ 138132 149028 171333 172243 137050 125985 156871 185279 192693 196987 199847 196676 191067 190276
17263A90276J3483Q881J348J0741l806K363O271J2659J5087M618r447q953J6157
$$ 190276 203759 212640 213988 224729 220923 223286 229557 242216 257303 261921 252474 243521 259678
17250B59678K5337L2550J5635j964Q459J7675K1484J9955K5440L5861K0655K9845
$$ 259678 285015 317565 333200 331236 339695 357370 378854 398809 424249 460110 480765 510610
17238E10610J6870L2200L1989J9678L8204K7273K0133J8211M7715M5544P3781
$$ 510610 527480 559680 591669 611347 649551 676824 696957 715168 762883 808427 882208
17227H82208R6055J03843J03486J25075J39043J49857J61381J60290J78677K06037
$$ 882208 978263 1082106 1185592 1310667 1449710 1599567 1760948 1921238 2099915 2305952
17217B305952K17670K53097K70758L20185M15898N59117O99671R39580J291122
$$ 2305952 2523622 2776719 3047477 3367662 3783560 4342677 5042348 5981928 7273050
17208G273050J745544K516407L817155N861128Q473737R760356O456724j571272
$$ 7273050 9018594 11535001 15352156 21213284 29687021 39447377 45904101 44332829
17200D4332829o915400o134599l122625j7412L181662O879449J0480985J1446230
$$ 44332829 37417429 31282830 28160205 28142793 31324455 38203904 48684889 60131119
17192F0131119P098002P45610o57328j042550o279243j1269137j0203928o397044
$$ 60131119 67229121 67974731 67317403 66274853 59995610 48726473 38522545 32125501
17184C2125501k703981O23628M011978P140961P788700K662614o683524j1319734
$$ 32125501 29421520 30045148 34057126 41198087 48986787 51649401 44965877 33646143
17176C3646143r578618o516687m304152k917332k032504j459771j069301q23653
$$ 33646143 24067525 17550838 13246686 10329354 8296850 6837079 5767778 4944125
17168D944125o50245m75274l79962l15800k97144k78204k40984j94180j89342
$$ 4944125 4293880 3818606 3438644 3122844 2825700 2547496 2306512 2112332 1922990
17159A922990j91872j52026j39155j31214j24052p7805o7174q3031q0547n1185
$$ 1922990 1731118 1579092 1439937 1308723 1184671 1106866 1039692 956661 876114 824929
17149H24929j4339j9815m2600n7018l6940l3365l2940j9163k8759l2644r960Q292
$$ 824929 810590 790775 748175 691157 654217 620852 587912 568749 539990 507346 497386 505678
17137E05678k1068j5961k0623l1857j8766q452j5990k0828p73o335L094K194J2468
$$ 505678 484610 468649 448026 416169 397403 388951 372961 352133 351360 345025 348119 350313 362781
17124C62781k2178k2397J0584J331N089k852j2195O354J9520n156k2037k2206
$$ 362781 340603 318206 328790 330121 335210 332358 320163 326517 346037 340881 318844 296638
17112B96638k0070j336K0228J0689j7508o219l500j2644J8301r430r515k6719
$$ 296638 276568 275232 295460 306149 288641 282422 278922 266278 284579 275149 265634 238915
17100B38915k3151r797M490m412l982R898J2986J8336P946j4525m652j8055k0561
$$ 238915 215764 205967 210457 206045 202063 211961 224947 243283 251229 236704 232052 213997 193436
17087A93436o738j3049j391K3478J712p814q843K028k146J0245J4100L405O410
$$ 193436 186698 173649 172258 195736 197448 189634 180791 182819 180673 190918 205018 208423 214833
17074B14833L172N832J3740O140j0714l2739l044J4021N864P225J6143J9167J46
$$ 214833 218005 223837 237577 243717 233003 200264 197220 211241 217105 224330 240473 259640 259786
17061B59786j890k2726p348j3738j3096Q22n176r91K1412L9508J8129q139j3610
$$ 259786 257896 235170 227822 214084 200988 201810 196634 195643 217055 256563 274692 266553 252943
17048B52943K282j9293k3495N041K66K88K1802J0877K283K623J9563J7903k73
$$ 252943 255225 235932 212437 217478 217744 218032 239834 250711 252994 255617 275180 293083 292810
17035B92810q132M084J8516K1317J0200J2349k8605k1700L6444J1076l49J4738
$$ 292810 284678 288762 307278 328595 338795 351144 322539 300839 337283 348359 348010 362748
17023C62748L3334K0206K1141M0527J9674M0374K5826K5449N77J9220L0936K1394
$$ 362748 396082 416288 437429 477956 497630 538004 563830 589279 589856 609076 640012 661406
17011F61406L5355O4151O9012N3547P3728P5945P5991J05153J25719J41511J37678
$$ 661406 696761 760912 829924 883471 957199 1033144 1109135 1214288 1340007 1481518 1619196
17000A619196J61948J87117K10058K46492K83852L02393L48412M23221N79292
$$ 1619196 1781144 1968261 2178319 2424811 2708663 3011056 3359468 3782689 4361981
16991D361981P74552J013284J386685J881538K656705M025972O280789R304165
$$ 4361981 5136533 6149817 7536502 9418040 12074745 16100717 22381506 31685671
16983C1685671J0953775P259901k258165q417959p322460l903738o79524K429475
$$ 31685671 42639446 49899347 47641182 39223223 31900763 27997025 27317501 29746976
16975B9746976N908266R211006R834246M967677j731606j414505L248613L883590
$$ 29746976 35655242 44866248 54700494 59668171 57936565 56522060 59770673 63654263
16967F3654263l241986j0975005j0905898o970580l236163J8157L362153O623096
$$ 63654263 60412277 49437272 38531374 31560794 28324631 28342788 31704941 38328037
16959C8328037P775532L335640o050056j1238777r499328o282922m069603k706841
$$ 38328037 46103569 49439209 43389153 32150376 22651048 16368126 12298523 9591682
16951I591682j852589j301373r74560p61401o23827m72669l42591k90241k82260
$$ 9591682 7739093 6437720 5463160 4701759 4077932 3605263 3262672 2972431 2690171
16942B690171k83737k49508k19367j94605j58819j52312j41612j39289q8815o6897
$$ 2690171 2406434 2156926 1937559 1742954 1584135 1431823 1290211 1150922 1062107 995210
16932I95210p0686n3225m8643l5544l7506n1309m5368j2973l1228l0435p643m4356
$$ 995210 924524 871299 822656 787112 749606 698297 652929 639956 608728 578293 570650 526294
16920E26294j9708o829n497o941j8352k8995k9817l1324l1508j2660j4760J481
$$ 526294 506586 499757 494260 487319 468967 439972 410155 378831 347323 334663 319903 321384
16908C21384L209O986m2093k9407J8352O266j7576j7231j1371P837K4726J5555
$$ 321384 324593 331579 289486 260079 278431 284697 267121 249890 238519 246356 271082 286637
16896B86637k860j8041j5627l2965j3040n250J855J2324N772J1744q915m624k0199
$$ 286637 283777 265736 250109 217144 204104 198854 200709 213033 218805 230549 221634 217010 196811
16883A96811k5553J0153j8688k7283p679q9n36Q513Q333m721M050j3681k1250
$$ 196811 171258 181411 162723 135440 127761 127672 127136 135649 143982 139261 143311 129630 108380
16870A08380j2017J814K7937m998l216J1235p093n31N861j4437m339J5632N725
$$ 108380 96363 98177 126114 121116 117900 129135 122042 121511 127372 112935 108596 124228 129953
16857A29953k4336k3204J9889J3380J2785J095j6155k4556n265J8343M039O814
$$ 129953 105617 82413 102302 115682 128467 129562 113407 88851 83586 101929 105968 112782
16845A12782J033J3523Q934K6577L7389J2881J1259N964k6312l1863l0036m0017
$$ 112782 113815 127338 136272 162849 200238 213119 224378 230342 204030 172167 142131 102114
16833A02114j4807J0549J9985K2338K7871J5670P139M7512M3331K5506J2654n3231
$$ 102114 87307 97856 117841 140179 168050 183720 190859 238371 281702 307208 319862 266631
16821B66631o1646k0804k2852j1351K9079J0497J0733K2197O9349J10551J52335
$$ 266631 204985 184181 161329 149978 179057 189554 200287 222484 291833 402384 554719
16810E54719K04023J19854k3355j42065j85579j50114p3194k8468o041K5600L7980
$$ 554719 758742 878596 855241 713176 527597 377483 304289 275821 269780 295380 333360
16799C33360Q2016J12946J46217J29024j1473j44574j84193j41027r2784o4880
$$ 333360 415376 528322 674539 803563 792090 647516 463323 322296 229512 164632
16789A64632l6219j2701j2379l259r474o587M42J2129j6746p413o429k6733q748
$$ 164632 128413 115712 103333 100074 90600 84013 84455 96584 79838 72425 65996 39263 30515
16776C0515k2L676K7588J4247l4534j5840O824K5660J8582J8755J661q249q616
$$ 30515 30493 34169 61757 76004 41470 25630 32454 58114 76696 95451 97112 88863 80247
16763H0247q276m802K988K504M637J705j523o692Q377K2069L738M367O371K354
$$ 80247 71971 67169 70157 72661 77298 79003 77480 70788 79165 101234 104972 109339 115710 118064
16749A18064j0598k5293l4406j8442k410Q313J3938K1525P995m992J4310K994
$$ 118064 107466 82173 47767 29325 26915 35228 49166 70691 78686 73694 88004 90998
16737I0998k8191j402K362j7626J4609m058N075J2989m148j0604J953J8j533o758
$$ 90998 62807 61405 63767 46141 60750 56692 61767 74756 70608 60004 61957 61975 60442 53684
16723E3684j720J958j7696K80J3355M823K069k859J232L381p8O584M578k890m392
$$ 53684 51964 53922 36226 36506 49861 54684 56753 53894 55126 58507 58429 65013 69591 66701 62309
16708F2309q694J168o188j5575K129K9682J7479l921J9266q74r219R556K3758
$$ 62309 53615 54783 48595 33020 35149 64831 82310 78389 97655 96781 87562 97118 120876
16695A20876O156O625L114K3251M7453K4418q878m536O098P207J334J4567L414
$$ 120876 127032 133657 136771 160022 207475 231893 223015 218479 224577 231784 233118 247685 251099
16682B51099K3384J6559K1607J7639J2238K394R321j0901l9928l0071j9067o763
$$ 251099 274483 291042 312649 330288 342526 344920 354241 343340 303412 273341 254274 247511
16670B47511l442K4247Q75k652M054n056k2536l9426l9447k5587j2493k9258L093
$$ 247511 244069 268316 269191 266539 270593 265537 243001 203575 164128 138541 126048 96790 99883
16657I9883k53j5719l733p64J3746J6055o929j7433j6114j221K24Q424n244M299
$$ 99883 99630 83911 80178 79414 93160 109215 102286 84853 68739 67518 67742 76166 70922 75221
16643G5221j0191L005K97j566p234J5105J479R717N35r68L020J2795m382r545
$$ 75221 65030 68035 68332 66766 59532 74637 76116 85833 86368 85400 88420 101215 96833 87288
16629H7288l460r972j2835K9491L2730J8821K8409N025o684L296K379m039m921
$$ 87288 83828 73856 61021 90512 123242 142063 170472 175497 168813 172109 174488 170449 165528
16616A65528j5425m2336k8297l679J0990K8167J6623r00j99q262m562J6810j099
$$ 165528 150103 107767 79470 75791 86781 114948 131571 130671 130472 122210 117648 134458 133359
16603A33359j2379j2187r869p575L663J0240r351j4135R417J7530J3189n460j9220
$$ 133359 120980 108793 98924 91349 95012 105252 95901 81766 91183 108713 121902 116442 97222
16590I7222k975K302j9501q419J0426P614K7667M833l117J691j1284O294K6121
$$ 97222 94247 96549 77048 68629 79055 86669 114336 119169 116052 117743 106459 112753 138874
16577A38874J6169M340R09j0394R536o851j1557J856N542J2077M314n291J7224
$$ 138874 155043 159383 160292 149898 159434 152583 141026 142882 148424 160501 164815 159524 176748
16564A76748N542J1407O35k715R208k580K882M49l189K6418J4255m350J0291J4931
$$ 176748 182290 193697 194332 191617 200825 198245 201127 201576 198387 224805 239060 234710 245001 259932
16550B59932J648r553Q896L1112K9415J0073J3973J098M504J0510J5094J0950
$$ 259932 261580 252027 260923 292035 321450 331523 345496 346594 351098 361608 376702 387652
16538C87652J1756Q360J6011J7911K871L9334M1640L2821L9299N0969M3919O6077
$$ 387652 399408 407768 423779 441690 444561 483895 525535 558356 597655 648624 692543 758620
16526G58620M5843M4798P1509R2311O9855P2872J19766J34205J49225J55630J74100
$$ 758620 804463 849261 920770 1013081 1082936 1155808 1275574 1409779 1559004 1714634 1888734
16515A888734J93250J94488K14717K65658L24997L97100N31450P07839R07468
$$ 1888734 2081984 2276472 2491189 2756847 3081844 3478944 4010394 4718233 5625701
16506E625701J152496J607414K342949L497365N274464P760087R954328Q801306
$$ 5625701 6778197 8385611 10728560 14225925 19500389 27260476 37214804 46016110
16498D6016110J757689o624439q808085o533020l783649j645477K2620J645335
$$ 46016110 47773799 41149360 32341275 25808255 22024606 20379129 20401749 22047084
16490B2047084L612921O327577J0144432J4575129J6577423J1025759k449959
$$ 22047084 25660005 31987582 42132014 56707143 73284566 84310325 81860366
16483H1860366j4428512j6958282j3007943q414247n123043k904728j237008L40296
$$ 81860366 67431854 50473572 37465629 29051382 23928339 21023611 19786603 20126899
16475B0126899K122786M309844O647430P487832L920343m001231r370836q799328
$$ 20126899 22249685 26559529 33206959 40694791 44615134 40613903 31243067 22443739
16467B2443739o132923l982630k619948j803877j324086r74562p09462n48906
$$ 22443739 16310816 12328186 9708238 7904361 6580275 5605713 4896251 4347345
16459D347345m84823m32261l84414l10934k39415j81679j67309j72601j65441
$$ 4347345 3862522 3430261 3045847 2734913 2495498 2313819 2146510 1973909 1808468
16450A808468j60386j59477j26030j19031j10070q3308o8232o1627n7788m6384
$$ 1808468 1648082 1488605 1362575 1243544 1133474 1050166 981934 920307 862519 816135
16440H16135m1852n8612n1327l1314l5401l8758j8009p153r637m5317l0439l6452
$$ 816135 774283 715671 664344 633030 597629 558871 540862 533709 524072 478755 448316 411864
16428D11864j52j0174k1791j3729j6895j1265l790p757k4188p704J1607r98j5101
$$ 411864 411712 401538 379747 366018 349123 337858 334068 326311 302123 294419 306026 305028 289927
16415B89927j4674k3992k0348j7918p910J5373k416j4617j3585p462l323L127
$$ 289927 275253 251261 230913 212995 205085 220458 218042 203425 189840 182378 179055 182182
16403A82182L307R2j5514j2263m676j86p785n165j9896k6386j4755O730J7740
$$ 182182 185489 185581 170067 157804 153128 152942 145157 139992 120096 93710 78955 85685 103425
16390A03425J6049J9024J467j4488o443j512J2668J4305J3751k0054j5666N735
$$ 103425 119474 138498 139965 125477 119034 117522 130190 144495 158246 138192 122526 128261
16378A28261J0878q980j7960N700O264N349O042O170j3166J4699j2066j6063r963
$$ 128261 139139 130159 112199 117899 124163 129512 135554 141724 128558 143257 131191 115128 105165
16365A05165k3792J0906J8830j1412p978J2933J5505J4359j168m060j0713j9085
$$ 105165 81373 92279 111109 99697 91719 104652 120157 134516 133348 129288 118575 99490
16353I9490O240M962j6493j6400j6001J984L18J0872Q495p606O257L055j046q661
$$ 99490 105730 110692 94199 77799 61798 63782 64100 74972 83467 75861 82118 85173 84127 75466
16339G5466j1608n320m04j473k3092r885q201m725J2718O647j6728P59J8124L935
$$ 75466 63858 58538 58134 56661 33569 23684 15483 10758 23476 30123 13395 14154 32278 36213
16325C6213K0911M370j991j0526n598O563L878p728J3048j2556k3448J530J998
$$ 36213 57124 61494 59503 48977 43379 49942 53820 46092 59140 46584 23136 24666 26664
16312B6664k455n978R667J182J5415N674J454N24j6374J2744k27o670J9843Q000
$$ 26664 24209 18231 27898 29080 44495 50169 51623 52147 35773 48517 48290 41620 61463 69463
16298F9463j4190k3926q036k027j7233l444K4059J5096l24q638N49m867k289k47
$$ 69463 55273 31347 23311 21284 4051 607 24666 39762 39438 30800 31349 26482 24193 23946
16284B3946J6078j073o316o120J0434J9662j537o303l384J7448J2043k0218o636
$$ 23946 40024 38951 32635 26515 36949 56611 55074 48771 45387 62835 74878 54660 48024
16271D8024j2215K485J8730K126n714j2063r715n975k0219k5185O101J2459J1947
$$ 48024 35809 38294 57024 59150 53436 41373 31658 25683 5464 -19721 -13620 -1161 10786
16258A0786L14l133J0476J1945n155p201O759P116P567n083k5203J3041R585J1962
$$ 10786 11100 7967 18443 30388 25233 18032 24791 31907 39474 34391 9188 22229 31814 43776
16244D3776J293J2591j6615j6950J690j302J4820l405n356k3798k1150J6561O914
$$ 43776 45069 57660 41045 24095 25785 24483 39303 35898 30542 6744 -14406 2155 9069
16231I069N141M51K233k439l272j2627J8150J5914q657k084n747L330K453j9432
$$ 9069 14210 14661 16894 14455 11183 -1444 16706 32620 23963 21879 16132 19462 21915 2483
16217B483q750J7017J3722q522k038q778J4518K0648M545j2735k3781r76O77K710
$$ 2483 -6267 10750 24472 15950 13912 5134 19652 40300 44845 32110 8329 7353 8030 10740
16203A0740J1653j0250J7276r534k5022L608J3376J4452K7094K311l26r22j0253
$$ 10740 22393 12143 29419 19885 -5137 -1529 11847 26299 53393 55704 55378 54456 44203
16190D4203j2172n8J2079m16l084m037J2731J5836q745J1080M036O45J3945j3208
$$ 44203 32031 31973 44052 43636 40552 36515 49246 65082 56337 67417 71453 72098 86043 72835
16176G2835J364K3051K7088M3617J4785r148l0246j1017j3610j494q982r092o992
$$ 72835 74199 97250 124338 167955 182740 173592 143346 132329 118719 117225 108243 99151 92159
16163I2159K0504L7842O0257P0667L9524p153o3392o7861m1863m4211j9825j8101
$$ 92159 112663 150505 210762 281429 320953 313800 250408 182547 140684 96473 76648 58547
16151E8547k973R949N451L6998M3968K2935O138k2459k9587m3555j8882j5802
$$ 58547 55574 65523 70974 107972 151940 174875 181013 158554 128967 85412 66530 50728
16139E0728j2853j1919M234K186j8025L868J5422j1582n769j598J2297m860q978
$$ 50728 37875 25956 30190 32376 14351 18219 33641 22059 16290 14692 26989 22129 13151
16126A3151L461K330j1109J4998J4491j853Q228j6783k1817Q874l450L958O194
$$ 13151 16612 18942 7833 22831 37322 35469 43697 26914 5097 13971 10521 14479 20673
16113B0673M301K821k209m444q860O894l409O506J6215p893k4546j9814q638O249
$$ 20673 24974 27795 25586 21142 12282 19176 15767 22273 38488 30595 6049 -13765 -22403 -16154
16099a6154O802R318m537R557j4940R203j0693N861l908K1275J0895j1917p030
$$ -16154 -9352 -34 -4571 4986 -9954 -751 -11444 -5583 -9491 11784 22679 10762 3732
16086C732j639j4739j6360M984J2649K1345J7384k0824j2987l57K60J031j236
$$ 3732 2093 -12646 -29006 -24022 -11373 9972 27356 6532 -6455 -6812 -6552 -5521 -6757
16073f757J4080J3350L50J7977M460r183j9292k264l739K150K195j8306K124O622
$$ -6757 7323 20673 21023 39000 43460 34277 14985 12721 8982 11132 13327 -4979 -2855 3767
16059C767L90m215Q230m062L361J1980Q813j1934j0246j9278M217K7584J9750
$$ 3767 4157 -58 8172 4110 7471 19451 28264 16330 6084 -13194 -8977 18607 38357
16046C8357N436k5454j3831q6o873k0957o634L363Q695J7121K48j8380J8979K5634
$$ 38357 43793 18339 4508 4422 -2451 -23408 -30042 -26679 -17984 -863 -615 -18995 -16 25618
16032B5618J1962K246q908j0446J659k794j771m221J126L884J969K700m741O962
$$ 25618 37580 39826 30918 20472 22131 19337 17566 13345 14471 18355 20324 23024 18283 25245
16018B5245K1540n122j3749N549R377J4587q253j2203q316J8989L4387P006K2038
$$ 25245 46785 41663 27914 33463 42840 57427 49174 36971 28655 47644 82031 89037 111075
16005A11075K3272K2143Q922K2347l470k4965o807k0919j255K4229J7245P586
$$ 111075 134347 156490 165412 187759 184289 159324 152517 131598 130343 154572 171817 179403
15993A79403P505M191K6693M5789M5633R013j8355m6984m6191k3366k0297K150
$$ 179403 186908 191099 217792 263581 309214 318227 299872 252888 206697 183331 163034 165184
15981A65184J0751j1169m745q691J514J0674K4477k726l0577k4224k5945m1481
$$ 165184 175935 164766 160021 151330 152844 163518 187995 185269 154692 130468 104523 63042
15969F3042j7294k447p359j6057q18m295j2050j1759J7760j179K793K746o070
$$ 63042 45748 43301 35942 19885 19067 14772 2722 -9037 8723 7544 10337 13083 7013
15956G013K54J68j2791m124O886M353J7758J8084J5479N311j8106n955o525M139
$$ 7013 7267 7435 -5356 -9480 -2594 1759 19517 37601 53080 58391 40285 34330 27805 31944
15942C1944J0844J8991j284j2315j5715O593k0960k628K2048o18o848K521Q310
$$ 31944 42788 61779 60495 48180 32465 39058 18098 15470 37518 36900 30052 32573 40883
15929D0883m787k968o196j3488k866j749P115j945K0713j563j8291j2406j174
$$ 40883 36096 33128 26932 13444 10578 8829 15944 13999 34712 33149 14858 2452 1278
15916A278J6350J2208o928j5224n828J3356K910j6877K226J2151j2122j3987m136
$$ 1278 17628 29836 22908 7684 1856 15212 18122 1245 3471 15622 3500 -10487 -14623
15903a4623M373j2975J6850o737j2209n421k00J6574J5219J2709j057j3529r497
$$ -14623 -10250 -23225 -6375 -13112 -25321 -30742 -30942 -14368 851 13560 12503 -1026 -10523
15890a0523J0591l2765j501J4979K418J4300Q612K1899M293p131j1286n399P326
$$ -10523 68 -32697 -34198 -19219 -16801 -2501 6111 28010 32303 25172 13886 8487 15813
15877A5813r316J0241K514O860o412o513k587l210L964r158J3800j087m294k108
$$ 15813 6497 16738 19252 26112 19700 13187 10600 7390 11354 2196 15996 14909 10615 8507
15863H507q078m482Q005l927r369M824j4586k13J3410K380n907Q535O000r531
$$ 8507 429 -4053 3952 25 -9344 -4520 -19106 -19319 -5909 -3529 -9436 -901 5099 -4432
15849d432K434J1969l873j4645o964K2405M783k7147q933J8485J1228L679N515
$$ -4432 -1998 9971 6098 -8547 -15511 6894 11677 -15470 -24403 -5918 5310 8989 14504
15836A4504Q85J1584n243j441O590K869J783j1318j5134o74j2670K0326K7882
$$ 14504 15389 26973 21730 20289 26879 29748 31531 20213 5079 4405 -8265 12061 39943
15823C9943J37j0390j5938J049Q222M82r369K221L030j6326P868R046J545l485
$$ 39943 40080 29690 13752 14801 23023 23505 14136 16357 19387 3061 10929 19975 21520 18035
15809A8035J2027n434n85j4548J3802M313j7227r793k184O965r161L195J5651
$$ 18035 30062 24628 24043 9495 23297 27610 10383 590 -1594 5371 -3790 -595 15056
15796A5056O043q760M076J680j4658k104J3702J3086L168J6118J2861o03k4328
$$ 15056 21099 12339 16415 18095 3437 1333 15035 28121 31289 47407 60268 59665 35337
15783C5337m091j185m133j7695j4173J3047K4639r429O570K3164k2020k4626K654
$$ 35337 31246 30061 25928 8233 -5940 7107 31746 22317 28887 52051 30031 5405 8059
15770H059J6665n994J6677j0562k0456j938Q883K2499J351k0832r763M707q341
$$ 8059 24724 18730 35407 24845 4389 2451 11334 33833 35184 14352 4589 9296 955
15757I55o817L086L851j0027j2144K971K717j6834o313K3463J6201n109j131j1328
$$ 955 -5862 -2776 1075 -8952 -21096 -18125 -15408 -32242 -38555 -15092 1109 -4000 -5131 -16459
15743a6459n912J6669N872Q070K894M874j0946J4187j5753p326O581J6345k441
$$ -16459 -22371 -5702 170 8240 11134 16008 5062 19249 3496 -3830 2751 19096 16655
15730A6655j4064J2397Q902J4921J565k4632Q130J4182p113k5714j511K0786L934
$$ 16655 2591 14988 23890 38811 40376 15744 23874 38056 30943 5229 3718 24504 28438
15717B8438L027k756k0945j3591J1084N305p178j5601J2461J2163M643J7954j2340
$$ 28438 31465 28709 7764 -5827 5257 10562 3384 -12217 244 12407 17050 35004 22664
15704B2664J3985j0548K165J817j5238j5377J003J2199K2361J4106K0914r12L414
$$ 22664 36649 26101 28266 30083 14845 -532 471 12670 35031 49137 70051 69139 72553
15691G2553o995r182k1463J96J1971J234j509o653j2863j2961l077L140P806J9521
$$ 72553 65558 56376 34913 35109 47080 48314 46805 40152 27289 14328 11251 14391 22197 41718
15677D1718Q834N793p102r663j3331K991M817o974p832n807Q832O049j408l695
$$ 41718 50552 56345 49243 39580 26249 29240 34057 27083 19251 13444 22276 28325 26917 23222
15663B3222l24k461N227K0211Q868o406l107q214o137j7380j5303o031j1540K2478
$$ 23222 22898 20437 25664 45875 54743 48337 45230 37016 30879 13499 -1804 -7835 -19375 3103
15649C103L301k477O281K258O339R021o034j9120k2318k868K507J6077L3240J2824
$$ 3103 6404 3927 10208 12466 18805 27826 21792 2672 -19646 -22514 -20007 -3930 29310 42134
15635D2134j6360k0622o801J6225J4925J3360m374j4867j5702k1845R586J7532
$$ 42134 25774 5152 -1649 14576 29501 42861 38487 23620 7918 -13927 -4341 13191
15623A3191R324J193q80l693K807L106M263J2609j0638j8409O750l382j9724k32
$$ 13191 22515 23708 22828 19135 21942 25048 29311 41920 31282 12873 19623 16241 -3483 -3715
15609c715K0338J6796j5563j5422J766K0660J9108j0103j8241k020K948j429j1927
$$ -3715 16623 33419 17856 2434 4200 24860 43968 33865 15624 13604 16552 15123 3196
15596C196J951J2177K5975p171j6834j6999n472j876J0495M447j2488P115J9753
$$ 3196 5147 17324 43299 36128 19294 2295 -3177 -5053 5442 9889 -2599 4516 24269
15583B4269P328O372J1357J0292k2933q279o556O599R5l2216j1184J1300J4851
$$ 24269 31597 37969 49326 59618 36685 28406 21850 28449 28544 -3672 -14856 -3556 11295
15570A1295J2336o173r142K858J2954j3237k1002k8123J7917K5438J2313L256
$$ 11295 23631 17458 8316 11174 24128 10891 -10111 -38234 -20317 5121 17434 20690
15558B0690k013q5P646m303j6937k2346O322J5884P702j419j1262K1794P653k875
$$ 20690 18677 18592 26238 21935 4998 -17348 -11026 4858 12560 11141 -121 21673 29326 26451
15544B6451M476k642j8717q235K762J6670J0816j322Q836l43r085J986J0465P332
$$ 26451 30927 28285 9568 1333 4095 20765 31581 30259 39095 38752 29667 31653 42118 49450
15530D9450L100j961r674J592J5231j3521M94P602j3100J8091R506j7037j6252
$$ 49450 52550 50589 40915 42507 57738 44217 44711 52313 39213 57304 66810 49773 33521
15517C3521p779J4694n550j4814j965J8310J0648j2439j4350l81M219R211n216
$$ 33521 25742 40436 34886 20072 18107 36417 47065 34626 20276 19895 24114 33325 28109
15504B8109j3920n160J5007K679K401n323m248J3158J5736j1180O663J014O389
$$ 28109 14189 9029 24036 26715 29116 23793 19545 32703 48439 37259 43922 44936 51325
15491E1325J382j3953K639J7251p261n980J812l439o426j196R780J2524L172j9681
$$ 51325 52707 38754 41393 58644 51383 45403 47215 43776 37350 36154 45934 58458 61630 41949
15477D1949q145l0684q028J5201M703O20K1430j372m136j554k565P04J7920R180
$$ 41949 33804 3120 -4908 10293 14996 15616 37046 35674 31538 29984 27419 28123 46043 55223
15463E5223K550R473p175m387J8207R914n32o698j4643O482J1246j6931J795K724
$$ 55223 57773 67246 60071 55684 73891 83805 83273 76575 61932 68414 79660 62729 64524 67248
15449F7248j3588n268Q926J9q276j0619M397J323q378l157p715K0680J9305m0210
$$ 67248 53660 48392 57318 57337 49061 38442 42839 44162 35784 32627 24912 45592 64897 24687
15435B4687r303J9912j324n802P968J6721J9631N206J5830k2359o385M09k212
$$ 24687 15384 35296 33972 28170 36138 52859 72490 77696 93526 71167 64782 65191 62979
15422F2979r945j6719k851R846J486J2761j515q230N406k920O855J186j1903j0713
$$ 62979 53034 36315 33464 43310 44796 57557 56042 47812 53218 50298 57153 58339 46436 35723
15408C5723J1319Q913n742j3604J0109K5482J8066k615j9338k0086p763p390R48
$$ 35723 47042 55955 50213 36609 46718 72200 90266 87651 68313 48227 40464 33074 34022
15395C4022J2387P857j802k88N212R319L762k1415k834J5519J2350k15l623j1979
$$ 34022 46409 54266 52464 52176 57388 66707 70469 49054 46220 61739 74089 73874 70251 58272
15381E8272j022n846l584L827j0069o33L605J910J4957r900o024J4991M414o919
$$ 58272 57250 51404 47820 51647 41578 40945 44550 46460 61417 51517 45493 60484 64898 57979
15367E7979K975L503j8517J1109N195j6960R399J4390J0957J896j1642J1560p923
$$ 57979 60954 64457 45940 57049 62244 45284 54683 69073 80030 81926 70284 81844 73921
15354G3921j1135n617O818n315M943J4421O26N356j6697l885J0852R1n921M89
$$ 73921 62786 57169 63987 58672 63615 78036 78662 84018 67321 63436 74288 74379 68458 68947
15340F8947j026O875J7419K170r932p266o564J5362p147j3832J6490Q111l84r150
$$ 68947 67921 74796 92215 94385 84453 77187 70623 85985 78838 65006 81496 89607 89223 80073
15326H0073J763M447q622J3448M5j0529J2690n525j5582j6967J2335m216m092
$$ 80073 81836 86283 77661 91109 91154 80625 93315 87790 72208 55241 67576 63360 59268
15313E9268K1866J9089n217j4744J1003j3625k4441r83J4706k821k329J0664J036
$$ 59268 81134 100223 95006 80262 91265 77640 53199 52216 66922 64101 61772 72436 73472
15300G3472J7919J6764Q872M501n007k2605q829J8944l446j0588J2255k358q501
$$ 73472 91391 108155 117027 121528 116521 93916 85087 104031 100585 89997 102252 99894 91393
15287I1393J790M281j5511k388J426R322N376J1260M406Q452o581R115L177j128
$$ 91393 93183 97464 81953 79565 80991 90313 95689 106949 111355 119807 113226 122341 125518 124390
15273A24390J3975N311J6021r219j3448P091N129l473k0677j724K5206J1088n478
$$ 124390 138365 143676 159697 150478 137030 144121 149250 145777 125100 123376 148582 159670 154192
15260A54192q180j3408l0786m06K2268j1999k002M346j8542p503K822j764N809
$$ 154192 146012 132604 101818 101412 123680 111681 109679 114025 95483 87980 90802 89038 94847
15247I4847J2132M534K435J2295k408l554j3882q232K5179J6313R137O670q407
$$ 94847 106979 111513 113948 126243 123835 120281 106399 98167 123346 139659 148796 155466 147059
15234A47059n887P569r819J8266J9073J4017O185l991l149o843K1741K5166P681
$$ 147059 141172 148741 138922 157188 176261 190278 196463 192472 189323 182480 204221 229387 237068
15221B37068k71K1351J7816K2989K5837J6680L0181L8242L2154J1570k656K560
$$ 237068 236797 258148 275964 298953 324790 341470 371651 409893 442047 453617 450961 453521
15209D53521n469l7762j6058k3326l0675j3108k4435k70Q101k3099n224k5098
$$ 453521 448052 410290 394232 370906 340231 327123 302688 302418 310519 287420 282196 257098
15197B57098o461P716r319j2418l589J675K337k944k3958p897J418R598k1664
$$ 257098 250637 258353 249034 236616 233027 234702 237039 234095 210137 202240 203658 213256 191592
15184A91592j6087O729Q529M03K5566J6698m716N862K822P203p772j3803J560
$$ 191592 175505 182234 190763 191166 216732 233430 228714 234576 237398 244601 236829 223026 224586
15171B24586j935o638K827K3985J7960j5606j762J5105k0006N728M212j4395m664
$$ 224586 222651 216013 218840 242825 260785 245179 243417 258522 238516 244244 248456 234061 229397
15158B29397J0209R690K62r653j2252J7244J0256j1627P453J6689q049m524J1554
$$ 229397 239606 249296 249558 239905 227653 244897 255153 243526 250979 267668 259619 255095 266649
15145B66649r490m237R283J4265Q622J5995P714J1415M709j0343l735K03o622
$$ 266649 257159 252922 262205 276470 285092 301087 308801 320216 324925 314582 310847 311050 304428
15132C04428O112J5783J3355M474M582J9255J0575r38J1744R732j0141j495J7748
$$ 304428 310540 326323 339678 344152 348734 367989 378564 377626 389370 399102 388961 387466 405214
15119D05214L239P331J7666L003n413J0817M739M545M393l203K183L338m760j202
$$ 405214 408453 415784 433450 436453 431040 441857 446596 451141 455534 452331 454514 457852 453092 451890
15105D51890J8707K3066K3353R175k392P7j1141J2631J8162j628J5551J3476K5317
$$ 451890 470597 493663 517016 526191 523799 523876 512735 525366 543528 541900 557451 570927 596244
15092E96244J1854j6377L238K4152Q641N821P814J8847L5878L0656J3119K844
$$ 596244 608098 591721 594959 619111 627752 633573 641387 660234 696112 726768 739887 742731
15080G42731j2170r050J2108O237k612j0549P589M150J9344R058K577N241K750
$$ 742731 730561 721511 733619 739856 737244 726695 734284 738434 757778 766836 769413 774654 777404
15067G77404K6033L2080Q570P236j433j501J2401Q355J4433R019J6094K2663K1130
$$ 777404 803437 835517 844087 851323 849890 848389 860790 869145 883578 892597 908691 931354 952484
15054I52484J6729K4733J7761k937L3368N6906K4780J7659J392J7249L2579O668
$$ 952484 969213 993946 1011707 1008770 1042138 1099044 1123824 1141483 1142875 1160124 1192703 1199371
15042A199371P238J2677K1156L3078L4104K1202L2392L3083K6127L0404M8686
$$ 1199371 1206609 1219286 1240442 1273520 1307624 1328826 1361218 1394301 1420428 1450832 1499518
15031A499518L0423L8099L5273K0514N3545N5698M2092M7743M3082M7917M1272
$$ 1499518 1529941 1568040 1603313 1623827 1677372 1733070 1775162 1822905 1865987 1913904 1955176
15020A955176M1591N3165O0560P0444O2421N5371P8975N7571N7631Q0316Q5349
$$ 1955176 1996767 2049932 2110492 2180936 2243357 2298728 2377703 2435274 2492905 2573221 2658570
15009B658570R2794R3176J02110Q5990Q5794R3894J25402J30019J27426J12228
$$ 2658570 2751364 2844540 2946650 3032640 3118434 3212328 3337730 3467749 3595175 3707403
14999C707403J35778J59460J69447J50323J64735J92200J97024K11816K26777
$$ 3707403 3843181 4002641 4172088 4322411 4487146 4679346 4876370 5088186 5314963
14990E314963K52487K59961K73411K97381K99202L37089L60459L87857L98241
$$ 5314963 5567450 5827411 6100822 6398203 6697405 7034494 7394953 7782810 8181051
14981H181051M33170M84329N54715N90121O17543O68683P47015P95668Q76321
$$ 8181051 8614221 9098550 9653265 10243386 10860929 11529612 12276627 13072295 13948616
14972A3948616R48541J041337J170773J290115J405563J497886J654063J856690
$$ 13948616 14897157 15938494 17109267 18399382 19804945 21302831 22956894 24813584
14964B4813584K058792K252330K459273K746134L047827L352097L672319M016137
$$ 24813584 26872376 29124706 31583979 34330113 37377940 40730037 44402356 48418493
14956D8418493M310317M575221M754092M808321M690979M356985L755102K904180
$$ 48418493 52728810 57304031 62058123 66866444 71557423 75914408 79669510 82573690
14948H2573690J817448O02058o67593j884491k946604l766095m335338m666452
$$ 82573690 84391138 84993196 84325603 82441112 79494508 75728413 71393075 66726623
14940F6726623m765170m716357m529580m267682l979722l630624l310925k992199
$$ 66726623 61961453 57245096 52715516 48447834 44468112 40837488 37526563 34534364
14932C4534364k716652k477704k247626k023089j820057j650857j506916j360820
$$ 34534364 31817712 29340008 27092382 25069293 23249236 21598379 20091463 18730643
14924A8730643j245817j144655j048102r59260r12203q33071p23434o69699o50364
$$ 18730643 17484826 16340171 15292069 14332809 13420606 12587535 11864101 11194402 10544038
14915A0544038n79385n41987n16732m65232m32058l84574l79578l39380l14789
$$ 10544038 9964653 9422666 8905934 8440702 8008644 7624070 7244492 6905112 6590323
14906F590323l08033k86861k57523k19705k28119k43393k25458k02539j79193
$$ 6590323 6282290 5995429 5737906 5518201 5290082 5046689 4821231 4618692 4439499
14897D439499j49340j60605j80544j48426j24193j00730j14240j30068r5728r7962
$$ 4439499 4290159 4129554 3949010 3800584 3676391 3575661 3461421 3331353 3235625 3137663
14887C137663r9138j12050j04900q6897r1417q3475q1755o4272p3520n8560o6774
$$ 3137663 3038525 2926475 2821575 2734678 2643261 2559786 2478031 2413759 2340239 2281679 2214905
14876B214905p2248n5992m1552n5774m2285m2660n6995o2893l8834m6691m6354
$$ 2214905 2142657 2086665 2045113 1989339 1947054 1904394 1847399 1784506 1745672 1698981 1652627
14865A652627k4225l0602m7978l2324j8959l2898l6922m0535k4053l2069l5166
$$ 1652627 1628402 1597800 1549822 1517498 1498539 1465641 1428719 1388184 1364131 1332062 1296896
14854A296896j6495m651k2893m0172m6164o523j60j2316k9984l5396k4415k1947
$$ 1296896 1280401 1275750 1252857 1212685 1166521 1159998 1159838 1147522 1117538 1082142 1057727 1035780
14842A035780k9436p367j2988j4953o555j4066j0499o163j2584j6961p322O974
$$ 1035780 1006344 998977 985989 971036 964481 950415 939916 933753 921169 904208 896886 903860
14830I03860j1477k8923k3633n650L105J37j7319m1190k2050k1255o893J8789
$$ 903860 892383 863460 839827 834177 837282 837419 820100 778910 756860 735605 728712 747501
14818G47501R004n650l7755l8935j5089j7063l711K992o038k0439r978m963q403
$$ 747501 756505 750855 713100 674165 659076 642013 638302 641294 635256 614817 604839 599876 591473
14805E91473j6306l6235m534j2412j4823j300R87l831o20q798J043j4457k8689
$$ 591473 575167 538932 534398 521986 507163 505863 506850 503019 502399 493601 494644 480187 451498
14792D51498k7384L042j1600K4666J3922m980L331j6639m972N591j65r344p131
$$ 451498 424114 427156 415556 440222 454144 449164 452495 435856 430884 436475 436310 426966 419835
14779D19835n102k6280j8258j5341N670k37j0392P551l390J836J18p843j5953
$$ 419835 414733 388453 370195 354854 360524 360287 349895 357446 354056 355892 356010 348167 332214
14766C32214n3M868K475Q64j5403K72J7512J3248p129p556j671J5251l3894j9932
$$ 332214 332161 337029 339504 340368 324965 325237 342749 355997 348868 341312 339641 354892 320998 301066
14752C01066J7523J6368N60k701P185j5106O145m508j7802L84k2519j3569J0536
$$ 301066 318589 334957 335517 332816 340001 324895 331040 326532 308730 309114 286595 273026 283562
14739B83562j669k3714R148J663J5829K4895p081j8885O8n106j0020k4302j3032
$$ 283562 281893 258179 267327 268990 284819 309714 302633 283748 283816 278710 268690 244388 231356
14726B31356j4128P595j417N986O238m358O67l066j589o118J436N879J493L16
$$ 231356 217228 224823 223406 229392 235630 231272 231939 228873 227284 221166 222602 228481 229974 230290
14712B30290L051k0488j9118J0058J4347J775P72j141J1407o245q775k2440j908
$$ 230290 233341 212853 193735 203793 218140 219915 220687 219546 230953 224708 215933 193493 191585
14699A91585K8619k610j4896K246K2629J5099m3K0782K6941O084l973R42J7291
$$ 191585 220204 217594 202698 204944 227573 242672 242629 263411 290352 296436 292463 293405 310696
14686C10696M3225K9742J4874R480N311K5824J0968j5440k8146k7830k8022l0410
$$ 310696 353921 383663 398537 408017 413328 439152 450120 434680 406534 378704 350682 320272
14674C20272k8650j4717r936j4967j4684j4416j9585j2925K3731l983r462j8826
$$ 320272 291622 276905 266969 252002 237318 222902 203317 190392 214123 210140 200678 181852
14662A81852L67j5150j8889k224J1082J0049L406r173j1709J7192R489J29O384
$$ 181852 182219 167069 148180 145956 157038 167087 170493 161320 149611 166803 176292 176421 182805
14649A82805J1431J3313j9701j9920P557j3712j3629N201O579k891n924j1604
$$ 182805 194236 207549 187848 167928 175485 161773 148144 153345 159924 157033 151109 139505
14637A39505l917K119j3483k6391p073k179P372P982n969m426k7017J2835K1084
$$ 139505 135588 137707 124224 97833 90760 88581 95953 103935 97966 93540 66523 79358 100442
14624A00442N275N563m310k498J6129J7280l780L803q83k0955O105r471j6240
$$ 100442 105717 111280 106970 104472 120601 137881 134101 137904 137021 116066 122171 112700 96460
14611I6460J3691J2801j3735R740Q126k2405N68m527k171J48N122P338K98j2349
$$ 96460 110151 122952 109217 118957 127083 104678 105246 100719 98548 98696 103818 111156 111454 99105
14597I9105r05O150j3068p422K475j6125Q474K2923j490J673K4679P903k4833
$$ 99105 98200 104350 91282 83860 86335 70210 78684 101607 100117 101790 126469 134372 109539
14584A09539p101R711k495O53K589P241P001L928K3321J9378O798k5739O187Q229
$$ 109539 102438 112149 109654 110307 112896 120137 127138 131066 154387 173765 180563 154824 161011 169240
14570A69240r562L871M391J0412K258q609j2735L289J3894l754J8193J6609k749
$$ 169240 159678 163549 167940 178352 180610 172001 159266 162555 176449 172695 190888 207497 204748
14557B04748M149K9779J9340P079K3562L6122K7576L7409M0059L4780P796J4595
$$ 204748 208897 238676 258016 265095 288657 324779 352355 389764 429823 464603 472399 486994
14545D86994L4713M3781N0297N7499R795K1931K4355k439j2719k5364j6148j4279
$$ 486994 521707 565488 615785 673284 683079 705010 729365 726926 714207 688843 672695 658416
14533F58416l4652k9211k5452k7952l9909m4688k9932l3372j9009l1635j5483
$$ 658416 623764 594553 569101 541149 501240 456552 426620 393248 374239 342604 327121
14522C27121k4016q935q103k1219k9973j3442j6979k0573j0521p148j2651k0162
$$ 327121 303105 294170 286067 264848 234875 221433 204454 183881 173360 166212 153561 133399
14510A33399j4123j246Q584J0652L750R391O350q992k1360j7522k914O657r191
$$ 133399 119276 118030 126614 137266 141016 150407 156757 147765 126405 108883 105969 112626 103435
14497A03435k0101j8890p597j781O620O18L092o35K842J103j2614l759J8255P984
$$ 103435 83334 64444 56847 55066 61686 62304 65396 64761 67603 68706 56092 52333 70588 78572
14483G8572m456j1727j952P57J262J3708J0818j0946j1358j1037r70J0326Q988
$$ 78572 74116 62389 60437 61194 62456 76164 86982 76036 64678 53641 52671 62997 71985
14470G1985o29J2796m558m190j4357j5925j8141J3199J0374P500J901K7639r461
$$ 71985 71356 84152 79594 75404 61047 45122 26981 40180 50554 58054 59955 87594 78133
14457G8133j7889P851J7805j3119r893k0221r13n620J720j0948k815r125r636
$$ 78133 60244 68095 85900 72781 62888 42667 41754 36134 37854 26906 24091 14966 5330
14444E330R567K1610K490r801J5876j4195r243r523J7166m058m301O334J1208
$$ 5330 14897 36507 38997 29196 45072 30877 21634 12111 29277 25219 20918 27252 38460
14431C8460N1025l211j9120j6856j5484K593k157j4862p760O928J9498K890q379
$$ 38460 89485 86274 67154 50298 34814 37407 35250 20388 12628 19556 39054 41944 33565
14418C3565k348J4395r797K898K620J94M026J6714R074J86q271r091J561O93P3
$$ 33565 31217 45612 35815 38713 41333 41527 45553 62267 71341 71527 63256 54165 55726 56419 56492
14403E6492n037J903J918j326Q493o995k9433o663k1084j2352J2316q555J6499
$$ 56492 51455 53358 55276 53950 62443 55448 26015 19352 -1732 -14084 -1768 -10323 6176
14390F176K3359O978J4480O257k2151j4409k248J2803p771j340j382J0711Q576
$$ 6176 29535 36513 50993 57250 35099 20690 18442 31245 23474 22134 20752 31463 40039
14377D0039O476P347j3787j4109J152P730J0799k343K995m908p032m995j3034
$$ 40039 46515 53862 40075 25966 27118 34848 45647 43304 46299 41391 34359 29364 16330
14364A6330J204P16P184o135J1854j389j4178q199L821q794k132R691J3634M879
$$ 16330 17534 18250 25434 19299 31153 29764 15586 7387 11208 2414 282 9973 23607 28486
14350B8486j0722j6614k353O807p720m726j270P311J7058J2668J6684p706j7643
$$ 28486 17764 1150 -1203 5604 -2116 -6842 -8112 -801 16257 28925 45609 37903 20260
14337B0260k5281l905K4003R682j0219j390j1222m565L5197J7249J3708j5616
$$ 20260 -5021 -8926 15077 24759 14540 13150 1928 -2637 32560 49809 63517 47901
14325D7901M0J715j2013p466j579o803j7014L384J7801O943m013j4013J3350j44
$$ 47901 47941 49656 37643 30177 28598 21795 4781 8165 25966 32909 28896 14883 28233 28089
14311B8089p251k5839j2451P300K3272O402j381J019k99J2607J5026o818o486
$$ 28089 20838 -5001 -17452 -10152 13120 19522 18141 19160 18861 31468 46494 39676 33190
14298C3190k84N084Q692K46r289n050K066n327j671l307p997k2114p948J8158
$$ 33190 32906 37990 46682 46928 37639 32589 34655 29328 27657 24350 16353 -5761 -13709 4449
14284D449J6359K931Q319j4863j2025o743M505N342K1341K1537p748p024J444
$$ 4449 20808 23739 32058 17195 5170 -1573 2932 8274 29615 51152 43404 36380 37824
14271C7824r618j1559K679Q048P041J699J163p635j800J1118j0191l497O645k5437
$$ 37824 28206 16647 19326 27374 34415 36114 37277 29642 27842 38960 28769 25272 31917 6480
14257F480j0857j0697Q471J2527K4418R877o306q310r95O50J635k526j1216j6455
$$ 6480 -4377 -15074 -6603 5924 30342 40219 33913 25603 24608 25258 26893 24367 13151 -3304
14243c304k298N506J0686M234j4131N12q360K678J7771q835j1783L867K838K984
$$ -3304 -5602 -96 10590 14824 693 1205 -7155 -4477 13294 4459 -7324 -3457 -619 2365
14229B365M725j1533n53o091j1667J773R174L4057K4016N450k5561o919o630j704
$$ 2365 7090 -4443 -4996 -11087 -22754 -20981 -11807 22250 46266 51716 26155 19236 12606 10902
14215A0902q026J5908R606k807q077k1290l420R775R058M565l493J6891m402N231
$$ 10902 2876 18784 28390 25583 17506 -3784 -7204 2571 11629 16194 12701 29592 25190 30421
14201C0421k959K084j4120k36j399J5070J1425k935l828KL507m365k5208j7049
$$ 30421 27462 29546 15426 15190 13791 28861 40286 37351 33523 33525 37032 32667 7459 -9590
14187i590J3032K8157J981k949J7851L40j1809r264k6795k0790J141J3919J0567
$$ -9590 3442 31599 33580 30631 48482 48822 37013 27749 954 -19836 -18695 -4776 5791
14174E791M564K0095P466q049o012N552k15j521j2078L312k031J3252n944j6912
$$ 5791 10355 30450 37916 29867 23855 29407 29192 27671 15593 18905 16874 30126 24182 7270
14160G270j79Q037j829J4784J2215r910K2858o197k4202p777m35L972j7630k429
$$ 7270 7091 15128 13299 28083 40298 30388 53246 47049 22847 15070 14635 18607 977 -1452
14146a452K3571Q765Q72j2961j0686M895l286k2335m948J2067J7406J5202J926
$$ -1452 22119 30884 31756 18795 8109 13004 9718 -12617 -17565 -5498 11908 27110 29036
14133B9036j1490j603j5032k843P775J863J202l092k341R478o546L371J6903J3208
$$ 29036 17546 15943 911 -1932 5843 7706 8908 5816 3475 12953 6407 9778 26681 39889
14119C9889j0766r203J0134j7173j1968k614O689K871j406P650O389p523m842
$$ 39889 29123 19920 30054 12881 913 -1701 4988 7859 6453 14103 20492 12969 8127
14106H127r441J207J3623R322k1631k1749N676O920P207J0187J3009j2945j1227
$$ 8127 -1314 -107 13516 22838 1207 -20542 -14866 -7946 -739 9448 22457 9512 -1715
14093a715k156k532k510J1149j256R112l901k149J7123m957M508Q245k246j2464
$$ -1715 -3871 -6403 -8913 2236 980 10092 6191 4042 21165 16208 20716 28961 26715 14251
14079A4251J0606J1632j3677j0945O324j51l1804j048r022L010K2989Q166m174
$$ 14251 24857 36489 22812 11867 18191 18040 -13764 -14812 -23834 -20824 2165 10331 6157
14066F157m994J1364n865l615O635j585R240N512J2254j6951r347l989j3851J3011
$$ 6157 1163 12527 6662 3047 9682 8097 17337 22849 35103 18152 8805 4816 -9035 3976
14052C976P035r004j0136J6403J8074j4360N36Q906k213j1537n176K4902l581
$$ 3976 11011 2007 -8129 8274 26348 11988 12524 21430 19217 7680 2504 27406 23825
14039B3825j7241j7354m090K2069O915R835L684Q603Q695N475j8052m161m934
$$ 23825 6584 -10770 -14860 7209 14124 23959 27643 36246 44941 50416 32364 28203 23269
14026B3269n738k9370r323L093n169J0279Q656J0203J1718J944q511J932r464
$$ 23269 17531 -11839 -21162 -18069 -23238 -12959 -4303 5900 17618 19562 11051 12983 3519
14013C519n923L511P162j1598K266J9365m731j2311j4418J7428K8671o882k9976
$$ 3519 -2404 1107 8269 -3329 -1063 18302 13571 1260 -13158 4270 32941 26059 -3917
14000c917j4827j6255L658L1246L1480p273k7817o520j5341j2284K6238K8326
$$ -3917 -18744 -34999 -31341 -95 31385 24112 -3705 -10225 -25566 -37850 -11612 16714
13988A6714n831N537O284l414p79j1013j3392k076m789J1795J5420K6699l763
$$ 16714 10883 16420 22704 19290 18511 7498 -5894 -7970 -12759 -964 14456 41155 37392
13975C7392r579J58o810j1828q600j4353L536J718j312O163N264n490R545K5693
$$ 37392 27813 27971 21161 9333 733 -13620 -10084 -8366 -9678 -3515 1749 -3741 5804 31497
13961C1497j0867k0277r024m423N714Q410R308J61k065K378L318r736k408j3922
$$ 31497 20630 353 -8671 -13094 -7380 1030 10338 10499 8434 10812 14130 4394 1986 -11936
13947a1936P409J5457M39J0586l425J2991J1310p676j3488l020l128O897j5460
$$ -11936 -4527 10930 11369 21955 18530 31521 42831 35155 21667 18647 15519 22416 6956
13934F956j182N533R544K69n116j1353J0673j3209j8499r102J8351R687n601l364
$$ 6956 5774 11307 20851 21120 16004 4651 15324 2115 -16384 -25486 -7135 2552 -3049 -6413
13920f413k131K6494j6899o990m8J0K6040q951j7313p350p311M546J3388k527
$$ -6413 -8544 17950 1051 -5939 -5987 -5977 20063 11112 -6201 -13551 -20862 -16316 -2928 -5455
13906e455m534k634L963J2o05J4656R621r961p234P267K105P330J3028l5558j3229
$$ -5455 -9989 -12623 -8660 -8648 -9253 5403 15024 5063 -2171 5096 7201 14531 27559 -7999 -21228
13891b1228p414K0258J2167P764N811j2499q051p202N699L577J4400M307j2894
$$ -21228 -28642 -8384 3783 11547 17358 4859 -3192 -10394 -4695 -1118 13282 17589 4695
13878D695j4517K285O774l851j0057J3735l66m258M780J4023r795L086J0128j869
$$ 4695 -9822 -7537 -763 -4614 -14671 -936 -1302 -5560 -780 13243 3448 6534 16662 14793
13864A4793j2685J6821M217n191m59j7241j0423p426q36K1698J1602O860j0508
$$ 14793 2108 18929 23146 17955 17496 255 -10168 -17594 -18430 3268 14870 21730 11222
13851A1222j5748J2081J3854o022j9483l373L328K396N272p267J5296M790K54
$$ 11222 -4526 7555 21409 15387 -4096 -7469 -4141 -1745 3527 -3740 11556 16346 16600
13838A6600K5208l979q906r610j6774J3397j3159k2319K414J7110N121j1740q780
$$ 16600 41808 37829 28923 19313 2539 15936 2777 -19542 -17128 -18 5103 -6637 -15417
13825a5417m866j748Q362L432L426J1825J0515N892m588j4400k0406j4612K2245
$$ -15417 -20283 -22031 -13669 -10237 -6811 5014 15529 21421 16833 2433 -17973 -32585 -10340
13812a0340K5211m945l204n162j3965O626O701K1789p992m040o394m169J2306
$$ -10340 14871 9926 6722 1560 -12405 -5779 922 22711 14719 10679 4285 116 12422
13799A2422J5178R520j455k464j0144p967K84M263p128n070j1997j9235R46J9101
$$ 12422 27600 37120 35665 33201 23057 15090 15374 19637 12509 7439 -4558 -23793 -22847 -3746
13785c746R771J886K1463m063j8285j924q23J0575J796r118j1027j84J4395L082
$$ -3746 6025 7911 29374 25311 7026 5102 4279 14854 16650 7532 -3495 -3679 10716 13798
13771A3798k185j0568J7456n134n337j0974n9K9489J0139K427k9535j420J2493
$$ 13798 11613 1045 18501 13367 8030 -2944 -3003 26486 36625 39052 9517 8097 20590
13758B0590M409j3548l132Q736q857j0476L713N215M371J3492q799j3712q992
$$ 20590 24999 11451 8319 17055 8198 -2278 1435 6650 11021 24513 15714 2002 -6990
13745f990l06L716l151j3118M894J4735J5461N372p658l033O13o158m011P300
$$ -6990 -7296 -3580 -6731 -19849 -14955 -220 15241 20613 12955 9922 10535 4377 366 7666
13731G666J51n251J3515J3388k331j3010j8709n453J8646Q530k6089j0845R532
$$ 7666 7817 2566 16081 29469 27138 14128 -4581 -10034 8612 17142 -8947 -19792 -10260
13718a0260m249j836p558R022r739j1756K574K3231K6632L744q547l297m026N413
$$ -10260 -14509 -16345 -23903 -14881 -24620 -36376 -33802 -10571 16061 19805 11258 7961 3935 9348
13704I348j2965o416N675q698M484K0140q809j5717k950o275K957l889m228K4142
$$ 9348 -3617 -10033 -4358 -13056 -8572 11568 2759 -12958 -15908 -22183 -19226 -23115 -27343 -3201
13690c201N914N574L197j4075M715J1335j2174j375k1033M342J4967K3714j184
$$ -3201 2713 8287 11484 -2591 2124 13459 1285 -90 -21123 -16781 -1814 21900 20716
13677B0716Q615k666J7740j250o745k543j2541l639J438R495L18K294j2693M218
$$ 20716 29331 26665 44405 43155 36410 33867 21326 17687 19125 28620 28938 31232 18539 22757
13663B2757J6261o878p671j7124j9447K514K9971J4262p862k24j1923l930j5964
$$ 22757 39018 32140 24469 7345 -12102 -9588 20383 34645 26783 26559 14636 10706 -5258
13650e258R21O30r609J1793K6477J2105j4419K986j9229q017O904J9939j904r767
$$ -5258 -4337 -3707 -13316 -1523 24954 37059 22640 25626 6397 -1620 5284 25223 23319 13552
13636A3552l10n010J7721K131j6735j0594K3121J6896k295N075K13j3095P855
$$ 13552 13242 8232 25953 28084 11349 755 23876 40772 38477 43552 43765 30670 38525
13623C8525M174j1660l922o61q392O708O971K114m340m396k4304o32K407J8472
$$ 38525 42699 31039 27117 26456 18064 24772 31743 33857 29517 25121 817 185 2592 21064
13609B1064R297k691j3526k0843l65J3817p382j2247K701Q308P268n203k0091
$$ 21064 30361 27670 14144 -6699 -7064 6753 -629 -12876 -10175 -1867 5401 198 -19893
13596a9893o053J7869K051L693J2872J6968j2144j1871n119o711M229J7282K622
$$ -19893 -25946 -8077 -6026 -2333 10539 27507 15363 3492 -1627 -8338 -4109 13173 15795
13583A5795L43j2777j4472J1296K0510J715O433J2292j423j8904k4079Q1J6952
$$ 15795 16138 3361 -11111 185 20695 22410 28843 41135 39712 20808 -3271 -3190 13762
13570A3762K739l47N466N900N783j3148j2427j2035r615K5474M1615j3897j2052
$$ 13762 16501 16154 21620 27520 33303 20155 7728 -4307 -13922 11552 53167 39270 27218
13557B7218l240j2684p621j4912O275j594J0143L465J9294J0687p872j0680j2720
$$ 27218 23978 11294 3673 -11239 -4964 -6558 3585 7050 26344 37031 29159 18479 5759
13544E759L601J3948j3800k4140J668L5312J6669n611j9709j2100J6017p839N309
$$ 5759 9360 23308 9508 -14632 -12964 22348 39017 33406 13697 1597 17614 9775 15084
13531A5084L644k948j798j227K454m70K440P682N168m529J7111J0007N350k2344
$$ 15084 18728 15780 13982 12755 15209 14739 17179 24861 30029 25500 42611 52618 57968 35624
13517C5624k1177o715j3410J358N324P494J1567Q188p473k0889n44j0587L490
$$ 35624 14447 7732 -5678 -4320 1004 8498 20065 28253 20780 -109 -653 -11240 -7750
13504g750K3793J965j284J4081p321j7836j5714J1320P507J2814K0570O620n960
$$ -7750 16043 18008 16724 30805 23484 5648 -10066 1254 8761 21575 42145 48765 42805
13491D2805k0801j1286N292L734j3197k3677lJ1736K591j7492r838R916Q066J0253
$$ 42805 22004 10718 16010 19744 6547 -17130 -17133 -5397 -2806 -20298 -30136 -20220 -12154 -1901
13477a901Q175R027J6652J084j2502j0666m746R870M296j8690j3246p414Q471
$$ -1901 6274 15301 31953 33037 20535 9869 5123 14993 19289 599 -12647 -20061 -11590
13464a1590j368Q750J1528q997J155J1882r242Q176N417m571k75j2830N402j648
$$ -11590 -12958 -4208 7320 -1677 -522 11360 2118 10294 15711 11140 10865 -1965 3437 1789
13450A789M624R215P90j414n181j462k2761n048P533J1660J2017J5795l741j865
$$ 1789 6413 15628 16418 15004 9823 8361 -14400 -19448 -11915 -255 11762 27557 23816 21951
13436B1951j6310o670O042K4124Q169M350j8024k5755J3471J0399j7078j743m11
$$ 21951 5641 -1029 5013 29137 37306 41656 23632 -2123 11348 21747 4669 2926 2515
13423B515P00n51K3512n473J903j410p714R877O206q984j9153K212j3064l345
$$ 2515 3215 2664 26176 20703 22606 21196 13482 23359 29565 20581 1428 3640 -9424 -12769
13409a2769l697j2407K737J3733J5970j1341L0457J4442N374q949l1964m671J9488
$$ -12769 -16466 -28873 -26136 -12403 3567 -7774 22683 37125 42499 33550 1586 -3085 16403
13396A6403J8338o179n40l593n78k955N781K997j3896r083q63j0373M170j0526
$$ 16403 34741 28562 28022 24429 23851 20896 26677 29674 15778 6695 5832 -4541 -371 -10897
13382a0897m036q109m591J0538J3130K645j408J3037K2827J7500l995o878j1120
$$ -10897 -14933 -23042 -27633 -17095 -3965 -1320 -2728 10309 33136 50636 46641 39763 28643
13369B8643j6821m20l656j0364o691l682R672J110L284M957N203p684l33K7042
$$ 28643 11822 11402 7746 -2618 -9309 -12991 -3319 -2209 1075 6032 11235 3551 3218 30260
13355C0260L0061p966k4526k325j4574Q087r51o185j5347j7780M450m303O149
$$ 30260 60321 52355 27829 25504 10930 19017 18066 11881 -3466 -21246 -16796 -21099 -14950
13342a4950K2491j1126J0284J7793Q232l782M480j2576k4204k30J917M445J2107
$$ -14950 7541 -3585 6699 24492 32724 28942 33422 20846 -3358 -3588 -1671 2774 14881
13329A4881P30k335Q364m724N95L1055m960k4226l2768J7317Q207l066L875K0335
$$ 14881 15611 13276 21640 16916 17511 48566 43606 19380 -13388 3929 12136 9070 12945 33280
13315C3280j7259k0125K1551J495j7229P383K676M894N254k3362j5596M008R791
$$ 33280 16021 -4104 17447 18942 1713 9096 11772 16666 21920 -1442 -17038 -13030 -3239
13302c239j534J5003R375j701R848L555l400K198l1K832m164j7270l704O258J6647
$$ -3239 -4773 10230 19605 17904 27752 31307 27907 30105 30074 32906 28742 11472 7768 14026 30673
13287C0673j6355M173n191j2395Q221L333J2787R666M225J2362j5824j8576n123
$$ 30673 14318 18491 13300 905 9126 12459 25246 34912 39137 51499 35675 17099 11976
13274A1976j3298k2016M316L560K675P790o259P726L879J9811L1310J1476o794
$$ 11976 -1322 -23338 -19022 -15462 -12787 -4997 -11256 -3530 349 20160 51470 62946 56152
13261E6152k0625j6767J939R090j8128k2183N877J4494Q206M800o08p84J2527
$$ 56152 35527 18760 20699 29789 11661 -10522 -4645 9849 18055 22855 22247 21463 33990
13248C3990j0195m799P50Q329N389j7069J3602M583K48P098q0k607l536j8939
$$ 33990 23795 18996 19746 28075 33464 16395 29997 34580 34828 41926 41846 39239 35703 16764
13234A6764j8481j7995l140O143K6159J2770Q76K0911n751j6098n08K099l317
$$ 16764 -1717 -19712 -22852 -16709 9450 22220 23096 44007 38256 22158 21650 23749 20432
13221B0432O388J1706J3307J6973l32j8493k6698o51K1691p870n10o3j1971R074
$$ 20432 26820 38526 51833 68806 68474 49981 23283 22632 44323 36453 35943 35880 23909 32983
13207C2983J341K895j0683J0442O295j0302M93j881J4607p620j8991q962K0529
$$ 32983 34324 37219 26536 36978 43273 32971 33464 31583 46190 38570 19579 10617 31146
13194C1146J8325J6025k5661j3372P759N937o255n099O355j1455K906L9036J0519
$$ 31146 49471 65496 39835 26463 34222 40159 33904 28805 35160 23705 26611 65647 76166
13181G6166j2390j7026j5653j0924O390J7966j0109j0425j2173J0265J1089J0025
$$ 76166 63776 46750 31097 20173 26563 44529 34420 23995 11822 22087 33176 43201
13169D3201J0467r571k1161O85j5712m296n630J5038n35L841O774n450m88K1271
$$ 43201 53668 44097 22936 23621 7909 3613 -2017 13021 12486 16327 23101 17651 17163 38434
13155C8434J4009K118r340j1746J0592K381j2072N659q381r142R789J5209J6107
$$ 38434 52443 54561 45221 33475 44067 46448 34376 40035 31654 22512 32301 47510 63617
13142F3617j9070j9559N380q090m945J1522R70j2424P316O34J1446L190Q799n625
$$ 63617 44547 24988 30368 22278 17333 28855 29825 17401 24717 25351 36797 39987 48786 43161
13128D3161n417P05O275j414P074L296M821q734n844m461j0787K0699J7468k0597
$$ 43161 37744 38449 44724 43310 50384 53680 58501 49767 43923 39462 28675 49374 66842 46245
13114D6245J338j0974L226L967q440R24M08r392K064N961J3770m240J691M866
$$ 46245 47583 36609 39835 43802 35362 36286 36694 27302 29366 35327 49097 44857 46548 51414
13100E1414j9686j5705J2218J3406K31P10l335j8080r179J6267J2350O447j5721
$$ 51414 31728 16023 28241 41647 41878 42588 39253 21173 11994 28261 40611 47058 31337
13087C1337l268K7356J3904N509O138K8754J0772k347m74O97Q065j0706K6756
$$ 31337 28069 55425 69329 74838 80976 109730 120502 118155 117681 118378 126443 115737 142493
13074A42493O4787J15853J19116J09508P9056j1781r9395j15600q8468o7525k1404
$$ 142493 207280 323133 442249 551757 630813 619032 519637 404037 315569 248044 226640
13063B26640j1297k8195j1670p668L5737K2135J9912J9360K3028L0001L8920P2524
$$ 226640 215343 187148 175478 167810 203547 225682 245594 264954 287982 317983 356903 429427
13051D29427O6325Q4952J43310J88990K37001L10240L38744K69071K6338k88742
$$ 429427 495752 580704 724014 913004 1150005 1460245 1798989 2068060 2094398 1805656
13041A805656l64690l26263k64899j69977j01487q1294q1240j6961k446J0447
$$ 1805656 1440966 1114703 849804 679827 578340 497046 415806 398845 396399 406846
13031D06846K1808M5352J17184K14333L12573L63156K81871J3087k72069l86968
$$ 406846 428654 474006 591190 805523 1118096 1481252 1763123 1776210 1504141 1117173
13021A117173l65921k44655j42198o8668j9801q109k3491l3317k9326j2995k9602
$$ 1117173 751252 506597 364399 295731 275930 267821 244330 211013 181687 168692 139090
13010A39090r787j3885k4794k5760J2803L2830R798N43n410p932J69K414j2373
$$ 139090 129303 115418 90624 64864 77667 110497 120295 120838 115428 107496 107665 110079 97706
12997I7706p755J0577J1523J2740n012L279J3197R201K1676K3833K8987L2361
$$ 97706 89951 100528 112051 124791 119779 123058 136255 145456 167132 190965 219952 252313
12985B52313O9273J43148K39249L33628L82649K99401J9927k69291l84220l48732
$$ 252313 321586 464734 703983 1037611 1420260 1719661 1739588 1470297 1086077 737345
12975G37345k32288j17618p2819m3097l9564l5510l6510K091P202j2817M965j6018
$$ 737345 505057 387439 314620 271523 231959 196449 159939 162030 169232 156415 161380 145362
12963A45362j5340P544j2280k1859J2550O741m335j6264k6234J5005K6398j011
$$ 145362 130022 137566 125286 103427 115977 122718 118383 102119 75885 90890 117288 116277
12951A16277r575m166N284j3781p17Q623P4J1768J3312N211q66L1213M3242O1370
$$ 116277 106702 102536 107820 94039 93322 101945 102019 113787 127099 132310 131444 162657 205899 267269
12937B67269J04588J28321J01622J7777p4553j23133j17967p0621l2974k6749
$$ 267269 371857 500178 601800 619577 545024 421891 303924 233303 200329 173580
12927A73580j5234k2557j6235L849n731k1175k6443R513Q963K2290L934j431j0691
$$ 173580 158346 135789 119554 123403 117672 96497 70054 79567 88530 110820 114754 113323 102632
12914A02632J191j0566j7174K234J0460o45j2757J5896J0022J6641o301J5321
$$ 102632 103823 93257 76083 78317 88777 88132 75375 91271 101293 117934 111633 126954
12902A26954N450m462K2069r240q615J346P208K4518n801k3681j6716m6837p2507
$$ 126954 132404 127942 150011 140771 132156 133502 140710 165228 159427 135746 119030 72193 -314
12889c14q1690o0043m187L8979K7740J9485R359J0809j096K5762K1304Q990n597
$$ -314 -82004 -142047 -146234 -107255 -79515 -60030 -50671 -39862 -40958 -15196 6108 15098 9501
12876I501j1445J950J7610M014R00j7355m127J4228K4585M3706O353k605j8659
$$ 9501 -1944 6 17616 21630 22530 5175 1048 15276 39861 83567 89920 87315 68656
12863F8656j4808L044K5969P157k7085m9810J515M9818K0552j513n303L3949N1141
$$ 68656 53848 56892 82861 90018 62933 13123 14638 64456 85008 83495 78192 112141 163282
12850A63282K5079K4076l606k9524k1073Q724K7553K6484L2743J5369Q160j7785
$$ 163282 188361 212437 208831 179307 158234 166958 194511 220995 253738 269107 277267 259482
12838B59482j3417K4837l1546k3922J856j511m2628n4716l7248k5223K078K3028
$$ 259482 246065 270902 239356 215434 217290 215779 173151 118435 81187 55964 58042 81070
12826H1070R353q267M012O860J0815J3489l142P261p635k5600k1045j5699M193
$$ 81070 90423 82156 86168 93028 103843 117332 114190 121451 113816 88216 67171 51472 55665
12813E5665P910P53J3426R172K9524J7538m020j1477P169k6227j1368j8850j4022
$$ 55665 63575 64328 77754 86926 116450 133988 129968 118491 125660 99433 88065 69215 55193
12800E5193p514j843K7635K3837L869j994j8502m063p894j6911j979q487r340
$$ 55193 47679 45836 73471 97308 101177 99183 80681 76618 68724 51813 49834 41347 32007
12787C2007k987n83K8731Q464k6882j3175j513M226R466K1712o034p803J5679
$$ 32007 29020 28437 57168 65632 38750 25575 24062 28288 37754 59466 53432 45629 61308
12774F1308m06J6647N383L635L2332M031o541K2810J1307p297R219K1447J5986
$$ 61308 60902 77549 82932 86567 118899 122930 116389 139199 150506 143209 152428 173875 189861
12761A89861P074l176Q703M224r425q488k3325m648K9498J444L458R244J2539
$$ 189861 196935 193759 202462 206686 197261 188773 165448 160800 190298 191742 195200 204444 216983
12748B16983k956j1841J595j155l290J1595J6339J5487P930Q799O110N956K619
$$ 216983 214027 202186 203781 202626 199336 210931 227270 242757 250687 259486 265596 271552 274171
12735B74171j6082J5153M443j3109J8215J9060j0047K4067L6234N83K1644K0066
$$ 274171 258089 273242 277685 264576 282791 301851 291804 315871 352105 352688 374332 394398
12723C94398L2379L9520O1418J00190P8353O2337J4220k2738q8958j21939j25694
$$ 394398 426777 466297 527715 627905 706258 768595 782815 760077 671119 549180 423486
12712D23486j29368r3375r063P2172O9788L9263p23p571r904j5765Q541J854K5011
$$ 423486 294118 200743 191680 263852 333640 372903 372180 364609 354705 338940 347481 349335 374346
12699C74346J4488R492j1825j2203J4217N92j9438R994q167K704K5264J1656j583
$$ 374346 388834 398326 386501 374298 388515 389107 369669 379663 371496 374200 399464 411120 409537
12686D09537J4476N968J6712n491M614J1762R526J0909M738K4585L3125K1792
$$ 409537 424013 429981 446693 441202 445816 457578 467104 478013 482751 507336 540461 562253
12674E62253L512k233K1471K9229K6917K0785J1435Q991J3731N688J5803N458
$$ 562253 565765 563532 585003 614232 641149 661934 673369 682360 696091 701779 717582 723040
12662G23040J2473K8917K3108K9877L4930K0618M017K8989L3669L3008J9333K1836
$$ 723040 735513 764430 787538 817415 852345 872963 876980 905969 939638 972646 991979 1013815
12650A013815L2506K3223M2710L7492L0023K0001J3425K7587L9998O9327P9586
$$ 1013815 1046321 1069544 1112254 1149746 1179769 1199770 1213195 1240782 1280780 1350107 1429693
12639A429693M4739M1570K8582O1308P7292Q3378R4239R2980J17829J39764J96988
$$ 1429693 1474432 1516002 1544584 1605892 1683184 1766562 1860801 1953781 2071610 2211374 2408362
12628B408362K78595L30121K95526J49026l1433p6611r765O1841J03939J25629
$$ 2408362 2686957 3017078 3312604 3461630 3430197 3353586 3343821 3405662 3509601 3635230
12618C635230J38725J51240J70080J77261K11247K70036L07714L66780M16789
$$ 3635230 3773955 3925195 4095275 4272536 4483783 4753819 5061533 5428313 5845102
12609E845102M14974M67526N58324O42437P07439Q15122R37302J103023J279391
$$ 5845102 6260076 6727602 7285926 7928363 8635802 9450924 10388226 11491249 12770640
12600A2770640J480488J765547K100089K529654L098269L786093M489771N178964
$$ 12770640 14251128 16016675 18116764 20646418 23744687 27530780 32020551 37199515
12592C7199515O286478Q375962J1482946J5948158K2559298L2417033M6789353
$$ 37199515 43485993 51861955 63344901 79293059 101852357 134269390 181058743
12585A81058743O5872071Q4350590Q2361951L6114985m7700853r1879205q1970024
$$ 181058743 246930814 331281404 413643355 449758340 402057487 310178282 228208258
12578B28208258n9896051m1761725k9090910k0521770j4770654j0796855p977316
$$ 228208258 168312207 126550482 97459572 76937802 62167148 51370293 43392977
12571D3392977o005971m760541m157583l807362l276064k724636k224024j818017
$$ 43392977 37387006 32626465 28468882 24661520 21385456 18660820 16436796 14618779
12563A4618779j478048j237047j064121r43486q14896o88844o24683n56667m90425
$$ 14618779 13140731 11903684 10839563 9896077 9081181 8392337 7767654 7210987 6720562
12554F720562m24373l59986k72218k34596j36465l9562R3344J30996J844l46791
$$ 6720562 6296189 5936203 5663985 5429389 5292924 5253362 5346706 5477702 5479546 5132755
12544E132755n57473n01531m04860l10559k11670j68216j76081j62816j56904
$$ 5132755 4575282 4073751 3668891 3358332 3146662 2978446 2802365 2639549 2482645
12535B482645j37244j08652j12495q4409r0572j03004p5998n1200o7835p3875
$$ 2482645 2345401 2236749 2124254 2039845 1949273 1846269 1770271 1719071 1651236 1577361
12525A577361p6454l6151m0793n0194k8560l9219m5660m2020l8024m9495m5997
$$ 1577361 1500907 1464756 1423963 1373769 1345209 1305990 1260330 1218310 1180286 1130791 1084794
12514A084794m1090n5891l6217k1181j5813k6536m1164l6957j6175l371n345k7629
$$ 1084794 1043704 987813 951596 930415 914602 888066 846902 809945 793770 790399 785054 757425
12502G57425M546P812l1416k6852l7522m5784j3138M62l992Q158K871j1265j7314
$$ 757425 761971 769783 738367 711515 673993 628209 615071 615533 611541 619699 622570 611305 593991
12489E93991j4692o761Q451j0355O773P19n860l0865j8083k0055k851j2309j6785
$$ 593991 579299 572538 580989 570634 577407 578126 572266 541401 523318 503263 500412 488103 471318
12476D71318j1775M461k0540j788J3587j940j6799j1520j0975M690j1772q099
$$ 471318 459543 464004 443464 441676 455263 453323 436524 425004 414029 418719 406947 398848
12464C98848j1365J2460K7248J9672J0636j540l711R556N0681M4667N4487L8481
$$ 398848 387483 399943 427191 446863 457499 455959 452248 461804 512485 557152 611639 650120
12452F50120k5714r2516p0000q9853j05763q0997m6053j9872r27K2401K0661K4545
$$ 650120 624406 531890 461890 372037 266274 185277 139224 119352 118425 140826 161487 186032
12440A86032J3532K2605R356j6500j2824R870J2194l279l790J591J6986k75l4628
$$ 186032 199564 222169 231525 215025 202201 212071 224265 220986 217196 218787 235773 235498 200870
12427B00870j6723K137J7797L69K243J791j5165j1362k753J1525M884J5387j2143
$$ 200870 184147 186284 204081 204450 206693 208484 193319 181957 179204 190729 195613 211000 198857
12414A98857p299j1191m411Q332J023o479j2379j5307j0451j1865k981J3621J523
$$ 198857 191558 180367 175956 184288 185311 178832 166453 151146 140695 128830 125849 139470 140993
12401A40993j2688K253Q10J0096Q250Q935O56J4773L9197K2898p895p082M677
$$ 140993 128305 130558 131368 141464 149714 158649 159305 174078 213275 236173 228278 221196 225873
12388B25873P045J8461N956r199p39m744l3053m3745k3597n703J2725L6273K2461
$$ 225873 232918 251379 257335 248136 247397 242653 209600 165855 142258 136555 149280 185553 208014
12375B08014J1753k976k5179l0003l6016l656j4173m527K5965J8466J3811j6272
$$ 208014 219767 216791 191612 161609 125593 121937 107764 103237 129202 147668 161479 145207
12363A45207q489j672j654o746j4186k068j3864j1573J2446n072O34J8475Q698
$$ 145207 136718 135046 133392 126646 112460 110392 96528 84955 97401 92329 92963 111438 120136
12350A20136P329k343k6763r101k211R186Q41J2518L437j4188k0636l514O010
$$ 120136 127465 125122 98359 89258 87047 96233 97074 109592 113029 98841 78205 74691 80701
12337H0701K8276J4918r068Q299r675m575l849Q136q790q531r255j8314M75Q548
$$ 80701 108977 123895 114827 123126 113451 108876 105027 113163 104373 95842 86587 68273 68748 77296
12323G7296j622k787J3885p20Q451j039Q38R942K6248j1724n746J3954j0653j0607
$$ 77296 75674 72887 86772 86052 94503 93464 94302 104244 130492 118768 113022 126976 116323 105716
12309A05716j4005J8040Q985O938K1034p00j4389Q14o182N427j8662j8567j1078
$$ 105716 91711 109751 118736 125674 146708 146008 131619 132433 126251 131678 113016 94449 83371
12296H3371J2199K9001j474p425K158K3137j6074k5967O004p176M420J7682K6368
$$ 83371 95570 124571 123097 115672 117830 140967 124893 98926 104930 97754 102174 119856 146224
12283A46224P220L588K6132L7886L9585J2413J1333j8963q1185q4402m9709m8778
$$ 146224 153444 157032 183164 221050 260635 273048 284381 265418 184233 99831 50122 1344
12271A344l7392r674Q728J0440K3623J6129P996J0270q568j6167j1007L06L876
$$ 1344 -36048 -45722 -36994 -26554 -2931 13198 21194 31464 22896 6729 -4278 -3972 -96
12258i6Q410n513J788q150n340j3190j1410J741N565m356M99J0798J7270J9049
$$ -96 8314 2801 4589 -3561 -8901 -22091 -33501 -31760 -26195 -30551 -30052 -19254 -1984 17065
12244A7065N325j126j7098q951K0094J1438K454L905j2900m258m453J1326J4493
$$ 17065 22390 21264 4166 -4785 15309 26747 29201 33106 20206 15948 11495 22821 37314
12231C7314m367j7748J2351J5056M253l073N599j3639l095p809P762l302M510
$$ 37314 32947 15199 27550 42606 46859 43786 49385 35746 32651 24842 32604 29302 33812
12218C3812K802p257J0494k742J4376J8105R365o191l67K0576N885M415M496j5689
$$ 33812 36614 29357 39851 37109 51485 69590 78955 72764 72397 92973 98858 103273 107769 92080
12204I2080k2225k303k948P454j1396j1730P939L287j464l474m625K1146m156
$$ 92080 69855 67552 64604 72058 60662 48932 56871 60158 58694 55220 50595 71741 67585
12191F7585J532J8984J7338K428j2676k7702j2264J2417k372J5982J9564j4870
$$ 67585 69117 88101 105439 107867 95191 67489 55225 67642 65270 81252 100816 85946
12179H5946k9655k472J992J0932j969m497p399J2098Q785K724J2937P515o897
$$ 85946 56291 53819 55811 66743 64774 60277 52878 64976 73761 76485 89422 96937 90040
12166I0040k0364q931j9101J284J2846J1152J2268N103j4773j2888M411J2634
$$ 90040 69676 60745 41644 42928 55774 66926 79194 84297 69524 56636 61047 73681
12154G3681j728j7564l809n308N589L973N349j866j5029j0494n812j4236K5370
$$ 73681 71953 54389 50580 45272 50861 54834 60183 58317 43288 32794 26982 12746 38116
12141C8116L3735J2856J3086j8999j1098j911J7056P00P769J9006J8127r031K2050
$$ 38116 71851 84707 97793 78794 67696 65785 82841 83541 91310 110316 128443 119412 141462
12128A41462J2091l885J2703M1608L0591J1034M3540N9865P5227J35078J54809
$$ 141462 153553 149668 162371 203979 234570 245604 289144 349009 424236 559314 714123
12117G14123J81261K56099L63382L72869K56137m1563l30761l83898l13217k37920
$$ 714123 895384 1151483 1514865 1887734 2143871 2102308 1771547 1387649 1074432 836512
12107H36512j69169j04558q7302n9487l9563l8165l4765n2592l5411j1897k3085
$$ 836512 667343 562785 475483 415996 376433 338268 303503 250911 215500 203603 180518
12096A80518k2466l2372R689J6815L14J073J5343N985j3714Q852J7109L486Q992
$$ 180518 158052 125680 135369 152184 152498 153571 168914 174899 161185 170037 187146 190632 199624
12083A99624p904K520l4090j9059j5465l949o908l276q55r656Q599L543R810P243
$$ 199624 191720 194240 160150 141091 125626 121677 114769 111493 110638 100982 109581 113124 122934 130177
12069A30177j8764n444M907m364M328n120j491m905j1018j355J1714P104n899
$$ 130177 111413 105969 110876 106512 110840 105720 104229 99324 88306 86951 98665 105769 99870
12056I9870o728J0176O94O252J6730N463J5378J4910L38J2385j1335j9726m661
$$ 99870 93142 103318 104012 110264 126994 132457 147835 162745 163083 175468 164133 144407 139746
12043A39746r862J2744Q640j7901o890L357J3876J3844m808p679j4987P565J138
$$ 139746 129884 142628 151268 133367 126477 129834 143710 157554 152746 145067 130080 137645 138783
12030A38783J9613J349J482J1571J3608P535q764j6504R053M882J3643K3682K9806
$$ 138783 158396 159745 161227 172798 186406 193941 185177 168673 177726 182608 196251 219933 249739
12017B49739j061k1146j85J3151J6709j709L659o373o116J0592P942K5985L517
$$ 249739 248678 227532 227347 240498 257207 255498 259157 252784 246668 257260 265202 291187 294704
12004B94704O870N858J1703K5971K6050J1994P138n039J7145J9478K4966P210
$$ 294704 301574 307432 319135 345106 371156 383150 390288 385249 402394 421872 446838 454048
11992D54048J9006K1402J5509K7729K2989J7305L0096N7714N0639L7383M0632
$$ 454048 473054 494456 509965 537694 560683 577988 608084 665798 716437 753820 794452
11981G94452M4766N1506O8211O0748O5033N8366O8273P9718J12701J30865J32278
$$ 794452 839218 890724 958935 1019683 1084716 1143082 1211355 1291073 1403774 1534639 1666917
11970A666917J45586J57341J71506K32221K65558K96726L37402L97157M64593
$$ 1666917 1812503 1969844 2141350 2373571 2639129 2935855 3273257 3670414 4135007
11961D135007N68406O67511Q18008J056171J330756J700558K219146K939733L982028
$$ 4135007 4703413 5370924 6188932 7245103 8575859 10276417 12495563 15435296 19417324
11952A9417324N425506P354859R632546J1518556J1251051O731226j707000r306404
$$ 19417324 24842830 32197689 41830235 53348791 64599842 71331068 69624068 60317664
11944F0317664j2008236j0892652q576213o414636m697187l481604k607072j968492
$$ 60317664 48309428 37416776 28840563 22425927 17728740 14247136 11640064 9671572
11936I671572j506617j188364r64739p82678o46153n11683m47084l94019l31017
$$ 9671572 8164955 6976591 6011852 5229174 4583021 4071338 3624254 3230235 2899218
11927B899218k74158k24062k04593j92984j52739j40125j36090j20060q6799q3122
$$ 2899218 2625060 2400998 2196405 2003421 1850682 1710557 1574467 1454407 1367608 1284486
11917A284486p0240q1213p7953o5971o6283m9073n7819l9914l7884n1177m4234
$$ 1284486 1214246 1133033 1055080 989109 922826 873753 815934 776020 738136 686959 642725
11906F42725q583J112j7033l5612l6375j4666k7700j8986j6997j4166j9759l0789
$$ 642725 634142 635254 618221 582609 546234 531568 503868 484882 467885 453719 433960 403171
11894D03171k7472q846M283J225p714n75m294l4007k0729l578Q590j9520k4802
$$ 403171 375699 366853 371136 372361 364647 364072 359778 325771 305042 301464 310054 290534 265732
11881B65732j9983j4345j2361n227N128L03n639P334K1530p535j4966j0614k280
$$ 265732 245749 231404 219043 213816 218944 219247 213608 220942 242472 234937 219971 209357 207077
11868B07077j9770J3648O10j8223p317o045q609j0212j6883j4054q352J4758J7564
$$ 207077 187307 200955 201565 183342 176025 169980 161371 151159 134276 120222 111870 126628 144192
11855A44192j420j6462j5008L717J4651o378j2581n803j6475J0570K449J1768
$$ 144192 142772 126310 111302 115019 129670 123292 110711 104908 88433 99003 101452 113220
11843A13220J344L373M953j6012j452P488n936o855P358L878Q377j2137l513P191
$$ 113220 114564 117937 122890 106878 105426 112914 106978 100123 107481 111359 119736 107599 104086 111277
11829A11277j113q315J3006Q480K383r558J3982j6743k630J5503J5603J6894j4936
$$ 111277 110164 101849 114855 123335 125718 116160 130142 113399 110769 126272 141875 158769 143833
11816A43833j6386k2494j3363j3205l964k0319j983O06j0794p108R675n568M670
$$ 143833 127447 104953 91590 78385 74421 54102 52119 52725 41931 34823 44498 38930 43600
11803D3600J0915r46l920q245J3867J0954k6019j0397N111j4585Q984l546o274
$$ 43600 54515 53569 49649 41404 55271 66225 40206 29809 34920 20335 29319 25773 19499
11790A9499k717j327J4246M627J259J2591k3913o960P104j0390j4008N836K2205
$$ 19499 16782 15455 29701 34328 35587 48178 24265 17305 24409 14019 11 5847 28052
11777B8052R215j0698l49Q092n523j5929j4300m128J0559K8591P415q826L035
$$ 28052 37267 26569 26220 34312 28789 12860 -1440 -5568 4991 33582 40997 32171 35206
11764C5206J2583p267J2147K264p820j6745l018K2225j3499r115o999M400p547
$$ 35206 47789 40522 52669 54933 47113 30368 27350 49575 36076 26961 19962 24362 16815
11751A6815K292J3583j2950J1677J416n214J9671P354j6419j1703J3125p251p918
$$ 16815 19107 32690 19740 31417 32833 27619 47290 54644 38225 26522 39647 32396 24478
11738B4478M355r328j0183k3119N187J4944J8233J425J0210J779q176k0705O45
$$ 24478 28833 19505 9322 -13797 -8610 6334 24567 25992 36202 37981 29805 9100 9745
11725I745j1028J2036R601j0123O275R183k47m248K580R703J2039K44o371K066
$$ 9745 -1283 10753 20354 10231 16506 25689 25442 21194 23774 33477 45516 45760 39389 41455
11711D1455j1687k5551j472J5806Q910M467R175O865j8342r048J6113j6243O604
$$ 41455 29768 4217 2745 18551 27461 31928 41103 47968 29626 20578 36691 20448 27052
11698B7052Q48k4907J1629J0662O794l348k587O462k74Q356J2051j1417j8658
$$ 27052 27900 2993 14622 25284 32078 28730 26143 32605 32331 40687 52738 41321 22663
11685B2663K795J2800n556q995O060N452m841n62p866q263J2351N63k3374K257
$$ 22663 25458 38258 32702 23707 29767 35219 30378 29816 21950 13687 26038 26601 3227 5484
11671E484j779M921p817j5116N040P205n341J3763q926O653J0994L535N367j0736
$$ 5484 3705 8626 809 -14307 -9267 -2062 -7403 6360 -2566 4087 15081 18616 23983 13247
11657A3247L332K0081L073j1978j9013j8118k029r78q69L758J9765K4849J8365
$$ 13247 16579 36660 39733 27755 8742 -9376 -11405 -12383 -13252 -9494 10271 35120 53485
11644E3485J2622P453q897j5184k4105k2785l165j5235r77k479M342J3839R989
$$ 53485 66107 73560 64663 49479 25374 2589 -576 -15811 -16788 -19267 -14925 -1086 8903
11631H903r451k321J0753O126j4612k5811j3836O940K1643O141K988N12K679q386
$$ 8903 -548 -2869 7884 14010 -602 -26413 -40249 -33309 -11666 -5525 -2537 -2025 654 -7732
11617g732j229J2684Q918M337j5528J2149J882J4703o087k726r47p427q489L716
$$ -7732 -8961 3723 12641 16978 1450 13599 15481 30184 24097 21371 20424 12997 4508 8224
11603H224J273J6698J42n040j3168N076K985j3345N129j1217K673J2774R433q669
$$ 8224 9497 26195 26337 21297 8129 13205 16190 2845 7974 -3243 -570 12204 21637 12968
11589A2968j0031p117j1099l107K6874P272M44l404k5200m684o80K9439J0718
$$ 12968 2937 -4180 -15279 -18386 8488 15760 16204 12800 -12400 -17084 -17764 11675 22393
11576B2393j4754j7939j682Q278l487M652K456Q929l171L067o720j1378Q829N410
$$ 22393 7639 -10300 -11982 -3704 -7191 -2539 -83 8846 5675 8742 2022 -9356 -527 4883
11562D883p605R037j3961l133L2133O864j9384N056J1499j1536j2730N367n948
$$ 4883 -2722 6315 -7646 -10779 21354 28218 8834 13890 25389 13853 1123 6490 542
11549E42O395r46j057L174l840q090l81n437p286m866K3385P626j3492p03k373
$$ 542 6937 5991 4934 8108 4268 -3822 -4203 -9640 -16926 -21792 1593 9219 -4273 -4976 -7349
11534g349o85l645n20Q815P807N745L121r867l426j4488L455L135R944K8730m467
$$ -7349 -8034 -11679 -12199 -3384 4423 10168 13289 3422 -4 -14492 -11037 -7902 2042 30772 26305
11519B6305K284r34N883m963L016k942j4619J864O202p328k0682p01J1050J1011
$$ 26305 28589 27655 33538 28575 31591 28649 14030 15894 22096 14768 -5914 -6615 4435 15446
11505A5446j3781k1061q243R106J133Q674R787N054J1941o857o528K2451j750
$$ 15446 1665 -19396 -27639 -18533 -17400 -8726 1061 6115 18056 11199 4671 27122 25372
11492B5372p613k664j993m624n97j6127p420L979Q390R047O186m582l391j3622
$$ 25372 17759 15095 13102 8478 7881 -8246 -15666 -11687 -3297 5750 11936 7354 3963 -9659
11478i659j3726j7028L25K1370K8505m388j1128N324L636N775q133q275j7036
$$ -9659 -23385 -40413 -40088 -18718 9787 5399 -5729 -405 3231 9006 873 -7402 -24438
11465b4438L322J2336j4264k224J9169P371k795r759q445J1664J4934m501k1540
$$ -24438 -21116 -8780 -23044 -25268 -6099 1272 -1523 -11282 -19727 -8063 6871 2370 -19170
11452a9170l2292J446J7531j3752K2423K9061r526j236J6671r311j2842Q671j0737
$$ -19170 -51462 -50016 -32485 -46237 -23814 5247 -4279 -5515 11156 1845 -10997 -2326 -13063
11439a3063j859L780j0267J8498J7896j0030p545L301K249n170q847k2K311J1756
$$ -13063 -14922 -11142 -21409 -2911 14985 4955 -2590 711 2960 -2210 -11057 -11079 -8768 2988
11425B988l723o555J5980m165k178M370J2228K190J412P72j6541j9J3601q325
$$ 2988 -735 -7290 8690 4525 2347 6717 18945 21135 22547 23319 6778 6759 20360 12035
11411A2035p045J1073k848k7226m614K0668J9072j4612M535L00o18k0978j5082
$$ 12035 4990 16063 13215 -14011 -18625 2043 21115 6503 11038 11338 10720 -10258 -25340
11398b5340k3162J0625K3592L879M873N080J824k115j1875j039P472k915J92J0369
$$ -25340 -48502 -37877 -14285 -10406 -5533 -453 1371 -744 -12619 -13658 -6186 -9101 -8909 1460
11384A460Q09J0387M826k4179N97n784K629p93m696P000J599r601J7464K617q206
$$ 1460 2269 12656 17482 -6697 -6100 -11884 -9255 -10048 -14744 -7744 -6145 -15746 1718 4335 -3871
11369c871m069l8j416k977R587m600j6990m739J1432K1507J7018j3335j5581m029
$$ -3871 -7940 -7978 -9394 -12371 -2784 -7384 -24374 -29113 -17681 3826 20844 7509 -8072 -12101
11355a2101j9014q467J3853K2706J8694L110k3715O886j687p098P154r82J1105
$$ -12101 -31115 -39582 -25729 -3023 15671 18781 -4934 1952 265 -6833 321 -661 10444
11342A0444J613o052k858J04J5705p284M462J983k2553J322J7100j1113n68L656
$$ 10444 12057 6005 3147 3251 18956 11672 16134 18117 -4436 -3114 13986 2873 2305 5961
11328E961J1765J2771j0682k4242j3760L115j8226O330N536J4361P368J2074p034
$$ 5961 17726 30497 19815 -4427 -18187 -15072 -33298 -26968 -21432 -7071 297 12371 5337
11315E337M539J636j3583n630j583J5025k1261j5691R322N90O237K059N242N23
$$ 5337 9876 11512 -2071 -7701 -9284 5741 -15520 -31211 -21889 -21299 -15062 -13003 -7761 -7238
11301g238l70N258k231J1470k765o285K956l59L464J4151J696n217j216q599J5076
$$ -7238 -7608 -2350 -4581 6889 4124 -2161 795 436 3900 18051 19747 14530 13314 4715 19791
11286A9791J0869j7457l106k6983Q976O332p85k549k49L1659n259k6616j396K4366
$$ 19791 30660 13203 10097 -16886 -7910 -1578 -2363 -4912 -5161 26498 21239 -5377 -6773 17593
11272A7593J2386j0911K168n26J555N731j948o483p168m32J5369J3751Q14j4781
$$ 17593 29979 19068 21236 20710 22265 27996 26048 19565 12397 11965 27334 41085 41899 27118
11258B7118n472J209m341j126j4489P271J6018j5286j1983r769J1400K695r842
$$ 27118 21646 22855 18514 17388 2899 10170 26188 10902 -1081 -10850 550 3245 -6597
11245f597j4616j4699j4376J9386J5974J1951L2988J915j0688m428o35j4915n960
$$ -6597 -21213 -35912 -50288 -30902 -14928 -2977 30011 31926 21238 16810 16175 1260 -4700
11232d700O480M199k6954L080O893k160k692K6972J2517j4782j6239n662j180
$$ -4700 1780 5979 -20975 -17895 -11002 -13162 -15854 11118 23635 8853 -7386 -13048 -14228
11219a4228J958k076j260k0594N43k115O372J6766J5770j0373q505j1397j724
$$ -14228 -12270 -14346 -15606 -36200 -35657 -37772 -31400 -14634 1136 -9237 -17742 -29139 -30863
11206c0863J4694J9749J5689J1478p353J99j2957j5077j5183J893o645J0278J2816
$$ -30863 -16169 3580 19269 30747 23394 23593 10636 -4441 -19624 -17731 -24376 -14098 -1282
11193a282j8943J2018l611O218J950j0510M462J2802j4k0129r032r22q697n158
$$ -1282 -20225 -8207 -11818 -5600 -3650 -14160 -9698 3104 3090 -17039 -26071 -26993 -35690 -40848
11179d0848m117N117O549J5187N453J2625j7040K467J6816P494R729k005k2724
$$ -40848 -44965 -39848 -33299 -18112 -12659 -34 -17074 -14607 2209 9703 19432 17427 -5297
11166e297J861J1363l758k7243j5542J8534Q267P858P909q72j2471r79N311J1230
$$ -5297 -3436 7927 4169 -23074 -38616 -20082 -11815 -3957 3952 3080 -9391 -10370 -5059 6171
11152F171j276m918k3314p500K470J9756M99L266K4023p42j5768j2670j6040q885
$$ 6171 4895 -23 -23337 -30837 -28367 -8611 -8112 -4846 19177 18435 2667 -10003 -26043 -34928
11138c4928O148J2115j1657p151M724K703K3694K2028j3351O238R858J1607j05
$$ -34928 -28780 -16665 -28322 -35473 -30749 -28046 -4352 17676 4325 10563 20421 32028 31923
11125C1923j9374k4815j5015n659L292J2508J6842Q62k1032J10K292K90J9104
$$ 31923 12549 -12266 -27281 -32940 -29648 -17140 -298 564 -20468 -20358 -18066 -17776 1328
11112A328J2864k2510m309M527J8484J8460k0090j7094l226R639J836n326J0210
$$ 1328 14192 -8318 -12627 -8100 10384 28844 8754 -8340 -11566 -1927 -91 -5417 4793
11099D793J6833m150J0415O119k823j6543j0465J3310l451j3577j2587O87J3959
$$ 4793 21626 17476 27891 34010 31187 14644 4179 17489 14038 461 -12126 -11439 2520
11086B520K5805n083j9809J3743J2199k9052l6829p843J4164L170J969O711L271
$$ 2520 28325 23242 3433 17176 29375 323 -36506 -44349 -30185 -27015 -25046 -18335 -15064
11073a5064J8502M958o576j060j24j6348M75Q316O173R029L539j547j4277j3128
$$ -15064 3438 8396 1820 760 636 -15712 -15237 -6921 -748 8281 11820 10273 -4004 -17132
11059a7132R289J1318R706K2117J554j8050J2375n284J61J4270J4139k1394j1657
$$ -17132 -7843 3475 13181 35298 36852 18802 31177 25893 26054 40324 54463 33069 21412
11046B1412J1133J7326J9966L221j1689P926j5599o453K1664l250P5J8502J6247
$$ 21412 32545 49871 69837 73058 61369 69295 53696 47243 68907 65657 65732 84234 100481
11033A00481R086N095J8058m069j4098m696p121J303J5907K0712K0003J168Q927
$$ 100481 109567 114662 132720 128651 114553 109857 102736 104039 119946 140658 160661 161829 170756
11020A70756K9324j636m1033m1862K325k12O63j292q694J0660Q736O25m482R19
$$ 170756 200080 198444 157411 115549 117874 117662 118325 117033 108339 118999 127735 128360 123878 124797
11006A24797k3110k5760j0247o425j3795M982O115Q104J2824P592j1557q274j2434
$$ 124797 101687 75927 65680 59255 45460 50442 56557 64661 77485 85077 73520 65246 52812
10993E2812j4699N836j381k2168l500o762k5609j5069R981J6980K1480r109j4480
$$ 52812 38113 43949 42568 20400 16900 10138 -15471 -30540 -20559 -3579 17901 8792 -5688
10980e688n992o635j679J595K1520m338M023O606j468J9637r001k6216N980l539
$$ -5688 -11680 -18315 -19994 -18399 3121 -1217 2806 9412 7944 27581 18580 -7636 -1656 -5195
10966e195r03O972k398k289m518M515L368J5671P148M419j4267L06k0991r518
$$ -5195 -6098 874 -1524 -3813 -8331 -3816 -448 15223 22371 26790 12523 12829 -8162 -17680
10952a7680J4324J1034n366l661P548m126o012M450J9932J54j6939Q117L689k534
$$ -17680 -3356 7678 2312 -1349 6199 2073 -3939 511 20443 20597 3658 11775 15464 12930
10938A2930R161j3257P5K274m48o976j6197n546K1635J9770j6714j5276n672q645
$$ 12930 22091 8834 8909 11183 10735 3759 -12438 -17984 3651 23421 6707 -8569 -14241 -22886
10924b2886O217n148l614J2577J3233J5254l217P943J9884j56k0266l262k791
$$ -22886 -16669 -21817 -25431 -12854 379 15633 12416 20359 40243 40087 19821 16559 13768
10911A3768K292j0157j3692l92n996Q823J6336p414m601K6351O750M874r643k6089
$$ 13768 16060 5903 -7789 -8181 -14177 -5354 10982 3568 -1033 25318 32068 36942 27299 1210
10897A210k4031j2430q839N681M475L983n053K0108L8895L315p471Q353o447o539
$$ 1210 -22821 -35251 -44090 -38409 -33934 -29951 -35004 -14896 23999 27314 19843 28196 21749 15210
10883A5210r885k5687j5494J7414K2393j0877l01M213N627P778k5855K083M918
$$ 15210 5325 -20362 -35856 -18442 3951 -6926 -7227 -3014 2613 10391 -15464 -13381 -8463
10870h463K497p501j559p168O099J6501M499n621K328o038M614j375J4331j105
$$ -8463 -5966 -13467 -15026 -22194 -16095 406 4905 -716 1612 -4426 188 -1187 13144 12039
10856A2039N620N891l429j6131j8816j7272O019K707l278J5345N029K9257n45
$$ 12039 17659 23550 20121 3990 -14826 -32098 -26079 -23372 -26650 -11305 -6276 22981 22436
10843B2436K946J9591p345j3137m427K5520p115j5809J900j0650r221K631r79
$$ 22436 25382 44973 37628 24491 20064 45584 38469 22660 24560 13910 4689 7320 6341
10830F341J0786M052m214k201o895k643p419J0573m289l275o954O992O858o135
$$ 6341 17127 21179 16965 14764 7869 5226 -2193 8380 4091 816 -6138 854 7712 1577
10816A577n559J2644J0403j0881r087K158k701j1138j124N204p589J1887J5888
$$ 1577 -3982 8662 19065 8184 -903 1255 -1446 -12584 -13708 -8504 -16093 -4206 11682
10803A1682J423j589L043k512J803m510m51k337j0877j2954k561M290p812J4988
$$ 11682 13105 11516 14559 12047 13850 9340 8889 6552 -4325 -17279 -19840 -15550 -23362 -8374
10789h374J2157j501J5924J5829j4268j6351q210J560l678K2345J1969l747J244
$$ -8374 3783 2282 18206 34035 19767 3416 -4794 -3234 -6912 15433 27402 23655 24899
10776B4899r60O976j707O359j6159R446j2521J711L450J4891J0813J2105O84j6321
$$ 24899 23939 30915 29208 35567 19408 28854 16333 18044 21494 36385 47198 59303 59987 43666
10762D3666j2289J1380R674R817l5715k4814P610o795j348J3514K7825R506j3397
$$ 43666 31377 42757 52431 62248 26533 1719 9329 2534 1186 14700 42525 52031 38634
10749C8634m578J948R14J2156o288K825m505j4265J6192l517K604m632o220K3569
$$ 38634 34056 36004 36918 49074 42786 45611 41106 26841 43033 39516 42120 37488 31268 54837
10735E4837R263K1470p318l0806j8583m280J172R39n70o974J6517J6076k582J1808
$$ 54837 64100 85570 78252 47446 28863 24583 25755 26694 26124 19150 35667 51743 49161 60969
10721F0969Q09k4096k512P048J2606Q466K1772j0554J178r838k1770k2101l393
$$ 60969 61778 37682 35170 42218 54824 63290 85062 74508 75686 65848 44078 21977 18584
10708A8584J6300R296o125L088n37r352P787J1982J5303j6105J531P047J0630
$$ 18584 34884 44180 38055 41143 40606 31254 39041 51023 66326 50221 51752 58799 69429
10695F9429j1799p924l250o824m766j4804q498J6538K4543j0848l0449j5130j1935
$$ 69429 57630 49706 46456 39632 34866 20062 11564 28102 52645 41797 11348 -3782 -15717
10682a5717J7305L0825J8571P886J1207L298m626j1183P222K1703N537J2950J3110
$$ -15717 1588 32413 50984 58870 70077 73375 68749 57566 64788 86491 92028 104978 118088
10669A18088m102j7853j9739J2672M541j316J7632Q810K804j999J0505O879J1712
$$ 118088 113986 96133 76394 89066 93607 92291 109923 118733 121537 119538 130043 136922 148634
10656A48634Q612J4803L0514K8303J60J6057J0207K4633R413p972l720K051J2054
$$ 148634 157246 172049 202563 230866 231026 247083 257290 281923 291336 283364 279644 281695 293749
10643B93749k233K0674Q959R345L9742K4101M5724M1955L5217N5179P6346R0629
$$ 293749 291516 312190 321149 330494 370236 394337 440061 482016 517233 572412 648758 739387
10631G39387R6458O8155N5855N2414Q6328J10366J37237J85510K57265L40796
$$ 739387 835845 904000 959855 1012269 1098597 1208963 1346200 1531710 1788975 2129771
10621B129771M78070O40394Q28573J088477J389902J644870J624961J174530M08661
$$ 2129771 2607841 3248235 4076808 5165285 6555187 8200057 9825018 10999548 11408209
10612A1408209k68138n28858m02995m7654M84487J118237J855946K672128L314792
$$ 11408209 11140071 10611213 10208218 10160564 10645051 11763288 13619234 16291362 19606154
10603A9606154L230411J927473j55048j795134k259014j802391r17339R6776J191400
$$ 19606154 22836565 24764038 24608990 22813856 20554842 18752451 17835112 17931888 19123288
10594A9123288K376424L541724M232697L752544J593919j555369l809620m250761
$$ 19123288 21499712 25041436 29274133 33026677 34620596 33065227 29255607 25004846
10586B5004846l474174k322901j154766n5594R28633J775716K211823J736739
$$ 25004846 21530672 19207771 18053005 17997411 18926044 20701760 22913583 24650322
10578B4650322J29392j963653l252103l322455k665358j832934j067892m32158
$$ 24650322 24779714 22816061 19563958 16241503 13576145 11743211 10675319 10243161
10570A0243161O4154M02181N20269K25178m53446j207101j644610j652197j396931
$$ 10243161 10307315 10709496 11229765 11454943 11001497 9794396 8149786 6497589 5100658
10561E100658j091899q21129n82891m44968l33819k49829k17821j79183j22095
$$ 5100658 4008759 3187630 2604739 2159771 1825952 1576123 1358302 1179119 1057024
10552A057024j11860j16552q0127n9272n8037n1702m6544n6352m5083j2733j6553
$$ 1057024 945164 828612 748485 689213 631176 579474 532930 476578 431495 418762 402209
10541D02209l7932k0034j0108j6288k1262j5725k0687k2367j4179L786k5839l1605
$$ 402209 364277 344243 334135 317847 296585 280860 260173 237806 223627 227413 201574 169969
10529A69969o598n431n338m416J4227P897j7191j0721m048m340j9978j6072K9968
$$ 169969 163371 157940 152602 148186 162413 170310 153119 142398 138350 134010 114032 97960 127928
10516A27928R510j965j4013Q47K632j0906j3045J0201O929j4077m763P375K907
$$ 127928 137438 135473 121460 122307 124939 114033 100988 111189 118118 104041 99278 106653 109560
10503A09560J201K197j0709j6426j6294r170J1062J04p516Q482n221O75J0817
$$ 109560 110761 112958 102249 85823 69529 60359 71421 71525 64009 72491 67270 67945 78762
10490G8762L98j2023J967j550n299R531K2456O365l074j6839j7510O410L249k6624
$$ 78762 79160 67137 69104 67554 62255 71786 94242 100607 97533 80694 63184 69594 72843 46219
10476D6219j0657k694K0989J3868J0788q585l786p340P414J8634Q454k617k988
$$ 46219 35562 32868 53857 67725 78513 69928 66142 58802 66216 84850 93304 90687 87699
10463H7699K543m350k1153j1344J4416R248k7430m828j3344j2121p678N180K90
$$ 87699 90242 85892 64739 53395 67811 77059 49629 44801 31457 19336 11658 16838 17128
10450A7128L156R049K101j4713M634M270j6214M626L457L126o716k0774K465J5877
$$ 17128 20284 29333 31434 16721 21355 25625 9411 14037 17494 20620 13904 -6870 -4405 11472
10436A1472K517P310Q128O314j0257k0848r636J8892k571n772O194R047K590m999
$$ 11472 13989 21299 29427 35741 25484 4636 -5000 13892 11321 5549 11743 20790 23380 18381
10422A8381j212K422P821j1559j3132j1121L06j3154j1980L066J8445L4435J5172
$$ 18381 17169 19591 27412 15853 2721 -8400 -8094 -21248 -33228 -30162 -11717 22718 37890
10409C7890J1817R865q946k8856n142L279K351J3275K2546j2983q090j0738p8
$$ 37890 49707 59572 50626 21770 16628 19907 22258 35533 58079 45096 37006 26268 26190
10396B6190N059n170j0972K788J6574l135O904k9694L806J0696K6326M743J570
$$ 26190 31249 26079 15107 17895 34469 31334 38238 8544 12350 23046 49372 54115 55685
10383E5685j2076l483o056q01P751J070j8954j5720k860N289J0200Q610k255j0917
$$ 55685 43609 40126 34070 33269 41020 42090 23136 7416 4556 9845 20045 28655 26400 15483
10369A5483P37J1272l927k7276l594J579J009m017K586q80r273j4328J0921L1531
$$ 15483 16220 27492 23565 -3711 -7305 -5726 -4717 -8734 -6148 -7028 -16301 -30629 -19708 11823
10355A1823J5194k826J2732j7770j3970J344j0104l2209J6008P873J843j4141
$$ 11823 27017 24191 36923 19153 5183 6527 -3577 -35786 -19778 -11905 -10062 -24203
10343b4203K1341O517j9883j7531J8940L9364J1595J694n520j2107r079P835M711
$$ -24203 -2862 3655 -16228 -33759 -14819 24545 36140 37834 32314 20207 11128 18963 23674
10330B3674L251l401p832p795N058j090j3386j8249k7351J8834K4758R780L901
$$ 23674 26925 23524 15692 7897 12955 11865 -1521 -19770 -47121 -28287 -3529 6251 10152
10317A0152Q716n010P85P576J56O070K387m377k9449k851M56j936J2043k509J658
$$ 10152 18868 13858 14643 22219 22375 28445 30832 26455 -2994 -5845 -5389 -7325 4718 2209 3867
10302C867J8949J2575j6590l608k0191K192M886J3986K5127P870k3444o208l154
$$ 3867 22816 35391 18801 15193 -4998 -2806 2080 16066 41193 49063 25619 19411 16257
10289A6257j0728l037O938J2714P575j1574k1365r625k7523O100L0771J5541l978
$$ 16257 5529 2492 9430 22144 29719 18145 -3220 -12845 -40368 -34268 -3497 12044 8066
10276H066J4436j440q140l257J4441J1228r735k1620M881R648q532j9101J4978
$$ 8066 22502 21062 12922 9665 24106 35334 25599 3979 8860 18508 9976 -9125 5853
10263E853r266k424N247M772q832J3825n107o586k7357j5355J4436R653j2123
$$ 5853 -3413 -5837 -590 4182 -4650 9175 4068 -2518 -29875 -45230 -30794 -21141 -33264
10250c3264R300M422J3367l557n843j816o910p177k0618K1969J2494Q941K3905
$$ -33264 -23964 -19542 -6175 -9732 -15575 -17391 -24301 -31478 -52096 -30127 -17633 -8692 15213
10237A5213K976o124Q508n479K7j0108M331j3022L211m164k0N502J8874Q29j183
$$ 15213 18189 12065 20573 15094 15121 5013 9344 -3678 -467 -4631 -4651 851 19725 20554 19371
10222A9371J4441K2989j2399k3217L39p311q161j336Q836R016j660j1016j0671
$$ 19371 33812 56801 44402 21185 21524 14213 6052 4716 13552 22568 20908 9892 -779
10209g79K492J179Q373J5883R18k1584J575l509P332l351j6576Q080l183o739
$$ -779 1713 2892 11265 27148 28066 6482 8057 4548 11880 8529 -8047 33 -3150 -9889
10195i889O694k669L425J8489J3159n662m133j991M922k367j3149L98J5966K9005
$$ -9889 -3195 -5864 -2439 16050 29209 23547 19414 17423 22345 19978 6829 7227 23193 52198
10181E2198J1937j3384L145J3239j1581n707N138K0862M091k4926j3373R16J5290
$$ 52198 64135 50751 53896 67135 55554 49847 54985 75847 79938 55012 41639 42555 57845
10168E7845K9713J1972J1320K0129k614k1045j1892M45K2521k473O944K2256J5088
$$ 57845 87558 99530 110850 130979 128365 107320 95428 95873 118394 115921 122865 145121 160209
10155A60209K7778Q422p811k3868j5789J1694k1537m0086j1548J1598J6210J8926
$$ 160209 187987 196409 188598 164730 148941 160635 139098 99012 87464 99062 115272 134198
10143A34198R255J6834k906r214l3806l9557k3559j5847j219j405P930J235R471
$$ 134198 143453 160287 157381 148167 114361 74804 51245 35398 34179 32774 40704 41939 51410
10130E1410k767j0275K4964l617j1736j2677j0285j830l439N116K99j5645j1331
$$ 51410 48643 38368 63332 59715 47979 35302 25017 23187 19748 24864 25163 9518 -1813
10117a813j8483M602N717M545M17p676K09J0621J881J1934K2203K250m118k0907
$$ -1813 -20296 -15694 -9977 -5432 -5015 -12691 -12482 -1861 20 11954 34157 36407 32289 11382
10103A1382j4905p218o366j0680K30j903l785k17J8840l465r146J741p046K713
$$ 11382 -3523 -10741 -17107 -27787 -27557 -29460 -33245 -33462 -14622 -18087 -27233 -25492 -32538 -29825
10089b9825J5382N840R674K579M314N160o002j997k1807k769K1999J6527p69q820
$$ -29825 -14443 -8603 1071 3650 7964 13124 7122 5125 -16682 -19451 2548 19075 18306 9486
10075I486k524R151j8056n784Q339N666L990J6281j522L010j5505q017m160O379
$$ 9486 6962 16113 -1943 -7727 612 6278 10268 26549 25027 28037 12532 4515 355 6734
10061F734r854j075R925p837p068q683p337P866K3491J0833L538j5452K941P698
$$ 6734 -3120 -4195 5730 -2107 -9175 -17858 -25195 -17329 6162 16995 20533 5081 8022 15720
10047A5720j362k4932j6246J6161K8564P26O77J768N720j4782j7544k1827N969
$$ 15720 14358 -10574 -26820 -10659 17905 18631 19308 21076 26796 12014 -5530 -27357 -21388
10034b1388O703M428o487q546l420J2496j2774k255O614J1441O106o202K037P161
$$ -21388 -14685 -10257 -16744 -25290 -28710 -16214 -28988 -31243 -24629 -13188 -7082 -13284 -11247 -4086
10020d086j580j1683o150j0779n201L58k674M449M764m165k628K5867Q810J6581
$$ -4086 -5666 -17349 -23499 -34278 -39479 -39121 -41795 -37346 -32582 -36747 -39375 -13508 -4698 11883
10006A1883J4533k1946j5753k445O214P814k2668o626O36J7723n159l157m486
$$ 11883 26416 4470 -11283 -13728 -7514 300 -22368 -28994 -28358 -10635 -15794 -18951 -23437
9993b3437N757O035k701P771j0355k2343m848N309L816o895j1814R867L3271p278
$$ -23437 -17680 -11645 -14346 -6575 -16930 -39273 -44121 -38812 -34996 -41891 -53705 -43838 -10567 -17845
9979a7845j0529O587R78j1921j5319k663J1575M743Q170K3286l751o512P268l38
$$ -17845 -28374 -21787 -20809 -32730 -48049 -50712 -39137 -34394 -26224 -2938 -6689 -13201 -5933 -6271
9965f271J342j6162J3940L521O059J2217J782P275j0487j2257j2956p58p557Q377
$$ -6271 -4929 -21091 -7151 -3630 2429 14646 16428 23703 13216 959 -11997 -12755 -20312 -11935
9951a1935J6596j3566j1640J0146K710j63K196l37Q915J9057R78k1091P550K4677
$$ -11935 4661 -8905 -20545 -10399 -7689 -7852 -5656 -5993 2922 21979 22957 1866 9416 34093
9937C4093j4259q695m386j2146p076j4442j579R875K2745J0814J5234Q485m023
$$ 34093 19834 11139 6753 -5393 -12469 -26911 -28490 -18615 4130 14944 30178 38663 34640
9924C4640j9566l795j652m272P759J2417o553j9512N701K922k4316q971l422o393
$$ 34640 15074 11279 9627 5355 13114 25531 18978 -534 5167 8089 -16227 -25198 -28620 -35013
9910c5013J5845J4518l282J1298M465o754R0n802k876o464j8390K907J2139j1799
$$ -35013 -19168 -4650 -7932 3366 7831 1077 1167 -4635 -7511 -13975 -32365 -29458 -17319 -29118
9896b9118l896J870K5046K39l482l987K336R062J9075r553r075M745o415j1739
$$ -29118 -33014 -31144 -6098 -5859 -9341 -13328 -10992 -1930 17145 7592 -1483 3262 -3153 -14892
9882a4892j701j866J202k509J2306K392K14j785Q925k372P52o053J9630R524R180
$$ -14892 -16593 -18459 -17257 -19766 -7460 -5068 -4854 -6639 2286 -86 666 -5387 14243 23767 32947
9867C2947j3595R208n86p63R590j3600j5820J3493J961j6905J299M54K950o459
$$ 32947 19352 28560 27974 27211 36801 23201 7381 20874 22835 5930 7229 7683 10633 4174
9853D174q578r668Q82J0523q476j1869J3434n710l481k423J8162J0100l70N401
$$ 4174 -4404 -14072 -13190 -2667 -11143 -23012 -9578 -15288 -18769 -21192 -3030 7070 6700 12101
9839A2101J5105J61j6861j3037j7264J578p95K2273q990j8324m580J9523R570
$$ 12101 27206 27367 10506 -2531 -19795 -18217 -19012 3261 -5729 -24053 -28633 -9110 460
9826D60M434k6236j6410J5454J1747Q288j5240o237K0478J5104J0061J4408J4637
$$ 460 4894 -21342 -37752 -22298 -10551 -2263 -17503 -23740 -3262 11842 21903 36311 50948
9813E0948k6369j9337j6549K5602K2016j2874n825J6581Q157L062L8n313J3571
$$ 50948 24579 5242 -11307 14295 36311 23437 17612 34193 42350 45412 45450 40137 53708
9800E3708Q269J7424P35m165J5401k874P758J5716K0256P219J1414J2663J2151
$$ 53708 61977 79401 80136 75971 91372 88498 96256 111972 132228 139447 150861 163524 175675
9787A75675J2657K7514M5688Q3209R9751J61487K47345L55824O20736J122352
$$ 175675 188332 215846 261534 344743 444494 605981 853326 1209150 1829886 2952238
9777B952238J723073J937891J040375p19599j915026j838110j169260o79476m03541
$$ 2952238 4675311 6613202 7653577 6933978 5018952 3180842 2011582 1332106 928565
9768I28565k50025j48170j12270j00782n5552k6285j7967l1267k4667j6428j0427
$$ 928565 678540 530370 418100 317318 261766 235481 217514 186247 161580 145152 134725
9757A34725j1586n40m824j3216k770j3693j5193m634J3613k2831k9867j5046J587
$$ 134725 123139 122599 117775 104559 101789 88096 72903 68269 81882 59051 29184 14138 15725
9744A5725J3145J073J1040j7200m123p353m798O231J2226Q067k1673p975n504
$$ 15725 28870 29943 40983 23783 19660 12307 7509 13740 25966 34033 12360 4385 -1119
9731a119l858j4618l471k85Q783L4867J1465r604p857l496j1676P493P244j8319
$$ -1119 -4977 -19595 -23066 -23351 -14568 20299 31764 22160 14303 10807 -869 6624 13868 -4451
9717d451j6698J4042J9340J2480J6734m443k8806j5594q522j2722K2374J3126
$$ -4451 -21149 -7107 12233 24713 41447 37004 8198 -7396 -15918 -28640 -6266 6860
9705F860J5448J445k1430j9122m2j7157J1255j01J3680Q068R918K2440J656r035
$$ 6860 22308 23753 2323 -16799 -16841 -33998 -22743 -22844 -9164 -1096 8822 31262 32918 23883
9691B3883J433n988l012J103m017p963j0249N5r85m608O179R630J70j4495q011
$$ 23883 25316 19328 16316 17419 13402 5439 -4810 -4755 -5740 -10348 -4169 5461 5631 -8864 -16875
9676a6875J2076p130J826J7407J175o040o11q618J2395R139M354R905j3569J582
$$ -16875 -4799 -11929 -10103 7304 8479 2439 1828 -6790 5605 14744 19098 29003 15434 17016
9662A7016n571J9056K470k5452M266n118r168O267o672L68M466K464J3270r938
$$ 17016 11445 30501 32971 7519 11785 6667 -2501 3766 -2906 -2538 1928 4392 17662 7724
9648G724O432J1018N532P5j5053L584J3985p843l1280R90K64j1919J8589Q912
$$ 7724 14156 25174 30706 30781 15728 19312 33297 25454 -5826 -4836 -4572 -16491 2098 11010
9634A1010P476o061Q828P139k3131j9617j4674L406j880N800J2958J8612K905
$$ 11010 18486 12425 21253 28392 5261 -14356 -29030 -25624 -27504 -21704 -8746 9866 12771
9621A2771p0J4158p405r796P660J340q954P29J33P7O838r083P486k77j0473j4004
$$ 12771 12701 26859 19454 9658 17318 18658 9704 10433 10566 10643 17481 8398 15884 15607 5134 -8870
9605h870j1815L905o984j2824l795K6859J5128J4575K3464N136j5329j4898j0834
$$ -8870 -20685 -16780 -23764 -36588 -40383 -13524 1604 16179 39643 44779 29450 14552 3718
9592C718k737k2091M920J2540K2502Q490L309k108m499j0933K528o589l180J1689
$$ 3718 981 -21110 -16190 -3650 18852 27342 30651 28543 24044 13111 15639 9050 5870 17559
9578A7559J888j3657o548j365L800j1481N494J0071n627j7154K635J8791P504
$$ 17559 19447 5790 -758 -2123 1677 -9804 -4310 5761 134 -17020 -14385 4406 11910
9565A1910n558J818j1311K901k596N320K453k490J116l357j9052k622K7398J4727
$$ 11910 6352 8170 -3141 -240 -2836 2484 4937 2447 3563 206 -18846 -21468 5930 20657
9551B0657j3451j4528l761j9066N216J8230m188J2592L591K096J3740J1754k52
$$ 20657 7206 -7322 -11083 -30149 -24933 -6703 -10891 1701 5292 7388 21128 32882 32630
9538C2630j3670n113j2240J4035P685L98m246j6463j0908O462J1109l543j4582
$$ 32630 18960 13847 1607 15642 23327 23725 19479 3016 -7892 -1430 9679 6136 -8446
9525h446J6184J3871j5676n046R545q76p998j979k4866j1465J2892o124J5935
$$ -8446 7738 21609 5933 887 10432 9556 1558 -421 -25287 -36752 -23860 -29984 -14049
9512a4049K605o755J4774J709j4733K178p54J5391L53O493j0902q252P972J389
$$ -14049 -11444 -18199 -3425 -1716 -16449 -14271 -15025 366 719 7212 -3690 -11942 -3970 -2581
9498b581l461q560j4469k426J3952N722N564J9q31j279K446N769k2604J127K332
$$ -2581 -6042 -14602 -29071 -31497 -17545 -11823 -6259 -6240 -7071 -8350 -5904 -135 -22739 -21612 -19280
9483a9280m807j162M332J1043r837r454Q826K7309J7916L624J506l992J0472r488
$$ -19280 -24087 -25249 -20917 -9874 -19711 -29165 -20339 6970 24886 28510 30016 26024 36496 27008
9469B7008j0845j0066l398R303l1413j4471j4891J158K0540j891J2009K524J0998
$$ 27008 16163 6097 2699 12002 -19411 -33882 -48773 -47615 -27075 -28966 -16957 -14433 -3435
9456c435J84k7377k3054J0178J1442J7097P817j3249M092l558j3070R364P807
$$ -3435 -3251 -30628 -53682 -43504 -32062 -14965 -7148 -20397 -16305 -19863 -32933 -23569 -15762
9443a5762K5052J5079j5787k1885j3144p723J335J5628k120J4985J2657p494q854
$$ -15762 9290 24369 8582 -13303 -26447 -34170 -32835 -17207 -19327 -4342 8315 821 -8033
9430h033J327j90J475l871Q541Q65r731N13J2092L933Q140m420o965o790J0078
$$ -8033 -6706 -6896 -5421 -9292 -751 114 -9617 -9104 2988 6921 15061 10641 3676 -3114 6964
9415F964j8357j0312J2843j3270j2989l876J1920J2669m96L405L1714j0202j7721
$$ 6964 -11393 -21705 -8862 -22132 -35121 -38997 -27077 -14408 -14904 -11499 20215 10013 -7708
9402g708j021J0185n897l781J7885K123j1122M273J1054K104K592M180j0411q676
$$ -7708 -8729 1456 -4441 -8222 9663 11786 664 4937 15991 18095 20687 24867 14456 5780
9388E780j972j1951l540K4998K8064j3196l1392j175j010q981J5209J6514l841
$$ 5780 3808 -8143 -11683 13315 41379 28183 -3209 -4384 -5394 -14375 834 17348 13507
9375A3507r956k2003j6472J629J3546l507j5606J8900J4623K1604K1655m55k585
$$ 13507 3551 -18452 -34924 -33295 -19749 -23256 -38862 -19962 -5339 16265 37920 37465 34880
9362C4880m152k5267m172j9385k6971K342O743J1441J8925p34j3808q067p68J051
$$ 34880 30728 5461 1289 -18096 -45067 -42725 -35982 -24541 -5616 -6350 -20158 -28225 -28993 -27942
9348b7942O089K0536K8561J1548k0679j2024K901j4262K55J769j1169k486k194
$$ -27942 -21853 -1317 27244 38792 18113 6089 8990 -5272 -5017 -3248 -14417 -16903 -19097
9335a9097m755p563O614L633M042m502l144K453o72O196K2594o371j9825p623
$$ -19097 -23852 -31415 -24801 -21168 -17126 -21628 -24772 -22319 -22991 -16795 5799 -572 -20397 -28020
9321b8020O435k021J954J9494R077J0185j8888j2697q4J35K957N482P97j9652
$$ -28020 -21585 -23606 -21652 -2158 6919 17104 -1784 -14481 -14565 -14430 -11473 -5991 -5194 -24846
9307b4846j2256K3450n925o798Q101J6427K291k873J535o441o40O155o30n11K207
$$ -24846 -37102 -13652 -19577 -26375 -18274 -1847 444 -2429 -894 -7335 -7975 -1820 -2450 -2961 -754
9292g54J414r575J0177j5566M245n996j3438Q448P121L20M326j0997j146K3334
$$ -754 660 -8915 1262 -14304 -10059 -16055 -29493 -21045 -13924 -13604 -9278 -20275 -21421 1913
9278A913J2724P02J4864J3115o571j5070j4627q268p716l494q129O047K835k437
$$ 1913 14637 15339 30203 43318 36747 21677 7050 -1218 -8934 -12428 -20557 -14510 -11675 -14112
9264a4112M817N940N179N947J499k6104k0341P189K2771j1677r637P186J8584
$$ -14112 -9295 -3355 1824 7771 9270 -16834 -37175 -29986 -7215 -18892 -28529 -21343 -2759
9251b759J1103q258j355r59j554L418j950j3873J1612k780N284P47k574r128j227
$$ -2759 8344 86 -1269 -2228 -3782 -364 -2314 -16187 -4575 -7355 -2071 -1324 -3898 -13026 -14253
9236a4253k420k275P954K935M693J6319m982k3242r514l893M767R693J3971O035
$$ -14253 -16673 -18948 -10994 -8059 -3366 12953 7971 -15271 -24785 -28678 -23911 -14218 -247 5788
9222E788K624j230j7127J2000P964j107r865j135J8314k019j5068L004o551r698
$$ 5788 8412 7182 -9945 2055 10019 8912 -953 -2088 16226 14207 -861 2143 -4408 -14106
9208a4106l006M161J9242j3763j6339J369K2973J2925j2853k70Q913j9472l528
$$ -14106 -17112 -12951 6291 -7472 -23811 -22442 531 13456 603 333 9246 -10226 -13754
9195a3754m753j319r249o672K0504L0192n546j5296N17j30j0623N374O267M70
$$ -13754 -18507 -19826 -29075 -35747 -15243 14949 9403 -5893 -5376 -5506 -16129 -10755 -4488 -4018
9181d018K843L929j3174j1015R341p68o981l442m212Q025J5796N210J573O792
$$ -4018 -1175 2754 -10420 -21435 -12094 -12862 -19843 -23285 -27497 -19472 -3676 1534 3107 9899
9167I899K2142j6921k1546r421j1190L967O693l437j416K3888J2071o684j1752
$$ 9899 32041 15120 -6426 -15847 -27037 -23070 -16377 -19814 -21230 2658 14729 8045 -3707
9154c707J4464J7422k0110j3546O509N494N947q181j0936o943M075j950O74m119
$$ -3707 10757 28179 8069 -5477 1032 6526 12473 4292 -6644 -13587 -9512 -11462 -10788 -14907
9140a4907l215p239n191L121J1769N735J2073p440L89j3283k2125K309O024M076
$$ -14907 -18122 -25361 -30552 -27431 -15662 -9927 2146 -5294 -4905 -18188 -40313 -38004 -31980 -27904
9126b7904J8920K1431Q128n642K513K462N810p642l233l421J1395j1289q072J8152
$$ -27904 -8984 12447 20575 14933 17446 19908 25718 18076 14843 11422 22817 11528 3456 21608
9112B1608J5376k363j4584k2776j2957J153P343O555j7483k0184k2164m622J1351
$$ 21608 36984 34621 20037 -2739 -15696 -14543 -7200 -645 -18128 -38312 -60476 -65098 -53747
9099e3747J4510P629k176J7651K2735K0585k931j0494j7081J1120n970k657k773
$$ -53747 -39237 -31608 -33784 -16133 6602 27187 24256 13762 -3319 7801 1831 -826 -3599
9086c599N354j3714J4943j828K921M335j3475J606n327o172O115O207K80J0806
$$ -3599 1755 -11959 2984 1156 4077 8412 -5063 -3457 -8784 -14956 -8841 -2634 -2354 8452
9072H452J5738P377j3985m028J1090j5602j8253J4394J5455q921k1587n481L196
$$ 8452 24190 31567 17582 13554 24644 9042 -9211 5183 20638 11717 -9870 -15351 -12155
9059a2155K169J0929J3197N5k139m622J888N523P206j117j1621N922j8006J797
$$ -12155 -9986 943 14140 14195 12056 7434 9322 14845 22051 20934 9313 15235 -2771 -974
9045i74J172j2895j429K480r990n704J1157O931P245L164o249P16j002k117l150
$$ -974 198 -12697 -14126 -11646 -21636 -27340 -16183 -9252 -2007 1157 -5092 -4376 -5378 -7495 -10645
9030a0645j477L469L96J9141m41j6368J1443j1138p734J10j262P04k897q049M744
$$ -10645 -12122 -8653 -8257 10884 10443 -5925 5518 -5620 -13354 -13244 -14506 -13802 -16699 -24748 -20004
9015b0004J2341J6999J576m1963j4455R929r75r014k837R149J7632K6822Q981
$$ -20004 -7663 9336 10912 -31051 -45506 -35577 -36552 -45566 -48403 -39254 -21622 5200 14181
9002A4181o730j5741m84j2292j1122L318J4106N657j4841J1984Q124n119J97M534
$$ 14181 7451 -8290 -8774 -21066 -32188 -28870 -14764 -9107 -23948 -11964 -3840 -8959 -8762 -4228
8988d228j9772K428J4927K7088L628j9727j6863M980K2528o284k4554K045J131
$$ -4228 -24000 -21572 -6645 20443 24071 4344 -12519 -7539 14989 8705 -15849 -13804 -12673
8975a2673J1165j1622r885R120q60J8575J1240k712j5766m993Q362L071o478l1191
$$ -12673 -1508 -13130 -23015 -13895 -14755 3820 15060 12348 -3418 -8411 -49 3022 -3456 -34647
8961c4647j9409J1761J8059k1703l175J432N051K5731P274k93J6674P699J234
$$ -34647 -54056 -42295 -24236 -45939 -49114 -47682 -42631 -16900 -9626 -9919 6755 14454 15688
8948A5688N585j4207r942M475K7k075m068J3603J4261j355j5798m578L026m406
$$ 15688 21273 7066 -2876 1599 1626 -449 -4517 9086 23347 21992 6194 1616 4642 236
8934B36p887n422q992J5017N638j5218j5032J230J8317n08P035N618j798M526
$$ 236 -7651 -13073 -22065 -7048 -1410 -16628 -31660 -30430 -12113 -12621 -5586 32 -1766 2760
8920B760J268r139m058r622J0431J3712r00M776o67O696j50q923j8918K328J1889
$$ 2760 4028 -5111 -9169 -18791 -8360 5352 4452 9228 8561 15257 15107 6184 -12734 -10406 1483
8905A483j15K1828J3338j5277J1680R85j2204O486M889l834o210k1295n699m310
$$ 1483 1368 23196 36534 21257 32937 33922 21718 28204 33093 29259 23049 1754 -3945 -8255
8891h255l157J703p469j166Q570K50J2268j016J0047R044J839J829l1048k2691
$$ -8255 -11412 -9709 -17178 -18344 -9774 -9524 2744 1728 11775 20819 22658 24487 -6561 -29252
8877b9252J7826K0231O347q520j387n893J3802l548k6165p54J3048K088N299R827
$$ -29252 -11426 8805 15152 6632 5245 -648 13154 9606 -16559 -17313 -4265 -2177 3122 12949
8863A2949r992j8253j0894j733O778P389K0254K510m243k1302j4627P454K045
$$ 12949 2957 -15296 -26190 -27923 -21145 -13756 6498 9008 4765 -16537 -31164 -23710 -21665
8850b1665J974o71N624J3225R248J1170j2569n8J0781j141j5207j0408J631J3194
$$ -21665 -19691 -20362 -14738 -1513 7735 18905 6336 6278 17059 15918 711 -9697 -8066 5128
8836E128r602p839K688J5307l112j8995j0921j734K1513K7288o603j2529J1659
$$ 5128 -4474 -12313 -9625 5682 2570 -16425 -27346 -29080 -7567 19721 13118 589 12248
8823A2248n288q456l016M167J2902k0524O685q882j3775J047k951J8235J6577
$$ 12248 6960 -1496 -4512 -345 12557 -7967 -1282 -10164 -23939 -22892 -25843 -7608 8969
8810H969j313m726j912j479J7010J566j8271j8726j271N532J3125J835j5083j7975
$$ 8969 7656 2930 1018 -461 16549 18115 -156 -18882 -20153 -14621 -1496 339 -14744 -32719
8796c2719n985R599J820K5527K1831R235k0083q771M727r860p09M918j5053j5012
$$ -32719 -38704 -29105 -27285 -1758 20073 29308 9225 454 5181 -4679 -5388 -470 -15523 -30535
8782c0535N985J1582M315M298m09J7727k857l3299q994K0548P875J3964P777j5987
$$ -30535 -24550 -12968 -8653 -4355 -4764 12963 10106 -23193 -32187 -11639 -3764 10200 17977 1990
8768A990j5544K179O277j40J200K323J017O768o492R821N53k1431j3836J200K6828
$$ 1990 -13554 -11375 -5098 -5238 -4038 -1715 -698 6070 -422 9399 9952 -11479 -25315 -24115 2713
8753B713J6301k4059k2994M924K916l724R752P376J7597j9791J073n656k597k65
$$ 2713 19014 -5045 -28039 -23115 -20199 -23923 -14171 -6795 10802 -8989 -7916 -13572 -16169 -16434
8739a6434J457j4408J87J8173J6868p675m256m107N184Q712K0460Q571k3193l3862
$$ -16434 -14977 -29385 -29198 -11025 5843 -1832 -6088 -10195 -5011 3701 24161 32732 9539 -24323
8725b4323r289R613k231o06Q771k7000L150K3887P789j93j0370j7096J8138L3784
$$ -24323 -33612 -23999 -26230 -26836 -18065 -45065 -41915 -18028 -10239 -10432 -20802 -37898 -19760 14024
8711A4024J0963j5620k1762m132r671J6232J6601j3772q157J1323j666q266R619
$$ 14024 24987 9367 -12395 -16527 -26198 -9966 6635 -7137 -15294 -3971 -5637 -13903 -4284
8698d284P028J7883j4730P141J719J4037q003k7285k9752j5573J8847J4768P30
$$ -4284 2744 20627 5897 13038 14757 28794 20791 -6494 -36246 -51819 -32972 -18204 -17474
8685a7474k1844k4584J4610L0816K2954M088P540K123k7739k5721m418N026R839
$$ -17474 -39318 -63902 -49292 -18476 4478 8566 16106 18229 -9510 -35231 -39649 -34623 -24784
8672b4784j5882q92l143J7875J5685O684p426j182k855k1417j2182O367Q586L543
$$ -24784 -40666 -41558 -44701 -26826 -11141 -4457 -11883 -13065 -15920 -37337 -49519 -43152 -34566 -31023
8658c1023R66J8891K9625l883l012K098J944j1811P141K626j8073k2107J818m133
$$ -31023 -30057 -11166 18459 14576 11564 13662 15606 3795 10936 13562 -4511 -26618 -24800 -28933
8644b8933J2720R287J0416R075J232j2765J1922q841o071J341K096L573q463Q577
$$ -28933 -16213 -6926 3490 12565 13797 1032 12954 4113 -1958 -617 1479 5052 -3411 5166
8630E166m799j5864k077J3439J7235o784k446O031J1253j116k695j0257Q068l529
$$ 5166 367 -15497 -17574 -4135 13100 6316 3870 9901 21154 20038 17343 7086 15154 11625
8616A1625o243l752j4632K956Q461m605M669J1406L011P11n986Q785k481p224
$$ 11625 5382 1630 -13002 -10046 -1585 -6190 -1521 9885 12896 13607 7621 16406 13925 6701
8602F701l382J0519P91k2168N740R924J1140Q254k0024j0860J7886o305o910l040
$$ 6701 3319 13838 14629 -7539 -1799 8125 19265 27519 7495 -3365 14521 8216 1306 -1734
8588a734j3378K1054l651M435K8121J0010p115J1614K3975n035j1834j0723K202
$$ -1734 -15112 5942 2291 6726 34847 44857 37742 49356 73331 68296 56462 45739 47941
8575D7941m648N640j2605k2243M09Q047r964j6339j0337J8818J6747j974J259
$$ 47941 43293 48933 36328 14085 14494 22541 12577 -3762 -14099 4719 21466 19492 20751
8562B0751J8136j008q670j3876o910r057Q44L724j154P585J667K208j6040m158
$$ 20751 38887 37879 29209 15333 8423 -634 210 3934 2780 10365 12032 14240 -1800 -5958
8548e958n485N260J4645N483j0213R229M1191K5585r795r233J5873k768K0996
$$ -5958 -11443 -6183 8462 13945 3732 12961 54152 79737 69942 60709 76582 73814 94810
8535I4810J9687M4719N6937Q8150J72646K72633M53099N40740K70840l18509n57832
$$ 94810 114497 159216 216153 304303 476949 749582 1202681 1743421 2014261 1695752 1137920
8524A137920m12324k42938j47223r2229n1438k2382m0191k4521k4958O58R258
$$ 1137920 725596 482658 335435 243206 191768 169386 129195 104674 79716 80374 89632
8513H9632M926k0931o865q898l945l806l048Q086L374m755p563J5956o43k75J6486
$$ 89632 94558 73627 66762 57864 53919 50113 47065 55151 58525 53770 46207 62163 61520 61245 77731
8498G7731L4649J0217N180J1078J4111K9602J9482L1862O4455O9072R0920J62214
$$ 77731 112380 122597 127777 138855 152966 182568 202050 233912 298367 367439 458359 620573
8486F20573K99538N47301Q97415J094712O58544n86485j183959q92428n09161
$$ 620573 920111 1467412 2364827 3459539 4118083 3531598 2347639 1455211 946050
8477I46050k69412j69170j24733r1885o9031m8488k5014j9866j9192n281m385
$$ 946050 676638 507468 382735 290850 221819 173331 148317 128451 109259 103978 99593
8466I9593j0854k3948m720n891q860q43l100J363j6731K195K3842J4806L983N507
$$ 99593 88739 64791 60071 54180 45320 44477 41377 42740 26009 28204 52046 66852 70835 76342
8452G6342L948j4109N225O872K552L2955J5513P250L6705O0895R2343J35691K43077
$$ 76342 80290 66181 71406 78278 80830 113785 129298 136548 173253 234148 326491 462182 705259
8439G05259M21678N20884L26588k10303n51367m57407k67378j38551q2366n5130
$$ 705259 1126937 1647821 1974409 1764106 1212739 755332 487954 349403 267037 211907
8429B11907l5305l8847m5106l2791k1645J90P543J1941l437n679m052q916j770
$$ 211907 176602 137755 92649 59858 38213 38403 45946 57887 54450 48771 44719 35803 34033
8416C4033J2343L708k2599j4132N84n907J996j5258K461J6244P70j7307j4761
$$ 34033 46376 50084 27485 13353 13937 8030 10026 -5232 -2771 13473 14243 -3064 -17825
8403a7825J1836J3094J422J792l328j5840J868Q477O544J7485j2870j197K1080
$$ -17825 -5989 7105 8527 10319 6991 -8849 -6981 1496 8040 25525 12655 11458 32538
8390C2538J8995L473k7750j9009J5339N090l280j8132k217q515J3401K0007q78
$$ 32538 51533 55006 27256 8247 23586 28676 25396 7264 5047 -3468 9933 29940 29062
8377B9062k7030n945Q549p900r456J6770j6966k0J0112J6805P585j566k6764j8807
$$ 29062 2032 -3913 4636 -3264 -12720 4050 -12916 -12936 -2824 13981 21566 20000 -6764 -25571
8363b5571k1664R348J4959j703J8834Q547j3986k646m767n856O505l591l68N026
$$ -25571 -47235 -37887 -22928 -24631 -5797 2750 -11236 -13882 -18649 -24505 -18000 -21591 -21959 -16933
8349a6933O100j191k7315q937K7973K8563P674M968J615j4506p024J3672k0439
$$ -16933 -10833 -12024 -39339 -48276 -20303 8260 15934 20902 22517 8011 987 14659 -5780
8336e780k1342J4865J8780q02j0186k6917j591O558L9251O278l0655j1635K0591
$$ -5780 -27122 -12257 6523 5721 -4465 -31382 -32973 -26415 12836 19114 -11541 -23176 -2585
8323b585l673o026n145J0439N583J1606J729k2292J551L231N109M785l876n56
$$ -2585 -6258 -12284 -17429 -6990 -1407 10199 11928 -10364 -8813 -5582 -473 4312 436 -120
8309a20K312k0753n405r674k951O870J3746J6294o179j1144R975P115K195j0355
$$ -120 2192 -18561 -23966 -33640 -36591 -29721 -15975 319 -5860 -17004 -7029 86 2281 -8074
8295h074j4157j3669J4751K971l420R539M549k4003j3757L2572N567p418n766
$$ -8074 -22231 -35900 -21149 -18178 -21598 -12059 -7510 -31513 -45270 -12698 -7131 -14549 -20315
8282b0315L512K886j915q423l525O331J7975J1484L769m440j2178j2049k1073
$$ -20315 -16803 -13917 -15832 -24255 -27780 -21449 -3474 8010 11779 7339 -4839 -16888 -37961
8269c7961J0051K3353J0107r479O057j2007K57P908q24q23k5404r012K1101J8242
$$ -37961 -27910 -4557 5550 -3929 2128 -9879 -9622 -1714 -2538 -3361 -28765 -37777 -16676 1566
8255A566J889j0758j953P166P981j2531J51J2837j7965r344l723K8343K7597J40
$$ 1566 3455 -7303 -9256 -2090 5891 -6640 -6489 6348 -11617 -20961 -24684 3659 31256 31396
8241C1396o152o186k926o925r682R452J0003r473n493K7097n580J655l505l3784
$$ 31396 25244 19058 16132 9207 -475 8977 18980 9507 4014 31111 25531 27186 23681 -10103
8227a0103p814L515J1400O953J331J2483r527j9896J302p338P167K3427o393l3093
$$ -10103 -17917 -14402 -3002 3951 5282 17765 8238 -11658 -10356 -17694 -10527 12900 6507 -26586
8213b6586j3719j4398Q436K3825J1818O389r775r307m18m953k1917n539R069O238
$$ -26586 -40305 -54703 -46267 -22442 -10624 -4235 -14010 -23317 -23735 -28688 -50605 -56144 -47075 -40837
8199d0837J4053J2226J195N955M255P457J0311J2285k721k0208M067L726j0396
$$ -40837 -26784 -14558 -13363 -7408 -3153 4304 14615 26900 24179 3971 8038 11764 1368
8186A368j1238J8780J1812Q311m263k2649k4226j9140O159J6605K3339k614l839
$$ 1368 -9870 8910 20722 29033 24770 2121 -22105 -41245 -35086 -18481 4858 2244 -1595
8173a595l729m24n429J0894J5762j8077j9207J4401K6266n688k4659l835R96J4051
$$ -1595 -5324 -5748 -11177 -283 15479 -2598 -21805 -7404 18862 13174 -11485 -15320 -14324 -273
8159b73J1985j3762j0288O915L382q543j795J2954J1315J4907j0784j2980P018
$$ -273 11712 -2050 -12338 -5423 -2041 -10584 -12379 575 11890 26797 16013 3033 10051
8146A0051q343M14K099O489L550j8503k774q655j9562J193J7476l132k763j544
$$ 10051 1708 2122 4221 10710 14260 -4243 -7017 -15672 -35234 -34041 -16565 -19697 -22460 -24004
8132b4004R155J5932J8330O866k6188j4724O42J4826O351P036J3853K0636J5806
$$ -24004 -14849 1083 19413 26279 91 -14633 -13991 835 7186 14222 28075 48711 64517
8119F4517j0298k1432j8000r175J0448k835j2459j8040j2304j0412n606j465Q425
$$ 64517 54219 32787 14787 5612 16060 13225 766 -17274 -29578 -39990 -45596 -47061 -38636
8106c8636J1740L282P188o547l456J1999R378M461o307K448J748J1961O712j3109
$$ -38636 -26896 -23614 -16426 -22973 -26429 -14430 -5052 -591 -6898 -4450 -2702 9259 15971 2862
8092B862J0868K2j066J2605J0738K0251j7911p459r735n037j8388O542K6449J2744
$$ 2862 13730 13752 12686 25291 36029 56280 38369 30910 21175 16138 -2250 4292 30741 43485
8078D3485O527Q430j0244k3272j8382q817j4953j529j1776r085J0013l61j9370
$$ 43485 50012 58442 48198 24926 6544 -2273 -17226 -18755 -30531 -39616 -29603 -29964 -49334
8065d9334J9499J2939j154p998Q344K1837J8178j3308j0278R63p720j896j6193
$$ -49334 -29835 -16896 -18050 -26048 -17704 4133 22311 9003 -1275 -312 -8032 -9928 -26121
8052b6121j8271J1001K8242J7651o222j3884J674K440j3105j1467P170J1882J6450
$$ -26121 -44392 -33391 -5149 12502 6280 -7604 -5930 -3490 -16595 -28062 -20892 -9010 7440
8039G440j030j5969L568n277O240j414O409R171J9517J7236k7936k0632J6385
$$ 7440 6410 -9559 -5991 -11268 -5028 -6442 -33 9138 28655 45891 17955 -2677 13708
8026A3708J1946N245k5419k0443k356l873J6160J6072j376j0072p328j102j352
$$ 13708 25654 30899 5480 -14963 -17319 -21192 -5032 11040 9664 -408 -7736 -8838 -10190
8013a0190Kj0767N120J9406k554L681Q204M305J0457l360r332j7189L969L301
$$ -10190 -10188 -20955 -15835 3571 1017 4698 12902 17207 27664 24304 14972 -2217 1752 5053
7999E053J0022R354l465k3932p969J0828J4763J0243j5435j4269N051P531r939
$$ 5053 15075 24429 20964 -2968 -10937 -109 14654 24897 9462 -4807 244 7775 -2164
7986b164J2625l359j0863j509J7317J9391O93n192j127O178n604j6881K384O387
$$ -2164 10461 7102 -3761 -5270 12047 31438 32131 26939 25812 31990 26386 9505 11889 18276
7972A8276k0630r470r504o009Q86R029J7482L9041J5084j2351j1092k9789k2287
$$ 18276 -2354 -11824 -21328 -27337 -26451 -17422 60 39101 54185 41834 30742 953 -21334
7959b1334o382j229r40K7033J8097p6L943J4207j3861j3936j3673Q921j1447Q297
$$ -21334 -27716 -28945 -29885 -2852 15245 15169 19112 33319 19458 5522 -8151 770 -10677 -2380
7945b380p689j7366R580J7022j4114J573J2253m216R259J1746j4831k596J6143
$$ -2380 -10069 -27435 -17855 -833 -14947 -13374 -1121 -5337 3922 15668 837 -1759 14384
7932A4384o110J0586K64n637k1486J1831K699l3392q240J0577L258j2740p95J3445
$$ 14384 8274 18860 19124 13487 -7999 3832 6531 -26861 -35101 -24524 -21266 -34006 -34801 -21356
7918b1356J4242J719Q099p009j9493j1584J1747R874k6566q299M583J6239J7408
$$ -21356 -7114 -5395 2704 -4305 -23798 -35382 -23635 -13761 -40327 -48626 -44043 -27804 -10396
7905a0396k100k5077p617J9753J2687K1115L752N459j863m179J7642Q575j2829
$$ -10396 -12496 -37573 -45190 -25437 -12750 8365 12117 17576 15713 11534 29176 37751 24922
7892B4922k932p474j5773P584R114N992j3348k9590m173K0347j074n752j8051
$$ 24922 21990 14516 -1257 6327 15441 21433 8085 -21505 -25678 -5331 -6405 -12157 -30208
7879c0208k402j1965J0695O8j9168J7353J3446K557l094J1151m700O209K3255
$$ -30208 -32610 -44575 -33880 -33812 -52980 -35627 -22181 -19624 -22718 -11567 -16267 -10058 13197
7866A3197j528o030o053k0483P309k36o577l760J0768M692r835j0909j3146J750
$$ 13197 11669 5639 -414 -20897 -13588 -13824 -20401 -24161 -13393 -8701 -18536 -29445 -42591 -40841
7852d0841J8004M801O717j4465p02P520q470q83j0638N624L412O211L468j0549
$$ -40841 -22837 -18036 -11319 -25784 -26486 -18966 -27436 -28319 -38957 -33333 -29921 -23710 -20242 -30791
7838c0791J4984R718N38J7156J4415n992J4696J6713k794k4359r756l059k749
$$ -30791 -15807 -6089 -5551 11605 26020 20028 34724 51437 48643 24284 14528 11469 8720
7825H720O503O518M713k1935l0810j0863n438K7452J4296l647j3883k398K661
$$ 8720 15223 21741 26454 4519 -26291 -37154 -42592 -15140 -844 -4491 -18374 -20772 -18111
7812a8111J918q594o868Q48L225k454J7760J566N353J1007l098m7194l556K2649
$$ -18111 -16193 -24787 -31655 -30807 -27582 -30036 -12276 -10710 -5357 5650 2552 -44642 -48198 -25549
7798b5549L3392J3986j2436L834l359j3858j162j827J723J3440K423J7023j6986
$$ -25549 7843 21829 9393 13227 9868 -3990 -5152 -6979 -5256 8184 10607 27630 10644
7785A0644k2971J130m160M333J6767p196j6551K486O208L192j982j6306J0060
$$ 10644 -12327 -11197 -15357 -11024 5743 -1453 -18004 -15518 -9310 -6118 -8100 -24406 -14346
7772a4346K358M326J5314r847n852J8991q597k2240n013o578J282J9695M168K150
$$ -14346 -11988 -7662 7652 -2195 -8047 10944 2347 -19893 -24906 -31484 -30202 -10507 -6339 -4189
7758d189J431J0805R361q534O124j9840j5909n666K3403J1178j5293n962j4168
$$ -4189 -2758 8047 17408 8874 14998 -4842 -20751 -26417 -3014 8164 -7129 -13091 -27259
7745b7259J5276K0675J7891K420j6799k0598R371j5707o086J5189O621j4542j8071
$$ -27259 -11983 8692 26583 29003 12204 -8394 977 -14730 -20816 -5627 994 -13548 -31619
7732c1619O398K3103J3908j222q076n132Q539J907j3046n485O254k108q163M18
$$ -31619 -25221 -2118 11790 10568 2492 -2640 5899 7806 -5240 -10725 -4471 -6579 -14742 -14324
7718a4324J1132J5692M90j7344N467O540j8217j2420J637P002J2555O460o588
$$ -14324 -3192 12500 12990 -4354 1113 7653 -10564 -22984 -21347 -14345 -1790 4670 -1918
7705a918k2722o799J3600L439j6964M089n331J2714J0577L128J582O06J361j6054
$$ -1918 -24640 -31439 -17839 -14400 -31364 -27275 -32606 -19892 -9315 -6187 -4605 -3999 -2638 -18692
7691a8692j0830J7295J9235J1480j3151j7081o610l127L909J6205j071p598k470
$$ -18692 -29522 -12227 7008 18488 5337 -11744 -18354 -21481 -17572 -1367 -2438 -10036 -12506
7678a2506l348P027J3108M351N489j3907k0222J5899Q785k4117l819M603J2566
$$ -12506 -15854 -8827 4281 8632 14121 214 -20008 -4109 4676 -19441 -23260 -18657 -6091
7665f091k097k917j3223L705j501K3630J1349M501N296R370j0300k0109n617M155
$$ -6091 -8188 -11105 -24328 -20623 -22124 1506 12855 17356 22652 32022 21722 1613 -4004 151
7651A51J6705P071j2746k1412j0930N844R684N769J536j8835J5192J0780p462
$$ 151 16856 23927 11181 -10231 -21161 -15317 -5633 136 1672 -17163 -1971 8809 1347
7638A347Q459q929n059q136K61J3502J1012M725j5416J931L948p23k287J2626
$$ 1347 9806 877 -4182 -12318 -12057 1445 12457 17182 1766 3697 7645 6922 4635 17261
7624A7261l519L064N616o776r592N678K702q316l168K423j1777j8722q088l145
$$ 17261 13742 16806 22422 15646 6054 11732 14434 6118 2950 5373 -6404 -25126 -33214 -36359
7610c6359P2N427q741q976k676N130J2765J0741Q230J3631J006N130L313o896
$$ -36359 -36287 -30860 -39601 -48577 -51253 -46123 -33358 -22617 -14387 -756 250 5380 8693 1797
7596A797j7500J8600K652R162J277m457Q387r119k5295q542J1841J3978J16L257
$$ 1797 -15703 2897 5549 14711 15988 11531 19918 10799 -14496 -23038 -11197 2781 2897 6154
7582F154J460j6628m756J2240J9239J1982K16j1572k128j1579q379p413K111K701
$$ 6154 7614 -9014 -13770 -1530 17709 29691 29907 18335 16207 4628 -3751 -11164 -9053 -6352
7568f352L858j0554j1872K7182O209k0277j2554K578J2850m77K52o832K437J732
$$ -6352 -2494 -13048 -24920 2262 8471 -11806 -24360 -21782 -8932 -9409 -9157 -15989 -13552 -11820
7554a1820m23k2924p078N34K4578K5503R854j4041L026N179j0515R259j1068O142
$$ -11820 -12243 -35167 -42245 -41711 -17133 8370 18224 4183 7209 12388 1873 11132 64 6206
7540F206r795N19L925L0n098J555l257j2597q482K0034L741O555Q505j0659K696
$$ 6206 -3589 -3070 855 885 -4213 -2658 -5915 -18512 -26994 -6960 -3219 3336 11841 1182 3878
7525C878J6644j4426j7144j4872j531J086L479N115m343K89q174k950K8742J6888
$$ 3878 20522 6096 -11048 -25920 -27451 -26365 -22886 -17771 -22114 -21825 -29999 -32949 -4207 12681
7511A2681j3500j8027q844j4292J7322j811o781J60N268M37N528n227n09q331
$$ 12681 -819 -18846 -27690 -41982 -24660 -26471 -33252 -33092 -27824 -27387 -21859 -27086 -27595 -35926
7497c5926K498K782J9240J2785m445n545m899j8919Q895L516J933J2063J8766
$$ -35926 -33428 -30646 -11406 1379 -3066 -8611 -13510 -32429 -23534 -20018 -18085 -6022 12744
7484A2744r023J1458J3290P243k2207l620j2777l0250r347K4562J4486J552J199
$$ 12744 3721 15179 28469 35712 13505 9885 -2892 -33142 -42489 -17927 -3441 -1889 -690
7471f90K3619n380k8745j7671K2109J9980L727m431j3487M058n671j7662K828
$$ -690 22929 17549 -11196 -28867 -6758 13222 16949 12518 -969 3089 -2582 -20244 -17416
7458a7416o487J9419j042r496N735p549K143J961j149J3975J6067J3184j2253
$$ -17416 -23903 -4484 -5526 -15022 -9287 -16836 -14693 -12732 -13881 94 16161 29345 17092
7445A7092r907o995J883l444J4091j4252k154r00p131M465o46M42N787j0805N31
$$ 17092 7185 190 2073 -1371 12720 -1532 -3686 -4586 -11717 -7252 -7898 -7456 -1669 -12474 -11943
7430a1943J7786J4442K059l600r693o618q866j183M249J7460J751k997n780j3458
$$ -11943 5843 20285 22344 18744 9051 2433 -6433 -7616 -3367 14093 15844 12847 7067 -6391
7416f391n258J1145q891j2995J1117l681j2430N683j1148K202j44O685L20l94
$$ -6391 -11649 -504 -9395 -22390 -11273 -14954 -27384 -21701 -32849 -30647 -30791 -24106 -23786 -24180
7402b4180N951O335J6887o52m539j4067J7412J4493J288p147k5070J1083J5935
$$ -24180 -18229 -11894 4993 4341 -198 -14265 3147 17640 18928 11781 -13289 -2206 13729
7389A3729L452k730j4328j580O55J0664n495j3258N887J8298J3122j0158M771
$$ 13729 17181 14451 123 -1457 -802 9862 4367 -8891 -3004 15294 28416 18258 23029
7376B3029n310J4458k1511j0399J3906J544j1403J6209O611j1596m248l278J0349
$$ 23029 17719 32177 10666 267 14173 15717 4314 20523 27134 15538 11290 8012 18361
7363A8361o273p652k93n185l634j0998J5863R514j3913l051r549K23j8940r554
$$ 18361 12088 4436 4143 -1042 -4676 -15674 189 9703 -4210 -7261 -16810 -16587 -35527 -45081
7349d5081Q250j3765J4862J3396P690M891j4245J541k896J64O509K719J4226j586
$$ -45081 -36831 -50596 -35734 -22338 -14648 -9757 -24002 -22461 -25357 -25193 -18684 -15965 -1739 -3325
7335c325j1975n705o285j4903R475J0153P190N264o993n234j1474L830J0384P437
$$ -3325 -15300 -21005 -27290 -42193 -32718 -22565 -15375 -10111 -17104 -22338 -33812 -29982 -19598 -12161
7321a2161j2184n353j639L051O641J6941K497o01M02j4281M451j0076p289J4199
$$ -12161 -24345 -29698 -31337 -28286 -21645 -4704 -2207 -2808 -2406 -16687 -12236 -22312 -29601 -15402
7307a5402R704n371l332k108J764K156Q616J0273J8238j393k2990j8638j4365
$$ -15402 -5698 -11069 -14401 -16509 -14745 -12589 -3973 6300 24538 23145 155 -18483 -32848
7294c2848M283K5918L256R707r498L554o548l183n497O83J613N63j1102K414Q763
$$ -32848 -28565 -2647 609 10316 818 4372 -2176 -5359 -10856 -10173 -8560 -7997 -19099 -16685 -7922
7279g922O59L434j018j5259p945J3294J8970K374r646K459J0480l993l5299r67
$$ -7922 -7263 -3829 -4847 -20106 -28051 -14757 4213 6587 -3059 -600 9880 5887 -29412 -30379
7265c0379L4811J6305o47l1476j0511R593J6989l914k3082Q281K5047J015n168
$$ -30379 4432 20737 20090 -11386 -21897 -12304 4685 771 -22311 -14030 11017 12032 6864
7252F864j4509N388O66p643j2487q946J7937K2174l568k2886q458J0307J8598
$$ 6864 -7645 -2257 -1591 -9234 -21721 -30667 -12730 9444 5876 -17010 -25468 -15161 3437
7239C437Q348J3764j0412k3175M143o263M719J0233J934O368j1761j2063P169
$$ 3437 11785 25549 15137 -8038 -3895 -10158 -5439 4794 6728 13096 1335 -10728 -3559
7226c559M606j1543J066J9039j7478m201n98j966p490N472O354k626N321p679
$$ -3559 1047 -10496 -9430 9609 -7869 -12070 -12668 -14634 -22124 -16652 -10298 -12924 -7603 -15282
7212a5282j2308j3823p371Q330j845J7583J3356N905k302l196l331J7856R097
$$ -15282 -27590 -41413 -48784 -40454 -42299 -24716 -11360 -5455 -7757 -10953 -14284 3572 12669
7199A2669m337k2605j4221K0101n586r449J6207J267J387r653n064K324J440j829
$$ 12669 8332 -14273 -28494 -8393 -13979 -23428 -7221 -5954 -4567 -14220 -19284 -16960 -15520 -17349
7185a7349j4204P437p057q673K5387J1622j2224j3984J5544m443O022k068N122
$$ -17349 -31553 -24116 -31173 -39846 -14459 -2837 -15061 -29045 -13501 -17944 -11922 -13990 -8868
7172h868J4517P611M295J9065Q35l8578K292J1814j382N089J1888L82k1575j1045
$$ -8868 5649 13260 17555 36620 37455 -1123 1169 12983 11601 16690 28578 28960 7385 -3660
7158c660n047j1073l416J0616J4777k3159j8051M72J0039P587j983Q925K61L030
$$ -3660 -8707 -19780 -23196 -12580 2197 -20962 -39013 -38541 -28502 -20915 -22898 -13973 -13712 -10682
7144a0682O678l72J703L966o547J303r0k1004r647K372J9322J4752J2617p15J2528
$$ -10682 -4004 -4376 -2673 1293 -5254 -3951 -4041 -25045 -34692 -32320 -12998 1754 14371 13656 26184
7129B6184J438j2651k2078M165K565k1103R67L0205J2645N032j8646j3645j845
$$ 26184 27622 14971 -7107 -2942 -377 -21480 -20513 9692 22337 27369 8723 -4922 -6767
7116f767R600j2370O749J9307j0077R192P868Q85p382l646p282q225q734L015
$$ -6767 2833 -9537 -2788 16519 6442 15634 23502 24387 17005 13359 6077 -2148 -10882 -7867
7102g867m244O50N409k389l46m029k0307K286J7786Q180k760M080q716n552j4236
$$ -7867 -12111 -11461 -6052 -8441 -8787 -12816 -33123 -30837 -13051 -4871 -7631 -3551 -12267 -17819 -32055
7087c2055N613K686j5593q412J8255J7655L201j609j097O438J0534K2816j2561
$$ -32055 -26442 -23756 -39349 -47761 -29506 -11851 -8650 -10259 -11356 -4918 5616 28432 15871
7074A5871k1083k4828J6976J9317m127j5177J1359K662r779J0200J911R123R761
$$ 15871 -5212 -30040 -13064 6253 2126 -13051 -1692 970 -8809 1391 3302 12425 22186
7061B2186q867j0885N372J1103K194n615j4358r477j9283L603l740O653R666N285
$$ 22186 13319 2434 7806 18909 21103 15488 1130 -8347 -27630 -24027 -27767 -21114 -11448 -6163
7047f163O187M857J7107l313l330J3656j1078o306J3540p798k1505J421r084k1733
$$ -6163 24 4881 21988 18675 15345 29001 17923 11617 25157 17359 -4146 -2725 -11809 -33542
7033c3542j7673J8427r35K0096K356M221m27m706O22J3662J2174L41j3849l906
$$ -33542 -51215 -32788 -33723 -13627 -11271 -7050 -7477 -12183 -11561 2101 14275 14616 767 -3139
7019c139N062Q67k901j0491j2631K0211n338j4011K541r269K189l845q091N237
$$ -3139 1923 2790 -111 -10602 -23233 -3022 -8360 -22371 -19830 -29099 -26910 -30755 -38846 -33609
7005c3609J7742K5509P920o589j6321j1096O475p473J339R655J1483r456j1749
$$ -33609 -15867 9642 17562 10973 -5348 -16444 -9969 -17442 -16103 -6448 5035 -4421 -16170
6992a6170j6230l405K1400r434K594J6293R590J30k6301J418K0541J5117o873
$$ -16170 -32400 -35805 -14405 -23839 -21245 -4952 4638 4768 -21533 -20115 426 15543 8670
6979H670j7888j9432M916O397l273J5820j524m644r38j429l062o824J5796O819
$$ 8670 -9218 -28650 -23734 -17337 -20610 -4790 -6314 -10958 -11896 -13325 -16387 -23211 -7415 -596
6965e96Q225k0767q896j98J3432j55R485o434k0393n299K7418J1753R19K802j6058
$$ -596 7629 -13138 -22034 -22232 -8800 -8955 530 -5904 -26297 -31596 -4178 7575 8494 11296 -4762
6950d762r096K055M851O747Q034K456j7764J798K2323r783k3624L497J3816M760
$$ -4762 -13858 -11803 -6952 -205 7829 10285 -7479 -5681 16642 6859 -16765 -13268 548 5308
6936E308L905l439j1920j1264l026J5517J5840n979m481j95J6167k087p625J0993
$$ 5308 9213 5774 -6146 -17410 -20436 -4919 10921 4942 461 266 16433 14346 6721 17714
6922A7714p430m909J9357L601j0220j632j3464k0239o82J0676M76k2777j084J5061
$$ 17714 10284 5375 24732 28333 18113 16481 3017 -17222 -17904 -7228 -6752 -29529 -30613 -15552
6908a5552K999k172j2441M88J3153N305J849j4865J2589N321k4022k014J766R584
$$ -15552 -12553 -14725 -27166 -26678 -13525 -8220 -6371 -21236 -8647 -3326 -27348 -29362 -27596 -18012
6894a8012R759J39j9503j7074L829L591K7104L2215L838j1695Q047P587J1225
$$ -18012 -8253 -8114 -27617 -44691 -40862 -37271 -10167 22048 25886 14191 22238 29825 41050
6881D1050L291j9272j3915J536j0227j6852O500q228J4973q1k3522j5518j1614
$$ 41050 44341 25069 11154 12690 2463 -14389 -7889 -16117 -1144 -1225 -24747 -40265 -51879
6868e1879K3603J7540m797l397K1725K8016l106j1026j1144o18j876j274k479
$$ -51879 -28276 -10736 -15533 -18930 2795 30811 27705 16679 5535 4917 3041 1767 -712
6855g12L86R332K920L83k023P832J3468p043j6589j4415j0442k153M708K1494
$$ -712 -326 9006 11926 12309 10286 18118 31586 24543 7954 -6461 -16903 -19056 -14348 7146
6841G146J8852j0536o833n836M542l532j58m844p254N386j77J4994p174m006j8231
$$ 7146 25998 15462 8629 2793 7335 3803 3645 -1199 -8453 -3067 -3244 11750 4576 570 -17661
6826a7661j4643o318p40R928R665J5998L572N055p507j435J0412j0996P477O544
$$ -17661 -32304 -38622 -39362 -29434 -19769 -3771 -199 4856 -2651 -4086 6326 -4670 2807 9351
6812I351q184j3152J831m190j5036J4809J6505J2560j028o634j0714K621N796
$$ 9351 1167 -11985 -10154 -14344 -29380 -14571 1934 14494 13466 6832 -3882 -1261 4535
6799D535L302N413P14J2187j6402q783j537L925n781J917j137r779q143m844J2647
$$ 4535 7837 13250 13964 26151 9749 966 -571 3354 -2427 -510 -1647 -11426 -19569 -24413 -11766
6784a1766J291q43n487j2351M851J1380J2716N089J379l314o238K0573O77k2257
$$ -11766 -10475 -11318 -16805 -29156 -24305 -12925 -209 4880 6259 2945 -3293 17280 17957 -4300
6770d300J053l227J7032r048k9526J970K4174P908n332j5553R143j325j9395j0136
$$ -4300 -3247 -6474 10558 1510 -28016 -26046 -1872 6036 704 -14849 -5706 -7031 -26426 -36562
6756c6562J3999J0911o891N291J1170p677N732Q594J4759N558j4508j9945J004
$$ -36562 -22563 -11652 -18543 -13252 -2082 -9759 -4027 4567 19326 24884 10376 -9569 -8565
6743h565O768M921n747K986n606j8008k993K283O2L643P657P655J6522K932J7540
$$ -8565 -1797 3124 -2623 363 -5243 -23251 -26244 -23961 -23899 -20256 -12599 -4944 11578 14510 32050
6728C2050o812K586K327n165n310k7256m2049L448M321J7502R261k843J1924j5187
$$ 32050 25238 27824 30151 24986 19676 -7580 -49629 -46181 -41860 -24358 -15097 -17940 -6016 -21203
6714b1203J2751K1000J4859l432j2786j2089r379j8137k683J971Q151q112K3585
$$ -21203 -8452 12548 27407 23975 11189 -900 -10279 -28416 -31099 -29128 -20977 -29089 -5504
6701e504J7462l976q106p288Q797n326O851L752m78r53j4386j595J1712J1750
$$ -5504 11958 7982 -124 -7412 1385 -3941 2910 6662 6184 5231 -9155 -10750 962 12712
6687A2712J2953l018m27J4226p283r299P5j976P592q664o96P178j6672j5727j5680
$$ 12712 25665 22647 22220 36446 29163 19864 19939 17963 25555 16891 16195 23373 6701 -9026 -24706
6672b4706N938M0831J9985P175k6787l832j1494m460J2157R031k055l678o078
$$ -24706 -18768 22063 42048 49223 22436 18604 7110 2650 14807 23838 21783 18105 12027
6659A2027L802J382j2599J774J4933J4013O933j6912k5084m3J5546J9833l086
$$ 12027 15829 17211 4612 6386 21319 35332 42265 25353 269 226 15772 35605 32519
6646C2519j8448J4176J8705o099j919p419k4407l66J011J3959J1101k8614k1902
$$ 32519 14071 28247 46952 40853 38934 31515 7108 6742 7753 21712 32813 4199 -17703
6633a7703r358n742P445J4223J4870M25l0897J0422J2931j0135K204K7062J4330
$$ -17703 -27061 -32803 -25358 -11135 3735 4160 -26737 -16315 -3384 -13519 -11315 15747 30077
6620C0077N662j9401J139k5848l285R604J3063L521J6242M4P43j81N406r827N662
$$ 30077 35739 16338 17477 -8371 -11656 -2052 11011 14532 30774 30818 31561 31380 36786 26959 32621
6605C2621j034l663J0859P215M636m664l1391j0089P415n438q670q746Q471J3080
$$ 32621 31587 27924 38783 45998 50634 45970 14579 4490 11905 6467 -2203 -10949 -2478 10602
6591A0602M597j3013O97J9624J9743K3555l439j2120k3276J539L05K2008J6135
$$ 10602 15199 2186 2883 22507 42250 65805 62366 50246 26970 28509 28814 50822 66957
6578F6957J5729p781k5204K694J6851l1445o767J5299K8586Q284p587Q139p282
$$ 66957 82686 74905 49701 52395 69246 37801 31034 46333 74919 83203 75616 83755 76473
6565G6473Q052J5533J4022Q814O070k232m284J0139o701N113j9960n300J8566
$$ 76473 84525 100058 114080 122894 128964 126732 122448 132587 125886 130999 111039 105739 124305
6552A24305P722J5275J1709K923L206J6020K744j3964J0593O422J4927L8104L2689
$$ 124305 132027 147302 159011 161934 165140 181160 183904 169940 180533 186955 201882 239986 272675
6539B72675L4073K8403J4221R500K0421K2692j1230k4820l226j6275m4395l3314
$$ 272675 306748 335151 349372 358872 379293 401985 390755 365935 362709 346434 302039 268725
6527B68725j2278n117k9425j0343k4258j6811q763l039p499k2430k1565P944r66
$$ 268725 256447 251330 221905 211562 187304 170493 161730 158691 151192 128762 107197 115141 114175
6514A14175k2923J6789K3913n933k8814q019O41j3167q70j4578j1699L432O018
$$ 114175 91252 108041 131954 126021 97207 89188 89829 76662 75792 61214 49515 52947 58965
6501E8965J3638j1194k3035j5794L018K4017Q086n583j8400n759K183q446m248
$$ 58965 72603 61409 38374 22580 25598 49615 57701 52118 33718 27959 30142 21696 17448
6488A7448n639K426L6J2216J3080Q063p35R183O341j0623k96o294n92J1157j4018
$$ 17448 11809 14235 14271 26487 39567 47630 46895 56078 62419 51796 51500 45206 44614 55771 41753
6473D1753p202l960r729m539k8021j515L0080k810n966j1121J0319N067K287J1828
$$ 41753 34551 30591 20862 16323 -11698 -13213 16867 14057 8091 -3030 7289 12356 14643 26471
6459B6471l365r234K274k070K17R979K050N056k2457r236J5258K291j047j0773
$$ 26471 23106 13872 16146 14076 14293 24272 26322 31378 8921 -315 14943 17234 16187 5414
6445E414j3339Q539J733P18j4541j7568J1613J2230Q798J4701j0519k7052m389
$$ 5414 -7925 614 2347 3065 -11476 -29044 -17431 -5201 3597 18298 7779 -19273 -23662
6432b3662n317J0499M592P761M991L417J1114M494P194o398q26O446l08J0953
$$ -23662 -28979 -18480 -13888 -6127 -1136 2281 13395 17889 25083 18685 17859 24305 23997 34950
6418C4950j9404r879L254J4738l63k7626O599J1327N042L915m979n461o163k403
$$ 34950 15546 5667 8921 23659 23296 -4330 2269 13596 18638 22553 17574 12113 5950 3547
6404C547q231m716L548J8357j95o019Q406O586N574q170j433P390l590r677j2844
$$ 3547 -4684 -9400 -5852 12505 12310 6291 14697 21283 26857 18687 17254 24644 21054 11377 -1467
6389a467q589K0075J2321l460l845m627k552j954j4866m595j8620j837N797j3238
$$ -1467 -10056 10019 22340 18880 15035 10408 7856 5902 -8964 -13559 -32179 -34016 -28219 -41457
6375d1457j1941J1727J5298j4996L058j2281q203r551K973J8696K562J6642K5658
$$ -41457 -53398 -41671 -26373 -41369 -38311 -50592 -58795 -68346 -65373 -46677 -44115 -27473 -1815
6362a815J3030L206j6872p598J7178P443M933j6233N466R508j7960j3784l98J2416
$$ -1815 11215 14421 -2451 -10049 7129 14572 19505 3272 8738 18246 286 -13498 -13896 -1480
6348a480j0272l752O680J9930Q302o328j8395j1829k96m280M13o488m888n443
$$ -1480 -11752 -15504 -8824 11106 19408 13080 -5315 -17144 -17440 -21720 -21307 -27795 -32683 -38126
$$ [...]
##END NTUPLES=NMR SPECTRUM
##END=
