##TITLE=Analysis number 327893
Compound Code mo 08020
Book Reference 510/36
Project Code adrs
Chemist Name jimp
##JCAMPDX= 6.0         $$ Bruker NMR JCAMP-DX V2.0
##DATA TYPE= NMR SPECTRUM
##DATA CLASS= NTUPLES
##ORIGIN= Bruker BioSpin GmbH
##OWNER= nmr
$$ XWIN-NMR		Version 3.5
$$ Mon Apr 16 11:17:08 2007 GMT Daylight Time (UT+1h)  MAYBRIDGE\nmr@NMR_250MHZ
##.OBSERVE FREQUENCY= 250.131544655141
##.OBSERVE NUCLEUS= ^1H
##.ACQUISITION MODE= SIMULTANEOUS (DQD)
##.ACQUISITION SCHEME= undefined
##.AVERAGES= 16
##.DIGITISER RES= 18
##SPECTROMETER/DATA SYSTEM= dpx250
##.PULSE SEQUENCE= zg30
##.SOLVENT NAME= DMSO
##.SHIFT REFERENCE= (INTERNAL, DMSO, 0, 16.5719)
##AUDIT TRAIL= $$ (NUMBER, WHEN, WHO, WHERE, WHAT)
$$ ##TITLE= Audit trail, XWIN-NMR		Version 3.5
$$ ##JCAMPDX= 5.01
$$ ##ORIGIN= Bruker BioSpin GmbH
$$ ##OWNER= nmr
$$ C:\u/data/dgb/nmr/ADRS/1510/pdata/1/auditp.txt
$$ ##AUDIT TRAIL=  $$ (NUMBER, WHEN, WHO, WHERE, WHAT)
(   1,<2007-04-16 11:16:49.31 +100>,<MAYBRIDGE\nmr>,<NMR_250MHZ>,
      <created by zg, POWCHK disabled, PULCHK disabled
       configuration hash MD5:
       49 4B E0 1D 92 C2 6B 37 9F E6 65 BC 52 41 86 1D
       data hash MD5: 64K
       4F C4 86 12 4B AB E0 72 CB A0 8C 76 85 BE E4 AC>)
(   2,<2007-04-16 11:17:00.17 +100>,<MAYBRIDGE\nmr>,<NMR_250MHZ>,
      <Start of raw data processing
       ef LB = 0.3 FT_mod = 6 PKNL = 1 SI = 32K 
       data hash MD5: 32K
       F6 8E A5 04 D0 78 52 E3 93 AD 31 30 A5 E3 15 49>)
(   3,<2007-04-16 11:17:01.80 +100>,<MAYBRIDGE\nmr>,<NMR_250MHZ>,
      <apk 
       data hash MD5: 32K
       5B 87 61 5A 76 F2 8D AC 13 31 CA CC 14 58 C3 09>)
(   4,<2007-04-16 11:17:02.52 +100>,<MAYBRIDGE\nmr>,<NMR_250MHZ>,
      <abs ABSG = 5 
       data hash MD5: 32K
       DA 78 35 39 B7 53 BD E3 AB 75 B4 49 DA 71 3F C8>)
$$ ##END=
$$ 
$$ hash MD5
$$ 80 AF 60 8C 31 FB CE C8 63 53 66 9F 19 73 6D 87
##$RELAX= 
##$RELAX= 
##$RELAX= 
##$RELAX= 
##$RELAX= 
##$RELAX= 
##$RELAX= 
$$ Bruker specific parameters
$$ --------------------------
##$DU= <C:\u>
##$EXPNO= 1510
##$NAME= <ADRS>
##$PROCNO= 1
##$TYPE= <nmr>
##$USER= <dgb>
##$AMP= (0..31)
100 100 100 100 100 100 100 100 100 100 100 100 100 100 100 100 100 100 
100 100 100 100 100 100 100 100 100 100 100 100 100 100 
##$AQSEQ= 0
##$AQ_mod= 3
##$AUNM= <au_zg>
##$AUTOPOS= <12 >
##$BF1= 250.13
##$BF2= 250.13
##$BF3= 250.13
##$BF4= 250.13
##$BF5= 500.13
##$BF6= 500.13
##$BF7= 500.13
##$BF8= 500.13
##$BYTORDA= 1
##$CFDGTYP= 0
##$CFRGTYP= 5
##$CHEMSTR= <none>
##$CNST= (0..31)
1 1 145 1 1 1 1 1 1 1 1 1 1 1 1 1 1 1 1 1 1 1 1 1 1 1 1 1 1 1 1 1 
##$CPDPRG= <>
##$CPDPRG1= <>
##$CPDPRG2= <>
##$CPDPRG3= <>
##$CPDPRG4= <mlev>
##$CPDPRG5= <mlev>
##$CPDPRG6= <mlev>
##$CPDPRG7= <mlev>
##$CPDPRG8= <mlev>
##$CPDPRGB= <>
##$CPDPRGT= <>
##$D= (0..31)
0 1 0 0 0 0 0 0 0 0.06 0 0 0 0 0 0 0.0002 0 0 0 0 0 0 0 0 0 0 0 0 0 0 
0 
##$DATE= 1176718608
##$DBL= (0..7)
120 120 120 120 120 120 120 120 
##$DBP= (0..7)
150 150 150 150 150 150 150 150 
##$DBP07= 0
##$DBPNAM0= <>
##$DBPNAM1= <>
$$ [...]
##$SUBNAM7= <"">
##$SUBNAM8= <"">
##$SUBNAM9= <"">
##$SW= 20.6930455092707
##$SWIBOX= (0..15)
0 0 3 0 0 0 0 0 0 0 0 0 0 0 0 0 
##$SW_h= 5175.983436853
##$TD= 65536
##$TD0= 1
##$TE= 683.16
##$TE2= 300
##$TE3= 300
##$TEG= 300
##$TL= (0..7)
0 120 120 120 120 120 120 120 
##$TP= (0..7)
150 150 150 150 150 150 150 150 
##$TP07= 0
##$TPNAME0= <>
##$TPNAME1= <>
##$TPNAME2= <>
##$TPNAME3= <>
##$TPNAME4= <>
##$TPNAME5= <>
##$TPNAME6= <>
##$TPNAME7= <>
##$TPOAL= (0..7)
0.5 0.5 0.5 0.5 0.5 0.5 0.5 0.5 
##$TPOFFS= (0..7)
0 0 0 0 0 0 0 0 
##$TUNHIN= 0
##$TUNHOUT= 0
##$TUNXOUT= 0
##$USERA1= <user>
##$USERA2= <user>
##$USERA3= <user>
##$USERA4= <user>
##$USERA5= <user>
##$V9= 5
##$VALIST= <valist>
##$VCLIST= <CCCCCCCCCCCCCCC>
##$VD= 0
##$VDLIST= <DDDDDDDDDDDDDDD>
##$VPLIST= <PPPPPPPPPPPPPPP>
##$VTLIST= <TTTTTTTTTTTTTTT>
##$WBST= 1024
##$WBSW= 4
##$XGAIN= (0..3)
0 0 0 0 
##$XL= 0
##$YL= 0
##$YMAX_a= 160111
##$YMIN_a= -291270
##$ZGOPTNS= <>
##$ZL1= 120
##$ZL2= 120
##$ZL3= 120
##$ZL4= 120
##$ABSF1= 16.5719
##$ABSF2= -4.121275
##$ABSG= 5
##$ABSL= 3
##$ALPHA= 0
##$AQORDER= 0
##$ASSFAC= 0
##$ASSFACI= 0
##$ASSFACX= 0
##$ASSWID= 0
##$AUNMP= <proc_1d>
##$AZFE= 0.1
##$AZFW= 0.1
##$BCFW= 0
##$BC_mod= 0
##$BYTORDP= 0
##$COROFFS= 0
##$CY= 12.5
##$DATMOD= 1
##$DC= 0
##$DFILT= <>
##$DTYPP= 0
##$F1P= 14.0000005364418
##$F2P= -0.99999901652339
##$FCOR= 0.5
##$FTSIZE= 32768
##$FT_mod= 6
##$GAMMA= 0
##$GB= 0
##$INTBC= 1
##$INTSCL= 1
##$ISEN= 128
##$LB= 0.3
##$LEV0= 0
##$LPBIN= 0
##$MAXI= 10000
##$MC2= 0
##$MEAN= 0
##$ME_mod= 0
##$MI= 0
##$NCOEF= 0
##$NC_proc= -6
##$NLEV= 6
##$NOISF1= 0
##$NOISF2= 0
##$NSP= 0
##$NTH_PI= 0
##$NZP= 0
##$OFFSET= 16.5719
##$PC= 1
##$PHC0= 216.4821
##$PHC1= 7.798889
##$PH_mod= 1
##$PKNL= yes
##$PPARMOD= 0
##$PSCAL= 4
##$PSIGN= 0
##$REVERSE= no
##$SF= 250.129987517002
##$SI= 32768
##$SIGF1= 0
##$SIGF2= 0
##$SINO= 400
##$SIOLD= 32768
##$SREGLST= <1H.DMSO>
##$SSB= 0
##$STSI= 32768
##$STSR= 0
##$SW_p= 5175.98343685301
##$SYMM= 0
##$S_DEV= 0
##$TDeff= 65536
##$TDoff= 0
##$TI= <Analysis number 999999
Compound Code 99
Book Reference 9
Project Code 9>
##$TILT= no
##$TM1= 0
##$TM2= 0
##$TOPLEV= 0
##$USERP1= <user>
##$USERP2= <user>
##$USERP3= <user>
##$USERP4= <user>
##$USERP5= <user>
##$WDW= 1
##$XDIM= 32768
##$YMAX_p= 455775406
##$YMIN_p= -900367
$$ End of Bruker specific parameters
$$ ---------------------------------
##NTUPLES= NMR SPECTRUM
##VAR_NAME=  FREQUENCY,     SPECTRUM/REAL,   SPECTRUM/IMAG
##SYMBOL=    X,             R,               I
##VAR_TYPE=  INDEPENDENT,   DEPENDENT,       DEPENDENT
##VAR_FORM=  AFFN,          ASDF,            ASDF
##VAR_DIM=   32768,         32768,           32768
##UNITS=     HZ,            ARBITRARY UNITS, ARBITRARY UNITS
##FACTOR=    0.157963299565203, 1,           1
##FIRST=     4145.12899357247, 0,            0
##LAST=      -1030.85444328054, 0,           0
##MIN=       -1030.85444328054, -900367,     0
##MAX=       4145.12899357247, 455775406,    0
$$ Real data points
##PAGE= N=1
##DATA TABLE= (X++(R..R)), XYDATA
$$ [...]
$$ plain form
15519 -121233 -112568 -33354 -110347 -25912 336102 615870 502292 189048 31670 65864 94245
15508 94245 177117 -61071 -73770 181582 250202 -27178 -216117 31348 -36138 -72557 127548
15497 127548 242689 45947 8504 192399 329410 310096 239919 321693 340444 203454
15487 203454 136876 173490 310420 361898 57435 163512 465044 397630 291379 22585
15477 22585 -39393 -147842 -71862 47742 -67499 -46576 -80022 -94703 -73243 -21103 -60047
15466 -60047 72266 80672 -106041 -198204 44553 172417 234040 324505 172391 -10509 47748
15455 47748 117050 222074 347236 379079 471941 470067 191409 140169 416359 505001 497522
15444 497522 540244 338771 120491 -89299 -24725 28018 96517 -65145 -85360 78911
$$ packed form
15519a21233Q665P9214p6993Q4435L62014K79768j13578l13244j57378L4194K8381
15508I4245Q2872k38188j2699K55352O8620k77380j88939K47465o7486l6419K00105
15497A27548J15141j96742l7443J83895J37011j9314p0177Q1774J8751j36990
15487B03454o6578L6614J36930N1478l04463J06077L01532o7414j06251k68794
15477B2585o1978j08449P5980J19604j15241K0923l3446j4681K1460N2140l8944
15466f0047J32313Q406j86713r2163K42757J27864O1623R0465j52114j82900N8257
15455D7748O9302J05024J25162L1843R2862j874k78658n1240K76190Q8642p479
15444D97522M2722k01473k18280k09790O4574N2743O8499j61662k0215J64271
$$ plain form
15434 78911 151355 226454 -25729 -154610 -37926 184919 323278 454814 332905 92000
15424 92000 24557 -21147 127981 226966 279885 258451 3164 -97103 -77476 189297 283414
15413 283414 90303 200714 421416 549722 416282 228758 211341 155263 42725 26373
15403 26373 41867 120729 226397 196056 405079 463594 471519 339415 463666 606154 565210
15392 565210 557850 455050 352590 221183 230430 378489 535626 431314 308808 14995
15382 14995 -70795 64834 174143 156220 64482 106770 102291 -112237 -139080 -122990 -104617
15371 -104617 -123110 -196756 -135359 -102847 -117392 -55285 -66640 -154590 -31877 208324 107892
15360 107892 7399 -20681 -123895 -144898 -49919 44040 156784 217840 202175 182345 136062
$$ packed form
15434G8911P2444P5099k52183j28881J16684K22845J38359J31536j21909k40905
15424I2000o7443m5704J49128R8985N2919k1434k55287j00267J9627K66773R4117
15413B83414j93111J10411K20702J28306j33440j87524j7417n6078j12538j6352
15403B6373J5494P8862J05668l0341K09023N8515P925j32104J24251J42488m0944
15392E65210p360j02800j02460j31407R247J48059J57137j04312j22506k93813
15382A4995q5790J35629J09309j7923r1738M2288m479k14528k6843J6090J8373
15371a04617j8493p3646O1397L2512j4545O2107j1355q7950J22713K40201j00432
15360A07892j00493k8080j03214k1003R4979R3959J12744O1056j5665j9830m6283
$$ plain form
15349 136062 -31019 -79507 143395 260501 -24845 -55307 178035 82589 -19290 273393
15339 273393 214169 145763 -27973 -165161 -301214 -355847 -330432 -152559 134275 215441
15329 215441 310533 101769 56072 173024 378639 310131 -61706 -419348 -418420 -169964 -36130
15318 -36130 24419 80730 10189 -253918 -172880 -71099 -108224 -129081 55658 40270 -55766
15307 -55766 -75812 -122617 9794 90298 -13146 -251967 -76245 132690 302617 352657
15297 352657 82966 -236198 -386015 -284761 -396202 -362043 -155962 -149540 -150605 24386
15287 24386 181796 165643 -48176 -206745 -412841 -440201 -295143 -228561 324116 488786
15277 488786 357886 175198 3353 -18478 47314 85022 57186 258361 261618 309751 435464
$$ packed form
15349A36062j67081m8488K22902J17106k85346l0462K33342r5446j01879K92683
15339B73393n9224o8406j73736j37188j36053n4633K5415J77873K86834Q1166
15329B15441R5092k08764m5697J16952K05615o8508l71837l57642R28K48456J33834
15318c6130O0549N6311p0541k64107Q1038J01781l7125k0857J84739j5388r6036
15307e5766k0046m6805J32411Q0504j03444k38821J75722K08935J69927N0040
15297C52657k69691l19164j49817J01254j11441L4159K06081O422j065J74991
15287B4386J57410j6153k13819j58569k06096k7360J45058O6582N52677J64670
15277D88786j30900j82688j71845k1831O5792L7708k7836K01175L257M8133J25713
$$ plain form
15266 435464 404666 253368 336332 570937 728010 689172 730853 969584 844001 790791
15256 790791 848243 1110024 1083168 798742 672337 592716 761143 783833 575293 439677
15246 439677 799083 1233655 1328077 1216526 1037207 839191 632988 646135 644884 559759
15236 559759 440343 468031 610145 263355 156659 91564 -3507 -79455 -2493 322470
15226 322470 579643 622892 594439 618835 284117 407430 428527 277331 316992 557167
15216 557167 838757 766051 753322 937492 1177851 1394149 1399671 1259003 1206691 1278237 1631218
15205 1631218 1714113 1898247 1956676 2012449 2242952 2367348 2611164 2873248 2969228 3469798
15195 3469798 3847427 4420985 5245490 5685669 6158672 7017379 8087409 9722263 11561281
$$ packed form
15266D35464l0798j51298Q2964K34605J57073l8838M1681K38731j25583n3210
15256G90791N7452K61781k6856k84426j26405p9621J68427K2690k08540j35616
15246D39677L59406M34572R4422j11551j79319j98016k06203J3147j251q5125
15236E59759j19416K7688J42114l46790j06696o5095r5071p5948P6962L24963
15226C22470K57173M3249k8453K4396l34718J23313K1097j51196L9661K40175
15216E57167K81590p2706j2729J84170K40359K16298N522j40668n2312P1546L52981
15205A631218Q2895J84134N8429N5773K30503J24396K43816K62084R5980N00570
15195C469798L77629N73558Q24505M40179M73003Q58707J070030J634854J839018
$$ plain form
15186 11561281 14494852 19117504 26089307 35810930 46727933 54013868 52256219 45092862
15178 45092862 39820833 38504689 41166313 48442624 61948641 84440843 117071928 150639900
15170 150639900 159306082 134334292 103530825 81949286 70527038 67319809 71585151
15163 71585151 83992323 105602946 135098631 161870207 164532298 130634548 91622233
15156 91622233 66531639 52450491 45427133 43559916 45970621 51654539 58197802 60633384
15148 60633384 53953124 41581171 30411348 22577841 17210940 13441165 11035291 9387121
15140 9387121 8051997 7310400 6713434 6173961 5974206 5667625 5247605 4699078 3989197
15131 3989197 3602714 3253320 3248366 3280126 3199874 3224139 3011484 2842134 2562243 2309949
$$ packed form
15186A1561281K933571M622652O971803R721623J0917003P285935j757649p163357
15178D5092862n272029j316144K661624P276311J3506017K2492202L2631085L3567972
15170A50639900Q666182k4971790l0803467k1581539j1422248l207229M265342
15163G1585151J2407172K1610623K9495685K6771576K662091l3897750l9012315
15156I1622233k5090594j4081148p023358j867217K410705N683918O543263K435582
15148F0633384o680260j2371953j1169823p833507n366901l769775k405874j648170
15140I387121j335124p41597n96966n39473j99755l06581m20020n48527p09881
15131C989197l86483l49394m954L1760q0252K4265k12655j69350k79891k52294
$$ plain form
15121 2309949 2419653 2198155 1963952 2073476 2308698 2463283 2260710 1786966 1429241
15112 1429241 1423944 1532018 1476767 1764523 1590240 1640148 1881119 1772054 1495960 1514859
15102 1514859 1546644 1553071 1701898 1856203 1862269 1848139 2081538 2141708 2226528 2217815 2075655
15091 2075655 2209629 2523989 2915383 3530962 3767605 4178819 4560759 4770719 5150315
15082 5150315 5859248 6403495 7119215 8398264 10440756 13141892 16623314 21733459 28974149
15073 28974149 37485858 43501609 42769411 37922730 34096912 33143611 35204811 40794162
15065 40794162 51298740 69154271 94560487 120560216 128157876 108216308 83490097
15058 83490097 65966725 56515625 54004608 57443489 67384820 84987946 108632483 130074050
$$ packed form
15121B309949J09704k21498k34203J09524K35222J54585k02573m73744l57725
15112A429241n297J08074n5251K87756j74283M9908K40971j09065k76094J8899
15102A514859L1785O427J48827J54305O066j4130K33399O0170Q4820q713j42160
15091B075655J33974L14360L91394O15579K36643M11214L81940K09960L79596
15082E150315P08933N44247P15720J279049K042492K701136L481422N110145P240690
15073B8974149Q511709O015751p32198m846681l825818r53301K061200N589351
15065D0794162J0504578J7855531K5406216K5999729P597660j9941568k4726211
15058H3490097j7523372r451100k511017L438881R941331J7603126K3644537K1441567
$$ plain form
15050 130074050 132719553 105972185 73112608 52111658 40515061 34827351 33261419
15043 33261419 35242504 40308559 46756177 50192006 45089355 33987708 24120992 17581223
15035 17581223 13274133 10500193 8533277 7145484 6311643 5682765 5147894 4955225 4658080
15026 4658080 4430527 4066026 3793377 3676568 3484854 3140785 2773452 2621639 2603619 2676723
15016 2676723 2799758 2712222 2397772 2300472 2265734 2180107 2194305 2206836 2118133 2201649 2371915
15005 2371915 2307472 2189118 2079002 1964429 1890951 2017920 2297961 2456226 2401772 2411884
14995 2411884 2177644 2119974 2333650 2541837 2556543 2778036 3039494 3134925 3196354 3443773
14985 3443773 3417901 3598962 3764927 4169851 4407268 4877342 5775746 6297911 6687060 7748008
$$ packed form
15050A30074050K645503k6747368l2859577k1000950j1596597n687710j565932
15043C3261419J981085N066055O447618L435829n102651j1101647r866716o539769
15035A7581223m307090k773940j966916j387793q33841o28878n34871j92669k97145
15026D658080k27553l64501k72649j16809j91714l44069l67333j51813j8020P3104
15016B676723J23035q7536l14450r7300l4738q5627J4198J2531q8703Q3516J70266
15005B371915o4443j18354j10116j14573p3478J26969K80041J58265n4454J0112
14995B411884k34240n7670K13676K08187J4706K21493K61458R5431O1429K47419
14985C443773k5872J81061J65965M04924K37417M70074Q98404N22165L89149J060948
$$ plain form
14975 7748008 9350090 11303914 14076163 18377230 24907039 34424866 46913865 58579278
14967 58579278 61935793 56577449 51406239 51639224 58896185 74424704 99946297 131526666
14959 131526666 150674520 139439448 120334462 107724568 97220905 90349801 91242775
14952 91242775 99063682 109644900 119026138 129409172 136233686 120304579 89187327
14945 89187327 66353595 54215186 49973515 50612501 54111595 56504694 52454409 41739812
14937 41739812 30868661 22741724 17740271 14718204 12346289 10364542 9062237 7872783
14929 7872783 7310986 7083688 6703474 6161192 5911763 5752475 5732688 5800726 5609964 5428482
14919 5428482 5530946 5608639 5751561 5823463 6096462 6514684 6840450 7205780 7821867 8682557
$$ packed form
14975G748008J602082J953824K772249M301067O529809R517827J2488999J1665413
14967E8579278L356515n358344n171210K32985P256961J5528519K5521593L1580369
14959A31526666J9147854j1235072j9104986j2609894j0503663o871104Q92974
14952I1242775P820907J0581218R381238J0383034O824514j5929107l1117252
14945H9187327k2833732j2138409m241671O38986L499094K393099m050285j0714597
14937D1739812j0871151q126937n001453l022067k371915j981747j302305j189454
14929G872783n61797k27298l80214n42282k49429j59288j9787O8038j90762j81482
14919E428482J02464P7693J42922P1902K72999M18222L25766L65330O16087Q60690
$$ plain form
14909 8682557 9824059 11309340 13970651 18065590 23675045 31660631 41670552 50773399
14901 50773399 53588953 50000623 46715588 47527858 54357548 68396093 90793578 117881335
14893 117881335 133170538 121456420 103814755 92881287 84713595 80035321 82003767
14886 82003767 90334262 101404431 110620006 119509571 124567429 108221954 78574920 57755272
14878 57755272 46980349 43306908 44365230 48646096 52341094 48962682 38144171 27059062
14870 27059062 19498332 14694811 11338809 8950131 7606744 6546008 5566757 5052792
14862 5052792 4674226 4154806 3907463 3765782 3441889 3119473 2889167 2856836 2742026 2452167
14852 2452167 2526645 2360450 2132055 2287198 2201284 2097092 2072501 1936708 1835807 1622931
$$ packed form
14909H682557J141502J485281K661311M094939N609455P985586J0009921R102847
14901E0773399K815554l588330l285035Q12270O829690J4038545K2397485K7087757
14893A17881335J5289203j1714118j7641665j0933468q167692m678274J968446
14886H2003767Q330495J1070169R215575Q889565N057858j6345475k9647034k0819648
14878E7755272j0774923l673441J058322M280866L694998l378412j0818511j1085109
14870B7059062p560730m803521l356002k388678j343387j060736r79251n13965
14862E052792l78566n19420k47343j41681l23893l22416k30306l2331j14810k89859
14852B452167P4478j66195k28395J55143q5914j04192k4591j35793j00901k12876
$$ plain form
14842 1622931 1542376 1691194 1610686 1362905 1212098 1269227 1443440 1341313 1254267 1040068
14832 1040068 1152839 1192539 1092835 1027863 937272 1018066 1149568 1175938 943861 884608 730526
14821 730526 483768 462080 641599 588378 777727 758439 457982 529793 824232 837493
14811 837493 662794 516689 576962 548517 332430 274013 332254 232376 252803 251218 485959
14800 485959 519147 568660 628526 470612 401856 524752 433771 301595 347548 499498 684559
14789 684559 682524 252048 263669 543293 458145 360137 16779 -166917 -24642 212833
14779 212833 59282 -55951 231647 418729 504412 574099 381770 252061 334469 554767
14769 554767 612661 599134 471617 340099 204609 225679 222683 266043 474417 371808 26788
$$ packed form
14842A622931q0555J48818q0508k47781j50807N7129J74213j02127q7046k14199
14832A040068J12771L9700r9704o4972r0591Q0794J31502K6370k32077n9253j54082
14821G30526k46758k1688J79519n3221J89349j9288l00457P1811K94439J3261
14811H37493j74699j46105O0273k8445k16087n8417N8241r9878K0427j585K34741
14800D85959L3188M9513N9866j57914o8756J22896r0981j32176M5953J51950J85061
14789F84559k035m30476J1621K79624q5148r8008l43358j83696J42275K37475
14779B12833j53551j15233K87598J87082Q5683O9687j92329j29709Q2408K20298
14769E54767N7894j3527j27517j31518j35490K1070k996M3360K08374j02609l45020
$$ plain form
14758 26788 278364 125731 86038 180174 134162 208106 154455 224201 383542 675264 644396
14747 644396 363286 250871 260666 180552 40438 -46185 83870 84965 -150933 -244144 -160929
14736 -160929 -30419 56030 174155 -72908 -78455 164041 247827 26605 -71010 64182
14726 64182 -39549 -84217 110927 348824 293859 188268 110554 201684 329566 382999 328258
14715 328258 290243 408749 308987 70057 118487 211400 192808 161612 281146 502255 556110
14704 556110 363661 -594 -85792 -126278 -30275 142402 285815 448244 476799 301587
14694 301587 333944 416296 260800 113084 148197 330292 373469 481492 388018 386690 341738
14683 341738 404672 578487 433267 191243 160164 407627 802820 773680 903039 932490
$$ packed form
14758B6788K51576j52633l9693R4136m6012P3944n3651O9746J59341K91722l0868
14747F44396k81110j12415R795q0114j40114q6623J30055J095k35898r3211Q3215
14736a60929J30510Q6449J18125k47063n547K42496Q3786k21222r7615J35192
14726F4182j03731m4668J95144K37897n4965j05591p7714R1130J27882N3433n4741
14715C28258l8015J18506r9762k38930M8430R2913j8592l1196J19534K21109N3855
14704E56110j92449l64255q5198m0486R6003J72677J43413J62429K8555j75212
14694C01587L2357Q2352j55496j47716L5113J82095M3177J08023r3474j328m4952
14683C41738O2934J73815j45220k42024l1079K47463L95193k9140J29359K9451
$$ plain form
14673 932490 723385 355549 312613 306116 654910 747917 775333 928313 832937 648101 527879
14662 527879 109015 -85900 -74039 -200507 -157479 -87950 -148793 44534 400027 405735 348517
14651 348517 -50662 -68170 105234 56801 140821 112184 84818 28262 -81504 -80648 -158146
14640 -158146 -228519 -168333 -159869 -40907 86097 183725 230353 276623 190930 -21261 51127
14629 51127 76765 -126370 -245516 -112118 -24792 72270 139224 -8230 105156 252215
14619 252215 75201 28050 67272 -171809 -243843 3749 66591 -30744 25567 135194 212688
14608 212688 252015 87403 -27539 -36843 -335002 -299099 -167200 -128126 81578 177478 140683
14597 140683 136170 -34280 -357749 -327211 -175725 -163663 -335450 -287553 -298850 -275750 91074
$$ packed form
14673I32490k09105l67836m2936o497L48794R3007K7416J52980r5376j84836j20222
14662E27879m18864j94915J1861j26468M3028O9529o0843J93327L55493N708n7218
14651C48517l99179j7508J73404m8433Q4020k8637k7366n6556j09766Q56p7498
14640a58146p0373O0186Q464J18962J27004R7628M6628M6270q5693k12191P2388
14629E1127K5638k03135j19146J33398Q7326R7062O6954j47454J13386J47059
14619B52215j77014m7151L9222k39081p2034K47592O2842r7335N6311J09627P7494
14608B12688L9327j64612j14942r304k98159L5903J31899L9074K09704R5900l6795
14597A40683m513j70450l23469L0538J51486J2062j71787M7897j1297K3100L66824
$$ plain form
14586 91074 277204 309983 85836 104078 152437 74722 65066 -78841 27853 76752 70216
14575 70216 67471 -4594 162795 183544 265811 308593 354798 376781 577617 835150 705675
14564 705675 476244 355723 222500 82674 139511 139340 132340 22630 154302 691771 886391
14553 886391 545117 193429 101654 278709 346072 193960 342022 288818 226039 405052
14543 405052 483417 214980 141800 294709 409210 289155 106131 -31702 -74289 113883
14533 113883 259119 -64774 -133418 -79415 -107387 -278544 -290068 -240703 -67783 115244
14523 115244 47235 -251213 -226093 -122141 -156800 -139240 -241679 -261113 -52728 75831
14513 75831 121067 -11348 -148331 41267 215436 65738 -187903 -386175 -240061 -308087
$$ packed form
14586I1074J86130L2779k24147J8242M8359p7715r656j43907J06694M8899o536
14575G0216k745p2065J67389K0749Q2267M2782M6205K1983K00836K57533j29475
14564G05675k29431j20521j33223j39826N6837j71p000j09710J31672N37469J94620
14553H86391l41274l51688r1775J77055O7363j52112J48062n3204o2779J79013
14543D05052P8365k68437p3180J52909J14501j20055j83024j37833m2587J88172
14533A13883J45236l23893o8644N4003k7972j71157j1524M9365J72920J83027
14523A15244o8009k98448K5120J03952l4659J7560j02439j9434K08385J28559
14513G5831M5236j32415j36983J89598J74169j49698k53641j98272J46114o8026
$$ plain form
14503 -308087 -224257 -205963 -309402 -65188 134394 119840 -45424 51364 -32698 89101
14493 89101 3589 -144894 79706 182326 215515 161437 119604 83299 111263 19411 -138388
14482 -138388 -66329 93295 40691 -17914 3476 213691 253493 234794 125376 118849 192873
14471 192873 151122 248264 111851 56698 123351 -76262 -34624 15620 -31974 70406 138000
14460 138000 154637 231444 242926 148288 182029 248375 455168 553873 509339 610537 673334
14449 673334 718594 700128 664491 855081 766347 841181 819122 758605 442964 432582 776564
14438 776564 803578 458921 306607 322355 381175 374738 327042 252922 24726 -75879 88408
14427 88408 171355 411319 240427 170095 132534 -55118 -14611 -41635 -7839 87529 237566
$$ packed form
14503c08087Q3830J8294j03439K44214J99582j4554j65264R6788q4062J21799
14493H9101q5512j48483K24600J02620L3189n4078m1833l6305K7964r1852j57799
14482a38388P2059J59624n2604n8605K1390K10215L9802j8699j09418o527P4024
14471A92873m1751R7142j36413n5153O6653j99613M1638N0244m7594J02380O7594
14460A38000J6637P6807J1482r4638L3741O6346K06793R8705m4534J01198O2797
14449F73334M5260j8466l5637J90590q8734P4834k2059o0517l15641j0382L43982
14438G76564K7014l44657j52314J5748N8820o437m7696p4120k28196j00605J64287
14427H8408Q2947K39964j70892p0332l7561j87652M0507k7024L3796R5368J50037
$$ plain form
14416 237566 154153 134625 178487 22716 282278 651892 784975 1008209 940418 946791 935208
14405 935208 1129498 1174231 1298704 1586538 1585647 1478625 1447107 1589620 1682415 1612206 1279036
14394 1279036 1141842 1047050 1110130 1179677 1351769 1440420 1461051 1635374 1346541 1067930
14384 1067930 1070189 856849 812484 993436 982069 854859 962810 1154694 1243731 1243772 1618983
14373 1618983 1722945 1497585 1334640 1289164 1385065 1221640 1093310 899183 747852 999156
14363 999156 1284216 1484159 1386667 1278951 1176418 1240382 1033051 705067 731150 739788
14353 739788 1017085 1043395 832838 670807 557700 395845 234015 90063 207670 552218
14343 552218 430329 197185 186217 308222 328754 126387 -78836 -221400 -229553 -94755
$$ packed form
14416B37566q3413j9528M3862j55771K59562L69614J33083K23234o7791O373j1583
14405I35208J94290M4733J24473K87834q91j07022l1518J42513R2795p0209l33170
14394A279036j37194r4792O3080O9547J72092Q8651K0631J74323k88833k78611
14384A067930K259k13340m4365J80952j1367j27210J07951J91884Q9037M1L75211
14373A618983J03962k25360j62945m5476R5901j63425j28330j94127j51331K51304
14363I99156K85060J99943r7492j07716j02533O3964k07331l27984K6083Q638
14353G39788K77297K6310k10557j62031j13107j61855j61830j43952J17607L44548
14343E52218j21889k33144j0968J22005K0532k02367k05223j42564q153J34798
$$ plain form
14333 -94755 -125246 -79011 -13643 127723 35374 216863 358890 395718 -38299 -246837 41596
14322 41596 121067 -127669 -298896 -294858 -434540 -508334 -280915 -143948 -57493 38122 295964
14311 295964 209546 299011 234413 61690 -16336 -177131 -109648 -39670 3537 -228684 -436423
14300 -436423 -325764 56618 114044 -132285 -196326 -197759 -295654 -304079 -203092 -248104 -54864
14289 -54864 132517 -89271 -85232 -274549 -127627 -120846 -129055 -178374 -194540 -125210 62610
14278 62610 115248 18583 2561 -89371 -273032 -247681 -460241 -655893 -311076 -192950 -233081
14267 -233081 -227333 -111965 -157493 -58855 41615 134021 342031 445992 195169 -53459
14257 -53459 -117560 -66041 -96671 85487 252914 223965 265196 136195 -28927 132102 9571
$$ packed form
14333i4755l0491M6235O5368J41366r2349J81489J42027L6828m34017k08538K88433
14322D1596P9471k48736j71227M038j39682p3794K27419J36967Q6455R5615K57842
14311B95964q6418Q9465o4598j72723p8026j60795O7483O9978M3207k32221k07739
14300d36423J10659L82382N7426k46329o4041j433r7895q425J00987m5012J93240
14289e4864J87381k21788M039j89317J46922O781q209m9319j6166O9330J87820
14278F2610N2638r6665j6022r1932j83661K5351k12560j95652L44817J18126m0131
14267b33081N748J15368m5528R8638J00470R2406K08010J03961k50823k48628
14257e3459o4101N1519l0630J82158J67427k8949M1231j29001j65122J61029j22531
$$ plain form
14246 9571 83556 -58692 -229654 -135544 155402 388301 469574 405307 402508 183000 43834
14235 43834 14457 203695 282873 317011 199153 304984 260879 29759 -180315 -331431
14225 -331431 -229657 -71485 -31137 104658 200071 -3822 -262951 -98285 -173169 -214890
14215 -214890 -191389 72667 149036 -61057 82954 174320 298631 199726 83480 44251
14205 44251 204669 203794 85488 -52455 237235 303697 251239 266491 277578 423897 761642
14194 761642 521241 271614 362987 467209 543468 420697 306434 439385 465659 344843
14184 344843 323463 389635 469920 496893 338042 312441 326285 163422 143135 169136 151407
14173 151407 188493 231421 558749 632124 713386 773823 592753 704655 1167115 1192583 1209798
$$ packed form
14246I571P3985j42248j70962R4110K90946K32899Q1273o4267k799k19508j39166
14235D3834k9377J89238P9178L4138j17858J05831m4105k31120k10074j51116
14225c31431J01774J58172M0348J35795R5413k03893k59129J64666p4884m1721
14215b14890K3501K64056P6369k10093J44011R1366J24311r8905j16246l9229
14205D4251J60418q75j18306j37943K89690O6462n2458J5252J1087J46319L37745
14194G61642k40401k49627R1373J04222P6259j22771j14263J32951K6274j20816
14184C44843k1380O6172Q0285K6973j58851k5601J3844j62863k0287K6001j7729
14173A51407L7086M2928L27328P3375Q1262O0437j81070J11902M62460K5468J7215
$$ plain form
14162 1209798 1284698 1258847 1118427 1168460 1295652 1395823 1892064 2206382 2386636 2200342
14152 2200342 2029179 1762453 1548793 1301562 1202898 1194533 1184378 1157374 1179519 1320047
14142 1320047 1280792 802515 397096 343229 481172 610198 664585 595613 606357 842558
14132 842558 818995 641294 703394 898462 1104081 1290078 1336092 1348625 1409945 1231601
14122 1231601 1094364 1050532 1186437 1418326 1675635 1792584 1663275 1455283 1299560 1449321
14112 1449321 1332469 1376572 1423248 1592753 1647952 1398385 1155429 1103152 863042 576846
14102 576846 509486 666707 853145 933972 1144569 1156760 1020963 1018719 1183562 1052720
14092 1052720 996983 936152 801415 706986 486030 625647 885809 854019 564067 426916
$$ packed form
14162A209798P4900k5851j40420N0033J27192J00171M96241L14318J80254j86294
14152B200342j71163k66726k13660k47231r8664q365j0155k7004K2145J40528
14142A320047l9255m78277m05419n3867J37943J29026N4387o8972J0744K36201
14132H42558k3563j77701O2100J95068K05619J85997M6014J2533O1320j78344
14122A231601j37237m3832J35905K31889K57309J16949j29309k07992j55723J49761
14112A449321j16852M4103M6676J69505N5199k49567k42956n2277k40110k86196
14102E76846o7360J57221J86438Q0827K10597J2191j35797k244J64843j30842
14092A052720n5737o0831j34737r4429k20956J39617K60162l1790k89952j37151
$$ plain form
14082 426916 619314 807502 790501 700767 660535 601835 553849 592004 676853 635494 455590
14071 455590 445398 493638 604573 734487 911804 949400 931450 962763 829793 744988 668861
14060 668861 707357 753335 583710 425706 457109 716154 783023 788315 728444 670348 639463
14049 639463 488949 599640 606143 592847 671551 809042 705453 702596 734390 635561 620647
14038 620647 474537 556291 655323 946196 1053921 1074415 849490 706007 840941 941283
14028 941283 835260 1000040 1222634 1183979 1149774 1208646 1239469 1239231 1486034 1496243 1337524
14017 1337524 1337678 1299877 1341824 1367656 1356781 1362897 1270044 1365311 1463320 1393149 1527711 1710010
14005 1710010 1946628 1701890 1544508 1589055 1795589 1839312 1911898 2152543 2196784 2432969
$$ packed form
14082D26916J92398J88188j7001q9734m0232n8700m7986L8155Q4849m1359j79904
14071D55590j0192M8240J10935J29914J77317L7596j7950L1313j32970q4805p6127
14060F68861L8496M5978j69625j58004L1403K59045O6869N292n9871n8096l0885
14049F39463j50514J10691O503j3296P8704J37491j03589k857L1794r8829j4914
14038F20647j46110Q1754R9032K90873J07725K0494k24925j43483J34934J00342
14028I41283j06023J64780K22594l8655l4205N8872L0823k38K46803J0209j58719
14017A337524J54l7801M1947K5832j0875O116r2853R5267R8009p0171J34562J82299
14005A710010K36618k44738j57382M4547K06534M3723P2586K40645M4241K36185
$$ plain form
13995 2432969 2739177 2937285 3173185 3137987 3263820 3311814 3155378 3011130 3208117 3658862
13985 3658862 4137893 4418578 4482244 4440874 4603360 4617566 4520902 4714561 5048655 5124573
13975 5124573 5142030 5433880 5775195 6091792 6306862 6949710 7599055 8000641 8669755 9332447
13965 9332447 9758489 10414935 11269728 12346031 13724943 15305308 16924439 18902586 21291540
13956 21291540 23769006 26576979 29688671 33253710 37830721 44423240 53706277 66082198
13948 66082198 82666692 104373700 130871831 158038811 176935521 179619782 169990642
13941 169990642 160261970 159202225 170769918 195386366 230260057 266819293 290878250
13934 290878250 292197266 270958018 235288817 199605194 174808307 163413907 164324871
$$ packed form
13995B432969L06208J98108K35900l5198J25833M7994j56436j44248J96987M50745
13985C658862M79031K80685O3666m1370J62486J4206r6664J93659L34094P5918
13975E124573J7457K91850L41315L16597K15070O42848O49345M01586O69114O62692
13965I332447M26042O56446Q54793J076303J378912J580365J619131J978147K388954
13956B1291540K477466K807973L111692L565039M577011O592519R283037J2375921
13948F6082198J6584494K1707008K6498131K7166980J8896710K684261r629140
13941A69990642r728672j059745J1567693K4616448L4873691L6559236K4058957
13934B90878250J319016k1239248l5669201l5683623k4796887j1394400R10964
$$ plain form
13927 164324871 173736427 184342761 185641053 170801214 145585217 121036226 102241159
13920 102241159 89227436 80953476 76471132 75533733 77896541 83938906 94507590 110379009
13912 110379009 131795622 156692579 177836902 185652105 178368318 165840847 159092531
13905 159092531 163363319 180605725 209662130 245310700 275516711 287343460 275000454
13898 275000454 243536395 205825306 175026046 156705585 151194636 155798663 165609367
13891 165609367 171400001 163139227 140098934 112192357 88246300 70384048 57393978
13884 57393978 47719689 40415109 34744378 30359820 26774918 23923441 21594678 19758654
13876 19758654 18243931 16633161 15257829 13993955 12706796 11632794 10925830 10079199
$$ packed form
13927A64324871R411556J0606334J298292j4839839k5215997k4548991j8795067
13920A02241159j3013723q273960m482344r37399K362808O042365J0568684J5871419
13912A10379009K1416613K4896957K1144323P815203p283787j2527471o748316
13905A59092531M270788J7242406K9056405L5648570L0206011J1826749j2343006
13898B75000454l1464059l7711089l0799260j8320461n510949M604027R810704
13891A65609367N790634q260774k3040293k7906577k3946057j7862252j2990070
13884E7393978r674289p304580n670731m384558l584902k851477k328763j836024
13876A9758654j514723j610770j375332j263874j287159j074002p06964q46631
$$ plain form
13868 10079199 9238998 8857399 8430326 8144527 7830342 7400107 6910064 6376527 5883533
13859 5883533 5571210 5361014 5173752 4910334 4772672 4437425 4279645 4082288 3705043
13850 3705043 3450983 3285824 3250011 3406138 3286749 3300960 3346146 3441984 3363925 3213391
13840 3213391 3101861 3087020 3061222 2767420 2422992 2456981 2407862 2434178 2570545 2384867
13830 2384867 2281387 2256789 2163673 1965217 1878008 1929251 2088601 2212098 2064311 2071484
13820 2071484 2138958 2117625 1781702 1446989 1446488 1685540 1795712 1822164 1937861 1803524
13810 1803524 1534138 1339508 1441524 1800171 1737401 1454970 1458636 1565688 1459187 1432066
13800 1432066 1448447 1534558 1630764 1191837 1093688 1361693 1518155 1433935 1089682 1026866
$$ packed form
13868A0079199q40201l81599m27073k85799l14185m30235m90043n33537m92994
13859E883533l12323k10196j87262k63418j37662l35247j57780j97357l77245
13850C705043k54060j65159l5813J56127j19389J4211M5186R5838p8059j50534
13840C213391j11530j4841k5798k93802l44428L3989m9119K6316J36367j85678
13830B384867j03480k4598r3116j98456q7209N1243J59350J23497j47787P173
13820B071484O7474k1333l35923l34713n01K39052J10172K6452J15697j34337
13810A803524k69386j94630J02016L58647o2770k82431L666J07052j06501k7121
13800A432066J6381Q6111R6206m38927r8149K68005J56462q4220l44253o2816
$$ plain form
13790 1026866 1326240 1504869 1503751 1464143 1201310 1125635 1036971 1148752 1309100 1468639
13780 1468639 1326827 1230584 1121472 996813 953813 763351 684973 653522 852106 938023
13770 938023 761825 714120 903502 1046638 1072850 920606 1150284 1194316 1054190 822077
13760 822077 732379 807723 930969 969723 913651 845963 746638 451082 286448 360955 421657
13749 421657 416524 496042 383576 297704 459134 458438 664758 609517 738773 819891 788689
13738 788689 584970 562904 640595 551637 605411 572771 511969 538082 548425 609072 576104
13727 576104 430959 251014 190920 317289 459858 306403 391281 469008 500152 522340
13717 522340 743643 690458 693775 633790 667113 721053 600786 322728 490921 538570 641986
$$ packed form
13790A026866K99374J78629j118l9608k62833p5675q8664J11781J60348J59539
13780A468639j41812r6243j09112j24659m3000j90462p8378l1451J98584Q5917
13770I38023j76198m7705J89382J43136K6212j52244K29678M4032j40126k32113
13760H22077q9698P5344J23246L8754n6072o7688r9325k95556j64634P4507O0702
13749D21657n133P9518j12466q5872J61430o96K06320n5241J29256Q1118l1202
13738G88689k03719k2066P7691q8958N3774l2640o0802K6113J0343O0647l2968
13727E76104j45145j79945o0094J26369J42569j53455Q4878P7727L1144K2188
13717E22340K21303n3185L317n9985L3323N3940j20267k78058J68193M7649J03416
$$ plain form
13706 641986 662650 552554 469627 606305 673771 572606 463820 403391 457205 294425
13696 294425 278748 167692 146509 124027 260655 397457 391319 140392 172812 60390 104613
13685 104613 259340 325009 279779 133450 -30999 120847 281179 596406 613851 499790
13675 499790 637946 567577 256602 276867 511948 605025 341457 153032 121793 -13071
13665 -13071 -14589 260948 452166 405787 307553 193810 117259 41590 -99423 -166757 -48026
13654 -48026 115849 287611 490840 228505 -27468 -138765 -85664 76086 81537 115200
13644 115200 29467 67778 238364 97427 197822 86665 196132 246339 120867 -13467
13634 -13467 -148413 -224342 -211023 -163790 -23266 45180 157215 511243 589691 690311 737380
$$ packed form
13706F41986K0664j10096q2927J36678O7466j01165j08786o0429N3814j62780
13696B94425j5677j11056k1183k2482J36628J36802o138k50927L2420j12422M4223
13685A04613J54727O5669m5230j46329j64449J51846J60332L15227J7445j14061
13675D99790J38156p0369l10975K0265K35081R3077k63568j88425l1239j34864
13665a3071j518K75537J91218m6379r8234j13743p6551p5669j41013o7334J18731
13654d8026J63875J71762K03229k62335k55973j11297N3101J61750N451L3663
13644A15200q5733L8311J70586j40937J00395j11157J09467N0207j25472j34334
13634a3467j34946p5929J3319M7233J40524O8446J12035L54028P8448J00620M7069
$$ plain form
13623 737380 615356 425146 299066 235755 213352 98823 200167 197990 159201 169421 155730
13612 155730 -16948 -207614 -158540 -98715 -68517 -143543 -17106 113475 -16570 -73544
13602 -73544 115708 208557 236196 56561 -170304 -167809 -140986 -14455 15317 -208006 -70873
13591 -70873 -47524 -18589 68382 147470 57451 73866 -154712 -142263 -194685 -207428 -107600
13580 -107600 33103 233428 548487 519254 370249 308554 269703 80615 185180 319367
13570 319367 303528 159922 -78160 -124503 38905 -40083 57030 148426 91202 304909 264610
13559 264610 231436 91693 134473 347104 51645 -52034 313076 509042 310559 350005
13549 350005 206823 126948 282496 569991 364482 364133 493557 364189 286240 336506 357864
$$ packed form
13623G37380j22024j90210j26080o3311k2403j14529J01344k177l8789J0220j3691
13612A55730j72678j90666M9074N9825L0198p5026J26437J30581j30045n6974
13602g3544J89252R2849K7639j79635k26865K495K6823J26531K9772k23323J37133
13591g0873K3349K8935Q6971P9088r0019J6415k28578J2449n2422j2743R9828
13580a07600J40703K00325L15059k9233j49005o1695l8851j89088J04565J34187
13570C19367j5839j43606k38082m6343J63408p8988R7113R1396n7224K13707m0299
13559B64610l3174j39743M2780K12631k95459j03679L65110J95966j98483L9446
13549C50005j43182p9875J55548K87495k05509l49J29424j29368p7949N0266K1358
$$ plain form
13538 357864 496930 465295 16021 -79089 192344 281420 385766 509017 524310 371792
13528 371792 77977 -57294 108688 251737 -56508 -76620 88394 167023 159539 92284
13518 92284 173950 268830 236331 131671 -8430 -62336 -9093 -147437 -79175 155778 199120
13507 199120 55557 142804 251674 383769 459405 238450 -193879 -357451 -276679 -78312
13497 -78312 -7314 79697 372063 382510 440955 345462 277862 214858 149869 81279 -61770
13486 -61770 -21951 199790 344081 244625 148899 293551 264761 260933 166103 258777 279104
13475 279104 376618 627696 717307 810635 913110 973587 1225624 1167768 1252944 1488596 1506717
13464 1506717 1458313 1290834 1077217 942116 888968 1108237 1209750 1290900 1104427 906576
$$ packed form
13538C57864J39066l1635m49274r5110K71433Q9076J04346J23251J5293j52518
13528C71792k93815j35271J65982J43049l08245k0112J65014P8629p484o7255
13518I2284Q1666R4880l2499j04660j40101n3906N3243j38344O8262K34953M3342
13507A99120j43563Q7247J08870J32095P5636k20955m32329j63572Q0772J98367
13497g8312P0998Q7011K92366J0447N8445r5493o7600o3004o4989o8590j43049
13486f1770L9819K21741J44291r9456r5726J44652k8790l828r4830R2674K0327
13475B79104R7514K51078Q9611R3328J02475O0477K52037n7856Q5176K35652J8121
13464A506717m8404j67479k13617j35101n3148K19269J01513Q1150j86473j97851
$$ plain form
13454 906576 705580 680090 900670 659216 327065 129237 237179 331019 450630 584648
13444 584648 503944 428666 739315 962393 1014671 1240743 1529991 1492168 1236098 1170765
13434 1170765 1266651 1396686 1382312 1388460 1363531 1473289 1436565 1224565 1025716 832096
13424 832096 493747 455304 650376 698350 952369 1082052 1000177 965757 801665 580220
13414 580220 534148 227863 -45062 77083 -22798 -140809 -18090 9049 148759 189990
13404 189990 -20517 85351 145231 411262 285997 164550 138105 222733 85279 -139707
13394 -139707 -102144 9522 67301 126719 233217 142935 143318 214446 124643 -125179 -134175
13383 -134175 -438398 -454979 -243711 -49712 -88690 -186357 -228346 62088 180562 105750
$$ packed form
13454I06576k00996k5490K20580k41454l32151j97828J07942R3840J19611J34018
13444E84648q0704p5278L10649K23078N2278K26072K89248l7823k56070o5333
13434A170765R5886J30035j4374O148k4929J09758l6724k12000j98849j93620
13424H32096l38349l8443J95072M7974K54019J29683q1875l4420j64092k21445
13414E80220m6072l06285k72925J22145r9881j18011J22719K7139J39710M1231
13404A89990k10507J05868N9880K66031j25265j21447k6445Q4628j37454k24986
13394a39707L7563J11666N7779N9418J06498r0282L83P1128q9803k49822q996
13383a34175l04223j6581K11268J93999l8978r7667m1989K90434J18474p4812
$$ plain form
13373 105750 58452 -116170 -343017 -563117 -564605 -585000 -398949 -226381 -179986 -158985 -204123
13362 -204123 -313012 -412404 -338678 -437346 -245098 -119520 -35662 26312 139796 171748 73038
13351 73038 68566 57142 70233 11750 81998 94085 119 52923 211668 412375 170617
13340 170617 84980 141104 254740 -61551 -87815 -157020 -287082 -193307 136306 175008 -229384
13329 -229384 -330905 -128165 122235 288347 370277 363230 415475 109108 101309 157058 115563
13318 115563 24748 -106024 -324811 -439645 -175832 -143673 -236576 -226271 -277481 -397549
13308 -397549 -342281 -190438 -187652 -325824 -281245 -116628 -263927 -217371 -37339 226597
13298 226597 207768 137896 212846 -42517 -196492 -143621 36056 308828 26993 -258502
$$ packed form
13373A05750m7298j74622k26847k20100j488k0395J86051J72568M6395K1001m5138
13362b04123j08889r9392P3726r8668J92248J25578Q3858O1974J13484L1952r8710
13351G3038m472j1424J3091n8483P0248J2087r3966N2804J58745K00707k41758
13340A70617q5637N6124J13636l16291k6264o9205j30062R3775L29613L8702m04392
13329b29384j01521K02740K50400J66112Q1930p047N2245l06367p799N5749m1495
13318A15563r0815j30772k18787j14834K63813L2159r2903J0305n1210j20068
13308c97549N5268J51843K786j38172M4579J64617j47299M6556J80032K63936
13298B26597j8829o9872P4950k55363j53975N2871J79677K72772k81835k85495
$$ plain form
13288 -258502 -259560 -251125 -402532 -360151 -86793 60522 326603 226793 -38124 3074 35891
13277 35891 115567 115611 -111050 -253771 -287185 -116814 -306243 -213518 -119551 -77980 129239
13266 129239 67345 80351 -73445 -15069 3994 -24888 244977 293933 257340 465789 440992
13255 440992 398350 451549 391925 183214 197386 106483 128549 267090 341417 268779 74257
13244 74257 -158642 33877 91651 124812 114019 434806 541131 521376 727890 674135 508413
13233 508413 512985 315810 25963 -2885 54894 55381 50319 28208 16891 -133978 -124391 -65020
13221 -65020 -287159 -421626 -190811 143405 165445 104191 6678 -60935 -144765 -314511 -292544
13210 -292544 -54328 221825 88360 -89321 55043 27219 -64229 -185583 -225036 -99793
$$ packed form
13288b58502j058Q435j51407M2381K73358J47315K66081r9810k64917M1198L2817
13277C5891P9676M4k26661j42721l3414J70371j89429R2725R3967M1571K07219
13266A29239o1894J3006j53796N8376J9063k8882K69865M8956l6593K08449k4797
13255D40992m2642N3199n9624k08711J4172r0903K2066J38541P4327p2638j94522
13244G4257k32899J92519N7774L3161j0793L20787J06325j9755K06514n3755j65722
13233E08413M572j97175k89847k8848N7779M87n062k2111j1317j50869R587N9371
13221f5020k22139j34467K30815L34216K2040o1254r7513o7613q3830j69746K1967
13210b92544K38216K76153j33465j77681J44364k7824r1448j21354l9453J25243
$$ plain form
13200 -99793 42120 139481 -120698 -269278 -139448 54993 95029 -100841 -38005 -28577 -28909
13189 -28909 3032 -114264 -83936 -75383 164322 213576 -16318 -174634 108610 207917 155925
13178 155925 117928 50924 132369 287103 240711 -55704 -193250 -15970 -10091 745 33904
13167 33904 -215493 -301025 -192990 -67916 15529 -128020 -274526 -362887 -367336 -257529 -116660
13156 -116660 -60085 -110220 -189492 -258084 155933 301564 331722 236169 99941 66292 98737
13145 98737 115612 76446 158454 146029 -23582 148794 26198 -125425 -132812 -1406 -29741
13134 -29741 -69189 -32851 103469 58087 -74081 -92860 142657 89324 -160932 -114418 218822
13123 218822 343837 504383 275211 312854 49449 -47438 -175452 61121 334755 306789
$$ packed form
13200i9793J41913R7361k60179j48580J29830J94441M0036j95870O2836R428l32
13189b8909L1941j17296L0328Q553K39705M9254k29894j58316K83244R9307n1992
13178A55925l7997o7004Q1445J54734m6392k96415j37546J77280N879J0836L3159
13167C3904k49397q5532J08035J25074Q3445j43549j46506q8361m449J09807J40869
13156a16660N6575n0135p9272o8592M14017J45631L0158r5553j36228l3649L2445
13145I8737J6875l9166Q2008j2425j69611J72376j22596j51623p387J31406k8335
13134b9741l9448L6338J36320m5382j32168j8779K35517n3333k50256M6514L33240
13123B18822J25015J60546k29172L7643k63405r6887j28014K36573K73634k7966
$$ plain form
13113 306789 267145 101892 -104418 205172 355043 117615 -93876 -129920 48396 69160
13103 69160 188525 158936 175289 325502 236737 256455 290502 184656 154525 144365 139554
13092 139554 48463 31582 118237 353589 290635 149525 -133179 -223251 -122917 -137955 -257265
13081 -257265 -4284 197883 270969 381716 438553 436474 89977 -150097 -320295 -477222
13071 -477222 -431210 -274110 -152947 118944 283928 263895 -23692 97084 117306 209897
13061 209897 307945 264198 118714 4957 -105120 -62369 -32002 134951 361909 585781
13051 585781 804064 979968 1073152 1101945 843977 613666 392655 210148 399962 513092
13041 513092 519270 439662 558249 421836 268253 20846 134537 228653 246317 372755
$$ packed form
13113C06789l9644j65253k06310L09590J49871k37428k11491l6044J78316K0764
13103F9160J19365k9589J6353J50213q8765J9718L4047j05846l0131j0160m811
13092A39554r1091j6881Q6655K35352o2954j41110k82704r0072J00334j5038j19310
13081b57265K52981K02167P3086J10747N6837k079l46497k40074j70198j56927
13071d77222M6012J57100J21163K71891J64984k0033k87587J20776K0222R2591
13061B09897R8048m3747j45484j13757j10077M2751L0367J66953K26958K23872
13051E85781K18283J75904R3184K8793k57968k30311k21011j82507J89814J13130
13041E13092O178p9608J18587j36413j53583k47407J13691R4116J7664J26438
$$ plain form
13031 372755 328239 433721 415955 378598 365734 543337 652236 496927 449248 250150
13021 250150 371998 529848 441026 528883 532928 484128 454754 355561 378107 680724 995215
13010 995215 1420857 1957895 2360786 2523518 2467244 2089627 1742649 1368512 1025265 678327
13000 678327 495916 673482 563002 496134 490458 291364 333552 152538 66252 112338 291667
12989 291667 24035 88839 132351 146144 41490 186733 592948 506627 266915 270368 316051
12978 316051 281810 318709 343899 180013 293781 444044 516341 719425 727955 731410 641619
12967 641619 796957 1158997 1474509 1648453 1582568 1361206 1051568 906381 735195 567606
12957 567606 527776 353234 63539 203598 189137 84527 43973 61107 182425 102856
$$ packed form
13031C72755m4516J05482j7766l7357j2864J77603J08899j55309m7679j99098
13021B50150J21848J57850q8822Q7857M045m8800k9374r9193K2546L02617L14491
13010I95215M25642N37038M02891J62732n6274l77617l46978l74137l43247l46938
13000F78327j82411J77566j10480o6868n676j99094M2188j81014q6286M6086J79329
12989B91667k67632O4804M3512J3793j04654J45243M06215q6321k39712L453M5683
12978C16051l4241L6899K5190j63886J13768J50263P2297K03084Q530L455q9791
12967F41619J55338L62040L15512J73944o5885k21362l09638j45187j71186j67589
12957E67606l9830j74542k89695J40059j4461j04610m0554J7134J21318p9569
$$ plain form
12947 102856 6175 -42122 91041 -135595 -124216 -146820 -273067 -152175 -137267 -20474
12937 -20474 5955 -3201 -89257 -185060 -2083 35087 71912 206435 -41581 -462786 -561099
12926 -561099 -508291 -607582 -476684 -196932 38802 173244 42077 -38590 -42386 -106824 -218835
12915 -218835 -302284 -230063 -83700 -109436 -119121 -175931 -459770 -227603 -52453 71061 202129
12904 202129 189660 45498 -78247 -1042 40132 206926 98435 -15089 29624 -27521
12894 -27521 -171433 -158094 -104731 -170197 -296936 -26746 -8333 -36949 91242 225497 44301
12883 44301 -52412 -359491 -508285 -349329 -253020 -264695 -227327 -68592 -47067 55232 268980
12872 268980 344104 246422 107308 100628 207972 158828 212293 -21150 -149824 28859 335665
$$ packed form
12947A02856r6681m8297J33163k26636J1379k2604j26247J20892J4908J16793
12937b0474K6429r156q6056r5803J82977L7170L6825J34523k48016m21205r8313
12926e61099N2808r9291J30898K79752K35734J34442j31167q0667l796o4438j12011
12915b18835q3449P2221J46363k5736r685n6810k83839K32167J75150J23514J31068
12904B02129j2469j44162j23745P7205M1174J66794j08491j13524M4713n7145
12894b7521j43912J3339N3363o5466j26739K70190J8413k8616J28191J34255j81196
12883D4301r6713l07079j48794J58956R6309j1675L7368J58735K1525J02299K13748
12872B68980P5124r7682j39114o680J07344m9144N3465k33443j28674J78683L06806
$$ plain form
12861 335665 375166 463269 574169 534872 450159 147382 -56969 -184934 -193964 -414560 -177194
12850 -177194 -150279 52250 -51109 -307958 -379823 -330650 -373026 -159403 -46910 -105360
12840 -105360 -226088 73662 253927 352786 306464 58414 -228375 -248830 -194270 -86520
12830 -86520 -153563 -188590 50784 171781 207964 121303 23882 77452 102808 83605 257712
12819 257712 265478 105908 -78501 29356 -56165 -166106 -255572 -279603 -132203 -49295 18819
12808 18819 -35407 -23586 -266645 -62716 -94266 -332578 -139987 -61651 -116274 -16449 216160
12797 216160 369968 422669 360029 223555 64445 143367 101213 37380 181277 215451 155112
12786 155112 242101 280755 427034 351565 272016 238843 421107 427776 208676 -10420 -142150
$$ packed form
12861C35665L9501Q8103J10900l9297q4713l02777k04351j27965r030k20596K37366
12850a77194K6915K02529j03359k56849p1865M9173m2376K13623J12493n8450
12840a05360j20728K99750J80265R8859m6322k48050k86789k0455N4560J07750
12830h6520o7043l5027K39374J20997L6183q6661r7421N3570K5356j9203J74107
12819B57712P766j59570j84409J07857q5521j09941q9466k4031J47400Q2908O8114
12808A8819n4226J1821k43059K03929l1550k38312J92591P8336n4623R9825K32609
12797B16160J53808N2701o2640j36474j59110P8922m2154o3833J43897L4174o0339
12786A55112Q6989L8654J46279p5469p9549l3173J82264O669k19100k19096j31730
$$ plain form
12775 -142150 -210186 -314417 -390063 -172599 127426 35382 -141254 61819 424110 440662
12765 440662 131341 -11889 33031 -13574 3907 -61402 -97950 261207 205108 -145117 -303561
12754 -303561 -402976 -456764 -342555 -279767 -77930 578 -2067 -86566 -228489 4352 134622
12743 134622 113120 26160 60313 63007 -58843 109744 154924 228534 279314 229217 -26772
12732 -26772 25913 157200 180881 81957 21767 96879 56340 -114078 -324434 -257779 -9374
12721 -9374 37489 13922 -82392 -215111 -265276 -273729 -285 162631 31021 -104268 -157092
12710 -157092 101485 240668 350948 326792 122970 -186539 -64789 193583 217680 178415
12700 178415 351983 474811 447581 327577 342228 104984 -142663 -478933 -473079 -373755
$$ packed form
12775a42150o8036j04231p5646K17464L00025r2044j76636K03073L62291J6552
12765D40662l09321j43230M4920m6605J7481o5309l6548L59157n6099l50225j58444
12754c03561r9415n3788J14209O2788K01837P8508k645q4499j41923K32841J30270
12743A34622k1502q6960L4153K694j21850J68587M5180P3610N0780n0097k55989
12732b6772N2685J31287K3681r8924o0190P5112m0539j70418k10356O6655K48405
12721i374M6863k3567r6314j32719n0165q453K73444J62916j31610j35289n2824
12710a57092K58577J39183J10280k4156k03822l09509J21750K58372K4097l9265
12700A78415J73568J22828k7230j20004J4651k37244k47647l36270N854R9324
$$ plain form
12690 -373755 -193367 -373178 -384025 -276312 -209243 -332770 -326136 -135946 93145 146313
12680 146313 217757 136070 9148 53754 -171941 -148663 -158073 -356153 -547187 -305378 -321629
12669 -321629 -35949 86991 -257 -185692 -147376 -257340 -337963 -447657 -427321 -418195 -469120
12658 -469120 -408301 -397574 -267471 -232012 -263591 -130852 119657 329492 389237 491097
12648 491097 375919 288720 398167 386666 66316 -59213 -201680 -114331 -182673 -146876
12638 -146876 -122944 -178554 4582 114167 -4908 -196962 -99435 41535 67360 10568
12628 10568 77272 -24589 -271549 -258791 -213284 -71289 -168188 -309514 -274904 -88019 -88527
12617 -88527 -243127 -93196 241625 94987 -59164 -180392 -352703 -257928 -127059 -150181
$$ packed form
12690c73755J80388j79811j0847J07713O7069j23527O634J90190K29091N3168
12680A46313P1444q1687j26922M4606k25695K3278r410j98080j91034K41809j6251
12669c21629K85680J22940q7248j85435L8316j09964q0623j09694K0336R126n0925
12658d69120O0819J0727J30103L5459l1579J32739K50509K09835N9745J01860
12648D91097j15178q7199J09447j1501l20350j25529j42467Q7349o8342L5797
12638a46876K3932n5610J83136J09585j19075j92054R7527J40970K5825n6792
12628A0568O6704j01861k46960J2758M5507J41995r6899j41326L4610J86885n08
12617h8527j54600J49931L34821j46638j54151j21228j72311R4775J30869k3122
$$ plain form
12607 -150181 -306715 -351084 -483390 -277870 10318 -66935 -58105 -74255 -59114 67216 68261
12596 68261 186226 264766 125662 83050 99170 281149 335112 203195 84242 -124053
12586 -124053 -124641 81400 -59423 -298381 -186034 -99109 -190491 -217543 -257155 -228123 53386
12575 53386 -71699 -4937 227217 107222 -132053 33560 167529 189039 424923 398186
12565 398186 322329 236821 247356 107958 96731 288783 316474 219831 134799 75793 181369
12554 181369 378836 437630 363703 393295 393421 158062 86231 135603 -88887 -200725 -216293
12543 -216293 -249727 -229442 -353313 -86894 50433 194095 152922 -98279 -69916 -118455
12533 -118455 -226414 -143654 -123853 -85769 -89746 9019 95739 -100881 -64614 44064 -65190
$$ packed form
12607a50181j56534m4369j32306K05520K88188p7253Q830j6150J5141J26330J045
12596F8261J17965P8540j39104m2612J6120J81979N3963j31917j18953k08295
12586a24053n88K06041j40823k38958J12347Q6925r1382k7052l9612K9032K81509
12575E3386j25085O6762K32154j19995k39275J65613J33969K1510K35884k6737
12565C98186p5857q5508J0535j39398j1227J92052K7691r6643q5032n9006J05576
12554A81369J97467N8794p3927K9592J26k35359p1831M9372k24490j11838j5568
12543b16293l3434K0285j23871K66419J37327J43662m1173k51201K8363m8539
12533a18455j07959Q2760J9801L8084l977R8765Q6720j96620L6267J08678j09254
$$ plain form
12522 -65190 -129487 -202313 -17269 -2972 -25623 12392 156409 305735 263015 68946 -234035
12511 -234035 -253190 -94887 -11351 22500 -43034 -60472 308863 422341 16020 -177468
12501 -177468 -114770 -50049 -228889 -223114 -92508 -36535 -273870 -269418 2861 -67812 -57236
12490 -57236 103180 101601 242611 262158 132457 -25945 -54364 103736 243113 108161
12480 108161 -136764 -61038 221673 405145 97282 -48120 164325 268375 235094 82013
12470 82013 -181236 -233490 -161085 -265058 -236851 63378 67209 -140858 -113200 -59695 202927
12459 202927 150014 -26712 49832 -84901 -119476 -367110 -380411 -174695 -63878 -7146
12449 -7146 32328 459887 606766 473291 261519 181326 276026 9027 -240099 -253601 -121741
$$ packed form
12522f5190o4297p2826J85044J4297k2651L8015J44017J49326m2720j94069l02981
12511b34035j9155J58303Q3536L3851o5534j7438L69335J13478m06321j93488
12501a77468O2698O4721j78840N775J30606N5973k37335M452K72279p0673J0576
12490e7236J60416j579J41010J9547j29701j58402k8419J58100J39377j34952
12480A08161k44925P5726K82711J83472l07863j45402K12445J04050l3281j53081
12470H2013k63249n2254P2405j03973K8207L00229L831k08067K7658N3505K62622
12459B02927n2913j76726P6544j34733l4575k47634j3301K05716J10817N6732
12449g146L9474M27559J46879j33475k11772q0193R4700k66999k49126j3502J31860
$$ plain form
12438 -121741 -24018 60568 30230 -54349 79490 95947 69134 155947 241763 378811 472272
12427 472272 293320 228142 301481 98924 -202674 -250704 -238562 -101867 3255 51392
12417 51392 -71988 42395 -37275 267906 550135 541236 434394 296948 275154 67332
12407 67332 -45916 194062 227584 137723 105401 159750 206767 103302 40446 251396 291225
12396 291225 147736 -46955 -230480 -201206 -146420 -304508 -291545 -96786 -41309 -3120
12386 -3120 385 -16945 -61594 -167239 -270494 -176036 8499 169750 128969 101593 389615
12375 389615 304284 204755 236639 327409 361833 212299 277095 153017 59734 303570 279960
12364 279960 71563 222859 275123 136672 255374 163629 134830 209125 218837 350999 599583
$$ packed form
12438a21741R7723Q4586l0338q4579J33839J6457k6813Q6813Q5816J37048R3461
12427D72272j78952o5178P3339k02557l01598m8030J2142J36695J05122M8137
12417E1392j23380J14383p9670L05181K82229q899j06842j37446k1794k07822
12407F7332j13248K39978L3522q9861l2322N4349M7017j03465o2856K10950L9829
12396B91225j43489j94691j83525K9274N4786j58088J2963J94759N5477L8189
12386c120L505j7330m4649j05645j03255R4458J84535J61251m0781k7376K88022
12375C89615q5331r9529L1884R0770L4424j49534O4796j24078r3283K43836k3610
12364B79960k08397J51296N2264j38451J18702r1745k8799P4295R712J32162K48584
$$ plain form
12353 599583 455628 323690 253925 75168 18133 44247 -139614 147402 277906 358555
12343 358555 240481 388690 423622 347185 409187 322029 2308 -85294 7752 199218 402669
12332 402669 461862 486890 436480 262832 289812 303818 325004 308965 46505 -10391 -208156
12321 -208156 -236835 -286584 -228411 -326915 -295925 -151350 20725 -83944 4886 133498 14056
12310 14056 -69353 224290 375723 354008 287136 304643 195278 404154 488097 453356 454434
12299 454434 444313 299343 327438 330122 352538 473517 149139 20579 64790 217436 449243
12288 449243 685941 746897 572609 534314 868201 1140060 1112377 1406142 1823639 2541855
12278 2541855 3627690 5910981 9730806 15364778 19177353 15128727 8688132 4985782
$$ packed form
12353E99583j43955j31938o9765j78757n7035K6114j83861K87016J30504Q0649
12343C58555j18074J48209L4932p6437O2002q7158l19721q7602R3046J91466K03451
12332D02669N9193K5028n0410j73648K6980J4006K1186j6039k62460n6896j97765
12321b08156k8679m9749N8173r8504L0990J44575J72075j04669Q8830J28612j19442
12310A4056q3409K93643J51433k1715o6872J7507j09365K08876Q3943l4741J078
12299D54434j0121j44970K8095K684K2416J20979l24378j28560M4211J52646K31807
12288D49243K36698O0956j74288l8295L33887K71859k7683K93765M17497P18216
12278B541855J085835K283291L819825N633972L812575m048626o440595l702350
$$ plain form
12270 4985782 3294390 2309590 1859886 1435990 1278026 1401044 1299385 1056985 860482
12261 860482 837177 904825 752695 813958 745785 684054 350069 356784 501407 297569 -117017
12250 -117017 -158895 149844 429227 573728 580513 680579 552140 429713 503490 372623
12240 372623 353057 461590 592108 553715 343552 363052 416121 517059 678925 619104
12230 619104 436900 390288 444956 506611 479379 750495 799998 602838 611202 711625 913647
12219 913647 905221 715380 469989 417138 434670 572273 611169 824344 680972 584796 471425
12208 471425 726998 756039 696684 694269 637899 797751 910033 756858 637004 589571 454943
12197 454943 411107 546623 502158 416657 420597 522985 329809 252906 346527 484097 572143
$$ packed form
12270D985782j691392r84800m49704m23896j57964J23018j01659k42400j96503
12261H60482k3305O7648j52130O1263o8173o1731l33985O715J44623k03838m14586
12250a17017m1878L08739K79383J44501O785J00066j28439j22427P3777j30867
12240C72623j9566J08533J30518l8393k10163J9500N3069J00938J61866n9821
12230F19104j82204m6612N4668O1655k7232K71116M9503j97160Q364J00423K02022
12219I13647q426j89841k45391n2851J7532J37603L8896K13175j43372r6176j13371
12208D71425K55573K9041n9355k415n6370J59852J12282j53175j19854m7433j34628
12197D54943m3836J35516m4465q5501L940J02388j93176p6903R3621J37570Q8046
$$ plain form
12186 572143 614375 663961 876379 652625 243506 284835 359502 448723 590987 796897
12176 796897 680482 539093 734174 810556 667818 671571 748398 697542 707600 1066915 1354220
12165 1354220 984538 663656 345648 140887 324987 422679 440060 364631 463134 597417
12155 597417 521083 397230 446300 492946 595354 439136 617129 543066 514097 552360 275238
12144 275238 167660 260575 463981 643138 866396 1021120 983378 865807 830732 984209
12134 984209 971012 825984 802801 914245 867678 560913 473339 517870 605689 736077 810913
12123 810913 855995 980399 828948 909636 811623 847104 785809 823735 1068899 1332624 1424501
12112 1424501 1384172 1262155 1151379 880934 623206 812039 889642 802582 975224 1054430
$$ packed form
12186E72143M2232M9586K12418k23754m09119M1329P4667Q9221J42264K05910
12176G96897j16415j41389J95081P6382j42738L753P6827n0856J0058L59315K87305
12165A354220l69682l20882l18008k04761J84100R7692J7381p5429R8503J34283
12155E97417p6334j23853M9070M6646J02408j56218J77993p4063k8969L8263k77122
12144B75238j07578R2915K03406J79157K23258J54724l7742j17571l5075J53477
12134I84209j3197j45028k3183J11444m6567l06765q7574M4531Q7819J30388P4836
12123H10913M5082J24404j51451Q0688r8013L5481o1295L7926K45164K63725R1877
12112A424501m0329j22017j10776k70445k57728J88833P7603q7060J72642P9206
$$ plain form
12102 1054430 1186974 1196496 1130984 1084022 1031182 1275968 1411140 1309263 1332546 1288456 1425769
12091 1425769 1322331 1296023 1290122 1438802 1831502 1611985 1319205 1464942 1599004 1693927
12081 1693927 1737797 1603172 1729060 1604744 1747054 1824210 1803101 1716233 1524166 1495433
12071 1495433 1499596 1484076 1460968 1646645 1688325 1858332 1862214 1895782 1826492 1822961 2012388
12060 2012388 2126092 2147519 2195702 2280219 2189525 2174076 2210587 2347617 2232711 2054515
12050 2054515 2127700 2176489 2115657 2318804 2438657 2355716 2339053 2500538 2496407 2532879 2751754
12039 2751754 2637810 2699091 3062158 2923525 2920758 3151565 3334690 3329880 3357452 3325120 3405650
12028 3405650 3545212 3607255 3818049 3950558 3974998 3772187 3587423 3693002 3936729 4234590
$$ packed form
12102A054430J32544R522o5512m6962n2840K44786J35172j01877K3283m4090J37313
12091A425769j03438k6308n901J48680L92700k19517k92780J45737J34062R4923
12081A693927M3870j34625J25888j24316J42310P7156k1109q6868j92067k8733
12071A495433M163j5520k3108J85677M1680J70007L882L3568o9290l531J89427
12060B012388J13704K1427M8183Q4517r0694j5449L6511J37030j14906j78196
12050B054515P3185M8789o0832K03147J19853q2941j6663J61485m131L6472K18875
12039B751754j13944O1281L63067j38633k767K30807J83125m810K7572l2332Q0530
12028C405650J39562O2043K10794J32509K4440k02811j84764J05579K43727K97861
$$ plain form
12018 4234590 4471365 4589247 4488615 4339538 4358677 4556179 4851474 5045768 5195589 5475484
12008 5475484 5354351 5235751 5369923 5591524 5511407 5472176 5598653 5298097 5558725 5924894
11998 5924894 6398329 6780912 7109366 7170995 7366984 7508996 7955318 7995087 8061033 8359614
11988 8359614 8784360 9193274 9262869 9611550 9900452 10567311 10974873 11479181 11799200 12108902
11978 12108902 12535316 12915742 13446746 13956111 14566836 14966725 15667833 16296340 17071650
11969 17071650 17771007 18426688 19220385 20051890 20928282 21784204 22611140 24011028 25339689
11960 25339689 26819674 28199867 29671577 31295591 32885668 34783978 36897890 39110061
11952 39110061 41350070 43886520 46592057 49619982 52865903 56722204 61087000 65713647
$$ packed form
12018D234590K36775J17882j00632j49077J9139J97502K95295J94294J49821K79895
12008E475484j21133j18600J34172K21601q0117l9231J26477l00556K60628L66169
11998E924894M73435L82583L28454O1629J95989J42012M46322L9769O5946K98581
11988H359614M24746M08914O9595L48681K88902O66859M07562N04308L20019L09702
11978A2108902M26414L80426N31004N09365O10725L99889P01108O28507P75310
11969A7071650O99357O55681P93697Q31505Q76392Q55922Q26936J399888J328661
11960B5339689J479985J380193J471710J624014J590077J898310K113912K212171
11952C9110061K240009K536450K705537L027925L245921L856301M364796M626647
$$ plain form
11944 65713647 70658289 75938764 82298724 89372942 96957776 105060614 114346083 125157932
11936 125157932 137331350 150703195 165460499 181817399 199656646 218829055 239473965
11929 239473965 260918247 282848807 303992581 323590164 340411786 352990936 360603330
11922 360603330 362197226 357646650 347589763 332917711 314628890 294545135 273315282
11915 273315282 251838588 231011353 211260442 192998464 176203663 161080001 147380963
11908 147380963 134794350 123514497 113603629 104679703 96638190 89510470 82721614 76445868
11900 76445868 71126079 66375664 62125952 57930529 54076708 50793610 47942495 45183123
11892 45183123 42277353 39918508 37637066 35572270 33798530 32163849 30623154 29190140
$$ packed form
11944F5713647M944642N280475O359960P074218P584834Q102838R285469J0811849
11936A25157932J2173418J3371845J4757304J6356900J7839247J9172409K0644910
11929B39473965K1444282K1930560K1143774J9597583J6821622J2579150P612394
11922C60603330J593896m550576j0056887j4672052j8288821k0083755k1229853
11915B73315282k1476694k0827235j9750911j8261978j6794801j5123662j3699038
11908A47380963j2586613j1279853r910868q923926q041513p127720o788856o275746
11900G6445868n319789m750415m249712m195423l853821l283098k851115k759372
11892D5183123k905770k358845k281442k064796j773740j634681j540695j433014
$$ plain form
11884 29190140 27896921 26809012 25559318 24300597 23088160 22062101 21011192 20167187
11876 20167187 19574088 18715843 18164375 17517709 16770037 16073091 15381383 14668184 14295061
11867 14295061 14043141 13677596 13299649 12862639 12665830 12272554 11744228 11405750 11109929
11858 11109929 10838948 10497191 9949515 9660127 9368097 9069906 8882245 8727097 8366796
11849 8366796 8069566 8054523 7935735 7593014 7157495 7091467 7166619 6809518 6825282 6794833
11839 6794833 6540516 6296305 6142663 6017460 5909709 5727456 5749260 5645483 5330195 5197973
11829 5197973 5096134 4882201 4775736 4824491 4683083 4710229 4577990 4155059 4013177 4047396
11819 4047396 4186981 4298104 4398011 4469366 4183175 4080587 3843323 3874033 4005392 3984961
$$ packed form
11884B9190140j293219j087909j249694j258721j212437j026059j050909q44005
11876B0167187n93099q58245n51468o46666p47672o96946o91708p13199l73123
11867A4295061k51920l65545l77947m37010j96809l93276n28326l38478k95821
11858A1109929k70981l41757n47676k89388k92030k98191j87661j55148l60301
11849H366796k97230j5043j18788l42721m35519o6028P5152l57101J5764l0449
11839F794833k54317k44211j53642j25203j07751j82253K1804j03777l15288j32222
11829E197973j01839k13933j06465M8755j41408K7146j32239m22931j41882L4219
11819D047396J39585J11123R9907P1355k86191j02588k37264L0710J31359k0431
$$ plain form
11809 3984961 4020998 4108639 3862099 3472974 3372161 3566060 3709566 3510466 3218229 2990255
11799 2990255 2893914 2872782 3044446 3296972 3276659 3167879 3149035 3235795 3229381 3179496 3101411
11788 3101411 3026481 2787110 2712782 2789612 2996069 3076094 2811341 2888883 2852341 2729789
11778 2729789 2471443 2213329 2022917 1949267 2119046 2086424 2041029 1983889 1864400 1898689
11768 1898689 1996865 1855102 1939361 2182397 1885051 1496840 1567773 1658639 1766256 1687032
11758 1687032 1582475 1634098 1629021 1560398 1690883 1615566 1401026 1459836 1472691 1717486 1717344
11747 1717344 1617661 1825219 1889730 1853411 1752324 1588906 1454874 1287648 1179433 1487018
11737 1487018 1631189 1373865 1231945 1468842 1598608 1472759 1288666 1410423 1496493 1342090
$$ packed form
11809C984961L6037Q7641k46540l89125j00813J93899J43506j99100k92237k27974
11799B990255r6341k1132J71664K52526k0313j08780j8844Q6760o414m9885p8085
11788C101411p4930k39371p4328P6830K06457Q0025k64753P7542l6542j22552
11778B729789k58346k58114j90412p3650J69779l2622m5395n7140j19489L4289
11768A898689R8176j41763Q4259K43036k97346l88211P0933R0866J07617p9224
11758A687032j04557N1623n077o8623J30485p5317k14540N8810J2855K44795j42
11747A717344r9683K07558O4511l6319j01087j63418j34032j67226j08215L07585
11737A487018J44171k57324j41920K36897J29766j25849j84093J21757Q6070j54403
$$ plain form
11727 1342090 1042857 892849 724049 811474 803527 851087 808684 807237 735445 723108 899367
11716 899367 979422 836646 914695 683543 802665 907115 1094295 1098450 965081 774350
11706 774350 984890 1183738 927571 1034752 1128381 1255981 1344844 1269102 1332462 1265691
11696 1265691 1106561 796637 883315 1096368 1007311 1001292 917875 780120 776902 682608 586951
11685 586951 893443 936421 625478 396838 700747 843494 805965 809454 815654 755513 425250
11674 425250 374986 556460 849875 824429 884648 869960 796506 823291 722238 482016 467349
11663 467349 616127 819273 787069 775780 711620 622899 741702 719952 410982 504402 473216
11652 473216 524058 678430 641315 503051 604929 871076 1074810 955340 792535 513682
$$ packed form
11727A342090k99233j50008j68800Q7425p947M7560m2403j447p1792j2337J76259
11716H99367Q0055j42776P8049k31152J19122J04450J87180M155j33369j90731
11706G74350K10540J98848k56167J07181R3629J27600Q8863p5742O3360o6771
11696A265691j59130l09924Q6678K13053q9057o019q3417j37755l218r4294r5657
11685E86951L06492M2978l10943k28640L03909J42747l7529L489O200o0141l30263
11674D25250n0264J81474K93415k5446O0219j4688p3454K6785j01053k40222j4667
11663D67349J48778K03146l2204j1289o4160q8721J18803k1750l08970R3420l1186
11652D73216N0842J54372l7115j38264J01878K66147K03734j19470j62805k78853
$$ plain form
11642 513682 420154 467607 554549 723565 941918 798062 817362 440478 230782 283608
11632 283608 21650 104665 114653 186510 288880 213587 246190 369204 323484 215983 123109
11621 123109 304047 428053 498592 431825 341259 492647 786183 682286 670505 615445
11611 615445 449362 342945 439894 278176 226068 399395 398836 372654 237294 287850 416442
11600 416442 542967 786488 718582 770112 796285 575920 605886 534516 346514 358738 533409
11589 533409 495898 466178 405771 215984 232774 205664 215040 94954 38939 253070 186013
11578 186013 213365 473960 519694 343672 170508 -6106 31115 466303 418755 256567
11568 256567 313384 175094 -86250 -219918 -128793 -240722 65363 99787 -170 -61133
$$ packed form
11642E13682r3528M7453Q6942J69016K18353j43856J9300l76884k09696N2826
11632B83608k61958Q3015R988P1857J02370p5293L2603J23014m5720j07501r2874
11621A23109J80938J24006P0539o6767r0566J51388K93536j03897j1781n5060
11611F15445j66083j06417R6949j61718n2108J73327n59k6182j35360N0556J28592
11600D16442J26525K43521o7906N1530K6173k20365K9966p1370j88002J2224J74671
11589E33409l7511k9720o0407j89787J6790k7110R376j20086n6015K14131o7057
11578A86013K7352K60595M5734j76022j73164j76614L7221M35188m7548j62188
11568B56567N6817j38290k61344j33668R1125j11929L06085L4424r9957o0963
$$ plain form
11558 -61133 -14342 -6373 6088 68640 234880 -8770 -57108 240744 436069 306315 178815
11547 178815 353150 311127 112725 233426 246734 305952 300039 47438 -139716 -233938 -41019
11536 -41019 82982 198516 192517 227273 223741 148044 236495 310713 519500 467823 232152
11525 232152 117034 126507 50908 -5822 123590 393126 468587 269854 145192 95398 -15754
11514 -15754 143180 143948 45315 259078 478265 336000 354144 489965 510080 535013 475370
11503 475370 239368 72646 168668 314808 421082 511380 540967 398775 510933 658947
11493 658947 567615 517696 442677 303550 173222 -31785 -80687 79116 273202 204107
11483 204107 158738 207653 314927 311496 400593 344661 80967 31859 207865 371722 312549
$$ packed form
11558f1133M6791P969J2461O2552J66240k43650m8338K97852J95325j29754j27500
11547A78815J74335m2023j98402J20701J3308N9218n913k52601j87154r4222J92919
11536d1019J24001J15534n999L4756l532p5697Q8451P4218K08787n1677k35671
11525B32152j15118R473p5599n6730J29412K69536P5461j98733j24662m9794j11152
11514a5754J58934P68r8633K13763K19187j42265J8144J35821K0115K4933n9643
11503D75370k36002j66722R6022J46140J06274R0298K9587j42192J12158J48014
11493F58947r1332m9919p5019j39127j30328k05007m8902J59803J94086o9095
11483B04107m5369M8915J07274l431Q9097n5932k63694m9108J76006J63857n9173
$$ plain form
11472 312549 184943 464438 482168 254840 203797 286224 371714 228835 177803 156019 278375
11461 278375 219322 169287 227930 363566 483122 459973 460437 504099 450667 331658 376180
11450 376180 370207 192024 160727 260835 15183 -195639 55012 177594 417227 367260
11440 367260 89188 -213904 -229566 310123 254680 -61949 -36226 60888 14023 -45512 -252902
11429 -252902 -251703 -31002 1185 32659 171003 180536 169688 111466 100246 367594 313808
11418 313808 -57363 -337408 -347705 -323106 -347960 -187836 -139361 -310383 -391877 -10827
11408 -10827 170191 206072 118839 69610 -133690 -223786 -84897 151339 288766 320398 245451
11397 245451 71704 -38354 -70124 -73818 -131253 -104766 -10262 13337 647 10416 74954
$$ packed form
11472C12549j27606K79495J7730k27328n1043Q2427Q5490j42879n1032k1784J22356
11461B78375n9053n0035N8643J35636J19556k3149M64M3662n3432j19009M4522
11450C76180n973j78183l1297J00108k45652k10822K50651J22582K39633m9967
11440C67260k78072l03092j5662N39689n5443l16629K5723R7114m6865n9535k07390
11429b52902J199K20701L2187L1474J38344R533j0848n8222j1220K67348n3786
11418C13808l71171k80045j0297K4599k4854J60124M8475j71022q1494L81050
11408a0827J81018L5881q7233m9229k03300r0096J38889K36236J37427L1632p4947
11397B45451j73747j10058l1770l694n7435K6487R4504K3599j2690R769O4538
$$ plain form
11386 74954 160391 107961 112042 106479 -15025 -298620 -253121 -162154 -60516 -23981 180406
11375 180406 22489 -56237 25084 19956 -177944 -279509 -301573 -153569 -90020 60933 170503
11364 170503 231950 329006 460844 451179 364986 27125 25612 299523 290839 327546 261401
11353 261401 105457 78231 374938 274634 33990 71653 -6271 -97507 -29755 159237
11343 159237 205355 154616 81405 14747 61934 145031 293989 314011 137908 -241727 -430884
11332 -430884 -495779 -354293 -207401 -212655 112710 255245 352835 380639 315339 166924 -281
11321 -281 -56640 -39550 -40036 -86244 -35054 -22136 -125464 -35405 61216 248991 120977 197900
11309 197900 88629 11624 -179738 -284455 -160808 123851 -136273 -240723 -256990 -310303
$$ packed form
11386G4954Q5437n2430M081n563j21504k83595M5499R0967J01638L6535K04387
11375A80406j57917p8726Q1321n128j97900j01565k2064J48004O3549J50953J09570
11364A70503O1447R7056J31838r665q6193l37861j513K73911q684L6707o6145
11353B61401j55944k7226K96707j00304k40644L7663p7924r1236O7752J88992
11343A59237M6118n0739p3211o6658M7187Q3097J48958K0022j76103l79635j89157
11332d30884o4895J41486J46892n254L25365J42535R7590K7804o5300j48415j67205
11321b81n6359J7090m86m6208N1190J2918j03328R0059R6621J87775j28014P6923
11309A97900j09271p7005j91362j04717J23647K84659k60124j04450j6267n3313
$$ plain form
11299 -310303 -36150 105094 -3277 -34011 -101175 -38599 -45585 -188921 -106762 -37717 -160590
11288 -160590 -121971 70764 142299 -16844 -103791 -298127 -74902 156742 316145 110436
11278 110436 232382 591683 345061 85200 -121958 -275998 -129651 -106111 -52023 -263784
11268 -263784 -380059 -443569 -509122 -118889 78253 182024 -30267 17897 99744 340308
11258 340308 380130 219013 372669 311675 162287 249592 126714 -56035 -203638 -178518
11248 -178518 -96944 170711 379391 294138 406439 353324 304301 218486 257692 342092 193423
11237 193423 -22869 -276015 -442591 -504958 -288016 -178411 -218093 -180900 -62797 42010
11227 42010 -997 -43211 -36579 -102787 -124453 -108557 -19128 -116226 -104568 -144200 -175523 -40789
$$ packed form
11299c10303K74153J41244j08371l0734o7164O2576o986j43336Q2159O9045j22873
11288a60590L8619J92735P1535j59143q6947j94336K23225K31644J59403k05709
11278A10436J21946L59301k46622k59861k07158j54040J46347K3540N4088k11761
11268b63784j16275o3510o5553L90233J97142J03771k12291M8164Q1847K40564
11258C40308L9822j61117J53656o0994j49388Q7305j22878j82749j47603K5120
11248a78518Q1574K67655K08680q5253J12301n3115m9023q5815L9206Q4400j48669
11237A93423k16292k53146j66576o2367K16942J09605l9682L7193J18103J04807
11227D2010m3007m2214O632o6208k1666J5896Q9429r7098J1658l9632l1323J34734
$$ plain form
11215 -40789 123312 265781 348087 76662 -9071 127849 169193 156402 320198 277829 38841
11204 38841 -155930 -67151 79196 -101084 -81952 -25381 65 -140671 -20661 35652 -59368
11193 -59368 -155911 -86655 87339 170884 250923 50512 -303559 -477319 -285680 -318381 -158972
11182 -158972 115046 59265 -80219 2540 18132 107361 149882 -6791 11124 91010 -34744
11171 -34744 66805 -38009 -79581 29449 54243 85323 4373 23004 11045 -16512 -17259
11160 -17259 93895 -79244 -46799 207216 41833 223315 471781 368269 60115 -25033
11150 -25033 47888 120700 -6188 -129059 -52885 13239 -257420 -352656 -365024 -149981 11179
11139 11179 126534 -13159 -130865 -33147 67479 -76865 -118384 -301660 -170451 -74909
$$ packed form
11215d0789J64101J42469Q2306k71425q5733J36920M1344j2791J63796m2369k38988
11204C8841j94771Q8779J46347j80280J9132N6571K5446j40736J20010N6313r5020
11193e9368r6543O9256J73994Q3545Q0039k00411l54071j73760J91639l2701J59409
11182a58972K74018n5781j39484Q2759J5592Q9229M2521j56673J7915P9886j25754
11171c4744J01549j04814m1572J09030K4794L1080q0950J8631j1959k7557p47
11160a7259J11154j73139L2445K54015j65383J81482K48466j03512l08154q5148
11150b5033P2921P2812j26888j22871P6174O6124k70659r5236j2368K15043J61160
11139A1179J15355j39693j17706R7718J00626j44344m1519j83276J31209R5542
$$ plain form
11129 -74909 -188836 -74529 -129117 -329419 -113017 -56345 -240229 -114280 2789 -71552
11119 -71552 -88198 -96879 -24066 158781 244578 93331 -57139 134621 157734 38521 -155828
11108 -155828 -137771 -294762 -234024 -318012 -293906 -111087 -51743 -275285 -390570 -271618
11098 -271618 -243932 -148059 -125597 -111304 91940 120699 -6413 -33080 -89343 -262206 -274194
11087 -274194 -219682 -141750 -232582 -47592 -76585 -307671 47669 221938 10079 -172696
11077 -172696 -222412 -133125 -59314 -396 -49531 57315 224837 43361 -104046 -141528 -108366
11066 -108366 -280927 -339056 -286172 -159715 6672 86689 54367 234790 228690 275260 -13638
11055 -13638 -247938 -77652 349166 522705 480282 436123 442619 578612 608409 800631 1038434
$$ packed form
11129g4909j13927J14307n4588k00302K16402N6672j83884J25949J17069p4341
11119g1552j6646q681P2813J82847Q5797j51247j50470J91760K3113j19213j94349
11108a55828J8057j56991O0738q3988K4106J82819N9344k23542j15285J18952
11098b71618K7686R5873K2462J4293K03244K8759j27112k6667n6263j72863j1988
11087b74194N4512P7932r0832J84990k8993k31086L55340J74269k11859j82775
11077a72696m9716Q9287P3811N8918m9135J06846J67522j81476j47407l7482L3162
11066a08366j72561n8129N2884J26457J66387Q0017l2322J80423o100M6570k88898
11055a3638k34300J70286M26818J73539m2423m4159O496J35993K9797J92222K37803
$$ plain form
11044 1038434 841802 587124 530174 377066 323702 555665 541713 464557 618660 1063395
11034 1063395 1403141 1607791 1608552 1501019 1328005 1335387 1204808 1255738 1346715 1340205 1334493
11023 1334493 1481857 1911325 2427144 2708694 2491389 1934024 1615888 1512765 1503768 1580358
11013 1580358 1530091 1596004 1709102 1769342 2000109 1771392 1584994 1523251 1459486 1067176
11003 1067176 743451 337970 284285 305875 326034 553930 808627 644243 307230 174906
10993 174906 35560 34350 -63362 -45535 -113512 -85717 -221278 -199520 -117340 -75591 -231386
10982 -231386 -205558 -112795 -214466 -344564 -393804 -346843 -605375 -731005 -477964 -303909
10972 -303909 -202751 -130842 41163 -122712 -64936 30631 -34763 -30526 -98610 -41600 16630
$$ packed form
11044A038434j96632k54678n6950j53108n3364K31963j3952p7156J54103M44735
11034A063395L39746K04650P61j07533j73014P382j30579N0930R0977o510n712
11023A334493J47364M29468N15819K81550k17305n57365l18136j03123q997P6590
11013A580358n0267O5913J13098O0240K30767k28717j86398o1743o3765l92310
11003A067176l23725m05481n3685K1590K0159K27896K54697j64384l37013j32324
10993A74906j39346j210r7712J7827o7977K7795j35561K1758Q2180M1749j55795
10982b31386K5828R2763j01671j30098m9240M6961k58532j25630K53041J74055
10972c03909J01158P1909J72005j63875N7776R5567o5394M237o8084N7010N8230
$$ plain form
10961 16630 53180 -105238 -394084 -272981 -17643 136081 167996 138417 85102 202706
10951 202706 231512 -144082 -228860 -446060 -218422 8230 -153166 -311137 -112916 -128543
10941 -128543 -197607 -362832 -239714 -200619 -235093 -118133 -160514 -156539 -147366 -328332 -351801
10930 -351801 -317508 -382468 -361341 -462151 -357437 -166148 34849 -5879 -190607 -324437
10920 -324437 -278190 173958 333874 85770 -121979 -377873 -141329 -77596 73139 119974
10910 119974 111697 172491 129425 315541 264564 184557 199145 166987 168295 53858 10914
10899 10914 -32239 -9757 143373 235938 287618 369738 310761 356013 350027 339379 226572
10888 226572 178857 29123 -71525 3680 -75696 -71660 -61972 46250 212943 337509 263943
$$ packed form
10961A6630L6550j58418k88846J21103K55338J53724L1915k9579n3315J17604
10951B02706K8806l75594q4778k17200K27638K26652j61396j57971J98221j5627
10941a28543o9064j65225J23118L9095l4474J16960m2381L975R173j80966k3469
10930c51801L4293o4960K1127j00810J04714J91289K00997m0728j84728j33830
10920c24437M6247M52148J59916k48104k07749k55894K36544O3733J50735M6835
10910A19974q277O0794m3066J86116n0977q0007J4588l2158J308j14437m2944
10899A0914m3153K2482J53130R2565N1680Q2120n8977M5252n986j0648j12807
10888B26572m7715j49734j00648P5205p9376M036R688J08222J66693J24566p3566
$$ plain form
10877 263943 -118030 -125650 115252 356621 242343 68482 163919 302737 283656 340213
10867 340213 484185 494835 217127 218845 538135 501513 223807 393392 555870 247384
10857 247384 272407 280144 160043 110598 75895 131432 315970 491678 595830 577585 240999
10846 240999 215799 255614 307505 250720 191111 203719 46339 -83134 -35432 9173 170966
10835 170966 289653 366800 399396 323139 245314 25216 -64492 83598 405059 460358 349153
10824 349153 269370 128523 79000 413827 386237 362696 35450 165555 208714 14726
10814 14726 -77765 -45767 81847 24419 -170690 -316644 -139978 -44298 -142910 -254296 -71966
10803 -71966 -15373 -29007 178240 215610 340602 262543 150884 131467 293775 226666 51799
$$ packed form
10877B63943l81973p620K40902K41369j14278j73861R5437J38818j9081N6557
10867C40213J43972J0650k77708J718L19290l6622k77706J69585J62478l08486
10857B47384K5023P737j20101m9445l4703N5537J84538J75708J04152j8245l36586
10846B40999k5200L9815N1891n6785n9609J2608j57380j29473M7702M4605J61793
10835A70966J18687P7147L2596p6257p7825k20098q9708J48090L21461N5299j11205
10824C49153p9783j40847m9523L34827k7590k3541l27246J30105M3159j93988
10814A4726r2491L1998J27614n7428j95109j45954J76666R5680r8612j11386J82330
10803g1966N6593j3634K07247L7370J24992p8059j11659j9417J62308o7109j74867
$$ plain form
10792 51799 -187045 -332667 -222771 -213063 -257262 -228818 -305974 -206622 -117325 52818 238099
10781 238099 -65374 -123529 -39372 39554 238848 254278 143326 28634 -50437 -39828 -6858
10770 -6858 -98492 -104576 38160 232626 671537 933584 847185 649983 252983 127141 265899
10759 265899 275506 95933 159416 315471 179043 2356 54488 156170 71154 21794 39603
10748 39603 -94390 -138731 -186966 -21473 20638 37267 84421 86526 -12401 -216172 -325734
10737 -325734 -137858 -37930 38552 95890 316803 679793 814617 683831 523141 497045
10727 497045 244041 132634 289036 512033 541677 505155 446224 398276 574418 535711
10717 535711 297634 166023 62635 267194 244273 415501 335112 473588 490978 420098
$$ packed form
10792E1799k38844j45622J09896R708m4199K8444p7156R9352Q9297J70143J85281
10781B38099l03473n8155Q4157P8926J99294J5430j10952j14692p9071J0609L2970
10770f858r1634o084J42736J94466M38911K62047q6399j97202l97000j25842J38758
10759B65899R607j79573O3483J56055j36428j76687N2132J01682q5016m9360J7809
10748C9603j33993m4341m8235J65493M2111J6629M7154K105r8927k03771j09562
10737c25734J87876R9928P6482N7338K20913L62990J34824j30786j60690k6096
10727D97045k53004j11407J56402K22997K9644l6522n8931m7948J76142l8707
10717E35711k38077j31611j03388K04559k2921J71228q0389J38476J7390p0880
$$ plain form
10707 420098 609308 515511 470970 503503 751085 609319 432066 329934 513858 466890
10697 466890 128413 320776 722058 603436 282322 -37969 2726 306700 266153 -2895
10687 -2895 61870 384035 656655 692672 695579 723774 868335 819913 550085 386537 373100
10676 373100 271661 271539 217173 299489 440011 545586 626145 524271 399712 157011 312871
10665 312871 505731 524337 468563 598187 712691 917932 1085164 1152268 1182546 1163898
10655 1163898 1382787 1687205 1863837 2203463 2192779 2071262 2286737 2537419 2630614 2460354
10645 2460354 2240437 2303107 2389428 2639275 2700212 2875772 3152940 3445252 3649009 4162799
10635 4162799 4806854 5552031 6278888 7372967 8823449 10106711 10809298 11473835 11993756
$$ packed form
10707D20098J89210r3797m4541L2533K47582j41766j77253j02132J83924m6968
10697D66890l38477J92363M01282j18622l21114l20291M0695L03974m0547k69048
10687b895O4765L22165K72620L6017K907K8195J44561m8422k69828j63548j3437
10676C73100j01439j22n4366Q2316J40522J05575Q0559j01874j24559k42701J55860
10665C12871J92860J8606n5774J29624J14504K05241J67232O7104L0278j8648
10655A163898K18889L04418J76632L39626j0684j21517K15475K50682R3195j70260
10645B460354k19917O2670Q6321K49847O0937J75560K77168K92312K03757N13790
10635D162799O44055P45177P26857J094079J450482J283262P02587O64537N19921
$$ plain form
10626 11993756 12765724 14262389 16286651 19173865 23439710 29116891 36894945 47328068
10618 47328068 61316054 79331258 101118456 123996400 141263777 147160543 142077261
10611 142077261 132369052 124620911 122574469 127675262 141148988 164762143 199809184
10604 199809184 245000705 291562510 322455523 322061203 294503314 259564907 232107623
10597 232107623 217877493 217973092 233192452 264296817 311683234 370607098 426975433
10590 426975433 455775406 436934293 381402394 318983763 269098752 236730118 221169489
10583 221169489 220254121 233138819 258148659 290893276 319749995 327053137 302409321
10576 302409321 255583110 207279821 169644212 144940933 131186214 125887732 127725044
$$ packed form
10626A1993756P71968J496665K024262K887214M265845N677181P778054J0433123
10618D7328068J3987986J8015204K1787198K2877944J7267377N896766n083282
10611A42077261r708209p748141k046442N100793J3473726K3613155L5047041
10604A99809184M5191521M6561805L0893013l94320k7557889l4938407k7457284
10597B32107623j4230130R5599J5219360L1104365M7386417N8923864N6368335
10590D26975433K8799973j8841113n5531899o2418631m9885011l2368634j5560629
10583B21169489r15368J2884698K5009840L2744617K8856719P303142k4643816
10576C02409321m6826211m8303289l7635609k4703279j3754719n298482J837312
$$ plain form
10569 127725044 134555347 143664762 149790434 146126691 130635814 107652448 84286610
10562 84286610 64776171 50432918 40112784 32531728 27064557 22971406 19860005 17486129
10554 17486129 15600324 14122942 12549120 11180323 10171830 9241614 8568588 7727183
10546 7727183 6990420 6561020 6108419 5687469 5400605 4976725 4634364 4498584 4366325
10537 4366325 4269952 4061045 3802265 3744127 3753833 3676916 3469540 3181200 3251103 3303010 3240276
10526 3240276 3146834 3079857 2868554 2755443 2662181 2587776 2627263 2595411 2656098 2334583 2118170
10515 2118170 2107660 2006816 1935927 1994052 1945688 1993265 1924245 1855477 1871156 1728178 1597931
10504 1597931 1498834 1353889 1145390 1427105 1585573 1407735 1242855 1425628 1272942 1006080
$$ packed form
10569A27725044O830303R109415O125672l663743j5490877k2983366k3365838
10562H4286610j9510439j4343253j0320134p581056n467171m093151l111401k373876
10554A7486129j885805j477382j573822j368797j008493r30216o73026q41405
10546G727183p36763m29400m52601m20950k86864m23880l42361j35780j32259
10537D366325r6373k08907k58780n8138R706p6917k07376k88340O9903N1907o2734
10526C240276r3442o6977k11303j13111r3262p4405L9487l1852O0687l21515k16413
10515B118170j0510j00844p0889N8125m8364M7577o9020o8768J5679j42978j30247
10504A597931r9097j44945k08499K81715J58468j77838j64880J82773j52686k66862
$$ plain form
10494 1006080 915642 1251296 1233579 1111747 1013796 921759 958523 840482 902374 925694 748626
10483 748626 904930 1224460 1354266 1414245 1242210 1013567 890638 909806 684291 715914
10473 715914 980395 1060067 1112265 1214478 1147989 1042200 975918 825921 612982 634756
10463 634756 795491 818693 761531 812517 1102857 1342027 1360058 1527491 1540812 1322279
10453 1322279 1229436 1265750 1163211 924074 702025 838638 884388 968173 1109188 1198016
10443 1198016 1313821 1209155 1198563 907079 871088 933213 1009122 1016798 872644 791733 653981
10432 653981 924917 967773 668300 678067 674482 698630 702788 669390 593115 399589 289662
10421 289662 483185 623991 570727 788139 833561 607773 487698 737715 916729 1016158
$$ packed form
10494A006080r0438L35654j7717j21832r7951r2037L6764j18041O1892K3320j77068
10483G48626J56304L19530J29806N9979j72035k28643j22929J9168k25515L1623
10473G15914K64481P9672N2198J02213o6489j05789o6282j49997k12939K1774
10463F34756J60735K3202n7162N0986K90340K39170J8031J67433J3321k18533
10453A322279r2843L6314j02539k39137k22049J36613M5750Q3785J41015Q8828
10443A198016J15805j04666j0592k91484l5991O2125P5909P676j44154q0911j37752
10432F53981K70936M2856k99473R767l585K4148M158l3398p6275j93526j09927
10421B89662J93523J40806n3264K17412M5422k25788j20075K50017J79014R9429
$$ plain form
10411 1016158 1014074 831634 514332 385669 219478 366981 622611 615277 769638 605294
10401 605294 97559 10567 190896 294693 72215 4204 345214 494706 655938 514795
10391 514795 166524 269907 234995 333917 278784 299044 366576 357368 365803 142142 -13539
10380 -13539 74610 223172 -28605 -88287 -179937 -61396 277817 419275 499957 493639 363094
10369 363094 414415 625298 586850 537020 192420 176094 196897 141359 246000 251160 146976
10358 146976 90332 143167 -34832 -161354 13887 373579 554632 576690 370979 118262
10348 118262 307749 412018 684177 759141 646896 530660 566133 423747 446793 511996
10338 511996 466411 480230 404079 279172 296295 249476 374278 621866 643777 492542 419360
$$ packed form
10411A016158k084j82440l17302j28663j66191J47503K55630p334J54361j64344
10401F05294n07735q6992J80329J03797k22478o8011L41010J49492J61232j41143
10391E14795l48271J03383l4912R8922n5133K0260O7532r208Q435k23661j55681
10380a3539Q8149J48562k51777n9682r1650J18541L39213J41458Q0682o318j30545
10369C63094N1321K10883l8448m9830l44600j6326K0803n5538J04641N160j04184
10358A46976n6644N2835j77999j26522J75241L59692J81053K2058k05711k52717
10348A18262J89487J04269K72159P4964j12245j16236L5473j42386K3046O5203
10338E11996m5585J3819p6151j24907J7123m6819J24802K47588K1911j51235p3182
$$ plain form
10327 419360 360130 286637 284136 280755 85771 118171 90103 41430 190401 244092 186423
10316 186423 -63580 -253378 -148540 89859 181625 154310 89193 101756 7373 -397725
10306 -397725 -183654 -51736 66413 245676 349086 143470 71158 196705 105605 98701
10296 98701 55070 -5093 210852 323498 77468 -66714 -82796 -4641 59577 165414 96281
10285 96281 16534 266187 388994 404894 303926 -42026 -10877 93740 103624 206570 227884
10274 227884 133646 -178701 -142632 -135931 -170390 -26771 200819 291496 687 -180538 -26059
10263 -26059 27390 99736 196111 179248 -89796 -64577 -65824 -112242 -163941 -173313 -208630 -183844
10251 -183844 -260644 -223296 -142929 35831 66305 -74777 -110042 66666 491453 314545
$$ packed form
10327D19360n9230p3493k501l381j94984L2400k8068m8673J48971N3691n7669
10316A86423k50003j89798J04838K38399R1766k7315o5117J2563r4383m05098
10306c97725K14071J31918J18149J79263J03410k05616p2312J25547r1100o904
10296I8701m3631o0163K15945J12646k46030j44182j6082P8155O4218J05837o9133
10285I6281p9747K49653J22807J5900j00968l45952L1149J04617R884J02946K1314
10274B27884r4238l12347L6069O701l4459J43619K27590R0677k90809j81225J54479
10263b6059N3449P2346R6375j6863k69044K5219j247m6418n1699r372l5317K4786
10251a83844p6800L7348Q0367J78760L0474j41082l5265J76708M24787j76908
$$ plain form
10241 314545 52397 30903 -47629 -165813 -13981 122142 81981 -26083 93518 156347
10231 156347 100282 80129 252609 315594 377274 337045 349505 378295 432388 405195 397052
10220 397052 257210 183950 455646 328678 189022 103721 149230 216788 176725 314211
10210 314211 455196 356359 164350 56408 53976 30750 -2228 199943 215940 147358 270909
10199 270909 223964 149210 -12891 4141 -170925 -192186 168114 263819 66545 -5899 297083
10188 297083 365337 158105 119312 131056 240253 343325 526000 496848 591902 389591
10178 389591 162158 489953 759704 776838 669133 605483 366025 340682 639318 677024
10168 677024 712081 1054219 1310817 1723513 1877649 1716001 1287152 934621 932949 1136367
$$ packed form
10241C14545k62148k1494p8532j18184J51832J36123m0161j08064J19601O2829
10231A56347n6065k0153J72480O2985O1680m0229J2460K8790N4093k7193q143
10220C97052j39842p3260K71696j26968j39656q5301M5509O7558m0063J37486
10210C14211J40985r8837j92009j07942k432k3226l2978K02171J5997o8582J23551
10199B70909m6945p4754j62101J7032j75066k1261L60300R5705j97274p2444L02982
10188B97083O8254k07232l8793J1744J09197J03072J82675k9152R5054k02311
10178C89591k27433L27795K69751J7134j07705o3650k39458k5343K98636L7706
10168F77024L5057L42138K56598M12696J54136j61648m28849l52531j672K03418
$$ plain form
10158 1136367 1207740 1229815 1668539 2076784 2315008 2409076 2494315 2211336 1883393 1694468
10148 1694468 1421622 1256625 1180426 1002207 1157892 1767311 1948229 1863733 1687687 1317204
10138 1317204 941158 745820 599982 648567 812644 831573 816774 859488 967330 1002990
10128 1002990 952094 820452 688547 531444 581964 583126 363309 272371 434397 411895
10118 411895 445694 477242 401561 474036 370079 301548 83060 64002 200839 300347 685329
10107 685329 749068 468249 216115 42936 -81245 13463 -165488 -101913 -87986 229918
10097 229918 391555 217289 17215 -112932 -267568 -370937 -340119 -274401 -216175 -178703
10087 -178703 -147301 -85394 7918 -18254 -98528 -220430 -69777 -94601 -73073 -25006 -36630
$$ packed form
10158A136367P1373K2075M38724M08245K38224R4068Q5239k82979l27943j88925
10148A694468k72846j64997p6199j78219J55685O09419J80918q4496j76046l70483
10138A317204l76046j95338j45838M8585J64077J8929j4799M2714J07842L5660
10128A002990n0896j31642j31905j57103N0520J162k19817r0938J62026k2502
10118D11895L3799L1548p5681P2475j03957o8531k18488j9058J36837R9508L84982
10107F85329O3739k80819k52134j73179j24181R4708j78951O3575J3927L17904
10097B29918J61637j74266k00074j30147j54636j03369L0818O5718N8226L7472
10087a78703L1402O1907R3312k6172q0274j21902J50653k4824K1528M8067j1624
$$ plain form
10076 -36630 -22866 7114 -127475 -167960 -116813 -168001 -79951 48746 68206 369726 384966
10065 384966 357375 165433 9144 -54608 -4642 -61614 -45764 -152630 -81867 139597 43761
10054 43761 -190265 -420351 -266962 -153727 -86229 83780 -153828 -239212 48964 193364
10044 193364 146968 164550 234185 213485 254242 201962 146986 136140 -57373 75014 241878
10033 241878 286653 144269 -30398 14645 289224 381391 423320 444030 439145 428011 253042
10022 253042 255540 317162 383966 489460 466524 281906 -12602 -320841 -487307 -233557
10012 -233557 -57770 -253896 -231048 -21021 -26761 -118781 107039 201656 243164 371041 376417
10001 376417 273890 290967 223428 318923 337073 310964 412231 499805 402074 290220 -5192
$$ packed form
10076c6630J3764K9980j34589m0485N1147n1188Q8050J28697J9460L01520J5240
10065C84966k7591j91942j56289o3752M9966n6972J5850j06866P0763K21464r5836
10054D3761k34026k30086J53389J13235O7498J70009k37608q5384K88176J44400
10044A93364m6396J7582O9635k0700M0757n2280n4976j0846j93513J32387J66864
10033B41878M4775j42384j74667M5043K74579R2167M1929K0710m885j1134j74969
10022B53042K498O1622O6804J05494k2936j84618k94508l08239j66466K53750
10012b33557J75787j96126K2848K10027n740r2020K25820R4617M1508J27877N376
10001C76417j02527J7077o7539R5495J8150k6109J01267Q7574r7731j11854k95412
$$ plain form
9990 -5192 -169600 -110812 15087 -67713 8439 11756 64914 240394 364738 288610 -95387
9979 -95387 -187859 11424 -20554 -130720 -221844 -75358 -9538 -16939 -107481 -87230 84405
9968 84405 7505 -132744 -237 101221 225562 120478 113676 142205 235130 339926 443723
9957 443723 446644 243326 144754 -137403 -236724 89957 324202 340616 170475 108025 73144
9946 73144 44931 98048 32968 -2384 -59537 9454 -44573 207855 279785 83690 -102619
9935 -102619 -154842 -8622 175746 98880 84845 -27858 -120727 -14815 -61279 21779 145253
9924 145253 188110 54776 -51733 28771 92549 -96057 -88525 -208650 17830 94977 10451
9913 10451 -43665 48925 146833 -36294 -42912 13131 69642 91333 172443 343980 385788 103388
$$ packed form
9990e192j64408N8788J25899q2800P6152L317N3158J75480J24344p6128l83997
9979i5387r2472J99283l1978j10166r1124J46486O5820p401r0542K0251J71635
9968H4405p6900j40249J32507J01458J24341j05084o802K8529R2925J04796J03797
9957D43723K921k03318r8572k82157r9321L26681K34245J6414j70141o2450l4881
9946G3144k8213N3117o5080l5352n7153O8991n4027K52428P1930j96095j86309
9935a02619n2223J46220J84368p6866j4035j12703r2869J05912m6464Q3058J23474
9924A45253M2857j33334j06509Q0504O3778j88606P532j20125K26480P7147q4526
9913A0451n4116R2590R7908j83127o618N6043N6511K1691Q1110J71537M1808k82400
$$ plain form
9901 103388 -25666 -232796 -413587 -486182 -318393 -49887 -120311 -194865 -279115 -152737
9891 -152737 -24971 16467 147771 155128 201784 211839 236901 210317 21822 -4465 156955
9880 156955 -155188 -159807 -90943 -33711 -22592 -6732 210154 413909 234854 307173 37247
9869 37247 -200746 -264786 -179250 -27887 42441 -855 20052 93835 376775 359238 22500
9858 22500 -116819 -178151 -57043 84752 202757 123231 10188 20576 228118 79680
9848 79680 -86393 -201861 -5612 176471 73320 -51085 59877 13067 -48395 -216621
9838 -216621 -302041 -156112 82171 49334 40750 37525 -36352 -344335 -629116 -441764 -252055
9827 -252055 -399942 -424275 -253742 -188413 38757 41641 -97422 -73453 -172635 -328632 -66719
$$ packed form
9901A03388j29054k07130j80791p2595J67789K68506p0424p4554q4250J26378
9891a52737J27766M1438J31304P357M6656J0055K5062k6584j88495k6287J61420
9880A56955l12143m619O8864N7232J1119J5860K16886K03755j79055P2319k69926
9869C7247k37993o4040Q5536J51363P0328m3296K0907P3783K82940j7537l36738
9858B2500j39319o1332J21108J41795J18005p9526j13043J0388K07542j48438
9848G9680j66073j15468J96249J82083j03151j24405J10962m6810o1462j68226
9838b16621q5420J45929K38283l2837q584l225p3877l07983k84781J87352J89709
9827b52055j47887k4333J70533O5329K27170K884j39063K3969r9182j55997K61913
$$ plain form
9816 -66719 101776 119301 103208 173856 206510 87536 139831 148588 -44913 -210903 -110046
9805 -110046 -201079 -240721 -183823 -118871 21656 42582 -209160 -337424 -143644 13997 96201
9794 96201 18850 101084 179765 258920 -82803 -351377 -245616 -50179 76480 154208 335219
9783 335219 126513 -112042 -27210 174186 199829 259700 279231 273771 113363 -50434 -351749
9772 -351749 -258354 -129482 106936 123364 147905 57392 123158 319915 256215 186410 60676
9761 60676 -47762 -182558 -251978 -36477 -63792 -66834 -116179 9937 -21073 -126578 -130596
9750 -130596 -130821 -375549 -152709 47941 -74011 -235639 -118941 -101416 78510 213169
9740 213169 62132 -201200 -323142 -434241 -461290 -679745 -699392 -496815 -259469 -110125
$$ packed form
9816f6719J68495J7525j6093P0648L2654j18974N2295Q757j93501j65990J00857
9805a10046r1033l9642N6898O4952J40527K0926k51742j28264J93780J57641Q2204
9794I6201p7351Q2234P8681P9155l41723k68574J05761J95437J26659P7728J81011
9783C35219k08706k38555Q4832K01396K5643N9871J9531n460j60408j63797l01315
9772c51749R3395J28872K36418J6428K4541r0513O5766J96757o3700o9805j25734
9761F0676j08438j34796o9420K15501k7315l042m9345J26116l1010j05505m018
9750a30596k25k44728K22840K00650j21952j61628J16698J7525J79926J34659
9740B13169j51037k63332j21942j11099k7049k18455j9647K02577K37346J49344
$$ plain form
9730 -110125 46702 158697 -73292 -126965 -99562 -185520 -263330 -155673 120029 250903
9720 250903 301873 186067 27216 -55756 -176719 -250039 -339868 -257427 -269716 -449161 -413719
9709 -413719 -207558 -89172 -79927 24512 15858 135314 278946 302113 277785 166110 215143
9698 215143 174285 -169155 -354978 -114961 -360021 -577556 -379348 -326680 -38658 -92327
9688 -92327 -39473 -136227 -283091 -215060 54577 128372 122544 -19619 22716 112589 29946
9677 29946 76817 208864 131641 -33385 -161301 3409 213587 174119 -123200 -166522 -116676
9666 -116676 -204456 -377372 -303382 -76583 42118 -37637 -88115 -237488 -290721 -3776 403544
9655 403544 673147 676897 899006 1491007 1983567 2467558 1908843 1058950 668718 408042
$$ packed form
9730a10125J56827J11995k31989n3673K7403q5958p7810J07657K75702J30874
9720B50903N0970j15806j58851q2972j20963p3320q9829Q2441j2289j79445L5442
9709d13719K06161J18386R245J04439q654J19456J43632K3167k4328j11675M9033
9698B15143m0858l43440j85823K40017k45060k17535J98208N2668K88022n3669
9688i2327N2854r6754j46864O8031K69637P3795n828j42163M2335Q9873q2643
9677B9946M6871J32047p7223j65026j27916J64710K10178l9468k97319m3322M9846
9666a16676q7780j72916P3990K26799J18701p9755n0478j49373n3233K86945M07320
9655D03544K69603L750K22109N92001M92560M83991n58715q49893l90232k60676
$$ plain form
9645 408042 245946 169611 -68426 -215675 -402016 -415534 -450794 -230386 -33570 -81611
9635 -81611 -198815 -229396 -296415 -265554 -82177 -191719 -326675 -323299 -259388 -62482 161082
9624 161082 124196 -150108 -208581 20349 151171 70061 -32154 -112162 -111839 -984 34518
9613 34518 70697 -47965 -135682 -30666 -242513 -188097 -205645 -160792 56609 215937 156657
9602 156657 219849 170627 102331 120194 91955 35732 145597 198936 158677 -143165 -125199
9591 -125199 41832 25096 -193634 -289177 -320668 -123086 72880 112637 -120069 -105474 68244
9580 68244 -43502 -374512 -188145 -34381 -196694 -240399 -93349 66089 151241 84802
9570 84802 -93886 -456193 -454793 -227749 -15457 -44560 -143143 18506 -2968 -162532 -191437
$$ packed form
9645D08042j62096p6335k38037j47249j86341j3518l5260K20408J96816m8041
9635h1611j17204l0581o7019L0861J83377j09542j34956L376O3911J96906K23564
9624A61082l6886k74304n8473K28930J30822q1110j02215q0008L23J10855L5502
9613C4518L6179j18662q7717J05016k11847N4416j7548M4853K17401J59328n9280
9602A56657O3192m9222o8296J7863k8239n6223J09865N3339m0259l01842J7966
9591a25199J67031j6736k18730r5543l1491J97582J95966L9757k32706J4595J73718
9580F8244j11746l31010J86367J53764j62313m3705J47050J59438Q5152o6439
9570H4802j78688l62307J400K27044K12292k9103r8583J61649k1474j59564k8905
$$ plain form
9559 -191437 -357282 -217316 -41244 53942 240078 467709 260933 129471 217532 137386
9549 137386 106048 8415 -78333 -196542 -369843 -425008 -483513 -522025 -368863 -196383 55473
9538 55473 30714 -146080 -228268 -339600 -222842 -164318 -230946 -196394 -33323 -42670 -152955
9527 -152955 -291426 -438587 -259125 -171743 -178201 -183600 -103689 112940 300588 208388 230223
9516 230223 37851 -232397 -309517 -163184 -55432 35678 106993 -95501 -261747 -180590
9506 -180590 -44682 134988 -19302 -92352 -257799 -100373 -55862 -219691 -324413 -361744
9496 -361744 -409642 -328074 -134345 2352 5993 54675 137758 -123035 -270907 -376528 -564074
9485 -564074 -696731 -536301 -388516 -289333 -309896 -378066 -678783 -692135 -394285 -183977
$$ packed form
9559a91437j65845J39966J76072R5186J86136K27631k06776j31462Q8061q0146
9549A37386l1338r7633q6748j18209j73301n5165n8505l8512J53162J72480K51856
9538E5473k4759j76794q2188j11332J16758N8524o6628L4552J63071r347j10285
9527a52955j38471j47161J79462Q7382o458n399P9911K16629J87648r2200K1835
9516B30223j92372k70248p7120J46333J07752R1110P1315k02494j66246Q1157
9506a80590J35908J79670j54290p3050j65447J57426M4511j63829j04722l7331
9496c61744m7898Q1568J93729J36697L641M8682Q3083k60793j47872j05621j87546
9485e64074j32657J60430J47785R9183k0563o8170l00717j3352K97850K10308
$$ plain form
9475 -183977 -264106 -95991 44380 -82044 -197495 -342692 -208086 -213494 -270352 -101177
9465 -101177 -57064 -145957 -167628 -297857 -423340 -253557 -258771 -293590 -139333 -190059 -143242
9454 -143242 150265 109630 -105792 -124167 -173591 -102083 13973 -72023 20760 219915 229906
9443 229906 288006 109414 115448 120030 42801 -138701 -243312 -284462 -154136 84835 112717
9432 112717 190651 178843 -57635 -136962 -19810 327681 333500 -4167 -225714 -164204 -293716
9421 -293716 -190985 -258474 -165208 -84828 -45399 77044 147810 174727 -124314 -53422 -67802
9410 -67802 -89177 -67300 -242944 -238658 -188679 -33541 111576 -48195 -133374 -205177 -175629
9399 -175629 -532575 -671842 -370998 -152459 -232811 -51834 -61615 -223901 30351 165766
$$ packed form
9475a83977q0129J68115J40371j26424j15451j45197J34606n408n6858J69175
9465a01177M4113q8893k1671j30229j25483J69783n214l4819J54257n0726M6817
9454a43242K93507m0635k15422j8375m9424P1508J16056q5996R2783J99155R991
9443B29906N8100j78592O034M582p7229j81502j04611m1150J30326K38971K7882
9432A12717P7934j1808k36478p9327J17152L47491N819l37667k21547O1510j29512
9421b93716J02731o7489R3266Q0380L9429J22443P0766K6917k99041P0892j4380
9410f7802k1375K1877j75644M286M9979J55138J45117j59771q5179p1803K9548
9399a75629l56946j39267L00844K18539q0352J80977r781j62286K54252J35415
$$ plain form
9389 165766 -63683 68557 -39742 -245255 -212043 -132480 -59729 -122743 -100345 163743 138252
9378 138252 -30605 136725 364687 225557 307042 413964 333012 233895 -14869 -82189
9368 -82189 -339699 -337195 -328666 -229135 -321275 -400011 -366949 -118562 27053 241491 216915
9357 216915 -54337 -33237 14121 82592 39171 -159984 -463940 -458099 -96526 -106073 29772
9346 29772 36311 -88988 -79033 -45374 -126794 -19214 -5340 -197642 -161152 -163984 -139477 -89013
9334 -89013 -82961 -45419 -19589 81792 171596 196289 218374 397818 468582 176850 -81712
9323 -81712 93933 83090 18004 98657 191381 251008 263332 -2065 -234590 -115054 -30295
9312 -30295 68365 40332 144417 278801 401510 108955 -154847 -163344 -77478 -150103 -230568
$$ packed form
9389A65766k29449J32240j08299k05513L3212P9563P2751o3014K2398K64088k5491
9378A38252j68857J67330K27962j39130Q1485J06922q0952r9117k48764o7320
9368h2189k57510K504Q529R9531r2140p8736L3062K48387J45615K14438k4576
9357B16915k71252K1100M7358O8471m3421j99155l03956N841L61573r547J35845
9346B9772O539j25299R955L3659q1420J07580J3874j92302L6490k832K4507N0464
9334h9013O052L7542K5830J01381Q9804K4693K2085J79444P0764k91732k58562
9323h1712J75645j0843o5086Q0653R2724N9627J2324k65397k32525J19536Q4759
9312c0295R8660k8033J04085J34384J22709k92555k63802q497Q5866p2625q0465
$$ plain form
9301 -230568 -170310 -222640 36740 138478 213724 173416 110394 161245 312753 485609 379501
9290 379501 254086 299214 234868 360599 592161 740678 411175 261737 167899 320245
9280 320245 559327 766068 832481 740567 506820 295110 199402 -229437 -232499 -130612 -267458
9269 -267458 -403377 -421953 -342534 -84515 155885 -2758 -143516 97641 291234 187697
9259 187697 185150 315535 410726 291726 209691 110651 66591 143789 78058 26811 -28950
9248 -28950 167288 262528 57910 -98274 -113306 236273 669035 1000867 1045244 1337202
9238 1337202 1624408 1886543 1758417 1453349 1314933 1075697 944585 748497 591967 459868
9228 459868 322184 219531 224880 168766 -72784 93843 143098 35818 -121817 -112080 -278143
$$ packed form
9301b30568O0258n2330K59380J01738P5246m0308o3022N0851J51508J72856j06108
9290C79501j25415M5128o4346J25731K31562J48517l29503j49438r3838J52346
9280C20245K39082K06741O6413r1914k33747k11710r5708m28839l062J01887j36846
9269b67458j35919j8576P9419K58019K40400j58643j40758K41157J93593j03537
9259A87697k547J30385R5191j19000q2035r9040m4060P7198o5731n1247n5761
9248b8950J96238R5240k04618j56184j5032L49579M32762L31832M4377K91958
9238A337202K87206K62135j28126l05068j38416k39236j31112j96088j56530j32099
9228D59868j37684j02653N349n6114k41550J66627M9255j07280j57635R737j66063
$$ plain form
9217 -278143 -188012 87491 246158 341208 120445 127755 101422 238165 47692 -68483 -214743
9206 -214743 -252105 48476 259648 388337 444393 361010 363269 675052 771016 719056 748129
9195 748129 972553 1171567 1334611 1502549 1458261 1395224 1130610 969429 678921 568326
9185 568326 534809 584422 338657 386353 490728 384716 341117 291596 -12470 -113830 -116932
9174 -116932 -172989 -185132 -296474 -431330 -458253 -143432 -18059 75993 3034 -141300 -118116
9163 -118116 210499 276041 141975 -18091 -185303 91054 171875 196165 281171 325911 331388
9152 331388 173206 430413 864503 940245 895622 861875 617494 507087 546324 671216
9142 671216 632845 469436 162864 196287 219709 33038 -31179 -65447 21321 -80924 -80694
$$ packed form
9217b78143R0131K75503J58667R5050k20763P310k6333J36743j90473j16175j46260
9206b14743l7362L00581K11172J28689N6056q3383K259L11783R5964n1960K9073
9195G48129K24424J99014J63044J67938m4288o3037k64614j61181k90508j10595
9185E68326l3517M9613k45765M7696J04375j06012m3599m9521l04066j01360l102
9174a16932n6057j2143j11342j34856k6923L14821J25373R4052p2959j44334K3184
9163a18116L28615O5542j34066j60066j67212K76357Q0821K4290Q5006M4740N477
9152C31388j58182K57207M34090P5742m4623l3747k44381j10407L9237J24892
9142F71216l8371j63409l06572L3423K3422j86671o4217l4268Q6768j02245K30
$$ plain form
9131 -80694 -48895 -120564 -146561 -293017 -106585 -28826 104284 -8124 -95836 5182 -324810
9120 -324810 -373495 -369736 -110504 -119197 -249950 -254955 -235124 -240915 -170613 30485 -97356 -378064
9108 -378064 -415312 -244290 -250218 -498056 -307219 92281 68144 125217 213802 165156 198029
9097 198029 335568 318844 184231 117282 106410 130300 195822 338364 290781 336004 587524
9086 587524 539187 282663 166389 44641 -36119 -14973 44425 46842 348783 353720 174026
9075 174026 341859 382484 96886 -96228 -26660 -96590 -5754 -35106 95518 143276 131524
9064 131524 337060 372108 441718 409803 498076 478821 469285 408470 111391 -355562 -286516
9053 -286516 209731 11686 -176665 -108697 5452 199434 69624 -373415 -192885 27012
$$ packed form
9131h0694L1799p1669k5997j46456J86432P7759J33110j12408q7712J01018l29992
9120c24810m8685L759K59232q693j30753n005J9831n791P0302K01098j27841k80708
9108c78064l7248J71022n928k47838J90837L99500k4137N7073Q8585m8646L2873
9097A98029J37539j6724j34613o6949j0872K3890O5522J42542m7583M5223K51520
9086E87524m8337k56524j16274j21748q0760K1146N9398K417L01941M937j79694
9075A74026J67833M0625k85598j93114O9568o9930R0836k9352J30624M7758j1752
9064A31524K05536L5048O9610l1915Q8273j9255r536o0815k97079m66953O9046
9053b86516M96247j98045j88351O7968J14149J93982j29810m43039J80530K19897
$$ plain form
9043 27012 136011 -74767 -38624 -74047 -74282 -65738 -85606 159342 210528 15294 -48673 54454
9031 54454 216508 -61149 -252256 -385442 -294933 -116555 108761 222427 220094 331682
9021 331682 344049 302505 233437 118077 -263863 -328900 -85905 241152 167969 191232 151159
9010 151159 51790 -14276 -265456 -176648 69624 150286 50985 -87382 31532 -55898 35783
8999 35783 69280 -69795 -200987 116059 201001 38636 108720 76276 83656 198372 315888
8988 315888 396489 116723 41177 62303 62874 52868 270946 233204 273242 122283 36421
8977 36421 43891 -94819 -26138 -163571 -335787 -277032 -295035 -227836 30150 178202 340597
8966 340597 242514 132993 -168654 -382663 -247839 -255827 -333215 -337973 -223527 -253355 -183931
$$ packed form
9043B7012J08999k10778L6143l5423k35Q544j9868K44948N1186j95234o3967J03127
9031E4454J62054k77657j91107j33186R0509J78378K25316J13666k333J11588
9021C31682J2367m1544o9068j15360l81940o5037K42995L27057p3183K3263m0073
9010A51159r9369o6066k51180Q8808K46272Q0662r9301j38367J18914q7430R1681
8999C5783L3497j39075j31192L17046Q4942j62365P0084l2444P380J14716J17516
8988C15888Q0601k79766p5546K1126N71j0006K18078l7742M0038j50959q5862
8977C6421P470j38710O8681j37433j72216N8755j8003O7199K57986J48052J62395
8966C40597r8083j09521l01647k14009J34824p988p7388m758J14446k9828O9424
$$ plain form
8955 -183931 -156935 -292824 -425697 -231411 -261293 18742 323103 168959 4584 67169
8945 67169 158664 100559 59753 77252 83483 -45400 -125637 -44917 -161865 -389824 -220774
8934 -220774 -177512 -390742 -565081 -592176 -232937 139744 265469 80219 -25312 37726
8924 37726 60401 5673 -48831 -58346 -207832 -443114 -579561 -225016 45955 -28077 -36120
8913 -36120 -167912 -299953 -211528 -176044 -226885 2722 89866 -31981 -175702 -226700 -254777
8902 -254777 -534705 -523052 -246140 8591 -117974 -176049 -109218 27798 196093 11257
8892 11257 -320023 -251357 -57036 -40903 -205806 -253913 -315 -5259 -68733 -117109 -221176
8881 -221176 -172028 -148948 -14077 99049 179395 358100 372723 265880 127669 -78941
$$ packed form
8955a83931K6996j35889j32873J94286k9882K80035L04361j54144j64375O2585
8945F7169R1495n8105m0806J7499O231j28883q0237Q0720j16948k27959J69050
8934b20774M3262k13230j74339k7095L59239L72681J25725j85250j05531O3038
8924C7726K2675n4728n4504r515j49486k35282j36447L54545K70971p4032q043
8913c6120j31792j32041Q8425L5484n0841K29607Q7144j21847j43721n0998k8077
8902b54777k79928J1653K76912K54731j26565n8075O6831J37016J68295j84836
8892A1257l31280O8666J94321J6133j64903m8107K53598m944o3474m8376j04067
8881b21176M9148K3080J34871J13126Q0346J78705J4623j06843j38211k06610
$$ plain form
8871 -78941 24601 138893 -59916 -104103 -129328 -174553 -348054 -186167 52388 223154
8861 223154 275996 245421 182787 38616 167391 285055 364837 104693 20635 308362 314592
8850 314592 -64764 -177952 -98967 146253 66713 -51055 3862 8522 130988 287328 209845
8839 209845 408118 317088 130539 -162696 -34575 179421 236254 37014 -255001 -94027
8829 -94027 232448 372606 169449 -57686 -119689 92458 43821 -81420 -147670 -171059 -302106
8818 -302106 -207570 161085 191583 139634 80238 180984 90992 82392 86782 142366 113500 101060
8806 101060 113623 14393 -219630 -141571 163279 321748 589084 513993 369471 269214
8796 269214 8967 91806 -29334 -205509 -108312 143041 -77607 -541749 -662031 -562396
$$ packed form
8871g8941J03542J14292j98809m4187k5225m5225j73501J61887K38555J70766
8861B23154N2842l0575o2634j44171J28775J17664P9782k60144q4058K87727O230
8850C14592l79356j13188P8985K45220p9540j17768N4917M660J22466J56340p7483
8839B09845J98273r1030j86549k93235J28121K13996N6833j99240k92015J60974
8829i4027L26475J40158k03157k27135o2003K12147m8637j25241o6250k3389j31047
8818c02106R4536L68655L0498n1949n9396J00746q9992q600M390N5584k8866j2440
8806A01060J2563r9230k34023P8059L04850J58469K67336p5091j44522j00257
8796B69214k60247Q2839j21140j76175R7197K51353k20648m64142j20282R9635
$$ plain form
8786 -562396 -260227 -230437 -111583 -97647 -288258 -180857 60452 -191001 -118915 74205
8776 74205 26525 27016 276484 468954 505291 223755 287305 230446 87653 102582 -31734
8765 -31734 56042 117582 28789 -87932 -123911 47790 191790 278118 162669 78041 -73869
8754 -73869 -143184 -220474 -232463 -103912 100657 61367 -78434 -223392 -207765 -209908 -223763
8743 -223763 -198327 -377483 -482159 -357539 -254968 -318696 -262115 -70253 -134114 -408264
8733 -408264 -468943 -289050 -228884 -259643 -88545 -51920 14301 32119 114438 -13140 -275340
8722 -275340 -388547 -227255 -252388 -328845 -238897 -11729 118946 -4032 -257672 -231030
8712 -231030 -316132 -164901 22703 -2892 102649 -80952 -92860 -33334 78789 123630 -40768
$$ packed form
8786e62396L02169K9790J18854J3936j90611J07401K41309k51453P2086J93120
8776G4205m7680M91K49468J92470L6337k81536O3550n6859j42793J4929j34316
8765c1734Q7776O1540q8793j16721l5979J71701J44000Q6328j15449q4628j51910
8754g3869o9315p7290j1989J28551K04569l9290j39801j44958J5627k143j3855
8743b23763K5436j79156j04676J24620J02571o3728N6581J91862o3861k74150
8733d08264o0679J79893O0166l0759J71098L6625O6221J7818Q2319j27578k62200
8722b75340j13207J61292k5133p6457Q9948K27168J30675j22978k53640K6642
8712b31030q5102J51231J87604k5595J05541j83601j1908N9526J12123M4841j64398
$$ plain form
8701 -40768 -111126 -231389 -463265 -388996 -201751 -240799 -395360 -122185 -83248 -127560 31482
8690 31482 62469 -15558 99204 101599 58052 -85441 -404519 -514338 -283130 -282134 -234854
8679 -234854 -332321 -114760 8565 61211 129611 242077 178538 60081 36106 -196829 -327002
8668 -327002 -257101 -314962 -355639 -162404 -207545 -371391 -314286 -118842 174228 556772 472700
8657 472700 232082 99411 -83907 66041 55735 81981 157873 -75664 -176073 -70233
8647 -70233 91774 142058 118417 -60715 -11014 -169538 -255260 -249109 -195916 -122240 -90837
8636 -90837 -129615 7438 36551 62263 215101 287305 -13330 -203951 120903 317589 522028
8625 522028 873272 831086 499041 528916 618678 544985 329014 334 -201675 -243423 -80271
$$ packed form
8701d0768p0358j20263k31876P4269J87245l9048j54561K73175L8937m4312J59042
8690C1482L0987p8027J14762K395m3547j43493l19078j09819K31208R96M7280
8679b34854r7467K17561J23325N2646O8400J12466o3539j18457k3975k32935j30173
8668c27002O9901n7861m0677J93235m5141j63846N7105J95444K93070L82544q4072
8657D72700k40618j32671j83318J49948j0306K6246P5892k33537j00409J05840
8647g0233J62007N0284k3641j79132M9701j58524q5722O151N3193P3676L1403
8636i0837l8778J37053K9113K5712J52838P2204l00635j90621L24854J96686K04439
8625E22028L51244m2186l32045K9875Q9762p3693k15971l28680k02009m1748J63152
$$ plain form
8614 -80271 -36072 -25865 -62591 43726 134350 184801 280128 231827 -96603 -314294 -189245
8603 -189245 3036 -114452 -103172 240170 415614 385189 423823 402278 476890 520118 575764
8592 575764 656336 699863 649711 843459 862498 884124 1031602 937812 821244 676746 533486
8581 533486 573126 393897 144088 219191 362664 309018 -32734 -2552 290488 631916
8571 631916 295735 86133 173407 303227 346808 248190 90114 24582 -228503 -208003 -287443
8560 -287443 -296175 50168 198024 360694 282301 240912 -71150 -264920 -338852 -421685 -480496
8549 -480496 -215293 -153445 -98234 -113612 -31948 -40957 -71500 149991 327816 176706 130372
8538 130372 56516 -81321 -240831 -258500 3605 -140892 -278482 -58530 108790 92588
$$ packed form
8614h0271M4199J0207l6726J06317R0624N0451R5327m8301l28430k17691J25049
8603a89245J92281j17488J1280L43342J75444l0425L8634k1545P4612M3228N5646
8592E75764Q0572M3527n0152J93748J9039K1626J47478r3790j16568j44498j43260
8581E33486L9640j79229k49809P5103J43473n3646l41752L0182K93040L41428
8571F31916l36181k09602Q7274J29820M3581r8618j58076o5532k53085K0500p9440
8560b87443q732L46343J47856J62670p8393m1389l12062j93770p3932q2833n8811
8549d80496K65203O1848N5211j5378Q1664r009l0543K21491J77825j51110m6334
8538A30372p3856j37837j59510j7669K62105j44497j37590K19952J67320j6202
$$ plain form
8528 92588 -81374 -337980 -278508 -133807 379 -28717 40961 -94647 -251372 -147792
8518 -147792 -284384 -249944 -148020 -164364 -278080 -151582 -74046 -55754 19275 -74640 -341452
8507 -341452 -402614 -282064 -91541 -29843 -21351 -237715 -230643 -215091 20768 184177 259842
8496 259842 184820 -56563 -254837 -157032 -78362 53671 115910 -131585 -253683 -67166
8486 -67166 197773 312644 173701 -50462 -191492 -158045 -172429 -66854 -105596 -176382 -160067
8475 -160067 71818 67619 190796 341276 162072 4581 -265814 -427361 -337279 -76857
8465 -76857 138566 -143226 -126958 61524 -41351 54015 38471 89254 215879 364222 404865
8454 404865 415430 223415 -117464 -34947 -110335 -386843 -427318 -223309 -25515 121349
$$ packed form
8528I2588j73962k56606N9472J44701J34186k9096O9678j35608j56725J03580
8518a47792j36592L4440J01924j6344j13716J26498P7536J8292P5029r3915k66812
8507c41452o1162J20550J90523O1698Q492k16364P072J5552K35859J63409P5665
8496B59842p5022k41383j98274R7805P8670J32033O2239k47495j22098J86517
8486f7166K64939J14871j38943k24163j41030L3447j4384J05575l8742p0786J6315
8475a60067K31885m199J23177J50480j79204j57491k70395j61547R0082K60422
8465g6857K15423k81792J6268J88482j02875R5366j5544N0783J26625J48343M0643
8454D04865J0565j92015l40879Q2517p5388k76508m0475K04009J97794J46864
$$ plain form
8444 121349 190180 138006 104972 275837 262714 293038 515456 579080 585358 498648 229726
8433 229726 347150 186121 173810 237135 283699 454807 390720 125193 77487 93572 141949
8422 141949 34555 -8456 93581 128170 404138 350884 229861 3893 -257942 -324224
8412 -324224 -106584 -4592 -52464 -85340 -253907 -434530 -713284 -802519 -561110 -521111
8402 -521111 -324148 -170906 -24520 16973 59142 -3424 -187331 -200369 -365021 -433432 -198725
8391 -198725 -28498 -184191 -112861 59270 36619 34829 83229 44530 -29224 176679 28826
8380 28826 -52800 133443 -7011 -180618 -337354 -399431 -500733 -505467 -351278 -389038 -284507
8369 -284507 -348198 -332888 -144629 46433 -184703 -355189 -132000 -113671 -201599 -101445
$$ packed form
8444A21349O8831n2174l3034J70865j3123L0324K22418O3624O278q6710k68922
8433B29726J17424j61029j2311O3325M6564J71108o4087k65527m7706J6085M8377
8422A41949j07394m3011J02037L4589K75968n3254j21023k25968k61835o6282
8412c24224K17640J01992m7872l2876j68567j80623k78754q9235K41409L9999
8402e21111J96963J53242J46386M1493M2169o2566j83907j3038j64652o8411K34707
8391a98725J70227j55693P1330J72131k2651j790M8400l8699p3754K05903j47853
8380B8826q1626J86243j40454j73607j56736o2077j01302m734J54189l7760J04531
8369b84507o3691J5310J88259J91062k31136j70486K23189J8329q7928J00154
$$ plain form
8359 -101445 -135621 -235351 -243064 -100390 -3501 -116102 -181367 -234554 -52186 24673 156596
8348 156596 175922 90835 -12694 -50741 -100282 -149746 -60539 202598 31070 -174232 -42656
8337 -42656 106421 88600 -9387 96578 -8130 -213615 -265579 -386493 -327791 -271537 -351505
8326 -351505 -338976 -360579 -305225 -258439 -236803 -218779 -50655 -98075 -108235 57681 -50356
8315 -50356 -104571 26018 -74764 -172972 -132320 -348680 -457784 -476334 -271793 -338919 -351157
8304 -351157 -328020 -215768 -46688 -184760 -7192 80125 159620 16958 -267034 -503476
8294 -503476 -292754 137210 324750 100919 -77033 168930 206008 239931 -32210 -474457
8284 -474457 -420733 -297670 -190123 -44561 -126927 -195439 -77274 88963 137263 127683 -86846
$$ packed form
8359a01445l4176r9730p713J42674R6889j12601o5265n3187J82368P6859J31923
8348A56596J9326q5087j03529l8047m9541m9464Q9207K63137j71528k05302J31576
8337d2656J49077j7821r7987J05965j04708k05485n1964j20914N8702N6254p9968
8326c51505J2529k1603N5354M6786K1636J8024J68124m7420j0160J65916j08037
8315e0356n4215J30589j00782r8208M0652k16360j09104j8550K04541o7126j2238
8304c51157K3137J12252J69080j38072J77568Q7317P9495j42662k83992k36442
8294e03476K10722M29964J87540k23831j77952K45963L7078L3923k72141m42247
8284d74457N3724J23063J07547J45562q2366o8512J18165J66237M8300r580k14529
$$ plain form
8273 -86846 -88743 -114587 -423528 -559502 -385750 -48525 -72387 -197227 -78130 -121112 44864
8262 44864 -12583 -358861 -393775 -362552 -378074 -387683 -362593 -302902 -265746 -192693 107317 109984
8250 109984 164579 125824 -62342 -246794 -78537 -25399 -100993 -298671 -301652 -219556 -164341
8239 -164341 -328460 -403754 -421427 -475409 -325887 -126184 -59217 -173100 -355019 -372321 -355047
8228 -355047 -503065 -421435 -205364 -197036 -174492 41323 327537 352218 89295 -181330 -388707
8217 -388707 -215888 -28272 124760 -167439 -500509 -218681 -35524 32119 -134017 -264205
8207 -264205 -269874 -142425 26680 43477 -95711 -174023 98913 125557 -36809 -217873 -79742
8196 -79742 -2693 -111623 77908 141295 128186 123933 210735 323714 365046 183273 131456
$$ packed form
8273h6846j897k5844l08941j35974J73752L37225k3862j24840J19097m2982J65976
8262D4864n7447l46278l4914L1223j5522r609K5090N9691L7156P3053L00010K667
8250A09984N4595l8755j88166j84452J68257N3138p5594j97678k981Q2096N5215
8239a64341j64119p5294j7673n3982J49522J99703O6967j13883j81919j7302J7274
8228c55047j48018Q1630K16071Q328K2544K15815K86214K4681k62923k70625k07377
8217c88707J72819J87616J53032k92199l33070K81828J83157O7643j66136j30188
8207b64205n669J27449J69105J6797j39188p8312K72936K6644j62366j81064J38131
8196g9742P7049j08930J89531O3387j3109m253Q6802J12979M1332j81773n1817
$$ plain form
8185 131456 -11096 -264765 -282956 -193487 -110915 -74665 110243 176375 111748 73321 174731
8174 174731 270211 72369 114469 153402 99976 250908 274190 121946 148516 323478 276293
8163 276293 132792 126442 305057 354851 210985 182643 204766 168448 344842 470103 355425
8152 355425 350120 455603 785357 892691 1016149 1608205 2514638 2555515 2536619 2686339
8142 2686339 2471908 1924277 1281689 988517 881362 990726 816051 611871 338366 27864
8132 27864 205957 372229 298014 133936 245886 391647 567427 427675 185904 419605
8122 419605 597618 495817 443698 445823 399375 355143 -47214 -259634 -231650 16663 128513
8111 128513 -65414 77350 285845 236622 321487 415320 521134 544165 790452 1216599
$$ packed form
8185A31456j42552k53669j8191Q9469Q2572L6250J84908O6132o4627l8427J01410
8174A74731R5480j97842M2100L8933n3426J50932K3282j52244K6570J74962m7185
8163B76293j43501o350J78615M9794j43866k8342K2123l6318J76394J25261j14678
8152C55425n305J05483L29754J07334J23458N92056R06433M0877j8896J49720
8142B686339k14431n47631o42588k93172j07155J09364j74675k04180k73505l10502
8132B7864J78093J66272p4215j64078J11950J45761J75780j39752k41771K33701
8122D19605J78013j01801n2119K125m6448m4232m02357k12420K7984K48313J11850
8111A28513j93927J42764K08495m9223Q4865R3833J05814K3031K46287M26147
$$ plain form
8101 1216599 2140298 3073358 4193919 5037299 5167067 4516009 3824197 2945787 1915776
8092 1915776 1388088 960841 749914 334127 58962 28422 -138702 -284652 -218638 26948
8082 26948 165186 -35736 -41914 429864 517762 333193 274140 394657 275664 126585 -39173
8071 -39173 97581 78199 -105932 -184436 -118003 -203202 -146772 -40855 92445 -40713 -78529
8060 -78529 106701 453288 593388 856391 1155042 1500009 1599040 1611058 1687691 1899081
8050 1899081 1946903 1735498 1396302 1032860 554972 271001 25473 -45802 281645 277985
8040 277985 159078 125600 132518 78873 163708 405823 453153 316272 61530 -545 10685
8029 10685 -68188 -131333 -87753 11426 -47285 3973 63255 310963 359602 76626 37890
$$ packed form
8101A216599R23699R33060J120561Q43380J29768o51058o91812q78410j030011
8092A915776n27688m27247k10927m15787k75165l0540j67124j45950O6014K45586
8082B6948J38238k00922o178M71778Q7898j84569n9053J20517j18993j49079j65758
8071c9173J36754j9382j84131p8504O6433q5199N6430J05917J33300j33158l7816
8060g8529J85230L46587J40100K63003K98651L44967R9031J2018P6633K11390
8050A899081M7822k11405l39196l63442m77888k83971k45528p1275L27447l660
8040B77985j18907l3478O918n3645Q4835K42115M7330j36881k54742o2075J1230
8029A0685p8873o3145M3580R9179n8711N1258N9282K47708M8639k82976l8736
$$ plain form
8018 37890 148244 439708 758907 319318 -99860 -68662 59791 123483 102633 -30817
8008 -30817 80410 -8777 -115074 -78 58029 -128625 -229941 -139146 -201344 -217721 -216980
7997 -216980 -118860 -83384 31230 172955 45321 29132 -132639 -375149 -476520 -240395
7987 -240395 40665 124183 202273 152632 259704 159971 -170451 -328217 -416333 -337492 -138787
7976 -138787 -46802 110092 245090 274960 438555 507592 542268 606743 534157 434361 432399
7965 432399 331290 122853 9930 -168911 -336701 -327089 -261850 -227262 -218453 -89360 -150263
7954 -150263 -335547 -518877 -447182 -131652 67066 22851 -155831 -183651 -298162 -125666
7944 -125666 -108395 -90972 -89455 -187240 -222091 -120387 -188157 -228365 -327098 -403352 -547026
$$ packed form
8018C7890J10354K91464L19199m39589m19178L1198J28453O3692k0850j33450
8008c0817J11227q9187j06297J14996N8107j86654j01316R0795o2198j6377P41
7997b16980R8120L5476J14614J41725j27634j6189j61771k42510j01371K36125
7987b40395K81060Q3518P8090m9641J07072r9733l30422j57766q8116P8841J98705
7976a38787R1985J56894J34998K9870J63595O9037L4676O4475p2586r9796j962
7965D32399j01109k08437j12923j78841j67790R612O5239L4588Q809J29093o0903
7954a50263j85284j83330P1695L15530J98718m4215j78682k7820j14511J72496
7944a25666J7271J7423J517r7785l4851J01704o7770m0208r8733p6254j43674
$$ plain form
7933 -547026 -650011 -421399 -291214 -262098 -61205 102380 106716 111310 -117778 -286541 -410682
7922 -410682 -297918 -198100 -131359 -187634 -359513 -258016 -159700 16041 -104435 -478715
7912 -478715 -691931 -666987 -401169 -279029 -230854 -227751 -311262 -6324 195480 174105 49037
7901 49037 -82844 -21046 -158755 -200200 -243891 -116921 -65649 -315259 -38423 130244 -92470
7890 -92470 53354 110622 -212303 -415199 -237394 37438 428423 490161 325867 -82900
7880 -82900 -50017 109088 -24144 15776 67980 161719 140831 188498 151783 -39708 -87495
7869 -87495 127202 197668 29394 8462 200425 86761 -203871 -306932 -266448 -342632 -332291
7858 -332291 -360503 -258420 -270538 -267487 -240974 -311450 -347684 -248025 -80744 -111844 -94751
$$ packed form
7933e47026j02985K28612J30185K9116K00893J63585M336M594k29088j68763j24141
7922d10682J12764R9818O6741n6275j71879J01497R8316J75741j20476l74280
7912d78715k13216K4944K65818J22140M8175L103q3511L04938K01804k1375j25068
7901D9037j31881O1798j37709m1445m3691J26970N1272k49610K76836J68667k22714
7890i2470J45824N7268l22925k02896J77805K74832L90985O1738j64294m08767
7880h2900L2883J59105j33232L9920N2204R3739k0888M7667l6715j91491m7787
7869h7495K14697P0466j68274k0932J91963j13664k90632j03061M0484p6184J0341
7858c32291k8212J02083j2118L051K6513p0476l6234R9659J67281l1100J7093
$$ plain form
7847 -94751 -245871 -212213 -179809 -42920 29323 94138 55661 -74660 -5254 48956 248197
7836 248197 77562 -260529 -255119 -66465 -160597 -116229 -54636 40808 -25907 66279 121794
7825 121794 -85961 -51380 110963 42161 -180151 -72360 166948 90746 -252923 -189204
7815 -189204 10146 -134750 -302616 -466764 -471663 -297596 601 115081 219326 189248
7805 189248 -69424 -160257 -105889 -31334 72653 176712 305194 131318 11747 -63402
7795 -63402 -144992 24367 156492 175520 97713 178823 246913 133934 36431 -106882 -187928
7784 -187928 -175086 -59997 181038 403381 127062 -18172 113746 39041 24784 133635
7774 133635 158502 28701 -201594 -107992 8202 -293717 -400535 -307176 -349178 -156148
$$ packed form
7847i4751j51120L3658L2404J36889P2243O4815l8477j30321O9406N4210J99241
7836B48197j70635l38091N410J88654r4132M4368O1593R5444o6715R2186N5515
7825A21794k07755L4581J62343o8802k22312J07791K39308p6202l43669O3719
7815a89204J99350j44896j67866j64148m899J74067K98197J14480J04245l0078
7805A89248k58672r0833N4368P4555J03987J04059J28482j73876j19571p5149
7795f3402q1590J69359J32125J9028p7807Q1110O8090j12979r7503j43313q1046
7784a87928J2842J15089K41035K22343k76319j45234J31918p4705j4257J08851
7774A33635K4867j29801k30295R3602J16194l01919j06818R3359m2002J93030
$$ plain form
7764 -156148 -143843 -136989 -52684 -57289 145338 102175 -211212 -309985 -353248 -371947 -480898
7753 -480898 -361709 -231972 -61126 97632 204549 -44040 -193790 -163494 -216147 -387731
7743 -387731 -177572 -157109 -214835 -103367 -81097 -255808 -436374 -477902 -446870 -287100 -292707
7732 -292707 -107433 32192 -23490 -120223 -86659 73699 125759 -90795 -137989 -176908 -231190
7721 -231190 -211494 -162825 -272498 -397590 -523392 -465238 -350738 -84076 -164538 -144051 1826
7710 1826 98558 34817 -135744 -397509 -429189 -17754 112532 147112 278122 204141 10474
7699 10474 -45106 137761 272533 254858 197129 135006 268635 228539 103753 152614 345075
7688 345075 284800 104379 95226 109989 -15560 142230 287679 154234 -97394 -96000 -32511
$$ packed form
7764a56148J2305O854Q4305m605K02627m3163l13387r8773m3263j8699j08951
7753d80898J19189J29737J70846J58758J06917k48589j49750L0296n2653j71584
7743c87731K10159K0463n7726J11468K2270j74711j80566m1528L1032J59770n607
7732b92707J85274J39625n5682r6733L3564J60358N2060k16554m7194l8919n4282
7721b31190J9696M8669j09673j25092j25802N8154J14500K66662q0462K0487J45877
7710A826R6732o3741j70561k61765l1680M11435J30286L4580J31010p3981j93667
7699A0474n5580J82867J34772j7675n7729o2123J33629m0096j24786M8861J92461
7688C45075o0275j80421r153J4763j25549J57790J45449j33445k51628J394O3489
$$ plain form
7677 -32511 -68805 -10762 -118087 -307807 -83646 203867 289667 194631 -162229 -283266 -353879
7666 -353879 -67631 99485 106436 -26793 -448142 -339192 -145769 -25955 -66697 -169202
7656 -169202 77502 326566 168378 19107 -138998 -284932 -434787 -185858 172240 192150
7646 192150 207600 9343 -197260 -186005 -186643 -185814 -191340 -179147 -107325 57276 101792 -134348
7634 -134348 -189247 27662 157070 190202 2277 14162 56242 178421 211065 -10373 -133746
7623 -133746 -57302 59824 84226 19790 -115427 -280055 -451696 -361716 -275992 -187320 -212688
7612 -212688 -125915 -237551 -264386 -304179 -335154 -94981 89655 363923 533599 416936
7602 416936 393707 399873 253146 -145916 -496206 -371187 -44019 -10972 -192445 75511
$$ packed form
7677c2511l6294N8043j07325j89720K24161K87513Q5800r5036l56860j21037p0613
7666c53879K86248J67116O951j33229m21349J08950J93423J19814m0742j02505
7656a69202K46704K49064j58188j49271j58105j45934j49855K48929L58098J9910
7646A92150J5450j98257k06603J1255o38Q29n526J2193P1822J64601M4516k36140
7634a34348n4899K16909J29408L3132j87925J1885M2080J22179L2644k21438j23373
7623a33746P6444J17126K4402o4436j35217j64628j71641Q9980Q5724Q8672k5368
7612b12688Q6773j11636k6835l9793l0975K40173J84636K74268J69676j16663
7602D16936k3229O166j46727l99062l50290J25019L27168L3047j81473K67956
$$ plain form
7592 75511 109531 87530 157112 -10083 -153363 -120984 -199001 -176804 -171228 -127283 -94637 -51058
7580 -51058 -105266 -244794 -344899 19971 8910 -29154 52923 129479 -34338 93106 132228
7569 132228 248558 319939 223914 232723 19269 76103 316940 242336 -54767 -112363 27270
7558 27270 -36004 57308 188202 2970 21276 -78530 -201427 -68318 53784 27337 22681
7547 22681 -87391 -375759 -267827 -84516 93076 -4332 -20041 -71980 -152736 -52236 -124996
7536 -124996 -74075 51885 -39825 22902 91371 -52827 -293117 -283936 111905 -1389 -144382
7525 -144382 -93806 -28912 -20934 15013 96734 -137453 -342635 -240240 42057 -156227 -187400
7514 -187400 -14459 -146475 -139996 -80555 123534 168355 315442 272888 124044 55441 203078
$$ packed form
7592G5511L4020k2001O9582j67195j43280L2379p8017K2197N576M3945L2646M3579
7580e1058n4208j39528j00105L64870j1061l8064Q2077P6556j63817J27444L9122
7569A32228J16330P1381r6025Q809k13454N6834K40837p4604k97103n7596J39633
7558B7270o3274R3312J30894j85232J8306r9806j22897J33109J22102k6447m656
7547B2681j10072k88368J07932J83311J77592r7408j5709n1939q0756J00500p2760
7536a24996N0921J25960r1710O2727O8469j44198k40290R181L95841j13294j42993
7525a44382N0576O4894P978L5947Q1721k34187k05182J02395K82297j98284l1173
7514a87400J72941j32016O479N9441K04089M4821J47087m2554j48844o8603J47637
$$ plain form
7503 203078 254238 170262 -182107 -22694 222704 -53074 -171223 -187266 -344432 -616642
7493 -616642 -831200 -681516 -555569 -441710 -415900 -267892 -100124 -39956 -34768 -185646
7483 -185646 -390296 -381425 -448016 -477138 -511918 -585768 -603420 -513549 -318830 -310366 -287752 -26306
7471 -26306 1286 -145183 -84140 45338 66085 17777 -184131 -261700 -57907 243365 320354
7460 320354 216466 122061 111278 -37295 -268240 -278883 -247202 -214100 180750 252520 119040
7449 119040 26813 125643 140493 101398 31674 -113431 -246926 -368265 -447422 -365997 -190377
7438 -190377 109025 356653 149069 -23984 -65748 -147421 -51921 -101812 -151785 49627 246777
7427 246777 232214 377467 335259 190037 148181 98907 31556 60334 10511 29093 40844
$$ packed form
7503B03078N1160q3976l52369J59413K45398k75778j18149j6043j57166k72210
7493f16642k14558J49684J25947J13859K5810J48008J67768O0168N188j50878
7483a85646k04650Q871o6591k9122l4780p3850j7652Q9871J94719Q464K2614K61446
7471b6306K7592j46469O1043J29478K0747m8308k01908p7569K03793L01272P6989
7460C20354j03888r4405j0783j48573k30945j0643L1681L3102L94850P1770j33480
7449A19040r2227R8830J4850l9095o9724j45105j33495j21339p9157Q1425J75620
7438a90377K99402K47628k07584j73053m1764q1673R5500m9891m9973K01412J97150
7427B46777j4563J45253m2208j45222m1856m9274o7351K8778m9823J8582J1751
$$ plain form
7416 40844 120964 91618 387884 376073 15469 -50251 -153711 -185488 -158240 -135894 -80455
7405 -80455 -69818 -271908 -426858 -440926 -399640 -321069 -32785 -15929 -184427 -314233 -231341
7394 -231341 32063 210397 328133 346550 314788 297370 -82922 -426468 -333817 -546454
7384 -546454 -195476 -36002 -147892 -235483 -155143 50696 -223085 -266338 -139241 -55549
7374 -55549 -262359 -395492 -297703 -378519 -311630 -381028 -382669 -219877 -263964 -261441 -377646
7363 -377646 -592098 -692984 -582571 -602042 -443161 -446064 -283731 42430 108548 -10933
7353 -10933 -162021 -309440 -429296 -276266 -134414 -17021 -136650 -105749 -213214 -274765
7343 -274765 -234246 -365125 -320085 -277323 -57753 93627 158192 -4057 99043 27833 226864
$$ packed form
7416D0844Q0120k9346K96266j1811l60604o5720j03460l1777K7248K2346N5439
7405h0455J0637k02090j54950j4068M1286P8571K88284J6856j68498j29806Q2892
7394b31341K63404J78334J17736J8417l1762j7418l80292l43546R2651k12637
7384e46454L50978J59474j11890q7591Q0340K05839k73781m3253J27097Q3692
7374e5549k06810j33133R7789q0816O6889o9398j641J62792m4087K523j16205
7363c77646k14452j00886J10413j9471J58881k903J62333L26161O6118j19481
7353a0933j51088j47419j19856J53030J41852J17393j19629L0901j07465o1551
7343b74765M0519j30879M5040M2762K19570J51380O4565j62249J03100p1210J99031
$$ plain form
7332 226864 335691 148767 175873 44869 -6392 -259156 -292279 20827 223351 430183
7322 430183 581712 328708 79450 51959 -44939 -131991 7976 122581 345607 411647
7312 411647 340576 310544 216942 15221 11767 180834 218135 20335 -26973 246412 374671
7301 374671 213583 -37307 -110820 -417658 -347678 -131060 73912 291967 287261 7741
7291 7741 -287848 -300981 -579441 -757029 -837462 -807142 -484529 -230781 -53824 -72674 -197634
7280 -197634 -180982 87467 173566 308309 159657 37237 99760 90678 19537 11665 -127063
7269 -127063 -94541 -51169 80546 -165628 -435294 -400521 -144464 -119755 -248903 -325679 -379866
7258 -379866 -451038 -514170 -437114 -252505 -234438 -290747 -367357 -526338 -641469 -444349 -117448
$$ packed form
7332B26864J08827j86924K7106j31004n1261k52764l3123L13106K02524K06832
7322D30183J51529k53004k49258k7491r6898q7052J39967J14605K23026O6040
7312D11647p1071l0032r3602k01721l454J69067L7301j97800m7308K73385J28259
7301C74671j61088k50890p3513l06838O9980K16618K04972K18055m706k79520
7291G741k95589j3133k78460j77588q0433L0320L22613K53748J76957j8850j24960
7280a97634J6652K68449Q6099J34743j48652j22420O2523r082p1141p872j38728
7269a27063L2522M3372J31715k46174k69666L4773K56057K4709j29148p6776n4187
7258c79866p1172o3132P7056J84609J8067n6309p6610j58981j15131J97120L26901
$$ plain form
7247 -117448 -84063 -32334 208195 124427 -61894 -157971 -77592 140516 156779 16288 207619
7236 207619 210306 166681 -1046 107909 -79395 -234797 -175289 67491 136017 94862 233602
7225 233602 152662 17000 -357921 -524513 -496981 -535256 -429697 -246849 -151820 6182
7215 6182 21369 144615 362415 205784 -36892 -121567 -104305 -141056 -122101 -227866 -222753
7204 -222753 -81927 -219838 -254168 -433722 -490809 -219931 -89797 32575 157393 312014
7194 312014 338408 129587 203361 245557 116926 -218359 -270488 -106857 19413 -94448
7184 -94448 -32871 -41427 21503 73590 -15385 28289 245247 34667 -234162 -320680 -159320
7173 -159320 -63000 -277878 -371331 -324248 -276120 -79288 56309 -48216 -180435 -92017 112714
$$ packed form
7247a17448L3385N1729K40529q3768j86321r6077Q0379K18108J6263j40491J91331
7236B07619K687m3625j67727J08955j87304j55402N9508K42780O8526m1155J38740
7225B33602q0940j35662l74921j66592K7532l8275J05559J82848R5029J58002
7215F182J5187J23246K17800j56631k42676q4675J7262l6751J8955j05765N113
7204b22753J40826j37911l4330j79554n7087K70878J30134J22372J24818J54621
7194C12014K6394k08821P3774M2196j28631l35285n2129J63631J26270j13861
7184i4448O1577q556O2930N2087q8975M3674K16958k10580k68829q6518J61360
7173a59320R6320k14878r3453M7083M8128J96832J35597j04525j32219Q8418K04731
$$ plain form
7162 112714 165154 222558 278979 409467 416535 430563 233605 173915 140476 85129 144543
7151 144543 129012 -28378 -118095 -313105 -310145 -250751 -408949 -685061 -586244 -318607 -253332
7140 -253332 -174521 -65532 -50713 -266062 -229367 29156 103709 -109249 -64954 48052 20948
7129 20948 42192 159546 146725 -32921 52869 73306 100489 -83816 -18015 -71189 7087
7118 7087 52945 87298 247194 389940 156919 154811 4146 -19811 -83508 -133230 62610
7107 62610 -9426 -72565 -105812 -113469 -42315 153125 99533 31825 -28433 -59136 -130463 94342
7095 94342 224034 174032 127032 31184 -258152 -339348 -274258 -216827 -403348 -521090 -646793
7084 -646793 -686455 -692990 -489869 -354346 -214583 -5101 55685 82743 174429 63429 -89167
$$ packed form
7162A12714N2440N7404N6421J30488P068J4028j96958n9690l3439n5347N9414
7151A44543j5531j57390q9717j95010K960N9394j58198k76112R8817K67637O5275
7140b53332P8811J08989J4819k15349L6695K58523P4553k12958M4295J13006k7104
7129B0948K1244J17354j2821j79646Q5790K0437K7183j84305O5801n3174P8276
7118G087M5858L4353J59896J42746k33021k108j50665k3957o3697m9722J95840
7107F2610p2036o3139l3247p657P1154J95440n3592o7708o0258l0703p1327K24805
7095I4342J29692n0002m7000r5848k89336q1196O5090N7431j86521j17742j25703
7084f46793l9662o535K03121J35523J39763K09482O0786K7058R1686j11000j52596
$$ plain form
7073 -89167 -405905 -510666 -440566 -298732 -42820 63675 98970 231266 266824 150734
7063 150734 154623 225962 186700 92664 -117731 -271591 -507423 -497939 -302810 -276162 -143235
7052 -143235 -217774 -162165 -231108 -236952 -112028 -72437 -119393 -15896 31522 113220 231258
7041 231258 290605 157136 -63510 -161711 -239486 -430883 -253723 12449 42914 27549 -123810
7030 -123810 -134150 -76472 -306421 -547273 -474085 -430630 -307415 -380473 -349369 -184926 -9559
7019 -9559 61805 104607 230385 311614 350721 71089 -177223 -330102 -167394 88888 403460
7008 403460 232794 27693 69096 -277381 -386893 -230262 -263296 -241030 -112610 10029
6998 10029 114935 39495 -73426 -436992 -254516 -232259 -260426 -273303 -58599 44087 -118259
$$ packed form
7073h9167l16738j04761P0100J41834K55912J06495L5295J32296L5558j16090
7063A50734L889P1339l9262r4036k10395j53860k35832R484J95129K6648J32927
7052a43235p4539N5609o8943n844J24924L9591m6956J03497M7418Q1698J18038
7041B31258N9347j33469k20646r8201p7775j91397J77160K66172L0465j5365j51359
7030a23810j0340N7678k29949k40852P3188M3455J23215p3058L1104J64443J75367
7019i559P1364M2802J25778Q1229L9107k79632k48312j52879J62708K56282L14572
7008D03460j70666k05101M1403l46477j09512J56631l3034K2266J28420J22639
6998A0029J04906p5440j12921l63566J82476K2257k8167j2877K14704J02686j62346
$$ plain form
6987 -118259 -287112 25652 200269 95846 -48434 -259628 -332525 10992 75466 -38797
6977 -38797 38660 -52865 53442 317560 327652 311760 215637 163762 167006 151204 -80201
6966 -80201 -202580 -146075 -118140 -167826 -393011 -496834 -498998 -412270 -334166 -47687 -39840
6955 -39840 17410 147733 -21125 -31246 170808 195750 -48311 -188256 19499 139641
6945 139641 33965 -182283 -186626 -15864 -176877 -4730 299896 -34812 598 42302
6935 42302 117198 23242 35107 102766 106957 -28598 -134774 -209513 -382410 -240917 112791
6924 112791 255035 51389 -62441 -328958 -120917 120455 -84777 -248647 -350589 -378292
6914 -378292 -94970 -37693 -3221 -92137 -318554 -268793 -126832 -171999 -133354 -221005 -290438
$$ packed form
6987a18259j68853L12764J74617j04423j44280k11194p2897L43517O4474j14263
6977c8797P7457r1525J06307K64118J0092j5892r6123n1875L244j5802k31405
6966h0201j22379N6505K7935m9686k25185j03823k164Q6728P8104K86479P847
6955c9840N7250J30323j68858j0121K02054K4942k44061j39945K07755J20142
6945A39641j05676k16248m343J70762j61013J72147L04626l34708L5410M1704
6935D2302P4896r3956J1865O7659M191j35555j06176p4739j72897J41493L53708
6924A12791J42244k03646j13830k66517K08041K41372k05232j63870j01942k7703
6914c78292K83322N7277L4472q8916k26417M9761J41961m5167L8645q7651o9433
$$ plain form
6903 -290438 -430990 -206267 -65867 11759 -91216 -10805 -60827 -392315 -145453 183419
6893 183419 283434 335561 498780 668712 384469 415038 248783 271295 290019 390504
6883 390504 277016 78677 -79338 -7175 103075 46050 -97452 -24444 29292 -50771 -110703
6872 -110703 -88276 65989 171087 27158 65287 73593 -32829 -150863 -288504 -113045
6862 -113045 -119831 -109522 -281519 -453618 -352500 -171007 -63534 87410 222013 -23018
6852 -23018 -144113 -191103 -234969 -171289 172234 183768 234522 143509 110935 67837 182623
6841 182623 -21216 -63985 61523 -108740 -153352 1618 14271 -86063 -44066 16249 147632
6830 147632 96997 239072 -204 -286337 -507606 -474092 -95139 141304 149958 17248
$$ packed form
6903b90438j40552K24723J40400P7626j02975Q0411n0022l31488K46862L28872
6893A83419J00015N2127J63219J69932k84243L0569j66255K2512J8724J00485
6883C90504j13488j98339j58015P2163J10250n7025j43502P3008N3736q0063n9932
6872a10703K2427J54265J05098j43929L8129Q306j06422j18034j37641J75459
6862a13045o786J0309j71997j72099J01118J81493J07473J50944J34603k45031
6852b3018j21095m6990m3866O3680L43523J1534N0754r1013l2574m3098J14786
6841A82623k03839m2769J25508j70263m4612J54970J2653j00334M1997O0315J31383
6830A47632n0635J42075k39276k86133k21269L3514L78953K36443Q654j32710
$$ plain form
6820 17248 99622 78749 -13982 -93508 -224914 -278532 -330676 -184695 -44067 -47676 86348
6809 86348 154131 -106524 -65551 6320 -173849 -191341 -80023 49380 19502 27374 -63193
6798 -63193 -276156 -321519 -190380 -159581 -138301 -323875 -299094 -155172 -72310 -61316 -57997
6787 -57997 64975 36471 -50376 28818 -46633 -62526 154579 150433 -81200 76699 -32370
6776 -32370 -56941 -109290 -107044 -54749 -27146 -278330 -202618 -178461 -176382 -73592 38311 -140350
6764 -140350 -72376 -6409 53084 184013 194454 163717 -57547 -53544 80851 191522 13039
6753 13039 -253743 -253945 -11055 106498 193845 230747 194886 155808 64675 -85496 27415
6742 27415 233223 158697 -11813 -181595 -132466 -133003 -61971 122335 58361 -84526 -87896
$$ packed form
6820A7248Q2374k0873r2731p9526j31406n3618n2144J45981J40628l609J34024
6809H6348O7783k60655M0973P1871j80169j7492J11318J29403k9878P872r0567
6798f3193k12963m5363J31139L0799K1280j85574K4781J43922Q2862J0994L319
6787e7997J22972k8504q6847P9194p5451j5893K17105m146k31633J57899j09069
6776c2370k4571n2349K246N2295K7603k51184P5712K4157K079J02790J11903j78661
6764a40350O7974O5967N9493J30929J0441l0737k21264M003J34395J10671j78483
6753A3039k66782k02K42890J17553Q7347L6902l5861l9078r1133j50171J12911
6742B7415K05808p4526j70510j69782M9129n37P1032J84306o3974j42887l370
$$ plain form
6731 -87896 -58919 69649 -95591 -316730 -372747 -402353 -334132 -411711 -389650 -443411 -286172
6720 -286172 -283572 -393851 -319042 -282043 -145155 -267511 -399476 -417405 -187155 -7730 -174552
6709 -174552 -107879 -97867 -236834 -219439 -335753 -332916 -148439 -79001 -73848 -3839 -16766
6698 -16766 -20379 -82608 -212220 -213526 -4675 -51213 131575 -107513 -235512 144066 132494
6687 132494 850 46397 84049 192602 156778 300133 178688 256825 336236 706374 617711
6676 617711 327156 157227 -59773 -226918 -53863 87888 33517 -95914 -326371 -306462
6666 -306462 -147457 -49979 -32599 22913 100779 -33288 -70317 -160791 -97889 -25692 -19983
6655 -19983 -116666 -206138 -48 -83713 -169936 -64248 -67215 -11881 -89191 -52101 232229
$$ packed form
6731h7896K8977J28568j65240k21139n6017k9606O8221p7579K2061n3761J57239
6720b86172K600j10279P4809L6999J36888j22356j31965j7929K30250J79425j66822
6709a74552O6673J0012j38967J7395j16314K837J84477O9438N153P0009j2927
6698a6766l613o2229j29612j306K08851m6538J82788k39088j27999L79578j1572
6687A32494j31644M5547L7652J08553l5824J43355j21445P8137P9411L70138q8663
6676F17711k90555j69929k17000j67145J73055J41751n4371j29431k30457J9909
6666c06462J59005R7478J7380N5512P7866j34067l7029r0474O2902P2197N709
6655a9983r6683q9472K06090q3665q6223J05688k967N5334p7310L7090K84330
$$ plain form
6644 232229 330409 188758 -12395 -93942 -55852 113568 217615 269221 308519 460667 390106
6633 390106 230981 42264 -227147 -397857 105452 290686 -50137 -356062 -351376 -266343
6623 -266343 -296680 -167113 -73356 -53836 -22951 -36640 -120503 -159087 -166809 -106704 110840
6612 110840 216208 35357 93 -73168 -49189 8367 59877 73294 77448 194704 276377
6601 276377 529234 533274 563099 408080 220200 29279 -69069 -254688 -430616 -226248
6591 -226248 3042 18610 -40834 -299247 -164558 -154467 -306288 -392675 -214932 -168428 -126529
6580 -126529 -32731 -23378 -165695 -162915 -183492 -252166 -251336 62734 199497 337754 369661 396818
6568 396818 598812 740059 621484 327804 77067 -89606 47451 108494 266394 310651
$$ packed form
6644B32229R8180j41651k01153q1547L8090J69420J04047N1606L9298J52148p0561
6633C90106j59125j88717k69411j70710N03309J85234l40823l05925M686Q5033
6623b66343l0337J29567R3757J9520L0885j3689q3863l8584p722O0105K17544
6612A10840J05368j80851l5264p3261K3979N7556N1510J3417M154J17256Q1673
6601B76377K52857M040K9825j55019j87880j90921r8348j85619j75928K04368
6591b26248K29290J5568n9444k58413J34689J0091j51821q6387J77743M6504M1899
6580a26529R3798R353j42317K780k0577o8674Q30L14070J36763J38257L1907K7157
6568C96818K01994J41247j18575k93680k50737j66673J37057O1043J57900M4257
$$ plain form
6558 310651 275063 305717 198864 197794 220009 128856 187578 357103 271822 343762 300727
6547 300727 276999 279395 30633 199748 207821 234123 304814 485233 568686 667215 908712
6536 908712 823640 718546 1059786 1410888 1250121 1376747 1434072 1435703 1610916 1711799
6526 1711799 1769663 1680808 1568801 1455218 1399103 1112217 809823 605579 664383 808838
6516 808838 684762 647204 493057 434867 363069 270568 166649 186865 222671 201583 161778
6505 161778 54631 13148 -30039 39521 109986 200069 306143 254895 178438 130764 60940
6494 60940 -88939 -46818 182151 195059 194673 29803 -196305 -211856 52442 220167 407338
6483 407338 359846 221662 104528 -141576 -442808 -640838 -379528 -355501 -399386 -108140
$$ packed form
6558C10651l5588L0654j06853j070K2215r1153N8722J69525q5281P1940m3035
6547C00727k3728K396k48762J69115Q073K6302P0691J80419Q3453R8529K41497
6536I08712q5072j05094L41240L51102j60767J26626N7325J631J75213J00883
6526A711799N7864q8855j12007j13583n6115k86886l02394k04244N8804J44455
6516H08838j24076l7558j54147n8190p1798r2501j03919K0216L5806k1088l9805
6505A61778j07147m1483m3187O9560P0465R0083J06074n1248p6457m7674o9824
6494F0940j49879M2121K28969J2908l86j64870k26108j5551K64298J67725J87171
6483D07338m7492j38184j17134k46104l01232j98030K61310K4027m3885K91246
$$ plain form
6473 -108140 -151889 -9507 26970 -84073 -115358 4775 -50840 -11233 96918 35254 -27276
6462 -27276 168182 291849 396689 345985 327587 384727 276487 80256 -204866 -112891 194789
6451 194789 417665 224986 -217760 -408188 -20793 214304 475086 623553 337004 415825
6441 415825 362982 72727 -88550 -184982 -147991 115245 178684 16847 45064 139505 197685
6430 197685 -42548 17632 217311 184540 277207 396459 189069 -17861 -124334 -65134
6420 -65134 -51195 119391 137667 -35415 -134471 -307550 51875 176404 175348 11461 -4236
6409 -4236 169089 147239 46740 -110206 20209 236142 341213 234740 -33945 -68482
6399 -68482 -85348 -29911 208548 358139 230110 249638 63769 -18918 -113412 -58857 -120620
$$ packed form
6473a08140m3749J42382L6477j11043l1285J20133n5615L9607J08151o1664o2530
6462b7276J95458J23667J04840n0704j8398N7140j08240j96231k85122R1975L07680
6451A94789K22876j92679m42746j90428L87395K35097K60782J48467k86549P8821
6441D15825n2843k90255j61277r6432L6991K63236O3439j61837K8217R4441N8180
6430A97685k40233O0180J99679l2771R2667J19252k07390k06930j06473N9200
6420f5134J3939J70586J8276j73082r9056j73079L59425J24529j056j63887j5697
6409d236J73325k1850j00499j56946J30415K15933J05071j06473k68685l4537
6399f8482j6866N5437K38459J49591j28029J9528j85869q2687r4494N4555o1763
$$ plain form
6388 -120620 -367801 -259424 -184764 -220350 -30700 -26167 -124575 125227 333301 378211 149576
6377 149576 275130 307832 258212 162952 -1391 -292482 -157664 -79526 86162 184500 88352
6366 88352 25496 116323 148563 44873 41277 106606 23446 14761 -108912 84022 99062 11397
6354 11397 153036 286901 57792 -253204 -122847 193589 424265 440356 310134 214589
6344 214589 210144 39873 107098 69060 184022 345433 242396 79171 -195234 -238441 -137699
6333 -137699 -104603 -128126 -74743 -99995 -38082 -39879 -36972 -287629 -437900 -396526 -320477 -169024
6321 -169024 99844 96178 -211836 -176081 -76971 -327686 -433605 -335061 -82435 124122 290291
6310 290291 353595 134943 -163710 -291993 -261254 -298022 -155829 -60564 -38474 -16080 28143
$$ packed form
6388a20620k47181J08377P4660l5586J89650M533r8408K49802K08074M4910k28635
6377A49576J25554L2702m9620r5260j64343k91091J34818P8138J65688R8338r6148
6366H8352o2856R0827L2240j03690l596O5329q3160q685j23673J92934J5040q7665
6354A1397J41639J33865k29109l10996J30357L16436K30676J6091j30222r5545
6344B14589m445j70271O7225l8038J14962J61411j03037j63225k74405m3207J00742
6333a37699L3096k3523N3383k5252O1913j797K907k50657j50271M1374P6049J51453
6321a69024K68868l666l08014L5755R9110k50715j05919R8544K52626K06557J66169
6310B90291O3304k18652k98653j28283L0739l6768J42193R5265K2090K2394M4223
$$ plain form
6299 28143 176860 226017 80036 4999 82286 -4070 -225944 -104764 92455 32900 17328
6288 17328 12892 179968 198346 -162778 -343374 -344679 -139052 133205 111453 90410 94231
6277 94231 -52806 -186477 -151520 -144825 -141993 -399848 -519940 -393831 -203418 -175359 -113464
6266 -113464 -26901 -93487 -156980 -474313 -676387 -751181 -608847 -457937 -133363 -77879 -327879
6255 -327879 -405387 -405539 -275689 -225021 -233774 -344774 -224461 -64371 163073 43138 30975
6244 30975 -32146 -300685 -344014 -295085 -93099 35355 -246907 -301285 -97531 47807 -77691
6233 -77691 -141167 -169353 -131695 -159682 -114782 11858 -42987 -137736 -132953 -100754 -147363 -160590
6221 -160590 -208992 -177134 -348870 -100933 -36259 -31659 -135676 -111775 26623 -54185 -365279
$$ packed form
6299B8143J48717M9157j45981p5037P7287q6356k21874J21180J97219n9555j5572
6288A7328m436J67076J8378l61124j80596j305K05627K72257k1752k1043L821
6277I4231j47037j33671L4957O695K832k57855j20092J26109J90413K8059O1895
6266a13464Q6563o6586o3493l17333k02074p4794J42334J50910L24574N5484k50000
6255c27879p7508j52J29850N0668q753j11000J20313J60090K27444j19935j2163
6244C0975o3121k68539m3329M8929K01986J28454k82262n4378K03754J45338j25498
6233g7691o3476k8186L7658k7987M4900J26640n4845r4749M783L2199m6609j3227
6221a60590m8402L1858j71736K47937O4674M600j04017K3901J38398q0808l11094
$$ plain form
6210 -365279 -409573 -197431 -97771 16030 -50647 -35117 -200878 151763 274729 122487
6200 122487 5086 126127 96951 101264 72103 -57219 -54334 -232955 -79833 220240 29377
6189 29377 -110142 -201075 -264327 -235486 -21165 145437 374775 457702 209790 -112416 127866
6178 127866 47606 -81881 23597 54249 63805 192836 120882 210255 117700 -1173 -29931
6167 -29931 60173 145487 -46907 -248285 -300645 -304914 -146561 -276408 -255437 -213452 -439128
6156 -439128 -484253 -275044 30580 107677 111769 86423 -24335 27946 -23061 -136400 -243306
6145 -243306 -142156 -92847 -94371 22978 -52451 59606 193463 181056 189867 -51312 -15281
6134 -15281 110962 -23277 -232646 -211484 -302727 -232268 -243068 -283179 -324540 -141037 -26905
$$ packed form
6210c65279m4294K12142R9660J13801o6677J5530j65761L52641J22966j52242
6200A22487j17401J21041k9176M313k9161j29322K885j78621J53122L00073j90863
6189B9377j39519r0933o3252K8841K14321J66602K29338Q2927k47912l22206K40282
6178A27866q0260j29487J05478L0652R556J29031p1954Q9373r2555j18873k8758
6167b9931R0104Q5314j92394k01378n2360m269J58353j29847K0971M1985k25676
6156d39128m5125K09209L05624P7097M092k5346j10758N2281n1007j13339j06906
6145b43306J01150M9309j524J17349p5429J12057J33857j2407Q811k41179L6031
6134a5281J26243j34239k09369K1162r1243P0459j0800m0111m1361J83503J14132
$$ plain form
6123 -26905 -171039 -154213 152250 83078 41156 20804 149260 -59439 -190625 -101650 57187
6112 57187 23480 -37323 -258786 -425874 -433334 -230246 -201948 -31460 36886 -242673 -209049
6101 -209049 87736 99451 41736 -100075 -163909 -228455 -185401 -42045 -158243 -141033 -184593
6090 -184593 48633 93634 -182815 -26781 221514 42329 -76196 -305495 -316346 -267908
6080 -267908 -326990 -221551 -57832 -136620 -176390 -155712 -53858 -98403 -148158 -141425 -7617
6069 -7617 81705 127333 188543 56349 -35581 33288 73815 64968 301435 205520 74518 17287
6057 17287 138467 237658 208832 182353 252411 235407 -191725 -307315 -271958 -394767 -140509
6046 -140509 -136625 -387143 -759377 -752816 -433319 -360989 -467892 -580470 -400541 -187110 -148850
$$ packed form
6123b6905j44134J6826L06463o9172m1922k0352J28456k08699j31186Q8975J58837
6112E7187l3707o0803k21463j67088p460K03088K8298J70488O8346k79559L3624
6101b09049K96785J1715n7715j41811o3834o4546M3054J43356j16198J7210m3560
6090a84593K33226M5001k76449J56034K48295j79185j18525k29299j0851M8438
6080b67908n9082J05439J63719p8788l9770K0678J01854m4545m9755O733J33808
6069g617Q9322M5628O1210j32194r1930O8869M0527q847K36467r5915j31002n7231
6057A7287J21180R9191k8826k6479P0058j7004m27132j15590L5357j22809K54258
6046a40509L884k50518l72234O561L19497P2330j06903j12578J79929K13431L8260
$$ plain form
6035 -148850 -205134 -381886 -544466 -602631 -479678 -360532 -295278 -208498 -196497 -71048 -5746
6024 -5746 -94086 -252245 -432348 -442834 -299597 -277381 82508 153552 -11032 14658 114195
6013 114195 212914 37441 11107 -100622 -2219 -128130 -216025 -362254 -271218 -122666 -72929
6002 -72929 -87701 26237 205865 68336 -49629 31785 8398 -285881 -124257 27555
5992 27555 7225 -99967 -154378 71571 245418 -156709 -365426 -282724 -250447 -328989 -252735
5981 -252735 -137719 51868 93761 1736 -199659 -356114 -309517 -246922 -199888 -233590 -191934
5970 -191934 -112904 -37328 -59668 31978 38025 60753 -56799 -282282 -414737 -344329 -400017
5959 -400017 -445790 -302579 -48976 -119819 -197157 61528 110309 202387 231870 237967 322398
$$ packed form
6035a48850n6284j76752j62580n8165J22953J19146O5254Q6780J2001J25449O5302
6024e746q8340j58159j80103j0486J43237K2216L59889P1044j64584K5690R9537
6013A14195R8719j75473k6334j11729R8403j25911q7895j46229R1036J48552M9737
6002g2929j4772J13938J79628j37529j17965Q1414k3387k94279J61624J51812
5992B7555k0330j07192n4411K25949J73847m02127k08717Q2702L2277p8542P6254
5981b52735J15016J89587M1893r2025k01395j56455M6597O2595M7034l3702M1656
5970a91934P9030P5576k2340R1646O047K2728j17552k25483j32455P0408n5688
5959d00017m5773J43211K53603p0843p7338K58685M8781R2078K9483O097Q4431
$$ plain form
5948 322398 143726 -68891 -80701 9292 74644 241139 150885 362950 169196 -300621
5938 -300621 -344781 -310197 -23357 41289 -379 143024 152411 208114 217569 103200 -121897
5927 -121897 -99417 -185609 -66754 59674 92484 14386 132030 85178 -129292 -311871 -294233
5916 -294233 -39683 31263 -65004 -283841 -340079 -502364 -486143 -266445 -248223 -543077 -458964
5905 -458964 -247497 -159593 16206 -120753 -331884 -430373 -357485 -310091 -143828 -77683 -130549
5894 -130549 -163875 -22637 8595 -230036 -283830 -194283 -23242 -42301 -175818 -234038 -192587
5883 -192587 268095 441299 240906 -17373 71232 241063 38879 1507 -103880 43721
5873 43721 216441 365503 83069 9694 14885 -90433 162790 473247 322599 160524
$$ packed form
5948C22398j78672k12617j1810Q9993O5352J66495r0254K12065j93754m69817
5938c00621m4160L4584K86840O4646m1668J43403R387N5703R455j14369k25097
5927a21897K2480q6192J18855J26428L2810p8098J17644m6852k14470j82579J7638
5916b94233K54550P0946r6267k18837n6238j62285J6221K19698J8222k94854Q4113
5905d58964K11467Q7904J75799j36959k11131r8489P2888M7394J66263O6145n2866
5894a30549l3326J41238L1232k38631n3794Q9547J71041j9059j33517n8220M1451
5883a92587M60682J73204k00393k58279Q8605J69831k02184l7372j05387J47601
5873D3721J72720J49062k82434p3375N191j05318K53223L10457j50648j62075
$$ plain form
5863 160524 -125003 -252260 -285504 -128302 18932 -195946 -488163 -472805 -354026 -196595
5853 -196595 -409448 -345613 -175790 -87419 -45311 -49352 48418 -180537 -73326 132403 -25718
5842 -25718 -31259 49328 104752 96734 159741 22317 -125868 -295759 -307580 -213385 24425
5831 24425 32800 -102823 71433 253660 221760 96300 216677 193806 242424 247171 475925
5820 475925 525178 245504 -42674 -21530 131730 457371 443391 318637 151009 86752
5810 86752 86509 170532 150667 247112 100608 -148608 -244740 -419937 -619257 -667442 -564595
5799 -564595 -176985 -226633 -93663 -96741 -110069 -85425 -51706 -137070 -280300 -239839 -93959
5788 -93959 -177934 -113132 -5224 118874 35377 18827 322159 437129 260686 167468 256731
$$ packed form
5863A60524k85527j27257l3244J57202J47234k14878k92217J5358J18779J57431
5853a96595k12853O3835J69823Q8371M2108m041R7770k28955J07211K05729j58121
5842b5718n541Q0587N5424q018O3007j37424j48185j69891j1821R4195K37810
5831B4425Q375j35623J74256J82227l1900j25460J20377k2871M8618M747K28754
5820D75925M9253k79674k88178K1144J53260L25641j3980j24754j67628o4257
5810H6752k43Q4023j9865R6445j46504k49216r6132j75197j99320m8185J02847
5799e64595L87610m9648J32970l078j3328K4644L3719q5364j43230M0461J45880
5788i3959q3975O4802J07908J24098q3497j6550L03332J14970j76443r3218Q9263
$$ plain form
5777 256731 284133 202431 120505 208548 277758 -23043 -264941 -292287 -536456 -401212 -150672
5766 -150672 -397386 -126701 225874 180259 130097 138845 130850 -92984 -221976 -348950 -303542
5755 -303542 -397915 -173203 -33651 145216 159975 187353 168227 181429 55693 -109147 -391980
5744 -391980 -510099 -405335 -493604 -266235 -163616 19257 -67595 -234217 -201536 135218
5734 135218 145857 -304070 -362021 -284427 -189137 -157709 -319561 -256918 -82514 -102035 -203370
5723 -203370 -256687 -229394 -210921 -66684 -14361 -186679 -178836 -91348 48961 146196 59649
5712 59649 19455 -46201 -16490 204838 261725 196560 77118 34358 -134606 -66095 8596
5701 8596 -9023 89192 60252 655 -67018 -168286 -62266 52607 73801 -209538 -376806
$$ packed form
5777B56731K7402q1702q1926Q8043O9210l00801k41898k7346k44169J35244K50540
5766a50672k46714K70685L52575m5615n0162Q748p995k23834j28992j26974M5408
5755c03542r4373K24712J39552J78867J4759K7378j9126J3202j25736j64840k82833
5744c91980j18119J04764q8269K27369J02619J82873q6852j66622L2681L36754
5734A35218J0639m49927n7951P7594R5290L1428j61852O2643J74404j9521j01335
5723b03370n3317K7293J8473J44237N2323j72318P843Q7488J40309R7235q6547
5712E9649m0194o5656K9711K21328N6887o5165j19442m2760j68964O8511P4691
5701H596j7619R8215k8940n9597o7673j01268J06020J14873K1194k83339j67268
$$ plain form
5690 -376806 -170892 34407 -88651 -182866 -157393 18746 99360 213716 99547 -97335
5680 -97335 -94171 -42335 18151 -226571 5909 179991 181953 172807 -8673 -286343 -428092
5669 -428092 -453363 -293582 -278949 -120267 -104795 -385483 -429524 -524941 -704401 -581074 -493642
5658 -493642 -427322 -237999 -115010 -52032 168260 285116 242960 -31506 -253610 -224911
5648 -224911 -81898 23942 -219509 -400406 -400665 -115535 -28369 -106055 -36057 91174 280384
5637 280384 327386 460501 636964 560136 239600 -168681 -175446 -9146 14795 141834 62003
5626 62003 119172 291809 54886 67871 202037 326210 67498 96682 -5199 -53007 -181491
5615 -181491 -73622 -168352 -165306 -73353 -66688 45657 499 113774 206290 139787 -46368
$$ packed form
5690c76806K05914K05299j23058r4215K5473J76139Q0614J14356j14169j96882
5680i7335L164N1836O0486k44722K32480J74082J962r146j81480k77670j41749
5669d28092k5271J59781J4633J58682J5472k80688m4041r5417j79460J23327Q7432
5658d93642O6320J89323J22989O2978K20292J16856m2156k74466k22104K8699
5648b24911J43013J05840k43451j80897k59K85130Q7166p7686O9998J27231J89210
5637B80384M7002J33115J76463p6828l20536m08281o765J66300K3941J27039p9831
5626F2003N7169J72637k36923J2985J34166J24173k58712K9184j01881m7808j28484
5615a81491J07869r4730L046R1953O665J12345m5158J13275R2516o6503j86155
$$ plain form
5604 -46368 -156673 -75154 -91486 -303797 -14078 211961 31742 -121495 -176457 -272053 -183434
5593 -183434 -215447 -147171 -139889 -82804 -61057 -139435 -260803 -342073 -165633 114844 176962
5582 176962 200651 27102 -142883 -140051 243511 503412 70745 -70832 -67893 -114428 -219011
5571 -219011 -221362 -222202 -212376 -507369 -472748 -209793 -78623 -22631 -168558 -343690 -214868
5560 -214868 -101141 85662 114360 -43378 -376558 -430458 -394402 -415383 -412602 -386908 -347539
5549 -347539 -16386 -3186 102590 213789 -40317 -120298 3242 169694 179010 109826 182230
5538 182230 146518 -137269 -211636 18563 -221146 -286110 44671 82130 3509 -18585 -402882
5527 -402882 -276752 -192784 -10936 17713 -229007 -445776 -470114 -475549 -442723 -328941 -146772
$$ packed form
5604d6368j10305Q1519j6332k12311K89719K26039j80219j53237n4962r5596Q8619
5593a83434l2013O8276P282N7085K1747p8378j21368q1270J76440K80477O2118
5582A76962K3689j73549j69985K832L83562K59901m32667j41577K939m6535j04583
5571b19011k351q40R826k94993L4621K62955J31170N5992j45927j75132J28822
5560b14868J13727J86803K8698j57738l33180n3900L6056k0981K781K5694L9369
5549c47539L31153J3200J05776J11199k54106p9981J23540J66452R316o9184P2404
5538A82230l5712k83787p4367K30199k39709o4964L30781L7459p8621k2094l84297
5527d02882J26130Q3968J81848K8649k46720k16769k4338n435L2826J13782J82169
$$ plain form
5516 -146772 -7470 68074 217341 274327 45635 -73289 240987 447620 294151 339151
5506 339151 438071 157468 -285521 -171736 -23785 74883 63450 47568 27250 6532 -14503
5495 -14503 97548 408382 388416 112554 -1489 85173 114934 -87019 -252457 -296093 -235511
5484 -235511 -65997 24269 -55072 82167 253150 214030 132609 61480 -16688 85144 368146
5473 368146 308188 143339 26199 56944 14848 -126661 -90976 42044 84985 232469 105930
5462 105930 -78438 -164897 -347374 -341235 -377595 -366431 -155715 5088 37902 101258 38115
5451 38115 -50815 -246263 -97299 -30333 36469 -22669 -114419 -113751 -183436 -80988 -66967 -125235
5439 -125235 -115608 -157819 -270203 -100809 -141225 -96650 -11270 127948 -8652 58605 135243
$$ packed form
5516a46772J39302P5544J49267N6986k28692j18924L14276K06633j53469M5000
5506C39151R8920k80603m42989J13785J47951R8668j1433j5882k0318k0718k1035
5495a4503J12051L10834j9966k75862j14043Q6662K9761k01953j65438m3636O0582
5484b35511J69514R0266p9341J37239J70983l9120q1421p1129p8168J01832K83002
5473C68146n9958j64849j17140L0745m2096j41509L5685J33020M2941J47484j26539
5462A05930j84368q6459j82477O139l6360J1164K10716J60803L2814O3356o3143
5451C8115q8930j95448J48964O6966O6802n9138r1750O68o9685J02448J4021n8268
5439a25235R627m2211j12384J69394m0416M4575Q5380J39218j36600O7257P6638
$$ plain form
5428 135243 223354 -11076 -203492 -33674 -197907 -268875 -229175 -280083 -187880 -278945 -199747
5417 -199747 -63669 38424 -109529 -224069 -124560 -130706 -165951 -225362 -356988 -269924 -120608
5406 -120608 -105478 -51436 -6869 89348 116067 69405 -38615 -104831 -167783 -228504 -85680
5395 -85680 -192550 -186353 -120056 -21276 188613 224306 -142595 -74301 -311061 -364545 -144741
$$ packed form
5428A35243Q8111k34430j92416J69818j64233p0968L9700n0908R2203r1065P9198
5417a99747J36078J02093j47953j14540R9509o146l5245n9411j31626Q7064J49316
5406a20608J5130N4042M4567R6217K6719m6662j08020o6216o2952o0721J42824
5395h5680j06870O197O6297R8780K09889L5693l66901O8294k36760n3484K19804
$$ [...]
##END NTUPLES=NMR SPECTRUM
##END=
