##TITLE=Analysis number 328227
Compound Code mo 08032
Book Reference 510/48
Project Code adrs
Chemist Name jimp
##JCAMPDX= 6.0         $$ Bruker NMR JCAMP-DX V2.0
##DATA TYPE= NMR SPECTRUM
##DATA CLASS= NTUPLES
##ORIGIN= Bruker BioSpin GmbH
##OWNER= nmr
$$ XWIN-NMR		Version 3.5
$$ Wed May 16 10:38:02 2007 GMT Daylight Time (UT+1h)  MAYBRIDGE\nmr@NMR_250MHZ
##.OBSERVE FREQUENCY= 250.131544655141
##.OBSERVE NUCLEUS= ^1H
##.ACQUISITION MODE= SIMULTANEOUS (DQD)
##.ACQUISITION SCHEME= undefined
##.AVERAGES= 16
##.DIGITISER RES= 18
##SPECTROMETER/DATA SYSTEM= dpx250
##.PULSE SEQUENCE= zg30
##.SOLVENT NAME= DMSO
##.SHIFT REFERENCE= (INTERNAL, DMSO, 0, 16.5104)
##AUDIT TRAIL= $$ (NUMBER, WHEN, WHO, WHERE, WHAT)
$$ ##TITLE= Audit trail, XWIN-NMR		Version 3.5
$$ ##JCAMPDX= 5.01
$$ ##ORIGIN= Bruker BioSpin GmbH
$$ ##OWNER= nmr
$$ C:\u/data/dgb/nmr/ADRS/1070/pdata/1/auditp.txt
$$ ##AUDIT TRAIL=  $$ (NUMBER, WHEN, WHO, WHERE, WHAT)
(   1,<2007-05-16 10:37:35.79 +100>,<MAYBRIDGE\nmr>,<NMR_250MHZ>,
      <created by zg, POWCHK disabled, PULCHK disabled
       configuration hash MD5:
       76 6E 9A 78 1E 09 19 81 EC 84 63 8F B0 6A 59 2D
       data hash MD5: 64K
       D3 25 94 CA E7 79 0D F1 D1 29 00 C0 54 BA 86 E8>)
(   2,<2007-05-16 10:37:50.71 +100>,<MAYBRIDGE\nmr>,<NMR_250MHZ>,
      <Start of raw data processing
       ef LB = 0.3 FT_mod = 6 PKNL = 1 SI = 32K 
       data hash MD5: 32K
       DF CF 63 1F 0C 26 AF 2E 60 F6 00 16 B4 10 15 40>)
(   3,<2007-05-16 10:37:52.38 +100>,<MAYBRIDGE\nmr>,<NMR_250MHZ>,
      <apk 
       data hash MD5: 32K
       65 47 2D 0F 26 48 E7 07 7E E3 75 EE DA 09 7C 2D>)
(   4,<2007-05-16 10:37:53.16 +100>,<MAYBRIDGE\nmr>,<NMR_250MHZ>,
      <abs ABSG = 5 
       data hash MD5: 32K
       9F CD D3 1E C4 DB 5F 74 20 41 41 D9 80 09 E1 E2>)
$$ ##END=
$$ 
$$ hash MD5
$$ DD D1 47 AA 46 A7 E9 F4 0B 2E BD 1E 85 C9 A8 9C
##$RELAX= 
##$RELAX= 
##$RELAX= 
##$RELAX= 
##$RELAX= 
##$RELAX= 
##$RELAX= 
$$ Bruker specific parameters
$$ --------------------------
##$DU= <C:\u>
##$EXPNO= 1070
##$NAME= <ADRS>
##$PROCNO= 1
##$TYPE= <nmr>
##$USER= <dgb>
##$AMP= (0..31)
100 100 100 100 100 100 100 100 100 100 100 100 100 100 100 100 100 100 
100 100 100 100 100 100 100 100 100 100 100 100 100 100 
##$AQSEQ= 0
##$AQ_mod= 3
##$AUNM= <au_zg>
##$AUTOPOS= <7 >
##$BF1= 250.13
##$BF2= 250.13
##$BF3= 250.13
##$BF4= 250.13
##$BF5= 500.13
##$BF6= 500.13
##$BF7= 500.13
##$BF8= 500.13
##$BYTORDA= 1
##$CFDGTYP= 0
##$CFRGTYP= 5
##$CHEMSTR= <none>
##$CNST= (0..31)
1 1 145 1 1 1 1 1 1 1 1 1 1 1 1 1 1 1 1 1 1 1 1 1 1 1 1 1 1 1 1 1 
##$CPDPRG= <>
##$CPDPRG1= <>
##$CPDPRG2= <>
##$CPDPRG3= <>
##$CPDPRG4= <mlev>
##$CPDPRG5= <mlev>
##$CPDPRG6= <mlev>
##$CPDPRG7= <mlev>
##$CPDPRG8= <mlev>
##$CPDPRGB= <>
##$CPDPRGT= <>
##$D= (0..31)
0 1 0 0 0 0 0 0 0 0.06 0 0 0 0 0 0 0.0002 0 0 0 0 0 0 0 0 0 0 0 0 0 0 
0 
##$DATE= 1179308254
##$DBL= (0..7)
120 120 120 120 120 120 120 120 
##$DBP= (0..7)
150 150 150 150 150 150 150 150 
##$DBP07= 0
##$DBPNAM0= <>
##$DBPNAM1= <>
$$ [...]
##$SUBNAM7= <"">
##$SUBNAM8= <"">
##$SUBNAM9= <"">
##$SW= 20.6930455092707
##$SWIBOX= (0..15)
0 0 3 0 0 0 0 0 0 0 0 0 0 0 0 0 
##$SW_h= 5175.983436853
##$TD= 65536
##$TD0= 1
##$TE= 683.16
##$TE2= 300
##$TE3= 300
##$TEG= 300
##$TL= (0..7)
0 120 120 120 120 120 120 120 
##$TP= (0..7)
150 150 150 150 150 150 150 150 
##$TP07= 0
##$TPNAME0= <>
##$TPNAME1= <>
##$TPNAME2= <>
##$TPNAME3= <>
##$TPNAME4= <>
##$TPNAME5= <>
##$TPNAME6= <>
##$TPNAME7= <>
##$TPOAL= (0..7)
0.5 0.5 0.5 0.5 0.5 0.5 0.5 0.5 
##$TPOFFS= (0..7)
0 0 0 0 0 0 0 0 
##$TUNHIN= 0
##$TUNHOUT= 0
##$TUNXOUT= 0
##$USERA1= <user>
##$USERA2= <user>
##$USERA3= <user>
##$USERA4= <user>
##$USERA5= <user>
##$V9= 5
##$VALIST= <valist>
##$VCLIST= <CCCCCCCCCCCCCCC>
##$VD= 0
##$VDLIST= <DDDDDDDDDDDDDDD>
##$VPLIST= <PPPPPPPPPPPPPPP>
##$VTLIST= <TTTTTTTTTTTTTTT>
##$WBST= 1024
##$WBSW= 4
##$XGAIN= (0..3)
0 0 0 0 
##$XL= 0
##$YL= 0
##$YMAX_a= 213542
##$YMIN_a= -254414
##$ZGOPTNS= <>
##$ZL1= 120
##$ZL2= 120
##$ZL3= 120
##$ZL4= 120
##$ABSF1= 16.51044
##$ABSF2= -4.182732
##$ABSG= 5
##$ABSL= 3
##$ALPHA= 0
##$AQORDER= 0
##$ASSFAC= 0
##$ASSFACI= 0
##$ASSFACX= 0
##$ASSWID= 0
##$AUNMP= <proc_1d>
##$AZFE= 0.1
##$AZFW= 0.1
##$BCFW= 0
##$BC_mod= 0
##$BYTORDP= 0
##$COROFFS= 0
##$CY= 12.5
##$DATMOD= 1
##$DC= 0
##$DFILT= <>
##$DTYPP= 0
##$F1P= 14.0000005364418
##$F2P= -0.99999901652339
##$FCOR= 0.5
##$FTSIZE= 32768
##$FT_mod= 6
##$GAMMA= 0
##$GB= 0
##$INTBC= 1
##$INTSCL= 1
##$ISEN= 128
##$LB= 0.3
##$LEV0= 0
##$LPBIN= 0
##$MAXI= 10000
##$MC2= 0
##$MEAN= 0
##$ME_mod= 0
##$MI= 0
##$NCOEF= 0
##$NC_proc= -4
##$NLEV= 6
##$NOISF1= 0
##$NOISF2= 0
##$NSP= 0
##$NTH_PI= 0
##$NZP= 0
##$OFFSET= 16.51044
##$PC= 1
##$PHC0= -66.81512
##$PHC1= 9.505378
##$PH_mod= 1
##$PKNL= yes
##$PPARMOD= 0
##$PSCAL= 4
##$PSIGN= 0
##$REVERSE= no
##$SF= 250.130002891113
##$SI= 32768
##$SIGF1= 0
##$SIGF2= 0
##$SINO= 400
##$SIOLD= 32768
##$SREGLST= <1H.DMSO>
##$SSB= 0
##$STSI= 32768
##$STSR= 0
##$SW_p= 5175.98343685301
##$SYMM= 0
##$S_DEV= 0
##$TDeff= 65536
##$TDoff= 0
##$TI= <Analysis number 999999
Compound Code 99
Book Reference 9
Project Code 9>
##$TILT= no
##$TM1= 0
##$TM2= 0
##$TOPLEV= 0
##$USERP1= <user>
##$USERP2= <user>
##$USERP3= <user>
##$USERP4= <user>
##$USERP5= <user>
##$WDW= 1
##$XDIM= 32768
##$YMAX_p= 528176530
##$YMIN_p= -264522
$$ End of Bruker specific parameters
$$ ---------------------------------
##NTUPLES= NMR SPECTRUM
##VAR_NAME=  FREQUENCY,     SPECTRUM/REAL,   SPECTRUM/IMAG
##SYMBOL=    X,             R,               I
##VAR_TYPE=  INDEPENDENT,   DEPENDENT,       DEPENDENT
##VAR_FORM=  AFFN,          ASDF,            ASDF
##VAR_DIM=   32768,         32768,           32768
##UNITS=     HZ,            ARBITRARY UNITS, ARBITRARY UNITS
##FACTOR=    0.157963299565203, 1,           1
##FIRST=     4129.75661164499, 0,            0
##LAST=      -1046.22682520802, 0,           0
##MIN=       -1046.22682520802, -264522,     0
##MAX=       4129.75661164499, 528176530,    0
$$ Real data points
##PAGE= N=1
##DATA TABLE= (X++(R..R)), XYDATA
$$ [...]
14576B5510o074n4926k9335K1523N1563K1995p7564m2765P7879M0179q417j6327
$$ 25510 19436 -35490 -64825 -43302 8261 30256 -47308 -90073 -12194 27985 19568 3241
14564C241k2381j3738M0427O9580j5954R279l8622n9917j7173M3416P187q3781
$$ 3241 -19140 -32878 7549 77129 61175 70454 31832 -28085 -45258 -1842 5345 -78436
14552g8436K0140K7801K6893Q769j7317k9135l9743M6288l974l9038p0465K8257
$$ -78436 -58296 -30495 -3602 5167 -12150 -41285 -81028 -34740 -38714 -77752 -148217 -119960
14540a19960p138p7487l8830N7821N2623N5115N0829K1838k4846o0956n678k0011
$$ -119960 -127098 -204585 -243415 -185594 -132971 -77856 -27027 -5189 -30035 -90991 -96669 -116680
14528a16680K8367P968K8046j9706k5451R0888L1477m3962P0633l9925q5008o2436
$$ -116680 -88313 -80345 -52299 -72005 -97456 -6568 24909 -19053 51580 11655 -73353 -135789
14516a35789M782R1523Q2318J7714m7599m2476J7154O7223N3968j1151q2336l4768
$$ -135789 -131007 -39484 42834 60548 12949 -29527 -12373 54850 108818 97667 15331 -19437
14504a9437m0911l0009L3924M2788M1714P9637j4714o0710p297L821j4119k7951
$$ -19437 -60348 -90357 -56433 -13645 28069 107706 92992 32282 24985 28806 14687 -13264
14492a3264K6367j5405J8327q253j1643K4271j1243n0174k5192p881K2080j266
$$ -13264 13103 -2302 16025 7772 -3871 20400 9157 -41017 -66209 -74090 -52010 -53276
14480e3276P9561M9428m8257l0830Q632L4438L819l0371j3598j4997O044j7200
$$ -53276 26285 75713 27456 -3374 5258 39696 43515 13144 -454 -15451 -9407 -26607
14468b6607m3635N6214l3377k9887R3020L0739m8986O8011j1323J4284p1460N236
$$ -26607 -70242 -14028 -47405 -77292 15728 46467 -2519 65492 54169 68453 -3007 2229
14456B229K8881o160k9387J7652M7258N593n9620K1240j4060l7236N5402l5238
$$ 2229 31110 24950 -4437 13215 60473 66066 6446 27686 13626 -23610 31792 -3446
14444c446m1179k9974P08J0278l7612k2760j3810J5778K6253K8057l7251p1484
$$ -3446 -44625 -74599 -73891 -63613 -101225 -123985 -137795 -122017 -95764 -67707 -104958 -176442
14432a76442P6543K2227Q575L3452n7104L1143N3841Q489J8349j7549L0549M0818
$$ -176442 -99899 -77672 -69097 -35645 -92749 -61606 -7765 724 19073 1524 32073 72891
14420G2891j4584N081m9489l2149K4515J8964m1330q946L6655l8213L6443M5490
$$ 72891 58307 63388 13899 -18250 6265 25229 -16101 -25047 11608 -26605 9838 55328
14408E5328p4680j14973j0171J0769m866K0078N1536K3703n719L7078N2886j3078
$$ 55328 -19352 -134325 -144496 -133727 -138593 -118515 -66979 -43276 -48995 -11917 40969 27891
14396B7891l25J4418r608r4439L0019J4246K0928k4088K7224P836j971M5881K1090
$$ 27891 27566 41984 32376 -62063 -32044 -17798 3130 -20958 6266 14102 12131 58012 79102
14383G9102j8322o5655k3384O6816p908k1431J4637r210o197j8546p5502k1890
$$ 79102 60780 -4875 -28259 38557 30649 9218 23855 14645 8448 -10098 -85600 -107490
14371a07490K5925K0078O8241p715o6725l0544M1129Q7743l846o6905J4466J1589
$$ -107490 -81565 -61487 6754 -961 -67686 -98230 -57101 30642 26796 -40109 -25643 -14054
14359a4054L0478J5857k821l9159L8582m9459o7475n19j0969j6976L2926n0810
$$ -14054 16424 32281 29460 -9699 28883 -20576 -88051 -88570 -99539 -116515 -83589 -134399
14347a34399j12137N5121L7067J6284O8893K9770P687k6879K6945O5791M6670
$$ -134399 -246536 -191415 -154348 -138064 -69171 -39401 -31714 -58593 -31648 34143 80813
14336H0813q0504o6816k2086M7566Q7090L8853j4023n0338k5498n0758o8015j5177
$$ 80813 309 -66507 -88593 -41027 46063 84916 70893 20555 -4943 -55701 -123716 -138893
14324a38893J03625O2329l6605n704P4806N3880p9976p1303N0920L5882j8583
$$ -138893 -35268 27061 -9544 -15248 59558 113438 33462 -37841 13079 48961 30378
14313C0378m851L0419N7760k3998L3722K448n7477o9940J4451K2353p6277j4271
$$ 30378 25527 55946 113706 89708 123430 125878 68401 -1539 12912 35265 -41012 -55283
14301e5283m7585O934J34917P5387L9826J7014l2514j19803o9253L1914K4901
$$ -55283 -102868 -95934 38983 114370 154196 171210 138696 18893 -50360 -18446 6455
14290F455P1882J0589o1689J6764O0494m9587j18717N5609L4601l2628l1488K528
$$ 6455 78337 88926 27237 44001 104495 54908 -63809 -8200 26401 -6227 -37715 -35187
14278c5187L6641M064j9869m78r018n6385N6588l821j0109L5391m089K5281L2475
$$ -35187 1454 5518 -14351 -14829 -23847 -80232 -23644 -27465 -37574 -2183 -6272 19009 51484
14265E1484K0758N2552n0419r7597r264k0393R909J2926m210q036l6936M0319
$$ 51484 72242 124794 74375 -23222 -32486 -52879 -42970 -30044 -34254 -42290 -79226 -38907
14253c8907K6612q769m1514N39J4422N9562N2179p9198o9553Q824K374L2456O3743
$$ -38907 -12295 -21064 -62578 -62039 -47617 11945 64124 -15074 -84627 -75803 -73429 -40973 22770
14240B2770l417m7119J4128J9438k5874N4775J0441k2483l2201K7610m2669j0991
$$ 22770 19353 -27766 -13638 5800 -20074 34701 45142 22659 -9542 18068 -24601 -35592
14228c5592O7840R4584k3602o9509p6924j1726K2640P465j454k6903J5747k2698
$$ -35592 32248 126832 103230 33721 -43203 -54929 -32289 -24824 -26278 -53181 -37434 -60132
14216f0132j3085J6256l7579j308J4541j9640K7935P859K7906J7592o32r894m935
$$ -60132 -73217 -56961 -94540 -95848 -81307 -100947 -73012 -65153 -37247 -19655 -20287 -30181 -35116
14203c5116J1181N9115J481q2609n8591K832L3242j2980j2608p640m4852J3801
$$ -35116 -23935 35180 36661 -45948 -104539 -101707 -68465 -81445 -94053 -101693 -146545 -132744
14191a32744J9977N3677j4889m2768M5020N5458l9147j9391M3002l3980N3461
$$ -132744 -112767 -59090 -73979 -116747 -71727 -16269 -55416 -74807 -31805 -65785 -12324
14180a2324J2774K2532J9707k9055r4145m3344N2466P2972l782J141J4899L7161
$$ -12324 450 22982 42689 13634 -80511 -123855 -71389 1583 -2199 -1058 13841 51002
14168E1002l5072n6664p3824O8623M0926L9880M1855p1522k0563R516K5342K1161
$$ 51002 15930 -40734 -114558 -45935 -5009 34871 76726 5204 -15359 -5843 19499 40660
14156D0660r745j7992m347o3909K8507M6143j4378j1868K256j7703J7172M0260
$$ 40660 30915 12923 8576 -55333 -26826 19317 4939 -6929 -4673 -22376 -5204 35056
14144C5056o7227n1788K9078J4032o019M9568J1836L8980J1802j1654l487J569
$$ 35056 -32171 -83959 -54881 -40849 -46868 2700 14536 53516 65318 53664 50177 51746
14132E1746M1852j4318m1658j6580K969M7649J9306J9439K5579J6703p3061k9076
$$ 51746 93598 79280 37622 21042 24011 71660 90966 110405 135984 152687 79626 50550
14120E0550l6731k0863M0647J09966O4109n1296n9887k4006j8115K725j1247k8894
$$ 50550 13819 -7044 33603 143569 207678 156382 96495 72489 54374 57099 45852 16958
14108A6958k045l3585k5663O7971l1119k2073L9950k1548j6330Q3540L8976k2951
$$ 16958 14913 -18672 -44335 23636 -7483 -29556 10394 -11154 -27484 56056 95032 72081
14096G2081n3004m6804L1340M1928p426J6856N620k4580j0618p847n4884m1521
$$ 72081 19077 -27727 3613 45541 38115 54971 60591 36011 25393 17546 -37338 -78859
14084g8859J4268K2462j9861O3723L0307j7096m438R009k3921L4606M9993O189
$$ -78859 -64591 -42129 -61990 1733 32040 14944 10506 19515 -4406 30200 80193 86382
14072H6382j6017m0816m2552n6283N8834O7190k3116m1963N9331N8436n6318m1665
$$ 86382 70365 29549 -13003 -69286 -10452 56738 33622 -8341 50990 109426 53108 11443
14060A1443k1247n5401l5160L3546Q011r682J6305O2563J0559K9657k2284r6269
$$ 11443 -9804 -65205 -100365 -66819 -58808 -68490 -52185 10378 20937 50594 28310 -67959
14048f7959k7942L3670P4676J13163k8994l6433K893k8667k9508J5302J9676J03696
$$ -67959 -95901 -62231 12445 125608 96614 60181 63074 34407 4899 20201 39877 143573
14036A43573K7889n0306j0604o509j5764m8917j2359M0312r22n6191j0947r892
$$ 143573 171462 121156 110552 104043 88279 39362 27003 67315 66393 10202 -745 -10637
14024a0637L7793K3830j3767j640j8375N365n1100p5657N2137m198j8122n731
$$ -10637 27156 50986 37219 35579 17204 22569 -28531 -104188 -52051 -56249 -74371 -80102
14012h0102M1605L8955m1860m8262N6372K2794q25L4794J0260k356o9737r0151
$$ -80102 -38497 458 -41402 -89664 -33292 -10498 -11323 23471 33731 31375 -38362 -128513
14000a28513n2231k6105o396J10274O7270J0339p676K9930r413K0631K8003J1761
$$ -128513 -180744 -206849 -213245 -102971 -35701 -25362 -33038 -3108 -12521 8110 36113 47874
13988D7874r3483j2878M4375L9140l5330L2135k078j4654L5750R6850J96p6936
$$ 47874 -45609 -58487 -14112 25028 -10302 21833 19755 5101 40851 137701 137897 60961
13976F0961n4686k971m1525q558n3115j05694k0125N4399N6725J5803J6894K2721
$$ 60961 6275 3304 -38221 -46779 -99894 -205588 -225713 -171314 -114589 -98786 -81892 -59171
13964e9171j5608J6455K6753j5106m6287M7287j0799l3051j501N2563K5679K9375
$$ -59171 -74779 -58324 -31571 -46677 -92964 -45677 -56476 -89527 -91028 -38465 -12786 16589
13952A6589O454L2699M1078j8059n3418j7443l3508K8208Q9840j5838p8054m4785
$$ 16589 23043 55742 96820 78761 25343 7900 -25608 2600 92440 76602 -1452 -46237
13940d6237l6128j8174p554J092O853J1665N1485N7939J5046q8125o0255O3688
$$ -46237 -82365 -100539 -108093 -107001 -100148 -88483 -36998 20941 35987 -52138 -112393 -48705
13928d8705R3301L8901k7179J197o984J9845j6298l8841k6013l4105m0253J8932
$$ -48705 44596 83497 56318 57515 50531 70376 54078 15237 -10776 -44881 -85134 -66202
13916f6202J2216j8814N2703k3491k7964J3500m6619J3762N6042N6162K1202n9059
$$ -66202 -53986 -72800 -20097 -43588 -71552 -58052 -104671 -90909 -34867 21295 42497 -16562
13904a6562r826p000l3568K6804M2194M2661o527M7878l1526q2787K539K4619
$$ -16562 -26388 -33388 -66956 -40152 2042 44703 38176 86054 54528 -28259 -25720 -1101
13892a101N2011k3703o192o316k7359n0826N941Q6091O7158j7487m0747m2914
$$ -1101 50910 27207 21015 14699 -12660 -63486 -57545 28546 95704 78217 37470 -5444
13880e444J6047m0945j8368j5896L711n662j090M1461Q576k9273l4223P9045l3367
$$ -5444 10603 -30342 -48710 -64606 -60895 -66557 -67647 -26186 -17610 -46883 -81106 -2061 -35428
13867c5428j09554l0012R8070N0474l687j349L5605N4465k3239J8278J507j6937
$$ -35428 -144982 -174994 -76924 -26450 -30137 -31486 4119 58584 35345 53623 55130 38193
13855C8193j2468N5096k8940p1757l2346j7907N850L1198J9267j0183o2356k3010
$$ 38193 25725 80821 51881 -19876 -52222 -70129 -64279 -33081 -13814 -23997 -86353 -109363
13843a09363M4240J9617J3945j0836m0362l4977q695J0758N8343N5396n048j2370
$$ -109363 -65123 -45506 -31561 -42397 -82759 -117736 -126431 -115673 -57330 -1934 -6982 -19352
13831a9352M9640j8914n0984j8646l9509L6042K3597l2384J6996J25766j3849
$$ -19352 30288 11374 -39610 -58256 -97765 -61723 -38126 -70510 -53514 72252 58403
13820E8403j04209n069O8529j8661n4495j6015Q1528O9412j6783m4348o0966L0529
$$ 58403 -45806 -50875 17654 -1007 -55502 -71517 10011 79423 62640 18292 -42674 -12145
13808a2145M2832M3165K5088l7033p2070k1385K2770k4834j5902K5516J5980L2858
$$ -12145 30687 73852 98940 61907 -10163 -31548 -8778 -33612 -49514 -23998 -8018 24840
13796B4840N9690J4287j0457j0027k5873K2956k8386J2827o4787K7629L2333k2798
$$ 24840 84530 98817 88360 78333 52460 75416 47030 59857 -4930 22699 55032 32234
13784C2234j9693J911O6210K4208r0014j9380k8314o3361m234P327M7139M5335
$$ 32234 12541 14452 80662 104870 14856 -4524 -32838 -96199 -100433 -93106 -45967 -632
13772f32k6500M4839j9135O004n2154j1410K0499l2649K5888N048O0180N3325
$$ -632 -27132 17707 -1428 4576 -47578 -58988 -38489 -71138 -45250 -40202 19978 73303
13760G3303k4706m3029k1028R283m2712l6099N2973j9558m1264L5845L2985K5956
$$ 73303 48597 5568 -15460 -6177 -48889 -84988 -32015 -51573 -92837 -56992 -24007 1949
13748A949K2349l8909m6976m7459R0498R9344m9797n3912m4245l6991N6804N2728
$$ 1949 24298 -14611 -61587 -109046 -18548 80796 30999 -22913 -67158 -104149 -47345 5383
13736E383n460M4952l2966j1038k6490L2704P701k3063R21m4942j1439n329M8153
$$ 5383 -77 44875 11909 871 -25619 7085 14786 -8277 -7356 -52298 -63737 -69066 -20913
13723b0913J0584J2213o2352k3012J1454m2204K4975J501N5120N2702M0244Q6105
$$ -20913 -10329 1884 -60468 -83480 -72026 -114230 -89255 -87754 -32634 20068 60312 146417
13711A46417j727k6906m0545o353k7225m1472j3904o060l7897j3037Q932j8063
$$ 146417 144690 117784 77239 70886 43661 2189 -11715 -17775 -55672 -68709 -59777 -77840
13699g7840j8488l0700L6945K5572n169k9952K1425K9049M7860j4608k1918n1655
$$ -77840 -96328 -127028 -90083 -64511 -69680 -99632 -78207 -49158 -1298 -15906 -37824 -89479
13687h9479M5872J655n4198O959N2127K3597k5726k9153l9979N3529L0611k2904
$$ -89479 -43607 -41952 -96150 -89191 -37064 -13467 -39193 -68346 -108325 -54796 -24185 -47089
13675d7089l1938L2288j9819n0299K1596j8848O5550O134k1850P0441O7495m4063
$$ -47089 -79027 -46739 -66558 -116857 -95261 -114109 -48559 -42425 -64275 6166 73661 29598
13663B9598L2284r669M3097j5586j10033o0601j5005Q161L2182N3574O7526M3785
$$ 29598 61882 52213 95310 79724 -30309 -90910 -105915 -97754 -65572 -11998 55528 99313
13651I9313N712k0995q4850n3243j8060M6155K7746l4531n3655L239K5338o964
$$ 99313 105025 84030 -820 -54063 -72123 -25968 1778 -32753 -86408 -83169 -57831 -64795
13639f4795k7306j531j912l6318L6386M674J7167Q445N6997l1079l5447K4348
$$ -64795 -92101 -93632 -95544 -131862 -95476 -90802 -73635 -65190 -8193 -39272 -74719 -50371
13627e0371P2723J8492K2879N1784m5939m7963j1225J4520K6150R948q6465P135
$$ -50371 22352 40844 63723 115507 69568 21605 10380 24900 51050 60998 -25467 -18332
13615a8332N114m905K8090k1173J1816L8586q115k4237j538l1456l2857J0078
$$ -18332 -13218 -18123 9967 -11206 610 39196 31081 6844 5306 -26150 -59007 -48929
13603d8929J6616k9563K6371l5377J4422l8878L0392L8914o113L9816l6384o195
$$ -48929 -32313 -61876 -35505 -70882 -56460 -95338 -64946 -26032 -32145 7671 -28713 -34908
13591c4908N4636k0811n2836l5N7825J3847l8951R617l7663q7512J1869J9673
$$ -34908 19728 -1083 -53919 -53954 3871 17718 -21233 -11616 -49279 -136791 -124922 -105249
13579a05249M7417M3586k3386o174m2985J2666Q547L5774N9650l0533p8062P798
$$ -105249 -57832 -14246 -37632 -43806 -86791 -74125 -65578 -29804 29846 -687 -78749 -70951
13567g0951K9122m7464J7610o9677O432N3666Q245M2046O5831L2009K4428r299
$$ -70951 -41829 -89293 -71683 -141360 -134928 -81262 -73017 -30971 34860 66869 91297 81998
13555H1998k7921J0326L382k5460p5850n8425K3212N1969J1011p163k8514O3092
$$ 81998 54077 64403 67785 42325 -33525 -91950 -68738 -16769 -5758 -12921 -41435 21657
13543B1657N9298j1966n1533J4992p816k0301j728l8108n0739o0740M3571P1226
$$ 21657 80955 68989 17456 32448 24632 4331 2603 -35505 -86244 -146984 -103413 -32187
13531c2187J1101P590m0552M193k4423n7367Q333K2283M6783P2628k4094k8179
$$ -32187 -21086 -13496 -54048 -49855 -74278 -131645 -123312 -101029 -54246 18382 -5712 -33891
13519c3891k557j9630J8521l7894r7697N1480N6845P785O8816n548l3456j0706
$$ -33891 -36448 -56078 -37557 -75451 -173148 -121668 -64823 -57038 11778 6230 -27226 -37932
13507c7932L5080J1659n2925n3097M9983M2644K3701j4316M470J4714J2484m5160
$$ -37932 -2852 8807 -44118 -97215 -47232 -4588 19113 4797 9267 23981 36465 -8695
13495h695O2149M9333L3213q2290r7518k2265J2930j900M0337Q3380J1571n4903
$$ -8695 53454 102787 136000 53710 -43808 -66073 -53143 -55043 -14706 68674 80245 25342
13483B5342j2562O3245K7100l7925j6181q5642j6403M2781M2199L5009r080J1437
$$ 25342 12780 76025 103125 65200 49019 -36623 -53026 -10245 31954 66963 57883 69320
13471F9320l6949n618L5294L8015m2579j30664k7675J01474K5121r746k1605j9382
$$ 69320 32371 26753 62047 100062 57483 -73181 -100856 618 25739 15993 -5612 -24994
13459b4994J7118K227j6775j9252K5071r4985k1928M5282j4060P876L2560M7599
$$ -24994 -7876 -5649 -22424 -41676 -16605 -111590 -133518 -88236 -102296 -94420 -61860 -14261
13447a4261N7736p5938n8122K1639N7919n453k4107J9112M8879J1991k5632R845
$$ -14261 43475 -32463 -90585 -68946 -11027 -16480 -40587 -21475 27404 39395 13763 23608
13435B3608M6187k066Q2804K3510J797o7907n8062o1500n6282K148j0296J02707
$$ 23608 69795 67729 150533 174043 175840 107933 49871 -11629 -67911 -65763 -76059 26648
13423B6648M4606l1976k7235K1171m1961l4072K6143J6054M0221L8260O444k6435
$$ 26648 71254 39278 12043 33214 -8747 -42819 -16676 -622 39599 77859 84303 57868
13411E7868r5147L8341J7137k7491L7010L5834R716k0830l6922r395K4048K0703
$$ 57868 -37279 1062 18199 -9292 27718 63552 73268 52438 15516 6121 30169 50872
13399E0872k0589o693K3847n2206n1857j5277L4369J4434o3386o4913l7814j8115
$$ 50872 30283 23590 47437 -4769 -56626 -71903 -37534 -23100 -86486 -151399 -189213 -207328
13387b07328Q4622Q5517k3696N2599N7516j3279p5750n7685N636J7262O661k9495
$$ -207328 -122706 -37189 -60885 -8286 49230 35951 -39799 -97484 -91848 -74586 -67925 -97420
13375i7420n577l75L163P3495J09049J3725K5546j4878j00237n2348P689J4433
$$ -97420 -102997 -103372 -100209 -26714 82335 96060 121606 106728 6491 -45857 -38168 -23735
13363b3735J6708K926K0008n5788L7095j2471l3433J3869K753p7094P843M913
$$ -23735 -7027 -4101 15907 -39881 -2786 -15257 -48690 -34821 -32068 -109162 -101319 -96406
13351i6406R747L3853n178M1226Q6566l253k3239p5643o8928k8642K0963k620
$$ -96406 -86659 -52806 -57984 -16758 69808 66555 43316 -32327 -101255 -129897 -108934 -111554
13339a11554k342j0617R0837R7273p4777R445L0669K5254J2149O0504l9643m4774
$$ -111554 -113896 -124513 -33676 63597 -11180 -1735 28934 54188 66337 126841 87198 42424
13327D2424l7925o5858j8627l4431M8250Q2432k9068k6190N3967J5909K7480j0833
$$ 42424 4499 -61359 -79986 -114417 -66167 16265 -12803 -38993 14974 30883 58363 47530
13315D7530m9276o2923k0848K768R2794M3059j2898j7717p74J786k109r0920l1334
$$ 47530 -1746 -64669 -85517 -82749 10045 53104 40206 22489 21715 23501 21392 -69528 -100862
13302a00862L3531L1819L6731K0933K4391k0525n249j494N958P3055J6293L7981
$$ -100862 -67331 -35512 1219 22152 46543 26018 20769 19275 25233 98288 114581 152562
13290A52562r364j20919n6521r379k2796o3011k5159N1124l7073N3912Q1118L7975
$$ 152562 143198 22279 -34242 -43621 -66417 -129428 -154587 -103463 -140536 -86624 -5506 32469
13278C2469k8435m6854j5173l5463l0376k0816N7851l3752p161J06747J4839L8489
$$ 32469 4034 -42820 -57993 -93456 -123832 -144648 -86797 -120549 -127710 -20963 -6124 32365
13266C2365M6346Q906N873r230j2252m8557L8468j8099o0163j9786P6626L3438
$$ 32365 78711 87617 93490 84260 72008 23451 61919 43820 -16343 -36129 40497 73935
13254G3935o1210K9701N1909m8188q3015k0432o6810J489J344M6815L7269l512
$$ 73935 12725 42426 94335 46147 -36868 -57300 -124110 -122621 -121277 -74462 -37193 -40705
13242d0705K7052r02J2559J4531J9897L2362o9462o4493J1517L1656Q1371n678
$$ -40705 -13653 -14555 -1996 12535 32432 64794 -4668 -69161 -57644 -25988 55383 49705
13230D9705k0510m6875J0590m5179k9315L3042j8991L7431L0343k4914O589K8752
$$ 49705 29195 -17680 -7090 -52269 -81584 -48542 -67533 -30102 241 -24673 -18084 10668
13218A0668J9575J7708m0494k5441m1546R4555P7913J1446K6747m8263k2927j9886
$$ 10668 30243 47951 7457 -17984 -59530 35025 112938 124384 151131 102868 79941 60055
13206F0055p9094l6307j4327J9280K9582M5816M604m3862L9211J1764J7087J8722
$$ 60055 -19039 -55346 -69673 -50393 -20811 25005 29609 -14253 24958 36722 53809 72531
13194G2531j5960Q062o284L70l0851o1095M430R576j2566j9345Q3705K9062p8168
$$ 72531 56571 64633 58349 58719 27868 -33227 -28797 -19221 -31787 -51132 32573 61635 -16533
13181a6533J0606J8675p4303m4634R783N8072M2025J595k4569L8508K4145q337
$$ -16533 -5927 12748 -61555 -106189 -96406 -38334 3691 5286 -19283 19225 43370 35033
13169C5033l764o1578k8345M162L2440O4186j9010o448J4887K844J5816n1209
$$ 35033 31269 -30309 -58654 -54492 -22052 42134 23124 16676 31563 34407 50223 -986
13157i86k513M8401J7348m545N6645k0252j20500k4486M2496P6609N2651j2175
$$ -986 -3499 44902 62250 57705 114350 94098 -26402 -50888 -8392 68217 120868 108693
13145A08693l2235K0866l7290L2046m0800j3476k576o3286q649K4647K7338q783
$$ 108693 76458 97324 60034 92080 51280 37804 35228 -28058 -36707 -12060 15278 6495
13133F495k5920l9002l9302J050q8217M8823J26442J40976j5506M264j261p9068
$$ 6495 -19425 -58427 -97729 -96679 -184896 -136073 -9631 131345 115839 120103 118842 39774
13121C9774o7425M118Q033J0901L3738J9071o8632J7857L3614p768m6866K6758
$$ 39774 -27651 -23533 -15500 -4599 29139 48210 -20422 -2565 31049 23281 -23585 3173
13109C173L83n771j4661j802Q2419n2288q7038l3519K0644L9006J214K902n234
$$ 3173 3556 -2215 -16876 -18678 63741 11453 -75585 -109104 -88460 -49454 -48240 -45338 -50572
13096e0572L1506M5317m4392M9749q767j7760J1605j1738O6367k1420n6436j1295
$$ -50572 -19066 26251 -18141 31608 22841 5081 16686 4948 71315 49895 -6541 -17836
13084a7836N2095J4820R3766L9839j1908N6317M5044Q7840R2664J21076J62303
$$ -17836 34259 49079 142845 182684 170776 227093 272137 359977 452641 573717 736020
13073G36020J60936J18211K3292p3176j69639l16552k48988q3330l9650j0732
$$ 736020 896956 1015167 1038459 965283 795644 479092 230104 146774 107124 96392
13063I6392L7040P0711M81p5241n5164J5849l540k9786P9158K1218n5150k9456
$$ 96392 133432 204143 204624 129383 74219 90068 86528 56742 135900 157118 101968 72512
13051G2512j4917j7734M0092N0635p5433m9651O290N0064L4926k9674J1222P0047
$$ 72512 57595 39861 79953 130588 55155 5504 11794 61858 96784 67110 78332 148379
13039A48379J20093L0348K1048Q9601P8473J92301K70175K08862K79390L09557
$$ 148379 268472 298820 319868 409469 487942 680243 950418 1159280 1438670 1748227
13029A748227L94057N44093L81587Q6025l11679n31652o37291n30085l61377k32776
$$ 1748227 2142284 2686377 3067964 3153989 2842310 2310658 1673367 1143282 781905 549129
13019E49129j35270o4994n0626j11698k579K7744m8698n6745k6450N5542J4209
$$ 549129 413859 348865 298239 186541 183962 211706 163008 106263 79813 135355 149564
13008A49564k9919L2932K8867N8228n0666n0845J3660n0227n6801j5805o181P8829
$$ 149564 119645 152577 181444 239672 189006 138161 151821 101594 44793 28988 22807 101636
12996A01636J00304N9902P5734j3252L1069J39650J03057J07143J77521K35684
$$ 101636 201940 261842 337576 324324 355393 495043 598100 705243 882764 1118448
12986A118448L26369K95384L75698M83968M38159J24160l24159n23579o65603
$$ 1118448 1444817 1740201 2115899 2599867 3038026 3162186 2838027 2314448 1648845
12977A648845n59117l30561k40550j30564o4679p0105q5247p9059l7771j4393
$$ 1648845 1089728 759167 518617 388053 323374 253269 168022 88963 51192 36799
12967C6799k0692n4831j660j1387K7989M9232K472k2592L1728P1423J1984m4579
$$ 36799 16107 -38724 -40384 -51771 -23782 25450 27922 5330 37058 108481 120465 75886
12955G5886l9363j3751J5510Q545J1207K89K5856R579L0617K1798L0095J01824
$$ 75886 36523 22772 38282 46827 58034 58323 84179 93758 124375 146173 176268 278092
12943B78092O6310m564K9095J53940J45843J55575K41616J27890r2774k02686
$$ 278092 344402 339838 368933 522873 668716 824291 1065907 1193797 1101023 898337
12933H98337k66907j74834j59659r7629n1385O070p4172k5381N3213q0474l9343
$$ 898337 631430 456596 296937 199308 147923 153993 79821 54440 107653 27179 -12164
12922a2164P828j0852N9572O39M8766J3968k8978j3178o7024r1065o270L4099
$$ -12164 -4336 -15188 44384 45023 93789 107757 78779 65601 -1423 -92488 -98758 -64659
12910f4659J75782k1827l5000R2667O3104l0046o5829j13546o5491J1008R6162
$$ -64659 111123 89296 54296 146963 210067 180021 114192 646 -64845 -53837 42325
12899D2325Q9350m6396L373L4255P418o2989o4183n1426n7291J2498n735j9642
$$ 42325 131675 85279 88652 122907 130325 67336 3153 -48273 -105564 -93066 -98801 -118443
12887a18443K5612M1634O4914M0142K8485j32225n3385R837l413j3040L8087P0422
$$ -118443 -92831 -51197 13717 53859 82344 -49881 -103266 -93429 -96842 -109882 -71795 -1373
12875a373L5792M2573k6083l1484k8182k2006k8643l3079K7253P4867l1048q6840
$$ -1373 34419 76992 50909 19425 -8757 -30763 -59406 -92485 -65232 9635 -21413 -108253
12863a08253k9078Q3355R4711J2613j1776J9637p1769r5261m7905P726L7904M3982
$$ -108253 -137331 -53976 40735 53348 41572 61209 -10560 -105821 -153726 -146000 -108096 -64114
12851f4114M470j2953J3663O1817O5269k3160l9899o088l5104N107N7240L493
$$ -64114 -59644 -72597 -58934 2883 68152 44992 5093 -995 -36099 -30992 26248 29741
12839B9741N96o122L2727l0932k8101k2475J7459o3086k1491M8373O8251Q0400
$$ 29741 30337 24215 56942 26010 -2091 -24566 -7107 -70193 -91684 -43311 24940 105340
12827A05340L454k5268L4949l4748r6953K246k8531Q4824N5141J7788p053n2326
$$ 105340 108794 83526 118475 83727 -13226 -10980 -39511 45313 100454 118242 111189 58863
12815E8863l6706j7924j5972m3922M8352N1057K538j6075J7911R298q6208j5369
$$ 58863 22157 4233 -11739 -55661 -7309 43748 46286 30211 48122 57420 -28788 -44157
12803d4157K5853l0928J6594P7140j0122l7166k8425k2102N4673M509k6936Q5206
$$ -44157 -18304 -49232 -32638 44502 34380 -2786 -31211 -53313 1360 5869 -21067 64139
12791F4139K3897p4105j46605J2945K5292o5360j6114M9555Q6619K1147q983k5303
$$ 64139 88036 13931 -132674 -119729 -94437 -159797 -175911 -126356 -39737 -18590 -27573 -52876
12779e2876p4100l6207L3305N4821O513M100J0430P441K2987O606k7782l2435
$$ -52876 -126976 -163183 -129878 -75057 -68544 -64444 -54014 -46573 -23586 -16980 -44762 -77197
12767g7197L652j1165P515L7545J1533M6380O2092N890k4645k4704j9117m6334
$$ -77197 -73545 -84710 -77195 -39650 -28117 18263 80355 86245 61600 36896 17779 -28555
12755b8555l7947Q9722K7210n4255K3666O6840P719l5681o2373k8855M3261n5939
$$ -28555 -66502 23220 50430 -3825 19841 86681 94400 58719 -3654 -32509 10752 -45187
12743d5187k7948L2381M5448l9795k7326j6093l852M4015O053L2349K9361K2260
$$ -45187 -73135 -40754 4694 -35101 -62427 -78520 -82372 -38357 -32304 45 29406 51666
12731E1666r5086k4610M6630k4226J3023L3143N212k5194j2757K3734J667R798
$$ 51666 -43420 -68030 -21400 -45626 -32603 540 5752 -19442 -32199 -8465 -6798 3000
12719C000L3192J8881O4645J6544K3195J6537m9482j17647q2000J2405P4960J00000
$$ 3000 36192 55073 119718 136262 159457 175994 126512 8865 -73135 -60730 14230 114230
12707A14230n345o3891o1934m1040k49O9000K0930j6397J9974M0096p118J2585
$$ 114230 108885 44994 -16940 -57980 -58229 10771 31701 15304 35278 75374 68256 80841
12695H0841n9756l0809n5516P849L3877O2676N461p0331n9564L8836L5319j6986
$$ 80841 21085 -9724 -65240 -57391 -23514 39162 44623 -25708 -85272 -46436 -11117 -28103
12683b8103L2844Q792R155k6296l3015n9670R395K8876L2937m5843n8586j3704
$$ -28103 4741 13533 22688 -3608 -36623 -96293 -86898 -58022 -25085 -70928 -129514 -143218
12671a43218K7993L0888M9576K8193J0270k1431P565M0587N5647n0737l4345j2210
$$ -143218 -115225 -84337 -34761 -6568 3702 -17729 -10164 30423 86070 35333 988 -11222
12659a1222O9236Q400r161m5509o133k3376N792L2864m483l9283N3427O3400n6784
$$ -11222 58014 66414 57253 11744 5611 -17765 -11973 20891 16408 -22875 30552 93952 37168
12646C7168o9122k7139L0446O8564l682o7003q9920L774M1469J4268m5968L9494
$$ 37168 -31954 -59093 -28647 39917 36235 -30768 -120688 -116914 -75445 -61177 -107145 -67651
12634f7651O8414L4640J7027l5740J9255k9361j04245n4519J6451J01361L3763
$$ -67651 763 35403 52430 16690 35945 6584 -97661 -152180 -135729 -34368 -605
12623f05j4123p0079k8704j0902L2097K098M2485p120L697J1572k2094Q958M3615
$$ -605 -14728 -84807 -113511 -124413 -92316 -90218 -47733 -54853 -51156 -39584 -61678 -52720 -9105
12610i105J3068L8078K3734j3910o8439k6491k3721M7254K1058K4607N504j2599
$$ -9105 3963 42041 65775 51865 -16574 -43065 -66786 -19532 1526 26133 31637 19038
12598A9038J8458o5959j9730L9859K7763J3505L1644O0139n2049J5033r1122l9542
$$ 19038 37496 -28463 -48193 -8334 19429 32934 64578 124717 72668 87701 -3421 -42963
12586d2963m80n4919K952N2717L1090O540K9251K8642M4058M8919m100j00757
$$ -42963 -43443 -98362 -95410 -42693 -11603 -5063 24188 52830 96888 145807 141707 40950
12574D0950r3876m9292J8329j1195O1016L0353O8293l3093j2737j286n9383k7916
$$ 40950 -52926 -102218 -83889 -95084 -34068 -3715 64578 31485 18748 17462 -41921 -69837
12562f9837l8792k5757O782K2059j1380J3740O0857j2203K4128k1873m097K1238
$$ -69837 -108629 -134386 -127604 -105545 -116925 -103185 -42328 -54531 -30403 -52276 -56373 -35135
12550c5135j9642O133k9274J1315N0702O5492j3076m0303J2770R3221J9521j9627
$$ -35135 -54777 -48644 -77918 -66603 -15901 49591 36515 -3788 8982 102203 121724 102097
12538A02097j19132q7754n2022K6429M9406M3328K3154M0852L4972M2641O6403
$$ 102097 -17035 -104789 -156811 -130382 -80976 -37648 -14494 26358 61330 103971 170374
12527A70374k5686n7748o3960K370K4619N673m4652l3327l8525k2933J9957p134
$$ 170374 144688 86940 22980 25350 49969 55642 10990 -22337 -60862 -83795 -63838 -70972
12515g0972M3501M0192N7471P2273l1146j9010o3894l5618K773N34Q686J5806
$$ -70972 -27471 12721 70192 142465 111319 92309 28415 -7203 -4430 -3896 4790 20596
12503B0596k3837j3359j4306L5670M4420O550j2650J9932J4171O42M0926m5793
$$ 20596 -3241 -16600 -30906 4764 49184 55734 43084 63016 77187 77829 118755 72962
12491G2962n9492M5486n157k9869n5061J4833o6720m1084j1630L5671R5828L1828
$$ 72962 13470 58956 53799 23930 -31131 -16298 -83018 -124102 -135732 -100061 -4233 27595
12479B7595k5699K290O5401Q692J2146K7224J8965k0931k7417j2787m4167j8974
$$ 27595 1896 4186 69587 78279 90425 117649 136614 115683 88266 75479 31312 12338
12467A2338L5027l0173K2612m1612J0147J7432k9759o093J823n6217R117K3017
$$ 12338 47365 17192 39804 -1808 8339 25771 -3988 -10081 -8258 -64475 -55358 -32341
12455c2341O0009l3823j2903M702n145n3676P1212M6181n95L2989o1813l8444
$$ -32341 27668 -6155 -19058 -14356 -19501 -73177 -1965 44216 43621 76610 14797 -23647
12443b3647J557L9700K0032j9788l1838k1459M011O4429R410n2445o9800R0432
$$ -23647 -22090 17610 37642 17854 -13984 -35443 -31432 32997 42407 -10038 -79838 10594
12431A0594N8395j0934m4235M011N0572m0629J4948k9189l0017j1416r874Q770
$$ 10594 68989 58055 13820 17831 68403 27774 42722 13533 -16484 -27900 -37774 -29004
12419b9004J2357l4980J1161j4859M9078N6894O8698J983l4878l1343j4003l7773
$$ -29004 -16647 -51627 -40466 -55325 -6247 50647 119345 121328 86450 55107 41104 3331
12407C331L7171L6623L9033P172p711R744O093m9923m4861j3017J4484K9990M049
$$ 3331 40502 77125 116158 123330 115619 125363 131456 81533 36672 23655 38139 68129 72178
12394G2178l851Q554M1227L864j7690l8855m7345r001N2938m2244o0253k256l9226
$$ 72178 68327 76881 118108 121972 104282 65427 18082 9081 62019 19775 -40478 -42734 -81960
12381h1960K6411J08814K0336M2800J4895m3375j8839n5817j3448K4487M004J0453
$$ -81960 -55549 53265 73601 116401 131296 87921 69082 13265 -183 24304 28308 38761
12369C8761l616J5833N2992R128j5758o4138l4514o840R063K6007k7619K7890
$$ 38761 35145 50978 103970 113098 97340 33202 -1312 -8152 911 26918 -701 27189
12357B7189Q1208L9870k5293j4272n679M0411k5881r1834J067O712K7723j0489
$$ 27189 108397 148267 122974 108702 103023 143434 117553 25719 26786 33498 61221 50732
12345E0732R380K2835j9924o233K1466J2313j02201n6599L8861N6398N9137K9520
$$ 50732 60112 82947 63023 56790 78256 90569 -11632 -68231 -29370 27028 86165 115685
12333A15685m3352M703L2520M6390j5868m5060k8937l8036m2736l4294j9862L5215
$$ 115685 72333 77036 109556 155946 140078 95018 66081 28045 -14691 -48985 -68847 -33632
12321c3632Q2553J4083q068l1646j5635k0591j2562L3285j5811j8407L7534k0442
$$ -33632 48921 63004 54936 23290 7655 -12936 -25498 7787 -8024 -26431 11103 -9339
12309i339q923R499N5757L0743o2760j127J5102N6957k4988p3559L6527j3049
$$ -9339 -18262 -8763 46994 77737 14977 13850 28952 85909 60921 -12638 23889 10840
12297A0840N9963p689K445L6022k5920m7765k0542o183O1623l9766q6216O5225
$$ 10840 70803 63114 65559 101581 75661 27896 7354 1171 62794 23028 -63188 2037
12285B037J30951l2140m7543l6279m0502J9552N5563L5744l5072k8736m1840l4225
$$ 2037 132988 100848 53305 17026 -23476 -3924 51639 87383 52311 23575 -18265 -52490
12273e2490O6371J13256M2613M700q275q1610q0036l1040K5428m868J3688M4986
$$ -52490 13881 127137 169750 174450 166175 84565 4529 -26511 -1083 -5951 7737 52723
12261E2723N2761j5770k1694P802k4025m6206j6061J3083N7766L5383o272k392
$$ 52723 105484 89714 68020 75822 51797 5591 -10470 2613 60379 95762 89490 87098
12249H7098l607k490k2391L163P3736L4188n2784n5118p5324L4695L1476J1292
$$ 87098 83491 81001 58610 61773 135509 169697 116913 61795 -13529 21166 52642 63934
12237F3934j4561M3215L1123n673k1717J5002m1616m7501M6132K7402m144k7855
$$ 63934 49373 92588 123711 118038 96321 111323 69707 22206 68338 95740 91596 63741
12225F3741j3334L7824J5358K2014k2153j9863n6050l8493J3996M6693K6055L7254
$$ 63741 50407 88231 103589 125603 103450 83587 27537 -10956 3040 49733 75788 113042
12213A13042J7625o0750J55K5312P0867K581j7886k7928j3636p43l1615J0125
$$ 113042 130667 69917 70072 95384 166251 168832 150946 123018 109382 108639 77024 87149
12201H7149K0635M938k8476M0117J9428j1885M4522m967m6271p6811K9671r382
$$ 87149 107784 112722 84246 124363 143791 131906 176428 171461 125190 48379 78050 68668
12189F8668O251o255L0046j4903j9248J7642J1251J6158L6561L4860k678r168
$$ 68668 74919 68664 98710 83807 64559 82201 93452 109610 146171 181031 178353 169185
12177A69185l2958k3875k5048J7467L8241j0538M4389O1114m4983l4214N679K9925
$$ 169185 136227 112352 87304 104771 143012 132474 176863 237977 192994 158780 164459 194384
12165A94384p625M911m3407j1438M3265l5857J3852J6596R692l186l0602q297
$$ 194384 186759 191670 148263 136825 180090 144233 158085 174681 184373 181187 150585 142288
12153A42288J4672M5804j1777l7936k1075K0382J6695l9231n6604K8114N4658
$$ 142288 156960 202764 190987 153051 131976 152358 169053 129822 73218 101332 155990
12142A55990J5411M871M814K2775O3911K111l4528m1968l8042k5659l0743j5237
$$ 155990 171401 176272 181086 203861 267772 269883 235355 193387 155345 129686 98943 83706
12130H3706L6163k1549K0644m907K738L6728J4918M7020p8351q9540K0514N2819
$$ 83706 119869 98320 118964 114057 116795 153523 168441 215461 137110 47570 68084 120903
12118A20903m0878M6888J1431P1361L361p902M1421K3102N8656J7595m5456m6748
$$ 120903 80025 126913 138344 209705 213066 205164 246585 269687 328343 345938 300482 253734
12106B53734Q53L8555m9231r4670P8846K3371P2970M9823K4691m9393j6923K497
$$ 253734 254587 293142 243911 149241 228087 251458 324428 374251 398942 349549 332626 335123
12094C35123k9833k7747k759O9629M0496K3597l8406L6067N482n9982K2689j9082
$$ 335123 305290 277543 274784 344413 384909 408506 370100 406167 411649 351667 374356 355274
12082C55274n9719L8047O6419j0401n3798L93J2171J7483R187j5998J3874L9806
$$ 355274 295555 333602 400021 389620 335822 336215 348386 365869 375056 359058 372932 412738
12070D12738l6626J3759K8895r069J5626k8237n9496Q721P6652O7694P5672L198
$$ 412738 376112 389871 418766 409697 425323 397086 337590 346311 422963 490657 566329 569527
12058E69527m2026J4361k63M8436N2304N370K9881J03583K4179r6637m7087J13852
$$ 569527 527501 541862 541599 590035 642339 647709 677590 781173 805352 708715 661628 775480
12046G75480O0779r3249n3623m0284o1329Q359j706O1049K3296J8856L0330M0418
$$ 775480 836259 743010 689387 649103 587774 596133 594427 655476 678772 697628 727958 768376
12034G68376N8479p3560P276L9409n410Q6588N3294M4648j4844j5011j948J9771
$$ 768376 826855 753295 760571 799980 794570 881158 934452 979100 964256 949245 947297 967068
12022I67068j8041l2930j9305o999M642O0417j2334l3345j9457R0051R9830L2634
$$ 967068 949027 916097 896792 889793 894435 954852 942518 909173 889716 979767 1079597 1112231
12010A112231L1569R0674J17236O9220P865n4189l3922L8104j422L7135P3563
$$ 1112231 1143800 1234474 1351710 1420930 1428795 1374606 1340684 1378788 1377366 1414501 1488064
11999A488064L5229J2821M4744N9024J9914N3055J42554J09446o2325L9524J12301
$$ 1488064 1523293 1536114 1580858 1639882 1659796 1712851 1855405 1964851 1902526 1942050 2054351
11988B054351K8346m49L3459N1894R2652R1890J01251K1078K7763M6703R1346
$$ 2054351 2082697 2082248 2115707 2167601 2260253 2352143 2453394 2474472 2502235 2548938 2640284
11977B640284J39847J35962J20115J09401N6209M4529J61806J71995J50005J74730
$$ 2640284 2780131 2916093 3036208 3145609 3201818 3246347 3408153 3580148 3730153 3904883
11967C904883Q3301J17295J23250J20872J93773J91454J68682J40988K87373K74722
$$ 3904883 3988184 4105479 4228729 4349601 4543374 4734828 4903510 5044498 5331871 5606593
11957E606593K70852L19750L04892K86386K79568L01391L47626M00536N30788
$$ 5606593 5877445 6197195 6502087 6788473 7068041 7369432 7717058 8117594 8648382
11948H648382M28528M62426N24473N20368N92855O64710P61122P76731P95027
$$ 8648382 9076910 9539336 10063809 10584177 11177032 11841742 12602864 13379595 14174622
11939A4174622R25065J016599J097885J207627J291616J373429J410734J502334
$$ 14174622 15099687 16116286 17214171 18421798 19713414 21086843 22497577 23999911
11931B3999911J673542J876679J911877K005573K111085K232773K241554K346515
$$ 23999911 25673453 27550132 29462009 31467582 33578667 35811440 38052994 40399509
11923D0399509K371189K302402K154795K025559J776309J541080J178158P94966
$$ 40399509 42770698 45073100 47227895 49253454 51029763 52570843 53749001 54543967
11915E4543967L52684j79030o51279j045146j413808j807176k143191k276797
$$ 54543967 54896651 54717621 54066342 53021196 51607388 49800212 47657021 45380224
11907D5380224k391764k321757k432640k355985k272525k148491j992466j905921
$$ 45380224 42988460 40666703 38234063 35878078 33605553 31457062 29464596 27558675
11899B7558675j784367j650842j584967j428217j283324j227764j213257j071970
$$ 27558675 25774308 24123466 22538499 21110282 19826958 18599194 17385937 16313967
11891A6313967r75409r18287p73856o60437o88810p04297n76509n35464n10124
$$ 16313967 15338558 14420271 13646415 12985978 12297168 11592871 11016362 10480898 9970774
11882I970774m82797m83572n26225m52009l67480l01740l02077l24784k36872
$$ 9970774 9487977 9004405 8478180 8026171 7658691 7356951 7054874 6730090 6493218
11873F493218k20246k29707k77638k65363k41236k03234k02833k59896j12067
$$ 6493218 6272972 6043265 5765627 5500264 5259028 5055794 4852961 4593065 4480998
11864D480998p9093j10966j07263k01457k16618r8921j24252n0978r6069j95897
$$ 4480998 4401905 4290939 4183676 3982219 3765601 3666680 3542428 3491450 3395381 3199484
11854C199484j45761n9377j10816q5353L962k2304p9298q7039o8065o4687p1347
$$ 3199484 3053723 2994346 2883530 2798177 2802139 2779835 2700537 2613498 2545433 2480746 2409399
11843B409399q8283p9125o3045n8258p8600j2745j3217R022k4511r5935j066r4318
$$ 2409399 2321116 2241991 2178946 2120688 2042088 2029343 2016126 2025148 2000637 1904702 1903636 1809318
11831A809318p8077m1421J1122n7151m9522k4466n2693J8085r186p9831o9217
$$ 1809318 1731241 1689820 1700942 1643791 1594269 1569803 1517110 1535195 1526009 1446178 1376961
11820A376961n6291J0442j968m4420l6721k2134o0986l9624l861k9214l7160l357
$$ 1376961 1320670 1331112 1329144 1284724 1248003 1225869 1164883 1125259 1121398 1092184 1055024 1051667
11808A051667k5442M7141K7062L654l9505o9115n9934j8847L4103k7459J212j0512
$$ 1051667 1026225 1073366 1100428 1104082 1064577 995462 935528 916681 950784 923325 924537 914025
11796I14025l3231j7531J5160j4560L6956M3769o8179m4894o2124m3483m0038
$$ 914025 880794 863263 878423 863863 900819 944588 876409 831515 769391 725908 685870
11785F85870N6448q8630m4097J4176K2669p855q3140N2116q012q2469P097K2747
$$ 685870 742318 653688 609591 623767 646436 638581 555441 607557 599545 517076 524173 546920
11773E46920r394r675J505N5029P4129k6215p9575M077k6407q8535Q0987K4075
$$ 546920 537526 527851 529356 584385 658514 632299 552724 556801 530394 441859 522846 546921
11761E46921n2716L5029M2087N7877j7715j9143m6354n4311j2197k9752j2398
$$ 546921 494205 529234 571321 629198 611483 592340 545986 491675 479478 449726 437328
11750D37328l8961n9796q89P8235O4758j4871J838J6303N4484M0978p2591q5968
$$ 437328 398367 338571 337682 415917 480675 465804 467642 483945 538429 579407 506816 420848
11738D20848k2319k7506o518m394N3666O3923j1434l4168n9589P607M8527n7016
$$ 420848 398529 371023 364505 360111 413777 477700 466266 432098 372509 380116 428643 371627
11726C71627m2563m1895j28625J1992O3636P4203J7993j9259P0982R5245K5193
$$ 371627 329064 287169 158544 170536 234172 308375 326368 307109 378091 473336 498529
11715D98529m8760m0719j8998m1167l521O146M3929j8285Q948m7713m3216l0219
$$ 498529 449769 409050 390052 348885 345364 351510 395439 377154 386102 338389 295173 264954
11703B64954J69K179m2453O142O2195j7356n7295m4495K6212n538J4636j898O4131
$$ 264954 265123 267302 224849 230991 293186 275830 218535 174040 200252 194714 209350 207452 271583
11690B71583K1746k6960r3372J857P777N4668J8738j6526J4746O440P7498n2622
$$ 271583 293329 266369 172997 174854 182631 237299 256037 239511 254257 260697 338195 285573
11678B85573q2887O059L8206m477o3643n0815j0504M1776Q4489r506l8843K0560
$$ 285573 202686 208745 246951 242474 178831 128016 117512 159288 243777 234271 195428 215988
11666B15988L4033j87m8062n702M5174K9712m3050q4473o0544M9582Q2925k3941
$$ 215988 250021 249834 201772 196070 241244 270956 227906 143433 82889 132471 215396 191455
11654A91455O752j1748n309k741l3963K4677J04044L8504q5896n2729p720J7127
$$ 191455 198207 186459 181150 178409 144446 169123 273167 311671 225775 173046 165326 182453
11642A82453m8638m683k3209j562n4086M2378N7027j026L177J5454k8024P044
$$ 182453 133815 129132 105923 104361 50275 92653 149680 148654 151831 167285 139261 146305
11630A46305O2332o0548o4771n0057L36l235P565j9267J8844R798N1477O2806
$$ 146305 208637 148089 83318 33261 33597 30362 37927 18660 37504 47302 98779 161585
11618A61585p4946o9109l398L2563P0528M4567k0164K6617j9884K0851l3031p6727
$$ 161585 86639 17530 14132 46695 117223 161790 141626 168243 148359 169210 136179 59452
11606E9452k4975J05401L431j0173O2697L3176l1859n4472r3251m6861L3827L8629
$$ 59452 34477 139878 143309 133136 195833 229009 197150 142678 49427 2566 36393 75022
11594G5022N1612m027L0737o4352M4997M7026k6604K1928P0005J5102k1796r7709
$$ 75022 126634 122607 153344 88992 133989 181015 154411 176339 246344 261446 239650 141941
11582A41941j22498m646m326J3312J07085M1977p3182l4733r067J1948k021O3368
$$ 141941 19443 14797 10471 23783 130868 172845 99663 64930 55863 67811 65790 129158
11570A29158O8401j3683o9750p0645K2295J4847N4518m888r3407M2083L0085J0841
$$ 129158 197559 183876 114126 43481 65776 80623 135141 130253 36846 78929 109014 119855
11558A19855o374K2903K8323l6275m66n508m9589p61m8385n5182j1005k3591L8777
$$ 119855 113481 136384 164707 128432 127966 122458 72869 72108 23723 -31459 -42464 -66055 -27278
11545b7278N9895L2193K7626N5901j865n5161o5036J0469N2550m616p1808n3998
$$ -27278 32617 64810 92436 148337 146472 91311 26275 36744 89294 84678 12870 -41128
11533d1128K3533O683K0543K038j7714j0109l1263Q460R4884M1028M6852n1855
$$ -41128 -17595 -10912 9631 11669 -6045 -16154 -47417 -38957 55927 96955 143807 91952
11521I1952k9553k3693K5423N9399j7308k592l4318m3916m0947N6934M0474o7730
$$ 91952 62399 38706 64129 123528 106220 103628 69310 25394 -15553 41381 81855 14125
11509A4125k5853L2185Q1214q368N74K5720j1441o8873J5509r535j717N2093L3150
$$ 14125 -11728 20457 101671 93303 93877 119597 108156 39283 54792 45257 43540 95633 128783
11496A28783l3347j6620J1632O542l5935k502J9838L6870K4646K9729m4839k0110
$$ 128783 95436 78816 90448 96990 61055 58553 78391 115261 139907 169636 124797 104687
11484A04687p9864m4299L5666K6059p9314m3986L3321P5512R6988O3027M3460
$$ 104687 24823 -19476 16190 42249 -37065 -81051 -47730 27782 124770 187797 231257
11473B31257m0793j00049k10M3817l7980m6978K4771J8924m0867j5621l320P818
$$ 231257 190464 90415 90205 134022 96042 49064 73835 92759 51892 36271 32951 40769
11461D0769k5520Q0734P5467o1232k01010l1395K0387O7587P4869N7694l9424
$$ 40769 15249 95983 171450 110218 -90792 -122187 -101800 -34213 40656 98350 58926
11450E8926j9866N5138K1715L7504K7319p4101k0040Q065l2466j7888l1599j3510
$$ 58926 39060 94198 115913 153417 180736 106635 86595 94660 62194 44306 12707 -803
11438h03j524J7421L6837K0332n947o9408K1474R0998r5836j08240L4129O8260
$$ -803 -2327 15094 51931 72263 66316 -3092 18382 109380 13544 -94696 -60567 7693
11426G693J6932l4913J4731M1324M2507q381j5684L7994m0795l8515K3039J5570
$$ 7693 24625 -10288 4443 45767 88274 79893 64209 102203 61408 22893 45932 61502
11414F1502l1880m6877k1244K0862j1507k3026j6084Q161R9990N8599o1806l9589
$$ 61502 29622 -17255 -38499 -17637 -29144 -52170 -68254 -60093 39897 98496 36690 -2899
11402b899j7459M1920R0539N3441p2583n7276l4492k209K8507K3074m4326r9788
$$ -2899 -20358 21562 112101 165542 92959 35683 1191 -1018 27489 50563 6237 -93551
11390i3551l1915l1043K2918R5157J02597k1633k4712k575j0327o7792K8148K8967
$$ -93551 -125466 -156509 -133591 -38434 64163 42530 17818 15243 4916 -62876 -34728 -5761
11378e761L6457R178Q202p696j3806J4123L973K8417j6042o684n1840k9151j0879
$$ -5761 30696 39874 48076 40380 26574 40697 44670 73087 57045 50361 -1479 -30630 -41509
11365d1509m9675J16695O0897l4760J1411L438k7568l10L4861k5380K4774l314
$$ -41509 -91184 25511 86408 51648 63059 66497 38929 38619 73480 48100 72874 69560
11353F9560N4020O5944p6735o6130j2512j0418m3952m7049N4021L2682j1525k9444
$$ 69560 123580 189524 112789 46659 34147 23729 -20223 -67272 -13251 19431 7906 -21538
11341b1538k9744p4054K5711N5557j3750J8286K3063n5956O3487M1984K4670l2496
$$ -21538 -51282 -125336 -99625 -44068 -57818 -39532 -16469 -72425 -8938 33046 57716 25220
11329B5220r301Q454o516Q549k4322L7434N4710l7791l6375p8629K2581J50J5873
$$ 25220 15919 24373 17857 26406 2084 39518 94228 56437 20062 -58567 -35986 -35836 -19963
11316a9963K2782j121j8828N9009M33n6318m4460K4563L6644N8538m0976p109
$$ -19963 2819 1698 -17130 41879 42312 -14006 -58466 -33903 2741 61279 20303 13194
11304A3194M57p2035k0071J12299l599l1842k315k5277k4023k203P6337J2021
$$ 13194 13651 -58384 -78455 33844 30245 -1597 -3912 -29189 -53212 -55415 20922 32943
11292C2943l4368N4341L0268j5708l2572m2085K6592O8668n8214o5598J4210K2507
$$ 32943 -1425 52916 83184 67476 34904 -7181 19411 88079 29865 -35733 -21523 984
11280I84r799L6206J6632M4798o8964J0302Q8617j5361l3084o812k7854L6928
$$ 984 -8815 27391 44023 88821 19857 30159 118776 103415 70331 63519 35665 72593
11268G2593l2124q5576J235L2939l9274l8758L4828j7299l8226L8437M4483O269
$$ 72593 40469 -45107 -43872 -10933 -50207 -88965 -54137 -71436 -109662 -71225 -26742 -20473
11256b0473k8588P183P134m7531l3744K9313Q2569Q2320P9956L6408o5290n5834
$$ -20473 -49061 -41878 -34744 -82275 -116019 -86706 -4137 78183 158139 194547 129257 73423
11244G3423m5536p628j8238M7704j1702J8418J237l2707l0228J4292o658M8598
$$ 73423 27887 20259 2021 49725 38023 56441 57678 24971 -5257 9035 2377 50975
11232E0975J8293k1018l459p1912m212J7893P8320r287N962O0117k5251k5630
$$ 50975 69268 48250 44791 -27121 -31333 -13440 64880 55593 61555 121672 96421 70791
11220G0791l0726P89n9173n4354m9595m938N8262J13996K7081N228o4877n5445
$$ 70791 40065 40854 -18319 -72673 -122268 -127206 -68944 45052 72133 77361 12484 -42961
11208d2961j260M2207M3340N215j5873m724k7658j0233J3986K202m7051k5513
$$ -42961 -44221 -2014 41326 46541 30668 25944 -1714 -11947 2039 4241 -42810 -68323
11196f8323k3420M7853M8173K3334M3130M2429j5437j0862K6943M0159n0853l6745
$$ -68323 -91743 -43890 4283 27617 70747 113176 97739 86877 113820 153979 103126 66381
11184F6381J3513J3949k6014j2138k1923J6548j667J3658j1765n430q909k1944
$$ 66381 79894 93843 67829 55691 33768 50316 48649 62307 50542 45112 36203 14259
11172A4259n1512L940j6928N3188m1189m4041M6505P8244J3276n3683k2628R307
$$ 14259 -37253 -33313 -50241 2947 -38242 -82283 -35778 42466 55742 2059 -20569 -11262
11160a1262J1966L3837L200k0884k2682q099L2987l2231j03675n7595J21735K1479
$$ -11262 704 34541 37741 16857 -5825 -13924 19063 -13168 -116843 -174438 -52703 -31224
11148c1224q4648M2089K5939J1118k8984k6410M4762K8169P2307M311m4967o5232
$$ -31224 -115872 -73783 -47844 -36726 -65710 -92120 -47358 -19189 53118 57429 12462 -52770
11136e2770j1812K9456M9928J4871n2150l4611L7977o745J9306p902L5754J8291
$$ -52770 -64582 -35126 14802 29673 -22477 -57088 -19111 -25856 -6550 -14452 21302 39593
11124C9593j9169n1382n7874O66M4702J0243J5162p817M0171K1917J0943L3824
$$ 39593 20424 -30958 -88832 -88166 -43464 -33221 -18059 -25876 14295 36212 47155 80979
11112H0979J1041m5531j926K2029j6374j9567N7038n5668L780q750l8405P572
$$ 80979 92020 46489 44563 66592 50218 30651 87689 32021 35801 27051 -11354 -3782
11100c782j0502K3314P7198K2700r8970o6755k1160k921j2066N377J6914l7931
$$ -3782 -14284 9030 86228 108928 9958 -56797 -77957 -80878 -92944 -87567 -70653 -108584
11088a08584J14784J0291m1691M0744J9088n0739l1357j5385j2250K6122m9796
$$ -108584 6200 16491 -25200 15544 34632 -16107 -47464 -62849 -75099 -48977 -98773
11077i8773N7661P586M185K5240K649p621M5942l9070q018k6086K730r148Q23
$$ -98773 -41112 -33526 -29341 -4101 -1452 -9073 36869 -2201 -10219 -36305 -33575 -42723 -41900
11064d1900P4478P330m6060J1053K17n5108P2788J9960l2293l2681J2042J6877
$$ -41900 32578 39908 -6152 4901 5118 -49990 22798 42758 10465 -22216 -10174 6703
11052F703k9200K2825M7805l4719K912M5242J22786L4128n9232j4585J20010P8150
$$ 6703 -22497 328 48133 13414 16326 61568 184354 218482 159250 144665 264675 342825
11040C42825j01741q1098k746j5486l6265J6363Q7493M2671P0722K4464k3968
$$ 342825 241084 159986 157240 141754 105489 121852 209345 252016 322738 347202 323234
11029C23234K8600N8555m3379l7514n1880l0211J0492L3943R3496M6297N1322
$$ 323234 351834 410389 367010 329496 277616 247405 257897 291840 385336 431633 482955
11018D82955l1034q736l772p6001p7946o9111l1045N0922N1517N0217j7764p1857
$$ 482955 451921 443185 439413 363412 285466 216355 185310 236232 287749 337966 320202 248345
11006B48345M663N1148R961m6668p2415k9247J36k4889m3767r48K6877j7601n2588
$$ 248345 253008 304156 314117 267449 195034 165787 165923 141034 97267 96319 123196 105595 53007
10993E3007j8883L9048K4605o363n2777k4221o6933n5615Q5313L0200p1743k6462
$$ 53007 34124 73172 97777 91414 38637 14416 -52517 -108132 -22819 7381 -64362 -90824
10981i0824K5536j521k3094L969K4155M9917j6048N65K2205J6650k988J466R8079
$$ -90824 -65288 -66809 -89903 -85934 -61779 -11862 -27910 -27345 -5140 11510 8522 9988 108067
10968A08067K2163L620K3238K9154J8219n6772q8354n786m5608M790M1647k9348
$$ 108067 130230 133850 157088 186242 204461 147689 59335 53549 7941 12731 54378 25030
10956B5030l4101p940M8274m5119Q598J5963L2024n0441J6967K1441l1561m1846
$$ 25030 -9071 -17011 31263 -13856 -5258 10705 42729 -7712 9255 30696 -865 -42711
10944d2711n761K1764m831J3019n6706j1463P141N2748R3657k0189j3545L009
$$ -42711 -48472 -26708 -31539 -18520 -75226 -86689 -79548 -26800 66857 46668 33123 36132
10932C6132J961o3122m8018n9430K54J6842Q7441J1352k3942J5940o5568J576
$$ 36132 38093 -25029 -73047 -132477 -132223 -115381 -27940 -16588 -40530 -24590 -90158 -88582
10920h8582M0908l7978K7184O2490k6951n8602k8900J4028K7917M3611m3698M8055
$$ -88582 -47674 -85652 -58468 4022 -22929 -81531 -110431 -96403 -68486 -24875 -68573 -20518
10908b0518j6012K1603j3733M8398J3572o7400q2388M7889R1738n897n013N774
$$ -20518 -36530 -14927 -28660 19738 33310 -34090 -116478 -68589 23149 17252 12239 18013
10896A8013l4091J5752n277o8846J1109n8287M3074K4834m6251p326O5511n0931
$$ 18013 -16078 -326 -5603 -74449 -63340 -121627 -78553 -53719 -99970 -107296 -41785 -92716
10884i2716K4064j1929K4290N2835O306n6645k7391K1818P0563k3693k2645j1882
$$ -92716 -68652 -80581 -56291 -3456 2850 -53795 -81186 -59368 11195 -12498 -35143 -47025
10872d7025k7464N7127O8473J2446o2617j5627j1145M874L7870k8991J5543j5013
$$ -47025 -74489 -17362 51111 63557 940 -14687 -25832 -20958 16912 -12079 3464 -11549
10860a1549k0310n7635n5209L7340J5149l4289J6687P1294P473j6860L87l9651
$$ -11549 -31859 -89494 -144703 -107363 -92214 -126503 -109816 -38522 -31049 -47909 -47522 -87173
10848h7173M5638L2748j01289k0777R376M7977M7636N6738k6606J2905r142q0981
$$ -87173 -41535 -8787 -110076 -130853 -121477 -73500 -25864 30874 4268 17173 8031 -72950
10836g2950k3011K2004K7420l8987k6190L9256p792O43M9684j2709k6243o3450
$$ -72950 -95961 -73957 -46537 -85524 -111714 -72458 -80250 -79607 -29923 -42632 -68875 -132325
10824a32325j1041L9671M2192M499k2357J3017k4611N4551O597L658L6041r5535
$$ -132325 -143366 -103695 -61503 -57004 -79361 -66344 -90955 -36404 -29807 -26149 9892 -85643
10812h5643l6698R726L536n110j0329P1579J7791J6950K0658k7130r714J156q573
$$ -85643 -122341 -112615 -109079 -114189 -124518 -52939 -35148 -18198 2460 -24670 -34384 -33228 -41801
10799d1801m0831o7440K3202K7696n152L6451J9594m4421M7139P2953M1646K8002
$$ -41801 -82632 -150072 -126870 -99174 -104326 -67875 -48281 -92702 -45563 27390 69036 97038
10787I7038n8170q7068J0076k6313n9130m0496k5575q078L9518j6733k0525k0703
$$ 97038 38868 -48200 -38124 -64437 -123567 -164063 -189638 -197716 -158198 -174931 -195456 -216159
10775b16159J9262J2956O2749J00583J9248l9232K6371L8115o7399j2479Q704
$$ -216159 -196897 -183941 -121192 -20609 -1361 -40593 -14222 23893 -43506 -55985 -47281
10764d7281j5447P0270k7718k4719O918l385n8497L897m5795L1L5584o618M1978
$$ -47281 -62728 7542 -20176 -44895 -37977 -41362 -99859 -95962 -141757 -141726 -106142 -112760 -70782
10751g0782Q1056L2525L9454M1889N1720J9292q1341P552o7448o63j486Q478J2698
$$ -70782 10274 42799 82253 124142 175862 195154 113813 121365 53917 53254 51768 60246 72944
10738G2944O126j6911K7084j3836K5655K2162m1651l4882K5957J0395j2988n5522
$$ 72944 79070 62159 89243 75407 101062 123224 81573 46691 72648 83043 70055 14533
10726A4533m9076K8088L8270J7442j1609o85M2953J8074N4993K5948l7406j2338
$$ 14533 -34543 -6455 31815 49257 37648 36963 79916 97990 152983 178931 141525 129187
10714A29187L5568m7224j17531L9471K1009O641R597k3750o26N5881M141j7536
$$ 129187 164755 117531 0 39471 60480 67121 76718 52968 52342 108223 112364 94828
10702I4828J5485k1605j2252M0786j3351l2031j1657o7926L2679J382k9834J8672
$$ 94828 110313 88708 76456 117242 103891 71860 60203 -7723 24956 26338 -3496 15176
10690A5176R1956L8085o7454k6457m875P12M8344m2144J9053K3781N3290M4814
$$ 15176 107132 145217 77763 51306 46431 47143 95487 53343 72396 96177 149467 194281
10678A94281n0685q1602J9837N869K2415P339k2532K994L24J3448K4778l2274
$$ 194281 143596 61994 81831 87700 110115 117454 94922 97916 98240 111688 136466 104192
10666A04192j5435M350k1155O5249L5565k0950K0763k4946O5274P5645L2424J0696
$$ 104192 88757 93107 71952 137201 172766 151816 172579 147633 212907 288552 320976 331672
10654C31672k2426o093k9314l2028N3548M4056J01926R0588Q8743K9590l9956
$$ 331672 309246 303153 273839 241811 295359 339415 441341 531929 620672 650262 610306
10643F10306J2675P6926P9994N3164K4228R2211J38480J6659Q8663J46624J43509
$$ 610306 622981 699907 779901 833065 857293 949504 1087984 1104643 1193306 1339930 1483439
10632A483439K68287K17226L04144L22909K85061L56781N00741N74825O99428
$$ 1483439 1751726 1968952 2273096 2596005 2881066 3237847 3738588 4313413 5012841
10623E012841R14657J171425J391479J812777K064701K429762K788608L131277
$$ 5012841 5927498 7098923 8490402 10303179 12367880 14797642 17586250 20717527
10615B0717527L400978L375059K941238J906113P39063j6717J72734J010112K200316
$$ 20717527 24118505 27493564 30434802 32340915 33079978 33063261 33235995 34246107 36446423
10606C6446423L255174M237148N047072N740198N835250M464694J659057j507622
$$ 36446423 39701597 43938745 48985817 54726015 60561265 65025959 66685016 65177394
10598F5177394l228473k828660j156116R43272K915452M458108N582816O339244
$$ 65177394 61948921 59120261 57964145 58907417 61822869 66280977 71863793 78203037
10590G8203037N939206L367840j263198o013153q435830p903939n636650l123190
$$ 78203037 84142243 87510083 86246885 80233732 71797902 63893963 58257313 55134123
10582E5134123q89225P87000J875049K504993K190414L18263k962060o016206
$$ 55134123 54244898 55031898 56906947 59411940 61602354 61920617 58958557 52942351
10574E2942351p262571o627243m987859l142855j693000p12164j23800R2133k15423
$$ 52942351 45679780 39052537 34064678 30921823 29228823 28516659 28392859 28484992 28269569
10565B8269569j089535k240775l409167l871474l659650l050482k284069j614163
$$ 28269569 27180034 24939259 21530092 17658618 13998968 10948486 8664417 7050254
10557G050254j148382q81664p27678m98125l78714m02630k91180j81430k43248
$$ 7050254 5901872 5020208 4292530 3794405 3415691 3013061 2721881 2540451 2297203
10548B297203k45151j47533j10883j13241j38796q0868n5396j42348p9524o0423
$$ 2297203 2052052 1904519 1793636 1680395 1541599 1460731 1405335 1262987 1183463 1123040
10538A123040o3297p5864m9544k9715n6488m8860p3582J231J1396m0163n2823
$$ 1123040 1059743 983879 934335 904620 848132 799272 725690 726921 738317 698154 645331
10527F45331p582P9437k0448n1526j897J5417J4179q712o5477l4734j05364n8651
$$ 645331 637749 717186 696738 645212 643315 658732 672911 664199 598722 563988 458624 399973
10515C99973K9541L4610n6201q304M2414l3043p1697K6836O60M3246o173J7452
$$ 399973 429514 464124 407923 399619 442033 408990 337293 364129 364789 408035 401862 419314
10503D19314o563k2989N2349M6984J4496l0234r4264q4858q60j5945O712M4609
$$ 419314 412751 389762 442111 489095 503591 473357 379093 294235 293375 277430 284142 328751
10491C28751j9933N5792K7794q255p5074q2358j9655O9298j2291m9333k5412O3755
$$ 328751 308818 364610 392404 384149 309075 226717 207062 276360 264069 214736 189324 253079
10479B53079J0393K060Q265O421r408L409k3771k8091j6964j3508j6468P3736
$$ 253079 263472 265532 273797 280218 270810 274219 250448 222357 205393 191885 175417 249153
10467B49153Q7042j02704p0896j4652j714N5022P9246n4824n8110M3631l2086
$$ 249153 336195 233491 162595 147943 146229 201251 280497 225673 167563 211194 179108
10456A79108j7417l7333N2765J03037K228l9188L226l1881j2700q3926m0576k3926
$$ 179108 161691 124358 177123 280160 282388 243200 246426 214545 201845 117919 77343 53417
10444E3417q7583O7961O6126J7912M58K1841K2949j4567J1372o2256m3973J6517
$$ 53417 -34166 33795 99921 117833 118291 140132 163081 148514 159886 97630 53657 70174
10432G0174M5251L7982j2958K2379M9853k4350r5547O932m3177k7464J193K8665
$$ 70174 115425 153407 140449 162828 212681 188331 92784 99716 56539 29075 30268 58933
10420E8933N9465R895J862N98o2766J2838L3503J9087l6448M702L8048l2203K5405
$$ 58933 118398 128293 130155 130753 67987 80825 114328 133415 96967 101669 139717 107514 132919
10407A32919L0334j6335k6209j762M0422J9958L5755O655o5785k5673K7788p5658
$$ 132919 163253 146918 120709 118947 159369 179327 215082 221737 155952 130279 158067 82409
10395H2409p7339k524P7265M293j4712q768O2868M3686K4912k1794k5011q8570
$$ 82409 5070 2546 79811 84104 69392 60624 123492 167178 192090 170296 145285 56715
10383E6715m1290J3180M5287M7918m4208j9228p908L4M4319M4087r448J3545n783
$$ 56715 15425 28605 73892 121810 77602 58374 50466 50500 94819 138906 129458 143003 137220
10370A37220k4532K478J5692j1100j7507J1520J826o201l5186M5387k1414l0180
$$ 137220 112688 115166 130858 119758 102251 113771 115597 109396 74210 119597 98183 68003
10358F8003k8384J734n2645l3211N0999J9042L663J0457L7188m569m905l6920
$$ 68003 39619 41353 -11292 -44503 6496 25538 29201 39658 76846 72277 67372 30452
10346C0452k2037j475j9179K3964N1104O9273Q4801j1477p3777n9288J1714N504
$$ 30452 8415 6940 -12239 11725 62829 132102 216903 205426 131649 72361 84075 89579
10334H9579Q131l1588k9724m3081M3633L5405k6563n7844q414P1004P1365J9776
$$ 89579 97710 66122 36398 -6683 36950 72355 45792 -12052 -20466 50538 121903 141679
10322A41679L8719p3190p4606r3947j3587M7176P3032K1559j5838J846O439K4366
$$ 141679 180398 107208 32602 -61345 -74932 -27756 45276 66835 50997 52843 59282 83648
10310H3648N6510L4800m1876n8688k3436l8789q387L9535M27m8259m781L062j0250
$$ 83648 140158 174958 133082 74394 50958 12169 3782 43317 43744 -4515 -9296 -6234 -16484
10297a6484M689N3027J8037m6649M1124Q1183J0236q3168m9957m2430K6500j1624
$$ -16484 -11795 41232 59269 12620 53744 134927 145163 61995 12038 -30392 -3892 -15516
10285a5516R971k4927R153O1030R5522K4390n0725j5489m9800k0710R2217k775
$$ -15516 -5545 -30472 -21319 39711 135233 159623 108898 93409 43609 22899 115116 112341
10273A12341m477l9418l1355J6068Q95l1329p144j100l4102k234M9106K5628k0741
$$ 112341 107864 68446 37091 53159 54054 22725 15581 14481 -19621 -21855 27251 52879 32138
10260C2138l0910M164O0509L2731n9070j3655K8765p829k6340r040J551O1248
$$ 32138 1228 5392 65901 98632 39562 25907 54672 46843 20503 11463 13014 74262
10248G4262M0624O8372n1376r5789k7680L744J6468n3645j7310l3202k9793J27121
$$ 74262 114886 183258 131882 36093 8413 12157 28625 -25020 -42330 -75532 -105325 21796
10236B1796J9554k2533k1881J7035O8011l620j0959Q950K8149p690l359p8842
$$ 21796 41350 18817 -3064 13971 81982 78362 67403 76353 104502 96812 93453 14611
10224A4611m5260J0846L9540j9373k7538r83M17l3410r48K8933n3864O897O1225
$$ 14611 -30649 -19803 19737 364 -27174 -28157 -27740 -61150 -62098 -33165 -87029 -80132 -18907
10211a8907K8245L953m3129l0401Q0381k062j04708J5175L4499N591k0566K4667
$$ -18907 9338 13291 -29838 -60239 20142 18080 -86628 -71453 -36954 -31363 -51929 -27262
10199b7262j3431P9780K175n151m826k9945J6565K2770R653J9512L3084m4367
$$ -27262 -40693 39087 41262 36111 31285 1340 17905 40675 50328 69840 102924 58557
10187E8557M7130K5470p9386L075K8753J3610r88K0728J2243M0566Q4973R423
$$ 58557 105687 131157 51771 54846 83599 97209 96221 116949 129192 169758 254731 264154
10175B64154q7461m752J608k3296l1445K6868J1791j4130K2065O0427J34341M9207
$$ 264154 176693 171941 173549 150253 118808 145676 157467 143337 165402 225829 360170 409377
10163D09377M7220j2161n2353n781n6437K40J2427N9100L5014Q1478P418P214
$$ 409377 456597 444436 392083 386302 329865 330105 342532 401632 436646 518124 525542 532756
10151E32756k6374m4959j05638m9798O2778P296J068j451l2256k5545J6513k8359
$$ 532756 506382 461423 355785 305987 368765 376061 377129 375678 343422 317877 334390 306031
10139C06031l6175j14058n4993M9133P6833M6367k0793m5085m5737Q743k4124
$$ 306031 269856 155798 100805 149938 226771 273138 252345 207260 161523 170266 146142
10128A46142P8950l6524m4599p8214m2183m9299P283l3133l997L8870k326J0054
$$ 146142 225092 188568 143969 65755 23572 -25727 -18444 -51577 -55574 -16704 -19030 -8976
10116h976P4851L1718n1153q3465p5687K4019j2790P204Q6248Q9561l7790J2247
$$ -8976 65875 97593 46440 -37025 -112712 -88693 -101483 -94279 -8031 81530 43740 55987
10104E5987Q1370k2926k8319k4908n0715m2218L867J1890R556k2920k0299K2413
$$ 55987 137357 114431 86112 61204 10489 -31729 -27862 -15972 -6416 -29336 -49635 -27222
10092b7222P1487P9883j658n7618j4016P2280j5513n8100j7625m4582k0592q223
$$ -27222 44265 124148 122490 64872 50856 123136 107623 49523 31898 -12684 -33276 -41499
10080d1499p0019M351q857k2205M1792L7954J7590n755k9259M94R55o006L2140
$$ -41499 -111518 -107167 -116024 -138229 -96437 -58483 -40893 -46648 -75907 -75413 -74458 -80464 -48324
10067d8324m4491j3674J10382K3032p995K0857L5536L6979j232l6898l6907m093
$$ -48324 -92815 -106489 3893 26925 18930 39787 75323 112302 111070 74172 37265 33172
10055C3172K5763n3596n6255J64M3006K5821o4558J4724j4260m1847J2672L3916
$$ 33172 58935 5339 -50916 -50752 -7746 18075 -46483 -31759 -46019 -87866 -75194 -41278
10043d1278N12P599K2181l5617Q621O360j3390l899L1741M2942n2962L8187J06934
$$ -41278 -40766 -33167 -10986 -46603 -37982 -31622 -45012 -48911 -17170 25772 -27190 10997 117931
10030A17931j5961p0773m9350K0993J7112J2629j8088J0889l2354q179l0184o2838
$$ 117931 101970 31197 -18153 2840 19952 32581 14493 25382 -6972 -15151 -45335 -108173
10018a08173r982P7392J26484j1416P633m8361j26418l8129K2111L3383K5483
$$ -108173 -118155 -40763 85721 74305 81938 33577 -92841 -130970 -108859 -75476 -49993
10007d9993O8463L4444O888R850l2846j6602k9441l5967N1085k0439o3757N1328
$$ -49993 18470 52914 59802 69652 36806 20204 -9237 -45204 5881 -14558 -78315 -26987
9995b6987J3219L2359L818p5826O4319N8218J0792l0798n3506n9063K6499q220
$$ -26987 -13768 18591 22409 -53417 10902 69120 79912 49114 -4392 -63455 -36956 -45176
9983d5176M0616n047p799L006o3934M968J0791p293M3204m932L6061K4600k0491
$$ -45176 -4560 -9607 -17406 -14400 -78334 -73366 -62575 -69868 -26664 -31596 4465 29065 8574
9970H574o4114k5518O8075k3352j8975p381J8687j3967J5919K4015j4563J6755
$$ 8574 -55540 -81058 -12983 -36335 -55310 -62691 -44004 -57971 -42052 -18037 -32600 -15845
9958a5845K8923j2429l0617n098l6321j9572N0118J0129K2981K0145K5314J8861
$$ -15845 13078 649 -29968 -35066 -71387 -90959 -40841 -30712 -7731 12414 37728 56589
9946E6589l7047J5146j0782o6709K9351j2282k4593K086M9822k8910j4356N3452
$$ 56589 19542 34688 23906 -42803 -13452 -25734 -50327 -48241 1581 -27329 -41685 11767
9934A1767j002J4984K7271K6939Q7177J05337q3997j11417n9235n9303l385L3841
$$ 11767 10765 25749 53020 79959 167136 272473 188476 77059 17824 -41479 -44864 -11023
9922a1023j8981l0954M2281P9947j4802o1499k4551m7470J1309K229j1031K0643
$$ -11023 -30004 -60958 -18677 61270 46468 -15031 -39582 -87052 -75743 -73514 -84545 -63902
9910f3902m7J8633L6160k0681l8303l2887N6524J3699L681q638j27938K4903J2480
$$ -63902 -63949 -45316 -9156 -29837 -68140 -101027 -44503 -30804 -27123 -35761 -163699 -138796 -126316
9897a26316j3288J6361P9938J2779o8189k8429J8237L3046K4547p200p010p811
$$ -126316 -139604 -123243 -43305 -30526 -98715 -127144 -108907 -75861 -51314 -58514 -65524 -73335
9885g3335l496J2686Q549K3748K9232M7627K8317r137j7274R249p5280l5272n4500
$$ -73335 -76831 -64145 -55596 -31848 -2616 45011 73328 64191 46917 56166 -19114 -54386 -108886
9872a08886l7585J64886M8548m4672K8615k2464n0190K1475K0239o578M4890M4122
$$ -108886 -146471 18415 66963 22291 50906 28442 -21748 -273 19966 13388 58278 102400
9860A02400l0644j8220j5015k7311L0056M0852l4485m1985j9681J929j6769o5006
$$ 102400 71756 53536 38521 11210 41266 82118 47633 5648 -14033 -12104 -28873 -93879
9848i3879j1286J4069j383l3366L3328J4482j7897m0227j48J23337M93j2469L9544
$$ -93879 -105165 -91096 -92479 -125845 -92517 -78035 -95932 -136159 -136307 -12970 -12477 -24946 14598
9835A4598q1309n7790N0713P1313k8628p9260o7452M3110N9417M7520N6393O533
$$ 14598 -66711 -124501 -73788 -2475 -31103 -110363 -177815 -134705 -75288 -27768 28625 35158
9823C5158j9516L6369j6648l3974n000L7966R165j7041J6715L3564K0427j2114
$$ 35158 15642 52011 35363 1389 -3611 34355 43520 26479 43194 76758 97185 85071
9811H5071l9961n8669k9850k3353K3528K193J8586N0545n453l4017K4201Q1793
$$ 85071 45110 -13559 -43409 -66762 -43234 -41041 -22455 28090 22637 -11380 12821 94614
9799I4614O8847K0379M0019o911k1787N5957J42458J82043K207N3619J39919J70278
$$ 94614 163461 183840 223859 216948 195161 251118 393576 575619 577826 631445 771364 941642
9787I41642J87148K61057L27782N51850P38943Q27626R66072J177848J404613
$$ 941642 1128790 1389847 1717629 2269479 3008422 3836048 4802120 5979968 7384581
9778G384581J678463K074143J999538M77169j798441l178406l014679k098032
$$ 7384581 9063044 11137187 13136725 13613894 11815453 8637047 5622368 3524336
9770C524336j228650p10831m07795j99474j52816j25990j61109j06948m9414k7823
$$ 3524336 2295686 1584855 1177060 977586 824770 698780 537671 430723 381309 353486
9760C53486j7128r3384q3110P4471k0347k6888m4196R4305J08632q5173m0972
$$ 353486 336358 242974 159864 234335 213988 187100 142904 237209 345841 260668 219696
9749B19696K124j265n4748q4001l8166J05930m597j8372l9092j0044k7424K5175
$$ 219696 221820 220555 165807 81806 43640 149570 144973 126601 87509 77465 50041 75216
9737G5216n6449K6695O1307L7812j6903l6842Q11r090o5616j7420o4843j10339
$$ 75216 18767 45462 106769 144581 127678 90836 91647 82557 16941 -479 -65322 -175661
9725a75661Q9256L7357M8803N6839n1510J8780K7968O522l4656m7194k612O8234
$$ -175661 -86405 -49048 -245 56594 5084 23864 51832 58354 23698 -23496 -26108 42126
9713D2126M2454o1588l4302K0722k7370j5118N013j0976J7353L9478K5668j9937
$$ 42126 84580 22992 -11310 9412 -17958 -33076 -28063 -39039 -21686 17792 43460 23523
9701B3523m0366n2772j9049j9241k0214R965J9204O8510j7822l7898J9974j9466
$$ 23523 -16843 -69615 -88664 -107905 -128119 -118154 -98950 -30440 -48262 -86160 -66186 -85652
9689h5652k5918P4148L9979m5134j8285J0140j0725J5256o2015j1306R978L9205
$$ -85652 -111570 -37422 2557 -42577 -60862 -50722 -61447 -46191 -108206 -119512 -109534 -70329
9677g0329M8855N802K6334L5539j9605R982n987l4184j9146J4985M2581J257m735
$$ -70329 -21474 -15672 10662 46201 26596 36578 30591 -3593 -22739 -7754 34827 36084 31349
9664C1349p984p201J6493M6169P2571J5315r52L7834K2590O0558Q1574J49723
$$ 31349 23365 16164 32657 78826 151397 166712 165760 203594 226184 286742 368316 518039
9652E18039J87940J85275K19497J19232p0218k48666l44603k68663j84254N070
$$ 518039 705979 891254 1110751 1229983 1159765 911099 566496 297833 113579 118649
9642A18649M0581n4851j07311o6340J9252Q1893K9385L8818K2243j4877o8001
$$ 118649 159230 104379 -2932 -69272 -50020 31873 61258 100076 122319 107442 39441
9631C9441n8967j8389R430j0340r115n5852j1140N3997n00l4821L743O114J4955
$$ 39441 -19526 -37915 -28485 -38825 -47940 -103792 -114932 -60935 -61435 -96256 -92513 -86399 -71444
9618g1444M2740M3056k4370L69L5063J1181N316k6279N769M7966J0108M435Q301
$$ -71444 -28704 14352 -10018 -9649 25414 36595 41911 15632 21401 69367 79475 83910 92211
9605I2211l407m8544o2520n0548k1802M5135K5771j3274l5574l4952J3262J972
$$ 92211 88804 40260 -22260 -72808 -94610 -49475 -23704 -36978 -72552 -107504 -94242 -92270
9593i2270k089J5357O4976M1528J8599K791p6685q2178M8580O2156p3686M136
$$ -92270 -94359 -79002 -14026 27502 46101 48892 -27793 -109971 -61391 765 -72921 -68785
9581f8785k5870l6716L8249j6331K5941Q9620P9498l8026n5902J213N4148p271
$$ -68785 -94655 -131371 -93122 -109453 -83512 6108 85606 47580 -8322 -7109 47039 39768
9569C9768o248j8158l16m898l0226j3612M4J6100R401L187L2854l089j5558j8666
$$ 39768 33520 15362 15046 10148 -20078 -33690 -33646 -17546 -8145 -4958 27896 24807 9249 -9417
9555i417k5350P505k7512p4268m5914j38n2513N0033J38395J9541m8986j1755
$$ -9417 -34767 -27262 -54774 -129042 -174956 -175094 -227607 -177574 -39179 -19638 -68624 -80379
9543h0379L665M4172K0016j55N249L9686n5579o0790N6471K1009j5998j3981m0190
$$ -80379 -76714 -32542 -12526 -12681 -7432 32254 -23325 -84115 -27644 -6635 -22633 -36614 -76804
9530g6804K2837N130J4269m629n7580l3195M472M4226J9055O4893O2949j2635
$$ -76804 -53967 -48837 -34568 -39197 -96777 -129972 -125500 -81274 -62219 2674 65623 52988
9518E2988L2052m218j24922o4847M3848Q4826l4750o0096P0305R5759j6261n0119
$$ 52988 85040 80822 -44100 -108947 -65099 19727 -15023 -75119 -4814 90945 74684 24565
9506B4565p5568k0980Q0353n9879q9580M316j6050L6603O3279N2331K362O5150
$$ 24565 -51003 -71983 8370 -51509 -141089 -136773 -152823 -116220 -52941 -610 1752 66902
9494F6902j3920m8831J3667m9840L1076k3862m23k2137j6600L6336J80n3190L5761
$$ 66902 52982 4151 17818 -32022 -946 -24808 -25231 -47368 -63968 -27632 -27452 -80642 -44881
9481d4881O2307K5639r622o434K4696j8254L6807M8643l8103j6615k2702l4989
$$ -44881 17426 43065 33443 27009 51705 33451 70258 118901 80798 64183 41481 6492
9469F492K4855j0441n0408p3643K0195m2638k2869j4698L7563k7138O9458J0970
$$ 6492 31347 20906 -29502 -103145 -82950 -125588 -148457 -163155 -125592 -152730 -83272 -72302
9457g2302j6634l3845j9683N5781J9998O6363O7773m6241j6298k1914k565j2148
$$ -72302 -88936 -122781 -142464 -86683 -66685 -322 67451 21210 4912 -17002 -19567 -31715
9445c1715J5846M3917n282n4365L1784P903k9749j4028l9985j7778L6647J4904
$$ -31715 -15869 28048 22766 -31599 185 8088 -21661 -35689 -75674 -93452 -56805 -41901
9433d1901L0548K7980n7941l3173l0855K8222N8015j4035m8150L463j0739n2836
$$ -41901 -11353 16627 -41314 -74487 -105342 -77120 -19105 -33140 -81290 -77827 -88566 -141402
9421a41402l499q747M575l9159J305J6691N3288l0866L4059P6065K5488Q743K435
$$ -141402 -144901 -153648 -149073 -188232 -186927 -170236 -116948 -147814 -113755 -37690 -12202 -3459 -1024
9408a024Q5259l0318k7550P028q777k5389M4192Q3807k1215m6995k6880K2527
$$ -1024 84235 53917 26367 33395 24618 -771 43421 127228 106013 59018 32138 54665
9396E4665K3433N3903K3617m6119l4380k7519K7228k7408m4337N8752q944M492
$$ 54665 78098 132001 155618 109499 75119 47600 74828 47420 3083 61835 52891 57383
9384E7383N0669N4031P0936K0776q5279k2657P7177m3883M6548N1507k5211J7578
$$ 57383 108052 162083 233019 253795 168516 145859 223036 179153 225701 277208 251997 269575
9372B69575L5272K6102M1520J6985Q5069Q1422J26689N6014R2962J84088J70376
$$ 269575 304847 330949 372469 389454 474523 555945 682634 738648 831610 1015698 1186074
9361A186074J19862J12046J21821J47102Q4998J21615O2922N1571K2746p3149
$$ 1186074 1305936 1417982 1539803 1686905 1771903 1893518 1956440 2008011 2030757 1957608
9351A957608j04258n7036j71813j98956j68119q4396r2535j37620k25358j30239
$$ 1957608 1853350 1796314 1624501 1425545 1257426 1173030 1080495 942875 717517 587278
9341E87278J4614k7241q2197n6766m9669q7386n6758l4791q0086k9874L9525k8174
$$ 587278 601892 574651 492454 435688 386019 298633 241875 207084 126998 97124 136649 108475
9329A08475k1378L5732P73J9348L6151N2521j2328l7883o5439k8n7871q7472L6684
$$ 108475 87097 122829 123602 142950 179101 231622 219294 181411 115972 115944 58073 -29399 7285
9316G285M7869O910k7022j6247p0984J4108l288L4165O8396K7493k1965o4145
$$ 7285 55154 62064 35042 18795 -52189 -38081 -41369 -7204 61192 88685 66720 2575
9304B575o2326J1116O7888J9253n8654M0163L3427L1305M2366p2232p9891n8100
$$ 2575 -59751 -48635 19253 38506 -20148 20015 53442 84747 127113 54881 -25010 -83110
9292h3110j3914N6820N2891o856P039j1306N9011L8652M98p0369Q168k2618l3900
$$ -83110 -97024 -40204 12687 5831 12870 1564 60575 99227 99725 29356 37524 14906 -18994
9279a8994j3983Q518N1382n9438j9338P575p53R2112N4996m0709k4433N743l4378
$$ -18994 -32977 -24459 26923 -32515 -51853 -44278 -45031 47081 102077 61368 36935 42678 8300
9266H300m5945J0350L4119O148K075l8202K9857j8507n1125K1503M2576j6999
$$ 8300 -37645 -27295 6824 12972 15047 -23155 6702 -11805 -62930 -41427 1149 -15850
9254a5850m4517j3355L7575Q365n0317Q7748K9146l8547K1301r372R894k5676
$$ -15850 -60367 -73722 -36147 -27782 -78099 9649 38795 248 21549 12177 22071 -3605
9242c605J041M3852p4822j029O3856q225l7298K4177O3099M1234K6268o045K1
$$ -3605 -2564 41288 -33534 -34563 29293 21068 -16230 7947 71046 112280 138548 132503 132524
9229A32524l9913j476o688j5580M9201L9430L3935O3708O7479N0367m0093m2628
$$ 132524 92611 91135 84447 68867 118068 157498 191433 255141 322620 372987 332894 290266
9217B90266l6230j6799j6856N3924j7630p891K3980l6734l6075l2979n311M4939
$$ 290266 254036 237237 220381 274305 256675 248784 272764 236030 199955 166976 161665 206604
9205B06604j1409o475k8986o2639n4678l7810P6535k6021k9810j7840j9543K0998
$$ 206604 195195 188720 159734 97095 42417 4607 81142 55121 25311 7471 -12072 8926
9193H926J5827m4981Q709K1406K5717j3900m130q290n397M0140m7425l2731N0476
$$ 8926 24753 -20228 -11519 9887 35604 21704 17574 9284 3887 44027 -3398 -36129 14347
9180A4347O0010l897M3663K6190K7075K6576N22R439m8667l2033O71j126P543
$$ 14347 74357 70460 114123 140313 167388 193964 194486 203925 155258 123225 123896 122770 130313
9167A30313l2061K4666N3893j2783j1607M384r907l9053m6844J575q8443K729
$$ 130313 98252 122918 176811 164028 152421 156805 146898 107845 61001 62576 -25867 -23138
9155b3138J4424R535K7019K6308j0522j24567k6193l0070P45L8811N113j0659
$$ -23138 -8714 821 27840 54148 43626 -80941 -107134 -137204 -136459 -97648 -92535 -103194
9143a03194L7427l215K7210K5643R4650M4406k6238l2175M9342M880R78M0332
$$ -103194 -65767 -68982 -41772 -16129 78521 122927 96689 64514 113856 118736 119714 160046
9131A60046N1447j2955J07696j4597l80k3954p0490k9567M4478m6236l7278K5534
$$ 160046 211493 198538 306234 291637 291257 267303 196813 167246 211724 165488 128210 153744
9119A53744N8225L4887l959n724r504M2568J6018N5541O5772k6088K1634J04934
$$ 153744 211969 246856 242897 237173 227669 270237 286255 341796 407568 381480 403114 508048
9107E08048O5329N6427L5445m0751j28046j00387L4527N4025L3162O3649n009
$$ 508048 573377 629804 665249 624498 496452 396065 430592 484617 517779 581428 576419
9096E76419j3322Q8644J31549R1274R6502Q8475k3245r949K70p617k5919j1752
$$ 576419 563097 651741 783290 874564 971066 1059541 1036296 1026347 1026617 1019000 993081 981329
9084I81329L2662j31339j00340j04668j88078p8074L1435J0566P2261R7182P5803
$$ 981329 1013991 882652 782312 677644 489566 411492 442927 453493 525754 622936 698739
9073F98739o2685j1056N939N5676M0563Q972L1152N9089M5304k2313P685L5264
$$ 698739 636054 624998 630937 686613 727176 736148 767300 826389 871693 849380 857065 892329
9061H92329J3252L0611N8047K7428k8509n5175L7892J7558N1065M6098K148J10042
$$ 892329 905581 936192 994239 1021667 993158 937983 975875 993433 1044498 1090596 1092744 1202786
9049A202786M1703q7965J1626P4372J08549J3617K6594M5358k616M1028P7941
$$ 1202786 1244489 1156524 1168150 1242522 1351071 1364688 1391282 1436640 1434024 1475052 1552993
9038A552993M7233Q0713K6159R561O1395Q0420N7484P7996J29935P6883P7885
$$ 1552993 1600226 1680939 1707098 1716659 1778054 1858474 1915958 1993954 2123889 2200772 2278657
9027B278657M2354K5077R3806J45006J03766N4071K4643J11355J04126P4007J06809
$$ 2278657 2321011 2346088 2439894 2584900 2688666 2742737 2767380 2878735 2982861 3056868 3163677
9016C163677J30609J51189K15384J32103J26201J07699J04891J66847K04142J61874
$$ 3163677 3294286 3445475 3660859 3792962 3919163 4026862 4131753 4298600 4502742 4664616
9006D664616K39908K52589K70429L33921L84618L88502M08485M08864M31929M82410
$$ 4664616 4904524 5157113 5427542 5761463 6146081 6534583 6943068 7351932 7783861 8266271
8996H266271M75884L76992L85583M08189M74142N52873P57207P95430Q63378J031090
$$ 8266271 8742155 9119147 9504730 9912919 10387061 10939934 11697141 12492571 13355949 14387039
8986A4387039J162433J291887J344674J602040J767167J928913K367255K807215
$$ 14387039 15549472 16841359 18186033 19788073 21555240 23484153 25851408 28658623
8978B8658623L194663L578011M050224M771206N551905O253880P100282Q204959
$$ 28658623 31853286 35431297 39481521 44252727 49804632 56058512 63158794 71363753
8970G1363753R595887J1260033J3190770J5646872J8805015K2705116K7470081
$$ 71363753 80959640 92219673 105410443 121057315 139862330 162567446 190037527
8963A90037527L2853853L8153300M2945580M6627478M8958939M8948850M4234925
$$ 190037527 222891380 261044680 303990260 350617738 399576677 448525527 492760452
8956D92760452L0353586N062492k6856967n4112193o7596639o7138883n8168930
$$ 492760452 523114038 528176530 501319563 447207370 379610731 312471848 254302918
8949B54302918m6762501l6338159k7924258k1600030j6864966j3345720j0721835
$$ 254302918 207540417 171202258 143278000 121677970 104813004 91467284 80745449
8942H0745449q909523p683161o750250o002784n306580m607967m088555l513587
$$ 80745449 71835926 64152765 57402515 51399731 46093151 41485184 37396629 33883042
8934C3883042l053654k570537k134095j945912j757002j578090j389427j225294
$$ 33883042 30829388 28258851 26124756 24178844 22421842 20843752 19454325 18229031
8926A8229031j162228j073700r11587q62211o90862n96128o72401o24283n47750
$$ 18229031 17066803 15993103 15081516 14219305 13528443 12932315 12259914 11635631 11087881
8917A1087881n54828n67735n36064n31920l77397l31793k69669l27626l57409
$$ 11087881 10533053 9965318 9429254 8897334 8519937 8188144 7918475 7590849 7233440
8908G233440k44401k85554k15700k05398k82550k81006k89963j21344j17427j87736
$$ 7233440 6989039 6703485 6487785 6282387 5999837 5718831 5428868 5307524 5190097 5002361
8898E002361j85521m5490j02900j60165j46947j75270j47891j64161j21166m3652
$$ 5002361 4816840 4771350 4668450 4508285 4361338 4186068 4038177 3874016 3752850 3709198
8888C709198m5908r7108q9578j16337k7098q1424o6365l7500n1166k0849j58958
$$ 3709198 3663290 3566182 3476604 3360267 3333169 3251745 3185380 3147880 3096714 3075865 2916907
8877B916907j54110n8797o4713P2393k442n5320q6197k6358m6272O354K1192j06295
$$ 2916907 2762797 2704000 2639287 2711680 2709238 2653918 2567721 2541363 2495091 2501445 2522637 2416342
8865B416342j03796j65541m9246m198k1653L3392q912r1653K2583k8439n9692
$$ 2416342 2312546 2147005 2097759 2093561 2071908 2105300 2096388 2004735 2027318 1998879 1939187
8854A939187L2165p3932l4334k1052m3746K1953K7529N1416Q1858N7532O3728
$$ 1939187 1971352 1897420 1863086 1842034 1798288 1820241 1847770 1899186 1981044 2038576 2102304
8843B102304J58810J84637J83910J27021J80742K38018K54079J87907p8409l70760
$$ 2102304 2261114 2445751 2629661 2756682 2937424 3175442 3429521 3617428 3539019 3168259
8833C168259l80985k57355j40359k61703l52928j98033j66635j51967p5369p7940
$$ 3168259 2787274 2529919 2389560 2127857 1774929 1576896 1410261 1258294 1182925 1104985
8823A104985J0282J11089N3657M2759r5588r0937q7349J9400M0183K768n7446
$$ 1104985 1115267 1226356 1280013 1322772 1227184 1136247 1048898 1068298 1108481 1111249 1053803
8812A053803m2598l3763n2155j6238N830M8128m4043J7586M3255J1600L467M1105
$$ 1053803 1011205 977442 925287 909049 914879 963007 918964 936550 979805 991405 994872 1035977
8800A035977M8875l0918k3783M8612J0513o0814o3351K453n0006K2289P269J973
$$ 1035977 1084852 1053934 1030151 1078763 1089276 1028462 965111 967564 917558 939847 947116 949089
8788I49089J7965m0593j4270L4278M6121m8204q6637o6242l7003L6949K5082m3507
$$ 949089 967054 926461 912191 946469 992590 944386 857749 791507 754504 791453 816535 773028
8776G73028L506J652N4928L23n0791K9044M6161q78p208k6654j0915m9625L1845
$$ 773028 776534 778186 833114 833437 782646 811690 857851 856973 849765 823111 812196 762571 794416
8763G94416M7685R261k2100n5905k6690N4813J8221n0958o585J7314r939r0345
$$ 794416 842101 851362 829262 773357 746667 801480 819701 768743 762158 779472 769533 679188
8751F79188p5535K6573k058m7078j6202p3183j9520Q3058k0905k1837J0612n0100
$$ 679188 603653 630226 628168 581090 564888 491705 472185 555243 534338 512501 523113 473013
8739D73013K0705M9320N1029m5594l5520K779J1846m5570m983M1751n179m9506
$$ 473013 493718 543038 594067 548473 512953 515732 527578 482008 477025 518776 513597 464091
8727D64091o1202l395N5770L8591J4226j8772j8546j5641k901M1187L7400J6987
$$ 464091 402889 399494 455264 493855 508081 489309 470763 455122 452221 493408 530808 547795
8715E47795o6016o2130J8435Q0206k7172J0182l465M3427J3859R343K7147o9079
$$ 547795 481779 419649 438084 518290 491118 501300 497835 541262 555121 564464 591611 522532
8703E22532m4954l1741J3299L2995o8237k3705L564k3658Q6989P9075J7794q55
$$ 522532 477578 445837 459136 492131 423894 400189 403753 380095 467084 546159 563953 563098
8691E63098n6254o6215m1271J7894j7282p4999M600L7951M1502j9159m0981M4675
$$ 563098 506844 440629 399358 417252 399970 324971 329571 367522 409024 389865 348884 393559
8679C93559J0951q815J2884L4485Q01j9819q3799j6854K2591J8982n0942R14J20780
$$ 393559 404510 395695 408579 443064 443865 424046 340247 323393 345984 364966 314024 314938 435718
8666D35718L3328o2423j2177J2824O5496j2601m5646M8323M6163m3888m3562N4405
$$ 435718 469046 406623 394446 407270 472766 460165 414519 462842 509005 465117 421555 475960
8654D75960O6339J3885n7849k5837Q380m5746j7360m4800R444n0617k4143K3023
$$ 475960 542299 556184 498335 472498 480878 435132 417772 372972 382416 331799 307656 330679
8642C30679k3379j8780j1883M859K8351J1241L1432k1658j3985k2118j35l2178
$$ 330679 307300 288520 276637 281496 309847 321088 352520 330862 316877 294759 294624 262446
8630B62446k1917N6606r165n0937R052M2826k4767k4676k2117P2880L217J3297
$$ 262446 240529 297135 287970 237033 246085 288911 264144 239468 217351 290231 293448 306745
8618C06745J7993L6298J9750q3659m5536p482N3523L7247m6930k9855K395L7449
$$ 306745 324738 361036 380786 297127 251591 244109 297632 334879 287949 258094 260489 297938
8606B97938m5602P7275J3219J0703j9283n5343j3217n6677O5848Q9521K8680l3597
$$ 297938 252336 329611 342830 353533 334250 278907 265690 209013 274861 364382 393062 359465
8594C59465j7355R115j5980k0117K1464q556r52K2639N7105k2856k3520K7596
$$ 359465 342110 351225 335245 315128 336592 328036 327084 349723 406828 383972 360452 388048
8582C88048L5936J3222m8077J6091N1539Q772P220j6334k4209Q328M0414Q7772
$$ 388048 423984 437206 389129 405220 456759 465531 472751 456417 432208 440536 480950 568722
8570E68722L1692M94J12592J26996Q9436J37272Q5885N9423J34949J31211J00245
$$ 568722 600414 600908 713500 840496 929932 1067204 1153089 1212512 1347461 1478672 1578917
8559A578917J9040J39351K15626J83734J20552N0066O6602r251l0352q5037q2356
$$ 1578917 1597957 1737308 1952934 2136668 2257220 2307286 2373888 2364637 2334285 2249248 2166892
8548B166892j64623k04340j85273j77910j07992q3423p1732j29330j5923J44899
$$ 2166892 2002269 1797929 1612656 1434746 1326754 1243331 1171599 1042269 1026346 1171245
8538A171245P0707J13434J37838K05535L31152K71816L16633M31071N89798K91041
$$ 1171245 1241952 1355386 1493224 1698759 2029911 2301727 2618360 3049431 3639229 3930270
8528C930270l84873q17757p66574n63360k86328j81901k31038j45492p0380n2750
$$ 3930270 3545397 2727640 1961066 1397706 1111378 929477 698439 552947 482567 429817
8518D29817l5349N934J1036n2909o9895J7811Q5737q899p8250j9688R5794N7266
$$ 429817 394468 400402 411438 358529 288634 306445 392182 383283 305033 285345 381139 438405
8506D38405O614J7357L2472m5186J856M2882O4107J00037P4961J35445J14980
$$ 438405 445019 462376 494848 449662 451518 494400 558507 658544 733505 868950 983930
8495I83930J03372J46484K13693K29424L73645N29336O04220N73986P04442J011769
$$ 983930 1087302 1233786 1447479 1676903 2050548 2579884 3184104 3758090 4462532 5474301
8485E474301J279974P62915o33663j712934j711056j217417o55639m06625k51539
$$ 5474301 6754275 7517190 6883527 5170593 3459537 2242120 1586481 1179856 928317
8476I28317j97617p7453l6812m9892l7378o629Q701l1420r2655p9180J2214j740
$$ 928317 730700 653247 616435 566543 529165 522536 531237 499817 407162 327982 340196 338456
8464C38456k2079J0962J539p623R605K8382K3022L3766j04396j0224P6446P4566
$$ 338456 316377 327339 328878 321255 330860 359242 382264 416030 311634 301410 377856 452422
8452D52422N4637L9336R2108J18070J50247J47303J39351K30256L08542K98499
$$ 452422 507059 546395 638503 756573 906820 1054123 1193474 1423730 1732272 2030771
8442B030771L18221M85500N76807L37685l21656p72497q10197o26144m24965j77987
$$ 2030771 2348992 2834492 3411299 3748984 3427328 2654831 1844634 1218490 793525 615538
8432F15538q7203k9038o9814l9799n0165m8692j8661m205j2243n2967q2882N5934
$$ 615538 528335 499297 429483 389684 339519 290827 272166 267961 255718 202751 119869 175803
8420A75803M4059L052j2463j1995K0184m5622o3274n6341N1588j0494M628O6310
$$ 175803 219862 222914 210451 198456 218640 173018 109744 53403 104991 94497 99125 165435
8408A65435M4891j7913j2853L398m295M0402r629L4344k6710j2383j5661m7220
$$ 165435 210326 192413 179560 182958 178663 219065 209436 243780 217070 204687 189026 141806
8396A41806J8589O7496J4459n3255n2052N918J12414N4332O3812K9974P3663J49560
$$ 141806 160395 227891 242350 189095 137043 142961 255375 309707 373519 403493 477156 626716
8384F26716J15482J04187P8963n3650j45036j41702j02016j24734l5161m3284
$$ 626716 742198 846385 925348 871698 726662 584960 482944 358210 323049 279765
8374B79765n3605j4542J4565J8141J6145k5138l701q7076k0423K6891J0922K6155
$$ 279765 226160 211618 226183 244324 260469 235331 231630 144554 124131 151022 161944 188099
8362A88099J6889m8978R647l3397o4236j8678K476M3540P3094n8147m6530K6372
$$ 188099 204988 156010 165657 132260 68024 49346 51822 95362 168456 110309 63779 90151
8350I0151P0697M1292L666k178j1661l2769j0730j7855P762k1327j3811P3585
$$ 90151 160848 202140 205806 203628 191967 159198 148468 130613 138375 117048 103237 176822
8338A76822N658o9205j0357M2076l3211n1924k0523J4872M2256R745r6148l3735
$$ 176822 182480 113275 102918 144994 111783 59859 39336 54208 96464 106209 10061 -23674
8326b3674J5256K6459Q4519J6402p1972j2317O5469J6022n4676L447M2659P4120
$$ -23674 -8418 18041 102560 118962 46990 34673 100142 116164 61488 64935 107594 181714
8314A81714J6910k8094l2620q608K072P020j4924k7019j3296o3677r416N2428
$$ 181714 198624 170530 137910 129302 131374 138394 123470 96451 83155 19478 10062 62490
8302F2490J616j2796L1166L0910j9459L7880O772L1875m5907n5467M7873P7609
$$ 62490 64106 51310 82476 113386 93927 131807 138579 170454 124547 69080 116953 194562
8290A94562q726l3267O2808k5891r4996m7305L398n5116J0675M0340J4204O60
$$ 194562 185836 152569 215377 189486 94490 47185 50583 -4533 6142 46482 60686 61346
8278F1346O2792J9960L0272o980o9840j3902K6082k8554p2902k7250M0948J6474
$$ 61346 124138 144098 174370 167390 97550 83648 109730 81176 8274 -18976 21972 38446
8266C8446O813L996N4069M3566l7481l7915q6m1858j7310k9687O9599L0672k9896
$$ 38446 45259 49255 103324 146890 109409 71494 71408 29550 12240 -17447 52152 82824 52928
8253E2928O056n3251l1212L811P3312J3075K0807L9632o7434o694K4101j1962
$$ 52928 58984 5733 -25479 -21668 51644 64719 85526 125158 57724 51030 75131 63169
8241F3169N513J8344J676j2317k1286M5596M372q6393N4963J8840J5699l8000
$$ 63169 68682 87026 88702 76385 55099 100695 105067 18674 73637 92477 108176 70176
8229G0176l5404K820K2095O6522o757j6325j661P26l961J715j2559m5649m5990
$$ 70176 34772 37592 59687 126209 119452 103127 101466 102192 98231 99946 87387 41738 -4252
8216d252k9013P0417O9792m2481l6295o0348n5532j172R364Q4256M6594L9658
$$ -4252 -33265 37152 106944 64463 28168 -32180 -87712 -88884 -79520 4736 51330 90988
8204I0988j6153j9575j8301J732j063m8439j0904k6873K1211J02640M4150j1662
$$ 90988 74835 55260 36959 38691 37628 -10811 -21715 -48588 -27377 75263 119413 107751
8192A07751m1196p9509k1171K9450M8871N327K9616M4038l6565l4461m0066j7886
$$ 107751 66555 -12954 -34125 -4675 44196 49523 79139 123177 86612 52151 12085 -5801
8180e801J6124R239M9072O5470M2401m7595j1773m77j0233J2658j4546K6414O448
$$ -5801 10323 19562 68634 134104 176505 128910 117137 116660 106427 119085 104539 130953 137401
8167A37401m5611j3147q614m3552j0582O0517K8929L4264K9382p624q925J0237
$$ 137401 91790 78643 70029 26477 15895 76412 105341 139605 168987 161363 152438 162675
8155A62675l6836k2905L0830M021j0430j2947L1507J9069l6970q9900j2048J7096
$$ 162675 125839 102934 133764 137785 127355 114408 145915 164984 128014 38114 26066 43162
8143D3162R0315N0573J1208J7142n7609l7979m43j6405Q224n726m6085k7625k9591
$$ 43162 133477 184050 195258 212400 154791 116812 116369 99964 108188 102462 56377 28752 -839
8130h39L6547l006K0266O5239k7204o326j9308Q998O3284l690J2669r4448m0610
$$ -839 35708 32702 52968 118207 91003 84677 65369 74367 137651 133961 146630 52182 11572
8117A1572n113J0550P3740j1204N2946j8363m6457N8948M3196K5738l3473k2911
$$ 11572 6459 17009 90749 79545 132491 114128 67671 126619 169815 195553 162080 139169
8105A39169M2114k1914l6938k0721R924j3575k4482o4978M3278O689K982J1827
$$ 139169 181283 159369 122431 101710 111634 98059 73577 8599 51877 58566 61548 73375
8093G3375k642j9904n3893K9330P7177J471l4310Q941n0028j8218l390J9982J1354
$$ 73375 70733 50829 -3064 26266 103443 104914 70604 79545 29517 11299 7909 27891 39245
8080C9245J2971L8213J3127J9259Q387p022o5116J0033M6740P134m4426j9233
$$ 39245 52216 90429 103556 122815 131202 124180 59064 69097 115837 122971 78545 59312
8068E9312M2293L2158k5010o5603j1422L8822j4914k4149o888M9750N2703K5253
$$ 59312 101605 133763 108753 43150 31728 70550 55636 31487 24599 74349 127052 152305
8056A52305K3676k6003L327o0594K2005J7081m5963l229M0293Q0450m5359r9502
$$ 152305 175981 149978 153305 92711 114716 131797 85834 82605 122898 203348 157989 58487
8044E8487j6726N5153M8236j02364q0040J6058K1196M3599l8944N4609L8729L5161
$$ 58487 41761 96914 145150 42786 -37254 -21196 0 43599 4655 59264 97993 133154
8032A33154P446l8142j3346o7708l3761Q0573O2994j7811l0941o478J5011L613
$$ 133154 140600 102458 89112 21404 -12357 68216 131210 113399 82458 75980 90991 94604
8020I4604l7679J0720L4029L3573O982j9518p2276k8652M6912O09J2754j7054
$$ 94604 56925 67645 101674 135247 142229 122711 50435 21783 68695 69304 82058 65004
8008F5004J06J1211J7564p4803m6095J7079k4464L8630K8070L6675O3405p237
$$ 65004 65110 76321 93885 19082 -27013 -9934 -34398 4232 32302 68977 132382 125145
7996A25145l4153k2431j5705J1458l1040K0405J5352n7156k0503N2474m8089m7601
$$ 125145 90992 68561 52856 64314 33274 53679 69031 11875 -8628 43846 -4243 -51844
7984e1844O6428M0872n9643k0616n017N9686J2444O4202K18m8732k8593O2494
$$ -51844 14584 55456 -4187 -24803 -29820 29866 42310 106512 106730 57998 29405 91899
7972I1899P0893K4189K4099p4101m7693l7604j5123J1326j7044m071j7111J1713
$$ 91899 162792 186981 211080 136979 89286 51682 36559 47885 30841 26770 9659 21372
7960B1372L4785k9116k2073L4682J561j1514J03546k0974q5934L5881L1096m413
$$ 21372 56157 27041 4968 39650 41211 29697 133243 112269 26335 62216 93312 88899
7948H8899K1694l4201l1132N7869k0127l6996L0516K2689n2905m1917P363L7713
$$ 88899 110593 76392 45260 103129 83002 46006 76522 99211 46306 4389 11752 49465
7936D9465j8864k5282o3554J3457L6642P9572K7052m917J8963N521j04027L7524
$$ 49465 30601 5319 -58235 -44778 -8136 71436 98488 93571 112534 118055 14028 51552
7924E1552k216r8036m7870M2752L5729P096j6199K0080N7642N9847N7355n5236
$$ 51552 49336 -48700 -96570 -53818 -18089 -10993 -27192 -7112 50530 110377 167732 112496
7912A12496o6572m4828K0221L7789J5915k6347n412L1882o2631j8006P1996K7136
$$ 112496 45924 1096 21317 59106 75021 48674 43262 75144 12513 -5493 66503 93639
7900I3639K7540j4271m9524J0111M7615L536o3979m1226k9897p913J7902J33794
$$ 93639 121179 106908 57384 67495 115110 118646 54667 13441 -16456 -24369 -6467 127327
7888A27327l2016l0719q685K3875J705j8296J4887J1412k6313l5993M840K3364
$$ 127327 95311 64592 55907 79782 81487 63191 78078 89490 63177 27184 32024 55388
7876E5388j4249J1774m6410l4650q509n1924K1497L5814N7316k7243k0885L5499
$$ 55388 41139 52913 6503 -28147 -36656 -88580 -67083 -31269 26047 -1196 -22081 13418
7864A3418J3266j300r884O782l1045L7567j5955q158N597j5190n623M779j2014
$$ 13418 26684 25384 15500 22282 -8763 28804 12849 4691 10288 -4902 -10525 -5746 -17760
7851a7760R7190O0864r8832l371j642k4437N105o59m3140L1414n7294k2435P6387
$$ -17760 79430 140294 41462 38091 36449 12012 17117 16458 -26682 4732 -52562 -74997 1390
7838A390O0420k6468m9866p538L7119l7919K9493K7002m680j0518j2121M6720
$$ 1390 61810 35342 -14524 -22062 15057 -22862 6631 33633 28953 18435 6314 53034
7826E3034l0192p9849L2301p365N1531L0605J6613K6944l9743k1799j5296k9606
$$ 53034 22842 -57007 -24706 -32071 19460 50065 66678 93622 53879 32080 16784 -12822
7814a2822N170J4677N2414K4418J2092q25O626n1901o462k2648k4765K9444j9243
$$ -12822 -7652 7025 59439 83857 95949 95124 101750 49849 43387 20739 -4026 25418 6175
7801F175n603P6292L938m6135j7031k0496L2136k5100P3183K2305K3870l4466
$$ 6175 572 76864 80802 34667 17636 -2860 29276 4176 77359 99664 123534 89068
7789H9068m6486J5418m3898n0004o6581J0596K6532P0112L6134N4609M6505J753
$$ 89068 42582 58000 14102 -35902 -102483 -91887 -65355 4757 40891 95500 142005 143758
7777A43758p2587L6646K4535m3260o3371r5150n3660O6105J04623K6793k5797
$$ 143758 71171 107817 132352 89092 25721 -69429 -123089 -56984 47639 74432 48635
7766D8635l7620O2808K3092o2887k7366J7428n8150o2517l083J06819O4524j3120
$$ 48635 11015 73823 96915 34028 6662 24090 -34060 -96577 -99660 7159 71683 58563
7754E8563k2009K7318n0068k3382o4266l5390L9643Q8361k4011K246M6809l0938
$$ 58563 36554 63872 13804 -9578 -73844 -109234 -69591 18770 -5241 -2995 43814 12876
7742A2876k8285K1039q963J04889M0574j2692m9889l6416p955j0324o641o54K7807
$$ 12876 -15409 5630 -3333 101556 142130 129438 79549 43133 35178 24854 18213 17559 45366
7729D5366k1743m7954k9123M5798K7356m3706r7441N49J1930L4073K6121N3383
$$ 45366 23623 -24331 -53454 -7656 19700 -24006 -121447 -120898 -108968 -74895 -48774 4609
7717D609q670l2571o9179p004N4796O250q407j0530N8603K3225n849J3933M5295
$$ 4609 -4061 -36632 -105811 -112815 -58019 -51769 -60176 -70706 -12103 11122 5273 19206 64501
7704F4501l5071q1390K3744k5935K9968J3064m2020O4057M4880k2166K5102M724
$$ 64501 29430 -51960 -28216 -54151 -24183 -11119 -53139 10918 55798 33632 58734 63458
7692F3458j00434j900M3435Q5262O4151l3984p6686Q297O6407j4806n4817l5975
$$ 63458 -36976 -38876 4559 89821 153972 119988 43302 51599 118006 103200 48383 12408
7680A2408k8787n9406M3420N0549j4678J272O0951M1443L0235n8258M960l0713
$$ 12408 -16379 -75785 -32365 18184 3506 4778 65729 107172 137407 79149 84109 53396
7668E3396J5835k8839j6354M6709l0250K2155k0214p3594l1940P0028N6172n1176
$$ 53396 69231 40392 24038 70747 40497 62652 42438 -31156 -63096 6932 63104 11928
7656A1928L919k389K7736N3882L5148j4621m8777J7029J1343M9652q5845l5052
$$ 11928 15847 13458 41194 95076 130224 115603 66826 83855 95198 144850 59005 23953
7644B3953O8065J812P664j0957J7243l8637l4146L4153o8971o0817k7013n5299
$$ 23953 92018 93830 101494 90537 107780 69143 34997 69150 179 -60638 -87651 -142950
7632a42950N7806O5830O2944M8015k1864J1432n374k0718o2956k3668m239L6021
$$ -142950 -85144 -19314 43630 91645 69781 81213 75839 55121 -7835 -31503 -35742 279
7620B79k6750J9167k603M6340K4429K450n8006j7575J5496l8715k3045q689J6494
$$ 279 -26471 -7304 -9907 36433 60862 63312 5306 -12269 3227 -35488 -58533 -67222 -50728
7607e0728N6670Q3179L7609K8087k4876j897K6128o8025r0171k2806j2769N7620
$$ -50728 5942 89121 126730 154817 129941 128044 154172 86147 -4024 -26830 -39599 18021
7595A8021o938m9137J834k8804l2313J1059j574k079O4838K2114j7196K2600J4742
$$ 18021 11083 -38054 -36220 -65024 -97337 -86278 -87852 -89931 -25093 -2979 -20175 2425 17167
7582A7167M344j6046P14N2312o3675M664n2141o1095r486O1019p72j731j6884
$$ 17167 21511 5465 6179 58491 -5184 -520 -52661 -113756 -123242 -62223 -62995 -64726 -81610
7569h1610O5685P9825O8686K4947n0980o2026n0473J3516L5894k0416n5697J5838
$$ -81610 -15925 63900 132586 157533 106553 44527 -5946 7570 43464 23048 -32649 -16811
7557a6811N015L2597L8361o7807l9244l5785L260L2918k7323o43N3483N5459L8332
$$ -16811 -11796 20801 59162 -8645 -47889 -83674 -80414 -47496 -74819 -75462 -21979 33480 71812
7544G1812o539R400R049O0218p6317q1627J1858r922m4066K5267j7504P2925l3814
$$ 71812 65273 74673 83722 143940 67623 -14004 -2146 -12068 -56134 -30867 -48371 24554 -9260
7531i260k5808J76M0739J0992j9277L587O963n7956n9691O7907l3828l7344J12421
$$ -9260 -35068 -34892 5847 16839 -2438 1149 8112 -49844 -109535 -41628 -75456 -112800 -379
7518c79Q7952N1104l4301n4011J3732K5381j1967l7676n189J0395L6667K158L2394
$$ -379 87573 138677 104376 50365 64097 89478 77511 39835 34646 45041 81708 83866 116260
7505A16260M9298j6688j4426m5039m9895k2227m5637L138j9977O4087o905o0426
$$ 116260 165558 148870 134444 89405 39510 17283 -28354 -25216 -45193 18894 11989 -48437
7493d8437k405N2246p859J7488O1118M4221j06950q6153L3069p026P0522O3719
$$ -48437 -50842 1404 -6455 11033 72151 116372 9422 -76731 -43662 -50688 19834 83553
7481H3553J4187M4903n4498o8528J8717m6485Q813R9954L1952J2354l1401k0335
$$ 83553 97740 142643 88145 19617 38334 -8151 662 100616 132568 144922 113521 93186
7469I3186m7767J4166P3679j7076j2291n8064p1616K8792N812L7915N9464J6228
$$ 93186 45419 59585 133264 116188 103897 45833 -25783 3009 8821 46736 106200 122428
7457A22428k9052M2720o6835k1138k5358J978J2305m3349k8766K7911J6103Q417
$$ 122428 93376 136096 69261 48123 22765 24743 37048 -6301 -35067 -7156 8947 17364
7445A7364k3709j4162L1323n224M3653M138q5167J4532L840O003L6688L9185m9496
$$ 17364 -6345 -20507 10816 5592 49245 53383 -31784 -17252 -13412 -7409 29279 68464 18968
7432A8968J7801K379K9274j5589j5812o2402K812K3624L6583K8482M186J7300
$$ 18968 36769 39148 68422 52833 37021 -25381 -22569 1055 37638 66120 70306 87606
7420H7606Q162k6936m1048l5443J6741j7733J4240Q52M4871l7275l125k880m8258
$$ 87606 95768 68832 27784 -7659 9082 -8651 5589 6441 51312 14037 10912 8032 -40226
7407d0226p0942k1503M7618j558M9232Q2977O8853m958k5864m0275p980m1737
$$ -40226 -111168 -132671 -85053 -86611 -37379 45598 114451 109493 83629 43354 35374 -6363
7395f363j5447K9482l3554O1308Q3270j0403j133j8838k3760l3494m0062m0723
$$ -6363 -21810 7672 -25882 35426 118696 108293 107160 88322 64562 31068 -8994 -49717
7383d9717M0018O6730O4910p4927j6364j4510j16301q1280J03004L0645l972p49
$$ -49717 -9699 57031 121941 47014 30650 16140 -100161 -181441 -78437 -47792 -51764 -52513
7371e2513O7277N2175l8623R635K0413n0168l0891j691j9004k4354L7813O0887
$$ -52513 14764 66939 28316 37951 58364 8196 -22695 -24386 -43390 -67744 -29931 30956
7359C0956j8085K6668R201j3653L7599M1407L811p2291m4879M9207N9200P735
$$ 30956 12871 39539 48740 35087 72686 114093 117904 45613 734 49941 109141 116876
7347A16876q26m5964r3760K2353N2812L1581L3981M9950j5633r3687p4553j1755
$$ 116876 116050 70086 -23674 -1321 51491 83072 117053 167003 151370 57683 -16870 -28625
7335b8625O039K2429j3425k9960k3980j5543j0366K2252J3675k3570L1431M0086
$$ -28625 -22586 -157 -13582 -43542 -67522 -83065 -93431 -71179 -57504 -81074 -49643 -9557
7323i557l2085l1967j2386N5026k6887J9363L4993R678k822K7346N4877k557n2353
$$ -9557 -41642 -73609 -85995 -30969 -57856 -38493 -3500 6178 3356 30702 85579 83022 30669
7310C0669m0007l3941M4640J9000J8436n7306M45Q349n2819j7360L0439O2188
$$ 30669 -9338 -43279 1361 20361 38797 -18509 -18064 -9715 -62534 -79894 -49455 12733
7298A2733l5500m0042J8218K7641q966j571j9001J3465l2090J902L7484j2965
$$ 12733 -22767 -62809 -44591 -16950 -25916 -27487 -46488 -33023 -65113 -63211 -25727 -38692
7286c8692p0427J7463J13294M7700Q579J3795j885K4566J3180j2726k9423k1224
$$ -38692 -109119 -91656 21638 69338 77917 91712 89827 114393 127573 114847 85424 64200
7274F4200m6349q960J9736L8091r2727n7312j346N4855k7007n459k5062N734n243
$$ 64200 17851 8891 28627 66718 -26009 -83321 -84667 -29812 -56819 -62278 -87340 -81606 -86849
7261h6849L7540J862j9552j4304N4777M0596l8535n9010J2087J7239k5816j4959
$$ -86849 -49309 -47447 -66999 -81303 -26526 14070 -24465 -83475 -71388 -54149 -79965 -94924
7249i4924L7804K3498N5456N5428N008n8146K0982m007J0206M964k1927j2576
$$ -94924 -57120 -33622 21834 77262 82270 24124 45106 41099 51305 56269 34342 21766
7237B1766k041j014k1908M7562Q0146m4516j5839L501j8665k7811p496N2295M7276
$$ 21766 19725 18711 -3197 44365 124511 79995 64156 67657 48992 21181 13685 65980 113256
7224A13256N1933k5632j8769j5300J0364L7248O82m9459j9009n6521k8502R10
$$ 113256 165189 139557 120788 105488 115852 153100 153782 104323 85314 28793 291 1201
7212A201n3268L8698L7933m7614M9817l280K1852J8086j2387m3948l3230p70N92
$$ 1201 -52067 -13369 24564 -23050 26767 23487 45339 63425 51038 7090 -26140 -26910 -26318
7199b6318n273M6893J7437k3210K614M4411j8033q7450n8849O0325O6398o104
$$ -26318 -31591 15302 32739 9529 12143 56554 38521 -48929 -107778 -47453 18945 12841
7187A2841q614o1201j2336N6074l6417J3068K2236J7901n0788o9077K6686M0970
$$ 12841 4227 -56974 -69310 -13236 -49653 -36585 -14349 3552 -47236 -116313 -89627 -48657
7175d8657O9495n11L0346l3160J3801J585j7353R476L5332O3970R045j3465j7614
$$ -48657 20838 20327 50673 17513 31314 32899 15546 25022 60354 124324 133369 119904 102290
7162A02290o4195l7024j5328P8472O8611l9060q0366l6187K6525P7867j230l6941
$$ 102290 38095 1071 -14257 64215 132826 93766 13400 -22787 3738 81605 80375 43434
7150D3434n1808L1322j0137n9025m7009o373J09183Q3430L6840j4406l5621l8126
$$ 43434 -8374 22948 12811 -46214 -93223 -99596 9587 93017 129857 115451 79830 41704
7138D1704m5477L8869M3545K876l2556p8701n0792L3822K5601q6053Q862P0043
$$ 41704 -3773 35096 78641 81517 48961 -29740 -80532 -46710 -21109 -107162 -98300 -28257
7126b8257L1620J9797L2299k9703n4759j01994o2045L1948N3112J21731M4803
$$ -28257 3363 23160 55459 25756 -29003 -130997 -193042 -161094 -107982 13749 58552
7115E8552M2240k7173l3935k0336p4028J9484Q0242M1078K0819p8004r9717L396
$$ 58552 100792 73619 39684 19348 -54680 -35196 45046 86124 106943 28939 -70778 -67382
7103f7382L1835J0791J3573j4986k6061l2757l1170Q8312M8583P5664N77n280
$$ -67382 -35547 -24756 -11183 -26169 -52230 -84987 -116157 -27845 20738 96402 96979 91699
7091I1699j1850J8491K33l9186j2006J8404J2744m3104j2126k9439K7772L5775
$$ 91699 79849 98340 98573 59387 47381 65785 78529 35425 23299 -6140 21632 57407
7079E7407J491m8986K945k0316Q51J0325M6348J8717m4729m6599K3594k7236M2587
$$ 57407 58898 9912 12857 -7459 -6608 3717 50065 68782 24053 -22546 1048 -26188 16399
7066A6399q049l6031l6853l0089j256l2725J2226N1611o53M1524K7737K4586n9114
$$ 16399 8350 -27681 -64534 -94623 -95879 -128604 -116378 -64767 -65420 -23896 3841 28427 -30687
7053c0687j8435L36k7033l4336L6954P978O2125k607k9489M152N7756K5147l0964
$$ -30687 -49122 -48786 -75819 -110155 -73201 -65223 -3098 -5705 -35194 -31042 26714 51861 20897
7040B0897L894M7876k0810p245N5831K4606q155l3389n9896j20L499j2043K199
$$ 20897 24791 72667 51857 44612 100443 125049 116894 83505 23609 23489 26988 14945 17144
7027A7144L841p9784k6606l4212J0302L4388L5028j0246N181K1284K5716j2366
$$ 17144 20985 -58799 -85405 -119617 -109315 -74927 -39899 -50145 -44964 -23680 2036 -10330
7015a0330J032J9191L4412j6172j3170J42J6829o702k7753L6701q791L6283j6044
$$ -10330 -9298 9893 44305 28133 14963 15105 31934 25232 -2521 34180 25389 61672 45628
7002D5628m7660K4577p455K2478N0056J9957l4214Q068N7254n1224o3986o4452
$$ 45628 -2032 22545 15090 37568 87624 107581 73367 81435 138689 87465 23479 -40973
6990d0973l5401R496O1007P4833k8198j6434m5123l5155P838j9529l1490J0046
$$ -40973 -76374 -66878 -5871 68962 40764 24330 -20793 -55948 -48110 -67639 -99129 -89083
6978h9083N7033N1465k9075n100m2027K6358l2508P857O2695K6950J1091J7630
$$ -89083 -32050 19415 -9660 -14760 -56787 -30429 -62937 -55080 7615 34565 45656 63286
6966F3286J9069M7236l6034j1621J9469K0274L8946p5892o8073N0834j8283L8192
$$ 63286 82355 129591 93557 81936 101405 121679 160625 84733 16660 67494 49211 87403
6954H7403K0747J9290K2564j1798n9440p1377m7241N8657K3202J7468k2226R118
$$ 87403 108150 127440 150004 138206 78766 7389 -39852 18805 42007 59475 37249 46367
6942D6367j2236l0959p5870m5692L6646n660l6653M7862M4371N544L2752K2375
$$ 46367 34131 3172 -72698 -118390 -81744 -87404 -124057 -76195 -31824 -26280 6472 28847
6930B8847o8675J3109N7743K8892o708k2400m4825k5717N6730j9320l5578l0381
$$ 28847 -39828 -26719 31024 59916 53208 30808 -14017 -39734 16996 -2324 -37902 -68283
6918f8283l7867p101L1493k9492l123L4799J1812N2093M2004K6813m435L9076
$$ -68283 -106150 -113251 -81758 -111250 -114373 -79574 -67762 -15669 26335 53148 48713 87789
6906H7789n2557p8016L4891O1115p1454L1200J00644j8210o9900Q9910J1718r1448
$$ 87789 35232 -42784 -7893 53222 -18232 12968 113612 95402 25502 115412 127130 35682
6894C5682o2901m681l0230l738Q179Q3360j9365n2939j144K6807K7414r7920J4737
$$ 35682 -27219 -31900 -62130 -65868 -57689 25671 6306 -46633 -47777 -20970 6444 -91476 -76739
6881g6739J27809J6255l7200m743r306O769l5828k3849P6725l5957j27343P170
$$ -76739 51070 67325 30125 25382 16076 22845 -12983 -36832 39893 3936 -123407 -116237
6869a16237K8782J7205K4265K1515k753L6633J8746j7384j2919n3747r2746M4070
$$ -116237 -87455 -70250 -45985 -24470 -27223 9410 28156 10772 -2147 -55894 -148640 -104570
6857a04570N4930J4744P325J17k8530K2202N6102j4894o0350k1519L2036L0127
$$ -104570 -49640 -34896 -27571 -27454 -55984 -33782 22320 7426 -52924 -74443 -42407 -12280
6845a2280k5187M6209M9904L8554r4836p9497N0384M0946K3980Q25J3781Q596
$$ -12280 -37467 8742 58646 97200 2364 -77133 -26749 14197 38177 39002 52783 61379
6833F1379n770j8334p1776O777J2143K5777K1643J9149l2178J4535M4212j0796
$$ 61379 55609 37275 -34501 -27724 -15581 10196 31839 50988 18810 33345 77557 66761
6821F6761P836J1141o886j5852K2704j4953J2032N221l0844l352k1657L4413l7014
$$ 66761 74597 85738 78852 63000 85704 70751 82783 88004 57160 53808 32151 66564 29550
6808B9550M5307M9168M570l9672k9075o7958n3511k396J8869L689L8185l632O060
$$ 29550 74857 124025 128595 88923 59848 -8110 -61621 -64017 -45148 -41459 -3274 -6906 -846
6795h46K531n461m8391o525n690M1638R6716k0649m7197j9925k0317K7230k5416
$$ -846 1685 -3776 -52167 -58692 -64382 -22744 73972 53323 6126 -13799 -34116 -6886 -32302
6782c2302j365l5639M0598j9545K1733m740p7337j8916R008J29053J875l4612
$$ -32302 -33667 -69306 -28708 -48253 -26520 -31260 -108597 -127513 -118505 10548 12423 -22189
6770b2189M388N7498P3975n9552J997j3683o6413Q149J8495m395j4881j2807k7819
$$ -22189 -17801 39697 113672 54120 56117 42434 -23979 -15830 2665 -1730 -16611 -29418 -57237
6757e7237K8754O3402j4931q756o6562K3368M2357J4995j4181k0807l6009j5523
$$ -57237 -28483 34919 19988 11232 -55330 -31962 10395 25390 11209 -9598 -45607 -61130
6745f1130k0899L510R346L2351M552K9506J539k2514K8567M624K6539M6180R475
$$ -61130 -82029 -78519 -69173 -36822 -32270 -2764 -1225 -23739 4828 9452 35991 82171 91646
6732I1646k2388o4334p7863L9491k1349k1075O7436N6514J3306q059L427j5779
$$ 91646 69258 4924 -72939 -33448 -54797 -75872 -8436 48078 61384 53325 56752 40973
6720D0973J3494j0305K2583L066j598m7516n2838m8691N9608M3920m004l9338
$$ 40973 54467 44162 66745 69811 68213 20697 -32141 -80832 -21224 22696 18692 -20646
6708b0646k8082j4333r274K5379l7661n4644P833L4324j2535J3419K2733N094
$$ -20646 -48728 -63061 -72335 -46956 -84617 -139261 -131428 -97104 -109639 -96220 -73487 -68393
6696f8393k2643m0781m3646J0471P961P268P5069Q3321O077j4493k1670k9123
$$ -68393 -91036 -131817 -175463 -164992 -157031 -149763 -74694 8627 14704 211 -21459 -50582
6684e0582L9936R3036K2338j97l3504o8533n229L3966M4242k0204R797N2572L767
$$ -50582 -10646 82390 104728 104531 71027 2494 -2735 31231 75473 55269 65066 117638 121405
6671A21405m8797m4714l78n3489R72J1142q525K2773P0756M2364p545k5776l7064
$$ 121405 72608 27894 27516 -25973 -25001 -13859 -22384 389 71145 113509 105964 80188 43124
6658D3124m5293M2634N0544M2596L7920J02458M2077O9199J02670J05929N8530
$$ 43124 -2169 40465 91009 133605 171525 273983 316060 385259 487929 593858 652388
6647F52388J12319J29264J03644L0710p1657j42970m4770J33065K04187J61493
$$ 652388 764707 893971 997615 1028325 956668 813698 768928 901993 1106180 1267673
6637A267673J90288L32718M29960M11674O95934J090082J510676J852304K110596
$$ 1267673 1457961 1790679 2220639 2632313 3328247 4418329 5929005 7781309 9891905
6628I891905K063343K263726L189574M777897N019387L71724n373361p495590
$$ 9891905 11955248 14218974 17408548 22186445 27205832 27577556 22204195 14708605
6620A4708605n689367l196095j702539r48276o03097m86093l60678k43591k11184
$$ 14708605 9019238 5823143 4120604 3172328 2569231 2083138 1722460 1478869 1267685
6611A267685j40652q0445o6456j31880n0385j603K871O7065N7852n2167j29503
$$ 1267685 1127033 1046588 980132 848252 797867 796264 799135 866200 924052 871885 742382
6600G42382j93898j23989o3605J5502o289j02290p7357o1853l9835l6818M5162
$$ 742382 548484 424495 360890 376392 370103 267813 190456 128603 88768 51950 97112
6589I7112O0201n6387j102J5642M0188l2480m9171l2915J148j277L8635L7761
$$ 97112 157313 100926 99824 115466 155654 123174 74003 41088 42236 40959 79594 117355
6577A17355L4617M8489k0750j0170l052n4777o7392l9159P6336N5900P5787q986
$$ 117355 151972 200461 179711 169541 166489 111712 44320 5161 81497 137397 213184 204198
6565B04198p0444m4935J7867O3632J2659k6324p910o8694q0021P08j6051O3487
$$ 204198 133754 88819 106686 170318 182977 156653 148743 80049 28 736 -15315 48172
6553D8172P5429L7762n1838n1048o7634J3294l0562Q365M3484Q7311j3179k8945
$$ 48172 123601 161363 109525 58477 -9157 4137 -26425 -18060 25424 112735 99556 70611
6541G0611j5505K5996k7385m5912L26l542N0335m3422k5396R8836N1553l3397
$$ 70611 55106 81102 53717 7805 8131 4589 54924 11502 -13894 84942 136495 103098
6529A03098L6532n271m8272j6661l566K5953K9761M7925l065q5582k1157j8183
$$ 103098 139630 134359 86087 69426 65860 91813 121574 169499 166434 80852 59695 41512
6517D1512N0426L0967K2031o4410m6298j3913P1689Q3635n1276o6753P788J4383
$$ 41512 91938 122905 144936 80526 34228 20315 92004 175639 124363 57610 65398 79781
6505G9781J8443q5286L351j4418J4965J20078J70029q9661j61717n3295N5172
$$ 79781 98224 12938 16289 1871 16836 136914 306943 217282 55565 2270 57442
6494E7442L3578j27197r0960N6968Q5206K2527j4453j4627Q170J3387p2646M4959
$$ 57442 91020 -36177 -127137 -70169 15037 37564 23111 8484 16654 30041 -42605 2354
6482B354N9295k2936L9138J0045m1895N076R239r610l4282j1815L702j4040J0509
$$ 2354 61649 38713 77851 87896 46001 51077 60316 50706 16424 4609 8311 -5729 4780
6469D780n230L4276m166j8485p8092L0985Q5865J6546l6871J1221k3741J5918
$$ 4780 -450 33826 29660 11175 -66917 -35932 49933 66479 29608 40829 17088 33006
6457C3006j928p2615L2593O8730J1627p7179L8912L3160p35j01639m0104N387
$$ 33006 31078 -41537 -8944 59786 71413 -5766 33146 66306 65571 -36068 -76172 -70785
6445g0785K4041K8381R712k8336r281J4326M5767N0542L8441j7765m5652k5144
$$ -70785 -46744 -18363 -8651 -36987 -46268 -31942 13825 64367 102808 85043 39391 14247
6433A4247J4014J8285j2110o6901k0325R4236N6229r652o6265k8819k7164o7271
$$ 14247 28261 46546 34436 -32465 -52790 41446 97675 88023 21758 -7061 -34225 -101496
6421a01496Q1596L121L2657M8693r3849l1098j2473Q696J0580M7687J3317n5534
$$ -101496 -19900 -16779 15878 64571 -29278 -60376 -72849 -64153 -53573 -5886 7431 -48103
6409d8103N922M3209M594J7460M3896K7861m9811J4829J4812K6328j4577j07366
$$ -48103 -42181 1028 5622 23082 66978 94839 45028 59857 74669 100997 86420 -20946
6397b0946J1627k3981K6969L5696j2975M4289m0416m6629m17J2123J8847L3426
$$ -20946 -9319 -33300 -6331 29365 16390 60679 20263 -26366 -26783 -14660 4187 37613
6385C7613l1946J767l5419N1043P5198M236m6377n7205L3562n1198k444R2012
$$ 37613 5667 7434 -27985 23058 98256 102492 56115 -1090 32472 -18726 -21170 70842
6373G0842O8279l6801o1969j5113L1130p6872n470P4356q555n8259j6202j8644
$$ 70842 139121 102320 40351 25238 56368 -20504 -25974 48382 39827 -18432 -34634 -53278
6361e3278P251L1043K5382L8297j6008l93R9413K0665r5854j0240K4682O0167
$$ -53278 -46027 -14984 10398 48695 32687 32294 131707 152372 56518 46278 70960 131127
6349A31127m8897p210j6373j2688k8763o9570j1379n6537q898J7043M7504K6520
$$ 131127 82230 75020 58647 45959 17196 -52374 -63753 -120290 -129188 -112145 -64641 -38121
6337c8121n67O4365M1729P2246J3259j7294l0755k1021M0736L6537o6951j2579
$$ -38121 -38688 25677 67406 139652 152911 135617 104862 83841 124577 161114 94163 81584
6325H1584L3918L8860j19207l5239q052O52k802k3338L281K6774j9226K9337M0399
$$ 81584 115502 154362 35155 -84 -8136 -7484 -10286 -33624 -30343 -3569 -22795 6542 46941
6312D6941q870p16j0050l1109J9845k9835l754K2781q0966k0254L4588J9657M1808
$$ 46941 38071 37355 27305 -3804 16041 -13794 -17548 5233 -75733 -95987 -61399 -41742 66
6299F6O7657M765o0179m4310m328Q885o497j8264j5065m1829l0457M4443P9291
$$ 66 67723 72488 12309 -32001 -36329 -27444 -33941 -52205 -67270 -109099 -139556 -95113 -15822
6286a5822L5174L2790R36N2786k0348l1550p6816j9078K7777j9910K1830l6376
$$ -15822 19352 52142 53078 105864 85516 53966 -22850 -41928 -14151 -34061 -12231 -48607
6274d8607p6940K9666N6849j4505n264j5106K0610J5243q061O0764N3208K2600
$$ -48607 -125547 -95881 -39032 -53537 -58801 -73907 -53297 -38054 -46115 14649 67857 90457
6262I0457l9157j8742M3404L9483p105m9685m7216l1526j4555N5933O1673J8948
$$ 90457 51300 32558 75962 115445 108340 58655 11439 -20087 -34642 21291 82964 101912
6250A01912J6495j3979J3627m4123k7751J4279N363m0246J4184o495K308k1088
$$ 101912 118407 104428 118055 73932 46181 60460 65823 25577 39761 33266 35574 14486
6238A4486N9754K3716k7159o0346l0064r568L701J0085L2426j3614K4119K4993
$$ 14486 74240 97956 70797 10451 -19613 -29181 -25480 -15395 17031 3417 27536 52529
6226E2529L3538m9718m4000j7894L1619O420m8504O7185P165j1109j0323O596
$$ 52529 86067 36349 -7651 -25545 6074 12494 -36010 31175 38340 27231 16908 23504
6214B3504N5819l1285k2201J1498m7453m9519n2851L5287K1660L2094O591J1623
$$ 23504 79323 48038 25837 37335 -10118 -59637 -112488 -77201 -55541 -23447 -16856 -5233
6202e233m8329k2003J0538J06314k3095o1377j593j493K754O3287J3294J247P924
$$ -5233 -53562 -75565 -65027 41287 18192 -43185 -44778 -46271 -43517 19770 33064 34311 42235
6189D2235m7628j7469m0596J4187L3327l6994K4139k4340K190j378p535q710j650
$$ 42235 -5393 -22862 -63458 -49271 -15944 -52938 -28799 -53139 -50949 -52327 -59862 -68572 -70222
6176g0222L3614K7772L5519J8863J0638l4621l1562J2851N0598O9q8362m8788
$$ -70222 -36608 -8836 26683 45546 56184 21563 -9999 2852 53450 53519 -34843 -83631
6164h3631K8795O2124p335k8069l7144P244J395J1928J5551k2272r088o609J8914
$$ -83631 -54836 7288 -47 -28116 -65260 -58016 -56621 -44693 -29142 -51414 -60502 -67111 -48197
6151d8197O9579O9537l5307j6779K0355m8825k6923K1789N6356j8552p0495n5572
$$ -48197 21382 90919 55612 38833 59188 10363 -16560 5229 61585 43033 -27462 -83034
6139h3034j636K7604M753j3984p985N461N0538N8742q1879j11287K4497L2785
$$ -83034 -84670 -57066 -52313 -66297 -74282 -68821 -18283 40459 -41420 -152707 -128210 -95425
6127i5425P6082P0525j036q6700n1537J19594J24880m4670m4394j4404o7702N306
$$ -95425 -19343 51182 50146 -36554 -88091 31503 156383 111713 67319 52915 -14787 -9481
6115i481n7492l369R8573K1848M666m1627k8779j9769M2465L1789l5478R635K966
$$ -9481 -66973 -70342 28231 50079 54745 13118 -15661 -35430 7035 38824 3346 12981 15947
6102A5947k398J2023L1184j2212l5887k7608m9620j195K008j4996j0215L7706
$$ 15947 13549 25572 56756 44544 8657 -18951 -68571 -69766 -67758 -82754 -92969 -55263
6090e5263M4318K224K8663M8195l4914j2006n86j0922l302K9224L2497j9470q5997
$$ -55263 -10945 -8721 19942 68137 33223 21217 20631 9709 6407 35631 68128 48658 -37339
6077c7339m108O0020K1284l4389n3157j8181m2073K4287K0134M4375N9598j7052
$$ -37339 -41447 18573 39857 5468 -47689 -65870 -107943 -83656 -63522 -19147 40451 23399
6065B3399J9017o9214m8337j599M0362L9374n1184j0126J9189M4586j0459P837
$$ 23399 42416 -26798 -75135 -76734 -36372 3002 -48182 -58308 -39119 5467 -4992 2845
6053B845M690L4887O918j4876l1798k2489l4566q484J7081P293L7457l9485J3013
$$ 2845 7535 42422 49340 34464 2666 -19823 -54389 -62873 -45792 -38499 -1042 -40527 -27514
6040b7514M0185n178o1606o3706J1j6384j4559n616K814O0424R2643L9947l5571
$$ -27514 12671 7493 -54113 -117819 -117808 -134192 -148751 -154367 -151553 -91129 1514 41461 5890
6027E890n3100j0830P7375K9306l2263N2793L194k9867k7973n0165j706J8907
$$ 5890 -47210 -58040 19335 48641 16378 69171 72365 42498 14525 -35640 -37346 -18439
6015a8439R1868O885q2158n4458k5179k6723l6255M4283J20020o3099m8703Q651
$$ -18439 73429 80314 -1844 -56302 -81481 -108204 -144459 -100176 19844 -43255 -91958 -83307
6003h3307M7611K3613J2150l7189N7444N1744Q69J124p2511m5146m3476J4714
$$ -83307 -35696 -12083 67 -37122 20322 72066 72935 74059 1548 -43598 -87074 -72360
5991g2360O9617J0323K9779N5371N6171k2130k5104o5174k8281L9996k19J276
$$ -72360 -2743 7580 37359 92730 148901 126771 101667 36493 8212 48208 47989 49265
5979D9265k1758N5529R392l7190p047l89m6623K1490O7839j4546p9059j5840M8923
$$ 49265 27507 83036 92428 55238 48191 47802 1179 22669 90508 75962 -3097 -18937 29986
5966B9986M6769j5035j3982J9650l0839J8721J929m8039l2124m0759J1230j578
$$ 29986 76755 61720 47738 67388 36549 55270 57199 9160 -22964 -63723 -52493 -54071
5954e4071j8301k2330n6486j3614Q397q66K2127J3549J9718N9544O5145L5824
$$ -54071 -72372 -94702 -151188 -164802 -156405 -157271 -135144 -121595 -101877 -42333 22812 58636
5942E8636l3232K476L7681j9708N86j6174o6050j167q263m468L0132L5389P536
$$ 58636 25404 27880 65561 45853 46439 30265 -35785 -36952 -45215 -49683 -19551 15838 23374
5929B3374q0129o1907L3841J05978L0938o6068m5216m2474j7512K163q381L0439
$$ 23374 -56755 -118662 -84821 21157 52095 -13973 -59189 -101663 -119175 -117012 -125393 -94954
5917i4954L7429q156m0801o326K3271N7478P526k0860p793K9445J7604j8799J1526
$$ -94954 -57525 -65681 -106482 -112808 -89537 -32059 -24533 -45393 -53186 -23741 -6137 -24936 -13410
5904a3410Q306n0851l047L5838L307L7715J0176m0243k3694N842O924q153L8984
$$ -13410 -5104 -55955 -59002 -23164 -19857 17858 28034 -12209 -35903 -30061 -23137 -31290 7694
5891G694j2044m3046l635j4572J9278O4545N353P4125L2753J5591o1395j8722
$$ 7694 -4350 -47396 -51031 -65603 -46325 18220 23573 97698 130451 146042 84647 65925
5879F5925J4723l228m7908o8999l8379j6998M7520j2007J0239j2744J1566O6089
$$ 65925 80648 77420 29512 -39487 -77866 -94864 -47344 -59351 -49112 -61856 -50290 15799
5867A5799J0707n1466j3911n079L2348P1432j69j1200K422o3885Q404n7252r899
$$ 15799 26506 -24960 -38871 -43950 -11602 59830 59661 48461 50883 -13002 -4598 -61850 -71749
5854g1749O8945k5162o4461k2448j3373P9979N8842J1892o7484M0561L0058l0995
$$ -71749 -2804 -27966 -92427 -114875 -128248 -48269 10573 22465 -45019 -4458 25600 -5395
5842e395l9669q207J191N8548l9586K0120o285P24k9481J9510P1136o686n3755
$$ -5395 -45064 -53271 -52080 6468 -33118 -12998 -19283 -18559 -48040 -28530 42606 35920 -17835
5829a7835O735O78l1214J4185L1116l1856k3798R8736M1022n1614k4015J1506
$$ -17835 -11100 -10422 -41636 -27451 3665 -28191 -51989 46747 87769 36155 12140 23646
5817B3646j03154J4608Q0200L3983n8371q4968m0958P243j7401R5993M4222K9606
$$ 23646 -79508 -64900 15300 49283 -9088 -94056 -135014 -127771 -145172 -49179 -4957 24649
5805B4649k9773o4315m8989L4024N1296L8179k8324r520K9771J7310l2926l5701
$$ 24649 -5124 -69439 -118428 -84404 -33108 5071 -23253 -32773 -3002 14308 -18618 -54319
5793e4319J0077J553j00226o832K6973O1686k0899j1197L8792N0321m9450L5264
$$ -54319 -44242 -42689 -142915 -149747 -122774 -61088 -81987 -93184 -54392 -4071 -53521 -18257
5781a8257o4628m1639K0396J37708O4544q7593j10503j4314k5913O7287J01038
$$ -18257 -82885 -124524 -104128 33580 98124 10531 -99972 -114286 -140199 -72912 28126
5770B8126K3369p924n617K9775j4070l5522l0096L223o7606j9036J9197L5070
$$ 28126 51495 43571 37954 67729 53659 18137 -11959 -8736 -76342 -95378 -76181 -41111
5758d1111J5080K0675q689k0792j443K6439m912K0633O321J7741Q530m386M5659
$$ -41111 -26031 -5356 -14045 -34837 -36280 -9841 -14753 5880 12201 29942 38472 34086 79745
5745G9745J691m5176o4202J0088M8736m2538k0999k261n3866J6088k2841j7295
$$ 79745 81436 36260 -27942 -17854 30882 -11656 -32655 -34916 -88782 -72694 -95535 -112830
5733a12830M2813M6137J0922O4559l4848k9556k5J5718N3727o4865p4137l4331
$$ -112830 -70017 -23880 -12958 51601 16753 -12803 -12828 2890 56617 -8248 -82385 -116716
5721a16716J9731J8419J3357O5423j184L3593k4828j29721k6720K7700M3135M2973
$$ -116716 -96985 -78566 -65209 214 -970 32623 7795 -121926 -148646 -120946 -77811 -34838
5709c4838J1878K1366K5515j2231m7179l1876J342P5007K0468k4705M0237K8391
$$ -34838 -22960 -1594 23921 11690 -35489 -67365 -66023 8984 29452 4747 44984 73375
5697G3375o0376m1254k997j5201k2461L0311K5603O455o166L3377p620j1253n2347
$$ 73375 12999 -28255 -31252 -46453 -68914 -38603 -13000 -6545 -12711 20666 13046 1793 -50554
5684e0554q462K0971l2539R56K3190L1833p7791k6310K6919J4051O922j7773j5973
$$ -50554 -59016 -38045 -70584 -69628 -46438 -14605 -92396 -118706 -91787 -77736 -70814 -88587 -104560
5671a04560n0256L3233N2389n60n0603L75l633l8657L5406O5479J8653J8037k8163
$$ -104560 -154816 -121583 -69194 -69754 -120357 -119982 -123615 -162272 -126866 -61387 -42734 -24697 -52860
5658e2860l8215r248L7306k989j7341j3165o9914m4954M2784M4738K9348L5794
$$ -52860 -91075 -100323 -63017 -66006 -83347 -96512 -166426 -211380 -168596 -123858 -94510 -58716
5646e8716K1958K2243o6867o0828N5802n68j2156M7586O349o6679j4557l914k0780
$$ -58716 -36758 -14515 -81382 -142210 -86408 -86976 -99132 -51546 -45197 -111876 -126433 -130347 -151127
5633a51127l3723m308O2979N5621J3665K9649k145l4362o5548M8266N4024L5479
$$ -151127 -184850 -189158 -126179 -70558 -56893 -27244 -29389 -63751 -129299 -81033 -27009 8470
5621H470P6130n1937m4667L3597O0128K3633n4270l1509j1573l1669j7182J1105
$$ 8470 84600 32663 -12004 21593 81721 105354 51084 19575 8002 -23667 -40849 -29744
5609b9744j0864M1808N6939J1129k9059n6783n7424j9314J8463M0425L5270J4126
$$ -29744 -40608 1200 58139 69268 40209 -16574 -73998 -93312 -74849 -34424 846 14972
5597A4972l7971p7580k139K1237l6987M7941K6913K8369J2690q297J6687J9120
$$ 14972 -22999 -100579 -102718 -81481 -118468 -70527 -43614 -15245 -2555 -10852 5835 24955
5585B4955J9500m166o9446k1784K5803j8866Q204L8600P519j2143L4145P414L2580
$$ 24955 44455 40289 -29157 -50941 -25138 -44004 -35800 2800 10319 -1824 32321 39735 72315
5572G2315k476j01000j4399k2624j5822L6213p956k3092O2983N7026L206m619
$$ 72315 69839 -31161 -45560 -68184 -84006 -47793 -55749 -78841 -15858 41168 44374 39755
5560C9755k6731l2484L6705K2053j1195m1512J8222J1926K0083L5194m1231n2635
$$ 39755 13024 -19460 17245 39298 28103 -13409 4813 16739 36822 72016 30785 -21850
5548b1850J755j2614J3979J6305N4230K2056j9851k114p528j6672K7827m5618
$$ -21850 -20095 -32709 -18730 -2425 51805 73861 54010 51896 44368 27696 55523 9905
5536I905N926k3440l8644k951J7752l5987p4070K2550J4715M2072K0863k5875
$$ 9905 15831 -7609 -46253 -49204 -31452 -67439 -141509 -118959 -104244 -62172 -41309 -67184
5524f7184K1769R7909J3176l2970j2405l776p2402j3465o2236m632O5369r967
$$ -67184 -45415 52494 65670 32700 20295 16519 -55883 -69348 -131584 -136216 -70847 -80814
5512h0814L6930k657j6094L8995J4692k4528l7312N2674Q2441j1264P224J601
$$ -80814 -43884 -46541 -62635 -23640 -8948 -33476 -70788 -18114 64327 53063 60287 61888
5500F1888P258l1473J6402o520N7083m1491m3046o0720l0945N4186l221J9622
$$ 61888 69146 37673 54075 47555 104638 63147 20101 -40619 -71564 -17378 -20599 -977
5488i77N5150R09M52m3471p5297j3479q219j14857o0012M9938O9857P8807M4740
$$ -977 54173 55082 55534 12063 -63234 -76713 -84932 -199789 -259801 -209863 -140006 -61199 -16459
5475a6459m6014l0850m8031k3205R2441R6541K2561m4331K0683j7627k6411j1332
$$ -16459 -62473 -93323 -141354 -164559 -72118 24423 46984 2653 23336 5709 -20702 -32034
5463c2034K0857O3675J1534p5266p1830J1493L2899J7439k2736L6468k021j3935
$$ -32034 -11177 52498 64032 -11234 -83064 -71571 -38672 -21233 -43969 -7501 -9522 -23457
5451b3457k7690L6031J0721J3888o4420n9573O4624K1459m6927m546k0782O520
$$ -23457 -51147 -15116 -4395 9493 -54927 -114500 -49876 -28417 -75344 -79890 -100672 -94152
5439i4152N9434K4842m1853o0925L3448m6692r795N9941J4313n281M1256J823
$$ -94152 -34718 -9876 -51729 -112654 -79206 -125898 -135693 -75752 -61439 -66720 -25464 -23641
5427b3641k8691j1781O7846K8205l1702K4733N6951n7716p1577L118k6536L5242
$$ -23641 -52332 -64113 3733 31938 236 24969 81920 24204 -47373 -44255 -70791 -35549
5415c5549j5129l2181o872R500O391K5218k2874q2082M2536J13989K3656N946
$$ -35549 -50678 -82859 -89731 -80231 -73840 -48622 -71496 -153578 -111042 2947 26603 32549
5403C2549m6221M3194N6564l8684k9852m9671m6732n9064O834J8003N2704L0459
$$ 32549 -13672 29522 86086 47402 17550 -32121 -78853 -137917 -131083 -113080 -60376 -29917
5391b9917L7473M4114P5275m0964j6120m5203j9822n6588n1056m4703Q965P1754
$$ -29917 7556 51670 126945 85981 69861 24658 4836 -51752 -102808 -147511 -138546 -66792
5379f6792O0762P8238L9386q2340n9637k8874j7109M7259P2796j1448M2954J9658
$$ -66792 -6030 72208 111594 29254 -30383 -59257 -76366 -29107 43689 32241 75195 94853
5367I4853k4428k1388j942K4810m3337q0496k9300O589L0369l4850m189L4154
$$ 94853 70425 49037 47095 71905 28568 -51928 -81228 -74639 -44270 -79120 -83309 -49155
5355d9155m6920K564N4929L0529J997j6327l6739K5177n176J7277o347j1214q688
$$ -49155 -96075 -93511 -38582 -8053 -6056 -22383 -59122 -33945 -39121 -21844 -28191 -39405 -48093
5342d8093q0742p8816J1011l330J8271K5685M9380K184m0544r991L8937O1763
$$ -48093 -128835 -207651 -196640 -199970 -181699 -156014 -106634 -104450 -144994 -154985 -116048 -54285
5330e4285K8557m122J1173m682M4427m274j1407n6446l8801J5980K1227M2822
$$ -54285 -25728 -29850 -18677 -23359 21068 16794 5387 -51059 -89860 -73880 -52653 -9831
5318i831J0549J0680M566l508O5638l7436j744k5777j9076R1930j6636o9724p7873
$$ -9831 718 11398 15964 12456 78094 40658 38914 13137 -5939 85991 69355 -369 -78242
5305g8242m2582n592o223K7071M9159K4975l3904K2318R3401P678j766J6353k1637
$$ -78242 -120824 -126416 -132639 -105568 -56409 -31434 -65338 -43020 50381 58059 56293 72646 51009
5292E1009L4151J1501m7003J1565K5975l5806l0407K0653j5173j4818N839L6262
$$ 51009 85160 96661 49658 61223 87198 51392 20985 41638 26465 11647 17486 53748
5280E3748r1930l6867Q8303O805K0748O6439J8267j1263o0282n1347L4139j7389
$$ 53748 -38182 -75049 13254 20059 40807 107246 125513 114250 53968 2621 36760 19371
5268A9371j6900k2737k6313k7166p1M1538O063n9568J6453M8384M047j06752m9716
$$ 19371 2471 -20266 -46579 -73745 -73816 -32278 -26215 -85783 -69330 -20946 -16899 -123651 -173367
5255a73367M0317O6747O3200P3702Q833k8785m2476J6531K405m5687m2201L3881
$$ -173367 -133050 -66303 -3103 70599 79432 50647 8171 24702 27107 -18580 -60781 -26900
5243b6900M5213K2816p004l3853m804M4042M7816M5188j9650q5541m9902j7344
$$ -26900 18313 41129 34125 272 -4532 39510 87326 132514 112864 27323 -22579 -39923
5231c9923M8523m309k6907J2049O552J623J115j3236J5362L835n5334K1992J3761
$$ -39923 8600 4291 -22616 -10567 -4015 -2392 -1277 -14513 849 4684 -50650 -28658 -14897
5218a4897n4796l4209M0732N1727K0199n3844n8063L6458N5773l9432k1447L7478
$$ -14897 -69693 -103902 -63170 -11443 8756 -45088 -103151 -66693 -10920 -50352 -71799 -34321
5206c4321J5104J2240k3463l0711j2615J6402l7459J5386J6965K1982Q213l4834
$$ -34321 -19217 -6977 -30440 -61151 -73766 -57364 -94823 -79437 -62472 -40490 -32277 -67111
5194f7111J5965N0553m5988j1741m7664j1261P9966N6546L7057N4321K193k9411
$$ -67111 -51146 -593 -46581 -58322 -105986 -117247 -37281 19265 56322 110643 112836 83425
5182H3425j0559p5448j9854p0720K9521J1649K6902m4736p3114k4735J7345k102
$$ 83425 72866 -2582 -22436 -93156 -63635 -51986 -25084 -69820 -142934 -167669 -150324 -152426
5170a52426N5896J750l3505m7084L9424K7178j2712J1641L8894P0658L7905L8315
$$ -152426 -96530 -94780 -128285 -175369 -135945 -108767 -121479 -109838 -70944 -286 37619 75934
5158G5934q197j00368n2345L7298j2573k5536j8702r864M5747Q2795l6815p9495
$$ 75934 67737 -32631 -84976 -47678 -60251 -85787 -104489 -114353 -68606 14189 -22626 -102121
5146a02121K1953M9759O6135K1240l3049O7080l6713r0762m1994j3041J14714
$$ -102121 -80168 -30409 35726 56966 23917 90997 54284 -36478 -78472 -91513 23201
5135B3201N4633k2776L1092m7564K828N4495k0690k123m487n6014l7735l5585
$$ 23201 77834 55058 86150 38586 41414 95909 75219 73096 68609 12595 -25140 -60725
5123f0725n39J8617l8025L3528N5820k77n2260k1374J6049M3092l1017j3760N0952
$$ -60725 -61264 -42647 -80672 -47144 8676 8399 -43861 -65235 -49186 -6094 -37111 -50871 81
5110H1N0624L3613n5458j9338p620p476N3180M5669p2446n9033J0894k8113m7723
$$ 81 50705 84318 28860 9522 1902 -5574 47606 93275 20829 -38204 -27310 -55423 -103146
5097a03146P2361O1572L351n2624l613M6635J9014m9423o0292l0904P2897O6136
$$ -103146 -30785 30787 34138 -18486 -22099 24536 43550 -5873 -66165 -97069 -24172 41964
5085D1964J2371n6729k6380J5520p9580j2186K8756P441m1438k4850O7938J8101
$$ 41964 54335 -2394 -28774 -13254 -92834 -105020 -76264 -68823 -110261 -135111 -67173 -49072
5073d9072j4178J951P9418K3982k7172n5195p7153j7047N6607M3990m6002K1340
$$ -49072 -63250 -61299 18119 42101 14929 -40266 -117419 -134466 -77859 -33869 -79871 -58531
5061e8531K8472K0948j8725m8235L5477J10581J9986l6845l0079o935r641o6848
$$ -58531 -30059 -9111 -27836 -76071 -40594 69987 89973 53128 23049 16114 6473 -60375
5049f0375k4517J28020Q3974k0635n0839o9769k3832j4420R1027J1691p8507M1452
$$ -60375 -84892 43128 127102 106467 55628 -14141 -37973 -52393 38634 50325 -28182 13270
5037A3270M498n9287R023M9794Q9066L1103j9727r2245o7386o4754j7267Q5304
$$ 13270 17768 -41519 -32496 17298 106364 137467 117740 25495 -41891 -106645 -123912 -38608
5025c8608M0617N0154k4727j1800K4057k8162k3312K4206M07k591K1830k0293
$$ -38608 2009 52163 27436 15636 39693 11531 -11781 12425 12832 10241 32071 11778
5013A1778K873M2302j18771j5411K6234m2841q1507j818J08401M6754n386r104
$$ 11778 14651 56953 -61818 -77229 -50995 -93836 -175343 -177161 -68760 -22006 -27392 -36496
5001c6496m2681K2372O7647m1600j0714O2579K4687J9252N841m0505M39L4697
$$ -36496 -79177 -56805 10842 -30758 -41472 21107 45794 65046 70887 30382 30821 65518
4989F5518r223k1437J2529k9606J1485n378J5745j465o3095k1102J3248K359k1748
$$ 65518 56295 34858 47387 17781 29266 23888 39633 38168 -24927 -46029 -32781 -30422 -52170
4976e2170m6572k7817j904j5823J4176K1838K584P4194K2914j0496J4453l7177
$$ -52170 -98742 -126559 -128463 -144286 -130110 -108272 -105688 -31494 -8580 -19076 -4623 -41800
4964d1800q4889J7954J10553K9888l3228J3637J453n2126n9717m647N85J8824
$$ -41800 -126689 -108735 1818 31706 -1522 12115 13568 -38558 -98275 -102922 -102337 -83513
4952h3513L5927O2124J4136r542l03M540J6607P417p1633l445J7033L2988l1148
$$ -83513 -47586 14538 28674 19132 18829 23369 39976 47393 -24240 -27685 -10652 22336 -8812
4939h812J9056R7747K7999j35255l3189j0431J1299L8913o170J5254l1050q7135
$$ -8812 10244 107991 135990 735 -32454 -42885 -31586 7327 1157 16411 -14639 -101774
4927a01774P5254O1957p5j9554M700M813m6245q2002R379M3038l9913j9718N1541
$$ -101774 -26520 35437 35362 15808 20508 25321 -20924 -102926 -93547 -50509 -90422 -110140 -58599
4914e8599O6354l805L9380K5219j4182l5224j11988m4173J29768N2919n016p9214
$$ -58599 7755 3950 43330 68549 54367 19143 -92845 -137018 -7250 45669 40653 -38561
4902c8561n1404M1488P4299p1628m6066Q744K2795L3823j3641K6463n9525L255
$$ -38561 -89965 -48477 25822 -45806 -91872 -83128 -60333 -26510 -40151 -13688 -73213 -69958
4890f9958M67n7319L4593P5614P8707K2486l0480j30736n585J6115L0155j4297
$$ -69958 -69491 -126810 -92217 -16603 62104 84590 54110 -76626 -82211 -66096 -35941 -50238
4878e0238o254r699J177K1369j5360l8612K0409l3571K550r2452N4088P0039N6111
$$ -50238 -56492 -66191 -65014 -43645 -59005 -97617 -77208 -110779 -108229 -200681 -146593 -76554 -20443
4865b0443J5325j1798m594r6542Q256K4453l2227k4489O6163J07938K1395q1148
$$ -20443 -5118 -16916 -21510 -118052 -109796 -85343 -117570 -142059 -75896 32042 53437 -27711
4853b7711n0013N1817N8382R76r87k6843J337K8473k7244k9909P3473N5877o1948
$$ -27711 -77724 -25907 32475 33451 32464 5621 6958 35431 8187 -21722 51751 107628 45680
4840D5680l6605n3881K6000L6299L5217r0334l7319M1751M6084q864L5100L5126
$$ 45680 9075 -44806 -18806 17493 52710 -37624 -74943 -33192 12892 4028 39128 74254
4828G4254l5977j8747J4912n1897l4954k646Q689j3204o2547L2044k0440m8935
$$ 74254 38277 19530 34442 -17455 -52409 -55055 -46366 -59570 -122117 -90073 -110513 -159448
4816a59448l6466Q8136Q6074P509n435m193N583N3585M5254j6761J2185j9640
$$ -159448 -195914 -107778 -21704 -14195 -19630 -23823 -18240 35345 80599 63838 76023 56383
4804E6383m5326k1292j1527j1081J0298k8795o208J5053K2117L5029O2247N4755
$$ 56383 11057 -10235 -21762 -32843 -22545 -51340 -57548 -42495 -20378 14651 76898 131653
4792A31653k0157p1267n221K307l7687k2124O4890r240k4010J0522q1992L69K0756
$$ 131653 111496 40229 35008 37315 -372 -22496 42394 33154 9144 19666 -62326 -61957 -41201
4779d1201p717L9413L2508l6355K8085n8732q1328J3252L4581j3188L6366P3548
$$ -41201 -48918 -9505 23003 -13352 14733 -43999 -125327 -112075 -77494 -90682 -54316 19232
4767A9232j8054n1354l275j2865N562k8395L71k4475k5916J9286L3632j0068J27171
$$ 19232 1178 -50176 -53451 -66316 -60754 -89149 -88778 -113253 -139169 -119883 -86251 -96319 30852
4754C0852K457Q790M3492j6354r5243p0903J6621L4716M7767K5491l3283m0867
$$ 30852 33309 42099 85591 69237 -26006 -96909 -80288 -45572 2195 27686 -5597 -46464
4742d6464M068l2780p7699J7022L731R9418O9540L5688j5069j9732J9796k5055
$$ -46464 -42396 -75176 -152875 -135853 -132122 -32704 36836 72524 57455 37723 57519 32464
4730C2464m433n4747j5813k2899j3223M7323J205J3661N0322M8625k3030j16368
$$ 32464 28031 -26716 -42529 -65428 -78651 -31328 -30123 -16462 33860 82485 59455 -56913
4718e6913p9484m7672J2888K9287L6395J8004j6769J7072M7363L6104n2300J1614
$$ -56913 -136397 -184069 -171181 -141894 -105499 -87495 -104264 -87192 -39829 -3725 -56025 -44411
4706d4411J9913l930l1550O0029K4670k7807J064K8247k4875k2561N4902K4005
$$ -44411 -24498 -28428 -59978 51 24721 -3086 -2022 26225 1350 -21211 33691 57696
4694E7696J0611n2001n0446m5880m532J00927K964j3330l4896K2769j9473m3756
$$ 57696 68307 16306 -34140 -80020 -84552 16375 19339 6009 -28887 -6118 -25591 -69347
4682f9347o1883L3230O8439O799J9120l1874k6954L87q842J2929J3952k8123l2312
$$ -69347 -131230 -98000 -29561 -22762 -3642 -35516 -62470 -62083 -70925 -57996 -44044 -72167 -104479
4669a04479K3083K4847p1615q7602J7791J29906l2600R455O0080L166m0606Q759
$$ -104479 -81396 -56549 -128164 -215766 -197975 -68069 -100669 -91214 -31134 -27968 -68574 -59815
4657e9815P101Q145l9233o3871K4226L7535L3964k7383o4519n636R9034N5628
$$ -59815 -52714 -44569 -83802 -147673 -123447 -85912 -51948 -79331 -143850 -149486 -50452 5176
4645E176l507j4833q286L1988J3927m597m4515l3293L4225J1689K7590J4655R582
$$ 5176 1669 -13164 -21450 10538 24465 19868 -24647 -57940 -23715 -12026 15564 30219 39801
4632C9801m4170m457n2185P5562P5548L2990k6991r1898m695O912k9391J4015
$$ 39801 -4369 -8826 -61011 14551 90099 123089 96098 4200 -495 6417 -22974 -8959
4620h959P221m0838J0077P6601J7681O394m5049n8986m2054p174j6359P0460Q8713
$$ -8959 -1738 -42576 -32499 44102 61783 68177 23128 -35858 -77912 -85086 -101445 -30985 57728
4607E7728m6549l0435m5783n0736M3732L0960K1750K8685k8890m8162J5333N7296
$$ 57728 11179 -19256 -65039 -115775 -72043 -41083 -19333 9352 -19538 -67700 -52367 4929
4595D929K1713N5100n8241K743q227O4506r352r2673n8556M2163N877K868n5170
$$ 4929 26642 81742 23501 26244 18017 82523 73171 -19502 -78058 -35895 -30018 -27150 -82320
4582h2320N6869k3460L1094j310n5893k0470J0018k6243l3372j2643Q4775L0932
$$ -82320 -25451 -48911 -17817 -19127 -75020 -95490 -85472 -111715 -145087 -157730 -72955 -42023
4570d2023M4286J6431j68j2233j2440N5161k3669o0584J8427N8376O8804l9186
$$ -42023 2263 18694 18526 6293 -6147 49014 25345 -35239 -16812 41564 110368 71182
4558G1182j3709j2654o224K9059r014j4156M6621o3230m552J9657m2283J1292
$$ 71182 57473 44819 38595 67654 58640 44484 91105 27875 23323 42980 697 11989
4546A1989j9795p010J3216j2487K3974O635L3820j4135l1430m2562k005k8765
$$ 11989 -7806 -14816 -1600 -14087 9887 16522 50342 36207 4777 -37785 -39790 -68555
4534f8555k2511j3532J5521O3916p177k5183j4270r732J7481K3153J2966k2714
$$ -68555 -91066 -104598 -89077 -25161 -32338 -57521 -71791 -81523 -64042 -40889 -27923 -50637
4522e0637j2523j0856P12k6472l2629L2185M7372J1759o618R351K0067N1623r830
$$ -50637 -63160 -74016 -73304 -99776 -132405 -100220 -52848 -41089 -47707 -38356 -18289 33334 23504
4509B3504j1067n0857k5504O0977J0425J1938l2728J8865r2921L7316N0519k8492
$$ 23504 12437 -38420 -63924 -2947 7478 19416 -13312 5553 -87368 -50052 467 -28025
4497b8025k2206K3931j1726n0318J7520L281k527K3146l0050k4457M8092L7603
$$ -28025 -50231 -26300 -38026 -88344 -70824 -67543 -70070 -46924 -76974 -101431 -53339 -15736
4485a5736L4295j481r348p5385j1944L9824Q691l0915j3602M0629O3639j7147
$$ -15736 18559 17078 7730 -67655 -79599 -39775 -31084 -61999 -75601 -34972 28667 11520
4473A1520J7891j305P6375n746K9394N9249j7839o3401o583k7885n3434l7775
$$ 11520 29411 28106 104481 98735 128129 187378 169539 106138 99555 71670 18236 -19539
4461a9539M113r040l9378o0151n8322J016P0675k4211K1348R5233L302K257M415
$$ -19539 -15426 -24466 -63844 -123995 -182317 -181301 -110626 -134837 -113489 -18256 -14954 -12697 -8282
4448h282M3079l5224q8871P5210J01737n0055n7235N7134M4893K6327o7339n9661
$$ -8282 34797 -427 -89298 -14088 87649 37594 -19641 37493 82386 108713 41374 -18287
4436a8287k3520J7702L10J4002m3048L3591O1396q5940r879O9673L4936n6598
$$ -18287 -41807 -24105 -23795 -9793 -52841 -19250 42146 -43794 -53673 16000 50936 -5662
4424e662L2550j2467n9678m5959k7159L2639P1416l4850M0751L4620n3093l0519
$$ -5662 26888 14421 -45257 -91216 -118375 -85736 -14320 -49170 -8419 26201 -26892 -57411
4412e7411N8840p404o2419K8651N7217m638M3070J9636J7659L607J4967k7935
$$ -57411 1429 -5975 -68394 -39743 17474 12836 55906 75542 93201 96808 111775 83840
4400H3840m2860Q522l5528K3434k8294n0979L1125m9544k5857k1416J0225L6333
$$ 83840 40980 49502 13974 37408 9114 -41865 -10740 -60284 -86141 -107557 -97332 -60999
4388f0999L8958P09p4894j575M3556M9223M3847n1027K6109K71J6541K6592p078
$$ -60999 -22041 -21332 -96226 -97801 -54245 -5022 38825 -12202 13907 14178 30719 57311 50233
4375E0233J6241m0396n6187m1948K2998k1131L5514J347k2518M5205K5786j2829
$$ 50233 66474 26078 -30109 -72057 -49059 -70190 -34676 -33329 -55847 -10642 15144 2315
4363B315j3532l5714o539J0789L9796L5846p466K4622K1629m9005j64l152j14165
$$ 2315 -11217 -46931 -53470 -42681 -2885 32961 25495 50117 71746 22741 22577 19425 -94740
4350i4740o9784O3254M7940N150j5702J7069j9056R048J7732L6582J083K5651
$$ -94740 -164524 -101270 -53330 -48180 -63882 -46813 -65869 -56821 -39089 -2507 -1424 24227
4338B4227o498j9756j3106m0920l8807m194M1435k4732Q8884J00536K2544J0268
$$ 24227 17729 -2027 -15133 -56053 -94860 -99054 -57619 -82351 6533 107069 129613 139881
4326A39881j06058j44063L8384O0959O0096j3445m8344j5417K7670l5112o0180
$$ 139881 33823 -110240 -71856 -10897 49199 35754 -12590 -28007 -337 -35449 -95629
4315i5629k750m0490q258L3672l219k2833k2594N5826K7356J0201P3319j2755
$$ -95629 -98379 -138869 -147127 -113455 -116674 -139507 -162101 -106275 -78919 -68718 4601 -8154
4303h154K2272m3354J9812J9081J4644k5314m2215O9569J9465j1587P291L6336
$$ -8154 14118 -29236 -9424 9657 24301 -1013 -43228 26341 45806 34219 41510 77846
4291G7846q7099o2694l0274M3342K6019j053j399J6097J1746l4094l3218l3394
$$ 77846 -9253 -71947 -102221 -58879 -32860 -33913 -35312 -19215 -7469 -41563 -74781 -108175
4279a08175M3427K2278j5932j3768M4856P3454l451n0872j1279L5902k7398r662
$$ -108175 -64748 -42470 -58402 -72170 -27314 46140 42689 -8183 -19462 16440 -10958 -20620
4267b0620N7365L0536P2152J3270r6245j09167o631L3364l2094L0394j6532n6997
$$ -20620 36745 67281 139433 152703 56458 -52709 -59340 -25976 -58070 -27676 -44208 -101205
4255a01205n491J1204m245M6658M8167k72M8186n8150l7402L006L090Q32J0053
$$ -101205 -106696 -95492 -99737 -53079 -4912 -5184 43002 -15148 -52550 -49544 -46454 -45622 -35569
4242c5569M4154l2223J0197l2129L8838P4218q2679p300L8743k6354j4861l1777
$$ -35569 8585 -23638 -13441 -45570 -6732 67486 -15193 -22493 16250 -10104 -24965 -56742
4230e6742k0942K0286l1955k773L1590m856J6134n093L6115r362O6292L6728J071
$$ -56742 -77684 -57398 -89353 -92126 -60536 -65392 -49258 -54351 -18236 -27598 38694 75422 76493
4217G6493m2467O207k0597j0892r182L105P0332j7060N760r885k9264K7317m075
$$ 76493 34026 40233 19636 8744 -438 2667 72999 55939 61699 51814 22550 49867 45792
4204D5792k7941j1622q245m4251n641L8880R7554k6951k0402j9926l6436L9712
$$ 45792 17851 6229 -2016 -46267 -51908 -13028 84526 57575 37173 17247 -19189 20523
4192B0523K3570j7235k0985q141L0810k0122n7388l4740L3569J1851n0380j1501
$$ 20523 44093 26858 5873 -2268 28542 8420 -48968 -83708 -50139 -38288 -88668 -100169
4180a00169M4788J2022J5344K7282J1417J0003K5922M561j1465n746J4903J9215
$$ -100169 -55381 -43359 -28015 -733 10684 20687 46609 51170 39705 33959 48862 68077
4168F8077J5149l9264q0260o7201n2935O8746K6146j3525M799o2032N515P9404
$$ 68077 83226 43962 -36298 -103499 -156434 -87688 -61542 -75067 -70268 -132300 -126785 -47381
4156d7381N0578j5101l2153J3132m6744J406J3134J675n9194K5563k165K579L2097
$$ -47381 3197 -11904 -44057 -30925 -77669 -76263 -63129 -61454 -120648 -95085 -97250 -94671 -62574
4143f2574J5084K4568J2305j5622J4059J1849L3595o2894n1739k4462K5092j3064
$$ -62574 -47490 -22922 -10617 -26239 -12180 -331 33264 -29630 -81369 -105831 -80739 -93803
4131i3803Q67N740k1390l1864K8714J9646J0061L2462q091M9856k1896r4297k6612
$$ -93803 -92936 -87196 -108586 -140450 -111736 -92090 -82029 -49567 -57658 -7802 -29698 -123995 -150607
4118a50607N0524J178P2478Q2883K989j3562k0129J6607m093j6639L1592j6675
$$ -150607 -100083 -98905 -26427 56456 59445 45883 25754 42361 38268 21629 53221 36546
4106C6546m7296L3507l3307o0478l8049J2101K6229O389K0478j9870j0319N7514
$$ 36546 -10750 22757 -10550 -71028 -109077 -96976 -70747 -64358 -43880 -63750 -74069 -16555
4094a6555k8045m8136p8051P2608J26350K1964k4982J1532Q847p4918m194L1156
$$ -16555 -44600 -92736 -170787 -98179 28171 50135 25153 36685 45532 -29386 -33580 -2424
4082b424p516j1620K4848P8870K5240p5132n5856j5922N9794J9222o8652j8158
$$ -2424 -9940 -21560 3288 82158 107398 32266 -23590 -39512 20282 39504 -29148 -47306
4070d7306M7812k4682J27j9830j3731j2027R288P1619K6735J7752r634l1837K0266
$$ -47306 506 -24176 -24049 -43879 -57610 -69637 -60349 11270 38005 55757 46123 14286 34552
4057C4552P709K581K1529K5027J4859k9664l3139n8772l6678L1860L4514k1195
$$ 34552 42261 44842 66371 91398 106257 76593 43454 -15318 -51996 -20136 14378 -6817
4045f817q2N51k1572J1724K728m7284O710O6041M4165L1946K0622P548l9285m2256
$$ -6817 -6899 -6348 -27920 -16196 -13468 -60752 -54042 11999 56164 88110 108732 116280 76995 34739
4031C4739k6239m1434P6774L1857j1324m0862Q616l0717j1150L9399k1285j0714
$$ 34739 8500 -32934 43840 75697 64373 23511 32127 1410 -9740 29659 8374 -2340
4019b340O0930K4471k416j883o1177m5410J4970L582q008L7638M1081m383p582
$$ -2340 58590 83061 80645 78762 17585 -27825 -12855 -9273 -17281 20357 61438 57055 49473
4006D9473l6392M868M4401k2742j3702k4514J0579L8296o546n031j1103p77J0489
$$ 49473 13081 17949 62350 39608 25906 1392 11971 50267 43721 38690 27587 26810 37299
3993C7299N128k1792R307J15346P1191J4560m6159o1594m0859k1296N8950J9952
$$ 37299 42427 20635 29942 145288 216479 231039 184880 123286 82427 61131 120081 140033
3981A40033n0101k1666P679K2592Q1049n486j03671o3840J2602m8129n532m3514
$$ 140033 89932 68266 75945 98537 179586 174100 70429 6589 19191 -28938 -34470 -77984
3969g7984l6039M6886N8329L1100N3260q3019Q77k4180l5099l734K8269j5360
$$ -77984 -114023 -67137 -8808 22292 75552 -7467 -6590 -30770 -65869 -69603 -41334 -56694
3957e6694l3121m3682j6830l4288K6578N454Q8674J18966m4157r255n472K2836
$$ -56694 -89815 -133497 -150327 -184615 -158037 -152583 -63909 55057 10900 1645 -3827 19009
3945A9009j4144r409p8401M799L5680j4006l3434J6996N5532k6886r469L6387
$$ 19009 4865 -4544 -82945 -78146 -42466 -56472 -89906 -72910 -17378 -44264 -53733 -17346
3933a7346K8482r736k7188m4179J0462M5209o5961n1190L5033M5109O9548j2317
$$ -17346 11136 1400 -25788 -69967 -59505 -14296 -80257 -131447 -96414 -51305 18243 5926
3921E926k1052J593l3021k8175L1818K7513J0942K1023j9018l556j9264n0959
$$ 5926 -15126 -13533 -46554 -74729 -42911 -15398 -4456 16567 -2451 -6007 -25271 -76230
3909g6230K2469R361m330L6821j7455k4021K6872j7221n5235j039K7424L686N6029
$$ -76230 -53761 -44400 -48730 -11909 -29364 -53385 -26513 -43734 -98969 -100008 -72584 -68898 -12869
3896a2869P2288J9677l1396k7203L866L8270J2532p1761n1558Q5809O1202q2398
$$ -12869 59419 79096 47700 20497 24363 62633 75165 3404 -48154 37655 98857 16459
3884A6459m6152k0502K6546p193n3357K4448n2269n475R205J2205J541P188m4597
$$ 16459 -29693 -50195 -23649 -30842 -84199 -59751 -112020 -117495 -108290 -96085 -94544 -87356 -131953
3871a31953q386J13146J3012l3932K0741J220k8516J5685K3054l2905j4712P2682
$$ -131953 -140339 -27193 -14181 -48113 -27372 -26152 -54668 -38983 -15929 -48834 -63546 9136
3859I136J7010m2537J9706K6475j2006r577k7856L1992N945m067J8187K2534j2765
$$ 9136 26146 -16391 3315 29790 17784 8207 -19649 12343 18288 14221 32408 54942 42177
3846D2177K3260l4033l6559L8584N3980Q169l1455m3260m4891l6339j789Q765
$$ 42177 65437 31404 -5155 33429 87409 95578 64123 20863 -24028 -60367 -62156 -53391
3834e3391K0941K5492J1619m0765M9680O0120m5185m4972J8177j5935l0469j9881
$$ -53391 -32450 -6958 4661 -36104 13576 73696 28511 -16461 1716 -14219 -44688 -64569
3822f4569j223J6353k3951L0168O4631n182j808j5540M1049k0247n8759J5937
$$ -64569 -65792 -49439 -73390 -43222 21409 16227 14419 -1121 39928 19681 -39078 -23141
3810b3141j3885m0281J20047L9723p3874m0836M2053k2294K7567K185j9504r6517
$$ -23141 -37026 -77307 42740 82463 8589 -32247 9806 -12488 15079 17264 -2240 -98757
3798i8757o0245J1019Q2125N9279Q2883O9699m6701l4626k486k4462j6315j6211
$$ -98757 -159002 -147983 -65858 -6579 76304 146003 99302 64676 62190 37728 21413 5202
3786E202J7759o1528j2721J4350j3032J6144k9256l7717L0801n702P9323O0134
$$ 5202 22961 -38567 -51288 -36938 -49970 -33826 -63082 -100799 -69998 -75700 3623 63757
3774F3757l2265m179N9160l549l5199o1626l5234o7073J7416L213l0112J2970
$$ 63757 31492 27313 86473 82924 47725 -13901 -49135 -116208 -98792 -95579 -125691 -112721
3762a12721J6361J3135N7061N6695r591m0644k5157L4028J5501j0694k6119J9878
$$ -112721 -96360 -83225 -26164 30531 20940 -19704 -44861 -10833 4668 -6026 -32145 -12267
3750a2267J1772J6007j0283J2353k5240l3282l1872j9314l1088J4187O3841M7734
$$ -12267 -495 15512 5229 17582 -7658 -40940 -72812 -92126 -123214 -109027 -45186 2548
3738B548N7260p3566m4846j7979k7784k9473R0058L4049k4l9571L4523n751K702
$$ 2548 59808 -13758 -58604 -76583 -104367 -133840 -43782 -9733 -9757 -49328 -14805 -20556 -17854
3725a7854M4659L2867n4521n6810J3829M1076j7571M1941M6288J8911J2365n0543
$$ -17854 26805 59672 5151 -51659 -37830 3246 -14325 27616 73904 92815 105180 54637
3713E4637m4527L7707L1617l2746l6349k459J2847L256l2065J9211K2902q108
$$ 54637 10110 47817 79434 46688 10339 7880 20727 23983 -8082 11129 34031 25923
3701B5923K5994L5696J7076j4426o5941K9573K4970L9725K8350q2098O742J4474
$$ 25923 51917 87613 104689 90263 24322 53895 78865 118590 146940 64842 71584 86058
3689H6058q723p1046k710j3625j8554L8461J8843J6424J819r606p4168n0200K5166
$$ 86058 77335 6289 3579 -10046 -28600 9861 28704 45128 46947 37341 -36827 -87027 -61861
3676f1861J5498m328j596O8399M8476j1746k8307n4401m4304K0485O715K7862
$$ -61861 -46363 -50691 -52287 16112 64588 52842 24535 -29866 -74170 -53685 -46970 -19108
3664a9108j2661l3314R709N0668L8286m1815m3792N6906m8096j2425R2909o630
$$ -19108 -31769 -65083 -55374 -4706 33580 -8235 -52027 4879 -43217 -55642 37267 30637
3652C0637k3153q8489m9939n31l72J2992k8802J4820L7672m0311Q5206P1867j6017
$$ 30637 7484 -81005 -130944 -131475 -131847 -118855 -147657 -132837 -95165 -135476 -50270 21597 5580
3639E580o42j621L832N5553L4922k4107j06644o0639q337L8735L5276M2417n0673
$$ 5580 4938 3317 7149 62702 97624 73517 -33127 -93766 -102103 -63368 -28092 14325 -36348
3626c6348r6666L5836N3320M2929n8954K4942P5540j2229n1912L7713M9776m1954
$$ -36348 -133014 -97178 -43858 -929 -59883 -34941 40599 28370 -23542 14171 63947 21993
3614B1993l4067J3083J492k2963m5451p6210M7659M2140J1486K0073N113l5210
$$ 21993 -12074 1009 2501 -20462 -65913 -142123 -94464 -52324 -40838 -20765 -15652 -50862
3602e0862O0740L0581k8819j7599k1777m1512L3379N3435l8429L0266l1445j6712
$$ -50862 9878 40459 11640 -5959 -27736 -69248 -35869 17566 -20863 9403 -22042 -38754
3590c8754J2405J3958j0264N4369j4487n4086n3184N3534J9938j9323q4982o3730
$$ -38754 -26349 -12391 -22655 31714 17227 -36859 -90043 -36509 -16571 -35894 -120876 -184606
3578a84606j2323J28764O0332r978m6736L6110Q4782p448n2352n9443p8576K07
$$ -184606 -196929 -68165 -7833 -17811 -64547 -28437 56345 48897 -3455 -62898 -141474 -141267
3566a41267L5589k2647m3548k5056J7403O7806P3805K258m5388J3237P0623j791
$$ -141267 -105678 -128325 -171873 -196929 -179526 -111720 -37915 -35657 -81045 -67808 2815 1024
3554A024q416k2373m9814L4327M1045l274l549L0623L6310l5613k4930k8197n97
$$ 1024 -7392 -29765 -79579 -45252 -4207 -7481 -11030 19593 55903 20290 -4640 -32837 -33434
3541c3434m7701j1989k609K5022K5380M2553J0658j2116m9565L8855M3776J8774
$$ -33434 -81135 -93124 -95733 -70711 -45331 -2778 7880 -4236 -53801 -14946 28830 47604
3529D7604K628K3565q865O7621M696p396k8661n0589J8079J4026m8298l2979l5881
$$ 47604 50232 73797 64932 132553 137249 129853 101192 50603 68682 82708 34410 1431 -34450
3516c4450o1132o5675k4266P1567L0439j3132L6033j9784L7677L062m9922n5464
$$ -34450 -95582 -161257 -185523 -113956 -83517 -96649 -60616 -80400 -42723 -39661 -89583 -145047
3504a45047l817L1048J4997P6573N1445M8225n1562l0787M5630j2227l0148j9592
$$ -145047 -148864 -117816 -102819 -26246 25199 73424 21862 -8925 36705 24478 -5670 -25262
3492b5262l3876j6697j2165J2199L4139m1604M4579Q270M1439J9543p8940m9993
$$ -25262 -59138 -75835 -88000 -75801 -41662 -83266 -38687 -30417 11022 30565 -48375 -98368
3480i8368Q0119J5108k6552k7618N079O953M7949M8335J7518J7661K7689l8382
$$ -98368 -18249 -3141 -29693 -57311 -52232 -45279 2670 51005 68523 86184 113873 75491
3468G5491l6584l4605J9623j3169q2275j7369L7711K7130J0761K7181n4478L4973
$$ 75491 38907 4302 23925 10756 -71519 -88888 -51177 -24047 -13286 13895 -40583 -5610
3456e610K260j5124j2810n7908m7086O0055j2148J331M9891p6463j0412Q2952
$$ -5610 -3350 -18474 -31284 -89192 -136278 -76223 -88371 -87040 -37149 -113612 -124024 -41072
3444d1072O9817N5990j8174j2510k639o5347K0734N7734l9350j2714N1150j5458
$$ -41072 28745 84735 66561 54051 51412 -13935 6799 64533 25183 12469 63619 48161
3432D8161n796q2608m4438m539N8406l881M3867n2486l192K9865o156L9971k9869
$$ 48161 42365 -40243 -84681 -89220 -30814 -34695 9172 -43314 -46506 -16641 -22797 17174 -12695
3419a2695j2735M7852n4750m5249J5294J6835K5158O2661k6171q2095q04k8533
$$ -12695 -25430 22422 -32328 -77577 -62283 -45448 -20290 42371 16200 -65895 -66699 -95232
3407i5232R049N5306J754k290q255R717M9111k9344o69K890j1286P982j7023l4125
$$ -95232 -86183 -30877 -29123 -31413 -39668 -29951 19160 -10184 -10853 -7963 -19249 -11267 -28290 -62415
3393f2415j4119L8269J3869N7719N4106n1266o9663l2273k9339J1O8916Q0453
$$ -62415 -76534 -38265 -24396 33323 87429 36163 -33500 -65773 -95112 -95101 -26185 54268
3381E4268j7541p0814K2735l445k6892n7450M7165L7203K1032K7044q6024q244
$$ 54268 36727 -34087 -11352 -14797 -41689 -99139 -51974 -14771 6261 33305 -52719 -60963
3369f0963L9338K5434J2452j8993J1512m7165R119L5577o200m5801L2828L4269
$$ -60963 -21625 3809 16261 -2732 8780 -38385 -29266 6311 111 -45690 -12862 21407
3357B1407L73M929k7128K8401Q9181J9471l584j5646O3511M8178p1789j17628
$$ 21407 21780 26709 -419 27982 117163 136634 133050 117404 180915 229093 157304 39676
3345C9676p0429L3723L294k7199l0161j0069J0338r735J2354Q523J4643M4960
$$ 39676 -30753 2970 6264 -20935 -51096 -61165 -50827 -60562 -48208 -39685 -25042 19918
3333A9918K5756l781o2639o8855M8973J9136N7613N7008l1035r225N377n5370
$$ 19918 45674 41893 -20746 -89601 -40628 -21492 36121 93129 62094 52869 58246 2876
3321B876l8490q1O7873M7992o5388m7494k5869K6161K3434L5994O503j0321N0289
$$ 2876 -35614 -35695 32178 80170 14782 -32712 -58581 -32420 -8986 27008 33511 23190 73479
3308G3479J0212K7045m2112j2018L4035m5628j4837n1938K1016J2496K1288K686
$$ 73479 83691 110736 68624 56606 90641 45013 30176 -21762 -746 11750 33038 35724
3296C5724k3754k8549p9899p801N9713J8622Q0879Q7278p5088o471M5035k5044
$$ 35724 11970 -16579 -96478 -104279 -44566 -25944 54935 142213 67125 60654 105689 80645
3284H0645J6480l9773m1046o237l5116m1903J7564M7551M8519q7752R182J8002
$$ 80645 97125 57352 16306 10069 -25047 -66950 -49386 -1835 46684 -41068 -31886 -13884
3272a3884O4856r410O199J0477k703R609L3559j4626l1831j12783J1424J0594
$$ -13884 50972 41562 47761 58238 55535 65144 98703 84077 52246 -60537 -49113 -38519
3260c8519L9961K8264J6197m1140n1041K5754M5196P99O4954J8809q4830m5576
$$ -38519 1442 29706 45903 4763 -46278 -20524 24672 25471 90425 109234 24404 -21172
3248b1172q925M4577M3680K3782m7333M130k7991j6717K6334K229J1175K7757
$$ -21172 -30097 14480 58160 81942 34609 38739 10748 -5969 20365 22594 33769 61526
3236F1526n2987p0661J8978J7580K8126Q667K400O4339J3315O264l4176o9709
$$ 61526 8539 -62122 -43144 -25564 2562 11229 13629 77968 91283 97547 63371 -6338
3224f338n5965P029k9845L5849K8361m2797k6887J4972j6349K7798j1504P4223
$$ -6338 -62303 -55274 -85119 -49270 -20909 -63706 -90593 -75621 -91970 -64172 -75676 -1453
3212a453J38462L6143q1728r4648j531l1574k8213n0403l8234N2151N0197J8028
$$ -1453 137009 173152 91424 -3224 -4755 -36329 -64542 -114945 -153179 -101028 -50831 -32803
3200c2803O3624P0857o7077p5149l5971M737o9269q3P0914J4530m3515M991K1899
$$ -32803 30821 101678 34601 -40548 -76519 -71782 -141051 -141134 -70220 -55690 -99205 -94214 -72315
3187g2315L3346Q9809M3354J4487M256M4865q8488n0116K0870k4243L6280K9009
$$ -72315 -38969 50840 94194 108681 112937 157802 69314 19198 40068 15825 52105 81114
3175H1114n5230m7658M6444m480K2840J2697q740k8111k902p3472M109k7419L1214
$$ 81114 25884 -21774 24670 20190 43030 55727 46987 18876 15974 -57498 -53389 -80808 -49594
$$ [...]
##END NTUPLES=NMR SPECTRUM
##END=
