##TITLE=Analysis number 328065
Compound Code mo 08033
Book Reference 510/38
Project Code adrs
Chemist Name jimp
##JCAMPDX= 6.0         $$ Bruker NMR JCAMP-DX V2.0
##DATA TYPE= NMR SPECTRUM
##DATA CLASS= NTUPLES
##ORIGIN= Bruker BioSpin GmbH
##OWNER= nmr
$$ XWIN-NMR		Version 3.5
$$ Mon Apr 30 13:46:51 2007 GMT Daylight Time (UT+1h)  MAYBRIDGE\nmr@NMR_250MHZ
##.OBSERVE FREQUENCY= 250.131544655141
##.OBSERVE NUCLEUS= ^1H
##.ACQUISITION MODE= SIMULTANEOUS (DQD)
##.ACQUISITION SCHEME= undefined
##.AVERAGES= 16
##.DIGITISER RES= 18
##SPECTROMETER/DATA SYSTEM= dpx250
##.PULSE SEQUENCE= zg30
##.SOLVENT NAME= DMSO
##.SHIFT REFERENCE= (INTERNAL, DMSO, 0, 16.522)
##AUDIT TRAIL= $$ (NUMBER, WHEN, WHO, WHERE, WHAT)
$$ ##TITLE= Audit trail, XWIN-NMR		Version 3.5
$$ ##JCAMPDX= 5.01
$$ ##ORIGIN= Bruker BioSpin GmbH
$$ ##OWNER= nmr
$$ C:\u/data/dgb/nmr/ADRS/3340/pdata/1/auditp.txt
$$ ##AUDIT TRAIL=  $$ (NUMBER, WHEN, WHO, WHERE, WHAT)
(   1,<2007-04-30 13:46:19.92 +100>,<MAYBRIDGE\nmr>,<NMR_250MHZ>,
      <created by zg, POWCHK disabled, PULCHK disabled
       configuration hash MD5:
       76 6E 9A 78 1E 09 19 81 EC 84 63 8F B0 6A 59 2D
       data hash MD5: 64K
       7E 6D 5D 16 A4 5B EE 26 76 B8 EF 01 0D 83 53 75>)
(   2,<2007-04-30 13:46:35.83 +100>,<MAYBRIDGE\nmr>,<NMR_250MHZ>,
      <Start of raw data processing
       ef LB = 0.3 FT_mod = 6 PKNL = 1 SI = 32K 
       data hash MD5: 32K
       67 A8 69 15 A1 AD B8 10 50 E2 E6 C9 30 49 2F 2F>)
(   3,<2007-04-30 13:46:39.72 +100>,<MAYBRIDGE\nmr>,<NMR_250MHZ>,
      <apk 
       data hash MD5: 32K
       75 79 86 37 BE 0B 85 DC 00 50 37 A8 38 77 8D 60>)
(   4,<2007-04-30 13:46:41.11 +100>,<MAYBRIDGE\nmr>,<NMR_250MHZ>,
      <abs ABSG = 5 
       data hash MD5: 32K
       55 90 C3 21 18 01 52 C0 E6 EE FE 31 98 07 61 03>)
$$ ##END=
$$ 
$$ hash MD5
$$ 89 C8 E9 3A 4F 42 8C 6E E9 CF 29 03 88 99 E7 47
##$RELAX= 
##$RELAX= 
##$RELAX= 
##$RELAX= 
##$RELAX= 
##$RELAX= 
##$RELAX= 
$$ Bruker specific parameters
$$ --------------------------
##$DU= <C:\u>
##$EXPNO= 3340
##$NAME= <ADRS>
##$PROCNO= 1
##$TYPE= <nmr>
##$USER= <dgb>
##$AMP= (0..31)
100 100 100 100 100 100 100 100 100 100 100 100 100 100 100 100 100 100 
100 100 100 100 100 100 100 100 100 100 100 100 100 100 
##$AQSEQ= 0
##$AQ_mod= 3
##$AUNM= <au_zg>
##$AUTOPOS= <11 >
##$BF1= 250.13
##$BF2= 250.13
##$BF3= 250.13
##$BF4= 250.13
##$BF5= 500.13
##$BF6= 500.13
##$BF7= 500.13
##$BF8= 500.13
##$BYTORDA= 1
##$CFDGTYP= 0
##$CFRGTYP= 5
##$CHEMSTR= <none>
##$CNST= (0..31)
1 1 145 1 1 1 1 1 1 1 1 1 1 1 1 1 1 1 1 1 1 1 1 1 1 1 1 1 1 1 1 1 
##$CPDPRG= <>
##$CPDPRG1= <>
##$CPDPRG2= <>
##$CPDPRG3= <>
##$CPDPRG4= <mlev>
##$CPDPRG5= <mlev>
##$CPDPRG6= <mlev>
##$CPDPRG7= <mlev>
##$CPDPRG8= <mlev>
##$CPDPRGB= <>
##$CPDPRGT= <>
##$D= (0..31)
0 1 0 0 0 0 0 0 0 0.06 0 0 0 0 0 0 0.0002 0 0 0 0 0 0 0 0 0 0 0 0 0 0 
0 
##$DATE= 1177937177
##$DBL= (0..7)
120 120 120 120 120 120 120 120 
##$DBP= (0..7)
150 150 150 150 150 150 150 150 
##$DBP07= 0
##$DBPNAM0= <>
##$DBPNAM1= <>
$$ [...]
##$SUBNAM6= <"">
##$SUBNAM7= <"">
##$SUBNAM8= <"">
##$SUBNAM9= <"">
##$SW= 20.6930455092707
##$SWIBOX= (0..15)
0 0 3 0 0 0 0 0 0 0 0 0 0 0 0 0 
##$SW_h= 5175.983436853
##$TD= 65536
##$TD0= 1
##$TE= 683.16
##$TE2= 300
##$TE3= 300
##$TEG= 300
##$TL= (0..7)
0 120 120 120 120 120 120 120 
##$TP= (0..7)
150 150 150 150 150 150 150 150 
##$TP07= 0
##$TPNAME0= <>
##$TPNAME1= <>
##$TPNAME2= <>
##$TPNAME3= <>
##$TPNAME4= <>
##$TPNAME5= <>
##$TPNAME6= <>
##$TPNAME7= <>
##$TPOAL= (0..7)
0.5 0.5 0.5 0.5 0.5 0.5 0.5 0.5 
##$TPOFFS= (0..7)
0 0 0 0 0 0 0 0 
##$TUNHIN= 0
##$TUNHOUT= 0
##$TUNXOUT= 0
##$USERA1= <user>
##$USERA2= <user>
##$USERA3= <user>
##$USERA4= <user>
##$USERA5= <user>
##$V9= 5
##$VALIST= <valist>
##$VCLIST= <CCCCCCCCCCCCCCC>
##$VD= 0
##$VDLIST= <DDDDDDDDDDDDDDD>
##$VPLIST= <PPPPPPPPPPPPPPP>
##$VTLIST= <TTTTTTTTTTTTTTT>
##$WBST= 1024
##$WBSW= 4
##$XGAIN= (0..3)
0 0 0 0 
##$XL= 0
##$YL= 0
##$YMAX_a= 313742
##$YMIN_a= -265741
##$ZGOPTNS= <>
##$ZL1= 120
##$ZL2= 120
##$ZL3= 120
##$ZL4= 120
##$ABSF1= 16.522
##$ABSF2= -4.171173
##$ABSG= 5
##$ABSL= 3
##$ALPHA= 0
##$AQORDER= 0
##$ASSFAC= 0
##$ASSFACI= 0
##$ASSFACX= 0
##$ASSWID= 0
##$AUNMP= <proc_1d>
##$AZFE= 0.1
##$AZFW= 0.1
##$BCFW= 0
##$BC_mod= 0
##$BYTORDP= 0
##$COROFFS= 0
##$CY= 12.5
##$DATMOD= 1
##$DC= 0
##$DFILT= <>
##$DTYPP= 0
##$F1P= 14.0000005364418
##$F2P= -0.99999901652339
##$FCOR= 0.5
##$FTSIZE= 32768
##$FT_mod= 6
##$GAMMA= 0
##$GB= 0
##$INTBC= 1
##$INTSCL= 1
##$ISEN= 128
##$LB= 0.3
##$LEV0= 0
##$LPBIN= 0
##$MAXI= 10000
##$MC2= 0
##$MEAN= 0
##$ME_mod= 0
##$MI= 0
##$NCOEF= 0
##$NC_proc= -5
##$NLEV= 6
##$NOISF1= 0
##$NOISF2= 0
##$NSP= 0
##$NTH_PI= 0
##$NZP= 0
##$OFFSET= 16.522
##$PC= 1
##$PHC0= -63.588
##$PHC1= 5.975336
##$PH_mod= 1
##$PKNL= yes
##$PPARMOD= 0
##$PSCAL= 4
##$PSIGN= 0
##$REVERSE= no
##$SF= 250.13
##$SI= 32768
##$SIGF1= 0
##$SIGF2= 0
##$SINO= 400
##$SIOLD= 32768
##$SREGLST= <1H.DMSO>
##$SSB= 0
##$STSI= 32768
##$STSR= 0
##$SW_p= 5175.98343685301
##$SYMM= 0
##$S_DEV= 0
##$TDeff= 65536
##$TDoff= 0
##$TI= <Analysis number 999999
Compound Code 99
Book Reference 9
Project Code 9>
##$TILT= no
##$TM1= 0
##$TM2= 0
##$TOPLEV= 0
##$USERP1= <user>
##$USERP2= <user>
##$USERP3= <user>
##$USERP4= <user>
##$USERP5= <user>
##$WDW= 1
##$XDIM= 32768
##$YMAX_p= 394809845
##$YMIN_p= -474320
$$ End of Bruker specific parameters
$$ ---------------------------------
##NTUPLES= NMR SPECTRUM
##VAR_NAME=  FREQUENCY,     SPECTRUM/REAL,   SPECTRUM/IMAG
##SYMBOL=    X,             R,               I
##VAR_TYPE=  INDEPENDENT,   DEPENDENT,       DEPENDENT
##VAR_FORM=  AFFN,          ASDF,            ASDF
##VAR_DIM=   32768,         32768,           32768
##UNITS=     HZ,            ARBITRARY UNITS, ARBITRARY UNITS
##FACTOR=    0.157963299565203, 1,           1
##FIRST=     4132.6476996994, 0,             0
##LAST=      -1043.33573715361, 0,           0
##MIN=       -1043.33573715361, -474320,     0
##MAX=       4132.6476996994, 394809845,     0
$$ Real data points
##PAGE= N=1
##DATA TABLE= (X++(R..R)), XYDATA
$$ [...]
19972h4319n5421J88921J5483J4201j29241n1851n6123N2627N8204L1930L55l1608
19960d6842j2088n8515Q7403Q6388k0371n3233L0285n4068o6285P6347J10561
19949G9582l8643Q8381l7999k19805j02962K0421M5012O7201J22277q2095j07418
19938a66048p2198n3161R8915Q4748J14926k4698q3277K4490j4908r107j20N3878
19926d6560o6669o6091q00J65628q8425q7696n8838j4657N863J70819K7437K9048
19914c0941L3500N7867J1811M4307p50j49389M3894K4853J29869N3633q7842N771
19902A36583o3659q2164K2312j12194p722P7165J20388o0245K6584K2732k1852
19891E7928k5751l7635o8228J600M872k6687M814J42785j1970q1164K9169K0084
$$ y = [-84319, -139740, 49181, 64664, 78865, -50376, -102227, -158350, -105723, -47519, -15589, -15234, -46842, -58930, -117445, -30042, 56346, 35975, -17258, 13027, -41041, -107326, -30979, 79582, 40939, 129320, 91321, -128484, -231446, -211025, -166013, -98812, 23465, -58630, -166048, -238246, -291407, -192492, -107744, 7182, -17516, -100793, -76303, -91211, -100318, -100438, -46560, -113229, -179320, -180120, -14492, -102917, -190613, -249451, -264108, -258245, -87426, -59989, -30941, 2559, 60426, 72237, 116544, 115794, -33595, 10299, 35152, 165021, 218654, 130812, 136583, 72924, -9240, 13072, -99122, -106844, -29679, 90709, 30464, 57048, 79780, 57928, 32177, -5458, -73686, -72086, -67214, -93901, -89087, 53698, 41728, -39436, -10267, 9817]
19879I817j8903J21264J49802R4776k2817j18660o0494j38731j00798J03733N1493
19868G0482k5730o0393p1500j92139O6101N0782r0093J12845K43481P1148j06847
19857F8137p9635J595L6499O7069p1989n55l4824o1199q1952n8775J5540M5522
19845a54567J4882N1053M1598L801o0066j89031j57943J16423K9654j8396k5292
19834c47884j735J19979J18991Q6453o8583j68502k5689J44717L0020o7634M0732
19823a39135L1090M6331O6368q112J896K8250n1397m4853O484l1863j3820R8794
19811i967j2102o4952J38871K1692O7308Q1789j6570p7727m2619J10513p2054
19800A24182n3794j34775j24469J15309N8140Q7115J4320O5620k367j55906l0101
$$ y = [9817, -9086, 112178, 261980, 356756, 333939, 215279, 154785, 16054, -84744, 18989, 70482, 44752, -15641, -87141, -279280, -213179, -162397, -252490, -139645, 103836, 174984, 68137, -11498, -9903, 26596, 93665, 21676, 21121, -13703, -74902, -156854, -215629, -200089, -154567, -139685, -88632, -47034, -43233, -103299, -292330, -450273, -333850, -304196, -322592, -347884, -349619, -229640, -110649, -24196, -92779, -261281, -286970, -142253, -112233, -179867, -139135, -108045, -61714, 4654, -3458, -1562, 26688, -24709, -69562, -63078, -94941, -108761, -9967, -22069, -87021, 51850, 73542, 140850, 222639, 206069, 128342, 85723, 196236, 124182, 70388, -64387, -188856, -73547, -15407, 71708, 86028, 151648, 149281, -6625, -36726]
19789c6726Q764N9650j8030M1070k7206p7235l94R9748l8198j08541j31300R375
19777b19023K4375J36754J21182M3553L931M5474J92676m909q8079j54450P5789
19766A77273k8095l6901j39966j26003J05682j3011r2176m5837M131r2226J79585
19755a07544P1123J1000N7509k447p4347n7191r1031j2688N9939J68228L3751
19744E6302J4860J3201l1753K6840l1942j3944j00997j43364J6239k4513P6725
19733a42346O7533m3589m5968J10717m9857Q5832r9266l3251q7908m2254J5014
19722b65343J13013J26844M6389j8722J53975J07206j1604r7174r5746M1469n7092
19711D3215j38154L1068j1167j44997q8341n1469J22524J96611N675J09819J16675
$$ y = [-36726, -27962, 31688, 13658, 54728, 27522, -49713, -50107, 49641, 11443, -97098, -228398, -219023, -194648, -57894, 63288, 106841, 110772, 156246, 348922, 344013, 255934, 101484, 177273, 149178, 112277, -27689, -153692, -48010, -61021, -153197, -199034, -194903, -287129, -107544, -36421, -25421, 32088, 29641, -44706, -101897, -192928, -205616, -145677, 22551, 56302, 71162, 84363, 52610, 79450, 47508, 33564, -67433, -210797, -194558, -219071, -142346, -74813, -118402, -164370, -53653, -103510, -17678, -116944, -150195, -238103, -280357, -265343, -152330, -25486, 20903, 2181, 156156, 263362, 251758, 154584, 58838, 100307, 43215, -94939, -63871, -75038, -220035, -308376, -359845, -237321, -40710, -35035, 74784, 191459]
19700A91459p4988j64397n284J6781L7001j01647o8950M7841m7763J12290p5095
19689a32752j87518P5381L1138R5559P026o6574r7713K7361J31819L0694J8813
19678f6766n0460P6137j7337J14415J55274p7452n7839K8177m1270r1907m0460
19667f9488K8035J23245L3778l1863R1153N5910j09320p0933r2708j34978K10087
19656C2918J37387r4412k52685j16891Q1990N8645L7842j1586P4987J37430j1194
19645G4431k3536O0755Q8882j45431j14748J9126n5824k0105J62490j40139j35418
19634b29517o4056J18555J45869j07720q6340J7338O7482P7789j14733j1658K2959
19623a64032J05795R5747J76O9920P3986J0476j29986o2932l8391L1169o2839
$$ y = [191459, 116471, -47926, -53210, -36429, 572, -101075, -170025, -122184, -169947, -57657, -132752, -320270, -244889, -213751, -118192, -111166, -177740, -275453, -248092, -116273, -85579, -66766, -117226, -41089, -58426, 55989, 211263, 133811, 75972, 104149, 62879, -29028, -69488, -41453, 81792, 115570, 83707, 174860, 230770, 121450, 50517, -42191, -177169, 32918, 170305, 75893, -176792, -293683, -211693, -153048, -115206, -126792, -51805, 85625, 74431, 50895, 111650, 200532, 55101, -59647, -40521, -96345, -116450, 46040, -94099, -229517, -293573, -175018, -29149, -136869, -223209, -205871, -138389, -60600, -175333, -186991, -164032, -58237, 37510, 37686, 107606, 181592, 192068, 62082, -850, -39241, -8072, -70911]
19612g0911M7955m7688k744L9284j2546R2458L6490j27158m5904O635p2905l4
19600a57068M0316K7875R3702N5791j82583j61978Q3998Q4213j068j05361k8989
19589b51152M1265n5317k3674P7968K57129J61967l4476n6120k605l8621q4313
19578g949j7791P6018n7635j05101l2223J6709K9250Q4633j52315j12660J00950
19567a78114J14001L7279r5609P7983J9607o2531k6043P0663l8887j09013k5529
19556b16193P0021r233k0672k4412J59404k1124j39879N5054P3148r505L4L3441
19544d9916R0735J3648R7432O60p3251q9424K1653p2401R2955L745j17938M8792
19532c3310M6950p0290j9653n4510j4995o9426M2771J45818J03564M941m5031
$$ y = [-70911, -22956, -70644, -73388, -34104, -46650, 45808, 82298, -44860, -90764, -84129, -157034, -157068, -116752, -88877, 4825, 60616, -121967, -283945, -199947, -115734, -116802, -222163, -251152, -209887, -265204, -288878, -210910, 46219, 208186, 173710, 117590, 114985, 76364, -7949, -25740, 50278, -7357, -112458, -144681, -127972, -98722, -14089, -166404, -279064, -178114, -64113, -26834, -122443, -44460, -24853, -87384, -113427, -42764, -81651, -190664, -216193, -146172, -155405, -176077, -200489, -41085, -62209, -202088, -147034, -73886, -83391, -83357, -49916, 40819, 54467, 151899, 152559, 79308, -10116, 11537, -60864, 32091, 35836, -82102, -33310, 13640, -56650, -76303, -130813, -145808, -215234, -172463, -26645, 76919, 81860, 36829]
19521C6829J7396n849o5820J20557K0291r3801k2621M6196K9018j53337r6629
19510a67770p2878J37473k0317Q45R4808K0901q5969j00214p4567M4500M1295
19499a81893R5116P504j58466Q4948J54242j20764j9701M8226J5564P4265R2685
19488I1726l6414j85688l7733K0032O873p9524r4677P428J29899R2541l761j30470
19476b19768j9454Q7559J41741p3374p8478J0441Q1407n1695J22798o2605q6991
19465a48419Q4330L0300J3651R2963k6125m2502n2445l0686q4630J27431K21338
19454A85206j10685j19360j12500J42895j05905j43921P9075k806o2970J9191
19444b31780M7401J4790Q7289n3824M0946l8815R752j1571l3663j9745M8290L3472
$$ y = [36829, 54225, 48376, -17444, 103113, 123404, 29603, 6982, 53178, 82196, -71141, -167770, -240648, -103175, -123492, -122647, -27839, -6938, -92907, -193121, -267688, -223188, -181893, -86777, -79273, -237739, -152791, 1451, -119313, -139014, -90788, -75224, -959, 91726, 55312, -130376, -168109, -148077, -141204, -220728, -315405, -307977, -178078, -85537, -89298, -219768, -239222, -151663, -9922, -83296, -161774, -151333, -69926, -121621, 1177, -61428, -148419, -64089, -33789, -20138, 72825, 46700, 4198, -48247, -78933, -163563, -36132, 185206, 74521, -44839, -157339, -14444, -120349, -264270, -185195, -188001, -250971, -231780, -184379, -169589, -82300, -136124, -95178, -133993, -124241, -135812, -169475, -189220, -140930, -107458]
19432a07458J86520J28738K5604k1827l54508l6785O543j05234Q0146m2292K4208
19421b16345J67397N1426l5390K4307M3610j46938j54975M1590p5404j3554J51653
19410a62623Q0669J11727j5685p0131o2882N5509L124n3534N6170P9589m8682
19399b6749m5303P1719K2713N4962Q309q3219r5922L6757j77077J6081J26854
19388i0875j8911o1314o8695J66270O2947N980j05171j21158j1735q9219K5718
19377c06163Q9641P4693k274o7489m7485P577R8720j0491K5771L2180Q311P3863
19365b3146K8165Q048O894j8662n6766L6365q1284j1579O1568J6628j73204l6105
19353b43078m172Q0265j8438J00307K6016J7803m3530K7216K4478n2546j2448
$$ y = [-107458, 79062, 207800, 233404, 211577, -142931, -179716, -173173, -278407, -198261, -240553, -216345, -48948, 2478, -32912, -8605, 35005, -111933, -266908, -225318, -300722, -314276, -162623, -81954, 29773, 14088, -56043, -118925, -63416, -60292, -113826, -57656, 21933, -26749, -72052, -333, 22380, 77342, 85651, 2432, -93490, -56733, -233810, -217729, -90875, -109786, -171100, -239795, -73525, -10578, -4598, -109769, -230927, -242662, -331881, -306163, -216522, -141829, -144103, -211592, -259077, -251500, -152780, -163271, -137500, -105320, -97009, -23146, 5019, 13067, 19961, 1299, -55467, -19102, -100386, -111965, -50397, -33769, -206973, -243078, -247250, -166985, -185423, -85116, -59100, -41297, -84827, -57611, -33133, -85679, -98127]
19342i8127J03475j40006k0951P7138R9901n2137j7337M9317M0937m6665o4739
19331f9194q8065k5338j6413O2319Q6836l017J2402j09939j62019N1099K30013
19320c1316o6857n8808j0416K113O9721P5855M7883k0274j1349r2153o9219o1641
19308b26461m3987J67765K0860M5179K6524J7150K1291O9084j31813j17557r0059
19297b42024m4890l6188O9294O8122m383J14445j9385q7667n4864K0959R4429
19286a22152k4020j30771P5268O2138L1799N3283q910O3828j1260j64110J2436
19275a62471J21789P3067J39686o9305l7559L9753K849J9881k4J18633P9201j80343
19263A45157j17054K5074j55066j26362k4068R9784R1653l5969K2706L6579p9355
$$ y = [-98127, 5348, -134658, -155609, -78471, 21430, -30707, -48044, 1273, 42210, -4455, -69194, -157259, -182597, -199010, -136691, -49855, -52872, -40470, -150409, -312428, -261329, -31316, -98173, -156981, -167397, -165284, -95563, -19708, 28175, 7901, -3448, -95601, -164820, -226461, -270448, -102683, -81823, -36644, -10120, 7030, 28321, 97405, -34408, -151965, -242024, -286914, -323102, -253808, -185686, -190069, -75624, -95009, -182676, -237540, -216581, -122152, -146172, -276943, -201675, -139537, -107738, -54455, -63365, 463, -10797, -174907, -162471, -40682, 32385, 172071, 102766, 65207, 104960, 107809, 127690, 127666, 246299, 325500, 145157, 28103, 53177, -101889, -228251, -252319, -152535, -60882, -96851, -74145, -37566, -116921]
19252a16921l2679q3405l1672M5682r3281j18262J9570J00155J01108R5485j2488
19241a26708P84l897l7244K2034M2650j7804N3438q1702o2675O2618Q853J58158
19229A8505k1127j50549j18310J24730J56634q7128o6337n9413M6038J16149K5341
19218a5467j320L3358m4418k2612l2604k1439J30796K6986o5347K2942L3133j13707
19206f9699K133O9663J05422J2378l7318n71N6001j06112j64900n8834N2211j46369
19194b85995m5637N0285M8088L9157N7933j14170l4332l472R8396K06295O2353
19183G8901j18021r513k9052M5666r1362n1599O8056L2406J1953P3271j17445
19172a06739L6366K9090L2806O353j03411j11725p3121J86325O2597j37920p9297
$$ y = [-116921, -149600, -233005, -264677, -218995, -312276, -430538, -410968, -310813, -209705, -114220, -126708, -125924, -129821, -167065, -145031, -102381, -120185, -66747, -148449, -211124, -148506, -139653, 18505, -2622, -153171, -271481, -146751, 9883, -77245, -143582, -202995, -156957, -40808, -15467, -16787, 16571, -27847, -50459, -83063, -104502, 26294, 53280, -12067, 10875, 44008, -69699, -67566, 2097, 107519, 119897, 82579, 82008, 138009, 31897, -133003, -191837, -139626, -285995, -331632, -281347, -233259, -194102, -136169, -250339, -284671, -288143, -189747, 16548, 78901, -39120, -48633, -77685, -32019, -123381, -174980, -106924, -74518, -62565, 10706, -106739, -70373, -41283, -8477, -2124, -105535, -217260, -290381, -104056, -41459, -179379, -258676]
19161b58676J34636J7498K4143Q7048m0133j74690j50370n0063P7676J40054J27546
19150f5331J7513q2427N5620J11701n2176J9934J70633j3123o0829J2339k2644
19139I1210m3316J967l518L2310n5076o1693o6628P4022J6658J23910J12575k7273
19127A95148r1697R5306P5049L5468j59237p3893K6992o4577q4324r5828m155
19116a45748J19071J74508k8964k6153k3269N883N2071J01987P3520j42961j82429
19105b2484l2278K27718K6791r5318P5701P2409J6354J35643M1580n9827j29391
19094B56898K5117J0073J2908R2567K2949L5399L8551m0342P3506J7075L1233
19083E75934L9117r1401j08251j84918j08210n6264m1782J6629n8010O6698Q4493
$$ y = [-258676, -124040, -106542, -82399, 4649, -35484, -210174, -360544, -410607, -332931, -192877, -65331, -47818, -130245, -74625, 37076, -15100, 4834, 175467, 162344, 101515, 113854, 91210, 47894, 49861, 46343, 78653, 23577, -38116, -104744, -30722, -14064, 109846, 222421, 195148, 103451, 198757, 273806, 309274, 150037, 76144, 103136, 38559, -45765, -141593, -145748, -26677, 147831, 118867, 92714, 69445, 75328, 127399, 229386, 302906, 159945, -22484, -54762, 172956, 199747, 104429, 180130, 252539, 268893, 404536, 446116, 386289, 256898, 282015, 292088, 304996, 397563, 420512, 455911, 494462, 454120, 527626, 544701, 575934, 615051, 523650, 415399, 230481, 122271, 66007, 24225, 40854, -17156, 49542, 134035]
19072A34035q0568K29492m8108j77528l3688R4247K9742j09670j03302P9875j5143
19061f16p1083J2484J82972m4500j31199K6201K27724j4474J2652r1907K3886
19050A32140j2327k9572j19453m3331P2060j17999j7108N9706O6627J10962n7260
19039D4445k9787L6179p5069R72R2899k6079n7606M6246O5913j7926n5539M4917
19027F9565L0319N3327N532o5650N9393J17234M073O759O9111O9019q3518j22493
19015B12671j6493K7427k86k4719q0707R3786K12412o7610N0087R0025o9336n7304
19003C69953r6938K0157m1166L0179L908K2991J70538K8765j19720j00162p1289
18992B17216J22541O5575k13251j43532j4440P6011J7332m2463J1108n208J17750
$$ y = [134035, 53467, 282959, 234851, 57323, 23635, 117882, 147624, 37954, -65348, 14527, -616, -71699, -59215, 123757, 79257, -51942, -25741, 201983, 187509, 200161, 108254, 132140, 119813, 90241, -29212, -72543, -483, -118482, -135590, -75884, -9257, 101705, 44445, 14658, 50837, -24232, -23260, 69639, 43560, -14046, 32200, 98113, 80187, 24648, 69565, 99884, 153211, 158743, 93093, 152486, 269720, 273793, 280552, 349663, 418682, 335164, 212671, 196178, 223605, 223319, 198600, 117893, 211679, 424091, 356481, 406568, 496593, 427257, 369953, 273015, 293172, 252006, 282185, 286093, 309084, 479622, 508387, 388667, 288505, 217216, 339757, 405332, 192081, 48549, 34109, 110120, 127452, 84989, 96097, 90889, 208639]
18981B08639n4235o2789q9753k9666j641l4592j52735R7802J30426J01627J5942
18970A29025o8924m7156J9050J2457p5006Q4612j60449k6243J05942P1927j25628
18959h0393J8287Q4708L7113m8857k6122k8288O6514Q8633n4719o2371P2884j935
18947F5454m530n0290q1004J30915J17048j85338m7157P483j44616J9583M2168
18936a30284k4125n4578J40936J51393K00764M1113j2361O2202J7442k249N5436
18925D45689p7526n3711n5687q6966j1628R556K4164L2859J88769Q55o6533j45010
18913B04831K319J37705L5144N3490J54539J9078o0951n9040N3174k2610o1446
18902D56233J74928J66937q7769j16466O6441N8559N1634R5118K2877n3436n9999
$$ y = [208639, 154404, 91615, 1862, -27804, -29445, -64037, -216772, -118970, 11456, 113083, 129025, 60101, 12945, 31995, 44452, -30554, 54058, -106391, -132634, -26692, 45235, -80393, -62106, 22602, 59715, 10858, -15264, -43552, 22962, 111595, 56876, -5495, 67389, 65454, 60924, 10634, -70370, 60545, 177593, -7745, -54902, -47419, -192035, -172452, -130284, -154409, -208987, -68051, 83342, 284106, 325219, 312858, 375060, 392502, 390253, 445689, 368163, 314452, 258765, 171799, 160171, 169727, 193891, 226750, 415519, 416374, 349841, 204831, 207150, 344855, 379999, 433489, 588028, 607106, 546155, 487115, 540289, 517679, 456233, 631161, 798098, 710329, 593863, 660304, 718863, 770497, 865615, 888492, 835056, 775057]
18891G75057q8625q681l9324l1121P6433r230l8780m698R543N9052o0191L9101
18879F78536O9974n1713l9266r5841m2733p2413p800J00299J49811k4310r4048
18868E70496J92335Q5771o3007m3290r1202m249l5580L4236j5253J00079O7242
18857G97578l636j03066q5558j12028Q2169J06615J00714O9720J8813m4912n1637
18846G74772P5284P8049n3169J0829r3533k80722j90564m592n0554Q0944N2906
18835C99650n4637J1503j76817j48560n6437J20781M2925M4511J54152n5580o7778
18824B13713L7124j7864j19153K9472N5673R8757j37461j46314J92790J09338
18814C16075q728M8045M8688N3006P374O1048M1617L2462j56188n2066R4266O9340
$$ y = [775057, 686432, 677751, 638427, 607306, 683739, 674509, 635729, 631031, 640574, 699626, 639435, 678536, 748510, 696797, 657531, 561690, 518957, 446544, 438744, 539043, 688854, 664544, 570496, 762831, 848602, 785595, 742305, 651103, 646854, 611274, 645510, 630257, 730336, 797578, 793942, 690876, 605318, 493290, 575459, 682074, 782788, 852508, 871321, 826409, 774772, 850056, 928105, 874936, 885765, 792232, 511510, 320946, 316354, 265800, 346744, 399650, 345013, 356516, 179699, 31139, -25298, 95483, 138408, 182919, 337071, 281491, 213713, 250837, 232973, 113820, 143292, 198965, 297722, 160261, 13947, 206737, 316075, 307347, 355392, 404080, 457086, 464460, 525508, 567125, 599587, 443399, 391333, 485599, 554939]
18802E54939N4523j26756j28497j267J14472J7304P2861N9490n6329j32425j4041
18791D14274j12395r2664J12639J4788M9144p1392p9198n2070j32329j9152R0399
18780A22044J01799N2N3519L4335k2533Q048M5903j376k8553N5528m604K551Q1390
18767D48103l8677j5173j1656K6486J0017j38939j08326L6360J17044O4780M8885
18756D38904j63569j66237J230K4531O0187j13531Q349K9570l756J1669j1654
18745A15693J09065R9204r2230j1440q8192K6848M1743O7543j6729o338K8659
18734B73826j08690N5662q5783J3749j0846Q0367L6767R7163j3973O6014o617
18723C97639m096o0778j46800k2802N9920j9420n8638k3719K4163J6978R7215
$$ y = [554939, 609462, 482706, 354209, 352942, 467414, 484718, 557579, 617069, 560740, 428315, 414274, 301879, 209215, 321854, 336642, 385786, 314394, 235196, 183126, 50797, 31645, 122044, 223843, 223895, 277414, 311749, 289216, 297264, 343167, 341791, 313238, 368766, 364162, 366713, 448103, 409426, 394253, 382597, 409083, 419100, 280161, 171835, 208195, 325239, 390019, 438904, 275335, 109098, 110328, 134859, 195046, 81515, 89864, 119434, 115678, 127347, 115693, 224758, 323962, 231732, 220292, 132100, 158948, 200691, 268234, 251505, 245167, 273826, 165136, 220798, 135015, 148764, 137918, 218285, 255052, 352215, 338242, 404256, 397639, 393543, 332765, 185965, 163163, 223083, 203663, 145025, 121306, 145469, 162447, 259662]
18712B59662L3746R2360L4192L6102P0482l8052k3486p7825N7870j1937j62883
18701B70231o972N8718J3325l777O0275M5792p5251M3024L8804l1744m9233n335
18689C57857L4546r3393q257J41845l8838q0174r8956l5595J12168P1153M9497
18678D11853J6683j86500j05604R1581O2039L8482j9121j56730k6327L4996Q1484
18667B42836N4933j06422l0564J9774o5313J7512j10617M410L2373M7153J12669
18656B18744J12712J1888J2854J997n1291q7650M337J49711J23951O149L2061
18645E35463L1073p5798j09725j00818m4765J14724L2776R8730R1211j3486q6039
18634D73346M9511O2425o62l747j18115O1807J46966k7826N4697J76184L3699
$$ y = [259662, 293408, 385768, 419960, 456062, 526544, 488492, 465006, 387181, 445051, 433114, 270231, 263259, 321977, 335302, 331525, 391800, 437592, 362341, 405365, 444169, 412425, 363192, 357857, 392403, 299010, 290753, 432598, 393760, 313586, 214630, 179035, 291203, 362356, 411853, 428536, 242036, 136432, 228013, 290052, 328534, 309413, 152683, 126356, 161352, 242836, 297769, 191347, 160783, 180557, 115244, 132756, 22139, 26549, 58922, 106075, 218744, 331456, 343344, 356198, 358195, 306904, 219254, 223591, 373302, 497253, 503402, 535463, 566536, 490738, 381013, 280195, 235430, 350154, 382930, 481660, 572871, 559385, 473346, 522857, 585282, 584620, 580873, 462758, 524565, 671531, 643705, 698402, 874586, 908285]
18623I08285O1321P7881J31028Q2810j23361p6213j6923o5343j35516Q2158M3144
18612I69271m7941K28931K16965J42998J31974N4329J88891O7583R983J9197K40868
18601B223049K11941j11995J39419M62268L31752K20599J98732M51698M86178
18592D613641K32318L33076K44088O32631N96476O49618Q45676R66864J211501
18583A0325889J616887K021670K789225L777507N374307P377678J0166605J2744207
18575E6193975J3006715R183361J858005m225471n873916l438904J256556O570435
18567G4530756J1448309J4300949J3084714Q182280L240802o42544n339202j0932500
18559A07873564j4057047j2673590q098324k618879K707422O275745O419496J402997
$$ y = [908285, 969606, 1047487, 1178515, 1261325, 1137964, 1061751, 1044828, 979485, 843969, 926127, 969271, 921330, 1150261, 1367226, 1510224, 1642198, 1696527, 1885418, 1953001, 1962984, 1982181, 2223049, 2434990, 2322995, 2462414, 2924682, 3256434, 3477033, 3675765, 4127463, 4613641, 4845959, 5179035, 5423123, 6055754, 6652230, 7301848, 8147524, 9114388, 10325889, 11942776, 13964446, 16753671, 20531178, 25905485, 33283163, 43449768, 56193975, 69200690, 78384051, 80242056, 76016585, 70142669, 66703765, 67960321, 74530756, 85979065, 100280014, 113364728, 121547008, 124787810, 124145266, 118806064, 107873564, 93816517, 81142927, 73044603, 70425724, 73133146, 79408891, 85828387, 87231384]
18551H7231384o799700j3180205j4403159j1945179q970773o429724m706139l710382
18543A7086123k731311j748580j561003j371671r38371q29150p58140o67486o94826
18534E785585n17190l68161m17051n46560m36595j82860q7332r6878j95754j16312
18524B820892j24512k12519J3776k00572j30856j1351r059j08831j49715j07196
18514A780057j53377q4415p4402k5561Q1730N755j54571q6545Q9151P3749J09006
18503A560577R9419o6395j46882k06741J7262P4558L2828J851o8831m7248q1285
18492A169113l3981J09022k2731k7598O1305p1455r4197m4383O565P3381l845
18481A121196o0277J2899p1354j2391J40446R2253K14382K970q5513J6353N015
$$ y = [87231384, 80431684, 67251479, 52848320, 40903141, 31932368, 25502644, 20796505, 17086123, 14354812, 12606232, 11045229, 9673558, 8735187, 7906037, 7147897, 6480411, 5785585, 5268395, 4900234, 4483183, 3936623, 3500028, 3317168, 3229836, 3132958, 2937204, 2820892, 2696380, 2483861, 2497637, 2297065, 2166209, 2154858, 2145799, 2036968, 1887253, 1780057, 1626680, 1542265, 1467863, 1442302, 1524032, 1529787, 1375216, 1288671, 1377822, 1451571, 1560577, 1659996, 1593601, 1446719, 1239978, 1257240, 1331798, 1364626, 1366477, 1297646, 1250398, 1169113, 1135132, 1244154, 1221423, 1193825, 1255130, 1183675, 1089478, 1045095, 1051660, 1125041, 1121196, 1060919, 1073818, 1002464, 990073, 1130519, 1222772, 1437154, 1440124, 1354611, 1370964, 1375979]
18470A375979j52290K3966N2090J29374J93499j4884j14316o1479R902r1927j4031
18459A335883K61412K74333N2601k0179Q3009K23321Q8698J07578J54731K14033
18449B775420K04457L78498M17912L71178P56592R15332J417040J919573K492019
18440A1648021K853213K650773J631090O45616j02086o26932m28568K30592N72655
18431A9074374K80651j27111k69766j62263N24837K085424M077079N479406N833532
18422C6796163N102071L446530O3500l985670n823250n085809l266760j459084
18414B5787691o45559r14474j351386j056850k6996J077053J644288K127187K340273
18405B8981227J547607M97206M22883J308894L044757N447350Q386482J0835831
$$ y = [1375979, 1223689, 1247655, 1299745, 1429119, 1622618, 1607734, 1493418, 1431939, 1441841, 1349914, 1335883, 1597295, 1871628, 1924229, 1904050, 1987059, 2210380, 2299078, 2406656, 2561387, 2775420, 2979877, 3358375, 3776287, 4147465, 4904057, 5819389, 7236429, 9156002, 11648021, 14501234, 17152007, 18783097, 19428713, 19326627, 18699695, 18271127, 18501719, 19074374, 19355025, 19227914, 18958148, 18795885, 19320722, 21406146, 25483225, 30962631, 36796163, 41898234, 45344764, 45408264, 41422594, 35599344, 30513535, 27246775, 25787691, 25142132, 24227658, 22876272, 21819422, 21792426, 22869479, 24513767, 26640954, 28981227, 30528834, 31026040, 31448923, 32757817, 35802574, 41249924, 49636406, 60472237]
18397F0472237J2209973J2037996R966894P742380O923833Q947971J1299381R546919
18389A39147584L16799o540517l424039P209227J6313992K1031004J9525062J4133530
18381B07712642R647913P182766O924629K720525m797133j1311856j3398314q466032
18373A96215140O74931N833370M515603L54458p947064j8139697k4565035k6150892
18365A30790814k4355345j9061617j1478751n125545j203241n38566k706068m796127
18357F1525554m486303j643578K636489O728662P770440K965061m20827L209649
18349G8285147J2423881K3271584L1033255K6529849J0986948O41332n31960K602154
18341A85242190Q757761R152547q876543l1963346l9407182l0968510j9378082
$$ y = [60472237, 72682210, 84720206, 94687100, 102429480, 109353313, 118301284, 129600665, 139147584, 139464383, 132923866, 129499827, 136709054, 153023046, 174054050, 193579112, 207712642, 217360555, 224543321, 231467950, 234188475, 229391342, 218079486, 204681172, 196215140, 196890071, 202723441, 207239044, 207593502, 199646438, 181506741, 156941706, 130790814, 106435469, 87373852, 75895101, 70769556, 69566315, 69027749, 66321681, 61525554, 57039251, 55395673, 58032162, 64760824, 72531264, 75496325, 75075498, 78285147, 90709028, 113980612, 145013867, 171543716, 182530664, 183171996, 182640036, 185242190, 193999951, 203152498, 194275955, 162312609, 122905427, 91936917, 72558835]
18334G2558835j0943781n854919l862856l201436k313863l73314K070591L650232
18326E1729489J791712l341033p001269o472483m095956k265354j614174j508675
18318B7222257j950434k054458j633378j063062l15962Q48629K106234L757060
18310B6916886O605500R494801J0537167O961651J245323m752M196038R180158
18302G5132772J1059885P833413K007516m417173r085981p834383k560449L157349
18294G5292949Q873640R565446P4680q687292q602497k021343L902054O076289
18286H4473926K900119k157878o033649q926867r591968q418070o695783m823671
18278D0726159k964967k145469j618467L43714K509659K981417P67512k550426
$$ y = [72558835, 61615054, 55760135, 51897279, 48695843, 46381980, 46008666, 48079257, 51729489, 53521201, 50180168, 43178899, 36706416, 32610460, 30345106, 28730932, 27222257, 25271823, 23217365, 21583987, 20520925, 20204963, 21053592, 23159826, 26916886, 33522386, 43017187, 53554354, 60516005, 61761328, 61756576, 65952614, 75132772, 86192657, 94026070, 96033586, 91616413, 82530432, 74696049, 72135600, 75292949, 84166589, 93732035, 93806715, 85119423, 76516926, 74495583, 78397637, 84473926, 87374045, 85216167, 79182518, 70255651, 60663683, 52245613, 45549830, 40726159, 37761192, 35615723, 33997256, 34340970, 36850629, 39832046, 40599558, 38049132]
18270C8049132l665136j721493O00291K0343k950774m826078m618994l567779
18262A7319512k430365j393522o73614J41001R53925J918249L032229L880325
18254B2747740M161612L367777K388763J319930P53292J473129L385888M361335
18246D3959466K688283o32686l788524o078827o827481o071285m880396l740680
18238A4627870k987088k015202j567828j085265q48507o92898m38151k45262j67050
18229D580619J07575J83542J78224M83420N79773P88715J395984K149361L052435
18220A3499648L356816J802073j046866k692990k656760j519815k32766P61041
18212A1270381J262930Q54793n30515j821719k002328j373168n85480J85122O79023
$$ y = [38049132, 34383996, 32662503, 33262794, 33283137, 30332363, 25506285, 20887291, 17319512, 14889147, 13495625, 12822011, 12963012, 13916937, 15835186, 18867415, 22747740, 26909352, 30277129, 32665892, 33985822, 34739114, 36212243, 39598131, 43959466, 46647749, 46015063, 42226539, 36147712, 29320231, 23248946, 18368550, 14627870, 11640782, 9625580, 8057752, 6972487, 6123980, 5431082, 4992931, 4747669, 4580619, 4688194, 4871736, 5049960, 5533380, 6113153, 6901868, 8297852, 10447213, 13499648, 16856464, 18658537, 17611671, 14918681, 12261921, 10742106, 10509340, 11270381, 12533311, 13388104, 12857589, 11035870, 9033542, 7660374, 7074894, 7260016, 7939039]
18203G939039R25726M97201n37946j219063r27903m81745k00367M31511P58111
18194G184564N96293J4512p33265j308598j124937p98709n61585m79317j78508
18185B610450p8030j45920k13870n6943L221K0766j79510k55796p6209J0435Q1144
18174A719738N4256o4070j53393J5327R1481m571l5023k2695K5059J92964L80
18163A819453p7771p8270j31855j35104n7721L0592N9258j10912j14823R0182
18153A293029l4413m1040q5961j06076P9524j41532p8502O7603J6262M8103J32116
18142A149113P3970j27431L5098R4211k6165k9131R3247j25627N0144J58826O4870
18131A411125K4251r8955l264m8464J4688J0356J16819J10868J64257J28607l1304
$$ y = [7939039, 8864765, 9361966, 8824020, 7604957, 6677054, 6195309, 5994942, 6426453, 7184564, 7780857, 7795369, 7062104, 5753506, 4628569, 3829860, 3268275, 2788958, 2610450, 2532420, 2386500, 2172630, 2115687, 2118908, 2139674, 1960164, 1704368, 1628159, 1638594, 1719738, 1773994, 1709924, 1556531, 1571858, 1663339, 1658768, 1623745, 1601050, 1626109, 1819073, 1819453, 1741682, 1663412, 1531557, 1396453, 1338732, 1369324, 1428582, 1317670, 1202847, 1293029, 1258616, 1217576, 1131615, 1025539, 1105063, 963531, 885029, 952632, 968894, 1016997, 1149113, 1223083, 1095652, 1130750, 1224961, 1198796, 1169665, 1262912, 1137285, 1187429, 1346255, 1411125, 1435376, 1336421, 1333157, 1284693, 1299381, 1309737, 1426556, 1537424, 1701681, 1830288, 1798984]
18120A798984Q1138J26083Q4279P6673J28270J02341O8539J85162J24647J5153
18110B791269N3922O798O0551o0958J09389J79370K23782K21011L73731L78565
18100D337430L11026L60002M49340N12844O04927N32096Q57940J141901J125297
18091A0232803J293639J662048K045469K573845L724921M818370O329940Q028406
18083D0709441R125255Q851499O243851J708399k673730n031147m995066l456330
18075E0482172j201523J418587M183971P058829J0170073J2812509J3749573J1666005
18067A10340196O250193r63746q069811j2564956j3564931j2042176r026880n759809
18059E4598080k877885j30224K458365M771166N678221M497854Q83384m171878
$$ y = [1798984, 1880122, 2006205, 2090484, 2167157, 2295427, 2397768, 2466307, 2651469, 2776116, 2791269, 2845191, 2851989, 2912540, 2851582, 2960971, 3140341, 3364123, 3585134, 3958865, 4337430, 4648456, 5008458, 5457798, 5970642, 6575569, 7107665, 7965605, 9107506, 10232803, 11526442, 13188490, 15233959, 17807804, 21532725, 26351095, 32681035, 40709441, 49834696, 58686195, 64930046, 66638445, 63964715, 58933568, 53938502, 50482172, 49280649, 50699236, 54883207, 61942036, 72112109, 84924618, 98674191, 110340196, 116590389, 115626643, 107556832, 94991876, 81426945, 69384769, 60357889, 54598080, 51720195, 51589971, 54048336, 58819502, 64497723, 68995577, 69878961, 65707083]
18051F5707083q292551r823584q927614p343407n581993m208132l196145k471347
18043A5862310j902180j542229j357777j207796r86595q70711o45744n02866l86169
18034F460243m28242m73993m83857m68238k24054l20842l01046k38509k70507
18025C250955q3348m0000j49369k57044k73115j49482j15284l2668k8889n3649
18015B068107p8624j14785j11651j41523o0739K1880P9959O6297J8077J3233q2733
18004A677498q3974p1847j22031l40515l3532J8061n6183L6839l7716j25196L9934
17993I01338Q7966j5198j16139o8731n5190M6184J00443P6105j69301j07666l2572
17982F47239p8666O7268M1533K0073M2915J16813J0003r8253J6265q7091j31877
$$ y = [65707083, 57414532, 47590948, 38663334, 31319927, 25737934, 21529802, 18333657, 15862310, 13960130, 12417901, 11060124, 9852328, 8865733, 7995022, 7349278, 6846412, 6460243, 6032001, 5558008, 5074151, 4605913, 4381859, 4061017, 3759971, 3521462, 3250955, 3167607, 3127607, 2978238, 2721194, 2448079, 2298597, 2183313, 2150645, 2121756, 2068107, 1989483, 1874698, 1763047, 1621524, 1560785, 1582665, 1662624, 1728921, 1746998, 1760231, 1677498, 1593524, 1521677, 1399646, 1059131, 1025599, 1043660, 987477, 1024316, 986600, 861404, 901338, 989304, 974106, 857967, 789236, 734046, 780230, 880673, 956778, 787477, 679811, 647239, 568573, 635841, 677374, 697447, 740362, 857175, 867178, 768925, 785190, 698099, 566222]
17971E66222M040J08374P0981J05007K331r2578n7103j15721j8339l3137J90228
17960G30305K4803r0248k24026o0124O5799p293l8720R6549j75581n5618l994
17949B61852K6458J13820J4563K2370Q0048l6748j13566J3671P5199K7814M3644
17938E29125k4374M5886K0508r1575k02376n8188L7022J46842O1974l9931k0707
17927D04206N7502Q87M1154J05168O2404k4144m6045l1686J54699J60089J63301
17916A047535j144k1639J76088l8989j01195j29957q0099J8419K903O933M8959
17905I27814K5964p0809J9284K4804o4593l1556p3911j39024j21712n7801Q8722
17894E27182m4836o7258P4136m5682L2841k9617J47160q0727J0076O4779j9487
$$ y = [566222, 570262, 678636, 749617, 854624, 856955, 764377, 707274, 591553, 573214, 540077, 730305, 755108, 664860, 440834, 380710, 446509, 439216, 400496, 497045, 321464, 265846, 261852, 288310, 402130, 416693, 439063, 519111, 482363, 368797, 382468, 457667, 485481, 529125, 504751, 550637, 571145, 479570, 277194, 219006, 256028, 402870, 464844, 424913, 404206, 461708, 462595, 503749, 608917, 671321, 647177, 601132, 569446, 724145, 884234, 1047535, 1046391, 1024752, 1200840, 1161851, 1060656, 930699, 850600, 869019, 871922, 878855, 927814, 953778, 882969, 902253, 927057, 862464, 830908, 756997, 617973, 496261, 438460, 527182, 482346, 415088, 489224, 443542, 476383, 446766, 593926, 513199, 523275, 588054, 568567]
17883E68567N556j0129K3058K08999O2315k0548J11027N8725l3048J17343l249
17872A088616P4100R0659p7772j05629k8268R1823O6654p0203j14912j21111o2765
17861H31192m526j6214J21895P9744j03931j33351n9208r2986q2737J03546J05052
17850G48476L1784o265o8703k5656L9363K5558P8664j50030L056J88468K54125
17839A118840n9105k343L1024p6818k9450k9611j21117J70958J89652J38038R6214
17828A426282j55972k6138K4744q3260j27167q3458k4916O4065R5957O8133p7310
17817A100960o2754r07k2034N6602j24108j47515m4102r4273m6505m3150L9974
17806F12188P5275M0676k5622l5937P1784Q4154q803o9276o1549r2131K0063K06339
$$ y = [568567, 574123, 563994, 587052, 796051, 858366, 837818, 948845, 1007570, 974522, 1091865, 1088616, 1162716, 1253375, 1175603, 1069974, 1041706, 1133529, 1200183, 1129980, 1015068, 893957, 831192, 826666, 810452, 932347, 1012091, 908160, 774809, 715601, 622615, 539878, 643424, 748476, 780260, 773995, 705292, 679636, 718999, 744557, 823221, 673191, 676247, 864715, 1118840, 1059735, 1057392, 1088416, 1011598, 982148, 952537, 831420, 1002378, 1192030, 1330068, 1426282, 1270310, 1244172, 1268916, 1185656, 1058489, 975031, 950115, 1014180, 1110137, 1178270, 1100960, 1038206, 1037299, 1015265, 1071867, 947759, 800244, 756142, 661869, 615364, 572214, 612188, 687463, 728139, 702517, 666580, 738364, 822518, 813715, 744439, 682890, 590759, 610822, 817161]
17794H17161L1895J49040j8516k2800o5152q8908j33686p8225j9371J08642j08260
17783E71820L6004J48882l3415j00512r5596q6775J86407M2812M5903j995M4946
17772G58481N2945j32785j81920o2579J152k832p2940K5583k2851K803j8418N6309
17760D02948Q9926J01266k4370j5488M8441J2728o530m7755J01504o7945j23098
17749D71627P6874k3613K5338O1084L3457l0360j91675j24730M6934P9231p917
17738D16250M3041n6120q4500K4606J39666J37876J42810R7516N0458k1413n979
17727H84211m0784p752j0718N7738m1123K8933J4387N3427K9380o9813K4252R0139
17715A012277J39811K10960L16083J15413J37639J82986K33102K54899J67405
$$ y = [817161, 849056, 998096, 979580, 956780, 891628, 802720, 669034, 590809, 571438, 680080, 571820, 607824, 756706, 723291, 622779, 527183, 440408, 626815, 669627, 715530, 713535, 758481, 811426, 678641, 496721, 434142, 435294, 432462, 359522, 385105, 362254, 365057, 346639, 402948, 492874, 594140, 569770, 554282, 602723, 615451, 608921, 561166, 662670, 594725, 471627, 548501, 524888, 550226, 611310, 644767, 614407, 422732, 298002, 344936, 424167, 416250, 459291, 403171, 318671, 343277, 482943, 620819, 763629, 861145, 911603, 890190, 884211, 843427, 835675, 824957, 882695, 841572, 870505, 884892, 938319, 967699, 897886, 922138, 1012277, 1152088, 1363048, 1679131, 1794544, 1932183, 2115169, 2348271, 2603170, 2770575]
17706B770575K77403L18562L47965M63410M51489N45892N51431P29037Q80510
17697G336274J192812J463681J910313K885416M227650O137969R018143J3340592
17689D7512850J8044827J9032914J0479960l702724j2268888j1708209n716373
17682F1674357J116022P776227J3941913J6482337J0479434j587528q395395n129606
17674I6357761L092298P061413R05043j0203904j5748742j3545440p251401p66840
17666E9900188N042976J0008521J0989037L110147r654464j7643346j7017440
17659D4735619j2129811p953785n322278l747993k524172j881193j491384j099597
17651H585406j079341p81167p31458n74005o31650n15527m80823l48308k97196
$$ y = [2770575, 3047978, 3366540, 3714505, 4177915, 4629404, 5175296, 5726727, 6455764, 7336274, 8529086, 9992767, 11903080, 14788496, 19016146, 25154115, 34172258, 47512850, 65557677, 84590591, 95070551, 91367827, 79098939, 67390730, 61674357, 62790379, 70566606, 84508519, 100990856, 111470290, 109882762, 101487367, 96357761, 99450059, 106511472, 107416515, 97212611, 81463869, 67918429, 60667028, 59900188, 64943164, 74951685, 85940722, 89050869, 79396405, 61753059, 44735619, 32605808, 24652023, 19329745, 15581752, 13057580, 11176387, 9685003, 8585406, 7506065, 6724898, 5993440, 5419435, 4787785, 4272258, 3791435, 3443127, 3145931]
17642C145931k57037j76614k11837k98467k01382j76109o777L8543j7807J14976
17632A953420m9501j61985j64253Q7897j29868j75810n2792k8048j01574n7493
17622A119993J23661O8178K253J9779n5483n8683j02159k7736O5753j1181j86304
17611I58071m9815K842L889O8787N182j01050p2893o3644j22853q0771r6417L8172
17599D89500l009J743J17992o1667r1774l981L8604j018N5338l7040j78228r2025
17587B34435J7670N0363R5467r1166O7364Q0299l5107j50203j06066M5795N8392
17576B67243N6179J11350N5171p1119m9964J21771K2118r8169k2492O4012M930
17565D61030K0345n9108M9355K25618J2781k6036q029L1474q7150j43919N5033
$$ y = [3145931, 2888894, 2712280, 2500443, 2201976, 2000594, 1824485, 1817708, 1856251, 1838444, 1953420, 1903919, 1741934, 1577681, 1665578, 1535710, 1359900, 1307108, 1279060, 1177486, 1119993, 1243654, 1311832, 1314085, 1333864, 1278381, 1219698, 1117539, 1089803, 1155556, 1144375, 958071, 908256, 911098, 914987, 983774, 988956, 887906, 815013, 751369, 628516, 547745, 451328, 489500, 486491, 488234, 606226, 544559, 452785, 448804, 487408, 486390, 541728, 504688, 326460, 234435, 252105, 302468, 397935, 306769, 374133, 454432, 419325, 269122, 163056, 208851, 267243, 323422, 434772, 489943, 418824, 368860, 490631, 512749, 414580, 392088, 456100, 461030, 481375, 422267, 471622, 697240, 710021, 683985, 675956, 707430, 620280, 476361, 531394]
17554E31394k4416j58014q686o277j8309J52775N2236k228M7763q8555l2836j01018
17542C43829o379M5429k7380k6276P3467l9759m3737k18494Q3578K31145O6625
17531D82048N65j36685k6944N1116Q3054j49207o4221j9049M9115o6252K1638
17520B25178J15656K2968N4204J7310J3969j49314K0210m1982r5835j57576l4234
17509i446J21997k0180m9140J93219M8049j44283j3062J63315M8464m6512M7061
17498C39482k0761J2968l1650r9201j881r7485n2305O0330J15006m6804l6199
17487A41500q2821j12303n560N6461p4610L2223J56945l6075m7963R857L9260
17476G6914r9519p7413l2353L9871P5905j0984J7184l8315q0858O0670R0483o3031
$$ y = [531394, 506978, 348964, 340278, 334001, 315692, 468467, 520703, 518475, 566238, 477683, 444847, 343829, 337450, 382879, 355499, 329223, 402690, 362931, 319194, 100700, 184278, 415423, 482048, 482613, 345928, 318984, 370100, 453154, 303947, 239726, 220677, 269792, 203540, 225178, 340834, 363802, 418006, 435316, 449285, 299971, 320181, 278199, 182364, 24788, -9446, 112551, 92371, 43231, 236450, 284499, 140216, 127154, 290469, 338933, 292421, 339482, 318721, 331689, 300039, 200838, 198957, 101472, 49167, 109497, 224503, 177699, 141500, 58679, -53624, -59184, -2723, -77333, -45110, 111835, 75760, 27797, 37654, 76914, -22605, -100018, -132371, -92500, -16595, -27579, -10395, -48710, -129568, -68898, 21585, -41446]
17464d1446P6082K16466o2775k64795K5987J31823P0209l1103N348P2726J67151
17453C65673N1512j02126n0523n1009j34068p1250N5201K8175q8530j5557j9234
17442c1736J6943K6768P3617k2935J9125P2394J0923j41686k7773M4504K3989
17431F4133M710K8457K0380o6558m4386l4838m9943J11422J29399j8637J8895
17420A63034n0115O6442Q7990m3790J589m6784J9704k4416k7736J5470r9656o0033
17408A699J06711N7222j03427K5550j5276J02981O2624J29317J48772K01754M0609
17397G58536m4860j20742p7946j56090k22345q8863J11309m6238P766J0649J24138
17386B55314J88995J43604R4120q4572j76117j18841o1684j2028p1407j06058
$$ y = [-41446, 34636, 251102, 188327, -76468, -50481, 81342, 151551, 120448, 125796, 198522, 365673, 417185, 315059, 264536, 213527, 79459, 8209, 63410, 91585, 3055, -12502, -31736, -14793, 11975, 85592, 62657, 81782, 154176, 165099, 23413, -4360, 40144, 64133, 68843, 97300, 117680, 51122, 6736, -28102, -78045, 33377, 162776, 144139, 163034, 112919, 179361, 267351, 223561, 225150, 178366, 198070, 173654, 145918, 161388, 61732, 1699, 108410, 165632, 62205, 87755, 72479, 175460, 238084, 367401, 516173, 717927, 758536, 713676, 592934, 514988, 358898, 136553, 47690, 158999, 112761, 120527, 131176, 255314, 444309, 587913, 682033, 597461, 421344, 302503, 240819, 228791, 157384, 51326]
17376E1326P8097N5559J04897j96022J24j620J09651L9939j75589q2184P0105
17365E4283R5601J15972J4494j19655M2201q5068N0252m252k0148r5191o7476
17354a8987o2846M0195L3188m2002m346O1009N2312O5459m8666j70968m4885K17244
17342G6707O46j151J7888k3669J8212j543q898K1381n1534k5117j39464M4065
17330g2477J3093J3171J11362k2298J54747J01890o9965o2914l8628p2878j17130
17319f2027o8803q0711L9122M7674O8852K6041Q1986j67815j34195L9876j7558
17308b27558m0228J03558l5684J48735J5218m9945p5693o0286K00947N9154p6431
17297c8213o9640l8257o9821l9166J56698l7256o3715J26137N7600o1015K3472
$$ y = [51326, 129423, 184982, 289879, 93857, 93981, 92361, 202012, 241951, 66362, -15822, 54283, 149884, 265856, 280350, 160695, 202896, 117828, 168080, 163828, 143680, 48489, -18987, -81833, -41638, -8450, -50452, -54798, 6211, 58523, 123982, 75316, -95652, -140537, 76707, 77353, 76202, 94090, 70421, 88633, 87090, 78192, 99573, 48039, 22922, -116542, -72477, -59384, -46213, 65149, 42851, 197598, 299488, 229523, 166609, 127981, 55103, -62027, -130830, -211541, -172419, -124745, -55893, -29852, 52134, -115681, -249876, -210000, -227558, -267786, -164228, -199912, -51177, -35959, -85904, -161597, -221883, -20936, 38218, -38213, -107853, -146110, -215931, -255097, -98399, -135655, -199370, -73233, -15633, -76648, -53176]
17286e3176L0042J1771Q6158O7204N516J9107l6407l851o1431R4359k3738n7562
17274G7992O8826m6185P775j8645o7816O5788J7054m329m8317m6841m685p6277
17262g5660N9523O2169J57727j64985k24151r5972L1875J44465N8956l9655N2647
17251c3061O5266o5440K6627k9643r45N675j11982n3060R4186Q8284J14630j1567
17239H8970n5543n2988R4252M4132n7058J6551N488j8551j4836o7127l9026J14636
17227E8900J02338k4749P4391P0515l0696k9478J00978K8256q2945j11556p9027
17216G6927N4589j02100q5445l9951L7774j9207L0280l0982J0007N022Q9544L3200
17204E9658P5448m8061n7297J0500k5586j332q0902P0573J31195j3060m4486M2191
$$ y = [-53176, -23134, -11363, 74795, 141999, 147515, 166622, 130215, 126364, 64933, 159292, 135554, 77992, 146818, 100633, 108408, 89763, 21947, 87735, 104789, 100460, 52143, 5302, 617, -75660, -16137, 46032, 203759, 38774, -185377, -281349, -249474, -105009, -46053, -85708, -33061, 32205, -33235, -6608, -36251, -37196, -31521, -143503, -196563, -102377, -14093, 100537, 88970, 33427, -19561, 74691, 118823, 61765, 78316, 83804, 65253, 50417, -16710, -55736, 58900, 161238, 136489, 210880, 281395, 250699, 221221, 322199, 350455, 267510, 155954, 76927, 131516, 29416, -56029, -95980, -58206, -77413, -47133, -78115, -68108, -63086, 26458, 59658, 135106, 87045, 29748, 40248, 14662, 13330, -67572, 3001, 134196, 121136, 76650, 118841]
17192A18841j709q09J54654o2330r2255L9815P685r4543q7914N0857L176n1120
17180a5652O3013J21628Q7953j6157j64969N2324J04868L7262n1967q2929n3285
17169H2089P7743N2421L2148Q0394N0880o200p1240J2512K01999r4034m1362J0252
17157C87602Q6541O0415j33736r8589K7863O7039q537J6123p1597j84826J3292
17146A61590R3526l8824k2914M075L6489k01479O1425J86740j19062j05831j9019
17135C6716M2188m7166k5091L8140N3896Q3304N4223n5206n527j16238j6333j25935
17123h3029L2333K7242l177j8026l036m9433n2422Q7332P574K694J39580J8977
17111A06609l5461O4500k3051j34868m0824q8783p5515K2808l5650k0230l4918
$$ y = [118841, 117132, 116323, 270977, 208647, 116392, 156207, 163892, 69349, -18565, 32292, 35468, -15652, 47361, 168989, 256942, 240785, 75816, 128140, 233008, 270270, 218303, 135374, 82089, 159832, 212253, 244401, 324795, 375675, 369475, 298235, 310747, 512746, 418712, 377350, 387602, 474143, 534558, 400822, 302233, 330096, 397135, 388598, 404721, 333124, 148298, 161590, 255116, 216292, 193378, 197453, 233942, 32463, 93888, 280628, 161566, 55735, 36716, 78904, 31738, 6647, 44787, 98683, 181987, 236210, 181004, 175477, 59239, 42906, -83029, -50696, -23454, -26631, -44657, -47693, -97126, -149548, -62216, -54642, -51948, 87632, 106609, 71148, 135648, 112597, -22271, -63095, -151878, -227393, -204585, -240235, -260465, -295383]
17100b95383J92988R4682M8441J36640k0629k31708p1107R9388N3233m487Q1904
17089H3962j44305j12208q5164p8549R8308Q0545R537l0417k2527M52L8283P7707
17077h4376p916J3676l6590m7509L1023m7594J410o8081O1393N5168j13695o0846
17065c03937O4024J1662J26317N418J1127O9280m4624l2446O7296q0925p7812
17054a84620l1274R7280N6744r1721k279k9386r0787Q1342J57358O4625p465k09917
17042a90100n7794J1528L1497Q8680Q6665l2906k0911L6161o382k3625k7044r6102
17030b00333N5024Q2912r1479n8529n774J0541R270p6984L5733K13497J07430
17019H1308k3505o6799q5805k5579K9250l4080P4010J14193L8693Q9310L6635
$$ y = [-295383, -102395, -7713, 40728, 177368, 156739, -74969, -146076, -46688, 6545, 2058, 83962, -60343, -172551, -257715, -336264, -237956, -157411, -147874, -178291, -200818, -200366, -162083, -84376, -92292, -78616, -115206, -162715, -131692, -179286, -177876, -245957, -184564, -129396, -243091, -303937, -239913, -228251, -101934, -96516, -85389, -16109, -60733, -93179, -25883, -106808, -184620, -215894, -118614, -61870, -153591, -155870, -185256, -276043, -194701, -37343, 27282, 19817, -190100, -247894, -236366, -204869, -116189, -29524, -62430, -83341, -47180, -53562, -77187, -104231, -200333, -145309, -62397, -153876, -212405, -218179, -207638, -198368, -275352, -239619, -26122, 81308, 57803, -8996, -94801, -120380, -91130, -125210, -51200, 62993, 101686, 190996, 227631]
17008B27631o6754R1517o8659p7041n994n661m5936o5179k2566j630P8705J51902
16996A90335o0481j0759l3722J7428k4478P0897Q605R7066k5543j49814l4252
16985D5282J1434J17052j0274k057n0244j06284j1669j6722k778J02821L3578
16974A10139L3609l6650n8875n4465n6463l6584Q5057P3606J09834P0034m2771
16963A96471m7442j42460l4299j4308J08966N0337j28267l081R7020k07N3031
16952A35761M7368m5723j83570j55269M6647L2259M9580L7252K261N9932o92R2652
16940A18458m4256L0511p640n0494l1075J3082l5791j21601m6876k3644j13286
16929c12612L615O181J19977j6487l7673J05688J01766L4263J978N9235J0013
$$ y = [227631, 160877, 252394, 183735, 106694, 100700, 95039, 49103, -16076, -38642, -40272, 38433, 190335, 129854, 119095, 85373, 102801, 78323, 149220, 157825, 254891, 229348, 79534, 45282, 56716, 173768, 163494, 161437, 111193, 4909, -6760, -23482, -26260, 76561, 110139, 143748, 107098, 48223, -6242, -62705, -99289, -14232, 59374, 169208, 239242, 196471, 149029, 6569, -27730, -42038, 66928, 117265, -11002, -14083, 82937, 82730, 135761, 183129, 137406, -46164, -201433, -154786, -122527, -72947, -35695, -33434, 26498, 25806, 118458, 74202, 104713, 97073, 46579, 15504, 28586, -7205, -128806, -175682, -199326, -312612, -308997, -302816, -182839, -199326, -236999, -131311, -29545, 4718, 6696, 65931, 75944]
16918G5944q1660K317P3173J9697K3665L3337o1032m3262l0837j22957o5702M243
16906a73074L4851P0042J26004j2934p5224J30459K0999L376n3549j12000J15647
16895G4597J19137k7465o0148o766j06857K8747k8379J23411M3524j1295k8091
16884A20415j73987j50972J68437O5828j18354j16484k8635p3563L3177J80617
16874i3521R9355J3672Q5079l9267j73993j4441O8382q0291M4265L8822q5391
16863a37329N1156J24268K4610r6064N1712J80025K5916j29933j9512n5654n106
16852A4089P6986n2649j14851j93895q0273J93427J64914j3330l6583L874L5938
16841b353J8920k3641L0117j25132r790R0970k9712q6629O7553O363r8948J11212
$$ y = [75944, -5716, -3399, 69774, 89471, 113136, 146473, 85441, 42179, 11342, -111615, -177317, -173074, -138223, -68181, 57823, 44889, -30335, 100124, 121123, 124499, 70950, -41050, 74597, 193734, 166269, 106121, 99355, -7502, 21245, -7134, 116277, 159801, 148506, 120415, -53572, -204544, -36107, 29721, -88633, -205117, -233752, -307315, -274138, -93521, 5834, 19506, 104585, 65318, -108675, -123116, -54734, -135025, -90760, -51938, -137329, -86173, 38095, 62705, -33359, 18353, 198378, 224294, 94361, 74849, 19195, 14089, 91075, 38426, -76425, -270320, -350593, -157166, 7748, -5582, -42165, -38291, -2353, 16567, -7074, 23043, -102089, -111879, -20909, -50621, -137250, -69697, -63334, -162282, -51070]
16829e1070Q1061m4069k4213J00806P9905K3859j11771r0058J6475J3569R7278
16818I1772N2895m1857r1320Q6957O5360P756J4912r0288m2754J06344o432o2444
16806I0901M419N9269p2642l8884N1026P6585j19039k7393L3295j0836p6906j02054
16794a32259O3701O4842j02826L475r4489J8316l5039q6880K44240J86004l8923
16783I0162n5043l8463L6830p3322N3224O4955L9684l5652j26070n0402R6804
16772B707N7707J3291O1097J63812M2766Q680p8690j34962m6582R384j61608J8888
16760d3510R8402j07390r753J07665L2565r0183R9107J35194m454k5678M182K4808
16748B20955p9005J801M0697p3664m9070m2776o3618K0020j36580j06294J3097
$$ y = [-51070, 29991, -14078, -38291, 62515, 142420, 166279, 54508, -35550, -19075, -5506, 91772, 144667, 102810, 11490, 98447, 163807, 171563, 186475, 96187, 53433, 159777, 153345, 90901, 95320, 154589, 81947, 43063, 94089, 170674, 51635, 24242, 57537, 46701, -30205, -132259, -68558, -3716, -106542, -103067, -197556, -179240, -214279, -301159, -56919, 129085, 90162, 35119, -3344, 33486, -39836, 13388, 78343, 118027, 82375, -43695, -94097, 2707, 60414, 73705, 134802, 298614, 341380, 350060, 271370, 136408, 89826, 99210, -62398, -43510, 54892, -52498, -62251, 45414, 77979, -12204, 86903, 222097, 217643, 191965, 196147, 220955, 141950, 143751, 184448, 110784, 61714, 18938, -44680, -24660, -161240, -267534, -254437]
16737b54437K30740P2466j38900l8233J2492Q5119R7007k4571l9934o1460j1282
16726g0993N6478l5981Q1390M8712r5695N8545J09050j6435r3557p7253Q846q149
16714c5042K5763j2268r8372k1584P0790J3903q695j85617M3319J10125m5157
16703a42835j47116j06448J49649K02642J28687R1758j45648r6625m3779J7833
16693i1882J19681o6280J4166K647j05256p0007O1608J54805Q3813j22865M4294
16682B4724K7741L1008n1933r983q51j04605m1715J3377L1891m6457J03707q396
16670c1492l4332n9579j14381N454J2951l2190O799P3434K8404J0123n7148J5368
16658a76589O9200J8778L0801k6117J10620K69397o7285j1604r621r3308q7054
$$ y = [-254437, -23697, 48769, -90131, -128364, -115872, -30753, 66254, 41683, 1749, -59711, -70993, -14515, -50496, 30894, 79606, -16089, 42456, 151506, 135071, 41514, -35739, -26893, -35042, -9279, -21547, -119919, -141503, -70713, -56810, -65505, -251122, -207803, -97678, -142835, -289951, -396399, -246750, -44108, 84579, 176337, 30689, -65936, -109715, -91882, 27799, -38481, -24315, -21668, -126924, -196931, -135323, 19482, 103295, -19570, 24724, 52465, 83473, 31540, 21557, 20706, -83899, -125614, -112237, -80346, -126803, -23096, -31492, -65824, -125403, -239784, -234330, -221379, -253569, -246770, -173336, -144932, -134809, -191957, -176589, -107389, -88611, -57810, -83927, 26693, 296090, 228805, 217201, 207580, 114272, 27218]
16647B7218r606q1032Q0169K11977q573j58826j16451J56717J02999k3158n5698
16636A25736k5406k1588N9537r9088j96396j77255M5215J87421Q8577j6576N5513
16625B5690P758l0570Q0329P5288j75976j77879j49954J4756O7724l9253k5312
16614c27399k9569n129Q7298J35915J04794J04138L6222L4617R9411p3667j43972
16603B2659r5500o5581j08797k4635O0844L3661J12142M9028j51906K7503L06
16592a40276Q1111J14422p7430j96603l7030Q6103L8965j5050J5901K289m6683
16581a74281r7972k0448R9432J91560J00304j06165j32611l5935k354Q0056M2496
16570e5918o1069J04169j12399o1385l6906J07731M5271j0363O2304j29479L440
$$ y = [27218, 17612, -63420, 16749, 228726, 220153, 61327, -55124, 101593, 204592, 181434, 125736, 100330, 78742, 138279, 39191, -157205, -334460, -289245, -101824, -13247, -29823, 25690, 33448, 2878, 83207, 158495, -17481, -195360, -345314, -330558, -262834, -302087, -327399, -356968, -362097, -274799, -138884, -34090, 70048, 106270, 140887, 240298, 166631, 22659, -72841, -138422, -247219, -271854, -211010, -177349, -65207, -16179, -168085, -140582, -140276, -59165, 55257, -22173, -218776, -255806, -169703, -130738, -145788, -129887, -127598, -174281, -272253, -292701, -193269, -1709, 98595, -7570, -140181, -176116, -178470, -98414, -55918, -116987, -12818, -125217, -186602, -223508, -115777, -70506, -80869, -18565, -148044, -144604]
16559a44604l6659m7983J12248O3059j3713o7955l6095J5341l6216R282J74333
16548h962p9771L940L7474L8283n0878o2948j04170K4803M4486r9096K7283R1782
16536a37774J69776O1453m9042j41433j40308l910J73851J38662k3540j12381
16526f4646j8575p2464o3205n1547L4146M9338O4866L8983L7732M4856p2244R4308
16514B1548J252K9460n0903j2188M4122r301j29296J6904p9733J04152K5259L0549
16502h175K5706o8661j39856j4919J15319K0297r1401R5995K7335k6441k6720
16491i1521m4115p908P6388Q22p0365m898n2480r0221J35482J11662j08189k6134
16479a71477L8840j3087K2666N9149j41680q0057J19923P104L8804J40190q777
$$ y = [-144604, -181263, -229246, -116998, -53939, -67652, -135607, -171702, -156361, -192577, -183295, -8962, -88733, -84793, -47319, -9036, -59914, -122862, -227032, -202229, -157743, -256839, -229556, -137774, 32002, 93455, 44413, -97020, -237328, -241238, -67387, 71275, 47735, -64646, -83221, -155685, -218890, -270437, -236291, -186953, -122087, -83104, -45372, -516, -72760, 21548, 22800, 52260, 1357, -10831, 33291, 23990, -105306, -88402, -168135, -63983, -38724, -8175, 17531, -51130, -190986, -205905, -90586, -70289, -161690, -65695, -38360, -64801, -91521, -135636, -143544, -67156, -66334, -136699, -141597, -194077, -284298, -148816, -37154, -145343, -171477, -132637, -145724, -123058, -63909, -205589, -285646, -165723, -158619, -119815, 20375, 11598]
16468A1598j04030j3009P2643P1896l3794l3536l8235J72812k1322j28462j26847
16457a70286O7345J3023O5774j5916n807J01547Q0342j72927j55503n5170m3602
16446b91180J20829J69508J08319k3957k455J67275R4784k71776k6179M6342o5827
16435B5683j03318J34838J62343r6578p9780J11032j25287j14438n6790J37596
16425d699l770l9124M2819k10J38972Q4793R5653N0326q2919p5950q4925M8220
16413A69186o1964k4251P2252N0737M0457o2466p1077J6572J80912l5205j01620
16402A73533N505o699l6279L4425J41329k2882j15291r5467k1939q1703o088R1781
16390F0225O4169l2736j61313O1361K11226O350j53027j68802j24748N1177J18162
$$ y = [11598, -92432, -105441, -32798, 39098, 5304, -28232, -66467, 106345, 85023, -43439, -170286, -102941, -89918, -24144, -40060, -45867, 55680, 136022, -36905, -192408, -247578, -291180, -170351, -843, 107476, 83519, 81064, 248339, 343123, 71347, 45168, 91510, 25683, -77635, 57203, 219546, 122968, 43188, 154220, 28933, -85505, -142295, -4699, -8469, -47593, -4774, -4984, 133988, 218781, 314434, 364760, 281841, 205891, 120966, 169186, 107222, 82971, 155223, 205960, 246417, 183951, 112874, 129446, 310358, 275153, 173533, 179038, 172339, 136060, 170485, 311814, 288932, 173641, 78174, 56235, -25468, -31556, 60225, 124394, 91658, -69655, -8294, 202932, 209282, 56255, -112547, -237295, -186118, -67956]
16379f7956J03721J0088n3575k286Q2204j58921j97482K2301J07609M3889p7169
16368a87577j29181N6262Q8263J34484j4544P3170K1448N8540r3824r5012Q89
16357h7082P5196n6064j44235j4522J34792R6241R779l6027q3898j0210J8773
16346i7257q8307p0515j19999P4116J60889P7859q5804M9686J11730n0965p1350
16335a09917K2007J13664J40942J62769k0j82832j00010k0700j11901m6562M7324
16324h5236J32612j2472j65636l1628P4384L0537P7170m9693k9346Q5807o2313
16313c5814Q121M2324j00167m3876J04420r1312m1734O2246M2444N028K3604l2650
16301e7366K4112P4456q555j7686q9297k017Q4200o0459j74308n5724Q2866R2669
$$ y = [-67956, 35765, 45853, -7722, -10008, 72196, -86725, -284207, -261906, -154297, -110408, -187577, -316758, -260496, -172233, -37749, -52293, 20877, 42325, 100865, 7041, -87971, -87082, -11886, -67950, -212185, -226707, -91915, 4326, 14105, -21922, -105820, -116030, -97257, -185564, -256079, -376078, -301962, -141073, -63214, -149018, -99332, 12398, -38567, -109917, -87910, 25754, 166696, 329465, 329445, 146613, 46603, 25903, -85998, -132560, -85236, 47376, 34904, -130732, -162360, -87976, -57439, 19731, -29962, -59308, 26499, -35814, -27693, 14631, -85536, -129412, -24992, -116304, -158038, -95792, -53348, -48320, -24716, -57366, -33254, 41202, 32647, 14961, -74336, -76353, 7847, -52612, -226920, -282644, -199778, -107109]
16289a07109M9428m1288o0264k14359p3207R8983N7472J43768J00558K6381J00760
16278H1123L0158o9528j8571O6823q6993m7529n3830q6583j61195N6767R7378
16267a91980R7192J05220n4598j19342j1581O5192j608K0242m4146N1009K4721
16256e9679j0468m4080O0756k5563l4014j07384R964N150o0795J07378R1537L0942
16244c6256Q3642j8837o0664n97l1611J15339M4849r1979N9994N899N2079l6830
16232H5028J0946N8794P5621r0452k36721j06807K08088J62675m0362r0003m5627
16221h820m747N6110R2632j00359j17117r7681Q1619R3867P7050j7895l9451j41827
16209a26619Q8852N4068j33388j39657P3369P5445P0398o9364n2973k1630m7569
$$ y = [-107109, -57681, -98969, -159233, -373592, -446799, -347816, -290344, -146576, -46018, -19637, 81123, 111281, 41753, 23182, 90005, 3012, -44517, -98347, -184930, -346125, -289358, -191980, -94788, 10432, -44166, -163508, -175089, -109897, -111505, -91263, -135409, -84400, -59679, -70147, -114227, -53471, -79034, -113048, -220432, -210468, -205318, -266113, -158735, -67198, -36256, 47386, 28549, -32115, -32712, -64323, 51016, 95865, 3886, 63880, 69779, 121858, 85028, 95974, 154768, 230389, 139937, -96784, -203591, 4497, 167172, 126810, 36807, -8820, -13567, 42543, 135175, 34816, -82301, -179982, -98363, -4496, 72554, 54659, 15208, -126619, -37767, 16301, -117087, -256744, -183375, -107930, -37532, -106896, -159869, -181499, -229068]
16198b29068R8013P3114r1591L3728J03686N0438M5226j66779j27552J79783J49884
16187A18882m2554L1549p3328m8555j0158m7145J22746P6819O5220j36387J8194
16176G5283m1317j56578L1191L2411N8891K1490k0109j06207j11416L781L4300
16165a78280n3706N9732k3534j8355N5890P6450J3171O0449K7324j5334n8630
16154e4823r5952J3612k6883M2667L297K6908J33128j5664j68997L5696L920J62177
16142E9086k9891o7711j0454l9033J1501J3839j4834Q9796o3243K7647J76349
16131A53052j2169j36686k8675l5355o4455k25990j9823J67295M5141N0141N986
16120a01538p6674K2195J52126P2280R717J51872j02323j98426k1606R7150P6227
$$ y = [-229068, -131055, -57941, -149532, -115804, -12118, 38320, 83546, -83233, -210785, -31002, 118882, 76328, 107877, 34549, -14006, -24164, -71309, 51437, 128256, 193476, 57089, 75283, 33966, -122612, -91421, -59010, -119, 21371, 1262, -104945, -216361, -212580, -178280, -231986, -172254, -195788, -214143, -158253, -81803, -68632, -8183, 19141, 3807, -54823, -150775, -137163, -164046, -121379, -118082, -91174, 41954, 26290, -142707, -107011, -103091, 59086, 29195, -38516, -48970, -88003, -76502, -62663, -77497, 12299, -50944, -23297, 153052, 140883, 4197, -24478, -59833, -124288, -350278, -370101, -202806, -157665, -107524, -101538, -178212, -156017, -3891, 68389, 78106, 229978, 127655, -70771, -92377, 4773, 81000]
16109H1000N749P0691J1853J742l1643j37159j46868M9458O3926k5325o5764r01
16097a23241O596K00479O5902j16752j55493R2435j8n5280O9772J6453q5468j22657
16085b07272r0631j0033O8880P7635J70341R3791J275P374O7558k32247k6824
16074h0153j15126p6310r879R978o115k7605R97Q6411Q9807k0277p3158r1544
16062c12974N3039K61246J07723n6812l9188k732j02318j27436J32219J31267
16052D4034J7095j29456L2171M3354j23853M3295o5860n2947M8579N9727K03880
16041A20019Q6376j77565j12117M9040R8371N3208p4463j14640k4510j9038J36831
16030B1512J22820j374j31617j16367O8043r067p2912j30738J11629J15453R2978
$$ y = [81000, 86749, 157440, 169293, 171035, 139392, 2233, -144635, -95177, -31251, -56576, -122340, -123241, -116645, 83834, 149736, 32984, -122509, -30074, -30092, -85372, -15600, 853, -84615, -207272, -297903, -307936, -239056, -161421, 8920, 102711, 103986, 111360, 178918, -53329, -80153, -195279, -271589, -281468, -271490, -277605, -305210, -304213, -217802, -127995, -148272, -221430, -312974, -259935, 1311, 109034, 52222, 13034, 10302, -92016, -219452, -87233, 44034, 61129, -68327, -36156, 7198, -116655, -73360, -139220, -192167, -143588, -83861, 120019, 206395, 28830, -83287, -34247, 64124, 117332, 42869, -71771, -96281, -115319, 21512, 144332, 142958, 11341, -105026, -36983, -46050, -118962, -249700, -138071, -22618, 70360]
16019G0360p299j4728o4922o6050k1929M0460R6241L9475L2936l5183p5037j56709
16007a62385J7136J63006J21716j5764p6492J265K6880K6530J28199p564j71393
15996E1134j47111l9982J51400L1597n1398l8832J7570J93943r1593j18579J3485
15985b8366Q858J03718p3820q6565O491J4679R891j03303J06036J31498M1711
15974A30828j36794j7122J17589q2975n5203o9971J01426O6776N2292k1680p1992
15963A3174j78473j3160J58421K09725p70j39203n2774n7358n6362j6721J76083
15952D2582N8639L1123O4671j21957o1490m4406J0317J17621O7395j9984n7823
15941H6688J00703L6688p4423j28961k8917o160l8489q2716j18075r2378N5502
$$ y = [70360, 63061, 48333, -16589, -82639, -104568, -64108, 32133, 71608, 104544, 69361, -5676, -162385, -145249, 17757, 139473, 123709, 47217, 48482, 75362, 101892, 230091, 222527, 51134, -95977, -135959, 15441, 47038, -4360, -43192, -25622, 168321, 76728, -41851, -28366, -19508, 84210, 10390, -76175, -69684, -55005, -45114, -148417, -42381, 89117, 130828, -5966, -23088, 94501, 11526, -43677, -113648, -12222, 54554, 106846, 85166, 13174, -165299, -178459, -20038, 189687, 188917, 49714, -3060, -60418, -116780, -133501, 42582, 101221, 132344, 197015, 75058, 13568, -30838, -20521, 97100, 164495, 144511, 86688, 187391, 224079, 149656, 20695, -8222, -14382, -52871, -135587, -253662, -346040, -290538]
15930b90538O8704l2348k5122J7349J500K6271Q608k3055J12881l330J03404j3018
15918d8694j28866P5125R8569O7127N262q1592j05096l5068O4203J69319M3209
15907A23498r7866n3202K3150j0952q7453q6964M0904n3977K7355J02091N7930
15896a5486k4930q3933o4262m9836J65030J12778J2965Q2865r4336M056O9228
15885A14139n9664o8080L8869o4567o6984L5868p9038N0006K9849J2981N2971
15874c650j92917m570Q5414k2656j29166J15390R1111K3344j5075l4209l4565
15863a21549j2590q0504j4114P6303K23176Q3260j17944j1659J6745Q6024K4688
15852A51836q1814p6347j56284p0145P3728q741K9287L4781P6578Q6486o5140
$$ y = [-290538, -221834, -254182, -279304, -261955, -260455, -234184, -225576, -248631, -135750, -139080, -35676, -48694, -177560, -102435, -3866, 63261, 68523, -13069, -118165, -153233, -89030, 80289, 123498, 25632, -27570, -4420, -15372, -102825, -189789, -148885, -202862, -175507, -73416, -15486, -40416, -124349, -188611, -238447, -73417, 39361, 52326, 135191, 40855, 44911, 114139, 54475, -13605, 25264, -39303, -106287, -70419, -149457, -99451, -69602, -56621, -3650, -196567, -201137, -115723, -138379, -267545, -152155, -61044, -37700, -52775, -86984, -121549, -134139, -214643, -228757, -152454, 70722, 153982, 36038, 24379, 41124, 127148, 151836, 70022, -6325, -162609, -232754, -159026, -167767, -138480, -103699, -27121, 59365, -5775]
15841e775j16148J5873R4024J80761K5753j16056j48604j36303J4763o4588L8183
15830b18117J37871P4044p7483m6239N3018n0087O3112j6414q586O673p5273k0116
15818a77597q2767L4458M7510N235O1945Q7020O4388o421l3150o7874j8045J42006
15806E6708m4867K2190n6030j18884K0472k1773N84P8236M3903J18884R5805L6651
15794B31879k3534j07550k3077l7197p6431j00975O3699M9765P4767n2055k7179
15783b7888K1276K8514n1905k2602O7925k03604l8037J82248j9852j04451P6247
15772i2129J38563l249R0416R9811l5710k10389n2338K2947k7764M2619j089j26187
15760a54499l1534K00021L1376j2401l739p7212p8803J46211J67635R6226p2969
$$ y = [-5775, -121923, -106050, -12026, 168735, 194488, 78432, -70172, -206475, -191712, -256300, -218117, -80246, -6202, -83685, -129924, -76906, -126993, -63881, -80295, -88881, -82208, -157481, -177597, -260364, -225906, -178396, -173161, -111216, -24196, 40192, 33771, 621, -67253, -85298, 56708, 11841, 34031, -21999, -140883, -120411, -142184, -141600, -63364, -19461, 99423, 195228, 231879, 208345, 100795, 77718, 40521, -35910, -136885, -73186, -23421, 51346, -709, -27888, -6612, 21902, -30003, -52605, 15320, -188284, -226321, -44073, -63925, -168376, -92129, 46434, 43185, 133601, 233412, 197702, -12687, -65025, -42078, -69842, -27223, -28312, -154499, -186033, 13988, 45364, 32963, 29224, -47988, -126791, 19420, 187055, 283281, 210312]
15749B10312q2354o4233J5433k92l8718J7351r709J36482l5690r0810J76033J23109
15737C56914k3834j0316j46084J5658L4057p2672r6301p6027j5487R1724j6672
15726D0960n011j79180j50924J34791J56327p374m9360l1124j5975J27903P973
15715B9006l6501j504n0217l4584J78843k2331l0962m403R8547N0252j35281o1596
15703b0731J06387P8979j4515o77n7499j5883j9320r8372n429j05429N7531O3920
15691c1038K5706J08947N1437R4070K6126o3512k4233l8930J6927M2526j59351
15680D8675j10200q4174L8323r0036n2004J14817J4239J25134k4889n3146p303
15669h0564k673R1732p3121r8892N0657k7508q7952N5931L2235J08405M587p2826
$$ y = [210312, 127958, 63725, 79158, 78866, 40148, 57499, 47790, 184272, 148582, 57772, 233805, 356914, 333080, 322764, 176680, 192338, 226395, 153723, 57422, -18605, -34092, 57632, 40960, 35949, -143231, -294155, -159364, -3037, -10411, -59771, -90895, -106870, 21033, 29006, -7495, -8999, -59216, -93800, 85043, 62712, 31750, 27347, 125894, 176146, 40865, -20731, 85656, 164635, 150120, 149443, 91944, 76061, 56741, -41631, -47060, -152489, -94958, -31038, -5332, 103615, 155052, 249122, 275248, 211736, 187503, 148573, 165500, 208026, 48675, -61525, -145699, -107376, -197412, -249416, -134599, -120360, 4774, -20115, -73261, -80564, -83237, 8495, -64626, -163518, -112861, -140369, -228321, -172390, -140155, -31750, -27163, -99989]
15657i9989j6600K4310J00356R2331P670m7226o4039J874p105O9139R5616P1052
15645B27389r5610j6274k0157j52947n5645r6193j50162r5679J46128J42848J66558
15634B56J6033l1619o9085N6342J79798k3887p4282M7156n6775j21299j45060
15623b22422N9550L1549J73010N1997m6905P898P4573J28021j2558n180j0893
15612B28640k3734N3621l7604j84497n2980O8718L775J0527J04380r310r7603
15601F3933p0472J32630Q7046j17795q1472m8033N1629j1686k1712Q5403r7546
15590b8075L3016l5117p5526m1381O876J32730L4121q3626j65336j01308O8140
15579b55486l2068J15071L7391O664q7285P7005Q2783L9140O215j16969J1112
$$ y = [-99989, -116589, -92279, 8077, 100408, 108078, 60852, -3187, -1313, -8418, 60721, 156337, 227389, 131779, 115505, 95348, -57599, -113244, -209437, -359599, -455278, -309150, -166302, 256, 16289, -15330, -84415, -28073, 151725, 127838, 53556, 100712, 43937, -77362, -222422, -162872, -131323, 41687, 93684, 46779, 54677, 129250, 257271, 244713, 239533, 228640, 204906, 258527, 220923, 36426, -16554, 52164, 55939, 66466, 170846, 161536, 63933, -6539, 126091, 213137, 95342, 13870, -34163, 17466, 5780, -15932, 69471, -28075, 4941, -30176, -105702, -147083, -140207, -7477, 26644, -56982, -222318, -323626, -255486, -287554, -172483, -135092, -128428, -215713, -138708, -55925, -16785, -10570, -127539, -116427]
15568a16427Q080O8724O8137R0818j56761L4671l3986m2436p4470l1494J73213
15557a1931J32192p7171j38571j28835N516L8448L9437o4668r9144Q9611P6885
15546a38231Q3489J03280O1082o3086p1638N9519j51042J0807Q4188R0832L5913
15535A05113j20336o3283n7284p3078m626P3117J22323j36376K1605L9720R9918
15524F813l8357l9000K8294N4724q9411j08864M0024m4049P553J09112N5778Q058
15512i325M6693l3601O0353K5092j34321o0414L9613k5129J10855M7332p253k3381
15500C6514J63178P1513o6127n9140j14789q3191J66420J4967j03076M0739O8799
15489A35807k6825J9355M9424r2265r6688N0905L1715J6078j00282J17314r1306
$$ y = [-116427, -108347, -39623, 28514, 119332, -37429, -2758, -36744, -79180, -153650, -185144, -11931, 120261, 43090, -95481, -224316, -218800, -180352, -140915, -205583, -304727, -215116, -138231, -54742, 48538, 109620, 46534, -25104, 34415, -116627, -105820, -21632, 69200, 105113, -15223, -78506, -135790, -208868, -213494, -140377, -18054, -154430, -132825, -93105, 6813, -31544, -70544, -42250, 12474, -76937, -185801, -145777, -189826, -182273, -73161, -17383, -9325, 37368, 3767, 64120, 89212, -45109, -105523, -65910, -91039, 19816, 67148, 59895, 36514, 199692, 271205, 205078, 145938, 31149, -52042, 114378, 129345, 26269, 67008, 135807, 108982, 128337, 177761, 85496, -11192, 39713, 71428, 87506, -12776, 104538, 13232]
15478A3232q2945J02870J50158J2330j10396L0476j6120j39116j02329k4523j31134
15467b97497N1404R1250M1763K721N4264J4236L1809O5194o593K1714K8158p1024
15455B7399o4624n176J20113P9674q2776M7077L0352j13519j23879p9008Q8328
15444g6039K3760R519j1259J6096j9752r1733j25981J00057P8014K7536J16772
15433D6990l0620j44547N6487O3603l0479n6747M137q7936R6338o9525n022J04325
15421e2996J10535m201q4939j25918R3560k2373o7584J19638n5018r5807m3397
15410b28500L6592J9444M013n2729J1780N4066k3199l4419J00192m1927K0877
15399a33810q0236o7712o9714k0469J12712J51340R5744O3293j9932j00822l9531
$$ y = [13232, -69713, 33157, 183315, 195645, 85249, 115725, 99605, -39511, -141840, -166363, -297497, -246093, -154843, -113080, -110359, -56095, -41859, -10050, 55144, 48551, 70265, 98423, 27399, -37225, -42401, 77712, 157386, 74610, 121687, 152039, 38520, -85359, -164367, -76039, -52279, -42760, -54019, -37923, -57675, -149408, -275389, -175332, -97318, -69782, 46990, 16370, -128177, -71690, -8087, -38566, -95313, -91176, -179112, -82774, -152299, -157321, -52996, 57539, 53338, -31601, -157519, -63959, -86332, -153916, -34278, -89296, -185103, -228500, -191908, -172464, -168451, -221180, -209400, -155334, -178533, -212952, -112760, -154687, -133810, -214046, -281758, -351472, -371941, -259229, -107889, -12145, 51148, 31216, -69606, -109137]
15388a09137j83263m1759J42600J46723r0359P7201M6249j15595j02247O9927
15378a59660K42075o1520N978j21405R5995J28384l9352o8536l843J6171J12461
15367A46748n9435k24165q7231k757J24708J00866k6967O4294p9169r6398J43491
15356C985N2354k3718m1404P7520N4410M862L9069P6497j11417l9511N7876K262
15344A52785q8848L0337k911M068k6867n4368M9759K895J2000l3215l8676K2732
15332B9691k3337k00p2584M2175Q8115O0864j49226j48483p5647J23510J34398
15321I276M8528o2043L387N1299q1007k0672P0789J09537Q6922m8678k23125j18033
15309a73820J27086L1276j56861j38968J41590J92868O7374q4523j66635j9406
$$ y = [-109137, -292400, -334159, -191559, -44836, -135195, -57994, -11745, -127340, -229587, -159660, 82415, 20895, 26873, -94532, 1463, 129847, 90495, 21959, 18116, 34287, 146748, 87313, -136852, -224083, -226840, -102132, -1266, -28233, 36061, -43108, -139506, 3985, 56339, 32621, -8783, 68737, 123147, 128009, 167078, 243575, 132158, 92647, 150523, 152785, 63937, 94274, 91363, 95431, 68564, 14196, 63955, 66850, 78850, 45635, 6959, 29691, 6354, 6154, -66430, -24255, 63860, 124724, -24502, -172985, -248632, -125122, 9276, 57804, -4239, -852, 50447, -30560, -51232, 19557, 129094, 216016, 167338, -55787, -173820, -46734, -15458, -172319, -311287, -169697, 23171, 90545, 6022, -160613, -180019]
15299a80019J28180K02387J1178l8269j05139p6668k7527J06677o2218j45366
15289a86784J75622J51986P147L4683J06432k1895j0239K6605m1461l0738k0655
15278A90703j47378Q4438L0105n3746l786k8143N3209o9766O1043R8575J10350
15267C25604r2224O5625j2677O8810j29406j28644n524J73392P6360o5778k2260
15256B53278R432R6278J71692J77978J48772l0421O8157J97067L55012J61580
15246A608825O3270j14534k09817L0704j13379j88565k29871j48895j18270K8598
15236F08066j8041r6623n0872l2576l4979j12856m712O3708j2118r7019m1001
15225A70977j27134l0231o759L9775K1825K6191l0636m9547l3329j20528m0373
$$ y = [-180019, -51839, 150548, 161726, 123457, 18318, -58350, -85877, 20800, -41418, -186784, -11162, 140824, 147971, 182654, 289086, 267191, 256952, 283557, 242096, 211358, 190703, 43325, 127763, 157868, 104122, 100336, 72193, 125402, 55636, 116679, 215254, 325604, 233380, 299005, 286328, 355138, 225732, 97088, 91564, 264956, 341316, 275538, 253278, 262710, 358988, 530680, 708658, 857430, 827009, 895166, 1092233, 1447245, 1608825, 1672095, 1557561, 1347744, 1378448, 1265069, 1076504, 846633, 697738, 579468, 608066, 590025, 493402, 442530, 409954, 374975, 262119, 257407, 321115, 308997, 211978, 170977, 43843, 13612, 6853, 46628, 68453, 94644, 64008, 14461, -18868, -139396, -179769]
15214a79769R2997Q0127J32497M5908j4930P7363N7612L0890j33363j65289o6316
15203d2273o1261J34936k1637m1658m8827j06915K0959J37889l2633O5559J25347
15192A29486M2770n4641p836j48180r8194l6537J37964J41339O1986j58189j3645
15181c677J32802l6652r991m3328J03854P0803j44504k8454m2291n381L4810q5394
15169e7403n8083J96302N0600j79908j1867J29226r772j77031P4090K150m9863
15158i1559K7753M9970j11587l0128Q941Q240J20782N5987K3300l0085m2479o3964
15146g4829J09584J986j00919k170J6415r4889J2228j13356O148L5955Q4918l3191
15134a52120J2133K7939P7832Q7424o1748M7748o9043n5569Q4086k5728j29813
$$ y = [-179769, -86772, -6645, 125852, 171760, 156830, 234193, 291805, 322695, 189332, 24043, -42273, -103534, 31402, 9765, -31893, -80720, -187635, -166676, -28787, -61420, 4139, 129486, 172256, 117615, 109779, -38401, -136595, -173132, -35168, 106171, 168157, 9968, -3677, 129125, 92473, 82482, 39154, 143008, 213811, 69307, 40853, -1438, -6819, 27991, -57403, -115486, 80816, 131416, -48492, -60359, 68867, 59095, -117936, -43846, -41696, -91559, -63806, -13836, -125423, -155551, -146610, -138370, -17588, 38399, 61699, 31614, -10865, -74829, 34755, 36741, -64178, -66348, -49933, -144822, -132594, -245950, -239802, -203847, -118929, -152120, -139987, -112048, -34216, 53208, -8540, 39208, -29835, -85404, -1318, -27046, -156859]
15123a56859J858K4835k0134m5399j00413L6102J39968Q2356K0215J31424N034
15112A18987j5567J2991p411j77455n9394J25317M3474M9291m5164j27803k3356
15101a06090L0915M6228n2857J14161n9178m4131p9869M3839J40887K9063q1832
15090a8864J23657J32828P1029p9068n5034m7232j2901k8111J04775N2915l5194
15079B08800M505p6184r219q9573j46406J59531J25965j04829n6147J9916k2927
15068A3432n4408k4933l3410Q8192J4323p530k5924Q2402J07929r144j30578K9319
15056D9670R4829j4281K2482m321j83740Q3556R8760O8758N5360N9999n8881J2465
15044B84656r1321j01797J35269J23829R1066P9253Q1253p7665l5195O0050m6173
$$ y = [-156859, -155001, -130166, -150300, -195699, -296112, -260010, -120042, -37686, -17471, 113953, 118987, 103420, 116411, 109000, -68455, -127849, -2532, 40942, 90233, 45069, -82734, -106090, -75175, -28947, -81804, 32357, -26821, -70952, -150821, -106982, 33905, 62968, -18864, 104793, 237621, 308650, 229582, 174548, 127316, 114415, 86304, 191079, 243994, 208800, 213305, 137121, 127902, 38329, -108077, 51454, 177419, 72590, 16443, 36359, 13432, -40976, -65909, -99319, -11127, 3196, -4334, -30258, 52144, 160073, 150929, 20351, 49670, 144499, 130218, 152700, 148379, -35361, 48195, 146955, 215713, 271073, 331072, 272191, 284656, 193335, 91538, 226807, 350636, 441702, 520955, 602208, 524543, 489348, 549398, 503225]
15033E03225j00240r8087P9180p8804j63146N414L7336L9551O0221N3573Q3177
15022D21400m370j21680p1232L0934M5773l6962J2075J144N6918j01195k2143
15011B10662L6713O8164K3754o0554j9053o4192K3224q1028J23249n6662j24966
15000G9311K1918J4348J54267J56768j50789m4160J05449K6494O3747J25990J28784
14989F82127L4354L4187m7502o0049q2775n934J3355p0954p1328o1426L2604J02789
14977D99448j59204j66726o0025p2588o9887N8297J63987Q1117q9408r8822M051
14966I0240j4951j15333J02039R8064q9442J23065P0247p1602M8472p1609j7633
14955A51557o1921p4603M5117j6444o1264o9922O3221J85277K3365p3219j5950
$$ y = [503225, 402985, 304898, 384078, 305274, 142128, 147542, 184878, 224429, 284650, 338223, 421400, 417030, 295350, 224118, 255052, 300825, 263863, 275938, 277082, 334000, 232805, 210662, 247375, 315539, 339293, 278739, 259686, 195494, 218718, 137690, 260939, 204277, 79311, 101229, 115577, 269844, 426612, 275823, 231663, 337112, 363606, 427353, 553343, 682127, 716481, 750668, 703166, 643117, 560342, 554408, 567763, 496809, 425481, 364055, 396659, 499448, 340244, 173518, 113493, 40905, -28982, 29315, 193302, 274419, 185011, 86189, 90240, 75289, -40044, 61995, 160059, 70617, 193682, 263929, 192327, 240799, 169190, 151557, 89636, 15033, 60150, 43706, -17558, -87480, -24259, 161018, 184383, 111164, 95214]
14944I5214M2041J70115R3590q9778m2618j1523p0130J3364m3567M86K1268N4054
14932B32516j48388N3488N4628M4408O8145J40119R8475k5538j21293q4036R5394
14921D07918R5552o5326j37303p6504J84357N2961l352K0795J43657j16419o6896
14910D39440J09510L6786Q691O3893m4485o6372r8720o1323o4411J35042J7037
14899D75088r1303j32839j25923N5088K70998N0352j77350j02902r6998N0569
14889A74780J32713N4003K2503M1650L975P2712k7114J6663N8800J06439Q0356
14878G37480M7255j08611q2821L5381J8789j14959p0824l3829m0179L6430m83
14867D23629Q6103K56041J95186m4787K2952j8880O9005L7843N9372n78n3496
$$ y = [95214, 137255, 307370, 400960, 311182, 268564, 257041, 186911, 200275, 156708, 157194, 178462, 232516, 84128, 137616, 192244, 236652, 304797, 444916, 543391, 517853, 396560, 312524, 407918, 503470, 438144, 300841, 224337, 408694, 461655, 458303, 479098, 622755, 506336, 439440, 548950, 585736, 594427, 658320, 613835, 547463, 448743, 387420, 323009, 458051, 475088, 383785, 250946, 125023, 180111, 451109, 501461, 324111, 221209, 124211, 174780, 307493, 361496, 383999, 425649, 429624, 502336, 475222, 491885, 550685, 657124, 737480, 784735, 676124, 593303, 628684, 647473, 532514, 461690, 427861, 387682, 424112, 423629, 509732, 765773, 960959, 916172, 939124, 920244, 989249, 1027092, 1086464, 1085886, 1032390]
14856A032390j8118J11177L2701q6237r569P651P2671Q4346N1141Q9336J18196
14845A485685J23027J62294R5144J9063m229o2818M4067Q5063P3123N5602k4475
14834B051546P7140J33526J31045J69479J89213J78238K33029K70496K72029J36847
14824C842588P9891J44957J44634J91130K60711K64878K05343J58649L16566M43728
14814F053075K61849L54872N54366P13855O65222O81058Q21504R70304J129341
14805A2205446J152985J168021J460925J559172J759643K141519K444367K911386
14797B6803464L555577L980452M752711N468644O204257P561769R637637J2390844
14789H0355355J6644576K2541630L0021890L8304389M5956237N0511363M9209520
$$ y = [1032390, 1014272, 1125449, 1158150, 1071913, 1062344, 1069995, 1142666, 1227012, 1278153, 1367489, 1485685, 1608712, 1771006, 1866150, 1885213, 1880984, 1818166, 1862233, 1947296, 2020419, 2076021, 2051546, 2128686, 2262212, 2393257, 2562736, 2751949, 2930187, 3163216, 3433712, 3705741, 3842588, 3922479, 4067436, 4212070, 4403200, 4663911, 4928789, 5134132, 5292781, 5609347, 6053075, 6314924, 6669796, 7224162, 7938017, 8603239, 9284297, 10105801, 11076105, 12205446, 13358431, 14526452, 15987377, 17546549, 19306192, 21447711, 23892078, 26803464, 30359041, 34339493, 39092204, 44560848, 50765105, 58326874, 67964511, 80355355, 96999931, 119541561, 149563451, 187867840, 233824077, 284335440, 333544960]
14782C33544960L9823057K1441828k091450k5070895m2161795n0274083n0275115
14775B24936507m4447613l5983188k7522279k0423657j5353317j1657644r058708
14768F0490101p426773o231646n585962n034026m414094l888031l338666k809279
14760B1761624k367371k057911j724856j256132j131140j054526r17234p97116
14752A0455338p68858p02525n22069n19229m72868n53248k66383l38652m77025
14743E834481l29048k25697k63855l06854k61375j15495j00197j07992j51029
14734C972939j16929o4210J8783o5820j51657k38312j18328k37007j78770l9906
14724B780783n8317q3090j00380q9634l6282q4198j33558K7141M335n7249o582
$$ y = [333544960, 373368017, 394809845, 392718395, 367647500, 325485705, 275211622, 224936507, 180488894, 144505706, 116983427, 96559770, 81206453, 69548809, 60490101, 53063328, 46831682, 41245720, 36211694, 31797600, 27909569, 24570903, 21761624, 19394253, 17336342, 15611486, 14355354, 13224214, 12169688, 11252454, 10455338, 9686480, 8983955, 8461886, 7942657, 7469789, 6916541, 6650158, 6311506, 5834481, 5505433, 5279736, 5015881, 4709027, 4447652, 4332157, 4231960, 4123968, 3972939, 3856010, 3791800, 3810583, 3744763, 3593106, 3354794, 3236466, 2999459, 2820689, 2780783, 2722466, 2639376, 2538996, 2449362, 2413080, 2328882, 2195324, 2222465, 2226800, 2169551, 2162969]
14713B162969m7832n9946q9058m0520k0420j98307q5442r5088j81731j1122O3173
14702A396676N2158k7444J0453j8405j57828J228l3333j9657n1187L4259m4691
14691A142229n7307j3448M3900J15798j18964j91290l3177O7957k5921o7633J983
14680H64127k3511n3224j9758O6489P393n7703q1593q522M5789P4579M3050L3051
14668H90167J13279n8760j26832j3867m4525m4576n612O0660K5794R139P3544
14657H78411O8475k9333j66569r3086J29941L6454k973L9446j53994r4046K7251
14646F39977Q494n6355L9533L2243n9253n3678k3619k0365o6750l0441J5084k9277
14634C95593p6805O1774P783L1720l0894Q5517j22771k7166J86420R2634r8252
$$ y = [2162969, 2115137, 2055191, 1966133, 1925613, 1905193, 1706886, 1621444, 1526356, 1344625, 1333503, 1396676, 1448834, 1421390, 1431843, 1413438, 1255610, 1256838, 1223505, 1203848, 1152661, 1186920, 1142229, 1084922, 1071474, 1115374, 1231172, 1112208, 920918, 887741, 955698, 929777, 862144, 864127, 840616, 787392, 767634, 834123, 841516, 783813, 702220, 693698, 739487, 814066, 857116, 890167, 1003446, 944686, 817854, 803987, 759462, 714886, 709274, 769934, 795728, 804867, 878411, 946886, 917553, 750984, 657898, 787839, 824293, 821320, 860766, 706772, 612726, 639977, 648471, 592116, 631649, 663892, 604639, 550961, 527342, 506977, 440227, 409786, 424870, 395593, 318788, 380562, 388345, 420065, 389171, 474688, 351917, 324751, 511171, 603805, 505553]
14623E05553n236k9821j01511n4745p8866K5697n124L8779M5695k413j1761q6381
14611B39866m9472J7797P5399Q3723N4590L9884M2556p1009o8621J11461o9014
14600D07160J1916j00486j34848q490K61716M6557j13691j18058n0932R0966j04289
14589A87521m2918N4228j29795j17869J74970O5455l9832M8603j07K5007K5186
14578B50449j5043J60848q298j49549j02710L399j03760j09874J91061R4150o6491
14567A44182L7151k9403q391M2512M0521O6068m5230P1217o2845m9546K2466k3972
14555B04730L2440M3821M055r9165J08402k2451j0179M5096N3399j32443j08133
14544A19572J84208m6354o7448j08616m8933O6105O4369J8171J12746P1674n7244
$$ y = [505553, 500317, 470496, 368985, 314240, 235374, 261071, 255947, 294726, 340421, 338008, 326247, 239866, 190394, 208191, 283590, 367313, 421903, 461787, 504343, 433334, 364713, 476174, 407160, 419076, 318590, 183742, 175252, 436968, 483525, 369834, 251776, 200844, 291810, 187521, 144603, 198831, 69036, -48833, 126137, 191592, 151760, 200363, 200256, 225263, 250449, 235406, 396254, 387956, 238407, 135697, 139096, 35336, -74538, 116523, 210673, 144182, 181333, 151930, 143539, 186051, 226572, 292640, 247410, 318627, 255782, 206236, 228702, 204730, 237170, 280991, 285046, 185881, 294283, 271832, 261653, 306749, 360148, 227705, 119572, 303780, 257426, 189978, 81362, 32429, 98534, 162903, 181074, 293820, 365494, 308250]
14533C08250m3193n2078k2281q6811J6817P8682o2030j77603M0492K2843K7738
14522E0826j5040L3576M4839P5566l3980j5253J0753O791j84113o9672Q718O520
14510h0469J14790O3641Q2298M3080J11745j05194O974J8904O7989j049q4397
14499B38312j33254k988o8474R5688J9452n7351N2478N8068O734j17012j47329
14488e5676P9110R0080o2087l1568K5182K0698J05646K16019n714k77404j13206
14477h920K3614n3570p4359m7205j92577n6562L2578O8539k44N2858K90481J83317
14465B17950J25073j4107o2681k2585l8585j82859r8633M7918R8689j1936j02763
14454d4519N6169R7293P1200J7759j3445j09559K8995j15576l0536n0461L4772
$$ y = [308250, 265057, 212979, 190698, 103887, 120704, 199386, 137356, -40247, 245, 23088, 50826, 35786, 69362, 114201, 189767, 155787, 140534, 151287, 158078, -26035, -95707, -86989, -80469, 34321, 97962, 180260, 223340, 335085, 229891, 236865, 255769, 323758, 322709, 238312, 105058, 102070, 33596, 129284, 148736, 91385, 143863, 201931, 208665, 91653, -55676, 23434, 113514, 51427, 19859, 45041, 65739, 171385, 387404, 381690, 104286, -8920, 14694, -38876, -113235, -160440, -353017, -409579, -377001, -308462, -308706, -255848, 34633, 217950, 343023, 328916, 266235, 243650, 205065, 22206, -76427, -28509, 70180, 58244, -44519, 11650, 108943, 180143, 197902, 184457, 74898, 103893, -11683, -42219, -92680, -57908]
14443e7908p4993R123J15714J08018O6501N5140j02098P5157O7258o3009k4423
14432A74480j26030k7694J08360N2240P812M2390r2034r2890k2933j4470j34299
14421a25068K0006Q7086N5284j3691O0599O9528l9928n1717l546m2227J5235J21452
14409A53013Q8474o3575o6283J16867m5843j13447M0377j24635J5218m357N7260
14398E3069q7859K0794J24196J29761j450o8004K0832m3374l2066o5993o7608
14387a7702O9497J47846Q9252j10243k9634P5235p9574k048k5115K2402J7276
14376A57192r3302N3206J0384p4815j5708R8758j34644n5938l8905J03665P7382
14365H7275N963q7833J6872Q3669J9666o538Q5285K3989p9921m2116N4901L8750
$$ y = [-57908, -132901, -123778, -8064, 99954, 166455, 221595, 119497, 194654, 261912, 198903, 174480, 48450, 20756, 129116, 181356, 189168, 231558, 139524, 46634, 23701, 9231, -125068, -105062, -17976, 37308, 23617, 84216, 153744, 113816, 62099, 58553, 16326, 31561, 153013, 241487, 177912, 111629, 228496, 182653, 69206, 109583, -15052, 166, -4191, 53069, -34790, -13996, 110200, 239961, 238511, 170507, 191339, 147965, 115899, 49906, -17702, 51795, 199641, 288893, 178650, 149016, 224251, 144677, 142629, 117514, 139916, 157192, 63890, 117096, 127480, 52665, 36957, 135715, 1071, -54867, -93772, 9893, 87275, 93238, 5405, 22277, 105946, 125612, 119074, 204359, 228348, 148427, 106311, 161212, 199962]
14353A99962j05410o417R3727L3155r7016J6482J115N4925O2995j53708j84497
14342h4687N246J05345l9688O5801J05516J05117J19782l1306j20784j1310R336
14331B28368k3045l2041r9559p5684J58386L7940j16040R7972J04028P2873M4597
14320C97795N0023p370j2658L0104K12359K06923K35239J55453J33984J89868
14310A591720K01852P1645j05509j18770r3242j13906l02336j22998k823n0441
14300I55192q1870j46352j52341j28332j13495N9536k6759j03800k4895o886n4749
14289A75249L512P5269L2801O6302M232j34580k23092l59R4232K7086p0955J59245
14277B08942Q4405j04422p7941o1627o7746J20370l7427j46994J01413Q1642q757
$$ y = [199962, 94552, 88135, 181862, 215017, 118001, 134483, 135598, 190523, 253518, 99810, -84687, -79441, 25904, -13784, 52017, 157533, 262650, 382432, 351126, 230342, 219032, 228368, 205323, 173282, 73723, -1961, 156425, 194365, 78325, 176297, 280325, 353198, 397795, 447818, 440448, 427790, 457894, 670253, 877176, 1112415, 1267868, 1401852, 1591720, 1793572, 1865217, 1759708, 1640938, 1547696, 1433790, 1131454, 1008456, 1005633, 955192, 873322, 726970, 574629, 446297, 332802, 392338, 365579, 261779, 236884, 229998, 175249, 178761, 254030, 286831, 353133, 357365, 222785, -307, -666, 93566, 120652, 49697, 208942, 293347, 188925, 110984, 49357, -18389, 101981, 64554, -82440, 18973, 100615, 91858]
14266I1858l361O2556K5688j13024L9594n2310r4855L3075J69793R5134n3298
14255B00850J8034r9997p6800m6702M2590j49957M2280K13944L1084k7598o9427
14244G8301m2750m773r4670J9291J48787p2736P8306P115m5340j3947l8628p8302
14232e9346m3800J41526M8601j09729q1403j0940n98R9160L8602n95m8923n0071
14220g7516J04765N1822k31816l0139P6746N689N0997K9300Q2493j4747O0354
14209A07948n355J9471l2527J5646N603R6973j3021K0370j05394j05546q5949
14198h1781q4836O6334J8124k1980J52731l282L3184O9449r9953q6133N9189J30883
14186A51929P8652j8332K115l3082n682j01901n8650K6406M9754K4971R8211j27490
$$ y = [91858, 88497, 151053, 176741, 63717, 103311, 51001, -43854, -10779, 159014, 254148, 200850, 218884, 118887, 42087, -4615, 37975, -111982, -69702, 144242, 175326, 147728, 78301, 35551, 30778, -63892, -44601, 104186, 31450, 109756, 116871, 71531, 57584, 18956, -59346, -103146, 38380, 86981, -22748, -104151, -115091, -115689, -16529, 22073, 21478, -27445, -77516, 27249, 79071, -152745, -182884, -106138, -100449, -49452, -20152, 62341, 47594, 107948, 102593, 122064, 89537, 105183, 110786, 207759, 194738, 215108, 109714, 4168, -81781, -166617, -100283, -82159, -104139, 48592, 45310, 78494, 147943, 47990, -38143, 21046, 151929, 230581, 212249, 214364, 181282, 175600, 73699, 15049, 41455, 91209, 116180, 214391, 86901]
14174H6901j5485m290R3626n766J58336l6977j83392r6007n6445R7789L4252j0665
14162F1877Q2173L242K7758p9165M6416r4439n1066l9308P6748Q7652j4105j09561
14150a778R4817o9629N4353P2354J00653J1343O9755j06335j63881p6870J06179
14139I0961K26062q4140j21717j9484j21870k976k7476l4267K3159N6061p513
14128b3200L1757J7253k5432m1952j4742R2668r6565k318K1746k1855n0999J24431
14116A0792J22733Q9040j8383r5102m1963N6758q282K6165o0928R8079j07079
14105G1830j09783m2085K3318N806N1763P3123n3221K0953j5215M2656J8784j38389
14093e0460M1169P0641j24749l5924J19046O1359m6423j30272Q1938J49160O5567
$$ y = [86901, 71416, 67126, 160752, 154986, 313322, 276345, 92953, -3054, -59499, 38290, 72542, 61877, 144050, 147292, 175050, 95885, 142301, 47862, -3204, -42512, 34236, 121888, 107783, -1778, 93039, 23410, 77763, 150117, 250770, 262113, 331868, 225533, 61652, -15218, 90961, 317023, 232883, 111166, 91682, -30188, -33164, -60640, -94907, -71748, -15687, -23200, 8557, 25810, 378, -41574, -56316, 36352, -60213, -62531, -40785, -62640, -113639, 10792, 133525, 222565, 204182, 109080, 67117, 123875, 115593, 141758, 80830, 178909, 71830, -37953, -80038, -56720, -50914, 849, 73972, 20751, 41704, 26489, 69145, 87929, -50460, -9291, 61350, -63399, -99323, 19723, 81082, 34659, -95613, -13675, 135485, 201052]
14082B01052j8774j35886q5504O6650J67328K7527j61873n9465m9312J2380l546
14071c9423P8833p560o4104J3828l4700n6601N5871m394Q3568M4171P3744j20345
14059B2888r7933n7621j06629q3529L8249J87784Q3992j03801L9987K5226O4802
14048A3415M4710K1992J08722k2669p6016j0333J16731l3374j59128j48870j5895
14037a60715J45852J20609J04144J64966j3524j12482l1567k400J1158J9607j54138
14026I1510K8146O1363N980p3259j02081p1383N3982j6704n2350q3065J1399J01520
14014d4942K8630r1666o0204j03972J36634L3018P2440O3422R2941R871m5666
14003I0506k7645m1771p0155L0797J08469q5985q9575o9212P2893J70587K5450
$$ y = [201052, 182278, 46392, -39112, 27538, 194866, 222393, 60520, 1055, -48257, -35877, -39423, 39410, 31850, -32254, -18426, -53126, -109727, -53856, -58250, 25318, 69489, 143233, 22888, -75045, -132666, -239295, -322824, -284575, -96791, -12799, -116600, -76613, -51387, 13415, 58125, 80117, 188839, 166170, 90154, 79821, 196552, 163178, 4050, -144820, -160715, -14863, 105746, 209890, 374856, 361332, 248850, 217283, 214883, 226041, 245648, 91510, 119656, 181019, 186999, 113740, 11659, -59724, -5742, -22446, -74796, -157861, -146462, -44942, -16312, -107978, -168182, -272154, -135520, -102502, -30062, 33360, 126301, 136172, 90506, 62861, 21090, -49065, -18268, 90201, 4216, -85359, -154571, -81678, 88909, 114359]
13992A14359j5614j39263q1197J02491o4979K8382Q1215j0431P810n2961l9182
13981f9370k8660Q8265L2806j05747N0292K750M0235r7097K381J26897o1942K9231
13969A0041O3579j0003l6867J2660m9556m6089k7222J30101j1571N3286M2918
13958A31277Q38o5551j10194l8690Q7897Q9684K0498l3122j12072j06820m105
13947a40360J64517Q5680k3113k6033j6034L8117N9940N0529R3966q7114l9770
13936A60325l2253P6440J35182o0468j97457J12308l3262j01184r95l1952m6780
13925b0096R7202l883k31893r6988N2210p2862K00270J11139J02971k38827j64031
13914b64788j21226Q1489J28443R7392M7745l84k3061M3848J8184Q8219m810M1237
$$ y = [114359, 98745, -40518, -121715, -19224, -84203, -55821, 25394, 14963, 22773, -30188, -69370, -98030, -9765, 23041, -82706, -32414, -29664, 10571, -86526, -84145, 42752, -19190, 10041, 73620, 63617, 26750, 39410, -10146, -56235, -83457, 46644, 35073, 88359, 131277, 132115, 66564, -43630, -82320, 5577, 95261, 115759, 82637, -29435, -136255, -140360, 24157, 109837, 86724, 60691, 44657, 82774, 142714, 193243, 287209, 200095, 160325, 128072, 204512, 339694, 279226, 81769, 194077, 160815, 59631, 58636, 26684, -20096, 77106, 73223, -158670, -255658, -203448, -276310, -76040, 35099, 138070, -100757, -264788, -386014, -304525, -176082, -78690, -30945, -31329, -54390, -10542, 7642, 95861, 91051, 132288]
13902A32288m5414l4390o2694q0036k82K5610n9857J23111L371r3088p4315N9596
13890a06100N6449k0635j2704M0003M1629N4697k17642r5390l8338Q2003j37458
13879c53486Q4506J95407R1626L3303J7917O3685j27265R2187l7879p7640q4627
13868a02266J6989m3435l4637J1993O2348R7708K3394Q507j78225k4662J19518
13857d2768O5294J32281p6725p1893K7346P6434k01329j41031L2039P3439j05081
13846b31994q218r9728J34637J60621O5303l2067O041K9990k6504M4966L551l542
13834D3056o7840R7637m4308j76936J63643j8502K7834R5952J6931q2448j39308
13823h4289K454N3688P172n8873j6080J01762l817j4823o2193Q345J45022N9205
$$ y = [132288, 86874, 52484, -10210, -90246, -90528, -64918, -124775, -1664, 1707, -91381, -165696, -106100, -49651, -70286, -82990, -42987, -1358, 53339, -164303, -259693, -298031, -216028, -353486, -268980, -73573, 18053, 51356, 69273, 132958, 5693, 97880, 60001, -17639, -102266, -85277, -128712, -163349, -151356, -89008, 8700, 32094, 40601, -137624, -162286, -42768, 22526, 154807, 78082, 6189, 33535, 109969, -91360, -232391, -200352, -126913, -231994, -240212, -339940, -205303, -44682, 20621, -11446, -5405, 24585, -1919, 43047, 46598, 43056, -24784, 72853, 28545, -148391, 15252, -3250, 24584, 120536, 137467, 55019, -84289, -81835, -28147, -20975, -79848, -95928, 5834, 2017, -12806, -74999, -66654, 78368, 137573]
13811A37573N6177k7270o4031P8479j05089j76302l2305P719J29700J39861K8048
13800A72560m6262q9722R5620J13504j08652n1107K07364Q7632k01426p5697j0432
13789I3382p749K0663j9129o4772O9610l0307r4492k07735N5341J89750R5657
13778A00219l6188q5780o6369O8524k5319j7376L3894k5958k3437l0707l7677
13767a46174Q7870k4624L7750N4460J16446J27311j71840j01384n2355P8117J47913
13756A53490j61785L3481J97753J0927j24024l7481k6703j09469M0359L1107M7038
13745E4693O2944R0079l9208q4113j16783m1091P5976J27308O9997r0260o5573
13734D3969J27870M1164n9941k1745l8485J40501j00723p8443n5548n8839q800
$$ y = [137573, 193750, 166480, 102449, 180928, 75839, -100463, -132768, -125049, 4651, 144512, 172560, 126298, 36576, 132196, 245700, 137048, 85941, 293305, 380937, 179511, 103814, 93382, 85633, 106296, 87167, 22395, 92005, 61698, -32794, -240529, -185188, 4562, 100219, 64031, -21749, -88118, -19594, -44913, -62289, -28395, -54353, -77790, -108497, -146174, -58304, -82928, -45178, 9282, 125728, 253039, 81199, -20185, -72540, 5577, 153490, -8295, 25186, 222939, 233866, 109842, 72361, 45658, -63811, -23452, 7655, 54693, 117637, 207716, 168508, 84395, -32388, -73479, 2497, 129805, 199802, 109542, 43969, 171839, 213003, 153062, 131317, 92832, 233333, 132610, 54167, -1381, -60220, -69020]
13723f9020P0463L5908q8150l919O4204j8009r835P518O7250J21526J09472k4601
13711B62807j2022j1406k3078k21031j29448O6191O886j306J60613K36332J02771
13700D37309q5158j38875k05372k0607O8873k2192p4484l3167l057n6199P0117
13689f2812P9286M9974k2731j1263O5374J44901k7971k8560k4360L2363J23646
13678C17847n2488j02215r2498J33403l0084r1657j05405K7684P1896K23J41666
13667B18372J4191p0494o4605m2465n3816m9681j06886M4938Q167J5462K0783
13656f6034Q5274K0583j82003n1981J18437J20054J29953O2959m6700q8746l0160
13645G1636n680P1115k3170k03205N7118J41258N7843L8871o5455J3723j7039
$$ y = [-69020, 1443, 37351, -50799, -54718, 9486, -8523, -18358, -10840, 56410, 177936, 287408, 262807, 250785, 239379, 216301, -4730, -134178, -67987, -61101, -62407, 98206, 334538, 437309, 352151, 213276, 7904, -12703, 56170, 33978, -40506, -73673, -76730, -132929, -62812, 16474, 66448, 43717, 32454, 97828, 242729, 214758, 186198, 161838, 194201, 317847, 265359, 163144, 70646, 204049, 173965, 82308, -23097, 4587, 76483, 76706, 218372, 232563, 162069, 97464, 54999, 1183, -48498, -155384, -110446, -102279, -86817, -66034, 19240, 39823, -142180, -194161, -75724, 44330, 174283, 237242, 190542, 101796, 71636, 65956, 137071, 113901, -89304, -32186, 109072, 166915, 205786, 140331, 154054, 137015]
13634A37015p7545r0685p6795R8720J44271N4673n7338q5603m779q4644j6390
13623e9100l1510k3425L8974J0018q5245l127l895J32408Q2683o4741o6391l4119
13611a07470J14736O1496P5331K604p6951q802J5226j17712k2210J70239l5655
13600G0832j07488K0816J93191O6852l6386K2753L0552j47972K4516J04915p3058
13589A69523m5717J08982O7080j56403k55869j06696o9468J00061Q5148l6203
13579a39562o5189K9551K3048K0689K980K9450P7505O8017L1765N8964P8695j9552
13567A96361j41354j31552j38158J07443J63674J28101K7663j61655n8201k6705
13557c4383j5436M7443m5992j32146Q9551J13997l5495L1928N162j05645m4771
$$ y = [137015, 59470, -31215, -108010, -9290, 134981, 189654, 132316, 46713, 41934, -42710, -59100, -90610, -114035, -75061, -65043, -150288, -153415, -157310, -24902, 57781, -6960, -73351, -107470, 7266, 68762, 144093, 146697, 69746, 60944, 76170, -41542, -63752, 106487, 70832, -36656, -15840, 177351, 244203, 207817, 230570, 261122, 113150, 137666, 242581, 169523, 123806, 232788, 299868, 143465, -112404, -219100, -288568, -188507, -103359, -139562, -204751, -175200, -152152, -131463, -128483, -99033, -21528, 46489, 78254, 137218, 215913, 196361, 55007, -76545, -214703, -107260, 56414, 184515, 212178, 50523, -7678, -34383, -49819, -2376, -48368, -180514, -90963, 23034, -12461, 19467, 24629, -81016, -125787]
13546a25787l7777L4761J08020O1914P1731O6018J10901O3860j64163j08649p9599
13535A230j6943J9407m8787L5982m3001l4208J27047J99047j05779m5274N0156
13524A38877k7216l3921o2852m6131R174K8114n1959L8548J6290q1068m0310J16627
13512D173K275O5705M1327l4131n5218j69581k2350J81398K00940q6449j13255
13501A4834L4543l1695q9941J808R4612k3186M6944L0444r335p0858p0611L2358
13489d0083M0029O245j04429J12431J37401L6448j56034l7765l5246j7553J40044
13478H1488l2185k3725Q8628r5023j921r6163R1707J68323j4306L1523j3822p4856
13466A09668j34309k331P6982l4368J31542Q8208k1662j08290j35221n5647N59
$$ y = [-125787, -163564, -128803, -20783, 41131, 112862, 178880, 289781, 353641, 189478, 80829, 1230, -15713, 3694, -45093, -9111, -52112, -86320, 40727, 239774, 133995, 88721, 138877, 111661, 77740, 14888, -31243, -22069, 6045, -45914, -7366, 8924, -72144, -112454, 4173, 6448, 72153, 113480, 79349, 24131, -145450, -167800, 13598, 214538, 128089, 14834, 49377, 17682, -72259, -70451, 24161, 975, 47919, 78363, 69028, -1830, -72441, -40083, -54, 6191, -98238, 14193, 151594, 188042, 32008, -5757, -41003, -58556, 81488, 49303, 25578, 114206, 19183, 17262, -78901, 12806, 181129, 166823, 198346, 184524, 109668, -24641, -26972, 50010, 15642, 147184, 235392, 213730, 105440, -29781, -85428, -84869]
13455h4869O1901L177l8888K1163p4049J6146R471N7692L6946K0876K7075k3282
13443C3359r9847n7206q683M398Q3160J04243o1759m7520O7869L8694R1460L6911
13431A85079r3901p4289P752J68388O1470M39J2708k748m3518o1501M4493J26186
13419C30558M5971j19174L376j41096r3466l7543k1352L7506K12614L8896J690
13408B57980j0027n7485j21199J18978j3758j65973p6250Q596n5515P7044O7492
13397B9883j52955o9309J68536P4420j9224J2864L5588q2431n3509j08885N1453
13386a13569O9237l6397m6411J25910Q7164M0237J5610j27686R510j50152m302
13375a30849J52168J65642m5105o3915j156k1027j44462j40214n4082J80277N2017
$$ y = [-84869, -22968, -19791, -58679, -37516, -111565, -95419, -85948, -28256, 8690, 29566, 56641, 33359, -66488, -123694, -132377, -127979, -44819, 59424, -2335, -49855, 18014, 56708, 148168, 185079, 91178, 16889, 24641, 193029, 254499, 254938, 267646, 264898, 221380, 159879, 204372, 330558, 376529, 257355, 260731, 119635, 26169, -11374, -32726, 4780, 217394, 256290, 257980, 247953, 190468, 69269, 188247, 174489, 8516, -67734, -59138, -114653, -37609, 29883, -123072, -192381, -23845, 50575, 31351, 44215, 79803, -2628, -56137, -165022, -113569, -44332, -80729, -127140, -1230, 85934, 126171, 141781, 14095, 23605, -126547, -130849, 21319, 186961, 141856, 77941, 76785, 55758, -88704, -228918, -283000, -102723, -50706]
13364e0706k8212L6050m644P1498P0951o424P346j9054q4539q979M1366M2623
13352F7276J60886k3797m4944n0167J33857m394o5541j8112j6759m7209N3303
13341A44399R7933j64988l8702N5030J7558p664K3140J8881J4469j45970J3894
13330B7980J15135R2426L9156m2224J1908K7057n7351o1236M9549K7471R7952
13319C27823r3556m9433L2756K8266j38230j25465p3785n9397l294Q4042N9558
13308a0715o6534m4094O1818j9212Q6970K9728l596Q853N868k8775q2327r8950
13296a60966j6836o8602j05634m799J53873J72824P1649p6289Q63N0021K5776
13285D1880l3905j5093q0784J76855J2365J17565O4962p0648j10150j8167P0575
$$ y = [-50706, -78918, -42868, -47512, 23986, 94937, 88513, 95859, 76805, -7734, -16713, 24653, 67276, 228162, 204365, 159421, 109254, 243111, 238717, 173176, 155064, 138305, 91096, 144399, 242332, 77344, 38642, 93672, 111230, 103566, 126706, 145587, 160056, 14086, 27980, 143115, 235541, 274697, 232473, 244381, 271438, 214087, 152851, 202400, 229871, 327823, 234267, 184834, 217590, 245856, 107626, -17839, -91624, -151021, -154315, -70273, -10715, -77249, -121343, -59525, -78737, 8233, 37961, 34365, 43218, 49086, 20311, -62016, -160966, -177802, -246404, -352038, -356837, -202964, -30140, 41509, -34780, -33917, 16104, 41880, 7975, -7118, -87902, 88953, 101318, 218883, 283845, 213197, 103047, 84880, 155455]
13274A55455k4607J8570J18721j171j51435r2171l8248l413j5774p7479M6462
13263f5090J8549K5860Q0874O2383j3395m9862l6930r4718N9487J14762l4180
13252F7740r16l5696j6055l7612Q6164L9420j3271l3530l296N3708j8869o297
13240H1490o6699P4356q2837l8430J8654Q7533O2821p5254L0873L5580j06171
13229B1916q2862p4817M506m193L7676R9752q113L9893R3379r416j03320j79517
13217a65116p1649J9111k5991J26214K7183k8545J7666J40589j01875j33530j7426
13206b13369J79128k0950N7638J7811J3965q7831r8471r8343J06613l4687j07291
13195b85787Q7198J32869M1447m8038R0272q9k1602K6924j78169N4515J22263
$$ y = [155455, 130848, 149418, 268139, 266968, 115533, 23362, -14886, -18299, -34073, -111552, -65090, -46541, -20681, 60193, 122576, 109181, 59319, 22389, -72329, -12842, 101920, 67740, 66824, 31128, 15073, -22539, 63625, 103045, 89774, 56244, 52948, 106656, 87787, 81490, 14791, 89147, 6310, -32120, -13466, 74067, 136888, 61634, 92507, 128087, 21916, -60946, -135763, -131257, -135450, -97774, 1978, -6135, 33758, 127137, 117721, 14401, -165116, -236765, -217654, -243645, -117431, -90248, -118793, -101127, 39462, -62413, -195943, -213369, -34241, -55191, 2447, 20258, 34223, -53608, -152079, -250422, -143809, -178496, -285787, -198589, -65720, -24273, -72311, 17961, 17872, -3730, 23194, -154975, -100460, 21803]
13184B1803Q5567k7656r1786j5773N7558O1529k7657q9034j06338k865L8716L570
13172i2366k5915k4692q8103j1986N0357K3685J04944k6996j75833L3548K08880
13161b4477J90707M0312r0243j58756r4666j85195R3236O5314l5515J36928J74433
13150A12078K178j02362n8834j9411J29257o9513J906L3185j57154n2847J11468
13139g0049N0328R8256P3684j7668j19006q0759j3009l6548L1206O7433J26545
13128A10413J41949q4070n73J3975j14437j28974J38361K3615q2926q0861m7196
13117a10724J09k2927J71763J61881j12531j19534J00734J2964j27152J0596J20475
13106H5654P8632Q5538O358q1470j75087q287Q8304j59600o3002K8606m5773Q2820
$$ y = [21803, 107370, 79714, -12072, -27845, 29713, 91242, 63585, -25449, -131787, -134652, -95936, -92366, -118281, -142973, -231076, -243062, -192705, -169020, -64076, -91072, -266905, -233357, -24477, 166230, 206542, 116299, -42457, -137123, -322318, -229082, -163768, -199283, -62355, 112078, 114256, 11894, -46940, -66351, 62906, -6607, -4701, 28484, -128670, -181517, -70049, -19721, 78535, 152219, 134551, 15545, -65214, -78223, -114771, -83565, -16132, 110413, 252362, 168292, 167719, 181694, 67257, -61717, 76644, 100259, 17333, -63528, -110724, -110615, -133542, 38221, 200102, 87571, -31963, 68771, 81735, -45417, -34821, 85654, 164286, 249824, 256182, 174712, -375, -8662, 79642, -79958, -142960, -114354, -160127, -77307]
13094g7307O9829Q4652M0586k9914O0762O288L6225K0210p02k9881k7471p8258
13082G5019q6882K0444J6917j0423O2708J17787k8758n4892j86361J0532j4360
13071g8269j0077Q5689P0926M0383P4220k0206j73150J0379J07707J00780M0256
13060B48638r922j87844j16574J09473K442P4206q248M4863P549j27915j14570
13049g7902n2028q685J66613N122l647q4668k8531J09916o5122m7391N1179j3867
13037d9011k9595j9323k2303J08957J10998j03415j35366j4057M898O4046J9561
13026f4610m4153L3567J38759n8235k8620r838k8338O4537l2287N3097J18998
13015A42877o0838J1999j05674M5285J62418j7678o2479k0219p1829J4253j3337
$$ y = [-77307, -7478, 77174, 117760, 87846, 148608, 154896, 191121, 211331, 210629, 180748, 153277, 75019, -11863, 8581, 25498, 15075, 77783, 195570, 166812, 111920, -74441, -63909, -78269, -88346, -2657, 68269, 108652, 182872, 162666, -10484, -105, 107602, 208382, 248638, 238716, 50872, -65702, 43771, 46213, 120419, 112171, 157034, 164583, 36668, -77902, -129930, -138615, 27998, 33120, 29473, -55195, -83726, 26190, -38932, -86323, -35144, -49011, -78606, -97929, -120232, -11275, 99723, -3692, -139058, -153115, -148217, -84171, -64610, -108763, -75196, 63563, 5328, -23292, -33130, -61468, 3069, -29218, 23879, 142877, 82039, 94038, -11636, 33649, 196067, 178389, 115910, 95691, 23862, 38115, 24778]
13004B4778o9851N0101m0899J1142R0476M3764N5881J8946m1948n1548j11598
12993b0756j1473k316p1507j7086P1697n2573l2313P6781k7362j7980J16691J97832
12981B09635J3432k04719M3871j8432r2345n5359M4513J08105j2317J6264P8649
12970A31297P226k5033L500P4570l8959n9930j17147L9730m3347J865M7485l5703
12958a4446R703O7948R3121M3794o570m3669o5534r3572L1071p0137o1022K33178
12946A23865P6589j73066o3246j3270O2607j2425J25106M179k6622r4728J1060
12935B0049l0553p929N4044k3820Q6390J8649O8599j12791q3602J53427J36327
12924B78790j20948j44994j30231L5807J49402O7626P110J2482K6496j26812O278
$$ y = [24778, -45073, 5028, -35871, -24729, 65747, 109511, 165392, 184338, 142390, 90842, -20756, -32229, -34545, -106052, -123138, -51441, -104014, -136327, -59546, -86908, -104888, 11803, 209635, 223067, 18348, 62219, 43787, -48558, -103917, -59404, 48701, 36384, 52648, 131297, 138523, 113490, 116990, 191560, 152601, 92671, -24476, 15254, -28093, -26228, 21257, -14446, -4743, 63205, 156326, 200120, 193550, 149881, 84347, -9225, 21846, -48291, -109313, 123865, 200454, 27388, -35858, -49128, 13479, 1054, 126160, 130339, 103717, 8989, 20049, -10504, -18433, 35611, 11791, 98181, 116830, 185429, 72638, -10964, 142463, 278790, 157842, 12848, -117383, -81576, 67826, 135452, 142562, 155044, 181540, 54728, 61006]
12913F1006R1855k482j22930q1172p0288J6382R2903K6437l4831j01140q4810
12902b09070N2304O4871K3565N418J12633J48306P3436q3234j25613k22725M4641
12891a15468K36539J04569J2411n5105q4134N556J03119J61709n6872K9335o3777
12880B77882K0562J46p6380k4000j7740m2287P9236p9220r9304J39775N8437j39977
12868I7130k08452q1583J69639N7243p5931l171n9410J14650k29K2348Q8084k9320
12856I0998l6201j9019q1853Q7995J02287n5868j7520N1778l3240k6558N4389
12845A17188o0642j51036n4464J21442R3239K6724R1966n2072j04230j62771k9461
12834a64117K17720o7074j05048J7017Q1560J57860m7854p5899Q6392K4627P6282
$$ y = [61006, 152861, 150379, 27449, -53723, -124011, -107629, -14726, 11711, -23120, -124260, -209070, -156766, -91895, -68330, -62912, 49721, 198027, 271463, 188229, 62616, -160109, -115468, 121071, 225640, 238051, 182946, 98812, 104368, 207487, 369196, 312324, 341659, 277882, 298444, 298590, 222210, 198210, 180470, 138183, 217419, 138199, 38895, 178670, 237107, 97130, -111322, -192905, -23266, 33977, -41954, -45125, -104535, 10115, 9886, 32234, 120318, 90998, 54797, 35778, -46075, 41920, 144207, 88339, 70819, 122597, 89357, 62799, 117188, 56546, -94490, -148954, -27512, 65727, 92451, 184417, 132345, 28115, -134656, -164117, 53603, -13471, -118519, -101502, -19942, 137918, 90064, 14165, 100557, 125184, 201466]
12823B01466J1058K8265j27973j0266n2988j95269L2975K16321O3891q9443j54848
12812g6811l9181j8832Q3071J06379O2291k2817q7717n2379M3503l9632n430p361
12800e4916J2885M5878j25030n8755J75412R2181n1773p1906j2842m9606k5224
12789a23696J14761J45471P0178k7081j88309j40805J77406J56004L74j0624q5648
12778H8031j28384J24071L008k4717j18017l3202k2947J07347R4896j45199l6053
12767i1166k7081M7180K3815n4145N3939L7232q2019M3647R6970Q9662l2599p1619
12755C3816J20135J1790j04965K5367n4469j35933p7988J16289P7854m6969L0161
12744d912O2118J8388J16753M4071k10980l7606j764j10727N5816L4287j5846
$$ y = [201466, 212524, 240789, 112816, 102550, 49562, -145707, -112732, 103589, 167480, 78037, -76811, -115992, -134824, -51753, 54626, 116917, 94100, 6383, -45996, -2493, -42125, -47555, -54916, -42031, 3847, -121183, -179938, -4526, 87655, 35882, -36024, -48866, -98472, -123696, -8935, 136536, 206714, 179633, -8676, -149481, 27925, 183929, 184303, 173679, 88031, -40353, 83718, 86726, 62009, -56008, -89210, -112157, -4810, 90086, -55113, -91166, -118247, -71067, -47252, -101397, -47458, -10226, -92245, -48598, 48372, 138034, 105435, 33816, 153951, 165741, 60776, 86143, 31674, -104259, -182247, -65958, 11896, -35073, -4912, 57206, 75594, 192347, 236418, 25438, -12168, -13932, -124659, -68843, -34556, -50402]
12733e0402J21586m945m8650p4946q5201m0947L7239k4994j23798r898O2305J43530
12721i9121R3906p0281Q6458M5711q2792K4594n5401j07609n3029J4537P155N4354
12709a41518Q9739l2946K1083N9988O7119l2050r1094m6184j6923k3698O2906
12698h3578l9333P2177P870o9213k6494L9230K0993N7238K3998M1346m6377o6460
12686f8603j74471O5854J04066J11385K3509n3432N6363q068m6607N3627j15605
12675e1982m2056l920k9888M4308J71774l150j07605o2546l6450R1375n3563l0929
12663a14632R0008Q4127l4382R417J2174q7257j46664M1210J78795P7965m2931
12652F7830M2788J0155n362r726J75319l0029q1452l3325R792m0309k87087m2330
$$ y = [-50402, 71184, 66239, 17589, -57357, -142558, -183505, -146266, -171260, -295058, -304956, -242651, -99121, -5215, -75496, 10962, 56673, -26119, -1525, -56926, -164535, -217564, -203027, -195872, -141518, -51779, -84725, -63642, -3654, 63465, 31415, -59679, -105863, -122786, -146484, -83578, -122911, -50734, -42864, -112077, -138571, -99341, -78348, -21110, 2888, 44234, -2143, -68603, -243074, -177220, -73154, 38231, 61740, 8308, 64671, 56603, 9996, 63623, -51982, -94038, -97958, -127846, -83538, 88236, 85086, -22519, -85065, -121515, -30140, -83703, -114632, -24624, 59503, 25121, 34538, 46712, -40545, -187209, -145999, 32796, 110761, 67830, 110618, 120773, 115411, 105685, 281004, 250975, 169523, 136198, 145990, 105681, -181406, -223736]
12640b23736J35883M6706k2964L8901P9236k2812p9276J31637j12323k3959R5813
12629D3106J9676J9234J8024r3255l5524R6574R9479r8529j5028n2165o2299Q0152
12617A9445r907p4326j200Q2317j48982o0960p5426Q151J56726L0652j63635Q927
12605b28218L6763k3739L3942N2412M6989Q5523J0363j31467P2435J54648m341
12594A05310K3763J0149j72181q1761J04912M2487o282O7229N6836r6677n1715
12583B070j22611N5001J11703J6405k2512n119j5964r109J0470n0307r9148J7066
12571a12055K4497N4907P1021m268m6530q8633j27982r0689M6554J10478K7039
12560a35661j288n7076M5590J54078k4997O1747L7899j06425k7673l1903r9143
$$ y = [-223736, -87853, -41147, -64111, -25210, 54026, 31214, -48062, 83575, -28748, -52707, 43106, 62782, 82016, 100040, 6785, -28739, 67835, 167314, 68785, 53757, 1592, -60707, 19445, 9538, -64788, -65988, 16329, -132653, -193613, -269039, -260888, -104162, -73510, -237145, -228218, -191455, -215194, -181252, -128840, -81851, 3672, 14035, -117432, -44997, 109651, 105310, 129073, 139222, -32959, -114720, -9808, 32679, 26397, 93626, 150462, 53785, 2070, -120541, -65540, 46163, 62568, 40056, 34937, 18973, 9864, 20334, -29973, -129121, -112055, -87558, -32651, 38370, 34102, -12428, -101061, -229043, -319732, -273178, -162700, -135661, -136949, -194025, -148435, 5643, -19354, 42393, 80292, -26133, -53806, -85709, -184852]
12549a84852N4145P7739m6608P6931P4586k3822O939n5250l2474j587J09297J00008
12537A55052j2736r0740j08079n0130J4475J3338L942q1050Q8116J08216J3196
12526E3600o7056o5927N0130K3365K0544Q6945p6537j36522l1679r1439Q5305
12515a49271P5515Q1458j03677k39884j130J68466o4092o0954P039M1530Q2968
12504a62032K1662l1029Q7309K7653O79J02522R2453o8104q433M3939K9719J17939
12492B54277J3828j79597o1215n701p4020k205j6126R5754K589r4392K2542R0209
12480D5943o7177R46K8276m14M0389N434j13276M2757Q08N2747j32410n3760J8842
12467a30895O7502M0655n4599O4847O8713Q3549m1126j67775N4271J7802o9534
$$ y = [-184852, -130707, -52968, -99576, -22645, 51941, 28119, 35058, -20192, -52666, -54253, 55044, 155052, 142316, 51576, -56503, -106633, -92158, -78820, -74878, -155928, -67812, 40404, 53600, -13456, -79383, -29253, -5888, 14656, 101601, 25064, -111458, -143137, -234576, -149271, -73756, 7702, -95975, -335859, -336989, -168523, -232615, -293569, -286530, -245000, -162032, -140370, -171399, -84090, -56437, -55758, 46764, 139217, 71113, 62680, 106619, 136338, 254277, 268105, 88508, 27293, 21592, -52428, -54633, -70759, 24995, 27584, -66808, -44266, 45943, -21234, -20288, 7988, 7574, 47963, 53397, -59879, -17122, -16314, 36433, -95977, -149737, -130895, -63393, -22738, -77337, -12490, 56223, 139772, 98646, -69129, -14858, 2944, -66590]
12456f6590m9973N8556J10109J1054K9936N1056j4857n6726J7456K0080M5958
12445A56059n194k2623j48868j39200j5672k5791k6499J28951J8579O4174O3552
12434D7468R9758L8453J3770k6967M402j63248j65253J00940O6559P3410J0229
12423I9521P1637N2190P0907r8329j21526P0149O3088Q909j8879j14900p8166
12412D601m9871o5368q1392l5826l5840P7896J06122R4753J12112J04810J37799
12401C69796K1673o3979j21544n7246m0008o1703L273K2382o9862q2282L3333
12390d6167M3669L0396N8481J61173Q2876K3949q0256j20177J6944q9491q3859
12379b462K3801J12461p9253p292O3208M3800P8913j5005j38060r5558k4206j20071
$$ y = [-66590, -116563, -58007, 52102, 63156, 93092, 144148, 129291, 72565, 90021, 110101, 156059, 150865, 128242, -20626, -159826, -175498, -201289, -227788, -98837, -80258, -16084, 47468, 147226, 185679, 199449, 172482, 176884, 13636, -151617, -50677, 15882, 89292, 99521, 171158, 223348, 294255, 195926, 74400, 144549, 207637, 216546, 197667, 82767, 4601, -45270, -110638, -192030, -227856, -263696, -185800, -79678, 15075, 127187, 231997, 369796, 391469, 327490, 205946, 148700, 108692, 46989, 50262, 72644, 2782, -79500, -46167, -2498, 27898, 86379, 247552, 330428, 354377, 274121, 153944, 170888, 81397, -2462, 21339, 133800, 54547, 47255, 110463, 154263, 233176, 218171, 80111, -15447, -39653, -159724]
12367a59724k925M3798O4537k9644M3442N8326J36003k706o4261j65700N3425
12356b5429J15216m4392j45508k5752O1314J40124J34000o9101l6056Q870L551
12345A16837k6689q137j39L3801R0025K2604m4100O1054M099q4938j6347r7986
12333E0084m1540J79509Q0408k4780j51391p8812O7109J78842R590k7454j24022
12322A17543n5896L110l27n4267J32102l7665j40761m494Q9522K24653j39006
12311A34514k09295K4772J04214K22936M3308q3890q8417Q7666M420p7663l8126
12300A24439P6018k2249L9548j12718l4616P3977M6277r6563k58696r2348M1357
12289b15574P5052J01978O5483Q5349J4937l4210j936N9110J7712N3951K16542
$$ y = [-159724, -162649, -118851, -54314, -83958, -40516, 17810, 153813, 151107, 86846, -78854, -25429, 89787, 45395, -100113, -125865, -64551, 75573, 209573, 140472, 104416, 113286, 116837, 90148, 82011, 81872, 115673, 205698, 228302, 184202, 245256, 249355, 164417, 148070, 50084, 8544, 188053, 268461, 243681, 92290, 13478, 80587, 259429, 269019, 241565, 117543, 61647, 64757, 64430, 10163, 142265, 104600, -36161, -40655, 48867, 273520, 134514, -74781, -50009, 54205, 277141, 320449, 236559, 148142, 235808, 240228, 162565, 124439, 200457, 178208, 217756, 105038, 70422, 144399, 190676, 94113, -164583, -256931, -215574, -140522, -38544, 26939, 112288, 127225, 93015, 91079, 150189, 167901, 221852, 438394]
12278D38394L94695N02861O78980J94249o03115p79386m91751j23648P9714k3289
12268B67704m359o8290M6719O9135k7646j70204k11114j6043R6658J20508J2021
12257A15089m0448j880k602J3351O7562m7311o6252k2556L2894J12108K0865K2126
12245B02946N2825m3441j27859m2451n4551J18181j5727j15188O9032J26886n9517
12234A11136J14776J7061o4449m1989Q1215o1633l4699L3946n7214L8762N5836
12223A92748l2608J1504o401k4876Q1077j9967J6264j5827j1954k0267j0910o2552
12211I6231j1105R211j01035n8975l5771m1463j27957Q3996J48736R5525J3932
12200G1325j6234M0028K5385k5984M5934m114n2472j17628P5395k2994j46014
$$ y = [438394, 833089, 1335950, 2014930, 2209179, 1606064, 826678, 334927, 211279, 290993, 267704, 263345, 195055, 241774, 310909, 283263, 113059, -98055, -114098, -17440, 103068, 115089, 74641, 72761, 70159, 83510, 151072, 103761, 37509, 14953, 47847, 159955, 180820, 202946, 255771, 212330, 84471, 42020, -12531, 105650, 89923, -25265, 43767, 170653, 111136, 225912, 242973, 178524, 136535, 217750, 156117, 121418, 155364, 98150, 136912, 192748, 160140, 171644, 165243, 140367, 221444, 201477, 217741, 201914, 189960, 169693, 158783, 96231, 85126, 94337, -6698, -65673, -101444, -142907, -270864, -186868, -38132, 57393, 71325, 55091, 95119, 120504, 94520, 140454, 136340, 83868, -33760, 41635, 18641, -127373]
12189a27373N0651j5010N4129J02488N8695j1118n6936O2742J24777j11334k7365
12178A04346K2447j19150N7781K44875J16753m7326j82613J00628j6360p0674
12168B10707J1791P700Q3222n889n4482R5799M2887j20763n6637n4030n1303m2441
12156F6561p1180O7107N5893K1931Q414N4469O9794N904j30102l9593J40208O4849
12144C14255L8056Q649j08750R1466p2990n1135L4205R9127j0835k8185j833J0370
12132C22400j07637q8130j642l4052k9762O0402P1560l0901n9877P108J22951
12121B32420K9530J56914J0939k14142q1794R7791L1378P310M2150O0449o1881
12110C11064j23054m5787L0390j6513m2789k3517L8597J33582p399l8281K15064
$$ y = [-127373, -76722, -91732, -37603, 64885, 123580, 112462, 55526, 118268, 243045, 131711, 104346, 126793, 7643, 65424, 310299, 427052, 379726, 197113, 297741, 281381, 210707, 222498, 230198, 313420, 307531, 253049, 348848, 391735, 270972, 214335, 160305, 109002, 66561, -4619, 62488, 118381, 140312, 148726, 203195, 272989, 278893, 148791, 109198, 249406, 314255, 352311, 360960, 252210, 343676, 270686, 219551, 253756, 352883, 342048, 313863, 312030, 322400, 214763, 126633, 124991, 90939, 61177, 121579, 193139, 162238, 102361, 109469, 232420, 261950, 418864, 429803, 215661, 133867, 231658, 263036, 270346, 312496, 372945, 311064, 188010, 142223, 172613, 156100, 113311, 89794, 128391, 261973, 254574, 216293, 431357]
12099D31357J82717k2518J2554n8614j9465k8157Q2013O429k9454k2212O123k394
12087E38379O1140k7759j05457k0257N7275k4034j9943q3343j7670l3293j54871
12076A70167n6143J24345J42928M0237Q476p2189O4846P4031N8405K9989K3174
12065F08266k8930l87L2332n5279J4517J810N5917k3214p6867J61142M9221o1177
12053F77351Q2385O3582j26654J41760P1413K6099k5576o717l41p6666j06282
12042G20354K2345p8130l6931J61427N7973M3389N3452Q6918L1845l5488r5436
12031I31718n81J36950r8074m0415M4243R7014p8190o2538n1261K6041J25621
12020A030528K37010J33893N0190j03503j21035L4458m2755j2462J31309M8499
$$ y = [431357, 614074, 591556, 604110, 545496, 526031, 497874, 579887, 586316, 556862, 534650, 540773, 538379, 599519, 571760, 466303, 446046, 503321, 479287, 459344, 376001, 358331, 325038, 170167, 114024, 238369, 381297, 421534, 430010, 357821, 422667, 496698, 555103, 585092, 608266, 579336, 578949, 611281, 556002, 570519, 572329, 628246, 605032, 528165, 689307, 738528, 677351, 759736, 823318, 696664, 838424, 909837, 935936, 910360, 903643, 903302, 826636, 720354, 742699, 664569, 627638, 789065, 847038, 890427, 943879, 1030797, 1062642, 1027154, 931718, 931137, 1068087, 970013, 929598, 973841, 1070855, 992665, 930127, 878866, 904907, 1030528, 1267538, 1401431, 1451621, 1348118, 1227083, 1261541, 1218786, 1206324, 1337633, 1386132]
12010A386132M5326N3410R0606o6679L3479L181P2453J24832M3196J12994J21338
11999B020268L4228r2720q7916P4911K14236O9773Q734k5523O4874J06629L6373
11988B423867j01303M0899M0383J51496J08270J75472J40299J88252J63376J81189
11978C512200O7842M303M7292J32564J44031J35784J79155J86213K95450K23484
11968D928318p2750R0608K23938K35319K55956L09302J25107K11436L54205L82840
11958G044279M23294L72493M56915M27237L21579L41873N59221O37720M81796
11949A1066407N79324N92364O38878R20679Q02665Q67945R66296R71296J194977
11940A8600831J263749J178894J408993J591408J619061J613710J790685J877796
$$ y = [1386132, 1431458, 1484868, 1575474, 1508795, 1542274, 1545455, 1617908, 1742740, 1785936, 1898930, 2020268, 2054496, 1961776, 1873860, 1948771, 2163007, 2232780, 2241514, 2215991, 2280865, 2387494, 2423867, 2322564, 2363463, 2403846, 2555342, 2663612, 2839084, 2979383, 3167635, 3331011, 3512200, 3580042, 3584345, 3631637, 3764201, 3908232, 4044016, 4223171, 4409384, 4704834, 4928318, 4855568, 4946176, 5170114, 5405433, 5661389, 5970691, 6095798, 6307234, 6661439, 7044279, 7467573, 7840066, 8296981, 8724218, 9045797, 9387670, 9946891, 10584611, 11066407, 11645731, 12238095, 12876973, 13797652, 14600317, 15468262, 16434558, 17405854, 18600831, 19864580, 21043474, 22452467, 24043875, 25662936, 27276646, 29067331, 30945127]
11932C0945127K078158K155155K347815K230871K209933K260110K102258K032146
11924D8361573J901999J583716J153590Q08485K58410j69085o25462j240661j532793
11915E0499772j771144k085006k246356k425105k308585k183981k178259k180567
11907C3120769j990857k042557j855073j731640j551134j317751j325417j395405
11899A9910935j161185j178106r96056r92957r04946q28462p55243o51605n07986
11890A1934389m84256o34120m51181m99429m31606l30752m99378l86324k79540
11881G937803l97338l94844l27715l10106k70786j80649j50523k11015k34942
11872E459885j08568j35517k43455k80820j94407k14180j61827k49838j18831
$$ y = [30945127, 33023285, 35178440, 37526255, 39757126, 41967059, 44227169, 46329427, 48361573, 50263572, 51847288, 53000878, 53809363, 54067773, 53898688, 53273226, 52032565, 50499772, 48728628, 46643622, 44397266, 41972161, 39663576, 37479595, 35301336, 33120769, 31129912, 29087355, 27232282, 25500642, 23949508, 22631757, 21306340, 19910935, 18749750, 17571644, 16575588, 15582631, 14677685, 13849223, 13093980, 12442375, 11934389, 11450133, 10816013, 10364832, 9865403, 9433797, 9103045, 8603667, 8217343, 7937803, 7540465, 7145621, 6817906, 6507800, 6237014, 6056365, 5905842, 5694827, 5459885, 5351317, 5215800, 4972345, 4691525, 4497118, 4282938, 4121111, 3871273, 3752442]
11863C752442Q1273j02321k20023j04789Q3261o1008q8870k02466j43666l6907
11853B956926j23029m4003l8969j18613k53608q8951K139l5650P4226L2165j09924
11842B252709o9919j8997Q194j10638j13769l2309p8761j33987q858R991O8472
11831A772128j66965r9612n8428q1265o7093P4822K10946p0506q7875j13214j11715
11820A201223K3104R7683k8952m9123j08138k0991o8237O7340N6963O29M2520
11809A214021k215o4301J3594r0455n6436r2011j3242Q7623M4768J746Q153j1017
11797A040228n548j41397r162j19581p831L2250R5456M1602q3217J7107J35506
11786I95413j58593j51002L2950O0190J9459O8759k7283q351q3617j90184q2156
$$ y = [3752442, 3833715, 3731394, 3511371, 3406582, 3489843, 3428835, 3339965, 3137499, 2993833, 2956926, 2833897, 2789894, 2750925, 2632312, 2378704, 2289753, 2291892, 2256242, 2330468, 2362633, 2252709, 2182790, 2163793, 2171987, 2061349, 1947580, 1915271, 1836510, 1702523, 1693665, 1703656, 1772128, 1605163, 1505551, 1447123, 1365858, 1298765, 1373587, 1584533, 1514027, 1426152, 1312938, 1201223, 1224327, 1322010, 1293058, 1243935, 1135797, 1114806, 1046569, 1113909, 1170872, 1171501, 1214021, 1211806, 1147505, 1161099, 1070644, 1014208, 922197, 908955, 996578, 1041346, 1043092, 1051245, 1040228, 1034680, 893283, 884121, 764540, 756709, 788959, 884415, 926017, 842800, 859907, 995413, 836820, 685818, 718768, 778958, 798417, 867176, 839893, 831542, 747925, 557741, 475585]
11775D75585J43471P8437j7355M3271P9904k4143j38025n383r4117j32024P2544
11764D82165J45312q971j1304j12161j33245K2965N1543M1425j441l6500N8335
11753D98123P604j49689m8567O8533R6306l132J11417p805R009j5539j07758j22283
11741C36219k0800l28L8204l2406n3018K8460K1325M7051J29774J1803k841n9663
11729D43780r8794j03959q320N1949j47680M2617K8656J750n5745p742K0294J2883
11717A79689Q8309k6838o3306M4621p7413j4824m7213o4306m0670L6329Q7043
11706A01421J39462m7532R814o0811m0997J75100Q9279n2717p9464M029o5132
11695A72452P9201L2254p2707k3634j40056p142O2500P7996J9307M6079J21335
$$ y = [475585, 619056, 697493, 680138, 723409, 803313, 779170, 641145, 635762, 541645, 409621, 482165, 627477, 618506, 607202, 495041, 361796, 384761, 436304, 477729, 476288, 439788, 498123, 505727, 356038, 307471, 376004, 472310, 469178, 580595, 572790, 581799, 566260, 458502, 336219, 315419, 315091, 353295, 320889, 267871, 296331, 317656, 364707, 494481, 506284, 503443, 443780, 344986, 241027, 232707, 284656, 136976, 179593, 208249, 209999, 154254, 146512, 166806, 179689, 267998, 241160, 177854, 222475, 145062, 130238, 83025, 18719, -21951, 14378, 101421, 240883, 193351, 203165, 142354, 101357, 276457, 365736, 313019, 233555, 237584, 172452, 251653, 283907, 211200, 187566, 47510, 40368, 102868, 180864, 200171, 246250, 367585]
11684C67585J52419p9448m3659r6271Q068Q1538j27130k0612K1425j1436j05182
11673A47297P193R9417p397k7374R7324J01747o2950j38229k8416j0392L107q325
11661A73002J9171J80497J294r2762M0609L2304o0870q4184j12832p3784J15831
11650A38276J15249M5349M6918K99l1536m6510J4537r4103N5788L5358R7911P9571
11638D57107m1789p4772j60255j6659J52845Q066j51254j67151J9211K05499K7411
11627B58259j7861K9879m7544j192J7980J0161Q628O8736l8624n4600R501J21774
11615C65097l4787j28720Q2270k6828m9155N8983r3761J1873P8281k7248o8878
11604A67127m2624j10494j45567J6095R1110p710J2460N8821j3063J69422R1110
$$ y = [367585, 520004, 440556, 396897, 300626, 308694, 390232, 263102, 242490, 263915, 252479, 147297, 154490, 253907, 246510, 219136, 316460, 418207, 355257, 217028, 188612, 178220, 181327, 173002, 192173, 372670, 373964, 281202, 321811, 354115, 293245, 209061, 96229, 22445, 138276, 253525, 298874, 345792, 346091, 314555, 268045, 282582, 188479, 244267, 279625, 377536, 457107, 415318, 340546, 180291, 163632, 316477, 324543, 173289, 6138, 25349, 230848, 258259, 240398, 270277, 222733, 221541, 239521, 249682, 258310, 327046, 288422, 233822, 243323, 365097, 330310, 201590, 283860, 257032, 207877, 266860, 173099, 184972, 263253, 236005, 167127, 124503, 14009, -131558, -115463, -24353, -32063, -19603, 39218, 26155, 195577, 286687]
11593B86687p8070p9487r5012k7043O8868l6312L0266J22419J30673l9914j35602
11582A47473K9833O8446j134m5248j66001Q0274j4182p9761k8916l4949J28557
11571H4392M4513K1510l4690k7095r1732l5700J75062P9761r5846j45629J05137
11560G9683R6704N4519p6635K896N7365p125j4193k7375l1047j0241m4957j0732
11548F8862L3768m9614j5991Q6299J40003k3417j15833j50600p1847J35382P4376
11537A11388l8400j47302j5102l7234P7080J60414L4841q7800q2858l3199L9252
11526a8920r6614k4907K1157q5374Q8237R0726L861j1695J61151O0869m1179n4852
11514I2460p0502Q904L0384m1656j50163M0675J5227P6337l1552p3913l0141o2462
$$ y = [286687, 208617, 129130, 34118, 7075, 75943, 39631, 69897, 192316, 322989, 283075, 147473, 177306, 245752, 244618, 199370, 33369, 113643, 99461, 19700, -9216, -44165, 84392, 128905, 150415, 115725, 88630, -3102, -38802, 136260, 216021, 120175, -25454, 79683, 176387, 230906, 154271, 157167, 214532, 207407, 193214, 165839, 134792, 124551, 79594, 68862, 102630, 53016, 37025, 123324, 263327, 239910, 124077, -26523, -98370, 37012, 111388, 72988, -74314, -89416, -126650, -49570, 110844, 145685, 57885, -24973, -58172, -18920, -115534, -140441, -119284, -204658, -116421, -25695, -21834, -33529, 127622, 188491, 147312, 92460, 21958, 30862, 61246, 19590, -130573, -89898, -74671, 1666, -29886, -103799, -133940, -196402]
11502a96402J12251K15252J21634m8736N1351m894p5942q8275o8051J5211q5817
11491e2418K090J7131j5982k6831J38376m5010p2722J18816j9592q5339Q9619
11480D8138K39019R2020Q114j91677j98767K0799N3718j21550j9007n3939J0688
11469a12444M7644P8153R5925Q0375r6761L9509L9383o3882J406q0755m5964M3637
11457B6226r2399m7432m0613J51023J2103j12586j7534R8987J30656o9704j60533
11446a21806L7046Q2557J46050J2421j64694m1503Q2840Q707K9551J04143k2986
11435A52326j70902q0016m942J23278R4523k2701j2961O088N9663p5380k09168
11424a40192J9764k7416l4411R0712O0158O8164J137l4660k6385k4066R7298n171
$$ y = [-196402, -84151, 131101, 252735, 203999, 255350, 250456, 174514, 86239, 18188, 33399, -52418, -50328, -33197, -49179, -76010, 62366, 17356, -55366, 63450, 43858, -41481, 48138, 287157, 379177, 387291, 195614, -3153, 17646, 71364, -50186, -69193, -123132, -112444, -64800, 13353, 109278, 189653, 92892, 132401, 171784, 107902, 109308, 28553, -17411, 26226, -66173, -113605, -154218, -3195, 8908, -103678, -121212, -22225, 108431, 38727, -121806, -84760, -2203, 143847, 156268, -8426, -49929, 32911, 41618, 71169, 175312, 152326, -18576, -98592, -103534, 19744, 114267, 91566, 78605, 84693, 144356, 68976, -140192, -120428, -147844, -182255, -91543, -31385, 36779, 37916, 3256, -23129, -47195, 50103, 44932]
11412D4932j16197n4969J25532J6625L6925N0869o7348m5028j2760o0521R0488
11401H548P7444o8772K8939p2638j41184O2091J03002j669j99225N5530l9675
11390a87609j27588R3323J68590R7711p4235J28435J04748q5541j67451k0581
11380g0198M3776p717Q191N1752N5446N7710m1680l9257L0479J048k9218j33348
11368g3016m9792R5354L1313L1757O0329k691K3116n0757j5493j31799k18941
11357c00620j6159J50776N9904O320P9170l5113j83816J31724K8836j40279j04149
11346c23406J31920O5623l0045P1110M3561l3141j1362P6322R2830N3279j32029
11335D662l1654J05433J75076P6077j70650p9106n1980P3283J91435J71m0340
$$ y = [44932, -71265, -126234, -702, 15923, 52848, 103717, 36369, -8659, -21419, -81940, 8548, 85992, 17220, 46159, -26479, -167663, -105572, -2570, -4239, -203464, -147934, -187609, -315197, -221874, -53284, 44427, -29808, 98627, 203375, 117834, -49617, -70198, -26422, -34139, -25948, 25804, 81250, 138960, 97280, 58023, 88502, 89550, 60332, -73016, -122808, -27454, 3859, 35616, 95945, 93254, 116370, 65613, 50120, -81679, -300620, -316779, -166003, -106099, -99779, -20609, -55722, -239538, -107814, -78978, -219257, -323406, -191486, -125863, -155908, -84798, -41237, -74378, -85740, -9418, 83412, 136691, 4662, -26992, 78441, 253517, 329594, 158944, 79838, 27858, 101141, 292576, 292747, 252407]
11324B52407o7012k7003M8465j9916j09061q6563j12327M3790q6782j72167R3091
11313b43078J06782l2733n6336M841R6804P0211l8788P870r2048K859J3689j6679
11301a76606N660Q7385L616j2271M0930N3748j1099o2727M5210P1584m8051k03163
11289b05784l845J83990J30869k4265K9109q0321n1374l7478J9035P5700Q3841
11278A19477P6295j19688Q8935L9146J3726m6007k1518j88835l5115j9101L2652
11267f0033m2407l9031r898L8983J7648k2514L5007K6128m8375N9342J89574R6955
11255B41379M2210j04647j11393j20891Q5835p3591j31952j3148O3727O8593P6246
11244B2368K4088M5010L1842N8224J69j26189R623J65285O1733j67668k55621
$$ y = [252407, 185395, 158392, 206857, 186941, 77880, -8683, -121010, -77220, -164002, -336169, -243078, -136296, -169029, -225365, -220524, -123720, -53509, -92297, -84427, -176475, -173616, -159927, -176606, -170946, -83561, -79945, -92216, -51286, 2462, -8637, -71364, -26154, 45430, -2621, -205784, -209629, -25639, 105230, 80965, 110074, 29753, -21621, -59099, -40064, 35636, 119477, 195772, 76084, 165019, 204165, 217891, 171884, 150366, -38469, -73584, -92685, -60033, -102440, -141471, -151369, -112386, -94738, -117252, -82245, -56117, -104492, -45150, 144424, 241379, 283589, 178942, 67549, -53342, 32493, -41098, -173050, -186198, -122471, -53878, 22368, 46456, 91466, 123308, 181532, 181701, 55512, 65135, 230420, 292153, 124485, -131136]
11233a31136j06285l8926M6176J09986O0877j00149j6745J19048O7877n3835j3132
11222e6244m557j6992L2399L1232m4623N1167j9770n2645O745J03010O4357j0865
11210H3214j52920O3518R2698q0824q5405K9833R6017J3276J20477N3004j02587
11199A30301j05873K1070n628N897k5359q4539M2968J11556M3704o9823J5243
11188G9517N65O0776Q4820o5290o1011L2344o900n3077j12m343j29913j6574P6983
11175b215N5944j16288k0936m8780q4028J83134J48254P6835q2943k926k9968
11164G6083N9794P3071k1232m4321Q886j6915l7938J4849J1415j29272j53881
11153a59461M3012O3217r4920J3056N4841o0871p000l2423J7828L6782J90929
$$ y = [-131136, -237421, -276347, -230171, -120185, -59308, -159457, -176202, -57154, 10723, -43112, -56244, -60801, -77793, -45394, -14162, -58785, -7618, -27388, -80033, -73288, 29722, 94079, 83214, -69706, -6188, 86510, 5686, -79719, -49886, 46131, 59407, 179884, 232888, 130301, 24428, 45498, 39870, 45767, 20408, -64131, -21163, 90393, 134097, 64274, 79517, 80082, 140858, 225678, 160388, 99377, 131721, 124821, 71744, 71632, 67289, -62624, -79198, -2215, 53729, -62559, -83495, -132275, -216303, -33169, 115085, 191920, 108977, 106051, 76083, 135877, 208948, 187716, 143395, 152281, 135366, 97428, 112277, 123692, -5580, -159461, -116449, -53232, -148152, -135096, -80255, -141126, -148126, -180549, -162721, -125939, 64990]
11142F4990J29210J7417k04135j28689r7690P7342k5850P983p7490K8811J38499
11131f9602L2423J0442J70l8818J3298J46081N0803p3910m1824j8889j4871l9202
11119d3899L135N9605o64j4037l143r1327R8574q030J433j1817n2361j8923q4960
11106a66414R700J08706K399K6201k1613N4105p032m7887j33180Q4008K99464
11095B08457J03513j03069R28L8396k6903n7205j33472k44333M0879R1698l06
11084h1417R8634l0P1625N5414p3639j21019j8202l7862K8020L3738M0668N1802
11072D7732j05504j40591N2393l0519m4153N1053J12945J00736m4979J04975m2729
11061F1359j04346o4052k4093r4787j06998Q9959J14048J23255J12221J4926k5043
$$ y = [64990, 194200, 211617, 7482, -121207, -218897, -141555, -167405, -159422, -236912, -208101, -69602, -37179, -26737, -26567, -65385, -52087, 93994, 144797, 70887, 29063, 10174, -4697, -43899, -40764, 18841, 18177, 4140, 997, -90330, 8244, 214, 1647, -10170, -62531, -81454, -166414, -156714, -48008, -45609, -19408, -41021, 13084, 6052, -41835, -175015, -91007, 208457, 311970, 208901, 209829, 248225, 221322, 164117, 30645, -213688, -172809, -81111, -81417, 17217, 17187, 88812, 144226, 70587, -50432, -68634, -106496, -78476, -44738, -4070, 47732, -57772, -198363, -145970, -176489, -220642, -169589, -56644, 44092, -887, 104088, 61359, -42987, -107039, -131132, -225919, -332917, -242958, -128910, -5655, 106566, 121492, 96449]
11050I6449m9281R4838j7107J31862K43190P7677j23227n7129j6871j27735l8718
11039B13948p1513j0676m068R9579R2874O4975R7219L9604L9256n0971p5908J7815
11027D52134J59110l6216n3707M2342J10818J51787J58459r0241j17811j64541
11017F12134m5789j9186P769j13553n7553K626J21209K30213Q976j17109o5085
11006E64652j6947j92382j18217L575j66347o9852J28081O5875L6730j7176K6537
10995B44529N9593j18353K5165l8569j11498K1733Q6637o2595l5906K490l3348
10984C9878m5455m6533l3554o4040J0059J18379j01863k7487J44114O3371M6431
10973A03300J4669l4530r7305j0308J3694Q5999O9665n263n3496j78836N733j628
$$ y = [96449, 47168, 142006, 124899, 256761, 499951, 577628, 454401, 397272, 380401, 252666, 213948, 142435, 131759, 127691, 227270, 320144, 385119, 482338, 521942, 561198, 510227, 434319, 452134, 611244, 575028, 521321, 563663, 674481, 826268, 984727, 894486, 776675, 612134, 566345, 547159, 554928, 441375, 383822, 386448, 507657, 737870, 746846, 629737, 564652, 547705, 355323, 237106, 240681, 74334, 4482, 132563, 198438, 235168, 217992, 244529, 304122, 185769, 210934, 172365, 60867, 82600, 169237, 106642, 70736, 73226, 39878, -5577, -52110, -85664, -149704, -139645, -21266, -123129, -150616, -6502, 56869, 103300, 117969, 83439, -13866, -24174, -10480, 75519, 145184, 139921, 86425, -92411, -86678, -88306]
10961h8306N072O9562J51977m8276j21952l6124J15631P2042m4801j39102j20220
10950a84497K6324J31265J01716l7294j13968j03499J14934R0884J16505N29m1093
10939A01806m1822j01064M6771R3439l160o0431Q3780k0238o3268l3582m4769
10928d2538r4435n4080J19509l9893J4615J11218k5825j19517K1658o6606J16684
10917e9210J43584n3382r6529P0645L2880q4506J35655M572j16200r5319O4140
10906e3670Q8231M9555r129l4700k9275k45054r8934J07776J93033R2075O753
10895F6661J5268L9478m2010j53021o8684M4650P6022P2698M3325p455m4074j02928
10883f0070K2807n7077l6306l3335l1935L2745J5633Q3410Q831j0619J14924j16744
$$ y = [-88306, -83234, -13672, 138305, 90029, -31923, -68047, 47584, 119626, 74825, -64277, -184497, -158173, -26908, 74808, 37514, -76454, -179953, -65019, 25865, 142370, 142899, 101806, 59984, -41080, 5691, 99130, 95970, 35539, 119319, 99081, 35813, 2231, -42538, -136973, -191053, -71544, -111437, -96822, 14396, -11429, -130946, -109288, -175894, -59210, 84374, 30992, -65537, 5108, 37988, -46518, 89137, 93709, -22491, -117810, -53670, 34561, 84116, 74987, 40287, 11012, -234042, -332976, -225200, -32167, 59908, 66661, 81929, 121407, 79397, -73624, -142308, -97658, -21636, 51062, 94387, 86932, 42858, -60070, -37263, -94340, -130646, -163981, -195916, -163171, -147538, -64128, -55297, -65916, 49008, -67736]
10871f7736N7110J17766R943k623l1205Q1154J339k9861l2300l9074j51580j19582
10859b06649J70929J8623r4573m8184o0291n4680J9828J06192k1808l5375M8745
10848a57243J71677J16441Q3977k27404K2538Q6632n971J51378R0510j00498J121
10837B33158k4819j90585j42966K9787J80075K4659j81965J7711j5274O2280J54690
10826A46751k14197m3935J18024J9908j8657N8783M2916R410j6575l6159k0149
10815D6120j07311j31691j4248l4922Q5225K23730j17696n2385J00757q2721K0900
10804f4242Q4882k7567l7036R0470R5177O1306n1911q8221m9891o044o0102o1972
10792a15151J80501Q6638J24959j2258k2242j8445o4203J4359m8523p3967k7691
$$ y = [-67736, -10626, 107140, 117083, 114460, 83255, 164409, 165748, 135887, 103587, 64513, -87067, -206649, -35720, -17097, -111670, -159854, -220145, -274825, -254997, -148805, -170613, -205988, -157243, 14434, 130875, 214852, -12552, 9986, 96618, 90647, 242025, 332535, 232037, 233158, 208339, 17754, -125212, -95425, 84650, 109309, -72656, -54945, -70219, -7939, 146751, -67446, -111381, 6643, 26551, 7894, 66677, 109593, 119003, 102428, 66269, 46120, -61191, -192882, -207130, -242052, -156827, 66903, -50793, -103178, -2421, -85142, -64242, 20640, -6927, -43963, 46507, 141684, 202990, 151079, 62858, 12967, 6923, -53179, -115151, 65350, 151988, 276947, 264689, 242447, 224002, 159799, 174158, 125635, 51668, 23977]
10781B3977j7945P586n4347R1325r2746p5867l5836R4117p5854j16582O7383q478
10769a93267Q1638J17379l8641j10096N3267q2884R5301K2219K3891J0819l4625
10758e4999r1199P1259J16410K3275l1283j6066J9514j24751N3815J28064O1817
10747A55856q1428L9912P9043J50491J5633k03479j82078n1581J41001J9303j71464
10736h8791k9781P9938L3294N1515l4022R7573J88166j5608j14679l0277K2657
10725A59985p1822o8014r619J75686P4339L3923K0750o8262j361q8858j44979
10714A1768O1348J1501m1740K1846J633J63094J45915m7696j23194r6550o1158
10703D6767Q861n7298J46610J823o4888L5298j27395r1367M5200j4671N5901M4070
$$ y = [23977, 6032, 13618, -40729, 50596, -42150, -118017, -153853, -59736, -135590, -252172, -184789, -193267, -111629, 5750, -32891, -142987, -89720, -172604, -77303, -55084, -31193, -20374, -54999, -146198, -74939, 41471, 64746, 33463, 17397, 36911, -87840, -34025, 94039, 155856, 74428, 114340, 193383, 343874, 359507, 156028, -26050, -77631, 63370, 82673, -88791, -118572, -38634, -5340, 46175, 12153, 109726, 297892, 282284, 167605, 137328, 159985, 88163, 20149, 10530, 186216, 260555, 294478, 315228, 246966, 245605, 156747, 11768, 73116, 84617, 42877, 64723, 66356, 229450, 375365, 327669, 204475, 107925, 46767, 55628, -1670, 144940, 146763, 81875, 117173, -10222, -101589, -56389, -71060, -15159, 28911]
10691B8911R3769p6680L1486l3681r1551j3731Q0433M3615N7701L5447q8194m3893
10679B3632P4647P8368N9595m5357k9948m2437m6642n457J98366J4393m7644L7829
10667B69345L9311M9032O8980r470p2592j04398J21441l9178O9617J52952j5561
10656E29479j6213L3926k5442J54781P6684m567L3769K2082l1616N2939K9452
10645H55274j1318m8444P4724J86800J39127K6442k2920K42615J15117k0238M8961
10634A586140L49264L43763M07042L87321K48186L02578M42215M32428M31600
10625D930537M15655P72429J213156J536089K227210L125267M174412N689386
10617B4084141P454404R126497R440147O845671K108129k271018m014325l216231
$$ y = [28911, 122680, 46000, 77486, 43805, -47746, -61477, 18956, 62571, 120272, 155719, 67525, 23632, 98279, 176647, 236242, 190885, 160937, 118500, 71858, 66401, 264767, 279160, 231516, 269345, 308656, 357688, 426668, 417198, 344606, 240208, 361649, 322471, 392088, 545040, 529479, 513266, 547192, 521750, 676531, 753215, 748648, 782417, 804499, 772883, 825822, 855274, 843956, 795512, 870236, 1057036, 1196163, 1222605, 1199685, 1442300, 1557417, 1537179, 1586140, 1935404, 2279167, 2686209, 3073530, 3321716, 3624294, 4066509, 4498937, 4930537, 5346192, 6118621, 7331777, 8867866, 11095076, 14220343, 18394755, 24084141, 31538545, 40665042, 50105189, 56950860, 59058989, 56787971, 52773646, 49557415]
10609D9557415r29938J889730N565534R864758J4718408J8858972J9013262J1994814
10601A30532955n33340j0701301j3953719j1252852n958207r4460O061529J2712058
10593A06812663J9590039K4659298K3066692J0803782q056034k2021806k5170984
10586A29683650k0373774j3213653o531847l33200N400874J0384333J3476577
10579A18492960J1376266K296614j0187595j8467252j9501992j5430497j0204559
10572E8373945n673435j971422Q43440L007977L758358K312775j567925o282138
10564E2801575r311630r366641p985449o004160m339397l052269k181325j686452
10556H874252j277070q82401o27576o85030o89985m17448m03409m66968m34145
$$ y = [49557415, 48627477, 50517207, 56082741, 65947499, 80665907, 99524879, 118538141, 130532955, 129999615, 119298314, 105344595, 94091743, 88133536, 88039076, 94100605, 106812663, 126402702, 151062000, 174128692, 184932474, 176876440, 154854634, 129683650, 109309876, 96096223, 89564376, 89231176, 94632050, 105016383, 118492960, 129869226, 132165840, 121978245, 103510993, 84009001, 68578504, 58373945, 52700510, 50729088, 51572528, 54580505, 58338863, 60651638, 59083713, 52801575, 43489945, 34123304, 26137855, 20133695, 15794298, 12742029, 10560704, 8874252, 7597182, 6714781, 6087205, 5402175, 4712190, 4294742, 3891333, 3424365, 2990220]
10547B990220k35851j26006j82520j68487m287j59127k03341q9379j665k74736
10537A544821j24484j17334o5376l2175O5026M2740o8445p1259o0455j397k7943
10526A083719j18387j33064o1836J26064K05360p6278j10836n1577J28556n8417
10516I33304L4907j7892q1652r1556q4498j23275J7121j1746n1183O5767k3704
10505E65593m5223R4127J62881o5576k7298r4241q6112J5047j4754k3535Q7042
10494E67951n929K2890L8013o9912j45283L9282L1604J83749M4717j68410j73745
10483C64927K0050J04308J07571n232j52236o6895J7378q301Q4548L479l4106
10472D35491j50204m6444O9361N8278k4841J34804P0321r3959J5258o3109j44188
$$ y = [2990220, 2754369, 2628363, 2445843, 2277356, 2273069, 2113942, 1910601, 1821222, 1819557, 1544821, 1420337, 1303003, 1237627, 1205452, 1270478, 1313218, 1244773, 1173514, 1113059, 1111662, 1083719, 965332, 832268, 770432, 896496, 1101856, 1025578, 914742, 863165, 991721, 933304, 968211, 950319, 868667, 777111, 692613, 569338, 586459, 574713, 523530, 589297, 565593, 520370, 614497, 777378, 711802, 684504, 590263, 504151, 519198, 504444, 480909, 567951, 562022, 584912, 622925, 553013, 407730, 447012, 478616, 662365, 707082, 538672, 364927, 384977, 489285, 596856, 591624, 439388, 372493, 389871, 381570, 466118, 469597, 435491, 285287, 238843, 308204, 366482, 341641, 476445, 546766, 452807, 468065, 404956, 260768]
10461B60768p1637N162m8755M6274J63529P4516J26044r3759p0893M2594P6411
10450E10254O920Q9292n0816k88288j63881M1379J24185R9337J51676L0212j08781
10439D41489m8685j65605o4040j7320m4922j6683O9022P0199P9442m792q8798
10428B09307M402n6323j4908R9741K3989l843K1114m461J17628O7428q4539n5748
10416C23787L260j12061q0963R508P8151o6739o9134J06709Q9534r3695p4620
10405A13737k371J18517K2848m7584j32949j11593P8836P2322R9058j26144j28258
10394d3581N4741M178J18418L6744p7283m3761j3175R0263m152l6049j50347k4750
10382h8754P9258k7890p184L6102J10634O9793r0127p3735k8596J46505l4195
$$ y = [260768, 189131, 194293, 145538, 191812, 355341, 429857, 555901, 462142, 391249, 433843, 510254, 517174, 606466, 555650, 267362, 103481, 144860, 269045, 368382, 520058, 550270, 441489, 392804, 227199, 163159, 145839, 100917, 84234, 153256, 223455, 302897, 298105, 209307, 213709, 157386, 142478, 242219, 266208, 262365, 283479, 279018, 396646, 464074, 379535, 323787, 327047, 214986, 134023, 143531, 221682, 154943, 85809, 192518, 282052, 188357, 113737, 111366, 229883, 252731, 205147, 72198, -39395, 39441, 111763, 210821, 84677, -43581, 11160, 15338, 133756, 170500, 93217, 49456, 36281, 126544, 122392, 86343, -64004, -88754, -9496, -37386, -44570, -8468, 102166, 171959, 81832, 8097, -20499, 126006, 91811]
10371I1811p587L9443p1405o3013J8319M4320P6680m6425q3142M6062q1348j8119
10359e4404J01023n0913P3844O435k2112o33Q127L3806n778J23980J4648l5889
10347A92134j07607J31144N4665p5276k35452r1716J0098J18934J38470N3486
10337A88880j5092m7798k1356j38586n9212L5356K6298J0716L4629P6613L5467
10326A25915q7678L6091M0149l9138K1508L5822M35j8259p9700P7796O0478P9319
10314B52738r3516Q5731m2047o2504l4729r8314j61324j0112r783N4113J01653
10303a8094J37305m3083j03085J09174K39727q1463r6356l3294O006m3749m8188
10292B4900k0343n3297j56866n6903k6761R2891L5425Q8556K02266K8414p6419
$$ y = [91811, 84224, 123667, 52262, -10751, 7568, 51888, 128568, 82143, -999, 45063, -36285, -54404, 46619, -4294, 69550, 75985, 53873, 53240, 61367, 95173, 89395, 213375, 228023, 192134, 84527, 215671, 270336, 195060, -40392, -132108, -122010, -3076, 135394, 188880, 173788, 125990, 104634, -33952, -93164, -57808, -31510, -20794, 13835, 90448, 125915, 38237, 74328, 114477, 75339, 96847, 132669, 133104, 114845, 35145, 112941, 173419, 252738, 159222, 244953, 202906, 140402, 105673, 7359, -153965, -164077, -173860, -119747, -18094, 119211, 76128, -26957, 82217, 321944, 240481, 144125, 110831, 116837, 73088, 24900, 4557, -48740, -205606, -262509, -289270, -196379, -160954, -72398, 129868, 158282, 81863]
10281H1863k24650j30872J0242J56224J0863j02985L6545L8871J16239j8128n5825
10270h1613j69075O3024J30285J91454J52303o6779j94671j49228o9788p6925
10260b71013Q1832J29626l2295R017R9023P2291n6278J4464j4067p8013k9464
10249g4877J6128L468J8090o4701m7972P929k1737J17678J8238j06255K8660j0219
10237a15570m9224O3584M8197K2355j6324j9597R6834J33831M7076r5219m9550
10226F6393l2869l6293L0988k7587j04263o5830M9184J08477j16482j64824j9912
10215c13018M7017J49025J4687M0412J05023M026j64685M3400r1797j44546k7641
10204c38097O4188J08589O7071P8497M3879K975L6508L4968k4977M656j11369
$$ y = [81863, -142787, -273659, -263417, -107193, -96330, -199315, -162770, -123899, -7660, -25788, -81613, -250688, -187664, -57379, 134075, 286378, 219599, 24928, -124300, -194088, -271013, -189181, -59555, -91850, -82833, 16190, 88481, 32203, 46667, 32600, -45413, -74877, -58749, -55281, -37191, -101892, -149864, -141935, -163672, -45994, -27756, -134011, -105351, -115570, -164794, -101210, -53013, -30658, -46982, -66579, 30255, 164086, 211162, 115943, 66393, 33524, -2769, 28219, 632, -103631, -169461, -120277, -11800, -128282, -293106, -313018, -266001, -116976, -102289, -61877, 43146, 47172, -117513, -74113, -165910, -310456, -338097, -273909, -165320, -98249, -19752, 24127, 27102, 63610, 98578, 73601, 78257, -33112]
10193c3112p9530K02151J24403j8488j71850j41091O0868j1544l2684J46376J5365
10182F0864l2758Q2733p982k1512N5314J10665J13443L7942K1227o3267J5996
10171C72665J82l6625l9666N6415K57372J42027k9675q5837j10725j25662J4756
10160D15227J23013Q8049k0196J15686J90362J50160l015l600k4948j34389j67241
10149G29108j27335j02900Q4526L6527p522O8266J595o9345P5239l1377r1076
10138E65706j0642L5520p3011j75978l5521J43618k1626j21282j63052m3378M6351
10127A46705n269o0921k5883r6975o1325N3271N3355M8136P8035j3489M3135j08765
10115E0010o0600N0249j6710P4330J22812J11727N0041j45239j23991l1564J06935
$$ y = [-33112, -112642, 89509, 213912, 195424, 23574, -117517, -56649, -68193, -100877, 45499, 60864, 28106, 110839, 102857, 81345, 136659, 247324, 360767, 398709, 419936, 356669, 372665, 372847, 336222, 296556, 352971, 610343, 752370, 722695, 636858, 526133, 400471, 415227, 538240, 626289, 606093, 721779, 912141, 1062301, 1059286, 1055686, 1030738, 896349, 729108, 601773, 498873, 583399, 619926, 612404, 680670, 682265, 612920, 688159, 656782, 565706, 555064, 590584, 517573, 341595, 306074, 449692, 428066, 306784, 143732, 100354, 146705, 141436, 80515, 54632, -42343, -103668, -50397, 2958, 51094, 129129, 115640, 158775, 50010, -10590, 39659, 22949, 97279, 220091, 331818, 381859, 236620, 112629, 81065, 188000]
10104A88000o9439p4117n8953m0773j48712q0028P6314J89609N4341J24862r6923
10093F4181j35368O7529K3756M8422N3377p9274j37374R8064n054J08612R7732
10082B04603o1731r0037n7457p9097j26684j05597N9221J3349Q7032K34569j8597
10071E9574m4072j09397O9895o7717o6854O1237O9187J9997j12063J3894j19401
10060b25720j2585J00433J06700N8103n9527k15497N314K24028J57128m5777L2819
10049A25419N8422j34437j02025l6409M3162P604K2261n9571o4784p2954Q6622
10038a26690N0255N5570L4578J52191L1890j46957j50495l3646J48768m3663m8974
10027g7173J19370M4321L25j09591j90022l6438J29701J05109L6946K0997j00374
$$ y = [188000, 118561, 44444, -14509, -55282, -203994, -284022, -207708, -18099, 36242, 161104, 64181, -71187, -3658, 20098, 68520, 121897, 42623, -94751, 3313, -1741, 106871, 204603, 142872, 52835, -4622, -83719, -210403, -316000, -256779, -243430, -156398, 78171, 59574, 15502, -93895, -24000, -91717, -158571, -97334, -28147, -8150, -120213, -106319, -225720, -238305, -137872, -31172, 26931, -32596, -248093, -242779, -18751, 138377, 92600, 125419, 183841, 49404, -52621, -89030, -45868, -38264, -16003, -75574, -140358, -213312, -126690, -76435, -20865, 13713, 165904, 197794, 50837, -99658, -133304, 15464, -28199, -77173, 42197, 86518, 86843, -22748, -212770, -249208, -119507, -14398, 22548, 43545, -56829]
10016e6829q7852m2956p974K7302Q169q2601J03567K60030J10873n0951j22235
10005E8543k917M8255R4762M7700q6904p7942j22373n473J09411k7260J0534J3077
9993E9413j32985P7983J02488P2573M0766j08380j19948J8184k8253l8626n8808
9982a15593j32921N7938P2292O1356R6872M9407q8393j8259J16461J3067K3687
9971A35914O1436n5271j5870j58391p7626Q8170J19616K9752p4195m3013J29095
9960A39617J8584K3019p0038K359R0460L14m2814j19973O8904m0672j27708L9252
9948a8696j7041J24386j5503j6610L7974L9O339n404Q520q3412j90818j9505O9370
9935a20361Q311N2810J63599M029O9666K1967j09549q9571q7533m2139l2897K1619
$$ y = [-56829, -144681, -187637, -195611, -168309, -160140, -242741, -139174, 120856, 231729, 180778, 58543, 55626, 103881, 198643, 246343, 159439, 81497, -40876, -46349, 63062, 35802, 46336, 59413, -73572, 4411, 106899, 179472, 220238, 111858, -8090, 10094, -18159, -56785, -115593, -248514, -190576, -118284, -56928, 39944, 89351, 958, -17301, 99160, 112227, 135914, 197350, 142079, 126209, -32182, -109808, -21638, 97978, 127730, 53535, 10522, 139617, 158201, 181220, 111182, 113541, 204001, 204315, 161501, 41528, 110432, 69760, -57948, -18696, -35737, 88649, 73146, 56536, 94510, 94549, 100888, 95484, 104004, 20592, -170226, -189731, -120361, -112050, -59240, 104359, 108388, 178054, 200021, 90472, 901, -86632, -128771, -161668, -140049]
9923a40049O6658N5350k7821J9902Q2490J30978o7065j03493j32116p4185O8370
9912a20981M4188K1508Q5726J04824Q0581l2558p3205j6077j12449j45982O2849
9901a01576K01220L34K1997o8999r7805M5171m6186j5914R8461P1605L450K0176
9889A31934j5182o1745q0666j23488j06655K02086K25643o5578j38102K9611r0573
9878i2715l9539l831n7490K6637K8146J0638o505L3384J31978n4111j23018K8223
9866a18203O5222j8729q9962m9895k7470J03196J25265p8157j07381Q5933K10833
9855A00652J33834j0406J9335j57233k04454j26356N7153J27661j2476n4069J226
9844a25133k5516n8634O65L5466l504J29506J09896j36298r4098N5552O1379J7739
$$ y = [-140049, -73391, -18041, -45862, -25960, 56530, 187508, 120443, 16950, -115166, -189351, -120981, -76793, -55285, 30441, 135265, 215846, 183288, 110083, 94006, -18443, -164425, -101576, 99644, 99978, 121975, 52976, -44829, 342, -45844, -61758, 36703, 108308, 111758, 131934, 116752, 55007, -25659, -149147, -255802, -53716, 171927, 106349, -31753, -2142, -92715, -132254, -136085, -193575, -166938, -138792, -128154, -134659, -101275, 30703, -23408, -146426, -118203, -52981, -71710, -161672, -211567, -239037, -135841, -10576, -88733, -196114, -110181, 100652, 234486, 224080, 243415, 86182, -118272, -244628, -187475, -59814, -72290, -126359, -125133, -150649, -209283, -208618, -173152, -176656, -47150, 62746, -73552, -167650, -112098, -50719, -32980]
9832c2980r055k8951R1704O0529Q5662j1144r4617K1070p032j63285q9656R525
9820a68230q9913j14938J05571J67552J54852P123m5434J0592K8001O582j47826
9809h6068J3343o3204o4226N5294M918k6366O7208K4654J24114K6518m1025K7717
9797F2877k3407R383j06156K6879R800O2766R0193N8296o0456j76830j02749R1982
9785e7422n663j1532J12969J02442M499k383J9081j13658l8328r819l8610j09023
9773a47447j19640Q7656J39095N01R943J7454m0486K6152o5126j3582n418o5380
9761a76278r7512J05189P3096N0469L5243j09279j01471J73261Q5506q3115j33670
9750a78561J19673Q8686P8580M8230l0075q5119M6385o2897o3851J27067M161
$$ y = [-32980, -42035, -70986, 20718, 81247, 166909, 155765, 61148, 82218, 75186, -88099, -177755, -168230, -258143, -373081, -267510, -99958, 54894, 62017, 16583, 27175, 55176, 61758, -86068, -72725, -135929, -200155, -144861, -139943, -166309, -99101, -74447, 49667, 76185, 35160, 62877, 39470, 48853, -57303, -30424, -20624, 42142, 132335, 190631, 130175, -46655, -149404, -57422, -63085, -74617, 38352, 140794, 145293, 142910, 161991, 48333, 10005, 186, -38424, -147447, -267087, -179431, -40336, -39835, -29892, -12438, -52924, -26772, -91898, -105480, -110898, -176278, -273790, -168601, -95505, -45036, -9793, -119072, -220543, -47282, 38224, -44891, -178561, -58888, 29798, 108378, 156608, 126533, 41414, 87799, 24902, -38949, 88118, 92279]
9739I2279p4497L0474j26273m134o1557J11652J72332o2538p8886p765M8013j164
9727C7936o098r3096m0681q8091o6833j2775J78480J18255J15406j154j5729L9448
9715A65068J4773j29l6256m6530O932q1867j6136k3403q5716J4812O3534R7065
9703G2147o898L1247M6124P1813r9213j4804L1024L253j22028p2306n2391k9240
9691a41272N0531J03620l9494q4614J6318M2260j8674l724J95665n196n1225J11249
9679A75444m0265j41450o1171n0591j08899J1801N3322l4015q2799J39351J4507
9668a24765Q633J79421J85385m8837j05642Q6641n2506J02241L392p1176j04334
9657E8453m5344L3512j00818l3793O4912l9576k11454p6025N4634Q6494M4519
$$ y = [92279, 17782, 48256, -78017, -82151, -143708, -32056, 140276, 77738, -1148, -8913, 39100, 37936, 31838, -61258, -101939, -190030, -256863, -269638, -91158, 27097, 142503, 141349, 125620, 165068, 179841, 179712, 143456, 96926, 103858, 21991, 5855, -17548, -103264, -88452, -24918, 72147, 65249, 96496, 142620, 214433, 115220, 100416, 131440, 134693, 12665, -59641, -112032, -141272, -90741, 12879, -26615, -111229, -94911, -52651, -71325, -75049, 120616, 115420, 64195, 175444, 135179, -6271, -67442, -118033, -226932, -215131, -161809, -195824, -278623, -139272, -124765, -116132, 63289, 248674, 199837, 94195, 180836, 128330, 230571, 233963, 162787, 58453, 13109, 46621, -54197, -87990, -23078, -62654, -274108, -350133, -295499, -209005, -164486]
9646a64486r305P6418K02031m0331j03093l344K1274R4017N8890O2663j09381
9635H5353r0882l8983M0720Q1984q22l9168n1335k677P7686J7293L9394m9837
9623F8726K7123K350o3061j11749J0835j2540n8583j01096J05408Q8989R501M9720
9611A5623l1878m3346j06328j0609O4209M408J42907N8844r9154p8231k9796J42167
9599B8816j0865j81448J2113J44243m3675N4399J6646q2052P5995J30564o7102
9588G7634o6065p802j38583l0503L894k7504L9816J09788K5973q9758J05911J98185
9576B00986K3869k01682j59482J7338J5318k131N3652N1271l7014m4012k7935
9565a09822j08126n9905Q4920Q0437K4127M0342N4252q4297J53456O1322n4278
$$ y = [-164486, -173791, -97373, 104658, 64327, -38766, -42110, -20836, 73181, 132071, 194734, 85353, -5529, -44512, -3792, 78192, 77370, 38202, -13133, -15810, 61876, 79169, 118563, 68726, 95849, 98199, 35138, -76611, -65776, -78316, -136899, -237995, -132587, -43598, -34097, 15623, -16255, -59601, -165929, -176538, -112329, -107921, 34986, 93830, -5324, -83555, -113351, 28816, 17951, -163497, -151384, -7141, -50816, 3583, 20229, -61823, 14172, 144736, 77634, 11569, 3767, -134816, -165319, -161425, -188929, -149113, -39325, -13352, -103110, 2801, 200986, 224855, 23173, -136309, -118971, -103653, -105784, -52132, -861, -37875, -81887, -109822, -217948, -277853, -192933, -112496, -88369, -48027, 6225, -78072, 75384, 136706, 82428]
9554H2428k21426r0984M2883L971j6357J2811J43896P2748m9379L3534J1882r5090
9542f9083q0529j9310O2309J6881Q7010J5912M2858L0272m6458L210O724o9363
9530a9567m7707L6787Q2472k5892j33233j20670J08374Q5460j9175Q755L8061
9519f335q2534J0299J02207j50442j1738L9796O02M9054N9640k7253m0411O2655
9507E540J40420O3945j04245o5732j30270N8702J09318q9647o4217K2187O7004
9496A3005n4014j05597j4877j5835o1049J17819J12666k6399n1863K8265L6696
9485b1183n3308m4951J15139m2793p3671L8205Q6728K5586j7483J1017Q6845k6361
9473H3770j00970k0248r124q7974J7261O4460M3498O5773k3665r1544O3257O8176
$$ y = [82428, -138998, -229982, -187099, -183128, -199485, -186674, -42778, 29970, -19409, 14125, 26007, -69083, -149612, -168922, -106613, -89732, -2722, 13190, 56048, 86320, 39862, 43072, 49796, -19567, -67274, -30487, 51985, 26093, -107140, -227810, -119436, -33976, -53151, -44396, -6335, -88869, -78570, 23637, -126805, -138543, -98747, -98145, -49091, 10549, -16704, -57115, 5540, 145960, 209905, 105660, 39928, -90342, -31640, 77678, -11969, -76186, -53999, 13005, -41009, -146606, -161483, -177318, -238367, -120548, -7882, -34281, -86144, -57879, -21183, -74491, -119442, -4303, -47096, -120767, -82562, 4166, 29752, 12269, 23286, 110131, 83770, -17200, -37448, -46572, -134546, -117285, -52825, -9327, 56446, 32781, -58763, 4494, 72670]
9461G2670L2811J68716p9418p4580o7367r1804P487L5814M5788J04893k246j42415
9449A0349j12082J77992j51j38799k1669J08500j1934J4507o2716P691p2918N1569
$$ y = [72670, 105481, 274197, 194779, 120199, 52832, -38972, -31485, 4329, 50117, 155010, 152764, 10349, -101733, 76259, 76108, -62691, -84360, 24140, 12206, 26713, -36003, -28312, -101230, -49661]
$$ [...]
##END NTUPLES=NMR SPECTRUM
##END=
