##TITLE=Analysis number 327871
Compound Code mo 08071
Book Reference 470/170
Project Code adrs 
Chemist Name mikem
##JCAMPDX= 6.0         $$ Bruker NMR JCAMP-DX V2.0
##DATA TYPE= NMR SPECTRUM
##DATA CLASS= NTUPLES
##ORIGIN= Bruker BioSpin GmbH
##OWNER= nmr
$$ XWIN-NMR		Version 3.5
$$ Fri Apr 13 10:26:11 2007 GMT Daylight Time (UT+1h)  MAYBRIDGE\nmr@NMR_250MHZ
##.OBSERVE FREQUENCY= 250.131544655141
##.OBSERVE NUCLEUS= ^1H
##.ACQUISITION MODE= SIMULTANEOUS (DQD)
##.ACQUISITION SCHEME= undefined
##.AVERAGES= 16
##.DIGITISER RES= 18
##SPECTROMETER/DATA SYSTEM= dpx250
##.PULSE SEQUENCE= zg30
##.SOLVENT NAME= DMSO
##.SHIFT REFERENCE= (INTERNAL, DMSO, 0, 16.522)
##AUDIT TRAIL= $$ (NUMBER, WHEN, WHO, WHERE, WHAT)
$$ ##TITLE= Audit trail, XWIN-NMR		Version 3.5
$$ ##JCAMPDX= 5.01
$$ ##ORIGIN= Bruker BioSpin GmbH
$$ ##OWNER= nmr
$$ C:\u/data/dgb/nmr/ADRS/1440/pdata/1/auditp.txt
$$ ##AUDIT TRAIL=  $$ (NUMBER, WHEN, WHO, WHERE, WHAT)
(   1,<2007-04-13 10:25:50.81 +100>,<MAYBRIDGE\nmr>,<NMR_250MHZ>,
      <created by zg, POWCHK disabled, PULCHK disabled
       configuration hash MD5:
       49 4B E0 1D 92 C2 6B 37 9F E6 65 BC 52 41 86 1D
       data hash MD5: 64K
       68 F5 18 A5 C7 39 97 3A 94 64 CD 2F 16 41 F8 35>)
(   2,<2007-04-13 10:26:02.28 +100>,<MAYBRIDGE\nmr>,<NMR_250MHZ>,
      <Start of raw data processing
       ef LB = 0.3 FT_mod = 6 PKNL = 1 SI = 32K 
       data hash MD5: 32K
       D0 49 22 24 A4 2C 08 39 E5 D1 F1 25 C1 1B D8 D5>)
(   3,<2007-04-13 10:26:04.06 +100>,<MAYBRIDGE\nmr>,<NMR_250MHZ>,
      <apk 
       data hash MD5: 32K
       B8 0B 24 99 04 97 08 0C CC 8A A4 3B 7F 57 5E 13>)
(   4,<2007-04-13 10:26:04.84 +100>,<MAYBRIDGE\nmr>,<NMR_250MHZ>,
      <abs ABSG = 5 
       data hash MD5: 32K
       92 96 12 49 34 81 23 55 67 30 2B DE 6D D5 48 04>)
$$ ##END=
$$ 
$$ hash MD5
$$ B3 56 7C 78 77 D4 2C 9D 77 44 73 82 D2 73 60 09
##$RELAX= 
##$RELAX= 
##$RELAX= 
##$RELAX= 
##$RELAX= 
##$RELAX= 
##$RELAX= 
$$ Bruker specific parameters
$$ --------------------------
##$DU= <C:\u>
##$EXPNO= 1440
##$NAME= <ADRS>
##$PROCNO= 1
##$TYPE= <nmr>
##$USER= <dgb>
##$AMP= (0..31)
100 100 100 100 100 100 100 100 100 100 100 100 100 100 100 100 100 100 
100 100 100 100 100 100 100 100 100 100 100 100 100 100 
##$AQSEQ= 0
##$AQ_mod= 3
##$AUNM= <au_zg>
##$AUTOPOS= <5 >
##$BF1= 250.13
##$BF2= 250.13
##$BF3= 250.13
##$BF4= 250.13
##$BF5= 500.13
##$BF6= 500.13
##$BF7= 500.13
##$BF8= 500.13
##$BYTORDA= 1
##$CFDGTYP= 0
##$CFRGTYP= 5
##$CHEMSTR= <none>
##$CNST= (0..31)
1 1 145 1 1 1 1 1 1 1 1 1 1 1 1 1 1 1 1 1 1 1 1 1 1 1 1 1 1 1 1 1 
##$CPDPRG= <>
##$CPDPRG1= <>
##$CPDPRG2= <>
##$CPDPRG3= <>
##$CPDPRG4= <mlev>
##$CPDPRG5= <mlev>
##$CPDPRG6= <mlev>
##$CPDPRG7= <mlev>
##$CPDPRG8= <mlev>
##$CPDPRGB= <>
##$CPDPRGT= <>
##$D= (0..31)
0 1 0 0 0 0 0 0 0 0.06 0 0 0 0 0 0 0.0002 0 0 0 0 0 0 0 0 0 0 0 0 0 0 
0 
##$DATE= 1176456349
##$DBL= (0..7)
120 120 120 120 120 120 120 120 
##$DBP= (0..7)
150 150 150 150 150 150 150 150 
##$DBP07= 0
##$DBPNAM0= <>
##$DBPNAM1= <>
$$ [...]
##$SUBNAM7= <"">
##$SUBNAM8= <"">
##$SUBNAM9= <"">
##$SW= 20.6930455092707
##$SWIBOX= (0..15)
0 0 3 0 0 0 0 0 0 0 0 0 0 0 0 0 
##$SW_h= 5175.983436853
##$TD= 65536
##$TD0= 1
##$TE= 683.16
##$TE2= 300
##$TE3= 300
##$TEG= 300
##$TL= (0..7)
0 120 120 120 120 120 120 120 
##$TP= (0..7)
150 150 150 150 150 150 150 150 
##$TP07= 0
##$TPNAME0= <>
##$TPNAME1= <>
##$TPNAME2= <>
##$TPNAME3= <>
##$TPNAME4= <>
##$TPNAME5= <>
##$TPNAME6= <>
##$TPNAME7= <>
##$TPOAL= (0..7)
0.5 0.5 0.5 0.5 0.5 0.5 0.5 0.5 
##$TPOFFS= (0..7)
0 0 0 0 0 0 0 0 
##$TUNHIN= 0
##$TUNHOUT= 0
##$TUNXOUT= 0
##$USERA1= <user>
##$USERA2= <user>
##$USERA3= <user>
##$USERA4= <user>
##$USERA5= <user>
##$V9= 5
##$VALIST= <valist>
##$VCLIST= <CCCCCCCCCCCCCCC>
##$VD= 0
##$VDLIST= <DDDDDDDDDDDDDDD>
##$VPLIST= <PPPPPPPPPPPPPPP>
##$VTLIST= <TTTTTTTTTTTTTTT>
##$WBST= 1024
##$WBSW= 4
##$XGAIN= (0..3)
0 0 0 0 
##$XL= 0
##$YL= 0
##$YMAX_a= 256513
##$YMIN_a= -358181
##$ZGOPTNS= <>
##$ZL1= 120
##$ZL2= 120
##$ZL3= 120
##$ZL4= 120
##$ABSF1= 16.522
##$ABSF2= -4.171173
##$ABSG= 5
##$ABSL= 3
##$ALPHA= 0
##$AQORDER= 0
##$ASSFAC= 0
##$ASSFACI= 0
##$ASSFACX= 0
##$ASSWID= 0
##$AUNMP= <proc_1d>
##$AZFE= 0.1
##$AZFW= 0.1
##$BCFW= 0
##$BC_mod= 0
##$BYTORDP= 0
##$COROFFS= 0
##$CY= 12.5
##$DATMOD= 1
##$DC= 0
##$DFILT= <>
##$DTYPP= 0
##$F1P= 14.0000005364418
##$F2P= -0.99999901652339
##$FCOR= 0.5
##$FTSIZE= 32768
##$FT_mod= 6
##$GAMMA= 0
##$GB= 0
##$INTBC= 1
##$INTSCL= 1
##$ISEN= 128
##$LB= 0.3
##$LEV0= 0
##$LPBIN= 0
##$MAXI= 10000
##$MC2= 0
##$MEAN= 0
##$ME_mod= 0
##$MI= 0
##$NCOEF= 0
##$NC_proc= -4
##$NLEV= 6
##$NOISF1= 0
##$NOISF2= 0
##$NSP= 0
##$NTH_PI= 0
##$NZP= 0
##$OFFSET= 16.522
##$PC= 1
##$PHC0= 216.4002
##$PHC1= 10.04016
##$PH_mod= 1
##$PKNL= yes
##$PPARMOD= 0
##$PSCAL= 4
##$PSIGN= 0
##$REVERSE= no
##$SF= 250.13
##$SI= 32768
##$SIGF1= 0
##$SIGF2= 0
##$SINO= 400
##$SIOLD= 32768
##$SREGLST= <1H.DMSO>
##$SSB= 0
##$STSI= 32768
##$STSR= 0
##$SW_p= 5175.98343685301
##$SYMM= 0
##$S_DEV= 0
##$TDeff= 65536
##$TDoff= 0
##$TI= <Analysis number 999999
Compound Code 99
Book Reference 9
Project Code 9>
##$TILT= no
##$TM1= 0
##$TM2= 0
##$TOPLEV= 0
##$USERP1= <user>
##$USERP2= <user>
##$USERP3= <user>
##$USERP4= <user>
##$USERP5= <user>
##$WDW= 1
##$XDIM= 32768
##$YMAX_p= 431828850
##$YMIN_p= -113780
$$ End of Bruker specific parameters
$$ ---------------------------------
##NTUPLES= NMR SPECTRUM
##VAR_NAME=  FREQUENCY,     SPECTRUM/REAL,   SPECTRUM/IMAG
##SYMBOL=    X,             R,               I
##VAR_TYPE=  INDEPENDENT,   DEPENDENT,       DEPENDENT
##VAR_FORM=  AFFN,          ASDF,            ASDF
##VAR_DIM=   32768,         32768,           32768
##UNITS=     HZ,            ARBITRARY UNITS, ARBITRARY UNITS
##FACTOR=    0.157963299565203, 1,           1
##FIRST=     4132.6476996994, 0,             0
##LAST=      -1043.33573715361, 0,           0
##MIN=       -1043.33573715361, -113780,     0
##MAX=       4132.6476996994, 431828850,     0
$$ Real data points
##PAGE= N=1
##DATA TABLE= (X++(R..R)), XYDATA
$$ [...]
24134c693k7806J1969J3674n879K132j609j1725J9431M4322p927l359l786k925
24121B2819o372k4964J089R218j7225k070m871l6771r612N412J7501K3702O441
24108a5703j3453q89J2167K0433J9058n825j3829n939j994j2842m107K7018N939
24095A0034N956J0155j2570J5986l421l805P74k188k6146m531J38j9436J067J3480
24081a4507K5319L9607p893r925n050l9333j7854J3590o986L0420P691q14j5518
24068a253k641M167k0517j428r454J567j4875O061K6837J3312j4674Q284K1144
24055A6530N887J7187J2670j2814l7748n252K3044K0208L4184m872l4156j1342
24043B3526j8633j2683j6861J3879J1251N606l226j4106l685p697k386L0016J5421
$$ plain form
24134 -3693 -31499 -19530 -5856 -11735 -9603 -11212 -22937 -3506 40816 32889 29530 25744 22819
24121 22819 16447 -8517 -7428 1790 -15435 -17505 -22376 -59147 -68759 -63347 -45846 -22144 -15703
24108 -15703 -29156 -30045 -17878 2555 21613 15788 1959 -3980 -5974 -18816 -22923 4095 10034
24095 10034 15990 26145 13575 29561 26140 22335 23109 20921 -5225 -9756 -9618 -29054 -27987 -14507
24081 -14507 10812 50419 42526 32601 27551 -11782 -29636 -16046 -23032 7388 15079 14265 -1253
24068 -1253 -3894 273 -20244 -21672 -31126 -29559 -44434 -38373 -11536 1776 -12898 -4614 16530
24055 16530 22417 39604 52274 39460 1712 -3540 19504 39712 73896 69024 34868 23526
24043 23526 4893 -7790 -24651 -10772 479 6085 2859 -11247 -14932 -22629 -25015 5001 20422
24030B0422L8487k543k6976k4737M26J6285o763k2991j6109J4617J1393Q226k692
24017G045n423l342m839K178J4660K0790l538l2933k6512j5363k22J419J3838
24004c2242J6336j2404K5788O728Q428j2725K3q156l8111r245K1341K4133l258
23991a3364l980J2158j6157J3389j764Q195R394J0502k0644k822j1720j2551p529
23978c6893L6275N678J387k217J2286R680q09k2090k7683J5318k304j6612K3610
23965d374J009O383o362q244l216J7409L15k486k5049k059M4496J5405l4764k940
23951d477n789l250P926R637j0236k8748n182O289O268J5493j7474l3185K910
23938e9818K6020L1731P473l5532K342j1884L604K9181J1574j1624L177K1073
$$ plain form
24030 20422 58909 56366 29390 4653 5079 21364 14601 -8390 -24499 -9882 1511 9737 7045
24017 7045 1622 -1720 -6559 -4381 10279 31069 27531 -5402 -31914 -47277 -47499 -46080 -32242
24004 -32242 -15906 -28310 -2522 4206 12634 -91 -68 -8224 -46335 -55580 -34239 -10106 -13364
23991 -13364 -17344 -5186 -21343 -7954 -9718 -1523 7871 18373 -2271 -5093 -16813 -29364 -36893
23978 -36893 -618 5060 6447 4230 16516 26196 25387 3297 -24386 -9068 -11372 -27984 -4374
23965 -4374 -3365 3018 -3344 -11588 -14804 2605 2920 434 -24615 -26674 17822 33227 -1537 -4477
23951 -4477 -10266 -13516 -5590 4047 -6189 -34937 -40119 -33830 -27562 -12069 -29543 -62728 -59818
23938 -59818 -33798 -2067 5406 -30126 -27784 -39668 -36064 -6883 4691 -6933 -3756 17317
23926A7317j1653K798j240j9505P42j7392q636L0507J875o3o058R354J6790k6096
23912a1260J7573L2792M930k8254m584K8626q831k8130o925O507L0590j8160J474
23899A6348L714k081j3898l83P879j7236j0449K579K408K3779J90r858p759J644
23885c123J0943j0640m905J9491M55k632J302k3713j5791o296K0976J1151J2960
23872A0178J767J9060j3085k5626J447K5306L384k1569m597J6666p640n0320j0403
23859e5432J2206K4725J9311P171m8007k3436N061J0851n866J6620K2573J3694
23847e29J5655l0332k1010k308M900j3069k7058J6255L5992K7872o678j1858J476
23834a0692j2484J243K4619n600j4123K7323K0243J810n187k1719k6207J9359
$$ plain form
23926 17317 5664 8462 7222 -12283 -11541 -28933 -37569 -7062 -5187 -5250 -11308 -1954 14836 -11260
23912 -11260 6313 39105 44035 15781 11197 39823 30992 2862 -4063 2444 33034 14874 16348
23899 16348 20062 17981 4083 3700 11579 -5657 -16106 -13527 -11119 12660 12850 2992 -4767 -3123
23885 -3123 7820 -2820 -7725 11766 12221 9589 10891 -12822 -28613 -34909 -13933 -2782 10178
23872 10178 11945 31005 17920 -7706 -6259 19047 22431 862 -3735 12931 5291 -45029 -55432
23859 -55432 -43226 -18501 810 7981 -40026 -63462 -58401 -47550 -53416 -36796 -14223 -529
23847 -529 15126 -15206 -36216 -38524 -33624 -46693 -73751 -57496 -21504 6368 -310 -12168 -10692
23834 -10692 -23176 -21933 2686 -2914 -17037 10286 30529 32339 27152 5433 -20774 -1415
23822a415j3046m759J5968J637J0695k3548k4247Q284L3086K1821O78k4922p88
23809e56R373P076p650J0431k7049j0744j4089k8412M125J2930J0254J6901k974
23796b0384K4597K3049r102j9348J1652l688m3166j7962L7885K5294j1669j6634
23784a9476p91J6831J2788m075R65k259r116j5298k3257m300K164J1247L410j3124
23770d4291j6645N324L2089J3763m59q567q93L7594n533l8195J929K701J6016
23757e167K0936P204j8318J2777j206q590J2196J0402l619p680o397j093j9831
23744h386j6503j5724M185K5363R954N817K143N713j3482r11K340N0445J0043
23731F0997j5754l1069J4467K3085M738k9363k6275P796M227K3749j3889j9402
$$ plain form
23822 -1415 -14461 -19220 -3252 -1615 9080 -14468 -38715 -30431 2655 24476 25154 232 -556
23809 -556 8817 15893 8243 18674 -8375 -19119 -33208 -61620 -57495 -44565 -34311 -17410 -20384
23796 -20384 4213 27262 18160 -1188 10464 6776 -36390 -54352 -16467 8827 -2842 -19476
23784 -19476 -20267 -3436 9352 5277 6242 3983 -5133 -20431 -43688 -47988 -45824 -34577 -31167 -44291
23770 -44291 -60936 -55612 -23523 -9760 -10219 -18786 -19679 17915 12382 -25813 -23884 -21183 -5167
23757 -5167 15769 22973 4655 17432 16226 7636 19832 30234 26615 18935 12538 11445 -8386
23744 -8386 -24889 -40613 -36428 -11065 -1111 4706 6849 12562 -920 -1831 509 50954 60997
23731 60997 45243 14174 28641 51726 56464 27101 826 8622 12849 36598 22709 3307
23719C307j5674j5464N715J2515p291n805p733k5623Q41M2488L4759r879j6039
23706c883k1885j3169l70M713P742N644O596j2837j6157P101K3286K0433O016
23693A3230k890j9832o812O178P798m463q414j3677J1535K729K1842K3092Q717
23680C9033m2407n4015l543N4616J6854j8033P311O531K9826j101m3874q075k1788
23667c8665j1505N749P483p869K6555K4360K2498L11k2365k6211N478K3147N113
23654A4079L207j6502l4902Q341K229k7551K5505M0376K3040l0479j9118P757
23642d018K2846o52p462P814J5724l643p568n248j2858j7798r189J1029n466J7432
23628I43R964j2023j6884j2506J6615j961P511Q671j0894M164N508M005o186r129
$$ plain form
23719 3307 -12367 -27831 -22116 -9601 -16892 -22697 -30430 -56053 -55212 -12724 22035 12156 -3883
23706 -3883 -25768 -38937 -39307 -34594 -26852 -21208 -14612 -27449 -43606 -36505 -13219 7214 13230
23693 13230 10340 -9492 -16304 -10126 -2328 -6791 -15205 -28882 -17347 -14618 7224 30316 39033
23680 39033 -3374 -57389 -60932 -6316 10538 -7495 -184 6347 36173 35072 -8802 -16877 -38665
23667 -38665 -50170 -44421 -36938 -44807 -18252 6108 28606 28917 6552 -19659 -14181 8966 14079
23654 14079 17286 784 -34118 -25777 -23548 -51099 -25594 14782 37822 7343 -11775 -4018
23642 -4018 18828 18176 10714 18528 34252 30609 23041 17793 4935 -12863 -22052 -11023 -16489 943
23628 943 10907 -1116 -18000 -30506 -13891 -15852 -8341 330 -10564 -6400 -892 3113 -3073 -12202
23614a2202Q252M045j4719j2602J5587P313L454k672m673O309K45M079K4346J5002
23600D1764q459K555J1934j9373k6193K0j6546L234O374l973J1153j9270J2396
23587d384p774K4706P932m8008k1538M4639J6944r106K750L434k056M045j0227
23574A357J0675j7095k722J2186J5414J4523J1195k0101q260J9327P641j7063
23562B7077m4884j0860J888j9848k6J9492J2347L8071J00J7197K5308j0825k992
23549E2045k6803J0772M164J1677j9608j5910k3212j3658M5713K1608k3520l8715
23537a5447M601R284n754J1459j2372R398L940J0713J185k0368L407N652R742
23524A5440M715L808j43m048J6434k861n848k800j7617j8524Q949j8983K723L3201
$$ plain form
23614 -12202 -3950 95 -14624 -27226 -11639 -4326 -872 -3544 -8217 -1908 -1663 2416 26762 41764
23600 41764 33305 35860 47794 28421 2228 2248 -14298 -11064 -4690 -8663 2490 -16780 -4384
23587 -4384 -12158 12548 20480 -27528 -49066 -4427 12517 3411 6161 9595 7539 11584 1357
23574 1357 12032 -5063 -7785 4401 19815 34338 45533 25432 17172 36499 44140 27077
23562 27077 -17807 -28667 -26779 -46627 -46653 -27161 -14814 23257 23357 40554 65862 55037 52045
23549 52045 25242 36014 40178 51855 32247 16337 -6875 -20533 25180 46788 23268 -15447
23537 -15447 -10846 -1562 -7316 4143 -8229 1169 5109 15822 17007 -3361 46 5698 15440
23524 15440 20155 23963 23820 19772 36206 33345 27497 24697 7080 -11444 -2495 -21478 -18755 14446
23510A4446n735K4025j2302m1462j7473J2677J9049P451m7026K4869O305k2k562
23497a7760l373J4358K6313J8452o479J628J579k3619k8639L1253L7485j2759
23485C8439L359r149K461j0070K5256J738k2754k7055O138l474R931K272j6004
23472A088r836k2072p525Q465Q979J5457k5087j0638l053M4035R013m1580p46
23459c3500L2669q434j3992k615q435J7499L5052l0514P194K3936j1134l1845
23447b4119r652R147O130j0378o571N159j0055J988P625l543J7255P779j3819
23434b3054J016o095K8397j348M784J4486K289l9689L774L2488j8795r596L553
23421g790N117N350j8254O82L4327j1558l9390j6417K2248R026M496L204j2206
$$ plain form
23510 14446 8711 32736 20434 -21028 -38501 -25824 -6775 676 -46350 -21481 -15176 -15198 -17760
23497 -17760 -21133 -6775 19538 37990 31511 33139 34718 11099 -17540 13713 51198 38439
23485 38439 41798 32649 35110 25040 50296 52034 29280 2225 8363 4889 14820 17092 1088
23472 1088 -8748 -30820 -38345 -29880 -20901 -5444 -30531 -41169 -44222 -187 8826 -32754 -33500
23459 -33500 -831 -9265 -23257 -25872 -34307 -16808 18244 -12270 -5076 18860 7726 -24119
23447 -24119 -33771 -24624 -18494 -28872 -35443 -30284 -40339 -38351 -30726 -34269 -17014 -9235 -23054
23434 -23054 -22038 -28133 264 -1084 3700 18186 20475 -19214 -15440 17048 -1747 -11343 -7790
23421 -7790 -2673 2677 -15577 -14895 19432 7874 -31516 -47933 -25685 -16659 -12163 -8959 -21165
23408b1165k6603k3340J2502K3707J7921K750K980J4691l453N10J7457P158p191
23395A7924k0018j2274j0887j4388n334J655Q490J3434J2232j3012J4523n549
23383a3204L401j3541J797P98j4013J8991J5351j1826M971K6837J3121l811r517
23370A9355n837o664p712n983j0668M099K2726P396j8157J1198P10m794r027K2952
23356A9594L7380n463m0833k4139M674J0670R016o636n612n920q130P825J5106
23343G532l0331j5835J3204K0639N818K084R231n227Q416k2242j251L2382k866
23330B1554K0593L722M719k3620p809P978j4796j2271L211j2438j391J4773k0930
23317a6705K8810M0024l408r450j7012m981J3774m553j9631O521k892j5630j1515
$$ plain form
23408 -21165 -47768 -71108 -58606 -34899 -16978 -14228 -11248 3443 -10 500 17957 25115 17924
23395 17924 -2094 -14368 -25255 -39643 -44977 -43322 -34832 -21398 -9166 -22178 -7655 -13204
23383 -13204 -9803 -23344 -21547 -20749 -34762 -15771 -420 -12246 -7275 19562 32683 28872 19355
23370 19355 13518 6854 -858 -6841 -17509 -13410 9316 16712 -1445 9753 10463 5669 -3358 19594
23356 19594 56974 51511 10678 -13461 -8787 1883 10899 4263 -1349 -7269 -15399 -7574 7532
23343 7532 -22799 -38634 -25430 -4791 1027 3111 12342 7115 15531 -6711 -7962 24420 21554
23330 21554 42147 45869 50588 26968 19159 27137 12341 70 3281 -9157 -10548 4225 -16705
23317 -16705 12105 52129 48721 39271 22259 17278 31052 26499 6868 13389 10497 -5133 -16648
23304a6648j9263K8520J0599l662l734l947o694K7589K1215L935N637k7935K075
23291A7687R916k8982j843M813K0706L1321J0408k302M09k4819k769N806j7066
23278B3285J7309R634J0266j2325Q024j5788j3440J2277k5471k2588J6172j7685
23266a0330j2710J6583K5888n789k8786P425k410j8318P567L409N270j927O677
23253g451J2814n354O058k223L95o289r333J3148K4402Q511n719j0868q24l421
23239A3846P448o510J0170j0604j9811K0283O581j2366j3198J9928n640M905j4076
23226I56J7155L5444j4704j8246k8594j8247j6768J042J002R130J9697J9458j7692
23213a0367k7595l555m326q7o525k558M1203L1566J8110j8335P30k2989j05J6392
$$ plain form
23304 -16648 -35911 -7391 3208 -454 -4188 -8135 -14829 12760 33975 37910 43547 15612 17687
23291 17687 27603 -1379 -3222 1591 22297 53618 64026 61724 62133 37314 34545 40351 23285
23278 23285 40594 50228 60494 48169 56193 40405 26965 39242 13771 -8817 7355 -10330
23266 -10330 -23040 -6457 19431 13642 -15144 -7719 -10129 -28447 -20880 -17471 -12201 -14128 -7451
23253 -7451 5363 9 6067 3844 4239 -2050 -11383 1765 26167 34678 28959 18091 17267 13846
23239 13846 21294 14784 24954 14350 -5461 14822 21403 9037 -4161 15767 10127 15032 956
23226 956 18111 53555 38851 20605 -7989 -26236 -43004 -41962 -40960 -31830 -12133 7325 -10367
23213 -10367 -37962 -41517 -45843 -45930 -52455 -55013 -13810 17756 35866 17531 18261 -4728 -4833 11559
23199A1559p564L212j184j434k3767J4716R629L150J6295P862J6136n194k1278
23186B2138j4253k2321J6457J2065J3017m015j2600l0448L385K1545O731l51l659
23173G691j0660o997J1758K2455j6298J4994r869l3059J751J9145R131j449j3897
23160e304j3699j6560R560K2478k01j0864J6361J2564j3870k0369Q329J4627j7805
23147a4753l0553J392K1560J3627K8328O946l4484J5873O857J1292L129p099j6992
23134E123k1399j18R041J1719p886K4327J1911j1530j2047j4853P016O177j5636
23121h155k4002j2752J5529k250j6584J0972M424N177m995n619J79K3151J5033
23108A08L333K7345J499k2186K236k8016K811M1291K9275n033j4194k7405l2706
$$ plain form
23199 11559 3995 7207 6023 4589 -19178 -4462 5167 8317 24612 32474 48610 43416 22138
23186 22138 7885 -14436 2021 14086 27103 23088 10488 -19960 -16575 4970 11701 11350 7691
23173 7691 -2969 -9966 1792 24247 7949 22943 13074 -19985 -18234 911 10042 8593 -5304
23160 -5304 -19003 -35563 -26003 -3525 -3726 -14590 1771 14335 465 -19904 -11575 3052 -14753
23147 -14753 -45306 -43914 -22354 -8727 19601 26547 -7937 7936 14793 26085 29214 22115 5123
23134 5123 -16276 -16394 -7353 4366 -3520 20807 32718 21188 9141 -5712 1304 7481 -8155
23121 -8155 -32157 -44909 -29380 -31630 -48214 -37242 -32818 -27641 -32636 -38255 -38076 -14925 108
23108 108 3441 30786 32285 10099 12335 -15681 -12870 28421 57696 52663 38469 11064 -21642
23095b1642k717J2071P950J6019M324l0817M898L5833K4531j615o0203l0084Q365
23082c3087J3470K2967M4899m197j3885j3744r405M336k1275q142p249L2488J7038
23069B4214l5735j0069R895J7504K9887J9615k7373r201k1271k708L593j5617
23057a7266j7465K9678L51l8401j3863K2166J643K7732M658J2653R154P51R4O436
23043B8321j2340k2955K554J9323K5719o186j6427Q485k8480k3519j8889J7853
23031b6541L491J8864N583k2178j992K2294j359K223J3691J1267n801k0838P652
23018F356J1578r86k1199k5006Q441Q358l69n288L3609J5422p171o866P12k448
23004A5143r154R715l1847k3138J7694N0471m633M477J5776P890j1704n504k8530
$$ plain form
23095 -21642 -24359 -12288 -4338 11681 16005 -14812 -9914 25919 50450 48835 -11368 -41452 -33087
23082 -33087 -19617 3350 48249 44052 30167 16423 7018 11354 -9921 -18063 -25312 7176 24214
23069 24214 -11521 -21590 -11695 5809 35696 55311 27938 18737 -2534 -5242 -1649 -17266
23057 -17266 -34731 -5053 -4702 -43103 -56966 -34800 -33157 -5425 -767 11886 21040 21791 21885 28321
23043 28321 15981 -6974 -4420 14903 40622 34436 18009 26494 -1986 -25505 -44394 -26541
23031 -26541 -23050 -4186 1397 -20781 -22773 -479 -1838 385 14076 25343 19542 -1296 6356
23018 6356 17934 16948 -4251 -29257 -20816 -12458 -12827 -18115 15494 30916 23745 16879 17591 15143
23004 15143 5989 15704 -16143 -39281 -21587 28884 24251 28728 44504 52394 40690 35186 6656
22991F656l8826Q686M2189l1330j7303L360J0287J891P60J6600L797L6801K0815
22978F4383l4549l2878j4425K3384J6390k451N575l465j6085o324R505N499j3953
22965F06j2824K197K1698O319l4876k2130J4789j124J989j4064l4939O698J3409
22952e2252J0064O910K8739K9039J3635j3615j3126j1969J1491l852m88L2146
22940C6722J0731K629l1884k6256K5883R528l099j1283P65k0540O845o822N785
22927i96K330j128J9645j9932r204K1777J3493m620K0076J9096l6532l7239J2502
22914g32J0982k3132n3103K992K1312J1199Q443n838k2164L3366K9739L2287j6362
22901B8989m4834j5991P479L978K0867p701k6670L603K7436K9966j1206K360M293
$$ plain form
22991 6656 -32170 -23484 18705 -12625 -29928 -26568 -16281 -14390 -13630 2970 6767 43568 64383
22978 64383 29834 -3044 -17469 5915 22305 19854 25429 21964 5879 -445 9060 14559 606
22965 606 -12218 -10021 11677 17996 -16880 -39010 -24221 -25345 -23356 -37420 -72359 -65661 -52252
22952 -52252 -42188 -35278 -6539 22500 36135 22520 9394 -2575 8916 5064 4576 36722
22940 36722 47453 50082 18198 -8058 17825 27353 24254 12971 13736 -6804 41 -6781 -996
22927 -996 1334 206 19851 -81 -9285 12492 25985 21365 41441 60537 24005 -13234 -732
22914 -732 10250 -12882 -65985 -62993 -41681 -30482 -22039 -27877 -50041 -16675 13064 45351 28989
22901 28989 -15845 -31836 -24357 -20379 488 -7213 -33883 -30280 -2844 27122 15916 18276 22569
22888B2569k808m854J8290K3053q652l8974j1384J5731J4543k0090l1713O004
22876a8285J439J1899m021o941m786k8491J7800N379j773J7719q86j5234M693
22863b1488J8369r15J809K5786K6758J0052j1749j9152J7323j1348k2116j6710
22851c381J2428J7915o561k0343k4782J3000J9622J9355P7j0788p128k3205j0639
22838b4430R468j1573K013J2089j1813L6362L1952J3127J2548j5388j4906k9901
22826I548K672J8151j5740k6735J7890l314j7579K2390j992j9560J1364j0312
22814a3217K5819Q168n5806J4640Q934k684K5962M620k457L311N735R58J1328
22801C5311L462q206m905J0902J1181K472R776j6615j4785J2176j8523j2818j1172
$$ plain form
22888 22569 19761 14907 33197 56250 47598 8624 -2760 12971 27514 7424 -24289 -18285
22876 -18285 -16846 -4947 -8968 -15909 -20695 -49186 -31386 -26007 -27780 -10061 -10947 -26181 -21488
22863 -21488 -3119 -4034 -2225 23561 50319 60371 48622 29470 46793 35445 13329 -3381
22851 -3381 9047 26962 20401 58 -24724 -11724 7898 27253 27330 16542 9414 -13791 -24430
22838 -24430 -14962 -26535 -24522 -12433 -24246 12116 44068 57195 69743 54355 39449 9548
22826 9548 12220 30371 14631 -12104 5786 2472 -15107 7283 5291 -14269 -2905 -13217
22814 -13217 12602 20770 -35036 -20396 -11462 -14146 11816 16436 13979 17290 23025 23983 35311
22801 35311 38773 30567 25662 36564 47745 50217 59993 43378 28593 40769 22246 9428 -1744
22788a744r027l104n756j3295O203N463K2898K5805O686r394M389m669J8636j5029
22774B8062k7279J1217o951N461J9933O624J3188l554l2208k63r627J9631J0251
22761C4485J0467J5043J1390L327j6951j4813K1714k9747r250K6630q76j208k1640
22748B8571k7143r064J9787J6819J167k1321O126J7604j4977j1916P751P369J321
22735B2094k5447j0398j418K9033L552M972j8702j0438K1880M416O31p330Q667
22722B1512k604r213J279K5695J3815j843j7625l2972m020K1103j1198k9407j8951
22709d4429K6431M358M488K997J1150M383M006K3651Q831l4015J1026n773l0848
22696a3744j9865L3481K3998j3248j7020j3178j261N883K9745L380J918m683R140
$$ plain form
22788 -1744 -10771 -13875 -19631 -32926 -26723 -21260 1638 27443 34129 24735 29124 24455 43091 28062
22774 28062 783 12000 5049 10510 30443 37067 50255 46701 14493 14230 4603 24234 34485
22761 34485 44952 59995 71385 74712 57761 42948 64662 34915 25665 52295 51419 50211 28571
22748 28571 1428 -7636 12151 28970 30137 8816 14942 32546 17569 5653 13404 20773 22094
22735 22094 -3353 -13751 -15169 13864 17416 22388 3686 -6752 15128 19544 20175 12845 21512
22722 21512 18908 9695 10974 36669 50484 48641 31016 -1956 -5976 15127 3929 -25478 -44429
22709 -44429 -17998 -13640 -9152 -6155 4995 9378 13384 37035 45866 11851 22877 17104 -13744
22696 -13744 -33609 -128 23870 10622 -6398 -19576 -20837 -14954 14791 18171 20089 15406 24546
22683B4546K8103Q56j7318p042j3421j0707P650n862r819J3866m37j9466l011
22670a2062o92r346k304J4893k763k4999R589K2287Q221J4315Q015J8137j3384
22657B9907k3148j002N499K6326n034L976K8534J3489j627l0146j9130m0005l7549
22644d9910K8408K9310J998n799j4205J0750R825p77L323n397N613k0517k1777
22631b9155o403p128K9979K1980J5155j6307n75q461k980J5478Q930o397R605
22618B3721q689n596R971J1441J5947k7974n243j0251Q6r02J0898j3061J4233
22605A4581J5514Q086k4609M910J0415R448k7705k512j6905l1227J7602R945j4199
22592b6656K6262J9594k1519P020J7366L487o785j4484J922O570J6463L6277J6807
$$ plain form
22683 24546 52649 53505 36187 29145 15724 5017 12667 6805 -3014 10852 10415 -9051 -12062
22670 -12062 -12754 -22100 -24404 -9511 -12274 -37273 -27684 -5397 2824 17139 25154 43291 29907
22657 29907 6759 5757 11256 37582 32548 36524 65058 78547 76920 46774 27644 -12361 -49910
22644 -49910 -21502 7808 9806 4007 -10198 552 10377 9600 12923 7526 13139 -7378 -29155
22631 -29155 -35558 -42686 -12707 9273 24428 8121 7546 -915 -3895 11583 20513 14116 23721
22618 23721 15032 9436 19407 30848 46795 18821 13578 3327 3413 2511 13409 348 14581
22605 14581 30095 38181 13572 18482 28897 38345 10640 8128 -8777 -40004 -22402 -12457 -26656
22592 -26656 -394 19200 -2319 4701 22067 25554 18769 4285 6207 12777 29240 65517 82324
22579H2324J4343n3181m0592K6813J6433k6578k2871p267p501L5839k941q071
22567F750J947J5468L0037j883j5521Q232J3195j9944k4368K2220J2259j2219
22555C6173r007J9187q619l1024n1561O291K4703p651J3296J6182J2998j5797
22543E171k3287j1782J0290J3631j2021j8876l468L8042K1986j2684j4464p585
22531a5047P382j9297M956J8719M701J3377j2869p079N848k4271j4480j204L7562
22518a702K4466L623k3819O988K5571J8879j1695j6021P031j9126m1301N36M3893
22505A7323K1120k830j4494L85K1680q084l6215n004r07J5353R865Q602K769P478
22491C7041k7874m957J3683J3354K5979J3303q571j6101K295q136j6367N816L824
$$ plain form
22579 82324 96667 43486 2894 29707 46140 19562 -3309 -10576 -18077 17762 14821 6750
22567 6750 8697 24165 54202 52319 36798 45030 58225 38281 13913 36133 48392 36173
22555 36173 27166 46353 37734 6710 -44851 -38560 -13857 -21508 -8212 7970 20968 5171
22543 5171 -18116 -29898 -19608 -5977 -17998 -36874 -40342 -2300 19686 7002 -7462 -15047
22531 -15047 -7665 -26962 -22006 -3287 1414 14791 1922 -5157 691 -23580 -38060 -39264 -1702
22518 -1702 22764 26387 2568 9556 35127 54006 42311 26290 33321 14195 -27106 -26570 17323
22505 17323 38443 35613 21119 21504 43184 35100 -1115 -6119 -7026 8327 18192 26794 29563 37041
22491 37041 9167 4210 17893 31247 57226 70529 61958 45857 48152 40016 23649 29465 33289
22478C3289K0422J792k615k1934m6097j535M1643J8018l225m401j070j1075J6013
22465C9225J2794K057Q584K541k4836k2391o843p226K154J025K4806K2431N065
22452E9386L362O173j4219J1102P381k3742j8984J4335m822n43J3371o418Q054
22439E4436k9017j5141k507K4317j4638l672J0030R64K6223K9231K4708j8805
22427H6129j6848k7855k3245J7487J6393n297j7456J4054N436j7045l0480j839
22415e66J5376j0709l105J4869R273J4898m185k0857l750J0624J120j3153k4145
22402a4310P744J0394K6205q615J9981J3814j4477k765k750N93O888J8109J6560
22389G7371j4728q432m497j4532k2327K9854n356j2420o251k849R673j0808m009
$$ plain form
22478 33289 53711 55503 52888 30954 -15143 -16678 24965 42983 39758 35357 34287 23212 39225
22465 39225 52019 54076 62660 65201 40365 17974 11131 3905 6059 7084 31890 54321 59386
22452 59386 62748 68921 54702 65804 73185 49443 30459 44794 39972 39429 52800 46382 54436
22439 54436 25419 10278 7771 32088 17450 13778 23808 24772 50995 80226 104934 86129
22427 86129 69281 41426 18181 35668 52061 46764 29308 43362 48798 31753 1273 -566
22415 -566 14810 4101 996 15865 25138 40036 35851 14994 11244 21868 22988 9835 -14310
22402 -14310 -6566 3828 30033 21418 41399 55213 40736 37971 35221 35814 42702 60811 77371
22389 77371 62643 54211 49714 35182 12855 42709 37353 24933 18682 15833 25506 14698 10689
22376A0689J6293j312Q368o955P307J4584L5881K3527k0534q106j7029K4701R995
22363I7409k5380j4234J2353J8957j7292k9294M1279L5580l4851M698J0494l2551
22351F7168j6686J5782J4643L660l6077l694J0472j1q537j0469n096j1462n995
22338A3698J6851J0923J5583M497j3765J1288J19k0567j4767j6250O387J8156
22326C2153l6132k4589N7004K7387k1841n790k1351k0449N24J5157K5876q966
22314A8983r40m594J0013L5104n946j8270k4500j018J1682J0604J1179r160j843
22301C1294m941L427M435p436J0453Q529j4218K792k9653j4170L4372O226n543
22288B5567j4254q550K0663L460L272l3844l5617o284L7072K7201J0117J406j4521
$$ plain form
22376 10689 26982 25670 34038 27083 34390 48974 84855 108382 87848 79742 62713 87414 97409
22363 97409 72029 57795 70148 89105 71813 42519 83798 119378 84527 89225 99719 67168
22351 67168 50482 66264 80907 84567 48490 44796 55268 55257 46720 36251 31155 19693 13698
22338 13698 30549 41472 57055 61552 47787 59075 59194 38627 23860 7610 13997 32153
22326 32153 -3979 -28568 28436 55823 33982 28192 6841 -13608 -13084 2073 27949 18983
22314 18983 18043 13449 23462 58566 52620 34350 9850 8832 20514 31118 42297 33137 31294
22301 31294 26353 29780 34215 26779 37232 45761 31543 34335 4682 -9488 24884 31110 25567
22288 25567 11313 2763 23426 26886 30158 -3686 -39303 -45587 -8515 18686 28803 30209 15688
22275A5688K554K5504j212P755k4490q260L812J9200K2624O041k1189J2538j9457
22262D1108K126J8866q567j5144j929j6413k115K8441K1238J2820k5483n6751
22250a803J5508K5458J7369j9277l1589J5556j294J3937j613J00J0995j8167q090
22237A7090o50M0297L0728p434L006R748O52k3767J9708K3781o297p850l3945
22224F5067o420k258J2494p553M677N452k9676K2499n474l4908Q262Q664j1595
22211B9231l570K5249Q255J9989Q041j3134j0618j8673l0750k1231L190L2425
22199B8404Q028j2348J7637l364j0143o498J1410K0006N278j1328J5031P294l1070
22186C8337J3856l16j2554k108k040j3803j128M4197L7119j7261j0975k9220q596
$$ plain form
22275 15688 18242 43746 42534 50289 25799 17539 21351 40551 63175 69216 48027 60565 41108
22262 41108 43234 62100 53533 38389 36460 20047 17932 46373 67611 80431 54948 -1803
22250 -1803 13705 39163 56532 37255 5666 21222 19928 33865 32252 32352 43347 25180 17090
22237 17090 16440 56737 87465 80031 83037 92785 93437 69670 89378 113159 106862 99012 65067
22224 65067 58647 56389 68883 61330 66007 71459 41783 64282 58808 23900 32162 40826 29231
22211 29231 25661 50910 59165 79154 87195 74061 63443 44770 14020 -7211 -4021 28404
22199 28404 36432 24084 41721 38357 28214 21716 33126 53132 58410 47082 62113 69407 38337
22186 38337 52193 51877 39323 37215 35175 21372 20244 64441 101560 84299 73324 44104 35508
22173C5508K6424J8983j5231j9812O120L5462P488j2453l0918R586o619q306j068
22160D5164j2319j0260r614K316J401n680M3108m485k6088J5798L6131p801n202
22147F2469j9128j5929J713r858p186J9521J1651K0576J2073J147K2990l0412
22135F9627j3126K826K415P885n585m614N596L240J3020J0139j3060k736k422
22122G3205r992J1401J4170n179J7382j6444m1076j0337K3112K5600K4298l0463
22110G5677r941m683J0573Q707j7382k3021J3313L2988M322r877L229J79n210
22097G8874k4438j6041K5561L685o680k3803J9280J5967j7746l522r46J2099K7807
22084I0097J7197j9595k4073N02N8006O529l3341o738R534j2238j9331K0146L151
$$ plain form
22173 35508 61932 80915 65684 45872 51992 87454 94942 82489 51571 61157 54538 46232 45164
22160 45164 32845 22585 12971 15287 16688 11008 54116 49631 23543 39341 75472 67671 62469
22147 62469 43341 27412 29125 19267 12081 31602 43253 63829 75902 77049 100039 69627
22135 69627 56501 59327 61742 69627 64042 59428 65024 68264 81284 91423 78363 75627 73205
22122 73205 63213 74614 88784 83605 100987 84543 43467 33130 56242 81842 106140 75677
22110 75677 65736 61053 71626 80333 62951 39930 53243 86231 90553 80676 83905 84084 78874
22097 78874 54436 38395 63956 67641 60961 37158 56438 72405 54659 51137 50191 62290 90097
22084 90097 107294 87699 63626 64128 122134 128663 95322 88584 98118 85880 66549 86695 89846
22071H9846K742j7090L506k0495k5993J6666J4292J8495K0993J3539J5578M298
22059A36377j7962m0816m812K6856j55O41J0261n832l2336k1676J99R047J9364
22046G9156L0400m237L174K3261m1520l3105L3827K2744j5963l614J0757J1512
22034A16392L386L31j4580m724J352j1149j7286j8508K8631K4342P54P129N637
22021A21707r432J5030j1395j1613j2536K1405K9042K1863N476l5964j4356l259
22009A15968n065k174n105j7559p337L5626K3309Q283P786n078k5599l7290o582
21996G9183K2474R471k686j618O645K7436Q952J3858k767k2004m8180m2838q33
21983D7093J3679J8871L3953J0432j7892J942j7768O100k193r067J2766K1603
$$ plain form
22071 89846 92588 75498 79004 58509 32516 49182 63474 81969 102962 116501 132079 136377
22059 136377 118415 77599 72787 99643 99488 100129 110390 104558 72222 50546 50745 59792 79156
22046 79156 109556 105319 108493 131754 90234 57129 90956 113700 97737 94123 104880 116392
22034 116392 119778 120109 105529 100805 102157 91008 73722 55214 83845 108187 108941 116070 121707
22021 121707 112275 127305 115910 104297 91761 113166 142208 164071 169547 133583 119227 115968
22009 115968 110903 108729 103624 86065 78728 114354 137663 145946 153732 148654 123055 85765 79183
21996 79183 101657 111128 108442 106824 113469 140905 149857 163715 160948 138944 90764 47926 47093
21983 47093 60772 79643 113596 124028 106136 108078 90310 96410 94217 85150 97916 119519
21971A19519J9161l655M682J0360K1260J0999J2657j8579p910n656k3000j7322
21959A22516K2238m458j2782j1259R534K5522n731j8535R828K9436J7466l2629
21947A51146j3065K6200K9521J6826k3215M23K97j2713l730k3922j0091R999o431
21934A41245L914J9610o415m208J1863k8492j3595J4287L013j79J3809j8982m937
21921A30933K2145j0404k479J2460M974j369L2240J2174l350J061j5427o524M732
21908A81166j898l0m211O292L2798J6500N492J5187N1113K1047j1407k8908R169
21895B92310m91m5082k0541j067k1073N338K405o579j484O50j9344l075J7515
21882A99482J8611R607J2709p004K8628K2945K0571j2427j916j9493J4718R083
$$ plain form
21971 119519 138680 135025 139707 150067 171327 182326 194983 176404 168494 162838 139838 122516
21959 122516 144754 140296 127514 116255 125789 151311 145580 127045 136873 166309 183775 151146
21947 151146 138081 164281 193802 210628 187413 187836 188133 175420 171690 147768 137677 147676 141245
21934 141245 145159 164769 158354 154146 166009 137517 123922 138209 141222 141043 154852 135870 130933
21921 130933 153078 142674 140195 152655 157629 156260 188500 200674 197324 198385 182958 176434 181166
21908 181166 179268 179238 175027 181319 214117 230617 236109 251296 302409 323456 312049 283141 292310
21895 292310 291819 246737 226196 225129 204056 209394 211799 205220 203736 204386 185042 181967 199482
21882 199482 218093 227700 240409 233405 262033 284978 305549 293122 291206 271713 286431 295514
21870B95514K0682p356m6983l4593J3871L970K6702Q086p358K9830K1714M635
21858C28714K2588J1940j0079k945J014r629q934k2820k6494J22J3483q590j0581
21845B77789N598m094q918j5301O839m293p337k8471j0151K8822p288Q513L8660
21832B80368M2637K463J3411k6246q122l284k153J9355m0658k9679K5654K9481
21820C03227j780o591k311k6827J2439J7876L769R919o730j2340l832J2952m011
21807B95760L4515K603N729r092r13K0907j6094Q52J6318J3819J5740K5289r285
21794C96148j5828K0278P136k5737k5673m875K3430K646K4099L4054L1118Q169
21782D74965K2978k1021j6641q873j7157j7150J5710j2329Q118K9187M87o825
$$ plain form
21870 295514 316196 308840 261857 227264 241135 245105 271807 279893 272535 302365 324079 328714
21858 328714 351302 363242 353163 350218 351232 341603 332669 309849 283355 283477 296960 288370 277789
21845 277789 283387 279293 270375 255074 261913 257620 250283 221812 211661 240483 233195 241708 280368
21832 280368 323005 325468 338879 312633 304511 301227 299074 318429 277771 248092 273746 303227
21820 303227 301447 294856 292545 265718 278157 296033 299802 309721 302991 290651 286819 299771 295760
21807 295760 330275 332878 338607 329515 328602 349509 333415 334267 350585 364404 380144 405433 396148
21794 396148 380320 400598 407734 381997 356324 351449 374879 377525 401624 435678 466796 474965
21782 474965 497943 476922 460281 451408 434251 417101 432811 420482 428600 457787 458274 451449
21770D51449J9012J8848j1301N160o431j624r040j97L1268O428K235k346O192
21757E09653l368P272k83l116K1054j54j1572n819L4108L0631p94j6763r762j6075
21743E35012O987K5007L1499J3890J9768n73k982l082k411J4086J1642l0786L021
21730F21078J295J7306N3764K8381J7098l272j4327j1610O264M6324L3138J2414
21718H07853j5344k1152k36k1895L0117L0107J6815J8575J7776K2248J1668J4426
21706I10958J3431j1852J6083J3345L3434K4814K7694Q513J1500k330J9076L9527
21694A104193K0048K3642Q346k524K5753J3121J3953R318m641o337K5485N2960
21682A283317L0428J3244K1278J9868J8171M6120L3799J7459L8257L1036L8912
$$ plain form
21770 451449 470461 489309 478008 483168 476737 475113 466073 465876 497144 503572 505807 503461 509653
21757 509653 506285 513557 513274 510158 531212 531058 519486 513667 547775 578406 577612 560849 551087 535012
21743 535012 541999 567006 598505 612395 632163 631590 628608 625526 623115 637201 648843 618057 621078
21730 621078 622373 639679 693443 721824 738922 735650 721323 709713 715977 762301 795439 807853
21718 807853 792509 771357 771121 749226 779343 809450 826265 844840 862616 884864 896532 910958
21706 910958 924389 912537 928620 941965 975399 1000213 1027907 1036420 1047920 1045590 1064666 1104193
21694 1104193 1124241 1147883 1156229 1153705 1179458 1192579 1206532 1215850 1211209 1204872 1230357 1283317
21682 1283317 1313745 1326989 1348267 1368135 1386306 1432426 1466225 1483684 1521941 1552977 1591889
21671A591889L5327K8794L4579L2189N4506M4943J5426L2368M4822J7839N3247
21660A985929L2405K2538N2231N7595P2059O7534P2899N9192M6167O9413R1765
21649B629727M1591N4057O6457M2064M3505Q4069Q8245R6632J09220J13297P4088
21638C442952Q7152J15599J15636J21347J05950J23979J20139J32619J72278J80941
21628D718592J80412J72406J39872J65938J86480J81747K11785K34727K38604
21619F430563K31867K39985K53326K83388L06662K85344L17607K95832L39703
21610H984277L46726L66965L94530L91430M07145L88408M06277M42258M53029
21601A2581045M50423M36692M38873M60844M90905M47575M32503M24302M29488
$$ plain form
21671 1591889 1627216 1656010 1690589 1722778 1777284 1822227 1837653 1870021 1914843 1932682 1985929
21660 1985929 2018334 2040872 2093103 2150698 2222757 2290291 2363190 2422382 2468549 2537962 2629727
21649 2629727 2671318 2725375 2791832 2833896 2877401 2961470 3049715 3146347 3255567 3368864 3442952
21638 3442952 3530104 3645703 3761339 3882686 3988636 4112615 4232754 4365373 4537651 4718592
21628 4718592 4899004 5071410 5211282 5377220 5563700 5745447 5957232 6191959 6430563
21619 6430563 6662430 6902415 7155741 7439129 7745791 8031135 8348742 8644574 8984277
21610 8984277 9331003 9697968 10092498 10483928 10891073 11279481 11685758 12128016 12581045
21601 12581045 13031468 13468160 13907033 14367877 14858782 15306357 15738860 16163162 16592650
21592A6592650L67164L45106L53082L28814K69516K40608K32081K18945J82077
21583A9130043J23178J22011R8407J6395J7221k8615p2151j02311j29209j57084
21573A9017885j95992k45498k86907k95885l41361l44804l58224m02441m24096
21564A6122677m46324m22922m47056m51447m79238m64215m82076m75776m31784
21555A2021839m44077l96621m30243l90890m13273l87961l73651l43777l50050
21546H491296l52720l22428k90091k76299k66246k72378k71044k58163k15778
21537E966149k07290k17800k04917j71164j64163j57173j70063j47015j49322
21528D377242j62640j50385j34403j11318j29286j01043r1514j16927j04020p9455
$$ plain form
21592 16592650 16959814 17304920 17658002 17986816 18256332 18496940 18729021 18947966 19130043
21583 19130043 19253221 19375232 19473639 19490034 19507255 19478640 19406489 19304178 19174969 19017885
21573 19017885 18821893 18576395 18289488 17993603 17652242 17307438 16949214 16546773 16122677
21564 16122677 15676353 15253431 14806375 14354928 13875690 13411475 12929399 12453623 12021839
21555 12021839 11577762 11181141 10750898 10360008 9946735 9558774 9185123 8841346 8491296
21546 8491296 8138576 7816148 7526057 7249758 6983512 6711134 6440090 6181927 5966149
21537 5966149 5758859 5541059 5336142 5164978 5000815 4843642 4673579 4526564 4377242
21528 4377242 4214602 4064217 3929814 3818496 3689210 3588167 3496653 3379726 3275706 3196251
21518C196251r0663j07101j18350j11605q7389o8200n6892m4043o4464o4122o5410
21507B318012o2450n2399l5301m3537o1798l9302l8654o9182m4273l4440n3564
21496A783112l8968n2768o2273l7405n012k2367l2728l0599j5152m1501j8561
21485A425778j9242k7378j5383l8391j3579J3221l1249m0489j3451k7783k6953
21474A185101n0769k0089q375j9742k4269q235p777o334k7617l8716k2751q793
21462I41634j23n563p08k7466J289J2332j6282l8975o272J5912j7021j4261j4964
21449H29532k570k073J718j9304j9798j1303j2716k7518k430J0583j1552j5684
21437G16885J1852J5291k4369l0871j6801P579J7199l951l2855J5142J5057l1570
$$ plain form
21518 3196251 3105588 2998487 2880137 2768532 2681143 2612943 2556051 2512008 2447544 2383422 2318012
21507 2318012 2255562 2203163 2167862 2124325 2062527 2023225 1984571 1915389 1871116 1836676 1783112
21496 1783112 1744144 1691376 1629103 1591698 1586686 1564319 1531591 1500992 1485840 1444339 1425778
21485 1425778 1406536 1379158 1363775 1325384 1311805 1325026 1293777 1253288 1239837 1212054 1185101
21474 1185101 1134332 1114243 1105868 1086126 1061857 1053622 1045845 1039511 1011894 973178 950427 941634
21462 941634 941511 935948 935240 907774 909063 921395 905113 866138 859866 875778 858757 844496 829532
21449 829532 826962 824889 826607 807303 787505 776202 763486 735968 733538 744121 732569 716885
21437 716885 728737 744028 719659 688788 671987 679566 696765 692814 659959 675101 690158 658588
21425F58588k5682k2874R714l195Q371L360r776j6318J7219k5200j1822r26j794
21412E79665j3799l557j3056n731J1709j8713m218J1891J1296l1543l897J7815
21400E37862k6847N076J6803l6216k4648L0579N9368j273k8266q464o848k143
21388E14983J4471L9408J4646j6184M413j19j8361m188m701j5876k0858l2503
21376D75131o186L0609K5536n259o875k821J3830k621K3791j423j6437L735m309
21363E26701O992Q25j9679j3973r890k4233m0558O700K4264l452O228j2061j4185
21350D33679K400j777J7409L866m9150m742K6361M780M900J2183K8302j6689l808
21337D57714L095j8938l239O156P99j3332n707n52k2166n13j3729K2204L5031
$$ plain form
21425 658588 632906 610032 619746 616551 624922 628282 618506 602188 619407 594207 582385 581459 579665
21412 579665 565866 562309 549253 543522 555231 536518 532300 544191 555487 523944 520047 537862
21400 537862 511015 516091 532894 496678 472030 502609 561977 560704 532438 523974 517126 514983
21388 514983 529454 568862 583508 567324 571737 571618 553257 549069 544368 528492 507634 475131
21376 475131 468945 499554 525090 519831 512956 510135 523965 521344 545135 543712 527275 531010 526701
21363 526701 533693 534518 514839 500866 490976 466743 426185 432885 457149 453697 459925 447864 433679
21350 433679 436079 434302 451711 455577 406427 401685 428046 432826 437726 449909 478211 461522 457714
21337 457714 460809 441871 438632 444788 445587 432255 426548 425996 403830 403317 389588 411792 446823
21324D46823N731Q998j0678k0134O666J9080K5515K2343k0432j2363k5334O207
21312D52422R915K663J101l977K4333L7845J7791L1444j1779R00K5116K2426j115
21299F09085k4184j3366k8276k9785J1259J182j75k019n001L3232M7478J8298
21287F17728j9209p75j0341O188J613O125Q43j5325N617l2640O148m273r199j0263
21273E42237k0176N91J1288K5711L1889M686j2972k4641K652M8577J341o777m047
21260F00359K3566K098J4093n086n185J528p814J005L891K3165j5569p91J9799
21247F55059j755J8166L014J1041L1260O580P271J2196n54j51Q186J8726K0123
21234G89162p358j0843L066j8018J3660M6897K9174P606M4815K1468n566K4166
$$ plain form
21324 446823 452554 461552 450874 430740 437406 456486 482001 504344 483912 471549 446215 452422
21312 452422 462337 465000 466101 462124 486457 524302 542093 573537 561758 562658 587774 610200 609085
21299 609085 584901 571535 543259 513474 524733 525915 525740 523721 518720 551952 599430 617728
21287 617728 598519 597744 587403 593591 595204 601329 602172 586847 592464 559824 565972 561699 552500 542237
21273 542237 522061 522652 533940 559651 591540 596226 583254 558613 561265 609842 611183 604406 600359
21260 600359 623925 626023 640116 635030 629845 631373 623559 624564 628455 651620 636051 635260 655059
21247 655059 653304 671470 674484 685525 716785 723365 730636 742832 742278 742127 750313 769039 789162
21234 789162 781804 770961 774027 756009 769669 816566 845740 853346 898161 919629 914063 938229
21222I38229J9730J0517k0487L876L6621Q447J7208J9232r508M400J9078o75p077
21209A039591K2071N5700O0545K0144L299j7642J0814L2383L3596M0979L949J5097
21197A320526K9527K5837R383J8936J9387j2102L0104L5148K4005L0335N1197
21186A582283L3417N1429O0469L3734M0372J6594j256K2595N7571M7066K7691
21175A971965Q9344N1390L3995M1488N0542O4647O9777N5003M2687N6826N6431
21164B584095Q2541O9909Q0246P9416Q3206Q7783P9853Q4510J27723Q7351Q7800
21153C534433J40700J34943J08524J16597J38757J23655J50669J59993J44630
21144D752901J43106J56528J69893J78723K19024K42420K28157K57732K43317
$$ plain form
21222 938229 957959 968476 947989 951865 988486 996933 1014141 1033373 1023865 1028265 1047343 1046668 1039591
21209 1039591 1061662 1117362 1177907 1198051 1201350 1183708 1194522 1226905 1260501 1301480 1305429 1320526
21197 1320526 1350053 1375890 1385273 1404209 1423596 1411494 1441598 1476746 1500751 1531086 1582283
21186 1582283 1615700 1667129 1727598 1761332 1801704 1818298 1817042 1839637 1897208 1944274 1971965
21175 1971965 2061309 2112699 2146694 2188182 2238724 2303371 2373148 2428151 2470838 2527664 2584095
21164 2584095 2666636 2736545 2816791 2896207 2979413 3067196 3147049 3231559 3359282 3446633 3534433
21153 3534433 3675133 3810076 3918600 4035197 4173954 4297609 4448278 4608271 4752901
21144 4752901 4896007 5052535 5222428 5401151 5620175 5862595 6090752 6348484 6591801
21135F591801K52945K35730K72868L21873L32190L32772L46132L55125L71900
21126I413336L88137L90539M05228M17161M29351M37742M64173M74263M97807
21117A3317737M94405M87068M89870M70395M72535M71420M44069L93522M10698
21108A7451719L95444L45043L32278L01416K56047K02750J98426J44334R4007
21099A9721464Q3430N9385Q536k4721p8242j24653j30506j23494j93234k16860
21089A8981105k37600l02896l53020l44363l62770l92133m44793m64781m62367
21080A5616382m41323m50239m61144n02168n14545m92018m73442m76079m31516
21071A1373908m37136m04953l98819m17931l90912l70889l71301l33949k98578
$$ plain form
21135 6591801 6844746 7080476 7353344 7675217 8007407 8340179 8686311 9041436 9413336
21126 9413336 9801473 10192012 10597240 11014401 11443752 11881494 12345667 12819930 13317737
21117 13317737 13812142 14299210 14789080 15259475 15732010 16203430 16647499 17041021 17451719
21108 17451719 17847163 18192206 18524484 18825900 19081947 19284697 19483123 19627457 19721464
21099 19721464 19804894 19864279 19872815 19848094 19769852 19645199 19514693 19391199 19197965 18981105
21089 18981105 18743505 18440609 18087589 17743226 17380456 16988323 16543530 16078749 15616382
21080 15616382 15175059 14724820 14263676 13761508 13246963 12754945 12281503 11805424 11373908
21071 11373908 10936772 10531819 10133000 9715069 9324157 8953268 8581967 8248018 7949440
21062G949440l15011l01873k70040k73955k67471k34725k23542k50403k36980
21053E575440j89483j68400j81753j77889j78766j64992j74125j47929j22431
21044D069672j45945j64557j12702j11280r8429r3082p5216j09154j12007r2742
21034B954558p0850p7576p7106n9475q2682p9835p7136q6604o1095o6578n6664
21023B158957l2847m8846p8824l5633k0738m9710l7668m4223m1875r0694n0342
21012A627557l4637j8522l6869R50k1251l1544l7067k207l4192m0411n197k3772
21000A342838k1414l3237n0201l7849j8490j9938k9597k3513k762k0643m9260
20989A035934k8060j2479k1280l0947m284M478l006k1272k3291k2542N148P469
$$ plain form
21062 7949440 7634429 7332556 7062516 6788561 6521090 6286365 6062823 5812420 5575440
21053 5575440 5385957 5217557 5035804 4857915 4679149 4514157 4340032 4192103 4069672
21044 4069672 3923727 3759170 3646468 3535188 3436759 3343677 3268461 3159307 3047300 2954558
21034 2954558 2883708 2806132 2729026 2669551 2586869 2507034 2429898 2343294 2282199 2215621 2158957
21023 2158957 2126110 2077264 1998440 1962807 1942069 1892359 1854691 1810468 1768593 1677899 1627557
21012 1627557 1592920 1574398 1537529 1538479 1517228 1485684 1448617 1446410 1412218 1371807 1366610 1342838
21000 1342838 1321424 1288187 1237986 1200137 1181647 1161709 1132112 1108599 1105837 1085194 1035934
20989 1035934 1007874 995395 974115 943168 938884 943362 940356 919084 895793 873251 878399 885868
20977H85868n768j1011l435k0277m1997l4789k8027j5519O636L894p27R660K1337
20964G65845j0390k9164m0825l6352j925o217j7461J4635P24k4237k0455J8755
20952F12933M265o364j1673l5062J5328N846l7863j5106L338J620j2171j4345
20940E10746j8702k920L112k607M870l2904n1321J0720P416p955M009O238k062
20927D28640p702J2347k6707L898R220p73j5849k8393J8241l113k8113j6459M257
20914C49494J1273l0181Q180J9774J6567l4230k2943j2231r298n661j1945l255
20902B75544k5088j5483r637j054L1797K7120K7497r528j988j942k9307j0672
20890B57259j5736o412J8460J7986L18l262p633p433Q777k5336N619N391j2056
$$ plain form
20977 885868 880100 869089 865654 845377 803380 768591 740564 725045 731681 735575 734848 744508 765845
20964 765845 755455 726291 685466 649114 647189 640972 623511 638146 638870 614633 594178 612933
20952 612933 617198 610834 599161 564099 579427 585273 547410 532304 535642 537262 525091 510746
20940 510746 492044 489124 492236 489629 494499 461595 410274 420994 428410 420455 424464 430702 428640
20927 428640 420938 433285 406578 410476 419696 418923 403074 374681 392922 389809 361696 345237 349494
20914 349494 360767 330586 338766 358540 375107 340877 317934 305703 296405 290744 278799 275544
20902 275544 250456 234973 225336 224282 256079 283199 310696 301168 299180 297238 267931 257259
20890 257259 241523 235111 253571 271557 271875 268613 260980 253547 262324 236988 242607 247998 235942
20877B35942L78j7200j6795Q983J9489J2745j2950O995M487J6200K0519j8459
20865B60334R09j9314j5921l556j3305q734j0348O706K0187o205Q939j283J6358
20852B34767k5301j3550k504j6866J4793R78m444R425M690j1234M168J6521M285
20839B15728P872k2992l2955j5495Q414J8442L857j3899J150J1138P855J3713
20827B02828M1945L9981R317o478k3531J79k2730k7558l9014J0468L0748k990
20815B13165k6730J4354J4626p129K583r417k0509k9642P795J0976M66k0553j4741
20802A35244J0266J927j487k3506j2604l03j3522K436J4112j600K7446J2286p813
20789A42882j1102J8460J1361K715n748o950n825l006k570K030o745k0212O420
$$ plain form
20877 235942 236320 219120 202325 211308 230797 243542 230592 237587 242074 258274 278793 260334
20865 260334 261243 241929 226008 222452 209147 200413 190065 196771 216958 210753 219692 218409 234767
20852 234767 209466 195916 193412 176546 191339 192317 187873 197298 201988 190754 194922 211443 215728
20839 215728 223600 200608 167653 152158 160572 179014 182871 168972 170122 181260 189115 202828
20827 202828 244773 284754 294071 287593 264062 264241 241511 213953 174939 185407 216155 213165
20815 213165 186435 200789 215415 208286 210869 201452 180943 151301 159096 170072 170538 149985 135244
20802 135244 145510 147437 145950 122444 109840 109537 96015 98451 112563 110963 138409 150695 142882
20789 142882 131780 150240 161601 164316 158568 151618 145793 142787 140217 142247 135502 115290 121710
20776A21710j4296p651L718j4707Q964J1854m536n608j6886N473R47j1639M141
20763H1484J3500k00L327J877J2830k616J0735J7129k9602R495k963j7032k6474
20750G1490j662q707p100K4494L234l672r346L341l041o960K4633J5048j9493
20737H2259q080J0532M123K543l304m518M822n399P183K585j0519Q945j6387j2599
20723F2186k0865n829K1449M7536K261M954q316l909m146j5581O458j2284O82
20710G4596j0545k4186j3880L0685N876j6781J4846K6184J5981j6188k1899N422
20698G0111j2040l4216n245K8783n55l322M108j997j8393k369m984q594k882J2755
20684B1160M645j1070J3341K0745L080Q569j3296k770p072L1627J7776n834k88
$$ plain form
20776 121710 107414 99763 103481 88774 97738 109592 105056 99448 82562 88035 88982 77343 81484
20763 81484 94984 94784 98111 99988 112818 110202 120937 138066 108464 117959 114996 97964 71490
20750 71490 69828 61121 54021 78515 81749 78077 68731 72072 69031 62071 86704 101752 82259
20737 82259 74179 84711 88834 91377 88073 83555 88377 82978 90161 92746 82227 91172 74785 62186
20723 62186 41321 35492 56941 104477 106738 111692 103376 99467 95321 79740 86198 73914 74596
20710 74596 64051 39865 25985 56670 62546 45765 60611 86795 102776 86588 64689 70111
20698 70111 58071 23855 18610 47393 46838 43516 47624 45627 27234 24865 19881 11287 8405 21160
20684 21160 25805 14735 28076 48821 51901 60470 47174 44404 37332 68959 86735 80901 80613
20671H0613q564k1255k8764J6452R656j1886o771O185M331j0115o739J7553l893
20658C6803L974j7086k0718K6669K1103K1757q363k3252q03K5090L0838j8711
20646G7301l2818o146j6038j3156r737K738m272L3081J3278Q512j6557k0325J3649
20633B9510J4971J742k370m7340N053K0408K4543P21L7156k720J2656K091j5324
20620H1097k7617J1379l673m380k836j097j539m926o097j2233n589K390J3925
20607C8804J9987m0761j5853J4863K6947N516J5733O301J2964k6796l7832r470
20595A0403L6041l75l9703J718J327q840M4935J0823J5011L3824j8027j1974m501
20582G0662k39J2924J0697N197j7672m3852N990P982K9728q285j8601k3906l4821
$$ plain form
20671 80613 72049 50794 22030 38482 48138 36252 29481 35666 39997 29882 23143 40696 36803
20658 36803 40777 23691 2973 29642 50745 72502 64139 40887 40084 65174 96012 77301
20646 77301 44483 38337 22299 9143 -594 2144 -2128 30953 44231 52743 36186 15861 29510
20633 29510 44481 46223 43853 -3487 1566 21974 46517 47238 84394 81674 94330 96421 81097
20620 81097 53480 64859 61186 56806 53970 52873 51334 46408 40311 28078 22489 24879 38804
20607 38804 58791 18030 2177 17040 43987 49503 65236 71537 84501 57705 19873 10403
20595 10403 46444 46069 6366 8084 9411 571 45506 56329 71340 105164 87137 75163 70662
20582 70662 70423 83347 94044 99241 81569 37717 43707 51689 81417 73132 54531 30625 -4196
20569d196N988J5437o545r462J8729l101L033j7934l0256K6690J9284J748j4960
20556D455M097j6301o294R247J7678J20r262N19N234K2383Q71N82P372P222k2845
20541B5078K355j267O790m627j8823j994j3326j2759L0433J7278M904j6172l296
20528A4574K799J8228M029k7772J9131r671j1648J2643J8295m217K490m186J3020
20515D7715K2005k5863J5074J9577n191j7808k2035j6069l0930J3550O995j3833
20503f813o600k352J2313M019r745r196O740N867p659L6553j5553m743P599j0277
20489A53q581j665R445j7967K1692K4342J046p662K9918k0811j0047O708k5051
20476A520n054N591N300J8866J525q399m907j332j1327p472J0954L2763j8880
$$ plain form
20569 -4196 1792 17229 10684 1222 19951 16850 19883 1949 -28307 -1617 17667 19415 4455
20556 4455 8552 -7749 -14043 -4796 12882 13002 3740 4259 9493 31876 32747 33329 40701 47923 25078
20541 25078 27433 26166 32956 28329 9506 7512 -5814 -18573 11860 29138 34042 17870 14574
20528 14574 17373 35601 39630 11858 30989 21318 9670 22313 40608 36391 38881 34695 47715
20515 47715 69720 43857 58931 78508 73317 55509 33474 17405 -13525 25 7020 -6813
20503 -6813 -13413 -15765 -3452 567 -9178 -18374 -11634 -5767 -13426 23127 7574 2831 10430 153
20489 153 -8428 -10093 -648 -18615 3077 27419 28465 20803 50721 29910 19863 26571 1520
20476 1520 -3534 2057 7357 26223 27748 19349 14442 13110 1783 -5689 5265 38028 19148
20463A9148Q191m2238j0736J1529K5374L1694o084l8436k3376p036L5343J0426
20451A3799K522k1859l1665m141J6192J016J4930K0862J7730j0796K2457O022
20439D7069K1817L572M331j3096n665k2138j2485J1262n00l0458k2694j2934p340
20426c9259J2223J3237Q172o097J8412K630l657J6907K3568j037j6813j2652j9198
20413c564K346J5452j101J747m2072j7408P499R18P952N815J8257N487O745J0292
20399A8365R817L2602J173j9386n7797l2632k800M3302M9113j151k5918m455J4944
20386B5177J59K42k879P55j7124o459J1263K2934j2533K5011K1283j2481j0891
20373D4457R232j5155j5065J758J7P787M450n025P150N440l7379p414n208J2375
$$ plain form
20463 19148 27339 -14899 -25635 -14106 11268 42962 36878 -1558 -24934 -31970 3373 13799
20451 13799 16321 -5538 -37203 -41344 -25152 -24136 -9206 11656 29386 18590 41047 47069
20439 47069 68886 72458 76789 63693 58028 35890 23405 34667 34167 3709 -18985 -31919 -39259
20426 -39259 -27036 -13799 -5627 -11724 6688 9318 5661 22568 46136 45099 28286 15634 -3564
20413 -3564 -1218 14234 13133 14880 -27192 -44600 -37101 -36183 -28231 -22416 -4159 1328 8073 18365
20399 18365 28182 60784 61957 42571 -15226 -47858 -50658 -7356 41757 40606 14688 10233 25177
20386 25177 25336 25578 22699 23454 6330 -129 11134 34068 21535 46546 67829 55348 44457
20373 44457 53689 38534 23469 25227 25244 33031 37481 32456 39606 45046 7667 253 -4955 7420
20359G420q124k715L5J7614J9650j5224n072N192p235M561q494j2353l83J8004
20345A2876j5469J299J0207j5452R719k016j4948l636j3299K0373P484K581r766
20332a0047M89P454p537L192N188O813Q007J0505J0753q256k109j2102k3614J2192
20318I28j641J1305J5155q441j0637k2442M110R876l552L164L9558K4680p717
20305E4346p139j6383k084j2981k9768R27J5031k0384j835k833j372P490R717
20292g268K305p443Q610L8834j2495j4779j7141k350J0229J1687j5978k4035J2516
20279a7308j0223K336J6916J2817j6643l925J4289k7384J8822J8267j2010M029
20267a7J723j798J4582l1604j8107M993J0571L7990j3215J869J1990j8894l495
$$ plain form
20359 7420 -704 -3419 -3384 14230 33880 18656 13584 18776 11541 16102 7608 -4745 -5128 12876
20345 12876 -2593 -1294 8913 -6539 3180 1164 -13784 -17420 -30719 -10346 -2862 -281 -10047
20332 -10047 -9558 -2104 -9641 -6449 -1261 5552 13559 24064 34817 26561 24452 12350 -11264 928
20318 928 -713 10592 25747 17306 6669 -15773 -11663 -1787 -5339 -2175 37383 62063 54346
20305 54346 47207 30824 28740 15759 -14009 -13082 1949 -18435 -20270 -23103 -24475 -16985 -7268
20292 -7268 -4963 -12406 -3796 35038 22543 7764 -9377 -11727 -1498 10189 -5789 -29824 -17308
20279 -17308 -27531 -25195 -8279 4538 -12105 -16030 -1741 -29125 -10303 7964 -4046 -17
20267 -17 1706 -92 14490 -17114 -35221 -30228 -19657 18333 5118 6987 18977 83 -3412
20254c412J8386J7732P615Q135l2384j7571r682K9972L082k0778R13p650R305
20241C663K6525j6618j1803J4032j6946K1343K7076o471k4973l3274k9772J396
20229d5822K651J8203K6838K4250K1071k143m1779j7324j2266m323K313J2705
20217a5626L6184P422k0129J044P394M582q089K5181j4029m6023P355P60P5K1000
20203G101r297O112P237j5111K279J9138L574q996j898Q545R223l3702K471m099
20189g423K628o73L130J5920J9614N404j0489k1054l911Q352j2128J2131K3785
20176C5286n805k5747L4500N096P95j4444M152J1743O605j7514J6603j1709n7900
20163a8339p160L1995L1652K1411o949m9025j6102P655j7973P520J0498j1820
$$ plain form
20254 -3412 14974 32706 40321 48456 16072 -1499 -11181 18791 21873 1095 2008 -5642 3663
20241 3663 30188 13570 1767 15799 -1147 20196 47272 40801 15828 -17446 -47218 -45822
20229 -45822 -43171 -24968 1870 26120 47191 45048 3269 -14055 -26321 -30644 -28331 -15626
20217 -15626 20558 27980 7851 8895 16289 20871 12782 37963 23934 -22089 -14734 -13974 -13899 7101
20203 7101 -2196 3916 11153 -3958 -1679 17459 21033 12037 10139 18684 27907 -5795 -3324 -7423
20189 -7423 -4795 -5468 -2338 13582 33196 38600 28111 7057 3146 11498 -630 11501 35286
20176 35286 29481 3734 38234 43330 44125 29681 33833 45576 52181 34667 51270 39561 -18339
20163 -18339 -25499 6496 38148 59559 52610 3585 -12517 -4862 -22835 -15315 -4817 -16637
20151a6637j3858J0893n055J1763J1917l960k772j1096O356K4305K2468L4613
20139F8937k9277k6759J2179J2939o865j7014j0108k0503j2578K413J9063M113
20127c460J1806K3243Q899r671k8243q998P374K5755K4860j467j6402k4817q01
20114H078J8213k910k8608k4577K0748K002l930j0812Q157L986O730l132j8408
20101b4463Q618K0864o584j7821J0889K1526J5429k8587K782k81M475J7149J0127
20088C4123l5874j3961K2760J3942k4753j7248J2404K502j3721K7719Q851j0538
20076F206k7941l1937K3138L0695j0498p750J1565o107J8834K3222j1661k2709
20064d943R064L470j8470k6745J3998Q672J2005L944L871k4121L990J5301o938
$$ plain form
20151 -16637 -30495 -19602 -24657 -12894 -977 -4937 -7709 -18805 -12449 11856 34324 68937
20139 68937 39660 12901 25080 38019 31154 14140 4032 -16471 -29049 -26636 -7573 -3460
20127 -3460 8346 31589 40488 30817 2574 -6424 950 26705 51565 50098 33696 8879 8078
20114 8078 26291 23381 -5227 -29804 -9056 -7054 -10984 -21796 -13639 -9653 -2923 -6055 -24463
20101 -24463 -15845 5019 -1565 -19386 -8497 13029 28458 -129 2653 2372 6847 23996 34123
20088 34123 -1751 -15712 7048 20990 -3763 -21011 -8607 -6105 -19826 7893 16744 6206
20076 6206 -21735 -53672 -30534 161 -10337 -18087 -6522 -12629 6205 29427 17766 -4943
20064 -4943 4121 7591 -10879 -37624 -23626 -14954 -2949 995 4866 -19255 -15265 36 -6902
20051f902n673Q865q638j2238N16l5N689K1551j1557O365K32J0813j6093l4656
20037d1761K5372J9386l9784k1343L9714J3342k0228K5299L080j6628p339o426
20025b7316J8316j2095Q887n007r440j4434k8290l0069Q826N4633R107K7713K1205
20012B2036J1519j331j1077j4878J231L916q132k7303J6779L8017K327L417L3159
19999F9680j593k3825l668k4011l0048m201j3473j568j3823l178M5054K6397M609
19986B6352l7084k9912K2408K2852j7652R857K2716Q591R337J3651o200l4852
19974A0064k8563n680K6987N592P137j6271j8045o804J1670J7772J681r683J1429
19961G286j0897j5973P701K1875k2758R890J1256j8792k3183r84r845P093K8185
$$ plain form
20051 -6902 -12575 -3710 -12348 -24586 -24070 -24105 -18416 3135 -8422 -2057 -1825 8988 -7105 -41761
20037 -41761 -16389 2997 -36787 -58130 -18416 -5074 -25302 -3 3077 -13551 -20890 -27316
20025 -27316 -9000 -21095 -12208 -17215 -26655 -41089 -69379 -99448 -90622 -35989 -26882 831 22036
20012 22036 33555 32224 21147 6269 7500 11416 3284 -24019 -7240 30777 33104 36521 69680
19999 69680 68087 44262 40594 16583 -13465 -17666 -31139 -32707 -46530 -49708 -4654 21743 26352
19986 26352 -10732 -40644 -18236 4616 -13036 -3179 19537 28128 37465 51116 44916 10064
19974 10064 -18499 -24179 2808 8400 15537 -734 -18779 -25583 -13913 3859 5540 -4143 7286
19961 7286 -3611 -19584 -11883 9992 -12766 -2876 8380 -10412 -33595 -34579 -44424 -37331 -9146
19948i146K6246l0572l237k695J089R530l895k5379J5515K0694q357k1356k656
19935c4219P101L906j8514j731K6292K3625j8013j1586J1706J6098p061p06J2996
19922I894K2170j340K2278m990l4091K9220l981l9977m279K1000m899o746J4366
19909A8625K33j5992j5828K1336k878J64j5053P745J8055J7069J461j5406m286
19896A5245l4482j2833Q003l28l250J0240M810O461j9832r847q877Q354n832J9408
19882b2760l265j3419k254m246J4172r442j0356P662J467J9008J8843r943J7560
19869C027m578k1590M752k1313J2719J0068J4526R615j1593k4978K0989K4987
19857A6631j9306k7757J0642L2895J6431O103m411j0570l434k7553o850J5922
$$ plain form
19948 -9146 17100 -13472 -16709 -19404 -18315 -8785 -12680 -38059 -22544 -1850 -10207 -31563 -34219
19935 -34219 -27118 -23212 -41726 -43457 -17165 6460 -11553 -23139 -11433 4665 -2396 -3102 9894
19922 9894 32064 30724 53002 48012 13921 43141 39160 -817 -5096 15904 11005 4259 18625
19909 18625 18858 2866 -12962 8374 5496 5660 -9393 -1648 16407 33476 34937 19531 15245
19896 15245 -19237 -32070 -24067 -24395 -27645 -17405 -12595 -6134 -25966 -35813 -44690 -36336 -42168 -22760
19882 -22760 -26025 -39444 -41698 -45944 -31772 -41214 -51570 -43908 -42441 -23433 -4590 -14533 3027
19869 3027 -1551 -23141 -18389 -39702 -26983 -16915 -2389 7226 -4367 -29345 -8356 16631
19857 16631 -2675 -30432 -19790 13105 29536 35639 31228 20658 17224 -10329 -17179 -1257
19845a257j4531J8648J1037n961n070l0127J6420J4242K1534p480k1867j1557
19833a5969M185R533K6243L394k53J8098j6782j2295J6405J50J799o432o260q294
19819A3522n946j5400m534J4277J006o706M62j174j8n948j478P285K1829J5441
19805C2618K2051q529l2633k2188K7646J6068k0208n5378L151L4180K8022M383
19793B9183J4210M302k4625k7050P416K478l147j8596n561R911J236m0466j3007
19780f3716L9502J4738J2538k82m2110R998j2545J3899p770J0026L0527j1936
19768g131j7093j6529K650L7459P774K428q252k403K797K660N799K35k5977j0329
19754b5912J6242J4327j3766p368L8821j4116n244j2413M992J703O95J3605j0752
$$ plain form
19845 -1257 -15788 2860 13897 7936 2866 -27261 -10841 3401 24935 17455 -4412 -15969
19833 -15969 -11784 -2251 23992 27386 27133 45231 28449 16154 32559 32709 34508 28076 21816 13522
19819 13522 7576 -7824 -12358 1919 2925 -3781 -3319 -4493 -4511 -10459 -11937 -4652 17177 32618
19805 32618 54669 46140 13507 -8681 18965 35033 14825 -40553 -37402 -3222 24800 29183
19793 29183 43393 47695 23070 -3980 3436 5914 2767 -15829 -21390 -11479 -10243 -50709 -63716
19780 -63716 -24214 -9476 3062 2780 -39330 -29332 -41877 -27978 -35748 -25722 4805 -7131
19768 -7131 -24224 -40753 -38103 -644 7130 9558 1306 -1097 1700 4360 10159 10394 -15583 -25912
19754 -25912 -9670 4657 -9109 -16477 22344 8228 2984 -9429 -4437 -2734 -2039 11566 814
19741H14j7047N124R028K3480K2351J7076R473l3734l9348j3341J751J1894j0508
19728a2987J6556L826m19M314K768j58k651J4994Q600l359j2938k2358N454J2065
19714A3707K9483J1996l6679j6083j5883K599L0270M513k5245k0142j422L3214
19702A0328Q828k0152l675J1602k836J189K2991k4872m458N223j8898R606K9248
19689B4124K170j5450j884L3470J5037J0464J615j6354n122J5919j834j7325k0048
19676B4782l6599O668K2026j819O087J0421J149j5705J186l617k1372j5515N57
19663b1751J5243J1762O727M107R526o741j4296O376j0445k1844l747J6266J2973
19650D156J6115J7426K90P878j530l8937j4694m712J1428J2000J6123J5723J3066
$$ plain form
19741 814 -16233 -11109 -2081 21399 43750 60826 70299 36565 -2783 -16124 -14373 -2479 -12987
19728 -12987 3569 7395 6976 11290 14058 13900 11249 26243 34843 31484 18546 -3812 1642 13707
19714 13707 43190 55186 18507 2424 -13459 -10860 19410 23923 -1322 -21464 -22886 10328
19702 10328 19156 -996 -4671 6931 4095 5284 28275 3403 -1055 4168 -14730 -5124 24124
19689 24124 26294 10844 8960 42430 57467 67931 69546 53192 48070 63989 62155 44830 24782
19676 24782 -11817 -5149 16877 15058 21145 31566 32715 17010 18196 14579 -6793 -22308 -21751
19663 -21751 -6508 5254 11981 16088 25614 18873 4577 10953 508 -21336 -25083 -8817 4156
19650 4156 20271 37697 37987 45865 44335 5398 -9296 -14008 -2580 9420 25543 41266 54332
19637E4332P798k4997l2374k1630L788J8840K4849J2634O461k3369j8954k3429
19625a6051j9623K2360N484N162q615k316J9387J8792k0666M810n683R465J7911
19612C0417K759o83j0815q114j7082J9155P640j6904p380J4013J1093K4101L2952
19599H1152j9699n5259l6497J0387L4030O167l19P062K439j0993j5960r46l121
19586a557P412J3397o62j1666j2453k1958L607J8582J4543J8119Q423J2965j2301
19573C6451J8323k1191j9943j8764j0340M135J4068Q872K4849J2197j6856k1320
19561A0481n290L805K398j086j626l2224J2125L4615M760l1775K0169J3070j3951
19548A5471k9245Q700L4225q310j808J6594j2404m7978j3784K3989J3785R876
$$ plain form
19637 54332 62130 37133 4759 -16871 -13083 5757 30606 43240 49701 26332 7378 -16051
19625 -16051 -35674 -13314 -7830 -2668 -11283 -13599 5788 24580 3914 8724 3041 12506 30417
19612 30417 33176 32493 21678 13564 -3518 15637 23277 6373 -1007 13006 24099 48200 81152
19599 81152 61453 6194 -30303 -19916 14114 20281 19962 27024 29463 18470 2510 1564 -1557
19586 -1557 5855 19252 18590 6924 -5529 -27487 -23880 -5298 9245 27364 35787 48752 36451
19573 36451 54774 33583 13640 -5124 -15464 -11329 2739 11611 36460 48657 31801 10481
19561 10481 5191 8996 11394 10308 8682 -23542 -11417 23198 27958 -3817 16352 29422 15471
19548 15471 -13774 -5074 29151 20841 19033 35627 23223 -24755 -38539 -14550 -765 9111
19536I111o705k1062J2328K2381n851k5095j0573J157n358K5418m442R838P56
19523A903j2038K084k885P291j5184J8398L808p727J7498j2741K7640k2332l085
19510B630r460j494o114J7610Q214N661J6230K0944q396p799p274j0237j2792
19497G723M2150J4516j9201J8941j2966l3972k876L441j8374j9332K9904J5090
19485B5044N108l2L387m591J4359n866j3605k3529j9260J6287J5279O060k24n062
19471A3355p337j6725q644K5569J0441N860L768O577l33k5776j3611p136l747
19458a7739m408L015J0500M1206N885j2175k5935k4496J4646N554P980p931J8315
19445A4417k771o896O277J0612J5029j198k9161L29J9723k1667k2320M309K0320
$$ plain form
19536 9111 2406 -18656 -6328 16053 10202 -14893 -25466 -24309 -29667 -4249 -8691 1147 1903
19523 1903 -10135 -8051 -10936 -3645 -18829 -431 3377 -4350 13148 407 28047 5715 2630
19510 2630 -6830 -8324 -14438 3172 11386 17047 33277 54221 45825 38026 30752 20515 7723
19497 7723 49873 64389 45188 64129 51163 17191 14315 17756 -618 -19950 9954 25044
19485 25044 30152 30120 33507 28916 43275 37409 23804 275 -18985 -2698 12581 18641 18417 13355
19471 13355 6018 -10707 -19351 6218 16659 22519 26287 32864 32531 6755 -6856 -13992 -17739
19458 -17739 -22147 -19132 -8632 32574 38459 26284 349 -24147 -9501 -3947 4033 -3898 14417
19445 14417 11646 4750 11027 21639 36668 35470 6309 6638 26361 4694 -17626 -13317 7003
19432G003N160j5801m070J8203j8890j7506J1375j6180J8182J7424J9855q299
19420A6456k1130J5549Q327j4579J0295M126m915q112K2305l5482Q766J5965n172
19407A2399P52l875K042O131J2344o881j49J2459P759K775N849m99l71n702j8165
19392B6868l426j580J5233Q908r068q699j884p58j5760j78J5313J2849j4280J3524
19378C7062l8311j3239J7052J6851k1454M316L3028K487J1255n448r009j0094
19366B4496l102k130j986j7414l789K8370K98j6805k4485k2055L300J7298N423
19353a2581P31K9914L4589L344k640j9680l2774J7429J6148L2570P857p136j1585
19340E6186k5844K456o508K3701J5116j7922j3608J6608K9049J5931l5927j9831
$$ plain form
19432 7003 12163 -3638 -7708 10495 -8395 -25901 -14526 -30706 -12524 4900 24755 16456
19420 16456 -4674 10875 19202 4623 14918 19044 14129 6017 28322 -7160 1606 17571 12399
19407 12399 13151 9276 11318 17449 29793 22912 22763 35222 42981 45756 51605 51106 50735 45033 26868
19392 26868 23442 21862 37095 46003 36935 28236 26352 25594 9834 9656 24969 37818 23538 37062
19378 37062 -1249 -14488 2564 19415 -2039 2277 35305 37792 49047 43599 34590 24496
19366 24496 21394 19264 17278 -136 -3925 24445 24743 7938 -16547 -38602 -35302 -18004 -12581
19353 -12581 -11850 18064 52653 55997 53357 33677 903 18332 34480 67050 74907 67771 56186
19340 56186 30342 32798 26290 49991 65107 47185 33577 50185 79234 95165 59238 39407
19328C9407j1844J1795q575k3392k4527O101J7979J2329M711K587J4278o07R875
19315E0117k960k6830k4858J314q246j1314N204L100O006j1133J9727K3499Q348
19302C1974P451J3750j0412N951J2315o639l177K768j1036K1246j1278L04j765
19289E1452p83K1738J857k7168l144N063j9767p641J5200j0127m732P4k134M410
19275B4298n779j2693J6112L3104M1683m157l9763m0036p815M3040J015J4598
19263F3607J095j5489p073l057j9971M059O455P502J2712R05l2641j990J5282
19250C1396J5170K2085j7395j7550j0941j3588J6310R831l2717j2023J6111J3478
19238B0167L3131J8216k5597M941J6279j1802k6780l362J0879J9082j641m3667
$$ plain form
19328 39407 27563 39358 30783 7391 -17136 -11035 6944 19273 23984 26571 40849 40242 50117
19315 50117 47157 20327 -4531 -3217 -11463 -22777 -17573 -14473 -8467 -19600 127 23626 31974
19302 31974 39425 53175 42763 48714 61029 54390 51213 53981 42945 64191 52913 53217 51452
19289 51452 50669 72407 74264 47096 43952 49015 29248 21607 36807 26680 21948 22022 19888 24298
19275 24298 18519 5826 21938 55042 96725 92568 52805 12769 4954 47994 49009 63607
19263 63607 64702 49213 42140 39083 19112 23171 29626 37128 49840 50745 18104 16114 31396
19250 31396 46566 68651 51256 33706 22765 9177 25487 35318 2601 -9422 6689 20167
19238 20167 53298 71514 45917 50858 67137 55335 28555 25193 36072 55154 53513 9846
19226I846M280M4243j8373l7216j4998r588P360L7578J0183J3312O489j8146k4721
19213A0249N107J0405N429J6764K3505J6942j1108j0713k0005K3384J7690j3606
19201G4043J800J9884J8620N183q133l3533J1394P02j6411J618j8772k3359R77
19188C4013Q564k6677j5680J0790J414L6711k772k482J3624R160J2778Q382q501
19175G9324q14j1875k0713k412J0289J3321j8774l4231k140R114r628L546L943
19162A8950L4885o999p104O163k1333M154j3354k203J9386r206j6713k6261M227
19149a5408J1110M5712P9j9671J2666K0326J8619N560Q51o106j2238j1007J162
19136E1655J1674k4834O069J3135R521p370k18j7342l8018K8349M1553j8617k6080
$$ plain form
19226 9846 14126 58369 39996 2780 -12218 -21806 -14446 23132 33315 46627 53116 34970 10249
19213 10249 15356 25761 31190 47954 71459 88401 77293 66580 46575 69959 87649 74043
19201 74043 75843 95727 114347 119530 111397 77864 89258 89960 73549 75167 56395 33036 34013
19188 34013 42577 15900 220 11010 12424 49135 46363 43881 57505 66665 79443 87825 79324
19175 79324 78510 66635 45922 43510 53799 67120 48346 14115 11975 21089 11461 15007 18950
19162 18950 53835 46836 39732 45895 24562 28716 15362 13159 32545 23339 6626 -19635 -15408
19149 -15408 -4298 41414 41493 21822 34488 54814 73433 78993 79844 73738 61500 50493 51655
19136 51655 63329 38495 44564 57699 67220 59850 59632 42290 4272 32621 74174 55557 29477
19123B9477K281K5077O436O853o478J304J7833J8706j4220M995J6553k5728l4861
19110D8228Q363J1921O973K9939J1509j1008k7814k3713j5342K0347N161j9747
19098D4817j8572M253K6633N60k083k118j199K0969N953m677l082m345O26J4393
19084H2128J6377k7590k7750k2527J0264J7538J8637j4294L3888j780m8472P118
19072D3537K4411j3901l675k6566N130k628j3385K185M9636N0260r523j6635j9939
19059F8907k9838P312K9270R053J4168j0062n1987k2091L8710O5664p275k3432
19047H8399l1967r342Q264O656K4895q960j7801O811N089j0676j5187j1502r948
19034B4731J6884J5605q501R963j55k224l059j0628K727K4124M697J724O043P137
$$ plain form
19123 29477 31758 56835 63271 70124 63646 64950 82783 101489 87269 92264 108817 83089 48228
19110 48228 56591 68512 75485 105424 116933 105925 78111 54398 39056 59403 64564 44817
19098 44817 26245 30498 57131 57691 55608 53490 52291 73260 79213 74536 71454 67109 67735 82128
19084 82128 98505 70915 43165 20638 30902 48440 67077 52783 86671 84891 36419 43537
19072 43537 67948 54047 50372 23806 28936 26308 12923 15108 64744 115004 105481 88846 68907
19059 68907 39069 46381 75651 84704 98872 88810 36823 14732 53442 119106 111831 88399
19047 88399 56432 47090 55354 62010 86905 77945 60144 66955 72044 61368 46181 34679 24731
19034 24731 41615 57220 48719 58682 58527 56303 53244 42616 45343 69467 74164 75888 81931 89068
19020H9068o725J101P017o144j7275j5175j9822Q402l507j8314J7237J037J1030
19007D7930M399m786J1516K9345J6468J2355J7017o695j499k4187l3293m3112
18995B5458j7114J0068j450J3379L0372J5326k704j4542n434J2743L8261L2382
18983A36745J0567l1230m2141k9475M760J4936J0767p712K020L6756J3668j0597
18971A09064r141l3880J4655R881n929K2700K0595N457m0900j1232r622j4815
18959E6833K5614K3030K280k0224j2680J4664J381n602J7056J8037K2458J6952
18947A59799k5059j4331l814p334J1115L029k0313m088R509k7476L791K1704J6274
18934A22806j2583o027K4654J9311q287n655j0215j5739j402p408Q769K9110L9015
$$ plain form
19020 89068 82343 83444 90461 84317 67042 51867 32045 40447 36940 18626 35863 36900 47930
19007 47930 52329 47543 59059 88404 104872 117227 134244 127549 126050 101863 68570 25458
18995 25458 8344 18412 16962 30341 60713 76039 73335 58793 53359 66102 104363 136745
18983 136745 147312 116082 73941 44466 49226 64162 74929 67217 69237 105993 119661 109064
18971 109064 99923 66043 80698 90579 84650 107350 127945 133402 92502 81270 71648 56833
18959 56833 82447 105477 107757 87533 74853 89517 90898 85296 102352 120389 142847 159799
18947 159799 134740 120409 116595 109261 120376 123405 103092 99004 108513 81037 84828 106532 122806
18934 122806 110223 104196 128850 148161 139874 134219 124004 108265 106863 99455 108224 137334 176349
18921A76349k808k8232Q185J1797j1841M6586Q3999P2669K0558l1545o0884l5705
18909B49128k4493p146j912k6436J4100P669l0116k5050N307M201J1619J6458
18897A93329o065q456j6837k7159k0536N069J737j6371l485J0196M373j2666l2101
18884G1028K2638L3776L0996m937L570j7161p437K9135M4470k706O277M025k0095
18871A93579j3075K2668K9240k470K4477J4680J3294K4337M3138M9765K0739N1056
18859D71428L9729K9456K459k7638n1605m4966j8493k9352j1551m9131l7102Q493
18847B81727K0176k1394l922k9460K2241K1853j7536j5780r190j9080p320j0275
18835B12040k5059M687M1399P1326P4089L4354P174K2158n150m3528j7305j6837
$$ plain form
18921 176349 173541 145309 153494 165291 153450 200036 284035 356704 377262 345717 284833 249128
18909 249128 224635 217489 215577 189141 203241 210910 180794 155744 161051 165252 176871 193329
18897 193329 187264 178808 161971 134812 114276 119345 121082 104711 101226 111422 115795 103129 71028
18884 71028 93666 127442 158438 153501 157071 139910 132473 161608 206078 203372 209649 213674 193579
18871 193579 180504 203172 232412 229942 254419 269099 282393 306730 349868 399633 420372 471428
18859 471428 511157 540613 543072 515434 463829 418863 400370 371018 359467 310336 273234 281727
18847 281727 301903 280509 276587 247127 269368 291221 273685 257905 248715 229635 222315 212040
18835 212040 186981 191668 233067 304393 378482 412836 420010 442168 437018 393490 376185 359348
18823C59348J5919P647K5210O1087P9116L5797J4116k7376r857k1587k4916M7116
18811E61620L4985M5084Q1687N9508J6395k6098l1271R14j4757l2942k360K318
18799F95083R744o389m8860m7230j5599l1178l9554m2352k3478r005J379j2051
18787D30510l337K1279K8605m711J3742K1100L2200M721O312J9126J4957J5891
18775F00395J9033K5606R625n907k6491m2234j7910N3065N2677J9880j39J5110
18763G02710k7503k0733p381L6276K5229Q844P750j1306J2205K7311M4744J5164
18751H13310J3877l6072q0644p6992n5422n8077l4576k517K0560J8290r742k6867
18739D85128n1712k6076m425k9046m4536k6624l209O559J2087K8350K5226K6381
$$ plain form
18823 359348 375267 382914 408124 469211 548327 584124 598240 570864 561007 539420 514504 561620
18811 561620 596605 641689 723376 782884 799279 773181 741910 742824 728067 695125 692765 695083
18799 695083 704827 698438 649578 602348 586749 555571 516017 473665 450187 441182 442561 430510
18787 430510 427173 448452 477057 472346 486088 507188 539388 544109 550421 569547 584504 600395
18775 600395 619428 645034 654659 648752 622261 580027 562117 615182 667859 687739 687600 702710
18763 702710 675207 654474 647093 683369 708598 717442 725192 713886 726091 753402 798146 813310
18751 813310 827187 791115 710471 633479 578057 519980 485404 482887 503447 521737 511995 485128
18739 485128 433416 407340 402915 373869 329333 302709 299500 306059 318146 346496 371722 398103
18727C98103J3571P078J971J816j1122k2850k9174j8109N14p969J5333m648m2709
18714C01805k4775j6006J412o159l214O133J4537J1430N798j471J8500L4007M6812
18701C88809p516J9900K9926J5567Q23p53j4731j4049m3846k4217j6135J7101
18689C50879J3801j0459k1513K3131p734r646j2537j1433m6018p960M3675j80
18677C04006k2550j4325j9522j9273J0026l768k0950J1900L2434O603q791K2853
18665B78643J5690o632J5011M5713L933l1636l0361o414j0144k5333k1246k7799
18653A99425j325L0576L1672Q496J1701j0080j8757O216M134P806r504K9916R651
18640B99927l0856j5604j3828r48J0656J4479j1437J9155j6904j571O002n535
$$ plain form
18727 398103 411674 418752 420723 422539 411417 388567 359393 341284 341798 333829 349162 344514 301805
18714 301805 277030 261024 262436 256277 253063 259196 273733 285163 290961 289490 307990 341997 388809
18701 388809 381293 401193 431119 446686 447509 446756 432025 417976 374130 349913 333778 350879
18689 350879 364680 354221 332708 355839 348105 338459 325922 314489 268471 260511 304186 304006
18677 304006 281456 267131 247609 228336 238362 234594 213644 225544 257978 264581 255790 278643
18665 278643 294333 287701 302712 348425 352358 320722 290361 283947 273803 248470 227224 199425
18653 199425 198100 228676 260348 268844 280545 270465 251708 257924 262058 269864 260360 290276 299927
18640 299927 269071 253467 239639 238691 249347 263826 252389 271544 254640 253069 259071 253536
18628B53536K7628J3435n165j7018k2445J3793m756L598O391j811o968O77J1634
18615B72529k8465l192L0580q379p079J0679L7498j0393j5141J9539P023r248
18603B95951q915P235l2714l6239j0261J9998J623l5825j3484O167p836j3210
18591A72490K0061J1245K3280J4460M048m477j0869p104j5781l617K735N335K668
18578B14474O991l7255j0141Q549K3638k167L569R064J0508p68O57l597J6091
18565B39613J2385j4541j50P809J6196L979j5954P293M6589J5475P385m1l3792
18552B92246k1529l2082k2551R688Q64m267J1074K6169L1699N2386K734j2022
18540C34409J1744Q217L0048Q760n961j8205k0133k0516j1598l565m4099l2484
$$ plain form
18628 253536 281164 294599 289434 272416 249971 263764 259008 262606 268997 267186 260218 260895 272529
18615 272529 244064 240872 271452 263073 255994 266673 304171 293778 278637 298176 305199 295951
18603 295951 287036 294271 261557 225318 215057 235055 236678 200853 187369 193536 185700 172490
18591 172490 192551 203796 227076 241536 245584 241107 230238 223134 207353 203736 206471 211806 214474
18578 214474 221465 184210 174069 182618 206256 204089 207658 216722 227230 226462 227119 223522 239613
18565 239613 251998 237457 237307 245116 261312 265291 249337 256630 303219 318694 326079 326038 292246
18552 292246 270717 238635 216084 225772 226636 222369 233443 259612 291311 343697 346431 334409
18540 334409 346153 354370 384418 393178 387217 369012 348879 328363 316765 313200 269101 236617
18528B36617K272j0064l016J5718L2259p554o724N3588M0889j6579j7125K749
18516C23030L4334J8824j2231J2394K4900k68K130k1872J499K6113k2139j602
18504C85112q241O426K240K1438L0887p988j894l0102M405P544k4663j2183J5600
18491C88581K1909K1848n051N977L9491J6944J5838J6176M4821Q044j692K823
18479E75709J7371L510P481K8880M4848M2933K6267L3895J1010O524j1910N329
18467G91847N745k6026p5007n8349l5257k8448k1725j908r086q872J978k083R208
18454E42017J2137j3169k5649k5561j5258K4744L9033K5795l7836k6443k1862
18443D77948j8138l9563m1577n9960r2860q7356m5629J8296L0806K2614K4496
$$ plain form
18528 236617 238889 228825 225809 241527 273786 266232 259508 313096 353985 337406 320281 323030
18516 323030 357364 376188 363957 376351 401251 400983 403113 381241 382740 408853 386714 385112
18504 385112 376871 383297 385537 406975 437862 429874 427980 397878 402283 409827 385164 372981 388581
18491 388581 410490 432338 427287 433264 472755 489699 505537 521713 566534 574578 572886 575709
18479 575709 593080 596590 604071 632951 677799 720732 746999 780894 791904 798428 786518 791847
18467 791847 797592 771566 696559 638210 602953 574505 552780 550872 541786 532914 534892 532809 542017
18454 542017 554154 540985 515336 489775 474517 499261 538294 564089 526253 499810 477948
18443 477948 459810 420247 378670 318710 225850 138494 92865 111161 141967 164581 189077
18432A89077L8643Q6778M2386K0803L1665M018Q321J1890J5547j321q499J235
18420D40543K805j9733j4688L5583Q9150P5755L8283M8001M3182L4164M1071J1300
18408H25416N097K5876N071k4938j4608l4247l9464P858K5359J8065j0224L0925
18396H20186K4409J4831K9386M1646O8051J2213L640J4860O5492O4707M0775L1637
18384A231833K6544K4542P186O0637J43432K30181L51039M79983O62721Q58397
18374D076495Q98807K26073o74393o38190j64456L18039P78835J072288P45858
18365F639356j13985j39331N01977L65031o89048j112274p99268n84618l84132
18356C683708j11393J56724M17429N13309K44584l83002o37708l73966j33189
$$ plain form
18432 189077 227720 314498 356884 377687 409352 413370 421691 433581 449128 447807 439308 440543
18420 440543 443348 423615 408927 444510 533660 609415 647698 695699 738881 773045 814116 825416
18408 825416 830513 856389 861460 836522 821914 787667 748203 756061 781420 799485 789261 820186
18396 820186 844595 859426 888812 930458 998509 1010722 1014362 1029222 1094714 1159421 1200196 1231833
18384 1231833 1258377 1282919 1290105 1350742 1494174 1724355 2075394 2555377 3218098 4076495
18374 4076495 4975302 5201375 4526982 3888792 3724336 4042375 4821210 5893498 6639356
18365 6639356 6525371 6386040 6888017 7253048 6564000 5451726 4652458 4067840 3683708
18356 3683708 3572315 3729039 4146468 4659777 4904361 4521359 3883651 3509685 3376496
18347C376496l3990O1451J93206L15156N06555O58722O01458J92288k18975k84774
18337E367593j55294L5639K71408N93357R49888J281343J726807K288829K478867
18328A4838437J457657k56587o95944Q3157Q36087J421245K198442K118264R49721
18319B2950479J475206M336078P852193J0524410R437358J165745p783415o703830
18311D3254224q34041M213611M945260m45293l482880r77474J546315J501647
18303D9721369Q20082K359791M495349M334106K76798l542008l514436l931349
18295E1019702m016089k114938R60669M715505Q860026J3014746J6843904K0699081
18287A09982606K6806331L9698325O0995007P8522448P2724630M3099503j210148
$$ plain form
18347 3376496 3342506 3403957 3597163 3912319 4418874 5077596 5679054 5871342 5652367 5367593
18337 5367593 5212299 5247938 5519346 6112703 7062591 8343934 10070741 12359570 14838437
18328 14838437 16296094 16039507 15343563 15426720 16262807 17684052 19882494 22000758 22950479
18319 22950479 24425685 28761763 36613956 47138366 56575724 57741469 49958054 43254224
18311 43254224 42420183 46633794 51579054 51133761 47650881 46673407 48219722 49721369
18303 49721369 50541451 52901242 57396591 61730697 62007495 58465487 54951051 51019702
18295 51019702 47003613 44888675 45849344 50564849 59424875 72439621 89283525 109982606
18287 109982606 136788937 176487262 237482269 316004717 388729347 431828850 430618702
18280D30618702m3876184o5976869o4023667n4626190m7731351l8607129k8070608
18273H7706704j9160713j2736810q584276o085934m545761l274217j937118n52855
18265C0829020Q29615K366246L690903M726569O025137P230339O398417L508808
18257F5605054J197492j556123o436137r016086p836512n497508k700194j40799
18249C3619187R13107J100795K528244M273977M316264R64931m455864p420596
18241C5840045o719769m685505l694513l438003k726806j699286p79473O1359
18233A2158049J023964J998699K755650L228420K941976O36210k677127l718052
18225A8347789k973567k421880k003477j363560p05687j77040K36137N03719P97484
$$ plain form
18280 430618702 386742518 320765649 256741982 202115792 154384441 115777312 87706704
18273 87706704 68545991 55809181 47224905 41138971 36593210 33318993 31381875 30829020
18265 30829020 31658635 34024881 37715784 42442353 48467490 55697829 62096246 65605054
18257 65605054 66802546 65246423 58810286 49794200 41957688 36460180 33759986 33619187
18249 33619187 34532294 35633089 38161333 42435310 46751574 47716505 43260641 35840045
18241 35840045 29120276 24434771 20740258 17302255 14575449 12876163 12096690 12158049
18233 12158049 13182013 15180712 17936362 21164782 24106758 24742968 22065841 18347789
18225 18347789 15374222 12952342 10948865 9585305 8879618 8702578 8938715 9442434 10239918
18216A0239918J171242J122144M64968R8625J36218o7709k07009j501K30437L71360
18206A3558693R82119J788121K016111J061671n53135j170415q33483n81639n36460
18197A5731583q65509k003909k504237j847780j298381j063761p06629l75975
18189E065402j88082o9693p7358r5411j7310m1064j23753q1516O2309K02990K98140
18178D934654M21534M99988M47811K02109j04262k1830K50352K81076L2555Q8021
18168G032008L15688K48420m23641j057633j072487q89053p19701n16213l18271
18159B599117k43154j83326r9717L8575J98419L41116M74796N22798M12367K3255
18149D084246m76369o23377n67150m59366l15811j61246r6819j05816j03343p7238
$$ plain form
18216 10239918 11411160 12533304 12998272 13096897 13233115 13165406 12958397 12956896 13187333 13558693
18206 13558693 14540812 16328933 18345044 19406715 18853580 17683165 16849682 16268043 15731583
18197 15731583 14866074 12862165 10357928 8510148 7211767 6148006 5441377 5065402
18189 5065402 4877320 4807627 4730269 4634858 4617548 4576484 4452731 4371215 4433524 4636514 4934654
18178 4934654 5356188 5856176 6303987 6506096 6401834 6380004 6630356 6911432 6943987 7032008
18168 7032008 7347696 7596116 7172475 6114842 5042355 4153302 3433601 2917388 2599117
18159 2599117 2355963 2172637 2072920 2111495 2309914 2651030 3125826 3648624 4060991 4084246
18149 4084246 3607877 2984500 2417350 1957984 1642173 1480927 1384108 1278292 1174949 1097711
18139A097711m9523J523q796j4400r427m1003n5711o411L5040O1197P6348M6122
18127A132670L2269j1858o2242j18844j58622j15270p1944k9399o9096p9458n6083
18116C92123m712K2293J677j091p97J4494j8620k6660L301K0627k4289j316R180
18103C86210j6901N737K6J5210q548k9106j4367p0466q7977o1863r367J3478L3208
18090A55274O2295M1401P764n821J210q442l3766k5626j262M221j172l136k1834
18077A71106o031r988K0741j421L304J5526n930j023J8151k2749j5483o932l2538
18064A26733J2439K4235o08j2800n885J3805Q465k5914Q096K9693j8404Q18O436
18051A67109P761Q211L109M8591k350j6460n691n939j4851j7296K5691J4926N376
$$ plain form
18139 1097711 1048188 1049711 1040915 1026515 1017088 976085 920374 913963 949003 1010200 1086548 1132670
18127 1132670 1164939 1153081 1090839 971995 813373 698103 626159 596760 527664 448206 392123
18116 392123 387411 409704 411381 410290 409493 423987 405367 378707 382008 402635 378346 377030 386210
18103 386210 369309 375046 375072 390282 381734 352628 338261 267795 179818 117955 108588 122066 155274
18090 155274 217569 258970 266734 260913 262123 253681 219915 194289 193027 197248 196076 192940 171106
18077 171106 165075 155087 175828 174407 177711 193237 187307 186284 204435 181686 166203 159271 126733
18064 126733 139172 163407 162799 149999 144114 157919 166384 140470 148566 178259 159855 160673 167109
18051 167109 174870 183081 186190 234781 232431 215971 210280 204341 189490 172194 197885 212811 218187
18038B18187P892K3202r878p799J6708K7610J4087k7151j4885j5403L343J7433
18026B53346n7459l5169o354P534q335l989K1249j3511L504k725j1005J0872K078
18013A60036j225r699J5199J0336k0766j0073l4308l97l958N494J6661L0429O39
18000A58368j1252j3315J0219P93L887K107K949n008k4938J2391l902k0866k7494
17987H3939j5228K790J5638q583M472R690m756k8871J9671r47J3608p810r723
17974G3890q200K450N749P519j9663j4977j8313j578J2288K2149J503j0624J7560
17961F9753q62J961j9699j7966J9292N896q250J5597L1221n993P407M175k4418
17948G8114o706L0594M199l102j7976j7612R844J6104J4144M186l711o919L106
$$ plain form
18038 218187 226079 249281 239403 231604 248312 275922 290009 262858 247973 232570 235913 253346
18026 253346 195887 160718 154364 161898 153563 149574 170823 157312 160816 158091 147086 157958 160036
18013 160036 158811 149112 164311 174647 153881 143808 109500 109103 105145 110639 127300 157729 158368
18000 158368 147116 133801 144020 144813 148700 150807 153756 148748 123810 136201 132299 111433 83939
17987 83939 68711 71501 87139 78556 83028 92718 87962 59091 78762 77815 91423 83613 73890
17974 73890 65690 68140 73889 81408 61745 46768 28455 26877 39165 61314 62817 52193 69753
17961 69753 68891 70852 51153 33187 52479 58375 50125 65722 96943 90950 98357 102532 78114
17948 78114 71408 102002 106201 103099 85123 67511 77355 93459 107603 111789 108078 101159 104265
17935A04265o164k2150r32j3652o874k5410r743j418K2017o626k1755l449J2594
17922B0703R079k1284j9406j5915m865p986O562J3979n406j3981O05j2978O850
17909d4043J4382J601O965O21R744L755J9355l091q779k6012j0397J8292k8693
17896d6300J0862K9169K5725J8572m74m147m495r814J1763J1626j0439K1038K8735
17883H1821r221j5928k8559J430j0310j2312l0183L620J3202J066K2687J5695
17871C3008P544q509j0567n125l2247l245r854K3945K2786J8048K3797k692j1711
17858D5178R595k262k0946J1856L857O889L3285R023p631J3200K9927M7323K6004
17845B05298O213R280J0496j3917L1452K95k581R154k8534n3977l1602M047R301
$$ plain form
17935 104265 98101 75951 75019 61367 54493 29083 19340 17922 39939 33313 11558 8109 20703
17922 20703 29782 8498 -10908 -26823 -31688 -39674 -33112 -19133 -24539 -38520 -37915 -50893 -44043
17909 -44043 -29661 -28060 -21095 -20474 -10730 -6975 12380 9289 510 -25502 -35899 -17607 -46300
17896 -46300 -35438 -6269 19456 38028 37554 33407 28912 19098 30861 42487 32048 53086 81821
17883 81821 72600 56672 28113 29543 19233 6921 -23262 -19642 -6440 -5374 17313 33008
17871 33008 40552 32043 21476 16351 -15896 -19141 -28995 -5050 17736 35784 59581 56889 45178
17858 45178 54773 52511 31565 43421 47278 54167 87452 96475 88844 102044 131971 179294 205298
17845 205298 211511 220791 231287 217370 248822 249117 246536 255690 227156 173179 141577 145624 154925
17832A54925n337k5890m510P393m092Q62M641l2254o912K3019K8610J2195L839
17819A56489j9958p872N482K4986O831o790N846P948K7172M4234L2681L6477L6843
17806C50369L2919N2063N6794M3617J9766L9680L9715M1542M8425L8708j5870
17795G47728J9963L7642j6155l6636n4482n5942m8311o1857j00461o9351p09R13
17783C62342r188J009j9679n588K0677r604m3237l8384m0019j6236o01K954J9716
17770B24162j7489J0608L1483J2608K8344N8542O3358J4190n089Q897o489k214
17758D20911R629p15j3571j6253L0150L2327K9584L4885N0284L3286J4986J8822
17746F44325L9695J4525k0717j5241k0202o1640l3956j6035j1768k2481j2759
$$ plain form
17832 154925 149588 123698 119188 126581 122489 123351 127992 95738 88826 111845 140455 152650 156489
17819 156489 136531 128659 134141 159127 165958 159168 165014 172962 200134 244368 277049 313526 350369
17806 350369 383288 435351 492145 535762 555528 595208 634923 676465 724890 763598 747728
17795 747728 767691 805333 789178 752542 698060 642118 593807 531950 431489 362138 361429 362342
17783 362342 353154 354163 334484 328896 349573 339969 296732 258348 218329 202093 201492 204446 224162
17770 224162 206673 217281 248764 261372 289716 348258 411616 425806 420717 429614 423125 420911
17758 420911 430540 429825 416254 400001 430151 462478 492062 526947 577231 610517 625503 644325
17746 644325 684020 698545 677828 662587 642385 580745 546789 530754 518986 496505 483746
17735D83746l8835o7225k7510l2913k4200R26K6556K1839L9970M1801K0850R572
17723D54577l2360l0480j5784k7867l2554l7530l1476r532l522K0821j4629J7505
17711B57169K936O983Q321q483n495K4158L0120J5258l1478j0182J4507k8966
17699B74848j2757j4574j2380J7366L2782K5468K5982K0848j3475J5436J8806
17688C78350M6301j2846j221m1901k5327J930r330m8677j8566Q040j5550Q940
17676B70143O776j1099n35r989L1906M2062N015L635j9670l4483n9861j8999J4323
17663B19224J898k4799k2815m2920l1586j5291J2822J2778J1243P075J2830J5699
17651A56158j7105q063K3004J2628J1772j6241j9427k7424k0109j2155J1170K7179
$$ plain form
17735 483746 444911 377686 350176 317263 293063 293989 320545 342384 382354 424155 445005 454577
17723 454577 422217 391737 375953 348086 315532 278002 246526 236994 233472 254293 239664 257169
17711 257169 260105 267088 275409 266926 261431 285589 315709 330967 299489 289307 303814 274848
17699 274848 262091 247517 235137 252503 285285 310753 336735 357583 344108 359544 378350
17688 378350 424651 411805 410584 368683 343356 345286 335956 287279 268713 276753 261203 270143
17676 270143 276919 265820 265285 255296 287202 329264 334279 337914 318244 283761 223900 204901 219224
17663 219224 221122 196323 173508 130588 99002 83711 96533 109311 120554 127629 140459 156158
17651 156158 139053 130990 153994 166622 178394 162153 142726 115302 95193 83038 94208 121387
17639A21387P969j0277k1676J0647N555K4344l7444l0449O894L885j8186l1764
17627C0885K8994L5189J5659q323j0029j7860j1470J4853j1532m938K2767k1460
17615F2735J7535J9288j8034l1451j3004p93Q875j5073j1136J4973j106J0531
17603D3340K0162O673J2769q828j756J3576j0169P399K9604m356k2159J2111K6234
17590A24600k8296k9892J2943K0559K1369l647k9135P962k5047k8634J4516J4815
17578G2113P648k1995j3299o176M7821P767j4358M70P362J4803o084q322J2832
17565A00582O386R703K7656J046J2014K7153j0629l2579L969J1771j177K3237
17553A79132k1609j1369P061l183m620J0367N533J7517J604J149N528k934p697
$$ plain form
17639 121387 129356 119079 97403 108050 113605 137949 100505 70056 76950 80835 62649 30885
17627 30885 59879 95068 110727 102404 92375 74515 63045 77898 66366 61428 84195 62735
17615 62735 80270 99558 81524 50073 37069 36276 45151 30078 18942 33915 32809 43340
17603 43340 63502 70175 82944 74116 72360 85936 75767 83166 112770 108414 86255 98366 124600
17590 124600 96304 66412 79355 99914 121283 117636 88501 96463 71416 42782 57298 72113
17578 72113 79761 57766 44467 38291 86112 93879 79521 79991 87353 102156 96072 87750 100582
17565 100582 106968 116671 144327 145373 157387 184540 173911 141332 145301 157072 155895 179132
17553 179132 157523 146154 153215 150032 145412 155779 161312 178829 180433 181582 187110 184176 176479
17540A76479M0l20n94K5008n820n698k6698j2956J1288J1522o556m920j4552K9279
17526A75502J1069k2496L676J4107K5483J3623k460k2004L260N4214O367l2002
17514B28339l8598r787r14p289M699R702J4799J8705K9222r551l9591k8004O889
17501A78621K2116K1000K92j3069J0940j066o161k3568l5909N923R470L471p953
17488A64107J5049l93j501k4002j7881o303J8864K80O702K3183O158k524J426
17475A83165p274K735q9k1133j7411O467O462J0363J5862k6137k2375k0879m848
17462A04908L6029K959n499l1401M598K836M1194L8151o235l0108m5542j0599
17450A01291L0755K6167M927j8981j0983P330P917k7292q656j6663O956n022j751
$$ plain form
17540 176479 176519 176199 175605 200613 194793 189095 162397 149441 160729 172251 165695 160775 146223 175502
17526 175502 186571 164075 167751 181858 207341 220964 218504 196500 199760 253974 260341 228339
17514 228339 189741 179954 179040 171751 176450 186152 200951 219656 248878 239327 199736 171732 178621
17501 178621 200737 221737 222029 208960 219900 218834 212673 189105 153196 159119 168589 172060 164107
17488 164107 179156 178763 177262 153260 135379 129076 147940 148220 154922 178105 184263 181739 183165
17475 183165 175891 178626 178537 157404 139993 146460 152922 163285 179147 153010 130635 109756 104908
17462 104908 140937 143896 138397 106996 111594 114430 155624 193775 187540 157432 111890 101291
17450 101291 132046 158213 163140 144159 133176 140506 148423 121131 112475 95812 102768 97746 95995
17437I5995p922K8787N383j9162J5859k0203l4461J2958J4153m821K5747K729
17425A15042k518j9391n218n44N446J1749k946m101K1709k4747m7401n713Q115
17412D9482O356K174J3729j216j9567K065K7802l167J358j789l1941j5914J2626
17399D1998q920p13J1533J0210q771J0524j6760j8472k9054M942k3156N613p528
17386b8554L1926K1702j024j1723J6207o713O505j3647j8295M973J0065O127j3877
17373C672m637o923J9261J1127j3769j4474j3273j5139J5325M615k566J4998J0498
17360H715k0953J7156K6761j9909k2754p873J0801L121L773R795k391p127k0951
17347b1836n280O71r887L7449P164j5187J431K7182J7656Q875q354l4160q404
$$ plain form
17437 95995 88073 116860 122243 103081 118940 98737 64276 77234 91387 86566 112313 115042
17425 115042 112524 93133 87915 87371 92817 104566 101620 97519 119228 94481 47080 41367 49482
17412 49482 55838 58012 71741 70525 50958 53023 80825 77658 79016 77227 45286 29372 41998
17399 41998 33078 32365 43898 54108 45337 55861 39101 20629 -8425 -3483 -26639 -21026 -28554
17386 -28554 3372 25074 24050 12327 28534 21821 28326 14679 -3616 1357 11422 17549 3672
17373 3672 -965 -7888 11373 22500 8731 -5743 -19016 -34155 -18830 -14215 -16781 -1783 8715
17360 8715 -12238 4918 31679 11770 -10984 -18857 -8056 -4935 -1162 8633 6242 -885 -21836
17347 -21836 -27116 -26445 -36332 1117 8281 -6906 -5475 21707 39363 48238 39884 5724 -2680
17334b680l137k6280k922p02K1172q968q323K1583R598O116k0187k9154K2589
17321b1295J3374k5251j173j1606l11M3217R337n2685j450J7714J556k5356J8005
17308c5924p903j9496J2244M1658K0931O542J0114j0594k0843m324L839k6084
17296b9840j1581M3503M102m8051j201K2617j4696p657J1431j3308k9223J6298
17284e7606K8328j758j196L246k011j6134J42k2037p14J9635J9579k842m884O778
17270c1474M356R259Q679p384L616j3285Q145K3013m531j3237k0564L083K0403
17257i921j2717j5439K0641K9231P922k3712k1661k8894m999j8398J3528K0246
17245d4173O432n284j4588j3241M698L0646J9346M863J4492k9355j8873M601K3279
$$ plain form
17334 -2680 -5817 -32097 -35019 -35721 -14549 -23517 -31840 -10257 -659 5457 -14730 -43884 -21295
17321 -21295 -7921 -33172 -34345 -45951 -46262 -3045 6292 -46393 -47843 -30129 -28573 -53929 -35924
17308 -35924 -43827 -63323 -51079 -9421 11510 18052 28166 17572 -3271 -7595 -3756 -29840
17296 -29840 -41421 2082 6184 -41867 -43068 -20451 -35147 -42804 -31373 -44681 -73904 -57606
17284 -57606 -29278 -31036 -32232 -28986 -30997 -47131 -46989 -69026 -69740 -50105 -30526 -33368 -38252 -31474
17270 -31474 -27118 -17859 -9180 -16564 -12948 -26233 -18088 4925 394 -12843 -33407 -30324 -9921
17257 -9921 -22638 -38077 -17436 11795 19717 -3995 -25656 -54550 -59549 -77947 -64419 -44173
17245 -44173 -37741 -43025 -57613 -70854 -66156 -35510 -16164 -11301 3191 -26164 -45037 -40436 -17157
17232a7157K030k3560j2014j5111O97K1573K4059J7123M515K6374m492k5587P59
17219g91M568r093J3140J0942j2319l110J4313r225k0247J6877J6327j3464J8798
17206B6716j8525k2705j3559K1442r861j660N256m012J3719J1797k1165j8265
17194c0822p1l296r266L2L9283M140K53n980R146k5900k2095L4923L3767q728
17180A5386O896j6605j7094j18q407K177M482R716J0878J949j7091q281j1844
17167b7956j3725r950K2032J967J1067k597K5714J366n012j9821n466n626r755
17154c7762j2449K6985K8087L90j1752j438p893j3403J9072J3701k1055p803j1259
17141c6579J5744L428Q224q972j0873j2366L086J6431K3934J5090j388k666j5981
$$ plain form
17232 -17157 -15127 -38687 -50701 -65812 -65115 -43542 -19483 -2360 2155 28529 24037 -1550 -791
17219 -791 3777 -5316 7824 18766 6447 3337 17650 8425 -11822 5055 21382 7918 26716
17206 26716 8191 -14514 -28073 -6631 -16492 -18152 -12896 -16908 -3189 8608 -12557 -30822
17194 -30822 -30893 -34189 -43455 -43423 -4140 0 253 -5727 3419 -22481 -44576 -9653 24114 15386
17180 15386 22282 5677 -11417 -11535 -19942 -17765 -13283 -3567 7311 9260 -7831 -16112 -27956
17167 -27956 -41681 -51631 -29599 -27632 -16565 -19162 6552 7918 2906 -16915 -22381 -28007 -37762
17154 -37762 -50211 -23226 4861 5251 -6501 -7939 -15832 -29235 -10163 3538 -17517 -25320 -36579
17141 -36579 -20835 -17407 -9183 -18155 -29028 -41394 -38308 -21877 2057 17147 15759 13093 -2888
17128b888o196k2584o03p561j0437j0697J1424j4136O263N649j7042R346j7912
17115g7374m250L1746L5456J1397r158k2934k7039k1723R551j683J2020j4778
17103g8769n666K3244K235J4355N778j2202K69j0426M224m553q774k116J3935
17090e8466K1067L8490K841j675j949q422r293K923m587j4516k1482k2494j658
17077g9221l717N053K8289Q48j6505M4580J5598j783m241l4090j9797j2212o649
17064h3847J0733J3403J6608m025J5481K554J8987L6134j9266k6912J5828j713
17052f035k87J2129L118J260j8235k5738J1709K4275j4233k1543j4176n2j1034
17039e8842j3306K5926K8131o943j1948J5543p050j0276l4970P510J1877p502
$$ plain form
17128 -2888 -9084 -31668 -32271 -39832 -50269 -60966 -49542 -63678 -57415 -51766 -68808 -59462 -77374
17115 -77374 -81624 -49878 -14422 -3025 -12183 -35117 -62156 -83879 -74328 -76011 -63991 -78769
17103 -78769 -84435 -61191 -58956 -44601 -38823 -51025 -50756 -61182 -56958 -61511 -70285 -72401 -58466
17090 -58466 -37399 1091 3932 2257 308 -8114 -17407 -14484 -19071 -33587 -55069 -77563 -79221
17077 -79221 -82938 -77885 -49596 -48748 -65253 -20673 -5075 -6858 -11099 -45189 -64986 -77198 -83847
17064 -83847 -73114 -59711 -43103 -47128 -31647 -29093 -10106 26028 6762 -20150 -4322 -6035
17052 -6035 -6322 5807 8925 10185 -8050 -33788 -22079 2196 -12037 -33580 -47756 -47808 -58842
17039 -58842 -72148 -46222 -18091 -25034 -36982 -21439 -28489 -38765 -73735 -66225 -54348 -61850
17027f1850k2498J98J0393J5198N311J4775k167o815j3478k2285l0562L0055N0462
17014c3263K6595q992j3199L1913j1980p212j8164r480J1456J8915J1037K3341
17002B0967m678k8264j4358J2481k050j7771k2248J5014O945J3185R922K853j700
16989i702l734k6081o841L1955j634q022l3166j2126l850j0247J8284J4348J7868
16976c2948P606k4779Q364L7312K9138m523m191k5713j8607p57Q858J2488l2707
16963d0459k4193J2089K9754K9744n091j5578p593r854P264K0517P86l2773P554
16950b7833j864r225j6377J5110p672Q879K6582K6103k5451j416K4550J7299o302
16937B2383O576m536j8678k0401j3102j465j2125K1561K1473j1478k7768N696
$$ plain form
17027 -61850 -84348 -84150 -73757 -58559 -53248 -38473 -40640 -47455 -60933 -83218 -113780 -83725 -33263
17014 -33263 -6668 -15660 -28859 3054 -8926 -16138 -34302 -43782 -32326 -13411 -2374 20967
17002 20967 16289 -11975 -26333 -13852 -15902 -33673 -55921 -40907 -33962 -20777 -10855 -8002 -9702
16989 -9702 -13436 -39517 -46358 -14403 -16037 -24059 -57225 -69351 -73201 -83448 -65164 -50816 -32948
16976 -32948 -25342 -50121 -41757 -4445 24693 20170 15979 -9734 -28341 -29098 -20240 -7752 -40459
16963 -40459 -64652 -52563 -22809 6935 1844 -13734 -21327 -31181 -23917 -3400 -2614 -35387 -27833
16950 -27833 -29697 -38922 -55299 -40189 -47861 -38982 -12400 13703 -11748 -13164 11386 28685 22383
16937 22383 28959 24423 5745 -14656 -27758 -29223 -41348 -19787 1686 -9792 -37560 -31864
16925c1864L1270o465j3447o167J0820k2058R842k462j4055J0829K3905J4036
16913D184L305j5213k9639K4911R007p149k0890p105L699m179K0232K3368L4189
16900C8720R538m788k2278l3363l9748J1610J7846O458k1099j689J6333L3909
16888A1449J0043k5738l1383K9066M412N743m013k2085J2071J5769J0254k2595
16876g007m6458k913j867K0918R905j0027R635J4724R061k9315k8502J0346J6174
16863c5326Q083k1948k9944L7681L1073O535j0296j6728o912o144j2677K711J7570
16850c6322M425k6494J5297J3228K4914j4395j0880j7603k2876P465Q717N165
16838d9359J5774j0042J1380L964j6762J0167j3477J2581J1792o650q970j7088
$$ plain form
16925 -31864 -594 -7059 -20506 -26673 -15853 -37911 -28069 -30531 -44586 -33757 -9852 4184
16913 4184 7489 -7724 -37363 -12452 -3445 -10594 -31484 -38589 -34890 -39069 -18837 4531 38720
16900 38720 48258 43470 21192 -12171 -51919 -40309 -22463 -16005 -37104 -38793 -22460 11449
16888 11449 21492 -4246 -35629 -6563 -2151 3592 -421 -22506 -10435 5334 15588 -7007
16876 -7007 -53465 -56378 -58245 -37327 -27422 -37449 -27814 -13090 -4029 -33344 -61846 -51500 -35326
16863 -35326 -27243 -49191 -79135 -41454 -10381 -3846 -14142 -30870 -37782 -43926 -56603 -53892 -36322
16850 -36322 -31897 -58391 -43094 -29866 -4952 -19347 -30227 -47830 -70706 -63241 -54524 -49359
16838 -49359 -33585 -43627 -32247 -28283 -45045 -34878 -48355 -35774 -23982 -30632 -39602 -56690
16826e6690K0011O343J3980m633k011L1998p983j8856k3770k8752L979j0893J0465
16813f6812J7619K8724N448k3970k786j6844O59O456n948P194K222K3430J5059
16800i549Q517q023q614q826l846j1175n528j7565j3165p012j067J8190K4052
16787d3611M92Q180j188j5120k0175L786J0802l50J158P200j173k654J0679j365
16773d3339K433o241K2207M077p44L3857k540k7775j5834K9200R390p935o472
16760i716j5255R641m473Q188J2260k1168k6282o246L0039J5141O185L39J0318
16747H971r449k9428j8865K5153K611o653R066o816L098J7016n5277k7202J3828
16734g3947K1907O421J540J5290K169k2425Q848O954l5356m099Q56J8286J7927
$$ plain form
16826 -56690 -36679 -30336 -16356 -20989 -23000 8998 1015 -17841 -41611 -70363 -66384 -77277 -66812
16813 -66812 -49193 -20469 -15021 -38991 -41777 -58621 -57962 -51506 -57454 -50260 -48038 -24608 -9549
16800 -9549 -1032 -9055 -17669 -26495 -30341 -41516 -47044 -64609 -77774 -84786 -85853 -67663 -43611
16787 -43611 -43119 -34939 -36127 -51247 -71422 -67636 -56834 -57184 -56026 -48826 -49999 -52653 -41974 -43339
16773 -43339 -40906 -47147 -24940 -20863 -21607 12250 9710 -18065 -33899 -4699 4691 -3244 -9716
16760 -9716 -24971 -15330 -19803 -11615 645 -20523 -46805 -53051 -23012 -7871 -1686 -1347 8971
16747 8971 -478 -29906 -48771 -23618 -21007 -27660 -18594 -25410 -22312 -5296 -60573 -87775 -73947
16734 -73947 -52040 -45619 -44079 -28789 -26620 -49045 -40197 -33243 -68599 -72698 -71842 -53556 -35629
16721c5629J0981j4459O743L1489k8747j1310K2314r373j7771M44J4451L09j6651
16708d7209j8312J1252J0444j0005o850l255N568l0o364J4869L2487M030j0846
16695b4221N17k7801J9092K2032K9444J5749r730p036p165K0019J0560l902k7987
16682I571k9444l9181j3339K3452K1390r642P983K5965l729r547M202R728K8525
16669B5934j3820m0365l139r187L378K3625M4j9143n485J8788O251P830J1297
16656F008N102J2240R56P406k647n2993l2474j133O811K7599J3499J5764k2809
16643a6671O754j4757j8007J2278K1042j0509k246j6245Q199R833k0984K6951
16631a4362Jl363l76J3046N112n001R61J2764j050n667L60O044j3791n389M550
$$ plain form
16721 -35629 -24648 -39107 -32364 -875 -29622 -40932 -18618 -27991 -45762 -45318 -30867 -30558 -47209
16708 -47209 -65521 -54269 -43825 -53830 -60680 -63935 -58367 -58397 -64761 -49892 -17405 -13375 -24221
16695 -24221 -23704 -51505 -32413 -10381 19063 34812 25082 18046 10881 30900 41460 37558 9571
16682 9571 -19873 -59054 -72393 -48941 -27551 -37193 -29210 -3245 -6974 -16521 -12319 -2591 25934
16669 25934 12114 -28251 -31390 -40577 -37199 -13574 -13530 -32673 -38158 -19370 -13119 -5289 6008
16656 6008 11110 23350 24306 31712 29065 -23928 -56402 -57535 -50724 -23125 -9626 6138 -16671
16643 -16671 -9917 -24674 -42681 -30403 -9361 -19870 -22116 -38361 -30162 -20329 -41313 -14362
16631 -14362 -14361 -17724 -18100 -5054 58 -4943 -3982 8782 7732 2065 2425 8469 -5322 -10711 -6161
16616f161o878J3361L715N242J0261k2241k1958J3446M984J1012l350k5514k5047
16603d9128j1516k3078J8231J4535J0568J7927o152K337K1201k1592l0265j7625
16591g4557j199K7442K0655J5521j4584R547L6385n286k9290k6832K370J7619
16579b2209J1529P689R432j3390n340M888O278q51q420k4331j9894k0877J0431
16566f5065K0691p578m081O646M7385K80M288j4225j4242O805n142j8881k0620
16553f3739J768J9346Q917k359j5731r679p930K7446J9587l671K738j1247j8759
16540e3313k2471j305J3264R481J0919J2714q155j3787K2974K1540K4824q259
16528H426J241n68k0406j2762J9427K3465r948l0763J5729K5942j7356j3211n886
$$ plain form
16616 -6161 -13039 322 4037 9279 19540 -2701 -24659 -11213 -6229 4783 1433 -24081 -49128
16603 -49128 -60644 -83722 -65491 -50956 -40388 -22461 -28613 -26276 -5075 -26667 -56932 -74557
16591 -74557 -75756 -48314 -27659 -12138 -26722 -17175 19210 13924 -15366 -42198 -39828 -22209
16579 -22209 -10680 -2991 6441 -6949 -12289 -7401 -1123 -1974 -10394 -34725 -54619 -75496 -65065
16566 -65065 -44374 -51952 -56033 -49387 -2002 -1722 2566 -11659 -25901 -19096 -24238 -43119 -63739
16553 -63739 -61971 -42625 -33708 -36067 -51798 -61477 -69407 -41961 -22374 -26045 -23307 -34554 -53313
16540 -53313 -75784 -77089 -63825 -54344 -43425 -30711 -38866 -52653 -29679 -8139 16685 8426
16528 8426 9667 9099 -11307 -24069 -4642 18823 8875 -21888 -6159 19783 2427 -10784 -16670
16515a6670l7221j0393J6944K1658O868j967K1301j8282j6290o747l1952K0247
16503e2504K8175K1203K0793o376q348r131k857l150N941J0851r337J4396L3176
16490D2832j5723l5829j6197J2922k0658K822K2117J7123k3075k0479M906J320
16478b7919o778q163Q709J7946K421J298j6055J1930j0732K166K551R280j1831
16465b5177j0188K0746J5201l404m4202n531L1016K0928k7234j2051L751K2128
16453a4017l0791R352J681L0889J4237k3126N289J0271j4558j4377q659j2204
16441d6013n427L019J5895q002J5231J0683k0638r89n344K1256J9542q33r542
16428a1162l4319r052k0843j0026K235j373R958K5837J7596J131j2748M862n668
$$ plain form
16515 -16670 -53891 -64284 -47340 -25682 -18814 -20781 520 -17762 -34052 -40799 -72751 -52504
16503 -52504 -24329 -3126 17667 11291 2943 -6188 -9045 -12195 -6254 4597 -4740 9656 42832
16490 42832 27109 -8720 -24917 -11995 -32653 -29831 -7714 9409 -13666 -34145 -29239 -27919
16478 -27919 -34697 -42860 -34151 -16205 -13784 -12486 -28541 -16611 -27343 -25177 -22626 -13346 -25177
16465 -25177 -35365 -14619 582 -2822 -47024 -52555 -21539 -611 -27845 -39896 -36145 -14017
16453 -14017 -44808 -35456 -33775 -2886 11351 -11775 -6486 3785 -10773 -25150 -33809 -46013
16441 -46013 -51440 -48421 -32526 -40528 -25297 -14614 -35252 -36241 -41585 -20329 -787 -1620 -11162
16428 -11162 -45481 -54533 -75376 -85402 -83167 -84540 -74582 -48745 -31149 -30018 -42766 -37904 -43572
16415d3572K979M226m9P972Q039q314R607M305m188J0130L6976O595j5474k0409
16401a177J0994P684R356n955m326l0676l0595k3212K1619K9349k612K323j2159
16388b9387j6955j405K084K2593J8779j2564p327l406J5946J2877k5401o176J805
16375b8537j5402m970J6253J343k4571j8854M9317N603l6436j7067K8056Q691
16363c6574m634n977r986K6186J578p859j908Q725J6131N38N785J0811o298M724
16349A242o84j7640k1598m708Q456J0531m244l200m271K0888j1725k4501J775
16336d9679J1609k5500j1178M5417L2313k551P767J7705j0267M365k0237k1800
16324b2036j9783j2164K1770n340j9422M788P526P435P793K128K1667J0972j1831
$$ plain form
16415 -43572 -40593 -36367 -36416 -28444 -20405 -28719 -19112 -14807 -18995 -8865 28111 34706 19232 -1177
16401 -1177 9817 17501 26857 20902 16576 -14100 -44695 -67907 -46288 -16939 -19551 -17228 -29387
16388 -29387 -46342 -47747 -45663 -23070 -4291 -16855 -24182 -27588 -11642 1235 -24166 -30342 -28537
16375 -28537 -43939 -48909 -32656 -31313 -55884 -74738 -25421 -19818 -56254 -73321 -45265 -36574
16363 -36574 -41208 -47185 -57171 -30985 -29407 -37266 -39174 -30449 -14318 -13780 -7995 2816 -3482 1242
16349 1242 558 -17082 -38680 -43388 -34932 -24401 -28645 -31845 -36116 -15228 -26953 -51454 -49679
16336 -49679 -38070 -63570 -74748 -29331 2982 431 8198 25903 15636 20001 -236 -22036
16324 -22036 -41819 -53983 -32213 -37553 -56975 -52187 -44661 -37226 -29433 -27305 -5638 5334 -6497
16311f497r529L297j3151R376Q657L857k2957j1447k048j037J5817K6008L205
16298C551j3046k7878k0015J2927J92k0960j656k901R720j249L0593J5615o776
16285b1883k770J5671J1287j8125j8165K1463L1179J1515m092k5990j4946N300
16273i556K2210J1440J4934m286j5634j2785J3721Q441l745q898j4871k8932k0391
16260d8352M40J9560Q222O774M644k1315K7020J4348P099k4502j7005j5972J762
16247c7277J4127k434Q041J2868J3226k1108l8552l2095k0066K7609K1271q2O183
16234d8289J1998L315M085K1167K095j5595J9468K7627n594l0384l803j8138k2138
16221e4186L4851K8861n888o463l5579k5223K1175J8926K5172K1263J0582k2883
$$ plain form
16311 -6497 -16026 -12729 -25880 -16504 -7847 -3990 -26947 -38394 -40442 -41479 -25662 346 3551
16298 3551 -9495 -37373 -57388 -44461 -44269 -65229 -66885 -69786 -60066 -61315 -30722 -15107 -21883
16285 -21883 -24653 -8982 2305 -15820 -33985 -12522 18657 30172 26080 90 -14856 -9556
16273 -9556 12654 24094 39028 34742 19108 6323 20044 28485 24740 15842 971 -27961 -48352
16260 -48352 -47912 -28352 -20130 -13356 -8712 -30027 -3007 11341 18440 -6062 -23067 -39039 -37277
16247 -37277 -23150 -25584 -17543 -4675 8551 -12557 -51109 -83204 -103270 -75661 -54390 -54472 -48289
16234 -48289 -36291 -32976 -28891 -7724 -5629 -21224 -1756 25871 20277 -10107 -13910 -32048 -54186
16221 -54186 -19335 9526 3638 -2825 -38404 -63627 -42452 -23526 1646 22909 33491 10608
16209A0608r726j3326l4148l439J6920K0154j7021K5650K3996J421j2522j1521
16197b954j968M001M466j5413k9892k109J478Q697k747l830K0132P32n689Q370
16183a6726Q510j4944J567R439k0655K8880K8819L291j3728q538L197J0180p754
16170A1538l1746o345J8945J7680j523k1385N105K6924J964q5q899k1015p343
16157a6185K8896m96k7r749L658j5638j5398J8630q735o717j8015Q530J5028J6720
16143E02k714k0571j433j0214O337r889J0379J433k1544j008K070l1199o465K2543
16129f1773J6484k0780j1712K6078L3147P540j0062r124O361o330J3119J4662
16117b390K5533j927l1058j3594k372J989J4220J8756l603K158k7343j4985j5214
$$ plain form
16209 10608 882 -12444 -46592 -50031 -33111 -12957 -29978 -4328 19668 21089 8567 -2954
16197 -2954 -4922 -921 3545 -11868 -41760 -43869 -42391 -33694 -36441 -40271 -20139 -19407 -25096 -16726
16183 -16726 -8216 -23160 -21593 -12154 -32809 -3929 24890 28181 14453 5915 9112 19292 11538
16170 11538 -20208 -26553 -7608 10072 8549 -12836 -7731 19193 21157 21072 12173 -8842 -16185
16157 -16185 12711 12215 12188 2439 6097 -9541 -24939 -6309 -15044 -21761 -39776 -31246 -16218 502
16143 502 -2212 -22783 -24216 -34430 -28093 -37982 -27603 -26170 -47714 -48722 -46652 -77851 -84316 -61773
16129 -61773 -45289 -66069 -77781 -51703 -18556 -11016 -21078 -30202 -23841 -30171 -17052 -2390
16117 -2390 23143 21216 -9842 -23436 -25808 -23819 -9599 9157 5554 7712 -19631 -34616 -49830
16104d9830J765K7639L7115j9704k1207q570J8276J5135J0243J5548l4840j3295
16092b1725J4400O66q845q036p824K8490j7696R265j6363j8837K7336Q07l8672
16079e7034k1985K4657q73p005K7593L0699q603k6659J2598J1464j5319m807J4148
16066b1126N0O950j3901R586K70N900M3831J432l580R623k6306M436k024l6603
16052b1462N278L0597j8773j3598k2607q651K7522R093Q102L423Q487j278q744
16039b611j6673j7508j9985J8142J7415j032K1261k6115k4313L958K247L265n67
16026d2516p77L543o747J2031K878j1480j7541J8201K5389j2280r331J3595K482
16013b2553P611K810q069k1087j681L2876M005o783m81m193O412J3294j2766L616
$$ plain form
16104 -49830 -48065 -20426 16689 -3015 -24222 -32792 -14516 619 10862 26410 -8430 -21725
16092 -21725 -7325 -6659 -15504 -23540 -31364 -2874 -20570 -11305 -27668 -46505 -19169 -18362 -57034
16079 -57034 -79019 -54362 -55235 -62240 -34647 -3948 -12551 -39210 -26612 -15148 -30467 -35274 -21126
16066 -21126 -21076 -14126 -28027 -18441 -18171 -12271 31560 32992 29412 39035 12729 17165 15141 -21462
16052 -21462 -16184 14413 -4360 -17958 -40565 -49216 -21694 -12601 -4499 -1076 7411 6133 -2611
16039 -2611 -19284 -36792 -56777 -38635 -21220 -22252 -991 -27106 -51419 -47461 -45214 -41949 -42516
16026 -42516 -43293 -39750 -46497 -34466 -31588 -43068 -60609 -42408 -17019 -29299 -38630 -25035 -22553
16013 -22553 -14942 -12132 -20201 -41288 -42969 -10093 -6088 -12871 -13352 -17545 -11133 2161 -10605 -6989
15999f989m765J4214r240j2070N455K9181n313k5602o809M1577r297m2084k3235
15986e4977K3385K2050O108l713j2527R167J3621j888j1601k6098j9195n136p942
15973f8746J972p219K7098J8404j603l239k5710j001J4451K7426J2177n495l2874
15960d4359k9963L1668L5118L50J5516M32k2024j3446o894n070q42k3096k817
15947f5427M1736M0763K290J3847j9066k3293k2055j7045J0950L3450k177j1580
15935a7607K2542K8325J09j6833k3236j6133K7297k0606k214j903P949j1997L027
15922b1280l611k2833m912R581j3946j6323o99P876K7792K8478k68j2255o461
15909b8861j881j430P173R209p084q622K8406j145J1846l767p884k3814k9906
$$ plain form
15999 -6989 -11754 2460 -6780 -18850 -13395 15786 10473 -15129 -21938 19639 10342 -31742 -54977
15986 -54977 -31592 -9542 -3434 -7147 -19674 -10507 3114 1226 -10375 -36473 -55668 -60804 -68746
15973 -68746 -66774 -73993 -46895 -28491 -30094 -33333 -59043 -60044 -45593 -18167 -5990 -11485 -44359
15960 -44359 -74322 -42654 -7536 -7186 8330 8762 -13262 -26708 -33602 -38672 -39514 -62610 -65427
15947 -65427 -23691 17072 19362 33209 14143 -9150 -31205 -48250 -37300 -3850 -6027 -17607
15935 -17607 4935 33260 33369 16536 -6700 -22833 4464 -16142 -18356 -20259 -12310 -24307 -21280
15922 -21280 -24891 -47724 -52636 -43055 -57001 -73324 -74023 -66147 -38355 -9877 -10145 -22400 -28861
15909 -28861 -30742 -32172 -24999 -15790 -22874 -31496 -3090 -4235 7611 3844 -4040 -27854 -57760
15896e7760L041p569j4255L775J9850J1028P132J2258k3139K9947K0878l9111
15884c3925l7105L587J4491L3827j4462N25L9611K1057j9642k1320m5024j4350
15872g2730r682L5412L4460j1216Q840R996k6361o707r813K097K9391K2716p56
15859E647j3149k615o256o879k7192R440p317K4513O694j957p689l837P583j3953
15845c6967n459L4399K8560l5436j4904n470o47Q63J4902Q375J3224j1752P064
15832c248m729l276L650K210L4860K061k9856k6114Q321L1551l527j8446J9597
15819A3054J42k3514j8506k9604j2833R850K601J0135m57L6292j754l848P999
15806a0443o226Q142J8223L1414j04j270j670k2106k6782K3059j014k9783l6389
$$ plain form
15896 -57760 -54719 -62288 -76543 -72768 -52918 -41890 -34758 -22500 -45639 -15692 5186 -33925
15884 -33925 -71030 -67443 -52952 -19125 -33587 -33062 6549 27606 7964 -13356 -58380 -72730
15872 -72730 -82412 -47000 -12540 -23756 -14916 -4920 -31281 -37988 -47801 -45704 -16313 6403 5647
15859 5647 -7502 -10117 -16373 -23252 -50444 -41004 -48321 -23808 -17114 -19071 -26760 -30597 -23014 -36967
15845 -36967 -42426 -8027 20533 -14903 -29807 -35277 -35924 -35061 -20159 -11784 1440 -10312 -3248
15832 -3248 -7977 -11253 -7603 -5393 29467 31528 1672 -24442 -16121 15430 11903 -6543 13054
15819 13054 13196 -10318 -28824 -58428 -71261 -61411 -58810 -48675 -49132 -12840 -14594 -18442 -10443
15806 -10443 -16669 -8527 9696 41110 41006 39736 38066 15960 -10822 12237 11223 -18560 -54949
15793e4949l592K2070J5656M3112K4086r48l1557l1177J669n895k448L405m600
15780b5168Q120M951j0670J303K2418J8228n801R354o198k7129l897J3564k3604
15767b4529n827L864P957k421K124j288j5913J2129k406J1142m966o859J8681
15754h312k2689k929K4311J1537n324p956l4420L289j0509J0131J1085o28J3188
15741a9226p295L16J2986m376l8967M076N145l225N50R706K796P738J4808j0775
15727b5743O325j4763j5405J3258j1450J7659M815J7907j8065K811J1314Q261
15715c076L208Q434j2077O103J554j3771m79J3977N288K7378p535k6016j0463
15702g475m836n95j6680k3243K715O719J069p225K4195J362k6842Q964M222l026
$$ plain form
15793 -54949 -58541 -36471 -20815 22297 46383 45435 13878 -17299 -15630 -21525 -23973 -20568 -25168
15780 -25168 -17048 -12097 -22767 -21464 954 19182 13381 22735 16537 -10592 -14489 -925 -24529
15767 -24529 -30356 -26492 -18535 -20956 -18832 -20120 -36033 -23904 -26310 -15168 -20134 -26993 -8312
15754 -8312 -31001 -33930 -9619 1918 -3406 -11362 -45782 -42493 -53002 -42871 -31786 -32414 -19226
15741 -19226 -26521 -26205 -13219 -17595 -56562 -52486 -47341 -50566 -50016 -40310 -37514 -29776 -14968 -25743
15727 -25743 -19418 -34181 -49586 -36328 -47778 -30119 -25304 -7397 -25462 -22651 -11337 -3076
15715 -3076 132 8566 -3511 2592 4146 -9625 -10104 3873 9161 36539 29004 2988 -7475
15702 -7475 -12311 -12906 -29586 -52829 -50114 -43395 -42326 -49551 -25356 -23994 -50836 -41872 -37650 -40676
15688d0676n634J8246K497j3675p517j3190K2093J6408j353J613J8309n55r00
15675d334j6734N853K974J088j205k3328m9669q585K0972J8399P321L62K2124
15662b4762L6585k1093M997P533n074j453O039q791j8526o715j7226j2684J1022
15649e0148L0078j6231K1017l031J152q470j4049M59m179p913p719J4782K1170
15636b3082J1335q672O432K4127L100q829j3066J6604N547l523k0782j0117K2922
15623A996L0817O16l2939k3270R873q701k5826r33O653J0139K6825j2332l3038
15610e0120j603j0108J6183K0454o965J5164K3979p768m1640k0529J1448m593
15598e6098J1342j782J3920K1948N65K0893M976j9680n4800o450K2890M0350J0723
$$ plain form
15688 -40676 -46310 -28064 -25567 -39242 -46759 -59949 -37856 -21448 -22801 -21188 -2879 -3434 -4334
15675 -4334 -21068 -15215 -12241 -11153 -12358 -35686 -85355 -93940 -72968 -54569 -47248 -46886 -24762
15662 -24762 11823 -9270 -4273 3260 -1814 -3267 2772 -6019 -24545 -31260 -48486 -61170 -50148
15649 -50148 -20070 -36301 -15284 -18315 -17163 -25633 -39682 -39223 -43402 -51315 -59034 -44252 -23082
15636 -23082 -11747 -20419 -13987 10140 13240 4411 -8655 7949 13496 9973 -10809 -20926 1996
15623 1996 32813 33429 490 -22780 -12907 -21608 -47434 -48367 -41714 -31575 -4750 -17082 -50120
15610 -50120 -51723 -61831 -45648 -25194 -32159 -16995 6984 -784 -42424 -62953 -51505 -56098
15598 -56098 -44756 -46538 -32618 -10670 -10105 10788 15764 -3916 -58716 -65166 -42276 -1926 8797
15585H797m050r137P719J25m132j2334j2802o906J3528K8627J1359j5309o653
15572a168n375J9303k7111l1522J0672q840o225q097K0864M615m987p483k743
15559d8097j3358K1129q464k2775J9149J6350l1295j3141o177R09J8612J3523
15547e3635L226K2331J9175p291r417j9j693J4399J6889R655j0345k029p972j3409
15533b0135n722Q991Q697j1103j7638j3243K0034K9481J5701N107k7459n3003
15521f0292j4532J2524l544n487J5460k2589J4243M0848r331k7599m999J3980
15509e1318J9248L731K2681j4362j6453J842J5306J2761J8848J0288k2617O591
15497F546L4793J295q537k485k2702J5275j5357k4947J4184J0538k1850o2J8164
$$ plain form
15585 8797 4747 -4390 3329 3454 -678 -13012 -25814 -32720 -19192 9435 20794 5485 -1168
15572 -1168 -6543 12760 -14351 -45873 -35201 -44041 -50266 -58363 -37499 -32884 -37871 -45354 -48097
15559 -48097 -61455 -40326 -48790 -71565 -52416 -36066 -67361 -80502 -86679 -85770 -67158 -53635
15547 -53635 -50409 -28078 -8903 -16194 -25611 -25630 -27323 -12924 3965 13620 3275 1246 -6726 -20135
15533 -20135 -25857 -16866 -8169 -19272 -36910 -50153 -30119 -638 15063 20170 -7289 -60292
15521 -60292 -74824 -62300 -65844 -71331 -55871 -78460 -64217 -23369 -32700 -60299 -65298 -51318
15509 -51318 -32070 -28339 -5658 -20020 -36473 -34631 -19325 -6564 12284 22572 -45 6546
15497 6546 41339 42634 34097 31612 8910 24185 8828 -16119 -1935 8603 -13247 -13309 4855
15484D855J1922j5335o109j6428N910J3563j899k001K227Q290j257k0112j0497
15471b6871J375p129K4523L0511R454j1474j9423j8554R645Q567L647O018J2957
15458B3246N281r977j211J9425k7306r420o668m306j7811O663j1401J6981K1009
15445D505o697j5781p54J0058J3469K0688o3k2900l2413k4309l0517K1852K3495
15432c9367p966J16O661K343J9201L4050J8298j5669j2338l0264J316J2639q085
15419a9065k9420R587J5825j2180L591k084J0327K4503J2863j992j0849j6283
15407a5177n783n209K826j798J5133J0803j5417m642L1251J8466L044m489k5094
15394C914j6825J8558J0678r37k8448j0217l528K0468Q275l8754K574P879J226
$$ plain form
15484 4855 16777 1442 -4667 -21095 -15185 -1622 -3521 -5522 -3295 4995 3738 -16374 -26871
15471 -26871 -25496 -32625 -8102 22409 31863 20389 966 -17588 -7943 624 4271 10289 23246
15458 23246 28527 18550 17339 36764 9458 38 -6630 -10936 -28747 -22084 -33485 -16504 4505
15445 4505 -2192 -17973 -18727 -8669 4800 25488 25425 2525 -29888 -54197 -84714 -62862 -39367
15432 -39367 -47333 -47217 -40556 -38213 -19012 15038 33336 17667 5329 -24935 -23619 -10980 -19065
15419 -19065 -48485 -38898 -23073 -35253 -31662 -33746 -23419 1084 13947 11955 1106 -15177
15407 -15177 -20960 -26169 -23343 -25141 -10008 795 -14622 -19264 11987 30453 33497 29008 3914
15394 3914 -12911 5647 16325 15388 -13060 -23277 -26805 -6337 1938 -36816 -34242 -26363 -25137
15381b5137l695J1042l4405r704K1550K2492L5097N165j3696j6973k615n821R282
15368g418j605m0519Q0K5166N19M08J9820J3779k4317N706J4480P478k9380l095
15354a8898P065R237K9334L802j3759m635q49j7421l965q112N68J5154j8786J147
15340b0118K4020J4695m1705k4252M84N664K8055K0729L1047j3068j7221j4850
15328f520M743o465J1590J3376J7813k826k0880j7727j8342k974O217k641K2889
15315a747J452L322J402j832l277R527K0501J0331k7366j4151j3452J2998n636
15302g928J5156Q358k3260k6541J7142R961J1294J3937K288j1699j1867j2920
15290a6079r535j3869L3837L3735N581M33O572q625k3693J2024p120k3463j4442
$$ plain form
15381 -25137 -28832 -17790 -52195 -61899 -40349 -17857 17240 22405 8709 -8264 -10879 -16700 -7418
15368 -7418 -9023 -49542 -49462 -24296 -23777 -23369 -3549 10230 -14087 -8381 6099 13577 -15803 -18898
15354 -18898 -11833 -2596 26738 30540 16781 12146 11297 -6124 -10089 -18201 -17633 -2479 -21265 -20118
15340 -20118 3902 18597 -23108 -47360 -46876 -41212 -13157 7572 38619 25551 8330 -6520
15328 -6520 -1777 -8242 3348 16724 34537 31711 10831 -6896 -25238 -28212 -21995 -24636 -1747
15315 -1747 -295 3027 4429 2597 -680 8847 29348 39679 12313 -1838 -15290 -2292 -7928
15302 -7928 7228 15586 -7674 -34215 -17073 -7112 4182 18119 20407 8708 -3159 -16079
15290 -16079 -25614 -39483 -5646 28089 33670 34103 40675 32050 8357 20381 13261 -10202 -24644
15277b4644o363K7111R127k8866R703O746k2673j3697P363J7916K8932J5213q483
15264A7385J0139O695O93k2880j7959k9584K787K5036k8155k5911L39R513K8802
15251b3100M5043k653j1977m1726n746J9916j5328r999P582P739J1759j5076k5779
15238e9345O013L8717J715p618j199P230P250Q021j2220m274J6431J7715J3671
15225C2107l8424n119K0880N613j632l5587P385K3303l7972j2788K0422j376L0912
15212G724J4409k3739l0762j4242M251j2445L1659K1256N882j1196K450O488L357
15199E092J5804J0787r992J0725J6800J486r57J8718k5019k4555M28P593L893
15186C0803j058r58l3004j5489J7280j2846J473J7607k8443k5409J9389K8074
$$ plain form
15277 -24644 -31007 -3896 5231 -23635 -13932 -7186 -29859 -43556 -36193 -18277 10655 25868 17385
15264 17385 27524 34219 34912 12032 -5927 -35511 -32724 -7688 -35843 -61754 -61415 -51902 -23100
15251 -23100 21943 19290 7313 -34413 -40159 -20243 -35571 -45570 -37988 -30249 -18490 -33566 -59345
15238 -59345 -53332 -14615 -12900 -20518 -21717 -14487 -7237 784 -11436 -15710 721 18436 32107
15225 32107 -6317 -11436 9444 15057 13425 -22162 -14777 8526 -29446 -42234 -21812 -23188 7724
15212 7724 22133 -1606 -32368 -46610 -42359 -54804 -23145 -1889 3993 -7203 -4753 1735 5092
15199 5092 20896 31683 21691 32416 49216 50702 49745 68463 43444 18889 19317 26910 30803
15186 30803 29745 28787 -4217 -19706 -2426 -15272 -13799 3808 -24635 -50044 -30655 -2581
15174b581J7281R971j0194q264o743j3418Q135J0130J5302J6717r365n809K2314
15161D3476M0160j0901j7729J5321m3853j0006j8440M955L6006Q236K849M933
15149E5007P823l718J6122K7592L0585J748R284N9213K4829J9892M2621L8865
15137C29863O0616O3516N7100L5223O9509P2609K2487L7077L6757o786m6109o3102
15125F68760n8597p5822m1983p3014n4745j3958k4864l9006o6017j4061l60n2003
15113A54330m9245P650j9753j0534k5856q927J5451K5553q805J9408J8255j8395
15101I9132j6488k9159k5158N968J2333J0330K73j6065m3407j0476K8155Q185
15089B3623j902q425O373M2490K595p156j1497l0616J7001J6598j6204P768N649
$$ plain form
15174 -2581 14700 24671 14477 6213 -530 -13948 -5813 4317 19619 36336 26971 21162 43476
15161 43476 83636 72735 55006 70327 26474 16468 -1972 2983 38989 47225 50074 55007
15149 55007 62830 59112 75234 102826 133411 135159 144443 203656 228485 248377 290998 329863
15137 329863 390479 453995 511095 546318 615827 688436 710923 748000 784757 777971 731862 668760
15125 668760 610163 534341 492358 419344 364599 350641 325777 286771 220754 206693 206333 154330
15113 154330 105085 112735 92982 82448 56592 47665 63116 88669 79864 99272 117527 99132
15101 99132 82644 53485 28327 34295 46628 56958 57231 41166 -2241 -12717 15438 23623
15089 23623 21721 13296 19669 62159 64754 57598 46101 15485 32486 49084 32880 40648 46297
15076D6297K590R45M695k004m829o774M360k1756m302K1357M762q33j7265q496
15062A8747n533j0015n53r590k7373L8517J8836r129K0910j4959l2927r457J0914
15049a1612J4297J8342j752J2226J6572R778Qk9016k611R779Q60q980l154J3101
15035C7838k1430j0871J5763j4901l5512o50J0056J1387M990L8109K2254K596
15023E9629l829J2707p786J454j3198j6594j7161K1656r173k434L7634k2441l8226
15010B238k0950M217J6552q094J5670J6430l147K765o436j0479j4431k0952l735
14997c0352J4844J4124J0706J1064P395O435r660k1735j3260n480K3884L5928
14985D3893j1710j0808m708k781j5537j3207O47j1850N076J9423L3601N962j0037
$$ plain form
15076 46297 48887 49832 54527 52523 47694 40920 45280 23524 19222 40579 45341 44508 27243 18747
15062 18747 13214 3199 2646 -6944 -34317 4200 23036 13907 34817 19858 -13069 -22526 -11612
15049 -11612 2685 21027 19275 31501 48073 57851 57859 28843 26232 36011 36871 27891 24737 37838
15035 37838 16408 5537 21300 6399 -29113 -29763 -19707 -8320 -3330 34779 57033 59629
15023 59629 55800 68507 60721 62175 48977 32383 15222 36878 27705 25271 62905 40464 2238
15010 2238 -18712 -14495 2057 -6037 9633 26063 22916 25681 19245 8766 -5665 -26617 -30352
14997 -30352 -15508 -1384 9322 20386 27781 34216 24556 2821 -10439 -15919 7965 43893
14985 43893 32183 21375 16667 13886 -1651 -14858 -14211 -26061 -20985 -1562 32039 38001 27964
14972B7964K3821J7730j0519k4243l488N878l409p956N51k3700o077k64K718J8475
14958A7481r457k5888j892J0072M8705L9413N285j3612k8132q259K7003J8856
14946G9575O977j7468j4027J3296r994O33k027J773K7759J238o929j210n030J6962
14932I1528p336K197J0744P232o444Q419J4548K7037j00L178J5k1334k4955N530
14918A10259j9400j8400k0814k1902J4586J9717L3726q174n3464o209J4413J6931
14906F1269J7781r492j7633j1200p596J8884j178q663j2173j1711j1332j51J4260
14893B1065J4229K8466J016j9398O811R685k60j8201o788k408K0433P383j5977
14880D6056J7897L3134K4301O505l7632l6912j0020K5483k0679M887K9504j0210
$$ plain form
14972 27964 51785 69515 58996 34753 31265 37143 33734 25778 26329 2629 -3448 -3712 -994 17481
14958 17481 8024 -17864 -19756 -9684 39021 78434 83719 70107 41975 33716 60719 79575
14946 79575 86552 69084 55057 68353 58359 58992 56965 58738 86497 87735 80806 79596 74566 91528
14932 91528 84192 86389 97133 104365 97921 106340 120888 147925 147825 151003 151018 129684 104729 110259
14918 110259 90859 72459 51645 29743 44329 64046 97772 89598 36134 29925 44338 61269
14906 61269 79050 69558 51925 40725 33129 52013 50835 42172 29999 18288 6956 6805 21065
14893 21065 35294 63760 64776 45378 52189 61874 61614 43413 36625 34217 54650 62033 46056
14880 46056 63953 97087 121388 127893 90261 53349 43329 68812 48133 53020 82524 72314
14868G2314j155J7567J7094M088l2078J5837j2546j7282J7753K2274J0498K7462
14856A41826O307j7987k312J521N727P053q535m3095l0716j725L4088o060q723
14843G7369J0648J5101o805j0601O063J7264j244j5010K6601N909k2998P278J0499
14830A20074q869m788j2970k4094l957J456o584p765Q309l7878k2070N921K2187
14817B8972J671K967P796J8923K5829K8043K6109J513R809K9866L2716r985Q87
14804B05116L4882O5805O4202O6344Q9630N9335j7173k3401l8984l3765j7435
14793D54556J602M701J0745k7829Q736L5310k2192m1314n29j1516L031K3549J3515
14780D52365l3542j2830O514M857K3287j0076j6267k2358j1066J8003J7959J4491
$$ plain form
14868 72314 71159 88726 105820 109908 77830 93667 81121 63839 81592 103866 114364 141826
14856 141826 148133 130146 127834 129355 135082 142135 133600 90505 59789 58064 92152 86092 77369
14843 77369 88017 103118 96313 85712 91775 109039 107795 92785 119386 125295 102297 109575 120074
14830 120074 111205 106417 93447 69353 65396 66852 60268 52503 60812 22934 864 6785 28972
14817 28972 30643 33610 41406 60329 86158 114201 140310 141823 151632 181498 214214 204229 205116
14804 205116 239998 305803 370005 436349 525979 585314 568141 544740 505756 471991 454556
14793 454556 456158 460859 471604 443775 452511 487821 465629 424315 423786 412270 415301 438850 452365
14780 452365 418823 405993 412507 417364 440651 430575 414308 391950 380884 398887 416846 431337
14768D31337q34K621J8797K6010J6579J784P745L0572K6458J2292Q671p481J3838
14755E88389j2353o077K0096M3453N8130J2769K580J2940J9816M7719J4930M177
14743H06569J3277O667K0912M5865N3777K5527p216L5712O9998N5300j3345m842
14731A108201N8286N7302N4642O0189M1092O5823M1752K9050M6500M5263M3882
14720A651982O0287N5157R0994R2480M6391Q4582J08066J15294Q2604Q0361J06720
14709B574918P9101O9173Q4990J31994J52068J40536J45409K18248K41287K26189
14699D063913K40448K45390L25764L45168L76917M21600M55263N43206N86086
14690G603755O95152P92097Q58488R88758J159925J402956J647411J913982K198047
$$ plain form
14768 431337 430503 433124 451921 477931 494510 496294 504039 534611 561069 573361 582032 574551 588389
14755 588389 576036 569959 590055 633508 691638 704407 706987 719927 739743 787462 802392 806569
14743 806569 819846 826513 847425 893290 947067 972594 965378 1001090 1071088 1126388 1113043 1108201
14731 1108201 1166487 1223789 1278431 1338620 1379712 1445535 1487287 1516337 1562837 1608100 1651982
14720 1651982 1712269 1767426 1858420 1950900 1997291 2081873 2189939 2305233 2387837 2468198 2574918
14709 2574918 2654019 2723192 2808182 2940176 3092244 3232780 3378189 3596437 3837724 4063913
14699 4063913 4304361 4549751 4875515 5220683 5597600 6019200 6474463 7017669 7603755
14690 7603755 8298907 9091004 9949492 10938250 12098175 13501131 15148542 17062524 19260571
14681A9260571K566332K939931L466018M115839M942674O040288P541710R485581
14673F0358944J1788995J4332090J6757261J8301979J8279328J6106362J1801966
14666A67726925N848248q49896p106762j1935848j4986715j6290414j6193016
14659A06212522j5072078j3379255j1491727r606867p851905o442763n332255
14652C7035672m480274l803475l279303k828245k422586k127005j878067j645362
14644A4571355j442095j264119j100777r35409q39741p41886o16373n49181m81757
14635F600017m78165l96482l53568l16635k89982k69043k43863k40838k23922
14626C787519k05492j75053j54023j35975j46013j61179j30357j01434j05934
$$ plain form
14681 19260571 21826903 24766834 28232852 32348691 37291365 43331653 50873363 60358944
14673 60358944 72147939 86480029 103237290 121539269 139818597 155924959 167726925
14666 167726925 173575173 172725277 165618515 153682667 138695952 122405538 106212522
14659 106212522 91140444 77761189 66269462 56662595 48810690 42367927 37035672
14652 37035672 32555398 28751923 25472620 22644375 20221789 18094784 16216717 14571355
14644 14571355 13129260 11865141 10764364 9828955 8989214 8247328 7630955 7081774 6600017
14635 6600017 6121852 5725370 5371802 5055167 4765185 4496142 4252279 4011441 3787519
14626 3787519 3582027 3406974 3252951 3116976 2970963 2809784 2679427 2577993 2472059
14617B472059j01709o4007o7239j08210j09345m7045q3864p1164l6780o5933m6419
14606A670344l0956n9204o1380j1513J174k4641m9552m0822k4595n1658o4617
14595A252580m0407l0090l9679n3158n2463m0573l1877n0376r233j3424m4235
14584H47065l7758p717j3549k4784k7320l0410K039j41k3597j4518n357k054k8481
14571F33418j4491l4487J560L580p771j3783r448n351l4135l7084N364M7l2647
14558D54772k5485j6958n96M535J9068N959j1665o716l2250l3658J706K814r665
14545C51861r186K345j1750J0590o469l6975p580L4329M736K037K5579J2288k2101
14532C49704n851q941L1061J1128j74J030j2210r315j6960j338M533j8330k0764
$$ plain form
14617 2472059 2370350 2306343 2239104 2130894 2021549 1974504 1890640 1819476 1782696 1716763 1670344
14606 1670344 1639388 1580184 1518804 1507291 1508465 1483824 1434272 1393450 1368855 1317197 1252580
14595 1252580 1212173 1182083 1142404 1089246 1036783 996210 964333 913957 904724 891300 847065
14584 847065 809307 801590 788041 763257 735937 705527 707566 707425 683828 669310 663953 661899 633418
14571 633418 618927 584440 586000 589580 581809 568026 558578 553227 519092 482008 487372 487419 454772
14558 454772 429287 412329 411733 416268 435336 441295 429630 422914 390664 357006 358712 361526 351861
14545 351861 342675 345020 333270 343860 337391 300416 292836 327165 331901 333938 359517 371805 349704
14532 349704 343853 334912 365973 377101 376927 377957 365747 356432 339472 338134 342667 324337 303573
14519C03573K676L4118O899k1439j246J8685K2906k833l390k1028P40n206l4559
14506B99896l3062j2710k3538l1598N568J0645l9180k1666j4310M865L211j7826
14494A30295R538O244o258Q531J678O047j5176k4298P190J5383J0972l6445k4276
14481H9425N456j2868k46j0861m894M363r790Q511L959L687R397K813j3182K2067
14467I7837N2259P257k4430j2752q323j3831j3431j0081l823J1688K8323J2494
14455A23187J959k1226j289m080K2230j5015l2545l328J0382L0605k079m3171
14443F5630Q261M680j622P954r723L968j4563M898L7205J7356j8464Q823j708
14430A12695j8284p813j142K607L9262k2905k4353J1633N008M885J3258l106j3053
$$ plain form
14519 303573 306249 340367 347266 325827 324581 343266 366172 363339 359949 338921 339661 334455 299896
14506 299896 266834 254124 230586 198988 204556 215201 176021 154355 140045 144910 148121 130295
14494 130295 139833 146077 139819 148350 150028 156075 140899 116601 123791 139174 150146 113701 89425
14481 89425 94881 82013 81767 70906 66012 70375 60585 69096 73055 76742 86139 88952 75770 97837
14467 97837 150096 157353 132923 120171 111848 98017 84586 74505 70682 82370 110693 123187
14455 123187 125146 103920 102631 98551 120781 105766 73221 69893 80275 110880 108801 65630
14443 65630 73891 78571 76949 84903 75180 79148 64585 69483 106688 124044 105580 114403 112695
14430 112695 94411 86598 85456 88063 127325 104420 80067 91700 96708 101593 114851 111745 98692
14417I8692j0373k8857j9342L972N333J8098K0466L837R493l628N878j1031o807
14404H5731L629J1871l001N697K7959Q733l8775l8094k8282k6142K3488J0872
14392D3686L2746L441J3622k1861J0310j3244K211N145j0391k349k012K0964j1751
14379G0517k8885N434J9271k5326j3380j1887j6036K3241O597J386J4370L5034
14367H0336j0004k0890k8901l8116Q64K3999L0423p739P054L1343p392k3662l153
14354C4162L6035K0155j7109k2904O331J6891j4336k2334K776L975J2566m325
14342E1883O145J2476k4671j4802K2663p959l3338L011R46p388j477r603q46J979
14328i81P209K0392J2385j5661l5018o132p773k501L5740o539j6210m4k454L2598
$$ plain form
14417 98692 88319 59462 40120 44092 49425 67523 87989 91826 101319 97691 103569 92538 85731
14404 85731 89360 101231 98230 103927 131886 140619 101844 63750 35468 9326 32814 43686
14392 43686 76432 79873 93495 71634 81944 68700 70911 76056 65665 63316 61304 82268 70517
14379 70517 41632 47066 66337 41011 27631 15744 -292 22949 29546 30932 45302 80336
14367 80336 70332 49442 20541 -17575 -16711 7288 37711 29972 37026 68369 60977 37315 34162
14354 34162 70197 90352 73243 50339 56670 73561 59225 36891 39667 43642 56208 51883
14342 51883 58028 70504 45833 31031 53694 45735 12397 15408 16354 8966 7489 -2114 -2960 -981
14328 -981 6228 26620 39005 23344 -11674 -17806 -25579 -28080 7660 1121 -15089 -15133 -17587 15011
14314A5011J3991O810n886J2107j2079J1751k260K9085q097m6312j1576J0627
14302A3172J1173L2026M045l5124m1107M5704L1182m1104j5803P465j1612q070
14290h053K342J9812L466j0703K274j4811r282j0662K0522J1960K8863L4418J2602
14277H2748k1780j5863Q208P305k4357l2184o462J8595j6361K4090J4532J4825
14265E3296r142k0968L7246N709m7374K200P578j5098j5290J3400J0134M075k4187
14252A579j0381J5541j2248J0961J5539k777K2419K456R520R985j5417q426J777
14239D0528k0531k210q562k8897K6138q988N692j4878O296L1968R200K743j5886
14226B2613P36K3626Q573r666j1584J2167J6629P724J3425K0631j7096M691R147
$$ plain form
14314 15011 29002 35812 29926 42033 29954 41705 39445 68530 60433 14121 2545 13172
14302 13172 24345 56371 60416 25292 -15815 29889 61071 19967 4164 11629 17 -8053
14290 -8053 -5711 14101 17567 6864 9138 -5673 -14955 -25617 -5095 6865 35728 70146 82748
14277 82748 60968 45105 53313 60618 36261 4077 -2385 16210 -151 23939 38471 53296
14265 53296 44154 23186 60432 66141 18767 20967 28545 13447 -1843 11557 21691 25766 1579
14252 1579 -8802 6739 -5509 5452 20991 18214 40633 43089 52609 62594 47177 38751 40528
14239 40528 19997 17787 9225 -19672 6466 -2522 3170 -11708 -5412 26556 35756 38499 22613
14226 22613 23349 46975 55548 45882 34298 46465 63094 70818 84243 104874 87778 92469 101616
14213A01616J8964j204J0258K4198K6222L8203J5874M1701L9851M3076L1722M3027
14201D33508P5274P4407P8263M8885O4004Q4289L7843j4942m3690p1641n3980
14190G12220n6020n6640n5187p8807n6909k1912n210k1830n2780k6511l7068l2016
14178B11330j2013j7506l0827k0445l823n332o465j2196j7203p624k285J532J78
14165G7321j8710k7907p546k9042j3877J5440K7971J7650J1991J246r28J5902
14153F9511l416j3439M688P61J709M438k4397J7545L7870j8077k3697m2528M033
14140A5001J8777k7379n897k4982L84n43L083j4038J974K8109J4275p052l799
14127b087L3734R726R798J509j9776J1882l352l8397j0865q568j4463m441K08
$$ plain form
14213 101616 120580 119376 129634 153832 180054 218257 234131 275832 315683 358759 390481 433508
14201 433508 508782 583189 661452 710337 774341 858630 896473 881531 837841 766200 712220
14190 712220 656200 599560 544373 465566 408657 386745 381535 359705 306925 280414 243346 211330
14178 211330 199317 181811 150984 130539 126716 121384 114919 102723 85520 77896 75611 77143 77321
14165 77321 58611 30704 23158 -5884 -19761 -4321 23650 41300 53291 54537 53609 69511
14153 69511 66095 52656 57344 58105 59814 64252 39855 57400 95270 77193 53496 10968 15001
14140 15001 33778 6399 502 -24480 -24096 -24639 -21556 -35594 -33620 -5511 8764 1712 -2087
14127 -2087 31647 41373 51171 52680 32904 44786 41434 3037 -7828 -16396 -30859 -35300 -35092
14114c5092o118P721K4062J2124J2146K6115k0011K462M4054k3202j3314K9897
14102F0844L045J271j5486j4289j3643K6625k2788J0900j4818m2056J3191J0291
14090C087N850K5601J1328o768l3027j4864M499j0350J3291L836M844K5510k3797
14077I040j9039O557o000m182J299p720l94K5485L0877L487J776j0435Q643J0422
14063D9816j7077j0675N98K6282j2207j2896O759Q83j523k1671k912j2156k4625
14050c1404n276L2396L4386L443J4153j1779j1121o35k8054O812J8322J1254j3440
14037A9057n772q887M396L299q230k0867l4119K150J9542J3654K8658J2592J3575
14024C9048J4111j7681k1169p249r115J516J3729k5994J9949J3752j1624M3J0372
$$ plain form
14114 -35092 -41210 -33489 -9427 2697 14843 40958 20947 23409 67463 44261 30947 60844
14102 60844 63889 65160 49674 35385 21742 48367 25579 36479 21661 -20395 -7204 3087
14090 3087 8937 34538 45866 39098 6071 -8793 -4294 -14644 -1353 2483 7327 32837 9040
14077 9040 -9999 -3442 -9442 -13624 -12325 -20045 -20439 5046 35923 39410 41186 30751 39394 49816
14063 49816 32739 22064 22662 48944 36737 23841 30600 31483 29960 8289 5377 -6779 -31404
14050 -31404 -36680 -4284 30102 33545 47698 35919 24798 24163 -3891 2921 21243 32497 19057
14037 19057 13285 4398 8794 12093 3863 -17004 -51123 -48973 -29431 -15777 12881 25473 39048
14024 39048 53159 35478 14309 7060 -2055 -539 13190 -12804 7145 20897 9273 9316 19688
14011A9688k9630k4642P386K8670j019K304l347r582J8772l926j6960J4090J3457
13998A5261k0181j444K2922N981m831M042k9506k8983q948K0427j6583k8924L0757
13985d0010L4525L0836m532l5465l1180j8201K7425K1087l405k0143j4041K4392
13973b8712p736L889J9360J8944k0024J8439j388j6522j345J8488J2087J1007
13961B6487p722j5345k2482L922P019k5865L0765m748k3152k4J1048K3150l106
13948e3J8253J8074J7865j9911k5570J52j1176j0880P066K1601Q158K0507q673
13935C5413j1705n696Q88l658m898k3154P876K669k6678J9710J9329M313o035
13922H374r952J1164J0429k4233K766K2647k376k6057k2929J7648L566K5260J2540
$$ plain form
14011 19688 -9942 -34584 -27198 1472 453 2757 -590 -10172 8600 4674 -12286 1804 15261
13998 15261 -4920 -6364 16558 22539 17708 21750 -7756 -36739 -45687 -25260 -41843 -70767 -40010
13985 -40010 -5485 25351 20819 -14646 -45826 -64027 -36602 -15515 -18920 -39063 -53104 -28712
13973 -28712 -36448 -32559 -13199 5745 -14279 4160 2772 -13750 -15095 3393 15480 26487
13961 26487 18765 3420 -19062 -15140 -8121 -33986 -3221 -7969 -31121 -31145 -20097 3053 -53
13948 -53 18200 36274 54139 34228 8658 8810 -2366 -13246 -6180 15421 23579 44086 35413
13935 35413 23708 18012 18900 15242 10344 -12810 -4934 -2265 -28943 -9233 10096 14409 8374
13922 8374 -1578 9586 20015 -4218 -1452 21195 18819 -7238 -30167 -12519 -8953 16307 28847
13909B8847K089J5194J277r078j0566l5357j2002K8789j373l302J9439J3234j5066
13896B2125j6077j9439r851j1567J9254K4618J1035k2626p639J4691J2470K7741
13884D4735k5490r734j3804j2756l883K2741J1878j578J5944N229k6300J009j0596
13871b605k15R73k489k442q246J1625q770L6530p767l1305n933L5773m76k6360
13857a1707k175j405M472K8212R723N240k123K1426q90m1806J2107K1123P787
13844D9984k648R589j7384m4055j5860Q858k531L422o990J9148o739k7082R362
13831b2926Q656j0119J1474J9903j9940k3358k3610j8514J5630L1330J6664J0635
13819d175j0152K8069N149p891N28J6124j2867p694K0709K5108m396j1293k7038
$$ plain form
13909 28847 30936 46130 47407 38329 27763 -7594 -19596 9193 7820 4518 23957 37191 22125
13896 22125 6048 -13391 -23242 -34809 -15555 9063 20098 -2528 -10167 4524 16994 44735
13884 44735 19245 9511 -4293 -17049 -20932 1809 13687 12109 28053 33282 6982 7991 -2605
13871 -2605 -2820 -1847 -4336 -6778 -15024 -3399 -12169 24361 16594 -14711 -20644 15129 14653 -11707
13857 -11707 -13882 -15287 -10815 17397 27120 32360 30237 51663 50773 8967 21074 42197 49984
13844 49984 47336 56925 39541 -4514 -20374 -11516 -14047 -10625 -17615 1533 -5206 -32288 -22926
13831 -22926 -14270 -24389 -12915 6988 -12952 -36310 -59920 -78434 -62804 -31474 -14810 -4175
13819 -4175 -14327 13742 18891 11000 11528 27652 14785 7091 27800 52908 48512 37219 10181
13806A0181j6271p004J9437r432k4312M958J9172L0415J3293j9771J2060M81j6802
13793A6405j7581N89K9090K8305k9097J524j5344N667J9411J1580j5994n244j5635
13780A3676j3500J2238k219K974L4924o936l3333j0405j6242M250K7979J8195
13768C1601j2729o76j344J0546M9999P321j7424L632J584j3762l8986j2455j51
13755G156P767L926j3794K8991J6908J2102L6592J3346J1876l1533k1670q690
13743F2977k0216K7543Q717j8096j4009l1408l1266l958j2360M134K7604K0794
13731B0456K562J0382l091j3760j1657L1098k86l1611p516j6589R250K5919k4520
13718i363k7189L538Q924L7080L4177L395j5525j8028j0567K386P226j5505k1014
$$ plain form
13806 10181 -6090 -13094 6343 -3089 -27401 -22443 -3271 27144 40437 20666 32726 33207 16405
13793 16405 -1176 -587 28503 56808 27711 29235 13891 19558 38969 50549 34555 29311 13676
13780 13676 176 12414 10195 13169 48093 41157 7824 -2581 -18823 -14573 13406 31601
13768 31601 18872 18196 16852 27398 77397 84718 67294 70926 72510 58748 19762 7307 7156
13755 7156 14923 18849 5055 34046 50954 63056 99648 112994 124870 93337 71667 62977
13743 62977 42761 70304 79021 60925 46916 15508 -15758 -19716 -32076 -27942 -338 20456
13731 20456 23018 33400 30309 16549 4892 35990 35704 4093 -3423 -20012 -10762 15157 -9363
13718 -9363 -36552 -33014 -24090 12990 47167 50562 35037 17009 6442 8828 16054 549 -20465
13705b0465J946R75J3439l1673m798K0309K1040J3634j1875l981k206j6999K5049
13692D395J9316N02m0391K4281J7839j280n419k9352r085K1506J8090J1625n048
13679B6979Q697p805J943K3301K4288J4050l0708o928M821j0706q474J4706M194
13666E8358R947Q952j478l253r943N66Q881k2209l2632j5118j840K5182j4981
13653A0432j7152K2903J3640k2415J0282M923K3938J8654o543N447r161l0505
13641B4443j2588J3089K6427J8016J65J7863j7637j1950Q093K810o969r897l3899
13628A7966j9461K918O407j6746K2785J8445j4622l222l097l012j182K0062L5167
13615F2408Q900j46j5639J856k0532j3358J6884Q042j3727R521J2845j7401m016
$$ plain form
13705 -20465 -18519 -17544 -4105 -35778 -40576 -20267 773 14407 2532 -1449 -3655 -20654 4395
13692 4395 23711 24213 -16178 8103 25942 24662 19243 -10109 -19194 2312 20402 32027 26979
13679 26979 35676 27871 29814 53115 77403 91453 60745 53817 58638 47932 39458 54164 58358
13666 58358 68305 77257 75779 72526 62583 63149 72030 49821 17189 2071 231 25413 10432
13653 10432 -6720 16183 29823 7408 17690 22613 46551 65205 58662 64109 54948 24443
13641 24443 11855 24944 51371 69387 69552 87415 69778 57828 65921 68731 61762 51865 17966
13628 17966 -1495 1423 7830 -8916 13869 32314 17692 14470 11373 8361 7179 27241 62408
13615 62408 71308 71162 55523 57379 36847 23489 40373 48415 34688 44209 57054 39653 35637
13602C5637M682m668n721j433K286J946J5516J5425K5679R455J9910L984K0859
13589A43557j2290K31K622k0298J2708M3987J6031J7802j3112j1282r146j2214
13577A58596j2318k679R629K5826L04K0994j8668k2142L814L934j3781P88M025
13564A58322J3164l041k1098n213M440J8581J2941J0916n433k6108j4695j5432
13552A27344j0824q23J6922P809j3861k3415M157J1840p992O370R854P507L7101
13539A71989K9516l0374m2999J3108L849q575r658j8539j5977j1040L396j1641
13527G3055k0973J1851p185R692J5615j4710J2927K279k9621j797K017J3292M1823
13514A08265K108P124J6457l1582p916j314o450L1276R161k9667j8110J4526K4631
$$ plain form
13602 35637 40319 35651 29930 28497 30783 32729 48245 63670 89349 98804 118714 122698 143557
13589 143557 131267 131498 134120 113822 126530 170517 186548 204350 191238 179956 170810 158596
13577 158596 146278 143599 153228 179054 179358 200352 181684 159542 163356 167290 153509 154297 158322
13564 158322 171486 168445 147347 142134 146574 165155 178096 189012 183579 157471 142776 127344
13552 127344 116520 115697 132619 140428 126567 103152 107309 119149 111157 117527 127381 134888 171989
13539 171989 201505 171131 128132 141240 145089 136514 126856 108317 92340 81300 84696 73055
13527 73055 52082 63933 56748 66440 82055 67345 80272 82551 52930 51133 53150 66442 108265
13514 108265 110373 117497 133954 102372 94456 93142 86692 117968 127129 97462 79352 93878 118509
13501A18509K3090J6376j622k4560M895j431J8529J3313r029K6235K8960j0607
13489B02658l002j4773R732R120j0391m9n089q863K5887L3337k1232m5021l5511
13476A36803N600L9962k969k4020j4001N611J5688r656j3331k2723n584J6253
13464A27633J602n471Q941J5124j1379j1139m726j2485k751j1938L2291J9518
13452A45220k982k3161l14M806k2651J5784m56J5347j9501k2895m931j5858L618
13439G2026R507o928M370L1445J6204P830j2897p791Q425q74k495K0429O36k245
13425A37642M593O754l4054l3945j3722K0423o560j7381L428K3636Q897J8j8057
13412H1672j3784m021J0972Q796n683L2542K771l0993J1960O107j5547l923K3368
$$ plain form
13501 118509 141599 157975 156353 131793 136688 135257 153786 167099 158070 184305 213265 202658
13489 202658 199656 184883 194615 203735 193344 193295 188206 179343 205230 238567 217335 172314 136803
13476 136803 142403 182365 179396 155376 141375 146986 162674 153018 139687 116964 111380 127633
13464 127633 129235 123764 132705 147829 136450 125311 120585 108100 105349 93411 125702 145220
13452 145220 142238 119077 118763 123569 100918 116702 116246 131593 112092 89197 84266 68408 72026
13439 72026 81533 74605 78975 110420 126624 134454 121557 113766 122191 121317 118822 139251 139887 137642
13425 137642 142235 148989 114935 80990 67268 87691 81131 63750 67178 90814 99711 99729 81672
13412 81672 67888 63867 74839 83635 77952 110494 113265 82272 94232 100339 84792 80869 104237
13399A04237K4245k8755m8437K4729K5812Q491j4746j1976j6483K4465R85j677
13387I0890J6733m053n974k2497j4566M007J8688M0236J811n669j2637J448j5936
13374I2481K2026J3797k9632N58Q572p255n738J0326M985k1572k1025M86L8819
13361A06828N605q807J4376j3639k3343L508J5935j4573k1416J0561j383J6259
13349H9911M453l2785O440l196m614k757j0395K2129L8858K110O778q42j9127
13336I6963k5672l9252K410K1370K9097J9632K4845m936j0517m1101j7511K6429
13324H1757K424j2084J7443j548K1809N772k3797r649J973n287j1009J1382J1501
13311I0687k7986O998M077K4249m87j7736M132L5254J6948j8261r108J4826K4362
$$ plain form
13399 104237 128482 99727 51290 76019 101831 110322 95576 83600 67117 91582 92567 90890
13387 90890 107623 103570 97596 75099 60533 64540 83228 123464 125275 119606 106969 108417 92481
13374 92481 114507 128304 98672 99230 107802 100547 94809 105135 110120 88548 67523 68009 106828
13361 106828 112433 103626 118002 104363 81020 84528 100463 85890 64474 75035 73652 89911
13349 89911 94364 61579 68019 64823 60209 57452 47057 69186 108044 110154 116932 116090 96963
13336 96963 71291 32039 34449 55819 84916 104548 129393 124457 113940 72839 55328 81757
13324 81757 84181 72097 89540 87992 109801 115573 91776 82127 84100 78813 67804 79186 90687
13311 90687 62701 69699 73776 98025 97538 79802 83934 119188 136136 117875 108767 123593 147955
13298A47955J0407j5780K258m516n165m680m396O531m289O385q950J2552J0922
13285A49234L14R384N491k5125k282J8805r36j2038j3547q969m852K0370r105
13272A26744j1842N369M6124L1385o591n487l2867J7104N782j8089k4037K3572
13260A57167L2614K2003r303k4724l7939j4165L1302K7534L0419J9559q744l538
13248B22185M312J0357k0633k196n140k4165M1017K9151O643j706q703L0093J7215
13235B98430J5055p898m000J2308Q690k9024J8641J9M802K0049J0391j4082j3389
13222C19992j4658O959J4792q301Q521J161l910j0126J6628K4867J6355J1365
13210C83645n616N3168L5344Q036J75p189J1606P738L1618J8026j1633J78K7307
$$ plain form
13298 147955 158362 142582 144840 140324 135159 130479 126083 132614 128325 134710 125760 138312 149234
13285 149234 149548 158932 164423 139298 137016 155821 154885 142847 129300 120331 115479 135849 126744
13272 126744 114902 120271 166395 197780 191189 185702 152835 169939 175721 157632 133595 157167
13260 157167 189781 211784 202481 177757 139818 125653 156955 184489 214908 234467 225723 222185
13248 222185 226497 236854 216221 214025 208885 184720 225737 254888 261531 259825 251122 281215 298430
13235 298430 313485 305587 301587 313895 322585 293561 312202 312221 317023 337072 347463 333381 319992
13222 319992 305334 312293 327085 318784 327305 328466 324556 314430 331058 355925 372280 383645
13210 383645 378029 431197 466541 474577 474752 467563 479169 486907 518525 536551 524918 525096 552403
13197E52403J5373J2465L6160K0276R099J5648K4115K3172M3425K5751K3419L6235
13185H37541J6554L6569N0250M7299O0942M9635O0164R1414Q8467R0650P9361
13174A508846J05766O7074R5106J23250J09862J15315J43298J56155J84609K03247
13164B812528K26375K79951K98625L02261L82616M40280M70998N58884O29292
13155F401810O97031P81183Q45573Q74560R05560Q93088Q97604Q82542Q75521
13146A4054472Q53956Q20353Q16553Q03110P68024P49009P06729O40322N86134
13137B0798662N46322N10127M32163M26415M18848M43257M63051M92556N50964
13128B5082365O44044P15896P60959P75562P16271O38134M78132K59191J8509
$$ plain form
13197 552403 567776 580241 616401 636677 645776 661424 685539 708711 752136 777887 801306 837541
13185 837541 854095 890664 940914 988213 1049155 1098790 1158954 1250368 1338835 1429485 1508846
13174 1508846 1614612 1681686 1776792 1900042 2009904 2125219 2268517 2424672 2609281 2812528
13164 2812528 3038903 3318854 3617479 3919740 4302356 4742636 5213634 5772518 6401810
13155 6401810 7098841 7880024 8725597 9600157 10505717 11398805 12296409 13178951 14054472
13146 14054472 14908428 15728781 16545334 17348444 18116468 18865477 19572206 20212528 20798662
13137 20798662 21344984 21855111 22287274 22713689 23132537 23575794 24038845 24531401 25082365
13128 25082365 25726409 26442305 27203264 27978826 28695097 29333231 29811363 30070554 30089063
13119C0089063k02043l73017m80196n25442n54525n01784m75874m49798m48406
13110B6077978m70186n13003n31673n30012n35308n25313n49107n47768n72346
13101B1303262o13422o48032o67277o72493o95686p54385q21353r03851r53447
13092A4573316r52116r70806r33203q87177q15177p44914o05908n06495m06386
13083G751134l13512k70162j46147r3641m3198M9204J57970K77322M20776N39995
13073H329741N78064N63619N79560O20685P32636Q52032R33208R96315J006200
13064A5192060R76145R07099Q63498P95466P61246P17265P02808O57503N92806
13055B2165896N38194M54446M05756L61910L33791L80038M57658N19118O27636
$$ plain form
13119 30089063 29887020 29514003 29033807 28508365 27953840 27452056 26976182 26526384 26077978
13110 26077978 25607792 25094789 24563116 24033104 23497796 22972483 22423376 21875608 21303262
13101 21303262 20689840 20041808 19374531 18702038 18006352 17251967 16430614 15526763 14573316
13092 14573316 13621200 12650394 11717191 10830014 10014837 9269923 8664015 8157520 7751134
13083 7751134 7437622 7167460 7021313 6927672 6884474 6933678 7091648 7368970 7789746 8329741
13073 8329741 8907805 9471424 10050984 10671669 11404305 12256337 13189545 14185860 15192060
13064 15192060 16168205 17075304 17938802 18734268 19495514 20212779 20915587 21573090 22165896
13055 22165896 22704090 23158536 23564292 23926202 24259993 24640031 25097689 25616807 26244443
13046B6244443P34540Q84391R87948J056827J118057J086724R85658Q02101N37473
13037C4438162K49736m1881k40602l87608n65913o17106o06968n49663m45712
13028C1232445n20176q73031j274107j464250j323377j070625q99099q30831p25223
13019B2251726p03116p13919p29266p39547p66179q01113q02622q16200q67871
13010A5311893r17175r40564r90009r82402r29360r04476q75075p56067p02163
13001G314602o49296n74210n05510m75220l94171l30473k95466k56737k79380
12992C554139k13084j46290j47773j38329q2807j4222J11899K58496L70958L66307
12982C919294J06809l59834o07372n68839l91663k40771j49447j12713p2698j00459
$$ plain form
13046 26244443 26978983 27863374 28851322 29908149 31026206 32112930 33098588 33900689 34438162
13037 34438162 34687898 34646017 34405415 34017807 33451894 32834788 32227820 31678157 31232445
13028 31232445 30712269 29839238 28565131 27100881 25777504 24706879 23807780 22976949 22251726
13019 22251726 21548610 20834691 20105425 19365878 18599699 17798586 16995964 16179764 15311893
13010 15311893 14394718 13454154 12464145 11481743 10552383 9647907 8772832 8016765 7314602
13001 7314602 6665306 6091096 5585586 5110366 4716195 4385722 4090256 3833519 3554139
12992 3554139 3341055 3194765 3046992 2908663 2825856 2811634 2923533 3182029 3552987 3919294
12982 3919294 4026103 3666269 3058897 2490058 2098395 1857624 1708177 1595464 1522766 1422307
12972A422307o3701n6955p7817o4425m6103m2125l7953l3318k5710j7681k0600
12961I35919m0332l3155m663j9480J728l4525o7278j4033n346k3602q739q529
12949F77965j7821J5137J5917j4943l1201k7837K3311M9938P5406J25105J34388
12938A025365J22535O1810r2838k00750j69771r2929o4964n0459k3786j770k5902
12927D86541q953j2757l3654k4734k1475o154Q917j399Q212m166j9245K2637J1173
12914D04943j6897O673j4524j7084k7772K0990M3608J6644j0043k1889j3530k3260
12902C47859r195M408j20P067j447P549r020j8427l238k30p710J249j8488j9160
12888B81097Q058K1754K8387J8720N174R023o116j1176J2102J4593j150k9010
$$ plain form
12972 1422307 1358606 1301651 1223834 1159409 1113306 1071181 1033228 999910 974200 956519 935919
12961 935919 895587 862432 857769 838289 840017 805492 738214 724181 718835 695233 686494 677965
12949 677965 660144 675281 691198 676255 645054 617217 640528 690466 765872 890977 1025365
12938 1025365 1147900 1209710 1116872 916122 746351 653422 588458 537999 514213 512443 486541
12927 486541 477588 464831 431177 406443 384968 378814 387731 386332 394544 390378 371133 393770 404943
12914 404943 388046 394719 380195 363111 335339 356329 399937 416581 406538 384649 371119 347859
12902 347859 338664 343072 342952 350019 348572 356121 347101 328674 325436 325206 317496 318745 300257 281097
12888 281097 289155 310909 339296 358016 363190 372213 366097 354921 367023 381616 380466 351456
12876C51456q415N743K2987j0827j1423K4899K2736j4696l495O818j7030j6176
12864C52577k6133k8500M771q876j1908l35J9037k1383j8873r404J8716K471m0911
12851B31249j5606r924J8949M229R710k837j7881j3167k4189J0621J6258k3520
12839A83892M646P233l4544j989M5485J9137l6139k4091j7695Q927K1447J8198
12827A94507J0826j0460J410J7270l088k0902R60k0039k847K2401N120l820k375
12814A88963o351J0034J3946r161j6239k2797k1409N562o80M123K6007J4017j0548
12801A75467j7357m636N96L1370L1515j2524J1301J3296j5946j5032P906l685
12789B02271N84P291l6475j4274j5943o287J2721r54n603j7967N141N909o038
$$ plain form
12876 351456 343041 348784 371771 360944 349521 374420 397156 382460 378965 385783 368753 352577
12864 352577 326444 297944 302715 293839 281931 281596 300633 279250 260377 250973 269689 272160 231249
12851 231249 215643 205719 224668 228897 238607 235770 217889 204722 180533 191154 207412 183892
12839 183892 188538 195771 161227 159238 204723 223860 187721 163630 145935 154862 176309 194507
12827 194507 205333 194873 196283 213553 210465 189563 190523 170484 167637 190038 195158 191338 188963
12814 188963 182612 192646 206592 197431 181192 158395 136986 142548 141868 145991 171998 186015 175467
12801 175467 158110 153474 154070 185440 216955 204431 215732 229028 213082 198050 205956 202271
12789 202271 202855 210146 173671 159397 143454 137167 149888 148934 143331 125364 130505 136414 130376
12776A30376j4182j1661J5374J1252L822L6235j4143l5028O854J2792J9312j4009
12764A46994k578L2888P4l8138k4166l018L18p18L7186L4121L810k9381L180K2238
12750A82810k5688k1658r573K9481L8501l383j2279K117K777l8430m556P572r813
12737A37878l744j639J0066K7198O505R657m666M938J0903j3604j0726j5060r828
12724A47878p997k5097K0778O078J3769K4447R202q14J4286L3409L0184q490j8675
12711B38958j8628k5011L1936J7211m149l585K8400J5820j2928L444L2560K5575
12699C29603q759k8089l7202J4150R419J4773R678J0037N664L4690L60k8453J804
12686C27675k1572j7707j311o80K1612R171J1648j3972j2242j178l3809J3687
$$ plain form
12776 130376 116194 104533 119907 131159 134981 171216 157073 122045 128899 141691 161003 146994
12764 146994 144416 177304 177378 139240 115074 112056 112374 111656 148842 182963 186773 157392 160572 182810
12750 182810 157122 135464 125891 155372 193873 190490 178211 180328 183105 144675 140119 147691 137878
12737 137878 134134 132495 142561 169759 176264 185921 181255 186193 197096 183492 172766 157706 147878
12724 147878 139881 114784 135562 141640 155409 179856 189058 188244 202530 235939 266123 257633 238958
12711 238958 220330 195319 227255 244466 240317 236732 265132 280952 268024 271468 304028 329603
12699 329603 320844 292755 255553 269703 279122 293895 303573 313610 319274 353964 354324 325871 327675
12686 327675 306103 288396 287085 286405 308017 317188 328836 314864 302622 301444 267635 281322
12674B81322o076k0099K4793K6432K4138O73j6704k6274p158l148K0492K9526
12662C27917K2095J8258N397J596j1113J3906M2857J7178k7312J063N601N3643
12650D71086N9322O9909L4549j113k0932j351L3814J12928J65808K58583L34415
12639A517018M24905L63319J74289k312r4912k13998k80168l03235k27686p9136
12629A278084Q0881J46720J47937l6936k03798k73689j86940j07530m2447l2390
12619G69892j2404k0670k807K1798K2319Q832J7371j840k7948l2550k7576p630
12607G06787n158J3056q827j4678j3588J3371j496J7029M7795L1761L1544L556
12595H21152r727K5029J0184L9175L1465P0853R8917J22417J29063J29725J64367
$$ plain form
12674 281322 275246 255147 279940 306372 330510 331183 314479 288205 281047 277899 298391 327917
12662 327917 350012 368270 373667 375263 364150 378056 420913 438091 410779 411842 417443 471086
12650 471086 530408 600317 634866 633753 612821 611470 645284 758212 924020 1182603 1517018
12639 1517018 1941923 2305242 2479531 2477219 2382307 2168309 1888141 1584906 1357220 1278084
12629 1278084 1358965 1505685 1653622 1616686 1412888 1139199 952259 844729 802282 769892
12619 769892 757488 736818 734011 755809 778128 786960 804331 802491 774543 741993 714417 706787
12607 706787 701629 714685 705858 691180 677592 690963 689467 706496 754291 786052 817596 821152
12595 821152 811425 836454 846638 885813 917278 988131 1087048 1209465 1338528 1468253 1632620
12584A632620J45960R5063J0986o9903j43607j41016j24295j04398n4204R051
12574A256257Q1865Q2315J2953q6748r9026q1885n5973k8145K2425J0569m0922
12563A073685j18601j54217j24008j07050o1493n6342k2777l4838p653k5088m7176
12552C14442n615r662k4003r193j5656l6690k0106p767j001q98l477J0424r369
12539A81429j6480J950J8746k3134m0029k317N777L24j7444N957L9943j4916o495
12526A33311L2952J093o771j2981j9053j2642j9598m194K5928j745k413J6168
12514A30055K4236L584o030l488O123j2960j3635k3128q925k174K826l797k2952
12501F9735q756K3628j435j0952K8277L093R019K192j6450l0456j0591r353J1712
$$ plain form
12584 1632620 1778580 1873643 1884629 1814726 1671119 1530103 1405808 1301410 1247206 1256257
12574 1256257 1338122 1420437 1433390 1346642 1247616 1165731 1109758 1081613 1104038 1114607 1073685
12563 1073685 955084 800867 676859 569809 508316 451974 429197 394359 386706 361618 314442
12552 314442 308827 299165 275162 265969 250313 213623 193517 185750 184749 183851 180374 190798 181429
12539 181429 164949 166899 185645 162511 122482 120165 125942 126266 108822 114779 154722 139806 133311
12526 133311 166263 167356 160585 147604 128551 115909 96311 92117 118045 116300 113887 130055
12514 130055 154291 157875 151845 148357 154480 141520 127885 104757 95832 93658 96484 92687 69735
12501 69735 60979 84607 83172 72220 100497 103590 112609 114801 98351 67895 57304 47951 59663
12488E9663L8703n784P382M239j2627j2368K2264J6657k2110o333N630K1617J1498
$$ plain form
12488 59663 98366 92582 99964 104203 91576 79208 101472 118129 96019 89686 95316 116933 128431
$$ [...]
##END NTUPLES=NMR SPECTRUM
##END=
