##TITLE=Analysis number 328614
Compound Code mo 08250
Project Code adrs
Chemist Name stores
##JCAMPDX= 6.0         $$ Bruker NMR JCAMP-DX V2.0
##DATA TYPE= NMR SPECTRUM
##DATA CLASS= NTUPLES
##ORIGIN= Bruker BioSpin GmbH
##OWNER= nmr
$$ XWIN-NMR		Version 3.5
$$ Wed Jun 20 12:22:24 2007 GMT Daylight Time (UT+1h)  MAYBRIDGE\nmr@NMR_250MHZ
##.OBSERVE FREQUENCY= 250.131544655141
##.OBSERVE NUCLEUS= ^1H
##.ACQUISITION MODE= SIMULTANEOUS (DQD)
##.ACQUISITION SCHEME= undefined
##.AVERAGES= 16
##.DIGITISER RES= 18
##SPECTROMETER/DATA SYSTEM= dpx250
##.PULSE SEQUENCE= zg30
##.SOLVENT NAME= CDCl3
##.SHIFT REFERENCE= (INTERNAL, CDCl3, 0, 16.522)
##AUDIT TRAIL= $$ (NUMBER, WHEN, WHO, WHERE, WHAT)
$$ ##TITLE= Audit trail, XWIN-NMR		Version 3.5
$$ ##JCAMPDX= 5.01
$$ ##ORIGIN= Bruker BioSpin GmbH
$$ ##OWNER= nmr
$$ C:\u/data/dgb/nmr/ADRS/1300/pdata/1/auditp.txt
$$ ##AUDIT TRAIL=  $$ (NUMBER, WHEN, WHO, WHERE, WHAT)
(   1,<2007-06-20 12:22:00.26 +100>,<MAYBRIDGE\nmr>,<NMR_250MHZ>,
      <created by zg, POWCHK disabled, PULCHK disabled
       configuration hash MD5:
       76 6E 9A 78 1E 09 19 81 EC 84 63 8F B0 6A 59 2D
       data hash MD5: 64K
       EC 57 F1 2D 23 C9 2E 02 22 B2 16 C6 49 9D 10 85>)
(   2,<2007-06-20 12:22:12.78 +100>,<MAYBRIDGE\nmr>,<NMR_250MHZ>,
      <Start of raw data processing
       ef LB = 0.3 FT_mod = 6 PKNL = 1 SI = 32K 
       data hash MD5: 32K
       EC 39 9C 8F F6 6B D5 AE 7D 21 03 7F 1A F8 77 62>)
(   3,<2007-06-20 12:22:14.50 +100>,<MAYBRIDGE\nmr>,<NMR_250MHZ>,
      <apk 
       data hash MD5: 32K
       07 5A A2 F4 79 28 23 0F 9D 44 C9 1F 2E 54 10 B3>)
(   4,<2007-06-20 12:22:15.32 +100>,<MAYBRIDGE\nmr>,<NMR_250MHZ>,
      <abs ABSG = 5 
       data hash MD5: 32K
       9B 71 6E 85 AB 70 AC 7E 7B D6 AF F3 7F 4F 90 FE>)
$$ ##END=
$$ 
$$ hash MD5
$$ 52 C5 66 B8 DE 34 24 93 03 94 83 B3 AB 59 66 06
##$RELAX= 
##$RELAX= 
##$RELAX= 
##$RELAX= 
##$RELAX= 
##$RELAX= 
##$RELAX= 
$$ Bruker specific parameters
$$ --------------------------
##$DU= <C:\u>
##$EXPNO= 1300
##$NAME= <ADRS>
##$PROCNO= 1
##$TYPE= <nmr>
##$USER= <dgb>
##$AMP= (0..31)
100 100 100 100 100 100 100 100 100 100 100 100 100 100 100 100 100 100 
100 100 100 100 100 100 100 100 100 100 100 100 100 100 
##$AQSEQ= 0
##$AQ_mod= 3
##$AUNM= <au_zg>
##$AUTOPOS= <24 >
##$BF1= 250.13
##$BF2= 250.13
##$BF3= 250.13
##$BF4= 250.13
##$BF5= 500.13
##$BF6= 500.13
##$BF7= 500.13
##$BF8= 500.13
##$BYTORDA= 1
##$CFDGTYP= 0
##$CFRGTYP= 5
##$CHEMSTR= <none>
##$CNST= (0..31)
1 1 145 1 1 1 1 1 1 1 1 1 1 1 1 1 1 1 1 1 1 1 1 1 1 1 1 1 1 1 1 1 
##$CPDPRG= <>
##$CPDPRG1= <>
##$CPDPRG2= <>
##$CPDPRG3= <>
##$CPDPRG4= <mlev>
##$CPDPRG5= <mlev>
##$CPDPRG6= <mlev>
##$CPDPRG7= <mlev>
##$CPDPRG8= <mlev>
##$CPDPRGB= <>
##$CPDPRGT= <>
##$D= (0..31)
0 1 0 0 0 0 0 0 0 0.06 0 0 0 0 0 0 0.0002 0 0 0 0 0 0 0 0 0 0 0 0 0 0 
0 
##$DATE= 1182338519
##$DBL= (0..7)
120 120 120 120 120 120 120 120 
##$DBP= (0..7)
150 150 150 150 150 150 150 150 
##$DBP07= 0
##$DBPNAM0= <>
##$DBPNAM1= <>
##$DBPNAM2= <>
$$ [...]
##$SUBNAM7= <"">
##$SUBNAM8= <"">
##$SUBNAM9= <"">
##$SW= 20.6930455092707
##$SWIBOX= (0..15)
0 0 3 0 0 0 0 0 0 0 0 0 0 0 0 0 
##$SW_h= 5175.983436853
##$TD= 65536
##$TD0= 1
##$TE= 296.16
##$TE2= 300
##$TE3= 300
##$TEG= 300
##$TL= (0..7)
0 120 120 120 120 120 120 120 
##$TP= (0..7)
150 150 150 150 150 150 150 150 
##$TP07= 0
##$TPNAME0= <>
##$TPNAME1= <>
##$TPNAME2= <>
##$TPNAME3= <>
##$TPNAME4= <>
##$TPNAME5= <>
##$TPNAME6= <>
##$TPNAME7= <>
##$TPOAL= (0..7)
0.5 0.5 0.5 0.5 0.5 0.5 0.5 0.5 
##$TPOFFS= (0..7)
0 0 0 0 0 0 0 0 
##$TUNHIN= 0
##$TUNHOUT= 0
##$TUNXOUT= 0
##$USERA1= <user>
##$USERA2= <user>
##$USERA3= <user>
##$USERA4= <user>
##$USERA5= <user>
##$V9= 5
##$VALIST= <valist>
##$VCLIST= <CCCCCCCCCCCCCCC>
##$VD= 0
##$VDLIST= <DDDDDDDDDDDDDDD>
##$VPLIST= <PPPPPPPPPPPPPPP>
##$VTLIST= <TTTTTTTTTTTTTTT>
##$WBST= 1024
##$WBSW= 4
##$XGAIN= (0..3)
0 0 0 0 
##$XL= 0
##$YL= 0
##$YMAX_a= 351552
##$YMIN_a= -320863
##$ZGOPTNS= <>
##$ZL1= 120
##$ZL2= 120
##$ZL3= 120
##$ZL4= 120
##$ABSF1= 16.522
##$ABSF2= -4.171173
##$ABSG= 5
##$ABSL= 3
##$ALPHA= 0
##$AQORDER= 0
##$ASSFAC= 0
##$ASSFACI= 0
##$ASSFACX= 0
##$ASSWID= 0
##$AUNMP= <proc_1d>
##$AZFE= 0.1
##$AZFW= 0.1
##$BCFW= 0
##$BC_mod= 0
##$BYTORDP= 0
##$COROFFS= 0
##$CY= 12.5
##$DATMOD= 1
##$DC= 0
##$DFILT= <>
##$DTYPP= 0
##$F1P= 14.0000005364418
##$F2P= -0.99999901652339
##$FCOR= 0.5
##$FTSIZE= 32768
##$FT_mod= 6
##$GAMMA= 0
##$GB= 0
##$INTBC= 1
##$INTSCL= 1
##$ISEN= 128
##$LB= 0.3
##$LEV0= 0
##$LPBIN= 0
##$MAXI= 10000
##$MC2= 0
##$MEAN= 0
##$ME_mod= 0
##$MI= 0
##$NCOEF= 0
##$NC_proc= -3
##$NLEV= 6
##$NOISF1= 0
##$NOISF2= 0
##$NSP= 0
##$NTH_PI= 0
##$NZP= 0
##$OFFSET= 16.522
##$PC= 1
##$PHC0= -49.19766
##$PHC1= -1.294664
##$PH_mod= 1
##$PKNL= yes
##$PPARMOD= 0
##$PSCAL= 4
##$PSIGN= 0
##$REVERSE= no
##$SF= 250.13
##$SI= 32768
##$SIGF1= 0
##$SIGF2= 0
##$SINO= 400
##$SIOLD= 32768
##$SREGLST= <1H.CDCl3>
##$SSB= 0
##$STSI= 32768
##$STSR= 0
##$SW_p= 5175.98343685301
##$SYMM= 0
##$S_DEV= 0
##$TDeff= 65536
##$TDoff= 0
##$TI= <Analysis number 999999
Compound Code 99
Book Reference 9
Project Code 9>
##$TILT= no
##$TM1= 0
##$TM2= 0
##$TOPLEV= 0
##$USERP1= <user>
##$USERP2= <user>
##$USERP3= <user>
##$USERP4= <user>
##$USERP5= <user>
##$WDW= 1
##$XDIM= 32768
##$YMAX_p= 551922748
##$YMIN_p= -160936
$$ End of Bruker specific parameters
$$ ---------------------------------
##NTUPLES= NMR SPECTRUM
##VAR_NAME=  FREQUENCY,     SPECTRUM/REAL,   SPECTRUM/IMAG
##SYMBOL=    X,             R,               I
##VAR_TYPE=  INDEPENDENT,   DEPENDENT,       DEPENDENT
##VAR_FORM=  AFFN,          ASDF,            ASDF
##VAR_DIM=   32768,         32768,           32768
##UNITS=     HZ,            ARBITRARY UNITS, ARBITRARY UNITS
##FACTOR=    0.157963299565203, 1,           1
##FIRST=     4132.6476996994, 0,             0
##LAST=      -1043.33573715361, 0,           0
##MIN=       -1043.33573715361, -160936,     0
##MAX=       4132.6476996994, 551922748,     0
$$ Real data points
##PAGE= N=1
##DATA TABLE= (X++(R..R)), XYDATA
$$ [...]
$$ plain form
16404 -20030 -24250 -43734 -30726 -28253 -17593 -16397 -39082 -27853 -47195 -43016 -36667 -39074 -32708
16391 -32708 -22626 -22653 -11474 12377 -5710 -33914 -35123 -29725 -44297 -47286 -49324 -52451 -53771
16378 -53771 -40357 -25792 -44119 -12905 20241 11581 6882 -17645 -18410 -10922 -34646 -51483 -89466
16365 -89466 -73355 -19096 6877 -23156 -34716 -28369 -14965 -16623 -10851 -20279 -28261 -45786 -27707
16352 -27707 -6464 -7040 -9438 -12364 -32843 -46971 -32058 -20154 -38153 -29832 -2476 -24160 -36927
16339 -36927 -44693 -44265 -21109 -21035 -49079 -68025 -56237 -28756 -10283 -26782 -19588 3533 4096
16326 4096 13196 44412 52646 8494 13175 22663 31892 30929 7601 4024 -6374 40068 71809
16313 71809 42183 24684 23358 2968 9180 2702 -42812 -19228 10204 -2066 -22663 -26134
$$ packed form
16404b0030m220j9484J3008K473J0660J196k2685J1229j9342M179O349k407O366
16391c2708J0082k7J1179K3851j8087k8204j209N398j4572k989k038l127j320
16378e3771J3414J4565j8327L1214L3146q660m699k4527p65P488k3724j6837l7983
16365h9466J6111N4259K5973l0033j1560O347J3404j658N772r428p982j7525J8079
16352b7707K1243n76k398k926k0479j4128J4913J1904j7999Q321K7356k1684j2767
16339c6927p766M28K3156P4k8044j8946J1788K7481J8473j6499P194K3121N63
16326D096R100L1216Q234m4152M681R488R229r63k3328l577j0398M6442L1741
16313G1809k9626j7499j326k0390O212o478m5514K3584K9432j2270k0597l471
$$ plain form
16301 -26134 15608 1058 -15786 -6738 -32930 -59757 -15212 -10127 -2519 -15359 -32137 -69158
16289 -69158 -67297 -63897 -103224 -107007 -51875 -44483 -80103 -78781 -36168 -35190 -23337 9577 33486
16276 33486 56196 55766 24239 22494 17856 -1551 -8345 -11665 -3656 10000 -3435 29102 23582
16263 23582 -22125 -45942 -60164 -9860 -1851 -21650 -42829 -66812 -71462 -38266 -2991 1905
16251 1905 -28472 -43525 -46647 -58000 -43105 -13896 -3303 -3488 -14150 -2920 4929 10115 500
16238 500 5825 -10927 16893 13793 -10307 -11917 -3840 -4588 -8460 -1389 2585 205 12248 -9134
16224 -9134 -18077 4216 36471 33745 10633 -7358 -30160 4932 8286 -23695 -19903 -28408 -23832
16211 -23832 -27135 -21730 -19885 -38394 -26141 -18640 -13180 -3315 -28788 -24266 16087 12347 -8865
$$ packed form
16301b6134M1742j4550j6844R048k6192k6827M4545N085P608j2840j6778l7021
16289f9158J861L400l9327l783N5132P392l5620J322M2613R78J1853L2914K3909
16276C3486K2710m30l1527j745m638j9407o794l320Q009J3656j3435L2537n520
16263B3582m5707k3817j4222N0304Q009j9799k1179k3983m650L3196L5275M896
16251A905l0377j5053l122j1353J4895K9209J0593j85j0662J1230P849N186r615
16238E00N325j6752K7820l100k4100j610Q077p48l872P071L974k380J2043k1382
16224i134q943K2293L2255k726k3112j7991k2802L5092L354l1981L792q505M576
16211b3832l303N405J845j8509J2253P501N460R865k5473M522M0353l740k1212
$$ plain form
16198 -8865 -19637 -18364 -35590 -51272 -50577 -35563 -11493 -14183 -16047 1610 2423 -36681 -53968
16185 -53968 -47720 -40698 -8367 5651 14686 -14718 -13400 -9005 4603 37405 44408 28432 12568
16172 12568 9334 -3265 1697 -24566 -50014 -54203 -46087 -34594 -25927 -28710 -31990 -19395 6235
16159 6235 8197 -13465 -43984 -49173 -41210 -37995 -28437 -4984 10665 -3518 -4324 5814 -14684
16146 -14684 -16869 -35737 -46522 -41062 -17391 -3743 -15789 5755 47494 32025 8941 20983
16134 20983 8603 -6410 -546 1120 -12206 -12683 -10272 4351 -33801 -23129 -21112 -13254 2429
16121 2429 30953 41097 9277 8983 19588 13908 927 -10614 -551 17653 -6632 -9577 -19463
16108 -19463 -31245 -21812 -41944 -15734 11406 28636 53562 40645 36172 17662 27797 -7903
$$ packed form
16198h865j0772J273j7226j5682O95J5014K4070k690j864J7657Q13l9104j7287
16185e3968O248P022L2331J4018R035k9404J318M395J3608L2802P003j5976j5864
16172A2568l234j2599M962k6263k5448m189Q116J1493Q667k783l280J2595K5630
16159F235J962k1662l0519n189P963L215R558K3453J5649j4183q06J0138k0498
16146a4684k185j8868j0785N460K3671J3648j2046K1544M1739j5469k3084J2042
16134B0983j2380j5013N864J666j3326m77K411J4623l8152J0672K017P858J5683
16121B429K8524J0144l1820k94J0605n680j2981j1541J0063J8204k4285k945r886
16108a9463j1782R433k0132K6210K7140J7230K4926j2917m473j8510J0135l5700
$$ plain form
16096 -7903 -18483 -16292 -17986 12514 20993 26677 21288 402 -31760 -26921 -12509 -24021 -36558
16083 -36558 -52469 -17473 -13773 -5249 10198 13727 -10117 2443 32988 40148 23665 -304
16071 -304 -728 -39130 -55737 -39703 -75274 -59947 -24917 -17332 -39741 -8599 -5882 -5236 -11693
16058 -11693 -14370 -1675 2164 16433 11439 621 18363 8055 -5854 -34317 -45478 15840
16046 15840 31361 21527 26253 7787 4974 -8534 -49241 -52821 -31240 24 16522 17893 24540
16033 24540 25850 13480 -22411 -2791 -940 -14965 -33656 -30551 -41300 -44469 -11801 -1050
16021 -1050 -14043 -31420 -49531 -44673 -51854 -33528 -42495 -72982 -79427 -76597 -54091 -15271 -1776
16008 -1776 -24007 -12793 9039 -1443 -1465 -13113 -18888 768 -758 -5481 7856 10489 -7377
$$ packed form
16096g903j0580K191j694L0500Q479N684n389k0886l2162M839J4412j1512j2537
16083c6558j5911L4996L700Q524J5447L529k3844J2560L0545P160j6483k3969
16071c04m24l8402j6607J6034l5571J5327L5030P585k2409L1142K717O46o457
16058a1693k677J2695L839J4269m994j0818J7742j0308j3909k8463j1161O1318
16046A5840J5521r834M726j8466k813j3508m0707l580K1581L1264J6498J371O647
16033B4540J310j2370l5891J9620J851j4025j8691L105j0749l169L2668J0751
16021a050j2993j7377j8111M858p181J8326q967l0487o445K830K2506L8820J3495
16008a776k2231J1214K1832j0482k2j1648n775J9656j526m723J3337K633j7866
$$ plain form
15995 -7377 -12945 -5705 -8689 -46216 -38698 -6873 6699 5132 -7363 -109 -7492 -356 21621
15982 21621 18005 1239 -14960 -6899 -8952 275 20881 23246 -7658 -26217 -21964 -4043 31596
15969 31596 32121 -10135 -34197 -23592 -14893 -8109 -2164 -10261 -46217 -72317 -70358 -55475 -37722
15956 -37722 -47576 -22572 -9944 15979 31699 9277 9138 37561 44390 13578 -2578 2537 17575
15943 17575 5880 9441 11235 16333 -23405 -31637 -15112 -3105 12924 24432 3416 12227 13440
15930 13440 9682 16898 18148 3487 -21025 -382 26684 26313 16498 -9651 -14244 23402 25823
15917 25823 44968 37760 19537 4838 19189 10139 -8858 -7530 -24094 -32049 -20650 -3788
15905 -3788 -10923 -7776 24994 15135 19562 13572 9120 -10122 -18716 -17710 -43885 -37464 -28716 -8678
$$ packed form
15995g377n568P240k984l7527P518L1825J3572j567j2495P254p383P136K1977
15982B1621l616j6766j6199Q061k053R227K0606K365l0904j8559M253J7921L5639
15969C1596N25m2256k4062J0605Q699O784N945q097l5956k6100J959J4883J7753
15956c7722r854K5004J2628K5923J5720k2422j39K8423O829l0812j6156N115J5038
15943A7575j1695L561J794N098l9738q232J6525J2007J6029J1508k1016Q811J213
15930A3440l758P216J250j4661k4512K0643K7066l71r815k6149m593L7646K421
15917B5823J9145p208j8223j4699J4351r050j8997J328j6564p955J1399J6862
15905c788p135L147L2770r859M427n990m452j9242q594J006k6175O421Q748K0038
$$ plain form
15891 -8678 -18452 -16277 -35712 -51051 -62123 -65021 -57304 -60182 -30368 8511 17234 18746 34680
15878 34680 31503 18204 1760 -6729 -53564 -53953 -33266 -30595 -58363 -43074 -6445 -12862 -6110
15865 -6110 -7797 -29768 -39137 -32283 -16710 -16662 -13890 3764 8111 -1350 7271 9035 -9052 -29494
15851 -29494 -36956 -42638 -41036 -20904 -14040 6266 8906 1875 21866 8801 4688 -18354 -33607
15838 -33607 -20734 -20246 -29943 -27891 -29154 -28095 -26518 -18341 -12245 -3383 7030 11399 31490 39747
15824 39747 45582 37304 24655 1472 -13813 -30234 -5432 -22742 -30099 -25609 -8729 23829
15812 23829 26297 29195 -7270 -35562 -23206 5987 1451 -10720 -19042 -14064 2467 39093 17223
15799 17223 -38231 -52849 -31262 2438 33790 50725 13657 15068 9639 -17687 -27755 -28822
$$ packed form
15891h678r774K175j9435j5339j1072k898P717k878K9814L8879Q723J512J5934
15878C4680l177j3299j6444q489m6835l89K0687K671k7768J5289L6629o417O752
15865f110j687k1971r369O854J5573M8K772J7654M347r461Q621J764j8087k0442
15851b9494p462n682J602K0132O864K0306K640p031J9991j3065m113k3042j5253
15838c3607J2873M88r697K052j263J059J577Q177O096Q862J0413M369K0091Q257
15824C9747N835q278j2649k3183j5285j6421K4802j7310p357M490J6880L2558
15812B3829K468K898l6465k8292J2356K9193m536j2171q322M978J6531L6626k1870
15799A7223n5454j4618K1587L3700L1352J6935l7068J411n429k7326j0068j067
$$ plain form
15787 -28822 -32309 -30188 -26158 207 7452 4545 -5882 4381 -24925 -41091 -29847 -16299 -2564
15774 -2564 20937 20394 164 -14294 -21825 -29787 -53116 -49494 -42552 -34456 -14151 11206 18529
15761 18529 18902 -14522 -17019 16151 36453 -65 -23106 -34782 -13836 -12203 -4594 36353 49014
15748 49014 36780 -2930 -47407 -66175 -42299 -15870 26030 36388 11217 -11816 -30476 -36612
15736 -36612 -32282 -73649 -41156 -3769 10867 -1355 -1631 -25133 -14386 -66 2018 -11190
15724 -11190 -25119 -13114 14894 23050 -3725 -46810 -74069 -62464 -50833 -35955 -40664 -34379
15712 -34379 -42555 -33965 -50757 -23672 -17435 -35521 -47333 -46523 -1476 4969 -9424 -32194 -25817
15699 -25817 -20697 -27981 -62680 -65393 -17694 -18420 -36103 -29919 107 21836 10006 -4376 -4974
$$ packed form
15787b8822l487K121M030K6365P245k907j0427J0263k9306j6166J1244J3548J3735
15774b564K3501n43k0230j4458p531p962k3329L622O942Q096K0305K5357P323
15761A8529L73l3424k497L3170K0302l6518k3041j1676K0946J633P609M0947J2661
15748D9014j2234l9710m4477j8768K3876K6429M1900J0358k5171k3033j8660o136
15736c6612M330m1367L2493L7387J4636j2222k76k3502J0747J4320K084j3208
15724a1190j3929J2005K8008Q156k6775m3085k7259J1605J1631J4878m709O285
15712c4379q176Q590j6792K7085O237j8086j1812Q10M5047O445j4393k2770O377
15699b5817N120p284l4699k713M7699p26j7683O184L0026K1729j1830j4382n98
$$ plain form
15686 -4974 12072 6456 -3530 3643 16966 9966 -6700 -25005 -23013 -16124 -3118 39660 78541
15673 78541 70016 33341 35777 34665 18737 32469 -1453 5958 -5168 -17214 -16051 -2450 -21656
15660 -21656 -37893 -52574 -55450 -32279 -47537 -56522 -24876 -14507 -14424 -8742 -11556 -9732 -13009
15647 -13009 -5581 -2075 29065 -324 -14321 -12890 3723 7005 -8235 -9473 -22492 -12920 -22832
15634 -22832 -11061 -4483 -12729 -27051 -15656 -20665 -47984 -44862 -21164 -21403 -20644 -28369 -31502 -27567
15620 -27567 -11926 27556 24815 22909 15632 5865 23219 17598 -25301 -45357 -8189 0 9976
15607 9976 9083 18712 29466 18709 -11891 19500 27151 6081 -5937 717 6183 4377 -11195
15594 -11195 -38665 -39336 -37874 -33598 -36830 -29980 -12544 -6910 -5770 -1102 -29945 -31038 -20569 -12092
$$ packed form
15686d974J7046n616r986P173J3323p000j6666j8305J992O889J3006M2778L8881
15673G8541q525l6675K436j112j5928J3732l3922P411j1126j2046J163J3601j9206
15660b1656j6237j4681k876K3171j5258q985L1646J0369Q3N682k814J824l277
15647a3009P428L506L1140k9389j3997J431J6613L282j5240j238j3019R572r912
15634b2832J1771O578q246j4322J1395n009k7319L122K3698k39P59p725l133L935
15620b7567J5641L9482k741j906p277r767J7354n621m2899k0056L7168Q189R976
15607I976q93R629J0754j0757l0600L1391P651k1070j2018O654N466j806j5572
15594a1195k7470o71J462M276l232O850J7436N634J140M668k8843j093J0469Q477
$$ plain form
15580 -12092 -712 399 -6328 -10475 13929 15253 -5347 -22150 -28380 -7640 14590 49226 36688
15567 36688 11056 10099 26350 31674 19618 15912 47528 31698 -10829 -26758 -23021 -22620 -21615
15554 -21615 -15604 -38190 -51209 -44824 -27118 -24565 -35355 256 2117 -5268 -24699 -37730 -68980
15541 -68980 -85176 -53616 -38944 -47310 -24288 -23970 -37903 -15803 -12803 -33928 -25252 -22562 -6090
15528 -6090 160 -19749 -55908 -36902 -10729 7012 -3098 -1004 14098 -704 -32441 -25220
15516 -25220 -5364 26808 6329 -2978 8607 14534 -14827 -51715 -76381 -47906 -54764 -75871
15504 -75871 -83868 -57352 -33529 -25335 -24490 -34680 -43853 -29597 10634 13939 6919 -13219 -8723
15491 -8723 -39711 -52016 -50524 -37841 -36827 -44553 -42229 -39768 -31536 -107 1571 -13885 -25168
$$ packed form
15580a2092J1380J111o727m147K4404J324k0600j6803o230K0740K2230L4636j2538
15567C6688k5632r57J6251N324j2056l706L1616j5830m2527j5929L737M01J005
15554b1615O011k2586j3019O385J7706K553j0790L5611J861p385j9431j3031l1250
15541f8980j6196L1560J4672q366K3022L18j3933K2100L000k1125Q676K690J6472
15528f090O250j9909l6159J9006K6173J7741j0110K094J5102j4802l1737P221
15516b5220J9856L2172k0479r307J1585N927k9361l6888k4666K8475o858k1107
15504g5871p997K6516K3823Q194Q45j0190r173J4256M0231L305p020k0138M496
15491h723l0988j2305J492J2683J014p726K324K461Q232L1429J678j5456j1283
$$ plain form
15478 -25168 -41095 -57180 -36586 -23258 -21812 -2568 17019 -26103 -35355 -31026 -44657 -42994
15466 -42994 -16570 -9097 -36239 -59752 -39178 -9957 -9998 -32129 -14809 -5476 -3668 -7355 13410
15453 13410 32185 21003 7769 27608 58120 40262 4464 -8732 -20696 -35330 -42525 -57300
15441 -57300 -91369 -80153 -57814 -44998 -29861 -6268 -13099 -10857 1871 4115 20698 22067
15429 22067 -14713 -30469 -9802 -23484 -34753 -27033 -14934 27937 37106 25596 15733 5520
15417 5520 -5657 4835 -2042 13191 18012 -10221 -16445 2664 11394 -13124 -60138 -62094 -50126
15404 -50126 -51586 -26140 11863 40450 11916 -23876 -1406 -3689 -32825 -10939 -19040 -48563
15392 -48563 -22261 16772 11366 -24199 944 11395 27144 54220 40568 35723 16727 24732
$$ packed form
15478b5168j5927j6085K0594J3328J446J9244J9587m3122r252M329j3631J663
15466d2994K6424P473k7142k3513K0574K9221m1k2131J7320R333J808l687K0765
15453A3410J8775j1182j3234J9839L0512j7858l5798j3196j1964j4634p195j4775
15441e7300l4069J1216K2339J2816J5137K3593o831K242J2728K244J6583J369
15429B2067l6780j5756K0667j3682j1269P720J2099M2871R169j1510r863j0213
15417E520j1177J0492o877J5233M821k8233o224J9109Q730k4518m7014j956J1968
15404e0126j460K5446L8003K8587k8534l5792K2470k283k9136K1886q101k9523
15392d8563K6302L9033n406l5565K5143J0451J5749K7076j3652m845j8996Q005
$$ plain form
15380 24732 19896 -6412 800 9802 26438 30069 5084 -51120 -47340 -39400 -35915 -40986 -33681
15367 -33681 2535 17872 23575 17096 5644 -326 -7488 -32721 -18499 -5315 -1268 -13287 -24495
15354 -24495 -20641 -12359 -5112 -29135 -47396 -47090 -22558 -8505 12793 13169 9208 -15217 -10706
15341 -10706 25928 65773 65497 44443 31414 27078 33096 1453 -6130 -10732 -40183 -45689 -9734
15328 -9734 -14887 -34897 -31874 -8656 -23862 -58835 -48777 -33430 -24274 -26855 -47494 -35500 -12425
15315 -12425 -11334 11075 14203 23510 5407 7007 25848 60018 68527 46359 38423 65685 59687
15302 59687 44732 13107 -17825 -41001 -33606 -15572 -14542 -27856 -56493 -71000 -67114 -56990
15290 -56990 -60008 -37610 -22851 -24005 -16396 -4835 23108 -3796 -1367 11137 13056 14305 -20087
$$ packed form
15380B4732m836k6308P212R002J6636L631k4985n6204L780P940L485n071P305
15367c3681L6216J5337N703o479j1452n970p162k5233J4222J3184M047j2019j1208
15354b4495L854Q282P247k4023j8261L06K4532J4053K1298L76l961k4425M511
15341a0706L6634L9845k76k1054j3029m336O018l1643p583m602k9451n506L5955
15328i734n153k0010L023K3218j5206l4973J0058J5347R156k581k0639J1994K3075
15315a2425J091K2409L128R307j8103J600J8841L4170Q509k2168p936K7262n998
15302E9687j4955l1625l0932k3176P395J8034J030j3314k8637j4507L886J0124
15290e6990l018K2398J4759j154P609J1561K7943k6904K429J2504J919J249l4392
$$ plain form
15277 -20087 -27483 11537 21445 17331 2502 -4123 4177 34337 52379 52020 33032 5253 9019
15264 9019 27361 9222 -16261 -11030 11063 -12399 -37043 -30273 -14045 -7624 -3996 36733 41699
15251 41699 26520 29860 27161 10862 24042 12531 -11504 -7638 2684 22746 4259 24668
15239 24668 4947 -36040 -46174 -40484 -27085 4436 -12009 -54428 -46604 -38695 -16041 -1563
15227 -1563 -22097 -19963 -11922 -44882 -34682 -16501 -25085 -30523 -1464 7769 5535 -24157 -32862
15214 -32862 -24537 -37883 -52823 -41960 -30949 15382 25014 11023 17823 24579 32330 -2968 -12211
15201 -12211 27202 38639 4522 23 14451 35297 21893 14748 -6490 -30080 -27589 -4507
15189 -4507 -21903 -30316 -37878 -61857 -93219 -75867 -23263 32664 47009 27495 1361 -32388
$$ packed form
15277b0087p396L9020R908m114j4829o625Q300L0160J8042l59j8988k7779L766
15264I019J8342j8139k5483N231K2093k3462k4644O770J6228O421L628M0729M966
15251D1699j5179L340k699j6299J3180j1511k4035L866J0322K0062j8487K0409
15239B4668j9721m0987j0134N690J3399L1521j6445m2419P824P909K2654J4478
15227a563k0534K134Q041l2960J0200J8181q584n438K9059R233k234k9692q705
15214c2862Q325j3346j4940J0863J1011M6331R632j3991O800O756P751l5298r243
15201a2211L9413J1437l4117m499J4428K0846j3404p145k1238k3590K491K3082
15189d507j7396q413p562k3979l1362J7352N2604N5927J4345j9514k6134l3749
$$ plain form
15177 -32388 -49895 -46367 -43498 669 20680 17198 26485 56892 64493 55725 35334 34809 24295
15164 24295 36398 49170 28755 -8839 -42161 -20326 -1332 27935 34082 -10688 -42266 -22424
15152 -22424 -14343 -5723 -15378 -26320 -16054 -14322 -17607 10801 14635 -20510 -42256 -52487 -61543
15139 -61543 -35503 -15008 -31628 -54981 -11493 2455 3494 -1874 3301 -10377 -3510 -5762 -27047
15126 -27047 -50019 -64180 -35306 -26371 -19472 4952 30496 -10267 -34253 -42089 -34857 -16490
15114 -16490 21062 24274 -9005 450 25432 -6189 -22233 439 8765 22971 6744 -20388
15102 -20388 -33574 -22486 3146 -19241 -21773 -17717 -10722 6114 10267 34983 55461 30801
15090 30801 3937 -14628 -41688 -51509 -32569 -27402 -33915 -20402 -22943 -33732 -41392 -15099 532
$$ packed form
15177c2388j7507L528K869M4167K0011l482R287L0407P601q768k0391n25j0514
15164B4295J2103J2772k0415l7594l3322K1835J8994K9267O147m4770l1578J9842
15152b2424Q081Q620r655j0942J0266J732l285K8408L834l5145k1746j0231r056
15139f1543K6040K0495j6620k3353M3488J3948J039n368N175j3678O867k252k1285
15126b7047k2972j4161K8874Q935O899K4424K5544m0763k3986p836P232J8367
15114a6490L7552L212l3279R455K4982l1621j6044K2672Q326J4206j6227k7132
15102b0388j3186J1088K5632k2387k532M056O995J6836M153K4716K0478k4660
15090C0801k6864j8565k7060r821J8940N167o513J3513k541j0789p660K6293J5631
$$ plain form
15077 532 2649 -28019 -27798 -15150 -5861 -29516 -42551 -43187 -22319 -40370 -43760 -37463 -16625 28893
15063 28893 40985 32616 -3183 -33697 -27367 -10214 8382 9039 32433 39005 16638 -967 12285
15050 12285 18227 32445 41620 16385 29270 25123 13184 22121 46467 29899 25735 14821 3498
15037 3498 19186 14524 15874 7620 2231 2490 120 13659 -12005 -14215 15090 19284 21527 -1574
15023 -1574 10689 9886 4409 1033 -11503 -31695 -47940 -35310 -17666 25392 25878 16430 39363
15010 39363 7085 -37127 -47227 -57760 -45194 -60588 -20224 -14242 -1830 28729 51091 48267
14998 48267 23238 -802 39284 79515 84078 81528 49314 23130 -22631 -59615 -32961 -3609
14986 -3609 1013 5021 25505 20562 8913 9553 16660 29882 29714 22073 -22173 -47863 -26174 -17547
$$ packed form
15077E32K117l0668K21J2648R289k3655j3035o36K0868j8051l390O297K0838M5518
15063B8893J2092q369l5799l0514O330J7153J8596O57K3394O572k2367j7605J3252
15050A2285N942J4218R175k5235J2885m147j1939Q937K4346j6568m164j0914j1323
15037C498J5688m662J350q254n389K59k370J3539k5664k210K9305M194K243k3101
15023a574J2263q03n477l376j2536k0192j6245J2630J7644M3058M86r448K2933
15010C9363l2278m4212j0100j0533J2566j5394M0364N982J2412L0559K2362k824
14998D8267k5029k4040M0086M0231M563k550l2214k6184m5761l6984K6654K9352
14986c609M622M008K0484m943j1649O40P107J3222j68p641m4246k5690K1689Q627
$$ plain form
14972 -17547 -2110 15230 22690 25579 25666 12125 20412 28081 31412 10749 24288 34882 36486
14959 36486 21133 -3598 -2072 -299 -1439 24841 35833 42815 13333 -7169 -21894 -34375
14947 -34375 3316 31835 33564 14382 16674 16791 13632 -10846 -17793 -10118 -15395 -21586 -29345 -36039
14933 -36039 -6825 16950 24034 33161 24230 -12110 -24390 21278 31590 28180 -1374 -22027
14921 -22027 -31137 -41108 -30841 -7013 -6943 4148 3019 4911 4497 -9417 -28444 -9127 -20257
14908 -20257 9640 45893 53760 45542 23792 44697 54364 46829 15331 22512 47195 34494 24855
14895 24855 5608 21290 39510 18429 2792 -28279 -24747 -4319 -3853 -1814 12454 10973 12766
14882 12766 4997 3733 7386 4293 -1092 -12754 -19557 -25823 -23542 -13572 15989 11796 9935 8255
$$ packed form
14972a7547J5437J7340P460K889Q7j3541Q287P669L331k0663J3539J0594J604
14959C6486j5353k4731J526J773j140K6280J0992O982k9482k0502j4725j2481
14947c4375L7691K8519J729j9182K292J17l159k4478o947P675n277o191p759o694
14933c6039K9214K3775P084R127q931l6340j2280M5668J0312l410k9554k0653
14921b2027r110r971J0267K3828P0J1091j129J892m14j3914j9027J9317j1130
14908b0257K9897L6253P867q218k1750K0905R667p535l1498P181K4683j2701r639
14895B4855j9247J5682J8220k1081j5637l1071L532K0428M66K039J4268j481J793
14882A2766p769j264L653l093n385j1662o803o266K281R970K9561m193j861j680
$$ plain form
14868 8255 -12698 -845 5468 5677 10003 2021 -5947 -18738 -4276 19888 12687 -17316 -57076
14855 -57076 -53748 -43282 -14375 -20473 -5109 11521 17201 33270 22603 3318 -19640 868
14843 868 12732 3731 5381 7033 11186 9697 -34201 -40420 -25493 -22248 -38024 -51131 -33608
14830 -33608 6424 44020 44153 42020 25801 -18476 -62835 -41193 283 17336 1552 -25361
14818 -25361 -36810 -24835 -23063 -25080 -2157 -23706 -42812 -25708 -23439 -29209 -41055 -42147 -45301
14805 -45301 -32180 20397 39416 30307 12678 -7722 6160 -3013 -27906 -45158 -22300 -9263
14793 -9263 -31891 -46685 -28117 -14193 4198 16662 36692 40244 3343 16429 21050 18600
14781 18600 22686 33889 11145 -23741 -20932 21631 34971 35589 35165 51613 79685 87825 77821
$$ packed form
14868H255k0953J1853O313K09M326p982p968j2791J4462K4164p201l0003l9760
14855e7076L328J0466K8907o098J5364J6630N680J6069j0667j9285k2958K0508
14843H68J1864r001J650J652M153j489m3898o219J4927L245j5776j3107J7523
14830c3608M0032L7596J33k133j6219m4277m4359K1642M1476J7053j5784k6913
14818b5361j1449J1975J772k017K2923k1549j9106J7104K269n770j1846j092l154
14805d5301J3121N2577J9019r109j7629k0400J3882r173k4893j7252K2858J3037
14793i263k2628j4794J8568J3924J8391J2464K0030L552l6901J3086M621k450
14781A8600M086J1203k2744l4886K809M2563J3340O18m24J6448K8072Q140j0004
$$ plain form
14768 77821 68145 12975 3933 -3463 -2256 5839 12969 10294 11258 -10817 -29858 -39628 -48134 -39757
14754 -39757 -19875 -25455 -14495 -11120 -15233 -21833 -37700 -30824 -75 6574 3465 4553 -3085
14741 -3085 18626 35430 11896 -5660 -5972 10478 -2512 10924 18109 926 -27014 -19129 -25347
14728 -25347 -20781 -15701 -37336 -41849 -58658 -62107 -65085 -46696 -17286 -13027 566 29090 32521
14715 32521 32648 7572 -51827 -36933 8405 19210 -5558 -8160 -5622 18096 28628 16248
14703 16248 -18127 -21947 -952 602 -35900 -72429 -88661 -51517 -22125 -20788 -29144 -31093 -38185
14690 -38185 -36080 -34840 -69327 -61081 -18833 -2676 -5921 -27116 -21697 16401 43605 39841 35338
14677 35338 38898 49346 71433 65055 59823 18692 10996 1225 20745 23471 10665 22225 25604
$$ packed form
14768G7821r676n5170r042p396J207Q095P130k675R64k2075j9041r770q506Q377
14754c9757J9882n580J0960L375m113o600j5867O876L0749O649l109J088p638
14741c085K1711J6804k3534j7556l12J6450j2990J3436P185j7183k7940P885o218
14728b5347M566N080k1635m513j6809l449k978J8389K9410M259J3593K8524L431
14715C2521J27k5076n9399J4894M5338J0805k4768k602K538K3718J0532j2380
14703A6248l4375l820K0995J554l6502l6529j6232L7144K9392J337q356j949p092
14690c8185K105J240l4487Q246M2248J6157l245k1195N419L8098K7204l764m503
14677C5338L560J0448K2087o378n232m1131p696r771J9520K726j2806J1560L379
$$ plain form
14664 25604 20597 19107 46136 50001 40861 54490 35468 44852 45614 74184 68250 52571 14876
14651 14876 6338 22623 36458 50073 36292 29066 22800 26839 34284 17476 17264 3967 24320
14638 24320 32967 19168 30580 30818 54193 66273 69718 38616 22879 2177 -19519 -30040
14626 -30040 -10938 -13502 -22653 -12931 -12609 -47295 -80136 -65213 -30435 10762 12543 19107 15819
14613 15819 15887 14664 23092 11340 -10057 5571 7920 -869 37391 17733 22468 18194 10212 15849
14599 15849 -4707 -17675 -21961 -19329 7641 38674 46523 29062 15715 -14528 -718 38359
14587 38359 85370 86755 46517 35040 1768 -37805 -45757 -65575 -46688 -10722 -11480 -31188
14575 -31188 -13013 -9385 1916 19177 27935 13602 -8750 -5028 36382 66314 59345 22260
$$ packed form
14664B5604n007j490K7029L865r140J3629j9022R384P62K8570n934j5679l7695
14651A4876q538J6285J3835J3615j3781p226o266M039P445j6808k12j3297K0353
14638B4320Q647j3799J1412K38K3375J2080L445l1102j5737k0702k1696j0521
14626c0040J9102k564r151R722L22l4686l2841J4923L4778M1197J781O564l288
14613A5819O8j223Q428j1752k1397J5628K349q789L8260j9658M735m274p982N637
14599A5849k0556j2968m286K632K6970L1033P849j7461j3347l0243J3810L9077
14587C8359M7011J385m0238j1477l3272l9573p952j9818J8887L5966p58j9708
14575c1188J8175L628J1301J7261Q758j4333k2352L722M1410K9932o969l7085
$$ plain form
14563 22260 -12645 21972 33863 13496 -19785 -13841 -9057 7728 7495 13606 12046 26458 21292
14550 21292 16894 23401 14527 22299 19370 -6992 -4953 5965 10713 39017 56930 62746 59503
14537 59503 44769 25064 24091 17543 -2662 2251 -9991 8286 18731 -8513 -3833 5896 29918
14524 29918 36261 -2101 -6862 4426 -6514 -16480 14561 21517 -1983 1923 7605 -16666 -31132
14511 -31132 -5191 5698 12413 26256 44898 75451 58413 24416 39117 35684 -2010 -17183
14499 -17183 -32160 -27779 -41279 -43756 6393 4118 10439 -2473 12287 26151 47644 32962
14487 32962 50325 52300 37252 42772 51948 41391 27896 29422 17297 21200 -8227 -36193 -56521
14474 -56521 -55574 -26040 -14211 -26319 -44584 -44345 -41110 -6360 -13345 -31087 -28212 -31049 -25154
$$ packed form
14563B2260l4905L4617J1891k0367l3281N944M784J6785k33O111j560J4412n166
14550B1292m398O507q874P772k929k6362K039J0918M748K8304J7913N816l243
14537E9503j4734j9705r73o548k0205M913j2242J8277J0445k7244M680R729K4022
14524B9918O343l8362m761J1288j0940r966L1041O956k3500L906N682k4271j4466
14511c1132K5941J0889O715J3843J8642L0553j7038l3997J4701l433l7694j5173
14499a7183j4977M381j3500k477N0149k275O321j2912J4760J3864K1493j4682
14487C2962J7363J975j5048N520R176j0557j3495J526j2125L903k9427k7966k0328
14474e6521R47K9534J1829j2108j8265K39L235L4750o985j7742K875k837N895
$$ plain form
14461 -25154 17065 37036 4126 -12420 -11399 -34423 -37069 6990 27331 12498 -3628 -8055
14449 -8055 -21089 -3381 -956 15386 26728 8626 -8202 16479 21046 939 -158 -19613
14437 -19613 -14203 -23088 -13846 14587 23942 1250 -29434 -24815 -43656 -28782 -42518 -36303 -46751
14424 -46751 -62648 -54425 -13617 -12690 -12169 4534 -12700 -23229 -4327 -5192 -22918 -10504 16244
14411 16244 21040 -9478 -15264 22457 11382 -5556 -2109 47739 58362 41241 12486 13760
14399 13760 -18682 -14673 -11267 -7997 -9199 -16708 -20507 -23418 3310 6451 -23379 -37082 -23125
14386 -23125 -13814 -26460 -26112 -33275 -23754 -2020 -19927 -14759 -11851 25576 43922 50543 51721
14373 51721 57965 42035 14100 -9368 -1380 -11451 -11382 -9812 10626 32621 30334 25891 15805
$$ packed form
14461b5154M2219J9971l2910j6546J021k3024k646M4059K0341j4833j6126m427
14449h055j3034J7708K425J6342J1342j8102j6828K4681M567k0107j097j9455
14437a9613N410q885R242K8433R355k2692l0684M619j8841J4874j3736O215j0448
14424d6751j5897Q223M0808R27N21J6703j7234j0529J8902q65j7726J2414K6748
14411A6244M796l0518n786L7721j1075j6938L447M9848J0623j7121k8755J274
14399A3760l2442M009L406L270j202p509l799k911K6728L141k9830j3703J3957
14386b3125R311j2646L48p163R521K1734j7907N168K908L7427J8346O621J178
14373E1721O244j5930k7935k3468P988j0071O9J570K0438K1995k287m443j0086
$$ plain form
14360 15805 14 -25210 -31178 -26766 -7081 24565 25782 -6968 3267 23862 42440 11079
14348 11079 25663 45428 40122 32236 42176 6161 -18326 -19050 -19828 -29791 -30315 -30344 -7151 -99
14334 -99 -9549 -12093 -11106 -17748 733 27304 6414 -17925 -33081 -37575 -43820 -49291 2751 33387
14320 33387 11493 25119 44106 34584 -7672 9225 9916 31807 56949 37452 12491 12444 12994
14307 12994 4105 9032 23861 34582 46601 35118 34507 41662 7808 -11713 6906 11758 -16757
14294 -16757 -21738 -33428 -16368 -20642 -35956 -20447 -7336 -15195 -1354 18575 7346 -23902
14282 -23902 -42590 -46880 -38377 -17754 -6959 -17468 -3522 17950 39492 35663 9788 -23611
14270 -23611 -16677 26499 33747 29004 -7194 -1150 27162 44658 43840 53827 37320 1940 -2101
$$ packed form
14360A5805j5791k5224n968M412J9685L1646J217l2750J0235K0595J8578l1361
14348A1079J4584J9765n306p886R940l6015k4487p24p78r963n24k9K3193P052
14334i9r450k544R87o642J8481K6571k0890k4339j5156m494o245n471N2042L0636
14320C3387k1894J3626J8987r522m2256J6897O91K1891K5142j9497k4961m7N50
14307A2994q889M927J4829J0721J2019j1483o11P155l3854j9521J8619M852k8515
14294a6757m981j1690J7060m274j5314J5509J3111p859J3841J9929j1229l1248
14282b3902j8688m290Q503K0623J0795j0509J3946K1472K1542l829k5875l3399
14270b3611O934M3176P248m743l6198O044K8312J7496q18R987j6507l5380m041
$$ plain form
14257 -2101 14878 9832 -1625 26431 5002 -19923 -24306 2999 25955 36558 22966 10739
14245 10739 -11227 -16083 16512 3209 -3608 -8564 -7795 -7448 -11065 -4538 19774 24726 23502 4163
14231 4163 -8546 12227 20368 25483 22145 19934 9937 23485 21823 10571 10986 14841 40195 66322
14217 66322 63666 40600 30910 31519 30443 17105 20429 15543 1514 17486 33734 44847 30328
14204 30328 14749 37133 48131 5435 18127 44254 55789 67018 52484 23589 7537 27618
14192 27618 27855 6665 -10154 -7931 -3123 5887 7683 19091 11991 -14737 -4604 -3047 5559
14179 5559 16876 23640 29223 33075 48272 72679 103556 73949 27269 -4252 -30056 -22989 -5221
14166 -5221 -1781 -9629 -26993 -54677 -30413 -11895 -18515 -36010 -28762 -31663 -13801 -6444 -12449
$$ packed form
14257b101J6979n046j1457K8056k1429k4925m383K7305K2956J0603j3592j2227
14245A0739k1966m856L2595j3303o817m956P69L47l617O527K4312M952j224j9339
14231D163j2709K0773Q141N115l338k211r997J3548j662j1252M15L855K5354K6127
14217F6322k656k3066r690O09j076j3338L324m886j4029J5972J6248J1113j4519
14204C0328j5579K2384J0998m2696J2692K6127J1535J1229j4534k8895j6052K0081
14192B7618K37k1190j6819K223M808R010J796J1408p100k6728J0133J557Q606
14179E559J1317O764N583L852J5197K4407L0877k9607m6680l1521k5804P067J7768
14166e221L440p848j7364k7684K4264J8518o620j7495P248k901J7862P357o005
$$ plain form
14153 -12449 -15971 -18264 -23375 -30030 -44942 -29095 -34242 -34118 -16117 689 22869 3367 -29049
14140 -29049 -12400 -20250 -57066 -38590 6001 2113 2993 9512 -16157 -4598 2207 -28474 -46943
14127 -46943 -71407 -38453 -7941 2802 -20009 -38715 -37339 -34646 -44655 -55179 -38093 -51581
14115 -51581 -30587 -9595 7819 -19425 -29436 -21894 -50105 -48671 -15667 10207 32842 23269
14103 23269 30391 43268 41406 21660 -4651 -18822 -8952 25514 28114 33902 44503 10504 -10870
14090 -10870 254 30428 36113 25732 6096 6017 -4210 28686 73569 76770 51294 13331 -5423
14077 -5423 16987 45360 54339 26874 -2011 -12221 9513 21833 41130 24564 2842 11241
14065 11241 31293 42124 6717 -7919 2880 23346 33445 40581 15878 8223 17642 17390 12416
$$ packed form
14153a2449l522k293n111o655j4912J5847n147J24J8001J6806K2180j9502l2416
14140b9049J6649p850l6816J8476M4591l888Q80O519k5669J1559O805l0681j8469
14127d6943k4464L2954L0512J0743k2811j8706J376K693j0009j0524J7086j3488
14115e1581K0994K0992J7414k7244j0011P542k8211J434L3004K5874K2635r573
14103B3269P122J2877j862j9746k6311j4171R870L4466K600N788J0601l3999k1374
14090a0870J1124L0174N685j0381j9636p9j0227L2896M4883L201k5476l7963j8754
14077e423K2410K8373Q979k7465k8885j0210K1734J2320J9297j6566k1722Q399
14065A1241K0052J0831l5407j4636J0799K0466J0099P136k4703p655R419k52m974
$$ plain form
14052 12416 14646 4735 -5430 13147 19629 4164 26135 37318 39249 44159 40840 36374 40567
14039 40567 7786 -2998 -3802 -24810 -32401 -15452 909 29756 38119 43291 51166 42342 12987
14026 12987 -2285 2642 39191 49441 49831 50854 53040 35193 -11751 -47281 -69221 -40282 -1723
14013 -1723 17381 25628 22330 6125 892 7088 15915 16470 15440 18446 31970 58525 54754 24067
13999 24067 6993 31369 4568 -17906 6065 -1380 1957 -7325 15193 52479 48843 17489
13987 17489 15046 -1154 -6785 -27466 -27997 8881 31737 26412 20310 -9138 -2507 14253 25160
13974 25160 -15376 -17962 -19324 3570 35504 32082 6705 2952 2742 -15620 -17122 -24326 -21120
13961 -21120 -44935 -27780 5710 -4221 -22822 7437 39110 28375 28665 41710 69215 49543
$$ packed form
14052A2416K230r911j0165J8577O482j5465K1971J1183J931M910l319m466M193
14039D0567l2781j0784q04k1008p591J6949J6361K8847Q363N172P875q824k9355
14026A2987j5272M927L6549J0250L90J023K186j7847m6944l5530k1940K8939L8559
14013a723J9104Q247l298j6205n233O196Q827N55j030L006J3524K6555l771l0687
13999B4067j7074K4376k6801k2474K3971p445L337r282K2518L7286l636l1354
13987A7489k443j6200n631k0681n31L6878K2856n325o102k9448O631J6760J0907
13974B5160m0536k586j362K2894L1934l422k5377l753k10j8362j502p204L206
13961b1120k3815J7155L3490r931j8601L0259L1673j0735K90J3045K7505j9672
$$ plain form
13949 49543 16530 9467 -10600 9420 7669 34414 62752 72467 56574 50343 32941 19830
13937 19830 12824 41709 52932 61528 55392 39926 5062 -8464 -3831 -32566 -27958 1863 21272
13924 21272 9011 880 4715 -7149 -34248 -15143 20450 39364 44953 48416 12327 -7705
13912 -7705 21955 23889 17909 11252 28489 31730 22737 25849 21234 19204 24650 22934 16590 2018
13898 2018 5501 -8825 -5592 2261 -8911 1441 -3073 4565 3589 17775 38318 41589 16932
13885 16932 -18240 -24480 -32881 -43633 -31046 -28270 -40322 -20837 -33047 -19260 28994 45706
13873 45706 64942 77911 58711 56139 44020 14981 10377 12399 34435 29942 -1756 -1308 1814
13860 1814 -5194 -9665 5228 -7125 -13206 -16212 -20382 17270 38216 31791 22344 29302 6695
$$ packed form
13949D9543l3013p063k0067K0020j751K6745K8338R715j5893o231j7402j3111
13937A9830p006K8885J1223Q596o136j5466l4864j3526M633k8735M608K9821J9409
13924B1272j2261q131L835j1864k7099J9105L5593J8914N589L463l6089k0032
13912g705K9660J934n980o657J7237L241q993L112m615k030N446j716o344j4572
13898B018L483j4326L233P853j1172J0352m514P638r76J4186K0543L271k4657
13885A6932l5172o240q401j0752J2587K776j2052J9485j2210J3787M8254J6712
13873D5706J9236J2969j9200k572j2119k9039m604K022K2036m493l1698M48L122
13860A814p008m471J4893j2353o081l006m170L7652K0946o425r447O958k2607
$$ plain form
13847 6695 14940 25957 27141 17866 13060 9039 10963 22894 38884 48614 39134 29494 45993 75778
13833 75778 72361 62964 27758 28368 55061 50117 54479 38287 19731 6186 25085 47590 40358
13820 40358 32652 3305 -6519 -2840 -14788 -43438 -50177 -49474 -36026 -19738 -27530 -26860 -32551 -4823
13806 -4823 4642 46196 2204 -54397 -38611 -18620 826 -23545 -38533 -24889 -16033 11348
13794 11348 9271 -2274 -8849 3022 -6650 -25890 -16402 -6470 -5449 -25127 -19760 7929 -1872
13781 -1872 27713 6394 12403 46370 59441 45937 41972 33313 6561 -8967 1211 2472 10764
13768 10764 10507 -27157 -19991 -20125 -19153 -1628 42899 35946 16766 -15698 -31581 -23137 -4961
13755 -4961 1533 485 -1265 -5348 23416 39909 27964 18209 -5545 -2569 -9234 -606 14060
$$ packed form
13847F695Q245J1017J184r275m806m021J924J1931J5990R730r480r640J6499K9785
13833G5778l417r397l5206O10K6693m944M362j6192j8556j3545J8899K2505p232
13820D0358p706k9347r824L679j1948k8650o739P03J3448J6288p792O70n691K7728
13806d823R465M1554m3992n6601J5786J9991J9446k4371j4988J3644Q856K7381
13794A1348k077j1545o575J1871r672j9240R488R932J021j9678N367K7689r801
13781a872K9585k1319O009L3967J3071j3504l965q659k6752j5528J0178J261Q292
13768A0764k57l7664P166j34R72J7525M4527o953j9180l2464j5883Q444J8176
13755d961O494j048j750m083K8764J6493j1945r755k3754K976o665Q628J4666
$$ plain form
13742 14060 -3646 6669 -3916 -5544 18177 -5837 -27412 -7112 3963 8252 3706 5610
13730 5610 13641 566 3237 24739 39811 14278 -3761 -25338 -13012 524 2425 29640
13718 29640 13432 11193 -16138 -25978 -11506 -9918 -29679 -38617 12311 34540 18797 18919 8936
13705 8936 5599 9213 6442 9134 28450 44271 15791 -15576 -2851 33346 53745 32987 5422
13692 5422 3585 16550 42428 70439 53127 18838 24648 20278 16175 2688 -9860 -26031 -34604
13679 -34604 -5262 -16237 -23368 -25568 6508 17727 -19399 6933 17072 6406 21274 25605
13667 25605 11108 -4408 -7967 -2314 3854 -5233 -12566 -31795 -42488 -10510 -19767 -36280 -23283
13654 -23283 4633 -5031 -18370 10080 -4810 -9472 -16727 16400 18627 -4430 -18615 -17449 6392
$$ packed form
13742A4060j7706J0315j0585j628K3721k4014k1575K0300J1075M289m546J904
13730E610Q031j3075K671K1502J5072k5533j8039k1577J2326J3536J901K7215
13718B9640j6208k239k7331r840J4472J588j9761q938N0928K2229j5743J22r983
13705H936l337L614k771K692J9316J5821k8480l1367J2725L6197K0399k0758k7565
13692E422j837J2965K5878K8011j7312l4289N810m370m103j3487j2548j6171q573
13679c4604K9342j0975p131k200L2076J1219l7126K6332J0139j0666J4868M331
13667B5605j4497j5516l559N653O168r087p333j9229j0693L1978r257j6513J2997
13654b3283K7916r664j3339K8450j4890m662p255L3127K227k3057j4185J166K3841
$$ plain form
13641 6392 6766 -8045 1254 19345 13980 12538 31244 32098 6726 11368 28176 39772 12298
13628 12298 4017 9992 23710 39581 39128 45373 42846 34602 39528 36247 28454 38059 48418 35858
13614 35858 31328 1057 -24077 -2353 20523 35857 40127 26615 -6726 -27223 -11791 -6515
13602 -6515 -26003 -32588 -28584 -27866 -18318 27440 47324 52069 53718 53047 51467 66696 73207 42782
13588 42782 806 -31400 -52892 -50821 -39682 -45163 -22776 -13273 -33863 -38843 -23882 19362
13576 19362 52157 82869 65969 5886 6934 21468 16795 21842 37313 40701 24099 1525
13564 1525 10340 12363 4353 5067 27113 15976 -22238 -17239 -7340 30496 60726 54930 78470
13551 78470 85401 82737 80142 74402 50118 27421 28137 5659 -21775 -5087 -821 -14534 -44714
$$ packed form
13641F392L74j4811R299J8091n365j442J8706Q54k5372M642J6808J1596k7474
13628A2298q281N975J3718J5871m53O245k527q244M926l281p793R605J0359j2560
13614C5858m530l0271k5134K1724K2876J5334M270j3512l3341k0497J5432N276
13602f515j9488o585M004P18R548M5758J9884M745J649o71j580J5229O511l0425
13588D2782m1976l2206k1492K071J1139n481K2387R503k0590m980J4961M3244
13576A9362L2795L0712j6900o0083J048J4534m673N047J5471L388j6602k2574
13564A525Q815K023q010P14K2046j1137l8214M999R899L7836L0230n796K3540
13551G8470O931k664k595n740k4284k2697P16k2478k7434J6688M266j3713l0180
$$ plain form
13538 -44714 -65561 -10975 41838 47783 30473 8684 14213 3736 487 -7977 -12159 -27054 -16123
13525 -16123 19810 26866 31002 18856 -10700 -17466 -32686 -24902 -16239 -26933 -10042 7667 -1617
13512 -1617 -12324 -8239 -4321 14577 17642 13833 2650 -16578 -8673 6007 36646 19069 -13186
13499 -13186 -37305 -31195 -1066 -17318 -13992 -29996 -46304 -29918 -4093 6428 -8557 -5620
13487 -5620 -8632 -181 30130 28463 1571 18524 25560 45469 36283 20713 -39048 -52332 10969
13474 10969 17328 18259 39491 56114 47534 33009 3565 3379 46202 83572 60751 54605 49803
13461 49803 50328 45656 47899 60002 48960 19933 2275 -20773 -18549 3997 19218 14495 19060
13448 19060 24149 6372 6177 -5937 19196 30141 29420 29865 17174 15665 10781 31687 23974 24292
$$ packed form
13538d4714k0847N4586N2813N945j7310k1789N529j0477l249q464m182j4895J0931
13525a6123L5933P056M136j2146k9556o766j5220P784Q663j0694J6891J7709r284
13512a617j0707M085L918J8898L065l809j1183j9228P905J4680L0639j7577l2255
13499a3186k4119O110L0129j6252L326j6004j6308J6386K5825J0521j4985K937
13487e620l012Q451L0311j667k6892J6953P036J9909r186j5570n9761j3284O3301
13474A0969O359R31K1232J6623q580j4525k9444j86M2823L7370k2821o146m802
13461D9803N25m672K243J2103j1042k9027j7658k3048K224K2546J5221m723M565
13448A9060N089j7777j95j2114K5133J0945p21M45j2691j509m884K0906p713L18
$$ plain form
13434 24292 6838 17895 4180 12166 -7977 -26912 -14324 -4714 -642 9117 13021 27638 21215
13421 21215 39753 18694 22462 28097 -13204 -13150 -20940 -31809 -31443 -15267 -1130 25440 23524
13408 23524 10900 9085 11954 -2832 -14470 -20021 -27746 -22940 -1016 13238 -13992 -33071 -9882
13395 -9882 5608 36675 52888 59634 66761 67350 56027 26754 27622 26067 1856 -9113 -31982
13382 -31982 -47927 -23468 -26829 -20231 16427 63903 89827 64455 30433 22724 -25128 -25197 -6942
13369 -6942 22256 18156 28581 25311 9482 22252 9792 5995 3248 1434 -419 -20914 -15812
13356 -15812 31222 10228 7570 -12961 -21850 12971 51374 85263 76458 32037 17045 73390
13344 73390 54040 20016 1397 17456 40546 57091 42263 36708 31608 45079 65881 23020
$$ packed form
13434B4292j7454J1057j3715P986k0143j8935J2588R610M072R759L904J4617o423
13421B1215J8538k1059L768N635m1301N4p790j0869L66J6176J4137K6570j916
13408B3524j2624j815K869j4786j1638n551p725M806K1924J4254k7230j9079K3189
13395i882J5490L1067J6213O746P127N89j1323k9273Q68j555k4211j0969k2869
13382c1982j5945K4459l361O598L6658M7476K5924k5372l4022p709m7852o9J8255
13369f942K9198m100J0425l270j5829J2770j2460l797k747j814j853k0495N102
13356a5812M7034k0994k658k0531q889L4821L8403L3889q805m4421j4992N6345
13344G3390j9350l4024j8619J6059K3090J6545j4828n555n100J3471K0802m2861
$$ plain form
13332 23020 -10458 19502 27319 34052 251 -13908 3224 26760 16923 13283 19232 26958 34085
13319 34085 29229 23255 -5218 -13887 -11828 13673 6229 3022 22714 35985 23996 12827 15328
13306 15328 10079 -18598 -21061 -12637 33373 42575 38255 48444 56216 38865 34196 26293 39757
13293 39757 20823 -3114 -18277 -47953 -70047 -50836 -22350 -11961 6791 19751 21558 16144
13281 16144 -9419 -35458 -19588 -5448 27493 28092 15025 22575 15930 -244 -19372 -24314 -34463
13268 -34463 -15342 -8675 -1491 -10529 -32663 -19052 36099 46077 12099 21445 14646 -11022 -13086
13255 -13086 -11900 4759 37317 51675 41678 28358 33469 27389 36030 24711 -14845 3139 17762
13242 17762 6545 15525 25211 39152 25757 7453 -20787 -18177 -4336 13305 10198 -13076
$$ packed form
13332B3020l3478K9960P817O733l3801j4159J7132K3536r837l640N949P726P127
13319C4085m856n974k8473q669K059K5501p444l207J9692J3271j1989j1169K501
13306A5328n249k8677k463Q424M6010R202m320J0189P772j7351m669p903J3464
13293C9757j8934k3937j5163k9676k2094J9211K8486J0389J8752J2960J807n414
13281A6144k5563k6039J5870J4140L2941N99j3067P550o645j6174j9128m942j0149
13268c4463J9121O667P184r038k2134J3611N5151R978l3978R346o799k5668k064
13255a3086J186J6659L2558J4358r997j3320N111o080Q641j1319l9556J7984J4623
13242A7762j1217Q980R686J3941j3395j8304k8240K610J3841J7641l107k3274
$$ plain form
13230 -13076 -4204 -10057 -22539 -23369 -12860 -6956 -17785 -14457 -3680 -2097 35386 89582 54786
13217 54786 10806 17864 26364 23542 22889 32494 51369 53414 51487 41624 47148 71023 68489 47748
13203 47748 39309 34206 37859 36764 38030 45169 59168 55075 24201 10334 -10929 -17966 12419
13190 12419 44261 44848 39506 23568 621 -2184 9586 19434 28875 39273 34733 41886 51440
13177 51440 38109 36581 18587 -2218 23736 59655 54510 35805 9267 -8719 -5266 -22831
13165 -22831 -36764 -22354 -2635 -1474 4113 7656 -26128 -30133 -13435 -7339 -13851 -11236 -43365
13152 -43365 -75026 -60001 -23715 14152 13899 6776 391 16961 23110 25502 17894 2987 -10407
13139 -10407 -16732 -3745 -10417 -16510 11598 12860 -6079 -22022 -6490 35649 64514 54879 41010
$$ packed form
13230a3076Q872n853j2482q30J0509N904j0829L328J0777J583L7483N4196l4796
13217E4786m3980P058Q500k822o53R605J8875K045j927r863N524K3875k534k0741
13203D7748q439n103L653j095J266P139J3999m093l0874j3867k1263p037L0385
13190A2419L1842N87n342j5938k2947k805J1770R848R441J0398m540P153R554
13177E1440j3331j528j7994k0805K5954L5919n145j8705k6538j7986L453j7565
13165b2831j3933J4410J9719J161N587L543l3784m005J6698O096o512K615l2129
13152d3365l1661J5025L6286L7867k53p123o385J6570O149K392p608j4907j3394
13139a0407o325J2987o672o093K8108J262j8939j5943J5532M2139K8865r635j3869
$$ plain form
13126 41010 33674 31128 9620 21646 38323 26373 13398 32530 14781 17646 53922 40862
13114 40862 30480 6431 9840 10068 14517 21711 17031 17992 14771 20954 24521 10427 -6287 -19430
13100 -19430 -33794 -18524 -8283 -37119 -37558 -11391 -10506 -122 1383 -11366 -32268 -53479 -51342
13087 -51342 -15407 9048 7487 31142 56011 46740 27109 15117 10756 9487 -394 19411 36975
13074 36975 69234 81184 43413 8783 12946 1497 11760 42444 21153 25388 58639 94767
13062 94767 96392 50816 43442 39027 27484 32087 43877 54642 73157 49434 21911 12451 4979
13049 4979 8559 -4078 -6197 21346 32631 15660 37993 57246 52458 62843 47023 29413
13037 29413 58265 67858 88002 85282 85321 65834 52034 31284 41486 64399 56378 14017 15202
$$ packed form
13126D1010p336k546k1508J2026J6677j1950j2975J9132j7749K865L6276j3060
13114D0862j0382k4049L409K28M449P194m680R61l221O183L567j4094j6714j3143
13100a9430j4364J5270J0241k8836m39K6167Q85J0384J505j2749k0902k1211K137
13087e1342L5935K4455j561K3655K4869r271j9631j1992m361j269r881J9805J7564
13074C6975L2259J1950l7771l4630M163j1449J0263L0684k1291M235L3251L6128
13062I4767J625m5576p374m415j1543M603J1790J0765J8515k3723k7523r460p472
13049D979L580j2637k119K7543J1285j6971K2333J9253m788J0385j5820j7610
13037B9413K8852R593K0144k720L9j9487j3800k0750J0202K2913q021m2361J185
$$ plain form
13024 15202 -6602 1406 19185 29425 20502 -21272 -11506 9619 -6070 -7009 9932 30799 44232
13011 44232 31069 12156 -1499 16834 33706 41801 18956 17609 47644 62573 58185 52428
12999 52428 30825 9180 26661 49788 79616 106727 97654 57686 27565 6725 13758 26882
12987 26882 59999 68103 62303 61042 23771 21022 36083 7015 -4729 8421 9568 15080 -1562
12974 -1562 -17074 -10801 7908 20044 40868 15528 18542 18702 -506 4681 2873 334 -2614
12961 -2614 6141 29227 37074 41149 41281 20824 9924 28888 43721 43175 35412 40654 54393 55338
12947 55338 38597 41213 40518 48564 45959 29393 32590 32991 22277 1255 -3552 21684 28771 27329
12933 27329 60904 40855 25604 21370 31282 40266 24645 -3056 -13518 -11965 8017 14037 19172
$$ packed form
13024A5202k1804Q008J7779J0240q923m1774R766K1125j5689r39J6941K0867J3433
13011D4232j3163j8913j3655J8333J6872Q095k2845j347L0035J4929m388n757
12999E2428k1603k1645J7481K3127K9828K7111r073l9968l0121k0840P033J3124
12987B6882L3117Q104n800j261l7271k749J5061k9068j1744J3150J147N512j6642
12974a562j5512O273J8709J2136K0824k5340L014J60j9208N187j808k539k948
12961b614Q755K3086P847M075J32k0457j0900J8964J4833n46p763N242J3739R45
12947E5338j6741K616o95Q046k605j6566L197M01j0714k1022m807K5236P087j442
12933B7329L3575k0049j5251m234R912Q984j5621k7701j0462J553J9982O020N135
$$ plain form
12920 19172 23655 22344 2454 12775 50588 49905 67103 69441 21451 6302 16325 40057 42839
12907 42839 6595 1680 10049 13622 27113 37177 48482 36397 29522 26120 11327 22981 15948
12894 15948 28737 57155 72792 65674 56819 76989 60797 35385 -7547 -10499 31353 29093
12882 29093 12416 -19188 -820 24914 21061 18380 15233 7848 13205 42370 38913 31996 5817
12869 5817 20157 20705 24121 38242 65427 71391 79487 104105 100252 106499 106738 74523 73801 59392
12855 59392 32979 19785 23774 33373 36974 4462 21351 36072 23728 23903 43196 66951 88273
12842 88273 50630 37030 48722 39114 64466 67662 62613 71052 87676 100483 89913 39571
12830 39571 27796 19255 19301 25367 38575 47891 64614 68785 64622 66184 62318 69173 41889 17728
$$ packed form
12920A9172M483j311j9890J0321L7813o83J7198K338m7990j5149J0023K3732K782
12907D2839l6244m915Q369L573J3491J0064J1305j2085o875l402j4793J1654p033
12894A5948J2789K8418J5637p118q855K0170j6192k5412m2932k952M1852k260
12882B9093j6677l1604J8368K5734l853k681l147p385N357K9165l457o917k6179
12869E817J4340N48L416J4121K7185N964Q096K4618l853O247K39l2215p22j4409
12855E9392k6413j3194L989R599L601l2512J6889J4721j2344J75J9293K3755K1322
12842H8273l7643j3600J1692r608K5352L196n049Q439J6624J2807j0570n0342
12830C9571j1775q541M6O066J3208R316J6723M171m163J562l866O855k7284k4161
$$ plain form
12816 17728 24311 41705 66849 84789 79048 80783 74557 46710 32665 63104 57335 33703 15501
12803 15501 21017 49353 35617 8492 20254 18775 39362 55690 66774 77558 61028 45449
12791 45449 19150 7865 15214 41336 53731 69321 63177 38869 24027 11352 6849 29884
12779 29884 14312 28002 27388 28535 21046 29375 38183 45742 32378 50864 70767 64459 70344
12766 70344 33619 -11110 -32018 11170 80058 94819 85878 53607 14407 14435 30932 47906
12754 47906 45510 44478 34631 22786 25210 20745 10528 13047 923 37613 43059 17612 7058
12741 7058 23973 26500 42263 62126 61217 69474 94512 68225 31905 40164 47640 44091 31971
12728 31971 31718 32238 77651 83161 62279 31115 35746 42874 33721 55436 70916 38338 24724
$$ packed form
12816A7728O583J7394K5144J7940n741J735o226k7847j4045L0439n769k3632j8202
12803A5501N516K8336j3736k7125J1762j479K0587J6328J1084J0784j6530j5579
12791D5449k6299j1285P349K6122J2395J5590o144k4308j4842j2675m503K3035
12779B9884j5572J3690o14J147p489Q329Q808P559j3364J8486J9903o308N885
12766G0344l6725m4729k0908M3188O8888J4761q941l2271l9200K8J6497J6974
12754D7906k396j032r847j1845K424m465j0217K519j2124L6690N446k5447j0554
12741G058J6915K527J5763J9863r09Q257K5038k6287l6320Q259P476l549j2120
12728C1971k53N20M5413N510k0882l1164M631P128r153K1715J5480l2578j3614
$$ plain form
12715 24724 48322 59260 60964 54244 20527 5687 32290 13748 26241 21933 16484 51115
12703 51115 72381 55617 49910 63834 54676 61693 65694 74489 102924 104837 96375 82307 105570
12690 105570 111398 84919 55588 52034 46352 2981 15048 25413 44538 47463 37837 26934
12678 26934 45967 64867 42698 41833 52511 58770 49644 79080 87503 86735 71885 76828 77068 61316
12664 61316 46206 32460 30900 67413 122024 151679 150401 164758 201733 226582 256572 309798
12652 309798 321853 368465 441393 492878 580188 675316 745640 782374 810478 805016 700440
12641 700440 576240 488848 428259 347554 282380 211723 164544 141781 148114 147595 125626 116830
12629 116830 123106 124790 102331 131308 153427 129834 103802 107003 86204 65887 85430 114413
$$ packed form
12715B4724K3598J0938J704o720l3717j4840K6603j8542J2493m308n449L4631
12703E1115K1266j6764n707J3924r158P017M001Q795K8435J913q462j4068K3263
12690A05570N828k6479k9331l554n682m3371J2067J0365J9125K925r626j0903
12678B6934J9033J8900k2169q65J0678O259r126K9436Q423p68j4850M943K40j5752
12664F1316j5110j3746j560L6513N4611K9655j278J4357L6975K4849K9990N3226
12652C09798J2055M6612P2928N1485Q7310R5128P0324L6734K8104n462j04576
12641G00440j24200q7392o0589q0705o5174p0657m7179k2763O333n19k1969q796
12629A16830O276J684k2459K8977K2119k3593k6032L201k0799k0317J9543K8983
$$ plain form
12617 114413 125995 96336 82012 106273 136548 115423 115298 124886 168272 219198 232451 201171
12605 201171 136787 111089 88636 72750 60773 82972 74550 53496 44615 52375 73624 83235
12593 83235 77468 58335 88797 106357 91512 79419 77568 85500 73486 81279 91277 95360 117032
12580 117032 122412 103747 89322 90422 77577 61414 36619 51030 81204 86238 91505 142608
12568 142608 147314 145240 134305 137821 161893 192090 203453 196867 125565 72807 50771 29441
12556 29441 26976 44354 63665 92043 76160 74619 67274 75249 89944 70986 63848 67905 78250
12543 78250 93625 84711 72840 63367 87373 92220 90887 61110 44730 36939 34319 61202 76679
12530 76679 55271 49042 39250 69877 116063 122225 134139 128160 107519 99356 112227 91799 120923
$$ packed form
12617A14413J1582k9659j4324K4261L0275k1125j25R588M3386N0926J3253l1280
12605B01171o4384k5698k2453j5886j1977K2199q422k1054q881P760K1249R611
12593H3235n767j9133L0462J7560j4845j2093j851P932j2014P793R998M083K1672
12580A17032N380j8665j4425J100j2845j6163k4795J4411L0174N034N267N1103
12568A42608M706k074j0935L516K4072L0197J1363o586p1302n2758k2036k1330
12556B9441k465J7378J9311K8378j5883j541p345P975J4695j8958p138M057J0345
12543G8250J5375q914j1871r473K4006M847j333k9777j6380p791k620K6883J5477
12530G6679k1408o229r792L0627M6186O162J1914n979k0641q163J2871k0428K9124
$$ plain form
12517 120923 144829 136760 158264 146791 113264 92701 111161 127973 117095 88913 80276 102281
12505 102281 95047 82117 83795 76599 64013 67113 52579 38893 52644 68500 68711 69338 74700
12492 74700 67389 68613 70193 63477 63991 67122 78838 68259 70264 50688 68239 81685 104578
12479 104578 113552 113419 109464 83306 61467 33482 19605 38792 60869 38811 46982 43808 82805
12466 82805 117147 109456 94713 122408 127198 101075 100565 125597 107053 88762 107977 109393 103310
12453 103310 132344 153765 161872 177938 160958 142389 118660 88453 117135 127815 110456 134256
12441 134256 141260 140360 134192 107644 88597 91174 106199 116985 154004 154307 134536 172325 198049
12428 198049 185498 201275 203296 183423 191168 179064 167606 178615 166154 149716 156231 152369
$$ packed form
12517A20923K3906q069K1504j1473l3527k0563J8460J6812j0878k8182q637K2005
12505A02281p234j2930J678p196j2586L100j4534j3686J3751J5856K11O27N362
12492G4700p311J224J580o716N14L131J1716j0579K005j9576J7551J3446K2893
12479A04578Q974j33l955k6158k1839k7985j3877J9187K2077k2058Q171l174L8997
12466H2805L4342p691j4743K7695M790k6123n10K5032j8544j8291J9215J416o083
12453A03310K9034K1421Q107J6066j6980j8569k3729l0207K8682J0680j7359K3800
12441A34256P004r00o168k6548j9047K577J5025J0786L7019L03j9771L7789K5724
12428A98049j2551J5777K021j9873P745j2104j1458J1009j2461j6438O515l862
$$ plain form
12416 152369 147182 168874 138119 109231 123437 128067 128548 123336 136080 134715 126835 154554 135712
12403 135712 114485 111232 116750 125628 178580 200240 171472 130464 131395 126456 109415 89618 86598
12390 86598 108194 108909 119189 145575 115048 88806 91638 87977 115349 142077 129724 128514 111705
12377 111705 119498 130565 117082 79392 58026 73302 80741 88665 105852 98637 122399 128983
12365 128983 124609 101406 108261 144307 146895 126060 117957 132497 124068 111324 113980 120138 96080
12352 96080 119463 129811 115619 112159 100152 118512 130752 152967 183429 157958 119514 98675
12340 98675 86407 80923 94526 114457 123267 97405 107703 155649 152536 111711 63097 70820
12328 70820 94404 123510 161347 172368 198172 252292 265591 267415 282473 265349 263979 263273
$$ packed form
12416A52369n187K1692l0755k8888J4206M630M81n212J2744j365p880K7719j8842
12403A35712k1227l253N518Q878N2952K1660k8768m1008R31m939j7041j9797l020
12390H6598K1596P15J0280K6386l0527k6242K832l661K7372K6728j2353j210j6809
12377A11705P793J1067j3483l7690k1366J5276P439P924J7187p215K3762O584
12365A28983m374k3203O855L6046K588k0835q103J4540q429j2744K656O158k4058
12352I6080K3383J0348j4192l460j2007J8360J2240K2215L0462k5471l8444k0839
12340I8675j2268n484J3603J9931Q810k5862J0298M7946l113m0825m8614P723
12328G0820K3584K9106L7837J1021K5804N4120J3299J824J5058j7124j370p06
$$ plain form
12316 263273 278180 298565 312363 312121 300804 309101 316201 314624 311076 310411 299568 296297 316958
12303 316958 304466 310882 319238 333957 295045 305717 358235 377736 361009 333657 335274 351178
12291 351178 368022 364725 388357 410648 416550 436604 439077 421031 404493 420555 424248 434545
12279 434545 437686 455100 458064 460373 457719 457268 476620 523798 531364 530927 545670 563253 573460
12266 573460 589782 601529 613311 646998 684439 702128 717930 723406 747132 796639 820735 851060
12254 851060 897750 944131 977636 1020733 1033291 1081413 1143926 1204741 1286651 1382802 1447186
12243 1447186 1504880 1562106 1645616 1758166 1911658 2045747 2188896 2391093 2599950 2838503
12233 2838503 3109280 3389699 3676093 3960109 4246624 4540330 4870751 5309328 5939041
$$ packed form
12316B63273J4907K0385J3798k42j1317Q297P100j577l548o65j0843l271K0661
12303C16958j2492O416Q356J4719l8912J0672N2518J9501j6727k7352J617J5904
12291C51178J6844l297K3632K2291N902K0054K473j8046j6538J6062L693J0297
12279D34545L141J7414K964K309k654m51J9352M7178P566m37J4743J7583J0207
12266E73460J6322J1747J1782L3687L7441J7689J5802N476K3726M9507K4096L0325
12254H51060M6690M6381L3505M3097J2558M8122O2513O0815Q1910R6151O4384
12243A447186N7694N7226Q3510J12550J53492J34089J43149K02197K08857K38553
12233B838503K70777K80419K86394K84016K86515K93706L30421M38577O29713
$$ plain form
12224 5939041 6749079 7707530 8837969 10206941 11787922 13618271 15673128 18072752
12216 18072752 20944290 24533192 29195571 35501598 44140912 55845571 71084845 89445100
12208 89445100 109344540 127858578 141296693 146532414 142184541 129315468 110835740
12201 110835740 90437976 71133108 54741038 41847391 32184572 25177502 20126511
12194 20126511 16520465 13915113 12002084 10506894 9280401 8249613 7295795 6431847
12186 6431847 5646686 5023261 4492150 4053041 3716630 3441168 3241152 3058105 2882920
12177 2882920 2661666 2409229 2142331 1936339 1694905 1505614 1364486 1244169 1113852
12168 1113852 999761 904697 842750 792243 746322 717169 673171 655883 605561 587608 568741
$$ packed form
12224E939041Q10038R58451J130439J368972J580981J830349K054857K399624
12216A8072752K871538L588902M662379O306027Q639314J1704659J5239274J8360255
12208H9445100J9899440J8514038J3438115N235721m347873j2869073j8479728
12201A10835740k0397764j9304868j6392070j2893647r662819p007070n050991
12194B0126511l606046k605352j913029j495190j226493j030788r53818q63948
12186F431847p85161o23425n31111m39109l36411k75462k00016j83047j75185
12177B882920k21254k52437k66898k05992k41434j89291j41128j20317j30317
12168A113852j14091r5064o1947n0507m5921k9153m3998j7288n0322j7953j8867
$$ plain form
12157 568741 531186 486120 456271 442829 426890 414284 408081 384485 345246 359339 353171 356291
12145 356291 343706 336552 334595 298323 237129 221870 220332 230523 239738 243924 204879 166944
12133 166944 120649 130836 155668 159798 176244 148721 130719 120264 129892 139734 105429 70528
12121 70528 73404 69540 77815 120731 119404 96201 90356 83069 75631 68599 64067 72240 81535 46055
12107 46055 36243 48106 51058 75630 117974 128705 147359 188044 181738 192537 189760 213359
12095 213359 214041 211876 224224 199823 207723 234969 227289 211199 210966 223045 195265 173805 183018
12082 183018 187768 131864 120646 145571 170252 147598 146999 128385 113151 98260 104920 77596
12070 77596 67261 88545 73032 80577 48697 26396 41376 63635 109347 109105 107367 83426
$$ packed form
12157E68741l7555m5066k9849j3442j5939j2606o203k3596l9239J4093o168L120
12145C56291j2585p154j957l6272o1194j5259j538J0191R215M186l9045l7935
12133A66944m6295J0187K4832M130J6446k7523j8002j0455R628R842l4305l4901
12121G0528K876l864Q275M2916j327k3203n845p287p438p032m532Q173R295l5480
12107D6055r812J1863K952K4572M2344J0731J8654M0685o306J0799k777K3599
12095B13359O82k165J2348k4401P900K7246p680j6090k33J2079k7780k1460R213
12082A83018M750n5904j1218K4925K4681k2654n99j8614j5234j4891O660k7324
12070G7596j0335K1284j5513P545l1880k2301J4980K2259M5712k42j738k3941
$$ plain form
12058 83426 72790 72165 67812 78033 87745 92611 67238 37249 17250 17581 29078 60737 76371
12045 76371 51960 41261 10473 12975 4573 -775 -3293 -7587 -13694 30509 54474 37458 29279
12032 29279 47143 67754 74047 39937 35438 17485 9842 -5989 7745 37188 61092 80874
12020 80874 54128 14209 -543 27316 41076 41147 11723 -38662 -47599 -5942 -11204 -60593 -68380
12007 -68380 -36657 -46406 -68220 -59114 -23638 18779 24609 28530 48700 81332 77649 49654 31333
11994 31333 11787 15709 23038 10309 -33975 -39254 -34005 -7063 9823 23861 29527 11781 -27738
11981 -27738 -23831 -23081 -5599 29437 36404 33913 54694 66709 70712 60784 41980 44366 57431
11968 57431 52335 55457 26135 -6592 -29190 -8008 -4177 -1521 -16887 -17976 -182 8487 9435
$$ packed form
12058H3426j0636o25m353J0221R712M866k5373k9989j9999L31J1497L1659J5634
12045G6371k4411j0699l0788K502q402n348k518m294o107M4203K3965j7016q179
12032B9279J7864K0611O293l4110m499j7953p643j5831J3734K9443K3904J9782
12020H0874k6746l9919j4752K7859J3760P1k9424n0385q937M1657n262m9389p787
12007f8380L1723r749k1814R106L5476M2417N830L921K0170L2632l683k7995j8321
11994C1333j9546L922P329j2729m4284n279N249K6942J6886J4038N666j7746l9519
11981b7738L907P50J7482L5036O967k491K0781J2015M003r928j8804K386J3065
11968E7431n096L122k9322l2727k2598K1182L831K656j5366j089J7794Q669R48
$$ plain form
11955 9435 -3574 14639 17814 -9676 -6409 -6755 -6244 5353 25334 46560 42110 2975 -27557
11942 -27557 -33460 -43761 -61843 -39419 -509 11052 31134 34194 15553 28533 17610 13606
11930 13606 -12003 -34390 -23216 7572 12703 1237 -24015 -8696 -14318 -7152 -6620 -16533 -16041
11917 -16041 928 -12720 6843 18020 24144 1187 -686 33039 66839 47595 41874 24060
11905 24060 14989 -8163 -796 -21791 -4994 -10973 -12517 -9810 -1113 -20930 -30646 -3952 13018
11892 13018 31011 12459 -18195 -23220 -28659 -24840 -17674 -1083 7113 9888 37531 32466 24115
11879 24115 4891 8854 22197 38907 18090 12911 -8378 3781 10166 20270 33717 42021
11867 42021 31241 22291 29426 20736 -116 -10010 6356 -10108 -37257 -22681 -3662 -907 17540
$$ packed form
11955I435j3009J8213L175k7490L267l46N11J1597J9981K1226m450l9135l0532
11942b7557n903j0301j8082K2424L8910J1561K0082L060j8641J2980j0923m004
11930A3606k5609k2387J1174L0788N131j1466k5252J5319n622P166N32r913M92
11917a6041J6969j3648J9563J1177O124k2957j873L3725L3800j9244n721j7814
11905B4060r071k3152P367k0995J6797n979j544K707Q697j9817r716K6694J6970
11892A3018J7993j8552l0654n025n439L819P166J6591Q196K775K7643n065q351
11879B4115j9224L963J3343J6710k0817n179k1289J2159O385J0104J3447Q304
11867D2021j0780q950P135q690k0852r894J6366j6464k7149J4576J9019K755J8447
$$ plain form
11854 17540 15525 39218 51786 66736 52691 1261 -28233 -5174 11487 17519 26190 32126
11842 32126 47222 20282 -5648 -12482 2670 9933 24048 20060 -4199 -25435 -12259 -1175
11830 -1175 19214 27007 44091 55123 42747 25148 15253 6933 13213 5835 16151 39217 58917
11817 58917 77846 52724 14002 -7705 8644 6434 7176 10945 -24349 -39668 6750 30742
11805 30742 28395 6409 -12940 -17770 13964 47820 46974 30429 22237 13923 36603 34306 17101
11792 17101 18769 46252 63984 39951 1495 5317 12806 40093 37313 35074 32033 16235 19133
11779 19133 19540 15225 48855 86012 110595 122523 120554 133516 138304 132231 146240 182284 223630
11766 223630 254546 326601 400980 473732 553750 656829 738481 737534 714892 666486 625735 544700
$$ packed form
11854A7540k015K3693J2568J4950j4045n1430k9494K3059J6661O032Q671N936
11842C2126J5096k6940k5930o834J5152P263J4115l988k4259k1236J3176J1084
11830a175K0389P793J7084J1032j2376j7599r895q320O280p378J0316K3066J9700
11817E8917J8929k5122l8722k1707J6349k210P42L769l5294j5319M6418K3992
11805C0742k347k1986j9349m830L1734L3856q46j6545q192q314K2680k297j7205
11792A7101J668K7483J7732k4033l8456L822P489K7287k780k239l041j5798K898
11779A9133M07m315L3630L7157K4583J1928j969J2962M788o073J4009L6044M1346
11766B23630L0916P2055P4379P2752Q0018J03079Q1652r47k2642m8406m0751q1035
$$ plain form
11754 544700 450832 362647 250516 169874 121515 115729 131749 94208 70990 78729 87828 78681
11742 78681 93607 89721 65392 70891 44480 31206 47160 59491 55106 30385 1227 489 29728
11729 29728 22641 41970 44769 16203 19888 7100 8610 23644 57063 67072 46624 43106 40650
11716 40650 44363 43363 46899 62636 79581 56014 75631 82807 78431 67432 46138 46539 43375
11703 43375 44810 -1461 14372 64238 42007 30113 33386 34077 44168 51300 57470 39061 21576
11690 21576 34087 46531 73271 78580 69166 49553 23582 11924 22117 25777 47716 32284
11678 32284 42383 34014 33115 38351 45050 49919 58021 35989 20556 14228 40757 46757 37040 55743
11664 55743 36024 -2705 -30471 -27184 -3536 16799 14252 -5629 11717 22136 12771 20929
$$ packed form
11754E44700r3868q8185j12131q0642m8359n786J6020l7541k3218P739R099r147
11742G8681J4926l886k4329N499k6411j3274J5954J2331m385k4721k9158p38K9239
11729B9728p087J9329K799k8566L685j2788J510J5034L3419J0009k0448l518k456
11716D0650L713j000L536J5737J6945k3567J9617P176m376j0999k1294M01l164
11703D3375J435m6271J5833M9866k2231j1894L273O91J0091P132O170j8409j7485
11690B1576J2511J2444K6740N309r414j9613k5971j1658J0193L660K1939j5432
11678C2284J0099q369q99N236O699M869Q102k2032j5433o328K6529O000r717J8703
11664E5743j9719l8729k7766L287K3648K0335k547j9881J7346J0419r365Q158
$$ plain form
11652 20929 18100 31396 46795 40712 43002 31458 17546 18938 30760 -640 -25449 7806
11640 7806 14762 10241 22576 23898 21929 53776 42488 33041 14464 12173 19328 25328 32599 34093
11626 34093 39296 17169 28428 18166 21631 8342 10254 27817 -35603 -36563 11696 10464 11059
11613 11059 -3366 34112 35815 44397 62600 30711 14126 11895 15290 41793 43774 17121 9597
11600 9597 19783 31254 8920 7539 32975 31966 37246 35851 33516 26085 60289 44277 16244
11587 16244 39849 30570 -9615 -12535 30432 47538 43494 35966 -6287 -10105 -8075 -3687 28533
11574 28533 8599 9656 13315 5250 15270 31010 16563 22835 14497 13748 2217 11774 14906
11561 14906 -4270 -13641 -24689 -5529 27866 24750 16815 8666 -702 553 4242 36996 60459
$$ packed form
11652B0929k829J3296J5399o083K290j1544j3912J392J1822l1400k4809L3255
11640G806O956m521J2335J322j969L1847j1288r447j8577k291P155O000P271J494
11626C4093N203k2127J1259j0262L465j3289J912J7563o3420r60M8259j232N95
11613A1059j4425L7478J703Q582J8203l1889j6585k231L395K6503J981k6653p524
11600I597J0186J1471k2334j381K5436j009N280j395k335p431L4204j6012k8033
11587A6244K3605r279m0185k920M2967J7106m044p528m2253l818K030M388L2220
11574B8533j9934J057L659q065J0020J5740j4447O272q338p49j1531R557L132
11561A4906j9176r371j1048J9160L3395l116p935q149r368J255L689L2754K3463
$$ plain form
11548 60459 62223 42735 30643 47764 50035 35186 68462 126540 97437 57678 73162 107763
11536 107763 122719 95672 90207 53180 42330 38191 16281 -17739 -4256 12193 831 -1258
11524 -1258 19052 16590 20130 8689 11799 9363 11076 18296 24913 17709 42678 77715 79760 49920
11510 49920 51774 70650 105444 119109 108586 63606 50839 19560 -8086 11898 45340 28051
11498 28051 19038 16017 28778 65338 81139 86337 101722 73976 47396 45485 26688 -1595
11486 -1595 16692 59838 98701 83094 52156 23867 24354 44313 62859 56339 53017 64171 96415
11473 96415 91244 42410 32285 47603 41884 24785 5721 -2134 18727 54929 81574 74469
11461 74469 86021 69745 58406 26045 22890 49170 39165 15806 442 -15750 -22873 -46817
$$ packed form
11548F0459J764j9488j2092J7121K271j4849L3276N8078k9103l9759J5484L4601
11536A07763J4956k7047n465l7027j0850m139k1910l4020J3483J6449j1362k089
11524a258K0310k462L540j1441L110k436J713P220O617p204K4969L5037K045k9840
11510D9920J854J8876L4794J3665j0523m4980j2767l1279k7646J9984L3442j7289
11498B8051r013l021J2761L6560J5801N198J5385k7746k6580j911j8797k8283
11486a595J8287M3146L8863j5607l0938k8289M87J9959J8546o520l322J1154L2244
11473I6415n171m8834j0125J5318n719j7099j9064p855K0861L6202K6645p105
11461G4469J1552j6276j1339l2361l155K6280j0005k3359j5364j6192p123k3944
$$ plain form
11449 -46817 -49013 14384 56259 59943 50671 49964 30373 32272 36566 41609 50574 47829 47737 31384
11435 31384 14681 9151 31421 23783 10048 11549 -10476 -25237 -14128 11595 41690 37544
11423 37544 47811 78331 78588 77810 66076 68125 45365 32360 27679 17029 24703 18415 19636
11410 19636 44868 51998 10475 -8962 29821 70894 74164 64046 41156 27214 18478 17159
11398 17159 3385 8343 24538 29579 37175 59838 86581 92173 97246 82116 75817 80155 62018
11385 62018 56488 75150 67333 41359 34300 31406 35693 21856 56341 76842 61117 54941 54717
11372 54717 68751 103456 77625 60662 62614 50528 67070 68159 37710 7896 8742 7251 4952
11359 4952 56212 65406 54217 45934 28716 22175 47576 64584 59031 37225 25600 994 18761
$$ packed form
11449d6817k196O3397M1875L684r272p07j9591J899M294N043Q965k745r2j6353
11435C1384j6703n530K2270p638j3735J501k2025j4761J1109K5723L0095m146
11423C7544J0267L0520K57p78j1734K049k2760j3005m681j0650P674o288J221
11410A9636K5232P130m1523j9437L8783M1073L270j0118k2890j3942q736j319
11398A7159j3774M958J6195N041P596K2663K6743N592N073j5130o299M338j8137
11385F2018n530J8662p817k5974p059k894M287j3837L4485K0501j5725o176k24
11372E4717J4034L4705k5831j6963J952j2086J6542J089l0449k9814Q46j491k299
11359D952N1260R194j1189q283j7218o541K5401J7008n553k1806j1625k4606J7767
$$ plain form
11346 18761 48075 70305 76309 69484 55458 32641 24346 11535 -10803 -5771 8366 6144 27160
11333 27160 3859 -2767 571 31849 66361 75348 86089 86724 52151 16004 -6466 -384 8055
11320 8055 -4296 4854 27922 49928 68454 52185 39345 36805 36757 37669 26207 49022 84189
11307 84189 75361 73852 62416 61272 49515 58397 60717 72377 92963 82245 124163 136093 102343
11294 102343 83670 84033 93183 89174 38900 4463 40092 79200 74936 64790 78399 61461
11282 61461 78659 103952 89455 104588 89994 97077 114118 103168 49782 32981 31336 52590
11270 52590 89611 88949 82140 82461 59594 69063 72483 89249 88262 88007 110722 122689 98471 70436
11256 70436 73026 74637 81506 72874 72380 90921 99160 95914 88508 67100 51819 -2091 -22107
$$ packed form
11346A8761K9314K2230O004o825j4026k2817q295j2811k2338N032J4137k222K1016
11333B7160k3301o626L338L1278L4512Q987J0741O35l4573l6147k2470O082Q439
11320H055j2351R150K3068K2006J8526j6269j2840k540m8R12j1462K2815L5167
11307H4189q828j509j1436j144j1757Q882K320J1660K0586j0718M1918J1930l3750
11294A02343j8673L63R150m009n0274l4437L5629L9108m264j0146J3609j6938
11282F1461J7198K5293j4497J5133j4594P083J7041j0950n3386j6801j645K1254
11270E2590L7021o62o809L21k2867R469L420J6766r87k55K2715J1967k4218k8035
11256G0436K590J611O869q632m94J8541Q239l246p406k1408j5281n3910k0016
$$ plain form
11243 -22107 10539 35195 41439 36727 71259 73279 58244 39834 7596 -10196 -6366 7790
11231 7790 19092 33547 55887 88400 79632 48541 46693 57652 46403 45326 72382 76492 58955
11218 58955 53007 54000 54157 59908 77942 77267 79601 83691 71702 56582 59327 57058 36139 27112
11204 27112 45510 28845 38312 63777 66459 49518 43594 55348 83147 100385 83932 70805
11192 70805 91007 99698 72553 72285 61471 71392 63827 33854 48214 48778 90534 100868 76534
11179 76534 102283 127029 136289 114723 94355 67418 56249 102057 105807 90303 101562 105316
11167 105316 108722 100682 82144 85753 92094 86317 52061 89775 130131 110096 59008 45000
11155 45000 36139 74812 109831 109331 71679 61675 107257 110842 112704 111571 111653 102287 100886 80509
$$ packed form
11243b2107L2646K4656O244m712L4532K020j5035j8410l2238j7792L830J4156
11231G790J1302J4455K2340L2513q768l1091j848J0959j1249j077K7056M110j7537
11218E8955n948R93J57N751J8034o75K334M090j1989j5120K745k269k0919r027
11204B7112J8398j6665R467K5465K682j6941n924J1754K7799J7238j6453j3127
11192G0805K0202Q691k7145k68j0814R921p565k9973J4360N64M1756J0334k4334
11179G6534K5749K4746R260k1566k0368k6937j1169M5808L750j5504J1259L754
11167A05316L406q040j8538L609O341n777l4256L7714M0356k0035n1088j4008
11155D5000q861L8673L5019n00l7652j0004M5582L585J862j133Q2r366j401k0377
$$ plain form
11141 80509 35879 23227 31113 52475 73971 68362 53178 52027 66497 92151 101505 103123 97446
11128 97446 88112 116193 100302 89365 120204 119148 127342 120163 86987 108719 89171 73606
11116 73606 80443 83466 97905 105662 98390 84964 84036 122627 119322 96149 103164 125616 152131
11103 152131 127726 139417 126536 76447 84967 115671 129677 135491 99057 80427 88654 80361
11091 80361 73335 57556 53451 52719 58488 52612 40273 74553 103914 117094 93102 58860 56950
11078 56950 91157 116803 101843 101164 80955 89010 129332 108296 70493 62061 79025 86167 98694
11065 98694 113554 110769 103888 98342 140535 147744 109858 88850 93045 125141 139397 111875 103218
11052 103218 88653 84618 83623 78557 97450 95667 86126 107418 114489 76296 35522 41872 47727
$$ packed form
11141H0509m4630j2652P886K1362K1496n609j5184j151J4470K5654R354J618n677
11128I7446r334K8081j5891j0937L0839j056Q194p179l3176K1732j9548j5565
11116G3606O837L023J4439P757p272j3426r28L8591l305k3173P015K2452K6515
11103A52131k4405J1691j2881n0089Q520L0704J4006N814l6434j8630Q227q293
11091H0361p026j5779m105p32N769n876j2339L4280K9361J3180k3992l4242j910
11078E6950L4207K5646j4960o79k0209Q055M0322k1036l7803q432J6964P142J2527
11065I8694J4860k785o881n546M2193P209l7886k1008M195L2096J4256k7522q657
11052A03218j4565m035r95n066J8893j783r541K1292P071l8193m0774O350N855
$$ plain form
11039 47727 45453 71774 96415 114886 107001 124963 118004 138442 137245 121767 98761 102478 73797
11026 73797 68541 80820 91486 98326 71165 66376 51555 49783 55064 47178 84306 102178 92602
11013 92602 107542 121660 136243 150746 141671 107367 85362 77554 71212 91668 96055 100303 94323
11000 94323 145932 152390 128330 127077 134183 120362 99107 89243 105669 131902 122461 113226 137344
10987 137344 121430 96384 115181 138077 123821 114063 145328 171506 170282 131918 137616 138265
10975 138265 107129 121832 144728 132626 106199 106366 115502 117455 113405 117941 142459 143875 126674
10962 126674 85973 67921 78745 97832 130857 148642 131720 104881 77599 74345 71249 80297
10950 80297 93354 93008 97533 74572 129080 135186 115690 115090 154626 163344 139035 142368 148540
$$ packed form
11039D7727k274K6321K4641J8471p885J7962o959K0438j197j5478k3006L717k8681
11026G3797n256J2279J0666O840k7161m789j4821j772N281p886L7128J7872r576
11013I2602J4940J4118J4583J4503r075l4304k2005p808o342K0456M387M248n980
11000I4323N1609O458k4060j253P106j3821k1255r864J6426K6233r441r235K4118
10987A37344j5914k5046J8797K2896j4256r758L1265K6178j224l8364N698O49
10975A38265l1136J4703K2896j2102k6427J67R136J953m050M536K4518J416j7201
10962A26674m0701j8052J0824J9087L3025J7785j6922k6839k7282l254l096R048
10950H0297J3057l46M525k2961N4508O106j9496o00L9536Q718k4309L333O172
$$ plain form
10937 148540 149218 152279 151978 141235 149266 181188 190087 164505 140137 136836 177810 210963 189329
10924 189329 134389 103514 119772 109125 103025 106080 136598 166687 163213 146259 141216 125967
10912 125967 147015 148804 145948 157568 175695 195509 206963 208138 210690 186074 171955 195458
10900 195458 187291 156860 159665 174731 144654 152563 147579 130330 122290 120802 106922 112058 123751
10887 123751 138035 143999 167745 194519 188233 199134 224172 239364 258465 258636 257358 277245
10875 277245 319218 323349 347468 398443 382299 369667 395897 427091 466580 541092 643712
10864 643712 761154 915601 1124938 1358402 1631439 1921603 2214998 2394151 2444015 2354040
10854 2354040 2172886 1901318 1563681 1240521 988705 816582 692801 576309 481212 424027
$$ packed form
10937A48540O78L061l01j0743Q031L1922Q899k5582k4368l301M0974L3153k1634
10924A89329n4940l0875J6258j0647o100L055L0518L0089l474j6954n043j5249
10912A25967K1048J789k856J1620J8127J9814J1454J175K552k4616j4119K3503
10900A95458q167l0431K805J5066l0077P909m984j7249q040j488j3880N136J1693
10887A23751J4284N964K3746K6774o286J0901K5038J5192J9101J71j278J9887
10875B77245M1973M131K4119N0975j6144j2632K6230L1194L9489P4512J02620
10864F43712J17442J54447K09337K33464K73037K90164K93395J79153M9864q9975
10854B354040j81154k71568l37637l23160k51816j72123j23781j16492r5097n7185
$$ plain form
10844 424027 371913 337801 303953 288041 251019 241138 253749 276827 274962 280580 264325 231671
10832 231671 198584 219769 232414 214679 233161 231118 205998 223590 227174 208986 200272 197734
10820 197734 183696 176388 185901 159557 114667 115279 136902 175922 179559 207123 182662 135224
10808 135224 167698 188466 197125 182801 185110 182380 148165 156790 207560 230734 271205 252884
10796 252884 209830 166972 141224 158487 165540 157842 164662 169902 158555 159143 189499 200719 211850
10783 211850 195965 176229 148169 147417 155371 158393 192532 216622 228807 226972 236557 224965 196987
10770 196987 171860 165869 182509 217328 233302 247839 234773 213993 174898 185367 206649 220759
10758 220759 242948 255125 247048 245661 246384 250959 240507 250012 263556 288515 292955 262160 262303
$$ packed form
10844D24027n2114l4112l3848j5912l7022r881J2611K3078j865N618j6255l2654
10832B31671l3087K1185J2645j7735J8482k043k5120J7592L584j8188q714k538
10820A97734j4038p308R513k6344m4890O12K1623L9020L637K7564k4461m7438
10808A35224L2474K0768Q659j4324K309k730l4215Q625N0770K3174M0471j8321
10796B52884m3054m2858k5748J7263P053p698O820N240j1347N88L0356J1220J1131
10783B11850j5885j9736k8060p52P954L022L4139K4090J2185j835R585j1592k7978
10770A96987k5127n991J6640L4819J5974J4537j3066k0780l9095J0469K1282J4110
10758B20759K2189J2177q077j387P23M575j0452R505J3544K4959M440l0795J43
$$ plain form
10745 262303 246836 228097 221632 220928 208754 236343 265001 272843 258631 231222 237446 234115 212957
10732 212957 220391 274751 302836 259891 249395 270740 254395 223923 217071 229964 207764 187954
10720 187954 180222 195121 194698 234083 255682 238930 228942 261481 263011 270703 283142 265577 238856
10707 238856 233849 243400 255232 281918 286346 285069 289436 301802 307637 301525 302623 309785 338865
10694 338865 366746 362309 373475 387700 397054 377672 335060 316665 308435 292415 289238 307654
10682 307654 303706 325103 339768 349657 353757 338147 346016 371584 388045 385676 392595 428580 453929
10669 453929 469550 460672 453904 454764 462806 452633 447669 457865 477844 490911 486265 482814 505712
10656 505712 516397 504751 474894 474892 479969 482812 483597 483655 505858 485544 464358 468544 453703 409662
$$ packed form
10745B62303j5467j8739o465p04j2174K7589K8658P842j4212k7409O224l331k1158
10732B12957P434N4360K8085m2945j0496K1345j6345l0472o852J2893k2200j9810
10720A87954p732J4899m23L9385K1599j6752r988L2539J530P692J2439j7565k6721
10707B38856n007R551J1832K6686M428j277M367J2366N835o112J098P162K9080
10694C38865K7881m437J1166J4225R354j9382m2612j8395q230j6020l177J8416
10682C07654l948K1397J4665R889M100j5610P869K5568J6461k369O919L5985K5349
10669D53929J5621q878o768Q60Q042j0173m964J0196J9979J3067m646l451K2898
10656E05712J0685j1646k9857kN077K843P85N8K2203k0314k1186M186j4841m4041
$$ plain form
10642 409662 414727 413714 405112 406145 385061 379143 394635 392207 375438 383003 422337 452324 444168
10629 444168 463670 471462 468038 465535 453208 434462 391828 352764 340091 326826 308933 322655
10617 322655 338284 370312 406844 438125 457338 458987 426526 379892 349466 363295 372442 353107
10605 353107 374958 365219 367612 381934 393988 381951 384375 422545 455270 467783 459074 431728
10593 431728 447349 464516 479243 446658 450914 472735 445334 435710 440677 420350 400383 407767
10581 407767 386953 368898 359799 360525 370072 392831 411933 426234 451114 449857 458853 451249 453290
10568 453290 443672 412255 453007 470896 475389 458511 419405 395866 386858 380969 393726 400379
10556 400379 428436 500715 580537 684007 818032 959857 1063807 1033016 963021 956942 964714
$$ packed form
10642D09662N065j013q602J033k1084n918J5492k428j6769P565L9334K9987q156
10629D44168J9502P792l424k503j2327j8746m2634l9064j2673j3265j7893J3722
10617C22655J5629L2028L6532L1281J9213J649l2461m6634l0426J3829R147j9335
10605C53107K1851r739K393J4322J2054j2037K424L8170L2725J2513q709k7346
10593D31728J5621J7167J4727l2585M256K1821k7401r624M967k0327j9967P384
10581D07767k0814j8055r099P26R547K2759J9102J4301K4880j257Q996p604K041
10568D53290r618l1417M0752J7889M493j6878l9106k3539r008n889J2757O653
10556D00379K8057P2279P9822J03470J34025J41825J03950l0791o9995o079P772
$$ plain form
10545 964714 1015084 1048663 1054413 1024682 1007152 1020210 1010118 1029356 1018482 1010591 993687 993263
10533 993263 1013852 1036794 1039223 1034061 1065011 1065763 1067480 1070465 1096856 1131360 1156656 1165040 1196748
10520 1196748 1217697 1213063 1208303 1219523 1259446 1284338 1344308 1380138 1390374 1430882 1493402 1536880
10508 1536880 1569590 1610116 1599940 1615839 1624365 1611203 1637850 1679837 1722045 1784983 1819761
10497 1819761 1874532 1911560 1986106 2047500 2141404 2264058 2333705 2383010 2449784 2504481 2562216
10486 2562216 2675404 2803276 2955835 3084735 3178313 3292506 3428154 3561219 3678600 3840677
10476 3840677 4011946 4163480 4317154 4484103 4727130 4993462 5237421 5534896 5866569
10467 5866569 6260418 6654023 7064218 7498124 7974232 8538873 9211732 9991572 10892422
$$ packed form
10545I64714N0370L3579N750k9731j7530J3058j0092J9238j0874p891j6904m24
10533I93263K0589K2942K429n162L0950P52J717K985K6391L4504K5296Q384L1708
10520A196748K0949m634m760J1220L9923K4892N9970L5830J0236M0508O2520M3478
10508A536880L2710M0526j0176J5899Q526j3162K6647M1987M2208O2938L4778
10497A819761N4771L7028P4546O1394R3904J22654O9647M9305O6774N4697N7735
10486B562216J13188J27872J52559J28900R3578J14193J35648J33065J17381J62077
10476C840677J71269J51534J53674J66949K43027K66332K43959K97475L31673
10467E866569L93849L93605M10195M33906M76108N64641O72859P79840R00850
$$ plain form
10458 10892422 12014285 13404910 15086498 17100279 19444790 21967536 24509772 26967334
10450 26967334 29507905 32511085 36368971 41605335 48838603 58858731 72536565 90772650
10442 90772650 114699421 146655408 191216887 254507539 338850719 434855207 517245003
10435 517245003 551922748 520636021 437852294 337417075 246942911 178126879 130299770
10428 130299770 97938940 75753289 60062754 48677100 40300104 34063963 29407574
10421 29407574 25952631 23370807 21408528 19778799 18180044 16404891 14513471 12712421
10413 12712421 11101842 9747257 8608573 7623783 6771486 6063857 5465989 4970820 4544093
10404 4544093 4153010 3840227 3588063 3351369 3123543 2942759 2770091 2632939 2521365
$$ packed form
10458A0892422J121863J390625J681588K013781K344511K522746K542236K457562
10450B6967334K540571L003180L857886N236364P233268J0020128J3677834J8236085
10442I0772650K3926771L1955987M4561479O3290652Q4343180R6004488Q2389796
10435E17245003L4677745l1286727q2783727j00435219r0474164o8816032m7827109
10428A30299770l2360830k2185651j5690535j1385654q376996o236141m656389
10421B9407574l454943k581824j962279j629729j598755j775153j891420j801050
10413A2712421j610579j354585j138684r84790q52297p07629n97868m95169m26727
10404D544093l91083l12783k52164k36694k27826j80784j72668j37152j11574
$$ plain form
10395 2521365 2376819 2271004 2209076 2147280 2107496 2167201 2339394 2641703 3042933 3383267
10385 3383267 3413669 3041295 2501735 2002860 1644360 1382292 1194058 1082349 985840 940917
10375 940917 923735 861955 811802 763103 701478 670024 626646 585966 571559 511538 434211
10364 434211 400294 384216 368386 370272 391149 358261 330865 310467 273143 270158 276239 292269
10352 292269 304544 310336 299485 279553 282703 329072 387648 472187 553123 628417 735055 820455
10340 820455 872077 918153 919417 889567 855077 803654 730260 632003 561476 514045 491402 469351
10328 469351 498165 540609 558665 588000 633538 652675 592880 540908 517302 522096 502564 557424
10316 557424 633316 621413 553354 504803 490079 423792 332799 293565 278963 280789 276982 253021
$$ packed form
10395B521365j44546j05815o1928o1796l9784N9705J72193L02309M01230L40334
10385C383267L0402l72374n39560m98875l58500k62068j88234j11709r6509m4923
10375I40917j7182o1780n0153m8699o1625l1454m3378m0680j4407o0021p7327
10364D34211l3917j6078j5830J886K0877l2888k7396k0398l7324k985O081J6030
10352B92269J2275N792j0851j9932L150M6369N8576Q4539Q0936P5294J06638Q5400
10340H20455N1622M6076J264k9850l4490n1423p3394r8257p0527m7431k2643k2051
10328D69351K8814M2444J8056K9335M5538J9137n9795n1972k3606M794j9532N4860
10316E57424P5892j1903o8059m8551j4724o6287r0993l9234j4602J826l807k3961
$$ plain form
10304 253021 228582 208168 188847 165343 144614 155613 136565 122081 141027 140099 136698 156253
10292 156253 212754 229723 206829 188115 179420 137577 85195 62719 53041 32313 32299 20144
10280 20144 15445 -13076 -25853 -13858 9071 7756 24599 53571 67752 50142 38123 29609
10268 29609 -21222 -36010 -7202 -2052 -4304 -3215 13803 22517 1734 -39022 -81510 -79781 -82473
10255 -82473 -67377 -63079 -29298 17768 40256 14148 2767 6094 -13142 -60157 -100014 -125240
10243 -125240 -104354 -113694 -145682 -160936 -115772 -79035 -72013 -89002 -118110 -123969 -106870 -68711
10231 -68711 -59249 -90165 -87424 -116940 -98925 -75814 -97016 -95391 -84817 -59987 -61239 -75909
10219 -75909 -87791 -76035 -69495 -81402 -105760 -129117 -121389 -103379 -94303 -86786 -85405 -81483 -76867
$$ packed form
10304B53021k4439k0414j9321k3504k0729J0999j9048j4484J8946r28l401J9555
10292A56253N6501J6969k2894j8714q695m1843n2382k2476r678k0728j4j2155
10280B0144m699k8521j2777J1995K2929j315J6843K8972J4181j7610j2019q514
10268B9609n0831j4788K8808N150k252J089J7018Q714k0783m0756m2488J729k692
10255h2473J5096M298L3781M7066K2488k6108j1381L327j9236m7015l9857k5226
10243a25240K0886r340l1988j5254M5164L6737P022j6989k9108n859J7099L8159
10231f8711R462l0916K741k9516J8015K3111k1202J625J0574K4830j252j4670
10219g5909j1882J1756O540j1907k4358k3357P728J8010R076P517J381L922M616
$$ plain form
10206 -76867 -64352 -23978 -26055 -1807 38252 37906 -26591 -57711 -63897 -86069 -110943 -104371 -104216
10193 -104216 -99489 -111845 -99513 -101724 -97841 -96006 -77862 -64536 -58730 -85180 -110367 -106749 -94261
10180 -94261 -88814 -96952 -109566 -106936 -104563 -71920 -51661 -32572 -45387 -75563 -105883 -120696
10168 -120696 -125107 -98469 -72092 -61523 -69623 -64747 -63805 -73227 -73798 -93360 -93736 -64647 -29167
10155 -29167 -75026 -101672 -89723 -71056 -58511 -69881 -85924 -85034 -62139 -19700 -16396 -35606
10143 -35606 -31535 -69103 -70671 -60924 -52299 -41577 -52999 -38600 -47291 -44385 -61549 -86709 -110262
10130 -110262 -119790 -99724 -92645 -94240 -95395 -126737 -148021 -158100 -144684 -137158 -137171 -116553 -100259
10117 -100259 -91965 -86032 -103260 -115685 -103520 -105283 -101137 -80458 -108771 -110889 -81862 -78566 -100540
$$ packed form
10206g6867J2515M0374k077K4248M0059l46o4497l1120o186k2172k4874O572J55
10193a04216M727j2356J2332k211L883J835J8144J3326N806k6450k5187L618J2488
10180i4261N447q138j2614K630K373L2643K0259J9089j2815l0176l0320j4813
10168a20696m411K6638K6377J0569q100M876R42r422n71j9562l76K9089L5480
10155b9167m5859k6646J1949J8667J2545j1370j6043Q90K2895M2439L304j9210
10143c5606M071l7568j568R747Q625J0722j1422J4399q691K906j7164k5160k3553
10130a10262r528K0066P079j595j155l1342k1284j0079J3416P526j3K0618J6294
10117a00259Q294N933j7228j2425J2165j763M146K0679k8313k118K9027L296k1974
$$ plain form
10104 -100540 -119953 -118652 -133517 -125204 -123707 -125566 -124859 -88350 -87318 -97264 -102275 -79193 -61558
10091 -61558 -50913 -42899 -11930 -31045 -60163 -95323 -87851 -73994 -79188 -66107 -64979 -43967
10079 -43967 -24942 -46567 -28205 -9466 -34444 -44778 -38759 -35964 -63030 -90776 -93958 -56658
10067 -56658 -42529 -70527 -88194 -88620 -61467 -38368 -21723 -17752 17514 25044 2935 -5062 5786
10054 5786 -29443 -38376 -67581 -80126 -47288 -25589 -30486 -64458 -39298 -23309 -23189 -43938 -48254
10041 -48254 -36540 -36816 -43928 -49508 -54600 -40819 -14035 11201 31520 25544 24312 49250 44124
10028 44124 32236 51168 75968 77548 82475 93823 123166 161839 186782 242727 295371 377924
10016 377924 496280 605089 760350 957690 1189852 1459245 1738700 1985288 2121139 2163267
$$ packed form
10104a00540j9413J301j4865Q313J497j859P07L6509J032r946n011K3082J7635
10091f1558J0645Q014L0969j9115k9118l5160P472J3857n194J3081J128K1012
10079d3967J9025k1625J8362J8739k4978j0334O019K795k7066k7746l182L7300
10067e6658J4129k7998j7667m26K7153K3099J6645L971L5266P530k2109p997J0848
10054E786l5229q933k9205j2545L2838K1699m897l3972K5160J5989J20k0749m316
10041d8254J1714k76p112n580n092J3781K6784K5236K0319n976j232K4938n126
10028D4124j1888J8932K4800J580M927J1348K9343L8673K4943N5945N2644Q2553
10016C77924J18356J08809J55261J97340K32162K69393K79455K46588J35851M2128
$$ plain form
10006 2163267 2093187 1869305 1574030 1286111 1027351 797850 576589 395105 283692 235312
9996 235312 204232 171760 133271 98592 92884 112714 109714 84014 77515 92695 70703 65200
9984 65200 50813 34601 36407 20735 21392 27047 32950 30843 49447 29841 -1787 -13407 -2572
9971 -2572 1849 -11749 -6623 -3025 -16910 -7104 18675 14415 21653 12318 -16721 -20531 -12122 9868
9957 9868 32148 28177 -9782 -32782 -11399 17929 38588 5588 -3522 11308 -4967 -17761
9945 -17761 -7237 -24242 -20360 -10810 742 -18927 -25049 -40480 -54072 -60934 -58090 -35510 -32433
9932 -32433 -18136 -1993 -20916 -23524 -36851 -24755 -2105 6844 10215 -1541 -8714 -15710 4848
9919 4848 -5965 -23349 -26903 5570 14862 6660 8430 12928 16442 22698 11844 -6130 9407
$$ packed form
10006B163267p0080k23882k95275k87919k58760k29501k21261j81484j11413m8380
9996B35312l1080l2472l8489l4679n708J9830l000k5700o499J5180k1992n503
9984F5200j4387j6212J806j5672O57N655N903k107J8604j9606l1628j1620J0835
9971b572M421j3598N126L598j3885R806K5779m260P238r335k9039l810Q409K1990
9957I868K2280l971l7959k3000K1383K9328K0659l3000r110J4830j6275j2794
9945a7761J0524j7005L882R550J1552j9669o122j5431j3592o862K844K2580L077
9932c2433J4297J6143j8923k608j3327J2096K2650Q949L371j1756p173o996K0558
9919D848j0813j7384l554L2473R292q202J770M498L514O256j0854j7974J5537
$$ plain form
9906 9407 33533 23464 13460 16927 1447 -31937 -39156 -40257 -26113 -18966 -30238 -26250 15329
9893 15329 52809 26198 -8015 17088 38547 32667 8148 -23561 -21360 -3604 15223 20639
9881 20639 41093 5585 7811 -26072 -35941 -21471 938 1883 16595 13573 36237 18995 17349
9868 17349 38364 30393 24515 20884 33763 31170 55878 46058 -7122 -49830 -33822 12081 68632
9855 68632 98268 95091 49984 9832 1413 29760 39248 31033 21735 8995 28186 45473 40675
9842 40675 21043 -4609 -27785 -44214 -31216 -18873 1761 25527 50167 27190 13501 38899
9830 38899 31252 2408 -12827 20771 30657 19914 36847 71528 91326 62651 58137 42039
9818 42039 37800 28176 12544 30214 52717 62523 49433 17936 17943 6664 -19744 -14452 -9304 -29724
$$ packed form
9906I407K4126j0069j0004L467j5480l3384p219j101J4144P147j1272L988M1579
9893A5329L7480k6611l4213K5103K1459n880k4519l1709K201J7756J8827N416
9881B0639K0454l5508K226l3883r869J4470K2409R45J4712l022K2664j7242j646
9868A7349K1015p971n878l631J2879k593K4708r820n3180m2708J6008M5903N6551
9855F8632K9636l177m5107m0152q419K8347R488q215r298j2740J9191J7287m798
9842D0675j9632k5652k3176j6429J2998J2343K0634K3766K4640k2977j3689K5398
9830C8899p647k8844j5235L3598R886j0743J6933L4681J9798k8675m514j6098
9818D2039m239r624j5632J7670K2503R806j3090l1497Pj1279k6408N292N148k0420
$$ plain form
9804 -29724 -28882 4928 36493 48837 42101 49007 38551 29367 26579 36273 45902 49525 20279 27680
9790 27680 49843 66554 96195 99008 69060 58152 52176 24768 53969 59930 78098 92615
9778 92615 105445 96645 60007 47664 55032 63065 54235 50914 67663 77624 73647 41631 39192
9765 39192 69715 86716 61920 43999 60170 68795 38032 4703 -9889 -7912 27638 31631
9753 31631 17511 47541 85930 103319 95948 28060 -16317 23811 68773 67241 62884 42486
9741 42486 27696 20731 14092 48058 50757 35367 23076 45169 65326 72627 48458 34930 55743
9728 55743 86391 118808 141725 146649 138316 112531 86862 76363 53827 64070 74929 76656
9716 76656 77508 70306 78211 100896 129768 127776 84525 73003 62359 60170 46056 40425 55724
$$ packed form
9804b9724Q42L3810L1565J2344o736O906j0456r184k788R694R629L623k9246P401
9790B7680K2163J6711K9641K813k9948j0908n976k7408K9201N961J8168J4517
9778I2615J2830q800l6638j2343P368Q033q830l321J6749R961l977l2016k439
9765C9192L0523J7001k4796j7921J6171Q625l0763l3329j4592J977L5550L993
9753C1631j4120L0030L8389J7389p371o7888m4377M0128M4962j532m357k0398
9741D2486j4790o965o639L3966K699j5390j2291K2093K0157P301k4169j3528K0813
9728E5743L0648L2417K2917M924q333k5785k5669j0499k2536J0243J0859J727
9716G6656Q52p202P905K2685K8872j992m3251j1522j0644k189j4114n631J5299
$$ plain form
9703 55724 59032 30565 20046 52431 80823 96044 117422 111010 98204 94808 78576 63856
9691 63856 66287 85449 95805 91810 109177 100165 114201 116522 85901 88163 123905 151326 138352
9678 138352 107499 107855 112059 124670 130510 123791 122024 114978 96308 78386 70949 39935 60957
9665 60957 94155 97542 72290 60430 71065 106563 142013 167787 142000 116882 106282 74480
9653 74480 67230 97289 130813 124039 133069 154723 137358 97515 70578 71038 77127 91726 98752
9640 98752 103188 93131 94529 101693 95146 118064 108799 96604 85994 113778 132617 152846 152023
9627 152023 154178 147507 137910 136198 160499 161106 136972 130962 149055 160523 156203 148151 161627
9614 161627 152988 177745 180163 137098 128099 112904 125468 135431 111564 122230 123252 119161 142306
$$ packed form
9703E5724L308k8467j0519L2385K8392J5221K1378o412j2806l396j6232j4720
9691F3856K431J9162J0356l995J7367r012J4036K321l0621K262L5742K7421j2974
9678A38352l0853L56M204J2611N840o719j767p046j8670j7922p437l1014K1022
9665F0957L3198L387k5252j1860J0635L5498L5450K5774k5787k5118j0600l1802
9653G4480p250L0059L3524o774R030K1654j7365l9843k6937M60O089J4599P026
9640I8752M436j0057J398P164o547K2918r265j2195j0610K7784J8839K0229q23
9627A52023K155o671r597j712K4301O07k4134o010J8093J1468m320q052J3476
9614A61627q639K4757K418m3065q999j5195J2564R963k3867J0666J022m091K3145
$$ plain form
9601 142306 145229 152855 156469 152202 135426 120441 133910 157199 143617 150161 173437 172589 175992
9588 175992 182130 166066 153977 148713 175424 181227 155474 148586 155051 173428 163239 161704 162770
9575 162770 167934 153760 172879 191839 194478 193090 201156 226665 217481 202408 215412 202663 194223
9562 194223 185910 181769 172025 172381 169348 175927 194782 179776 188224 200101 200563 187330 182676 197482
9548 197482 189101 211109 214147 222912 201725 190489 221483 257657 218559 177107 132016 154695
9536 154695 203487 213955 196538 170155 178840 173808 211058 184671 179567 185904 186574 185449 194213
9523 194213 195247 191944 194515 175294 155587 156868 161563 166191 181147 193887 174088 197513 209379
9510 209379 238709 245617 250830 256260 243285 207433 184689 190025 162351 167424 169020 138409 132904
$$ packed form
9601A42306K923P626L614m267j6776j4985J3469K3289j3582O544K3276q48L403
9588A75992O138j6064j2089n264K6711N803k5753o888O465J8377j0189j535J066
9575A62770N164j4174J9119J8960K639j388Q066K5509r184j5073J3004j2749q440
9562A94223q313m141r744L56l033O579J8855j5006Q448J1877M62j3233m654J4806
9548A97482q381K2008L038Q765k1187j1236L0994L6174l9098m1452m5091K2679
9536A54695M8792J0468j7417k6383Q685n032L7250k6387n104O337O70j125Q764
9523A94213J034l303K571j9221j9707J281M695M628J4956J2740j9799K3425J1866
9510B09379K9330O908N213N430j2975l5852k2744N336k7674N073J596l0611n505
$$ plain form
9497 132904 164736 167787 173013 176046 179993 189328 170395 170828 192441 201129 196550 192254 182618 197458
9483 197458 208962 197302 204605 244615 233803 202746 203055 209479 212142 224613 224660 236535 209518
9470 209518 185923 173391 175330 178268 183082 188299 198548 179356 198753 235562 245192 235518 182139
9457 182139 163899 184522 191646 188023 168806 174747 179270 198044 213156 194607 173553 172990 183290
9444 183290 217879 236881 257233 263392 231685 203625 187041 188717 211458 222901 210621 221528
9432 221528 201112 175295 183891 231183 223295 236220 231713 209522 222446 230410 184829 181506 207759
9419 207759 192874 185419 169748 162124 148284 179644 200771 189050 187581 208373 230756 254305
9407 254305 233486 199588 173868 197032 256559 273765 237029 208117 204013 209009 208356 185778
$$ packed form
9497A32904L1832L051N226L033L947R335j8933M33K1613Q688m579m296r636J4840
9483A97458J1504j1660P303M0010j0812l1057L09O424K663J2471M7J1875k7017
9470B09518k3595j2532J939K938M814N217J0249j9192J9397L6809R630r674n3379
9457A82139j8240K0623P124l623j9217N941M523J8774J5112j8549k1054n63J0300
9444A83290L4589J9002K0352O159l1707k8060j6584J676K2741J1443j2280J0907
9432B21528k0416k5817Q596M7292p888J2925m507k2191J2924P964m5581l323K6253
9419B07759j4885p455j5671p624j3840L1360K1127j1721j469K0792K2383K3549
9407B54305k0819l3898k5720K3164N9527J7206l6736k8912m104M996o53k2578
$$ plain form
9395 185778 191555 201296 222338 236584 208152 232382 250726 240232 236119 242576 243499 243533 221432
9382 221432 199947 220911 205782 204352 197217 182075 166186 184210 199175 220774 197749 206377
9370 206377 204879 221299 267312 254488 230178 208074 208531 196394 191976 226296 217018 187703 136242
9357 136242 134347 162408 163757 201739 197484 191657 209693 209091 199636 209797 193486 164022 173578
9344 173578 207047 210617 204986 191380 215670 220825 224104 180571 152780 137407 108349 170194
9332 170194 192277 175980 176254 190049 186993 150211 143197 151672 134705 122401 131540 153505 175905
9319 175905 180302 162842 178450 199382 167479 155958 155155 155608 163717 190322 193491 195239 194305 183317
9305 183317 164694 171269 184444 181937 171651 170718 163663 155295 146366 149659 167402 154086 164316
$$ packed form
9395A85778N777R741K1042J4246k8432K4230J8344j0494m113O457R23L4k2101
9382B21432k1485K0964j5129j430p135j5142j5889J8024J4965K1599k3025Q628
9370B06377j498J6420M6013j2824k4310k2104M57j2137m418L4320r278k9315n1461
9357A36242j895K8061J349L7982m255n827J8036o02r455J0161j6311k9464R556
9344A73578L3469L570n631j3606K4290N155L279m3533k7791j5373k9058O1845
9332A70194K2083j6297K74J3795l056l6782p014Q475j6967j2304R139K1965K2400
9319A75905M397j7460J5608K0932l1903j1521q03M53Q109K6605L169J748r34j0988
9305A83317j8623O575J3175k507j0286r33p055q368q929L293J7743j3316J0230
$$ plain form
9292 164316 164217 178792 176467 158802 163268 176254 150077 146697 147121 153705 157756 142556 135038 149210
9278 149210 141020 146670 184425 169025 157922 170232 152438 129624 137888 150280 139297 106546
9266 106546 91710 95299 122304 141060 146502 124272 119205 152340 185026 191927 169367 179977
9254 179977 183807 165195 164378 162643 140927 134868 120412 118674 137989 134493 144553 139169 131977
9241 131977 128472 105443 112181 104681 104592 71245 57209 89581 131128 131734 137891 171056 177279 174309
9227 174309 187864 147957 142708 168361 152964 135525 122765 110424 108406 134416 172379 154296
9215 154296 152133 123478 91254 95608 101706 122293 150993 186917 183714 151793 121564 111199
9203 111199 94404 134114 159302 171471 211297 201103 165299 124043 126445 145498 133176 127202
$$ packed form
9292A64316r9J4575k325j7665M466J2986k6177l380M24O584M051j5200p518J4172
9278A49210q190N650L7755j5400j1103J2310j7794k2814Q264J2392j0983l2751
9266A06546j4836L589K7005J8756N442k2230n067L3135L2686O901k2560J0610
9254A79977L830j8612q17j735k1716o059j4456j738J9315l496J0060n384p192
9241A31977l505k3029O738p500q9l3347j4036L2372M1547O06O157L3165O223k970
9227A74309J3555l9907n249K5653j5397j7439j2760j2341k018K6010L7963j8083
9215A54296k163k8655l2224M354O098K0587K8700L5924l203l1921l0229j0365
9203A11199j6795L9710K5188J2169L9826j0194l5804m1256K402J9053j2322n974
$$ plain form
9191 127202 109697 92141 78331 43426 51093 42419 61166 99270 98795 93873 136892 157763 117038
9178 117038 93412 101881 92630 88119 90242 89501 85971 87194 83078 60203 45614 65687 84510
9165 84510 96934 118878 104389 122036 121899 119717 131958 151787 143221 147519 160050 133849 135847
9152 135847 155230 153468 129691 90388 65611 63076 32990 52069 68817 62347 44295 31972
9140 31972 45160 59710 86438 104723 98347 97822 103612 101945 86433 84686 88800 98849 111477
9127 111477 110542 102870 97774 93146 80045 73278 43197 56604 67795 41341 29355 68436 93699
9114 93699 75910 77322 73955 90558 105619 118691 121669 117567 108050 140045 149838 134066 105935
9101 105935 102423 105558 100627 69157 58175 82629 96352 115827 125883 126545 110883 115024 109832
$$ packed form
9191A27202j7505j7556j3810l4905P667q674J8747L8104m75m922M3019K0871m0725
9178A17038k3626Q469r251m511K123p41l530J223m116k2875j4589K0073J8823
9165H4510J2424K1944j4489J7647j37k182J2241J9829q566M298J2531k6201J998
9152A35847J9383j762k3777l9303k4777k535l0086J9079J6748o470j8052j2323
9140C1972J3188J4550K6728J8285o376n25N790j667j5512j747M114J0049J2628
9127A11477r35p672n096m628j3101o767l0081J3407J1191k6454j1986L9081K5263
9114I3699j7789J412l367J6603J5061J3072K978m102r517L1995R793j5772k8131
9101A05935l512L135m931l1470j0982K4454J3723J9475J0056O62j5662M141n192
$$ plain form
9088 109832 80881 69511 70814 59998 55883 74234 72798 61768 57496 69002 35986 22686
9076 22686 54840 47513 38774 58108 66213 73288 72538 69776 30694 49563 73023 99046 105643
9063 105643 82675 38707 37439 62019 69768 70133 91771 60312 46016 55871 62635 66695 62628
9050 62628 71015 73295 67258 63673 29788 4764 13642 54945 67326 42433 36978 24203 2475
9037 2475 4546 -1703 3678 -7150 3012 33342 16276 10787 26387 14458 54025 77731 72113
9024 72113 50021 37638 32781 42623 42966 45332 42651 35444 44724 41269 41207 31754 36420 50063 35755
9009 35755 24209 21624 27008 35806 15074 -14630 -27374 -8371 6291 13614 36153 30462 14480
8996 14480 32950 24808 14252 27578 4073 26630 16686 39241 53415 36299 29699 45930
$$ packed form
9088A09832k8951j1370J303j0816m115J8351j436j1030m272J1506l3016j3300
9076B2686L2154p327q739J9334Q105P075p50k762l9082J8869K3460K6023O597
9063A05643k2968m3968j268K4580P749L65K1638l1459j4296R855O764M060m067
9050F2628Q387K280o037l585l3885k5024Q878M1303J2381k4893n455j2775k1728
9037B475K071o249N381j0828J0162L0330j7066n489J5600j1929L9567K3706n618
9024G2113k2092j2383m857R842L43K366k681p207R280l455o2r453M666J3643j4308
9009C5755j1546k585N384Q798k0732k9704j2744J9003J4662P323K2539n691j5982
8996A4480J8470q142j0556J3326k3505K2557r944K2555J4174j7116o600J6231
$$ plain form
8984 45930 25837 9434 4291 -11174 4600 33234 31709 5183 -20203 4540 32913 29197
8972 29197 41783 46507 35521 14582 9526 1758 20745 48594 81289 93770 99915 86776 25757
8959 25757 17376 23726 1394 21021 29633 35389 44755 45882 15467 -7301 21090 22239 41787
8946 41787 66324 50610 43590 41824 40563 68300 80371 84681 117944 119296 79219 104207 161008
8933 161008 212535 324247 461718 594586 657355 591275 459611 332341 232024 176170
8923 176170 111242 75417 89457 74171 41371 62869 74061 41444 -9842 -26047 -9177 7795
8911 7795 36066 37294 17245 23252 22090 21132 45703 28846 -3409 6496 11824 34672 42084 58031
8897 58031 47640 35586 25325 23325 34308 44016 57741 108383 177318 232312 318029 457105
$$ packed form
8984D5930k0093j6403n143j5465J5774K8634j525k6526k5386K4743K8373l716
8972B9197J2586M724j0986k0939n056p768J8987K7849L2695J2481O145j3139o1019
8959B5757q381O350k2332J9627Q612N756R366J127l0415k2768K8391J149J9548
8946D1787K4537j5714p020j766j261K7737J2071M310L3263J352m0077K4988N6801
8933A61008N1527J11712J37471J32868O2769o6080j31664j27270j00317n5854
8923A76170o4928l5825J4040j5286l2800K1498J1192l2617n1286j6205J6870J6972
8911G795K8271J228k0049O007j162r58K4571j6857l2255R905N328K2848P412J5947
8897E8031j0391j2054j0261k000J0983R708J3725N0642O8935N4994Q5717J39076
$$ plain form
8885 457105 589305 588811 455482 307804 213113 150544 117897 96687 76708 75974 91084 79890
8873 79890 61635 58428 24126 14669 39192 21864 10943 8163 18221 51142 60724 33607 21407
8860 21407 7579 -18830 -24332 12139 33451 2634 -5501 30092 42652 25843 9801 -5065
8848 -5065 -29840 -4451 40589 30083 21172 21080 9988 18237 25676 7235 -31194 -34622 -5771
8835 -5771 32858 26127 1858 8437 15039 8080 9066 15720 12971 8783 33973 51543 46971 21537
8821 21537 3188 1624 -6169 -24515 -14195 5593 8917 -10577 -3539 1210 15736 25534 37639
8808 37639 51723 34954 52711 50618 9440 -13789 -4574 37508 26998 12774 14089 -110
8796 -110 -9977 -22013 16721 13137 -24703 -44122 -22524 36063 33954 6684 -15660 -26288 -16549
$$ packed form
8885D57105J32200m94j33329j47678r4691o2569l2647k1210j9979p34J5110j1194
8873G9890j8255l207l4302r457K4523j7328j0921k780J0058L2921R582k7117j2200
8860B1407j3828k6409n502L6471K1312l0817q135L5593J2560j6809j6042j4866
8848e065k4775K5389M5040j0506q911r2j1092Q249P439j8441l8429l428K8851
8835e771L8629o731k4269O579O602o959R86O654k749m188K5190J7570m572k5434
8821B1537j8349j564p793j8346J0320J9788L324j9494P038M749J4526R798J2105
8808C7639J4084j6769J7757k093m1178k3229R215M2082j0510j4224J315j4199
8796a10r867j2036L8734l584l7840j9419K1598N8587k109k7270k2344j0628R739
$$ plain form
8783 -16549 -14180 7763 29333 44836 53587 48228 42160 20663 50166 53028 16481 28880 81206
8770 81206 110619 89949 55072 49215 51141 45836 37000 36684 23131 -18136 -35043 -23913 -18685
8757 -18685 7244 16730 34813 37316 54022 60738 55044 28916 8844 42886 40238 10745 3592
8744 3592 7397 3115 -25563 -37993 -31354 -12006 -17949 21047 28351 9855 -6246 -9245 -1265
8731 -1265 1013 -7355 -25174 -18042 20323 41579 20924 28899 47595 22618 42357 41280 20402
8718 20402 12360 -16753 -19627 -1525 -2380 -34137 -10900 9138 30468 31095 43795 66091 57156
8705 57156 60838 36921 6082 939 -4625 20362 22746 20313 -8109 -38893 -81738 -80810 -56895
8692 -56895 -35725 12130 25663 16252 15805 21585 11641 13252 -26866 -29918 -1824 -27744 -36124
$$ packed form
8783a6549K369K1943K1570J5503Q751n359o068k1497K9503K862l6547J2399N2326
8770H1206K9413k0670l4877n857J926n305q836l16j3553m1267j6907J1130N228
8757a8685K5929R486J8083K503J6706O716n694k6128k0072L4042k648k9493p153
8744C592L805m282k8678j2430O639J9348n943L8996P304j8496j6101k999P980
8731a265K278q368j7819P132L8365K1256k0655P975J8696k4977J9739j077k0878
8718B0402q042k9113k874J8102q55l1757K3237K0038K1330O27J2700K2296q935
8705E7156L682k3917l0839n143n564K4987K384k433k8422l0784m2845R28K3915
8692e6895K1170M7855J3533r411m47N780r944J611m0118l052K8094k5920q380
$$ plain form
8679 -36124 -27863 -28054 9053 41540 33595 10038 -2327 -1832 -516 7517 3903 10738 10490 12332
8665 12332 14455 22683 21631 27533 40223 39980 19194 -19086 -10185 18312 25559 25789 13155 12432
8651 12432 20487 -12076 -44830 -43458 -27629 -6153 -10148 -20713 -16086 20692 -1783 -12946 -5621
8638 -5621 10858 -11262 -27254 -27121 -4456 -10585 -16295 -44319 -50922 -32344 3780 41036 58899
8625 58899 45049 1760 -48450 -58145 -35674 -35894 -41820 -27619 -26599 -29675 -15374 -16830 -41506
8612 -41506 -67247 -50613 -40224 -25646 -27917 -21097 -4832 9555 20038 53833 30684 16122
8600 16122 -3450 -35144 -17337 13943 28274 39696 44068 20035 26736 35184 39789 53552 29529
8587 29529 17097 18949 31713 24118 11935 18972 11943 -11876 -14911 -7484 -11781 -6133 6178
$$ packed form
8679c6124Q261j91L7107L2487p945k3557j2365M95J316Q033l614O835k48J842
8665A2332K123Q228j052N902J2690k43k0786l8280Q901K8497P247K30j2634p23
8651A2432Q055l2563l2754J372J5829K1476l995j0565M627L6778k2475j1163P325
8638e621J6479k2120j5992J33K2665o129n710k8024o603J8578L6124L7256J7863
8625E8899j3850m3289n0210r695K2471k20n926J4201J020l076J4301j456k4676
8612d1506k5741J6634J0389J4578k271O820J6265J4387J0483L3795k3149j4562
8600A6122j9572l1694J7807L1280J4331J1422M372k4033O701Q448M605J3763k4023
8587B9529j2432J852J2764p595j2183P037p029k3819l035P427m297N648J2311
$$ plain form
8574 6178 -2113 -22481 -31513 -34448 -23611 9272 -6478 -29274 -38279 -53354 -44304 -43113 -58494
8561 -58494 -46427 -41157 -48687 -44684 -46453 -39055 -16439 -9990 -14438 -28880 -23570 -38233 -52185
8548 -52185 -63308 -40640 -39907 -36404 -19650 -22077 -52687 -68593 -67402 -37843 -3949 -8630 -22107
8535 -22107 -38361 -71720 -74321 -84942 -47702 -32159 -19089 636 -15133 -46841 -29365 20154
8523 20154 25742 6106 -35615 -18799 6350 13067 1599 -11048 1105 18733 20326 -20074
8511 -20074 -55402 -52627 -43550 -52595 -58687 -66792 -66659 -31280 6036 -35866 -65222 -44206 -35605
8498 -35605 -33429 3808 7413 1325 20680 9821 -19312 17745 41612 34528 46833 52399 46017
8485 46017 18713 -20745 -7571 16839 1171 10319 -8318 -27702 -58150 -50574 -74835 -54145
$$ packed form
8574F178q291k0368r032k935J0837L2883j5750k2796r005j5075R050J191j5381
8561e8494J2067N270p530M003j769P398K2616O449m448j4442N310j4663j3952
8548e2185j1123K2668P33L503J6754k427l0610j5906J191K9559L3894m681j3477
8535b2107j6254l3359k601j0621L7240J5543J3070J9725j5769l1708J7476M9519
8523B0154N588j9636m1721J6816K5149O717j1468j2647J2153J7628J593m0400
8511b0074l5328K775R077r045o092q105J33L5379L7316m1902k9356K1016Q601
8498c5605K176L7237L605o088J9355j0859k9133L7057K3867p084J2305N566o382
8485D6017k7304l9458J3174K4410j5668R148j8637j9384l0448P576k4261K0690
$$ plain form
8473 -54145 -24294 2559 -20030 -27489 -31733 -68103 -58441 -48051 -59193 -71965 -69260 -44298 -6163
8460 -6163 5152 5166 -13980 -38874 -33308 -4357 -10068 -14835 -15641 -17041 -47677 -77768 -47474 17856
8446 17856 -10049 -37497 -56052 -58006 -41892 -33249 -8548 -9164 -5925 2178 -10236 -12301 -5268
8433 -5268 14024 27269 -10356 -15519 -36361 -35284 -42550 -52311 -55004 -35207 -12930 3724 25074
8420 25074 46807 25900 -19801 -19668 235 14759 27254 41819 40616 29893 8801 10891 -14641
8407 -14641 -47704 -33153 -48528 -20245 2470 -29076 -34159 -34550 -30162 -3528 4519 7917 -28510
8394 -28510 -37067 -28743 -30339 -11381 -11472 -46460 -42573 -31680 -49433 -53875 -67924 -75644 -63248 -51284
8380 -51284 -26133 -16849 -5463 12788 13887 7351 -16484 -49173 -5367 -8863 -9047 -4372 -17923
$$ packed form
8473e4145K9851K6853k2589p459m244l6370R662J0390j1142j2772K705K4962L8135
8460f163J1315J4j9146k4894N566K8951n711m767q06j400l0636l0091L0294O5330
8446A7856k7905k7448j8555j954J6114Q643K4701o16L239Q103j2414k065P033
8433e268J9292J3245l7625n163k0842J077p266r761k693J9797K2277J6654K1350
8420B5074K1733k0907m5701J33J9903J4524J2495J4565j203j0723k1092K090k5532
8407a4641l3063J4551j5375K8283K2715l1546n083l91M388K6634Q047L398l6427
8394b8510q557Q324j596J8958r1l4988L887J0893j7753m442j4049p720J2396J1964
8380e1284K5151R284J1386J8251J099o536k3835l2689M3806l496j84M675j3551
$$ plain form
8367 -17923 -33869 -29563 -39019 -15165 4769 -14401 -13418 -36662 -37762 -41627 -45188 -31577 -11598
8354 -11598 3727 12934 12412 -8381 -24647 -27593 -46603 -36787 -28517 -20586 -10899 -35739 -30588 -34634
8340 -34634 -7068 -12316 -2995 11294 -3100 -766 27365 -5379 -35398 -2789 -14203 -50162
8328 -50162 -44716 -40284 -40584 -56175 -62504 -51343 -49152 -49330 -15507 -19424 -33667 -32262 -38221 -30347
8314 -30347 -19892 -1002 -15462 -23425 -25144 -26355 -29814 -20622 -34458 -15948 -7855 -18961 -28345
8301 -28345 -17440 -3949 22285 29643 8012 -1438 9980 -8676 -21355 -15261 -2597 -36068
8289 -36068 -31974 -8919 -14737 1176 -16392 -4205 -261 13150 28871 -1023 -5367 1325 -17068
8276 -17068 9360 9041 -5587 -41105 -70247 -68878 -39119 -38335 -25386 20368 38062 15791 -5223
$$ packed form
8367a7923j5946M306r456K3854J9934j9170R83k3244j100l865l561J3611J9979
8354a1598J5325R207n22k0793j6266k946j9010R816Q270P931R687k4840N151m046
8340c4634K7566n248R321J4289j4394K334K8131l2744l0019L2609j1414l5959
8328e0162N446M432l00j5591o329J1161K191j78L3823l917j4243J405n959P874
8314c0347J0455J8890j4460p963j719j211l459R192j3836J8510Q093j1106r384
8301b8345J0905J3491K6234P358k1631r450J1418j8656j2679O094J2664l3471
8289c6068M094K3055n818J5913j7568J2187L944J3411J5721k9894m344O692j8393
8276a7068K6428l19j4628l5518k9142J369K9759P84J2949M5754J7694k2271k1014
$$ plain form
8263 -5223 6062 16121 35823 11125 -13397 -22260 -1128 14200 9169 -2672 11744 20289 49479
8250 49479 28007 17220 14401 -12146 -48381 -46229 -28926 -16883 -3356 28400 23395 -4800
8238 -4800 -22278 -29644 -22320 -22468 -42010 -69273 -91706 -62900 -30848 -37149 -37281 -32287 -23700 -44395
8224 -44395 -25356 -22490 -37587 -18163 -21643 -24496 2441 11708 12855 56200 36818 14970 15770
8211 15770 39198 57415 22908 -8661 -15803 -22687 -1554 23419 16864 -3093 -1472 -13725 -43107
8198 -43107 -69697 -50036 -56977 -78098 -46993 -12941 -15332 -1722 1591 820 148 -3410 -14362
8185 -14362 -38517 -32483 -37352 -35672 -28032 -48051 -60769 -28520 11487 3912 3371 17564 6534
8172 6534 -30133 -27464 -31066 -21272 -23714 -40175 -48573 -4758 15445 16900 30755 5915 -25758
$$ packed form
8263e223J1285J0059J9702k4698k4522q863K1132J5328n031j1841J4416Q545K9190
8250D9479k1472j0787k819k6547l6235K152J7303J2043J3527L1756n005k8195
8238d800j7478p366P324j48j9542k7263k2433K8806L2052o301j32M994Q587k0695
8224d4395J9039K866j5097J9424l480k853K6937R267J147M3345j9382k1848Q00
8211A5770K3428J8217l4507l1569p142o884K1133K4973o555j9957J621j2253k9382
8198d3107k6590J9661o941k1121L1105L4052k391J3610L313p71o72l558j0952
8185a4362k4155O034m869J680P640k0019j2718L2249M0007p575n41J4193j1030
8172F534l6667K669l602R794k442j6461q398M3815K0203J455J3855k4840l1673
$$ plain form
8159 -25758 -26657 -57592 -68314 -86277 -64463 -39800 23784 9082 -2005 35337 46950 32161
8147 32161 29186 -15389 -36378 -41262 -24880 -32599 -58082 -52914 -10311 19150 6192 -14 8767
8134 8767 18615 -9043 -5512 -1089 -15143 7719 10933 4063 -9169 -19673 -36962 -62479 -53215
8121 -53215 -22684 -11607 -32638 -68258 -57342 -46167 -45687 -33972 -32464 -36745 -12454 -23042 -29741
8108 -29741 -12818 -12399 -36231 -43955 -51113 -9548 2125 2346 -25265 -29683 -24030 -9645 8430
8095 8430 -924 11542 3906 -4475 3769 -5261 -18285 -29742 -5591 -4857 -1231 -19250 -17683 25794
8081 25794 37614 -5663 -17453 1865 8473 -1875 8991 2042 18488 9325 12178 8234 26111
8068 26111 -3079 -30779 -46893 -36576 -32263 -10601 -6230 9297 3557 2634 8642 -25638 -70509
$$ packed form
8159b5758q99l0935j0722j7963K1814K4663O3584j4702j1087L7342J1613j4789
8147C2161k975m4575k0989m884J6382p719k5483N168M2603K9461j2958o206Q781
8134H767R848k7658L531M423j4054K2862L214o870j3232j0504j7289k5517R264
8121e3215L0531J1077k1031l5620J0916J1175M80J1715J508m281K4291j0588o699
8108b9741J6923M19k3832p724p158M1565J1673K21k7611m418N653J4385J8075
8095H430r354J2466p636q381Q244r030j3024j1457K4151P34L626j8019J567M3477
8081B5794J1820m3277j1790J9318O608j0348J0866o949J6446r163K853l944J7877
8068B6111k9190k7700j6114J0317M313K1662M371J5527n740r23O008l4280m4871
$$ plain form
8055 -70509 -91253 -80096 -44142 -36901 -37655 -20547 12681 30765 54440 73906 56300 6128
8043 6128 -34488 -14973 -21185 -38870 -67439 -67800 -36283 -30431 -27590 -19383 -31024 -57160 -42910
8030 -42910 -52630 -60206 -58572 -45573 -38863 -35024 -33830 -43982 -22105 -20966 2495 -27087 -82463
8017 -82463 -80919 -53476 -35833 -49110 -70459 -35491 -10213 -28916 -36834 -57543 -55878 -50140 -45452
8004 -45452 -18281 -5956 -6713 40560 67627 21434 -8261 -3532 6294 9278 6693 26127 42402
7991 42402 17708 7187 20125 24654 396 -10742 825 -29874 -32518 -28161 8933 38061
7979 38061 33049 -10623 -27798 -39403 -21830 -1773 9425 15729 -9313 -24435 197 1329
7967 1329 -24549 -30400 -23419 -15345 -3782 -4497 -38876 -27205 14677 26302 31634 42304 22573
$$ packed form
8055g0509k0744J1157L5954P241p54J7108L3228J8084K3675J9466j7606n0172
8043F128m0616J9515o212j7685k8569l61L1517N852K841Q207j1641k6136J4250
8030d2910r720p576J634J2999O710L839J194j0152K1877J139K3461k9582n5376
8017h2463J544K7443J7643j3277k1349L4968K5278j8703p918k0709J665N738M688
8004d5452K7171J2325p57M7273K7067m6193k9695M729R826K984k585J9434J6275
7991D2402k4694j0521J2938M529k4258j1138J1567l0699k644M357L7094K9128
7979C8061n012m3672j7175j1605J7573K0057J1198O304k5042j5122K4632J132
7967A329k5878n851O981Q074J1563p15l4379J1671M1882J1625N332J0670j9731
$$ plain form
7954 22573 12088 -24591 -21857 -21459 -37946 -40634 -37339 -11126 -15488 19759 38011 8466 16832
7941 16832 32073 -4720 -20308 -23065 -26468 -10908 -12675 5865 13695 12067 12389 -12505 -34661
7928 -34661 -13412 5155 -2556 -17313 -18558 -18032 -8205 -7668 -16483 7993 27090 28978 5839 -18438
7914 -18438 -25245 -23911 -1070 -6116 -12723 -19194 6667 23877 14393 -3141 -32402 -27645 -7434
7901 -7434 519 -5354 -7205 -17460 -47719 -85534 -79359 -29032 -488 -5830 18354 61786 54052
7888 54052 8100 3687 -18099 -43218 -46222 -24000 -17252 -12787 -31829 -34691 -20679 -17213 -8399
7875 -8399 24043 6502 19154 20466 15145 7787 16909 7734 20944 62377 75368 65756 70659
7862 70659 87959 59769 34760 41599 29557 1533 6386 -6402 -4148 6575 -17982 -26439 -15351
$$ packed form
7954B2573j0485l6679K734L98j6487k688L295K6213m362L5247J8252k9545Q366
7941A6832J5241l6793j5588k757l403J5560j767J8540P830j628L22k4894k2156
7928c4661K1249J8567p711j4757j245N26R827N37q815K4476J9097J888k3139k4277
7914a8438o807J334K2841n046o607o471K5861J7210r484j7534k9261M757K0211
7901g434P953n873j851j0255l0259l7815O175N0327K8544n342K4184M3432p734
7888E4052m5952m413k1786k5119l004K2222O748M465j9042k862J4012L466Q814
7875h399L2442j7541J2652J312n321p358R122r175J3210M1433J2991r612M903
7862G0659J7300k8190k5009O839j2042k8024M853j2788K254J0723k4557q457J1088
$$ plain form
7849 -15351 17221 31140 13406 -10596 -3400 19315 27221 7671 -5927 -5564 -38483 -55359 -68966
7836 -68966 -51523 -37495 -24052 3126 -5591 18356 1792 -12520 -28859 -63685 -77528 -52754
7824 -52754 -54329 -50327 -22670 12780 28437 -28444 -48489 -22436 33662 34079 -11848 -44051 -45227
7811 -45227 -48725 -59233 -40621 -16505 6453 27346 20036 15721 33588 22967 -10479 -24971
7799 -24971 -40221 -12538 23055 -9303 -55294 -51890 -50377 -42823 -76760 -80509 -42641 -4646 -25384
7786 -25384 -62178 -68127 -59337 -23463 10341 11635 24110 25991 17260 1410 -9122 -7125 -21489
7773 -21489 -18101 -19334 -4218 -10695 -32369 -27018 -10470 -33990 -14037 -10611 -14884 -26758 -40893
7760 -40893 -34958 -13132 -27081 3612 34268 18893 -6770 -36790 -38088 -27123 -20308 -25106 -23363
$$ packed form
7849a5351L2572J3919j7734k4002P196K2715P906j9550j3598L63l2919j6876j3607
7836f8966J7443J4028J3443K7178q717K3947j6564j4312j6339l4826j3843K4774
7824e2754j575M002K7657L5450J5657n6881k0045K6053N6098M17m5927l2203j176
7811d5227l498j0508J8612K4116K2958K0893p310m315J7867j0621l3446j4492
7799b4971j5250K7683L5593l2358m5991L404J513P554l3937l749L7868L7995k0738
7786b5384l6794n949Q790L5874L3804J294J2475J881q731j5850j0532J997j4364
7773b1489L388j233J5116o477k1674N351J6548k3520J9953L426m273j1874j4135
7760d0893N935K1826j3949L0693L0656j5375k5663l0020j298J0965O815m798J743
$$ plain form
7747 -23363 18522 29175 20733 26485 33204 37299 35414 29828 6507 -1073 -10629 575 20630
7734 20630 18564 -10640 -9183 -21494 -42506 -34742 -29340 -31518 -11259 6628 -2753 -25048 -50912
7721 -50912 -65152 -44241 -29621 -36741 -13985 -21440 -18682 -8060 -12143 6064 31384 52421 34876
7708 34876 2468 1025 15037 22985 28741 31738 6617 -27903 -12301 27993 14252 17370 17521
7695 17521 -27365 -47860 -54774 -51316 -50803 -30946 -11374 -1582 259 27459 53232 30310 -8370
7682 -8370 -45493 -60744 -55701 -81489 -63906 -38654 -20012 -10801 -24508 -37379 -27224 -17095
7670 -17095 -16092 -26972 -29766 -53873 -32453 -30442 -14055 -4689 -33328 -11492 28267 35716 12233
7657 12233 -10736 -41446 -55766 -57081 -40981 -24818 11232 19119 13365 24640 23098 13273 726
$$ packed form
7747b3363M1885J0653q442N752O719M095j885n586k3321p580r556J1204K0055
7734B0630k066k9204J457j2311k1012P764N402k178K0259J7887r381k2295k5864
7721e0912j4240K0911J4620p120K2756p455K758J0622m083J8207K5320K1037j7545
7708C4876l2408j443J4012P948N756K997k5121l4520J5602M0294j3741L118J51
7695A7521m4886k0495o914L458N13J9857J9572R792J841K7200K5773k2922l8680
7682h370l7123j5251N043k5788J7583K5252J8642R211j3707j2871J0155J0129
7670a7095J003j0880k794k4107K1420K011J6387R366k8639K1836L9759P449k3483
7657A2233k2969l0710j4320j315J6100J6163L6050P887n754J1275j542r825j2547
$$ plain form
7644 726 1756 -5667 -10078 -18882 -33399 -42687 -58552 -58350 -63351 -41191 -26253 9194 23219 28016
7630 28016 11108 -38175 -64435 -40532 -27897 -38918 -38335 -15271 9959 7701 20099 53354
7618 53354 63621 51181 5337 -473 -20902 -24615 3533 1329 4205 16103 20367 21582 7210
7605 7210 -25897 -26417 -13487 -16111 -39175 -32747 -37854 -32981 -40603 -10724 -10932 -37649 -53265 -29387
7591 -29387 -11543 -8928 -35814 -26003 -12941 -22455 -28623 -37450 -16889 -6311 -14455 -27637 -29076
7578 -29076 -23440 -33069 -16120 -35387 -45693 -36120 4949 21967 3247 11522 -2524 6464 -11685
7565 -11685 -32395 -29081 -13492 -11856 -21628 -30492 -30499 -30445 -40478 -16857 -520 10280 13488 -18904
7551 -18904 -52650 -60503 -57717 -55381 -67158 -57856 -37832 -40853 -48139 -61056 -40637 -24090 -4456
$$ packed form
7644G26J030p423m411q804j4517r288j5865K02n001K2160J4938L5447J4025M797
7630B8016j6908m9283k6260K3903J2635j1021N83K3064K5230k258J2398L3255
7618E3354J0267j2440m5844n810k0429l713K8148k204K876J1898M264J215j4372
7605G210l3107n20J2930k624k3064O428n107M873p622K9879k08k6717j5616K3878
7591b9387J7844K615k6886R811J3062r514o168q827K0561J0578q144j3182j439
7578b9076N636r629J6949j9267j0306R573M1069J7018j8720Q275j4046Q988j8149
7565a1685k0710L314J5589J636r772q864pN4j0033K3621J6337J0800L208l2392
7551a8904l3746p853K786K336j1777R302K0024l021p286j2917K0419J6547J9634
$$ plain form
7538 -4456 2778 34686 21633 -12269 -65067 -56334 -33886 -37798 -27166 -52736 -51693 -27795 -22883
7525 -22883 -19423 -1749 -1960 1476 -10669 -11133 25249 23836 3879 -10132 -18591 -38086 -67692
7512 -67692 -68687 -53791 -29873 -21105 -15076 -33282 -48679 -41199 -32403 -13121 -15276 -32090 -27305
7499 -27305 -25023 -38390 -28275 -47666 -35048 -21813 -18706 456 -8390 3596 7472 -11315 -51412
7486 -51412 -67498 -48453 -25867 -33304 -10292 -12020 -22560 -14226 -23863 -18720 9015 -20110 -23981
7473 -23981 -16243 -14 -8205 -43099 -67808 -55852 -48423 -15063 25938 37895 19258 -8400
7461 -8400 -29155 -6810 -12847 -55622 -45428 82 -6686 -20414 -32417 -38727 -51973 -48614 -28711
7448 -28711 -26728 -13452 -8073 -11537 -7166 -37420 -44622 -40565 -29164 -54963 -79896 -51733 -19936
$$ packed form
7538d456P234L1908j3053l3902n2798Q733K2448l912J0632k5570J043K3898M912
7525b2883L460J7674k11L436j2145m64L6382j413j9957j4011q459j9495k9606
7512f7692r95J4896K3918Q768O029j8206j5397P480Q796J9282k155j6814M785
7499b7305K282j3367J0115j9391J2618J3235L107J9162q846J1986L876j8787m0097
7486e1412j6086J9045K2586p437K3012j728j0540Q334r637N143K7735k9125l871
7473b3981P738J6229q191l4894k4709J1956P429L3360M1001J1957j8637k7658
7461h400k0755K2345o037m2775J0194M5510o768j3728j2003o310j3246L359J9903
7448b8711J983J3276N379l464M371l0254p202M057J1401k5799k4933K8163L1797
$$ plain form
7435 -19936 -22013 15291 28311 -2216 -25940 -24812 -21606 -18457 -217 10211 2186 5930 17109
7422 17109 19653 3695 -19118 -31289 -20280 4874 1998 -3517 -18234 -23164 -1202 -12317 -8196
7409 -8196 1414 6114 930 8003 8836 14919 35235 23052 14048 35873 41438 37241 17723 10173
7395 10173 -14704 -30170 -21340 -10864 8292 5926 1039 15401 7370 -11464 -10910 -25833 -42956
7382 -42956 -69218 -44648 -25894 -18190 -1963 31594 28387 16996 36909 20622 2931 -11368
7370 -11368 -8460 16224 -5468 -25574 -14277 2117 9411 3165 -15049 -20514 -10734 -5932 -18204
7357 -18204 -20512 20501 15043 -18479 -16265 -3847 -8013 -45359 -36100 -12600 -24904 -7241 18723
7344 18723 31365 19308 -1225 -2214 -32535 -56990 -41070 -22027 5686 -3759 -23021 -28600 -5264
$$ packed form
7435a9936k077L7304J3020l0527k3724J128L206L149J8240J0428q025L744J1179
7422A7109K544j5958k2813j2171J1009K5154k876n515j4717m930K1962j1115M121
7409h196R610M700n184P073Q33O083K0316j2183r004K1825N565m197j9518p550
7395A0173k4877j5466Q830J0476J9156k366m887J4362q031j8834N54j4923j7123
7382d2956k6262K4570J8754P704J6227L3557l207j1391J9913j6287j7691j4299
7370a1368K908K4684k1692k0106J1297J6394P294o246j8214n465R780M802j2272
7357a8204k308M1013n458l3522K214J2418m166l7346R259K3500j2304J7663K5964
7344A8723J2642j2057k0533r89l0321k4455J5920J9043K7713r445j9262n579K3336
$$ plain form
7331 -5264 48094 61140 32316 3389 -13138 -26784 -27605 -21835 14234 29224 18013 5313 -4758
7318 -4758 -16074 -26076 -48477 -40745 -30724 -16532 -16024 10037 -9877 -7938 -4711 -14537 -33602
7305 -33602 -25336 -49352 -70131 -62150 -34200 4588 -8972 -9451 1125 -3713 -14157 4517 -1118
7292 -1118 9178 4825 23068 13426 6829 -5757 8700 24912 29015 35593 22519 8168 30366
7279 30366 34407 -289 -7531 23884 17578 -9288 -32721 -10184 878 -8759 -12966 5534 30407
7266 30407 -5354 -33501 -44580 -50532 -3021 37037 13820 9942 19260 25163 33745 33844 7729
7253 7729 -21772 -45081 -61635 -20224 4518 16521 8750 -10124 10679 14399 30210 28996 10403
7240 10403 -19929 -37565 -23363 1566 -48064 -59661 -32818 -7262 3550 -15957 -50294 -48487
$$ packed form
7331e264N3358J3046k8824k8927j6527j3646q21N770L6069J4990j1211j2700j0071
7318d758j1316j0002k2401P732J0021J4192N08K6061j9914J939L227r826j9065
7305c3602Q266k4016k0779P981K7950L8788j3560m79J0576m838j0444J8674n635
7292a118J0296m353J8243r642o597j2586J4457J6212M103O578j3074j4351K2198
7279C0366M041l4696p242L1415o306k6866k3433K2537J1062r637m207J8500K4873
7266C0407l5761k8147j1079n952M7511M0058k3217l878R318N903Q582R9k6115
7253G729k9501k3309j6554M1411K4742J2003p771j8874K0803L720J5811j214j8593
7240A0403l0332j7636J4202K4929m9630j1597K6843K5556J0812j9507l4337J807
$$ plain form
7228 -48487 -66134 -67173 -37286 -28274 -23543 -12029 -13390 -14215 5184 3312 -8576 -2660 21264
7215 21264 31386 7733 2385 30318 7338 3301 -13878 -19601 -6766 8543 -2382 -17072
7203 -17072 -5740 -1171 -24020 -33314 -12100 -16942 -26421 -51265 -34909 -30756 -18684 -28192 -32631
7190 -32631 -23107 -22619 5323 10646 -8243 4871 455 4347 18648 2807 10805 9224 14673 8360
7176 8360 31987 16550 4592 5467 2313 -5461 5449 15461 10955 568 -19964 -5115 -2264
7163 -2264 -14240 -18483 -48404 -76584 -50695 -22935 -26980 -31053 -18679 -24821 -44421 -54293 -50028
7150 -50028 -39107 -34065 6808 -17502 -22771 -10172 38683 58736 5829 982 30392 11754
7138 11754 2320 16204 494 -18218 -12421 -11438 -17755 -56920 -63491 -58038 -34325 -17773 27264
$$ packed form
7228d8487j7647j039K9887R012M731J1514j361q25J9399j872j1888N916K3924
7215B1264J0122k3653n348K7933k2980m037j7179n723J2835J5309j0925j4690
7203a7072J1332M569k2849r294K1214m842r479k4844J6356M153J2072r508m439
7190c2631R524M88K7942N323j8889J3114m416L892J4301j5841P998j581N449o313
7176H360K3627j5437j1958Q75l154p774J0910J0012m506j0387k0532J4849K851
7163b264j1976m243k9921k8180K5889K7760m045m073J2374o142j9600r872M265
7150e0028J0921N042M0873k4310n269J2599M8855K0053n2907m847K9410j8638
7138A1754r434J3884j5710j8712N797R83o317l9165o571N453K3713J6552M5037
$$ plain form
7125 27264 41108 33743 -1787 -47034 -42251 -15686 -40001 -48794 -43539 -26516 -45295 -60179 -37155
7112 -37155 -6255 10708 16183 38962 16659 -181 -12555 -43399 -47256 -34031 -25941 -15913
7100 -15913 8405 27945 -17095 -57694 -38371 -36346 -60581 -39866 -12745 27317 25375 35
7088 35 -5082 -35163 -44081 -32686 -7777 14246 29083 13245 5336 -42 -2477 -617 -18376 -33882
7074 -33882 -39178 -53335 -61315 -34645 -19839 -2127 -2233 -11183 -22186 -40850 -44963 -47022 -38502
7061 -38502 -14221 -14827 -37683 -49479 -72417 -97064 -84714 -64332 -31213 -44457 -40852 -2934
7049 -2934 -9211 -27340 -41762 -35937 -39607 -41311 -57777 -52540 -31261 -23863 -33106 -40911 -22308 -2080
7035 -2080 -18283 -39099 -39845 -41367 -22507 9682 40017 18143 2402 12569 30083 4035 -6547
$$ packed form
7125B7264J3844p365l5530m5247M783K6565k4315q793N255J7023j8779j4884K3024
7112c7155L0900J6963N475K2779k2303j6840j2374l0844l857J3225Q090J0028
7100a5913K4318J9540m5040m0599J9323K025k4235K0715K7121M0062j942k5340
7088C5n117l0081q918J1395K4909K2023J4837j5838p909n378k435J860j7759j5506
7074c3882n296j4157p980K6670J4806J7712j06q950j1003j8664m113k059Q520
7061c8502K4281o06k2856j1796k2938k4647J2350K0382L3119j3244L605L7918
7049b934o277j8129j4422N825l670j704j6466N237K1279P398r243p805J8603K0228
7035b080j6203k0816p46j522J8860L2189L0335k1874j5741J0167J7514k6048j0582
$$ plain form
7022 -6547 -5684 3536 5084 8459 -5656 -33672 -47887 -41684 -23477 -21796 -26150 -10766 4899 7493
7008 7493 18925 -6164 2079 -5778 -17801 -6229 -10432 -20567 -38538 -32707 -34639 -44737 -41361
6995 -41361 -6729 -9530 -24715 -63156 -36796 6359 22565 10359 -2025 6236 17443 -16019
6983 -16019 -42903 -32293 -9903 20063 29950 -4412 -46640 -46069 -3927 -4202 -20868 -23642 -7830
6970 -7830 -5210 -2434 -20884 -26334 -34770 -21141 -38487 -52613 -48898 -32401 15439 19320 -2253
6957 -2253 -37247 -4587 12308 6696 24800 44139 19354 17109 25193 24748 18597 -32690 -26091
6944 -26091 -23222 -34684 -33837 -41441 -37328 -18477 -29663 -32346 -9726 -1309 -10222 -11833 -5869 5709
6930 5709 5231 -34388 -9289 6270 -23724 -15169 9373 -10871 -17770 -22696 -21087 -5741 499
$$ packed form
7022f547Q63R220J548L375j4115k8016j4215O203J8207J681m354J5384J5665K594
7008G493J1432k5089Q243p857j2023J1572m203j0135j7971N831j932j0098L376
6995d1361L4632k801j5185l8441K6360M3155J6206j2206j2384Q261J1207l3462
6983a6019k6884J0610K2390K9966R887l4362m2228N71M2142k75j6666k774J5812
6970g830K620K776j8450n450q436J3629j7346j4126L715J6497M7840L881k1573
6957b253l4994L2660J6895n612J8104J9339k4785k245Q084m45o151n1287O599
6944b6091K869j1462Q47p604M113J8851j1186k683K2620Q417q913j611N964J1578
6930E709m78l9619K5099J5559k9994Q555K4542k0244o899m926J609J5346O240
$$ plain form
6917 499 942 -7556 8726 25334 21157 4320 -4397 -11519 -26271 -69193 -43597 -36787 -44686 5605
6903 5605 5069 -32298 -59740 -42393 -30009 950 22386 26443 14062 11020 17445 22578 -2138
6890 -2138 -24362 -23648 -25589 -3750 14033 -3755 -19398 -27887 -15940 -2210 6854 15875 2880
6877 2880 12454 13418 -12299 -18087 -3980 10050 5830 9628 21155 -5260 -25339 -21180 4339
6864 4339 -17689 -74609 -89134 -61897 -44895 -43563 -46484 -34952 -23846 -20823 -10013 8400 -5256
6851 -5256 15686 9724 19537 29180 6239 -7205 12992 -20506 -51399 -39785 -21452 -5478 -16644
6838 -16644 -9541 -5259 -20295 -20460 -2561 -29851 -56730 -32265 -5680 -10432 -6518 -980 28520
6825 28520 35510 32367 10413 -19362 -55943 -87736 -88240 -43414 -29697 -18838 -35477 -45691 -8776
$$ packed form
6917D99M43q498J6282J6608m177j6837q717p122j4752m2922K5596O810p899N0291
6903E605n36l7367k7442J7347J2384L0959K1436M057j2381l042O425N133k4716
6890b138k2224P14j941K1839J7783j7788j5643q489J1947J3730R064R021j2995
6877B880R574R64k5717n788J4107J4030m220L798J1527k6415k0079M159K5519
6864D339k2028n6920j4525K7237J7002J332k921J1532J1106L023J0810J8413j3656
6851e256K0942n962R813R643k2941j3444K0197l3498l0893J1614J8333J5974j1166
6838a6644P103M282j5036j65J7899k7290k6879K4465K6585m752L914N538K9500
6825B8520O990l143k1954k9775l6581l1793n04M4826J3717J0859j6639j0214L6915
$$ plain form
6812 -8776 -23405 -16311 -26134 3236 26741 14665 -16210 -26283 -22215 -49598 -28335 -13018 -9523
6799 -9523 13643 12509 25632 27457 -4742 -10399 -411 -4435 -12449 -1343 -24052 -24810 -29134 -20908
6785 -20908 2941 6349 14308 5493 -31014 -61587 -67544 -44027 -14491 12983 -6530 -17676 -2959
6772 -2959 -11879 -13620 24927 -3550 -16172 -13751 -17674 -18389 11759 13106 22459 -10487 -18409 -3534
6758 -3534 -865 6385 3695 -11527 -30708 -35580 -1618 6547 20137 41498 52612 15505 -12051
6745 -12051 11062 664 -6887 -1801 -8895 -6090 -28513 -18773 -2922 1431 -18277 -16325 -16241 -26808
6731 -26808 -39086 -46536 -44194 -38256 -47116 -24699 -33937 -27453 -40466 -64047 -28474 -23534 -34837
6718 -34837 -34388 -5770 -21458 -48911 -49675 -46603 -58664 -62876 -59135 -20168 -630 -11476 -19044
$$ packed form
6812h776j4629P094r823K9370K3505j2076l0875j0073M068k7383K1263J5317L495
6799i523K3166j134J3123J825l2199n657R988m024q014J1106k2709p58m324Q226
6785b0908K3849L408P959q815l6507l0573n957K3517K9536K7474j9513j1146J4717
6772b959q920j741L8547k8477j2622K421l923p15L0148J347R353l2946p922J4875
6758c534K669P250k690j5222j9181m872L3962Q165J3590K1361J1114l7107k7556
6745a2051K3113j0398p551N086p094K805k2423R740J5851M353j9708J952Q4j0567
6731b6808j2278p450K342N938q860K2417r238O484j3013k3581L5573M940j1303
6718c4837M49K8618j5688k7453p64L072j2061m212L741L8967J9538j0846p568
$$ plain form
6705 -19044 2093 -2399 6306 -8079 -30125 -57420 -64677 -30469 -30315 -55033 -52171 -17999 -12278
6692 -12278 -6467 8805 7465 -15809 -13318 -16828 -28951 -65471 -35222 -264 -15590 -19087 -15038
6679 -15038 2392 19480 22698 39670 10243 -27383 3622 44033 35824 395 -12110 -37374
6667 -37374 -41616 -8908 11146 27766 44673 40656 6094 -19027 -19689 -32555 -55421 -46068 -33311
6654 -33311 -17430 4409 5800 -1846 -16287 -30759 -24320 -48768 -56440 -36890 -10077 10559 5186
6641 5186 2869 14593 41430 44712 40587 44073 27068 -7278 -24079 -6278 26909 21608 7564
6628 7564 -8173 -6993 1325 8851 -10260 -25647 -45099 -47953 -45006 -45127 -28884 -6033 -7339 -402
6614 -402 -4745 -21346 -33290 -22484 -3664 26652 35184 23571 -174 -29186 -24308 -26234 -46395
$$ packed form
6705a9044K1137m492Q705j4385k2046k7295p257L4208J54k4718K862L4172N721
6692a2278N811J5272j340k3274K491l510j2123l6520L0249L4958j5326l497M049
6679a5038J7430J7088L218J6972k9427l7626L1005M0411q209l5429j2505k5264
6667c7374m242L2708K0054J6620J6907m017l4562k5121o62j2866k2866R353J2757
6654c3311J5881K1839J391p646j4441j4472O439k4448p672J9550K6813K0636n373
6641E186k317J1724K6837L282m125L486j7005l4346j6801J7801L3187n301j4044
6628G564j5737J180Q318P526j9111j5387j9452k854K947j21J6243K2851j306O937
6614d02m343j6601j1944J0806J8820L0316Q532j1613k3745k9012M878j926k0161
$$ plain form
6601 -46395 -42838 5870 19976 -6986 -45460 -61359 -62074 -71038 -26403 -34446 -43390 -60508 -42108
6588 -42108 -27769 -15290 251 18212 -22484 -29900 -17907 -6329 19624 10166 7904 10364 11946
6575 11946 -5377 -7900 -17216 -5551 -2320 -7563 7884 28133 33516 47966 5424 -29472 -29098
6562 -29098 -46088 -31911 -17714 -45299 -29727 12312 2960 -8514 -21674 -22936 -3736 -15354
6550 -15354 -9936 -16722 -63604 -55828 -20458 -20871 -23048 1369 -21403 -51388 -54874 -38074 -21671
6537 -21671 14302 -5497 -18507 -24568 -24546 -36605 -48666 -37848 -19757 -8940 -20686 -4129 -6267
6524 -6267 -20122 -13940 -17149 2347 4208 5737 -3259 -18521 12477 5900 -5179 -22324 -54130
6511 -54130 -33660 -21299 -49388 -36169 -37326 -50430 -40132 -29959 -36692 -22485 -14507 -23051 -35547
$$ packed form
6601d6395L557M8708J4106k6962l8474j5899p15q964M4635q043q944j7118J8400
6588d2108J4339J2479J5541J7961m0696p416J1993J1578K5953r458k262K460J582
6575A1946j7323k523r316J1665L231n243J5447K0249N383J4450m2542l4896L74
6562b9098j6990J4177J4197k7585J5572M2039r352j1474j3160j262J9200j1618
6550a5354N418o786m6882P776L5370m13k177K4417k2772k9985l486J6800J6403
6537b1671L5973j9799j3010o061K2j2059j2061J0818J8091J0817j1746J6557k138
6524f267j3855O182l209J9496J861J529q996j5262L0998o577j1079j7145l1806
6511e4130K0470J2361k8089J3219j157j3104J0298J0173o733J4207P978q544j2496
$$ plain form
6498 -35547 -28490 -9352 1571 4061 17420 20927 7481 2249 20150 2121 3503 17383 31075
6485 31075 37007 17834 3150 39450 34326 17436 -633 -24090 -27574 -36159 -47090 -38941 -42593
6472 -42593 -69734 -69611 -44797 -20861 7628 19386 9534 8100 -2759 -34343 -54600 -15413 1703
6459 1703 -27751 -10353 -21173 -19364 -11981 -43936 -26726 -3156 3834 -16731 -17832 -26811 -6973
6446 -6973 4657 -3459 5577 17297 34611 33521 33463 41509 49767 22943 -8841 -36086 -21807 22610
6432 22610 -8734 -48028 -21163 -6656 7206 10573 -10016 -12657 -17006 -8905 -9955 -9662 4721
6419 4721 -6756 -9751 13014 37880 35710 32458 22350 18981 16945 19559 26315 25177 23859 7735
6405 7735 14459 14331 1633 -15490 -18814 8926 22217 287 -13482 12295 25933 18521 21404
$$ packed form
6498c5547P057J9138J0923K490J3359L507j3446n232J7901j8029J382J3880J3692
6485C1075N932j9173j4684L6300n124j6890j8069k3457l484q585j0931Q149l652
6472d2593k7141J23K4814K3936K8489J1758r852j434j0859l1584k0257L9187J7116
6459A703k9454J7398j0820J809P383l1955J7210K3570O990k0565j101q979J9838
6446f973J1630q116R036J1720J7314j090n8Q046Q258k6824l1784k7245J4279M4417
6432B2610l1344l9294K6865J4507J3862L367k0589k641m349Q101j050K93J4383
6419D721j1477k995K2765K4866k170l252j0108l369k036K614O756j138j318j6124
6405G735O724j28j2698j7123l324K7740J3291k1930j3769K5777J3638p412K883
$$ plain form
6392 21404 12554 -1796 -15976 -3115 -36216 -30617 -5694 17336 9381 -42357 -78830 -37049
6380 -37049 15137 16534 -7251 -37269 -39971 -23550 -22775 -13182 -28508 -37100 -33059 -36934 -23394
6367 -23394 -22202 -25576 -19 -2280 -19447 -28719 -9108 3466 -4008 -18704 -16794 -21646 -29545
6354 -29545 -27538 -9219 -4262 -11101 -2858 -7179 5769 15280 4420 1432 1031 -1117 2885 -19694
6340 -19694 -28005 -5752 -32423 -31169 -8796 -7066 -34508 -29457 -51523 -26381 -520 15908 13284
6327 13284 35084 27375 4753 -26438 -32125 -45125 -42665 -19339 9866 15866 27319 2471 -13599
6314 -13599 -14720 2263 8836 -23036 -26051 -11995 19977 23673 24619 3069 1442 1792 -2166 -10232
6300 -10232 11356 10345 -15747 -12640 -9724 -53353 -51939 -32470 -36550 -26087 -9171 -5436 14893
$$ packed form
6392B1404q850j4350j4180J2861l3101N599K4923K3030p955n1738l6473M1781
6380c7049N2186J397k3785l0018k702J6421P75R593j5326q592M041l875J3540
6367b3394J192l374K5557k261j7167r272J9611J2574p474j4696J910m852p899
6354b9545K007J8319M957o839Q243m321J2948R511j0860k988m01k148M002k2579
6340a9694q311K2253k6671J254K2373J730k7442N051k2066K5142K5861J6428k624
6327A3284K1800p709k2622l1191n687j3000K460K3326K9205O000J1453k4848j6070
6314a3599j121J6983O573l1872l015J4056L1972L696R46k1550j627L50l958q066
6300a0232K1588j011k6092L107K916m3629J414J9469m080J0463J6916L735K0329
$$ plain form
6287 14893 -7877 -56500 -48863 -28510 -6214 -3630 -23131 -28213 -658 18344 16049 2803 -9513
6274 -9513 -16938 -20982 -10690 15056 15745 7149 -13442 -35179 -61554 -51143 -28939 7190 -2085
6261 -2085 -30889 -56232 -30526 -21426 13679 21697 -19543 -3525 15829 13202 21047 36626 18031
6248 18031 411 -18148 -25312 -52765 -61826 -30507 -22230 -20358 -29471 -8930 49342 40148 18438
6235 18438 13281 30419 24859 14814 -4911 -26683 -40329 -55447 -14701 -13106 -46437 -22977
6223 -22977 -3290 -25870 -42885 -32671 -60284 -37013 -11866 -17187 -26903 -44718 -37448 -1518
6211 -1518 32982 28105 24675 5855 11122 20237 12409 20359 -8239 -14978 -24367 9754 29525 24802
6197 24802 27799 44327 52738 50316 27079 -7554 -61803 -69852 -47156 2991 10425 -15112 -18245
$$ packed form
6287A4893k2770m8623P637K0353K2296K584j9501n082K7555J9002k295j3246j2316
6274i513p425m044J0292K5746O89q596k0591k1737k6375J0411K2204L6129r275
6261b085k8804k5343K5706R100L5105Q018m1240J6018J9354k627P845J5579j8595
6248A8031j7620j8559p164k7453r061L1319Q277J872r113K0541N8272r194k1710
6235A8438n157J7138n560j0045j9725k1772j3646j5118M0746J595l3331K3460
6223b2977J9687k2580j7015J0214k7613K3271K5147n321r716j7815P270L5930
6211a518L4500m877l430j8820N267R115p828P950k8598o739r389L4121J9771m723
6197B4802K997J6528Q411k422k3237l4633n4249q049K2696N0147P434k5537l133
$$ plain form
6184 -18245 11282 24329 30775 39864 31427 43666 38594 11560 -1907 6299 -18019 5061 6839
6171 6839 4825 -6207 -11097 -40479 -54003 -31208 -38291 -32054 6807 6647 -10833 -23393 777
6158 777 -12877 -21822 -18633 -30122 -33072 -39001 -56816 -68492 -77775 -36864 -31577 -45859 -36930 -18468
6144 -18468 3362 -14058 -5626 -10515 10958 28873 5309 17275 3881 2838 20753 33396
6132 33396 27779 19587 7121 -19198 -28870 -13881 -10740 -905 15400 38694 47824 32906 45230
6119 45230 24884 17391 15609 9371 -11127 -5966 4246 -2810 -6994 -6764 -21299 -26212 -4879 -2975
6105 -2975 -8900 -24622 -19059 28426 31255 9231 31525 40309 38386 -4631 -33962 -58795 -67651
6092 -67651 -34917 -15850 -12595 -24481 733 9600 1467 -24619 -74160 -100673 -96305 -52731 -40021
$$ packed form
6184a8245K9527J3047O446R089q437J2239n072k7034j3467Q206k4318K3080J778
6171F839k014j1032m890k9382j3524K2795p083O237L8861j60j7480j2560K4170
6158G77j3654q945L189j1489k950n929j7815j1676r283M0911N287j4282Q929J8462
6144a8468K1830j7420Q432m889K1473J7915k3564J1966j3394j043J7915J2643
6132C3396n617q192j2466k6319r672J4989L141R835J6305K3294R130j4918J2324
6119D5230k0346p493j782o238k0498N161J0212p056m184K30j4535m913K1333J904
6105b975n925j5722N563M7485K829k2024K2294Q784j923m3017k9331k4833q856
6092f7651L2734J9067L255j1886K5214Q867q133k6086m9541k6513M368M3574J2710
$$ plain form
6079 -40021 -20851 -17890 4571 20721 465 -13273 -18240 -26346 -30247 -30130 -4919 -7061 -2559
6066 -2559 16343 3469 -21440 -5361 16463 29002 -4466 -48627 -57429 -50442 -51004 -57403 -30317
6053 -30317 7784 173 -23337 -23531 -12642 14736 -7927 -26986 -8816 -1930 5472 -10638 -1320
6040 -1320 5607 7648 -329 -12992 -6966 -7057 -4022 -16897 -41658 -12257 -3112 10048 8292 3291
6026 3291 -26003 -40858 -47219 -30257 -25557 -51806 -28146 -11276 -11231 591 -4064 -21602 -27317
6013 -27317 -7409 40483 42727 50524 56489 60849 55359 46256 31228 38908 2589 -14498 -11878
6000 -11878 10100 24360 57020 60963 56030 35017 355 -31311 -36629 -21800 3482 16690
5988 16690 31907 24118 17277 8517 25871 12486 -12615 -12697 -41944 -56297 -65967 -48498 -24024
$$ packed form
6079d0021J9170K961K2461J6150k0256j3738m967q106l901J17K5211k142M502
6066b559J8902j2874k4909J6079K1824J2539l3468m4161q802O987n62o399K7086
6053c0317L8101p611k3510j94J0889K7378k2663j9059J8170O886P402j6110R318
6040a320O927K041p977j2663O026r1L035j2875k4761K9401R145J3160j756n001
6026C291k9294j4855o361J6962M700k6249K3660J6870M5J1822m655j7538n715
6013b7317J9908M7892K244P797N965M360n490r103j5028P680l6319j7087K620
6000a1878K1978J4260L2660L943m933k1013l4662l1666n318J4829K5282J3208
5988A6690J5217p789o841q760J7354j3385k5101q2k9247j4353r670J7469K4474
$$ plain form
5975 -24024 1549 21382 12766 -21800 -48898 -50933 -61786 -64332 -43021 -17849 4158 14466
5963 14466 28452 19796 12375 -7099 -43666 -40771 -17619 -8064 4710 -28097 -33325 2873 12691
5950 12691 27268 17334 -11766 -24489 -25743 -29682 3977 30231 32883 24478 32121 49864 37016
5937 37016 21870 13761 -18652 -30684 -55603 -51185 -23944 -15087 -26845 -36320 -12343 35845 51253
5924 51253 9027 -26651 -49574 -56999 -35234 -19198 6152 49352 47306 -11470 -37367 -53483
5912 -53483 -56425 -53138 -29883 -8652 -26666 -16934 -26729 -15677 -10776 -25748 -3979 -14082 -14526
5899 -14526 -23018 -7822 3808 13995 43368 67976 61772 34433 28825 41686 36422 26635 19010
5886 19010 10094 17359 43071 83646 80340 75092 48888 27558 53909 50527 11786 9609 7995
$$ packed form
5975b4024K5573J9833q616l4566k7098k035j0853k546K1311K5172K2007J0308
5963A4466J3986q656p421j9474l6567K895K3152R555J2774l2807n228L6198R818
5950A2691J4577r934k9100j2723j254l939L3659K6254K652q405P643J7743j2848
5937C7016j5146q109l2413j2032k4919M418K7241Q857j1758r475K3977M8188J5408
5924E1253m2226l5678k2923p425K1765J6036K5350M3200k046n8776k5897j6116
5912e3483k942L287K3255K1231j8014R732r795J1052M901j4972K1769j0103m44
5899a4526q492J5196J1630J0187K9373K4608o204k7339n608J2861n264r787p625
5886A9010q916P265K5712M0575l306n248k6204k1330K6351l382l8741k177j614
$$ plain form
5873 7995 -6093 -21941 -26014 -16227 370 17123 3962 17307 18366 11919 18342 33752 29520
5860 29520 -1240 -9584 -14102 -14011 -11734 -39922 -41131 -19865 -20013 -39496 -26408 3154 7700 -981
5846 -981 19129 9272 10898 -12970 -19648 2139 16099 64386 62728 39066 24065 27696 49879
5833 49879 38452 23496 -9411 -11160 28341 33936 11777 4405 -5916 24818 17441 -20555 -27292
5820 -27292 -14755 -27407 -46959 -56154 -50166 -33894 -42352 -54186 -26524 -21110 -25517 -16526 13737
5807 13737 21094 766 -28245 -32837 386 -9806 -1663 3465 -4594 2406 -19114 -12513 65
5794 65 5115 -11146 -38585 -36235 -19471 -12631 15789 20727 9011 -9073 -27611 -41170 -35651
5781 -35651 -16670 -11368 6308 20034 -17100 -38976 -44985 -29821 -36900 -50924 -28463 -40587
$$ packed form
5873G995j4088j5848m073R787J6597J6753j3161J3345J059o447O423J5410m232
5860B9520l0760q344m518R1K277k8188j209K1266j48j9483J3088K9562M546q681
5846i81K0110r857J626k3868o678K1787J3960M8287j658k3662j5001L631K2183
5833D9879j1427j4956l2907j749L9501N595k2159p372j0321L0734p377l7996o737
5820b7292J2537j2652j9552r195N988J6272q458j1834K7662N414m407Q991L0263
5807A3737P357k0328k9011m592L3223j0192Q143N128q059P000k1520O601J2578
5794F5N050j6261k7439K350J6764O840K8420M938j1716j8084j8538j3559N519
5781c5651J8981N302J7676J3726l7134k1876o009J5164p079j4024K2461j2124
$$ plain form
5769 -40587 -50050 -35435 -19075 -48382 -61805 -31552 3213 34274 52877 43275 19759 19604 28005
5756 28005 7337 -10177 -42553 -27037 -8301 9826 22927 39860 4018 -9918 20848 17632
5744 17632 -15231 -30283 -14212 9925 6731 -23576 -36372 -30180 -18865 21457 36562 -6399
5732 -6399 -27849 -33419 -43029 -7410 -3506 18713 20958 -2149 -6966 -12556 412 15683 22185
5719 22185 -1650 -17652 -25490 -11435 -23831 -20247 -8144 -614 15631 13341 14563 30217 20582
5706 20582 3513 2216 -30622 -56070 -54600 -31627 -26909 -7091 16190 8103 28017 12091 -13684
5693 -13684 -2780 5002 -8011 -7889 -14101 7966 6523 -5900 -10417 -9755 7889 2181 3420 14169
5679 14169 -5197 1640 -1447 11807 -12735 -22581 -3623 14029 14814 4380 3595 20276 7015
$$ packed form
5769d0587r463J4615J6360k9307j3423L0253L4765L1061J8603r602k3516j55Q401
5756B8005k0668j7514l2376J5516J8736J8127J3101J6933l5842j3936L0766l216
5744A7632l2863j5052J6071K4137l194l0307j2796O192J1315M0322J5105m2961
5732f399k1450n570r610L5619L904K2219K245k3107m817n590J2968J5271O502
5719B2185k3835j6002p838J4055j2396L584J2103P530J6245k290J222J5654r635
5706B0582j7069j297l2838k5448J470K2973M718J9818K3281q087J9914j5926k5775
5693a3684J0904P782j3013J22o212K2067j443j2423m517O62J7644n708J239J0749
5679A4169j9366O837l087J3254k4542r846J8958J7652P85j0434p85J6681j3261
$$ plain form
5666 7015 10636 19951 24987 -22973 -35784 -35907 -17242 -25476 -25792 -28629 639 45291 51724 27017
5652 27017 34545 7628 7346 12891 24928 20965 -8559 -21335 -38860 -30866 -1477 16717 30944
5639 30944 34000 50083 36323 5256 -5179 23755 36089 10581 2577 3015 34339 29540 8217
5626 8217 6240 15365 23375 31430 19421 -21147 -50413 -40526 -45282 -40096 -44858 -42158 -15356 -270
5612 -270 -16709 -17338 -22050 -8668 -20196 -24004 -16996 -31198 -50035 -59888 -39870 -57636 -10019
5599 -10019 6428 17594 -471 -46275 -71084 -66547 -54383 -67340 -63566 -47223 -41943 -61460
5587 -61460 -85825 -69004 -27108 -12680 -12716 4903 4413 18585 2329 1699 -10685 -23859 -20582
5574 -20582 -15580 -16909 -19647 2832 -17895 -22531 -2635 -24807 -34679 -34459 -45846 -41925 -27345
$$ packed form
5666G015L621R315N036m7960j2811j23J8665q234l16k837K9268M4652O433k4707
5652B7017P528k6917k82N545J2037l963k9524j2776j7525P994K9389J8194J4227
5639C0944L056J6083j3760l1067j0435K8934J2334k5508q004M38L1324m799k1323
5626H217j977R125Q010Q055j2009m0568k9266R887m756N186m762K700K6802J5086
5612b70j6439o29m712J3382j1528l808P008j4202j8837r853K0018j7766M7617
5599a0019J6447J1166j8065m5804k4809M537J2164j2957L774J6343N280j9517
5587f1460k4365J6821M1896J4428l6J7619m90J4172j6256o30j2384j3174L277
5574b0582N002j329k738K2479k0727m636J9896k2172r872K20j1387L921J4580
$$ plain form
5561 -27345 -15131 -4211 651 4311 4199 -5088 -6153 -1875 -8961 25846 70793 12319 -23827
5548 -23827 -50705 -38176 -21748 -16733 10156 9674 15302 -2091 -14470 -1999 21943 45674 69599
5535 69599 63371 32319 26845 39000 46804 45717 34397 31200 -6465 -21875 -2710 21840 11967
5522 11967 23771 25988 2922 -1390 -4226 -2025 -37899 -44130 -51469 -16379 5941 8970 33920
5509 33920 51553 12231 -13833 -3991 10168 15086 28890 11859 -940 8037 21959 4551
5497 4551 -2065 -8168 1919 23805 25082 -11790 -28797 -60692 -53159 -19270 -16817 -7538 8166
5484 8166 -2088 -30738 -34904 -50217 -37341 -17860 -6946 -14922 -15755 -7330 -4519 -12289 -27901
5471 -27901 -27187 -11811 -14565 -16796 2336 9260 4518 -6175 -5510 3264 -15649 -38447 -59829 -35199
$$ packed form
5561b7345J2214J0920M862L660j12r287j065M278p086L4807M4947n8474l6146
5548b3827k6878J2529J6428N015K6889m82N628j7393j2379J2471K3942K3731K3925
5535F9599o228l1052n474J2155P804j087j1320l197l7665j5410J9165K4550r873
5522A1967J1804K217k3066m312k836K201l5874o231p339L5090K2320L029K4950
5509C3920J7633l9322k6064R842J4159M918J3804j7031j2799Q977J3922j7408
5497D551o616o103J0087K1886J277l6872j7007l1895P533L3889K453R279J5704
5484H166j0254k8650m166j5313J2876J9481J0914p976q33Q425K811p770j5612
5471b7901P14J5376k754k231J9132O924m742j0693O65Q774j8913k2798k1382K4630
$$ plain form
5457 -35199 -22651 -33478 -31108 -30445 -21463 -24546 3692 17360 38074 31722 26799 27332 30855 9477
5443 9477 -14001 -21135 2845 7516 34161 43623 20974 -11171 -23703 -40685 -35985 -41904 -43575
5430 -43575 -55631 -54559 -25931 -14299 -24185 -26381 -9151 -8364 -19640 -14420 19751 23306 12102
5417 12102 20489 5476 -18719 -19600 -38514 -30858 -25783 -19786 -38805 -44701 -41836 -39159 -31309 21920
5403 21920 45506 54809 62179 21768 9532 8266 1310 -10813 -6713 12408 -11613 -25409 -13512
5390 -13512 -10316 730 17845 22200 18269 21752 30697 39491 43834 20529 -9659 -25169 -45487
5377 -45487 -38325 -16002 -2225 25871 20803 15999 27652 42867 27776 1563 -24644 -5483
5365 -5483 -1838 -7470 20753 33272 36224 21134 25292 22741 39340 38385 43639 41489 42434 31761
$$ packed form
5457c5199J2548j0827K370O63Q982l083K8238J3668K0714o352m923N33L523k1378
5443I477k3478p134K3980M671K6645R462k2649l2145j2532j6982M700n919j671
5430d3575j2056J072K8628J1632r886k196J7230P87j1276N220L4171L555j1204
5417A2102Q387j5013k4195q81j8914P656N075N997j9019n896K865K677P850N3229
5403B1920K3586R303P370m0411j2236j266o956j2123M100J9121k4021j3796J1897
5390a3512L196J1046J7115M355l931L483Q945Q794M343k3305l0188j5510k0318
5377d5487P162K2323J3777K8096n068m804J1653J5215j5091k6213k6207J9161
5365e483L645n632K8223J2519K952j5090M158k551J6599r55N254k150R45j0673
$$ plain form
5351 31761 16561 -3897 -2085 3290 24429 14250 5227 2122 -38911 -62061 -37015 -46011 -32641
5338 -32641 -19689 -19749 -22327 622 14357 37404 48340 37878 59480 58727 37707 11365 -2259
5325 -2259 -19435 -26975 -49356 -55919 -41763 -15523 12775 27472 21243 89 -18021 -16079 -35634
5312 -35634 -44607 -3788 43232 38740 1561 -37164 -44037 -40234 -13236 -4307 -38948 -46081 -24607
5299 -24607 -11038 -2004 3298 -8117 -19984 -52374 -42913 -55982 -58883 -43303 -31575 -8765 26939
5286 26939 49622 15176 6622 6669 5931 18211 -4889 -4444 12474 26170 22805 7873 -3339 -13128
5272 -13128 10874 37538 68034 72843 31986 4399 5646 8615 -6309 -39628 -45979 -29531 10206
5259 10206 25265 7505 27606 16999 16130 29976 20454 18559 21708 42355 50257 72672 50808
$$ packed form
5351C1761j5200k0458J812N375K1139j0179r023l105m1033k3150K5046q996J3370
5338c2641J2952o0k578K2949J3735K3047J0936j0462K1602p53k1020k6342j3624
5325b259j7176p540k2381o563J4156K6240K8298J4697o229k1154j8110J942j9555
5312c5634q973M0819M7020m492l7179l8725o873L803K6998Q929l4641p133K1474
5299b4607J3569R034N302j1415j1867l2390R461j3069k901J5580J1728K2810L5704
5286B6939K2683l4446q554M7p38J2280k3100M45J6918J3696l365j4932j1212r789
5272a3128K4002K6664L0496M809m0857k7587J247K969j4924l3319o351J6448L9737
5259A0206J5059j7760K0101j0607q69J3846r522j895L149K0647P902K2415k1864
$$ plain form
5246 50808 -8983 -14747 20738 7303 -18133 -8242 3815 -4594 12552 2158 -9652 2896
5234 2896 -9322 -25636 15882 807 -1205 5339 1611 -7729 -48012 -45655 -38452 -19426 -1478
5221 -1478 -12352 -42499 -25446 -16808 7884 22998 -6049 1160 11659 6643 -26945 -25651 -10400
5208 -10400 15558 9863 -2317 -7086 -7850 -1983 13054 6089 -15429 -10842 -11989 -18522 2045 20562
5194 20562 44276 50819 27629 30678 39351 -1113 -23308 -11728 -19266 -9068 -1815 -20701 -18988
5181 -18988 -5051 9558 9008 -16725 17090 37976 18414 -8462 -16821 -11524 10811 -14158 -1626
5168 -1626 -10860 -18506 6539 23525 8043 -30046 -9628 23390 12447 3110 10930 28855 26229
5155 26229 2105 11325 18260 17307 11542 1401 3972 -8687 22720 21013 -8192 9252 20882
$$ packed form
5246E0808n9791n764L5485j3435k5436R891J2057q409J7146j0394j1810J2548
5234B896j2218j6314M1518j5075k012O544l728r340m0283K357P203J9026J7948
5221a478j0874l0147J7053Q638K4692J5114k9047P209J0499n016l3588J294J5251
5208a0400K5958n695j2180m769p64N867J5037o965k1518M587j147o533K0567J8517
5194B0562K3714O543k3190L049Q673m0464k2195J1580p538J0198P253j8886J713
5181a8988J3937J4609n50k5733L3815K0886j9562k6876q359N297K2335k4969J2532
5168a626r234p646K5045J6986j5482l8089K0418L3018j0943r337P820J7925k626
5155B6229k4124R220O935r53n765j0141K571j2659L1407j707k9205J7444J1630
$$ plain form
5142 20882 28819 45232 52843 31105 20694 -18896 -22660 -21372 -19440 -33992 -14709 -18960 -6865
5129 -6865 1987 -2532 -8734 21533 52433 33575 39790 47518 12319 9000 -84 -30072 -30268 1362
5115 1362 5651 18020 50660 20559 -10290 -11637 8697 23157 21916 29595 38179 9936 -4808
5102 -4808 6826 7359 -2623 -8920 -6874 -3922 -22067 -36633 -35954 -55358 -51557 -50061 -35597 -1205
5088 -1205 -16169 -24580 -5777 7655 13966 11916 9817 -32599 -64333 -37374 18017 19644 8015
5075 8015 -6766 11308 12534 -6612 -2092 -8088 -13847 8140 21078 25949 34450 14654 -8660
5062 -8660 10387 6492 -301 7111 4040 -2321 -22050 -21868 -5048 -19333 4500 19628 6929
5049 6929 2390 17222 9318 175 -7045 -14011 -7557 16065 15257 37738 21737 18297 3699 -13585
$$ packed form
5142B0882P937J6413P611k1738j0411l9590l764J288J932j4552J9283m251J2095
5129f865Q852m519o202L0267L0900j8858O215P728l5199l319r084k9988j96L1630
5115A362M289J2369L2640l0101l0849j347K0334J4460j241P679Q584k8243j4744
5102d808J1634N33r982o297K046K952j8145j4566O79j9404L801J496J4464L4392
5088a205j4964q411J8803J3432O311k050k099m2416l1734K6959N5391J627j1629
5075H015j4781J8074J226j9146M520n996n759K1987J2938M871Q501j9796k3314
5062h660J9047l895o793P412l071o361j9729J82J6820j4285K3833J5128j2699
5049F929m539J4832p904r143p220o966O454K3622q08K2481j6001l440j4598j7284
$$ plain form
5035 -13585 6606 33277 47685 44023 9813 9858 4703 -6265 26470 29146 20368 -5097 -26334
5022 -26334 -36358 -14491 4324 38876 48583 6042 -39223 -30374 -6965 -2010 7620 12110 8289
5009 8289 7222 9115 -13526 -27160 12830 658 -17851 -28361 -30022 -17187 6885 -4261 -46375
4996 -46375 -43558 -32734 -13469 -19902 -46794 -56672 -20115 4042 11820 1027 -9137 -24244 -3456
4983 -3456 -2594 -594 -3344 22052 13317 15516 33020 26890 35768 34108 273 -29731 -39277 -35062
4969 -35062 -31148 -44047 -34529 -31621 -25412 5649 -3083 15433 35209 37122 38260 12217 13274
4956 13274 26462 21444 2830 -3891 17863 4651 -19839 -33860 -16866 13413 28986 13665
4944 13665 -18078 -37220 -1318 -3644 -4703 22240 20816 13653 12104 -2947 12162 19736 37919
$$ packed form
5035a3585K0191K6671J4408l662l4210M5n155j0968L2735K676q778k5465k1237
5022b6334j0024K1867J8815L4552R707m2541m5265Q849K3409M955R630M490l821
5009H289j067J893k2641j3634L9990j2172j8509j0510j661J2835K4072j1146m2114
4996d6375K817J0824J9265o433k6892r878L6557K4157P778j0793j0164j5107K0788
4983c456Q62K000k750K5396q735K199J7504o130Q878j660l3835l0004r546M215
4969c5062L914j2899R518K908O209L1061q732J8516J9776J913J138k6043J057
4956A3274J3188n018j8614o721K1754j3212k4490j4021J6994L0279J5573j5321
4944A3665l1743j9142L5902k326j059K6943j424p163j549j5051J5109P574J8183
$$ plain form
4931 37919 37802 27605 24680 17384 11071 -13121 -11528 -10789 -24829 -25258 -18985 -12792 -26380 -19091
4917 -19091 -7834 -20917 -10566 -20386 -12151 12304 7408 17516 12395 -6080 -28659 -39840 -30438
4904 -30438 -16199 -4579 10510 2122 4514 46261 60094 25594 14977 34460 11826 -7846
4892 -7846 -19858 -6416 -31336 -52467 -60766 -59559 -60933 -57991 -33489 -34963 -58063 -62940 -41679
4879 -41679 -33732 -20963 427 23113 8925 2546 24462 45829 38882 35424 61446 33604 13731
4866 13731 31878 28945 36733 49011 28534 -1985 -22824 -27789 -23496 -8146 2401 8062 -3244
4853 -3244 19463 23001 15726 -4150 19280 44208 32279 -17678 -45283 -45131 -35480 -17616 -1674
4840 -1674 10138 10539 4481 18083 45546 26754 -1207 -16947 -10904 5579 12555 16294 8641
$$ packed form
4931C7919j17j0197k925p296o313k4192J593P39j4040m29O273O193j3588P289
4917a9091J1257j3083J0351r820Q235K4455m896J0108n121j8475k2579j1181R402
4904c0438J4239J1620J5089q388K392M1747J3833l4500j0617J9483k2634j9672
4892g846j2012J3442k4920k1131q299J207j374K942K4502j474k3100m877K1261
4879d1679P947J2769K1390K2686j4188o379K1916K1367o947l458K6022k7842j9873
4866A3731J8147k933P788J2278k0477l0519k0839m965M293J5350J0547N661j1306
4853c244K2707L538p275j9876K3430K4928j1929m9957k7605J52R651J7864J5942
4840a674J1812M01o058J3602K7463j8792k7961j5740O043J6483O976L739p653
$$ plain form
4827 8641 2615 -17725 -589 7217 13446 -2362 2297 -1158 3333 20343 18489 -2839 26440
4814 26440 34449 18045 19822 -470 -35006 -44812 -12763 34692 34984 21693 13997 -7640 5872
4801 5872 22270 34106 22500 9199 3666 5328 1762 5235 29463 23813 -2010 -38154 -40013
4788 -40013 -27245 2807 7549 14759 28558 -8155 8573 19921 13640 -8692 -16437 21779 21563
4775 21563 6263 -1368 -9570 -2604 -6259 -30442 -24741 -43187 -20703 -18405 -21164 -16310 -13864 -34116
4761 -34116 -61030 -46275 -2465 -2026 4899 13310 10505 9486 6179 3714 -5501 -7005 -12747 -24791
4747 -24791 3452 34537 16246 -10988 -28297 -6307 16580 -1820 25201 23665 11828 18061
4735 18061 30631 33877 43651 40226 20316 28020 22655 19053 12641 5072 -17116 -27080 -7438 3466
$$ packed form
4827H641o026k0340J7136P806O229j5808M659l455M491J7010j854k1328K9279
4814B6440Q009j6404J777k0292l4536r806L2049M7455K92j3291p696k1637J3512
4801E872J6398J1836j1606j3301n533J662l566L473K4228n650k5823l6144j859
4788d0013J2768L0052M742P210J3799l6713J6728J1348o281k2332p745L8216k16
4775B1563j5300p631q202O966l655k4183N701j8446K2484K298k759M854K446k0252
4761c4116k6914J4755M3810M39O925Q411k805j019l307k465r215j504n742j2044
4747b4791K8243L1085j8291k7234j7309K1990K2887j8400K7021j536j1837O233
4735A8061J2570L246R774l425j9910P704n365l602o412p569k2188r964J9642J0904
$$ plain form
4721 3466 32774 46103 45276 28192 30223 35214 21191 17048 1413 -6485 -16106 -11534 3083 15390
4707 15390 18229 -5048 -14823 -10072 15886 29140 11625 12292 41746 36691 -9600 -13571 -6051
4694 -6051 8267 29825 17514 -11825 -959 16520 10911 16417 8154 14014 -1526 -17599 3908
4681 3908 -2631 -30033 -45959 -35281 -10843 9951 21478 23451 1442 -28524 -34799 -24525 2245
4668 2245 45856 64292 61712 48199 51686 48537 37495 42756 57144 75127 95390 91234 40109
4655 40109 34279 55514 50732 6162 692 24197 17995 -1616 10331 -3361 5945 -6913 -10235
4642 -10235 -4591 26895 64954 60486 47293 1000 -19249 -38349 -28399 -34125 -37580 -13449 27753
4629 27753 59843 33749 -1807 -10210 -21423 -20432 -8853 -3380 -961 -40758 -37865 -40131 -45124
$$ packed form
4721C466K9308J3329q27j7084K031M991j4023m143j5635p898r621M572J4617J2307
4707A5390K839k3277r775M751K5958J3254j7515O67K9454n055m6291l971P520
4694f051J4318K1558j2311k9339J0866J7479n609N506q263N860j5540j6073K1507
4681C908o539k7402j5926J0678K4438K0794J1527J973k2009k9966o275J0274K6770
4668B245M3611J8436k580j3513L487l149j1042N261J4388J7983K0263m156n1125
4655D0109n830K1235m782m4570n470K3505o202j9611J1947j3692R306j2858l322
4642a0235N644L1486L8059m468j3193m6293k0249j9100R950n726l455K4131M1202
4629B7753L2090k6094l5556q403j1213R91J1579N473K419l9797K893k266m993
$$ plain form
4616 -45124 -35437 -36269 -37391 -48090 -21353 -3370 -269 11862 12100 2132 -5739 -12799 -12265 29733
4602 29733 38983 16768 41181 30648 8026 2955 5783 21690 45989 41652 38027 16453 21709
4589 21709 40174 38789 30563 23934 -532 -26801 -28857 -529 6292 30420 14182 36087 45827
4576 45827 27803 -3710 9215 15275 -1483 -9176 -12304 -10070 13858 31175 15816 13456 28407
4563 28407 56190 29822 5786 -23510 -32602 -31974 -57393 -79975 -59222 -11753 -11358 -3367 19006
4550 19006 13748 31338 40788 43635 17197 23953 8999 -16303 23430 38860 12390 -4203 4886
4537 4886 47679 69270 35483 32373 11065 25671 72000 63762 36992 21565 26159 32058 46357
4524 46357 34903 19446 10110 -15952 -29364 -22960 -29117 -38843 -10201 39785 65879 48572 21767
$$ packed form
4616d5124R687q32j122j0699K6737J7983L101J2131K38r968p871p060N34M1998
4602B9733R250k2215K4413j0533k2622n071K828J5907K4299m337l625k1574N256
4589B1709J8465j385q226o629k4466k6269k056K8328O821K4128j6238K1905R740
4576D5827j8024l1513J2925O060j6758p693l128K234K3928J7317j5359k360J4951
4563B8407K7783k6368k4036k9296r092O28k5419k2582K0753M7469L95P991K2373
4550A9006n258J7590R450K847k6438O756j4954k5302L9733J5430k6470j6593R089
4537D886M2793K1591l3787l110k1308J4606M6329q238k6770j5427M594N899J4299
4524D6357j1454j5457r336k6062j3412O404o157r726K8642M9986K6094j7307k6805
$$ plain form
4511 21767 17417 13033 17404 15512 12514 9782 -11618 -19785 -4885 8180 -5374 -3309 4119 -9063
4497 -9063 -811 3015 28333 20563 5901 13066 11335 6080 -4883 4337 14904 36231 40180 19971
4483 19971 -7524 12684 30102 12422 25290 22309 28968 43015 54954 59777 69687 42203 25305
4470 25305 8210 11403 28336 27166 32081 13985 17262 22815 22038 29578 44563 50206 40628 34530
4456 34530 57651 69570 51819 9441 17532 15065 1244 3731 32215 54598 47468 42787 45010
4443 45010 21087 30279 27060 12775 19247 47067 42056 -6500 -11805 17407 13112 9079 32621
4430 32621 36386 54458 24706 19559 6274 3262 27827 29718 34042 5094 -40501 -37429 -13605
4417 -13605 154 -22191 -36291 -19708 -30288 -20649 -2100 2528 -14034 -17535 -2898 9750
$$ packed form
4511B1767m350m384M371j892k998k732k1400q167J4900J3065j3554K065P428j3182
4497i063Q252L826K5318p770j4662P165j731n255j0963R220J0567K1327L949k0209
4483A9971k7495K0208J7418j7680J2868k981O659J4047J1939M823R910k7484j6898
4470B5305j7095L193J6933j170M915j8096L277N553p77P540J4985N643r578o098
4456C4530K3121J1919j7751m2378Q091k467j3821K487K8484K2383p130m681K223
4443D5010k3923R192l219j4285O472K7820n011m8556n305K9212m295m033K3542
4430C2621L765J8072k9752n147j3285l012K4565J891M324k8948m5595L072K3824
4417a3605J3759k2345j4100J6583j0580R639J8549M628j6562l501J4637J2648
$$ plain form
4405 9750 23331 16197 10043 -3846 -31043 -33979 -17409 6349 43885 33268 17527 -7285 -13754
4392 -13754 -2603 31298 38248 45530 17951 -9108 -2168 7612 20066 43746 52833 89108 101424
4379 101424 62471 37973 26385 35161 34603 26353 60496 44002 -3722 -3310 23764 29333 23656
4366 23656 18384 22914 25673 39598 32434 22069 10523 -5850 -26751 -27350 -20693 2287 11832
4353 11832 -12146 10001 49497 32717 39328 22104 -9020 -36411 -40177 -30401 -9572 15220
4341 15220 10671 -11625 -15173 -12500 -5002 -5899 -15972 5892 26259 21141 34744 44607 44373 60611
4327 60611 38158 1093 -23308 -46959 -64019 -53536 -21701 16780 20756 17723 -8320 -14205
4315 -14205 -6162 8329 4832 11099 30936 22328 15404 11497 4849 -12335 -23634 -42883 -35091
$$ packed form
4405I750J3581p134o154j3889k7197k936J6570K3758L7536j0617j5741k4812o469
4392a3754J1151L3901O950P282k7579k7059O940R780J2454K3680R087L6275J2316
4379A01424l8953k4498j1588Q776n58q250L4143j6494m7724M12K7074N569n677
4366B3656n272M530K759J3925p164j0365j1546j6373k0901n99O657K2980R545
4353A1832k3978K2147L9496j6780O611j7224l1124k7391l766R776K0829K4792
4341A5220m549k2296l548K673P498q97j0073K1864K0367n118J3603R863k34J6238
4327F0611k2453l7065k4401k3651j7060J0483L1835L8481L976l033k6043n885
4315a4205Q043J4491l497O267J9837q608o924l907o648j7184j1299j9249P792
$$ [...]
##END NTUPLES=NMR SPECTRUM
##END=
