##TITLE=Analysis number 328319
Compound Code sb 00755
Book Reference 2
Project Code adrs
Chemist Name stores
##JCAMPDX= 6.0         $$ Bruker NMR JCAMP-DX V2.0
##DATA TYPE= NMR SPECTRUM
##DATA CLASS= NTUPLES
##ORIGIN= Bruker BioSpin GmbH
##OWNER= nmr
$$ XWIN-NMR		Version 3.5
$$ Thu May 24 09:12:55 2007 GMT Daylight Time (UT+1h)  MAYBRIDGE\nmr@NMR_250MHZ
##.OBSERVE FREQUENCY= 250.131544655141
##.OBSERVE NUCLEUS= ^1H
##.ACQUISITION MODE= SIMULTANEOUS (DQD)
##.ACQUISITION SCHEME= undefined
##.AVERAGES= 16
##.DIGITISER RES= 18
##SPECTROMETER/DATA SYSTEM= dpx250
##.PULSE SEQUENCE= zg30
##.SOLVENT NAME= D2O
##.SHIFT REFERENCE= (INTERNAL, D2O, 0, 16.522)
##AUDIT TRAIL= $$ (NUMBER, WHEN, WHO, WHERE, WHAT)
$$ ##TITLE= Audit trail, XWIN-NMR		Version 3.5
$$ ##JCAMPDX= 5.01
$$ ##ORIGIN= Bruker BioSpin GmbH
$$ ##OWNER= nmr
$$ C:\u/data/dgb/nmr/ADRS/1430/pdata/1/auditp.txt
$$ ##AUDIT TRAIL=  $$ (NUMBER, WHEN, WHO, WHERE, WHAT)
(   1,<2007-05-24 09:12:34.51 +100>,<MAYBRIDGE\nmr>,<NMR_250MHZ>,
      <created by zg, POWCHK disabled, PULCHK disabled
       configuration hash MD5:
       76 6E 9A 78 1E 09 19 81 EC 84 63 8F B0 6A 59 2D
       data hash MD5: 64K
       92 1A 94 2B AE 2E B4 5C CC BD 7E B6 C9 BD 05 4D>)
(   2,<2007-05-24 09:12:48.40 +100>,<MAYBRIDGE\nmr>,<NMR_250MHZ>,
      <Start of raw data processing
       ef LB = 0.3 FT_mod = 6 PKNL = 1 SI = 32K 
       data hash MD5: 32K
       20 34 FB 11 05 89 E2 C4 94 EE E9 0A 27 F5 89 19>)
(   3,<2007-05-24 09:12:49.99 +100>,<MAYBRIDGE\nmr>,<NMR_250MHZ>,
      <apk 
       data hash MD5: 32K
       A5 FE 73 C9 8E A6 5E 80 28 11 6A E8 CC 77 2F 53>)
(   4,<2007-05-24 09:12:50.74 +100>,<MAYBRIDGE\nmr>,<NMR_250MHZ>,
      <abs ABSG = 5 
       data hash MD5: 32K
       A0 24 F2 8F 59 EE 3A 6E BA F5 51 97 E4 45 EE 44>)
$$ ##END=
$$ 
$$ hash MD5
$$ 78 F8 E4 BF 02 B7 E3 A7 DD 2D 7E 4C 96 07 DE BF
##$RELAX= 
##$RELAX= 
##$RELAX= 
##$RELAX= 
##$RELAX= 
##$RELAX= 
##$RELAX= 
$$ Bruker specific parameters
$$ --------------------------
##$DU= <C:\u>
##$EXPNO= 1430
##$NAME= <ADRS>
##$PROCNO= 1
##$TYPE= <nmr>
##$USER= <dgb>
##$AMP= (0..31)
100 100 100 100 100 100 100 100 100 100 100 100 100 100 100 100 100 100 
100 100 100 100 100 100 100 100 100 100 100 100 100 100 
##$AQSEQ= 0
##$AQ_mod= 3
##$AUNM= <au_zg>
##$AUTOPOS= <57 >
##$BF1= 250.13
##$BF2= 250.13
##$BF3= 250.13
##$BF4= 250.13
##$BF5= 500.13
##$BF6= 500.13
##$BF7= 500.13
##$BF8= 500.13
##$BYTORDA= 1
##$CFDGTYP= 0
##$CFRGTYP= 5
##$CHEMSTR= <none>
##$CNST= (0..31)
1 1 145 1 1 1 1 1 1 1 1 1 1 1 1 1 1 1 1 1 1 1 1 1 1 1 1 1 1 1 1 1 
##$CPDPRG= <>
##$CPDPRG1= <>
##$CPDPRG2= <>
##$CPDPRG3= <>
##$CPDPRG4= <mlev>
##$CPDPRG5= <mlev>
##$CPDPRG6= <mlev>
##$CPDPRG7= <mlev>
##$CPDPRG8= <mlev>
##$CPDPRGB= <>
##$CPDPRGT= <>
##$D= (0..31)
0 1 0 0 0 0 0 0 0 0.06 0 0 0 0 0 0 0.0002 0 0 0 0 0 0 0 0 0 0 0 0 0 0 
0 
##$DATE= 1179994353
##$DBL= (0..7)
120 120 120 120 120 120 120 120 
##$DBP= (0..7)
150 150 150 150 150 150 150 150 
##$DBP07= 0
##$DBPNAM0= <>
##$DBPNAM1= <>
##$DBPNAM2= <>
$$ [...]
##$SUBNAM6= <"">
##$SUBNAM7= <"">
##$SUBNAM8= <"">
##$SUBNAM9= <"">
##$SW= 20.6930455092707
##$SWIBOX= (0..15)
0 0 3 0 0 0 0 0 0 0 0 0 0 0 0 0 
##$SW_h= 5175.983436853
##$TD= 65536
##$TD0= 1
##$TE= 683.16
##$TE2= 300
##$TE3= 300
##$TEG= 300
##$TL= (0..7)
0 120 120 120 120 120 120 120 
##$TP= (0..7)
150 150 150 150 150 150 150 150 
##$TP07= 0
##$TPNAME0= <>
##$TPNAME1= <>
##$TPNAME2= <>
##$TPNAME3= <>
##$TPNAME4= <>
##$TPNAME5= <>
##$TPNAME6= <>
##$TPNAME7= <>
##$TPOAL= (0..7)
0.5 0.5 0.5 0.5 0.5 0.5 0.5 0.5 
##$TPOFFS= (0..7)
0 0 0 0 0 0 0 0 
##$TUNHIN= 0
##$TUNHOUT= 0
##$TUNXOUT= 0
##$USERA1= <user>
##$USERA2= <user>
##$USERA3= <user>
##$USERA4= <user>
##$USERA5= <user>
##$V9= 5
##$VALIST= <valist>
##$VCLIST= <CCCCCCCCCCCCCCC>
##$VD= 0
##$VDLIST= <DDDDDDDDDDDDDDD>
##$VPLIST= <PPPPPPPPPPPPPPP>
##$VTLIST= <TTTTTTTTTTTTTTT>
##$WBST= 1024
##$WBSW= 4
##$XGAIN= (0..3)
0 0 0 0 
##$XL= 0
##$YL= 0
##$YMAX_a= 410736
##$YMIN_a= -443936
##$ZGOPTNS= <>
##$ZL1= 120
##$ZL2= 120
##$ZL3= 120
##$ZL4= 120
##$ABSF1= 16.522
##$ABSF2= -4.171173
##$ABSG= 5
##$ABSL= 3
##$ALPHA= 0
##$AQORDER= 0
##$ASSFAC= 0
##$ASSFACI= 0
##$ASSFACX= 0
##$ASSWID= 0
##$AUNMP= <proc_1d>
##$AZFE= 0.1
##$AZFW= 0.1
##$BCFW= 0
##$BC_mod= 0
##$BYTORDP= 0
##$COROFFS= 0
##$CY= 12.5
##$DATMOD= 1
##$DC= 0
##$DFILT= <>
##$DTYPP= 0
##$F1P= 14.0000005364418
##$F2P= -0.99999901652339
##$FCOR= 0.5
##$FTSIZE= 32768
##$FT_mod= 6
##$GAMMA= 0
##$GB= 0
##$INTBC= 1
##$INTSCL= 1
##$ISEN= 128
##$LB= 0.3
##$LEV0= 0
##$LPBIN= 0
##$MAXI= 10000
##$MC2= 0
##$MEAN= 0
##$ME_mod= 0
##$MI= 0
##$NCOEF= 0
##$NC_proc= -2
##$NLEV= 6
##$NOISF1= 0
##$NOISF2= 0
##$NSP= 0
##$NTH_PI= 0
##$NZP= 0
##$OFFSET= 16.522
##$PC= 1
##$PHC0= -71.48132
##$PHC1= 10.10799
##$PH_mod= 1
##$PKNL= yes
##$PPARMOD= 0
##$PSCAL= 4
##$PSIGN= 0
##$REVERSE= no
##$SF= 250.13
##$SI= 32768
##$SIGF1= 0
##$SIGF2= 0
##$SINO= 400
##$SIOLD= 32768
##$SREGLST= <1H.D2O>
##$SSB= 0
##$STSI= 32768
##$STSR= 0
##$SW_p= 5175.98343685301
##$SYMM= 0
##$S_DEV= 0
##$TDeff= 65536
##$TDoff= 0
##$TI= <Analysis number 999999
Compound Code 99
Book Reference 9
Project Code 9>
##$TILT= no
##$TM1= 0
##$TM2= 0
##$TOPLEV= 0
##$USERP1= <user>
##$USERP2= <user>
##$USERP3= <user>
##$USERP4= <user>
##$USERP5= <user>
##$WDW= 1
##$XDIM= 32768
##$YMAX_p= 373158980
##$YMIN_p= -75027
$$ End of Bruker specific parameters
$$ ---------------------------------
##NTUPLES= NMR SPECTRUM
##VAR_NAME=  FREQUENCY,     SPECTRUM/REAL,   SPECTRUM/IMAG
##SYMBOL=    X,             R,               I
##VAR_TYPE=  INDEPENDENT,   DEPENDENT,       DEPENDENT
##VAR_FORM=  AFFN,          ASDF,            ASDF
##VAR_DIM=   32768,         32768,           32768
##UNITS=     HZ,            ARBITRARY UNITS, ARBITRARY UNITS
##FACTOR=    0.157963299565203, 1,           1
##FIRST=     4132.6476996994, 0,             0
##LAST=      -1043.33573715361, 0,           0
##MIN=       -1043.33573715361, -75027,      0
##MAX=       4132.6476996994, 373158980,     0
$$ Real data points
##PAGE= N=1
##DATA TABLE= (X++(R..R)), XYDATA
$$ [...]
$$ plain form
20997 939 -4081 537 3051 -1534 -1940 -2754 -2547 3430 8470 3390 484 2309 -3498 -5938 -4464 -3738
20981 -3738 -4596 -10914 -13430 -5136 -2977 -5441 -3531 -4192 -2413 3793 6370 7346 5793 454 -6021
20966 -6021 -7900 -4624 -6578 -3582 -1617 4383 1856 2151 819 -583 1978 6305 8182 4221 4540
20951 4540 -311 -4802 -9949 -14752 -15693 -9658 -3822 518 -4897 -11061 -6752 -3339 -2912 -1417 -863
20936 -863 -673 -3683 -8696 -8132 -6266 -2425 -3419 -4270 -1154 -1242 -96 3765 8126 7111 1700 801 -5077
20919 -5077 -7501 -8669 -3803 2803 5337 10140 4111 -1551 3975 4387 2126 2619 -2258 -527 -7501
20904 -7501 -10326 -13222 -11484 -6757 -1703 3373 5301 -1730 -4084 -4435 -5369 -6171 -3943 1744 11610
20889 11610 3813 -467 -1420 -3811 -2667 -4451 86 996 1868 7935 304 -7716 -5736 2167 2024
$$ packed form
20997I39n020M618K514m585m06q14K07N977N040n080k906J825n807k440J474P26
20981c738q58o318k516Q294K159k464J910o61J779O206K577R76j553n339o475
20966f021j879L276j954K996J965O000k527K95j332j402K561M327J877l961L19
20951D540m851m491n147m803r41O035N836M340n415o164M309L413M27J495N54
20936h63J90l010n013N64J866L841r94q51L116q8J146L861M361j015n411q99n878
20919e077k424j168M866O606K534M803o029n662N526M12k261M93m877J731o974
20904g501k825k896J738M727N054N076J928p031k354l51r34q02K228N687R866
20889A1610p797m280r53k391J144j784M537R10Q72O067p631q020J980P903j43
$$ plain form
20874 2024 8567 9439 178 -5070 3765 4241 11501 12046 5971 2764 976 -2866 -3748 1921 3837 1529
20858 1529 -3370 -5255 -3241 -7321 -7631 -11495 -8233 -10117 -7650 -4841 -883 -5554 -12701 -9036 -2520
20843 -2520 -2065 -6610 -9331 -12307 -14013 -11109 -7098 -5118 -1265 4352 4117 -987 -5266 -5222 -3507 -6508
20827 -6508 -13512 -9286 -11727 -15630 -7821 -752 -7605 -13367 -15346 -14104 -1849 5668 9187 11510
20813 11510 7534 874 -4777 -3051 385 7046 14291 6835 -1517 -2659 -3174 -1381 -5739 -6251 -2668
20798 -2668 -2721 -7640 -9598 -4227 -876 551 3452 11201 14988 11248 2536 -3189 -2546 -3517 2683 6486
20782 6486 1598 -3684 -5858 -9407 -4370 -9337 -8692 -12430 -13844 -8885 -10379 -13234 -9736 -7968 -13502
20767 -13502 -7354 -4080 -7172 -9473 -3984 1089 -357 -3707 -350 -4423 -9129 -7514 -13601 -13109 -13008
$$ packed form
20874B024O543Q72r261n248Q835M76P260N45o075l207j788l842q82N669J916k308
20858A529m899j885K014m080l10l864L262j884K467K809L958m671p147L665O516
20843b520M55m545k721k976j706K904M011J980L853N617k35n104m279M4J715l001
20827f508p004M226k441l903P809P069o853n762j979J242J2255P517L519K323
20813A1510l976o660n651J726L436O661P245p456q352j142n15J793m358n12L583
20798b668n3m919j958N371L351J427K901P749L787l740q712n725O43r71O200L803
20782F486m888n282k174l549N037m967O45l738j414M959j494k855L498J768n534
20767a3502O148L274l092k301N489N073j446l350L357m073m706J615o087M92J01
$$ plain form
20752 -13008 -13009 -7915 -4084 -2468 -5262 -2073 776 2559 -5573 -7440 -747 -1051 -135 2916 1386 -4572
20736 -4572 -1909 5598 2780 3554 6310 9203 13055 17369 13859 5533 1870 3532 2299 1347 -5544
20721 -5544 -10160 -1780 -4941 -3172 -6300 -9665 -8221 -8127 -3733 3144 7832 3138 -10427 -18642 -10097
20706 -10097 -5753 -5352 -4493 1571 3131 3983 -1806 -6559 -6948 -5482 -6632 -6032 -5619 -6082 -7336 -3623
20690 -3623 1383 -2048 -786 546 252 4828 8690 14164 6602 2620 6176 1439 2284 10102 10720
20675 10720 5591 -2502 -10285 -11288 -5796 -3645 -2341 -1665 -6034 -11664 -5392 417 441 2714 7839
20660 7839 2530 -3938 -2991 1346 6801 5040 3309 204 3364 2335 2191 -36 -6290 -6524 -3638
20645 -3638 -655 2824 1010 6183 7598 1812 -8182 -12769 -10309 -1559 3206 1078 -2993 -986 -2900
$$ packed form
20752a3008jN094L831J616k794L189K849J783q132j867O693l04R16L051j530n958
20736d572K663P507k818P74K756K893L852M314l510q326l663J662j233r52o891
20721e544m616Q380l161J769l128l365J444R4M394O877M688m694j3565q215Q545
20706a0097M344M01Q59O064J560Q52n789m753l89J466j150O00M13m63j254L713
20690c623N006l431J262J332k94M576L862N474p562l982L556m737Q45P818O18
20675A0720n129q093p783j003N492K151J304O76m369n630O272N809K4K273N125
20660G839n309o468R47M337N455j761j731l105L160j029j44k227o254k34K886
20645c638K983L479j814N173J415n786r994m587K460Q750M765k128m071K007j914
$$ plain form
20630 -2900 -8698 -10846 -9062 2692 6401 -3510 -3461 -1110 -4444 -6483 -334 -545 3545 6543 9530
20615 9530 6011 -1163 -4858 -4317 -2659 -1333 -3440 -1560 687 3020 10880 16985 10720 1804 -7958
20600 -7958 -6342 635 4402 232 3675 4215 3640 752 -5802 -3301 -774 -758 -7345 -11373 -17704 -16415
20584 -16415 -9844 -1173 4601 2649 -971 -2660 1421 4703 4825 1929 1476 4212 8396 9987 6638
20569 6638 7814 7571 3624 2388 4010 8797 5662 966 4103 3860 1228 -2069 6220 7672 4125
20554 4125 1611 -83 -3182 4291 7580 8433 9510 9509 44 -420 4621 126 -10819 -16005 -16890 -16444
20538 -16444 -14574 -7315 -709 2945 -3517 -7751 -12712 -7028 -6388 -8096 -5593 -1841 1677 -757 2789
20523 2789 2887 4552 3299 2416 1283 -546 -2504 -7650 -11253 -11220 -10818 -6141 -3917 -2132 -1996 921
$$ packed form
20630b900n798k148J784J1754L709r911M9K351l334k039O149k11M090K998K987
20615I530l519p174l695N41J658J326k107J880K247K333P860O105o265q916r762
20600g958J616O977L767m170L443N40n75k888o554K501K527J6o587m028o331J289
20584a6415O571Q671N774j952l620j689M081L282J22k896m53K736M184J591l349
20569F638J176k43l947j236J622M787l135m696L137k43k632l297Q289J452l547
20554D125k514j694l099P473L289Q53J077jr465m64N041m495j0945n186q85M46
20538a6444J870P259O606L654o462m234m961N684O40j708K503L752L518k434L546
20523B789R8J665j253q83j133j829j958n146l603L3M02M677K224J785J36K917
$$ plain form
20507 921 268 964 4209 -4765 337 5153 4346 -335 -232 205 -3316 -3260 -4319 -2461 -5383 -8360 -4178
20490 -4178 -3600 -7600 -1907 -3400 -6368 -4526 -1119 3309 -178 -4017 -1727 -859 -6856 -8324 -4168
20475 -4168 -669 -254 -4054 -2659 260 -2340 198 -4613 -3589 -1850 -1603 -6862 -11344 -11358 -16211 -20969
20459 -20969 -18316 -13482 -9701 -7948 -9078 -9762 -12783 -5720 740 -5567 -6839 -6652 -6857 -8849 -10168
20444 -10168 -3241 -1803 -4353 -7752 -7497 -3762 -6704 -7733 -3239 3169 618 1229 277 -1320 4037
20429 4037 4868 3968 -2320 -3154 277 -3783 -2629 1483 -4084 -3017 -5324 -3493 3362 7255 1460
20414 1460 -2679 -6873 -7432 -1101 -2238 -1575 4012 91 626 1963 1652 -2237 1975 7329 10313 9347
20398 9347 10491 8635 4251 -1328 -4006 -4258 4108 7076 6713 4368 384 -5179 -6677 4151 12292
$$ packed form
20507I21o53O96L245q974N102M816q07m681J03M37l521N6j059J858k922k977M182
20490d178N78m000N693j493k968J842L407M428l487l839K290Q68n997j468M156
20475d168L499M15l800J395K919k600K538m811J024J739K47n259m482j4m853m758
20459b0969K653M834L781J753j130o84l021P063O460o307j272J87k05j992j319
20444a0168O927J438k550l399K55L735k942j029M494O408k551O11r52j597N357
20429D037Q31r00o288q34L431m060J154M112n567J067k307J831O855L893n795
20414A460m139m194n59O331j137O63N587l921N35J337l11l889M212N354K984r66
20398I347J144j856m384n579k678k52Q366K968l63k345l984n563j498J0828Q141
$$ plain form
20383 12292 12650 2787 -2200 -2387 6819 4698 2472 -501 839 -188 -2276 365 9717 5211 203
20368 203 -5155 -7553 -5065 716 -492 349 -591 825 1878 2123 1510 3547 7265 6828 4541 3908
20352 3908 777 -1718 -975 -2929 -7628 -4606 -1752 -6619 -9062 -3352 -7409 -11752 -8538 -6073 -5876
20337 -5876 -741 -3087 -7745 -15183 -13974 -4747 -2870 -6835 -4848 2886 3027 -1294 -7615 -7103 -4149
20322 -4149 3331 6204 3410 1439 -435 3792 6046 -4721 -5854 -3256 974 584 718 -1002 -2930
20307 -2930 -2362 -3592 -6198 -7099 -4080 3483 5257 1305 -4000 -7970 -9889 -9213 -6929 -8183 -8538 -1384
20291 -1384 5210 1366 5025 7482 8610 3604 4302 5630 -371 -5054 -2702 -649 -657 -167 -2166 -198
20275 -198 -1232 -2441 7012 -1206 -4363 -3277 -1367 -797 -4441 -5134 835 2838 5815 4558 -385
$$ packed form
20383A2292L58r863m987j87R206k121k226k973J340j027k088K641R352m506n008
20368B03n358k398K488N781j208Q41r40J416J053K45o13K037L718m37k287o33
20352C908l131k495P43j954m699L022K854m867k443N710m057m343L214K465J97
20337e876N135k346m658p438J209R227J877l965J987P734J41m321o321N12K954
20322d149P480K873k794j971j874M227K254j0767j133K598M230l90J34j720j928
20307b930N68j230k606r01L019P563J774l952n305l970j919O76K284j254l55P154
20291a384O594l844L659K457J128n006O98J328o001m683K352K053qM90j999J968
20275a98j034j209R453q218l157J086J910N70l644o93N969K003K977j257m943
$$ plain form
20260 -385 -6762 -7594 -2031 718 4614 6745 6376 10171 9118 6022 8756 8233 6967 1976 4846 216
20244 216 -3156 -6532 -7230 -3018 -9844 -5301 428 -464 -2994 -856 3441 6777 10195 13998 13089 9133
20228 9133 4199 -2014 916 1601 491 5962 401 -3851 -5854 -959 875 -3291 -3316 4400 3198
20213 3198 -948 -700 4750 1728 -336 1 1155 -2346 -7076 -10212 -9098 -5367 -3419 -5051 251
20198 251 6389 9552 8184 4931 -208 -2433 -2753 -8480 -7705 -7634 -13253 -9080 -1253 1488 -1211 -1309
20182 -1309 -2025 -4124 -502 1325 2138 2552 -5324 -6514 -10940 -11068 -4167 -5589 -9461 -18613 -24980 -18857
20166 -18857 -14419 -13740 -8568 -6528 -7263 -14424 -8998 -10736 -15901 -5913 -4795 -10386 -11846 -11987 -11773
20151 -11773 -13603 -6793 -3765 -3021 -4070 -7114 -10065 -12017 -5816 -775 1645 -3248 -2418 -579 1407
$$ packed form
20260c85o377q32N563K749L896K131l69L795j053l096K734n23j266m991K870m630
20244B16l372l376o98M212o826M543N729q92k530K138M297L336L418L803r09l956
20228I133m934o213K930O85j110N471n561m252k003M895J834m166k5P716j202
20213C198m146K48N450l022k064L37J154l501m730l136J114L731J948j632N302
20198B51O138L163j368l253n139k225l20n727P75P1n619M173P827K741k699r8
20182a309p16k099L622J827Q13M14p876j190m426j28O901j422l872r152o367O123
20166a8857M438O79N172K040p35p161N426j738n165R988J118n591j460j41K14
20151a1773j830O810L028P44j049l044k951j952O201N041K420m893Q30J839J986
$$ plain form
20136 1407 3791 5497 -135 2610 1662 1434 -6284 -12294 -13930 -10220 -10404 -9474 -4377 -6481 -8277 -1615
20120 -1615 4537 5880 5683 5469 2472 157 1829 5302 6874 5686 5059 2604 5284 -1438 -4083
20105 -4083 1969 7886 5714 5229 3574 -329 -5321 -2248 3262 5890 4761 3673 -1581 -6166 -4325
20090 -4325 -7350 -12573 -6344 -5935 -3794 -3121 914 5786 862 1555 324 -2962 -136 -1717 3665
20075 3665 12177 10203 6364 4 -5760 -4149 -1673 -4881 -4465 -2799 -3500 -4835 100 -1606 -3826
20060 -3826 755 4818 6165 2661 206 1935 3084 4227 9351 7849 7082 6680 -5996 -9139 -8649
20045 -8649 -12199 -9521 -7228 -5635 -7049 -2979 526 3108 4776 -81 -5298 -2133 2530 -251 1466
20030 1466 -2786 -3162 -4671 -2186 1229 4419 4872 8413 266 -445 1160 2722 2498 -1932 -6262 -8970
$$ packed form
20136A407K384J706n632K745r48k28p718o010j636L710j84R30N097k104j796O662
20120a615O152J343j97k14k997k315J672L473J572j188o27k455K680o722k645
20105d083O052N917k172m85j655l903m992L073N510K628j129j088n254m585J841
20090d325l025n223O229M09K141O73M035M872m924O93j231l286K826j581N382
20075C665Q512j974l839o360n764J611K476l208M16J666p01j335M935j706k220
20060c826M581M063J347l504k455J729J149J143N124j502p67m02j2676l143M90
20045h649l550K678K293J593j414M070L505K582J668m857n217L165M663k781J717
20030A466m252l76j509K485L415L190M53L541q147p11J605J562k24m430m330k708
$$ plain form
20014 -8970 -417 4154 -869 -147 1036 1898 2690 -700 -753 6424 1596 -2712 -8245 -7279 1267 5300
19998 5300 6408 5863 6278 1982 2931 -446 -3543 -2513 -2146 -6927 -13338 -7247 -1143 -1444 -395 -175
19982 -175 561 -4587 -9294 -5977 -4975 -3179 -9191 -3320 2578 -556 -1341 -1806 -2564 1586 2391 -608
19966 -608 -3714 -5172 -7535 -2105 4816 1023 -6010 -6704 -8407 -9186 -3603 1333 1938 2392 -315 -2522
19950 -2522 -1223 3234 5491 10157 8936 2954 -806 -2676 -4823 -7258 -2922 -2270 -1024 -1877 3295
19935 3295 1828 220 2476 3693 791 -3924 -4127 -2301 1561 1293 3909 2556 -144 855 -2742
19920 -2742 -7109 -9159 -2121 -743 -3862 948 -2494 -5618 -5343 -4550 3489 6092 12450 14166 12610
19905 12610 15920 9879 5316 5608 -2817 -5702 -3408 -10440 -12669 -14865 -13085 -6496 -10674 -12394 -12590
$$ packed form
20014h970Q553M571n023P22J183Q62P92l390n3P177m828m308n533R66Q546M033
19998E300J108n45M15m296R49l377l097J030L67m781o411O091O104l01J049K20
19982a75P36n148m707L317J002J796o012N871N898l134p85m65p58M150Q05k999
19966f08l106j458k363N430O921l793p033o94j703p79N583M936O05M54k707k207
19950b522J299M457K257M666j221n982l760j870k147k435M336O52J246q53N172
19935C295j467j608K256J217k902m715k03J826L862k68K616j353k700R99l597
19920b742m367k050P038J378l119M810l442l124K75P93Q039K603O358J716j556
19905A2610L310o041m563K92q425k885K294p032k229k196J780O589m178j720j96
$$ plain form
19890 -12590 -1027 6667 9022 8347 6449 10278 6608 -1296 -7148 -14840 -17688 -13933 -6788 -4844
19876 -4844 -1616 3460 3489 -3252 768 2343 5560 6213 4035 -3759 -13297 -11733 -10719 -12544 -7511
19861 -7511 -5644 -7985 -11022 -16793 -19216 -10053 -5627 -1772 -2144 -8654 -16985 -12076 -10154 -1457 -2058
19846 -2058 -5828 -4406 977 5125 703 -7084 -14236 -11570 -11713 -9746 -1302 4161 -1236 -1401 -4033
19831 -4033 -5863 -5963 -6933 -7186 -143 8657 10634 9374 12174 6052 1997 3128 -3929 -6305 -5949 -11659
19815 -11659 -20867 -18549 -13695 -5652 -7659 -7233 -4184 -173 -3215 -9317 -13994 -13344 -6338 1271 -206
19800 -206 -6469 -3770 -839 -2544 -1455 -396 2025 -1684 -3077 -5678 752 11676 9796 7135 -3233
19785 -3233 -2914 2215 -3598 -2914 4870 3995 -313 -289 2263 2297 265 5770 13717 11493 8536 7029
$$ packed form
19890a2590J1563P694K355o75j898L829l670p904n852p692k848L755P145J944
19876d844L228N076K9o741M020J575L217O53k178p794r538J564J014j825N033
19861g511J867k341l037n771k423R163M426L855l72o510q331M909J922Q697o01
19846b058l770J422N383M148m422p787p152K666j43J967Q444N463n397j65k632
19831d033j830j00r70k53P043Q800J977j260K800o122m055J131p057k376L56n710
19815a1659r208K318M854Q043k007M26L049M011l042o102m677O50P006P609j477
19800b06o263K699K931j705J089J059K421l709j393k601O430J0924j880k661j0368
19785c233L19N129n813O84P784q75m308K4K552L4k032N505P947k224k957j507
$$ plain form
19769 7029 4964 -51 -2764 -1912 -4726 -7798 -7388 -2983 3605 9898 6403 -106 583 5435 8412
19754 8412 3418 834 5973 9673 2240 158 -539 3154 1752 -1835 -2826 -2839 -3308 -1551 2355 4348
19738 4348 11196 7037 3122 6366 5574 4075 -2011 -88 8530 10382 3436 6192 999 -699 -1811
19723 -1811 -2822 -7203 -7895 -7304 -3257 -4043 -5373 -6503 -1194 4260 3345 -9485 -9783 -3890 -4515 -3243
19707 -3243 -3824 -4747 -7404 -6902 -6853 -5725 -1396 970 -604 -2429 -5646 -4795 -3771 -4234 -6833 -4556
19691 -4556 5515 9898 12580 7098 -8786 -10841 -5873 -23 1114 487 -5579 -5231 -4786 -813 3551
19676 3551 4968 2826 -1153 -2945 -6965 -7292 -9542 -6179 -1976 -5241 -1802 -3472 -6018 -1974 -2762
19661 -2762 -5088 -1131 2231 397 -955 2082 182 -6102 -12171 -6625 -2211 -4536 -7599 -4035 -1809
$$ packed form
19769G029k065n015k713Q52k814l072M10M405O588O293l495o509O89M852K977
19754H412m994k584N139L700p433k082o97L693j402l587r91j3m69J757L906J993
19738D348O848m159l915L244p92j499o086J923Q618J852o946K756n193j698j112
19723a811j011m381o92N91M047p86j330j130N309N454r15j2830k98N893o25J272
19707c243n81r23k657N02M9J128M329K366j574j825l217Q51J024m63k599K277
19691d556J0071M383K682n482j5884k055M968N850J137o27o066L48M45L973M364
19676C551J417k142l979j792m020l27k250L363M203l265L439j670k546M044p88
19661b762k326L957L362j834j352L037j900o284o069N546M414k325l063L564K226
$$ plain form
19646 -1809 3832 9909 11925 12430 7977 3701 230 3285 16627 10059 4203 5398 4651 195 -4400
19631 -4400 -9750 -7781 -4477 2861 447 -1426 -6085 -6819 -8294 -1568 2300 2182 -410 -643 -5383
19616 -5383 -6954 -5528 -930 11215 12457 8748 4145 11965 10822 7456 -2759 -10947 -17302 -17785
19602 -17785 -15659 -8941 2224 10069 3060 -674 -1898 5305 1330 -1436 -5033 -13763 -14092 -10201
19588 -10201 -10231 -14363 -13507 -5937 -5530 -9628 -8621 -5660 140 1779 -7735 -12143 -15718 -13644 -14722
19573 -14722 -20472 -16768 -9053 -6052 -4011 732 10349 7055 9267 4690 -4366 -7260 -3206 1462
19559 1462 5131 9406 13840 6040 1355 3004 -571 -12599 -8999 -1161 -4689 -5681 -5126 -3404 -5192
19544 -5192 -1119 791 4475 6569 4857 -1731 -6635 -4506 -1460 408 -346 -1028 5051 6969 1088
$$ packed form
19646a809N641O077K016N05m453m276l471L055J3342o568n856J195p47m456m595
19631d400n350J969L304P338k414j873m659p34j475O726L868j18k592k33m740
19616e383j571J426M598J2145J242l709m603P820j143l366j0215q188o355m83
19602a7785K126O718J1165P845p009l734j224P203l975k766l597q730l29L891
19588a0201l0m132Q56P570M07m098J007K961N800J639r514m408l575K074j078
19573a4722n750L704P715L001K041M743R617l294K212m577r056k894M054M668
19559A462L669M275M434p800m685J649l575j2028L600P838l528r92N55J722j788
19544e192M073J910L684K094j712o588m904K129L046J868p54o82O079J918n881
$$ plain form
19529 1088 -7204 -6169 -11189 -10711 -12858 -15386 -20386 -21625 -18234 -10287 -9146 -4995 -6687 -7529 -3495
19514 -3495 4206 7526 7741 4153 -3812 -9309 -9709 -4453 -3465 -6910 -454 -3216 -1446 -7202 -10957
19499 -10957 -13180 -17839 -18208 -5623 4700 8287 1750 -1459 -1792 5521 9656 7212 7208 8411 6291
19484 6291 2492 2472 -68 4516 3996 4032 4567 2021 -2550 1932 10265 5423 262 -4050 -3856 2756
19468 2756 10931 7669 2945 711 -2137 -2568 -1177 -1713 -684 -127 -4708 5418 6840 3685 1641
19453 1641 2389 7884 10750 5049 -367 -3830 -484 5430 3179 -1348 -9786 -14988 -11043 -2735 5141
19438 5141 3456 6758 8499 353 -154 7578 7708 4331 -1052 -3447 -692 308 -3352 -10448 -11206
19423 -11206 -11143 -7202 -11533 -13486 -10086 -5713 -880 -2357 -7410 -6402 -8533 -5217 -3365 -3389 1369
$$ packed form
19529A088q292J035n020M78k147k528n000j239L391P947J141M151j692q42M034
19514c495P701L320K15l588p965n497m00N256R88l445O456k762J770n756l755
19499a0957k223m659l69J2585J0323L587o537l209l33P313M135k444mJ203k120
19484F291l799k0k540M584n20L6N35k546m571M482Q333m842n161m312J94O612
19468B756Q175l262m724k234k848m31J391n36J029N57m581J0126J422l155k044
19453A641P48N495K866n701n416l463L346N914k251m527q438n202L945Q308P876
19438E141j685L302J741q146n07P732J30l377n383k395K755J000l660p096p58
19423a1206O3L941m331j953L400M373M833j477n053J008k131L316J852k4M758
$$ plain form
19408 1369 -2513 -5670 -1399 -3078 -2152 -2224 -978 6300 5945 -7880 -16318 -11528 -3250 -3132 -3760 -3589
19392 -3589 -3213 -1453 3581 6080 7853 6494 4362 535 -3276 5823 14869 8674 6031 9766 3188
19377 3188 -4408 -6880 -11087 -10531 1746 6646 6614 3512 2797 5224 -1046 1642 4531 3065 1078
19362 1078 934 -4757 -4883 -5656 897 4752 4421 -1212 -7510 -8838 -7599 -6418 -9899 -11257 -8997 -5616
19346 -5616 -133 -1623 -3117 -2130 -6736 -6626 -4971 -2122 -2772 3015 5451 -36 3824 4297 2283 2495
19330 2495 -2925 -5768 -4199 -1168 4905 1368 -894 -4737 -5245 -3215 -4888 -2536 -1860 -2235 3146
19315 3146 2055 -645 -4097 -7198 -7822 -7882 -1849 -6985 -9425 -4403 -873 2278 2262 -1745 -1346 2985
19299 2985 6184 3303 -6608 -16551 -7847 -4290 151 7005 4248 -1876 -4238 -4143 -2111 902 3599
$$ packed form
19408A369l882l157M271j679R26p2J246P278l55j3825q438M790Q278J18o28J71
19392c589L76J760N034K499J773j359k132l827l811R099R046o195k643L735o578
19377C188p596k472m207N56J2277M900l2l102p15K427o270K688K889j466j987
19362A078j44n691j26p73O553L855l31n633o298j328J239J181l481j358K260L381
19346e616N483j490j494R87m606J10J655K849o50N787K436n487L860M73k014K12
19330B495n420k843J569L031O073l537k262l843n08K030j673K352O76l75N381
19315C146j091k700l452l101o24o0O033n136k440N022L530L151j6m007L99M331
19299B985L199k881r911r943Q704L557M441O854k757o124k362R5K032L013K697
$$ plain form
19284 3599 3610 7814 628 -9273 -9264 -7541 -3641 -6244 -6337 -8973 -2018 -1365 -7744 -9011 -4975 -6361 -10776
19267 -10776 -12311 -9004 -5391 -7323 -7384 -3808 -2956 -2638 -4508 -8664 -8927 -5692 -1243 -2377 -3965 -637
19251 -637 3111 2840 -2480 1456 904 -6599 -16651 -15422 -10557 -4983 -2721 -3008 -3900 -11686 -10761 -3292
19235 -3292 468 -4146 -5519 -8472 -14710 -14006 -7095 1750 4956 10532 7783 3598 -2914 -6754 -3861
19220 -3861 -3829 -3112 -3828 -1572 514 758 2008 4062 6473 5153 2244 -1717 -5936 -6675 1380 8564
19204 8564 4495 4945 273 -5043 -7514 -2885 -7093 -4146 -4116 -865 -199 30 -4141 -8355 -7782 -8256
19188 -8256 -10021 -5843 -7916 -10742 -8319 -4783 -6056 -2296 -3661 -2222 1565 -2176 -8676 -3128 1636
19173 1636 -4814 -2064 -1943 -3791 -5654 -3622 774 -2234 -6755 -1262 -1394 -6862 -7425 47 5638
$$ packed form
19284C599J1M204p186r901RJ723L900k603r3k636O955O53o379j267M036j386m415
19267a0776j535L307L613j932o1L576Q52L18j870m156k63L235M449j134j588L328
19251f37L748k71n320L936n52p503j0052J229M865N574K262k87q92p786R25P469
19235c292L760m614j373k953o238P04O911Q845L206N576k749m185o512l840K893
19220c861L2P17p16K256K086K44J250K054K411j320k909l961m219p39Q055P184
19204H564m069M50m672n316k471M629m208K947L0L251O66K29m171m214N73m74
19188h256j765M178k073k826K423L536j273L760j365J439L787l741o500N548M764
19173A636o450K750J21j848j863K032M396l008m521N493j32n468n63P472N591
$$ plain form
19158 5638 3456 1410 -5344 -8403 -19547 -18583 -12046 -12911 -15506 -7533 -2810 -5844 -2667 -1944 -3633
19143 -3633 -2844 -4236 -5276 -2714 738 -1390 -2733 -2365 -8289 -4914 -2116 576 2973 490 1591
19128 1591 2971 5542 -860 -5914 -11903 -10939 -2898 -4860 -807 -612 -71 -738 -8650 -11317 -7402 -1185
19112 -1185 -1633 -8485 -9373 -8750 -6785 1053 2358 1707 1345 7285 492 -4250 -6759 -5634 -1827 -7194
19096 -7194 -8339 -7003 -10461 -7164 427 -2900 -3772 -1026 -3177 -4487 3192 3418 832 -2670 -7633
19081 -7633 -8902 -8225 -8359 -7393 -3855 -8897 -8658 -8401 -6561 -7261 -12790 -15375 -7532 -1842 5144 14436
19065 14436 17002 7226 5677 -3441 -8259 -10683 -11828 -12235 -15236 -11844 -7349 -8546 -7694 -1757 -1150
19050 -1150 493 -2382 -3580 -258 -3436 -12208 -13820 -9300 -2910 5888 5687 8482 3785 3208 7164
$$ packed form
19158E638k182k046o754l059j1144R64O537q65k595P973M723l034L177P23j689
19143c633P89j392j040K562L452k128j343L68n924L375K798K692K397k483J101
19128A591J380K571o402n054n989R64Q041j962M053J95N41o67p912k667L915O217
19112a185m48o852q88O23J965P838J305o51l62N940o793m742k509J125L807n367
19096g194j145J336l458L297P591l327q72K746k151j310P679K26k586l502m963
19081g633j269O77j34R66L538n042K39K57J840p00n529k585P843N690O986R292
19065A4436K566r776j549r118m818k424j145m07l001L392M495j197Q52N937O07
19050a150J643k875j198L322l178q772j612M520O390Q798k01K795m697n77L956
$$ plain form
19035 7164 1797 158 8256 12218 7753 -3354 -4051 5141 9166 11015 9417 3169 3202 5475 2176
19020 2176 7918 731 -4110 -6879 -10507 -16659 -17299 -12726 -6369 -1451 -6130 -4453 2504 3914 2615
19005 2615 -1752 -7329 -10567 -8525 -3085 249 214 3135 3650 4216 -2621 -5669 -2763 4797 1146 -3625
18989 -3625 -4952 -1237 1363 -1179 -4528 -6323 -6123 -10463 -16711 -13781 -10732 -10260 -11423 -11470 -10177 -10586
18973 -10586 -11670 -10871 -10448 -3191 -6098 -5793 -3324 -2516 -3362 616 152 1021 2542 1641 1282 2015 -1772
18956 -1772 -3756 -8138 -12132 -11376 -8608 -10247 -4285 3219 5290 3087 1110 7865 10854 7679 -883
18941 -883 -7938 -10945 -7913 -3903 1075 1305 6192 10133 10859 5038 2804 -100 1459 -2695 -10835
18926 -10835 -17717 -17154 -11484 -6943 -8289 -8787 -7194 -6766 -3093 4753 9324 6603 3447 6800 4447
$$ packed form
19035G164n367j639Q098L962m465j1107o97R192M025J849j598o248L3K273l299
19020B176N742p187m841k769l628o152o40M573O357M918m679J677O957J410j299
19005B615m367n577l238K042N440L334l5K921N15N66o837l048K906P560l651m771
18989c625j327L715K600k542l349j795K00m340o248K930L049M72j163m7J293m09
18973a0586j084P99M23P257k907L05K469Q08q46L978m64Q69J521r01l59P33l787
18956a772j984m382l994P56K768j639N962P504K071k203j977O755K989l175q562
18941h83p055l007L032M010M978K30M887L941P26n821k234k904J559m154q140
18926a0835o882N63N670M541j346m98J593M28L673P846M571k721l156L353k353
$$ plain form
18911 4447 -2372 -5647 -2120 -1014 1523 2202 3848 6567 4244 3433 -4413 -14080 -11345 -4323 -5282
18896 -5282 -10867 -16718 -15624 -9182 -8945 -12624 -5314 -4096 -9595 -8768 -3769 486 6247 5069 6796
18881 6796 6605 6535 8057 2651 -6007 -9527 -5837 -6385 -14093 -5168 8280 11335 7694 6291 2975
18866 2975 -7414 -8082 -8228 -9922 -9200 -14952 -17144 -11877 -11293 -11279 -9667 -6429 -3208 -6394 -7619 -10013
18850 -10013 -10498 -9621 -6561 -3481 -781 -189 5960 2574 2293 2239 2710 6309 1037 -2950 -1862 -3793
18834 -3793 -569 1770 -8423 -10258 1261 7733 11379 8534 3963 1962 982 2621 -1047 803
18820 803 144 -3531 -3127 -5861 -4549 -2389 -4473 -4988 -5811 1067 617 -1257 3078 7751 4748 4578
18804 4578 3467 2928 -4030 -12386 -9195 -7895 -11251 -5759 1405 3023 2496 -174 -3494 -3821 300
$$ packed form
18911D447o819l275L527J106K537O79J646K719k323q11p846r667K735P022r59
18896e282n585n851J094O442K37l679P310J218n499Q27M999M255N761j178J727
18881F796j91p0J522n406q658l520L690n48p708Q925J3448L055l641j403l316
18866B975j0389o68j46j694P22n752k192N267N84J4J612L238L221l186j225k394
18850a0013m85Q77L060L080K700N92O149l386k81n4M71L599n272l987J088j931
18834c793L224K339j0193j835J1519O472L646k845m571k001r80J639l668J850
18820H03o59l675M04k734J312K160k084n15q23O878m50j874M335M673l003j70
18804D578j111n39o958q356L191J300l356N492P164J618n27k670l320l27M121
$$ plain form
18789 300 4593 9874 5886 -2949 -2669 -3380 -5492 -7259 -7609 -3805 -895 -2512 1042 -911 -2895 1174
18773 1174 2961 -488 -1521 -3431 -8231 -7760 -1380 -2859 -6407 -4436 -5051 -1598 -1190 -3 39 -1911
18757 -1911 -4559 -4060 -4841 -7310 -8874 -7479 -7345 -6055 -6600 757 -6227 -14267 -11545 -7843 -5987 -5871
18741 -5871 -5950 -12816 -21433 -22543 -17152 -7455 -8601 -8894 -2997 2307 4680 4927 4961 545 3507 10566
18725 10566 2489 -5913 -7323 -5330 -6450 -5699 -4594 4403 8732 8257 14108 9885 -4368 -10383 -15071
18710 -15071 -16169 -8589 1195 1071 173 -2832 2484 2843 -2614 -4652 -303 2908 3141 4018 2394 -2423
18694 -2423 -970 1548 2162 5619 4827 5369 3969 -249 -2516 403 4163 7679 8442 6596 5416 -2718
18678 -2718 -9144 -14693 -10051 -4813 -4294 -5977 -7137 -5375 -5898 -6096 -9712 -8346 -3948 -61 -1544
$$ packed form
18789C00M293N281l988q835K80p11k112j767l50L804K910j617L554j953j984M069
18773A174J787l449j033j910m800M71O380j479l548J971o15L453M08J187M2j950
18757a911k648M99p81k469j564J395J34J290n45P357o984q040K722L702J856J16
18741e871p9o866q617j110N391R697j146k93N897N304K373K47L4m416K962P059
18725A0566q077q402j410J993j120P51J105Q997M329m75N851m223j4253o015m688
18710a5071j098P580R784j24q98l005N316L59n457k038M349L211K33Q77j624m817
18694b423J453K518O14L457p92N42j400m218k267K919L760L516P63j846j180q134
18678b718o426n549M642N238N19j683j160J762n23j98l616J366M398L887j483
$$ plain form
18663 -1544 -9421 -15147 -12666 -7988 -6024 112 612 -6609 -7870 -1466 -6396 -13000 -12337 -6807 -1501
18648 -1501 1251 5345 1272 110 -1337 -6765 -8916 -9941 -8747 -5874 -8693 -7049 -6352 -4394 6560
18633 6560 12441 10821 6922 1441 3112 2782 -7375 -6667 -5974 -8723 -10980 -2308 7110 11692 9755
18618 9755 4713 2236 2224 3511 7172 6473 3641 4870 13000 8581 7444 3233 -4795 -8661 -7914 -546
18602 -546 1994 1789 -914 -7295 -219 4169 7597 8491 857 -6648 -9114 -7892 -4864 -4856 -134 -1564
18586 -1564 -6715 496 2650 -119 -790 -5698 -4852 -1775 -6758 -16952 -16062 -10426 -11320 -9699 -1346
18571 -1346 5071 4560 6364 5953 1095 5103 7282 4599 4334 8441 11103 7881 4964 5407 2061 -3239
18555 -3239 -3624 1046 -4051 -9448 -11790 -13037 -11667 -13187 -9251 -2578 2610 10077 11135 11417 10605
$$ packed form
18663a544p877n726K481M678J964O136N00p221j261O404m930o604O63N530N306
18648a501K752M094m073j162j447n428k151j025J194K873k819J644O97J958J0954
18633F560N881j620l899n481J671l30j0157P08O93k749k257Q672R418M582j937
18618I755n042k477j2J287L661o99k832J229Q130m419j137m211q028l866P47P368
18602e46K540k05k703o381P076M388L428Q94p634p505k466J222L028QM722j430
18586a564n151P211K154k769o71m908Q46L077m983j0194Q90N636q94J621Q353
18571a346O417n11J804m11m858M008K179k683k65M107K662l222k917M43l346n300
18555c239l85M670n097n397k342j247J370j520L936O673N188P467J058K82q12
$$ plain form
18540 10605 13064 14475 7474 76 -5768 -9245 -12498 -5058 -2216 -4410 -7523 -11075 -9569 -9386 -4268
18525 -4268 3706 6296 4015 5854 4783 7516 14323 9036 2048 -5846 -10482 -6414 -7854 -9369 -6447
18510 -6447 -3610 -3180 -4385 -484 4977 7179 2241 -1068 -9479 -8567 -8313 -9193 -7128 -2984 -2213 -3162
18494 -3162 2278 5734 7224 8673 1183 -3725 -271 8866 6496 -7 1541 3311 -1154 -2667 -8307
18479 -8307 -9393 -6345 -3663 -6714 -4953 -6213 -4579 -5833 -5608 726 1896 547 -2138 -7866 -6678
18464 -6678 -197 -8238 -9391 -9968 -11230 -8448 -7189 -7606 -6843 -4345 -1453 -3068 -10348 -12434 -8092
18449 -8092 -8664 -5225 -5357 -5321 -7048 -2517 2444 1193 -11538 -17474 -18048 -23419 -19604 -11725 -9470 -12404
18433 -12404 -9016 -4847 2463 5966 2070 -3374 2200 4708 4269 7554 2347 -1671 -2446 -1395 2492
$$ packed form
18540A0605K459J411p001p398n844l477l253P440K842k194l113l552J506J83N118
18525d268P974K590k281J839j071K733O807n287o988p894m636M068j440j515K922
18510f447K837M30j205L901N461K202m938l309q411R12K54q80K065M144P71r49
18494c162N440L456J490J449p490m908L454R137k370o503J548J770m465j513n640
18479h307j086L048K682l051J761j260J634j254K25O334J170j349k685n728J188
18464f678O481q041j153n77j262K782J259m17P63K498K892j615p280k086M342
18449h092n72L439j32L6j727M531M961j251j2731n936n74n371L815P879K255k934
18433a2404L388M169P310L503l896n444N574K508m39L285n207m018p75J051L887
$$ plain form
18418 2492 5707 7700 728 -3644 -3431 -3002 -10711 -10828 -10870 -7027 -2179 -2958 -7169 -3597 -6859 -4065
18402 -4065 -1368 -338 715 6525 11595 8113 3061 -2383 -7945 -8540 -3885 -1801 6595 8155 -196
18387 -196 202 1035 1133 -1974 807 3736 -1226 -1641 -1630 -1651 138 1470 -418 -2132 -4442 -1956 856
18370 856 3908 6308 4211 5836 10135 7958 4787 -3427 -6676 -7344 -5249 -4515 -3525 -6010 -9525 -7414
18354 -7414 -8625 2649 9417 3941 -2183 -1095 -6145 -11573 -13237 -6593 -1514 -2962 -13465 -13632
18340 -13632 -10607 684 2527 -3066 -2199 2565 5978 9469 11105 8106 1965 -6516 -9082 -7658
18326 -7658 -282 1705 -2199 -1067 -9319 -9506 -5630 -5521 -5833 -5799 -5890 -6929 -11027 -6837 129 -2153
18310 -2153 -2200 2924 7648 9236 8556 7068 5441 -1369 1259 4444 2672 -447 7479 11583 6749
$$ packed form
18418B492L215J993o972m372K13M29p709j17m2L843M848p79m211L572l262K794
18402d065K697J030J053N810N070l482n052n444n562n95M655K084Q396J560q351
18387a96L98Q33R8l107K781K929m962m15J1k1J789J332j888j714k310K486K812
18370H56L052K400k097J625M299k177l171q214l249o68K095P34R90k485l515K111
18354g414j211J1274O768n476o124J088n050n428j664O644N079j448j0503j67
18340a3632L025J1291J843n593Q67M764L413L491J636k999o141q481k566J424
18326g658P376J987l904J132q252j87L876J09l12L4r1j039m098M190O966k282
18310b153m7N124M724J588o80j488j627o810K628L185j772l119P926M104m834
$$ plain form
18295 6749 7721 7660 10205 4833 3304 -165 -6245 -2464 -3390 -7812 -10196 -10118 -4616 -8131 -11763 -10660
18279 -10660 -12267 -15924 -20825 -15035 -8094 -3211 4123 4668 -4569 -5551 -3679 1676 -514 2434 9020
18264 9020 5926 3570 5962 7085 7204 634 -2820 -5905 1095 4258 5595 11653 5565 1222 1252
18249 1252 -2523 -2975 -4183 -6293 -8553 -8734 -6660 -2877 -8010 -1277 5375 4508 -2076 -5593 -9993
18234 -9993 -8331 -6258 -2823 6818 3442 4147 -2033 -5304 -3412 2159 3190 2908 4182 -677 -3075
18219 -3075 -6866 -6939 -5671 2236 2352 -6108 -12707 -9230 -7555 -7903 -6565 712 2624 1779 -3540 57
18203 57 3297 -2705 3012 10193 12760 13312 11310 7793 4713 1235 1124 3674 4083 3294 -5710 -14073
18187 -14073 -22047 -16082 -7222 -6100 -327 3406 -1434 1573 959 605 -874 -3128 -4445 -1148 -2820
$$ packed form
18295F749R72o1K545n372j529l469o080L781r26m422k384P8N502l515l632J103
18279a0660j607l657m901N790O941M883P334N45r237r82J872N355k190K948O586
18264I020l094k356K392J123J19o570l454l085P000L163J337O058o088m343L0
18249A252l775m52j208k110k260j81K074L783n133O733O652q67o584l517m400
18234i993J662K073L435R641l376P05o180l271J892N571J031k82J274m859k398
18219c075l791p3J268P907J16q460o599L477J675l48J338P277J912q45n319L597
18203E7L240o002N717P181K567N52k002l517l080l478j11K550M09p89r004q363
18187a4073p974N965Q860J122N773L733m840L007o14l54j479k254j317L297j672
$$ plain form
18172 -2820 -6318 -4153 2972 2057 4081 985 -446 2222 -1459 -7487 -6124 -2578 -3215 4852 7812
18157 7812 9652 7454 9946 9727 1010 656 13068 16262 9951 4094 2523 10605 16019 7690 1469
18142 1469 -2572 378 -7097 -7616 -154 3165 4916 4427 -4044 -10592 -7507 3077 11239 9694 11213
18127 11213 7149 1960 1828 2092 -3154 -4873 -3831 -2744 -156 -591 -10152 -13625 -10118 -3353 -4081
18112 -4081 -1109 1492 -309 758 1388 -1636 -1069 -3463 -6100 -5212 2490 7418 -793 -3149 -3871 -3983
18096 -3983 632 9024 11637 8312 5545 2150 -2438 -3764 4809 4117 -5869 -11567 -14443 -14404 -11505
18081 -11505 -12568 -6594 -3603 -3108 -781 -2004 -9107 -10381 -9461 -9002 -6256 -9956 -8469 -12059 -17110
18066 -17110 -18133 -11838 -9574 -8461 -9273 -7358 -2403 -1301 -2962 2287 4022 -5886 -12278 -14215 -10730
$$ packed form
18172b820l498K165P125r15K024l096j431K668l681o028J363L546o37Q067K960
18157G812J840k198K492k19q717l54J2412L194o311n857j571Q082N414q329o221
18142A469m041K950p475n19P462L319J751m89q471o548L085J0584Q162j545J519
18127A1213m064n189j32K64n246j719J042J087K588m35r561l473L507O765p28
18112d081K972K601j801J067O30l024N67k394k637Q88P702M928q211k356p22j12
18096c983M615Q392K613l325k767l395m588j326Q573o92r986n698k876L9K899
18081a1505j063N974K991M95K327j223p103j274R20M59K746l700J487l590n051
18066a7110j023O295K264J113q12J915M955J102j661N249J735r908o392j937L485
$$ plain form
18051 -10730 -12990 -11459 1916 6946 11265 11895 9185 12702 12265 6561 6682 939 -3446 1848 5868
18036 5868 4398 -958 1402 -478 -1295 -1438 2427 2169 2879 701 -3368 -1414 -3210 -8270 -4403 -646
18020 -646 -1602 5324 6243 3620 -2786 -4510 -7224 -4233 -5969 -2240 293 -6666 -13290 -12849 -2875 1374
18004 1374 2260 -54 -2871 -4937 -5272 -2164 5747 6211 5211 4317 8734 -189 -9317 -7158 -4168 -317
17988 -317 2485 4038 6717 2629 255 -4909 -4941 -6540 -9082 -4921 -1747 -2881 1855 -260 -3290
17973 -3290 -5321 -7913 -6951 -4750 -4626 -2717 1200 2453 -2202 -6026 -2026 5192 3841 5662 3028
17958 3028 1280 2005 1174 -1505 3037 6724 3001 3938 5001 7619 769 -4271 5028 8416 4185
17943 4185 -2365 -6835 -6650 -3399 -7610 -6989 -6960 -3868 -5021 -5546 -6212 1941 901 -4989 -9930 -8366
$$ packed form
18051a0730k260J531J3375N030M319O30k710L517m37n704J21n743m385N294M020
18036E868j470n356K360j880q17j43L865k58P10k178m069J954j796n060L867L757
18020f46r56O926R19k623o406j724k714K991j736L729K533o959o624M41R974M249
18004A374Q86k314k817k066l35L108P911M64j000q94M417q923r128K159K990L851
17988c17K802J553K679m088k374n164l2j599k542M161L174j134M736k115l030
17973c290k031k592R62K201J24J909L917J253m655l824M000P218j351J821k634
17958C028j748P25q31k679M542L687l723R37J063K618o850n040R299L388m231
17943D185o550m470J85L251m211O21K9L092j153n25o66Q153j040n890m941J564
$$ plain form
17927 -8366 -11199 -11053 -7163 -5540 -2735 -1195 -2672 -512 -1057 -283 5727 1428 1591 1294 -3293 3329
17911 3329 3677 8126 11937 9047 5768 4246 536 4910 232 -5464 -10387 -4883 684 7505 5293
17896 5293 4806 6285 5897 607 2888 9964 10443 7784 7140 5439 4566 6391 852 -11453 -19194 -20443
17880 -20443 -16185 -4027 -3433 -2940 -2765 -9251 -11014 -2514 -1347 -3695 -3526 -975 650 -2363 -6651
17865 -6651 -4570 -8644 -4238 -4238 -1356 -777 5044 4859 -2701 1202 3749 -2734 -11651 -13260 -13637 -10404
17849 -10404 -5621 -1394 -3567 -2609 -2690 2606 194 -784 937 -639 -5643 -2872 938 5791 7058
17834 7058 3555 2125 3263 2181 -3224 -9396 -1830 2028 2177 -3515 -5558 -6342 -9902 -14964 -11502
17819 -11502 -2422 -1298 1484 134 -6441 -13038 -15568 -11902 -11517 -8432 -2269 -6894 -12019 -5753 -1151
$$ packed form
17927h366k833J46L890J623K805J540j477K160n45P74O010m299J63k97m587O622
17911C329L48M449L811k890l279j522l710M374m678n696m923N504N567O821k212
17896E293m87J479l88n290K281P076M79k659o44j701q73J825n539j2305p741j249
17880b0443M258J2158N94M93J75o486j763Q500J167k348J69K551J625l013m288
17865f651K081m074M406%K882N79N821j85p560L903K547o483q917j609l77L233
17849a0404M783M227k173R58q1N296k412r78J721j576n004K771L810M853J267
17834G058l503j430J138j082n405o172P566L858J49n692k043p84l560n062L462
17819a1502R080J124K782j350o575o597k530L666L85L085O163m625n125O266M602
$$ plain form
17804 -1151 3404 3273 264 -1178 -726 -7685 -7419 -668 2880 2732 3644 7052 2524 -1226 -2405 -5743
17788 -5743 -9912 -9156 937 8722 8232 2384 367 -2824 -8716 -11895 -13849 -11324 -4767 -46 -3287
17773 -3287 -5091 -4982 -6526 -4967 -5790 -13673 -19989 -13842 -7017 -4238 -8866 -8226 -2089 6509 10704
17758 10704 5595 2779 6681 8347 2173 -2391 2284 784 -4770 2011 6341 3435 -1661 -1254 -2116
17743 -2116 -7514 -9820 -962 525 1466 4936 -597 -4178 -7499 -5883 2761 3498 -199 607 2415
17728 2415 -5597 -8087 -6468 -3255 53 -6232 -886 5244 962 -1966 4001 4518 -2792 -5568 -3385
17713 -3385 1730 -603 -4952 -2215 4723 -1002 -6335 -2353 -372 -6284 -10479 -9493 -4790 -3474 -4963
17698 -4963 -4102 -3778 312 -410 -2563 -5568 -5612 -3848 -223 -1964 -6358 -10097 -11239 -2688 -5320 -3263
$$ packed form
17804a151M555j31l009j442M52o959K66O751L548j48R12L408m528l750j179l338
17788e743m169P56J0093P785m90n848k017l191n892l179j954K525O557M721l241
17773c287j804J09j544J559q23p883o316O147O825K779m628O40O137Q598M195
17758A0704n109k816L902J666o174m564M675j500n554O781M330k906n096M07q62
17743b116n398k306Q858J487R41L470n533l581l321J616Q644P37l697Q06J808
17728B415q012k490J619L213L308o285N346O130m282k928N967N17p310k776K183
17713c385N115k333m349K737O938n725n333L982J981n912m195R86M703J316j489
17698d963Q61L24M090p22k153l005m4J764L625j741m394l739j142Q551k632K057
$$ plain form
17682 -3263 -3947 -7489 -7534 -2610 1862 3664 2720 -4027 -3312 3768 -1721 -12551 -9983 1063 -246
17667 -246 -3591 -818 -1672 1491 2060 -1890 -5964 -3141 2839 191 -4690 671 -465 -472 3025 4448
17651 4448 4903 3769 -2785 -1333 4596 8169 11356 8305 3526 5895 5222 -4528 -5761 -4768 -10660
17636 -10660 -9514 -9672 -9072 -12159 -13297 -7893 -10725 -11616 -10036 -6785 -4032 -7419 -6252 -8255 -12032
17621 -12032 -9426 -4637 651 565 -6266 -8289 -581 9836 10210 5753 3392 -2507 -10283 -7271 -6832
17606 -6832 -7003 -9392 -6543 -3252 652 3564 -1485 -5223 -3759 -1475 -2675 -4558 -3957 -649 -9178
17591 -9178 -4231 6725 9923 7014 -6154 -12192 -10001 -815 3387 -612 -2725 972 -306 -4167
17577 -4167 -300 4044 -1286 -1238 -1807 -1858 2901 2604 -694 5894 5582 1536 -305 -355 4180 5129 -3196
$$ packed form
17682c263o84l542m5M924M472J802r44o747P15P080n489j0830K568J1046j309
17667b46l345K773q54L163N69l950m074K823N980k648m881N361j136pL497J423
17651D448M55j134o554J452N929L573L187l051m779K369o73r750j233R93n892
17636a0660J146j58O00l087j138N404k832q91J580L251K753l387J167k003l777
17621a2032K606M789N288q6o831k023P708J0417L74m457k361n899p776L012M39
17606f832j71k389K849L291L904K912n049l738J464K284j200j883O01L308q529
17591i178M947J0956L198k909j3168o038K191R186M202l999k113L697j278l861
17577d167L867M344n330M8n69n1M759k97l298O588l12m046j841n0M535R49q325
$$ plain form
17560 -3196 -4348 -9660 -13049 -11264 -8100 -4543 -2589 -11763 -8800 -9724 -10660 -8073 -1711 -3541 -4461
17545 -4461 -7151 -4621 1289 -2484 -666 8744 5788 2124 4407 10519 7194 7618 4034 3693 -4595
17530 -4595 -4141 2743 -26 860 -5428 -9280 -3946 2649 1852 -516 6318 260 -861 -4002 -10059
17515 -10059 -12369 -9833 18 -410 -3449 -4544 -2511 -1738 -5340 -7959 -7938 -6997 3429 2864 2025 3408
17499 3408 2651 7163 4579 1008 -1432 1026 8815 12673 13207 9349 2607 -2864 -5188 -7366 -3258
17484 -3258 2992 6389 10366 12847 8176 3695 1761 2442 -2427 -2828 -620 -2640 -1003 825 44
17469 44 584 -9249 -12218 -12642 -5536 -7979 -12067 -7742 -8202 -13176 -18495 -19463 -19751 -12503 -9532 -7482
17453 -7482 -7666 -7506 -7827 -5942 -4328 -2849 512 409 -3176 -5150 -4825 -5059 -5731 -727 -7223 -2481
$$ packed form
17560c196j152n312l389J785L164L557J954r174K963r24r36K587O362j830r20
17545d461k690K530N910l773J818R410k956l664K283O112l325M24l584l41q288
17530d595M54O884k769Q86o288l852N334O595p97k368O834o058j121l141o057
17515a0059k310K536R851m28l039j095K033P73l602k619K1R41J0426n65q39J383
17499C408p57M512k584l571k440K458P789L858N34l858o742n471k324k178M108
17484c258O250L397L977K481m671m481j934O81m869m01K208k020J637J828p81
17469D4N40r833k969m24P106k443m088M325m60m974n319r68k88P248K971K050
17453g482j84J60l21J885J614J479L361j03l585j974L25k34o72N004o496M742
$$ plain form
17437 -2481 -1512 -1856 -1314 3633 8310 2658 482 -5113 -8273 -14100 -7936 -3641 -9357 -11073 -7363
17422 -7363 -5371 -520 -731 -2886 -1438 2638 928 -3185 -6389 -9666 -9361 -9436 -12141 -9188 -8198 -2765
17406 -2765 -2418 -2140 1187 7307 11252 7689 311 637 -4025 -5899 4063 4703 6830 10571 11569 10707
17390 10707 2284 -5969 -4193 -4989 -8487 -7372 -87 7833 4578 1811 -4590 -3295 -3526 -7197 -11769
17375 -11769 -8717 -7169 -8206 -5735 395 5859 967 1265 4597 6187 7976 9154 11967 10641 7642
17360 7642 8320 6858 7671 15597 8253 3011 1173 1679 2536 -901 2654 6294 9660 11406 9328 2226
17344 2226 -6719 -10839 -12050 -12783 -15937 -6997 -6135 -10441 -4798 -4923 -10258 -10911 -8670 -5977 -4008 -9754
17328 -9754 -10731 -10500 -11571 -13475 -14721 -16115 -15335 -9736 -10584 -11927 -16632 -11352 -3179 825 3808 1412
$$ packed form
17437b481R69l44N42M947M677n652k176n595l160n827O164M295n716j716L710
17422g363J992M851k11k155J448M076j710m113l204l277L05p5k705K953R90N433
17406b765L47K78L327O120L945l563p378L26m662j874R962O40K127L741R98q62
17390A0707q423q253J776p96l498J115P285P920l255k767o401J295k31l671m572
17375a1769L052J548j037K471O130N464m892K98L332J590J789J178K813j326k999
17360G642O78j462Q13P926p344n242j838N06Q57l437L555L640L366J746k078p102
17344B226q945m120j211p33l154Q940Q62m306N643j25n335o53K241K693J969n746
17328i754r77K31j071j904j246j394P80N599q48j343m705N280Q173M004K983k396
$$ plain form
17312 1412 -435 -5050 -8485 -7993 -9574 -6142 1106 -1084 -2707 365 4098 1283 -2576 -4266 -9593
17297 -9593 -11441 -12279 -7560 -2001 -7269 -5535 1183 4110 1056 -1221 -99 1246 -624 756 -3760
17282 -3760 -4250 -2756 -3763 -4240 2961 7122 12312 11445 7500 193 -3212 -4382 342 -105 -1366 -2357
17266 -2357 -6815 -7025 -5981 -1051 -1120 -3178 -3673 -2691 -9412 -11488 -7692 -5972 -4309 -850 -2832 -4488
17250 -4488 -6319 -4733 3249 511 -308 2184 -2192 -3160 1079 -833 3981 10028 5225 505 -2624
17235 -2624 -2238 -4399 -4789 -8373 -4823 -2787 -9879 -9455 867 -736 1171 6531 -4529 691 10503
17220 10503 10683 9780 5218 1676 1317 8278 6145 -1151 4154 8188 2937 -2149 2059 5136 1650
17205 1650 1627 2554 -394 -671 -4438 -6115 -6532 -12315 -13664 -3928 2810 -734 -5675 -3215 2874 8779
$$ packed form
17312A412j847m615l435M92j581L432P248k190j623L072L733k815l859j690n327
17297i593j848q38M719N559n268J734O718K927l054k277J122J345j870J380m516
17282c760m90J494j007m77P201M161N190q67l945p307l405j170M724m47j261r91
17266b357m458k10J044M930o9k058m95R82o721k076L796J720J663L459j982j656
17250d488j831J586P982k738q19K492m376r68M239j912M814O047m803m720l129
17235b624L86k161l90l584L550K036p092M24J0322j603J907N360j1060N220R812
17220A0503J80r03m562l542l59O961k133p296N305M034n251n086M208L077l486
17205A650k3R27k948k77l767j677m17n783j349R736O738l544m941K460O089N905
$$ plain form
17189 8779 11881 6344 1315 -2262 -995 -1990 -1447 -3871 3615 13487 13597 12388 4642 -2862 -10662
17174 -10662 -14716 -10579 -7368 555 4127 -1613 589 121 39 6611 4506 2180 44 -2182 -4172
17159 -4172 -3097 221 -860 -23 -5327 -3866 -1349 -3668 -3347 1510 5300 8246 3102 -2419 -9434
17144 -9434 -9608 -6642 -3015 914 -1633 -4312 -5467 -4924 -977 -1654 5192 3353 -8018 -9967 -2613
17129 -2613 -902 -1256 -579 -4165 -3713 -451 3049 6186 -653 -3437 -246 -357 -342 620 1338 1886 -1446
17112 -1446 -4938 -7452 -17362 -15619 -9573 -7040 -3738 -5891 -5960 -3674 381 2016 -1934 275 -1616
17097 -1616 -3221 -1240 -4387 -1126 -1224 -5576 -5951 -6563 -7979 -10593 -5015 2518 4546 2533 -586 -506
17081 -506 -8170 -9230 -4757 -3739 -4540 -5884 -13027 -8437 1829 5096 1064 -3084 -4662 -1814 -3617
$$ packed form
17189H779L102n537n029l577J267r95N43k424P486R872J10j209p746p504p800
17174a0662m054M137L211P923L572n740K202m68q2O572k105k326k136k226j990
17159d172J075L318j081Q37n304J461K517k319L21M857L790K946n144n521p015
17144i434j74K966L627L929k547k679j155N43L947o77O846j839j1371j949P354
17129b613J711l54O77l586M52L262L500L137o839k784L191j11J5R62P18N48l332
17112a446l492k514r910J743O046K533L302k153o9K286M055J635l950K209j891
17097a616j605J981l147L261r8m352l75o12j416k614N578P533K028k013l119Q0
17081e06p664j060M473J018q01j344p143M590J0266L267m032m148j578K848j803
$$ plain form
17066 -3617 -7881 -9136 -11375 -7746 -3888 -5543 -2856 6849 8359 5513 4892 10384 11409 7802 4294
17051 4294 1157 -6196 1167 6365 -511 -3998 -935 4236 3105 -3151 -715 -2566 -9100 -8092 -224
17036 -224 1355 -4596 -9825 -9402 -10388 -12904 -2714 8357 9613 1656 285 -3692 -4687 -6985 -5287
17021 -5287 -2809 -242 1509 2123 403 -4176 -1319 -1924 2226 1984 864 -58 -5167 -8378 -9743 -4275
17005 -4275 -728 5031 921 -704 4255 6318 11240 19374 13039 5020 297 -2369 -7350 -7829 -3785
16990 -3785 287 2279 5069 320 -3420 -3481 -7259 -11026 -9016 2 1861 1510 2809 11071 4728
16975 4728 291 -5776 -2217 795 -2925 -5448 -3974 -2436 -4108 343 -157 -2048 180 179 1214 2834
16959 2834 -1926 -5134 -5490 2450 424 1301 532 -2295 -4027 464 4385 2938 -2220 -6366 -7500
$$ packed form
17066c617m264j255k239L629L858j655K687R705J510k846o21N492J025l607l508
17051D294l137p353P363N198o876l487L063N171j131o256K436j851o534J008P868
17036b24J579n951n229M23r86k516J0190J1071J256p957j371l977r95k298J698
17021e287K478K567J751O14j720m579K857o05M150k42j120r22n109l211j365N468
17005d275L547N759m110j625M959K063M922Q134o335q019m723k666m981m79M044
16990c785M072J992K790m749l740o1l778l767K010R018J859l51J299Q262o343
16975D728m437o067L559L012l720k523J474J538j672M451n00j891K228jJ035J620
16959B834m760l208l56P940k026Q77p69k827j732M491L921j447n158m146j134
$$ plain form
16944 -7500 -3059 9613 12748 9610 5785 2711 4237 1620 7993 8054 6465 684 4371 568 -1186
16929 -1186 4081 8470 7194 2214 1073 -3261 132 9601 9286 4960 4255 4381 -1964 -4898 -3639
16914 -3639 -3725 -3507 -1342 -3753 -2898 -12015 -19671 -19507 -12527 -5655 1114 3258 1293 -11014 -16805 -11211
16898 -11211 -7532 -8017 -4992 -4875 -1935 6065 9959 7909 5657 10897 8424 3230 1830 -5002 -4926
16883 -4926 -5944 -8175 -4255 -1793 -1749 -4210 -4366 -4486 -8564 -12661 -11112 -4867 4964 1692 -4231 -6306
16867 -6306 -5997 -3305 4092 3710 -1825 -851 3529 110 -6704 -10601 -12697 -4949 -2889 -4771 -1895
16852 -1895 3565 1411 -1781 -2184 -5858 -7293 -5664 -3844 -1490 -5981 -8340 -5418 -4983 -3765 -8781
16837 -8781 -4520 -3079 -6408 -1409 3677 3477 -593 -9703 -10732 -8287 -9303 -11947 -11823 -11650 -7452
$$ packed form
16944g500M441J2672L135l138l825l074J526k617O373O1j589n781L687l803j754
16929a186N267M389j276m980j141m334L393R469l15m326p05J26o345k934J259
16914c639q6K18K165k411Q55r117p656J64O980O872O769K144j965j2307n791N594
16898a1211L679m85L025J17K940Q000L894k050k252N240k473n194j400o832P6
16883d926j018k231L920K462M4k461j56j20m078m097J549O245R831l272n923k075
16867f306L09K692P397l82n535R74M380l419o814l897k096P748K060j882K876
16852a895N460k154l192m03l674j435J629J820K354m491k359K922M35J218n016
16837h781M261J441l329M999N086k00m070r110j029K445j016k644J24J73M198
$$ plain form
16822 -7452 -5506 -7059 -8665 -4211 -765 -1426 -7712 -5723 925 3410 8611 7071 2661 -209 4090
16807 4090 6661 4258 -4636 -3508 1038 -1890 1702 -98 -349 3796 3313 2451 188 -1848 -6071
16792 -6071 -13223 -17835 -10327 -1119 -835 -4649 -6660 -4581 -4288 -3611 -3856 -9533 -7932 -4774 -3396 -6786
16776 -6786 -13810 -9746 -7250 -11608 -7891 -1904 1929 4577 3550 3132 852 -4822 -4886 112 1382
16761 1382 -451 -8109 -9593 -8304 -2427 -1930 1500 5663 9226 6792 467 364 -3524 -8367 -7028
16746 -7028 -6131 -11090 -13066 -7886 507 -450 -2280 -413 839 1353 -4058 -6539 -8848 -11153 -7493
16731 -7493 -4459 -2320 1083 -3779 -1061 1989 4149 10469 8109 -1216 -6738 509 5755 8421 -1095
16716 -1095 1022 2491 1148 1108 -3725 3914 1438 -2466 -1275 -1924 -1819 -1943 -568 -3639 -1158 -3097
$$ packed form
16822g452J946j553j606M454L446o61o286J989O648K485N201j540m410k870M299
16807D090K571k403q894J128M546k928L592j800k51M145m83q62k263k036m223
16792f071p152m612P508R208K84l814k011K079K93O77k45n677J601L158J378l390
16776f786p024M064K496m358L717N987L833K648j027m18k280n674o4M998J270
16761A382j833p658j484J289N877M97L430M163L563k434o325j03l888m843J339
16746g028Q97m959j976N180Q393r57j830J867J252N14n411k481k309k305L660
16731g493L034K139L403m862K718L050K160O320k360r325n522P247N246K666r516
16716a095K117J469j343m0m833P639k476l904J191o49J05j24J375l071K481j939
$$ plain form
16700 -3097 -3863 -995 912 714 -850 509 -1494 -6535 -6120 -3405 891 -2584 -3984 -5179 -4925 -13218
16684 -13218 -6402 6230 2046 1746 6938 6744 4238 1914 1898 -1292 -236 -4977 -8659 -6480 -6862
16669 -6862 -5845 -448 -1999 -6303 -7862 -9114 -5943 -8878 -12641 -8698 -3967 -3925 -2883 -5012 1539
16654 1539 7324 10070 9985 4824 284 2434 550 2978 5908 5497 5663 -3438 -6505 -1559 5406 5185
16638 5185 5249 5159 8656 5880 -1487 -4046 760 -257 -3667 -2970 -7326 -12950 -15551 -15635 -8957 -2216
16622 -2216 2734 199 -1630 -255 3914 1577 2878 4483 970 -2928 454 -2386 -11475 -15624 -12119
16607 -12119 -5490 -1858 1481 -1188 -3348 -1801 5874 9990 10188 14667 5108 -3697 898 1481 -1988
16592 -1988 3581 8062 13938 9964 2472 2738 -5120 -10645 -8865 -3138 -4515 -2680 -646 1923 6147
$$ packed form
16700c097p66K868J907j98j564J359k003n041M15K715M296l475j400j195K54q293
16684a3218O816J2632m184l00N192j94k506k324j6l190J056m741l682K179l82
16669f862J017N397j551m304j559j252L171k935l763L943M731M2J042k129O551
16654A539N785K746q5n161m540K150j884K428K930m11J66r101l067M946O965k21
16638E185O4r0L497k776p367k559M806j017l410O97m356n624k601q4O678O741
16622b216M950k535j829J375M169k337J301J605l513l898L382k840r089m149L505
16607a2119O629L632L339k669k160J547P675M116J98M479r559q805M595N83l469
16592a988N569M481N876l974p492K66p858n525J780N727j377J835K034K569M224
$$ plain form
16577 6147 5092 1282 488 -1621 -1944 2530 6247 7557 1362 -454 8679 12561 9080 4937 -2027
16562 -2027 -1423 1555 -2654 1472 3160 1756 -1047 -327 4214 7878 -22 -8056 -9922 -8309 -2471
16547 -2471 194 1559 6018 7138 4762 5736 9736 3867 -6734 -13367 -13356 -9276 -6564 -2080 5182
16532 5182 1627 -1190 -6111 -5579 584 -454 -4974 -5206 659 8704 13854 11447 8105 2270 -102
16517 -102 6365 7981 8379 7283 9605 9410 9417 9643 6014 -2359 2785 9920 11428 11054 10741 6506 3884
16500 3884 2465 2761 1169 -2382 3056 3932 322 9126 6710 5332 13292 14843 13610 9917 6308
16485 6308 8168 9124 16347 12506 3892 1045 1196 7050 5681 4196 -2101 -7170 -7896 -9701 -8708 -988
16469 -988 3235 7821 4085 1880 1658 799 -1238 9241 11397 -1134 -7177 -3883 -1617 613 6120
$$ packed form
16577F147j055l810p94k109l23M474L717J310o195j816R133L882l481m143o964
16562b027O04K978m209M126J688j404k803P20M541L664p900q034j866J613N838
16547b471K665J365M459J120k376R74M000n869j0601o633J1M080K712M484P262
16532E182l555k817m921N32O163j038m520k32N865Q045N150k407l342n835k372
16517a02O467J616L98j096K322j95PK26l629q373N144P135J508l74l13m235k622
16500C884j419K96j592l551N438Q76l610Q804k416j378P960J551j233l693l609
16485F308J860R56P223l841q614k847J51N854j369j485o297n069p26j805R93P720
16469i88M223M586l736k205k22q59k037J0479K156j2531o043L294K266K230N507
$$ plain form
16454 6120 2752 -76 -3471 -7753 -5371 170 7256 8096 14300 14372 14103 21256 20717 17886 14569 12773
16438 12773 10298 4305 -401 -4480 -1246 1995 5116 9411 3287 313 -1402 1181 7781 13264
16424 13264 10259 2674 2463 11059 7476 -4304 -4774 -3354 -182 -1388 1348 172 7258 8744 13603
16409 13603 15608 10370 6319 1208 1841 -4537 -8470 -6346 -10032 -11761 -10104 -7576 -11206 -5237 -4916
16394 -4916 -570 2385 11277 10605 7348 3447 3086 1488 -1749 -12288 -14910 -13502 -15276 -9593 0
16379 0 2608 5442 6768 7150 12673 9166 2768 208 -1261 -1057 -340 3586 -2137 1774 7109 4183
16363 4183 4670 13866 12941 7839 2769 -5912 -6564 -1691 728 -2667 -2837 -7253 -9779 -9047 -9824 -8001
16347 -8001 -5673 -6883 -10482 -14970 -16021 -9122 -6122 1209 -403 -4038 -4898 -2858 -2250 277 -1894
$$ packed form
16454F120l368k828l395m282K382N541P086Q40O204P2k69P153n39k831l317j796
16438A2773k475n993m706m079L234L241L121M295o124k974j715K583O600N483
16424A3264l005p585k11Q596l583j1780m70J420L172j206K736j176P086J486M859
16409A3603K005n238m051n111O33o378l933K124l686j729J657K528l630N969L21
16394d916M346K955Q892o72l257l901l61j598l237j0539k622J408j774N683R593
16379@K608K834J326L82N523l507o398k560j469K04P17L926n723L911N335k926
16363D183M87R196r25n102n070q681o52M873K419l395j70m416k526P32p77J823
16347h001K328j210l599m488j051O899L000P331j612l635q60K040O08K527k171
$$ plain form
16332 -1894 -4232 3142 11858 2612 -9630 -9797 -7043 1775 2668 1149 3429 -294 -6291 -10046 -5313
16317 -5313 -5673 -8517 -9681 -6931 -3591 -3467 -3151 -2011 -7082 -5487 -3852 -8792 -410 7227 4370
16302 4370 2920 3731 3391 -1350 -3948 -7212 -7676 -5777 -6740 -3812 -437 2035 2444 4886 -1923 -9847
16286 -9847 -8552 -5810 -558 3756 6608 3912 -6099 -6763 -2487 2741 5616 -2913 -4107 7773
16272 7773 8603 4640 10980 7827 1962 2957 2603 2221 2228 3543 6261 5610 -2262 -90 3832 3344 -17
16255 -17 1369 6142 3736 2526 -3005 -1682 3059 2313 6983 2061 2946 10318 9724 10684 6248 -1246
16239 -1246 -7048 -3235 -2430 492 1460 -4044 -10017 -3916 4039 12210 12215 8547 4403 -5206 -1690 5938
16223 5938 9483 4794 2991 642 4255 9593 9475 4603 3333 9393 14189 13044 3301 1304 7450
$$ packed form
16332a894k338P374Q716r246j2242j67K754Q818Q93j519K280l723n997l755M733
16317e313l60k844j164K750L340J24L16J140n071J595J635m940Q382P637k857
16302D370j450Q11l40m741k598l264m64J899r63K928L375K472M09K442o809p924
16286i847J295K742N252M314K852k696j0011o64M276N228K875q529j194J1880
16272G773Q30l963O340l153n865R95l54l82PJ315K718o51p872K172L922m88l361
16255a7J386M773k406j210n531J323M741p46M670m922Q85P372n94R60m436p494
16239a246n802L813Q05K922R68n504n973O101P955Q171Nl668m144r609L516P628
16223E938L545m689j803k349L613N338j18m872j270O060M796j145r743j997O146
$$ plain form
16208 7450 5613 1036 -4484 -9256 -2806 -1456 5528 6694 2198 5959 2626 -945 -1886 1302 6085
16193 6085 8234 5986 4782 5328 1463 4657 7252 3727 -2593 3724 8178 4099 -1411 3852 141
16178 141 870 4069 4112 2359 -983 -1231 4945 10127 12128 18019 15569 14092 16185 6715 -1430 -3494
16162 -3494 -278 4619 128 -6268 -9347 -10738 -13116 -10404 -7788 -3549 -2250 -3911 -1856 -1082 -4309
16147 -4309 -4819 -4629 803 8525 7110 4145 2776 47 -394 2995 224 -4618 -590 -1821 -4192
16132 -4192 -6019 -616 4756 2728 5115 1348 -3016 -5557 -7242 -6948 1990 11131 2607 -1151 1040
16117 1040 2471 -250 -908 -5802 -12512 -9127 -1249 -3219 -7867 -8761 -6070 2980 10529 10788 10733 10608
16101 10608 -375 -3878 717 4464 -1632 -5401 -4015 -4751 2483 5334 5297 -1777 -3231 -2807 1662
$$ packed form
16208G450j837m577n520m772O450J350O984J166m496L761l333l571r41L188M783
16193F085K149k248j204N46l865L194K595l525o320O317M454m079n510N263l711
16178A41P29L199M3j753l342k48O176N182K001N891k450j477K093r470q145k064
16162c494L216M897m491o396l079j391k378K712K616M239J299j661K055P74l227
16147d309n10J90N432P722j415k965j369k729m41L389k771m842M028j231k371
16132d192j827N403N372k028K387l767m364k541j685K94Q938R141q524l758K191
16117A040J431k721o58m894o710L385P878j970m648q94K691R050P549K59n5j25
16101A0608j0983l503M595L747o096l769J386p36P234K851l7p074j454M24M469
$$ plain form
16086 1662 6406 2151 -7523 -8149 489 4085 -753 -11238 -8390 3613 1798 -6801 -7607 -9225 -8098
16071 -8098 -5245 -1379 3800 8437 9925 7932 2117 1112 -503 -2086 2995 1460 -1356 1065 4798
16056 4798 7376 5660 4024 11956 13344 10783 11519 6470 1782 1337 3874 3196 867 -135 1428
16041 1428 5429 3397 10560 7392 5765 11015 17772 17221 10140 8942 5021 3006 -1069 2380 2893
16026 2893 119 4652 3497 5321 -4544 -5387 281 3748 2642 -2816 -2814 -981 461 6961 7603 872
16010 872 -1721 1204 5752 5607 2824 -2068 5600 7536 7648 6348 6723 10469 7362 1936 3220 7571
15994 7571 9309 5722 4733 -77 3587 6790 11785 13970 9920 5025 1337 383 -4514 -6876 -5484
15979 -5484 -7055 -8943 -5483 -2865 -3126 -3842 -3320 5883 10976 3849 -6185 -1620 2402 1616 -1202
$$ packed form
16086A662M744m255r674o26Q638L596m838j0485K848J2003j815q599q06j618J127
16071h098K853L866N179M637J488j993n815j005j615j583N081j535k816K421L733
16056D798K578j716j636P932J388k561P36n049m688m45K537o78k329j002J563
16041A428M001k032P163l168j627N250O757n51p081j198l921k015m075L449N13
16026B893k774M533j155J824r865q43N668L467j106n458KJ833J442O500O42o731
16010H72k593K925M548j45k783m892P668J936J12j300L75L746l107n426J284M351
15994G571J738l587r89m810L664L203M995K185m050m895l688r54m897k362J392
15979e484j571j888L460K618k61p16N22R203N093p127j0034M565M022p86k818
$$ plain form
15964 -1202 -373 3953 -1089 -2064 6817 10007 11905 7408 1004 5796 5379 9612 9197 13276 6521 5882
15948 5882 3990 -4443 -10027 -4797 4856 8633 8909 10912 16413 12376 10 4006 12661 12602 11477
15933 11477 12283 5937 5703 -1822 -10925 -5562 2237 -3593 -174 3197 6772 5775 4369 408 -9107
15918 -9107 -8791 -261 4839 3584 2706 8362 2745 -10899 -11573 -7996 -610 456 -1549 2079 317
15903 317 3183 8337 16964 19660 18110 13978 12508 8709 5803 10662 10746 5881 -3162 -3444 3368 6498
15887 6498 5963 -536 -1652 -3619 -10996 -9766 -7174 -5950 -830 429 -8058 -11034 -11840 -10424 -762
15872 -762 6050 6200 4555 839 2559 9023 2899 -555 3426 1921 3120 6059 4756 -1623 -305
15857 -305 -267 -2762 127 3472 4070 1183 1892 3175 -2513 -12555 -10256 -3709 184 6024 6127 5302
$$ packed form
15964a202Q29M326n042r75Q881L190J898m497o404M792m17M233m15M079o755o39
15948E882j892q433n584N230R653L777K76K003N501m037j2366L996Q655n9j125
15933A1477Q06o346k34p525r103N363P799n830L419L371L575r97j406l961r515
15918i107L16Q530N100j255q78N656n617j3644o74L577P386J066k005L628j762
15903C17K866N154Q627K696j550m132j470l799k906M859Q4m865r043k82O812L130
15887F498n35o499j116j967p377J230K592J224N120J259q487k976q06J416R662
15872g62O812J50j645l716J720O464o124l454L981j505J199K939j303o379J318
15857c05L8k495K889L345N98k887P09J283n688j0042K299O547L893N840J03q25
$$ plain form
15841 5302 -1201 674 1602 -302 1258 6059 9442 8181 4012 -5517 -6491 -6113 -6743 3490 6519
15826 6519 4587 7272 6780 2098 1609 5661 2988 -986 3664 5046 1004 -102 -2423 -3054 -1330
15811 -1330 4928 552 -3060 -2742 -1940 3503 1304 -173 -2483 -1136 1509 291 -500 -2284 -2759 -2393
15795 -2393 -2131 -44 145 -2518 -1399 -3546 -6133 -11301 -11672 -8018 -1038 -301 -3215 327 5205 4049
15779 4049 7623 8475 5611 4328 2515 -2769 -8254 -11628 -7039 -254 5035 1876 2021 2608 9882
15764 9882 4752 -366 1575 884 -2383 -182 -3401 -4651 1652 4621 1433 -8629 -7493 -4095 -2215
15749 -2215 -2440 -851 5675 7636 -2047 -2026 -447 -425 -2632 -1244 2242 341 -1206 3588 4533 1061
15733 1061 530 1930 3591 -1973 -340 -1002 -1246 -2877 3069 9450 8685 2111 7641 5785 5546 5991
$$ packed form
15841E302o503J875R28j904J560M801L383j261m169r529r74L78o30J0233L029
15826F519j932K685m92m682m89M052k673l974M650J382m042j106k321o31J724
15811a330O258m376l612L18Q02N443k199j477k310J347K645j218p91j784m75L66
15795b393K62K087J89k663J119k147k587n168l71L654O980P37k914L542M878j156
15779D049L574Q52k864j283j813n284n485l374M589O785N289l159J45N87P274
15764I882n130n118J941o91l267K201l219j250O303K969l188j0062J136L398J880
15749b215k25J589O526J961r683K1J579K2k207J388L486j901j547M794R45l472
15733A061n31J400J661n564J633o62k44j631N946O381p65o574N530j856k39M45
$$ plain form
15717 5991 6164 8864 3781 -872 1282 5862 7470 11624 6097 958 90 3627 7032 11851 16775
15702 16775 12325 8799 9632 8352 8806 12735 9079 -1466 -9636 -3957 4350 12612 4265 2262 -183
15687 -183 1757 6558 2955 -477 8901 6318 6663 5838 13523 17862 17062 16922 14920 7570 2600 3872
15671 3872 12120 3315 -3597 -2515 980 6299 9950 4411 562 404 -2410 -5096 -9261 -10436 -8462
15656 -8462 -2743 -911 1413 4124 3924 3651 675 -4276 -7115 -5733 2175 9451 8845 -1080 578
15641 578 1080 1437 1051 1638 7330 8633 2176 4948 8129 9694 9732 7645 988 4188 -2077 2571
15625 2571 6283 1647 1370 4905 1207 -356 1870 -3625 -5782 -5550 1749 7147 2410 -2419 -5989
15610 -5989 -3933 -29 3288 3977 250 4237 9577 9486 6570 379 -1158 5796 7541 -478 -2715
$$ packed form
15717E991J73K700n083m653K154M580J608M154n527n139q68L537L405M819M924
15702A6775m450l526Q33j280M54L929l656j0545q170N679Q307Q262q347k003k445
15687a83J940M801l603l432R378k583L45q25P685M339q00j40k002p350m970J272
15671C872Q248q805o912J082L495N319L651n539l849j58k814k686m165j175J974
15656h462N719J832K324K711k00k73k976m951k839J382P908P276o06r925J658
15641E78N02L57l86N87N692J303o457K772L181J565L8k087o657L200o265M648
15625B571L712m636k77L535l698j563K226n495k157K32P299N398m737m829l570
15610e989K056L904L317O89l727L987N340r1k916o191j537O954J745q019k237
$$ plain form
15595 -2715 609 4054 3385 10935 9240 5912 5769 9802 1473 -606 6209 3577 2650 1086 166 -4558
15579 -4558 -5341 -767 7663 14667 9142 5504 16088 18710 14978 5661 1413 5855 7110 5292 643
15564 643 -1151 -2790 -3619 5422 6842 8867 14775 17532 12550 6520 4970 9605 9853 13634 18961
15549 18961 16362 3859 3720 9918 10962 8952 8214 8394 10463 11735 3128 -5108 -3307 -10173 -901
15534 -901 5093 8576 8098 5620 3848 2873 -4925 -12149 -10642 -4713 -663 4096 12012 11141 2797 276
15518 276 7720 13127 9274 7958 7671 8684 9068 9814 13118 17527 15900 13621 16754 18120 17138 9192
15502 9192 7478 17307 20107 9950 1321 93 79 -1028 3646 8540 11807 16338 20476 15456 15599
15487 15599 10077 5901 4554 3901 1266 -2716 285 1473 -110 4272 4219 8120 7848 8759 11741 10159
$$ packed form
15595b715L324L445o69P550j695l328j43M033q329k079O815k632r27j564r20m724
15579d558p83M574Q430P004n525l638J0584K622l732r317m248M442J255j818m649
15564F43j794j639q29R041J420K025N908K757m982o030j550M635K48L781N327
15549A8961k599j2503j39O198J044k010p38J80K069J272q607q236J801o866R272
15534i01N994L483m78k478j772r75p798p224J507N929M050M759P916q71q344k521
15518B76P444N407l853j316k87J013L84P46L304M409j627k279L133J366r82p946
15502I192j714R829K800j0157q629j228j4j107M674M894L267M531M138n020J43
15487A5599n522m176j347o53k635l982L001J188j583M382n3L901k72R11K982j582
$$ plain form
15471 10159 11191 17554 17600 10433 4413 -7349 -6521 -130 -150 6331 9428 11451 12036 13749 12858 951
15455 951 -2264 -3411 1565 11217 12399 6393 2397 5662 7089 6628 4505 4143 6814 192 -85 6047
15439 6047 9498 8143 3568 -3131 -2329 -878 -4175 -5183 -9626 -5179 5294 6294 5558 4338 10940
15424 10940 8725 4593 9110 15943 20120 20955 16306 8536 7192 10213 4705 -1631 -431 5644 6763
15409 6763 13032 17393 8880 7782 8619 4922 2930 7114 8079 8869 8182 9302 13809 9656 10423 13788
15393 13788 12993 12623 20530 23879 25246 18170 6958 8395 11522 5593 1921 -2460 -2281 -2232 -2179 1071
15377 1071 9647 5746 -2561 -2575 514 3573 -3537 -9812 -5222 681 2924 3707 -3564 1473 4096
15362 4096 5263 5959 3870 4176 6539 2804 8951 13039 8748 5545 2131 2532 6360 16055 17450
$$ packed form
15471A0159J032O363M6p167o020j1762Q28O391k0O481L097K023N85J713q91j1907
15455I51l215j147M976R652J182o006l996L265J427m61k123l62K671o622k77O132
15439F047L451j355m575o699Q02J451l297j008m443M447J0473J000p36j220O602
15424A0940k215m132M517O833M177Q35m649p770j344L021n508o336J200O075J119
15409F763O269M361q513j098Q37l697j992M184R65P90o87J120M507m153P67L365
15393A3788p95l70P907L349J367p076j1212J437L127n929l672m381J79M9N3L250
15377A071Q576l901q307j4L089L059p110o275M590N903K243P83p271N037K623
15362D096J167O96k089L06K363l735O147M088m291l203l414M01L828R695J395
$$ plain form
15347 17450 13561 13566 13751 12985 10991 10698 5198 6902 9718 15389 13657 8276 6160 17288 20609 19329
15331 19329 11580 5401 3204 1119 3471 6775 11918 15927 14010 15175 17283 17741 15729 18823 17650
15316 17650 12073 5663 2778 1485 -218 1414 5322 8683 5800 6658 7061 7946 8022 6290 1265 2400
15300 2400 2854 3808 1316 5616 11621 10418 9309 11498 16750 21389 22802 13260 1792 5669 8893
15285 8893 3428 -2090 6168 13315 14544 14561 17027 12822 10664 10104 4842 7298 10394 8574 10336
15270 10336 8920 3998 3114 3812 6957 10962 11023 15221 13879 12297 13593 12117 7907 5361 2494
15255 2494 2177 7874 13094 6570 1589 -1025 1193 -1194 393 2664 1261 -21 -519 3927 6094
15240 6094 11746 14266 20229 20381 9681 8829 12050 8639 11708 10341 2518 813 5778 11386 15660
$$ packed form
15347A7450l889NJ85p66j994k93n500J704K816N671j732n381k116J1128L321j280
15331A9329p749o179k197k085K352L304N143M009j917J165K108M58k012L094j173
15316A7650n577o410k885j293j703J632L908L361k883Q58M03Q85P6j732n025J135
15300B400M54R54k492M300O005j203j109K189N252M639J413r542j1468L877L224
15285H893n465n518Q258P147J229J7K466m205k158n60n262K456L096j820J762
15270A0336j416m922q84O98L145M005O1M198j342j582J296j476m210k546k867
15255B494l17N697N220o524m981k614K218k387J587K271j403j282m98M446K167
15240F094N652K520N963J52j0700q52L221l411L069j367p823j705M965N608M274
$$ plain form
15225 15660 15951 18275 17751 14131 13362 9851 15980 19908 19995 18678 14477 12917 9544 1885 9170 12207
15209 12207 16815 14972 13998 17576 12006 1606 1201 1517 6009 12722 16306 11486 11182 11707 7881
15194 7881 4573 8615 13382 13015 11130 15197 13941 7113 303 -4534 -10092 -5105 5248 4505 7095
15179 7095 4248 9485 12274 12693 23128 28068 23706 14364 14332 15951 20788 19043 14523 12170 5021
15164 5021 3321 5179 4982 2748 8803 12837 9365 3963 3869 5000 6902 11951 14873 15865 20133 21115
15148 21115 15123 10778 11226 12679 16430 17722 19606 21343 20299 16571 10999 14755 21056 16192 10908
15133 10908 14660 17319 13698 4437 4150 939 1896 6644 11232 10961 7603 6230 5376 1291 9228
15118 9228 9906 5025 2483 11689 16564 14241 16737 15397 11022 9601 12678 9451 7012 9089 5668
$$ packed form
15225A5660K91K324n24l620p69l511O129L928Q7j317m201j560l373p659P285L037
15209A2207M608j843r74L578n570j0400m05L16M492O713L584m820l04N25l826
15194G881l308M042M767l67j885M067j256o828o810m837n558M987J0353p43K590
15179G095k847N237K789M19J0435M940m362r342l2J619M837j745m520k353p149
15164E021j700J858j97k234O055M034l472n402r4J131J902N049K922R92M268R82
15148B1115n992m345M48J453L751J292J884J737j044l728n572L756O301m864n284
15133A0908L752K659l621r261k87l211R57M748M588k71l358j373q54m085P937
15118I228O78m881k542R206M875k323K496j340m375j421L077l227k439K077l421
$$ plain form
15103 5668 4456 9164 15114 12622 13326 16240 10660 713 4042 16076 19521 17389 10077 4324 7064
15088 7064 10633 18739 21650 14241 14671 17428 12620 12254 18388 16101 10133 14714 20592 21877 17756
15073 17756 13297 10962 3186 3816 11263 20157 17263 10381 13641 15594 14927 12231 8817 3962 4361
15058 4361 10028 15209 11429 7443 1715 3906 7052 6833 2202 -1322 -1848 125 -2720 -2860 -3213 -2531
15042 -2531 2712 13179 15847 16402 16748 17546 19296 17911 16623 17970 17913 16988 18605 17450 12596 13197
15026 13197 18791 18228 15680 15756 16237 16543 13091 11542 3556 -61 2324 11304 15782 18903 17548 15329
15010 15329 18227 14922 13519 5876 -3070 -6217 -5934 -5524 -295 3870 6628 3594 3145 9070 8969
14995 8969 8672 10789 20252 19373 12333 9186 13755 20390 19749 16667 17571 16551 15803 9141 11004 22279
$$ packed form
15103E668j212M708N950k492P04K914n580r947L329J2034L445k132p312n753K740
15088G064L569Q106K911p409M30K757m808l66O134k287n968M581N878J285m121
15073A7756m459k335p776O30P447Q894k894o882L260J953o67k696l414m855L99
15058D361N667N181l780l986n728K191L146k19m631l524n26J973k845j40l53O82
15042b531N243J0467K668N55L46P98J750j385j288J347n7r25J617j155m854O01
15026A3197N594n63k548P6M81L06l452j549p986l617K385Q980M478L121j355k219
15010A5329K898l305j403p643q946l147K83M10N229M165K758l034m49N925j01
14995H969k97K117R463q79p040l147M569O635o41l082R04j020p48o662J863J1275
$$ plain form
14979 22279 27984 20498 8723 5101 10045 11623 16114 22554 18122 13436 14173 12165 13075 9313 12792
14964 12792 18061 19939 20642 18157 20244 14668 3614 -293 1270 6467 7212 7438 7363 4817 3103
14949 3103 8597 7168 5198 4721 12263 19413 23092 19529 16503 16284 19228 17418 14187 11829 11366
14934 11366 6123 11417 10302 10428 14617 21100 20860 19945 21335 16118 12260 9483 14144 12760 6009
14919 6009 5468 4084 7547 2890 2026 8863 8503 2386 1893 5034 8358 11086 2961 1440 -209 3556
14903 3556 5454 6210 12369 13472 10822 8968 10708 11987 13881 20082 21174 15474 12448 1206 -405
14888 -405 -2885 2171 14093 13964 7762 10763 9217 14586 17845 21092 21229 19732 20108 16992 11270
14873 11270 10570 7985 9983 10493 10108 13701 15117 10282 5729 11770 14745 14879 14550 14667 14311 16010
$$ packed form
14979B2279N705p486j1775l622M944J578M491O440m432m686P37k008R10l762L479
14964A2792N269J878P03k485K087n576j1054l907J563N197P45K26p5k546j714
14949C103N494j429j970m77P542P150L679l563l026k19K944j810l231k358m63
14934A1366n243N294j115J26M189O483k40r15J390n217l858k777M661j384o751
14919F009n41j384L463m657q64O837l60o117m93L141L324K728q125j521j649L765
14903C556J898P56O159J103k650j854J740J279J894O201J092n700l026j1242j611
14888d05k480N056J1922j29o202L001j546N369L259L247J37j497L76l116n722
14873A1270p00k585J998N10l85L593J416m835m553O041K975J34l29J17l56J699
$$ plain form
14857 16010 16848 16363 18101 18657 28679 30361 25835 19949 14206 13382 11368 11736 12847 18124 17242 12508
14841 12508 16074 14877 12934 15722 14830 16097 20933 17731 19292 23685 20323 17558 15685 13228 13531
14826 13531 10423 11578 17874 24798 27220 26946 20629 19337 14688 10694 8245 11306 16220 20836 20295
14811 20295 21257 12860 11783 15740 22639 25572 19526 16980 20784 21451 18110 15100 12789 19159 21061
14796 21061 22489 21336 14041 15933 15555 26647 25764 22452 23227 23733 18476 7161 10936 15085 20243
14781 20243 21425 20342 22117 24751 23466 20557 18384 9966 5197 8324 15215 22300 20556 17007
14767 17007 26401 27910 24957 24464 20132 14546 10136 13435 19014 22346 22925 19191 21209 21452 14370
14752 14370 7859 15445 22263 23486 18629 23076 25703 23339 18081 13012 15443 18279 23407 29800
$$ packed form
14857A6010Q38m85J738N56J0022J682m526n886n743q24k014L68J111N277q82m734
14841A2508L566j197j943K788q92J267M836l202J561M393l362k765j873k457L03
14826A3531l108J155O296O924K422k74o317j292m649l994k449L061M914M616n41
14811B0295R62q397j077L957O899K933o046k546L804O67l341l010k311O370J902
14796B1061J428j153p295J892l78J1092q83l312P75N06n257j1315L775M149N158
14781B0243J182j083J775K634j285k909k173q418m769L127O891P085j744l549
14767A7007R394J509k953m93m332n586m410L299N579L332N79l734K018K43p082
14752A4370o511P586O818J223m857M447K627k364n258n069K431K836N128O393
$$ plain form
14738 29800 31945 25200 20481 23458 18277 15569 13272 16025 23375 22512 15473 15346 18471 21995 23538
14723 23538 15879 14753 17368 16541 16936 15497 18131 16359 15728 21590 19566 17822 24421 25861 24435
14708 24435 21688 19506 21108 18415 17844 21097 21443 25216 23231 25092 24291 28170 25271 24769 22730
14693 22730 23199 28919 31135 32097 24248 20573 21683 19757 24805 23826 24018 26670 30539 31896 26436
14678 26436 21172 21260 22938 29381 31345 25992 26237 24412 23017 24418 20617 12946 16834 26729 31587
14663 31587 34642 44230 44041 38723 28124 19620 14478 13376 20103 25698 23634 19252 20329 18205
14649 18205 11074 9856 14682 17514 20667 24873 24454 22155 19810 21579 22360 27105 28813 21330 18076
14634 18076 15075 18076 29454 32372 28294 27660 31873 29532 29866 30073 24194 14142 19329 24128 25783
$$ packed form
14738B9800K145o745m719K977n181k708k297K753P350q63p039j27L125L524J543
14723B3538p659j126K615q27L95j439K634j772o31N862k024j744O599J440j426
14708B4435k747k182J602k693n71L253L46L773j985J861q01L879k899n02k039
14693B2730M69N720K216R62p849l675J110j926N048r79J92K652L869J357n460
14678B6436n264Q8J678O443J964n353K45j825j395J401l801p671L888R895M858
14663C1587L055R588j89n318j0599q504n142j102O727N595k064m382J077k124
14649A8205p131j218M826K832L153M206m19k299k345J769P81M745J708p483l254
14634A8076l001L001J1378K918m078o34M213k341L34K07n879j0052N187M799J655
$$ plain form
14619 25783 19848 17343 21668 24004 26643 35260 36128 32103 30699 31194 33613 32935 32111 36363 31088
14604 31088 27742 27169 28582 28228 31169 34421 30756 24879 23585 27629 26260 22080 16420 19597 27675
14589 27675 31357 23615 21055 20468 18279 21221 27240 31408 34451 36217 35772 34597 35804 39105 39285
14574 39285 37416 38096 37700 40942 41450 33220 32545 33907 41699 45715 42675 42904 39199 38936 32600 32448
14558 32448 38653 35082 29721 32226 33477 35905 33245 39108 47558 53210 45960 44324 41889 41100 39383
14543 39383 37233 40928 34162 28727 23743 25614 29527 29068 25676 30381 37955 37709 34626 36264 37951
14528 37951 36282 39983 46025 42930 38784 33825 29331 30215 32921 33769 36446 36574 40759 43981 43665
14513 43665 34278 27102 29178 32251 34257 33059 33170 24708 12404 15361 22089 29119 30659 30272 32870
$$ packed form
14619B5783n935k505M325K336K639Q617Q68m025j404M95K419o78q24M252n275
14604C1088l346n73J413l54K941L252l665n877j294M044j369m180n660L177Q078
14589B7675L682p742k560n87k189K942O019M168L043J766m45j175J207L301J80
14574C9285j869O80l96L242N08q230o75J362P792M016l040K29l705k63o336j52
14558C2448O205l571n361K505J251K428k660N863Q450N652p250j636k435p89j717
14543C9383k150L695o766n435m984J871L913m59l392M705P574k46l083J638J687
14528C7951j669L701O042l095m146m959m494Q84K706Q48K677J28M185L222l16
14513D3665r387p176K076L073K006j198J11q462j2304K957O728P030J540l87K598
$$ plain form
14498 32870 32736 34040 32471 30133 27746 31215 31298 34250 37382 34304 40220 49916 49845 42981 42296 49423
14482 49423 48607 52930 53369 56871 63318 76028 92380 95439 97917 102259 107357 112348 114013 119543
14468 119543 137878 149723 143708 135080 120470 115399 107579 101545 99689 93144 82769 83786 87641
14455 87641 91185 85420 89374 92054 87308 88476 81104 78764 78974 72660 77223 85427 77759 79067 82610
14440 82610 81539 84134 86845 87472 80569 72160 63946 64330 68740 71896 70516 74614 76085 78260 87072
14425 87072 83674 88710 90771 82119 79208 78957 79826 77263 80818 85700 88208 90105 93887 86443 80158
14410 80158 82564 81274 75556 75361 79202 81163 75877 67850 65482 64372 60993 61125 70212 75107 75031
14395 75031 69895 67666 63710 58058 61058 61909 58121 60543 62275 67984 68702 69436 67282 69948 76334
$$ packed form
14498C2870j34J304j569k338k387L469Q3K952L132l078N916R696p1o864o85P127
14482D9423q16M323M39L502O447J2710J6352L059K478M342N098M991J665N530
14468A19543J8335J1845o015q628j4610n071p820o034j856o545j0375J017L855
14455H7641L544n765L954K680m746J168p372k340K10o314M563Q204p668J308L543
14440H2610j071K595K711O27o903q409q214L84M410L156j380M098J471K175Q812
14425H7072l398N036K061q652k911k51Q69k563L555M882K508J897L782p444o285
14410H0158K406j290n718j95L841J961n286q027k368j110l379J32R087M895p6
14395G5031n136k229l956n652L000Q51l788K422J732N709P18P34k154K666O386
$$ plain form
14380 76334 71092 68332 66237 69828 75681 84837 86663 81060 76897 77601 82643 77051 77941 81026 79829
14365 79829 85250 82469 75727 75474 77026 72471 67416 64132 59999 60674 64603 65426 68685 73624 80999
14350 80999 83374 83261 73695 69335 71565 76306 82457 85818 82122 83854 88244 82794 82740 88339 91255
14335 91255 88269 90407 98814 100762 102145 102140 101225 95013 99294 111333 116853 111404 111932 111499 110447 115840
14319 115840 121393 124659 139424 150377 155569 155509 148239 143588 134276 115363 100041 85827 74379
14306 74379 72714 70323 71101 75498 75093 78896 89308 97729 99478 93422 86394 89198 89677 87753 88215
14291 88215 99673 103183 109653 114643 121445 127822 137538 135945 134490 150283 172555 178850 182857 183988
14277 183988 188097 203456 210139 210320 216105 225692 231597 230840 220532 207956 206643 205346 204295 203828
$$ packed form
14380G6334n242k760k095L591N853R156J826n603m163P04N042n592Q90L085j197
14365G9829N421k781o742k53J552m555n055l284m133O75L929Q23L259M939P375
14350H0999K375j13r566m360K230M741O151L361l696J732M390n450n4N599K916
14335I1255k986K138Q407J948J383nr15o212M281J2039N520n449N28m33j052N393
14319A15840N553L266J4765J0953N192o0p270m651r312j8913j5322j4214j1448
14306G4379j665k391P78M397m05L803J0412Q421J749o056p028K804M79j924M62
14291H8215J1458L510O470M990O802O377R716j593j455J5793K2272O295M007J131
14277A83988M109J5359O683J81N785R587N905p57j0308j2576j313j297j051m67
$$ plain form
14263 203828 213737 223818 232422 237198 245897 252338 251425 248304 243503 231740 220144 207892 195957
14250 195957 188319 182473 172488 165679 163866 161442 153773 153030 159819 157350 151934 149099 147271 141774
14236 141774 133763 132431 134907 143573 139478 137265 137418 139533 138986 139122 136297 134786 136258 149383 157043
14221 157043 160909 164170 158212 145506 141853 140808 134819 124559 116282 110759 104801 104817 101368 104807
14207 104807 108152 113627 118278 126853 136467 153583 176123 201880 220128 237703 247760 250164 253634
14194 253634 245397 240199 231580 230511 231212 235020 233869 218425 215857 221613 222754 223123 232561 242246
14180 242246 243444 247504 255258 253780 253613 265267 275291 277333 287362 285428 283620 285729 294757 295271
14166 295271 292070 278922 255989 245598 242933 253510 278977 308284 343713 372254 404208 434353
$$ packed form
14263B03828R909J0081Q604M776Q699O441r13l121m801j1763j1596j2252j1935
14250A95957p638n846r985o809j813k424p669p43O789k469n416k835j828n497
14236A41774q011j332K476Q666m095k213J53K115n47J36k825j511J472J3125P660
14221A57043L866L261n958j2706l653j045n989j0260q277n523n958J6l449L439
14207A04807L345N475M651Q575R614J7116K2540K5757J8248J7575J0057K404L470
14194B53634q237n198q619j069P01L808j151j5444k568N756J141L69R438R685
14180B42246J198M060P754j478j67J1654J0024K042J0029j934j808K109R028N14
14166B95271l201j3148k2933j0391k665J0577K5467K9307L5429K8541L1954L0145
$$ plain form
14154 434353 470464 501181 527121 546941 560001 577255 600377 616341 618821 617166 608533 583691
14142 583691 557042 524961 498173 465436 425851 396936 372505 342822 312581 287747 282774 301483
14130 301483 326240 346536 366666 377483 391174 415170 439931 459322 472889 486149 498353
14119 498353 518481 534823 547431 553290 570441 586292 604594 626296 644434 660440 677470 693609
14107 693609 709561 728363 742982 764183 787130 808683 834051 861175 882341 900418 922976
14096 922976 943233 954353 968249 979334 1000618 1032691 1066007 1091716 1115087 1140382 1155176
14085 1155176 1173077 1204463 1241256 1275314 1317897 1363165 1412940 1465394 1515258 1563615 1619669
14074 1619669 1684602 1747003 1806172 1859440 1913634 1975111 2041714 2124811 2209125 2301883 2407188
$$ packed form
14154D34353L6111L0717K5940J9820J3060J7254K3122J5964K480j655q633k4842
14142E83691k6649l2081k6788l2737l9585k8915k4431k9683l0241k4834m973J8709
14130C01483K4757K0296K0130J0817J3691K3996K4761J9391J3567J3260J2204
14119D98353K0128J6342J2608N859J7151J5851J8302K1702J8138J6006J7030J6139
14107F93609J5952J8802J4619K1201K2947K1553K5368K7124K1166J8077K2558
14096I22976K0257J1120J3896J1085K1284L2073L3316K5709K3371K5295J4794
14085A155176J7901L1386L6793L4058M2583M5268M9775N2454M9864M8357N6054
14074A619669O4933O2401N9169N3268N4194O1477O6603Q3097Q4314R2758J05305
$$ plain form
14063 2407188 2516483 2625005 2730362 2846353 2971408 3096407 3236038 3386803 3552578
14054 3552578 3728710 3915649 4118253 4343395 4586809 4848723 5132787 5441661 5787686
14045 5787686 6176184 6598573 7073350 7608754 8216010 8899850 9678214 10573322 11586569
14036 11586569 12740725 14062439 15587654 17357531 19426591 21850210 24684574 28002110
14028 28002110 31885490 36431012 41764592 48022367 55416131 64235646 74899378 87936760
14020 87936760 103800976 122343126 142265377 161518822 178742383 194526054 211229891
14013 211229891 231613256 257851197 291101520 329543051 363540365 373158980 343145846
14006 343145846 284261242 221341367 169096154 129986934 101634704 81080398 65963138
$$ packed form
14063B407188J09295J08522J05357J15991J25055J24999J39631J50765J65775
14054C552578J76132J86939K02604K25142K43414K61914K84064L08874L46025
14045E787686L88498M22389M74777N35404O07256O83840P78364Q95108J013247
14036A1586569J154156J321714J525215J769877K069060K423619K834364L317536
14028B8002110L883380M545522N333580O257775P393764Q819515J0663732J3037382
14020H7936760J5864216J8542150J9922251J9253445J7223561J5783671J6703837
14013B11229891K0383365K6237941L3250323L8441531L3997314R618615l0013134
14006C43145846n8884604o2919875n2245213l9109220k8352230k0554306j5117260
$$ plain form
13999 65963138 54620414 45950945 39217170 33878694 29575871 26052047 23124068 20650779
13991 20650779 18553130 16757514 15207977 13874949 12719686 11704210 10803845 10003226
13983 10003226 9293055 8657805 8080928 7565940 7113339 6707341 6338282 5991950 5669009
13974 5669009 5359023 5068225 4794697 4547208 4315708 4101221 3904126 3721263 3550834
13965 3550834 3386696 3242020 3114758 2994972 2880755 2776403 2670109 2564935 2456870
13956 2456870 2357251 2283518 2211739 2135783 2069990 2019226 1967101 1904419 1833468 1768841 1711250
13945 1711250 1659279 1601008 1553444 1516604 1485190 1454023 1420401 1385680 1351457 1311284 1277104
13934 1277104 1251374 1221848 1188685 1152295 1114471 1071692 1040429 1013363 986732 966470 949721
$$ packed form
13999F5963138j1342724q669469o733775n338476m302823l523824k927979k473289
13991B0650779k097649j795616j549537j333028j155263j015476r00365q00619
13983A0003226p10171o35250n76877n14988m52601m05998l69059l46332l22941
13974E669009l09986k90798k73528k47489k31500k14487j97095j82863j70429
13965C550834j64138j44676j27262j19786j14217j04352j06294j05174j08065
13956B456870r9619p3733p1779p5956o5793n0764n2125o2682p0951o4627n7591
13945A711250n1971n8271m7564l6840l1414l1167l3622l4721l4223m0173l4180
13934A277104k5730k9526l3163l6390l7824m2779l1263k7066k6631k0262j6749
$$ plain form
13923 949721 931184 914134 889182 870485 856108 844988 830102 819662 817050 818161 814975 813868
13911 813868 798657 785186 776576 776210 774590 774744 778686 787178 783847 777165 771046 770114 764807 747776
13897 747776 738652 739313 750169 762844 784823 808024 814635 810883 803000 794585 792260 789142 788797 794870
13883 794870 802252 782260 737838 683231 628180 565839 506092 464445 435201 406256 372605 344894
13871 344894 325793 312563 305001 302530 314586 326619 338749 356949 363460 373194 380121 385202 388051
13858 388051 392391 408451 413216 404531 392441 367508 325621 295915 276841 260335 256901 258007
13846 258007 261298 256052 259734 261456 259580 253292 252333 252360 243030 239872 239723 232554 225998 228949 228587
13831 228587 229966 229449 221169 211605 211728 210686 205144 206349 206077 200352 191839 190581 198794 212841 230025
$$ packed form
13923I49721j8537j7050k4952j8697j4377j1120j4886j0440k612J111l186j107
13911H13868j5211j3471q610l66j620J54L942Q492l331o682o119r32n307j7031
13897G47776r124O61J0856J2675K1979K3201O611l752p883q415k325l118l45O073
13883G94870P382j9992m4422n4607n5051o2341n9747m1647k9244k8945l3651k7711
13871C44894j9101j3230p562k471J2056J2033J2130J8200O511R734O927N081K849
13858C88051M340J6060M765q685j2090k4933m1887k9706j9074j6506l434J106
13846B58007L291n246L682J722j876o288r59K7r330l158j49p169o556K951l62
13831B28587J379n17q280r564J23j042n542J205k72n725q513j258Q213J4047J7184
$$ plain form
13816 230025 244998 266060 279143 283655 280025 277613 271621 260956 249319 236174 224869 217635
13804 217635 206975 202073 192025 182631 179053 173011 163033 160907 163369 168097 173093 177907 176020 177200
13790 177200 174345 168414 162772 170042 172063 167712 157904 156043 155852 148672 145581 152345 146051 139291
13776 139291 139729 143374 144098 146852 152112 153382 152486 153073 155520 156967 157654 160753 156783 154738 149949
13761 149949 146887 147314 152461 153298 154476 157379 159747 150915 148643 149690 143935 138737 133703 129081 127606
13746 127606 131063 127208 127875 129206 126467 128192 131107 130027 129788 125146 116793 112537 114455 118726 120197
13731 120197 120148 118327 121850 117532 116762 121265 120136 115970 108086 107921 111034 110527 107966 104993 97120
13716 97120 95113 98847 93291 82866 78444 76986 71255 60270 44443 29554 19062 3260 -9028
$$ packed form
13816B30025J4973K1062J3083M512l630k412n992j0665j1637j3145j1305p234
13804B17635j0660m902j0048r394l578o042r978k126K462M728M996M814j887J180
13790A77200k855n931n642P270K021m351r808j861j91p180l091O764o294o760
13776A39291M38L645P24K754N260J270q96N87K447J447O87L099l970k045m789
13761A49949l062M27N147Q37J178K903K368q832k272J047n755n198n034m622j475
13746A27606L457l855O67J331k739J725K915j080k39m642q353m256J918M271J471
13731A20197m9j821L523m318p70M503j129m166p884j65L113n07k561k973p873
13716I7120k007L734n556j0425m422j458n731j0985j5827j4889j0492j5802j2288
$$ plain form
13703 -9028 -16202 -17850 -3421 22917 42628 60244 68754 73028 70296 60460 62712 63891 55581 50614
13689 50614 48392 50713 55726 61811 65887 63121 59671 67933 68647 66210 63956 64697 59277 60590 62225
13674 62225 63854 61291 64698 67062 62377 59103 60191 61232 65323 63967 63634 59973 60049 61805 56402
13659 56402 52076 54495 52858 46638 43055 42339 40132 41343 47235 48297 48107 47400 48504 52174 48996
13644 48996 50157 45263 42954 40197 45431 47060 44334 41480 45766 45783 40347 39704 42441 44319 49583
13629 49583 49344 48114 46690 44213 45184 39286 41280 44057 40989 44042 48475 38458 27946 33979
13615 33979 44564 42267 35339 33622 23553 13533 13580 13841 15046 11769 11776 9994 8253 7435 8501
13600 8501 6300 1935 6095 10319 18052 20940 19913 24470 18815 13719 14990 9557 11185 11804 9039
$$ packed form
13703i028p174j648J4429K6338J9711J7616Q510M274k732r836K252J179q310m967
13689E0614k222K321N013O085M076k766l450Q262P14k437k254P41n420J313J635
13674F2225J629k563L407K364m685l274J088J041M091j356l33l661P6J756n403
13659E6402m326K419j637o220l583p16k207J211N892J062j90p07J104L670l178
13644D8996J161m894k309k757N234J629k726k854M286J7n436o43K737J878N264
13629D9583k39j230j424k477R71n898J994K777l068L053M433j0017j0512O033
13615C3979J0585k297o928j717j0069j0020M7K61J205l277Pj782j741q18J066
13600H501k201m365M160M224P733K888j027M557n655n096J271n433J628O19k765
$$ plain form
13585 9039 9655 4876 2759 11590 11951 13581 8236 9850 15365 11321 8688 3922 2245 -6248 -6412
13570 -6412 -5743 -6279 -4275 -154 -834 -8084 -13499 -16963 -19302 -22295 -23090 -22330 -28910 -34380 -33009 -36480
13554 -36480 -47713 -58429 -67118 -75027 -69027 -63335 -51815 -38132 -29050 -19720 -4764 1962 7196
13541 7196 13245 20449 26014 23376 22751 21111 26899 29765 31724 36265 46174 41675 32111 27772 29972
13526 29972 25875 24134 29970 32092 38883 40511 40544 43049 39769 41352 49105 44200 43116 43358 45391
13511 45391 42903 35926 33246 33952 40819 42772 45713 43206 36013 31591 30542 36598 38448 33468 28740
13496 28740 26950 28323 34566 39616 40688 34877 33532 32210 28277 28229 30720 30338 26652 25116 23508
13481 23508 19886 21854 22179 17726 13540 19306 20563 19883 14186 9843 8419 7846 12640 13923 18054
$$ packed form
13585I039O16m779k117Q831L61J630n345J614N515m044k633m766j677q493j64
13570f412O69n36K004M121o80p250n415l464k339k993p95P60o580n470J371l471
13554c6480j1233j0716q689p909O000N692J1520J3683R082R330J4956O726N234
13541G196O049P204N565k638o25j640N788K866J959M541R909m499r564m339K200
13526B9972m097j741N836K122O791J628L3K505l280J583P753m905j084K42K033
13511D5391k488o977k680P06O867J953K941k507p193m422j049O056J850m980m728
13496B8740j790J373O243N050J072n811j345j322l933m8K491l82l686j536j608
13481B3508l622J968L25m453m186N766J257o80n697m343j424n73M794J283M131
$$ plain form
13466 18054 21680 18560 17331 16759 18565 24242 22462 19341 24106 25095 32242 29924 22832 20841 15313
13451 15313 16862 16276 18261 14400 8426 12788 15590 8801 13386 19005 15448 12063 9336 7485 9555
13436 9555 12458 12361 17813 25530 27154 27830 24759 18509 13302 11460 7890 9959 21198 20363 18980
13421 18980 23067 22356 20624 17978 14659 14289 17093 15530 9922 11078 15485 13342 14028 11148 5278
13406 5278 5893 6560 9290 10160 19561 22469 22795 21670 22528 23618 24554 22022 21993 22851 22963 22268 14534
13389 14534 16376 25793 19716 22794 23834 22373 20321 18765 21438 22913 22656 17350 21357 17719 12380
13374 12380 14325 19037 22959 16286 15153 13064 12908 9961 7623 9854 6573 8429 9931 4022 -2899
13359 -2899 -3232 3854 7873 3591 5308 5285 9158 7032 6836 4494 1074 2408 3386 3473 4602 10229
$$ packed form
13466A8054L626l120j229n72J806N677j780l121M765R89P147k318p092j991n528
13451A5313J549n86J985l861n974M362K802o789M585N619l557l385k727j851K070
13436I555K903r7N452P717J624O76l071o250n207j842l570K069J1239q35j383
13421A8980M087p11j732k646l319l70K804j563n608J156M407k143O86k880n870
13406E278O15O67K730Q70R401K908L26j125Q58J090R36k532k9Q58J12o95p734
13389A4534J842R417o077L078J040j461k052j556K673J475k57n306M007l638n339
13374A2380J945M712L922o673j133k089j56k947k338K231l281J856J502n909o921
13359b899l33P086M019m282J717k3L873k126j96k342l420J334R78Q7J129N627
$$ plain form
13343 10229 11871 8935 13479 11158 10059 12975 11802 5694 2266 4364 5881 10670 15951 17368
13329 17368 15481 17369 19221 16300 20864 16551 14475 15973 17532 19735 18573 19489 18078 15197 16128
13314 16128 16105 11435 5138 1392 1012 7091 5885 694 -1151 -4421 719 3127 3382 4008 6844 10468
13298 10468 9533 4921 7269 11295 13917 13063 13237 6837 5040 4567 5587 4472 2406 5045 10996
13283 10996 13373 12645 10591 16803 17863 6122 4584 4836 6697 8206 9972 10852 12668 13062 8350
13268 8350 4553 11039 16506 14001 6913 7125 10772 12302 17559 11819 16051 18492 11152 10292 9423
13253 9423 7953 17606 23834 21678 15257 13267 13840 12682 22330 23832 17569 13193 7912 5598 3989
13238 3989 5114 8976 10164 11275 16477 21748 21946 18315 16260 13972 11510 13752 15660 18425 21576
$$ packed form
13343A0229J642k936M544k321j099K916j173o108l428K098J517M789N281J417
13329A7368j887J888J852k921M564m313k076J498J559K203j162R16j411k881R31
13314A6128k3m670o297l746l80O079j206n191j845l270N140K408K55O26K836L624
13298A0468r35m612K348M026K622q54J74o400j797m73J020j115k066K639N951
13283A0996K377p28k054O212J060j1741j538K52J861J509J766Q80J816L94m712
13268H350l797O486N467k505p088K12L647J530N257n740M232K441p340q60q69
13253I423j470R653O228k156o421j990N73j158R648J502o263m376n281k314j609
13238C989J125L862J188J111N202N271J98l631k055k288k462K242J908K765L151
$$ plain form
13223 21576 16203 15862 11187 6379 3037 4038 5892 3347 3014 3738 8820 11433 11140 5263 3280
13208 3280 8726 12339 6255 -1300 984 -1247 -88 9937 13271 18933 14341 10602 9500 5158
13194 5158 -1591 -3634 -5883 -7759 -9355 570 3890 5487 15943 16260 16168 10574 6569 3810 5667
13179 5667 3094 9689 11780 11201 9944 14229 17260 19671 22677 18501 12023 6985 6425 11190 10635
13164 10635 1004 -500 7773 12654 17638 20840 17933 10941 8154 10120 9804 548 6483 13208 19333
13149 19333 13869 8819 4600 9616 16899 19644 20250 20638 17222 12922 7526 1193 2770 3494 -3428
13134 -3428 -1030 7119 12367 13401 11913 10137 10788 7186 4019 812 5576 7767 10033 11887 9086
13119 9086 9239 11485 14429 15357 13443 8847 8499 15800 16721 15280 7699 667 941 8413 14009 12450
$$ packed form
13223B1576n373l41m675m808l342J001J854k545l33P24N082K613k93n877j983
13208C280N446L613o084p555K284k231J159J0025L334N662m592l739j102m342
13194E158o749k043k249j876j596R925L320J597J0456L17r2n594m005k759J857
13179E667k573O595K091n79j257M285L031K411L006m176o478n038n60M765n55
13164A0635r631j504Q273M881M984L202k907o992k787J966l16r256N935O725O125
13149A9333n464n050m219N016P283K745O06L88l416m300n396o333J577P24o922
13134c428K398Q149N248J034j488j776O51l602l167l207M764K191K266J854k801
13119I086J53K246K944R28j914m596l48P301R21j441p581p032K74P472N596j559
$$ plain form
13103 12450 9214 11306 14264 16366 13695 7446 6613 11264 11507 11346 4046 1025 2007 2442 6809 6720
13087 6720 14099 18858 19939 16335 13885 10703 12517 14516 15545 19232 26630 20909 9419 10953
13073 10953 11233 8904 8216 9190 9928 12822 15674 12002 12049 10130 17895 19430 16075 16625 15547 9126
13057 9126 10808 10402 8784 3609 5760 1556 -4859 -547 7433 4514 -2989 -7594 -3924 -1227 3198
13042 3198 1768 -3809 -3647 -1444 2370 5540 8424 13279 9183 9665 9729 4599 9484 14960 11702 11357
13026 11357 13241 12891 14748 14144 9831 6742 7022 7853 9816 13752 18067 18502 17060 20450 20058 16151
13010 16151 17053 19099 17102 15705 12762 16059 18870 14123 9976 5525 8202 10594 7411 5391 2369
12995 2369 89 2043 6511 14093 14038 7898 6994 11086 13186 7732 1935 9498 12400 12318 13824 14717
$$ packed form
13103A2450l236K092K958K102k671o249q33M651K43j61p300l021R82M35M367q9
13087F720P379M759J081l604k450l182J814J999J029L687P398n721j1490J534
13073A0953K80k329o88R74P38K894K852l672M7j919P765J535l355N50j078o421
13057I126J682m06j618n175K151m204o415M312P980k919p503m605L670K697M425
13042C198j430n577J62K203L814L170K884M855m096M82O4n130M885N476l258l45
13026A1357J884l50J857o04m313l089K80Q31J963L936M315M35j442L390l92l907
13010A6151R02K046j997j397k943L297K811m747m147m451K677K392l183k020l022
12995B369k280J954M468P582n5o140r04M092K100n454n797P563K902q2J506Q93
$$ plain form
12979 14717 12189 8834 10884 8298 6850 9357 11108 11226 10549 12187 15091 7195 8497 11027 13862
12964 13862 16529 16293 21171 26186 25585 24409 19703 15584 9766 6459 7114 11247 9336 7529 3547
12949 3547 5896 5886 9015 14857 20509 16349 8710 12939 12643 7110 4465 3452 257 2157 2584 -136
12933 -136 7421 5606 -1725 -6829 -6346 -4702 -200 6677 7681 8513 1155 1251 9192 13354 10399 8675
12917 8675 7809 3745 3420 11311 14169 11612 15975 18788 8567 -1575 -1850 2659 -1398 -1303 1961
12902 1961 7998 8062 4470 -1108 1191 4921 3362 10308 12632 8132 6375 10427 14184 8898 1962
12887 1962 723 3563 7471 1276 3725 10705 12060 16548 15598 7728 266 -4838 -1001 1525 8494
12872 8494 9076 6938 5291 3709 -8506 -8673 -5989 -6598 -5961 -5063 1659 1935 9760 11211 8698 10928
$$ packed form
12979A4717k528l355K050k586j448K507J751J18o77J638K904p896J302K530K835
12964A3862K667k36M878N015o01j176m706m119n818l307O55M133j911j807l982
12949C547K349j0L129N842N652m160p639M229k96n533k645j013l195J900M27k720
12933a36P557j815p331n104M83J644M502O877J004Q32p358R6P941M162k955j724
12917H675q66m064l25P891K858k557M363K813j0221j0142k75M509m057R5L264
12902A961O037O4l592n578K299L730j559O946K324m500j757M052L757n286o936
12887A962j239K840L908o195K449O980J355M488r50p870p462n104L837K526O969
12872H494N82k138j647j582j2215j67K684o09O37Q98O722K76P825J451k513K230
$$ plain form
12856 10928 1107 -7242 -3710 -4830 -2915 -5761 -10151 -3291 4603 4387 4966 6866 5784 -2498 -2003
12841 -2003 6390 5930 7147 11426 8580 1306 5914 12724 7864 4429 2426 4787 3654 7991 9285
12826 9285 6163 3560 6363 9515 1819 1287 6967 6557 1631 -2583 -934 2208 4822 9656 12841
12811 12841 14588 10042 8185 11010 4831 -5003 -6521 5175 8543 1924 -485 451 2120 845
12797 845 2261 -1251 -2107 -8104 -2906 -3985 382 3940 3025 906 -320 -5860 -9425 -10231 998
12782 998 10718 12310 11682 7404 5232 3656 -4987 -1427 12326 8549 5600 749 -2245 -1886 -6262
12767 -6262 -2949 -3872 -1390 332 3646 4513 5427 12501 16801 7309 1834 3348 7329 4238 3744 8250
12751 8250 10626 7129 5694 502 473 3391 4783 2213 -5916 -6074 -1743 481 1801 2003 7757 1724
$$ packed form
12856A0928r821q349L532j120J915k846m390O860P894k16N79J900j082q282M95
12841b003Q393m60J217M279k846p274M608O810m860l435k003K361j133M337J294
12826I285l122k603K803L152p696n32N680m10m926m214J649L142K614M834L185
12811A2841J747m546j857K825o179r834j518J1696L368o619k409R36J669j275
12797H45J416l512q56n997N198j079M367L558r15k119j226n540l565q06J1229
12782I98R720J592o28m278k172j576q643L560J3753l777k949m851k994L59m376
12767f262L313r23K482J722L314Q67R14P074M300r492n475J514L981l091m94M506
12751H250K376l497j435n192k9K918J392k570q129j58M331K224J320K02N754o033
$$ plain form
12735 1724 -4905 -7615 -9601 -5723 -3565 -5835 -6639 -3780 -222 480 1951 3836 11824 9095 1551
12720 1551 -4449 -602 -1290 -4555 -3431 -1641 3917 3747 -2570 -3710 -1429 -6361 -11271 -8499 1402
12705 1402 -346 5055 4273 4167 3667 -2148 -360 -6333 -9255 -5283 -13256 -12573 -12836 -10044 -12814 -8896
12689 -8896 -5000 -9854 -2115 1109 2512 7351 10790 7088 11125 16093 12094 10313 12906 8922 6331
12674 6331 88 -3154 1799 1909 -1677 2261 -3973 -175 2840 4349 5257 4317 207 -170 1443 2743
12658 2743 12782 11873 4841 432 -8285 -6007 -2795 -7290 -6690 -4438 -4209 -2566 -1448 -2814 2689
12643 2689 -894 5848 2725 -6037 -4950 1149 4117 3826 -2929 -4804 -2841 141 1189 3859 4497
12628 4497 6401 2394 -2464 3349 5919 11351 8528 644 1057 1500 3075 2983 -3892 -5622 1258 5900
$$ packed form
12735A724o629k710j986L878K158k270q04K859L558P02J471J885P988k729p544
12720A551o000L847o88l265J124J790N558j70o317j140K281m932m910K772R901
12705A402j748N401p82j06n00n815J788n973k922L972p973O83k63K792k770L918
12689h896L896m854P739L224J403M839L439l702M037M968l999j781K593l984k591
12674F331o243l242M953J10l586L938o234L798L015J509R08r40m110l77J613J300
12658B743J0039r09p032m409q717K278L212m495O00K252K29J643J118j366N503
12643B689l583O742l123q762J087O099K968k91o755j875J963K982J048K670O38
12628D497J904m007m858N813K570N432k823p884M13M43J575r2o875j730O880M642
$$ plain form
12612 5900 1780 -4774 -1227 2826 -1387 -4400 -169 453 980 -55 226 1128 638 139 1964 -4641
12596 -4641 -6610 1676 9396 15957 12756 8595 5999 3864 4095 5405 5892 5364 29 1632 3949
12581 3949 5909 1885 1141 3498 4194 6954 8621 4917 9854 21509 22993 14067 13125 17477 19882
12566 19882 17928 24653 30274 28303 24015 31193 35405 44329 57392 62600 53573 33245 22593 6811
12552 6811 1307 -7628 -3978 5665 4572 6485 2995 2193 8922 10847 12814 16686 30676 27280 27254
12537 27254 18518 17887 18587 26075 27906 24378 31739 45849 51216 40753 24138 13808 12687 12568
12523 12568 13286 15656 14368 8542 8968 7216 1748 -3681 -2782 -1114 4832 6692 -2779 2098 3166
12508 3166 -6063 -8139 -3101 -4285 -8708 -7460 -4241 3206 8326 9695 16657 10408 4907 11388 11812
$$ packed form
12612E900m120o554L547M053m213l013M231O22N27j035K81R02m90m99J825o605
12596d641j969Q286P720O561l201m161k596k135K31J310M87n28n335J603K317
12581C949J960m024p44K357O96K760J667l704M937J1655J484q926r42M352K405
12566A9882j954O725N621j971m288P178M212Q924J3063N208r027k0328j0652j5782
12552F811n504q935L650R643j093J913l490q02O729J925J967L872J3990l396k6
12537B7254q736o31P00P488J831l528P361J4110N367j0463j6615j0330j121j19
12523A2568P18K370j288n826M26j752n468n429Q99J668N946J860r471M877J068
12508C166r229k076N038j184m423J248L219P447N120J369O962o249n501O481M24
$$ plain form
12493 11812 8615 6407 1701 657 -165 3814 929 -726 4048 8262 9942 13423 14473 10151 6655
12478 6655 -4531 -4194 611 -343 4269 9776 11975 7491 -2247 -4545 -2912 -3272 1543 1007 857 4784
12462 4784 5383 9529 11308 8480 9637 9683 9039 9398 9958 8531 6294 3122 1271 -222 457 3163
12446 3163 -4895 -5308 8898 12876 12586 3462 3115 3794 -3141 -2376 1130 -914 -7136 -8919 -2323 712
12430 712 6418 7515 5884 4878 9402 8426 15075 16998 12255 8831 3395 138 3091 4655 5968
12415 5968 10485 10209 12087 11129 5365 2442 -2738 1013 -620 4274 7056 6609 -370 -2567 646
12400 646 3435 2111 -9961 -18687 -12089 -11895 -11777 -8863 -5773 1745 4496 -462 -3161 -1736 -1684 5871
12384 5871 3278 2799 7646 10492 6143 1120 5066 8430 5683 3938 2970 9295 16790 9615 6703
$$ packed form
12493A1812l197k208m706j044q22L979k885j655M774M214J680L481J050m322l496
12478F655j1186L37M805r54M612N507K199m484r738k298J633l60M815n36j50L927
12462D784N99M146J779k828J157M6o44L59N60j427k237l172j851j493O79K706
12446C163q058m13J4206L978k90r124l47O79o935P65L506k044o222j783O596L035
12430G12N706J097j631j006M524r76O649J923m743l424n436l257K953J564J313
12415E968M517k76J878r58n764k923n180L751j633M894K782m47o979k197L213
12400F46K789j324j2072q726O598J94J18K914L090P518K751m958k699J425N2P555
12384E871k593m79M847K846m349n023L946L364k747j745r68O325P495p175k912
$$ plain form
12369 6703 4114 8464 15461 14292 10569 8141 7435 12384 13179 11038 9360 5064 6190 4394 11766
12354 11766 12635 10243 2635 7232 8443 6192 6982 1217 -598 636 3985 6472 10708 12249 12342
12339 12342 10838 5326 9204 7114 6426 3131 3728 2447 1941 -396 -4957 -4344 -969 1584 -2596
12324 -2596 1174 9811 12747 8282 3388 1729 2871 3720 6625 7299 3928 619 5834 7849 6047
12309 6047 3756 5805 5359 3619 2388 517 -3053 -5702 489 2074 2298 3860 3483 2576 5264 5612
12293 5612 11656 14450 4805 -3425 -8303 -6417 -2577 6245 11548 14510 15528 10902 6568 210 1811
12278 1811 9707 10988 14787 12207 8306 1587 -4447 -7362 -5538 1219 5487 11705 7435 5731 810
12263 810 416 -1673 2968 5356 7774 6336 326 -2846 -2789 298 -1707 808 4997 6752 6931 1623
$$ packed form
12369F703k589M350O997j169l723k428p06M949P95k141j678m296J126j796P372
12354A1766Q69k392p608M597J211k251P90n765j815J234L349K487M236J541R3
12339A2342j504n512L878k090o88l295N97j281n06k337m561O13L375K553m180
12324b596L770Q637K936m465m894j659J142Q49K905O74l371l309N215K015j802
12309F047k291K049m46j740j231j871l570k649O191J585K24J562l77r07K688L48
12293E612O044K794r645q230m878J886L840Q822N303K962J018m626m334o358J601
12278A811P896J281L799k580l901o719o034k915J824O757M268O218m270j704m921
12263H10l94k089M641K388K418j438o010l172N7L087k005K515M189J755J79n308
$$ plain form
12247 1623 2080 7287 7095 5525 13474 19024 18989 20150 15686 11582 10137 7185 3255 8778 5781 6732
12231 6732 6765 1341 -2237 -611 -4457 -3839 2998 5529 3818 4485 1189 3514 7534 3334 9791 9737
12215 9737 16484 23840 22163 20277 19432 20815 16252 9493 8440 12445 14913 21324 20825 12364 11406
12200 11406 18878 15384 7047 10213 16394 19589 15023 9794 13450 13594 15253 11108 9235 15508 9521
12185 9521 7106 14540 20963 23755 22479 22589 17096 7833 8989 12795 13660 9682 12535 11929 5984
12170 5984 11627 16057 19147 26526 24975 19333 14319 8904 10224 20080 22402 16971 9143 1973 1149
12155 1149 6108 6363 12347 13249 15143 19971 27486 30367 27751 26706 35340 40447 37858 34911 39246
12140 39246 45624 47865 50828 59795 61706 68066 75965 81472 92520 108907 120062 141622 155052
$$ packed form
12247A623M57N207j92j570P949N550l5J161m464m104j445k952l930N523k997R51
12231F732L3n424l578J626l846O18O837K531j711O67l296K325M020m200O457n4
12215I737O747P356j677j886q45J383m563o759j053M005K468O411m99q461r58
12200A1406P472l494q337L166O181L195m566n229L656J44J659m145j873O273n987
12185I521k415P434O423K792j276J10n493r263J156L806Q65l978K853o06n945
12170E984N643M430L090P379j551n642n014n415J320R856K322n431p828p170q24
12155A149M959K55N984R02J894M828P515K881k616j045Q634N107k589k947M335
12140C9246O378K241K963Q967J911O360P899N507J1048J6387J1155K1560J3430
$$ plain form
12127 155052 170466 197682 222317 258193 301396 348193 399369 476566 574315 705970 848354
12116 848354 987752 1162742 1437417 1857094 2368351 2796439 3074228 3244795 3420093 3698530
12106 3698530 4145339 4856121 6028304 8052970 10826398 11440264 8161208 4847581 2997800
12097 2997800 2056008 1566205 1306170 1162542 1096306 1087487 1139274 1242576 1361437 1485715
12087 1485715 1669595 1964666 2403726 2871082 3197239 3382762 3517035 3711285 4037419
12078 4037419 4566714 5411108 6862570 9282900 11759137 10679344 6757239 3876664
12070 3876664 2385527 1605037 1167465 901536 730452 619061 546010 501891 457772 422885
12060 422885 397208 368053 345518 309646 256177 204973 167303 145175 134047 128174 122948 117360
$$ packed form
12127A55052J5414K7216K4635L5876M3203M6797N1176P7197R7749J31655J42384
12116H48354J39398J74990K74675M19677N11257M28088K77789J70567J75298K78437
12106C698530M46809P10782J172183K024666K773428O13866l279056l313627j849781
12097B997800r41792m89803k60035j43628o6236q819N1787J03302J18861J24278
12087A485715J83880K95071M39060M67356L26157J85523J34273J94250L26134
12078D037419N29295Q44394J451462K420330K476237j079793l922105k880575
12070C876664j491137p80490m37572k65929j71084j11391p3051m4119m4119l4887
12060D22885k5677k9155k2535l5872n3469n1204l7670k2128j1128n873n226n588
$$ plain form
12048 117360 104153 90289 85413 78393 72549 70325 72297 75132 71700 61219 65794 60524 52250
12035 52250 51770 50650 51250 44899 40110 32551 29499 31775 28641 28302 31870 34036 32291 24406 21141
12020 21141 19773 23761 30292 28851 21004 22012 23941 22333 25891 33777 34425 32401 27195 21545 22319
12005 22319 23784 26321 25615 34218 33237 27447 22334 15965 12952 13355 17130 17372 20810 28390 29911
11990 29911 32797 27662 23732 25781 29898 29538 20041 21854 21940 23083 21492 22994 25898 28002 27674
11975 27674 19023 17954 12878 10398 11130 10685 15917 18986 19563 14464 9735 7091 8154 6956 10851
11960 10851 6134 10850 18840 25623 25439 19652 17292 15823 14873 26401 23839 22086 14391 12213 15619
11945 15619 19453 11189 6892 2895 4140 773 -2320 -152 3635 845 10326 12981 8932 7671
$$ packed form
12048A17360j3207j3864m876p020n844k224J972K835l432j0481M575n270q274
12035E2250m80j120O00o351m789p559l052K276l134l39L568K166j745p885l265
12020B1141j368L988O531j441p847J008J929j608L558P886O48k024n206n650P74
12005B2319J465K537p06Q603r81n790n113o369l013M03L775K42L438P580J521
11990B9911K886n135l930K049M117l60r497J813Q6J143j591J502K904K104l28
11975B7674q651j069n076k480P32m45N232L069N77n099m729k644J063j198L895
11960A0851m717M716P990O783j84n787k360j469r50J1528k562j753p695k178L406
11945A5619L834q264m297l997J245l367l093K168L787k790R481K655m049j261
$$ plain form
11931 7671 8435 11686 11175 3891 -1826 -4407 -9223 -8516 -6355 1824 10282 10231 9589 13536 11206 6876
11915 6876 1317 654 281 4869 1566 163 -772 -129 2134 1796 2608 5254 5048 5635 1998 1176 2894
11898 2894 5510 7773 10011 3788 1394 7715 15782 14707 10505 8803 11854 16613 16196 14718 14251
11883 14251 14246 13184 4371 2373 1641 843 5166 8712 8395 1521 1326 1307 3797 2695 -4307 -8157 -9283
11866 -9283 -2540 10110 11659 6777 2095 3423 7948 10825 5582 2929 4809 609 5531 5655 -4571
11851 -4571 -9560 -6580 -1983 4206 2573 -1249 -3030 1649 6390 8436 6910 4144 657 4372 5375
11836 5375 3533 3125 405 -2164 -9717 -11329 -5144 2351 1135 -4191 -7161 -14888 -11244 -5750 3405
11821 3405 11479 7903 408 6562 6193 4946 -3480 -493 5161 5788 1817 -1581 -1062 761 5508
$$ packed form
11931G671P64L251n11p284n717k581m816P07K161Q179Q458n1o42L947k330m330
11915F876n559o63l73M588l303j403r35O43K263l38Q12K646k06N87l637q22J718
11898B894K616K263K238o223k394O321Q067j075m202j702L051M759m17j478m67
11883A4251nj062q813j998p32p98M323L546l17o874j95j9K490j102p002l850j126
11866i283O743J2650J549m882m682J328M525K877n243k653J880m200M922J24j0226
11851d571m989K980M597O189j633l822j781M679M741K046j526k766l487L715J003
11836E375j842m08k720k569p553j612O185P495j216n326k970p727L644N494R155
11821C405Q074l576p495O154l69j247q426K987N654O27l971l398N19J823M747
$$ plain form
11806 5508 6012 1378 -1550 -3027 -8154 -8136 -6509 -4745 -1462 2538 5510 8040 2514 2290 7017 5975
11790 5975 4197 5240 2586 -4098 -3645 -2122 1239 -5035 -4409 -1629 7113 18007 15078 8419 3944
11775 3944 3388 7415 14354 6153 1107 3870 5194 3349 3426 2949 6846 4243 -485 3623 10366 8786
11759 8786 9904 11205 6023 7236 4789 -4287 -2847 1992 10923 6042 -2529 -3843 1248 3347 2317
11744 2317 -697 -501 -246 4724 7827 4694 -882 1296 2823 312 -1063 2577 1788 3754 3340 4011
11728 4011 1508 -300 2580 -2773 -5317 -2732 -228 4471 8571 9805 7199 2307 2689 -646 -3711
11713 -3711 -2006 1659 5956 6729 7090 9629 9457 5714 2714 -2265 -2422 1631 -1530 3640 8666 11463
11697 11463 72 -6636 -1712 -1276 -1510 -6269 -3103 556 372 -4080 -1673 3498 -1046 -5783 -5073
$$ packed form
11806E508N04m634k928j477n127J8J627J764L283M000K972K530n526k24M727j042
11790E975j778J043k654o684M53J523L361o274O26K780Q742J0894k929o659m475
11775C944n56M027O939q201n046K763J324j845P7m77L897k603m728M108O743j580
11759H786J118J301n182J213k447r076J440M839Q931m881q571j314N091K099j030
11744B317l014J96K55M970L103l133n576K178J527k511j375L640p89J966m14O71
11728D011k503j808K880n353k544K585K504M699M100J234k606m892L82l335l065
11713c711J705L665M297P73L61K539j72l743l000m979j57M053l161N170N026K797
11697A1463j1391o708M924M36k34m759L166L659j84m452K407N171m544m737P10
$$ plain form
11682 -5073 -3663 2694 1086 -2193 -4815 -5828 -2663 3747 -29 -6300 -4634 -1745 1999 4144 3798
11667 3798 -1637 -4251 -4619 -672 2182 762 -1666 839 934 -6852 -14370 -7192 6814 11813 9726
11652 9726 8393 6315 10301 16059 17679 18123 20572 23643 21780 20722 25885 33316 46849 57369
11638 57369 47292 30912 20346 12566 2985 1444 2495 -3305 -5923 659 10449 13076 15718 8268
11624 8268 3006 11736 20138 23735 28341 26213 19515 14568 18910 24228 32520 38922 50582 56491
11610 56491 49107 33791 16447 9431 3934 6141 1000 -6 3582 2160 -748 -801 987 3470
11596 3470 -974 -9986 -13904 -3592 2807 4114 2485 -8860 -13290 -6591 -4266 -7463 -6353 2629
11582 2629 8253 15264 14049 5222 9719 13488 7433 3806 3938 461 327 5255 6622 3306 -456
$$ packed form
11682e073J410O357j608l279k622j013L165O410l776o271J666K889L744K145l46
11667C798n435k614l68L947K854j420k428K505R5p786p518P178J4006M999k087
11652I726j333k078L986N758J620M44K449L071j863j058N163P431J3533J0520
11638E7369j0077j6380j0566p780r581j541J051n800k618O582R790K627K642p450
11624H268n262Q730Q402L597M606k128o698m947M342N318Q292O402J1660N909
11610E6491p384j5316j7344p016n497K207n141j006L588j422k908n3J788K483
11596C470m444r012l918J0312O399J307j629j1345m430O699K325l197J110Q982
11582B629N624P011j215q827M497L769o055l627J32l477j34M928J367l316l762
$$ plain form
11567 -456 1193 1573 4495 5457 4004 2012 4751 1161 5140 4429 -3000 -1434 -1367 114 -2388 -7136
11551 -7136 -2109 2117 5128 10239 3894 -4723 -3565 375 10539 4999 -1177 -1399 1102 2733 4472
11536 4472 5166 4637 5864 7056 8782 7791 7482 5277 -135 2457 2092 6346 4643 1932 8161 5757
11520 5757 1314 -1365 -3276 -262 1735 12320 6586 3166 2643 2442 2403 -3292 -4489 -546 -4910
11505 -4910 -9211 -10931 -8342 90 1127 3267 582 552 1945 123 5286 3033 -1193 1011 2756
11490 2756 12856 17023 12136 8541 -130 -5809 1289 9930 6203 -5694 -7068 -13039 -12920 -6230
11476 -6230 -3130 -2147 2957 969 -1949 -4631 -5594 -5353 -1297 -4737 -4819 -3114 -1819 -1087 -5526 927
11460 927 2286 3753 2284 -2226 -5640 -6645 -1706 -715 -4573 -6397 3160 5235 -1966 -4007 -1646
$$ packed form
11567d56J649L80K922R62j453j992K739l590L979p11p429J566O7J481k502m748
11551g136N027M226L011N111o345q617J158L940J0164n540o176k22K501J631J739
11536D472O94n29J227J192J726r91l09k205n412K592l65M254j703k711O229k404
11520E757m443k679j911L014J997J0585n734l420n23k01l9n695j197L943m364
11505d910m301j720K589Q432J037K140k685l0J393j822N163k253m226K204J745
11490B756J0100M167m887l595q671n679P098Q641l727j1897j374n971J19O690
11476f230L100R83N104j988k918k682r63K41M056l440q2J705J295P32m439O453
11460I27J359J467j469m510l414j005M939R91l858j824R557K075p201k041K361
$$ plain form
11445 -1646 -1889 -3882 -5880 -3868 -7886 -9903 -7533 -4122 -5305 -879 4155 6958 3173 2505 -1064
11430 -1064 -2786 1220 2769 3320 3777 2262 1345 -4631 -12993 -14966 -6939 -1144 716 414 -2648 -8539
11414 -8539 -8543 -6420 563 -1561 -4684 2488 6750 11060 12435 9959 -1273 -5673 -3345 4065 15606
11399 15606 5678 2558 4450 8011 10665 5843 7118 9496 8787 10355 14085 12398 6648 5736 4785
11384 4785 7545 8117 4315 -468 -622 -451 -3100 -3938 -2276 -2502 7205 4996 -4255 -5991 -2708 -2822
11368 -2822 -5098 -7842 -6743 -4633 -3149 -8307 -8885 -414 7672 2881 -2286 -6636 -9133 -11133 -9606
11353 -9606 -7609 -3497 -996 -1355 1540 -390 3222 2918 -2601 -4484 1497 5924 8657 14717 9298
11338 9298 5992 10065 11544 10350 12276 7547 3888 2184 7689 7291 7897 6662 3518 -1623 462
$$ packed form
11445a646k43j993j998K012m018k017K370L411j183M426N034K803l785o68l569
11430a064j722M006J549N51M57j515r17n976q362j973Q027N795J860l02l062n891
11414h539mK123O983k124l123P172M262M310J375k476j1232m400K328P410J1541
11399A5606r928l120J892L561K654m822J275K378p09J568L730j687n750r12r51
11384D785K760N72l802m783j54J71k649q38J662k26R707k209r251j736L283j14
11368b822k276k744J099K110J484n158n78Q471Q086m791n167m350k497k000J527
11353i606J997M112K501l59K895j930L612l04n519j883N981M427K733O060n419
11338I298l306M073J479j194J926m729l659j704N505l98O06j235l144n141K085
$$ plain form
11323 462 -2592 856 -5157 -9119 -5978 -5747 -9488 -12004 -5420 1484 6697 13345 14049 9149 5631
11308 5631 3889 2993 7100 10404 8125 5440 -4415 -2333 -4257 -3071 5812 4156 6082 10538 2362
11293 2362 -10127 -18001 -19848 -18927 -7094 -6002 -4707 -3276 -3931 -1926 -6299 -3283 -3213 -5117 -1717
11278 -1717 5639 843 -3954 -1842 621 -1652 -5306 -11440 -15035 -16426 -19130 -16938 -9431 -7592 -9673
11263 -9673 -4268 -2774 -2588 2790 5167 -1318 -6306 -8171 -10312 -8401 -8184 -6579 -7919 -9869 -4614
11248 -4614 5585 5748 5116 628 -1186 3585 3191 -1833 -1891 4891 -241 -1909 -1815 -4328 -6411 -7892
11232 -7892 -7896 -5061 -3633 -3222 143 -1800 -5786 -5385 -13047 -16222 -13286 -6284 3110 -739 -6074 -8333
11216 -8333 -5631 1600 2945 1231 5376 2613 -5050 -3405 5109 6675 6658 4753 -1387 443 2024
$$ packed form
11323D62l054L448o013l962L141K31l741k516O584O904N213O648P04m900l518
11308E631j742q96M107L304k279k685r855K082j924J186Q883j656J926M456q176
11293B362j2489p874j847R21J1833J092J295J431o55K005m373L016P0j904L400
11278a717P356m796m797K112K463k273l654o134l595j391k704K192P507J839k081
11263i673N405J494J86N378K377o485m988j865k141J911K17J605j340j950N255
11248d614J0199J63o32m488j814M771l94n024n8O782n132j668R4k513k083j481
11232g892mK835J428M11L365j943l986M01p662l175K936P002R394l849n335k259
11216h333K702P231J345j714M145k763p663J645Q514J566j7j905o140J830J581
$$ plain form
11201 2024 -337 -4282 -9049 -3551 -1124 -4707 390 3346 4258 -843 -3624 -5560 -5377 -5128 -13870
11186 -13870 -15204 -5883 813 251 -4020 -7352 -939 4642 4837 -18 -10934 -12519 -8013 -13928 -13897
11171 -13897 -9098 -6777 -13895 -17174 -6927 -2900 -6246 -8281 -5120 -1888 2698 875 -1635 166
11157 166 -1764 -4515 -5126 -9134 -12439 -11683 -2222 -582 -3741 -1457 -2147 -7945 -5346 -296 -2296 -3574
11141 -3574 -1593 -1350 1121 3226 -893 -8694 -9213 -7634 -5128 -4893 -3959 -4875 -7633 -8013 -9059 -7370
11125 -7370 -7186 -3963 1866 1975 -4001 -13464 -10318 -5571 -5418 -2143 5239 6834 5800 1468 -1959
11110 -1959 3705 5371 2096 3039 3574 3738 8553 7136 8228 9397 6316 1860 -2098 -1995 -2232 4081
11094 4081 9684 7441 2471 -97 -2629 -1450 -3584 -9050 -6928 -3595 -1142 2199 5858 3341 4432
$$ packed form
11201B024k361l945m767N498K427l583N097K956R12n101k781j936J83K49q742
11186a3870j334R321O696n62m271l332O413N581J95m855j0916j585M506n915L1
11171a3897M799K321p118l279J0247M027l346k035L161L232M586j823k510J801
11157A66j930k751o11m008l305P56R461J640l159K284o90n798K599N050k000j278
11141c574J981K43K471K105m119p801n19J579K506K35R34r16k758l80j046J689
11125g370J84L223N829J09n976r463L146M747J53L275P382J595j034m332l427
11110a959N664J666l275R43N35J64M815j417J092J169l081m456l958J03k37O313
11094D081N603k243m970k568k532J179k134n466K122L333K453L341L659k517J091
$$ plain form
11079 4432 5024 3180 -4782 -2486 -2337 -6520 -3277 -2173 -7902 -4513 2541 4924 2829 -3408 2157
11064 2157 2355 -4344 -6086 -3039 115 -2439 -6740 -1720 4182 4567 1190 -2943 150 2370 -389
11049 -389 3703 8895 8876 15033 12984 7599 7791 11311 10055 5457 3979 -706 -2768 1864 2665 -3853
11033 -3853 -4082 -1903 -5475 -9851 -11913 -12053 -10434 -11371 -13826 -7602 -8055 -8755 -2867 687 -2018 -3516
11017 -3516 -6884 -8149 -10820 -7126 -5702 -8466 498 7445 5667 -2716 1406 -6353 -9042 -11512 -8756
11002 -8756 -6666 -5764 3110 2738 1544 -602 -2394 -2134 -418 4142 1129 2124 2778 -1513 -2082 528
10986 528 1120 9946 13199 12314 5374 -575 -5387 -10932 -10124 -14575 -15723 -11351 -2947 -3750 -8171 -8136
10970 -8136 -9458 -8768 -7912 -9298 -3411 2385 4953 861 -276 -3128 -1427 3092 8097 6457 -5460
$$ packed form
11079D432N92j844p962K296J49m183L243J104n729L389P054K383k095o237N565
11064B157J98o699j742L047L154k554m301N020N902L85l377m133L093K220k759
11049c89M092N192j9O157k049n385J92L520j256m598j478m685k062M632Q01o518
11033c853k29K179l572m376k062j40J619r37k455O224m53p00N888L554k705j498
11017c516l368j265k671L694J424k764Q964O947j778q383M122p759k689k470K756
11002h756K090R02Q874l72j194k146j792K60J716M560l013R95O54m291n69K610
10986E28N92Q826L253q85o940n949m812n545Q08m451j148M372Q404q03m421L5
10970h136j322O90Q56j386N887N796K568m092j137k852J701M519N005j640j1917
$$ plain form
10955 -5460 -17532 -17010 -12199 -6218 -4810 -2383 -4315 -4250 -1722 -313 3782 5568 3395 -1045 -8748
10940 -8748 -14422 -10492 -9644 -14964 -14929 -9194 -1728 2845 1729 -8416 -5313 -4166 -8932 -11865 -8334
10925 -8334 -6692 -5802 -3716 4210 5661 4544 1320 -5617 -580 4153 731 -1912 -5298 -5954 -5810
10910 -5810 -1481 -3275 -1565 6418 8070 8429 7037 2087 -4200 -4718 -4174 -4004 -5102 -5999 -9129 -9543
10894 -9543 -3862 -2626 -6900 -9743 -7104 -4691 -4952 675 -2163 -1281 -1356 -2421 -469 549 7348 4530
10878 4530 3213 1952 1361 -8131 -13769 -9413 -7308 -3240 -1422 -6695 -13311 -15843 -11925 -5893 -9061
10863 -9061 -4988 -5136 -4373 -2217 -1184 -2222 -4962 -7686 -10309 -8577 2150 7275 4390 6157 5798
10848 5798 4266 5346 13699 12014 4987 1997 -4346 -6834 -6504 -2928 -5828 -3483 1031 5069 988
$$ packed form
10955e460j2072N22M811N981J408K427j932O5K528J409M095J786k173m440p703
10940h748n674L930Q48n320L5N735P466M573j116j0145L103J147m766k933L531
10925h334J642Q90K086P926J451j117l224o937N037M733l422k643l386o56J44
10910e810M329j794J710P983J652L59j392m950o287n18N44J70j098q97l130m14
10894i543N681J236m274k843K639K413k61N627k838Q82p5j065J952J018O799k818
10878D530j317j261n91r492n638M356K105M068J818n273o616k532L918O032l168
10863i061M073j48P63K156J033j038k740k724k623J732J0727N125k885J767l59
10848E798j532J080Q353j685p027k990o343k488L30L576k900K345M514M038m081
$$ plain form
10833 988 600 8473 11415 4875 436 -3597 -1099 -544 -2202 -1797 4055 4496 6686 7847 -6703 -18718
10817 -18718 -16636 -13155 -101 1764 -5031 -4715 -8002 -7783 -4113 -7915 -6916 -7911 -12543 -13508 -12865 -5224
10801 -5224 877 -3850 -10590 -10403 -10005 -9189 -2930 -2980 -6267 -13385 -12953 -4045 -6186 -6498 117 -1642
10785 -1642 260 -2038 -5640 -10214 -12545 -8970 -1298 1694 -204 -5084 -6685 -5238 -2574 2084 2186
10770 2186 9825 10094 2144 -3390 -2556 -441 -5561 -9416 -6831 -3750 -8523 -10479 -1740 -1745 -5012 -8133
10754 -8133 -9027 -6764 -9992 -6723 -11602 -15284 -16298 -8326 -4046 -3696 -3431 -10449 -10073 -6020 -7645 -22397
10738 -22397 -21413 -14731 -10306 -5902 1753 4754 1288 1464 1580 -1587 -9095 -8483 -7713 -7835 -7443 -7700
10722 -7700 -6133 -3178 -3338 -10004 -21802 -23103 -13551 -2208 4267 5047 365 -11159 -11576 -10931 -3631
$$ packed form
10833I88l88P873K942o540m439m033K498N55j658M05N852M41K190J161j4550j2015
10817a8718K082L481J3054J865o795L16l287K19L670l802R99r95m632r65O43P641
10801e224O101m727o740J87L98Q16O259n0l287p118M32Q908k141l12O615j759
10785a642J902k298l602m574k331L575P672K992j898m880j601J447K664M658J02
10770B186P639K69p950n534Q34K115n120l855K585L081m773j956Q739nl267l121
10754h133q94K263l228L269m879l682j014P972M280L50K65p018L76M053j625j4752
10738b2397R84O682M425M404P655L001l466J76J16l167p508O12P70j22L92k57
10722g700J567K955j60o666j1798j301R552J1343O475P80m682j1524m17O45P300
$$ plain form
10707 -3631 -6617 -9611 -10959 -9846 -15715 -14064 -12470 -7040 -5105 -8934 -18444 -23507 -20078 -12222 -8986
10692 -8986 -11817 -11962 -13156 -6263 -1477 -1500 -7243 -9060 -3338 412 -4011 -12847 -16180 -14765 -11114
10677 -11114 -9171 -7769 -6998 -5163 -1688 1342 1855 -1228 -2219 -4578 -2193 2999 -413 -7138 -8363
10662 -8363 -1171 7867 13630 10427 1685 -6655 -7620 -2125 3519 1868 -2180 -1906 -8396 -7390 -83
10647 -83 2672 2282 -2633 -7566 -5400 -1422 -3397 -6345 -6962 -922 3189 5193 3289 -1813 -5942 -8099
10631 -8099 -7619 -5160 -2031 2490 155 614 -3779 -3361 -2558 -7559 -10370 -12524 -14552 -10207 -7604 -1376
10615 -1376 -5723 -3830 -3248 1295 2060 2745 -2336 440 -912 -2626 -1199 -923 -8389 -8211 -6458 -5863
10599 -5863 -3978 139 3047 -3366 -3618 -1701 -3939 -2444 -4309 2894 6742 6638 4800 -5656 -3990
$$ packed form
10707c631k986k994j348J113n869J651J594N430J935l829r510n063L429P856L236
10692h986k831j45j194O893M786k3n743j817N722L750m423q836l333J415L651
10677a1114J943J402P71J835L475L030N13l083r91k359K385N192l412o725j225
10662h363P192R038N763l203q742q340r65N495N644j651m048K74o490J006P307
10647h3K755l90m915m933K166L978j975k948o17O040M111K004j904n102m129k157
10631h099M80K459L129M521k335M59m393M18Q03n001k811k154k028M345K603O228
10615a376m347J893N82M543P65O85n081K776j352j714J427K76p466J78J753N95
10599e863J885M117K908o413k52J917k238J495j865P203L848j04j838j0456J666
$$ plain form
10584 -3990 3529 1095 119 557 1739 -1163 -7175 -4467 -1528 -3622 -1604 -2099 2717 5382 -1543
10569 -1543 -9750 -2408 2076 -3103 -5167 -11647 -15090 -11070 -2836 1568 2985 3793 1416 1521 -920
10554 -920 191 4 -840 -4373 -4734 1306 1394 -371 -10398 -12846 -10550 -7923 -4037 3006 7873 946
10538 946 -9137 -10310 -6850 -4879 4858 9832 14367 14545 12315 8746 9163 2771 1638 2582 -7257
10523 -7257 -9021 -1525 330 -5385 -8500 -8104 -4280 -5572 -11215 -8302 -4681 -3698 -3837 1672 -3435
10508 -3435 -8215 -9949 -14675 -6098 -3059 -332 -3310 -10271 -19302 -15675 -12297 -5356 -7411 -1769 1616
10493 1616 -458 -1470 -5074 -438 -3530 -4762 -7889 -8042 -10387 -8239 434 -1913 -6593 -5720 -5581
10478 -5581 -6734 -7404 -11864 -9263 -9565 -12600 -9745 -3596 -954 -662 5592 5460 -3192 -6916 -1786 3260
$$ packed form
10584c990P519k434r76M38J182k902o012K708K939k094K018m95M816K665o925
10569a543q207P342M484n179k064o480l443M020Q234M404J417Q08k377J05k441
10554i20J111j87q44l533l61O040Q8j765j0027k448K296K627L886P043M867o927
10538I46j0083j173L460J971R737M974M535J78k230l569M17o392j133R44r839
10523g257j764P496J855n715l115L96L824j292n643K913L621R83j39N509n107
10508c435m780j734m726Q577L039K727k978o961r031L627L378O941k055N642L385
10493A616k074j012l604M636l092j232l127j53k345K148Q673k347m680Q73J39
10478e581j153o70m460K601l02l035K855O149K642K92O254j32q652l724N130N046
$$ plain form
10462 3260 7886 5023 3350 -3005 -8339 -7340 -4260 -2413 -4306 1387 4074 244 -3455 1305 4794
10447 4794 -1580 -8867 -8717 -6594 -12080 -13108 -16734 -18505 -14983 -16976 -13956 -7782 -6953 -8900 -4651
10432 -4651 -2467 -804 -2498 -4839 -3476 173 -921 -435 6705 6398 6886 9683 7320 4503 4158 5321
10416 5321 1503 5302 8752 5865 1603 2651 6096 7827 8159 9119 10378 10475 9381 5673 1905 2852
10400 2852 6450 6297 5574 3808 1774 -1132 -8076 -5575 -2494 -1709 3359 7471 3423 -871 -2771
10385 -2771 3913 9362 10727 11374 15970 11855 8545 3830 4466 8640 7597 5476 -2531 -2098 -1330 -2522
10369 -2522 -2767 -2761 2230 2633 6489 12776 19834 22451 17488 16567 12844 9142 -2860 -5164 90 -2071
10353 -2071 -1025 -1770 1482 233 -3071 -6801 -5004 -1926 4947 10543 3447 -584 8276 8973 8011
$$ packed form
10462C260M626k863j673o355n334R99L080J847j893N693K687l830l699M760L489
10447D794o374p287J50K123n486j028l626j771L522j993L020O174Q29j947M249
10432d651K184J663j694k341J363L649j094M86P140l07M88K797k363k817l45J163
10416E321l818L799L450k887m262J048L445J731L32R60J259R7j094l708l768R47
10400B852L598j53p23j766k034k906o944K501L081P85N068M112m048m294j900
10385b771O684N449J365O47M596m115l310m715O36M174j043k121q007M33P68j192
10369b522k45OM991M03L856O287P058K617m963r21l723l702j2002k304N254k161
10353b071J046p45L252j249l304l730J797L078O873N596p096m031Q860O97r62
$$ plain form
10338 8011 5240 6748 8174 8963 17492 19882 15861 9091 6332 -1286 -7118 -4137 -3728 -2665 -688
10323 -688 -5085 -7902 -7006 -4240 3381 3675 591 -1563 -2994 -2006 2306 10215 8167 5201 2565 2190
10307 2190 2051 -1378 -14609 -11576 -6045 -10302 -5834 -6368 -8361 -14998 -7269 2187 5325 1754 5895
10292 5895 9566 7882 4943 -979 -1762 -2842 1429 9039 8744 3710 5728 4858 -2551 -6837 -7399 -7122
10276 -7122 -6201 -6768 -7840 -3139 -3259 -1593 -3597 -4789 -6951 1541 -1994 -8193 -8201 -3531 3615 5577
10260 5577 6836 3412 2870 -41 -2940 -3091 4866 613 -4824 -13974 -9551 -5366 -1273 890 -8345
10245 -8345 -6351 -6702 -11711 -8244 -833 702 -5703 -12094 -8482 -3118 -5409 -10489 -8978 1965 6082
10230 6082 5422 415 1030 155 5858 9104 9086 1491 -7567 -3177 -966 -2200 -1137 -3799 -3168 2416
$$ packed form
10338H011k771J508J426P89Q529K390m021o770k759p618n832K981M09J063J977
10323f88m397k817Q96K766P621K94l084k154j431R88M312P909k048k966k636l75
10307B190j39l429j3231L033N531m257M468n34j993o637P729R456L138l571M141
10292E895L671j684k939n922p83j080M271P610k95n034K018q70p409m286n62K77
10276g122R21n67j072M701j20J666k004j192k162Q492l535o199qM670P146J962
10260E577J259l424n42k911k899j51P957m253n437r150M423M185M093K163r235
10245h345J994l51n009L467P411J535o405o391L612N364k291n080J511J0943M117
10230F082o60n007O15q75N703L246j8p595r058M390K211j234J063k662O31N584
$$ plain form
10214 2416 2457 -5475 -7018 -2253 -19 -2209 5160 3717 -2255 -3572 -9313 -8178 -305 -962 -23 -1821
10198 -1821 -9741 -5916 -2554 -531 -4555 -10674 -11039 -5022 763 3506 6833 9491 1475 400 976
10183 976 -782 -5725 -7434 -9287 -7340 -8719 -8345 -2882 -5301 -10437 -12444 -9096 -3815 -2060 -5912
10168 -5912 547 5130 1469 -2511 2815 6070 11925 10798 4101 -1715 -28 2008 2656 5460 2189
10153 2189 3798 4314 5913 11287 11790 9629 18171 15997 17667 18530 23716 27558 29284 28110 32781
10138 32781 45233 49111 49295 54784 63654 66614 72540 88548 104127 109252 102225 85632 76765 66727
10124 66727 55816 49258 46295 43317 38649 30809 27325 29708 37164 39481 42443 47114 49847 56821
10110 56821 66085 79761 95998 105852 115197 121059 129092 144242 158192 166490 170916 175598 175275 185836
$$ packed form
10214B416M1p932j543M765K234k190P369j443n972j317n741J135P873o57R39j798
10198a821p920L825L362K023m024o119l65O017N785K743L327K658q016j075N76
10183I76j758m943j709j853J947j379L74N463k419n136k007L348N281J755l852
10168e912O459M583l661l980N326L255N855j127o697n816J687K036O48K804l271
10153B189J609N16J599N374N03k161Q542k174J670Q63N186L842J726j174M671
10138C2781J2452L878J84N489Q870K960N926J6008J5579N125p027j6593q867j0038
10124F6727j0911o558k963k978m668p840l484K383P456K317K962M671K733O974
10110E6821R264J3676J6237R854R345N862Q033J5150J3950Q298M426M682l23J0561
$$ plain form
10096 185836 210335 240126 263592 282099 305596 330164 355690 396789 456290 524264 599076
10085 599076 659988 661072 589959 475201 370995 300218 250468 213108 184796 176158 175354 172885
10073 172885 182500 191034 207325 229506 245854 264250 297047 329153 359959 386934 417879 463070
10061 463070 516372 580032 651890 732410 788025 800581 763191 703988 670723 673195 691876 737665
10049 737665 797883 850434 904576 961878 1048335 1160164 1307640 1484277 1657503 1758034
10039 1758034 1693460 1439234 1122961 859239 678480 565750 495627 456587 430430 419719
10029 419719 422329 437206 465704 504117 550460 612054 680980 754603 827886 898515 972934 1056400
10017 1056400 1158152 1289893 1457757 1658103 1845332 1927765 1832601 1604424 1376484 1232930
$$ packed form
10096A85836K4499K9791K3466J8507K3497K4568K5526M1099N9501O7974P4812
10085E99076O0912J084p1113j14758j04206p0777m9750l7360k8312q638q04k469
10073A72885R615Q534J6291K2181J6348J8396L2797L2106L0806K6975L0945M5191
10061D63070N3302O3660P1858Q0520N5615J2556l7390n9203l3265K472J8681M5789
10049G37665O0218N2551N4142N7302Q6457J11829J47476J76637J73226J00531
10039A758034o4574k54226l16273k63722j80759j12730p0123l9040k6157j0711
10029D19719K610J4877K8498L8413M6343O1594O8926P3623P3283P0629P4419Q3466
10017A056400J01752J31741J67864K00346J87229Q2433r5164k28177k27940j43554
$$ plain form
10007 1232930 1169056 1172764 1210514 1258790 1314749 1385041 1472893 1599416 1771340 1995156 2253915
9996 2253915 2463765 2494742 2254981 1815424 1392614 1083456 874054 743945 664375 617898
9986 617898 597750 592940 608339 629798 670484 727305 795977 885194 984834 1083027 1172221 1258909
9974 1258909 1350996 1475325 1636653 1842300 2095205 2350176 2520004 2495198 2208651 1800502
9964 1800502 1475174 1282303 1179683 1142328 1144857 1167943 1195995 1233099 1305416 1413399 1550145
9953 1550145 1728356 1901937 1982047 1883466 1596878 1247113 959125 769051 642566 562787
9943 562787 516518 486615 468246 475951 493594 526130 563329 606482 661114 733738 807267 875002
9931 875002 944491 1009215 1085230 1189264 1324230 1493816 1691728 1866628 1925473 1767509
$$ packed form
10007A232930o3874L708L7750M8276N5959P0292Q7852J26523J71924K23816K58759
9996B253915K09850L0977k39761m39557m22810l09158k09402j30109p9570m6477
9986F17898k0148m810J5399K1459M0686N6821O8672Q9217R9640R8193Q9194Q6688
9974A258909R2087J24329J61328K05647K52905K54971J69828k4806k86547m08149
9964A800502l25328j92871j02620l7355K529K3086K8052L7104P2317J07983J36746
9953A550145J78211J73581Q0110r8581k86588l49765k87988j90074j26485p9779
9943E62787m6269k9903j8369P705J7643L2536L7199M3153N4632P2624P3529O7735
9931H75002O9489O4724P6015J04034J34966J69586J97912J74900N8845j57964
$$ plain form
9921 1767509 1451138 1137851 910994 773163 691320 647915 626330 614841 617021 626416 649856
9910 649856 689995 749285 816926 863397 850765 761942 626619 500856 400316 329035 290758
9899 290758 260713 235046 233885 232720 230635 238168 259806 278500 299057 331771 365979 395675
9887 395675 412332 423121 446088 482479 526404 590905 669380 739227 775618 742625 625698
9876 625698 489062 380465 305405 254829 224574 211637 190789 176811 170214 169762 173005 172837
9864 172837 181762 189408 185770 164986 136671 117691 101061 85074 78454 70175 64807 66118 68325
9851 68325 65349 58746 58356 71602 79844 80866 78459 86645 89995 90394 91415 95353 101341 113780 123528
9836 123528 137597 150145 146900 132606 102890 80967 67738 56775 44301 35416 35844 32726 29079
$$ packed form
9921A767509l16371l13287k26857j37831q1843m3405k1585j1489K180R395K3440
9910F49856M0139N9290O7641M6471j2632q8823j35323j25763j00540p1281l8277
9899B90758l0045k5667j161j165k085P533K1638J8694K0557L2714L4208K9696
9887C95675J6657J0789K2967L6391M3925O4501P8475O9847L6391l2993j16927
9876F25698j36636j08597p5060n0576l0255j2937k0848j3978o597m52L243j68
9864A72837Q925P646l638k0784k8315j8980j6630j5987o620q279n368J311K207
9851F8325k976o603l90J3246Q242J022k407Q186L350L99J021L938N988J2439R748
9836A23528J4069J2548l245j4294k9716k1923j3229j0963j2474q885M28l118l647
$$ plain form
9823 29079 28813 33758 38560 35684 26749 29236 21922 15136 14790 12619 16579 19859 16625 18014 23129
9808 23129 14527 8729 14466 18289 15022 7580 3167 4569 17968 18883 13424 12838 12874 12159 18328 21762
9792 21762 16033 13211 9206 13421 14127 8735 9222 9392 9191 7951 3411 1357 3742 6613 3035 -498
9776 -498 127 -1257 -2205 -3236 -1007 4053 12410 12246 4093 9610 11352 -220 -4810 5064 2442 1718
9760 1718 8826 11986 7544 -37 -1460 1081 8439 11992 11043 6059 7910 6116 6741 4064 -4388
9745 -4388 -8922 -5001 -5276 -7192 -5862 5205 2967 2239 4197 1184 2831 1158 -3317 -4473 -3794
9730 -3794 -2972 2689 5765 3297 594 6466 12969 14645 12694 7561 767 -4831 -5758 -9371 -4882
9715 -4882 4284 5207 6562 6194 11110 9795 1304 -3854 -8084 -4847 -233 -8633 -10046 -7912 -12205
$$ packed form
9823B9079k66M945M802k876q935K487p314o786l46k171L960L280l234J389N115
9808B3129q602n798N737L823l267p442m413J402J3399R15n459n86L6p15O169L434
9792B1762n729k822m005M215P06n392M87J70k01j240m540k054K385K871l578l533
9776d98O25j384r48j031K229N060Q357j64q153N517J742j1572m590R874k622p24
9760A718P108L160m442p581j423K541P358L553r49m984J851j794O25k677q452
9745d388m534L921k75j916J330J1067k238p28J958l013J647j673m475j156O79
9730c794Q22N661L076k468k703N872O503J676j951n133o794n598r27l613M489
9715d882R166R23J355l68M916j315q491n158m230L237M614q400j413K134m293
$$ plain form
9700 -12205 -18135 -15961 -8826 -3236 -315 328 -1557 -1536 -240 151 -156 5916 8731 5900 6360 -679
9684 -679 287 919 -818 1631 5961 12682 20759 20350 13221 2643 4793 9891 12529 10873 5248 2559
9668 2559 1024 364 1287 2516 6196 5463 2909 119 531 -6595 -12033 -9570 -7256 6 2617 5220
9652 5220 2535 3265 7685 6483 5441 2566 646 7100 5421 8535 11163 5636 -146 -4358 -4816
9637 -4816 1075 3933 -3003 -10108 -9077 -1374 2845 3973 4014 8903 11091 6942 6829 8313 6448 2982
9621 2982 2334 3990 9302 4675 -4328 -6273 711 4543 485 -3005 -231 4288 10521 10432 12607 5557
9605 5557 881 448 -3933 -8944 -5084 1934 3584 6619 12277 21328 18659 12700 6041 4976 11031
9590 11031 11319 5594 -904 -3217 -2146 1681 7080 3473 -5517 -6149 -2278 -2049 -2664 -2505 -1990 -425
$$ packed form
9700a2205n930K174P135N590K921O43j885K1J296L91l07O072K815k831M60p039
9684f79R66O32j737K449M330O721Q077m09p129j0578K150N098K638j656n625k689
9668B559j535o60R23J229L680p33k554k790M12p126n438K463K314P262K611K603
9652E220k685P30M420j202j042k875j920O454j679L114K628n527n782m212m58
9637d816N891K858o936p105J031P703M219J128M1M889K188m149j13J484j865l466
9621B982o48J656N312m627r003j945O984L832m058l490K774M519O233q9K175p050
9605E557m676m33m381n011L860P018J650L035N658R051k669n959o659j065O055
9590A1031K88n725o498k313J071L827N399l607q990o32L871K29o15J59N15J565
$$ plain form
9574 -425 -600 -191 4115 5470 -3621 -2949 1370 247 -3657 -3508 5354 6888 2721 3171 3664 237 2103
9557 2103 7004 11609 13606 10276 7461 9549 11444 13674 9548 5726 1863 -4557 -6701 -9273 -7745
9542 -7745 -236 -2772 -2053 4069 9365 5696 3084 2777 1873 1890 5739 1160 -2190 -2583 -1598 -6461 -6663
9525 -6663 -6523 -6077 -6336 -6004 -5797 -5878 -6056 -3794 -1746 -508 -7418 -9672 -9545 -2412 -2365 -2755 -2539 1182
9507 1182 6693 7871 -5091 -8782 -1700 1497 6643 2144 -2374 -1159 -1446 -4311 -7773 -14612 -11612
9492 -11612 -3188 142 2684 110 -1343 -2768 2446 393 2710 6142 4280 -8167 -10274 -4237
9478 -4237 -7042 -7259 -4166 -8570 -5508 -1246 4293 2398 -5284 -9805 -11428 -14978 -9833 -6073 -2765
9463 -2765 2947 1977 1972 7016 2012 -4188 -4957 -1332 6188 6837 3059 -459 217 2920 -164 -6087 -10627
$$ packed form
9574d25j75M09M306J355r091O72M319j123l904J49Q862J534m167M50M93l427J866
9557B103M901M605J997l330k815K088J895K230m126l822l863o420k144k572J528
9542g745P509k536P19O122N296l669k612l07r04J7L849m579l350l93R85m863k02
9525f663J40M46k59L32K07q1j78K262K048J238o910k254J27P133M7l90K16L721
9507A182N511J178j2962l691P082L197N146m499m518J215k87k865l462o839L000
9492a1612Q424L330K542k574j453j425N214k053K317L432j862j2447k107O037
9478d237k805k17L093m404L062M262N539j895p682m521j623l550N145L760L308
9463b765N712r70nN044n004o200p69L625P520O49l778l518O76K703l084n923m540
$$ plain form
9446 -10627 -8128 -10607 -13462 -2880 4806 8384 10328 6046 1707 2186 1407 -1 -7344 -7748 -7327
9431 -7327 -8316 -9105 -3744 -62 -3442 -106 5503 1917 -6166 -11800 -4728 -1457 -2285 3218 4001 -1240
9415 -1240 -1857 2528 -2535 405 8195 6286 1923 -4862 -2545 -2332 -6772 -1331 1328 -1925 -5262
9400 -5262 -9303 -10662 -7622 -2946 -4125 -6804 -3384 -1449 1830 8002 11243 6102 3207 -564 -3169
9385 -3169 1785 -3629 -2939 -6960 -6054 59 1163 2959 -97 3320 -1702 -1683 270 -366 -1249 -3840
9369 -3840 -7164 -6363 -8400 -5128 589 2769 1508 1177 -2044 -1385 -7897 -8986 -8222 -7422 1590 112
9353 112 -4386 -1447 -3147 1076 5069 -1449 -5023 -9115 -7290 -10315 -7822 2648 5605 -450 -448 -5912
9337 -5912 -3953 -4914 -6178 2606 9497 9483 3766 74 -287 -2659 -3789 -3869 -5711 -9353 -7250 -8651
$$ packed form
9446a0627K499k479k855J0582P686L578J944m282m339M79p79j408p343m04M21
9431g327r89p89N361L682l380L336N609l586q083n634P072L271q28N503P83n241
9415a240o17M385n063K940P790j909m363o785K317K13m440N441K659l253l337
9400e262m041j359L040M676j179k679L420J935L279O172L241n141k895l771k605
9385c169M954n414O90m021R06O113J104J796l056L417n022J9J953o36q83k591
9369c840l324Q01k037L272N717K180j261l31l221O59o512j089P64Q00R012j478
9353A12m498K939j700M223L993o518l574m092J825l025K493J0470K957o055Kn464
9337e912J959r61j264Q784O891j4n717l692l61k372j130q0j842l642K103j401
$$ plain form
9321 -8651 -10384 -10658 -6692 -3517 -3984 -3653 -5498 -13027 -10672 -7998 -2887 3564 1305 -4985 -10368 -8189
9305 -8189 -3533 -6341 -8588 -8195 -8445 -5359 -6161 -10572 -6296 -192 -3227 -2971 1875 1771 -2499 -5463
9289 -5463 -1335 -4218 -11275 -12995 -8396 -9085 -6373 -6306 -6594 -6550 -10197 -6972 666 1965 2226 5196 2285
9272 2285 3501 -1805 -5437 -10667 -17124 -15349 -4633 2785 2765 -6883 -8100 -5456 -3164 -4574 -7219
9257 -7219 -14292 -14345 -11942 -13462 -15805 -14669 -4799 2904 2562 2877 -795 -3493 -5696 -5930 -1695 -402
9241 -402 251 -4241 -12121 -18038 -10801 1851 2859 -3404 -7265 -4511 -6569 -9322 -9375 -9086 -10241 -4633
9225 -4633 -7698 -6262 -6503 -6318 29 7760 10793 16914 15178 4582 2887 2761 -1373 3544 5560
9210 5560 -4560 -13186 -11071 -8163 -4506 144 6972 3912 -3911 -4855 1554 587 5062 7346 5023
$$ packed form
9321h651j733k74L966L175m67L31j845p529K355K674N111O451k259o290n383K179
9305h189M656k808k247L93k50L086q02m411M276O104l035K56M846j04m270k964
9289e463M128k883p057j720M599o89K712O7k88M4l647L225P638J299K61K970k911
9272B285J216n306l632n230o457J775J0716P418k0r648j217K644K292j410k645
9257g219p073n3K403j520k343J136R870P703l42L15l672k698k203k34M235J293
9241d02O53m492p880n917P237J2652J008o263l861K754k058k753n3K89j155N608
9225d633l065J436k41J85O347P731L033O121j736j0596j695j26m134M917K016
9210E560j0120q626K115K908L657M650O828l060p823r44O409r67M475K284k323
$$ plain form
9195 5023 1205 -413 -2574 -8080 -12841 -9828 -1055 1914 -2751 -8089 -3506 4515 5311 1797 1034
9180 1034 -2825 -280 2467 1139 -4248 -5492 -4914 -1955 -6339 -10628 -3428 2165 2224 3814 3477 -2422
9164 -2422 -7227 -10125 -7121 -1747 -5069 -7167 -10165 -6344 -6017 -6516 -2300 -1696 -1731 -5195 -5753 -4790 -12216
9147 -12216 -10942 -10416 -12326 -7177 -3388 -2788 675 -5573 -8241 -10357 -9737 -4406 2585 1882 6051 8945
9131 8945 3975 -2295 -5651 -3451 -4906 -9237 -1365 420 -36 5741 8149 4287 -416 8190 5100
9116 5100 5194 11507 9233 115 -859 5567 5651 10774 13627 11124 3118 4317 -2530 -6396 -7037 40
9100 40 5674 8594 9685 4635 -4210 -3084 4446 5432 -4747 181 1780 7894 15994 9055 1600
9085 1600 -4150 -5042 -8337 -15556 -13157 -9762 -8718 -6677 -4509 -3815 -1692 -8368 -9946 -7055 892
$$ packed form
9195E023l818j618k161n506m761L013Q773K969m665n338M583Q021P96l514p63
9180A034l859K545K747j328n387j244N78K959m384m289P200N593N9J590l37n899
9164b422m805k898L004N374l322k098k998L821L27m99M216O04l5l464n58R63p426
9147a2216J274N26j910N149L789O00L463o248k668k116O20N331O991p03M169K894
9131H945m970o270l356K200j455m331P872J785m56N777K408l862m703Q606l090
9116E100R4O313k274r118r74O426Q4N123K853k503q006J199o847l866o41P077
9100D0N634K920J091n050q845J126P530R86j0179M928J599O114Q100o939p455
9085A600n750q92l295p219K399L395J044K041K168O94K123o676j578K891P947
$$ plain form
9070 892 -2296 -12929 -12319 -10847 -11116 -8096 -11251 -11261 -4345 -5232 -7601 -4645 2308 -101 4303 10752
9054 10752 7770 4455 3091 -484 2903 7756 -279 -3916 -8456 -9516 -6648 -9877 -8068 -6230 1518
9039 1518 5897 5003 474 -1141 -5483 -3498 -8342 -14307 -9346 -6548 -10844 -12663 -13016 -9804 -5089
9024 -5089 -1775 4219 7801 12205 8616 3355 -1743 -5447 -9849 -12758 -12145 -9690 -10456 -9053 -6396
9009 -6396 -5067 -7744 -5833 -6351 -6335 -9623 -9169 -6461 -7777 -9287 -12570 -16319 -18915 -11718 -7752 -1155
8993 -1155 -2526 -9205 -9561 -8019 -9666 -8214 -11896 -11491 -9191 -13343 -10113 -6782 -12697 -6828 -4333
8978 -4333 -8876 -8816 -4032 -1348 -110 -1069 793 -1025 -4551 -11346 -7240 -6785 -9439 -12145 -14516 -9063
8962 -9063 -4366 -3851 -5201 -16799 -26070 -21782 -9336 838 -693 -301 -9140 -12360 -7716 -6445 -7918
$$ packed form
9070H92l188j0633O10J472k69L020l155j0O916q87k369K956O953k409M404O449
9054A0752k982l315j364l575L387M853q035l637m540j060K868l229J809J838P748
9039A518M379q94m529j615m342J985m844n965M961K798m296j819l53L212M715
9024e089L314N994L582M404l589n261n098l704m402k909O13K455p66J403K657
9009f396J329k677J911n18J6l288M54K708j316j510l283l749k596P197L966O597
8993a155j371o679l56J542j647J452l682M05K300m152L230L331n915N869K495
8978d333m543O0M784K684J238r59J862j818l526o795M106M55k654k706k371N453
8962i063M697N15j350j1598r271M288J2446J0174j531L92q839l220M644J271j473
$$ plain form
8947 -7918 -1819 -3479 -13805 -15546 -13328 -10868 -10277 -9680 -13062 -16661 -4308 -1897 -4380 -4887 -250
8932 -250 2205 -237 -1722 -1059 -20 -6343 -5604 -1241 7914 15207 8821 -1808 -9998 -8293 -3781
8917 -3781 -3738 -8291 -10020 -15281 -13629 -8619 -10668 -13112 -18870 -18868 -15377 -14311 -9354 -6892 -2994 -8300
8901 -8300 -10401 -913 6284 8056 6202 1578 -1915 -9920 -13461 -15541 -14640 -8599 -6764 -7854 -9031
8886 -9031 -2724 -4949 -9174 -2955 -4267 -14300 -20016 -23469 -22359 -15908 -14621 -7702 -7427 -9219 -11559
8871 -11559 -4233 -2167 -4387 -12835 -14485 -9823 -1001 -3801 -10246 -8924 -4255 -4474 -127 -3229 -4477
8856 -4477 -2627 3395 663 -2927 -8537 -9946 -1713 2993 3968 2250 5013 5800 3444 -5506 -5855 -4198
8840 -4198 -3273 -1779 -1136 -2179 -1491 -8948 -14125 -14913 -16128 -17109 -10099 -5798 -8465 -13273 -14319 -15123
$$ packed form
8947g918O099j660j0326j741K218K460N91N97l382l599J2353K411k483n07M637
8932b50K455k442j485O63J039o323P39M363R155P293o386j0629q190J705M512
8917c781M3m553j729n261J652N010k049k444n758KL491J066M957K462L898n306
8901h300k101R488P197J772j854m624l493q005l541k080R01O041J835j090j177
8886i031O307k225m225O219j312j0033n716l453J110O451J287O919K75j792k340
8871a1559P326K066k220q448j650M662Q822k800o445J322M669k19M347l102j248
8856d477J850O022k732l590n610j409Q233M706R75j718K763P87k356q950l49J657
8840d198R25J494O43j043O88p457n177p88j215r81P010M301k667m808j046q04
$$ plain form
8824 -15123 -16296 -11329 -8571 -11735 -12110 -11328 -13092 -11083 -9626 -2981 2736 -3505 -7075 -3881 -8525
8809 -8525 -8984 -7846 -2347 2140 -4265 -8089 -5053 -4222 -7792 -5324 -4822 -9018 -9280 -7632 -4196 -5470
8793 -5470 -4975 251 -4246 -6131 -11790 -15715 -18533 -15611 -9175 -6668 -3565 -4569 -11342 -16061 -9783
8778 -9783 -7508 -11995 -17324 -22669 -20353 -20960 -13334 -13010 -11952 -8978 -8178 -10492 -14001 -14498 -10642 -6237
8762 -6237 -6239 -14372 -11802 -10660 -5007 -5879 -5381 -2895 -7651 -11838 -11712 1168 12933 18327 13573 14246
8746 14246 9743 4311 11911 14090 10995 11222 23941 28538 23764 19971 8981 -3204 -1164 -613
8732 -613 -1116 -1310 -5281 -3404 -7630 -13509 -7314 -1558 -8959 -12453 -6056 -1088 2151 -4433 -7746 -9068
8716 -9068 -9242 -8758 428 8959 4813 -5039 -4830 -5087 -7533 -7888 -2189 3843 1681 4908 3646 -3036
$$ packed form
8824a5123j173M967K758l164l75P82j764K009J457O645N717o241l570L194m644
8809h525m59J138N499M487o405l824L036Q31l570K468N02m196k62J648L436j274
8793e470M95N226m497j885n659l925k818K922O436K507L103j004o773m719O278
8778i783K275m487n329n345K316o07P626L24J058K974Q00k314l509m97L856M405
8762f237kq133K570J142N653q72M98K486m756m187J26J2880J1765N394m754O73
8746A4246m503n432P600K179l095K27J2719M597m774l793j0990j2185K040N51
8732f13n03j94l971J877m226n879O195N756p401l494O397M968L239o584l313j322
8716i068j74M84R186Q531m146r852K09k57k446l55N699O032k162L227j262o682
$$ plain form
8700 -3036 -14893 -23980 -16810 -4415 3016 16336 19466 16570 14488 12117 7861 6630 2513 -1235
8686 -1235 -3260 -9349 -8084 1865 4643 3298 -3177 1792 3941 7156 7493 6503 3342 -6023 -13169
8671 -13169 -12985 -13898 -14407 -11148 -9732 -6842 -6629 -8675 -2319 -2461 1099 -1796 -3544 -1021 -2840 -6142
8655 -6142 -12151 -13153 -14328 -15011 -15821 -16913 -16103 -18886 -14302 -9306 1144 -3966 -6973 -4053 -3981 -3587
8639 -3587 -9197 -15872 -15596 -14692 -14928 -12141 -13777 -19041 -22371 -22613 -21614 -21064 -20605 -20127 -10835 -1334 8098
8622 8098 3766 -2495 -8985 -9491 -8216 -5786 -2867 110 -5163 -9330 -16411 -17852 -11664 -11421 -9588
8607 -9588 -14805 -19822 -14592 -11864 -5342 -7210 -13801 -13749 -2239 10021 5110 2907 1141 -1500 -2752
8592 -2752 -2732 -6921 -8585 -15229 -12333 -6732 -7864 2653 -989 -5931 -3820 -1251 -4061 -7454 -8201
$$ packed form
8700c036j1857r087P170J2395P431J3320L130k896k082k371m256j231m117l748
8686a235k025o089J265R949K778j345o475M969K149L215L37r90l161r365p146
8671a3169J84r13n09L259J416K890K13k046O356j42L560k895j748K523j819l302
8655f142o009j002j175o83q10j092Q10k783M584M996J0450n110l007K920P2L94
8639c587n610o675K76R04k36K787j636n264l330k42R99N50M59M78R292R501R432
8622H098m332o261o490n06J275K430K919K977n273m167p081j441O188K43J833
8607i588n217n017N230K728O522j868o591N2J1510J2260m911k203j766k641j252
8592b752K0m189j664o644K896N601j132J0517l642m942K111K569k810l393p47
$$ plain form
8577 -8201 -5649 -5363 -7272 -6634 -13735 -13187 -14452 -12815 -12721 -11820 -10249 -8888 -12719 -13406 -17437 -18220 -22349
8560 -22349 -19394 -18198 -16635 -12689 -9253 -11053 -13485 -10801 -13435 -11773 -11369 -14203 -12737 -12851 -7970
8545 -7970 -1273 256 -3661 -6749 -4490 -3220 -7227 -16132 -17820 -7726 -7806 -13308 -15444 -9495 -3288
8530 -3288 -5541 -8721 -11396 -11953 -18987 -15775 -11620 -15692 -17514 -15933 -17737 -14835 -12208 -5032 -5675
8515 -5675 -5245 -5560 -2098 2197 1246 210 3744 2346 -11043 -12377 -10093 -15847 -12069 -9968 -9950 -7953
8499 -7953 -933 -1150 152 6541 8050 2691 -3687 -3454 -6298 -7746 -3914 -5562 -8919 -5858 2977
8484 2977 4446 -1610 -9223 -7553 892 -867 -3592 -615 -7112 -4843 3282 2438 -5092 -1827 -3282
8469 -3282 -9284 -5115 5047 11278 15610 20454 28333 30090 20116 21334 25185 28950 34059 41164 55849
$$ packed form
8577h201K552K86j909O38p101N48j265J637R4R01J571J361l831o87m031p83m129
8560b2349K955J196J563L946L436j800k432K684k634J662M04k834J466j14M881
8545g970O697J529l917l088K259J270m007q905j688J0094q0n502k136N949O207
8530c288k253l180k675n57p034L212M155m072j822J581j804K902K627P176o43
8515e675M30l15L462M295r51j036L534j398j3389j334K284n754L778K101J8J997
8499g953P020k17J302O389J509n359o378K33k844j448L832j648l357L061Q835
8484B977J469o056p613J670Q445j759k725K977o497K269Q125q44p530L265j455
8469c282o002M169J0162O231M332M844P879J757r974J218L851L765N109P105J4685
$$ plain form
8454 55849 61591 59224 66940 78263 93208 102079 113236 121902 123880 114732 94823 75765 55599
8441 55599 39756 25035 13703 12754 11890 10094 6844 9360 4149 6796 5893 5765 8575 10442 7835
8426 7835 7778 18157 8768 3783 12613 15561 9896 7732 12413 16422 24807 26273 21322 30535 33789
8411 33789 37724 47687 47786 52359 62237 72802 81808 87535 100536 112288 110083 97132 71415 51671
8397 51671 35384 28586 27555 18759 13629 8467 7763 13496 18238 13259 12646 13457 8915 9563 9067 6261
8381 6261 9614 8945 8479 13952 18667 20921 31905 39222 33336 41425 50876 56288 57376 72469 87778
8366 87778 95536 99802 115851 126457 124410 108333 87422 64096 46481 34369 23143 12784
8354 12784 10316 7277 5988 6132 5338 -24 -2295 -303 1200 1964 4941 7725 4643 1366 -1801
$$ packed form
8454E5849N742k367P716J1323J4945Q871J1157Q666J978r148j9909j9058k0166
8441E5599j5843j4721j1332r49q64j796l250K516n211K647r03j28K810J867k607
8426G835n7J0379r389m985Q830K948n665k164M681M009Q385J466m951R213L254
8411C3789L935R963R9M573R878J0565R006N727J3001J1752k205j2951k5717j9744
8397E1671j6287o798j031q796n130n162p04N733M742m979o13Q11m542O48m96k806
8381F261L353o69m66N473M715K254J0984P317n886Q089R451N412J088J5093J5309
8366H7778P758M266J6049J0606k047j6077k0911k3326j7615j2112j1226j0359
8354A2784k468l039j289J44p94n362k271J992J503P64K977K784l082l277l167
$$ plain form
8339 -1801 -4166 227 7066 7701 6639 5122 9417 9113 14851 20473 29406 37750 47875 55020 59980
8324 59980 65858 78882 88640 104833 119142 123503 130909 119704 92891 74491 53748 36557 24896
8311 24896 17072 18427 19484 17432 9573 6221 3936 5557 4804 3881 7042 4514 7600 13190 6109
8296 6109 -632 4076 7722 4546 3898 2778 -3478 -7078 -1707 2421 -464 1260 -3705 -3748 -5632 -1926
8280 -1926 -524 903 -1961 2720 10406 8550 3422 12670 11052 7721 1823 7219 1270 -2240 -4041
8265 -4041 -12509 -6982 -1924 -9016 -21580 -21098 -13373 -4850 -5258 -10743 -11717 -3786 -2947 -4891 -4398 -2987
8249 -2987 -6911 -11335 -20512 -31503 -26739 -11872 -5148 -8998 -11274 -9647 -2489 8839 10726 12045
8235 12045 4202 2099 4428 1007 1440 2007 5156 2635 1642 -4663 -3891 -5984 -6327 -7231 -9694 -11767
$$ packed form
8339a801k365M393O839O35j062j517M295l04N738N622Q933Q344J0125P145M960
8324E9980N878J3024R758J6193J4309M361P406j1205k6813j8400k0743j7191j1661
8311B4896p824J355J057k052p859l352k285J621p53r23L161k528L086N590p081
8296F109o741M708L646l176o48j120o256l600N371M128k885J724m965m3j884L706
8280a926J402J427k864M681P686j856n128R248j618l331n898N396n949l510j801
8265d041q468N527N058p092j2564M82P725Q523m08n485r74P931Q39j944M93J411
8249b987l924m424r177j0991M764J4867O724l850k276J627P158J1328J887J319
8235A2045p843k103K329l421M33N67L149k521r93o305P72k093l43r04k463k073
$$ plain form
8219 -11767 -12270 -8993 -3271 2777 4448 9628 14388 5124 -2534 -6844 -5564 -9464 -14094 -19759 -12537
8204 -12537 -7002 -9654 -10523 -9488 -8660 -1336 5339 3583 3277 6663 16214 23977 17729 12331 12076 8251
8188 8251 10918 14867 16093 11034 9314 4909 2303 4564 2272 -1640 -7971 -7882 -8928 -16528 -17984
8173 -17984 -17744 -18109 -11164 -11432 -10792 -10766 -15750 -19015 -21003 -11975 -7594 -7654 -12297 -15817 -17196 -18236 -16255
8156 -16255 -13437 -6528 4468 6988 7168 5973 11088 11879 1676 1507 9116 10540 6852 11867 16144
8141 16144 16552 25283 27394 28629 20298 6331 1535 -2501 -3538 4900 3129 53 389 5259 1701
8126 1701 -1495 2411 2758 2241 2526 6408 17161 19176 20117 20121 22805 23325 22660 24438 28498 36944 41198
8109 41198 47803 56419 58368 63152 68878 74254 75042 80643 85037 87968 93872 94807 89896 80982 89148
$$ packed form
8219a1767n03L277N722O048J671N180M760r264p658m310J280l900m630n665P222
8204a2537N535k652q69J035Q28P324O675j756l06L386R551P763o248n398k55l825
8188H251K667L949J226n059j720m405k606K261k292l912o331Q9j046p600j456
8173a7984K40l65O945k68O40K6m984l265j988R028M381o0m643l520j379j040J981
8156a6255K818O909J0996K520J80j195N115P91j0203j69P609J424l688N015M277
8141A6144M08Q731K111J235q331j3967m796m036j037Q438j771l076L36M870l558
8126A701l196L906L47n17K85L882J0753K015R41MK684N20o65J778M060Q446M254
8109D1198O605Q616J949M784N726N376P88N601M394K931N904R35m911q914Q166
$$ plain form
8094 89148 98052 97916 103036 105346 111707 119969 137441 161477 186099 197430 211514 237842 262850
8081 262850 285309 315599 358392 403992 460156 525493 600610 682807 772456 883297 1019707
8070 1019707 1185318 1377362 1614605 1916185 2275564 2695653 3205032 3835840 4629324 5612064
8060 5612064 6734256 7870270 8901838 9809367 10718773 11816870 13298541 15405770 18307240
8051 18307240 21832329 24952253 25827212 23354488 18520336 13455597 9501573 6819749
8043 6819749 5084811 3966615 3226429 2722640 2374983 2143934 1973148 1864247 1792905
8034 1792905 1730896 1666635 1594442 1523847 1483107 1467791 1480117 1530555 1615270 1743226 1920647
8023 1920647 2140260 2421561 2767504 3190266 3699836 4350920 5172115 6166232 7251864
$$ packed form
8094H9148Q904j36N120K310O361Q262J7472K4036K4622J1331J4084K6328K5008
8081B62850K2459L0290M2793M5600N6164O5337P5117Q2197Q9649J10841J36410
8070A019707J65611J92044K37243L01580L59379M20089N09379O30808P93484R82740
8060E612064J122192J136014J031568R07529R09406J098097J481671K107229K901470
8051A8307240L525089L119924Q74959k472724m834152n064739l954024k681824
8043F819749j734938j118196p40186n03789l47657k31049j70786j08901p1342
8034A792905o2009o4261p2193p0595m0740j5316J2326N0438Q4715J27956J77421
8023A920647K19613K81301L45943M22762N09570O51084Q21195R94117J085632
$$ plain form
8014 7251864 8291065 9207368 10043725 10959546 12133854 13767848 16081969 19141821 22473498
8005 22473498 24676757 24099619 20559323 15657584 11208163 7965201 5828259 4460602
7997 4460602 3572575 2986598 2594230 2347280 2193856 2105694 2064466 2047233 2041762 2042403 2048881
7986 2048881 2097427 2203490 2377645 2627101 2951215 3362112 3882562 4554705 5422924 6483009
7976 6483009 7635990 8729375 9677166 10538184 11472856 12688288 14422791 16921229 20278281
7967 20278281 24028448 26594654 25922441 21749333 16168501 11366880 8027096 5885373
7959 5885373 4519868 3634518 3044932 2632573 2343729 2143425 2012075 1923662 1865412 1808232
7949 1808232 1736301 1658124 1585924 1547350 1546646 1581165 1649454 1757007 1902368 2098189 2359445
$$ packed form
8014G251864J039201R16303Q36357R15821J174308J633994K314121L059852L331677
8005B2473498K203259n77138l540296m901739m449421l242962k136942j367657
7997D460602q88027n85977l92368k46950j53424q8162m1228j7233n471O41O478
7986B048881M8546J06063J74155K49456L24114M10897N20450O72143Q68219J060085
7976F483009J152981J093385R47791Q61018R34672J215432J734503K498438L357052
7967B0278281L750167K566206o72213m173108n580832m801621l339784k141723
7959E885373j365505q85350n89586m12359k88844k00304j31350q8413n8250n7180
7949A808232p1931p8177p2200l8574p04L4519O8289J07553J45361J95821K61256
$$ plain form
7938 2359445 2682244 3074405 3553565 4143365 4910106 5875999 6960691 8029436 8979023
7929 8979023 9816997 10658426 11702130 13163766 15263074 18189462 21757830 24813642 25320089
7920 25320089 22323586 17220006 12258941 8547863 6097604 4540831 3538138 2864107
7912 2864107 2390001 2061636 1836746 1678611 1563269 1470504 1372301 1266549 1136910 1006019
7902 1006019 887323 784977 713005 657049 608320 568408 533735 501972 477435 458119 439211
7891 439211 427009 415157 390865 376172 365948 352813 340736 323155 300337 288248 275578 265904
7879 265904 265394 263660 256260 245302 232834 232655 226249 216236 213254 200840 191699 187455 181075 180350
7865 180350 180832 183844 175160 174273 169732 167094 162311 159597 159972 159960 162584 163292 164254 162167 160689 159153
$$ packed form
7938B359445L22799L92161M79160N89800P66741R65893J084692J068745R49587
7929H979023Q37974Q41429J043704J461636K099308K926388L568368L055812N06447
7920B5320089k996503n103580m961065l711078k450259j556773j002693o74031
7912B864107m74106l28365k24890j58135j15342r2765r8203j05752j29639j30891
7902A006019j18696j02346p1972n5956m8729l9912l4673l1763k4537j9316j8908
7891D39211j2202j1852k4292j4693j0224j3135j2077j7581k2818j2089j2670r674
7879B65904n10j734p400j0958j2468j79o406j0013k982j2414r141m244o380p25
7865A80350M82L012q684q87m541k638m783k714L75j2K624P08R62k087j478j536
$$ plain form
7849 159153 153898 144035 137778 137030 135845 128837 125934 122638 124957 131752 131120 126281 114707 102875
7835 102875 97978 98865 100748 100503 98122 95576 90690 94088 92426 90118 98146 100080 100134 100085 101339 107873
7819 107873 103878 101263 100592 100803 103303 106060 104446 102320 102366 102017 102359 98486 100750 99015 91860 97009
7803 97009 104448 106394 102785 101841 94379 94261 94267 87384 82520 85651 82850 77873 73399 69204 60803 51369
7787 51369 55036 57939 51725 48024 51675 53743 50356 52263 53966 53645 54142 57050 57065 58928 63170 67998
7771 67998 71870 70389 61031 57713 61312 57580 54281 49358 50411 56429 52271 51556 48164 44603 45589
7756 45589 43869 46708 48686 45389 47505 50076 51694 47731 42642 34767 39022 39131 37598 40797 39674
7741 39674 34861 34897 31471 29894 31560 30501 28451 31414 34881 36103 35730 37561 40695 40211 50210 48996
$$ packed form
7849A59153n255r863o257p48j185p008k903l296K319O795o32m839j1574j1832
7835A02875m897Q87J883k45k381k546m886L398j662k308Q028J934N4m9J254O534
7819A07873l995k615o71K11K500K757j614k126M6l49L42l873K264j735p155N149
7803I7009P439J946l609r44p462j18Oo883m864L131k801m977m474m195q401r434
7787E1369L667K903o214l701L651K068l387J907J703l21M97K908J5J863M242M828
7771F7998L872j481r358l318L599l732l299m923J053O018m158p15l392l561R86
7756D5589j720K839J978l297K116K571J618l963n089p875M255J09j533L199j123
7741C9674m813L6l426j577J666j059k050K963L467J222l73J831L134m84R999j214
$$ plain form
7725 48996 40670 39510 43561 44552 48590 47775 47568 47715 44153 47449 48897 47795 44314 36680 32003 33671
7709 33671 35821 31015 32239 36943 39981 40799 36009 36262 32962 31045 34625 44031 42989 36377 34431
7694 34431 36301 41457 42290 38936 36460 36505 34549 37611 42599 44468 43391 36021 35129 29288 31479 35725
7678 35725 32137 29146 30914 30317 32785 36953 32327 32844 29773 26915 28319 30240 30207 33247 31110 25225
7662 25225 24234 29269 34953 45178 58513 69990 69590 71550 75938 84832 94020 108962 121884 130391
7648 130391 144704 156025 153128 137508 116794 93355 68231 50807 52084 54993 50016 42255 40275
7635 40275 45507 48984 40897 34742 35959 32906 31533 33824 34450 31737 33627 33063 35335 32597 33383
7620 33383 35980 30679 32688 38864 37331 45434 48747 54851 62720 67557 72422 75807 81843 88176 87353
$$ packed form
7725D8996q326j160M051R91M038q15k07J47l562L296J448j102l481p634m677J668
7709C3671K150m806J224M704L038Q18m790K53l300j917L580R406j042o612j946
7694C4431J870N156Q33l354k476M5j956L062M988J869j077p370q92n841K191M246
7678C5725l588k991J768n97K468M168m626N17l071k858J404J921l3L040k137n885
7662B5225r91N035N684J0225J3335J1477m00J960M388Q894R188J4942J2922Q507
7648A30391J4313J1321k897j5620k0714k3439k5124j7424J277K909m977p761j980
7635D0275N232L477q087o155J217l053j373K291O26k713J890n64K272k738P86
7620C3383K597n301K009O176j533Q103L313O104P869M837M865L385O036O333q23
$$ plain form
7605 87353 99994 117313 129451 138556 124946 98623 79135 62172 48338 38442 37344 29623 28357
7592 28357 26121 23954 20702 24206 28314 30859 35437 37934 31195 28140 32926 38618 37396 35245 43766
7577 43766 46781 45473 49882 52247 56015 63859 72759 80169 86731 90839 101323 115547 133548 149560
7563 149560 153228 137085 121468 93286 68801 55780 44041 45908 42781 38672 34608 27834 21564
7550 21564 22212 31295 28954 25706 24524 29235 27710 29281 31805 27759 21560 10214 11716 18709 22674
7535 22674 24046 28096 27829 31357 38354 42129 50677 60154 65611 70424 69770 75895 88166 104856 126301
7520 126301 145631 154401 146439 118433 90083 71035 52223 37922 34213 30601 24553 12083 10147
7507 10147 12055 10014 16474 19835 19743 14035 14934 16120 13147 13565 21574 19879 19121 18835 23859 16730
$$ packed form
7605H7353J2641J7319J2138R105j3610k6323j9488j6963j3834r896j098p721j266
7592B8357k236k167l252L504M108K545M578K497o739l055M786N692j222k151Q521
7577D3766L015j308M409K365L768P844Q900P410O562M108J0484J4224J8001J6012
7563A49560L668j6143j5617k8182k4485j3021j1739J867l127m109m064o774o270
7550B1564O48R083k341l248j182M711j525J571K524m046o199j1346J502O993L965
7535B2674J372M050k67L528O997L775Q548R477N457M813o54O125J2271J6690K1445
7520A26301J9330Q770p962k8006k8350j9048j8812j4301l709l612o048j2470j936
7507A0147J908k041O460L361r2n708Q99J186k973M18Q009j695p58k86N024p129
$$ plain form
7491 16730 4245 8517 14726 18267 18335 15675 12733 15320 20923 25975 18989 12712 10634 5644 4569
7476 4569 1982 -1770 7019 14196 17153 11278 3796 2489 7881 4749 -3042 1040 1049 1065 6014 13675
7460 13675 14745 8530 5060 6470 11178 8805 8468 10780 7012 5525 7054 13584 13894 10992 15174
7445 15174 12386 8568 15105 15159 21363 24267 24725 26055 29042 25204 19017 21532 18835 21127 20191 14641
7429 14641 1003 2815 2013 6223 10949 20194 21923 17071 14378 11349 21481 27342 30136 27047
7415 27047 19194 13327 7122 2394 3617 261 -796 551 842 3008 3600 2445 2644 2077 7375 6409
7399 6409 6838 8622 12012 17069 16601 18851 18308 12441 13227 10751 5511 -1316 3886 7974 8710 12824
7383 12824 5386 7665 11420 11233 10767 14877 13943 13344 11675 11833 6956 5352 9706 6686 8248 8807
$$ packed form
7491A6730j2485M272O209L541O8k660k942K587N603N052o986o277k078m990j075
7476D569k587l752Q789P177K957n875p482j307N392l132p791M082RJ6M949P661
7460A3675J070o215l470J410M708k373l37K312l768j487J529O530L10k902M182
7445A5174k788l818O537N4O204K904M58J330K987l838o187K515k697K292r36n550
7429A4641j3638J812q02M210M726R245J729m852k693l029J0132N861K794l089
7415B7047p853n867o205m728J223l356j057J347K91K166N92j155J99n67N298r66
7399F409M29J784L390N057m68K250n43n867P86k476n240o827N202M088P36M114
7383A2824p438K279L755j87m66M110r34n99j669J58m877j604M354l020J562N59
$$ plain form
7367 8807 14809 9745 3323 2234 3791 6696 4876 4664 3842 7841 6966 10961 9585 5723 2189 51
7351 51 3670 13410 14058 13686 9654 7600 13165 13344 10666 10084 9828 6553 1157 7655 9011 9320 3828
7334 3828 5647 10897 12050 12308 11708 9063 11079 15698 8590 10030 5876 4725 8177 14264 9981
7319 9981 8288 10094 6861 -176 4161 9289 11092 9169 9249 14859 12884 5798 4465 11066 4864
7304 4864 -763 1043 6857 15705 12205 2072 4529 6696 8858 12738 11686 11700 10162 6098 6446
7289 6446 12029 8772 7328 5948 8125 13441 17087 8826 7187 8210 9846 12224 13122 14561 19618
7274 19618 13614 6884 7151 6290 7459 12020 12166 16378 7974 881 -5528 -5541 -1584 -8521 -6199 -670
$$ packed form
7367H807O002n064o422j089J557K905j820k12q22L999q75L995j376l862l534k138
7351E1L619R740O48l72m032k054N565J79k678n82k56l275n396O498J356L09n492
7334C828J819N250J153K58o00k645K016M619p108J440m154j151L452O087m283
7319I981j693J806l233p037M337N128J803j923Q0N610j975p086j333O601o202
7304D864n627J806N814Q848l500j0133K457K167K162L880j052J4j538m064L48
7289F446N583l257j444j380K177N316L646q261j639J023J636K378Q98J439N057
7274A9618o004o730K67q61J169M561J46M212q404p093o409j3L957o937K322N529
$$ [...]
##END NTUPLES=NMR SPECTRUM
##END=
