##TITLE=Analysis number 328512
Compound Code sb 01197
Book Reference 2
Project Code adrs
Chemist Name stores
##JCAMPDX= 6.0         $$ Bruker NMR JCAMP-DX V2.0
##DATA TYPE= NMR SPECTRUM
##DATA CLASS= NTUPLES
##ORIGIN= Bruker BioSpin GmbH
##OWNER= nmr
$$ XWIN-NMR		Version 3.5
$$ Mon Jun 11 14:39:35 2007 GMT Daylight Time (UT+1h)  MAYBRIDGE\nmr@NMR_250MHZ
##.OBSERVE FREQUENCY= 250.131544655141
##.OBSERVE NUCLEUS= ^1H
##.ACQUISITION MODE= SIMULTANEOUS (DQD)
##.ACQUISITION SCHEME= undefined
##.AVERAGES= 16
##.DIGITISER RES= 18
##SPECTROMETER/DATA SYSTEM= dpx250
##.PULSE SEQUENCE= zg30
##.SOLVENT NAME= CDCl3
##.SHIFT REFERENCE= (INTERNAL, CDCl3, 0, 16.522)
##AUDIT TRAIL= $$ (NUMBER, WHEN, WHO, WHERE, WHAT)
$$ ##TITLE= Audit trail, XWIN-NMR		Version 3.5
$$ ##JCAMPDX= 5.01
$$ ##ORIGIN= Bruker BioSpin GmbH
$$ ##OWNER= nmr
$$ C:\u/data/dgb/nmr/ADRS/730/pdata/1/auditp.txt
$$ ##AUDIT TRAIL=  $$ (NUMBER, WHEN, WHO, WHERE, WHAT)
(   1,<2007-06-11 14:38:55.38 +100>,<MAYBRIDGE\nmr>,<NMR_250MHZ>,
      <created by zg, POWCHK disabled, PULCHK disabled
       configuration hash MD5:
       76 6E 9A 78 1E 09 19 81 EC 84 63 8F B0 6A 59 2D
       data hash MD5: 64K
       44 4E 42 1A 57 FA BB 53 72 A4 64 A7 A7 2A AC 39>)
(   2,<2007-06-11 14:39:09.63 +100>,<MAYBRIDGE\nmr>,<NMR_250MHZ>,
      <Start of raw data processing
       ef LB = 0.3 FT_mod = 6 PKNL = 1 SI = 32K 
       data hash MD5: 32K
       06 2A 56 B4 3F 9B C2 E6 74 8B 8D 59 71 43 EE FC>)
(   3,<2007-06-11 14:39:14.88 +100>,<MAYBRIDGE\nmr>,<NMR_250MHZ>,
      <apk 
       data hash MD5: 32K
       82 77 DB E6 93 D4 03 60 20 B3 D0 D0 74 47 42 6B>)
(   4,<2007-06-11 14:39:16.57 +100>,<MAYBRIDGE\nmr>,<NMR_250MHZ>,
      <abs ABSG = 5 
       data hash MD5: 32K
       B0 B9 70 1F D9 00 D3 AB D8 7E C6 59 AE 94 FD ED>)
$$ ##END=
$$ 
$$ hash MD5
$$ 40 F7 0A 87 19 6F E8 FA 62 CA 99 C0 06 28 E5 A8
##$RELAX= 
##$RELAX= 
##$RELAX= 
##$RELAX= 
##$RELAX= 
##$RELAX= 
##$RELAX= 
$$ Bruker specific parameters
$$ --------------------------
##$DU= <C:\u>
##$EXPNO= 730
##$NAME= <ADRS>
##$PROCNO= 1
##$TYPE= <nmr>
##$USER= <dgb>
##$AMP= (0..31)
100 100 100 100 100 100 100 100 100 100 100 100 100 100 100 100 100 100 
100 100 100 100 100 100 100 100 100 100 100 100 100 100 
##$AQSEQ= 0
##$AQ_mod= 3
##$AUNM= <au_zg>
##$AUTOPOS= <24 >
##$BF1= 250.13
##$BF2= 250.13
##$BF3= 250.13
##$BF4= 250.13
##$BF5= 500.13
##$BF6= 500.13
##$BF7= 500.13
##$BF8= 500.13
##$BYTORDA= 1
##$CFDGTYP= 0
##$CFRGTYP= 5
##$CHEMSTR= <none>
##$CNST= (0..31)
1 1 145 1 1 1 1 1 1 1 1 1 1 1 1 1 1 1 1 1 1 1 1 1 1 1 1 1 1 1 1 1 
##$CPDPRG= <>
##$CPDPRG1= <>
##$CPDPRG2= <>
##$CPDPRG3= <>
##$CPDPRG4= <mlev>
##$CPDPRG5= <mlev>
##$CPDPRG6= <mlev>
##$CPDPRG7= <mlev>
##$CPDPRG8= <mlev>
##$CPDPRGB= <>
##$CPDPRGT= <>
##$D= (0..31)
0 1 0 0 0 0 0 0 0 0.06 0 0 0 0 0 0 0.0002 0 0 0 0 0 0 0 0 0 0 0 0 0 0 
0 
##$DATE= 1181569134
##$DBL= (0..7)
120 120 120 120 120 120 120 120 
##$DBP= (0..7)
150 150 150 150 150 150 150 150 
##$DBP07= 0
##$DBPNAM0= <>
##$DBPNAM1= <>
$$ [...]
##$SUBNAM7= <"">
##$SUBNAM8= <"">
##$SUBNAM9= <"">
##$SW= 20.6930455092707
##$SWIBOX= (0..15)
0 0 3 0 0 0 0 0 0 0 0 0 0 0 0 0 
##$SW_h= 5175.983436853
##$TD= 65536
##$TD0= 1
##$TE= 297.16
##$TE2= 300
##$TE3= 300
##$TEG= 300
##$TL= (0..7)
0 120 120 120 120 120 120 120 
##$TP= (0..7)
150 150 150 150 150 150 150 150 
##$TP07= 0
##$TPNAME0= <>
##$TPNAME1= <>
##$TPNAME2= <>
##$TPNAME3= <>
##$TPNAME4= <>
##$TPNAME5= <>
##$TPNAME6= <>
##$TPNAME7= <>
##$TPOAL= (0..7)
0.5 0.5 0.5 0.5 0.5 0.5 0.5 0.5 
##$TPOFFS= (0..7)
0 0 0 0 0 0 0 0 
##$TUNHIN= 0
##$TUNHOUT= 0
##$TUNXOUT= 0
##$USERA1= <user>
##$USERA2= <user>
##$USERA3= <user>
##$USERA4= <user>
##$USERA5= <user>
##$V9= 5
##$VALIST= <valist>
##$VCLIST= <CCCCCCCCCCCCCCC>
##$VD= 0
##$VDLIST= <DDDDDDDDDDDDDDD>
##$VPLIST= <PPPPPPPPPPPPPPP>
##$VTLIST= <TTTTTTTTTTTTTTT>
##$WBST= 1024
##$WBSW= 4
##$XGAIN= (0..3)
0 0 0 0 
##$XL= 0
##$YL= 0
##$YMAX_a= 441225
##$YMIN_a= -455267
##$ZGOPTNS= <>
##$ZL1= 120
##$ZL2= 120
##$ZL3= 120
##$ZL4= 120
##$ABSF1= 16.522
##$ABSF2= -4.171173
##$ABSG= 5
##$ABSL= 3
##$ALPHA= 0
##$AQORDER= 0
##$ASSFAC= 0
##$ASSFACI= 0
##$ASSFACX= 0
##$ASSWID= 0
##$AUNMP= <proc_1d>
##$AZFE= 0.1
##$AZFW= 0.1
##$BCFW= 0
##$BC_mod= 0
##$BYTORDP= 0
##$COROFFS= 0
##$CY= 12.5
##$DATMOD= 1
##$DC= 0
##$DFILT= <>
##$DTYPP= 0
##$F1P= 14.0000005364418
##$F2P= -0.99999901652339
##$FCOR= 0.5
##$FTSIZE= 32768
##$FT_mod= 6
##$GAMMA= 0
##$GB= 0
##$INTBC= 1
##$INTSCL= 1
##$ISEN= 128
##$LB= 0.3
##$LEV0= 0
##$LPBIN= 0
##$MAXI= 10000
##$MC2= 0
##$MEAN= 0
##$ME_mod= 0
##$MI= 0
##$NCOEF= 0
##$NC_proc= -3
##$NLEV= 6
##$NOISF1= 0
##$NOISF2= 0
##$NSP= 0
##$NTH_PI= 0
##$NZP= 0
##$OFFSET= 16.522
##$PC= 1
##$PHC0= -53.58063
##$PHC1= 4.504789
##$PH_mod= 1
##$PKNL= yes
##$PPARMOD= 0
##$PSCAL= 4
##$PSIGN= 0
##$REVERSE= no
##$SF= 250.13
##$SI= 32768
##$SIGF1= 0
##$SIGF2= 0
##$SINO= 400
##$SIOLD= 32768
##$SREGLST= <1H.CDCl3>
##$SSB= 0
##$STSI= 32768
##$STSR= 0
##$SW_p= 5175.98343685301
##$SYMM= 0
##$S_DEV= 0
##$TDeff= 65536
##$TDoff= 0
##$TI= <Analysis number 999999
Compound Code 99
Book Reference 9
Project Code 9>
##$TILT= no
##$TM1= 0
##$TM2= 0
##$TOPLEV= 0
##$USERP1= <user>
##$USERP2= <user>
##$USERP3= <user>
##$USERP4= <user>
##$USERP5= <user>
##$WDW= 1
##$XDIM= 32768
##$YMAX_p= 326507634
##$YMIN_p= -164524
$$ End of Bruker specific parameters
$$ ---------------------------------
##NTUPLES= NMR SPECTRUM
##VAR_NAME=  FREQUENCY,     SPECTRUM/REAL,   SPECTRUM/IMAG
##SYMBOL=    X,             R,               I
##VAR_TYPE=  INDEPENDENT,   DEPENDENT,       DEPENDENT
##VAR_FORM=  AFFN,          ASDF,            ASDF
##VAR_DIM=   32768,         32768,           32768
##UNITS=     HZ,            ARBITRARY UNITS, ARBITRARY UNITS
##FACTOR=    0.157963299565203, 1,           1
##FIRST=     4132.6476996994, 0,             0
##LAST=      -1043.33573715361, 0,           0
##MIN=       -1043.33573715361, -164524,     0
##MAX=       4132.6476996994, 326507634,     0
$$ Real data points
##PAGE= N=1
##DATA TABLE= (X++(R..R)), XYDATA
$$ [...]
$$ plain form
20066 -32804 -15176 -21683 -14064 8934 11991 7238 -16823 -6175 -17050 -25284 -15558 -10203 -14292
20053 -14292 -15903 -4360 -7790 -18880 -33826 -40508 -22628 -8342 8126 8201 12731 25241 22068
20040 22068 23052 33147 16671 9896 22888 42517 42935 20949 7175 9070 5639 -220 -423 10895
20026 10895 23010 13680 4696 11782 17009 -1533 -6607 -1376 -2847 467 -16194 -25618 -13946
20013 -13946 4018 18988 15300 22235 20076 17782 3764 410 1602 9860 -2692 -23034 -16315
20000 -16315 -14250 -11511 -23777 -13744 2994 2215 -10629 -11912 -5400 -19260 -12177 5192 2765
19987 2765 -4400 -21257 -23476 -12401 16890 12064 8530 16060 30417 41203 27852 15196 14421
19974 14421 8962 2197 14993 16150 32413 23821 3966 -6697 3485 14801 22879 13473 13068
$$ packed form
20066c2804J7628o507P619K2998L057m753k4061J0648j0875q234R726N355m089
20053a4292j611J1543l430j1090j4946o682J7880J4286J6468P5M530J2510l173
20040B2068R84J0095j6476o775J2992J9629M18k1986j3774J895l431n859k03J1318
20026A0895J2115r330q984P086N227j8542n074N231j471L314j6661r424J1672
20013a3946J7964J4970l688O935k159k294j4018l354J192Q258j2552k0342O719
20000a6315K065K739j2266J0033J6738p79j2844j283O512j3860P083J7369k427
19987B765p165j6857k219J1075K9291m826l534P530J4357J0786j3351j2656p75
19974A4421n459o765J2796J157J6263q592j9855j0663J0182J1316Q078r406m05
$$ plain form
19961 13068 17071 4935 20623 23417 4696 -6816 -8945 -9594 -2124 -3902 -30060 -57702 -52825
19948 -52825 -36337 -22147 6023 7766 8923 -3738 -18529 4271 8848 4865 -639 -2819 8659
19935 8659 8797 -1364 -9850 -1161 -7269 2498 2926 11800 22279 11393 -21509 -24365 -40181 -38391
19921 -38391 -6593 -5113 -16182 -18298 -28878 -26118 -35693 -14271 6496 -9426 -16778 -23766 -19077
19908 -19077 -1692 6514 21156 8614 1759 -11473 -5652 -949 -2534 -9364 305 603 -10268
19895 -10268 -13435 8584 16610 10689 8331 20014 8868 -4751 -550 12344 29472 36150 20752
19882 20752 5877 6721 25982 21613 21910 29528 27151 25016 14867 -7366 2004 20463 8092
19869 8092 -8686 -31716 -34130 -27271 -6337 4221 3767 431 -11655 -14896 -2903 8373 9119
$$ packed form
19961A3068M003j2136J5688K794j8721j1512k129o49P470j778k6158k7642M877
19948e2825J6488J4190K8170J743J157j2661j4791K2800M577l983n504k180J1478
19935H659J38j0161q486Q689o108R767M28Q874J0479j0886l2902k856j5816J790
19921c8391L1798J480j1069k116j0580K760r575K1422K0767j5922p352o988M689
19908a9077J7385Q206J4642j2542o855j3232N821M703j585o830R669K98j0871
19895a0268l167K2019Q026n921k358J1683j1146j3619M201J2894J7128O678j5398
19882B0752j4875Q44J9261m369K97P618k377k135j0149k2233R370J8459j2371
19869H092j6778k3030k414O859K0934J0558m54l336j2086l241J1993J1276P46
$$ plain form
19856 9119 2403 3668 16724 24794 26243 14303 -12308 -35104 -23436 -19533 -31472 -24421 -40122
19843 -40122 -44341 -29606 -11803 3211 -17927 -17360 -3155 5641 22128 23476 -2867 -7225 -3081
19830 -3081 13053 28529 16307 -1470 -15435 -22550 -18059 12724 13057 -25534 -30294 -15635 -26137
19817 -26137 -24371 -23522 -25088 -8170 14988 3130 -4888 -2452 7688 10689 -6235 7043 22968
19804 22968 25241 8416 -11729 -5416 244 -5367 -383 5913 16205 22027 31108 11836 180
19791 180 -1022 4143 1546 -14908 -19249 -4014 -15371 -18938 -16172 -3250 6220 -4826 3801 7169
19777 7169 17185 6906 2785 -6146 -8582 -4752 -1532 -24302 -26350 -12280 3062 4519 12300
19764 12300 27613 29200 37289 20466 -7521 -1947 8460 12170 24055 21840 -2791 9919 16249
$$ packed form
19856I119o716J265J3056Q070J449j1940k6611k2796J1668L903j1939P051j5701
19843d0122m219J4735J7803J5014k1138N67J4205Q796J6487J348k6343m358M144
19830c081J6134J5476j2222j7777j3965p115M491L0783L33l8591m760J4659j0502
19817b6137J766Q49j566J6918K3158j1858q018K436J0140L001j6924J3278J5925
19804B2968K273j6825k0145O313N660n611M984O296J0292N822R081j9272j1656
19791A80j202N165k597j6454m341J5235j1357l567K766J2922R470j1046Q627L368
19777G169J0016j0279m121q931k436L830L220k2770k048J4070J5342J457P781
19764A2300J5313J587Q089j6823k7987N574J0407L710J1885k215k4631J2710O330
$$ plain form
19751 16249 -10141 -20722 -24746 -18571 -26460 -26868 -18319 -26255 -18107 -20783 -16396 6693 2562 -13336
19737 -13336 2974 6223 23105 30046 -7716 -24561 -15775 -9261 -2468 10696 -6480 -7798 3208
19724 3208 6342 566 24096 36718 25569 17377 -13682 -10667 15741 22859 21833 8167 -1539
19711 -1539 221 10708 15750 4852 4006 -2024 2126 -21051 -17099 -12822 -17663 -25008 -13362 1375
19697 1375 6762 -1432 -8972 11153 27565 26608 27485 26003 18752 23623 28533 -5584 -6577 3312 10025
19682 10025 6481 17521 8261 -7180 -23445 -31177 -29589 -17497 -9332 -10607 -23614 -33647 -9334
19669 -9334 1411 8240 19573 7252 -367 -7246 7611 8868 2288 -2498 -6977 5031 14484
19656 14484 35019 42931 38093 32699 20436 23202 5605 4293 -10404 -31256 -24424 -17977 -17459
$$ packed form
19751A6249k6390j0581m024O175p889m08Q549p936Q148k676M387K3089m131j5898
19737a3336J6310L249J6882O941l7762j6845Q786O514O793J3164j7176j318J1006
19724C208L134n776K3530J2622j1149q192l1059L015K6408P118j026j3666r706
19711a539J760J0487N042j0898q46o030M150k3177L952M277m841p345J1646J4737
19697A375N387q194p540K0125J6412r57Q77j482p251M871M910l4117r93R889O713
19682A0025l544J1040r260j5441j6265p732J588J2092Q165j275j3007j0033K4313
19669i334J0745O829J1333j2321p619o879J4857J257o580m786m479J2008R453
19656A4484K0535P912m838n394j2263K766j7597j312j4697k0852O832O447N18
$$ plain form
19643 -17459 -19342 -16011 115 9734 7883 7248 -10576 -15713 -7423 2094 18712 12673 6704 7414
19629 7414 -2413 -16785 -13004 -890 1149 16995 20630 9077 3990 3846 20038 15683 7179 666
19615 666 11742 6612 -8548 -4963 -4028 -8663 -13151 -31624 -13823 4001 6874 -1912 720 7168
19601 7168 25743 20565 18619 2207 -17981 -21819 -38026 -27170 -18904 -11551 326 6387 766
19588 766 -15428 -23670 -18323 -16272 -6493 -7965 -29187 -29925 -29546 -14482 -3181 4385 12831 8747
19574 8747 13456 -6347 922 5944 -3370 -5561 11844 20637 25140 21808 17900 27970 30633 25492
19560 25492 42729 28056 587 -9243 -14419 -7258 -15001 980 16535 21796 23936 21099 3840
19547 3840 -6952 -36089 -55448 -38555 -15736 2517 17845 25731 35026 41795 30900 23660 19967
$$ packed form
19643a7459j883L331J6126R619j851o35j7824n137Q290R517J6618o039n969P10
19629G414r827j4372L781J2114K039J5846L635j1553n087j44J6192m355q504o513
19615F66J1076n130j5160L585R35m635m488j8473J7801J7824K873q786K632O448
19601G168J8575n178j946j6412k0188l838j6207J0856Q266P353J1877O061n621
19588G66j6194q242N347K051R779j472k1222p38L79J5064J1301P566Q446m084
19574H747M709j9803P269N022r314k191J7405Q793M503l332l908J0070K663n141
19560B5492J7237j4673k7469r830n176P161p743J5981J5555N261K140k837j7259
19547C840j0792k9137j9359J6893K2819J8253J5328P886R295O769j0895p240l693
$$ plain form
19534 19967 10582 11079 13992 -9014 2857 8847 15646 16276 16156 16367 19926 22170 17431 30452 30037
19519 30037 868 -9761 3066 -6399 -16566 -19700 -18736 -15449 -15392 -19470 -26543 -39285 -21187 -5408
19505 -5408 2124 7810 10999 -4800 -9732 10436 9442 19603 23496 11069 5863 -1659 2229 10402
19491 10402 12559 9403 12290 15076 14486 12145 12764 29580 20405 15134 3315 3608 -7875 -4900
19477 -4900 9298 31609 12194 10723 21241 -4271 -21910 -13175 7725 12851 26061 49139
19465 49139 43689 42264 27317 31594 41670 42654 6167 -9819 -21987 -30866 -22345 -20231 -7198
19452 -7198 -21937 -38534 -44014 -23142 -18321 -24565 -19854 -6237 -1967 -1743 9746 17302 17401 8615
19438 8615 6054 2384 1418 7697 15251 23324 13176 2676 -2842 -6071 -7700 -4916 -2639 -4712
$$ packed form
19534A9967r385M97K913k3006J1871N990O799O30j20K11L559K244m739J3021m15
19519C0037k9169j0629J2827r465j0167l134R64L287N7m078p073j2742J8098J5779
19505e408P532N686L189j5799m932K0168r94J0161L893j2427n206p522L888Q173
19491A0402K157l156K887K786n90k341O19J6816r175n271j1819K93j1483K975
19477d900J4198K2311j9415j471J0518k5512j7639Q735K0900N126J3210K3078
19465D9139n450j425j4947M277J0076R84l6487j5986j2168q879Q521K114J3033
19452g198j4739j6597n480K0872M821o244M711J3617M270K24J1489P556R9q786
19438H615k561l670r66O279P554Q073j0148j0500n518l229j629K784K277k073
$$ plain form
19424 -4712 6908 7841 -2479 -16616 -15840 -9851 8217 -1047 6766 23684 11492 -2502 3030
19411 3030 26669 21559 10302 7768 10596 10775 10316 13379 19488 25193 26964 34488 39091 25724
19397 25724 20406 10770 -17609 -27663 -18849 -1516 -1350 1908 9862 12675 6291 8363 2896 -1788
19383 -1788 -1994 6339 1418 3620 3543 4572 5477 17111 18902 19428 11954 6024 9436 6921 20261
19368 20261 24701 17072 6005 -6330 -10436 5127 31691 40058 30817 10323 9733 12298 2106
19355 2106 23242 25313 37218 58310 64033 45782 38540 25583 32503 45225 46755 45048 48401
19342 48401 44213 36368 37119 31117 36808 40367 33595 34001 31047 38488 40335 38769 50658 59231 78095
19327 78095 87512 73556 74685 83661 63574 57957 67839 62090 51771 36805 46100 58769 51103
$$ packed form
19424d712J1620R33j0320j4137P76N989J8068r264P813J6918j2192j3994N532
19411C030K3639n110j1257k534K828J79m59L063O109N705J771P524M603j3367
19397B5724n318r636k8379j0054Q814J7333J66L258P954K813o384K072n467m684
19383a788k06Q333m921K202p7J029R05J1634J791N26p474n930L412k515J3340
19368B0261M440p629j1067j2335m106J5563K6564Q367r241k0494n90K565j0192
19355B106K1136K071J1905K1092N723j8251p242j2957O920J2722J530j707L353
19342D8401m188p845P51o002N691L559o772M06k954P441J847j566J1889Q573J8864
19327G8095R417j3956J129Q976k0087n617R882n749j0319j4966R295J2669p666
$$ plain form
19314 51103 46183 69444 60517 68716 63099 55129 68674 88924 81628 86961 82083 88379 106777
19301 106777 138730 152400 148068 148646 159540 176674 198996 215068 215246 213263 218169 221763 244587
19288 244587 261538 286521 315766 324171 333160 340283 354576 379397 387905 385681 378642 394138 411423
19275 411423 422073 441727 448282 455058 469808 445242 410510 409031 429906 430939 415200 395946
19263 395946 373531 369389 348870 338558 340996 336394 328142 322680 322197 315634 296647 299356 280103
19250 280103 267944 262652 276614 301397 300468 288899 292803 282633 254486 249739 266375 292411
19238 292411 296323 311170 326272 340955 330586 326931 342508 359570 399487 426201 426201 440004 453535
19225 453535 455379 461890 481507 500829 510490 491268 480030 490585 491768 456927 418625 405509
$$ packed form
19314E1103m920K3261q927Q199n617p970J3545K0250p296N333m878O296J8398
19301A06777L1953J3670m332N78J0894J7134K2322J6072J78j983M906L594K2824
19288B44587J6951K4983K9245Q405Q989P123J4293K4821Q508k224p039J5496J7285
19275D11423J0650J9654O555O776J4750k4566l4732j479K0875J033j5739j9254
19263C95946k2415m142k0519j0312K438m602q252n462m83o563j8987K709j9253
19250B80103j2159n292J3962K4783r29j1569L904j0170k8147m747J6636K6036
19238B92411L912J4847J5102J4683j0369l655J5577J7062L9917K6714%J3803J3531
19225D53535J844O511J9617J9322R661j9222j1238J0555J183l4841l8302j3116
$$ plain form
19213 405509 392117 387805 385584 365670 339511 314071 304049 290336 284173 271747 261163 235238
19201 235238 231536 222617 205507 190853 171070 175628 170990 162525 159780 138214 118483 129173 139661
19188 139661 132697 133061 118375 109517 110596 87094 76627 77222 59626 38792 40138 54052 58386
19175 58386 76371 68736 77972 87218 79969 67362 67703 73210 62613 56562 57775 59220 57839 33202
19161 33202 21907 19992 31906 60409 67618 72433 68975 60247 46658 39999 31272 41318 51291
19148 51291 52054 52706 57585 31727 26708 39554 62042 45616 48566 42376 36416 49366 42824 37134
19134 37134 40334 43719 43495 41282 46815 39682 35040 24443 22298 20873 32561 34429 48392 45954
19120 45954 32922 18891 18211 12854 10375 29963 33870 35707 40702 34868 38942 40255 33699 39760
$$ packed form
19213D05509j3392m312k221j9914k6159k5440j0022j3713o163j2426j0584k5925
19201B35238l702q919j7110j4654j9783M558m638q465k745k1566j9731J0690J0488
19188A39661o964L64j4686q858J079k3502j0467N95j7596k0834J346J3914M334
19175E8386J7985p635R236R246p249j2607L41N507j0597o051J213J445j381k4637
19161C3202j1295j915J1914K8503P209M815l458q728j3589o659q727J0046R973
19148E1291P63O52M879k5858n019J2846K2488j6426K950o190n960J2950o542n690
19134C7134L200L385k24k213N533p133m642j0597k145j425J1688J868J3963k438
19120D5954j3032j4031o80n357k479J9588L907J837M995n834M074J313o556O061
$$ plain form
19106 39760 48774 37893 29386 42600 53214 54907 45936 43178 32898 15341 21624 30148 33196
19093 33196 34000 28821 6034 2172 30096 57639 55755 31684 22153 17901 13755 5518 12485 37037
19079 37037 48392 39009 22860 13785 20134 9839 5282 7413 22854 22522 28956 18702 9305
19066 9305 19222 24001 22901 20169 16649 27143 19172 15929 30500 10282 24058 34932 36173
19053 36173 35600 28034 25718 16460 18064 27769 38213 22317 23632 24250 38765 37544 35941 38223
19039 38223 23432 22083 40367 31108 20499 17583 6114 -11748 -3377 -176 26119 37248 50030
19026 50030 37698 36639 35378 38217 45064 42719 23049 7355 1926 1197 1707 -798 14044 34383
19012 34383 26012 34631 40553 30646 8219 -3254 10235 29541 42476 42075 27497 5318 13021
$$ packed form
19106C9760R014j0881q507J3214J0614J693q971k758j0280j7557O283Q524L048
19093C3196Q04n179k2787l862K7924K7543j884k4071r531m252m146q237O967K4552
19079C7037J1355r383j6149r075O349j0295m557K131J5441l32O434j0254r397
19066I305R917M779j100k732l520J0494p971l243J4571k0218J3776J0874J241
19053C6173n73p566k316r258J604R705J0444j5896J315O18J4515j221j603K282
19039C8223j4791j349J8284r259j0609k916j1469j7862Q371L201K6295J1129J2782
19026E0030j2332j059j261K839O847k345j9670j5694n429p29N10k505J4842K0339
19012C4383q371Q619N922r907k2427j1473J3489J9306J2935m01j4578k2179P703
$$ plain form
18999 13021 13105 12601 5800 8783 31140 42813 55960 53079 23186 14384 16880 8912 6030 2736
18985 2736 12803 27876 31404 17902 13668 8574 23785 35784 51909 42149 19842 19952 25903
18972 25903 39585 44254 18567 4385 12746 16463 22167 25961 35980 38070 23596 48331 66632
18959 66632 39928 13886 67 -125 -5021 12901 35932 32152 40800 38334 28696 21116 17285
18946 17285 18367 27569 43558 46912 43511 13168 -9643 4296 10021 16750 18806 27871 34782
18933 34782 38680 49894 48029 47804 34450 39696 36034 28528 10380 6020 7570 19558 29698
18920 29698 27074 25287 32813 49128 37610 14761 16209 21898 54757 53980 48070 60970 45609
18907 45609 30093 34802 10329 -1270 4595 16435 8655 16002 32474 45607 47368 53741 57984
$$ packed form
18999A3021Q4n04o801K983K2357J1673J3147k881k9893q802K496p968k882l294
18985B736J0067J5073L528j3502m234n094J5211J1999J6125r760k2307J10N951
18972B5903J3682M669k5687j4182Q361L717N704L794J0019K090j4474K4735J8301
18959F6632k6704k6042j3819j92m896J7922K3031l780Q648k466r638p580l831
18946A7285J082R202J5989L354l401l0343k2811J3939N725O729K056R065O911
18933C4782L898J1214j865k25j3354N246l662p506j8148m360J550J1988J0140
18920B9698k624j787P526J6315j1518k2849J448N689L2859p77n910J2900j5361
18907D5609j5516M709k4473j1599N865J1840p780P347J6472J3133J761O373M243
$$ plain form
18894 57984 59424 63798 54958 52925 61496 53920 49451 54697 53700 43873 52394 42633 47899 34846
18880 34846 42324 40778 35093 41587 38149 22848 23266 36059 48377 45266 28538 8911 2915
18867 2915 -107 20539 28498 19273 15999 35454 56167 57035 44962 37620 35017 42001 42752 26680
18853 26680 18577 29945 24411 16960 10258 13701 16485 21046 27599 10768 4601 29892 29243 24581
18839 24581 42221 49815 30060 29815 21707 7997 1747 -9271 -3295 -1953 5307 9184 17361 24032
18825 24032 20399 10538 16449 28110 15339 17157 20057 14204 7713 -9263 2861 8327 4495
18812 4495 21032 39095 42964 37636 8558 1175 3288 -6700 6537 11143 17145 11034 24142
18799 24142 28902 15642 8791 10181 10425 8468 22696 41720 61064 69097 52514 53187 51091 65907
$$ packed form
18894E7984J440M374q840k033Q571p576m469N246r97r827Q521r761N266j3053
18880C4846P478j546n685O494l438j5301M18J2793J2318l111j6728j9627n996
18867B915l022K0646P959r225l274J9455K0713Q68j2073p342k603O984P51j6072
18853B6680q103J1368n534p451o702L443K784M561O553j6831o167K5291o49m662
18839B4581J7640P594j9755k45q108j3710o250j1018N976J342P260L877Q177O671
18825B4032l633r861N911J1661j2771J818K900n853o491j6976J2124N466l832
18812D495J6537J8063L869n328k9078p383K113r988J3237M606O002o111J3108
18799B4142M760j3260o851J390K44j957J4228J9024J9344Q033j6583O73k096J4816
$$ plain form
18785 65907 72550 64753 47082 46056 54582 40968 34214 57955 59485 36534 41035 51066 53638
18772 53638 62989 76904 108640 143820 209109 315936 446017 537669 584020 597494 580713
18761 580713 524934 446548 346057 269770 195859 158225 143489 166074 201267 248053 298048
18750 298048 351875 398168 433665 462716 468741 472018 488000 498647 447636 376451 296575 221064
18738 221064 174119 148069 148378 121187 90504 80502 73754 77005 96364 115775 126405 153589
18726 153589 175510 176164 171000 160139 142530 137672 120379 104565 101496 100236 104802 99547 91771
18713 91771 103852 139532 176172 260084 373747 491280 582250 663821 667712 612408 532948
18702 532948 494038 513847 546865 579301 583506 572106 562448 564504 577108 575632 544688 484223
$$ packed form
18785F5907O643p797j7671j026Q526j3614o754K3741J530k2951M501J0031K572
18772E3638R351J3915L1736L5180O5289J06827J30081R1652M6351J3474j6781
18761E80713n5779p8386j00491p6287p3911l7634j4736K2585L5193M6786M9995
18750B98048N3827M6293L5497K9051O025L277J5982J0647n1011p1185p9876p5511
18738B21064m6945k6050L09k7191l0683j0002o748L251J9359J9411J0630K7184
18726A53589K1921O54n164j0861j7609m858j7293j5814l069j260M566n255p776
18713I1771J2081L5680L6640Q3912J13663J17533R0970Q1571L891n5304p9460
18702E32948l8910J9809L3018L2436M205j1400r658K056J2604j476l0944o0465
$$ plain form
18690 484223 441363 411861 382656 386749 407643 422868 434316 445288 456202 470617 480719 465767
18678 465767 449960 460853 476644 502289 526851 532284 515445 453829 399546 383900 337508 290528
18666 290528 233602 198907 183081 160721 160734 152764 153295 156346 154382 175252 195687 199066 220082
18653 220082 222435 200396 174342 126686 117362 124906 124641 139116 150019 140121 155085 198665 229918
18640 229918 249663 262097 292633 359764 406940 435226 432184 422857 443417 485023 479577 483117
18628 483117 488987 481771 484493 486705 468055 455046 455472 458115 468367 494578 539812 547743 520535
18615 520535 488866 445353 390899 352564 299256 244171 197365 171493 145303 139926 138240 136411
18603 136411 117850 105822 98731 109664 123690 108027 102295 86856 72289 78096 81416 81230 80630
$$ packed form
18690D84223m2860k9502k9205M093K0894J5225J1448J0972J0914J4415J0102j4952
18678D65767j5807J0893J5791K5645K4562N433j6839o1616n4283j5646m6392m6980
18666B90528n6926l4695j5826k2360J3p970N31L051j964K0870K0435L379K1016
18653B20082K353k2039k6054m7656r324P544k65J4475J0903r898J4964M3580L1253
18640B29918J9745J2434L0536O7131M7176K8286l042r327K0560M1606n446L540
18628D83117N870p216K722K212j8650j3009M26K643J0252K6211M5234P931k7208
18615E20535l1669m3513n4454l8335n3308n5085m6806k5872k6190n377j686j829
18603A36411j8561j2028p091J0933J4026j5663n732j5439j4567N807L320j86o00
$$ plain form
18590 80630 68398 71533 74237 63199 84221 89958 76652 58987 69530 74745 66165 79301 81777
18577 81777 71202 43135 56644 84897 76662 56660 31124 54844 75313 85930 105438 112344
18565 112344 96525 84893 78662 60777 45633 40259 49424 59497 77992 82957 84468 83465 88308
18552 88308 60270 51429 69027 63460 72147 75285 76005 77815 97596 95662 102270 108571 107325 107161
18538 107161 107798 113272 115141 99035 99682 114069 127192 139268 123657 116027 115477 119984 115279 109355
18524 109355 108927 101533 91038 87691 82379 70044 79627 82045 90381 93395 90235 95116 98095 103131
18510 103131 98416 94487 99850 108335 95695 91871 103400 113062 119296 107633 113309 134733 136856
18497 136856 115981 102030 81268 84877 97861 92082 76196 82995 82855 84304 94409 87713 112540
$$ packed form
18590H0630j2232L135K704j1038K1022N737j3306j7665J0543N215q580J3136K476
18577H1777j0575k8067J3509K8253q235k0002k5536K3720K0469J0617J9508O906
18565A12344j5819j1632o231j7885j5144n374R165J0073J8495M965J511j003M843
18552H8308k8038q841J7598n567Q687L138P20J810J9781j934O608O301j246j64
18538A07161O37N474J869j6106O47J4387J3123J2076j5611p630n50M507m705n924
18524A09355m28p394j0495l347n312j2335R583K418Q336L014l160M881K979N036
18510A03131m715l929N363Q485j2640l824J1529R662O234j1663N676K1424K123
18497A36856k0875j3951k0762L609J2984n779j5886O799j40J449J0105o696K4827
$$ plain form
18484 112540 137755 137897 120163 124395 109304 107768 110645 113619 120808 109249 110650 113271 121463
18471 121463 117901 92785 94642 93954 90533 111798 129977 135737 153035 170158 180607 197502 195470
18458 195470 172366 168019 187856 205600 216675 211839 197228 208779 220481 236287 233260 233923
18446 233923 267331 307939 368970 400248 407007 399163 377602 370082 365604 354975 343948 341933
18434 341933 341219 339489 320421 317890 334958 346488 349265 343564 336311 354172 359989 397192 430474
18421 430474 460799 484351 500471 516970 541134 559399 563930 575535 589983 587724 586156 589512
18409 589512 597057 616006 627627 651809 669702 685044 716440 725326 719911 716874 718474 705356
18397 705356 695304 673414 651101 629285 592851 564126 562215 576407 571023 546219 539838 537451
$$ packed form
18484A12540K5215J42j7734M232j5091j536K877K974P189j1559J401K621Q192
18471A21463l562k5116J857o88l421K1265J8179N760J7298J7123J0449J6895k032
18458A95470k3104m347J9837J7744J1075m836j4611J1551J1702J5806l027O63
18446B33923L3408M0608O1031L1278O759p844k1561p520m478j0629j1027k015
18434C41933p14j730j9068k531J7068J1530K777n701p253J7861N817L7203L3282
18421D30474L0325K3552J6120J6499K4164J8265M531J1605J4448k259j568L356
18409E89512P545J8949J1621K4182J7893J5342L1396Q886n415l037J600j3118
18397G05356j0052k1890k2313k1816l6434k8725j911J4192n384k4804o381k387
$$ plain form
18385 537451 542247 546347 566102 582033 581993 563558 559487 569062 544844 528273 525619 514241 512409
18372 512409 515784 525029 531512 530962 541156 557532 550713 564023 591298 625740 646282 669291 690124
18359 690124 712808 733024 724163 727859 731398 725018 717796 709048 700352 690851 693951 696754 670669
18346 670669 665401 652678 620087 613270 620849 616840 605165 603088 591336 568429 558746 549768 527263
18333 527263 502257 475742 470606 472499 458444 446201 418244 409278 414270 419235 431230 456526
18321 456526 474871 449798 433100 435279 458260 493207 537099 567622 591014 606316 593767 575165
18309 575165 565694 581054 576586 562833 554983 563720 565601 570138 580743 591857 598436 614497 607028
18296 607028 613283 621109 641786 676366 712873 761844 802556 828254 867993 909284 923416 925820
$$ packed form
18385E37451M796M100J9755J5931m0j8435m071R575k4218j6571k654j1378j832
18372E12409L375R245O483n50J0194J6376o819J3310K7275L4442K0542K3009K0833
18359F90124K2684K0216q861L696L539o380p222q748q696r501L100K803k6085
18346F70669n268j2723l2591o817P579m009j1675k077j1752k2907r683q978k2505
18333E27263k5006k6515n136J893j4055j2243k7957q966M992M965J1995K5296
18321D56526J8345k5073j6698K179K2981L4947M3892L0523K3392J5302j2549j8602
18309E75165r471J5360m468j3753p850Q737J881M537J0605J1114O579J6061p469
18296F07028O255P826K0677L4580L6507M8971M0712K5698L9739M1291J4132K404
$$ plain form
18284 925820 939458 971825 998799 1034378 1086232 1127069 1164739 1193492 1210798 1255909 1354618
18273 1354618 1523144 1792989 2232660 3050314 4099209 4368913 4049706 3424831 2952605
18264 2952605 2738671 2657850 2674448 2810921 3022533 3369564 3958112 4910052 6157034 7548527
18254 7548527 8879708 9869182 10535396 11193728 12511042 15404210 21151557 30513787 41124818
18245 41124818 47546657 47119140 42384391 38240199 36930391 36456546 33623072 28158638
18237 28158638 21962938 16979009 13858451 12374988 12330916 13833196 16884293 20721810
18229 20721810 23844417 24479730 22424682 18679649 14827749 11750019 9580293 8127607
18221 8127607 7135887 6483335 6138441 6053357 6202273 6515872 6970871 7602829 8526824 9875060
$$ packed form
18284I25820J3638L2367K6974L5579N1854M0837L7670K8753J7306M5111R8709
18273A354618J68526K69845M39671Q17654J048895K69704l19207o24875m72226
18264B952605k13934q0821J6598J36473K11612L47031N88548R51940J246982J391493
18254G548527J331181R89474O66214O58332J317314K893168N747347R362230J0611031
18245D1124818O421839m27517m734749m144192j309808m73845k833474n464434
18237B8158638o195700m983929l120558j483463m4072J502280L051097L837517
18229B0721810L122607O35313k055048l745033l851900l077730k169726j452686
18221H127607r91720o52552l44894q5084J48916L13599M54999O31958R23995J348236
$$ plain form
18211 9875060 11751724 14345349 18153367 23999074 32086785 39557843 41777036 38277773
18203 38277773 32139995 26978680 24439019 24310367 25897596 28941643 33812386 41542099
18195 41542099 54226291 75508793 110677752 162748839 224721141 277594003 304818800
18188 304818800 301855537 272601764 226344670 176354500 134909848 109310141 99927946
18181 99927946 98405338 92528256 80969996 68262213 60435479 59390745 63453235 70554136
18173 70554136 79571367 89014940 100686063 116361039 136038492 160460519 189329703
18166 189329703 215684776 233115257 242143523 240100182 223399185 195723771 163655631
18159 163655631 131869841 102279464 76944896 57701437 44826954 36942592 32590283
$$ packed form
18211I875060J876664K593625L808018N845707Q087711P471058K219193l499263
18203C8277773o137778n161315k539661j28652J587229L044047M870743P729713
18195D1542099J2684192K1282502L5168959N2071087O1972302N2872862K7224797
18188C04818800k963263k9253773m6257094m9990170m1444652k5599707r382195
18181I9927946j522608n877082j1558260j2707783p826734j044734M062490P100901
18173G0554136R017231R443573J1671123J5674976J9677453K4422027K8869184
18166A89329703K6355073J7430481R028266k043341j6700997k7675414l2068140
18159A63655631l1785790k9590377k5334568j9243459j2874483p884362m352309
$$ plain form
18152 32590283 30955941 31431521 33063206 35138437 36776094 36450117 34125683 30376164
18144 30376164 25756154 20985665 16718928 13447346 11226468 9801465 8912405 8373011
18136 8373011 8061104 7927818 7962809 8131536 8488159 9199034 10461612 12216566 13950541
18127 13950541 15523860 17388268 19407760 20315989 19893820 18934927 18157209 17434420 16935730
18118 16935730 17302630 18829233 21098710 24313834 28900807 33918853 38902094 44731047
18110 44731047 52999244 65415483 77530352 76996311 66646100 51775769 38736545
18103 38736545 28894826 21690412 16876722 13864955 11752324 10044593 8665957 7641547
18095 7641547 6736181 5812177 4950313 4219730 3626909 3165600 2811090 2566814 2382555
$$ packed form
18152C2590283j634342M75580J631685K075231J637657l25977k324434l749519
18144C0376164m620010m770489m266737l271582k220878j425003q89060n39394
18136H373011l11907j33286L4991J68727L56623P10875J262578J754954J733975
18127A3950541J573319J864408K019492R08229m22169r58893p77718p22789m98690
18118A6935730L66900J526603K269477L215124M586973N018046M983241N828953
18110D4731047Q268197J2416239J2114869n34041j0350211j4870331j3039224
18103C8736545r841719p204414m813690l011767k112631j707731j378636j024410
18095G641547r05366r24004q61864p30583n92821m61309l54510k44276j84259
$$ plain form
18086 2382555 2255032 2143513 2064278 1987057 1909342 1816528 1723652 1676686 1618692 1507709 1367926
18075 1367926 1241034 1161526 1078492 987020 916317 882230 861223 837043 822100 825383 822766
18064 822766 836092 849939 848517 835059 808789 770252 726624 677841 636918 625552 608046 575093
18052 575093 548040 514884 493026 493643 499091 501703 495206 490641 492142 487280 481748 491794 528535
18039 528535 546927 559044 562827 565054 560379 535920 502510 473765 440125 432579 443653 441936
18027 441936 437452 416123 405555 417961 415565 397168 366587 359250 344682 307587 279484 266344
18015 266344 256150 266098 276740 271930 274037 264140 252635 255453 252152 260481 244700 221196 213916
18002 213916 196675 181051 173275 154798 128928 137430 129427 125631 119587 127776 130575 139202 153306
$$ packed form
18086B382555j27523j11519p9235p7221p7715r2814r2876m6966n7994j10983j39783
18075A367926j26892p9508q3034r1472p0703l4087k1007k4180j4943L283k617
18064H22766J3326J3847j422j3458k6270l8537m3628m8783m0923j1366j7506l2953
18052E75093k7053l3156k1858O17N448K612o497m565J501m862n532J0046L6741
18039E28535J8392J2117L783K227m675k4459l3410k8745l3640p546J1074j717
18027D41936m484k1329j0568J2406k396j8397l0581p337j4568l7095k8103j3140
18015B66344j0194R948J0642m810K107r897j1505K818l301Q329j5781k3504p280
18002B13916j7241j5624p776j8477k5870Q502q003l796o044Q189K799Q627J4104
$$ plain form
17989 153306 158464 165423 168828 183626 193114 198393 187151 187011 203973 204036 199185 183846 154148 156717
17975 156717 154171 144794 136190 128992 126037 122769 119445 120988 131563 140198 145884 123312 110105
17962 110105 123891 128579 104523 90313 83618 75552 76175 62282 63130 80639 83693 98657 113611
17949 113611 123800 123462 103982 100038 100524 100580 101903 110084 129068 131732 134362 126464 127934 112352
17935 112352 104819 117850 114224 122863 140729 157141 144665 122379 97864 82722 75920 76564 90456
17922 90456 102896 108841 129563 130483 113375 84382 49820 41797 47380 51100 68905 93321 92298
17909 92298 92156 98352 68597 52894 59698 35390 34044 52498 63253 55898 38941 33651 26180
17896 26180 18625 28139 50426 37371 29368 29691 39027 43276 48924 74903 92115 120578 133154
$$ packed form
17989A53306N158O959L405J4798R488N279j1242j40J6962O3m851j5339k9698K569
17975A56717k546r377q604p198k955l268l324J543J0575Q635N686k2572j3207
17962A10105J3786M688k4056j4210o695q066O23j3893Q48J7509L054J4964J4954
17949A13611J0189l38j9480l944M86N6J323Q181J8984K664K630p898J470j5582
17935A12352p533J3031l626Q639J7866J6412j2476k2286k4515j5142o802O44J3892
17922I0456J2440N945K0722R20j7108k8993l4562q023N583L720J7805K4416j023
17909I2298j42O196k9755j5703O804k4308j346J8454J0755p355j6957n290p471
17896B6180p555R514K2287j3055q003L23R336M249N648K5979J7212K8463J2576
$$ plain form
17883 133154 106149 76631 61549 40771 19942 19745 15651 25087 42510 48901 46292 25622 19939
17870 19939 17746 55773 50079 52824 53388 44817 67175 76740 63475 69978 87842 91445 88757 90288
17856 90288 95247 103770 86938 62551 51832 54948 59003 61433 60519 56993 58751 52107 50018 48360
17842 48360 51226 50077 48423 31237 2544 14042 42898 44753 37560 36534 48751 69909 69530
17829 69530 58808 42428 42617 49732 48357 11600 7506 3513 18093 34606 50228 42944 40965
17816 40965 43411 40093 37349 21986 24517 25006 29312 34046 43396 40893 33378 48792 72085 55462
17802 55462 45982 39979 32687 17896 18519 12838 4024 18423 35341 31148 25303 11130 4837 1892
17788 1892 18758 32867 36738 29567 32554 29675 8291 10195 30862 32545 25117 34425 33296 25180
$$ packed form
17883A33154k7005k9518j5082k0778k0829j97m094R436J7423O391k609k0670n683
17870A9939k193L8027n694K745N64q571K2358R565j3265O503J7864L603k688J531
17856I0288M959Q523j6832k4387j0719L116M055K430r14l526J758o644k089j658
17842D8360K866j149j654j7186k8693J1498K8856J855p193j026J2217K1158l79
17829F9530j0722j6380J89P115j375l6757m094l993J4580J6513J5622p284j979
17816D0965K446l318k744j5363K531M89M306M734R350k503p515J5414K3293j6623
17802E5462r480o003p292j4791O23n681q814J4399J6918m193n845j4173o293k945
17788A892J6866J4109L871p171K987k879k1384J904K0667J683p428R308j129q116
$$ plain form
17774 25180 24379 13161 8763 16246 29547 34406 28920 32303 31563 26210 13257 14791 25808 32990
17760 32990 17536 5291 -11741 -3426 -9289 -5457 -2315 -2505 -5034 1366 7886 15456 21038 24456
17746 24456 18718 20016 13819 20344 20453 18692 16804 28239 42632 62491 71546 73358 60123 39665
17732 39665 24213 25637 23880 26753 36908 20863 11909 24694 28575 31162 59731 80942 86814
17719 86814 120873 169607 225019 318182 439298 519373 554870 535880 448049 385443 329333
17708 329333 278979 262410 268160 320574 400310 478066 537589 553401 526349 453763 380704 334404
17696 334404 329246 361836 388274 399395 363622 302003 244733 202185 160633 154164 146307 125278
17684 125278 112515 104203 104914 110422 119147 143082 188286 215952 235554 253397 299900 366257
$$ packed form
17774B5180q01j1218m398P483J3301M859n486L383p40n353j2953J534J1017P182
17760C2990j5454j2245j7032Q315n863L832L142j90k529O400O520P570N582L418
17746B4456n738J298o197O525J09j761j888J1435J4393J9859R055J812j3235k0458
17732C9665j5452J424j757K873J0155j6045q954J2785L881K587K8569K1211N872
17719H6814L4059M8734N5412R3163J21116Q0075L5497j8990q7831o2606n6110
17708C29333n0354j6569N750N2414P9736P7756N9523J5812k7052p2586p3059m6300
17696C34404n158L2590K6438J1121l5773o1619n7270m2548m1552o469p857k1029
17684A25278j2763q312P11N508Q725K3935M5204K7666J9602J7843M6503O6357
$$ plain form
17672 366257 450064 518758 576089 597037 586152 564021 558325 583025 597471 598240 618715 648616
17660 648616 717309 811424 891155 937977 959760 927433 860277 781265 716009 627596 536473
17649 536473 465315 426882 418615 416734 415415 430675 440353 407238 380386 345229 299475 260647
17637 260647 205794 179710 140037 117003 122872 100089 77134 62264 69786 105548 124362 164242
17625 164242 211421 244918 282120 312928 361269 395811 396346 383028 388485 386476 379655 358153
17613 358153 322405 272577 256428 227921 194991 186442 216913 257814 291492 321154 351661 362599
17601 362599 387271 370483 332641 300060 280374 240535 186564 135308 91557 60813 54843 37778
17589 37778 34074 55700 44036 33203 38239 21270 24937 36456 -3185 -23772 -33864 -19466
$$ packed form
17672C66257Q3807O8694N7331K0948j0885k2131n696K4700J4446P69K0475K9901
17660F48616O8693R4115P9731M6822K1783l2327o7156p9012o5256q8413r1123
17649E36473p1158l8433q267j881j319J5260R678l3115k6852l5157m5754l8828
17637B60647n4853k6084l9673k3034N869k2783k2955j4870P522L5762J8814L9880
17625A64242M7179L3497L7202L0808M8341L4542N35j3318N457k009o821k1502
17613C58153l5748m9828j6149k8507l2930q549L0471M0901L3678K9662L0507J0938
17601C62599K4672j6788l7842l2581j9686l9839n3971n1256m3751l0744n970j7065
17589C7778l704K1626j1664j0833N036j6969L667J1519l9641k0587j0092J4398
$$ plain form
17577 -19466 8600 10855 17160 27552 18509 22627 30704 31862 9778 18509 24324 3420 -5520
17564 -5520 9697 15135 13357 18051 24156 14569 13313 36492 53777 53676 39732 41551 51987 30820
17550 30820 8126 -4721 -19208 -17840 -9153 -13560 -21636 -24148 -28611 -33226 -37393 -28363 -4135
17537 -4135 -1674 -19511 -12545 -16634 -20596 -25831 -24991 -16688 -16224 -11914 8418 23607 19358 14829
17523 14829 -295 -14151 -14093 -831 -20869 -36960 -28185 -10523 -7039 5819 3148 -14435 12075
17510 12075 17253 22126 22944 21431 18055 -1861 -11970 -10694 -2309 9800 26861 15049 -12880
17497 -12880 -14673 -1479 -3937 14914 16346 25896 26161 13905 6878 2916 5783 5689 11424 4515
17483 4515 -4148 -5919 -1088 7327 24837 27356 15601 6964 -4396 3698 2015 12545 25977
$$ packed form
17577a9466K8066K255O305J0392r043M118Q077J158k2084Q731N815k0904q940
17564e520J5217N438j778M694O105r587j256K3179J7285j01j3944J819J0436k1167
17550C0820k2694j2847j4487J368Q687m407q076k512m463m615m167R030K4228
17537d135K461j7837O966m089l962n235Q40Q303M64M310K0332J5189m249m529
17523A4829j5124j3856N8J3262k0038j6091Q775J7662L484J2858k671j7583K6510
17510A2075N178M873Q18j513l376j9916j0109J276Q385J2109J7061j1812k7929
17497a2880j793J3194k458J8851J432R550K65j2256p027l962K867r4N735o909
17483D515q663j771M831Q415J7510K519j1755q637j1360Q094j683J0530J3432
$$ plain form
17470 25977 -1426 9992 12039 5334 11090 10345 7112 12002 9378 -7435 -1141 -2704 -16753 -10567
17456 -10567 4380 -3038 -4263 -76 28288 50911 45026 22323 1659 7123 13485 23064 46294
17443 46294 82295 143566 185492 181398 132615 64906 26704 20612 22230 1401 5436 6273 3519
17430 3519 28805 23063 27599 13300 -7220 9744 -1393 -8675 6281 3371 6519 2088 -4397
17417 -4397 -18409 -5311 -829 19381 39903 22880 5819 1409 -6746 15108 3364 -21348
17405 -21348 -41108 -44317 -34797 -25871 -32299 -30718 -16651 3408 -7545 10231 19540 11538 -1088
17392 -1088 -5885 -12358 -9686 1205 3057 4937 -10842 -11166 11993 17597 5518 7211 10524 21480
17378 21480 13043 7834 5031 -6321 -25793 -30349 -8735 2004 -21667 -45928 -49720 -41260 -55603
$$ packed form
17470B5977k7403J1418K047o705N756p45l233M890k624j6813O294j563j4049O186
17456a0567J4947p418j225M187K8364K2623n885k2703k0664N464O362R579K3230
17443D6294L6001O1271M1926m094m8783o7709l8202o092J618k0829M035Q37k754
17430C519K5286n742M536j4299k0520J6964j1137p282J4956k910L148m431o485
17417d397j4012J3098M482K0210K0522j7023j7061m410q155K1854j1744k4712
17405b1348j9760l209R520Q926o428J581J4067K0059j0953J7776R309q002j2626
17392a088m797o473K672J0891J852J880j5779l24K3159N604j2079J693L313J0956
17378B1480q437n209k803j1352j9472m556K1614J0739k3671k4261l792Q460j4343
$$ plain form
17365 -55603 -75857 -45492 -30320 -24488 -36827 -43224 -32123 -27809 -28337 -19960 -2467 -4490 -26910
17352 -26910 -34393 -15569 -147 21550 15173 4661 -16449 -7828 -10848 -8870 -8928 -29780 -46546
17339 -46546 -41956 -35803 -25382 -30896 -16089 -23321 -38316 -23598 -18204 -1006 -993 -9782 -18857 -29988
17325 -29988 -40561 -26626 -7325 -15214 -29608 -16243 -5091 -13515 -31953 -44293 -11737 24342
17313 24342 27868 6481 -5813 -4772 -2726 -6322 -2910 -5642 3334 247 942 4471 7933 13476
17299 13476 541 -5759 -11341 -23026 -13982 -13270 -31232 -39048 -20176 -29023 -15323 8298 -3048
17286 -3048 -11368 -9087 -3517 -2045 -21637 -34358 -32316 -26448 -44781 -52219 -28510 -23180 -17491 -20006
17272 -20006 -2643 -7176 -13879 14173 22753 15955 6071 4259 -4498 722 6694 -7797 -17804
$$ packed form
17365e5603k0254L0365J5172N832j2339o397J1101M314n28Q377J7493k023k2420
17352b6910p483J8824J5422K1697o377j0512k1110Q621l020J978n8k0852j6766
17339d6546M590O153J0421n514J4807p232j4995J4718N394J7198J3q789r075j1131
17325b9988j0573J3935J9301p889j4394J3365J1152q424j8438j2340L2556L6079
17313B4342L526k1387j2294J041K046l596L412k732Q976l087O95L529L462N543
17299A3476j2935o300n582j1685R044P12j7962p816J8872q847J3700K3621j1346
17286c048q320K281N570J472j9592j2721K042N868j8333p438K3709N330N689k515
17272b0006J7363m533o703K8052Q580o798r884j812q757N220N972j4491j0007
$$ plain form
17259 -17804 -17496 -4228 9400 11020 -8416 -25645 -33118 -21478 -17748 -29193 -22328 -17818 1365
17246 1365 14863 5557 -11989 -36070 -43212 -33638 -17929 -6488 -6798 -6179 -11948 -10877 -13865 -10571
17232 -10571 -27822 -37454 -26274 -25851 -27909 -21901 -27049 -26958 -6372 696 -12711 -43558 -36480 -24872
17218 -24872 -26903 -43955 -36861 -22229 -12007 -35499 -30827 -12933 -11391 -15766 -22486 -32442 -41731
17205 -41731 -34371 -24591 -16541 -6427 -10628 -15825 -19605 -5189 7061 -3222 -15934 -25444 -30387
17192 -30387 -43527 -30158 -16260 -20336 -2416 -7063 -4300 -19199 -25746 1621 10087 -15069 -17857
17179 -17857 -22431 -23723 -10863 3401 5651 17925 12853 -2650 -3547 -1939 5637 -6020 -20616
17166 -20616 -21363 -4888 -2827 -8799 2235 14037 10219 -6737 -8708 -1981 -6100 -14727 -14228 -7432
$$ packed form
17259a7804L08J3268J3628J620j9436j7229p473J1640L730j1445O865M510J9183
17246A365J3498r306j7546k4081p142R574J5709J1441l10O19n769J071k988L294
17232a0571j7251r632J1180M23k058O008n148R1K0586P068j3407l0847P078J1608
17218b4872k031j7052P094J4632J0222k3492M672J7894J542m375o720r956r289
17205d1731P360R780Q050J0114m201n197l780J4416J2250j0283j2712r510m943
17192c0387j3140J3369J3898m076J7920m647K763j4899o547K7367Q466k5156k788
17179a7857m574j292J2860J4264K250J2274n072j5503q97J608P576j1657j4596
17166b0616p47J6475K061n972J1034J1802l818j6956j971O727m119q627M99O796
$$ plain form
17152 -7432 -3747 1171 7441 3043 -1839 14664 31154 41309 37560 29248 14593 -11889 -13336
17139 -13336 -7213 -15647 -16824 -326 6733 16096 19850 -1458 -17052 -19805 -16016 -21683 -15934 -9792
17125 -9792 -11920 -9702 6335 2272 6466 3658 -2380 4511 1783 11928 18983 9898 7877 12050
17111 12050 4130 -13029 -36667 -41798 -31513 -23058 -15350 -15964 -39442 -49560 -31283 -28451 -20001
17098 -20001 -24653 -22668 -9931 -1063 -1410 -12321 -13797 -23540 -25473 -21364 -12537 2271 16511 19800
17084 19800 515 -11004 -20601 -16792 -16828 -4812 -11165 -23125 -36397 -17806 -24028 -17244 -16063
17071 -16063 -16695 -14564 -19595 -20174 -25517 -17340 -32799 -30854 -32442 -17718 19250 8205 -8863 2396
17057 2396 32125 34271 16277 -5658 -265 -14828 -22524 -15243 -2797 -7199 -17511 -9457 -7541
$$ packed form
17152g432L685M918O270m398m882J6503J6490J0155l749q312j4655k6482j447
17139a3336O123q434j177J6498P059R363L754k1308j5594k753L789n667N749O142
17125i792k128K218J6037m063M194k808o038O891k728J0145P055r085k021M173
17111A2050p920j7159k3638n131J0285Q455P708o14k3478j0118J8277K832Q450
17098b0001m652J985J2737Q868l47j0911j476r743j933M109Q827J4808J4240L289
17084A9800j9285j1519r597L809l6J2016o353j1960j3272J8591o222O784J181
17071a6063o32K131n031n79n343Q177j5459J945j588J4724L6968j1045j7068J1259
17057B396K9729K146j7994k1935N393j4563p696P281J2446m402j0312Q054J916
$$ plain form
17044 -7541 -8245 -7824 -13388 -10667 1412 2474 -10036 -9720 -12120 -7646 2767 4585 7877 5388 12758
17029 12758 19785 31610 -7936 -20378 9171 4484 -9044 -10796 -2036 -16074 -19140 -11466 -21957
17016 -21957 -27729 -5174 9829 3784 -7868 -10892 -7044 -850 16680 12779 12457 12447 7851 -480
17002 -480 -8881 -14020 -27153 -15671 -643 -577 -5102 -26222 -28711 -15080 -5891 -9717 -21714 -40898
16988 -40898 -43476 -28248 -18125 6472 15270 11548 7558 6424 8004 -13039 -10823 -7990 -16640
16975 -16640 -24176 -32987 -8350 7921 16987 470 -12615 -11268 -6866 6087 -12211 -22102 -11463
16962 -11463 15925 18999 13165 8634 25395 29548 14096 10730 1172 16815 24108 7173 -4809
16949 -4809 -2530 11085 1127 -12376 -6987 -4725 7415 6762 -9577 -16656 -6923 471 4819 9592
$$ packed form
17044g541p04M21n564K721J2079J062j2510L16k400M474J0413J818L292k489P370
17029A2758P027J1825l9546j2442K9549m687j3528j752Q760j4038l066P674j0491
17016b1957n772K2555J5003o045j1652l024L848O194J7530l901l22j0m596q331
17002d80q401n139j3133J1482J5028O6m525k1120k489J3631R189l826j1997j9184
16988d0898k578J5228J0123K4597Q798l722l990j134J580k1043K216K833q650
16975a6640p536q811K4637J6271R066j6517j3085J347M402J2953j8298r891J0639
16962a1463K7388L074n834m531J6761M153j5452l366r558J5643P293j6935j1982
16949d809K279J3615r958j3503N389K262J2140o53j6339p079R733P394M348M773
$$ plain form
16935 9592 1112 -733 5946 -13400 -41790 -28176 -11284 800 6191 -13217 -30099 -44203 -42313
16922 -42313 -23690 -19097 -13786 -5911 -19585 -17336 -445 6447 -1577 -11416 -5045 -9009 -28950
16909 -28950 -25419 -24670 -4818 -4233 -16651 -26461 -33008 -23552 -3862 -2015 -3790 -2397 -16779 -15824
16895 -15824 -4160 3756 -4900 -7049 -8564 -8764 -3370 -10269 -13952 -3861 3 -3825 13177 15504
16881 15504 4129 8094 290 -730 -13955 -23110 -12286 3268 10006 2078 -25130 -3597 -2433
16868 -2433 -1892 -2168 -12188 -11975 -1015 20093 980 -12694 -15759 -23474 -44076 -28632 10384
16855 10384 19904 20749 2917 -13883 -14735 -20625 -25194 -14457 99 -11248 -5706 3627 -2002 -9342
16841 -9342 -5471 -15465 -46425 -35749 -14895 -5425 9300 14359 4500 -4853 3517 -6448 -13161 -19098
$$ packed form
16935I592q480j845O679j9346k8390J3614J6892J2084N391j9408j6882j4104J890
16922d2313J8623M593N311P875j3674K249J6891O892q024r839O371l964j9941
16909b8950L531P49J9852N85j2418r810o547R456J9690J847j775J393j4382R55
16895a5824J1664P916q656k149j515k00N394o899l683J0091L864l828J7002K327
16881A5504j1375L965p804j020j3225r155J0824J5554O738p928k7208K1533J164
16868b433N41k76j0020K13J0960K1108j9113j3674l065p715k0602J5444L9016
16855A0384R520Q45j7832j6800q52n890m569J0737J4556j1347N542R333n629p340
16841i342L871r994l0960J0676K0854R470J4725N059r859r353Q370r965o713n937
$$ plain form
16827 -19098 -26585 -30559 -25739 -12574 -3826 -27788 -7086 -6499 -10798 -1034 2889 9685 7982 -842
16813 -842 7999 24242 16085 9973 15468 13629 1814 -16831 -4144 10328 6772 -3088 7975
16800 7975 13788 9300 7792 19635 31970 48114 31009 3019 -28521 -24790 -19364 -20093 -3069
16787 -3069 19036 5493 -15388 -7060 -11019 -17644 -8223 16645 10664 2548 6210 18604 10954
16774 10954 -15383 -18068 -16826 -26764 -48256 -26522 -7612 -3124 3445 -135 9776 8862 -2253
16761 -2253 6566 2419 -1476 -7994 -20337 -25536 -19125 -22082 -38454 -38116 -26696 -12238 -11754 1049
16747 1049 3326 -5107 -9539 -8265 -1457 -1861 -5332 -15820 -1711 90 -7903 619 21294 13391
16733 13391 1555 12494 28996 15047 -12780 -32564 -18316 -17993 -21251 -28743 -29999 -10503 11927
$$ packed form
16827a9098p487l974M820J3165Q748k3962K0702N87m299R764L923O796j703q824
16813h42Q841J6243q157o112N495j839j1815j8645J2687J4472l556r860J1063
16800G975N813m488j508J1843J2335J6144j7105k7990l1540L731N426p29J7024
16787c069K2105j3543k0881Q328l959o625R421K4868n981q116L662J2394p650
16774A0954k6337k685J242r938k1492K1734J8910M488O569l580R911r14j1115
16761b253Q819m147l895o518j2343n199O411k957j6372L38J1420J4458M84J2803
16747A049K277q433m432J274O808m04l471j0488J4109J801p993Q522K0675p903
16733A3391j1836J0939J6502j3949k7827j9784J4248L23l258p492j256J9496K2430
$$ plain form
16720 11927 6654 -8599 -13830 -2029 -13987 -24621 -27794 -35518 -20847 -6358 -9235 -12037 4915
16707 4915 -4019 -23664 -34560 -47998 -33621 -33506 -37017 -30007 -34116 -40631 -18135 -16412 3923
16694 3923 -5269 -13609 2271 -7656 -12014 -7693 -13332 10156 22254 34699 46052 23616 8367
16681 8367 803 5422 8928 3508 -7796 -8752 -174 -11191 -18554 -15526 -15427 -3432 1646 5762 -1566
16666 -1566 -18464 -1610 -1543 1635 -4217 -12348 -25572 -32196 -33454 -38338 -32673 -28182 -13651 -7556
16652 -7556 -7814 -424 7603 2280 7264 5984 -2005 -937 -8054 -1293 -5890 -13489 -23396 -10441 8765
16637 8765 6149 8704 15936 -3875 -19407 -31687 -16035 -8454 2212 -4316 -11061 -8908 -998
16624 -998 -15944 -12658 -16190 -22584 -13524 -11350 3149 3373 4953 15625 13168 5219 -2206 -16451
$$ packed form
16720A1927n273j5253n231J1801j1958j0634l173p724J4671J4489k877k802J6952
16707D915q934j9645j0896j3438J4377J15l511P010m109o515K2496J723K0335
16694C923r192q340J5880r927m358M321n639K3488J2098J2445J1353k2436j5249
16681H367p564M619L506n420j1304r56Q578j1017p363L028R9J1995N078M116p328
16666a566j6898J6854O7L178n852q131j3224o624j258m884N665M491J4531O095
16652g556k58P390Q027n323M984j280p989J068p117O761m597p599r907J2955J9206
16637H765k616K555P232j9811j5532j2280J5652P581J0666o528o745K153P910
16624i98j4946L286l532o394R060K174J4499K24J580J0672k457p949p425j4245
$$ plain form
16610 -16451 -8933 -14155 -10979 -20986 -37830 -35572 -5008 -3426 1279 9011 -3145 -8203 -17106
16597 -17106 -16624 -7536 -8598 -1711 -24080 -25729 -18580 -26336 -7896 -9850 -6332 -13005 -17502 -16479
16583 -16479 -4566 9687 -6855 -3718 -1344 -12481 55 7611 12834 12568 310 -15240 -27982
16570 -27982 -35165 -37265 -34521 -662 8511 -7409 -537 15108 16480 19996 16960 17632 17163 11836
16556 11836 -5047 -14674 -32570 -40732 -51262 -58044 -45231 -38907 -24467 -7764 -52 274 -3655
16543 -3655 5465 -7522 -15851 -36546 -32900 -21881 -34564 -13997 -11681 -16223 -26265 -15185 1965
16530 1965 7405 3464 -3552 -11607 -17535 7125 -7599 -3022 -4966 -11829 -5651 -14888 -845 -7359
16516 -7359 -16332 -28135 -31204 -7442 7352 3446 -17217 -8690 18347 14815 11012 1271 703 4094
$$ packed form
16610a6451P518n222L176j0007j6844K258L0564J582M705P732j2156n058q903
16597a7106M82R088j062O887k2369j649P149p756J8440j954L518o673m497J023
16583a6479J1913J4253j6542L137K374j1137J2536P556N223k66j2258j5550j2742
16570b7982p183k100K744L3859R173j5920O872J5645J372L516l036O72m69n327
16556A1836j6883r627j7896q162j0530o782J2813O324J4440J6703P712L26l929
16543c655R120j2987q329k0695L646J1019j2683K0567K316m542j0042J1080J7150
16530A965N440l941p016q055n928K4660j4724M577j944o863O178r237J4043o514
16516g359q973j1803l069K3762J4794l906k0663Q527K7037l532l803r741n68L391
$$ plain form
16502 4094 -5581 2817 4529 -4680 -1059 -2541 -16190 -23259 -19943 -8125 -23324 -26564 -22088 -24953
16488 -24953 -20590 -6885 10852 23052 17620 26068 24531 19889 13149 11516 19046 33302 15496
16475 15496 -17299 -26274 -27987 -15107 -3355 -19517 -21665 -19961 -34606 -30038 -19974 -12651 -5539
16462 -5539 1266 12374 25518 -561 -3285 -1989 -2999 -11360 -8523 -1556 510 -4234 -12993 -23937
16448 -23937 -27941 -26215 -5813 -24376 -39773 -28413 -12912 -2875 -5569 2780 16901 22576 27183
16435 27183 -7670 -18766 -22268 -34812 -33828 -33477 -28009 -16507 -15993 -5475 -10484 -6485 -12274 -25307
16421 -25307 -37366 -19958 -3624 -22232 -25692 -29283 -29749 -33547 -20402 -2097 -3247 -18218 -36233
16408 -36233 -28161 3079 13661 -1366 -7333 -25786 -34395 -9576 17538 17160 -1844 -12665 -16369
$$ packed form
16502D094r675Q398J712r209L621j482j3649p069L316J1818j5199l240M476k865
16488b4953M363J3705J7737J2200n432Q448j537m642o740j633P530J4256j7806
16475A5496l2795q975j713J2880J1752j6162k148J704j4645M568J0064P323P112
16462e539O805J1108J3144k6079k724J296j010q361K837O967K066m744q759j0944
16448b3937m004J726K0402j8563j5397J1360J5501J0037k694Q349J4121N675M607
16435B7183l4853j1096l502j2544R84L51N468J1502N14J0518n009L999n789j3033
16421b5307j2059J7408J6334j8608l460l591m66l798J3145J8305j150j4971j8015
16408c6233Q072L1240J0582j5027n967j8453q609K4819K7114l78j9004j0821l704
$$ plain form
16395 -16369 -16445 -6080 -12393 914 16620 -2598 -15858 -14959 -13944 -6658 -18125 -24220 -23887 -28430
16381 -28430 -17687 -15393 -5851 -1966 4205 5486 -4058 -15917 -4455 -1065 4773 -16891 -9358
16368 -9358 -818 -6100 -33977 -38598 -26452 -21509 -14595 -2043 -11618 -21907 -29292 -22217 -19910 -13906
16354 -13906 -25930 -35178 -37778 -30681 -22427 -18019 -16398 -6869 14926 16260 -1993 -4339 -2442 -1179
16340 -1179 -1960 9796 12793 11238 -4828 -21211 -17805 -9278 -12003 -24788 -30558 -15153 -1072
16327 -1072 3679 19310 27834 8641 6640 5860 -13272 -5861 2114 866 9399 12258 13013 10168
16313 10168 10272 4547 -4905 5934 445 -10303 -13747 5182 17187 19094 703 -9758 -1307
16300 -1307 19077 16807 -11096 -19091 -24656 -35063 -39027 -27054 -11641 -30361 -47782 -43442 -32085
$$ packed form
16395a6369p6J0365o313J3307J5706j9218j3260Q99J015P286j1467o095L33m543
16381b8430J0743K294R542L885O171J281r544j1859J1462L390N838k1664P533
16368i358Q540n282k7877m621J2146M943O914J2552r575j0289p385P075K307O004
16354a3906j2024r248k600P097Q254M408J621R529K1795J334j8253k346J897J263
16340a179p81J1756K997j555j6066j6383L406Q527k725j2785n770J5405J4081
16327a072M751J5631Q524j9193k001p80j9132P411P975j248Q533K859P55k845
16313A0168J04n725r452J0839n489j0748l444J8929J2005J907j8391j0461Q451
16300a307K0384k270k7903p995n565j0407l964J1973J5413j8720j7421M340J1357
$$ plain form
16287 -32085 -25897 -33348 -22782 -14391 -18919 -16686 -18241 -24539 -25760 -13820 192 14562 46722
16274 46722 41788 30926 10749 -12294 -27060 -30848 -13880 -2698 11276 11639 14372 18951 21247
16261 21247 5540 -13942 -26440 -17149 -10905 12319 -5704 -36196 -39520 -34276 -27185 -20489 -18206
16248 -18206 -10057 -21695 -26076 -25823 -22517 -28170 -26416 -31269 -33135 -11884 -5483 -16838 -23069 -29508
16234 -29508 -16667 -12580 -5290 4554 3058 2422 -15220 -18199 -12817 -21327 -17692 -9629 1163 4800
16220 4800 2678 2233 -12926 -8213 6748 5870 18479 12333 2809 -7552 -20198 -8610 -3337 5256
16206 5256 14838 10819 5468 6895 10090 -3092 -274 0 11231 7704 3206 14378 19252 9945
16192 9945 11632 12853 13661 7545 11815 15051 6946 -2161 -16490 -8396 -19372 -29403 -25265 -10344
$$ packed form
16287c2085O188p451J0566Q391m528K233j555o298j221J1940J4012J4370L2160
16274D6722m934j0862k0177k3043j4766l788J6968J1182J3974L63K733M579K296
16261B1247j5707j9482j2498R291O244K3224j8023l0492l324N244P091O696K283
16248a8206Q149j1638m381K53L306n653J754m853j866K1251O401j1355o231o439
16234b9508J2841M087P290R844j496o36j7642k979N382q510L635Q063J0792L637
16220D800k122m45j5159M713J4961q78J2609o146r524j0361j2646J1588N273Q593
16206E256R582m019n351J427L195j3182K818K74J1231l527m498J1172M874r307
16192I945J687J221Q08o116M270L236q105r107j4329Q094j0976j0031M138J4921
$$ plain form
16178 -10344 12866 232 -8851 -4805 -9644 -11999 -7968 -7530 -18571 -6309 5578 7876 14919
16165 14919 -2453 -28596 -25469 -20097 -30334 -18980 -10851 -11519 -15202 -9385 3139 6267 -7651
16152 -7651 -24834 -24842 -21598 -12774 -18804 -11973 3510 13078 17418 13955 21797 15028 9694 -6972 2649
16137 2649 27690 23311 16636 -1106 -9744 4925 14285 6199 -2299 -11591 -29401 -30729 -9531
16124 -9531 -2594 -19156 -31807 -24328 -12758 9244 14256 23416 18108 20242 16819 21214 16110 2715
16110 2715 -13645 -23571 -13578 -3380 19584 33930 25192 6793 -20581 -9088 -5689 -2148 -9041
16097 -9041 -27226 -25629 -16877 1391 11553 12577 -2146 -13982 -16765 -23845 18862 16722 -4336
16084 -4336 -10559 -15250 -4807 -6296 -17319 -11354 4941 6741 -5457 -8032 -14277 -27688 -22016
$$ packed form
16178a0344K3210j2634r083M046m839k355M031M38j1041J2262J1887K298P043
16165A4919j7372k6143L127N372j0237J1354Q129o68l683N817J2524L128j3918
16152g651j7183qL244Q824o030O831J5483R568M340l463P842o769n334j6666R621
16137B649K5041m379o675j7742q638J4669R360q086q498r292j7810j328K1198
16124i531O937j6562j2651P479J1570K2002N012R160n308K134l423M395n104j3395
16110B715j6360r926R993J0198K2964J4346q738j8399k7374J1493L399L541o893
16097i041j8185J597Q752J8268J0162J024j4723j1836k783p080M2707k140k1058
16084d336o223m691J0443j489j1023N965J6295J800j2198k575o245j3411N672
$$ plain form
16071 -22016 425 13515 3343 10899 11783 9071 6390 5711 431 -16370 -14112 706 19186
16058 19186 19024 11723 12103 -1070 -12466 -5642 4932 5067 -20790 -27453 -15325 -4884 9795
16045 9795 -488 -8760 8724 12330 15912 11100 9501 -8264 -14901 -5837 7674 18444 22635
16032 22635 82 -15976 -34160 -33414 -13991 -21100 -11099 4379 9388 10500 13180 10221 23178
16019 23178 24839 23255 27575 25656 20689 13390 13480 17255 32645 18473 8423 4342 5157 5048 4969
16004 4969 3228 21196 20770 4845 15773 24639 14576 3420 -177 -7874 1685 -11011 -25926
15991 -25926 -18703 -23195 -56204 -53200 -43677 -31024 -48189 -43307 -37431 -31881 1223 2949 -1803
15978 -1803 12309 16712 10987 4198 13518 24118 -5491 -22746 -6401 -11115 -20099 -20399 -9661
$$ packed form
16071b2016K2441J3090j0172P556Q84k712k681o79n280j6801K258J4818J8480
16058A9186j62p301L80j3173j1396O824J0574J35k5857o663J2128J0441J4679
16045I795j0283q272J7484L606L582m812j599j7765o637R064J3511J0770M191
16032B2635k2553j6058j8184P46J9423p109J0001J5478N009J112K680k959J2957
16019B3178J661j584M320j919m967p299R0L775J5390j4172j0050m081Q15j09p9
16004D969j741J7968m26j5925J0928Q866j0063j1156l597p697R559j2696j4915
15991b5926P223m492l3009L004R523J2653j7165M882N876N550L3104J726m752
15978a803J4112M403n725o789R320J0600k9609j7255J6345m714q984l00J0738
$$ plain form
15965 -9661 -8831 -8249 12903 13122 12557 29407 9255 6008 13820 26733 20574 22557 15769 22
15951 22 2024 9913 19623 4692 -7063 -4698 -7078 316 -8541 8425 12780 7827 2176 5465
15937 5465 12159 8485 6645 731 15452 8858 600 -13446 -11962 -7645 -15538 -7242 -93 6201
15923 6201 16275 26142 8826 -7528 938 -4229 17834 11390 3916 -3932 -17422 -7389 3442
15910 3442 14079 13977 17257 -7028 -17413 -19476 -21287 -21791 -31538 -23651 -14479 -12891 -23617 -20415
15896 -20415 -16996 -12081 2727 5800 23461 33229 34472 34155 19945 11737 25113 24465 4567 8469
15882 8469 12898 10802 4796 950 4970 6988 22343 20216 9921 1802 -7755 -1564 2822 -3974
15868 -3974 -16705 -17627 -23790 -38904 -37431 -32998 -28901 -38806 -21256 -10417 -4483 -8019 239 -5854
$$ packed form
15965i661Q30N82K1152K19n65J6850k0152l247P812J2913o159J983o788j5747
15951B2K002P889R710j4931j1755K365k380P394q857J6966M355m953n651L289
15937E465O694l674j840n914J4721o594q258j4046J484M317p893Q296P149O294
15923F201J0074R867j7316j6354Q466n167K2063o444p474p848j3490J0033J0831
15910C442J0637j02L280k4285j0385k063j811n04r747P887R172J588j0726L202
15896b0415L419M915J4808L073J7661R768J243l17j4210q208J3376o48j9898L902
15882H469M429k096o006l846M020K018J5355k127j0295q119r557O191M386o796
15868c974j2731r22o163j5114J473M433M097r905J7550J0839N934l536Q258o093
$$ plain form
15854 -5854 -21356 -36727 -27024 -19462 -3071 19298 24651 6281 -14557 -29326 -19128 -5637
15842 -5637 -11399 -8433 -10252 -2637 2419 3107 -12719 -36557 -46014 -41699 -21331 11149 17095 -5193
15828 -5193 -3674 5766 11127 7036 4042 -13714 -31498 -12369 15938 15433 13334 852 12862
15815 12862 16371 -3695 -6 686 -3810 -842 -3893 -7412 -5239 5445 -12848 -14846 -10079 -3578
15801 -3578 -1508 -7603 -1767 -4587 -23445 -31376 -32657 -36185 -36029 -21703 10509 20364 7062 -871
15787 -871 6840 20988 3860 -3311 -8990 4814 14865 5006 -1981 -2775 -10986 -4223 7618 10597
15773 10597 11726 -9263 -16250 -14164 -6778 -4764 -10137 -8726 -22330 -28709 -23755 -22590 4525 8888
15759 8888 -4523 -15335 -5237 -4405 -94 -8153 -17273 -14019 -9032 -8055 -12453 -9767 -2817 -6523
$$ packed form
15854e854j5502j5371R703P562J6391K2369N353j8370k0838j4769J0198J3491
15842e637n762K966j819P615N056O88j5826k3838r457M315K0368L2480N946k2288
15828e193J519R440N361m091k994j7756j7784J9129K8307n05k099j2482J2010
15815A2862L509k0066L689O92m496K968l051l519K173J0684j8293j998M767O501
15801c578K070o095N836k820j8858p931j281l528J56J4326L2212R855j3302p933
15787h71P711J4148j7128p171n679J3804J0051r859o987p94q211O763J1841K979
15773A0597J129k0989o987K086P386K014n373J411j3604o379M954J165K7115M363
15759H888j3411j0812J0098Q32M311q059r120L254M987R77m398K686O950l706
$$ plain form
15745 -6523 -17047 -11271 -17317 -7948 -12409 -13809 -4545 -6588 -9055 -19219 -3739 -7650 -25266 -16949
15731 -16949 -15559 -23551 -14913 -1754 2607 -2835 -10282 -19140 -35363 -24166 -4834 -1491 -553 -10256
15717 -10256 -16867 -9874 -8425 -5332 -4054 12956 22017 20228 8027 1243 -6393 -31119 -39759 -27559
15703 -27559 -26715 -4461 6757 -2097 11619 13239 27741 29286 33981 21084 11187 -4185 -14942
15690 -14942 2835 4344 -14528 -11691 -9766 -12180 -12714 -410 -2296 -10810 3651 5409 1488 12877
15676 12877 30133 27383 19489 20664 5601 -7764 -39018 -32968 -9096 -1016 -5226 7415 16415
15663 16415 20795 26330 14620 4627 11392 20072 18315 -12521 -18724 -3605 9438 18331 20968
15650 20968 19416 17792 5289 30142 40371 20906 -343 -22135 -21587 -19648 -20526 -18132 -14809
$$ packed form
15745f523j0524N776o046R369m461j400R264k043k467j0164J5480l911j7616Q317
15731a6949J390p992Q638J3159M361n442p447q858j6223J1197J9332L343R38r703
15717a0256o611O993J449L093J278J7010R061j789j2201o784p636k4726q640J2200
15703b7559Q44K2254J1218q854J3716J620J4502J545M695j2897r897j5372j0757
15690a4942J7777J509j8872K837J925k414n34J2304j886q514J4461J758l921J1389
15676A2877J7256k750p894J175j5063j3365l1254O050K3872Q080m210J2641R000
15663A6415M380N535j1710r993O765Q680j757l0836o203J5119J3043Q893K637
15650B0968j552j624j2503K4853J0229j9465k1249k1792N48J939q78K394L323
$$ plain form
15637 -14809 -11872 -1194 -1162 -6170 -6200 -3586 -10891 -7789 -14135 -26042 -37154 -8991 -12786 -22680
15623 -22680 -13234 9884 -5175 -18644 -6796 -4120 -1523 -1791 13888 17987 14999 5951 -3095
15610 -3095 -4392 2045 11589 27080 33819 25439 18745 26250 34346 18669 -20 -23489 -25908 -10392
15596 -10392 17054 13640 20367 28008 34609 34798 37297 14841 -1357 14450 26642 16099 41528
15583 41528 31308 19700 2766 13567 16761 20432 15991 9422 -15586 -19061 -20684 -12505 -19434
15570 -19434 -17335 -24842 -45404 -36653 -23737 -15106 -8206 -7725 -6521 -1218 6096 7171 4991 401
15556 401 -249 6809 13129 4175 10855 7220 10572 8653 -1913 17208 42467 42429 15093 -5393
15542 -5393 13762 26680 43531 34796 32310 23824 17611 13677 13325 1258 6159 11573 17324 17842
$$ packed form
15637a4809K937J0678L2n008l0K614p305L102o346j1907j1112K8163l795r894
15623b2680R446K3118j5059j3469J1848K676K597k68J5679M099k988r048r046
15610c095j297O437R544J5491O739q380o694P505Q096j5677j8689k3469k419J5516
15596a0392K7446l414O727P641O601J89K499k2456j6198J5807J2192j0543K5429
15583D1528j0220j1608j6934J0801L194L671m441o569k5008l475j623Q179o929
15570a9434K099p507k0562Q751J2916Q631O900M81J204N303P314J075k180m590
15556D01o50P058O320q954O680l635L352j919j0566J9121K5259l8k7336k0486
15542e393J9155J2918J6851q735k486q486o213l934l52j2067M901N414N751N18
$$ plain form
15528 17842 18843 33867 27918 22020 4854 -8462 2694 11427 11868 12730 1965 703 3110 4525
15514 4525 21639 24001 24004 5597 -5259 -4356 7943 6958 -4472 -9976 -2336 -2013 -6147 -14117 -23953
15499 -23953 -14764 -2894 17786 26023 5618 -13374 7165 11673 -12250 -13539 4713 -12658
15487 -12658 -23406 -14334 -23965 -18790 -4992 1632 -9431 -2367 7088 21221 -4942 -10738 -11440
15474 -11440 7893 29731 28589 21771 8482 17903 12650 22000 14582 7200 -2698 -6579 13019
15461 13019 5777 -8314 -21967 -13811 9769 21557 20795 25675 18316 11659 18289 15834 7377 17038
15447 17038 5860 -8786 -12737 -13747 -19158 -2564 16663 36616 22698 5674 8028 -2439
15435 -2439 -11567 -6081 -7500 -12681 -10626 16519 15573 -16137 -26042 -23317 -21998 -25217 -24725 -5929
$$ packed form
15528A7842J001J5024n949n898j7166j3316J1156Q733M41Q62j0765j262K407J415
15514D525J7114K362Lj8407j0856R03J2299r85j1430n504P640L23m134p970r836
15499b3953R189J1870K0680Q237k0405j8992K0539M508k3923j289J8252j7371
15487a2658j0748R072r631N175J3798O624j1063P064R455J4133k6163n796p02
15474a1440J9333K1838j142o818j3289R421n253R350p418p382r898l881J9598
15461A3019p242j4091j3653Q156K3580J1788p62M880p359o657O630k455q457R661
15447A7038j1178j4646l951j010n411J6594J9227J9953j3918j7024K354j0467
15435b439r128N486j419n181K055K7145r46l1710r905K725J319l219M92J8796
$$ plain form
15421 -5929 17753 13778 2068 13078 7976 1962 -8909 -34234 -45709 -46551 -47790 -54000 -43004
15408 -43004 -34121 -33429 -16610 -14745 -12796 -13459 -21386 -1709 16528 31722 32898 31691 21690 17425
15394 17425 28465 43251 50928 36401 21694 13832 8811 18531 13543 8818 1471 19474 4467
15381 4467 -792 -9630 -10848 -9245 -23205 -26233 -28595 -7114 3293 -12094 -9980 6684 14994
15368 14994 7635 -1138 7684 1717 12472 14182 19292 6513 11741 10589 14045 33246 17892
15355 17892 -11690 -12346 14631 24428 19583 11984 10484 16766 19520 5159 1463 7823 6920 23696
15341 23696 24780 16054 17545 9482 6903 12663 23364 18631 10013 34 -7925 -15610 -14333 -15328
15327 -15328 -11690 310 21455 30320 28976 30339 18047 -1245 -17499 -14618 -7922 1329 14000
$$ packed form
15421e929K3682l975j1710J1010n102o014j0871k5325j1475q42j239o210J0996
15408d3004Q883O92J6819J865J949o63p927J9677J8237J5194J176j207j0001m265
15394A7425J1040J4786P677j4527j4707p862n021R720m988m725p347J8003j5007
15381D467n259q838j218J603j3960l028k362K1481J0407j5387K114J6664Q310
15368A4994p359q773Q822n967J0755J710N110j2779N228j152L456J9201j5354
15355A7892k9582o56K6977R797m845p599j500O282K754j4361l696O360r03J6776
15341B3696J084q726J491q063k579N760J0701m733q618r979p959p685J277r95
15327a5328L638J2000K1145Q865j344J363j2292j9292j6254K881O696R251J2671
$$ plain form
15314 14000 26172 32284 15253 21460 29721 28850 17865 19632 12727 2848 -24284 -26844 -17269 -4499
15300 -4499 7608 18284 -11457 -15518 -16297 15470 16269 6771 3816 9588 -3667 -15229 4600
15287 4600 18270 6576 20692 32289 40832 43907 26156 -9 -10928 -14824 -1687 6242 15560
15274 15560 13790 -8317 -15598 -15855 -17723 -9006 -11149 -2866 18975 11182 1226 -4599 -9751 -2130
15260 -2130 8259 7745 29006 14598 15989 6049 12347 3008 -4875 5525 14918 5652 -1259 9531
15246 9531 4028 12210 10731 -5290 6090 6796 -812 1552 2823 -11986 -27930 -25835 -13721 -1661
15232 -1661 -22547 -19455 -15872 -4930 15369 12297 22554 32752 31436 20680 14627 11460 24406
15219 24406 18861 9571 17705 -2039 -4114 -15039 -13548 -427 -1388 -16292 -13003 -2527 -5751
$$ packed form
15314A4000J2172O112j7031O207Q261q71j0985J767o905r879k7132k560R575J2770
15300d499J2107J0676k9741m061p79L1767P99r498k955N772j3255j1562J9829
15287D600J3670j1694J4116J1597Q543L075j7751k6165j0919l896J3137P929R318
15274A5560j770k2107p281k57j868Q717k143Q283K1841p793r956n825n152P621
15260b130J0389n14K1261j4408J391r940O298r339p883J0400R393r266o911J0790
15246I531n503Q182j479j6021J1380P06p608K364J271j4809j5944K095J2114J2060
15232a661k0886L092L583J0942K0299l072J0257J0198j316j0756o053l167J2946
15219B4406n545r290Q134j9744k075j0925J491J3121r61j4904L289J0476l224
$$ plain form
15206 -5751 -12766 -1778 -2041 -18475 -17603 -19429 -13277 -6218 -33987 -34895 -16966 -7848 32525 34885
15192 34885 34522 48460 47213 27481 29400 22161 10177 -2505 -4300 -475 -6964 -17525 -3755
15179 -3755 7592 1839 -6428 -1941 8371 17878 16569 2151 -3751 6900 8052 -6391 18145
15166 18145 15341 7810 6666 1686 7252 -8201 -16780 -14264 -3839 17264 24774 2149 -3751
15153 -3751 -20060 -19240 -20854 -36153 -38158 -12729 9716 20249 35123 17069 19407 35280 36179
15140 36179 25002 9916 15499 10283 -5235 3995 -3828 11898 41192 27875 26232 15025 4736
15127 4736 -8083 -27930 -38636 -34168 -18541 -8306 5571 1143 -10800 -19103 -25934 -30849 -27562
15114 -27562 -9364 -52 -12819 1004 11216 17348 8181 13134 11484 13091 1143 17916 20536
$$ packed form
15206e751p015J0988k63j6434Q72j826O152P059k7769r08J7929R118M0373K360
15192C4885l63J3938j247j9732J919p239j1984j2682j795L825o489j0561J3770
15179c755J1347n753q267M487J0312R507j309j4418n902J0651J152j4443K4536
15166A8145k804p531j144m980N566j5453q579K516J0425K1103P510k2625n900
15153c751j6309Q20j614j5299k005K5429K2445J0533J4874j8054K338J5873Q99
15140C6179j1177j5086N583n216j5518R230p823J5726K9294j3317j643j1207j0289
15127D736j2819j9847j0706M468J5627J0235J3877m428j1943q303o831m915L287
15114b7562J8198R312j2767J3823J0212O132r167M953j650J607j1948J6773K620
$$ plain form
15101 20536 -11327 -18884 9400 10061 13644 -717 -11559 -10420 6233 -1668 -2952 3743 20796
15088 20796 27850 24720 5334 -948 12247 15862 7288 -17637 -27042 -10859 1657 -4179 6327
15075 6327 36238 31484 37005 35740 10551 15357 21532 26578 30215 46429 41812 32405 35960 22438
15061 22438 16188 -731 -334 6853 3241 12849 30507 38721 16550 4504 10089 2168 -753 -38
15047 -38 5116 19510 27470 13414 -5014 -14799 -4947 4482 2853 5031 811 -2635 3762 6855
15033 6855 -1332 -2055 1984 -7218 -10240 15252 23728 31823 38257 32628 14680 2268 17404 20693
15019 20693 14310 7148 10947 10504 10841 15779 17378 34733 34056 21444 28481 26783 20019 19267 38047
15004 38047 56137 50101 34109 30258 18447 29439 21604 15281 31198 45036 32439 17056
$$ packed form
15101B0536l1863p557K8284O61L583j4361j0842J139J6653p901j284O695J7053
15088B0796P054l130j9386o282J3195L615q574k4925r405J6183J2516n836J0506
15075F327K9911m754N521j265k5189M806O175N046L637J6214m617r407L555j3522
15061B2438o250j6919L97P187l612R608J7658Q214k2171j2046N585p921k921P15
15047c8N154J4394P960j4056j8428r785R852R429j629K178m220l446O397L093
15033F855q187p23M039r202l022K5492Q476Q095O434n629j7948j2412J5136L289
15019B0693o383p162L799m43L37M938J599J7355o77j2612P037j698o764p52J8780
15004C8047J8090o036j5992l851j1811J0992p835o323J5917J3838j2597j5383
$$ plain form
14992 17056 17209 -443 3423 33627 31897 9660 432 -13136 -8964 -693 18083 24634 11379
14979 11379 7303 16085 9302 -8132 -19748 -8228 -350 13033 5232 -12605 -10306 -13213 -10106
14966 -10106 -9783 12011 11545 1935 7385 8741 2395 -7121 -4776 -6906 5551 366 2829 12795
14952 12795 20532 16883 9485 3153 2914 -13460 -1839 -10839 -26724 -19483 3707 11204 7946 21612
14938 21612 30506 23953 37489 30263 7123 9581 8996 15423 20740 -9197 -24478 -31518 -51125
14925 -51125 -46716 -13124 4738 -2483 -2558 2594 -3062 6304 5549 20745 28128 38911 54489 55861
14911 55861 46191 19760 6673 14313 21511 51648 70743 57119 26882 31307 53271 49794 37745
14898 37745 20020 -1264 -18019 -8560 2348 -1088 -22295 -15088 262 -115 -268 -6188 -330
$$ packed form
14992A7056J53j7652L866L0204j730k2237r228j3568M172Q271J8776O551j3255
14979A1379m076Q782o783j7434j1616J1520P878J3383p801j7837K299k907L107
14966a0106L23K1794m66r610N450J356o346r516K345k130J2457n185K463R966
14952A2795P737l649p398o332k39j6374J1621r000j5885P241K3190P497l258J3666
14938B1612Q894o553J3536p226k3140K458n85O427N317k9937j5281p040j9607
14925e1125M409L3592J7862p221p5N152n656R366p55J5196P383J0783J5578J372
14911E5861r670k6431j3087P640P198L0137J9095j3624l0237M425K1964l477j2049
14898C7745j7725k1284j6755R459J0908l436k1207P207J5350l77j53n920N858
$$ plain form
14885 -330 -5145 -14890 -14925 4483 15924 15412 13675 13003 5777 7637 1296 -3023 3823 22150 23999
14870 23999 24437 18927 3815 13127 15748 34132 45732 52215 53851 38898 39356 37337 29300 21252
14856 21252 26670 38273 47850 23622 10272 13518 34433 35749 23486 16653 12955 10386 16562
14843 16562 17784 20467 9582 17093 11562 17 15419 17300 27233 27298 30031 17065 30043 27129
14829 27129 12073 21279 21120 15144 -6942 -27856 -32022 -10344 -2533 -11118 -11041 -10354 -21063 -7134
14815 -7134 7946 28557 41781 20695 30033 36850 39473 25415 15609 -3150 -6889 4540 4621
14802 4621 13173 19497 14381 753 4933 7921 -4860 -12580 3496 20100 28163 26906 15095
14789 15095 5420 141 6222 16377 33400 46857 24875 8079 8164 4942 16234 31429 30864
$$ packed form
14885c30m815r745l5J9408J1441n12j737o72p226J860o341m319O846J8327J849
14870B3999M38n510j5112R312K621J8384J1600O483J636j4953M58k019q037q048
14856B1252N418J1603R577k4228j3350L246K0915J316j2263o833l698k569O176
14843A6562J222K683j0885P511n531j1545J5402J881R933O5K733j2966J2978k914
14829B7129j5056R206j59n976k2086k0914m166K1678P811q585P7O87j0709J3929
14815g134J5080K0611J3224k1086R338O817K623j4058r806j8759l739J1429Q1
14802D621Q552O324n116j3628M180K988j2781p720J6076J6604Q063j257j1811
14789A5095r675n279O081J0155J7023J3457k1982j6796Q5l222J1292J5195n65
$$ plain form
14776 30864 8410 1041 23034 37593 36301 29457 8897 21563 39179 26304 8889 15287
14764 15287 16725 19777 25777 21092 9794 29889 39615 37781 55703 58340 26585 15894 26570
14751 26570 17767 16628 27766 21598 15607 31550 40046 45989 40830 33247 20737 16881 16232 28780
14737 28780 28808 16855 32988 47045 35486 30463 32195 42245 34196 44605 53362 32100 4664
14724 4664 5434 -3226 -6943 -2559 13855 19580 22960 36766 29499 22311 12694 18423 12161 8971
14710 8971 5367 28248 47865 26404 15094 13849 15094 23496 43485 38270 46307 44472 57122
14697 57122 59120 40401 2295 746 -11635 -13315 -20172 -4121 -696 -5123 -11210 -7111 14387
14684 14387 912 -12330 -275 11360 20510 4430 1649 6388 22786 21473 32789 21055
$$ packed form
14776C0864k2454p369K1993J4559j292o844k0560J2666J7616j2875j7415O398
14764A5287J438L052O000m685j1298K0095R726j834J7922K637l1755j0691J0676
14751B6570q803j139J1138o168n991J5943Q496N943n159p583j2510l856o49J2548
14737B8780K8j1953J6133J4057j1559n023J732J0050q049J0409Q757k1262k7436
14724D664P70q660l717M384J6414N725L380J3806p267p188r617N729o262l190
14710H971l604K2881J9617k1461j1310j245J245Q402J9989n215Q037j835J2650
14697E7122J998j8719l8106j549j2381j680o857J6051L425m427o087M099K1498
14684A4387j3475j3242J2055J1635R150j6080k781M739J6398j313J1316j1734
$$ plain form
14672 21055 30201 24859 25351 24772 11495 11757 19238 13409 26467 33033 27253 32585 37571 23659
14658 23659 13824 16531 31106 4158 -522 12628 23510 26979 23157 36275 52431 23037 19325
14645 19325 27515 30191 15097 32636 41140 32661 27993 7284 2671 12507 7645 11175 26416
14632 26416 27477 19898 31613 26943 34951 19331 9376 22613 24210 28009 22556 18688 33291
14619 33291 36375 27583 19998 16470 11695 15227 12003 -6294 -13183 -9468 -2780 5066 -4011 1098
14605 1098 -5024 -12431 6738 16666 33237 45690 41773 25005 18338 25283 16976 9233 19413
14592 19413 21403 37738 49722 55227 60485 40242 33111 30463 24331 14881 6380 8592 20466
14579 20466 14524 12585 21092 35438 56610 47759 16651 1526 10534 18994 16965 2655 -3557
$$ packed form
14672B1055R146n342M92n79j3277K62P481n829J3058O566n780N332M986j3912
14658B3659r835K707J4575k6948m680J3150J0882L469l822J3118J6156k9394l712
14645A9325Q190K676j5094J7539Q504q479m668k0709m613R836m862L530J5241
14632B6416J061p579J1715m670Q008j5620r955J3237J597L799n453l868J4603
14619C3291L084q792p585l528m775L532l224j8297o889L715O688P846r077N109
14605A098o122p407J9169R928J6571J2453l917j6768o667O945q307p743J0180
14592A9413J990J6335J1984N505N258k0243p131k648o132r450q501K212J1874
14579B0466n942j939Q507J4346K1172q851l1108j5125R008Q460k029j4310o212
$$ plain form
14566 -3557 -2412 6285 -2763 6494 -1377 -1341 -9049 -22567 20102 29692 37120 39570 28713 11598
14552 11598 3249 19957 34580 17281 13948 11339 6249 -1344 -10289 -6545 10260 22717 23413
14539 23413 33333 39282 47011 52376 60578 64817 65664 53840 42361 41780 55320 67213 46539 26949
14525 26949 29009 30037 22516 175 8865 21637 32547 37890 35080 35464 39405 38648 37872 39609
14511 39609 38110 36246 52561 46594 36593 18991 -3295 161 22738 30570 26616 44866 61563
14498 61563 58676 46477 31017 32610 24982 8440 11707 24558 18144 14400 23746 38173 26631
14485 26631 30161 51998 61862 57617 67959 61945 28378 13769 13903 17401 37396 37806 28085 34343
14471 34343 55966 61976 61596 64538 50945 28338 27736 34492 37025 37410 40307 42748 46083 40358
$$ packed form
14566c557J145Q697r048R257p871L6p708j3518M2669R590P428K450j0857j7115
14552A1598q349J6708J4623j7299l333k609n090p593q945L744J6805J2457O96
14539B3413R920N949P729N365Q202M239Q47j1824j1479n81J3540J1893k0674j9590
14525B6949K060J028p521k2341Q690J2772J0910N343k810L84L941p57p76J737
14511C9609j499j864J6315n967j0001j7602k2286L456K2577P832l954J8250J6697
14498F1563k887j2199j5460J593p628j6542L267J2851o414l744R346J4427j1542
14485B6631L530K1837R864m245J0342o014l3567j4609J34L498J9995M10r721O258
14471C4343K1623O010l80K942j3593k2607o02O756K533L85K897K441L335n725
$$ plain form
14457 40358 49093 57222 65103 71822 67778 65174 67480 80197 92213 77081 72954 78628 83693 96792
14443 96792 117067 137355 145782 147006 168103 187083 198075 209977 227662 254786 312979 390490
14431 390490 491665 634475 834093 1081247 1355221 1619129 1788570 1855080 1848999 1737233
14421 1737233 1538094 1267704 987852 753015 595104 473167 376943 302191 276372 230051
14411 230051 214718 196147 166266 158727 163052 163647 155721 140387 130513 117493 105752 109324 119774
14398 119774 115596 92498 59691 38572 41341 38746 45337 51946 61284 68740 79150 88994 77286
14385 77286 64176 67371 63121 48716 44559 62006 58249 61357 68052 73953 85386 87829 81804
14372 81804 75782 63893 58640 40924 40791 55102 67291 56043 42151 30307 20159 20412 27423
$$ packed form
14457D0358Q735Q129P881O719m044k604K306J2717J2016j5132m127N674N065J3099
14443I6792K0275K0288Q427J224K1097J8980J0992J1902J7685K7124N8193P7511
14431C90490J01175J42810J99618K47154K73974K63908J69441O6510o081j11766
14421A737233j99139k70390k79852k34837j57911j21937r6224p4752k5819m6321
14411B30051j5333j8571k9881p539M325N95p926j5334r874j3020j1741L572J0450
14398A19774m178k3098l2807k1119K769k595O591O609R338P456J0410R844j1708
14385G7286j3110L195m250j4405m157J7447l757L108O695N901J1433K443o025
14372H1804o022j1889n253j7716j33J4311J2189j1248j3892j1844j0148K53P011
$$ plain form
14359 27423 46521 57922 56218 48426 20238 4865 10998 26678 59172 77643 77920 76705 63037
14346 63037 59473 68072 82511 91432 94159 85179 81833 64621 63099 67815 67010 89749 94368 89225
14332 89225 72582 58243 64981 76375 77284 77033 84111 70904 58254 57708 58960 62770 56881 64462
14318 64462 75513 56084 55098 74639 63859 58481 66005 47199 37226 38241 23620 16983 22652
14305 22652 22088 30220 36543 58948 69246 66085 72891 69996 55014 65195 72461 72113 78956 75086
14291 75086 69909 72069 76948 83755 78106 67387 58192 70905 59597 45036 48089 26550 9093
14278 9093 22170 47795 46960 53295 94026 108602 95238 83845 93401 102174 80619 46486 58591
14265 58591 73715 76218 73124 76221 79013 72157 62040 53276 61382 75445 78464 68693 71373 84166
$$ packed form
14359B7423J9098J1401j704p792k8188j5373O133J5680L2494J8471K77j215j3668
14346F3037l564Q599J4439Q921K727q980l346j7212j522M716q05K2739M619n143
14332H9225j6643j4339O738J1394R09k51P078j3207j2650n46J252L810n889P581
14318F4462J1051j9429r86J9541j0780n378P524j8806r973J015j4621o637N669
14305B2652n64Q132O323K2405J0298l161O806k895j4982J0181P266l48O843l870
14291G5086n177K160M879O807n649j0719r195J2713j1308j4561L053k1539j7457
14278I093J3077K5625q35O335M0731J4576j3364j1393R556Q773k1555l4133J2105
14265E8591J5124K503l094L097K792o856j0117q764Q106J4063L019r771K680J2793
$$ plain form
14251 84166 93265 92063 95864 94155 95963 102231 102392 92591 109512 107879 110587 114700 126976 133855
14237 133855 151406 175129 180347 177113 224804 273679 301996 307225 300958 301993 288515 292971 282623
14224 282623 273906 240011 192526 175375 162512 150685 147692 164234 161431 154922 144818 139332
14212 139332 134507 114191 100532 105835 78263 58733 71029 91119 111615 105096 108219 123037
14200 123037 125979 132789 133421 129948 106794 96959 81180 70927 83077 99690 109547 127208 140316
14187 140316 144619 158633 164678 157248 141685 141569 152766 175931 164188 142073 128562 135541 134792
14174 134792 135346 160952 194058 223687 221894 220401 227557 248854 255827 251252 243472 237208 232262
14161 232262 211737 191608 179101 184454 165167 144507 117760 126882 139524 157117 153034 151384
$$ packed form
14251H4166R099j202L801j709J808O268J61r801J6921j633K708M113J2276O879
14237A33855J7551K3723N218l234M7691M8875K8317N229o267J035j3478M456j0348
14224B82623q717l3895m7485j7151j2863j1827k993J6542k803o509j0104n486
14212A39332m825k0316j3659N303k7572j9530J2296K0090K0496o519L123J4818
14200A23037K942O810O32l473k3154r835j5779j0253J2150J6613R857J7661J3108
14187A40316M303J4014O045p430j5563j16J1197K3165j1743k2115j3511O979p49
14174A34792N54K5606L3106K9629j793j493P156K1297O973m575p780o264m946
14161B32262k0525k0129j2507N353j9287k0660k6747R122J2642J7593m083j650
$$ plain form
14149 151384 153633 168029 159455 158630 152992 142422 133814 137453 149787 145081 146351 160438 195958
14136 195958 208522 196977 203389 219278 219472 214216 214451 211139 214758 216003 208512 203428 230180 243144
14122 243144 255209 265743 249868 236818 226531 211289 219629 229988 216482 199883 218500 231279
14110 231279 228348 227132 238296 245796 274804 296060 317649 341987 368625 382142 407699 427475
14098 427475 436426 415379 416698 416763 400997 389953 399959 407433 406449 415062 415362 414904 408342 406204
14084 406204 396217 401344 410751 429765 437355 440864 443170 444397 454457 442161 437312 444216 456219
14071 456219 482378 503886 515010 532731 535478 533065 538544 553287 552213 563095 579007 585838
14059 585838 583769 604289 615252 631985 645567 672100 715127 748983 783791 801620 824247 830459
$$ packed form
14149A51384K249J4396q574q25n638j0570q608L639J2334m706J270J4087L5520
14136A95958J2564j1545O412J5889J94n256K35l312L619J245p491n084K6752J2964
14122B43144J2065J0534j5875j3050j0287j5242Q340J0359j3506j6599J8617J2779
14110B31279k931j216J1164P500K9008K1256K1589K4338K6638J3517K5557J9776
14098D27475Q951k1047J319O5j5766j1044J0006P474r84Q613L00m58o562k138
14084D06204r987N127R407J9014P590L509K306J227J0060j2296m849O904J2003
14071D56219K6159K1508J1124J7721K747k413N479J4743j074J0882J5912O831
14059E85838k069K0520J0963J6733J3582K6533M3027L3856L4808J7829K2627O212
$$ plain form
14047 830459 815063 820011 842543 875604 887151 900582 919890 943820 981974 1003984 1040534 1069852
14035 1069852 1101506 1151252 1216599 1293232 1393164 1495573 1613908 1711127 1785384 1810848 1817400
14024 1817400 1833884 1852068 1862217 1875664 1923340 1985081 2046796 2125010 2188514 2279270 2382697
14013 2382697 2503587 2646228 2817612 2975969 3154298 3346620 3558061 3804028 4092066
14004 4092066 4388033 4699682 5042905 5421671 5849474 6385563 7015116 7749852 8653366
13995 8653366 9751969 11108696 12802856 14849954 17227915 19940265 23014843 26627602
13987 26627602 31037789 36734329 44442293 55414223 71569171 95425137 128845917
13980 128845917 170576875 215398962 257551268 292861251 317290381 326507634 317776927
$$ packed form
14047H30459j5396M948K2532L3061J1547J3431J9308K3930L8154K2010L6550K9318
14035A069852L1654M9746O5347P6633R9932J02409J18335R7219P4257K5464O552
14024A817400J6484J8184J0149J3447M7676O1741O1715P8214O3504R0756J03427
14013B382697J20890J42641J71384J58357J78329J92322K11441K45967K88038
14004D092066K95967L11649L43223L78766M27803N36089O29553P34736R03514
13995H653366J098603J356727J694160K047098K377961K712350L074578L612759
13987B6627602M410187N696540P707964J0971930J6154948K3855966L3420780
13980A28845917M1730958M4822087M2152306L5309983K4429130R217253q730707
$$ plain form
13973 317776927 293165371 256845972 213223342 168249494 127996738 96312633 73551516
13966 73551516 57802538 46910830 39133965 33363710 28846738 25135053 21965804 19205461
13958 19205461 16769730 14612333 12724455 11128330 9814076 8742941 7848066 7084490
13950 7084490 6419493 5835971 5328055 4878302 4471453 4131387 3824384 3557775 3325446
13941 3325446 3137743 2980226 2831952 2692163 2573592 2460381 2337990 2214479 2084340
13932 2084340 1970378 1848252 1745142 1657622 1575669 1489517 1419455 1371716 1309599 1273838 1245929
13921 1245929 1208068 1174936 1133184 1095100 1055839 1020502 978187 932154 930350 900375 853390
13910 853390 837476 808262 792689 779811 751905 732397 718699 686615 664704 649153 652303 637995
$$ packed form
13973C17776927k4611556l6319399m3622630m4973848m0252756l1684105k2761117
13966G3551516j5748978j0891708p776865n770255m516972l711685l169249k760343
13958A9205461k435731k157397j887878j596125j314254j071135q94875p63576
13950G084490o64997n83522n07916m49753m06849l40066l07003k66609k32329
13941C325446j87703j57517j48274j39789j18571j13211j22391j23511j30139
13932B084340j13962j22126j03110q7520q1953q6152p0062m7739o2117l5761k7909
13921A245929l7861l3132m1752l8084l9261l5337m2315m6033j804k9975m6985
13910H53390j5914k9214j5573j2878k7906j9508j3698l2084k1911j5551L150j4308
$$ plain form
13898 637995 641822 644467 649212 645564 646276 639358 588583 515513 471968 460803 457696 439522 428507
13885 428507 411243 370379 357937 356120 361675 367816 360662 339593 326646 321144 308184 295624
13873 295624 280232 260082 242703 217416 216587 235104 233165 235955 252320 264450 263740 264989 247973
13860 247973 259849 267330 268473 260811 268765 288931 322102 352136 393507 423191 448084 483352
13848 483352 509165 505170 472744 452267 412036 369045 350242 325402 307082 295912 269484 253702
13836 253702 224747 204790 190255 167966 159532 161742 171259 182190 192887 190548 164305 158794
13824 158794 169311 160749 151074 163300 154145 138205 129886 122725 137537 138790 131064 134416 129879
13811 129879 132974 131298 118084 112955 121404 133003 133548 141149 140629 128578 119132 130289 155462
$$ packed form
13898F37995L827K645M745l648P12o918n0775p3070m3545j1165l107j8174j1015
13885D28507j7264m0864j2442j817N555O141p154k1069j2947n502j2960j2560
13873B95624j5392k0150j7379k5287q29J8517j939K790J6365J2130p10J249j7016
13860B47973J1876P481J143p662P954K0166L3171L0034M1371K9684K4893L5268
13848D83352K5813l995l2426k0477m0231m2991j8803k4840j8320j1170k6428j5782
13836B53702k8955j9957j4535k2289q434K210R517J0931J0697k339k6243n511
13824A58794J0517q562r675J2226r155j5940q319p161J4812J253p726L352m537
13811A29879L095j676j3214n129Q449J1599N45P601n20j2051r446J1157K5173
$$ plain form
13798 155462 137180 108613 96518 93115 87804 91630 91350 71145 58190 51946 40939 -5433 -32216
13785 -32216 -48490 -29816 -15877 -13555 -29182 -20961 -1097 21650 37009 33286 47174 50814
13773 50814 43630 48398 35196 24751 17293 -3977 -5652 -2875 3430 8638 8614 9743 21126 31385
13759 31385 50631 55511 60157 58817 58221 64752 87240 75877 58469 59068 60711 73373 61389
13746 61389 45443 35509 26979 30738 38942 56951 58035 67513 57376 47546 38605 25048 30332
13733 30332 16327 20012 8368 33380 35793 19337 32258 43284 58733 67223 72228 81023 66023
13720 66023 79827 84416 79478 64760 39272 23707 34842 54054 51605 40558 42088 46485 28327
13707 28327 10202 13805 32609 37214 38364 47946 44521 46772 43909 40762 26704 30891 25859 16622
$$ packed form
13798A55462j8282k8567j2095l403n311L826k80k0205j2955o244j1007m6372k6783
13785c2216j6274J8674J3939K322j5627Q221J9864K2747J5359l723J3888L640
13773E0814p184M768j3202j0445p458k1270j675K777O305N208k4J129J1383J0259
13759C1385J9246M880M646j340n96O531K2488j1363j7408N99J643J2662j1984
13746F1389j5946r934q530L759Q204J8009J084R478j0137r830q941j3557N284
13733C0332j4005L685j1644K5012K413j6456J2921J1026J5449Q490N005Q795j5000
13720F6023J3804M589m938j4718k5488j5565J1135J9212k449j1047J530M397j8158
13707B8327j8125L603J8804M605J150R582l425K251k863l147j4058M187n032r237
$$ plain form
13693 16622 8275 -105 12919 10739 18393 37161 33916 21615 27335 21665 5683 -5182 -1513
13680 -1513 -8032 -11855 -3301 10448 27555 42424 37230 33350 43069 65471 76965 75305 78048
13667 78048 88084 78360 61969 51662 42700 47030 58226 33570 23860 14459 30447 53766 45321
13654 45321 40984 38533 42084 32414 34148 42551 52634 42405 20417 28449 23171 12232 15736
13641 15736 19320 12804 -4461 -10154 5831 30330 26177 25840 21469 26108 26610 18986 4858 13203
13627 13203 10140 4880 1373 -7221 -4912 -1275 -7206 -8531 -8180 2460 20805 28743 9227 6277
13613 6277 24333 12360 -5541 -5377 27169 36911 28303 4356 -2198 11951 2064 -11213 -3326
13600 -3326 -6649 -110 32788 54629 57813 42372 29666 46622 72992 67511 40729 48615 39769
$$ packed form
13693A6622q347q380J3024k180P654J8768l245j2301N720n670j5982j0865L669
13680a513o519l823Q554J3749J7107J4869n194l880R719K2402J1494j660K743
13667G8048J0036r724j6391j0307q962M330J1196k4656r710r401J5988K3319q445
13654D5321m337k451L551r670J734Q403J0083j0229k1988Q032n278j0939L504
13641A5736L584o516j7265n693J5985K4499m153l37m371M639N02p624j4128Q345
13627A3203l063n260l507q594K309L637n931j325L51J0640J8345P938j9516k950
13613F277J8056j1973j7901J64L2546R742q608k3947o554J4149r887j3277P887
13600c326l323O539L2898K1841L184j5441j2706J6956K6370n481k6782P886q846
$$ plain form
13587 39769 32174 43581 50910 60108 52796 30152 19431 23413 34993 28394 18541 17675 6185
13574 6185 11939 27946 42345 24272 6546 17526 34033 33711 23401 47273 50602 42803 35395
13561 35395 16839 12956 41 -4434 -5351 9399 16978 6277 8435 17618 22947 14107 14695 33498
13547 33498 38883 49916 74752 75499 85058 84764 90908 90153 105501 125366 112211 94381 98491 117703
13533 117703 144637 164126 190115 221616 269179 357842 474000 640272 830090 1036418 1271820
13522 1271820 1476270 1619173 1700791 1703301 1595695 1438880 1249173 1025869 812878 629419
13512 629419 467831 346063 282456 238358 203927 172827 165733 147730 117456 114244 90525
13501 90525 73542 78277 82189 91244 84233 80102 71505 55225 26292 27682 40417 30850 20633
$$ packed form
13587C9769p595J1407P329R198p312k2644j0721L982J1580o599r853q66j1490
13574F185N754J6007J4399j8073j7726J0980J6507l22j0310K3872L329p799p408
13561C5395j8556l883j2915m475r17J4750P579j0701K158R183N329q840N88J8803
13547C3498N385J1033K4836P47R559k94O144p55J5348J9865j3155j7830M110J9212
13533A17703K6934J9489K5989L1501M7563Q8663J16158J66272J89818K06328K35402
13522A271820K04450J42903Q1618K510j07606j56815j89707k23304k12991j83459
13512F29419j61588j21768o3607m4098l4431l1100p094j8003l0274l212k3719
13501I0525j6983M735L912R055p011m131q597j6280k8933J390J2735r567j0217
$$ plain form
13488 20633 29573 32821 29388 28493 25471 17471 27147 36916 28192 28440 35039 27654 16772 -766
13474 -766 4269 19218 2274 2153 2424 -5379 12263 26481 16053 34999 34190 7329 541 12560
13460 12560 5463 -6049 3829 22156 33513 22738 19164 22746 32323 25413 21575 24475 31282
13447 31282 37557 18588 -4064 -6057 19414 16169 -4115 -5684 -6469 11008 23978 23630 -1754
13434 -1754 -21682 -1587 9446 16407 11180 -1494 -120 6552 15585 11547 928 -11082 -11668
13421 -11668 -25698 -15117 -8041 534 19401 37551 29154 7897 -3831 -10525 -5295 2437 4714
13408 4714 14754 10861 21749 17488 11442 14678 -4363 -7004 247 15268 -11515 -35436 -29720
13395 -29720 -22944 -6067 -4524 -11339 -8467 831 -4579 -8735 5104 4874 3356 6854 15239 11349
$$ packed form
13488B0633Q940L248l433q95l022q000R676R769q724K48O599p385j0882j7538
13474g66N035J4949j6944j21K71p803J7642J4218j0428J8946q09k6861o788J2019
13460A2560p097j1512R878J8327J1357j0775l574L582R577o910l838K900O807
13447C1282O275j8969k2652j993K5471l245k0284j569p85J7477J2970l48k5384
13434a754j9928K0095J1033O961n227j2674J374O672R033m038j0619j2010n86
13421a1668j4030J0581P076Q575J8867J8150q397k1257j1728o694N230P732K277
13408D714J0040l893J0888m261o046L236j9041k641P251J5021k6783k3921N716
13395b9720O776J6877J543o815K872R298n410m156J3839k30j518L498Q385l890
$$ plain form
13381 11349 5537 22233 6113 10217 23561 12396 -5716 -30 13856 10401 11103 12216 12366
13368 12366 99 -18913 -16042 -6239 -10237 -16623 -9698 9591 8274 951 6893 5675 19249
13355 19249 35024 20020 20972 11301 14646 1936 6172 2562 -1125 11025 4936 2100 -5022 4813
13341 4813 1087 -7614 132 4815 -3184 -13936 -14964 -24505 -19337 -4994 -7287 -20621 -26137 -36738
13327 -36738 -39808 -23293 -2866 -4476 -1290 -9495 -6588 11019 -549 -12249 3638 12600 19
13314 19 -5623 -13698 -30620 -62531 -63667 -29760 361 -4007 1586 26591 37785 45517 51327 46673
13300 46673 22754 31866 56005 51252 52250 52866 47298 34124 39179 44261 35539 26047 6474 -9901
13286 -9901 -14266 -14278 1675 14664 17423 19428 20080 26293 31170 25068 19761 29727 39991 33055 19393
$$ packed form
13381A1349n812J6696j6120M104J3344j1165j8112N686J3886l455P02J113J50
13368A2366j2267j9012K871R803l998o386O925J9289j317p323N942j218J3574
13355A9249J5775j5004R52r671L345j2710M236l610l687J2150o089k836p122R835
13341D813l726q701P746M683p999j0752j028r541N168J4343k293j3334n516j0601
13327c6738l070J6515K0427j610L186q205K907J7607j1568j1700J5887Q962j2581
13314A9n642q075j6922l1911j136L3907L0121m368N593K5005J1194P732N810m654
13300D6673k3919R112K4139m753R98O16n568j3174N055N082q722r492j9573j6375
13286i901m365j2J5953J2989K759K005O52O213M877o102n307R966J0264o936j3662
$$ plain form
13271 19393 6993 -2160 19094 34867 18212 2533 -12511 -6462 -4357 3155 4836 5530 -13012
13258 -13012 -24680 -9521 -11642 -1139 1299 -9000 1242 -2489 -23086 -17458 -8965 -15630 -14485
13245 -14485 -22727 -27414 -12951 -8178 -20157 -38019 -42050 -24713 4380 -963 -7390 -12922 -1348
13232 -1348 10738 9476 -5119 -13928 -15097 -16824 1197 9785 -3977 6271 3081 14844 18986
13219 18986 16993 10791 -2508 9242 18812 13554 23029 30487 33810 30076 28531 15383 12111 -938
13205 -938 23913 19191 -7964 -15522 -32059 -43058 -37296 -31004 -36462 -35034 -20866 8497 20399
13192 20399 15275 6329 3067 4281 -636 24569 29434 38519 34159 22566 23976 9439 -1870
13179 -1870 8658 5584 -22232 -21371 -4444 -14104 2561 16079 -4142 -12546 -13019 -13813 -21057 11614
$$ packed form
13271A9393j2400r153K1254J5773j6655j5679j5044O049K105P512J681O94j8542
13258a3012j1668J5159k121J0503K438j0299J0242l731k0597N628Q493o665J145
13245a4485q242m687J4463M773j1979j7862m031J7337K9093n343o427n532J1574
13232a348J2086j262j4595q809j169j727J8021Q588j3762J0248l190J1763M142
13219A8986j993o202j3299J1750R570n258R475P458L323l734j545j3148l272j3049
13205i38K4851m722k7155p558j6537j0999N762O292n458J428J4168K9363J1902
13192B0399n124q946l262J214m917K5205M865R085m360j1593J410j4537j1309
13179a870J0528l074k7816Q61J6927r660J6665J3518k0221q404m73p94p244L2671
$$ plain form
13165 11614 36915 37553 16859 16644 14545 11911 -14300 -15130 -13026 -8659 -3317 3655 -536 -213 14761
13150 14761 16070 8449 -3020 -3710 4122 -7545 -2488 4398 9022 18127 3821 -5382 12366 18840
13136 18840 534 -2706 4754 7501 1606 -12122 -25596 -17270 -3542 -11381 -15387 -6073 -22434
13123 -22434 -39916 -26178 -8666 -1043 -581 -11523 -19687 -24172 -26045 -42895 -33554 -13858 -4273
13110 -4273 -8679 -31087 -28759 -22052 -26267 -28244 -18652 5406 20748 25307 26377 20386 10756 -4708
13096 -4708 -29484 -24031 770 5882 -12318 -8227 -7952 15589 16142 -67 -5790 -7014 -24583 -18908
13082 -18908 -12177 2041 8004 2484 6774 17939 7330 -15288 -25535 -37660 -40068 -32737 -24713
13069 -24713 -13037 -14951 -18255 -28069 -4681 999 -2283 11712 33354 46286 33306 19755 16126
$$ packed form
13165A1614K5301O38k0694k15k099k634k6211q30K104M367N342O972m191L23J4974
13150A4761J309p621j1469o90P832j1667N057O886M624R105j4306r203J7748O474
13136A8840j8306l240P460K747n895j3728j3474Q326J3728p839m006R314j6361
13123b2434j7482J3738J7512P623M62j0942q164m485j873j6850R341J9696R585
13110d273m406k2408K328O707m215j977R592K4058J5342M559J070n991r630j5464
13096d708k4776N453K4801N112j8200M091K75K3541N53j6209n723j224j7569N675
13082a8908O731J4218N963n520M290J1165j0609k2618j0247j2125k408P331Q024
13069b4713J1676j914l304r814K3388N680l282J3995K1642J2932j2980j3551l629
$$ plain form
13056 16126 7273 1355 -1218 9602 16942 11751 5841 1314 13711 21572 26331 17556 3827 1317
13042 1317 -3739 -23620 -22849 -8880 -11931 -6954 -21535 -37886 -21198 -16355 -20575 -31582 -31414 -39784
13028 -39784 -43344 -31430 -28288 1809 6590 5018 16199 19902 8088 11095 -2602 -4855 3410
13015 3410 -257 7830 -2677 -16805 -21295 -11231 -17158 -29838 -28210 -10991 -24021 -24760 -36331
13002 -36331 -32160 -32356 -24944 -5571 -6863 -5670 -31796 -34729 -33147 -32421 -25642 -25935 -29453 -39796
12988 -39796 -21163 -18384 -10547 -19991 -14569 -7967 14882 16929 -7837 -8426 -2508 2226 -3769 -16986
12974 -16986 -24686 -35060 -23943 -20699 -7865 -10069 1493 -1849 -20623 -27572 -26144 -17678 -9638
12961 -9638 7895 14385 10489 -3250 -11300 -33082 -23482 -5498 -20533 -30181 -18469 -5762 16575
$$ packed form
13056A6126q853n918k573J0820P340n191n910m527J2397P861M759q775j3729k510
13042A317n056j9881P71J3969l051M977j4581j6351J6688M843m220j1007J68q370
13028c9784l560J1914L142L0097M781j572J1181L703j1814L007j3697k253Q265
13015C410l667Q087j0507j4128m490J0064n927j2680J628J7219j3030p39j1571
13002c6331M171j96P412J9373j292J193k6126k933J582P26O779k93l518j0343
12988c9796J8633K779P837r444N422O602K2849K047k4766n89N918M734n995j3217
12974a6986p700j0374J1117L244J2834k204J1562l342j8774o949J428Q466Q040
12961i638J7533O490l896j3739q050k1782R600J7984j5035r648J1712J2707K2337
$$ plain form
12948 16575 28623 20894 13197 10334 6162 -356 -2364 -16545 -22998 -12062 5647 5660 20181 24238
12934 24238 23451 30928 22974 2649 -18611 -20615 -20944 -11499 3255 10424 1229 -5482 4129 4236
12920 4236 14133 16306 -3005 -10241 -27326 -14949 963 -5119 -16600 -28739 -18708 -7543 -2876
12907 -2876 -28449 -35590 -37120 -26478 -11398 -11322 -15890 -1366 -8205 -17440 -29315 -9477 -6313 -5414
12893 -5414 -10459 -18084 -17490 -17284 -6891 -2419 -5994 5117 2497 -7410 -18661 -12328 -4953 5007
12879 5007 1758 -2327 -27286 -40473 -11676 13801 12400 -3292 -21593 -28430 -18102 2061 -2658
12866 -2658 -6931 -20300 -14985 10163 -107 -12228 -4319 9711 -7150 -20121 1718 28991
12854 28991 24594 8043 -3970 -4246 -8523 1162 15177 23886 24202 20160 5187 -8769 -364 -19280
$$ packed form
12948A6575J2048p729p697k863m172o518k008j4181o453J0936J7709J3J4521M057
12934B4238p87P477p954k0325k1260k004l29R445J4754P169r195o711R611J07
12920D236R897K173j9311p236j7085J2377J5912o082j1481j2139J0031J1165M667
12907b876k5573p141j530J0642J5080P6m568J4524o839r235j1875J9838L164Q99
12893e414n045p625N94K06J0393M472l575J1111k620r907j1251O333P375R960
12879E007l249m085k4959j3187K8797K5477j401j5692j8301o837J0328K0163m719
12866b658m273j3369N315K5148j0270j2121P909J4030j6861j2971K1839K7273
12854B8991m397j6551j2013k76m277R685J4015Q709L16m042j4973j3956Q405j8916
$$ plain form
12840 -19280 -29456 -19581 -25574 -15331 1213 13644 1570 -7236 -10703 -20361 -24154 -32443 -22144
12827 -22144 -34677 -50318 -25173 1649 -4744 -15365 -25917 -46159 -35218 -18162 -38523 -39246
12815 -39246 -29393 -34024 -36844 -39068 -29276 -27869 -41027 -35039 -25867 -32251 -14581 -3057 -7238 3653
12801 3653 622 9145 -4466 -9490 -2705 13468 5391 8972 -23362 -46303 -13341 -2570 -18861
12788 -18861 -27254 -24354 -22860 -25408 -36836 -41478 -49235 -57717 -39204 -38864 -41523 -40259 -24954 -23081
12774 -23081 -21198 -10315 -8410 -672 -9512 -7623 -495 -16024 -33772 -43574 -33011 -17841 -17761 -8277
12760 -8277 -3563 -10748 -13477 -10358 -2924 -4217 -9088 6981 3305 -8111 -14831 12466 15685 18203
12746 18203 29421 18465 15716 2338 -15598 -14997 -4278 5062 11899 10808 4482 -8646 -36700
$$ packed form
12840a9280j0176R875n993J0243J6544J2431j2074q806l467r658l793q289J0299
12827b2144j2533j5641K5145K6822o393j0621j0552k0242J0941J7056k0361p23
12815c9246R853m631k820k224R792J407j3158N988R172o384J7670J1524m181J0891
12801C653l031Q523j3611n024O785J6173q077L581l2334k2941L2962J0771j6291
12788a8861q393K900J494k548j1428m642p757q482J8513L40k659J264J5305J873
12774b3081J883J0883J905P738q840J889P128j5529j7748r802J0563J5170Q0R484
12760h277M714p185k729L119P434j293m871J6069l676j1416o720K7297L219K518
12746A8203J1218j0956k749j3378j7936O01J0719R340O837j091o326j3128k8054
$$ plain form
12733 -36700 -42245 -30962 -22732 -30328 -24372 -16732 -27045 -29915 -13463 -17606 -41322 -38012 -32789
12720 -32789 -27850 -29360 -33219 -24560 -25558 -19289 -5218 2123 -14889 -126 4676 -1485 3314 939
12706 939 -7359 -15499 -9221 11577 5596 1725 10980 13 -12901 -8020 -5846 -12831 766 766 -85
12691 -85 -24380 -37827 -17727 -2089 -11845 7878 19742 7497 -11301 -15887 10468 20771 20922
12678 20922 17914 8878 6458 4646 -2678 5226 -3453 651 -1723 6730 7035 155 -23835 -44682
12664 -44682 -28615 -9475 18267 12497 -17652 -25420 -16900 -24786 -20665 -8423 -27214 -37483 -26229
12651 -26229 -6463 -5469 -16791 -9797 -24110 -26148 -16590 -3857 -380 -10812 -11203 -6896 -4149 -13472
12637 -13472 -5538 -20051 -40843 -34638 -18122 -13435 -23830 -25251 -21429 -7577 -2259 -2986 -13214
$$ packed form
12733c6700n545J1283Q230p596N956P640j0313k870J6452m143k3716L310N223
12720c2789M939j510l859Q659r98O269J4071P341j7012J4763M802o161M799k375
12706I39q298q140O278K0798n981l871R255j0967j2914M881K174o985J3597%q51
12691h5k4295j3447K0100J5638r756J9723J1864j2245j8798m586K6355J0303J51
12678B0922l008r036k420j812p324P904q679M104k374Q453L05o880k3990k0847
12664d4682J6067J9140K7742n770l0149p768Q520p886M121J2242j8791j0269J1254
12651b6229J9766R94j1322O994j4313k038R558J2733L477j0432l91M307K747r323
12637a3472P934j4513k0792O205J6516M687j0395j421L822J3852N318p27j0228
$$ plain form
12624 -13214 -22365 -17986 -18548 -30944 -14017 -12021 -17102 -9394 -19503 -29463 -37309 -43293 -35043 -41167
12610 -41167 -56665 -54123 -40989 -37823 -26700 -16489 -509 12045 9239 10686 16257 11571 16534
12597 16534 -4835 297 9379 -1239 -5010 -5390 -9235 -19804 -35006 -45552 -23566 -10864 9761
12584 9761 18020 19360 18037 15561 -174 -9533 -13870 103 6601 16033 23818 27540 22991 -2082
12570 -2082 -30928 -15004 -6301 5193 17983 4367 4897 26045 32181 23393 18560 20610 23628
12557 23628 9206 -10945 -19454 -6656 18157 27540 4374 8597 3241 -709 9772 18715 23906
12544 23906 37523 32533 38491 31515 23021 4890 4845 12036 5378 -1396 -177 -4344 -25313 -25381 -9578
12529 -9578 -8623 -5637 -11523 -8304 6032 -6823 -11545 -3595 18839 33033 23452 15258 19758 25504
$$ packed form
12624a3214r151M379n62j2396J6927J996n081P708j0109r960p846n984Q250o124
12610d1167j5498K542J3134L166J1123J0211J5980J2554k806J447N571m686M963
12597A6534k1369N132R082j0618l771l80l845j0569j5202j0546K1986J2702K0625
12584I761Q259J340j323k476j5735r359m337J3973O498R432P785L722m549k5073
12570b082k8846J5924Q703J1494J2790j3616N30K1148O136q788m833K050L018
12557B3628j4422k0151q509J2798K4813R383k3166M223n356l950J0481Q943N191
12544B3906J3617m990N958o976q494j8131m5P191o658o774J219m167k0969o8J5803
12529i578R55K986n886L219J4336j2855m722P950K2434J4194r581q194M500N746
$$ plain form
12515 25504 26999 39264 33406 26796 27842 25531 1114 459 7994 -4050 -8268 -7909 -303 26840
12501 26840 50813 76589 103573 113104 117831 102089 85572 70649 41906 24996 14755 -3043
12489 -3043 4012 25843 40514 26164 22482 10745 -9130 -18106 -9296 5776 21553 4887 -21118
12476 -21118 -6351 13023 8889 11159 22650 24584 14798 9544 610 -1507 5868 3990 -3306 1377
12462 1377 -400 2946 13947 21751 36011 56384 67301 74415 86808 71064 56564 58943 78204
12449 78204 57851 33020 29620 16795 7611 -3441 -10490 1017 13210 -3827 -15085 -14148 -8540
12436 -8540 8983 14411 10850 -2804 -12663 -27455 -39451 -5311 20829 20887 8330 2386 -136
12423 -136 13910 -1279 -23082 -5159 -906 -969 2303 -869 -8993 -7981 4710 17650 10006 20977
$$ packed form
12515B5504J495J2265n858o610J046k311k4417o55P535j2044m218L59P606K7143
12501B6840K3973K5776K6984R531M727j5742j6517j4923k8743j6910j0241j7798
12489c043P055K1831J4671j4350l682j1737j9875q976Q810J5072J5777j6666k6005
12476b1118J4767J9374m134K270J1491J934r786n254q934k117P375j878p296M683
12462A377j777L346J1001P804J4260K0373J0917P114J2393j5744j4500K379J9261
12449G8204k0353k4831l400j2825r184j1052p049J1507J2193j7037j1258R37N608
12436h540J7523N428l561j3654r859j4792j1996L4140K6140N8j2557n944k522
12423a36J4046j5189k1803J7923M253o3L272l172q124J012J2691J2940p644J0971
$$ plain form
12409 20977 26297 16334 4931 -3464 1316 5684 9059 14953 18343 20323 20413 -7968 -26715 -9768
12395 -9768 -12974 -17040 23 -6931 -2065 5599 4525 -9658 -8807 -3815 -5445 30310 44016 24705
12381 24705 -6426 -14910 12076 6193 -14194 -7531 3160 3620 2899 10590 -2301 1623 -4923 -2050
12367 -2050 4728 6824 -2062 -7696 -15014 -23744 -23205 -31927 -18080 3327 4341 6867 27131 22001
12353 22001 27578 24008 7692 4981 4754 12569 18872 11952 -5794 -114 -7109 -9301 -12648 3159
12339 3159 8246 12520 6626 -3744 -13058 -21817 -16836 -9326 -9745 -18959 -19166 -18930 -13227 -551 13449
12324 13449 121 -6263 -9832 -12156 -20261 -8860 9911 28175 18996 14588 5754 20398 27069
12311 27069 15651 21600 10038 -6406 -894 11834 -8208 -31349 -24719 -12172 1470 -2228
$$ packed form
12409B0977N320r963j1403q395M780M368L375N894L390J980R0k8381j8747J6947
12395i768l206m066J7063o954M866P664j074j4183Q51M992j630L5755J3706j9311
12381B4705l1131q484K6986n883k0387O663J0691M60p21P691j2891L924o546K873
12367b050O778K096q886n634p318q730N39q722J3847K1407J014K526K0264n130
12353B2001N577l570j6316k711k27P815O303o920j7746N680o995k192l347J5807
12339C159N087M274n894j0370r314q759M981P510m19r214k07K36N703J2676J4000
12324A3449j3328o384l569k324q105J1401J8771J8264r179m408q834J4644O671
12311B7069j1418N949j1562j6444N512J2728k0042k3141O630J2547J3642l698
$$ plain form
12299 -2228 -2856 -4185 -4830 -27222 -19242 -10927 4987 11372 7796 12046 9086 5829 -8160 -22372
12285 -22372 -18565 -22356 -21870 -21066 -20749 -19674 -29950 -24653 -11905 -27407 -26225 -13580 -10069 -1167
12271 -1167 13279 1919 -15433 -12187 -4957 -3041 -2401 -4316 -23209 -16032 -7491 -4868 1771 -4296
12257 -4296 -16147 -23756 -20410 -5854 -5233 11291 31936 36767 28049 1492 -18221 -34880 -10569
12244 -10569 -3382 18689 22761 10714 18397 39419 34927 12976 23312 15088 -2947 703 8023
12231 8023 10690 5539 7814 5419 6255 -4941 -21202 -25639 -13906 3193 5604 -9908 -3492 -8030
12217 -8030 -10524 -7398 -2290 -3288 15784 30213 14865 15563 24596 22384 12554 2631 1081 4498
12203 4498 608 -14650 -28709 -43968 -42000 -33615 -46829 -53312 -50913 -46053 -29494 -12846 12413
$$ packed form
12299b228o28j329o45k2392P980Q315J5914O385l576M250k960l257j3989j4212
12285b2372L807l791M86Q04L17J075j0276N297J2748j5502J182J2645L511Q902
12271a167J4446j1360j7352L246P230J916O40j915j8893P177Q541K623O639o067
12257d296j1851p609L346J4556O21J6524K0645M831q718k6557j9713j6659K4311
12244a0569P187K2071M072j2047P683K1022m492k1951J0336q224j8035L650P320
12231H023K667n151K275k395Q36j1196j6261m437J1733J7099K411j5512O416m538
12217h030k494L126N108r98J9072J4429j5348O98R033k212r830r923j550L417
12203D498l890j5258j4059j5259J968Q385j3214o483K399M860J6559J6648K5259
$$ plain form
12190 12413 23299 30244 6099 1199 1511 26559 17715 6704 -704 3230 -9602 -18711 -11854
12177 -11854 4168 25470 48272 34022 9138 -17189 -20331 -7225 -16035 -9193 -2698 -5242 8334
12164 8334 -7084 -4549 -8561 -4290 -8610 -16119 -3941 -5613 -12819 -13830 -8048 199 6034 19262
12150 19262 22954 16241 18475 18770 3970 3632 17396 15178 19288 15932 12411 9657 15179 -7023
12136 -7023 3390 22498 12538 -11032 -31265 -26697 661 17815 33116 27053 28372 17758 13161
12123 13161 8925 -12863 -26635 -26037 -28262 -9858 -546 -14646 -5626 -6828 -16722 -24756 -24768 -16202
12109 -16202 3724 7357 28207 41728 21316 28523 12263 -1675 -4599 17911 29430 29085 13626
12096 13626 805 -8535 -20405 -20284 -7743 -18270 -15596 -14830 -6928 2181 684 -7726 -23391 -17580
$$ packed form
12190A2413J0886O945k4145m900L12K5048q844j1011p408L934j2832r109O857
12177a1854J6022K1302K2802j4250k4884k6327l142J3106q810O842O495k544J3576
12164H334j5418K535m012M271m320p509J2178j672p206j011N782Q247N835J3228
12150A9262L692o713K234K95j4800l38J3764k218M110l356l521k754N522k2202
12136g023J0413J9108r960k3570k0233M568K7358J7154J5301o063J319j0614m597
12123A3161m236k1788j3772N98k225J8404R312j4100R020j202r894q034j2Q566
12109a6202J9926L633K0850J3521k0412P207j6260j3938k924K2510J1519l45j5459
12096A3626j2821r340j1870J21J2541j0527K674P66P902R109j497q410j5665N811
$$ plain form
12082 -17580 -16007 -26314 -16597 3409 861 -1453 -19512 -16589 -4085 -4118 4792 10086 6375 -2688
12068 -2688 356 5017 3963 9950 -6882 -15908 -10340 -7291 3200 8015 11641 9125 -6954 -9242
12054 -9242 -14973 1389 10807 4644 6955 19726 13622 8570 8456 2925 4353 9489 19726 1179
12040 1179 -10251 -11504 -12850 -23938 -26090 -20679 -26665 -6961 -9830 -3898 -2787 -3540 -912 4110
12026 4110 935 -15715 -15422 2437 23021 18099 8537 8364 21264 31012 48702 25556 -5630
12013 -5630 -10913 7912 36335 21123 10825 15434 17407 10840 -4653 3198 13104 10933 7434
12000 7434 9503 5526 4325 -1074 -3954 11329 20806 -2314 -19214 -40769 -37132 -34590 -22737
11987 -22737 -7630 -2240 8990 18819 746 -12477 16633 29127 22778 12661 24581 29583
$$ packed form
12082a7580J573j0307R717K0006k548k314j8059K923J2504l3Q910N294l711r063
12068b688L044M661j054N987j6832r026N568L049J0491M815L626k516j6079k288
12054i242n731J6362R418o163K311J2771o104n052j14n531J428N136J0237j8547
12040A179j1430j253j346j1088k152N411n986J9704k869N932J111p53K628N022
12026D110l175j6650K93J7859K0584m922r562j73J2900R748J7690k3146l1186
12013e630n283J8825K8423j5212j0298M609J973o567j5493P851R906k171l499
12000G434K069l977j201n399k880J5283R477k3120j6900k1555L637K542J1853
11987b2737J5107N390J1230R829j8073j3223K9110J2494o349j0117J1920N002
$$ plain form
11975 29583 17530 23538 27380 7470 1321 -10535 -25804 74 34951 47769 23098 9868
11963 9868 2090 3680 26839 33433 22283 3797 5348 18702 19926 24793 35455 18837 19514
11950 19514 24106 1806 -17795 -187 8683 3549 -5867 -2344 7069 -14602 -920 13094 16050
11937 16050 7124 -16755 -17227 -5022 16355 15130 7448 -6025 -6127 3245 24701 17496 22194 39642
11923 39642 34654 19111 20931 12373 -20681 -15045 9404 20306 12714 20269 16519 15180 20936
11910 20936 16830 29990 12585 11713 -2129 -17534 612 -1206 1338 -8595 -8788 -11122 7276
11897 7276 21994 8023 12745 14883 30870 -4032 -22614 -26277 -40490 -43115 -23657 -17504 -23749
11884 -23749 -15016 -2260 5588 11072 -1943 -11919 -11815 -6348 -20400 -11985 -506 8215 -1451 -90
$$ packed form
11975B9583j2053O008L842j9910o149j1856j5269K5878L4877J2818k4671j3230
11963I868p778J590K3159O594j1150j8486J551J3354J224M867J0662j6618O77
11950A9514M592k2300j9601J7608Q870n134r416L523R413k1671J3682J4014K956
11937A6050q926k3879m72J2205K1377j225p682j3473j02R372K1456p205M698J7448
11923C9642m988j5543J820q558l3054N636K4449J0902p592P555l750j339N756
11910B0936m106J3160j7405q72j3842j5405J8146j818K544r933j93k334J8398
11897G276J4718j3971M722K138J5987l4902j8582l663j4213k625J9458O153o245
11884b3749Q733J2756P848N484j3015r976J04N467j4052Q415J1479Q721r666J361
$$ plain form
11870 -90 -9434 -9233 -3377 -3677 11807 26815 20534 9567 19959 7953 -4663 -3197 10049 -4532
11856 -4532 -13261 -9387 -19922 3330 9903 4942 1071 -8951 -5313 2146 -2551 -23146 -21904 8443
11842 8443 14259 20300 4258 487 931 5237 3851 -21332 -35523 -24592 -25267 -19951 -14691 -4957
11828 -4957 -7499 -19393 -29278 -22612 -28587 -43294 -45566 -45208 -23374 3212 15558 31871 20796
11815 20796 -4089 5792 15009 15074 3703 -3444 8979 -5025 -2314 4295 9598 8788 2295 203
11801 203 -20333 -18666 -9996 3485 -1736 -6382 687 -9630 -20869 -17791 1054 24494 14354
11788 14354 594 -4551 8032 17056 12764 13467 18386 6601 -3416 14564 23455 16430 16732 27355
11774 27355 29984 19046 13364 2343 -8697 -11902 -15162 -15512 -12468 -11581 -8212 -1393 -8354 -21168
$$ packed form
11870i0r344K01N856l00J5484J5008o281j0967J0392j2006j2616J466J3246j4581
11856d532q729L874j0535K3252O573m961l871j0022L638P459m697k0595J242L0347
11842H443N816O041j6042l771M44M306j386k5183j4191J0931o75N316N260R734
11828d957k542j1894r885O666n975j4707k272L58K1834K6586J2346J6313j1075
11815B0796k4885R881R217O5j1371p147J2423j4004K711O609N303q10o493k092
11801B03k0536J667Q670J3481n221m646P069j0317j1239L078J8845K3440j0140
11788A4354j3760n145J2583R024m292P03M919j1785j0017J7980Q891p025L02J0623
11774B7355K629j0938n682j1021j1040l205l260l50L044Q87L369O819o961j2814
$$ plain form
11760 -21168 -7455 1924 -1072 -12912 -41341 -51465 -39210 -48660 -47897 -14462 11299 17039 10309
11747 10309 10004 2400 -10271 -9617 -4948 -2935 7337 17638 2632 13321 26145 22622 1348
11734 1348 -9850 2704 -1088 -2867 3604 23616 41839 41905 36789 31794 25358 3673 -3576 -1042
11720 -1042 -1980 -8148 -4026 5675 11883 2008 1719 23966 30534 28477 20421 8046 -13613 -24579
11706 -24579 -22578 -10445 33110 45385 30664 13451 9832 -4487 -9612 3034 -4878 1330 2888
11693 2888 -566 -14273 -10025 4354 1532 -16821 -24739 -15645 -14296 3512 7604 -5028 -11806
11680 -11806 -14094 -29193 -30197 -16868 -12663 -13563 -14800 -29720 -33006 -16312 -6025 -11957 -7630
11667 -7630 -20420 -21205 3034 26738 43090 41348 28510 30916 28551 9146 18572 18899 17209 5078
$$ packed form
11760b1168J3713R379k996j1840k8429j0124J2255r450P63L3435K5761N740o730
11747A0309l05p604j2671O54M669K013J0272J0301j5006J0689J2824l523k1274
11734A348j1198J2554l792j779O471K0012J8223O6n116m995o436k1685p249K534
11720a042r38o168M122R701O208r875k89K2247O568k057q056j2375k1659j0966
11706b4579K001J2133M3555J2275j4721j7213l619j4319n125J2646p912O208J558
11693B888l454j3707M248J4379k822j8353p918R094J349J7808M092j2632o778
11680a1806k288j5099j004J3329M205r00j237j4920l286J6694J0287n932M327
11667g630j2790p85K4239K3704J6352j742j2838K406k365j9405R426L27j690j2131
$$ plain form
11653 5078 -3972 -13926 7375 14210 12521 9617 6001 4549 5331 6249 -7016 -31381 -42083 -43275
11639 -43275 -9007 10834 21167 17231 12495 7121 -5950 -5533 -14117 -6106 9448 1436 4139
11626 4139 2407 2531 23636 26566 5723 -7232 -8386 -16124 -23168 -12994 5778 4040 -4406 -3669
11612 -3669 -9056 -22709 -13072 3273 11778 6289 695 -9222 -10546 -5289 11203 -11016 -18873 -2539
11598 -2539 21122 17977 10626 5293 12309 26457 21735 6968 -5034 -7849 4772 11538 8030
11585 8030 12896 15195 21996 1030 -14257 -20472 -12658 -25994 -4455 9118 -1611 -22776 -14778
11572 -14778 -23314 -21896 -25714 -21508 -2008 -10648 -598 -219 3653 -4738 -2784 24907 35644 18873
11558 18873 23601 14628 1143 927 -8410 -11552 -2094 11172 17278 19713 12725 -4660 -1109 -4434
$$ packed form
11653E078r050r954K1301O835j689k904l616j452P82R18j3265k4365j0702j192
11639d3275L4268J9841J0333l936m736n374j3071M17q584Q011J5554q012K703
11626D139j732J24K1105K930k0843j2955j154p738p044J0174J8772j738q446P37
11612c669n387j3653R637J6345Q505n489n594r917j324N257J6492k2219p857J6334
11598b539K3661l145p351n333P016J4148m722j4767j2002k815J2621O766l508
11585H030M866K299O801k0966j5287o215P814j3336K1539J3573j0729k1165P998
11572a4778q536J418l818M206J9500q640J0050L79L872q391J954K7691J0737j6771
11558A8873M728q973j3485k16r337l142R458J3266O106K435o988j7385L551l325
$$ plain form
11544 -4434 -9367 -9374 -7432 -12986 -19046 -4353 550 2873 19019 3800 3132 583 6051 1713 -18566
11529 -18566 -24589 -19773 6264 19451 1731 -20548 -31753 -19097 -6885 1546 7216 24819
11517 24819 26628 24961 2531 1311 11135 1812 -10937 -7567 -14152 -15633 -10308 -14956 -16036 -17334
11503 -17334 -16901 -10453 -16351 -19594 -9992 -11982 -4650 -6812 790 3743 -5344 -21312 -25687 -11678
11489 -11678 2056 10280 12238 -16354 -17288 -2511 22961 33366 25187 -4583 -2875 2037 7762
11476 7762 8180 11344 -10078 -17123 -3917 15416 6345 -22473 -23420 -10092 -4014 -23330 -16076 -4690
11462 -4690 -7237 -6053 -13820 -14977 1085 9961 14500 13649 -460 -8764 -2124 388 6226 -10754
11448 -10754 3908 9082 1006 -10740 -26121 -30079 -15857 -12991 -8506 440 -2830 -21305 -25334
$$ packed form
11544d434m933pJ942n554o060J4693M903K323J6146j5219o68k549N468m338k0279
11529a8566o023M816K6037J3187j7720k2279j1205J2656J2212Q431N670J7603
11517B4819J809j667k2430j220R824r323j2749L370o585j481N325m648j080j298
11503a7334M33O448n898l243R602j990P332k162P602K953r087j5968m375J4009
11489a1678J3734Q224J958k8592r34J4777K5472J0405q179k9770J708M912N725
11476G762M18L164k1422p045J3206J9333r071k8818r47J3328O078j9316P254J1386
11462d690k547J184p767j157J6062Q876M539q51j4109q304O640K512N838j6980
11448a0754J4662N174q076j1746j5381l958J4222K866M485Q946l270j8475m029
$$ plain form
11435 -25334 -14625 11087 843 -975 -7123 922 -9891 -8546 -6279 -20475 -19557 -25928 -40702
11422 -40702 -32411 -43278 -62407 -28482 -14339 -22539 -33443 402 1622 -31523 -20749 3719
11410 3719 14645 22936 27936 32054 12749 2062 -17249 -33582 -17475 -6345 -10341 -11822 -24095
11397 -24095 -37613 -38289 -18078 8754 22778 37596 30854 21479 16085 3235 -11936 -12196 -4000
11384 -4000 15601 15381 9793 11319 9004 -5334 -9561 -9159 -7583 -9845 -12993 -12862 -5010 -284 7331
11369 7331 6493 -12726 -5562 6599 -511 -7044 -1952 -7234 -3767 -4061 -15029 -24065 -18529 -19956
11355 -19956 -9505 -7503 -2206 544 -734 -27496 -35209 -29919 -26209 -10967 -3293 -12147 -36388
11342 -36388 -35815 -33908 -38283 -26379 -21041 -29641 -32338 -32539 -25186 -12841 -17117 -7346 5870 10413
$$ packed form
11435b5334J0709K5712j0244j818o148Q045j0813J345K267j4196R18o371j4774
11422d0702Q291j0867j9129L3925J4143q200j0904L3845J220l3145J0774K4468
11410C719J0926Q291N000M118j9305j0687j9311j6333J6107J1130l996j481j2273
11397b4095j3518o76K0211K6832J4024J4818o742r375n394j2850j5171k60Q196
11384d000J9601k20n588J526k315j4338m227M02J576k262l148J31P852M726P615
11369G331q38j9219P164J2161p110o533N092n282L467k94j0968r036N536j427
11355a9956J0451K002N297K750j278k6762p713N290L710J5242P674q854k4241
11342c6388N73J907m375J1904N338q600k697k01P353J2345m276R771J3216M543
$$ plain form
11328 10413 5200 6096 11173 2785 -4422 -5519 -6689 -1977 5433 4830 -6059 -7006 19397 28294 22741
11313 22741 16375 24925 15490 -3436 -5915 -13219 -11527 3083 930 -6491 -8232 -2218 11419 6812
11299 6812 9353 8754 -5010 818 4316 20169 25580 40687 42648 38281 14966 22851 20047 6937
11285 6937 -10138 -7010 17273 14514 2606 1365 -8628 -2699 9965 -1960 -13148 -4577 -11631
11272 -11631 -17108 -2203 -6370 -34500 -24995 -1096 18867 35257 39959 25595 15191 18973 -1434
11259 -1434 -11949 10604 28876 9970 -6297 -14269 -19818 -28041 -21701 4673 10151 10664 -12015
11246 -12015 -27140 -21090 -3847 4865 -14924 -22884 -9858 1206 -1260 -11282 -19351 -29776 -36323
11233 -36323 -19331 3202 18887 16121 -16270 -34736 -40663 -29352 -14642 -5095 -11058 -3722 -8835
$$ packed form
11328A0413n213Q96N077q388p207j097j170M712P410o03j0889r47K6403Q897n553
11313B2741o366Q550r435j8926k479p304J692J4610k153p421j741O014J3637m607
11299F812K541n99j3764N828L498J5853N411J5107J961m367k3315P885k804j3110
11285F937j7075L128K4283k759j1908j241r993N929J2664j1925j1188Q571p054
11272a1631n477J4905m167k8130R505K3899J9963J6390M702j4364j0404L782k0407
11259a434j0515K2553J8272j8906j6267p972n549q223O340K6374N478N13k2679
11246a2015j5125O050J7243Q712j9789p960J3026J1064k466j0022q069j0425o547
11233c6323J6992K2533J5685k766l2391j8466n927J1311J4710R547n963P336n113
$$ plain form
11220 -8835 -1791 -8798 2377 -376 -9898 -4759 4054 1367 -3316 29456 57493 49349 24217 -8369
11206 -8369 -21452 -15623 7485 12358 -12982 -19281 -18698 -24127 -21606 -20964 -6051 7437 4507 -60
11192 -60 19706 23713 -6185 5392 20396 19879 23875 16218 3371 -14776 -18999 -13274 -18309 -9086
11178 -9086 -5051 -3334 960 -3594 -3523 -14450 -6522 -14773 -12264 -11341 -15124 -14653 -13827 3783 22706
11163 22706 7080 -9668 -5200 -7646 -16501 -22845 -20185 -31333 -24878 -10375 2213 7094 11787
11150 11787 21624 10778 4420 8141 6815 7715 17422 21426 22719 44908 47151 17456 18584 18938
11136 18938 15061 6818 -12143 -9962 -76 14975 28217 16339 -6528 -9667 -8591 -31073 -32959
11123 -32959 -14417 5052 15471 -839 -18542 -18303 -224 6274 20044 32094 30994 16687
$$ packed form
11220h835P044p007J1175k753r522N139Q813k687m683L2772K8037q144k5132l2586
11206h369j3083N829K3108M873k5340o299N83n429K521O42J4913J3488k930m567
11192f0J9766M007k9898J1577J5004n17L996p657j2847j8147m223N725n035R223
11178i086M035J717M294m554P1j0927P928q251K509R23l783M71Q26J7610J8923
11163B2706j5626j6748M468k446q855o344K660j1148O455J4503J2588M881M693
11150A1787R837j0846o358L721j326R00R707M004J293K2189K243k9695J128L54
11136A8938l877q243j8961K181R886J5051J3242j1878k2867l139J076k2482j886
11123c2959J8542J9469J0419j6310j7703K39J8079O498J3770J2050j100j4307
$$ plain form
11111 16687 26824 20218 896 -5341 -8480 -10882 -19726 -9701 5368 12811 21659 25679 9547
11098 9547 13532 4235 -5369 908 -13742 -22192 -9337 -1632 4059 12328 27336 9500 -3327
11085 -3327 6681 18360 21419 14591 2438 9202 9728 11061 -4124 -7044 -7839 17602 25029 6553
11071 6553 5969 2321 -21162 -17519 -14765 -5927 -12172 4100 15045 2765 -16153 -22317 -25797 -8021
11057 -8021 20913 42732 25961 21570 15904 8075 3046 5224 4498 -6321 59 5228 13049 16303
11043 16303 8679 1749 21780 41363 38959 26692 9822 19746 29559 15456 22568 20806 17105
11030 17105 28024 36623 35101 40278 49828 43807 29099 14481 664 -14278 -12491 -2034 -7417
11017 -7417 -1149 11257 17798 30005 43668 14811 -6598 -9677 6388 7654 3132 9209 2959
$$ packed form
11111A6687J0137o606j9322o237l139k402q844J0025J5069P443Q848M020j6132
11098I547L985r297r604O277j4650q450J2855P705N691Q269J5008j7836j2827
11085c327J0008J1679L059o828j2153O764N26J333j5185k920p95K5441P427j8476
11071F553n84l648k3483L643K754Q838o245J6272J0945j2280j8918o164l480J7776
11057h021K8934K1819j6771m391n666p829n029K178p26j0819O380N169P821L254
11043A6303p624o930K0031J9583k404j2267j6870R924R813j4103P112j762l701
11030A7105J0919Q599j522N177R550o021j4708j4618j3817j4942J787J0457n383
11017g417O268J2406O541J2207J3663k8857k1409l079J6065J266m522O077o250
$$ plain form
11004 2959 8063 6568 7269 -3295 -12423 -4527 -11799 2351 9900 14225 6550 2418 13894 8913
10990 8913 11681 2914 -6922 -8279 9189 13875 2504 -2018 -345 8952 18310 14773 3685 16578
10976 16578 37626 38890 44286 39695 10924 -8668 -1046 5334 -1677 -1455 -2673 5379 15593 4335
10962 4335 -253 8328 27027 32324 22106 7149 5150 5354 -2345 -26 -7650 8194 5328 -3521
10948 -3521 -2394 3441 16028 22040 10566 -2247 -8341 -7042 -5545 -15651 1387 1577 2238 4388
10934 4388 8301 -1718 -41 12560 9319 14510 6993 8014 18791 5828 -10133 6865 14765
10921 14765 8861 3995 -6825 1555 22213 24320 14512 10155 12675 -4815 -29550 -23836 -17734
10908 -17734 -31206 -33284 -8696 -7243 5159 1268 2864 115 10278 10975 6024 5595 15525 -10235
$$ packed form
11004B959N104j495P01j0564r128P896p272J4150P549M325p675m132J1476m981
10990H913K768q767r836j357J7468M686j1371m522J673R297R358l537j1088J2893
10976A6578K1048J264N396m591k8771j9592P622O380p011K22j218Q052J0214j1258
10962D335m588Q581J8699N297j0218j4957j999K04p699K319p624J5844k866q849
10948c521J127N835J2587O012j1474j2813o094J299J497j0106J7038J90O61K150
10934D388L913j0019J677J2601l241N191p517J021J0777j2963j5961J6998P900
10921A4765n904m866j0820Q380K0658K107r808m357K520j7490k4735N714O102
10908a7734j3472k078K4588J453J2402l891J596k749J0163O97m951m29R930k5760
$$ plain form
10894 -10235 -26140 -18512 -5520 15512 13579 -1050 -1220 9454 7535 -2969 6093 2549 2943
10881 2943 24034 38622 32195 20989 10919 2599 10128 32180 36118 39483 50884 41649 31325
10868 31325 25677 9056 217 -12985 -8500 2094 3342 9340 12522 12119 4682 7291 15683 24254
10854 24254 30145 47636 48529 39893 9377 -9939 -11919 -16628 -15296 -14731 15004 31878 21707
10841 21707 20468 26659 35972 31443 15454 18222 11516 4751 9639 2394 17126 13073 8242 18809
10827 18809 27035 26239 23963 17554 12382 640 -7699 -10369 -9581 -2655 8313 4458 1541 -1443
10813 -1443 -12326 -9063 -9209 -15568 -14266 -11388 -15216 -10887 -4786 1399 -23161 -35857 -4929 7227
10799 7227 10543 4432 -5573 -19971 -13477 -2739 22611 32412 19136 8112 1738 21066 33020
$$ packed form
10894a0235j5905P628J2992K1032j933j4629j70J0674j919j0504R062l544L94
10881B943K1091J4588o427j1206j0070q320P529K2052L938L365J1401r235j0324
10868C1325n648j6621q839j3202M485J0594J248N998L182m03p437K609Q392Q571
10854B4254N891J7491Q93q636l0516j9316j980m709J332N65K9735J6874j0171
10841B1707j239O191R313m529j5989K768o706o765M888p245J4732m053m831J0567
10827A8809Q226p96k276o409n172j1742q339k670P88O926J0968l855k917k984
10813a443j0883L263j46o359J302K878l828M329O101O185k4560j2696L0928J2156
10799G227L316o111j0005j4398O494J0738K5350R801j3276j1024o374J9328J1954
$$ plain form
10786 33020 32859 19337 16765 13417 3862 -2266 9756 7706 -4518 4877 11908 6769 -2934 2332
10772 2332 3426 -429 -22108 -8552 24287 25336 30623 40173 24081 5832 9386 10360 70
10759 70 -64 4502 -45 -8226 8272 39453 21493 9175 10477 24432 10822 -7599 -4538 30338
10745 30338 37427 24424 7283 15539 21884 3040 14347 31037 18277 14730 809 1920 15997
10732 15997 6075 7620 -18810 -22056 1380 10488 21661 6477 -10670 -4054 8801 12544 14398
10719 14398 11175 18088 19425 4498 -12216 2418 -2594 1521 -2007 -26936 -19021 -3036 -9752
10706 -9752 -19659 -21189 -28115 -12202 128 -9467 280 15812 13886 -5 18901 26603 38805
10693 38805 58329 61156 51471 42852 42446 38104 37575 18638 3671 -18116 -11062 -3603 -440 1698
$$ packed form
10786C3020j61j3522k572l348r555o128J2022k050j2224R395P031n139r703N266
10772B332J094l855k1679J3556L2839J049N287R550j6092j8249L554R74j0290
10759G0j34M566m547q181J6498L1181j7960j2318J302J3955j3610j8421L061L4876
10745C0338P089j3003j7141Q256O345j8844J1307J6690j2760l547j3921J111J4077
10732A5997r922J545k6430l246K3436R108J1173j5184j7147O616J2855L743J854
10719A4398l223O913J337j4927j6714J4634n012M115l528k4929P915J5985o716
10706i752r907j530o926J5913J2330r595R747J5532j926j3891J8906P702J2202
10693C8805J9524K827r685q619m06m342n29j8937j4967k1787P054P459L163K138
$$ plain form
10679 1698 17162 17285 14930 18048 29703 42732 57200 71822 58233 35429 38794 40634 13688
10666 13688 12539 36357 40855 38473 29634 33837 40705 59747 64137 55120 46900 36297 6268
10653 6268 6589 17897 41834 37079 41117 49231 44513 48965 49268 40539 29601 28017 29721 25607
10639 25607 32401 53919 68310 49263 50060 42892 28683 23767 21728 18741 8331 7409 403 7450
10625 7450 9276 9436 -2641 -8504 5859 -7331 -3400 3873 -574 -2865 13936 15360 27801 32621
10611 32621 40998 14622 3494 21444 32212 33797 37715 14326 14896 19338 18427 7845 5127
10598 5127 10318 15007 20491 27185 41404 37635 34974 45655 38912 31463 44126 37428 16933 3601
10584 3601 3576 -8557 -29308 -17925 -6684 2638 5727 6596 4655 -8299 -15333 8862 32568 28426
$$ packed form
10679A698J5464J23k355L118J1655J3029J4468J4622j3589k2804L365J840k6946
10666A3688j149K3818M498k382q839M203O868J9042M390r017q220j0603l0029
10653F268L21J1308K3937m755M038Q114m718M452L03q729j0938j584J704m114
10639B5607O794K1518J4391j9047P97p168j4209m916k039k987j0410r22p006P047
10625G450J826J60j2077n863J4363j3190L931P273m447k291J6801J424J2441M820
10611C2621Q377k6376j1128J7950J0768J585L918k3389N70M442r11j0582k718
10598E127N191M689N484O694J4219l769k661J0681o743p449J2663o698k0495j3332
10584C601k5j2133k0751J1383J1241R322L089Q69j941j2954p034K4195K3706m142
$$ plain form
10570 28426 8591 16760 13402 1645 -14312 -37646 -19469 23761 46309 43272 42559 36332 27825
10557 27825 33857 42101 46785 60258 59453 40473 21534 8352 1848 11653 11817 12971 -2011 -29226
10543 -29226 -3529 18810 2053 8013 22541 26546 42738 29311 16892 33000 42753 43734 43891
10530 43891 25542 28185 28462 21357 13568 31333 48392 54930 53512 48892 38246 5265 11482
10517 11482 23721 44512 40337 18217 14416 6199 -4316 -1041 10360 5984 26448 42436 44038
10504 44038 26910 10376 3883 -6495 -8734 9826 31665 21707 21048 30488 20938 509 3387
10491 3387 -2692 6243 20101 20172 19450 1898 -6393 11050 34947 38031 17718 25248 25171 33841 42107
10476 42107 39887 31410 27955 19215 7360 16498 32948 57222 42189 32649 62273 50966 35295
$$ packed form
10570B8426j9835Q169l358j1757j5957k3334J8177M3230K2548l037p13o227q507
10557B7825O032Q244M684J3473q05j8980j8939j3182o504R805J64J154j4982k7215
10543b9226K5697K2339j6757N960J4528M005J6192j3427j2419J6108R753R81J57
10530D3891j8349K643K77p105p789J7765J7059O538j418m620j0646l2981O217
10517A1482J2239K0791m175k2120l801q217j0515L275J1401m376K0464J5988J602
10504D4038j7128j6534o493j0378k239J8560K1839r958o59R440r550k0429K878
10491C387o079Q935J3858P1p22j7552q291J7443K3897L084k0313P530p7Q670Q266
10476D2107k220q477l455q740j1855R138J6450K4274j5033r540K9624j1307j5671
$$ plain form
10463 35295 34841 40780 57931 47094 31114 11561 -1795 14217 13396 23339 22135 39006 46053
10450 46053 40375 27471 36591 41963 42779 33620 23487 43216 55690 47995 44090 62313 60305
10437 60305 70324 60247 44399 41648 48408 58069 52755 35266 13613 29681 55300 44482
10425 44482 13886 18829 17460 35777 53966 79386 84460 69615 63854 52917 45879 45202 65856
10412 65856 69704 54504 38517 33021 44958 65757 64250 70983 69786 63785 57038 35820 34130
10399 34130 28701 23726 15061 15667 39375 29465 18677 41457 57745 46987 40924 59183 76686
10386 76686 68036 57169 44047 29422 28917 51009 60517 65536 63174 56228 43070 30609 29602
10373 29602 33563 36056 14874 12630 17664 25131 17173 19536 26639 41538 52632 47164 30896
$$ packed form
10463C5295m54N939J7151j0837j5980j9553j3356J6012q21R943j204J6871P047
10450D6053n678j2904R120N372Q16r159j0133J9729J2474p695l905J8223k008
10437F0305J0019j0077j5848k751O760R661n314j7489k1653J6068K5619j0818
10425D4482l0596M943j369J8317J8189K5420N074j4845n761j0937p038o77K0654
10412F5856L848j5200j5987n496J1937K0799j507O733j197o001o747k1218j690
10399C4130n429m975q665O06K3708r910j0788K2780J6288j0758o063J8259J7503
10386G6686q650j0867j3122j4625n05K2092R508N019k362o946j3158j2461j007
10373B9602L961K493k1182k244N034P467p958K363P103J4899J1094n468j6268
$$ plain form
10360 30896 21129 20565 22865 30857 41121 47061 59530 65879 59073 34750 23508 25074 46918
10347 46918 50107 41089 42425 47783 61484 81758 90484 71126 59736 70944 84339 81675 54331
10334 54331 47894 55679 60465 48908 43879 68124 87952 102611 101722 89610 86022 89390 73859
10321 73859 41398 26862 20999 34963 45252 52031 49627 43695 64376 80954 83245 58607 43967
10308 43967 34623 29654 29929 39791 61596 91428 100257 98760 88805 74840 81023 84180 73055 60172
10294 60172 59271 79222 64469 40388 42714 45520 24231 25568 65129 96790 95388 104067 90436
10281 90436 81113 75528 64682 62329 47605 52920 82988 100290 101445 81841 94614 88515 75862
10268 75862 64565 66513 73188 77976 68042 57298 70209 58556 43632 31482 27217 41571 50174
$$ packed form
10360C0896r767n64K300P992J0264N940J2469O349o806k4323j1242J566K1844
10347D6918L189r018J336N358J3701K0274Q726j9358j1390J1208J3395k664k7344
10334E4331o437P785M786j1557n029K4245J9828J4659q89j2112l588L368j5531
10321G3859l2461j4536n863J3964J0289O779k404n932K0681J6578K291k4638j4640
10308D3967r344m969K75R862K1805K9832Q829j497r955j3965O183L157j1125j2883
10294F0172r01J9951j4753k4081K326K806k1289J337L9561L1661j402Q679j3631
10281I0436r323n585j0846k353j4724N315L0068J7302J155j9604J2773o099j2653
10268G5862j1297J948O675M788r934j0744J2911j1653j4924j2150m265J4354Q603
$$ plain form
10255 50174 46047 59529 73185 67278 56332 54020 63986 74092 102193 100971 90131 72517 63967
10242 63967 59698 45272 43044 57831 65017 70814 69688 61984 80315 102592 99903 92768 96771
10229 96771 117223 143144 139467 127209 112567 100726 91320 84570 60835 83296 98241 103420
10217 103420 107067 101161 100571 104869 99222 96077 110776 117902 109628 103272 115016 115858 88648 80727
10203 80727 78461 90468 88538 97679 109416 108127 106441 97753 90628 90935 90242 103857 128946 132404
10189 132404 120550 101665 78066 71746 85861 95484 92137 103783 111508 104744 102543 99946 114100
10176 114100 128636 125073 128542 123804 133267 140608 140465 145808 126068 92952 78204 73671 88983
10163 88983 93257 96748 98680 115468 118803 107269 114118 130738 140304 145968 143386 144418 116996
$$ packed form
10255E0174m127J3482J3656n907j0946k312R966J0106K8101j222j0840j7614q550
10242F3967m269j4426k228J4787P186N797j126p704J8331K2277k689p135M003
10229I6771K0452K5921l677j2258j4642j1841r406o750k3735K2461J4945N179
10217A03420L647n906n90M298n647l145J4699P126q274o356J1744Q42k7210p921
10203H0727k266J2007j930R141J1737j289j686q688p125L07o93J3615K5089L458
10189A32404j1854j8885k3599o320J4115R623l347J1646P725o764k201k597J4154
10176A14100J4536l563L469m738R463P341j43N343j9740l3116j4748m533J5312
10163H8983M274L491J932J6788L335j1534O849J6620R566N664k582J032k7422
$$ plain form
10150 116996 107656 116809 123902 116864 118740 124046 120642 144574 159319 149135 141651 132410 128142
10137 128142 128727 119301 117277 122134 139892 132883 121897 120777 131730 135571 141550 146162 147865 133323
10123 133323 140821 155243 159117 149206 154614 163754 174839 187176 184325 167938 160395 168612 161947
10110 161947 168557 177379 175320 165642 165095 167517 165331 156480 145571 142692 149211 152230 147659 168028
10096 168028 186611 184416 165165 166839 174519 175418 176942 185878 201568 206179 200514 189295 194051
10083 194051 210649 178977 169178 173135 182617 181124 181933 190765 193632 204030 210419 212271 230849
10070 230849 236912 222850 197627 189618 188625 201137 207388 207710 217385 221395 226477 231634 225968 220650
10056 220650 214442 222205 209251 194572 178421 183974 209651 236762 232154 239089 237971 229935 235778
$$ packed form
10150A16996r340R153P093p038J876N306l404K3932J4745j0184p484r241m268
10137A28142N85r426k024M857J7758p009j0986j120J0953L841N979M612J703j4542
10123A33323P498J4422L874r911N408R140J1085J2337k851j6387p543Q217o665
10110A61947O610Q822k059r678n47K422k186q851j0909k879O519L019m571K0369
10096A68028J8583k195j9251J674P680Q99J524Q936J5690M611n665j1219M756
10083A94051J6598l1672r799L957R482j493Q09Q832K867J0398O389J852J8578
10070B30849O063j4062k5223q009r93J2512O251L22R675M010N082N157n666n318
10056B20650o208P763j2954j4679j6151N553K5677K7111m608O935j118q036N843
$$ plain form
10043 235778 244193 258232 268991 277293 290329 313331 344942 389752 397686 375326 335184 307332
10031 307332 285677 276914 286730 286739 290709 309952 312099 311636 298809 291409 300815 312923 313933 306756
10017 306756 311657 319744 326437 332374 337263 340944 331739 336908 341673 332596 331001 332714 336021 327373
10003 327373 322562 343819 378027 400430 386823 361825 357121 358230 363926 370635 372519 379011 387357
9990 387357 388750 384995 365423 363368 358800 359521 390676 402360 392640 386873 396263 384525 388909 416739
9976 416739 419801 414568 402634 414238 425281 435282 442968 420498 406806 434279 446027 439091
9964 439091 450285 475183 481854 496218 503741 490048 491574 495736 496833 485472 502140 512678 513423
9951 513423 514756 512334 519393 539180 544723 541069 539976 532428 539699 550684 561585 578870 595589
$$ packed form
10043B35778Q415J4039J0759Q302J3036K3002L1611M4810P934k2360m0142k7852
10031C07332k1655q763R816RL970J9243K147m63j2827p400R406J2108J010p177
10017C06756M901Q087O693N937M889L681r205N169M765r077j595J713L307q648
10003C27373m811K1257L4208K2403j3607k4998m704J109N696O709J884O492Q346
9990C87357J393l755j9572k055m568P21L1155J1684r720n767R390j1738M384K7830
9976D16739L062n233j1934J1604J1043J0001P686k2470j3692K7473J1748o936
9964D39091J1194K4898O671J4364P523j3693J526M162J097j1361J6668J0538P45
9951E13423J333k422P059J9787N543l654j093p548P271J0985J0901J7285J6719
$$ plain form
9938 595589 599144 605083 600723 614768 620343 621553 628841 637723 628768 638023 649676 662389 667577 674063
9924 674063 676457 674879 692548 718967 724788 740497 748158 746037 747657 764624 770157 771684 802220
9911 802220 813246 812477 820523 827344 816479 836447 851405 858261 866405 865717 882603 906970 931059
9898 931059 949478 949616 972921 990990 1007158 1035808 1053620 1059585 1082328 1106369 1091669 1096707
9886 1096707 1128307 1143500 1156534 1173451 1200412 1199803 1199319 1209466 1225037 1258441 1302029 1330165
9874 1330165 1339180 1363753 1377516 1381030 1396836 1450963 1498550 1534755 1544478 1561494 1583535 1581985
9862 1581985 1608271 1642292 1670769 1723723 1759500 1788369 1810984 1858755 1898701 1921762 1932371
9851 1932371 1956812 1995299 2027486 2044598 2079765 2128340 2177013 2217816 2250502 2306612 2359798
$$ packed form
9938E95589L555N939m360J4045N575J210P288Q882q955R255J1653J2713N188O486
9924F74063K394j578J7669K6419N821J5709P661k121J620J6967N533J527L0536
9911H02220J1026p69Q046O821j0865J9968J4958O856Q144o88J6886K4367K4089
9898I31059J8419J38K3305J8069J6168K8650J7812N965K2743K4041j4700N038
9886A096707L1600J5193J3034J6917K6961o09m84J0147J5571L3404M3588K8136
9874A330165R015K4573J3763L514J5806N4127M7587L6205R723J7016K2041j550
9862A581985K6286L4021K8477N2954L5777K8869K2615M7771L9946K3061J0609
9851A932371K4441L8487L2187J7112L5167M8575M8673M0803L2686N6110N3186
$$ plain form
9840 2359798 2409608 2459497 2504500 2549235 2599885 2657212 2713860 2794425 2876154 2920998 2970607
9829 2970607 3043644 3120973 3213031 3289643 3361254 3430839 3517743 3604618 3701564 3803056 3896764
9818 3896764 3979277 4057591 4167915 4280757 4411282 4546939 4673637 4797691 4931262 5068181
9808 5068181 5209142 5385291 5538307 5713363 5881781 6051002 6231384 6436793 6641172 6852100
9798 6852100 7063771 7296424 7552418 7810348 8068211 8339743 8642995 8966330 9284534 9619807
9788 9619807 9959015 10296884 10659905 11045089 11443708 11850743 12276397 12727844 13208042 13723372
9778 13723372 14254618 14788394 15358473 15955461 16562864 17155492 17768192 18400473 19051650
9769 19051650 19726844 20411285 21088265 21773159 22476604 23166125 23832873 24465133 25090982
$$ packed form
9840B359798M9810M9889M5003M4735N0650N7327N6648Q0565Q1729M4844M9609
9829B970607P3037P7329R2058P6612P1611O9585Q6904Q6875R6946J01492R3708
9818C896764Q2513P8314J10324J12842J30525J35657J26698J24054J33571J36919
9808E068181J40961J76149J53016J75056J68418J69221J80382K05409K04379K10928
9798F852100K11671K32653K55994K57930K57863K71532L03252L23335L18204L35273
9788I619807L39208L37869L63021L85184L98619M07035M25654M51447M80198N15330
9778A3723372N31246N33776N70079N96988O07403N92628O12700O32281O51177
9769A9051650O75194O84441O76980O84894P03445O89521O66748O32260O25849
$$ plain form
9760 25090982 25695197 26226870 26717762 27158458 27545681 27891770 28170374 28386733 28508103
9751 28508103 28548701 28516014 28425229 28265373 28040784 27731967 27349798 26896111 26400090 25889103
9741 25889103 25333775 24733692 24111172 23466718 22803346 22124050 21421392 20746681 20078645
9732 20078645 19424277 18784976 18156608 17525009 16914138 16317503 15726588 15167470 14619221
9723 14619221 14077270 13576240 13093118 12612626 12186866 11774984 11356946 10973883 10589026
9714 10589026 10220991 9875678 9527676 9197715 8886475 8595331 8318022 8048440 7806196
9705 7806196 7558026 7311379 7085453 6872399 6683570 6467625 6268391 6086218 5907482 5735583
9695 5735583 5554532 5384472 5238446 5104296 4976742 4836911 4690342 4559329 4448015 4345540
$$ packed form
9760B5090982O04215N31673M90892M40696L87223L46089K78604K16359J21370
9751B8508103M0598l2687r0785j59856k24589l08817l82169m53687m96021n10987
9741B5889103n55328o00083o22520o44454o63372o79296p02658o74711o68036
9732B0078645o54368o39301o28368o31599o10871n96635n90915n59118n48249
9723A4619221n41951n01030m83122m80492m25760m11882m18038l83063l84857
9714A0589026l68035l45313l48002l29961l11240k91144k77309k69582k42244
9705G806196k48170k46647k25926k13054j88829k15945j99234j82173j78736j71899
9695E735583j81051j70060j46026j34150j27554j39831j46569j31013j11314j02475
$$ plain form
9685 4345540 4244452 4137791 4037436 3947214 3834469 3749620 3675083 3598872 3527818 3436776 3351517
9674 3351517 3262647 3188458 3112682 3060577 3010355 2930584 2868555 2791449 2718906 2660919 2598091
9663 2598091 2539414 2493321 2455146 2392225 2351570 2320401 2286076 2245641 2184382 2126210 2117605 2090340
9651 2090340 2048462 2006025 1969463 1944178 1885396 1839166 1825856 1795887 1764679 1715621 1701100
9640 1701100 1691602 1672774 1635885 1587986 1549104 1523420 1528530 1525216 1495075 1444096 1423440 1417360
9628 1417360 1404012 1380559 1362513 1351574 1330066 1314073 1304145 1287115 1242142 1198299 1166885 1152755
9616 1152755 1139661 1130572 1140372 1129303 1101297 1086375 1051571 1026571 1029117 1027320 1018322 1005301
9604 1005301 979784 965241 960843 962405 944396 931754 910747 892038 899537 912979 890610 862388
$$ packed form
9685D345540j01088j06661j00355r0222j12745q4849p4537p6211p1054r1042q5259
9674C351517q8870p4189p5776n2105n0222p9771o2029p7106p2543n7987o2828
9663B598091n8677m6093l8175o2921m0655l1169l4325m0435o1259n8172q605k7265
9651B090340m1878m2437l6562k5285n8782m6230j3310k9969l1208m9058j4521
9640A701100r498j8828l6889m7899l8882k5684N110l314l0141n0979k0656o080
9628A417360j3348k3453j8046j0939k1508j5993r928j7030m4973m3843l1414j4130
9616A152755j3094r089R800j1069k8006j4922l4804k5000K546j797q998j3021
9604A005301k5517j4543m398J562j8009j2642k1007j8709P499J3442k2369k8222
$$ plain form
9592 862388 853290 852363 834567 830017 818321 804421 773835 760784 742731 733297 738457 721787 703076
9579 703076 706918 715290 712348 705706 688743 668497 653505 641140 643292 651159 642990 621073 614278
9566 614278 615223 621647 616473 605755 579917 589377 583998 572756 583367 575492 562647 535753 536199
9553 536199 547539 547710 540237 527917 509582 493162 471848 463937 477055 488226 482801 481364 495912
9540 495912 491353 478660 456613 451526 464245 467541 452531 430966 436507 460649 447365 435171
9528 435171 431708 431481 419315 406597 407201 403136 402265 417926 403409 396288 379175 381991 399150 395710
9514 395710 384406 384137 381883 374142 374828 375436 354506 356128 353000 337988 328858 324435 331337 344437
9500 344437 345852 341566 323874 311155 321447 305812 312714 322473 308241 306565 304903 291659 284030
$$ packed form
9592H62388r098r27j7796m550j1696j3900l0586j3051j8053r434N160j6670j8711
9579G03076L842Q372k942o642j6963k0246j4992j2365K152P867q169k1917o795
9566F14278R45O424n174j0718k5838R460n379j1242J0611p875j2845k6894M46
9553E36199J1340J71p473j2320j8335j6420k1314p911J3118J1171n425j437J4548
9540D95912m559j2693k2047n087J2719L296j5010k1565N541K4142j3284j2194
9528D35171l463k27j2166j2718O04m065q71J5661j4517p121j7113K816J7159l440
9514C95710j1304k69k254p741O86O08k0930J622l128j5012r130m423O902J3100
9500C44437J415m286j7692j2719J0292j5635O902R759j4232j676j662j3244p629
$$ plain form
9487 284030 275674 277421 287323 300502 291001 298508 308713 300844 300858 294922 276612 265574 272859 277691
9473 277691 271488 255310 272818 288933 278518 273621 279392 289830 301939 294875 262787 251931
9461 251931 260049 267144 276842 257939 241749 225522 213713 209405 197582 198918 209335 226791 233865
9448 233865 225997 218982 210364 198492 191282 201338 190949 198089 200011 182660 170748 191015 201293
9435 201293 182050 184531 191201 192711 210615 227212 223103 216392 199372 199296 195506 195581 187887 201338
9421 201338 208115 201192 170841 161573 167666 170660 173441 187475 187889 179629 177477 162309 142898 154237
9407 154237 179729 179157 169317 168162 181564 196302 192094 181061 179507 178246 191138 188082 182442
9394 182442 172158 184606 195075 179430 154989 161807 173574 159550 156354 145772 123465 127794
$$ packed form
9487B84030q356J747R902J3179r501P507J0205p869J4n936j8310j1038P285M832
9473B77691o203j6178J7508J6115j0415m897N771J0438J2109p064l2088j0856
9461B51931Q118P095R698j8903j6190j6227j1809m308j1823J336J0417J7456P074
9448B33865p868p015q618j1872p210J0056j0389P140J922j7351j1912K0267J0278
9435B01293j9243K481O670J510J7904J6597m109o711j7020p6l790P5p694J3451
9421B01338O777o923l0351r268O093K994K781J4034M14q260k152j5168j9411J1339
9407A54237K5492n72r840j155J3402J4738m208j1033j554j261J2892l056n640
9394A82442j0284J2448J0469j5645k4441O818J1767j4024l196j0582k2307M329
$$ plain form
9382 127794 114032 116211 122067 132516 140280 151566 136352 133509 135612 145442 143579 138716 130234
9369 130234 119515 121755 127836 126433 116733 113593 125343 131604 133375 126216 140240 148709 131553
9356 131553 145600 137443 113195 124908 132947 118788 120846 115816 118879 128126 136544 137053 124304
9343 124304 101928 104346 125157 136831 126738 106245 105371 125958 126189 128663 135052 123056 114042
9330 114042 120262 125210 101279 85837 98072 103305 95270 105711 113094 113901 103107 92002 97387
9317 97387 99302 112957 115978 116549 107893 116995 114045 99217 98038 97222 96687 93677 99493 104204 104935
9302 104935 104197 109474 118313 107769 85078 63070 66241 73868 94082 117785 116001 95960 107860
9289 107860 109200 98592 82709 87426 114587 109386 97354 88243 88858 97275 94375 104349 113299 115377
$$ packed form
9382A27794j3762K179N856J0449P764J1286j5214k843K103R830j863m863q482
9369A30234j0719K240O081j403r700l140J1750O261J771p159J4024Q469j7156
9356A31553J4047q157k4248J1713Q039j4159K058n030L063R247Q418N09j2749
9343A24304k2376K418K0811J1674j0093k0493q74K0587K31K474O389j1996r014
9330A14042O220M948k3931j5442J2235N233q035J0441P383Q07j0794j1105N385
9317I7387J915J3655L021N71q656R102k950j4828j179q16n35l010N816M711P31
9302A04935p38N277Q839j0544k2691k2008L171P627K0214K3703j784k0041J1900
9289A07860J340j0608j5883M717K7161n201j2032r111O15Q417k900R974Q950K078
$$ plain form
9275 115377 117418 117347 101460 112359 131075 131789 121850 100959 100984 97416 81230 81446 88772 88849 82218
9260 82218 95949 84123 73525 66462 54070 43002 37189 58162 63749 88696 93898 74724 56250
9247 56250 57378 83218 102413 89979 69394 73913 77054 77677 60676 48758 54666 68080 68555
9234 68555 73782 74869 68331 55083 66271 62780 50206 52004 64813 80163 91830 99544 101343
9221 101343 78924 66414 38025 34719 44417 70767 62142 66477 76326 83409 90128 81161 76932
9208 76932 54182 68399 85264 97047 83428 59441 39694 43613 67396 84610 78143 66164
9196 66164 72023 58507 38720 30143 26331 40635 44494 40403 34700 40600 48659 34835 31957 42855
9182 42855 37284 20559 22984 20080 23476 36008 39199 30876 36994 51015 46733 48866 49644 54621
$$ packed form
9275A15377K041p1j5887J0899J8716P14r939k0891K5l568j6186K16P326P7o631
9260H2218J3731j1826j0598p063j2392j1068n813K0973N587K4947N202j9174j8474
9247E6250J128K5840J9195j2434k0585M519L141O23j7001j1918N908J3414M75
9234F8555N227J087o538j3248J1188l491j2574J798J2809J5350J1667P714J799
9221A01343k2419j2510k8389l306R698K6350q625M335R849P083O719q967m229
9208G6932k2750J4217J6865J1783j3619k3987j9747L919K3783J7214o467j1979
9196F6164N859j3516j9787q577l812J4304L859m091n703N900Q059j3824k878J0898
9182D2855n571j6725K425k904L396J2532L191q323O118J4021m282K133P78M977
$$ plain form
9168 54621 42018 37814 42432 45921 52655 40330 44696 55605 57183 58799 50502 56486 52544 48134
9154 48134 39725 29908 45492 78262 94145 98999 106732 90277 76725 70825 48629 28950 27138
9141 27138 26491 27290 48097 43159 51160 58715 71976 54830 51711 63285 56556 41379 28448 28009
9127 28009 53208 71510 90657 79865 58051 39442 33730 56024 57728 59057 62950 64017 66416
9114 66416 82640 79201 47696 41199 56774 58051 42310 34646 28165 31378 46525 39342 36807
9101 36807 43140 30886 38034 50570 45078 51060 70779 76248 86090 70107 57884 62366 59724
9088 59724 72384 68891 60194 43425 18345 13582 31396 38562 49482 46267 18462 10598 -9733
9075 -9733 -4102 18378 11980 2027 23026 35117 30177 36118 49281 60258 50888 58765 46739
$$ packed form
9168E4621j2603m204M618L489O734j2325M366J0909J578J616q297N984l942m410
9154D8134q409r817J5584L2770J5883M854P733j6455j3552n900k2196j9679j812
9141B7138o47P99K0807m938Q001P555J3261j7146l119J1574o729j5177j2931m39
9127B8009K5199J8302J9147j0792k1814j8609n712K2294J704J329L893J067K399
9114F6416J6224l439l1505o497J5575J277j5741p664o481L213J5147p183k535
9101C6807O333j2254P148J2536n492N982J9719N469R842j5983j2223M482k642
9088E9724J2660l493q697j6769k5080m763J7814P166J0920l215k7805p864k0331
9075i733N631K2480o398r953K0999J2091m940N941J3163J0977r370P877j2026
$$ plain form
9062 46739 37638 38776 37932 38925 35054 50871 71446 90232 92213 85618 82939 72156 66432 36884
9048 36884 31065 51274 47342 41948 57613 61790 40209 30970 25424 29628 35306 36363 41105 54958
9034 54958 39991 17915 12299 29821 42903 49911 42604 37288 31488 29672 16426 32383 27844
9021 27844 19520 5460 15263 15124 19840 28718 32586 37813 38602 58550 60796 55277 50398 53657 67047
9006 67047 50833 45477 44508 45234 51315 57281 53949 71099 68048 82000 102609 143508 233443 405577
8992 405577 544634 519861 395604 242642 142318 100822 75873 53555 36994 47219 65109
8981 65109 65457 47814 26717 25973 14609 9399 18187 22821 32045 22535 24095 32106 28363 36877
8967 36877 50031 39834 26843 25518 15501 29434 32623 23249 14156 26727 42476 44489 58162
$$ packed form
9062D6739r101J138q44R93l871J5817K0575J8786J981o595k679j0783n724k9548
9048C6884n819K0209l932n394J5665M177k1581r239n546M204N678J057M742J3853
9034E4958j4967k2076n616J7522J3082P008p307n316n800j816j3246J5957m539
9021B7844q324j4060R803j39M716Q878L868N227P89J9948K246n519m879L259J3390
9006F7047j6214n356r69P26O081N966l332J7150l051J3952K0609M0899Q9935J72134
8992D05577J39057k4773j24257j52962j00324m1496k4949k2318j6561J0225J7890
8981F5109L48j7643k1097p44j1364n210Q788M634R224r510J560Q011l743Q514
8967C6877J3154j0197j2991j325j0017J3933L189r374r093J2571J5749K013J3673
$$ plain form
8954 58162 46401 22011 24759 40064 43450 25605 13212 14586 14798 18094 20687 18702 20997 22234
8940 22234 31010 22597 14978 22347 43154 50314 30478 9350 9336 23804 29826 39195 42384 24748
8926 24748 7956 -5172 838 -15133 -12984 -25745 -20318 -7877 -2844 -3793 -14003 20720 49744
8913 49744 54361 46775 27112 22005 23854 11329 10699 8811 11382 12889 18411 16072 8856 -8891
8899 -8891 -8148 13262 6621 5099 34139 38779 42181 34608 33980 26242 11193 11108 5580 20639 22235
8884 22235 18816 24494 34580 43031 17223 1836 -2972 24797 36957 37163 24937 35117 51430
8871 51430 54476 39510 43541 51318 35110 32291 30477 21117 8305 187 20012 30233 13269
8858 13269 -1324 3962 9075 11785 12537 8092 16472 33788 37368 20657 22697 24825 24758 28137 32777
$$ packed form
8954E8162j1761k4390K748J5305L386j7845j2393J374K12L296K593j985K295J237
8940B2234Q776q413p619P369K0807P160j9836k1128j4J4468O022R369L189j7636
8926B4748j6792j3128O010j5971K149j2761N427J2441N033r49j0210L4723K9024
8913D9744M617p586j9663n107J849j2525o30j888K571J507N522k339p216j7747
8899h891P43K1410o641j522K9040M640L402p573o28p738j5049q5n528J5059J596
8884B2235l419N678J0086Q451k5808j5387m808K7769J2160K06j2226J0180J6313
8871E1430L046j4966M031P777j6208k819j814r360j2812q118J9825J0221j6964
8858A3269j4593N286N113K710P52m445Q380J7316L580j6711K040K128o7L379M640
$$ plain form
8843 32777 26182 32403 12649 -2708 -5265 -1912 1661 -6706 2049 14999 17603 10804 16521 5597
8829 5597 19602 30487 33173 36716 43746 59521 56942 49449 53212 51027 36229 37747 20626 23126
8815 23126 31374 32525 41812 46005 44411 45638 53403 51353 49963 37758 19329 18840 23600 24746
8801 24746 32516 44026 41745 26910 20801 24059 22549 35809 22158 14211 13206 11344 29885
8788 29885 30523 12458 6252 565 703 23193 38628 35185 33553 33481 47839 33308 35656 44238
8774 44238 27855 33044 47019 47153 56196 50872 56047 55733 41287 50087 65016 71193 65503 50216
8760 50216 39088 35222 45316 45325 37226 38518 45770 44722 53385 67819 73852 64189 45055 19584
8746 19584 13571 30221 40379 43224 34608 22555 16150 7002 26399 30811 30553 32997 30420 46527
$$ packed form
8843C2777o595O221j9754j5357k557L353L573q367Q755J2950K604o799N717j0924
8829E597J4005J0885K686L543P030J5775k579p493L763k185j4798J518j7121K500
8815B3126Q248J151R287M193j594J227P765k050j390j2205j8429m89M760J146
8801B4746P770J1510k281j4835o109L258j510J3260j3651p947j005j862J8541
8788B9885O38j8065o206n687J38K2490J5435l443j632p2J4358j4531K348Q582
8774D4238j6383N189J3975J34R043n324N175l14j4446Q800J4929O177n690j5287
8760E0216j1128l866J0094Rq099J292P252j048Q663J4434O033r663j9134k5471
8746A9584o013J6650J0158K845q616j2053o405r148J9397M412k58K444k577J6107
$$ plain form
8732 46527 43206 28035 13210 12621 20817 27918 44113 40819 37777 29453 27485 13588 12017 33778
8718 33778 38755 37354 31427 59494 67369 60388 56327 49033 60715 61965 58504 67980 73977 59192
8704 59192 56965 57504 60093 41702 29503 30008 66387 84791 92947 95862 85661 89478 77989 74533
8690 74533 60287 44077 37005 54744 75310 79887 97223 105714 114289 101627 81939 59924 41492
8677 41492 26760 29190 64790 74252 74252 94111 109012 106813 120301 110723 86829 61388 66560 65070
8663 65070 82926 101755 118213 127516 121021 109584 108898 110501 111355 122627 129674 129327 130262 140594
8649 140594 127412 101050 110841 110169 98112 78353 89933 113068 129854 129856 130669 137255 131521 130904
8635 130904 132581 134537 142221 153162 155223 160057 178754 195836 206819 220827 235325 245557 240955
$$ packed form
8732D6527l321j5171j4825n89Q196P101J6195l294l042q324j968j3897j571K1761
8718C3778M977j401n927K8067P875o981m061p294J1682J250l461R476N997j4785
8704E9192k227N39K589j8391j2199N05L6379J8404Q156K915j0201L817j1489l456
8690G4533j4246j6210p072J7739K0566M577J7336Q491Q575j2662j9688k2015j8432
8677D1492j4732K430L5600R462%J9859J4901k199J3488r578k3894k5441N172j490
8663F5070J7856J8829J6458R303o495j1437o86J603Q54J1272P047l47R35J0332
8649A40594j3182k6362R791o72j2057j9759J1580K3135J6786KQ13O586n734o17
8635A30904J677J956P684J0941K061M834J8697J7082J0983J4008J4498J0232m602
$$ plain form
8622 240955 228701 233822 230464 224790 224052 223291 213686 212995 214698 210431 195935 197216 205230 215087 231056
8607 231056 231059 235717 248449 267967 312179 327890 308607 261717 217060 186184 162961 140720 122225
8594 122225 112622 115105 120113 94664 80908 74960 76875 92975 89146 59444 56838 50162 60278
8581 60278 57431 64180 46693 36514 45206 44413 46968 47851 53804 59971 50995 47469 46563 55980 49547
8566 49547 41615 52728 64279 84291 94868 129111 193197 281438 314182 292029 239751 184457
8554 184457 139828 95779 59913 40479 46583 58756 47310 39863 34943 30529 37197 29222 43143
8541 43143 55277 61182 59200 40786 28035 29851 22520 9984 18167 22457 32672 44691 34027
8528 34027 16598 7478 7950 19658 33538 35756 22894 27046 29275 33766 66568 77389 87055
$$ packed form
8622B40955j2254N121l358n674p38p61r605o91J703m267j4496J281Q014R857J5969
8607B31056LM658J2732J9518M4212J5711j9283m6890m4657l0876k3223k2241j8495
8594A22225r603K483N008k5449j3756n948J915J6100l829k9702k606o676J0116
8581F0278k847O749j7487j0179Q692p93K555Q83N953O167q976l526r06R417o433
8566D9547p932J1113J1551K0012J0577L4243O4086Q8241L2744k2153n2278n5294
8554A84457m4629m4049l5866j9434O104J2173j1446p447m920m414O668p975J3921
8541D3143J2134N905j982j8414j2751J816p331j2536Q183M290J0215J2019j0664
8528C4027j7429r120M72J1708J3880K218j2862M152K229M491L2802J0821R666
$$ plain form
8515 87055 114671 142480 151356 140904 87136 55011 60434 62622 79396 62876 43246 41140 44743
8502 44743 33070 20141 26261 33738 42999 38709 18510 21548 33648 40603 45097 62046 49730
8489 49730 39761 35407 32252 16117 40097 41961 61752 49285 30815 24185 26332 29006 26369
8476 26369 24254 42191 37859 29055 11213 19775 45869 42858 22064 17322 17714 49713 65664
8463 65664 91911 99482 93552 84676 81429 59220 33196 43460 60476 62782 36978 7687 -13384
8450 -13384 9604 15359 25084 45076 50343 65835 54928 51684 58605 61518 48237 37151 34073
8437 34073 28084 31399 45821 46493 62278 77377 68687 50719 44891 64154 59711 52701 47115 64295
8423 64295 64092 67706 105859 146145 173798 166097 118558 67151 43662 15774 6447 15719 12387
$$ packed form
8515H7055K7616K7809Q876j0452n3768l2125N423K188J6774j6520j9630k106L603
8502D4743j1673j2929O120P477R261m290k0199L038J2100O955M494J6949j2316
8489D9730r969m354l155j6135K3980J864J9791j2467j8470o630K147K674k637
8476B6369k115J7937m332q804j7842Q562K6094l011k0794m742L92L1999J5951
8463F5664K6247P571n930q876l247k2209k6024J0264J7016K306k5804k9291k1071
8450a3384K2988N755R725J9992N267J5492j0907l244O921K913j3281j1086l078
8437C4073n989L315J4422O72J5785J5099q690j7968n828J9263m443p010n586J7180
8423F4295k03L614L8153M0286K7653p701m7539n1407k3489k7888r327R272l332
$$ plain form
8410 12387 2373 -2510 -4256 12406 29294 36673 45067 25938 23643 38155 62241 66800 56645
8397 56645 69027 68725 61570 62938 55613 61503 75413 70990 49569 41010 25421 45340 60692
8384 60692 53023 31361 13637 20560 31180 33827 38121 36300 26333 40925 53648 45947 25837
8371 25837 11617 -6510 -8154 -6891 -3460 -5859 14318 22303 5810 1958 8054 10724 15437 21684
8357 21684 44283 48108 34143 23278 21249 20130 24625 30113 22490 18785 54199 58050 42407
8344 42407 40731 40107 36719 46537 45451 39904 40481 16450 20305 10707 3628 10672 19682 27518 26072
8329 26072 13380 5778 6658 5272 -10936 -12782 8332 28412 21343 22407 12190 -2991 -5383
8316 -5383 -4198 8886 14971 20045 -2005 4786 -199 5705 8189 20661 25159 4210 5143 11938
$$ packed form
8410A2387j0014m883j746J6662J6888P379Q394j9129k295J4512K4086M559j0155
8397E6645J2382l02p155J368p325N890J3910m423k1421q559j5589J9919J5352
8384F0692p669k1662j7724O923J0620K647M294j821r967J4592J2723p701k0110
8371B5837j4220j8127j644J263L431k399K0177P985j6493l852O096K670M713O247
8357B1684K2599L825j3965j0865k029j119M495N488p623l705L5414L851j5643
8344D2407j676o24l388R818j086n547N77k4031L855r598p079P044R010P836j446
8329B6072j2692p602Q80j386j6208j846K1114K0080p069J064j0217j5181k392
8316e383J185J3084O085N074k2050O791m985N904K484J2472M498k0949R33O795
$$ plain form
8302 11938 18620 18907 17945 15198 2272 20340 18715 9875 5263 12137 30092 44406 40331 35282
8288 35282 33486 17135 11258 13453 26635 21530 22697 11975 8481 21591 20121 8445 4256
8275 4256 -1157 -11039 2192 24037 18314 2559 -12581 -4332 13155 -810 -14816 -16290 -4053
8262 -4053 9354 8517 -8286 -12845 -19900 -13013 3006 12160 15406 9257 31680 60628 69092 70851
8248 70851 54506 28457 12934 2115 10228 19490 4428 -14560 -10360 9035 15908 21975 24267
8235 24267 13399 14686 33796 48955 77800 74747 57884 34254 24135 25411 18435 -6565 -10352
8222 -10352 9402 20646 18794 10653 27930 35463 29826 19204 -2053 -16668 -19104 -29812 -8278
8209 -8278 24308 19767 -1461 14909 24976 32723 18545 12130 2669 368 4864 22687 41688
$$ packed form
8302A1938O682K87r62k747j2926J8068j625q840m612O874J7955J4314m075n049
8288C5282j796j6351n877K195J3182n105J167j0722l494J3110j470j1676m189
8275D256n413r882J3231K1845n723j5755j5140Q249J7487j3965j4006j474J2237
8262d053J3407q37j6803m559p055O887J6019R154L246o149K2423K8948Q464J759
8248G0851j6345k6049j5523j0819Q113R262j5062j8988M200J9395O873O067K292
8235B4267j0868J287J9110J5159K8845l053j6863k3630j0119J276o976k5000l787
8222a0352J9754J1244j852q141J7277P533n637j0622k1257j4615k436j0708K1534
8209h278L2586m541k1228J6370J0067P747j4178o415r461k301M496J7823J9001
$$ plain form
8196 41688 61411 67967 85121 115901 125526 133937 156342 167954 177153 164498 130983 79795 54946
8183 54946 30422 12468 27522 31488 35308 23587 2916 -8908 -7884 -2784 -7607 35 -5246
8170 -5246 -2445 7801 24183 20074 40359 67434 64170 55797 46339 34561 34237 28476 36088 45989
8156 45989 41534 37011 43188 56904 67862 89907 97027 83192 77682 75199 65524 42454 51316
8143 51316 61347 59887 57678 57045 71842 61398 41768 38046 10082 -2252 -2522 -10840 -4206 23120
8129 23120 29717 14854 18074 20631 28348 39509 50322 53308 53903 52469 38230 14435 -5326
8116 -5326 -8723 -1777 -8283 -5217 747 3730 3011 5014 13486 30328 22517 23386 18699 13481 18419
8101 18419 14292 8646 6980 -7032 -2495 8286 17079 12761 10398 12254 3380 -5859 -7143 -2735
$$ packed form
8196D1688J9723O556J7154L0780R625Q411K2405J1612R199j2655l3515n1188k4849
8183E4946k4524j7954J5054L966L820j1721k0671j1824J024N100m823P642n281
8170e246K801J0246J6382m109K0285K7075l264q373r458j1778l24n761P612R901
8156D5989m455m523O177J3716J0958K2045P120j3835n510k483r675k3070Q862
8143E1316J0031j460k209o33J4797j0444j9630l722k7964j2334k70q318O634K7326
8129B3120O597j4863L220K557P717J1161J0813K986N95j434j4239k3795j9761
8116e326l397O946o506L066N964K983p19K003Q472J6842p811Q69m687n218M938
8101A8419m127n646j666j4012M537J0781Q793m318k363J856q874r239j284M408
$$ plain form
8087 -2735 4666 21502 23420 14529 38787 33241 29017 18280 13028 5921 -5078 -3240 14989 28142
8073 28142 29569 21700 17804 11167 20576 28166 28397 23714 36789 39477 47625 58883 75957 66016
8059 66016 57963 68859 59711 73062 101677 112465 102566 92481 102979 123381 132235 155061 165264
8046 165264 165986 182254 174670 187536 183939 172840 148777 125186 115621 105356 84016 72278 101876
8033 101876 114690 95860 89143 86613 95386 99958 96275 103725 105385 102194 97409 102571 110812 141462
8019 141462 159502 182654 217148 259928 321184 387784 423729 433317 428974 400136 375355 337693
8007 337693 293799 299773 341875 420425 560688 753945 953406 1020106 928801 748939 556461
7996 556461 402633 303818 226461 174100 140248 116429 106665 106388 107069 103818 110561 112587 96406
$$ packed form
8087b735P401J6836J918q891K4258n546m224j0737n252p107j0999J838J8229J3153
8073B8142J427p869l896o637R409P590K31m683J3075K688Q148J1258J7074r941
8059F6016q053J0896r148J3351K8615J0788r899j0085J0498K0402Q854K2826J0203
8046A65264P22J6268p584J2866l597j1099k4063k3591r565j0265k1340j1738K9598
8033A01876J2814j8830o717k530Q773M572l683P450J660l191m785N162Q241L0650
8019A41462J8040K3152L4494M2780O1256O6600L5945R588m343k8838k4781l7662
8007C37693m3894N974M2102P8550J40263J93257J99461O6700r1305j79862j92478
7996E56461j53828r8815p7357n2361l3852k3819r764k77O81l251O743K026j6181
$$ plain form
7983 96406 86782 81420 95835 95428 92169 105153 115781 142111 161068 182290 206049 240678 303842
7970 303842 369318 440898 513768 566123 576963 560802 529212 513305 529318 616201 755746
7959 755746 878041 889748 813549 668299 497489 397300 316279 248854 194445 172634 160555
7948 160555 136658 128931 125909 102144 77039 57143 40565 47496 42225 21968 21508 30484 40490
7935 40490 67127 85669 65139 53288 69629 102103 142837 182080 195241 188148 176742 161556
7923 161556 134152 126539 121477 126263 147578 193090 228319 227966 195859 170039 135411 100601 72212
7910 72212 44551 33134 42795 23949 16057 -3400 1482 14004 20252 20095 19195 8623 -2686
7897 -2686 -19088 -32761 -20194 -477 -5512 4301 9130 20514 19195 9730 3545 919 -7548 -16573
$$ packed form
7983I6406r624n362J4415m07l259J2984J0628K6330J8957K1222K3759L4629O3164
7970C03842O5476P1580P2870N2355J0840j6161l1590j5907J6013Q6883J39545
7959G55746J22295J1707p6199j45250j70810j00189q1021o7425n4409k1811j2079
7948A60555k3897p727l022k3765k5105j9896j6578O931n271k0257m60Q976J0006
7935D0490K6637J8542k0530j1851J6341L2474M0734L9243J3161p093j1406j5186
7923A61556k7404p613n062M786K1315M5512L5229l53l2107k5820l4628l4810k8389
7910G2212k7661j1417R661j8846p892j9457M882J2522O248j57r00j0572j1309
7897b686j6402j3673J2567J9717n035R813M829J1384j319r465o185k626q467r025
$$ plain form
7883 -16573 -20742 -27316 -29249 -22603 -2208 -2297 -22183 -34909 -20937 -13945 -12538 -36530 -26636 -11235
7869 -11235 -5837 -8928 -4310 -11011 -7144 2644 7042 420 -13924 -18932 -31443 -25183 -16766 -17665
7855 -17665 -7314 2853 -1269 -16484 -25796 -21776 -26183 -19394 1236 7948 3916 -7952 -4148
7842 -4148 -4024 409 1020 10121 19786 8186 -16055 -20111 -24228 -34118 -15594 -15449 -1242 -11545
7828 -11545 -22934 -5773 -3648 5026 3269 -5789 15030 14126 22260 14736 822 -21076 -6458
7815 -6458 17503 15388 20641 10253 -3213 -23249 -12085 -10991 -17859 -14576 -14613 -18312 -5688 -9746
7801 -9746 5758 2773 2 14747 6195 7335 8060 -11288 -19127 -20961 -19430 -12325 12040 25838
7787 25838 5398 -7124 -6180 9815 6775 -1533 -11798 -970 -62 14299 18031 18353 2091 -8606
$$ packed form
7883a6573m169o574j933O646K0395q9j9886j2726J3972O992J407k3992R894J5401
7869a1235N398l091M618o701L867R788M398o622j4344n008j2511O260Q417q99
7855a7665J0351J0167m122j5215r312M020m407O789K0630O712m032j1868L804
7842d148J24M433O11R101R665j1600k4241m056m117r890J8524J45J4207j0303
7828a1545j1389J7161K125Q674j757r058K0819r04Q134p524j3914k1898J4618
7815f458K3961k115N253j0388j3466k0036J1164J094o868L283l7l699J2624m058
7801i746J5504k985k771J4745q552J140P25j9348p839j834J531P105K4365J3798
7787B5838k0440j2522R44J5995l040q308j0265J0828R08J4361L732L22j6262j0697
$$ plain form
7773 -8606 -10160 -9405 -10634 -9876 -4427 -14316 -27986 -20594 146 11760 36537 42546 22054 -5713
$$ packed form
7773h606j554P55j229P58N449r889j3670P392K0740J1614K4777O009k0492k7767
$$ [...]
##END NTUPLES=NMR SPECTRUM
##END=
