##TITLE=Analysis number 328130
Compound Code sb 01204
Book Reference b
Project Code adrs
Chemist Name stores
##JCAMPDX= 6.0         $$ Bruker NMR JCAMP-DX V2.0
##DATA TYPE= NMR SPECTRUM
##DATA CLASS= NTUPLES
##ORIGIN= Bruker BioSpin GmbH
##OWNER= nmr
$$ XWIN-NMR		Version 3.5
$$ Fri May  4 14:09:52 2007 GMT Daylight Time (UT+1h)  MAYBRIDGE\nmr@NMR_250MHZ
##.OBSERVE FREQUENCY= 250.131544655141
##.OBSERVE NUCLEUS= ^1H
##.ACQUISITION MODE= SIMULTANEOUS (DQD)
##.ACQUISITION SCHEME= undefined
##.AVERAGES= 16
##.DIGITISER RES= 18
##SPECTROMETER/DATA SYSTEM= dpx250
##.PULSE SEQUENCE= zg30
##.SOLVENT NAME= CDCl3
##.SHIFT REFERENCE= (INTERNAL, CDCl3, 0, 16.522)
##AUDIT TRAIL= $$ (NUMBER, WHEN, WHO, WHERE, WHAT)
$$ ##TITLE= Audit trail, XWIN-NMR		Version 3.5
$$ ##JCAMPDX= 5.01
$$ ##ORIGIN= Bruker BioSpin GmbH
$$ ##OWNER= nmr
$$ C:\u/data/dgb/nmr/ADRS/460/pdata/1/auditp.txt
$$ ##AUDIT TRAIL=  $$ (NUMBER, WHEN, WHO, WHERE, WHAT)
(   1,<2007-05-04 14:09:32.88 +100>,<MAYBRIDGE\nmr>,<NMR_250MHZ>,
      <created by zg, POWCHK disabled, PULCHK disabled
       configuration hash MD5:
       76 6E 9A 78 1E 09 19 81 EC 84 63 8F B0 6A 59 2D
       data hash MD5: 64K
       62 3F D9 F9 89 47 44 77 56 D2 A4 6C FF EF 72 60>)
(   2,<2007-05-04 14:09:44.16 +100>,<MAYBRIDGE\nmr>,<NMR_250MHZ>,
      <Start of raw data processing
       ef LB = 0.3 FT_mod = 6 PKNL = 1 SI = 32K 
       data hash MD5: 32K
       58 56 48 9C E6 E6 B5 F7 D0 57 C0 8C 39 EE 67 40>)
(   3,<2007-05-04 14:09:46.94 +100>,<MAYBRIDGE\nmr>,<NMR_250MHZ>,
      <apk 
       data hash MD5: 32K
       85 09 B8 0F 38 5B 2D 47 92 FA 85 E7 1D 54 B7 E0>)
(   4,<2007-05-04 14:09:47.69 +100>,<MAYBRIDGE\nmr>,<NMR_250MHZ>,
      <abs ABSG = 5 
       data hash MD5: 32K
       81 62 FC AB D6 34 8C CE 9E D2 54 67 AA AF 70 24>)
$$ ##END=
$$ 
$$ hash MD5
$$ C9 DB 44 4D 54 0A 4B 69 EC B0 19 94 26 AE EE 51
##$RELAX= 
##$RELAX= 
##$RELAX= 
##$RELAX= 
##$RELAX= 
##$RELAX= 
##$RELAX= 
$$ Bruker specific parameters
$$ --------------------------
##$DU= <C:\u>
##$EXPNO= 460
##$NAME= <ADRS>
##$PROCNO= 1
##$TYPE= <nmr>
##$USER= <dgb>
##$AMP= (0..31)
100 100 100 100 100 100 100 100 100 100 100 100 100 100 100 100 100 100 
100 100 100 100 100 100 100 100 100 100 100 100 100 100 
##$AQSEQ= 0
##$AQ_mod= 3
##$AUNM= <au_zg>
##$AUTOPOS= <39 >
##$BF1= 250.13
##$BF2= 250.13
##$BF3= 250.13
##$BF4= 250.13
##$BF5= 500.13
##$BF6= 500.13
##$BF7= 500.13
##$BF8= 500.13
##$BYTORDA= 1
##$CFDGTYP= 0
##$CFRGTYP= 5
##$CHEMSTR= <none>
##$CNST= (0..31)
1 1 145 1 1 1 1 1 1 1 1 1 1 1 1 1 1 1 1 1 1 1 1 1 1 1 1 1 1 1 1 1 
##$CPDPRG= <>
##$CPDPRG1= <>
##$CPDPRG2= <>
##$CPDPRG3= <>
##$CPDPRG4= <mlev>
##$CPDPRG5= <mlev>
##$CPDPRG6= <mlev>
##$CPDPRG7= <mlev>
##$CPDPRG8= <mlev>
##$CPDPRGB= <>
##$CPDPRGT= <>
##$D= (0..31)
0 1 0 0 0 0 0 0 0 0.06 0 0 0 0 0 0 0.0002 0 0 0 0 0 0 0 0 0 0 0 0 0 0 
0 
##$DATE= 1178284172
##$DBL= (0..7)
120 120 120 120 120 120 120 120 
##$DBP= (0..7)
150 150 150 150 150 150 150 150 
##$DBP07= 0
##$DBPNAM0= <>
##$DBPNAM1= <>
$$ [...]
##$SUBNAM7= <"">
##$SUBNAM8= <"">
##$SUBNAM9= <"">
##$SW= 20.6930455092707
##$SWIBOX= (0..15)
0 0 3 0 0 0 0 0 0 0 0 0 0 0 0 0 
##$SW_h= 5175.983436853
##$TD= 65536
##$TD0= 1
##$TE= 683.16
##$TE2= 300
##$TE3= 300
##$TEG= 300
##$TL= (0..7)
0 120 120 120 120 120 120 120 
##$TP= (0..7)
150 150 150 150 150 150 150 150 
##$TP07= 0
##$TPNAME0= <>
##$TPNAME1= <>
##$TPNAME2= <>
##$TPNAME3= <>
##$TPNAME4= <>
##$TPNAME5= <>
##$TPNAME6= <>
##$TPNAME7= <>
##$TPOAL= (0..7)
0.5 0.5 0.5 0.5 0.5 0.5 0.5 0.5 
##$TPOFFS= (0..7)
0 0 0 0 0 0 0 0 
##$TUNHIN= 0
##$TUNHOUT= 0
##$TUNXOUT= 0
##$USERA1= <user>
##$USERA2= <user>
##$USERA3= <user>
##$USERA4= <user>
##$USERA5= <user>
##$V9= 5
##$VALIST= <valist>
##$VCLIST= <CCCCCCCCCCCCCCC>
##$VD= 0
##$VDLIST= <DDDDDDDDDDDDDDD>
##$VPLIST= <PPPPPPPPPPPPPPP>
##$VTLIST= <TTTTTTTTTTTTTTT>
##$WBST= 1024
##$WBSW= 4
##$XGAIN= (0..3)
0 0 0 0 
##$XL= 0
##$YL= 0
##$YMAX_a= 439237
##$YMIN_a= -402090
##$ZGOPTNS= <>
##$ZL1= 120
##$ZL2= 120
##$ZL3= 120
##$ZL4= 120
##$ABSF1= 16.522
##$ABSF2= -4.171173
##$ABSG= 5
##$ABSL= 3
##$ALPHA= 0
##$AQORDER= 0
##$ASSFAC= 0
##$ASSFACI= 0
##$ASSFACX= 0
##$ASSWID= 0
##$AUNMP= <proc_1d>
##$AZFE= 0.1
##$AZFW= 0.1
##$BCFW= 0
##$BC_mod= 0
##$BYTORDP= 0
##$COROFFS= 0
##$CY= 12.5
##$DATMOD= 1
##$DC= 0
##$DFILT= <>
##$DTYPP= 0
##$F1P= 14.0000005364418
##$F2P= -0.99999901652339
##$FCOR= 0.5
##$FTSIZE= 32768
##$FT_mod= 6
##$GAMMA= 0
##$GB= 0
##$INTBC= 1
##$INTSCL= 1
##$ISEN= 128
##$LB= 0.3
##$LEV0= 0
##$LPBIN= 0
##$MAXI= 10000
##$MC2= 0
##$MEAN= 0
##$ME_mod= 0
##$MI= 0
##$NCOEF= 0
##$NC_proc= -2
##$NLEV= 6
##$NOISF1= 0
##$NOISF2= 0
##$NSP= 0
##$NTH_PI= 0
##$NZP= 0
##$OFFSET= 16.522
##$PC= 1
##$PHC0= 153.387
##$PHC1= 2.974071
##$PH_mod= 1
##$PKNL= yes
##$PPARMOD= 0
##$PSCAL= 4
##$PSIGN= 0
##$REVERSE= no
##$SF= 250.13
##$SI= 32768
##$SIGF1= 0
##$SIGF2= 0
##$SINO= 400
##$SIOLD= 32768
##$SREGLST= <1H.CDCl3>
##$SSB= 0
##$STSI= 32768
##$STSR= 0
##$SW_p= 5175.98343685301
##$SYMM= 0
##$S_DEV= 0
##$TDeff= 65536
##$TDoff= 0
##$TI= <Analysis number 999999
Compound Code 99
Book Reference 9
Project Code 9>
##$TILT= no
##$TM1= 0
##$TM2= 0
##$TOPLEV= 0
##$USERP1= <user>
##$USERP2= <user>
##$USERP3= <user>
##$USERP4= <user>
##$USERP5= <user>
##$WDW= 1
##$XDIM= 32768
##$YMAX_p= 462741902
##$YMIN_p= -236994
$$ End of Bruker specific parameters
$$ ---------------------------------
##NTUPLES= NMR SPECTRUM
##VAR_NAME=  FREQUENCY,     SPECTRUM/REAL,   SPECTRUM/IMAG
##SYMBOL=    X,             R,               I
##VAR_TYPE=  INDEPENDENT,   DEPENDENT,       DEPENDENT
##VAR_FORM=  AFFN,          ASDF,            ASDF
##VAR_DIM=   32768,         32768,           32768
##UNITS=     HZ,            ARBITRARY UNITS, ARBITRARY UNITS
##FACTOR=    0.157963299565203, 1,           1
##FIRST=     4132.6476996994, 0,             0
##LAST=      -1043.33573715361, 0,           0
##MIN=       -1043.33573715361, -236994,     0
##MAX=       4132.6476996994, 462741902,     0
$$ Real data points
##PAGE= N=1
##DATA TABLE= (X++(R..R)), XYDATA
$$ [...]
19184A050o84j61L81q77j707J13J904O0Q7O80N48o63q43J454p8j915J060j6j345
$$ 1050 366 205 586 -291 -1998 -1885 19 79 166 846 1394 731 -112 1342 1264 -651 409 393 -952
19165i52p59J003R06J176P30J45j719k004k62J647K91j708j607j255N37J752J641
$$ -952 -1711 -708 198 1374 2104 2249 530 -1474 -1736 -89 202 -1506 -3113 -4368 -3831 -2079 -438
19148d38l41Q72k322l10J365J033j304J652O03j940q81q62K48O40J587J484l65
$$ -438 -779 93 -2229 -2539 -1174 -141 -1445 207 810 -1130 -2011 -2873 -2625 -1985 -398 1086 721
19131G21n75k368Q6J838j375R71J951K82L87n61j305K60J936Q27J549q34k336
$$ 721 146 -2222 -2136 -298 -1673 -702 1249 1531 1918 1357 52 312 2248 3075 4624 3790 1454
19114A454j08p26o39N80l47j685j209Q26N43J468K204K111l69j968k09L09m44
$$ 1454 1346 620 -19 561 214 -1471 -2680 -1854 -1311 157 2361 4472 4103 2135 1926 2235 1791
19097A791k042J083J311n31q18J919o39j072j325j061j095k06j42j56O17l17l90
$$ 1791 -251 832 2143 1612 794 2713 2074 1002 -323 -1384 -2479 -2685 -2827 -2983 -2366 -2683 -3073
19080c073m26k45j577K413J461j57r98m3J609J471J700n59j881m94J038J779k416
$$ -3073 -3499 -3744 -5321 -2908 -1447 -1604 -2602 -2645 -1036 435 2135 1576 -305 -799 239 2018 -398
19063c98j267J95j199N76J628O02l78j253J636Q34l029k362L12K733N65j420J959
$$ -398 -1665 -1470 -2669 -2093 -465 137 -241 -1494 142 976 -2053 -4415 -4103 -1370 -805 -2225 -266
19046b66L48n77M60j651L16J88P9M34R5m13j688J00P87J555N45j214j488L92K42
$$ -266 82 -495 -35 -1686 -1370 -1182 -1103 -669 -574 -987 -2675 -2575 -1788 -233 312 -902 -2390 -1998 -1756
19027a756J889N11l200p80J781R9n88K21K479k76m40m20J8r22J216R80l11n96
$$ -1756 133 644 -2556 -3336 -1555 -1456 -2044 -1823 656 380 -60 -480 -462 -1384 -168 812 501 -95
19009i5j273m1R20J510J15J6j660L77n19J548K06J01l74j083k842j299k6K048
$$ -95 -1368 -1409 -489 1021 1136 1152 -508 -131 -650 898 1104 1205 831 -252 -3094 -4393 -4419 -2371
18991b371J567J821k28j199j498M92K06j423o46J051l17q02J586k115j658J640
$$ -2371 -804 1017 789 -410 -1908 -1416 -1210 -2633 -3279 -2228 -2545 -3347 -1761 -3876 -5534 -3894
18975c894J832j51J33J419o61J070J597J39k24j209l37j22O54J480n96j721j060
$$ -3894 -2062 -2213 -2080 -661 -1322 -252 1345 1484 1260 51 -286 -408 246 1726 1130 -591 -1651
18958a651n73l8J194j160j804j536J585O91j615J10J676J948o88K4N58R19R1Q39
$$ -1651 -2224 -2262 -1068 -2228 -4032 -5568 -3983 -3292 -4907 -4797 -3121 -1173 -1861 -1837 -1279 -360 -269 570
18940E70k40l75j84j151p20K264K997j615K32J981o18j355k063m18n2n90Q45m17
$$ 570 330 -45 -229 -1380 -2100 164 3161 1546 1778 3759 3141 1786 -277 -695 -747 -1337 -492 -909
18922i09M08J310J478M97k774l364P44m47k725N65J244r5j36K602K71K85M53J376
$$ -909 -501 809 2287 2784 10 -3354 -2610 -3057 -5782 -5217 -3973 -4068 -4204 -1602 -1331 -1046 -593 783
18904G83J254j982k839o93J710l57M00M92M94M56q06j696J137J869J96j578k69
$$ 783 2037 55 -2784 -3477 -1767 -2124 -1724 -1232 -738 -282 -1088 -2784 -1647 222 418 -1160 -1429
18887a429J284j181J346O31j419j036L85j096R79J290N44j178j610r88R96k37
$$ -1429 -145 -1326 20 651 -768 -1804 -1419 -2515 -1536 -246 298 -880 -2490 -3478 -2482 -2719
18871b719k38k58R26R07Q2j836Q60j028P52N7L307k11O97o11j552o31n44J29L25
$$ -2719 -2957 -3215 -2289 -1382 -1300 -3136 -2276 -3304 -2552 -2495 812 601 1298 687 -865 -1496 -2040 -1911 -1586
18852a586K44O82p96p07p46J453J482R48j181j196k5K585J582j504J219R83m79
$$ -1586 -1342 -660 -1456 -2163 -2909 -1456 26 974 -207 -1403 -1428 1157 2739 1235 2454 3437 2958
18835B958o44j062q7q34j156j620o01p43K625J360j144j786P12Q59J309m58%j343
$$ 2958 2314 1252 1165 331 -825 -2445 -3046 -3789 -1164 196 -948 -2734 -2022 -1163 146 -312 -312 -1655
18817a655j248j60n99J442L18K00j268j12j419j610K322K258J145j552j579J566
$$ -1655 -2903 -3063 -3662 -2220 -1902 -1702 -2970 -3082 -4501 -6111 -3789 -1531 -386 -1938 -3517 -1951
18801a951K785J297j700j087o59K06K87p93n45J878N76m55L39j41J082k279j402
$$ -1951 834 2131 431 -656 -1315 -1109 -822 -1615 -2160 -282 294 -161 178 37 1119 -1160 -2562
18784b562N33o38J135N61J874N87r67J855J315N45o81j02q60R00M306O260N293
$$ -2562 -2029 -2667 -1532 -971 903 1490 523 2378 3693 4238 3557 3455 2595 3495 7801 14061 19354
18767A9354L671l920o689n134l062j245R7j558r83J315o80l23k000k382J432J297
$$ 19354 23025 19105 12416 7282 4220 2975 3072 1514 531 1846 1166 843 -1157 -3539 -2107 -810
18751h10M92m62M412l7j299j669K24N91N05p90j126j556R66q90P3M93J59Q31k46
$$ -810 -318 -780 3632 3595 2296 627 851 1442 1947 1157 31 -1525 -559 -1449 -1376 -883 -724 107 -139
18732a39j824j558L024K413n78j21O88n56k704M83K02J077K695K060k283j232
$$ -139 -1963 -3521 -497 1916 1338 1217 1905 1349 -1355 -872 -670 407 3102 5162 2879 1647
18716A647R0J526j487j310L82j620J672R14k04j323q24O53K36R56P40k51j207
$$ 1647 1737 3263 1776 466 848 -772 900 1814 1610 287 -537 116 352 1308 2048 1797 590
18699E90J69J051j714k847j0q70k67J148j73J60j156R15j89n87N44j19K371J630
$$ 590 759 1810 96 -2751 -2761 -3631 -3898 -2750 -2923 -2763 -3919 -3004 -3193 -3780 -3236 -3355 -984 646
18681F46N50P02K09j925j136m6j064k304L97q47n35P40K557K164N45o24j668p06
$$ 646 1196 1898 2107 182 -954 -1000 -2064 -4368 -3971 -4818 -5353 -4613 -2056 108 653 29 -1639 -2345
18663b345P2j792m06j77m16O53Q71J839j178p95j776q1J744R55j107J608J570
$$ -2345 -2273 -4065 -4471 -4648 -5064 -4411 -3540 -1701 -2879 -3674 -5450 -5531 -3787 -2832 -3939 -2331 -761
18646g61o6k54L049l11j131R13J106m79o11m93M7j825l31p51o58R13m67Q21R92
$$ -761 -827 -1081 1968 1657 526 1439 2545 2066 1455 962 1009 -816 -1147 -1898 -2556 -1643 -2110 -1289 -297
18627b97J210J362j931k88j024k641M01K75J72K486k97j7N94k02N44p01j089p6
$$ -297 913 2275 344 56 -968 -3609 -3208 -2933 -2761 -275 -572 -589 5 -197 347 -354 -1443 -1519
18609a519k91J280j049l749L63J281O16j71j81P35r13J895k69O52p84j095j14
$$ -1519 -1810 -530 -1579 -5328 -4965 -3684 -3068 -3239 -3420 -2685 -3598 -1703 -1972 -1320 -2104 -3199 -3313
18592c313L50k79l02N17J344J03M16o77n09k24J52R91J251r39k308j767O89m59
$$ -3313 -2963 -3242 -3544 -3027 -1683 -1580 -1164 -1841 -2350 -2574 -2422 -1431 -180 -1119 -3427 -5194 -4505 -4964
18574d964K30J369R98Q55P42j304j648L151P33k156n36j346L18J356J125Q07n22
$$ -4964 -4734 -3365 -2367 -1512 -770 -2074 -3722 -571 162 -1994 -2530 -3876 -3558 -2202 -1077 -270 -792
18557g92m72j13j08J74o70j547Q2K579J155R69O98k4j906r87R60o00O02N48j137
$$ -792 -1264 -1377 -1485 -1311 -1981 -3528 -3446 -867 288 1257 1955 1931 25 -962 -2 -602 0 548 -589
18538e89m21q72N96K627j082j012j955j470R77J502J578j134j584J20K317n74
$$ -589 -1010 -1882 -1286 1341 259 -753 -2708 -4178 -3201 -1699 -121 -1255 -2839 -2719 -402 -976
18522i76m28j053J58q37j44l59M07J965R4j537J89J277j45k71k248o60j40o80
$$ -976 -1404 -2457 -2299 -3136 -3280 -3639 -3232 -1267 -1173 -2710 -2521 -1244 -1389 -1660 -3908 -4568 -4708 -5388
18504e388J809K063q63J263q18j215L90K445N14M0j005M99J277J343Q04K18j748
$$ -5388 -3579 -1516 -2379 -1116 -1934 -3149 -2759 -314 200 240 -765 -266 1011 2354 3158 3376 1628
18487A628p86k040j773j4n64P77K120J085r34j014n41j059L17P09K8J09P94l21
$$ 1628 842 -1198 -2971 -2985 -3549 -2772 -652 433 -501 -1515 -2056 -3115 -2798 -2089 -2061 -1952 -1158 -1479
18469a479j071P24R92l67K22J667O63k043p54l2J452k66j923n49K9J32Q15j84
$$ -1479 -2550 -1826 -834 -1201 -979 688 1351 -692 -1446 -1478 -26 -292 -2215 -2764 -2735 -2603 -1788 -1972
18451a972j189P18K39L23J089j24o44j219K355M75k607j047j155j131O74K868
$$ -1972 -3161 -2443 -2204 -1881 -792 -916 -1560 -2779 -424 51 -2556 -3603 -4758 -5889 -5215 -2347
18435b347J527J1m58k680J327J080M7k093M16J042P10K242J165j86q5k37j863
$$ -2347 -820 -809 -1267 -3947 -2620 -1540 -1493 -3586 -3170 -2128 -1418 824 1989 1803 1718 1481 -382
18418c82J66J823q34j106K096N194K994j180l211j410j503l23P86J67j110j531
$$ -382 -216 1607 773 -333 1763 6957 9951 8771 5560 4150 2647 2324 3110 3277 2167 636
18402F36Q24o20L5M46N72Q89N33j129n05P6n50L96J60j939l65J601N3J800P55
$$ 636 1460 840 875 1321 1893 2782 3315 2186 1681 1757 1207 1603 1763 -176 -541 1060 1113 2913 3668
18383C668j528m54r63q01J903O64J091j843j097k228k3j64K358J879j371p63M74
$$ 3668 2140 1686 723 -78 1825 2489 3580 1737 640 -1588 -1611 -1775 583 2462 1091 328 802
18366H02J746kj810J158j252k627l13J034M09k78M18p14l06j41r9K17K35K912
$$ 802 2548 2546 736 1894 642 -1985 -2298 -1264 -855 -1133 -715 -1429 -1735 -1876 -1975 -1758 -1523 1389
18348A389Q12o21k001J44l18m3j504R00J035j345j005J532O37L14J047N65J34
$$ 1389 2201 1580 -421 -277 -595 -638 -2142 -1242 -207 -1552 -2557 -1025 -388 -74 973 1538 1672
18331A672o37j412J921j844l202J542J124L79J373J400K12n36p62q97j479L43
$$ 1672 1035 -377 1544 -300 -3502 -1960 -836 -457 916 2316 2528 1992 1230 333 -1146 -803
18315h03P01M15J91O36l19k246J57m55O91J861J930j248l98k37N05N25j616k093
$$ -803 -102 313 504 1140 821 -1425 -1268 -1723 -1032 829 2759 1511 1113 876 1381 1906 290 -1803
18297a803Q23n38j147N88ML001L280q8k593k599P03K061j7j867l73K56p07P6J089
$$ -1803 -980 -1518 -2665 -2077 -2073 928 4208 4120 1527 -1072 -369 1692 1675 -192 -565 -309 -1016 -940 149
18278A49k51j504j906J205J358M63J75l80q5N16J98N07K60K04P33O08k308n67
$$ 149 -102 -1606 -3512 -2307 -949 -486 -311 -691 -776 -260 -62 445 705 909 1642 2250 -58 -625
18260f25R44j033q83j02J101L64K794J324j530j025m96j979j272J408P32o55o41
$$ -625 319 -714 -1597 -1699 -598 -234 2560 3884 2354 1329 833 -1146 -2418 -1010 -278 -933 -1574
18243a574j577j220j990J434L884K499J586m9J338O41R36K4j286r0J070q54K23
$$ -1574 -3151 -4371 -6361 -4927 -1043 1456 3042 2993 4331 4972 5908 5932 4646 4556 5626 4772 4995
18226D995M16j084j372l270j044k11K844K088K37j608j479l32o97r34N42J065
$$ 4995 5411 4327 2955 -315 -1359 -1570 1274 3362 3599 1991 512 180 -517 -1451 -909 156
18210A56Q33q84k6J98r1j356O34p25J135J70o96k7n24r18K65O05j283o70K193
$$ 156 989 105 79 277 186 -1170 -536 -1261 -126 44 -652 -679 -1203 -2121 -1856 -1251 -2534 -3204 -1011
18191a011J937L31k94K31q25k93O59q26j029J759J630j228J541j721k149j711
$$ -1011 926 1257 963 1194 369 76 735 -91 -1120 639 2269 1041 2582 861 -1288 -2999
18175b999K570J982Q96J019j470j507K055Q16N31k8l090j297K111J466m43j56
$$ -2999 -429 1553 2449 3468 1998 491 2546 3362 3893 3865 775 -522 1589 3055 2612 2456
18159B456L98J099R33m6N32L07K301K628q31j425R72n22P57J443r52J236J965
$$ 2456 2854 3953 4886 4840 5372 5679 7980 10608 9777 8352 9324 8802 9559 11002 10050 11286 13251
18142A3251O61P67n80m069q5K298J713J735L039j21L39K636J550N114L503K275
$$ 13251 13912 14679 14099 10030 9945 12243 13956 15691 18730 18609 18948 21584 23134 28248 31751 34026
18126C4026L164N642P529R218R585O947P744J3297K0149K7349L0827M2739O7750
$$ 34026 37190 42832 50361 59579 69164 76111 83855 97152 117301 144650 175477 218216 285966
18113B85966J15487J98452L61327O86200J095945R64769K26441r96693j229486
$$ 285966 401453 599905 961232 1647432 2743377 3708146 3934587 2937894 1708408
18104A708408p03721l55914j91907j18575p7609n6540m2500l0636j9928j6140
$$ 1708408 1004687 648773 456866 338291 260682 204142 161642 131006 111078 94938
18094I4938j3674j3350j1458p977n547m767m642l991j964j029l054k356j553j077
$$ 94938 81264 67914 56456 48479 42932 38165 33523 29532 27568 26539 23485 21129 19576 18499
18080A8499j474k256r84M92J233J894k72j721j433k311j177r20j810l397j272
$$ 18499 17025 14769 13785 14277 15510 17404 17132 15411 13978 11667 10490 9570 7760 4363 3091
18065C091o89P86K36O71Q18k061j995r2J94n31K97O41K67J122l28n70j164j685
$$ 3091 2402 3188 3424 4095 4913 2852 857 765 959 428 725 1366 1633 2755 2427 1857 693 -992
18047i92J662J292q65j50r94m32J246Q86Q64P07k11j41j006m60J824M84o42k894
$$ -992 670 1962 1097 947 -47 -479 767 1653 2517 3224 3013 2872 1866 1406 3230 3714 3072 178
18029A78j363K57R69j105J72L55K98K0j490l54J785k320j643J860r7R70J741o59
$$ 178 -1185 -928 41 -1064 -892 -537 -239 -219 -1709 -2063 -278 -2598 -4241 -2381 -2478 -1508 233 -426
18011d26j9p67K32N02J7j541j88J230N63O05j722k92J03J237k89J380J940k542
$$ -426 -445 -1212 -980 -478 -461 -2002 -2190 -960 -397 208 -1514 -1806 -1703 -466 -755 625 2565 23
17993B3j190l60j54o73O12O42J87l93O69R32P05j204L8J91J511J326M15J21m85
$$ 23 -1167 -1527 -1681 -2354 -1742 -1100 -913 -1306 -637 295 1000 -204 -166 25 1536 2862 3277 3398 2913
17974B913J580n08j380j830M21Q01j991l053R87K318L6n99Q28J149J554k150j274
$$ 2913 4493 3985 2605 775 1196 1997 6 -3047 -2060 258 294 -305 523 1672 3226 1076 -198
17957a98r63m59P76J372q9k497l39r05k09J20P88J115M0J27N3o00j881j579J329
$$ -198 -1161 -1620 -844 528 439 -2058 -2397 -3302 -3511 -3391 -2603 -1488 -1448 -1321 -1268 -1868 -3749 -5328 -3999
17938c999J253L42Q61j69o39N86k854l134J540K633J473l65K446J572J55n4kl42
$$ -3999 -2746 -2404 -1543 -1712 -2351 -1765 -4619 -7753 -6213 -3580 -2107 -2472 -26 1546 1701 1647 1645 1303
17920A303j085k942k399k09J009K422L22k010J729L68p86rk67q5j16J901O13M57
$$ 1303 218 -2724 -5123 -5332 -4323 -1901 -1579 -3589 -1860 -1492 -2278 -2287 -2554 -2639 -2755 -854 -241 216
17902B16p90r47k446M67K02K20L41K43Q12M13P40k51k646n14J820J572N48n14
$$ 216 -574 -1521 -3967 -3500 -3298 -3078 -2737 -2494 -1682 -1269 -529 -780 -3426 -3940 -2120 -548 0 -514
17884e14k337J863J193j613J34K116j40k142j811P83J289p10o14J94L382J963
$$ -514 -2851 -988 205 -1408 -1274 842 702 -1440 -3251 -2468 -1179 -1889 -2503 -2309 1073 3036
17868C036q70j218j32q75j064m59k62j056r01P54j99P92O67j406j47q11j151K256
$$ 3036 2166 948 816 -59 -1123 -1582 -1844 -2900 -3801 -3047 -3246 -2454 -1787 -3193 -3340 -4151 -5302 -3046
17850c046J365L25M00M46R97q09q48J609K360j374k662p97L24k55L18j445J03
$$ -3046 -1681 -1356 -956 -510 487 -322 -1170 439 2799 1425 -1237 -2034 -1710 -1965 -1647 -3092 -2989
17833b989q8J728R74p1j774m56Q54jR61m37J257j520J149j349r22K16l80j071
$$ -2989 -3077 -1349 -375 -446 -2220 -2676 -1822 -1823 -862 -1299 -42 -1562 -413 -1762 -2684 -2468 -2848 -3919
17815c919l13K303l61p97j637R76j11P15RJ06Q62j310n88Q68p66o21J023R74L29
$$ -3919 -4232 -1929 -2290 -3087 -4724 -3748 -3859 -3144 -3135 -3029 -2167 -3477 -4065 -3197 -3963 -4584 -3561 -2587 -2258
17796b258p99J011j137M79M192j080j651n46O86p3q14j748J353K793R42Q27P02
$$ -2258 -3057 -2046 -3183 -2704 1488 408 -1243 -1789 -1103 -1176 -1990 -3738 -2385 408 1350 2177 2879
17779B879j578k129o98J849M13n38Q52k045o05K793Jj767J011L58j684N27N21
$$ 2879 1301 -828 -1526 323 736 198 1050 -995 -1600 1193 1194 -573 438 796 -888 -361 160
17762A60m00j92j21J3k50J93o64J139Q8J88n74o20l77j840j741M17Q45L900K400
$$ 160 -240 -432 -553 -540 -790 -597 -1261 -122 -34 154 -420 -1040 -1417 -3257 -4998 -4581 -3736 164 2564
17743B564N9j148r36J169l88l100k319K21L96K083J496M01j683j867j404K99J176
$$ 2564 2623 1475 539 1708 1320 -1780 -4099 -3878 -3482 -1399 97 498 -1185 -3052 -4456 -4157 -2981
17726b981J874K541M77k631j766J07J91J482k40j252M25r44k441J79r6N85Q5M98
$$ -2981 -1107 1434 1911 -720 -2486 -2379 -2188 -706 -946 -2198 -1773 -2717 -5158 -4979 -5075 -4490 -4405 -3907
17708c907K870R42q93k186J055Q46j113j014K49N54J279J583j319j880k15P74
$$ -3907 -1037 -95 -988 -3174 -2119 -1273 -2386 -3400 -3151 -2597 -1318 265 -1054 -2934 -3149 -2375
17692b375r73j315O32J479N32O09m27j071j162J257m12m87K7m22J912P59k77K69
$$ -2375 -3348 -4663 -4031 -2552 -2020 -1411 -1838 -2909 -4071 -2814 -3226 -3713 -3686 -4108 -2196 -1437 -1714 -1445
17674a445J032O7j853M48k4J707l74m92k27Q99m52J342j015j102j369K009J177
$$ -1445 -413 -346 -2199 -1751 -1775 -68 -442 -934 -1161 -262 -714 628 -387 -1489 -2858 -849 328
17657C28L51m23Q43j443k591J718P86P93j500J182o00j894O22J389j235q24m29
$$ 328 679 256 1099 -344 -2935 -1217 -431 362 -1138 44 -556 -2450 -1828 -439 -1674 -2498 -2927
17640b927m13L4L02Q0k52J105j587R1K104J30o54m09J843Q72l769j198M06p92
$$ -2927 -3340 -3306 -3004 -2924 -3176 -2071 -3658 -3567 -1463 -1333 -1987 -2396 -553 319 -3450 -4648 -4242 -5034
17622e034K291J034o67P2j034k95J699Q22k95P01L52o41O57O49k076k62l83L33
$$ -5034 -2743 -1709 -2376 -2304 -3338 -3633 -1934 -1112 -1407 -706 -354 -995 -338 311 -1765 -2027 -2410 -2077
17604b077N26J384j087L43J821j32J758o25j59j946k679Q03J194R48j605Q81j150
$$ -2077 -1551 -167 -1254 -911 910 778 2536 1911 1752 -194 -2873 -2070 -876 72 -1533 -652 -1802
17587a802l315J113L117j69k66j22q41j084o26J505K306J882O61j764j481J27
$$ -1802 -5117 -4004 -887 -1056 -1322 -1444 -2285 -3369 -3995 -2490 -184 1698 2359 595 -886 -759
17571g59r19k295N54J583n7q91J319q97r93K622r69q36K989M70k356j259K27Q84
$$ -759 -1678 -3973 -3419 -1836 -1893 -2784 -1465 -2362 -3355 -733 -1702 -2538 451 921 -1435 -2694 -2467 -1583
17553a583J321J117m72l00j980J90j70j200J878R20k924m75L11Q11K466P81Q43
$$ -1583 -262 855 383 83 -1897 -1707 -1877 -3077 -1199 -279 -3203 -3678 -3367 -2556 -90 691 1534
17536A534j781j984j466m40N79N13R91P6K835K53j995o98J051J386o01J137l67
$$ 1534 -247 -2231 -3697 -4137 -3558 -3045 -2054 -1978 857 1110 -885 -1583 -532 854 253 1390 1023
17519A023k061N47J269J7j312l66q64M92p2j849j236J570P10j096K110J251k165
$$ 1023 -1038 -491 778 795 -517 -883 -1747 -1255 -1327 -3176 -4412 -2842 -2132 -3228 -1118 133 -2032
17502b032j923PL174p40J001j03J790K37j637L19J704K820N39k860j656q24M89
$$ -2032 -3955 -3948 -774 -1514 -513 -616 1174 1411 -226 93 1797 4617 5156 2296 640 -184 305
17485C05j770q61l50m40J38K218p11m21Q74j409q29j25o31m5P23j6K044J078J25
$$ 305 -1465 -2326 -2676 -3116 -2978 -760 -1471 -1892 -1018 -2427 -3256 -3381 -4012 -4057 -3334 -3350 -1306 -228 -103
17466a03k411j814K006J454k6r58l94P5j19M11j316J74p46J174J301k67j152J572
$$ -103 -2514 -4328 -2322 -868 -894 -1852 -2246 -2171 -2290 -1879 -3195 -3021 -3767 -2593 -1292 -1559 -2711 -1139
17448a139j276q03o19J472K217K158L140P022M712J265k598o575m519N66n13k706
$$ -1139 -2415 -3218 -3837 -2365 -148 2010 5150 12172 16884 18149 15551 8976 4457 5023 4510 1804
17432A804j709j171k816L84r4K843J240M34K21j391N34J82o28o92p76k7j020j173
$$ 1804 95 -1076 -3892 -3508 -3602 -759 481 915 1136 -255 279 461 -167 -859 -1635 -1662 -2682 -3855
17414c855jR21J96N57J063l63j677j60J69J046l5m79J210J504j028j399q74L13
$$ -3855 -3856 -2935 -2739 -2182 -1119 -1482 -3159 -3319 -3150 -2104 -2139 -2618 -1408 96 -932 -2331 -3205 -2892
17396b892J103L78R7M43l2n88J226L98j854j294j638M90J631N28J747Q45k217
$$ -2892 -1789 -1411 -1314 -871 -903 -1491 -265 133 -1721 -3015 -4653 -4163 -2532 -2004 -257 588 -1629
17379a629k507L72K55O84o83m15M61M26J66j7K625K521l05q39L2p33P85q51j188
$$ -1629 -4136 -3764 -3509 -2825 -3508 -3923 -3462 -3036 -2870 -2887 -262 2259 1954 1115 1147 414 1199 348 -840
17360h40q81j853l91j112L98J238Q07M60j693L17N01J045o1R37J7k11M5r84J272
$$ -840 -1721 -3574 -3965 -5077 -4679 -3441 -2634 -2174 -3867 -3550 -3049 -2004 -2065 -1128 -1111 -1322 -1277 -2261 -989
17341i89K53j273j393k6P37k76J961J889j84n55k179Q08m10K35N14J344n09Q58
$$ -989 -736 -2009 -3402 -3428 -2691 -2967 -1006 883 699 144 -2035 -1227 -1637 -1402 -888 456 -53 805
17323H05Q35Q78j370m20j565j241Q96K96mq96Q95J677K67q02J35k385k62J090
$$ 805 1640 2518 1148 728 -837 -2078 -1182 -886 -890 -1786 -891 786 1053 251 386 -1999 -2261 -1171
17305a171l26k0L65K34R98K31q23j763J521J793o23R00P12j934k498m29j272K655
$$ -1171 -1497 -1517 -1152 -918 80 311 -512 -2275 -754 1039 416 1316 2028 94 -2404 -2833 -4105 -1450
17287a450K352m47q40m02k366J931J855K039L94Q95L16j813l770j357r43j094
$$ -1450 902 455 -385 -787 -3153 -1222 633 2672 3066 3961 4277 2464 -1306 -2663 -3606 -4700
17271d700q70J407j61r43J577L99L040L322Q67j369k550j079j804k839J961K797
$$ -4700 -5570 -4163 -4324 -5267 -3690 -3291 -251 3071 3938 2569 19 -1060 -2864 -5703 -3742 -945
17255i45j224n72J167O36j788j071j458K68K529K175P10k11J649r42k099j159
$$ -945 -2169 -2741 -1574 -938 -2726 -3797 -5255 -4987 -2458 -283 427 216 1865 923 -1176 -2335
17239b335J053K007L38Q46M67j307j489p20p04j651J316J129j097J589J592P45
$$ -2335 -1282 725 1063 1909 2376 1069 -420 -1140 -1844 -3495 -2179 -1050 -2147 -558 1034 1779
17223A779j390j304J645J740J998J20j765k38k25j702k049k21J419K714n00m97
$$ 1779 389 -915 730 2470 4468 4588 2823 2585 2360 658 -1391 -1612 -193 2521 2021 1524
17207A524L589J675j927n024j658j046J723L105j595j184j282M88K54r93k905
$$ 1524 5113 6788 4861 -163 -1821 -2867 -1144 1961 366 -818 -2100 -1612 -1358 -2351 -5256
17192e256p09j96M38K554K05N98m9m48O72n37P85l7n05k160q38O13J81J23K238
$$ -5256 -5965 -6161 -5723 -3169 -2964 -2366 -2415 -2863 -2191 -2728 -1943 -1980 -2485 -4645 -5483 -4870 -4689 -4566 -2328
17173b328k91O73J442l05m21O4K044N55j064J096j57J64j233M34n36k47j707j021
$$ -2328 -2619 -1946 -504 -809 -1230 -1166 878 1433 369 1465 1308 1472 239 673 137 -110 -1817 -2838
17155b838k035J210K884k48j288k11r8O08m3j469l33R43J115l74l25O28J228n08
$$ -2838 -4873 -3663 -779 -1027 -2315 -2526 -2624 -2016 -2059 -3528 -3861 -2918 -1803 -2177 -2502 -1874 -646 -1154
17137a154p95N8J700R39J151j451j699j556J73j279m99J411M85J150J321K48l00
$$ -1154 -1949 -1891 -191 748 1899 448 -1251 -2807 -2634 -3913 -4412 -3001 -2516 -1366 -45 203 -97
17120i7m49p59q97n93j40r4O10n6M45K875J723j680j349M39K52O10q60N06r78
$$ -97 -546 -1305 -2202 -2795 -2935 -3029 -2419 -2475 -2030 845 2568 888 -461 -22 230 840 -20 486 -492
17101d92r95j745n73K002j143q14K05Q57K557L25l15L33j33j063l079p60L137
$$ -492 -1487 -3232 -3805 -1803 -2946 -3760 -3555 -2698 -141 184 -131 202 69 -994 -4073 -4833 -1696
17084a696P47o10j17j113j907M2J169M21P13j32J47K91j593j158m4J65P08J191
$$ -1696 -949 -1559 -1676 -2789 -4696 -4654 -3485 -3064 -2351 -2483 -2336 -2045 -3638 -4796 -4840 -4675 -3967 -2776
17066b776J183j034J496Q80j817K74N41J623k36r34J957P95L95M92j591k096j950
$$ -2776 -1593 -2627 -1131 -251 -2068 -1794 -1253 370 134 -800 1157 1952 2347 2839 1248 -848 -2798
17049b798r89k89J380R09o00m60j966O2L199r47j170J619K248r69p12J380j696
$$ -2798 -3787 -4076 -2696 -1787 -2387 -2847 -4813 -4751 -1552 -2499 -3669 -2050 198 -771 -1483 -103 -1799
17032a799J43N39J77k238j012J423L29R02K004J140l21j000o37m17R80J65k130
$$ -1799 -1656 -1117 -940 -3178 -4190 -2767 -2438 -1536 468 1608 1287 287 -350 -767 213 378 -1752
17015a752p20K03J583Q40k81j857j55L73j181J094q24j64J591O59o04j485j454
$$ -1752 -2472 -2269 -686 154 -127 -1984 -2139 -1766 -2947 -1853 -2677 -2841 -1250 -591 -1195 -2680 -4134
16998d134q76K89N69J919j151o05J38o81J981R11n65k10j09Q41J513N10P5j255
$$ -4134 -5010 -4721 -4152 -2233 -3384 -3989 -3851 -4532 -2551 -1640 -2205 -2415 -2524 -1683 -170 340 415 -840
16980h40N00m00K29P04Q05j075l18L97l28k435j039P50J621J364O75K57J66k95
$$ -840 -340 -740 -511 193 998 -77 -395 2 -326 -2761 -3800 -3050 -1429 -65 610 867 1033 738
16962G38Q22k016j629j225J416j505n36O20j873J72L114n12l30j935K26J808Q10
$$ 738 1560 -456 -2085 -3310 -1894 -3399 -3935 -3315 -5188 -5016 -1902 -2414 -2744 -4679 -4453 -2645 -1835
16945a835J34j21j125M31R80L190J168j634L71L060j774l866j649k1J994K487
$$ -1835 -1701 -1822 -2947 -2516 -1536 1654 2822 1188 1559 4619 2845 -1021 -2670 -2691 -697 1790
16929A790j261j394n55n04J016O10O63p15j404L24J71P51j97N38k62l06O95J427
$$ 1790 529 -865 -1420 -1924 -908 -298 365 -350 -1754 -1430 -1259 -508 -705 -167 -429 -735 -40 1387
16911A387O56n58j63r4j209K260k91k83o61j759q87j180O2N77k23N89j267J03
$$ 1387 2043 1485 1322 1228 19 2279 1988 1705 1044 -715 -1602 -2782 -2720 -2143 -2366 -1777 -3044 -2941
16893b941K407m66j039l19Q29R83P67n5k5K381J585L00l52m71j340j202l276m67
$$ -2941 -534 -1000 -2039 -2358 -1529 -546 221 166 141 2522 4107 4407 4055 3584 2244 1042 -2234 -2701
16875b701J385P40k495j255L12L162L927j383j742j22Lo72j355R66J054q34Q15
$$ -2701 -1316 -576 -3071 -4326 -4014 -852 3075 1692 -50 -172 -169 -841 -2196 -1230 -176 -1010 -195
16858a95P69M6J456l226j552J027P36Q83j598m35k38k83L58N68m34j826j599M08
$$ -195 574 620 2076 -1150 -2702 -1675 -939 -56 -1654 -2089 -2327 -2610 -2252 -1684 -2118 -3944 -5543 -5135
16840e135R0J933J927L487L38k730p26M05M55j869N92K428K873J58k212j21J33
$$ -5135 -5045 -3112 -1185 2302 2640 -90 -816 -411 44 -1825 -1233 1195 4068 4226 2014 1893 2026
16823B026n57j304j416O91J947J116j90k458j234o97j38K075n52j648J152L93
$$ 2026 1469 165 -1251 -560 1387 2503 2313 -145 -1379 -2076 -2214 -139 -691 -2339 -1187 -794
16807g94p75M40J482K61q73J181L39j349q05m18Q81R3k6N60O68p68j291J098Q22
$$ -794 -1569 -1129 353 614 -259 922 1261 -88 -893 -1311 -430 -337 -363 197 865 97 -1194 -96 726
16788G26j119N79Q54l5k107k83O79l31R50k059M08O69Q04J45J097m7k061N40q70
$$ 726 -393 186 1040 1005 -1102 -1385 -706 -1037 -87 -2146 -1738 -1069 -265 -120 977 930 -1131 -591 -1461
16769a461M47L072K456k047j666j793q0j13o76P31J085q48l53J259m78j074R64
$$ -1461 -1014 2058 4514 2467 801 -992 -1072 -1185 -1861 -1130 -45 -893 -1246 13 -465 -1539 -575
16752e75N61L33M30J500k30n36J165q58k634j0P33j558j260J521J535l44O98p1
$$ -575 -14 319 749 2249 2019 1483 2648 1790 -844 -854 -121 -1679 -2939 -1418 117 -227 471 400
16734D00o08m41j890j960j020k5O61K243J314J746J058K07k57j699k172m74Q2
$$ 400 -208 -649 -2539 -4499 -5519 -5544 -4883 -2640 -1326 420 1478 1685 1428 -271 -2443 -2917 -2835
16717b835p25J074M78j988J902Q2k796P40J753Q3k5P5J093J212R14j177k181j05
$$ -2835 -3560 -2486 -2008 -3996 -2094 -2012 -4808 -4068 -2315 -2232 -2257 -2182 -1089 123 1037 -140 -2321 -2426
16699b426J826Q97r88r09K180r31j322J338Q29p01N67j24j984o86k75Q63J42m82
$$ -2426 -600 297 -691 -1600 580 -351 -1673 -335 494 -207 360 236 -1748 -2434 -2709 -1846 -1704 -2186
16681b186P83Q79K048k39j53m06L46j65L67j734k186K19P84j810N23J055J222
$$ -2186 -1403 -524 1524 1285 1132 726 1072 907 1274 -460 -2646 -2427 -1643 -3453 -2930 -1875 -653
16664f53O78n96M73K91J800j315k519J365J622j161J841J314j761R57r0m85n41
$$ -653 25 -571 -98 193 1993 678 -1841 -476 1146 -15 1826 3140 1379 2336 2246 1761 1220
16647A220L99P09J41n51k4M5j610o56q56p28J307K097j82j169O98K303n0j528
$$ 1220 1619 2328 2469 1918 1894 1939 329 -327 -1183 -1911 -604 1493 1311 142 840 3143 3093 1565
16629A565k740l03r02J032R20K343N04j293L38R0M39j318o86j482j989k48J182
$$ 1565 -1175 -1478 -2380 -1348 -428 1915 2419 1126 1464 1554 1993 675 -11 -1493 -3482 -3730 -2548
16612b548Q17K95J707M63o96k056J007J610j622j831J82j3N70J194P17m44l02
$$ -2548 -1731 -1436 271 734 38 -2018 -1011 599 -1023 -2854 -2672 -2685 -2115 -921 -204 -648 -950
16595i50Q71j592j369j171J356K077N46j076j521q31P9M51R79Q67J185j683j218
$$ -950 -79 -1671 -3040 -4211 -2855 -778 -232 -1308 -2829 -3660 -3581 -3130 -2151 -1284 -99 -1782 -3000
16578c000L6R99L85l97k040j7m03k112N3J568K076O96M53p56K4l25J17r57m06
$$ -3000 -2964 -1965 -1580 -1977 -4017 -4034 -4437 -6549 -6496 -4928 -2852 -2156 -1703 -2459 -2435 -2760 -2643 -3600 -4006
16559d006R82J994M8J20J78m4j46M85r28o44m51j125K84J038J188j270r21j001
$$ -4006 -3024 -1030 -982 -862 -684 -728 -874 -389 -1317 -1961 -2412 -3537 -3253 -2215 -1027 -2297 -3218 -4219
16541d219P70J840L20p99J119J67o04J4r04Q59P26j73o84Q60o37Q19L69L67J832
$$ -4219 -3449 -1609 -1289 -2088 -969 -802 -1406 -1392 -2296 -1437 -711 -884 -1568 -708 -1345 -526 -157 210 2042
16522B042M18j148m19j035k314k128j023L16J006K461j30j57j820P6O02J140R46
$$ 2042 2460 1312 893 -142 -2456 -4584 -5607 -5291 -4285 -1824 -1954 -2111 -3931 -3855 -3253 -2113 -1167
16505a167J130J155r1q97j390O1K89L35N39m71m78j297J06J678L42J45J78j893
$$ -1167 -37 1118 1027 130 -1260 -1199 -910 -575 -36 -507 -985 -2282 -2176 -498 -156 -11 167 -1726
16487a726L52l14p27O35q13j10J473K70j031N65L29Q41Q96R35j712K13p12o14
$$ -1726 -1374 -1688 -2415 -1780 -2593 -2703 -1230 -960 -1991 -1426 -1097 -256 640 1575 -137 76 -636 -1250
16469a250K369R29r89j914k753N3J497J628P71j477j951J09J362J445n96j081
$$ -1250 1119 2048 1059 -855 -3608 -3555 -2058 -430 341 -1136 -3087 -2978 -1616 -171 -767 -1848
16453a848o37J352r23p33J552k12j248n98J025m8K28j884M3k569p53L168K316
$$ -1848 -2485 -1133 -2056 -2789 -1237 -1449 -2697 -3295 -2270 -2318 -2090 -3974 -3931 -6500 -7253 -4085 -1769
16436a769K259j309K72N47J276J141q88k39m43j559p08P09Q45n65q23k06j282
$$ -1769 490 -819 -547 0 1276 2417 1529 1290 847 -712 -1420 -711 134 -431 -1254 -1460 -2742
16419b742r87j071J063J462j102n50N36m05Q64j424r08P74J644K093J471n05r76
$$ -2742 -3729 -4800 -3737 -2275 -3377 -3927 -3391 -3796 -2932 -4356 -5264 -4490 -2846 -753 718 213 -763
16402g63k197j664p16N41Q97J232k65j161K535J336m95j02J63%m42l096j321j124
$$ -763 -2960 -4624 -5340 -4799 -3902 -2670 -2935 -4096 -1561 -225 -720 -822 -659 -659 -1101 -4197 -5518 -6642
16384f642J432J075Q14K190P44r04j027m67O85j067n45J163L40j95o94l67q76
$$ -6642 -5210 -4135 -3321 -1131 -387 -1291 -2318 -2785 -2100 -3167 -3712 -2549 -2209 -2404 -3098 -3465 -4341
16367d341J76j0r82j429j132J939J469K341J427m51K85n37n1m98r76p64j26K59
$$ -4341 -4165 -4175 -5157 -6586 -7718 -5779 -4310 -1969 -542 -993 -708 -1245 -1296 -1794 -2770 -3534 -3660 -3401
16349c401J37o9J533K1N36Q49r79k06J081M17j511oJ454r28k00j279j506r69N75
$$ -3401 -3264 -3333 -1800 -1779 -1243 -394 -1373 -1579 -498 -81 -1592 -1598 -144 -1072 -1272 -2551 -4057 -5026 -4451
16330d451K872N14o96k056L26P05L37j37l94R89P33J23P1J426R73l75r68M85J117
$$ -4451 -1579 -1065 -1761 -3817 -3491 -2786 -2449 -2586 -2980 -1991 -1258 -1135 -1064 362 1335 960 -8 477 1594
16311A594p6j674J68j093n66J4J172q42j774J450R60J43K390J57j787j168Q64
$$ 1594 1518 -156 12 -1081 -1647 -1633 -461 -1303 -3077 -1627 -667 -524 1866 2023 236 -932 -68
16294f8R97L248k20j243j048q24m48l22j173j161j219n53R8R06n70j500J185M89
$$ -68 929 4177 3957 2714 1666 842 394 72 -1101 -2262 -3481 -4034 -3936 -3030 -3600 -5100 -3915 -3426
16276c426Q43Q77j305n60j560J502K39o90J049k172k445K148J950j490j12Q85
$$ -3426 -2583 -1706 -3011 -3571 -5131 -3629 -3390 -4080 -3031 -5203 -7648 -5500 -3550 -5040 -5152 -4267
16260d267J476J227P89J822r7k042p92m42o29l88k96L2n28J186J868J811j428
$$ -4267 -2791 -1564 -775 1047 950 -1092 -1884 -2326 -2955 -3343 -3639 -3607 -4135 -2949 -1081 730 -698
16243f98n35M20J211K41j417j395k231j17K911l26j476R8J98Q13j961N66J002
$$ -698 -1233 -813 398 639 -778 -2173 -4404 -4521 -1610 -1936 -3412 -3314 -3116 -2303 -4264 -3698 -2696
16226b696o35o67Q24J265L78O89m29j076JQ7j651R56oR19J373P70l443k350N27
$$ -2696 -3331 -3998 -3174 -1909 -1531 -842 -1271 -2347 -2346 -2259 -3910 -2954 -2960 -2041 -668 102 -3341 -5691 -5164
16207e164P30K008P10k45K39k577j232J587R84J706M74K53Q10R5O0j101j578k018
$$ -5164 -4434 -2426 -1716 -1961 -1722 -4299 -5531 -3944 -2960 -1254 -780 -527 283 378 438 -663 -2241 -4259
16189d259O55L354O54j046o04j16K645M98j93k26P51L05L42j921l181j535m90
$$ -4259 -3604 -250 404 -642 -1246 -1362 1283 1781 1588 1362 2113 2418 2760 839 -2342 -3877 -4367
16172d367P30Q51J456R41j923k78J432j502j167R30j161o19J473J616N14M34m45
$$ -4367 -3637 -2786 -1330 -389 -2312 -2590 -1158 -2660 -3827 -2897 -4058 -4677 -3204 -1588 -1074 -640 -1085
16155a085K2O40O65N96j578r24L14K57p08K61J423J165L41o62M5j200r37n10J26
$$ -1085 -1063 -423 242 838 -740 -1664 -1350 -1093 -1801 -1540 -117 1048 1389 727 772 -428 -1365 -1875 -1749
16136a749N44O17j251o98J685j304k256lk42k32L086K678N5j745oO55j967j354
$$ -1749 -1205 -588 -1839 -2537 -852 -2156 -4412 -4415 -4657 -4889 -1803 875 930 -815 -821 -166 -2133 -3487
16118c487J6m26K13j65Q65J325J741j28k111j010N48p2j206J498J274j036K45
$$ -3487 -3471 -3897 -3684 -3849 -2984 -1659 82 -46 -2157 -3167 -2619 -2691 -3897 -2399 -1125 -2161 -1916
16101a916l3J411P77j250j826O33O25n16l70K34n12N73R25k42N61M62k17j360
$$ -1916 -1949 -538 239 -1011 -2837 -2204 -1579 -2095 -2465 -2231 -2743 -2170 -1245 -1487 -926 -464 -681 -2041
16083b041J557r05p64L30m61n08l10Q55j079j726O35L82J528K225R00k831J0M29
$$ -2041 -484 -1389 -2153 -1823 -2284 -2792 -3102 -2247 -3326 -5052 -4417 -4035 -2507 -282 618 -2213 -2203 -1774
16065a774J038R55O43K87l231N57p59Q52o68j938q11j73l75J966J509q84j594
$$ -1774 -736 219 862 1149 -2082 -1525 -2284 -1432 -2100 -4038 -4849 -5022 -5397 -3431 -1922 -2806 -4400
16048d400k009J461K247j76J32p91k137j93L058r37J789R61L18L28j026q01J11
$$ -4400 -6409 -4948 -2701 -2877 -2745 -3536 -5673 -5866 -2808 -3745 -1956 -995 -677 -349 -1375 -2176 -2065
16031b065m71Q26j16j214J131J484P4j119K23M44J013J124k35k89l53J9K57m40
$$ -2065 -2536 -1710 -1826 -3040 -1909 -425 -351 -1470 -1247 -803 210 1334 1099 810 457 476 733 293
16013B93J530J017j809j733P72j62j37J59Q53P6l15j93k24o50k451j367R26J267
$$ 293 1823 2840 1031 -702 70 -92 -229 -70 783 859 544 351 127 -523 -2974 -4341 -3415 -2148
15995b148K98j866j330J334K023J513j217R3m64l12p28M91o5l32k808O73J965
$$ -2148 -1850 -3716 -5046 -3712 -1689 -176 -1393 -1300 -1764 -2076 -2804 -2313 -2378 -2710 -5518 -4845 -2880
15978b880J376l89L49M79k5j153p28p5m77L31P12J645J757Q48P10p34j034j208
$$ -2880 -1504 -1893 -1544 -1065 -1090 -2243 -2971 -3046 -3523 -3192 -2480 -835 922 1770 2480 1746 712 -496
15960d96j406j109j035q69J188J217l14j512lK508m23J674N33k057k309K253P
$$ -496 -1902 -3011 -4046 -4915 -3727 -2510 -2824 -4336 -4339 -1831 -2254 -580 -47 -2104 -4413 -2160 -2153
15943b153j506n60k66P69K32J02N4J583m61l94k92O27N49j847k39L28R03p87r06
$$ -2153 -3659 -4219 -4485 -3716 -3484 -3382 -3328 -1745 -2206 -2600 -2892 -2265 -1716 -3563 -3802 -3474 -2571 -3358 -4264
15924d264r79K93J547L4R09M80r35O84P92J236O70j107K10n93j00O94j035N10
$$ -4264 -5243 -4950 -3403 -3369 -2460 -1980 -2915 -2231 -1439 -203 467 -640 -430 -1023 -1123 -429 -1464 -954
15906i54M83J124k07k149j212L86R65J323R87J43o27j363p49Q41j14J332R89M83
$$ -954 -471 653 446 -1703 -2915 -2529 -1564 -241 746 889 262 -1101 -1850 -1009 -1123 209 1198 1681
15888A681j557j521Q8K085J494N21j28j851j225m24O6J696j380r91j101k37l99
$$ 1681 124 -1397 -1309 776 2270 2791 2663 812 -413 -837 -771 925 -455 -1446 -2547 -2784 -3183
15871c183n10j105O01P43J218Q13m41j614j697k11P58O9J718P09m10N31J785j421
$$ -3183 -3693 -4798 -4197 -3454 -2236 -1423 -1864 -3478 -5175 -5386 -4628 -4559 -2841 -2132 -2542 -2011 -226 -1647
15853a647k012j00J73N06n36J112K080p4j661r56R1L58J801O05j340k65N46j889
$$ -1647 -3659 -3759 -3586 -3080 -3616 -2504 -424 -498 -2159 -3115 -3024 -2666 -865 -260 -1600 -1865 -1319 -3208
15835c208j31K487P48P79K008J392M74r32k025m34j9K3r68K70J75j92j036j80
$$ -3208 -3339 -852 -104 675 2683 4075 4549 3617 1592 1158 1139 1162 194 464 639 447 -589 -769
15817g69K058j635r23M49Q39j242k831o13L65j052l66r8K098J799J202n05q52
$$ -769 1289 -346 -1269 -820 19 -1223 -4054 -4667 -4302 -5354 -5720 -5818 -3720 -1921 -719 -1224 -2076
15800b076J212m65n94Q98K065J77j116K99J146k817p23j54K87j887r31n73j746
$$ -2076 -864 -1329 -1923 -1025 1040 1217 101 400 1546 -1271 -1994 -2148 -1861 -3748 -4679 -5252 -6998
15783f998J467K208J389j52r11J094K615J25j217L30p2r76p00J196K94j171j045
$$ -6998 -5531 -3323 -1934 -2086 -2997 -1903 712 837 -380 -50 -122 -1098 -1798 -602 -308 -1479 -2524
15766b524J248K82J426L79j549k66p05j024O4n65J889Q94K72P88k604k168J93
$$ -2524 -1276 -994 432 811 -738 -1004 -1709 -2733 -2669 -3234 -1345 -451 -179 609 -1995 -4163 -3970
15749c970k571l59K274K006q00k139l64J402M89J159K315M4K94O7J168j65j498
$$ -3970 -6541 -6900 -4626 -2620 -3420 -5559 -5923 -4521 -4032 -2873 -558 -514 -220 -153 1015 850 -648
15732f48O77J998j598j450k131P67P87l69J139q93P5k35L80R45k28j802r30l19
$$ -648 29 2027 429 -1021 -3152 -2385 -1598 -1967 -828 -1721 -1646 -1881 -1501 -556 -784 -2586 -3516 -3835
15714c835K196J430O66L20n32J078r75j974j354m63J418j76m13m10J790J077j102
$$ -3835 -1639 -209 457 777 245 1323 348 -1626 -2980 -3443 -2025 -2201 -2614 -3024 -1234 -157 -1259
15697a259J287R89N9q55j207j595k229k375J936L489K189q84R8J382K57r79k148
$$ -1259 28 1017 1076 221 -986 -2581 -4810 -7185 -5249 -1760 429 -455 -357 1025 1282 303 -1845
15680a845J477R41m74j633k186Q29J407O21K21k186j385J442k31N6P31l35J141
$$ -1845 -368 573 99 -1534 -3720 -2891 -1484 -863 -642 -2828 -4213 -2771 -3002 -2946 -2215 -2550 -1409
15663a409J222k042J92P11n31J449q16j887L56K86R98p0l61J89j077j352N29J314
$$ -1409 -187 -2229 -2037 -1326 -1857 -408 -1224 -3111 -2755 -2469 -1471 -1541 -1902 -1713 -2790 -4142 -3613 -2299
15645b299J222kM66j81o69J026O74Q95o45K25J275J116l722j922O81J238l97J210
$$ -2299 -1077 -1079 -613 -794 -1463 -437 237 1132 487 712 1987 3103 -619 -2541 -1860 -622 -1019 191
15627A91J291k025r89j51o74J269L82l51k72J466J144l18r3Q17j69L01l275j210
$$ 191 1482 -543 -1532 -1683 -2357 -1088 -706 -1057 -1329 137 1281 963 870 1687 1518 1819 -1456 -2666
15609b666q54J820K18j146p86N16J188J47J583O07q4r23m87o78q02l39M28m99
$$ -2666 -3520 -1700 -1482 -2628 -3414 -2898 -1710 -1563 20 627 543 -380 -867 -1545 -2347 -2686 -2258 -2757
15591b757J264R06J787o84j116n36M14n57p68k91j32J764P3O9L18o06q16j137
$$ -2757 -1493 -587 1200 516 -600 -1136 -722 -1279 -2047 -2338 -2470 -706 -633 -564 -246 -852 -1668 -2805
15573b805J86K398M42j093K159K759Q03m91k755j784N95P4j738q72p11k99k61
$$ -2805 -2619 -221 221 -872 1287 4046 4849 4358 1603 -181 414 488 -1250 -2122 -2833 -3132 -3393
15556c393o86P72J531j945m94O18K659J228n46K15j634Ok21N74j92n25OQ08k7
$$ -3393 -4079 -3307 -1776 -3721 -4215 -3597 -938 290 -256 -41 -1675 -1669 -1890 -1316 -1508 -2033 -2027 -1219 -1246
15537a246l36j1l21j51k19O35J504J155N74j524k800n82J087N89J396O95r57J02
$$ -1246 -1582 -1593 -1914 -2065 -2284 -1649 -145 1010 1584 60 -2740 -3322 -2235 -1646 -250 445 -512 -410
15519d10m99J012m56j395l49J009j140j131J898N6j015J32k35j148j152J611L253
$$ -410 -909 103 -353 -1748 -2097 -1088 -2228 -3359 -1461 -1405 -2420 -2288 -2523 -3671 -4823 -3212 41
15502D1J930j173j317j906K31J84l15l79K208L135r17j379M10K69j751k391L05
$$ 41 1971 798 -519 -2425 -2194 -2010 -2325 -2704 -496 2639 1722 343 753 1022 -729 -3120 -2815
15485b815M78k370Q87J142n83O66J544j243q88N94J634J916J5r93j476r25j3m40
$$ -2815 -2337 -4707 -3820 -2678 -3261 -2595 -1051 -2294 -3182 -2588 -954 962 977 -16 -1492 -2417 -2430 -2870
15467b870Q31J691l11o08J51M93J095J396j006l171l826J363M788J156J066J84
$$ -2870 -2039 -348 -659 -1267 -1116 -623 472 1868 862 -2309 -6135 -4772 16 1172 2238 2422
15451B422l424O12J569J320n77J047J818l830l497j873P79K27r70J508P69o87
$$ 2422 -1002 -390 1179 2499 1922 2969 4787 957 -2540 -4413 -3634 -3407 -4377 -2869 -2100 -2787
15435b787j283k85J28R43M02J083J273l25m56J329P36J556q3j824q08j836N57
$$ -2787 -4070 -4355 -4227 -3284 -2882 -1799 -526 -851 -1307 22 758 2314 2231 407 -401 -2237 -1680
15418a680N08J331l08j756p86J213K530N79j105j351j251R98J042j270J47K139
$$ -1680 -1172 159 -149 -1905 -2691 -1478 1052 1631 526 -825 -2076 -1078 -36 -1306 -1159 980
15402I80j025q26J050P31j053L90j69o98J096l45p44N45r62j497J787O21j318
$$ 980 -45 -871 179 910 -143 247 78 -620 476 131 -613 -68 -1030 -2527 -740 -119 -1437
15385a437J83o96j327R37k0Q22n01r3J640r5j474m6k43J255j3L29P99L51n24j192
$$ -1437 -1254 -1950 -3277 -2340 -2360 -1538 -2039 -2132 -492 -587 -2061 -2107 -2350 -1095 -1108 -779 20 371 -153 -1345
15365a345L23j026m28N81l54N73J076M39J70k10j35k62P5o20j78j630o24K737
$$ -1345 -1022 -2048 -2476 -1895 -2249 -1676 -600 -161 9 -201 -336 -598 -523 -1143 -1321 -2951 -3575 -838
15347h38K258m17j329J387K169q98r72J371k119o52l52n38j237Q19J17qJ211J613
$$ -838 1420 1003 -326 1061 3230 2332 1360 2731 612 -40 -392 -930 -2167 -1348 -1231 -1239 -28 1585
15329A585O14r06j968j815p71N12J240j144J784J112j720k053J322K597Q61p52
$$ 1585 2199 1293 -675 -2490 -3261 -2749 -1509 -2653 -869 243 -1477 -3530 -2208 389 1250 498
15313D98J085J01n24p32Q40m96L20l73j714r32k88P74j0J164L62n82J525k525
$$ 498 1583 1684 1160 428 1268 772 1092 719 -995 -1927 -2215 -1441 -1451 -287 75 -507 1018 -1507
15295a507p33P59r9J48j13j126M04P07l44J090J075j72Q99K270k93j238j211L01
$$ -1507 -2240 -1481 -1580 -1432 -1545 -2671 -2267 -1560 -1904 -814 261 89 988 3258 2965 1727 516 817
15277H17n46q61N47p00k573N15K615J000p46L78r1J111l12J006J616r09j327j217
$$ 817 271 -590 -43 -743 -3316 -2801 -186 814 68 446 355 1466 1154 2160 3776 2867 1540 323
15259C23m49k74O12l15J158j72r06r96K09N84k36K98l9q3K186L08k059r41j106
$$ 323 -126 -400 212 -103 1055 883 -23 -1019 -810 -226 -462 -164 -203 -286 1900 2208 149 -792 -1898
15240a898j925J96J538R74K7K57K619M82j152p17j008j179j141R45J377L68j335
$$ -1898 -3823 -3627 -2089 -1115 -1088 -831 1788 2270 1118 401 -607 -1786 -2927 -1982 -605 -237 -1572
15223a572M13L59O83J278r88j770j638M68J098R27k29m74q0Q44l1r06n94q09J27
$$ -1572 -1159 -800 -117 1161 173 -1597 -3235 -2767 -1669 -742 -971 -1445 -1525 -681 -712 -1618 -2212 -3021 -2894
15204b894n08R02P54J147J43M40m04p74j912J426J520P2P2r9j092l76R95Q66l55
$$ -2894 -3402 -2500 -1746 -599 -456 -16 -420 -1194 -3106 -1680 -160 -88 -16 -115 -1207 -1583 -588 278 -77
15185g7j364l30l22m47K72J499pQ35J224n7n24j254n1M48m86J445k53j014L53
$$ -77 -1441 -1771 -2093 -2540 -2268 -769 -776 59 1283 1226 702 -552 -603 -155 -641 804 551 -463 -110
15166a10K79k37j07k415M03J342J006J376m04M59j961l06L09Q11Q07J298O91l504
$$ -110 169 -68 -175 -2590 -2187 -845 161 1537 1133 1592 -369 -675 -366 445 1252 2550 3241 -263
15148b63l61K009J290k119p41O88j080k367J45J000J064O01J802J48o14o81j066
$$ -263 -624 1385 2675 556 -185 503 -577 -2944 -2799 -1799 -735 -134 1668 1816 1202 521 -545
15131e45r65k102Q11Q56K27M51M66P96P03j288p78Q25J964Q60k794k716J47K572
$$ -545 -1510 -3612 -2801 -1945 -1718 -1267 -801 -5 698 -590 -1368 -543 1421 2281 -513 -3229 -3082 -510
15113e10L404O6o52p27J81q42k01j775j746l00L01Q65Q70j277k27R28k026o23
$$ -510 2894 2960 2308 1581 1762 920 719 -1056 -2802 -3102 -2801 -1936 -1066 -2343 -2570 -1642 -3668 -4291
15095d291J186J152l24l41K33O13L14N39k67j424K95q2R45o52J290K694q38k779
$$ -4291 -3105 -1953 -2277 -2618 -2385 -1772 -1458 -919 -1186 -2610 -2315 -2397 -1452 -2104 -814 1880 1042 -1737
15077a737J181J93M55o59m21m91L39j149q13j279J531p62M53K712J28M26l358
$$ -1737 -556 -363 92 -567 -988 -1479 -1140 -2289 -3102 -4381 -2850 -3612 -3159 -447 -319 107 -3251
15060c251q39K743J582j71q06m0K069J730J752J519j354k398j152p07j621j72
$$ -3251 -4090 -1347 235 64 -742 -782 1287 3017 4769 6288 4934 2536 1384 677 -944 -1116
15044a116N41J070n95q06r7N24R02j091j202O81Q86J018K842N16k570q63n97P60
$$ -1116 -575 495 -100 -906 -1003 -479 423 -668 -1870 -1189 -303 715 3557 4073 1503 640 43 803
15026H03r39j120J549J151k306M84o63q18p06O67K013j525P3O37M02J17p55M9
$$ 803 -136 -1256 293 1444 -862 -378 -1041 -1859 -2565 -1898 115 -1410 -1337 -700 -298 -181 -936 -887
15008h87p03J946J06m05J974J549n09k133l511l138n83j4J648L807J147K92o96
$$ -887 -1590 356 462 57 2031 3580 3071 938 -2573 -5711 -6294 -6308 -4660 -853 294 586 -110
14991a10p72j3M15k60l81N20J128j264J467m86j801k598M19K292j030j665J842
$$ -110 -882 -895 -480 -740 -1121 -601 527 -737 730 244 -1557 -4155 -3736 -1444 -2474 -4139 -2297
14974b297J880l94j94L17M95R85K93L16K90j331j026J615k63k04J586M69j507
$$ -2297 -417 -811 -1005 -688 -193 792 1085 1401 1691 360 -666 949 686 482 2068 2537 1030
14957A030j02j91r26j40Q4J825Q6k00p12J527j481l172k584o08n64J821K314J085
$$ 1030 928 737 -189 -329 -245 1580 1666 1466 754 2281 800 -2372 -4956 -5564 -6128 -4307 -1993 -908
14939i08N82l67Q39k199n85K128J440l42j021j39K93j647j255m86K061K870j057
$$ -908 -326 -693 146 -2053 -2638 -510 930 588 -433 -572 -279 -1926 -3181 -3667 -1606 1264 207
14922B07k726J472K12k771N15J616J968J815j574j433J534K123O74r19k585k634
$$ 207 -2519 -1047 -835 -3606 -3091 -1475 493 2308 734 -699 835 2958 3632 2713 128 -2506
14906b506j518K868q76r02J691Q85j36k03J989R88P45rj489P24N39J175n22j113
$$ -2506 -4024 -1156 -2032 -2934 -1243 -358 -494 -697 1292 2280 3025 3016 1527 2251 2790 3965 3443 2330
14888B330O0j888j920q76o28J353M36K58N60P67J276J741Q58m76l223j083J102
$$ 2330 2390 502 -1418 -2294 -2922 -1569 -1133 -875 -315 452 1728 3469 4327 3851 628 -455 647
14871F47J32j802k826j425K176j742o38j01o16J595K848J225J82m80N23l39K70
$$ 647 779 -1023 -3849 -5274 -3098 -4840 -5478 -5579 -6195 -4600 -1752 -527 -345 -825 -302 -641 -371
14854c71r33K005J299k239o60O65m6P63j1O3r80J31K197k35k323J095Q55k96k04
$$ -371 -1304 701 2000 -239 -899 -234 -280 483 472 535 -445 -314 1883 1648 -675 420 1275 979 775
14835G75o8j862J146J231M04k39M60L583M83r56o82j886j024P77p0Q01N37j305
$$ 775 707 -1155 -9 1222 1626 1387 1847 5430 5913 4957 4275 2389 1365 2142 2072 2873 3410 2105
14817B105m27R78R71J492l80j032j568J65J061J41J284q04n31K98m04j26J136
$$ 2105 1678 2656 3627 5119 4739 3707 2139 2304 3365 3506 4790 3986 3455 3753 3349 3223 4359
14800D359k3o27K78j774l051j343J112k21P5Q6N37K27J826J770j428m30r38J131
$$ 4359 4336 3709 3987 2213 -838 -2181 -1069 -1290 -1215 -1129 -592 -365 1461 3231 1803 1373 435 1566
14782A566J709Q72l00m42j130m70J03Q9R17M89L14j532j210k15N78m60j375R06
$$ 1566 3275 4147 3847 3405 2275 1805 1908 1997 2914 3403 3717 2185 975 760 1338 878 -497 409
14764D09K154o09j42q60N73J616K52k469p71j2J223L524k827l442L31K701M9O2
$$ 409 2563 1954 1812 952 1525 3141 3393 924 153 141 1364 4888 2061 -1381 -1050 1651 1700 1762
14746A762j277k259l85L242P38R31L27j187j862j821o25K066j334q93Q24J292
$$ 1762 485 -1774 -2159 1083 1821 2752 3079 1892 30 -1791 -2416 -350 -1684 -2577 -1753 -461
14730d61J82Q38j441k98o8j573n22J319l57J008J744r61j554R72n00K775L208
$$ -461 -279 559 -882 -1180 -1248 -2821 -3343 -2024 -2381 -1373 371 -590 -2144 -1172 -1672 1103 4311
14713D311o47p04j599k574j892K373K386O73o31L43Q53p52j834k036J420P23n81
$$ 4311 3664 2960 1361 -1213 -3105 -732 1654 2327 1696 2039 2892 2140 306 -1730 -310 413 -168
14696a68N64J47J191l09Q99n82j025p43k72J721Q50N64M97N8n46Q54l84k286j703
$$ -168 396 543 1734 1425 2324 1742 717 -26 -298 1423 2273 2837 3334 3392 2846 3700 3316 1030 -673
14677f73R02J48n86J748M92k225Q7M87J947m12Q38l46j463k87K95O33r57j368
$$ -673 229 377 -209 1539 2031 -194 -107 380 2327 1915 2753 2407 944 657 952 1585 628 -740
14659g40P43J011K386O61k069j500L05K88J401k345k8K2Q44Q37O73O61j639k651
$$ -740 3 1014 3400 4061 1992 492 797 1085 2486 141 113 135 979 1816 2489 3150 1511 -1140
14641a140O37K865P00j325J882p10j414J555N53j822k65m97k63J19J12J67j132
$$ -1140 -503 2362 3062 1737 3619 2909 1495 3050 3603 1781 1516 1019 756 875 987 1154 22
14624B2L25m8J606j2p30P48j966r91j387K06J942l89q70o26o80l02J445K387r13
$$ 22 347 299 1905 1893 1163 1911 -55 -1046 -2433 -2227 -285 -674 -1544 -2170 -2850 -3152 -1707 680 -233
14605b33j994J891J527K741r2l015j644L69N39M93J701J264j315j092n73j300
$$ -233 -2227 -336 1191 3932 3840 825 -819 -450 89 582 2283 3547 2232 1140 567 -733
14589g33j495L115J068j9N43J141k15n19l06j855J526L00J405M74j17o28j193
$$ -733 -2228 887 1955 1936 2479 3620 3405 2886 2580 725 2251 2551 3956 4430 4313 3685 2492
14572B492m31J448q54j393l21R01k06q55j245J483J527k489j332R90N02p68L75
$$ 2492 2061 3509 2655 1262 941 1842 1636 781 -464 1019 2546 57 -1275 -285 217 -551 -176
14555a76K463J864k41k79l30k177O91K20n02k274q40P80P83J433o65j97q8l70
$$ -176 2287 4151 3910 3631 3301 1124 1815 2035 1533 -741 -1581 -801 -18 1415 750 553 465 95
14537I5j625r1J291J329P24l5K01k206o85J234q3j31O1J132J876m25J07p16j812
$$ 95 -1530 -1621 -330 999 1723 1688 1889 -317 -1002 232 149 18 79 1211 3087 2662 2769 2053 241
14518B41L88J616p51q07j418R68J342r67m12J157L53j843j240L11P51j9JO51o85
$$ 241 629 2245 1494 687 -731 237 1579 612 200 1357 1710 -133 -1373 -1062 -311 -330 -329 322 -363
14499c63J32J90K12j204Q98J010K478J375M38j796j542j468J49m80N85K230j250
$$ -363 -231 -41 171 -1033 -135 875 3353 4728 5166 3370 1828 360 509 29 614 2844 1594
14482A594K21Kj616q53Q25J472k87J95M43j370P2O05K007J212p77j698n8K23k79
$$ 1594 1815 1817 201 -652 173 1645 1358 1553 1996 626 698 1303 3310 4522 3745 2047 1989 2212 1933
14463A933o84j323j09J019M79Q39L62j98Q03k624j630J021J699k30J6J37k29O89
$$ 1933 1249 -74 -183 836 1315 2154 2516 2318 3121 497 -1133 -112 1587 1357 1373 1510 1281 1970
14445A970J794j619j590L12J276K91k69q9J21m00p13Q23J254n11R00K94J197r68
$$ 1970 3764 2145 555 867 2143 2434 2165 2076 2197 1797 1084 1907 3161 2650 3550 3844 5041 4073
14427D073j920n92j017L42J478J23j503j406q60P55j534J145J320P39j86j287
$$ 4073 2153 1561 544 886 2364 2487 984 -422 -1282 -527 -2061 -916 404 1143 957 -330
14411c30j572J9P7L165K550J852k984j684J566K246j099j713j340k24p47J209
$$ -330 -1902 -1883 -1806 1359 3909 5761 2777 1093 2659 4905 3806 2093 753 529 -218 991
14395I91J412q79r80J963k39m74j810j901J398J802K160N91j723K14O18l542o21
$$ 991 2403 1524 544 2507 2268 1794 -16 -1917 -519 1283 3443 4034 2311 2525 3143 -399 -1020
14378a020J311j89j83J890J033m6N51m28M4O89o2k546p80K278J610O2n90k216
$$ -1020 291 102 -81 1809 2842 2796 3347 2919 2963 3652 3590 1044 264 2542 4152 4214 3624 1408
14360A408n63J566o33k406J250K048R97Q82j504k042o9r91l43J640R20O88j758
$$ 1408 845 2411 1778 -628 622 2670 3667 4549 3045 1003 934 -57 -400 1240 2160 2848 1090
14343A090l82J29j014p98J267j038J104J96k93M21J462J61O14J015M88n84j121
$$ 1090 708 837 -177 -975 292 -746 358 554 261 682 2144 2305 2919 3934 4422 3838 2717
14326B717m16r1j194o06j924O28K904J263R48l27O15J289j377l188m88J170M87
$$ 2717 2301 2210 1016 410 -1514 -886 2018 3281 4229 3902 4517 5806 4429 1241 753 1923 2410
14309B410k67J051K608J732m85m42j747L92J927R04J080K019P96K417R52j510
$$ 2410 2143 3194 5802 7534 7049 6607 4860 5252 7179 8083 9163 11182 11978 14395 15347 13837
14293A3837k784k666K141M5k708j504j17J293j509k404j198N62P58j995j15J756
$$ 13837 11053 8387 10528 10573 7865 6361 6244 7537 6028 3624 2426 2988 3746 1751 1636 3392
14277C392Q20k13j68M84j038N09p43j124O07J687J961o29r00p90M60k1K90k316
$$ 3392 4212 3999 3831 4315 3277 3786 3043 1919 2526 4213 6174 5545 4645 3855 4315 4294 4584 2268
14259B268j17J84q17J432K661M88j846k233k638O82o74J839o52r03O14J801P26
$$ 2268 2151 2335 1518 2950 5611 6099 4253 2020 -618 64 -610 1229 577 -326 288 2089 2815
14242B815O09j4n84j480o7k22K66m82K0K443K083J9J41l69n56r82J433l39k146
$$ 2815 3424 3410 2826 1346 1279 1057 1323 841 861 3304 5387 5406 5547 5178 4622 3640 5073 4734 2588
14223B588j2K929K637k347m270j77K741m27j060R75k45L69r42l67P38K172R48
$$ 2588 2576 5505 8142 5795 1525 1348 4089 3662 2602 3577 3332 3701 2759 2392 3130 5302 6250
14206F250r96j272J593O77K026l77j958N93r28j845n71j081N9J594k16j90n08
$$ 6250 5254 3982 5575 6252 8278 7901 5943 6536 5608 3763 3192 2111 2170 3764 3548 3358 2850
14189B850L05j265p11M75j147m5K74J525J734P01k78J388K623j18j260p97l93
$$ 2850 3155 1890 1179 1654 507 462 736 2261 3995 4696 4418 5806 8429 8311 7051 6254 5861
14172E861j46j031J61p91N82J613P3M50Q05l60k483j846j141j00j55K3K64o10
$$ 5861 5715 4684 4845 4054 4636 6249 6322 6772 7577 7217 4734 2888 1747 1647 1492 1515 1779 1169
14154A169j141j18J50R21J94J533P87j518j033K91J792J382L41j115j410R43L72
$$ 1169 28 -90 60 981 1175 2708 3495 1977 944 1235 3027 4409 4750 3635 2225 3168 3540
14137C540k06m37J099m62k481L557O01j581r08q2J538M47j263M40L50q75N36k22
$$ 3540 3334 2897 3996 3534 1053 4610 5211 3630 2722 2640 4178 4625 3362 3802 4152 3277 3813 3591
14119C591K152j01j111J01n9J102r89j453p07j201o72j46J442J215O22O94j005
$$ 3591 5743 5642 4531 4632 4573 5675 4686 3233 2526 1325 653 507 1949 3164 3786 4480 3475
14102C475k5P71r77O55p29P6Q67J198J257r41p16o30K181n77m97J001J728J220
$$ 3475 3450 4221 3244 3899 3170 3246 4113 5311 6568 5627 4911 4281 6462 5885 5388 6389 8117 9337
14084I337P64J558j286l045k530J030P99j543j635k09Q39O10K188L90p24R45O9
$$ 9337 10101 11659 10373 7328 4798 5828 6627 5084 3449 3240 4079 4689 6877 7267 6543 7488 7557
14067G557K64j652k530l84J282J799Q04J152j910j218L49p89j842r38j38L54j006
$$ 7557 7821 6169 3639 3255 4537 6336 7140 8292 6382 5164 5513 4724 2882 1944 1806 2160 1154
14050A154J372J5l70L17L51M3L31J929N00j15P14R89j09k404p51N05R56M05q60
$$ 1154 2526 2541 2171 2488 2839 2882 3213 5142 5642 5527 6241 7230 7121 4717 3966 4471 5427 5832 4972
14031D972r59P52P67K491K465q75j606R91j903j308N32J385r17o39Q79P61N2J027
$$ 4972 4013 4765 5532 8023 10488 9613 8007 8998 7095 5787 6319 7704 6787 6148 7027 7788 7840 8867
14013H867J353j028j616Q15o37j127J688J184K06n22j570K182o91l442m18J053
$$ 8867 10220 9192 7576 8391 7754 6627 8315 9499 9705 9183 7613 9795 9104 5662 5244 6297
13997F297R49L02N53J968k066j432m01r8j733K211N01N82R26N45k7j728J403K235
$$ 6297 7246 7548 8101 10069 8003 6571 6170 6072 4339 6550 7051 7633 8559 9104 9077 7349 8752 10987
13979A0987J114Lk87j149o50K66O15p15j758l97j784j839j483K5P88N48O38J546
$$ 10987 12101 12104 11817 10668 10018 10284 10899 10184 8426 8029 6245 4406 2923 2948 3736 4284 4922 6468
13961F468K05j6J917J574k12J125J14K33r65j448O47J737o23j280J097J628j528
$$ 6468 6673 6657 8574 10148 9936 11061 11175 11408 10443 8995 9642 11379 10756 9476 10573 12201 10673
13944A0673k308l16J88n45r5K64J153l154J57M39R66q17P57j031k76N02o84j462
$$ 10673 8365 8049 8237 7692 7597 7861 9014 5860 6017 6456 7422 6605 7362 6331 6055 6557 5873 4411
13926D411K37M47J55n81J20J428J207K0k96n69M22J805L149n16k629j464o81k034
$$ 4411 4648 5095 5250 4669 4789 6217 7424 7444 7148 6579 7001 8806 11955 11439 8810 7346 6665 4631
13908D631o66R23J293j107q72J730K225J685R46k238o56k52k266J605L703k95
$$ 4631 3965 4888 6181 5074 4202 5932 8157 9842 10788 8550 7894 7642 5376 6981 10684 10389
13892A0389n49K14l01j984M71j96k585r4J628J240o95L99j221N45L06R86r42L26
$$ 10389 9840 10054 9753 7769 8240 8044 5459 5365 6993 8233 7538 7937 6716 7261 7567 8553 7611 7937
13874G937K252Q57k117l579L69Q08l62J264J619j22m49J213J789M61l33o95j395
$$ 7937 10189 11046 8929 5350 5719 6527 6165 7429 9048 8926 8477 9690 11479 11940 11607 10912 9517
13857I517J033J885J158q7q3J671M67M97l02r34m64j837j203k378j138K209J567
$$ 9517 10550 12435 13593 13506 13423 15094 15561 16058 15756 14822 14358 12521 11318 8940 7802 10011 11578
13840A1578O76J304p14k814j050k18q27K72L285L054o30M80J669L91J716M66K85
$$ 11578 12254 13558 12844 10030 8980 8762 7935 8207 11492 14546 13916 14396 16065 16456 18172 18638 18923
13823A8923J343M795N127N287J0876J8044K3860K1631J2161n614j8179k2509k0416
$$ 18923 20266 25061 30188 35475 46351 64395 88255 109886 122047 116433 98254 75745 55329
13810E5329j3273n798n513n928n967m155J591L474J874J586l37k254k061j073
$$ 55329 42056 36258 30745 24817 18850 14695 16286 19760 21634 23220 22883 20629 18568 17495
13796A7495J171J196J245j43K208L301K371N417Q235J4256K4335L6401M6253M7191
$$ 17495 18666 19862 21107 20964 23172 26473 28844 34261 42496 56752 81087 117488 163741 210932
13782B10932K3713j2080l8948m8420l9959j9637j3313j4343j0293j0400p127K887
$$ 210932 234645 222565 183617 135197 95238 75601 62288 47945 37652 27252 20125 23012
13770B3012L328j144j287N98l823k290k04J290p50k150K157K810L266P63K450
$$ 23012 26340 25196 23909 24507 20684 18394 18190 19480 18730 16580 18737 21547 24813 25576 28026
13755B8026K873P403J4193J9885K1831K3290J1232r868k1186k2542j5290o462
$$ 28026 30899 38302 52495 72380 94211 117501 128733 118865 97679 75137 59847 53385
13743E3385o002o538l925n841n151k038l906n719l229j009J06j522N78r42j104
$$ 53385 47383 40845 36920 31079 25928 23890 19984 14265 11036 10027 10133 8611 9189 8247 7143
13728G143n60O68M278K580K104K154j126l803j65m00k305j32J61J753J686K090
$$ 7143 6583 7251 11529 14109 16213 18367 17241 13438 13273 12873 10568 10436 10597 12350 14036 16126
13712A6126J811M604M653O82q68l272m147k734j783l57j577j221j187l477k836
$$ 16126 17937 22541 27194 27876 27008 23736 19589 16855 15072 14715 13138 11917 10730 7253 4417
13697D417p00K51O09N68J443J236K192K039Q60J84k283n97K710L30j456l04J0
$$ 4417 3717 3968 4577 5145 6588 7824 10016 12055 12915 13099 10816 10219 12929 13259 11803 11499 11509
13680A1509k212r4J642J676k92o12j956j785J491k26k78j33L80O33J963J848m02
$$ 11509 9297 9203 10845 12521 12229 11617 9661 7876 9367 9141 8863 8730 9110 9743 11706 13554 13152
13663A3152k255k183j287k77o88J491J72j245J170K642J14j597r3K13O79J486
$$ 13152 10897 8714 7427 7150 6462 7953 8125 6880 8050 10692 10806 9209 9116 9329 10008 11494
13647A1494O12L32O93j153n063q82L238J604K59j168j621p25J090J228Q43l76
$$ 11494 12106 12438 13131 11978 6915 6033 9271 10875 11134 9966 8345 7620 8710 9938 10781 10405
13631A0405k327j149k90j962J276P68K097J131J124j686J552M378J881K987J228
$$ 10405 8078 6929 6639 4677 5953 6721 8818 9949 11073 9387 10939 15317 17198 20185 21413
13616B1413J66J322J150j919j605j266q69j002k487k004p31N07l19o30m82m99
$$ 21413 21579 22901 24051 22132 20527 19261 18392 17390 14903 12899 12168 12675 12356 11726 11244 10745
13600A0745O94J435m87j767P67L91m26N60M23L526O34N74J940N181N345N281L820
$$ 10745 11439 12874 12387 10620 11387 11778 11352 11912 12335 15861 16495 17069 19009 24190 29535 34816 38636
13583C8636Q52O02P29k329m403k390m96j006k470l057N86l41o26l434M65Q82O78
$$ 38636 39488 40090 40819 38490 34087 31697 31201 30195 27725 24668 25254 24913 24287 20853 21318 22200 22878
13566B2878J775J386P8J956o8m1L25N56K473J847J482k83J176Q74J548J312K017
$$ 22878 24653 26039 26117 28073 28005 27964 28289 28845 31318 33165 34647 34364 35540 36414 37962 39274 41291
13549D1291K058q39j658R75J96J550o18m45j237P09k980k556l94k647j260K328
$$ 41291 43349 42510 40852 41827 42023 43573 42955 42510 41273 41982 39002 36446 36052 33405 32145 34473
13533C4473L194J658J234M72k1J351m82j347n94n38k114l316q7K229R17O12J753
$$ 34473 37667 39325 40559 41031 41010 42361 41879 40532 39938 39400 37286 33970 33883 36112 37029 37641 39394
13516C9394j568k067k43OJ698P267N272K158l05j777l805m700l461l90q31q79
$$ 39394 37826 35759 35516 35522 37220 44487 49759 51917 51612 49835 46030 41330 37869 37479 36648 35769
13500C5769M44J109K624M590L528K73k227j802k834n091l790k437k13J449R40
$$ 35769 36213 37322 39946 44536 48064 48337 46110 44308 41474 36383 32593 30156 29943 31392 32332
13485C2332N87J303J377K660L379J256J157Q75J793N8j441K235J697k086k875
$$ 32332 32919 34222 35599 38259 41638 42894 44051 44926 46719 46777 45336 47571 49268 47182 44307
13470D4307l555l221j855R63K608O087Q043M461Q95l345o472p758n530k391m52
$$ 44307 40752 37531 35676 36639 39247 45334 53377 57838 58733 55388 48916 41158 35628 33237 32785
13455C2785R49J052J521K908L331J987J766m31n961p065m316K510M377M760L398
$$ 32785 33734 34786 36307 39215 42546 44533 46299 45868 39907 32842 28526 31036 35413 40173 43571
13440D3571K303M70K313M421L702J051J087k28p49K835J238k077m769o653m694
$$ 43571 45874 46344 48657 53078 56780 57831 58918 58690 57941 60776 62014 59937 55168 48515 43821
13425D3821m615l139l76K299J721K836J890K336K42n549o283j0069p510n60P450
$$ 43821 39206 36067 35691 37990 39711 42547 44437 46773 47015 41466 35183 25114 17604 17044 24494
13410B4494J5040J4269Q582J968N252Q921O913M548M043J738j353k99m309m508
$$ 24494 39534 53803 62385 64353 69605 78526 85439 89987 94030 95768 94415 94116 89807 85299
13396H5299o169n090m355j709J22j565O51L86p57J086M32q88j027j506j364k897
$$ 85299 79130 74040 69685 67976 68098 66533 67184 67570 66813 67899 68331 67443 66416 64910 63546 60649
13380F0649k199L089P649J3045Q088K510L725N318M360K855M425L215K460K738
$$ 60649 58450 61539 69188 82233 90321 92831 96556 101874 106234 109089 113514 116729 119189 121927
13366A21927L438K969J361o52M75n90J370J826N343J311K108L465K208N248K490
$$ 121927 125365 128334 129695 129043 129518 128928 130298 132124 137467 138778 140886 144351 146559 151807 154297
13351A54297L353K457K984N454Q477J0513J1965J0873J1586J1514J2180J3175
$$ 154297 157650 160107 163091 168545 177022 187535 199500 210373 221959 233473 245653 258828
13339B58828J4461J4544J5449J6871K0553K6990L6933M5630N4259O7533Q5350
$$ 258828 273289 287833 303282 320153 340706 367696 404629 450259 504518 572051 657401
13328F57401R2868P8440N5691M2959O0136J03497J58816K26402L19161M72854
$$ 657401 750269 828709 884400 927359 987495 1090992 1249808 1476210 1795371 2268225
13318B268225P45748J218426K001697L113368M132662M092506K232500r20191
$$ 2268225 3013973 4232399 6234096 9347464 13480126 17572632 19805132 18884941
13310A8884941l574727m303180l452391k253010j379829q64074n59836l74800
$$ 18884941 15310214 11007034 7554643 5301633 3921804 3057730 2497894 2123094
13302B123094k49881j52309p1282l949N1208R6586J19327J07898O8288K5076J8154
$$ 2123094 1873213 1720904 1649622 1645673 1696881 1793467 1912794 2020692 2088980 2114056 2132210
13291B132210P1978J75256L04968M52903O67011J016858J615046K642989M334692
$$ 2132210 2204188 2379444 2684412 3137315 3804326 4821184 6436230 9079219 13413911
13282A3413911O664687Q630460Q179670L944125k702689p977962r103841p033693
$$ 13413911 20078598 28709058 36888728 40832853 38130164 30152202 21048361 14014668
13274A4014668m452405k680688j677588j112421p62948n29528l56747k27016j26234
$$ 14014668 9562263 6881575 5203987 4091566 3328618 2799090 2442343 2215327 2089093
13265B089093n4734j2542k1482o6717j04879j12907p8825j6312N7017J30184K16619
$$ 2089093 2034359 2021817 2000335 1933618 1828739 1715832 1637007 1620695 1677712 1807896 2024515
13254B024515L38331N37851Q75504J451895K374585L568951M419641L870208J408006
$$ 2024515 2362846 2900697 3776201 5228096 7602681 11171632 15591273 19461481 20869487
13245B0869487j972859m278220m467279l328182k098893j278131q16509n67365
$$ 20869487 18896628 14618408 10151129 6822947 4724054 3445923 2629414 2062049
13237B062049m21576l02235k07195j39357q9593n9383n5245o8050q8626r6117
$$ 2062049 1640473 1338238 1131043 991686 902093 842710 787465 719415 630789 534672
13227E34672q5723o2780m6328l5340l1169k5910k3396k1169j8251j4596j0054
$$ 534672 448949 386169 339841 304501 273332 247422 224026 202857 184606 170010 159956
13216A59956n614n786o945n214n554m260l497n891j0023q292p251m854n506n920
$$ 159956 154342 148556 141611 136397 130843 126583 123086 117195 107172 98880 91629 86775 81269 75349
13202G5349m484l291j557n4j130j689k980l827j890k650r40l80k179r67j010r87
$$ 75349 70865 67574 66017 65963 64833 63144 60164 56337 54447 51797 50857 50477 48298 47331 46321 45334
13186D5334j46J457J711K479J303J356M926L436L60k200n434n728m054j291L33
$$ 45334 45188 46645 48356 50835 52138 53494 58420 61856 62216 60016 54582 48854 44800 43509 43842
13171D3842n77k046j520k115l196k939j429k060j913k098m417m614o12L712N908
$$ 43842 43265 41219 39699 37584 34388 31449 30020 27960 26047 23949 19532 14918 14306 18018 23926
13156B3926M212Q10q46M774N973J700M46M867R249J0361O878K04n163q456n662
$$ 23926 28138 28948 28102 32876 38849 40549 40995 45862 55111 65472 72350 72554 67391 58935 53273
13141E3273j945k224k728l009m740k745k538j759j500j839r53l881m831k533n09
$$ 53273 51328 49104 46376 43367 38627 35882 33344 31585 30085 28246 27293 23412 18581 16048 15539
13126A5539k12K993J602j230k037o29L326L733L344J531K931L407M414L864K255
$$ 15539 15327 18320 19922 18692 16655 16026 19352 23085 26429 27960 30891 34298 38712 42576 44831
13111D4831k751n407j573k210k464q89J312P42j116l959k582j709q41r76P09o05
$$ 44831 42080 36673 35100 32890 30426 29537 30849 31591 30475 26516 23934 22225 21384 20408 21117 20512
13095B0512k103J796p34r83j162j389J30p5r72j875r9J748J104L66o53K36l06
$$ 20512 18409 20205 19471 18488 17326 15937 16067 15992 15020 13145 13046 14794 15898 16264 15611 15847 15541
13078A5541M13J992M466J049J869j26l27j316j3k636l059k525j417m67n53K059
$$ 15541 15954 17946 22412 23461 25330 25204 24877 23561 23548 20912 17853 15328 13911 13444 12891 14950
13062A4950J00o43j739o46K814R99j028k731j856J789J01j147p0J406j151K276
$$ 14950 15050 14407 12668 12022 14836 15835 14807 12076 10220 12009 12110 10963 10893 12299 11148 13424
13046A3424K269L5J71L58mk2l22J403k284K22O63k816o56j18j786r33J613J300
$$ 13424 15693 15728 15899 16257 16253 16231 15909 17312 15028 15250 15913 13097 12441 12323 10537 9604 11217 12517
13028A2517j391r28k95P59k68R02J343K25k556l15k93j240j706n17J378J320K46
$$ 12517 11126 10198 9903 10662 10394 11296 12639 12864 10308 9993 9700 8460 6754 6237 7615 8935 9181
13011I181j477l846p11N46K93j4K337Q63J873J366N46J648O40L22n57j120q03
$$ 9181 7704 3858 3147 3693 3986 3972 6309 7172 9045 10411 10957 12605 13245 13567 13010 11890 11087
12994A1087o02L140K143J338j55k982j290J187k069k557j050j96L40o91j885m210
$$ 11087 10485 13625 15768 17106 16951 13969 12679 13866 11797 9240 8190 7994 8334 7643 5758 1548
12978A548l727j798j800k12K911K413L632P521M361J117L124K167j7n39j992o14
$$ 1548 -2179 -3977 -5777 -5989 -3078 -665 2967 10488 14849 15966 19090 21257 21240 20701 18709 18095
12962A8095Q80K838q01j859j941n65n96J219q6N0r11m58q60q00l38k055l209k563
$$ 18095 18975 21813 21012 19153 17212 16647 16051 17270 17184 17234 16323 15865 15005 14205 13867 11812 8603 6040
12944F040j927j086j284J970K700L457L807K732J045j220J097K977J733K50k81
$$ 6040 4113 3027 1743 3713 6413 9870 13677 16409 17454 16234 17331 20308 22041 22291 22010
12929B2010j585j952k89J156j192M91j59K27O01j98r61P00J433J969k023k880
$$ 22010 20425 18473 18184 19340 18148 18639 18480 18707 19308 19110 18149 18849 20282 22251 20228 17348
12913A7348m22J796L76j600p3L39J28l8k49J901N93j646Mr92j689O62K37P85r14
$$ 17348 16926 18722 19098 17498 17425 17764 17892 17854 17605 19506 20099 18453 18457 17465 15776 16438 16675 17460 16546
12894A6546O88K684M68k29p1R33p07m69O99o67j783K689N43j182j786J367j81
$$ 16546 17234 19918 20386 20157 20086 21019 20312 19843 20542 19875 18092 20781 21324 20142 18356 19723 19542
12877A9542k275J781P49L11K125j283j001N7j087j086j707Q60J951j112P97K705
$$ 19542 17267 19048 19797 20108 22233 20950 19949 20006 18919 17833 16126 16986 18937 17825 18622 21327
12861B1327p31n26L742M86J15K590K447k138m687l235o25K14m97j563o31M01Q78
$$ 21327 20596 20070 23812 24298 24413 27003 29450 27312 22625 19390 18765 18979 18482 16919 16288 16689 17567
12844A7567O83r2J76n98j152K223J760J980L003m684n58Q351N672J2281P518j5216
$$ 17567 18250 18158 18334 17736 16584 18807 20567 22547 25550 20866 20308 28659 34331 46612 54130 38914
12828C8914j2461n071N30N836M008n828p146l911r04k060l676k075J834K334R40
$$ 38914 26453 21382 21912 27748 31756 25928 18782 14871 13967 11907 8231 6156 7990 10324 11264
12813A1264p2J919M148L705L224M595P388J1618J2343K0504K4569J1670O525k132
$$ 11264 11192 13111 17259 20964 24188 28783 36171 47789 60132 80636 105205 116875 123400 121268
12799A21268j5734p037j0737k8308k1379p995m723L343J603l495o661k318J411
$$ 121268 105534 98497 87760 59452 38073 30078 25355 28698 30301 26806 20145 17827 19238
12786A9238K437o83j295k108J747J984O4J128L045N266N649O906J2085J6538K6551
$$ 19238 21675 20992 19697 17589 19336 21320 21384 22512 25557 30823 36472 43378 55463 72001 98552
12771I8552L8678M5944L9661J2137k0169m3521m8397l6571j9258j3439p396l191
$$ 98552 137230 183174 222835 234972 214803 171282 122885 86314 67056 53617 46221 43030
12759D3030q376o379k367J538j059j357k22J420K30l79J607J337m72J47K91K48
$$ 43030 34654 28275 25908 27446 26387 25030 24808 26228 26458 26079 27686 29023 28551 28698 28989 29237
12743B9237K342K555L322J0203J6413K3328K3933J5059n82j6694k3174k1599j5603
$$ 29237 31579 34134 37456 47659 64072 87400 111333 126392 125810 109116 85942 64343 48740
12730D8740j0721n686k960j735l19j085q83j243j060Q93k286r74J310J274l506
$$ 48740 38019 32333 29373 27638 27319 26234 25351 24108 23048 23941 21655 20681 21991 23265 19759
12715A9759k619J373J294j639l331r81K087O9k29o53Q97O68k66j837L56K367l25
$$ 19759 17140 18513 19807 18168 14837 13856 15943 16012 15783 15130 16027 16695 16429 14592 14948 17315 16990
12698A6990n94K3J449J2j095R07K559m61j449J75K742J201l84j184k334j585R76
$$ 16990 16396 16419 17868 17880 16785 17692 20251 19790 18341 18516 21258 22459 22075 20891 18557 16972 17948
12681A7948O68M03Q00k01l21J13j07J353j101k790J59J689J800j406j919L7J704
$$ 17948 18616 19019 19819 19618 19297 19410 19303 20656 19555 16765 16924 18613 20413 19007 17088 17125 18829
12664A8829j20r81q82k923J182K49o42l48J781J602o38L29k671j084j17J236J195
$$ 18829 18709 17728 16846 13923 15105 15354 14712 14364 16145 17747 17109 17438 14767 13683 13566 14802 15997
12647A5997K72k73J377j326k492j281O37L349K900J566J67k547l86J061K1O34
$$ 15997 16269 15996 17373 16047 13555 12274 12911 16260 19160 20726 20893 18346 17960 19021 19042 19676
12631A9676r06J430K217J18o96k181j534J034J114n97K23P32M27J19J364K690
$$ 19676 18770 20200 22417 22535 21839 19658 18124 19158 20272 19675 19898 20630 21057 21176 22540 25230
12615B5230l4m37j488j333K886J315n06L83n61L43J406R75J319L83k26j182m05
$$ 25230 25196 24759 23271 21938 24824 26139 25633 26016 25455 25798 27204 28179 29498 29881 29655 28473 28068
12598B8068J0j112j028l05J542P22O84k236l47J276Q49l98j170J606R22R26n87
$$ 28068 28078 26966 25938 25633 27175 27897 28581 26345 25998 27274 28123 27725 26555 28161 29083 30009 29422
12581B9422j444O08M79J599j290j427k3j92N47L33R83L78L27j996k554P89J773
$$ 29422 27978 28586 29065 30664 29374 27947 27924 27732 28279 28612 29595 29973 30300 28304 25750 26539 28312
12564B8312J665J674R33R50p30k147l18K74P1J718j936O51n69J29l42j452N78
$$ 28312 29977 31651 32584 33534 32804 30657 30339 30613 30684 32402 30466 31117 30548 30677 30335 28883 29461
12547B9461k20j5O0P48J041R28J118j416j236O1J215k350j743k451M81j68J008
$$ 29461 29241 29226 29286 30034 31075 32003 33121 31705 30469 30530 31745 29395 27652 25201 25682 25514 26522
12530B6522K347K195J090r76r93m11k073j483J601K834n89M95J367J78L90o87
$$ 26522 28869 31064 32154 31178 30185 29774 27701 26218 27819 30653 30064 30559 31926 32104 32494 31807
12514C1807j074l24N09j792j263o60O63l97K54k28K439J550R11p06k93J418n92
$$ 31807 30733 30409 30918 29126 27863 27203 27866 27469 27723 27495 29934 31484 32395 31689 31396 32814 32222
12497C2222n99J103M48J312J763j037m24J231j04K15J251k25k123J524M601J08
$$ 32222 31623 32726 33174 34486 36249 35212 34788 36019 35915 36130 37381 37156 35033 36557 41158 41266
12481D1266n51k859m18j077j247L176K420o59K22L05J03j522j695q44J637j446
$$ 41266 40715 37856 37438 36361 35114 38290 40710 40051 40273 40578 40681 39159 37464 36620 38257 36811
12465C6811j199l82O48k92J192K347R6j49K545k360j071n1oR67J375J760J401
$$ 36811 35612 35230 35878 35586 36778 39125 39221 39072 41617 39257 38186 38135 38129 39096 40471 42231 43632
12448D3632R48M10J298j985l74k43J932J709k72K34j349k860m071k025J35J032
$$ 43632 44580 44990 46288 44303 43929 43686 45618 47327 47055 47289 45940 43080 39009 36984 37119 38151
12432C8151K799p59n53p2K40K149k76M94r31J441o94M5J214o73m25p0NL54j842
$$ 38151 40950 40191 39638 39566 39806 41955 41679 42173 41242 42683 41989 42034 43248 42575 42150 42080 42085 42439 40597
12413D0597R77j21l2l59J70K074Q17J629k38j97j157Q13J839K905Q28r02j797
$$ 40597 41574 41453 41421 41062 41232 43306 44123 45752 45514 45317 44160 44973 46812 49717 50545 49643 47846
12396D7846k32n3r17j076L895L662K698j40P1N53j700j170q3j716q01J67K64j941
$$ 47846 47614 47561 46644 45568 49463 53125 55823 55683 55754 56307 54607 53437 53354 51638 50837 51004 51268 49327
12378D9327j739m21j180j358N78P51M67K486J518j020j211K016L222L625J626
$$ 49327 47588 47167 45987 44629 45207 45958 46425 48911 50429 49409 48198 50214 53436 57061 58687
12363E8687K530j80j982r4j791j816k386r31J566K170N223M129K665K288J264
$$ 58687 61217 61037 59055 58961 57170 55354 52968 52037 53603 55773 60996 65125 67790 70078 71342
12348G1342j805k756k387k484Q95J181K51J577Q03j427m1o11k738l914N81L228
$$ 71342 69537 66781 64394 61910 62805 63986 64237 65814 66617 65190 65149 64538 61800 57886 58467 61695
12332F1695M651O151P112M768l3R95K685O750J0796J5656J8681K2242K4150L0942
$$ 61695 66346 72497 79609 84377 84344 85339 88024 94774 105570 121226 139907 162149 186299 217241
12318B17241L2217K0591R035j4812l4301l4562k0449J332J9722L6563N8061R5422
$$ 217241 249458 270049 279084 264272 229971 195409 174960 176292 196014 232577 290638 386060
12306C86060J61866K83952N09924Q00858Q14862L32931n02533r62418p24156l93804
$$ 386060 547926 831878 1341802 2142660 2957522 3290453 2787920 1825502 1101346 707542
12296G07542k08836j20731p6448n0990l9325l1124j8303j0705q851q004j1258
$$ 707542 498706 377975 301527 250537 211212 180088 161785 151080 142229 134225 122967
12285A22967j3386j2244p919n539o488k930r99j594l374k759r32l298m486l899
$$ 122967 109581 97337 89418 83879 77391 74461 73462 71868 68494 65735 64803 61505 57019 53120
12271E3120o63J70m17N31k25J616J481N22k095j470r43m6k039k147J628L226K834
$$ 53120 52457 52627 52210 52741 52516 54132 55613 56135 54040 52570 51627 51581 49542 47395 49023 52249 55083
12254E5083K334M132J596k101m157o839p016m186q65K026J932K106R18J307p00
$$ 55083 57417 61549 63145 61044 56887 50048 43032 38846 37981 40007 41939 44045 44963 46270 45570
12239D5570K76j387k399K11R80J062j06J099K388M167L797N449N121K780p31k806
$$ 45570 45846 44459 42060 42271 43251 44313 44207 45306 47694 51861 55658 61107 66228 69008 68277 65471
12223F5471l719l790k036O45O82R03l417l395l445l766l174j297L256O486L571
$$ 65471 61752 57962 55926 56571 57253 58156 54739 51344 47899 44133 40959 39662 42918 49404 52975
12208E2975R33k20k174m47O89j576r60k4k466K5j639k293J157O07J057j239J18
$$ 52975 53908 53688 51514 51067 51756 50180 49220 49196 46730 46755 45116 42823 43980 44587 45644 44405 44523
12191D4523K841o16j851k162j116k447m91l197j141m37K441M137J966j642k062
$$ 44523 47364 46748 44897 42735 41619 39172 38681 35484 34343 33906 36347 40484 42450 40808 38746
12176C8746m604n912m387l370m495n896n061l65N224R240J4806K6767M5114N8183
$$ 38746 34142 28230 23843 20473 15978 10082 5021 4656 9880 19120 33926 60693 105807 163990
12162A63990O6174N8824L5867J7916l670k2207k3891j9810j5742p623j851n241
$$ 163990 230164 288988 324855 342771 339101 316894 293003 273193 257451 249828 247977 242736
12150B42736j8135l1153k5429j7422j3837p805m361k520K972K889L88M90r46r01
$$ 242736 224601 193448 168019 150597 136760 128955 124594 122074 125046 127935 128323 128813 127867 126966
12136A26966Q88p27r50j274j63L97N210Q331J1959J6389K3616K7231K0919P886
$$ 126966 127854 127127 126177 124903 124740 125137 130347 138678 150637 167026 190642 217873 238792 246678
12122B46678q984q927O085K2918L1423K2168k868k2753l0274j6194n404n438n516
$$ 246678 237694 228767 234852 257770 289193 311361 308493 285740 255466 239272 233868 228430 222914
12109B22914N21L653N595P529P898J7827J7182k269j8867l2348l4020k5578j8955
$$ 222914 223435 227088 232683 240212 248110 265937 283119 280850 261983 229635 195615 170037 151082
12096A51082j3317q448l578J131L286M038M298L996K289P05N91j304k312P22J966
$$ 151082 137765 129317 125739 126870 130156 134194 138492 142488 144777 145482 146073 144769 142457 143179 145145
12081A45145J728K224k435m871J428O738Q303O758L950j788n083n507m019o380
$$ 145145 146873 149097 146662 141791 143219 149957 158260 165018 168968 167180 162097 156590 152571 146191
12067A46191r182p525j766m88p20l265j234L182K178N352O326Q556J3751J5345
$$ 146191 137009 129484 127718 127230 126510 123245 122011 125193 127371 132723 139049 147605 161356 176701
12053A76701J2207J0849R983M671L760k013q804j5478j3847q310k327N517J2566
$$ 176701 188908 199757 209740 214411 218171 216158 207354 191876 178029 169719 167392 172909 185475
12040A85475J1734N526J834j511p677j0884j1197j3726j5168j2068o906j041Q668
$$ 185475 197209 202735 204569 203058 195381 184497 173300 159574 144406 132338 125432 124391 133059
12027A33059J1856J3652J4943J1863M810j026j106j72J797J818N960J1230J6064
$$ 133059 144915 158567 173510 185373 190183 189157 188051 187879 189676 191494 197454 208684 224748
12014B24748J5689Q955j704p545p348j6727k1591j7042j5010j6288j3765j0946
$$ 224748 240437 249392 247688 240143 232795 216068 194477 177435 162425 146137 132372 121426
12002A21426m311L654P634Q800Q676M775J450l057j2051l2226o0577r5075j04261
$$ 121426 117115 120769 128403 137203 145879 150654 152104 149047 136996 104770 44193 -50882 -155143
11989a55143n6165N0329J72997K10292J24255K3953K3517Q4589J05301Q3455O5549
$$ -155143 -211308 -160979 12018 222310 346565 370518 394035 478624 583925 667380 732929
11978G32929K2224j1949j0731j0067r769j6537l0962l4547k5649k1096j2847n259
$$ 732929 755153 743204 732473 722406 712637 696100 665138 630591 604942 583846 570999 565740
11966E65740m706l047R94N752O520P253Q624J5037K4899L7111K6643J248k2596
$$ 565740 561034 557987 558981 564733 571253 578506 587130 602167 627066 664177 690820 692068 669472
11953F69472j9633m341N483R908J9880L7118N6809R0932J42316J81527J29071
$$ 669472 649839 645498 650981 660889 680769 717887 774696 865628 1007944 1189471 1318542
11942A318542j0407j74834j74295j00012m5733j3219Q521K5416L6239L9948L1807
$$ 1318542 1308135 1133301 959006 858994 813261 800042 808563 833979 870218 910166 941973
11931I41973R801j4246j5257K189Q992J3526J4050J6697K3105K9108L7233M2660
$$ 941973 951774 937528 922271 924460 933452 946978 961028 977725 1000830 1029938 1067171 1109831
11919A109831M6899N4404N2115M4302L3920L1163L8608N1479O5885Q6829J22786
$$ 1109831 1156730 1211134 1263249 1307551 1341471 1372634 1411242 1462721 1528606 1615435 1738221
11908A738221J58518J48586P6904k4921o4647j8141L8842Q0622J20129J51193
$$ 1738221 1896739 2045325 2122229 2097308 2032661 2014520 2053362 2133984 2254113 2405306
11898B405306J59192J48181J26910J28157J66599K35875M15531P28414R32648
$$ 2405306 2564498 2712679 2839589 2967746 3134345 3370220 3785751 4514165 5446813
11889E446813O55242k1314o52385m19760p0254J25919K17380K56988L13581L88060
$$ 5446813 6102055 6080741 5428356 5008596 4938342 5064261 5281641 5538629 5852210 6240270
11879F240270M71708N72119P14626Q81829J049444J253067J491791J782022K120230
$$ 6240270 6711978 7284097 7998723 8880552 9929996 11183063 12674854 14456876 16577106
11870A6577106K410328K459398K257032K392733L562339N326605P439025J0522890
$$ 16577106 18987434 21446832 23703864 26096597 29658936 34985541 42424566 52947456
11862E2947456J5529572K3716065L7374212N9881276R0306917J02443308O8221757
$$ 52947456 68477028 92193093 129567305 189448581 279755498 382198806 450420563
11855D50420563J2321339n5118212j05315609r7144452o4035543l9491846k5348219
$$ 450420563 462741902 407623690 302308081 205163629 141128086 101636240 76288021
11848G6288021j7207191j2144365q842547o467471m613698l198955k321638k098040
$$ 76288021 59080830 46936465 38093918 31626447 27012749 23813794 21492156 19394116
11840A9394116k397821k676226k289049j661740j224588r54972p79665o73814
$$ 19394116 16996295 14320069 12031020 10369280 9144692 8189720 7410055 6736241
11832F736241o06183n45171m81775m18598l68824l33461k80101k24084j94337
$$ 6736241 6130058 5584887 5103112 4684514 4315690 3982229 3702128 3478044 3283707
11823C283707k00362k08477j78052j50755j53660j59713j65017j67428j64665
$$ 3283707 3083345 2874868 2696816 2546061 2392401 2232688 2067671 1900243 1735578
11814A735578j46308j08451o8026m8444m7582n2095o0332o7620o0978n4815n5077
$$ 1735578 1589270 1480819 1412793 1364349 1316767 1264672 1204340 1136720 1075742 1020927 965850
11803I65850m6992l2573k6459k6992l1732l9759m0605m0586l5790k5415r975J331
$$ 965850 918858 886285 859826 832834 801102 761343 720738 680152 644362 618947 608972 610303
11791F10303J056n942j0606q732j3408j7075j8380k0982j3837j990o576j9342
$$ 610303 611359 605417 594811 586079 572671 555596 537216 516234 502397 500407 493831 474489
11779D74489k4228k6957k4850j0478l219r891j6313k2448k5361k2434k1144j9344
$$ 474489 450261 423304 398454 387976 384757 374866 358553 336105 310744 288310 267166 247822
11767B47822j5674p801j417L266L155K757P75q563j1564l740K328o43k586j076
$$ 247822 232148 224347 222930 226196 229351 232108 232883 224320 212756 209016 211344 210701 208115 207039
11753B07039m054p144q802j1872j5950j6385j2274j0673j5302j8182j7378k1062
$$ 207039 202985 195841 187039 175167 159217 142832 130558 119885 104583 86401 69023 47961
11741D7961k7550l3858l8595l7681j7900K4344P8269J09818Q3698L7683K8085
$$ 47961 20411 -13447 -52042 -89723 -107623 -83279 -5010 104808 188506 226189 254274
11730B54274M1353R9686J00450J3712k9068J2188P1782R3847O9662k7810j15608
$$ 254274 295627 395313 495763 509475 480407 492595 564377 658224 727886 700076 584468
11719E84468j12974q2605n2805l0515k0197j2879n375k575p49j080l982p518j3132
$$ 584468 471494 388889 336084 305569 285372 272493 267118 264543 263794 262714 258732 251214 238082
11706B38082j6179k0527k0280j6876j6811j6006j7241j2074o670j851L267N936
$$ 238082 221903 201376 181096 164220 147409 131403 114162 102088 95418 93567 96834 102770
11694A02770O183J515k255k579l334k803j503O46P275J3284J3385J0970J512n227
$$ 102770 108953 110468 108213 105634 102300 99497 97994 98640 105915 119199 132584 143554 145066 139839
11680A39839o840j1839j6605j5581j1243j4296j1758n985k378K821P086R280R586
$$ 139839 132999 121160 104555 88974 77731 63435 51677 45692 43314 46135 53221 62501 72087
11667G2087K327p946j5228j7852j4431p330Q59N167N697P475J0436J1872J1824
$$ 72087 74414 66468 51240 33388 18957 11627 12486 17653 23350 30825 41261 53133 64957
11654F4957P337O646N634K861J573j29n516n021l590l983m529p058j1557j1958
$$ 64957 72294 78940 84574 87435 89008 88879 83363 78342 74752 70769 66240 59182 47625 35667
11640C5667o951p411k993Q0M882R067O884M30l308j887j887k69J357k69j333J078
$$ 35667 28716 21305 18312 18392 23274 32341 39225 39655 36347 34460 32573 32304 33661 33392 32059 33137
11624C3137N809N009K441K653M977M311L444J506j498l607m794q527j1141n613
$$ 33137 38946 43955 46396 49049 54026 58337 61781 63287 61789 58182 53388 44861 33720 28107
11610B8107m53K039J06m56k191j749k521j528L431L468k102n204n974p205n171
$$ 28107 27654 29693 29799 29343 27152 25403 22882 21354 24785 28253 26151 20947 14973 7768 2597
11595B597k304l29L361J1074R328M465J333l033m822o854l198l55K61n52q55M160
$$ 2597 293 -36 3325 14399 23727 28192 29525 26492 21670 14816 11618 11263 11524 10972 10117 14277
11579A4277N23k707n112l634r64k80q87j435j139j423M263N083M76m219n835p443
$$ 14277 14800 12093 6981 3347 2383 2103 1216 -219 -1358 -2781 1482 6565 7041 2822 -3013 -10456
11563a0456r404j1370j2064j4036j7135j8667k2133k3089k6668k9281k7258j5433
$$ -10456 -19860 -31230 -43294 -57330 -74465 -93132 -115265 -138354 -165022 -194303 -221561 -236994
11551b36994Q013L7221N5513O1191O3736M8485K9335J7365P895M936r58n778n179
$$ -236994 -228981 -191760 -136247 -75056 -11320 37165 66500 83865 91760 96696 95738 89960 84781
11538H4781n067n221m403p046l251l7k84k046p72o11k95J946o24l045p1j153j771
$$ 84781 79714 74493 70090 63044 59793 59756 59472 57426 56654 56043 55748 57694 57070 54025 53954 52801 51030
11521E1030j598J65K661q24l341j364m37R01j89k144j049m5l57j77j575j167j214
$$ 51030 49432 49597 52258 51434 48093 46729 46292 47193 47004 44860 43811 43766 43409 43232 41657 40490 39276
11504C9276j123k130k050K340M454K983K43l375l322k061j879k000J89J948m91
$$ 39276 38153 36023 33973 36313 40767 43750 43993 40618 37296 35235 33356 31356 31545 33493 33002
11489C3002j391l229l923k911J339M01J999N19J049K939K105J319K714J129J05
$$ 33002 31611 28382 24459 21548 22887 23288 25287 25806 26855 29794 31899 33218 35932 37061 37166
11474C7166K864L211O8p20r07m04K364K170N35O33r14k945o104m790m458p35L858
$$ 37166 40030 43241 43309 42589 41682 41278 43642 45812 46347 46980 46066 43121 37017 32227 27769 27034 30892
11457C0892K928K906O062L643K72J152q67l065j478p5j662L786L254L207L313
$$ 30892 33820 36726 42788 46431 46703 47855 46988 43923 42445 42370 40708 44494 47748 50955 54268
11442E4268J583j905o895n153m860l113j416R07p1K009J337J759j97J35J086J060
$$ 54268 55851 53946 47051 41898 37038 33925 32509 33416 33345 35354 36691 38450 38253 38388 39474 40534
11426D0534m4J345K573M325M682N988N548O350J0826J5158J5423J2794J5177J4788
$$ 40534 40490 41835 44408 48733 53415 59403 64951 71301 82127 97285 112708 125502 140679 155467
11412A55467K1274K8437L8121N4881R0634J52114K71342M95281P89670Q29296
$$ 155467 176741 205178 243299 298180 388814 540928 812270 1307551 2097221 2926517
11402B926517L79186m55050r65915p62933m38715k64831j78061j13103o8062l3745
$$ 2926517 3305703 2850653 1884738 1121805 683090 418259 240198 127095 59033 25288
11392B5288l402Q583O593P902L748K801l163m332j908o42p80L210N149N444M661
$$ 25288 21886 30469 37062 44964 48712 51513 48350 44018 42110 41468 40688 43898 49047 54491 59152
11377E9152K634M10k561p023q453r462j0807p164l564Q69K37j957k568k827j366
$$ 59152 61786 62196 59635 52612 44159 34697 23890 16726 13162 14031 14268 12311 9743 6916 5550
11362E550Q9K25K046K649j180J141N908N327L540J664jo32J907L200N875R710
$$ 5550 5639 5864 7910 10559 9379 10520 16428 21755 25295 26959 26958 26326 28233 31433 37308 47018
11346D7018J1856J4923K0278L0111M2299O0899R4317J18259P8225k1472j23500
$$ 47018 58874 73797 94075 124186 166485 227384 321701 439960 518185 496713 373213
11335C73213j28277q2925m8141l1746k0718r574p014o152m603j725j925k997k573
$$ 373213 244936 162011 113870 82124 61406 51832 44818 38666 34063 32338 30413 27416 24843
11322B4843j780J211J349L126J127O84J341L829M894M354R406J6784K4708L9848
$$ 24843 23063 24274 25623 28749 29876 30560 31901 35730 40624 44978 54384 71168 95876 135724
11308A35724O5492J01368J17501P0339l0136j19836j15322p4774m4590k7403k0151
$$ 135724 201216 302584 420085 490424 460288 340452 225130 150356 105766 78363 58212
11297E8212j4734q314l636n460m262j124k34o96j672k375j443J260R15j139p29
$$ 58212 43478 35164 31528 26068 21806 20682 20448 19752 18080 15705 14262 15522 16437 15298 14569
11282A4569j836j766J082K553l71j441j021q20K87l040k538n39R84J926K48j371
$$ 14569 12733 10967 12049 14602 14231 12790 11769 10949 11236 8196 5658 5119 6103 8029 8277 6906
11266F906j649r06j446p59j217j348J796L240K920L02m44p51J332K916L344J154
$$ 6906 5257 4351 2905 2146 929 -419 1377 4617 7537 7839 7395 6644 7976 10892 14236 15390
11250A5390j427j741j942J01Q24N23K050M95j674j711l226o67k12o94J468J295
$$ 15390 13963 12222 10280 10381 11205 11728 13778 14273 12599 10888 7662 6995 6783 6089 7557 8852
11234H852j11q61k113k872l001k126j432j260J17K195K066K725P322J3239J4055
$$ 8852 8741 7880 5767 2895 -106 -2232 -3664 -4924 -4807 -2612 -546 2179 9501 22740 36795
11219C6795R605M627L010J744k37k875m253m476l815q60L085J082m35j546m894
$$ 36795 46400 51027 54037 55781 55544 52669 48416 43940 40125 39265 42350 43432 42997 41451 36557
11204C6557k494j823k814l066k234l231j894j770j272n0J280M98K206J491L649
$$ 36557 34063 32240 29426 26360 24126 20895 19001 17231 15959 15909 17189 17687 19893 21384 25033
11189B5033Q782J3411J3436J0905J1083P087J893k606m588m964n650l534l388
$$ 25033 33815 47226 60662 71567 82650 89737 91630 89024 84436 79472 73822 70288 66900
11176F6900k058R00j224n633p043m174k724n36M05M402M291O23J390J695K803
$$ 66900 64842 65742 64518 58885 51842 47668 44944 44408 44813 49215 53506 54129 55519 57214 60017
11161F0017M333J32k697o764p861m222k729k500K03M44Q9J049J404R32p46j761
$$ 60017 64350 64482 61785 55021 47160 42938 40209 37709 37912 38356 38445 39494 40898 41830 41084 39323
11145C9323N71N259O939L259r76k363j021K389l76k460J090K964O262M549P79
$$ 39323 39894 45153 52092 55351 54375 52012 50991 53380 53004 50544 51634 54598 60860 65409 66188
11130F6188J958K153Q45k347o956q701o855m916m403l293k73j471O06P67J856
$$ 66188 68146 70299 71144 68797 61841 53140 46285 41369 36966 33673 33400 31929 32535 33302 35158
11115C5158O64K429K854J164K813M084K869K149j60k701l092l879m519k563j464
$$ 35158 35822 38251 41105 42269 45082 49166 52035 54184 54024 51323 48231 44352 39833 37270 35806
11100C5806K909O954O478K06j045k062j0l589n273k354r66o97j139m21J879J651
$$ 35806 38715 45669 52147 52353 51308 49246 49236 45647 40374 38020 37054 36357 35218 34797 36676 38327
11084C8327L928M350K935K881K728K774L565L609L971N221J008k577j192k426
$$ 38327 42255 46605 49540 52421 55149 57923 61488 65097 69068 74289 75297 72720 71528 69102
11070F9102p32O42o16j114n33j93j792k156l849k446k116n362m118k017j667p54
$$ 69102 68370 69012 68396 67282 66749 66556 64764 62608 58759 56313 54197 48835 44717 42700 41033 40279
11054D0279N35J018n30j072p059j8215k3755j6728J1130M2979M5033J7135j182
$$ 40279 40814 41832 41302 40230 33171 14956 -8799 -25527 -14397 28582 73615 90750 89568
11041H9568K0J6187K5463J8006O421J020l15k863n586n189n554q545j1610r983
$$ 89568 89588 105775 131238 149244 155665 156685 156370 153507 147921 142732 137178 128633 117023 107040
11027A07040n652l199M4M75J419J789J899n00o422q396j1202j8896j9920j0850
$$ 107040 101388 98189 98233 98708 100127 101916 103815 103315 96893 88497 77295 58399 38479 27629
11013B7629J8830M7962M1905J5649K549J926J6582K8723K1013J1554K697K214
$$ 27629 46459 94421 136326 151975 154524 156450 173032 201755 222768 234322 237019 239233
11001B39233N75J652K443r09l851m71P351J5449K4780M3177O8405J04039J32691
$$ 239233 239808 241460 243903 242994 239143 238672 246023 261472 286252 329429 397834 501873 634564
10988F34564R8470n456j20296j36654r1057m9475k5671j3877p442k824J609M706
$$ 634564 733034 727578 607282 470628 379571 330096 304425 290548 283106 280282 281891 286597
10976B86597P954J0096N583M299M924L326L128N922N576Q845N159N639N482K799
$$ 286597 294551 304647 310230 314529 319453 322779 325907 331829 337405 346250 351409 357048 362530 365329
10962C65329O190J3406J6841J5825K0364K2621J9780J7881J3315Q050Q374J0132
$$ 365329 371519 384925 401766 417591 437955 460576 480356 498237 511552 519602 527976 538108
10950E38108J5609K4674L2909L8893M1949M3075M7784N6868N5746M9803M6212
$$ 538108 553717 578391 611300 650193 692142 735217 783001 839869 895615 945418 991630
10939I91630N3590O7260P9002R3340J15043J39022J57623J74525J94567K26535
$$ 991630 1045220 1112480 1191482 1284822 1399865 1538887 1696510 1871035 2065602 2292137
10929B292137K71963L43386M36079N24741N88311O44032P81405J077208J591960
$$ 2292137 2564100 2907486 3343565 3868306 4456617 5100649 5882054 6959262 8551222
10920H551222K458296L889013O344369J0688062J7591536K3141513J7679994J702391
$$ 8551222 11009518 14898531 21242900 31930962 49522498 72664011 90344005 92046396
10912I2046396j9158907k4856008j6995158r803091n761145l664921k454747j713535
$$ 92046396 72887489 48031481 31036323 21233232 15472087 11807166 9352419 7638884
10904G638884j205393q09013m84618l03894k48300k59084k62120j60866k1985
$$ 7638884 6433491 5624478 5139860 4835966 4587666 4328582 4066462 3905596 3883611
10895C883611J22976K58812L64056M37966N13681O77235R86457J530264K426820
$$ 3883611 4006587 4265399 4629455 5067421 5581102 6258337 7244794 8775058 11201878
10886A1201878L901073O443361J0947978J7891451K2591731J5970845n70598k0372539
$$ 11201878 15102951 21546312 32494290 50385741 72977472 88948317 88377719 68005180
10878F8005180k3713456j5648050r021994n373087l475612k371806j688732j215371
$$ 68005180 44291724 28643674 19621680 14248593 10772981 8401175 6712443 5497072
10870E497072q44330n55763m17260l99889m41092m55717l73032k81135k07785
$$ 5497072 4652742 4096979 3679719 3279830 2838738 2383021 2009989 1728854 1521069
10861A521069j55095j24934j03982r3204q8614q2558p8199p1226o0095m6938l3543
$$ 1521069 1365974 1241040 1137058 1043854 955240 872682 794483 723257 663162 616224 582681
10850E82681k6371k4122j9078j5253j3598j3627j8824k5325k7352k7527k2257
$$ 582681 556310 532188 513110 497857 484259 470632 451808 426483 399131 371604 349347
10839C49347j3477l320N261J6025K7514M2904P3759J33151K41445L90004M11055
$$ 349347 335870 332550 337811 353836 381350 424254 498013 631164 872609 1262613 1673668
10828A673668J82987k47666n01530l72242k12174j20949p3601n1613l7548l1329
$$ 1673668 1856655 1608989 1107459 735217 523043 402094 328493 276880 239332 208003
10818B08003j9868j0946p764p650r504q941p583o517p484o693p140j768n306p666
$$ 208003 188135 177189 169425 161775 152271 143330 135747 129230 121746 115053 107913 106145 100839 93173
10804I3173r092r489o262k614j645o215j1425j3701j3481r996L359J4595J9140
$$ 93173 84081 74592 68330 65716 64071 57856 46431 32730 19249 9253 12612 27207 46347
10791D6347J0980R08m409L187J9250J3795m93k545R969K3482K7039J4626j0972
$$ 46347 57327 58235 53826 57013 76263 90058 89565 87020 96989 120471 147510 162136 151164
10778A51164k0703j6180j2025j3397j2992j0315o460k141l965k391l681k780m872
$$ 151164 130461 114281 102256 88859 75867 65552 59092 56951 52986 50595 46914 44134 39262
10765C9262q685j1343j2496n814J639J4424J5769Q405j800q119L402J8451J6244
$$ 39262 30577 19234 6738 924 2563 16987 32756 41161 39361 31242 34644 53095 69339
10752F9339K990m16J0454K1590K5656J0685j4633k4513j4413m137K945M9l955
$$ 69339 72329 71913 82367 103957 129613 140298 125665 101152 86739 82602 85547 85596 81641
10739H1641r214p503o859k880j545j126k084n705o441k798k756j723j82k045l399
$$ 81641 72427 64924 58065 55185 53640 52514 50430 44725 38284 35486 32730 31007 30825 28780 25381
10724B5381l299o039m046j749J89M406K747k78m97R82m59p89R24L087M136L012
$$ 25381 22082 16043 11997 10248 10437 14843 17590 17312 16815 17797 17338 16549 17473 20560 24696 27708
10708B7708K584K480j304k187m552l054o721m097k418N5M58k831k435L233K450
$$ 27708 30292 32772 31468 29281 24729 21675 14954 10857 8439 8494 8952 6121 3686 6919 9369
10693I369K628q9j888o155l154k401J202M193J391l34j72L615M163K094J696P68
$$ 9369 11997 11908 10020 3865 711 -1690 -488 3705 5096 4762 4590 8205 12368 14462 16158 16926
10677A6926J748N18j022l58j275k510k181m025l451n33o35r69n62Q8n66j012J345
$$ 16926 18674 19192 18170 17812 16537 14027 11846 7821 4370 3837 3202 2233 1671 1759 1193 181 1526
10660A526J746K410J590J68j634m822k151j312K126K349Q89M236N752q64l560
$$ 1526 3272 5682 7272 7440 5806 984 -1167 -2479 -353 1996 2885 7121 12873 12009 8449
10645H449j603j577n02K81J522q09j162l734k912m74N23J484l20m02j700j072
$$ 8449 6846 5269 4767 5048 6570 5761 4599 865 -2047 -2521 -1998 -514 -834 -1236 -2936 -4008
10629d008j323J58L127J271o09l047l028j821l015k135Q60n12j298j904k705n731
$$ -4008 -5331 -5173 -2046 -775 -1384 -4431 -7459 -9280 -12295 -14430 -13570 -14082 -15380 -17284 -19989 -25720
10613b5720n822m822o576m621J588P263R368J2831J4218Q558M034L194R73K70
$$ -25720 -31542 -36364 -42940 -47561 -45973 -38710 -29342 -16511 -2293 6265 10299 13493 14466 14736
10599A4736j803k110j710p98l19n83j429p89J096M96p60n51m762m281l082m298
$$ 14736 12933 10823 9113 8315 7996 7413 5984 5195 6291 6787 6027 5476 714 -3567 -6649 -10947
10583a0947l523m126m847m921m643m593k487K407P051J1190J1993J0867N978K747
$$ -10947 -14470 -18596 -23443 -28364 -33007 -37600 -40087 -37680 -30629 -19439 -7446 3421 9399 12146
10569A2146J941J070k9k12k517k994K14l82kK014P37j97oJ8J275j401K07K31k611
$$ 12146 14087 15157 15128 14916 12399 9405 9619 9237 9235 11249 11986 11789 11783 11801 13076 11675 11882 12113 9502
10550I502k726P9o0J92m29r64q44p7J368J33j32N97j86O70K148K209K551o31k937
$$ 9502 6776 6855 6795 6987 6558 5594 4750 4673 6041 6174 6042 6639 6453 7123 9271 11480 14031 13400 10463
10531A0463k369L68n12J30j74j296j244K45K797K061k142k577r8N29R67J679k85
$$ 10463 8094 8462 7950 8080 7906 6610 5366 5611 8408 10469 8327 5750 5652 6181 7148 8827 8542
10514H542j570j59K888j626j010J495L89k59O33J342R19O05J997K948N8K19K56
$$ 8542 6972 6813 9701 8075 7065 8560 8949 8690 9323 10665 11584 12189 14186 17134 17192 17411 17667
10497A7667J034Q96K125N010M832M286P333R557J3566K0560L6995O3160R7949
$$ 17667 18701 19597 21722 26732 31564 35850 43183 52740 66306 86866 123861 187021 284970
10484B84970J22867Q7377p824j15072j28407q4444m6828k7836j8273j3528q983
$$ 284970 407837 495214 487390 372318 243911 159467 112639 84803 66530 53002 44019
10473D4019m109j100k253k777n62Jm9L12K93n74n65j866j080K790K510N781P455
$$ 44019 39910 38810 36557 33780 33218 33219 33170 33482 33775 33201 32636 30770 29690 32480 34990 40771 48226
10456D8226Q000J3863K9260N9818J01360J26281Q3656k1928j19475j17749p4029
$$ 48226 56226 70089 99349 159167 260527 386808 470464 448536 329061 211312 137283
10445A37283l9255k6057j7890r890o744l562k264k614l612l502K25q0j652j074
$$ 137283 98028 71971 54081 44191 37447 33885 31621 29007 25395 21893 22118 22038 20386 19312
10431A9312k559n370l861j668k4J14r43m639q163j1148r739k747j514M522P556
$$ 19312 16753 11383 7522 5854 5830 5944 5001 362 -7801 -18949 -28688 -31435 -32949 -28427 -20871
10416b0871O507M753K303K305J672n78j986M40L171Q70J955j53K96K127J101N88
$$ -20871 -14364 -9611 -7308 -5003 -3331 -3909 -5895 -5455 -2284 -1414 541 388 684 2811 3912 4500
10400D500RJ655J22l689l144r76O58j175j589l722j792J092J625J701N25Q60K314
$$ 4500 4509 6164 6286 2597 -547 -1523 -865 -2040 -3629 -7351 -9143 -8051 -6426 -4725 -4200 -3340 -1026
10383a026n11N27L156J682l07l623J90P51m30K12K181K450M120N955P481J2602
$$ -1026 -1537 -1010 2146 3828 3521 -102 88 839 409 621 2802 5252 9372 15327 22808 35410
10367C5410J2760M933p020j3503q840o008o998m206l979k940K863L151j203q06
$$ 35410 48170 53103 46083 32580 23740 17732 10734 6528 2549 -391 2472 5623 4420 3614
10353C614l044k558j643j40J944P29J97k56l2j63l89k4m45j521o8M60j217P09
$$ 3614 570 -1988 -3631 -3771 -1827 -1098 -901 -1157 -1189 -1352 -1741 -1765 -2210 -3731 -3799 -3339 -4556 -3847
10335c847M5p38j98O66J103J05L56j146K21J697K134K37k38r82q02l339j70K5
$$ -3847 -3802 -4540 -4738 -4072 -2969 -2864 -2508 -3654 -3433 -1736 398 635 397 -585 -1387 -4726 -4896 -4871
10317d871J518J514J215n04n45P82r77O48O34l981M34J663j092j95O67K56K9p80
$$ -4871 -3353 -1839 -624 -1128 -1673 -891 -1868 -1220 -586 -4567 -4133 -2470 -3562 -3757 -3090 -2834 -2805 -3585
10299c585L16j451j410P90K23M84M06J93r46O73J515l20K80p55j035K073l55k711
$$ -3585 -3269 -4720 -6130 -5340 -5117 -4633 -4227 -4034 -4980 -4307 -2792 -3112 -2832 -3587 -4622 -2549 -2904 -5615
10281e615j389R81M32J570J496J301j577o50O42L80K80n0J28R71j663j273j367
$$ -5615 -7004 -6023 -5591 -4021 -2525 -1224 -2801 -3451 -2809 -2429 -2149 -2199 -2071 -1100 -2763 -4036 -5403
10264e403J439n74J134M58k24l37j808o14j713n77N06L527J81K54M37P48j349
$$ -5403 -3964 -4538 -3404 -2946 -3170 -3507 -5315 -5929 -7642 -8219 -7713 -4186 -4005 -3751 -3314 -2566 -3915
10247c915K50L175n55J94J979q1j131l05pk474r86M26K269J037l09k131j488j244
$$ -3915 -3665 -490 -1045 -851 1128 1047 -84 -389 -396 -2870 -3856 -3430 -1161 -124 -433 -2564 -4052 -5296
10229e296J163O58R40R25K677P4j417O29J018m61j525r46n21n52r30N16Q66K95
$$ -5296 -4133 -3475 -2535 -1610 1067 1141 -276 353 1371 910 -615 -1561 -2082 -2634 -3564 -3048 -2182 -1887
10211a887m27N71j632p20K368N9J20L87j108j255J358L65j227k05M41p51K040
$$ -1887 -2314 -1743 -3375 -4095 -1727 -1668 -1548 -1161 -2269 -3524 -2166 -1801 -3028 -3233 -2792 -3543 -1503
10194a503K773K62l09j580K20j257n70J328K964q92j904p92N54J661N90j714p52
$$ -1503 1270 1532 1223 -357 -137 -1394 -1964 -636 2328 1436 -468 -1260 -706 955 1545 -169 -921
10177i21k36Q36J096m84j09j002J50J71j53k694n04r13q34K500P49j683J126R52
$$ -921 -1157 -321 775 291 182 -820 -670 -499 -652 -3346 -3850 -4763 -5597 -3097 -2348 -4031 -2905 -1953
10159a953R09p2l99j819M09J502J342J478j441l013j537J138K684R39P32p21l717
$$ -1953 -1044 -1116 -1515 -3334 -2925 -1423 -81 1397 -44 -3057 -4594 -3456 -772 167 899 178 -3539
10142c539J216J795m48j907J313J536R77k055m06J695j785j025J060J171K597
$$ -3539 -2323 -528 -976 -2883 -1570 -34 943 -1112 -1518 177 -1608 -2633 -1573 -402 2195
10127B195q93r16N8M51J408J71j77J71l15l37p78P80j465j002P26J722j075j958
$$ 2195 1302 386 444 895 2303 2474 2297 2468 2153 1816 1038 1818 353 -649 77 1799 724 -1234
10109a234J533l74Q63P43N57K14J212R05q3j069k738j295M93r04m69M12J366J918
$$ -1234 299 -75 788 1531 2088 2302 3514 4419 4336 3267 529 -766 -273 -1177 -1646 -1234 132 2050
10091B050L13J14m27j916J208k72k118M63J88K42J272N9M53J188K284o82k918
$$ 2050 2363 2477 2050 134 1342 1070 -1048 -585 -397 -155 1117 1176 1629 2817 5101 4419 1501
10074A501J596K321q09j161j976L41Q80p49n29J196j9M20j345j539m80O06l33
$$ 1501 3097 5418 4609 3448 1472 1813 2693 1944 1415 2611 2592 3012 1667 128 -352 254 -79
10057g9o19O67Q06J000k053j859J323l03m41m60P77J765o52n22N8l09L05J82R22
$$ -79 -698 -31 775 1775 -278 -2137 -814 -1117 -1558 -2018 -1241 524 -128 -650 -592 -901 -596 -414 508
10038E08j18M29m95o49K136O44n45j45j10r14Q5l13j169N40K664n79j342j119
$$ 508 390 819 324 -325 1811 2455 1910 1765 1655 741 826 513 -656 -116 2548 1969 627 -492
10020d92J719P45M69J717Q70j021O66J291j755l25L6k069j180J378K417J118N42
$$ -492 1227 1972 2441 4158 5028 4007 4673 5964 4209 3884 3920 1851 671 2049 4466 5584 6126
10003F126k273j848J511J125j055j995M53J544K655P78j954j575m45J566m38n74
$$ 6126 3853 2005 3516 4641 3586 1591 2044 3588 6243 7021 5067 3492 3047 4613 4175 3601
9987C601P03P43j89m67M90L44j426p26j6k48j359j424M58K636L061R08k079k199
$$ 3601 4304 5047 4858 4391 4881 5225 3799 3073 3057 2809 1450 26 484 3120 6181 7089 5010 2811
9969B811l416O15L207K06m39k822o76J114J866P34L28j3L009j358j164m50j031
$$ 2811 -605 10 3217 3423 2984 162 -514 600 2466 3200 3528 3515 6524 5166 4002 3552 2521
9952B521j193l25l05j223l45r30K569N457j654n880k604J445N070K392o81n103
$$ 2521 1328 1003 698 -525 -870 -1800 769 6226 4572 -1308 -3912 -2467 2603 4995 4314 -789
9936g89l750M179M302o32J02j084P23j650k197j033R03K033L539J202k60O60J826
$$ -789 -4539 -360 3942 3310 3412 2328 3051 1401 -796 -1829 -926 1107 4646 5848 5588 6248 8074
9919H074J17r38k808j481R7j29O17J121l001k510K80J337J775R16J646j93r15
$$ 8074 8191 7253 4445 2964 3061 2932 3549 4670 1669 -841 -561 776 2551 3467 5113 4920 4005
9902D005K961K365k373j874R81J076p23J18R76r45K81K17j035j098N58R81j004
$$ 4005 6966 9331 6958 5084 6065 7141 6418 6536 7512 6567 6848 7065 6030 4932 5490 6471 5467
9885E467j859n88kP63m33n66Q76J181j734M47J269M33R20J329k15l6K40j553j080
$$ 5467 3608 3020 3018 3781 3348 2782 3658 4839 3105 3552 4821 5254 6174 7503 7288 7252 7492 5939 4859
9866D859R94J274r44q53j004r91j395j71K250K289k588l01R55o55n09l80R04J41
$$ 4859 5853 7127 6183 5330 4326 3335 1940 1769 4019 6308 3720 3419 4374 3719 3210 2830 3734 3875
9848C875N49k74m29L384L18j399o94J659L99j288k5k079N25J224m63j108o36n77
$$ 3875 4424 4150 3721 7105 7423 6024 5330 6989 7388 6100 6075 3996 4521 5745 5282 4174 3538 2961
9830B961J219J421K6r62n53M43J239L68Q35M2J893j911j264j0k12n00J576R26
$$ 2961 4180 5601 5627 4665 4112 4555 5794 6162 6997 7039 8932 7021 5757 5747 5535 5035 6611 7537
9812G537L47k218j31J450k98r02m99j723J46J289k97P95J212Q78k98k057j974
$$ 7537 7884 5666 5535 6985 6687 5785 5286 3563 3709 4998 4701 5496 6708 7586 7288 5231 3257
9795C257J867L658M09q27j858m37k53M96J140R72J15j747j55J414n4k06k90K391
$$ 3257 5124 8782 9191 8364 6506 6069 5816 6312 7452 8424 8539 6792 6637 8051 7997 7791 7501 9892
9777I892N38J93J42l15m79l92r27N90j41j26Q31j424k50l32K23J35J248n64l16
$$ 9892 10430 10623 10765 10450 9971 9579 8652 9242 9101 8975 9806 8382 8132 7800 8023 8158 9406 8842 8526
9758H526k060k54K69R63J113J319O74j03q54j351p83qR78q7j426J380o35Q64k86
$$ 8526 6466 6212 6481 7444 8557 9876 10550 10447 9593 8242 7459 7451 8429 8342 6916 8296 7661 8525 8239
9739H239J917j477q53M34J113m25J546J820J023o23j166N75q67l294j787l21n87
$$ 8239 10156 8679 7826 8260 9373 8948 10494 12314 13337 12714 11548 12123 11256 7962 6175 5854 5267
9722E267QM44r14o14L168J441J087j345o15m96q66J925n28N28o80M18O22J331
$$ 5267 5275 5719 4805 4191 7359 8800 9887 8542 7927 7431 6565 8490 7962 8490 7810 8228 8850 10181
9704A0181l01o66j297J209R01j580j016J993J062j467j212K00J520j78L42L06
$$ 10181 9880 9214 7917 9126 10027 8447 7431 9424 10486 9019 7807 8007 9527 9349 9691 9997
9688I997q12R59K19j173j153M57J257J37l74R9L73N79n0N18R57J849J763l70o42
$$ 9997 9185 10144 10363 9190 8037 8494 9751 9888 9514 9613 9986 10565 10515 11033 11990 13839 15602 15232 14590
9669A4590J98q86L16Q18j056j820M64l14K399K495n42j044M30K148K110J022j92
$$ 14590 14788 13902 14218 15036 13980 12160 12624 12310 14709 17204 16662 15618 16048 18196 20306 21328 21136
9652B1136l01K683L418K149p61k314l616k461O78N77M8J499q82j165P07j068N71
$$ 21136 20835 23518 26936 29085 28324 26010 22394 19933 20611 21188 21236 22735 21853 20688 21395 20327 20898
9635B0898J388M61n72j016r26j742N13j215M9K897l0j079K096J396N32L096N028
$$ 20898 22286 22747 22175 21159 20233 18491 19004 17789 17838 20735 20705 19626 21722 23118 23650 26746 31774
9618C1774p0k580m350k213j263R70J059m95k189j771l367N23J916j336j453k081
$$ 31774 31704 29124 24774 22561 21298 22268 23327 22832 20643 18872 15505 16028 17944 16608 15155 13074
9602A3074m99k85l15R42J522q79q7j59j821M78L15j762O01p05p83O03J247J136
$$ 13074 12575 12290 11975 12917 14439 13560 13473 13314 11493 11971 12286 10524 11125 10420 9637 10240 11487 12623
9584A2623Q26q86j482J60j05J519P51K62O23l75Q59Om66P92j86l0p83j785o74
$$ 12623 13449 12563 11081 11241 11136 12655 13406 13668 14291 13916 14775 14781 14315 15107 14921 14891 14108 12323 11649
9565A1649P5J882m20O06J145J587j257j210j1Q28J48N89q77j999o54L58R37J847
$$ 11649 11724 13606 13186 13792 14937 16524 15267 14057 14046 14874 15022 15611 14734 12735 12081 12439 13376 15223
9547A5223Q5R05j52l60Q84J74k770k068M72J565k17M52L01J661J261Q0k588j95
$$ 15223 15308 16213 16061 15701 16585 16759 13989 11921 12393 13958 13741 14193 14494 16155 17416 17496 14908 14713
9529A4713M81r7r08m91Q98Q63J204j721j872j539J590J554J682j15k98p94M37
$$ 14713 15194 15097 14189 13698 14596 15459 16663 14942 13070 11531 13121 14675 16357 16242 15944 15150 15587
9512A5587k59J422j111q62k090J415R99q7j97K87J82K543o57Q96JOM23j805j446
$$ 15587 15328 16750 15639 14777 12687 14102 15101 15014 14817 15104 15286 17829 17172 18068 18069 18075 18498 16693 15247
9493A5247J118k248J073J400q82l26M58l75o04O6m80L0J070N74M38J00O00J316
$$ 15247 16365 14117 15190 16590 15708 15382 15840 15465 14861 14927 14447 14477 15547 16121 16559 16659 17259 18575
9475A8575R15j399j81j028k165m2J170J093K89K9p04J024J562J704K49j474j143
$$ 18575 19490 18091 17910 16882 14717 14675 15845 16938 17227 17256 16552 17576 19138 20842 21091 19617 18474
9458A8474L002J704j628l073q63j725J486J895j462j23n09j069J766J66k46r68
$$ 18474 21476 23180 21552 18479 17616 15891 17377 19272 17810 17687 17178 16109 17875 18041 17795 16827
9442A6827J269J033J159j089q97J205J973L75J267K752J095j054j545k449q32
$$ 16827 18096 19129 20288 19199 18302 19507 21480 21855 23122 25874 26969 25915 24370 21921 21089
9427B1089j81K011L215l1l586o48J466j50j711o69Q30M01K48r44M6q8j066L4j597
$$ 21089 20908 22919 26134 26103 22517 21869 23335 23185 21474 20805 21635 22036 22284 21340 21386 21298 20232 20266 18669
9408A8669L62L091K515O97k502O5M47Q92K310M569J187j321j424k163k993j139
$$ 18669 19031 22122 24637 25334 22832 22897 23344 24236 26546 31115 32302 30981 29557 27394 24401 23262
9392B3262J804n43J85L78j959o27j15k033p29R17K7J553Q90o76N98P0j014o30
$$ 23262 25066 24523 24708 25086 23127 22500 22385 20352 19623 20540 20567 22120 23010 22334 22932 23002 21988 21358
9374B1358J918P45j628k04J487L80j64k80k392l47J186J474J600j059O57o35k271
$$ 21358 23276 24021 22393 22189 23676 24056 23892 23612 21220 20873 22059 23533 25133 24074 24731 24096 21825
9357B1825R83j009J639j365p45L421J474m23q39j545J45J204j33j28j728J124
$$ 21825 22808 21799 23438 22073 21328 24749 26223 25800 24961 23416 23561 24765 24632 24504 22776 23900
9341B3900J981k15o8m4M81J01j419n4p11Ll1J200J840j058l55j81J844j69j610
$$ 23900 25881 25666 25598 25554 26035 26136 24717 24663 23952 23955 23924 25124 26964 25906 25551 25370 27214 27045 25435
9322B5435R49R7o83j527K99P59n83L63P03K378N23j561r23J3M58J458P40j077
$$ 25435 26384 26481 25798 24271 24570 25329 24746 25109 25812 28190 28713 27152 26229 26242 26700 28158 28898 27821
9304B7821r27o06O00J772o62M26P82J750l159k019Q18q93J120J736j051N9o9K36
$$ 27821 26894 26288 26888 28660 27998 28424 29206 30956 27797 25778 26596 25703 26823 28559 27508 27567 27498 27734
9286B7734j104j101n5J98J079N69j294o35j675J270J193K071J016p69N16P40Q96
$$ 27734 26630 25529 25474 25672 26751 27320 26026 25391 23716 24986 26179 28250 29266 28497 29013 29753 30649
9269C0649J598P46K478J271j008l73o36n40r22k495k017J360K124J054j368j292
$$ 30649 32247 32993 35471 36742 35734 35361 34725 34185 33263 30768 28751 30111 32235 33289 31921 30629
9253C0629j72K29j343j417K413K664J14r07r92q72J771L209P12j92j717p21K01
$$ 30629 30457 30686 29343 27926 30339 33003 33117 32210 31218 30346 32117 35326 36038 35846 34129 33408 33609
9236C3609R54l38o3K687K732l834k844J509J552k81o98q02N67l8l55l98L01j631
$$ 33609 34563 34225 34162 36849 39581 35747 32903 34412 35964 35683 34985 34183 34750 34712 34357 33959 34260 32629
9218C2629j080J780r31K76J306J227m61J205N65m87k936n64o16K061K667r37J053
$$ 32629 31549 33329 32398 32674 33980 35207 34746 35951 36516 36029 33093 32529 31913 33974 36641 35704 36757
9201C6757j350j790L12R69J403p85j410j98Pr74J151n90l5K526L084M08k815j763
$$ 36757 35407 33617 33929 34898 36301 35516 34106 33908 33915 32941 34092 33502 33467 35993 39077 39485 36670 34907
9183C4907J6K981P71k233j260L02o38J783K019M82L2P97J191J576l660l229R15
$$ 34907 34923 37904 38675 36442 35182 35484 34846 36629 38648 39130 39162 39959 41150 42726 39066 35837 36752
9166C6752K554J526Q81j224n94k47M82o99J570K225J889r06O61K28j361j873j176
$$ 36752 39306 40832 41713 40489 39895 39648 40130 39431 41001 43226 45115 44209 44870 45098 43737 41864 40688
9149D0688n69J397J401Q96j095M97J535k57k81K04j497J7m59n31M64N13J797n18
$$ 40688 40119 41516 42917 43813 42718 43215 44750 44493 44212 44416 42919 42936 42477 41946 42410 42923 44720 44202
9131D4202M82K111j15k750Q99K003J6O6M51J64J930m33j021j948j279m83P65J06
$$ 44202 44684 46795 46680 43930 44829 46832 46848 46914 47365 47529 49459 49026 48005 46057 44778 44295 45060 45166
9113D5166K89Q54n12J873J334k80M99O26o42j023j039j635Q55J699j257M67k73
$$ 45166 45455 46309 45797 47670 49004 48724 49223 49849 49207 48184 47145 45510 46365 48064 46807 47274 47001
9096D7001O2j211L08J104J534J327K040Q67K80j278q67N35m62J025O58r44j095
$$ 47001 47063 45852 46160 47264 48798 50125 52165 53032 53312 52034 51167 51702 51240 52265 52923 51979 50884
9079E0884QJ59o13J795P61Q10o01k27J969J342o62J269M58j82l64P77L64p87R84
$$ 50884 50892 51051 50438 52233 52994 53804 53203 52976 54945 56287 55625 56894 57352 57170 56806 57583 57947 57160 58144
9060E8144j97L92k59j294O56n8J80j423J54K090N70K224j17m68j35j41N13m80
$$ 58144 57947 58339 58080 56786 57442 57384 57564 56141 56295 58385 58955 61179 61062 60594 60459 60318 60831 60351
9042F0351l113J327K286M97j98N6o22K64J212L60j53j38J778J014j537j27M9n52
$$ 60351 57238 58565 60851 61348 61150 61206 60584 60848 62060 62420 62267 62129 63907 64921 63384 63257 63306 62754
9024F2754J020l32N11J730m11r40R47J953r8k40k368n69J68J517k83r29J381K213
$$ 62754 63774 63442 63953 65683 65272 64332 65279 67232 67134 66894 64526 63957 64125 65642 65359 64430 65811 68024
9006F8024J013q8j246j139J620J257j364l86J938m36m1J792N00o37L12J496Q55
$$ 68024 69037 68949 67703 66564 68184 69441 68077 67691 69629 69193 69152 70944 71444 70807 71119 72615 73470
8989G3470l746j100L693J035P71l50m14J373J610j17l92j189L84N32J439O98K007
$$ 73470 69724 68624 72317 73352 74123 73773 73359 74732 76342 76225 75833 74644 75028 75560 76999 77697 79704
8972G9704P29k13j840R10J29j547j179K0m35Q60K377N16l65R51m4L33J3k42J831
$$ 79704 80433 80220 78380 79290 79419 77872 76693 76713 76278 77138 79515 80031 79666 80617 80573 80906 80919 80677 82508
8953H2508P66K745J688o35l96J79j52O49l15l51M59J547j48J58J57J122j414L95
$$ 82508 83274 86019 87707 87072 86676 86855 86703 87352 87037 86686 87145 88692 88544 88702 88859 89981 88567 88962
8935H8962R65p44o16j139Q59M213K276j323j86n20M36J830R44j409j095l35P72
$$ 88962 89927 89183 88567 87428 88287 92500 94776 93453 93267 92747 93183 95013 95957 94548 93453 93118 93890
8918I3890J682Q20J950J404j974l403m46J499J004J973J035j73l56o59N20J163
$$ 93890 95572 96392 98342 99746 97772 94369 93923 95422 96426 98399 99434 99261 98905 98246 98766 99929
8902I9929O7J044K388K76j90n06J187N93k5N70R44m69m60P20J413j21J528J867
$$ 99929 99996 101040 103428 103704 103514 103008 104195 104788 104763 105333 106277 105808 105348 106068 107481 107360 108888 110755
8884A10755j530k022J501K761j135j170n31K78J872M31R1J52J954n05K71R32P93
$$ 110755 109225 107203 108704 111465 110330 109160 108629 108907 110779 111210 111301 111453 113407 112902 113173 114105 114898
8867A14898J29R56M14K884J695j265p26Q3M37j104m4N25J761K749K123j863J66
$$ 114898 115027 115983 116397 119281 120976 119711 118985 119068 119505 118401 118357 118882 120643 123392 125515 123652 123818
8850A23818j07q32N85J428O92M61l44kP8J520J708k97J54O79J341l83P79K342
$$ 123818 123711 122879 123464 124892 125584 126045 125701 125699 125777 127297 129005 128708 128862 129541 130882 130499 131278 133620
8832A33620P63l54o37m25j157r28K835L228K889R78l31J250pM28Q45j841K313
$$ 133620 134383 134029 133392 132967 131810 130882 133717 136945 139834 140812 140481 141731 141724 142152 142997 141156 143469
8815A43469J151j644L94K243J303rM26K042J430J538J428J92n85K42R36J396l07
$$ 143469 144620 142976 143370 145613 146916 146907 147333 149375 150805 152343 153771 153963 153378 153620 154556 155952 155645
8798A55645N76J332l01L142J909k84m25J440K717K049J374Q93N74J502P53k45
$$ 155645 156221 157553 157252 160394 162303 162019 161594 163034 165751 167800 169174 170067 170641 172143 172896 172651
8782A72651J19n19J897L070K930j1n67J268j98J76J691J852K606K275J187p1K280
$$ 172651 172770 172251 174148 177218 180148 180137 179570 180838 180640 180816 182507 184359 186965 189240 190427 190356 192636
8765A92636L267L76n39O2K038L096M8l35K052J415n53K106L378L437J160R37R38
$$ 192636 195903 196279 195740 195802 197840 200936 200984 200649 202701 204116 203563 205669 209047 212484 213644 214581 215519
8748B15519K803L020M9r79J499M401L098J210K145K213K476M83q40J355L367J176
$$ 215519 218322 221342 221391 220412 221911 226312 229410 230620 232765 234978 237454 237937 237097 238452 241819 242995
8732B42995N83J724K520J308K085O13R29L217L209L055O48r69K778K434L409L449
$$ 242995 243578 245302 247822 249130 251215 251828 252757 255974 259183 262238 262886 261917 264695 267129 270538 273987
8716B73987J111J151K382J075J289K481J899L576K506k204J692J778R43J417M317
$$ 273987 275098 276249 278631 279706 280995 283476 285375 288951 291457 289253 290945 292723 293666 295083 299400
8701B99400K512L633K902K917J984J099J314J993K180M587J977J467J173K673
$$ 299400 301912 305545 308447 311364 313348 314447 315761 317754 319934 324521 326498 327965 329138 331811
8687C31811J900L08M449M595L363K048J319K043J759K209L333L866Q63M49K680
$$ 331811 333711 334019 338468 343063 346426 348474 349793 351836 353595 355804 359137 363003 363866 364315 366995
8672C66995L366j53K267J975N126L252K746K369K865K423L304K842K470K602L271
$$ 366995 370361 370208 372475 374450 379576 382828 385574 387943 390808 393231 396535 399377 401847 404449 407720
8657D07720M802N639L701J227J601L162N470M268K330J185J754N770L049L264
$$ 407720 412522 418161 421862 423089 424690 427852 433322 437590 439920 441105 442859 448629 451678 454942
8643D54942M252M990N332K086L769M543M819M686M450P107M462K185K599M537
$$ 454942 459194 464184 469516 471602 475371 479914 484733 489419 493869 500976 505438 507623 510222 514759
8629E14759M790M863P373M755L051M116O023O654O029O033O639N310M467M576
$$ 514759 519549 524412 531785 536540 539591 543707 549730 556384 562413 568446 575085 580395 584862 589438
8615E89438O693P583N566N210N732N328O842P152P848P186Q670N404M817O146
$$ 589438 596131 603714 609280 614490 620222 625550 632392 639544 647392 654578 663248 668652 673469 679615
8601F79615Q941Q121N281P074R140J0248P346Q522J0461R693R436J1066J0344
$$ 679615 688556 696677 701958 709032 718172 728420 735766 744288 754749 764442 773878 784944 795288
8588G95288Q008O625N464J0383J0566J0458Q367J0771J0791J0067J0967J1857
$$ 795288 803296 809921 815385 825768 836334 846792 855159 865930 876721 886788 897755 909612
8576I09612J0823J2080J3587J3227J1765J3416J4419J2341J3238J3353J4023J4006
$$ 909612 920435 932515 946102 959329 971094 984510 998929 1011270 1024508 1037861 1051884 1065890
8564A065890J5725J5014J5327J4363J5359J5131J7323J8809K0590J9812K0141
$$ 1065890 1081615 1096629 1111956 1126319 1141678 1156809 1174132 1192941 1213531 1233343 1253484
8553A253484K0285J9179J8932J5573J6134J7551K0099K1553K2482K2958K2117
$$ 1253484 1273769 1292948 1311880 1327453 1343587 1361138 1381237 1402790 1425272 1448230 1470347
8542A470347K3776K5334K7327L2098L7714L6455K5095J5237J4597J9928K4182
$$ 1470347 1494123 1519457 1546784 1578882 1616596 1653051 1678146 1693383 1707980 1727908 1752090
8531A752090K7953K8133K8024L0340L1057L0231L4619L4756L6640L8419L8314
$$ 1752090 1780043 1808176 1836200 1866540 1897597 1927828 1962447 1997203 2033843 2072262 2110576
8520B110576L6624L7844L8493L9432M3260M5550M5436M6388M8087M7640M9478
$$ 2110576 2147200 2185044 2223537 2262969 2306229 2351779 2397215 2443603 2491690 2539330 2588808
8509B588808N1705N5805N6441O0884O7653P0773O8041N9089N1876N5173O3021
$$ 2588808 2640513 2696318 2752759 2813643 2881296 2952069 3020110 3079199 3131075 3186248 3249269
8498C249269O8399O9725P0023P3429P7836Q0307Q0831Q5745Q8497R3213R4767
$$ 3249269 3317668 3387393 3457416 3530845 3608681 3688988 3769819 3855564 3944061 4037274 4132041
8487D132041R4102R8727R9963J02248J08085J11656J14435J16717J20613J23256
$$ 4132041 4226143 4324870 4424833 4527081 4635166 4746822 4861257 4977974 5098587 5221843
8477E221843J27016J30834J35697J38219J43761J47081J47791J52542J58284J60782
$$ 5221843 5348859 5479693 5615390 5753609 5897370 6044451 6192242 6344784 6503068 6663850
8467F663850J65844J70581J74271J75328J78554J81711J85893J88166J92437J96960
$$ 6663850 6829694 7000275 7174546 7349874 7528428 7710139 7896032 8084198 8276635 8473595
8457H473595J96747J97734J99975K01729J99468K01760K01095J99097J98028J93756
$$ 8473595 8670342 8868076 9068051 9269780 9469248 9671008 9872103 10071200 10269228 10462984
8447A0462984J88961J83873J80581J75023J67596J61265J48563J39366J30682
$$ 10462984 10651945 10835818 11016399 11191422 11359018 11520283 11668846 11808212 11938894
8438A1938894J18696J07072R4553P8281O6006N1691L6718J8711L248j1037k5031
$$ 11938894 12057590 12164662 12259215 12337496 12403502 12455193 12491911 12510622 12513870 12502833 12477802
8427A2477802m2605n5823p0315q3667r8955j12955j23799j32170j43337j58337
$$ 12477802 12435197 12379374 12309059 12225392 12126437 12013482 11889683 11757513 11614176 11455839
8417A1455839j64432j71595j79923j85416j89412j95009j99403k00970k02620
$$ 11455839 11291407 11119812 10939889 10754473 10565061 10370052 10170649 9969679 9767059
8408I767059k03815k06196k04137k02812k03154k04381k02114j98136j94844j90859
$$ 9767059 9563244 9357048 9152911 8950099 8746945 8542564 8340450 8142314 7947470 7756611
8398G756611j87651j84881j80245j78402j74721j69457j65154j61499j59803j53487
$$ 7756611 7568960 7384079 7203834 7025432 6850711 6681254 6516100 6354601 6194798 6041311
8388F041311j48733j43435j41821j39509j40551j36311j29436j24304j18752j17349
$$ 6041311 5892578 5749143 5607322 5467813 5327262 5190951 5061515 4937211 4818459 4701110
8378D701110j14326j13605j10026j02949r9775r7746r5623r3276r1436q7973q4576
$$ 4701110 4586784 4473179 4363153 4260204 4160429 4062683 3967060 3873784 3782348 3694375 3609799
8367C609799q1335q1525p7965p5802p2071p0872o9934o4453o5776o2706o1456
$$ 3609799 3528464 3446939 3368974 3293172 3221101 3150229 3080295 3015842 2950066 2887360 2825904
8356B825904o0390n6888n4335n4690n4740n2027m9384m8297m4990m3490m6047
$$ 2825904 2765514 2708626 2654291 2599601 2544861 2492834 2443450 2395153 2350163 2306673 2260626
8345B260626m8284m5542m1679m1344l7762l5729l5574l6272l7297l5224l4515
$$ 2260626 2212342 2166800 2125121 2083777 2046015 2010286 1974712 1938440 1901143 1865919 1831404
8334A831404l2934l4301l1450l0741k8949k8321k9951k6926k5370k6466k5605
$$ 1831404 1798470 1764169 1732719 1701978 1673029 1644708 1614757 1587831 1562461 1535995 1510390
8323A510390k6448k2825k1699k1898k1509j9891k0863k0616k0502k3134k2378
$$ 1510390 1483942 1461117 1439418 1417520 1396011 1376120 1355257 1334641 1314139 1291005 1268627
8312A268627k1511j8948j6949j9136j5763j5997j6711j6088j5083j4190j5797
$$ 1268627 1247116 1228168 1211219 1192083 1176320 1160323 1143612 1127524 1112441 1098251 1082454
8301A082454j6518j5304j3539j4132j1726j2662j4829j5246j3421j1545j2575
$$ 1082454 1065936 1050632 1037093 1022961 1011235 998573 983744 968498 955077 943532 930957
8290I30957j1363j1537j3050j2832j3427j2260j0730q901j0395j1099r812r004
$$ 930957 919594 908057 895007 882175 868748 856488 845758 836857 826462 815363 805551 796547
8278G96547p344o399q647j2361j2086j0207p982o106j0784j0344r064q157p353
$$ 796547 789203 782804 774157 761796 749710 739503 731521 725415 714631 704287 695223 687066 679713
8265F79713p859p432o799p788r575r721o615o245o311n977l131n168p139q698
$$ 679713 671854 664422 657623 649835 640260 630539 623924 617679 611368 605391 602260 597092 589953 581255
8251E81255p395o346o478o524n222n301o348p509p598n857o396o213m071n520
$$ 581255 573860 567514 561036 554512 549290 543989 537641 530132 522534 516677 510281 504068 499997 494477
8237D94477n815l782l705n975n371m144m767m815n388n145m098l537m545m958
$$ 494477 488662 484880 481175 475200 469829 465685 460918 456103 450715 445570 441472 437935 433390 428432
8223D28432n078m350o453n083k248k665k772l303n417m907j793j906k344l731
$$ 428432 423354 419004 412551 407468 405220 402555 399783 396480 391063 386156 384363 382457 380113 376382
8209C76382m127k746l735l290m225l141l080l410k488j601l641l459k562k611
$$ 376382 372255 369509 365774 362484 358259 355118 352038 348628 346140 344539 340898 337439 334877 332266
8195C32266l475m515l872l982j779j935k321j502m340l901k433k525j745n39j081
$$ 332266 328791 324276 320404 316422 314643 312708 310387 308885 304545 300644 298211 295686 293941 293402 292321
8180B92321l502l906l341m894l268j519k667m08k098l281j073j451q24k481j878
$$ 292321 288819 284913 281572 276678 273410 271891 269224 268816 266718 263437 262364 260913 260089 257608 255730
8165B55730k597k360j746l252k532j77j930j17j592l848l412l455l011j278j762
$$ 255730 253133 250773 249027 245775 243243 243066 241136 241019 239427 235579 232167 228712 225701 224423 222661
8150B22661o28j880j556l08k145n17n39k355j784j095j820k597k044K26K96k968
$$ 222661 222033 220153 218597 218289 216144 215627 215088 212733 210949 209854 208034 205437 203393 203619 203915 200947
8134B00947j987o39p72j012k044k551k158j6o13l240k966k51J149Q85p63k149
$$ 200947 198960 198321 197549 196537 194493 191942 189784 189768 189155 185915 182949 182698 183847 184732 183969 181820
8118A81820m54j829j957j896q24N3l38j065k856j621k23n50j039k858J70o19K68
$$ 181820 181366 179537 177580 175684 174860 174913 174575 173510 170654 169033 168810 168260 167221 164363 164533 163914 164182
8101A64182q79j67q54j985k518M92j552k49l01L65P89n13m50q92n57K295q98j677
$$ 164182 163303 163136 162282 160297 157779 158271 156719 156470 156169 156534 157323 156810 156360 155468 154911 157206 156308 154631
8083A54631j666k090k319j320O3j371q84m332k516L92M30M52j332j169J51J190
$$ 154631 152965 150875 148556 147236 147299 145928 145044 140712 138196 138588 139018 139470 138138 136969 137120 138310
8067A38310k168j628r23j0O42l471k625J038j953j942j251M23m03j392J569K910
$$ 138310 136142 134514 133591 133581 134223 130752 128127 129165 127212 125270 124019 124442 124039 122647 124216 127126
8051A27126j976p33J892J1Q82K278j747l668j718j955p29j600j375o43j314l904
$$ 127126 125150 124417 126309 126320 127202 129480 127733 124065 122347 120392 119663 118063 116688 116045 114731 110827
8035A10827k87r10P74j510n75J495Q38m248p4O00o6r4m05j131j077N83o66j159
$$ 110827 110540 109630 110404 108894 108319 109814 110652 106404 106330 106930 106864 106770 106365 105234 104157 104740 104074 102915
8017A02915Q1n62j00j45r93k034j220r22j390k43o44K031Q45j829k443j920K87
$$ 102915 102996 102434 102334 102189 101196 99162 97942 97020 95630 95387 94743 96774 97619 95790 93347 91427 91714
8000I1714k035q34m64Q5j073k545j02J937j59j663n00R39r92k197j341j78J318
$$ 91714 89679 88845 88381 88466 87393 84848 84746 86683 86524 84861 84361 85300 84308 82111 80770 80592 81910
7983H1910j467j535K15m59j163O59l20k68K564J329n3k483j882M89r7k737j241
$$ 81910 80443 78908 79123 78664 77501 78160 77840 77572 80136 81465 81412 78929 77047 77536 77439 74702 73461
7966G3461K506m53j463q04M95p22o55M71j512o17r39m86L86O09J348J170j57r68
$$ 73461 75967 75514 74051 73247 73742 73020 72365 72836 71324 70707 69768 69282 69668 70277 71625 72795 72638 71670
7948G1670k784j025j474K02p41O09J02Q02q88q41J23K58j087n48m14o47m6R38
$$ 71670 68886 67861 66387 66589 65848 66457 66559 67361 66473 65632 65755 66013 64926 64378 63964 63317 63271 64209
7930F4209R10j937j372R55L37q29J485p25j665Q21J136j876l365p68J48j68j821
$$ 64209 65119 63182 61810 62765 63102 62273 63758 63033 61368 62189 63325 61449 58084 57316 57464 57296 55475
7913E5475M81K157m32L59N04J497P04j555p80j30l33k037K655P3j912r88O70N30
$$ 55475 55956 58113 57681 58040 58544 60041 60745 59190 58410 58280 57947 55910 58565 58638 56726 55738 56408 56938
7895E6938Q92Q69k581k031k101j528O73l92j396K089J768o55j485r24M22N83q08
$$ 56938 57830 58699 56118 54087 51986 50458 51131 50739 49343 51432 53200 52545 51060 50136 50558 51141 50333
7878E0333M06J841m90J45m24o99k74P61m89p84p11r08L39R60p21j283p43j281
$$ 50333 50739 52580 52090 52235 51811 51112 50838 51599 51110 50326 49615 48707 49046 50006 49285 48002 47259 45978
7860D5978k272m27J916P10n89P4j566o04O93P10l82j486K371L028j111l66j140
$$ 45978 43706 43279 45195 45905 45316 45390 43824 43220 43913 44623 44241 42755 45126 48154 47043 46677 45537
7843D5537j381j066k603L17J519n92j043K012q64J370J804o29M39j760j239R49
$$ 45537 44156 43090 40487 40804 42323 41731 40688 42700 41836 43206 45010 44381 44820 43060 41821 42770
7827D2770j83L57J14k961m63M57q2r53j454J649Q16o77J59k428j046o40O95N89
$$ 42770 42587 42944 43058 40097 39634 40091 40009 39056 37602 39251 40067 39390 39549 37121 36075 35435 36130 36719
7809C6719j022J01J646K86P7j26J592M58k654k649l39n9M99J088J65j524o49Q11
$$ 36719 35697 35798 37444 37730 37807 37681 39273 39731 37077 34428 34089 34030 34529 35617 35782 34258 33609 34420
7791C4420M38J634J378j386l149k55L016O70j123N87R32J674r28j781r99j242
$$ 34420 34858 36492 37870 36484 33335 33080 36096 36766 35643 36230 37162 38836 37908 36127 35128 33886
7775C3886q1j138N20r88p1m17J347K57p22j088j560N54q25O22p1J304R2O47K12
$$ 33886 33805 32667 33187 32199 32128 31711 33058 33315 32593 31505 29945 30499 29674 30296 30225 31529 31621 32268 32480
7756C2480j146j251J23M62k60L82m26o07j234n80P42J976J620j848j314j517l558
$$ 32480 31334 30083 30206 30668 30408 30790 30364 29757 28523 27943 28685 30661 32281 30433 29119 27602 24044
7739B4044l00J755K112P88K661J169k994k101k107P6L132R7o56r88q21J5q7k32
$$ 24044 23744 25499 27611 28399 31060 32229 29235 27134 25027 25103 28235 28332 27676 26688 25867 25882 25795 25563
7721B5563N81k87j088o89J08p89J453M43j169R73J442j707O1k49m55J025K2j528
$$ 25563 26144 25857 24769 24080 24188 23399 24852 25295 24126 25099 26541 24834 24895 24646 24191 25216 25238 23710
7703B3710o55O75M17j39J7J877K499P93j316k352j287j98o6j545p44O68L643n2
$$ 23710 23055 23730 24147 24008 24025 25902 28401 29194 27878 25526 24239 24041 23975 22430 21686 22354 25997 25945
7685B5945n30k146p24j112q5J526l34K49m52J62m74o23j473J61q72J022Q01r34
$$ 25945 25415 23269 22545 21433 21348 22874 22540 22789 22337 22499 22025 21402 19929 20090 19218 20240 21041 20107
7667B0107R96K403n32j923j077L26P97l79j70J175K043j69k326j139k263j06Q80
$$ 20107 21103 23506 22974 21051 19974 20300 21097 20718 20548 21723 23766 23597 21271 20132 17869 17763 18643
7650A8643J116J104R04L31p84j010k4O79r97m46M74m17J198J764n28n06q37J285
$$ 18643 19759 20863 21767 22098 21314 20304 20280 20959 19962 19516 19990 19573 20771 22535 22007 21501 20664 21949
7632B1949l48j842j059j91J156j26l120l93J640M59Q37N45k090j608R85J555P30
$$ 21949 21601 19759 18700 18509 19665 19539 16419 16026 17666 18125 18962 19507 17417 15809 16794 18349 19079
7615A9079j762j521J92k72j802m29J414J099K08Q46k52q40k162j04J96J562J263
$$ 19079 17317 15796 15988 15716 13914 13485 14899 15998 16206 17052 16800 15960 13798 13694 13890 15452 16715
7598A6715J111q50q4j24O35O28J72j235j98J52K662J465k532k621M70R11n9Q21
$$ 16715 17826 16976 16892 16768 17403 18031 18203 16968 16770 16922 19584 21049 18517 15896 16366 17277 17218 18039
7580A8039o89q37r69P2j69j444K584J717j775j343j254J060K26m22J018J141J486
$$ 18039 17350 16513 15544 15616 15447 14003 16587 18304 16529 15186 13932 14992 15218 14796 15814 16955 18441
7563A8441k57l98K57r93Q74l0K06J170p13j601n34l160k947j11M5l7J161O87m49
$$ 18441 18184 17786 18043 17050 17924 17894 18100 19270 18557 16956 16422 13262 10315 10204 10249 10212 11373 12060 11611
7544A1611J39k72k51P00n9J603O7J37m79n40o59K474o82j81Q38M38j530N14J976
$$ 11611 11750 11478 11227 11927 11868 13471 13538 13675 13196 12656 11997 14471 13789 13608 14446 14884 13354 13868 15844
7525A5844N43k093l24R09R36r06j752j189j279l8k87N51j657k024K155J910k775
$$ 15844 16387 14294 13970 14879 15815 14909 13157 11968 10689 10651 10364 10915 9258 7234 9389 11299 8524
7508H524l75J403K637Q04J386k28j541j847j744Q86n87J50J396K950K00l11j013
$$ 8524 8149 9552 12189 12993 14379 14151 12610 10763 9019 9905 9318 9468 10864 13814 14014 13703 12690
7491A2690j104j307j824J177J364o22k585k2J871L976K009n15j423j694q85L63
$$ 12690 11586 10279 8455 9632 10996 10374 7789 7767 9638 13614 15623 15108 13685 11991 11106 11469
7475A1469N78K429j18k425j125J147P34k406R99M83r04P75Q58L42M08k32j70J48
$$ 11469 12047 14476 14358 11933 10808 11955 12689 10283 11282 11765 10861 11636 12494 12836 13244 13012 12842 12990
7457A2990j844j064M31K048n56n40j043K8R76L97Q00r43k225k743q14K273K499
$$ 12990 11146 10082 10513 12561 12005 11465 10422 10450 11426 11823 12623 11680 9455 6712 5898 8171 10670
7440A0670o06M89j94o53q98j159l83O53P15J177l35M93R96k147n57K354p13l712
$$ 10670 10064 10553 10359 9706 8808 7649 7266 7919 8634 9811 9476 9969 10965 8818 8261 10615 9902 6190
7422F190P89O26k64l35J339K319k378m18O22j864l98L71K26K75P57J374nj012
$$ 6190 6979 7605 7341 7006 8345 10664 8286 7868 8490 6626 6228 6599 6825 7100 7857 9231 9226 8214
7404H214j268J72M70J41j327J51K785o87n37O5K00j35J547j93r33n36q68J168
$$ 8214 6946 7118 7588 7729 6402 6553 9338 8651 8114 8179 8379 8244 9791 9598 8665 8129 7261 8429
7386H429n27j012J376NN09K13K687J338k497k558p76o30J465K161P08j143j237
$$ 8429 7902 6890 8266 8271 8780 8993 11680 13018 10521 7963 7187 6557 8022 10183 10891 9748 8511
7369H511m1J117n13q89K535N82j531o70l04O20l06M04L12j961k949n31J767P08
$$ 8511 8470 9587 9074 8185 10720 11302 9771 9101 8797 9417 9111 9515 9827 7866 4917 4386 6153 6861
7351F861k215Q02K148j352q69J367O25j840K90O94M45j510j122j285j15J901J373
$$ 6861 4646 5448 7596 6244 5375 6742 7367 5527 5817 6511 6956 5446 4324 3039 2924 4825 6198
7334F198mK375K42l21p97j397Q60J237o49k311o15J019Q13k61J14q64p94j033
$$ 6198 6194 8569 8811 8490 7693 6296 7156 8393 7744 5433 4818 5837 6650 6389 6503 5639 4845 3812
7316C812j76K131O03k07j571m32M33n33j39K334J105p65o78m8o45j820j327L34
$$ 3812 3636 5767 6370 6163 4592 4160 4593 4060 3921 6255 7360 6595 5917 5869 5224 3404 2077 2411
7298B411K359K440l58j384n35J363J309q16o86q34J343J565j609j892m50J46j124
$$ 2411 4770 7210 6852 5468 4933 6296 7605 6789 6103 5269 6612 8177 6568 4676 4226 4372 3248
7281C248K788J062j291R72J405n7m76q07p50r20J620J594p43j404j458Q70K348
$$ 3248 6036 7098 5807 6779 8184 8127 7651 6844 6094 5174 6794 8388 7645 6241 4783 5653 8001
7264H001l27j709l06R3r74j302j437n25J595P62l72K07J77L68K67J192R9K01j327
$$ 8001 7674 5965 5659 5752 4778 3476 2039 1514 3109 3871 3499 3706 3883 4251 4518 5710 5809 6010 4683
7245D683M82J665j195m87O03k5j590p17L58J427J730l10Or27j81M47P30R53R63
$$ 4683 5165 6830 5635 5148 5751 5726 4136 3419 3777 5204 6934 6624 6630 5703 5522 5969 6699 7652 8615
7226H615Q32l081P91J658n31k226j339k102n61N52j15L770Q05Q49j178k078j469
$$ 8615 9447 6366 7157 8815 8284 6058 4719 2617 2056 2608 2493 6263 7068 7917 6739 4661 3192
7209C192Q92K587k377m43J769j10j319Q22J761j402j887q55M33J11O75j505j85
$$ 3192 4084 6671 4294 3851 5620 5510 4191 5013 6774 5372 3485 2630 3063 3174 3849 2344 2159
7192B159J701J186O87j882j931q71N62K494M46m80n54j930k060o93J170m00J241
$$ 2159 3860 5046 5733 3851 1920 1049 1611 4105 4551 4071 3517 1587 -473 -1166 4 -396 845
7175H45L23K77R86J538q7o75j193K040J830k025k926J608K985R05j314p19l20
$$ 845 1168 1445 2431 3969 3882 3207 2014 4054 5884 3859 933 2541 5526 6431 5117 4398 4078
7158D078J419l26q73J489j02j62L16j782m36j339L28R2O91M18L99j606o58O78
$$ 4078 5497 5171 4298 5787 5685 5523 5839 4057 3621 2282 2610 2702 3393 3811 4210 2604 1946 2624
7140B624L01l18K601R68j220R66J594k042K33K06l70j901k509R72N54r02k46k02
$$ 2624 2925 2607 5208 6176 4956 5922 7516 5474 5707 5913 5543 3642 1133 2105 2659 1757 1511 1309
7122A309j212L56L008J575l050j946R77L394K63j024j506J432J861m18j736n11
$$ 1309 97 453 3461 5036 1986 40 1017 4411 4674 3650 2144 3576 5437 5019 3283 2772
7106B772K69j159k718K095J705q32J246J733k269k107J588R02J404j95k496L48
$$ 2772 3041 1882 -836 1259 2964 2132 3378 5111 2842 735 2323 3225 4629 4434 1938 2286
7090B286J715k56M73N19J316k60l64J8j840j405j197j067J107K298N08k090k97
$$ 2286 4001 3745 4218 4737 6053 5793 5429 5447 3607 2202 1005 -62 1045 3343 3851 1761 1464
7073A464K674K197l77r51L57m26p77K027j077k560j057J51J453N97j103j192M93
$$ 1464 4138 6335 5958 5007 5364 4938 4161 6188 5111 2551 1494 1645 3098 3695 2592 1400 1893
7056A893P41j460K60J858j168k267J996K494q98j096m63l95L36J415N11K89r66
$$ 1893 2634 1174 1434 3292 2124 -143 1853 4347 3449 2353 1890 1495 1831 3246 3757 4046 3080
7039C080j08O76k4J95K057k87p72j312m9j023k739Q67J981L74j065k695n0M20
$$ 3080 2972 3648 3624 3819 5876 5589 4817 3505 3456 2433 -306 561 2542 2916 1851 -844 -894 -474
7021d74K06q4Q26J364P47Kq53j373m95K525j37l61J193J504j11k958j342L89k66
$$ -474 -268 -352 474 1838 2585 2587 1734 361 -134 2391 2254 1893 3086 4590 4479 1521 179 568 302
7002C02J071O22j159J84K148L30r47j734p99l61K749O60l56j120m25J511J05k751
$$ 302 1373 1995 836 1020 3168 3498 2551 817 18 -343 2406 3066 2710 1590 1165 2676 2781 30
6984C0Q0o28k9K81j038K773K242L1M68j885j149L52p1J371J695j374q84q6j63
$$ 30 110 -518 -547 -266 -1304 1469 3711 3742 4210 2325 1176 1528 1457 2828 4523 3149 2265 2179 2016
6965B016j23m59K398j200j668M93J33J842l84o75L47l91k275N70J692k9K78j416
$$ 2016 1893 1434 3832 2632 964 1457 1590 3432 3048 2373 2720 2329 54 624 2316 2287 2565 1149
6947A149q56m49O89K144J331l74P36n26l268r42Q53Q24J62J227J639n17k026r8
$$ 1149 293 -156 533 2677 4008 3634 4370 3844 576 -366 487 1311 1473 2700 4339 3822 1796 1698
6929A698m6j101j133J523J536Q44o89j977m63R71n59J377J095L53M32j151j306
$$ 1698 1652 551 -582 941 2477 3321 2632 655 192 1163 604 1981 3076 3429 3861 2710 1404
6912A404L22j930m75J171K08k91K8O7m66q13m18K463K224R51p50l133j287P03
$$ 1404 1726 -204 -679 492 700 409 437 504 38 -775 -1193 1270 3494 4445 3695 562 -725 -22
6894b2Rj469J145n2r79J060J035J532q05j450j28j374J314O54L28o94j569J49
$$ -22 -13 -1482 -337 -389 -1368 -308 727 2259 1454 4 -124 -1498 -184 470 798 104 -1465 -1316
6876a316K191M97n05j683j427K555K145q36j906j154J001j351m33j147P69nJ090
$$ -1316 875 1372 867 -816 -2243 312 2457 1621 -285 -1439 -438 -1789 -2222 -3369 -2600 -2605 -1515
6859a515K895K326r54k440N35Q82R3P21m11j02J133j341j672J1N20L98J347l79
$$ -1515 1380 3706 2752 312 847 1729 1822 2543 2132 2030 3163 1822 150 161 681 1079 2426 2047
6841B047o03J635J447j151k282O25R74o60j632k002P93J499m17j436K61p67k12
$$ 2047 1444 3079 4526 3375 1093 1718 2692 2032 400 -1602 -809 690 273 -1163 -902 -1669 -1881
6824a881O50K14P44J063J66m68M64Q93j88q91J72J204K292O21K10r46k112k158
$$ -1881 -1231 -1017 -273 790 956 488 952 1845 1657 766 938 2142 4434 5055 5265 4319 2207 49
6806D9j319l15n75O63K209O69r25N62k73m78N53j875k139K254O13J217K36J90
$$ 49 -1270 -1585 -2160 -1497 712 1381 456 1018 745 267 820 -1055 -3194 -940 -327 890 1126 1316
6788A316j214k172L73K054j89j14J540J33j485n15j6j030n14J111K452K31j883
$$ 1316 102 -2070 -1697 357 168 54 1594 1727 242 -273 -289 -1319 -1833 -722 1730 1961 78
6771G8r74J514p7j339L53J257n6p55n28N66O58M02k39R62J1j279O55J20j325j378
$$ 78 -896 618 541 -798 -445 812 756 1 -527 39 697 1099 860 1822 1833 554 1209 1329 4 -1374
6751a374O38p68P68L91j218n65R52k29J099R15J575P35J4n20j009j424j24j026
$$ -1374 -736 -1504 -736 -345 -1563 -2128 -1176 -1405 -306 609 2184 2919 2933 2413 1404 -20 -144 -1170
6733a170o64k60n33R5J52J359k66r39J626N28k662o28J91J362K252J061k66l26
$$ -1170 -1834 -2094 -2627 -2532 -2380 -1021 -1287 -2226 -600 -72 -2734 -3362 -3171 -1809 443 1504 1238 912
6715I12J617j30r41j879j466p96J299J86J585O1r47L56K449J586M27j113j352
$$ 912 2529 2399 1458 -421 -1887 -2683 -1384 -1198 387 448 -499 -143 2306 3892 4319 3206 1854
6698A854R91j651r63p63j826J581K14p39J332j09m29m48J51K271K99j585j638
$$ 1854 2845 1194 231 -532 -2358 -777 -563 -1302 30 -79 -508 -956 -805 1466 1765 180 -1458
6681a458r13J024R05J525L79J054Q69j965p98M24o59k53o22j783J494J288r29
$$ -1458 -2371 -1347 -442 1083 1462 2516 3385 1420 622 1046 387 134 -488 -2271 -777 511 -418
6664d18k086j082O07l4k95P35M67J443p06k20K461J699r97n76k48j957p44m54
$$ -418 -2504 -3586 -2979 -3013 -3308 -2573 -2106 -663 -1369 -1589 872 2571 1574 998 750 -1207 -1951 -2405
6646b405P22J316o4J348L76O09j23J58j161j541O11m10j10j81J799R40o17j204
$$ -2405 -1683 -367 -431 917 1293 1902 1779 1937 776 -765 -154 -564 -674 -855 944 1884 1267 63
6628F3O07K69j273q2n20n88k128L38K398Q48O6q64r44N33J576K68q81K85J967
$$ 63 670 939 -334 -416 -936 -1524 -3652 -3314 -916 -68 -2 -866 -1810 -1277 299 567 -314 -29 1938
6609A938K339p57j291o9l68k646k061j83J340J132j359r21K16J440L21Q63J040
$$ 1938 4277 3520 2229 2160 1792 -854 -2915 -3098 -1758 -626 -1985 -2906 -2690 -1250 -929 -66 974
6592I74k12J785n48j455j843J025L05o13k458k91J742L77J232k40J1j06j9J725
$$ 974 762 2547 1999 544 -1299 -274 31 -582 -3040 -3331 -1589 -1212 20 -220 -209 -315 -334 1391
6574A391j012j568M05l30L10K784Q14q16j346j037k406j165J17k77q4k85J409
$$ 1391 379 -1189 -784 -1114 -804 1980 2794 1978 632 -405 -2811 -3976 -3859 -4136 -4220 -4505 -3096
6557c096K118m09r11L16K644n13j984J714M07J88m55r88j640O39J91N92J701K428
$$ -3096 -978 -1387 -2298 -1982 662 149 -1835 -121 286 474 19 -969 -2609 -1970 -1779 -1187 514 2942
6539B942O62p95p92j14j426k295q93N56r81l27J138P11m39k57k086k32M67K603
$$ 2942 3604 2809 2017 1903 477 -1818 -2711 -2155 -3136 -3463 -2325 -1614 -2053 -2310 -4396 -4628 -4161 -1558
6521a558N32L00j293K96Q12J217J195j877p81k40N19j64K542J725J244N18r24
$$ -1558 -1026 -726 -2019 -1723 -911 306 1501 -376 -1157 -1397 -878 -1042 1500 3225 4469 4987 4063
6504D063l639j524J577J572r33n39j792n98J167N44J974j92j347k182o43K086
$$ 4063 424 -1100 477 2049 1116 577 -1215 -1813 -646 -102 1872 1680 333 -1849 -2492 -406
6488d06N41l45K03J374j589l39J565O74P28j107O73k058l89J204J161m96O5j42
$$ -406 135 -210 -7 1367 -222 -561 1004 1678 2406 1299 1972 -86 -475 729 1890 1394 1459 1317
6470A317q49O52J419p85k301J78j643k762j09K822K336P56N79M13M63k350O1J25
$$ 1317 468 1120 2539 1754 -547 -369 -2012 -4774 -4883 -2061 275 1031 1610 2023 2486 136 197 322
6452C22j888k094j151J166J047J122J181J45p46J58Q11N86O95j7j978k018n24
$$ 322 -1566 -3660 -4811 -3645 -2598 -1476 -295 -150 -896 -738 73 659 1354 1337 -641 -2659 -3183
6435c183o67k61O89q50J35P58L268Q13O66M96q82k635N07O00P52P56P2O1p57J278
$$ -3183 -3850 -4111 -3422 -4272 -4137 -3379 -111 702 1368 1864 982 -1653 -1146 -546 206 962 1034 1095 338 1616
6415A616p83k334j420J16J480J12m44j254q48q69J638J496m39J867q0l52m65J281
$$ 1616 833 -1501 -2921 -2805 -1325 -1213 -1657 -2911 -3759 -4628 -2990 -1494 -1933 -66 -146 -498 -963 318
6397C18P84Q07l40j637q64J71j757o29k09N57Q06p64n9J094j277j398L23O33k39
$$ 318 1102 1909 1569 -68 -932 -761 -2518 -3147 -3356 -2799 -1993 -2757 -2816 -1722 -2999 -4397 -4074 -3441 -3680
6378c680M84K178K907K21l97L66L42n67j299J18k89q90K13J466L224Q82k232k307
$$ -3680 -3196 -1018 1889 2110 1713 2079 2421 1854 555 673 384 -506 -293 1173 4397 5279 3047 740
6360G40j027j262K58n48L95k65L18J854R69k473r70q21J055J214J228J702R17
$$ 740 -287 -1549 -1291 -1839 -1444 -1709 -1391 463 1432 -1041 -2011 -2832 -1777 -563 665 2367 3284
6343C284k050j939l20J059J465p46l03J125N95p18j523j631l59Q81R8J899p12
$$ 3284 1234 -705 -1025 34 1499 753 450 1575 2170 1452 -71 -1702 -2061 -1180 -1082 817 105
6326A05k382J418Q82P89o33m40j66r5J149J535J884J114o65r04k971j715k02O37
$$ 105 -2277 -859 23 812 179 -261 -427 -522 627 2162 4046 5160 4495 3591 620 -1095 -1297 -660
6308f60m96r96O46K103p1j469j18K192L56j360q99j677P69J70O81J172J092K62
$$ -660 -1156 -2152 -1506 597 526 -943 -1061 1131 1487 127 -772 -2449 -1680 -1510 -829 343 1435 1697
6290A697L04j700r92o09P69p50N69N50o03q24P59J114K08m77m29k727j569J784
$$ 1697 2001 301 -691 -1300 -531 -1281 -712 -162 -765 -1589 -830 284 492 15 -414 -3141 -4710 -2926
6272b926K281q8q29O40n14j344P90O52j083P78K649N76q87k80l55r93q1O45n69
$$ -2926 -645 -733 -1562 -922 -1436 -2780 -1990 -1338 -2421 -1643 1006 1582 695 415 60 -933 -1014 -369 -938
6253i38J750l01o51N53N23j15l14l18J55J034k828j344m15l42K263J517l62j447
$$ -938 812 511 -140 413 936 821 507 189 344 1378 -1450 -2794 -3209 -3551 -1288 229 -133 -1580
6235a580n05k98K27J494j983j730J031N80m14j051j942J588M89K272K024M49j378
$$ -1580 -2085 -2383 -2156 -662 -2645 -4375 -3344 -2764 -3178 -4229 -6171 -4583 -4094 -1822 202 651 -727
6218g27o07N76m39J574L60j241R8J002Q57q75o69n53P27J383k20j085l182j359
$$ -727 -1334 -758 -1197 377 737 -504 -406 596 1453 578 -91 -644 83 1466 1246 161 -3021 -4380
6200d380K622J922N94K13j074p23o52r2j87j49N06O13k278n48J933O09J329m1
$$ -4380 -1758 164 758 971 -103 -826 -1478 -1570 -1757 -1906 -1400 -787 -3065 -3613 -1680 -1071 258 217
6182B17j308p70P04k529o10K892r17n53K279P80j84j29Q30r17j575J088R08K013
$$ 217 -1091 -1861 -1157 -3686 -4296 -1404 -2321 -2874 -595 185 1 -128 702 -215 -1790 -702 206 2219
6164B219K15p54j989k128n31N57Q6j052J104l70Q87R17J4J085j19M70J641L29
$$ 2219 2434 1680 -309 -2437 -2968 -2411 -2325 -3377 -2273 -2643 -1756 -839 -825 260 141 611 2252 2581
6146B581j895n58q87p01j45O49O44j201k71J194r35r48K089j460j697L81j008
$$ 2581 686 128 -759 -1460 -1605 -956 -312 -1513 -1784 -590 -1525 -2473 -384 -1844 -3541 -3160 -4168
6129d168r92M59J917J89O11J406n58j059L53K290J196j037m08j059J828k74o93
$$ -4168 -5160 -4701 -2784 -2595 -1984 -578 -1136 -2195 -1842 448 1644 607 199 -860 968 694 1
6112Ak22pP64j738J421K46p21k754l020l27K569L606J055k57N95R60k280j451
$$ 1 -221 -228 536 -1202 219 465 -256 -3010 -6030 -6357 -3788 -182 873 616 1211 2171 -109 -1560
6094a560M15j48L280Q53k689k115J53J37M44L0j334O43J55M72L51m60l63J77j
$$ -1560 -1145 -1293 1987 2840 151 -1964 -1811 -1674 -1230 -1200 -2534 -1891 -1736 -1264 -913 -1373 -1736 -1559 -1560
6075a560N56k207L78K90N46N66j36J378J198J263r22j268k134k121J511J625Q90
$$ -1560 -1004 -3211 -2833 -2543 -1997 -1431 -1567 -189 1009 2272 1350 82 -2052 -4173 -2662 -1037 -147
6058a47J899l31j298M27J39l86J962p52k003j395j3J578m42m021p65J100p02K56
$$ -147 1752 1421 123 550 689 303 2265 1513 -490 -1885 -1898 -320 -762 -4783 -5548 -4448 -5150 -4894
6040d894J284J272r95j427q01M13J365J443P0M84J021k685k122J270L021j84j644
$$ -4894 -3610 -2338 -3333 -4760 -5561 -5148 -3783 -2340 -2270 -1786 -765 -3450 -5572 -4302 -1281 -1465 -3109
6023c109K428M30l17j223j632J315N43N68k62L02j68J095r74j673q84M1J03J05
$$ -3109 -681 -251 -568 -1791 -3423 -2108 -1565 -997 -1259 -957 -1125 -30 -1004 -2677 -3561 -3520 -3417 -3312
6005c312K026J8k48j747j798J930J498J891J774j982k579p21m18k48J462J17j032
$$ -3312 -1286 -1268 -1516 -3263 -5061 -3131 -1633 258 2032 50 -2529 -3250 -3668 -3916 -2454 -2337 -3369
5988c369J193J836J634j062j68K49j85j140k333L51L19J096K005J375r46j387
$$ -3369 -2176 -340 1294 232 64 313 128 -1012 -3345 -2994 -2675 -1579 426 1801 855 -532
5972e32J588M14j810j231j227l43R77k24j281J498K597j231j798q01R23K717r57
$$ -532 1056 1470 -340 -1571 -2798 -3141 -2164 -2388 -3669 -2171 426 -805 -2603 -3404 -2481 236 -721
5955g21j877R22J182N13J575J029J219N88l726k907J082L93P42J266k40R62k23
$$ -721 -2598 -1676 -494 19 1594 2623 3842 4430 704 -2203 -1121 -728 14 1280 1040 2002 1779
5938A779j991o50j294o44n25K97J562P55P84j998j118L77J633m64n65N21qL96
$$ 1779 -212 -862 -2156 -2800 -3325 -3028 -1466 -711 73 -1925 -3043 -2666 -1033 -1497 -2062 -1541 -1549 -1153
5920a153j31j739l18M70L106j124r41N43n91J176R14j068o59j450L42K64j20j493
$$ -1153 -1284 -3023 -3341 -2871 235 -889 -1830 -1287 -1878 -702 212 -856 -1515 -2965 -2623 -2359 -2479 -3972
5902c972m44J603N8o84k00J751O87J014J96j952N4k51N01l47n88Qj621k33J863
$$ -3972 -4416 -2813 -2755 -3439 -3639 -1888 -1201 -187 9 -1943 -1889 -2140 -1639 -1986 -2574 -2566 -4187 -4420 -2557
5883b557K025m92K298N73j650l543j314J036L43M29R61j277l7J725j109j433K91
$$ -2557 -532 -1024 1274 1847 197 -3346 -4660 -3624 -3281 -2852 -1891 -3168 -3205 -1480 -2589 -4022 -3731
5866c731j793P80J200K172K910K085j651q91L51O76j378j213o37Q09j335o45p51
$$ -3731 -5524 -4744 -3544 -1372 1538 3623 1972 1081 1432 2108 730 -483 -1120 -311 -1646 -2291 -3042
5849c042K90J168J3j517p26Q03P61q38k447N79K102J228l80O04p29N97l53j020
$$ -3042 -2752 -1584 -1571 -3088 -3814 -3011 -2250 -3088 -5535 -4956 -2854 -1626 -2006 -1402 -2131 -1534 -1887 -2907
5831b907J508J998k27k115k288j269o44P62J524J166K95j28K328J861r43p97M66
$$ -2907 -1399 599 372 -1743 -4031 -5300 -5944 -5182 -3658 -2492 -2197 -2325 3 1864 921 124 590
5814E90j077l02j248m82J400R21M53j54J01k56k107o64l57m24Q45J564m46o09
$$ 590 -487 -789 -2037 -2519 -1119 -198 255 101 202 -54 -2161 -2825 -3182 -3606 -2761 -1197 -1643 -2252
5796b252J683j25j563k328o12O78j155Q39J77O54J544J841J32j211O51J464l53
$$ -2252 -569 -694 -2257 -4585 -5197 -4519 -5674 -4835 -4658 -4004 -2460 -619 -487 -1698 -1047 417 64
5779F4j649J16N84n25N28n92K47q62k43N02J185j36j461j8J251K84J73O52j050
$$ 64 -1585 -1469 -885 -1410 -882 -1474 -1227 -2089 -2332 -1830 -645 -781 -2242 -2260 -1009 -725 -552 100 -950
5760i50j623p80K390J076R79l83M37j548k123N9J289p79j018m55j15J11J079j269
$$ -950 -2573 -3353 -963 113 1092 709 1146 -402 -2525 -2466 -1177 -1956 -2974 -3429 -3544 -3433 -2354 -3623
5742c623J78R98J28M07m85M88R32R07L39j366j256N74L72n95o08J524K118Q30
$$ -3623 -3445 -2447 -2319 -1912 -2397 -1909 -977 -70 269 -1097 -2353 -1779 -1407 -2002 -2610 -1086 1032 1862
5724A862j041j354k184m17K084n9r47J20J023j251j832l30P43J015L198j36r18
$$ 1862 821 -533 -2717 -3134 -1050 -1109 -2056 -1936 -913 -2164 -3996 -4326 -3583 -2568 630 494 -424
5707d24r67P86JM64J740Q66j958J129o85n80L26p22R2M36k39j513P51N58j039
$$ -424 -1391 -605 -604 -140 1600 2466 508 1637 952 372 698 -24 68 504 265 -1248 -497 61 -978
5688i78k043n83K001Q41l64j168R11J54M87j810k597j286K379L168J968P77N6
$$ -978 -3021 -3604 -1603 -762 -1126 -2294 -1383 -1229 -742 -2552 -5149 -6435 -4056 -888 1080 1857 1913
5671A913j67O34O56J75M81j020l042j208O56O91R61J585k31j97L39j390j969Q
$$ 1913 1746 2380 3036 3211 3692 2672 -370 -1578 -922 -231 730 2315 2084 1887 2226 836 -1133 -1125
5653a125l46N13R56J426Q84L17l53q71o66o84j022k181r74J43O09M31M19K244
$$ -1125 -1471 -958 -2 1424 2308 2625 2272 1401 735 51 -971 -3152 -4126 -3983 -3374 -2943 -2524 -280
5635b80j32J159j777p18J056K32J17p7k24j364J144J475j164m72j470j87K70j11
$$ -280 -412 747 -1030 -1748 -692 -460 -343 -420 -644 -2008 -864 611 -553 -1025 -2495 -2682 -2412 -2523
5617b523K76K78K92j132j838j14L425J813r99j389m75j197J340K355n6k085k36
$$ -2523 -2247 -1969 -1677 -2809 -4647 -4761 -1336 477 -522 -1911 -2386 -3583 -2243 112 56 -2029 -2265
5600b265M96J620N92r02k573K00J935J683l29J122q82j575j941n62J545k41j399
$$ -2265 -1769 -149 443 -459 -3032 -2832 -897 786 457 1579 697 -878 -2819 -3381 -1836 -2077 -3476
5583c476L24R82J629P4n70j035l320J077J859K44o37j524l04J625K849M57j699
$$ -3476 -3152 -2170 -541 -467 -1037 -2072 -5392 -4315 -2456 -2212 -2849 -4373 -4677 -3052 -203 254 -1445
5566a445n71O71P88j30n49R79j116M44N03l74o71K3J527q82j780R56j36j855k101
$$ -1445 -2016 -1345 -557 -687 -1236 -257 -1373 -929 -426 -800 -1471 -1448 79 -803 -2583 -1627 -1763 -3618 -5719
5547e719N0J953K455j006k394j040J095R59j84J235J110P32M97j943m92Q09q80
$$ -5719 -5669 -3716 -1261 -2267 -4661 -5701 -4606 -3647 -3831 -2596 -1486 -754 -257 -2200 -2692 -1883 -2763
5530b763J349K092j672k025k335m79J314Q81J676M79Q97J080j695K48J240j795
$$ -2763 -1414 678 -994 -3019 -5354 -5833 -4519 -3638 -1962 -1483 -586 494 -1201 -953 287 -1508
5514a508l684J147K014J227k92k49p9p80j277J243L94k2J949j002p62N23J016
$$ -1508 -5192 -4045 -2031 -804 -1096 -1345 -1424 -2204 -3481 -2238 -1844 -1866 83 -919 -1681 -1158 -142
5497a42j99J099m28k43l54r70n47R39O11k215K60K454K65p19P51n84j703J093
$$ -142 -341 758 330 87 -267 -1237 -1784 -845 -234 -2449 -2189 265 530 -189 562 -22 -1725 -632
5479f32l7p00m10K55q78k26k177p93M97P97l25j1N41L17N61R7l42k43N9J595p59
$$ -632 -669 -1369 -1779 -1524 -2402 -2628 -4805 -5598 -5101 -4304 -4629 -4640 -4099 -3782 -3221 -3124 -3466 -3709 -3650 -2055 -2814
5458b814k38K481j114R95N72j405p11J332M78k088n47N7R13n62n76q12J065J465
$$ -2814 -3052 -571 -1685 -690 -118 -1523 -2234 -902 -424 -2512 -3059 -3002 -2089 -2651 -3227 -4039 -2974 -1509
5440a509J007J852J75q21P2j063L67j21R73l50j04j650r56R04J210R50l51o66
$$ -1509 -502 1350 1525 704 776 -287 80 -41 932 582 478 -1172 -2128 -1224 -14 936 585 -81
5422h1p08j091j269Q38R46k277j878K389L120K37j81l660j235J041K665J890n20
$$ -81 -789 -1880 -3149 -2311 -1365 -3642 -5520 -3131 -11 226 45 -3615 -4850 -3809 -1144 746 226
5405B26n80m33K018J447j670j383L211j530k952o22k45K95m2K0k104l038J939
$$ 226 -354 -787 1231 2678 1008 -375 2836 1306 -1646 -2268 -2513 -2218 -2260 -2240 -4344 -7382 -5443
5388e443K215M48Q55J960j89o23k99N89J176K28j471r68n08P09k9K10K45K78o40
$$ -5443 -3228 -2780 -1925 35 -154 -777 -1076 -487 689 917 -554 -1522 -2030 -1321 -1350 -1140 -895 -617 -1257
5369a257r14J737o05n17m77kQ17M65j199l01m93K04l19J018O77j060k92j14q9
$$ -1257 -2171 -434 -1039 -1556 -2033 -2035 -1218 -753 -1952 -2253 -2746 -2542 -2861 -1843 -1166 -2226 -2518 -2632 -2721
5350b721m75J098n36N69n00j619J628J465r03J20o58j52J744J105J317j021k434
$$ -2721 -3196 -2098 -2634 -2065 -2565 -4184 -2556 -1091 -1994 -1874 -2532 -2684 -940 165 1482 461 -1973
5333a973N04Q90N79m93O98N07P40J144j374l47J021j113J084j282k176J439O85
$$ -1973 -1469 -579 0 -493 205 712 1452 2596 1222 875 1896 783 1867 585 -1591 -152 533
5316E33j666L57K76J354j191R02L03j066l32r45J57q63j94Q55l89k986L83M171
$$ 533 -1133 -776 -500 854 -337 565 868 -198 -530 -1475 -1318 -2181 -2375 -1520 -1909 -4895 -4512 -341
5298c41L607r27r35j105J118L48j280j715k847J823J698J90p48j098K41N20J337
$$ -341 3266 2339 1404 299 1417 1765 485 -1230 -4077 -2254 -556 -366 -1114 -2212 -1971 -1451 -114
5281a14J298J152J075j227k431j466O19j667j831K760K501p37P74R66O8k730o56
$$ -114 1184 2336 3411 2184 -247 -1713 -1094 -2761 -4592 -1832 669 -68 706 1672 1740 -990 -1646
5264a646K36l053j121K61K351K91J602J118k150q83Q6m6J771J34m85k09M20L22
$$ -1646 -1410 -4463 -5584 -5323 -2972 -2681 -1079 39 -2111 -2994 -2908 -2954 -1183 -1049 -1534 -1743 -1323 -1001
5246a001l77j238k36L001J642j726K29k627p14J372m04k015N21K612J908q52L42
$$ -1001 -1378 -2616 -2852 149 1791 65 294 -2333 -3047 -1675 -2079 -4094 -3573 -961 947 95 437
5229D37j382q72K053n8j353q7M89j214p59O94K188j869n58J326p07r85K048N66
$$ 437 -945 -1817 236 178 -1175 -1262 -773 -1987 -2746 -2052 136 -1733 -2291 -965 -1672 -2657 -609 -43
5211d3J799K52j515n96j495l65N83j15j676n72J511J321J096r17L66p60J372k4
$$ -43 1756 2008 493 -103 -1598 -1963 -1380 -1495 -3171 -3743 -2232 -911 185 -732 -366 -1126 246 222
5193B22R10r53j438j832k788k454K484J562j8J149J219J05O49r67M74q10m66k24
$$ 222 1132 179 -1259 -3091 -5879 -8333 -5849 -4287 -4305 -3156 -1937 -1832 -1183 -2150 -1676 -2486 -2952 -3176
5175c176o7q53L63j912J685L008L686q85j577o31j698J40K377k72J657J66k303
$$ -3176 -3243 -4096 -3733 -5645 -3960 -952 2734 1849 272 -359 -2057 -1917 460 188 1845 2011 -292
5158b92k389J55M94j072j313N39J935R98n52J111J196J112n42l425j755m5n05
$$ -292 -2681 -2526 -2032 -3104 -4417 -3878 -1943 -945 -1497 -386 810 1922 1380 -2045 -3800 -3845 -4350
5141d350O7n3K647N28K62K637k932L49K81o38Q13P70p68J843m91n62j199K29N54
$$ -4350 -4283 -4336 -1689 -1161 -899 1738 -1194 -845 -564 -1202 -389 381 -387 1456 965 403 -796 -567 -13
5122a3l26l82J051k333Q13L73N57J369n54l157O17K502L77l88P69k18j671K93
$$ -13 -339 -721 330 -2003 -1190 -817 -260 1109 555 -2602 -1985 517 894 506 1275 1057 -614 -321
5104c21k17p9m0L96J281r37j132m30Q16M34q02j167j079J268J327N00M43N72k14
$$ -321 -538 -617 -657 -261 1020 83 -1049 -1479 -663 -229 -1031 -2198 -3277 -2009 -682 -182 261 833 619
5085F19j260p88j9J192Q46R0j98p70O74l30R40Q5j364j375o82p19J470J036R97
$$ 619 -641 -1429 -1448 -256 590 680 482 -288 386 56 996 1081 -283 -1658 -2340 -3059 -1589 -553 444
5066D44j057q09J567Q72r06k233j231Q4p41R58j4q08K65J646O65O35J306L25R12
$$ 444 -613 -1422 145 1017 111 -2122 -3353 -3269 -4010 -3052 -3066 -3874 -3609 -1963 -1298 -663 643 968 1880
5047A880j015J84J659J467Q99k030j140O76m56l03o45J423p55j007o61K20K557
$$ 1880 865 1049 2708 4175 5074 3044 1904 2580 2124 1821 1176 2599 1844 837 176 396 2953
5030B953k461j209j058O1J342J919n15p68k511j697N28J627Q92k77R84R31m38
$$ 2953 492 -717 -1775 -1714 -372 1547 1032 264 -2247 -3944 -3416 -1789 -897 -1174 -190 741 303
5013C03O33K15O36r61q99q77L94j254j57J075R42j892p77K81L97J60k90j02K78
$$ 303 936 1151 1787 826 -73 -950 -556 -1810 -1967 -892 50 -1842 -2619 -2338 -1941 -1781 -2071 -2173 -1895
4994a895M74J539J010j285n69j760kJ978r16QN28l09k06K86J409p95k76j67j670
$$ -1895 -1421 118 1128 -157 -726 -2486 -2488 -510 -1426 -1418 -890 -1199 -1405 -1119 290 -505 -781 -948 -2618
4975b618l83J920J967j376l67J275J3j447q42j480J8m4j839N71n88q48J850L74
$$ -2618 -3001 -1081 886 -490 -857 418 431 -1016 -1858 -3338 -3320 -3364 -5203 -4632 -5220 -6068 -4218 -3844
4957c844o80K115J031n06j538J50J560L66r83p41J567m3o18n35m32K568J832O4
$$ -3844 -4524 -2409 -1378 -1884 -3422 -3272 -1712 -1346 -2329 -3070 -1503 -1546 -2164 -2699 -3131 -563 1269 1333
4939A333J046n69Q49j510j496j770J050M15n86P08l82m71L65j050j19N94r39p69
$$ 1333 2379 1810 2659 1149 -347 -2117 -1067 -652 -1238 -530 -912 -1383 -1018 -2068 -2187 -1593 -2532 -3301
4921c301K57p97J463N05r8J362J169p28j521q26m08O65J709O41P91j951j539j04
$$ -3301 -3044 -3841 -2378 -1873 -1971 -609 560 -168 -1689 -2515 -2923 -2258 -549 92 883 -1068 -2607 -2711
4903b711K43p63M03J096R69N46P46o42j61K275o52k866m67R57J077n91q04Q67
$$ -2711 -2468 -3231 -2828 -1732 -763 -217 529 -113 -274 2001 1349 -1517 -1984 -1027 50 -541 -1345 -478
4885d78j36k451N68J01r93q10m0L66L337K486L46N34P5j024j392q62p46J347j413
$$ -478 -614 -3065 -2497 -2396 -3389 -4199 -4239 -3873 -536 1950 2296 2830 2905 1881 489 -373 -1119 228 -1185
4866a185n03K987q86j087N90J112m94j495J724k65O94j968j038j479O00K141J588
$$ -1185 -1688 1299 413 -674 -84 1028 534 -961 763 498 1192 -776 -1814 -3293 -2693 -552 1036
4849A036o01n76K45j32j713j823M84K283K706k093j301P4Q47q90K96N62n84M13
$$ 1036 435 -141 104 -28 -1741 -3564 -3080 -797 1909 -184 -1485 -1411 -564 -1454 -1158 -596 -1180 -767
4831g67O05L1R45J396O88k148K49J491j98r20k568L11k97k017J07j270j008j72
$$ -767 -162 -131 814 2210 2898 750 999 2490 2292 1372 -1196 -885 -1182 -3199 -3092 -4362 -5370 -5542
4813e542M54J636K987o71r77K94Q33J891N26j670J268k029k518n7l81K63J278
$$ -5542 -5088 -3452 -465 -1136 -2113 -1819 -986 905 1431 -239 1029 -1000 -3518 -3575 -3956 -3693 -2415
4796b415j582Q1m2j277M41J604J873k91M25j164o3K82K063O76O17j363m36j363
$$ -2415 -3997 -3916 -3958 -5235 -4794 -3190 -1317 -1608 -1183 -2347 -2410 -2128 -65 611 1228 -135 -571 -1934
4778a934n92N4L26j80j274m82M81O94J419R6j381K66m8O58J117q76K96J68J344
$$ -1934 -2526 -2472 -2146 -2326 -3600 -4082 -3601 -2907 -1488 -1392 -2773 -2507 -2555 -1897 -780 -1656 -1360 -1192 152
4759A52R02J851P22o97J696K05k760p73R3Q76M88q70j394j369k69p49N38j442
$$ 152 1054 2905 3627 2930 4626 4831 2071 1298 1391 2267 2755 1885 491 -878 -1147 -1896 -1358 -2800
4741b800l44q72J262p62j055Q93K88J223r84k10Q04K559l70j610j318L17r45K069
$$ -2800 -3144 -4016 -2754 -3516 -4571 -3678 -3390 -2167 -3151 -3361 -2557 2 -368 -1978 -3296 -2979 -3924 -1855
$$ [...]
##END NTUPLES=NMR SPECTRUM
##END=
