##TITLE=Analysis number 325355
Compound Code sb 01361
Project Code adrs
Chemist Name namiki
##JCAMPDX= 6.0         $$ Bruker NMR JCAMP-DX V2.0
##DATA TYPE= NMR SPECTRUM
##DATA CLASS= NTUPLES
##ORIGIN= Bruker BioSpin GmbH
##OWNER= nmr
$$ XWIN-NMR		Version 3.5
$$ Thu Dec 21 09:53:38 2006 GMT Standard Time (UT+0h)  MAYBRIDGE\nmr@NMR_250MHZ
##.OBSERVE FREQUENCY= 250.131544655141
##.OBSERVE NUCLEUS= ^1H
##.ACQUISITION MODE= SIMULTANEOUS (DQD)
##.ACQUISITION SCHEME= undefined
##.AVERAGES= 16
##.DIGITISER RES= 18
##SPECTROMETER/DATA SYSTEM= dpx250
##.PULSE SEQUENCE= zg30
##.SOLVENT NAME= DMSO
##.SHIFT REFERENCE= (INTERNAL, DMSO, 0, 16.522)
##AUDIT TRAIL= $$ (NUMBER, WHEN, WHO, WHERE, WHAT)
$$ ##TITLE= Audit trail, XWIN-NMR		Version 3.5
$$ ##JCAMPDX= 5.01
$$ ##ORIGIN= Bruker BioSpin GmbH
$$ ##OWNER= nmr
$$ C:\u/data/dgb/nmr/ADRS/1920/pdata/1/auditp.txt
$$ ##AUDIT TRAIL=  $$ (NUMBER, WHEN, WHO, WHERE, WHAT)
(   1,<2006-12-21 09:53:11.32 +000>,<MAYBRIDGE\nmr>,<NMR_250MHZ>,
      <created by zg, POWCHK disabled, PULCHK disabled
       configuration hash MD5:
       49 4B E0 1D 92 C2 6B 37 9F E6 65 BC 52 41 86 1D
       data hash MD5: 64K
       70 D7 9E 2F 70 0A 4E 77 53 4D 70 0B 43 F3 9F 09>)
(   2,<2006-12-21 09:53:22.46 +000>,<MAYBRIDGE\nmr>,<NMR_250MHZ>,
      <Start of raw data processing
       ef LB = 0.3 FT_mod = 6 PKNL = 1 SI = 32K 
       data hash MD5: 32K
       AD 2D 85 FA E3 F5 08 8B D6 E6 3B B0 24 D6 E2 2A>)
(   3,<2006-12-21 09:53:24.39 +000>,<MAYBRIDGE\nmr>,<NMR_250MHZ>,
      <apk 
       data hash MD5: 32K
       E1 14 B4 04 01 99 CB E0 BE 4E D8 50 02 A6 78 16>)
(   4,<2006-12-21 09:53:25.14 +000>,<MAYBRIDGE\nmr>,<NMR_250MHZ>,
      <abs ABSG = 5 
       data hash MD5: 32K
       AA EC 42 8A 6C C6 8A 93 51 7A 5C 97 61 30 85 64>)
$$ ##END=
$$ 
$$ hash MD5
$$ B9 83 C0 86 C6 30 CB 34 87 63 84 6E 76 2E 19 4C
##$RELAX= 
##$RELAX= 
##$RELAX= 
##$RELAX= 
##$RELAX= 
##$RELAX= 
##$RELAX= 
$$ Bruker specific parameters
$$ --------------------------
##$DU= <C:\u>
##$EXPNO= 1920
##$NAME= <ADRS>
##$PROCNO= 1
##$TYPE= <nmr>
##$USER= <dgb>
##$AMP= (0..31)
100 100 100 100 100 100 100 100 100 100 100 100 100 100 100 100 100 100 
100 100 100 100 100 100 100 100 100 100 100 100 100 100 
##$AQSEQ= 0
##$AQ_mod= 3
##$AUNM= <au_zg>
##$AUTOPOS= <27 >
##$BF1= 250.13
##$BF2= 250.13
##$BF3= 250.13
##$BF4= 250.13
##$BF5= 500.13
##$BF6= 500.13
##$BF7= 500.13
##$BF8= 500.13
##$BYTORDA= 1
##$CFDGTYP= 0
##$CFRGTYP= 5
##$CHEMSTR= <none>
##$CNST= (0..31)
1 1 145 1 1 1 1 1 1 1 1 1 1 1 1 1 1 1 1 1 1 1 1 1 1 1 1 1 1 1 1 1 
##$CPDPRG= <>
##$CPDPRG1= <>
##$CPDPRG2= <>
##$CPDPRG3= <>
##$CPDPRG4= <mlev>
##$CPDPRG5= <mlev>
##$CPDPRG6= <mlev>
##$CPDPRG7= <mlev>
##$CPDPRG8= <mlev>
##$CPDPRGB= <>
##$CPDPRGT= <>
##$D= (0..31)
0 1 0 0 0 0 0 0 0 0.06 0 0 0 0 0 0 0.0002 0 0 0 0 0 0 0 0 0 0 0 0 0 0 
0 
##$DATE= 1166694790
##$DBL= (0..7)
120 120 120 120 120 120 120 120 
##$DBP= (0..7)
150 150 150 150 150 150 150 150 
##$DBP07= 0
##$DBPNAM0= <>
##$DBPNAM1= <>
##$DBPNAM2= <>
##$DBPNAM3= <>
$$ [...]
##$SUBNAM7= <"">
##$SUBNAM8= <"">
##$SUBNAM9= <"">
##$SW= 20.6930455092707
##$SWIBOX= (0..15)
0 0 3 0 0 0 0 0 0 0 0 0 0 0 0 0 
##$SW_h= 5175.983436853
##$TD= 65536
##$TD0= 1
##$TE= 294.16
##$TE2= 300
##$TE3= 300
##$TEG= 300
##$TL= (0..7)
0 120 120 120 120 120 120 120 
##$TP= (0..7)
150 150 150 150 150 150 150 150 
##$TP07= 0
##$TPNAME0= <>
##$TPNAME1= <>
##$TPNAME2= <>
##$TPNAME3= <>
##$TPNAME4= <>
##$TPNAME5= <>
##$TPNAME6= <>
##$TPNAME7= <>
##$TPOAL= (0..7)
0.5 0.5 0.5 0.5 0.5 0.5 0.5 0.5 
##$TPOFFS= (0..7)
0 0 0 0 0 0 0 0 
##$TUNHIN= 0
##$TUNHOUT= 0
##$TUNXOUT= 0
##$USERA1= <user>
##$USERA2= <user>
##$USERA3= <user>
##$USERA4= <user>
##$USERA5= <user>
##$V9= 5
##$VALIST= <valist>
##$VCLIST= <CCCCCCCCCCCCCCC>
##$VD= 0
##$VDLIST= <DDDDDDDDDDDDDDD>
##$VPLIST= <PPPPPPPPPPPPPPP>
##$VTLIST= <TTTTTTTTTTTTTTT>
##$WBST= 1024
##$WBSW= 4
##$XGAIN= (0..3)
0 0 0 0 
##$XL= 0
##$YL= 0
##$YMAX_a= 414486
##$YMIN_a= -393219
##$ZGOPTNS= <>
##$ZL1= 120
##$ZL2= 120
##$ZL3= 120
##$ZL4= 120
##$ABSF1= 16.522
##$ABSF2= -4.171173
##$ABSG= 5
##$ABSL= 3
##$ALPHA= 0
##$AQORDER= 0
##$ASSFAC= 0
##$ASSFACI= 0
##$ASSFACX= 0
##$ASSWID= 0
##$AUNMP= <proc_1d>
##$AZFE= 0.1
##$AZFW= 0.1
##$BCFW= 0
##$BC_mod= 0
##$BYTORDP= 0
##$COROFFS= 0
##$CY= 12.5
##$DATMOD= 1
##$DC= 0
##$DFILT= <>
##$DTYPP= 0
##$F1P= 14.0000005364418
##$F2P= -0.99999901652339
##$FCOR= 0.5
##$FTSIZE= 32768
##$FT_mod= 6
##$GAMMA= 0
##$GB= 0
##$INTBC= 1
##$INTSCL= 1
##$ISEN= 128
##$LB= 0.3
##$LEV0= 0
##$LPBIN= 0
##$MAXI= 10000
##$MC2= 0
##$MEAN= 0
##$ME_mod= 0
##$MI= 0
##$NCOEF= 0
##$NC_proc= -4
##$NLEV= 6
##$NOISF1= 0
##$NOISF2= 0
##$NSP= 0
##$NTH_PI= 0
##$NZP= 0
##$OFFSET= 16.522
##$PC= 1
##$PHC0= 220.6273
##$PHC1= 0.8489481
##$PH_mod= 1
##$PKNL= yes
##$PPARMOD= 0
##$PSCAL= 4
##$PSIGN= 0
##$REVERSE= no
##$SF= 250.13
##$SI= 32768
##$SIGF1= 0
##$SIGF2= 0
##$SINO= 400
##$SIOLD= 32768
##$SREGLST= <1H.DMSO>
##$SSB= 0
##$STSI= 32768
##$STSR= 0
##$SW_p= 5175.98343685301
##$SYMM= 0
##$S_DEV= 0
##$TDeff= 65536
##$TDoff= 0
##$TI= <Analysis number 999999
Compound Code 99
Book Reference 9
Project Code 9>
##$TILT= no
##$TM1= 0
##$TM2= 0
##$TOPLEV= 0
##$USERP1= <user>
##$USERP2= <user>
##$USERP3= <user>
##$USERP4= <user>
##$USERP5= <user>
##$WDW= 1
##$XDIM= 32768
##$YMAX_p= 325602054
##$YMIN_p= -232256
$$ End of Bruker specific parameters
$$ ---------------------------------
##NTUPLES= NMR SPECTRUM
##VAR_NAME=  FREQUENCY,     SPECTRUM/REAL,   SPECTRUM/IMAG
##SYMBOL=    X,             R,               I
##VAR_TYPE=  INDEPENDENT,   DEPENDENT,       DEPENDENT
##VAR_FORM=  AFFN,          ASDF,            ASDF
##VAR_DIM=   32768,         32768,           32768
##UNITS=     HZ,            ARBITRARY UNITS, ARBITRARY UNITS
##FACTOR=    0.157963299565203, 1,           1
##FIRST=     4132.6476996994, 0,             0
##LAST=      -1043.33573715361, 0,           0
##MIN=       -1043.33573715361, -232256,     0
##MAX=       4132.6476996994, 325602054,     0
$$ Real data points
##PAGE= N=1
##DATA TABLE= (X++(R..R)), XYDATA
$$ [...]
15938e4238K4823j5737l5829L9966l3485j9959K9007K8186N6014K0989j7389j2828
$$ -54238 -29415 -45152 -80981 -41015 -74500 -94459 -65452 -37266 18748 39737 22348 9520
15926I520j5569k5913K4231M3961m118l4156m8478o1387J5683L4163K3039J4597
$$ 9520 -6049 -31962 -7731 36230 32112 -2044 -50522 -111909 -96226 -62063 -39024 -24427
15914b4427j7227L6807N1388j6815n0214m4199n7010j1584M8626N0461J0614K2260
$$ -24427 -41654 -4847 46541 29726 -20488 -64687 -121697 -133281 -84655 -34194 -23580 -1320
15902a320n358k0297r700k2490P374K9075K8406j520m5282n0383j2942J3587N0830
$$ -1320 -6678 -26975 -36675 -59165 -51791 -22716 5690 4170 -41112 -91495 -104437 -90850 -40020
15889d0020J0777j6079J989J6611m26J4144J8843j8323n866m1396k4340k913p366
$$ -40020 -29243 -45322 -43333 -26722 -27148 -13004 5839 -12484 -18350 -59746 -84086 -86999 -94365
15876i4365K2208J0550L1511L900J1470J3675K04k9678N442K6109m0083J5015
$$ -94365 -72157 -61607 -30096 -26196 -14726 -1051 -847 -30525 -25083 1026 -39057 -24042
15864b4042J5299k8610l0922R058J1920k575L4613K765j3504J2461K6588q074
$$ -24042 -8743 -37353 -68275 -59217 -47297 -49872 -15259 -12494 -25998 -13537 13051 4977
15852D977j8432R101J8073J5705m8163p26R553p095J5766K144k6581k2063K7020
$$ 4977 -13455 -4354 13719 29424 -18739 -19465 -9912 -17007 -1241 903 -25678 -47741 -20721
15839b0721O851o967N297k3843m0718N3318l973k7809M6152K7346p259K433j997
$$ -20721 -13870 -20837 -15540 -39383 -80101 -26783 -30756 -58565 -12413 14933 7674 10107 8110
15826H110m7124l4036K2282K1073N0976p120m8106K9999j2628j2361L0841j6426
$$ 8110 -39014 -73050 -50768 -29695 21281 14161 -33945 -3946 -16574 -28935 1906 -14520
15814a4520K2538K1311j1l8355m4177k9110L3883L4106j9889p193r492N089L348
$$ -14520 8018 29329 29318 -9037 -53214 -82324 -48441 -14335 -34224 -41417 -50909 -45820 -42472
15801d2472J7108M4467J2150M388R993m1582j8173K7409L7366l6260k8978K5322
$$ -42472 -25364 19103 31253 35641 45634 4052 -14121 13288 50654 14394 -14584 10738
15789A0738r738l4620J6417L3850q757J0303M9323q0577j2533K2821N55j5311
$$ 10738 1000 -33620 -17203 16647 7890 18193 67516 -13061 -25594 -2773 -2218 -17529
15777a7529j0074l0645k993P694j091K6524L0916J2677k0547oj6520P51L3128
$$ -17529 -27603 -58248 -61241 -53547 -54638 -28114 2802 15479 -5068 -5074 -21594 -20843 12285
15764A2285J3680n4626k3337L5569P749l9130j8052L6199K5836k2513L6163L0940
$$ 12285 25965 -28661 -51998 -16429 -8680 -47810 -65862 -29663 -3827 -26340 9823 40763
15752D0763m2654j8645R351j7281r107k5910L8415O6136l0927p3151L1669j7576
$$ 40763 -1891 -20536 -11185 -28466 -37573 -63483 -25068 41068 10141 -63010 -31341 -48917
15740d8917l4555J0458J0461k1632j9131K098k1769J0661L0975J7400q692J043
$$ -48917 -83472 -73014 -62553 -84185 -103316 -101218 -122987 -112326 -81351 -63951 -72643 -71600
15728g1600j0267J4731j4805J2210m892j7957l5932K5147M4686J9319j968J4340
$$ -71600 -81867 -67136 -81941 -69731 -74623 -92580 -128512 -103365 -58679 -39360 -41328 -26988
15716b6988Q94l432K1155N1808j3682l9824m4787N243J0293M2430j7032j5420
$$ -26988 -26094 -29526 -8371 43437 29755 -10069 -54856 -49613 -39320 3110 -13922 -29342
15704b9342j2848j1190L9169L5724k1401K474k733k5629l864n8078j6557O4181
$$ -29342 -42190 -53380 -14211 21513 112 2586 -147 -25776 -29640 -87718 -104275 -40094
15692d0094M260k0575L2770J7661k7802r331K7685l230j6640j6690k9509J6198
$$ -40094 -35834 -56409 -23639 -5978 -33780 -43111 -15426 -18656 -35296 -51986 -81495 -65297
15680f5297l2025K4539O5801j0148n492K0318j8927l4791p572p579L344m8961
$$ -65297 -97322 -72783 -6982 -17130 -22622 -2304 -21231 -56022 -63594 -71173 -67829 -116790
15668a16790j0095O8073K6987k5034j8412L6013M8633N831n5605J8909k69n8279
$$ -116790 -126885 -58812 -31825 -56859 -75271 -39258 9375 15206 -40399 -21490 -21759 -80038
15656h0038J2814M7123L4588m0205o037q28j6940L5097L3293J45J8208L8418l7423
$$ -80038 -67224 -20101 14487 -25718 -31755 -32583 -49523 -14426 18867 19012 37220 75638 38215
15643C8215l2932j0835K7977k8029j2683k006l2488l0192J5145K7606K7764l1419
$$ 38215 5283 -5552 22425 -5604 -18287 -20293 -52781 -82973 -67828 -40222 -12458 -43877
15631d3877l5816L5667K3934l8858j2054J9995j9176j627M4479K6301K2569J2255
$$ -43877 -79693 -44026 -20092 -58950 -71004 -51009 -70185 -71812 -27333 -1032 21537 33792
15619C3792L882m4172j4771K3613q13m3029l8823L9323q636o4758k7305m811Q1395
$$ 33792 37674 -6498 -21269 2344 1531 -41498 -80321 -40998 -49634 -114392 -141697 -146508 -65113
15606f5113P116K4254J0028J6558J5331l5631o8888m1764M9869O0986M0176k6009
$$ -65113 -57997 -33743 -23715 -7157 8174 -27457 -96345 -138109 -88240 -27254 12922 -13087
15594a3087k4928l1238k8417L7442J2119j4703k5924r892l7851l905J6561j1285
$$ -13087 -38015 -69253 -97670 -60228 -48109 -62812 -88736 -98628 -136479 -140384 -123823 -135108
15582a35108J9753K6811J0570j3701L8987L2649k5438R770L1853k2438q9257N610
$$ -135108 -115355 -88544 -77974 -91675 -52688 -20039 -45477 -35707 -3854 -26292 -115549 -109939
15570a09939J8564j8465K2040M1247J8531J8388j0935J1912L3666m0342n1946
$$ -109939 -91375 -109840 -87800 -46553 -28022 -9634 -20569 -8657 25009 -15333 -67279
15559f7279o520N9313K8993J7580r070r5981o4280K2091J8670J9105N264J7540
$$ -67279 -73799 -14486 14507 32087 23017 -72964 -137244 -115153 -96483 -77378 -72114 -54574
15547e4574K5438J4016j715o802l1964k6494O169J2329J0575j5214j8837K4962
$$ -54574 -29136 -15120 -16835 -23637 -55601 -82095 -75926 -63597 -53022 -68236 -87073 -62111
15535f2111j3528N980j2786K6856L3461N4586K0802J2608m1604L338m566j3837
$$ -62111 -75639 -69659 -82445 -55589 -22128 32458 53260 65868 24264 27602 23036 9199
15523I199N5562l1325o9277L286M2576M6132J0715p0256k8893p129m078K0295
$$ 9199 64761 33436 -35841 -32555 10021 56153 66868 -3388 -32281 -39410 -43488 -23193
15511b3193L8549R831q965r234o382J5344K24j8864k4052j8445J6926q236J207
$$ -23193 15356 25187 16222 6988 606 15950 16174 -2690 -26742 -45187 -28261 -36497 -35290
15498c5290M1666P722n0656m1712J8138L0139O224j186N2026J6441m3022n1295
$$ -35290 6376 14098 -36558 -78270 -60132 -29993 -23769 -24955 27071 43512 490 -50805
15486e0805j9658l0695K2431J2159k2265j3326J2449L7319K0117l93m5774k8712
$$ -50805 -70463 -101158 -78727 -66568 -88833 -102159 -89710 -52391 -32274 -32667 -78441 -107153
15474a07153J9424m98l071K7666L7807J1338M799m4534K221L142l1008r077J2876
$$ -107153 -87729 -88227 -91298 -63632 -25825 -14487 -9688 -54222 -52001 -48859 -79867 -88944 -76068
15461g6068L8143j0168m3675L843K3036O265n2255k1240O805l2125J8065O1225
$$ -76068 -37925 -48093 -91768 -87925 -64889 -58624 -110879 -132119 -125314 -157439 -139374 -78149
15449g8149M3034j1570m6353j1598j9476J8077L0227L513N1064K8844k0778k6384
$$ -78149 -35115 -46685 -93038 -104636 -124112 -106035 -75808 -72295 -21231 7613 -13165 -39549
15437c9549m3616J8689K7598L1314J7498m5406k2867k848J5780N609m428k9616
$$ -39549 -83165 -64476 -36878 -5564 11934 -33472 -56339 -59187 -43407 -37798 -42226 -71842
15425g1842J5790K3093j8413l8750j8955L1210J1199K1092L1571K7285O96o6026
$$ -71842 -56052 -32959 -51372 -90122 -109077 -77867 -66668 -45576 -14005 13280 13976 -52050
15413e2050J5383J4862k7438j9330L4480p25m239j6621J876K6312l8292N0959
$$ -52050 -36667 -21805 -49243 -68573 -34093 -34818 -39057 -55678 -53802 -27490 -65782 -14823
15401a4823N3315N3868k3151k3337L216P519N457l3473m0879j9786p86m9216n839
$$ -14823 38492 92360 69209 45872 49088 56607 62064 28591 -12288 -32074 -32860 -82076 -87915
15388h7915K2270N2914K5677q797p371k7903r4035p570N3877M7931J1594k0322
$$ -87915 -65645 -12731 12946 4149 -3222 -31125 -125160 -132730 -78853 -30922 -19328 -39650
15376c9650n4061n6212j0106M6097n366J7559N1565N0362l3865K221K9953J6981
$$ -39650 -93711 -149923 -160029 -113932 -119298 -101739 -50174 188 -33677 -31456 -1503 15478
15364A5478K6534m7220n8074k0230j0312O311N2075K7657r864J8651j1754j3399
$$ 15478 42012 -5208 -63282 -83512 -93824 -87513 -35438 -7781 -17645 1006 -10748 -24147
15352b4147l6825k2745k5878M4894N1599J2602k2198L2651M8925J1514o1123o4052
$$ -24147 -60972 -83717 -109595 -64701 -13102 -500 -22698 9953 58878 70392 9269 -54783
15340e4783k2990k4996m6783r818j8335J778K4822K0110L3738M5162p257M0424
$$ -54783 -77773 -102769 -149552 -159370 -177705 -175927 -151105 -130995 -97257 -52095 -59352 -18928
15328a8928j2147o6597m0455P385l789N4380Q4746J5683n6951j9727n152j816
$$ -18928 -31075 -97672 -138127 -130742 -134531 -80151 4595 20278 -36673 -56400 -61552 -63368
15316f3368L8227L8580N4506r901n9632j4054l5503m869j8919k4107k0240K729
$$ -63368 -25141 13439 67945 58044 -1588 -15642 -51145 -56014 -74933 -99040 -119280 -116551
15304a16551L0237L9274j2156l0926J3261K4815k8754k9373L0826K6732M495N234
$$ -116551 -86314 -47040 -59196 -90122 -76861 -52046 -80800 -110173 -79347 -52615 -48120 -42886
15292d2886j358P620j8036K789j2115q88L8717K2785m2843l3188l591N9188L9112
$$ -42886 -44244 -36624 -54660 -51871 -63986 -64874 -26157 -3372 -46215 -79403 -82994 -23806 15306
15279A5306N161l1538J0738J0374l944Q553K0032j7739m9916k6224Q461L7507
$$ 15306 20467 -11071 -333 10041 6097 14650 34682 16943 -32973 -59197 -50736 -13229
15267a3229M2175k1422J6645P026k4917n2986l976J4436k1941m5855K3138O4236
$$ -13229 28946 7524 24169 31195 6278 -46708 -50684 -36248 -58189 -104044 -80906 -16670
15255a6670K6055m260m1641L1414M0004P159j1863l4981k4746k6208K8937M4578
$$ -16670 9385 5125 -36516 -5102 34902 42061 30198 -4783 -29529 -55737 -26800 17778
15243A7778l2650j7433L1476N5216k2960k3092K4099k2191j4279L4917J0873Q224
$$ 17778 -14872 -32305 -829 54387 31427 8335 32434 10243 -4036 30881 41754 49978
15231D9978l5358J0054O742k3687m3770M608O1812l0266r3815k0454j660P6969
$$ 49978 14620 24674 31416 7729 -36041 -31433 30379 113 -93702 -114156 -115816 -38847
15219c8847N7680j7249l0937K4117L2270J3051k6465l8843J2102k0544j5566K048
$$ -38847 18833 1584 -29353 -5236 27034 40085 13620 -25223 -13121 -33665 -49231 -47183
15207d7183o296K4819n494K6072l7739J1168K5966j1132K85n4279k2489K2645
$$ -47183 -53479 -28660 -34154 -8082 -45821 -34653 -8687 -19819 -19534 -73813 -96302 -73657
15195g3657L1628k3156n067P392O6585K2056l5692p506k0233j3913J573J8176
$$ -73657 -42029 -65185 -70252 -62860 3725 25781 -9911 -17417 -37650 -51563 -49990 -31814
15183c1814L3576J5643r188k6142k9666k7961M9457r666K5026M8438k2676k1038
$$ -31814 1762 17405 8217 -17925 -47591 -75552 -26095 -35761 -10735 37703 15027 -6011
15171f011k0876r412N7560K0888j6028j9419K7313k0053k8372l2129J2756K8022
$$ -6011 -26887 -36299 21261 42149 26121 6702 34015 13962 -14410 -46539 -33783 -5761
15159e761j4411l2487K1751Q832j4968m1714k3449j6691J5760M116l4909J4849
$$ -5761 -20172 -52659 -30908 -22076 -37044 -78758 -102207 -118898 -103138 -99022 -133931 -119082
15147a19082N124k6550L5279L8562J4170O5359j9092l3709N318K1562M2929J5432
$$ -119082 -113958 -140508 -105229 -66667 -52497 12862 -6230 -39939 -34621 -13059 29870 45302
15135D5302L8119k3999l3331m5361J7288K4473m0703j9487J2194J3604J5605K679
$$ 45302 83421 59422 26091 -19270 -1982 22491 -18212 -37699 -25505 -11901 3704 6383
15123F383j9232j6463j593p945m0987m8570N5061P5955J2880l3309J6345K5833
$$ 6383 -12849 -29312 -30905 -38850 -79837 -128407 -73346 2609 15489 -17820 -1475 24358
15111B4358j6347m2929k8110J9375k6203r516J6149J94K747j9523p26K3258q268
$$ 24358 8011 -34918 -63028 -43653 -69856 -79372 -63223 -63029 -60282 -79805 -80531 -57273 -65541
15098f5541J1658o086K3926j5338O538K3557p589O006R257J8884J163j1237M679
$$ -65541 -53883 -59969 -36043 -51381 -44843 -21286 -28875 -22869 -13612 5272 6435 -4802 -123
15085a23J0960K1789O0690q078k6071l1889m0705m7730J3147J7609k6598J9058
$$ -123 10837 32626 93316 85238 59167 27278 -13427 -61157 -48010 -30401 -56999 -37941
15073c7941J1471k4394O7587l343l7523K447O864p500J7375l082j5589O505M1998
$$ -37941 -26470 -50864 16723 13380 -24143 -21696 -14832 -22332 -4957 -8039 -23628 -17123 24875
15060B4875j0982j8426Q239L3126L1349k3594p626J3696K4387k2416n0189N190
$$ 24875 13893 -4533 3706 36832 68181 44587 36961 50657 75044 52628 2439 7629
15048G629j941K536J2418j7551N1224r366L7657K5610r8537r6075k6145K1118
$$ 7629 5688 8224 20642 3091 54315 44949 82606 108216 9679 -86396 -112541 -91423
15036i1423J9248K0385j9324k7653P6676Q3304n825o584O150k5171j0864j630
$$ -91423 -72175 -51790 -71114 -98767 -22091 61213 55388 48804 54954 29783 18919 17289
15024A7289P969J8710J4120k4747N756J9309m233j4999k7045J0608j3644m4040
$$ 17289 25258 43968 58088 33341 39097 58406 54173 39174 12129 22737 9093 -34947
15012c4947k4376l2622J0807K7853k5735J7594N9492m2735L862K2080p2060j3065
$$ -34947 -59323 -91945 -81138 -53285 -79020 -61426 -1934 -44669 -40807 -18727 -90787 -103852
15000a03852J0475J1358N8231j653J0986k1634l8640k374k1332J6309O1476N4955
$$ -103852 -93377 -82019 -23788 -25441 -14455 -36089 -74729 -77103 -98435 -82126 -20650 34305
14988C4305j6348j8801r822L7700l1765k9431L2508R533O3K2806j124k4667k0872
$$ 34305 17957 -844 -10666 27034 -4731 -34162 -1654 7879 7942 30748 29624 4957 -15915
14975a5915L005k7870j2333j189k0763j5239K341K9558l5234o955L6110k97J0698
$$ -15915 -12910 -40780 -53113 -54302 -75065 -90304 -87963 -58405 -93639 -100594 -64484 -64781 -54083
14962e4083k7112K7020J5236m132j0929l4806j6097J6569J1653j1857L1234P7424
$$ -54083 -81195 -54175 -38939 -43071 -54000 -88806 -104903 -88334 -76681 -88538 -57304 20120
14950B0120J1845o3691o62M7376J5390q582j4984j962k2509m1716k439J7756K4689
$$ 20120 31965 -31726 -32388 14988 30378 21796 6812 4850 -17659 -59375 -61814 -44058 -19369
14937a9369n821j8383J4198K1122O7L154k5141K5843J0636m0496K9177j3777m3955
$$ -19369 -25190 -43573 -29375 -8253 -8186 -5032 -30173 -4330 6306 -34190 -5013 -18790 -62745
14924f2745p075k5405K2505K2399J1290m5648J1054J9996J8822P461l3691k0819
$$ -62745 -69820 -95225 -72720 -50321 -39031 -84679 -73625 -53629 -34807 -27346 -61037 -81856
14912h1856M03L840K6041O5742l3498k1602K6619p492k7865N0201K1153K9691
$$ -81856 -81453 -77613 -51572 14170 -19328 -40930 -14311 -21803 -49668 533 21686 51377
14900E1377l2763p2883N245j2630m0485K3859j6972j6397j2055J2879O0503k5203
$$ 51377 18614 -54269 -49024 -61654 -102139 -78280 -95252 -111649 -123704 -110825 -50322 -75525
14888g5525J6969O7158n224k0838J9809O468j9977M3374J6565j2049p583l9147
$$ -75525 -58556 8602 3378 -17460 2349 8817 -11160 32214 48779 36730 29147 -10000
14876a0000o7413l5476J8607M4696L6136J5961j584m046P224m039k9244J5136
$$ -10000 -77413 -112889 -94282 -49586 -13450 2511 927 -3119 4105 66 -29178 -14042
14864a4042j284Q514k2191j8444K4970O078k3804k5418M7066M023l259Q324j2123
$$ -14042 -15326 -6812 -29003 -47447 -22477 -16399 -40203 -65621 -18555 -14532 -17791 -9467 -21590
14851b1590J8601o253j8978K4036O599k4548k2471Q699m5m566l1972j6672Q326
$$ -21590 -2989 -9242 -28220 -4184 2415 -22133 -44604 -35905 -35950 -40516 -72488 -89160 -80834
14838h0834M7480J1943l1535J7502L6243K0980k0432K896P529M3384J4525k8322
$$ -80834 -33354 -21411 -52946 -35444 799 21779 1347 4243 11772 55156 69681 41359
14826D1359o8923l1544k5894N309N7000K0516n6644j3262M091O3306R909k9920
$$ 41359 -27564 -59108 -85002 -79693 -22693 -2177 -58821 -72083 -67992 -4686 5223 -24697
14814b4697M860J9972j5897m6243k5917j4666P740J2775M974K5634L8635K2155
$$ -24697 -19837 135 -15762 -62005 -87922 -102588 -94848 -82073 -77099 -51465 -12830 9325
14802I325P481j0715p110j5677l486k4042J8938J7596K034k1230M1560Q708o2564
$$ 9325 16806 6091 -1019 -16696 -20182 -44224 -25286 -7690 -5656 -26886 14674 23382 -39182
14789c9182j5186n6550j1171K0061m096N6891Q6632L3242k838o1435o5787m7567
$$ -39182 -54368 -110918 -122089 -102028 -106124 -49233 37399 70641 67803 6368 -59419 -106986
14777a06986O5545L0087k5710j4399M1078L2868j1414m3298L493K2578k5293K0391
$$ -106986 -41441 -11354 -37064 -51463 -10385 22483 11069 -32229 -28736 -6158 -31451 -11060
14765a1060j4953k8005K0259k8033n530L3624N573K4097j8084l4283J4401K6920
$$ -11060 -26013 -54018 -33759 -61792 -67322 -33698 -28125 -4028 -22112 -56395 -41994 -15074
14753a5074l8308M084N3783j9947J4999J3723Q787l412k737P537j6253l4515k8184
$$ -15074 -53382 -49298 4485 -15462 -463 13260 22047 18635 15898 23435 7182 -27333 -55517
14740e5517K9055K3459j0057K3674j278j3085n2435k3838R407N7761M848r939
$$ -55517 -26462 -3003 -13060 10614 9336 -3749 -56184 -80022 -70615 -12854 -8006 -17945
14728a7945L7422m7535l2962J6821L8110J9908M4108l3998K00l6779n8029K02
$$ -17945 19477 -28058 -61020 -44199 -6089 13819 57927 23929 24129 -12650 -70679 -70477
14716g0477K1056j1534n646k9858j4688M2523Q083k5305K9749l710k4239L245
$$ -70477 -49421 -60955 -66601 -96459 -111147 -68624 -60541 -85846 -56097 -59807 -84046 -80801
14704h0801J2182j089k1526k938k329N6864J2098r108N354O681l2384m3243m0765
$$ -80801 -68619 -69708 -91234 -94172 -96501 -39637 -27539 -36647 -31293 -24612 -56996 -100239 -141004
14691a41004N740L706M8183N858M852l1799P587K3693l0158n237P404p15j9794
$$ -141004 -135264 -131558 -83375 -77517 -72665 -104464 -96877 -73184 -103342 -108579 -101175 -101890 -121684
14678a21684L0820N6442J6328j0233M0114k9503l4974k8505O390K891M9032Q2045
$$ -121684 -90864 -34422 -18094 -28327 11787 -17716 -52690 -81195 -74805 -71914 -22882 59163
14666E9163O658m9524o3911K633l4665j1995M5709L0110J9189l4109j878J7099
$$ 59163 65821 16297 -47614 -44981 -79646 -91641 -45932 -15822 3367 -30742 -32620 -15521
14654a5521M355m1304O588J4397q497L1714M1019j036M8928N111k9202j5427J6861
$$ -15521 -11166 -52470 -45882 -31485 -39982 -8268 32751 31715 80643 85754 56552 41125 57986
14641E7986M4303O296m2970p393m8351l1274k4879j2600m6594k226Q2760P115
$$ 57986 102289 108585 65615 58222 9871 -21403 -46282 -58882 -105476 -107702 -24942 -17827
14629a7827r899J7071P96J2442r460q1107j790K7008j6077r116J6987J7746l662
$$ -17827 -27726 -10655 -9859 2583 -6877 -87984 -89774 -62766 -78843 -87959 -70972 -53226 -56888
14616e6888j7559R089P2831K7492j6756j5980J5787j7639k6957n8547J5326L4246
$$ -56888 -74447 -65358 7473 34965 18209 2229 18016 377 -26580 -85127 -69801 -35555
14604c5555J9773J6513J6240J2955l0885m7901m5175k0040L7849J8231Q335J8783
$$ -35555 -15782 731 16971 29926 -959 -48860 -94035 -114075 -76226 -57995 -49660 -30877
14592c0877j0606J7799k4170K5421j6186k6280j8460L1854P6706N554j7297k188
$$ -30877 -41483 -23684 -47854 -22433 -38619 -64899 -83359 -51505 25201 30755 13458 11270
14580A1270Q945N163l2164j6853J9546j508K917K966l5713k9225N677l2520L2374
$$ 11270 20215 25378 -6786 -23639 -4093 -5601 -2684 282 -35431 -64656 -58979 -91499 -59125
14567e9125M6293j9010n5202L870N954O1004N2097k4652l2976k2092j245M0175
$$ -59125 -12832 -31842 -87044 -83174 -77220 -16216 35881 11229 -21747 -43839 -45084 -4909
14555d909K721j08j3157l6723j4531m734j2686L3741M7262n580J5273m4683K8032
$$ -4909 -2188 -2296 -15453 -52176 -66707 -71441 -84127 -50386 -3124 -8704 6569 -38114 -10082
14542a0082J9874N6199L8352q5631m1103J2377M8596m6509k1649J9850j392l4281
$$ -10082 9792 65991 104343 18712 -22391 -10014 38582 -7927 -29576 -9726 -11118 -45399
14530d5399K103K1770k6303K1343k9508n6274J0751L8627k1317n363p122L2042
$$ -45399 -43296 -21526 -47829 -26486 -55994 -112268 -101517 -62890 -84207 -89570 -96692 -64650
14518f4650R147j0654K9079r775j9922j4351M0266M7633n589m2112q358L8347
$$ -64650 -55503 -66157 -37078 -46853 -66775 -81126 -40860 6773 1184 -40928 -49286 -10939
14506a0939Q856j0790r222J4615L8257k8430k3210P039O813n2413J239L4900L4080
$$ -10939 -2083 -12873 -22095 -7480 30777 2347 -20863 -13824 -7011 -59424 -58185 -23285 10795
14493A0795J4596n0073j9867J0272N0435M5633l4052p1902k4556j6056j3843p904
$$ 10795 25391 -24682 -44549 -34277 16158 61791 27739 -44163 -68719 -84775 -98618 -106522
14481a06522o035N3920L117j9991M8553J9798q881l3467m1703J4859J1047O3332
$$ -106522 -112557 -58637 -55520 -75511 -26958 -7160 -16041 -49508 -91211 -76352 -65305 -1973
14469a973O5178k678k8413K780K1068M034J6428l0231N123n134p69k4514j9389
$$ -1973 63205 60527 32114 34894 55962 59996 76424 46193 51316 46182 45413 20899 1510
14456A510n785j7118k4953j2918K9586j3830n3494j101J8927K4907R100K0710
$$ 1510 -4275 -21393 -46346 -59264 -29678 -43508 -97002 -98103 -79176 -54269 -45169 -24459
14444b4459k270j3231k3111m4203k1898K8789N0381O8097k7235o8066m5982N3538
$$ -24459 -26729 -39960 -63071 -107274 -129172 -100383 -50002 18095 -9140 -77206 -123188 -69650
14432f9650J9583l4014M8627l0484l0782l3770K2557L1977P1742R058n425o576
$$ -69650 -50067 -84081 -35454 -65938 -96720 -130490 -107933 -75956 -4214 4844 -581 -7157
14420g157K7282R6521P080j6532n5644o3916j9732n4299l0625r514M974J9339
$$ -7157 20125 116646 123726 107194 51550 -12366 -32098 -86397 -117022 -126536 -121562 -102223
14408a02223J3006M5027l5859m9322J8389K4292K4809M0723K5577n175l7979o0307
$$ -102223 -89217 -44190 -80049 -129371 -110982 -86690 -61881 -21158 4419 -756 -38735 -99042
14396i9042j8195K2797J8661O1590j9025j0463l2908j3560J0825J1234k0203j615
$$ -99042 -117237 -94440 -75779 -14189 -33214 -43677 -76585 -90145 -79320 -68086 -88289 -89904
14384h9904N0660Q8420k4352q8412r736k4206j690N870L4955J3154O081l7343
$$ -89904 -39244 49176 24824 -63588 -73324 -97530 -99220 -93350 -58395 -45241 -39160 -76503
14372g6503J2622N9287N982L1561R205l8517m9081n699q146o3611K1543M2862
$$ -76503 -63881 -4594 1388 32949 42154 3637 -45444 -51143 -59289 -122900 -101357 -58495
14360e8495K8081J96k033j2778j4936K9621M7477l867J2808l2006k2450L6617
$$ -58495 -30414 -30218 -32251 -45029 -59965 -30344 17133 13266 26074 -5932 -28382 8235
14348H235P532l9335j2n953l6897k349O760j2601J933M462R151m3057Q44L5504
$$ 8235 15767 -23568 -23580 -29533 -66430 -68779 -62019 -74620 -72687 -68225 -59074 -102131 -101287 -65783
14334f5783K3338J2944n1722l9443L5697L3472J9242k3947k5305J9172J9625m169
$$ -65783 -42445 -29501 -81223 -120666 -84969 -51497 -32255 -56202 -81507 -62335 -42710 -46879
14322d6879K7395K0415J5996J4435M783O507J4041m9671j4291k5313j5296k1790
$$ -46879 -19484 931 16927 31362 36145 42652 56693 7022 -7269 -32582 -47878 -69668
14310f9668J383m991K3632k4543o6175j7751M5049N8295M3838k2813o4411N596
$$ -69668 -68285 -73276 -49644 -74187 -140362 -158113 -113064 -54769 -10931 -33744 -98155 -92559
14298i2559J2730p611l6107M753L3526O4186J9769k9184r432k787K99L967Q959
$$ -92559 -79829 -87440 -123547 -118794 -85268 -21082 -1313 -30497 -39929 -42716 -42417 -38450 -29491
14285b9491N971K463J4005M987l8115r068j8316j4379p298Q3918J0721J5818J9775
$$ -29491 -23520 -21057 -7052 -2065 -40180 -49248 -67564 -81943 -89241 -5323 5398 21216 40991
14272D0991j4816m7792l2513j0459R900K3824m524O5580J6820k4163n1208j4902
$$ 40991 26175 -21617 -54130 -64589 -54689 -30865 -35389 30191 47011 22848 -28360 -43262
14260d3262J9975P3603L2781j1666m9866j4808K5086k0038j9077R423J1886n4699
$$ -43262 -23287 50316 83097 71431 21565 6757 31843 11805 -7272 2151 14037 -40662
14248d0662p1080j2426L5278N2874K6588K3520j0205m4428r000L0461m6813k6082
$$ -40662 -111742 -124168 -88890 -36016 -9428 14092 3887 -40541 -49541 -19080 -65893 -91975
14236i1975P279L0110N4948k6924j8023j9288L2478K6474Q4k5293k7822p341j3258
$$ -91975 -84696 -54586 362 -26562 -44585 -63873 -31395 -4921 -4837 -30130 -57952 -65293 -78551
14223g8551q06Q799q236n630K9590M5255J277m4422R491K4471J1717k5628J4974
$$ -78551 -79357 -70558 -78794 -84424 -54834 -9579 -8302 -52724 -43233 -18762 -7045 -32673 -17699
14210a7699l384j8034n424L8118L8006Q023j6879R741k1913j6319m8873j7343
$$ -17699 -21083 -39117 -44541 -6423 31583 39606 22727 32468 10555 -5764 -54637 -71980
14198g1980p075n900M7471L3693k9203n165j7423k9491r63K1798k3582l3124K9820
$$ -71980 -79055 -84955 -37484 -3791 -32994 -38159 -55582 -85073 -86036 -64238 -87820 -120944 -91124
14185i1124P5805m0462j8023L3940p52j5914p563m2418k3960N0966L4141o304
$$ -91124 -15319 -55781 -73804 -39864 -40616 -56530 -64093 -106511 -130471 -79505 -45364 -51668
14173e1668m849J3676J2089o612k0054n0553K8527K5354j0294k222J0280J9083
$$ -51668 -56517 -42841 -30752 -37364 -57418 -107971 -79444 -54090 -64384 -66606 -56326 -37243
14161c7243j3087J7911J3260K8745j4018M77l1079L850j7153l2968L0264K3145
$$ -37243 -50330 -32419 -19159 9586 -4432 -3955 -35034 -31184 -48337 -81305 -51041 -27896
14149b7896k3683l3290O587O709k9185l1820j7838k3991M6908N2392N8555J1782
$$ -27896 -51579 -84869 -78282 -71573 -100758 -132578 -150416 -174407 -127499 -75107 -16552 -4770
14137d770j073j7694j5737k3517k5319p108M8062K5124k3724j4847n415L8932
$$ -4770 -5843 -23537 -39274 -62791 -88110 -95218 -47156 -22032 -45756 -60603 -66018 -27086
14125b7086p536j6867J1871J3184k168m2992p97J9652J5990M1880k0725l3688
$$ -27086 -34622 -51489 -39618 -26434 -28602 -71594 -72391 -52739 -36749 5131 -15594 -49282
14113d9282L0640m4362K945P131P3509Q7183j8516o4986k1969M928n3722l3186
$$ -49282 -18642 -63004 -60059 -52928 20581 107764 89248 24262 2293 7221 -46501 -79687
14101g9687J228p856K2128L2187j095l8581L4958J3916n9673J246n2814l8848
$$ -79687 -78459 -86315 -64187 -32000 -33095 -71676 -36718 -22802 -82475 -81229 -134043 -172891
14089a72891L2385O7963M0351r424O2032j5366m3847m1760M0075M701p792J4461
$$ -172891 -140506 -72543 -32192 -41616 20416 5050 -38797 -80557 -40482 -35781 -43573 -29112
14077b9112k2395k7112P445k9575k5192j5294J6568L7925L6347q415K627L4512
$$ -29112 -51507 -78619 -71174 -100749 -125941 -141235 -124667 -86742 -50395 -58810 -56183 -21671
14065b1671r993m2869k6276J5086P5729L2409r97j7407k4149K1809r386k7019
$$ -21671 -31664 -74533 -100809 -85723 -9994 22415 21418 4011 -20138 1671 -7715 -34734
14053c4734j1090j1802m7892K7742P4700J9207m2551m0231N844L5548k7561L7342
$$ -34734 -45824 -57626 -105518 -77776 -3076 16131 -26420 -66651 -60807 -25259 -52820 -15478
14041a5478K3924l3271J7843P702p2355k9790K2454M9230K8474J311n9265n6953
$$ -15478 8446 -24825 -6982 720 -71635 -101425 -78971 -29741 -1267 44 -59221 -116174
14029a16174k9342q21N7656J3364Q433M2868J7973J3271o783k9785l4568l3607
$$ -116174 -145516 -146337 -88681 -75317 -66884 -24016 -6043 7228 445 -29340 -63908 -97515
14017i7515j4892J5551l392L4856m266R034Q9834q16j2124l785R659L8525l3315
$$ -97515 -112407 -96856 -100248 -65392 -69658 -60624 29210 28394 16270 12485 22144 60669 27354
14004B7354k9717M83O34k4017M6115j6249j5738j1315K1119O221J5795K5556l0573
$$ 27354 -2363 -1880 -1246 -25263 20852 4603 -11135 -22450 -1331 4890 20685 46241 15668
13991A5668q5246k1521j5413l2663k2709M1501J8693L2202o308k3336K5177k8966
$$ 15668 -69578 -91099 -106512 -139175 -161884 -120383 -101690 -69488 -75796 -99132 -73955 -102921
13979a02921N233Q65M7662N3353l5166j7352n1909l2905K9738J0818n053m2044
$$ -102921 -97688 -96823 -49161 4192 -30974 -48326 -100235 -133140 -103402 -92584 -97637 -139681
13967a39681M5420Q7984p670K2388K2699l9061l4053j0173J6050j0156j6954M369
$$ -139681 -94261 -6277 -13947 8441 31140 -7921 -41974 -52147 -36097 -46253 -63207 -58838
13955e8838m9758M9045L9580L2641n0212n1393J4210R093n613M6462M1985R27
$$ -58838 -108596 -59551 -19971 12670 -37542 -88935 -74725 -65632 -71245 -24783 17202 18129
13943A8129n0615j0965N5234l1507l5282J4767J4546k4776m208J7853O084j3089
$$ 18129 -32486 -43451 11783 -19724 -55006 -40239 -25693 -50469 -54677 -36824 -30740 -43829
13931d3829N745k0095J0631Q956r666L0863m2056l0231L2938J1831j7527j1067
$$ -43829 -38084 -58179 -47548 -38592 -48258 -17395 -59451 -89682 -56744 -44913 -62440 -73507
13919g3507k4935m22M865j7470q747k5740O749Q983L9575K91p559J2634P633j2677
$$ -73507 -98442 -98864 -93999 -111469 -120216 -145956 -139207 -130224 -90649 -90358 -97917 -85283 -77650 -90327
13905i0327J0753K5056L8115J1330J3114k0464m2939j2646K8696L6788o229j8212
$$ -90327 -79574 -54518 -16403 -5073 8041 -12423 -55362 -68008 -39312 -2524 -8753 -26965
13893b6965K9996p867j7793M540L0455K5637l2583k4889l2608j5501J3134k8854
$$ -26965 3031 -4836 -22629 -18089 12366 38003 5420 -19469 -52077 -67578 -54444 -83298
13881h3298J2295J3977o162K7832J0597l7252k5048K4055J3408l973J0973P714
$$ -83298 -71003 -57026 -63188 -35356 -24759 -62011 -87059 -63004 -49596 -53569 -42596 -34882
13869c4882K5615R587j2075J8535l0949l5124r424O1304k0261j1388J4880l6097
$$ -34882 -9267 320 -11755 6780 -24169 -59293 -68717 -7413 -27674 -39062 -24182 -60279
13857f0279K7294M177J7096o465j04k628O990k6542j4166p525l0736K6536J5231
$$ -60279 -32985 -28808 -11712 -18177 -18281 -20909 -13919 -40461 -54627 -62152 -92888 -66352 -51121
13844e1121n1443k9621j3265L6534K4075m099r572M257J9427N634j400M0063L8311
$$ -51121 -102564 -132185 -145450 -108916 -84841 -88940 -98512 -94255 -74828 -69194 -70594 -30531 7780
13831G780m839k4612n179m1860J3735K9227R574k2211J7734Q314L8752J8949m289
$$ 7780 2941 -21671 -26850 -68710 -54975 -25748 -16174 -38385 -20651 -12337 26415 45364 41075
13818D1075n9326k4595l152l3051J402J7218M7775M1484m136r671m5532J6690
$$ 41075 -18251 -42846 -45998 -79049 -77647 -60429 -12654 28830 24694 15023 -30509 -13819
13806a3819L2569j19J6667m3378J1720k0830n425k0013P330m833k3379j0440l2127
$$ -13819 18750 18631 35298 -8080 3640 -17190 -22615 -42628 -35298 -40131 -63510 -73950 -106077
13793a06077m4756j5055M2260M6992K7713L3561J935L0454M4577j4354l2947j3408
$$ -106077 -150833 -165888 -123628 -76636 -48923 -15362 -13427 17027 61604 47250 14303 895
13781H95k0275n3797O725M4979K7345k2390k4110J7439N0953j1254m7723J62k2917
$$ 895 -19380 -73177 -66452 -21473 5872 -16518 -40628 -23189 27764 16510 -31213 -31051 -53968
13768e3968l0072P618r108M8085M8565j3271j0870k1241k2677l8307m4741J9977
$$ -53968 -84040 -76422 -85530 -37445 11120 -2151 -13021 -34262 -56939 -95246 -139987 -120010
13756a20010L787K0550L6906M4608l8453N6210M1916l0291k0252n0743j2414r141
$$ -120010 -116223 -95673 -58767 -14159 -52612 3598 45514 15223 -5029 -55772 -68186 -77327
13744g7327J5454j687m1038q986Q0713K5746l1409J9005n67n1301k9545K8508
$$ -77327 -61873 -63560 -104598 -113584 -32871 -7125 -38534 -19529 -20096 -71397 -100942 -72434
13732g2434O082j4791k4058K7035L0290k8032J8506K2320J0918p581J4031l1258
$$ -72434 -66352 -81143 -105201 -78166 -47876 -75908 -57402 -35082 -24164 -31745 -17714 -48972
13720d8972j9404K0780K0980M854k079K473K3520k0877J0344j519j9881j8360
$$ -48972 -68376 -47596 -26616 -21762 -23841 -21368 2152 -18725 -8381 -9900 -29781 -48141
13708d8141l1991L3126K0203n1759l8516K3921J6616L3087J1390K9031p589m3460
$$ -48141 -80132 -47006 -26803 -78562 -117078 -93157 -76541 -43454 -32064 -3033 -10622 -54082
13696e4082J4494J0967J2229n6506J5606M3474j7815l3805J1400q300P677N462
$$ -54082 -39588 -28621 -16392 -72898 -57292 -13818 -31633 -65438 -54038 -62338 -54661 -49199
13684d9199L7768J0734m2682k2169o264m7525O170Q2846R569n3544l6905O4939
$$ -49199 -11431 -697 -43379 -65548 -71812 -119337 -113167 -30321 -20752 -74296 -111201 -46262
13672d6262J7005J9245j0542m3861k0769k5830R593R1132J8667l3232k1705p2987
$$ -46262 -29257 -10012 -20554 -64415 -85184 -111014 -101421 -10289 8378 -24854 -46559 -119546
13660a19546n075L1437M501o887m241l9463L8488N2689J2595L2780k880m808l4873
$$ -119546 -124621 -93184 -88683 -95570 -99811 -139274 -100786 -48097 -35502 -2722 -5602 -10410 -45283
13647d5283j2257N907o519j7677n3096l1373K7718M4647J2279L7388K4673k3568
$$ -45283 -57540 -51633 -58152 -75829 -128925 -160298 -132580 -87933 -75654 -38266 -13593 -37161
13635c7161l1805O528N0634l3696k9272K4483l9002k9504J00L6734l0845l5542
$$ -37161 -68966 -62438 -11804 -45500 -74772 -50289 -89291 -118795 -118695 -81961 -112806 -148348
13623a48348K8272M5933P0246M9246m9276L369l827J606L5671L0901l4521j7968
$$ -148348 -120076 -74143 -3897 45349 -3927 -558 -4385 -2779 32892 63793 29272 11304
13611A1304L452l2075j4458n933K3931j4806q090M3657m5585J1975J1534j1984
$$ 11304 14756 -17319 -31777 -37710 -13779 -28585 -36675 6982 -38603 -26628 -15094 -27078
13599b7078Q558L8011J6323K5886k7223p503M400o562k5033l6445l671o3743j3840
$$ -27078 -18520 19491 35814 61700 34477 26974 31374 24812 -221 -36666 -40337 -104080 -117920
13586a17920L0603Q335O4300L4889n0274l2653J2446K8716k0434k3829L631L2417
$$ -117920 -87317 -78982 -14682 20207 -30067 -62720 -50274 -21558 -41992 -65821 -62190 -29773
13574b9773k813j9610l1428K5199J9569k1484J6494Q570k2280k5486L2247m8473
$$ -29773 -32586 -52196 -83624 -58425 -38856 -60340 -43846 -35276 -57556 -83042 -50795 -99268
13562i9268l361k261j6548N515L7545Q91Q867M5667O18k5583j0422m7472m0312
$$ -99268 -102629 -104890 -121438 -115923 -78378 -77487 -68620 -22953 -22335 -47918 -58340 -105812 -146124
13549a46124L9413K6272J4602J2864J7788K9060N9566l26l8650n1402K0155q936
$$ -146124 -106711 -80439 -65837 -52973 -35185 -6125 53441 53115 14465 -36937 -16782 -25718
13537b5718O592K5778p580j4596n6636J2115M7900L2564o137n1023L306L0362
$$ -25718 -19126 6652 -928 -15524 -72160 -60045 -12145 20419 14282 -36741 -33435 -3073
13525c073j756K7783k7499J0693R330o8044O61j206K560J102l2044k9631K7403
$$ -3073 -4829 22954 -4545 6148 15478 -52566 -51905 -53111 -50551 -49449 -81493 -111124 -83721
13512h3721L5677J0569M2027N942n4478N656L7672J9574M566j2208l5914m5711
$$ -83721 -48044 -37475 4552 10494 -43984 -38328 -656 18918 23484 11276 -24638 -70349
13500g0349K9594n222J1655l0944q0M4747L0734J5489p267L2913m2201p3674k9772
$$ -70349 -40755 -45977 -34322 -65266 -65346 -20599 10135 25624 18357 51270 9069 -64605 -94377
13487i4377K5550K9648N2860J8977Q50K8992k2422m5551o4385k1196J0208K1337
$$ -94377 -68827 -39179 13681 32658 33508 62500 40078 -5473 -69858 -91054 -80846 -59509
13475e9509L5680M3186k9359m3682j656k5656J3647J9087m1958j1100M6809L3788
$$ -59509 -23829 19357 -10002 -53684 -55340 -80996 -67349 -48262 -90220 -101320 -54511 -20723
13463b0723L2726K7856p3381m0471L1296K0770l4291k6802L2048J5210o128J4093
$$ -20723 12003 39859 -33522 -73993 -42697 -21927 -56218 -83020 -50972 -35762 -41890 -27797
13451b7797j7105q85J1550L7935K7950k4617l4869L7795m4579j7189K8095l0655
$$ -27797 -44902 -45787 -34237 3698 31648 7031 -27838 9957 -34622 -51811 -23716 -54371
13439e4371p6742r186Q2237M0317R021j1677R947j7329l967l4417J7241K6734
$$ -54371 -131113 -140299 -58062 -17745 -8724 -20401 -10454 -27783 -31750 -66167 -48926 -22192
13427b2192l032l810L4803l8432n1017n2023M161O4346p47j2421j416K6304L6842
$$ -22192 -25224 -29034 5769 -32663 -83680 -135703 -131542 -67196 -67943 -80364 -81780 -55476 -18634
13414a8634j8984n529k2530O1725j3m2557K7617O036m6891n7326J6354N7558N4800
$$ -18634 -37618 -43147 -65677 -3952 -3965 -46522 -18905 -12869 -59760 -117086 -100732 -43174 11626
13401A1626k883l9591m0522j4669o508K5341K491N171N4512N1965J4486N099m2783
$$ 11626 8743 -30848 -71370 -86039 -92547 -67206 -64715 -59544 -5032 46933 61419 66518 23735
13388B3735j8678k3263m2643m3009k3345j2926P188J7866P760L9204K0753O204
$$ 23735 5057 -18206 -60849 -103858 -127203 -140129 -132941 -115075 -107315 -68111 -47358 -41154
13376d1154j8613k9776K5448L5422n055j1918m7368k4273n977K7338K1281K7828
$$ -41154 -59767 -89543 -64095 -28673 -33728 -45646 -93014 -117287 -123264 -95926 -74645 -46817
13364d6817J7994K3443j7588m9428J7148J2028j620J5885N181M5193P204l79n5897
$$ -46817 -28823 -5380 -22968 -72396 -55248 -43220 -44840 -28955 -23774 21419 28623 28244 -27653
13351b7653j8984n4418k324J1120K0812M4601j1949j9451l7865j5095R134K9735
$$ -27653 -46637 -101055 -103379 -92259 -71447 -26846 -38795 -58246 -96111 -111206 -102072 -72337
13339g2337R989q163R378j5471k3797j6555M7290J4380k358K3115J1016p931k735
$$ -72337 -62348 -70511 -61133 -76604 -100401 -116956 -69666 -55286 -57644 -34529 -23513 -31444 -34179
13326c4179l633j8569j3351K9862q292l4630j541L3525l835l0679j2603L0592
$$ -34179 -37812 -56381 -69732 -39870 -48162 -82792 -84333 -50808 -54643 -85322 -97925 -67333
13314f7333N2889O586j0882l030N7060O9766J1336p379n4546K581P743q877L0314
$$ -67333 -14444 -7858 -18740 -21770 35290 105056 116392 109013 54467 57048 64791 55914 86228
13301H6228R947j1429n9117l3956m96k3512J4336P2805M1676o4197k8552k9992
$$ 86228 96175 84746 25629 -8327 -8823 -32335 -17999 54806 96482 32285 3733 -26259
13289b6259L5379k7098K9014r770O567M945m5082R211m091Q708J2440L9969J0524
$$ -26259 9120 -17978 11036 1266 7833 12778 -32304 -23093 -27184 -18476 -6036 33933 44457
13276D4457m7649n6206N5N3618J3632k843j2203l3725j7529J3405k8443k2756
$$ 44457 -3192 -59398 -59343 -5725 7907 5064 -7139 -40864 -58393 -44988 -73431 -96187
13264i6187M0030K8468j6035K3267J9184J5213k4353k7656k4035j2514O2209L9936
$$ -96187 -56157 -27689 -43724 -20457 -1273 13940 -10413 -38069 -62104 -74618 -12409 27527
13252B7527l3695o2200n9489J4716L3080p013k9062j2932p290K4508N6087J331
$$ 27527 -6168 -68368 -127857 -113141 -80061 -87074 -116136 -129068 -136358 -111850 -55763 -54432
13240e4432j7340Q370P341M137J9356M0920L3581J0220n4714j4088K2469N164
$$ -54432 -71772 -63402 -56061 -51924 -32568 8352 41933 52153 -2561 -16649 5820 10984
13228A0984J8160M407k3680n3137n394J2503J8796j2248J2619m6116j9237j7399
$$ 10984 29144 33551 9871 -43266 -48660 -36157 -17361 -29609 -16990 -63106 -82343 -99742
13216i9742M9334J5543k2969J7906N3782j8699L6222l6947k1040K3682k4964q605
$$ -99742 -50408 -34865 -57834 -39928 13854 -4845 31377 -5570 -26610 -2928 -27892 -36497
13204c6497n8887k8918O0959M2370J8101J2765K461L901r825l7618J1638l250
$$ -36497 -95384 -124302 -63343 -20973 -2872 9893 12354 16255 6430 -31188 -19550 -22800
13192b2800m0010p228J2697L0913j6902j2686Q635j259K9227j2063q199j3314
$$ -22800 -62810 -70038 -57341 -26428 -43330 -56016 -47381 -48640 -19413 -31476 -39675 -52989
13180e2989J4508K5598L7612K704l4390L028L4693l836J2736j9144m9027p9K6190
$$ -52989 -38481 -12883 24729 27433 -6957 -3929 30764 26928 39664 20520 -28507 -28586 -2396
13167b396o454M9004K7370J8194m5040l9551M145m4745L277J9174N2344J1964
$$ -2396 -8850 40154 67524 85718 40678 1127 5272 -39473 -36196 -17022 35322 47286
13155D7286m422r369k4477j2327k1928j9343K3805K5622m0064L0932O6450J1705
$$ 47286 42864 33495 9018 -3309 -25237 -44580 -20775 4847 -35217 -4285 62165 73870
13143G3870n8316k0312J6450j383k6022k1513j3247m7474J0748R7517K7159l1514
$$ 73870 15554 -4758 11692 10309 -15713 -37226 -50473 -97947 -87199 10318 37477 5963
13131E963J2676l5386o5136o975M759M1189J7388J474n1841o0824M9540L3592
$$ 5963 18639 -16747 -81883 -88858 -84099 -42910 -25522 -24048 -75889 -136713 -87173 -53581
13119e3581J7155L9592J0094m436m534k6327j5184n360l9197J0920Q6151M4965
$$ -53581 -36426 3166 13260 8824 4290 -22037 -37221 -42581 -81778 -70858 15293 60258
13107F0258k6350m5097K9093P231m7325m121K0432k8585k156L6769q053K8610
$$ 60258 33908 -11189 17904 25135 -22190 -26311 -5879 -34464 -36620 149 -7904 20706
13095B0706J4355p840n6341l1074q824M371q263L3872k978o251Q761L9520J3935
$$ 20706 35061 27221 -29120 -60194 -69018 -64647 -72910 -39038 -42016 -48267 -39506 14 13949
13082A3949J9795p417j2794j9757L0007l0438K0934K0778O447j2926N916K1946
$$ 13949 33744 26327 13533 -6224 23783 -6655 14279 35057 41504 28578 34494 56440
13070E6440l2280n9111l5138q216O045M5030L417J3902O575o205j9398j6741l7923
$$ 56440 24160 -34951 -70089 -78305 -72260 -27230 -23813 -9911 -3336 -9541 -28939 -45680 -83603
13057h3603J3002J6378k684L7522J1111m8364n3624M0163K9325J2491Q145j617
$$ -83603 -70601 -54223 -56907 -19385 -8274 -56638 -110262 -70099 -40774 -28283 -20138 -21755
13045b1755Q969O806N6728R615k2247n338m1047k2878N349J4983J3565n6103l6911
$$ -21755 -12786 -5980 50748 60363 38116 32778 -8269 -31147 -25798 -10815 2750 -53353 -90264
13032i0264L8445M8091M3701k4341n5381m4179K6223N3996k3470j9571q734k8477
$$ -90264 -51819 -3728 39973 15632 -39749 -83928 -57705 -3709 -27179 -46750 -55484 -83961
13020h3961Q885L4883L7186k8098j1705N048L3548M4007j7583p894k0334l626
$$ -83961 -75076 -40193 -3007 -31105 -42810 -37762 -4214 39793 22210 14316 -6018 -9644
13008i644J5387L9257j7001k0843j6038j1765m310J4749N907K7396L6130L6666
$$ -9644 5743 45000 27999 7156 -8882 -20647 -24957 -10208 -4301 23095 59225 95891
12996I5891m2775k934l8706K2937m051k6770J2688J8971K5863j7123k5735l2359
$$ 95891 53116 50182 11476 34413 30362 3592 16280 35251 61114 43991 18256 -14103
12984a4103k3950K0446J304J6117j0027l5244j7492J8382M763P825k6802m4510
$$ -14103 -38053 -17607 -16303 -186 -10213 -45457 -62949 -44567 -39804 -31979 -58781 -103291
12972a03291K0111N5606L0338J9922J3659l727K777p0148j127K4934k969k907
$$ -103291 -83180 -27574 2764 22686 36345 32618 35395 -34753 -35880 -10946 -13915 -16822
12960a6822j524k680J1976p860j1264R227J191k899m1328k3094M9427m6579K8841
$$ -16822 -18346 -21026 -9050 -16910 -28174 -18947 -17756 -20655 -61983 -85077 -35650 -82229 -53388
12947e3388P0122P364l3042k3512J8306L3356k3885k8353P450j612K9767L2803
$$ -53388 16734 24098 -8944 -32456 -14150 19206 -4679 -33032 -25582 -27194 2573 35376
12935C5376n9500m2838j4640J6055p557J8102Q36J1504K9426N041M1060k5662
$$ 35376 -24124 -66962 -81602 -65547 -73104 -55002 -54166 -42662 -13236 -8195 32865 7203
12923G203j14609j9242L9934M2975K22l7272K6256j6258k8906J0808N7829M2252
$$ 7203 -107406 -126648 -86714 -43739 -43517 -80789 -54533 -70791 -99697 -88889 -31060 11192
12911A1192K3505j3688n724K2273K9924l9264j4466K143j7172k0442M1652M6877
$$ 11192 34697 21009 15285 37558 67482 28218 13752 15895 -1277 -21719 19933 66810
12899F6810m8128o7870J5250j7710J3561L9558m1244k7976J1949L9218J1208j3449
$$ 66810 18682 -49188 -33938 -51648 -38087 1471 -39773 -67749 -55800 -16582 -5374 -18823
12887a8823J5591M1789K1994q404q096j3452j4788k7394k0975N6855K6096k6029
$$ -18823 -3232 38557 60551 52147 44051 30599 15811 -11583 -32558 24297 50393 24364
12875B4364l2117M7473K2161J801k0720k6492k4128m829J1929l9734l9855n2198
$$ 24364 -7753 39720 61881 63682 42962 16470 -7658 -12487 -558 -40292 -80147 -132345
12863a32345L1592R8969O0117o4338l6893K6946P40q770K2270l3344m2192L3202
$$ -132345 -100753 -1784 58333 -6005 -42898 -15952 -15212 -23982 -1712 -35056 -77248 -44046
12851d4046J8303O325L3164M384L928j6946m1956l684K0263K4378L405j1356k095
$$ -44046 -25743 -19418 13746 18130 22058 5112 -36844 -40528 -20265 4113 7518 -3838 -5933
12838e933J2029o974L9991k1891j7547L2301n6885Q002K6172J4672l553P683o26
$$ -5933 6096 -878 39113 17222 -325 31976 -24909 -16907 9265 23937 20384 28067 27441
12825B7441k729m4706l4460K0496K659q948j985J8867N4876J2575j9745n959j2112
$$ 27441 24712 -19994 -54454 -33958 -31299 -40247 -42232 -23365 31511 44086 24341 18382 6270
12812F270Q337L3218o815k1004P953j0206N712J7455l0390o0504l962K3839k583
$$ 6270 14607 47825 41010 20006 27959 17753 23465 40920 10530 -49974 -53936 -30097 -32680
12799c2680q083K5687L1834k6400P847L831K7374L546j8145k5274M6032M6148
$$ -32680 -40763 -15076 16758 -9642 -1795 2036 29410 32956 14811 -10463 35569 81717
12787H1717o4742l0132j016J7018l1487o006L3094O948l3571n367J5606J8607
$$ 81717 16975 -13157 -14173 2845 -28642 -34648 -1554 5394 -28177 -33544 -17938 669
12775F69k9966J2319K4168Q576M1337L0511n097k7742J9607l1495j0164l4888
$$ 669 -29297 -16978 7190 15766 57103 87614 82517 54775 74382 42887 32723 -2165
12763b165m4800J414L2598L9495M0741L4343K6278n1779n2422K0631N454m7754
$$ -2165 -46965 -45551 -12953 26542 67283 101626 127904 76125 23703 44334 49788 2034
12751B034K2089L3545L2682K4883n5551n7817M7496K2740k6871k4617m526k8779
$$ 2034 24123 57668 90350 115233 59682 1865 49361 72101 45230 20613 16087 -12692
12739a2692M4860K6292j2294j6381n380m7197l4171o611O5088M0039j9231k6566
$$ -12692 32168 58460 46166 29785 24405 -22792 -56963 -63574 1514 41553 22322 -4244
12727d244k284M8785J053j5657n4447L6763N4486k4639k0572k5853m1811K7656
$$ -4244 -6528 42257 43310 27653 -26794 9969 64455 39816 19244 -6609 -48420 -20764
12715b0764P931j63n2868o0r783M5961M8765l7269j3176M3935K5892j9561j593
$$ -20764 -12833 -12996 -65864 -65924 -75707 -29746 19019 -18250 -31426 12509 38401 18840 17247
12702A7247k516J5463N3555K3277k9993l8232k6676k497J5181J7571k3795j6258
$$ 17247 14731 30194 83749 107026 77033 38801 12125 9628 24809 42380 18585 2327
12690B327L43J3078M237l4549j1034M0102M9722k5629q4799k1600m3634L1637
$$ 2327 2670 15748 19985 -14564 -25598 14504 64226 38597 -46202 -67802 -111436 -79799
12678g9799M8575M0609J7348j8556j7434L697J8829P511n0192k2698Q9613N3637
$$ -79799 -31224 9385 26733 8177 -9257 -5560 13269 20780 -29412 -52110 37503 91140
12666I1140m471l1809k3641n0436j9948j4266L8182P6891R479l3552K4513L3401
$$ 91140 86669 54860 31219 -19217 -39165 -53431 -15249 61642 71121 37569 62082 95483
12654I5483k3985L7618k560j9684m3061j3551k2959m4117l8143L3528J1113j8560
$$ 95483 71498 109116 106556 86872 43811 30260 7301 -36816 -74959 -41431 -30318 -48878
12642d8878O1430K9724j518k8763N582K5913m009K131j996j1114k3554j9917L5887
$$ -48878 12552 42276 40758 11995 17577 43490 39481 41612 39616 28502 4948 -14969 20918
12629B0918m851K2945J4618l7812j5761L5127J2767m090k3009K7117K7831l3857
$$ 20918 16067 39012 53630 15818 57 35184 47951 43861 20852 47969 75800 41943
12617D1943k6708L2831J2835L2893j6784j8115q6k1947K6771O2204J1579k063
$$ 41943 15235 48066 60901 93794 77010 58895 58809 36862 63633 125837 137416 135353
12605A35353j4162L165m9489l5230j2427j0024j6259J8837J3376J4286L0490K3312
$$ 135353 121191 124356 74867 39637 27210 17186 927 19764 33140 47426 77916 101228
12593A01228J6526m9268m5396J0418N434K5293J9232l5040l7477N8290R517l2942
$$ 101228 117754 68486 23090 33508 38942 64235 83467 48427 10950 69240 78757 45815
12581D5815j1302j4229k248J4659N7101J2881j2694k0371M9503P82j8103J7532
$$ 45815 34513 20284 18036 32695 89796 102677 89983 69612 119115 119897 101794 119326
12569A19326j3032J3515Q395k2855k5370j6236Q189O885l4558j1392k4783k0541
$$ 119326 106294 119809 128204 105349 79979 63743 71932 78817 44259 32867 8084 -12457
12557a2457J368L0825J9991j1784J6401O0901K2073m5530j7430K6691K7438J620
$$ -12457 -11089 19736 39727 27943 44344 105245 127318 81788 64358 91049 118487 120107
12545A20107k5456m4024p3712l6732K6518J4022M8852M6262j0290j9637n098N4374
$$ 120107 94651 50627 -23085 -59817 -33299 -19277 29575 75837 65547 45910 40812 95186
12533I5186O5339l8179m5061j24K8721K1869J627K8284N9051J3237q300r622k4759
$$ 95186 160525 122346 77285 77161 105882 127751 129378 157662 216713 229950 221650 212028 187269
12520A87269K3061l8489j7106M2757K0230k4073l2643K963J2227m050m7418l6930
$$ 187269 210330 171841 154735 197492 217722 193649 161006 163969 176196 172146 124728 87798
12508H7798K5024J5516J00p5201p7918J4129O3917L6655j1421j1611r592Q520
$$ 87798 112822 128338 128438 53237 -24681 -10552 53365 90020 78599 66988 57396 65916
12496F5916O1682L5639J785J8285L871l4362m1210n978J312J7543j4896l5023
$$ 65916 127598 163237 165022 183307 187178 152816 111606 105628 106940 124483 109587 74564
12484G4564M9971L6638J6906l4051k5669j1916n20N776J7942j8868l8515R386
$$ 74564 124535 161173 178079 144028 118359 106443 105923 111699 129641 110773 72258 81644
12472H1644K3691j9672N631K7195k4107l2782L5835J3773K1868o4673l2744j3981
$$ 81644 105335 85663 91294 118489 94382 61600 97435 111208 133076 68403 35659 21678
12460B1678P312M3764K2647J6392k2728m0944k3601M5410M0421R013J6499l9327
$$ 21678 28990 72754 95401 111793 89065 48121 24520 69930 110351 119364 135863 96536
12448I6536m2448L5653L0751L0563o839J7480K0220j3390m6081l0975k3937M1727
$$ 96536 54088 89741 120492 151055 144216 161696 181916 168526 122445 91470 67533 109260
12436A09260L5871K7650L2349Q305l9428k6145K8750j0443K8412j261J1870m22
$$ 109260 145131 172781 205130 213435 174007 147862 176612 166169 194581 193320 205190 204768
12424B04768k7524o1095m432k2678k6073J5707K4498l166p192R899N07P007L9107
$$ 204768 177244 116149 111717 89039 62966 78673 103171 100005 92813 102712 103219 110226 149333
12411A49333L46K5269n614k3111Q494J7742m2194q175j0955M983M423N376K7925
$$ 149333 149679 174948 169334 146223 154717 172459 130265 122090 111135 116118 120541 125917 153842
12398A53842R806J8054J9858k4519J5841O720m1514N5147J2735j6232J1412k9551
$$ 153842 163648 181702 201560 177041 192882 199602 158088 213235 225970 209738 221150 191599
12386A91599Q783K1552n503j9279j4180N1367l1284o2058j201J499L7888K5497
$$ 191599 200382 221934 216431 197152 182972 234339 203055 140997 139796 141295 179183 204680
12374B04680K6669l720n720n727j1141K742n059K450m0131J8433L3708R672k1825
$$ 204680 231349 227629 221909 216182 205041 207783 202724 205174 165043 183476 217184 226856 205031
12361B05031K3769J7931L222K1418p763l3102k2698K7489n536k760q322j6862
$$ 205031 228800 246731 249953 271371 263608 230506 207808 235297 229761 227001 218679 201817
12349B01817j1112k7315K3801j4047J2326M4795K6399M5942J6639j1979R940l5110
$$ 201817 190705 163390 187191 173144 185470 230265 256664 302606 319245 307266 317206 282096
12337B82096J1110K3375J632j0387l7620j9238r220L1364M9176K964p1886l2633
$$ 282096 293206 316581 318213 307826 270206 250968 241748 273112 322288 325252 253366 220733
12325B20733L9575M3432J1112p952k5668m358r76k8657r757k775L4003L2386K4475
$$ 220733 260308 303740 314852 306900 281232 276874 275898 247241 237484 234709 268712 301098 325573
12312C25573l5692l0742O674K9710J9585K4439J3308J1382k0016k4933k4258O421
$$ 325573 289881 259139 265813 295523 315108 339547 352855 364237 344221 319288 295030 301451
12300C01451P952J4719M697l4640J7973l6702l3711k5676q664N6433K8851n4249
$$ 301451 309403 324122 328819 294179 312152 275450 241739 216063 207399 263832 292683 238434
12288B38434l2093J6302M1119R2885K8515j6572R003j4127q407O745j8650o308
$$ 238434 206341 222643 263762 356647 385162 368590 377593 363466 355059 361804 343154 336846
12276C36846K030j6456r505K1267M9914J4616L0497P145l926j0921M679J2194
$$ 336846 338876 322420 312915 334182 384096 398712 429209 436354 432428 421507 426186 438380
12264D38380k6786k6264K3759J5478k6222K0594Q435m0874k678K7066k0520L483
$$ 438380 411594 385330 409089 424567 398345 418939 427374 386500 383822 410888 390368 393851
12252C93851l0904J2731L2287K7174L989M6574L3057J7106j1187l0252L577j9957
$$ 393851 362947 375678 407965 435139 439128 485702 518759 535865 524678 494426 498003 478046
12240D78046J5342J3474k8360r149K471L6815P8826K3561m9020L80j1942m0333
$$ 478046 493388 506862 478502 469353 471824 508639 587465 611026 562006 562386 550444 510111
12228E10111k5741p385M1604N2690k46k911k0514l1700j0767J9058k1970K9024
$$ 510111 484370 476985 518589 571279 571033 568122 547608 515908 505141 524199 502229 531253
12216E31253L6770j1979j8731j741J8350L6202N0096l6060q044q962J1963j802
$$ 531253 568023 556044 537313 535572 553922 590124 640220 604160 596116 587154 599117 597315
12204E97315L3806L3187J6984L8061k2899k7695j9641l5667M1906J3620k4132
$$ 597315 631121 664308 681292 719353 696454 668759 649118 613451 655357 668977 644845
12193F44845k9206N802M8401j1590L079L8258K0595L9300q468k5842R386J6104
$$ 644845 615639 621441 669842 658252 661331 699589 720184 759484 751016 725174 734560 750664
12181G50664R890j0237J0595K1488J746m1668k4968J1700M7284J3898L2491L6735
$$ 750664 760554 750317 760912 782400 784146 742478 717510 729210 776494 790392 822883 859618
12169H59618K6663q39l854M6264l0928k1076N7891K1745K5257K5200K3926l8029
$$ 859618 886281 885442 881588 927852 896924 875848 933739 955484 980741 1005941 1029867 991838
12157I91838l5712R044J8592K2686L1463L5574L4648j8794m3283j0542J3836M4880
$$ 991838 956126 965170 983762 1006448 1037911 1073485 1108133 1089339 1046056 1035514 1049350 1094230
12145A094230K3561O316j1595l0124J2230N2380K5611L9157K4726J3509J366k3001
$$ 1094230 1117791 1124107 1112512 1082388 1094618 1146998 1172609 1211766 1236492 1250001 1251367 1228366
12133A228366K2958j2135k9919O0716L8162n209p009L6113L6057K8459k4869L4375
$$ 1228366 1251324 1239189 1209270 1269986 1308148 1302939 1295930 1332043 1368100 1396559 1371690 1406065
12121A406065O2590k9161j9466K2211J6207J6022L169J0943k1842K6831M2001
$$ 1406065 1468655 1439494 1420028 1442239 1458446 1474468 1477637 1488580 1466738 1493569 1535570
12110A535570j9738J5127M6598L7855M1663L0977k913n9063J6059R1614P3485
$$ 1535570 1515832 1530959 1577557 1615412 1657075 1688052 1685139 1626076 1642135 1733749 1807234
12099A807234N2133l2582l1435r132M1807N618P5194N5577J9389J3174K2447K9957
$$ 1807234 1859367 1826785 1795350 1786218 1828025 1833643 1908837 1964414 1983803 1996977 2019424 2049381
12087B049381p487K6634K0299N6097N1282J7501j132K8538O5088L9473J3416J8887
$$ 2049381 2041894 2068528 2088827 2144924 2196206 2213707 2212575 2241113 2306201 2345674 2359090 2377977
12075B377977Q625J4718j4161L3367Q5257L4691K2909L9821M8093N4403K2678
$$ 2377977 2386602 2401320 2387159 2420526 2505783 2540474 2563383 2603204 2651297 2705700 2728378
12064B728378K8688J0095O7886O4593K1484m033N7141K7002L2556J6618K7907
$$ 2728378 2757066 2767161 2835047 2899640 2921124 2917091 2974232 3001234 3033790 3050408 3078315
12053C078315P1134K1568L3447K5914L3258P1249J8814P799M3914J8577P8532
$$ 3078315 3149449 3171017 3204464 3230378 3263636 3334885 3353699 3361498 3405412 3423989 3502521
12042C502521J06015L5892P9576N5823L864O4909O1446P6757Q1402N6928J8861
$$ 3502521 3608536 3644428 3724004 3779827 3783691 3848600 3910046 3986803 4068205 4125133 4143994
12031D143994N4738M7017L520P587M9902O3779P8584Q1476L4926K6491P5609J20562
$$ 4143994 4198732 4245749 4249269 4256856 4306758 4370537 4449121 4530597 4565523 4592014 4667623 4788185
12019D788185Q2643j0273M3157Q0557K8296O8000L7402O2368P0333P5633k228
$$ 4788185 4870828 4860555 4903712 4984269 5012565 5080565 5117967 5180335 5250668 5326301 5324073
12008E324073K6437O3481J22917N5317M3101N6181O6006M9447J8369M8154Q1068
$$ 5324073 5350510 5413991 5536908 5592225 5635326 5691507 5757513 5806960 5825329 5873483 5954551
11997E954551Q9367L4972M3874K5938M0002O1280P5065L3468O2406P8704j4764
$$ 5954551 6043918 6078890 6122764 6148702 6188704 6249984 6325049 6358517 6420923 6499627 6484863
11986F484863J4595Q7165K0410j17M7479N6036K6189K7038J5707P5366J2783j4032
$$ 6484863 6499458 6586623 6607033 6606916 6654395 6710431 6736620 6763658 6779365 6854731 6867514 6853482
11974F853482p416L3639N4833k5417j7021M5487O9224L036k4970k5314J4632R868
$$ 6853482 6846066 6879705 6934538 6909121 6892100 6937587 7006811 7009847 6984877 6959563 6974195 6984063
11962F984063M962k1614o462J1283n984o5408j6190j9159k4584m4594J8878j1533
$$ 6984063 6989025 6967411 6960949 6972232 6966248 6900840 6884650 6865491 6840907 6796313 6815191 6803658
11950F803658m6436q75j5766m3039k3003m5915k7952k7577k6592m2814q330q7226
$$ 6803658 6757222 6756347 6740581 6697542 6674539 6628624 6600672 6573095 6546503 6503689 6495359 6408133
11938F408133p0080k6464l2599l6947m9327j19858q7739j1006k6725n7211p8579
$$ 6408133 6338053 6311589 6278990 6242043 6192716 6072858 5985119 5974113 5947388 5890177 5811598
11927E811598p5214o3043K8323k5886j39969o6946k3665m2672o8476K620J353
$$ 5811598 5736384 5673341 5701664 5675778 5535809 5468863 5445198 5402526 5334050 5336670 5338023
11916E338023m5552r9176j01009j53135l9394J3860m8415n4541n2795l5557n7467
$$ 5338023 5292471 5193295 5092286 4939151 4899757 4913617 4865202 4810661 4757866 4722309 4664842
11905D664842r0514q1560q9878l8639j0522o4905p1083m0521k5378l259j5263
$$ 4664842 4574328 4492768 4402890 4364251 4353729 4288824 4217741 4177220 4151842 4148583 4133320
11894D133320n6901m3153o1254r0126l3156o0167o1698l4218o0110m5973n7037
$$ 4133320 4076419 4033266 3972012 3881886 3848730 3788563 3726865 3692647 3632537 3586564 3529527
11883C529527p5032l8948k1077n965l4860l2893k9168l2564l3769j9761p4095
$$ 3529527 3454495 3415547 3394470 3388505 3353645 3320752 3291584 3259020 3225251 3205490 3131395
11872C131395q5309j003j8338q6867n8646k0298R733k4699m3730k1033k6201O994
$$ 3131395 3046086 3045083 3026745 2939878 2881232 2860934 2870667 2845968 2802238 2781205 2755004 2761998
11860B761998k4667o0938m1382m4818n4091k2636j700n4745k7660j4806M373n9936
$$ 2761998 2737331 2676393 2635011 2590193 2536102 2513466 2511766 2457021 2429361 2414555 2418928 2358992
11848B358992l3578k2661k4767k2355o1887k3636k8469l1288l2975j0648r184
$$ 2358992 2325414 2302753 2277986 2255631 2193744 2170108 2141639 2110351 2077376 2066728 2057544
11837B057544N6483N974n6283j1419l4030m9999j1181k4916m6197j013k1080k8320
$$ 2057544 2114027 2120001 2063718 2052299 2018269 1968270 1957089 1932173 1885976 1884963 1863883 1835563
11825A835563l4162j0962m9910l8192p2681k6862R757M2827l0796l6857q514k9521
$$ 1835563 1801401 1790439 1740529 1702337 1629656 1602794 1612551 1655378 1624582 1587725 1579211 1549690
11813A549690l0095k6461L5310j2218l1117j6188j8799J025j6689J6361l3133
$$ 1549690 1519595 1493134 1528444 1516226 1485109 1468921 1450122 1451147 1434458 1450819 1417686
11802A417686J8263l2810o7210R730J7428k4649n5663l9113k4462N911J0138m735
$$ 1417686 1435949 1403139 1335929 1345659 1363087 1338438 1282775 1243662 1219200 1225111 1235249 1230514
11790A230514j0485m6627m598O659J9118l4836j5367r835j9879M4827r059k6390
$$ 1230514 1220029 1173402 1168804 1175463 1194581 1159745 1144378 1134543 1114664 1159491 1150432 1124042
11778A124042m5546n3082K9804J929j9836M527P368p9616K6848M2187M3466l0073
$$ 1124042 1078496 1025414 1055218 1057147 1037311 1041838 1049206 969590 996438 1038625 1082091 1052018
11766A052018j9643p0356j6226k65o404L0562p048l3879l1693k2856J3540J6710
$$ 1052018 1032375 962019 945793 945528 939124 969686 962638 928759 897066 874210 887750 904460
11754I04460J5992m5032k9292p00n761J1783k6974K763j9097J8113O210P423l8597
$$ 904460 920452 875420 846128 845428 839667 851450 824476 827239 808142 826255 832465 839888 801291
11741H01291Q841n647n9444j0314O259J1825J741m1579Q087L2822k5476j4490
$$ 801291 810132 804485 745041 734727 740986 752811 754552 712973 721060 753882 728406 713916
11729G13916j1114J4404k8320J148k0702M6319L0230O584m693l2227q992n8127
$$ 713916 702802 717206 688886 690034 669332 715651 745881 752465 747772 715545 706553 648426
11717F48426j8044k3966J5888P8681j1270m4870k5992q137J4014j8549k2743J9824
$$ 648426 630382 606416 622304 700985 689715 644845 618853 610716 624730 606181 583438 603262
11705F03262j6018K1238r645l4179M408K2954M118k4217n0515n7817o736K4520
$$ 603262 587244 608482 598837 564658 569066 592020 596138 571921 521406 463589 456853 481373
11693D81373R121J0096j0705N981N144N2456M8038N741j5073l0796k0590L3616
$$ 481373 490494 500590 489885 495866 501010 553466 601504 607245 592172 561376 540786 574402
11681E74402J344l4502j1091M0992j6391l1849l2187j8238L0093o041j7997K7747
$$ 574402 575746 541244 530153 571145 554754 522905 490718 472480 502573 496532 478535 506282
11669E06282j489r485J3742k3183L8484J3897k6115j0531L0270L1670n6249j8018
$$ 506282 504793 495308 509050 485867 524351 538248 512133 501602 531872 563542 507293 489275
11657D89275J8231k7510q53K9192k0255n3912j2867j7600L2926j415k1249M5848
$$ 489275 507506 479996 479143 508335 488080 434168 421301 403701 436627 435212 413963 459811
11645D59811N069J7320L4362Q39l7316p0833j8568O098j7290M555M0626L928m4690
$$ 459811 464880 482200 516562 517401 480085 409252 390684 396782 379492 384047 424673 428601 383911
11632C83911R3Q177j1190m6734r1654j2169J0021q214J2064L882K3568N3005J1692
$$ 383911 384004 392181 380991 334257 242603 230434 240455 232241 244305 248187 271755 324760 336452
11619C36452l6291k5645J6191J9600Q760R803K7835m8933j2416K4763N5897J6377
$$ 336452 300161 274516 290707 310307 319067 328870 356705 307772 295356 320119 376016 392393
11607C92393n0604l7176j6318l868j4297m2776K0404L3716J5769J5427j5551j6007
$$ 392393 341789 304613 288295 284427 270130 227354 247758 281474 297243 312670 297119 281112
11595B81112j5915j3840L6721J3799j904l5892k0655M0675O7515q496j638m7179
$$ 281112 265197 251357 288078 301877 299973 264081 243426 284101 351616 343120 341482 294303
11583B94303p7618j9754J8723K8811P406L4523j5546R972k4958l8757J0117M1922
$$ 294303 216685 196931 215654 244465 251871 286394 270848 280820 255862 217105 227222 269144
11571B69144R394j3843n719R153k338l862K6201K0278M452j8970p5832K056m647
$$ 269144 278538 264695 258976 268129 265791 261929 288130 308408 312860 293890 218058 220114 215467
11558B15467l10j5400q669k1181L004J6530O018k074j162L2971j2074J4654k8040
$$ 215467 215157 199757 191088 169907 172911 189441 195459 193385 192223 225194 213120 227774 199734
11545A99734p384m339j6505l5027L907L6176k1804P290J5208J4790q077o457L8860
$$ 199734 192350 188011 171506 136479 140386 176562 154758 162048 177256 192046 183969 177512 216372
11532B16372J6849L0044K2642L2707q1224j2662K8274k038m0537n7961L9029N4247
$$ 216372 233221 263265 285907 318614 237390 224728 253002 250964 210427 152466 191495 245742
11520B45742k0897k8125L7683L5939j2288n9169k6369j0762j5510j9121R13J0270
$$ 245742 224845 196720 234403 270342 258054 198885 172516 161754 146244 127123 128036 138306
11508A38306K5457L4948k3644j3268k0422j3783l4472J2915L1381o252k2372O441
$$ 138306 163763 198711 175067 161799 141377 127594 93122 106037 137418 131166 108794 115235
11496A15235j0759m6815L7436K4332K9511J3633q529K333P2518M4869J7364m0910
$$ 115235 104476 57661 95097 119429 148940 162573 154044 156377 228895 273764 291128 250218
11484B50218o3626l3667J1859L0665l4975l0075O078K4042J9059j4393n7029j3719
$$ 250218 186592 152925 164784 195449 160474 130399 136477 160519 179578 165185 108156 94437
11472I4437O1403m816j9967L9329k440p549n2107j6088K1946L4435J5448j7116
$$ 94437 155840 151024 131057 170386 167946 160397 108290 92202 114148 148583 164031 146915
11460A46915N150N227l4836k8407k6938J1691J8346l894n921K3630M1314l4545
$$ 146915 152065 157292 122456 94049 67111 78802 97148 93254 87333 110963 152277 117732
11448A17732m2012K0937M128J2397L1771j5995l2589k0239J11M5324K5772l0264
$$ 117732 75720 96657 100785 113182 144953 128958 96369 76130 76241 121565 147337 117073
11436A17073k1073M825K534L7561K32M213m013l7293k2252O471K4124J6703n7049
$$ 117073 96000 100825 103359 140920 141152 145365 141352 104059 81807 88278 112402 129105 72056
11423G2056j4082L6001K5183M119N884K7943J7936m1852K4420p199J539j1201
$$ 72056 57974 93975 119158 123277 129161 157104 175040 133188 157608 150409 151948 140747
11411A40747k3627j2079L8183l75k852n668j8070M117l3110J3154L1716q313m4477
$$ 140747 117120 105041 143224 142849 139997 134329 116259 120376 87266 100420 132136 123823 79346
11398G9346j5040k9514J3189J3767K6940j4236j7256R345l9096J4736L4031L6696
$$ 79346 64306 34792 47981 61748 88688 74452 57196 66541 27445 42181 76212 112908
11386A12908L7728n648m0559l9080K3866M27l6577J6022k2691k2124L487R166
$$ 112908 150636 144988 104429 65349 89215 89642 53065 69087 46396 24272 27759 36925
11374C6925q057L8609R838R204J65k1804j449J9233O151k6312O595K2827N2285
$$ 36925 28868 67477 77315 86519 86684 64880 63431 82664 88815 62503 69098 91925 144210
11361A44210k571k6314L283k9555n5029k0458J4811K7884j5220k088J3191J65
$$ 144210 141639 115325 118608 89053 34024 13566 28377 56261 41041 38953 52144 52309
11349E2309j4430l3678N4698L4444l0003k9710K7486N6400j418l2443k6963L8099
$$ 52309 37879 4201 58899 93343 63340 33630 61116 117516 116098 83655 56692 94791
11337I4791j684k1855N791K0400J1285L4251k5897l8076n938N026k26j8851J897
$$ 94791 93107 71252 77043 97443 108728 142979 117082 79006 73068 78094 77868 59017 60914
11324F0914N1655K8298q188P017J4921l9584l461M253l097J645o138j1566l0385
$$ 60914 112569 140867 132679 139696 154617 115033 111572 115825 112728 114373 108235 96669 66284
11311F6284k8190j892P557J1977m1075N507O5232j7135R876N2382L4327P999l9503
$$ 66284 38094 36202 43759 55736 14661 20168 85400 68265 78141 130523 164850 172849 133346
11298A33346j2919n0793l1168k4067N584o839l6828K3766N0194K0089M387N108
$$ 133346 120427 69634 38466 14399 19983 13144 -23684 82 50276 70365 74752 79860
11286G9860j6368j0408r185L3879K4649J8026k6775j5071J9975n2293k1200l0442
$$ 79860 63492 53084 43899 77778 102427 120453 93678 78607 98582 46289 25089 -5353
11274e353j8427L4400J4867O1202J6798m1526r329M3961K6971m4422l5422k9500
$$ -5353 -23780 10620 25487 86689 103487 61961 52632 96593 123564 79142 43720 14220
11262A4220j3592P2522M212j6899L8419J2428K0143j0427m8002p3121n0283M2564
$$ 14220 628 73150 77362 60463 98882 111310 131453 121026 73024 -97 -50380 -7816
11250g816r736J5472O6910K2004k56J2547m620K7467K904l5417L262J3898K4858
$$ -7816 -17552 -2080 64830 86834 86578 99125 94505 121972 124876 89459 92721 106619 131477
11237A31477K6781l6770j2274k7979K0068J308J6941m951j0636K4105L927m6225
$$ 131477 158258 121488 109214 81235 101303 102611 119552 114601 103965 128070 131997 85772
11225H5772m2015j327K7694J4356k2574n6876k903K9759k5096L9155K1028k8120
$$ 85772 43757 42430 70124 84480 61906 5030 2127 31886 6790 45945 66973 38853
11213C8853m5581j2429L1167K2826l3928k1940M7249M8149K5258m0883q3869j4528
$$ 38853 -6728 -19157 12010 34836 908 -21032 26217 74366 99624 58741 -25128 -39656
11201c9656R275K4930N5317J808J811m1566J8707N9177M2322m3571o9855j9283
$$ -39656 -30381 -5451 49866 51674 53485 11919 30626 89803 132125 88554 18699 -584
11189e84p582J4821K0582J0948r044J6026Q92j9468K7000L3033Q823l7688k7066
$$ -584 -8166 6655 27237 38185 29141 45167 46059 26591 53591 86624 95447 57759 30693
11176C0693m8391M455j966N4156j3708l2396Q300M7321o264r035k0201L7324N8814
$$ 30693 -17698 -13243 -15209 38947 25239 -7157 1143 48464 42200 33165 12964 50288 109102
11163A09102k311k2406J2075r393j103m508k2868j8569j3500l3964l9776l709
$$ 109102 106791 84385 96460 87067 85964 81456 58588 40019 26519 -7445 -47221 -50930
11151e0930M7687N1567M4998R609l3459k5548k8293J5202j0099j2685O0562k645
$$ -50930 -3243 48324 93322 102931 69472 43924 15631 30833 20734 8049 68611 65966
11139F5966o6737J5628K4349J0970Q09l0598l656L1772k7054k3118K1215j7848
$$ 65966 -771 14857 39206 50176 50985 20387 16731 48503 21449 -1669 19546 1698
11127A698j0854O4241K7823k8188n4836l2240Q295J7918M0323N5537K423M0077
$$ 1698 -9156 55085 82908 54720 -116 -32356 -24061 -6143 34180 89717 92140 132217
11115A32217K6706j8835k4774l8682k4694j779K5194L3541L7605P603j4194O21
$$ 132217 158923 140088 115314 76632 51938 50159 75353 108894 146499 154102 139908 140529
11103A40529j2299L835l0328J4232K6954K8235P609m8293m7150o1087j1876M3668
$$ 140529 128230 132065 101737 115969 142923 171158 178767 130474 83324 22237 10361 54029
11091E4029L8147j1605k9204N4351q623J2456l8469m2850J7270n407K682L8855
$$ 54029 92176 80571 51367 105718 97095 109551 71082 28232 45502 40095 42777 81632
11079H1632j3884R470J7999m5074J5604j1084L0358P910P678m120n962l1564n2827
$$ 81632 67748 77218 95217 50143 65747 54663 85021 92931 100609 96489 90527 58963 6136
11066F136K3319K2245K3558O2025K5466k5520j1071k3944l0145k9553J3092j724
$$ 6136 29455 51700 75258 137283 162749 137229 126158 102214 72069 42516 55608 53884
11054E3884K5715K0778K1779l608N346P2102P749j2162K2347O516j0452K9676
$$ 53884 79599 100377 122156 118548 123894 195996 203745 191583 213930 220446 209994 239670
11042B39670r858p873k212k4013k6957L9022N7361O1597m529j2730j8489k34M223
$$ 239670 229812 221939 219727 195714 168757 207779 265140 326737 322208 309478 290989 290755 294978
11029B94978M7444P905N4064K1642R101L8940l3999j3681m647j8565k4381P819
$$ 294978 342422 350327 404391 426033 435134 474074 440075 426394 421747 403182 378801 386620
11017C86620L632K7061k672m3440p5400m3149J3148K9601m3623m5912K7876N3687
$$ 386620 390252 417313 414641 371201 295801 252652 265800 295401 251778 205866 233742 287429
11005B87429j555J5186j5076o006k1297j2548l8843j2336l4558J7363O713n1916
$$ 287429 285874 301060 285984 279978 258681 246133 207290 194954 160396 177759 184472 132556
10993A32556K0003K7031Q751l5193j7164J1701k2162P45J0901K237J951j7165
$$ 132556 152559 179590 188341 153148 135984 147685 125523 126268 137169 139406 141357 124192
10981A24192q247L6692l2287j3032J1311M5118J12j9654l0424k1430J6303J1797
$$ 124192 115945 152637 120350 107318 118629 163747 163859 144205 113781 92351 108654 120451
10969A20451N326K469P217R916m8866J4470n106m6710k1479j2783L8161K6539
$$ 120451 125777 128246 135463 145379 96513 110983 105877 59167 37688 24905 63066 89605
10957H9605j3859k6888J3491j6029l0159M2698M5584N5845K6683J2626l6287k6942
$$ 89605 75746 48858 62349 46320 16161 58859 104443 160288 186971 199597 163310 136368
10945A36368k4135o6825l061L53L0992p939k0350O274L6504O3578K4051n0475
$$ 136368 112233 45408 42347 42700 73692 65753 45403 51677 88181 151759 175810 125335
10933A25335m4489L775M9458Q04k6103O412K3373o252J0095m7859L379L5978j3257
$$ 125335 80846 84621 134079 134883 108780 115192 138565 132313 142408 94549 97928 133906 120649
10920A20649O767l1069j9330L9021J4827p028J0088k35k1666n8564K9756K4733
$$ 120649 127416 96347 77017 116038 130865 123837 133925 133690 112024 53460 83216 107949
10908A07949O390K4198N922k3770m4342J4430M7173L9895L3790m1130o1875L1128
$$ 107949 114339 138537 144459 120689 76347 90777 137950 177845 211635 170505 108630 139758
10896A39758J5540j8296o3354Q162M146L9407Q491j8657k3289l2706J0767l1561
$$ 139758 155298 137002 73648 81810 85956 125363 133854 115197 91908 59202 69969 38408
10884C8408q973K7170N171m6671l9785L7732M0619M0186j92j0227J7423R198k913
$$ 38408 29435 56605 61776 15105 -24680 13052 53671 93857 93665 83438 100861 110059 107146
10871A07146k2953k554J3914K1357j8018l2463K7048Q4185J183m8568j431J494
$$ 107146 84193 81639 95553 116910 98892 66429 93477 177662 178845 130277 128846 130340
10859A30340K6379K1843J6126J9297N266o781R478l9077m6537L443L2400M0048
$$ 130340 156719 178562 194688 213985 219251 212470 221948 182871 136334 139777 172177 212225
10847B12225k3092J7205R574j7314j2873R778M049K0551j1115N84L9456L5525
$$ 212225 189133 206338 215912 198598 185725 195503 199552 220103 208988 209572 249028 284553
10835B84553k1020n0146K857K208o920j203p236l601j0109M744L02o437l817j2334
$$ 284553 263533 213387 216244 218452 211532 210329 203093 199492 189383 194127 194429 187992 184175 171841
10821A71841p625j4787M4283N7356N8912O990o7956m8579k336J0694l4442r809
$$ 171841 164216 149429 193712 251068 309980 316970 249014 200435 198099 208793 174351 164542
10809A64542O2668K9687j7507k3585j8227k7982r438L1631O5351n3987m4380J841
$$ 164542 227210 256897 239390 215805 197578 169596 160158 191789 257140 203153 158773 160614
10797A60614K3690R479Q240K7968M527k2947L5153k99l6091J7805J4088l2193
$$ 160614 184304 193783 202023 229991 234518 211571 246724 246425 210334 228139 242227 210034
10785B10034k905R329L9538L2766m2236l3940k5765Q144O2340n210n4871M242
$$ 210034 207129 216458 255996 288762 246526 212586 186821 194965 257305 252095 197224 201466
10773B01466K3346M3772m13L8501j1391j7710o471r489J2209q642l433M0659P720
$$ 201466 224812 268584 268171 306672 295281 277571 271100 261611 273820 265178 261745 302404 310124
10760C10124j5121O5548L8971p297M287l3965J2883L0333M881K2678M2448M3497
$$ 310124 295003 360551 399522 392225 396512 362547 375430 405763 410644 433322 475770 519267
10748E19267J1738Q044Q094M3335N4009M2428K7231J9106Q219K601M9897J9701
$$ 519267 531005 539049 547143 590478 644487 686915 714146 733252 741471 744072 793969 813670
10736H13670R479O3438M8834K0136M8366P3114N2135K2192L351M1060P5789J00285
$$ 813670 823149 886587 935421 955557 1003923 1077037 1129172 1151364 1154715 1195775 1271564 1371849
10724A371849Q4158R8091O2192J00859R4032M4839P7037J7765M5054N7725N9071
$$ 1371849 1456007 1554098 1616290 1717149 1811181 1856020 1933057 1950822 1995876 2053601 2112672
10713B112672O5294K6141m4295j0029l6558j5937j8778k8473n5692p0958m4393
$$ 2112672 2177966 2204107 2159812 2149783 2113225 2097288 2078510 2050037 1994345 1923387 1878994
10702A878994r4204p7667l1422m1947p1185m5215n6126m0508K9551n2101l8773
$$ 1878994 1784790 1707123 1675701 1633754 1562569 1517354 1461228 1420720 1450271 1398170 1359397
10691A359397l8258m2098J6954k8492l2291m0012n0914o744k6584k5712k5591
$$ 1359397 1321139 1279041 1295995 1267503 1235212 1195200 1144286 1137542 1110958 1085246 1059655
10680A059655K8388J0279k066j5217o7262j3421M6524n002Q332q573k1571N1761
$$ 1059655 1088043 1098322 1096256 1081039 1013777 1000356 1046880 1041878 1050210 1041637 1020066 1071827
10668A071827K8507k7956K5238N9824J4096L7914j3884j1859J4826O2157P5101
$$ 1071827 1100334 1072378 1097616 1157440 1171536 1209450 1195566 1183707 1198533 1260690 1335791
10657A335791N7682Q1678J6753M9256M9548Q1617P1771N6539J06227O3736L3950
$$ 1335791 1393473 1475151 1491904 1541160 1590708 1672325 1744096 1800635 1906862 1970598 2004548
10646B004548K2266J0010L2225P2144J06703P7720Q5476R6714J42634J30347K17947
$$ 2004548 2026814 2036824 2069049 2141193 2247896 2325616 2411092 2507806 2650440 2780787 2998734
10635B998734K52635K63692K81514L13984K90770L36022L82815M76456N26143
$$ 2998734 3251369 3515061 3796575 4110559 4401329 4737351 5120166 5596622 6122765
10626F122765N96797P05090Q77237J088577J266024J537482J858979K095044K362808
$$ 6122765 6719562 7424652 8301889 9390466 10656490 12193972 14052951 16147995 18510803
10617A8510803K516025K429476K168514J774487J344332J085229J111993J287523
$$ 18510803 21026828 23456304 25624818 27399305 28743637 29828866 30940859 32228382
10609C2228382J724851K373412L085179L624352L801732L524994K842110J844230
$$ 32228382 33953233 36326645 39411824 43036176 46837908 50362902 53205012 55049242
10601E5049242O58016j25624l13323L6295P96512J783933K786213L456710L577374
$$ 55049242 55707258 55581634 55268311 55304606 56101118 57885051 60671264 64127974 67705348
10592F7705348L007599J666180j02653j923105l064369l451989l168153k362136
$$ 67705348 70712947 72379127 72276474 70353369 67289000 63837011 60668858 58306722
10584E8306722j395908n34722J50230L91423R9459p76841k007416l024138l614462
$$ 58306722 56910814 56376092 56526322 56917745 57017204 56240363 54232947 51208809 47594347
10575D7594347l754305l430682k835353k153929j554286j137150j052632j194521
$$ 47594347 43840042 40409360 37574007 35420078 33865792 32728642 31676010 30481489
10567C0481489j535972j893380k245526k454028k433311k318434k038960j791784
$$ 30481489 28945517 27052137 24806611 22352583 19919272 17600838 15561878 13770094
10559A3770094j512177j222717j046248r16804q01511o49724n99838n07314l95830
$$ 13770094 12257917 11035200 9988952 9072148 8270637 7620913 7021075 6513761 6117931
10550F117931l50796l35521l47609k91443k38151j64459j71961j66147j22820
$$ 6117931 5767135 5431614 5084005 4792562 4554411 4389952 4217991 4051844 3929024
10541C929024j25417j84923j40609j04970j18742q3636n3344j05769q4852r880
$$ 3929024 3803607 3618684 3478075 3373105 3254363 3170727 3117383 3011614 2926762 2916882
10531B916882m1005J1298o6908o9294j7085l4274k9906p2777j8956j1764n568
$$ 2916882 2875877 2887175 2820267 2750973 2733888 2699614 2669708 2596931 2577975 2566211 2560643
10520B560643j8003n8251n7467o381k7483j6594M3581L0708P047o821n7700o8008
$$ 2560643 2542640 2484389 2426922 2420541 2393058 2376464 2420045 2450753 2457800 2450979 2393279 2325271
10508B325271l8160q714K9697m1599k3906M2598M7616j1578m3890l1315L5305
$$ 2325271 2287111 2278397 2308094 2266495 2242589 2285187 2332803 2321225 2277335 2246020 2281325
10497B281325K677K8716O293m0554M2736K4916J2815k6572L2357K9238m510K5954
$$ 2281325 2284002 2312718 2319011 2278457 2321193 2346109 2358924 2332352 2364709 2393947 2389437 2415391
10485B415391J3800J086k0871K779R765L2956O3061J03125j631k4224J0710m2807
$$ 2415391 2429191 2430277 2409406 2412185 2421950 2454906 2517967 2621092 2619461 2595237 2605947 2563140
10473B563140M550N0964j056O185N4013L8303m179L5375O3912M6534N7021L6946
$$ 2563140 2567690 2618654 2617598 2623783 2677796 2716099 2711920 2747295 2811207 2857741 2914762 2951708
10461B951708O1663Q1781N0412N8414R4444N1425L2432P1339P9227M7377N6300
$$ 2951708 3013371 3095152 3145564 3203978 3298422 3349847 3382279 3453618 3532845 3580222 3636522
10450C636522J8626Q5542N5730N1955O4850O9081Q2676O7785N2483L553Q9966
$$ 3636522 3655148 3740690 3796420 3848375 3913225 3982306 4064982 4132767 4185250 4188803 4278769
10439D278769J33538J04773P5263O9213N3187K3730N8468N9949R3278M5785L9043
$$ 4278769 4412307 4517080 4592343 4661556 4714743 4738473 4796941 4856890 4950168 4995953 5034996
10428E034996Q4024O8887J31190J49767R6925P6078L6594J03748J05516P6873
$$ 5034996 5119020 5187907 5319097 5468864 5565789 5641867 5678461 5782209 5887725 5964598
10418E964598P4010R6261P7377J24150J28598J14831O9343J01621J40916J27789
$$ 5964598 6038608 6134869 6212246 6336396 6464994 6579825 6649168 6750789 6891705 7019494
10408G019494J59484J41486J17391J84638J15597J79811J89408J42563J35419
$$ 7019494 7178978 7320464 7437855 7622493 7738090 7917901 8107309 8249872 8385291
10399H385291J14232J75943J59277J57198J48282J72588K33607K36176K38112
$$ 8385291 8499523 8675466 8834743 8991941 9140223 9312811 9546418 9782594 10020706
10390A0020706K56212K38464K35917K59685K34292L03972L39002K90427K67111
$$ 10020706 10276918 10515382 10751299 11010984 11245276 11549248 11888250 12178677 12445788
10381A2445788L02627K75985L15467L82287L71491M60940M74104M71911M12353
$$ 12445788 12748415 13024400 13339867 13722154 14093645 14554585 15028689 15500600 15912953
10372A5912953M81424N32474N09933N13550N84467O42222O58610O45854O90365
$$ 15912953 16394377 16926851 17436784 17950334 18534801 19177023 19835633 20481487 21171852
10363B1171852P97433P95349P86663Q65180R22623R62334R70012J048728J140464
$$ 21171852 21969285 22764634 23551297 24416477 25339100 26301434 27271446 28320174 29460638
10354B9460638J221260J263441J366175J457094J499056J590278J698731J752377
$$ 29460638 30681898 31945339 33311514 34768608 36267664 37857942 39556673 41309050
10346D1309050J856756K054922K197926K390799K578854K651502K874850L092894
$$ 41309050 43165806 45220728 47418654 49809453 52388307 55039809 57914659 61007553
10338F1007553L356571L571403L790802M109836M450511M758110N170219N591803
$$ 61007553 64364124 67935527 71726329 75836165 80286676 85044786 90215005 95806808
10330I5806808N997363O420505O920011P459966Q061009Q642337R296367R955920
$$ 95806808 101804171 108224676 115144687 122604653 130665662 139307999 148604366 158560286
10322A58560286J0625300J1330112J2022026J2600174J3099265J3507257J3716952
$$ 158560286 169185586 180515698 192537724 205137898 218237163 231744420 245461372
10315B45461372J3704991J3304939J2574021J1567433J0126005Q226279O050857
$$ 245461372 259166363 272471302 285045323 296612756 306738761 314965040 321015897
10308C21015897L582062J004095j632520m252944o603638q607257j0269859j1575337
$$ 321015897 324597959 325602054 323969534 319716590 313112952 304505695 294235836 282660499
10300B82660499j2441855j2950858j3199462j3185917j2933358j2544846j2152888
$$ 282660499 270218644 257267786 244068324 230882407 217949049 205404203 193251315
10293A93251315j1594364j0927910j0214532r570808q993901q410509p851006
$$ 193251315 181656951 170729041 160514509 150943701 141949800 133539291 125688285
10286A25688285p209186o752184o249425n792362n440564n103020m715513m348894
$$ 125688285 118479099 111726915 105477490 99685128 94244564 89141544 84426031 80077137
10278H0077137m061762l779907l547428l293081l101062k886127k733514k568979
$$ 80077137 76015375 72235468 68688040 65394959 62293897 59407770 56674256 54105277
10270E4105277k381282k216621k093245j941659j827854j729945j631078j497927
$$ 54105277 51723995 49507374 47414129 45472470 43644616 41914671 40283593 38785666
10262C8785666j403184j302143j299367j235413j153227j108880j091545r91146
$$ 38785666 37382482 36080339 34780972 33545559 32392332 31283452 30191907 29200761
10254B9200761r81119r78177q90713q60916q23687p60470p12679o52544o90133
$$ 29200761 28219642 27241465 26350752 25489836 24666149 23905679 23193000 22540456 21850323
10245B1850323o57547o06492n97633n71465n10803m96560m71184m80207m69047
$$ 21850323 21192776 20586284 19988651 19417186 18906383 18409823 17938639 17458432 16989385
10236A6989385l75079l82587l94886m11835m06198m03260l71746l00112l02119
$$ 16989385 16614306 16231719 15836833 15424998 15018800 14615540 14243794 13943682 13641563
10227A3641563l16659l02079l25465k72752k45464k22392k56122k44266k40135
$$ 13641563 13324904 13022825 12697360 12424608 12179144 11956752 11700630 11456364 11216229
10218A1216229k28884k17710k56531k14843j75419k15316j70150j58627j69399
$$ 11216229 10987345 10769635 10513104 10298261 10122842 9907526 9737376 9578749 9409350
10209I409350j63960j98137k41803j74228j56646j12308j32985j07955j16951
$$ 9409350 9245390 9047253 8805450 8631222 8474576 8362268 8229283 8121328 8004377
10200H004377j76014j47104j34900p7906j15062j05686l8544r7826j29691q8503
$$ 8004377 7828363 7681259 7546359 7468453 7353391 7247705 7209161 7111335 6981644 6893141
10190F893141j17097m5022l9698n9248r7874j35636o4433p1612r4017j04434n4684
$$ 6893141 6776044 6731022 6691324 6632076 6534202 6398566 6334133 6262521 6168504 6064070 6009386
10179F009386p0963l0172k2762q9175q0761o8653q0748j03443l1749j2147r5000
$$ 6009386 5938423 5908251 5885489 5796314 5715553 5646900 5566152 5462709 5430960 5418813 5323813
10168E323813q1768j7224j25122r9969j2554o990j9977n4263j0644j4757l4583
$$ 5323813 5242045 5224821 5099699 4999730 4987176 4980186 4960209 4905946 4895302 4880545 4845962
10157D845962o0423n3960k3614L6066J4053l5256p1071j32866p2336l5121j6112
$$ 4845962 4785539 4731579 4707965 4744031 4758084 4722828 4651757 4518891 4446555 4411434 4395322
10146D395322n3607k8383R87p0570o8531m0614j2061n9005p4364j05871j8767
$$ 4395322 4341715 4313332 4314319 4243749 4175218 4134604 4122543 4063538 3989174 3883303 3864536
10135C864536m7278l7438O847l7004o7879l9630r2281p6961k5212l4955j06710
$$ 3864536 3817258 3779820 3786667 3749663 3681784 3642154 3549873 3472912 3447700 3412745 3306035
10124C306035r7662m3033N105l9593k7519l7761J9812O5144n9775r7738m1748
$$ 3306035 3208373 3165340 3170445 3130852 3103333 3065572 3085384 3150528 3090753 2993015 2951267
10113B951267j6061k3780j9462k3167o8207m6549p8718m0085o91r185j6776q372
$$ 2951267 2935206 2911426 2891964 2868797 2800590 2754041 2675323 2635238 2634547 2625362 2608586 2600214
10101B600214J2699l240m9793k1330k6951J2239m4095p1038o4983k0125K3210
$$ 2600214 2612913 2609673 2559880 2538550 2511599 2523838 2479743 2408705 2343722 2323597 2346807
10090B346807q065l3530k5458m5146n263r459M3757K065m7824k7797m8982J261
$$ 2346807 2338742 2305212 2279754 2234608 2229345 2219886 2263643 2265708 2217884 2190087 2141105 2142366
10078B142366J4717k2134o2481n9312K0790R132k7450K1295k0568n4520n421L6329
$$ 2142366 2157083 2134949 2072468 2013156 2033946 2043078 2015628 2036923 2016355 1961835 1956414 1992743
10066A992743j7405n6385L2628N0671m9817m2811r10n0512k2147M3610j662m2617
$$ 1992743 1975338 1918953 1951581 2002252 1952435 1909624 1908714 1858202 1836055 1879665 1878003 1835386
10054A835386L4987J0003o6705m6519k2439P884J4672l1093j0236k899k3733L797
$$ 1835386 1870373 1880376 1813671 1767152 1744713 1752597 1767269 1736176 1725940 1723041 1699308 1703105
10042A703105j2711k7789l1055j0813K3885R089k1988O816l5145l7498l6287J2694
$$ 1703105 1690394 1662605 1631550 1620737 1644622 1653711 1631723 1638539 1603394 1565896 1529609 1542303
10030A542303N7218j5352n6396M2388P0816n6966k4726J1135L723k0006m1670
$$ 1542303 1599521 1584169 1527773 1570161 1640977 1584011 1559285 1570420 1574143 1554137 1512467
10019A512467K8823j9653P351k3388k6032O5301l420m058M435j0846k3481o0257
$$ 1512467 1541290 1521637 1528988 1505600 1479568 1544869 1541449 1537391 1541826 1530980 1507499 1447242
10007A447242n108J8689n1304j9684M1882L6519J6839n2736q042K980k6240j2386
$$ 1447242 1442134 1460823 1409519 1389835 1431717 1468236 1485075 1432339 1424297 1427277 1401037 1388651
9995A388651J4382n7362m0614j1220k623N045n8674l9037R449M0411p554K259
$$ 1388651 1403033 1345671 1305057 1293837 1291214 1296259 1237585 1198548 1207997 1248408 1240854 1243113
9983A243113M9009K0603m4755m1896k3298L7220Q553m8025K3486N8392j503m2155
$$ 1243113 1292122 1312725 1267970 1226074 1202776 1239996 1248549 1200524 1224010 1282402 1280899 1238744
9971A238744J560Q3322J7490N2017O5504M5121K7469N8873L9436k1159l985N207
$$ 1238744 1240304 1323626 1341116 1393133 1458637 1503758 1531227 1590100 1629536 1608377 1604392 1609599
9959A609599l4211m3957o9180r1465n2189k7822l5872Q845k6635k4363p401k8759
$$ 1609599 1575388 1531431 1462251 1370786 1318597 1290775 1254903 1263748 1237113 1212750 1205349 1176590
9947A176590j4639j5740Q137K2320m436k8145L403K3609K2642m7115l3204Q961
$$ 1176590 1161951 1146211 1154348 1176668 1172232 1144087 1147490 1171099 1193741 1146626 1113422 1122383
9935A122383K684L2282J7431K3583K112l4049n2597j5780N0239N1574L2818M8132
$$ 1122383 1125067 1157349 1174780 1198363 1200475 1166426 1113829 1098049 1148288 1199862 1232680 1280812
9923A280812J8415M1429L1035L7051L9224L598Q150M2571R2219M6569O447J2637
$$ 1280812 1299227 1340656 1371691 1408742 1447966 1451564 1459714 1502285 1594504 1641073 1647520 1660157
9911A660157O4683K2574N7311J66364J18224K9873P8417P1183K8978R83L7589
$$ 1660157 1724840 1747414 1804725 1971089 2089313 2119186 2197603 2268786 2297764 2298747 2336336
9900B336336N4935L1233N4234O3933o386k8181j03821p2677r0436p9916l7282
$$ 2336336 2391271 2422504 2476738 2540671 2534285 2506104 2402283 2329606 2239170 2159254 2121972
9889B121972n8134o0417r6292p1648j3690n5052p7664q2127n5451k4107l0953
$$ 2121972 2063838 2003421 1907129 1835481 1821791 1766739 1689075 1606948 1551497 1527390 1496437
9878A496437o9026m8055k7827l4347n1185k4162l5285p2505j5666k0874k239o8856
$$ 1496437 1427411 1379356 1351529 1317182 1265997 1241835 1206550 1134045 1118379 1097505 1095266 1026410
9866A026410k7605J2109n2804j9088k1543L5289j2161n8975l7951K5188k520k4501
$$ 1026410 998805 1010914 958110 939022 917479 952768 940607 881632 843681 868869 866349 841848
9854H41848j3352q617j8273L0472M296l3478n1275m0312J6613L7185M6363N924
$$ 841848 828496 819879 801606 832078 836374 802896 751621 711309 727922 765107 811470 817394
9842H17394J5849o577j0036o1511n0624j8625J6076J4114j7751L1984j3626l7213
$$ 817394 833243 826666 816630 755119 704495 685870 701946 716060 698309 730293 716667 679454
9830F79454m6056R760M0672P224k5352m3461j4851j0958J9478J0438k6088K029
$$ 679454 633398 643158 683830 691054 665702 622241 607390 596432 615910 626348 600260 602289
9818F02289K9106J759m0732k6112K4128O5269K0750o0467m7064o7729j5325R287
$$ 602289 631395 633154 592422 566310 590438 655707 676457 615990 568926 501197 485872 495159
9806D95159M9163J5595K2559m1089k1828O941j109p868j2539K4704o292J7189
$$ 495159 544322 559917 582476 541387 519559 526500 525391 517523 504984 529688 523396 540585
9794E40585J0203L4547J1336k5256l997j8337k2801m3922Q229J7260j0161K5305
$$ 540585 550788 585335 596671 571415 567418 549081 526280 482358 490587 507847 497686 522991
9782E22991J2312l999l4813m5910K813L0310K0729l5371m0721j5348M199J0032
$$ 522991 535303 531304 496491 450581 453394 483704 504433 469062 428341 412993 417192 427224
9770D27224K2271M4874o688n7462R242K8486J0506J6686L3960P938l8793l5234
$$ 427224 449495 494369 487681 430219 439461 467947 478453 495139 529099 537037 498244 463010
9758D63010l4505N481K8729K9552j8113K4007o4474m5676K685O4610K1235k7562
$$ 463010 428505 433986 462715 492267 474154 498161 433687 388011 390696 455306 476541 448979
9746D48979j4588k3332P856j1527k8670j3601k1856P791J3199R762J781K6950
$$ 448979 434391 411059 418915 407388 378718 365117 343261 351052 364251 374013 375794 402744
9734D02744k4275L6J9176j1034K1086J976n1221J2385M3790Q803m0245m1604K0194
$$ 402744 378469 378505 397681 386647 407733 409709 358488 370873 414663 423466 383221 341617 361811
9721C61811K1145L576J1045J0114L2993k2185j8115J0260L282j0470k8020K718
$$ 361811 382956 386532 397577 407691 440684 418499 400384 410644 413926 403456 375436 378154
9709C78154P0287k9696n3870j8549j741P885O143l4754p983L7969N4626m1444
$$ 378154 448441 418745 364875 346326 344585 352470 358613 323859 315876 353845 408471 367027
9697C67027K4432j4643N71K0657J2918j4423k803K5663J4835N8042K6454k2557
$$ 367027 391459 376816 377387 398044 410962 396539 393736 419399 434234 492276 518730 496173
9685D96173j8186l9930n4556l7960j0535k1529j980K9284j1793K1526L3107k2277
$$ 496173 477987 438057 383501 345541 335006 313477 311497 340781 328988 350514 383621 361344
9673C61344L8177k1528j07636k0454P794L3299J2566Q212Q349R759J1909K4802
$$ 361344 399521 377993 270357 249903 257697 290996 303562 311774 320123 329882 341791 366593
9661C66593r727K1772L918j151K4417k1478k1322k0928j2941L3796J8844k777
$$ 366593 356866 378638 382556 381405 405822 384344 363022 342094 329153 362949 381793 379016
9649C79016o140J0249k3400l4520l6997p094M5411J6948k440q212K960j4625j7236
$$ 379016 372876 383125 359725 325205 288208 281114 326525 343473 341033 332821 335781 321156 303920
9636C03920k6514k1384K2335L103Q380L9888k4054j8510k775J8452J0064O7195
$$ 303920 277406 256022 278357 281460 289840 329728 305674 287164 284389 302841 312905 380100
9624C80100k4148j5871n0756m2454L1885J0695j3107k8359j130K8295O844K5422
$$ 380100 355952 340081 289325 246871 278756 289451 276344 247985 246855 275150 281994 307416
9612C07416M6097J2711J7544j523p3597p986k984P421L1916k2603k7777j8842
$$ 307416 353513 366224 383768 382245 308648 300662 297678 305099 337015 314412 286635 267793
9600B67793P429M5481K878j2297n88L1577J6336p131J6550n7534n3631j4106J860
$$ 267793 275222 320703 323581 311284 310696 342273 358609 351478 368028 310494 256863 242757 244617
9587B44617K275M3675m383l9071K8318k617j9848l3742L163J4612K2159M5755
$$ 244617 246892 290567 286184 247113 275431 272814 252966 219224 222387 236999 259158 304913
9575C04913J0358J2216l237J788J0293m2651n5687N163M8059L6021K0960m2749
$$ 304913 315271 327487 324250 326038 336331 293680 237993 243156 291215 327236 348196 305447
9563C05447l9089N674J5759k558j8895J4449J3847M679O60L0375L5496l3164K246
$$ 305447 266358 272032 287791 285233 266338 280787 294634 299313 299973 330348 365844 332680 334926
9550C34926j6000M784J7230N829j07999o4701L0733M4415M4324j3461n5636l7565
$$ 334926 318926 323710 340940 346769 238770 174069 204802 249217 293541 280080 224444 186879
9538A86879L2677M0555j9245P407P2428L6649k8897j4031m0120l874J3098l8457
$$ 186879 219556 260111 240866 248273 320701 357350 328453 314422 274302 270428 283526 245069
9526B45069K4617N145k9852n9495l068N428M039K4916J03059R992l7563j3317
$$ 245069 269686 274831 244979 185484 182416 187844 191883 216799 319858 329850 292287 278970
9514B78970Q642l8643l7344J6113J8803k4115m1179J7822P5843N1370l2159k5204
$$ 278970 287612 248969 211625 227738 246541 222426 181247 199069 274912 326282 294123 268919
9502B68919k3948M033M2216K5308l9775L9251p973j6972M3451K15o0487k6289
$$ 268919 244971 249004 291220 316528 276753 316004 308031 291059 334510 334725 274238 247949
9490B47949j6789Q385L4636O41k5971j0586j6201l2982K484Q363J1172K1548p059
$$ 247949 231160 239545 274181 274822 248851 238265 222064 189082 191566 199929 211101 232649 225590
9477B25590l8519M1624L3710l0348l5638P705K1936j0859P669j2536N07J3554
$$ 225590 187071 228695 262405 232057 196419 204124 226060 215201 222870 210334 210841 224395
9465B24395j2121J274k2320J3389M3848J0299J7968K3300o21k0603m791m1944
$$ 224395 212274 213548 191228 204617 248465 258764 276732 300032 299411 278808 274017 232073
9453B32073o4091J007K9600L1588M4086J7455k7521r457k0792m4724k6881J2405
$$ 232073 167982 168989 198589 230177 274263 291718 264197 254740 233948 189224 162343 174748
9441A74748M1796L3582R62J5120j2293K584J1548J2201k4828k8438j5101O129
$$ 174748 216544 250126 251088 266208 253915 256499 268047 280248 255420 226982 211881 218010
9429B18010J533L6129K1307J6066M3742P673k2174k4847k730m2919L9281J6508
$$ 218010 219543 255672 276979 293045 336787 344460 322286 297439 294709 251790 291071 307579
9417C07579K1132j3125Q046L0162J16107R2487o43J4276K8313N4235j7609m5369
$$ 307579 328711 315586 323632 353794 469901 562388 561745 576021 604334 658569 640960 595591
9405E95591m0040p5997q2028n0906m4025k3780m0221K541J3167m2620K5208K0083
$$ 595591 555551 479554 397526 346620 302595 278815 238594 241135 254302 211682 236890 256973
9393B56973k6722k544j6273m0865K2232L1644q657m4902n0630J7059O3221K3130
$$ 256973 230251 227707 211434 170569 192801 224445 215788 170886 120256 137315 200536 223666
9381B23666L5276j5841J8821K3425J841k1885k9757l4560J143K7133j7209k3897
$$ 223666 258942 243101 261922 285347 287188 265303 235546 200986 202129 229262 212053 188156
9369A88156r330l4726O253K4458p11N075K2906l66J2179r070o309J7625K4116
$$ 188156 178826 144100 150353 174811 174100 179175 202081 201715 213894 204824 198515 216140 240256
9356B40256j1562m2270k6256k1882L2829L689J7220J4060J0151j8160K3157K0436
$$ 240256 228694 186424 160168 138286 171115 174804 192024 206084 216235 198075 221232 241668
9344B41668K870n1249p5061k2547M3643j1435N5087J9086r6261r555O5724N4717
$$ 241668 244538 193289 118228 95681 139324 127889 182976 202062 105801 96246 161970 216687
9332B16687j4827k7036j0980j4927j4617m7291L1491K4801j2576k8454k9761K3309
$$ 216687 201860 174824 163844 148917 134300 87009 118500 143301 130725 102271 72510 95819
9320I5819M4640J0939L8677n6929k0227L2257J6533R867k6898k687j1985k7900
$$ 95819 140459 151398 190075 133146 112919 145176 161709 171576 144678 141991 130006 102106
9308A02106J1765L4346J5405N914n9194k5180L6388L4962k7375P231J2583j5248
$$ 102106 113871 148217 163622 169536 110342 85162 121550 156512 129137 136368 148951 133703
9296A33703J2981J479j3535K125j592L2071j0997n677P080k4815n8700p669L2866
$$ 133703 146684 148163 134628 136753 135161 167232 156235 150558 157638 132823 74123 66454 99320
9283I9320J4474k7122j6188K9523P1860K5115l0149m0375n907M3727r690l15n3069
$$ 99320 113794 86672 70484 100007 171867 196982 166833 126458 120551 164278 154588 154273 101204
9270A01204K642r888K6551K5625k2071J7092M2770m0389k9515j10L1823j1006
$$ 101204 103846 93958 120509 146134 124063 141155 183925 143536 114021 113911 145734 134728
9258A34728j8436j5807L6728K3825m3096k9649J6178j7128j8504M8095K2119L8047
$$ 134728 116292 100485 137213 161038 117942 88293 104471 87343 68839 116934 139053 177100
9246A77100M3193q276Q83M792j2826k6401j4260r170p643J441j0430l8283O951
$$ 177100 220293 212017 212900 217692 204866 178465 164205 155035 147392 148833 138403 100120 107071
9233A07071N9918L2409k5559r114q1114k5776K0569N4215K2636J2695J0832l267
$$ 107071 166989 199398 173839 164725 83611 57835 78404 132619 155255 167950 178782 175515
9221A75515m0599k7477O9645L0871N175m7976l1920K875k1920n1622j3448J6351
$$ 175515 134916 107439 177084 207955 213130 165154 133234 136109 114189 62567 49119 65470
9209F5470o699J8931N970N5792K7581l760k8648m2822l3585K0344K8249m2234
$$ 65470 58771 77702 83672 139464 167045 163285 134637 91815 58230 78574 106823 64589
9197F4589P233L4332o494m2323M3045N8773M1162m2291k1025n8246p3083M4619
$$ 64589 71822 106154 99660 57337 100382 159155 200317 158026 137001 78755 5672 50291
9185E0291q751P158M4798K3908K33l0657j1333O4782L4316J826l8942n1414m694
$$ 50291 41540 48698 93496 117404 117637 86980 75647 140429 174745 176571 137629 86215 81521
9172H1521l8229l1046O968N8727J3484l945J3080j7844J1548J535k1560M3204
$$ 81521 43292 12246 19214 77941 91425 87480 100560 82716 94264 95799 74239 117443
9160A17443N4842p445j9729k0955q283J1152k2515m9620M4241r781l1083o849
$$ 117443 172285 164840 145111 124156 115873 127025 104510 54890 99131 89350 58267 51418
9148E1418L916Q894J0139J6629O4199J3989l5985j8451n841l4201R098K4201N1652
$$ 51418 55334 64228 74367 90996 155195 169184 133199 114748 108907 74706 83804 108005 159657
9135A59657J7131j4698l3538p5077l0370K2460L0176j2298M708N8240K4298j7707
$$ 159657 176788 162090 128552 53475 23105 45565 75741 63443 68151 126391 150689 132982
9123A32982r714k2852L65J5877o0016o4378K985K7249K8497J1539M7031K5607
$$ 132982 123268 100416 100781 116658 56642 -7736 -4751 22498 50995 62534 109565 135172
9111A35172j5514M001l9919q028J0089M7999K2917n0235k3963K3529j4930r321
$$ 135172 119658 123659 83740 75712 85801 133800 156717 106482 82519 106048 91118 81797
9099H1797j4712r212L871K4989O3422L6553k9888n3620j0479K5765P7561L2381
$$ 81797 67085 57873 61744 86733 150155 186708 156820 103200 92721 118486 196047 228428
9087B28428k176p320m1075n2981m7831o167O600J733J6279l524J9912r616m2790
$$ 228428 226252 218932 177857 124876 77045 70878 77478 79211 95490 91966 111878 102262 59472
9074E9472k0121O8804L9168n307l7789J4594J2643m0503O1443J6166m5928m2070
$$ 59472 39351 108155 147323 142016 104227 118821 131464 90961 152404 168570 122642 80572
9062H0572J3861L5563j2441L7965K1011J4898J3381n1483k5942L6482J342J1195
$$ 80572 94433 129996 117555 155520 176531 191429 204810 153327 127385 163867 165209 176404
9050A76404n372p5509l1842M6129l1719k7458K3428l7231J0366M3083l7985j9132
$$ 176404 171032 95523 63681 109810 78091 50633 74061 36830 47196 90279 52294 33162
9038C3162J3233K5764K7620k0487o868J2108M558l1826L5345J9908j6538J2587
$$ 33162 46395 72159 99779 79292 72424 84532 89090 57264 92609 112517 95979 108566
9026A08566j0589J6023n064m2479k6360K9768N9747K9936m5866q3734j9460j1834
$$ 108566 97977 114000 108936 66457 40097 69865 129612 159548 113682 29948 10488 -1346
9014a346l8086Q0691N1347m214k5711K6176J8770J2540L1517J5307j5489N3988
$$ -1346 -39432 41259 92606 88392 62681 88857 107627 120167 151684 166991 151502 205490
9002B05490j0964l4758j4185j0974K856k0902o2921j2995j6135L1107j0819L7320
$$ 205490 194526 159768 145583 134609 137465 116563 53642 40647 24512 55619 44800 82120
8990H2120N5831K95Q398j116L4645K4116k5725p5420j2909p964j1773J0785L2243
$$ 82120 137951 138246 146644 145528 180173 204289 178564 103144 90235 82271 70498 81283 113526
8977A13526k9052n145q343n0447m3718L6328N5576N7372J9309k3177J546Q814
$$ 113526 84474 79329 70986 20539 -23179 13149 68725 126097 145406 122229 123775 132589
8965A32589l721j802j5001j6724k0399m165j3492J1968J6125J4293K3647K0063
$$ 132589 128868 127066 112065 95341 74942 70777 57285 69253 85378 99671 123318 143381
8953A43381l0311k1787L5272K7610j4941n1783k5696l1428p43L326n027l0259
$$ 143381 113070 91283 126555 154165 139224 87441 61745 30317 29574 32900 27873 -2386
8941b386k7284O1011J7744j3080O720K3948q907R888K1179K3096k3012J6922r190
$$ -2386 -29670 31341 49085 36005 42725 66673 57766 67654 88833 111929 88917 105839 96649
8928I6649J9935Q457k9149k697L3608k0147k2549m305k5623o0906L9039J5325
$$ 96649 116584 125041 95892 93195 126803 106656 84107 79802 54179 -6727 32312 47637
8916D7637m2598L3898N0844L4507N6901J1114j4167n0220m2189o076l8348L862
$$ 47637 5039 38937 89781 124288 181189 192303 178136 127916 85727 79651 41303 45165
8904D5165N1980r778N210J2016R606l0196J7776L990j7988L0746j3316k8604o491
$$ 45165 97145 87367 92577 104593 114199 84003 101779 105769 87781 118527 105211 76607 70116
8891G0116m269j0439j3540J3724l0942k4459N6662M0675J3070L950j4464j0361
$$ 70116 65847 55408 41868 55592 24650 191 56853 97528 110598 114548 100084 89723
8879H9723M861r928k9988q020K0550L673q357Q945J1472j4039m0285L4287L9660
$$ 89723 94584 84656 54668 46648 67198 70871 62514 71459 82931 68892 28607 62894 102554
8866A02554j590l6712j509j0902k662k286l0358K0062L4602O0993p360k1059j8906
$$ 102554 100964 64252 62743 51841 49179 46893 16535 36597 71199 132192 124832 103773 84867
8853H4867Q535K9286m4528j772K8329m0546k0671n345O8297K4544J1920k0874
$$ 84867 93402 122688 78160 76388 104717 64171 43500 38155 106452 130996 142916 122042
8841A22042k6401j5187j7287k1955K9984M9710J9135J1184j1114m4108M743k9
$$ 122042 95641 80454 63167 41212 71196 120906 140041 151225 140111 96003 100746 100717
8829A00717r45L631j9793m9386K7039M9255k3536m2075m0244L6131M2705K649
$$ 100717 99772 103403 83610 34224 61263 110518 86982 44907 4663 40794 83499 86148
8817H6148k7158k3231K8605L4948M832l1272m271k6182j0431O775K0621l4189
$$ 86148 58990 35759 64364 99312 104144 72872 68601 42419 31988 38763 59384 25195
8805B5195j052M9534k8219M5291M2537j3521K3241J4829m6259l6313L1780K5658
$$ 25195 24143 73677 45458 90749 133286 119765 143006 157835 111576 75263 107043 132701
8793A32701N241l0817j2808K3327L4874K6081l1218K0881j3059j75J5832k1970
$$ 132701 137942 107125 94317 117644 152518 178599 147381 168262 155203 155028 170860 148890
8781A48890r021l2914M323n8119l0387J7459P0865J5293p335K2912J3816Q195
$$ 148890 139869 106955 111278 53159 22772 40231 111096 126389 119054 141966 155782 163977
8769A63977k9756R948K6253P931l5962n7537l4471L738J6989R991m7874l1202
$$ 163977 134221 144169 170422 178353 142391 84854 50383 54121 71110 81101 33227 2025
8757B025R577M4142M0673q802J0349m508m5180R50K6368J2266j1248j9719k6707
$$ 2025 11602 55744 96417 87615 97964 93456 48276 49226 75594 87860 76612 56893 30186
8744C0186J3523J2903J4407P190l2296k0642K74K2214J2009O3556j3030o360J426
$$ 30186 43709 56612 71019 78209 45913 25271 25545 47759 59768 123324 110294 103934 105360
8731A05360j9240N9883j4455m0876P424M8220k516N703m5517l5855j0280r18L2246
$$ 105360 86120 146003 131548 90672 98096 146316 143800 149503 103986 68131 57851 56933 89179
8718H9179N5017k4641K6185m4664k6688K5415K2190Q417N0J7793q200J204k2449
$$ 89179 144196 119555 145740 101076 74388 99803 121993 130410 130460 148253 140053 141257 118808
8705A18808m3622m937K3190o691M0919J1660k8193M69j734J1246M4332J3232m1524
$$ 118808 75186 70249 93439 86748 127667 139327 111134 111603 109869 121115 165447 178679 137155
8692A37155L488k0949j0148J4108L334J5144R267j3584J881n3931k0638k8489
$$ 137155 140643 119694 109546 123654 126988 142132 151399 137815 139696 85765 65127 36638
8680C6638J1831N8561N717K332l790l7139k2106K6559L3468Q493m0708J0648K3984
$$ 36638 48469 107030 112747 115079 111289 74150 52044 78603 112071 120564 79856 90504 114488
8667A14488L9925l4609m9883n1981m0512L716k275M7542N0264O163J3806L2594
$$ 114488 154413 119804 69921 17940 -22572 -18856 -21131 26411 76675 82838 96644 129238
8655A29238K111J2227l542K7541l1785m3201Q463L3087R652k9974j1356L2277
$$ 129238 131349 143576 140034 167575 135790 92589 101052 134139 143791 113817 102461 134738
8643A34738j20l7297J5546N2364m370k9060K3705j524k2183J2123J3528k4355
$$ 134738 134618 97321 112867 165231 160861 131801 155506 153982 131799 143922 157450 133095
8631A33095r381J6800l3608O476N2863N592N793J3462O1084Q8854j4824J2839
$$ 133095 123714 140514 106906 113382 166245 171837 177630 191092 252176 341030 326206 339045
8619C39045q476j100R856q2164j5473O460J1425k8165l1992l2375k4750J3878
$$ 339045 330569 329469 339325 257161 241688 248148 259573 231408 199416 167041 142291 156169
8607A56169j2577n4J408K0420k902k0855R02J34j3515P22j881n258j4124k4285
$$ 156169 143592 143538 144946 165366 162464 141609 142511 142645 129130 129852 127971 122713 108589 84304
8593H4304O35K3000j58L2439M9696L0509K0124O986j6825Q219L2166M5029P3750
$$ 84304 84939 107939 107781 140220 189916 220425 240549 247535 230710 238929 271095 316124 389874
8580C89874J2812o6071n6941o994m6991p3309j0692P1762m64l0641l5523k3505
$$ 389874 402686 336615 279674 272680 225689 152380 141688 213450 212986 182345 146822 123317
8568A23317l779j2904J1752K7672L7033L0033q297m0479k5385J8963m67q1577
$$ 123317 119538 106634 118386 146058 183091 213124 204827 164348 138963 157926 157459 75882
8556G5882o7877k3127N8509K1785j7711l7626K8485L6272l2030K851K5634M8234
$$ 75882 8005 -15122 43387 65172 47461 9835 38320 74592 42562 45413 71047 119281
8544A19281J5919l4974n1318M3958J3565l4899J0839j0398l0208k8109K4537Q465
$$ 119281 135200 100226 48908 92866 106431 71532 82371 71973 41765 13656 38193 46658
8532D6658O7578K4813k854l3145q709L9947k0081q1853j3713K581K1405K255Q932
$$ 46658 114236 139049 136195 103050 94341 134288 114207 32354 18641 21222 42627 44882 53814
8519E3814j5877M9759K1590O760k5395m634K8600k2262k4337L7372r985p1138
$$ 53814 37937 87696 109286 116046 90651 86017 114617 92355 68018 105390 95405 24267
8507B4267J3917M950M2626J0022K4524L4526l4714l8316n828L6369L6157j2729
$$ 24267 38184 43134 85760 95782 120306 154832 120118 81802 75974 112343 148500 135771
8495A35771k8038k8039m4526o615J7447L3688J3672k2432k2767l5458k0635K9810
$$ 135771 107733 79694 35168 28553 46000 79688 93360 70928 48161 12703 -7932 21878
8483B1878M6015L1733k0511l2952l8248J874M7236M0484j8036j5962M6899k3522
$$ 21878 67893 99626 79115 46163 7915 9789 57025 97509 79473 63511 110410 86888
8471H6888J201L038k2509o138J603M93L2761l2517k5373L0455O584l106k7148
$$ 86888 88089 91127 68618 62480 64083 64576 97337 64820 39447 69902 76486 73380 46232
8458D6232n5364l4940q456N1793P5748J6900L511l1514m745k9965L8413j494M5331
$$ 46232 -9132 -44072 -52528 -735 75013 91913 95424 63910 59165 29200 67613 66119 111450
8445A11450n6375K4548J9636n3046k5177K9858K242o2412j9182L5196P142K1327
$$ 111450 55075 79623 99259 46213 21036 50894 53136 -9276 -28458 6738 13880 35207
8433C5207q679L1552M4950J2241l0018K910M1797L246j0377L39k4676l6903l1984
$$ 35207 26528 58080 103030 115271 85253 88163 129960 133206 122829 123168 98492 61589 29605
8420B9605n0509k6424N1045R4497j0874l3903K3464J1828K456l5133n671L787
$$ 29605 -20904 -47328 3717 98214 87340 53437 76901 88729 91185 56052 50381 54168
8408E4168q5948m7805O1737L2412m335K70L91J0948l3964m59L6737J1003j4422
$$ 54168 -31780 -79585 -17848 14564 10229 10499 10890 21838 -12126 -12585 24152 35155 20733
8395B0733J8524l408j7850m8580j4452J2139L9501Q930K7568J613j4464o227p829
$$ 20733 39257 35849 17999 -30581 -45033 -32894 6607 15537 43105 44718 30254 24027 16198
8382A6198j4762K365O2694J4362l7611J2436j8480j9582N0718L1499k6710j643
$$ 16198 1436 3801 66495 80857 43246 55682 37202 17620 68338 99837 73127 71484
8370G1484P896l4369J6542L3141k2458j2382L448J8592j4662k069j2633R960Q7914
$$ 71484 79380 45011 61553 94694 72236 59854 63302 81894 67232 65163 52530 62490 150404
8357A50404J0708J2150l0527m3097n2210j2077L9804J0624P595J629K1051m557
$$ 150404 161112 173262 142735 99638 47428 35351 75155 85779 93374 95003 116054 111497
8345A11497K80k7927k3o168M718l8481j1562L4635k7386l1342r937L2891K5492
$$ 111497 111777 83850 83827 77659 82377 43896 32334 66969 39583 8241 -1696 31195 56687
8332E6687J5843j3571N954L2337j0428m4372K1997J9993k3005J5870q910j2441
$$ 56687 72530 58959 64913 97250 86822 42450 64447 84440 61435 77305 68395 55954
8320E5954L2114O097k2176J0224j8539k7926K5306l684L4560J0934J1755k2856
$$ 55954 88068 94165 71989 82213 63674 35748 61054 57370 91930 102864 114619 91763
8308I1763k2312m0740p524J2067K2024P936j9509L8973M5354k6345l4858l2367
$$ 91763 69451 28711 21187 33254 55278 63214 43705 82678 128032 101687 66829 34462
8296C4462o55k4537k0964K8017j2563j2379M6183k882n5127N6255N0907J6777
$$ 34462 33807 9270 -11694 16323 3760 -8619 37564 34682 -20445 35810 86717 103494
8284A03494K3587M4095k570J122K1454j3573k5261k1937p597K8229M8609k1968
$$ 103494 127081 171176 168606 169728 191182 177609 152348 130411 122814 151043 199652 177684
8272A77684n6089o0179l7201j2115J6371L2992J3088J0860J6694J5051n055p0081
$$ 177684 121595 61416 24215 12100 28471 61463 74551 85411 102105 117156 112101 42020
8260D2020p284K5536k4020j5424N475K7367L5927M4819j8457j3013K9509J6320
$$ 42020 34736 60272 36252 20828 26303 53670 89597 134416 115959 102946 132455 148775
8248A48775j9386O182J6795M207k7313j6742P3942M047n6011l8897l8740O0865
$$ 148775 129389 135571 152366 156573 129260 112518 186460 190507 134496 95599 56859 117724
8236A17724K0605r5342r3497M5557L2091M0351M2742R739m6590N387O5132K7755
$$ 117724 138329 42987 -50510 -4953 27138 67489 110231 119970 73380 78767 143899 171654
8224A71654k4360m8929m7375N264M2466L99n1912M2197K9241J2267m544q462j6257
$$ 171654 147294 98365 50990 56254 98720 99119 47207 89404 118645 130912 126368 117906 101649
8211A01649l1333k6305K9822l5479l0226k8591o510K3653M0470L868J1672l234
$$ 101649 70316 44011 73833 38354 8128 -20463 -26973 -3320 37150 41018 52690 49456
8199D9456R764o150K3242Q432P779k5703m6495m2632j3930L3205O376K5563M4134
$$ 49456 59220 53070 76312 84744 92523 66820 20325 -22307 -36237 -3032 3344 28907 73041
8186G3041j8775j0590L8458J9820O20k506l5047j5611l0005j1865k6771j1692
$$ 73041 54266 43676 82134 101954 102574 100068 65021 49410 19405 7540 -19231 -30923
8174c0923K2303j116J5111k1694M0522l4169l2837p937M5005N2148r860P543K2039
$$ -30923 -8620 -9736 5375 -16319 24203 -9966 -42803 -50740 -5735 46413 36553 44096 66135
8161F6135J7430j6325l9793n2029J2225J637l947K2603L7001M282J1159n867p380
$$ 66135 83565 67240 27447 -24582 -12357 -10720 -14667 7936 44937 49219 60378 54511 47131
8148D7131J0549L2872J8822n6625J6095M1483l11o1264l2839k5714o742N9416
$$ 47131 57680 90552 109374 52749 68844 110327 110016 48752 15913 -9801 -16543 42873
8136D2873M0535l1816l3920j7934Q167K601Q012K2879K4499P832K858L7403K7152
$$ 42873 83408 51592 17672 -262 7905 10506 18518 41397 65896 73728 76586 113989 141141
8123A41141l1794n0817m0954M4729L1774J9738J3454n1223n4660K6930J0569L8102
$$ 141141 109347 58530 17576 62305 94079 113817 127271 76048 21388 48318 58887 96989
8111I6989J335q0406m5571k856O5220J7871l8862m7259l521L4850j0111p174Q439
$$ 96989 98324 17918 -27653 -30509 34711 52582 13720 -33539 -37060 -2210 -12321 -19495 -11056
8098a1056J8911k8783j7068K1196n377M2865J7720p8057P737L9639m249j7065
$$ -11056 7855 -20928 -37996 -16800 -22177 20688 38408 -39649 -31912 7727 3478 -13587
8086a3587O15n0891K7438L6329M8866R618j7733K2662K4191J2176j6113k5103
$$ -13587 -12972 -63863 -36425 -96 48770 58388 40655 63317 87508 99684 83571 58468
8074E8468K0627J8838J99l3599m3167R500k603l0931R006J3982j2209J5791R19
$$ 58468 79095 97933 98132 64533 21366 30866 28263 -2668 6338 20320 8111 23902 24821
8061B4821L1975K7186K5678n2835k5138K679l1120k6029L573M4666J1495k2767
$$ 24821 56796 83982 109660 56825 31687 34366 3246 -22783 -19210 25456 36951 14184
8049A4184K7788J8534N3036J6210k2454k5897p50N5617j724Q653m133m8884L0409
$$ 14184 41972 60506 113542 129752 107298 81401 80651 136268 134544 143197 139064 90180 120589
8036A20589L4074p245o7809q6464k4200K3308M3848K3146L2035K0868J6357P148
$$ 120589 154663 147418 79609 -6855 -31055 -7747 36101 59247 91282 112150 128507 135655
8024A35655L6348k5533l0793o4311o450k059o928L5667n6437n4070K0227N6884
$$ 135655 172003 146470 115677 51366 44916 42857 35929 71596 15159 -38911 -18684 38200
8012C8200J7170r542K047l0403K6184O3837M4192k4052m3362j5995k3746M3457
$$ 38200 55370 45828 47875 17472 43656 107493 151685 127633 84271 68276 44530 87987
8000H7987Q4220k4071o9416j3638K5284J4869k140l7417L4491K582j7283k8523
$$ 87987 172207 148136 78720 65082 90366 105235 103095 65678 100169 102751 85468 56945
7988E6945J7420p0067k2022r11R944J0191O7561M6351l310j4446l1883k6902l8368
$$ 56945 74365 4298 -17724 -18635 -8691 1500 69061 115412 112102 97656 65773 38871 503
7975E03L1425K8497P353j0571j6719l7580m9501l4087K2024K3693j282J9653J5040
$$ 503 31928 60425 67778 57207 40488 2908 -46593 -80680 -58656 -34963 -36245 -16592 -1552
7962a552m3614j3599K3198J5215O457K5415j4488K0547L4029N1824l2799k2605
$$ -1552 -45166 -58765 -35567 -20352 -13895 11520 -2968 17579 51608 103432 70633 48028
7950D8028J1789J7944j9393R161J6581j6016l239m399k4481K7571L4611k8037
$$ 48028 59817 77761 58368 67529 84110 68094 64855 60456 35975 63546 98157 70120
7938G0120l4528P13K021L744J6369m8559n1264K6735L4963l0754l4458Q723N2442
$$ 70120 35592 36305 38326 42070 58439 9880 -41384 -14649 20314 -10440 -44898 -36175 16267
7925A6267K1040j3729K524j1658q756j505N921J0939K9357o434l3327k2768J9415
$$ 16267 37307 23578 26102 14444 5688 4183 10104 21043 50400 43966 10639 -12129 7286
7912G286j1170N508k717J7155M8459K2967P33j5403K4394j8274q404J9354o4638
$$ 7286 -3884 1624 -1093 16062 64521 87488 88221 72818 97212 78938 70534 89888 25250
7899B5250m6438M147L7096K7430j8848O271N838r196l1115n3112J7254O8168P101
$$ 25250 -21188 -17041 20055 47485 28637 34908 40746 31550 435 -52677 -35423 32745 39846
7886C9846l7163N851J5298K0666J8601k8080O0395M8463k2453m9581k5770J7666
$$ 39846 2683 8534 23832 44498 63099 35019 95414 143877 121424 71843 46073 63739
7874F3739j4827J4678k2209l7546N845l0939K6482M5841P936m0033j3438N04L3426
$$ 63739 48912 63590 41381 3835 9680 -21259 5223 51064 59000 18967 5529 6033 39459
7861C9459M1138J3477N465k2029j4427l3915l2380o5887j6642L1492K319L6651
$$ 39459 80597 94074 99539 77510 63083 29168 -3212 -69099 -85741 -54249 -51930 -15279
7849a5279j6941k5522K908J6788M4665M7373j1823l4311K371j1253j3365k0266
$$ -15279 -32220 -57742 -54834 -38046 6619 53992 42169 7858 10229 -1024 -14389 -34655
7837c4655L6588M756K9925R763j8730K265k0332m4362j0118l1502J0396O1636
$$ -34655 1933 6689 36614 46377 27647 29912 9580 -34782 -44900 -76402 -66006 -4370
7825d370P200l3209k2361Q767L3670L6405j4042J2497K8943m43m2164l552l0761
$$ -4370 2830 -30379 -52740 -43973 -10303 26102 12060 24557 53500 53057 10893 7341 -23420
7812b3420M0572o342n9046n808J4964L3553l1205J2232L01m26k1191K7609M2412
$$ -23420 17152 10810 -48236 -54044 -39080 -5527 -36732 -24500 -24199 -24625 -45816 -18207 24205
7799B4205k1353l8099j6800J9639J8424K2714p2259q536K8038J33k798K4852N3141
$$ 24205 2852 -35247 -52047 -32408 -13984 8730 -63529 -72065 -44027 -43894 -46692 -21840 31301
7786C1301j588m8740M2747K4508N485l9507n4481M230M739J1293k851P573L7598
$$ 31301 29713 -19027 23720 48228 53713 14206 -40275 -36045 -31306 -20013 -22864 -15291 22307
7773B2307n055l9980l474M953K5168j2672l8215P097O0782k3095k5426J3196K4965
$$ 22307 17252 -22728 -26202 -21249 3919 -8753 -46968 -39871 20911 -2184 -27610 -14414 10551
7760A0551J7290j118L3328p955j0438o936J3008l6046j9379K1977J9281N3380
$$ 10551 27841 26723 60051 52096 41658 34722 47730 11684 -7695 14282 33563 86943
7748H6943m807l2870j5666k5639k6021k0363J2034m33k3361q264l8478L7363O4153
$$ 86943 82136 49266 33600 7961 -18060 -38423 -26389 -26822 -50183 -58447 -96925 -59562 4591
7735D591O0397l3795l2411K9479J0727J6874j4902k825l8779q511J8527M1781
$$ 4591 64988 31193 -1218 28261 38988 55862 40960 38135 -644 -9155 9372 51153
7723E1153l522m4581P273L9284M366j1571r086K673j829Q786l0357L225N2500
$$ 51153 47631 3050 10323 49607 53973 42402 33316 35989 34160 42946 12589 15814 68314
7710F8314j1373k5535j2066R318l3724k3922J0094q269l472n486k982O918L715
$$ 68314 56941 31406 19340 28658 -5066 -28988 -18894 -27163 -30635 -36121 -39103 -32185 -28470
7697b8470K054j0220J3795L1466M859Q904j2220m76n477L515L242J631k0963m505
$$ -28470 -26416 -36636 -22841 8625 13484 22388 10168 9692 4215 7730 10972 12603 -8360 -12865
7683a2865n017Q20k9099J3213J0214J5452K0367m935J5970K1795l4522M967q303
$$ -12865 -17882 -17062 -46161 -32948 -22734 -7282 13085 8150 24120 45915 11393 16360 8057
7670H057j5101M2415m088k604J0624k2896J3748K6262k7058l5711j4940j8724
$$ 8057 -7044 35371 31283 28679 39303 16407 30155 56417 29359 -6352 -21292 -40016
7658d0016j1943N7270N0854j9549k8412M6904K8026k5314l104K7185l2679l3381
$$ -40016 -51959 5311 56165 36616 8204 55108 83134 57820 54716 81901 49222 15841
7646A5841j4694j4825O624J1294k4255k7596J9707K2119l2038M7291J4561j4778
$$ 15841 1147 -13678 -7054 4240 -20015 -47611 -27904 -5785 -37823 9468 24029 9251
7634I251k843J3869j5175J9257L1434j4345j5361J5230J0781p970J9653o927k4515
$$ 9251 6408 20277 5102 24359 55793 41448 26087 41317 52098 44128 63781 56854 32339
7621C2339J495N5502M1451j0471n5060n781K075K6105k1170n4629j7383K5442
$$ 32339 33834 89336 130787 120316 65256 59475 61550 87655 66485 11856 -5527 19915
7609A9915L9874n531l3502n4138l9762L510K8154K4595J2862k9071j2990L9026
$$ 19915 59789 54258 20756 -33382 -73144 -69634 -41480 -16885 -4023 -33094 -46084 -7058
7597g058L0861p821k6015K67M402Q031L0386n663k2507k5332o0954j5519L6643
$$ -7058 23803 15982 -10033 -9766 -5364 2667 33053 27390 4883 -20449 -81403 -96922 -60279
7584f0279M3294L6804n789j7907q672k2371n046Q936K8035M0981l0985J9339L6469
$$ -60279 -16985 19819 14030 -3877 -12549 -34920 -39966 -31030 -2995 37986 7001 26340 62809
7571F2809k5631j8390k7600L893r449l963P892J1024J7709l894l4319o370Q8405
$$ 62809 37178 18788 -8812 -4919 -14368 -18331 -10439 585 18294 14400 -19919 -26289 62116
7558F2116J0545l2570L4135m3573J3033Q964K7165m0019k1044j5115m2530M3459
$$ 62116 72661 40091 74226 30653 43686 52650 79815 39796 18752 3637 -38893 4566
7546D566j315k6538k0334N1915K9947L0905j205k4591k0190p895j4990K891N0512
$$ 4566 3251 -23287 -43621 8294 38241 69146 67941 43350 23160 15265 275 3166 53678
7533E3678j9403n310O068J9160m4087j1265k0411l7453q052L9262M2797l7092
$$ 53678 34275 28965 35033 54193 10106 -1159 -21570 -59023 -67075 -27813 14984 -22108
7521b2108P576M2301M4824j8028j7787N7J406m6080n5198p996j0044M9662J5486
$$ -22108 -14532 27769 72593 54565 36778 36835 38241 -7839 -63037 -71033 -81077 -31415 -15929
7508a5929k3209o759K4944L8114p751k1471j5456j9442N818l94K8634q676j1577
$$ -15929 -39138 -45897 -20953 17161 9410 -12061 -27517 -46959 -41141 -41535 -12901 -21577 -33154
7495c3154j2920J2722J74K8805K182k9506j097K2385M2775l645Q824L976J4663
$$ -33154 -46074 -33352 -33178 -4373 -2191 -31697 -32794 -10409 32366 28721 37545 41521 56184
7482E6184m4634o4403l1906N290L3981L4451K8039J8001J013k7704N795J377K2579
$$ 56184 11550 -52853 -84759 -79469 -45488 -11037 17002 35003 36016 8312 14107 15484 38063
7469C8063k7005j6199J7437l1372K0140O4l9981j5148k3748M3779P7250R607o0581
$$ 38063 11058 -5141 12296 -19076 1064 1128 -38853 -54001 -77749 -33970 43280 52887 -7694
7456g694k8391J0952K7792O8574j7154k1977N222M39m0944l0957l2589N145K8006
$$ -7694 -36085 -25133 2659 71233 54079 32102 37324 37763 -3181 -34138 -66727 -61582 -33576
7443c3576K0393O3955J2695n0382n0429L950L2703K9967L9106M5306l1695o2484
$$ -33576 -13183 50772 63467 13085 -37344 -33394 -691 29276 68382 113688 81993 19509
7431A9509p5881l9128n879J8309M5234M2628o534k1000J9495L0352j310q60k9842
$$ 19509 -56372 -95500 -101379 -83070 -37836 4792 -1742 -22742 -3247 27105 25795 24935 -4907
7418d907k7604l4997k0930L8456O7447k0145K1975l0147j8820K9849N7539K185
$$ -4907 -32511 -67508 -88438 -49982 17465 -2680 19295 -10852 -29672 177 57716 59901
7406E9901m3815O636K3722J019K1014J1895k4296n0786l2068K5535J2199K2968
$$ 59901 16086 22722 46444 47463 68477 80372 56076 5290 -26778 -1243 10956 33924
7394C3924l4010k5071l4941L0596K5939k2867j3729M3013N9105q091n3161j2725
$$ 33924 -86 -25157 -60098 -29502 -3563 -26430 -40159 2854 61959 53868 707 -12018
7382a2018l3P349k3862o3476K5175K0823J5808K6989k5519R038l905q002o659
$$ -12018 -12051 -4702 -28564 -92040 -66865 -46042 -30234 -3245 -28764 -19726 -23631 -31633 -38292
7369c8292Q036k8539K1090M4724L0062m097n8827j0241J0821n969k3049K1462
$$ -38292 -30256 -58795 -37705 7019 37081 32984 -25843 -36084 -25263 -31232 -54281 -32819
7357c2819M3022j0777J6204P905m2139L662O9054K0019q6666P312L6761P862N222
$$ -32819 10203 -574 15630 23535 -18604 -14942 54112 74131 -12535 -5223 31538 39400 44622
7344D4622m1409P238K640k0156r4806J6033O2487K5072j4190L5063n280P977L1668
$$ 44622 3213 10451 13091 -7065 -101871 -85838 -23351 1721 -12469 22594 17314 25291 56959
7331E6959q592n3285p209K2418L9130k1121M806p401k069l067l5911M107j0735
$$ 56959 48367 -4918 -12127 10291 49421 28300 33106 25705 23636 20569 -15342 -11235 -21970
7318b1970j6184q890M2668j4830L5298k667J741J9875k7980N620J0688L4271j3804
$$ -21970 -38154 -47044 -4376 -19206 16092 13425 15166 35041 7061 12681 23369 57640 43836
7305D3836L049k4388l5684L3530l1910k8798O120K884J5335K3005J2885J0087
$$ 43836 46885 22497 -13187 20343 -11567 -40365 -34245 -31361 -16026 6979 19864 29951
7293B9951l5953k9355R641R356k9944L0393J3176j2948m4552n422k3903K5912
$$ 29951 -6002 -35357 -25716 -16360 -46304 -15911 -2735 -15683 -60235 -65657 -89560 -63648
7281f3648M0871M8341k6044q180J0340K2699j1350l602Q635m545K0948J0030k5063
$$ -63648 -22777 25564 -480 -8660 1680 24379 13029 9427 18062 13517 34465 44495 19432
7268A9432N978J8814l4769q1338k5250L9885K3384L7585K7008j5869l6863j7122
$$ 19432 25410 44224 9455 -71883 -97133 -57248 -33864 3721 30729 14860 -22003 -39125
7256c9125L7743l0243j1395M7418J9168j3074p978O761j5231L785K1331m2226
$$ -39125 -1382 -31625 -43020 4398 23566 10492 2514 9275 -5956 -2171 19160 -23066
7244b3066k8733K3478K9291j5059J2261K3028j7157R367K9252j1558l3705K2383
$$ -23066 -51799 -28321 970 -14089 -1828 21200 4043 13410 42662 31104 -2601 19782
7232A9782N2726K664j9432p5164j6350K4986O3464P4556m39m1978o8522m9573
$$ 19782 72508 75172 55740 -19424 -35774 -10788 52676 127232 126793 84815 16293 -33280
7220c3280L3422J3070L4774k232j7542l7174J0387J5852k9561k2388J8762O60
$$ -33280 142 13212 47986 45754 28212 -8962 1425 17277 -12284 -34672 -15910 -15250
7208a5250K9501K4989l9189j7707l3462j3092L9687K4097k4467m852J8719k8293
$$ -15250 14251 39240 51 -17656 -51118 -64210 -24523 -426 -24893 -29745 -11026 -39319
7196c9319n9L22r585m954K6248j005l1059K4843M2822J574q2901K728J0903L7153
$$ -39319 -39378 -39056 -48641 -53595 -27347 -28352 -59411 -34568 8254 9828 -73073 -70345 -59442 -22289
7182b2289K0315k2905l4253J3047K3702J0108J1063l13K5691P269r123k4769N557
$$ -22289 -1974 -24879 -59132 -46085 -22383 -12275 -1212 -1525 24166 31435 22312 -2457 3100
7169C100j630J6191j8773j3410l8530M589J0331O916P7905L9073K0253m3220j1151
$$ 3100 1470 17661 -1112 -14522 -53052 -48463 -38132 -31216 46689 85762 106015 62795 51644
7156E1644k9909n6866M420M488K5357q488N519j4433J0588K444J7666r349j3186
$$ 51644 21735 -35131 -30711 -26223 -866 -9354 -3835 -18268 -7680 -5236 12430 3081 -10105
7143a0105J494M4428P3555l3335o3o307n1687j8679K8349K8927n1050j04468k9031
$$ -10105 -8611 35817 109372 76037 75974 69667 17980 -699 27650 56577 5527 -98941 -127972
7130a27972L4570N6072J3070j4990K1670q937k4858n2949m892L9008O562l0685
$$ -127972 -93402 -37330 -24260 -39250 -17580 -26517 -51375 -104324 -109216 -70208 -63646 -94331
7118i4331K3814m802j7761O0553L1015j327R036j6619j5991N3479K2161M704L532
$$ -94331 -70517 -75319 -93080 -32527 -1512 -2839 6197 -10422 -26413 27066 49227 53931 57463
7105E7463k3953j1538k9156J6738K6322K8789K2981l7334n4173R171L3746o633
$$ 57463 33510 21972 -7184 9554 35876 64665 87646 50312 -3861 5310 39056 32423
7093C2423o3027N480J8835o960m9167j1788L8875J4010Q001J331o7457j6402M4557
$$ 32423 -30604 -25124 -6289 -13249 -62416 -74204 -35329 -21319 -13318 -11987 -79444 -95846 -51289
7080e1289j3679J995L748J1692p51j9348O045k7778J6382Q020J0667L1728K9062
$$ -51289 -64968 -62973 -59225 -47533 -48284 -67632 -61587 -89365 -72983 -64963 -54296 -22568 6494
7067F494q104q726N586q45p0170m7479K0624J806j2047J7914O4618O3595K7184
$$ 6494 -1610 -10336 -4750 -5595 -75765 -123244 -102620 -100814 -112861 -94947 -30329 33266 60450
7054F0450J9873j0687j2888L5494j6492o2546m4755l6440M9823O8764l1532l5630
$$ 60450 80323 69636 56748 92242 75750 13204 -31551 -67991 -18168 50596 19064 -16566
7042a6566k0003J0632J0344K3242M5849q204k7673n7503K5300J9568l7925L1251
$$ -16566 -36569 -25937 -15593 7649 53498 45294 17621 -39882 -14582 4986 -32939 -1688
7030a688M5142l571J4116m85K5006N84j717R422k4858l9016k321m4637k7169J676
$$ -1688 43454 39883 53999 53514 78520 79104 77387 86809 61951 22935 20614 -24023 -51192 -49516
7016d9516L467j4041J9666K2388M3371M2539m4677n2079Q668K6436n730k764J5069
$$ -49516 -46049 -60090 -40424 -18036 25335 67874 23197 -28882 -20214 6222 492 -2272 12797
7003A2797p252K7529M4402K1252m3792L770l775k7943m9722j2304M0141J9446
$$ 12797 5545 33074 77476 98728 54936 58706 54931 26988 -22734 -35038 5103 24549
6991B4549m6265N821K4317k8829P078l802K5455K6434N404k3195n2134j0475J1951
$$ 24549 -21716 -15895 8422 -20407 -13329 -17131 8324 34758 40162 16967 -35167 -45642 -33691
6978c3691L8128R042l2183r84k047j6957K1748j1998m0730J0201L9311K4024l0011
$$ -33691 4437 13479 -18704 -19688 -21735 -38692 -16944 -28942 -69672 -59471 -20160 3864 -26147
6965b6147n5577l892K0311M7954m3721l037k1228K8291L3394m9583j7350L0991
$$ -26147 -81724 -85616 -65305 -17351 -61072 -64109 -85337 -57046 -23652 -73235 -90585 -59594
6953e9594L8137n49k0354n4l433j7512k0026M0127J762L2907l184k7304M608N1391
$$ -59594 -21457 -22006 -42360 -42414 -45847 -63359 -83385 -43258 -41496 -8589 -11773 -39077 -34469 16922
6939A6922k6847j2051k1534l7806N2884K3421k3588q326J1160J7998J8738K6722
$$ 16922 -9925 -21976 -43510 -81316 -28432 -5011 -28599 -36925 -25765 -7767 10971 37693
6927C7693l144r80l1062k0715L2820K6110K9140J0416m4902q2951k6769K0780
$$ 37693 34549 33569 2507 -18208 14612 40722 69862 80278 35376 -47575 -74344 -53564
6915e3564N483O383J7727K2744P283m838p482J0693j4838j2463j588j9690N089
$$ -53564 -48081 -41698 -23971 -1227 6056 1218 -6264 4429 -10409 -22872 -24460 -44150 -39061
6902c9061O917k5719L36j4410J7327J6304L9734Q400Q974k2204o3994J5059N5527
$$ -39061 -32144 -57863 -57527 -71937 -54610 -38306 1428 9828 18802 -3402 -67396 -52337 3190
6889C190q124j5339J1026M5261L9411o674n4038k5423j4127K4512M688J0809j9746
$$ 3190 -4934 -20273 -9247 36014 75425 68751 14713 -10710 -24837 -325 4363 15172 -4574
6876d574j7258J0582p787J3285r723k498j5082j1044R658J9624K3902L8645j1862
$$ -4574 -21832 -11250 -19037 -5752 -15475 -17973 -33055 -44099 -34441 -14817 9085 47730 35868
6863C5868j1984k9358L760n2370o612L9321K5834l409J4475j5876q049m0445K0500
$$ 35868 23884 -5474 -1714 -54084 -60696 -21375 4459 1050 15525 -351 -8400 -48845 -28345
6850b8345K2058J3214P923J4163k8374J1666J4916n5219r298L4582L7059J8329
$$ -28345 -6287 6927 14850 29013 639 12305 27221 -27998 -37296 -2714 34345 52674
6838E2674k973P099k5386p3570n0518n690q987J7952O566O0149M6019j9269j7772
$$ 52674 49701 56800 31414 -42156 -92674 -98364 -107351 -89399 -82833 -22684 23335 4066 -13706
6825a3706m2625j1873L4956N7126j6150L0823Q661k7669o6151K78M9431J7605
$$ -13706 -56331 -68204 -33248 23878 7728 38551 47212 19543 -46608 -46330 3101 20706
6813B0706l120Q622N650M103m3355m8377L4378M5684O133n1265n8978M3728L8167
$$ 20706 17586 26208 31858 35961 -7394 -55771 -21393 24291 30424 -20841 -79819 -36091 2076
6800B076n1395j2227r724l0993N4051J4339L944J9688L6076m7233o0979k2344
$$ 2076 -49319 -61546 -71270 -102263 -48212 -33873 -29929 -10241 25835 -21398 -82377 -104721
6788a04721K9313K1972o4746M29L0058L4353L6543j4986J69L0819J4428k7277
$$ -104721 -75408 -53436 -118182 -117753 -87695 -53342 -16799 -31785 -31616 -797 13631 -13646
6776a3646j6307j6723j4304L571q874p041J1456L7020k0303k361q636K96N134
$$ -13646 -29953 -46676 -60980 -57409 -66283 -73324 -61868 -24848 -45151 -47512 -56148 -55852 -50718
6763e0718K2908q972K2523K1610l0807J9543M6065k6029m3979N965P248R052j3209
$$ -50718 -27810 -36782 -14259 7351 -23456 -3913 42152 16123 -27856 -21891 -14643 -5591 -18800
6750a8800J1745j5166N8043J4781k9000J2202j9940k6213m04J4121K2724P2935
$$ -18800 -7055 -22221 35822 50603 21603 33805 13865 -12348 -12752 1369 24093 97028
6738I7028j6037m9824N748k9336N499P374p853N1439k9767l4579K6815j9705j9189
$$ 97028 80991 31167 36915 7579 13078 20452 12599 64038 34271 -308 26507 6802 -12387
6725a2387J4217J6051o086J829q665N1888n412j7357N2471L5269j5472o7080j8534
$$ -12387 1830 17881 11795 13624 4959 56847 51435 34078 86549 121818 106346 39266 20732
6712B0732J6709J1733p350l1210r099j1315k754L3533j1145k2409j2919K5168
$$ 20732 37441 49174 41824 10614 1515 -9800 -12554 20979 9834 -12575 -25494 -326
6700c26K5312k4565j0588J5271M8907J2851m4432K4555j4766j6038M0646J2344
$$ -326 24986 421 -10167 5104 54011 66862 22430 46985 32219 16181 56827 69171
6688F9171j5290l1835J6991p6947k2563K518J4194Q844K7199O882J966K4639J1739
$$ 69171 53881 22046 39037 -37910 -60473 -57955 -43761 -34917 -7718 -836 1130 25769 37508
6675C7508j5503K1278L0219k0727O076l6530n74j1701J2874M2693j2064p7235
$$ 37508 22005 43283 73502 52775 58851 22321 21747 10046 22920 65613 53549 -23686
6663b3686l7447Q931K2723K0388k4054J3683K3888m4812k4844L3360o4456K2014
$$ -23686 -61133 -52202 -29479 -9091 -33145 -19462 4426 -40386 -65230 -31870 -96326 -74312
6651g4312M9071j1500j734O232L077O503J413k2008j5127m5834J3837L9678P1035
$$ -74312 -25241 -36741 -38475 -32243 -29166 -22663 -21250 -43258 -58385 -104219 -90382 -50704 20331
6638B0331K5047k2745J2287L0839m961L1089m1623m3220L4051L1820N566o0829
$$ 20331 45378 22633 34920 65759 60798 91887 50264 7044 41095 72915 78481 17652
6626A7652n9990k7794l487L1970Q985j6788K8463k182l716J3732j5068j6819j0695
$$ 17652 -42338 -70132 -73619 -41649 -32664 -49452 -20989 -23171 -26887 -13155 -28223 -45042 -55737
6613e5737K6672J3820K3641L5914K3815K0158l4931l291N360o2903k3528k7037
$$ -55737 -29065 -15245 8396 44310 68125 88283 53352 50061 55421 -7482 -31010 -58047
6601e8047P807p898Q792M8206k581J5026N0382K5377m3146p0541j0870M8829j4356
$$ -58047 -50240 -58138 -49346 -1140 -3721 11305 61687 87064 43918 -26623 -37493 11336 -3020
6588c020k2604j3434Q46L1081n7791k2223O916L8873P2151l185k5885l6265m4038
$$ -3020 -25624 -39058 -38212 -7131 -64922 -87145 -80229 -41356 30795 27610 1725 -34540 -78578
6575g8578j7532K1416Q5657N7747m5166l2036l9377P366J4226M087j4333K5310
$$ -78578 -96110 -74694 10963 68710 23544 -8492 -47869 -40503 -26277 -22190 -36523 -11213
6563a1213K4137p362m4049l638L7610N355K6239L5633j2011k8807k7056j0748
$$ -11213 12924 5562 -38487 -42125 -4515 840 27079 62712 50701 21894 -5162 -15910
6551a5910J048l3565P4784L4785j5997k7625m1812N644O357l0177K2709K5932
$$ -15910 -14862 -48427 26357 61142 45145 17520 -24292 -18648 -12291 -42468 -19759 6173
6539F173M3316k518k8048J1942K778k0455J5386J4029k9506n4348K9711m215R102
$$ 6173 49489 46971 18923 30865 33643 13188 28574 42603 13097 -41251 -11540 -15755 -6653
6526f653M37K1247J4614k7252k4891K382K5027j3727k1837r699m8543K1787L4686
$$ -6653 -6216 15031 29645 2393 -22498 -20116 4911 -8816 -30653 -40352 -88895 -67108 -32422
6513c2422q275J975l211j1416K2191q915J8020L0352M2806m6085k4514K0714J6606
$$ -32422 -40697 -38722 -41933 -53349 -31158 -40073 -22053 8299 51105 5020 -19494 1220 17826
6500A7826N775m5013M996P667k5801J3847k1588Q842O5101j0k7730K6481q8042
$$ 17826 23601 -21412 -16416 -8749 -34550 -20703 -42291 -33449 31652 31642 3912 30393 -57649
6487e7649k5325O2549K5544l1262m6392p657j8447L2100l02K6211L2099M7807
$$ -57649 -82974 -20425 5119 -26143 -72535 -80192 -98639 -66539 -66841 -40630 -8531 39276
6475C9276M6251k9543q997m7098J174J8240j0506k1100j9685m2522J5417K0617
$$ 39276 85527 55984 46987 -111 1063 19303 8797 -12303 -31988 -74510 -59093 -38476
6463c8476P327K793n142n211L5805j1786m1647l327P1218Q609l2631K7349k733
$$ -38476 -31149 -28356 -33498 -38709 -2904 -14690 -56337 -59664 11554 20163 -12468 14881 12148
6450A2148m7133m3112K818O118n7966n439O6929N9092J0921j4118n738q691k8410
$$ 12148 -34985 -78097 -75279 -69161 -127127 -132566 -65637 -6545 4376 -9742 -15480 -24171 -52581
6437e2581K8571L4704j2388L980J1756j8799N8791k4301l0499k4927n094J4039
$$ -52581 -24010 10694 -1694 2286 14042 -4757 54034 29733 -766 -25693 -30787 -16748
6425a6748J1312j9362N2196k900k0605N2454Q055J2234n367k2834o9352l7563
$$ -16748 -5436 -24798 27398 24498 3893 56347 64402 76636 71269 48435 -20917 -58480
6413e8480K8039J3601k4332k4618j6526P9972M8622j4979j2692k869k4997k324
$$ -58480 -30441 -16840 -41172 -65790 -82316 -2344 46278 31299 18607 15738 -9259 -11583
6401a1583o808k2539n030L5661L1871J6988J3640k5726l8180j5305L3480m6159
$$ -11583 -18391 -40930 -45960 -10299 21572 38560 52200 26474 -11706 -27011 6469 -39690
6389c9690p848N1049k758j5811K4777R832k1801j1508n2590j2016K4759M334L2150
$$ -39690 -47538 3511 753 -15058 9719 19551 -2250 -13758 -66348 -78364 -53605 -49271 -17121
6376a7121J4856j6415k2041j3369n943N8382p419l2947j1130j6268P465n90L1242
$$ -17121 -2265 -18680 -40721 -54090 -60033 -1651 -9070 -42017 -53147 -69415 -61950 -62540 -31298
6363c1298M9287M127k777l9194M4974l827K8247N241p935j01875l9182R258L9745
$$ -31298 17989 22116 19339 -19855 25119 21292 49539 54780 46845 -55030 -94212 -84954 -45209
6350d5209N3002Q77J3347J6270J592Q402n5454n1549J321Q675J8907o158L8325
$$ -45209 7793 8670 22017 38287 39879 48281 -7173 -58722 -57401 -48726 -29819 -35977 2348
6337B348N0600l8727p0261J6238J9659j0639k565o9661k1657M0118Q6178O880
$$ 2348 52948 14221 -56040 -39802 -20143 -30782 -33347 -103008 -124665 -84547 1631 8511
6325H511k1296n1124k7877o264K0530R7905L7041l1554j598K868M443l8749l3169
$$ 8511 -12785 -63909 -91786 -98050 -77520 20385 57426 25872 24274 27142 31585 -7164 -40333
6312d0333K8920q94k6590J8929J3872m3931N679K3755K8636K0041K6114K689k3139
$$ -40333 -11413 -12307 -38897 -19968 -6096 -50027 -44348 -20593 8043 28084 54198 56887 33748
6299C3748l3347o2970j4068Q658O4919R4978l581n6988K424m086j4009j6269P72
$$ 33748 401 -62569 -76637 -67979 -3060 91918 88337 31349 33773 29687 15678 -591 181
6286A81L5691j6176O984N5770N951k3597l5636j6847K3123m4516m0030J6147M1109
$$ 181 35872 19696 26680 82450 88401 64804 29168 12321 35444 -9072 -49102 -32955 8154
6273H154J5224K0505j8179k9518O072j1728q627n530K2603M2856m815m7269j38
$$ 8154 23378 43883 25704 -3814 2258 -9470 -18097 -23627 -1024 41832 37017 -10252 -10390
6260a0390J244k1166j684M6670J5724l6705k5913m7220L5983N1845L7073J5817
$$ -10390 -9146 -30312 -31996 14674 30398 -6307 -32220 -79440 -43457 8388 45461 61278
6248F1278k0609o2831j6198N6565n911m6585j0101M029K2513L3294O217m8080
$$ 61278 40669 -22162 -38360 18205 12294 -34291 -44392 -40363 -17850 15444 21661 -26419
6236b6419J2575L850k6882R016M220J2777K6542j3777J1591l267N057L123m482
$$ -26419 -13844 -9994 -36876 -27860 -23640 -10863 15679 1902 13493 10226 15283 18406 13924
6223A3924J484k7520J3683k7260o4154K5819N2307j0150l7454J3506K3092k2596
$$ 13924 15408 -12112 1571 -25689 -89843 -64024 -11717 -21867 -59321 -45815 -22723 -45319
6211d5319j7973K5539L0865n5060k8531M6996K6201K2177j3656l0714j7922l2137
$$ -45319 -63292 -37753 -6888 -61948 -90479 -43483 -17282 4895 -8761 -39475 -57397 -89534
6199h9534K1344L9691L4486j8218L0841l1550n8223p601K9221M2015K5219k1927
$$ -89534 -68190 -28499 5987 -12231 18610 -12940 -71163 -78764 -49543 -7528 17691 -4236
6187d236l4540m7064j1816q872K5730J309K5170m3210k1095l214K0160k1941k3045
$$ -4236 -38776 -85840 -97656 -106528 -80798 -79489 -54319 -97529 -118624 -121838 -101678 -123619 -146664
6174a46664N0970J5152J1906L113M564o66M0002K8338M9101L9962l0607R230l0685
$$ -146664 -95694 -80542 -68636 -65523 -60959 -61625 -21623 6715 55816 95778 65171 74401 43716
6161D3716m2483L086R067K1955j8846l4614m748l0612n0344j4283M469K0666N0346
$$ 43716 1233 4319 13386 35341 16495 -18119 -22867 -53479 -103823 -118106 -113637 -92971 -42625
6148d2625J3792j5628L0451l2046J0623R79m4191O226l3001k1976K7383O7320
$$ -42625 -28833 -44461 -14010 -46056 -35433 -34454 -78645 -72419 -105420 -127396 -100013 -32693
6136c2693r624J0253k660n1615j1127l54k4196K652O7319m617m7151M6259L9839
$$ -32693 -42317 -32064 -34724 -86339 -97466 -97820 -122016 -119364 -52045 -56662 -103813 -57554 -17715
6123a7715N330p112J6746l1776j014J4332k787m325K0720K148P425R685j5515
$$ -17715 -12385 -19497 -2751 -34527 -35541 -21209 -23996 -28321 -7601 -5453 1972 11657 -3858
6110c858k6635J2792K325M540o3381K3855L8565K8944J3518k3891n9948m652K0980
$$ -3858 -30493 -17701 -15376 -10836 -74217 -50362 -11797 17147 30665 6774 -53174 -57826 -36846
6097c6846N312j5781J79j2196J4442M118M1117k585l6745q698M7753N335p990
$$ -36846 -31534 -47315 -47136 -59332 -44890 -40772 345 -2240 -38985 -47683 70 5405 -2585
6084b585P331K0446n952L6755k312m3261k7446L182k7575K8869L7765N435M619
$$ -2585 4746 25192 19240 55995 53683 10422 -17024 -13842 -41417 -12548 25217 30652 35271
6071C5271J5005J3323O488l3664o015J6270O666l581L9716k8174m7513j4663j2069
$$ 35271 50276 63599 70087 36423 30408 46678 53344 49763 89479 61305 13792 -871 -12940
6058a2940K4923K5780L0247m5689n7120k3006L2603J9577j4938K2157Q164J593
$$ -12940 11983 37763 68010 22321 -34799 -57805 -25202 -5625 -20563 1594 9758 11351
6046A1351K0553j945K4033J1945m9965k5622l2743J5480J1985l872j6992j0171
$$ 11351 31904 29959 53992 65937 15972 -9650 -42393 -26913 -14928 -18800 -35792 -45963
6034d5963n083J0838M0416j5034j8309M497l6816M8258K1580K7105P606n010j1331
$$ -45963 -51046 -40208 208 -14826 -33135 -28638 -65454 -17196 4384 31489 39095 34085 22754
6021B2754R092J8095l0114r688K4367J8800m4164l7067M3091j0458j3543K0779
$$ 22754 31846 49941 19827 10139 34506 53306 9142 -27925 15166 4708 -8835 11944
6009A1944k9290p1829P583L4732n8225k2053K4738O1672K6466j2880K997J86R401
$$ 11944 -17346 -89175 -81592 -46860 -105085 -127138 -102400 -40728 -14262 -27142 -24145 -23959 -14558
5996a4558J3235j2017M627j5989K7842o241m3693r603K2693L9487N9547J4566
$$ -14558 -1323 -13340 -8713 -24702 3140 -3101 -46794 -56397 -33704 5783 65330 79896
5984G9896j0450j1210o1637m5205m7772N7688M6397M7464j6652n4798n8961J3524
$$ 79896 69446 58236 -3401 -48606 -96378 -38690 7707 55171 38519 -16279 -75240 -61716
5972f1716O5628J8450N4815n403N597k3440o3630n1897l0329L3619K7210j6001
$$ -61716 3912 22362 77177 71774 77371 53931 -9699 -61596 -91925 -58306 -31096 -47097
5960d7097k144l6659m493M0988k8120l693l6625k3195P3506L5880j4057J8390
$$ -47097 -49241 -85900 -90393 -49405 -77525 -81218 -117843 -141038 -67532 -31652 -45709 -27319
5948b7319M6628m0942n0944J6832L7011M0731K9190J551k1671M25m1962m7235
$$ -27319 19309 -21633 -72577 -55745 -18734 21997 51187 52738 31067 31492 -10470 -57705
5936e7705l877J5416O151J8940K2774K1904K1468J9408l3036m8787P159J7882
$$ -57705 -61582 -46166 -40015 -21075 1699 23603 45071 64479 31443 -17344 -10185 7697
5924G697k7924m05r980M471M261o289m5303j890K9142L4774m2186r456L3059L6378
$$ 7697 -20227 -20632 -30612 -26141 -21880 -28169 -73472 -75362 -46220 -11446 -53632 -63088 -30029 6349
5910F349K8615P4m0376k6899L4418M1719j2600K12L238l5157l3013j6743k5072
$$ 6349 34964 35038 -5338 -32237 2181 43900 31300 31512 34750 -407 -33420 -50163 -75235
5897g5235Q926J1307N6003L7562m8622k3931l8144K0567j8137j5577K6480L4204
$$ -75235 -66309 -55002 1001 38563 -10059 -33990 -72134 -51567 -69704 -85281 -58801 -24597
5885b4597M4222L3444n422m910m245p888n4498R561N006j1754K9792L6031J9653
$$ -24597 19625 53069 47647 42737 38492 30604 -23894 -14333 -9327 -21081 8711 44742 64395
5872F4395m8795m4412M9555N4670L37n8696o4863j2278J9748k7065K20P1663J2223
$$ 64395 15600 -28812 20743 75413 75750 17054 -47809 -60087 -40339 -67404 -67184 4479 16702
5859A6702k6228M55k7756l0177L16R611L4187J8956K1981m8162l0330J1205K1880
$$ 16702 -9526 -9071 -36827 -67004 -66688 -57077 -22890 -3934 18047 -30115 -60445 -49240 -27360
5846b7360J3570k5167j3536L2836K1118K3932k6974N8116L6371m475j3474m0594
$$ -27360 -13790 -38957 -52493 -19657 1461 25393 -1581 56535 92906 88431 74957 34363
5834C4363m130J5801j9236l7587K1002L7481n208j452L266k4087R332k9293j5338
$$ 34363 30233 46034 26798 -10789 10213 47694 42486 41034 44300 20213 29545 252 -15086
5821a5086j6380P307K8702K6680J6676n347l4712m4633q655L5261k8662k420M1443
$$ -15086 -31466 -24159 4543 31223 47899 42552 7840 -36793 -45448 -10187 -38849 -41269 174
5808A74J3361o9498J8565K4901K1208N9481K8011m6284k4234n341p250k3124j7189
$$ 174 13535 -55963 -37398 -12497 8711 68192 96203 49919 25685 20344 13094 -10030 -27219
5795b7219l1624k1484L8982N6366J6274m6481k6879M175J3833o081J0073K467
$$ -27219 -58843 -80327 -41345 15021 31295 -15186 -42065 -37890 -24057 -30138 -20065 -17598
5783a7598k8389R551M3059L7105j5714l4120J9052M3698j506k3057J6431L352
$$ -17598 -45987 -36436 6623 43728 28014 -6106 12946 56644 55138 32081 48512 51864
5771E1864k0408k6040j5240l0965J3446M2794j5630l4435J2098o557j2780l9651
$$ 51864 31456 5416 -9824 -40789 -27343 15451 -179 -34614 -22516 -29073 -41853 -81504
5759h1504k7988M6539L6251l1940j6497j1174J3249K0193j8930m6341J5492K7431
$$ -81504 -109492 -62953 -26702 -58642 -75139 -86313 -73064 -52871 -71801 -118142 -102650 -75219
5747g5219l6469p720O7499M0515n0298N35j0130J0668j1015k3587K355L5288r121
$$ -75219 -111688 -119408 -51909 -11394 -61692 -61157 -71287 -60619 -71634 -95221 -92866 -57578 -66699
5734f6699j1212N0864L5741n3370o991L4127K0418k5354p165K8612j133n473M159
$$ -66699 -77911 -27047 8694 -44676 -51667 -17540 2878 -22476 -29641 -1029 -2162 -7635 -3476
5721c476R432N6126m0697p2180k7051L301L9069O8044L2813m7306j5526n300L3724
$$ -3476 5956 62082 21385 -50795 -77846 -74545 -35476 32568 65381 18075 2549 -2751 30973
5708C0973K0333k8737j8017o773K8541j721l4797J7174K5805J2175K1617J003
$$ 30973 51306 22569 4552 -2221 26320 24599 -10198 6976 32781 44956 66573 67576
5696F7576L6449J6095n9217n4696l4628j5516m6146k3113J9527M6425J5703k0368
$$ 67576 104025 120120 60903 6207 -28421 -43937 -90083 -113196 -93669 -47244 -31541 -51909
5684e1909k0950l8063Q535J2937L2232M8066J0215k2685J9626j1311q656N5430
$$ -51909 -72859 -110922 -102387 -89450 -57218 -9152 1063 -21622 -1996 -13307 -21963 33467
5672C3467K4018k931l4377l0388k2231J8411K480j2254k7299k718L8641j4865
$$ 33467 57485 54554 20177 -10211 -32442 -14031 -11551 -23805 -51104 -53822 -15181 -30046
5660c0046j5887o521N250k91l3073p8052M4510O1270L3342L5335k6817o4346L4653
$$ -30046 -45933 -52454 -47204 -47495 -80568 -158620 -114110 -52840 -19498 15837 -10980 -75326 -40673
5647d0673N9835J6508k92p883k4032L3750J0936J0363q615N5378L077o6646m9978
$$ -40673 19162 35670 35378 27495 3463 37213 48149 58512 49897 105275 108352 41706 -8272
5634h272R12j4041J8218L7331q269K7710J3688K472o3128j7244j7327o413J5694
$$ -8272 -7360 -21401 -3183 34148 25879 53589 67277 69749 6621 -10623 -27950 -34363 -18669
5621a8669L5159J6184k1833M0468J2690j9737L9716K6820l6454p3960q456j6789
$$ -18669 16490 32674 10841 51309 63999 44262 83978 110798 74344 384 -8072 -24861
5609b4861n163j0431N4049K4375k0663k6469m5906K7957N29R701R382J6067J3998
$$ -24861 -30024 -40455 13594 37969 17306 -9163 -55069 -27112 -26583 -16882 -7500 8567 22565
5596B2565m0694J2033l2888J2460J4319l26M4915n1507O248K5901k6706k0651
$$ 22565 -18129 -6096 -38984 -26524 -12205 -12531 32384 -19123 -12875 13026 -13680 -34331
5584c4331O093o1585k7990J6674n904L5030K9377J41K9696K665L3590j7766p8084
$$ -34331 -28238 -89823 -117813 -101139 -107043 -72013 -42636 -42495 -12799 -10134 23456 5690 -72394
5571g2394r849O5773j7834n4499K9912K3789J0265J2606J7587l4316k8602L1602
$$ -72394 -82243 -16470 -34304 -88803 -58891 -35102 -24837 -12231 5356 -28960 -57562 -25960
5559b5960M4447k9534K6030j8O99l3840j8255Q009l4769J4184L6653O2622M578
$$ -25960 18487 -11047 14983 14965 15664 -18176 -36431 -28422 -63191 -49007 -12354 50268 54846
5546E4846m1926m3104K1655m3068n8833N2948M3227P689L3107k1430L153L389
$$ 54846 12920 -30184 -8529 -51597 -110430 -57482 -14255 -6566 26541 5111 8264 11653
5534A1653k7213l5762p6351M575N7021J4062l0903K9150J7683J7413m855R789
$$ 11653 -15560 -51322 -127673 -123098 -66077 -52015 -82918 -53768 -36085 -18672 -23527 -13738
5522a3738J5524l9202k1341m2145J2768P9650J7706n1541J3313K3684K2468k7595
$$ -13738 1786 -37416 -58757 -100902 -88134 -8484 9222 -42319 -29006 -5322 17146 -10449
5510a0449L0525n902j8670n1164L3051J0073L7164k3646m5470L2786O6606N6350
$$ -10449 20076 14174 -4496 -55660 -22609 -12536 24628 982 -44488 -11702 54904 111254
5498A11254o4261r0367j5047K2601N20J113J0348o99j4287j3910J3320j2751K3766
$$ 111254 46993 -43374 -58421 -35820 -35300 -34187 -23839 -24538 -38825 -52735 -39415 -52166 -28400
5485b8400J1690j5330j0816q234j6494Q306R951p479K6272O487J6915M295J1511
$$ -28400 -16710 -32040 -42856 -51090 -67584 -59278 -49327 -56806 -30534 -24047 -7132 -2837 8674
5472H674k1278m5884L5078L9664J0529L873k1066k9133K3174n066N612M9753P987
$$ 8674 -12604 -58488 -23410 16254 26783 30656 9590 -19543 3631 -1435 4177 53930 61917
5459F1917m2912n6098j725k5703J017P0140O2119R11p6945o6699j9954J8858L1103
$$ 61917 19005 -37093 -38818 -64521 -63504 6636 68755 69666 -7279 -73978 -93932 -75074 -43971
5446d3971M3229K037N174l5667j0341j4940L8098r250j0177L169O6023L7519m1774
$$ -43971 -742 1295 6469 -29198 -39539 -54479 -16381 -25631 -35808 -32639 33384 70903 29129
5433B9129k1594K650k1290K9559j4628m9520k1344P1855L179j4051j8509M675
$$ 29129 7535 10185 -11105 18454 3826 -45694 -67038 4817 7996 -6055 -24564 -19889
5421a9889J0465j3474J0179l1761l8817j2737Q402k2809L4157K7310q889M435
$$ -19889 -9424 -22898 -12719 -44480 -83297 -96034 -87632 -110441 -76284 -48974 -57863 -53428
5409e3428l1886k5681L1499M7271J6180L4943L0284n6284l3887o896m1714l6694
$$ -53428 -85314 -110995 -79496 -32225 -16045 18898 49182 -7102 -40989 -47885 -89599 -126293
5397a26293l599J1518m631J2774M1774K2617J3868j6144P942J0251k328P348J7964
$$ -126293 -129892 -118374 -123005 -110231 -68457 -45840 -31972 -48116 -40174 -29923 -32251 -24903 -6939
5384f939j3643J2017O717j6980J073M5444m744l2239p4676j6707N9547K2249j5890
$$ -6939 -20582 -8565 -1848 -18828 -17755 27689 22945 -9294 -83970 -100677 -41130 -18881 -34771
5371c4771M3089l6133k8154Q0229k1764l6167l9216n95R882J5187o812P0796K6281
$$ -34771 8318 -27815 -55969 24260 2496 -33671 -72887 -73482 -63600 -48413 -55225 15571 41852
5358D1852l2041j9756l0407M715k4299N564J7124M653L0863l6182L6644L7375
$$ 41852 9811 -9945 -40352 -35637 -59936 -54372 -37248 -32595 -1732 -37914 -1270 36105
5346C6105P339n211P743m3162k734j8711k1844M0066N7636k6491l0850p1334m0818
$$ 36105 43444 38233 45976 2814 80 -18631 -40475 -409 57227 30736 -114 -71448 -112266
5333a12266N8671P6821J1831n0544K394k2455l388R335K5067m5689j95N126l2952
$$ -112266 -53595 23226 35057 -15487 -13093 -35548 -38936 -29601 -4534 -50223 -50418 -45292 -78244
5320g8244L2160N8264K789o4471j6376N5845M8907K3424n8776l8334M3898M8621
$$ -78244 -46084 12180 14969 -49502 -65878 -10033 38874 62298 3522 -34812 9086 57707
5308E7707J2748j1690n4995k7908Q869j5423o141K5278j3755k9889k3816K424
$$ 57707 70455 58765 3770 -24138 -15269 -30692 -36833 -11555 -25310 -55199 -79015 -76591
5296g6591r295k1656K1847N2617K3057J0626l1051j8650L2239Q817J1309K230
$$ -76591 -85886 -107542 -85695 -33078 -10021 605 -30446 -49096 -16857 -8040 3269 5499
5284E499l2720j87R837k875K5597J8874J6046j2113p137l705J2402j3893K9276
$$ 5499 -27221 -27408 -17571 -20446 5151 24025 40071 27958 20821 17116 29518 15625 44901
5271D4901j5644o3436j2830J177n615k0695l7129l996K8191L1785M1095j3088
$$ 44901 29257 -34179 -47009 -45832 -51447 -72142 -109271 -113267 -85076 -53291 -12196 -25284
5259b5284K3322O235M5891J7739m1351n6574l5478j5133O3308K8464m2129K931
$$ -25284 -1962 4273 50164 67903 26552 -30022 -65500 -80633 -17325 11139 -30990 -28059
5247b8059J0274j4608j2634o980N052r495j8421K091K1894L0996n592k6486J2254
$$ -28059 -17785 -32393 -45027 -52007 -46955 -56450 -74871 -72780 -50886 -19890 -25482 -51968 -39714
5234c9714k414L2769m285l775j5868K0395r463J0950N7563R869j5708k7576k4084
$$ -39714 -42128 -9359 -13644 -17419 -33287 -12892 -22355 -11405 46158 56027 40319 12743 -11341
5221a1341l5017J1826P301L667J5139o5632l993N0276J4037J9988O308l6243o5157
$$ -11341 -46358 -34532 -27231 -23564 -8425 -74057 -78050 -27774 -13737 6251 12559 -23684 -88841
5208h8841j9265K5320J9296L729n296j2524L6929M1413M9294k7433R878N346m3058
$$ -88841 -108106 -82786 -63490 -59761 -65057 -77581 -40652 761 50055 22622 32500 37846 -5212
5195e212J8587M0532k0698k8059J7861J5496j3547l2203l5114J4355j0252j704
$$ -5212 13375 53907 33209 5150 23011 38507 24960 -7243 -42357 -28002 -38254 -39958
5183c9958K5704J6571p508l8105q141J575M0723K1k6246k9966r536L0985M0142
$$ -39958 -14254 2317 -5191 -43296 -51437 -49862 -9139 -9118 -35364 -65330 -74866 -43881 -3739
5170c739j8715j0307M4451K3465j4299n7529K5159L895L4784N1186o2929l2903
$$ -3739 -22454 -32761 11690 35155 20856 -36673 -11514 -7619 27165 78351 15422 -17481
5158a7481o905Q064N0365p336m9695j9540L0447N8341m503p59l7129l0284k1169
$$ -17481 -24386 -16322 34043 26707 -22988 -42528 -12081 46260 41757 40998 3869 -26415 -47584
5145d7584L7485q739m6618l08k344K5794J2428j815R026N1047K3262n445N4527
$$ -47584 -10099 -18838 -65456 -65764 -68108 -42314 -29886 -31701 -22675 28372 51634 46189 100716
5132A00716o1735n9924J3000k1204q076J2685N7334j4499k8377K13N5012P024
$$ 100716 38981 -20943 -7943 -29147 -37223 -24538 32796 18297 -10080 -9867 45145 52169
5120E2169j1566l8496j2815k0784m826K9626k5091l3946K276N2766O0857K2006
$$ 52169 40603 2107 -10708 -31492 -36318 -6692 -31783 -65729 -63453 -10687 50170 72176
5108G2176l9512l0620n1663J9401M2164l0747j7072j8269N23M7240L8356O16k1207
$$ 72176 32664 2044 -49619 -30218 11946 -18801 -35873 -54142 -53619 -6379 31977 32593 11386
5095A1386m3267K2795L7401J2779n1385j3639J139K137K7778L5656j3014j9880
$$ 11386 -31881 -9086 28315 41094 -10291 -23930 -22791 -20654 7124 42780 29766 9886
5083I886n0609q661J013J3016L5627K7057k782K8744q775j4586k7255p962Q664
$$ 9886 -40723 -49384 -48371 -35355 272 27329 24547 53291 44516 29930 2675 -5287 3377
5070C377j8496n807J259J3910p479K062K5968O912k8685J1468J3149j3503p976
$$ 3377 -15119 -20926 -19667 -5757 -13236 -11174 14794 21706 -6979 4489 17638 4135 -3841
5057c841O415L392j661m0431k870K8148J0886l1080j4304P907R1812L9301m2446
$$ -3841 2574 5966 4305 -36126 -38996 -10848 38 -31042 -45346 -37439 54373 93674 51228
5044E1228l3816L9624K2030o889r534K1584N521o5239k0380k6092m5189L0885
$$ 51228 17412 57036 79066 72177 62643 84227 89748 24509 4129 -21963 -67152 -36267
5032c6267N1021o149k9536J3892J2195j2530K1745J915r067k6515k2262L2019
$$ -36267 14754 8605 -20931 -7039 5156 -7374 14371 16286 7219 -19296 -41558 -9539
5020i539r954L0145j1937j434q065l3537M740Q541J1312j4064j7826j2367k4808
$$ -9539 -19493 10652 -1285 -2719 -10784 -44321 -39581 -31040 -19728 -33792 -51618 -63985 -88793
5007h8793J5477M6610m966J8476k8344l8156L9083M2265M12k2252j2753M5974
$$ -88793 -73316 -26706 -31672 -13196 -41540 -79696 -40613 1652 2064 -20188 -32941 13033
4995A3033K5720L375J6115O825k9223K6955J9594j0293m2045k1249j3795j3431
$$ 13033 38753 42128 58243 65068 35845 62800 82394 72101 30056 8807 -4988 -18419
4983a8419J133r018l9106m5016j4955j0521M9209L6773L1945J725l0275K7094
$$ -18419 -17286 -26304 -65410 -110426 -125381 -135902 -86693 -49920 -17975 -16250 -46525 -19431
4971a9431M3338j5756r328j603m8584J4578L2953K9398m2344K6323k3157n015
$$ -19431 23907 8151 -1177 -2780 -51364 -36786 -3833 25565 -16779 9544 -13613 -18628
4959a8628K7096K1295o120l6713j6164K3417l979M9873J2709m629l3335j4778
$$ -18628 8468 29763 23643 -13070 -29234 -5817 -9796 40077 52786 48157 14822 44
4947D4J7964M0504R345L8800L4451o2997j9530r412l514j1017l2397J253k6284
$$ 44 18008 58512 67857 106657 141108 78111 58581 49169 45655 34638 2241 3494 -22790
4934b2790j8434J3972l6190Q287j4519L5403N4154M6525j8294j533q292q0741
$$ -22790 -41224 -27252 -63442 -55155 -69674 -34271 19883 66408 48114 46581 38289 -42452
4922d2452k8366M7974P044j3146J3394J8164k764J4632K6505Q774R922o5527p1857
$$ -42452 -70818 -22844 -15800 -28946 -15552 2612 -152 14480 40985 49759 59681 -5846 -77703
4909g7703k0792l251k60R159N4047M8223J1340M9506j0446k5876l1712m9526J2468
$$ -77703 -98495 -101746 -102006 -92847 -38800 9423 20763 70269 59823 33947 2235 -47291 -34823
4896c4823r224l8931N682M3883L7405O084K9132m6990k7329j3252j7274m1664
$$ -34823 -44047 -82978 -77296 -33413 3992 10076 39208 -7782 -35111 -48363 -65637 -107301
4884a07301M444K4676M7764p12K0707L153k3236j9543j014k569K1252N3461L2627
$$ -107301 -102857 -78181 -30417 -31129 -10422 -7269 -30505 -50048 -51062 -53631 -32379 21082 53709
4871E3709M3125n8174k8961J2835k9191j0869n2k3728m453j8559n855k2106N542
$$ 53709 96834 38660 9699 22534 -6657 -17526 -17578 -41306 -45759 -64318 -70173 -92279 -86737
4858h6737M1393K9323j9823j4206J6113J3809q371M904l8871L0361j2296N833
$$ -86737 -45344 -16021 -35844 -50050 -33937 -20128 -28499 -23595 -62466 -32105 -44401 -38568
4846c8568M0903j3293j7225M562K6907q827m9621k4120K7454j8542K3870K6254
$$ -38568 2335 -10958 -28183 -23621 3286 -5541 -55162 -79282 -51828 -70370 -46500 -20246
4834b0246j7048K9214P9178j6901m5535l6883J2264p813J6784K405J3907J9711
$$ -20246 -37294 -8080 71098 54197 8662 -28221 -15957 -23770 -6986 -4581 9326 29037
4822B9037p635k5415j0745k5973L5208K8176k6455m7235k1204j2212J1385L7679
$$ 29037 21402 -4013 -14758 -40731 -5523 22653 -3802 -51037 -72241 -84453 -73068 -35389
4810c5389M2721j773Q319L4414M2575j5612k3124N975J6162K6853n5199m9717
$$ -35389 7332 5559 13878 48292 90867 75255 52131 58106 74268 101121 45922 -3795
4798c795O9840j8860n4527K3993r703r296j7609J0988L5174L4210P557k1070l5355
$$ -3795 66045 47185 -7342 16651 6948 -2348 -19957 -8969 26205 60415 67972 46902 11547
4785A1547p514q437k6544j3731j6510M3996J5693l4409M1826L2679j7433K8222
$$ 11547 4033 -4404 -30948 -44679 -61189 -17193 -1500 -35909 5917 38596 21163 49385
4773D9385K4296m2923O590p7347l2913K0489n845j8464K6367J8020M3549M4989
$$ 49385 73681 30758 37348 -39999 -72912 -52423 -58268 -76732 -50365 -32345 11204 56193
4761E6193j2200k6437l3887M125j5104l88o608m0044r887j6447K5652M2794K5511
$$ 56193 43993 17556 -16331 -12206 -27310 -27698 -34306 -74350 -84237 -100684 -75032 -32238 -6727
4748f727O036j2839L2809k7726m7032N653L3217m801N126K149L193l082k5811
$$ -6727 -691 -13530 19279 -8447 -55479 -49826 -16609 -21410 -16284 -14135 -10942 -14024 -39835
4735c9835j179j7528j9686l489M1980P648j7296J569N4980M9896M5251M9695j5475
$$ -39835 -41014 -58542 -78228 -81717 -39737 -32089 -49385 -47816 7164 57060 102311 152006 136531
4722A36531k7177j1090n2033n6754n29K3893j2695L871Q081K5932p447m037m6946
$$ 136531 109354 98264 46231 -10523 -11052 12841 146 4017 12098 38030 30583 26546 -20400
4709b0400l3381l2689j2162j6304O2635O2791J5088m52l0254P32K6122P944j9673
$$ -20400 -53781 -86470 -98632 -114936 -52301 10490 25578 25126 -5128 -4396 21726 29670 9997
4696I997m093N5085o258J0930l4794m9855N144J0622k7075j8216K7422L815M4049
$$ 9997 5904 60989 54731 65661 30867 -18988 -13844 -3222 -30297 -48513 -21091 -17276 26773
4683B6773j9056l3814j1632P1897J1884m9920K6467r141k5380p7632m3027K0555
$$ 26773 7717 -26097 -37729 34168 46052 -3868 22599 13458 -11922 -89554 -132581 -112026
4671a12026J633J2200L3051L8620J980j3115q70p521K4104j2320k8251M1094M1556
$$ -112026 -110393 -98193 -65142 -26522 -24542 -37657 -38527 -46048 -21944 -34264 -62515 -21421 20135
4658B0135J547l056k9039J021j3512k8565J9924M8708L1468j5909l8069J1168
$$ 20135 21682 18626 -10413 -9392 -22904 -51469 -31545 17163 48631 32722 -5347 5821
4646E821j2515j6086j4806j7325k0978K3404N2374o0935j7863n695J7499l0641
$$ 5821 -6694 -22780 -37586 -54911 -75889 -52485 -111 -61046 -78909 -84604 -67105 -97746
4634i7746J3920J4018K3829K1498k6372j579l5592k0037K6233k4945J9652K4932
$$ -97746 -83826 -69808 -45979 -24481 -50853 -52432 -88024 -108061 -81828 -106773 -87121 -62189
4622f2189L3588q268j5148j2317O2137M4654j4993j7118j4657M8007j715l3894
$$ -62189 -28601 -36869 -52017 -64334 -2197 42457 27464 10346 -4311 43696 41981 8087
4610H087L4384J903l0116N170n9355l9169R608j2137N877R9972j200n1499K4582
$$ 8087 42471 44374 14258 19428 -39927 -79096 -69488 -81625 -75748 24224 23024 -28475 -3893
4597c893k6112k7171K5760J9093q563j2285J5943L1124l5762j8319M3045J9847
$$ -3893 -30005 -57176 -31416 -12323 -20886 -33171 -17228 13896 -21866 -40185 2860 22707
4585B2707K804j0690k8951l2549K2112J0560M8086L498o8288p819L576L6443k1653
$$ 22707 25511 14821 -14130 -46679 -24567 -14007 34079 37577 -30711 -38530 -34954 1489 -20164
4572b0164q961K220l7597K087j992o14K3072J1410o630K0267L8027n407Q699k0753
$$ -20164 -29125 -26905 -64502 -62415 -64407 -65021 -41949 -30539 -37169 -16902 21125 15718 24417 3664
4558C664J155j6031J9191J3383k8189m2539o920L0893n3719n6089P0964L2354
$$ 3664 4819 -11212 7979 21362 -6827 -49366 -56286 -25393 -79112 -135201 -64237 -31883
4546c1883r351k5809J488L6141k2306K074L3153L2135L4782l68R339k4477j9899
$$ -31883 -41234 -67043 -65555 -29414 -51720 -49646 -16493 15642 50424 50056 59395 34918 15019
4533A5019J6527j220n432k3594j8447l8735K344N5907L1022j1185o4790k6093
$$ 15019 31546 30326 24894 1300 -17147 -55882 -53538 2369 33391 22206 -42584 -68677
4521f8677K8730L7206l00k8079j3160K3424L93j8192m5961q676L5168O0737R021
$$ -68677 -39947 -2741 -3041 -31120 -44280 -20856 -20463 -38655 -84616 -93292 -58124 2613 11634
4508A1634j6076n455n992j8808L594N905K0074n712j6851L408K0017j1481j1152
$$ 11634 -4442 -9897 -15889 -34697 -31103 -25198 -5124 -10836 -27687 -24279 -4262 -15743 -26895
$$ [...]
##END NTUPLES=NMR SPECTRUM
##END=
