##TITLE=Analysis number 325300
Compound Code sb 01792
Project Code adrs
Chemist Name stores
##JCAMPDX= 6.0         $$ Bruker NMR JCAMP-DX V2.0
##DATA TYPE= NMR SPECTRUM
##DATA CLASS= NTUPLES
##ORIGIN= Bruker BioSpin GmbH
##OWNER= nmr
$$ XWIN-NMR		Version 3.5
$$ Mon Dec 18 10:54:41 2006 GMT Standard Time (UT+0h)  MAYBRIDGE\nmr@NMR_250MHZ
##.OBSERVE FREQUENCY= 250.131544655141
##.OBSERVE NUCLEUS= ^1H
##.ACQUISITION MODE= SIMULTANEOUS (DQD)
##.ACQUISITION SCHEME= undefined
##.AVERAGES= 16
##.DIGITISER RES= 18
##SPECTROMETER/DATA SYSTEM= dpx250
##.PULSE SEQUENCE= zg30
##.SOLVENT NAME= CDCl3
##.SHIFT REFERENCE= (INTERNAL, CDCl3, 0, 16.5205)
##AUDIT TRAIL= $$ (NUMBER, WHEN, WHO, WHERE, WHAT)
$$ ##TITLE= Audit trail, XWIN-NMR		Version 3.5
$$ ##JCAMPDX= 5.01
$$ ##ORIGIN= Bruker BioSpin GmbH
$$ ##OWNER= nmr
$$ C:\u/data/dgb/nmr/ADRS/1790/pdata/1/auditp.txt
$$ ##AUDIT TRAIL=  $$ (NUMBER, WHEN, WHO, WHERE, WHAT)
(   1,<2006-12-18 10:54:12.71 +000>,<MAYBRIDGE\nmr>,<NMR_250MHZ>,
      <created by zg, POWCHK disabled, PULCHK disabled
       configuration hash MD5:
       49 4B E0 1D 92 C2 6B 37 9F E6 65 BC 52 41 86 1D
       data hash MD5: 64K
       96 B5 01 15 2E AA CA C1 D8 87 67 B4 F6 3D 86 D6>)
(   2,<2006-12-18 10:54:29.97 +000>,<MAYBRIDGE\nmr>,<NMR_250MHZ>,
      <Start of raw data processing
       ef LB = 0.3 FT_mod = 6 PKNL = 1 SI = 32K 
       data hash MD5: 32K
       D7 62 36 B7 13 D6 C1 57 36 77 7E B0 9B 94 C5 43>)
(   3,<2006-12-18 10:54:32.80 +000>,<MAYBRIDGE\nmr>,<NMR_250MHZ>,
      <apk 
       data hash MD5: 32K
       76 F1 D2 D7 DF EF C5 FA 2A 54 28 AB 95 8C 1B 67>)
(   4,<2006-12-18 10:54:33.49 +000>,<MAYBRIDGE\nmr>,<NMR_250MHZ>,
      <abs ABSG = 5 
       data hash MD5: 32K
       B8 1E FC 89 C1 1A 69 9E 06 58 5C BE 19 50 22 68>)
$$ ##END=
$$ 
$$ hash MD5
$$ F7 A3 87 D9 0F 18 23 42 4E C7 5A 95 DE B8 84 7F
##$RELAX= 
##$RELAX= 
##$RELAX= 
##$RELAX= 
##$RELAX= 
##$RELAX= 
##$RELAX= 
$$ Bruker specific parameters
$$ --------------------------
##$DU= <C:\u>
##$EXPNO= 1790
##$NAME= <ADRS>
##$PROCNO= 1
##$TYPE= <nmr>
##$USER= <dgb>
##$AMP= (0..31)
100 100 100 100 100 100 100 100 100 100 100 100 100 100 100 100 100 100 
100 100 100 100 100 100 100 100 100 100 100 100 100 100 
##$AQSEQ= 0
##$AQ_mod= 3
##$AUNM= <au_zg>
##$AUTOPOS= <7 >
##$BF1= 250.13
##$BF2= 250.13
##$BF3= 250.13
##$BF4= 250.13
##$BF5= 500.13
##$BF6= 500.13
##$BF7= 500.13
##$BF8= 500.13
##$BYTORDA= 1
##$CFDGTYP= 0
##$CFRGTYP= 5
##$CHEMSTR= <none>
##$CNST= (0..31)
1 1 145 1 1 1 1 1 1 1 1 1 1 1 1 1 1 1 1 1 1 1 1 1 1 1 1 1 1 1 1 1 
##$CPDPRG= <>
##$CPDPRG1= <>
##$CPDPRG2= <>
##$CPDPRG3= <>
##$CPDPRG4= <mlev>
##$CPDPRG5= <mlev>
##$CPDPRG6= <mlev>
##$CPDPRG7= <mlev>
##$CPDPRG8= <mlev>
##$CPDPRGB= <>
##$CPDPRGT= <>
##$D= (0..31)
0 1 0 0 0 0 0 0 0 0.06 0 0 0 0 0 0 0.0002 0 0 0 0 0 0 0 0 0 0 0 0 0 0 
0 
##$DATE= 1166439251
##$DBL= (0..7)
120 120 120 120 120 120 120 120 
##$DBP= (0..7)
150 150 150 150 150 150 150 150 
##$DBP07= 0
##$DBPNAM0= <>
##$DBPNAM1= <>
##$DBPNAM2= <>
$$ [...]
##$SUBNAM7= <"">
##$SUBNAM8= <"">
##$SUBNAM9= <"">
##$SW= 20.6930455092707
##$SWIBOX= (0..15)
0 0 3 0 0 0 0 0 0 0 0 0 0 0 0 0 
##$SW_h= 5175.983436853
##$TD= 65536
##$TD0= 1
##$TE= 295.16
##$TE2= 300
##$TE3= 300
##$TEG= 300
##$TL= (0..7)
0 120 120 120 120 120 120 120 
##$TP= (0..7)
150 150 150 150 150 150 150 150 
##$TP07= 0
##$TPNAME0= <>
##$TPNAME1= <>
##$TPNAME2= <>
##$TPNAME3= <>
##$TPNAME4= <>
##$TPNAME5= <>
##$TPNAME6= <>
##$TPNAME7= <>
##$TPOAL= (0..7)
0.5 0.5 0.5 0.5 0.5 0.5 0.5 0.5 
##$TPOFFS= (0..7)
0 0 0 0 0 0 0 0 
##$TUNHIN= 0
##$TUNHOUT= 0
##$TUNXOUT= 0
##$USERA1= <user>
##$USERA2= <user>
##$USERA3= <user>
##$USERA4= <user>
##$USERA5= <user>
##$V9= 5
##$VALIST= <valist>
##$VCLIST= <CCCCCCCCCCCCCCC>
##$VD= 0
##$VDLIST= <DDDDDDDDDDDDDDD>
##$VPLIST= <PPPPPPPPPPPPPPP>
##$VTLIST= <TTTTTTTTTTTTTTT>
##$WBST= 1024
##$WBSW= 4
##$XGAIN= (0..3)
0 0 0 0 
##$XL= 0
##$YL= 0
##$YMAX_a= 486155
##$YMIN_a= -503353
##$ZGOPTNS= <>
##$ZL1= 120
##$ZL2= 120
##$ZL3= 120
##$ZL4= 120
##$ABSF1= 16.52052
##$ABSF2= -4.172653
##$ABSG= 5
##$ABSL= 3
##$ALPHA= 0
##$AQORDER= 0
##$ASSFAC= 0
##$ASSFACI= 0
##$ASSFACX= 0
##$ASSWID= 0
##$AUNMP= <proc_1d>
##$AZFE= 0.1
##$AZFW= 0.1
##$BCFW= 0
##$BC_mod= 0
##$BYTORDP= 0
##$COROFFS= 0
##$CY= 12.5
##$DATMOD= 1
##$DC= 0
##$DFILT= <>
##$DTYPP= 0
##$F1P= 14.0000005364418
##$F2P= -0.99999901652339
##$FCOR= 0.5
##$FTSIZE= 32768
##$FT_mod= 6
##$GAMMA= 0
##$GB= 0
##$INTBC= 1
##$INTSCL= 1
##$ISEN= 128
##$LB= 0.3
##$LEV0= 0
##$LPBIN= 0
##$MAXI= 10000
##$MC2= 0
##$MEAN= 0
##$ME_mod= 0
##$MI= 0
##$NCOEF= 0
##$NC_proc= -6
##$NLEV= 6
##$NOISF1= 0
##$NOISF2= 0
##$NSP= 0
##$NTH_PI= 0
##$NZP= 0
##$OFFSET= 16.52052
##$PC= 1
##$PHC0= -135.0709
##$PHC1= 10.51031
##$PH_mod= 1
##$PKNL= yes
##$PPARMOD= 0
##$PSCAL= 4
##$PSIGN= 0
##$REVERSE= no
##$SF= 250.130000369639
##$SI= 32768
##$SIGF1= 0
##$SIGF2= 0
##$SINO= 400
##$SIOLD= 32768
##$SREGLST= <1H.CDCl3>
##$SSB= 0
##$STSI= 32768
##$STSR= 0
##$SW_p= 5175.98343685301
##$SYMM= 0
##$S_DEV= 0
##$TDeff= 65536
##$TDoff= 0
##$TI= <Analysis number 999999
Compound Code 99
Book Reference 9
Project Code 9>
##$TILT= no
##$TM1= 0
##$TM2= 0
##$TOPLEV= 0
##$USERP1= <user>
##$USERP2= <user>
##$USERP3= <user>
##$USERP4= <user>
##$USERP5= <user>
##$WDW= 1
##$XDIM= 32768
##$YMAX_p= 495204104
##$YMIN_p= -997575
$$ End of Bruker specific parameters
$$ ---------------------------------
##NTUPLES= NMR SPECTRUM
##VAR_NAME=  FREQUENCY,     SPECTRUM/REAL,   SPECTRUM/IMAG
##SYMBOL=    X,             R,               I
##VAR_TYPE=  INDEPENDENT,   DEPENDENT,       DEPENDENT
##VAR_FORM=  AFFN,          ASDF,            ASDF
##VAR_DIM=   32768,         32768,           32768
##UNITS=     HZ,            ARBITRARY UNITS, ARBITRARY UNITS
##FACTOR=    0.157963299565203, 1,           1
##FIRST=     4132.27748775793, 0,            0
##LAST=      -1043.70594909508, 0,           0
##MIN=       -1043.70594909508, -997575,     0
##MAX=       4132.27748775793, 495204104,    0
$$ Real data points
##PAGE= N=1
##DATA TABLE= (X++(R..R)), XYDATA
$$ [...]
$$ plain form
12634 396605 170966 15422 -84845 -235421 137361 331489 350848 242059 15766 45913
12624 45913 103374 72937 -141312 -232454 -185576 -23305 109359 -110560 -50766 -54992 12561
12613 12561 161001 116642 -118805 -198205 -262018 -65986 267722 239000 217112 48824 -173697
12602 -173697 -71149 -166343 -163930 -91818 -73628 -278811 -121715 23204 159579 122007 -128920
12591 -128920 -195290 -138797 -400252 -484114 -211067 153474 247133 93353 83113 -11839 76816
12580 76816 231490 478639 591533 568906 507081 395962 276549 227601 253090 139155
12570 139155 139313 138959 -61092 -65585 -256569 -304634 -168530 154169 -92008 -372174 -375091
12559 -375091 -294986 -288679 -15038 162017 214742 -90795 -300258 -104649 271607 329592
$$ packed form
12634C96605k25639j55544j00267j50576L72782J94128J9359j08789k26293L0147
12624D5913N7461l0437k14249r1142M6878J62271J32664k19919N9794m226O7553
12613A2561J48440m4359k35447p9400o3813J96032L33708k8722k1888j68288k22521
12602a73697J02548r5194K413P2112J8190k05183J57096J44919J36375l7572k50927
12591a28920o6370N6493k61455q3862K73047L64541R3659j53780j0240r4952Q8655
12580G6816J54674K47149J12894k2627o1825j11119j19413m8948K5489j13935
12570A39155J58l54k00051m493j90984m8065J36104L22699k46177k80166k917
12559c75091Q0105O307K73641J77055N2725l05537k09463J95609L76256N7985
$$ plain form
12549 329592 157051 28301 -14627 13770 -79377 164 232750 134985 -78562 -106205 -10707
12538 -10707 -22094 -54244 36828 20631 -402686 -327080 -148546 49965 78205 49681 -113730
12527 -113730 -307723 -367025 -352175 -255430 -184758 -87063 155753 47459 -76607 78254
12517 78254 150932 -14727 -60028 -30304 34502 193885 -134408 -68865 -15316 -153939 -290091
12506 -290091 -594111 -391973 -156996 -62170 -110635 83676 145892 236218 468669 382879
12496 382879 335264 69047 -206998 -19615 7322 -334925 -247644 110741 180998 -52358
12486 -52358 -37819 138252 286725 245279 49104 -55083 -192054 -244270 -45605 206864
12476 206864 -65019 -100300 -119824 -16719 -153393 -195887 -214683 -171534 -41145 161346
$$ packed form
12549C29592j72541j28750m2928K8397r3147P9541K32586r7765k13547k7643R5498
12538a0707j1387l2150R1072j6197m23317P5606J78534J98511K8240k8524j63411
12527a13730j93993n9302J4850R6745P0672R7695K42816j08294j24066J54861
12517G8254P2678j65659m5301K9724O4806J59383l28293O5543N3549j38623j36152
12506b90091l04020K02138K34977R4826m8465J94311O2216R0326K32451q5790
12496C82879m7615k66217k76045J87383K6937l42247Q7281L58385P0257k33356
12486e2358J4539J76071J48473m1446j96175j04187j36971n2216J98665K52469
12476B06864k71883l5281j9524J03105j36674m2494j8796M3149J30389K02491
$$ plain form
12466 161346 306078 219049 89011 190910 124764 -164148 -283422 -294323 -111643 -53034
12456 -53034 40631 -115931 -15708 -33357 -60150 -4665 -2625 -96555 -85036 92451 151974
12445 151974 -86708 -151072 125244 224472 13979 -16334 -210577 -386293 -402795 -379453
12435 -379453 -34759 -75020 310001 416174 418801 157373 -66822 69529 310634 259079
12425 259079 274559 129431 176719 74270 67799 251837 182416 238507 218341 182740 104342
12414 104342 79184 -71343 -61981 100403 415674 830136 906739 516708 242660 142191
12404 142191 4489 20604 62268 -132486 -175997 -252327 -145023 2843 -30654 105171
12394 105171 73989 205197 269574 145099 203733 249825 186370 87343 -53058 85626 -27033
$$ packed form
12466A61346J44732q7029j30038J01899o6146k88912j19274j0901J82680N8609
12456e3034R3665j56562J00223j7649k6793N5485K040r3930J1519J77487N9523
12445A51974k38682o4364K76316R9228k10493l0313j94243j75716j6502K3342
12435c79453L44694m0261L85021J06173K627k61428k24195J36351K41105n1555
12425B59079J5480j45128M7288j02449o471J84038o9421N6091k0166l5601p8398
12414A04342k5158j50527R362J62384L15271M14462P6603l90031k74048j00469
12404A42191j37702J6115M1664j94754m3511p6330J07304J47866l3497J35825
12394A05171l1182J31208O4377j24475N8634M6092o3455r9027j40401J38684j12659
$$ plain form
12383 -27033 114411 86151 304811 476043 354223 59324 -142799 -128744 38684 155646
12373 155646 -65172 51771 190043 304546 -34405 -317218 -144574 22674 107397 292820
12363 292820 349836 285309 207922 171593 1424 -211612 -112343 7070 98043 -215067 -367528
12352 -367528 -327644 -221338 -280261 -309559 -328524 -408842 -315345 -274800 -361283 -472416 -155790
12341 -155790 -210897 -140312 103510 64560 -108074 -105541 -146731 -137399 -88461 3132 -95548
12330 -95548 -38891 -71907 -1872 52490 -9740 -284963 -477196 -340417 -188700 -68635 -159712
12319 -159712 -308633 -218750 -84588 -88557 -8907 -27147 -51852 -175379 -146109 -261218 -352567
12308 -352567 -172268 -166075 -142483 -8669 -27055 -265975 -170826 -89295 144981 277053 337387
$$ packed form
12383b7033J41444k8260K18660J71232j21820k94899k02123J4055J67428J16962
12373A55646k20818J16943J38272J14503l38951k82813J72644J67248Q4723J85423
12363B92820N7016o4527p7387l6329j70169k13036R9269J19413R0973l13110j52461
12352c67528L9884J06306n8923k9298j8965q0318R3497M0545q6483j11133L16626
12341a55790n5107P0585K43822l8950j72634K533m1190R332M8938R1593r8680
12330i5548N6657l3016P0035N4362o2230k75223j92233J36779J51717J20065r1077
12319a59712j48921Q9883J34162l969P9650j8240k4705j23527K9270j15109r1349
12308c52567J80299O193K3592J33814j8386k38920R5149Q1531K34276J32072O0334
$$ plain form
12297 337387 65368 -127694 -254751 -343882 -345804 -237997 -163928 -506861 -314625 -45624
12287 -45624 -134309 -205722 -359398 -283377 -322478 -189622 -237592 -328360 -232274 -38918 66260
12276 66260 165740 66255 -357289 -440542 -268826 149977 194198 -102508 -255711 -185079 -162230
12265 -162230 -281298 -219301 -264836 -216924 -333376 -314879 -446514 -368061 -92415 192417
12255 192417 73605 -203110 -27129 116885 132359 -5265 -22525 -238075 -150835 -271663
12245 -271663 -420716 -518419 -388138 -149734 -3074 -190359 -411791 -249763 201769 336910
12235 336910 455716 224300 -2480 -35545 3387 238610 143165 -25094 171034 149850
12225 149850 -45216 -94270 -37697 228545 247149 61049 23836 -182517 -201272 -144458 -87786
$$ packed form
12297C37387k72019j93062j27057q9131j922J07807P4069l42933J92236K69001
12287d5624q8685p1413j53676P6021l9101J32856m7970r0768R6086J93356J05178
12276F6260R9480r9485m23544q3253J71716M18803M4221k96706j53203P0632K2849
12265a62230j19068O1997m5535M7912j16452J8497j31635P8453K75646K84832
12255A92417j18812k76715J75981J44014J5474j37624j7260k15550Q7240j20828
12245b71663j49053r7703J30281K38404J46660j87285k21432J62028M51532J35141
12235C36910J18806k31416k26780l3065L8932K35223r5445j68259J96128k1184
12225A49850j95066m9054N6573K66242J8604j86100l7213k06353j8755N6814N6672
$$ plain form
12214 -87786 -262012 -465514 -453723 -371441 -184664 23860 13936 -85210 47558 163482 246098
12203 246098 132589 5690 -6181 -164099 162735 232077 -63250 -16151 -86721 -170130
12193 -170130 -69883 147839 391318 494187 532658 304659 370511 536389 669769 429577
12183 429577 157730 -143796 -221925 -84095 -294250 -161044 -54976 -165221 -106252 -82271
12173 -82271 -222988 -59918 100213 78401 142462 160400 -31852 -6994 197661 269511 163651
12162 163651 217713 352270 161007 172447 -3859 138524 229849 217188 53297 137697
12152 137697 81251 -108910 870 -122198 -251594 -90174 136588 154040 -39229 -130541
12142 -130541 -118998 -21110 295748 217337 111632 76998 -191206 -352917 -392148 -500709
$$ packed form
12214h7786j74226k03502J1791Q2282J86777K08524r924r9146J32768J15924Q2616
12203B46098j13509j26899j1871j57918L26834O9342k95327M7099p0570q3409
12193a70130J00247K17722K43479J02869L8471k27999O5852J65878J33380k40192
12183D29577k71847l01526p8129J37830k10155J33206J06068j10245N8969K3981
12173h2271j40717J63070J60131k1812O4061J7938j92252K4858K04655P1850j05860
12162A63651N4062J34557j91263J1440j76306J42383R1325j2661j63891Q4400
12152A37697n6446j90161J09780j23068j29396J61420K26762J7452j93269r1312
12142a30541J1543R7888L16858p8411j05705l4634k68204j61711l9231j08561
$$ plain form
12132 -500709 -386306 -101765 -130721 56163 356953 268993 131773 -35511 -282337 -122162
12122 -122162 66883 17009 -28991 12914 12750 -196868 -153025 -23056 48262 218968 148358
12111 148358 310131 216146 -137058 -124026 13977 -16033 -126870 -140282 -213651 -204730 -355302
12100 -355302 -240809 -159722 21977 373029 446168 423062 216130 -225223 -197126 -216198
12090 -216198 -354264 -303985 -283472 -210419 -190354 -225963 -276427 -297628 -370543 -311974 -385677
12079 -385677 -230430 -165970 -198817 -214644 32378 224285 138774 -48607 -50022 -111177 -222844
12068 -222844 -85502 -209674 -296068 -182100 -173587 -74677 1554 48321 -42313 -49219 -164139
12057 -164139 -190742 -118707 13932 227174 24954 -199388 -260894 -285088 -327807 -391850 -548816
$$ packed form
12132e00709J14403K84541k8956J86884L00790q7960j37220j67284k46826J60175
12122a22162J89045m9874m6000M1905j64k09618M3843J29969P1318J70706p0610
12111A48358J61773r3985l53204J3032J38003l0010j10837j3412p3369Q921j50572
12100c55302J14493Q1087J81699L51052P3139k3106k06932m41353K8097j9072
12090b16198j38066N0279K0513P3053K0065l5609n0464k1201p2915N8569p3703
12079c85677J55247O4460l2847j5827K47022J91907q5511j87381j415o1155j11667
12068b22844J37342j24172q6394J13968Q513R8910P6231M6767r0634o906j14920
12057a64139k6603P2035J32639K13242k02220k24342o1506k4194m2719o4043j56966
$$ plain form
12046 -548816 -486407 -515868 -556639 -357442 -422273 -357186 19274 -57612 -139875 96342 300525
12035 300525 156676 38057 55565 -171286 -226206 -307132 -290188 -45318 153447 17751
12025 17751 217079 264977 93287 117877 120947 60899 1697 15922 58798 -14257 76737
12014 76737 66334 327353 504081 556293 599849 444229 526468 685350 556858 399841
12004 399841 193128 -46619 -137697 22772 153007 92755 67066 -67506 -114535 18470
11994 18470 -13656 -240483 -180568 -36280 247629 361996 63998 -51643 75691 90622
11984 90622 48108 17324 -22472 -132259 -244340 -174316 -209026 -52236 128146 313021 217146
11973 217146 60184 -11014 -176491 -510342 -424470 -412264 -224867 -133026 -124212 21451 121116
$$ packed form
12046e48816O2409k9461m0771J99197o4831O5087L76460p6886q2263K36217K04183
12035C00525j43849j18619J7508k26851n4920q0926J6944K44870J98765j35696
12025A7751J99328M7898j71690K4590L070o0048n9202J4225M2876p3055R0994
12014G6737j0403K61019J76728N2212M3556j55620Q2239J58882j28492j57017
12004C99841k06713k39747r1078J60469J30235o0252k5689j34572m7029J33005
11994A8470l2126k26827N9915J44288K83909J14367k97998j15641J27334J4931
11984I0622m2514l0784l9796j09787j12081P0024l4710J56790J80382J84875r5875
11973B17146j56962p1198j65477l33851Q5872J2206J87397R1841Q814J45663R9665
$$ plain form
11962 121116 213792 88490 -33151 4011 51407 88360 143995 156676 77562 66705 -197425
11951 -197425 -436067 -354856 -185591 7039 -121474 -168096 -307223 -381661 28697 299177
11941 299177 339753 395343 235268 -24372 88047 213486 129464 -30667 98667 157718
11931 157718 176086 271106 461123 657084 402929 200460 198719 188144 312340 187139
11921 187139 140122 313087 177330 -13246 99985 -1077 93437 265661 447270 374876
11911 374876 235080 96685 282383 542433 569679 498912 512311 491779 477756 716122
11901 716122 606100 573537 429724 278644 66058 -22775 293555 397883 655577 734637
11891 734637 653678 821154 806085 592822 600941 584863 506534 384884 376759 508632 808225
$$ packed form
11962A21116R2676j25302j21641L7162M7396L6953N5635J2681p9114j0857k64130
11951a97425k38642Q1211J69265J92630j28513m6622j39127p4438M10358K70480
11941B99177M0576N5590j60075k59640J12419J25439q4022j60131J29334N9051
11931A57718J8368R5020J90017J95961k54155k02469j741j0575J24196j25201
11921A87139m7017J72965j35757j90576J13231j01062R4514J72224J81609p2394
11911C74876j39796j38395J85698K60050K7246p0767J3399k0532j4023K38366
11901G16122j10022l2563j43813j51080k12586q8833L16330J04328K57694P9060
11891G34637q0959J67476j5069k13263Q119j6078p8329j21650q125J31873K99593
$$ plain form
11880 808225 770881 924674 789947 759590 579975 561400 530023 782618 776899 595939 704899
11869 704899 901893 920953 849945 861876 1094375 1158457 1108557 1135067 1303760 1124126 833179
11858 833179 694262 784388 1453910 1780321 1678664 1508894 1512077 1745322 1877953 1635941
11848 1635941 1800586 1979654 1807652 1768670 1693001 1491248 1318117 1098957 987978 1192125
11838 1192125 1258481 1330729 1334281 1284891 1137470 1242520 1556939 1734806 1732797 1654784 1733469
11827 1733469 1447659 1293149 1449878 1758204 2103808 2385615 2270930 2182091 2162183 2195097
11817 2195097 2314607 2538165 2569935 2636134 2883068 2976343 2908199 2960966 3278984 3778167
11807 3778167 3879609 4253187 4716990 4875408 4927545 5046975 4976119 4940564 5148326 5506724
$$ packed form
11880H08225l7344J53793j34727l0357j79615j8575l1377K52595n719j80960J08960
11869G04899J96994J9060p1008J1931K32499O4082m9900K6510J68693j79634k90947
11858H33179j38917R0126O69522L26411j01657j69770L183K33245J32631k42012
11848A635941J64645J79068j72002l8982p5669k01753j73131k19160j10979K04147
11838A192125O6356P2248L552m9390j47421J05050L14419J77867k009p8013P8685
11827A733469k85810j54510J56729L08326L45604K81807j14685q8839j9908L2914
11817B195097J19510K23558L1770O6199K46934R3275o8144N2767L18018M99183
11807C778167J01442L73578M63803J58418N2137J19430p0856l5555K07762L58398
$$ plain form
11797 5506724 6285784 7244476 8297790 9605885 11364038 13666046 16717326 20278276
11789 20278276 24388924 28324593 31617313 33556560 33510291 31412931 27932053 24102690
11781 24102690 20650517 17818581 15316250 13483593 12086230 11143480 10453634 9871220
11773 9871220 9305016 8703692 8640403 8905907 8992687 9167938 9283630 9832362 10801746 11964409
11763 11964409 13205844 14920304 17112498 19868572 22840321 26027734 28668800 30230359
11755 30230359 30970736 30732802 29332665 26882290 23721878 20615582 17749343 15438862
11747 15438862 13204377 11538940 10611675 9891991 9148421 8465055 8107541 7906929 7444027
11738 7444027 7122015 6885238 6652041 6437948 6592035 6630914 6380192 6251524 6455011 6629311
$$ packed form
11797E506724P79060R58692J053314J308095J758153K302008L051280L560950
11789B0278276M110648L935669L292720J939247m6269k097360l480878l829363
11781B4102690l452173k831936k502331j832657j397363r42750o89846n82414
11773I871220n66204o01324o3289K65504Q6780J75251J15692N48732R69384J162663
11763A1964409J241435J714460K192194K756074K971749L187413K641066J561559
11755C0230359P40377k37934j400137k450375l160412l106296k866239k310481
11747A5438862k234485j665437r27265p19684p43570o83366l57514k00612m62902
11738G444027l22012k36777k33197k14093J54087L8879k50722j28668K03487J74300
$$ plain form
11728 6629311 6891101 7502284 7898584 8530448 9310275 10541234 12043743 14022183 16680846
11719 16680846 20268506 24469988 29141993 33695209 36934738 37470413 35258787 31306009
11711 31306009 26264752 21697677 18043736 15407041 13547028 12349703 11286379 10413073
11703 10413073 9913250 9541519 8942037 8579952 8135245 8031245 8226831 8953416 10074203
11694 10074203 11255127 12595152 14239838 16801881 19785138 22898963 26362830 29868224
11686 29868224 32265317 32804205 31375423 28532429 24856683 21029030 17426328 14142009
11678 14142009 11566844 9840559 8741693 7816204 6820905 6307788 5968798 5460635 4958114
11669 4958114 4228081 3884732 3524359 2880214 2486367 2231986 2213733 2294981 2227154 2260738
$$ packed form
11728F629311K61790O11183L96300O31864P79827J230959J502509J978440K658663
11719A6680846L587660M201482M672005M553216L239529N35675k211626l952778
11711C1306009n041257m567075l653941k636695j860013j197325j063324q73306
11703A0413073m99823l71731n99482l62085m44707j04000J95586P26585J120787
11694A0074203J180924J340025J644686K562043K983257L113825L463867L505394
11686B9868224K397093N38888j428782k842994l675746l827653l602702l284319
11678A4142009k575165j726285j098866r25489r95299n13117l38990n08163n02521
11669D958114p30033l43349l60373o44145l93847k54381j8253Q1248o7827L3584
$$ plain form
11659 2260738 1946379 1546640 1382974 1450912 1494975 1265145 1289409 1124636 984893 1036371
11649 1036371 1012773 884434 889102 1058942 1151815 889378 545899 593643 543971 538752 278600
11638 278600 -47553 74284 87804 191530 538246 844329 934073 778340 665379 603966
11628 603966 405042 315815 461836 530467 304681 286210 247578 -50521 -235361 -121547
11618 -121547 257469 501944 300816 119680 298486 367421 351346 431897 399810 377904
11608 377904 491586 428486 156567 128404 323965 362879 173320 140373 386276 145532
11598 145532 47357 120126 29092 41927 -68848 -102830 234706 196883 54345 341933 138525
11587 138525 -31727 -81499 -86577 -947 132597 175237 -11522 -126327 -134009 -13931 -59827
$$ packed form
11659B260738l14359l99739j63666O7938M4063k29830K4264j64773j39743N1478
11649A036371k3598j28339M668J69840R2873k62437l43479M7744m9672n219k60152
11638B78600l26153J21837J3520J03726L46716L06083Q9744j55733j12961o1413
11628F03966j98924q9227J46021O8631k25786j8471l8632k98099j84840J13814
11618a21547L79016K44475k01128j81136J78806O8935j6075Q0551l2087k1906
11608C77904J13682o3100k71919k8163J95561L8914j89559l2947K45903k40744
11598A45532r8175P2769r1034J2835j10775l3982L37536l7823j42538K87588k03408
11587A38525j70252m9772n078Q5630J33544M2640j86759j14805p682J20078m5896
$$ plain form
11576 -59827 -148767 -157613 -175773 -146193 -290568 -243980 -217325 -339707 -228616 -42480 -119562
11565 -119562 -68050 78736 147421 136851 2334 -158557 -337199 -329927 -181108 54580
11555 54580 266884 309003 183100 254359 339608 146415 -5316 -260011 -174321 -152851 -240393
11544 -240393 -80333 112677 129551 43118 143771 63049 -6001 1882 -157486 -273545 -265483
11533 -265483 -290571 -337537 -350703 -438987 -343317 -261526 -231267 -16182 -71043 -254977 -249919
11522 -249919 54095 244852 381344 402320 144722 100105 -93611 -250274 -124653 9364
11512 9364 87358 297262 282455 94199 -44355 -211469 -265917 -216628 -265478 -213385 -89691
11501 -89691 -66771 14610 -1611 24342 -51257 74331 107967 134574 -185003 -304725 -285548
$$ packed form
11576e9827q8940q846j8160K9580j44375M6588K6655j22382J11091J86136p7082
11565a19562N1512J46786O8685j0570j34517j60891j78642P272J48819K35688
11555E4580K12304M2119j25903P1259Q5249j93193j51731k54695Q5690K1470q7542
11544b40393J60060J93010J6874q6433J00653q0722o9050P883j59368j16059Q062
11533b65483k5088m6966j3166q8284R5670Q1791L0259K15085n4861j83934N058
11522b49919L04014J90757J36492K0976k57598m4617j93716j56663J25621J34017
11512I364P7994K09904j4807j88256j38554j67114n4448M9289m8850N2093J23694
11501h9691K2920Q1381j6221K5953p5599J25588L3636K6607l19577j19722J9177
$$ plain form
11490 -285548 38052 93964 109614 -97417 -57570 -101880 -162852 -52744 83063 230162
11480 230162 192176 66685 -184526 -208188 -1216 -3826 39170 -132514 -14517 56568 -106862
11469 -106862 -231022 -20757 286410 292800 88096 -17361 -2759 77225 109458 -110534
11459 -110534 -241011 -10197 173954 76003 45008 -35130 -46271 209495 245004 183302 96482
11448 96482 78231 15438 163718 236110 236534 429547 398945 271981 386585 609906 578638
11437 578638 440048 719297 816223 693651 537183 430099 667688 390061 108631 263798
11427 263798 272834 190811 106332 161974 307684 603743 613842 277794 264146 493663 402189
11416 402189 362024 418666 429951 267483 255056 131767 160329 95467 103675 164840 4067
$$ packed form
11490b85548L23600N5912J5650k07031L9847m4310o0972J10108J35807J47099
11480B30162l7986j25491k51211k3662K06972k610M2996j71684J17997P1085j63430
11469a06862j24160K10265L07167O390k04704j05457J4602P9984L2233k19992
11459a10534j30477K30814J84151r7951l0995q0138j1141K55766L5509o1702q6820
11448I6482j8251o2793J48280P2392M24J93013l0602j26964J14604K23321l1268
11437E78638j38590K79249R6926j22572j56468j07084K37589k77627k81430J55167
11427B63798R036q2023q4479N5642J45710K96059J0099l36048j3648K29517r1474
11416D02189m0165N6642J1285j62468j2427j23289K8562o4862Q208O1165j60773
$$ plain form
11405 4067 -188678 -37281 50741 -56877 -18889 -18878 -116313 -269754 -140326 -175070 -108830
11394 -108830 -18999 106284 395250 468356 448491 450824 265393 148959 258889 331147 146374
11383 146374 -93841 -231929 -241389 -132601 -209156 -288339 -84014 78756 149695 73082 182154
11372 182154 221093 106442 307865 565674 663248 681391 812727 747544 511656 258804
11362 258804 -2608 -133781 -185151 3660 224244 217018 141899 161273 134344 9641 -56189
11351 -56189 55990 -111570 -156419 113827 178886 358517 443138 345255 347900 466322 518460
11340 518460 534467 535236 310858 95658 97686 257023 166353 151096 222481 -45606 -151986
11329 -151986 -219336 -166509 -29989 -52040 -135571 77154 249524 243410 205716 156897 221676
$$ packed form
11405D067j92745J51397Q8022j07618L7988J1r7435j53441J29428l4744O6240
11394a08830Q9831J25283K88966P3106j9865K333j85431j16434J09930P2258j84773
11383A46374k40215j38088r460J08788p6555p9183K04325J62770P0939p6613J09072
11372A82154L8939j14651K01423K57809R7574J8143J31336o5183k35888k52852
11362B58804k61412j31173n1370J88811K20584p226p5119J9374k6929j24703o5830
11351e6189J12179j67560m4849K70246O5059J79631Q4621r7883K645J18422N2138
11340E18460J6007P69k24378k15200K028J59337r0670j5257P1385k68087j06380
11329a51986o7350N2827J36520k2051q3531K12725J72370o114l7694m8819O4779
$$ plain form
11318 221676 315795 168445 164700 -19284 216012 685819 776446 513594 553331 469157 295101
11307 295101 417009 513279 487748 291911 297395 347750 446516 438009 334563 186576 194025
11296 194025 194274 273394 448289 455481 419220 486952 311338 20084 -89647 -215480 -352078
11285 -352078 -482089 -186650 2704 43077 -25691 215103 292452 256587 -36498 27187
11275 27187 174673 411609 490279 473253 503450 510441 396857 304196 430338 411890 356748
11264 356748 204403 302493 310748 -6747 -32232 123179 226628 329323 274744 305927 163245
11253 163245 -22556 82406 207138 -12302 239366 501434 261137 -103450 157239 115235
11243 115235 -4365 43712 150322 365325 634049 841447 813850 802637 675671 487463
$$ packed form
11318B21676R4119j47350l745j83984K35296M69807R0627k62852L9737q4174j74056
11307B95101J21908R6270k5531j95837N484N0355R8766q507j03446j47987P449
11296A94025K49P9120J74895P192l6261O7732j75614k91254j09731j25833j36598
11285c52078j30011K95439J89354M0373o8768K40794P7349l5865k93085O3685
11275B7187J47486K36936P8670j7026L0197O991j13584r2661J26142j8448n5142
11264C56748j52345R8090Q255l17495k5485J55411J03449J02695n4579L1183j42682
11253A63245j85801J04962J24732k19440K51668K62068k40297l64587K60689m2004
11243A15235j19600M8077J06610K15003K68724K07398k7597j1213j26966j88208
$$ plain form
11233 487463 447172 459257 302462 279364 204115 271240 490627 356671 321971 302568 33252
11222 33252 -29636 272446 508312 418594 329087 228195 214069 330163 375885 548512 684704
11211 684704 588488 528643 434845 457057 590301 517959 280589 333426 356018 399630 429993
11200 429993 476017 512041 340185 128436 90778 159669 270870 303001 306481 181205 144498
11189 144498 220483 216698 166007 358849 294195 101465 226333 260018 102211 379475 511925
11178 511925 515248 405548 309797 280343 412230 448858 306264 229627 393930 509153 870903
11167 870903 907753 606065 366119 436056 581940 623865 652660 550076 566767 571617 558833
11156 558833 561480 819813 814174 745044 928529 815089 638581 630934 664756 602841 629321
$$ packed form
11233D87463m0291J2085j56795k3098p5249O7125K19387j33956l4700j9403k69316
11222C3252o2888L02082K35866q9718q9507j00892j4126J16094M5722J72627J36192
11211F84704r6216n9845r3798K2212J33244p2342k37370N2837K2592M3612L0363
11200D29993M6024L6024j71856k11749l7658O8891J11201L2131L480j25276l6707
11189A44498P5985l785n0691J92842o4654j92730J24868L3685j57807K77264J32450
11178E11925L323j09700r5751k9454J31887L6628j42594p6637J64303J15223L61750
11167H70903L6850l01688k39946O9937J45884M1925K8795j02584J6691M850j2784
11156E58833K647K58333n639o9130J83485j13440j76508p647L3822o1915K6480
$$ plain form
11145 629321 557890 427239 447749 430682 478541 403313 290046 179284 157267 148731 202023
11134 202023 339869 288807 245361 120207 105238 398379 444336 375345 121481 3635
11124 3635 -82092 -32663 281241 142904 -107013 41989 151165 151031 125054 225197 279218
11113 279218 118854 87666 243855 428665 617026 602893 611510 645134 524075 449819 263598
11102 263598 196375 94632 252245 315067 406919 330294 405764 336498 265444 371224 294151
11091 294151 271904 379473 366263 260527 196429 -194390 -117122 -59519 -131721 46207 259203
11080 259203 359449 122577 48580 129659 201314 37239 -127805 -129160 156020 221475 368821
11069 368821 375014 281402 63827 136747 190271 199906 267142 430208 313689 499059 629573
$$ packed form
11145F29321p1431j30651K0510j7067M7859p5228j13267j10762k2017q536N3292
11134B02023J37846n1062m3446j25154j4969K93141M5957o8991k53864j17846
11124C635q5727M9429L13904j38337k49917J49002J09176j34k5977J00143N4021
11113B79218j60364l1188J56189J84810J88361j4133Q617L3624j21059p4256j86221
11102B63598o7223j01743J57613O2822R1852p6625P5470o9266p1054J05780p7073
11091B94151k2247J07569j3210j05736o4098l90819P7268N7603p2202J77928K12996
11080B59203J00246k36872p3997Q1079P1655j64075j65044j355K85180O5455J47346
11069C68821O193r3612k17575P2920N3524R635O7236J63066j16519J85370J30514
$$ plain form
11058 629573 464405 486096 507833 376361 375083 466398 676231 601124 278418 156628 107540
11047 107540 -51730 -25905 202047 313033 160625 54523 94204 474379 476756 489618
11037 489618 631118 393154 208361 308713 149725 42951 221939 462307 575405 544420
11027 544420 428771 408141 498355 816666 800150 957326 757963 671741 686331 650174 728322
11016 728322 547516 453130 433656 176876 266481 326619 194817 361484 270150 302133 384424
11005 384424 365850 303461 93861 -99251 1855 86494 97550 509122 660841 634128
10995 634128 481102 298379 112663 63026 -189820 -282951 -287397 -86989 23992 146033
10985 146033 431483 321435 210795 137882 467677 614479 372149 249839 287555 167550
$$ packed form
11058F29573j65168K1691K1737j31472j278R1315K09833p5107l22706j21790m9088
11047A07540j59270K5825K27952J10986j52408j06102L9681L80175K377J2862
11037D89618J41500k37964j84793J00352j58988j06774J78988K40368J13098l0985
11027E44420j15649k0630R0214L18311j6516J57176j99363q6222J4590l6157P8148
11016G28322j80806r4386j9474k56780Q9605O0138j31802J66667r1334L1983Q2291
11005C84424j8574o2389k09600j93112J01106Q4639J1056M11572J51719k6713
10995F34128j53026j82723j85716m9637k52846r3131m446K00408J10981J22041
10985A46033K85450j10048j10640p2913L29795J46802k42330j22310L7716j20005
$$ plain form
10975 167550 383013 552157 691559 924777 453086 277913 370392 425182 204140 254715
10965 254715 387905 244004 285930 559114 751219 474448 321022 695578 679267 710212
10955 710212 792056 676430 820795 731676 522292 676569 410475 380846 523703 854994
10945 854994 969782 897538 873467 795497 663562 452875 228422 450564 595923 549256
10935 549256 499054 609483 710617 900625 823311 778017 993324 1085516 1080791 1242951 1239703
10924 1239703 1301801 1170242 1162771 1152220 1315784 1198429 1137309 1345471 1276846 937865
10914 937865 748580 1033686 1055816 1281702 1161272 805237 706805 628952 778293 842267
10904 842267 888291 953894 647463 536971 598930 510653 688372 799117 660780 471978
$$ packed form
10975A67550K15463J69144J39402K33218m71691j75173R2479N4790k21042N0575
10965B54715J33190j43901M1926K73184J92105k76771j53426L74556j6311L0945
10955G10212Q1844j15626J44365q9119k09384J54277k66094k9629J42857L31291
10945H54994J14788p2244k4071p7970j31935k10687k24453K22142J45359m6667
10935E49256n0202J10429J01134J90008p7314m5294K15307R2192m725J62160l248
10924A239703O2098j31559p471j0551J63564j17355o1120K08162o8625l38981
10914I37865j89285K85106K2130K25886j20430l56035r8432p7853J49341O3974
10904H42267M6024O5603l06431j10492O1959q8277J77719J10745j38337j88802
$$ plain form
10894 471978 620690 569822 527858 396681 365913 353987 414459 562483 579309 702417 771810
10883 771810 734640 409172 429075 565567 829180 931717 967122 1231867 1466141 1383553
10873 1383553 1348744 1553338 1748732 1777858 1690364 1595769 1227865 1010332 983631 1164571
10863 1164571 1156712 1017968 972542 1069873 944789 906067 730299 692065 660841 501408 696941
10852 696941 691792 620368 711761 635224 692626 721984 715447 708417 812470 850069 776469 1089588
10840 1089588 1370467 1437445 1248307 1020329 982642 1114944 1165204 1230093 1210157 1055827
10830 1055827 1058636 1295261 1213010 891014 727915 679588 814444 979122 1164550 919635
10820 919635 864683 873179 927608 712697 538080 463141 608748 742538 853104 1034194
$$ packed form
10894D71978J48712n0868m1964j31177l0768j1926O0472J48024J6826J23108O9393
10883G71810l7170l25468J9903J36492K63613J02537L5405K64745K34274q2588
10873A383553l4809K04594J95394K9126q7494r4595l67904k17533k6701J80940
10863A164571p859j38744m5426R7331j25084l8722j75768l8234l1224j59433J95533
10852F96941n149p1424R1393p6537N7402K9358o537p030J04053L7599p3600L13119
10840A089588K80879O6978j89138k27978l7687J32302N0260O4889j9936j54330
10830A055827K809K36625q2251l21996j63099m8327J34856J64678J85428k44915
10820I19635n4952Q496N4429k14911j74617p4939J45607J33790J10566J81090
$$ plain form
10810 1034194 1144032 1179940 1170454 1105056 961634 985250 920405 874012 684449 802027 1022575
10799 1022575 1027777 1048096 1197843 1177168 822902 769428 1021619 1219708 1331084 1443876
10789 1443876 1554553 1570639 1560383 1716538 1718392 1738238 1491604 1252030 1280805 1478754
10779 1478754 1530792 1458177 1135111 1102809 1377370 1371566 1357505 1216716 1133841 1359649 1567981
10768 1567981 1589698 1680595 1836305 1638192 1476777 1547871 1568882 1455854 1501117 1756326
10758 1756326 1626310 1747766 1829592 1709454 1642164 1503242 1277311 946717 864222 917875
10748 917875 944425 862599 1045937 1275796 1103244 921484 841783 692816 638571 430505
10738 430505 652750 673990 613533 846308 905089 958203 1026678 1081266 536464 338730 486805
$$ packed form
10810A034194J09838L5908r486o5398j43422K3616o4845m6393j89563J17578K20548
10799A022575N202K0319J49747k0675l54266n3474K52191J98089J11376J12792
10789A443876J10677J6086j0256J56155J854J9846k46634k39574K8775J97949
10779A478754N2038p2615l23066l2302K74561n804j4061j40789q2875K25808K08332
10768A567981K1717R0897J55710j98113j61415P1094K1011j13028M5263K55209
10758A756326j30016J21456Q1826j20138o7290j38922k25931l30594q2495N3653
10748I17875K6550q1826J83338K29859j72552j81760p9701j48967n4245k08066
10738D30505K22245K1240o0457K32775N8781N3114O8475N4588n44802j97734J48075
$$ plain form
10727 486805 636307 706710 796630 803194 998072 1147087 1121799 1029921 920717 1072019 1399847
10716 1399847 1250840 1121714 1081644 921582 854872 1008052 1057818 1010889 1175728 1333392
10706 1333392 1136987 683730 559059 676459 873914 1102595 1039670 1047860 1154110 971670
10696 971670 828709 990049 1172266 1107330 1097045 1276801 1655719 1932038 1957765 1916363
10686 1916363 1806390 1674925 1793639 1725061 1676098 1666117 1792082 1752953 1649920 1274435
10676 1274435 1203759 1278163 994787 819748 710433 715537 813706 1054401 1106216 955560
10666 955560 1042561 1038472 987085 971479 838025 956041 1011570 1125832 948319 916501 1032283
10655 1032283 831355 907302 1083474 1140802 1159666 1324904 1359266 1068208 1104281 1015449
$$ packed form
10727D86805J49502P0403Q9920O564J94878J49015k5288r1878j09204J51302L27828
10716A399847j49007j29126m0070j60062o6710J53180M9766m6929J64839J57664
10706A333392j96405m53257j24671J17400J97455K28681o2925Q190J06250j82440
10696I71670j42961J61340J82217o4936j0285J79756L78918K76319K5727m1402
10686A916363j09973j31465J18714o8578m8963r981J25965l9129j03033l75485
10676A274435p0676P4404k83376j75039j09315N104R8169K40695N1815j50656
10666I55560Q7001m089n1387j5606j33454J18016N5529J14262j77513l1818J15782
10655A032283k00928P5947J76172N7328J8864J65238L4362k91058L6073q8832
$$ plain form
10645 1015449 1154816 1240397 1214586 1361533 1439925 1501182 1603810 1459966 1550071 1570461
10635 1570461 1381580 1278584 1222878 1356152 1647176 1860390 1453843 1114089 1402124 1488396
10625 1488396 1341920 1281482 1357619 1421032 1364646 1417319 1554092 1689626 1675447 1392159
10615 1392159 1335587 1258032 1267051 1206864 1090129 1075485 942264 990711 1049128 1068034 1081826
10604 1081826 1184743 1162597 1225148 1315502 1360960 1525252 1561029 1459031 1431727 1363436 1474810
10593 1474810 1450084 1720350 2047692 2002054 1779778 1920895 2090654 2213749 2328627 2277124
10583 2277124 2156816 2104668 2147799 1955854 1693193 1810911 1934364 1895640 1873143 1974195
10573 1974195 1704344 1649590 1702952 1759501 1807803 1805091 2069697 2099987 2053013 2007275 1748706
$$ packed form
10645A015449J39367Q5581k5811J46947P8392O1257J02628j43844R0105K0390
10635A570461j88881j02996n5706J33274K91024K13214m06547l39754K88035Q6272
10625A488396j46476o0438P6137O3413n6386N2673J36773J35534j4179k83288
10615A392159n6572p7555R019o0187j16735j4644j33221M8447N8417J8906J3792
10604A081826J02917k2146O2551R0354M5458J64292L5777j01998k7304o8291J11374
10593A474810k4726K70266L27342m5638k22276J41117J69759J23095J14878n1503
10583B277124j20308n2148M3131j91945k62661J17718J23453l8724k2497J01052
10573A974195k69851n4754N3362N6549M8302k712K64606L0290m6974m5738k58569
$$ plain form
10562 1748706 1531235 1663886 1789433 1766286 1901237 2173947 2465871 2384559 2268022 2341548
10552 2341548 2084778 2016195 1751384 1559363 1459015 1530768 1498054 1511050 1612881 1592583
10542 1592583 1563455 1435053 1626493 1726285 1691579 1783348 1767184 1693685 1609532 1467429 1314671
10531 1314671 1562421 1623675 1618659 1943526 2090724 1729100 1444968 1625199 1814122 1967100
10521 1967100 2366718 2592820 2557327 2606331 2891377 2854533 2909546 3110536 3163438 2982015
10511 2982015 2833937 2568875 2504436 2416161 2092960 1886325 1864516 1855794 1676224 1574635
10501 1574635 1454053 1453707 1415068 1294635 1325592 1591006 1652598 1720467 1921194 2025756 1886430
10490 1886430 2125750 2588786 2597712 2551749 2361194 2461011 2448015 2184174 2055347 1994182
$$ packed form
10562A748706k17471J32651J25547k3147J34951K72710K91924q1312j16537P3526
10552B341548k56770o8583k64811j92021j00348P1753l2714J2996J01831k0298
10542A592583k9128j28402J91440R9792l4706R1769j6164p3499q4153j42103j52758
10531A314671K47750O1254n016L24867J47198l61624k84132J80231J88923J52978
10521A967100L99618K26102l5493M9004K85046l6844N5013K00990N2902j81423
10511B982015j48078k65062o4439q8275l23201k06635k1809q722j79570j01589
10501A574635j20582l46l8639j20433L0957K65414O1592O7869K00727J04562j39326
10490A886430K39320M63036Q926m5963j90555R9817j2996k63841j28827o1165
$$ plain form
10480 1994182 1981905 2008036 1788790 1723959 2240934 2539067 2486270 2452901 2333399 2098306
10470 2098306 2005647 1987137 1972200 2025856 1937944 1724320 1768923 1970700 1950297 2304811 2413374
10459 2413374 2350286 2488359 2716775 2798475 2749264 2867387 2980444 2882284 2593431 2431559
10449 2431559 2163188 2226025 2445002 2443730 2359028 2406837 2411618 2371795 2365061 2482558 2341895
10438 2341895 1950639 1883179 1902743 1834909 1722551 1894732 2146067 1979430 2138554 2263000
10428 2263000 2195209 2188018 2167315 2284903 2509400 2445614 2789311 2999799 3305878 3558714
10418 3558714 3730023 3658733 3548062 3487263 3519153 3322189 3269297 3264215 3193483 3085400 2955133
10407 2955133 2782671 2572857 2346190 2261289 2299032 2314387 2491793 2333315 2121714 2180629
$$ packed form
10480A994182j2277K6131k19246o4831N16975K98133n2797l3369j19502k35093
10470B098306r2659j8510j4937N3656q7912k13624M4603K01777k0403L54514J08563
10459B413374o3088J38073K28416Q1700m9211J18123J13057r8160k88853j61872
10449B431559k68371O2837K18977j272q4702M7809M781l9823o734J17497j40663
10438B341895l91256o7460J9564o7834j12358J72181K51335j66637J59124J24446
10428B263000o7791p191k0703J17588K24497o3786L43697K10488L06079K52836
10418C558714J71309p1290j10671o0799L1890j96964n2892n082p0732j08083j30267
10407B955133j72462k09814k26667q4901L7743J5355J77406j58478k11601N8915
$$ plain form
10397 2180629 2127404 1889871 1762092 1574961 1676663 1982117 2005122 1883872 1828924 1907248
10387 1907248 1928416 1587430 1321496 1422972 1510995 1677171 1787670 1853125 1659815 1554057
10377 1554057 1583826 1638117 1643349 1368747 1427673 1741822 1776357 1815913 1859252 1881268 1913357
10366 1913357 1768982 1621051 1468672 1430959 1612446 1689972 1751538 1833880 1694341 1722849
10356 1722849 1560282 1481691 1762798 1876427 1968026 1866451 2010664 2347564 2227094 1984156
10346 1984156 1863247 1719742 1791858 1714298 1890945 1836314 1888341 2032964 2215869 2204035
10336 2204035 2365037 2535905 2370891 1974595 1736051 1614232 1678828 1713648 1834222 1826618
10326 1826618 1717449 1685374 1732965 1865625 1819781 1612805 1602201 1790506 2158322 2216516
$$ packed form
10397B180629n3225k37533j27779j87131J01702L05454K3005j21250n4948P8324
10387A907248K1168l40986k65934J01476Q8023J66176J10499O5455j93310j05758
10377A554057K9769N4291N232k74602N8926L14149L4535L9556M3339K2016L2089
10366A913357j44375j47931j52379l7713J81487P7526O1566Q2342j39539K8508
10356A722849j62567p8591K81107J13629R1599j01575J44213L36900j20470k42938
10346A984156j20909j43505P2116p7560J76647n4631N2027J44623J82905j1834
10336B204035J61002J70868j65014l96296k38544j21819O4596L4820J20574p604
10326A826618j09169l2075M7591J32660m5844k06976j0604J88305L67816N8194
$$ plain form
10316 2216516 2107552 2132514 2299860 2517817 2273508 1964080 2004669 2253746 2266812 2180294
10306 2180294 2007338 1901681 2219538 2428493 2362503 2519865 2428625 2466691 2614174 2595019
10296 2595019 2611261 2489978 2423575 2178136 2275823 2290631 2152808 2273587 2356995 2254955
10286 2254955 2193804 2043487 2052162 2140967 2111170 2325776 2544066 2580224 2621245 2651522 2773305
10275 2773305 2852775 2833202 2704576 2760507 2889551 2904522 2971141 2793820 2412889 2407885 2723250
10264 2723250 2788766 2516225 2500313 2596519 2716140 2755249 2719346 2622950 2563185 2620357 2549572
10253 2549572 2470153 2316371 2252212 2294279 2037327 1809442 1827146 2102001 2322021 2307209
10243 2307209 2048858 1799196 1660451 1870441 2116071 2267884 2508960 2387734 2265128
$$ packed form
10316B216516j08964K4962J67346K17957k44309l09428M0589K49077J3066q6518
10306B180294j72956j05657L17857K08955o5990J57362r1240L8066J47483j9155
10296B595019J6242j21283o6403k45439R7687J4808j37823J20779Q3408j02040
10286B254955o1151j50317Q675Q8805k9797K14606K18290L6158M1021L0277J21783
10275B773305P9470j9573j28626N5931J29044J4971O6619j77321l80931n004L15365
10264B723250O5516k72541j5912R6206J19621L9109l5903r6396n9765N7172p0785
10253B549572p9419j53782o4159M2067k56952k27885J7704K74855K20020j4812
10243B307209k58351k49662j38745K09990K45630J51813K41076j21226j22606
$$ plain form
10234 2265128 2243296 2358987 2417890 2559925 2606003 2536869 2554652 2552550 2272966 2351154 2784408
10223 2784408 3001378 3020988 3045521 3068635 3141857 3365296 3351084 3050501 2744734 2445025
10213 2445025 2323835 2389954 2638157 2839353 2793274 2683460 2546861 2588706 2579111 2683305
10203 2683305 2518166 2424604 2311183 2249542 2443654 2433933 2439512 2595704 2526533 2581308 2615803
10192 2615803 2425213 2421314 2683796 2462350 2384616 2389875 2581058 2676203 2562815 2603473 2681473
10181 2681473 2636917 2685288 2940810 3024026 2875071 2712864 2806022 2965132 3131377 3173259
10171 3173259 3006048 3052178 3259639 3340149 3119317 2970378 3140136 3186443 3287210 3087819
10161 3087819 2930746 3039111 3064239 2941902 3061685 3366512 3239230 3089182 3118871 2822495
$$ packed form
10234B265128k1832J15691N8903J42035M6078o9134J7783k102k79584P8188M33254
10223B784408K16970J9610K4533K3114P3222K23439j4212l00583l05767k99709
10213B445025j21190O6119K48203K01196m6079j09814j36599M1845r595J04194
10203B683305j65139r3562j13421o1641J94112r721N579J56192o9171N4775L4495
10192B615803j90590l899K62482k21446p7734N259J91183R5145j13388M0658P8000
10181B681473m4556M8371K55522Q3216j48955j62207R3158J59110J66245M1882
10171C173259j67211M6130K07461Q0510k20832j48939J69758M6307J00767j99391
10161C087819j57073J08365K5128j22337J19783L04827j27282j50048K9689k96376
$$ plain form
10151 2822495 2419389 2347904 2390077 2321042 2364799 2450820 2379113 2497818 2575024 2534733 2374689
10140 2374689 2221453 2109730 2290100 2329586 2189050 2517019 2543845 2584263 2677960 2908011
10130 2908011 2985692 2910183 2708359 2583633 2632900 2825479 2764313 2486537 2453097 2526790
10120 2526790 2340081 2478337 2556058 2456366 2431979 2348551 2491848 2694450 2470174 2383343
10110 2383343 2388833 2547593 2772448 2905253 2980201 3181706 3203486 3201255 2842353 2734028
10100 2734028 2744437 2699566 2636171 2728376 2567255 2581858 2616402 2560339 2464519 2681972 2530584
10089 2530584 2729313 3069837 3159255 2976284 2769239 2802750 3015748 3196396 3077831 3082076
10079 3082076 3201276 3335286 3487498 3554304 3571366 3412514 3501874 3518912 3609051 3746691
$$ packed form
10151B822495m03106p1485M2173o9035M3757Q6021p1707J18705P7206m0291j60044
10140B374689j53236j11723J80370L9486j40536L27969K6826M0418R3697K30051
10130B908011P7681p5509k01824j24726M9267J92579o1166k77776l3440P3693
10120B526790j86709J38256P7721r9692k4387q3428J43297K02602k24276q6831
10110B383343N490J58760K24855J32805P4948K01505K1780k231l58902j08325
10100B734028J0409m4871o3395R2205j61121J4603L4544n6063r5820K17453j51388
10089B530584J98729L40524Q9418j82971k07045L3511K12998J80648j18565M245
10079C082076J19200J34010J52212O6806J7062j58852Q9360J7038R0139J37640
$$ plain form
10069 3746691 3676048 3832792 3982961 3921930 4139300 4300189 4250090 4263553 4418213 4675658
10059 4675658 4856454 5006889 5126612 5272332 5790501 6860783 8129673 8477349 7810541
10050 7810541 6829337 5964446 5498968 5222873 4962543 4692710 4785264 4719330 4629306 4694434
10040 4694434 4796622 4599200 4365702 4381064 4253948 3990609 3897871 4067541 3911996 3632198
10030 3632198 3583989 3481519 3398324 3494588 3401565 3489555 3626014 3610238 3587155 3370860 3395782
10019 3395782 3579553 3763303 3780973 3673271 3733296 3741729 3630261 3845454 3804863 3916548
10009 3916548 3852468 3970943 4000380 4046568 4163424 3941810 4127848 4592612 4655478 4420429
9999 4420429 4496963 4664110 4979256 5402582 5687267 5937759 6368850 6679135 6374563 6059210
$$ packed form
10069C746691p0643J56744J50169o1031K17370J60889n0099J3463J54660K57445
10059D675658J80796J50435J19723J45720N18169J070282J268890L47676o66808
10050G810541r81204q64891m65478k76095k60330k69833R2554o5934r0024O5128
10040D694434J02188j97422k33498J5362j27116k63339r2738J69670j55545k79798
10030C632198m8209j02470q3195R6264r3023Q7990J36459j5776k3083k16295K4922
10019C395782J83771J83750J7670j07702O0025Q433j11468K15193m0591J11685
10009C916548o4080J18475K9437M6188J16856k21614J86038M64764O2866k35049
9999D420429P6534J67147L15146M23326K84685K50492M31091L10285l04572l15353
$$ plain form
9989 6059210 5796178 5513045 5308645 5419535 5478537 5623016 5631507 5553687 5431744 5615240
9979 5615240 5931549 6016266 5884766 6016329 6147052 5984839 5885796 5818730 5740926 6053428
9969 6053428 6088383 5842923 5834793 5979359 6179710 6228349 6260363 6595717 6642390 6421299 6591366
9958 6591366 6857807 7042059 7308091 7646452 7873564 8023305 8235972 8737096 8813830 8909765
9948 8909765 8962523 8847805 8949880 9382026 9832496 10037987 10261598 10518271 10708118 10894651
9938 10894651 11029520 11304838 11759240 12491188 13568659 15229219 17272806 20545937 24176671
9929 24176671 26141879 25079191 22046042 19184693 16856795 15439864 14774783 14564955
9921 14564955 14598514 14549059 14403937 14541207 14774613 14878826 15078877 15366050 15548420 15678945
$$ packed form
9989F059210k63032k83133k04400J10890N9002J44479Q491p7820j21943J83496
9979E615240L16309Q4717j31500J31563J30723j62213r9043o7066p7804L12502
9969F053428L4955k45460q130J44566K00351M8639L2014L35354M6673k21091J70067
9958F591366K66441J84252K66032L38361K27112J49741K12667N01124P6734R5935
9948H909765N2758j14718J02075M32146M50470K05491K23611K56673J89847J86533
9938A0894651J34869K75318M54402P31948J077471J660560K043587L273131L630734
9929B4176671J965208j062688l033149k861349k327898j416931o65081k09828
9921A4564955L3559m9455j45122J37270K33406J04213K00051K87173J82370J30525
$$ plain form
9911 15678945 15710705 16056359 16160338 16071681 16066995 16319054 16722670 17018165 17004266 17354074
9901 17354074 18021358 18381065 18668275 19176965 19828715 20439657 21380008 22308943 23572607
9892 23572607 24574316 25382190 26410878 27583929 29034123 30411706 31928309 33392194
9884 33392194 34660794 35625733 36416763 37035544 37075271 37311519 37290615 37111221 37249848 37552156
9874 37552156 38157289 38608000 39376880 40247306 41044309 41768552 42704910 43788678 44618974
9865 44618974 45223538 45652365 45849537 46007860 46046648 46317717 46614798 47252345 47849690 48585573
9855 48585573 49064089 49350901 49389386 49773549 50165123 50542545 50806709 51432597 52822373
9846 52822373 53973021 55476644 57257414 58965793 60294802 61217271 61734907 62124566 62477128
$$ packed form
9911A5678945L1760L45654J03979q8657m686K52059M03616K95495j3899L49808
9901A7354074O67284L59707K87210N08690O51750O10942R40351R28935J263664
9892B3572607J001709Q07874J028688J173051J450194J377583J516603J463885
9884C3392194J268600R64939P91030O18781L9727K36248k0904j79394J38627L02308
9874C7552156O05133M50711P68880Q70426P97003P24243R36358J083768Q30296
9865D4618974O04564M28827J97172J58323L8788K71069K97081O37547N97345P35883
9855D8585573M78516K86812L8485L84163L91574L77422K64164O25888J389776
9846E2822373J150648J503623J780770J708379J329009R22469N17636L89659L52562
$$ plain form
9837 62477128 63055867 63746000 64535386 65716166 67162938 68958255 71106186 73457231 75615033
9828 75615033 77619381 79005342 79083183 77980757 76333940 74313394 72375249 70742591
9820 70742591 69534553 69022196 68902562 69199132 69958357 70860981 71770031 72694739 73388943
9811 73388943 73890258 74417282 74704574 75003801 75409962 75515492 75973617 77049171 78312889
9802 78312889 79895576 81317565 82687164 83931016 85041325 86047916 86837874 87151190
9794 87151190 87087226 86689245 86154123 85361468 83993767 82270626 80375713 78406172 76387263
9785 76387263 74435765 72653465 71150139 70042097 69132500 67762827 66399171 65077607
9777 65077607 63381231 61176067 58832680 56470375 54180738 52079853 50417438 48945046
$$ packed form
9837F2477128N78739O90133P89386J180780J446772J795317K147931K351045K157802
9828G5615033K004348J385961P7841j102426j646817k020546j938145j632658
9820G0742591j208038n12357j19634K96570P59225R02624R09050R24708O94204
9811G3388943N01315N27024K87292K99227M06161J05530M58125J075554J263718
9802G8312889J582687J421989J369599J243852J110309J006591P89958L13316
9794H7151190o3964l97981n35122p92655j367701j723141j894913j969541k018909
9785G6387263j951498j782300j503326j108042r09597j369673j363656j321564
9777F5077607j696376k205164k343387k362305k289637k100885j662415j472392
$$ plain form
9769 48945046 47846782 47039172 46333567 46143731 46273257 46668507 47202363 47644532 48008937
9760 48008937 48422521 48874605 48767127 48366242 47669650 46868541 45990063 45117542 44127876
9751 44127876 43208036 42212461 41456440 40842265 40100303 39507659 38995216 38519805 38276128
9742 38276128 38056915 37875609 37700547 37505968 37448885 37428556 37389209 37465320 37348528 36901759
9732 36901759 36514654 36257645 35982939 35596565 34819592 34119708 33475941 32830818 32276042
9723 32276042 31715576 31240052 30785429 30498868 30382040 30161356 29999949 29614134 28903079
9714 28903079 28023206 26973033 25840796 24897628 23822127 22826632 21947107 21255867 20560002
9705 20560002 20277381 19906506 19312369 18922698 18582873 18102849 17852546 17641481 17335789
$$ packed form
9769D8945046j098264q07610p05605j89836J29526L95250N33856M42169L64405
9760D8008937M13584M52084j07478m00885o96592q01109q78478q72521r89666
9751D4127876r19840r95575p56021o14175p41962n92644n12443m75411k43677
9742C8276128k19213j81306j75062j94579n7083k0329l9347P6111j16792m46769
9732C6901759l87105k57009k74706l86374p76973o99884o43767o45123n54776
9723C2276042n60466m75524m54623k86561j16828k20684j61407l85815p11055
9714B8903079q79873j050173j132237r43168j075501r95495q79525o91240o95865
9705B0560002k82621l70875n94137l89671l39825m80024k50303k11065l05692
$$ plain form
9696 17335789 17061707 17146438 17318521 17337932 17372529 17117896 16751591 16506119 16367651 16149016
9686 16149016 15962768 15835677 15956246 16215384 16560816 17044044 17488929 17886881 18289629
9677 18289629 18698024 19580209 20405765 21343471 22048461 22443377 22703055 22947460 22941273 22543922
9667 22543922 22404784 22324084 22263040 22518637 22887312 23234344 23385056 23165217 22711875 22439872
9657 22439872 22228488 21881793 21560451 21413799 21308012 21354600 21407525 21698646 22075541 22138583
9647 22138583 21974665 21818878 21379489 21195836 21222344 21217570 21219223 21576327 22085947 22591149
9637 22591149 23098693 23667110 24045756 24114997 23896247 23301659 22579015 21949167 21406097 21480074
9627 21480074 21857074 22161557 22312115 22767589 23032635 23201406 23484115 23745619 23930628
$$ packed form
9696A7335789k74082Q4731J72083J9411L4597k54633l66305k45472j38468k18635
9686A6149016j86248j27091J20569K59138L45432M83228M44885L97952M02748
9677A8289629M08395Q82185Q25556R37706P04990L94916K59678K44405o187l97351
9667B2543922j39138q0700o1044K55597L68675L47032J50712k19839m53342k72003
9657B2439872k11384l46695l21342j46652j05787M6588N2925K91121L76895O3042
9647B2138583j63918j55787m39389j83653K6508m774J653L57104N09620N05202
9637B2591149N07544N68417L78646O9241k18750n94588p22644o29848n43070P3977
9627B1480074L77000L04483J50558M55474K65046J68771K82709K61504J85009
$$ plain form
9618 23930628 24098509 23990735 23908948 23820614 23773379 23597406 22907203 22352506 21793131 21505179
9608 21505179 21328855 21015644 20715308 20727769 20616091 20658643 21036997 21294948 21606775 21578570
9598 21578570 21630577 21861587 22185823 22607242 23159278 24233240 25139208 25809001 26248101
9589 26248101 26252941 26094227 25502680 25104417 24965999 24792949 24846860 25147013 25435122 25666776
9579 25666776 26089266 26257354 26547186 26471361 25713522 24753972 24080253 23647801 22926843 22160416
9569 22160416 21845556 21609889 21236163 21074431 20998411 20888151 20648533 20168456 19808512 19693179
9559 19693179 19597031 19655270 19759089 19636728 19426979 19267959 19116898 19119496 18946112 18997543
9549 18997543 19127640 19205907 18888666 18883996 18863068 18553746 18510045 18544551 18426863 18531636
$$ packed form
9618B3930628J67881j07774q1787q8334m7235j75973o90203n54697n59375k87952
9608B1505179j76324l13211l00336J2461j11678M2552L78354K57951L11827k8205
9598B1578570N2007K31010L24236M21419N52036J073962R05968O69793M39100
9589B6248101M840j58714n91547l98263j38418j73050N3911L00153K88109K31654
9579B5666776M22490J68088K89832p5825p57839r59550o73719m32452p20958p66427
9569B2160416l14860k35667l73726j61732p6020j10260k39618m80077l59944j15333
9559A9693179r6148N8239J03819j22361k09749j59020j51061K598j73384N1431
9549A8997543J30097P8267l17241m670k0928l09322m3701L4506j17688J04773
$$ plain form
9539 18531636 18718332 19150884 19365329 19685738 20170521 20672223 21156016 21676013 21555829
9530 21555829 21126410 20764588 20334990 19922087 19626797 19388958 19303984 19179527 19343878 19642910
9520 19642910 20096703 20171635 20027721 19845524 19792265 19633352 19252585 19015694 18905488 18738683
9510 18738683 18629513 18181314 17832783 17741266 17460733 17126626 17086599 17065022 16855280 16725933
9500 16725933 16411027 16153717 15982685 15849695 15720168 15513420 15328020 15449841 15276814
9491 15276814 15095413 14950670 14991474 14943838 14587214 14508753 14645248 14687221 14689276 14813355
9481 14813355 15091569 15048179 14900916 14993275 15260525 15656612 16003090 16335530 16512105 16573083
9471 16573083 16616845 16897345 17193999 17384128 17709213 17984341 18154562 18488531 18690670 18881871
$$ packed form
9539A8531636J86696M32552K14445L20409M84783N01702M83793N19997j20184
9530B1555829m29419l61822m29598m12903k95290k37839q4974j24457J64351K99032
9520A9642910M53793P4932j43914j82197n3259j58913l80767k36891j10206j66805
9510A8738683j09170m48199l48531r1517k80533l34107m0027k1577k09742j29347
9500A6725933l14906k57310j71032j32990j29527k06748j85400J21821j73027
9491A5276814j81401j44743M0804m7636l56624p8461J36495M1973K055J24079
9481A4813355K78214m3390j47263R2359K67250L96087L46478L32440J76575O0978
9471A6573083M3762K80500K96654J90129L25085K75128J70221L33969K02139J91201
$$ plain form
9461 18881871 19068178 19112835 19004256 19032367 19047692 19260356 19677345 19724492 19748761 19727140
9451 19727140 19637394 19794781 19925834 19715702 19433772 19383325 19371083 19272459 19065305 18933149
9441 18933149 18558885 18344864 18278255 18510350 18561304 18674194 18812703 18794142 18847431 18855258
9431 18855258 19188254 19721208 20192189 20823821 21404820 21881583 22539050 23207598 24294061
9422 24294061 25650542 26814225 27930508 28993959 29696169 30110614 30349744 30224867 30003203
9413 30003203 29631416 29459991 29408472 29365491 29347384 29410684 29879807 30577578 31272746 32493943
9403 32493943 34038378 35877643 38153631 40805216 43552249 46007535 47941191 49296057
9395 49296057 49543194 48604239 47032942 45022091 42812308 40290932 38242470 36752493
$$ packed form
9461A8881871J86307M4657j08579K8111J5325K12664M16989M7147K4269k1621
9451A9727140q9746J57387J31053k10132k81930n0447j2242r8624k07154j32156
9441A8933149l74264k14021o6609K32095N0954J12890J38509j8561N3289P827
9431A8855258L32996N32954M70981O31632N80999M76763O57467O68548J086463
9422B4294061J356481J163683J116283J063451P02210M14445K39130j24877k21664
9413C0003203l71787j71425n1519m2981j8107O3300M69123O97771O95168J221197
9403C2493943J544435J839265K275988K651585K747033K455286J933656J354866
9395D9296057K47137r38955j571297k010851k209783k521376k048462j489977
$$ plain form
9387 36752493 35420553 34600265 34176264 34113263 34354273 34744510 35357388 36425655 37876721
9378 37876721 39498071 41534743 43486792 45550576 47214092 48174901 48351453 48128766 47675226
9369 47675226 47080082 46513142 45910605 45349681 45124796 44990310 44729256 44227287 43929984
9360 43929984 43549956 43085663 42772922 42514327 42362502 42030203 42129872 42370936 42885411 43422298
9350 43422298 43913745 44653559 45218192 45993460 46666578 47701641 48973714 50479203 52416861
9341 52416861 54293264 56405156 58655860 60987043 63155897 65174752 67239734 69184075
9333 69184075 70861165 72470650 73887010 75227175 76582666 77394752 78109457 78891359 80087683
9324 80087683 81660930 83399379 85172027 86998296 88987548 90762922 92327588 93577020
$$ packed form
9387C6752493j331940q20288m24001o3001K41010L90237O12878J068267J451066
9378C7876721J621350K036672J952049K063784J663516R60809J76552k22687m53540
9369D7675226n95144n66940o02537n60924k24885j34486k61054n01969k97303
9360D3929984l80028m64293l12741k58595j51825l32299R9669K41064N14475N36887
9350D3422298M91447P39814N64633P75268O73118J035063J272073J505489J937658
9341E2416861J876403K111892K250704K331183K168854K018855K064982J944341
9333F9184075J677090J609485J416360J340165J355491Q12086P14705P81902J196324
9324H0087683J573247J738449J772648J826269J989252J775374J564666J249432
$$ plain form
9316 93577020 94454613 95391739 96672500 97836238 98847321 99633965 100227545 100333421 99648610
9307 99648610 98596084 97493929 96893360 96243904 95551538 95226437 94987776 95088320 95745765
9298 95745765 96842922 98716775 101483828 104715273 108256957 112222114 116270577 120242923
9290 120242923 124677011 129496573 134343288 139387059 144709930 150308958 157024462 165110353
9282 165110353 174637854 184968708 194889535 203015622 208552851 211575564 212698328 213051307
9274 213051307 213906081 215621244 217288134 217412549 215109038 209917181 201648043 190944625
9266 190944625 178961713 167069563 155881183 145151472 134730749 124683522 115364123
9259 115364123 107175304 99909118 94146289 89760836 86900151 84837186 83310934 82304692
$$ packed form
9316I3577020Q77593R37126J280761J163738J011083P86644N93580J05876o84811
9307I9648610j052526j102155o00569o49456o92366l25101k38661J00544O57445
9298I5745765J097157J873853K767053L231445L541684L965157M048463L972346
9290A20242923M434088M819562M846715N043771N322871N599028O715504Q085891
9282A65110353R527501J0330854R920827Q126087N537229L022713J122764L52979
9274B13051307Q54774J715163J666890J24415k303511n191857q269138j0703418
9266A90944625j1982912j1892150j1188380j0729711j0420723j0047227r319399
9259A15364123q188819p266186n762829m385453k860685k062965j526252j006242
$$ plain form
9251 82304692 81593401 80872543 79919150 78967667 77989696 77618805 77886887 78724932 80606386
9242 80606386 82954462 85781322 88344646 89964751 90356457 89386125 87289632 83858451
9234 83858451 79764858 75156742 70714913 67047273 64343212 62862982 62218397 62057613
9226 62057613 62622561 63863230 65340360 66800569 67836733 68381439 68881825 69352910 70018120
9217 70018120 70439084 70767313 71066924 70911180 70400662 69745972 68550535 66398852 63581104
9208 63581104 60448189 56864075 53604861 50691961 48152824 45999927 43960077 42241463
9200 42241463 40950558 39946566 39583755 39439365 39151409 39037257 39009252 39048209 38969790 38671869
9190 38671869 38525731 38271157 37778764 37225672 36857468 36027595 34793177 33726180 33178397
$$ packed form
9251H2304692p11291p20858r53393r51483r77971l70891K68082Q38045J881454
9242H0606386K348076K826860K563324J620105L91706r70332k096493l431181
9234H3858451m093593m608116m441829l667640k704061j480230o44585j60784
9226F2057613N64948J240669J477130J460209J036164N44706N00386M71085O65210
9217G0018120M20964L28229K99611j55744n10518o54690j195437k151683k817748
9208F3581104l132915l584114l259214k912900k539137k152897k039850j718614
9200D2241463j290905j003992l62811j44390k87956j14152k8005L8957p8419k97921
9190C8671869j46138k54574m92393n53092l68204q29873j234418j066997n47783
$$ plain form
9181 33178397 33006444 32891857 33296833 34024604 34773821 35591234 36567183 37732391 38695069
9172 38695069 39345749 39938078 40437828 41477683 42739639 44527858 46896767 49968247 54496172
9163 54496172 60665847 69223101 79828474 92866090 108099079 124675753 141977396
9156 141977396 159466716 175838265 190206151 202121338 211642260 218558022 223093090
9149 223093090 225587829 226618445 226634988 225537354 222153973 215902430 206783177 195074906
9141 195074906 180951383 165336380 149420866 134045800 119650614 106619591 94811141
9134 94811141 84763446 76204863 68783875 62757813 57730149 53640495 50080771 47045661
9126 47045661 44273747 41675771 39463674 37232324 35561269 33988206 32573242 31675642
$$ packed form
9181C3178397j71953j14587M04976P27771P49217Q17413R75949J165208R62678
9172C8695069O50680N92329M99750J039855J261956J788219K368909L071480M527925
9163E4496172O169675Q557254J0605373J3037616J5232989J6576674J7301643
9156A41977396J7489320J6371549J4367886J1915187R520922O915762M535068
9149B23093090K494739J030616J6543j097634l383381o251543r119253j1708271
9141A95074906j4123523j5615003j5915514j5375066j4395186j3031023j1808450
9134I4811141j0047695q558583p420988o026062n027664m089654l559724l035110
9126D7045661k771914k597976k212097k231350j671055j573063j414964q97600
$$ plain form
9118 31675642 31215398 30780960 30196865 30099822 29994090 30175868 30495945 30966532 31651529 32308421
9108 32308421 33158578 34024535 34954322 35570221 36087208 36891953 37370326 37355722 36997068 36594663
9098 36594663 36205127 35658076 35026011 34600539 34162672 33865014 33693599 33664652 34058439 34933711
9088 34933711 36096262 37613866 39454727 41453424 42972003 43848895 44249703 44285868 44061740
9079 44061740 44001243 44662140 45458192 46702005 47795445 48820273 49557300 49994302 49791305
9070 49791305 49174846 48729251 48525945 47813751 47086010 46857759 46530424 46351565 45949276
9061 45949276 45130653 44095858 42993854 41627494 40265646 39274426 38623670 38250136 38085633
9052 38085633 37951687 37808928 37646732 37386730 36965456 36781061 36614214 36086780 35394328
$$ packed form
9118C1675642m60244m34438n84095r7043j05732J81778L20077M70587O84997O56892
9108C2308421Q50157Q65957R29787O15899N16987Q04745M78373j4604l58654m02405
9098C6594663l89536n47051o32065m25472m37867k97658j71415k8947L93787Q75272
9088C4933711J162551J517604J840861J998697J518579Q76892M00808L6165k24128
9079D4061740o0497O60897P96052J243813J093440J024828P37027M37002k02997
9070D9791305o16459m45595k03306p12194p27741k28251l27335j78859m02289
9061D5949276q18623j034795j102004j366360j361848r91220o50756l73534j64503
9052C8085633j33946j42759j62196k60002m21274j84395j66847n27434o92452
$$ plain form
9043 35394328 34600181 33930224 33268398 32499352 32070528 31907629 31844177 31644402 31695728 32060305
9033 32060305 32627726 32938367 33297386 33624792 33717654 33755760 33999593 34311203 34541714 34800689
9023 34800689 35236852 35741576 36183141 36436323 36488334 36327526 35825952 35126289 33971243
9014 33971243 32539339 31388186 30458675 29590653 28996961 28432213 28384477 28475230 29065005
9005 29065005 30113108 31200426 32642871 34076690 34968526 35945541 36732986 37614274 38501390
8996 38501390 39595977 41085965 42650133 44227155 45479603 45958605 45801036 45250871 44666596
8987 44666596 43653027 42761574 42614763 42713619 42925148 43303800 43660642 43625535 43131106 41971315
8977 41971315 40672256 39658694 38592288 37390977 36276905 35305462 34952805 34550406 34587411
$$ packed form
9043C5394328p94147o69957o61826p69046m28824j62899o3452j99775N1326L64577
9033C2060305N67421L10641L59019L27406R2862L8106K43833L11610K30511K58975
9023C4800689M36163N04724M41565K53182N2011j60808n01574o99663j155046
9014C3971243j431904j151153r29511q68022n93692n64748m7736R0753N89775
9005B9065005J048103J087318J442445J433819Q91836R77015P87445Q81288Q87116
8996C8501390J094587J489988J564168J577022J252448M79002j57569n50165n84275
8987D4666596j013569q91453j46811R8856K11529L78652L56842l5107m94429j159791
8977D1971315j299059j013562j066406j201311j114072r71443l52657m02399L7005
$$ plain form
8968 34587411 34611494 34527234 34270604 33635868 32811556 32045901 31191230 30479090 29991638 29584718
8958 29584718 29297234 29149588 29183890 29348689 29692057 30218313 30644633 31205839 31493416 31734329
8948 31734329 31930894 32102148 32165609 32453185 32933818 33403096 34184014 35268957 36668640
8939 36668640 37760707 38586096 39335288 40155587 40923195 41335555 41912820 42359527 42659298
8930 42659298 42559636 41701384 40921316 40367293 39863249 39158509 38285704 37136088 35950700
8921 35950700 34962351 34178368 33305700 33162597 33507674 34430296 35403512 36210065 36988383
8912 36988383 37664756 38045891 38063734 37799356 37434382 37377244 37395278 37587116 37449161 37327790
8902 37327790 37013858 36487189 35920434 35116014 34625416 33943027 32999845 32341890 31850466
$$ packed form
8968C4587411K4083q4260k56630o34736q24312p65655q54671p12140m87452m06920
8958B9584718k87484j47646L4302J64799L43368N26256M26320N61206K87577K40913
8948C1734329J96565J71254O3461K87576M80633M69278P80918J084943J399683
8939C6668640J092067Q25389P49192Q20299P67608M12360N77265M46707K99771
8930D2659298r9662q58252p80068n54023n04044p04740q72805j149616j185388
8921C5950700r88349p83983q72668j43103L45077R22622R73216Q06553P78318
8912C6988383O76373L81135J7843k64378l64974n7138J8034J91838j37955j21371
8902C7327790l13932n26669n66755q04420m90598o82389r43182o57955m91424
$$ plain form
8893 31850466 31489936 31186968 30961801 31272044 31431480 31894809 32909752 33884979 35113442
8884 35113442 36375893 37742165 38843010 39604329 40438578 41077316 41497657 41863136 41995780
8875 41995780 42069921 41766155 41477019 41303767 40589295 40035001 39770870 39411645 39152010 38705280
8865 38705280 38016243 37326904 36696417 36242103 35757311 35678460 35743857 35744408 35825086 35981805
8855 35981805 35933172 36099496 36390514 36547873 36520760 36674866 36559896 36561475 36631880 36650578
8845 36650578 36611064 36410287 36751821 37013956 36697971 36168835 35789080 35612980 35540114 35594981
8835 35594981 35819277 36156511 36487010 36968259 37479820 37902516 38143936 37893871 37058669
8826 37058669 36219655 35459028 34588518 33625415 32678971 32143270 32033065 32066381 32534965 32848982
$$ packed form
8893C1850466l60530l02968k25167L10243J59436M63329J014943R75227J228463
8884C5113442J262451J366272J100845P61319Q34249O38738M20341L65479J32644
8875D1995780P4141l03766k89136j73252p14472n54294k64131l59225k59635m46730
8865C8705280o89037o89339o30487m54314m84792p8851O5397N51Q0678J56719
8855C5981805m8633J66324K91018J57359k7113J54106j14970J579P0405J8698
8845C6650578l9514k00777L41534K62135l15985n29136l79755j76100p2866N4867
8835C5594981K24296L37234L30499M81249N11561M22696K41420k50065q35202
8826C7058669q39014p60627q70510r63103r46444n35701j10205L3316M68584L14017
$$ plain form
8816 32848982 33364560 33973544 34259252 34642839 35074254 35230035 35496719 35410006 35241054 35026210
8806 35026210 34977396 35270811 35647836 35826772 35759062 36084190 36547918 36659540 36993169 37440886
8796 37440886 37949770 38688221 39786894 40688269 42205926 43497678 44832071 46093253 47226689
8787 47226689 48147962 48601582 48987993 49293146 49244291 48920309 48735951 48764900 48889503 49324371
8777 49324371 49829803 50025719 50192163 50429386 50791163 50593383 49812259 48688352 47566927
8768 47566927 46553081 45575415 44731496 43535657 42368998 41372000 40162846 39170982 38151822
8759 38151822 37296095 36625249 36124119 35894331 35622814 35391043 35582780 35887070 36306080
8750 36306080 36820268 37325151 37933448 38398827 38866189 39202502 39282351 39185922 39129842 39383495
$$ packed form
8816C2848982N15578O08984K85708L83587M31415J55781K66684q6713j68952k14844
8806C5026210m8814K93415L77025J78936o7710L25128M63728J11622L33629M47717
8796C7440886N08884P38451J098673R01375J517657J291752J334393J261182J133436
8787D7226689R21273M53620L86411L05153m8855l23982j84358K8949J24603M34868
8777D9324371N05432J95916J66444K37223L61777j97780p81124j123907j121425
8768D7566927j013846r77666q43919j195839j166659r96998j209154r91864j019160
8759C8151822q55727o70846n01130k29788k71517k31771J91737L04290M19010
8750C6306080N14188N04883O08297M65379M67362L36313P9849r6429n6080K53653
$$ plain form
8740 39383495 39798679 40507662 41411987 42146199 42892190 43462072 44225473 45192900 46149496
8731 46149496 46746558 46796258 46255078 45554391 44700049 43807780 42773712 41885178 41039228
8722 41039228 39881369 38957314 38469394 37795851 37205122 36921333 36553513 36275386 35961066
8713 35961066 35750102 35926944 36231618 36517199 36944546 37443090 38166818 38800460 38832876 38566621
8703 38566621 38143402 37737354 36943440 36263253 35888240 35401111 34728019 34530634 34234581
8694 34234581 33966094 33929925 33827114 33311329 32535956 31906425 30983349 30117310 29729355 29485911
8684 29485911 29188562 28817438 28427443 28053121 27499603 27051142 26616494 26411801 26701008
8675 26701008 27122935 27571813 27707386 27811693 27943221 27963603 27627365 26918844 26090324 25452256
$$ packed form
8740C9383495M15184P08983R04325P34212P45991N69882P63401R67427R56596
8731D6149496N97062M9700n41180p00687q54342q92269j034068q88534q45950
8722D1039228j157859r24055m87920o73543n90729k83789l67820k78127l14320
8713C5961066k10964J76842L04674K85581M27347M98544P23728O33642L2416k66255
8703C8566621m23219m06048p93914o80187l75013m87129o73092j97385k96053
8694C4234581k68487l6169j02811n15785p75373o29531r23076q66039l87955k43444
8684B9485911k97349l71124l89995l74322n53518m48461m34648k04693K89207
8675B6701008M21927M48878J35573J04307J31528K0382l36238p08521q28520o38068
$$ plain form
8665 25452256 25244174 24935335 24802464 24916885 25222974 25578298 26302293 27491099 28678359
8656 28678359 29558241 30527339 31329694 31642304 31893732 32610295 33432379 34128129 35036617
8647 35036617 35828831 36413004 36859064 37197565 37421144 37169087 36376091 35576574 34662755
8638 34662755 33369019 32139948 30744476 29800869 29367220 28579470 28082459 27627426 27651086
8629 27651086 27847925 28195744 28576351 29024923 29508254 29969947 30593953 31478576 31962707
8620 31962707 32033592 32036169 31996323 31764087 31305475 30626554 29738565 28787487 27620241 26347103
8610 26347103 24997140 23700010 22526660 21112747 20145367 19328744 18778303 18461736 18107870
8601 18107870 17524457 17044377 16655120 16588116 16850875 16855122 16798018 16745681 16946172 17554879
$$ packed form
8665B5452256k08082l08839j32871J14421L06089L55324P23995J188806J187260
8656B8678359Q79882R69098Q02355L12610K51428P16563Q22084O95750R08488
8647C5036617P92214N84173M46060L38501K23579k52057p92996p99517r13819
8638C4662755j293736j229071j395472r43607m33649p87750m97011m55033K3660
8629B7651086J96839L47819L80607M48572M83331M61693O24006Q84623M84131
8620C1962707P0885K577l9846k32236m58612o78921q87989r51078j167246j273138
8610B6347103j349963j297130j173350j413913r67380q16623n50441l16567l53866
8601A8107870n83413m80080l89257o7004K62759M247n7104n2337K00491O08707
$$ plain form
8591 17554879 17889484 18190341 18927513 19767630 20276144 20607718 21065539 21534499 21668677
8582 21668677 21964547 22570525 23151977 24015637 25119015 26718980 28270632 29818692 31457118
8573 31457118 33348113 34959363 36341055 37742973 38992907 40076925 40827779 41374889
8565 41374889 41862953 42359519 42629987 42497459 43029363 43731417 44241981 44841376 46406125
8556 46406125 49910000 55542092 64159049 77421340 98116157 130563615 183535339 266264432
8548 266264432 360038882 393045610 343886682 263573340 190339708 141359109 113401631
8541 113401631 97834492 88365660 82313191 78308520 75315147 73033494 71453548 69950474
8533 69950474 68170199 65707193 62759340 59131678 55320282 51950991 49373922 47601062
$$ packed form
8591A7554879L34605L00857P37172Q40117N08514L31574M57821M68960J34178
8582B1668677K95870O05978N81452Q63660J103378J599965J551652J548060J638426
8573C1457118J890995J611250J381692J401918J249934J084018P50854N47110
8565D1374889M88064M96566K70468j32528N31904P02054N10564N99395J564749
8556D6406125L503875N632092Q616957J3262291K0694817L2447458N2971724Q2729093
8548B66264432R3774450L3006728m9158928q0313342p3233632m8980599k7957478
8541A13401631j5567139r468832o052469m004671k993373k281653j579946j503074
8533F9950474j780275k463006k947853l627662l811396l369291k577069j772860
$$ plain form
8525 47601062 46648911 46285993 46724116 47594302 48284463 49190740 50621114 52817494 56104565
8516 56104565 61484619 70248013 83872954 105366326 139461964 195400207 280201365
8509 280201365 363299182 372696638 310012480 227176458 156799849 110899440 83845949
8502 83845949 67462939 57000437 49465392 44215297 40575737 37675706 35735755 34712473
8494 34712473 34183310 33682905 32954442 31948107 31215371 31126476 31410635 31490355 31633796 31922476
8484 31922476 32277737 33089109 33781264 34263127 34579143 35082910 36209276 37495975 39071182
8475 39071182 40656187 42125386 42994652 43560815 44085827 44366324 44455248 44860454 45402371
8466 45402371 46457609 47682389 49216253 51203266 53274740 55444722 57268295 58570353
$$ packed form
8525D7601062r52151l62918M38123Q70186O90161R06277J430374K196380L287071
8516E6104565N380054Q763394J3624941K1493372L4095638N5938243Q4801158
8509B80201365Q3097817R397456o2684158q2836022p0376609m5900409k7053491
8502H3845949j6383010j0462502p535045n250095l639560k900031j939951j023282
8494C4712473n29163n00405p28463j006335p32736q8895K84159P9720J43441K88680
8484C1922476L55261Q11372O92155M81863L16016N03767J126366J286699J575207
8475C9071182J585005J469199Q69266N66163N25012K80497Q8924M05206N41917
8466D5402371J055238J224780J533864J987013K071474K169982J823573J302058
$$ plain form
8458 58570353 59253048 59111085 58190052 56741116 55087710 52890294 50470482 48208808 46366695
8449 46366695 44772361 43760170 43404730 43019724 42377226 41502329 40516593 39168675 37587633
8440 37587633 35895331 34150987 32740848 31397206 30387094 29652533 29112585 28629562 28357608
8431 28357608 28139868 28045184 27848411 27981228 28187561 28048253 27890780 28135671 28600995 28938504
8421 28938504 29537281 29769403 30098160 30584918 31187170 31492409 31749847 32004373 32131024
8412 32131024 32010611 31842580 31635091 31760319 32124474 32289389 32768996 33745013 35304724
8403 35304724 37152219 39267537 41654833 44046430 46215783 48232403 49733783 50946865
8395 50946865 51710659 52288076 52606493 52707077 52258614 51883385 51766593 51454471 50766374
$$ packed form
8458E8570353O82695j41963r21033j448936j653406k197416k419812k261674j842113
8449D6366695j594334j012191l55440l85006o42498q74897r85736j347918j581042
8440C7587633j692302j744344j410139j343642j010112p34561n39948m83023k71954
8431B8357608k17740r4684j96773J32817K06333j39308j57473K44891M65324L37509
8421B8938504N98777K32122L28757M86758O02252L05239K57438K54526J26651
8412C2131024j20413j68031k07489J25228L64155J64915M79607R76017J559711
8403C5304724J847495K115318K387296K391597K169353K016620J501380J213082
8395E0946865P63794N77417L18417J00584m48463l75229j16792l12122o88097
$$ plain form
8386 50766374 49708311 48811984 47637241 46054860 44138872 42112692 40248526 38348028
8378 38348028 36877482 35817062 35051244 34326096 33749115 33174754 32822234 32499452 32440272
8369 32440272 32405544 32225932 31939167 31678230 31514947 31425240 31459474 31412845 31359339 31529452
8359 31529452 32032987 32448009 32554099 32752525 33192908 33192021 32767800 32385755 31644864 30543132
8349 30543132 29473562 28389467 27436702 26254790 25319557 24330337 23232940 22798058 22367405
8340 22367405 21990461 21818436 21637602 21161966 21082043 21156465 21409363 21834668 22526020 23480551
8330 23480551 24563383 25582010 26818928 28372368 29885540 31260490 32980755 35579296
8322 35579296 38918860 42941221 46821410 50439131 53730777 55528196 55132561 53461873
$$ packed form
8386E0766374j058063q96327j174743j582381j915988k026180j864166j900498
8378C8348028j470546j060420p65818p25148n76981n74361l52520l22782n9180
8369C2440272l4728j79612k86765k60937j63283q9707L4234m6629n3506J70113
8359C1529452N03535M15022J06090J98426M40383q87m24221l82045p40891j101732
8349C0543132j069570j084095r52765j181912r35233r89220j097397m34882m30653
8340B2367405l76944j72025j80834m75636p9923P4422K52898M25305O91352R54531
8330B3480551J082832J018627J236918J553440J513172J374950J720265K598541
8322C5579296L339564M022361L880189L617721L291646J797419l95635j670688
$$ plain form
8314 53461873 50891256 48498751 46388820 44995601 44300882 44286941 45134532 46680906 48998047
8305 48998047 51954271 55357246 57903910 59026266 58161629 55502956 51781636 47428256
8297 47428256 43181836 39697797 36570526 33892572 32139911 30777877 29825487 29105432
8289 29105432 28749054 28386317 27762844 27337599 27279150 27084597 26875673 26538521 25666165 25017857
8279 25017857 24827370 24446731 24178518 24234309 24475127 24956195 25602333 26405066 27030991 27497182
8269 27497182 27526317 27270619 26855551 26117761 25516088 25022602 24577265 24446515 23902881 23595051
8259 23595051 23657909 23648949 23640491 23702442 23950113 24254995 24866035 25808823 26811592 27848483
8249 27848483 29420486 31104830 33018041 35167396 37592891 40518121 43892901 47904452
$$ packed form
8314E3461873k570617k392505k109931j393219o94719j3941Q47591J546374K317141
8305D8998047K956224L402975K546664J122356q64637k658673l721320m353380
8297D7428256m246420l484039l127271k677954j752661j362034r52390p20055
8289B9105432l56378l62737o23473m25245n8449j94553k08924l37152q72356o48308
8279B5017857j90487l80639k68213N5791K40818M81068O46138Q02733O25925M66191
8269B7497182K9135k55698m15068p37790o01673m93486m45337j30750n43634l07830
8259B3595051O2858q960q458O1951K47671L04882O11040R42788J002769J036891
8249B7848483J572003J684344J913211K149355K425495K925230L374780M011551
$$ plain form
8241 47904452 52300172 56418265 59513119 60478154 59267907 56619198 53376884 50537923
8233 50537923 48295032 47179995 46921616 47705938 49248724 51404354 54205034 57174091
8225 57174091 59871816 61842278 62639394 61873451 59853066 57048061 54084209 51622615
8217 51622615 49408170 47838964 47465470 47967927 49503239 52235908 55971829 60808335
8209 60808335 66722027 73662956 80882149 88054136 95402542 102821880 110687331 120408535
8201 120408535 133251242 151255918 176586124 210661173 253162307 301891332 351554927
8194 351554927 393709793 419710967 424258255 406036833 369278287 321882605 272219085
8187 272219085 226313325 187882191 157842938 135318912 118982844 107407941 99532946
$$ packed form
8241D7904452M395720M118093L094854R65035j210247k648709l242314k838961
8233E0537923k242891j115037k58379P84322J542786K155630K800680K969057
8225E7174091K697725J970462P97116p65943k020385k805005k963852k461594
8217E1622615k214445j569206l73494N02457J535312K732669L735921M836506
8209F0808335N913692O940929P219193P171987P348406P419338P865451R721204
8201A20408535J2842707J8004676K5330206L4075049M2501134M8729025M9663595
8194C51554927M2154866K6001174M547288j8221422l6758546m7395682m9663520
8187B72219085m5905760l8431134l0039253k2524026j6336068j1574903p874995
$$ plain form
8180 99532946 94142527 90715292 88939394 88415966 89201102 91393081 94714918 100200197
8172 100200197 108814688 121554738 139995293 166093575 202031348 249219627 305898602
8165 305898602 364234133 412390545 442040284 452539289 444605124 417351076 371713973
8158 371713973 315009308 257943537 208623820 170019693 141553954 120778063 105772836
8151 105772836 94635034 85878861 78500256 72048994 66199508 60687326 55516684 51124053
8143 51124053 47376156 44156653 41214594 38979337 36974900 35267344 33942782 32786613
8135 32786613 31732586 30871267 30416234 30032350 29376678 28602465 28218349 28082948 28257273
8126 28257273 28100019 27897918 28115677 28239274 28190548 28384772 28802801 28954374 28811672 28540720
$$ packed form
8180I9532946n390419l427235j775898n23428P85136K191979L321837N485279
8172A00200197Q614491J2740050J8440555K6098282L5937773M7188279N6678975
8165C05898602N8335531M8156412K9649739J0499005p934165k7254048m5637103
8158C71713973n6704665n7065771m9319717l8604127k8465739k0775891j5005227
8151A05772836j1137802q756173p378605o451262n849486n512182n170642m392631
8143E1124053l747897l219503k942059k235257k004437j707556j324562j156169
8135C2786613j054027q61319m55033l83884o55672p74213l84116j35401J74325
8126B8257273j57254k02101K17759J23597m8726J94224M18029J51573j42702k70952
$$ plain form
8116 28540720 28257817 27859816 27497703 27317514 27175359 27014987 26918033 26866670 26735866 26853534
8106 26853534 27040747 26815754 26625530 26452582 26250793 26104612 26310079 26379029 26154215 26034769
8096 26034769 25860032 25892137 26473681 26868408 27284821 28186921 29142866 30011373 30765837 31757373
8086 31757373 32663299 34004642 35150774 36677381 38686779 41511939 45205400 50037336
8078 50037336 56402611 64462939 74739073 86828961 99951763 112078540 121893961 127075264
8070 127075264 126590444 122014769 114529024 105686381 97249712 89563952 82950128 77676767
8062 77676767 73136216 69095212 65745241 62686295 60024832 57671544 55836294 54573110
8054 54573110 53369678 52185845 51652555 51716933 51876764 52316908 53304304 55105864 57437262
$$ packed form
8116B8540720k82903l98001l62113j80189j42155j60372r6954n1363j30804J17668
8106B6853534J87213k24993j90224j72948k01789j46181K05467O8950k24814j19446
8096B6034769j74737L2105N81544L94727M16413R02100R55945Q68507P54464R91536
8086C1757373R05926J341343J146132J526607K009398K825160L693461M831936
8078E0037336O365275Q060328J0276134J2089888J3122802J2126777R815421N181303
8070A27075264m84820m575675p485745q842643q436669p685760o613824n273361
8062G7676767m540551m041004l349971l058946k661463k353288j835250j263184
8054E4573110j203432j183833n33290O4378J59831M40144R87396J801560K331398
$$ plain form
8045 57437262 60469013 64517192 69577679 75555090 82954393 92283001 103437496 116556552
8037 116556552 130898732 145238407 158505769 168867821 174161451 174294963 169262245 159764649
8029 159764649 147596992 134202134 121287712 110213079 100990497 93746456 88385349
8022 88385349 84125508 80589339 78092767 75812501 74307966 74222737 75188333 77637034 81390225
8013 81390225 87261042 95479487 106955259 121792809 140201464 162125716 187284515
8006 187284515 214999563 242326978 265123091 281466838 294331506 309367460 331565034
7999 331565034 362956840 401604411 442218912 476199769 495204104 495013347 478348805
7992 478348805 452197226 422371861 391760249 358990324 322803493 283305943 243105907
$$ packed form
8045E7437262L031751M048179N060487N977411P399303R328608J1154495J3119056
8037A16556552J4342180J4339675J3267362J0362052N293630J33512n032718r497596
8029A59764649j2167657j3394858j2914422j1074633r222582p244041n361107
8022H8385349m259841l536169k496572k280266j504535q5229R65596K448701L753191
8013H1390225N870817Q218445J1475772J4837550J8408655K1924252K5158799
8006A87284515K7715048K7327415K2796113J6343747J2864668J5035954K2197574
7999C31565034L1391806L8647571M0614501L3980857J9004335j90757j6664542
7992D78348805k6151579k9825365l0611612l2769925l6186831l9497550m0200036
$$ plain form
7985 243105907 206475543 175565375 150549614 130888985 115647815 103143662 93249322
7978 93249322 85064532 78354935 72755268 68229053 64878803 62770638 61847879 62135227
7970 62135227 63794795 67292834 72890749 81050930 91825442 105496278 121004878 135826028
7962 135826028 145409583 146859301 141777732 134350882 128971373 128333070 132084141 137205052
7954 137205052 138127259 131378083 117302445 99973883 83212620 69452360 58956167
7947 58956167 51436049 45916137 41525799 38068898 35426590 33333943 31754021 30128662
7939 30128662 28642984 27277525 26159373 25312775 24652663 23738544 23190455 23167750 23291065
7930 23291065 23355299 23555775 23713366 23838207 24066601 24359475 24479612 25125288 25747168 26462174
$$ packed form
7985B43105907l6630364l0910168k5015761j9660629j5241170j2504153r894340
7978I3249322q184790o709597n599667m526215l350250k108165r22759K87348
7970F2135227J659568L498039N597915Q160181J0774512J3670836J5508600J4821150
7962A35826028R583555J449718n081569p426850n379509o38303L751071N120911
7954A37205052R22207o749176j4075638j7328562j6761263j3760260j0496193
7947E8956167p520118n519912m390338l456901k642308k092647j579922j625359
7939C0128662j485678j365459j118152q46598o60112r14119n48089k2705J23315
7930B3291065O4234K00476J57591J24841K28394K92874J20137O45676O21880P15006
$$ plain form
7920 26462174 27212951 27818741 28167603 28048456 27847549 27590131 27682826 27690542 27964130 29013236
7910 29013236 30353412 32586684 35041898 37632971 41215800 45727516 50957674 57759225
7902 57759225 66802929 78804124 94918011 117051504 147259866 187147443 237192842
7895 237192842 295904919 356175039 407459307 437905913 439495241 411494615 362174285
7888 362174285 303440739 245589504 195860444 156313996 126878940 105332882 89711153
7881 89711153 78019385 69261589 62213594 56325477 51399336 46648195 42366015 38815596
7873 38815596 35437334 32200944 29464224 27157513 24870673 22909351 21436686 20397404
7865 20397404 19234195 18369750 17590206 16742289 15661933 14816703 14371830 13943875 13750607
$$ packed form
7920B6462174P50777O05790L48862j19147k00907k57418R2695P716K73588J049106
7910B9013236J340176K233272K455214K591073L582829M511716N230158O801551
7902E7759225R043704J2001195J6113887K2133493L0208362L9887577N0045399
7895B37192842N8712077O0270120N1284268L0446606J589328k8000626m9320330
7888C62174285n8733546n7851235m9729060l9546448k9435056k1546058j5621729
7881H9711153j1691768q757796p047995n888117m926141m751141m282180l550419
7873C8815596l378262l236390k736720k306711k286840j961322j472665j039282
7865B0397404j163209q64445p79544q47917j080356q45230m44873m27955j93268
$$ plain form
7856 13750607 13453677 13194747 12997160 12704918 12236144 11882524 11354883 10925029 10769682
7847 10769682 10470345 9969154 9793532 9648086 9330016 9024815 8993579 8842627 8721555 8647815
7837 8647815 8385488 8144368 8198156 8141478 7875062 7546249 7473097 7496386 7417651 7392667 7287158
7826 7287158 7148248 6927423 6732070 6573520 6397461 6381729 6253388 6358322 6362672 6291275
7816 6291275 6188752 6383164 6459546 6521889 6468338 6384960 6197111 6028537 6019529 5928045 6044341
7805 6044341 5994763 5756450 5803521 6050548 6153714 6357624 6486096 6536598 6755242 6941680
7795 6941680 7021082 7027525 7043543 6756633 6401894 6242516 6131795 5839364 5543379 5472406
7785 5472406 5167101 5072142 5435628 5533795 5403005 5318125 5251614 5266448 5247541 5399713 5647423
$$ packed form
7856A3750607k96930k58930j97587k92242m68774l53620n27641m29854j55347
7847A0769682k99337n01191j75622j45446l18070l05201l1236j50952j21072p3740
7837H647815k62327k41120N3788n6678k66416l28813p3152K3289p8735k4984j05509
7826G287158j38910k20825j95353j58550j76059j5732j28341J04934M350p1397
7816F291275j02523J94412P6382O2343n3551q3378j87849j68574r008r1484J16296
7805F044341m9578k38313M7071K47027J03166K03910J28472N0502K18644J86438
7795F941680P9402O443J6018k86910l54739j59378j10721k92431k95985p0973
7785E472406l05305r4959L63486R8167j30790q4880o6511J4834j8907J52172K47710
$$ plain form
7774 5647423 5845202 5978214 6370139 6617536 7169889 7292895 7525212 7847993 7831932 7736099
7764 7736099 7519677 7478002 7199310 6893543 6742228 6294401 5755599 5520879 5289302 5224339
7754 5224339 5222835 5074788 4999197 5039073 5350623 5485474 5523649 5383583 5218695 5324102
7744 5324102 5693649 5846078 5996812 6245509 6332975 6323305 6425920 6715668 7206676 7439564
7734 7439564 7956870 8166818 8376929 8418134 8874255 9231694 9608172 9948468 10371069 10545379
7724 10545379 11002028 11508843 12078955 12937046 14202777 15528261 16601035 17916989 19952963
7715 19952963 22528044 25603776 29417515 33623316 38647604 44511284 51654136 60620884
7707 60620884 72116495 87625266 108587123 136565704 173263032 218792560 269866140
$$ packed form
7774E647423J97779J33012L91925K47397N52353J23006K32317L22781j6061r5833
7764G736099k16422m1675k78692l05767j51315m47827n38802k34720k31577o4963
7754E224339j504j48047p5591L9876L11550J34851L8175j40066j64888J05407
7744E324102L69547J52429J50734K48697Q7466r670J02615K89748M91008K32888
7734G439564N17306K09948K10111M1205M56121L57439L76478L40296M22601J74310
7724A0545379M56649N06815N70112Q58091J265731J325484J072774J315954K035974
7715A9952963K575081L075732L813739M205801N024288N863680P142852Q966748
7707F0620884J1495611J5508771K0961857K7978581L6697328M5529528N1073580
$$ plain form
7700 269866140 319470754 359989834 384222585 388107115 371468191 337822021 293253926
7693 293253926 245011652 199346386 160213311 129415327 106084436 88436935 75186712
7686 75186712 65334789 57443073 50911313 45120830 39955956 35716133 32347188 29650638
7678 29650638 27557169 25626088 23934455 22319298 20717722 19179154 17616939 16333620
7670 16333620 15470009 14434270 13321388 12511977 11743393 11110784 10574454 10115316 9689458
7661 9689458 9418203 9168936 8942495 8361370 7808598 7855057 7848529 7769987 7799268 8092449
7651 8092449 8149222 8072542 8300423 8610242 8616962 8644085 9200114 9933852 10399717 10521418
7641 10521418 10874050 10928875 10688585 10243745 9602486 8649228 8019046 7592176 7080363 6732889
$$ packed form
7700B69866140M9604614M0519080K4232751L884530j6638924l3646170m4568095
7693B93253926m8242274m5665266l9133075l0797984k3330891j7647501j3250223
7686G5186712r851923p891716o531760n790483n164874m239823l368945k696550
7678B9650638k093469j931081j691633j615157j601576j538568j562215j283319
7670A6333620q63611j035739j112882q09411p68584o32609n36330m59138m25858
7661I689458k71255k49267k26441n81125n52772M6459o528p8542K9281K93181
7651H092449N6773p6680K27881L09819O720K7123N56029P33738M65865J21701
7641A0521418L52632N4825k40290m44840o41259r53258o30182m26870n11813l47474
$$ plain form
7631 6732889 6515666 6374879 6284850 5928511 5632461 5578313 5355349 5366086 5411186 5193243
7621 5193243 4924963 4895676 4853188 4952892 4769663 4732163 4579797 4472266 4603008 4730802
7611 4730802 4829823 5155384 5252014 5118755 4803025 4771320 4818147 4502518 4443719 4776881
7601 4776881 5109323 5092717 5214600 5440801 5655883 5737410 5920715 6189755 6367264 6238258
7591 6238258 5869453 5764281 5791717 5754564 6118604 6205916 6435773 6614953 6437532 6327482
7581 6327482 6464437 6492867 6424625 6283389 6289515 6167008 6001917 6160039 6368340 6666202
7571 6666202 6845214 6804495 7162030 7560458 7516008 7380989 7110984 6727263 6336637 6144399
7561 6144399 5798631 5616204 5243207 4500635 4251762 3932469 3479836 3310188 3267378 3492163
$$ packed form
7631F732889k17223j40787r0029l56339k96050n4148k22964J0737M5100k17943
7621E193243k68280k9287m2488R9704j83229l7500j52366j07531J30742J27794
7611D730802R9021L25561R6630j33259l15730l1705M6827l15629n8799L33162
7601D776881L32442j6606J21883K26201K15082Q1527J83305K69040J77509j29006
7591F238258l68805j05172K7436l7153L64040Q7312K29857J79180j77421j10050
7581F327482J36955K8430o8242j41236O126j22507j65091J58122K08301K97862
7571F666202J79012m0719L57535L98428m4450j35019k70005l83721l90626j92238
7561F144399l45768j82427l72997p42572k48873l19293m52633j69648m2810K24785
$$ plain form
7551 3492163 3364465 3090754 3022837 3414135 3645171 3804475 3954737 3911592 4028966 4014568
7541 4014568 3969966 3934688 3666406 3172610 3043485 2893530 2657259 2510717 2466975 2852550
7531 2852550 3036987 2834285 2492499 2573165 2518089 2610070 2700611 2748378 2729020 2530060 2489950
7520 2489950 2543888 3044483 3304430 3430881 3398396 3635682 4032075 4068358 4323364 4857285
7510 4857285 5683987 6680678 7767687 9320829 11418639 13822053 16635676 19147364 21163735
7501 21163735 22838056 23729593 23840500 22959652 21076508 18672763 16214498 13951737 12069540
7492 12069540 10373402 9025891 7929697 6871484 5750050 4924214 4520132 4270190 4116173
7483 4116173 4019647 3883320 3348391 3180831 2946734 2825568 2582517 2126450 1844818 1473861
$$ packed form
7551C492163j27698k73711o7917L91298K31036J59304J50262m3145J17374j4398
7541D014568m4602l5278k68282m93796j29125j49955k36271j46542m3742L85575
7531B852550J84437k02702l41786Q0666n5076R1981R0541M7767j9358j98960m0110
7520B489950N3938N00595K59947J26451l2485K37286L96393L6283K55006N33921
7510D857285Q26702R96691J087009J553142K097810K403414K813623K511688K016371
7501B1163735J674321Q91537J10907q80848j883144k403745k458265k262761j882197
7492A2069540j696138j347511j096194j058213j121434q25836m04082k49942j54017
7483D116173r6526j36327n34929j67560k34097j21166k43051m56067k81632l70957
$$ plain form
7473 1473861 1331902 1302194 1309290 1364211 1568113 1576161 1561798 1282330 1393124 1775063 1834837
7462 1834837 1731231 1567268 1744148 1676416 1479748 1353159 1307694 1253160 1091622 1083291
7452 1083291 1082130 986811 1187975 1418805 1637388 1605477 1581845 1669409 1544599 1186445 921877
7441 921877 933965 1130215 1302742 1364696 1569028 1493483 1319081 1383015 1285666 1298102 1239714
7430 1239714 902482 892276 802545 820624 1173515 1290759 1184609 1286497 1323523 972537
7420 972537 928489 994383 1045796 1100058 964297 991662 1006523 939090 858367 925631 934410 1103257
7408 1103257 1259997 1441293 1345016 1145774 1159305 1273618 1327223 1223363 1200974 1167931
7398 1167931 1049919 1119739 1367214 1326680 1052350 892541 703999 720793 666544 727827
$$ packed form
7473A473861j41959k9708P096N4921K03902Q048j4363k79468J10794L81939N9774
7462A834837j03606j63963J76880o7732j96668j26589m5465n4534j61538q331
7452A083291j161r5319K01164K30830K18583l1911k3632Q7564j24810l58154k64568
7441I21877J2088J96250J72527O1954K04332p5545j74402O3934r7349J2436n8388
7430A239714l37232j0206q9731J8079L52891J17244j06150J01888L7026l50986
7420I72537m4048O5894N1413N4262j35761K7365J4861o7433q0723O7264Q779J68847
7408A103257J56740J81296r6277j99242J3531J14313N3605j03860k2389l3043
7398A167931j18012O9820K47475m0534k74330j59809j88542J6794n4249O1283
$$ plain form
7388 727827 774957 860243 896509 579391 494631 699960 963328 1017258 944498 929071 843861
7377 843861 793130 698778 575233 673194 857411 725078 841756 902459 950514 887349 713399
7366 713399 796731 1005099 941901 968515 986133 612067 479890 559182 570829 790849 978521
7355 978521 1032796 959532 1025689 1078543 1075012 817819 583205 727821 915665 886756 848372
7344 848372 774948 907455 968833 715115 725196 739850 664147 875094 819096 955458 969901
7333 969901 945217 907580 957736 1274711 1252229 1009375 888551 1030929 1074669 1075000 876348
7322 876348 852764 659518 720415 659622 943342 1092198 904185 847884 1007984 1133509
7312 1133509 1105741 1027518 1194796 1332117 1424441 1546116 1783386 1860833 2206177 2360718
$$ packed form
7388G27827M7130Q5286L6266l17118q4760K05329K63368N3930p2760j5427q5210
7377H43861n0731r4352j23545R7961J84217j32333J16678O0703M8055o3165j73950
7366G13399Q3332K08368o3198K6614J7618l74066j32177P9292J1647K20020J87672
7355I78521N4275p3264O6157N2854l531k57193k34614J44616J87844k8909l8384
7344H48372p3424J32507O1378k53718J0081J4654p5703K10947n5998J36362J4443
7333I69901k4684l7637N0156L16975k2482k42854j20824J42378M3740L31j98652
7322H76348k3584j93246O0897o0793K83720J48856j88013n6301J60100J25525
7312A133509k7768p8223J67278J37321R2324J21675K37270P7447L45344J54541
$$ plain form
7302 2360718 2478026 2538597 2671152 2429262 2218103 1799821 1422294 1519757 1341115 972545
7292 972545 701855 859473 874681 867293 774340 840508 891727 825613 691183 671058 660644
7281 660644 576703 653178 740466 722963 658825 559398 361280 231478 611058 845233 818538
7270 818538 929066 857326 723973 367380 357978 414629 417485 464778 395542 425371 450607
7259 450607 441609 465494 445459 403194 562365 666340 578642 467181 462694 604685 412214
7248 412214 424640 727872 801654 826019 1003417 1202364 1008042 807467 781912 629093
7238 629093 432237 364426 395185 432968 700045 840873 843130 888481 918987 778568 568632
7227 568632 656811 751676 843466 555238 239409 208307 387948 673645 798065 912290
$$ packed form
7302B360718J17308O0571J32555k41890k11159m18282l77527R7463j78642l68570
7292I72545k70690J57618J5208p388r2953O6168N1219o6114j34430k0125j0414
7281F60644q3941P6475Q7288j7503o4138r9427j98118j29802L79580K34175k6695
7270H18538J10528p1740j33353l56593r402N6651K856M7293o9236K9829K5236
7259D50607q998K3885k0035m2265J59171J03975q7698j11461m487J41991j92471
7248D12214J2426L03232P3782K4365J77398J98947j94322k00575k5555j52819
7238F29093j96856o7811L0759L7783K67077J40828K257M5351L0506j40419k09936
7227E68632Q8179R4865R1790k88228l15829l1102J79641K85697J24420J14225
$$ plain form
7217 912290 751517 486069 448011 650297 616784 433775 548765 630260 860911 891096
7207 891096 667407 619146 534059 701344 846478 837498 925766 708991 755843 602504 622300
7196 622300 547168 485349 619771 572073 493406 642492 577252 523305 497121 361284 527021
7185 527021 537129 553832 532094 646737 430808 366896 568696 534914 445522 659391 1022824
7174 1022824 1078425 1313009 1137944 928956 777081 819535 867876 639114 631465 548556 600362
7163 600362 546427 607138 463973 353013 385903 435336 345496 380602 290734 286613 555801
7152 555801 604169 609818 469636 715537 537791 425520 421695 789289 650316 646557 594591
7141 594591 382139 410616 419415 687810 751533 619304 402751 414631 411006 172209 133095
$$ packed form
7217I12290j60773k65448l8058K02286l3513j83009J14990Q1495K30651L0185
7207H91096k23689m8261q5087J67285J45134q980Q8268k16775M6852j53339J9796
7196F22300p5132o1819J34422m7698p8667J49086o5240n3947k6184j35837J65737
7185E27021J0108J6703k1738J14643k15929o3912K01800l3782q9392K13869L63433
7174A022824N5601K34584j75065k08988j51875M2454M8341k28762p649q2909N1806
7163F00362n3935O0711j43165j10960L2890M9433q9840L5106q9868m121K69188
7152E55801M8368N649j40182K45901j77746j12271l825L67594j38973l759n1966
7141E94591k12452K8477Q799K68395O3723j32229k16553J1880l625k38797l9114
$$ plain form
7130 133095 259665 421106 503704 452710 312072 362511 259472 202862 272669 60758 1016
7119 1016 160828 321225 316356 457326 237832 316605 540392 602418 561559 515136 460308
7108 460308 464608 428825 482977 357431 51145 9049 82209 196120 242785 138449 175303
7097 175303 181049 218422 289946 434618 505890 459840 491410 287636 283766 142885 147441 182654
7085 182654 220299 218344 91209 176083 278220 330788 530107 472705 498836 615548 604604
7074 604604 386308 269099 510942 532919 570703 419011 331745 304385 257457 262319 222511
7063 222511 279749 359136 551669 718086 616071 516278 395447 299128 329734 434666 455457
7052 455457 560928 631406 480096 532267 617321 640294 534212 539088 509424 575479 453242
$$ packed form
7130A33095J26570J61441Q2598n0994j40638N0439j03039n6610O9807k11911n9742
7119A016J59812J60397m869J40970k19494P8773K23787O2026m0859m6423n4828
7108D60308M300l5783N4152j25546l06286m2096P3160J13911M6665j04336L6854
7097A75303N746L7373P1524J44672P1272m6050L1570k03774l870j40881M556L5213
7085A82654L7645j955j27135Q4874J02137N2568J99319n7402K6131J16712j0944
7074F04604k18296j17209K41843K1977L7784j51692q7266k7360m6928M862l9808
7063B22511N7238P9387J92533J66417j02015r9793j20831r6319L0606J04932K0791
7052D55457J05471P0478j51310N2171Q5054K2973j06082M876k9664O6055j22237
$$ plain form
7041 453242 326676 327805 291139 379626 357622 441269 428830 537083 472072 415053 389992
7030 389992 540159 522752 411500 130807 105597 85589 293338 406345 433922 550972
7020 550972 642708 720169 604040 432655 351047 278441 63160 60829 86702 249452 448305
7009 448305 491118 467213 621073 646728 588996 562516 671512 541921 412422 304337 288549
6998 288549 607215 895086 789065 640299 374722 448320 690857 584249 145704 363386
6988 363386 666120 516783 448736 530481 536399 539330 876309 893878 956585 834665 976224
6977 976224 874318 857914 755196 600129 712208 621181 540811 605115 348195 361526 401673
6966 401673 387440 565030 409526 237253 -55678 -113182 35083 132306 468963 662737
$$ packed form
7041D53242j26566J129l6666Q8487k2004Q3647j2439J08253o5011n7019k5061
7030C89992J50167j7407j11252k80693k5210k0008K07749J13007K7577J17050
7020E50972R1736P7461j16129j71385q1608p2606k15281k331K5873J62750J98853
7009D48305M2813k3905J53860K5655n7732k6480J08996j29591j29499j08085j5788
6998B88549L18666K87871j06021j48766k65577P3598K42537j06608m38545K17682
6988C63386L02734j49337o8047Q1745N918K931L36979J7569O2707j21920J41559
6977I76224j01906j6404j02718j55067J12079r1027q0370O4304k56920J3331M0147
6966D01673j4233J77590j55504j72273k92931n7504J48265R7223L36657J93774
$$ plain form
6956 662737 518398 471929 565258 406897 -37595 16593 234094 229866 189635 275708 318935
6945 318935 391436 366671 385711 170584 137449 54334 -243673 -214980 320569 518116 449589
6934 449589 534284 631280 508648 509400 274051 375609 467759 462261 572854 403699 257427
6923 257427 527891 519735 569432 602275 725618 719735 704159 578817 267637 153555 51098
6912 51098 232976 452635 321990 350323 273490 171528 172160 413888 285275 191662 353374
6901 353374 403501 295052 153498 10687 235305 357893 693262 652999 622768 430201
6891 430201 240967 44306 4205 147867 231519 307706 592497 647955 600632 571508 563846
6880 563846 477983 561583 461416 418795 255902 -20283 146724 474597 679539 622803
$$ packed form
6956F62737j44339m6469R3329j58361m44492N4188K17501m228m0231Q6073M3227
6945C18935P2501k4765J9040k15127l3135q3115k98007K8693N35549J97547o8527
6934D49589Q4695R6996j22632P52k35349J01558R2150n498J10593j69155j46272
6923B57427K70464q156M9697L2843J23343n883j5576j25342l11180j14082j02457
6912E1098J81878K19659j30645K8333p6833j01962O32K41728j28613r3613J61712
6901C53374N0127j08449j41554j42811K24618J22588L35369m0263l0231j92567
6891D30201j89234j96661m0101J43662Q3652P6187K84791N5458m7323k9124p662
6880E63846q5863Q3600j00167m2621j62893k76185J67007L27873K04942n6736
$$ plain form
6870 622803 318819 168747 321171 653109 722017 579139 542611 418323 444876 505621
6860 505621 412648 248971 57913 1132 -200332 -401641 -358815 -170503 -36252 190997
6850 190997 226316 249903 302313 428738 438980 260317 134117 305331 402959 316671 345571
6839 345571 325386 84595 270424 266393 135549 244692 264285 21009 -84378 16968
6829 16968 43567 -94325 -75553 153715 -74212 -116109 29353 192498 378302 374526 498898
6818 498898 386867 321361 -16680 -52929 1947 -286313 -280521 36539 185085 255331 383845
6807 383845 473364 453418 342130 365939 441853 552870 363852 268491 177716 123444 187100
6796 187100 378850 379332 312315 249942 318749 374017 236593 16767 -207930 -189382 -21306
$$ packed form
6870F22803l03984j50072J52424L31938O8908j42878l6528j24288K6553O0745
6860E05621r2973j63677j91058n6781k01464k01309M2826J88312J34251K27249
6850A90997L5319K3587N2410J26425J0242j78663j26200J71214R7628q6288K8900
6839C45571k0185k40791J85829m031j30844J09143J9593k43276j05387J01346
6829A6968K6599j37892J8772K29268k27927m1897J45462J63145J85804l776J24372
6818D98898j12031o5506l38041l6249N4876k88260N792L17060J48546P0246J28514
6807C83845Q9519j9946j11288K3809P5914J11017j89018r5361r0775n4272O3656
6796A87100J91750M82o7017o2373O8807N5268j37424k19826k24697J8548J68076
$$ plain form
6785 -21306 56037 -1956 -220077 -7934 240084 457972 431751 198561 173741 192363 149593
6774 149593 10046 -53741 189158 231999 302556 479142 525575 294292 159592 228112 423607
6763 423607 527557 238054 323275 418988 424475 256078 140291 149324 446240 532429 395124
6752 395124 483731 420358 437397 497230 657194 605464 583650 593446 649274 624148 566139 665620
6740 665620 607479 293079 157238 91447 198239 156773 64356 -196738 -274705 -176388 -53476
6729 -53476 -30432 170871 296715 100019 -219388 -198347 -33515 -128443 -63230 6518 -63960
6718 -63960 -156282 -142155 74053 166511 -74641 69202 246405 38878 -142592 101462
6708 101462 83214 45058 -43198 -53095 55587 216862 -6655 -68492 -11370 -55250 -220645
$$ packed form
6785b1306P7343n7993k18121K12143K48018K17888k6221k33190k4820J8622m2770
6774A49593j39547o3787K42899M2841P0557J76586M6433k31283j34700O8520J95495
6763D23607J03950k89503Q5221R5713N487j68397j15787R033K96916Q6189j37305
6752C95124Q8607o3373J7039N9833J59964n1730k1814R796N5828k5126n8009R9481
6740F65620n8141l14400j35841o5791J06792m1466r2417k61094p7967R8317J22912
6729e3476K3044K01303J25844j96696l19407K1041J64832r4928O5213O9748p0478
6718f3960r2322J4127K16208R2458k41152J43843J77203k07527j81470K44054
6708A01462j8248l8156q8256r897J08682J61275k23517o1837N7122m3880j65395
$$ plain form
6697 -220645 -350101 -291107 -298883 -137137 -11778 323260 274683 -66857 -231257 -268748 -511216
6686 -511216 -654001 -456629 -130457 -116437 -113921 78817 120021 212060 235304 82374 -251600
6675 -251600 -352822 -446135 -413479 -522439 -455025 -148179 -80885 -193939 23026 64520 136526
6664 136526 480292 853433 676956 313388 250442 292491 317279 75732 -62792 142233
6654 142233 459039 543724 689716 808607 553048 348399 245409 352450 314933 551120
6644 551120 510004 381953 433126 533026 564592 757926 943772 1094374 1101930 1370356 1404456
6633 1404456 1665874 2318569 3035362 4264544 5681923 6293320 5655367 4207113 3309822
6624 3309822 3091037 2987999 3068213 3584746 4204609 5094187 6363311 8609887 11776507
$$ packed form
6697b20645j29456N8994p776J61746J25359L35038m8577l41540j64400l7491k42468
6686e11216j42785J97372L26172J4020K516J92738M1204R2039K3244j52930l33974
6675b51600j01222r3313L2656j08960O7414L06846O7294j13054K16965M1494P2006
6664A36526L43766L73141j76477l63568o2946M2049K4788k41547j38524K05025
6654A42233L16806Q4685J45992J18891k55559k04649j02990J07041l7517K36187
6644E51120m1116j28051N1173R9900L1566J93334J85846J50602P556K68426L4100
6633A404456K61418O52695P16793J229182J417379O11397o37953j448254q97291
6624C309822k18785j03038Q0214N16533O19863Q89578J269124K246576L166620
$$ plain form
6615 11776507 16305882 21857743 29536148 41706595 61586236 95818637 151579600 207631068
6607 207631068 208849786 165085689 112900190 71876916 47643194 34506078 27127564
6600 27127564 22228132 18435495 15206706 12365543 10209432 8879278 7965103 7170133
6592 7170133 6787888 6539072 6527719 6967564 7889359 8605531 8104140 6850016 5553403
6583 5553403 4590315 3870105 3225823 2893116 2729339 2410927 2203907 2002434 1810123 1646278
6573 1646278 1698966 1843148 1848590 1656050 1128736 898577 1139093 1051750 911453 961622
6563 961622 973307 1013460 960405 1114792 978277 810816 816242 796623 898810 964749 859472
6552 859472 626684 515370 582967 769298 793770 768259 505055 476988 603522 690810 777730
$$ packed form
6615A1776507M529375N551861P678405J2170447J9879641L4232401N5760963N6051468
6607B07631068J218718m3764097n2185499m1023274k4233722j3137116p378514
6600B7127564m899432l792637l228789k841163k156111j330154r14175p94970
6592G170133l82245k48816j1353M39845R21795P16172n01391j254124j296613
6583E553403r63088p20210o44282l32707j63777l18412k07020k01473j92311j63845
6573A646278N2688J44182N442j92540n27314k30159K40516q7343j40297N0169
6563I61622J1685M0153n3055J54387j36515j67461N426j9619J02187O5939j05277
6552H59472k32788j11314O7597J86331K4472k5511k63204k8067J26534Q7288Q6920
$$ plain form
6541 777730 822240 516060 630401 760099 613274 649796 486265 353330 220692 404949
6531 404949 397046 89265 5763 237178 666582 788011 717834 577165 592697 772914 895399
6520 895399 847870 895392 706422 690440 621163 545190 495164 391510 351045 201532 141895
6509 141895 282093 187179 180935 254813 -50308 -57019 290360 523146 603228 343978 239851
6498 239851 430019 439929 311728 387233 299265 434301 549363 362088 498069 518854 576885
6487 576885 617883 873768 822581 536031 313677 553336 907154 884539 657985 549032
6477 549032 391856 358701 397090 173029 117006 356842 349986 24125 206031 493595 420147
6466 420147 274950 207633 237779 273992 163733 -16107 -1018 254787 386147 317870 143751
$$ packed form
6541G77730M4510l06180J14341J29698j46825L6522j63531j32935j32638J84257
6531D04949p903l07781q3502K31415M29404J21429p0177j40669J5532J80217J22485
6520H95399m7529M7522j88970j5982o9277p5973n0026j03654m0465j49513n9637
6509A41895J40198r4914o244P3878l05121o711L47379K32786Q0082k59250j04127
6498B39851J90168R910j28201P5505q7968J35036J15062j87275J35981K0785N8031
6487E76885M0998K55885n1187k86550k22354K39659L53818k2615k26554j08953
6477E49032j57176l3155L8389k24061n6023K39836o856l25861J81906K87564p3448
6466D20147j45197o7317L0146L6213j10259j79840J5089K55805J31360o8277j74119
$$ plain form
6455 143751 241593 123678 279426 429474 274943 -4699 103687 171139 -17695 -172043
6445 -172043 32050 155143 105726 161902 95182 -5558 -144674 126352 346461 300108
6435 300108 37362 16673 206716 171392 258353 169848 173543 58659 132554 483066 485880
6424 485880 329452 413159 272214 143784 160482 110805 170904 64027 242535 347046
6414 347046 157949 120614 335777 538569 505178 478471 408890 273949 150260 326866
6404 326866 289949 -103148 -175231 -14018 265972 316523 208741 151952 160343 362034 412108
6393 412108 368053 478451 497047 388577 163515 -58328 -18312 129730 225752 230974 335867
6382 335867 405930 280186 316286 302092 109112 324003 306672 37793 9721 28137 203923
$$ packed form
6455A43751R7842j17915J55748J50048j54531k79642J08386O7452j88834j54348
6445a72043K04093J23093m9417N6176o6720j00740j39116K71026K20109m6353
6435C00108k62746k0689J90043l5324Q6961q8505L695j14884P3895L50512K814
6424D85880j56428Q3707j40945j28430J6698m9677O0099j06877J78508J04511
6414C47046j89097l7335K15163K02792l3391k6707o9581j34941j23689J76606
6404C26866l6917l93097p2083J61213K79990N0551j07782n6789Q391K01691N0074
6393D12108m4055J10398J8596j08470k25062k21843M0016J48042R6022N222J04893
6382C35867P0063j25744L6100j4194j92980K14891j7331k68879k8072J8416J75786
$$ plain form
6371 203923 362165 671552 539114 337010 290420 247667 110639 205178 269896 320352 337053
6360 337053 217266 104879 45757 290633 270880 86284 -25817 1069 55163 147406 265378
6349 265378 188193 117195 42016 80432 -189604 -207100 -251720 -197874 133837 333059 371079
6338 371079 366710 297946 247414 402218 399596 345222 276884 185512 152406 134158 1872 -63078
6326 -63078 -59518 -12767 59590 84671 -39854 -113594 -94628 -211065 -33002 17125 -68376
6315 -68376 179430 243388 192997 625559 659621 34570 -66435 208940 364372 74607
6305 74607 -141338 -69361 67407 81828 132747 87112 37907 -176354 -324728 -133578 160372
6294 160372 330946 373994 513685 211584 128091 -74267 -109690 309969 485465 474988
$$ packed form
6371B03923J58242L09387j32438k02104m6590m2753j37028R4539O4718N0456J6701
6360C37053j19787j12387n9122K44876j9753j84596j12101K6886N4094R2243J17972
6349B65378p7185p0998p5179L8416k70036j7496m4620N3846L31711J99222L8020
6338C71079m369o8764n0532J54804k622n4374o8338r1372l3106j8248j32286o4950
6326f3078L560M6751P2357K5081j24525p3740J8966j16437J78063N0127q5501
6315f8376K47806O3958n0391M32562L4062o25051j01005K75375J55432k89765
6305G4607k15945P1977J36768J4421N0919m5635m9205k14261j48374J91150K93950
6294A60372J70574M3048J39691l02101q3493k02358l5423M19659J75496j0477
$$ plain form
6284 474988 197941 -126035 -38570 208724 491594 417010 405250 221272 270477 315631 179113
6273 179113 238260 465744 300054 -43654 -164276 -236971 -85751 146768 300810 242290
6263 242290 247069 301081 249358 95496 323393 155146 -112807 -98226 46414 346511 344816
6252 344816 54640 150530 -21691 -140524 -61927 24446 37390 122930 198726 -8659 81345
6241 81345 98447 190910 315145 199631 203328 489049 581802 834493 953600 909538 981494
6230 981494 984425 713511 529373 565336 668181 598118 550554 309642 248363 300257 246019
6219 246019 529543 672916 402673 85956 -83451 323674 489579 569583 353897 283763
6209 283763 155504 319007 344766 241275 196779 87462 146625 44089 138951 82135 -47275
$$ packed form
6284D74988k77047l23976Q7465K47294K82870p4584j1760j83978M9205M5154j36518
6273A79113N9147K27484j65690l43708j20622p2695J51220K32519J54042n8520
6263B42290M779N4012n1723j53862K27897j68247k67953J4581J44640L00097j695
6252C44816k90176R5890j72221j18833P8597Q6373J2944Q5540P5796k07385R0004
6241H1345J7102R2463J24235j15514L697K85721R2753K52691J19107m4062P1956
6230I81494K931k70914j84138L5963J02845p0063m7564k40912o1279N1894n4238
6219B46019K83524J43373k70243l16717j69407M07125J65905Q0004k15686p0134
6209B83763j28259J63503K5759j03491m4496j09317N9163j02536R4862n6816j29410
$$ plain form
6198 -47275 44418 140520 193013 230636 5379 -393582 -508259 -244731 -11434 -17621 -3816
6187 -3816 -132713 -89369 -21518 -74623 -24263 -38133 -13413 17120 288511 279756 22849 -28084
6175 -28084 88643 61062 204577 172232 98170 7956 -50412 -67243 -107922 -297522 -181365
6164 -181365 -124034 2867 122145 293785 299501 230693 195108 358198 362790 155816 -59777
6153 -59777 69517 -2896 -131008 41752 -10773 -85183 103601 427845 452674 409276 249490
6142 249490 216117 214314 285710 470954 612815 526027 437717 515559 499201 541871 498495
6131 498495 315347 209475 221976 164939 223321 -105226 -484612 -595757 -313933 145416
6121 145416 189584 343123 323017 198553 283435 492658 610903 492759 500602 279315 186134
$$ packed form
6198d7275R1693R6102N2493L7623k25257l98961j14677K63528K33297o187J3805
6187c816j28897M3344O7851n3105N0360j3870K4720L0533K71391q755k56907n0933
6175b8084J16727k7581J43515l2345p4062r0214n8368j6831m0679j89600J16157
6164a81365N7331J26901J19278J71640N716o8808l5585J63090M592k06974k15593
6153e9777J29294p2413j28112J72760n2525p4410J88784L24244K4829m3398j59786
6142B49490l3373j803P1396J85244J41861q6788q8310P7842j6358M2670m3376
6131D98495j83148j05872J2501n7037N8382l28547l79386j11145K81824M59349
6121A45416M4168J53539k0106j24464Q4882K09223J18245j18144P843k21287r3181
$$ plain form
6110 186134 180611 306198 524430 441621 315563 152570 200605 213197 98951 -13674 27395
6099 27395 -29445 119502 273229 383079 289526 227932 49748 -10991 44400 38479 53664
6088 53664 160509 447741 222868 -72226 -48238 -76463 -199261 -93263 18924 -33436
6078 -33436 3393 26028 -29109 105057 164019 215191 218232 76183 -46138 25607 126101
6067 126101 -30194 -20614 74833 -118680 -91885 24490 -160619 -370864 -417777 -524038 -642444
6056 -642444 -438563 -450505 -486328 -583493 -529975 -436761 -265130 -74988 -85606 -58925 -50717
6045 -50717 -94800 -184616 -137196 -86863 19832 -97330 -98760 46046 39339 161388 77299
6034 77299 -201294 -306419 -342721 -308768 -205750 13185 288273 357107 -122225 -610026
$$ packed form
6110A86134n523J25587K18232q2809j26058j62993M8035J2592j14246j12625M1069
6099B7395n6840J48947J53727J09850r3553o1594j78184o0739N5391n921J5185
6088E3664J06845K87232k24873k95094K3988k8225j22798J05998J12187n2360
6078c3436L6829K2635n5137J34166N8962N1172L041j42049j22321P1745J00494
6067A26101j56295R580R5447j93513K6795J16375j85109k10245m6913j06261j18406
6056f42444K03881j1942l5823r7165N3518R3214J71631J90142j0618K6681Q208
6045e0717m4083q9816M7420N0333J06695j17162j430J44806o707J22049q4089
6034G7299k78593j05125l6302L3953J03018K18935K75088O8834m79332m87801
$$ plain form
6024 -610026 -600831 -443440 -358379 -429648 -374784 -213909 113268 286670 249852 267320 246074
6013 246074 155504 164034 267429 107225 -163968 -184820 -14276 46330 147571 -4404 -225261
6002 -225261 -178383 -52269 111650 128075 95418 -104988 -141140 -187284 -319685 -205801 -136673
5991 -136673 -348108 -478032 -168469 56081 75551 338941 301596 160320 226444 326783
5981 326783 241457 155951 225783 -54083 -313760 -304136 -305938 -249444 -180068 -85317 -83391 -240517
5969 -240517 -189447 73427 32549 -59154 168531 126729 64981 -68481 -104504 -126110 -80238
5958 -80238 254213 242749 176257 130048 103280 16233 -124991 -221534 5410 56781 -23604
5947 -23604 -174541 -235257 129756 227220 265312 353060 59988 -164145 9950 177147 26176
$$ packed form
6024f10026R195J57391Q5061p1269N4864J60875L27177J73402l6818J7468k1246
6013B46074r0570Q530J03395j60204k71193k0852J70544O0606J01241j51975k20857
6002b25261M6878J26114J63919J6425l2657k00406l6152m6144j32401J13884O9128
5991a36673k11435j29924L09563K24550J9470K63390l7345j41276O6124J00339
5981C26783q5326q5506O9832k79866k59677R624j802N6494O9376R4751J926j57126
5969b40517N1070K62874m0878r1703K27685m1802o1748j33462l6023k1606M5872
5958h0238L34451j1464o6492m6209k6768q7047j41224r6543K26944N1371q0385
5947b3604j50937o0716L65013R7464L8092Q7748k93072k24133J74095J67197j50971
$$ plain form
5936 26176 45025 89290 89909 -75810 -230556 -282927 -276451 -81964 43641 116234 -32044
5925 -32044 -218011 -32211 48701 -86742 -233327 -64307 141148 127007 -120481 -305761
5915 -305761 -163970 99824 222204 81937 184680 -17850 -194972 -20498 171575 409872
5905 409872 388677 331818 257306 141950 22861 50045 -27004 -74619 -7552 -42861 112796
5894 112796 289842 312639 448474 509540 271580 105967 167135 231487 53569 -241807
5884 -241807 -281369 -238115 -338702 -235239 -397638 -300750 -18305 166789 262748 240484 193224
5873 193224 244332 324110 143731 -160637 -74565 37030 -50131 -151055 -208179 -13991 173443
5862 173443 208097 -21122 62235 126486 207380 152697 132760 184878 137013 125624 125934 284773
$$ packed form
5936B6176J8849M4265O19j65719j54746n2371O476J94487J25605P2593j48278
5925c2044j85967J85800Q0912j35443j46585J69020K05455j4141k47488j85280
5915c05761J41791K63794J22380j40267J02743k02530j77122J74474J92073K38297
5905D09872k1195n6859p4512j15356j19089K7184p7049m7615O7067l5309J55657
5894A12796J77046K2797J35835O1066k37960j65613O1168O4352j77918k95376
5884b41807l9562M3254j00587J03463j62399R6888K82445J85094R5959k2264m7260
5873A93224N1108P9778j80379l04368Q6072J11595q7161j00924n7124J94188J87434
5862A73443L4654k29219Q3357O4251Q0894n4683j9937N2118m7865j1389L10J58839
$$ plain form
5850 284773 350798 379493 64503 -77308 184043 189138 -115191 -164225 -126740 -100758 -195446
5839 -195446 -239574 -363400 -328435 -90805 -31895 -120168 -19104 299530 317678 200333 203252
5828 203252 343088 467724 277111 179645 141131 230731 116008 84456 114193 184230 223787
5817 223787 296818 237302 9335 259103 294927 21403 -132840 -529564 -415728 -282696
5807 -282696 -66331 -1132 -237231 -395346 -216483 19820 27564 4784 -18054 -35965 59460
5796 59460 169967 243939 241697 125831 74344 197961 381421 341067 56594 122711 24863
5785 24863 95424 -1555 -107420 -10844 42658 198734 216206 -39316 330449 365220 -47800
5774 -47800 -245869 -266105 -297360 -243400 -146025 40973 152670 124770 31507 37312 14455
$$ packed form
5850B84773O6025K8695l14990j41811K61351N095l04329m9034L7485K5982r4688
5839a95446m4128j23826L4965K37630N8910q8273J01064L18634J8148j17345K919
5828B03252J39836J24636j90613r7466l8514Q9600j14723l1552K9737P0037L9557
5817B23787P3031n9516k27967K49768L5824k73524j54243l96724J13836J33032
5807b82696K16365O5199k36099j58115J78863K36303P744k2780k2838j7911R5425
5796E9460J10507P3972k242j15866n1487J23617J83460m0354k84473O6117r7848
5785B4863P0561r6979j05865R6576N3502J56076J7472k55522L69765L4771m13020
5774d7800j98069k0236l1255N3960R7375J86998J11697k7900r3263N805k2857
$$ plain form
5763 14455 18067 98731 -19112 -12057 2111 -86768 -299965 -356696 -46952 -139195 -345466
5752 -345466 -377215 -371265 -314134 -278071 -87966 131253 260054 57200 92845 335475 493684
5741 493684 407813 284556 152484 82125 -48583 -160400 -90732 48143 76087 82334 305161
5730 305161 288564 217910 168361 -270226 -490636 -252911 -177902 -55876 153932 149671 -30388
5719 -30388 -270658 -181608 -176082 -188732 -18335 132247 128152 -57015 -194292 -63573 337
5708 337 -206519 -87662 52671 -8818 1750 76667 266352 252366 255802 53350 -36312
5697 -36312 -182131 -44695 99158 81653 78329 199853 214649 95798 -18227 -30910 -11721
5686 -11721 38408 294692 347807 404040 349603 517996 571887 182771 21 -94384 -130625
$$ packed form
5763A4455L612Q0664j17843P055J4168q8879k13197n6731L09744r2243k06271
5752c45466l1749N950N7131L6063J90105K19219J28801k02854L5645K42630J58209
5741D93684q5871j23257j32072p0359j30708j11817O9668J38875K7944O247K22827
5730C05161j6597p0654m9549m38587k20410K37725P5009J22026K09808m261j80059
5719c0388k40270Q9050N526j2650J70397J50582m095j85167j37277J30719O3910
5708C37k06856J18857J40333o1489J0568P4917J89685j3986L436k02452q9662
5697c6312j45819J37436J43853j7505l324J21524J4796j18851j14025j2683J9189
5686a1721N0129K56284N3115N6233n4437J68393N3891l89116j82750r4405l6241
$$ plain form
5675 -130625 -379625 -197556 665 -196849 -116253 -127657 -97856 -96073 -68495 -184795 -219047
5664 -219047 -108441 -51033 317396 773726 850118 709461 589206 469425 279186 143927
5654 143927 16622 262906 125290 -193684 -214249 -201693 -65590 170725 107851 -83380
5644 -83380 -169590 -263063 -88476 209626 295528 206511 4582 9004 -58740 72287 270036
5633 270036 175900 170767 103141 -96409 -80697 -178865 -96385 76513 332741 133751 94992
5622 94992 264279 88382 140034 8001 19908 166964 97490 82783 -125687 -208711 -78106
5611 -78106 32419 291517 288883 174814 191803 83497 2620 -103837 -313659 -258308 -286939
5600 -286939 -22861 -74975 -409772 -299530 -106305 212448 267541 137072 -53200 -22833
$$ packed form
5675a30625k49000J82069J98221j97514Q0596j1404K9801J783K7578j16300l4252
5664b19047J10606N7408L68429M56330P6392j40657j20255j19781j90239j35259
5654A43927j27305K46284j37616l18974k0565J2556J36103K36315o2874j91231
5644h3380q6210r3473J74587K98102Q5902q9017k01929M422o7744J31027J97749
5633B70036r4136n133o7626j99550J5712r8168Q2480J72898K56228j98990l8759
5622I4992J69287j75897N1652j32033J1907J47056o9474j4707k08470q3024J30605
5611g8106J10525K59098k634j14069J6989j08306q0877j06457k09822N5351k8631
5600b86939K64078n2114l34797J10242J93225L18753N5093j30469j90272L0367
$$ plain form
5590 -22833 163469 -102328 -395540 -326633 -197057 2305 29905 -15334 -18250 118095 185019
5579 185019 227351 412550 501404 343191 -87844 -306256 -259340 -125531 -53648 59084
5569 59084 182822 342516 174547 -34219 -181428 43217 228127 400829 415509 439190
5559 439190 320898 156465 169302 323844 449603 411515 325190 199761 -85569 -235374
5549 -235374 -328860 -316075 -377779 -248149 -61780 45706 -99614 87138 209488 159148
5539 159148 126592 11546 -157071 -336885 -589926 -574327 -382918 -507991 -429068 -418199
5529 -418199 -631615 -865892 -554574 -255417 -63773 -95542 -119632 26317 -49348 -102836
5519 -102836 98181 334225 209668 -165088 -205753 -84165 28968 21897 8493 49741 -114294
$$ packed form
5590b2833J86302k65797k93212O8907J29576J99362K7600m5239k916J36345O6924
5579A85019M2332J85199Q8854j58213m31035k18412M6916J33809P1883J12732
5569E9084J23738J59694j67969k08766j47209K24645J84910J72702J4680K3681
5559D39190j18292j64433J2837J54542J25759l8088q6325j25429k85330j49805
5549b35374r3486J2785o1704J29630J86369J07486j45320J86752J22350n0340
5539A59148l2556j15046j68617j79814k53041J5599J91409j25073P8923J0869
5529d18199k13416k34277L11318K99157J91644l1769k4090J45949p5665n3488
5519a02836K01017K36044j24557l74756m0665J21588J13133p071j3404M1248j64035
$$ plain form
5508 -114294 -421909 -305771 -186530 -260000 -93076 -167153 -278036 -295830 -286105 32735 192542
5497 192542 183323 -10237 -262841 -275671 -223343 -115408 -269354 -439007 -278484 -93680
5487 -93680 -147923 -144006 -157749 -369077 -412863 -422391 -471498 -252708 -11082 -60005 -228188
5476 -228188 -223353 -227783 -215642 -299119 -192188 -187280 -249305 42122 87204 94767 159907 -331063
5464 -331063 -368136 -144485 186385 145754 -34321 -72680 30806 360270 156691 -113293
5454 -113293 -231867 -480610 -350974 -215869 -96442 -47575 52415 406428 346040 140485
5444 140485 -86397 -267890 -352797 -287684 -223150 75498 119048 72465 -609 176126 44952
5433 44952 31747 112926 507816 529993 492094 473857 106050 -50238 -190399 -339579 -89068
$$ packed form
5508a14294l07615J16138J19241p3470J66924p4077j10883j7794R725L18840J59807
5497A92542r219j93560k52604j2830N2328J07935j53946j69653J60523J84804
5487i3680n4243L917j3743k11328m3786r528m9107K18790K41626m8923j68183
5476b28188M835m430J2141q3477J06931M908o2025K91427M5082P563O5140m90970
5464c31063l7073K23651L30870m0631j80075l8359J03486L29464k03579k69984
5454a13293j18574k48743J29636J35105J19427M8867R9990L54013o0388k05555
5444A40485k26882j81493q4907O5113O4534K98648M3550m6583p3074J76735j31174
5433D4952j3205Q1179L94890K2177l7899j8237l67807j56288j40161j49180K50511
$$ plain form
5422 -89068 -41973 -88752 -9933 -193529 -311561 -308559 -236494 9645 156336 36134 70457
5411 70457 -60114 -137199 -323525 -395328 -263589 -187249 -147806 -224654 -144348 -56510 -69807
5400 -69807 42624 108071 236265 314747 66563 -74412 214337 112978 -41841 -213170
5390 -213170 -148913 -91457 19539 72360 58568 -47736 110818 167427 12152 -150456 -229448
5379 -229448 -116140 -157706 -458420 -224990 -54771 4651 -227954 -117943 141948 86290
5369 86290 -134324 -230679 -107856 106429 134492 -21229 36284 423639 478509 371600 28455
5358 28455 -120479 -46893 30687 150635 554743 550583 413591 510133 297565 21270 120625
5347 120625 169507 37402 91682 -5225 -142604 -263345 -384892 -284532 -207384 -36824
$$ packed form
5422h9068M7095m6779P8819j83596j18032L002P2065K46139J46691j20202L4323
5411G0457j30571p7085j86326p1803J31739P6340L9443p6848Q0306Q7838j3297
5400f9807J12431O5447J28194P8482k48184j40975K88749j01359j54819j71329
5390b13170O4257N7456J10996N2821j3792j06304J58554N6609j55275j62608p8992
5379b29448J13308m1566l00714K33430J70219N9422k32605J10011K59891n5658
5369H6290k20614r6355J22823K14285K8063j55721N7513L87355N4870j06909l43145
5358B8455j48934P3586P7580J19948M04108m160j36992R6542k12568k76295R9355
5347A20625M8882j32105N4280r6907j37379j20741j21547J00360P7148J70560
$$ plain form
5337 -36824 -116891 -247724 -166523 -233094 -59344 215247 -58805 -340705 -230546 236059
5327 236059 253135 113139 25903 24388 -83206 -255501 -160259 -361075 -321290 -382881 -351861
5316 -351861 -453569 -301449 -208114 -47740 4709 -73473 -170041 -185288 -268446 -209147 -336340
5305 -336340 -252509 -62639 -44422 -14615 93776 94981 -68584 115293 255603 339050 343139
5294 343139 173370 356612 380785 365576 470051 508412 444739 256910 25913 -207260
5284 -207260 -66645 -175295 -349251 -427594 -356822 -123784 29231 187085 309827 55601
5274 55601 -64117 67601 97414 17228 -128850 -170608 -15226 -86880 -333964 -195025 -31997
5263 -31997 -104936 38676 45485 26897 20402 12099 88354 68623 195611 249012 181332 91090
$$ packed form
5337c6824q0067j30833Q1201o6571J73750K74591k74052k81900J10159M66605
5327B36059J7076j39996q7236j515j07594j72295R5242k00816L9785o1591L1020
5316c51861j01708J52120R3335J60374N2449p8182r6568j5247q3158N9299j27193
5305c36340Q3831J89870J8217K9807J08391J205j63565J83877J40310Q3447M089
5294C43139j69769J83242K4173j5209J04475L8361o3673j87829k30997k33173
5284b07260J40615j08650j73956p8343P0772K33038J53015J57854J22742k54226
5274E5601j19718J31718K9813q0186j46078m1758J55382p1654k47084J38939J63028
5263c1997p2939J43612O809j8588o495q303P6255j9731J26988N3401o7680r0242
$$ plain form
5251 91090 -6733 138000 -27490 -96866 -133778 -128476 -209689 -133923 -91411 -12433 11640 -29563
5239 -29563 -86529 -216197 -309137 -279280 18105 -74 -175301 -133303 -83676 -69468 -305498
5228 -305498 -450168 -366536 -280865 -260626 -132400 -155218 8881 -11135 1743 137245 136103
5217 136103 22765 161951 259191 241735 34827 -188549 -130897 -30837 -13296 119329
5207 119329 117806 347393 614127 631236 652722 358863 239788 258390 274133 296235 426348
5196 426348 362584 174295 89008 -110610 -91441 -178217 -344077 -312355 -293596 -355285 -230319
5185 -230319 151075 279118 282798 46737 -44862 155656 194216 270494 116867 26189 111145
5174 111145 34469 -167536 -230163 -189547 30587 142101 346160 536601 554905 340883
$$ packed form
5251I1090r7823J44733j65490o9376l6912N302q1213P5766M2512P8978K4073m1203
5239b9563n6966j29668r2940K9857K97385j8179j75227M1998M9627J4208k36030
5228c05498j44670Q3632Q5671K0239J28226k2818J64099k0016J2878J35502j142
5217A36103j13338J39186R7240j7456k06908k23376N7652J00060J7541J32625
5207A19329j523K29587K66734J7109K1486k93859j19075J8602J5743K2102J30113
5196D26348o3764j88289q5287j99618J9169q6776j65860L1722J8759o1689J24966
5185b30319L81394J28043L680k36061r1599K00518L8560P6278j53627r0678Q4956
5174A11145p6676k02005o2627M0616K20134J11514K04059J90441J8304k14022
$$ plain form
5164 340883 121321 -41727 -81223 -79739 -95356 -43202 192022 213785 292116 166236 136855
5153 136855 105963 187147 389645 414388 536420 623100 453084 364530 322061 386727 268694
5142 268694 122926 -29759 -212177 -310083 -238081 -112534 -272026 -204110 19255 279035
5132 279035 337181 58350 -42481 -106291 -118456 -280723 -194838 -112469 -46707 60211 56930
5121 56930 -71651 85468 184737 211335 230207 284898 371639 312923 302129 359056 81850
5110 81850 126186 218917 63987 239079 297445 249108 231165 195121 220594 128552 -39694
5099 -39694 24883 -32251 -108272 48549 20091 3973 135321 47199 -15718 9608 126248
5088 126248 51038 -88626 -56362 -140710 40639 27797 -283434 -211733 -115468 -33890 -77766
$$ packed form
5164C40883k19562j63048l9496J484j5617N2154K35224K1763P8331j25880k9381
5153A36855l0892Q1184K02498K4743J22032Q6680j70016q8554m2469O4666j18033
5142B68694j45768j52685j82418r7906P2002J25547j59492O7916K23365K59780
5132B79035N8146k78831j00831o3810j2165j62267Q5885Q2369O5762J06918l281
5121E6930j28581J57119R9269K6598J8872N4691Q6741n8716j0794N6927k77206
5110H1850M4336R2731j54930J75092N8366m8337j7943l6044K5473r2042j68246
5099c9694O4577n7134p6021J56821k8458j6118J31348q8122o2917K5326J16640
5088A26248p5210j39664L2264q4348J81349j2842l11231P1701R6265Q1578m3876
$$ plain form
5077 -77766 73801 165607 39028 -57768 -75657 187850 155025 26170 -75629 -114524 -304037
5066 -304037 -396694 -207249 42745 90937 -71176 -263617 -272932 -133270 -161811 -312496 -217898
5055 -217898 150124 259422 263489 173237 53819 128422 -8084 -215853 -68596 273671
5045 273671 308931 80897 -179016 -322125 -388097 -383212 -295066 -346199 -286762 -241605 -425494
5034 -425494 -336330 -107542 151090 8971 10820 76202 55194 38445 -147579 -676618 -640310
5023 -640310 -352757 -103172 -111013 -328902 -336555 -252230 -244191 -313376 -185330 63901 -46756
5012 -46756 96101 115221 307277 191809 -118407 20700 203086 386916 356058 150631
5002 150631 34770 81301 215532 71822 150313 -2449 156987 139654 163970 315895
$$ packed form
5077g7766J51567R1806j26579r6796j7889K63507l2825j28855j01799l8895j89513
5066c04037r2657J89445K49994M8192j62113j92441r315J39662k8541j50685R4598
5055b17898L68022J09298M067r0252j19418P4603j36506k07769J47257L42267
5045B73671L5260k28034k59913j43109o5972M885Q8146n1133N9437M5157j83889
5034d25494Q9164K28788K58632j42119J849O5382k1008j6749j86024n29039L6308
5023f40310K87553K49585p841k17889p653Q4325Q039o9185J28046K49231j10657
5012d6756J42857J9120J92056j15468l10216J39107J82386J83830l0858k05427
5002A50631j15861M6531J34231j43710P8491j52762J59436j7333K4316J51925
$$ plain form
4992 315895 300843 391609 411218 173944 -90354 -144849 -169389 -538994 -485607 -117059 -207413
4981 -207413 -135015 -13441 -20601 22134 128967 259197 -75445 -160487 -241769 -33774 -106637
4970 -106637 -69906 15682 -68211 -113322 207301 407974 413766 143752 143099 337654 617677
4959 617677 490042 239637 141557 34678 -50456 -331 26334 261401 314178 220318 276413
4948 276413 415561 381703 387680 497865 379849 193972 59900 -131004 -135303 -17879 -247102
4937 -247102 -230921 -313172 -368769 -121209 -44768 -71161 -17572 -139319 -272376 -173211 154231
4926 154231 484625 395316 266141 162214 16308 309756 657587 506912 326450 -17512
4916 -17512 14135 138423 -34228 -200475 -101742 207514 203145 -4556 -90940 -124414 7053
$$ packed form
4992C15895j5052R0766J9609k37274k64298n4495k4540l69605N3387L68548r0354
4981b07413P2398J21574p160M2735J06833J30230l34642q5042q1282K07995p2863
4970a06637L6731Q5588q3893m5111L20623K00673N792k70014o53J94555K80023
4959F17677j27635k50405r8080j06879q5134N0125K6665K35067N2777r3860N6095
4948B76413J39148l3858N977J10185j18016j85877j34072j90904m299J17424k29223
4937b47102J6181q2251n5597K47560P6441k6393N3589j21747j33057R9165L27442
4926A54231L30394q9309j29175j03927j45906K93448L47831j50675j80462l43962
4916a7512L1647J24288j72651j66247R8733L09256m369k07701q6384l3474J31467
$$ plain form
4905 7053 29022 -147377 -162092 -124397 -56167 313264 502547 538685 520984 246112 -32428
4894 -32428 -161223 -360730 -396851 -292060 -226736 -83734 -159039 -264744 -459492 -450166 -122971
4883 -122971 -112603 -30553 44267 -92351 -325359 -297420 -167366 -96848 93074 247852 43883
4872 43883 -74947 -17647 48677 -56570 -9672 93547 86323 -53643 -139889 -49975 182547
4861 182547 315535 165984 72338 195259 262097 381715 311231 162216 55427 -60125
4851 -60125 -58686 -182225 -345795 -253569 -156016 -58365 -82316 -165524 -62104 -129331 -228150
4840 -228150 -357218 -296750 -97723 -17060 37998 146365 -93049 -230447 -356884 -383258
4830 -383258 -130522 -152842 -125647 -41986 -109709 -131749 -141814 -128764 -176042 -194578 13210
$$ packed form
4905G053K1969j76399j4715L7695O8230L69431J89283L6138j7701k74872k78540
4894c2428j28795j99507l6121J04791O5324J43002p5305j05705j94748R326L27195
4883a22971J0368Q2050P4820j36618k33008K7939J30054P0518J89922J54778k03969
4872D3883j18830N7300O6324j05247M6898J03219p224j39966q6246Q9914K32522
4861A82547J32988j49551r3646J22921O6838J19618p0484j49015j06789j15552
4851f0125J439j23539j63570R2226R7553R7651k3951q3208J03420o7227r8819
4840b28150j29068O0468J99027Q0663N5058J08367k39414j37398j26437k6374
4830c83258K52736k2320K7195Q3661o7723k2040j0065J3050m7278j8536K07788
$$ plain form
4819 13210 192314 86343 -219378 -275496 -119207 -290857 -236449 -288835 -350084 -192310 -54570
4808 -54570 39660 259762 358195 266624 87180 17769 108226 -17992 -166836 -260088 -26090
4797 -26090 72850 67205 -256769 -89009 -37405 -76172 60820 179541 241586 246985 229335
4786 229335 225344 72404 -199557 -444280 -481419 -412940 -458019 -203663 208150 372348 204979
4775 204979 191834 196105 265971 757625 909089 524088 108667 -181083 -318604 -377923 -283866
4764 -283866 -84713 62734 76140 67547 55667 -195930 -350896 -353467 -207027 25411 160623
4753 160623 43837 140037 -53617 -185975 -153082 -197380 -352707 -307882 -27309 12877 134109
4742 134109 248137 275441 260252 196956 83814 -81330 -173139 -6344 344131 417531 194505
$$ packed form
4819A3210J79104j05971l05721n6118J56289j71650N4408n2386o1249J57774J37740
4808e4570R4230K20102R8433r1571j79444o9411R0457j26218j48844r3252K33998
4797b6090R8940n645l23974J67760N1604l8767J36992J18721O2045N399j7650
4786B29335l991j52940k71961k44723l7139O8479m5079K54356M11813J64198j67369
4775B04979j3145M271O9866M91654J51464l85001m15421k89750j37521n9319R4057
4764b83866J99153J47447J3406q593j1880k51597j54966k571J46440K32438J35212
4753A60623j16786R6200j93654j32358L2893m4298j55327M4825K80573M0186J21232
4742A34109J14028K7304j5189o3296j13142j65144r1809J66795L50475P3400k23026
$$ plain form
4731 194505 157569 -53483 -119246 -99339 -106375 -118316 -84135 -151834 -290544 -392742 -337356
4720 -337356 -153894 -44472 175708 476012 477782 305439 183629 212037 166089 -57633
4710 -57633 32589 121771 -13169 233354 335544 171483 91095 -85153 -212427 -154200 -189506
4699 -189506 -14416 246030 227849 102073 70894 -167933 -218298 22252 -8803 -18056 149372
4688 149372 131128 192194 109806 -144069 -80590 -2807 -104756 -95715 -113711 -170886 -424251
4677 -424251 -485336 -440965 -135536 -63574 42664 -36576 -247915 -415982 -521680 -589365 -300147
4666 -300147 -151654 -95983 -72942 1466 -231402 -260892 -100667 -18556 263671 250491 5043
4655 5043 -187294 -156690 -117872 -19897 112476 105640 143366 278455 345030 293571 126796
$$ packed form
4731A94505l6936k11052o5763J9907p036j1941L4181o7699j38710j02198N5386
4720c37356J83462J09422K20180L00304J770j72343j21810K8408m5948k23722
4710e7633R0222Q9182j34940K46523J02190j64061q0388j76248j27274N8227l5306
4699a89506J75090K60446j8181j25776l1179k38827n0365K40550l1055r253J67428
4688A49372j8244O1066q2388k53875O3479P7783j01949R041j7996n7175k53365
4677d24251o1085M4371L05429P1962J06238p9240k11339j68067j05698o7685K89218
4666c00147J48493N5671K3041P4408k32868k9490J60225Q2111K82227j3180k45448
4655E043j92337L0604L8818R7975J32373o836L7726J35089O6575n1459j66775
$$ plain form
4644 126796 79503 183649 -67586 -151830 -96180 -12274 -218479 -416998 -378151 -154015 126710
4633 126710 250957 232933 172681 -211449 -222230 172674 414556 434915 382427 19530 -55587
4622 -55587 -144139 -286371 -375669 -226420 -129026 13876 -107624 -237237 -298881 -268743 -391454
4611 -391454 -450103 -326311 -162410 -277722 -240047 -333365 -611048 -481581 -397846 -560899
4601 -560899 -508871 -284339 -21085 -296967 -184142 -274156 -277123 -365240 -461547 -598627 -344915
4590 -344915 -22398 -42100 -290017 -47972 11305 -72414 -55645 -62328 -94088 78465 444721
4579 444721 258329 199120 158513 -122392 -302858 -423055 -466983 -327556 -445596 -388268
4569 -388268 -195798 -191459 -82017 123121 173605 285749 511092 458423 357981 400102 414007
$$ packed form
4644A26796m7293J04146k51235q4244N5650Q3906k06205j98519L8847K24136K80725
4633A26710J24247j8024o0252l84130j0781L94904K41882K0359n2488l62897p5117
4622e5587q8552j42232q9298J49249R7394J42902j21500j29613o1644L0138j22711
4611c91454n8649J23792J63901j15312L7675r3318k77683J29467Q3735j63053
4601e60899N2028K24532K63254k75882J12825r0014k967q8117r6307j37080K53712
4590c44915L22517j9702k47917K42045N9277q3719J6769o683l1760J72553L66256
4579D44721j86392n9209m0607k80905j80466j20197m3928J39427j18040N7328
4569c88268J92470M339J09442K05138N0484J12144K25343n2669j00442M2121J3905
$$ plain form
4558 414007 401004 287246 160060 127671 123872 298960 211146 218516 113272 24780 -161958
4547 -161958 -45495 -74548 -97666 -112293 -133448 -109753 -64168 -98499 -3368 -133523 -127995
4536 -127995 -147959 -196012 -151838 -131497 -61911 -70675 -36808 -88041 -15174 -1169 -187332 -122118
4524 -122118 -65519 -136665 -79029 -56543 5669 32466 -66768 -190372 35538 180537 272726
4513 272726 264506 220747 -49313 32845 397449 566958 495371 366215 391899 372620 399861
4502 399861 194877 49682 187682 268552 -1498 -93683 -122117 -16322 -22114 -89904 -175694
4491 -175694 -180309 -155354 -90352 -242992 -258863 -416273 -322824 -284078 -15638 163968 242633
4480 242633 52228 -61007 -376021 -259738 139276 -2205 -76134 -71175 -58629 -125487 -289615
$$ packed form
4558D14007j3003j13758j27186l2389l799J75088q7814P370j05244q8492j86738
4547a61958J16463k9053k3118j4627k1155K3695M5585l4331R5131j30155N528
4536a27995j9964m8053M4174K0341O9586q764L3867n1233P2867J4005j86163O5214
4524a22118N6599p1146N7636K2486O2212K6797r9234j23604K25910J44999R2189
4513B72726q220m3759k70060Q2158L64604J69509p1587j29156K5684j9279K7241
4502C99861k04984j45195J38000Q0870k70050r2185k8434J05795n792o7790q5790
4491a75694m615K4955O5002j52640j5871j57410R3449L8746K68440J79606P8665
4480B42633j90405j13235l15014J16283L99014j41481p3929M959J2546o6858j64128
$$ plain form
4469 -289615 -73175 39173 109336 95842 3767 7885 -2993 -144029 153901 217166 23343
4458 23343 5114 115331 159715 -18658 -102997 64176 13473 90571 153009 -24057 -136293
4447 -136293 -342731 -303870 -115121 191565 45231 -218517 -282970 -221626 -38628 -157274
4437 -157274 -177161 -200679 -241995 -357282 -497213 -486710 -477100 -378038 -256382 41355 145242
4426 145242 528206 411053 245410 190545 137028 231840 90380 -245274 -326476 -66926
4416 -66926 -148837 -477893 -492795 -390688 -375986 -154337 -64021 -25845 -98609 -250630 -319591
4405 -319591 -150266 -146592 -84237 -73583 -163543 -101107 -65454 -80075 -180770 -276010 -443942
4394 -443942 -462201 -322567 -1110 222259 360117 187476 68400 -127742 -139062 38958
$$ packed form
4469b89615K16440J12348P0163j3494r2075M118j0878j41036K97930O3265j93823
4458B3343j8229J10217M4384j78373q4339J67173n0703P7098O2438j77066j12236
4447a36293k06438L8861J88749L06686j46334k63748o4453O1344J82998j18646
4437a57274j9887k3518m1316j15287j39931J0503R610R9062J21656K97737J03887
4426A45242L82964j17153j65643n4865n3517R4812j41460l35654q1202K59550
4416f6926q1911l29056j4902J02107J4702K21649R0316L8176p2764j52021o8961
4405c19591J69325L674O2355J0654q9960O2436L5653j4621j00695r5240j67932
4394d43942j8259J39634L21457K23369J37858j72641j19076j96142j1320J78020
$$ plain form
4384 38958 139091 -50637 -135455 -58423 -34954 27572 -79017 -161802 -145387 -101096 -45039
4373 -45039 -88470 -282009 -278722 -77454 -4493 -77953 -94148 -70154 4225 85707 271349
4362 271349 228883 132390 303851 421948 325884 156199 28107 -22649 -152619 -281222
4352 -281222 -305776 -293858 -129643 -266188 -294045 -160894 -212374 -357319 -305728 -267711 -50466
4341 -50466 -40162 -215724 86160 221764 345595 291273 117110 -73639 -130038 -154819 -276518
4330 -276518 -336191 -235975 12992 46173 -36640 31285 -122074 -238215 -226975 -161409 32916
4319 32916 33749 61491 45032 32478 -51870 -210303 -456755 -456372 -500933 -248181 151584 303421
4307 303421 234347 191450 79291 2361 -92618 -270226 -175263 30760 40982 -115383 -151721
$$ packed form
4384C8958J00133j89728q4818P7032K3469O2526j06589q2785J6415M4291N6057
4373d5039m3431j93539L287K01268P2961p3460j6195K3994P4379Q1482J85642
4362B71349m2466r6493J71461J18097r6064j69685j28092n0756j29970j28603
4352b81222k4554J1918J64215j36545k7857J33151n1480j44945N1591L8017K17245
4341e0466J0304j75562L01884J35604J23831n4322j74163j90749n6399k4781j21699
4330b76518n9673J00216K48967L3181q2813O7925j53359j16141J1240O5566J94325
4319C2916Q33K7742j6459j2554q4348j58433k46452L83m4561K52752L99765J51837
4307C03421o9074m2897j12159p6930r4979j77608R4963K06023J0222j56365l6338
$$ plain form
4296 -151721 -96741 -359739 -353521 -233643 -246696 -218930 137607 134674 92464 55073 -124280
4285 -124280 -187286 -169491 -200848 -101929 -69283 -5903 -43721 254871 439043 332556 226389
4274 226389 37740 216901 131463 65402 199235 326529 87565 -72234 -95303 97597
4264 97597 241033 56074 33167 -42477 195512 335799 267984 -59970 -300876 -537239
4254 -537239 -399667 -126552 -173705 -128046 49828 227691 90194 -82436 -229571 -215565
4244 -215565 -63642 34516 783 260196 393772 209114 10751 21443 -129345 -357026
4234 -357026 -306701 -248333 -159814 -65731 -172363 -160034 -106418 -159754 -21539 -51335 -162142
4223 -162142 -270982 -386804 -583890 -459398 -164924 -238805 -521692 -664169 -413869 -45708
$$ packed form
4296a51721N4980k62998O218J19878j3053K7766L56537k933m2210l7391j79353
4285a24280o3006J7795l1357R8919L2646O3380l7818K98592J84172j06487j06167
4274B26389j88649J79161q5438o6061J33833J27294k38964j59799k3069J92900
4264I7597J43436j84959k2907p5644K37989J40287o7815l27954k40906k36363
4254e37239J37572K73115m7153M5659J77874J77863j37497j72630j47135J4006
4244b15565J51923R8158l3733K59413J33576j84658j98363J0692j50788k27681
4234c57026N0325N8368Q8519R4083j06632J2329N3616n3336J38215k9796j10807
4223a62142j08840j15822j97086J24492K94474p3881k82887j42477K50300L68161
$$ plain form
4213 -45708 -72729 58032 401007 309237 -174557 -215800 -117422 -188433 48653 -77343 -205102
4202 -205102 -77927 14361 -82698 -225143 -312946 -158134 -72715 30679 -43943 -151293 -112038
4191 -112038 -108556 -247814 -303440 -284235 -245146 -286151 -424612 -380578 -246799 -297580 -211112
4180 -211112 -240347 -244267 -233681 -253960 -354644 -397176 -468868 -533146 -472403 -259714 116525
4169 116525 42121 -104213 -110084 -274013 -176305 -140341 -70815 99791 -101084 -395021 -309636
4158 -309636 -85068 -110110 -289715 -294349 -357085 -188905 -260334 -344670 -199534 -32122 76929
4147 76929 -46105 -119581 216631 184998 123956 65584 13783 94780 58583 67479 -72211
4136 -72211 -164064 3171 54146 81345 186828 143663 -99792 -162832 -174646 -279874 -152112
$$ packed form
4213d5708k7021J30761L42975r1770m83794m1243R8378p1011K37086j25996j27759
4202b05102J27175R2288r7059j42445q7803J54812Q5419J03394p4622j07350L9255
4191a12038L482j39258n5626J9205L9089m1005j38461M4034J33779n0781Q6468
4180b11112k9235l920J0586k0279j00684m2532p1692o4278O0743K12689L76239
4169A16525p4404j46334n871j63929R7708L5964O9526J70606k00875k93937Q5385
4158c09636K24568k5042j79605m634o2736J68180p1429q4336J45136J67412J09051
4147G6929j23034p3476L36212l1633o1042n8372n1801Q0997l6197Q896j39690
4136g2211r1853J67235N0975K7199J05483m3165k43455o3040j1814j05228J27762
$$ plain form
4125 -152112 2411 -77369 -114911 22550 11339 -406221 -410596 -204031 -16037 345173 233119
4114 233119 56816 -23863 -93653 -225246 -279766 -159951 -53356 58337 -45411 -80416
4104 -80416 176333 345347 331233 267614 -146859 -372258 -364785 -152830 -277802 -246469 -147652
4093 -147652 11950 158122 254899 89053 -187481 -252122 -102614 2326 -37130 405957
4083 405957 551750 417788 325868 170743 38226 -85245 -196070 -243259 -232512 -250227
4073 -250227 -129318 -117661 -144670 -222473 -155229 -16639 -317672 -570746 -450549 -537737 -626231
4062 -626231 -283920 -12630 -183444 -396090 -669919 -481439 -122484 -27874 149085 342623
4052 342623 215622 -196216 -273977 -251940 -131478 375253 293336 -56003 -275845 -468963
$$ packed form
4125a52112J54523p9780l7542J37461j1211m17560m375K06565J87994L61210j12054
4114B33119j76303q0679o9790j31593n4520J19815J06595J11693j03748l5005
4104h0416K56749J69014j4114o3619m14473k25399P473K11955j24972L1333R8817
4093a47652J59602J46172R6777j65846k76534o4641J49508J04940l9456M43087
4083D05957J45793j33962r1920j55125j32517j23471j10825m7189J0747j7715
4073b50227J20909J1657k7009p7803O7244J38590l01033k53074J20197q7188q8494
4062f26231L42311K71290j70814k12646k73829J88480L58955R4610J76959J93538
4052C42623j27001m11838p7761K2037J20462N06731q1917l49339k19842j93118
$$ plain form
4042 -468963 -352932 -285820 -189909 -156041 -285615 -305821 -172216 -92014 -138485 -164687 41545
4031 41545 374696 221481 79669 -53236 -48797 -46622 -168434 -173616 -240955 -263224 -76553
4020 -76553 -177620 -79153 -163489 -339905 -341088 -233464 -88968 -194473 -437896 -566646 -737824
4009 -737824 -776569 -548476 -383129 -227666 -102368 -267268 -503728 -561826 -593698 -428333
3999 -428333 -228927 -134053 -82074 -128698 -135255 186746 355019 396861 486379 286469 135529
3988 135529 222206 -55596 -544957 -543871 -375708 -323225 -155672 -127043 29328 123582 27908
3977 27908 99354 30791 -85768 -52390 -209409 -430870 -344063 -25694 137406 233278 105659
3966 105659 -95030 118907 247243 251452 -58678 -148281 -27855 -246674 -363513 -178697
$$ packed form
4042d68963J16031O7112R5911L3868j29574k0206J33605Q0202m6471k6202K06232
4031D1545L33151j53215j41812j32905M439K175j21812n182o7339k2269J86671
4020g6553j01067R8467q4336j76416j183J07624J44496j05505k43423j28750j71178
4009g37824l8745K28093J65347J55463J25298j64900k36460n8098l1872J65365
3999d28333J99406R4874N1979m6624o557L22001J68273M1842Q9518j99910j50940
3988A35529Q6677k77802m89361J086J68163N2483J67553K8629J56371R4254r5674
3977B7908P1446o8563j16559L3378j57019k21461Q6807L18369J63100R5872j27619
3966A05659k00689K13937J28336M209l10130q9603J20426k18819j16839J84816
$$ plain form
3956 -178697 -203775 -20191 183871 92814 15467 182900 147226 132885 -31495 86354 181737
3945 181737 131910 37310 -140515 -194873 -315639 -341329 -180957 -142153 -243756 -289284 -621846
3934 -621846 -567083 -417748 -326930 -56297 5302 92993 167466 149518 246608 221852 30660
3923 30660 -179809 -313691 -375732 -474294 -480964 -235957 -97061 -207889 -30094 20607 259269
3912 259269 382563 179054 321752 86551 -35690 68552 126017 13107 38027 140719
3902 140719 141707 325084 402172 389577 343461 236924 199441 318228 270440 125898 176315
3891 176315 236684 122483 -8309 72156 -30342 34983 -174845 -291182 -137051 -369046
3881 -369046 -547057 -485506 -392474 -409965 -232749 -222719 -329838 -193133 17020 103943 83039
$$ packed form
3956a78697k5078J83584K04062r1057p7347J67433l5674j4341j64380J17849R5383
3945A81737m9827r4600j77825n4358j20766k5690J60372L8804j01603m5528l32562
3934f21846N4763J49335R0818K70633O1599Q7691P4473j7948R7090k4756j91192
3923C0660k10469j33882o2041r8562o670K45007J38896j10828J77795N0701K38662
3912B59269J23294k03509J42698k35201j22241J04242N7465j12910K4920J02692
3902A40719R88J83377P7088j2595m6116j06537l7483J18787m7788j44542N0417
3891A76315O0369j14201j30792Q0465j02498O5325k09828j16337J54131k31995
3881c69046j78011O1551R3032j7491J77216J0030j07119J36705K10153Q6923k0904
$$ plain form
3870 83039 77804 200213 3606 51386 102050 312768 249099 65840 -103857 -119941 -311345
3859 -311345 -232962 -145986 -344320 -440683 -329658 -264690 -262102 -48392 -121841 -201502 -119476
3848 -119476 -19190 -130899 -173017 13444 253849 77814 -27996 169072 51590 6736
3838 6736 19041 -240728 -102163 -11610 7658 -72753 -17300 -266 -310690 -358657 -439261
3827 -439261 -398095 -68450 -128111 -195129 -202339 -215062 -420452 -364676 -444724 -482221 -186942
3816 -186942 -41259 -42611 -182119 -30379 -3057 -111236 -51651 -70667 -31106 239875 19962
3805 19962 -318104 -245713 -114093 -237149 -259991 -239738 -18981 135977 193324 29764 146860
3794 146860 178831 233784 245475 115372 147878 154206 156026 21092 -6919 -94067 -302799
$$ packed form
3870H3039n235J22409j96607M7780N0664K10718o3669j83259j69697j6084j91404
3859c11345P8383Q6976j98334r6363J11025O4968K588K13710p3449p9661Q2026
3848a19476J00286j11709m2118J86461K40405j76035j05810J97068j17482m4854
3838F736J2305k59769J38565R0553J9268q0411N5453J7034l10424m7967q0604
3827d39261M1166L29645n9661o7018p210j2723k05390N5776q0048l7497K95279
3816a86942J45683j352j39508J51740K7322j08179N9585j9016L9561K70981k19913
3805A9962l38066P2391J31620j23056k2842K0253K20757J54958N7347j63560J17096
3794A46860L1971N4953J1691j30103L2506O328J820j34934k8011q7148k08732
$$ plain form
3783 -302799 -303861 -246856 -133632 -118600 -50498 6774 -113242 -222 155038 213610 140118
3772 140118 -11400 12283 22851 119539 274316 58430 -222072 -315374 -365143 -178613 28278
3761 28278 13811 -90810 -244410 -344423 -220029 -91097 -109157 -16065 365030 561246
3751 561246 443969 361321 235114 317881 295400 164624 -73912 -90894 21030 -125095
3741 -125095 -372059 -291879 28113 53802 -136516 -291331 -211261 -97265 -353335 -465376
3731 -465376 -391124 -592763 -613160 -642477 -435692 -256111 -182405 -180534 -215153 -292731 -454173
3720 -454173 -644664 -402123 -236395 -136950 -76376 5124 -267441 -252697 135687 441563
3710 441563 397525 138679 3756 17622 102603 69311 -40482 -72390 882 108023 160331
$$ packed form
3783c02799j062N7005J13224J5032O8102N7272j20016J13020J55260N8572p3492
3772A40118j51518K3683J0568R6688J54777k15886k80502r3302m9769J86530K06891
3761B8278j4467j04621j53600j00013J24394J28932j8060R3092L81095J96216
3751E61246j17277q2648j26207Q2767k2481j30776k38536j6982J11924j46125
3741a25095k46964Q0180L19992K5689j90318j54815Q0070J13996k56070j12041
3731d65376P4252k01639k0397k9317K06785J79581P3706J871l4619p7578j61442
3720d54173j90491K42541J65728R9445O0574Q1500k72565J4744L88384L05876
3710D41563m4038k58846j34923J3866Q4981l3292j09793l1908P3272J07141N2308
$$ plain form
3699 160331 79843 110378 -62251 -514412 -476888 -275102 9636 195083 177965 160638 135008
3688 135008 78593 33599 97261 117603 100139 106480 63488 134099 135034 102173 -87424 -217139
3676 -217139 -333720 -289084 -123840 -204330 -212271 -197152 -65887 -146465 -294128 -208686 -27378
3665 -27378 -56178 -47668 -11807 -59189 -153404 -234974 -388897 -332761 -289495 -361233 -270310 -210561
3653 -210561 -370604 22236 101264 -70158 -228627 -279175 -306146 -271607 -251891 -341847 -360635
3642 -360635 -365870 -109970 -55001 -125741 -24635 -336289 -394099 -370941 -346290 -384357 -196094
3631 -196094 -96016 20857 -79235 -324550 -207655 -142595 -80955 -181226 -292570 -170401
3621 -170401 119028 104035 -95298 -115012 -43260 146030 249039 150463 60689 129138 -68267
$$ packed form
3699A60331q0488L0535j72629m52161L7524K01786K84738J85447j7118j7327k5630
3688A35008n6415m4994O3662K0342j7464O341m2992P0611R35l2861j89597j29715
3676b17139j16581M4636J65244q0490p941J5119J31265q0578j47663Q5442J81308
3665b7378k8800Q510L5861m7382r4215q1570j53923N6136M3266p1738R0923N9749
3653b10561j60043L92840P9028j71422j58469n0548k6971L4539J9716q9956j8788
3642c60635n235K55900N4969p0740J01106l11654n7810K3158K4651l8067J88263
3631a96094J00078J16873j00092k45315J16895O5060O1640j00271j11344J22169
3621a70401K89429j4993j99333j9714P1752J89290J03009r8576q9774O8449j97405
$$ plain form
3610 -68267 -264833 -198149 -176939 -176390 -148874 -155571 75331 241675 101666 -247784 -452593
3599 -452593 -564631 -475983 -301656 -135045 -320951 -427608 -383247 -448013 -440441 -383870 -216112
3588 -216112 -32549 44627 56190 -62585 -6243 24104 -15068 163726 -27373 -9919 213381
3577 213381 276385 -15423 -2786 155010 27021 -89374 -73200 213796 341891 249449
3567 249449 81964 63330 106765 45059 -253309 -493998 -213502 -152412 -35389 178179
3557 178179 223347 136078 101995 201581 -86480 -123139 -20630 -233736 -316649 -135087 18660
3546 18660 43604 -49149 66778 -53552 9604 -38372 2882 -353160 -675740 -440229 -249605
3535 -249605 -244401 -302387 -267059 -11433 -26380 -160400 -115574 -241251 -220494 -390682 -278254
$$ packed form
3610f8267j96566O6684K1210N49K7516o697K30902J66344j40009l49450k04809
3599d52593j12038Q8648J74327J66611j85906j06657M4361o4766P572N6571J67758
3588b16112J83563P7176J1563j18775N6342L0347l9172J78794j91099J7454K23300
3577B13381O3004k91808J2637J57796j27989j16395J6174K86996J28095r2442
3567B49449j67485j8634M3435o1706k98368k40689K80496O1090J17023K13568
3557A78179M5168q7269l4083R9586k88061l6659J02509k13106q2913J81562J53747
3546A8660K4944r2753J15927j20330O3156m7976M1254l56042l22580K35511J90624
3535b49605N204n7986L5328K55626j4947j34020M4826j25677K0757j70188J12428
$$ plain form
3524 -278254 -179826 -186302 -174302 -107632 -7113 -62111 -112474 -394763 -218216 -70289 -197921
3513 -197921 -310404 -488722 -689861 -625665 -660011 -538424 -207328 72639 114674 97946
3503 97946 82201 -23172 34593 -36474 -123700 18885 24960 -87463 -64902 -74029 -121398 -122652
3491 -122652 -81986 -222149 -331671 -201459 38873 -35039 -64994 9401 9795 -53665 -27651
3480 -27651 -92665 -58623 -129937 -108356 180692 231297 251978 13348 -303562 -254782 -278790
3469 -278790 -293837 -191030 -219304 -123736 -192622 -360454 -425033 -331122 -86939 50358 -105984
3458 -105984 -54816 57504 65869 88043 100158 128370 -24134 -155563 -189010 -112542 9305
3447 9305 147071 -121542 -256553 -48679 104573 -89207 -265193 -118564 -60572 -30163
$$ packed form
3524b78254R8428o476J2000O6670J00519n4998n0363k82289J76547J47927j27632
3513a97921j12483j78318k01139O4196l4346J21587L31096K79967M2035j6728
3503I7946j5745j05373N7765p1067q7226J42585O075j12423K2561r127m7369j254
3491a22652M0666j40163j09522J30212K40332p3912k9955P4395L94o3460K6014
3480b7651o5014L4042p1314K1581K89048N0605K0681k38630l16910M8780k4008
3469b78790j5047J02807k8274R5568o8886j67832o4579R3911K44183J37297j56342
3458a05984N1168J12320Q365K2174J2115K8212j52504j31429l3447P6468J21847
3447I305J37766k68613j35011K07874J53252j93780j75986J46629N7992L0409
$$ plain form
3437 -30163 -16503 -56689 163569 209317 138273 -28314 -91149 51582 -188248 -510613 -446846
3426 -446846 -66968 71731 -73216 -141344 -73702 122461 -151852 -169559 -246249 -159426 -75620
3415 -75620 -164032 -119982 -150981 -16632 74410 -169893 -239495 -82438 2117 -259119 13627
3404 13627 274840 153664 -89821 -57266 132943 65994 -116399 -127481 -281778 -249672 -334038
3393 -334038 -350342 -111090 -126361 -27943 179833 90638 -156054 -78427 -160701 -175797 -57368
3382 -57368 -303980 -303056 -217684 -55682 76429 -40924 -218287 -43023 4076 9574 -87819
3371 -87819 10991 -27795 -129274 -334106 -292336 -119823 156997 34086 -39766 -338151 -508961
3360 -508961 -636988 -644754 -472952 -326570 -370839 -399944 -184943 -193711 -183211 -120821 178258
$$ packed form
3437c0163J3660m0186K20258M5748p1044j66587o2835J42731k39830l22365O3767
3426d46846L79878J38699j44947o8128O7642J96163k74313j7707p6690Q6823Q3806
3415g5620q8412M4050l0999J34349R1042k44303o9602J57057Q4555k61236K72746
3404A3627K61213j21176k43485L2555J90209o6949j82393j1082j54297L2106q4366
3393c34038j6304K39252j5271R8418K07776q9195k46692P7627q2274j5096J18429
3382e7368k46612R24Q5372J62002J32111j17353j77363J75264M7099N498r7393
3371h7819R8810l8786j01479k04832M1770J72513K76820j22911p3852k98385j70810
3360e08961j28027p766J71802J46382m4269k9105K15001q768J0500O2390K99079
$$ plain form
3349 178258 268491 120145 226757 16265 -190399 -128610 -327390 -442207 -284254 -96449
3339 -96449 143990 136642 18314 -151064 -261578 -96053 75116 37503 73028 106143 169269
3328 169269 183345 196597 241672 155227 86852 206024 170008 198752 231234 255070 115088
3317 115088 61875 107987 -6951 -374423 -285588 -172492 44519 186484 9614 -312382
3307 -312382 -160763 -60294 -258174 -246026 -196219 -160939 -191629 -180048 -45636 87509 383574
3296 383574 432838 149904 -118454 -194714 -127766 -87391 -236218 -68832 267423 233705 62414
3285 62414 -33318 -214420 -170024 84427 112060 -60640 -247225 -287862 -201806 -347766 -567452
3274 -567452 -506460 -387766 -183246 51923 180874 304294 394099 410278 536798 467241
$$ packed form
3349A78258R0233j48346J06612k10492k06664O1789j98780j14817J57953J87805
3339i6449K40439p348j18328j69378j10514J65525J71169l7613L5525L3115O3126
3328A69269J4076J3252M5075q6445o8375J19172l6016K8744L2482K3836j39982
3317A15088n3213M6112j14938l67472Q8835J13096K17011J41965j76870l21996
3307c12382J51619J00469j97880J2148M9807L5280l0690J1581J34412J33145K96065
3296C83574M9264k82934k68358p6260O6948M0375j48827J67386L36255l3718j71291
3285F2414r5732j81102M4396K54451K7633j72700j86585m0637Q6056j45960k19686
3274e67452O0992J18694K04520K35169J28951J23420Q9805J6179J26520o9557
$$ plain form
3264 467241 121605 -187283 4516 207947 156028 120163 176727 290538 208803 108538
3254 108538 -113944 -215740 -53790 82980 162584 30055 12353 294689 351622 287205
3244 287205 64003 210031 190852 59700 -12803 43071 153153 348328 37671 -38311
3234 -38311 170463 222222 63667 168514 107476 178884 98892 18817 138840 145582 22533
3223 22533 -7770 -3073 90219 41017 1697 301568 510818 380654 207742 -62130 -7022
3212 -7022 142193 214448 66578 -35828 103131 119983 -98496 -245887 -235418 -351117 -279846
3201 -279846 -198574 -355728 -421843 -277783 -126949 -141971 -222518 -222046 51112 -74481 -245834
3190 -245834 -487225 -647815 -522784 -222895 -33949 -80711 -133804 -105086 -96782 -255296 -492770
$$ packed form
3264D67241l45636l08888J91799K03431n1919l5865N6564J13811q1735j00265
3254A08538k22482j01796J61950J36770P9604j32529j7702K82336N6933o4417
3244B87205k23202J46028j9179j31152p2503N5874J10082J95175l10657p5982
3234c8311K08774N1759j58555J04847o1038P1408p9992q0075J20023O742j23049
3223B2533l0303M697R3292m9202l9320K99871K09250j30164j72912k69872N5108
3212g022J49215P2255j47870j02406J38959J6852k18479j47391J0469j15699P1271
3201b79846Q1272j57154o6115J44060J50834j5022q0547M72K73158j25593j71353
3190b45834k41391j60590J25031K99889J88946m6762n3093K8718Q304j58514k37474
$$ plain form
3179 -492770 -311987 -367685 -601681 -618108 -284117 -48313 -225176 -211155 12143 -54620
3169 -54620 28960 -145351 -141010 -101564 -243991 -362512 -250927 -125714 67462 229814 220684
3158 220684 -26858 -189317 -115857 150193 405481 300456 223236 -152537 -318596 12404
3148 12404 152693 384177 507870 551874 582981 254807 -188611 -268268 -211837 -24825 80341
3137 80341 8193 -30478 30751 148879 48292 -189688 -74667 110555 -153060 -145027 79251
3126 79251 166501 -33351 -287469 -414799 -131913 -21061 -115439 -181208 117699 117823 137715
3115 137715 104525 68535 108695 172935 -11144 -347099 -369421 -174714 65251 44023 -25799
3104 -25799 73587 94189 -16793 -43690 -68893 -117214 -147690 -51683 70768 -177059 -362965
$$ packed form
3179d92770J80783n5698k33996j6427L33991K35804j76863J4021K23298o6763
3169e4620Q3580j74311M341L9446j42427j18521J11585J25213J93176J62352r130
3158B20684k47542j62459P3460K66050K55288j05025p7220l75773j66059L31000
3148A2404J40289K31484J23693M4004L1107l28174m43418p9657N6431J87012J05166
3137H0341p2148l8671O1229J18128j00587k37980J15021J85222k63615Q033K24278
3126G9251Q7250j99852k54118j27330K82886J10852r4378o5769K98907J24J9892
3115A37715l3190l5990M0160O4240j84079l35955k2322J94707K39965k1228o9822
3104b5799R9386K0602j10982k6897k5203m8321l0476R6007J22451k47827j85906
$$ plain form
3093 -362965 -401603 -337970 -277024 -357660 -277359 -55671 107819 -217282 -173794 -61087 -176552
3082 -176552 -324675 -154465 23822 -103510 -29062 -172734 -177180 -160521 -167089 -27671 30696
3071 30696 -60857 -54465 -159902 -188958 -2236 244464 32107 5641 204184 120388 132766
3060 132766 124753 239543 145308 580 -77746 -109379 68114 51385 231035 478001 581436
3049 581436 378216 237660 74215 -158357 -181698 -250533 -309790 -370408 -337239 -371175 -387650
3038 -387650 -432785 -318246 -312937 -285044 -229730 50245 116309 -68278 -241309 -106767 -102736
3027 -102736 -100384 -241497 -293888 39971 50430 77983 -77428 -88926 -247179 -288279 -163960
3016 -163960 -11233 72476 124065 141774 173283 223214 23503 -113238 -92353 1401 133311
$$ packed form
3093c62965l8638O3633O0946q0636Q0301K21688J63490l25101M3488J12707j15465
3082a76552j48123J70210J78287j27332P4448j43672m446J6659o568J39418N8367
3071C0696r1553O392j05437k9056J86722K46700k12357k6466J98543q3796J2378
3060A32766q013J14790r4235j44728p8326l1633J77493j6729J79650K46966J03435
3049E81436k03220j40556j63445k32572k3341o8835n9257o0618L3169l3936j6475
3038c87650m5135J14539N309K7893N5314K79975O6064j84587j73031J34542M031
3027a02736K352j41113n2391L33859J0459K7553j55411j1498j58253m1100J24319
3016a63960J52727Q3709N1589J7709L1509M9931j99711j36741K0885R3754J31910
$$ plain form
3005 133311 -143091 -289528 -284065 -328611 -183596 -123718 -309583 -167078 -6060 -27218 -230170
2994 -230170 -320982 -359902 -258929 -241976 -18069 25786 106974 152590 65429 35989 21728
2983 21728 1944 8792 26753 180995 -205132 -269068 -198188 -63052 -166681 -93353 156619
2972 156619 226284 168702 18765 -60933 -128753 -264573 -284930 -197615 87389 113105 119045
2961 119045 63031 119071 -44735 -152099 -170189 -152038 -163965 -260199 -14904 -3303 -62
2950 -62 -51715 -64369 -102525 -186512 -454275 -453108 -362532 -295557 -95269 -40390 -9536 -200874
2938 -200874 -223298 -221670 -167339 132941 144111 117704 115675 164167 62297 106460 12763 -62949
$$ packed form
3005A33311k76402j46437N463m4546J45015N9878j85865J42505J61018k1158k02952
2994b30170r0812l8920J00973J6953K23907M3855Q1188M5616q7161k9440j4261
2983B1728j9784O848J7961J54242l86127o3936P0880J35136j03629P3328K49972
2972A56619O9665n7582j49937p9698o7820j35820k0357Q7315K85004K5716N940
2961A19045n6014N6040j63806j07364j8090J8151j1927r6234K45295J1601L241
2950f2n1653j2654l8156q3987k67763J167R0576O6975K00288N4879L0854j91338
2938b00874k2424J628N4331L00280J1170k6407k029M8492j01870M4163r3697p5712
$$ [...]
##END NTUPLES=NMR SPECTRUM
##END=
