##TITLE=Analysis number 325152
Compound Code sp 01464
Project Code adrs
Chemist Name fudan
##JCAMPDX= 6.0         $$ Bruker NMR JCAMP-DX V2.0
##DATA TYPE= NMR SPECTRUM
##DATA CLASS= NTUPLES
##ORIGIN= Bruker BioSpin GmbH
##OWNER= nmr
$$ XWIN-NMR		Version 3.5
$$ Tue Dec 12 14:28:49 2006 GMT Standard Time (UT+0h)  MAYBRIDGE\nmr@NMR_250MHZ
##.OBSERVE FREQUENCY= 250.131544655141
##.OBSERVE NUCLEUS= ^1H
##.ACQUISITION MODE= SIMULTANEOUS (DQD)
##.ACQUISITION SCHEME= undefined
##.AVERAGES= 16
##.DIGITISER RES= 18
##SPECTROMETER/DATA SYSTEM= dpx250
##.PULSE SEQUENCE= zg30
##.SOLVENT NAME= CDCl3
##.SHIFT REFERENCE= (INTERNAL, CDCl3, 0, 16.5256)
##AUDIT TRAIL= $$ (NUMBER, WHEN, WHO, WHERE, WHAT)
$$ ##TITLE= Audit trail, XWIN-NMR		Version 3.5
$$ ##JCAMPDX= 5.01
$$ ##ORIGIN= Bruker BioSpin GmbH
$$ ##OWNER= nmr
$$ C:\u/data/dgb/nmr/ADRS/790/pdata/1/auditp.txt
$$ ##AUDIT TRAIL=  $$ (NUMBER, WHEN, WHO, WHERE, WHAT)
(   1,<2006-12-12 14:28:27.32 +000>,<MAYBRIDGE\nmr>,<NMR_250MHZ>,
      <created by zg, POWCHK disabled, PULCHK disabled
       configuration hash MD5:
       49 4B E0 1D 92 C2 6B 37 9F E6 65 BC 52 41 86 1D
       data hash MD5: 64K
       0D 66 B8 60 60 41 E6 87 FE 2D 2E 4F CD 86 0A 60>)
(   2,<2006-12-12 14:28:40.14 +000>,<MAYBRIDGE\nmr>,<NMR_250MHZ>,
      <Start of raw data processing
       ef LB = 0.3 FT_mod = 6 PKNL = 1 SI = 32K 
       data hash MD5: 32K
       6F 96 01 D0 6A 9F D4 D4 C5 B6 36 4D 21 77 CA D4>)
(   3,<2006-12-12 14:28:42.47 +000>,<MAYBRIDGE\nmr>,<NMR_250MHZ>,
      <apk 
       data hash MD5: 32K
       F3 2A D5 03 DE 2D 95 01 E9 83 84 FC 62 22 3C CD>)
(   4,<2006-12-12 14:28:43.14 +000>,<MAYBRIDGE\nmr>,<NMR_250MHZ>,
      <abs ABSG = 5 
       data hash MD5: 32K
       14 13 F1 53 A7 55 E1 CD 08 13 90 2C 34 84 E5 08>)
$$ ##END=
$$ 
$$ hash MD5
$$ EF 70 00 B1 94 0F 7F 8F 27 6F 90 DD 3A 82 7D 93
##$RELAX= 
##$RELAX= 
##$RELAX= 
##$RELAX= 
##$RELAX= 
##$RELAX= 
##$RELAX= 
$$ Bruker specific parameters
$$ --------------------------
##$DU= <C:\u>
##$EXPNO= 790
##$NAME= <ADRS>
##$PROCNO= 1
##$TYPE= <nmr>
##$USER= <dgb>
##$AMP= (0..31)
100 100 100 100 100 100 100 100 100 100 100 100 100 100 100 100 100 100 
100 100 100 100 100 100 100 100 100 100 100 100 100 100 
##$AQSEQ= 0
##$AQ_mod= 3
##$AUNM= <au_zg>
##$AUTOPOS= <53 >
##$BF1= 250.13
##$BF2= 250.13
##$BF3= 250.13
##$BF4= 250.13
##$BF5= 500.13
##$BF6= 500.13
##$BF7= 500.13
##$BF8= 500.13
##$BYTORDA= 1
##$CFDGTYP= 0
##$CFRGTYP= 5
##$CHEMSTR= <none>
##$CNST= (0..31)
1 1 145 1 1 1 1 1 1 1 1 1 1 1 1 1 1 1 1 1 1 1 1 1 1 1 1 1 1 1 1 1 
##$CPDPRG= <>
##$CPDPRG1= <>
##$CPDPRG2= <>
##$CPDPRG3= <>
##$CPDPRG4= <mlev>
##$CPDPRG5= <mlev>
##$CPDPRG6= <mlev>
##$CPDPRG7= <mlev>
##$CPDPRG8= <mlev>
##$CPDPRGB= <>
##$CPDPRGT= <>
##$D= (0..31)
0 1 0 0 0 0 0 0 0 0.06 0 0 0 0 0 0 0.0002 0 0 0 0 0 0 0 0 0 0 0 0 0 0 
0 
##$DATE= 1165933706
##$DBL= (0..7)
120 120 120 120 120 120 120 120 
##$DBP= (0..7)
150 150 150 150 150 150 150 150 
##$DBP07= 0
##$DBPNAM0= <>
##$DBPNAM1= <>
##$DBPNAM2= <>
##$DBPNAM3= <>
$$ [...]
##$SUBNAM7= <"">
##$SUBNAM8= <"">
##$SUBNAM9= <"">
##$SW= 20.6930455092707
##$SWIBOX= (0..15)
0 0 3 0 0 0 0 0 0 0 0 0 0 0 0 0 
##$SW_h= 5175.983436853
##$TD= 65536
##$TD0= 1
##$TE= 295.16
##$TE2= 300
##$TE3= 300
##$TEG= 300
##$TL= (0..7)
0 120 120 120 120 120 120 120 
##$TP= (0..7)
150 150 150 150 150 150 150 150 
##$TP07= 0
##$TPNAME0= <>
##$TPNAME1= <>
##$TPNAME2= <>
##$TPNAME3= <>
##$TPNAME4= <>
##$TPNAME5= <>
##$TPNAME6= <>
##$TPNAME7= <>
##$TPOAL= (0..7)
0.5 0.5 0.5 0.5 0.5 0.5 0.5 0.5 
##$TPOFFS= (0..7)
0 0 0 0 0 0 0 0 
##$TUNHIN= 0
##$TUNHOUT= 0
##$TUNXOUT= 0
##$USERA1= <user>
##$USERA2= <user>
##$USERA3= <user>
##$USERA4= <user>
##$USERA5= <user>
##$V9= 5
##$VALIST= <valist>
##$VCLIST= <CCCCCCCCCCCCCCC>
##$VD= 0
##$VDLIST= <DDDDDDDDDDDDDDD>
##$VPLIST= <PPPPPPPPPPPPPPP>
##$VTLIST= <TTTTTTTTTTTTTTT>
##$WBST= 1024
##$WBSW= 4
##$XGAIN= (0..3)
0 0 0 0 
##$XL= 0
##$YL= 0
##$YMAX_a= 356064
##$YMIN_a= -408113
##$ZGOPTNS= <>
##$ZL1= 120
##$ZL2= 120
##$ZL3= 120
##$ZL4= 120
##$ABSF1= 16.52557
##$ABSF2= -4.167603
##$ABSG= 5
##$ABSL= 3
##$ALPHA= 0
##$AQORDER= 0
##$ASSFAC= 0
##$ASSFACI= 0
##$ASSFACX= 0
##$ASSWID= 0
##$AUNMP= <proc_1d>
##$AZFE= 0.1
##$AZFW= 0.1
##$BCFW= 0
##$BC_mod= 0
##$BYTORDP= 0
##$COROFFS= 0
##$CY= 12.5
##$DATMOD= 1
##$DC= 0
##$DFILT= <>
##$DTYPP= 0
##$F1P= 14.0000005364418
##$F2P= -0.99999901652339
##$FCOR= 0.5
##$FTSIZE= 32768
##$FT_mod= 6
##$GAMMA= 0
##$GB= 0
##$INTBC= 1
##$INTSCL= 1
##$ISEN= 128
##$LB= 0.3
##$LEV0= 0
##$LPBIN= 0
##$MAXI= 10000
##$MC2= 0
##$MEAN= 0
##$ME_mod= 0
##$MI= 0
##$NCOEF= 0
##$NC_proc= -3
##$NLEV= 6
##$NOISF1= 0
##$NOISF2= 0
##$NSP= 0
##$NTH_PI= 0
##$NZP= 0
##$OFFSET= 16.52557
##$PC= 1
##$PHC0= 212.2837
##$PHC1= 32.72306
##$PH_mod= 1
##$PKNL= yes
##$PPARMOD= 0
##$PSCAL= 4
##$PSIGN= 0
##$REVERSE= no
##$SF= 250.129999106588
##$SI= 32768
##$SIGF1= 0
##$SIGF2= 0
##$SINO= 400
##$SIOLD= 32768
##$SREGLST= <1H.CDCl3>
##$SSB= 0
##$STSI= 32768
##$STSR= 0
##$SW_p= 5175.98343685301
##$SYMM= 0
##$S_DEV= 0
##$TDeff= 65536
##$TDoff= 0
##$TI= <Analysis number 999999
Compound Code 99
Book Reference 9
Project Code 9>
##$TILT= no
##$TM1= 0
##$TM2= 0
##$TOPLEV= 0
##$USERP1= <user>
##$USERP2= <user>
##$USERP3= <user>
##$USERP4= <user>
##$USERP5= <user>
##$WDW= 1
##$XDIM= 32768
##$YMAX_p= 558677631
##$YMIN_p= -613025
$$ End of Bruker specific parameters
$$ ---------------------------------
##NTUPLES= NMR SPECTRUM
##VAR_NAME=  FREQUENCY,     SPECTRUM/REAL,   SPECTRUM/IMAG
##SYMBOL=    X,             R,               I
##VAR_TYPE=  INDEPENDENT,   DEPENDENT,       DEPENDENT
##VAR_FORM=  AFFN,          ASDF,            ASDF
##VAR_DIM=   32768,         32768,           32768
##UNITS=     HZ,            ARBITRARY UNITS, ARBITRARY UNITS
##FACTOR=    0.157963299565203, 1,           1
##FIRST=     4133.54078826778, 0,            0
##LAST=      -1042.44264858523, 0,           0
##MIN=       -1042.44264858523, -613025,     0
##MAX=       4133.54078826778, 558677631,    0
$$ Real data points
##PAGE= N=1
##DATA TABLE= (X++(R..R)), XYDATA
$$ [...]
18746A42249Q645k049o83l385m513J8177n652j7704R601J1856Q224J86j0154l685
18732A51113j1283j8187L5832L0626r772L145P393n678J0740K1292j4678l5110
18720A65433J1495K3614p960N476j1767l0496j9239q810P065J9787k3724j5106
18708A15768J3073J4832k51J3353K4602R8O319J6037J9716o615k1201j7980M657
18695A82408k5904o083K9159J1336J1467R770O848L1280l511k8263M438K7979
18683B50924J3095R781P554P637R96r703j3581n30j5559j5500J5264J3375n077
18670B58676r348K3511L3262O088L631k115l8840k0343l2322R148k871n0840k0900
18657A56737K3639J4579Q255j4172j568J0806k280j6711k1188R408P173K2581
$$ plain form
18746 142249 150894 148845 148162 144777 140264 158441 152789 135085 144686 156542 164766 164952 154798 151113
18732 151113 139830 121643 157475 188101 178329 181474 188867 183189 193929 215221 200543 165433
18720 165433 176928 200542 192582 198058 186291 155795 136556 127746 134811 154598 130874 115768
18708 115768 128841 143673 143422 156775 181377 181475 187794 203831 223547 216932 195731 177751 182408
18695 182408 156504 150421 179580 190916 202383 212153 219001 250281 246770 218507 222945 250924
18683 250924 264019 273800 281354 288991 289987 280284 266703 266173 250614 235114 250378 263753 258676
18670 258676 249328 272839 306101 312189 315820 313705 274865 254522 222200 231348 228477 177637 156737
18657 156737 180376 194955 203210 189038 187470 198276 195996 179285 158097 167505 174678 197259
18645A97259p73O839J1790q626k0777j4161r534n319M869K6217n646j9381j0218
18632A52539l462J2517J4333L313J5376L2350J0212N981j7989j561K948j7950
18620B08607k3340Q380N9722L7073O841k5990k1917R299L902j1279j7351K4866
18608B58813J5334k1785j6740L3298K6799K6700j1216J741q657j683M749j6127
18596B91226j3344K3520L2549L6153M0730k3742k3882j9164J2110m273j7214R499
18584C44168j963K0089k9842J5305K9713j6953m0711j4606l033j0494r286m870
18572B77517J4903J2107N69k7076k4884n959N650J1605r686j121K8165K0540K322
18559C04652R685N0344N9179L1405L9238L6608K115k18j0414k5627o4231l3305
$$ plain form
18645 197259 196486 203325 215115 206489 185712 171551 162017 156698 161567 187784 182138 162757 152539
18632 152539 149077 161594 175927 179240 194616 226966 237178 243159 225170 223609 226557 208607
18620 208607 185267 193647 253369 290442 297283 271293 249376 258675 262577 251298 233947 258813
18608 258813 274147 252362 235622 268920 295719 322419 311203 312944 304287 302604 307353 291226
18596 291226 277882 301402 333951 370104 410834 387092 363210 344046 356156 351883 334669 344168
18584 344168 342205 362294 332452 347757 377470 360517 319806 305200 302167 291673 282387 277517
18572 277517 292420 304527 305096 278020 253136 247177 252827 264432 254746 253625 281790 302330 304652
18559 304652 314337 364681 423860 455265 494503 531111 533226 533008 522594 496967 432736 399431
18547C99431l0497j344M1500M930n227J2464J7838j5870L769R297j097J436J1552
18534D48182J8988N680R986K5678K8767K3942K142J3357L4717J1286R787k5589
18522F06923k1179l789J7742O742K8087N810j5160J2218K1942L3837L9964Q185
18510G41322j7599j0565J5060M6842L3378K7762N544J8320N5446K7055K8879L6291
18498A007735K7900P3358P0825M4726N8809O7204R6088J07747J36448J27472J31707
18487A950019J55918J36354J42864J83276J94032K34755K84517K96371L27759
18478C905865L98976M22807N03119O22935P23059R30015J261529J755825K487341
18469A3011471L606088M949521O018174O708915P553549P699558M967081J726966
$$ plain form
18547 399431 368934 367590 409090 414020 408793 421257 439095 423225 426994 436291 435194 436630 448182
18534 448182 467170 472850 482836 508514 537281 561223 563365 576722 611439 622725 632512 606923
18522 606923 585744 581955 599697 606439 634526 640336 625176 637394 659336 693173 733137 741322
18510 741322 723723 713158 728218 775060 808438 836200 841744 860064 915510 942565 971444 1007735
18498 1007735 1035635 1108993 1179818 1224544 1283353 1350557 1446645 1554392 1690840 1818312 1950019
18487 1950019 2105937 2242291 2385155 2568431 2762463 2997218 3281735 3578106 3905865
18478 3905865 4304841 4727648 5230767 5853702 6576761 7506776 8768305 10524130 13011471
18469 13011471 16617559 21567080 27585254 34294169 41847718 49547276 54514357 56241323
18461E6241323Q39869m96443l760462n148118l826706j655868M48729K402629
18453D5044953M295467O214485N981206K271882m35243j134030l769676p618347
18445E0850697q740410p888083o977419n990952m675400l385161k357273j740538
18437I095461j303393j016185q27890o77563n50965m48189l74923l49117l27370
18428C219866k83014k45502k24073k03481j95702j79624j90335j86229j48320
18419A363586j21893r6320q0768n3557o2885o4855l9055k5576l5404k3581j3022
18408G46670k0600r36Q187j6690J1269J7242l790J3703k1847l9612o5864p4186
18396E53546j1314l603k8199l8996l931R597K8095L1930k2142l8557j8747l7152
$$ plain form
18461 56241323 57081192 56584749 52824287 47676169 43849463 42193595 42642324 45044953
18453 45044953 49340420 55554905 61536111 63807993 63372750 62238720 58469044 50850697
18445 50850697 42110287 34222204 27244785 21253833 16578433 13193272 10835999 9095461
18437 9095461 7792068 6775883 5947993 5270430 4719465 4271276 3896353 3547236 3219866
18428 3219866 2936852 2691350 2467277 2263796 2068094 1888470 1698135 1511906 1363586
18419 1363586 1241693 1145373 1064605 1011048 948163 883308 844253 818677 783273 759692 746670
18408 746670 726070 725134 733321 716631 727900 745142 741352 755055 733208 693596 627732 553546
18396 553546 542232 538629 510430 471434 467503 477100 505195 537125 514983 476426 457679 420527
18384D20527j5236P665l008j6969k324M334j3216J5703p52j8965J217J4338J4199
18371D07513j1233k1713M6827L6117N2788Q5853R8165K3046o4753n8665n6532
18360E37413j8722l3680j0627N533K6616L220p322o56k2495k5975Q619R375J7176
18347D88475J5911K527J6316N765J0021j7957l5627R571N3625Q027J8016Q386
18335E83056j606O987J0024r95M897L5872J6307k5382k7438K9726L0214K824J6147
18322F80633J863m006J3510j0289L0391K5490K6009J5320K3482N5573K0003K6840
18310I04819M4096N2144N0356L9970O6868O1709L7051N7388P0357Q3594R1912
18299A560264J19565J39398J39358J63840K19521L01464L63287M29656M49746
$$ plain form
18384 420527 405291 412956 409948 392979 390655 394989 381773 397476 396724 377759 378976 393314 407513
18371 407513 396280 374567 421394 457511 510299 596152 694317 717363 652610 593945 537413
18360 537413 518691 485011 474384 479917 506533 509753 502431 501775 479280 453305 461924 471299 488475
18347 488475 504386 506913 523229 528994 539015 521058 485431 495002 548627 556654 574670 583056
18335 583056 581450 588437 598461 597466 602363 638235 654542 629160 601722 631448 661662 664486 680633
18322 680633 682496 678490 692000 681711 712102 737592 763601 778921 802403 857976 877979 904819
18310 904819 948915 1001059 1051415 1091385 1158253 1219962 1257013 1314401 1384758 1468352 1560264
18299 1560264 1679829 1819227 1958585 2122425 2341946 2643410 3006697 3436353 3886099
18290C886099L70299K16430K00608L05731M60244O01760Q23628J083266J478371
18281I426436K060165K876031M119164O036320R007152J3604941J9021221J9945794
18273H6097224P974486j0690963j9429884j6792011j0461497n624566k342111
18266B8730678L70548L289975P055581J1978459J6329498J3828502l33700j4668028
18258F6581513j8248465j4014570q910717n761021m017726k993376k279693j743350
18250H612595j336615j018413p62426n69966m36093l28681k75319k67136k74289
18241C343657k99946l25920l51810k87291k39486j84620j29069j18075j48260
18232A259180j24404o5170o2953p8224r3365m0730l7478m7414l2119k8764l2517
$$ plain form
18290 3886099 4256398 4472828 4673436 4979167 5439411 6041171 6864799 7948065 9426436
18281 9426436 11486601 14362632 18481796 24518116 33525268 47130209 66151430 86097224
18273 86097224 94071710 83380747 63950863 47158852 36697355 31072789 28730678
18266 28730678 29101226 32391201 39446782 51425241 67754739 81583241 81249541 66581513
18258 66581513 48333048 34318478 25407761 19646740 15629014 12635638 10355945 8612595
18250 8612595 7275980 6257567 5495141 4925175 4489082 4160401 3885082 3617946 3343657
18241 3343657 3043711 2717791 2365981 2078690 1839204 1654584 1525515 1407440 1259180
18232 1259180 1134776 1069606 1006653 928429 835064 794334 756856 709442 677323 648559 616042
18221F16042n7097n2166k6868k7337k9715r57j5594o406L666k7899k2069k6380
18209C27220k4379o4137j6142k1080J0041n961J1356J7476k1782j6131p910j4007
18197A74564j5209m363k3334j7589J7470j710M150K8240j4181q028r17j3438J5443
18184A41098p592O423K930R673N741k8372k5352j6452O797L9242J1283j3086p757
18171A24576K2957P575J8849M940j6733j0181j2102j8921k0743J4020J3152j2127
18159A15262P203r919n076L5409K912k6615J6063J2469K7484L5395J9092K0580
18147B50259j1942P040k1402K922l1171j3988L7032O1136M3628k283J1040L988
18135C36259m357L655l674L9162N2538O8301M1647N1736N8271R1604Q0994O3829
$$ plain form
18221 616042 558945 506779 479911 452574 422859 421902 406308 399902 403568 375669 353600 327220
18209 327220 302841 238704 222562 201482 211523 205562 216918 234394 212612 196481 188571 174564
18197 174564 159355 154992 131658 114069 131539 129829 133979 162219 148038 140010 139093 125655 141098
18184 141098 133506 139929 142859 152532 158273 129901 104549 88097 94894 134136 145419 132333 124576
18171 124576 147533 155108 173957 178897 162164 151983 139881 120960 100217 114237 127389 115262
18159 115262 122465 112546 107470 142879 145791 119176 135239 147708 175192 210587 229679 250259
18147 250259 238317 245357 223955 226877 195706 181718 218750 279886 323514 321231 332271 336259
18135 336259 331902 335557 331883 371045 423583 491884 533531 585267 643538 735142 816136 879965
18123H79965J18948J52993J59617J89595K39133K84269M04572N57614Q02503J189452
18113D978661J889238L153100N347194Q654586J1302093P169244m393814j0853839
18105B7246463r803393n979186l377567k072987j358551r46242o58709n21118
18097B528710m14121l29082k67525k08610j37121j18653j19155q5066r5897r0930
18087F62550m8129l0295k7721l0982n6031n683j1603j2636o5173m1817l6960l2605
18075B62915r456m648q533k2323K2119J0204j7581l6658j6728K1365k0558o8232
18063A11886o472k4778J634M332J5498N0182J2357k9568J7417J4626P572q274
18051A66412M544N306M990k1303m3638m6575j2480K3147K1915k6489n36Q797j024
$$ plain form
18123 879965 998913 1151906 1311523 1501118 1740251 2024520 2429092 2986706 3789209 4978661
18113 4978661 6867899 10020999 15368193 24022779 35324872 42494116 38100302 27246463
18105 27246463 17443070 11463884 8086317 6013330 4654779 3708537 3049828 2528710
18097 2528710 2114589 1785507 1517982 1309372 1172251 1053598 934443 849377 753480 662550
18087 662550 614421 584126 556405 525423 469392 463709 452106 439470 374297 332480 295520 262915
18075 262915 253459 248811 240278 217955 240074 250278 232697 196039 179311 200676 180118 111886
18063 111886 105414 80636 82270 86602 102100 152282 164639 135071 152488 167114 174686 166412
18051 166412 170956 176262 181252 159949 116311 69736 57256 80403 102318 75829 75293 84090 83066
18038H3066k5937q726J8390J2626k6297p522Q413K772n607K2451l173L694J9080
18025I3230j5438p193j9648j9004j8620j4975r337K4295p976l397P500J1518l3
18012B0922k5105l9209M939L891N760J3636J7639j1309j0297r61K408j1791J1878
17999a7599N146J537j5555k6409K631K4361M5204M9006J4355J106P635J9251J8072
17986A28741J3950j0417K0802J7038k81J3106M391p021o065k8142k1506j2092
17974A12504k7725m920l533K0922K333l1840l9554j0700J8721J2308j0057m8775
17962a0316j604R171M471J4851o968J9307L2146J9285l1077l2948o465N9J4185
17949B4097L2822m430j8643N519L8066J4135Q912K2243J0967M1687K1537O673
$$ plain form
18038 83066 57129 48403 66793 79419 53122 45600 54013 56785 51178 73629 70456 74150 93230
18025 93230 77792 70599 50951 31947 13327 -1648 -10985 13310 5334 1937 9437 20955 20922
18012 20922 -4183 -43392 -38453 -34562 -28802 -15166 2473 -8836 -19133 -20094 -17686 -29477 -17599
17999 -17599 -12453 -10916 -26471 -52880 -50249 -25888 19316 68322 82677 83783 91418 110669 128741
17986 128741 142691 132274 153076 170114 169833 182939 187330 180309 174244 146102 124596 112504
17974 112504 84779 79859 76326 97248 99581 67741 28187 17487 36208 48516 38459 -10316
17962 -10316 -11920 -2749 1722 16573 9605 28912 61058 80343 49266 16318 9853 9912 24097
17949 24097 56919 52489 33846 39365 77431 91566 100478 122721 133688 175375 196912 203585
17937B03585L3611J7719J0781q706j6309J6924J051j0714k490k0932l3894k8281
17925A62345m9296o0002k4418j838r548k627J380j3194R2l6924l1514Q285Q202
17912d9057R835M647m328Q590K416P432O57J5550q331l793k9787k105L5316p212
17898b0170k3854J1958J8248k354k0556k8743j3327K2068L3463J1228p287k3728
17886d3054J1592R203L7051N834k0801j3646j592o123J8089j3848J5133M465M481
17873F784j2095n828j1352P650j876j7105K3435K5955K0341k013p639r181J0236
17860B7312K0284j828K268k0455k2589n732Q591K1133O629L749K5486K2228M4914
17847A31990K7019L8266M7875L7171L930q593j5232Q517o828k1356j0765p290
$$ plain form
17937 203585 237196 254915 265696 256990 240681 257605 258656 247942 245452 224520 190626 162345
17925 162345 113049 53047 28629 26791 17243 14616 15996 2802 2894 -34030 -65544 -57259 -49057
17912 -49057 -39222 -34575 -38903 -30313 -27897 -20465 -19808 -4258 -12589 -16382 -46169 -48274 -12958 -20170
17898 -20170 -44024 -32066 -13818 -16172 -36728 -65471 -78798 -56730 -23267 -12039 -19326 -43054
17886 -43054 -31462 -22259 14792 20626 -175 -13821 -15413 -21536 -3447 -17295 -2162 2303 6784
17873 6784 -5311 -11139 -22491 -14841 -16717 -33822 -10387 15568 35909 33896 26257 17076 27312
17860 27312 47596 45768 48036 27581 4992 -740 7851 28984 35613 39362 64848 87076 131990
17847 131990 159009 197275 245150 282321 286251 277658 262426 270943 264115 242759 231994 224704
17835B24704j7288J8231K8840L4433J1798l031Q84j2603j5188m3306o9626o7302
17823I0546j9725k3281k0565j5747J7050k9456j1967k3647R971J7839J1229k6223
17811b3976l0681K213R837j6539N148K8469J2022J4889L3857k985l6726l1660
17799c6132J6155J5771J5359k04k1585k7127J0232J1303j0692M033j6299p394
17787d6580K8322J2175K5065j8430j6556k0029r143m322J1236k181R183J7882
17775a3378M174m504K1204J710k0383l543m305L0977J2212o061J1232m832k513
17762B1990j9478j525J977o706P541J811j5766k785o572P258K3285o127o283J0416
17748I036J3952J4198k297k1111j3056j3084J5133L2786m4k0332o033j0138o181
$$ plain form
17835 224704 207416 225647 254487 288920 300718 297687 298571 285968 270780 227474 157848 90546
17823 90546 70821 47540 26975 11228 28278 -1178 -13145 -36792 -26821 -8982 2247 -23976
17811 -23976 -54657 -52444 -42607 -59146 -53998 -25529 -13507 1382 35239 32254 -4472 -36132
17799 -36132 -19977 -4206 11153 10949 -10636 -37763 -27531 -16228 -26920 -22887 -39186 -46580
17787 -46580 -18258 -6083 18982 552 -16004 -36033 -45176 -49498 -38262 -40443 -31260 -13378
17775 -13378 -9204 -13708 7496 9206 -11177 -14720 -19025 11952 24164 18103 29335 24503 21990
17762 21990 2512 987 2964 -3742 3799 5610 -10156 -12941 -19513 -12255 11030 4903 -1380 9036
17748 9036 22988 37186 34889 13778 722 -12362 2771 35557 35513 15181 9148 -990 -7171
17735g171k0506j4000J9041R897j7008m724p216j2249K9088J7453L2869j1913
17723A3561j8578k206L1287q83o690r14k4951m3437K4587L4649K4014q62K592
17710C2169P572N093j1384k4424K5656j6580r262M012p17P960k4877n281J1241
17697A178O153K9690J2388k638p715J426K2893L4145Q3186Q6989J18248J01588
17685D87531M504q4421p7204p4687k9218P245j6880j3349K8297N7011P0388P2791
17673D32008K1828o5746q5974p3538n8303p770l1001k0132O133j079p5K671Q90
17660A19912J8294K2882J9026J1643J9410M0351K6345J5670K798j5749o320l342
17648B70920J3419K514k6145k6952k8958l7894k4881m2750K1180J4814p411j3893
$$ plain form
17735 -7171 -27677 -41677 -22636 -12739 -29747 -34471 -41687 -53936 -24848 -7395 25474 13561
17723 13561 -5017 -7223 24064 23181 16491 15577 -9374 -52811 -28224 6425 30439 29577 32169
17710 32169 39741 44834 33450 9026 34682 18102 8840 12852 12135 20095 -4782 -10063 1178
17697 1178 7331 37021 49409 46771 39056 40482 63375 97520 180706 267695 385943 487531
17685 487531 492035 407614 330410 255723 226505 233750 216870 203521 231818 288829 359217 432008
17673 432008 453836 388090 302116 228578 170275 162505 131504 111372 117505 116426 116351 119022 119912
17660 119912 138206 161088 180114 191757 211167 251518 277863 293533 296331 280582 274262 270920
17648 270920 284339 286853 260708 233756 204798 166904 142023 99273 120453 135267 127856 113963
17636A13963L440j6800k3827J6897L841n886J0338o522m7490l1836K2583K5431
17624F4132j0630R62k434n027L837L0111K0087J9620j6691k9391o311j861P997
17611G4401j7693J87K3054J3279k2310l601K0773J9803O108R52J5517K1883N0593
17598B02946P50O725J3071J1549q19j4579l5675k1578k2047l5030j8182P344R758
17585A04233r856l719K3913k7061m4880n733j2557j3637j2676K0546K7893J4955
17573F1421O866k3971o166k7167j9448J9392K8763Q953J1898o294q212k045L447
17560D7437p502k348J1048m361n145q809k3694K8334J9974J3354m727J3078R703
17547H6342O207q381K1089l3251j9512j3734R176P348J1234K4939Q109k630K2756
$$ plain form
17636 113963 117403 100603 76776 93673 97514 91628 101966 95444 47954 16118 38701 64132
17624 64132 53502 54464 52030 47003 50840 80951 101038 120658 103967 74576 68265 66404 74401
17611 74401 56708 56895 79949 93228 70918 67317 88090 107893 114001 114953 130470 152353 202946
17598 202946 203696 210421 223492 235041 234222 219643 183968 162390 140343 105313 87131 94475 104233
17585 104233 94377 90658 114571 87510 42630 36897 24340 10703 -1973 18573 46466 61421
17573 61421 68287 44316 38150 10983 -8465 10927 39690 48643 60541 54247 46035 43990 47437
17560 47437 39935 37587 48635 44274 39129 30320 6626 34960 54934 68288 63561 76639 86342
17547 86342 92549 84168 105257 72006 52494 38760 47936 55284 66518 91457 99566 96936 119692
17534A19692l0852n5762J0664R689o4J748n030j7056k1883J363L2796Q37J10O766
17520E3018j166k0577J115K9295n719j3382j6908O927K8849J7369l8540j8696
17508B1585r81Q691J31K9539J2031K1970L3608L1859J6516M502L928j3817L734
17495A73296r139K5802J1912j2012p965J5m6582k4133J7362K9744J7940q831n696
17482A61713j8493k1985n57M629k2895O167J0874l7358j0875l662k4402r211R542
17469D3487L366p613O562n656j0221K3441j520o4843l0130J6706M9270J250j1004
17456A3095j0725L9253J7077j6531N079P731K3918N564J917K6580J2602K0105
17444A45665N4500O1315L1653J9519j4969p7091p7202k0055q979l8788l7209j3786
$$ plain form
17534 119692 88840 33078 43742 53431 53367 55115 50085 33029 11146 12509 45305 46142 46252 53018
17520 53018 51852 31275 32390 61685 55966 42584 25676 32603 61452 78821 40281 21585
17508 21585 20604 29295 29426 58965 70996 92966 126574 158433 174949 179451 183379 169562 173296
17495 173296 164157 189959 201871 189859 181894 181909 135327 111194 128556 158300 176240 167409 161713
17482 161713 143220 121235 120678 125307 102412 108579 119453 82095 71220 67558 43156 33945 43487
17469 43487 46853 39240 45802 40146 29925 53366 51846 -12997 -43127 -26421 22849 24099 13095
17456 13095 2370 41623 58700 42169 47248 54979 78897 84461 86378 112958 125560 145665
17444 145665 200165 261480 293133 312652 297683 220592 143390 123335 114356 75568 38359 24573
17432B4573Q026k374l4309k9558m842j2553L32J4365K7687m629k8518o484K3545
17419b4739J7351K0161M817O173J1457l118j3889M002j0715Q284o385p276k3604
17406a7481M438N620n739J7872L109l388q006J6141J5764K748j431j6554j4467
17393a374k186O447k522k4755j1100K1370J3675j8236q604J8150m062n025k126
17380b0348K067J1402J4373M923k380l637J0195q415J2224k7805j8597k0378R278
17367c7098n035p239o723O172L6684l205k9450j7261M736j4554K430l356K0278
17354e3621K9468P989k2420O941Q69l3044j965O79M45L90M2394K6530J3327l7592
17340a9610j1641J0041R284k512k1217L529N578j0555L550r49j3313R662L1426
$$ plain form
17432 24573 32599 30225 -4084 -33642 -38484 -51037 -50705 -36340 -8653 -13282 -41800 -48284 -24739
17419 -24739 -7388 12773 17590 23763 35220 32102 18213 22215 11500 19784 13399 6123 -17481
17406 -17481 -13043 -7423 -13162 4710 7819 4431 -3575 12566 28330 31078 29647 13093 -1374
17393 -1374 -3560 2887 365 -24390 -35490 -14120 -445 -18681 -27285 -9135 -13197 -18222 -20348
17380 -20348 -18281 -6879 7494 12417 10037 6400 16595 8180 20404 -7401 -25998 -46376 -37098
17367 -37098 -42133 -49372 -56095 -49923 -13239 -16444 -45894 -63155 -58419 -72973 -70543 -73899 -53621
17354 -53621 -24153 -16164 -38584 -31643 -30774 -63818 -65783 -65104 -64659 -64269 -21875 4655 17982 -19610
17340 -19610 -31251 -21210 -11926 -14438 -35655 -32126 -26548 -37103 -33553 -34502 -47815 -38153 -6727
17327f727J4483l184J6157J0178j7157m7569J5726K9004j577l863j0604o805j8990
17314c0928K858J6402n728k7623Q766L0180L909r665k112j2246j0851M10j106
17301c7734n605n468K4279O408j3521j2489k0707m8J4394L035O092K6879q283
17288b2768j7334j6195l375J2331J1797J104k654J7159j5287j9221M718J7856
17276c1869k4979j5936l095L3201n528K174J7967R442j5507J1388K6472m862j8326
17263a9458l0883k227J2650P579j7770K0431O925j0773r034q288j0199k5450k2205
17250a08702J1183L3239k464p321K701K7501J8177l397L38J6925K219o96n895
17237a6192l6874r968R390K8273J3277p538j2310q92j6883p371J2633j2039j8976
$$ plain form
17327 -6727 7756 4572 20729 30907 13750 -33819 -18093 10911 9334 5471 -5133 -11938 -30928
17314 -30928 -28070 -11668 -17396 -45019 -36253 -6073 -2164 -11829 -13941 -26187 -37038 -36628 -37734
17301 -37734 -43339 -48807 -24528 -18120 -31641 -44130 -64837 -64885 -50491 -47456 -41364 -14485 -22768
17288 -22768 -40102 -56297 -59672 -47341 -35544 -34440 -37094 -19935 -35222 -54443 -49725 -31869
17276 -31869 -56848 -72784 -75879 -42678 -48206 -46032 -28065 -18623 -34130 -22742 3730 -1132 -19458
17263 -19458 -50341 -52568 -39918 -32339 -50109 -29678 -22753 -33526 -42560 -50848 -61047 -86497 -108702
17250 -108702 -97519 -64280 -66744 -74065 -71364 -43863 -25686 -29083 -28745 -11820 -9601 -10297 -16192
17237 -16192 -53066 -63034 -53644 -25371 -12094 -19632 -31942 -32834 -49717 -57088 -44455 -56494 -75470
17224g5470J2020j1462M823J4687K3222K8524j3518k4241r451K4320q859p25J1206
17211b4924J5536K715j2186k6586n04L1458Q83J6698J1628j8666n489j1654j9903
17198d0994k466J8176Q714K4225q377j4293L921P567Q707J3236q051k3798j6104
17185b9537q997k160J7841j0400o831j0352J334q066j1384k7263R9K6390J7710
17172e1616J9200j2614N310J257J0828K6450k2303l2707j4434k919L1484J6261
17160b5803R71K7807J7985k292k1565J386J2967j199k887o223L58l333k7830L4768
17146E110R479J347K7384j2145j9394r282n607q695n062J8067J4878j0582j6605
17133a1107j0388j3281K0097J3451j0225l007K5563j0983n267p414M050J0756
$$ plain form
17224 -75470 -63450 -74912 -70089 -55402 -32180 -3656 -17174 -41415 -50866 -26546 -35405 -36130 -24924
17211 -24924 -9388 -6673 -18859 -45445 -45949 -14491 -13608 3090 14718 -3948 -9437 -21091 -40994
17198 -40994 -43460 -25284 -16570 7655 -722 -15015 -11094 -3527 5180 18416 10365 -13433 -29537
17185 -29537 -38534 -40694 -22853 -33253 -40084 -50436 -49102 -57168 -68552 -95815 -95716 -69326 -51616
17172 -51616 -32416 -45030 -39720 -38463 -27635 -1185 -23488 -56195 -70629 -73548 -42064 -25803
17160 -25803 -24832 2975 20960 18668 -2897 -1511 11456 10257 7370 1147 1505 -1828 -29658 5110
17146 5110 14589 15936 43320 31175 11781 2499 -3108 -11803 -16865 1202 16080 5498 -11107
17133 -11107 -21495 -34776 -14679 -1228 -11453 -14460 11103 120 -5147 -12561 -8511 2245
17121B245J662j2015j3534j4663K282L7482j6949k9615K228q64J0179J1667l551
17108b3446M303R767j9584j9676j0953J7577L4390J9184k1091K6489K280k0645
17096a405q192J8190j4257k7834N321K738Q887R219K3608j3886j7123N458J3768
17083D492j7759j3785M784J2822l075o934l2879l058j5538J34J7609M0346O943
17070e898J6435J8008j4058J018j1808k4102J3716m160P226m823j6449k3863O544
17057d2214J7117K2711j3091j640Q090J1626J3731j5912j3147M155p204p033R490
17044a3321k650n044Q820P230J170j1260m744P044O51j2522q038R536j0161n475
17030c8764J2199L137j3835J2965j4607k8457O367k735K420K6265J1561q804j4966
$$ plain form
17121 2245 3907 -8108 -21642 -36305 -34023 3459 -13490 -43105 -40877 -41741 -31562 -19895 -23446
17108 -23446 -19143 -9376 -28960 -48636 -59589 -42012 -7622 11562 -9529 16960 19240 -1405
17096 -1405 -9597 8593 -5664 -33498 -28177 -25439 -16552 -7333 16275 2389 -14734 -9276 4492
17083 4492 -13267 -27052 -22268 -9446 -12521 -19455 -52334 -55392 -70930 -70796 -53187 -12841 -5898
17070 -5898 10537 28545 14487 15505 3697 -20405 -6689 -10849 -3623 -8446 -24895 -48758 -42214
17057 -42214 -25097 -2386 -15477 -17117 -9027 2599 16330 418 -12729 -8574 -15778 -22811 -13321
17044 -13321 -15971 -21015 -12195 -4965 -3795 -15055 -19799 -12755 -12104 -24626 -32664 -23128 -33289 -38764
17030 -38764 -26565 -23428 -37263 -24298 -38905 -67362 -60995 -63730 -61310 -35045 -23484 -32288 -47254
17017d7254j3160K857j2499K437M2588N5023J745j9989j5890j894j4201K3753
17005C516J5096j6820k3894k1212j0302J2413J4471K322m664J132P048J625R709
16992i560m95j0436k6711p174k4125l066J1059K2215Q928j9497r922l304J6308
16979e5780J4996j6018L4780J9723J3855J9194k7574k4825j6696n992j766o378
16967e2481j1336K0156K4395K3695J2531J5416l591k440j8785p382j3743j2102
16955b5667J9334J6132j0646j2464k0148j8487K236J3763P740J4036k6536k6020
16943f6727l0375K1126K3279j2742j3218P374j5049k475K2122L8430K1439K7075
16931B0259j1474l8182o032m608p412p609J3851O036m537J9073J7875K867q91
$$ plain form
17017 -47254 -60414 -57557 -70056 -67619 -25031 29992 31737 11748 -4142 -6036 -20237 3516
17005 3516 18612 1792 -22102 -43314 -53616 -41203 -26732 -24410 -29074 -27942 -20894 -19269 -9560
16992 -9560 -10055 -20491 -47202 -54376 -78501 -81567 -70508 -48293 -39365 -58862 -68784 -72088 -55780
16979 -55780 -40784 -56802 -22022 -2299 11556 30750 3176 -21649 -38345 -44337 -46103 -52481
16967 -52481 -63817 -43661 -19266 4429 16960 32376 28785 26345 7560 178 -13565 -25667
16955 -25667 -6333 9799 -847 -13311 -33459 -51946 -49710 -35947 -28207 -14171 -40707 -66727
16943 -66727 -97102 -75976 -52697 -65439 -78657 -71283 -86332 -88807 -66685 -28255 -6816 20259
16931 20259 8785 -29397 -35429 -40037 -47449 -55058 -41207 -35171 -39708 -20635 -2760 107 -784
16918g84N552Q409J5034j6486l5332k679O703J2970j1233K504n982k3979O792
16905c8511J9792N323j4668q726J6967j8276m3592M436L5685L5577J2772J5626
16893B2405j7148l0438L334J0060j1027R199K1082R750j5697m4434O191L1554
16881e169K2037j239o149k1947J8534J2309q365J7239K769k1689k347P074K7675
16868D0732k1696l4272j3980j0209j719K0876K2426q670l4598m1525J0074K7237
16856d5324K8121L4145k14r114j3503k0988j2112l113j0072j019M7251K6764k2699
16843a877r551n073j1532j1038K0714Q630j3780K253o083L3729K0033l5990k3167
16830c2732J7801O311q609q758j4553k6849J240n237J1924J7439J4503K0776j3119
$$ plain form
16918 -784 4768 13177 28211 11725 -23607 -26286 -19583 -6613 -17846 -15342 -21324 -45303 -38511
16905 -38511 -18719 -13396 -28064 -36790 -19823 -38099 -81691 -77255 -41570 -5993 6779 22405
16893 22405 5257 -25181 -21847 -11787 -22814 -13615 7467 17217 1520 -42914 -36723 -5169
16881 -5169 16868 15629 9480 -12467 6067 18376 10011 27250 30019 8330 5983 13057 40732
16868 40732 19036 -15236 -29216 -39425 -41144 -20268 2158 -6512 -41110 -82635 -72561 -45324
16856 -45324 -17203 16942 16728 7614 -5889 -26877 -38989 -42102 -52174 -53193 -5942 20822 -1877
16843 -1877 -11428 -16501 -28033 -39071 -18357 -9727 -23507 -21254 -27337 6392 26425 -9565 -32732
16830 -32732 -14931 -8620 -17229 -25987 -40540 -67389 -66149 -71386 -59462 -42023 -27520 -6744 -19863
16817a9863J9120J5484j0011k1425n279l528o072J1826K891R314J251L158q332
16804a1466j8783K109Q586k0328K84N107n28J1576J7425m266k4027m537J9551
16791a9297N755J4037j2870k9903k1123k676K5949R618j6586k443R165J7075J6120
16778g179q264m0734j1980J0458R01J2254J6185j890j1185K1375J7651k716r092
16765a4216j1082r45j2271J4450K0042J0743k3264j2156J6397K1384J6076k8395
16753c237N932r807l6446O204J835K6031J2541k1427l1113J1874K4914J5015j2202
16740i886k5687k203K6513J7196m9858l5467K3347J9878o419n07p12k1688J556
16727f3937P687L7734R110j0848r520K663Ql494N223N517K4252o767j5389j0162
$$ plain form
16817 -19863 -743 14741 4730 -16695 -21974 -25502 -31574 -19748 -16857 -7543 -6292 -3134 -11466
16804 -11466 -30249 -28140 -19554 -39882 -39598 -34491 -35019 -23443 -6018 -10284 -34311 -38848 -19297
16791 -19297 -13542 495 -12375 -42278 -63401 -66077 -40128 -30510 -47096 -49539 -40374 -23299 -7179
16778 -7179 -15443 -56177 -68157 -57699 -56798 -44544 -28359 -30249 -41434 -20059 -2408 -5124 -14216
16765 -14216 -25298 -26243 -38514 -24064 -4022 6721 -16543 -28699 -12302 9082 25158 -3237
16753 -3237 2695 -7112 -43558 -37354 -35519 -9488 3053 -18374 -49487 -37613 -12699 2316 -9886
16740 -9886 -35573 -37776 -11263 5933 -43925 -79392 -56045 -36167 -42586 -43093 -43805 -65493 -63937
16727 -63937 -56250 -18516 -9406 -20254 -29774 -27111 -27103 -30597 -25374 -19857 4395 -2372 -17761 -27923
16713b7923M055J9162j1973j0945j8993k9341L2762J8533o767R015k2525j7854
16701f2794M777K1048J5564J1754r42k6508r398M221J4570n422o088k31Q455J5853
16687a5141K2294M714l4455j2803j8381p278J8103J3196N450K0163P096o195Q699
16674E462Q295k989r443j8812k4086j9875L1267R653l582N862J962M597j2779
16661b4468k7946J863P739J2615Q610q554R830R755k6568j6257J2529O020J2089
16648b2743l197O667j6867L49Q772o520j4810L854L391K0976l624k2263j7531
16635f3546q400J9507J0951K0622M20j6998l5281K6227K6746J940j8253Q323k959
16622c0701m187J1812N565L501j6854o293L220K3711L392q863k1920j5658J1019
$$ plain form
16713 -27923 -23868 -4706 -16679 -27624 -46617 -75958 -43196 -24663 -31430 -22415 -44940 -62794
16701 -62794 -58017 -36969 -21405 -9651 -10593 -37101 -46499 -42278 -27708 -33130 -39218 -39449 -30994 -15141
16687 -15141 7153 11867 -22588 -35391 -53772 -61050 -42947 -29751 -24301 -4138 2958 -3237 5462
16674 5462 13757 10768 1325 -17487 -41573 -61448 -30181 -20528 -24110 -18248 -16286 -11689 -24468
16661 -24468 -52414 -50551 -42812 -30197 -21587 -30141 -20311 -10556 -37124 -53381 -40852 -34832 -22743
16648 -22743 -25940 -19273 -36140 -35791 -27019 -33539 -48349 -44495 -41104 -20128 -23752 -46015 -63546
16635 -63546 -71946 -52439 -41488 -20866 -20446 -37444 -72725 -46498 -19752 -17812 -36065 -27742 -30701
16622 -30701 -34888 -23076 -17511 -14010 -30864 -37157 -33937 -10226 -6834 -15697 -37617 -53275 -42256
16609d2256R78J2385K4991N273k3524j8596J7911j3665l6290N172L3426K7313
16597f882j170j9411r567m067M46l0188J7712J3798m630L2985J1743j0959o260
16584a6450r091n267p165J3059K2325n058q416M69j5543J5541Q381J4894J4928
16571B2607l751j6680k6481l0799m437K2590J5251K6397O37q166p058J5221k53
16558E078j4315p666k0222j0023r605K2331M1529J2707j0400k3796j7213m903
16546c6498J2345J053M793j2749K4729K8845l1378m1163J1534L7771j4736j8185
16534c3639J3112J5223Q806J4552k1760j7824K1779N171Q842j9587m4278n118
16522e4721Q584J5397K351j9243r347m81j3153J517K9592Q160K5769J5604q494
$$ plain form
16609 -42256 -41278 -28893 -3902 1371 -22153 -40749 -22838 -36503 -72793 -67621 -34195 -6882
16597 -6882 -8052 -27463 -37030 -41097 -40651 -70839 -53127 -39329 -43959 -10974 769 -10190 -16450
16584 -16450 -25541 -30808 -37973 -24914 -2589 -7647 -16063 -15594 -31137 -15596 -7215 7679 22607
16571 22607 18856 2176 -24305 -55104 -59541 -36951 -21700 4697 5334 -2832 -9890 5331 5078
16558 5078 -9237 -16903 -37125 -47148 -56753 -34422 7107 19814 9414 -14382 -31595 -36498
16546 -36498 -24153 -23100 -18307 -31056 -6327 22518 -8860 -50023 -38489 -718 -15454 -33639
16534 -33639 -20527 -5304 3502 18054 -3706 -21530 249 5420 14262 -5325 -49603 -54721
16522 -54721 -46137 -30740 -28389 -47632 -56979 -57460 -70613 -69096 -39504 -31344 -5575 10029 1535
16509A535j8136k0787j3504R604N311J2144O120J7337K2432r202l4902j8025j2215
16496e2288L3135K9360k0138k9193J4359K5042j4914j5312O013J5227k701K185
16484i225j0229R83Q935l27j2004N352j6739k579N59M09k4299j2678P947j424
16470f5319K499L3374K2749j0834k5428k5757J6212M2870O351j4342p137Q264
16458a6498K7598L47p486Q820n010k4379p657K8514J2172j9302j4293R65Q902
16445g307K626p461k2956P252J2345K3465N515k3700j0629K4622O731J843K8314
16432D0660O643j9870j8948m201l849Q132o547n085k2475o469O348J6127J7926
16419H392j7322l2154N340J5042j0457K301J4268K868J4133M297l596R827k3467
$$ plain form
16509 1535 -16601 -37388 -50892 -41288 -35977 -23833 -17713 -376 22056 12854 -22048 -40073 -52288
16496 -52288 -19153 10207 -9931 -39124 -24765 277 -14637 -29949 -23936 -8709 -11410 -9225
16484 -9225 -19454 -18471 -9536 -9863 -21867 -16515 -33254 -35833 -35274 -34865 -59164 -71842 -63895 -65319
16470 -65319 -62820 -29446 -6697 -17531 -42959 -68716 -52504 -9634 -3283 -17625 -24762 -16498
16458 -16498 11100 11447 3961 12781 7771 -16608 -24265 4249 16421 -2881 -17174 -16209 -7307
16445 -7307 -4681 -12142 -35098 -27846 -15501 7964 13479 -10221 -20850 3772 10503 12346 40660
16432 40660 47303 27433 8485 4284 435 8567 2020 -3065 -25540 -32009 -25661 -9534 8392
16419 8392 -8930 -41084 -35744 -20702 -31159 -28858 -14590 -11722 2411 6708 3112 12939 -10528
16406a0528j0254R742J5540j8790J4057k0519J72K7346J3247j1724k0794R660
16394b845k0058q528m924k410l38R530j5139J6556J9996J5396L1217j0723j4675
16381A3055k3287j2605l42N94L780K7904J0828k2582l4768k6632R835J9917k629
16368c6932m587j4318L227K8430M376M76J6823N369l0047l007J4589J7200J8064
16355A9663J6372k5343o536k695k1906q3j5194p868k2159K9869l667J3854Q440
16342a7253J6263k69r57q515O133K2418p003j7135N002K905m035P119J4799J9317
16328C8789j3239l8010l0633Q564P333n808j3536K339K8442l821J7051J3390K8434
16315C9295l9733l2035N92n947Q571J2999j2934r565n484M617k453J9391Q294
$$ plain form
16406 -10528 -20782 -11040 4500 -14290 -233 -20752 -20580 6766 20013 8289 -12505 -2845
16394 -2845 -22903 -31431 -36355 -38765 -39103 -29573 -44712 -28156 -8160 7236 38453 27730 13055
16381 13055 -10232 -22837 -23179 -22585 -18805 9099 19927 -2655 -37423 -64055 -54220 -34303 -36932
16368 -36932 -41519 -55837 -52610 -24180 -19804 -19328 -2505 2864 -27183 -30190 -15601 1599 19663
16355 19663 36035 10692 4156 1461 -20445 -20528 -35722 -43590 -65749 -35880 -39547 -25693 -17253
16342 -17253 -990 -1259 -2216 -10731 -4598 17820 10817 -6318 -1316 1589 -2446 4673 19472 38789
16328 38789 25550 -12460 -43093 -34529 -27196 -33004 -46540 -44201 -15759 -19580 -2529 10861 39295
16315 39295 -438 -32473 -31881 -37828 -29257 -16258 -29192 -38757 -44241 -39624 -42077 -22686 -14392
16302a4392j3831k383J5494j0241k0292j9205R453K2085P935j2270Q975J7903
16290a0769q339n884j3871J5742J3628J8541k340k2470j8762o309J6259m444J6654
16277a2364jR470R388j0940p597L3854J0397k5675r946j5268j6827j4221J276
16264d8454J0116R63N807J723J4890J6086M762N514j281j3667k4293L820M141
16251a9873J5318J3880J5329j6775n4174j7245P898j8434Q216K5987P764L938
16239b8171j3980J1218K6790J3078j8772k7216K478R152K6497K0010Q943k8531
16227A496m5778J9937K6659J0310O656Q906m246j3157l2669m439L1869J435P210
16214A4189j4730n471r925j8290K2765K9200j6992j3886k555J7270J5135m284
$$ plain form
16302 -14392 -28223 -30606 -15112 -25353 -45645 -64850 -55397 -33312 -25377 -37647 -28672 -10769
16290 -10769 -19108 -24992 -38863 -23121 -9493 9048 6708 -15762 -34524 -40833 -24574 -29018 -12364
16277 -12364 -12365 -2895 6493 -4447 -12044 21810 32207 6532 -3414 -18682 -35509 -49730 -48454
16264 -48454 -38338 -37375 -31568 -29845 -14955 1131 5893 11407 10126 -3541 -27834 -24014 -19873
16251 -19873 -4555 9325 24654 7879 -46295 -63540 -55642 -74076 -65860 -39873 -32109 -28171
16239 -28171 -42151 -30933 -4143 8935 -9837 -37053 -34575 -25423 1074 21084 30027 1496
16227 1496 -44282 -24345 2314 12624 19280 28186 23940 10783 -21886 -26325 5544 6979 14189
16214 14189 -541 -6012 -15937 -34227 -11462 17738 746 -13140 -15695 1575 16710 12426
16202A2426L340l2232j1715J0760J0349k8752k0022K461M109L9902J245J8683
16190A0554k397k2490j3528j5483n870J4233l844o17K504j7520N683K6011J5397
16177g367j1968n446P770k2483j4272j5473j267J5580J1046K7490J3624K0898
16165A8132r778p256k6670k5987n566J9149J2267m673p19K8453L1328o199l6060
16152a3579k3248r241J2392J0246p824j8566q012p861L0814R385k2745M517l489
16139d7211j3219O775l693p043J3704J3556J0614L294L0588q222r182k425l942
16126a6406k3485K7967J0121J813o852P609p667j8329J1359O834J3863J4391q514
16113A2704j3854J965k1777j9346N179K1949J6737r902j282M065J6971J0569J8525
$$ plain form
16202 12426 15766 -16466 -28181 -17421 -7072 -35824 -55846 -53385 -49276 -9374 -8129 10554
16190 10554 8157 -14333 -27861 -43344 -49214 -34981 -38825 -39442 -36938 -54458 -48775 -22764 -7367
16177 -7367 -19335 -24781 -17011 -39494 -53766 -69239 -70506 -54926 -43880 -16390 -2766 18132
16165 18132 8354 1098 -25572 -51559 -57125 -37976 -25709 -30382 -31101 -2648 28680 22481 -13579
16152 -13579 -36827 -46068 -33676 -23430 -31254 -49820 -57832 -65693 -34879 -25494 -48239 -43722 -47211
16139 -47211 -60430 -53655 -57348 -64391 -50687 -37131 -26517 -23223 7365 -857 -10039 -12464 -16406
16126 -16406 -39891 -11924 -1803 10 -6842 767 -6900 -25229 -13870 -7036 6827 21218 12704
16113 12704 -1150 815 -20962 -40308 -35129 -13180 3557 -6345 -7627 -3562 13409 23978 42503
16100D2503j0832k4652j1533M86J0106j6014K1543n826k0805m857L6063N995j7151
16087E026j96j3199J1639Q723j3098p851J8296K3632q154j2848o981J1046J7799
16074C3834J0664k256k9662k9136n858L3645L970Q726J6629l2846p828P028p599
16061f89J87j5525Q061k313L792K5542k6745k9944K1564M195O05j5716K4609M447
16047B070N156J7108J0999l1080l941L3330J2938j1068k0187r404l7621K0677
16035a1023J8149L312k2292R07P348J3420J3505k1931j2339O604R795N380J8367
16022B9202j8905l0826J8547O571j023j4100k9871k3367J0552K0412O946J4102
16010a1760K2130J5068M946l732k8884K06J7252Q782J5994r44j7880l0313j7820
$$ plain form
16100 42503 31671 7019 -4514 -4028 6078 -9936 11607 5781 -15024 -19881 16182 22177 5026
16087 5026 4830 -8369 3270 11993 -1105 -8956 9340 32972 24818 11970 4989 16035 33834
16074 33834 44498 42242 12580 -16556 -22414 11231 15201 23927 40556 7710 -118 6910 -689
16061 -689 -502 -16027 -7966 -10279 -6487 19055 -7690 -37634 -16070 -11875 -11270 -26986 -2377 2070
16047 2070 7226 24334 35333 4253 312 33642 46580 35512 15325 5921 -31700 -11023
16035 -11023 7126 10438 -11854 -10947 -3599 9821 23326 1395 -10944 -4340 5455 10835 29202
16022 29202 10297 -20529 -1982 4589 3566 -10534 -40405 -63772 -53220 -32808 -25862 -11760
16010 -11760 10370 25438 30384 26652 -2232 -2026 15226 24008 40002 39058 21178 -9135 -26955
15997b6955o462J259j1972K6629K6599l327j4550j0354O06J7941J0202O646p121
15984I141J5642m603j8822J5746J8031m526O410j0507k434j2088j3563n7j2767
15971a4397J2149p011O679k0802k154J919M0130J3143k1531j6768j8571J5380
15959a1834J5824j3686M446j5274j4825J4693M423n632j6087n095N261J6603K4636
15946C453J9376q690o755r122l665K095R495R094l7925J234K734j2486l591K8770
15932e983Q762j2362O514J2433j2486K173L301J7048j1666k8327j1372K4985K6110
15919A9130j5303l0333k6906q901K3158J6575j9345j7731J491J4842j1408J7911
15907c6820J0566L181J3008J9314j4843j6391K3563K693k8386P514j061n129r89
$$ plain form
15997 -26955 -33417 -32158 -44130 -17501 9098 5771 -8779 -19133 -18527 -586 9616 16262 9141
15984 9141 24783 20180 1358 17104 35135 30609 37019 26512 24078 11990 -1573 -1630 -14397
15971 -14397 -2248 -9259 -2580 -23382 -25536 -23617 16513 29656 8125 -8643 -27214 -11834
15959 -11834 3990 -9696 -5250 -20524 -35349 -20656 -16233 -21865 -37952 -43047 -37786 -21183 3453
15946 3453 22829 14139 7384 -1738 -5403 -3308 6187 15281 -22644 -21410 -18676 -31162 -34753 -5983
15932 -5983 2779 -9583 -3069 9364 -3122 -949 2352 19400 7734 -20593 -31965 -6980 19130
15919 19130 3827 -26506 -53412 -62313 -39155 -22580 -41925 -59656 -58165 -43323 -54731 -36820
15907 -36820 -26254 -23073 -10065 9249 -5594 -21985 1578 4271 -24115 -16601 -17662 -22791 -23780
15894b3780P650L760J5570K9427K2068k5094k3744R577k1871j7214m443o728O464
15881b8358M897j6188n847J6191K945K8324q507l360r548o410K153J0090M430
15868i188r389J5989O582r109j1352j0174L452k1653J2511l383j1415n91J6350
15855c1370L2729L2308r201k3920J9747m117k6344j0379L1544j9167P481k2239
15843b2928m210m412R038J0948L573J7945l416k1167j04O971R537Q742m015J1545
15829A8047L5616j3666n0280J67k222k661K3365K8189J4142k1882m6354O125J9517
15816H103J956o422j2857p753l742J0882J9782K7016o641o253m6347q897L5640
15803D467L3198J6783J8722l6955l3404M12q464Q268J9266J3016j2647j3849r030
$$ plain form
15894 -23780 -16130 -12370 3200 32627 54695 29601 5857 15434 -6437 -23651 -28094 -34822 -28358
15881 -28358 -23461 -39649 -45496 -29305 -26360 1964 -6543 -9903 -19451 -25861 -23708 -13618 -9188
15868 -9188 -18577 -2588 3994 -5115 -16467 -26641 -23189 -44842 -32331 -35714 -47129 -47720 -31370
15855 -31370 1359 33667 24466 546 20293 16176 -10168 -20547 10997 -8170 -689 -22928
15843 -22928 -27138 -31550 -22512 -11564 -7991 9954 6538 -14629 -14733 -7762 1775 10517 6502 18047
15829 18047 53663 39997 -10283 -10116 -12338 -14999 8366 36555 50697 28815 -17539 -11414 8103
15816 8103 10059 3637 -9220 -16973 -20715 -9833 9949 36965 30324 24071 -22276 -31173 4467
15803 4467 37665 54448 73170 36215 2811 3223 -5241 3027 22293 35309 22662 8813 -217
15790b17J0905j1055o284L4330k148k5596k8959j8319J6003K0542J0009J2908
15778A2119j3203M895m327R744N852O226j193l8943j6052N770O967o850N614J3621
15764i760Q079p706J5681L9828p060l4731k3938j3752J8503K2195Q684J3376l574
15751B5825j0452j4664J5612l066L669J7892K5627q126m3932j4430n032j2338
15739b3415j253J1586J7166J4495j8899m887J3385K460J345J6902l591M212L734
15726C3240l099J2550j0748J6923k808k1562j6626K678K5318K0272p077r351o782
15713C2928M737j7451k4485M790L764J6146l767p645r415o236K2687K7759J9709
15700F3521J1908l2249n249l0609K1264l962m8519q217K8245K9282j0296j0800
$$ plain form
15790 -217 10688 -367 -6651 27679 25531 -65 -29024 -47343 -31340 -10798 -789 12119
15778 12119 -1084 3811 -516 9228 15080 21306 20113 -18830 -34882 -29112 -22145 -28995 -23381 -9760
15764 -9760 -1681 -9387 6294 46122 39062 4331 -19607 -33359 -14856 7339 16023 29399 25825
15751 25825 15373 709 16321 13255 16924 34816 60443 52317 8385 -6045 -11077 -23415
15739 -23415 -24668 -13082 4084 18579 -320 -5207 8178 10638 11983 28885 25294 29506 33240
15726 33240 30141 42691 31943 48866 46058 24496 7870 10548 35866 56138 49061 39710 32928
15713 32928 37665 20214 -4271 519 4283 20429 16662 9017 -398 -6634 16053 43812 63521
15700 63521 75429 43180 37931 7322 28586 24624 -23895 -32112 -3867 25415 15119 4319
15688D319R619j5755q50M484p684J0948n989O983O313j7187K203o672p959k0557
15674c7784j1055J0139J5502K3622J5244j3415o539J9792J219m3292l3313K0069
15662c9811J9748J8449K3841L882k5745j96r838k0086r230K4854J7008R620J3254
15649B5750P978L795j983k8712m247N658j920r532j4789K1736j9210J42J6224
15636H90K0312k410j8801K820n146j4451j9477L480J7436o690p404O15L450N83
15622b4793J5479j2523k6308J427K0459K3830J2246n341K934L9726k204o309j8833
15609A9790J240r124r56P500j8083J9938K1305l637o373k5072n664j74K8805M392
15595C3887l717J9370j75j8414r803l1207j4039j0982K2828L862j6933l832K599
$$ plain form
15688 4319 13938 -1817 -2667 1817 -5867 5081 -908 6075 12388 -4799 -2596 -9268 -17227 -37784
15674 -37784 -48839 -38700 -23198 424 15668 2253 -4286 15506 16725 -26567 -59880 -39811
15662 -39811 -20063 -1614 22227 26109 364 168 -9670 -29756 -38986 -14132 2876 12496 25750
15649 25750 33728 37523 35540 6828 2581 8239 6319 -3213 -18002 3734 -15476 -15334 890
15636 890 21202 18792 -9 2811 -2335 -16786 -36263 -32783 -15347 -22037 -29441 -28826 -25376 -24793
15622 -24793 -9314 -21837 -48145 -46718 -26259 -2429 9817 4476 7410 47136 44932 38623 19790
15609 19790 21030 11906 10950 18450 367 20305 41610 37973 31600 6528 864 690 29495 33887
15595 33887 30170 49540 49365 30951 21148 -10059 -24098 -35080 -12252 -8390 -25323 -29155 -26556
15582b6556q033M0759N581k5376K1001j977j5289J9845K1994M427J0538l2144
15570A4770l6167j688J4554L965o671m825l270m179N913N136Q982J9842K0328
15557C6690j8828j9502j8986l763r038N759j7666J5314K4313P082O159r059j7579
15544a9104k8744J621Q346J6496N860n824n20J1777n273j8303O800J3911O910
15531f047q537j1696N448K0308K180r78O467N084J2215R500j345l3470N644q032
15517c259K1298K4636N851j4472l7000j3918n36K759K8201J073l212k3616l0758
15504d2953j0484K8907J6341k2578l4148l316J2389K0760J309K5714K9989q106
15492A3824m21m3731l6094l4689K9741K6847J263o423l1796J7124K1599q498j5221
$$ plain form
15582 -26556 -34589 6170 11751 -13625 7376 5399 -9890 9955 31949 36376 46914 14770
15570 14770 -21397 -23085 -8531 -4566 -11237 -16062 -19332 -23511 -17598 -12462 -3480 16362 36690
15557 36690 17862 -1640 -20626 -24389 -33427 -27668 -45334 -30020 -5707 1375 7534 -1525 -19104
15544 -19104 -47848 -46227 -37881 -21385 -15525 -21349 -21869 -10092 -15365 -33668 -26868 -12957 -6047
15531 -6047 -14584 -26280 -20832 -524 1656 678 7145 12229 24444 33944 32599 -871 4773 -3259
15517 -3259 18039 42675 48526 34054 -2946 -16864 -17400 -14641 13560 14633 11421 -12195 -42953
15504 -42953 -53437 -24530 -8189 -30767 -64915 -68231 -55842 -35082 -33773 -8059 21930 13824
15492 13824 13403 -30328 -66422 -101111 -71370 -44523 -43260 -49683 -81479 -64355 -42756 -51254 -66475
15479f6475j6604J2975J3961J2021K5185K3411P609j3587j6562j0600J5639o79
15467a3706k2458J6612L859k0113K3654O601p037K4050J6295j2051j3628J1720
15455A3798K8113k481l512l4235j4400q144q913J0172J3002R572j6790k400R446
15442f772J3749m186J3847N854o639r784j3963M249r77n06K2561J83N915J0233
15428C3764J5538k0906m034j6082L446o840j7235q685r752j4765J9023J6899m102
15415a3731P260M6173j8337j1475j3569l248n443q931J1838K4418p330q659j399
15402b433R397O804r692J5666M479k818p358j8486M329j7975R3J3950K6635J6778
15388C9369m535k0003k6778J1121J7225k3015j4662l1302K3427J1337p803j7328
$$ plain form
15479 -66475 -83079 -70104 -56143 -44122 -18937 4474 12083 -1504 -18066 -28666 -13027 -13706
15467 -13706 -36164 -19552 -15693 -35806 -12152 -5551 -12588 11462 27757 15706 2078 13798
15455 13798 41911 39430 35918 1683 -12717 -20861 -29774 -19602 -6600 2972 -13818 -16218 -6772
15442 -6772 6977 2791 16638 22492 15853 6069 -7894 -3645 -4622 -5128 17433 17616 23531 33764
15428 33764 49302 28396 24362 8280 11726 4886 -12349 -21034 -30786 -45551 -26528 -9629 -13731
15415 -13731 -6471 39702 21365 9890 -3679 -6927 -12370 -21301 -9463 14955 7625 -1034 -2433
15402 -2433 6964 13768 4076 19742 24221 21403 14045 -4441 -112 -18087 -17994 -4044 22591 39369
15388 39369 34834 14831 -11947 -826 16399 -6616 -21278 -52580 -29153 -17816 -25619 -42947
15376d2947j3662J5016L3925k531J1425K2248K1989l634j9382m57k5122j0733
15364a3865J2908J9907P154j2446j1136j6589K883J9353J9644j559J3527J6668
15352E6449k1626l0813j4306Q146k144L5814n052j4356P218k2255k5684o449n843
15339d0901K3153N337o071j0076j2276N353K9120J499K6795K3526j8927q674j1019
15326F839K3428J1918o725k9110n930j0277R280J3462l8630L521J7480j1095k0634
15313c6473j5061l155P456J8135J319J8619J3244j1764J1744k0613j4024j6736
15301d7309j8372j6408J4817K5315q718J4450L4960L8342O051k9120l9084m8370
15289g3446Q687L0734R831m324j0705k2118p666J3790L0110j958j5760L2283L3973
$$ plain form
15376 -42947 -56609 -41593 -7668 -10199 1226 23474 45463 41829 22447 21990 -3132 -13865
15364 -13865 -957 18950 26104 13658 2522 -14067 -11184 8169 27813 26254 39781 56449
15352 56449 34823 4010 -10296 -2150 -4294 31520 26468 12112 19330 -2925 -28609 -35058 -40901
15339 -40901 -17748 -12411 -18482 -28558 -40834 -35481 -6361 -4862 21933 45459 26532 17858 6839
15326 6839 30267 42185 35460 6350 420 -9857 -577 12885 -25745 -22224 -4744 -15839 -36473
15313 -36473 -51534 -54689 -47233 -29098 -27779 -9160 4084 -7680 4064 -16549 -30573 -47309
15301 -47309 -65681 -82089 -67272 -41957 -50675 -36225 -1265 37077 43128 14008 -25076 -73446
15289 -73446 -64759 -34025 -24194 -28518 -39223 -61341 -69007 -55217 -25107 -27065 -42825 -10542 23431
15276B3431p022l1023m877K1605K4049k6337O952J8105l2278j6658j3918j740
15264c9711J9472K9659m188k3538j9374M200p908n707M817J4949K1113L1821Q515
15251C4120K877J944k8841k9054K4824M879k3121o938J2131M263n609j2958K4006
15238B523l3592r646J1823K0652J0086k0130j5983m057l543j9369Q246J5035R330
15225b8625K864J4819j3359j6556J2760K4923J2388k1077m0094L173J0736M767
15213c3281K2541K4294j252j5358J9290N796m6318k9718J9778K7826K7285j1568
15201I315j0663J4986j1053j1372j2512m938J4128j690J0222o664j2326o650J4725
15188a4492J2101j4457j057K7809P377j5837o540R303R186j9445j8789J0741K3168
$$ plain form
15276 23431 16409 -14614 -19491 2114 26163 -174 6778 24883 -7395 -24053 -37971 -39711
15264 -39711 -20239 9420 5232 -18306 -37680 -33480 -41388 -47095 -42278 -27329 -6216 25605 34120
15251 34120 36997 38941 10100 -18954 5870 10749 -12372 -19310 -7179 -2916 -8525 -21483 2523
15238 2523 -31069 -40715 -28892 -8240 1846 -18284 -34267 -38324 -41867 -61236 -52990 -37955 -28625
15225 -28625 -25761 -10942 -24301 -40857 -28097 -3174 9214 -11863 -51957 -48784 -38048 -33281
15213 -33281 -10740 13554 12302 -3056 16234 22030 -24288 -54006 -34228 -6402 20883 9315
15201 9315 -1348 13638 2585 -8787 -21299 -26237 -12109 -13799 -3577 -10241 -22567 -29217 -14492
15188 -14492 -2391 -16848 -17905 9904 17281 1444 -5096 4207 13393 -6052 -24841 -14100 9068
15175I068O990O912K150j4131J2842m895N441k871J595J9839k0638l6316l702
15162a7716P673k2130M263J1805J4103l432o167k7986k6959J6109K9742K1182
15150D87R675l362j5288j8988k245M0065N445l903j8022J4044j2242q648K3653
15137A0671K0274k0179k0400k9538O744J2222n645N616n895j2830m231j751j7855
15124f2797P760J3662R105R174o822J560j191O791N505j0011R945Q613k1425j1823
15110d1954L0327K2257O897p083m045L044J9408J2808k5251k0838p087L225O822
15097a470K6610M099j2670j1898J8802n981j6975j6644K3337n77j6656p264K3113
15084E826L00J6716J4920R228k5722j4641K447j8011j8078K4252R922N823K5734
$$ plain form
15175 9068 16058 22970 25120 10989 23831 18936 24377 21506 23101 42940 22302 -14014 -17716
15162 -17716 -10043 -32173 -27910 -16105 -2002 -5434 -11601 -39587 -66546 -50437 -20695 487
15150 487 10162 6800 -8488 -27476 -29721 10344 15789 11886 -6136 7908 -4334 -12982 10671
15137 10671 30945 10766 -9634 -39172 -32428 -20206 -25851 -20235 -26130 -38960 -43191 -44942 -62797
15124 -62797 -55037 -41375 -32270 -23096 -29918 -28358 -29549 -22758 -17253 -27264 -17319 -8706 -30131 -41954
15110 -41954 -11627 10630 17527 10444 6399 9443 28851 41659 16408 -4430 -11517 -8292 -1470
15097 -1470 25140 29239 16569 4671 23473 17492 517 -16127 7210 6633 -10023 -17287 5826
15084 5826 6126 22842 37762 46990 21268 6627 9074 -8937 -27015 -2763 7159 12982 38716
15071C8716J4597j5694J8778k3534k1089j2706P219j1658O029q053m315k646j5626
15058b9982r606N458K9015L0263J6812J8346o548j9077j3011k0075K0697k2533
15046b41l2639j2969j0231K2184n344R492J8419l222K7777K610m455J9475J7022
15033D7878k9903m476k3596q576K5147J8677q133J7559J9721o801J0180p311j5959
15020C4407l001M622K0348Q048k3502j9939p370m1146k695J3957R386j2448J2419
15007f914L1023j5202Q101J8168j3022L9142M8027L4352k2737m1725k9033j312
14995D8868P474r985l424j2377j0068l708K1380O697j4166j4956M527R465J9767
14982D9494J2709j7003M830J6812k4803j8720j4558K4675L1585o619l1447j0104
$$ plain form
15071 38716 53313 37619 56397 32863 11774 -932 6287 -5371 658 -7395 -11710 -14356 -29982
15058 -29982 -39588 -34130 -5115 25148 41960 60306 53758 34681 21670 1595 22292 -241
15046 -241 -32880 -45849 -56080 -33896 -39240 -29748 -11329 -14551 13226 15836 11381 30856 47878
15033 47878 17975 13499 -10097 -18673 6474 25151 17018 34577 54298 47497 57677 50366 34407
15020 34407 31406 36028 56376 64424 40922 20983 13613 -27533 -30228 -16271 -6885 -19333 -6914
15007 -6914 24109 8907 17008 35176 22154 61296 109323 143675 120938 79213 50180 48868
14995 48868 56342 46357 42933 30556 20488 16780 38160 44857 30691 15735 20262 29727 49494
14982 49494 62203 45200 50030 66842 42039 23319 8761 33436 65021 58402 26955 16851
14970A6851J2849J0832j2277p805o012j435N326K5396k494k7876m178k1398M963
14957g258J6340n287k629j1578N756O176P670p637k299J5258k4497M441K1079
14944A5535l3546J14L3275j2364q017l710q054k2083J6542K2175m2407L133J4118
14931b5289J1189N2081o734k1623k8150p0L0426R337r466R743L222M818P930J4093
14917E1507R418k659j8757k6750k2984J2672L496j7409j2183j0768k0552K20J6234
14904c8515K6615k778k6193K1091o36K3576r072k7047J5511J6540j8172m406J3477
14891a0009J6083q593N337o408k3474O586M247Q655N292o592l4189o124j5791
14878f4980J3405K7292J4719p121k488K881J373p372n137l370J6778j944j7948
$$ plain form
14970 16851 29700 40532 28255 20450 14438 13003 18329 43725 41231 13355 9177 -12221 -7258
14957 -7258 9082 3795 1166 -10412 -4656 1520 9190 1553 -746 14512 -9985 -5544 15535
14944 15535 -18011 -17897 15378 3014 -5003 -8713 -16767 -38850 -22308 -133 -42540 -39407 -25289
14931 -25289 -14100 37981 31247 9624 -18526 -18596 11830 21167 11701 21444 24666 29484 37414 51507
14917 51507 60925 58266 39509 12759 -10225 2447 5943 -11466 -23649 -34417 -54969 -54749 -38515
14904 -38515 -11900 -14678 -40871 -19780 -20416 3160 -5912 -32959 -17448 -908 -19080 -23486 -10009
14891 -10009 6074 -2519 2818 -3590 -27064 -20478 -16231 -7576 -2284 -8876 -43065 -49189 -64980
14878 -64980 -51575 -24283 -9564 -16685 -19173 -16292 -14919 -22291 -27428 -30798 -14020 -15964 -33912
14865c3912M0934J7750j8625J6906J1891O031k412k0033K326J5833k280m0492
14853f083j9294M361J035K7212L9049k2438k9732k2355q615R410J1311k625j173
14840a9937K4156J3722o389J280j5563k2464j1203K3379L0693K959P789k994K9279
14827E4707j9986k0615j3816j6655K3964J3989j348M158q571j4248O780j4967
14815f608n54M0876Q033k2528M906o933k1013L61r570j0071J122J6088J5325K0671
14801C0105o412M51p477k9280K1297J4082j8278J3632j6723J1901n703p872l5699
14788c5976j5785O150K1810L054N121j5013J0696M470J4489r156R121K9646j4414
14775A4213m1689k2303j0962k3803K6577K8181J3097O184j3584j0345K404K2782
$$ plain form
14865 -33912 7022 24772 6147 23053 34944 40975 38563 18530 20856 36689 34409 -6083
14853 -6083 -25377 -21016 -19981 7231 46280 23842 -5890 -28245 -36860 -27450 -16139 -18764 -19937
14840 -19937 4219 17941 11552 12832 -2731 -25195 -36398 -13019 17674 20633 28422 25428 54707
14827 54707 34721 14106 290 -16365 7599 21588 20240 24398 15827 1579 8359 -6608
14815 -6608 -7162 33714 41747 19219 24125 17192 -3821 -3460 -13030 -23101 -21979 -5891 9434 30105
14801 30105 23693 24144 16667 -12613 8684 22766 4488 18120 1397 13298 7595 -277 -35976
14788 -35976 -51761 -45611 -23801 -20747 -15626 -30639 -19943 -15473 -984 -10140 -1019 28627 14213
14775 14213 -27476 -49779 -60741 -84544 -57967 -29786 -16689 -10505 -24089 -34434 -32030 -9248
14763i248k1598K4759J9674j4307j7639J6218J4788L676r533J510R806P479r807
14750A5778k8078N853L0903P813K487J2621N263k4448k233Q276L662j1644k2671
14737C582J9321p504q801J598j2639K25l3487k9905P951L9675L6736J21p364R205
14723A8714j2299Q280j2833j7982K6116K3140j456N570n924l1521k467K966k952
14710b648J9326K2241K6559l2205k2752k7084q783k0911R596K9368K5325j6032
14698B000j6008r321l34K4451L1663L4056P823j8093K4206j1551m5177k6409J0606
14685G912J9230K691O002L866J2086L35j0305o670o532j0278L439p662K2690j1405
14671B5399l0602K6593J1850j1262K9474Q873J0281O650k0470n98k4843R670j256
$$ plain form
14763 -9248 -30846 -6087 13587 -720 -18359 -2141 12647 16323 6790 8300 18106 25585 15778
14750 15778 -12300 -6447 24456 32269 34756 47377 52640 28192 25959 34235 37897 26253 3582
14737 3582 22903 15399 6598 8196 -4443 -4218 -37705 -67610 -59659 -19984 16752 16873 9509 18714
14723 18714 6415 14695 1862 -16120 9996 33136 31680 37250 31326 -195 -2662 304 -2648
14710 -2648 16678 38919 65478 33273 10521 -16563 -25346 -46257 -36661 -7293 18032 2000
14698 2000 -14008 -23329 -23663 788 32451 66507 74330 56237 80443 68892 23715 -2694 7912
14685 7912 27142 29833 35835 39701 51787 52122 41817 35147 28615 18337 21776 14114 36804 25399
14671 25399 -5203 21390 33240 21978 51452 60325 70606 77256 56786 56188 31345 41015 39759
14658C9759J0895q308J248R212k9249l249J4791P289l648k1094J4309P717l0554
14645I118j7189K3193J6809J7950l131n095L042R009n526k3091k3538j936L752
14632C367J5230K368j0057K1838J4379k9989j4248J8442L9013j322K1219O209
14620H6449j8581k6405j4516J0583l401l0051J2105K0404n846M609k0209j8610
14608c469o79l4O766R742N901K6177l333j2853p32M145j1413R917P186J3907p184
14593D4044k1490N786J4861P7j0557l5372R986J0771L005O539P605j4029j6867
14580D359J533K8316K5970J3612j4930l9554o193L1671K2332J7153j2007k6173
14568D6089k8417K0984J6390k5212j0853J4748j8447O787P135l731J9025N317
$$ plain form
14658 39759 50654 42346 43594 52806 23557 20308 35099 42388 38740 17646 31955 39672 9118
14645 9118 -8071 15122 31931 49881 46750 41655 44697 53706 48180 25089 1551 -385 3367
14632 3367 18597 20965 10908 32746 47125 17136 2888 21330 60343 59021 80240 86449
14620 86449 67868 41463 26947 37530 34129 4078 16183 36587 30741 35350 15141 -3469
14608 -3469 -4148 -4182 2584 12326 18227 44404 41071 28218 27486 31631 20218 30135 37321 51228 44044
14593 44044 22554 28340 43201 43278 32721 -2651 7335 18106 21111 27650 35255 21226 4359
14580 4359 5892 34208 60178 73790 58860 19306 13113 44784 67116 84269 72262 46089
14568 46089 17672 38656 55046 29834 18981 33729 15282 22069 29204 25473 44498 49815
14556D9815j2112j1366J2414k2872j7305K5092O335J698k1887K468J309L781J6008
14543C3378j3811Q811o316o77J528M130J2234M882j4909k74o803l433K6249P000
14529E1989J1831J9915k408k1704R575J9243l66k2210l706O677k7969j5263K1855
14516D7459J5205O472j9983j6642p900l195K5838J9943O135R124j0435l7532J443
14503C5932J6368J0437j8021l12J1460R44m188j2380p893m439L9717J3141o014
14490G4752j4619R458J6602m73j5071m270n2262k8887J3177P3578K1215j0996
14478H2204l0284k008p894j2753Q542n771O7R002O369Q060M329j8021l706O706
14464D4842k9032n660J2155k2041J5585K3879J1030q623q167n899j7087k0702
$$ plain form
14556 49815 37703 26337 38751 15879 -1426 23666 30001 31699 9812 12280 13589 17370 33378
14543 33378 19567 28378 22062 21385 22913 27043 39277 44159 29250 28976 22173 18740 44989 51989
14529 51989 63820 83735 81327 59623 69198 88441 88075 65865 62159 68836 40867 25604 47459
14516 47459 62664 69136 49153 32511 24611 21416 47254 67197 73332 82456 72021 34489 35932
14503 35932 52300 62737 44716 44404 55864 56808 52620 40240 32347 27908 67625 80766 74752
14490 74752 60133 69591 86193 85720 70649 66379 14117 -14770 -1593 71985 93200 82204
14478 82204 51920 49912 42018 29265 37807 32036 32103 41105 47474 55534 59863 41842 38136 44842
14464 44842 15810 10150 22305 264 15849 39728 50758 42135 33968 28069 10982 -9720
14452i720J3664L0169K0057P205K5549L245k2767k1560K6553m598K2334J450l2290
14439E9291o638P64k6280L110J7648n429J5841j4726R588o764L165O175Q985J224
14425F5954l361j9154M175R800Q75J4129O920P282J5561j3138l304k5396Q363
14412F8706N337k7241l1339K0684P608J1606j1705l0383O509K7521j3796K0035
14400E3542Q957K0611M0898j0436j9848J5651K3011n453k7082J793K2214N684
14388A29542k5852j9803J6291J8462k249j7105k8859j4273R100M226n527k1791
14376D2162l116L5257J7937k7257J7096O613o738q338L208k6953q299J9377J7355
14363G8304m243k7880J8635J7447r951j7192j9037o507Q414J8843j3409j1519
$$ plain form
14452 -9720 3944 34113 54170 61375 86924 90169 67402 45842 72395 67797 90131 91581 59291
14439 59291 52653 53417 27137 30247 47895 42466 58307 43581 53169 46405 49570 55745 64730 65954
14425 65954 62593 43439 47614 57414 58289 72418 79338 86620 102181 89043 85739 60343 68706
14412 68706 74043 46802 15463 36147 43755 55361 43656 13273 19782 47303 33507 53542
14400 53542 62499 83110 124008 113572 93724 109375 132386 126933 99851 101644 123858 129542
14388 129542 103690 83887 100178 118640 116391 99286 70427 56154 65254 69480 63953 42162
14376 42162 39046 74303 92240 64983 82079 88692 81954 73616 76824 49871 41572 60949 78304
14363 78304 74061 46181 64816 82263 72312 55120 36083 29576 37990 56833 43424 31905
14351C1905j7165J2410K878J1959J0682J1626P787K0202K7962P415j6051j7333
14339I4277n830k2189q476K5428K4340j9409J4808L0889j4546n587k7053n700
14327H0952M158J9683J63R723J3471j9410l495p020j7324M366K2315j2913j4641
14314H0028q284J4649J8497o142j4174k9835n995J7258J7803l4419j7153L8906
14302G1139M3644l380k3514k4770n977K5842J4683l450m715p945K331M520J5061
14289A03469j0738o184P617O559q588k954O272j8912l4366R292J9678O968J1626
14276H9739K6443J0296O996O48j6413n655m842J1317l124j7427j8384J6999j4881
14263H1712N449p339j0741j4329L3711J1137j0566j166j710n409j6686l4151l6936
$$ plain form
14351 31905 14740 27150 30028 41987 52669 64295 72082 92284 120246 127661 111610 94277
14339 94277 88447 66258 57782 83210 107550 88141 102949 133838 119292 113705 86652 80952
14327 80952 85110 104793 104956 114679 128150 108740 105245 98225 80901 85267 107582 94669 80028
14314 80028 71744 86393 104890 98748 84574 54739 48744 66002 83805 49386 32233 71139
14302 71139 114783 111403 87889 63119 57142 82984 97667 94217 89502 81557 83888 88408 103469
14289 103469 92731 86547 94164 100723 92135 89181 95453 76541 42175 51467 71145 78113 89739
14276 89739 116182 126478 133474 134122 117709 112054 107212 118529 115405 97978 79594 96593 81712
14263 81712 87161 79822 69081 54752 88463 99600 89034 87868 86158 80749 64063 29912 -7024
14250g024K5533N2773L8738n935l118k7589M000L0668J5302K1351K8819J3527
14238A87045j3534p827l5106k4844k553J9245l726J959K2117K9193K2466k3772
14226A70663k693j3305k6114q943N2j9005j1185J4874O795j8818K0015p95j4632
14213I6909J23j6532N570K8324K1197M357j587l0377l267L258O088j1537J0109
14200A12635K1993K388M488L001k437j3087k2593K2396l4j326L5156M494r778
14187A57296K268j6471j2731J794J1031j4673m72k4996J8921J2695j3914j0936
14175A09812K015j2089m816J3858Q466J070o249l840n116r774k0876J4162p549
14162G9074K9930J8157J804k2839l5682j2127Q043M759J5729M2075J5874k0695
$$ plain form
14250 -7024 18509 71282 110020 104085 100967 73378 77378 108046 123348 144699 173518 187045
14238 187045 173511 165684 130578 105734 103181 122426 118700 120659 142776 171969 194435 170663
14226 170663 167970 154665 128551 119608 119660 100655 89470 104344 111139 92321 112336 111541 96909
14213 96909 97032 80500 86070 114394 135591 139948 138361 107984 104717 107975 114063 102526 112635
14200 112635 134628 137016 141504 144505 142068 128981 106388 128784 128750 127424 162580 167074 157296
14187 157296 159564 143093 130362 132156 143187 128514 128042 103046 121967 134662 120748 109812
14175 109812 111827 99738 94922 108780 117246 118316 112067 108227 103111 93337 72461 86623 79074
14162 79074 109004 127161 128965 106126 70444 58317 66360 71119 86848 128923 144797 124102
14150A24102p749j1934j7047J9713K3003M861J0435l032j7200k1163j9869K0345
14138A04465J9033K4913L975j97J19r247n4j0570J9N556o107k875m113p925j2630
14123A04362P763K4979j6819p644j2125J4346K0575N48q058L86l393j8402m949
14110A01569Q010J6550J4428O582Q262m321j1331j9134n774M864L515K2700j1721
14097A34199j8825K617p481n818q060J2363J4632l508o687J1796K6057K53k8101
14084A23437K6105Q855k8227K2925L1689j0743j6580j3010q26J6930L6176K2652
14072B19383k2897n1588k0774Q263J5903k1152J7588J8119j1573r834m440o219
14060A30779P281J1047j248L66Q839o769j6037j3513P491j0879o618j0397J3202
$$ plain form
14150 124102 116353 104419 87372 107085 130088 134949 145384 142352 125152 103989 84120 104465
14138 104465 123498 148411 152386 152189 152308 143061 143007 132437 132456 138012 131905 129030 124917 116992 104362
14123 104362 112125 137104 120285 112641 100516 114862 135437 135985 127927 128313 124920 106518 101569
14110 101569 109579 126129 140557 147139 155401 151080 139749 120615 114841 119705 123220 145920 134199
14097 134199 115374 117991 110510 104692 96632 108995 123627 120119 113432 125228 151285 151538 123437
14084 123437 149542 158397 130170 153095 184784 174041 157461 144451 143625 160555 196731 219383
14072 219383 196486 144898 124124 132387 148290 127138 144726 162845 151272 141438 136998 130779
14060 130779 138060 149107 147859 148225 157064 150295 134258 120745 128236 117357 110739 100342 113544
14047A13544l806j5544j1828J5469J2084M348R032J2160J1409J5207j216l2074
14035A28785j1777J3475L381j2795J6936J6275j4025q206j5208M080J3533J0529
14023A44983j2585L580J5845L495N704k9257M278K3261o727n1160O734j947Q343
14010A14547J2335J4668m735m5807k2720J3658M1191R037J8690j4608p229j0332
13998A18695P527L53j5884j4753Q483J5146j6087j1696P817J6964K0009J9156
13986A55730n032k804j5909j1436j598K196K213P043j324k4473j7140j3956J6345
13973H9855M162J2828n389p696J0569M1779j0178P830M0347o044k5021j7229k9331
13960A06482N319p983p855K2584L733J5654M727k7505Q695R071L4382l554m191
$$ plain form
14047 113544 109738 94194 82366 97835 109919 114267 123299 135459 146868 162075 160859 128785
14035 128785 117008 130483 133864 121069 138005 154280 140255 132049 116841 120921 134454 144983
14023 144983 132398 135978 151823 155318 161022 131765 136043 159304 152577 101417 108151 106204 114547
14010 114547 126882 141550 136815 91008 68288 81946 123137 132174 150864 136256 129027 118695
13998 118695 126222 126575 110691 95938 104421 119567 103480 91784 99601 116565 136574 155730
13986 155730 150698 147894 131985 120549 118951 121147 123360 130403 129079 104606 87466 73510 89855
13973 89855 94017 106845 101456 93760 104329 146108 135930 143760 184107 178063 153042 135813 106482
13960 106482 111801 103818 95963 118547 122280 137934 142661 115156 123851 132922 167304 163750 159559
13947A59559J7360k605j5547k5361j9882K6989J756j0257n14o619j9267J2317
13935A17929j413O850K5513j3719K0685K6263j1173j5747o297j2463k8191q456
13923I9781r574K865K1004l579P631K6242q614J330m38r988k5946r428J7508k0846
13909H7948p761R454j8903J5940J6666K6615J3951j408j8841j05J7177L982k0968
13896A23747J2603J0853r406j2080j0766J9422r722l8630N322K2147K7435m537
13884A36388j8579j0499m927R996L392j1954l7591J2424j215J4219K1024N18j0431
13871A02765J2454N348n529o085q658M709J2294L408j6141K5645J6657P511j9414
13858A34964k8956O55J166N391J72k0510j1326J7566j901p463N936J3610r393
$$ plain form
13947 159559 176919 174314 158767 133406 113524 140513 142269 132012 131498 124879 105612 117929
13935 117929 116516 123366 148879 135160 155845 182108 170935 155188 148891 136428 108237 99781
13923 99781 90207 93072 114076 110497 118128 144370 135756 137086 136648 126660 100714 91286 108794 87948
13909 87948 80187 89641 70738 86678 103344 129959 143910 142502 123661 123556 140733 144715 123747
13896 123747 136350 147203 137797 125717 114951 134373 124651 86021 91343 113490 140925 136388
13884 136388 117809 107310 102383 112379 115771 103817 66226 78650 77435 91654 112678 113196 102765
13871 102765 115219 120567 115038 108953 100295 105004 117298 120706 104565 130210 146867 154378 134964
13858 134964 106008 106663 107829 113220 113392 92882 81556 99122 97221 89758 95694 109304 99911
13845I9911P467m4j2909k7162k1993k724Q756Q247K1174j4447m795L7263j45j2948
13831H5651J4494J1924k044j2413l929p950m450r464J2723M359j30K6605J2754
13818A28130K046m530n055j3355n417J1212K2456k512j5836k1020J1096J4998
13806A22213l874j4807j1294k7615P290L1744J1745J0308j7982k5231J0597j730
13794I1364r158Q088j2361Q712r368J7756K1628J2141k4337j6100J1705M521j9250
13781H5341l1726j5912k376L5932K1377P925j3297j7877j956p833O526L088P152
13768G6364M900j4430j5391j0045K1661J6943r511j3170m180r0J3899K3732j3300
13755G7382n468J754k0908k4690J2234K240J0160K3482q643q289k225n455J004
$$ plain form
13845 99911 107378 107334 94425 67263 45270 42546 51302 59549 80723 66276 61481 98744 98599 85651
13831 85651 100145 112069 110025 97612 93683 85733 81283 71819 84542 88901 88771 115376 128130
13818 128130 130176 125646 120591 107236 101819 113031 135487 132975 117139 96119 107215 122213
13806 122213 118339 103532 92238 64623 71913 103657 115402 125710 107728 82497 93094 91364
13794 91364 82206 90294 77933 86645 77277 95033 116661 128802 104465 88365 100070 104591 85341
13781 85341 53615 37703 35327 71259 92636 100561 87264 69387 67431 59598 66124 69212 76364
13768 76364 81264 66834 51443 41398 63059 80002 70491 57321 53141 53051 66950 90682 77382
13755 77382 71914 73668 52760 28070 40304 42544 52704 76186 67543 59254 57029 51574 52578
13742E2578j4359k4806j2236J3126L6521K6577N451j959j0445K051R445M841j0743
13729G6042J368p167j1648k352r473p870j4568n10j9715m0610K7532L8995J6297
13716D6321J1241p261j9916M0597o083n1442m456J2880Q724Q125J4225k4160q311
13703B0484J0202J8067K4679l558j0612r255K5121j0708k0374o102P012P902K515
13690E5373J0391N303N253l4558k0054J5093N1330K2331j2470m82k4704k3193
13678D9613k3426Q026M341J4263J7797J9859N752j3685M854j4689k388n330K2212
13665H7199K937k2694k2931K2713j8571l365k999l0127k5730k1210K1065K6209
13653A2496J4351P889m405j910l54J3239M762M097n955P405j7457n4551k5698
$$ plain form
13742 52578 38219 13413 1177 14303 50824 77401 82852 80893 70448 72499 81944 86785 76042
13729 76042 77410 70243 58595 56243 46770 38900 24332 23822 4107 -36503 -8971 30024 46321
13716 46321 57562 50301 30385 70982 64899 13457 9001 21881 30605 38730 52955 28795 20484
13703 20484 30686 48753 73432 69874 59262 50007 75128 64420 44046 37944 44956 52858 55373
13690 55373 65764 71067 76320 41762 21708 36801 88131 110462 97992 97510 72806 49613
13678 49613 26187 34213 38554 52817 70614 90473 96225 82540 87394 72705 70317 64987 87199
13665 87199 90136 67442 44511 67224 48653 45288 42289 12162 -13568 -34778 -13713 12496
13653 12496 26847 34736 30331 28421 28067 41306 46068 50165 44210 51615 34158 -20393 -46091
13640d6091M662J4869K2920P528j0774O605L349p059J9855M765k0453r101N309
13627c616O513L2630o548J4296K6811n385j9249l1097m6536p1L1929l564K2223
13614A8336J1265k4413m988L0045r748O417j7165l3074j7397R783K5665J3123
13602G849O538K2776k0181k3710P642J1142j8598k3491j127L0174j5466n460K0143
13589a769N457M234k102o393j2105k0222r4k0228Q276J1921K4780L6920m762k2090
13575A823o151k2752l987J3083O60N650L196K0291j6847M81k470k1598q910M4853
13561G322k700m672k68j9676l11J0895j9150j570l901j6284M174J364Q178O95
13547c5904J2089N467j4514L1163j0007n1121m8886R80M2059K7760o112j0696
$$ plain form
13640 -46091 -41429 -26560 -3640 3888 -6886 -281 3068 -3991 15864 20629 176 -8925 -3616
13627 -3616 2897 35527 28979 43275 70086 64701 45452 14355 -32181 -32252 -323 -3887 18336
13614 18336 29601 5188 200 30245 20497 26914 9749 -23325 -40722 -30939 -5274 7849
13602 7849 14387 37163 16982 -6728 914 12056 -6542 -30033 -31160 -986 -16452 -21912 -1769
13589 -1769 3688 7922 5820 -573 -12678 -32900 -32994 -53222 -44946 -33025 -8245 28675 23913 1823
13575 1823 -4328 -27080 -31067 -17984 -17324 -11674 -8478 11813 -5034 -4553 -7023 -28621 -37531 7322
13561 7322 4622 -50 -318 -19994 -20305 -9410 -28560 -30130 -34031 -50315 -46141 -44777 -36599 -35904
13547 -35904 -23815 -18348 -32862 -1699 -11706 -62827 -111713 -110733 -68674 -40914 -47026 -57722
13535e7722K9545q47k4108j5270J7772L3468O648k387j2039j4255l0473o032J0802
13522f4898j3688K466P340J5900M187o474q292J1678j7680k1122R061J672k675
13509h2525L952L5299L589k0318R108K343K8009K2536l1620j9477P288l646q15
13496d6277Q2q047k7965j2158Q133J2456N12J8683N565p005K026J0028k0068l5665
13482i9700k3376j2979K7462K8228n712J080n681R094J3201n863k3043J509J0346
13469h5434j9391J3915L0249j9523j2685n814m233j9166Q988P873n550K0899K5391
13456f4481N868O487J3581p244k0468k3081J0419l984k4890M997k4175L13J0624
13443a16034j687J30K4219J1663k4877P850O145P90K0622p458J9741J0667N85
$$ plain form
13535 -57722 -28177 -29024 -53132 -68402 -50630 -17162 -10514 -12901 -24940 -39195 -69668 -75700 -64898
13522 -64898 -78586 -76120 -68780 -52880 -48693 -55167 -63459 -51781 -69461 -90583 -81522 -79850 -82525
13509 -82525 -78573 -43274 -39685 -60003 -50895 -48552 -20543 1993 -29627 -49104 -41816 -45462 -46277
13496 -46277 -46195 -54242 -82207 -94365 -86232 -73776 -73264 -54581 -49016 -56021 -53995 -43967 -64035 -99700
13482 -99700 -123076 -136055 -108593 -80365 -86077 -84997 -90678 -81584 -68383 -74246 -97289 -95780 -85434
13469 -85434 -104825 -90910 -60661 -80184 -92869 -98683 -102916 -122082 -113094 -105221 -110771 -89872 -64481
13456 -64481 -58613 -52126 -38545 -45789 -66257 -89338 -78919 -82903 -107793 -102796 -126971 -126658 -116034
13443 -116034 -117721 -117591 -93372 -81709 -106586 -98736 -92591 -91801 -71179 -78637 -58896 -48229 -47644
13430d7644l765K8433K4064p389P188K3477K1087l966J4312O3932N6242N3814
13418B29785J13612J48129K40445L93041M21169K69145R5764L9443q3254k94572
13408A572707m13896l64794k31439j71606j05942q4248o1791j2673p196j6402
13398A02720m5012j7015q162j1093m0234j0692k102j7050j8953k9995j3825J5352
13386i6061J6589j6960M69L795m264K466J2119K404k7772k3543k7035P530p60
13373a51023j058L2402K6986l095k4833j9728o744J363l2237m667M504r537k7968
13360b15635K4530L6854K8797l835m3402K296M9117Q438p11J5602p740j2659k0269
13347a38617j4715j7077L9870N7619K4054L8399L4197L7591L6524j5524p0642
$$ plain form
13430 -47644 -51409 -22976 1088 -6301 887 24364 45451 41485 55797 119729 175971 229785
13418 229785 343397 491526 731971 1125012 1546181 1815326 1911090 1950533 1867279 1572707
13408 1572707 1158811 794017 562578 390972 285030 200782 138991 126318 119122 102720
13398 102720 57708 40693 32531 21438 -18796 -29488 -31590 -48640 -67593 -97588 -111413 -96061
13386 -96061 -79472 -96432 -95963 -92168 -96432 -93966 -81847 -79443 -107215 -130758 -157793 -150263 -151023
13373 -151023 -152081 -119679 -92693 -95788 -120621 -140349 -147093 -145730 -177967 -182634 -178130 -187667 -215635
13360 -215635 -191105 -154251 -125454 -129289 -172691 -170395 -121278 -112840 -113551 -97949 -105689 -118348 -138617
13347 -138617 -153332 -170409 -130539 -72920 -48866 -10467 23730 61321 97845 82321 11679
13336A1679o3820k6889j2940j0043m5832j7336K3443R898R687K8436q518k3188
13324a25423j7554P946M815k1166n158K4665j0367K8103J7670n078l3397j1139
13312a46083p21k2400Q148l149l1698k4418j5860J4462j8228k2154J3280L6980
13300b11841r754J3048J1480K15J2465Q383N972L758J8074k891k7700o315j4284
13287a99390j0096O968Q951j1953K721J681n650j1268l526J7903k660J2122O034
13274a88163R140J5151r428j2387j3923k7112m5341k1514K4367J0068J7688M4581
13262a96873L5865k616m834J4425N905J1433K487m765j656j0731J5587J707m718
13249a38784L005k033j2413m016j8145m1410o740k937o027L3163k0348m259k0319
$$ plain form
13336 11679 -52141 -79030 -91970 -102013 -147845 -165181 -141738 -131840 -122153 -93717 -102235 -125423
13324 -125423 -142977 -135031 -130216 -151382 -156540 -131875 -142242 -114139 -96469 -101547 -134944 -146083
13312 -146083 -146804 -169204 -161056 -164205 -195903 -220321 -236181 -221719 -239947 -262101 -248821 -211841
13300 -211841 -221595 -208547 -197067 -196852 -184387 -176004 -170032 -166274 -148200 -151091 -178791 -185106 -199390
13287 -199390 -209486 -202518 -193567 -205520 -202799 -201118 -206768 -218036 -221562 -203659 -206319 -194197 -188163
13274 -188163 -179023 -163872 -173300 -185687 -199610 -226722 -272063 -293577 -269210 -259142 -241454 -196873
13262 -196873 -161008 -163624 -168458 -154033 -148128 -136695 -134208 -138973 -140629 -151360 -135773 -134066 -138784
13249 -138784 -135779 -137812 -150225 -154241 -172386 -213796 -220536 -223473 -229500 -196337 -216685 -220944 -241263
13236b41263O349K400j9427R38j3023L6549L7589k467J2887J2439J0873n088O582
13223a54662j6618k9220M183P2781J36119J69417R2534N8532J09737P8404P0870
13212E92077J32504K85613M79094O72312N69037L2759n02313o66065n25129l41655
13202G28234k40320j55131j03033p4158m2710n3992o9675n8264j7873Q364j8780
13191i7338o458K756j2609n351l5139l6584j1221k1490l695O55L893J6105j8222
13178b24698j1161J4321O584O282K7304J3827J0442J0528j2325k7263j602r336
13166a97097n990j397l2071j6022n899k6889K9523K8693J9421J186k7231j462
13154b35235J1536k0061m9894k3249J2565k594q018k354m291r710j0124k6367
$$ plain form
13236 -241263 -234914 -232514 -251941 -251003 -264026 -227477 -189888 -192355 -179468 -167029 -156156 -161244 -154662
13223 -154662 -171280 -200500 -196317 -123536 12583 182000 274534 333066 442803 521207 592077
13212 592077 724581 1010194 1489288 2161600 2730637 2763396 2261083 1595018 1069889 728234
13202 728234 487914 332783 229750 155592 112882 58890 -10785 -69049 -86922 -78558 -97338
13191 -97338 -103796 -101040 -113649 -119000 -154139 -190723 -201944 -223434 -227129 -226474 -222581 -206476 -224698
13178 -224698 -235859 -221538 -214954 -208672 -181368 -167541 -157099 -146571 -158896 -186159 -187761 -197097
13166 -197097 -203087 -204484 -236555 -252577 -258476 -285365 -255842 -227149 -207728 -206542 -233773 -235235
13154 -235235 -223699 -243760 -293654 -316903 -304338 -306932 -314950 -317304 -321595 -331305 -341429 -367796
13142c67796r725j1069r759j6441M340j2967o525J7735K2900K4811J3956l033
13130c53573J0193K2963J1296K309j9642L027K7819j1751k5159l154J18L057K358
13117c30139P201j5023J255M0814M2407O856l5039o7493m2265P248K3622l39O953
13104c53942J7260O2730K4242J9342N2515O930J5040N818L6232O8564N2343L2699
13092C9773j408o5809j23881j02068p7884j00845r9355n8316k3232J652M5677
13081e65696K0464J8482K3181q36P869j2772J0971j711J438L0891L8214Q965L4059
13068c86481N5n215k1686l6464l1662n205j7239k2277J6397M5328J8150N6633
13056c89666N5643J2136n6256k9047m0794l1367l5800n3563j9268J6294o101Q419
$$ plain form
13142 -367796 -377521 -388590 -398349 -414790 -410450 -423417 -429942 -412207 -389307 -364496 -350540 -353573
13130 -353573 -343380 -320417 -309121 -306812 -326454 -323427 -295608 -307359 -332518 -335672 -335554 -332497 -330139
13117 -330139 -322938 -337961 -336706 -295892 -253485 -246629 -281668 -349161 -391426 -384178 -360556 -360895 -353942
13104 -353942 -336682 -273952 -249710 -230368 -177853 -170923 -155883 -150065 -113833 -45269 7074 39773
13092 39773 38365 -27444 -151325 -253393 -331277 -432122 -531477 -589793 -613025 -611373 -565696
13081 -565696 -545232 -526750 -503569 -504405 -496536 -509308 -498337 -500048 -498610 -467719 -429505 -420540 -386481
13068 -386481 -386426 -391641 -413327 -449791 -481453 -486658 -503897 -526174 -509777 -464449 -446299 -389666
13056 -389666 -334023 -321887 -378143 -407190 -447984 -479351 -515151 -568714 -587982 -571688 -577789 -569370
13044e69370P210M1025O0141K6083k1798j5635K0883l7519k4678K6675L3106m625
13032d58502n367P984J7204J2578N652k3494m269p925J1534L616K6918J4328K6444
13019c73299k702m3024n779o980K3173P1544J07260J27660J69881K31905K51651
13008E51290J61074j5485j32153j14875l2513r905N0388R8062J06770J50043K90938
12997A103634N02348L58596J46224Q1977O0832O6159P7341J08618J86635K44750
12987B937114L01808M22583N42435P03326Q68415J086528J405657J788941K158215
12978A2215022K373835K581481L029056L826584N020607O799484R532022J3971349
12970E9349440K1659411L4558797N4072907P7261944Q5379752N5971353J8142718
$$ plain form
13044 -569370 -562160 -521135 -460994 -434911 -456709 -472344 -451461 -488980 -513658 -486983 -453877 -458502
13032 -458502 -463869 -455885 -438681 -426103 -420451 -443945 -448214 -456139 -444605 -440989 -414071 -399743 -373299
13019 -373299 -376001 -419025 -424804 -431784 -408611 -337067 -229807 -102147 67734 299639 551290
13008 551290 712364 696879 564726 449851 417338 407433 457821 555883 662653 812696 1103634
12997 1103634 1605982 1964578 2110802 2192779 2253611 2319770 2397111 2505729 2692364 2937114
12987 2937114 3238922 3661505 4203940 4907266 5775681 6862209 8267866 10056807 12215022
12978 12215022 14588857 17170338 20199394 24025978 29046585 35846069 45378091 59349440
12970 59349440 81008851 115567648 169640555 246902499 332282251 388253604 406396322
12963D06396322L754022j6739707n8072873p9772773p0041705m8032935l1225145
12956A06265206k1137361j5075980j1177476q579656o775664n430407m383286
12949C3705376l646718l195527k877264k498244k079500j748902j481437j288636
12941A4889148j188453j075498r97225q71271p42609o98819o59183n50599m91904
12932G613587m49836m08745l53158l33331k93253k50273k43383j93562j94797
12923D893249j42339j51512j53649j09045j14073j19946j01798q1995r1664j04125
12913C723103r8256o5355l0510J8346k8400o7528q0626r3974j60665j75439j39966
12902B800730j40766j26742j14282r0457r9072q9161p1513n7204r2237n0588k629
$$ plain form
12963 406396322 410150344 393410637 335337764 255564991 185523286 137490351 106265206
12956 106265206 85127845 70051865 58874389 50294733 43519069 38088662 33705376
12949 33705376 30058658 26863131 23985867 21487623 19408123 17659221 16177784 14889148
12941 14889148 13700695 12625197 11627972 10756701 10014092 9315273 8656090 8105491 7613587
12932 7613587 7163751 6755006 6401848 6068517 5775264 5524991 5281608 5088046 4893249
12923 4893249 4750910 4599398 4445749 4336704 4222631 4102685 4000887 3918892 3827228 3723103
12913 3723103 3624847 3559492 3528982 3547328 3518928 3451400 3370774 3276800 3116135 2940696 2800730
12902 2800730 2659964 2533222 2418940 2328483 2229411 2140250 2068737 2011533 1919296 1868708 1866079
12891A866079k4499n9105o9625n3503l0829l6866k6737q455j147l0140k9265q001
12879A487907Q078J9885Q829K2453P0495Q7423P9607q399p6957j47282j74901
12868A377138j82898j12145n9716l7815k8732j4675L48q012p271K8109Q0J1755
12856I66166M8768L2502L6775M1565O1920J20393J34973M1867p9274j28161j13318
12845A164176q1943k8284l9302n38J7806o945n6639r2041j02533n7620m6146o6007
12833F03984o4859n8915m2935j8914Q442K9115O1243P277K439j1455m2518k2585
12821D50319J7222j4989k5578k4873p441J0638j1061Q579N2105K5881M627l2301
12809D53128l4897m5413k5129M406Q603J2225M787N528K3613k4454j6601K3612
$$ plain form
12891 1866079 1841580 1782475 1712850 1659347 1628518 1591652 1564915 1556460 1555313 1525173 1495908 1487907
12879 1487907 1495985 1515870 1524699 1547152 1617647 1705070 1784677 1776278 1699321 1552039 1377138
12868 1377138 1194240 1082095 1022379 984564 955832 941157 941505 933493 926222 954331 954411 966166
12856 966166 1014934 1047436 1084211 1125776 1187696 1308089 1443062 1484929 1405655 1277494 1164176
12845 1164176 1082233 1053949 1014647 1014109 1031915 1024970 968331 876290 773757 716137 669991 603984
12833 603984 539125 480210 437275 418361 426803 455918 517161 524438 526877 515422 472904 450319
12821 450319 467541 452552 426974 402101 394660 405298 394237 402816 454921 480802 485429 453128
12809 453128 418231 372818 347689 352095 360698 372923 377710 383238 406851 382397 365796 389408
12797C89408j9267p389K0248l519K6333O3696M9743L8528K4376l207J846L9421
12785F20217N2864R1729Q9683J11548R5053J03977J04743P9113Q9632J42723J67882
12774A749164J42240J89649K12035J79757J74198J74458K83428L61367M34958
12765C901254N40092O64876Q88926J136721J376013J692666K119577K631611L030730
12756A7982466K952422K834407L514137N207133P835972J1767561J7782725K8103063
12748I7979886M6231824P5681331J15003464J38438642Q5342484l9102280j18577609
12741D00997742j19598791q2847431n1993647l3680883k2880157j6007235j1743001
12734F2246597q999589o877860n214899m191324l933023l715773l225979k660409
$$ plain form
12797 389408 370141 362752 383000 379481 405814 469510 519253 557781 582157 578950 580796 620217
12785 620217 673081 764810 854493 966041 1061094 1165071 1269814 1348927 1438559 1581282 1749164
12774 1749164 1891404 2081053 2293088 2472845 2647043 2821501 3104929 3466296 3901254
12765 3901254 4441346 5106222 5995148 7131869 8507882 10200548 12320125 14951736 17982466
12756 17982466 20934888 23769295 27283432 32490565 40326537 52094098 69876823 97979886
12748 97979886 144211710 219893041 334896505 473335147 558677631 519575351 400997742
12741 400997742 281398951 198551520 146557873 112876990 89996833 73989598 62246597
12734 62246597 53247008 46369148 41154249 36962925 33029902 29314129 26088150 23427741
12726B3427741k232599j839059j573056j357520j210360j042490r16817q23871
12718A2431969p43544o83347o30897n44596m28358l70120l59927l49797l80544
12709G940839l73869l21733k73895l02364l66960l28345k49378k33956k27637
12700E262702j94548j86018j53330j24254j08487q4075j01337j13314j18583j26821
12690C951935j03889r8001j06294j01621r7544o9521n8500p5149o9347m4390p9123
12679C048556r6760o9924r6694m6922j7163m1962k1275m093n2992l6809k4371
12668B539591k9302n3606l8223l3883o7558k0964J347k736j7380j8013j0805l7612
12656B210856N717J1138j7858j701J068K0454k4214m903l2277m1234n4541l4977
$$ plain form
12726 23427741 21195142 19356083 17783027 16425507 15215147 14172657 13255840 12431969
12718 12431969 11688425 11005078 10374181 9829585 9401227 9031107 8671180 8321383 7940839
12709 7940839 7566970 7245237 6971342 6668978 6302018 5973673 5724295 5490339 5262702
12700 5262702 5068154 4882136 4728806 4604552 4496065 4411990 4310653 4197339 4078756 3951935
12690 3951935 3848046 3750045 3643751 3542130 3444586 3375065 3316565 3241416 3172069 3127679 3048556
12679 3048556 2951796 2881872 2785178 2738256 2721093 2679131 2657856 2653763 2600771 2563962 2539591
12668 2539591 2510289 2456683 2418460 2384577 2317019 2296055 2297402 2294666 2277286 2259273 2248468 2210856
12656 2210856 2216573 2227711 2209853 2208152 2209220 2229674 2205460 2200557 2168280 2127046 2072505 2037528
12644B037528p9518p9664k9738m116J25q060p685j927k1855l1945n666k773r523
12631A755183j2515L722K8152L0794M166N42l8918j2072L394M5638J699K4845
12619A834630L2674l1480o9315j26735j37774q9225k3083n394m7283j5184L2446
12608A354277J6657M748O639j253m971K6269J4602J0940k240j5265j0692j1565
12596A388146J0720N923L7755O3417J13140J15665J02198J9634m4015r9895j15625
12585A597063p4819p2444q0524n4884m3426m0754l7704K8325M7980J6158N103
12574A290074k6542k8263N688l842O769M7567N3744O1603k0895o3324p1474n8063
12562A193042k6705P400j1809j9155M371n151l5675l0897k812J1849Q694K0183
$$ plain form
12644 2037528 1958010 1878346 1848608 1844492 1844617 1836557 1828872 1826945 1805090 1773145 1767479 1764706 1755183
12631 1755183 1742668 1746390 1774542 1805336 1809502 1810044 1771126 1759054 1762448 1808086 1809785 1834630
12619 1834630 1867304 1835824 1766509 1639774 1502000 1412775 1389692 1384298 1337015 1321831 1354277
12608 1354277 1370934 1375682 1382321 1381068 1376097 1402366 1416968 1427908 1425668 1410403 1399711 1388146
12596 1388146 1398866 1404789 1442544 1505961 1619101 1734766 1836964 1856598 1812583 1712688 1597063
12585 1597063 1522244 1449800 1369276 1314392 1270966 1230212 1192508 1220833 1268813 1284971 1290074
12574 1290074 1263532 1235269 1240957 1237115 1243884 1291451 1345195 1406798 1385903 1322579 1251105 1193042
12562 1193042 1166337 1173737 1161928 1142773 1147144 1141993 1106318 1075421 1072609 1084458 1093152 1113335
12550A113335n615j9523k6987k2435j5802q037j4435j5086l4567k2930k6229n3298
12538H48391m1245J979J4644M0628J3286m382K3445K3716J3790J0015M1121N0887
12526A036275M5183N4105L498l1670J1076L269k0061j6308L685J3173N1910J07214
12514A261349J78643K28178L28592M47474L75209J32302L7228r6343k50647l52981
12504B289004l55057k81251k19477j42263j04463l5737k5419l6418k5611j8384
12494A044924j8332k9090m0338l3954J516r51k633l3978J985m550j9095R849J0689
12481H86042j1134J276j282r389J0649j7116j973q098J4795Q398M730Q509L006
12468H88413j1959j2544m2541k3953k352K493J6572p552k8585j9674p920j1485
$$ plain form
12550 1113335 1107720 1088197 1061210 1038775 1022973 1014936 1000501 985415 950848 927918 901689 848391
12538 848391 807146 809125 823769 864397 877683 873301 896746 920462 934252 944267 985388 1036275
12526 1036275 1081458 1135563 1139061 1107391 1118467 1121736 1101675 1085367 1089052 1102225 1154135 1261349
12514 1261349 1439992 1668170 1996762 2444236 2819445 2951747 2988975 2892632 2641985 2289004
12504 2289004 1933947 1652696 1433219 1290956 1186493 1150756 1125337 1088919 1063308 1044924
12494 1044924 1026592 997502 957164 923210 924726 923775 921142 887164 889149 884599 865504 875353 886042
12481 886042 874908 876184 874902 865513 876162 859046 857073 848975 863770 872168 876898 885407 888413
12468 888413 876454 863910 821369 797416 795064 797557 814129 806577 777992 758318 750398 738913
12456G38913j069j219L8524J1309j8125K902J1419j5650J5671N048p321m089P436
12443G83749J8213L0306Q763L075j7504j8624m9359l0572K1914L1117N851k2125
12431G64804P154m9007J229J4518J56o848R734p589q798j5270k3909j0468j2615
12418F63091J3624L1120j5370r88n578K823P487l92J4370k6244J2908J6835m640
12405G09046q453q734M182L730J728M329l2925m5573m2957rO32L2351L2430K0868
12391F70645o964J7097P540o173J997j25k3522l0677J8752O939J9297J3198j6740
12378F71264j0216K2107j6313k0524j7064j0018J4900j3042M325K6615o70j348
12366F50016j8101j877m445J840J0373j7790O073K3609l252j4572J517l3750P432
$$ plain form
12456 738913 737844 736625 775149 786458 768333 771235 782654 767004 782675 787723 780402 776313 783749
12443 783749 801962 832268 841031 844106 826602 807978 758619 728047 749961 781078 786929 764804
12431 764804 771958 722951 724180 738698 738854 732006 741740 734151 725353 710083 686174 675706 663091
12418 663091 676715 707835 692465 691477 685899 688722 696209 695817 710187 683943 696851 713686 709046
12405 709046 700593 691859 696041 699771 701499 705828 672903 627330 584373 584364 584996 617347 649777 670645
12391 670645 663681 680778 688318 682145 684142 684017 660495 629818 648570 655509 674806 688004 671264
12378 671264 661048 683155 666842 646318 629254 619236 634136 621094 625419 652034 651364 650016
12366 650016 631915 630038 625593 627433 637806 620016 626089 649698 646446 631874 633391 599641 607073
12353F07073K9249M0871j5554l2086j457M649R6L938K569r566K7886p891j2569
12340F37208k1924N183N692J8162j2350K7721R570m3541j538Q933Q258M696R952
12327F56022k5299r571J7473M75Q501j5157k0708o464j3575M274P389J1702O50
12314F15712k0842k8926J3059K4471m807J687k1755l5757n107r25k824j3014j5990
12301E04982L9163M0950J0118k5151M195L7251L4989M11m3653j7141M472O054
12289E96640J1207K9508L6496K2591L465K5438m155P542J4927L5104N5520J13243
12277I47526J82308L17122M57586O69776O60576K23153l84610o10455n25720l71730
12267A565532k18309j33426j37085j14411p8624k2362m8512m4018m6607j0048
$$ plain form
12353 607073 636322 677193 661639 629553 628096 632745 632841 636779 639348 629782 657668 649777 637208
12340 637208 615284 620467 626159 644321 631971 659692 669262 625721 624183 633116 641374 646070 656022
12327 656022 630723 621152 638625 639100 647601 632444 611736 605272 591697 595971 603360 615062 615712
12314 615712 594870 565944 579003 603474 598667 600354 578599 542842 537735 536810 533986 520972 504982
12301 504982 544145 585095 595213 570062 574257 611508 646497 646908 603255 586114 590586 596640
12289 596640 607847 637355 673851 696442 699907 725345 721190 728732 743659 778763 834283 947526
12277 947526 1129834 1446956 1904542 2574318 3234894 3458047 3073437 2462982 1937262 1565532
12267 1565532 1347223 1213797 1076712 962301 883677 861315 812803 768785 722178 712130
12257G12130r24j5796k606j942j7201k9727j3640K2917J0910p806l0445j2472
12245F13398J0700j5047k1955j2338K5084K5895j6886k3176j487K4379j6575O720
12233E98712J1466n645k0744j7258p5l90P28l515l489m367j8045L885n73K851
12219E43541J3583n20k2910J4401J0722l531k4267p459K3865N933k090m489k1608
12206E25171o985K1253K262K0114k4956N575J8582J0083L211J5139k7250q081
12194E54118J7661j939j8266L301j0958P287O090K3923L984l0729o281k7992k6738
12181D93461L1556L9788l217r615o169J4376J7067K6425k4508k4774l4721Q063
12169E27732J6089k882J054O177J1442o262r035j7550k7934l8752N806L7722L0345
$$ plain form
12257 712130 711206 695410 692804 690862 673661 643934 630294 653211 664121 656315 625870 613398
12245 613398 624098 609051 587096 574758 599842 625737 608851 585675 584188 608567 591992 598712
12233 598712 610178 604533 583789 566531 566456 566066 566794 563279 559790 555423 537378 541263 540690 543541
12219 543541 557124 556604 533694 548095 558817 555286 531019 523560 547425 553358 551268 546779 525171
12206 525171 518186 539439 541701 561815 536859 542434 561016 571099 574310 589449 562199 554118
12194 554118 571779 569840 551574 554875 543917 551204 557294 581217 585201 554472 548191 520199 493461
12181 493461 525017 564805 561588 551973 545804 560180 577247 603672 579164 554390 519669 527732
12169 527732 543821 540939 541993 548170 559612 553350 544315 526765 498831 460079 465885 503607 533952
12156E33952m805j1847K4155J1020L856J499n910K169K7335j224j8744k6488n765
12143E29203L045J0492J9286N484k8904j460K66J8006j2174j8102P75n635j4671
12130E05611L921J6610o61l0149J0543j85m1150o656K5062K3150J5482L371K9554
12117E54503J9541j1329j1767r919j3192J4453L8361j6708k9547k3965k0551K5367
12105E15247K7015M440n363m3637j1907J8492J7684L1182J5645m9341j6940j2697
12093D89820j0335K6388J1331M724O512p022K4250J6260m114l20o985J5107J0068
12080E75684k0751k3131k2662p165n77L304k276J8196o825J6643n43j2642n301
12067E11954M962j4777J0154K9166k3390J4534J2006J0600R28j0949J702j3312
$$ plain form
12156 533952 529147 517300 541455 552475 556331 557830 551920 554089 581424 580200 561456 534968 529203
12143 529203 532248 542740 562026 567510 538606 537146 537412 555418 543244 525142 525917 520282 505611
12130 505611 509532 526142 525481 495332 505875 505690 464540 457884 482946 506096 521578 524949 554503
12117 554503 574044 562715 550948 541029 527837 542290 580651 563943 534396 510431 489880 515247
12105 515247 542262 546702 541339 497702 485795 504287 521971 553153 568798 519457 502517 489820
12093 489820 479485 505873 517204 521928 528440 521418 545668 561928 557814 557494 550509 565616 575684
12080 575684 554933 531802 509140 501975 501398 504702 502426 520622 513797 530440 529897 517255 511954
12067 511954 516916 502139 512293 541459 518069 532603 544609 555209 556137 545188 546890 533578
12055E33578l7711k8231K0035L8043K4404o058r099P450l545j0040k1291j1257
12043D96278j2013K2349j029n154n894Q146J7207J1670j6553o936k5505N992j230
12030D87328P403r146j641K0454N2708J5873j8559j127M545l1721k6371J4215
12018E13961l360O093Q048o658J2215l044k1445N303L454K174L1143j5757k4762
12005E07365k6413J5069K9614J7258j4629m3028j8692l068J2300J9806L6401p664
11993E24319M564J55N48j4442K914R505n52l3182K368J031J5515L8733j3167J7627
11979E55936J8974J5272j6567m58j9254j7656k2163p162J197J3586j4203k9383
11967D78119J2485K8753J4260M891J7857L731r221l0269n12m557k6428j9850J4158
$$ plain form
12055 533578 495867 467636 487671 525714 550118 544060 534961 542411 538866 528826 507535 496278
12043 496278 484265 506614 505585 500431 494537 502683 519890 531560 515007 508071 482566 488558 487328
12030 487328 494731 485585 483944 504398 557106 572979 554420 553293 557838 526117 499746 513961
12018 513961 510601 516694 524742 518084 530299 527255 505810 511113 514567 516741 547884 532127 507365
12005 507365 480952 496021 525635 542893 528264 485236 466544 463476 475776 495582 531983 524319
11993 524319 528883 529038 529586 515144 518058 527563 527011 493829 496197 497228 512743 551476 538309 555936
11979 555936 574910 590182 573615 573157 553903 536247 514084 506922 508119 521705 507502 478119
11967 478119 490604 519357 533617 538508 556365 560096 550875 520606 520094 515537 489109 469259 483417
11954D83417N4210J245l4625j5073O241J6468K2414L227l1100J7780m47J9038
11942E42795J9979j9437l405J1169j5326L464m548R582Q733L260q633K139R551
11929E59323o70n25o12J3181O042O79J8409L18j0572j3009R034K6729k0648j1636
11915E76043K2964m08k383N6O81N490n149j4176l3256K306O418J8895K0364L462
11901F01307L821j9609l9168r562j7628k3354J7486K7157J5941j1736M782J2587
11889E62024K2433j1258q317K8932Q296k7239k9579P976K4373J7689K6125M275
11877F25730k3975m674J9209K1059j2546j794K0289L3405J9597j1214n0129k8346
11865F06611J066L5507O4700N0653M7821M0570R498L9272O3607L1357q760K1134
$$ plain form
11954 483417 537627 538872 504247 489174 495415 511883 534297 537524 506424 524204 523757 542795
11942 542795 562774 543337 539932 551101 535775 539239 534691 544273 553006 556266 547633 549772 559323
11929 559323 558653 558128 557516 570697 576739 577418 595827 596145 585573 572564 581598 608327 587679 576043
11915 576043 599007 598599 596216 596272 596953 602443 597294 583118 549862 552168 558586 577481 597845 601307
11901 601307 605128 585519 546351 536789 519161 495807 513293 540450 556391 544655 549437 562024
11889 562024 584457 573199 564882 593814 602110 574871 545292 553268 577641 595330 621455 625730
11877 625730 601755 597081 616290 637349 624803 623009 643298 676703 696300 685086 634957 606611
11865 606611 607677 643184 707884 758537 806358 846928 856426 895698 959305 990662 981902 1003036
11853A003036k8933k0577N330k7768o7534k2265R454J9689j4963k7254j029K3740
11841H50926k8985j9148m808O306j1314J120q582j944j6844j320j3593k5148j8873
11828G07793L5550K9237k4709j711J4625N721J6773l269j018j0685q442K3572
11816G83437Q87j2386o138j9025l403j9733k1922Q884J926O77k7475K8033J6483
11803G30245m0307n793J4433m026k3363l3607k4531J642J1396K6446M6505j697
11791F97343J5173N436p366r472k393j6525k369K1208r711o224Q598O749j1925
11778F88522j6475L0259P382J473L5974K3569K0457R224J8869L0410O3862L6852
11766I50378O423j0253N725j832m732j8495j5048q404j3096L522r400n2140m2469
$$ plain form
11853 1003036 974103 953526 958856 931088 863554 841289 850743 870432 855469 828215 827186 850926
11841 850926 821941 802793 797985 804291 792977 794097 785515 783571 766727 765407 751814 726666 707793
11828 707793 743343 772580 747871 746160 760785 766506 783279 780010 778992 768307 759865 783437
11816 783437 784324 771938 765800 746775 743372 723639 701717 710601 712527 713204 685729 713762 730245
11803 730245 689938 684145 698578 694552 671189 637582 613051 614693 626089 652535 699040 697343
11791 697343 712516 717952 710586 701114 698721 682196 679827 701035 691324 685100 693698 700447 688522
11778 688522 672047 702306 709688 711161 747135 770704 791161 800385 819254 849664 913526 950378
11766 950378 956801 946548 952273 950441 945709 927214 912166 903762 890666 894188 884788 832648 790179
11753G90179j5489o862M98J2340k67l6533j8752K6526L4484J2305m0517j1804
11741G46108k0858p704P311r186j3501L4599K6821j7143j1317l6488M63J3717
11729G12822j2057K1508K6909J3761J460k2500j4799m4101r04J4807j8773j5432
11717F62701J936j3975j8717l954K1801P686j1228k924k881l097J1441Q334J2483
11704F69606N921J1504k6386j2904J2975o542k3903n77J4918j2325m456L9328
11692F67159o770l7763j0888K5338J1947P203j5601k0036j0736o436j0773n17
11680E92127j6149k1145J0220l167k589j1374M060p916l5274n149L7654K2116
11668E63414Q127K0684j2875O566J3453K3437q432j8923k3576j2634p784j532
$$ plain form
11753 790179 774690 767828 768326 780666 780399 743866 725114 751640 786124 798429 757912 746108
11741 746108 725250 717546 724857 715671 702170 736769 763590 746447 735130 698642 699105 712822
11729 712822 700765 722273 749182 762943 764403 741903 727104 683003 682099 696906 678133 662701
11717 662701 664637 650662 631945 627991 649792 657478 646250 643326 640445 637348 648789 657123 669606
11704 669606 675527 687031 660645 647741 660716 654174 630271 629694 644612 632287 627831 667159
11692 667159 660389 622626 611738 637076 649023 656226 640625 620589 609853 603417 592644 592127
11680 592127 575978 554833 565053 561886 559297 547923 551983 544067 508793 503644 541298 563414
11668 563414 571541 592225 579350 585916 599369 622806 614374 595451 571875 559241 551457 549925
11656E49925m980j0650K3036L0647m890o837J7923M684m228K7401j8512k5639
11644E77880j3127K5840L0120j2972j9904j5291l349J4578q225J6136K60j0564
11632E81382k067l590P419m182O779j001M808L052K73j4611J2121r002k9243L038
11618E55176K2937l712j8023K0512J9975m043k5822j2583j766N574j4169q880
11606E35176L0946q72L30R807L482n342P672L6049K7289J5010O415n444J660k1532
11592F40646j1724j434k2397P534O186j1980J2277K1665K1048j1640n6299n8658
11580E35224J545m898K9519J9466P505J5988k173j1806k3686j1618L049p970r010
11567E41135R881J2443J5683M645Q6j8782K3188o203l2376L416J4025q728J1807
$$ plain form
11656 549925 544945 534295 557331 587978 583088 576251 594174 598858 594630 622031 603519 577880
11644 577880 564753 590593 620713 607741 587837 572546 569197 583775 575550 591686 591946 581382
11632 581382 579315 575725 583144 578962 585741 584740 589548 592600 592873 578262 590383 581381 552138 555176
11618 555176 578113 574401 556378 576890 596865 592822 567000 554417 552651 558225 544056 535176
11606 535176 566122 565250 565580 575387 578869 573527 581199 617248 644537 659547 665962 660518 662178 640646
11592 640646 628922 627488 605091 612625 618811 606831 619108 640773 661821 650181 593882 535224
11580 535224 536769 531871 561390 580856 588361 604349 602176 590370 566684 555066 558115 550145 541135
11567 541135 551016 563459 579142 583787 583873 565091 588279 582076 549700 553116 567141 558413 570220
11554E70220K0258N90k8392l743j1081J230J474j6641K5361K6756J5090k4566
11542E76556l5953k5621n985r058N161K6086k0029O829j1082J3442j1594j2151
11530D96601J1801j2213J9179l160j0835j9882Q527M4641p825p43o973l1207k0329
11517D67582j7032J2865M5364j802l224J8169k1827j3102j6863q90J9292K628
11505D91160k6421k4458l047J2359j8970J1039L8056j2655M617j0012L2182n969
11493D87881k4102k121j1000j0868n149L877K3742m290q579m797J1473l470O182
11480D58779N969K532J7203r430K272J5268o230j3329l4820N597J1215K0450K7931
11467E03407k452k5257J249P680J940Q912q724k942k2614k2239K2799J4754K0095
$$ plain form
11554 570220 590478 591068 562676 558933 547852 549082 550556 533915 559276 586032 601122 576556
11542 576556 540603 514982 508997 499939 505100 531186 511157 517986 506904 520346 508752 496601
11530 496601 508402 496189 515368 512208 501373 481491 490018 534659 526834 526091 519118 487911 467582
11517 467582 450550 463415 508779 506977 503753 521922 500095 486993 470130 469240 488532 491160
11505 491160 464739 440281 437234 449593 430623 441662 479718 467063 471680 461668 493850 487881
11493 487881 463779 461658 450658 439790 434641 438518 462260 457970 449391 444594 456067 452597 458779
11480 458779 464748 467280 484483 475053 477325 492593 486363 473034 438214 443811 455026 475476 503407
11467 503407 500955 475698 476947 484627 486567 495479 486755 483813 461199 438960 461759 476513 496608
11454D96608j3199k5029J5776j0480J3366J5595Q612l909j3597k9901l229Q010
11442D58623j706k9484l0967J4988L5035K3706K8143K3547k869j5930k3104j5319
11430D64663l051K6480k3032j9507J718o037Q807L543j401L321L313J830J8327
11417D78974j8709j8536Q890Q947j376J6086p445M156j6100j7907K7351L679K0762
11404D88772l3316j0259Q467J052Q461r834j5960l4181O197J9509n112j4389J293
11391D10700J0844J2604j3349R161l263r236L6641K1788K7349R413k3634j3082
11379D75936m856M429K5348J4589j6599k1086k7117l3025m2240l30K8297P423
11367D10769J1746K6465k1967m4978j1022K2836N3144J0430k50r677k0343P104
$$ plain form
11454 496608 483409 458380 474156 463676 477042 492637 501249 497340 483743 453842 450613 458623
11442 458623 456917 427433 396466 411454 446489 470195 498338 521885 519016 503086 479982 464663
11430 464663 461612 488092 465060 445553 447271 441234 450041 453584 452183 455504 458817 460647 478974
11417 478974 460265 441729 450619 459566 458190 474276 466831 470987 454887 436980 464331 468010 488772
11404 488772 455456 445197 453664 454716 463177 453343 437383 403202 409399 428908 423796 409407 410700
11391 410700 421544 434148 420799 429960 426697 417461 454102 475890 503239 512652 489018 475936
11379 475936 471080 475509 500857 515446 498847 477761 450644 417619 375379 375049 403346 410769
11367 410769 422515 448980 427013 382035 371013 393849 446993 457423 457173 447496 427153 434257
11355D34257J2068Q41j8016j4011K6116J0314k7257k7176J2575j994P91j0602
11343C97906k8994k555K0175O012K4237o36j7297k2086p35j4138L9950K110k2898
11330C81051L391K7186K4489O34n381J9769K5995k3572m2268Q847J2875j3750
11318D19266K718R772k428L409N198n74l405p957j9420Q203K5438M309j3396J0295
11304D41428Q238J6056J182Q802k7171k0339q67M227N173r741l1162j4132Q214
11291C89908K5342K9245j1062m0461J4906O620m9255o667k067J3229p051K0826
11279C83513J6936L4351M481j9555k502j0198J1477L2960k7478k8235k646J6533
11267D09637j3634K513r43n104L84k9585l7780K5646L0303j4118l397J0228K4991
$$ plain form
11355 434257 446325 447166 429150 415139 441255 451569 424312 397136 409711 407717 408508 397906
11343 397906 368912 366357 386532 392544 416781 416145 398848 376762 376027 361889 401839 403949 381051
11330 381051 384442 411628 436117 436751 431370 451139 477134 453562 411294 420141 433016 419266
11318 419266 421984 431756 429328 432737 437935 437361 433956 425999 406579 414782 440220 444529 431133 441428
11304 441428 449666 465722 466904 475706 448535 428196 427329 431556 436729 426988 395826 381694 389908
11291 389908 415250 444495 433433 392972 407878 414498 365243 358576 356509 369738 362687 383513
11279 383513 400449 434800 439281 419726 417224 407026 418503 451463 423985 395750 393104 409637
11267 409637 396003 398516 397573 392469 392853 363268 325488 351134 381437 367319 363922 374150 399141
11254C99141J0984j4222j9769J580j4437P495L211j2220j186L3224M7711J7738
11242D59250k2003l3506j4973j8634R140K5130O954j0660k1681j3439k4774K6076
11230C66880J4393r058r86M013O605k799l9772K146J5729J9620L98K554j021K0900
11216C99602p358l8736J8848J9281R707l451k1130L4740o01J6544O623K3977j4717
11203D43329m7046j0620k546M015O919J3295k5270l6740n125J856l608k2437j7174
11190B98848O820K6955K1140J631K0102j6370j3567j4798j87L838J2853L3489
11178C80754k3064n640K0272K5J2176m204J624k8020J82L718j7048M137M305J4701
11164C63918p287j1181O261J5781m005j7550K953K1724l895Q994J4534l588k6478
$$ plain form
11254 399141 410125 395903 376134 377714 363277 370772 373983 361763 360577 393801 441512 459250
11242 459250 437247 403741 388768 370134 379274 404404 411358 400698 379017 365578 340804 366880
11230 366880 381273 372215 371229 375242 381847 379048 339276 341422 357151 376771 377169 379723 378702 399602
11216 399602 392244 353508 372356 391637 401344 397893 376763 411503 410902 427446 434069 458046 443329
11203 443329 396283 385663 383117 387132 394051 407346 382076 345336 340211 342067 338459 316022 298848
11190 298848 305668 332623 353763 355394 375496 359126 345559 330761 330574 334412 347265 380754
11178 380754 357690 352050 372322 372347 384523 380319 381943 353923 354105 357823 340775 344912 349217 363918
11164 363918 356631 345450 351711 367492 363487 345937 348890 370614 366719 375713 390247 386659 360181
11151C60181j9913L2708j0627l6012P261J7841J4622K8257j1378j7579J119M86
11139C66966j7395K1746L9449J2084j4422j4288l4542j6025j1369L779K71j9712
11127C16542J662P255j216N944q175J0983K0431p38j2331l098L570L517K4470
11114C68816p122J1493K4657k9487j2901j6103J9219N207P736k4949L203L3052
11102C82821J5321J32j8509j7683k221P454N7655J9921m0063k1865K256K2179
11090D07398L9492k6149k8826j6611k1130J1756q872K0259L035J3204j913o794
11078C84849k4130r305M325k6964l0144J7089L8193L440n229j055p784K8051N688
11065C77024J3570k9853l3275K0745k560l4077k3028n985J6946J4551l359L5456
$$ plain form
11151 360181 340268 372976 362349 326337 333598 351439 366061 394318 382940 365361 366480 366966
11139 366966 349571 371317 410766 422850 408428 394140 359598 343573 332204 335983 336254 316542
11127 316542 318204 325459 324243 330187 322012 332995 353426 352688 340357 337259 340829 344346 368816
11114 368816 361694 373187 397844 368357 355456 339353 358572 363779 371515 346566 349769 382821
11102 382821 398142 398274 379765 362082 359861 367315 424970 444891 404828 382963 385219 407398
11090 407398 446890 420741 391915 375304 354174 365930 357058 377317 380352 393556 391643 384849
11078 384849 360719 351414 355739 328775 298631 315720 353913 357353 352124 351069 343285 371336 377024
11065 377024 390594 360741 327466 348211 345651 311574 288546 282561 299507 314058 310699 346155
11053C46155j023k6569j4919M892K3813J2249j0393j6332Q080K886j4893J7797
11041C31743L0318r329L128L1073k3934k4106J3242l13O195j7833Q726J1556N245
11028C65711m289j8511J2330K439K9841k838l8125n0511m254K6143j4564k2416
11016B80956J9893J6679J234k955p108m468p90J3969K3481N539m70J4404L283
11003C63647l8195l0676p448r670O594J3733K2768J1790l8377j697J9294J8632
10991C30395Q332J5051j4383k7590P808J1936K0350P794j6165k0368j3905O244
10979C15499R754L0155j697j1696o027k8282k6984J9381L969J3339j6980n880
10967B94551J0637k27K5207M2687J4756k0727k2493j4248r259K2125o266l3120
$$ plain form
11053 346155 345132 318563 303644 308536 332349 344598 334205 317873 325953 328839 313946 331743
11041 331743 362061 352732 355860 386933 362999 338893 352135 351822 358017 340184 348910 360466 365711
11028 365711 361422 342911 355241 357680 387521 384683 346558 296047 291793 317936 303372 280956
11016 280956 300849 317528 318762 315807 308699 304231 303441 317410 340891 346430 345960 360364 363647
11003 363647 325452 294776 287328 277658 284252 297985 320753 332543 294166 292469 311763 330395
10991 330395 338727 353778 339395 311805 319613 331549 351899 359693 343528 323160 309255 315499
10979 315499 325253 355408 353711 342015 335988 307706 280722 300103 304072 317411 300431 294551
10967 294551 305188 304961 330168 372855 387611 366884 344391 330143 320884 343009 336743 303623
10955C03623K553K0374K1292k375J4565m398k496r681k9976L327j898k213J6576
10942C29273L898j2733o720K5893J2364O733l1582j1693K6337J4265j5990k6538
10930C13507n745j7163j76K8541J7111l0604k0329J4705K5102j7976p978J4026
10918C13021J0379P960k6558k3446J795R707L1123J9746k2195j758k0000l4017
10906B65757j8278O896K0994J7396j7344k6849m995J8723j4105L50J1227J1978
10894B71750j457l867K2837J1181j9881J1039j8126k130j0508j3832R888L4148
10882B91042k432j0374m921J1028J4145Q766L372Q318J1644K284j8037j166j6387
10869B97282k5438N679O846k846J498q501J4904J3707l445J0219j1643l5309j521
$$ plain form
10955 303623 306176 326550 347842 345467 360032 355634 353138 343457 313481 316808 314910 312697 329273
10942 329273 333171 320438 313718 339611 351975 358708 327126 315433 341770 356035 340045 313507
10930 313507 307762 290599 290423 318964 336075 305471 285142 299847 324949 306973 298995 313021
10918 313021 323400 331360 304802 281356 283151 292858 323981 343727 321532 319774 299774 265757
10906 265757 247479 254375 275369 292765 275421 248572 243577 262300 248195 248545 259772 271750
10894 271750 270293 266426 289263 300444 280563 291602 273476 271346 260838 247006 256894 291042
10882 291042 288610 278236 273315 284343 298488 307254 310626 318944 330588 332872 314835 313669 297282
10869 297282 271844 277523 284369 281523 283021 274520 289424 303131 299686 309905 298262 262953 261432
10856B61432R103j11O382P398O143j075m663O137m1971k5010N942L9871J7995
10843B87573j6209J69J4488j6057O059L290p281k5036j3881J5316J8688L4771
10831C01890K920m822M914J9294j63l6271J3476m713k2131Q629J8055P140n129
10818C03089l2069R236K0896k0798k3415J2597J6372K275k1926J1578j2780k7494
10806B37561J8579L7811n948p788q341L429N461p729j387K425L487K5826p821
10793B95565J0691J862k993k8205J996L1099J1187k1273M404O975p522j7779j3251
10780B72756l1084j5282r947J1206L1627j8203q856J9672L5739K358j2826j0072
10768B67088L1618J0480j1545M794o811p429J4411K623k8334M990K1657k4581
$$ plain form
10856 261432 270535 270424 276806 284204 290347 289272 284609 290746 248775 223765 229707 269578 287573
10843 287573 271364 271533 286021 269964 276023 279313 272032 246996 233115 248431 267119 301890
10831 301890 304810 299988 304902 324196 324033 287762 301238 296525 274394 283023 301078 308218 303089
10818 303089 271020 280256 301152 280354 256939 269536 285908 288183 266257 277835 265055 237561
10806 237561 256140 293951 288003 280215 271874 275303 280764 273035 271648 274073 277560 303386 295565
10793 295565 306256 308118 305125 276920 278916 310015 321202 299929 304333 311308 303786 286007 272756
10780 272756 241672 226390 216443 227649 259276 241073 232217 251889 287628 289986 277160 267088
10768 267088 298706 309186 297641 302435 295624 288195 302606 305229 276895 281885 303542 278961
10756B78961m538P174p742k6179O978j7040l70J0032J371j9416J933J1144J2123
10743B54431K6271K5115J6907K537j5401j5480j7640N336J0325j5068q517N640
10731B74456j3907k1674K0824L9663K272l0394N08n167r802M623j5795r220N839
10718B42226K9752J1948l3212l8359J437J5395K2423j4440J2804J0536j7256k0614
10706B22640J3266m990K0573K8136J3197j2399j5836q332K941m682j2854j577
10694B40083J2375l0179J4439j4871j1815k174L1115J1559R651K3736p368j6435
10682B60116o901m160j7436N627J9269L3190O7m5662k7979k334j2957J833J4469
10669B17142M6211q35k1009q922J4316K2556J7618Q72k4037k9470m740K1172R147
$$ plain form
10756 278961 274423 281597 273855 247676 254654 237614 237244 247276 248647 229231 231164 242308 254431
10743 254431 280702 305817 322724 325261 309860 294380 276740 282076 292401 277333 268816 274456
10731 274456 260549 238875 259699 299362 301634 271240 271748 266581 256779 261402 245607 236387 242226
10718 242226 271978 283926 250714 212355 213792 229187 251610 237170 249974 260510 243254 222640
10706 222640 235906 230916 251489 279625 292822 280423 264587 256255 259196 254514 241660 240083
10694 240083 252458 222279 236718 221847 210032 207858 238973 250532 260183 283919 276551 260116
10682 260116 253215 249055 231619 237246 256515 289705 289772 244110 216131 213797 200840 202673 217142
10669 217142 263353 262518 241509 232587 246903 269459 287077 287949 263912 234442 229702 250874 260021
10656B60021j1627o487L520J7338J0197N168J3978j9491j0432J5466J6856J8627
10644C13134J222k8465j6888q00j1028j6003o212p287J3662p502j1531M964K3527
10631B50793k6033Q15Pk021J8528M1722J2169j2846N989J0442k662o81k0241m5283
10617B30698M961J0298j696M697N967j4434J5059O281J0294Q215j2711m180l178
10604B60271N626P759p071N585j9751J6712J024j0991p429n938P160J835p720
10591B47072k6327K3224J1731J3759j9675m476N090O922j724k2062k7077K7111
10579B33568K9738Q331k746j226O61r876j4825L437k6221k368L0578n572O388
10566B49867K2142J7180j9412o493j9270j9238Q91J8389L8125j2654m3299j7927
$$ plain form
10656 260021 248394 241907 245427 262765 272962 278130 292108 272617 262185 277651 294507 313134
10644 313134 314356 285891 269003 268203 257175 241172 234960 227673 241335 233833 222302 227266 250793
10631 250793 224760 225575 225582 223561 242089 283811 295980 283134 289123 299565 296903 296222 275981 230698
10617 230698 235659 245957 244261 248958 254925 240491 255550 261831 272125 280340 267629 263449 260271
10604 260271 265897 273656 266585 272170 252419 269131 270155 259164 251735 245797 252957 254792 247072
10591 247072 220745 243969 255700 269459 249784 245308 250398 257320 255596 233534 206457 233568
10579 233568 263306 271637 268891 267665 268326 258450 243625 247062 220841 218473 249051 243479 249867
10566 249867 272009 289189 269777 263284 244014 224776 225667 244056 282181 269527 226228 208301
10554B08301K7945J0141M303Q040K9233L824o278k2030J5777k263Q186K0317j4653
10541B90843r611k3830j3440j0058J9641K1953J2250k1148j6896N3173J7080l5610
10529B84347l5422N981q057L356q144M101M2415K3036j8992j4152J3065n551q656
10516B77327k027Q203l532R705k0758k3682J9453j657J4853K880J0247k2060j387
10503B67565N580q994k0667L665j383o474m424R128P351K0745L6881R787k1275
10490B97485R175J114k3169k2638J4754j6180M984J0781R66J3038k465r803J08
10477B78150j5299J480K3838J036m6622N035K9759L3127n023j8721m6545r374
10465B30841J2636N652J4855J9128K7757j5729l0216q017N334J0915n678P748
$$ plain form
10554 208301 236246 246387 250690 258730 287963 291787 285509 263479 279256 276993 285179 305496 290843
10541 290843 281232 257402 243962 233904 253545 275498 287748 266600 249704 302877 319957 284347
10529 284347 248925 254906 246849 250205 242061 246162 288577 311613 292621 278469 291534 285983 277327
10516 277327 275300 283503 279971 289676 268918 245236 264689 263032 277885 280765 291012 268952 267565
10503 267565 273145 264151 243484 247149 245766 239292 234868 243996 251347 272092 308973 318760 297485
10490 297485 306660 307774 284605 261967 276721 260541 265525 276306 277272 290310 287845 278042 278150
10477 278150 262851 264331 288169 289205 242583 247618 277377 310504 305481 286760 240215 230841
10465 230841 243477 249129 263984 283112 310869 295140 264924 256907 262241 273156 267478 275226
10453B75226J7988o877p07l148l281k3130L765j4724k5861J3588J2204K8575Q984
10440B82602n743j1759j4812J0820j7000Q781J3436n49K7370k655L833l31k7915
10427B66078j4255O034L3348j1564j3862M463j3533J4188q781j9240N163J2154
10415B60193Q010K6567j683k5152r897K6507J1168k925J0179q68j2779k2047J7065
10402B84338J7467O078J6053J6609M730j1747k59o111j6282j2654j0256J3940
10390C01906J1192j6526K252O493K1104K7457J5942l6719l5517j9722O0J2773
10378B90695O409N776K9670J5540k4750k0029q367j0989j4444J2526L0543J195
10366C13775k0701K5631R916J805N681r8q497l8383k7056j911K7930p214L735
$$ plain form
10453 275226 293214 286337 285630 282482 279201 256071 259836 245112 219251 232839 245043 273618 282602
10440 282602 276859 265100 250288 261108 244108 252889 266325 265776 293146 290491 294324 293993 266078
10427 266078 251823 257857 291205 279641 265779 270242 256709 270897 262116 242876 248039 260193
10415 260193 268203 294770 293087 267935 258038 284545 295713 292788 302967 302099 289320 267273 284338
10402 284338 301805 307883 323936 340545 345275 333528 333269 327158 310876 298222 287966 301906
10390 301906 313098 296572 298824 305317 326421 353878 369820 333101 297584 277862 277922 290695
10378 290695 297104 302880 332550 348090 323340 303311 294944 283955 269511 282037 312580 313775
10366 313775 293074 318705 328621 330426 336107 336009 327512 289129 262073 260162 288092 280878 284613
10353B84613K8407n327J6874J5795p882P915j6530m438J7244L2535N005J3802
10341C88013J8561k112L0949L1504M4877Q3397O3646O5560O8301O608M630L0946
10329H34880k6972l9197m4965o3340n2732l0611m3075k7496l4506n1485N86j6947
10317D04140j136n913R755O770m045O347k880j1426Q334q387o971J153k5630k2430
10303C47681J0157O2222L3828r383k4360j2690J8049j8031j0899J0294q476p997
10291C90395P4n065J0168j2115j7890K5736K4129m092j3900k0068K6438J9992
10279D23802O044k7429N997r512j176k714J1173M494L434J2939K6652l983j9804
10266D29917j6487J7322N999o921K786j701K603N422j4848l477J1600M858j671
$$ plain form
10353 284613 313020 307693 324567 340362 332480 340395 323865 319427 336671 369206 374211 388013
10341 388013 406574 404462 435411 466915 511792 595189 658835 724395 792696 799304 803934 834880
10329 834880 807908 768711 723746 660406 607674 577063 533988 506492 471986 420501 421087 404140
10317 404140 403004 397091 406846 413616 409571 415918 413038 401612 409946 401559 394588 395741 370111 347681
10303 347681 357838 420060 453888 444505 420145 407455 425504 407473 396574 406868 398392 390395
10291 390395 390469 385404 395572 383457 365567 391303 415432 411340 397440 377372 403810 423802
10279 423802 429846 402417 408414 398902 397726 395012 406185 410679 414113 427052 453704 449721 429917
10266 429917 413430 430752 436751 429830 432616 430915 433518 438940 424092 420615 432215 437073 435402
10253D35402j0622K9296O85j3930k4949j1721J023j343J0876j1986n550J8971
10241D16152M4279L51n663j4408j0985p96R679k994l98J1503K413J0372J4991
10228D74496J268j7103P158J2380L080L061j8089Q775K9762K2793m976R035J2807
10215E44447J0776k7186j5739J650J4031L830o451k9030m5435R005J1744Q938
10203D80580K3844K4899R855l4227j8851J013R901J3061j3072k2850l2855J0186
10191D51484K8454K3086K902n39J9280K9560P755k6208k9095q262K7785J9410
10179E45612K7555o353r574j725L786J0440l0300j0777K593j3849J7664J3843
10167E48915K0663J660K1508R350k197k3110J0932k179m176J5908J0076j9353
$$ plain form
10253 435402 424780 454076 454761 440831 415882 404161 405184 403841 414717 402731 397181 416152
10241 416152 460431 460782 455119 440711 429726 428930 438609 435615 435217 446720 449133 459505 474496
10228 474496 475764 458661 465819 478199 481279 484340 466251 475026 504788 527581 522605 531640 544447
10215 544447 555223 528037 512298 513948 527979 531809 525358 496328 450893 459898 471642 480580
10203 480580 504424 529323 539178 504951 486100 487113 497014 510075 497003 474153 441298 451484
10191 451484 479938 503024 505926 505387 524667 554227 561982 535774 506679 498417 526202 545612
10179 545612 573167 566814 557240 555515 559301 569741 539441 528664 531257 517408 535072 548915
10167 548915 569578 571238 592746 602096 599899 576789 587721 585542 581366 597274 607350 587997
10155E87997j3882J1954J3121J8564k3608k5578J3251R677J4001J3310k658k2389
10143E93760l2762J5895M5374M9637q972q412j6585j0601K8440K0650j3947l69
10131F62108R209m366n367K6673L5320j0786l7084k2343M582J2640Q083j2655
10119F66014j5672K4104J5802M989K7567l971j0018j071j5689j2618J3038K7778
10107G20253J8477J5197p558j6785Q4j5597k2694n987P408Q891L326k625j3675
10094F88715M280J1579j6171J683L114K5855J2041r942j2385r02P146N999J1307
10081G32319J9507M722K549o338j6393J2456P349O79K836P194R271K834K7208
10068H06193J3571o787j0006J9627l177J2302L3246M100n4817j6418J2611J9760
$$ plain form
10155 587997 574115 586069 599190 617754 594146 568568 581819 591496 605497 618807 616149 593760
10143 593760 560998 576893 622267 671904 662932 654520 637935 627334 655774 676424 662477 662108
10131 662108 671317 666951 661584 688257 723577 712791 675707 653364 657946 670586 678669 666014
10119 666014 650342 674446 690248 695237 722804 718833 708815 707744 692055 679437 692475 720253
10107 720253 738730 753927 746369 729584 729668 714071 691377 685390 692798 701689 705015 702390 688715
10094 688715 692995 704574 688403 690086 693200 719055 731096 721154 708769 707867 715013 721012 732319
10081 732319 751826 756548 759097 752759 736366 748822 756171 756850 759686 766880 776151 778985 806193
10068 806193 819764 812977 802971 822598 819421 831723 864969 869069 814252 797834 810445 830205
10056H30205K24O975N942M583P325L3024L3602L2826Q6473J43710O3805o1511
10044A187183j03190n6467k2770J0433l1177k7566k0896J1690K7406p712l1950
10033I34984j3436m273L982J1166J0264Q216K5167J0235K674j3998k3498k988
10021I48495J9348K5649J6954j5298k4677n757L0196K8691q152j7946k1840R350
10009I85013K1269J6249O810j5094k1229n638m685J0501q87p179k152L0138K5347
9996A038463j6229r347p452j986m878Q483N576L010K1595j1086j9531q864K4086
9983A021840K4213J025j855K35j2072M303J2456L4155N344j2352R474J0091q51
9970A096006k1722j6628J0030r917Q397q089K2848M9293N455k5921m9634j5039
$$ plain form
10056 830205 830429 837404 843346 847929 855254 888278 921880 954706 1041179 1184889 1248694 1187183
10044 1187183 1083993 1027526 1004756 1015189 984012 956446 935550 947240 974646 966934 934984
10033 934984 921548 917275 921257 932423 942687 950903 976070 986305 988979 974981 951483 948495
10021 948495 967843 993492 1010446 995148 970471 964714 994910 1023601 1015449 997503 975663 985013
10009 985013 1006282 1022531 1029341 1014247 993018 987380 982695 993196 992309 985130 982978 1013116 1038463
9996 1038463 1022234 1012887 1005435 1003449 998571 1007054 1012630 1015640 1037235 1026149 1006618 997754 1021840
9983 1021840 1046053 1047078 1045223 1045458 1033386 1037689 1050145 1084300 1089644 1077292 1086766 1096857 1096006
9970 1096006 1074284 1057656 1067686 1057769 1066166 1058077 1080925 1130218 1135673 1109752 1060118 1045079
9958A045079J077J2091K1411J6383J5564P017k154j2302j7692l85N053K3753k9473
9945A085422k9280k793K0576K5667N868N509N83L6076k339O74j420r121n53Q257
9931A143126m928K483k8507j2782K6941j2550l6665N624N4066j022O933O472J8700
9918A167891L616k8354k8625J6589J6666l332j5481k8722j2487o024R526K1746
9906A113009n779k0808j7779j2763N63J4880p917J6153K2880o263k6529P822J0109
9893A087578n619q308j1384o698J5815K2889Q972r080M003J4667j964j6206k1315
9880A073350l522j1296k6598k8143j453J0196M362p634o153J2874j0314J4879
9868A020548l713J1498L2654j4475K004k490L078k1709k5558J9180P813Q611j2566
$$ plain form
9958 1045079 1046156 1058247 1079658 1096041 1111605 1118622 1116468 1104166 1086474 1086089 1091142 1114895 1085422
9945 1085422 1056142 1053349 1073925 1099592 1105460 1110969 1111552 1147628 1145289 1145963 1144543 1135422 1134869 1143126
9931 1143126 1138198 1140681 1112174 1099392 1126333 1113783 1077118 1082742 1136808 1135786 1142719 1149191 1167891
9918 1167891 1171507 1143153 1114528 1131117 1147783 1144451 1128970 1100248 1087761 1081737 1091263 1113009
9906 1113009 1107230 1086422 1068643 1055880 1056443 1071323 1063406 1079559 1102439 1096176 1069647 1077469 1087578
9893 1087578 1081959 1073651 1062267 1055569 1071384 1094273 1103245 1094165 1098168 1112835 1110871 1094665 1073350
9880 1073350 1069828 1058532 1031934 1003791 1002338 1012534 1016896 1009262 1003109 1015983 1005669 1020548
9868 1020548 1016835 1028333 1060987 1046512 1048516 1046026 1049104 1027395 1001837 1021017 1028830 1037441 1024875
9855A024875l5865K168j7518k7174r715N110M244L6073J3639j4375j0924j0034
9843I60504o395J0414o490r070m508j09n771J0245K671m476P252m016K779m6471
9829I06559k6601J9767L1761J498J0835j8195l0947j1051k0324N205K1747P436
9817H97690l370P180J245k2433J02j8263k0273J3483J3142P507Q95o016j9901
9804H50988j9947r91p2J1575J345J5087j422m0153l4567R171R166L094L697Q6
9790H07057p276o341q7m238K04l8733l1794J723N415N120j1593j6945q674L8007
9776G31845K3285k6544r000J1725k5179P498q206j2302J2363j6392J1858J5230
9764G16181M931J1013p463l0337M690j1398j6789J6159J0006k2145j5785j2568
$$ plain form
9855 1024875 989010 991178 973660 946486 936771 941881 946125 982198 995837 981462 970538 960504
9843 960504 954109 964523 958033 948963 944455 944346 938575 948820 951491 947015 954267 950251 953030 906559
9829 906559 879958 899725 931486 932984 943819 925624 894677 883626 863302 868507 890254 897690
9817 897690 894320 901500 902745 880312 880414 862151 841878 855361 868503 876010 876905 870889 850988
9804 850988 831041 830050 829978 841553 842898 857985 856563 816410 781843 791014 800180 803274 806971 807057
9790 807057 799781 793440 793353 789115 789319 750586 718792 720515 725930 731050 719457 702512 693838 731845
9776 731845 755130 728586 719586 731311 706132 713630 705424 693122 705485 689093 700951 716181
9764 716181 721112 732125 724662 694325 699015 687617 670828 686987 696993 674848 659063 646495
9752F46495R000K7613L2721Q386j9333k0577k1164J2751j0946q567j7004j6129
9740F23246p070J4807K3607n212j8085k1228M731J0513j8118p670M1350K457p642
9727F35686o96j5996K754j7537J0119K003r66j2159o423p832k0312J4006n893
9714E76754K827Q391K172J6472j3443j1300p478q917j5575k7350j1178P963N495
9701E24833P379j0752J326J2794J5L269L175k1293P074k244P215l576k5290o993
9687D96932Q748J4363J21r42K2846L119N353J496l0052R205L407j7130l0396Q046
9673D95116J2846K398P215n096j7655J4020K1259J5741k4107l0155r72j832j5486
9660D73292K1377L7893k1525m1327k1126p134K0203o623j6944k2360n425J0645
$$ plain form
9752 646495 655495 683108 715829 724215 704882 684305 663141 675892 664946 656379 639375 623246
9740 623246 616176 630983 654590 649378 631293 610065 614796 625309 607191 599521 640871 643328 635686
9727 635686 634990 618994 621748 604211 614330 616333 615367 603208 596785 588953 568641 582647 576754
9714 576754 579581 587972 590144 606616 593173 581873 574395 565478 549903 522553 511375 519338 524833
9701 524833 532212 521460 522786 535580 535595 538864 542039 520746 527820 525576 532791 529215 503925 496932
9687 496932 505680 520043 520164 519222 542068 545187 550540 552036 521984 531189 534596 517466 487070 495116
9673 495116 507962 510360 517575 512479 494824 508844 530103 545844 521737 491582 490610 488778 473292
9660 473292 494669 532562 511037 469710 448584 441450 461653 455030 438086 415726 410301 420946
9648D20946K4563J1319j89l2739N712L6522K424m2413l5861o822J1836K6497O401
9635D28196j1376j3573j1964j0156J0208J5993N248L7004N628k4404j2461j7240
9623D01103k444K8796J7814j6078K391k238j1044J960P520J203K2558m472j3403
9610D33666j9723n0290N862K3969K7357k6j1139o818q404l701m214k797M207j8302
9596C69647k886j1272l179Q740j68o941O360J6320K2260k6947j2066n890k821
9583C51157J9468J1772n014p768j5264j9215J9243K0971p161r612j3254J837k361
9570C44799O154J6854N494R953J0589j769j5944j1041l0079l1298N702P193l816
9557C12791O853J6223Q273Q085l091k9297q393J2451K6083J5637k0082l7075J6451
$$ plain form
9648 420946 445509 456828 456639 423900 429612 466134 468558 426145 390284 383462 395298 421795 428196
9635 428196 416820 403247 391283 381127 391335 407328 412576 449580 455208 430804 418343 401103
9623 401103 398659 427455 445269 429191 431582 429344 418300 420260 427780 428983 451541 447069 433666
9610 433666 413943 363653 369515 393484 420841 420815 409676 402858 394454 390753 386539 383742 387949 369647
9596 369647 366761 355489 352310 361050 360882 353941 360301 376621 398881 371934 359868 353978 351157
9583 351157 370625 382397 377383 369615 354351 335136 354379 375350 368189 358577 345323 347160 344799
9570 344799 350953 367807 373301 383254 393843 392074 376130 365089 335010 303712 309414 316607 312791
9557 312791 319644 335867 344140 352225 349134 319837 311444 323895 349978 365615 345533 308458 324909
9544C24909j0024j7400n972J2798j513j5978j986j3160j4295M2146L2194q111
9532C23608P135R875k6632p60r307n095O948J8127N735j0705j0930j1236q810
9519B87953n979r912R874J4865J3300J1592j9047O98L0565m030K659j2680k1133
9506B98725j8743j6371J4771J8633J4462j4425j2110k5644K8534K0142j9286J3100
9494C01788J1709l7524N468M043r047J0721J0931j3060Q935j4768l94l706J5975
9481B91071l1994m1406o378L9457L7283L1136M816k4919m606J7895J1877j4565
9469C09667K639R809j4005j2631k0451l572N29l430J0660j0006k3722J5232k92
9456B60427M6770M789k2671j9533m712o7J0699L7024l870k8202k7646q958L1838
$$ plain form
9544 324909 314885 297485 291513 304311 302798 286820 284834 271674 257379 299525 331719 323608
9532 323608 330743 340618 313986 313226 303919 298824 305772 323899 329634 318929 307999 296763 287953
9519 287953 281974 272062 281936 296801 310101 321693 302646 303344 333909 329879 332538 319858 298725
9506 298725 279982 263611 278382 297015 311477 297052 284942 259298 287832 307974 288688 301788
9494 301788 313497 275973 281441 285484 276437 287158 298089 285029 293964 279196 278802 275096 291071
9481 291071 259077 217671 211293 250750 288033 319169 323985 299066 294460 312355 324232 309667
9469 309667 312306 322115 308110 295479 275028 271456 271985 268555 279215 269209 245487 260719 260427
9456 260427 307197 311986 289315 269782 265070 265003 275702 312726 308856 280654 253008 244050 275888
9443B75888K1390K06j7141k639j5951J189j1189J5170L747m358j680j2122q709
9430B43801M989j0525K5005J6563K301Q324J9648n4o941j9744l3410J6573O162
9417B72692k5621j7888K1394m739j7599q513J3436L2623m408j8547J5411l885
9405B54356m75k3273k6200j919K3628J3281J844J9031J6533k2999k0058J7269
9393B51018k530l1898l554L4715k898o849J0263R629j2502l4341K8173k2280Q404
9380B25350R139K97q255k1418J9550J0713J7684p217r346O844J7845J710l5283
9367B27613j6765K7026L3036j6514k4168L354m4536l5855R700j0021L821K8990
9355A85681J3712J0384n541j2160Q219K1916p036O228L086j0846j5296J4112m619
$$ plain form
9443 275888 297278 297484 280343 277704 261753 262942 251753 266923 270670 266312 264632 252510 243801
9430 243801 248790 238265 263270 279833 282134 290458 310106 310052 303111 283367 249957 266530 272692
9417 272692 247071 229183 250577 245838 228239 219726 233162 265785 261377 242830 258241 254356
9405 254356 253881 230608 204408 202489 226117 239398 241242 260273 276806 253807 233749 251018
9393 251018 248488 216590 213036 247751 244853 238004 248267 257896 245394 211053 239226 216946 225350
9380 225350 234489 234786 226531 205113 224663 235376 253060 245843 236497 243341 261186 262896 227613
9367 227613 210848 237874 270910 254396 230228 233582 189046 153191 162891 152870 156691 185681
9355 185681 199393 209777 204236 192076 200295 222211 215175 221403 224489 213643 198347 212459 207840
9342B07840J7707P078J0631m691P478k7167k0267o171Q324j4504J1250m732K0350
9329B13126L4693k6299l0372O492L5467L0820j0600k7695k3744J2433J0855q457
9317B16719q638L770p998j1953k887N171J4458J2291Q376J2695K0149M046j8899
9304B47300k7505k177K6258J9259o982j3427Q545j1144k986J1414K3003o923O294
9291B70929k3134m9623J2073O04J6297J2589j5010m706j532j0191k1815k1010
9279A65471J9592J6545J2696q345j3349J183J4269j441l2749P683r689l6186l311
9266A32369L2725L7252p277k4019K0608L9216k6378m4706P20j9594N530L2702
9254A79148K5298J0773K1855j4862k0337N131P531k5116N35L635k2968q37J4930
$$ plain form
9342 207840 225547 232625 243256 238565 246043 218876 198609 192438 200762 186258 197508 192776 213126
9329 213126 247819 221520 191148 197640 233107 263927 253327 225632 201888 214321 225176 216719
9317 216719 208081 211851 203853 191900 189013 194184 208642 220933 229309 242004 262153 266199 247300
9304 247300 219795 217618 243876 263135 256153 242726 251271 240127 237141 248555 271558 264635 270929
9291 270929 247795 198172 210245 210849 227146 239735 224725 220019 218487 208296 186481 165471
9279 165471 185063 201608 214304 205959 192610 193793 208062 206621 173872 181555 171866 135680 132369
9266 132369 165094 202346 195069 171050 191658 230874 204496 159790 160510 140916 146446 179148
9254 179148 204446 215219 237074 222212 201875 207006 214537 189421 189956 193591 170623 169786 184716
9241A84716J1513L0931j7777l6642K5261K210j1275n922Q741P012Q519j4090J6026
9228B09223q912k2857O790K3407j4229j2487j18L2827k4824l1015l707K3254J6765
9215A94117m3306k5778J226L9277O102k7921J610q37K3566K1007n948q24j7456
9202A64835J4894K3576j4743j8687o232j7588J9028K6951J4837l022J4153p314
9190B10688J0493K3870j0700k1938j0007k088n622j0790k3983j9246p429N08J2896
9177A46652m986J9774M709J6460J4014j7748k7748J5821q02n548K578R582K052
9164A74810l033l674l868k4206O076K1475r39J5426j1757j6283j7147p57Q470
9151A44593J2208P067k3674q307j6637N687K5009K0414L883K4556M076k2881j0114
$$ plain form
9241 184716 196229 227160 209383 172741 198002 200212 188937 183015 191756 198768 207287 193197 209223
9228 209223 200311 177454 184244 207651 193422 180935 180817 213644 188820 157805 154098 177352 194117
9215 194117 150811 125033 126259 165536 171638 143717 145327 144490 168056 189063 183115 182291 164835
9202 164835 179729 203305 188562 169875 163643 146055 165083 192034 206871 203849 218002 210688
9190 210688 221181 245051 234351 212413 202406 200318 194696 183906 159923 140677 133248 133756 146652
9177 146652 141666 161440 166149 182609 196623 178875 151127 166948 166146 160598 163176 172758 174810
9164 174810 171777 168103 164235 140029 146105 167580 166641 182067 170310 154027 136880 136123 144593
9151 144593 156801 163868 140194 131887 115250 120937 145946 166360 170243 194799 198875 175994 165880
9138A65880j2435o923m917J3772o884L974R918K6077k009j0176L460p036k4976
9125A47725O178K0555j3487m0984J4355M3686p485m859J6148L135P109j1577j0525
9112A69974K806M440N389L677j4649k8667k1532K5912K2597j1155j5512J8984
9100A62264K1303j0306k4804J4049J5343p722R071J4567N350j2250j5244q4j184
9087A70353J0205J117J684M671k2881j2806o374k556p787L929K9132J8403N569
9074A92659m9676k3658j5127O582J6770J7397Q785j9726N377J2002M771l768L0629
9061A83017l103l0428P299J9347J2396k186k6681l6617j5189j4413J2073K2152
9049A27667K0290R677r61k042J6865P06k1049J5305J320j0031k228j1485l312
$$ plain form
9138 165880 153445 146522 141605 155377 148493 152467 162385 188462 186453 176277 179737 172701 147725
9125 147725 153903 174458 160971 119987 134342 178028 170543 165684 181832 184967 192076 180499 169974
9112 169974 172780 177220 182609 186286 171637 142970 121438 147350 169947 158792 143280 162264
9100 162264 183567 173261 148457 162506 177849 170127 179198 193765 199115 186865 171621 171537 170353
9087 170353 180558 181675 183359 188030 165149 152343 145969 143413 135626 139555 168687 187090 192659
9074 192659 142983 119325 104198 110780 127550 144947 153732 134006 139383 151385 156156 152388 183017
9061 183017 179914 149486 156785 176132 188528 186342 159661 123044 107855 93442 105515 127667
9049 127667 147957 157634 156673 154631 171496 172202 151153 166458 167778 157747 155519 144034 140722
9036A40722q010l6268l381M6408L0937n13k6401p951k1283r392l662K1087M2617
9023A64910j818k8339q511m218j1605J0271M0565O293k6795k2864K9397m720J818
9010A44384k9652k56j9780k999M9895K3334L649l0895j2540N710M3914j9903l4648
8997A20213R601j3106N939M1044R050r573j3313L780J1566L730j2247O97l791
8984A53590j7852R24L375P092Q593q974j9037k7627M834J6931J8537j8785p916
8971A13685j4413J1822j915r880L7232M6676k580l4387K14J4950l5301k4501N763
8958A07365N980O770K728J899O557P924K0020R917O110K152L1763R884k7964l2605
8944A58500j3856k6813j4675M480O412O843L390n214o624m836j202l855k542J2356
$$ plain form
9036 140722 132712 96444 93063 139471 170408 169895 143494 135543 114260 104868 101206 122293 164910
9023 164910 163092 134753 126242 122024 110419 120690 161255 167548 140753 117889 147286 142566 144384
9010 144384 114732 114476 94696 91697 141592 164926 168575 137680 125140 130850 174764 154861 120213
8997 120213 129814 116708 122647 163691 172741 163168 149855 153635 165201 168931 156684 157381 153590
8984 153590 135738 136662 140037 147129 155722 146748 127711 100084 104918 121849 140386 121601 113685
8971 113685 99272 111094 109179 99299 136531 183207 180627 146240 146454 161404 126103 101602 107365
8958 107365 113345 120115 122843 124742 131299 139223 159243 169160 175270 177422 209185 219069 191105 158500
8944 158500 144644 117831 103156 107636 114048 120891 124281 119067 112443 107607 106405 102550 100008 112364
8930A12364J1924R189J1909O545J4691J984j4371j1492j460j5968j4946J3434
8918A23803J7446j9607M0947J0169j5245j2373j7138j1984J1102P687k1059O933
8906A20681j5530l879P476o508P637L7337K7040j4340l9589j7771k972J1733j241
8893A10074M208L128r228p268K5821J4737k072O334j2023l958q068K2352m594
8880A39443n035N551j0445Q503j2689J7714n421j770j2094k575J3985M4232n225
8867A74174k6146q22q066m677r08P456l026j9824J2196k1294o510J3379L074j4855
8853A04151J1034j1641R36R833K1718j914j2549J5058j1003J8885K9191j2365
8841A61334J6926j3982k1041k2279k1214O815M917J5455R555K583J8502l740j4954
$$ plain form
8930 112364 124288 133477 145386 151931 166622 168606 154235 142743 141283 125315 110369 123803
8918 123803 141249 121642 162589 172758 157513 145140 128002 116018 127120 134807 113748 120681
8906 120681 105151 101272 108748 102240 109877 147214 174254 159914 120325 102554 99582 111315 110074
8893 110074 114282 117410 108182 100914 126735 141472 139400 145734 133711 129753 121685 144037 139443
8880 139443 134408 139959 129514 138017 125328 143042 137621 135851 123757 121182 135167 179399 174174
8867 174174 148028 147206 139140 134463 133555 141011 137985 118161 130357 109063 102553 115932 119006 104151
8853 104151 115185 103544 104480 114313 136031 134117 121568 136626 125623 144508 173699 161334
8841 161334 178260 164278 143237 120958 99744 106559 111476 126931 136486 139069 157571 153831 138877
8828A38877j878J2421j2071o937k943k1960j974J0683j1765j659j5094l409k1947
8815F0344j6880K5121J4071J1139j4344K3270J6993J3487j0010K2697N227k684
8803A48431j7259k9171k7782j6291K8493J2459j396R318J3341J1274n72k0555
8791A10290K4153K9928k108m788n703K8841J6271k6j8653k8964k7600J7985j6491
8778A23135n30q707R311p626k7602l457Q714o14k1748k4083R397K221K8245J0319
8764I6975k438J044J0748L573MK6671R329j4351j5125m860L7436J5904J3397o685
8750A71622k612k508j899k9142j3541j5099j369K0326J4470J3266L923R657k3786
8737A43308r897L615k793P117r593k0120P607J5551j2717l2991J8011J4843q370
$$ plain form
8828 138877 136999 149420 137349 130412 127469 105509 103535 114218 102453 100794 85700 82291 60344
8815 60344 43464 68585 82656 93795 79451 102721 119714 133201 123191 145888 151115 148431
8803 148431 131172 102001 74219 57928 86421 98880 97484 106802 120143 131417 130845 110290
8791 110290 134443 164371 162263 157475 151772 180613 196884 196858 178205 149241 121641 139626 123135
8778 123135 122605 113898 123209 115583 87981 84524 93238 92624 70876 46793 56190 58411 86656 96975
8764 96975 94537 95581 106329 109902 109906 136577 145906 131555 116430 111570 149006 164910 178307 171622
8750 171622 169010 166502 164603 135461 121920 106821 105452 125778 140248 153514 157437 167094 143308
8737 143308 133411 137026 134233 141350 131757 111637 119244 134795 122078 89087 107098 121941 113571
8724A13571R390J4777j0599p56J4325L713J5830J1593m1075k2990p100j179K1573
8711A21073J1278L5288K5904L4945P275j7658m7177k2751j6088j1449p667K836
8699A15809J2101j6925n236j439K5409K1419J2218n1477l2457J9957J2440o537
8687A05282M32J1572n384J0437R196P4k232j7852J6341P837l767r278k8936k0358
8673G3364J0756M8517p068p993j3392P692P975J1056K3462J8500n836m565O018
8660A68486j4810l2670k3168l135J4658K7696Q451k305j4177j7278J1817M211
8648A27776k5867k5768J1599j1255j2692M9592K8567p598P263n139J2481r253
8636A39706k6068j9007n17L0696J2281p245n777k8578N602K2932p052j645j2051
$$ plain form
8724 113571 122961 137738 127139 126383 140708 144421 160251 171844 130769 107779 100679 99500 121073
8711 121073 132351 167639 193543 228488 235763 218105 170928 148177 132089 120640 112973 115809
8699 115809 127910 110985 105749 104310 129719 151138 163356 111879 79422 99379 111819 105282
8687 105282 105714 117286 111902 122339 131535 131609 129377 111525 127866 135703 131936 122658 93722 73364
8673 73364 84120 132637 125569 117576 104184 111876 119851 130907 154369 172869 167033 162468 168486
8660 168486 153676 121006 97838 94703 109361 137057 145508 143203 129026 111748 123565 127776
8648 127776 101909 76141 87740 76485 63793 113385 141952 134354 141617 136478 148959 139706
8636 139706 113638 94631 94114 124810 137091 129846 124069 95491 101093 124025 116973 115328 103277
8623A03277j7744n463R440J9039j1913j3802k3653J7135K8422K7339l733n5176
8611G3168k088L542K7514J4547J7769o404j6453j846J2897K5325j334j4225q078
8598A24334M548k0043k8776k2586J1424J0625J9230K9956J6765q945j2356j4475
8586A09701k2426L949J7863J8008p718J7228P508R302n92j4396K318J6897k2j1182
8572A46438k0346j2408j8239J77j0921k996L383o966j4389j1945J5878J7073J468
8559H6207J020N107J8794K5071r278j1893J9399N293n350k8312j1421K9006J6690
8546A40333N172k2844k5875L9433M8870j8748P174q755j1560k2656k6455K3566
8534A27655L0044j9853k7652K096L2622M468o001j3809M731j7092k3553k3418
$$ plain form
8623 103277 85533 80070 89510 108549 96636 82834 59181 76316 104738 132077 128344 73168
8611 73168 71080 74622 102136 116683 134452 128048 111595 109749 122646 147971 146637 132412 124334
8598 124334 128882 108839 80063 57477 68901 79526 98756 128712 145477 136532 124176 109701
8586 109701 87275 91224 109087 127095 119377 136605 144113 153415 152823 138427 140745 157642 157620 146438
8572 146438 126092 113684 95445 95622 84701 81705 85088 78122 63733 51788 67666 84739 86207
8559 86207 87227 92334 111128 136199 126921 115028 134427 139720 134370 106058 94637 123643 140333
8546 140333 145505 122661 96786 136219 185089 166341 173515 164760 153200 130544 104089 127655
8534 127655 157699 137846 110194 112290 144912 149380 143379 129570 134301 117209 93656 70238
8522G0238j9738L863K8861J403l7185J9763J6364j4190J3056q122J9512Q526j2632
8509H9719k0168J9022L1470K094j2314j8693M639J1966J3369k9354J0908K3192
8497A25850J6230j6585k1701l585N738J2247j1820k0252k7986J2625M615p92L3123
8484A07707J7251j5472l0972J0626J4537j7024L945j6245k1140o548J2593k4452
8472C4806J4710J4879k3787l955J7646K3650n361j9820q911L5041J9630l735J1900
8459A06693m760j7560q9q442k1409K1367K8816J2330m836k3735Q835J6958p822
8446A06346M458k855k1929j9784N601k0967l820O244l507N489K2976k1549l4034
8433B2669J0631L4838K875j0145N799M946p456j0031l680P244j1042O427J7570
$$ plain form
8522 70238 50500 54363 83224 84627 47442 67205 83569 69379 82435 74313 93825 102351 89719
8509 89719 69551 88573 120043 122137 109823 91130 95769 107735 121104 91750 102658 125850
8497 125850 142080 125495 103794 100209 105947 118194 106374 86122 58136 70761 75376 74584 107707
8484 107707 124958 109486 78514 89140 103677 86653 90598 74353 53213 46665 59258 34806
8472 34806 49516 64395 40608 36653 54299 77949 72588 52768 43857 78898 98528 94793 106693
8459 106693 101933 84373 84284 75842 54433 75800 104616 116946 112110 88375 97210 114168 106346
8446 106346 110804 107949 86020 66236 71837 50870 47050 53294 49787 55276 78252 56703 22669
8433 22669 33300 68138 71013 60868 66667 71613 64157 54126 50446 57690 46648 53075 70645
8420G0645j5607n600J0628m558L386K3004j7960j736k95q65J1208j2318J9331
8407G9263J0450O407q716j1997k3940J4441L3930M632j6937p399k3919r244K606
8394D9577L2741J5155J8477J5858l097l2859o240N691j149j9449l0955j2034J1565
8381D3281K9020L538j3859k8608N59J5752k312J9402J8695k4893m393K8258J5894
8368A00334J1226k3185k9563J6785j5865q288j5857q694K2260J5292K6959K7996
8356A19400j7532N088p16q896M341l76k015o893L864n018m516N850l414k7635
8342F1532l4415J0236R365M318R51j1651j1232J588J3859K8430L8587j4398K885
8329A00055J8134j5842p584j987L38j5876m5173k9119R628K9999K5938K3931Q157
$$ plain form
8420 70645 55038 49438 60066 55508 58894 81898 63938 62202 61907 61042 72250 59932 79263
8407 79263 89713 96120 87404 75407 51467 65908 99838 104470 87533 80134 56215 46971 49577
8394 49577 82318 97473 115950 131808 128711 95852 89612 95303 94154 74705 43750 31716 43281
8381 43281 72301 75839 61980 33372 33931 49683 47371 66773 85468 60575 56182 84440 100334
8368 100334 111560 88375 58812 75597 59732 51444 35587 26893 49153 64445 91404 119400
8356 119400 101868 106956 106240 97344 101685 101309 99294 92401 96265 91247 86731 92581 89167 61532
8342 61532 27117 37353 46718 51036 51987 40336 29104 30692 44551 72981 111568 97170 100055
8329 100055 118189 102347 94763 92776 93114 77238 32065 2946 12574 42573 68511 92442 100599
8316A00599m178J5885q102k4335m336J3391R406j7425j7177k4783j7063J5277
8304C7159l42j5299J4794m940k089M423J6762R577N852o370q293J5729l767j2072
8290E1124j430M0789K6949J466j8739m7428J7144O543n471r77r112j5911k0403
8277B4544O335K2627K1814R944k174L991n765P695N622Q794j4460j7097J1494
8264H3364K236j7635j7685N109k4598J0194j3942Q341L8788J1203K9204k32k4945
8251H9402r027j4707m851J6997O446K0354O573j2213N936k4597P573K746j0994
8238G9638r528k0604o012J0518L240l5872K0555L2815j2700k6497o374L6017K5166
8225I0362N576L735o33k4060j3742p919j1304L2614k2934j4330J3920K6692K7916
$$ plain form
8316 100599 96421 112306 104204 79869 75533 88924 98330 80905 63728 38945 21882 37159
8304 37159 36817 21518 36312 31372 29283 33706 50468 60045 65897 59527 51234 66963 63196 51124
8290 51124 49694 90483 117432 118898 100159 52731 69875 76418 70947 69970 60858 44947 24544
8277 24544 30879 53506 75320 85264 83090 87081 81316 89011 94633 103427 88967 71870 83364
8264 83364 85600 67965 50280 55389 30791 40985 27043 35384 74172 85375 114579 114347 89402
8251 89402 80375 65668 60817 77814 84260 104614 111187 98974 104910 80313 87886 90632 79638
8238 79638 70110 49506 43494 54012 57252 21380 41935 74750 62050 35553 29179 65196 90362
8225 90362 95938 99673 99040 74980 61238 53319 42015 74629 51695 37365 51285 77977 105893
8212A05893Q555J04k4711k6735J5203O99j6941J4904R70j3489k0377L636L1453
8199G9164N748o796j1131j7409k6329J30j7015j09J9824j8589J0389J3001m728
8186B6150j399j9942L736J0455J2416O368j400J5912l93q442k9937j5803L2687
8173C0408R521J0548j7492J3893L4546K2223k3541J7160J1922j2173j9034k6118
8161E1863p308K9290q706k2663o068n592J0809j8371O262N7825L0170j3192r869
8148I4450k4274n556J8457j5051l7601J8335K7994j6077k3123J0248J9933J1861
8136G9596J825k6920n035k1619k576o842m682J5678J7839j1762j3045K1802L759
8123D8018O473J512k6248J742J3224K801M992j0274o533j6444P000K4320P51l0028
$$ plain form
8212 105893 114448 114552 89841 63106 78309 79008 62067 76971 77941 64452 44075 47711 79164
8199 79164 84912 78116 66985 49576 23247 23377 6362 6253 26077 7488 17877 30878 26150
8186 26150 24751 4809 8545 19000 31416 37784 36384 52296 51903 43461 13524 -2279 30408
8173 30408 39929 50477 32985 46878 81424 103647 80106 97266 109188 97015 77981 51863
8161 51863 44555 73845 65139 42476 36408 30816 41625 23254 29516 87341 117511 104319 94450
8148 94450 70176 64620 83077 68026 30425 48760 76754 60677 37554 47802 67735 79596
8136 79596 81421 54501 49466 27847 25271 18429 13747 29425 47264 35502 22457 44259 48018
8123 48018 54491 56003 29755 31497 44721 47522 52514 42240 35707 19263 26263 50583 51334 21306
8109B1306J041L4268n439J5451K3103j4051k2840m960j6513J93Q151K580k212
8096D0078k415J763K4494r26k0349P535j5310k6696K390J6156n274K693l558j1524
8082I057L2045K1601J0638K049q921q303j7627J7415j2242l4837L3278J8229N965
8069F8347M318K46j7575l2206M61j3579k1498L8779L2103j3653j5052r25Q076
8056C7842L7682J2247m318j6543p612L662j284l711j0449k179P99j649K906q763
8042C8630J5057J1533K92M181j0403q167K9475L6012p774k1993O953l736j1536
8029G8524n144p57j334J1250k0379j4279N822J0523K3006k84l9040k4433J598
8016B5073r815J0885K0671J3691r958J4004J8937K735j2176j517k6683o782j3069
$$ plain form
8109 21306 22347 56615 51176 66627 89730 75679 52839 47879 31366 31559 39710 42290 40078
8096 40078 37663 39426 63920 62994 42645 50180 34870 8174 10564 26720 21446 24139 20581 9057
8082 9057 41102 62703 73341 75390 66469 58166 40539 57954 45712 10875 44153 62382 68347
8069 68347 72665 72911 55336 23130 23591 10012 -11486 27293 59396 45743 30691 29766 37842
8056 37842 75524 87771 83453 66910 59298 62960 61676 57965 47516 45337 46136 44487 47393 38630
8042 38630 53687 65220 65512 69693 59290 51123 80598 116610 108836 86843 93796 90060 78524
8029 78524 73380 72623 71289 82539 62160 47881 53703 64226 87232 86948 47908 23475 25073
8016 25073 15258 26143 46814 60505 50547 64551 83488 86223 74047 72530 45847 39065 25996
8003B5996J016l3677P420K1265J8034K5879n592M506l323j1272k1927J491m107
7990B5709J7447K1913j8489n350n373m706j0844J1983r281J048J8950J0808j3512
7977D0303K0360O758J195M800j3588j3760j8225J9073L4270K500j274j9630J0700
7964G3482j6955k7800n507p327J3145K2966L240l970O660o213q39p976J1014j0247
7950D3673o535K1330K4468q97j4188j0688J9754L687k808j7689j8782M338m336
7937D1327J1322j2242J7915m091j0838l944k0593K1618J1657O543J5832j3274
7925F1232j308K9672Q022j7542l2208Q213J1656k8696k8323K1484K7859R958k7660
7912D2359j6158K7773K5967M3638j4688k2235j8208m848P605M184p980m337l2717
$$ plain form
8003 25996 27012 -6665 755 22020 40054 65933 60341 64847 61524 50252 28325 29816 25709
7990 25709 43156 65069 46580 41230 35857 31151 20307 32290 23009 24057 43007 53815 40303
7977 40303 60663 67421 68616 73416 59828 46068 27843 46916 81186 83686 82412 62782 73482
7964 73482 56527 28727 23220 15893 29038 52004 55244 51274 57934 51721 50882 42906 53920 43673
7950 43673 37138 58468 82936 82039 67851 57163 76917 80604 77796 60107 41325 45663 41327
7937 41327 52649 40407 58322 54231 43393 39449 18856 40474 52131 58674 74506 61232
7925 61232 59924 89596 97618 80076 47868 56081 67737 39041 10718 32202 60061 70019 42359
7912 42359 26201 53974 79941 123579 108891 86656 68448 63600 71205 75389 67409 63072 30355
7899C0355k1167M311N965Q856J840J2626K2930l866k1459L016L7468K3076j1156
7886I2795j8945l3063j3478L3498L7034k4697p496l3370m2329Q921J6602J796
7874A7268J9101j6855k3390K2185M7166j3897k4910N045J0599J0763J6283J8457
7862H7815j7122j9398r170J3899n211r902k0344j3391K3916J9603J8955l691j709
7849F4250k5780m209J1822o667j3688j7835j2212J1152J4302l104N217L9794O708
7836F9750k233j288p841k5512q814q099J4844J034J9376K962k1671m181m862J0005
7822C3470K6170N71J3586k910J363p859j9921J9680j3213k7228L366J2612p206
7809C2481j5416J8935J9664k0542j9419J0999L6726r266k4986m840M771k0639
$$ plain form
7899 30355 9188 13499 19464 28320 30160 42786 65716 61850 40391 43407 80875 103951 92795
7886 92795 73850 40787 27309 60807 97841 73144 65648 32278 -10051 -1130 15472 17268
7874 17268 36369 19514 -3876 18309 65475 51578 26668 31713 42312 53075 69358 87815
7862 87815 70693 51295 42125 56024 50813 40911 20567 7176 31092 50695 69650 65959 64250
7849 64250 38470 34261 46083 39416 25728 7893 -4319 6833 21135 18031 23248 63042 69750
7836 69750 67517 66229 58388 32876 24062 15963 30807 31841 51217 54179 32508 28327 23465 33470
7822 33470 59640 60211 73797 70887 72250 64391 44470 64150 50937 23709 27075 39687 32481
7809 32481 17065 36000 55664 35122 15703 26702 63428 54162 29176 24336 29107 8468
7797H468K8185L9147j6542j9909j9608Q803P395J5232k2022p168K0437l0664l7696
7784b5942q380K0345M5207J2924J8481R816j7538P894P659j4858l4055J4559j504
7771C4608j7163J4577K4611q252j9843J6685K1841k017l4490j3900K5054p926
7759C3785K443p760J0594R05j4241q787k064Q653J5466J241J4104K0674R812k8087
7745E6738J6185K399l741r906p675j0490l310J9568K42j6594j7582R729l765j526
7731C0272l548m606O178k338k691P409J3900M627K0032Q902j2171J692q649K566
7717F1575J7921L313q113Q841k0711m6261q803N841K623M555k4279j783J6352
7704A1071m067J0824J3600J839o080L478J5017m30j4179k4975o793Q512o254K1932
$$ plain form
7797 8468 36653 75800 59258 39349 19741 28544 35939 51171 29149 21981 42418 11754 -25942
7784 -25942 -34322 -13977 31230 44154 62635 72451 54913 62807 70466 55608 21553 36112 34608
7771 34608 17445 32022 56633 48381 28538 45223 67064 65047 30557 16657 41711 33785
7759 33785 36228 28468 39062 39967 25726 16939 14875 23528 38994 40235 54339 75013 84825 56738
7745 56738 72923 75322 71581 61675 54000 43510 40200 59768 60010 43416 25834 35563 31798 30272
7731 30272 26724 22118 28296 25958 23267 30676 44576 49203 69235 78137 65966 67658 59009 61575
7717 61575 79496 82809 74696 83537 62826 16565 7762 13603 16226 20781 -3498 -5281 11071
7704 11071 7004 17828 31428 33267 27187 30665 45682 45252 31073 6098 -695 7817 1563 23495
7690B3495L853l935Q137M0959K0189j8047k5894J6722K867J6172j0937l9361K3134
7677E7354J2975l0009j7241K582j918j0658L4098J8611l0103k0076j5909J306
7665A012J8041q928J3170M1429J3872m0961k6773j0804J5476Q280j3943n762p984
7652c875J1160K3927k923L318j3342j4574j3380J1067K2103J8677l2079k6420
7640a6341K683K5741K5532j534p959m9972j099N702n749J5720K6000o916J8199
7627C0007J6986n473m06Q859j1447j1526K083K9664j2103q999j4923Q610Q382
7614C9714Q555r775j0351k0098M465k0598k499K7625J084K5844M802Q520K0251
7601G7539J2944r512r80k895k893j5653k5626k3038R048R279m949j6822q733J3883
$$ plain form
7690 23495 27348 23413 31550 72509 92698 74651 48757 65479 68346 84518 73581 34220 57354
7677 57354 70329 40320 23079 25661 23743 13085 47183 65794 35691 15615 -294 1012
7665 1012 19053 10125 23295 64724 78596 37635 10862 58 15534 23814 9871 4109 -3875
7652 -3875 7285 31212 28289 31607 18265 3691 -9689 1378 23481 42158 10079 -16341
7640 -16341 -13658 12083 37615 36081 28122 -21850 -22949 -17247 -22996 -7276 18724 11808 30007
7627 30007 46993 41520 41114 49973 38526 27000 29083 58747 46644 37645 22722 31332 39714
7614 39714 48269 38494 28143 8045 12510 -8088 -10587 17038 18122 43966 48768 57288 77539
7601 77539 90483 80971 79991 77096 74203 58550 32924 9886 18934 28213 23264 6442 -2291 11592
7587A1592J3883J1464J5949P957l3648k4073K1880J8775l2230q183J2126K4240
7575C9732q439k7257K3751J8756K2495J3902K724l2191l1508l1544j84L917J4565
7562H719K4265K587j2275j0184k3957L2462o049j3591J5450K1615K7254k8378
7550C7918k615k976K993k665m87j1938k406K5133j6889k4057j195J9796J677o843
7536A5446p680n742j2619J2550K4245J0141j6490j2517K02K478N302J404L549
7523B0269o568k503L013L893j4218m191m001P09K303L4061j78j600j0554j0539
7509I896J770l388n44J8313J8653K2578r152l0652k3409k305k22j5298O90j784
7495a4854L5204K787M723M241M648k4264q331q46r682n853R54Q083J1221O240
$$ plain form
7587 11592 25475 36939 52888 60845 27197 3124 25004 43779 11549 3366 15492 39732
7575 39732 31293 4036 27787 46543 69038 82940 85664 53473 21965 -9579 -9763 -5846 8719
7562 8719 32984 35571 23296 13112 -10845 21617 15568 1977 17427 39042 66296 37918
7550 37918 35303 32327 35320 32655 32168 20230 17824 42957 26068 2011 816 20612 22289 15446
7536 15446 7766 2024 -10595 1955 26200 36341 19851 7334 7536 10014 15316 16720 20269
7523 20269 13701 11198 14211 18104 3886 -305 -4306 -3597 -1294 32767 32589 30989 20435 9896
7509 9896 11666 8278 7734 26047 44700 67278 58126 27474 4065 1760 1538 -13760 -13070 -14854
7495 -14854 20350 23137 27860 32101 36749 12485 4154 3308 -6374 -12227 -11273 -3190 8031 14271
7481A4271J3898m917j0686k769J8613j4592K568M5699Q396j7588k5825J316r07
7468B7477r751j5768O114j5746J2175j974j7117J5437L4939L5716k0241k4490
7456B6771J794P968J4677J7990k1150k6947j2132J3856K128j0818k3091R645p19
7443b8n751n121J5584L4048P667p032m1324j1038J8533K9359r957j4290K0595
7430C1245K0602j4381j3546m68J2007k907J406K5783j453k8543q574k2719j8710
7417b0258J3735r405j2089J3085J4453R698m796n821q847J2574J7097K0187J0969
7404E0582k36q731p947o378J0911P885J1971O64k0898k8532J9104J9029j0176
7391C7248l575o781l29J1728J1639j496J1708L712j8206k6005k233r917L157L243
$$ plain form
7481 14271 28169 23252 12566 9797 28410 13818 16386 62085 70481 52893 27068 28384 27477
7468 27477 17726 1958 8072 -7674 4501 2527 -14590 847 35786 71502 51261 26771
7456 26771 28565 36533 51210 69200 48050 21103 8971 22827 24955 14137 -8954 691 -28
7443 -28 -5779 -10900 4684 38732 46399 39367 -1957 -12995 5538 34897 24940 10650 31245
7430 31245 51847 37466 23920 23452 35459 32552 33958 59741 58288 29745 21171 -1548 -20258
7417 -20258 -6523 -15928 -28017 -14932 -479 9219 4423 -1398 -10245 2329 19426 39613 50582
7404 50582 50346 41615 33668 27290 38201 46086 58057 58721 37823 9291 28395 47424 37248
7391 37248 33673 26892 26563 38291 49930 48434 60142 63854 45648 19643 17410 7493 10650 13893
7377A3893P728j5404O24J6903J0592l608L235p490J551N023J0436n40K6393J243
7363G0579j5990q847P023J5847n865k6102j9189r896q202R980K5799j1750J2722
7350C6109K217j1561r355K8208m372L571j923j5543J360k369J754j4898J1938
7337B5136k3350j2787K628K8158R607J292J343K057K495k965K8527k8809k2419
7324A0913K3921J9513j8004K02J1979q325k855o793q496J2350J4838j651o017
7311D1575r564r715K6662m120m280Q965K519j9059j9165j943o354K3372o117l67
7297B2409r919K1632J9275j0482k8586l021K4024k2563Q205j7428K3500P494n160
7284B9380N367Q261J9693k7103l5319R751N425l6820j3746q179j5532q418L2657
$$ plain form
7377 13893 21621 6217 6841 23744 34336 30728 33963 26473 28024 33047 43483 42943 69336 70579
7363 70579 54589 45742 52765 68612 62747 36645 17456 7560 -642 9338 35137 23387 36109
7350 36109 38326 26765 17410 45618 41246 44817 42894 27351 28711 26342 28096 13198 25136
7337 25136 1786 -11001 -8373 19785 29392 30684 32027 34084 36579 33614 62141 33332 10913
7324 10913 34834 54347 36343 36545 48524 40199 37344 30551 22055 34405 49243 47592 41575
7311 41575 32011 22296 48958 44838 40558 49523 52042 32983 13818 11875 5521 28893 22776 22409
7297 22409 12490 34122 53397 42915 14329 11308 35332 12769 20974 3546 27046 34540 29380
7284 29380 34747 43008 62701 35598 279 10030 15455 -21365 -35111 -43290 -58822 -67240 -34583
7271c4583M635M889l070l023J3174J7877K4788n194N196r546j3147M14K1567P242
7257C1219J0362J3493j0241k1817j8591m961J79L4405K2533k9704l3019J7097
7245A0955K3727p705p216j7223L744J3983Q667M127Q720M302j3035L652k1729
7232A4969k8372J8269J6959P613K0662j8764k7686j0560Q943P326L4549L506k6437
7219B0977P931j1662j1844N682J4007K9329M043k3760j4374J8260q634k2176J2717
7206B0496J7309n26m088p864M915R4R295L1717m225M72r517l2363j0757j0239
7192D719J2334J7203J1186j740j3978j0494k7279j0842O513J5936K533J9425j0559
7179A4957m4595j6942L1103L6186q808j538J3692K1587p426k1154P799n522J5643
$$ plain form
7271 -34583 -29948 -25059 -28129 -31152 -17978 -101 24687 19493 24689 15143 1996 2410 23977 31219
7257 31219 41581 55074 44833 23016 4425 -536 -357 34048 56581 26877 -6142 10955
7245 10955 34682 26977 19761 2538 6282 20265 28932 33059 41779 46081 33046 36698 14969
7232 14969 -13403 4866 21825 29438 50100 31336 3650 -6910 2033 9359 43908 47414 20977
7219 20977 28908 17246 5402 11084 25091 54420 58463 34703 20329 38589 29955 7779 20496
7206 20496 37805 37279 33191 25327 30242 30336 39631 71348 67123 67595 58078 25715 14958 4719
7192 4719 17053 34256 45442 43702 29724 19230 -8049 -18891 -12378 3558 6091 25516 14957
7179 14957 -29638 -46580 -15477 20709 11901 10363 24055 45642 38216 17062 24861 19339 34982
7166C4982J2491k0706k6486K3675K1568j9075j3816L972J1205n993J3670k3901
7154A1586j8316K125l88M682J8102J300K4328J1781N827n651j0552m1952n451
$$ plain form
7166 34982 47473 26767 281 23956 45524 26449 12633 16605 27810 21817 35487 11586
7154 11586 -6730 -4605 -4993 -311 17791 19091 43419 55200 61027 55376 44824 2872 -2579
$$ [...]
##END NTUPLES=NMR SPECTRUM
##END=
