##TITLE=Analysis number 325154
Compound Code spb 03806
Project Code adrs
Chemist Name 2y chem
##JCAMPDX= 6.0         $$ Bruker NMR JCAMP-DX V2.0
##DATA TYPE= NMR SPECTRUM
##DATA CLASS= NTUPLES
##ORIGIN= Bruker BioSpin GmbH
##OWNER= nmr
$$ XWIN-NMR		Version 3.5
$$ Tue Dec 12 14:44:41 2006 GMT Standard Time (UT+0h)  MAYBRIDGE\nmr@NMR_250MHZ
##.OBSERVE FREQUENCY= 250.131544655141
##.OBSERVE NUCLEUS= ^1H
##.ACQUISITION MODE= SIMULTANEOUS (DQD)
##.ACQUISITION SCHEME= undefined
##.AVERAGES= 16
##.DIGITISER RES= 18
##SPECTROMETER/DATA SYSTEM= dpx250
##.PULSE SEQUENCE= zg30
##.SOLVENT NAME= DMSO
##.SHIFT REFERENCE= (INTERNAL, DMSO, 0, 16.522)
##AUDIT TRAIL= $$ (NUMBER, WHEN, WHO, WHERE, WHAT)
$$ ##TITLE= Audit trail, XWIN-NMR		Version 3.5
$$ ##JCAMPDX= 5.01
$$ ##ORIGIN= Bruker BioSpin GmbH
$$ ##OWNER= nmr
$$ C:\u/data/dgb/nmr/ADRS/810/pdata/1/auditp.txt
$$ ##AUDIT TRAIL=  $$ (NUMBER, WHEN, WHO, WHERE, WHAT)
(   1,<2006-12-12 14:44:03.99 +000>,<MAYBRIDGE\nmr>,<NMR_250MHZ>,
      <created by zg, POWCHK disabled, PULCHK disabled
       configuration hash MD5:
       49 4B E0 1D 92 C2 6B 37 9F E6 65 BC 52 41 86 1D
       data hash MD5: 64K
       E2 0D 7E ED 68 E2 56 79 EA BC 4D 0F 5B 81 F5 C5>)
(   2,<2006-12-12 14:44:19.52 +000>,<MAYBRIDGE\nmr>,<NMR_250MHZ>,
      <Start of raw data processing
       ef LB = 0.3 FT_mod = 6 PKNL = 1 SI = 32K 
       data hash MD5: 32K
       C9 09 1B C2 ED 73 1A A0 F6 E8 48 05 CD 18 2C 50>)
(   3,<2006-12-12 14:44:23.91 +000>,<MAYBRIDGE\nmr>,<NMR_250MHZ>,
      <apk 
       data hash MD5: 32K
       B8 14 11 8D 36 80 B0 77 61 1E B6 48 1C 89 12 79>)
(   4,<2006-12-12 14:44:25.25 +000>,<MAYBRIDGE\nmr>,<NMR_250MHZ>,
      <abs ABSG = 5 
       data hash MD5: 32K
       D9 A3 EB E8 12 33 8B 4C 88 5A D5 C1 54 CD CC 5B>)
$$ ##END=
$$ 
$$ hash MD5
$$ DA 1D D1 74 91 D9 15 DE 6A D9 41 6F 91 01 24 EC
##$RELAX= 
##$RELAX= 
##$RELAX= 
##$RELAX= 
##$RELAX= 
##$RELAX= 
##$RELAX= 
$$ Bruker specific parameters
$$ --------------------------
##$DU= <C:\u>
##$EXPNO= 810
##$NAME= <ADRS>
##$PROCNO= 1
##$TYPE= <nmr>
##$USER= <dgb>
##$AMP= (0..31)
100 100 100 100 100 100 100 100 100 100 100 100 100 100 100 100 100 100 
100 100 100 100 100 100 100 100 100 100 100 100 100 100 
##$AQSEQ= 0
##$AQ_mod= 3
##$AUNM= <au_zg>
##$AUTOPOS= <55 >
##$BF1= 250.13
##$BF2= 250.13
##$BF3= 250.13
##$BF4= 250.13
##$BF5= 500.13
##$BF6= 500.13
##$BF7= 500.13
##$BF8= 500.13
##$BYTORDA= 1
##$CFDGTYP= 0
##$CFRGTYP= 5
##$CHEMSTR= <none>
##$CNST= (0..31)
1 1 145 1 1 1 1 1 1 1 1 1 1 1 1 1 1 1 1 1 1 1 1 1 1 1 1 1 1 1 1 1 
##$CPDPRG= <>
##$CPDPRG1= <>
##$CPDPRG2= <>
##$CPDPRG3= <>
##$CPDPRG4= <mlev>
##$CPDPRG5= <mlev>
##$CPDPRG6= <mlev>
##$CPDPRG7= <mlev>
##$CPDPRG8= <mlev>
##$CPDPRGB= <>
##$CPDPRGT= <>
##$D= (0..31)
0 1 0 0 0 0 0 0 0 0.06 0 0 0 0 0 0 0.0002 0 0 0 0 0 0 0 0 0 0 0 0 0 0 
0 
##$DATE= 1165934642
##$DBL= (0..7)
120 120 120 120 120 120 120 120 
##$DBP= (0..7)
150 150 150 150 150 150 150 150 
##$DBP07= 0
##$DBPNAM0= <>
##$DBPNAM1= <>
##$DBPNAM2= <>
##$DBPNAM3= <>
$$ [...]
##$SUBNAM6= <"">
##$SUBNAM7= <"">
##$SUBNAM8= <"">
##$SUBNAM9= <"">
##$SW= 20.6930455092707
##$SWIBOX= (0..15)
0 0 3 0 0 0 0 0 0 0 0 0 0 0 0 0 
##$SW_h= 5175.983436853
##$TD= 65536
##$TD0= 1
##$TE= 295.16
##$TE2= 300
##$TE3= 300
##$TEG= 300
##$TL= (0..7)
0 120 120 120 120 120 120 120 
##$TP= (0..7)
150 150 150 150 150 150 150 150 
##$TP07= 0
##$TPNAME0= <>
##$TPNAME1= <>
##$TPNAME2= <>
##$TPNAME3= <>
##$TPNAME4= <>
##$TPNAME5= <>
##$TPNAME6= <>
##$TPNAME7= <>
##$TPOAL= (0..7)
0.5 0.5 0.5 0.5 0.5 0.5 0.5 0.5 
##$TPOFFS= (0..7)
0 0 0 0 0 0 0 0 
##$TUNHIN= 0
##$TUNHOUT= 0
##$TUNXOUT= 0
##$USERA1= <user>
##$USERA2= <user>
##$USERA3= <user>
##$USERA4= <user>
##$USERA5= <user>
##$V9= 5
##$VALIST= <valist>
##$VCLIST= <CCCCCCCCCCCCCCC>
##$VD= 0
##$VDLIST= <DDDDDDDDDDDDDDD>
##$VPLIST= <PPPPPPPPPPPPPPP>
##$VTLIST= <TTTTTTTTTTTTTTT>
##$WBST= 1024
##$WBSW= 4
##$XGAIN= (0..3)
0 0 0 0 
##$XL= 0
##$YL= 0
##$YMAX_a= 211597
##$YMIN_a= -193885
##$ZGOPTNS= <>
##$ZL1= 120
##$ZL2= 120
##$ZL3= 120
##$ZL4= 120
##$ABSF1= 16.522
##$ABSF2= -4.171173
##$ABSG= 5
##$ABSL= 3
##$ALPHA= 0
##$AQORDER= 0
##$ASSFAC= 0
##$ASSFACI= 0
##$ASSFACX= 0
##$ASSWID= 0
##$AUNMP= <proc_1d>
##$AZFE= 0.1
##$AZFW= 0.1
##$BCFW= 0
##$BC_mod= 0
##$BYTORDP= 0
##$COROFFS= 0
##$CY= 12.5
##$DATMOD= 1
##$DC= 0
##$DFILT= <>
##$DTYPP= 0
##$F1P= 14.0000005364418
##$F2P= -0.99999901652339
##$FCOR= 0.5
##$FTSIZE= 32768
##$FT_mod= 6
##$GAMMA= 0
##$GB= 0
##$INTBC= 1
##$INTSCL= 1
##$ISEN= 128
##$LB= 0.3
##$LEV0= 0
##$LPBIN= 0
##$MAXI= 10000
##$MC2= 0
##$MEAN= 0
##$ME_mod= 0
##$MI= 0
##$NCOEF= 0
##$NC_proc= -5
##$NLEV= 6
##$NOISF1= 0
##$NOISF2= 0
##$NSP= 0
##$NTH_PI= 0
##$NZP= 0
##$OFFSET= 16.522
##$PC= 1
##$PHC0= 217.524
##$PHC1= 8.694895
##$PH_mod= 1
##$PKNL= yes
##$PPARMOD= 0
##$PSCAL= 4
##$PSIGN= 0
##$REVERSE= no
##$SF= 250.13
##$SI= 32768
##$SIGF1= 0
##$SIGF2= 0
##$SINO= 400
##$SIOLD= 32768
##$SREGLST= <1H.DMSO>
##$SSB= 0
##$STSI= 32768
##$STSR= 0
##$SW_p= 5175.98343685301
##$SYMM= 0
##$S_DEV= 0
##$TDeff= 65536
##$TDoff= 0
##$TI= <Analysis number 999999
Compound Code 99
Book Reference 9
Project Code 9>
##$TILT= no
##$TM1= 0
##$TM2= 0
##$TOPLEV= 0
##$USERP1= <user>
##$USERP2= <user>
##$USERP3= <user>
##$USERP4= <user>
##$USERP5= <user>
##$WDW= 1
##$XDIM= 32768
##$YMAX_p= 311485449
##$YMIN_p= -649262
$$ End of Bruker specific parameters
$$ ---------------------------------
##NTUPLES= NMR SPECTRUM
##VAR_NAME=  FREQUENCY,     SPECTRUM/REAL,   SPECTRUM/IMAG
##SYMBOL=    X,             R,               I
##VAR_TYPE=  INDEPENDENT,   DEPENDENT,       DEPENDENT
##VAR_FORM=  AFFN,          ASDF,            ASDF
##VAR_DIM=   32768,         32768,           32768
##UNITS=     HZ,            ARBITRARY UNITS, ARBITRARY UNITS
##FACTOR=    0.157963299565203, 1,           1
##FIRST=     4132.6476996994, 0,             0
##LAST=      -1043.33573715361, 0,           0
##MIN=       -1043.33573715361, -649262,     0
##MAX=       4132.6476996994, 311485449,     0
$$ Real data points
##PAGE= N=1
##DATA TABLE= (X++(R..R)), XYDATA
$$ [...]
15815A05480M1855j804k61805L1419J13168K3541j49525k4110J40037J56789j31958
15804D3087m843J27757o6913K6557j54230n8430Q4792Q5514R0557r9868K0392
15793I4372N1603m8360r0280M3858l9882k541P2415l7805l6027r4555j5609J13035
15781A0224J08785j4879n621j06143p6627P0146J47969L2112J53346j33472j88675
15770b835n7272l3304O1607N5168J7174L9982K4499K6098J08645P6353j59995
15759A56120j18500J7756M6644r2092p4467m6223M1594O881J24034J41662o9125
15748A34284M7420j8171j42129K5535j33070j6846Q731p5966n057J24293l9745
15737i0721r5541m4952m9205k4330O9230K61423l584M7839J91910j6649j88686
$$ plain form
15815 105480 147335 145531 -116274 -84855 28313 51854 -97671 -121781 18256 175045 43087
15804 43087 38244 166001 99088 125645 -28585 -87015 -2223 83291 173848 73980 94372
15793 94372 145975 97615 7335 51193 11311 8770 81185 43380 7353 -87202 -102811 10224
15781 10224 119009 104130 98509 -7634 -84261 -14115 133854 165966 319312 185840 -2835
15770 -2835 -60107 -93411 -31804 23364 40538 80520 105019 131117 239762 316115 156120
15759 156120 37620 55376 102020 9928 -64539 -110762 -69168 -62287 61747 203409 134284
15748 134284 181704 163533 21404 46939 -86131 -102977 -94246 -170212 -175269 -50976 -90721
15737 -90721 -186262 -231214 -280419 -304749 -235519 25904 22320 70159 262069 245420 56734
15726E6734j09546l3996J45003J16217J7601J7596N9146j9395j19110k8889O0018
15715A61379J18616n4429j55656L2833J85570r2595L2854j10494j30033n298m3522
15704f0775p3956j26789J34048K12765N2165M6007J37977M639j78391L6235j05171
15693G8754l8697p7151j05907J13633J34977j8674j96863q2320j19061O063J13843
15682a91403K94128Q7364k67263o2019L3211J14569O2953M8370p0887k04593L6097
15671a19473K5874J32636q1529M2553L0345N2694p7206K5337L1720P4955j6124
15660A21782j64937l0692N1099l0982j73530M5356Q2896J74581R4990n3785p6931
15649C9847m0203m7230J90328n5520j56165J696K3439o5853L9851k7081L5736
$$ plain form
15726 56734 -52812 -86808 58195 174412 192013 209609 268755 249360 130250 101361 161379
15715 161379 279995 225566 69910 102743 288313 195718 228572 118078 -11955 -17253 -60775
15704 -60775 -134731 -261520 -127472 85293 137458 183465 321442 326081 147690 183925 78754
15693 78754 40057 -37094 -143001 -29368 105609 86935 -109928 -192248 -311309 -305246 -191403
15682 -191403 102725 190089 -77174 -139193 -105982 8587 71540 119910 49023 -155570 -119473
15671 -119473 -93599 39037 -42492 61 30406 83100 5894 31231 62951 137906 121782
15660 121782 -43155 -73847 -22748 -53730 -227260 -181904 -99008 75573 170563 116778 39847
15649 39847 -356 -47586 142742 87222 -68943 -67247 -43808 -109661 -69810 -96891 -61155
15638f1155J09049K067q9105j5088j9095R8344O3563J476n088q3525j69559r0292
15626b58408J50409J65192N1668j41614j76387j06883O7470K52521J6532j20487
15616i9987K9533J60472j00327j74280o1560J56152L9556l7823p9436r7644O6582
15605a98762P3376o9941J50051M2498p3770j1992p0659j35105J07170J77367Q342
15594a425o0228N3913N4367M4458l2293l1277k4426o7806N8435M7533l096q5425
15582d7270r9824R8644J54379j86479n1855o7509j7425J8217j8648M8255o9841
15571b39356J31057K6263j78770k212J9600Q5985k086K9972P3312q5544K9216
15560a12563J38531K0459j44730J8493r6818j36522p0123P0824K74519R6301p3282
$$ plain form
15638 -61155 47894 49961 -39144 -54232 -73327 25017 88580 90056 84968 1443 -168116 -258408
15626 -258408 -107999 57193 108861 -32753 -209140 -316023 -248553 3968 20500 -99987
15616 -99987 -70454 90018 -10309 -184589 -246149 -89997 -50441 -88264 -167700 -265344 -198762
15605 -198762 -125386 -195327 -45276 -2778 -76548 -88540 -159199 -294304 -187134 -9767 -1425
15594 -1425 -61653 -7740 46627 91085 58792 27515 3089 -64717 -6282 41251 38155 -47270
15582 -47270 -147094 -48450 105929 -80550 -132405 -199914 -217339 -199122 -217770 -169515 -239356
15571 -239356 -108299 -82036 -260806 -263018 -243418 -157433 -159519 -129547 -56235 -141779 -112563
15560 -112563 25968 46427 -98303 -79810 -176628 -313150 -383273 -312449 -37930 58371 -14911
15549a4911l8181n1178l3750j78424L6671O4039J0318Q5907k18218J53370J11843
15538g2514j34549p992L918j67298R8643J50597K56027O4420k31325J40847m9473
15527E1301j83265r0386j26443R2023J38430P0591k7035j39715j5549Q0100M4855
15516a05093r9770m6422J38757k232o1239K1653m9326L1542J16304N2567o2246
15505f5505j19627n4767K7068J85987J42147N3956p9221j67592o6290Q3390J39171
15494G8717l3054m893j44502l0395Q659J4115j23870q791j16400o4339J35107
15483b89646J38756L3011R218P1233n3133N2981R3090j13743k07399j04745P0109
15472c00268J07271J26298p1089K0803j25835q1651Q8588R4957j13506q9464j06292
$$ plain form
15549 -14911 -53092 -104270 -138020 -316444 -279773 -215734 -205416 -119509 -337727 -184357 -72514
15538 -72514 -207063 -215055 -211137 -378435 -279792 -129195 126832 191252 -40073 100774 51301
15527 51301 -131964 -222350 -348793 -256770 -118340 -47749 -74784 -214499 -230048 -149948 -105093
15516 -105093 -204863 -251285 -112528 -114760 -175999 -154346 -203672 -172130 -55826 -3259 -65505
15505 -65505 -185132 -239899 -212831 -26844 115303 169259 90038 -77554 -143844 -60454 78717
15494 78717 45663 40770 -103732 -134127 -125468 -111353 -235223 -244014 -360414 -424753 -289646
15483 -289646 -150890 -117879 -108661 -37428 -90561 -37580 55510 -58233 -265632 -370377 -300268
15472 -300268 -192997 -66699 -137788 -116985 -242820 -324471 -235883 -140926 -254432 -343896 -450188
15461d50188K07158J22911J85552Q4339q6647r5581j46702L9935N6821K17J48801
15450F6616P8383J53148j97189k35651Q9017R8171J48610o8583J25724j1807j67548
15439G8891k0575N3830r1152k13256R1045N007q368J22395J63440m914j79823
15428c480q5446K1411J05081N7677j50357j32827l15357m8204J117M6933R3024
15417d10428J96449J38427j036R1989j18536j62993k5875K19049K83593J45437
15407C56076j85787j37824K0827k5829J7815J432n025p1365q6007J80159J42274
15396B06746o3965m8734n1729j02261j12760J3740N8169q5065K3518J85944L5568
15385E9171K3450K15355l5156j94949r9298p5001n5896L0836k8258l3162M3644
$$ plain form
15461 -450188 -243030 -120119 65433 149772 63125 -32456 -179158 -139223 -82402 -82185 66616
15450 66616 144999 298147 100958 -134693 -45676 52495 201105 132522 258246 246439 78891
15439 78891 58316 112146 20994 -192262 -101217 -96210 -104578 17817 181257 176343 -3480
15428 -3480 -88926 -67515 37566 95243 -55114 -187941 -503298 -551502 -550385 -503452 -410428
15417 -410428 -213979 -75552 -76588 15401 -103135 -266128 -292003 -72954 210639 356076
15407 356076 170289 32465 53292 27463 45278 46710 41685 -29680 -115687 64472 206746
15396 206746 142781 94047 42318 -59943 -172703 -158963 -100794 -185859 -162341 23603 59171
15385 59171 82621 297976 262820 67871 -31427 -106428 -162324 -131488 -159746 -192908 -149264
15374a49264M5931M0812n1733J00403P8912l9442Q5222j10212J04812l2515j02675
15363b9749N3892P0237J31891N5544r6455o2374L6479j17548j28982n3299K7796
15352a12568J22793P0106l014j24481M2363J53103K3073j95166j68816o1356K6661
15341b27302J45509K07415n5416j35954l9819O384P9180J20722J86281J37886
15331D24886o3170l10507o1883Q4717J09233n3783j32660J0669n9867M2597M9052
15320C9284o3556k2940j17512j2311L1635Q2315Q3289K4299J32286p5088q713
15309I2988m8893q5152p7908O2366k4949O5416J02632m8065j98908n0216n4317
15298b65006j40034p167J05085O7976Q8396k1889q9373K7815r196J62904J94215
$$ plain form
15374 -149264 -103333 -62521 -114254 -13851 65061 25619 110841 629 105441 72926 -29749
15363 -29749 24143 94380 226271 281815 185360 122986 159465 41917 -87065 -140364 -112568
15352 -112568 10225 80331 77317 -47164 -4801 148302 171375 -23791 -192607 -253963 -227302
15341 -227302 -81793 125622 70206 -65748 -105567 -99183 -20003 100719 287000 424886
15331 424886 361716 51209 -10674 74043 183276 129493 -3167 7502 -52365 -9768 39284
15320 39284 -24272 -47212 -164724 -177035 -145400 -63085 20204 44503 176789 101701 92988
15309 92988 44095 -41057 -118965 -56599 -81548 -16132 86500 38435 -160473 -210689 -265006
15298 -265006 -405040 -412207 -307122 -239146 -150750 -172639 -262012 -234197 -243393 -80489 113726
15287A13726q8633J4482n5184L9990j5408n8269j08049k1394L9551Q6581L2560
15276b0047M7053J69190K6915o0297j45305J05340r2201O1624K1945k11725m7319
15265a44827p5123l884N3188K02106R0327M0014j29781r9528J50067l4647k04171
15254a56259q4981j35892R4695K1320o1489O1294J24206N0444Q9199l249k9655
15243c0367L2900P3295j06680L2416j19394q9090J47799o3348J41500J47194O4692
15232B30917p1121J4154r4519n4811o0491m7948o3664Q9726M3500J45406j28391
15221B758j92703k9127N0404M2850l9637o5134R1466Q8219J70032o3946p9573
15210b4391M7591j7315L2781o0282L2428m3821k8129r5823m5091J7483O8227J07020
$$ plain form
15287 113726 25093 39575 -15609 24381 8973 -49296 -157345 -178739 -139188 -52607 -20047
15276 -20047 27006 196196 223111 162814 17509 122849 30648 92272 114217 -97508 -144827
15265 -144827 -219950 -223834 -170646 31460 121787 161801 32020 -67508 82559 47912 -156259
15254 -156259 -241240 -377132 -282437 -261117 -322606 -261312 -137106 -86662 2537 -712 -30367
15243 -30367 2533 75828 -30852 1564 -117830 -206920 -59121 -122469 19031 166225 230917
15232 230917 159796 173950 79431 24620 -35871 -83819 -147483 -57757 -14257 131149 2758
15221 2758 -189945 -219072 -168668 -125818 -165455 -230589 -139123 -50904 119128 55182 -24391
15210 -24391 23200 5885 38666 -21616 10812 -33009 -61138 -156961 -202052 -184569 -116342 -9322
15198i322J3980R268m1534M9887L2822N349J80063r8691j22351L1861j9792J10294
15186A41834n0324L5342l3252k00720M6500k5293o615P9679j47203j22660Q6833
15175a95879M824q994J25501K14847K9390j50195p8326m554J68897J39956J3492
15164B58959j24244N4052l6957j52904k5960o4198l0972J7030M0885R765j10729
15153a65273p3632J36984m94r0324k2359p9470m6977R2676J07826L3817J31322
15142B4096M6633k71405l9369J68233J40643L6655j01034l5622J2965k13238j56192
15131c87635J92946J23256j61153p9389m1477J11217l3350O3914K02083l4203
15121d3791r9348L0936J40414l1374r9396r1426p5245Q536J42011m5078N9314
$$ plain form
15198 -9322 4658 13926 -27608 22279 55101 60450 240513 141822 19471 51332 31540 141834
15186 141834 91510 126852 93600 -107120 -60620 -85913 -92528 -12849 -160052 -282712 -195879
15175 -195879 -191055 -200049 -74548 140299 169689 19494 -58832 -63386 105511 245467 258959
15164 258959 134715 188767 151810 -1094 -27054 -91252 -122224 -105194 -64309 -54544 -165273
15153 -165273 -238905 -101921 -102415 -192739 -215098 -294568 -341545 -248869 -141043 -107226 24096
15142 24096 70729 -200676 -240045 -71812 68831 105486 4452 -31170 -18205 -231443 -387635
15131 -387635 -194689 -71433 -232586 -311975 -353452 -242235 -275585 -211671 -9588 -43791
15121 -43791 -143139 -112203 28211 -3163 -102559 -193985 -269230 -260694 -118683 -163761 -104447
15110a04447L7993r9007r7413n8870o8696J23283J49301R8978Q8421o770n3553
15099I220p4933M5369R7760J21215l6420L7715P1342K1763N0690j62632j21038
15088F0051j49580m6464R3787K2171o2254j7338L8919J50632l8414N2541k1421
15077H2630q495l8707J17587q0610J0847L82n4098m3734K5990l0220j77614j37157
15065c33199j6047J06716J50814l9906n2187J14561O8318k7353M2788M0385l4141
15054B0749J5874N8127j52442j07783r0217p0732L5097q246J28493J58613M5761
15043C3294k217j14566j33832J4423K19804j3011p8333j20754M2995K5715j8787
15032a45269Q9724k01221j03509O253R9630J34979O7495n8771j40123P5589K00194
$$ plain form
15110 -104447 -66454 -165461 -262874 -321744 -390440 -267157 -117856 -18878 69543 62773 9220
15099 9220 -65713 -20344 77416 198631 162211 199926 271268 293031 343721 181089 60051
15088 60051 -89529 -135993 -42206 -20035 -82289 -99627 -60708 89924 51510 104051 82630
15077 82630 74135 35428 153015 72405 83252 83634 29536 -14198 11792 -18428 -196042 -333199
15065 -333199 -349246 -242530 -91716 -131622 -183809 -69248 -930 -28283 14505 54890 20749
15054 20749 36623 94750 -57692 -165475 -255692 -326424 -291327 -299573 -171080 -12467 33294
15043 33294 31077 -83489 -217321 -202898 16906 3895 -74438 -195192 -152197 -126482 -145269
15032 -145269 -55545 -256766 -360275 -354022 -254392 -119413 -51918 -110689 -250812 -175223 24971
15021B4971M1547l2045n46P9686J5172j63878p8557r7123l4619P6655M5163J7432
15009a06142J10242j7466j50417q9084P434K1790J9798J99294k3004o9418J26864
14998B9891O7765O6825j06138j93059j85020N8938R1701J85734Q3594N1009K4584
14987A75824j30779J2424K7124J16256j5562k54823j28116K6882O9675o8114K5670
14976a43539J99199M3215J6182l7466N304O199k4326L1341P8742J06278j67631
14965A13498p1895L2426Q3936K8101j93986l6568J14970j2899M2539N0278j08894
14954D1506j3288j32054m4631K07923j06289j2866p433n9167R4562k8937n3357
14943a14031r6686Q3816K27446O3700j02864q8476J27322k9979q4548K5549J76089
$$ plain form
15021 24971 66518 34473 33927 113613 128785 -35093 -113650 -210773 -245392 -168737 -123574 -106142
15009 -106142 4100 -13366 -163783 -252867 -245433 -223643 -203845 -4551 -27555 -96973 29891
14998 29891 97656 164481 58343 -134716 -319736 -260798 -169097 16637 100231 151240 175824
14987 175824 45045 57469 84593 200849 185287 -69536 -197652 -170770 -101095 -169209 -143539
14976 -143539 55660 98875 115057 77591 82895 89094 64768 96109 174851 281129 113498
14965 113498 41603 74029 157965 186066 -7920 -44488 70482 57583 100122 150400 41506
14954 41506 28218 -103836 -148467 59456 -46833 -59699 -67132 -126299 -31737 -60674 -114031
14943 -114031 -210717 -126901 100545 164245 61381 -27095 100227 70248 -14300 11249 187338
14932A87338M3493j63168j72708q6967L6185K06842M7030j26481K924J02670N6029
14921A33187j03537P5328k5438K4158J21624q6620k44965K2745l5210j4712k7655
14910a61095P6537l1592J33144K4548j66928k0798J8177J20883O4478j32924j01399
14899a76969m5687q023J03909J08052l8305J3669j46157j09744N1044J49286K7322
14888g1603Q439N3386O7920n1994O1235J07006J1604q866l3734L3141j13632j95622
14876a32720J3165q3862O9312p4144J45975J55791J1365L2218N4277n2252k387
14865A36738K0029k707j51520n2818J07170R2522J2110L6797j51420r4866L4795
14854a3170Q5597J59074R9786o8629J7437k1767J05265j89695j55957j66892l5765
$$ plain form
14932 187338 230831 67663 -105045 -192012 -155827 51015 98045 -28436 -25512 77158 133187
14921 133187 29650 104978 79540 103698 225322 138702 -106263 -83518 -118728 -133440 -161095
14910 -161095 -84558 -116150 16994 41542 -125386 -146184 -128007 -7124 57354 -75570 -176969
14899 -176969 -222656 -230679 -126770 -18718 -57023 -43354 -189511 -299255 -248211 -98925 -71603
14888 -71603 -63164 -9778 58142 6148 67383 174389 185993 177127 143393 176534 62902 -132720
14876 -132720 -119555 -203417 -134105 -208249 -62274 93517 104882 137100 191377 139125 136738
14865 136738 156767 154060 2540 -50278 56892 149414 161524 198321 46901 -47965 -13170
14854 -13170 72427 231501 331287 262658 280095 258328 363593 173898 17941 -148951 -184716
14843a84716J34744J7779K8598L7114L865q9110j982K9592J68162J5822j81657
14832b1789j17575j55608k2769J29557j05044n159K8694N962M1127R8697q3826
14821b07733j07795J99555J49402R6338k5766l3486R478j8008j5751J99144r9881
14810A45497j7658l4264K9520K6758K082K5982N7204j27800j13458N4095n6300
14799h342o7411M8468J20821N2751j9921p8121m6945p3371k25359R2620m0550
14788b45360J5434J13284Q321K8107l4564o9651N383N5996O5819K6633N016q1817
14776a07399K7431J80511M0397n7714k3673O608Q7871j17888J21917J39284k4248
14765B73097m2413j11370J3851k2152Q3038J83333r5915m9091j3071o8832k02275
$$ plain form
14843 -184716 -49972 -32193 -3595 33519 37384 -51726 -53708 -24116 144046 159868 -21789
14832 -21789 -139364 -294972 -317741 -188184 -293228 -298387 -269693 -263731 -222604 -123907 -207733
14821 -207733 -315528 -115973 33429 129767 104001 70515 79993 61985 46234 245378 145497
14810 145497 127839 93575 123095 149853 151935 177917 235121 107321 -6137 47958 -8342
14799 -8342 -75753 -27285 93536 146287 126366 48245 1300 -72071 -297430 -204810 -245360
14788 -245360 -229926 -116642 -108321 -80214 -114778 -184429 -179046 -123050 -57231 -30598 -25582 -107399
14776 -107399 -79968 100543 140940 83226 59553 66161 154032 36144 158061 297345 273097
14765 273097 230684 119314 133165 111013 194051 377384 281469 232378 219307 150475 -51800
14754e1800j60789L6918R3226J25154R7022l8835q4762r2599P3439J5829k6172
14743a3369j36608K32718J61572n4460k1470l5635N7170l0556j50449J13282J79489
14732C01684N2808q0075R1605K10943n536J59823q0873j31938j4912r3560L6190
14721D46159j10328j34332p5625p0214j8181l5618j92142m4867K481l3518l5012
14710c01197l8526K15410L4082J80225O9940n5956j7818q5194J08370M2502L1471
14699A83309J31988j86733j59574r493K6559M6570l751j31250l7069j8182p2385
14688b30011J5156K60253J29194N4279o6543J7639o1606n5377J7073j13871p3246
14677a07060P0880P8691L6460q4395p1395R7119R4842j44096K3034J36258q7677
$$ plain form
14754 -51800 -212589 -175671 -82445 42709 139731 100896 16134 -76465 -3026 12803 -13369
14743 -13369 -149977 82741 244313 189853 168383 132748 189918 159362 8913 122195 301684
14732 301684 354492 274417 366022 576965 571429 731252 650379 518441 503529 409969 446159
14721 446159 335831 201499 125874 55660 37479 1861 -190281 -235148 -232667 -266185 -301197
14710 -301197 -339723 -124313 -90231 89994 159934 103978 86160 966 109336 151838 183309
14699 183309 315297 128564 -31010 -40503 -13944 32626 28875 -102375 -139444 -157626 -230011
14688 -230011 -214855 45398 174592 228871 162328 179967 118361 62984 80057 -33814 -107060
14677 -107060 -36180 42511 78971 -5424 -76819 20300 115142 -28954 -5920 130338 42661
14666D2661n0701n4231j24020p5159p428j4284O9674J82392P8211j0937j1742
14655B4436k4115M4895j82619k28698j2438J59325O5989J18388K24707M1006j05759
14644A25117k04016P5162M0549j28986p951k5405j0938j66763N3362J0227m7044
14633b86686q822M2012J02062M8896L959K0121J33753J44399n3154j10295j475
14622C4770m6522Q4350K4824k59086j01690J11597l51q4992n4694J13892R207
14611a68695o4629J37778O6911J7969J5034q3062p2169N4221k1050j52950p0667
14600c41309P8108J74223K57584O6312j71399r9893j51510J56567J14706q242
14590G5147m3429K8311l2660j27374j04994J57806J99100p2280P1700O5972M0141
$$ plain form
14666 42661 -8040 -62271 -186291 -261450 -268878 -283162 -213488 -31096 47115 36178 24436
14655 24436 321 45216 -137403 -366101 -378539 -219214 -153225 -34837 189870 230876 125117
14644 125117 -78899 -3737 36812 -92174 -100125 -125530 -136468 -303231 -249869 -239642 -286686
14633 -286686 -295508 -253496 -151434 -102538 -98579 -78458 55295 199694 146540 36245 34770
14622 34770 -11752 72598 97422 -161664 -263354 -151757 -152108 -237100 -291794 -177902 -168695
14611 -168695 -233324 -95546 -28635 -10666 4368 -78694 -150863 -96642 -117692 -270642 -341309
14600 -341309 -263201 -88978 168606 234918 63519 -36374 -187884 -31317 83389 75147
14590 75147 31718 60029 27369 -100005 -204999 -47193 151907 79627 151327 217299 257440
14579B57440J26962j13542r0015O2727j50861q189L9421r579k02493k4557J30228
14568A7542k1070K0194K6939N8866o5375n3879m7268k84105r8714K052J98224
14557b46594J85067j8219M4126P7035P0085K9750q9479J05670J16137k1467k06701
14546D5410J6813Q7689K23748J5707j52518j54399n3923J19314q6672k5373o0303
14535b4507P2991J57121l0074q4210L5207o9720m281m3179P8724j37641j09548
14524a59117r4937J99471P2175r9226j10329p7058J6022Q8825j84646m4245O9875
14513c23190J37897j18048j17572J97635O159L394j06954j47753J17734J22942
14503b27756l8693j09054O1180l6584Q4706L2715Q8308J42891J33371Q3701j22242
$$ plain form
14579 257440 384402 270860 180845 243572 92711 84522 123943 114364 -88129 -112686 17542
14568 17542 -3528 16666 43605 102471 37096 -16783 -64051 -348156 -446870 -444818 -246594
14557 -246594 -61527 -79746 -35620 41415 111500 141250 51771 157441 273578 252111 45410
14546 45410 62223 149912 373660 389367 236849 82450 28527 147841 61169 35796 -24507
14535 -24507 48484 205605 175531 91321 126528 56808 52527 9348 88072 -49569 -159117
14524 -159117 -254054 -54583 17592 -81634 -191963 -269021 -252999 -164174 -348820 -393065 -323190
14513 -323190 -185293 -303341 -420913 -223278 -217119 -213725 -320679 -468432 -350698 -227756
14503 -227756 -266449 -375503 -314323 -350907 -266201 -233486 -145178 -2287 131084 214785 92543
14492I2543R3391O6776j94723r7129J2632O7411Q822j37037n7752J44967p5319
14481g5418j34492J0935J73403j30167j2361P7680O4507J01455j1295J2011M4833
14470A21091j14496O9647r1845q9773J8155R5366J0831R8410K9274j23656J15182
14459A38186l3002j9633M3226J9178P855k8402j01821j90062q5524R838J07425
14448a32736J54394J39439j43179k9284J8926k4463j04359O80J3824n1768m8486
14437b07012Q3121J16647j1318R0845j03922j83570m3368P8364P4611j0239n4759
14426a70600q131N9011K2226l4287J5805O2168j3366J70641O0395R3402O4697
14415C21961q5596j42590M9680N9295J2657m2559Q3202R1522m8847m0757k00926
$$ plain form
14492 92543 185934 252710 57987 -39142 -26510 40901 49723 -87314 -145066 -99 -75418
14481 -75418 -209910 -198975 -25572 -155739 -168100 -90420 -25913 75542 64247 76258 121091
14470 121091 6595 76242 -15603 -105376 -87221 8145 18976 117386 146660 23004 138186
14459 138186 105184 85551 128777 147955 155810 127408 25587 -164475 -249999 -240161 -132736
14448 -132736 21658 161097 17918 -11366 7560 -16903 -121262 -120582 -106758 -158526 -207012
14437 -207012 -123891 -7244 -18562 72283 -31639 -215209 -258577 -180213 -105602 -115841 -170600
14426 -170600 -178731 -119720 -97494 -131781 -115976 -53808 -67174 103467 163862 257264 321961
14415 321961 236365 93775 143455 202750 215407 172848 256050 347572 298725 257968 57042
14404E7042l7984k7713j8384Q6641L6596p3044l7023Q321r4722R6427j55616J5329
14392a44130M3972K6247K22146J32193k5131M3630o2998q4297o5470N2388M2248
14381A80798R1439j5492N6047L4359j12857j80905j09772j04944j40055K2906
14371b78476K26121J40963o3543m774k2520r8238l1025K3842j6979J23812n934
14360f751j06756L6065k9592j05188m0652J8118K55085J58744J9545j04026M5393
14349A39985k7379K7980j06603K3031k5533p7581p3823j2709O0084p1529J08577
14338c5500N3218j91013k1406J65919K3791k9027q1070l4763p2460J01079Q1282
14327c9950j02350M6940J40244M7124r6643L0181R9467N1965r0870j7145j69605
$$ plain form
14404 57042 19058 -8655 -27039 59602 96198 23154 -13869 -5548 -100270 -3843 -159459 -144130
14392 -144130 -100158 -73911 148235 280428 255297 298927 235929 151632 86162 138550 180798
14381 180798 272237 256745 312792 347151 234294 53389 -56383 -161327 -301382 -278476
14371 -278476 -52355 88608 25065 20291 -2229 -100467 -131492 -107650 -124629 -817 -6751
14360 -6751 -113507 -77442 -107034 -212222 -252874 -234756 20329 179073 198618 94592 139985
14349 139985 112606 140586 33983 57014 31481 -46100 -119923 -132632 -72548 -144077 -35500
14338 -35500 17718 -173295 -194701 -28782 -4991 -34018 -115088 -149851 -222311 -121232 -39950
14327 -39950 -142300 -95360 44884 92008 -4635 25546 125013 176978 86108 68963 -100642
14316a00642k5231N0091J67173O048k10413j77369k0006J64593K20875M6684M8640
14305A70443K2778o8557n4665m2023k0717j9371L3460j34193p7152o7466n8394
14294c15857R9822Q7861q429q5776N9212J17152K6813L8694L9272L4521L3898
14283A27183Q7473J01518r7723R4021L0908o2744o4137k46011K9438l08j5854
14272a6236P8368o0466k6646Q3262J63177J94708o2488k26499j01805m6429O4038
14261D2984R4624O4061j92534J14789K9880l6248q6823M8782j50947o0652r836
14250a41920J5182M8008J30882j17761o8813Q0808J2142K27025R6481m9737o7867
14239A64430j08561m0780P6658P9542r7136j28968K737K5539m771j45175N3747
$$ plain form
14316 -100642 -125873 -75782 91391 97439 -112974 -290343 -310349 -145756 75119 121803 170443
14305 170443 193221 124664 69999 27976 7259 -12112 21348 -112845 -189997 -257463 -315857
14294 -315857 -216035 -128174 -136603 -222379 -163167 -46015 -19202 19492 58764 93285 127183
14283 127183 214656 316174 218451 312472 343380 280636 216499 -29512 -74 -382 -16236
14272 -16236 62132 1666 -24980 58282 221459 416167 353679 127180 25375 -21054 42984
14261 42984 137608 201669 9135 123924 153804 117556 30733 79515 -71432 -132084 -141920
14250 -141920 -126738 -78730 52152 -65609 -134422 -53614 -41472 185553 282034 232297 164430
14239 164430 55869 15089 91747 171289 74153 -54815 -52078 -26539 -31310 -176485 -122738
14228a22738K45184J71784l9871j10783R3528m2201l8917j30348r5830o556J47762
14217G1014J7316n4931J03434K7044j57405k0603m317O8052l4410R2868J17004
14206B25066j53814j9085R3809J07313R5566l1179p3632J9929L3413L0011K4303
14195C51700K4650j07163k36846j55586K2393K20595N5452k8867j2394j07581
14185B6353k01962o7057P9495l131O1244M8804m8412P6759J01894J07239P0150
14174B51376o7931m5206j7572j16564P9592n1709j11916J2633P700J07627l5737
14163A2293j06348J8331m8964l1714L5766K593m7170N4444Q8670o8018o7541O4593
14151i3065L1738j0598O8211k26138k8696O4321J38602J18731J0050M4305j624
$$ plain form
14228 -122738 122446 294230 254359 143576 237104 194903 155986 25638 -70192 -76748 71014
14217 71014 88330 33399 136833 163877 6472 -14131 -18448 49604 15194 108062 225066
14206 225066 71252 52167 145976 253289 348855 317676 244044 263973 297386 327397 351700
14195 351700 376350 269187 32341 -123245 -100852 119743 175195 146328 133934 26353
14185 26353 -175609 -242666 -163171 -166302 -105058 -56254 -104666 -27907 73987 181226 251376
14174 251376 183445 138239 120667 4103 83695 31986 -79930 -67297 -59597 48030 12293
14163 12293 -94055 -75724 -124688 -156402 -120636 -118043 -165213 -110769 -22099 -90117 -157658 -93065
14151 -93065 -61327 -71925 -3714 -229852 -258548 -194227 -55625 63106 73156 117461 115837
14140A15837J05649k64371o0284J50482j09120p8502L9922O936L10958N9815r7968
14129A79354j49049n6529j8449Q0625J86593N8255O7101j24193m4284j23829p8569
14118b2974q6995K4527L6851o320N7527Q0587J90315p5482j29609r4195N0653
14107B4885j11224N7730l1259J3898O0895j9094Q3976Q9946j05813p4092p0139
14096h0291j93468j66220J34580J18604k4461Q4015Q9206j1110q1707o4619o6308
14085b61779j50351L1373J40960J52209p146j3154L2117K1969J10798m1872j65648
14074a50524l4310n8965J03292J76682K9159P3155n7235k03056K7014O7494L7426
14063A0132j6060n2783o1865p168m076j97352O0366K25744J62691R2609K460j89507
$$ plain form
14140 115837 221486 -42885 -103169 47313 -61807 -140309 -100387 -93451 217507 277322 179354
14129 179354 30305 -26224 -44673 35952 222545 280800 347901 223708 179424 55595 -22974
14118 -22974 -109969 -85442 -48591 -54911 2616 83203 273518 198036 68427 -25768 24885
14107 24885 -86339 -28609 -59868 -45970 14925 -4169 79807 169753 63940 -10152 -80291
14096 -80291 -273759 -439979 -305399 -186795 -211256 -127241 -38035 -49145 -130852 -195471 -261779
14085 -261779 -412130 -380757 -239797 -87588 -94734 -107888 -75771 -53802 56996 15124 -150524
14074 -150524 -184834 -243799 -140507 36175 65334 138489 81254 -121802 -94788 -27294 10132
14063 10132 -5928 -58711 -120576 -127744 -131820 -329172 -268806 -43062 119629 212238 214698 25191
14051B5191o1890J6040P702q080J31916J67368j55456K3482j19865n7420o5520
14040i6532K285p632n0066J29404m5413j5555q1565O5178M3050M731J95045n9352
14028H3578j42195j0093R3574J76046j05182o6424L4211O5055l6316r1678j8772
14017a8196L4673J64663j18125K3365J18024o7036j43661L0886L7913j0011j24018
14006g1523J3034O8410K844J61893K04278p6214j50846l4699j71506j0995Q975
13995e6349J53428J5809L8213M180r2360R7003j02943j31288k7939N917J71025
13984G4696N2958L2376j39636r1852j56247J7484J54092j28580P5182R792P7027
13973b2708K53574n7165K6509J09743n9015j34842l7161k1284j12939K5030K7766
$$ plain form
14051 25191 -36699 -20659 -12957 -21037 110879 278247 122791 146273 26408 -31012 -96532
14040 -96532 -94247 -101879 -151945 -22541 -67954 -83509 -165074 -99896 -56846 -52115 142930 83578
14028 83578 -58617 -68710 24864 200910 95728 29304 63515 128570 92254 576 -18196
14017 -18196 16477 181140 63015 86380 204404 137368 -6293 24593 62506 52495 -71523
14006 -71523 -58489 9921 12765 174658 378936 302722 151876 117177 -54329 -65324 -56349
13995 -56349 97079 112888 151101 155281 62921 159924 56981 -74307 -102246 -96329 74696
13984 74696 127654 160030 20394 -71458 -227705 -210221 -56129 -184709 -109527 -99735 -22708
13973 -22708 230866 173701 200210 309953 250938 116096 78935 57651 -55288 -30258 -2492
13962b492q9586j32700j16543J29786J48113J02094m0385J8343K8595k3961M395
13951B5659K7790L264n4805O5980K0208P6713m5123o7453k7671P070R818K8684
13939G0134M652j35140q606M0776O8126o9223K4066m4487o0485K6634O0707K12443
13927A89597N4893r0964q2046k31756J15701Q9479o3224K00071j7192o5067j32262
13916c2770K5123J74456o1719o9854k4435J3327o677q4070P6943J09007r0490
13905B8841M8138L7591j03463j07174J37752N0741J47479J71138j72943j28619
13895A09481j8801Q4239J28495J7321j43691r550K8404k0294l7622K1364l0283
13884A29063J40604m2036k63284l6243k04653L1197O9211K33265J46128j40438
$$ plain form
13962 -2492 -92078 -224778 -341321 -211535 -63422 38672 -1713 16630 45225 21264 25659
13951 25659 53449 56713 1908 67888 88096 164809 119686 52233 24562 31632 41450 70134
13939 70134 74786 -60354 -68960 -28184 39942 -29281 -5215 -49702 -110187 -83553 -22846 189597
13927 189597 244490 153526 71480 -160276 -44575 44904 -18320 181751 164559 99492 -32770
13916 -32770 -7647 166809 105090 35236 10801 24128 17451 -66619 10324 119331 28841
13905 28841 76979 114570 11107 -96067 41685 92426 239905 411043 238100 109481
13895 109481 90680 174919 303414 320735 177044 167494 195898 175604 137982 159346 129063
13884 129063 269667 227631 -35653 -71896 -276549 -245352 -176141 57124 203252 62814
13874F2814j32038p4275Q8857J60037P3411N3578P9494M1618j58894k09327O8460
13863E3735l9373p8924J4574j1622k9857k9920J57135P0809j60229j04309L2786
13852a25195P153M7779o8982j69794j31422K4623J94093J82971P2762J8674j02642
13841d9980j0971L1941n5579J93980j680o5795L2200O0523K18807q0743j31617
13830A41086R3503j846q0523j6832N4852J4904J67049Q5384j89189j7405r9184
13819A51799k36110j08119Q4855m8768j05921r464N9351J52369J5147j17345K7178
13808a35028J5341j07509P0329N6023m0812L7872q2756j2484R5183K34704J23068
13797B53931j35351j60238q8422J14674N6260q1884q4837j01371K1819J51083
$$ plain form
13874 62814 -69224 -143499 -54642 105395 178806 232384 311878 353496 194602 -14725 53735
13863 53735 14362 -64562 -49988 -61610 -91467 -121387 35748 106557 -53672 -157981 -125195
13852 -125195 -118042 -70263 -139245 -309039 -440461 -415838 -221745 -38774 33988 52662 -49980
13841 -49980 -60951 -29010 -84589 109391 107711 41916 74116 134639 353446 272703 141086
13830 141086 234589 232743 152220 135388 190240 205144 372193 457577 268388 250983 151799
13819 151799 -84311 -192430 -107575 -156343 -262264 -271728 -212377 -60008 -44861 -162206 -135028
13808 -135028 -119687 -227196 -156867 -100844 -141656 -103784 -186540 -199024 -103841 130863 253931
13797 253931 118580 -41658 -130080 -15406 40854 -41030 -125867 -227238 -205419 -54336
13787e4336J72507M7670n7931j44427k9581O3894Q263l1348n1579M9243J37619
13776A09994M9092l2599j11281N001J7486N6243j2242k3434J2995j18280L6497
13765a0528M3681r1917j3897n7980K4210J02440r3933p4293N8251Q7741j27009
13754a53234r2078q8147J2875J9463J44906J68264j1207j7202O6724m7404q6013
13743h3053K2476J79709M3928l9826J9889q3387k6149N2715r9806M210o7764P540
13731f9518m6975m9640M2917K29398Q4761k01609J6727k6084r9942J23234K4426
13720B7695J59714K06143j9651k36355o7114O1204L0646j3191L7595j54299j42039
13709a09652o3900L4483P7260M4691l5423j25901Q3374P2871j67307M5352J68785
$$ plain form
13787 -54336 118171 165841 107910 -36517 -66098 -2204 6059 -25289 -76868 -27625 109994
13776 109994 159086 126487 15206 20207 37693 93936 81694 58260 71255 -47025 -10528
13765 -10528 33153 -58764 -72661 -130641 -106431 -3991 -97924 -172217 -113966 -26225 -153234
13754 -153234 -245312 -333459 -320584 -301121 -156215 12049 842 -16360 50364 2960 -83053
13743 -83053 -60577 119132 163060 123234 143123 59736 33587 86302 -13504 -9294 -77058 -69518
13731 -69518 -116493 -166133 -123216 106182 190943 -10666 6061 -20023 -119965 3269 27695
13720 27695 187409 393552 373901 137546 70432 131636 162282 149091 186686 32387 -109652
13709 -109652 -173552 -139069 -61809 -17118 -52541 -178442 -95068 -22197 -189504 -144152 24633
13698B4633M9108j1545q9673Q1448o0385p8004j79659j51448P2515l6257J02987
13687b76280J32317J6717q3295P7184J31814K9472n0656j20924j25264R3266L8738
13676a36911n0511k06123n0495K55988J39574N0559q6637O8521J2615J25103O2943
13665A84626l5110n1466Q3864j04152m5958j5093L9823J37694L6008j10314l5704
13654H4218j9533O3723P2861p8952j37209n1172P3832J16524M8401j52042j72450
13643a51799n0045K54796m1047j1172L09243n8547N4138K5508l6507j58943j56949
13632b1324J25541n6415p1008M2276J7584j14914j21991J8443o110j78387J15025
13621b51280K15344N2432J00473J0682q7308r2264j47438R1883M866l1772M0343
$$ plain form
13698 24633 73741 62196 -27477 53971 -6414 -84418 -264077 -415525 -343010 -379267 -276280
13687 -276280 -143963 -127246 -210541 -133357 -1543 27929 -22727 -143651 -268915 -175649 -136911
13676 -136911 -187422 -393545 -444040 -188052 -48478 2081 -84556 -16035 -3420 121683 184626
13665 184626 149516 98050 181914 77762 31804 16711 56534 194228 230236 119922 84218
13654 84218 64685 128408 201269 122317 -14892 -66064 7768 124292 172693 20651 -151799
13643 -151799 -201844 52952 11905 733 309976 251429 305567 331075 294568 135625 -21324
13632 -21324 104217 47802 -23206 19070 36654 -78260 -200251 -181808 -187918 -366305 -251280
13621 -251280 -35936 16496 116969 127651 40343 -51921 -199359 -107476 -102610 -134382 -94039
13610i4039P4292j10870k19678Q0485Q5067j2616Q2515n7829l3725R4253Q8588
13599b3557J69293M4060o7360j22309j23020J01135M668n5253p4881M6160N0945
13588e0119n8858j07020K9748J10233o4846K0611l743L3914r3918j18454J98131
13577a04321n293J6475J09907j0259Q1401l3530j3690p6009r0887j4361j3587
13566a54154R626k1762j6523m0175N3019n4014q3954j71355J16578K06110p4836
13555b31440n0190J97546R1856Q9148M407j06540K7077P4050L1532J6587j6942
13544A27091o8207P4588j84306O4665L6743R7671K12316o0064j38244O2818k8822
13533A96249j33119o5826j18677r0339p101l0933K20255P1476R502O1484j38557
$$ plain form
13610 -94039 -19747 -130617 -350295 -269810 -184743 -197359 -114844 -172673 -206398 -112145 -23557
13599 -23557 145736 189796 122436 127 -122893 -21758 -17090 -72343 -147224 -101064 -50119
13588 -50119 -108977 -215997 -186249 -76016 -140862 -120251 -123994 -90080 -183998 -302452 -104321
13577 -104321 -109614 -93139 16768 6509 87910 54380 40690 -35319 -126206 -140567 -154154
13566 -154154 -144528 -166290 -182813 -222988 -169969 -223983 -307937 -479292 -362714 -156604 -231440
13555 -231440 -281630 -84084 7772 96920 101327 -5213 21864 95914 127446 144033 127091
13544 127091 58884 133472 -50834 13831 50574 148245 360561 300497 162253 225071 196249
13533 196249 63130 -2696 -121373 -211712 -218813 -249746 -29491 41985 51487 112971 -25586
13522b5586N1024K34607j6448k4267q3137J8197m8468L6449k3198L4659R4265
13511B48097L7786m5666p4320j51381j53359j60205O3885K39813K20413N003r1546
13500A38520o3135P8940j83066p5155J11979o4359M6887P1792k0957o9502N365
13489b2691j1224k8075K6137o7110l3747O1440J29108J12564j12545k06148n8212
13478b10503P6391K335L6651j29762m1272J07995j62881M9863Q7946L081O5199
13467a14957Q5251k8599j23444j31251J24981J52438L206j2823m118O5966j06589
13456h9939P3557l3925j42924l3356k4109l9670M2591J02672m9659j8372R5894
13445a17240o3253J42171M2434o4530o9022j47370n8560N9368Q6564J24503J00870
$$ plain form
13522 -25586 25438 260045 243597 219330 136193 154390 105922 142371 119173 153832 248097
13511 248097 285883 240217 165897 14516 -138843 -299048 -235163 4650 225063 230066 138520
13500 138520 75385 154325 -28741 -103896 8083 -56276 -9389 62403 41446 -28056 -22691
13489 -22691 -33915 -61990 -35853 -102963 -136710 -75270 53838 166402 53857 -152291 -210503
13478 -210503 -134112 -131777 -95126 -224888 -266160 -158165 -321046 -271183 -183237 -180156 -114957
13467 -114957 -29706 -58305 -181749 -313000 -188019 -35581 -32375 -45198 -49316 16650 -89939
13456 -89939 -16382 -50307 -193231 -226587 -250696 -290366 -247775 -145103 -194762 -213134 -117240
13445 -117240 -180493 -38322 4112 -60418 -129440 -276810 -335370 -276002 -189438 -64935 35935
13434C5935n9353j31863r7337k7470R1606J96531l5156k5129J21025J2898k1263
13423F0424m2758O3278j96698M7754J02386K64199R1355q2897k45707k63233p7515
13412b79412J3160P5862J44369P5329k39143P0890J575m7764K13178N883r5931
13401f2004N0212Q9602J4542Q066j87490m4328O9964L8065R0192N4297P1972J86118
13389C79208Q6239j37697j17784L2915M2957m4663n1928J16825J0072j04417j09015
13378A02712j22282J02110k9780j93862P915K23693O495n9383l309K5837K3159
13367H3305p0384P7252j0256J6195l0143N0243M2883r0576j33158K8756N0179
13356A4296N4483j38350k7207j3870j26196r588M0829J23589P1504r3661m4293
$$ plain form
13434 35935 -23418 -155281 -252618 -280088 -188482 8049 -27107 -52236 68789 81687 60424
13423 60424 17666 80944 -115754 -68000 34386 298585 389940 307043 61336 -201897 -279412
13412 -279412 -266252 -190390 -46021 29308 -209835 -138945 -137370 -185134 28044 33927 -62004
13401 -62004 -11792 77810 92352 100418 -87072 -131400 -61436 -23371 66821 121118 193090 379208
13389 379208 465447 327750 209966 242881 285838 241175 189247 306072 316144 211727 102712
13378 102712 -19570 82540 52760 -141102 -133187 90506 97001 37618 34309 60146 83305
13367 83305 12921 90173 79917 96112 65969 116212 159095 68519 -64639 -35883 14296
13356 14296 68779 -69571 -96778 -110648 -236844 -246432 -205603 -82014 -10510 -104171 -148464
13345a48464K9908o1420j20217R6578j5974K4483J94222P7817k05923n80L8816
13334i0754N9901K0142J31485R2456j05546l5374N0560P8749j74057r8663J38350
13323F7249j72481M7213P7006L3557q3065K5011J42019J8833q485n8031J45201
13312B34027j9907L4272K0401N8879j51374k59180o0859o8163m5322P6155J51323
13301b9748o6042O7725N788O8466j15647m0670L41464J66984p9599j53262j22095
13290D3364j16410L1045L295j12333j30047P0744J44174j2900J48300J07224m5769
13279A30687q5001j32942m5880J89602M7849j42172l7423P4431M1904m3518j029
13268c492J62899N0834j75570j02393M8404l0933P2484o4885O0262l372J23051
$$ plain form
13345 -148464 -118556 -179976 -300193 -203615 -219589 -195106 -884 76933 -128990 -129570 -90754
13334 -90754 -30853 -10711 120774 213230 107684 72310 122870 201619 27562 -71101 67249
13323 67249 -105232 -58019 18987 52544 -30521 -5510 136509 155342 146857 88826 234027
13312 234027 214120 248392 268793 327672 176298 -82882 -143741 -211904 -257226 -181071 -29748
13301 -29748 -95790 -28065 -22277 46189 -69458 -110128 231336 398320 318721 165459 43364
13290 43364 -73046 -42001 -38706 -151039 -281086 -210342 -66168 -79068 69232 176456 130687
13279 130687 45686 -87256 -133136 56466 104315 -37857 -75280 -849 41055 -2463 -3492
13268 -3492 159407 210241 34671 -67722 -19318 -50251 22233 -42652 17610 14238 137289
13257A37289J0920n4922r8634r9811m6224J35410J99763P7425q8869J9425Q2023
13246B73795q5425q4420O9413m5741q0986K4009J52369j67501j71939o3620N6651
13235a23395J69223m7590k3847O6133J75509K22437p324k86273n6319q099o999
13224G3456N776J96210L4086K2670n7079j60918M6913r2083o8642J6734O7315
13213H4438J12775J21906j09724j52132O5721o4134q5870j01820o4960N6349J58991
13202B1540R1551N114j02777l4989m9672n1899M7526K42596K02843j26105n1863
13191A93865J61515j35287K5392o3841j9574j242Q3622R2241L0925j43396j55220
13180F9000q3872R3039M992p1444q0926j46549m0019r593P4185P9247P6826Q4930
$$ plain form
13257 137289 148209 93287 -5347 -105158 -151382 -15972 183791 261216 172347 191772 273795
13246 273795 188370 103950 173363 127622 46636 70645 223014 55513 -116426 -180046 -123395
13235 -123395 45828 -1762 -25609 40524 216033 438470 431146 144873 88554 80455 73456
13224 73456 79232 275442 309528 332198 275119 114201 161114 69031 389 17123 84438
13213 84438 197213 319119 209395 57263 122984 58850 -27020 -128840 -193800 -137451 21540
13202 21540 113091 118205 15428 -19561 -69233 -121132 -73606 168990 371833 245728 193865
13191 193865 355380 220093 245485 181644 162070 160828 244450 336691 367616 224220 69000
13180 69000 -14872 78167 83159 11715 -69211 -215760 -255779 -265372 -191187 -111940 -35114 49816
13168D9816P3595j75464q8652Q5275R0911n0560k9787j5457Q4911K9058l0171
13157B3475R7518P9221k8173j27789k3178J16511q7283q4715Q3549Q402P4176
13146A31714N0014J87062M0284o6390j76149j99274Q5986L2418j14486O134O9365
13135D6678K0384R5551Q2402j1825r9412L0687J2920J975r078L9948L649j08688
13123A05191k99591N5475p4907J35393K25155q6230Q2428j71324J71023R4528
13113B37141n0566l5845J07786k1345n1315L8781L0200J16625J6853l5311j65120
13102A87884p7197K9255j28801k16788K7823J87840P3733k2615n321J8048k29308
13091a55447j00670K14087J46741r791j8347J37034J05230J45977j14111o5200
$$ plain form
13168 49816 123411 -52053 -140705 -55430 35481 -15079 -44866 -60323 24588 53646 23475
13157 23475 120993 200214 172041 44252 21074 137585 50302 -34413 49136 57538 131714
13146 131714 181728 368790 409074 342684 166535 -32739 53247 85665 -28821 -22687 46678
13135 46678 67062 162613 245015 233190 133778 164465 177385 179360 170282 210230 213879 105191
13123 105191 -194400 -138925 -213832 -78439 146716 60486 142914 -28410 142613 237141
13113 237141 186575 150730 258516 237171 185856 224637 254837 371462 388315 353004 187884
13102 187884 110687 139942 11141 -205647 -177824 10016 83749 61134 55813 73861 -155447
13091 -155447 -256117 -42030 104711 94920 76573 213607 318837 464814 350703 285503
13081B85503m2716P9476M4845j22945j06181j18807O958m6278R7173J03228m0074
13070A40182p9096j8426J9180P382n144K4666J6382o2233K1204J02064J04640
13059B70801p4639j07456O2612J5023l6247M0516p7812q9740k18928J26230K28625
13048A38985P2420j9203n8710J52785J35031r4294p1927r2583j40809m0216L7896
13037A9375n5474P0716L6314O1371J17600J01288M6190j64241j30304m0316k0456
13026D2063L5892P7567p5863J09022J12872j75265l2480Q9512j45280m9407Q1747
13015G0380J66266l0933N740J78417j64794j38336L4615l659J7948r8158r7557
13004f0071m7001j518K36116J04370K444K9460J07545n9979j65020o2599O7637
$$ plain form
13081 285503 242787 322263 367108 244163 137982 19175 26133 -20145 77028 180256 140182
13070 140182 61086 42660 61840 69222 64078 88744 105126 42893 64097 166161 270801
13059 270801 196162 88706 151318 166341 130094 170610 92798 3058 -215870 -89640 138985
13048 138985 211405 192202 133492 286277 421308 327014 255087 162504 21695 -18521 19375
13037 19375 -36099 34617 70931 132302 249902 351190 397380 233139 102835 62519 42063
13026 42063 77955 155522 79659 188681 301553 126288 93808 183320 38040 -11367 70380
13015 70380 236646 205713 211453 389870 225076 86740 121355 117696 135644 37486 -60071
13004 -60071 -107072 -108590 127526 231896 234340 263800 371345 311366 146346 83747 151384
12993A51384o8386j16168o8120J00665J61965j226J09349N7681j94005o4396j750
12982F6993P5895p0506L900N8071n219k483p6150J48760J84218k9730j72575n1411
12970A29763j23283k19046k8970P8976J68881M0250j09205N899K03087N0838r5138
12959A02052j97347N4528K9700q8109L9634K24524Q2107j4642R0027k4256l1710
12948B66508L442j85286J15054p2373l749N1631P8832R83j9588j75026O1700K4044
12936A46172k2312J72317j08863j17262j09151m5219R4758p1871p970R4965K2962
12925D8526J27590j30279j22821l4339k4859J01392R0474K0606J40409r8267Q8326
12914B06758J0099m2928j26179o4540k9227p8116L3484n144O6175N5500k404j59342
$$ plain form
12993 151384 82998 -33170 -101290 -625 161340 160114 269463 327144 133139 68743 66993
12982 66993 142888 72382 76282 134353 129134 126651 50501 199261 383479 353749 181174 129763
12970 129763 6480 -212566 -241536 -162560 6321 46571 -62634 -56735 146352 197190 102052
12959 102052 -95295 -40767 -11067 -99176 -59542 164982 247089 232447 322474 298218 266508
12948 266508 269950 84664 199718 127345 123596 175227 254059 255042 235454 60428 122128 146172
12936 146172 123860 296177 187314 70052 -39099 -84318 10440 -61431 -69401 25564 48526
12925 48526 176116 45837 -76984 -111323 -136182 -34790 55684 76290 216699 118432 206758
12914 206758 216857 173929 47750 -16790 -46017 -124133 -90649 -95793 -29618 25882 23478 -135864
12902a35864P3256r166r4579J54547M9996k3288K56936J01026j54316R7831k1791
12891B94588J00737l4541j03731j64366J06414l1952j1941l1695M0769n6944K04675
12880C12013K1759r7266o2958m2417J41721O6559j5078j44015j35818l3896k8619
12869a8015J3781K216K2868J2833j02947j00832K5111L0568J40337J58026J03205
12858B87151m0393j90121J2757N6866o1506j340J25802N3408r7079Q0140N8927
12847B84612j29106o0547l3020j19955j30561o9578N6013O5617J7916L443j1069
12836a26235j960J90102J32453l7261M4966Q6931q5377r5120j18306p2510l9307
12825a21624k140r4868L8045J49034N4033J59463l2026k44827j85078K03602K36692
$$ plain form
12902 -135864 -62608 -71774 -166353 -11806 38190 14902 271838 372864 218548 316379 294588
12891 294588 395325 360784 257053 92687 199101 167149 155208 123513 164282 107338 312013
12880 312013 333772 236506 173548 131131 272852 339411 324333 180318 44500 10604 -18015
12869 -18015 -4234 -2018 20850 33683 -69264 -170096 -144985 -114417 25920 183946 287151
12858 287151 246758 56637 69394 126260 64754 63414 189216 242624 145545 225685 284612
12847 284612 155506 94959 61939 -58016 -188577 -258155 -202142 -136525 -118609 -115166 -126235
12836 -126235 -128195 61907 194360 157099 202065 288996 203619 108499 -9807 -82317 -121624
12825 -121624 -123764 -218632 -180587 -31553 22480 181943 149917 -94910 -279988 -76386 160306
12814A60306O8349l6964j04621k39152j12022K1611J00754J57762K08174N73j19940
12803A04830L815M4104J06930q7783l597O6668R9749K5683j45017j10520K1718
12792A26580J24889K4121L6490o3143j12535m2161L35q1879l0620k2674j13230
12781a53827j27995J64367J63300P8089m7174j13484M7678N9530P2573R123K3161
12770A75341Q610l0301Q3215J83316l9605k7116M633l6404r0109o6230r8279r6319
12758b9248p3390J6265J80r985o7249N6078K4727J04471J94306J66441J1178j5918
12746C77856o5415n5768n7119j21787J7313J1833m2790N5240J32907O7714n4496
12735B65488j70063o1103r4992J8959M9379L1924P2709R9234k9123n9941n1282
$$ plain form
12814 160306 228655 191691 87070 -152082 -264104 -242493 -141739 16023 224197 224770 104830
12803 104830 108645 152749 259679 171896 168299 234967 334716 360399 215382 104862 126580
12792 126580 251469 275590 312080 248937 136402 94241 94576 12697 -17923 -40597 -153827
12781 -153827 -281822 -117455 45845 123934 76760 -36724 10954 70484 143057 152180 175341
12770 175341 183951 153650 236865 420181 380576 353460 358093 321689 231580 165350 67071 -29248
12758 -29248 -102638 -86373 -86193 -96178 -163427 -107349 -82622 21849 216155 382596 393774 377856
12746 377856 312441 256673 199554 77767 95080 106913 64123 119363 252270 319984 265488
12735 265488 95425 34322 -60670 -41711 7668 39592 112301 211535 182412 122471 71189
12724G1189p8673k574l2010n7985M6855P0104J69260R6035K810j06020j20673
12713E8318p0446n8314N1970N8027n5639k2854K4089O4872k882k6137j3655p7064
12701f9715J12551L03749r7148j23682j72983k0271K1057J32395j9683k6055J00930
12690A41145J11855r0150j8437P2853K7188k2575J74950k6389j16917J6834k4840
12679B45517l1368m1371K564m7214j28364J54972O5572l451J6652l6796q9107
12668A07606J6255j4247M0483o2499L174j34192o0597J64480K36712N0519q6795
12657B60899n6433J56119j20872j53331m7584P4526K0254J06052j8428j8829r1940
12646A10433l3413M0194m4232J49621J72251N0729N9334k32022k56535J06729
$$ plain form
12724 71189 -7484 -10058 -42068 -100053 -53198 16906 186166 282201 285011 178991 58318
12713 58318 -12128 -70442 -18472 39555 -16084 -38938 -14849 50023 47141 21004 7349 -69715
12701 -69715 42836 346585 249437 125755 -47228 -67499 -46442 85953 66270 40215 141145
12690 141145 253000 162850 144413 217266 244454 221879 396829 370440 253523 270357 245517
12679 245517 214149 172778 175342 128128 -236 154736 220308 216857 233509 196713 107606
12668 107606 123861 109614 150097 87598 90772 -43420 -104017 60463 297175 347694 260899
12657 260899 204466 360585 239713 86382 38798 113324 133578 239630 221202 202373 110433
12646 110433 77020 117214 72982 222603 394854 445583 504917 272895 16360 123089
12636A23089N7187K1033j38301j28254J13727M9256o2269r4687J76860K2517j5462
12625A24696j5918M8017j08692l9918N3953J39191Q4409J8570R1065J43158k05240
12614C33291p8447r8085r8170J52454J84380p5325J7277p4260l6900k187r1760
12603A32268J07313Q7794k3322r5078j09656J38983J00575q7031L2032J27240
12593D11118O7008k47861j11741J15841J19377L067m4594K9711j50774j41091
12583E0061o174R8772k4880K8597Q2046N2158k39149j12913K168J35014K65345
12572C31045n2644j6534p3598o4192Q5483R0531k44445k2757P5057K880k1533
12561H9293M6729k3801l1294p923M8079j7401o292l252P35L4618L2315n0939Q3104
$$ plain form
12636 123089 180276 201309 63008 -65246 48481 97737 35468 -59219 117641 140158 124696
12625 124696 108778 156795 48103 8185 62138 201329 285738 304308 395373 538531 333291
12614 333291 254844 156759 58589 211043 395423 320098 337375 263115 226215 224028 132268
12603 132268 239581 327375 304053 208975 99319 238302 338877 251846 283878 411118
12593 411118 478126 230265 118524 234365 353742 356809 312215 341926 191152 50061
12583 50061 43887 142659 117779 146376 228422 280580 41431 -71482 -69314 65700 331045
12572 331045 278401 261867 188269 124077 209560 300091 55646 32889 107946 110826 89293
12561 89293 136022 112221 80927 73004 121083 103682 97390 94138 94873 129491 161806 110867 193971
12548A93971P7212j44937N8986J25711q1182j74847M2796L4202J04782J18392
12538C55086n3276q7905K0708j19103j07071J92105J71177N3764r2597j30389
12528B02499j12986J37994j8816r263K9077P6087J02500J15382J4817K8366L1042
12517E96699j24270p5652J1874n7199j61823P713J23312m71M0219k239J50994
12506E09157j30242k59924M8806j41679J30112J49372k4130L025j94668j36372
12496d6543J31374O8683J71413Q7265m5072n034j32736l5377P4607p0468n345
12485A92767m9150M8398n001R391R8486l1543J1776O4319l5882M5326k4871Q6947
12473D10963J24935o3671j71751j16765j7402K1602K5094J81478J23342p171j54843
$$ plain form
12548 193971 271183 126246 185232 310943 229761 54914 97710 131912 236694 355086
12538 355086 301810 213905 234613 115510 8439 200544 371721 425485 332888 202499
12528 202499 89513 227507 208691 199428 228505 304592 407092 522474 537291 565657 596699
12517 596699 472429 396777 408651 351452 189629 197342 320654 320183 360402 358163 509157
12506 509157 378915 118991 167797 26118 156230 305602 281472 284497 89829 -46543
12496 -46543 84831 153514 324927 412192 367120 362086 229350 193973 268580 198112 192767
12485 192767 143617 192015 187014 196405 294891 263348 275124 339443 303561 348887 324016 410963
12473 410963 535898 472227 300476 183711 166309 187911 213005 394483 517825 510654 355811
12462C55811j69378j10304Q5754L0983J50458p5153j39332J25610J46894j852
12452C99491K0218j18088j02012P7953Q9351O653m4250Q2171o8290K4525J4014
12441C81736k6277q0742j04266j00733l4037Q3396m2871k0832N1263J48055J99058
12430D53750J81881j45898j30158l3034q5066j5719Q5495J66601o5584j96054
12420B16214J20412p6057n9283J10821J03011J45525J09300j60805j90657K3937
12410C42418N7712R3556R4724j48286K5693l0774p9928J0136L9208P3954m6817
12399D31596j43435j8269J01302J66635P8846j24805j50247o5871k2716M7222
12389C00258P9240J6736J89929Q9564L5160k1166k93415k00644j8299J3415M3975
$$ plain form
12462 355811 186433 76129 161883 192866 343324 268171 128839 254449 401343 399491
12452 399491 419709 301621 199609 277562 366913 373566 329316 411487 343197 367722 381736
12441 381736 355459 274717 170451 69718 35681 119077 76206 55374 106637 254692 453750
12430 453750 635631 489733 359575 326541 241475 225756 311251 477852 412268 216214
12420 216214 336626 260569 201286 312107 415118 560643 669943 509138 318481 342418
12410 342418 400130 493686 588410 440124 465817 435043 355115 365251 404459 478413 431596
12399 431596 288161 269892 371194 537829 616675 491870 341623 275752 253036 300258
12389 300258 379498 396234 586163 675727 710887 689721 396306 195662 177363 190778 234753
12378B34753J39660k381n682k4717N5946j09625k05671J54356J82262n5408j34477
12367B29016J31417M2885O4816P2003j95049J01042J34292l2085N4628n0162J0258
12356E63061m4724m667j16438j03020J0202O1625j0006M728M9397K0459R7583
12345E28200l0097J2978J45834R333j41812k4108k6528j97793M4921K67832J64830
12334G53590l0635r3448j06884O457M7720J24510J1704k11554j01445j25112P2829
12323C47732J21350L1639j04370k01525J24688J46612J71054J16944j74216j67347
12313D12561j2535P5568l4834Q6562J76619P4371k33232j01402L0937o3204K2871
12302D34282N9682j33841o8572R4489J33967L3318j01921M9184j7926J60084R8994
$$ plain form
12378 234753 374413 372032 366350 341633 397579 287954 82283 236639 418901 363493 229016
12367 229016 360433 403318 468134 540137 345088 446130 580422 548337 602965 552803 563061
12356 563061 518337 513670 397232 294212 304414 366039 356033 360761 410158 430617 528200
12345 528200 498103 511081 656915 666248 524436 500328 473800 276007 320928 588760 753590
12334 753590 722955 629507 522623 529080 576800 701310 713014 501460 400015 274903 347732
12323 347732 469082 500721 396351 194826 319514 466126 637180 754124 579908 412561
12313 412561 400026 475594 440760 527322 703941 778312 545080 443678 474615 411411 434282
12302 434282 493964 360123 291551 386040 520007 553325 451404 500588 482662 642746 741740
12291G41740k2491R3044J86732j92456j63799K6509J13794J11454j55850j28830
12281F09847k5309l7647J82374K01962m3652J0706j34238K2178m2567j73123q3169
12270D87362M5469J69078K11591k2778r9447N9559R0153Q3541j09727P9296n5352
12259I38745P1885n4313r659K9722j53144o7275q4613J93457P4028L8742o1447
12248I16128q7275k55143Q1442J01072J65438N7236k26494j37921P4590N2735
12238G41808M3409M5685L0995J00183l1246j14034l8475K05632R6430P7250o7537
12227A090100M9767Q4366O685K1232j36217o3414K4700j27402Q4938J30156L006
12216A167917K0546M049r1359j41783j63128k0268O6119J98051J77770Q2675j01416
$$ plain form
12291 741740 719249 812293 999025 806569 642770 669279 783073 894527 738677 609847
12281 609847 584538 546891 729265 931227 887575 898281 764043 786221 743654 570531 487362
12270 487362 532831 701909 913500 890722 791275 850834 940987 1024528 914801 994097 938745
12259 938745 1010630 956317 946658 976380 823236 755961 671348 864805 938833 977575 916128
12248 916128 828853 573710 655152 756224 921662 978898 752404 614483 689073 741808
12238 741808 785217 830902 861897 962080 930834 816800 778325 983957 1080387 1157637 1090100
12227 1090100 1139867 1224233 1230918 1252150 1115933 1052519 1077219 949817 1034755 1164911 1167917
12216 1167917 1188463 1192512 1101153 959370 796242 775974 842093 1040144 1217914 1300589 1199173
12205A199173Q0444K1220j37852j9650M4197N4813M5408Q8495o4803j10660P2864
12194A273649q3688P4157m109J65402J86961n1997j67901q6448M1726J73376P9399
12183A600527j89178j10039J81230L5996j36422j63537P1879K57796L0420k3158
12173A555514k05573L3500j9113L0252M9705J6164J25833J42902l2513k5422N2820
12162A724069J06671l9001p6391M6152r8764K4272Q062P5851J3366p1410o2191
12151A650686j10881K2118J28867P9594Q2340P5329r0436k3053R9829o014P6002
12140A984381M0316L9271M5980O4076J0579q6357J58423k7686q1759M6539m4947
12129B148816l1584m697J5854K9409J3005O7752k2091j03559K50966K09933M7341
$$ plain form
12205 1199173 1279617 1300837 1162985 1143335 1187532 1242345 1287753 1376248 1311445 1200785 1273649
12194 1273649 1189961 1264118 1260009 1425411 1612372 1560375 1392474 1306026 1347752 1521128 1600527
12183 1600527 1411349 1301310 1482540 1518536 1382114 1218577 1290456 1548252 1578672 1555514
12173 1555514 1349941 1383441 1364328 1394580 1444285 1460449 1586282 1729184 1696671 1671249 1724069
12162 1724069 1830740 1791739 1715348 1761500 1662736 1687008 1695070 1770921 1784287 1712877 1650686
12151 1650686 1539805 1561923 1690790 1770384 1852724 1928053 1837617 1814564 1914393 1908379 1984381
12140 1984381 2024697 2063968 2109948 2174024 2184603 2098246 2256669 2228983 2147224 2193763 2148816
12129 2148816 2117232 2112535 2128389 2157798 2170803 2238555 2216464 2112905 2363871 2573804 2621145
12118B621145K7045j75845j18073k7007k40504R9288K75697Q2771Q2575J4322
12108B641414M7885k7395K9857J04074J8715L9084P5630m1007j61841Q3885K38167
12097C048468K25090K76119K16257j87293k51356n4742J63277j16597N5399J25856
12087C500478J25522m3936R4070Q7911L1873N122J09663k1983k26193P752p5095
12076C595184l533O6624N2796j2018J71807K00320M0536k4683R0615R3509q5264
12065D185893N8742L7621J16678K06382J41144M9575K47980M3864O362j22706
12055D971535O8546O2757N0023P0711J30005J89666J74227o5151j26O7073J15932
12044E835198J31003O0604M6041J58313N0822p2089J54599M4305J17389J53424
$$ plain form
12118 2621145 2648190 2472345 2354272 2327265 2086761 2186049 2461746 2544517 2627092 2641414
12108 2641414 2689299 2661904 2691761 2795835 2814550 2853634 2929264 2888257 2726416 2810301 3048468
12097 3048468 3273558 3549677 3765934 3578641 3327285 3272543 3435820 3319223 3374622 3500478
12087 3500478 3626000 3582064 3676134 3764045 3795918 3801040 3910703 3888720 3662527 3670279 3595184
12076 3595184 3591651 3658275 3711071 3699053 3870860 4071180 4111716 4087033 4177648 4271157 4185893
12065 4185893 4244635 4282256 4398934 4605316 4746460 4796035 5044015 5087879 5094241 4971535
12055 4971535 5040081 5102838 5152861 5223572 5353577 5543243 5717470 5652319 5652193 5719266 5835198
12044 5835198 5966201 6026805 6072846 6231159 6281981 6209892 6364491 6408796 6526185 6679609
12034F679609K2486m5909J09892R6180J14695J50730j887Q3027J49312J00356
12024G458491J28844J87289l0355k5309K85834K45217M7208J33021L05690L55826
12014I091756J56740R9459j14052Q9937K12819J82463P6357J63792J80255J24549
12004A0264075J77899M58006K90681K49494J23209J88344K29677K09386K27970
11995A2418741L58241J21737K63456K46046J92010K79149L89907L62192L11326
11986A4942805L50038L08184K34894K53900J97613L05369M36735L79146K03652
11977A7612336L05672K73239L55746N63746N66737L73141M69395O26050M71603
11968B1617665L91536N04421N77351N08429P75905O45165N07002L39606M09158
$$ plain form
12034 6679609 6702095 6656186 6766078 6862258 6976953 7127683 7125796 7208823 7358135 7458491
12024 7458491 7587335 7774624 7744269 7718960 8004794 8250011 8297219 8430240 8735930 9091756
12014 9091756 9248496 9347955 9233903 9323840 9536659 9719122 9795479 9959271 10139526 10264075
12004 10264075 10441974 10899980 11190661 11440155 11563364 11751708 11981385 12190771 12418741
11995 12418741 12776982 12898719 13162175 13408221 13600231 13879380 14269287 14631479 14942805
11986 14942805 15292843 15601027 15835921 16089821 16287434 16592803 17029538 17408684 17612336
11977 17612336 17918008 18191247 18546993 19110739 19677476 20050617 20520012 21146062 21617665
11968 21617665 22009201 22513622 23090973 23599402 24375307 25020472 25527474 25867080 26276238
11959B6276238O37951N83458M64787N73766P00095N92275P94937O92572O77546
11950C1993625P07558P94913P29018N93024O75185O97881Q50783Q79504N69379
11941C8490870Q58966P62546P19355P92215R58559P90221N54401O58934Q95224
11932D5481291P39648M63037N24660O51134N68165M83197M82865O11752N46714
11923E0552463M08271K43021L52688L03201L37683J07885M8588P7462j55549J0901
11913E2286614n221p5961n9524j40168k28129k15842k09413n02396o59850n28695
11903D9661415l80473o25320p44845n30837m02349m80517n30109o06658p02085
11894D4658222o92464q85218p23644p09065o74365q76707q20116n84221m80698
$$ plain form
11959 26276238 26914189 27497647 27962434 28536200 29236295 29828570 30623507 31316079 31993625
11950 31993625 32701183 33496096 34225114 34818138 35493323 36191204 37041987 37921491 38490870
11941 38490870 39349836 40112382 40831737 41623952 42582511 43372732 43927133 44586067 45481291
11932 45481291 46220939 46683976 47208636 47859770 48427935 48911132 49393997 50005749 50552463
11923 50552463 50960734 51203755 51556443 51859644 52197327 52305212 52353800 52431262 52275713 52286614
11913 52286614 52281393 52205432 52145908 52005740 51777611 51561769 51352356 50849960 50190110 49661415
11903 49661415 49280942 48655622 47910777 47379940 46977591 46497074 45966965 45360307 44658222
11894 44658222 43965758 43080540 42356896 41647831 40973466 40096759 39276643 38692422 38211724
11885C8211724q28214p40267o42070q57854o52862o95682o95672p35472p15020
11876C1648611n39386m89891o08992p17390p51183n99311o08274n11652o06397
11867B6216135n37613l84260o26795o13438n87051n21122l03790n35220n21419
11858B1585427m64476l67415l23241m17242m82938l61084m41861m05670m54739
11849A7866761k75359l35596l77616k71986l74458l66456k30594k68563l78571
11840A4987562j67289j64442l96687m11840k74254j01985j96942k75523k62942
11831A2735658j47752j06692l30287l53629j78600l39699j56891m2944J8241j73264
11821A0924141j43407l50741l75794k51058k17976p1436n4174J4968j36394k11196
$$ plain form
11885 38211724 37383510 36643243 36001173 35143319 34490457 33794775 33099103 32363631 31648611
11876 31648611 31109225 30619334 30010342 29292952 28541769 27942458 27334184 26822532 26216135
11867 26216135 25678522 25294262 24667467 24054029 23466978 22945856 22642066 22106846 21585427
11858 21585427 21120951 20753536 20430295 20013053 19530115 19169031 18727170 18321500 17866761
11849 17866761 17591402 17255806 16878190 16606204 16231746 15865290 15634696 15366133 14987562
11840 14987562 14820273 14655831 14259144 13847304 13573050 13471065 13274123 12998600 12735658
11831 12735658 12587906 12481214 12150927 11797298 11618698 11278999 11122108 11079164 11097405 10924141
11821 10924141 10780734 10429993 10054199 9803141 9585165 9513729 9459555 9474523 9338129 9126933
11811I126933k01279j16152l18516j12009L8383n9951k90490j53627q5928m1199
11801G786165k68161l19182r9830m5142r3506k818j17933j00120q3762Q6723j22972
11790F619462k54900P7212O8239j14061k36154j03473k83800j00680K8077l7395
11780E662527m8267k7534j17073k7939j7055m7766k43695j87076q4004K2123N8909
11769D943150l9331k0533q2506o006j13876j26265m7501q1182j04409M0961J6550
11758D379052J7358j57475j52574k11474r3978P4978l3017P1320N8981L9879q3804
11747C909246j1516Q739p7655O894N9841q5530k14462N4216j86454o1853N4159
11736C455625J2048q5979o3079k6748r4394q5251j02648j51434n5394J18464J79259
$$ plain form
11811 9126933 8925654 8809502 8490986 8378977 8417360 8357409 8066919 7913292 7827364 7786165
11801 7786165 7518004 7198822 7098992 7053850 6960344 6957526 6839593 6739473 6655711 6742434 6619462
11790 6619462 6364562 6441774 6510013 6395952 6159798 6056325 5772525 5671845 5699922 5662527
11780 5662527 5614260 5586726 5469653 5441714 5424659 5376893 5133198 4946122 4862118 4884241 4943150
11769 4943150 4903819 4883286 4800780 4794774 4680898 4554633 4507132 4425950 4321541 4362502 4379052
11758 4379052 4396410 4238935 4086361 3874887 3780909 3855887 3822870 3894190 3953171 3993050 3909246
11747 3909246 3897730 3906469 3828814 3835708 3895549 3810019 3595557 3649773 3463319 3401466 3455625
11736 3455625 3467673 3381694 3318615 3291867 3197473 3112222 3009574 2858140 2802746 2921210 3100469
11725C100469J04613j63671j3093J68436m026j59587k05960o6859j30402l7012
11715B592908k2069j63280l3987J74513K2430O0533j4246J146k0358j1987M406
11704B590009M6024J8548J7707j03531p1251r4344j51592k6117N0617N4959p3305
11693B257724p47M396N2960N3944M759o5231j79516q1705j46356J1358K4937K17217
11681B153740L0538j2894m6843M4339L8476O0225n0202j65717r819J11874j8878
11670B134839k06009j9008J8785j31105j9463K7289J09241J11632N6958J560M5461
11659B130180j73330J343K12836R7629o0639Q6931P5905J12310r881O9729J13388
11648B656401K94117L15465J89400L61596L67335L21970J68089j10293k58717
$$ plain form
11725 3100469 3205082 3041411 3028318 3196754 3192728 3033141 2827181 2760322 2629920 2592908
11715 2592908 2570839 2407559 2373572 2548085 2570515 2631048 2616802 2617948 2597590 2585603 2590009
11704 2590009 2636033 2654581 2672288 2568757 2497506 2403162 2251570 2225453 2276070 2331029 2257724
11693 2257724 2256977 2261373 2314333 2368277 2373036 2307805 2128289 2046584 1900228 1911586 1936523 2153740
11681 2153740 2184278 2171384 2124541 2168880 2207356 2267581 2217379 2051662 2041843 2153717 2134839
11670 2134839 1928830 1909822 1928607 1797502 1778039 1805328 1914569 2026201 2083159 2084719 2130180
11659 2130180 1956850 1958193 2171029 2268658 2208019 2294950 2370855 2483165 2473284 2543013 2656401
11648 2656401 2950518 3265983 3455383 3816979 4184314 4506284 4674373 4564080 4305363
11639D305363l75313m10734k13181m92366k61900q3683j75588j30583r9386j60424
11629A902205j82350j84795j08449j15325J75097K4697q5459j55586n1076R8552
11619A317511n0523k9558J29847n2805j08981j29239K35403J79543j13033N2896
11609A431061m583j87327K6868Q2986j80637o9448N1393q7626m2259K72137l0946
11598A261619m5575Q6619J0530k72093j48665J0808J26407K26015l342j40402
11588A111921q8826l3484n6760J74552J50615m7802p4516j38603j55521q4152
11578G57424J32807J50896j2096j20949j14448q2183L0077M5275M1137Q5611j11411
11567H02140O3287K501j0246N6328j8148R5649p1699K6512o8700j10967R0487
$$ plain form
11639 4305363 3930050 3519316 3306135 2813769 2551869 2468186 2292598 2162015 2062629 1902205
11629 1902205 1719855 1535060 1426611 1311286 1486383 1511080 1425621 1270035 1218959 1317511
11619 1317511 1266988 1237430 1367277 1314472 1205491 1076252 1311655 1491198 1378165 1431061
11609 1431061 1426478 1239151 1266019 1349005 1168368 1098920 1150313 1062687 1020428 1292565 1261619
11598 1261619 1216044 1302663 1313193 1041100 892435 903243 1029650 1255665 1252323 1111921
11588 1111921 1023095 989611 932851 1107403 1258018 1210216 1135700 997097 841576 757424
11578 757424 890231 1041127 1029031 908082 793634 711451 741528 786803 827940 913551 802140
11567 802140 865427 867928 857682 914010 895862 991511 919812 946324 877624 766657 857144
11556H57144J83274q1246n7915N1652J28661P9173k22212j94898R0210M6418R2690
11545I72951k9627l2924r8156j80876p8832J00810N9118K9152M436M5864k9439
11534G62477J8301O7305L787k58402q1532P1597K9048p3022l9279n703Q9942J19203
11522G03722l6103j6810k16074j64830J06582Q9206l9976L9569K2991L2894k784
11511E18387K0737j0680N1322J16028k6653q9065R7679M4466n4702k6124k8653
11500F12742r7638j60495L5729J07786J13055N2485J72829R2309k60867j3892
11490F54043J48784j50028J4421K1694J02986L4351j37428j52337J0054J61682
11480G08222J86219K8292j95164J275k99946j51682p239K8011P367N9874k0698
$$ plain form
11556 857144 1040418 959172 901257 952909 1081570 1160743 938531 743633 833843 880261 972951
11545 972951 943324 910400 812244 631368 552536 653346 712464 741616 746052 791916 762477
11534 762477 780778 848083 851870 593468 511936 583533 612581 539559 500280 494577 584519 703722
11522 703722 667619 650809 434735 269905 376487 465693 425717 465286 488277 521171 518387
11511 518387 539124 528444 579766 695794 669141 580076 677755 722221 667519 641395 612742
11500 612742 515104 354609 390338 498124 611179 663664 836493 928802 667935 654043
11490 654043 802827 652799 667220 688914 791900 826251 688823 536486 546540 708222
11480 708222 894441 922733 727569 728844 428898 277216 269977 297988 305355 365229 344531
11469C44531K00092j7121j29279j8680l5040J74522k5575j21765O7295j6807l183
11458D18990K8175r0715p9370l0862m072q9997J08559J38885Q7738J1364k4955
11447D73740L4066m0395l7250k0488J74548J0041j11634J35085j5648m4255j04291
11436D53519j5438j15535O2189k6679O2690J01582l6516p7158J30884L7951Q5507
11425F62996J34195J3673k9950n3526n6261k3849j62544o5804o5997J62849R2529
11414F08311j9183P6317J1715j77011n7577J33709O6077J00308l8363j88946j25960
11403C89397q69J44833l9808j60339K2474K50251k6705q0557j5553L2018L999
11392E19141j15709j7567m2425L4637J02250N1661J21634p1832p7364N9980j1728
$$ plain form
11469 344531 544623 527502 398223 379543 344503 519025 493450 371685 438980 422173 418990
11458 418990 447165 356450 277080 246218 242146 152149 260708 399593 487331 498695 473740
11447 473740 507806 467411 430161 409673 584221 594262 482628 617713 602065 557810 453519
11436 453519 438081 322546 384735 358056 420746 522328 485812 408654 539538 577489 662996
11425 662996 797191 810864 780914 727388 671127 647278 484734 418930 352933 515782 608311
11414 608311 589128 665445 677160 500149 442572 576281 642358 742666 704303 515357 389397
11403 389397 388528 533361 493553 333214 355688 605939 579234 498677 483124 515142 519141
11392 519141 403432 385865 343440 378077 480327 531988 653622 581790 504426 564406 552678
11381E52678j4805j50454l4126J27820j05551j43491K1321N2330O8344J64967
11371E39033m6200l4352Q2994P61j76680r6549j26792O9652J56956k6558J45877
11360D88142J30172j53207q3447k8534m6156n9686J29169J3106N0124L731P780
11349D51194k6167n2392R4946K5776K4919R4254k01473K00347O7428q5526k28293
11338C65013j22261J55115J29432m5521j03176J8515j11697p3279m5094m7513
11328A19534M6381k2198J16393K09760j15766n5735l2816q9222j66036K2331L0140
11317F2766J17604l0147K8545J00217M9043p1178k4498p3407K4067K4987J15015
11306C23014o1101j41079j2620J14611R6136O329J7003k3404l6330J0544j4438
$$ plain form
11381 552678 537873 387419 353293 481113 375562 232071 253392 305722 374066 539033
11371 539033 492833 458481 541475 542236 365556 269007 142215 211867 368823 342265 488142
11360 488142 618314 465107 381660 353126 306970 247284 376453 389559 439683 443414 451194
11349 451194 425027 372635 467581 493357 518276 612530 411057 611404 678832 593306 365013
11338 365013 242752 397867 527299 481778 378602 397117 285420 212141 167047 119534
11328 119534 165915 143717 260110 469870 354104 298369 265553 176331 10295 32626 62766
11317 62766 180370 150223 178768 278985 328028 256850 232352 158945 183012 207999 323014
11306 323014 261913 120834 108214 222825 318961 325290 342293 318889 282559 293103 278665
11295B78665L8445q8281Q7870j2633k7152L1300r691m3020J9187j9533q6139j68327
11283F91p0165L2468R1157j3594N563M8960J67862Q358R0450o8921q3902k05358
11271C569n6523j5965K07146J19783n1637j814p8595q2677J07305r907l3200o1432
11259D6053l2886K5525K4689n569K411L0732Q8928J31861l3174p0162l1662J94360
11247C71106j9817m2434o6933j7529q0614j41223k8105J53950J1800l2435J57628
11236B65394K36417J28833r3741J1873m7618o3682p1395j9880Q796p6699q5278
11225A93020l3667q0695o8478N558n9394o1230R9363K08429J47956n9411J1667
11214C03118j00259L1354L0282j35095O535J13052j55793j25947J32031O3671
$$ plain form
11295 278665 317110 228829 316699 304066 276914 308214 298523 255503 274690 255157 169018 691
11283 691 -69474 -37006 54151 40557 46120 95080 262942 271300 361750 292829 208927 3569
11271 3569 -52954 -68919 138227 258010 206373 204559 125964 43287 150592 140685 107485 46053
11259 46053 13167 38692 63381 57812 60223 90955 179883 311744 278570 208408 176746 371106
11247 371106 351289 308855 241922 224393 143779 2556 -25549 128401 140201 107766 265394
11236 265394 501811 630644 536903 548776 501158 437476 366081 346201 354997 278298 193020
11225 193020 159353 78658 10180 15738 -43656 -104886 -5523 202906 350862 291451 303118
11214 303118 202859 234213 264495 129400 135935 248987 93194 -32753 99278 162949
11204A62949l6276P1845n8856J7601J00141J7396j95278q2197Q8542J93087k0446
11193B58508m6686o3397O5586N2659q8570j77106Q3444N7215O8575k8087q2495
11182I9646J03450Q2311P24K5709m0318j30401n8834r8729K29441R6724r2829
11171B16894n0577j0266K4162M1893o0521j39422J19461q4069L3574J17245J06473
11160C14847M4594k0006j76922k4995o0430p0166j36873j08890P2080J75358K3869
11149C2466j34012m9632r6903J1361J44144J06433J36067J7407n6848j71718o8416
11138a29651m2744N2047k0047M9969J59260P689M1035l5822R4706L8037p3023
11127A41456k2165r8348n3622k31436J4181J93045m1713m2835O6155M9053r111
$$ plain form
11204 162949 126673 198518 139662 157263 257404 274800 79522 -2675 85867 278954 258508
11193 258508 211822 148425 214011 266670 178100 994 84438 141653 210228 182141 99646
11182 99646 203096 285407 286131 311840 271522 141121 82287 -16442 212999 309723 216894
11171 216894 166317 156051 180213 222106 161585 22163 141624 57555 91129 208374 314847
11160 314847 359441 339435 162513 137518 77088 6922 -129951 -238841 -166761 8597 32466
11149 32466 -101546 -151178 -248081 -236720 -92576 13857 149924 167331 110483 -61235 -129651
11138 -129651 -172395 -120348 -140395 -90426 68834 76523 117558 81736 176442 214479 141456
11127 141456 119291 20943 -32679 -264115 -249934 -56889 -98602 -141437 -75282 -26229 -35340
11116c5340P2455q9559o8060R7476J04181R9148O438Q8938o5972k13712o0687
11105f4694J5003J7352n3490q7450M8293J59002J8803o6750q1115j42693J30518
11094a07221K47943J38062O7296k06322J4511R2157j3638j75006N5292Q8103J47754
11083C48931k0706j26135K20488L3233j57054m4336k42963J6745J47494N4786
11073B30483j10559j41508O6258K76035N2913j21938o5425L0961m1132j29500
11063D6588j79386p6900K29812P7201J5245o4908K5614K32328K3163L777L1733
11052C64267l9637k8202p3653J5109J6049K44059K34778l1176k12087r9258K6264
11041D16513J77843J70726L0673p1335J97329K74781J90014M1954J1243o7056
$$ plain form
11116 -35340 37115 -52444 -120504 -23028 81153 180301 186739 275677 209705 -4007 -64694
11105 -64694 -49691 -32339 -85829 -173279 -124986 34016 52819 -13931 -95046 -237739 -107221
11094 -107221 140722 278784 346080 139758 154269 246426 232788 57782 113074 201177 348931
11083 348931 328225 202090 422578 455811 298757 254421 11458 28203 175697 230483
11073 230483 119924 -21584 44674 320709 373622 251684 186259 217220 176088 46588
11063 46588 -132798 -209698 20114 97315 112560 47652 73266 305594 328757 332534 364267
11052 364267 324630 296428 222775 237884 253933 497992 732770 701594 489507 390249 416513
11041 416513 594356 765082 795755 724420 921749 1196530 1386544 1428498 1439741 1372685
11031A372685j06250k25848j96802o1590J75840Q7785o6289R04K77349K10933
11021A468717K1295k2679r2888l59730j13708j07688k6775J31092n3585J17269
11011I61320J96208J37022k917j17910J6094r3971j82539j69806j1585M1296j32913
11000F40299p1383O1751P9246O6485k52707k53197q5037p5641J11122J54318R4103
10989D69359n3010p6742o8163r9124j00740o0856m1029K3949j49193j22627J55077
10978a23099O1108l4389J08051r501K9966J1869j28777j68790p9112K09014J53312
10967B9652O768m275L1394j10665n975k1176p5922J58877o4677J27634m5042j97852
10955a71259p2831J88803P2486p2990m7192O5538k1060R0175J58262K6298j19816
$$ plain form
11031 1372685 1266435 1040587 843785 782195 958035 1045820 979531 980435 1257784 1468717
11021 1468717 1490012 1467333 1374445 1014715 901007 793319 766544 897636 844051 961320
11011 961320 1157528 1294550 1291633 1173723 1189817 1095846 913307 743501 731916 773212 640299
11000 640299 568916 630667 709913 776398 523691 270494 185457 109816 220938 375256 469359
10989 469359 416349 339607 271444 172320 71580 10724 -30305 -6356 -155549 -278176 -123099
10978 -123099 -61991 -96380 11671 2170 32136 44005 -84772 -253562 -332674 -123660 29652
10967 29652 36420 32145 63539 -47126 -53101 -74277 -150199 8678 -55999 71635 26593 -171259
10955 -171259 -244090 -55287 17199 -55791 -102983 -37445 -58505 31670 189932 216230 96414
10944I6414j97213p2064J63195m456j23949O3J43579k7513k6049o0505k0844K11351
10932H2009J7822k63909l9709M4477J14009J2312o7021k8284O7741K9326j35147
10921a66374R637J96329n2312r5077j55468O8483Q1684J26099J3867k3045J01409
10910A05232Q7607J40612R0220j586j1332L891j5495p6119k6866j16241l8129
10899A41794n619k11296l1875L5867p8328m2352k1408N0804K59687p2172p1512
10888d6410k1226R7055J10168l4762M5418p8512R068j057K1501m3698j7268r0971
10876e0694J9276q004K8812N4338k980r3193q3661J03607L3686j43756q3778P561
10864b18786J92195J14249J3125N7824j62638j40929O4964N6711K113j3311k3534
$$ plain form
10944 96414 -100799 -172863 -9668 -14124 -138073 -138010 5569 -21944 -47993 -108498 -129342 82009
10932 82009 99831 -164078 -203787 -159310 -45301 -32989 -100010 -128294 -60553 -31227 -166374
10921 -166374 -156737 39592 -12720 -107797 -263265 -194782 -113098 13001 26868 3823 105232
10910 105232 192839 333451 423671 422085 410753 414644 399149 323030 296164 179923 141794
10899 141794 136175 -75121 -106996 -71129 -149457 -191809 -213217 -162413 97274 25102 -46410
10888 -46410 -67636 29419 139587 104825 150243 71731 80799 79742 101243 57545 40277 -50694
10876 -50694 -31418 -39422 -10610 43728 40748 -52445 -136106 -32499 1187 -142569 -226347 -218786
10864 -218786 -26591 87658 100783 158607 -4031 -144960 -79996 -23285 -21172 -34483 -58017
10853e8017J00262k4282j01135Q8226L429o2631O0002J52221O2719l0379j7661
10842A72754K30688M9822j53185n7774j20159J01186J63023j47906L139j13442
10832A28146p9439R709O8237Q5368m3707j31041p2639N4517r8089j20898J80525
10821a9311J33231j13579m6436M4872j8274m3379J00488M0767n1496M4212J05295
10810A76390k8265j68478K1096L1350j66128o2055J16329K28544n6615n2102k5942
10799A4124J5655J09986k26716k36660K6536p214j83519K5406K28100m7405j1973
10788b93680Q9295J67655N6220k364n5577j21550j21961r6375R0681m2062j2461
10777c42179P808o1392M941N7077r782K9951j3244K09049K07294R3903j30857
$$ plain form
10853 -58017 42245 17963 -83172 5054 8483 -54148 5854 158075 220794 190415 172754
10842 172754 403442 453264 300079 242305 122146 223332 386355 238449 241588 128146
10832 128146 48707 58416 126653 212021 168314 37273 -35366 19151 -78938 -199836 -19311
10821 -19311 113920 341 -46095 -1223 -19497 -62876 37612 78379 26883 71095 176390
10810 176390 148125 -20353 743 32093 -134035 -196090 -79761 148783 92168 40066 14124
10799 14124 29779 139765 -86951 -323611 -297075 -304289 -487808 -462402 -234302 -281707 -293680
10788 -293680 -204385 -36730 19490 17126 -38451 -160001 -281962 -378337 -287656 -329718 -342179
10777 -342179 -334371 -395763 -390822 -333745 -343527 -313576 -326820 -117771 89523 183426 52569
10766E2569j52192n3510M6219J36944J6254j58525J16189J17667Q6004K5280l7724
10755A95175O180J71687j35428k16045j24236L4724m5340M3694q796l0261q1582
10744a90228L2072K78235o3686p3652m520Q5601J56750Q0195k0361q4596j415
10733A94395K1515j07671J7690K69901P1070J79922M3437k02027o4999k224P6901
10722D97910M9517R2892J95369k0553N2485J2289q5671r8913n242Q1052O6680
10711H37815m2632k02189l7762L473k8688n9788o2650Q2001J8226m5898k12756
10700B49152k91936j08100K8756l8834O3073K9654J88556J59512j17468j15081
10690D7284k03347j48290J4036Q8101n2316k58543p6669P5139K27963k3990k17923
$$ plain form
10766 52569 -99623 -153133 -106914 30030 46284 -112241 3948 121615 207619 232899 195175
10755 195175 201355 373042 237614 21569 -102667 -67943 -113283 -69589 -78385 -108646 -190228
10744 -190228 -158156 120079 56393 -17259 -21779 63822 220572 300767 280406 195810 194395
10733 194395 215910 108239 125929 395830 466900 646822 690259 488232 423233 421009 497910
10722 497910 547427 640319 835688 815135 867620 879909 794238 695325 690083 771135 837815
10711 837815 795183 592994 555232 558705 530017 470229 407579 489580 507806 461908 249152
10700 249152 -42784 -150884 -122128 -160962 -97889 -68235 120321 279833 162365 47284
10690 47284 -156063 -304353 -290317 -202216 -254532 -513075 -589744 -514605 -286642 -310632 -528555
10679e28555K1530J68451P1580L5322J3341m1898L699J39899j35855j46368O7697
10668c31157K41405J03165l5478R511k00149o0009L08676M6746p3206P9580O0483
10657A49567j33733J32251K49538K11889K90174K79326J39595L61754K36306N4737
10647A971404l89428n41684l94459j05889M8792K36559J40995Q8100N0371K87775
10637A392536L97391L33600L82416N27064P12290P47279O62609K21595R8905M99690
10627E975375P06438R92516J484854J977445K637121L706967N143950O963409
10619B9588075R349843J2145423J4758052J5358224J2059982M805585k114550
10612I5950634n697818n292289j778986L240082Q773137J5567804K3228656K9958075
$$ plain form
10679 -528555 -507025 -338574 -266994 -231672 -218331 -260229 -256530 -116631 -252486 -398854 -331157
10668 -331157 -89752 13413 -22065 -12554 -212703 -272712 35964 82710 9504 89084 149567
10657 149567 15834 148085 397623 609512 899686 1179012 1318607 1680361 1916667 1971404
10647 1971404 1581976 1040292 645833 539944 588736 825295 966290 1054390 1104761 1392536
10637 1392536 1789927 2123527 2505943 3033007 3745297 4492576 5155185 5376780 5475685 5975375
10627 5975375 6681813 7674329 9159183 11136628 13773749 17480716 22624666 29588075
10619 29588075 38937918 51083341 65841393 81199617 93259599 98065184 95950634
10612 95950634 90252816 84960527 83181541 86421623 95194760 110762564 133991220 163949295
10604A63949295L1569254K1936299K176610j5426261k1978148j8558889j0253272
10597A53414888j069661R259053K0110693L1002562L9057327L8225468K1199910
10590C11200240q877738l3492222m0297159l4003518k3328414j2219303j922846
10583A57059040P425290J5906238K1172505J9106548N908792j4481478k9261381
10576A82835554l1736565k6081614j7991474j0564114m624691K20901L785157
10569I5843154N604642L789113j967218r686820j4944844j5591912j3404606j0392141
10561C9249368p629835n490509m248960l394759k555526j861528j471843j132648
10553A1463760j127586j011976q97958o82738m46653n32945n10086m47175k37691
$$ plain form
10604 163949295 195518549 217454848 219631458 204205197 182227049 163668160 153414888
10597 153414888 152345227 161604280 181714973 212717535 251774862 290000330 311200240
10590 311200240 302322502 268830280 228533121 194529603 171201189 158981886 157059040
10583 157059040 164484330 180390568 201563073 220669621 226578413 212096935 182835554
10576 182835554 151098989 125017375 107025901 96461787 91837096 92057997 95843154
10569 95843154 101447796 105236909 103269691 93582871 78638027 63046115 49641509 39249368
10561 39249368 31619533 26129024 21880064 18485305 15929779 14068251 12596408 11463760
10553 11463760 10336174 9324198 8426240 7743502 7296849 6763904 6253818 5806643 5568952
10544E568952l08445l93758k49882k08827l25181m27744k98161j62876J03609
10535C297687K1186j33001Q4450j55901j67963l5331l2065r9155n2538o1668j58115
10524B507586j45401j05319o8298j40013R3024J70907n862k03005p0680L813R3488
10513B130240L6545o7148j76274r5957J9632Q0817j37636q6506J70231K7931k63729
10502A638146k0915J01083r2097k8139l3613k4660J23069q1355r4719j02258N3384
10491A437926J14494o5573j17967j45676j40971r1715m5185n0778J12696J29471
10481A136722J6540L1568j7943o4070j31177J4390L682j14885J25494j3757j23491
10470H63073n4640j00018J0308M036q4567j9792j65106k01824k7470P1059M0559
$$ plain form
10544 5568952 5260507 4866749 4616867 4408040 4082859 3655115 3356954 3194078 3297687
10535 3297687 3318873 3185872 3270322 3114421 2946458 2911127 2879062 2779907 2727369 2665701 2507586
10524 2507586 2362185 2256866 2188568 2048555 2141579 2312486 2306624 2103619 2032939 2036752 2130240
10513 2130240 2166785 2099637 1923363 1827406 1847038 1927855 1790219 1703713 1873944 1901875 1638146
10502 1638146 1617231 1718314 1626217 1598078 1564465 1539805 1662874 1581519 1486800 1384542 1437926
10491 1437926 1552420 1486847 1368880 1223204 1082233 990518 945333 894555 1007251 1136722
10481 1136722 1153262 1184830 1166887 1102817 971640 986030 989712 874827 1000321 986564 863073
10470 863073 808433 708415 718723 722759 638192 618400 453294 251470 224000 295059 335618
10459C35618N5121L1534k14104J15732J50741n1582o9820j10998m3176J0379J47869
10448C57314l3156l2691J4952K218O1387K35324J10858j67287k49390q9780L8920
10437B48669J79388K09058R6092k1900r8616j72639j22138J17891R1450p3841
10427D53414L3783Q3418K01607P3810j60885o2883l8884o5877q0114O588K37358
10416F81335L9236p0954N0764N0742k16560j68342n9436j23504N2961K44219J48019
10405F28480L2614j64407p6921R3612J99471J17071R402j32095p2236J1697J7628
10394F64316r7931j32935o3223j2174K7385L0167j44330L9646J67320o3493P2295
10383D87043p2272m6800Q9031p8378L7629k2827k6801O6415J50340M382k55248
$$ plain form
10459 335618 390739 422273 208169 323901 474642 423060 353240 242242 199066 209445 357314
10448 357314 324158 291467 306419 308637 370024 605348 716206 548919 299529 209749 248669
10437 248669 428057 637115 733207 711307 612691 440052 317914 435805 527255 453414
10427 453414 487197 570615 772222 846032 685147 622264 583380 517503 437389 443977 681335
10416 681335 720571 649617 700381 751123 534563 366221 306785 183281 236242 480461 628480
10405 628480 661094 496687 419766 513378 712849 829920 839322 707227 634991 646688 664316
10394 664316 566385 433450 370227 358053 385438 415605 271275 310921 478241 414748 487043
10383 487043 414771 367971 457002 378624 416253 393426 366625 433040 583380 587762 332514
10372C32514j10527k2328M7119o9669j29409P09Q1673K04669m898P5097n557R974
10360D09367j56969M3148J69167j23090n7786p5110M1972R7675j5564n4180J8962
10349B97592N1508j31262J24497J02533l6543q1706j23159k3032M6701J55149
10339C82278K1692J11679k1856k03327N3800k2927r3552Q2498J21225l8911M2690
10328D35289l7696J28863o9647k7485q4219K37922J44214j34169q4997k25594
10318B82481j36155J11531K48885p5767k26237k03214M8588R1180J09303K279
10308B52874O5395J41573M0929j38320r5705m6856l3926r737o270R3469O8691
10297C32117j8316M2722J18920j8365j96215j79847k12883N1356k2874p9536J06284
$$ plain form
10372 332514 221987 199659 246778 177109 47700 48409 130082 334751 329853 404950 399393 409367
10360 409367 252398 295546 464713 341623 283837 208727 250699 348374 332810 278630 297592
10349 297592 349100 217838 342335 444868 408325 326619 203460 180428 227129 382278
10339 382278 403970 515649 493793 290466 344266 321339 227787 310285 431510 392599 435289
10328 435289 397593 526456 456809 429324 345105 583027 727241 593072 508075 282481
10318 282481 146326 257857 506742 430975 204738 1524 50112 141292 250595 252874
10308 252874 318269 459842 500771 362451 266746 219890 185964 176227 169957 263426 332117
10297 332117 313801 356523 475443 457078 260863 81016 -131867 -80511 -103385 -182921 -76637
10286g6637J55018q9846l2114J5517q54O7334m814r5255p0990K80424P6046j77219
10274D6610M371r8500J6076N4427J29483J7451k7098J63380P4678j2383p4275
10263B94220N5402j81645l7758K1303PL4870J413j20309L3204J06334J06738r3355
10251B20424R6986J50815j87285j02731L7977J29476N0811j7945j08111M7610
10241C18027q8759j43306k593O927O4302J40326J04305k33303j64075J29638L455
10230A34944L2804K55206k5282j33212J34398J24652Q4117j80081j53051K75206
10220E49701M3960j04170p451R6241N421j35752q3134j3955j10998n9931M8229
10209B28161l3358M0090L5682M5656L5455o9944j45460j34897o4060N3317j36646
$$ plain form
10286 -76637 78381 -11465 -43579 -28062 -28916 38418 33604 -61651 -132641 147783 223829 46610
10274 46610 50981 -47519 -31443 22984 152467 169918 142820 306200 380878 368495 294220
10263 294220 349622 167977 130219 151522 151529 186399 187812 67503 100707 207041 313779 220424
10251 220424 317410 468225 280940 178209 216186 345662 396473 378528 270417 318027
10241 318027 229268 85962 83369 90296 154598 294924 399229 165926 1851 131489 134944
10230 134944 167748 422954 397672 264460 398858 523510 607627 427546 274495 549701
10220 549701 593661 489491 482040 578281 583702 447950 364816 350861 239863 179932 228161
10209 228161 194803 234893 270575 316231 351686 281742 136282 1385 -62675 -9358 -146004
10198a46004J90578L1801l3597P8460K31183n3949k11931n2312J5342J62827O3322
10187B75720J2861o3786Q0667J13824O556K9230j8861L4967L6749N0000M3234
10176F01161m1695K8037j5730o8487J7849J10268J21616J67356K03297J27204
10166A250876k7178j04796o5047J40574j3983n6794j26542R3346J34829M8831
10156A274116K63706K28405K8199k27246j4953j01912j52728K6607q8000j10873
10146A125321J21710j4349J1132J86295q2930l34716j88839k50937l920p4021
10136D94746J6929m2673o9628K0070R4436O1101R4924N6537q2136j25848m4368
10125D74090J2418p1071J39362j50055j58745j57977K7496M0625m7530q0419r6859
$$ plain form
10198 -146004 44574 76375 42778 121238 352421 298472 86541 34229 49571 212398 275720
10187 275720 288581 224795 305462 419286 425842 455072 436211 471178 507927 557927 601161
10176 601161 559466 587503 571773 503286 521135 631403 753019 920375 1123672 1250876
10166 1250876 1223698 1118902 1053855 1194429 1180446 1123652 997110 1090456 1225285 1274116
10156 1274116 1537822 1766227 1794426 1567180 1552227 1450315 1297587 1324194 1236194 1125321
10146 1125321 1247031 1232682 1243814 1430109 1347179 1012463 823624 572687 568767 494746
10136 494746 511675 469002 399374 419444 513880 574981 669905 726442 644306 518458 474090
10125 474090 486508 415437 554799 404744 245999 88022 115518 156143 108613 28194 -68665
10114f8665J40692J33796J37437K027j77095O4910J21409R0883n5941l55537j00242
10103f6326K17710j11352o3436p1444J7259L9928L0829K3063R7703j19578j03805
10092a09449P0696J33907J04502J12078p4079j35759k64330K767K03331R3828
10082A37492L1693l3737Q5033N962M9623k7006k01344o2825k6434J56402k1409
10071I3450N2020j60147j77731l1725J18391J4037J42919O8939j55726j40058
10061a75631K71363L40234K4667r6151J6239M0483j14280n7681N2028q8436Q7708
10050C00543r4766N7395q9040j94738J9639J31501n1903J55387N8417m5997N1990
10039B98428M8590O1573K0840n6485j31026k14719k8289M9173j10384k6352K04344
$$ plain form
10114 -68665 72027 205823 343260 345287 168192 233102 354511 445394 389453 33916 -66326
10103 -66326 151384 40032 -23404 -94848 -77589 -37661 -6832 16231 113934 -5644 -109449
10092 -109449 -38753 95154 199656 311734 237655 101896 -162434 -159667 43664 137492
10082 137492 169185 135448 220481 226443 276066 249060 47716 -15109 -41543 114859 93450
10071 93450 145470 -14677 -192408 -224133 -105742 -91705 51214 120153 -35573 -175631
10061 -175631 95732 435966 460633 364482 380721 421204 306924 249243 301271 212835 300543
10050 300543 205777 263172 174132 -20606 -967 130534 78631 234018 292435 246438 298428
10039 298428 347018 408591 429431 372946 241920 27201 -1088 48085 -62299 -88651 115693
10028A15693J0856l9548M8464J33892j00764O5878M7819J6207L8430m362O2360
10017C94925p3152r0761j57333O478l1504Q5661r6809j18692l740N8044M6829
10006A9946J79917p1879M550j1393l4046K4591o0189q7652J18906p6973j78487
9995a72709o586K2677P5357J05707J57655m6732j00983M8738j04733n9292p1535
9984a52436j70010o7363R7060J23677J14548O8060N2444o8979Q7390L5064L1377
9973A50832L5647M288j19477n9934L2840l3856r4822P097N8041J88614o3257r6444
9961I569J01033J83604O5798l2970k09999o3210N2183J94321J6751k20189r0206
9950F685Q1689J16233p5581N3280K6778Q879q4223J14535Q106q6431O0900J90789
$$ plain form
10028 115693 126549 87001 135465 269357 168593 234471 282290 298497 336927 332565 394925
10017 394925 321773 231012 73679 80157 48653 134314 37505 -81187 -84927 -26883 19946
10006 19946 199863 127984 132534 121141 87095 111686 51497 -36155 82751 5778 -172709
9995 -172709 -179295 -156618 -81261 24446 182101 135369 34386 83124 -21609 -80901 -152436
9984 -152436 -322446 -389809 -292749 -169072 -54524 13536 65980 -2999 84391 119455 150832
9973 150832 186479 190767 71290 11356 44196 10340 -84482 -77385 -19344 169270 106013 9569
9961 9569 110602 294206 360004 327034 117035 53825 106008 300329 317080 96891 6685
9950 6685 88374 204607 129026 182306 209084 217963 133740 248275 256381 169950 230850 421639
9938D21639J58167K01357M54967L89552M63131R45423K022322L484084N031268
9929A3571910L764074l452555n348058l439966j766355j074277o38112l19352
9921A297309k75787l76692j62969q7161j79950l0611J19709L7530K0959J196J72127
9910E35660J8625r9970r2863K5909o9414j58263K43539Q7873k18310q6988K4487
9899B10285j8101M6731R9114J46957m3914j80059p7821j6531J72237j72349q310
9888A58239K9566O8652O8206k7537j62007K0033J20711j6689j99590Q1296o1865
9877G9015j00300L3876P4894P5816j49306k45870j2553J28542K47027K14412k8226
9866C17327o422N9666J8363j17080j76335J12551m2777J10917Q3579q022n0442
$$ plain form
9938 421639 579806 781163 1236130 1625682 2088813 3034236 5056558 8540642 13571910
9929 13571910 17335984 13883429 8535371 5095405 3329050 2254773 1616661 1297309
9921 1297309 1021522 644830 481861 394700 214750 184139 303848 341378 362337 363533 535660
9910 535660 554285 454315 361452 387361 317947 159684 403223 491096 272786 185798 210285
9899 210285 192184 238915 338029 484986 441072 261013 183192 166661 338898 166549 158239
9888 158239 187805 256457 324663 297126 135119 155152 275863 259174 59584 140880 79015
9877 79015 -21285 12591 87485 163301 13995 -231875 -244428 -115886 131141 345553 317327
9866 317327 310905 370571 388934 271854 95519 208070 165293 276210 359789 351767 301325
9855C01325j05371m9119K0895J01359l4385j26101q2029N6877J26710r8617j39135
9844b7591N7608N969o0514J31316J24123M7446m8254j03205J01032L3057J3411
9833B74398p1029J3605m7154o4598r7944j7650n2312K1528J75685M3262M605Q4307
9821B66703J0998p8656k23392P0120K47652J05231k62536k63932M544L0101o8693
9810a61860N1683K80231K323j94514J64931k5013k14938J17309J33066O6526R3170
9799C12914r9261k60933n6572J52738j2159j0942k3515R5141j5259j49950m0Q8999
9787B1161K5012j09963J04712N1817K5990k6925R7686M9207K0623j30359j51787
9776b2826l426N3343q5787j31630Q5710J07700r8395P9761J24296O599K0410j9845
$$ plain form
9855 301325 195954 146835 167730 269089 234704 108603 26574 83451 210161 111544 -27591
9844 -27591 30017 35986 -24528 106788 230911 278357 230103 126898 227930 260987 274398
9833 274398 203369 216974 169820 105222 7278 -10372 -62684 -41156 134529 177791 182396 266703
9821 266703 277701 199045 -24347 45773 293425 398656 136120 -127812 -123268 -93167 -161860
9810 -161860 -110177 170054 172377 -22137 142794 117781 -97157 20152 153218 219744 312914
9799 312914 213653 -47280 -103852 48886 36727 25785 2270 97411 82152 -67798 -67838 21161
9787 21161 46173 -63790 40922 92739 118729 91804 189490 238697 259320 128961 -22826
9776 -22826 -26252 27091 -58696 -190326 -104616 3084 -95311 -15550 108746 115345 135755 115910
9764A15910R7090o3544j19642Q441n3881k55294M6770J40925p5896j8792N9261
9753a18652N2541j3533J88332J26528K0360K6671j09384j41216j28396J64294
9743F7545r767j54989L4810J58354J48807K2987L1375j63564n5882k8029n9414
9732g767L8028P5063J05051m8565j59103o1582J25148m6290l1994M9761j51319
9721a13569j77037M2316l732J09358L5129J73267M4268j25688K5249m0344m8195
9710g8978o3768N4010o7518M8284P422o2523p8525j59547J3360K37809K38284
9699H8310m2258p9953p8026K3608J01364k1499P3058o3165P6192L9985M1033J6734
9687A75383M0122p4034j41453j4711O518L5252m0177J54047l9065j93681j49276
$$ plain form
9764 115910 213000 149456 29814 38255 -15626 -270920 -224150 -83225 -159121 -177913 -118652
9753 -118652 -66111 -79644 108688 235216 255576 282247 172863 31647 -96749 67545
9743 67545 57778 -97211 -62401 95953 244760 267747 299122 135558 79676 51647 -7767
9732 -7767 30261 105324 210375 161810 2707 -58875 66273 19983 -12011 37750 -113569
9721 -113569 -290606 -248290 -252022 -142664 -107535 65732 110000 -15688 9561 -30783 -78978
9710 -78978 -142746 -88736 -156254 -107970 -100548 -163071 -241596 -401143 -387783 -149974 88310
9699 88310 46052 -33901 -111927 -88319 13045 -8454 64604 1439 77631 117616 158649 175383
9687 175383 215505 141471 18 -14693 -8175 27077 -13100 140947 101882 -91799 -241075
9676b41075m0451P4052K43687J17054j8204M3461P5197L0938q0703j71086p5602
9665d2732J13928j41361j65579m6483l9227K26112R8156k3760o6888J30227J35050
9654A77443R5794J47736K40564K23933J17791j97196j47642k42969j73364j62951
9644G9139r1350k1248J59092Q4531j2620o8290l7875j30026O104M7012n737r7659
9632h8927O6463l796P236J87593o3783L0495n7489j63720l8945O6561J42619M4318
9620A28625Q6654p8164j96597L3889J59925J13880L6681j09810j30098j01880
9610e6895J18891L5631k4789k3591m1742L6736Q1394r4744M6177P8290j11088
9599D4270j20303o928J20542J0526k1119n3692l0274J35261O8563O9641J44405
$$ plain form
9676 -241075 -281526 -207474 36213 153267 135063 178524 253721 284659 203956 32870 -42732
9665 -42732 71196 -70165 -235744 -282227 -321454 -95342 2814 -20946 -87834 42393 177443
9654 177443 273237 420973 661537 885470 1003261 806065 658423 415454 242090 79139
9644 79139 -12211 -33459 125633 210164 197544 129254 91379 -38647 -32543 14469 8732 -88927
9632 -88927 -22464 -26260 -19024 168569 104786 135281 77792 -85928 -124873 -58312 84307 128625
9620 128625 215279 137115 -59482 -25593 134332 248212 284893 175083 44985 -56895
9610 -56895 61996 97627 72838 49247 7505 44241 125635 30891 77068 155358 44270
9599 44270 -76033 -82961 37581 48107 26988 -26704 -56978 78283 146846 216487 360892
9588C60892j18806p5483q6049m8159k8964n6576m246M8147J09555J2375k9952
9577H2734J3399k7952N1145K7539j05444n0746J85064J68094j69199l20464K0707
9566a25123L5551J103R9642J7432m2187N2817M1627P3630N1732o1232j56154o7942
9554g9104L40707P5307n0115K8146J0093k88681k09993M060K19831O8184k44371
9543a25936N4847J07148J0183k4281R565j3694j43119L3792J43833K16398k8496
9532B40240j65186l2248l7319j7089J63021N3020j41747j09093j05233P484J16788
9521b7362J30703p4055M5570k4780j76971j0063J06356M4164j46433R1677p0429
9510a11623K57781J088O7803j04304j17461J9785J9551j21018J74254R987n5422
$$ plain form
9588 360892 242086 166603 80554 32395 3431 -53145 -57391 -9244 100311 112686 82734
9577 82734 96133 68181 119326 146865 41421 -9325 175739 343833 174634 -145830 -125123
9566 -125123 -89572 -88469 11173 28605 -13582 39235 80862 154492 206224 144992 -11162 -79104
9554 -79104 261603 336910 286795 314941 325034 36353 -173640 -169580 50251 118435 -125936
9543 -125936 -71089 36059 46242 21961 31526 17832 -125287 -91495 52338 268736 240240
9532 240240 75054 42806 5487 -11602 151419 204439 62692 -46401 -151634 -144150 -27362
9521 -27362 103341 29286 74856 50076 -126895 -136958 -30602 13562 -132871 -41194 -111623
9510 -111623 146158 147246 215049 110745 -6716 13069 32620 -88398 85856 95843 40421
9499D0421K378m8681k0941L1582k5906j7375N9362m0499R1049j05240o1650R0502
9487d998l176q1628j33170R3035O7965N7810N8434n1327o4756K2790J26513J25317
9475B12809r7005j99337p4158L5977J57879J73991k2772m4913o01j25491N8099
9464G4478Q6690l1475K247K04839j9856k53458j18640p6493j6023O9672j12784
9453a90803q5667J0446l0865l5754P3023J21796J49826J08254j575j77827J59093
9442I9947J66011j00148j75624J57807K31652j50745r3182l8515n123J6539p683
9431A00936l7942M7225O1878j08514N6310k5539r4964J4024M711R0006p7608Q056
9419C8579n4590K6842P3404O6802j20913p6575Q8139q1352k253P2236J98614J00829
$$ plain form
9499 40421 42799 -5882 -26823 4759 -21147 -38522 20840 -19659 71390 -33850 -95500 -4998
9487 -4998 -8174 -89802 -222972 -129937 -61972 -4162 54272 2945 -61811 -39021 87492 212809
9475 212809 115804 -83533 -157691 -121714 36165 210156 187384 142471 141870 16379 74478
9464 74478 161168 129693 131940 336779 316923 63465 -55175 -131668 -147691 -78019 -190803
9453 -190803 -276470 -266024 -296889 -332643 -259620 -137824 12002 120256 118681 -59146 99947
9442 99947 265958 165810 -9814 147993 379645 228900 135718 97203 92080 108619 100936
9431 100936 62994 110219 172097 63583 119893 94354 -610 13414 18125 108131 30523 38579
9419 38579 -16011 10831 84235 151037 30124 -46451 41688 -39664 -41917 30319 228933 329762
9407C29762k21165K1168J5414j07473q1026Q6927m8674j9118P8963r3207j91796
9396b30225J06018J08320J99610N5008o8394n3980Q7873J79287j53149m3184N4928
9385B42112J2346n2421l0672j28636r2986J0675k1205k9360J1387J12022R9528
9374A32790r3692j25897p0908L6645j0156k9876K148L9155m9703j5468O0624L6537
9362h7801R0106M6260j7511r473J3939J14556M6658r2278Q0836K8141j37822j96455
9350a20844j1525R7904O00J28057N9722o2652q4866N4616N8803O383J9629m3489
9338A02338j58437J03665P7658M4250q5938n8558j06341J96104J5452l5848P0118
9327A64463j11018q4586J8163j816p9467N2805M2387J01654q1272r1787k45081
$$ plain form
9407 329762 108597 129765 145179 37706 -43320 43607 -5067 -24185 54778 -38429 -230225
9396 -230225 -124207 -15887 183723 238731 170337 116357 204230 383517 230368 187184 242112
9385 242112 254458 202037 171365 42729 -50257 -39582 -60787 -90147 -78760 33262 132790
9374 132790 39098 -86799 -157707 -121062 -131218 -161094 -158946 -119791 -169494 -184962 -124338 -87801
9362 -87801 2305 48565 31054 21581 35520 150076 196734 104456 185292 213433 75611 -120844
9350 -120844 -132369 -34465 -33865 94192 153914 91262 6396 61012 119815 126198 145827 102338
9338 102338 -56099 47566 125224 169474 83536 24978 -81363 114741 130193 94345 164463
9327 164463 53445 -31141 -12978 -14794 -94261 -41456 931 102585 21313 -70474 -315555
9316c15555P2925J90052P2367N1281k8086p1145o7152L6790M7736p0635q2243
9305a63665k9781L1652K4410P0530M5552N9663l7933O0586n3014q5529k2832M9235
9293e1126K1330j9198J60715j19897j11766k6267L5384J9528j0383K0809L4788
9282d6083Q5582J57024p2699r1672j51015o1896P4491J72260m3758j1085p6833
9271f5684K9597j7836N8866m2258o7801N8066k13139r7348k9874K15474K55002
9260H3065p4145J85038J3885j14298j26940R743J94159M1265k20117M9256O1463
9249A02374J09325K2512n9271j30564j879J83857q3467L3603j66812k2753k5494
9238c8569j3797j9371J16690j43065o2627J32915P6558m9189K8063j12693l6499
$$ plain form
9316 -315555 -242630 -52578 19789 71070 42984 -28161 -95313 -58523 -10787 -81422 -163665
9305 -163665 -193446 -161794 -137384 -66854 -21302 38361 428 61014 8000 -77529 -100361 -51126
9293 -51126 -29796 -48994 111721 -8176 -119942 -146209 -110825 -91297 -101680 -80871 -46083
9282 -46083 39499 196523 123824 32152 -118863 -180759 -106268 65992 22234 11149 -65684
9271 -65684 -36087 -53923 4943 -37315 -105116 -47050 -260189 -357537 -387411 -171937 83065
9260 83065 8920 193958 207843 93545 -33395 -23652 170507 211772 -8345 40911 102374
9249 102374 211699 234211 174940 44376 42497 226354 142887 176490 9678 -13075 -38569
9238 -38569 -52366 -71737 44953 -98112 -160739 -27824 48734 -455 27608 -85085 -121584
9227a21584J46742N7918j57669J99837R6638p6975j41652K358l8217l3078k6190
9216i1872Q5294L0198K5909L7148M2993n4950l0919m1248O0099L759L3272M9680
9204A49363J0193l63409p529R8581P7025r3454N1191N0382R0269n845j07573M5201
9192e605p4850o8002m0330p0035r3321o0624J17302K47522J32420J27585j42795
9181F9267j64288K1569P3146j08367k12610K2865O3385J8248J44825J56225j2128
9170G2137L7164L30k02056K5133N6013j2863n7166p5432O535j62034M6905K05148
9158f0186L1523k7069l6108J13710J21317q9981q7018p7189J51060Q6992J15422
9147B42473l1957q9547l1784j59667p9613Q6209J38728J11587J00106j00142j34260
$$ plain form
9227 -121584 25158 83076 -74593 125244 221882 144907 3255 5613 -32604 -65682 -91872
9216 -91872 -6578 23620 49529 86677 129670 74720 43801 2553 62652 66411 99683 149363
9204 149363 159556 -203853 -211382 -112801 -35776 -129230 -78039 -27657 62612 56767 -50806 -5605
9192 -5605 -80455 -148457 -188787 -258822 -352143 -412767 -295465 -47943 84477 212062 69267
9181 69267 -95021 -73452 -306 -108673 -321283 -298418 -235033 -216785 -71960 84265 72137
9170 72137 109301 109631 -92425 -67292 -11279 -24142 -81308 -156740 -150205 -312239 -265334 -60186
9158 -60186 -28663 -55732 -91840 21870 143187 53206 -33812 -111001 40059 127051 242473
9147 242473 210516 120969 89185 -70482 -150095 -63886 74842 186429 286535 186393 52133
9136E2133j27476J660n5914l6902j2347J87162Q9329j14609q1285k5868o3532
9125a87649n3231N7577J69743o3469J1163K46556l3069p4074J69624J91281k20168
9114B14284r5309l1165P2546K0115m0419r9546j9480Q8123k51125j96349M2139
9103b96186J06170N2435j3482J51453K65963J4833m0150l7412j08303j00241J6310
9092A1390J50886q0727k15758o9939p237O8869J40854Q9963j68487r442K2693
9081f6935m0136J32031J5373l0174q9286P56q0129j121J41049m7751n2712K53510
9069A34475L7002n3089m5594M3489J58535j72621q2213M5102j6064R690n6745
9058A967n4321K4606m1047J25392J36824J5660j21106k01630l0242n0095j22422
$$ plain form
9136 52133 -75343 -73683 -129597 -166499 -178846 8316 97645 -16964 -98249 -124117 -187649
9125 -187649 -240880 -183303 -13560 -77029 -65866 180690 147621 73547 243171 434452 214284
9114 214284 118975 87810 160356 180471 140052 40506 21026 109149 -141976 -338325 -296186
9103 -296186 -190016 -137581 -151063 390 266353 281186 241036 203624 95321 -4920 11390
9092 11390 162276 81549 -134209 -204148 -211385 -142516 -1662 88301 -80186 -89628 -66935
9081 -66935 -107071 24960 40333 10159 -79127 -78371 -158500 -159621 -18572 -66323 -119035 134475
9069 134475 171477 118388 72794 116283 274818 102197 19984 65086 49022 58712 1967
9058 1967 -52354 -27748 -68795 56597 193421 209081 87975 -113655 -143897 -193992 -316414
9047c16414j49195J89843K48853J48195K8512r7661k2976q4497m3195j8254N4218
9036f2571R2926r3318J0958K21766O2746j41884j30091O758M5310J933J7161J3403
9024D5097j48597j9667l1586J58513P7556j81147p5220K77722K64380j81306p025
9013A78720k3752N7540K6520n3336l3743J812l2925p9707o2775N8944l4117j23621
9001a20440m1726N5605K2322j45882l1735p9281Q6861K5569L4854p0724m9906
8990c14483m188k2736M5394p074J91023M5340J14535j09473o615R8405R9127l1093
8978I8162m118L4607n8049l4881j07478j63798J18754L17999k9265k16623o5260
8967a09950R5250j0088J67939J73882j0236l9447j65035j37071r3948n4861K06051
$$ plain form
9047 -316414 -465609 -275766 -26913 121282 149794 52133 29157 -55340 -98535 -116789 -62571
9036 -62571 30355 -62963 -52005 169761 232507 90623 -39468 -32710 12600 14533 31694 45097
9024 45097 -103500 -123167 -154753 3760 81316 -99831 -175051 102671 367051 185745 178720
9013 178720 154968 212508 239028 185692 151949 153761 120836 41129 -21646 37298 3181 -120440
9001 -120440 -162166 -106561 -84239 -230121 -261856 -341137 -254276 -228707 -193853 -264577 -314483
8990 -314483 -318671 -341407 -296013 -303087 -112064 -66724 47811 -61662 -68277 30128 129255 98162
8978 98162 94044 128651 70602 35721 -71757 -235555 -116801 201198 171933 -44690 -109950
8967 -109950 -14700 -24788 143151 317033 306797 267350 102315 -34756 -128704 -183565 22486
8956B2486N2338L759M1308r65m7724L6646L8358m8354o1098J2664m6206J768N5595
8943F0575p7753n7617m703N041J0360j17561o8309r1242Q4818K03688R1906k6551
8931A2652p8160j34109K8929J21346J67465M9410j55582j12386J16538K668p1755
8920e2984N4633N6955P0180K3940O4292j4528q6640M1789J213j67743J4583r4601
8908h8911R1986J04773j08911j22382J14223n7548o8289l0210l5983J04240J33959
8897C6947Q7096j1749p5874K8639N0402R5638N9477j22958j27784o4182K7883
8886a6465K4721K4788R7890M7363J73010j26998k02609k9801k2928q0937j75014
8875b86980J14481r1050n2402Q8018J30961P9398J05304k2563P05j5245M1317
$$ plain form
8956 22486 74824 78583 119891 118926 71202 107848 146206 97852 36754 49418 3212 4980 60575
8943 60575 -17178 -74795 -79498 -74457 -64097 -181658 -249967 -341209 -256391 -52703 39203 12652
8931 12652 -65508 -199617 -170688 -49342 118123 167533 11951 -100435 16103 18771 -52984
8920 -52984 1649 58604 128784 152724 217016 202488 115848 157637 158850 -8893 5690 -88911
8908 -88911 3075 107848 -1063 -123445 -9222 -66770 -135059 -165269 -201252 -97012 36947
8897 36947 124043 112294 36420 65059 115461 211099 270576 147618 19834 -44348 -16465
8886 -16465 8256 33044 130934 178297 351307 224309 21700 -8101 -31029 -111966 -286980
8875 -286980 -172499 -263549 -315951 -227933 -96972 -17574 87730 65167 65872 50627 91944
8864I1944Q8866l8048k72450q1994R2431J09048j9985j28567k2520J16319N9347
8853e609n9587Q7052K7965n8164q9529N4561J01297J08753J13516K6033r4134
8842B12154L7760r87j12649J06348J05420p1541o1336j43202L5495L8669K3249
8831A69380o1816q2824r1505j7726J31574J24515q7814j9122p4118J26303k315
8820A14532j17196j12747M3360J54543K097N574J0683k5632j05804K9867R1844
8809I1121j05288j01049P7056J31205M6829p8329N7675O2625Q7457j8890m5076
8798B05336j13649o1557R3464M9755m9831k20747r540Q6527K8578j1947j12878
8787a16489N1667m4798J7921J00920m4810L5633j32012l1775N8321N6115p6426
$$ plain form
8864 91944 180810 142762 -129688 -211682 -119251 -10203 -30188 -158755 -181275 -64956 -5609
8853 -5609 -65196 21856 49821 -8343 -97872 -43311 57986 166739 280255 306288 212154
8842 212154 249914 248927 136278 242626 348046 276505 215169 71967 107462 146131 169380
8831 169380 107564 24740 -66765 -84491 47083 171598 83784 64662 -9456 116847 114532
8820 114532 -2664 -115411 -72051 82492 84589 90163 100846 75214 -30590 -723 91121
8809 91121 -14167 -115216 -38160 93045 139874 61545 119220 181845 269302 250412 205336
8798 205336 91687 30130 123594 173349 123518 -97229 -106769 -20242 8336 -3611 -116489
8787 -116489 -64822 -109620 -91699 9221 -35589 44 -131968 -163743 -105422 -49307 -125733
8776a25733j30906r0761P4138J24253N5025J62054n8937o0437N5363j79649O848
8765a68742J43657M6080q7473q4177J24762r2433J23231J62529j35023j70285
8755a37874j57359L3911J16617O9695k5017m8556j89531J22491K37863j3087j0312
8744a159k850l0901q3705k8899N0955j24316o8120M0094J36094K1728K18796l8359
8732H9358k3589j49325k34338J14699R1354M4524M868q6943j04966J1057J61695
8721h1606K09545J5230j20236j02307P5295P3411r6374m4359o7819P2123J51821
8710H4724N3009M1408P7157J9843j13048j30567j72868o0960J56804K30930m5400
8699A41032o3990M4120p8280l4551j20665N9634l5016N8434L9468j01414N7010
$$ plain form
8776 -125733 -256639 -347400 -273262 -149009 -93984 68070 9133 -51304 4059 -175590 -168742
8765 -168742 -25085 20995 -66478 -150655 -25893 -118326 4905 167434 32411 -137874
8755 -137874 -295233 -261322 -144705 -75010 -100027 -148583 -338114 -215623 22240 9153 -1159
8744 -1159 -4009 -34910 -118615 -147514 -96559 -220875 -288995 -248901 -112807 -91079 127717 89358
8732 89358 65769 -83556 -317894 -203195 -111841 -67317 -62449 -149392 -254358 -243301 -81606
8721 -81606 127939 143169 22933 -79374 -4079 69332 -27042 -71401 -139220 -67097 84724
8710 84724 137733 179141 256298 276141 163093 32526 -140342 -201302 -44498 186432 141032
8699 141032 77042 121162 42882 8331 -112334 -52700 -87716 -29282 10186 -91228 -34218
8688c4218J43932j32688p943R9477J48757K6579j19412j891j34690q0462l4578
8677a27137P7730L1148K3275n4244R749O8807J05527q0075q0210j84946M1375
8666a69001J03007L7131k9196J3289L1718m1626J13654R9060O8786k3343j15268
8655H8211L3461J13521M7481q2929n9121o803l2779n424Q285J40725M9907j65322
8643A29213j43572m3099J05033J01319K9907M1357J6270j77484M583R452Q9001
8632A61980O5140o1596k251k9708J22486M6569j55503k9654k0254o2066q2490
8621d7347J22382r108o9812K2811J38622N2581M007J35116l3394k33751l1726
8610E0381q0400m6391J6616R9314K3606j79569n1151N2589J35633l6381K3987
$$ plain form
8688 -34218 109714 -22974 -30917 68560 217317 243896 124484 122593 -12097 -92559 -127137
8677 -127137 -49407 -18259 5016 -49228 -39479 29328 134855 54780 -25430 -210376 -169001
8666 -169001 -65994 -28863 -58059 -44770 -13052 -54678 58976 158036 226822 203479 88211
8655 88211 121672 235193 282674 199745 140624 133821 101042 95618 103903 244628 294535 129213
8643 129213 -14359 -57458 47575 148894 178801 220158 236428 58944 63527 72979 161980
8632 161980 227120 165524 163273 133565 256051 302620 147117 117463 97209 35143 -47347
8621 -47347 75035 65927 -3885 18926 157548 210129 214136 349252 315858 82107 50381
8610 50381 -30019 -76410 -59794 39520 63126 -116443 -167594 -115005 20628 -15753 8234
8599H234k0298P913Q4387J0940q7184P0245j39237p5689P4939Q060M6996J62239
8587A51545q863o8427J7535J27881J2505j12044r5672j6891J13550K4184n9531
8576H5772k2856J0251r0789J68684R7992j33829j60092o3441K25406M2410j53036
8565F472o8604r725O3926J54618o282r2735p4541p8455J23230m823p0743j47573
8553b05235o9203J0685l6704N4965j29980O6773M32425j520j5531N5885q2012
8542H0548k01160m2172Q9347K5288j05313j60052p9027p3886M8606J22053O6100
8531b29668O0007O5916J55466P0395O2265j23636m7947l0974n8926N0535J25153
8520I8586R5571j7032n0053j31339L2617K0784p4896O295j0599O5292r6026m5119
$$ plain form
8599 8234 -12064 -4151 80236 91176 3992 74237 -65000 -140689 -65750 -57690 -10694 151545
8587 151545 142682 74255 91790 219671 232176 120132 24460 7569 121119 145303 85772
8576 85772 62916 73167 -17622 151062 249054 115225 -44867 -108308 117098 159508 6472
8565 6472 -62132 -71857 -7931 146687 140405 47670 -26871 -105326 17904 13081 -57662 -205235
8553 -205235 -274438 -263753 -300457 -245492 -375472 -308699 123726 122206 106675 162560 80548
8542 80548 -120612 -162784 -73437 -48149 -153462 -313514 -392541 -466427 -417821 -295768 -229668
8531 -229668 -169661 -103745 51721 122116 184381 60745 12798 -18176 -77102 -26567 98586
8520 98586 194157 177125 127072 -4267 28350 49134 -25762 -19467 -30066 35226 -60800 -105919
8508a05919M2865n0907J9522j13745q8159J34787J17901R1483p9316N3385K0690
8497D2587k2642K3429p7370j893n06J46011q5615q8538O3204M2920j52462j23507
8485b34382J03611j2902J90422J99482L1045N7894J9456p4843r2146j18196K3678
8474I3119L2308l3853Q7163P979p3372j01796O8715q9787P5793J01389J53510
8463C21168j6522n9533M313j47206m1773q2475p804J9483Q7703Q3629R2160r9437
8451A53706r4438J71585k40j35506j45840k7953J10142P9149K47687R7502j08264
8440C47530j57636p9020j7364Q78j31286L9817J41494k9175n0574o0420J16029
8429A20273l3164L2211m2664n3036j2340L8891J17801j57141j39029K09274N5961
$$ plain form
8508 -105919 -63054 -113961 -94439 -208184 -296343 -161556 -43655 47828 -31488 21897 42587
8497 42587 19945 43374 -33996 -35889 -36395 109616 24001 -64537 -1333 41587 -110875 -234382
8485 -234382 -130771 -143673 46749 246231 277276 335170 354626 279783 187637 69441 93119
8474 93119 125427 91574 178737 186716 113344 11548 80263 -9524 66269 167658 321168
8463 321168 304646 245113 249426 102220 60447 -22028 -29832 -10349 77354 160983 253143 153706
8451 153706 59268 230853 230613 95107 -50733 -78686 31456 110605 358292 455794 347530
8440 347530 189894 110874 93510 94388 -36898 2919 144413 115238 64664 4244 120273
8429 120273 87109 119320 76656 23620 11280 50171 167972 10831 -128198 81076 137037
8418A37037J0320k3862j7771N4476j74907r8574N0690m9635j6382J50890J96183
8407B18465J3647j49826n8935j05718J1691J9707j1963k0473j36125n5456J04653
8396a70333N2257n1715M547j30501J07920J8509j9545j22517k2442K06496N6439
8385g0885j02686J5426P646J1770k1172r1973J32363p852q392M0322Q4064k1250
8373c2619J17412l7766j99323n7716J15218o5540r7290J30246J54264M7696k4854
8362D9728O2180k7367p504l1443j41573o9888j20740M9646J42741R7993j9924
8351a6151n2198l5645Q59m976N8281K636O5388j45852o8956N9636o0831J50972
8339d6837k9478j18022Q2741K84451J40640j03207k03289K2026P7369L3991r8883
$$ plain form
8418 137037 147357 123495 105724 160200 -14707 -113281 -62591 -112226 -128608 22282 218465
8407 218465 232112 82286 23351 -82367 -70676 -50969 -62932 -83405 -219530 -274986 -170333
8396 -170333 -118076 -169791 -165244 -295745 -187825 -169316 -188861 -311378 -333820 -127324 -70885
8385 -70885 -173571 -158145 -150499 -138729 -159901 -251874 -119511 -127363 -135755 -95433 -11369 -32619
8373 -32619 84793 47027 -152296 -210012 -94794 -160334 -257624 -127378 26886 74582 49728
8362 49728 111908 84541 77037 45594 -95979 -165867 -286607 -236961 -94220 3773 -16151
8351 -16151 -68349 -103994 -103135 -108111 -49830 -47194 18194 -127658 -196614 -136978 -197809 -46837
8339 -46837 -76315 -194337 -111596 172855 313495 210288 6999 29025 106394 140385 41502
8328D1502q1968m5789k6122N7691k06696m6486L0356j9874J05245j6934k9044
8317b38119J84758N7792k11834j57759J06165o3973l1649Q0018J89350K3786J8190
8306d3275p1126m3806O68J31753M6928J7298k15477K7367J51328J49465p9268
8295G1855j86654j81534o0380P7453J19524J07243j31801j05679j23873R6589
8285c17257K17681Q157q807K32659N2982k4455m6040o4477o9610l7556o1895j10931
8273b29549K6881j38887j02251J6165j3305J15840J53437k734J5384J1343M4692
8262a02984k9343N2835J69645P8238k0711K7973L5041q2935j36358M9584L3909
8251G4894j20705N9304m6669P0445K8849L4890L6206L3579j06102o7533N2957
$$ plain form
8328 41502 -40466 -86255 -112377 -54686 -261382 -307868 -277512 -297386 -192141 -209075 -238119
8317 -238119 -53361 4431 -207403 -365162 -258997 -322970 -354619 -274601 -85251 -61465 -43275
8306 -43275 -114401 -158207 -157539 -25786 21142 38440 -177037 -149670 1658 151123 71855
8295 71855 -114799 -296333 -356713 -279260 -159736 -52493 -184294 -289973 -413846 -317257
8285 -317257 -99576 -91419 -100226 132433 185415 160960 114920 50443 -19167 -56723 -118618 -229549
8273 -229549 -202668 -341555 -443806 -427641 -440946 -325106 -171669 -174403 -159019 -147676 -102984
8262 -102984 -132327 -79492 90153 168391 147680 175653 210694 127759 -8599 40985 74894
8251 74894 -45811 13493 -33176 37269 66118 101008 137214 170793 64691 -2842 50115
8240E0115R337j28238O1666M3282j39298o1091M3558j739J54554J30164L1602
8229A93912j81908j00070l6726R3955J45852j43829j42607n6433j21567q6039
8219d35460J51464L4498O2572k7592m7459K41551M1772r3289l2263l4396J6431
8208a22171M5737j96792O1Q4493K27507P0455o4928m0356j10190n7683P5235J22918
8196C4286J05651q8456J6528j37832n0627N1079O0478R0877O9693r5327J5141
8185G1491O7067l9496o5189J24494N2623k6122j50213r2781N9158L300l6156j33690
8173a65514P2749m812l6984J53645L8476N0715l0460l8799o6722P867m6981j47459
8161b14279j02094N7566Q4350L9079Q578J1093P1259o7125j23893J67458N3266
$$ plain form
8240 50115 59452 -68786 -7120 36162 -103136 -164227 -120669 -122408 32146 162310 193912
8229 193912 12004 -88066 -124792 -30837 115015 -28814 -171421 -227854 -349421 -435460
8219 -435460 -283996 -249498 -186926 -214518 -261977 -20426 21346 -71943 -104206 -138602 -122171
8208 -122171 -76434 -273226 -273165 -188672 38835 109290 44362 4006 -106184 -163867 -88632 34286
8196 34286 139937 51481 68009 -69823 -120450 -69371 -8893 81984 151677 56350 71491
8185 71491 138558 99062 33873 158367 210990 184868 34655 -58126 1032 4332 -31824 -165514
8173 -165514 -92765 -97577 -134561 19084 57560 108275 77815 39016 -27706 -19839 -66820 -214279
8161 -214279 -316373 -258807 -174457 -135378 -126800 -115707 -44448 -111573 -235466 -68008 -14742
8150a4742j57288J42783L9712j27234j53462Q5921J75757J67351j0082p417j05370
8139C5929J02239J16200o3322K3866n2775q0287N2066j08812q8746J44313P1101
8128A51772q6629j8281k0200N8897R3796m6298j26461n8776N3056J4642l7491
8117b1973J8351J32107J60766Q410k14689j08769j84624O8499J21255O8228O7182
8106A14743j6254K9508N8208j8707q3228Q7524P8405j11038j44969j17835j22077
8095b45720J42574K20264j16665j05938j62247p303p2770O0592J05506J204m9590
8084b30093N6264J7629J00269J8768k3088l0975q0549J97007k2692q2523l2100
8073a12083p0537M1045n7058n1030R684p9459o0479O9102J92434N7508N2191J0526
$$ plain form
8150 -14742 -172030 -29247 10465 -116769 -270231 -184310 -8553 158798 148716 141299 35929
8139 35929 138168 254368 191046 214912 162137 81850 133916 25104 -63642 80671 151772
8128 151772 65143 46862 26662 85559 179355 133057 6596 -52180 876 15518 -21973
8117 -21973 -3622 128485 289251 297661 82972 -25797 -210421 -141922 -20667 47561 114743
8106 114743 98489 127997 186205 167498 84270 171794 250199 139161 -5808 -123643 -245720
8095 -245720 -103146 117118 453 -105485 -267732 -275035 -347805 -287213 -181707 -180503 -230093
8084 -230093 -173829 -156200 -55931 -37163 -60251 -91226 -171775 25232 2540 -79983 -112083
8073 -112083 -182620 -141575 -198633 -249663 -239979 -319438 -379917 -310815 -118381 -60873 -8682 1844
8061A844l9152P7729K4850k8978J8334J37291n9584J24469K1286o0136l1816j22682
8049F3455r3128k368o0754l1707m4419J6022J34195J18831O2257j51187j63560
8038a52363p9130L9512P6679k2429P0641j08410j254R6592O7360l3563Q8727N1983
8026I4345j79286J774P0805O9500M8214K0403k8954p9862K6865Q8939N1284n8796
8014A25231j47804L0865j03939q1778J00326J16417q8337j75168K8360J24100
8004g1727j20855j16920O9572j43792j07454l8324K00389K38842Q3128J04647
7994I7506P2607n6304j99015l33340M2808J97257l5990J94416J76981l903j10921
7983D2102j64603j06631P200L0770J34635K05340N0790j54082L72686J28498j73088
$$ plain form
8061 1844 -37308 40421 65271 36293 54627 191918 132334 256803 278089 217953 186137 63455
8049 63455 -29673 -32041 -92795 -124502 -168921 -152899 -18704 100127 162384 11197 -152363
8038 -152363 -231493 -191981 -115302 -137731 -67090 -175500 -176754 -80162 -12802 -46365 42362 94345
8026 94345 -84941 -83167 -12362 57138 105352 125755 96801 16939 43804 132743 184027 125231
8014 125231 -22573 8292 -95647 -177425 -77099 39318 -49019 -224187 -195827 -71727
8004 -71727 -192582 -309502 -239930 -383722 -491176 -529500 -329111 -90269 -7141 97506
7994 97506 170113 113809 -85206 -418546 -375738 -178481 -214471 -20055 156926 153023 42102
7983 42102 -122501 -229132 -221932 -191162 -56527 148813 199603 45521 418207 546705 373617
7972C73617n3542j75538j95702j3165M6984k547P3845n1066l7814p4269j26993
7961b36190P0114J99551j9349n9005M7870o5622R2908J5184N4380j30281j36195
7950a66635k8339O0378J06990J6366n821o5006m5609r94J42734n4405j15223P9313
7938g6251J31972K15803j3140k52629o1771n5213O053k0038n2731O6964K64516
7927A53535k8988o9525o9612j66849Q9472M9923J16253J26345j50998l38343J76444
7916a12343J20808P407k7796J91201N2291j83506o4801L0730L7655R5104P1290
7905B18040j13165j64283o485K95786j17617L990K511j0882L0870M0957R6550
7894B76272q6382r9667l6336J32789N559J1940m3358j39986j18659l1051K06065
$$ plain form
7972 373617 320075 144537 -51165 -64330 -17346 -19893 53952 2886 -34928 -109197 -236190
7961 -236190 -166076 33475 14126 -44879 2991 -62631 30277 45461 99841 -30440 -166635
7950 -166635 -194974 -134596 -27606 -11240 -17061 -82067 -127676 -128670 14064 -40341 -155564 -76251
7938 -76251 55721 271524 258384 5755 -56016 -111229 -105176 -125214 -177945 -110981 153535
7927 153535 124547 55022 -14590 -181439 -91967 -42044 74209 200554 49556 -288787 -112343
7916 -112343 8465 15872 -11924 179277 231568 48062 -16739 13991 51646 146750 218040
7905 218040 104875 -59408 -65893 229893 112276 116266 118777 107895 138765 179722 276272
7894 276272 189890 90223 53887 186676 192235 204175 160817 20831 -97828 -128879 77186
7883G7186o266p7485J46366J91453j15875p8284L1096m643k71076o6217J17972
7872e5773L0238r2920l2578J20298J34508j29330K9215n0845K64977K7439j46661
7861I8568n9131j4182j36933L4666J26074O694Q9595Q370q8375j27076R5566K1554
7849E5390O2325m0756k32045N1827O0129J32097j8475L5390R4496L3310P9015
7838C12703q8305o6628l3050j36490J12488J73318o2020j23032r2296O5345J22076
7827A84109j61694j11819J50694R8757j58383j64419Q0038N5954J5701j53006
7817a64068m9885J6235J64612J47964j36521k28868j7726K04628n120m9948J0295
7806a08402p6577m726Q5409m5398k9151j46055N598J08118P5639j21220J68168
$$ plain form
7883 77186 70920 -6565 139801 331254 215379 137095 168191 163548 -107528 -173745 -55773
7872 -55773 -25535 -118455 -151033 -30735 103773 -25557 3658 -47187 217790 245229 98568
7861 98568 39437 25255 -111678 -77012 49062 55756 145351 153721 65346 -61730 33836 55390
7849 55390 117715 76959 -155086 -103259 -43130 88967 70492 105882 200378 233688 312703
7838 312703 224398 157770 124720 -11770 100718 274036 212016 88984 -3312 62033 184109
7827 184109 22415 -89404 61290 160047 1664 -162755 -82717 -26763 -11062 -164068
7817 -164068 -213953 -197718 -33106 114858 -21663 -250531 -268257 -63629 -68749 -118697 -108402
7806 -108402 -184979 -189705 -104296 -149694 -178845 -324900 -319302 -211184 -135545 -256765 -88597
7795h8597J60492L9655m121m7738j04902p3278K29886J05432l6627n7037o4935
7784E8230j07975j8090Q3692L226j59289K2246r46J07881R1022j9135l3734J24799
7772A51927l1437m821J0182N9205k1300r2724o8875m6987j70662J34674J11224
7761C0406j14946O6367j6695L3636m4943Q2112j07266j97480j129j06550J10530
7750b65958R4521N072J65321K65084N9278k30011o2844J15499j76191q1975q0492
7739a92696n927O7791k2007L3510k4667r9945k2780J14727J32442m6091k9366
7728i5009m4238k5275K1374j8007q236J18283Q8144r948L0889N9408k1721k05587
7716a09923J13683P409o6662q2058m8953j43848O6965M6715J70450J36047k2712
$$ plain form
7795 -88597 71895 111550 107429 59691 -45211 -118489 111397 216829 180202 123165 58230
7784 58230 -49745 -67835 15857 19083 -140206 -117960 -118906 -11025 79997 60862 27128 151927
7772 151927 120490 115669 125851 185056 163756 71032 2157 -44830 -215492 -80818 30406
7761 30406 -84540 -18173 -34868 -1232 -46175 35937 -71329 -268809 -269938 -376488 -265958
7750 -265958 -171437 -166365 -1044 264040 323318 93307 30463 145962 -30229 -112204 -192696
7739 -192696 -198623 -130832 -152839 -119329 -143996 -243941 -266721 -151994 -19552 -65643 -95009
7728 -95009 -139247 -164522 -143148 -161155 -169391 -51108 37036 27088 57977 117385 95664 -109923
7716 -109923 3760 11169 -55493 -137551 -186504 -330352 -263387 -216672 -46222 89825 67113
7705F7113r949j26196j68215K9584M2538N7989l3822m8142O7640M1324M7987N0932
7693A8783q1212r3684l5970Q9302M0067J43996n0964L4798p4496j18256J38184
7682A0548p7315k01831K4787N2237J00025J7272j8911P19j14819K2460N7542J5529
7670a11757k4281n0472L3549p1568k01106p5080O7764J81907J34477K10065j0393
7659H3105j79953o1038P4014P6003j8485J33747J65260m7349j57500k01229j10838
7648b44263m1642R7643q9099o2586r3657N7494K5326Q9671K3017M3813K7324o381
7636a73340K55264J4712k45580k27150M9191J29594J72658J19110L6774j85576
7626e4343r7811M7434P2067q5826j17988p24L4480J55457L7623J05067L6812J10801
$$ plain form
7705 67113 57164 -69032 -237247 -207663 -165125 -107136 -140958 -189100 -121460 -80136 -32149 18783
7693 18783 -62429 -156113 -192083 -102781 -62714 81282 30318 65116 -9380 -127636 10548
7682 10548 -66767 -268598 -243811 -191574 -91549 -74277 -93188 -92469 -207288 -184828 -127286 -111757
7670 -111757 -136038 -186510 -152961 -224529 -425635 -500715 -432951 -251044 -116567 93498 83105
7659 83105 -96848 -157886 -83872 -7869 -26354 107393 272653 225304 67804 -133425 -244263
7648 -244263 -285905 -188262 -277361 -339947 -433604 -376110 -350784 -261113 -238096 -194283 -166959 -173340
7636 -173340 81924 96636 -148944 -376094 -326903 -197309 -24651 94459 131233 -54343
7626 -54343 -152154 -104720 -32653 -118479 -236467 -237191 -202711 -47254 -9631 95436 132248 243049
7614B43049J8832l6752O6544j59598r8002N960P0951L9957j47106r6645K4585
7603f8225j25480L7647J00329q185Q4485J8584j25322m9076L8108n1929j2347
7592a61411l6075p1594O374K49547J59101R5588J24168O4492k08573k45927r0630
7581a14940k6060J65793l0154j61602L2482L3400j38736R7093J48272o9837O649
7570e7640J42231m8976q9346K8524p0881r9577J0433K59745Q4271l7827m9850
7559G1107q4822J23121K5175k09115k0012J43616J78533l7263M2585L8965J7487
7548B89377j19978k0502j09328j36349J1460l7418j23015j86796J75956J64222
7538i2371J50750Q3347Q4994L0090j98628k5900R094J6818R6775p1723q5591M2735
$$ plain form
7614 243049 261881 225129 291673 132075 34073 40033 110984 150941 3835 -92810 -68225
7603 -68225 -193705 -156058 -55729 -63914 20571 39155 -86167 -135243 -97135 -149064 -161411
7592 -161411 -197486 -269080 -262706 -13159 145942 241530 365698 430190 221617 -24310 -114940
7581 -114940 -141000 24793 -5361 -166963 -134481 -101081 -239817 -142724 5548 -64289 -57640
7570 -57640 84591 35615 -53731 -25207 -96088 -195665 -185232 74513 158784 120957 71107
7559 71107 -13715 109406 134581 -74534 -94546 49070 227603 190340 232925 271890 289377
7548 289377 169399 148897 39569 -96780 -85320 -122738 -245753 -432549 -256593 -92371
7538 -92371 58379 141726 226720 256810 58182 32282 41376 58194 154969 83246 -2345 40390
7526D0390k4653O197J6120J01488N4477J46454J8776n5649j81253l01787L3647
7515a45793J80647j9209p7679j73040o7580J75812J97761J2811Q6043j7744j74767
7504b2738j72912M7071J59881Q3814R894k3050O0324R9281k93767r1763J66628
7493B2663J1801m6212L760k15083l4612Q6752l0065O4631P4033K7486J5907K9701
7481A0762j2093Q7293Q1188o6949J1759p2624j10199j3743j8325o911k9628p3192
7469b12662J76784k0067j75072j1310J06187J97567L48j0546J06387q1436j25567
7458d9387p587M3904Q5735k12865k64851M4420J52089J58839j9556r660M1838
7447c7081J9262R2730K1040p3451J2505q6301j38316J25742L0220k6766L3005
$$ plain form
7526 40390 15737 21934 38054 139542 194019 340473 359249 303600 122347 -179440 -145793
7515 -145793 34854 15645 -62034 -235074 -302654 -126842 70919 83730 169773 152029 -22738
7504 -22738 -195650 -148579 11302 95116 105010 81960 142284 241565 -52202 -143965 22663
7493 22663 34464 -11748 -7988 -223071 -257683 -170931 -200996 -136365 -62332 -34846 -18939 10762
7481 10762 -1331 85962 167150 100201 111960 39336 -70863 -84606 -102931 -109842 -139470 -212662
7469 -212662 -35878 -55945 -231017 -242327 -136140 61427 61775 51229 157616 76180 -49387
7458 -49387 -56974 -13070 72665 -140200 -405051 -360631 -208542 -49703 -69259 -78919 -37081
7447 -37081 -17819 74911 95951 22500 35005 -51296 -189612 -63870 -33650 -60416 -27411
7436b7411j51112J04882J25027M5704q408m8131k51530j08193L0695R873J6801
7425b61803J8526R9840O0269j03450j35168o6180K00296J34198q2013j33646l1627
7414c00758J44506K2678J31431j11605K0756J59625q8930n2662J05161K877j38955
7403a05876q2314M5445k4282K38044Q8480o6487m8232N9979m3831j17484L3045
7392b3513l4812k409J64721P5691o3342J9r3037j1934J12289J66152j54088j72594
7380c6857m2185K0758J51132O8107K4284k9269j76386M2676Q7498l0863Q7417
7369A66312j42604k26372m5642Q8111j10778J33235J19496K166O0049Q2101j32670
7358f596p3691M2999L0293K9388K16829l0886l48478k9744J5444N9128k7298J31937
$$ plain form
7436 -27411 -178523 -73641 51386 97090 88682 40551 -210979 -319172 -288477 -278604 -261803
7425 -261803 -243277 -143437 -83168 -186618 -321786 -387966 -187670 -53472 -135485 -269131 -300758
7414 -300758 -156252 -133574 -2143 -113748 -92992 66633 -22297 -74959 30202 33079 -105876
7403 -105876 -188190 -142745 -167027 71017 159497 93010 44778 104757 60926 -56558 -23513
7392 -23513 -58325 -60734 103987 179678 116336 116355 23318 11384 123673 289825 135737 -36857
7380 -36857 -79042 -58284 92848 160955 185239 155970 -20416 22260 109758 78895 166312
7369 166312 23708 -202664 -248306 -160195 -270973 -137738 -18242 -16076 43973 126074 -6596
7358 -6596 -80287 -37288 -6995 22393 239222 208336 -140142 -169886 -154442 -95314 -122612 9325
7346I325J23560p054p9326q7655j93922K9343J55344K02675P7392J626k25677
7335E631j55181j37531k465J54928R8923O7396o4662j74553O7121K39049R9353
7324A98009m1217j00574j87369r3029L914J59501J95510K2523q1790m8325Q7679
7313A14832q2671n1568J18649l0629r0672N8226P2306R8878q6565j7205p7811
7302B5770n0388M0452J6166j21907j47717L032J32240R5164K5107n9254O4921
7291B3586m5121M712j8936j02773k5621Q2976J03656R1360N2553q2927k4340M651
7279F3776l7320j65404n3024l4951n8406J4146M8230j0826J0798J84271R7253
7268E8543Q2329j57696k70074P473N0637Q8174R066M2509N1048Q5496o2583M3010
$$ plain form
7346 9325 132885 125831 46505 -41150 -235072 -205729 -50385 152290 229682 231308 5631
7335 5631 -149550 -287081 -289546 -134618 -35695 31701 -32961 -207514 -140393 98656 198009
7324 198009 156792 56218 -131151 -224180 -220266 -60765 134745 157268 75478 27153 114832
7313 114832 32161 -19407 99242 68613 -22059 36167 108473 207351 120786 103581 25770
7302 25770 -24618 15834 32000 -89907 -237624 -234592 -102352 -7188 17919 -41335 23586
7291 23586 -21535 -16823 -35759 -138532 -164153 -81177 22479 113839 166392 83465 59125 63776
7279 63776 26456 -138948 -191972 -226923 -285329 -271183 -222953 -233779 -222981 -38710 58543
7268 58543 140872 -16824 -286898 -279425 -228788 -140614 -131548 -89039 -37991 47505 -15078 27932
7256B7932j61834J03055N7253p8862p2845K3990L3500J43637Q1117n2611j10669
7245f337j20588k07783K8239J53573j8998J0988j2599j05276r9469k6245k7297
7234d31792J75655Q5503Q02r7452n4061M6893O7391n1028j60525J02714J92439
7223a23461J00803R863J02472J02035j9433r5539K5864K9480p934J2684k6025
7212A10809o9535p3279P7589l734K1000j9267o0252l6195j19823n3293q915J49088
7200h5807j90380j63357j34799P4929J94262J42575J3341L3844j6409j8133J17421
7189c2513j698l587J3761J69214P234n6231R1045r2191j17959M0267m3088n8202
7177h3948j34837q8929j535J63215r2835J0882J87862M3260j14074J68050J40186
$$ plain form
7256 27932 -133902 -30847 26406 -52456 -125301 -101311 -67811 75826 156943 104332 -6337
7245 -6337 -126925 -334708 -306469 -152896 -171894 -160906 -173505 -278781 -378250 -404495 -431792
7234 -431792 -256137 -170634 -169832 -267284 -321345 -274452 -207061 -258089 -418614 -315900 -123461
7223 -123461 -22658 -12795 89677 191712 172279 76740 102604 132084 124150 136834 110809
7212 110809 41274 -32005 45584 41850 62850 43583 -16669 -52864 -172687 -225980 -234895 -85807
7200 -85807 -276187 -439544 -574343 -499414 -305152 -162577 -149236 -115392 -131801 -149934 -32513
7189 -32513 -34211 -37798 -24037 145177 152411 96180 187225 95034 -22925 17342 -25746 -83948
7177 -83948 -218785 -307714 -309249 -146034 -238869 -227987 -40125 3135 -110939 57111 197297
7166A97297o391L6260L4734k1878q072r1125p8370j37446j06858J9632J09840
7155e2377l9334o7100m7392J81875J29354J00263r3895j26366L1407J53146K4080
7144A93661j57983j5969N2030j8142r2561m1027J01198M6230P4534j94j03185
7133C8592L2301K34n0745j18618L9379O7630m3520p894J44055n4163j1323R0013
7121A25941M7396L059q0048n9903k819N6720J2675L1714P2434o6039J4411n2159
7109A03382J50032k3522r5782k08110m1112j20974k14162J9364J26536K4814J89091
7098i0443R8979j9499J12388j6177j07727j13146n7339j5502J26832O7515K0329
7087F210k3408o4065L4078J32257J16659O5344j11341j42236j36402M9353J8767
$$ plain form
7166 197297 190906 227166 261900 240022 231950 140825 62455 -74991 -181849 -162217 -52377
7155 -52377 -91711 -158811 -206203 -24328 105026 205289 111394 -14972 16435 169581 193661
7144 193661 35678 19709 71739 53597 -38964 -79991 21207 67437 141971 141777 38592
7133 38592 70893 71127 20382 -98236 -58857 8773 -34747 -42641 101414 47251 35928 125941
7121 125941 173337 176396 96348 36445 33626 90346 103021 134735 207169 141130 155541 103382
7109 103382 253414 229892 134110 -74000 -115112 -236086 -450248 -430884 -304348 -279534 -90443
7098 -90443 8536 -10963 101425 85248 -22479 -135625 -192964 -208466 -81634 -14119 6210
7087 6210 -17198 -81263 -47185 85072 201731 267075 155734 13498 -122904 -73551 -54784
7076e4784M7317J06665q8142j85098j01080P8308O6974q7791L4990n8018L4890
7065b05769K7287P8220L3217o7624J17253k9174k41252M3760K74592k6266M2832
7054D7076n2129k8922K4118N3638j15053j00855L568k8035J41548Q5281J82470
7043B12705j6255P936L777q9804Q4127J33191j78704q8696o1980j8850J3784k7449
7031b6218j54070j5858K5300j9307p4804j01517j7091J49281J05355P5160J35403
7020H1634J28871K3342p5901l0843K75604L8999k72824m4659Q5087J1108n7557
7009A62861J05605m4838r1471k3147L8040q5435n0779j01353m0829o8371Q7059
6998a12658J27526K1885k4051P4672L1052n4739n7888j01443K9669j08445j84577
$$ plain form
7076 -54784 -7467 99198 11056 -174042 -275122 -196814 -129840 -217631 -182641 -240659 -205769
7065 -205769 -178482 -100262 -67045 -134669 -17416 -46590 -287842 -244082 30510 4244 47076
7054 47076 -5053 -33975 -9857 43781 -71272 -172127 -168559 -196594 -55046 30235 212705
7043 212705 196450 204386 208163 118359 202486 335677 156973 68277 6297 -12553 1231 -26218
7031 -26218 -180288 -196146 -170846 -190153 -264957 -366474 -383565 -234284 -128929 -53769 81634
7020 81634 210505 233847 157946 127103 402707 441706 168882 124223 209310 220418 162861
7009 162861 268466 223628 132157 109010 147050 61615 10836 -90517 -131346 -199717 -112658
6998 -112658 14868 36753 12702 87374 118426 63687 5799 -95644 -65975 -174420 -358997
6987c58997K9468N6926J72656M6812l0315r321j043k1566o093K5496j29627J0316
6975b15288Q4162L0702j11563J65R3938L5480K521r75N9303L6792k0602q8982
6963i4347q0429P1188J46197R8956m7505j43081j03735O8170k1859Q8031m125
6952b2539J63587N1286r5385j70678q2509j25679q2377J65534J40471J20228J25024
6941A86963j26076j35044j102p4840m5063j8055O1964M3574n1095K19910K18871
6930B80007O660J6059J4312j7725K1018n6512j43531m8407K7958J7602o4743j03405
6918e0707j58508j71226r7865L4318J44301L50441L5199J3794P4178j20224k9602
6907B4099j25813k3315M7611l9223k7450J17602R1011j2576K8230P1732o6298
$$ plain form
6987 -358997 -329529 -272603 -99947 -53135 -83450 -92771 -93814 -115380 -121473 -95977 -225604 -215288
6975 -215288 -131126 -100424 -211987 -211822 -117884 -82404 -79883 -80858 -21555 15237 -5365 -94347
6963 -94347 -174776 -103588 42609 141565 94060 -49021 -152756 -84586 -106445 -18414 -22539
6952 -22539 141048 192334 96949 -73729 -156238 -281917 -364294 -198760 -58289 61939 186963
6941 186963 60887 -74157 -75259 -150099 -195162 -213217 -151253 -107679 -158774 61136 280007
6930 280007 286667 302726 317038 299313 320331 263819 120288 71881 99839 117441 52698 -50707
6918 -50707 -209215 -380441 -478306 -443988 -299687 50754 85953 99747 173925 53701 24099
6907 24099 -101714 -125029 -77418 -116641 -144091 -26489 64522 51946 80176 151908 85610
6896H5610k00573J7052J57939K9161j43893J10510J83349m3269m5205l6896m3470
6885G0315k34458q4806o8125r3053Q8154Q6495J78650o6138j26255J59282J47515
6874E7576N1189n0856N4243m7897p0681j05579N5903k5157M2770j14833Q0172
6863g3150q9596J9900P7298K64939M8274r601j01400k77995M2004K01496Q9076
6852A91245j5504r6905j5790j46003k1565N1987j55k86J62505J61590k2647r3449
6840A55023Q73N109q1748o9717j49397p7299k9501r354J34736J0693m3084p8070
6828b31736L3393j1686J85074J37851K6810k84361q8600J22769J09708o187q4373
6817i1338j30415m4311j911l1506J50498O7272j21134J7365J99045K2133o7282
$$ plain form
6896 85610 -114963 -97911 60028 89189 -54704 55806 239155 195886 150681 113785 70315
6885 70315 -164143 -248949 -317074 -410127 -321973 -235478 -56828 -122966 -249221 -89939 57576
6874 57576 108765 57909 112152 64255 -6426 -112005 -56102 -81259 -38489 -153322 -73150
6863 -73150 -162746 -142846 -65548 199391 247665 238064 136664 -141331 -99327 102169 191245
6852 191245 175741 78836 63046 -82957 -104522 -52535 -52690 -52976 109529 271119 248472 155023
6840 155023 155896 161005 79257 9540 -139857 -217156 -246657 -256011 -121275 -110582 -153666 -231736
6828 -231736 -198343 -210029 -24955 112896 139706 -144655 -233255 -110486 -778 -6965 -91338
6817 -91338 -221753 -266064 -267975 -299481 -148983 -81711 -202845 -185480 13565 35698 -31584
6806c1584m8142j19685J64373N8349j68317k7783k1229Q7787J19192j6046j62525
6795a65610p689J16981l9547O2640p1902R348K02965r3797j84910J755L7715J163
6783a30888J20932N9862Q6238j30553Q2491J02218R2796k1261M5078r4127n0712
6772A62074Q241j14576K5038K3964R2707l8113r6909o5700J88937J12408p8406
6761B19665j67165k02919r1958r6669p7836K98043K46966j10153J00390N8046
6751A76410N3006j52485l8348K3737j12482n3317l0074l9847k1050j05920j34750
6740d35120P9704o636K68599J59827L9380j80752q7300r3859M5337Q1448Q6433
6729d2939N5066P577l5656k5018O4406R1675L0370O0408j07957p5119Q4857J9109
$$ plain form
6806 -31584 -79726 -199411 -35038 23311 -145006 -172789 -194018 -106231 12961 -3085 -165610
6795 -165610 -173299 -56318 -95865 -33225 -105127 -95779 107186 13389 -171521 -169766 -132051 -130888
6783 -130888 -9956 49906 136144 5591 88082 190300 283096 261835 306913 212786 162074
6772 162074 170315 55739 80777 104741 197448 159335 62426 -3274 185663 298071 219665
6761 219665 52500 -150419 -242377 -339046 -416882 -118839 128127 17974 118364 176410
6751 176410 229416 76931 38583 62320 -50162 -103479 -133553 -173400 -194450 -300370 -435120
6740 -435120 -355416 -362052 -93453 66374 105754 -74998 -162298 -256157 -210820 -129372 -42939
6729 -42939 12127 19704 -15952 -40970 23436 115111 145481 205889 97932 22813 107670 126779
6717A26779j1438p799j9324p9378J78418o9250j10209p4990m774J14137J938j73951
6705a29841m4329J16653k9268J64555J9137j91921k06133p6898R0390J70546J37480
6694B0371j31615J1214R9293q7632J4401J82900Q9573k7284l1985l8346q1991
6683A8899k23573n0561R9907J00781J33341P7873p4107L3802q3965p9321j8356
6672f5280P0916j14496o9013M2060P6522Q9168L0230J44381J32265l9824j48307
6661A48622j47352j60000l5190J76995m650r918j7646J21902L4375n6720r6939
6650d6521j13595O5538O4202j0309k9044j1658l36591j69372R7183J14179l0195
6639d06183J7870O8640J13578J37524p8633N7948R6097Q5817j09635n2027J02255
$$ plain form
6717 126779 115341 107542 88218 8840 187258 118008 7799 -67191 -71965 42172 44110 -129841
6705 -129841 -174170 -57517 -86785 77770 96907 -95014 -301147 -378045 -287655 -117109 20371
6694 20371 -111244 -100030 -737 -88369 -73968 108932 198505 171221 139236 100890 18899
6683 18899 -204674 -255235 -155328 -54547 78794 156667 82560 116362 32397 -46924 -65280
6672 -65280 5636 -108860 -177873 -135813 -59291 29877 60107 204488 336753 296929 148622
6661 148622 1270 -158730 -193920 -16925 -21575 -31493 -49139 72763 107138 50418 -46521
6650 -46521 -160116 -94578 -30376 -40685 -69729 -81387 -417978 -587350 -490167 -375988 -406183
6639 -406183 -388313 -319673 -206095 -68571 -147204 -89256 6841 92658 -16977 -69004 33251
6628C3251O9971J20295r2233j29793q7027O2123L4214r4646o5357J14407J5590
6617a9205q5299p5785J00320P9762R1531k7986k25410j24672k8688N1424o2246
6606c26254k054J5513J36059L9528o6491j05340R3533J49017P1448o16j17959
6595a13616P3575J96076M1296j29719R2160R5877j16145k470n1433O8853j09549
6584D4905k7448o5498M3210Q4893j68315k7276J41824J2077j36250J8614k8745
6573a08009K4722M5394J69644P4241q9617j21571q1388o6638K5757o3789K9718
6562a61536J21388o7267L8172P6920J47684p6682j85341k0072n0724J04045l1059
6551a04472j81342l0269q1627l336J47168J35122M3627J02144M1662J39996m5284
$$ plain form
6628 33251 103222 223517 131284 1491 -85536 -23413 10801 -83845 -149202 -34795 -19205
6617 -19205 -104504 -180289 -79969 -207 91324 63338 -162072 -286744 -315432 -264008 -326254
6606 -326254 -328308 -312795 -176736 -137208 -203699 -309039 -215506 -66489 4959 4343 -113616
6595 -113616 -40041 156035 197331 67612 159772 255649 139504 137034 85601 154454 44905
6584 44905 17457 -48041 -4831 80062 -88253 -115529 26295 38372 -97878 -79264 -108009
6573 -108009 -83287 -37893 131751 205992 116375 -5196 -86584 -153222 -127465 -191254 -161536
6562 -161536 -40148 -107415 -69243 7677 155361 78679 -106662 -126734 -177458 -73413 -104472
6551 -104472 -285814 -316083 -397710 -401046 -253878 -118756 -75129 27015 68677 208673 163389
6540A63389n1779Q5202J17809M3406j81568j68522J2275J65706n265k36630J85344
6529A29367P7757j17488K2948R4394q7047j1787p7272j7334m2998Q6286m2677
6518A4149k4655R5334Q1515n1570Q3697P8739j25929j91900n0932J98123N7091
6507A63662j17928j25255Q968o5011l9473J559R9019j6113k0120J15498K1860
6496B6666o8917N9013l3440j13628q6547L8709j08740M1650o4762O6259N9285
6485a84452N2786J59779L5142O2727J18909l9352j04893m500m1529q3870j65839
6474a95092J0077J84230L1703j44976O0826K597J05931p5758j17964M3993q5334
6463a79767P8332K92466K48498j3115j25024j22008j02826q0248N1662K09648
$$ plain form
6540 163389 111610 196812 314621 358027 176459 7937 20212 185918 180653 -55977 129367
6529 129367 207124 89636 112584 206978 119931 108144 30872 13538 -29460 56826 14149
6518 14149 -10506 84828 166343 114773 198470 277209 151280 -40620 -91552 106571 163662
6507 163662 45734 -79521 -70553 -135564 -175037 -173478 -74459 -90572 -110692 4806 26666
6496 26666 -42251 16762 -16678 -130306 -216853 -178144 -286884 -245234 -309996 -243737 -184452
6485 -184452 -131666 28113 63255 125982 244891 205539 100646 96146 54617 -29253 -195092
6474 -195092 -185015 -785 30918 -114058 -53232 -50635 55296 -20462 -138426 -94433 -179767
6463 -179767 -101435 191031 439529 426414 301390 179382 76556 -3692 47970 257618
6453B57618j30916j39783o673J5990j33801o4842Q8590J52343P2030q2935M4938
6442G2559L1916m2395k04187j5636R0242J690O6073m336j29139n7805J6997L9333
6430a34688K1768j22282J57494J20398O3658N7239J58795K6998m602l23727j59008
6419a37957L8096J34798j8401j02360K751p0702p279R4565l1654O3630K33586
6408A99073K90963m4650j82466j25429j31026q2322o0802J06698N9729Q9701N029
6397A24498q6141L4985j49385J43980l1335l6434j38026J39935R1474n0857o9042
6386b6348J15577j2055N8479N7195j53940k45053o0105M4084K22168K30474k6425
6375B04051n823m05M4378j41213k18664l8795O5099m9359N8793R9513k7699M1411
$$ plain form
6453 257618 126702 -13081 -19754 -3764 -137565 -202407 -113817 38526 110556 27621 72559
6442 72559 104475 62080 -142107 -157743 -67501 -65811 262 -4074 -133213 -191018 -174021 -134688
6430 -134688 -112920 -235202 -77708 42690 106348 163587 322382 349380 344778 21051 -137957
6419 -137957 -99861 34937 16536 -85824 -83073 -153775 -161054 -66489 -98143 -34513 199073
6408 199073 490036 445386 262920 137491 6465 -75857 -136659 -29961 29768 119469 124498
6397 124498 38357 73342 -76043 67937 36602 168 -137858 2077 93551 42694 -26348
6386 -26348 89229 77174 135653 192848 38908 -206145 -266250 -222166 2 230476 204051
6375 204051 198228 197823 242201 100988 -117676 -156471 -91372 -140731 -81938 17575 -10124 31287
6363C1287j15598j20539J3933N2495K46796M8459n2141m5713j75196r2068K16307
6352H022N7501p9330n3294K8891p1817j2015j13799L6249J2048K39019k5646r9214
6340g3385k8188P0064j50543m7540M1022J5848K28640P776m4653j0692k489r6388
6328i0528k16587p1100K42068K9079J96308J5526n5650k1365j13289J46717p23
6317F0456P0394j22330l10661J4529M7198L2629L3594J61656M3001Q1396J6354
6306A28216Q9987j26423j41993m416j498M593J0334R2781j0563J152j9455P173
6294B9888m3834Q6012N3277j80591j1508O8070O8107L0035J28583j08014r281
6283A10744n3573j58732O3090J21895k19359J51435J84470p7714j56529m2139
$$ plain form
6363 31287 -84311 -204850 -190917 -138422 108374 156833 104692 58979 -116217 -208285 8022
6352 8022 65523 -13807 -67101 -38210 -110027 -122042 -235841 -199592 -187544 51475 25829 -73385
6340 -73385 -101573 -31509 -182052 -229592 -188570 -172722 55918 63694 19041 8349 5860 -90528
6328 -90528 -307115 -378215 -136147 -107068 89240 104766 49116 27751 -85538 61179 60456
6317 60456 130850 8520 -302141 -287612 -240414 -207785 -174191 -12535 30466 111862 128216
6306 128216 218203 91780 -50213 -54629 -56127 -51534 -41200 51581 41018 42170 22715 29888
6294 29888 -13946 72066 125343 -55248 -66756 1314 69421 99456 228039 120025 110744
6283 110744 57171 -101561 -38471 83424 -135935 15500 199970 122256 -34273 -76412
6273g6412M9266o1751J93050J41906p4645K287N4668j07423j32988j49068P2684
6262h8426J39376J10283Q4676p7481j03204L0672o9087J22824M1750r3663p1698
6251B6022k14112o152J23517Q7070j08399L3608J5681k945O8863o0075J0149l3227
6239f0000l5765Q6147P4514K3881J38473N4190r7992l2591k4673j368L2784j49719
6227G881q0934J54602j4902M5509L6528j92019j1877r5507k06030K46551J33867
6216B3669k3236L000o6068j20771J15416m4473n27J55603K1845J1762k08771n1366
6204a83917K62547L8387j5292R752o3447J45873k8070r7544p2202J154Q0891j15329
6192c7197M6242P5150o2390j98545j06854M8856M8390J42168J55655N4541k02227
$$ plain form
6273 -76412 -27146 -88897 104153 246059 171414 173701 228369 120946 -12042 -161110 -88426
6262 -88426 50950 161233 245909 168428 65224 95896 26809 149633 191383 97720 26022
6251 26022 -188090 -194242 -70725 16345 -92054 -58446 -42765 -45710 23153 -36922 -26773 -60000
6239 -60000 -95765 -9618 64896 88777 227250 281440 183448 150857 126184 124816 157600 7881
6227 7881 -73053 81549 66647 112156 148684 -43335 -55212 -150719 -356749 -110198 23669
6216 23669 433 3433 -62635 -183406 -67990 -112463 -112990 42613 64458 76220 -132551 -183917
6204 -183917 78630 117017 101725 111477 48030 193903 165833 68289 -3913 -2759 78132 -37197
6192 -37197 9045 84195 21805 -176740 -283594 -234738 -186348 -44180 111475 166016 -36211
6181c6211N5149J58081n8589O0313k8544q7706j38189k171J3471K2339q6803K0692
6169a08168L7965l5612K1840j3892O1009m1103J2843n8313q4209r1612k5242J44649
6157a79845L7730m2027K00839J40136p4667q7421o5973j40253O619P1535O25q8425
6145b21127O7510J11369J06560L9364J11771K06589J7812k63635j38004j81573
6135a43364m666J25484O2012J19045K2408M1026j93178r6947k2458M3473Q156
6124c9009M3211r4645o0177J02456J06472k18833L8926J65919J65118j83993n7452
6113c2007O2273o5542N4171M1324l7007k335Q8144j3805p6496L5261n2079j3365
6101a1463R483q3624L2260M7289J04226J0037O4682N2647P9465Q390j30342M9732
$$ plain form
6181 -36211 18938 177019 118430 178743 150199 62493 -75696 -77867 -64396 -42057 -128860 -108168
6169 -108168 -70203 -105815 -83975 -97867 -36858 -77961 -65118 -123431 -207640 -299252 -324494 -179845
6157 -179845 -142115 -184142 16697 156833 82166 -5255 -71228 -211481 -204862 -133327 -132702 -221127
6145 -221127 -153617 -42248 64312 103676 215447 422036 439848 176213 38209 -143364
6135 -143364 -148030 -22546 39466 158511 180919 221945 28767 -68180 -90638 -47165 -39009
6124 -39009 4202 -90443 -150620 -48164 58308 -160525 -121599 44320 209438 25445 -32007
6113 -32007 30266 -35276 18895 60219 23212 20877 109021 95216 18720 53981 1902 -11463
6101 -11463 -1980 -85604 -53344 -6055 98171 108208 172890 225537 305002 313392 183050 232782
6089B32782J1010k4738m784n196M7332j65154r8375j26323m6740J52813R9354
6078G1981L9862n4607j692P4877J02524j74546k09898j32573Q7384J05040J14335
6067B2687N3820j67509O6166J13687j5756M8982l6007n5467j32029J6934N4384
6056c0108k5081J6131J5144N1461N674Q3212o3814m715J54649M7198m6695k77057
6044g4001k14389r4843J24616K33352q357k8608k6128j487l8344J02196J56402
6033A30409J43580p3299k61542j53621K50384J06765l081L5231n3732j04835q95
6022A5364N2845L8182l5541l1929P0655R1488k2908R031M6126p6256k7686p0386
6010E8985j54367j05230n5252O5440R8794p4827L3876J59141J26009J42095J32565
$$ plain form
6089 232782 243792 219054 214270 209074 256406 91252 -7123 -133446 -180186 -27373 71981
6078 71981 111843 57236 55544 130421 232945 58399 -151499 -284072 -196688 -91648 22687
6067 22687 76507 -91002 -24836 88851 73095 122077 86070 30603 -101426 -84492 -30108
6056 -30108 -55189 -39058 -23914 27547 33221 116433 52619 47904 202553 249751 203056 -74001
6044 -74001 -288390 -383233 -258617 -25265 -33622 -62230 -88358 -89845 -128189 -25993 130409
6033 130409 273989 200690 -60852 -214473 35911 142676 139595 174826 121094 16259 15364
6022 15364 68209 106391 70850 38921 109576 201064 178156 187187 233313 157057 129371 58985
6010 58985 -95382 -200612 -255864 -190424 -91630 -166457 -132581 26560 152569 294664 427229
5999D27229k07672j75589j78056k6098L9409K21047O4696P1303m9175l9325j26164
5988B1605R447J09231j5386j72079j55838K48224O4296l10271j40465L0231O3892
5977b47113J330N8935N0074j45021L4984J55994n5191j30726q7374K06258J60106
5966B256O6813j60174k9355M7163K4200J807j56876J01813P1868r4006P9451K0491
5954b4549r9306P3443J3361Q6142j07084j23508M6261R6280p7398j18140J04112
5943a30386K6085J9064q598M5865n3992j25873N4789N0891m8277j2995M7595J14375
5931b1457p6992l4115K8354j22555N6674K5804N8226M301Q393j2876l1424K2238
5919i5429L0564q1425q0275R9983M0204N3116j08918K6358j6399M6760m8644l3061
$$ plain form
5999 427229 219557 43968 -134088 -160186 -120777 100270 164966 236269 187094 147769 21605
5988 21605 31052 140283 124897 -47182 -203020 45204 109500 -200771 -341236 -311005 -247113
5977 -247113 -245783 -186848 -136774 -281795 -246811 -90817 -146008 -276734 -364108 -157850 2256
5966 2256 69069 -91105 -120460 -73297 -49097 -47290 -204166 -102353 -30485 -124491 -45040 -24549
5954 -24549 -123855 -50412 -37051 49091 -57993 -181501 -135240 -38960 -116358 -234498 -130386
5943 -130386 -104301 -85237 -93835 -47970 -101962 -227835 -173046 -122155 -170432 -183427 -135832 -21457
5931 -21457 -98449 -132564 -104210 -226765 -170091 -144287 -86061 -81760 -73367 -86243 -117667 -95429
5919 -95429 -64865 -146290 -226565 -126582 -86378 -33262 -142180 -115822 -132221 -85461 -134105 -167166
5907a67166J33045K01933J17662q7731j48871j38492L7896j50657Q1658J0036
5897a10687q3476R3102J81108j8026Q9497J68550j85710j44465o592j95123r2244
5886c04066J25816J08278j3201Q5690R6303j63962l6999q8832l0950J5944m8212
5875b54191J49873K28982L9249n8225p8495J497J09322J80842q9248k06670j47388
5864a24452J11328O8199N1604p1695j56152j26091q404L9366Q0326m0839l9257
5853b16067l1340n0147k7683l0604K17220Q9271m242M9432j14318j22213J56325
5842h4366o6105j52164Q3501K05231J69461m3761K52313l4j52574j59026j7801
5831C4675J26587o0255j53580j01729J70373M634m3172J89164J54761r4460j40465
$$ plain form
5907 -167166 -34121 167812 285474 197743 48872 -89620 -51724 -202381 -120723 -110687
5897 -110687 -194163 -101061 80047 62021 151518 320068 134358 -10107 -16699 -211822 -304066
5886 -304066 -178250 -69972 -83173 2517 98820 -65142 -102141 -190973 -221923 -205979 -254191
5875 -254191 -104318 124664 163913 105688 27193 28690 138012 318854 229606 22936 -124452
5864 -124452 -13124 55075 106679 34984 -121168 -247259 -255663 -216297 -135971 -176810 -216067
5853 -216067 -247407 -297554 -325237 -355841 -138621 -49350 -53592 -4160 -118478 -240691 -84366
5842 -84366 -150471 -302635 -219134 -13903 155558 111797 364110 364076 211502 52476 34675
5831 34675 161262 101007 -52573 -154302 16071 20705 -22467 166697 321458 226998 86533
5820H6533k00238j02938J9491J46851m7842o3023p7171j9829K9842J21227O2081
5809d5016l4j62885k10405N5413J31440K49959M0527p8257q8982L6944L0690p1768
5797a12374N4168L6968K6833k6142J69717n7011n1826m7214j5800p3357j59105
5786b55143o2710J08960K528J3746p7235K1369O3447j45383n2081J99889J97652
5775A5039J43236j37233k53873P0880J61598M5229J44501j56567j61569j10104
5765b38863O2918R0678N6507M551J03554j03371J17278J43865o0139l3801j39758
5754C419O2991P0293j12842j7897K36674R1495j53039r8015j96741o3747J38165
5743c9244Q8778k2020q5287N2548n1552P4532J03219o6109j74243J1336l5958
$$ plain form
5820 86533 -113705 -216643 -197152 -50301 -98143 -161166 -238337 -258166 -228324 -107097 -45016
5809 -45016 -45050 -207935 -418340 -362927 -231487 18472 58999 -19258 -108240 -71296 -40606 -112374
5797 -112374 -58206 -21238 5595 -20547 149170 92159 40333 -6881 -22681 -96038 -255143
5786 -255143 -317853 -208893 -206365 -192619 -269854 -248485 -185038 -330421 -382502 -182613 15039
5775 15039 158275 21042 -232831 -161951 -353 44876 189377 32810 -128759 -238863
5765 -238863 -175945 -85267 -28760 -24209 79345 -24026 93252 237117 176978 143177 3419
5754 3419 66410 136703 23861 5964 242638 334133 181094 83079 -113662 -177409 -39244
5743 -39244 49534 27514 -57773 -5225 -56777 17755 120974 54865 -119378 -108042 -144000
5732a44000L7501J20045k7916n5308l6151N4235k2996j36537P3251r0939j8732
5721b47547M8865P1813o8289J24168q729j55244J10903J86475J11260p2311j3894
5710H7470q5983j25597P73R5378J11907K9244k7865j7064n4457k6952j0590P5985
5698E2249o1922Q0011p4089j0240P1391j3547O2409j56576o5134m7496k6095J63587
5686b5452J48296q9261r8815j1246L085r4475j65971J64430J76269N9620J9675
5675H6155p2894j6234j54259O397J27675P0335l4740O600o473J24588o3832n589
5663F7729J25240q9907p0386J349J37272n0420j15563q7079l8179o979p0020L16
5651a96627J3052J64897n8425L2863P4282l9056k09318k9038p5228j04121j1375
$$ plain form
5732 -144000 -106499 13546 -14370 -69678 -105829 -51594 -74590 -211127 -137876 -228815 -247547
5721 -247547 -198682 -126869 -195158 -70990 -79719 -234963 -124060 62415 173675 101364 87470
5710 87470 1487 -124110 -123337 -27959 83948 113192 85327 68263 13806 -13146 -23736 52249
5698 52249 -9673 70338 -3751 -13991 57400 43853 106262 -50314 -115448 -162944 -189039 -25452
5686 -25452 122844 33583 -65232 -76478 -73393 -167868 -333839 -169409 6860 66480 86155
5675 86155 13261 -2973 -157232 -150835 -23160 47175 12435 19035 12562 137150 73318 67729
5663 67729 192969 103062 32676 34025 171297 120877 5314 -81765 -119944 -126923 -196943 -196627
5651 -196627 -183575 -18678 -77103 -44240 30042 -9014 -218332 -247370 -322598 -426719 -438094
5640d38094P1231Q1681J69875Q9137J6462J03949N6382j49432m8149J10356J86542
5629B49940q1618j0567j01306j09395M575J53434m9897n1818L3122j2699l6458
5618a2687q5364l2382J2983Q961J92124O0105L0662m3842n6616j33291J24089
5607F4742l20p5753L7032J42326j52741r2261m9511k0787J48512L1799j69840
5596a36802O8727K9282L764r288M7627j777k8698k9606J2563j08585Q6593Q2568
5584A6368j364r0086Q2266m3329j0873n0508o2580J07820O8988K6378M5853p2514
5572A6419R423R3124L2868O7798j56400j48423L9293Q1612J01580j11147l17822
5561b91675j46397O4569L41395K09580J1432j36654M6407j15629k2875j45320
$$ plain form
5640 -438094 -366863 -285182 -115307 -26170 -9708 94241 150623 1191 -46958 63398 249940
5629 249940 168322 157755 56449 -52946 -48371 105063 55166 3348 36470 23771 -12687
5618 -12687 -98051 -130433 -117450 -108489 83635 143740 174402 130560 73944 -59347 64742
5607 64742 64422 -11331 25701 168027 15286 -76975 -126486 -147273 1239 33038 -136802
5596 -136802 -68075 -38793 -35029 -44317 3310 1533 -27165 -56771 -44208 -152793 -66200 16368
5584 16368 15004 -75082 7184 -36145 -47018 -97526 -160106 -52286 16702 43080 88933 16419
5572 16419 25842 118966 151834 219632 63232 -85191 -45898 35714 137294 26147 -291675
5561 -291675 -438072 -373503 -32108 177472 188904 52250 98657 -16972 -39847 -185167
5551a85167J8158M7166r3920M0036J26533M8529j00620j32210L6591K11680K42836
5540B59612N3019j90326L2970q1318j72810j73K7958O6723M125j24841R5874L6137
5528F950j00429n658n2286J0775N3928l2976j0671P5027J15119j20151j27286
5517a87658m7425P1097k5322l8384k6586M6921Q6586J63758M8558j28555j35521
5506a72531l323m5810l9412q514J15597P4512J21554k2357Q1214J68206j02121
5495A67015j44025j70276n0690M5144q152r9399J10741N1972J4811q7041P115
5484a62785K01393j00267n0486J41201P2625L7359l3972J9530J5621n7305q7670
5473d756j35466m8526J95437N8895j13439q8140P5595M6752M4399l9193j94277
$$ plain form
5551 -185167 -167009 -119843 -213763 -173727 -47194 1335 -99285 -231495 -194904 16776 259612
5540 259612 312631 122305 155275 73957 -98853 -99026 -71068 -4345 -220 -125061 -29187 6950
5528 6950 -93479 -99137 -151423 -140648 -86720 -119696 -130367 -55340 59779 -60372 -187658
5517 -187658 -235083 -163986 -189308 -227692 -254278 -207357 -120771 42987 91545 -37010 -172531
5506 -172531 -175854 -221664 -261076 -269590 -153993 -79481 42073 19716 100930 269136 167015
5495 167015 22990 -147286 -197976 -152832 -160984 -260383 -149642 -97670 -82859 -169900 -162785
5484 -162785 38608 -61659 -112145 29056 101681 139040 105068 124598 140219 82914 -4756
5473 -4756 -140222 -188748 6689 65584 -47855 -135995 -60400 -13648 30751 -8442 -202719
5462b02719k5917K5991n9714O4837O9424m520L7626J54199l0869q5066k2541M8824
5450c0445P9133Q7594J031O3637O1501j07767j06272l7705n0732l4915K9197R3200
5438D7457j65327n5410P7013j02380K0930p425N5970K74728Q1273j72957k06176
5427a52304P213L3811K2835l2517r8310Q2208O6952q3001l9424j0889L331Q8779
5415a11316J26528l3853m5063j21102j35701O4215J49572J06331J22410L8653
5405A60674K8688o8143N7106j3206l9568j2543M1157j37805p3585R6118l204L0108
5393F5797j00235j12523j26033j78897O9779J12900L5505J16316K10362o9706
5383B3265n4783j28509j23541j1337J8587J05478R4531Q7311k70k1921M718r0675
$$ plain form
5462 -202719 -228636 -202645 -262359 -197522 -128098 -132618 -94992 59207 28338 -56728 -79269 -30445
5450 -30445 48688 136282 137313 200950 262451 154684 48412 10707 -40025 -74940 -45743 47457
5438 47457 -117870 -173280 -96267 -198647 -177717 -185142 -129172 145556 226829 53872 -152304
5427 -152304 -145091 -111280 -88445 -120962 -219272 -137064 -70112 -153113 -192537 -203426 -200095 -111316
5415 -111316 15212 -18641 -63704 -184806 -320507 -256292 -106720 -389 122021 160674
5405 160674 189362 121219 178325 165119 125551 113008 154165 16360 -57225 38893 35689 65797
5393 65797 -34438 -146961 -272994 -451891 -382112 -269212 -233707 -117391 92971 23265
5383 23265 -31518 -160027 -283568 -294905 -276318 -170840 -76309 11002 10732 -11189 -6471 -97146
5371i7146k4572K5559K47223O7002j37227o3984j49453r2923M495K1870M1788
5360a57368K38692k7920r5872r1808M3458p3476J50882J58787M7292p9501M715
5349A17881N2937o2740o3667j3015k8325l3577l6613q4381r9345R0226Q5068O4217
5337a1334j14288o7676R244L0054J10393m8648N7966N4041k37954L4686K8022
5326a55494J6700N204O5623l8199j10184M8657j155m6941l6074M3441J99442O3961
5314E4981k9798n2631J57542j91652l0660J59743r3644k88218L4951P3905J10847
5303i4634N8353N0112J4697j16749j32884L3064J49138N7621n1926N930n804j53420
5291a86502N5503R0754k1606R6753Q6863P0713k7987j37852k08600m211K03489
$$ plain form
5371 -97146 -121718 -96159 151064 218066 80839 16855 -132598 -225521 -221026 -199156 -157368
5360 -157368 81324 53404 -42468 -134276 -90818 -164294 -13412 145375 192667 113166 117881
5349 117881 170818 108078 44411 31396 3071 -30506 -67119 -151500 -250845 -160619 -75551 -11334
5337 -11334 -125622 -193298 -184054 -154000 -43607 -92255 -34289 19752 -218202 -183516 -155494
5326 -155494 -138794 -133590 -67967 -106166 -216350 -167693 -168848 -215789 -251863 -208422 -8980 54981
5314 54981 25183 -27448 130094 -61558 -92218 67525 -26119 -314337 -279386 -205481 -94634
5303 -94634 -36281 13831 28528 -88221 -221105 -188041 -38903 18718 -33208 -27278 -33082 -186502
5291 -186502 -130999 -40245 -61851 34902 121765 192478 164491 26639 -181961 -186172 17317
5280A7317J8359p4730L8820O9284m0538j7215q9053j50161J01778Q2559Q8396
5269D4816m8817N6258R423m0144J65239L5186K061k18164K6150J18039J244j42007
5257I284k2322j265J25550r7774l14518j32737J7660N4130j1985M5823J08341
5246b19813Q8010J17878N1902J10834J01289o7023l3893p024L0341j2947j49616
5235I938k26332O4915J07702J8714n8178K3141J26315J93401O9093M151l8585
$$ plain form
5280 17317 35676 -39054 -234 69050 28512 11297 -77756 -227917 -126139 -43580 44816
5269 44816 -4001 52257 61680 21536 186775 221961 224022 5858 32008 150047 151291 9284
5257 9284 -13038 -14303 111247 13473 -301045 -433782 -416122 -361992 -373977 -328154 -219813
5246 -219813 -131803 -13925 37977 148811 250100 183077 149184 142160 172501 159554 9938
5235 9938 -216394 -151479 -43777 -25063 -83241 -60100 66215 259616 328709 332860 294275
$$ [...]
##END NTUPLES=NMR SPECTRUM
##END=
