##TITLE=Analysis number 325153
Compound Code spb 05830
Project Code adrs
Chemist Name 2y chem
##JCAMPDX= 6.0         $$ Bruker NMR JCAMP-DX V2.0
##DATA TYPE= NMR SPECTRUM
##DATA CLASS= NTUPLES
##ORIGIN= Bruker BioSpin GmbH
##OWNER= nmr
$$ XWIN-NMR		Version 3.5
$$ Tue Dec 12 14:36:42 2006 GMT Standard Time (UT+0h)  MAYBRIDGE\nmr@NMR_250MHZ
##.OBSERVE FREQUENCY= 250.131544655141
##.OBSERVE NUCLEUS= ^1H
##.ACQUISITION MODE= SIMULTANEOUS (DQD)
##.ACQUISITION SCHEME= undefined
##.AVERAGES= 16
##.DIGITISER RES= 18
##SPECTROMETER/DATA SYSTEM= dpx250
##.PULSE SEQUENCE= zg30
##.SOLVENT NAME= CDCl3
##.SHIFT REFERENCE= (INTERNAL, CDCl3, 0, 16.5313)
##AUDIT TRAIL= $$ (NUMBER, WHEN, WHO, WHERE, WHAT)
$$ ##TITLE= Audit trail, XWIN-NMR		Version 3.5
$$ ##JCAMPDX= 5.01
$$ ##ORIGIN= Bruker BioSpin GmbH
$$ ##OWNER= nmr
$$ C:\u/data/dgb/nmr/ADRS/800/pdata/1/auditp.txt
$$ ##AUDIT TRAIL=  $$ (NUMBER, WHEN, WHO, WHERE, WHAT)
(   1,<2006-12-12 14:36:18.35 +000>,<MAYBRIDGE\nmr>,<NMR_250MHZ>,
      <created by zg, POWCHK disabled, PULCHK disabled
       configuration hash MD5:
       49 4B E0 1D 92 C2 6B 37 9F E6 65 BC 52 41 86 1D
       data hash MD5: 64K
       3F 5C 61 E8 DC AC 7C 27 0F 10 24 95 1A E4 73 46>)
(   2,<2006-12-12 14:36:33.27 +000>,<MAYBRIDGE\nmr>,<NMR_250MHZ>,
      <Start of raw data processing
       ef LB = 0.3 FT_mod = 6 PKNL = 1 SI = 32K 
       data hash MD5: 32K
       81 72 ED 36 A0 F3 AE 9B 58 66 36 BB 51 CA D9 A9>)
(   3,<2006-12-12 14:36:34.92 +000>,<MAYBRIDGE\nmr>,<NMR_250MHZ>,
      <apk 
       data hash MD5: 32K
       27 A7 32 B4 0D 3F 86 80 A2 58 85 33 76 37 B6 39>)
(   4,<2006-12-12 14:36:35.63 +000>,<MAYBRIDGE\nmr>,<NMR_250MHZ>,
      <abs ABSG = 5 
       data hash MD5: 32K
       42 F0 7E 2C C5 01 6F 2C B0 03 94 46 40 2E 4A B2>)
$$ ##END=
$$ 
$$ hash MD5
$$ 6F 14 BA EF 5D C8 77 14 60 1A E3 FC E7 14 B5 89
##$RELAX= 
##$RELAX= 
##$RELAX= 
##$RELAX= 
##$RELAX= 
##$RELAX= 
##$RELAX= 
$$ Bruker specific parameters
$$ --------------------------
##$DU= <C:\u>
##$EXPNO= 800
##$NAME= <ADRS>
##$PROCNO= 1
##$TYPE= <nmr>
##$USER= <dgb>
##$AMP= (0..31)
100 100 100 100 100 100 100 100 100 100 100 100 100 100 100 100 100 100 
100 100 100 100 100 100 100 100 100 100 100 100 100 100 
##$AQSEQ= 0
##$AQ_mod= 3
##$AUNM= <au_zg>
##$AUTOPOS= <54 >
##$BF1= 250.13
##$BF2= 250.13
##$BF3= 250.13
##$BF4= 250.13
##$BF5= 500.13
##$BF6= 500.13
##$BF7= 500.13
##$BF8= 500.13
##$BYTORDA= 1
##$CFDGTYP= 0
##$CFRGTYP= 5
##$CHEMSTR= <none>
##$CNST= (0..31)
1 1 145 1 1 1 1 1 1 1 1 1 1 1 1 1 1 1 1 1 1 1 1 1 1 1 1 1 1 1 1 1 
##$CPDPRG= <>
##$CPDPRG1= <>
##$CPDPRG2= <>
##$CPDPRG3= <>
##$CPDPRG4= <mlev>
##$CPDPRG5= <mlev>
##$CPDPRG6= <mlev>
##$CPDPRG7= <mlev>
##$CPDPRG8= <mlev>
##$CPDPRGB= <>
##$CPDPRGT= <>
##$D= (0..31)
0 1 0 0 0 0 0 0 0 0.06 0 0 0 0 0 0 0.0002 0 0 0 0 0 0 0 0 0 0 0 0 0 0 
0 
##$DATE= 1165934177
##$DBL= (0..7)
120 120 120 120 120 120 120 120 
##$DBP= (0..7)
150 150 150 150 150 150 150 150 
##$DBP07= 0
##$DBPNAM0= <>
##$DBPNAM1= <>
##$DBPNAM2= <>
$$ [...]
##$SUBNAM7= <"">
##$SUBNAM8= <"">
##$SUBNAM9= <"">
##$SW= 20.6930455092707
##$SWIBOX= (0..15)
0 0 3 0 0 0 0 0 0 0 0 0 0 0 0 0 
##$SW_h= 5175.983436853
##$TD= 65536
##$TD0= 1
##$TE= 295.16
##$TE2= 300
##$TE3= 300
##$TEG= 300
##$TL= (0..7)
0 120 120 120 120 120 120 120 
##$TP= (0..7)
150 150 150 150 150 150 150 150 
##$TP07= 0
##$TPNAME0= <>
##$TPNAME1= <>
##$TPNAME2= <>
##$TPNAME3= <>
##$TPNAME4= <>
##$TPNAME5= <>
##$TPNAME6= <>
##$TPNAME7= <>
##$TPOAL= (0..7)
0.5 0.5 0.5 0.5 0.5 0.5 0.5 0.5 
##$TPOFFS= (0..7)
0 0 0 0 0 0 0 0 
##$TUNHIN= 0
##$TUNHOUT= 0
##$TUNXOUT= 0
##$USERA1= <user>
##$USERA2= <user>
##$USERA3= <user>
##$USERA4= <user>
##$USERA5= <user>
##$V9= 5
##$VALIST= <valist>
##$VCLIST= <CCCCCCCCCCCCCCC>
##$VD= 0
##$VDLIST= <DDDDDDDDDDDDDDD>
##$VPLIST= <PPPPPPPPPPPPPPP>
##$VTLIST= <TTTTTTTTTTTTTTT>
##$WBST= 1024
##$WBSW= 4
##$XGAIN= (0..3)
0 0 0 0 
##$XL= 0
##$YL= 0
##$YMAX_a= 492116
##$YMIN_a= -521349
##$ZGOPTNS= <>
##$ZL1= 120
##$ZL2= 120
##$ZL3= 120
##$ZL4= 120
##$ABSF1= 16.53134
##$ABSF2= -4.161835
##$ABSG= 5
##$ABSL= 3
##$ALPHA= 0
##$AQORDER= 0
##$ASSFAC= 0
##$ASSFACI= 0
##$ASSFACX= 0
##$ASSWID= 0
##$AUNMP= <proc_1d>
##$AZFE= 0.1
##$AZFW= 0.1
##$BCFW= 0
##$BC_mod= 0
##$BYTORDP= 0
##$COROFFS= 0
##$CY= 12.5
##$DATMOD= 1
##$DC= 0
##$DFILT= <>
##$DTYPP= 0
##$F1P= 14.0000005364418
##$F2P= -0.99999901652339
##$FCOR= 0.5
##$FTSIZE= 32768
##$FT_mod= 6
##$GAMMA= 0
##$GB= 0
##$INTBC= 1
##$INTSCL= 1
##$ISEN= 128
##$LB= 0.3
##$LEV0= 0
##$LPBIN= 0
##$MAXI= 10000
##$MC2= 0
##$MEAN= 0
##$ME_mod= 0
##$MI= 0
##$NCOEF= 0
##$NC_proc= -2
##$NLEV= 6
##$NOISF1= 0
##$NOISF2= 0
##$NSP= 0
##$NTH_PI= 0
##$NZP= 0
##$OFFSET= 16.53134
##$PC= 1
##$PHC0= 224.4567
##$PHC1= 7.442222
##$PH_mod= 1
##$PKNL= yes
##$PPARMOD= 0
##$PSCAL= 4
##$PSIGN= 0
##$REVERSE= no
##$SF= 250.129997661823
##$SI= 32768
##$SIGF1= 0
##$SIGF2= 0
##$SINO= 400
##$SIOLD= 32768
##$SREGLST= <1H.CDCl3>
##$SSB= 0
##$STSI= 32768
##$STSR= 0
##$SW_p= 5175.98343685301
##$SYMM= 0
##$S_DEV= 0
##$TDeff= 65536
##$TDoff= 0
##$TI= <Analysis number 999999
Compound Code 99
Book Reference 9
Project Code 9>
##$TILT= no
##$TM1= 0
##$TM2= 0
##$TOPLEV= 0
##$USERP1= <user>
##$USERP2= <user>
##$USERP3= <user>
##$USERP4= <user>
##$USERP5= <user>
##$WDW= 1
##$XDIM= 32768
##$YMAX_p= 351813930
##$YMIN_p= -86591
$$ End of Bruker specific parameters
$$ ---------------------------------
##NTUPLES= NMR SPECTRUM
##VAR_NAME=  FREQUENCY,     SPECTRUM/REAL,   SPECTRUM/IMAG
##SYMBOL=    X,             R,               I
##VAR_TYPE=  INDEPENDENT,   DEPENDENT,       DEPENDENT
##VAR_FORM=  AFFN,          ASDF,            ASDF
##VAR_DIM=   32768,         32768,           32768
##UNITS=     HZ,            ARBITRARY UNITS, ARBITRARY UNITS
##FACTOR=    0.157963299565203, 1,           1
##FIRST=     4134.98394684714, 0,            0
##LAST=      -1040.99949000587, 0,           0
##MIN=       -1040.99949000587, -86591,      0
##MAX=       4134.98394684714, 351813930,    0
$$ Real data points
##PAGE= N=1
##DATA TABLE= (X++(R..R)), XYDATA
$$ [...]
$$ plain form
20721 74732 86734 85475 81512 74296 66577 58829 54071 51927 57577 48830 29579 19459 27166 32011
20707 32011 37014 33914 40998 39922 37302 36979 37898 42605 36995 36067 42116 48726 60331 66759 64907
20692 64907 57974 56661 46198 45474 45379 47167 57775 68035 72854 77853 79351 91072 105880 108673
20678 108673 99895 89828 75823 87431 102748 107882 108960 127453 151825 169252 199617 233782
20666 233782 279132 327759 376512 436663 513211 610255 701725 762596 796065 827436 865869
20655 865869 908362 936152 942752 918849 892887 891550 915087 936621 952546 950948 932867 916725
20643 916725 899947 869369 809918 734405 648923 570057 499779 428950 370226 321108 270499
20632 270499 240961 224304 206883 183007 157535 145961 132661 123518 120062 117397 115652 116774
$$ packed form
20721G4732J2002j259l963p216p719p748m758k144N650q747j9251j0120P707M845
20707C2011N003l100P084j076k620l23R19M707n610r28O049O610J1605O428j852
20692F4907o933j313j0463p24r5J788J0608J0260M819M999J498J1721J4808K793
20678A08673q778j0067j4005J1608J5317N134J078J8493K4372J7427L0365L4165
20666B33782M5350M8627M8753O0151P6548R7044R1470O0871L3469L1371L8433
20655H65869M2493K7790O600k3903k5962j337K3537K1534J5925j598j8081j6142
20643I16725j6778l0578n9451p5513q5482p8866p0278p0829n8724m9118n0609
20632B70499k9538j6657j7421k3876k5472j1574j3300r143l456k665j745J122
$$ plain form
20620 116774 117541 111827 103135 99069 108439 105632 92099 93681 99061 106930 107138 105613 107105 111006
20606 111006 108010 112665 112720 119927 114921 109771 109330 106394 114159 133181 136172 130638 134411 134917 146357
20591 146357 155913 161389 167246 160598 162143 168594 163029 155169 149428 148425 153714 156511 166658 160120
20577 160120 149843 145100 135766 139181 146529 150806 155273 160182 170987 161672 147134 147680 148225 159756
20563 159756 166286 168865 173419 184238 182641 178549 184577 184458 192895 198820 195386 195539 200575 206720
20549 206720 207091 211114 227223 235452 236796 236032 244722 253822 272729 287682 285309 295751 306977
20536 306977 327967 339925 350930 368573 396233 418688 431033 455242 491271 534698 582792
20525 582792 629481 689495 751867 814055 885897 953855 1007182 1068729 1124672 1185427 1245317
$$ packed form
20620A16774P67n714q692m066R370k807j3533J582N380P869K08j525J492L901
20606A11006k996M655N5P207n006n150m41k936P765J9022K991n534L773N06J1440
20591A46357R556N476N857o648J545O451n565p860n741j003N289K797J0147o538
20577A60120j0277m743r334L415P348M277M467M909J0805r315j4538N46N45J1531
20563A59756O530K579M554J0819j597m092O028j19Q437N925l434J53N036O145
20549B06720L71M023J6109Q229J344p64Q690R100J8907J4953k373J0442J1226
20536C06977K0990J1958J1005J7643K7660K2455J2345K4209L6029M3427M8094
20525E82792M6689O0014O2372O2188P1842O7958N3327O1547N5943O0755N9890
$$ plain form
20514 1245317 1308291 1371271 1433882 1510747 1603992 1711878 1826696 1958411 2097203 2242465
20504 2242465 2397489 2564317 2743265 2952945 3189880 3460399 3809259 4251549 4825333
20495 4825333 5598819 6688824 8279191 10578966 13702542 17430394 21335798 25275071
20487 25275071 29657737 35062607 41343887 47291984 51547437 54051910 55877471 58228223
20479 58228223 61194732 63628898 64517345 63805399 62530821 62137314 63282031 65331145
20471 65331145 66718851 66314588 64509037 62541655 61281980 60213041 57932640 53805681
20463 53805681 48303927 42552579 37330470 32674248 28269640 23973926 19987406 16607616
20455 16607616 13959340 11963341 10454019 9275069 8335054 7578152 6970380 6461265 6022600
$$ packed form
20514A245317O2974O2980O2611P6865R3245J07886J14818J31715J38792J45262
20504B242465J55024J66828J78948K09680K36935K70519L48860M42290N73784
20495D825333P73486J090005J590367K299775L123576L727852L905404L939273
20487B5275071M382666N404870O281280N948097M255453K504473J825561K350752
20479E8228223K966509K434166Q88447p11946j274578l93507J144717K049114
20471F5331145J387706m04263j805551j967382j259675j068939k280401m126959
20463E3805681n501754n751348n222109m656222m404608m295714l986520l379790
20455A6607616k648276j995999j509322j178950r40015p56902o07772n09115m38665
$$ plain form
20446 6022600 5619697 5247202 4906249 4605881 4343616 4085450 3829707 3595014 3382972
20437 3382972 3185771 3008423 2851158 2720224 2586952 2448989 2316890 2207103 2122351 2024280
20427 2024280 1924389 1820468 1708380 1611293 1512953 1430204 1359292 1293093 1227811 1157936 1109000
20416 1109000 1071369 1037064 996466 952672 911746 876880 840398 809393 784161 767665 740532
20405 740532 708489 683171 656979 636979 621194 600666 577895 555960 545313 534157 523016
20394 523016 509617 496172 480949 467537 454983 438775 427071 415649 400062 392038 376342 362232
20382 362232 346294 336182 327343 316985 313934 313451 311214 313103 312877 299987 287104 281204 264136
20369 264136 251140 244710 242997 240272 232118 218586 213052 211634 204051 198259 201604 213569 221723
$$ packed form
20446F022600m02903l72495l40953l00368k62265k58166k55743k34693k12042
20437C382972j97201j77348j57265j30934j33272j37963j32099j09787q4752r8071
20427B024280r9891j03921j12088r7087r8340q2749p0912o6199o5282o9875m8936
20416A109000l7631l4305m0598m3794m0926l4866l6482l1005k5232j6496k7133
20405G40532l2043k5318k6192k0000j5785k0528k2771k1935j0647j1156j1141
20394E23016j3399j3445j5223j3412j2554j6208j1704j1422j5587q024j5696j4110
20382C62232j5938j0112q839j0358l051m83k237J889k26j2890j2883n900j7068
20369B64136j2996o430j713k725q154j3532n534j418p583n792L345J1965Q154
$$ plain form
20356 221723 222899 205088 193803 188210 187457 199568 197812 193688 188138 191228 181335 164678 166976
20343 166976 171582 180817 176220 167976 162239 154416 152148 156729 147470 133124 128405 134049 130160 127960
20329 127960 129279 129903 120093 118281 123326 133217 137359 129903 118267 116022 105749 100576 101516 108980
20315 108980 105858 100365 97301 101079 106871 106189 103552 103603 103069 98531 99711 100516 101938 106380 96234
20300 96234 80604 76627 75936 72176 67782 68053 72141 80456 84535 74761 63593 68495 73964 64552
20286 64552 68729 69375 69990 62314 55946 56924 59383 59727 57406 49700 39944 38830 34537 29080 23015
20271 23015 19584 20761 24403 26393 30144 37264 40741 31375 23752 21852 22513 15494 14288 14724 21371
20256 21371 16033 11154 15101 22961 27102 21176 19945 27887 35727 25360 23992 25945 28173 28710
$$ packed form
20356B21723J176j7811j1285n593p53J2111j756m124n550L090r893j6657K298
20343A66976M606R235m597q244n737p823k268M581r259j4346m719N644l889k200
20329A27960J319O24r810j812N045R891M142p456j1636k245j0273n173R40P464
20315A08980l122n493l064L778N792o82k637N1n34m538J180Q05J422M442j0146
20300I6234j5630l977o91l760m394K71M088Q315M079r774j1168M902N469r412
20286F4552M177O46O15p676o368R78K459L44k321p706r756j114m293n457o065
20271B3015l431J177L642J990L751P120L477r366p623j900O61p019j206M36O647
20256B1371n338m879L947P860M141n926j231P942P840j0367j368J953K228N37
$$ plain form
20242 28710 25089 27266 30155 31629 32332 35293 32324 35108 35364 36049 39327 37996 32504 29253 42053
20227 42053 53187 39791 25829 24642 32936 34750 31875 24612 22616 30918 32697 35081 30511 30521
20213 30521 35858 28511 25711 25974 33509 38562 36423 35506 33033 28069 23579 24452 32784 25828 26248
20198 26248 19612 24502 32519 27742 24184 29713 26134 28402 33118 34534 29057 30779 35121 29249
20184 29249 22376 24255 30784 37586 23123 25921 33819 33257 27251 21179 18684 18776 18029 25607 38216
20169 38216 40348 37669 40052 39977 32482 28421 24418 19844 11783 8823 8800 17668 27178 30001 32542
20154 32542 31548 27612 23678 10100 9918 18740 14055 13724 18985 19558 19502 5261 -552 2353 11981
20139 11981 11333 7220 11693 7178 -2596 -5627 -1968 4624 13125 15706 19735 27633 22268 14034 13954
$$ packed form
20242B8710l621K177K889J474P03K961k969K784K56O85L278j331n492l251J2800
20227D2053J1134j3396j3962j187Q294J814k875p263j996Q302J779K384m570J0
20213C0521N337p347k800K63P535N053k139r17k473m964m490Q73Q332o956M20
20198B6248o636M890Q017m777l558N529l579K268M716J416n477J722M342n872
20184B9249o873J879O529O802j4463K798P898n62o006o072k495R2p47P578J2609
20169C8216K132k679K383p5p495m061m003m574q061k960k3Q868R510K823K541
20154C2542r94l936l934j3578j82Q822m685l31N261N73n6j4241n813K905R628
20139A1981o48m113M473m515r774l031L659O592Q501K581M029P898n365q234q0
$$ plain form
20124 13954 4203 7799 8514 14785 18476 20344 24231 27522 26859 25245 20238 21500 29049 24395 21581
20109 21581 24938 24312 26008 20082 11632 7508 1687 3421 9401 10264 9779 13144 15680 18840 12028
20094 12028 6040 -2611 4396 1808 -664 -4150 -4760 -502 3354 1772 4810 1024 11848 20099
20080 20099 15381 3392 -1962 2572 1975 10506 4540 1876 534 1733 -670 550 1225 4214 586
20065 586 5232 5152 7783 8870 1396 7308 9019 3395 -3822 -3550 4657 12330 13862 1564 -4018
20050 -4018 -2211 3247 7931 3760 -2045 -4992 -11399 -18497 -17061 -10921 -6022 2654 -2990 -9268 -6994
20035 -6994 -308 -1848 -4857 -1431 7595 5565 6126 17927 15937 12032 22398 24553 15087 4841
20021 4841 -1535 -1639 7019 3107 2953 1559 5153 6776 4070 -2698 -8666 -4614 610 7492 -480
$$ packed form
20124A3954r751L596P15O271L691J868L887L291o63j614n007J262P549m654k814
20109B1581L357o26J696n926q450m124n821J734N980Q63m85L365K536L160o812
20094A2028n988q651P007k588k472l486o10M258L856j582L038l786J0824Q251
20080B0099m718j1989n354M534n97Q531n966k664j342J199k403J220O75K989l628
20065E86M646q0K631J087p474N912J711n624p217K72Q207P673J532j2298n582
20050d018J807N458M684m171n805k947o407p098J436O140M899Q676n644o278K274
20035f994O686j540l009L426R026k030N61J1801j990l905J0366K155r466j0246
20021D841o376j04Q658l912j54j394L594J623k706o768n968M052N224O882p972
$$ plain form
20006 -480 -11023 -11434 -11071 -2007 -538 -7758 -12701 -8532 -7725 -928 17251 16114 16151 19818 15719 4925
19990 4925 6804 18007 26064 25741 26639 32725 44805 50825 53739 54794 47801 41983 36896 50048
19976 50048 66121 79659 85137 68803 57608 61227 67782 85575 91229 91680 90595 96461 112152
19963 112152 119845 120363 125597 140590 156788 165554 154471 142086 149359 168948 185018 189567 187697
19950 187697 169271 150158 141832 159217 187491 195577 198384 190700 172261 155120 148195 151235 150510
19937 150510 148384 135869 121599 103034 86573 69927 62064 57759 46107 37842 33795 32256 20086
19924 20086 16064 19583 20082 17935 13360 11956 17331 22645 25243 24630 35013 23302 11280 16826
19910 16826 24888 22693 23705 26315 25827 32233 36116 35228 33872 42577 50782 65562 89984 108426
$$ packed form
20006d80j0543m11L63R064J469p220m943M169Q07O797J8179j137L7L667m099j0794
19990D925J879J1203Q057l23Q98O086J2080O020K914J055o993n818n087J3152
19976E0048J6073J3538N478j6334j1195L619O555J7793N654M51j085N866J5691
19963A12152P693N18N234J4993J6198Q766j1083j2385P273J9589J6070M549j870
19950A87697j8426j9113q326J7385K8274Q086K807p684j8439j7141o925L040p25
19937A50510k126j2515j4270j8565j6461j6646p863m305j1652q265m047j539j2170
19924B0086m022L519M99k147m575j404N375N314K598o13J0383j1711j2022N546
19910A6826Q062k195J012K610m88O406L883q88j356Q705Q205J4780K4422J8442
$$ plain form
19896 108426 117269 134366 163090 207453 241290 252774 275573 304597 321398 334073 346790 363218
19884 363218 369212 361087 352592 354750 360838 367860 368180 362828 354444 349638 343840 339747 331159 309215
19870 309215 276356 250679 220960 184629 149264 135877 116264 98583 79790 62685 62501 59443
19858 59443 50139 41633 33764 34755 32409 29124 22238 14954 16425 14422 16654 15829 22334 30599 21922
19843 21922 17788 17715 16009 13122 22844 31164 31359 25818 24372 26345 28941 31376 17494 11453 19588
19828 19588 19402 12598 13281 17279 24487 21841 22846 18530 15516 25287 23296 16489 14338 18532 18176
19813 18176 7739 8087 6320 12298 12150 -218 -6372 3174 6382 -528 -2131 7766 10584 12940
19799 12940 8045 8326 16549 17245 12626 15001 17313 23381 25540 30717 36511 46434 55223 56338 67886
$$ packed form
19896A08426Q843J7097K8724M4363L3837J1484K2799K9024J6801J2675J2717J6428
19884C63218N994q125q495K158O088P022L20n352q384m806n798m093q588k1944
19870C09215l2859k5677k9719l6331l5365j3387j9613j7681j8793j7105j84l058
19858E9443r304q506p869R91k346l285o886p284J471k003K232q25O505Q265q677
19843B1922m134p3j706k887R722Q320J95n541j446J973K596K435j3882o041Q135
19828A9588j86o804O83L998P208k646J005m316l014R771j991o807k151M194l56
19813A8176j0437L48j767N978j48j2368o154R546L208o910j603R897K818K356
19799A2940m895K81Q223O96m619K375K312O068K159N177N794R923Q789J115J1548
$$ plain form
19784 67886 92003 117410 144000 173377 211666 253986 286627 320051 354541 384333 402294 408848
19772 408848 409433 410483 391964 372880 369605 376243 381628 403111 407013 413840 420092 413361 400780
19759 400780 374551 341291 294174 250829 207959 176539 158841 130985 102923 78754 59821
19748 59821 49305 47111 51805 52046 42727 39678 36246 28052 32256 30638 28408 23687 19506 25862
19734 25862 23216 22747 16622 15019 19551 20449 23817 28013 19614 7055 10961 14128 15830 12607 15898
19719 15898 17092 15440 16381 12647 1527 15876 24573 30840 28397 15373 8282 6702 2524 4277
19705 4277 416 1251 9264 13745 7326 14 1269 6924 10146 12812 11999 -3555 -2775 4234 6200
19690 6200 6630 1175 -5731 1897 3882 8651 7461 10633 20309 31181 24527 20263 9385 2760
$$ packed form
19784F7886K4117K5407K6590K9377L8289M2320L2641L3424L4490K9792J7961O554
19772D08848N85J050j8519j9084l275O638N385K1483L902O827O252o731j2581
19759D00780k6229l3260m7117m3345m2870l1420j7698k7856k8062k4169j8933
19748E9821j0516k194M694K41r319l049l432q194M204j618k230m721m181O356
19734B5862k646m69o125j603M532Q98L368M196q399j2559L906L167J702l223L291
19719A5898J194j652R41l734j1120J4349Q697O267k443j3024p091j580m178J753
19705D277l861Q35Q013M481o419p312J255N655L222K666q13j5554P80P009J966
19690F200M30n455o906P628J985M769j190L172R676J0872o654m264j0878o625
$$ plain form
19676 2760 1749 6816 14749 18971 24828 22504 13399 13802 15826 14116 7675 11357 10023 -4938 -4206
19661 -4206 4575 12423 11349 10978 18315 13950 10803 15379 16800 10303 13424 22800 22337 15657 10709
19646 10709 10603 11139 14318 15708 13899 18846 19307 15236 20898 26753 32597 32996 29527 14736 9628
19631 9628 15737 26192 27763 22095 22561 30388 32709 23991 21095 14123 4838 -10027 -7209 436
19617 436 -119 -1350 5092 5712 9983 9037 8324 814 -4688 -12071 -8666 -7102 -12315 -4123 6524 8279
19601 8279 7514 -1058 -242 -1137 -9495 -10511 -8183 -10940 -13335 -2336 5765 3578 -2693 4976 750
19586 750 765 -142 3265 8318 8567 10533 4763 6114 11061 13848 3708 2185 5699 4014 8613 10096
19570 10096 -4710 -10317 1102 10776 12033 13693 15974 13410 4053 2863 2545 536 -674 6166
$$ packed form
19676B760j011N067P933M222N857k324r105M03K024j710o441L682j334j4961P32
19661d206Q781P848j074l71P337m365l147M576J421o497L121R376m63o680m948
19646A0709j06N36L179J390j809M947M61m071N662N855N844L99l469j4791n108
19631I628O109J0455J571n668M66P827K321q718k896o972r285j4865K818P645
19617D36n55j231O442O20M271r46p13p510n502p383L405J564n213Q192J0647J755
19601H279p65q572Q16q95q358j016K328k757k395J0999Q101k187o271P669m226
19586G50J5r07L407N053K49J966n770J351M947K787j0140j523L514j685M599J483
19570A0096j4806n607J1419R674J257J660K281k564r357j190l18k009j210O840
$$ plain form
19556 6166 15254 10491 -7828 -8230 707 -3296 -7701 -10956 -13570 -13039 -16160 -14649 -9993 -8127 -14589
19541 -14589 -14190 -4807 -13540 -9862 -4965 -10068 -4042 12031 11826 4904 -2770 -4284 -3503 4362 576
19526 576 -3217 -2702 -1553 -3907 -5198 -8276 4209 4295 212 1048 -616 -6611 -6422 -1385 -4408 -7209
19510 -7209 -5791 3495 12396 20070 14438 7546 3660 6332 9227 12111 23551 21860 18045 23483
19496 23483 36086 40581 56257 69898 69018 72067 79457 75611 82156 79274 75158 80457 82153 89364
19482 89364 87145 83655 78952 73776 77196 74177 74483 76739 71502 65884 53120 50374 58085 49084
19468 49084 37666 38501 36073 24914 22965 22662 27405 24247 21775 19174 19558 23342 33271 41124 40635
19453 40635 32860 33836 26495 31103 39301 47013 43325 35524 39139 39186 36473 42384 39765 40493 37235
$$ packed form
19556F166R088m763j8319m02Q937m003m405l255k614N31l121J511M656J866o462
19541a4589L99R383q733L678M897n103O026J6073k05o922p674j514P81P865l786
19526E76l793N15J149k354j291l078J2485Q6m083Q36j664n995J89N037l023k801
19510g209J418R286Q901P674n632o892l886K672K895K884J1440j691l815N438
19496B3483J2603M495J5676J3641q80L049P390l846O545k882m116N299J696P211
19482H9364k219l490m703n176L420l019L06K256n237n618j2764k746P711r001
19468D9084j1418Q35k428j1159j949l03M743l158k472k601L84L784R929P853m89
19453D0635p775R76p341M608Q198P712l688p801L615M7k713N911k619P28l258
$$ plain form
19438 37235 35883 34123 44093 46782 50382 53451 59307 57914 46533 32701 38801 46650 48119 44796
19424 44796 40781 41953 43094 40621 31919 30539 38265 39321 34330 33379 30112 27886 27231 34295 40948
19409 40948 42519 30925 35134 36572 30130 19048 9540 10365 15295 26079 31787 32845 34496 37134
19395 37134 40860 43195 48115 40532 37791 44225 43718 35986 30545 34352 41405 38702 31872 35886 30440
19380 30440 23548 22103 36106 41333 38586 33147 29931 45274 37028 32939 37482 38391 34826 34708
19366 34708 42313 58168 67108 61222 61853 67610 65328 67521 73936 67755 57711 66732 68603 78563
19352 78563 85877 89964 92492 100883 109103 111444 104939 106264 106745 111437 114311 112914 103747 98745 92755
19337 92755 87908 83233 81070 76588 75637 76597 81235 88800 100235 102721 108802 118299 114986 110102 108734
$$ packed form
19438C7235j352j760R970K689L600L069N856j393j1381j3832O100P849J469l323
19424D4796m015J172J141k473q702j380P726J056m991r51l267k226o55P064O653
19409D0948J571j1594M209J438o442j1082r508Q25M930J0784N708J058J651K638
19395C7134L726K335M920p583k741O434n07p732n441L807P053k703o830M014n446
19380C0440o892j445J4003N227k747n439l216J5343q246m089M543R09l565j18
19366C4708P605J5855Q940n886O31N757k282K193O415o181j0044R021J871R960
19352G8563P314M087K528Q391Q220K341o505J325M81M692K874j397r167n002n990
19337I2755m847m675k163m482r51R60M638P565J1435K486O081R497l313m884j368
$$ plain form
19322 108734 111471 116676 118342 124072 124281 123622 138020 154249 153297 162046 169076 182876 201661 232301
19308 232301 273028 327842 396248 466949 549501 661048 808017 931719 994216 1033881 1082417
19297 1082417 1119436 1112261 1088864 1059486 1034586 1023268 1025419 1065899 1135367 1183527 1205140 1214261
19285 1214261 1226730 1218663 1173198 1090547 997301 914501 845265 786194 738563 695747 665276
19274 665276 652676 660123 664337 687484 721288 754064 786893 819155 871923 951182 1054276 1167336
19262 1167336 1303884 1467976 1662597 1890474 2145967 2424489 2723499 3048697 3409671
19253 3409671 3841073 4370410 5077847 6119836 7724633 10223674 13779106 18414373 23986618
19244 23986618 30433383 37920197 45900186 53986595 60289722 65128792 68071242 69724445
$$ packed form
19322A08734K737N205J666N730K09o59J4398J6229r52Q749P030J3800J8785L0640
19308B32301M0727N4814O8406P0701Q2552J11547J46969J23702O2497L9665M8536
19297A082417L7019p175k3397k9378k4900j1318K151M0480O9468M8160K1613R121
19285A214261J2469q067m5465q2651r3246q2800o9236n9071m7631m2816l0471
19274F65276j2600P447M214K3147L3804L2776L2829L2262N2768P9259J03094J13060
19262A167336J36548J64092J94621K27877K55493K78522K99010L25198L60974
19253C409671M31402N29337P07437J041989J604797K499041L555432M635267N572245
19244B3986618O446765P486814P979989Q086409O303127M839070K942450J653203
$$ plain form
19236 69724445 69855507 68496445 66460313 64028229 62390698 61886362 62964039 65220011
19228 65220011 68175723 70218243 71695161 71761994 70823892 67864107 62988469 56547563
19220 56547563 49042795 41685347 34706973 28497663 23110690 18732601 15387724 12942173
19212 12942173 11195610 9902005 8896664 8069381 7349899 6709055 6126415 5585234 5089867
19203 5089867 4639085 4232263 3873580 3553423 3269885 3027535 2802108 2608439 2443817
19194 2443817 2295410 2164410 2043555 1912948 1799031 1701811 1618233 1544447 1478604 1405268
19184 1405268 1345272 1295712 1247025 1189902 1137989 1097381 1068864 1033305 993160 955617 928647
19173 928647 891076 862393 839278 825813 803203 777414 771325 779332 791259 797746 824944 848825
$$ packed form
19236F9724445J31062j359062k036132k432084j637531n04336J077677K255972
19228F5220011K955712K042520J476918O6833r38102k959785m875638o440906
19220E6547563p504768p357448o978374o209310n386973m378089l344877k445551
19212A2942173j746563j293605j005341q27283p19482o40844n82640n41181m95367
19203E089867m50782m06822l58683l20157k83538k42350k25427j93669j64622
19194B443817j48407j31000j20855j30607j13917r7220q3578p3786o5843p3336
19184A405268n9996m9560m8687n7123n1913m0608k8517l5559m0145l7543k6970
19173I28647l7571k8683k3115j3465k2610k5789o089Q007J1927O487K7198K3881
$$ plain form
19161 848825 848943 828715 813187 789000 754109 714478 667138 636795 614612 601815 581498 578333
19149 578333 589810 608624 607191 607099 597950 570230 539262 515707 481920 453458 425645 403842
19137 403842 375380 354439 345083 334223 328755 323068 317653 309307 299290 289497 287885 277494 261602
19124 261602 253637 247668 246287 239272 228524 218777 213152 208479 203502 205771 207020 201020 194975 201855
19110 201855 210531 206190 191174 175188 168450 168735 164162 160108 162277 162820 163480 161667 157071 161046
19096 161046 162705 167148 164311 165445 165695 155278 146421 139227 133494 131791 131370 125045 113780 113050
19082 113050 108439 113418 124923 125178 113764 106978 97357 91925 109463 120401 119411 117344 102319
19069 102319 91803 99821 101695 108339 107962 103421 103328 100520 101376 98095 98659 99256 92968 87103 86158 77119
$$ packed form
19161H48825J18k0228j5528k4187l4891l9631m7340l0343k2183j2797k0317l165
19149E78333J1477J8814j433r2r149k7720l0968k3555l3787k8462k7813k1803
19137D03842k8462k0941r356j0860n468n687n415q346j0017r793j612j0391j5892
19124B61602p965n969j381p015j0748r747n625m673m977K269J249o000o045O880
19110B01855Q676m341j5016j5986o738K85m573m054K169N43O60j813m596L975
19096A61046J659M443k837J134K50j0417q857p194n733j703m21o325j1265p30
19082A13050m611M979J1505K55j1414o786r621n432J7538J0938r90k067j5025
19069A02319j0516Q018J874O644l77m541r3k808Q56l281N64N97o288n865r45r039
$$ plain form
19053 77119 77204 87114 89729 71414 57588 54159 64126 72031 64136 57660 53238 48422 42649 46783
19039 46783 53855 52206 58466 51359 46569 42766 38555 35682 27505 26661 27288 26543 25818 29030 31836
19024 31836 25117 24228 24541 19486 28282 27280 25772 23213 32295 34380 29707 35266 30293 27877 33756
19009 33756 39778 38231 25653 20503 25648 30434 27134 26497 35404 41473 41416 34358 25157 19515 15865
18994 15865 15290 17715 18650 16086 20107 29339 35519 40506 34033 25850 25943 27647 23496 27734 33050
18979 33050 30850 29927 24436 20197 18678 24327 31647 28497 16880 22130 21591 20945 32693 34423 32607
18964 32607 32834 30841 22420 25578 30724 25481 17249 29482 27073 22744 17276 22379 27214 22210
18950 22210 17322 11645 21858 24418 23517 28992 35680 30617 20967 25182 22650 30980 30750 31663 42627
$$ packed form
19053G7119Q5R910K615j8315j3826l429R967P905p895o476m422m816n773M134
19039D6783P072j649O260p107m790l803m211k873q177q44O27p45p25L212K806
19024C1836o719q89L13n055Q796j002j508k559R082K085m673N559m973k416N879
19009C3756O022j547j2578n150N145M786l300o37Q907O069n7p058r201n642l650
18994A5865n75K425R35k564M021R232O180M987o473q183R3J704m151M238N316
18979C3050k200r23n491m239j519N649P320l150j1617N250n39o46J1748J730j816
18964C2607K27j993q421L158N146n243q232J2233k409m329n468N103M835n004
18950B2210m888n677J0213K560r01N475O688n063r650M215k532Q330k30R13J0964
$$ plain form
18935 42627 37056 30271 28723 19756 24278 32196 37913 43296 40899 39721 30686 22826 23879 23563 32639
18920 32639 39776 37538 33987 33264 35490 38856 35481 33188 41972 42799 35190 28092 35808 37505 27554
18905 27554 15756 17070 21445 18325 16928 14691 14785 17673 11575 13574 21740 26391 24049 25688 18320
18890 18320 10629 5953 5191 20249 26643 32282 27001 19127 17344 19467 27913 22901 18868 18817 19997
18875 19997 19018 13670 12490 12526 18323 25594 23188 26902 33937 33929 30917 22300 23533 29999 34271 35929
18859 35929 37205 25542 25876 31695 35742 21683 14111 17761 18154 22752 32825 27896 21176 13102
18845 13102 13754 12722 12023 10348 14828 17388 7109 4285 8431 14021 13110 7693 8348 3465 1504
18830 1504 -819 -6877 -11490 -9731 -5234 -2405 -6870 -6943 -213 3939 16230 23996 25801 10672 8607
$$ packed form
18935D2627n571o785j548q967M522P918N717N383k397j178r035p860J053l16R076
18920C2639P137k238l551p23K226L366l375k293Q784Q27p609p098P716J697r951
18905B7554j1798J314M375l120j397k237R4K888o098J999Q166M651k342J639p368
18890A8320p691m676p62J5058O394N639n281p874j783K123Q446n012m033n1J180
18875A9997r79n348j180L6N797P271k406L714P035ql012q617J233O466M272J658
18859C5929J276j1663L34N819M047j4059p572L650L93M598J0073m929o720q074
18845A3102O52j032o99j675M480K560j0279k824M146N590r11n417O55m883j961
18830A504k323o058m613J759M497K829m465p3O730M152J2291P766J805j5129k065
$$ plain form
18815 8607 14484 19724 25749 15234 10748 6377 3482 9830 2527 -4649 4407 16389 27077 17167
18801 17167 7839 9001 11175 25854 21436 18227 12096 7911 13996 15794 10604 7669 8360 2461
18787 2461 -3768 -332 6222 6256 15446 22131 20891 20176 29013 35308 36848 30118 32477 24695 21244
18772 21244 16192 19505 33603 47469 74441 84668 81496 70814 43809 31531 21572 23621 30965
18759 30965 21885 16576 25072 19852 13606 16246 19091 16391 14327 14235 19080 18957 14841 7389 -2523
18744 -2523 -3446 -1265 616 8814 5414 7700 13885 15056 6177 6678 7047 18067 20386 19418 14006
18729 14006 19320 25304 20368 21862 23529 16108 10191 14789 15342 14622 9241 9729 11044 11081 16369 21883
18713 21883 28601 35263 30083 32072 35603 35516 32614 40188 64670 89319 118984 143854 176778 228253
$$ packed form
18815H607N877N240O025j0515m486m371k895O348p303p176R056J1982J0688r910
18801A7167r328J162K174J4679m418l209o131m185O085J798n190k935O91n899
18787B461o229L436O554L4R190O685j240p15Q837O295J540o730K359p782l451
18772B1244n052L313J4098J3866K6972J0227l172j0682k7005j2278r959K049P344
18759C0965r080n309Q496n220o246K640K845k700k064r2M845j23m116p452r912
18744b523r23K181J881Q198l400K286O185J171q879N01L69J1020K319r68n412
18729A4006N314N984m936J494J667p421n917M598N53p20n381M88J315L7N288N514
18713B1883O718O662n180J989L531q7k902P574K4482K4649K9665K4870L2924N1475
$$ plain form
18699 228253 277234 322702 351540 369491 387273 392336 379371 373634 369876 360888 357450 354377 359230
18686 359230 358914 368683 388693 394791 397423 386272 360429 339712 309997 266904 232927 187552
18674 187552 145161 117145 96824 81426 70282 55200 43907 45567 43532 40136 32337 27390
18662 27390 30092 15483 8414 17268 23483 21142 28719 20169 12911 20491 30182 27749 25396 21874
18648 21874 16204 14636 8490 11492 7959 822 5354 8391 8355 7040 8628 10671 7496 7067 -266
18633 -266 -7697 -2134 6035 14673 15131 5967 2907 10943 18792 18609 13142 16652 16172 15147 20923 22926
18617 22926 24403 17620 6499 3617 1096 -1869 8600 6550 2483 5402 11697 11909 5051 -726
18603 -726 -2428 1524 5805 -43 -9027 -20780 -10419 7045 14722 11029 1961 1301 -9167 -11822
$$ packed form
18699B28253M8981M5468K8838J7951J7782N063j2965n737l758q988l438l073M853
18686C59230l16R769K0010O098K632j1151k5843k0717k9715m3093l3977m5375
18674A87552m2391k8016k0321j5398j1144j5082j1293J660k035l396p799m947
18662B7390K702j4609p069Q854O215k341P577q550p258P580R691k433k353l522
18648B1874n670j568o146L002l533p137M532L037l6j315J588K043l175m29p333
18633b66p431N563Q169Q638M58r164l060Q036P849j83n467L510m80j025N776K003
18617B2926J477o783j1121k882k521k965J0469k050m067K919O295K12o858n777
18603g26j702L952M281n848q984j1753J0361J7464P677l693r068o60j0468k655
$$ plain form
18589 -11822 -6365 -3488 4855 6404 -462 578 8011 5907 1700 -1531 -2713 -5542 -4266 905
18575 905 6902 -5901 -16807 -18520 -14016 -3070 -2384 -4819 -9421 -10782 -3393 12059 20691 12639
18561 12639 9927 10894 6115 12652 16553 8426 5393 1749 4270 -303 -348 7484 12801 11579 3862
18546 3862 -7252 -10323 -15548 -18114 -14733 -8580 -8585 334 12338 12596 6093 7409 6588 -11968 -4749
18531 -4749 2376 1122 -13455 -16217 -8739 -13180 -21157 -14438 -8872 -13342 -15077 -6698 -358 -1 613
18516 613 13020 13190 -314 -16623 -16514 -5166 -513 -11396 -10730 -4762 -1801 1608 -4429 -8859
18502 -8859 -13172 -19584 -19170 -8548 -5856 -5674 50 -2024 -5626 -8825 -18025 -13267 -9627 -72 -3648
18487 -3648 -12368 -10939 -16310 -9654 -3155 17 4815 -1089 -4112 -1763 2009 4638 7970 3173 6295
$$ packed form
18589a1822N457K877Q343J549o866J040P433k104m207l231j182k829J276N171
18575I05N997j2803j0906j713M504J0946O86k435m602j361P389J5452Q632q052
18561A2639k712R67m779O537L901q127l033l644K521m573m5P832N317j222p717
18546C862j1114l071n225k566L381O153nQ919J2004K58o503J316q21j8556P219
18531d749P125j254j4577k762P478m441p977O719N566m470j735Q379O340L57O14
18516F13J2407J70j3504j6309J09J1348M653j0883O66N968K961L409o037m430
18502h859m313o412M14J0622K692J82N724k074l602l199r200M758L640R555l576
18487c648q720J429n371O656O499L172M798n904l023K349L772K629L332m797L122
$$ plain form
18472 6295 5863 1776 -4140 -11528 -16977 -13405 -4935 -8349 -5788 3496 -4701 -7396 -19433 -23736 -12195
18457 -12195 -6708 -9485 -9684 -148 -1559 -4176 -1054 -6643 -15139 -10095 -10808 -13497 -13121 -10115 -15784
18442 -15784 -10123 -8747 -7048 -3759 -5791 -1774 6509 8774 6416 2367 -5199 -2469 -13445 -18936
18428 -18936 -19130 -18777 -15223 1360 11135 3244 -4378 -6333 -4328 -3766 -7873 -13369 -12130 -5535 -4153
18413 -4153 -8413 -11558 -13989 -13989 -4236 478 8516 11475 4821 3895 -1027 -12475 -10908 -10860 -18682 -18769
18397 -18769 -15194 -10189 -11855 -10579 -1726 825 -7831 -5898 4481 231 -7064 -16768 -21672 -18928
18383 -18928 -13747 -11721 -13699 -11701 -7422 -6358 -7755 -2135 -2263 -8137 -17601 -17289 -23195 -32778 -33309
18368 -33309 -31606 -22099 -15153 -14648 -5125 -5473 -13802 -11848 -14984 -21483 -16020 -11126 -13446 -14930 -5644
$$ packed form
18472F295m32m087n916p388n449L572Q470l414K561R284q197k695j2037m303J1541
18457a2195N487k777j99R536j411k617L122n589q496N044p13k689L76L006n669
18442a5784N661J376J699L289k032M017Q283K265k358m049p566K730j0976n491
18428a8936j94L53L554J6583R775p891p622j955K005N62m107n496J239O595J382
18413d153m260l145k431%R753M714Q038K959o654r26m922j1448J567M8p822q7
18397a8769L575N005j666J276Q853K551q656J933J0379m250p295r704m904K744
18383a8928N181K026j978J998M279J064j397N620j28n874r464L12n906r583n31
18368c3309J703R507O946N05R523l48q329J954l136o499N463M894k320j484R286
$$ plain form
18353 -5644 5011 1176 3462 4683 10546 7342 -1078 -3249 4159 2220 288 5953 -6240 -12051
18339 -12051 -6265 5468 6439 -2851 -6933 -3239 -4668 288 12396 4242 -556 1761 -5834 -9150
18325 -9150 -9810 -1962 3978 9294 6893 5899 7050 -617 1824 -2027 -4405 715 6473 8163 3030
18310 3030 9592 6407 2607 5547 -297 -11096 -13809 -16018 -7914 -9825 -13380 -16412 -14165 -4822
18296 -4822 -639 1614 -581 -7977 -1091 8218 4150 1093 7905 7074 -11569 -18120 -15488 -11472 -4638
18281 -4638 -78 865 2521 4943 5180 723 -4892 -5761 -5833 -6485 -413 5483 -1748 -10260 -15382 -30587
18265 -30587 -30043 -17175 -7716 -11368 -15278 -13077 -7021 5856 4514 667 2997 1312 573 2991
18251 2991 5545 8133 5934 -535 -2605 4239 6971 89 -4691 -5209 -2742 460 -1814 -20614 -29289
$$ packed form
18353e644J0655l835K286J221N863l204q420k171P408j939j932N665j2193n811
18339a2051N786J1733R71r290m082L694j429M956J2108q154m798K317p595l316
18325i150o60P848N940N316k401r94J151p667K441l851k378N120N758J690n133
18310C030O562l185l800K940n844j0799k713k209Q104j911l555l032K247R343
18296d822M183K253k195p396O886R309m068l057O812q31j8643o551K632M016O834
18281d638M560R43J656K422K37m457n615q69p2o52O072N896p231q512n122j5205
18265c0587N44J2868R459l652l910K201O056J2877j342l847K330j685p39K418
18251B991K554K588k199o469k070O844K732o882m780n18K467L202k274j8800q675
$$ plain form
18236 -29289 -29699 -27854 -12525 -500 203 -6697 -3947 3307 5317 11227 13928 10174 10566 12149 10050
18221 10050 7602 7948 10455 5597 -8683 -15139 -4949 -9374 -8125 -6874 -833 -1699 -6816 -5405
18207 -5405 -6692 -7635 -8598 195 1388 -5386 -7404 2582 6714 -1582 -5530 435 3209 520 -219
18192 -219 -3609 -12617 -12770 -11163 -3967 5005 1627 -4687 -39 4768 -156 -5263 -3859 3701 8852
18177 8852 8185 3788 -585 3099 7335 2935 -393 -7262 -8647 -3825 -7100 -8337 -4106 6138 8987
18162 8987 14805 22802 25438 20584 21960 24915 22001 16997 10557 4604 6382 15145 20984 14356 16605
18147 16605 34821 44275 47305 46770 28106 32576 37343 36948 35356 38654 38374 42430 44645 41495 38658
18132 38658 42550 59375 70634 71301 84161 97595 113318 122192 136112 160198 181615 211475
$$ packed form
18236b9289m10J845J5329J2025P03o900K750P254K010N910K701l754L92J583k099
18221A0050k448L46K507m858j4280o456J0190m425J249J251O041q66n117J411
18207e405j287r43r63Q793J193o774k018R986M132q296l948N965K774k689p39
18192b19l390r008j53J607P196Q972l378o314M648M807m924n107J404P560N151
18177H852o67m397m373L684M236m400l328o869j385M822l275j237M231J0244K849
18162H987N818P997K636m854J376K955k914n004o440n953J778Q763N839o628K249
18147A6605J8216R454L030n35j8664M470M767l95j592L298k80M056K215l150k837
18132C8658L892J6825J1259O67J2860J3434J5723Q874J3920K4086K1417K9860
$$ plain form
18120 211475 258769 313424 397390 500218 643884 859525 1203256 1790691 2948941 5564511
18110 5564511 10672561 14370283 14121811 12416086 8601214 5167885 3356519 2373246
18102 2373246 1786894 1430840 1193686 1013472 868405 760627 671065 596583 528564 462238
18092 462238 415930 382746 340589 299464 282190 267670 254410 239320 226088 216795 213126 207327
18080 207327 188645 159086 145874 136168 122516 110361 103833 98779 94421 85310 87949 85040 79953
18067 79953 77115 65324 63773 64484 63177 62520 62015 59656 63658 63387 61261 47324 38702 37143 42914
18052 42914 49603 38685 49566 51218 50607 53779 45741 39415 34089 33947 36620 38883 33789 28534
18038 28534 36031 40133 36029 30722 25588 19533 19668 30726 31405 24844 23914 23745 35901 39855 25336
$$ packed form
18120B11475M7294N4655Q3966J02828J43666K15641L43731N87435J158250K615570
18110E564511N108050L697722k48472j705725l814872l433329j811366r83273
18102B373246n86352l56054k37154j80214j45067j07778q9562p4482o8019o6326
18092D62238m6308l3184m2157m1125j7274j4520j3260j5090j3232r293l669n799
18080B07327j8682k9559j3212r706j3652j2155o528n054m358r111K639k909n087
18067G9953k838j1791j551P11j307o57n05k359M002k71k126j3937q622j559N771
18052D2914O689j0918J0881J652o11L172q038o326n326j42K673K263n094n255
18038B8534P497M102m104n307n134o055J35J1058O79o561r30j69J2156L954j4519
$$ plain form
18023 25336 21405 16552 19710 25788 26877 29320 37857 51646 53999 48154 52925 63370 68673 68316
18009 68316 75048 99149 142525 192810 252422 362326 577520 964061 1559544 2251745 2786238
17998 2786238 2950518 2670490 2131151 1542311 1053641 726660 526333 416148 343711 284099
17988 284099 234007 186136 154660 148310 137028 116178 105429 100556 94116 88358 74742 64622
17976 64622 55859 53592 55045 48554 44321 44420 42212 43363 49052 54346 48070 33352 29003 29883 32311
17961 32311 34247 29591 22757 16759 15595 21089 20150 24662 30489 31705 24459 20066 24253 17423 14256
17946 14256 21039 21055 9355 2123 2664 4590 5752 7121 7953 -432 7622 17121 10778 2615 3724
17931 3724 5721 2555 4175 4610 2306 9477 9290 7430 7442 6260 6279 17789 10785 4075 1485 -10747
$$ packed form
18023B5336l931m853L158O078J089K443Q537J3789K353n845M771J0445N303l57
18009F8316O732K4101M3376N0285N9612J09904K15194L86541N95483O92201N34493
17998B786238J64280k80028n39339n88840m88670l26981k00327j10185p2437n9612
17988B84099n0092m7871l1476o350j1282k0850j0749m873o440n758j3616j0120
17976F4622q763k267J453o491m233R9k208J151N689N294o276j4718m349Q80K428
17961C2311J936m656o834n998j164N494r39M512N827J216p246m393M187o830l167
17946A4256O783J6j1700p232N41J926J162J369Q32q385Q054R499o343q163J109
17931C724J997l166J620M35k304P171j87j860J2j182J9J1510p004o710k590j2232
$$ plain form
17915 -10747 -13573 -4337 -9429 -1144 -1044 -2397 1392 -505 -3610 -1358 1903 3323 10094 7773 1239
17900 1239 1568 14183 6580 2812 4361 4142 -3064 -11084 -7117 -802 2667 -7515 -7569 -856 586
17885 586 1180 -991 -5206 2895 360 393 6223 4597 -5732 -7473 -5142 1601 10719 13481 -706
17870 -706 -2668 2105 13676 18375 13546 6306 -4156 -4577 7908 9365 2392 -2391 -838 7573
17856 7573 6605 -289 -11569 -18462 -15749 -13171 -18665 -13889 4664 7547 14604 13105 718 -808
17842 -808 2628 1976 -7936 -5583 -8663 -14374 -20603 -13233 -10947 -1366 5519 5685 -2903 -5177 -6169 -5597
17826 -5597 -4140 -3405 1607 -114 10051 9053 -3402 1051 5733 2637 11511 34207 56709 63839
17812 63839 63709 58540 39483 22786 15545 10402 2965 -4903 -5903 -5686 2245 715 4891 15154
$$ packed form
17915a0747k826R236n092Q285J00j353L789j897l105K252L261J420O771k321o534
17900A239L29J2615p603l768J549k19p206q020L967O315L469j0182n4O713J442
17885E86N94k171m215Q101k535L3N830j626j0329j741K331O743R118K762j4187
17870g06j962M773J1571M699m829p240j0462m21J2485J457o973m783J553Q411
17856G573r68o894j1280o893K713K578n494M776J8553K883P057j499j2387j526
17842h08L436o52r912K353l080n711o229P370K286R581O885J66q588k274r92N72
17826e597J457P35N012j721J0165r98j2455M453M682l096Q874K2696K2502P130
17812F3839j30n169j9057j6697p241n143p437p868j000K17P931j530M176J0263
$$ plain form
17798 15154 17127 16003 8240 2803 -1923 -7509 -6001 -5433 -18741 -22334 -11217 -1420 6717 12557
17784 12557 19063 23440 38259 39641 54457 88125 142746 205464 228263 210336 170368 123624
17772 123624 89910 58261 35449 35650 34402 32776 28003 23680 18983 10561 1839 9376 19127 25542
17758 25542 15475 4483 3689 8855 14293 13751 14607 16863 20824 24725 27876 28301 25686 32343 48745
17743 48745 72701 115892 187937 235105 233988 197511 146167 100059 64436 48018 37192 33132
17731 33132 34314 22172 11507 2005 721 10959 9163 4443 5245 8833 19745 34184 46300
17718 46300 27468 15960 13826 9771 4004 13930 18688 9825 2797 6135 3966 12185 26918 44280
17704 44280 62850 61466 50919 43662 28889 11959 6400 6578 18658 19896 8046 -859 -2459
$$ packed form
17798A5154J973j124p763n437m726n586J508N68j3308l593J1117R797Q137N840
17784A2557O506M377J4819J382J4816L3668N4621O2718K2799j7927l9968m6744
17772A23624l3714l1649k2812K01j248j626m773m323m697q422q722P537R751O415
17758B5542j0067j0992p94N166N438n42Q56K256L961L901L151M25k615O657J6402
17743D8745K3956M3191P2045M7168j117l6477n1344m6108l5623j6418j0826m060
17731C3132J182j2142j0665r502j284J0238j796m720Q02L588J0912J4439J2116
17718D6300j8832j1508k134m055n767R926M758q863p028L338k169Q219J4733J7362
17704D4280J8570j384j0547p257j4773j6930n559J78J2080J238j1850q905j600
$$ plain form
17691 -2459 -315 -6627 -15076 -4058 9624 6967 8182 15068 7592 2376 -10095 -18450 -27729 -23948
17677 -23948 -15970 -7471 -4488 -7003 -6697 -11152 -4905 -6130 -12758 -12350 -14817 -14177 -6105 -3900 -15098
17662 -15098 -23922 -12444 -10310 -13862 -16624 -17466 -15014 -14158 -12872 -4849 -1440 -3452 -5336 -15523
17648 -15523 -23445 -19395 -3897 6030 2372 -3381 -5023 -7169 -7092 -12756 -6937 -7892 -7832 -8260 4534
17633 4534 4250 -3869 -2984 -2412 -191 7586 11913 12147 615 -4654 -9476 -15504 -17933 -11998 -6914
17618 -6914 -7829 3986 15055 16951 5913 -2265 -6560 -2157 7993 7481 4121 4348 8353 16805
17604 16805 17050 4363 -1963 4975 5585 -2818 -6548 -9877 878 16837 16322 12873 -1213 -11514
17590 -11514 -9140 -6764 -5294 -4334 -5931 -3756 -5970 -3327 -4708 -3710 119 3318 -1408 8195 13813
$$ packed form
17691b459K144o312q449J1018J3682k657J215O886p476n216j2471q355r279L781
17677b3948P978Q499K983k515L06m455O247j225o628M08k467O40Q072K205j1198
17662a5098q824J1478K134l552k762q42K452Q56J286Q023L409k012j884j0187
17648a5523p922M050J5498R927l658n753j642k146P7n664N819r55O0m28J2794
17633D534k84q119Q85N72K221P777M327K34j1532n269m822o028k429N935N084
17618f914r15J1815J1069J896j1038q178m295M403J0150n12l360K27M005Q452
17604A6805K45j2687o326O938O10q403l730l329J0755J5959n15l449j4086j0301
17590a1514K374K376J470R60j597K175k214K643j381R98L829L199m726R603N618
$$ plain form
17575 13813 -1831 -11746 -7722 -11141 -11661 -4633 6395 2460 4702 5290 5195 2400 -7094 -17771 -8743
17560 -8743 -4801 -8530 -8987 -8054 287 -1636 -6846 5532 7846 5504 14473 8724 1293 -7434 -10112
17545 -10112 -15718 -19136 -17655 -11939 -9757 -105 -3858 -14209 -15649 -15524 -20659 -25336 -12823 -6279
17531 -6279 -11429 -11284 -13517 -1533 -6611 -8694 -7384 -9093 -4452 -5486 -65 -718 -2667 144 -3754
17516 -3754 -5848 -14401 -23929 -22515 -10180 -6687 -18170 -24135 -18126 -10407 -6664 -4473 -8798 -17487
17502 -17487 -17847 -18553 -19528 -17519 -9334 -3724 -3028 -4511 -2254 -4013 108 493 -7841 -13846 -10632 -4943
17486 -4943 -6868 -4833 -5531 -6931 -7210 -10622 -6762 -13174 -12017 -14893 -13152 -18661 -20904 -16643 -11594
17471 -11594 -16295 -22730 -24689 -20362 -10660 -10618 -9463 -9642 -9540 -8355 -1914 13224 16561 13108 3651
$$ packed form
17575A3813j5644r915M024l419n20P028J1028l935K242N88r5k795r494j0677R028
17560h743L942l729m57R33Q341j923n210J2378K314k342Q969n749p431q727k678
17545a0112n606l418J481N716K182R652l753j0351j440J25n135m677J2513O544
17531f279n150J45k233J1984n078k083J310j709M641j034N421o53j949K811l898
17516c754k094q553r528J414J2335L493j1483n965O009P719L743K191m325q689
17502a7487l60p06r75K009Q185N610O96j483K257j759M121L85q334o005L214N689
17486d943j925K035o98j400k79l412L860o412J157k876J741n509k243M261N049
17471a1594m701o435j959M327R702M2J155j79J02J185O441J5138L337l453r457
$$ plain form
17456 3651 1719 -8626 -13864 -9736 -5230 -84 10026 6677 8093 -1852 87 12216 37724 68699
17442 68699 80159 66531 34629 8503 3316 6640 -4936 -9196 448 -2449 -7535 -9049 -6972
17429 -6972 3301 3296 -2956 -1561 -10698 -26707 -25440 -16059 -9751 -2148 -3103 -12044 -11797 -4701 -4792 -6567
17413 -6567 -1745 4260 2627 -1479 -11504 -6531 -226 -450 -3542 -14466 -15243 -16139 -9524 -3995 -4883
17398 -4883 -6726 -7104 -10450 -14147 -7790 -4755 -7316 -14140 -15136 -7061 -9413 -18361 -13890 -10281 -6985
17383 -6985 -9626 -22944 -18053 -13082 -12008 -17164 -12046 -8298 -7548 -8864 -7233 -7603 -718 348 3460
17368 3460 -1655 2441 -213 -1690 5082 4271 -4108 -7493 -1416 7936 4088 5652 15577 14894 13490
17353 13490 12527 14660 4923 -3337 3054 1975 -6697 715 15957 9333 154 -1281 -4364 -10716
$$ packed form
17456C651j932j0345n238M128M506N146J0110l349J416r945J939J2129K5508L0975
17442F8699J1460j3628l1902k6126n187L324j1576m260R644k897n086j514K077
17429f972J0273no252J395r137j6009J267R381O308P603r55q941K47P096r1j775
17413f567M822O005j633m106j0025M973O305k24l092j0924p77q96O615N529q88
17398d883j843l78l346l697O357L035k561o824r96Q075k352q948M471L609L296
17383f985k641j3318M891M971J074n156N118L748P50j316J631l70O885J066L112
17368C460n115M096k654j477O772q11q379l385O077R352l848J564R925o83j404
17353A3490r63K133r737q260O391j079q672P412J5242o624r179j435l083o352
$$ plain form
17339 -10716 -9965 -16073 -16709 -11940 -13336 -10549 4083 17603 10349 4002 -5483 -7913 985 14374
17325 14374 25224 30360 22557 11593 13259 18536 5217 -3408 -5350 -3630 -3521 -6317 -9967 -8802
17311 -8802 -7404 -19713 -17020 -20549 -15055 -10368 -8753 -13705 -14083 -13077 -16495 -15394 -11714 -10354 -6609
17296 -6609 -10786 -16627 -11069 -12646 -12218 -7549 3397 8391 3529 33 425 2832 -5762 -10544 -10740
17281 -10740 -9724 875 8627 9146 4775 -3463 -7632 -1766 -9873 -16074 -9952 4757 10123 5720
17267 5720 -1243 -1920 -2236 -7661 -5461 -7122 -6119 -4239 -5823 -4758 -13736 -18784 -8704 -2458 -261
17252 -261 11087 12706 5522 6744 11102 6037 -1187 -13077 -15537 -13554 -7781 -8316 -1304 10186
17238 10186 12967 5860 6155 11519 11032 6560 3355 -8512 -7664 1419 9154 8120 8634 14088 23061
$$ packed form
17339a0716P51o108o36M769j396K787J4632J3520p254o347r485k430Q898J3389
17325A4374J0850N136p803j0964J666N277j3319q625j942J720J09k796l650J165
17311h802J398j2309K693l529N494M687J615m952l78J006l418J101L680J360L745
17296f609m177n841N558j577M28M669J0946M994m862l496L92K407q594m782j96
17281a0740J016J0599P752N19m371q238m169N866q107o201O122J4709N366m403
17267E720o963o77l16n425K200j661J003J880j584J065q978n048J0080O246K197
17252b61J1348J619p184J222M358n065p224j1890k460J983N773n35P012J1490
17238A0186K781p107K95N364m87m472l205j1867Q48R083P735j034N14N454Q973
$$ plain form
17223 23061 39752 62231 98029 181673 355868 538312 561138 518083 397008 267046 209781
17212 209781 205305 241183 368803 552593 595451 546966 426547 279402 187363 139187 94722
17201 94722 73027 63769 54903 58220 48545 44982 36872 22300 19987 16681 8040 8640 17930 15853
17187 15853 10742 3631 2484 2368 -427 -4972 -521 -598 -6653 -11213 -10443 -1155 -467 1738 8288 -1655
17171 -1655 -11538 -19885 -17450 -15136 -9001 -2992 -8439 -15408 -10373 -17355 -15161 -12845 -11748 -13952 -16319
17156 -16319 -9606 1732 15381 16981 5727 710 -1230 -659 -4994 -8669 327 992 3645 10148
17142 10148 11947 15642 18182 12800 13213 6061 2128 -2240 -6876 1690 7568 -4594 -9234 -15376
17128 -15376 -13018 -5739 -4878 5432 18920 15312 8530 7199 5633 3430 4501 -12168 -11003 -1524
$$ packed form
17223B3061J6691K2479L5798Q3644J74195J82444K2826m3055j21075j29962n7265
17212B09781m476L5878J27620J83790M2858m8485j20419j47145r2039m8176m4465
17201I4722k1695r258q866L317r675l563q110j4572k313l306q641O00R290k077
17187A5853n111p111j147j16k795m545M451p7o055m560P70R288O88K205O550r943
17171a655r883q347K435K314O135O009n447o969N035o982K194K316J097k204k367
17156a6319O713J1338J3649J600j1254n017j940N71m335l675Q996O65K653O503
17142A0148J799L695K540n382M13p152l933m368m636Q566N878j2162m640o142
17128a5376K358P279Q61J0310J3488l608o782j331j566k203J071j6669J165R479
$$ plain form
17114 -1524 -5270 -9778 -1140 1522 -2127 -15054 -22234 -27693 -22620 -9188 -13689 -11460 -11811 -11678 -4347
17099 -4347 -1199 -602 -1643 3715 -4226 -2213 10252 12244 7242 -6463 -12693 -2644 -7046 -18050
17085 -18050 -20841 -17445 -14205 -14717 -11560 1247 450 -1991 -4363 -3352 -8958 -17615 -16073 -4557
17071 -4557 1648 4524 1119 -6251 -9192 -4102 -9347 -16130 -15946 -13213 -15755 -14774 -8385 -8581 -7164
17056 -7164 -3751 -11279 -13719 -7730 -12332 -14642 -12176 -10806 -10555 -9329 -13075 -16451 -24191 -19053 -19935
17041 -19935 -12920 -4769 -555 -4029 -10197 -6248 -4845 -9465 -16950 -14330 -11835 -20896 -32536 -26677
17027 -26677 -25051 -34552 -27399 -4209 -10045 -13843 -7200 79 1130 4684 3157 2763 -4337 -8260
17013 -8260 -16909 -22034 -18315 -16636 -16046 -14828 -21707 -25137 -22344 -16823 -15683 -11036 -9624 -12064 -8504
$$ packed form
17114a524l746m508Q638K662l649j2927p180n459N073J3432m501K229l51J33P331
17099d347L148N97j041N358p941K013J2465J992n002j3705o230J0049m402j1004
17085a8050k791L396L240n12L157J2807p97k441k372J011n606q657J542J1516
17071d557O205K876l405p370k941N090n245o783J84K733k542R81O389j96J417
17056g164L413p528k440N989m602k310K466J370K51J226l746l376p740N138q82
17041a9935P015Q151M214l474o168L949J403m620p485K620K495r061j1640N859
17027b6677J626r501P153K3190n836l798O643P279J051L554j527l94p100l923
17013h260q649n125L719J679N90J218o879l430K793N521J140M647J412k440L560
$$ plain form
16998 -8504 -4697 1199 -275 -3511 -12786 -8207 -6497 -11256 -11363 -8460 -5266 2869 4579 8606 6605
16983 6605 -2870 -3970 -1737 -6242 -14035 -12353 -6077 -8676 -128 10640 4852 -8600 -15299 -10867
16969 -10867 -3935 -8231 -6490 -13726 -7669 -9554 -11806 -11374 -13297 -8190 -7264 -11247 -20420 -18849 -10499
16954 -10499 -8031 -13754 -12431 -16425 -18218 -18337 -22740 -14896 -4651 -12649 -13820 -9213 -16879 -9694
16940 -9694 -9341 -4792 2516 -1239 3362 11660 5242 -2843 -5017 -6352 -9921 -9749 -5979 79 3359
16925 3359 -2513 -10395 -19895 -17037 -25404 -17371 -6486 -14676 -20523 -10095 -2258 -4483 -7426 -7169
16911 -7169 -14258 -19796 -26462 -27419 -27276 -16291 -489 1432 -5007 -6115 -8328 -7658 -7807 -5406 -3030
16896 -3030 -437 7801 10104 7888 3307 13683 15078 8829 7662 1936 -4971 -1211 -6032 5899
$$ packed form
16998h504L807N896j474l236r275M579J710m759j07K903L194Q135J710M027k001
16983F605r475j100K233m505p793J682O276k599Q548J0768n788j3452o699M432
16969a0867O932m296J741p236O057j885k252M32j923N107R26l983r173J571Q350
16954a0499K468n723J323l994j793j19m403P844J0245p998j171M607p666P185
16940i694L53M549P308l755M601Q298o418q085k174j335l569J72L770O058L280
16925C359n872p882r500K858q367Q033J0885q190n847J0428P837k225k943K57
16911g169p089n538o666r57J43J0985J5802J921o439j108k213O70j49K401K376
16896c030K593Q238K303k216m581J0376J395o249j167n726o907L760m821J1931
$$ plain form
16882 5899 16356 13814 3078 -9885 -10074 -11702 -18068 -23456 -17977 -8514 795 6705 3159 -12446
16868 -12446 -15116 -14174 -6170 1927 -492 -2136 -1363 -7378 -6987 -1859 568 -10477 -10729 -6957 -6113
16853 -6113 -2534 -5454 1977 8372 5486 4987 -2952 -639 11247 16690 17961 16540 17981 15773 4163
16838 4163 7574 23738 41328 44403 46578 46771 29479 19995 10627 4722 550 2307 -1272 408
16824 408 6226 11130 13495 18710 16849 4296 -303 -8716 -24423 -31787 -25342 -18186 -13524 -11979
16810 -11979 -7343 -9400 1728 21298 42272 50242 50709 37900 28750 36587 50645 64399 67611
16797 67611 58364 44071 39560 33198 26244 18898 8370 3300 3645 6803 9638 8589 17241 19282
16783 19282 20186 17161 11253 8563 16036 19381 15046 20495 22579 16663 14398 16833 26248 31272 37430
$$ packed form
16882E899J0457k542j0736j2963j89j628o366n388N479R463R309N910l546j5605
16868a2446k670R42Q004Q097k419j644P73o015L91N128K427j1045k52L772Q44
16853f113L579k920P431O395k886m99p939K313J1886N443J271j421J441k208j1610
16838D163L411J6164J7590L075K175J93j7292r484r368n905m172J757l579J680
16824D08N818M904K365N215j861j2553m599q413j5707p364O445P156M662J545
16810a1979M636k057J1128J9570K0974P970M67j2809r150P837J4058J3754L212
16797F7611r247j4293m511o362o954p346j0528n070L45L158K835j049Q652K041
16783A9282R04l025n908k690P473L345m335N449K084n916k265K435R415N024O158
$$ plain form
16768 37430 42314 42917 45089 35886 28108 25671 25770 32314 36276 24325 11903 5161 11344 14755 12152
16753 12152 15009 8420 7758 7967 9028 3053 1409 -6906 -8138 -11922 -14168 -11742 -128 1476 -6139
16738 -6139 -8928 -7996 -5075 -1658 3533 10141 21757 18083 13161 22028 25409 17806 5081 14323
16724 14323 16589 4307 6764 11507 12166 3440 -5205 -8553 -12664 -25989 -27155 -25322 -19825 -1972
16710 -1972 4186 2244 -7169 -13016 -8166 -5761 -128 -1812 3110 3656 -222 -335 -1393 -6179 -12753
16695 -12753 -15790 -14356 -19556 -14349 -11805 -9795 -7121 -10184 -6569 -5170 -11484 -14957 -14056 -20356 -20001
16680 -20001 -16093 -23283 -21924 -11666 -9926 -5918 -13536 -20953 -19705 -12443 -8629 -3237 4250 -367
16666 -367 -5585 -5909 -3556 -11929 -16509 -7422 3927 3591 3287 1817 6077 -7249 -12209 -13817 -9389
$$ packed form
16768C7430M884O03K172r203p778k437R9O544L962j1951j2422o742O183L411k603
16753A2152K857o589o62K09J061n975j644q315j232l784k246K426J1614J604p615
16738f139k789R32K921L417N191O608J1616l674m922Q867L381p603j2725R242
16724A4323K266j2282K457M743O59q726q645l348m111j3325j166J833N497J7853
16710a972O158j942r413n847M850K405N633j684M922N46l878j13j058m786o574
16695a2753l037J434n200N207K544K010K674l063L615J399o314l473R01o300L55
16680b0001L908p190J359J0258J740M008p618p417J248P262L814N392P487m617
16666c67n218l24K353q373m580R087J1349l36l04j470M260j3326m960j608M428
$$ plain form
16651 -9389 -5263 -2264 -4142 -8950 -12458 -18438 -13824 -7898 -4868 -3932 -1379 1992 5490 3108 9416
16636 9416 8953 13744 9160 -1970 -9568 -20455 -17373 -11968 -10738 -8948 -4049 -2267 -1824 5155 9131
16621 9131 17619 18645 18964 15747 18749 18337 9043 5523 611 -3445 -3053 -244 -1366 -2481 -4293
16606 -4293 -4879 712 -7424 -16347 -24100 -22623 -21593 -9866 -12392 -11883 2088 5859 11477 12328 6387
16591 6387 -2983 -3782 3119 906 -1322 -1198 -1344 -3284 -6174 -11502 -10771 -11270 -8339 -6598 -6052 -6711
16575 -6711 -3928 -599 -1276 -12648 -12613 -26 422 6355 8421 3259 5882 -953 -17406 -28875 -31801
16560 -31801 -27295 -17098 -9599 -12404 -12419 -7765 -262 2896 -1098 -6462 -3812 -3259 -1424 -4711 7927
16545 7927 5845 1019 -8953 -10026 -17782 -12068 -3958 -8463 -4551 -5467 -6616 -8737 -14763 -12243 -6572
$$ packed form
16651i389M126K999j878m808l508n980M614N926L030R36K553L371L498k382O308
16636I416m63M791m584j1130p598j0887L082N405J230J790M899J782M43O979L976
16621I131Q488J026L19l217L002m12r294l520m912m056L92K809j122j115j812
16606d293n86N591q136q923p753J477J030J1727k526N09J3971L771N618Q51n941
16591F387r370p99O901k213k228J24j46j940k890n328P31m99K931J741N46o59
16575f711K783L329o77j1372L5J2587M48N933K066n162K623o835j6453j1469k926
16560c1801M506J0197P499k805j5M654P503L158l994n364K650N53J835l287J2638
16545G927k082m826r972j073p756N714Q110m505L912r16j149k121o026K520N671
$$ plain form
16530 -6572 -1478 184 -6391 1821 747 -314 -2927 -9453 -16598 -7826 165 -5032 763 8240 9629
16515 9629 347 1985 7618 9617 -2748 1377 6174 -6625 -10900 -10172 -8485 -12555 -3222 6467
16501 6467 9272 7310 -6190 -17150 -21935 -21765 -21669 -12889 -4476 -5604 -2878 -2658 1057 1135 -2784 180
16485 180 2839 -3835 -5776 -10176 -16376 -19727 -17842 -22394 -20675 -3224 -4714 -4893 -3931 2733 4901
16470 4901 -4397 -2283 2273 -4244 -5176 -3453 -8869 -11183 -8524 -387 7649 -972 -2856 -5700 -4776
16455 -4776 -3186 -321 2915 8305 18198 9012 4825 8706 11838 9842 8061 2497 2540 3289 -2520
16440 -2520 -2604 -7223 -4309 -10533 -11071 -10306 -11838 -13840 -17718 -24776 -25344 -22120 -16523 -15393 -17842 -14838
16424 -14838 -9386 -13220 -23906 -25294 -23183 -20359 -20580 -10081 -3399 -2265 -4284 -12112 -20971 -26852
$$ packed form
16530f572N094J662o575Q212j074j061k613o526p145Q772P991n197N795P477J389
16515I629r282J638N633J999j2365M125M797j2799m275P28J687m070R333R689
16501F467K805j962j3500j0960m785J70R6Q780Q413j128K726K20L715P8l919K964
16485A80K659o674j941m400o200l351J885m552J719J7451j490j79R62O664K168
16470D901r298K114M556o517r32J723n416k314K659Q137Q036q621j884k844R24
16455d776J590K865L236N390R893r186m187L881L132j996j781n564M3P49n809
16440b520q4m619K914o224n38P65j532k002l878p058n68L224N597J130k449L004
16424a4838N452l834j0686j388K111K824k21J0499O682J134k019p828q859n881
$$ plain form
16410 -26852 -25435 -20541 -15214 -14045 -13415 -14150 -8603 -6861 1542 6001 -3842 -13487 -12368 -7955 900
16395 900 2304 2405 -6273 -15350 -17696 -16065 -22168 -18373 -16715 -12550 233 2309 1838 -8893 -10574
16380 -10574 -8231 -8223 -9847 -17051 -15449 -22598 -28967 -26430 -12125 -5252 -6271 -7946 -5420 -12737 -22005
16365 -22005 -5367 -1100 6636 9668 10002 -5000 -3735 -10398 -17097 -12119 -12 -2232 -11972 -4955
16351 -4955 2026 -2964 -8361 -15501 -6703 -322 2547 2933 -4078 2680 11989 11257 -2333 -4573 -454
16336 -454 793 3384 2659 -10223 -13665 -12085 -13702 -10098 -13454 -19883 -12303 -5458 -2963 -11020 -19788
16321 -19788 -13519 -5186 -1199 -3568 -9852 -18823 -19118 -17777 -19078 -21847 -24441 -19105 -18444 -15339 -3810
16306 -3810 1907 -4494 -8670 -9513 -7468 -12380 -16741 -15917 -9926 -3973 -8060 -22336 -22112 -10700 -6311
$$ packed form
16410b6852J417M894N327J169O30p35N547J742Q403M459r843r645J119M413Q855
16395I00J404J01q678r077k346J631o103L795J658M165J2783K076m71j0731j681
16380a0574K343Qj624p204J602p149o369K537J4305O873j019j675K526p317r268
16365b2005J6638M267P736L032L34j5002J265o663o699M978J2107k220r740P017
16351d955O981m990n397p140Q798O381K869L86p011O758R309p32j3590k240M119
16336d54J247K591p25j2882l442J580j617L604l356o429P580O845K495q057q768
16321a9788O269Q333L987k369o284q971k95J341j301k769k594N336O61L105J1529
16306c810N717o401m176q43K045m912m361Q24N991N953m087j4276K24J1412M389
$$ plain form
16291 -6311 -114 -8827 -15119 -21209 -22497 -19357 -20691 -14959 -13347 -13893 -3986 -5925 -11433 -1177 3393
16276 3393 -3559 -9238 -14030 -12899 -14435 -10752 -12605 -20421 -16051 -14521 -19049 -20960 -14077 -9071 -1800
16261 -1800 500 -1050 4 2395 6094 5308 15088 23447 23703 13728 2079 -5799 -12704 -9597 -4100
16246 -4100 -542 -6643 -1094 5584 3006 -5105 -1640 -10690 -8282 4681 4754 549 -5657 -7537 -8587
16231 -8587 -8227 -2884 352 1344 -1078 -3096 -5716 -14204 -11981 -19512 -15585 -7335 -5791 -12165 -10314
16216 -10314 -10411 -16579 -19206 -20338 -23185 -17790 -16899 -25880 -19788 -19708 -15670 -10943 -2259 -246 -3349 -13280
16200 -13280 -16086 -20944 -18804 -12410 -7464 5352 1732 -389 6382 10526 -390 200 -3233 -4958
16186 -4958 -6256 -5786 -14919 -7229 2663 6090 8553 8783 9532 1690 -10249 -6533 2985 -3069 -11682
$$ packed form
16291f311O197q713o292o090j288L140j334N732J612n46R907j939n508J0256M570
16276C393o952n679m792J131j536L683j853p816M370J530m528j911O883N006P271
16261a800K300j550J054K391L699p86R780Q359K56r975j1649p878o905L107N497
16246d100L558o101N549O678k578q111L465r050K408J2963P3m205o206j880j050
16231h587L60N343L236R92k422k018k620q488K223p531L927Q250J544o374J851
16216a0314r7o168k627j132k847N395Q91q981O092Q0M038M727Q684K013l103r931
16200a3280k806m858K140O394M946J2816l620k121O771M144j0916N90l433j725
16186d958j298M70r133P690R892L427K463K30P49p842j1939L716R518o054q613
$$ plain form
16171 -11682 -10582 -6383 1517 5732 6662 5028 669 -2277 41 -1697 -1737 -6126 -11231 -8590 -8142
16156 -8142 -7867 -3956 -5311 -6861 -12377 -11453 -5017 3295 3100 4190 1372 -1625 -12562 -18303 -14317
16141 -14317 -10803 -15025 -6621 692 3275 -6906 -4188 -10369 -19872 -23136 -16347 -14336 -13572 -5046
16127 -5046 -4165 -2466 -3715 -5340 -4743 -2695 4443 -10085 -13847 -8081 -2520 1646 11478 12903 9420
16112 9420 2724 -3570 -7808 -4859 -263 -1108 -4889 -5582 -7919 4695 18992 16355 3731 -6324
16098 -6324 -4725 2225 5356 7160 9345 10134 683 -9381 -8825 -11934 -12206 -1284 -8931 -5866 -5032
16083 -5032 -9115 3083 2098 -1321 1235 2028 -3667 -3305 -8162 -12199 -12325 -20976 -19874 -18338 -15344
16068 -15344 -12109 -13705 -9350 -3920 3102 3316 1352 451 157 115 -1561 4318 3170 -2656 -7627 -13900
$$ packed form
16171a1682J100M199P900M215R30j634m359k946K318j738m0m389n105K641M48
16156h142K75L911j355j550n516R24O436Q312j95J090k818k997j0937n741L986
16141a4317L514m222Q404P313K583j0181K718o181r503l264O789K011P64Q526
16127e046Q81J699j249j625N97K048P138j4528l762N766N561M166R832J425l483
16112I420o696o294m238K949M596q45l781o93k337J2614J4297k637j2624j0055
16098f324J599O950L131J804K185P89r451j0064N56l109k72J0922p647L065Q34
16083e032m083J2198r85l419K556P93n695L62m857m037j26q651J102J536K994
16068a5344L235j596M355N430P022K14j964r01k94m2j676N879j148n826m971o273
$$ plain form
16052 -13900 -15480 -12617 -17397 -14058 -11537 -11187 -15568 -8463 -576 2322 7794 3448 4201 6221 12510
16037 12510 6698 6148 2682 -1114 -1428 1551 -2518 -9738 -3294 3689 11835 9585 657 -2733 -4280
16022 -4280 -7705 -4925 1420 -1185 -5131 -2580 -5944 -3672 -3900 -1146 -3886 -4290 -6112 -170 338
16007 338 -3012 41 -8126 -7911 -7751 -2802 614 135 -7067 -25589 -29931 -21400 -18513 -17518 -10628 -7551
15991 -7551 -7543 -15686 -11736 -10310 -6853 -3686 -2255 2135 3102 2946 5003 3486 -20 3374 7467 4572
15975 4572 2432 484 1863 2137 -4261 -6690 -4688 -1618 1517 339 -5768 -6880 -7640 -2048 -3254
15960 -3254 -4041 4628 5833 -1826 -574 1785 -6316 -14885 -18505 -17812 -11239 -14314 -13479 -1048 3162
15945 3162 -3703 -4940 1750 -635 -9142 -11539 -18274 -13818 -6300 -10330 -15927 -22510 -23316 -17989 -20557
$$ packed form
16052a3900j580K863m780L339K521L50m381P105P887K898N472m346P53K020O289
16037A2510n812n50l466l796l14K979m069p220O444O983Q146k250q928l390j547
16022d280l425K780O345k605l946K551l364K272k28K754k740m04j822N942N08
16007C38l350L053q167K15J60M949L416m79p202j8522m342Q531K887R95O890L077
15991g551Qq143L950J426L457L167J431M390R67j56K057j517l506L394M093k895
15975D572k140j948J379K74o398k429K002L070L135j178o107j112p60N592j206
15960c254p87Q669J205p659J252K359q101q569l620O93O573l075Q35J2431M210
15945C162o865j237O690k385q507k397o735M456P518m030n597o583q06N327k568
$$ plain form
15930 -20557 -15864 -19793 -18780 -18365 -20777 -29196 -30850 -22361 -24581 -24323 -24920 -24690 -23573 -14376 -13187
15915 -13187 -4687 6434 11972 10721 5607 5214 528 565 4698 -379 -10933 -13843 -6676 218 -3376
15900 -3376 -14560 -16456 -12109 -18137 -23802 -20352 -2054 8853 4688 -2261 23 5469 -7075 -17877
15886 -17877 -17397 -16421 -7810 3887 7443 -2312 -14006 -11942 -14830 -4204 2832 4385 4084 6754
15872 6754 7272 4069 -10571 -15756 -17935 -20044 -23133 -25667 -22749 -9575 5597 1517 3579 3716
15858 3716 2484 6553 -494 -425 -4976 -12344 -17972 -12445 -3445 -6074 -3528 -1064 -4132 -5623 -1533
15843 -1533 -500 -2084 -1177 -217 -2572 -6953 -4524 -7362 -6983 -635 -1955 -11501 -22091 -18362 -16016
15828 -16016 -13039 -13867 -2953 2418 5470 10396 9175 3140 -5345 -9149 -18500 -11461 -14149 -25545
$$ packed form
15930b0557M693l929J013M15k412q419j654Q489k220K58n97K30J117R197J189
15915a3187Q500J1121N538j251n114l93m686L7M133n077j0554k910P167O894l594
15900c376j1184j896M347o028n665L450J8298J0907m165o949K284N446j2544j0802
15886a7877M80R76Q611J1697L556r755j1694K064k888J0626P036J553l01K670
15872F754N18l203j4640n185k179k109l089k534K918J3174J5172m080K062J37
15858C716j232M069p047O9m551p368n628N527R000k629K546K464l068j491M090
15843a533J033j584R07R60k355m381K429k838L79O348j320r546j0590L729K346
15828a6016K977q28J0914N371L052M926j221o035q485l804r351P039k688j1396
$$ plain form
15814 -25545 -22832 -20612 -14572 439 1002 1224 -2005 -3902 -3749 -4185 -8967 -10744 -4216 2764 4784
15799 4784 -3633 -140 7889 1438 -3143 -6180 -1647 -942 -8491 -7593 -2740 3430 6710 -2807 -5309
15784 -5309 -11882 -13585 -7547 -14099 -29441 -17626 -10050 -11382 -4621 -2548 -1964 -2374 57 -3053 -12746
15769 -12746 -19546 -7555 9087 17193 6727 1004 -3827 4012 -22 -3681 -5194 -13751 -17031 -2752
15755 -2752 19712 21210 1451 -8220 -15304 -24541 -18432 3272 12435 2588 -8749 -12564 -10037 -5347
15741 -5347 485 -3555 -7667 -1232 5282 -268 -10237 -15618 -10997 -5570 -6106 -3997 -7419 -13195 -16820
15726 -16820 -10491 -7753 -1595 1636 2853 8456 15811 13557 8291 6131 -1970 -12871 -10622 2738
15712 2738 4078 -4231 -5113 -9959 -12898 -18566 -18567 -21815 -21204 -19555 -13287 -4473 -696 -8305 -16047 -18278
$$ packed form
15814b5545K713K220O040J5011N63K22l229j897J53m36m782j777O528O980K020
15799D784q417L493Q029o451m581l037M533P05p549Q98M853O170L280r517k502
15784e309o573j703O038o552j5342J1815P576j332O761K073N84m10K431l110r693
15769a2746o800J1991J6642Q106j0466n723m831P839m034l659j513q557l280J4279
15755b752K2464J498j9759r671p084r237O109K1704R163r847j1337l815K527M690
15741e347N832m040m112O435O514n550r969n381M621N427n36K109l422n776l625
15726a6820O329K738O158L231J217N603P355k254n266k160q101j0901K249J3360
15712B738J340q309q82m846k939n668jl248O11J649O268Q814L777p609p742k231
$$ plain form
15696 -18278 -15436 -9580 -6369 -5005 2501 16264 16314 18129 15310 5191 -1723 -6152 -7602 -5274
15682 -5274 -10690 -13186 -19020 -9679 -10486 -18876 -16105 -12069 1763 11616 10822 10763 19696 16313 1540
15667 1540 -5817 -12756 -10882 -8453 -10136 -3765 -4413 -11664 -5877 -2523 -3069 -1935 3278 5028 5181
15652 5181 528 -1805 -5529 -337 -1367 -5461 1157 4892 -3615 -9731 -5668 -4049 -2419 981 1759
15637 1759 -62 -6998 -16268 -8854 -1122 2114 -5782 -13837 -17072 -12831 -13954 -8282 -11840 -14712 -11146
15622 -11146 -6882 -14480 -24625 -22901 -20344 -19610 -9112 -16427 -24776 -18089 -10351 -11751 -15997 -11318
15608 -11318 -5475 411 -6234 -5978 -9238 -9075 -6808 -5082 -4784 897 -6042 -16871 -14787 -9468 -945
15593 -945 418 -3117 -1257 -756 -4466 -6051 -3162 -1508 1521 2541 -5251 -9083 -3326 5636 6377
$$ packed form
15696a8278K842N856L211J364P506J3763N0J815k819j0119o914m429j450K328
15682e274n416k496n834R341q07q390K771M036J3832R853p94n9Q933l383j4773
15667A540p357o939J874K429j683O371o48p251N787L354n46J134N213J750J53
15652E181m653k333l724N192j030m094O618L735q507o116M063J619J630L400P78
15637A759j821o936r270P414P732L236p896q055l235M241j123N672l558k872L566
15622a1146M264p598j0145J724K557P34J0498p315q349O687P738j400m246M679
15608a1318N843N886o645K56l260J63K267J726K98N681o939j0829K084N319Q523
15593i45J363l535J860N01l710j585K889J654L029J020p792l832N757Q962P41
$$ plain form
15578 6377 -7158 -15227 -8311 -2431 -2209 -1570 -5767 -8815 -13620 -12342 -20156 -27939 -23520 -14167 -15050
15563 -15050 -5234 4936 -1792 -7069 -9589 -4255 5236 10381 628 -10085 -11865 -5889 -4090 -4513
15549 -4513 -9920 -2491 13205 22007 7807 -5500 -7886 -13246 -7502 -259 4439 -2655 -12710 -9610
15535 -9610 -3008 1037 -10141 -16462 -14733 -13641 -8339 -3497 2413 6699 4061 -509 -11427 -15272
15521 -15272 -17299 -18023 -20551 -6414 -405 2439 227 3778 5320 2469 -5444 -8575 -2905 7036
15507 7036 3977 5222 2666 1413 -7392 -10275 1269 5232 6538 2149 -3171 -1683 3161 8314
15493 8314 2835 -9809 -8074 -2249 13428 19245 8527 -4909 -10242 -8048 -11150 -10210 -1718 -6277
15479 -6277 -5370 1027 -617 -2680 -2180 -9035 -14066 -16337 -7561 10720 8860 1300 -9027 -11322 -10727
$$ packed form
15578F377j3535q069O916N880K22O39m197l048m805J278p814p783M419R353q83
15563a5050R816J0170o728n277k520N334R491N145r753j0713j780N976J799m23
15549d513n407P429J5696Q802j4200j3307k386n360N744P243M698p094j0055L100
15535i610O602M045j1178o321J729J092N302M842N910M286k638m570j0918l845
15521a5272k027p24k528J4137O009K844k212L551J542k851p913l131N670R941
15507G036l059J245k556j253q805k883J1544L963J306m389n320J488M844N153
15493H314n479j2644J735N825J5677N817j0718j3436n333K194l102R40Q492m559
15479f277R07O397j644k063N00o855n031k271Q776J8281j860p560j0327k295N95
$$ plain form
15464 -10727 -12610 -5945 -4330 -1514 4935 6790 8680 1327 791 1605 14603 13766 11316 6266 -4892
15449 -4892 -9038 3607 11983 10856 4441 -24 4856 17 -2095 1899 7067 3743 -3323 -2979 -4273
15434 -4273 4061 4929 1321 -3833 -3854 -67 12057 10976 -1838 -4630 -10977 -10389 -6704 2999 7767
15419 7767 11778 10369 6237 -730 -758 -1431 -3146 -1830 -8458 -14786 -10898 -6673 -379 3196 -6626
15404 -6626 -15514 -16275 -11869 778 12690 14584 17466 15700 4783 283 4149 8669 13591 5717
15390 5717 6610 2687 -2804 -11444 -4254 -7553 -7358 -4266 473 -311 443 -7089 -3492 -2710 -96 1231
15374 1231 2127 10416 16431 24239 22522 4442 -848 -1095 -3798 -1957 -3025 -4074 -1838 422 9002
15359 9002 13585 10798 3455 -1675 1497 -555 -8434 -1459 -1368 -3038 -756 1762 10508 4457 -7723
$$ packed form
15464a0727j883O665J615K816O449J855J890p353n36Q14J2998q37k450n050j1158
15449d892m146J2645Q376j127o415m465M880m839k112L994N168l324p066L44j294
15434d273Q334Q68l608n154k1L787J2124j081j2814k792o347N88L685R703M768
15419G767M011j409m132o967k8o73j715J316o628o328L888M225O294L575r822
15404f626q888p61M406J2647J1912J894K882j766j0917m500L866M520M922p874
15390E717Q93l923n491q640P190l299J95L092M739p84P54p532L597P82K614J327
15374A231Q96Q289O015P808j717j8080n290k47k703J841j068j049K236K260Q580
15359I002M583k787p343n130L172k052p879O975R1j670K282K518Q746o051j2180
$$ plain form
15344 -7723 -12262 -13282 -13287 -480 -3918 -2192 -1184 898 4435 7563 8468 8101 -593 -6789 -119 6476
15328 6476 82 1569 6145 7374 2809 -895 7808 7499 3062 -1333 -1398 5720 5258 2166 1673 1073
15312 1073 2961 6725 1881 1599 6112 1675 5548 9454 12184 17832 19237 18557 30245 45417 39568
15297 39568 35726 28218 28955 29509 34256 46546 54934 57223 57072 68985 77880 88566 101593 97818
15283 97818 104476 118780 143164 180988 227428 276827 339487 410316 482157 557319 647043 719771
15271 719771 776590 809101 802402 768592 723820 659231 584186 509501 435525 381566 330251 287991
15259 287991 245239 220423 201622 184826 169330 153865 143154 130569 119406 104303 85485
15248 85485 76644 78605 69711 60715 50612 42937 45879 44410 44040 40041 34956 30139 32745 37326
$$ packed form
15344g723m539j020nJ2807l438J726J008K082L537L128R05l67q694o196O670O595
15328F476o394J487M576J229m565l704Q703l09m437m395o5P118m62l092m93o00
15312A073J888L764m844k82M513m437L873L906K730N648J405o80J1688J5172n849
15297C9568l842p508P37N54M747J2290Q388K289j51J1913Q895J0686J3027l775
15283I7818O658J4304K4384L7824M6440M9399O2660P0829P1841P5162Q9724P2728
15271G19771N6819L2511o699l3810m4772o4589p5045p4685p3976n3959n1315m2260
15259B87991m2752k4816j8801j6796j5496j5465j0711j2585j1163j5103j8818
15248H5485q841J961q894q996j0103p675K942j469l70l999n085m817K606M581
$$ plain form
15234 37326 34616 28650 32425 30351 28800 29392 28681 31493 31428 38428 38126 22696 19721 25293 19089
15219 19089 18227 14113 9714 1656 9928 12492 5367 11371 18733 16626 -540 4918 12150 13294
15205 13294 5143 -7898 -12760 -8678 5305 9289 -1024 -4503 3646 5669 7068 6959 -530 -3237
15191 -3237 -1819 -1293 9632 5308 -1897 -8021 3545 12435 10577 -1073 -5786 6477 17711 17283
15177 17283 6439 1967 4361 10274 9913 15051 10894 14409 12797 9419 4740 -5840 -9568 -12450
15163 -12450 -12491 -2070 7744 10269 6518 8623 12087 8901 427 -10707 -9172 -4916 -7032 -3215
15149 -3215 -3319 2685 762 -1872 5881 11616 3870 6114 3197 1 -1648 5710 2805 1848 11910
15134 11910 25615 39266 43092 36749 24504 10854 9340 10958 11450 13760 6857 3627 2984 -1370
$$ packed form
15234C7326k710n966L775k074j551N92p11K812o5P000l02j5430k975N572o204
15219A9089q62m114m399q058Q272K564p125O004P362k107j7166N458P232J144
15205A3294q151j3041m862M082J3983L984j0313l479Q149K023J399j09p489k707
15191c237J418N26J0925m324p205o124J1566Q890j858j1650m713J2263J1234m28
15177A7283j0844m472K394N913l61N138m157L515j612l378m679j0580l728k882
15163a2450m1J0421R814K525l751K105L464l186q474j1134J535M256k116L817
15149c215j04O004j923k634P753N735p746K244k917l196j649P358k905r57J0062
15134A1910J3705J3651L826o343j2245j3650j514J618M92K310o903l230o43m354
$$ plain form
15120 -1370 1082 3539 9532 7236 6017 15523 17283 9208 -3665 -11430 -9928 -11490 -2483 -6871
15106 -6871 -3955 -3990 -6004 5035 9200 10902 8290 11531 12858 19496 19699 20518 11800 11251 14897 13124
15090 13124 1443 297 3202 3346 2335 5567 12623 11906 9760 9333 20288 28783 21820 14269 14865
15075 14865 8627 8967 20111 20087 15389 24347 27996 27668 30501 44437 56855 62977 69279 74867 77366
15060 77366 79901 99168 115237 134320 157896 173056 201514 247161 295262 355390 436097 516204
15048 516204 601965 686064 751888 798258 818165 806227 773761 715895 645065 571018 502425
15037 502425 436127 370488 319144 276238 243837 202167 181995 170401 159379 145585 129318
15026 129318 117000 106477 92028 77824 63362 57383 60955 56191 61108 55221 49746 54930 52383
$$ packed form
15120a370K452K457N993k296j219R506J760q075j2873p765J502j562R007m388
15106f871K916l5k014J1039M165J702k612L241J327O638K03Q19q718n49L646j773
15090A3124j1681j146K905J44j011L232P056p17k146m27J0955Q495o963p551N96
15075A4865o238L40J1144k4m698Q958L649l28K833J3936J2418O122O302N588K499
15060G7366K535J9267J6069J9083K3576J5160K8458M5647M8101O0128Q0707Q0107
15048E16204Q5761Q4099O5824M6370J9907j1938l2466n7866p0830p4047o8593
15037E02425o6298o5639n1344m2906l2401m1670k0172j1594j1022j3794j6267
15026A29318j2318j0523j4449j4204j4462n979L572m764M917n887n475N184k547
$$ plain form
15013 52383 44334 36787 32391 32739 33882 30807 27891 20601 19577 13281 12436 11467 10192 9706 13166
14998 13166 12337 17789 17275 8961 7829 15778 18273 20126 26052 26517 20612 16324 5010 4277 7900
14983 7900 7415 5820 -2359 -1656 4358 12233 13853 6145 5897 910 -8132 -8656 -6419 -2184 6984 15426
14967 15426 11043 8985 1983 -3093 5123 3334 4600 13464 9968 -4296 -1162 5912 8807 5419
14953 5419 6028 8817 3932 5818 16453 22305 18036 8507 1489 699 1046 1260 1014 1205 7651 10604
14937 10604 11724 4522 812 -130 62 7286 6444 3546 8756 7525 1188 -3281 -1324 -220 495
14922 495 5851 9659 11902 17637 14617 6719 941 -124 -6716 -16748 -10510 -3526 2057 6759 2934
14907 2934 2894 -1591 1322 11134 9308 7754 11293 7601 2682 -461 -3153 -4293 -2494 19260 31536
$$ packed form
15013E2383q049p547m396L48J143l075k916p290j024o296q45r69j275m86L460
14998A3166q29N452n14q314j132P949K495J853N926M65n905m288j1314p33L623
14983G900m85j595q179P03O014P875J620p708k48m987r042n24K237M235R168Q442
14967A5426m383k058p002n076Q216j789J266Q864l496j4264L134P074K895l388
14953E419O09K789m885J886J0635N852m269r529p018p90L47K14k46J91O446K953
14937A0604J120p202l710r42J92P224q42k898N210j231o337m469J957J104P15
14922D95N356L808K243N735l020p898n778j065o592j0032O238O984N583M702l825
14907B934m0m485K913R812j826j554L539l692m919l143k692j140J799K1754J2276
$$ plain form
14892 31536 36597 42395 37148 22737 438 -6621 -6574 -6505 -4300 -4163 -4149 -2568 7691 19477 40705
14877 40705 51924 71100 127061 207087 236126 223163 197329 154314 132678 148048 195770 237484
14865 237484 239500 201839 140028 100162 69841 52585 47521 32910 19244 7309 11939 10529
14853 10529 11266 9301 10465 20064 26487 30138 33904 37490 45843 32689 15966 13128 10437 8243
14839 8243 7605 10753 11332 6901 2474 -2665 -6459 -1322 -2247 -6861 633 7410 10618 3847 10106
14824 10106 13322 5566 -455 -5603 -3914 8706 8978 4430 4242 6287 14068 24284 32845 30443
14810 30443 27047 17150 6936 -2040 -11450 -12774 -11786 -4852 8104 18300 27662 27432 28407 31437
14796 31437 24426 25119 29958 26218 14095 637 673 13813 17315 10079 12019 8129 2873 2800 1110
$$ packed form
14892C1536N061N798n247j4411k2299p059M7O9K205J37J4J581J0259J1786K1228
14877D0705J1219J9176N5961Q0026K9039j2963k5834m3015k1636J5370M7722M1714
14865B37484K016l7661o1811l9866l0321j7256n064j4611j3666j1935M630j410
14853A0529P37j965J164R599O423L651L766L586Q353j3154j6723k838k691k194
14839H243o38L148N79m431m427n139l794N137r25m614P494O777L208o771O259
14824A0106L216p756o021n148J689J2620K72m548j88K045P781J0216Q561k402
14810C0443l396r897j0214q976r410j324R88O934J2956J0196R362k30R75L030
14796C1437p011O93M839l740j2123j3458L6J3140L502p236J940l890n256p3j690
$$ plain form
14781 1110 -1994 2989 3932 -3165 -5710 -10632 -12066 -10899 -2628 9579 3930 -4171 -11059 -5941 5125
14766 5125 7967 1736 10719 20993 23876 24405 18053 16723 23766 25163 37063 44214 53113 57350
14752 57350 68305 77485 88813 96851 103450 126903 160181 219207 310992 451196 663040 937588
14740 937588 1253140 1564507 1793456 1890093 1851852 1685641 1438756 1159357 899979 692356
14730 692356 543648 430427 348940 286613 236295 206097 174696 158867 145760 132081 121219
14719 121219 111651 105510 95242 83636 84663 77699 66326 59186 60279 60453 53243 43795 41911 32222
14705 32222 30702 28992 22352 30280 31803 30994 30113 20266 21782 32883 35095 33854 28536 15854
14691 15854 3479 7372 21473 30384 21752 17305 21650 11989 6249 3771 17317 23018 24375 35200
$$ packed form
14781A110l104M983R43p097k545m922j434J167Q271J2207n649q101o888N118J1066
14766E125K842o231Q983J0274K883N29o352j330P043J397J1900P151Q899M237
14752E7350J0955R180J1328Q038O599K3453L3278N9026R1785J40204K11844K74548
14740I37588L15552L11367K28949R6637l8241j66211k46885k79399k59378k07623
14730F92356j48708j13221q1487o2327n0318l0198l1401j5829j3107j3679j0862
14719A21219r568o141j0268j1606J027o964j1373p140J093J74p210r448j884r689
14705C2222j520j710o640P928J523q09q81r847J516J1101K212j241n318j2682
14691A5854j2375L893J4101Q911q632m447M345r661n740k478J3546N701J357J0825
$$ plain form
14677 35200 32430 28096 19809 17156 31532 35432 44652 51581 38399 27825 32254 36184 30211 26633
14663 26633 20292 23353 15868 10805 11614 14592 19376 18659 18170 19483 18031 2760 -3891 10905 16943
14648 16943 19704 15021 9009 4631 0 917 9491 5309 8455 13441 18579 8979 693 3923 1598
14633 1598 11034 19907 22071 23807 18929 14313 14655 13005 1150 -4864 -13356 -20370 -26474 -32390 -25811
14618 -25811 -17928 -13428 -4557 -4144 -7145 -2628 -1790 -7384 -10837 -8677 1182 -344 1213 181 1336
14603 1336 5889 13434 24560 28233 34578 34783 32417 35476 25941 17736 16701 14155 17597 22826 14399
14588 14399 9595 12020 14980 6163 469 -941 5080 10167 12103 11269 6467 7073 -1539 -886 7320
14573 7320 1842 -6343 -16284 -22194 -28702 -39582 -44014 -52196 -61964 -68531 -66033 -63947 -45760 -23803
$$ packed form
14677C5200k770m334q287k653J4376L900R220O929j3182j0574M429L930n973l578
14663B6633o341L061p485n063Q09K978M784p17m89J313j452j5271o651J4796O038
14648A6943K761m683o012m378m631R17Q574m182L146M986N138r600q286L230k325
14633A598R436Q873K164J736m878m616L42j650j1855o014q492p014o104n916O579
14618b5811P883M500Q871M13l001M517Q38n594l453K160R859j526J557j032J155
14603A336M553P545J1126L673O345K05k366L059r535q205j035k546L442N229q427
14588A4399m804K425K960q817n694j410O021N087J936q34m802O06q612O53Q206
14573G320n478q185r941n910o508j0880m432q182r768o567K498K086J8187K1957
$$ plain form
14559 -23803 -4203 1945 8640 13543 7547 5611 2754 7288 11011 10683 17265 15589 22704 23169 21219
14544 21219 15684 9819 12409 8516 7193 9823 14089 11407 3461 9151 9098 9150 12127 15870 18213
14529 18213 12298 12705 30100 36539 30013 32878 40692 43330 40555 40382 39297 43883 52314 55944 71246
14514 71246 97739 126479 161492 194487 227142 256335 261047 232183 205356 172207 135898 104644
14502 104644 83287 76979 68794 59401 46021 39321 40700 36641 30928 35534 36393 27689 18243 27568
14488 27568 28470 33923 40546 40206 38720 34605 39626 45539 46075 51976 49565 53525 59757 64130 61056
14473 61056 62571 65817 73866 80471 84492 75409 77850 77207 59891 47687 39776 47610 50329 52546
14459 52546 54013 63861 80432 83680 81536 79593 73423 60043 67579 69568 62878 66666 71264 62991
$$ packed form
14559b3803J9600O148O695M903n996j936k857M534L723l28O582j676P115M65j950
14544B1219n535n865K590l893j323K630M266k682p946N690n3N2K977L743K343
14529A8213n915M07J7395O439o526K865P814K638k775j73j085M586Q431L630J5302
14514G1246K6493K8740L5013L2995L2655K9193M712k8864k6827l3149l6309l1254
14502A04644k1357o308q185r393j3380o700J379m059n713M606Q59q704r446R325
14488B7568R02N453O623l40j486m115N021N913N36N901k411L960O232M373l074
14473F1056J515L246Q049O605M021r083K441o43j7316j2204p911P834K719K217
14459E2546J467R848J6571L248k144j943o170j3380P536J989o690L788M598q273
$$ plain form
14445 62991 53795 51524 48587 42340 42955 45176 36222 31056 28407 34026 32756 27919 24950 20570 21794
14430 21794 36817 52513 68763 75358 79591 79859 69655 63458 48303 25142 10640 1901 -12632
14417 -12632 -32505 -58793 -76041 -85668 -86591 -63455 -31762 9619 60354 101042 132528 146605
14405 146605 147247 138209 124727 107079 83520 71585 53569 46635 38278 31079 26497 16745 4442
14392 4442 5957 1233 -9116 -25139 -34838 -25063 -16183 3188 45028 93103 146317 193814 220756
14379 220756 236392 245456 234416 210160 194096 189286 187277 188991 184437 171169 158202 154916 157588
14366 157588 160517 159491 164733 167215 172037 186657 199779 197602 191245 186483 187089 184095 174588 161832
14352 161832 160228 151528 146085 147777 151947 166161 177164 183368 193501 194078 199563 208688 212399 219863
$$ packed form
14445F2991r196k271k937o247O15K221q954n166k649N619j270m837k969m380J224
14430B1794J5023J5696J6250O595M233K68j0204o197j5155k3161j4502q739j4533
14417a2632j9873k6288j7248r627r23K3136L1693M1381N0735M0688L1486J4077
14405A46605O42r038j3482j7648k3559j1935j8016o934q357p199m582r752j2303
14392D442J515m724j0349j6023r699R775Q880J9371M1840M8075N3214M7497K6942
14379B20756J5636R064j1040k4256j6064m810k009J714m554j3268j2967l286K672
14366A57588K929j026N242K482M822J4620J3122k177o357m762O06k994r507j2756
14352A61832j604q700n443J692M170J4214J1003O204J0133N77N485R125L711P464
$$ plain form
14338 219863 222602 222462 220242 222319 224602 219741 221226 225673 238181 244370 257918 274815 284295 295774
14324 295774 306916 310988 320399 328471 336696 347945 357450 355409 361001 377448 409798 451118 479606
14311 479606 497301 516501 536681 550745 573649 604338 622613 644604 691521 746137 800624
14300 800624 868214 929470 982770 1022507 1085224 1154459 1227334 1301707 1389124 1464555 1538256
14289 1538256 1620408 1694093 1752487 1813196 1879157 1965661 2084328 2230636 2436633 2705610
14279 2705610 3025602 3402129 3858277 4431505 5145153 6084065 7293864 8779516 10544887
14270 10544887 12546510 14780355 17314029 20399888 24522474 30696038 40740196 57500764
14262 57500764 84195412 123581576 175318747 233655270 290085061 331991868 351813930
$$ packed form
14338B19863K739j40k220K077K283m861J485M447J2508O189J3548J6897R480J1479
14324B95774J1142M072R411Q072Q225J1249R505k041N592J6447L2350M1320K8488
14311D79606J7695J9200K0180J4064K2904L0689J8275K1991M6917N4616N4487
14300H00624O7590O1256N3300L9737O2717O9235P2875P4373Q7417P5431P3701
14289A538256Q2152P3685N8394O0709O5961Q6504J18667J46308K05997K68977
14279B705610L19992L76527M56148N73228P13648R38912J209799J485652J765371
14270A0544887K001623K233845K533674L085859M122586O173564J0044158J6760568
14262E7500764K6694648L9386164N1737171N8336523N6429791M1906807J9822062
$$ plain form
14255 351813930 344594136 313889679 266764218 213430098 163361364 121900648 91430687
14248 91430687 70501543 56688272 47539949 41126888 36267043 32280394 28801064 25650138
14240 25650138 22810834 20282178 18085868 16220827 14662851 13366944 12262071 11323965
14232 11323965 10500135 9757969 9088757 8465136 7890087 7356470 6850022 6371808 5944720
14223 5944720 5572467 5231727 4922236 4648947 4416579 4211059 4011852 3812801 3634276
14214 3634276 3466298 3319066 3203182 3085989 2975237 2865427 2762065 2659962 2557824
14205 2557824 2458924 2362133 2269202 2188819 2123884 2067542 2011384 1948093 1887810 1824045 1760609
14194 1760609 1697514 1629437 1577368 1532217 1486289 1446180 1411114 1368982 1330757 1292996 1260653
$$ packed form
14255C51813930p219794l0704457m7125461n3334120n0068734m1460716l0469961
14248I1430687k0929144j3813271r148323o413061m859845l986649l479330l150926
14240B5650138k839304k528656k196310j865041j557976j295907j104873r38106
14232A1323965q23830p42166o69212o23621n75049n33617n06448m78214m27088
14223E944720l72253l40740l09491k73289k32368k05520j99207j99051j78525
14214C634276j67978j47232j15884j17193j10752j09810j03362j02103j02138
14205B557824r8900r6791r2931q0383o4935n6342n6158o3291o0283o3765o3436
14194A760609o3095o8077n2069m5151m5928m0109l5066m2132l8225l7761l2343
$$ plain form
14183 1260653 1239645 1206541 1166879 1133559 1110775 1080604 1046985 1022951 989741 949816 922597
14172 922597 906037 881853 861430 853004 847917 842451 831366 810785 786646 760407 736457 724099
14160 724099 701019 668289 635304 614267 608329 604296 606708 611296 613605 613564 622324 617061 599547
14147 599547 583027 556792 536388 506857 484867 460289 441562 429755 415990 406290 379232 353425
14135 353425 331092 314035 316879 329964 347607 379282 417125 448311 471111 485525 487092 479138
14123 479138 469200 453487 444724 428975 410464 394079 375414 358665 352882 345121 330250 312310
14111 312310 289444 259315 232337 212550 190623 177297 179473 206409 239104 275442 327905 361592
14099 361592 380509 389309 384425 378695 357257 330609 312381 297181 280583 268779 261336 244913
$$ packed form
14183A260653k1008l3104l9662l3320k2784l0171l3619k4034l3210l9925k7219
14172I22597j6560k4184k0423q426n087n466j1085k0581k4139k6239k3950j2358
14160G24099k3080l2730l2985k1037n938m033K412M588K309m1Q760n263j7514
14147E99547j6520k6235k0404k9531k1990k4578j8727j1807j3765r700k7058k5807
14135C53425k2333j7057K844J3085J7643L1675L7843L1186K2800J4414J567p954
14123D79138r938j5713q763j5749j8511j6385j8665j6749n783p761j4871j7940
14111C12310k2866l0129k6978j9787k1927j3326K176K6936L2695L6338N2463L3687
14099C61592J8917Q800m884n730k1438k6648j8228j5200j6598j1804p443j6423
$$ plain form
14087 244913 225393 212626 218971 229675 238410 241191 237348 245666 248415 242533 232222 231411 217515
14074 217515 200369 194571 184389 170380 161830 158589 147869 141237 142641 137080 139558 139545 136963 132287
14060 132287 126760 122665 115507 102910 105340 111710 118889 121045 123867 121359 118468 112071 103814 87329
14046 87329 80711 77822 70240 65437 76932 91269 91842 82414 71225 71920 66176 66690 77206 77624
14032 77624 71003 84019 106558 117892 114582 111430 93022 97676 100078 97561 99455 99161 107556 117914
14018 117914 124495 116685 101263 91860 90025 82245 77482 78820 85353 87499 103970 116917 110514
14005 110514 107423 116956 123733 113429 106669 102510 100482 89743 81569 84240 83351 75472 75358 67278
13991 67278 60815 65121 74342 70301 71041 67448 74591 81207 74487 65536 77655 84275 81975 85398
$$ packed form
14087B44913j9520j2767O345J0704Q735K781l843Q318K749n882j0311q11j3896
14074B17515j7146n798j0182j4009q550l241j0720o632J404n561K478j3k582m676
14060A32287n527m095p158j2597K430O370P179K156K822k508k891o397q257j6485
14046H7329o618k889p582m803J1495J4337N73r428j1189O95n744N14J0516M18
14032G7624o621J3016K2539J1334l310l152j8408M654K402k517J894k94Q395J0358
14018A17914O581p810j5422r403j835p780m763J338O533K146J6471J2947o403
14005A10514l091R533O777j0304o760m159k028j0739q174K671q89p879j14q080
13991F7278o463M306R221m041P40l593P143O616o720q951J2119O620k300L423
$$ plain form
13977 85398 82976 80930 71169 68040 73512 76454 85433 86979 71894 56053 50259 52163 49030 54044
13963 54044 60824 60146 54244 52446 54779 46492 51258 51999 46742 57958 73154 89898 105887 111841
13949 111841 122806 132027 138209 123225 107635 87220 73982 64554 62753 64413 67640 65840 65022
13936 65022 63792 58527 57811 61099 63416 70442 74154 68567 65321 64390 62629 52472 45651 37282 44730
13921 44730 49240 54065 59791 58394 44579 33933 35205 37822 37313 25203 20595 25341 35093 33284
13907 33284 43253 45559 55694 64804 53848 42738 44608 52406 58041 52317 52950 43023 34192 41770
13893 41770 54400 66253 68265 55665 38117 36143 36511 29205 31306 28908 29606 28746 22732 16988
13879 16988 14105 28834 48050 49500 44243 37157 38450 36090 38288 34734 32837 35780 39847 39014
$$ packed form
13977H5398k422k046r761l129N472K942Q979J546j5085j5841n794J904l133N014
13963E4044O780o78n902j798K333q287M766P41n257J1216J5196J6744J5989N954
13949A11841J0965R221O182j4984j5590k0415j3238r428j801J660L227j800q18
13936F5022j230n265p16L288K317P026L712n587l246r31j761j0157o821q369P448
13921D4730M510M825N726j397j3815j0646J272K617n09j2110m608M746R752j809
13907C3284R969K306J0135R110j0956j1110J870P798N635n724O33r927q831P578
13893D1770J2630J1853K012j2600j7548j974L68p306K101k398O98q60o014n744
13879A6988k883J4729J9216J450n257p086J293k360K198l554j897K943M067q33
$$ plain form
13865 39014 36728 34434 36066 42407 43410 35957 23487 11322 17992 23158 25929 39917 44402 36589
13851 36589 26298 23363 24000 29492 33863 38013 38391 30559 23572 11243 9340 9977 8861 9045 5302
13836 5302 12027 20673 19566 21636 25737 27340 31006 25562 23183 21635 28704 27723 26234 21201 25243
13821 25243 38773 45108 35458 28243 21686 22042 30134 29733 27956 36474 35383 40246 43219 43222 45324
13806 45324 46321 48057 43000 31600 35181 32937 29234 38338 38992 30260 23115 21361 25546 25816 24755
13791 24755 26001 30403 33415 35586 38186 40377 44836 44696 44839 60334 79377 90969 114469 143265
13777 143265 171100 214404 311012 470888 681053 947788 1260426 1556937 1786955 1900522
13767 1900522 1863365 1706898 1460688 1180834 912491 690703 525475 403438 321872 267329
$$ packed form
13865C9014k286k294J632O341J003p453j2470j2165O670N166K771J3988M485p813
13851C6589j0291k935O37N492M371M150L78p832o987j2329j903O37j116J84l743
13836E302O725Q646j107K070M101J603L666n444k379j548P069r81j489n033M042
13821B5243J3530O335r650p215o557L56Q092m01j777Q518j091M863K973LK102
13806D5324R97J736n057j1400L581k244l703R104O54q732p145j754M185K70j061
13791B4755J246M402L012K171K600K191M459j40J43J5495J9043J1592K3500K8796
13777A43265K7835M3304R6608J59876K10165K66735L12638K96511K30018J13567
13767A900522l7157j56467k46210k79854k68343k21788j65228j22037q1566n4543
$$ plain form
13757 267329 230099 210576 198905 184607 158813 148004 145326 138554 128323 104707 97169 96613
13745 96613 95072 80281 74236 71799 72957 71332 65834 51177 48324 49776 52620 54664 50090 41921
13731 41921 34005 34775 38807 47409 42725 46537 50492 44371 40228 42659 41828 37295 36663 29528 27284
13716 27284 31191 31127 20579 23966 21683 24440 31920 38093 41791 46135 40487 32347 30210 27016 27932
13701 27932 20691 25597 27910 25827 21561 28547 27716 23238 26855 30315 24436 27066 27711 32426 30500
13686 30500 32178 46013 50516 51157 51937 47095 38695 29577 27539 30067 34293 40162 43073 38979 36291
13671 36291 37720 33092 33007 23234 6856 3330 2027 1117 1749 8019 19312 28476 18232 19579 19164
13656 19164 21736 12499 17454 24045 30727 38309 39925 32994 28867 39674 44223 46696 42230 32128
$$ packed form
13757B67329l7230j9523j1671j4298k5794j0809k678o772j0231k3616p538n56
13745I6613j541j4791o045k437J158j625n498j4657k853J452K844K044m574q169
13731D1921p916P70M032Q602m684L812L955o121m143K431q31m533o32p135k244
13716B7284L907o4j0548L387k283K757P480O173L698M344n648q140k137l194R16
13701B7932p241M906K313k083m266O986q31m478L617L460n879K630O45M715j926
13686C0500J678J3835M503O41P80m842q400r118k038K528M226N869K911m094k688
13671C6291J429m628q5r773j6378l526j303r10O32O270J1293R164j0244J347m15
13656A9164K572r237M955O591O682P582J616o931m127J0807M549K473m466j0102
$$ plain form
13642 32128 28201 24936 23737 26493 21709 19238 16435 16266 13762 13610 13688 18971 21818 20931 17354 9843
13626 9843 -929 3653 15981 15563 8315 9164 11344 16819 16581 11292 7186 14099 11103 9254 13889
13611 13889 22473 20201 18781 20932 20449 10011 14044 20578 24190 19748 23089 9436 -1825 5316
13597 5316 20643 29006 27970 28590 20398 13750 12335 10141 12140 14113 11320 8152 17296 15605 7061
13582 7061 18383 26508 22144 18224 15791 18096 7835 8539 16111 18483 13392 2605 -2167 465
13568 465 2317 9654 3499 -1160 6699 5386 4484 3178 808 -833 -272 6766 19310 19009 25218
13553 25218 20634 10325 730 -571 -7319 -7609 -8665 -13048 -12197 -4312 -1889 -2675 -1837 5964 10974
13538 10974 17372 12329 12424 23843 27474 24800 28309 29179 28788 35959 38740 26062 15423 19961 19570
$$ packed form
13642C2128l927l265j199K756m784k471k803j69k504j52P8N283K847q87l577p511
13626I843j0772M582J2328m18p248Q49K180N475k38n289m106O913k996j849M635
13611A3889Q584k272j420K151m83j0438M033O534L612m442L341j3653j1261P141
13597E316J5327Q363j036O20q192o648j415k194J999J973k793l168R144j691q544
13582G061J1322Q125m364l920k433K305j0261P04P572K372n091j0787m772K632
13568D65J852P337o155m659P859j313r02j306k370j641N61P038J2544l01O209
13553B5218m584j0309r595j301o748k90j056m383Q51P885K423p86Q38P801N010
13538A0974O398n043R5J1419L631k674L509Q70l91P171K781j2678j0639M538l91
$$ plain form
13523 19570 26587 27662 22936 11235 7106 9257 10528 12508 13844 20166 20651 17587 12508 11114
13509 11114 15847 15905 2005 3973 7583 6497 7147 3849 -1353 5882 17127 11820 13380 19930 26269
13494 26269 29109 25201 20322 19278 11454 1587 -3714 3954 9706 9138 5842 8686 10690 3891 -1879
13479 -1879 -7894 -1114 5633 8028 4141 3152 9027 7226 -921 -4670 -5040 -165 2576 1700 2319 12237
13463 12237 17868 20777 17828 16094 7400 2326 9597 16646 17305 15719 17821 17067 16905 13740 15995
13448 15995 11534 17083 16216 18201 28338 36089 31935 20946 12079 14111 15988 14100 12334 6293
13434 6293 -6194 -4441 2054 10828 10401 10010 3741 134 1914 5438 9438 15912 15602 6543 -1001
13419 -1001 -442 5037 11399 2717 -3998 572 3954 1618 2249 9702 15536 22159 14864 2700 -3939
$$ packed form
13523A9570P017J075m726j1701m129K151J271J980J336O322M85l064n079j394
13509A1114M733N8j3900J968L610j086O50l298n202P235J1245n307J560O550O339
13494B6269K840l908m879j044p824r867n301P668N752n68l296K844K004o799n770
13479a879o015O780O747K395l887r89N875j801q147l749l70M875K741q76O19R918
13463A2237N631K909k949j734q694n074P271P049O59j586K102p54j62l165K255
13448A5995m461N549q67J985J0137P751m154j0989q867K032J877j888j766o041
13434F293j2487J753O495Q774m27l91o269l607J780L524M000O474l10r059p544
13419a001N59N479O362q682o715M570L382k336O31P453N834O623p295j2164o639
$$ plain form
13404 -3939 -3860 1035 9539 11796 7506 8872 5909 4825 -2433 6702 17082 24571 30545 19198 20695
13389 20695 20203 22181 21252 11018 10604 13293 19689 14126 11366 17415 21094 22375 18899 14894 13879
13374 13879 21272 27101 24446 14986 13045 12116 14891 23970 21140 7226 10903 12555 13097 23715
13360 23715 35046 36022 35330 24945 11601 11225 14909 19649 11204 14765 14043 16991 17524 6139 -1613
13345 -1613 1403 2871 -5763 -3722 -9164 -10373 -14399 -6986 7018 8673 7199 7924 16221 19187 17012
13330 17012 10102 3118 6186 14915 14662 14100 22261 11125 2655 7294 8687 6785 5168 8361 11072
13315 11072 13093 6770 9638 11468 16240 18130 9697 3470 3531 -897 -7381 806 9135 12834 2384
13300 2384 7055 15402 14706 11322 3495 -10546 -6519 572 6803 10925 20920 35869 36006 30183 19369
$$ packed form
13404c939P9M895Q504K257m290J366k963j084p258R135J0380P489N974j1347J497
13389B0695m92J978r29j0234m14K689O396n563k760O049L679J281l476m005j015
13374A3879P393N829k655r460j941r29K775R079k830j3914L677J652N42J0618
13360B3715J1331R76o92j0385j3344l76L684M740q445L561p22K948N33j1385p752
13345a613L016J468q634K041n442j209m026P413J4004J655j474P25Q297K966k175
13330A7012o910o984L068Q729k53n62Q161j1136q470M639J393j902j617L193K711
13315A1072K021o323K868J830M772J890q433o227O1m428o484Q187Q329L699j0450
13300B384M671Q347o96l384p827j4041M027P091O231M122R995J4949J37n823j0814
$$ plain form
13285 19369 16389 11898 20628 27802 21794 17739 13532 10942 9818 4527 -3379 -5127 -785 5899
13271 5899 7221 -425 -9240 -4334 8161 14420 23648 26571 18068 18946 22410 10083 2097 11311
13257 11311 17933 9394 11631 16119 13959 26193 29138 23195 19351 21147 16167 8708 4740 8850
13243 8850 18992 19468 19592 19748 14486 2095 858 2251 2349 1687 335 1490 6850 10686 11705 17159
13227 17159 17341 11059 8320 16274 13874 14699 15792 11523 10886 19014 24015 24364 29094 20448 4590
13212 4590 4299 8833 14553 23746 24888 19731 13240 15481 15911 23934 20216 19391 13661 8117 8707 10261
13196 10261 6289 13999 14851 12449 10462 24965 34536 28864 25899 17727 15980 15649 18730 23898 16142
13181 16142 3555 -8245 -13831 -13383 -1780 6308 5369 5105 10357 13994 7932 2180 -3784 -1575
$$ packed form
13285A9369k980m491Q730P174o008m055m207k590j124n291p906j748M342O684
13271E899J322p646q815M906J2495O259R228K923q503Q78L464j2327p986R214
13257A1311O622q539K237M488k160J2234K945n943l844J796m980p459l968M110
13243H850J0142M76J24J56n262j2391j237J393R8o62j352J155N360L836J019N454
13227A7159J82o282k739P954k400Q25J093m269o37Q128N001L49M730q646j5858
13212D590k91M534N720R193J142n157o491K241M30Q023l718q25n730n544N90J554
13196A0261l972P710Q52k402j987J4503R571n672k965q172j747l31L081N168p756
13181A6142j2587j1800n586M48J1603Q088r39k64N252L637o062n752n964K209
$$ plain form
13167 -1575 5719 10324 14334 11314 13327 17444 16454 18602 9288 14787 6856 -4074 -8723 -2719 -1461
13152 -1461 -5520 -10509 -3396 -1306 -268 6185 4480 7342 5518 4823 -308 6041 5600 -2284 -2253 -2591
13136 -2591 -2170 1283 10095 3049 1250 5886 11800 12757 7959 9934 15401 12968 6996 3765 1279
13121 1279 2268 5253 1909 2552 2907 7229 1765 -6711 -10529 -2875 -523 8571 10827 9480 3199
13106 3199 5072 4970 1776 8283 11397 8265 7183 11673 8546 8484 13770 17447 16640 6464 3814
13091 3814 -772 -12920 -11527 -9635 -10738 -12800 -17963 -7332 390 -2517 -7178 10 5481 6396
13077 6396 14603 13440 12733 7237 6505 -1450 -410 -5606 -14867 -9103 -1837 164 10026 16731 18151
13062 18151 9588 -7793 -8445 -3941 -7522 -10136 -3187 -4669 -7649 -9457 -5371 958 4040 6827
$$ packed form
13167a575P294M605M010l020K013M117r90K148r314N499p931j0930m649O004J258
13152a461m059m989P113K090J038O453j705K862j824o95n131O349m41p884L1l38
13136b591M21L453Q812p046j799M636N914R57m798J975N467k433n972l231k486
13121A279R89K985l344O43L55M322n464q476l818P654K352R094K256j347o281
13106C199J873j02l194O507L114l132j082M490l127o2N286L677q07j0176k650
13091C814m586j2148J393J892j103k062n163J0631P722k907m661P188N471R15
13077F396Q207j163p07n496p32p955J040n196r261N764P266K001R862O705J420
13062A8151q563j7381o52M504l581k614O949j482k980j808M086O329L082K787
$$ plain form
13048 6827 5461 13845 5793 6402 -1574 -3895 7577 16178 10144 14077 22693 21630 16968 8827 -6
13033 -6 11330 6751 -3806 -1875 -1353 2280 13237 11717 5297 4873 3062 -3236 6507 8516 8651
13018 8651 5361 5375 2253 1826 15740 20963 16992 10527 7109 -2850 -11350 -9216 -2682 5303 7828
13003 7828 14120 7960 2699 4478 146 1133 1567 3012 -813 1557 407 -5727 -8599 -5682 -194
12988 -194 8505 24691 37186 23505 19081 17019 8348 -7398 -8641 5627 5085 -630 -612 2538
12974 2538 1920 15973 11912 3373 973 -8942 5732 8852 3563 671 -16617 -8697 7497 7910
12960 7910 9695 9324 -7501 -7728 -11499 -14005 -2948 -717 -3830 -6538 -2972 5998 10727 11167 8907
12945 8907 4288 -3977 -10814 -10478 -12766 -8666 -1664 -943 6537 3277 484 10747 13970 16548 8673
$$ packed form
13048F827j366Q384q052O09p976k321J1472Q601o034L933Q616j063m662q141q833
13033fJ1336m579j0557J931N22L633J0957j520o420m24j811o298R743K009J35
13018H651l290J4l122m27J3914N223l971o465l418r959q500K134O534P985K525
13003G828O292o160n261J779m332R87M34J445l825K370j150o134k872K917N488
12988a94Q699J6186J2495j3681m424k062q671j5746j243J4268n42n715J8L150
12974B538o18J4053m061q539k400r915J4674L120n289k892j7288P920J6194M13
12960G910J785l71j6825k27l771k506J1057K231l113k708L566Q970M729M40k260
12945H907m619q265o837L36k288M100P002P21P480l260k793J0263L223K578p875
$$ plain form
12930 8673 -1414 -2640 3591 6989 1926 -2499 -2011 -6606 4883 9232 11016 19771 21211 15709
12916 15709 12316 11778 1001 4650 5675 7250 727 1704 1567 -5090 -8713 -8200 -8426 -201 294 -4931
12900 -4931 -7626 -6704 -418 5986 4199 -2046 1552 -6767 -10227 -3390 9226 8824 6355 13963 9123
12885 9123 8497 14762 12447 7745 3447 -14417 -16946 -10635 1712 3549 -5220 -6546 -6928 -3369 -447
12870 -447 1645 -641 -504 -7938 -7496 -3413 5392 4454 319 968 -7404 -116 6265 6155 -1778 -10454
12854 -10454 -9942 -6313 -2094 1939 4914 13274 3476 5421 3183 736 5270 6076 2071 -1621 -7822
12839 -7822 -2314 3625 4163 1189 -4724 -4166 -1290 1166 2597 2260 7855 3708 -2585 -694 -8334
12824 -8334 -18542 -15028 -6809 -2187 -228 -4974 -3844 1192 -3359 -3141 -7790 -10222 -8732 -7350 -6361
$$ packed form
12930H673j0087j226O231L398n063m425M88m595J1489M349J784Q755J440n502
12916A5709l393n38j0777L649J025J575o523R77j37o657l623N13k26Q225M95n225
12900d931k695R22O286O404j787o245L598q319l460O837J2616m02k469P608m840
12885I123o26O265k315m702m298j7864k529O311J2347J837q769j326l82L559K922
12870d47K092k286J37p434M42M083Q805r38m135O49q372P288O381j10p933q676
12854a0454N12L629M219M033K975Q360r798J945k238k447M534Q06m005l692o201
12839g822N508N939N38k974n913N58K876K456J431l37N595m147o293J891p640
12824h334j0208L514Q219M622J959m746J130N036m551K18m649k432J490J382R89
$$ plain form
12809 -6361 -2459 8427 11089 10643 12833 8610 5669 8155 12956 14144 16498 20701 17654 14243 12710
12794 12710 -3114 -2251 -5213 -13619 -10265 -9869 -4209 2034 1816 323 -3019 -6979 -656 14041 22905
12779 22905 13997 -4338 -9647 -3453 7931 15756 10811 1108 -1203 1828 -6466 -10953 -7377 -2397
12765 -2397 3708 10078 12653 11527 14143 6006 -172 -1096 -3820 1851 7531 3024 5415 13287 7480
12750 7480 7303 9652 1747 -5949 -5720 -7153 -8917 -4670 1236 2723 4874 1394 602 14835 24658
12735 24658 28933 30112 33567 41951 35626 22801 16896 18286 26028 26556 29918 25224 19446 17850
12721 17850 12220 10831 15534 19651 16151 8993 11369 12048 14163 13514 9777 9083 13231 14352 24633
12706 24633 22046 20794 15758 11492 12905 15713 18391 14650 7557 12633 17580 23237 24187 21875 11146
$$ packed form
12809f361L902J0886K662m46K190m223k941K486M801J188K354M203l047l411j533
12794A2710j5824Q63k962q406L354L96N660O243k18j493l342l960O323J4697Q864
12779B2905q908j8335n309O194J1384P825m945r703k311L031q294m487L576M980
12765b397O105O370K575j126K616q137o178r24k724N671N680m507K391P872n807
12750G480j77K349p905p696K29j433j764M247N906J487K151l480p92J4233R823
12735B4658M275J179L455Q384o325j2825n905J390P742N28L362m694n778j596
12721A7850n630j389M703M117l500p158K376O79K115o49l737o94M148J121J0281
12706B4633k587j252n036m266J413K808K678l741p093N076M947N657R50k312j0729
$$ plain form
12691 11146 5115 6803 13691 18176 8771 3321 11348 3484 2144 650 11630 12669 18313 26330
12677 26330 21397 11711 9394 10584 17640 13584 10368 4852 9120 15579 11984 10679 9591 8409
12663 8409 10866 13953 13403 3618 6928 8543 6604 7101 9326 7483 4721 3176 92 -2502 -10195
12648 -10195 -13561 -5290 4675 14533 11884 6394 1453 5044 2626 -12391 -7577 -1464 696 2028
12634 2028 6091 2873 -11590 -16171 -7126 1864 7191 4163 559 4001 3814 6381 7831 196 -3865
12619 -3865 1744 2541 3064 -3581 -6858 -7505 -615 3744 5798 -1899 -9399 -4427 -5442 229 16603
12604 16603 25248 28431 27605 16008 3616 10837 7672 6207 8993 9550 5192 -1047 4325 2486
12590 2486 -1101 4241 4121 -990 -3014 -5628 -3264 2420 14102 4166 -8127 -9767 2351 4178
$$ packed form
12691A1146o031J688O888M485r405n450Q027p864j340j494J0980J039N644Q017
12677B6330m933r686k317J190P056m056l216n516M268O459l595j305j088j182
12663H409K457L087n50r785L310J615j939M97K225j843k762j545l084k594p693
12648a0195l366Q271R965R858k649n490m941L591k418j5017M814O113K160J332
12634B028M063l218j4463m581R045Q990N327l028l604L442j87K567J450p635m061
12619c865N609P97N23o645l277o47O890M359K054p697p500M972j015N671J6374
12604A6603Q645L183q26j1597j2392P221l165j465K786N57m358o239N372j839
12590B486l587N342j20n111k024k614K364N684J1682r936j2293j640J2118J827
$$ plain form
12576 4178 -149 -3998 5165 1477 1073 -8663 -8900 4564 6954 2808 2860 -3404 -14800 -13685 -7380
12561 -7380 937 5248 4775 -4730 -4211 -3646 5814 11853 6330 9500 14477 12624 11640 14748 20137 23050
12545 23050 15542 4902 -1519 1215 -2895 1000 6628 15871 21121 28933 24095 11545 8602 12426
12531 12426 17798 26057 21197 11453 295 873 -3443 -2132 -5180 4221 -1170 -6481 1744 4280
12517 4280 -4024 -8042 2165 6355 4436 53 -3508 -4109 2125 -1224 999 21644 28970 21722
12503 21722 15806 20180 30871 28923 26090 23428 22744 21394 10128 4202 -1514 -1813 737 6712
12489 6712 2197 -8118 -4454 -1993 -2293 -2393 -5288 -391 -4965 -2159 -7645 -11635 -21213 -16564 -3365
12474 -3365 -3315 -3348 6088 3050 1748 7009 1835 2355 12169 15670 13557 23237 25813 11558 3257 9685
$$ packed form
12576D178m327l849R163l688m04r736k37J3464K390m146N2o264j1396J115O305
12561g380Q317M311m73r505N19N65R460O039n523L170M977j853r84L108N389K913
12545B3050p508j0640o421K734m110L895N628R243N250P812m838j2550k943L824
12531A2426N372Q259m860r744j1158N78m316J311l048R401n391n311Q225K536
12517D280q304m018J0207M190j919m383l561o01O234l349K223K0645P326p248
12503B1722n916M374J0691j948k833k662o84j350j1266n926n716k99K550N975
12489F712m515j0315L664K461l00j00k895M897m574K806n486l990r578M649J3199
12474c365N0l3R436l038j302N261n174N20R814L501k113R680K576j4255q301O428
$$ plain form
12458 9685 14790 4586 -4447 -526 4332 -4279 -14429 -12450 -4816 -5851 -7877 -5054 476 4002
12444 4002 4914 2622 -3222 -6336 -3568 -396 5749 5804 1123 579 -3601 5480 5783 -3770 -6078 -6196
12428 -6196 -917 -5465 -10531 -14034 -3661 343 -1824 617 9583 11014 9834 4573 2714 2631 -4633
12413 -4633 -10432 -12028 -1913 1477 1922 -4230 -6686 -9211 -6970 -3758 -3348 -4841 -978 -1303 5515
12398 5515 10181 12549 9719 5843 3457 10300 15074 17830 22748 13112 7901 9450 14392 23280 19589
12383 19589 8001 2606 5388 2865 -4041 7091 19844 16036 7166 -818 -5126 -3537 -9203 -6331
12369 -6331 -915 3128 -1731 -7299 8743 8749 -3514 -3580 273 3352 -4210 -7120 -5710 6318 5446
12354 5446 8957 7218 3792 4270 4019 7852 6709 8397 10583 3476 10404 15235 6121 8775 14572
$$ packed form
12458I685N105j0204r033L921M858q611j0150J979P634j035k026K823N530L526
12444D002R12k292n844l114K768L172O145N5m681n44m180R081L03r553k308j18
12428f196N279m548n066l503J0373M004k167K441Q966J431j180n261j859q3p264
12413d633n799j596J0115L390M45o152k456k525K241L212M10j493L863l25O818
12398E515M666K368k830l876k386O843M774K756M918r636n211J549M942Q888l691
12383A9589j1588n395K782k523o906J1132J2753l808q870p984m308J589n666K872
12369f331N416M043m859n568J6042Oj2263o6L853L079p562k910J410J2028q72
12354E446L511j739l426M78k51L833j143J688K186p107O928M831r114K654N797
$$ plain form
12339 14572 17568 15198 19881 25296 25237 13828 2907 -4836 -4997 -5105 -2324 10080 6154 -4840
12325 -4840 -11656 -5996 7758 9945 9655 19305 21696 19755 9966 5490 -1071 -629 -4011 -9798 -7746
12310 -7746 -3682 -5334 -3324 -3960 -7523 -22483 -19282 -6371 3944 1465 5870 1116 122 1880
12296 1880 1432 -4106 5164 3122 -496 5434 7176 -668 -5539 879 1130 3610 9090 -3523 -4092
12281 -4092 -4067 -7920 4051 8604 11008 2636 4374 7569 1478 -6690 -16105 -16965 -12525 -5639 7059
12266 7059 1504 -7558 -8702 -5871 -4795 -3480 -770 -3681 -4966 -3299 4073 -2825 3045 4749 836
12251 836 -1726 -3637 -915 -1771 -9859 -9706 4195 6678 5879 8335 -1662 -4022 -1483 -81 -4312
12236 -4312 -3868 -718 10664 20030 16806 16250 14518 2878 -10558 -8866 8957 12647 10069 6836
$$ packed form
12339A4572K996k370M683N415n9j1409j0921p743j61j08K781J2404l926j0994
12325d840o816N660J3754K187k90R650K391j941r789m476o561M42l382n787K052
12310g746M064j652K010o36l563j4960L201J2911J0315k479M405m754r94J758
12296A880m48n538R270k042l618N930J742p844m871O418K51K480N480j2613n69
12281d092K5l853J1971M553K404q372J738L195o091q168r415q60M440O886J2698
12266G059n555r062j144K831J076J315K710k911j285J667P372o898N870J704l913
12251H36k562j911K722q56q088J53J3901K483p99K456r997k360K539J402m231
12236d312M44L150J1382R366l224n56j732j1640j3436J692J7823L690k578l233
$$ plain form
12222 6836 11868 13874 11016 10847 4564 -3653 -2813 -6044 -9066 -7140 -11562 -10752 993 3024 3180
12207 3180 7570 15978 14669 13047 10271 13882 15693 4815 698 2659 909 -5448 -2115 -1580 -2483
12192 -2483 7682 13501 13803 12280 9435 3837 7368 8814 10186 11547 15085 12900 2294 -7248
12178 -7248 -5766 6501 5361 -3016 -5142 -611 5488 268 5030 6904 3451 -53 232 -7416 -13741
12163 -13741 -20811 -12787 -5958 -4709 -8442 -10211 -4900 -6422 -7886 2455 17261 10241 10640 8155
12149 8155 -7081 -8229 1070 4568 1838 -1683 3241 8588 -7392 1118 12377 14171 17399 13354
12135 13354 12727 13854 12104 5444 978 4853 11188 12400 4332 327 -1896 -5976 -13935 -14278 -18604
12120 -18604 -15318 -4359 2135 -1722 -7305 -9860 -14856 -5011 1354 -487 1136 -26 1025 3324
$$ packed form
12222F836N032K006k858j69o283q217Q40l231l022J926m422Q10J1745K031J56
12207C180M390Q408j309j622k776L611J811j0878m117J961j750o357L333N35r03
12192b483J0165N819L02j523k845n598L531J446J372J361L538k185j0606r542
12178g248J482J2267j140q377k126M531O099n220M762J874l453l504K85p648o325
12163a3741p070Q024O829J249l733j769N311j522j464J0341J4806p020L99k485
12149H155j5236j148R299L498k730l521M924N347j5980Q510J1259J794L228m045
12135A3354o27J127j750o660m466L875O335J212q068m005k223m080p959l43m326
12120a8604L286J0959O494l857n583k555m996R845O365j841J623j162J051K299
$$ plain form
12106 3324 -1385 -6109 -4022 -4003 -4040 -7351 -4665 -4846 -9422 -9151 -12151 -8487 -1635 982 4999 1841
12090 1841 -5312 -11668 -3478 -6073 -7818 -3735 -4393 -15010 -13223 -13805 -7374 -2534 -5768 -11587 -11517
12075 -11517 -162 3437 8457 6658 -9139 -17792 -15892 -19137 -23040 -16655 -9777 -3033 -5335 -9539
12061 -9539 -1805 616 -5801 -7706 -1318 -5711 -1295 -2941 -12634 -12187 -1734 -2184 -3930 -5542 -11578
12046 -11578 1434 6376 2683 7214 5072 12304 19540 8443 7487 4105 -2867 -98 1277 -3189
12032 -3189 2796 5975 -3583 -10155 -8725 -9424 -4695 7328 14573 19551 17171 14184 8042 7437 13403
12017 13403 8922 10052 4536 1620 -4018 -11146 -3550 8473 15058 19825 15648 12492 3618 -6466
12003 -6466 -5164 911 5574 515 4694 -3253 -14514 -7681 4415 9500 12672 14709 9633 -4877
$$ packed form
12106C324m709m724K087J9l7l311K686j81m576K71l000L664O852K617M017l158
12090A841p153o356Q190k595j745M083o58j0617J787n82O431M840l234n819P0
12075a1517J1355L599N020j799j5797q653J900l245l903O385O878O744k302m204
12061i539P734K421o417j905O388m393M416j646r693M47J0453m50j746j612o036
12046a1578J3012M942l693M531k142P232P236j1097r56l382o972K769J375m466
12032c189N985L179r558o572J430o99M729J2023P245M978k380k987o142o05N966
12017A3403m481J130n516k916n638p128P596J2023O585M767m177l156q874j0084
12003f466J302O075M663n059M179p947j1261O833J2096N085L172K037n076j4510
$$ plain form
11989 -4877 -8473 4668 9549 4124 5248 8317 8913 -1393 -7829 -13533 -15219 -14943 -12912 -11893 -6122
11974 -6122 -1338 -6027 -7368 -10607 -11033 -9654 -11838 -6422 -6288 1147 11777 14450 11362 11511 22262
11959 22262 27054 26523 22494 12945 6585 2358 2742 8760 7368 6197 15513 9616 -1501 -11376 -9398
11944 -9398 3343 291 4595 5197 -3357 -11672 113 6840 9410 4509 3773 12311 23305 35139
11930 35139 29756 16236 19939 22948 19747 13523 10071 1270 1009 9181 10288 1331 -1006 -6143
11916 -6143 -3469 3597 -3020 -14280 -15524 -11986 -3919 5715 3134 2653 6442 1304 -7791 313 2701
11901 2701 -4661 -521 -2472 1286 8759 13927 11388 3407 2806 4102 -1034 319 -5822 -1871 -690
11886 -690 -3821 658 3967 12136 6047 2473 -7396 -14728 -15556 -10878 -7811 -10093 604 4517 2997
$$ packed form
11989d877l596J3141M881n425J124L069N96j0306o436n704j686K76K031J019N771
11974f122M784m689j341l239m26J379k184N416J34P435J0630K673l088J49J0751
11959B2262M792n31m029r549o360m227L84O018j392j171R316n897j1117r875J978
11944i398J2741l052M304O02q554q315J1785O727K570m901p36Q538J0994J1834
11930C5139n383j3520L703L009l201o224l452q801k61Q172J107q957k337n137
11916f143K674P066o617j1260j244L538Q067R634k581m81L789n138r095Q104K388
11901B701p362M140j951L758P473N168k539p981o01J296n136J353o141L951J181
11886f90l131M479L309Q169o089l574r869p332q28M678L067k282J0697L913j520
$$ plain form
11871 2997 -5490 -4158 -13063 -17994 -10390 302 7308 6798 -4888 -9561 -5558 2163 15407 11408
11857 11408 5682 4625 -2753 -13332 -14385 -9920 2858 4411 -3149 -1663 1709 -584 6479 -138
11843 -138 -1123 -9392 -6405 -12100 -14211 -7206 -1457 2105 2456 4829 1563 7938 8686 3429 -1771 9937
11827 9937 17919 8438 1724 -6656 -9522 -14057 -9437 -4237 -10725 -16619 -4778 -6685 -8054 -7192 -12813
11812 -12813 -5578 6606 20235 22168 12871 -5178 -10674 -13967 -8803 1678 4616 -12628 -14444
11799 -14444 -6986 -4255 3652 7232 2826 101 2161 -157 -8515 -10438 -3628 -9843 -2958 -3444 -5509
11784 -5509 -13348 -20593 -18057 -6622 -7821 -5378 -14470 -19465 -14351 -15029 -14253 -12177 -6793 -1968 3468
11769 3468 5666 2639 1687 389 -7322 -7069 -11326 -10720 -4754 6083 9145 -1837 -8068 -2654 -1587
$$ packed form
11871B997q487J332q905m931P604J0692P006n10j1686m673M003P721J3244l999
11857A1408n726j057p378j0579j053M465J2778J553p560J486L372k293P063o617
11843a38r85q269K987n695k111P005N749L562L51K373l266O375P48n257n200J1708
11827I937P982r481o714q380k866m535M620N200o488n894J1841j907j369Q62n621
11812a2813P235J2184J3629J933r297j8049n496l293N164J0481K938j7244j816
11799a4444P458K731P907L580m406k725K060k318q358j923O810o215O885m86k065
11784e509p839p245K536J1435j199K443r092m995N114o78P76K076N384M825N436
11769C468K198l027r52j298p711K53m257O06N966J0837L062j0982o231N414J067
$$ plain form
11754 -1587 -5541 -5731 -4568 1987 6246 11360 11622 8826 9534 6045 -4283 -9689 -12168 -3570 3712
11739 3712 -1126 -6710 1139 11348 7370 255 -7047 6219 12308 13441 16203 17770 21745 5797
11725 5797 -3527 7024 7159 2070 -6971 -14896 -21722 -20381 -15933 -14075 -14785 -12459 -3358 2206 6007
11710 6007 15550 19532 15719 11131 13632 8989 883 -5442 -2298 -1404 423 -1180 -12676 -14472 -6218
11695 -6218 -6428 -8904 -5830 99 -1226 -2099 -739 308 -1728 5487 -2099 -7185 -18687 -15421 -14330
11680 -14330 -21780 -20063 -23820 -18119 -13403 -12631 -10055 -3025 -6402 -5036 -13383 -18302 -9013 -2879 -4242
11665 -4242 -1444 -9831 -10459 -5670 1612 -614 135 8419 10678 5159 2235 9943 24549 24680 16916
11650 16916 -1817 -12912 -5437 10087 11681 -1238 -8450 -4717 1294 9036 1130 178 5635 11244
$$ packed form
11754a587l954j90J163O555M259N114K62k796P08l489j0328n406k479Q598P282
11739C712m838n584P849J0209l978p115p302J3266O089J133K762J567L975j5948
11725E797r324J0551J35n089r041p925o826J341M448J858p10K326R101N564L801
11710F007R543L982l813m588K501m643q106o325L144Q94J827j603j1496j796Q254
11695f218k10k476L074N929j325q73J360J047k036P215p586n086j1502L266J091
11680a4330p450J717l757N701M716P72K576P030l377J366q347m919R289O134j363
11665d242K798q387o28M789P282k226P49Q284K259n519k924P708J4606J31p764
11650A6916j8733j1095P475J5524J594j2919p212L733O011P742p906r52N457N609
$$ plain form
11636 11244 21539 19678 3820 760 7547 6734 -4262 -663 8640 3823 -643 -4617 -11469 -10849
11622 -10849 -3515 2166 727 -12769 -26314 -27359 -23759 -13253 -11818 -17578 -9425 -3793 2284 -4552
11608 -4552 -11114 -19915 -16032 2074 4482 7096 7101 5110 8623 6536 2939 11685 15266 5426 13937
11593 13937 12375 60 -8393 1528 6756 3875 2950 989 -13902 -11021 -2285 -7716 -14838 -13770
11579 -13770 -3143 2003 -2811 33 -9603 -21850 -15251 -3803 1409 -1814 -1172 4434 10233 13519
11565 13519 11859 14420 14764 10712 22307 34336 38354 41623 47898 69837 114019 158264 214547
11552 214547 262288 268635 237668 188330 133340 94198 70522 57442 50360 49746 42970 29301
11540 29301 14849 9196 2788 -2253 1485 4036 10055 5829 4579 1750 -1006 -377 5333 2125
$$ packed form
11636A1244J0295j861j5858l060O787q13j0996L599R303m817m466l974o852O20
11622a0849P334N681j439j3496j3545j045L600J0506J435n760Q153N632O077o836
11608d552o562q801L883J8106K408K614Nj991L513k087l597Q746L581r840Q511
11593A3937j562j2315q453R921N228k881r25j961j4891K881Q736n431p122J068
11579a3770J0627N146m814K844r636j2247O599J1448N212l223O42N606N799L286
11565A3519j660K561L44m052J1595J2029M018L269O275K1939M4182M4245N6283
11552B14547M7741O347l0967m9338n4990l9142k3676j3080p082o14o776j3669
11540B9301j4452n653o408n041L738K551O019m226j250k829k756O29N710l208
$$ plain form
11526 2125 -1061 -4334 -4138 -11376 -7877 -9135 -9986 -16619 -16549 295 21529 28007 26096 26750 25753 17027
11510 17027 7355 9278 6269 -2553 -11917 -10619 -14272 -11632 -627 -1531 -8690 -10021 -7302 -10454
11496 -10454 -11930 -3832 -4291 -9933 -11750 -10866 -270 -5792 -6417 -1023 -1228 -73 8507 8642 3121
11481 3121 5712 8693 5470 1383 -7 -2806 -4936 -9509 -8859 -8074 -5328 -9304 -13286 -16119 -14237
11466 -14237 -3540 -4105 3188 3618 -6283 -5413 -11294 -14525 -10728 -10680 -6203 89 3628 6507 1434
11451 1434 -12997 -20648 -12204 -1153 4800 8046 -2081 -7549 -11717 188 11312 12310 14733 9083
11437 9083 3383 832 874 -4425 -2406 843 -1572 -1059 4011 1204 -6229 -7573 -10570 -8658 -5840
11422 -5840 -6111 -4267 1064 2334 13496 13341 11765 7011 -5119 -6615 -1610 3260 71 6470 7577
$$ packed form
11526B125l186l273J96p238L499j258q51o633P0J6844K1234O478j911O54r97q726
11510A7027r672J923l009q822r364J298l653K640J1005r04p159j331K719l152
11496a0454j476Q098m59n642j817Q84J0596n522o25N394k05J155Q580J35n521
11481C121K591K981l223m087j390k799k130m573O50P85K746l976l982k833J882
11466a4237J0697n65P293M30r901Q70n881l231L797M8M477O292L539K879n073
11451A434j4431p651Q444J1051N953L246j0127n468m168J1905J1124R98K423n650
11437I083n700k551M2n299K019L249k415N13N070k807p433j344k997J912K818
11422e840k71J844N331J270J1162j55j576m754j2130j496N005M870l189O399J107
$$ plain form
11407 7577 5170 451 -761 -298 -3740 -800 8616 10006 20196 11638 -2788 -9654 -6117 2450
11393 2450 3679 2572 4469 -569 -2846 -3102 -2750 313 602 5744 10544 13300 16757 19112 8754
11378 8754 -1597 2179 11567 12429 9577 15221 15962 16278 15155 16092 42027 72328 96514 133270
11364 133270 204814 352152 668838 1042427 1097153 1015813 776342 479501 311479 222945
11354 222945 164620 122157 97790 78716 65524 48592 43787 42461 42635 35216 24325 26434 19445
11341 19445 9233 14814 31425 33255 23080 24933 29683 31035 30709 29446 15284 -576 1601
11328 1601 212 449 8635 7520 6941 4420 1723 2686 11495 10723 5945 4616 -706 -4845 -526 -5308
11312 -5308 -9758 -5624 3594 10500 11653 3268 2862 -335 -3756 -10838 -5217 3758 8612 9500 -1134
$$ packed form
11407G577k407m719j212M63l442K940R416J390J0190q558j4426o866L537Q567
11393B450J229j107J897n038k277k56L52L063K89N142M800K756L457K355j0358
11378H754j0351L776R388Q62k852N644P41L16j123R37K5935L0301K4186L6756
11364A33270P1544J47338L16686L73589N4726q1340k39471k96841j68022q8534
11354B22945n8325m2463k4367j9074j3192j6932m805j326J74p419j0891K109o989
11341A9445j0212N581J6611J830j0175J853M750J352l26j263j4162j5860K177
11328A601j389K37Q186j115n79k521k697R63Q809p72m778j329n322m139M319m782
11312e308m450M134R218O906J153q385m06l197l421p082N621Q975M854Q88j0634
$$ plain form
11297 -1134 4720 15989 15304 14389 11163 2302 -835 5427 10452 11637 3981 -7093 -5058 -10783 -12493
11282 -12493 -8411 -8983 -4563 2401 5323 -1360 -8632 -6452 -59 -1221 3865 -1971 -12897 -17135
11268 -17135 -13392 -622 6088 5343 4542 2420 -4260 -2858 -2963 -3363 -5108 -9510 -4048 -551 -1586
11253 -1586 509 1131 6229 8904 12370 7113 -4180 -1271 -4823 -7126 -14310 -9350 -9585 -14235 -7693
11238 -7693 -1948 -1954 -1738 2862 -455 8114 9025 9282 8429 6625 4894 4457 -6422 -3873 -4112 -9817 -8228
11221 -8228 -8322 2941 3356 1064 -1100 5650 9566 9141 2010 -2543 -9720 -3917 1638 -4505 -7251
11206 -7251 -11716 -7886 -5839 -3938 -1715 3340 3882 40 7544 8422 11555 5181 -4293 2255 5824
11191 5824 1150 -9037 -7130 -1611 1930 6969 4610 6602 7428 3046 5433 3804 -2485 -6156 -3652
$$ packed form
11297a134N854J1269o85r15l226q861l137O262N025J185p656j1074K035n725j710
11282a2493M082n72M420O964K922o683p272K180O393j162N086n836j0926m238
11268a7135L743J2770O710p45q01k122o680J402j05m00j745m402N462L497j035
11253a586K095O22N098K675L466n257j1293K909l552k303p184M960k35m650O542
11238g693N745oK16M600l317Q569R11K57q53j804j731m37j0879K549k39n705J589
11221h228r4J1263M15k292k164O750L916m25p131m553p177N803N555o143k746
11206g251m465L830K047J901K223N055N42l842P504Q78L133o374r474O548L569
11191E824m674j0187J907N519L541N039k359J992Q26m382K387j629o289l671K504
$$ plain form
11176 -3652 -1988 -4399 -7681 -4861 99 108 -7433 -8370 -11722 -11221 -9270 -8082 -6178 -5350 -6986 -8048
11160 -8048 3152 2578 -2913 -14612 -13687 -13898 -13821 -6967 -4493 -248 5309 9968 20827 24065 11750
11145 11750 13766 13886 12191 10555 -1726 -1296 8929 10670 8685 1441 -7923 -12594 -3658 1990
11131 1990 -8686 -7957 -5123 -785 1048 -25 -2346 -616 -7492 -17153 -19137 -9824 -7741 -9528 2902
11116 2902 8312 3319 -1002 4464 6746 1752 -1483 -7386 -6931 -1517 1595 270 7755 6945 5475
11101 5475 8225 -2508 -6603 -6579 3421 11102 8405 -2631 -10269 3051 5509 5176 2584 6782
11087 6782 -1470 -11341 -13371 -8813 -11 3581 10030 10118 3866 -8842 -17545 -22201 -16990 -11825 -9112
11072 -9112 -409 10096 5441 -589 7642 12022 6612 6424 -2556 -9463 -6435 -143 -9594 -10781 -1056
$$ packed form
11176c652J664k411l282K820M960Rp541r37l352N01J951J188J904Q28j636j062
11160h048J1200n74n491j1699R25k11P7O854K474M245N557M659J0859L238j2315
11145A1750K016J20j695j636j2281M30J0225J741j985p244r364m671Q936N648
11131A990j0676P29K834M338J833j073k321J730o876r661j984R313K083j787J2430
11116B902N410m993m321N466K282m994l235n903M55N414L112j325P485q10j470
11101E475K750j0733m095K4J0000P681k697j1036p638J3320K458l33k592M198
11087F782q252r871k030M558Q802L592O449Q8o252j2708q703m656N211N165K713
11072i112Q703J0505m655o030Q231M380n410j88q980o907L028O292r451j187R725
$$ plain form
11057 -1056 4811 6899 14375 15294 11233 3860 6129 10736 2910 -422 -7930 -2299 2589 -3937 -9586
11042 -9586 -12462 -10878 -2233 359 -4876 -7564 -4387 11958 7695 -2121 8337 12671 18963 17012
11028 17012 5004 -597 -9912 -12197 1362 16997 17933 10797 55 -9585 -7212 -1506 -3925 -3317
11014 -3317 -4407 -9602 -10028 -3903 -4182 -5608 -1650 12589 11652 4520 1777 8305 7217 -2686 5450
10999 5450 6810 -306 3253 7405 6005 12702 5350 -4593 -5944 1578 7609 10729 -1372 -3355
10985 -3355 -1367 -7329 -4919 -10653 -4361 4242 10839 9867 12156 6582 -2551 3296 209 -3124 6217
10970 6217 9944 -869 -6568 -8655 -2357 2489 1484 -1051 -3388 -4250 -7110 -9159 -4393 -6057 814
10955 814 -448 -4063 -7705 -5796 -11996 -15904 -7665 -5277 2068 13539 9238 7131 12929 21776 36219
$$ packed form
11057a056N867K088P476R19m061p373K269M607p826l332p508N631M888o526n649
11042i586k876J584Q645K592n235k688L177J6345m263r816J0458M334O292j951
11028A7012j2008n601r315k285J3559J5635R36p136j0742r640K373N706k419O08
11014c317j090n195m26O125k79j426L958J4239r37p132k743O528j088r903Q136
10999E450J360p116L559M152j400O697p352r943j351P522O031L120j2101j983
10985c355J988n962K410n734O292Q603O597r72K289n574r133N847l087l333R341
10970F217L727j0813n699k087O298M846j005k535k337q62k860k049M766j664O871
10955H14j262l615l642J909o200l908Q239K388P345J1471m301k107N798Q847J4443
$$ plain form
10940 36219 52998 75270 106766 146540 215151 337323 435834 447878 402972 311319 215509
10929 215509 146554 108177 90789 72135 57119 50976 46199 39408 31594 23773 21475 23691 26432
10916 26432 23319 12914 14501 21017 21286 17494 8065 6228 12347 12695 15460 13223 9887 11529 16394
10901 16394 12932 8196 9369 21004 21309 25712 21374 9170 9121 15911 16563 20190 33509 44626
10887 44626 44593 47050 50492 54578 74535 85984 88204 107400 119746 122676 137157 139838 129489
10874 129489 123801 102508 82478 69102 58543 50278 53325 64547 77449 88854 84894 75360
10862 75360 74512 60731 46029 51077 50452 49906 70961 88129 91432 85652 67077 53623 43991 35783
10848 35783 27346 29834 37380 42986 46695 41234 35686 37723 30036 25540 26405 19096 15725 31651
$$ packed form
10940C6219J6779K2272L1496L9774O8611J22172R8511J2044m4906r1653r5810
10929B15509o8955l8377j7388j8654j5016o143m777o791p814p821k298K216K741
10916B6432l113j0405J587O516K69l792r429j837O119L48K765k237l336J642M865
10901A6394l462m736J173J1635L05M403m338j2204m9O790O52L627J3319J1117
10887D4626l3K457L442M086J9957J1449K220J9196J2346K930J4481K681j0349
10874A29489n688k1293k0030j3376j0559q265L047J1222J2902J1405l960r534
10862G5360q48j3781j4702N048o25n46K1055J7168L303n780j8575j3454r632q208
10848C5783q437K488P546N606L709n461n548K037p687m496Q65p309l371J5926
$$ plain form
10834 31651 24374 18728 26899 43608 61700 64911 70456 77815 96090 112549 130968 146556 157534
10821 157534 163857 159819 155513 146033 121483 98078 77177 67799 62906 52904 51354 37482 27016
10808 27016 19553 15573 16693 6707 -6026 -5639 6962 5128 -6869 -3092 6356 15013 26850 21938
10794 21938 15194 4809 5390 3778 1689 1144 -7292 -9676 -8540 -7460 2296 9760 1512 667 1423
10779 1423 -1443 -1672 -5537 -7675 -11173 -2572 -2015 -3210 -2502 -4945 -5776 -8082 -9393 54 2362 -4682
10763 -4682 -10207 -12000 -3128 4762 9495 4307 1117 -800 -10025 -23593 -8897 6750 -765 -3246
10749 -3246 1570 1292 -4840 -569 -2024 -9078 -14255 -2873 4615 5488 -1233 2255 4284 -7663 -5787
10734 -5787 1357 -7390 86 -11211 -11321 -9660 -4857 -9095 -14537 -11406 -12254 -7366 1155 1238 -3545
$$ packed form
10834C1651p277n646Q171J6709J8092L211N545P359J8275J6459J8419J5588J0978
10821A57534O323m038m306r480k4550k3405k0901r378m893j0002j550j3872j0466
10808B7016p463l980J120r986j2733L87J2601j834j1997L777R448Q657J1837m912
10794B1938o744j0385N81j612k089n45q436k384J136J080R756P464q248q45P56
10779A423k866k29l865k138l498Q601N57j195P08k443q31k306j311R447K308p044
10763d682n525j793Q872P890M733n188l190j917r225j3568J4696J5647p515k481
10749c246M816k78o132M271j455p054n177J1382P488Q73o721L488K029j1947J876
10734e787P144q747P476j1297j10J661M803m238n442L131q48M888Q521Q3m783
$$ plain form
10719 -3545 -781 2497 7736 5364 1855 -7599 -16247 -21857 -21712 -18988 -16817 -14823 -2775 -5224 -13285
10704 -13285 -5902 633 1553 2614 3294 -1817 -10208 -11163 -11720 -10550 -17810 -12778 -3611 3648 3455 -4632
10688 -4632 -3993 -11039 -12329 -10388 -4338 -3029 592 -2977 7577 11786 13141 2288 -10115 -3783
10674 -3783 -5809 -16250 -16412 -14158 -12078 -13082 -11687 -8788 -8584 -12281 -9551 1290 7847 8235 3678
10659 3678 3177 4951 9793 13553 14075 11030 4177 -6541 -15794 -10037 -3879 407 9893 4161 -7003
10644 -7003 -13333 -10968 -3819 5408 7922 4293 -11331 -13479 -6654 -3664 -5724 -4500 5622 925
10630 925 -10183 -7732 1575 -1586 -4007 2712 4923 7940 10002 4735 -4907 -7896 -5489 -6177 -3091
10615 -3091 8582 13880 3875 -10446 -17413 -15548 -19676 -8063 -6154 -395 929 -4015 -18476
$$ packed form
10719c545K764L278N239k372l509r454q648n610J45K724K171J994J2048k449q061
10704a3285P383O535R20J061O80n111q391r55n57J170p260N032R167P259j93q087
10688d632O39p046j290J941O050J309L621l569J0554M209J355j0853j2403O332
10674c783k026j0441j62K254K080j004J395K899K04l697K730J0841O557L88m557
10659C678n01J774M842L760N22l045o853j0718r253N757O158M286R486n732j1164
10644g003o330K365P149R227K514l629j5624k148O825K990k060J224J0122m697
10630I25j1108K451R307l161k421O719K211L017K062n267r642k989K407o88L086
10615c091J1673N298j0005j4321o967J865m128J1613J909N759J324m944j4461
$$ plain form
10602 -18476 -17062 -8530 -9368 -8305 -9703 -2740 3804 3849 -1450 -7186 -8208 -13170 -12501 -14161 -22271
10587 -22271 -14439 -2646 1603 8853 2968 -1929 -11416 -16781 -13949 -10876 -15772 -9755 5071 11297
10573 11297 2717 -7576 -2635 6811 10760 10097 9821 2485 -5964 -724 7693 10487 5834 1116 4535
10558 4535 2675 -6501 -2837 -4312 -6792 -3776 6738 12653 6844 14833 17488 11722 12359 32445
10544 32445 50935 55527 52188 43903 53223 78953 95780 89816 76207 64340 45664 26162 8838
10531 8838 7439 6394 -1509 327 5099 7467 13754 16120 15409 14353 18517 16845 11933 6406 4082
10516 4082 6103 12763 15402 9946 1746 -1499 -2257 -3222 719 6418 12433 18401 13283 4560 -621
10501 -621 431 -5785 -1926 -754 -6178 948 5907 14565 12611 10238 5385 1547 -4454 -6429 -8337
$$ packed form
10602a8476J414Q532q38J063j398O963O544M5n299n736j022m962O69j660q110
10587b2271P832J1793M249P250n885m897r487n365K832L073m896O017J4826O226
10573A1297q580j0293M941R446L949o63k76p336q449N240Q417K794m653m718L419
10558D535j860r176L664j475k480L016J0514N915n809P989K655n766O37K0086
10544C2445J8490M592l339q285R320K5730J6827n964j3609j1867j8676j9502j7324
10531H838j399j045p903J836M772K368O287K366p11j056M164j672m912n527k324
10516D082K021O660K639n456q200l245p58r65L941N699O015N968n118q723n181
10501f21J052o216L859J172n424P126M959Q658j954k373m853l838o001j975j908
$$ plain form
10486 -8337 -4648 -3396 3282 3510 -980 -262 786 9145 14786 15944 25828 20161 9706 5605 6682
10471 6682 2969 -6412 249 2231 4255 240 -3052 -805 -3178 -1592 6270 5753 4709 5537 5179
10456 5179 6170 9761 7938 5903 2926 -2845 -14913 -8946 -2148 -844 2227 -1897 -1473 4638 14548
10441 14548 11422 7054 3654 7620 8516 6604 4332 -6482 -7155 -4612 6897 12195 757 -10428
10427 -10428 -21355 -15585 -9700 -5353 -3626 -2788 -2984 -9381 -15186 -11618 -12400 -14468 -8351 630 5013
10412 5013 5611 -3630 2708 1430 -1883 6849 6037 2270 5288 -316 4021 9893 15992 9654 -7373
10397 -7373 -22872 -18256 3394 16083 8867 8273 4938 11725 15062 11363 8111 4905 133 -5792
10383 -5792 -3730 -6390 -6688 -7417 4494 525 -17906 -24831 -19029 -20723 -22506 -15707 -5948 -5719 -3240
$$ packed form
10486h337L689J252O678K28m490P18J048Q359N641J158R884n667j0455m101J077
10471F682l713r381O661J982K024m015l292K247k373J586P862n17j044Q28l58
10456E179R91L591j823k035k977n771j2068N967O798J304L071m124M24O111R910
10441A4548l126m368l400L966Q96j912k272j0814o73K543J1509N298j1438j1185
10427a0428j0927N770N885M347J727Q38j96o397n805L568p82k068O117Q981M383
10412E013N98r241O338j278l313Q732q12l767L018n604M337N872O099o338j7027
10397g373j5499M616K1650J2689p216n94l335O787L337l699l252l206m772n925
10383e792K062k660k98p29J1911l969j8431o925N802j694j783O799R759K29K479
$$ plain form
10368 -3240 -8684 -13762 -10217 -4277 -4944 -4580 -6741 -10174 -2050 -4112 -2737 2902 -7881 -10781 -1360
10353 -1360 -4368 -10971 -16959 -14745 -13999 -15406 -23809 -16900 -9694 -10635 -4076 9898 4920 1454 992
10338 992 -3580 50 1418 2187 -2547 -11052 -3883 9403 5970 -1497 -1588 -5022 -6890 598 4357
10323 4357 2287 2453 743 1352 -1337 -17133 -13753 -6082 -9933 -5814 2057 6701 12628 10068 5483
10308 5483 4597 1628 -5096 -2530 4677 -2498 -1307 5652 1298 4951 10314 5395 5513 5083 -1310
10293 -1310 -8711 354 6324 4629 -1919 3556 9329 12377 610 -6213 -2617 -3858 -3229 5701 11960
10278 11960 9056 9965 8726 -3858 -7578 758 4730 5756 5226 8420 3323 -1351 -1411 1060 566
10263 566 -2012 -8134 -3100 4377 1493 5814 10301 1223 -4674 -14394 -20767 -12650 -9012 -14852 -13620
$$ packed form
10368c240n444n078L545N940o67L64k161l433Q124k062J375N639j0783k900R421
10353a360l008o603n988K214P46j407q403O909P206r41O559J3974m978l466m62
10338I92m572L630J368P69m734q505P169J3286l433p467r1l434j868P488L759
10323D357k070J66j710O09k689j5796L380P671l851M119P871M644N927k560m585
10308E483q86k969o724K566P207p175J191O959m354L653N363m919J18m30o393
10293a310p401R065N970j695o548N475N773L048j1767o823L596j241O29Q930O259
10278A1960k904R09j239j2584l720Q336L972J026n30L194n097m674o0K471m94
10263E66k578o122N034P477k884M321M487r078n897r720o373Q117L638n840J232
$$ plain form
10248 -13620 -7399 -2646 2310 4403 4867 1382 -3563 -4000 -1078 -954 -7503 -20809 -21371 -14253 -13766
10233 -13766 -11985 -9164 -11364 -15148 -17378 -4938 3858 4936 -5951 -2773 -5347 -15382 -14389 -15948
10219 -15948 -10694 -878 4054 5382 1590 7256 5941 5548 4914 1599 -1052 -1531 1663 7535 3945
10204 3945 2141 -1184 4381 9777 5755 4351 8770 7089 4551 -1205 -222 2667 5917 -82 -943
10189 -943 87 -4630 -4663 -15370 -15799 -11467 -4106 -4363 -926 2587 2977 -2210 -1174 -4288 1173 -4460
10173 -4460 -1538 9434 15034 17191 16154 10105 5692 -738 -7020 -11251 -4404 -5836 -3145 1711
10159 1711 5039 -3273 -4343 -6396 636 6005 9410 14291 10941 9612 10706 6472 -6825 -10889
10145 -10889 -4810 4290 9933 5384 -3666 -2819 728 -4243 2948 14104 13848 14215 16702 16922 15130
$$ packed form
10248a3620O221M753M956K093M64l485m945m37K922J24o549j3306n62P118M87
10233a3766J781K821k200l784k230J2440Q796J078j0887L178k574j0035R93j559
10219a5948N254R816M932J328l792N666j315l93o34l315k651m79L194N872l590
10204C945j804l325N565N396m022j404M419j681k538n756R83K889L250n999q61
10189i43J030m717l3j0707m29M332P361k57L437L513L90n187J036l114N461n633
10173d460K922J0972N600K157j037o049m413o430o282m231O847j432K691M856
10159A711L328q312j070k053P032N369L405M881l350j329J094m234j3297m064
10145a0889O079R100N643m549r050Q47L547m971P191J1156k56L67K487K20j792
$$ plain form
10130 15130 9502 4355 -2677 -8186 -377 8338 7181 6662 5154 -2879 -1020 7348 12022 1339
10116 1339 -7608 -7363 -1122 -792 -2022 -6773 -8798 -12360 -5039 7963 17136 13945 473 -3203 -2217
10101 -2217 -4382 976 -6279 -7828 -2592 -9386 -17993 -7774 7872 10145 5159 -5227 -8166 -14266
10087 -14266 -16376 -20170 -20678 -18220 -12414 -8087 -11687 -9911 3769 10762 11907 8723 8184 -1492 -2303
10072 -2303 -2639 -946 4850 3699 -423 -3967 -6114 6466 14460 6806 1537 -756 -5991 -3922 -232
10057 -232 -5110 -6931 -3967 -2031 3374 4090 4103 395 -7373 -283 7209 9221 10403 11804 10487 16017
10041 16017 17680 20217 22195 18386 20481 31652 47100 46468 44602 39786 27478 15352 16146 6220
10027 6220 3523 5494 2062 4195 8728 9786 15221 15750 1675 -4088 -12607 -12636 -13935 -7712 6973
$$ packed form
10130A5130n628n147p032n509P809Q715j157n19j508q033J859Q368M674j0683
10116A339q947K45O241L30j230m751k025l562P321J3002R173l191j3472l676R86
10101b217k165N358p255j549N236o794q607J0219J5646K273m986j0386k939o100
10087a4266k110l794n08K458N806M327l600J776J3680O993J145l184n39r676q11
10072b303l36J693N796j151m122l544k147J2580P994p654n269k293n235K069L690
10057b32m878j821K964J936N405P16J3l708p768P090P492K012J182J401j317N530
10041A6017J663K537J978l809K095J1171J5448o32j866m816j2308j2126P94r926
10027F220k697J971l432K133M533J058N435N29j4075n763q519k9j299O223J4685
$$ plain form
10012 6973 10215 4851 4122 -3220 3974 13796 13450 7664 9592 19341 14882 2706 525 -3575 -9541
9997 -9541 -13504 -9128 -6772 -898 5288 11708 12943 5775 -1520 -4264 -260 5538 4632 4501 15609
9982 15609 14640 -2118 -5850 -3085 5636 5911 -3734 -725 -560 -5053 -9708 -6894 -3790 -2041 -4446
9967 -4446 -2270 -4207 -8398 -9825 1149 12278 9651 -3777 -7525 -12244 -14096 -17296 -11571 -4766
9953 -4766 3531 7725 4885 5835 6355 5862 8076 9101 1623 6237 14178 17912 -676 -1955 -5067
9938 -5067 -9696 -12068 -5072 2556 15838 16361 16834 22802 19657 10900 2344 7294 15769 13322 19499
9923 19499 30953 29851 18352 7142 1458 -3547 -6081 -1654 2436 -6575 -9108 -5415 2034 6524
9909 6524 5638 -6949 -8679 -13056 -8695 -2618 6320 11360 4321 -3465 -9055 -645 -8208 -9614 -11556
$$ packed form
10012F973L242n364p29p342P194R822l46n786J928R749m459j2176k181m100n966
9997i541l963M376K356N874O186O420J235p168p295k744M004N798r06j31J1108
9982A5609r69j6758l732K765Q721K75r645L009J65m493m655K814L104J749k405
9967d446K176j937m191j427J0974J1129k627j3428l748m719j852l200N725O805
9953d766Q297M194k840R50N20m93K214J025p478M614P941L734j8588j279l112
9938e067m629k372O996P628J3282N23M73N968l145q757q556M950Q475k447O177
9923A9499J1454j102j1499j1210n684n005k534M427M090r011k533L693P449M490
9909F524q86j2587j730m377M361O077Q938N040p039p786n590Q410p563j406j942
$$ plain form
9894 -11556 -19080 -9467 6775 5802 3290 1219 1206 2150 -5783 -8801 -5400 4006 1212 2244 4241
9879 4241 8550 2439 1204 1637 -2788 4635 15285 14669 19181 20803 12611 4728 7105 9034 11943
9864 11943 9492 4668 12373 10203 3845 9557 11388 20932 11190 7294 6333 6423 697 -7262 -8658
9849 -8658 -6302 -2763 11583 10182 3789 1399 7179 7739 10268 14326 6314 1317 -984 -1213 -9822
9834 -9822 -6833 8745 8253 24 -5972 -2084 4544 -2783 2443 12448 22759 24772 29690 36451
9820 36451 41984 45330 52273 67897 93845 138431 207106 320842 516104 778217 936776 938227
9808 938227 818809 606135 418074 298416 218087 177832 150489 133104 107693 86699 64529
9797 64529 60404 54116 55349 52475 50873 49626 44071 41427 38859 32128 39233 55081 62724 63475 63920
$$ packed form
9894a1556p524R613J6242r73k512k071j3R44p933l018L401R406k794J032J997
9879D241M309o111j235M33m425P423J0650o16M512J622q192p883K377J929K909
9864A1943k451m824P705k170o358N712J831R544r742l896r61R0n726p959j396
9849h658K356L539J4346j401o393k390N780N60K529M058q012m997k301k29q609
9834i822K989J5578m92q229n996L888O628p327N226J0005J0311K013M918O761
9820C6451N533L346O943J5624K5948M4586O8675J13736J95262K62113J58559J451
9808I38227j19418k12674j88061j19658q0329m0255k7343j7385k5411k0994k2170
9797F4529m125o288J233k874j602j247n555k644k568o731P105J5848P643P51M45
$$ plain form
9782 63920 70992 88146 108015 137504 183470 270291 418691 651817 877791 949888 885742
9771 885742 714319 506489 349705 249493 191928 155918 139974 118384 104806 98697 84878
9760 84878 76479 71503 60582 50199 39877 42037 45862 36923 38751 31425 36241 44745 48986 44421
9746 44421 35010 30591 34725 36792 31758 24593 16110 15726 14842 16959 13256 16831 25356 27739 26361
9731 26361 27792 30882 22404 12764 11507 23693 23793 20813 22053 26511 21369 18414 16713 22720 28035
9716 28035 24508 19904 23360 28594 30008 26024 28543 30247 35354 35358 26703 15493 12500 13621 13779
9701 13779 15767 8664 1831 6043 15789 18554 17496 19417 14439 10577 8241 13614 25762 25707 20870
9686 20870 11278 551 10797 13625 13182 14438 7402 -1964 719 14220 24456 25688 22686 20968
$$ packed form
9782F3920P072J7154J9869K9489M5966Q6821J48400K33126K25974P2097o4146
9771H85742j71423k07830j56784j00212n7565l6010j5944k1590j3578o109j3819
9760H4878q399m976j0921j0383j0322K160L825q939J828p326M816Q504M241m565
9746D4421r411m419M134K067n034p165q483l84q84K117l703L575Q525K383j378
9731B6361J431L090q478r640j257J2186J00k980J240M458n142k955j701O007N315
9716B8035l527m604L456N234J414l984K519J704N107Mq655j1210k993J121J58
9701A3779J988p103o833M212R746K765j058J921m978l862k336N373J2148n5m837
9686B0870r592j0727J0246K828m43J256p036r366K683J3501J0236J232l002j718
$$ plain form
9672 20968 25733 16312 9016 11101 6864 5503 7955 9159 4281 8867 5257 9768 18600 17429 16100
9657 16100 13630 9220 10242 8000 21483 15636 6429 7897 12389 12106 11711 12364 12292 20306 24718 23615
9641 23615 19179 25002 22611 27485 20217 22599 17586 12531 10067 14816 21519 31954 43073 43407
9627 43407 38796 26153 12276 13544 20809 22770 24506 26722 32875 35431 22132 23032 26557 35020
9613 35020 41548 33250 23723 18458 21195 23394 25201 17750 18233 24370 26575 21203 12922 16348 18499
9598 18499 25316 29001 33080 23423 16411 18149 21020 30200 30354 26443 25833 30175 37429 46010 41591
9583 41591 41821 54829 63279 60466 46264 32893 27191 32220 34724 35361 33749 35652 38356 47149
9569 47149 63761 70804 78300 76277 60410 52313 54240 53493 52953 63881 89948 146902 204673 245397
$$ packed form
9672B0968M765r421p296K085m237j361K452J204m878M586l610M511Q832j171j329
9657A6100k470m410J022k242J3483n847r207J468M492k83l95O53p2Q014M412j103
9641B3615m436N823k391M874p268K382n013n055k464M749O703J0435J1119L34
9627D3407m611j2643j3877J268P265J961J736K216O153K556j3299R00L525Q463
9613C5020O528q298r527n265K737K199J807p451M83O137K205n372q281L426K151
9598A8499O817L685M079r657p012J738K871R180J54l911o10M342P254Q581m419
9583D1591K30J3008Q450k813j4202j3371n702N029K504O37j612J903K704Q793
9569D7149J6612P043P496k023j5867q097J927p47n40J0928K6067N6954N7771M0724
$$ plain form
9555 245397 248415 223766 167846 121561 87724 76478 69010 62319 61815 63559 70103 83650 109052
9542 109052 145647 214240 284532 319267 308172 269170 211455 158246 138199 138649 141144 120994
9530 120994 112205 103957 93039 87112 82681 83134 93011 121578 155506 206603 270152 288233 272718
9517 272718 244422 198641 164265 152874 146400 144842 137438 135703 132787 134300 139306 164104 221655
9504 221655 325475 455059 543584 538447 470344 360156 263716 194395 150389 128059 119371
9493 119371 103673 85755 85248 92048 83736 86476 91095 84324 78870 79093 80645 74699 79650 80726
9479 80726 75168 81816 89709 90087 89979 78881 58449 46065 42172 46006 52617 58537 63733 69994
9465 69994 68797 78881 102419 115292 109050 106123 117805 124167 128969 128397 129237 125304 130682 121628
$$ packed form
9555B45397L018k4649n5920m6285l3837j1246p468o691n04J744O544J3547K5402
9542A09052L6595O8593P0292L4735j1095l9002n7715n3209k0047M50K495k0150
9530A20994q789q248j0918n927m431M53R877K8567L3928N1097O3549J8081j5515
9517B72718k8296m5781l4376j1391o474j558p404j735k916J513N006K4798N7551
9504B21655J03820J29584Q8525n137o8103j10188r6440o9321m4006k2330q688
9493A19371j5698j7918n07O800q312K740M619o771n454K23J552n946M951J076
9479H0726n558O648P893L78j08j1098k0432j2384l893L834O611N920N196O261
9465F9994j197J0084K3538J2873o242k927J1682O362M802n72Q40l933N378r054
$$ plain form
9451 121628 110342 97559 94322 92576 91190 101712 106512 99307 93768 87516 99325 117425 118299
9438 118299 109057 102431 99317 107194 111362 108682 120531 124813 122111 120224 114635 119066 120736 115715
9424 115715 111271 111220 111511 108912 117279 132887 144511 137835 135226 138433 135760 131925 138260 141833 149034
9409 149034 152891 148348 149040 158500 156200 152648 161162 154354 158358 165609 168136 167486 167877 168078 176687
9394 176687 187237 185393 181887 181125 179218 182686 196872 194216 186486 193730 197847 201561 209623 220031
9380 220031 229058 220387 220050 229013 237866 236390 239346 236213 232496 231222 242262 250093 254808 262096
9366 262096 264069 259350 269686 273774 283890 289433 297583 298070 295613 309780 318113 318689 322619 326044
9352 326044 345303 350391 342061 336447 333520 346298 352347 352017 362576 364958 374045 387113 388929 393533
$$ packed form
9451A21628j1286j2783l237j746j386J0522M800p205n539o252J1809J8100Q74
9438A18299r242o626l114P877M168k680J1849M282k702j887n589M431J670n021
9424A15715m444n1K91k599Q367J5608J1624o676k609L207k673l835O335L573P201
9409A49034L857m543O92R460k300l552Q514o808M004P251K527o50L91K01Q609
9394A76687J0550j844l506p62j907L468J4186k656p730P244M117L714Q062J0408
9380B20031R027q671l37Q963Q853j476K956l133l717j274J1040P831M715P288
9366B62096J973m719J0336M088J0116N543Q150M87k457J4167Q333N76L930L425
9352C26044J9259N088q330n614k927J2778O049l30J0559K382R087J3068J816M604
$$ plain form
9338 393533 396595 393528 391420 397635 411772 423294 428037 435941 443478 465155 496561 520209 524977
9325 524977 508521 494991 494033 495283 505816 544547 614801 663161 659195 621635 578002 544272
9313 544272 523334 510545 513984 507489 497971 494795 476409 480052 486583 475659 464683 467282 465518
9300 465518 464812 459099 448865 445078 448656 454540 450288 443544 449393 448905 449993 442417 434148 429383 434618
9285 434618 432583 419335 413351 416016 413164 401892 394498 390147 384622 392487 393162 384749 381214 380901
9271 380901 372189 363126 349536 350370 344286 332915 337478 338400 343502 332232 329483 337240 328117 322667
9257 322667 310221 303241 302604 297928 288547 285918 286217 271500 257658 256619 247065 239172 236705 237458
9243 237458 235229 236076 225987 225562 233033 227566 216996 213499 223795 225103 215692 214566 212614 208472
$$ packed form
9338C93533L062l067k108O215J4137J1522M743P904P537K1677L1406K3648M768
9325E24977j6456j3530r58J250J0533L8731P0254M8360l966l7560m3633l3730
9313E44272k0938j2789L439o495r518l176j8386L643O531j0924j0976K599j764
9300D65518p06n713j0234l787L578N884m252o744N849m88J088p576q269m765N235
9285D34618k035j3248n984K665k852j1272p394m351n525P865O75q413l535l13
9271C80901q712r063j3590Q34o084j1371M563R22N102j1270k749P757r123n450
9257C22667j2446o980o37m676r381k629K99j4717j3842j039r554p893k467P53
9243B37458k229Q47j0089m25P471n467j0570l497J0296J308r411j126j952m142
$$ plain form
9229 208472 205336 198574 193187 192991 194353 188688 184485 179441 187428 185737 186563 184810 187652 171519 169296
9214 169296 167386 159965 150931 148081 151207 148533 137254 140265 138938 131140 134003 135669 130405 132360
9200 132360 131618 123329 124071 123121 121869 123635 126452 134440 130867 124469 119581 125725 124310 116934 111620
9185 111620 104070 105236 102546 98308 90831 94477 94498 96525 90912 92275 97843 108381 117688 117670 105001
9170 105001 97480 104917 112787 108971 97740 90157 93409 84648 78864 75340 77695 76870 69984 69077 73102
9155 73102 80906 80477 77254 81313 98956 117916 121963 108127 104943 103151 97976 94610 86875 79782
9141 79782 85080 81819 79415 73765 62735 59854 61891 73226 71810 63955 59635 59517 57438 54398
9127 54398 49606 48170 54662 55048 47435 45812 54818 65740 71106 69942 64436 65914 59658 48672
$$ packed form
9229B08472l136o762n387j96J362n665m203n044P987j691Q26j753K842j6133k223
9214A69296j910p421r034k850L126k674j1279L011j327p798K863J666n264J955
9200A32360p42q289P42r50j252J766K817P988l573o398m888O144j415p376n314
9185A11620p550J166k690m238p477L646K1K027n613J363N568J0538R307j8j2669
9170A05001p521P437P870l816j1231p583L252q761n784l524K355q25o886r07M025
9155G3102P804m29l223M059J7643J8960M047j3836l184j792n175l366p735p093
9141G9782N298l261k404n650j1030k881K037J1335j416p855m320j18k079l040
9127E4398m792j436O492L86p613j623R006J0922N366j164n506J478o256j0986
$$ plain form
9113 48672 53330 63563 70226 65227 67428 70082 70682 67024 66877 56670 51474 49732 50294 52125 54788
9098 54788 48385 54550 58660 57929 63818 54909 52628 63568 71282 63712 52071 53442 57183 66548
9084 66548 72359 70817 65541 55009 52528 61957 58999 54882 59548 59101 67529 77806 76633 87558
9070 87558 104216 126846 149429 179990 211622 237326 252707 276814 297793 320429 346280 371562
9058 371562 417166 490752 609391 801962 1091442 1612912 2656114 4779977 7816211 9192165
9048 9192165 8814444 7385764 5046269 3261741 2250430 1665602 1293798 1053590 888972
9039 888972 780120 703565 658911 630326 584864 546109 505614 462930 419730 375799 334045
9028 334045 297095 258003 236728 215358 199791 200119 200530 190930 179349 161446 147326 147450 134091
$$ packed form
9113D8672M658J0233O663m999K201K654O00l658j47j0207n196j742N62J831K663
9098E4788o403O165M110p31N889q909k281J0940P714p570j1641J371L741R365
9084F6548N811j542n276j0532k481R429k958m117M666m47Q428J0277j173J0925
9070H7558J6658K2630K2583L0561L1632K5704J5381K4107K0979K2636K5851K5282
9058C71562M5604P3586J18639J92571K89480N21470J043202K123863L036234J375954
9048I192165l77721j428680k339495j784528j011311n84828l71804k40208j64618
9039H88972j08852p6555m4654k8585m5462l8755m0495m2684m3200m3931m1754
9028C34045l6950l9092k1275k1370j5567L28M11r600j1581j7903j4120J24j3359
$$ plain form
9015 134091 118166 105766 107789 108855 101342 88811 82635 79939 79979 74108 77029 82352 80517 82449
9001 82449 73405 71317 80630 79117 81617 70779 59394 60509 64136 63119 61099 69788 73272 66546
8987 66546 60066 52958 54763 49617 44229 49055 54831 47906 49207 52304 48738 46933 46881 41628 30500
8972 30500 29959 31420 34741 41322 30887 18665 18811 21816 17935 19785 25250 27033 24440 23543 15734
8957 15734 16706 15479 14972 22171 25549 19243 19879 25316 27548 28062 24865 29331 32651 17759 8585
8942 8585 7198 10448 13326 25709 30191 30747 23522 11082 11167 20400 14944 8150 6939 14276 16868
8927 16868 10885 1184 -8086 9892 19685 22642 22708 25540 24625 24062 17752 14027 14499 14698 19817 25767
8911 25767 24326 16149 15021 15174 21783 14577 3571 8877 24067 44082 44792 34573 24480 25522
$$ packed form
9015A34091j5925j2400K023J066p513j2531o176k696M0n871K921N323j835J932
9001H2449r044k088R313j513K500j0838j1385J115L627j017k020Q689L484o726
8987F6546o480p108J805n146n388M826N776o925J301L097l566j805n2n253j1128
8972C0500n41J461L321O581j0435j2222J46L005l881J850N465J783k593q97p809
8957A5734R72j227n07P199L378o306O36N437K232N14l197M466L320j4892r174
8942H585j387L250K878J2383M482N56p225j2440Q5R233n456o794j211P337K592
8927A6868n983r701r270J7978R793K957O6K832r15n63o310l725M72J99N119N950
8911B5767j441q177j128J53O609p206j1006N306J5190K0015P10j0219j0093J042
$$ plain form
8897 25522 28532 30474 41443 43778 35169 29520 30832 35409 33681 29478 22130 27522 31193 25970
8883 25970 18073 22435 24232 19852 27726 18505 8505 5059 13488 15643 12191 9509 10986 21185
8869 21185 27600 24285 17817 12452 15154 22922 19078 16354 6363 5049 3360 7278 11129 15390 18564
8854 18564 17803 19562 17065 6018 6836 8897 2047 -6861 -4038 3110 183 -3125 -2044 9298 7416
8839 7416 2969 249 2771 5934 9036 13129 22268 19152 11677 18408 13535 10435 2984 -4199 -12049
8824 -12049 -4270 5354 10826 7297 9538 9143 464 -462 10513 15767 10006 6787 16702 19345 24208
8809 24208 17546 9566 16654 13329 10667 10265 4578 9016 23898 26952 20889 20699 17288 13024 6796
8794 6796 974 10071 16061 16382 11721 6322 7000 6319 3570 8300 6465 10335 13570 11820 13425 20530
$$ packed form
8897B5522L010J942J0969K335q609n649J312M577j728m203p348N392L671n223
8883B5970p897M362J797m380P874r221j0000l446Q429K155l452k682J477J0199
8869B1185O415l315o468n365K702P768l844k724r991j314j689L918L851M261L174
8854A8564p61J759k497j1047Q18K061o850q908K823P148k927l308J081J1342j882
8839G416m447k720K522L163L102M093R139l116p475O731m873l100p451p183p850
8824a2049P779R624N472l529K241l95q679r26J0975N254n761l219R915K643M863
8809B4208o662p980P088l325k662m02n687M438J4882L054o063j90l411m264o228
8794F796n822R097N990L21m661n399O78o81k749M730j835L870L235j750J605P105
$$ plain form
8778 20530 24245 23809 24909 21232 16863 9688 -2595 2561 7082 -194 -1309 4744 15963 13535
8764 13535 5383 5307 8544 9405 22365 19370 17944 23398 27045 26111 29054 30299 23028 18276 3975
8749 3975 -7096 -7362 -10101 -16523 -16907 -9258 -647 13232 12112 10938 19548 16106 10184 3857 -3209
8734 -3209 -8571 -3918 4600 3752 5694 5683 9640 11211 10362 2753 -4135 -7689 -4884 3309 6401 2846
8718 2846 6041 10244 2136 4080 14302 28346 37910 25798 20945 12047 9091 9785 12546 10349
8704 10349 5070 5182 8871 7989 11043 5036 12662 17923 11064 14107 23569 28915 29717 25162 24376 22931
8688 22931 25711 29788 27175 25059 20677 16035 11362 12349 18742 18430 20546 31580 35458 31355 14942
8673 14942 9762 13172 12618 12681 14551 12520 11541 8920 12077 22285 20598 10291 4821 14120 15202
$$ packed form
8778B0530L715m36J100l677m369p175j2283N156M521p276j115O053J1219k428
8764A3535q152p6L237Q61J2960k995j426N454L647r34K943J245p271m752j4301
8749C975j1071k66k739o422l84P649Q611J3879j120j174Q610l442n922o327p066
8734c209n362M653Q518q48J942j1L957J571q49p609o888l554K805Q193L092l555
8718B846L195M203q108J944J0222J4044R564j2112m853q898k956O94K761k197
8704A0349n279J12L689q82L054o007P626N261o859L043R462N346Q02m555p86j445
8688B2931K780M077k613k116m382m642m673R87O393l12K116J1034L878m103j6413
8673A4942n180L410n54O3J870k031r79k621L157J0208j687j0307n470R299J082
$$ plain form
8658 15202 14947 7990 2270 4599 3389 -5553 1113 2526 3959 11036 20749 23879 13953 6548 5477
8643 5477 11375 18358 13621 2680 -5191 4510 19045 24306 30204 32700 41656 58807 69223 76015
8629 76015 74504 53050 40238 22998 17016 18012 17895 23221 16574 16139 23284 14508 12114 14506 17967
8614 17967 15423 8247 7656 8740 18830 24166 23651 15817 13955 3850 2963 3631 5532 9530 19467
8599 19467 32761 31836 28140 31465 33986 41680 43594 40499 32389 25798 32023 29160 38637 43703 58440
8584 58440 57574 49541 49508 42616 35325 34766 30391 28906 38065 38919 38604 30529 23072 27208 22355 21694
8568 21694 17029 15546 17097 15249 12367 22359 33162 24839 15106 -546 -2264 13033 16223 17846
8554 17846 11987 9971 7299 4986 7610 12897 15532 15669 12871 16356 12615 8657 11373 5942 -738
$$ packed form
8658A5202k55o957n720K329j210q942O666J413J433P077R713L130r926p405j071
8643E477N898O983m737j0941p871R701J4535N261N898K496Q956J7151J0416O792
8629G6015j511k1454j2812j7240n982R96j17N326o647m35P145q776k394K392L461
8614A7967k544p176n91J084J0090N336n15p834j862j0105q87O68J901L998R937
8599A9467J3294r25l696L325K521P694J914l095q110o591O225k863R477N066J4737
8584E8440q66q033l3o892p291n59m375j485R159Q54l15q075p457M136m853o61
8568B1694m665j483J551j848k882R992J0803q323r733j5652j718J5297L190J623
8554A7846n859k016k672k313K624N287K635J37k798L485l741l958K716n431o680
$$ plain form
8539 -738 209 3799 9345 6449 -2086 -5963 -11840 -2754 9604 12217 17346 12267 14225 15637 16640
8524 16640 13558 3320 4318 3657 5159 3027 9301 7635 1311 -10731 -19724 -13691 4025 3933 -9654
8509 -9654 -18559 -22040 -16919 -11355 -7533 -11681 -8426 -2123 3089 6840 1848 -452 -9758 -10995 -11364
8494 -11364 -3056 3333 1307 1030 -186 11471 14513 15967 21909 16667 10621 10933 13105 17644 17838
8479 17838 13380 15467 8678 1134 -716 -6862 -7662 5750 7126 7449 1705 12864 23965 14520
8465 14520 824 1404 8043 14226 13039 6338 525 8364 14455 10440 4787 -1435 966 7710 12616
8450 12616 13310 5861 4460 4386 1940 -4886 -5769 2339 4304 -1303 -3180 8045 14998 10359 13700
8435 13700 13934 12587 18564 21780 21983 12150 9448 11208 3192 1384 -8605 -9034 -5274 -11636 -16978
$$ packed form
8539g38R47L590N546k896q535l877n877R086J2358K613N129n079J958J412J003
8524A6640l082j0238R98o61J502k132O274j666o324j2042q993O033J7716r2j3587
8509i654q905l481N121N564L822m148L255O303N212L751m992k300r306j237l69
8494a1364Q308O389k026k77j216J1657L042J454N942n242o046L12K172M539J94
8479A7838m458K087o789p544j850o146q00J3412J376L23n744J1159J1101r445
8465A4520j3696N80O639O183j187o701n813P839O091m015n653o222K401O744M906
8450A2616O94p449j401p4k446o826q83Q108J965n607j877J1225O953m639L341
8435A3700K34j347N977L216K03r833k702J760q016j808r989m29L760o362n342
$$ plain form
8420 -16978 -6666 -5515 -6517 -15585 -5789 -8060 -13502 -16809 -11211 2313 14227 13922 16174 18067
8406 18067 3120 -4528 5085 7687 9919 3725 9546 4532 -1899 -2733 -1675 -421 6107 12936 1256
8391 1256 -14092 -9556 -5899 -3572 -1161 1357 4455 -1398 -3035 -4246 -10691 -13335 -13077 -6800 -5954
8376 -5954 -15931 -15525 -10174 -10259 -13299 -12043 -4889 -11832 -12008 -13359 -17197 -15939 -11322 -4782 -3310 -3075
8360 -3075 5601 2621 2815 -4383 -9867 -4772 -6308 -13029 -19005 -11107 -6795 -13853 -14062 -19707 -4545
8345 -4545 -3859 -4999 -5239 -7274 -11579 -3668 -2933 -11216 -6838 -399 3887 8747 9900 5537 462 2874
8329 2874 2572 5730 11976 11274 -784 -3812 6952 9698 6324 6053 2700 3282 2792 -9315 -12879
8314 -12879 -4904 -4638 -831 492 7034 4331 6998 7904 6756 10019 10123 10142 6348 1221 -3860 2304
$$ packed form
8420a6978J0312J151j002r068R796k271n442l307N598J3524J1914l05K252J893
8406A8067j4947p648R613K602K232o194N821n014o431q34J058J254O528O829j1680
8391A256j5348M536L657K327K411K518L098n853j637j211o445k644K58O277Q46
8376e954r977M06N351q5l040J256P154o943j76j351l838J258M617O540J472K35
8360c075Q676k980J94p198n484N095j536o721n976P898M312p058k09n645J5162
8345d545O86j140k40k035m305P911P35q283M378O439M286M860J153m363n075K412
8329B874l02L158O246p02j2058l028J0764K746l374k71l353N82m90j2107l564
8314a2879P975K66L807J323O542k703K667R06j148L263J04J9l794n127n081O164
$$ plain form
8298 2304 4001 6481 2735 3360 9187 13472 15661 14895 3339 -2723 -4086 -6058 2193 4825 4886 12994
8282 12994 16265 4121 -12897 -16560 -10967 528 638 -5424 6181 8799 10892 16326 10689 -9419
8268 -9419 -17829 -12499 -12524 -11296 -803 2773 5627 7083 -966 -594 -9 3804 6708 7209 10830 13669
8252 13669 -3961 -268 9786 6546 3136 -7235 -12552 -3900 3504 10188 10216 1626 2491 4084 4264
8237 4264 5489 -9199 -12449 -4886 -1597 -1530 -10075 -17811 -16837 -8609 -3954 -4547 -6275 -4961 3751 5343
8221 5343 -555 -5173 509 4112 3894 -2852 -1522 6679 13068 11403 9610 6223 -3784 -1316 10312
8206 10312 6865 4760 5655 6371 7444 4078 -1724 -6128 -9161 -12127 -9719 -3368 239 6613 1403
8191 1403 -10271 -18270 -14019 229 2403 -11971 -18446 -12507 -11821 -10446 -4095 -5859 -2725 1986
$$ packed form
8298B304J697K480l746O25N827M285K189p66j1556o062j363j972Q251K632O1Q108
8282A2994L271j2144j7018l663N593J1495J10o062J1605K618K093N434n637k0108
8268i419q410N330k5J228J0493L576K854J456q049L72N85L813K904N01L621K839
8252A3669j7630L693J0054l240l410j0371n317Q652P404O684K8q590Q65J593J80
8237D264J225j4688l250P563L289O7q545p736R74Q228M655n93j728J314Q712J592
8221E343n898m618N682L603k18o746J330Q201O389j665j793l387j0007K468J1628
8206A0312l447k105Q95P16J073l366n802m404l033k966K408O351L607O374n210
8191A403j1674p999M251J4248K174j4374o475N939O86J375O351j764L134M711
$$ plain form
8177 1986 956 -1467 -2093 -7688 -9161 -21328 -19111 -8911 828 15455 19818 8711 294 -788
8163 -788 1289 -1378 -6557 3521 5529 -3693 -1083 -3188 -8883 -16476 -1789 9245 1053 -10930
8149 -10930 -9262 -5734 -1851 -4251 -2370 4861 4667 4643 2558 -4127 -9556 -8828 -5773 -9222 -9012 -4242
8133 -4242 2527 2937 -1239 -4774 -877 222 8121 8661 6181 2232 10864 8515 13827 11395 9486
8118 9486 -6696 -12915 -11938 -8159 1689 4661 6319 9817 11237 8579 536 -4712 -8022 -4521 2133
8103 2133 9056 -2113 -10744 -8231 1356 10617 14100 8643 14538 10343 2809 -3643 -9686 -12593 -780
8088 -780 -7626 -7729 -9941 -10947 -8833 4635 4205 13323 8354 3933 -803 -9131 -15118 -6606 -787
8073 -787 -323 4144 13238 5827 -7316 -8315 -1732 -3405 9280 17317 10312 9761 13483 11540 6317
$$ packed form
8177A986j030k423o26n595j473j2167K217J0200R739J4627M363j1107q417j082
8163g88K077k667n179J0078K008r222K610k105n695p593J4687J1034q192j1983
8149a0930J668L528L883k400J881P231j94k4k085o685n429P28L055l449K10M770
8133d242O769M10m176l535L897J099P899N40k480l949Q632k349N312k432j909
8118I486j6182o219R77L779R848K972J658L498J420k658q043n248l310L501O654
8103B133O923j1169q631K513R587R261L483n457N895m195p534o452o043k907J1813
8088g80o846j03k212j006K114J3468m30R118m969m421m736q328n987Q512N819
8073g87M64M467R094p411j3143r99O583j673J2685Q037p005n51L722j943n223
$$ plain form
8058 6317 -429 -1040 208 -1493 1754 -3491 -5872 -1211 1751 6456 -99 6394 5283 834 -2820
8043 -2820 1182 10132 9516 17890 21800 20412 7560 -6024 -7078 -9131 -3674 -3006 -3240 9044 19647
8028 19647 22455 20228 17496 19739 19929 15908 879 -13591 -17547 -9492 2106 6668 6442 5552 -1326
8013 -1326 4 2777 1838 -5216 -12278 -8336 -3887 3527 12086 5532 4187 6745 12395 6976 1485
7998 1485 1133 4833 2121 -7192 -9263 -8492 -6804 -5430 -3416 112 7665 14365 12076 7713 -1394
7983 -1394 1330 10782 7450 4961 -3038 -12977 -4984 4848 11571 -3834 -8103 3397 11731 7971
7969 7971 9845 4860 7939 14071 8973 -483 -2762 -692 3492 4811 4786 437 -4686 1066 17902
7954 17902 21142 12019 -3477 -6126 9681 9792 7509 4139 6911 10994 17789 16697 21821 22190 15062
$$ packed form
8058F317o746o11J248j701L247n245k381M661K962M705o555O493j111m449l654
8043b820M002Q950o16Q374L910j388j2852j3584j054k053N457O68k34J2284J0603
8028A9647K808k227k732K243J90m021j5029j4470l956Q055J1598M562k26q90o878
8013a326J330K773r39p054p062L942M449P414Q559o554j345K558N650n419n491
7998A485l52L700k712r313k071P71J688J374K014L528P553O700k289m363r107
7983a394K724R452l332k489p999r939P993R832O723j5405m269J1500Q334l760
7969G971J874m985L079O132n098r456k279K070M184J319k5m349n123N752J6836
7954A7902L240r123j5496k649J5807J11k283l370K772M083O795j092N124L69p128
$$ plain form
7939 15062 6146 -2147 2017 13599 19923 17696 16663 7181 -397 1059 3368 -653 1509 1794 2879
7924 2879 2139 -9522 -14381 -8673 -10806 -10589 -15146 -6709 2711 9515 12887 13908 15915 13488 7103
7909 7103 13817 13348 20356 15174 6079 4781 6428 4162 -3327 1345 4426 11791 7531 10339 6987
7894 6987 10098 9125 1931 1291 5337 10420 22091 23809 18533 15163 7546 10098 11213 8012 -1325
7879 -1325 4353 10583 1910 4126 6456 1090 -5847 -1440 7784 20445 17419 17612 18994 11552 2225
7864 2225 -6482 1132 8876 9288 4009 -1704 -12717 -13436 -13599 -14703 -7364 3133 -9250 -15209 -12027
7849 -12027 -7824 1011 4723 8414 22240 18424 17048 21289 5597 4783 4239 860 -544 1200 -155
7834 -155 2856 4667 3129 -7931 -14708 -13137 -4307 -5304 -8956 -4368 -1550 -1434 1762 2155 5434 11143
$$ packed form
7939A5062q916q293M164J1582O324k227j033r482p578J456K309m021K162K85J085
7924B879p40j1661m859N708k133K17m557Q437R420O804L372J021K007k427o385
7909G103O714m69P008n182r095j298J647k266p489M672L081P365m260K808l352
7894F987L111r73p194o40M046N083J1671J718n276l370p617K552J115l201r337
7879a325N678O230q673K216K330n366o937M407R224J2661l026J93J382p442r327
7864B225q707P614P744M12n279n713j1013p19j63j104P339J0497j2383n959L182
7849a2027M203Q835L712L691J3826l816j376M241j5692q14n44l379j404J744j355
7834a55L011J811j538j1060o777J571Q830r97l652M588K818J16L196L93L279N709
$$ plain form
7818 11143 9511 4911 -3255 -5302 67 617 2998 1302 -7541 -7813 -12118 -24576 -23890 -15944 -12350
7803 -12350 1915 1215 -4403 -11180 -16062 -14273 -6709 -8797 -11298 -18475 -7748 4933 -3400 -10791
7789 -10791 -7907 -4758 -4741 -6499 -13592 -19729 -18905 -14191 -6703 1098 5240 7161 6107 911 -1479
7774 -1479 -4711 -5811 -8538 -402 7434 10286 6559 1184 -10112 -8344 -4430 -7706 -3760 -3398 -5369
7759 -5369 -5516 -5711 -7549 -2499 -894 -7660 -8223 -3071 -7136 -8157 -262 3710 4701 2456 -3464 3660
7743 3660 11742 13230 -1125 -4213 6624 -87 -2288 9100 8805 4453 3960 2475 2951 -6407 -16418
7728 -16418 -13940 -11219 -11423 -21062 -22247 -17563 -16675 -16685 -22113 -17355 -9475 -1572 -4130 -2990 1253 -737
7712 -737 -2322 -2881 6757 5628 -151 -3920 -2303 602 -5370 -9162 -2981 -1219 -2567 8245 15261
$$ packed form
7818A1143j632m600q166k047N369N50K381j696q843k72m305j2458O86P946L594
7803a2350J4265p00n618o777m882J789P564k088k501p177J0727J2681q333p391
7789a0791K884L149J7j758p093o137Q24M714P488P801M142J921j054n196k390
7774a479l232j100k727Q136P836K852l727n375j1296J768L914l276L946L62j971
7759e369j47j95j838N050J605o766n63N152m065j021P895L972R91k245n920P124
7743C660Q082J488j4355l088J0837o711k201J1388k95m352m93j485M76r358j0011
7728a6418K478K721k04r639j185M684Q88j0n428M758P880P903k558J140M243j990
7712g37j585n59R638j129n779l769J617K905n972l792O181J762j348J0812P016
$$ plain form
7697 15261 11235 2574 -7943 -10841 -13717 -10680 -6633 -2338 -4346 -5918 3464 751 -11863 -17205
7683 -17205 -16752 -12656 -11394 -4955 5096 -38 -7216 -9359 -9081 -5477 -10935 -19219 -18335 -5386 -6320
7668 -6320 -7100 -485 3979 -5478 -9219 -6381 -676 6999 17118 19961 15547 9871 6840 -3577 -11056
7653 -11056 -6549 -7306 -5029 -7806 -13722 -513 4160 1770 -4341 -10692 -13969 -7981 -3015 714 2648
7638 2648 3321 -3330 -10669 -6858 -8651 -9247 -3887 -4976 -1728 5613 8242 13932 5323 13279 15449
7623 15449 16641 9588 -408 1248 6149 2529 -2491 -4012 -14679 -22824 -15699 -9847 -8692 -9010 -10416
7608 -10416 -4107 3438 4871 5641 1080 -334 -9757 -11543 -5847 -1097 14135 5433 4959 1825 1099
7593 1099 2913 8919 3764 762 6297 12958 -2254 -10648 -11215 -11155 -9765 -8195 -5481 -11102 -10473 575
$$ packed form
7697A5261m026q661j0517k898k876L037M047M295k008j572R382k713j2614n342
7683a7205M53M096J262O439J0051n134p178k143K78L604n458q284Q84J2949r34
7668f320p80O615M464r457l741K838N705P675J0119K843m414n676l031j0417p479
7653a1056M507p57K277k777n916J3209M673k390o111o351l277N988M966L729J934
7638B648O73o651p339L811j793n96N360j089L248P341K629N690q609P956K170
7623A5449J192p053r996J656M901l620n020j521j0667q145P125N852J155l18j406
7608a0416O309P545J433P70m561j414r423j786N696M750J5232q702m74l134p26
7593A099J814O006n155l002N535O661j5212q394n67O0J390J570K714n621O29J1048
$$ plain form
7577 575 12797 9772 2115 988 -4854 -8834 2488 6806 -277 -3375 -10898 -4389 -4825 -5927 1865
7562 1865 5975 -146 -4961 2367 7829 2292 -1637 -5865 -14235 -4720 53 2722 -380 -3 -13957
$$ packed form
7577E75J2222l025p657j127n842l980J1322M318p083l098p523O509m36j102P792
7562A865M110o121m815P328N462n537l929m228q370R515M773K669l102L77j3954
$$ [...]
##END NTUPLES=NMR SPECTRUM
##END=
