##TITLE=Analysis number 321255
Compound Code ac 13425
Project Code adrs
Chemist Name acros
##JCAMPDX= 6.0         $$ Bruker NMR JCAMP-DX V2.0
##DATA TYPE= NMR SPECTRUM
##DATA CLASS= NTUPLES
##ORIGIN= Bruker BioSpin GmbH
##OWNER= nmr
$$ XWIN-NMR		Version 3.5
$$ Tue Aug  1 12:56:29 2006 GMT Daylight Time (UT+1h)  MAYBRIDGE\nmr@NMR_250MHZ
##.OBSERVE FREQUENCY= 250.131544655141
##.OBSERVE NUCLEUS= ^1H
##.ACQUISITION MODE= SIMULTANEOUS (DQD)
##.ACQUISITION SCHEME= undefined
##.AVERAGES= 16
##.DIGITISER RES= 18
##SPECTROMETER/DATA SYSTEM= dpx250
##.PULSE SEQUENCE= zg30
##.SOLVENT NAME= DMSO
##.SHIFT REFERENCE= (INTERNAL, DMSO, 0, 16.522)
##AUDIT TRAIL= $$ (NUMBER, WHEN, WHO, WHERE, WHAT)
$$ ##TITLE= Audit trail, XWIN-NMR		Version 3.5
$$ ##JCAMPDX= 5.01
$$ ##ORIGIN= Bruker BioSpin GmbH
$$ ##OWNER= nmr
$$ C:\u/data/dgb/nmr/ADRS/10/pdata/1/auditp.txt
$$ ##AUDIT TRAIL=  $$ (NUMBER, WHEN, WHO, WHERE, WHAT)
(   1,<2006-08-01 12:55:59.03 +100>,<MAYBRIDGE\nmr>,<NMR_250MHZ>,
      <created by zg, POWCHK disabled, PULCHK disabled
       configuration hash MD5:
       E2 DF 36 D8 04 B2 41 60 5A D7 A3 38 5A 4B D0 FE
       data hash MD5: 64K
       DE 9E B6 24 D9 C1 F6 22 7E 77 03 76 5D 20 C8 0A>)
(   2,<2006-08-01 12:56:17.06 +100>,<MAYBRIDGE\nmr>,<NMR_250MHZ>,
      <Start of raw data processing
       ef LB = 0.3 FT_mod = 6 PKNL = 1 SI = 32K 
       data hash MD5: 32K
       17 1E EF 86 5C D8 80 BC 74 3D B9 C0 6B 74 3A 97>)
(   3,<2006-08-01 12:56:19.23 +100>,<MAYBRIDGE\nmr>,<NMR_250MHZ>,
      <apk 
       data hash MD5: 32K
       6C 19 FB 14 4D 31 82 D2 5E C3 D8 61 2A 9F 7D 2C>)
(   4,<2006-08-01 12:56:20.06 +100>,<MAYBRIDGE\nmr>,<NMR_250MHZ>,
      <abs ABSG = 5 
       data hash MD5: 32K
       0D 3B 59 2C 24 73 BF CD 36 F8 9A 87 66 0E 73 C0>)
$$ ##END=
$$ 
$$ hash MD5
$$ AD 52 16 A8 3C 79 F3 C2 3D E6 9C 49 63 39 29 F1
##$RELAX= 
##$RELAX= 
##$RELAX= 
##$RELAX= 
##$RELAX= 
##$RELAX= 
##$RELAX= 
$$ Bruker specific parameters
$$ --------------------------
##$DU= <C:\u>
##$EXPNO= 10
##$NAME= <ADRS>
##$PROCNO= 1
##$TYPE= <nmr>
##$USER= <dgb>
##$AMP= (0..31)
100 100 100 100 100 100 100 100 100 100 100 100 100 100 100 100 100 100 
100 100 100 100 100 100 100 100 100 100 100 100 100 100 
##$AQSEQ= 0
##$AQ_mod= 3
##$AUNM= <au_zg>
##$AUTOPOS= <46 >
##$BF1= 250.13
##$BF2= 250.13
##$BF3= 250.13
##$BF4= 250.13
##$BF5= 500.13
##$BF6= 500.13
##$BF7= 500.13
##$BF8= 500.13
##$BYTORDA= 1
##$CFDGTYP= 0
##$CFRGTYP= 5
##$CHEMSTR= <none>
##$CNST= (0..31)
1 1 145 1 1 1 1 1 1 1 1 1 1 1 1 1 1 1 1 1 1 1 1 1 1 1 1 1 1 1 1 1 
##$CPDPRG= <>
##$CPDPRG1= <>
##$CPDPRG2= <>
##$CPDPRG3= <>
##$CPDPRG4= <mlev>
##$CPDPRG5= <mlev>
##$CPDPRG6= <mlev>
##$CPDPRG7= <mlev>
##$CPDPRG8= <mlev>
##$CPDPRGB= <>
##$CPDPRGT= <>
##$D= (0..31)
0 1 0 0 0 0 0 0 0 0.06 0 0 0 0 0 0 0.0002 0 0 0 0 0 0 0 0 0 0 0 0 0 0 
0 
##$DATE= 1154433357
##$DBL= (0..7)
120 120 120 120 120 120 120 120 
##$DBP= (0..7)
150 150 150 150 150 150 150 150 
##$DBP07= 0
##$DBPNAM0= <>
##$DBPNAM1= <>
##$DBPNAM2= <>
##$DBPNAM3= <>
$$ [...]
##$SUBNAM7= <"">
##$SUBNAM8= <"">
##$SUBNAM9= <"">
##$SW= 20.6930455092707
##$SWIBOX= (0..15)
0 0 3 0 0 0 0 0 0 0 0 0 0 0 0 0 
##$SW_h= 5175.983436853
##$TD= 65536
##$TD0= 1
##$TE= 295.16
##$TE2= 300
##$TE3= 300
##$TEG= 300
##$TL= (0..7)
0 120 120 120 120 120 120 120 
##$TP= (0..7)
150 150 150 150 150 150 150 150 
##$TP07= 0
##$TPNAME0= <>
##$TPNAME1= <>
##$TPNAME2= <>
##$TPNAME3= <>
##$TPNAME4= <>
##$TPNAME5= <>
##$TPNAME6= <>
##$TPNAME7= <>
##$TPOAL= (0..7)
0.5 0.5 0.5 0.5 0.5 0.5 0.5 0.5 
##$TPOFFS= (0..7)
0 0 0 0 0 0 0 0 
##$TUNHIN= 0
##$TUNHOUT= 0
##$TUNXOUT= 0
##$USERA1= <user>
##$USERA2= <user>
##$USERA3= <user>
##$USERA4= <user>
##$USERA5= <user>
##$V9= 5
##$VALIST= <valist>
##$VCLIST= <CCCCCCCCCCCCCCC>
##$VD= 0
##$VDLIST= <DDDDDDDDDDDDDDD>
##$VPLIST= <PPPPPPPPPPPPPPP>
##$VTLIST= <TTTTTTTTTTTTTTT>
##$WBST= 1024
##$WBSW= 4
##$XGAIN= (0..3)
0 0 0 0 
##$XL= 0
##$YL= 0
##$YMAX_a= 317166
##$YMIN_a= -411226
##$ZGOPTNS= <>
##$ZL1= 120
##$ZL2= 120
##$ZL3= 120
##$ZL4= 120
##$ABSF1= 16.522
##$ABSF2= -4.171173
##$ABSG= 5
##$ABSL= 3
##$ALPHA= 0
##$AQORDER= 0
##$ASSFAC= 0
##$ASSFACI= 0
##$ASSFACX= 0
##$ASSWID= 0
##$AUNMP= <proc_1d>
##$AZFE= 0.1
##$AZFW= 0.1
##$BCFW= 0
##$BC_mod= 0
##$BYTORDP= 0
##$COROFFS= 0
##$CY= 12.5
##$DATMOD= 1
##$DC= 0
##$DFILT= <>
##$DTYPP= 0
##$F1P= 14.0000005364418
##$F2P= -0.99999901652339
##$FCOR= 0.5
##$FTSIZE= 32768
##$FT_mod= 6
##$GAMMA= 0
##$GB= 0
##$INTBC= 1
##$INTSCL= 1
##$ISEN= 128
##$LB= 0.3
##$LEV0= 0
##$LPBIN= 0
##$MAXI= 10000
##$MC2= 0
##$MEAN= 0
##$ME_mod= 0
##$MI= 0
##$NCOEF= 0
##$NC_proc= -6
##$NLEV= 6
##$NOISF1= 0
##$NOISF2= 0
##$NSP= 0
##$NTH_PI= 0
##$NZP= 0
##$OFFSET= 16.522
##$PC= 1
##$PHC0= 131.4319
##$PHC1= 9.265136
##$PH_mod= 1
##$PKNL= yes
##$PPARMOD= 0
##$PSCAL= 4
##$PSIGN= 0
##$REVERSE= no
##$SF= 250.13
##$SI= 32768
##$SIGF1= 0
##$SIGF2= 0
##$SINO= 400
##$SIOLD= 32768
##$SREGLST= <1H.DMSO>
##$SSB= 0
##$STSI= 32768
##$STSR= 0
##$SW_p= 5175.98343685301
##$SYMM= 0
##$S_DEV= 0
##$TDeff= 65536
##$TDoff= 0
##$TI= <Analysis number 999999
Compound Code 99
Book Reference 9
Project Code 9>
##$TILT= no
##$TM1= 0
##$TM2= 0
##$TOPLEV= 0
##$USERP1= <user>
##$USERP2= <user>
##$USERP3= <user>
##$USERP4= <user>
##$USERP5= <user>
##$WDW= 1
##$XDIM= 32768
##$YMAX_p= 328719073
##$YMIN_p= -738215
$$ End of Bruker specific parameters
$$ ---------------------------------
##NTUPLES= NMR SPECTRUM
##VAR_NAME=  FREQUENCY,     SPECTRUM/REAL,   SPECTRUM/IMAG
##SYMBOL=    X,             R,               I
##VAR_TYPE=  INDEPENDENT,   DEPENDENT,       DEPENDENT
##VAR_FORM=  AFFN,          ASDF,            ASDF
##VAR_DIM=   32768,         32768,           32768
##UNITS=     HZ,            ARBITRARY UNITS, ARBITRARY UNITS
##FACTOR=    0.157963299565203, 1,           1
##FIRST=     4132.6476996994, 0,             0
##LAST=      -1043.33573715361, 0,           0
##MIN=       -1043.33573715361, -738215,     0
##MAX=       4132.6476996994, 328719073,     0
$$ Real data points
##PAGE= N=1
##DATA TABLE= (X++(R..R)), XYDATA
$$ [...]
$$ plain form
23523 -136048 -141254 -216052 -227010 -198305 -222195 -113573 108171 149860 146987 25055 -75960
23512 -75960 -226306 -162856 -4779 142854 49908 -93799 -15612 126747 -54415 -75619
23502 -75619 -72619 -144452 -154076 -196783 -29769 164274 68245 139986 280639 132225 -4678
23491 -4678 88216 -80635 -184954 -278174 -295957 -245531 -207845 -233294 -160255 -125999 47040
23480 47040 175729 377472 394884 269452 282860 306480 358599 195846 112138 279008 288177
23469 288177 306950 86917 -114697 -39728 -8371 69080 -131663 -273967 -169387 -455
23459 -455 120335 68857 57688 33477 215402 303250 124013 -31256 1887 6626 -45171
23448 -45171 -89299 -119152 -259283 -294989 -356301 -264332 -129302 133645 -48250 -76646 -134298
$$ packed form
23523a36048n206p4798j0958K8705k3890J08622K21744M1689k873j21932j01015
23512g5960j50346O3450J58077J47633r2946j43707P8187J42359j81162k1204
23502g5619L000p1833r624m2707J67014J94043r6029P1741J40653j48414j36903
23491d678R2894j68851j04319r3220j7783N0426L7686k5449P3039L4256J73039
23480D7040J28689K01743J7412j25432J3408K3620N2119j62753q3708J66870R169
23469B88177J8773k20033k01614P4969L1357P7451k00743j42304J04580J68932
23459d55J20790n1478j1169k4211J81925Q7848j79237j55269L3143M739n1797
23448d5171m4128k9853j40131l5706o1312R1969J35030K62947j81895k8396n7652
$$ plain form
23437 -134298 -106752 -28633 177387 275623 319625 244617 83354 -106183 -52011 -120222 -132762
23426 -132762 -59669 102723 102898 7663 -20885 -76271 -13247 39429 6621 19517 72487 48260
23414 48260 20740 -70219 7120 168363 193291 97220 -11015 -99971 -212474 -149150 50548
23403 50548 143931 126231 79167 37796 59942 -18165 -100733 -39929 5250 -68418 -190165
23392 -190165 -213939 -310872 -358639 -421622 -506780 -518087 -543295 -414682 -165368 -84991 -161736
23381 -161736 -102885 -127085 4067 51669 -204885 -399881 -304894 -308066 -281272 -215716 -274544
23370 -274544 -316473 -226170 -248771 -265358 -322107 -264697 -227384 -316465 -396530 -452194 -256246
23359 -256246 -2645 30341 -126564 -147978 -105333 -150386 -32088 24233 10101 183918 79897
$$ packed form
23437a34298K7546P8119K06020R8236M4002p5008j61263j89537N4172o8211j2540
23426a32762P3093J62392J75r5235k8548n5386O3024N2676l2808J2896N2970k4227
23414D8260k7520r0959P7339J61243K4928r6071j08235q8956j12503O3324J99698
23403E0548R3383j7700m7064m1371K2146p8107q2568O0804M5179p3668j21747
23392a90165k3774r6933m7767o2983q5158j1307k5208J28613K49314Q0377p6745
23381a61736N8851k4200J31152M7602k56554j94996R4987l172K6794O5556n8828
23370b74544m1929R0303k2601j6587n6749N7410L7313q9081q0065n5664J95948
23359b56246K53601L2986j56905k1414M2645m5053J18298N6321j4132J73817j04021
$$ plain form
23348 79897 -29647 67894 93192 187062 366732 367090 323894 225498 121763 143009 215699
23337 215699 290345 424749 449226 234879 199361 100961 82441 176115 207364 137818 68898
23326 68898 172645 -17579 -110580 -115528 -20970 -50346 -126638 -98304 101881 171386 206275
23315 206275 194449 9233 -121033 179127 261086 78572 -129584 -367557 -216951 11539
23305 11539 41220 34908 93134 41399 71872 75482 191036 295345 321910 59790 -82825
23294 -82825 -20715 36401 137181 254013 256088 306537 306224 225449 91873 -66112 -42665
23283 -42665 -124097 -16731 -134754 -93265 -4850 69691 27168 90477 101918 165702 288541
23272 288541 272307 144542 81957 128903 -19039 -243517 -56394 126594 160426 247696
$$ packed form
23348G9897j09544R7541K5298R3870J79670L58m3196r8396j03735K1246P2690
23337B15699P4646J34404K4477k14347l5518r8400j8520R3674L1249o9546o8920
23326F8898J03747j90224r3001m948R4558k9376p6292K8334K00185O9505L4889
23315B06275j1826j85216j30266L00160Q1959j82514k08156k37973J50606K28490
23305A1539K9681o312N8226n1735L0473L610J15554J04309K6565k62120j42615
23294h2825O2110N7116J00780J16832K075N0449l13q0775j33576j57985K3447
23283d2665q1432J07366j18023M1489Q8415P4541m2523O3309J1441O3784J22839
23272B88541j6234j27765o2585M6946j47942k24478J87123J82988L3832Q7270
$$ plain form
23262 247696 113375 118701 18985 -7247 -67750 -194536 -286325 -149189 -233277 -248407 -117648
23251 -117648 20937 69818 -74676 9656 185354 91146 9757 -67224 -71915 6586 -56704
23240 -56704 -104110 -132332 -109061 -123307 -107937 -214811 -244158 -150683 -73144 -114647 -168590
23229 -168590 -13767 -79653 -23027 -57256 4382 -6610 119809 20156 -21148 94724 240591
23218 240591 160775 23922 23424 133340 19347 -39537 -75377 -174807 -246332 -140963 -234849
23207 -234849 -323880 -510598 -281839 -90766 -102341 -112425 -89671 44476 97531 -16961
23197 -16961 -272229 -221913 -18413 -135441 -4768 30125 -70490 -167623 -65872 -86189
23187 -86189 70336 234632 302989 159649 6440 35926 88568 -175631 -79369 -152679 -242756
$$ packed form
23262B47696j34321N326r9716k6232o0503j26786r1789J37136q4088j5130J30759
23251a17648J38585M8881j44494Q4332J75698r4208q1389p6981m691P8501o3290
23240e6704m7406k8222K3271j4246J5370j06874k9347R3475P7539m1503n3943
23229a68590J54823o5886N6626l4229O1638j0992J26419r9653m1304J15872J45867
23218B40591p9816j36853m98J09916j13993n8884l5840r9430p1525J05369r3886
23207b34849q9031j86718K28759J91073j1575j0084K2754J34147N3055j14492
23197a6961k55268N0316K03500j17028J30673L4893j00615r7133J01751k0317
23187h6189J56525J64296O8357j43340j53209K9486N2642k64199R6262p3310r0077
$$ plain form
23176 -242756 -167272 -201544 -91196 -111263 -172552 -289027 -247272 -255149 -176364 -158331 -155083
23165 -155083 -241950 -175539 -291120 -440238 -188742 15678 -50279 -35303 -75276 -172833 -174095
23154 -174095 -304351 -218895 -351579 -383045 -412893 -362199 -328882 -387407 -447469 -404401 -390151
23143 -390151 -162009 -108449 -165732 -56872 17783 268655 488218 476072 225843 76487
23133 76487 -32350 -19230 -56457 -39385 4389 105116 103869 50436 4386 -4436 -25021 -158904
23121 -158904 -153468 -192068 -32622 -3592 -29124 -173777 -118542 -180915 -181137 -40004 -67701
23110 -67701 -199983 -106090 9690 -45812 -126577 -123848 -102888 -69336 56194 212888 124404
23099 124404 151147 94441 61750 214762 248540 234045 158715 143629 164630 -60764 -97153
$$ packed form
23176b42756P5484l4272J10348k0067o1289j16475M1755p877P8785J8033L248
23165a55083q6867O6411j15581j49118K51496K04420o5957J4976l9973r7557j262
23154a74095j30256Q5456j32684l1466k9848N0694L3317n8525o0062M3068J4250
23143c90151K28142N3560n7283J08860P4655K50872K19563j2146k50229j49356
23133G6487j08837J3120l7227J7072M3774J00727j247n3433m6050q822k0585j33883
23121a58904N436l8600J59446K9030k5532j44653N5235o2373k22J41133k7697
23110f7701j32282R3893J15780n5502q0765K729K0960L3552J25530J56694q8484
23099A24404K6743n6706l2691J53012L3778j4495p5330j5086K1001k25394l6389
$$ plain form
23088 -97153 -42646 -150523 -281732 -340722 -232590 -161951 -20835 -8658 -48497 -85238 -111132
23077 -111132 -107222 -102599 -251847 -149295 -126602 -216436 -34166 124937 252965 238626 237091
23066 237091 209565 10802 -123426 10968 116904 93183 2645 19437 -140686 -107282
23056 -107282 -21962 148792 231690 220570 237756 136221 -73342 -119784 -54176 -110868 -85703
23045 -85703 -85249 26 56798 -14926 74341 35780 61064 126753 22003 -204614 -219160 -145799
23033 -145799 -80195 21728 32606 139482 13550 -279174 -183276 111884 209846 385033
23023 385033 354274 47412 -73973 -231440 -126892 39424 -81620 -148211 -146393 -246544
23013 -246544 -174825 -274016 -128517 -115155 -221328 -194321 -158665 -73580 -27640 -110912 -239949
$$ packed form
23088i7153N4507j07877j31209n8990J08132P0639J41116J2177l9839l6741k5894
23077a11132L910M623j49248J02552K2693q9834J82270J59103J28028j4339j535
23066B37091k7526j98763j34228J34394J05936k3721r0538J6792j60123L3404
23056a07282Q5320J70754Q2898j1120J7186j01535k09563m6442O5608n6692K5165
23045h5703M54Q5275N6772p1724Q9267l8561K5284O5689j04750k26617j4546P3361
23033a45799O5604J01923J0878J06876j25932k92724R5898K95160R7962J75187
23023C85033l0759l06862j21385j57467J04548J66316j21044o6591J818j00151
23013b46544P1719r9191J45499J3362j06173K7007L5656Q5085M5940q3272j29037
$$ plain form
23002 -239949 -431054 -328819 -182601 -89734 -211032 -322214 -336408 -175297 -233387 -201753
22992 -201753 -156137 -146422 -70140 97960 184215 -42429 -181713 -182101 -5414 85245 147975
22981 147975 10709 81910 66242 -68401 -223824 -188860 66893 69853 -7576 -125682 -113885
22970 -113885 -69316 12122 -27198 -40027 129314 -4618 -201454 -249353 -103428 -170765 -242337
22959 -242337 25223 206939 375594 412751 267816 143688 -63690 6363 249829 213001
22949 213001 160074 63877 -18740 161927 251775 276157 152471 8547 52731 -98542 -257662
22938 -257662 8012 210434 103644 -49555 -76585 27823 -41772 41913 51968 -152837
22928 -152837 -218448 -148280 -119829 -144888 64537 15889 118322 258408 194601 219172 193178
$$ packed form
23002b39949j91105J02235J46218R2867j21298j11182j4194J61111n8090L1634
22992b01753M5616R715P6282J68100Q6255k26644j39284l88J76687R0659O2730
22981A47975j37266P1201j5668j34643j55423L4964K55753K960p7429j18106J1797
22970a13885M4569Q1438l9320j2829J69341j33932j96836m7899J45925o7337p1572
22959b42337K67560J81716J68655L7157j44935j24128k07378P0053K43466l6828
22949B13001n2927r6197q2617J80667Q9848K4382j23686j43924M4184j51273j59120
22938b57662K65674K02422j06790j53199k7030J04408o9595Q3685J0055k04805
22928a52837o5611P0168K8451k5059K09425m8648J02433J40086o3807K4571k5994
$$ plain form
22917 193178 250521 156412 -1388 -152762 -98357 93517 -14004 -214699 -285744 -248950
22907 -248950 -96051 100853 205307 211233 188731 338403 152073 68549 143315 306001
22897 306001 352253 397301 475302 374463 278747 277687 268056 342441 258964 74360 -152224
22886 -152224 -176602 -219062 -336352 -216215 -30256 2018 -82128 -92785 -67223 -151152 -288714
22875 -288714 -226207 -72329 -125117 -177640 -171502 -203005 -107901 -125412 201421 202072 195506 277547
22863 277547 214852 25130 -102785 -82481 87065 82383 -93063 -134504 -120371 -5306 -90705
22852 -90705 -256568 -215882 -258680 -301249 -227939 -142278 -32927 84287 9008 141947 94777
22841 94777 84945 44923 106362 68747 71578 190018 69228 -148044 -169156 -159170 -37013
$$ packed form
22917A93178N7343r4109j57800j51374N4405J91874j07521k00695p1045L6794
22907b48950J52899J96904J04454N926k2502J49672j86330q3524P4766J62686
22897C06001M6252M5048P8001j00839r5716j060r631P4385q3477j84604k26584
22886a52224k4378m2460j17290J20137J85959L2274q4146j0657K5562q3929j37562
22875b88714O2507J53878n2788n2523O138l1503R5104j7511L26833O51o566Q2041
22863B77547o2695j89722j27915K0304J69546m682j75446m1441J4133J15065q5399
22852i0705j65863M0686m2798m2569P3310Q5661J09351J17214p5279J32939m7170
22841I4777r832m0022O1439l7615K831J18440j20790k17272k1112R986J22157
$$ plain form
22830 -37013 -100341 16169 7078 94683 173071 80304 27151 174536 112816 -52861 57504
22819 57504 84965 209518 324361 350755 197747 134296 234498 131207 37981 -27022 -192280
22808 -192280 -214166 -97858 95156 101236 88661 57491 -146330 -174961 -39578 101860 43163
22797 43163 -98783 -141401 -186452 22978 79348 78849 121986 53828 46445 -7893 -198850 -163142
22785 -163142 639 -30535 8894 151967 -18601 -165963 -142910 -121128 -51777 107703
22775 107703 135892 47013 19116 -53129 1574 164158 197465 131933 -15681 -249909 -191886
22764 -191886 -192268 -230718 -102668 -230565 -208510 -170820 -58338 146128 135415 150791 105773
22753 105773 47321 -81946 50736 179323 84825 75635 -53222 -137845 -115395 35757 20496
$$ packed form
22830c7013o3328J16510r091Q7605P8388r2767n3153J47385o1720j65677J10365
22819E7504K7461J24553J14843K6394j53008o3451J00202j03291r3226o5003j65258
22808a92280k1886J16308J93014O080j2575l1170k03821k8631J35383J41438n8697
22797D3163j41946m2618m5051K09430N6370m99M3137o8158p383n4338j90957L5708
22785a63142J63781l1174L9429J43073j70568j47362K3053K1782O9351J59480
22775A07703K8189q8879k7897p2245N4703J62584L3307o5532j47614k34228N8023
22764a91886l82l8450J28050j27897K2055L7690J12482K04466j0713J5376m5018
22753A05773n8452j29267J32682J28587r4498r190j28857q4623K2450J51152j5261
$$ plain form
22742 20496 -42052 86855 371295 341662 262029 272871 231256 -107045 -185069 -290330 -351734
22731 -351734 -303106 -201879 -134867 45968 40822 -51067 -101520 -51801 -107993 -39519 -94943
22720 -94943 -198607 -350116 36068 41939 -295352 -331829 -137572 48945 152925 204774
22710 204774 45399 29864 124361 107687 101237 169009 275562 174777 138262 145154 198958
22699 198958 203133 134344 147094 238994 85874 7312 -129830 -294002 -214884 -136005 -14661
22688 -14661 -42888 -66880 -22412 49228 219963 82533 -310433 -378489 -386903 -244150 -21955
22677 -21955 65684 -11537 84244 183826 108359 12156 -72569 -190369 -329780 -182386 143311
22666 143311 368971 284722 1516 -199265 -47143 152267 194334 279049 263261 292153
$$ packed form
22742B0496o2548J28907K84440k9633p9633J0842m1615l38301p8024j05261o1404
22731c51734M8628J01227O7012J80835n146r1889n0453M9719n6192O8474n5424
22720i4943j03664j51509L86184N871l37291l6477J94257J86517J03980N1849
22710B04774j59375j5535R4497j6674o450O7772J06553j00785l6515O892N3804
22699A98958M175o8789J2750R1900j53120p8562j37142j64172P9118P8879J21344
22688a4661k8227k3992M4468P1640J70735j37430l92966o8056q414J42753K22195
22677b1955Q7639p7221R5781R9582p5467r6203q4725j17800j39411J47394L25697
22666A43311K25660q4249k83206k00781J52122J99410M2067Q4715j5788K8892
$$ plain form
22656 292153 328148 197983 27404 97974 56810 87340 91766 17602 -47552 -99411 37233
22645 37233 151358 -130552 -247522 -230107 -171465 -265936 -287737 -21272 68761 -20825 71014
22634 71014 184024 191945 20126 34116 89219 -66095 -145052 -158141 54002 39084 43753
22623 43753 129222 173217 302913 396346 457437 361282 391314 242847 139414 200641 200982
22612 200982 127323 -2370 -67555 43925 30454 30499 67506 174223 129474 37233 -25244
22601 -25244 -134680 -239332 -244242 -348583 -427638 -391726 -165853 -84721 -12313 140810 139504
22590 139504 23879 -39900 -146210 -177608 -218080 -92142 104628 274880 310012 243223
22580 243223 198933 124523 -13875 -71867 -196282 -245671 -212025 -94420 -105254 -105400 -149670
$$ packed form
22656B92153L5995j30165j70579P0570m1164L0530M426p4164o5154n1859J36644
22645C7233J14125k81910j16970J7415N8642r4471k1801K66465R0033q9586R1839
22634G1014J13010P921j71819J3990N5103j55314p8957j3089K12143j4918M669
22623D3753Q5469M3995J29696R3433O1091r6155L0032j48467j03433O1227L41
22612B00982p3659j29693o5185J11480j3471M5L7007J06717m4749r2241o2477
22601b5244j09436j04652m910j04341p9055L5912K25873Q1132P2408J53123j306
22590A39504j15625o3779j06310l1398m0472J25938J96770J70252L5132o6789
22580B43223m4290p4410j38398n7992j24415m9389L3646J17605j0834j46m4270
$$ plain form
22569 -149670 -134524 -125088 -284474 -149130 3429 -41877 77207 298831 433231 390885
22559 390885 197028 146358 125934 53607 190146 361580 165294 -199938 -221324 -28244
22549 -28244 70899 164855 31088 84921 60473 49498 50195 -30728 44699 69918 190491 150207
22537 150207 -56423 -124323 -99392 -71586 -8933 -38155 -55668 5754 102117 23192 -212107
22526 -212107 -280455 -142102 95856 229560 297821 261490 197233 -35940 -68162 105857
22516 105857 249736 251502 118063 33818 36002 36127 235308 240343 319980 404558 430676 388267
22504 388267 26831 -6938 -60280 -161504 -111251 156285 210147 156235 108724 104388 48430
22493 48430 -211083 -195270 -43686 -78346 -117604 -126410 -53623 69688 73233 -1880 -62739
$$ packed form
22569a49670J5146R436j59386J35344J52559m5306J19084K21624J34400m2346
22559C90885j93857n0670k0424p2327J36539J71434j96286l65232k1386J93080
22549b8244R9143R3956j33767N3833k4448j0975O97q0923P5427K5219J20573m0284
22537A50207k06630o7900K4931K7806O2653k9222j7513O1422R6363p8925k35299
22526b12107o8348J38353K37958J33704O8261l6331o4257k33173l2222J74019
22516A05857J43879J766j33439q4245K184J25J99181N035P9637Q4578K6118m2409
22504C88267l61436l3769n3342j01224N0253K67536N3862n3912m7511m336n5958
22493D8430k59513J5813J51584l4660l9258q806P2787J23311L545p5113o0859
$$ plain form
22482 -62739 108773 54144 82202 -26007 -62428 -32046 24236 240469 300497 419326 493946
22471 493946 328644 43085 -287130 -274785 -101609 -74878 -1284 178304 171660 107039 47994
22460 47994 116054 204292 270861 195417 49197 1114 -51484 44490 218803 167932 212882
22449 212882 243382 118015 -93269 4487 117807 223459 314695 262692 -14991 -136394
22439 -136394 7263 57590 121863 263711 107839 48644 27881 -5618 252651 343115 471333
22428 471333 471768 419658 211852 80853 80587 129694 237942 264963 217796 369861 185809
22417 185809 146815 156325 214846 281163 233049 288531 277448 172238 129238 -70102 -64400
22406 -64400 192198 301564 77253 48374 212024 268607 378935 304182 165562 59962
$$ packed form
22482f2739J71512n4629K8058j08209l6421L0382N6282K16233O0028J18829P4620
22471D93946j65302k85559l30215J2345J73176K6731P3594J79588o644o4621n9045
22460D7994O8060Q8238O6569p5444j46220m8083n2598R5974J74313n0871M4950
22449B12882L0500j25367k11284R7756J13320J05652R1236n2003k77683j21403
22439a36394J43657N0327O4273J41848j55872n9195k0763l3499K58269R0464J28218
22428D71333M35n2110k07806j30999k66M9107J08248K7021m7167J52065j84052
22417A85809l8994R510N8521O6317m8114N5482j1083j05210m3000j99340N702
22406f4400K56598J09366k24311k8879J63650N6583J10328p4753j38620j05600
$$ plain form
22396 59962 68221 129948 232869 315737 460553 316911 298962 300762 370322 417110 264240
22385 264240 254650 75531 160141 279611 275692 221497 257649 217451 137366 170117 194275
22374 194275 209725 130720 93779 -22022 3059 117556 37224 -38063 54158 157243 159130
22363 159130 238667 563831 518185 568683 484296 261733 296520 301363 317275 308005 256016
22352 256016 75327 44899 273184 250745 307515 233615 126736 174023 109270 9338 89188
22341 89188 164289 295538 580883 502164 440048 394150 292675 139690 155983 84069 43740
22330 43740 145991 305631 454337 478728 513301 512529 556096 459909 433165 441228 388459 457113
22318 457113 309873 377152 282739 63370 168339 503083 560750 644640 699277 582789
$$ packed form
22396E9962Q259O1727J02921Q2868J44816j43642j7949J800O9560M6788j52870
22385B64240r590j79119Q4610J19470l919n4195L6152m0198q0085L2751K4158
22374A94275J5450p9005l6941j15801K5081J14497q0332p5287R2221J03085J887
22363A59130P9537L25164m5646N0498q4387k22563L4787M843J5912r270n1989
22352B56016j80689l0428K28285k2439N6770p3900j06879M7287o4753r9932P9850
22341H9188P5101J31249K85345p8719o2116m5898j01475j52985J6293p1914m0329
22330D3740J02251J59640J48706K4391L4573p72M3567r6187k6744Q063n2769O8654
22318D57113j47240O7279r4413k19369J04969L34744N7667Q3890N4637j16488
$$ plain form
22308 582789 533912 405173 376937 337058 394063 469635 591974 619677 505445 366004 192805
22297 192805 357784 408585 418154 483427 516509 630474 564140 546512 414487 293254 378964
22286 378964 188189 140240 122300 233837 390749 426676 375071 521389 519379 556876 638744
22275 638744 727864 664913 415064 270701 290748 320478 361752 511146 714340 848541
22265 848541 972855 903018 850126 977970 851721 719806 682507 754391 714698 580509
22255 580509 560801 517708 730739 741066 596415 599044 644597 573201 542136 573903 624816
22244 624816 618687 614885 680815 670747 740604 889079 951164 849520 700595 731415 705544
22233 705544 858690 854238 792953 794048 905971 937229 878843 841505 1024237 1100500 1023457
$$ packed form
22308E82789m8877j28739k8236l9879N7005P5572J22339K7703j14232j39441j73199
22297A92805J64979N0801R569O5273L3082J13965o6334j7628j32025j21233Q5710
22286C78964j90775m7949j7940J11537J56912L5927n1605J46318k010L7497Q1868
22275F38744Q9120o2951k49849j44363K0047K9730M1274J49394K03194J34201
22265H48541J24314o9837n2892J27844j26249j31915l7299P1884l9693j34189
22255E80509j9708m3093K13031J0327j44651K629M5553p1396l1065L1767N0913
22244F24816o129l802O5930j0068O9857J48475O2085j01644j48925L0820k5871
22233G05544J53146m452o1285J095J11923L1258n8386l7338J82732P6263p7043
$$ plain form
22222 1023457 1113052 1244221 1204691 1204386 1277326 1347705 1426171 1264288 1341009 1602309 1615749
22211 1615749 1476307 1385529 1468717 1472415 1375864 1250426 1388852 1457310 1408900 1544325 1606673
22200 1606673 1536759 1253221 1222033 1386596 1394939 1449658 1736350 1747847 1728693 1720728 1969046
22189 1969046 2212121 2243826 2032877 1871706 2055189 2235313 2188022 2075989 1966574 1980036
22179 1980036 2018420 2056602 2096838 2352983 2580488 2514351 2386986 2317831 2437362 2413902
22169 2413902 2493257 2649946 2661048 2882328 2904134 2704313 2663696 2827773 2936124 2864313
22159 2864313 3181941 3386408 3458320 3628129 3773342 3827157 3907377 3909069 3886150 3831031 3823245
22148 3823245 3796448 3818741 3958833 4034545 4224233 4356728 4451955 4417122 4389038 4483106 4539786
$$ packed form
22222A023457Q9595J31169l9530l05P2940P0379P8466j61883P6721K61300J3440
22211A615749j39442r0778Q3188L698r6551j25438J38426O8458m8410J35425O2348
22200A606673o9914k83538l1188J64563Q343N4719K86692J1497j9154p965K48318
22189A969046K43075L1705k10949j61171J83483J80124m7291j12033j09415J3462
22179A980036L8384L8182M0236K56145K27505o6137j27365o9155J19531k3460
22169B413902P9355J56689J1102K21280K1806j99821m0617J64077J08351p1811
22159B864313L17628K04467P1912J69809J45213N3815Q0220J692k2919n5119p786
22148C823245k6797K2293J40092P5712J89688J32495R5227l4833k8084R4068N6680
$$ plain form
22137 4539786 4665488 4945344 5149202 5299227 5322005 5367239 5408548 5306957 5542896 5650152
22127 5650152 5811903 6053087 6177188 6110186 5992376 5991062 5993266 6149332 6337486 6513431
22117 6513431 6515387 6508868 6459378 6657294 7047289 7141896 7211384 7310925 7430003 7385943 7571276
22106 7571276 7661600 7623402 7782295 8031873 8028027 8086103 8132649 8336592 8603749 8900757
22096 8900757 8964777 8764420 8807595 9056921 9353638 9540966 9447129 9386563 9475296 9472264 9532288
22085 9532288 9592223 9755120 9836061 9647858 9679244 9879215 9898936 10046491 10242547 10426735
22075 10426735 10547852 10569793 10343556 10301946 10475540 10609717 10735720 10759215 10988005 11112774
22065 11112774 10961148 11036349 11111545 11107511 11227633 11197058 11221654 11200775 11075359 11270669
$$ packed form
22137D539786J25702K79856K03858J50025K2778M5234M1309j01591K35939J07256
22127E650152J61751K41184J24101o7002j17810j314K204J56066J88154J75945
22117F513431J956o519m9490J97916L89995R4607O9488R9541J19078m4060J85333
22106G571276R0324l8198J58893K49578l846N8076M6546K03943K67157K97008
22096H900757O4020k00357M3175K49326K96717J87328r3837o0566Q8733l032O0024
22085I532288N9935J62897Q0941j88203L1386J99971J9721J47555J96056J84188
22075A0426735J21117K1941k26237m1610J73594J34177J26003K3495K28790J24769
22065A1112774j51626P5201P5196m034J20122l0575K4596k0879j25416J95310
$$ plain form
22055 11270669 11486674 11485963 11597352 11637538 11740372 11747954 11618451 11536621 11561242 11510063 11275661
22044 11275661 11339037 11354229 11364739 11659094 11836606 11663306 11537041 11578231 11540179 11400280
22034 11400280 11583637 11679762 11510954 11336561 11343912 11233161 11256474 11328779 11188385 11226928
22024 11226928 11323496 11253265 11234745 11208309 10969641 10840197 10769662 10831861 10971988 10916711
22014 10916711 10721331 10502004 10490833 10585678 10573377 10451151 10206445 10094257 9999469 9720333
22004 9720333 9764904 9808369 9601404 9474453 9471660 9483124 9244681 9086877 9139112 9069123 8915424
21993 8915424 8843279 8888481 8957749 8616529 8619187 8736404 8492233 8270508 8360172 8234947
21983 8234947 8138703 7984859 7712640 7652765 7511818 7457880 7521782 7450137 7100569 7019346
$$ packed form
22055A1270669K16005p11J11389M0186J02834P582j29503q1830K4621n1179k34402
22044A1275661O3376J5192J0510K94355J77512j73300j26265M1190l8052j39899
22034A1400280J83357R6125j68808j74393P351j10751K3313P2305j40394L8543
22024A1226928R6568p0231j8520k6436k38668j29444p0535O2199J40127n5277
22014A0916711j95380k19327j1171R4845j2301j22226k44706j12188r4788k79136
22004I720333M4571M3465k06965j26951k793J1464k38443j57804N2235o9989j53699
21993H915424p2145M5202O9268l41220K658J17217k44171k21725Q9664j25225
21983H234947r6244j53844k72219n9875j40947n3938O3902p1645l49568q1223
$$ plain form
21973 7019346 7323580 7415314 7209843 7006193 6791888 6771577 6589718 6397220 6379806 6443671
21963 6443671 6419206 6573379 6363218 6223266 6177118 6035104 5759492 5660960 5462702 5361587
21953 5361587 5377413 5244603 5124942 5161312 5105398 4988762 5041396 5034545 4895179 4891594 4867872
21942 4867872 4780858 4698560 4661519 4535103 4409001 4262955 4075057 3991095 4060658 3959046
21932 3959046 3713217 3490269 3365074 3372991 3464317 3451546 3351181 3271752 3112457 3043623
21922 3043623 3161985 3211051 3180869 3162391 3132710 2912585 2749827 2741666 2646794 2565958 2481346
21911 2481346 2354063 2310963 2270152 2172044 2116524 2121746 2091206 2124464 2105409 2121239 2075269
21900 2075269 2261606 2211980 2044145 1973709 1889356 1899527 1869275 1712811 1683723 1750618 1803274
$$ packed form
21973G019346L04234R1734k05471k03650k14305k0311j81859j92498j7414O3865
21963F443671k4465J54173k10161j39952m6148j42014k75612r8532j98258j01115
21953E361587J5826j32810j19661L6370n5914j16636N2634o851j39366l585k3722
21942D867872q7014q2298l7041j26416j26102j46046j87898q3962O9563j01612
21932C959046k45829k22948j25195P917R1326j2771j00365p9429j59295o8834
21922C043623J18362M9066l0182j8478k9681k20125j62758q161r4872q0836q4612
21911B481346j27283m3100m0811r8108n5520N222l0540L3258j9055J5830m5970
21900B075269J86337m9626j67835p0436q4353J0171l0252j56464k9088O6895N2656
$$ plain form
21889 1803274 1764615 1872415 1798721 1697333 1732751 1825303 1823420 1759485 1483290 1518583 1544325
21878 1544325 1376157 1397794 1522162 1572256 1463272 1325505 1233090 1217221 1343916 1214501
21868 1214501 1030778 1067838 1175858 1094639 1123804 1250383 1268228 1173340 1054114 1250839
21858 1250839 1194709 1187294 1114135 928515 952913 935958 1138107 1168305 951317 947092 861291
21847 861291 1019654 1109784 1130060 1101141 1084072 1144054 968432 901613 914924 810023 801760
21836 801760 890948 890127 776247 808251 839618 846403 860010 874512 760253 725239 903433
21825 903433 821151 833803 1002388 939321 689160 686460 645406 759883 606749 562798 717411
21814 717411 680508 667661 797475 675176 572590 621712 749811 753013 630158 520663
$$ packed form
21889A803274l8659J07800p3694j01388L5418R2552j883o3935k76195L5293K5742
21878A544325j68168K1637J24368N0094j08984j37767r2415j5869J26695j29415
21868A214501j83723L7060J08020q1219K9165J26579J7845r4888j19226J96725
21858A250839n6130p415p3159j85620K4398j6955K02149L0198k16988m225q5801
21847H61291J58363R0130K0276k8919j7069N9982j75622o6819J3311j04901q263
21836H01760Q9188q21j13880L2004L1367O785J3607J4502j14259l5014J78194
21825I03433q2282J2652J68585o3067k50161k700m1054J14477j53134m3951J54613
21814G17411l6903j2847J29814j22299j02586M9122J28099L202j22855j09495
$$ plain form
21804 520663 570817 652389 814713 660534 577101 545261 377105 241604 282562 347861 517238
21793 517238 401427 330109 481075 628235 559903 654808 686684 569523 443453 385927
21783 385927 198241 3361 -28369 213965 327264 197219 111903 82929 179903 391389
21773 391389 273623 167940 163553 212068 282306 363155 346669 362112 481768 469596 378702
21762 378702 280668 381379 458038 397895 421389 436554 309282 331937 255259 128142 209331
21751 209331 147011 309315 193881 248344 261927 314814 379952 309456 349130 461355 362196
21740 362196 2602 -32767 313266 309584 176912 40128 -23562 6323 -15840 167869 325100
21729 325100 160398 108745 155665 84321 69107 162773 383475 368410 408197 260924 36381
$$ packed form
21804E20663N0154Q1572J62324j54179q3433l1840j68156j35501M0958O5299J69377
21793E17238j15811p1318J50966J47160o8332R4905L1876j17161j26070n7526
21783C85927j87686j94880l1730K42334J13299j30045q5316k8974R6974K11486
21773C91389j17766j05683m387M8515P0238Q0849j6486J5443J19656j2172r0894
21762C78702r8034J00711P6659o0143K3494J5165j27272K2655p6678j27117Q1189
21751B09331o2320J62304j15434N4463J3583N2887O5138p0496L9674J12225r9159
21740C62196l59594l5369L46033l682j32672j36784o3690K9885k2163J83709J57231
21729C25100j64702n1653M6920p1344j5214R3666K20702j5065L9787j47273k24543
$$ plain form
21718 36381 125427 238059 235581 152535 237127 211845 161256 225905 239860 172670 147452 93740
21706 93740 -31913 -17648 -16008 -29427 279868 310404 79784 -49791 -157286 71254 235350
21695 235350 297777 390454 271858 141325 176579 214014 121231 140729 23789 -24732 16652
21684 16652 148578 92967 -65964 -113100 -158656 -125771 -5991 -86096 -56632 130422 42574
21673 42574 -8696 15502 -73332 -291245 -255333 -229770 -180322 60658 135872 211877 113217
21662 113217 139940 267944 355777 223950 -73089 -152221 -40202 22890 178665 139872
21652 139872 42534 76715 68204 101027 95977 59987 22136 -34165 17978 19926 87651 -81669
21640 -81669 -129984 -97257 -249844 -146022 79395 297300 182239 98444 282221 153349
$$ packed form
21718C6381Q9046J12632k478q3046Q4592k5282n0589O4649J3955o7190k5218n3712
21706I3740j25653J4265J640j3419L09295L0536k30620j29575j07495K28540J64096
21695B35350O2427R2677j18596j30533L5254L7435r2783J9498j16940m8521M1384
21684A6652J31926n5611j58931m7136m5556L2885J19780q0105K9464J87054q7848
21673D2574n1270K4198q8834k17913L5912K5563M9448K40980P5214P6005r8660
21662A13217K6723J28004Q7833j31827k97039p9132J12019O3092J55775l8793
21652A39872r7338L4181q511L2823n050l5990l7851n6301N2143J948O7725j69320
21640h1669m8315L2727j52587J03822K25417K17905j15061q3795J83777j28872
$$ plain form
21630 153349 -111437 -135239 113907 263038 -59621 -256979 -245305 -147706 69796 273814
21620 273814 302860 350899 300950 143197 59639 98245 46683 -191543 -190512 -56751 131336
21609 131336 67988 193836 139120 106125 149624 95808 -46291 69042 240604 134032
21599 134032 -83852 -119891 -3044 4424 -39030 -21821 81398 34373 76049 188210 124608
21588 124608 164586 -9662 -150423 14999 80695 -90141 -116856 72874 202015 255720
21578 255720 306789 230368 177305 199799 326623 498803 244106 61627 -33049 -42720 -59239
21567 -59239 -16702 -73542 9061 -116485 -14197 7082 3536 -38175 29532 45661 21996
21556 21996 5370 -26899 -118778 64677 222231 102967 -282633 -280986 -180840 15586 -87546
$$ packed form
21630A53349k64786k3802K49146J49131l22659j97358J1674R7599K17502K04018
21620B73814K9046M8039m9949j57753q3558L8606n1562k38226J031J33761J88087
21609A31336o3348J25848n4716l2995M3499n3816j42099J15333J71562j06572
21599A34032k17884l6039J16847P468m3454J7209J03219m7025M1676J12161o3602
21588A24608L9978j74248j40761J65422O5696j70836k6715J89730J29141N3705
21578B55720N1069p6421n3063K2494J26824J72180k54697j82479r4676r671j6519
21567e9239M2537n6840Q2603j25546J02288K1279l546m1711O7707J6129k3665
21556B1996j6626l2269r1879J83455J57554j19264l85600J647J00146J96426j03132
$$ plain form
21545 -87546 -68330 225354 258564 38169 -130524 -169242 -180477 -192243 -353747 -351842 -234399
21534 -234399 -76626 69075 82995 -45733 -87453 -112409 -154378 -244069 -195863 -81982 -9579
21523 -9579 125510 188010 105288 162636 353991 274013 409586 317354 192422 16754 -138002
21512 -138002 -227123 -258440 -30626 -203108 -246714 -185940 -124803 -83916 -79067 90452 137929
21501 137929 -27584 -204393 -91907 -19677 -13771 31918 136995 13161 -202666 -160614
21491 -160614 101110 40230 -93987 -1941 -50705 73402 84167 78489 70557 106562 227501
21480 227501 137363 -115001 -215247 -96445 83294 24127 -32082 -150585 -161953 -189187
21470 -189187 -249367 -278832 -179925 -11458 154943 125813 -10783 23222 47560 -19006 12511
$$ packed form
21545h7546J9216K93684L3210k20395j68693l8718j1235j1766j61504J905J17443
21534b34399J57773J45701J3920j28728m1720k4956m1969q9691M8206J13881P2403
21523i579J35089O2500q2722N7348J91355p9978J35573r2232j24932j75668j54756
21512a38002q9121l1317K27814j72482m3606O0774O1137M0887M849J69519M7477
21501A37929j65513j76809J12486P2230N906M5689J05077j23834k15827M2052
21491a60614K61724o0880j34217R2046m8764J24107J0765n678p932L6005J20939
21480B27501r0138k52364j00246J18802J79739n9167n6209j18503j1368k7234
21470a89187o0180k9465R8907J68467J66401k9130j36596L4005K4338o6566L1517
$$ plain form
21459 12511 -84718 -27513 62688 95116 -142124 -354479 -473129 -472298 -322926 -34648 185850
21448 185850 -185 -215906 -296767 -229784 -80224 164509 93908 122887 87949 100517 189347
21437 189347 64175 -63485 90788 37945 71301 -60108 -203495 -196068 -154760 -73772 -156930
21426 -156930 -246852 -264411 -182598 -132635 -43269 -213603 -442936 -274364 -170740 -125828 -3193
21415 -3193 -53181 7688 -42508 -134686 -114546 -22871 -13037 -91585 -125872 -136697 -2672 84825
21403 84825 -55405 -148859 118469 297384 137935 -61530 -52152 -166007 -137105 -30179
21393 -30179 105128 278583 258197 337102 192956 74673 41332 72936 143602 -6241 -58119
21382 -58119 -19908 -76729 -137550 -167569 -158615 -189978 -124550 -202797 -398726 -183570 -147189
$$ packed form
21459A2511r7229N7205R0201L2428k37240k12355j18650Q31J49372K88278K20498
21448A85850j86035k15721q0861O6983J49560K44733p0601K8979l4938J2568Q8830
21437A89347j25172j27660J54273n2843L3356j31409j43387P427M1308Q0988q3158
21426a56930q9922j7559Q1813M9963Q9366j70334k29333J68572J03624M4912J22635
21415c193m9988O0869n0196r2178K0140R1675R834p8548l4287j0825J34025Q7497
21403H4825j40230r3454K67328J78915j59449j99465R378j13855K8902J06926
21393c0179J35307J73455k0386P8905j44146j18283l3341L1604P0666j49843n1878
21382e8119L8211n6821o0821l0019Q954l1363O5428p8247j95929K15156L6381
$$ plain form
21371 -147189 -229090 -94063 24049 173257 120504 8948 -141174 -211090 -322141 -303556
21361 -303556 -116682 78949 55427 -71118 -19888 60770 66102 -79705 -57508 -72068 -3348
21350 -3348 150237 155486 -13460 -98354 179838 540345 453720 91055 -37281 -114367 -220808
21339 -220808 -334458 -113807 -47561 -78398 -96928 -24300 -11303 -209085 -277678 -66544 38034
21328 38034 252852 342810 238244 239566 67848 -165601 -321137 -189129 -75991 -160625
21318 -160625 -242371 -286840 -151689 -221442 -400736 -382510 -306148 -192290 -188313 -186191 -269934
21307 -269934 -385196 -278105 -106530 -213561 -227322 -53522 -48009 -120896 -322082 -248185
21297 -248185 -111110 -130851 -254115 -221596 -200230 -136740 44076 124581 6834 -32684 -80455
$$ packed form
21371a47189q1901J35027J18112J49208n2753j11556j50122o9916j11051J8585
21361c03556J86874J95631k3522j26545N1230Q0658N332j45807K2197j4560O8720
21350c348J53585N249j68946q4894K78192L60507q6625l62665j28336p7086j06441
21339b20808j13650K20651O6246l0837j8530P2628J2997j97782o8593K11134J04578
21328C8034K14818Q9958j04566J322j71718k33449j55536J32008J13138q4634
21318a60625q1746m4469J35151o9753j79294J8226P6362J13858L977K122q3743
21307b69934j15262J07091J71575j07031j3761J73800N513p2887k01186P3897
21297b48185J37075j9741j23264L2519K1366O3490J80816Q0505j17747l9518m7771
$$ plain form
21286 -80455 -169363 -65758 -164322 -362542 -310162 -156438 -134772 -123696 -124314 -121901 -147288 -165609
21274 -165609 -216348 -125208 -121482 -82466 61800 265847 186095 -58735 -343307 -222563 -25395
21263 -25395 -147193 -138971 58999 -5928 -247650 -308240 -276592 -79509 189262 63446 -103841
21252 -103841 41516 24089 3276 -63374 -164192 5370 -14871 -147130 -298457 -407045
21242 -407045 -295944 -230713 -131183 19616 14737 57040 -107409 88344 123354 159934 125888
21231 125888 64956 -251561 -296190 -202662 -160787 -27793 26569 142910 114980 91954 35312
21220 35312 -186774 -250200 -149137 -143716 -235685 -273210 -336922 -218169 -122856 -225092 -155983
21209 -155983 4060 102195 138691 235087 109185 -49978 -118709 -211064 -179762 44805 70278
$$ packed form
21286h0455q8908J03605r8564j98220N2380J53724K1666J1076o18K413k5387j8321
21274a65609n0739R1140L726L9016J44266K04047p9752k44830k84572J20744J97168
21263b5395j21798Q222J97970o4927k41722o0590L1648J97083K68771j25816j67287
21252a03841J45357j7427k0813o6650j00818J69562k0241j32259j51327j08588
21242d07045J11101O5231R9530J50799m879M2303j64449J95753L5010L6580l4046
21231A25888o0932l16517m4629R3528M1875J32994N4362J16341k7930k3026n6642
21220C5312k22086o3426J01063N421r1969l7525o3712J18753R5313j02236O9109
21209a55983J60043R8135L6496R6396j25902j59163o8731r2355L1302K24567K5473
$$ plain form
21198 70278 22511 -66919 -116403 -26724 -54198 -52904 177998 227415 45119 -163402 -158065
21187 -158065 -105421 -176314 -208044 -192940 -157455 41606 136632 4235 -103820 20852 139433
21176 139433 230467 286908 120333 -78347 -147561 -225843 -279336 -172630 -44296 100965
21166 100965 25882 -202546 -144634 -91916 -117737 -325972 -261907 -85483 -51237 7292 -49180
21155 -49180 3688 101483 67165 -172042 -303151 -268976 -162682 -149613 -84285 -51131 -4455
21144 -4455 284686 84473 -35546 -160899 -425380 -466700 -309597 -245324 -56104 -61304 -61420
21133 -61420 -103604 -253953 -248833 -208873 -138661 -228818 -249436 -229918 -150798 -128331 -166683 -208948
21121 -208948 -241105 -358533 -738215 -594966 -303885 -170622 -135821 -129706 -65344 -193657
$$ packed form
21198G0278m7767q9430m9484Q9679k7474J294K30902M9417j82296k08521N337
21187a58065N2644p0893l1730J5104L5485J99061R5026j32397j08055J24672J18581
21176A39433R1034N6441j66575j98680o9214p8282n3493J06706J28334J45261
21166A00965p5083k28428N7912N2718k5821k08235O4065J76424L4246N8529n6472
21155d9180N2868R7795l4318k39207j31109L4175J06294J3069O5328L3154M6676
21144d455K89141k00213j20019j25353k64481m1320J57103O4273J89220n200j16
21133f1420m2184j50349N120L9960P0212r0157k0618J9518P9120K2467l8352m2265
21121b08948l2157j17428l79682J43249K91081J33263L4801O115O4362j28313
$$ plain form
21111 -193657 -261711 -275400 -61592 -66003 -108663 -30564 -282004 -317897 -168023 -140806 107424
21100 107424 100100 -163947 -311145 -115855 -45000 -46500 80151 75610 12531 -26626 50808
21089 50808 -61833 -189608 -42204 -43610 101347 124721 35172 23709 -254937 -318066 -311472
21078 -311472 -269634 -147288 -264606 -253688 -287966 -412901 -374644 -330870 -179039 -123269 -79599
21067 -79599 -87781 -119966 -153147 -175586 -86256 -144600 -46833 -72195 -149813 -192660 -92575 -6987
21055 -6987 -1767 -75186 -31213 -10227 101371 52120 65544 93735 40909 28753 -130035 -200368
21043 -200368 -226403 -224443 -393830 -340616 -254598 -218353 -124711 -196481 -287253 -250086 -90316
21032 -90316 -29325 -53731 -31636 69900 5603 243674 330122 305787 220190 105972 87859
$$ packed form
21111a93657o8054j3689K13808m411m2660P8099k51440l5893J49874K7217K48230
21100A07424p324k64047j47198J95290P0855j500J26651m541o3079l9157P7434
21089E0808j12641j27775J47404j406J44957K3374q9549j1463k78646o3129O594
21078c11472M1838J22346j17318J0918l4278j24935L8257M3774J51831N5770M3670
21067g9599q182l2185l3181k2439Q9330n8344R7767k5362p7618m2847J00085Q5588
21055f987N220p3419M3973K0986J11598m9251J3424K8191n2826j2156j58788p0333
21043b00368k6035J960j69387N3214Q6018L6245R3642p1770r0772L7167J59770
21032i0316O0991k4406K2095J01536o4297K38071Q6448k4335q5597j14218j8113
$$ plain form
21021 87859 164775 151987 55620 94400 3304 20402 70587 -44260 -29943 76624 -142221
21010 -142221 -155274 -17107 -32348 -32640 -54797 -116135 -99769 -73903 -86296 488 -130137
20999 -130137 -349951 -348535 -277891 -149708 -101145 134617 199790 160531 283194 -34808 -123584
20988 -123584 -219877 -394613 -184469 25719 205703 44838 -4903 -65328 -254254 -169245
20978 -169245 -29428 26292 234914 183352 54774 -190186 -354139 -318857 -311914 -402854 -458602
20967 -458602 -393232 -135421 -72386 25054 80598 -16629 98967 244846 131812 18622
20957 18622 -144027 -382041 -293989 -58254 108086 89013 68722 -126067 -126141 -167050 -134280
20946 -134280 -296465 -211912 -240537 -352254 -226299 -197562 -97539 -157020 -176344 -261983 -330360
$$ packed form
21021H7859P6916j2788r6367L8780r1096J7098N0185j14847J4317J06567k18845
21010a42221j3053J38167j5241k92k2157o1338J6366K5866j2393Q6784j30625
20999a30137k19814J416P0644J28183M8563K35762O5173l9259J22663l18002q8776
20988a23584r6293j74736K10144K10188J79984j60865m9741o0425j88926Q5009
20978a69245J39817N5720K08622n1562j28578k44960j63953L5282O943r0940n5748
20967d58602O5370K57811O3035R7440N5544r7227J15596J45879j13034j13190
20957A8622j62649k38014Q8052K35735J66340j9073k0291j94789p4m0909L2770
20946a34280j62185Q4553k8625j11717J25955K8737J00023n9481j9324q5639o8377
$$ plain form
20935 -330360 -344131 -339709 -304338 -248828 -138965 -229155 -172625 -14260 6713 132427 50384
20924 50384 -57237 37652 39806 -152557 -181175 -189222 -148506 -126210 -220816 -249660 -57765
20913 -57765 14196 18388 -51010 -112191 -71998 -239859 -250672 -219729 -139217 45328 -144943
20902 -144943 -202446 -67637 -150318 -262655 -225313 -149358 -45409 -42632 12954 79271 228516
20891 228516 188390 22876 62990 85554 -159446 -184693 -21588 149344 288883 118721
20881 118721 94100 306690 330750 217187 198393 157312 -55725 -177882 -248234 -8941
20871 -8941 50656 -15462 -15234 56383 -18421 -208030 -46478 85012 35053 35974 127857 181477
20859 181477 160464 111324 81011 67269 104509 167493 -47170 66509 117578 49719 -80532
$$ packed form
20935c30360j3771M422L5371N5510J09863r0190N6530J58365K0973J25714q2043
20924E0384j07621R4889K154j92363k8618q047M0716K2296r4606k8844J91895
20913e7765P1961M192o9398o1181M0193j67861j0813L0943Q0512J84545j90271
20902a44943n7503J34809q2681j12337L7342P5955J03949K777N5586O6317J49245
20891B28516m0126j65514M0114K2564k45000k5247J63105J70932J39539j70162
20881A18721k4621K12590K4060j13563j8794m1081k13037j22157p0352K39293
20871h941N9597o6118K28P1617p4804j89609J61552J31490m9959R21R1883N3620
20859A81477k1013m9140l0313j3742L7240O2984k14663J13679N1069o7859j30251
$$ plain form
20848 -80532 -159029 -259206 -66580 1510 43389 78050 38273 81485 -69723 -268589 -276578
20837 -276578 -152382 -243064 -217641 -237649 -144080 -241435 -260377 -219920 -137213 -12356 34203
20826 34203 -79134 -338120 -313197 -125747 -6509 163605 332722 260838 104025 -47946
20816 -47946 46166 185361 206955 -24191 -98341 -146096 -204452 -139764 24697 226674 76842
20805 76842 -52622 -199806 -240694 -85355 -152902 -297364 -288037 -329140 -240266 -135841 -196436
20794 -196436 -40923 221849 246811 176842 154833 41733 21756 -126453 -240813 -222614
20784 -222614 -166416 -263511 -498046 -496258 -355346 -297323 -143926 -59555 -78526 43140 15680
20773 15680 22276 -82577 -245490 -421388 -203219 -111056 -85942 26157 85663 -21299 -101447
$$ packed form
20848h0532p8497j00177J92626O8090M1879L4661l9777M3212j51208j98866p989
20837b76578J24196r0682K5423k0008R3569r7355j8942M0457Q2707J24857M6559
20826C4203j13337k58986K4923J87450J19238J70114J69117p1884j56813j51971
20816d7946R4112J39195K1594k31146p4150m7755n8356O4688J64461K01977j49832
20805G6842j29464j47184m0888J55339o7547j44462R327m1103Q8874J04425o0595
20794a96436J55513K62772K4962o9969k2009j13100j9977j48209j14360J8199
20784b22614N6198r7095k34535J788J40912N8023J53397Q4371j8971J21666k7460
20773A5680O596j04853j62913j75898K18169R2163K5114J12099N9506j06962q0148
$$ plain form
20762 -101447 -110635 4626 10305 38469 113770 212520 272747 161077 -124201 -282191 -401253
20751 -401253 -222714 -349023 -453710 -351619 -306859 -48941 -116432 -129778 -25096 45248
20741 45248 41009 -80524 -249799 -320839 -106709 -220653 -185568 -158509 -62199 -30127 -96550
20730 -96550 -69477 -115937 40458 198623 312247 308117 58336 -282575 -237436 -79791 21513
20719 21513 9921 189309 176189 225879 180404 141875 68057 -47515 -210932 -360066 -311886
20708 -311886 -227347 -99743 8157 -56988 -134511 -124207 -70508 -179219 -139623 -190410 -295729
20697 -295729 -183656 -9601 -52618 -166523 -194418 -316132 -332389 -154325 -190571 -135479
20687 -135479 62869 170409 197236 238561 25473 -207040 -118628 -119186 -84573 -91493 -55888
$$ packed form
20762a01447r188J15261N679K8164P5301R8750O0227j11670k85278j57990j19062
20751d01253J78539j26309j04687J02091M4760K57918o7491j3346J04682P0344
20741D5248m239j21533j69275p1040K14130j13944L5085K7059R6310L2072o6423
20730i6550K7073m6460J56395J58165J13624m130k49781l40911M5139J57645J01304
20719B1513j1592J79388j3120M9690m5475l8529p3818j15572j63417j49134M8180
20708c11886Q4539J27604J07900o5145p7523J0304N3699j08711L9596n0787j05319
20697b95729J12073J74055m3017j13905k7895j21714j6257J78064l6246N5092
20687a35479J98348J07540K6827M1325k13088k32513Q8412n58L4613o920L5605
$$ plain form
20676 -55888 -249154 -491135 -436020 -438328 -432597 -400862 -281995 -226611 -288817 -239214 -294864
20665 -294864 -205841 -167032 -100386 -177143 77184 188862 137905 -78282 -241277 -382692
20655 -382692 -284813 -175126 -118525 7844 21017 106194 240794 251894 392699 326987 123577
20644 123577 55799 93542 116397 16967 -131165 -167610 -235491 -390455 -172518 -76962 -213803
20633 -213803 -480528 -487386 -513404 -458353 -348199 -177365 -114559 21093 -1895 46533 13317
20622 13317 -105338 -60375 -241371 -382424 -230718 -323002 -522575 -546185 -453801 -308302
20612 -308302 -278534 -282722 -297620 -405181 -414218 -361129 -326906 -465901 -459083 -221938 -93771
20601 -93771 26013 -168577 -251565 -329121 -272275 -255614 -290198 -81705 125571 124676 116479
$$ packed form
20676e5888j93266k41981N5115k308N731L1735J18867N5384o2206M9603n5650
20665b94864Q9023L8809O6646p6757K54327J11678n0957k16187j62995j41415
20655c82692R7879J09687N6601J26369J3173Q5177J34600J1100J40805o5712k03410
20644A23577o7778L7743K2855r9430j48132l6445o7881j54964K17937R5556j36841
20633b13803k66725o858k6018N5051J10154J70834O2806J35652k2988M8428l3216
20622A3317j18655M4963j80996j41053J51706r2284j99573k3610R2384J45499
20612c08302K9768m188j4898j07561r037N3089L4223j38995O818K37145J28167
20601i3771J19784j94590q2988p7556N6846J6661l4584K08493K07276q95q197
$$ plain form
20590 116479 74044 -100796 -178934 -209759 -233540 -371717 -270647 -201595 -119258 -203674 -252291
20579 -252291 -99337 86282 30906 38214 191554 227721 139845 -12367 -190824 -226773 -199493
20568 -199493 -290895 -288273 -280995 -282875 -415152 -449065 -496834 -402835 -467984 -490349 -497785 -518786
20556 -518786 -336894 -181754 -75534 17170 1360 3031 -79834 -66727 104185 104621 -21846
20545 -21846 64711 152208 177834 58785 -106745 -33157 15098 -64319 -103922 -275809 -223973
20534 -223973 18395 -76857 -264856 -212474 -80698 13553 321 -65483 -132720 10362 -93992
20523 -93992 -111150 -28790 -84761 24386 336447 252377 115385 21445 -50266 -144277 -265265
20512 -265265 -415230 -266124 18261 46979 -130694 -145718 -171363 -260793 -28359 -2162
$$ packed form
20590A16479m2435j74840p8138l0825k3781j38177J01070O9052Q2337q4416m8617
20579b52291J52954J85619n5376P308J53340L6167q7876j52212j78457l5949K7280
20568a99493r1402K622P278j880j32277l3913m7769R3999o5149k2365p436k1001
20556e18786J81892J55140J06220R2704j5810J671q2865J3107J70912M36j26467
20545b1846Q6557Q7497K5626j19049j65530P3588M8255p9417l9603j71887N1836
20534b23973K42368r5252j87999N2382J31776R4251j3232o5804o7237J43082j04354
20523i3992j7158Q2360n5971J09147L12061q4070j36992r3940p1711r4011j20988
20512b65265j49965J49106K84385K8718j77673j5024k5645q9430K32434K6197
$$ plain form
20502 -2162 13723 -113956 -182560 -284728 -246363 -53067 79692 106274 -45352 321 93446
20491 93446 96703 135275 74412 -22830 10190 106462 100603 16679 18729 -83130 -313288 -514475
20479 -514475 -582372 -367491 -87948 -63533 169849 327398 198312 -96471 -145319 -225233
20469 -225233 -285836 -294293 -135079 -154856 -121896 -2299 -28589 -144512 -276823 -272645 -304379
20458 -304379 -252706 -190290 -89552 -96865 -87671 102668 93860 109122 151600 69709 160173 301477
20446 301477 423105 294250 263848 252796 -21312 -253190 -86594 38835 -194021 -197650
20436 -197650 -216765 -155398 -161740 -103434 -12861 -134594 -209391 -41380 -126018 -208830 -280468
20425 -280468 -230854 -270072 -237657 -68679 62366 88835 66675 59780 -33851 -72789 109181
$$ packed form
20502b162J5885j27679o8604j02168L8365J93296J32759K6582j51626M5673R3125
20491I3446L257L8572o0863r7242L3020R6272n859q3924K050j01859k30158k01187
20479e14475o7897K14881K79543K4415K33382J57549j29086k94783m8848p9914
20469b25233o0603q457J59214j9777L2960J19597k6290j15923j32311M178l1734
20458c04379N1673O2416J00738p313R194J90339q808J5262M2478q1891R0464J41304
20446C01477J21628j28855l0402j1052k74108k31878J66596J25429k32856l629
20436a97650j9115O1367o342N8306R0573j21733p4797J68011q4638q2812p1638
20425b80468M9614l9218L2415J68978J31045K6469k2160o895r3631l8938J81970
$$ plain form
20414 109181 147453 84468 153994 -10889 -107523 -186366 -92218 -146817 -118177 -15674 58426
20403 58426 -73093 -235300 -191027 -304164 -417874 -303745 -151821 -238527 -209806 -41252
20393 -41252 38766 47234 -28951 -302912 -434363 -350477 -355592 -341791 -368949 -464680 -511166 -411649
20381 -411649 -184141 -128395 -21680 -110055 -297013 -86795 147620 201500 141438 -15189
20371 -15189 -158626 -218761 -131879 -271390 -338053 -211327 -69432 -49954 -287637 -292015 -132198
20360 -132198 -41052 -125811 -266544 -113999 -71999 -232032 -302535 -22917 135687 139882 224108
20349 224108 92805 86630 120583 190225 71610 -107600 -273997 -82622 -155090 -208124 -153305
20338 -153305 -80589 85522 -117754 -82017 -116416 20682 42395 34287 8318 -190172 -173305
$$ packed form
20414A09181L8272o2985O9526j64883r6634p8843R4148n4599K8640J02503P4100
20403E8426j31519j62207M4273j13137j13710J14129J51924q6706K8721J68554
20393d1252Q0018Q468p6185k73961j31451Q3886n115J3801k7158r5731m6486R9517
20381d11649K27508N5746J06715q8375j86958K10218K34415N3880o0062j56627
20371a5189j43437o0135Q6882j39511o6663J26726J41895J9478k37683m378J59817
20360a32198R1146q4759j40733J52545M2000j60033p0503K79618J58604M195Q4226
20349B24108j31303o175L3953O9642j18615j79210j66397J91375p2468n3034N4819
20338a53305P2716J66111k03276L5737l4399J37098K1713q108k5969j98490J6867
$$ plain form
20327 -173305 4970 -138734 4245 -46029 -96632 85271 201896 99772 -40779 -294971
20317 -294971 -626784 -605054 -382874 -241490 -148888 -2359 -47278 -133865 -15862 119048
20307 119048 32614 25003 244671 255472 288495 259071 108200 -86047 -146089 -56130 79625
20296 79625 -230244 -573913 -443200 -360272 -263336 -133399 -63737 -32986 -25307 63034 -4923
20285 -4923 -112338 -86591 -202619 -245980 -330373 -428827 -387524 -365787 -365841 -263285 -304146 -304007
20273 -304007 -149729 -17505 174071 429880 440890 325456 221677 191087 315926 242714
20263 242714 -4586 -33820 53689 75291 -30160 33990 51342 -64947 -78371 -11071 -82061
20252 -82061 -167296 -56818 51815 -137798 -164438 -111567 -81838 -228706 -279753 -145397 -53796
$$ packed form
20327a73305J78275j43704J42979n0274n0603J81903J16625j02124j40551k54192
20317b94971l31813K1730K22180J41384R2602J46529m4919q6587J18003J34910
20307A19048q6434p611K19668J0801L3023k9424j50871j94247o0042Q9959J35755
20296G9625l09869l43669J30713Q2928R6936J29937O9662L0751P679Q8341o7957
20285d923j07415K5747j16028m3361q4393r8454M1303K1737n4J02556m0861J39
20273c04007J54278J32224J91576K55809J1010j15434j03779l0590J24839p3212
20263B42714k47300k9234Q7509K1602j05451O4150J7352j16289j3424O7300p0990
20252h2061q5235J10478J08633j89613k6640N2871K9729j46868n1047J34356R1601
$$ plain form
20241 -53796 175212 325673 82025 96409 220738 160513 65914 -58750 -223127 -7139
20231 -7139 -21055 -248786 -282026 -203966 -10220 79706 113043 65115 -125185 -63167 134723
20220 134723 263824 150965 38270 -34633 165916 115821 -11212 -174855 -257833 -292381
20210 -292381 -322099 -253300 -253327 -42797 203062 208372 74220 -138585 -195634 21440 145662
20199 145662 24883 -109537 -57302 -141978 -150929 -108286 12646 -29144 -68372 -36368 29436
20188 29436 161221 192604 197146 199967 35987 158558 407786 193841 78067 183636 64673
20177 64673 -10314 -168569 -155807 -167037 -120115 -16611 -102959 -19339 49022 -30138 -100937
20166 -100937 -68004 -43441 -58595 17147 -57900 -52548 52310 11474 -174471 -58182 28094
$$ packed form
20241e3796K29008J50461k43648J4384J24329o0225r4599j24664j64377K15988
20231g139j3916k27731l3240P8060J93746Q9926L3337m7928j90300O2018J97890
20220A34723J29101j12859j12695p2903K00549n0095j27033j63643q2978l4548
20210b92381k9718O8799k7K10530K45859N310j34152k12805n7049K17074J24222
20199A45662j20779j34420N2235q4676q951M2643J20932m1790l9228L2004O5804
20188B9436J31785L1383M542K821j63980J22571K49228k13945j15774J05569j18963
20177F4673p4987j58255J2762j1230M6922J03504q6348Q3620O8361p9160p0799
20166a00937L2933K4563j5154P5742p5047N352J04858m0836j85945J16289Q6276
$$ plain form
20155 28094 104420 46929 99361 123332 80435 27191 11352 -140930 -218937 -213765 -294423 -211764
20143 -211764 -104705 -46683 -33379 1373 120769 40697 -186257 -350496 -104494 94859
20133 94859 -21680 -159809 -70162 -8238 -116837 -335384 -240110 -258189 -211311 -55050 -23563
20122 -23563 -13235 108256 197424 159377 161252 298149 277947 180481 213486 111284 -158457
20111 -158457 -125857 -174335 -260809 -305745 -252642 -225659 -294010 -234883 -16893 156505 -38098
20100 -38098 -61070 -137067 -162304 -220982 -59625 -17886 -5044 -151808 -253240 -224549 -85606
20089 -85606 58447 -9197 -44951 -276751 -88982 45689 17449 -143531 -125585 79758
20079 79758 -14964 73689 223557 130158 -132645 -273309 -267100 -223956 -55199 156437 324478
$$ packed form
20155B8094P6326n7491N2432K3971m2897n3244j5839j52282p8007N172q0658Q2659
20143b11764J07059N8022J3304L4752J19396q0072k26954j64239K46002J99353
20133I4859j16539j38129Q9647O1924j08599k18547R5274j8079M6878J56261L1487
20122b3563J0328J21491Q9168l8047J875J36897k0202r7466L3005j02202k69741
20111a58457L2600m8478q6474m4936N3103K6983o8351N9127K17990J73398j94603
20100c8098k2972p5997k5237n8678J61357M1739J2842j46764j01432K8691J38943
20089h5606J44053o7644l5754k31800J87769J34671k8240j60980J7946K05343
20079G9758r4722Q8653J49868r3399k62803j40664O209M3144J68757K11636J68041
$$ plain form
20068 324478 522739 534241 348274 322271 412865 378318 327656 175663 9109 29662 103649
20057 103649 88806 121141 39992 -129146 -107736 -27550 -115957 -32186 -197356 -256566 -243653
20046 -243653 -367563 -276478 -55347 -63042 42397 150814 26436 -31005 -17285 60007 30265
20035 30265 -253416 -265075 -200609 -145060 -94467 -3710 47035 159307 339757 153430 96500
20024 96500 -5153 -115886 -105450 -122588 -139012 -231964 -76565 -4625 99603 216648 162208
20013 162208 86970 105104 58307 47082 128669 107705 280166 445361 289559 236226 379060
20002 379060 333504 86577 166309 134459 -175361 -114428 -4100 -128816 -71367 -115105 -227256
19991 -227256 -259964 -307574 -451900 -349484 -153769 -101613 -76820 42657 -177938 -257946
$$ packed form
20068C24478J98261J1502j85967k6003R0594l4547n0662j51993j66554K0553P3987
20057A03649j4843L2335q1149j69138K1410Q0186q8407Q3771j65170n9210J2913
20046b43653j23910R1085K21131p695J05439J08417j24378n7441J3720P7292k9742
20035C0265k83681j1659O4466N5549N0593R0757N0745J12272J80450j86327n6930
20024I6500j01653j10733J0436j7138j6424r2952J55399P1940J04228J17045n4440
20013A62208p5238J8134m6797j1225Q1587k0964J72461J65195j55802n3333J42834
20002C79060m5556k46927P9732l1850l09820O0933J10328j24716N7449m3738j12151
19991b27256l2708m7610j44326J02416J95715N2156K4793J19477k20595q0008
$$ plain form
19981 -257946 -170351 -150028 -14924 40240 118890 160783 82792 101926 167513 -27526 -249068
19970 -249068 -292038 23884 71118 -58066 -207752 -206650 -50500 42992 65663 -85553 -14233
19959 -14233 30231 -97686 -322313 -453273 -370957 -498150 -358259 -51680 49978 27570
19949 27570 -766 -199676 -120199 -33999 -155330 -58940 174467 73377 110300 105153 202762
19938 202762 162010 85270 189786 29212 -16542 65955 150030 150096 199386 177349 147013 310423
19926 310423 80985 -18580 93248 152213 265166 215214 72950 106526 73850 101731 -705
19915 -705 -199392 -178726 -187202 -170969 -182063 -256513 -348910 -325496 -283655 -202067 -347831 -539952
19903 -539952 -340436 -46232 -106125 -71639 76568 32240 216812 250050 138520 38220
$$ packed form
19981b57946Q7595K0323J35104N5164P8650M1893p7991J9134O5587j95039k21542
19970b49068m2970L15922M7234j29184j49686J102J56150R3492K2671j51216P1320
19959a4233M4464j27917k24627j30960Q2316j27193J39891L06579J01658k2408
19949B7570k8336j98910P9477Q6200j21331R6390K33407j01090L6923n147R7609
19938B02762m0752p6740J04516j60574m5754Q2497Q4075O6M9290k2037l0336J63410
19926C10423k29438r9565J11828N8965J12953m9952j42264L3576l2676K7881j02436
19915g05j98687K0666q476J6233j1094p4450r2397K3414M1841Q1588j45764j92121
19903e39952J99516K94204n9893L4486J48207m4328J84572L3238j11530j00300
$$ plain form
19893 38220 49976 -646 31501 70405 9657 -215300 -287478 -241702 -296731 -209474 -128784
19882 -128784 -125999 -63565 -76877 -261223 -429646 -254414 -142914 -216524 -133750 4149 60970
19871 60970 203703 -37843 -212706 -21660 -30967 -101322 -120774 -66804 -90637 -128709 -19980
19860 -19980 92488 25505 -161496 -50269 218396 54262 -102830 -119287 -40051 123570
19850 123570 289735 278289 39178 -81014 -101223 -302093 -285896 -163806 -220788 -345130
19840 -345130 -283290 34817 217222 15412 -88547 -70374 148524 281664 75530 -157007
19830 -157007 -260303 -300419 -409898 -403499 -287327 -187696 -374530 -489385 -320088 -108544
19820 -108544 112455 21642 -101378 -212078 3245 57655 -79850 -172261 -46587 -13959
$$ packed form
19893C8220J1756n0622L2147L8904o0748k24957p2178M5776n5029Q7257Q0690
19882a28784K785O2434j3312j84346j68423J75232J11500p3610Q2774J37899N6821
19871F0970J42733k41546j74863J91046r307p0355j9452N3970k3833l8072J08729
19860a9980J12468o6983j87001J11227K68665j64134j57092j6457P9236J63621
19850A23570J66165j1446k39111j20192k0209k00870J6197J22090n6982j24342
19840c45130O1840L18107J82405k01810j03959J8173K18898J33140k06134k32537
19830a57007j03296m0116j09479O399J16172R9631j86834j14855J69297K11544
19820a08544K20999r0813j23020j10700K15323N4410j37505r2411J25674L2628
$$ plain form
19810 -13959 -209846 -393033 -287657 -201793 -230323 -139758 103420 162650 150762 182519 257900
19799 257900 218739 110540 -32967 -52186 58622 222055 190495 268020 306292 190295
19789 190295 60542 53844 85860 251143 342431 313039 266151 182298 110781 59056 -94679
19778 -94679 -73261 -42029 51241 170759 138007 -60867 29703 163041 221594 89689 212778
19767 212778 332707 214365 79988 116509 30218 34394 132976 23882 37008 167000 230886
19756 230886 254462 141426 -24268 -103782 -44505 -143983 -51314 -28790 10893 -57144 -129150
19745 -129150 -120543 -102825 -28908 -14032 32252 -24853 -51088 -252 -47204 -87274 80910
19734 80910 42625 193760 267795 356884 250977 55481 36522 35599 88986 -9953 98795
$$ packed form
19810a3959j95887j83187J05376Q5864k8530R0565K43178N9230j1888L1757P5381
19799B57900l9161j08199j43507j9219J10808J63433l1560P7525L8272j15997
19789A90295j29753o698L2016J65283R1288k9392m6888q3853p1517n1725j53735
19778i4679K1418L1232R3270J19518l2752j98874R0570J33338N8553j31905J23089
19767B12778J19929j18342j34377L6521q6291M176R8582j09094J3126J29992O3886
19756B30886K3576j13036j65694p9514N9277r9478R2669K2524L9683o8037p2006
19745a29150Q607J7718P3917J4876M6284n7105k6235N0836m6952m0070J68184
19734H0910l8285J51135P4035Q9089j05907j95496j8959r23N3387r8939J08748
$$ plain form
19723 98795 172356 110899 66175 31851 90158 149114 217059 136524 88577 -34111 -23955
19712 -23955 -196051 -295231 -154634 -210080 -187681 -265041 -301982 -281304 -239701 -194166 -77643
19701 -77643 -48776 -172166 -267156 -399345 -370475 -268684 -34801 53335 40524 -195367 -195743
19690 -195743 -150913 -20641 67654 108338 36957 24078 -15028 104214 -54161 -335615 -233731
19679 -233731 3168 28013 -165571 -169341 -106252 -65058 -14697 -113911 -82924 56093 69
19668 69 -14530 -129367 4875 25867 -243954 -240562 -45289 108427 78217 -33459 44324
19657 44324 -189951 -325624 -248163 -78282 100146 220038 145098 26334 -181857 -228024
19647 -228024 -152766 80333 214300 229435 289212 235856 -22398 -34992 -130086 -216076 -189649
$$ packed form
19723I8795P3561o1457m4724l4324N8307N8956O7945q0535m7947j22688J0156
19712b3955j72096r9180J40597n5446K2399p7360l6941K0678M1603M5535J16523
19701g7643K8867j23390r4990j32189K8870J01791K33883Q8136j2811k35891l76
19690a95743M4830J30272Q8295M0684p1381j2879l9106J19242j58375k81454J01884
19679b33731K36899K4845j93584l770O3089M1194N0361r9214L0987J39017n6024
19668F9j4599j14837J34242K0992k69821L392J95273J53716l0210j11676P7783
19657D4324k34275j35673P7461J69881J78428J19892p4940j18764k08191m6167
19647b28024P5258K33099J33967J5135N9777n3356k58254j2594r5094q5990K6427
$$ plain form
19636 -189649 -36368 99722 60478 -128528 -106712 -8175 19626 35895 -83451 -253202
19626 -253202 -264679 -213996 -191181 -226406 -64647 98521 86464 -52999 -46328 -38352 91382
19615 91382 12397 -203283 -48163 198507 208432 131698 -50792 -147122 18013 48712 17856
19604 17856 199828 280964 105869 19745 46959 78780 -40458 -155808 -146385 -133436 25566
19593 25566 -47040 -106508 -39380 -92100 -28536 42311 143587 4085 -114799 71524 157581
19582 157581 217464 51378 -63797 -49239 -42540 7800 63301 36637 138418 91148 -73478
19571 -73478 -3112 16934 11320 9955 -56297 -149003 -214123 119713 219026 221260 249680 233224
19559 233224 280867 406321 240666 20623 249705 335612 29806 -103087 -49337 -63233
$$ packed form
19636a89649J53281J36090l9244j89006K1816R8537K7801J6269j19346j69751
19626b53202j1477N0683K2815l5225J61759J63168j2057j39463O671P976J29734
19615I1382p8985k15680J55120K46670R925p6734j82490r6330J65135L0699l0856
19604A7856J81972Q1136j75095q6124K7214L1821j19238j15350R423J2949J59002
19593B5566p2606n9468O7128n2720O3564P0847J01276j39502j18884J86323Q6057
19582A57581N9883j66086j15175J4558O699N0340N5501k6664J01781m7270j64626
19571g3478P0366K0046n614j365o6252r2706o5120L33836R9313K234K8420j6456
19559B33224M7643J25454j65655k20043K29082Q5907l05806j32893N3750j3896
$$ plain form
19549 -63233 -240185 -346841 -265203 -145182 -91384 -222939 -102601 15241 299179 369518
19539 369518 67163 57966 37802 189911 320978 96294 21971 83921 199814 282016 322600
19528 322600 192880 16059 -157162 -88988 31457 -28056 -86663 -18040 29244 32231 169647
19517 169647 142915 66334 -18170 -4425 -213406 -270071 -292456 -180918 -12680 145076 93902
19506 93902 -117291 -169641 79725 58516 58172 -71652 -55752 184560 167992 -27264 -135417
19495 -135417 -113358 -143221 -206677 -230357 -305918 -342902 -334746 -286843 -236765 -255067 -222278 -216402
19483 -216402 -132787 -41181 71970 -13519 46247 -34064 -127960 -98452 -153164 -119272 38936
19472 38936 293469 388708 333484 274076 193427 125106 86494 -27576 -335622 -554105 -383032
$$ packed form
19549f3233j76952j06656Q1638J20021N3798j31555J20338J17842K83938P0339
19539C69518l02355r197k0164J52109J31067k24684p4323O1950J15893Q2202M0584
19528C22600j29720j76821j73221O8174J20445n9513n8607O8623M7284K987J37416
19517A69647k6732p6581q4504J3745k08981n6665k2385J11538J68238J57756n1174
19506I3902k11193n2350K49366k1209l44j29824J5900K40312j6568j95256j08153
19495a35417K2059k9863o3456k3680p5561l6984Q156M7903N0078j8302L2789N876
19483b16402Q3615R1606J13151q5489N9766q0311r3896K9508n4712L3892J58208
19472C8936K54533R5239n5224n9408q0649o8321l8612j14070l08046k18483J71073
$$ plain form
19461 -383032 -10210 131572 -1261 -159654 -210860 -194110 41217 95075 72029 8238
19451 8238 11136 11821 106943 29765 -71539 -1778 -28968 -119238 -110968 9931 -5965 44144
19439 44144 -1048 -49201 36886 45262 20762 69064 1780 -157172 -235300 -141248 40397
19428 40397 109342 13179 -88300 -82287 -174564 -263444 -170232 -173213 -151200 -27533 199902
19417 199902 272607 55802 8063 25665 -73791 -24218 121303 158872 60586 35418 -34104
19406 -34104 -4079 135700 114905 81492 65937 101692 108965 82528 14131 25667 -145209
19395 -145209 -161904 -83469 132744 351809 374551 417401 418918 495513 432722 232375 208203
19384 208203 71464 -98886 -95876 -82562 15946 -6791 53392 84017 110896 81479 -29779
$$ packed form
19461c83032L72822J41782j32833j58393n1206J6750K35327N3858k3046o3791
19451H238K898O85R5122p7178j01304O9761k7190r0270Q270J20899j5896N0109
19439D4144m5192m8153Q6087Q376k4500M8302o7284j58952p8128R4052J81645
19428D0397O8945r6163j01479O013r2277q8880R3212k981K2013J23667K27435
19417A99902P2705k16805m7739J7602r9456M9573J45521L7569r8286k5168o9522
19406c4104L0025J39779k0795l3413j5555L5755P273k6437o8397J1536j70876
19395a45209j6695P8435K16213K19065K2742M2850J517P6595o2791k00347k4172
19384B08203j36739j70350L010J3314R8508k2737O0183L0625K6879k9417j11258
$$ plain form
19373 -29779 -25308 148472 239869 -52372 -155250 -264034 -323197 -265970 -197516 -233555 -258679
19362 -258679 -193611 -324188 -104482 -78809 -148320 -130713 -44547 -180756 -155761 -96063 -147855
19351 -147855 84301 336623 250684 206955 245022 2136 -67455 -119822 48460 75587 62418
19340 62418 18421 -6638 3279 -15663 -59964 -141682 -79329 210620 283190 277931 193489 113498
19328 113498 113300 66999 15589 -170131 -31568 146658 61505 -143579 -111180 -59477 -27346
19317 -27346 15108 64085 198283 162652 85124 78998 -12722 -52509 -57834 -105123 -104450 4030
19305 4030 122465 250964 283060 262290 132278 26666 30499 86121 196146 145059 1170
19294 1170 -11268 1154 56930 155192 251638 245970 141457 130055 163834 1988 -182862
$$ packed form
19373b9779M471J73780R1397k92241j02878j08784n9163N7227O8454l6039k5124
19362b58679O5068j30577K19706K5673o9511J7607Q6166j36209K4995N9698n1792
19351a47855K32156K52322q5939m3729L8067k42886o9591n2367J68282K7127j3169
19340F2418m3997k5059R917j8942m4301q1718O2353K89949P2570n259q4442p9991
19328A13498j98m6301n1410j85720J38563J78226q5153k05084L2399N1703L2131
19317b7346M2454M8977J34198l5631p7528o126r1720l9787n325m7289O73J08480
19305D030J18435J28499L2096k0770j30012j05612L833N5622J10025n1087j43889
19294A170j2438J2422N5776R8262R6446n668j04513j1402L3779j61846j84850
$$ plain form
19283 -182862 -75169 43916 336383 529203 417710 432895 489584 275696 235548 438590
19273 438590 578343 771511 619334 526507 585624 673533 619597 566232 615204 656577 692347
19262 692347 672396 587961 494348 372317 289759 373492 466158 349953 419609 478618 450079
19251 450079 439225 427405 305287 436226 436439 512679 568703 525891 542471 575927 576723 632333
19239 632333 643344 479848 414903 348551 413122 582314 619574 678524 957078 917803 740540
19228 740540 660166 660899 672187 686312 798140 897249 833639 754512 795771 826678 848720 694480
19216 694480 862640 855551 685887 560141 689170 801810 647063 402295 361933 293904
19206 293904 407946 645961 900213 826313 819342 647103 457535 512486 539419 433991
$$ packed form
19283a82862J07693J19085K92467J92820j11493J5185N6689k13888m0148K03042
19273D38590J39753J93168j52177r2827N9117Q7909n3936n3365M8972M1373L5770
19262F92347j9951q4435r3613j22031q2558Q3733R2666j16205O9656N9009k8539
19251D50079j0854j1820j22118J30939K13P6240N6024m2812J6580L3456P96N5610
19239F32333J1011j63496o4945o6352O4571J69192L7260N8950K78554l9275j77263
19228G40540q0374P33J1288J4125J11828R9109o3610p9127M1259L0907K2042j54240
19216F94480J68160p089j69664j25746J29029J12640j54747k44768m0362o8029
19206B93904J14042K38015K54252p3900o971j72239j89568N4951K6933j05428
$$ plain form
19196 433991 431170 523699 645639 799928 715021 627476 505552 443596 537953 677409 759478
19185 759478 776162 479634 449018 342385 156795 150466 287600 439562 578261 436099
19175 436099 352391 330517 309998 447355 517186 544882 637597 615856 680146 727241 702455
19164 702455 615547 555785 490936 395291 258654 238187 110451 -12059 28877 115266 177725
19153 177725 219922 195460 281658 328987 412348 512042 502711 382918 389357 373177 477471
19142 477471 416888 481837 463708 304871 145952 228907 210321 221207 230394 415124 447906
19131 447906 383669 461116 546031 406512 443183 348825 470070 644540 734236 631454 331430
19120 331430 544753 496537 412146 462720 453917 451195 484417 408705 425043 730865 733737 642660
$$ packed form
19196D33991k821R2529J21940J54289q4907q7545j21924o1956R4357J39456Q2069
19185G59478J6684k96528l0616j06633j85590o329J37134J51962J38699j42162
19175D36099q3708k1874k0519J37357O9831K7696R2715k1741O4290M7095k4786
19164G02455q6908n9762o4849r5645j36637k0467j27736j22510M0936Q6389O2459
19153A77725M2197k4462Q6198M7329Q3361R9694r331j19793O439j6180J04294
19142D77471o0583O4949j8129j58837j58919Q2955j8586J0886R187J84730L2782
19131D47906o4237P7447Q4915j39519L6671r4358J21245J74470Q9696j02782l00024
19120C31430K13323m8216q4391N0574q803k722L3222p5712J6338L05822K872r1077
$$ plain form
19108 642660 436615 564398 564786 384648 492565 432429 334710 315100 346409 388951 419180
19097 419180 612099 510486 488095 497063 417300 444520 461406 414232 535786 558740 415534
19086 415534 339843 429317 452078 452909 429694 333543 390875 468446 316500 200858 431098
19075 431098 575668 381729 189773 302284 243715 342662 370429 371326 385628 568144 435880
19064 435880 368325 354786 406650 475273 258164 213307 219050 308621 307917 463465 565493
19053 565493 251403 192175 233889 380766 424057 340116 469695 506778 423954 182317 85199
19042 85199 115354 258203 211364 233287 278179 324650 365988 442989 630862 504312 200983
19031 200983 313390 464667 468812 588464 500443 353725 292523 223351 373546 233834
$$ packed form
19108F42660k06045J27783L88j80138J07917o0136r7719j9610L1309M2542L0229
19097D19180J92919j01613k2391Q968p9763K7220J6886m7174J21554K2954j43206
19086D15534p5691Q9474K2761Q31k3215r6151N7332P7571j51946j15642K30240
19075D31098J44570j93939j91956J12511n8569R8947K7767Q97J4302J82516j32264
19064D35880o7555j3539N1864O8623k17109m4857N743Q9571p04J55548J02028
19053E65493l14090n9228M1714J46877M3291q3941J29579L7083q2824k41637r7118
19042H5199L0155J42849m6839K1923M4892M6471M1338P7001J87873j26550l03329
19031B00983J12407J51277M145J19652q8021j46718o1202o9172J50195j39712
$$ plain form
19021 233834 230503 286248 317650 232578 412944 248547 162753 321125 582100 443646 278961
19010 278961 196338 492752 402854 367145 493704 599598 840310 725569 587615 438618
19000 438618 457009 518417 438629 364655 402494 323947 447414 480084 340129 392390 583468
18989 583468 699316 709731 730798 572377 629003 547459 608654 594625 778463 866687 1001537
18978 1001537 1290995 1324816 1085955 976454 784412 698355 809455 684600 645918 804147
18968 804147 988600 1180471 1012263 1083991 1056210 1021553 1037659 1151076 1108655 1120270 1212724
18957 1212724 1118318 1115169 1137966 972173 883374 960674 996393 1300733 1387385 1306966 1216583
18946 1216583 1229828 1260361 1171896 1226509 1289054 1397076 1544271 1472888 1526751 1612688 1584273
$$ packed form
19021B33834l331N5745L1402q5072J80366j64397q5794J58372K60975j38454j64685
19010B78961q2623K96414q9898l5709J26559J05894K40712j14741j37954j48997
19000D38618J8391O1408p9788p3974L7839p8547J23467L2670j39955N2261J91078
18989E83468J15848J0415K1067j58421N6626q1544O1195j4029J83838Q8224J34850
18978A001537K89458L3821k38861j09501j92042q6057J11100j24855l8682J58229
18968H04147J84453J91871j68208P1728k7781l4657J6106J13417m2421J1615R2454
18957A212724r4406l149K2797j65793q8799P7300L5719L04340Q6652q0419r0383
18946A216583J3245L0533q8465N4613O2545J08022J47195p1383N3863Q5937k8415
$$ plain form
18935 1584273 1728574 2005360 1915394 1612694 1465268 1327600 1499897 1680988 1875416 1822429
18925 1822429 1758678 1766598 1726843 1719331 1576362 1556312 1669162 1979700 2131180 2012470 1887057
18914 1887057 1755813 1813146 1931980 1924200 1621636 1448680 1455553 1410678 1461349 1612201 1726116
18903 1726116 1831564 1816480 1891595 1744599 1670765 1810701 1808563 1794777 1738834 1889878 1868321
18892 1868321 1852642 1994598 1967669 1847585 1859100 1681839 1715061 1788525 1690252 1657901 1627946
18881 1627946 1538772 1515692 1674716 1851509 1860320 1988574 1837679 2138712 2188331 1880148
18871 1880148 1856155 1878322 1845740 1665815 1632619 1588609 1384290 1393235 1387038 1499521 1423524
18860 1423524 1358118 1448942 1434601 1250657 1263029 1265452 1084520 1085759 1104993 1115271 1053817
$$ packed form
18935A584273J44301K76786q9966l02700j47426j37668J72297J81091J94428n2987
18925A822429o3751P920l9755p512j42969k0050J12850L10538J51480j18710j25413
18914A887057j31244N7333J18834p780l02564j72956O873m4875N0671J50852J13915
18903A726116J05448j5084P5115j46996p3834J39936k138j3786n5943J51044k1557
18892A868321j5679J41956k6929j20084J1515j77261L3222P3464r8273l2351k9955
18881A627946q9174k3080J59024J76793Q811J28254j50895L01033M9619l08183
18871A880148k3993K2167l2582j79925l3196m4010k04319Q945o197J12483p5997
18860A423524o5406R0824j4341j83944J2372K423j80932J239J9234J0278o1454
$$ plain form
18849 1053817 1160827 1264115 1335406 1370258 1429949 1436265 1400907 1546423 1564615 1347699 1447904
18838 1447904 1494464 1394673 1408870 1431302 1363265 1377912 1589679 1626898 1619847 1536831 1624468
18827 1624468 1831774 1981409 2138442 2089819 1958034 2017621 2165190 2203494 2123371 2062689
18817 2062689 2109943 2135509 2254115 2295854 2137335 2094104 2176784 2185260 2464712 2691694 2658084
18806 2658084 2733878 2820653 2841423 3105692 3200405 3518248 3852932 3900385 4092890 4557998
18796 4557998 4677960 5052069 5089902 5119800 5559874 6125890 6679371 7292847 7864032 8524100
18786 8524100 9065252 9427365 10031205 10494882 10762427 11215351 11592269 11917998 12440555
18777 12440555 12974286 13656930 14468998 15307987 16138903 17449792 18777329 20239600 22090991
$$ packed form
18849A053817J07010J03288P1291L4852N9691O316l5358J45516J8192k16916J00205
18838A447904M6560r9791J4197K2432o8037J4647K11767L7219p051q3016Q7637
18827A624468K07306J49635J57033m8623j31785N9587J47569L8304q0123o0682
18817B062689M7254K5566J18606M1739j58519m3231Q2680Q476K79452K26982l3610
18806B658084P5794Q6775K0770K64269R4713L17843L34684M7453J92505M65108
18796D557998J19962L74109L7833K9898M40074N66016N53481O13476N71185O60068
18786H524100N41152L62113O03840M63677K67545M52924L76918L25729N22557
18777A2440555N33731O82644Q12068Q38989Q30916J310889J327537J462271J851391
$$ plain form
18768 22090991 24128603 26484675 29293509 32655304 36411515 40726918 45552916 50813337
18760 50813337 56181611 61343441 65712595 69050872 71262919 72242687 72060037 71156078
18752 71156078 70428845 70133258 70414712 71465589 73026669 74844121 76462007 78226650
18744 78226650 80221071 82308351 84861968 87419512 90183197 92893044 95511649 98006984
18736 98006984 100476801 102174852 103155177 103427396 103274296 102689517 101707102 100706312 99972499
18727 99972499 99590680 99793674 100489745 101558712 102651763 103273165 103427809 103441421 104060276
18718 104060276 105624994 107766607 110398241 112990597 115113863 116491304 117066399 116357034
18710 116357034 115217740 114014665 112163520 110428489 108918927 107855759 107071877 106916197
$$ packed form
18768B2090991K037612K356072K808834L361795L756211M315403M825998N260421
18760E0813337N368274N161830M369154L338277K212047R79768j82650r03959
18752G1156078p27233k95587K81454J050877J561080J817452J617886J764643
18744G8226650J994421K087280K553617K557544K763685K709847K618605K495335
18736I8006984K469817J698051R80325K72219j53100n84779r82415j000790p33813
18727I9972499l81819K02994O96071J068967J093051O21402J54644J3612O18855
18718A04060276J564718K141613K631634K592356K123266J377441N75095p09365
18710A16357034j139294j203075j851145j735031j509562j063168p83882j55680
$$ plain form
18702 106916197 107447775 108897417 111481549 114784052 117801328 119757366 119967233 118306743
18694 118306743 114433579 108845542 102033197 95066948 88457982 82227186 76689170 71697304
18686 71697304 67139238 63286490 60142722 57554587 55191275 53096242 51188851 49683861
18678 49683861 48372345 47301317 46422435 45619861 44989214 44376921 43774753 43240134 42688526
18669 42688526 41916892 41113598 40210781 39349913 38886404 38296871 37676059 37447210 37399128
18660 37399128 37302085 37585835 37850615 38169666 38855110 39740927 40805616 42068064 43332697
18651 43332697 44800117 46280278 47469811 48275229 48628263 48602757 48381785 47885312 47556180
18642 47556180 47228426 47178197 47180994 47418958 47791585 48176975 48771849 49429249 50120815 50938257
$$ packed form
18702A06916197N31578J449642K584132L302503L017276J956038K09867j660490
18694A18306743l873164n588037o812345o966249o608966o230796n538016m991866
18686G1697304m558066l852748l143768k588135k363312k095033j907391j504990
18678D9683861j311516j071028q78882q02574o30647o12293o02168n34619n51608
18669D2688526p71634q03294r02817q60868m63509n89533o20812k28849m8082
18660C7399128r7043K83750K64780L19051O85444Q85817J064689J262448J264633
18651D3332697J467420J480161J189533Q05418L53034k5506k20972m96473l29132
18642D7556180l27754n0229K797K37964L72627L85390N94874O57400O91566Q17442
$$ plain form
18632 50938257 52179402 53602725 55397076 57309264 59198318 60723188 62119949 63212116
18624 63212116 63758266 63520025 63054264 62141617 61052759 60196117 59596043 59008633 58200481
18615 58200481 57578017 56837369 55918582 55267815 55239125 55828171 56917917 58554411 60824676
18606 60824676 63123054 65304197 67525405 69143245 70304585 70746085 70428444 69729265
18598 69729265 68544534 67362979 66280264 65487591 65023988 65120486 65855485 66814328 67982644
18589 67982644 69222267 70168073 70322575 69411812 67651245 64707608 60903338 56937503
18581 56937503 52877912 49131890 45608600 42685777 40170574 37958218 36122126 34797840
18573 34797840 33661184 32494608 31480264 30630771 29807067 28943256 28122665 27145776 26238555
$$ packed form
18632E0938257J241145J423323J794351J912188J889054J524870J396761J092167
18624F3212116N46150k38241m65761r12647j088858q56642o00074n87410q08152
18615E8200481o22464p40648r18787o50767k8690N89046J089746J636494K270265
18606F0824676K298378K181143K221208J617840J161340M41500l17641o99179
18598F9729265j184731j181555j082715p92673m63603R6498P34999R58843J168316
18589F7982644J239623R45806J54502r10763j760567k943637l804270l965835
18581E6937503m059591l746022l523290k922823k515203k212356j836092j324286
18573C4797840j136656j166576j014344q49493q23704q63811q20591r76889r07221
$$ plain form
18564 26238555 25483027 24827031 24316722 23790838 23209711 22466855 21853779 21158299 20438825
18555 20438825 19942976 19274445 18553231 18009981 17313464 16715442 15877853 15325063 14818960
18546 14818960 14104388 13541819 13210394 12716814 12358433 12141376 12016116 11581478 11289088
18537 11289088 11270545 10951545 10643246 10503601 10456372 10119925 10027428 9987576 10078452 10217917
18527 10217917 10334896 10365546 10153335 9939441 10104710 10206512 10327785 10503214 10259903
18518 10259903 10142302 10191275 10270490 10276350 10179820 10157201 10152417 10319399 10559455 10587488 10589714
18507 10589714 10543589 10449923 10489450 10508669 10863421 11277911 11379049 11436694 11758327 11867973
18497 11867973 11877863 11716303 11709127 11984630 12192054 12656234 13148323 13825465 14701654 15491467
$$ packed form
18564B6238555p55528o55996n10309n25884n81127p42856o13076o95480p19474
18555B0438825m95849o68531p21214n43250o96517n98022q37589n52790n06103
18546A4818960p14572n62569l31425m93580l58381k17057j25260m34638k92390
18537A1289088j8543l19000l08299j39645m7229l36447r2497l9852R0876J39465
18527A0217917J16979L0650k12211k13894J65269J01802J21273J75429k43311
18518A0259903j17601M8973P9215N860r6530k2619m784J66982K40056K8033K226
18507A0589714m6125r3666L9527J9219L54752M14490J01138N7645L21633J09646
18497A1867973R890j61560p176K75503K07424M64180M92089O77142Q76189P89813
$$ plain form
18487 15491467 16541180 17489276 18204348 19270191 20569627 21907272 23141752 24397664
18479 24397664 25730072 27318793 29096559 31273037 33624721 36072710 38825424 41683591
18471 41683591 44598574 47385044 50335467 53240967 55880114 59153097 63024124 67276908
18463 67276908 72231954 78335146 85292345 93323434 101844858 110482975 118725701 126266165
18455 126266165 132979617 138466334 142897789 146392337 149358078 152407105 155752780 159554456
18447 159554456 163574221 168085902 172829974 177921763 183625797 190446487 198896288 209901186
18439 209901186 224227280 241519239 261019495 280962741 299311855 313412668 320962427
18432 320962427 321048407 314658648 304049814 292262280 281942760 274369832 270054643 268009456
$$ packed form
18487A5491467J049713R48096P15072J065843J299436J337645J234480J255912
18479B4397664J332408J588721J777766K176478K351684K447989K752714K858167
18471D1683591K914983K786470K950423K905500K639147L272983L871027M252784
18463F7276908M955046O103192O957199Q031089Q521424Q638117Q242726P540464
18455A26266165O713452N486717M431455L494548K965741L049027L345675L801676
18447A59554456M019765M511681M744072N091789N704034O820690Q449801J1004898
18439B09901186J4326094J7291959J9500256J9943246J8349114J4100813P549759
18432C20962427Q5980o389759j0608834j1787534j0319520p572928m315189k045187
$$ plain form
18424 268009456 267657632 268406165 269726274 271894608 274992541 279729778 286273244 294852989
18416 294852989 305033260 315474947 324197886 328719073 326935654 318505583 305191189
18409 305191189 290046547 276336927 265293398 256594955 249042441 241375844 233141534
18402 233141534 224661903 216865297 210683883 207171911 207480520 211357824 217855694 224735710
18394 224735710 229673435 230618226 225608507 213927327 197195712 179169057 163065196
18387 163065196 150230249 140593908 133291050 127250744 121781218 116090746 110038212 103484313
18379 103484313 97129799 91042947 85352964 80549979 76885784 73525316 70910337 68443312
18371 68443312 66168107 64422536 62577689 60570136 58633620 56719767 54578021 52066571
$$ packed form
18424B68009456l51824P48533J320109K168334L097933M737237O543466Q579745
18416B94852989J0180271J0441687Q722939M521187j783419q430071j3314394
18409C05191189j5144642j3709620j1043529q698443p552514p666597q234310
18402B33141534q479631p796606o181414l511972L08609L877304O497870O880016
18394B24735710M937725R44791n009719j1681180j6731615j8026655j6103861
18387A63065196j2834947r636341p302858o040306n469526n690472o052534o553899
18379A03484313o354514o086852n689983m802985l664195l360468k614979k467025
18371F8443312k275205j745571j844847k007553j936516j913853k141746k511450
$$ plain form
18363 52066571 49547107 47292687 45222304 43449081 41756445 40208141 38737604 37455012
18355 37455012 36369211 35180664 33828069 32600083 31589047 30498231 29394064 28653116
18347 28653116 27870907 27112581 26331464 25681222 24929447 24235200 23511984 22998375 22489184
18338 22489184 21821469 21251845 20771106 20289818 19673833 19169431 18681226 18358187 18030036
18329 18030036 17722515 17229764 16633097 16258361 16047465 15706870 15221168 14605661 14181802
18320 14181802 13903666 13457326 13102008 12793353 12471285 11990321 11625238 11324535 11150059
18311 11150059 10721862 10360336 10314425 9989517 9815411 9793599 9609572 9389128 9095816 8838745
18301 8838745 8547664 8390681 8177024 8064527 8031857 7853541 7700780 7627874 7273340 7103099
$$ packed form
18363E2066571k519464k254420k070383j773223j692636j548304j470537j282592
18355C7455012j085801j188547j352595j227986j011036j090816j104167p40948
18347B8653116p82209p58326p81117o50242p51775o94247p23216n13609n09191
18338B2489184o67715n69624m80739m81288o15985n04402m88205l23039l28151
18329A8030036l07521m92751n96667l74736k10896l40595m85702o15507m23859
18320A4181802k78136m46340l55318l08655l22068m80964l65083l00703j74476
18311A1150059m28197l61526m5911l24908j74106k1812j84027k20444k93312k57071
18301H838745k91081j56983k13657j12497l2670j78316j52761p2906l54534j70241
$$ plain form
18291 7103099 7031392 6872533 6713505 6581227 6336519 6173561 6078562 6046420 5991953 6022895
18281 6022895 5944834 5730863 5490797 5187009 4946796 4946720 4918474 4858508 4821637 4728820 4734445
18270 4734445 4688837 4451089 4493423 4419738 4363343 4280599 4172214 4044699 3997373 3883142
18260 3883142 3687457 3470583 3427937 3439428 3451672 3321197 3303570 3604865 3646940 3565602
18250 3565602 3493777 3549591 3424887 3455806 3410819 3121187 2937743 2858171 2771057 2985371
18240 2985371 3221396 2987922 2781830 2724511 2839494 2819151 2672801 2626311 2537239 2407898
18230 2407898 2646228 2685309 2589478 2582258 2609340 2616399 2469968 2447590 2464779 2400128 2357131
18219 2357131 2221134 2188376 2128209 2038072 2148475 1969273 1770187 1712539 1753286 1791006
$$ packed form
18291G103099p1707j58859j59028j32278k44708j62958r4999l2142n4467L0942
18281F022895p8061k13971k40066l03788k40213p6k8246n9966l6871r2817N625
18270D734445m5608k37748M2334p3685n6395q2744j08385j27515m7326j14231
18260C883142j95685k16874m2646J1491J2244j30475j7627L01295M2075q1338
18250C565602p1825N5814j24704L0919m4987k89632j83444p9572q7114K14314
18240B985371K36025k33474k06092n7319J14983k0343j46350m6490q9072j29341
18230B407898K38330L9081r5831p220K7082P059j46431k2378J7189o4651m2997
18219B357131j35997l2758o0167r0137J10403j79202j99086n7648M0747L7720
$$ plain form
18209 1791006 1894075 1893747 1924852 1967977 2082767 1864912 1678573 1590127 1399865 1217659
18199 1217659 1210146 1399165 1581955 1534351 1568403 1707034 1648560 1558750 1529977 1460053 1201727
18188 1201727 1305787 1413121 1529157 1477885 1447662 1192853 1168078 1306119 1408613 1320467
18178 1320467 1383125 1446399 1338759 938634 843050 969579 987022 1027210 900419 765069
18168 765069 903925 994936 946317 1084086 1163051 1025239 894087 937232 953826 944766 862731
18157 862731 882745 1004398 1090948 1217901 1005014 693159 714530 920729 1086374 1025331
18147 1025331 886768 796913 929382 964752 940091 960474 734180 640909 613778 568410 785673
18136 785673 919997 949976 1016691 1056543 951979 1014706 863765 908662 1003081 1089481 990376
$$ packed form
18209A791006J03069l28L1105M3125J14790k17855j86339q8446j90262j82206
18199A217659p513J89019J82790m7604L4052J38631n8474q9810k8773o9924k58326
18188A201727J04060J07334J16036n1272l0223k54809k4775J38041J02494q8146
18178A320467O2658O3274j07640m00125r5584J26529J7443M0188j26791j35350
18168G65069J38856R1011m8619J37769P8965j37812j31152M3145J6594r060q2035
18157H62731K0014J21653Q6550J26953k12887l11855K1371K06199J65645o1043
18147A025331j38563q9855J32469L5370k4661K0383k26294r3271k7131m5368K17263
18136G85673J34324K9979O6715L9852j04564O2727j50941M4897R4419Q6400r9105
$$ plain form
18125 990376 973217 804225 663648 711512 898731 1000042 1111005 1023368 938889 1053715
18115 1053715 1003950 920037 924808 854772 819952 669670 754364 860964 874636 734274 761358
18104 761358 892415 909948 838160 731234 745165 564053 304224 283874 561241 628162
18094 628162 543469 558382 542967 606934 581241 610920 626935 615525 668280 796161 665222
18083 665222 462365 385394 477803 653881 876099 894923 765386 802689 622249 547114
18073 547114 598482 688199 468307 196037 445327 636690 792585 777787 789474 664217
18063 664217 527046 460163 485558 343973 328038 395389 346219 531659 470923 242128 161931
18052 161931 210039 234434 236581 304924 275273 304538 10763 79834 271339 128456 10562
$$ packed form
18125I90376j7159j68992j40577M7864J87219J01311J10963q7637q4479J14826
18115A053715m9765q3913M771p0036l4820j50282Q4694J06600J3672j40362K7084
18104G61358J31057J7533p1788j06926J3931j81112k59829k0350K77367O6921
18094F28162q4693J4913j5415O3967k5693K9679J6015j1410N2755J27881j30939
18083F65222k02857p6971R2409J76078K22218J8824j29537L7303j80440p5135
18073E47114N1368Q9717k19892k72270K49290J91363J55895j4798J1687j25257
18063F64217j37171o6883K5395j41585j5935O7351m9170J85440o0736k28795q0197
18052A61931M8108K4395K147O8343k9651K9265k93775O9071J91505j42883j17894
$$ plain form
18041 10562 -98101 -18333 159412 159866 45642 36518 132552 88240 222914 222370 20935 -44887
18029 -44887 6573 51615 258187 233856 132561 115156 41075 94571 131085 20640 -82499
18018 -82499 122810 208602 127123 168374 159574 189847 282674 268020 138393 143497 158879 141900
18006 141900 198862 198414 134277 89124 278459 287743 294150 229843 13638 50408 152270 13429
17994 13429 127620 257808 238320 117745 -48924 -9757 278604 306734 378988 437714 358569
17983 358569 352511 353820 515095 539447 579528 590603 525598 310337 197644 192064 232870
17972 232870 286344 368108 509538 487756 571823 671316 648877 613171 575345 512617 722085
17961 722085 765991 747606 871033 1058623 1079691 873347 623284 570340 784243 925506
$$ packed form
18041A0562j08663P9768J77745M54j14224r124R6034m4312J34674n44k01435o5822
18029d4887N1460M5042K06572k4331j01295j7405p4081N3496L6514j10445j03139
18018h2499K05309Q5792q1479M1251q800L0273R2827j4654j29627N104J5382j6979
18006A41900N6962m48o4137m5153J89335R284O407o4307k16205L6770J01862j38841
17994A3429J14191J30188j9488j20575j66669L9167K88361K8130P2254N8726p9145
17983C58569o058J309J61275K4352M0081J1075o5005k15261j12693n580M0806
17972B32870N3474Q1764J41430k1782Q4067R9493k2439l5706l7826o2728K09468
17961G22085M3906j8385J23427J87590K1068k06344k50063n2944K13903J41263
$$ plain form
17951 925506 873530 815750 886372 816173 876703 948410 932970 936700 993170 1057057 894115
17940 894115 804104 878776 920099 985668 981001 941157 929041 678386 396123 429896 676201
17929 676201 879855 885874 880202 825748 776813 814317 980129 1119394 1071945 948084 835607
17918 835607 674693 681684 774532 843863 939353 931991 898823 922951 1001067 884991 1132775
17907 1132775 1477280 1435434 1241066 1271866 1397973 1448102 1489858 1556632 1701823 1602678
17897 1602678 1301287 1252063 1077003 826423 838639 946758 1120231 979072 798550 723352
17887 723352 741569 617557 666359 715685 702376 604875 613914 487331 573427 609853 625513
17876 625513 664752 702389 737137 800738 870289 723824 610641 603303 693326 677503 792199
$$ packed form
17951I25506n1976n7780P0622p0199O0530P1707j5440L730N6470O3887j62942
17940H94115r0011P4672M1323O5569m667l9844j2116k50655k82263L3773K46305
17929F76201K03654O019n672n4454m8935L7504J65812J39265m7449j23861j12477
17918H35607j60914O991R2848O9331R5490p362l3168K4128P8116j16076K47784
17907A132775L44505m1846j94368L0800J26107N0129M1756O6774J45191r9145
17897A602678l01391m9224j75060k50580J2216J08119J73473j41159j80522p5198
17887G23352J8217j24012M8802M9326j3309r7501R039j26583Q6096L6426J5660
17876F25513L9239L7637L4748O3601O9551j46465j13183p338R0023j5823J14696
$$ plain form
17865 792199 692164 607913 449570 493028 568105 600395 685518 615104 484181 494788 472462
17854 472462 723586 689322 565708 707109 791808 590974 559364 457989 462656 600577
17844 600577 521190 335936 218181 197433 127473 -130119 -123377 -44446 -22899 113914 148512
17833 148512 -11978 11266 125705 343535 264088 259721 302052 217085 192838 344622 484075
17822 484075 396002 206633 71952 -53181 -91408 36818 45549 -54328 19425 -27822 -211742
17811 -211742 -102768 58941 178675 -46235 -231403 -295721 -374167 -308078 -212492 477
17801 477 38655 -35810 -98101 -178235 -274826 -399963 -173211 5478 -5069 -68289 -22574
17790 -22574 -117032 -136385 -201820 -281018 -342259 -298412 -179562 -140319 -88213 -174186 -121122
$$ packed form
17865G92199j00035q4251j58343M3458P5077L2290Q5123p0414j30923J0607k2326
17854D72462K51124l4264j23614J41401Q4699k00834l1610j01375M667J37921
17844F00577p9387j85254j17755k0748o9960k57592O742P8931K1547J36813L4598
17833A48512j60490K3244J14439K17830p9447m367M2331q4967k4247J51784J39453
17822D84075q8073j89369j34681j25133l8227J28226Q731r9877P3753m7247j83920
17811b11742J08974J61709J19734k24910j85168o4318p8446O6089R5586K12969
17801D77L8178p4465o2291q0134r6591j25137K26752J78689j0547o3220M5715
17790b2574r4458j9353o5435p9198o1241M3847J18850L9243N2106q5973N3064
$$ plain form
17779 -121122 -27636 878 -80476 45287 126376 154728 -15095 -108462 -20820 -59371 -20712
17768 -20712 -64104 -115786 -101151 76032 222281 134190 127719 -9174 -150592 -198391 -243373
17757 -243373 -91734 153922 174944 102876 -4572 -2344 7136 66005 -84397 73857 28697
17746 28697 -42183 68530 153359 318605 347767 514910 302722 121387 -84149 -87167 228845
17735 228845 193193 25727 48181 89493 105679 139115 51356 -287082 -157465 -138207 -266094
17724 -266094 -222015 -307282 -247338 -182113 -95509 -59523 -40012 -80594 -245362 -221690 -202689
17713 -202689 -249826 -323026 -319905 -185765 -219825 -180410 -180225 -249849 -166843 -205940 -278848 -170884
17701 -170884 -153306 -167372 -100817 -13576 -48349 -204727 -182919 15246 -104639 -36612 31661
$$ packed form
17779a21122R3486K8514q1354J25763Q1089K8352j69823r3367Q7642l8551L8659
17768b0712m3392n1682J4635J77183J46249q8091o471j36893j41418m7799m4982
17757b43373J51639K45656K1022p2068j07448K228R480N8869j50402J58254m5160
17746B8697p0880J10713Q4829J65246K9162J67143k12188j81335k05536l018L16012
17735B28845l5652j67466K2454M1312J6186L3436q7759l38438J29617J9258j27887
17724b66094M4079q5267N9944O5225Q6604L5986J9511m0582j64768K3672J9001
17713b02689m7137p3200L121J34140l4060L9415J85o9624Q3006l9097p2908J07964
17701a70884J7578j4066O6555Q7241l4773j56378K1808J98165j19885O8027O8273
$$ plain form
17690 31661 27626 63346 76053 142198 48 -128916 -187944 -195039 -113070 -80093 -19870 -23226
17678 -23226 -262954 -148120 -17816 35199 -15204 60498 45828 121926 266698 188431 74419
17667 74419 -7572 -109090 18620 236157 283070 180379 14271 -140794 -28363 56625
17657 56625 -21154 -185950 -291345 -73475 19929 84737 43811 -14861 -143386 -122142 31119
17646 31119 185913 172827 26458 -12345 -99446 -7397 104791 209146 188722 147336 7766
17635 7766 78453 169984 154416 35575 -115241 -231584 -247456 -124249 -83042 -360181 -453064
17624 -453064 -241076 110410 -73882 -251654 -150058 -90851 -95986 -61192 21499 89911 63906
17613 63906 48905 -23263 -66834 -118588 24965 -72547 -102208 83914 -112754 -304993 -245257
$$ packed form
17690C1661m035L5720J2707O6145j42150j28964n9028p095Q1969L2977O0223l356
17678b3226k39728J14834J30304N3015n0403P5702j4670P6098J44772p8267j14012
17667G4419q1991j01518J27710K17537M6913j02691j66108j55065J12431Q4988
17657E6625p7779j64796j05395K17870R3404O4808m0926n8672j28525K1244J53261
17646C1119J54794j3086j46369l8803q7101R2049J12188J04355k0424m1386j39570
17635G766P0687R1531j5568j18841j50816j16343j5872J23207M1207k77139r2883
17624d53064K11988L51486j84292j77772J01596N9207n135L4794Q2691O8412k6005
17613F3906j5001p2168m3571n1754J43553r7512k9661J86122j96668j92239N9736
$$ plain form
17602 -245257 -87183 -47670 -123178 11127 102309 170524 36468 -38465 22754 67753 48063
17591 48063 -101843 -84795 -44471 112596 -40982 -63876 34384 138191 114891 166206 285053
17580 285053 70443 -138317 -267541 -231528 -185442 -284368 -381442 -202282 -133660 -266690
17570 -266690 -120202 81401 117676 123202 67412 -79348 -117552 -165505 -314106 -282591 -396926
17559 -396926 -334274 -107535 14109 -189735 -367670 -367362 -263683 -191181 -300891 -141046
17549 -141046 -63346 -79352 -335 -271804 -180062 -208434 -296894 -237024 -30508 -54115 -294546
17538 -294546 -316324 -159358 -84432 -162899 -314332 -169854 -191696 -196321 -92616 -37199 -85404
17527 -85404 -82946 -65954 -95398 -151621 -132737 -311282 -459247 -322189 -297150 -239772 -215020
$$ packed form
17602b45257J58074L9513p5508J34305R1182O8215j34056p4933O1219M4999j9690
17591D8063j49906J7048M0324J57067j53578k2894R8260J03807k3300N1315J18847
17580B85053k14610k08760j29224L6013M6086r8926r7074J79160O8622j33030
17570b66690J46488K01603L6275N526n5790j46760l8204m7953j48601L1515j14335
17559c96926O2652K26739J21644k03844j77935L08J03679P2502j09710J59845
17549a41046P7700j6006P9017k71469R1742k8372q8460N9870K06516k3607k40431
17538b94546k1778J56966P4926p8467j51433J44478k1842m625J03705N5417m8205
17527h5404K458J6992k9444n6223J8884j78545j47965J37058K5039N7378K4752
$$ plain form
17516 -215020 -178396 -282988 -497881 -339982 -164805 -24233 42791 70509 8944 -106841
17506 -106841 -266289 -224381 -190423 -73226 -15550 -132980 -295373 -414718 -224939 -77748
17496 -77748 -179018 -128119 93833 54223 36000 125903 115380 126243 128258 320870 266380
17485 266380 43742 65288 187208 90815 151405 154704 115922 65936 -100196 -301246 -314284
17474 -314284 -254243 -101669 54354 134477 82141 -15376 -13654 -101370 43425 -51077 -345494
17463 -345494 -561774 -548733 -530302 -391637 -279747 -225041 -159571 -120123 -266044 -259284 -320609
17452 -320609 -281381 -142209 107497 101516 -72364 -67799 2054 32310 207874 225281 106232
17441 106232 -53844 -93293 90273 162268 -36573 -80906 263269 328928 168785 11407
$$ packed form
17516b15020L6624j04592k14893J57899J75177J40572O7024K7718o1565j15785
17506a06841j59448M1908L3958J17197N7676j17430j62393j19345J89779J47191
17496g7748j01270N0899K21952l9610j8223Q9903j0523J0863K015J92612n4490
17485B66380k22638K1546J21920r6393O0590L299l8782m9986j66132k01050j3038
17474c14284O0041J52574J56023Q0123n2336r7517J722q7716J44795r4502k94417
17463c45494k16280J3041J8431J38665J11890N4706O5470L9448j45921O760o1325
17452c20609L9228J39172K49706n981j73880M565O9853L0256J75564J7407j19049
17441A06232j60076l9449J83566P1995j98841m4333L44175O5659j60143j57378
$$ plain form
17431 11407 -201739 -372245 -270536 5302 127068 171267 232045 77006 -152660 -182749
17421 -182749 -316256 -458608 -394656 -187362 -101566 -212372 -342069 -454872 -369756 -161681
17411 -161681 -94061 95299 15704 -62000 -107305 -115124 -156244 -229500 -311796 -387282 -324785
17400 -324785 -24978 68503 -95754 -58021 -259598 -174091 -75299 -52855 -18197 -5440 -178291
17389 -178291 -238309 -251095 -151920 -160531 -230489 -255372 -264921 -160937 44275 90418 156100
17378 156100 -12127 -144589 -346734 -393149 -285730 -53499 -56799 -155839 -45697 192398
17368 192398 100143 -10414 61006 112465 46604 27362 115188 153262 153108 40979 3148
17357 3148 105478 31553 9584 -88131 -77103 -19913 -35696 -27681 -44233 2786 227758 129438
$$ packed form
17431A1407k13146j70506J01709K75838J21766M4199O0778j55039k29666l0089
17421a82749j33507j42352O3952K07294Q5796j10806j29697j12803Q5116K08075
17411a61681O7620J89360p9595p7704m5305p819m1120p3256q2296p5486O2497
17400c24785K99807R3481j64257L7733k01577Q5507R8792K2444L4658J2757j72851
17389a78291o0018j2786R9175q611o9958k4883r549J03984K05212M6143O5682
17378A56100j68227j32462k02145m6415J07419K32231l300r9040J10142K38095
17368A92398r2255j10557P1420N1459o5861j9242Q7826L8074j54j12129l7831
17357C148J02330p3925k1969r7715J1028N7190j5783Q015j6552M7019K24972r8320
$$ plain form
17345 129438 -52762 -223005 -363230 -354542 -71876 186619 253703 139809 243229 128770
17335 128770 792 -93804 -285556 -224768 -104835 89955 143888 196562 149659 133355 257223
17324 257223 300192 317523 362458 351121 280865 126636 19859 39028 136685 70560 -100089
17313 -100089 -98885 -218862 -168416 1241 -7418 152059 354735 150292 -56588 80547
17303 80547 68055 -14379 -66958 14579 110963 -41844 -137725 -250114 -277601 -368016 -494036
17292 -494036 -373729 -293957 -192481 -49543 224256 315268 123934 -20760 -164751 -253317
17282 -253317 -249096 -17138 105695 204252 196378 164970 157131 131802 6950 136619 244466
17271 244466 236549 300851 188357 -114038 -158611 -57813 113889 156347 62970 164773 27490
$$ packed form
17345A29438j82200j70243j40225Q688K82666K58495O7084j13894J03420j14459
17335A28770j27978r4596j91752O0788J19933J94790N3933N2674m6903j6304J23868
17324B57223M2969J7331M4935j1337p0256j54229j06777J9169R7657o6125j70649
17313a00089J204j19977N0446J69657q659J59477K02676k04443k06880J37135
17303H0547j2492q2434n2579Q1537R6384j52807r5881j12389k7487r0415j26020
17292d94036J20307P9772J01476J42938K73799R1012j91334j44694j43991q8566
17282b53317M221K31958J22833R8557p874l1408p839k5329j24852J29669J07847
17271B44466p917O4302j12494l02395m4573J00798J71702M2458r3377J01803j37283
$$ plain form
17260 27490 -178898 -59142 -46384 -134384 -145950 -78654 -147848 -70418 58937 67171 28428
17249 28428 -34010 -61052 -190467 -280893 -289712 -512992 -391578 -186751 -205063 -168427 -51276
17238 -51276 3436 -115668 -189824 -137607 -25602 1043 -127721 -171079 -128834 -191238 -264827
17227 -264827 -166474 -88350 -126943 -3812 245878 254465 32795 -87933 -157137 -253912 -183170
17216 -183170 -179221 -14223 -11770 -38999 16204 7251 -143992 -140550 -17350 -189142 -386555
17205 -386555 -525097 -412423 -435618 -353743 -108135 -48058 -27246 21626 227481 411722
17195 411722 364901 331620 225046 67592 -115464 16757 160900 10193 50440 -38637
17185 -38637 24946 -75446 -143193 -194418 -179431 71638 232002 119110 -120860 -13199
$$ packed form
17260B7490k06388J19756J2758q8000j1566O7296o9194P7430J29355Q234l8743
17249B8428o2438k7042j29415r0426q819k23280J21414K04827j8312L6636J17151
17238e1276N4712j19104p4156N2217J12005K6645j28764m3358M2245o2404p3589
17227b64827R8353P8124l8593J23131K49690Q587k21670j20728o9204r6775P0742
17216a83170L949J64998K453k7229N5203q953j51243L442J23200j71792j97413
17205c86555j38542J12674k3195Q1875K45608O0077K0812M8872K05855J84241
17195D11722m6821l3281j06574j57454j83056J32221J44143j50707M0247q9077
17185c8637O3583j00392o7747n1225J4987K51069J60364j12892k39970J07661
$$ plain form
17175 -13199 48045 -9934 -46115 -119264 98020 83476 -18697 64254 -75290 -245251 -291527
17164 -291527 -260180 -269096 -176667 -8618 22138 -13889 47529 97715 199426 73158 -71122
17153 -71122 -144531 -201046 -46134 -6523 -31421 103448 233573 167433 48853 74221 -183006
17142 -183006 -354792 -296257 -133033 -6368 124302 84592 -61625 -47474 -103974 41584
17132 41584 71163 -59654 -197857 -306542 -337384 -317439 -64674 222791 101945 -175503
17122 -175503 -207715 -170014 -179608 -201497 -319081 -287552 -86302 -120198 -248488 -175983 -98875
17111 -98875 -158860 -208710 -239304 -122216 -64797 40948 -75051 -220709 -126872 45113 -58761
17100 -58761 -197042 -230722 -138588 -152551 -245292 -251862 -168413 -121287 -203532 -218095 -36067
$$ packed form
17175a3199O1244n7979l6181p3149K17284j4544j02173Q2951j39544j69961m6276
17164b91527L1347q916R2429J68049L0756l6027O1418N0186J01711j26268j44280
17153g1122p3409n6515J54912L9611k4898J34869J30125o6140j18580K5368k57227
17142a83006j71786N8535J63224J26665J30670l9710j46217J4151n6500J45558
17132D1584K9579j30817j38203j08685l0842J9945K52765K87465j20846k77448
17122a75503l2212L7701r594k1889j17584L1529K01250l3896j28290P2505P7108
17111i8875n9985m9850l0594J17088N7419J05745j15999j45658R3837J71985j03874
17100e8761j38281l3680R2134j3963r2741o570Q3449M7126q2245j4563J82028
$$ plain form
17089 -36067 19154 -9699 -258193 -237081 -173560 -16145 -58715 -227872 -339421 -256742 -51353
17078 -51353 22339 -95004 -141847 26506 53784 -46151 -40150 -145843 -397345 -329976 -270585
17067 -270585 -234846 -197312 -80135 -63301 20717 127302 -27628 -205277 -205020 -131342 -49798
17056 -49798 -76022 78968 126034 182690 82411 -156007 -64196 139136 122258 -75038 32326
17045 32326 153835 249392 143549 -131498 -126354 -11989 -88886 -21901 18935 -124820 -91532
17034 -91532 125849 218410 204609 46199 -38860 -51374 -10440 49131 9808 -188151 -180663
17023 -180663 31121 5221 -316245 -224538 -192063 -153374 -248493 -348748 -307452 -137254 -31406
17012 -31406 -174569 -220885 -84240 -48901 -62924 -166652 -506225 -387086 -133256 -72298
$$ packed form
17089c6067N5221k8853k48494K1112O3521J57415m2570j69157j11549Q2679K05389
17078e1353P3692j17343m6843J68353K7278r9935O001j05693k51502O7369N9391
17067b70585L5739L7534J17177J6834Q4018J06585j54930j77649K57P3678Q1544
17056d9798k6224J54990M7066N6656j00279k38418R1811K03332j6878j97296J07364
17045C2326J21509R5557j05843k75047N144J14365p6897O6985M0836j43755L3288
17034i1532K17381R2561j3801j58410q5059j2514M0934N9571l9323j97959P488
17023a80663K11784k5900l21466R1707L2475L8689r5119j00255M1296J70198J05848
17012c1406j43163m6316J36645L5339j4023j03728l39573J19139K53830O0958
$$ plain form
17002 -72298 -94253 91057 -8017 -190573 -275964 -299269 -165643 -87071 70214 62850 -99744
16991 -99744 -215486 -90811 -44968 -228712 -143477 27410 8505 -165103 -337160 -252098
16981 -252098 -287855 -316056 -182092 -237057 -166908 -20416 4373 -184266 -211808 99820 392772
16970 392772 375062 134662 53333 32538 -38572 -269560 -398059 -430323 -285351 -157867
16960 -157867 33235 23800 89191 203768 119760 -134541 -266968 -283189 -254262 -373791 -317686
16949 -317686 -344795 -456288 -380302 -276796 -350444 -458228 -338864 -278888 -164467 -172939 -147541
16938 -147541 -4231 -54936 -297396 -283618 -80164 -56041 178549 352985 194108 176497
16928 176497 52239 54035 -29838 -45503 -3410 4303 -145092 -90990 24997 44841 40056
$$ packed form
17002g2298k1955J85310r9074j82556q5391k3305J33626P8572J57285p364j62594
16991i9744j15742J24675M5843j83744Q5235J70887j8905j73608j72057Q5062
16981b52098l5757k8201J33964n4965P0149J46492K4789j88639k7542L11628K92952
16970C92772j7710k40400q1329k0795p1110k30988j28499l2264J44972J27484
16960a57867J91102r435O5391J14577q4008k54301j32427j6221K8927j19529N6105
16949c17686k7109j11493P5986J03506p3648j07784J19364N9976J14421q472K5398
16938a47541J43310n0705k42460J3778K03454K4123K34590J74436j58877j7611
16928A76497j24258J796q3873j5665M2093P713j49395N4102J15987J9844m785
$$ plain form
16917 40056 -10313 30572 -53629 -10846 27422 35105 27609 -34026 -248679 -305091 -245218 -236591
16905 -236591 -242594 -228098 -393125 -317110 -43075 13956 -92753 -49597 7380 72563 -21493
16894 -21493 4660 19672 -81000 -185273 -10491 19118 -154619 -293533 -187712 -170687
16884 -170687 -186443 -166441 -232126 -381965 -285792 -227585 -145409 20019 13406 27068 40217
16873 40217 123266 75208 121578 86460 54144 134002 278786 261314 87434 264705 232456
16862 232456 -103440 -209207 -140942 -234576 -297328 -374475 -249589 -283429 -469489 -423404 -243104
16851 -243104 -13963 -49984 -130353 -277723 -231250 -296784 -367916 -406158 -404275 -426193 -472510
16840 -472510 -532941 -622270 -635043 -589680 -436899 -159020 -89328 -214187 -321101 -289908 -106924
$$ packed form
16917D0056n0369M0885q4201M2783L8268P683p496o1635k14653n6412N9873Q627
16905b36591o003J4496j65027P6015K74035N7031j06709M3156N6977O5183r4056
16894b1493K6153J5012j00672j04273J74782K9609j73737j38914J05821J7025
16884a70687j5756K0002o5685j49839R6173N8207Q2176J65428o613J3662J3149
16873D0217Q3049m8058M6370l5118l2316P9858J44784j7472j73880J77271l2249
16862B32456l35896j05767O8265r3634o2752p7147J24886l3840j86060M6085J80300
16851b43104K29141l6021q0369j47370M6473o5534p1132l8242J883k1918m6317
16840d72510o0431q9329j2773M5363J52781K77879O9692j24859j06914L1193J82984
$$ plain form
16829 -106924 -9663 111725 62863 -186682 -225087 -217596 -106911 -98919 -89835 -1168 15713
16818 15713 -27950 -114937 -66950 -81936 -62196 15982 -44611 -65694 -21303 26815 -43949 -9203
16806 -9203 -37176 24001 -12831 23986 -120439 -267109 -274123 -315063 -221280 -153795 -271441
16795 -271441 -322118 -223888 -190036 -168736 -280933 -413943 -235032 -64575 -259694 -347871
16785 -347871 -304816 -147919 41009 -78303 -206890 -239012 -163564 -164688 -309759 -80459
16775 -80459 227419 33520 -83120 -123457 -211496 -183242 -170393 -224351 -148118 -89730 -222243
16764 -222243 -262148 -294131 -307176 -286729 -334285 -156348 -214124 -155137 -188546 -246089 -227987
16753 -227987 -96842 98323 -66011 -47722 75410 94267 -275545 -332777 -182530 137849
$$ packed form
16829a06924R7261J21388m8862k49545l8405P491J10685P992R084Q8667J6881
16818A5713m3663q6987M7987j4986J9740P8178o0593k1083M4391M8118p0764L4746
16806i203k7973O1177l6832L6817j44425j46670p014m0940R3783O7485j17646
16795b71441n0677R8230L3852K1300j12197j33010J78911J70457j95119q8177
16785c47871M3055J56897J88928j19312j28587l2122P5448j124j45071K29300
16775h0459L07878j93899j16640m0337q8039K8254J2849n3958P6233N8388j32513
16764b22243l9905l1983j3045K0447m7556J77937n7776N8987l3409n7543J8102
16753b27987J31145J95165j64334J8289J23132J8857l69812n7232J50247L20379
$$ plain form
16743 137849 352382 135700 -95425 -180255 -201710 -132733 -44088 -77047 -89423 -296682 -316483
16732 -316483 -397891 -659107 -549291 -141880 42719 141701 359425 282719 337893 206611
16722 206611 150255 32451 32788 133287 201673 239304 39508 -153963 -56481 -10751 -83407
16711 -83407 30517 122685 -39387 -243762 -296170 -251721 -172970 -144943 -177723 -9600 -77157
16700 -77157 -90336 197771 376043 177109 125700 41221 6929 -182230 -219851 -129676 -88199
16689 -88199 -21461 24173 -14517 -75213 -61814 -9222 18345 47992 177861 243467 136791
16678 136791 -61226 -237185 -356103 -266788 -330823 -239898 -247507 -70835 51048 -35197 -74422
16667 -74422 -68435 -5803 -93024 -336586 -390374 -316586 -161427 -85408 -30641 -148364 -222713
$$ packed form
16743A37849K14533k16682k31125q4830k1455O8977Q8645l2959j2376k07259j9801
16732c16483q1408k61216J09816M07411J84599R8982K17724p6706N5174j31282
16722B06611n6356j17804L37J00499O8386L7631j99796j93471R7482M5730p2656
16711h3407J13924R2168j62072k04375n2408M4449P8751K8027l2780J68123o7557
16700g7157j3179K88107J78272j98934n1409q4479l4292j89159l7621R0175M1477
16689h8199O6738M5634l8690o0696J3399N2592K7567K9647J29869O5606j06676
16678A36791j98017j75959j18918Q9315o4035R0925p609J76672J21883q6245l9225
16667g4422N987O2632q7221k43562n3788P3788J55159P6019N4767j17723p4349
$$ plain form
16656 -222713 -126616 -263019 -390585 -300317 -169081 -166838 -108188 -27891 19591 136758 152925
16645 152925 149837 51665 52276 78869 -11718 -137324 22733 105058 -45189 -200658 -227992
16634 -227992 -62173 4945 -75399 -268113 -304697 -298628 -82032 156993 98535 -139687 -279487
16623 -279487 -85300 -194688 -276880 -147558 -245666 -70352 -22119 -4258 -48029 -232203
16613 -232203 -348449 -133344 189235 -14979 -75916 -255479 -382281 -419784 -261111 -5299
16603 -5299 -5754 -146385 -147676 -146822 -279850 -156908 -84038 -71867 -284530 -334417 -425908 -471900
16591 -471900 -400949 -148600 49881 -50578 -137870 -217771 -16261 214069 181828 -139196
16581 -139196 -219627 -189737 -140155 -243683 -140939 -132841 -265195 -156514 -80106 -11850 138511
$$ packed form
16656b22713R6097j36403j27566R0268J31236K243N8650Q0297M7482J17167J6167
16645A52925l088r8172O11K6593r0587j25606J60057Q2325j50247j55469k7334
16634b27992J65819O7118q0344j92714l6584O069K16596K39025n8458k38222j39800
16623b79487J94187j09388q2192J29322r8108J75314M8233J7861m3771j84174
16613b32203j16246K15105L22579k04214o0937j79563j26802l7503J58673K55812
16603e299m55j40631j291Q54j33028J22942P2870J2171k12663m9887r1491m5992
16591d71900P0951K52349J98481j00459q7292p9901K01510K30330l2241l21024
16581a39196q0431K9890M9582j03528J02744Q098j32354J08681P6408O8256J50361
$$ plain form
16570 138511 81538 -36074 -205734 -92503 -9452 82336 -7857 -111021 -41316 -97114 -55558
16559 -55558 123213 192454 232415 188385 79984 -18125 -82092 21338 228326 217236 36477
16548 36477 54479 -55820 70738 23805 -5638 -161840 -111113 -223877 -362310 -298194 -247229
16537 -247229 210569 321452 317994 194991 183106 120933 65056 122287 26363 93546 81097
16526 81097 176716 240689 127621 181963 542 -79113 -36151 -75085 -182069 -332908 -166371
16515 -166371 -65819 -4397 -172610 -182023 -86106 -228671 -162142 -145929 -249810 -203860 -14328
16504 -14328 -36194 -379859 -279654 -178662 -201162 -177920 -94504 25441 17031 -33323 -1808
16493 -1808 -18104 -47264 25429 -209782 -341861 -274047 -362849 -356691 -325627 -282828 -318849 -242351
$$ packed form
16570A38511n6973j17612j69660J13231Q3051R1788r0193j03164O9705n5798M1556
16559e5558J78771O9241L9961m4030j08401r8109o3967J03430K06988j1090j80759
16548C6477J8002j10299J26558m6933k9443j56202N0727j12764j38433O4116N0965
16537b47229M57798J10883l458j23003j1885o2173n5877N7231r5924O7183j2449
16526H1097R5619O3973j13068N4342j81421p9655M2962l8934j06984j50839J66537
16515a66371J00552O1422j68213r413R5917j42565O6529J6213j03881M5950J89532
16504a4328k1866l43665J00205J00992k2500K3242Q3416J19945q410n0354L1515
16493a808j6296k9160P2693k35211j32079O7814q8802O158L1064M2799l6021P6498
$$ plain form
16481 -242351 -194076 -20094 1727 -45904 -49313 -162729 -261735 -158528 65298 -11231 -212750
16470 -212750 -297526 -212640 -68210 -150110 -115942 183036 249883 179134 105214 7736 2077
16459 2077 173953 260534 296494 164576 -19346 -167180 -217514 -199087 -62982 53202 91109
16448 91109 -144341 -275227 -175015 -160820 -121583 -69364 -15387 -48091 -69551 127767 272458
16437 272458 323149 178102 -54770 835 136147 42882 -23679 181214 251260 360595
16427 360595 369710 142905 -27989 93996 104954 5328 55315 191914 248026 143695 -89463
16416 -89463 -179459 -10780 61123 203405 240153 122895 159110 322516 126906 20808
16406 20808 -32116 -23816 111969 234562 204381 -51353 -171271 -130153 -109214 -204067 -265466
$$ packed form
16481b42351M8275J73982K1821m7631l409j13416r9006J03207K23826p6529k01519
16470b12750q4776Q4886J44430q1900L4168K98978O6847p0749p3920r7478n659
16459B077J71876Q6581L5960j31918j83922j47834n0334J8427J36105J16184L7907
16448I1109k35450j30886J00212J4195L9237N2219N3977l2704k1460J97318J44691
16437B72458N0691j45047k32872N5605J35312r3265o6561K04893P0046J09335
16427C60595R115k26805j70894J21985J0958r9626M9987J36599N6112j04331k33158
16416h9463q9996J68679P1903J42282L6748j17258L6215J63406j95610j06098
16406B0808n2924Q300J35785J22593l0181k55734j19918M1118K0939r4853o1399
$$ plain form
16395 -265466 -337465 -187652 103101 82608 1329 145037 145222 -47352 -63822 -172122 -160122
16384 -160122 25870 155144 48054 97646 162875 -75686 -327213 -204021 -28199 -189607
16374 -189607 -259646 -151982 -104610 18865 41612 -61494 105335 86403 -91440 -61506
16364 -61506 45558 124393 47975 21161 -15556 -147236 -206879 -142929 -241427 -312964 -195680
16353 -195680 -263647 -260174 -75866 -214335 -328122 -201190 -217954 -165127 -124881 -151887 -86632
16342 -86632 92390 164910 -32406 -139578 34304 133626 158916 88484 65037 246523 162795
16331 162795 91064 89837 92653 148687 11586 156433 131307 23673 -109485 178576 423492
16320 423492 227957 63221 88980 346439 392073 180670 223759 139368 -93689 -79203
$$ packed form
16395b65466p1999J49813K90753k0493q1279J43708J85j92574j6470j08300J2000
16384a60122J85992J29274j07090M9592O5229k38561k51527J23192J75822j61408
16374a89607p0039J07664M7372J23475K2747j03106J66829j8932j77843K9934
16364f1506J07064P8835p6418k6814l6717j31680n9643O3950r8498p1537J17284
16353a95680o7967L473J84308j38469j13787J26932j6764N2827M0246k7006O5255
16342h6632J79022P2520j97316j07172J73882R9322K5290p0432k3447J81486q3728
16331A62795p1731j227K816N6034j37101J44847k5126j07634j33158K88061K44916
16320D23492j95535j64736K5759K57459M5634k11403M3089q4391k33057J4486
$$ plain form
16310 -79203 69558 163811 183299 107751 90739 119061 -41445 66454 239783 132019 61932
16299 61932 -46866 -88175 -59628 -62676 24849 -94298 -255525 -13325 137536 57460 164359
16288 164359 262526 96001 -122228 -177736 -219467 -234735 -70493 -69991 -44200 83082 252582
16277 252582 101551 -160909 -124248 -122886 -201034 -264119 -195789 -218774 -171414 -157506 14144
16266 14144 158303 -58326 -91608 -118995 -99488 -205996 -286469 -453019 -551524 -567291 -297466
16255 -297466 -227161 -260057 -253190 -252565 -333187 -254252 -143708 -289842 -258045 -124897 -78932
16244 -78932 76675 136373 -63114 -338305 -339357 -199740 -167233 -147007 -131030 11118 55165
16233 55165 8293 22776 -42863 -35091 33470 277480 94498 151516 205541 224384 221107 333353
$$ packed form
16310g9203J48761R4253J9488p5548j7012K8322j60506J07899J73329j07764p0087
16299F1932j08798m1309K8547l048Q7525j19147j61227K42200J50861q0076J06899
16288A64359R8167j66525k18229n5508m1731j5268J64242N02K5791J27282J69500
16277B52582j51031k62460L6661J362p8148o3085O8330k2985M7360J3908J71650
16266A4144J44159k16629l3282k7387J9507j06508q0473j66550r8505j5767K69825
16255b97466P0305l2896O867O25q0622P8935J10544j46134L1797J33148M5965
16244g8932J55607N9698j99487k75191j052J39617L2507K0226J5977J42148M4047
16233E5165m6872J4483o5639P772O8561K44010j82982N7018N4025J8843l277J12246
$$ plain form
16221 333353 175675 32498 134503 228034 310495 115318 -142126 -225363 -118768 -141250
16211 -141250 -155341 22142 70661 132156 -152105 -331542 -304058 -289936 -264214 -182071 -89067
16200 -89067 -135358 -238888 -163569 -124256 -182782 -352437 -391627 -195090 -147254 -49053 108895
16189 108895 44053 -17925 -77497 -20351 -72254 -95301 -196003 -184579 -195913 -220884 -192456
16178 -192456 -62436 -118944 -79297 -70142 -111393 -94855 70168 658 -191673 -79445 87069
16167 87069 92061 147863 218621 259984 206231 30238 41573 213443 297125 238769 -46298
16156 -46298 -29537 40631 -19156 -118975 -165871 -280441 -401757 -151206 -217901 -279718 -287681
16145 -287681 -275290 -297099 -267019 75536 153962 -221360 -264801 -214152 84100 99877 -127230
$$ packed form
16221C33353j57678j43177J02005R3531Q2461j95177k57444q3237J06595k2482
16211a41250j4091J77483M8519O1495k84261j79437K7484J4122K5722Q2143R3004
16200h9067m6291j03530P5319L9313n8526j69655l9190J96537M7836R8201J57948
16189A08895o4842o1978n9572N7146n1903k3047j00702J1424j1334k4971K8428
16178a92456J30020n6508L9647R155m1251J6538J65023o9510j92331J12228J66514
16167H7069M992N5802P0758M1363n3753j75993J1335J71870Q3682n8356k85067
16156d6298J6761P0168n9787r9819m6896j14570j21316K50551o6695o1817p963
16145b87681J2391k1809L0080L42555P8426l75322m3441N0649K98252J5777k27107
$$ plain form
16134 -127230 -71991 -28187 -253572 -411875 -310916 -205768 -286807 -301732 -94245 52593
16124 52593 114940 76880 33753 92808 145895 185472 230705 125601 -25223 -144882 -70814
16113 -70814 51553 163576 192413 80929 -122268 -128554 11735 40079 -28983 -132538 -137635
16102 -137635 -19694 86304 143449 137043 169743 189810 274601 233683 83285 -47018 -235165
16091 -235165 -347894 -239378 -185390 -194119 -136101 -27323 -60351 41071 53023 1185 -21342
16080 -21342 -34538 -109596 13285 80192 -116093 -225708 -139386 -272984 -269446 -298438 -363189
16069 -363189 -211120 97464 75281 93620 234319 323003 393603 174324 3434 40702
16059 40702 -96659 -88604 -77596 -111524 -375093 -538662 -259685 24031 61716 -5755 -128597
$$ packed form
16134a27230N5239M3804k25385j58303J00959J05148q1039j4925K07487J46838
16124E2593O2347l8060m3127N9055N3087L9577M5233j05104j50824j19659P4068
16113g0814J22367J12023K8837j11484k03197o286J40289K8344o9062j03555n097
16102a37635J17941J05998N7145o406L2700K0067Q4791m0918j50398j30303j88147
16091b35165j12729J08516N3988q729N8018J08778l3028J01422J1952n1838k2527
16080b1342j3196p5058J22881O6907j96285j09615Q6322j33598L538k8992o4751
16069c63189J52069L08584k2183J8339J40699Q8684P0600k19279j70890L7268
16059D0702j37361Q055J1008l3928k63569j63569K78977K83716L7685o7471j22842
$$ plain form
16048 -128597 -275625 -184250 -108305 -390919 -486299 -299990 -178354 -203665 -239838 -316185 -389729
16037 -389729 -310405 -165920 -180440 -159502 -259760 -276173 12941 128592 173220 99856 -22739
16026 -22739 -135266 -156610 -99413 -217411 -345926 -462843 -299898 -22786 70241 41565
16016 41565 124510 208763 294159 62417 -178158 -255 127593 91187 -140110 -129496 -146831
16005 -146831 -198996 -230411 -257463 -149894 -60062 134201 116735 343033 324078 179549 211704
15994 211704 178679 -21264 -167863 -35416 31506 -19322 -112632 -153999 -197773 -40820 -54157
15983 -54157 -71262 119398 67360 13394 -18443 144286 42458 98655 258573 217989 263508
15972 263508 241295 164152 -7292 25986 -17879 -90910 -4761 -76954 -198393 -171291 2916
$$ packed form
16048a28597j47028R1375P5945k82614r5380J86309J21636k5311l6173p6347p3544
16037c89729P9324J44485j4520K0938j00258j6413K89114J15651M4628p3364j22595
16026b2739j12527k1344N7197j17998j28515j16917J62945K77112R3027k8676
16016D1565Q2945Q4253Q5396k31742k40575J77903J27848l6406k31297J0614j7335
16005a46831n2165l1415k7052J07569Q9832J94263j7466K26298j8955j44529L2155
15994B11704l3025j99943j46599J32447O6922n0828r3310m1367m3774J56953j3337
15983e4157j7105J90660n2038n3966l1837J62729j01828N6197J59918m0584M5519
15972B63508k2213p7143j71444L3278m3865p3031Q6149p2193j21439K7102J74207
$$ plain form
15961 2916 13949 -208231 -279426 -145582 -18772 -179452 -213105 -205862 -122149 9222 110351
15950 110351 81600 34830 119022 225890 93738 -160079 -108396 17748 -62044 -47248 38906
15939 38906 2239 -67914 -69296 -149177 -117493 26498 43359 114830 132794 288914 456855
15928 456855 383932 207451 166167 82776 35681 -126784 -271718 -331645 -357992 -228377 -150541
15917 -150541 4769 199286 351778 326051 292609 240642 53309 -114961 22933 45918
15907 45918 2424 -152478 -76651 5511 113743 202090 95895 156258 97762 -74535 -91038
15896 -91038 -52326 -13348 -62237 -257847 -373886 -293587 -136883 -112534 -125634 -218535 -245384
15885 -245384 -209181 -277408 -221969 -39424 210716 260044 215632 95081 24492 -148266 -34997
$$ packed form
15961B916J1033k22180p1195J33844J26810j60680l3653P243Q3713J31371J01129
15950A10351k8751m6770Q4192J06868j32152k53817N1683J26144p9792J4796Q6154
15939C8906l6667p0153j382p9881L1684J43991J6861P1471J7964J56120J67941
15928D56855p2923j76481m1284q3391m7095j62465j44934n9927k6347J29615P7836
15917a50541J55310J94517J52492k5727l3442n1967j87333j68270J37894K2985
15907D5918m3494j54902P5827Q2162J08232Q8347j06195O0363n8496j72297j6503
15896i1038L8712L8978m8889j95610j16039Q0299J56704K4349j3100r2901k6849
15885b45384L6203o8227N5439J82545K50140M9328m4412j20551p0589j72758J13269
$$ plain form
15874 -34997 137405 149608 117761 263933 97387 163938 220317 39646 73922 327297 327509
15863 327509 75250 -67161 11567 -25786 -117344 -31123 55888 8662 -83719 -134486 -39697
15852 -39697 -49222 -1344 104929 355916 575261 573683 229780 3269 -129111 -30416 116607
15841 116607 -124180 -220313 -144617 103301 91846 -29294 -57297 37933 -1221 9100 -29606
15830 -29606 -69596 -300181 -443343 -295174 -19918 41113 116957 283192 123278 27747
15820 27747 40567 71991 115735 53995 -45670 -134286 -292112 -174994 -63536 42192 165954
15809 165954 65610 -154835 -126166 -90234 -127740 -252768 8120 52092 -13978 5970 50531
15798 50531 132924 146112 167194 151283 -81915 -365444 -346077 -180915 -85928 -39264 85899
$$ packed form
15874c4997J72402J2203l1847J46172j66546O6551N6379j80671L4276K53375K12
15863C27509k52259j42411P8728l7353r1558Q6221Q7011m7226r2381n0767R4789
15852c9697r525M7878J06273K50987K19345j578l43903k26511j32380R8695J47023
15841A16607k40787r6133P5696K47918j1455j21140k8003R5230l9154J0321l8706
15830b9606l9990k30585j43162J48169K75256O1031P5844J66235j59914r5531
15820B7747J2820L1424M3744o1740r9665q8616j57826J17118J11458J05728J23762
15809A65954j00344k20445K8669L5932l7506j25028K60888M3972o6070J9948M4561
15798E0531Q2393J3188K1082j5911k33198k83529J9367J65162R4987M6664J25163
$$ plain form
15787 85899 105908 44570 -84686 -3141 36638 -73896 -123219 -19834 -126461 -242538 -175551
15776 -175551 -259168 -148729 -69819 21156 45254 90546 -79403 -28415 -48439 -16455 -176604
15765 -176604 -271604 -191958 -86705 131112 103445 3556 -86215 37734 272603 351430 391068
15754 391068 221037 75930 88593 104016 173190 178893 253717 357981 419922 230050 34323
15743 34323 -59184 -161668 -170338 -67572 62293 130200 28921 -213936 -172529 79144 110821
15732 110821 -11557 14837 154881 22630 170869 202830 102683 73052 75272 221073
15722 221073 214929 206269 182522 147581 180056 199099 -41650 14461 125027 24770 -159775
15711 -159775 -66482 -24477 -71176 -124177 -65289 97371 183133 422592 419644 326410 376955
$$ packed form
15787H5899K0009o1338j29256Q1545L9779j10534m9323J03385j06627j16077O6987
15776a75551q3617J10439P8910R0975K4098M5292j69949N0988k0024L1984j60149
15765a76604r5000P9646J05253K17817k7667r9889q9771J23949K34869P8827L9638
15754C91068j70031j45107J2663J5423O9174N703P4824J04264O1941j89872j95727
15743C4323r3507j02484q670J02766J29865O7907j01279k42857M1407K51673L1677
15732A10821j22378K6394J40044j32251J48239L1961j00147k9631K220J45801
15722B21073o144q660k3747l4941L2475J9043k40749N6111J10566j00257j84545
15711a59775R3293M2005m6699n3001N8888J62660Q5762K39459k948r3234N0545
$$ plain form
15700 376955 356748 253162 152177 20745 74314 241703 355732 372151 505605 430880
15690 430880 179946 86260 -25358 -100891 -109944 4920 98129 80200 104385 117251 79338
15679 79338 116848 52017 151339 146598 -68113 -36979 94374 197036 316161 275962 140941
15668 140941 3663 111663 183796 33648 -196440 -244127 25836 106069 70653 52540
15658 52540 -61147 -139853 -92575 2722 7782 88073 52745 20749 -105964 -131913 -46884
15647 -46884 8901 219160 415713 331555 189174 182204 288489 401293 518343 469145 404764
15636 404764 274285 361439 306582 150895 8644 -41292 -34466 -159610 36175 288846
15626 288846 289357 338489 363229 214397 196899 45249 120756 144927 50013 185733 57555
$$ packed form
15700C76955k0207j03586j00985j31432N3569J67389J14029J6419J33454p4725
15690D30880k50934r3686j11618p5533r053J14864R3209j7929K4185J2866l7913
15679G9338L7510o4831R9322m741k14711L1134J31353J02662J19125m0199j35021
15668A40941j37278J08000P2133j50148k30088m7687K69963Q0233l5416j8113
15658E2540j13687p8706M7278R5297N060Q0291l5328l1996j26713k5949Q5029
15647d6884N5785K10259J96553q4158j42381o970J06285J12804J17050m9198o4381
15636D04764j30479Q7154n4857j55687j42251m9936O826j25144J95785K52671
15626B88846N11M9132K4740j48832j7498j51650P5507K4171r4914J35720j28178
$$ plain form
15615 57555 8896 -93628 64159 178615 220841 194105 356844 524341 340663 180240
15605 180240 131401 239367 246977 309232 273813 171149 -8498 -14587 93076 135196 184919
15594 184919 291766 317977 229357 209584 320454 303568 123006 75486 19241 -92067 -149953
15583 -149953 25677 242107 383396 433046 418612 283752 99845 5191 -33848 101084
15573 101084 238637 347490 433501 436103 390040 393108 375754 459152 408718 597732 539577
15562 539577 354895 384381 682749 685192 547603 458274 268956 287823 280213 388925 464319
15551 464319 492231 350053 242470 132129 437642 703936 495282 343389 430068 470230
15541 470230 349842 173803 196147 498544 551095 391845 299324 212652 193352 346793
$$ packed form
15615E7555m8659j02524J57787J14456M2226k6736J62739J67497j83678j60423
15605A80240m8839J07966P610O2255l5419j02664j79647o089J07663M2120M9723
15594A84919J06847K6211q8620j9773J10870j6886j80562m7520n6245j11308n7886
15583a49953J75630K16430J41289M9650j4434j34860j83907r4654l9039J34932
15573A01084J37553J08853Q6011K602m6063L068j7354Q3398n0434J89014n8155
15562E39577j84682K9486K98368K443j37589q9329j89318J8867p610J08712P5394
15551D64319K7912j42178j07583j10341L05513K66294k08654j51893Q6679M0162
15541D70230j20388j76039K2344L02397N2551j59250r2521q6672j9300J53441
$$ plain form
15531 346793 368913 246213 283228 271262 108299 64517 131434 46788 165731 405610 450212
15520 450212 662487 481688 412813 348621 435373 592674 539167 387814 278701 350861
15510 350861 240896 207552 155869 109665 -22520 76635 155751 291435 448595 539981 659904
15499 659904 703786 560641 554232 684641 713103 721527 553530 524413 499834 595212 562187
15488 562187 511946 505875 573710 649708 521257 501680 755836 620786 589559 650490 663299
15477 663299 690368 549795 482047 643292 787782 804860 871627 775727 626320 590239 743015
15466 743015 1032537 1128716 1055005 886969 718524 699583 686470 685598 596114 514527 588721
15455 588721 488386 418467 509546 612987 721768 1012712 976262 836796 866137 990088
$$ packed form
15531C46793K2120j22700L7015j1966j62963m3782O6917q4646J18943K39879M4602
15520D50212K12275j80799o8875o4192Q6752J57301n3507j51353j09113P2160
15510C50861j09965l3344n1683m6204j32185R9155P9116J35684J57160R1386J19923
15499F59904M3882j43145o409J30409K8462Q424j67997k9117k4579R5378l3025
15488E62187n0241o071O7835P5998j28451j9577K54156j35050l1227O0931J2809
15477F63299K7069j40573o7748J61245J44490J7078O6767r5900j49407l6081J52776
15466G43015K89522R6179p3711j68036j68445j8941j3113q72q9484q1587P4194
15455E88721j00335o9919R1079J03441J08781K90944l6450j39466K9341J23951
$$ plain form
15445 990088 1002086 785157 762054 912447 877178 799852 843989 790754 801642 805664 882311
15434 882311 961188 958010 1134493 1089149 813060 845658 999826 1044352 1100291 1107993 1296270
15423 1296270 1550879 1449807 1092142 810350 860371 982713 913615 785010 913771 972889
15413 972889 922409 972172 842178 858295 803312 950038 974156 1033538 1146276 1405488 1343819
15402 1343819 1206878 1050316 1068579 1099332 1221931 1124658 1129224 1293444 1373072 1367964 1403899
15391 1403899 1369906 1247395 1220360 1390877 1549746 1356607 1535962 1704562 1735832 1846596
15381 1846596 1626632 1591106 1627685 1568430 1808998 1792538 1931749 1954448 1960238 2134585 2205028
15370 2205028 2320504 2317910 2325994 2256553 2046436 2008904 2045305 2052546 2202144 2383853 2570898
$$ packed form
15445I90088J1998k16929k3103J50393l5269p7326M4137n3235J0888M022P6647
15434H82311P8877l178J76483m5344k76089L2598J54168M4526N5939P702J88277
15423A296270K54609j01072l57665k81792N0021J22342o9098j28605J28761N9118
15413I72889n0480M9763j29994J6117n4983J46726K4118N9382J12738K59212o1669
15402A343819j36941j56562J8263L0753J22599r7273M566J64220P9628n108L5935
15391A403899l3993j22511k7035J70517J58869j93139J79355J68600L1270J10764
15381A846596k19964l5526L6579n9255K40568j6460J39211K2699N790J74347P0443
15370B205028J15476k594Q084o9441k10117l7532L6401P241J49598J81709J87045
$$ plain form
15359 2570898 2527753 2455906 2391337 2227160 2274884 2487081 2547378 2576613 2589760 2519322 2513443
15348 2513443 2487835 2574644 2889514 3007930 3057477 2998590 2800932 2606591 2604038 2746926
15338 2746926 3095544 3198308 3496889 3782592 3594053 3420277 3536008 3699598 3814529
15329 3814529 4120507 4081440 4245243 4542667 4661412 4596104 4514111 4630273 4866314 5081037
15319 5081037 5321385 5455428 5403618 5233969 5323117 5514112 5536076 5718372 5833456 6088038
15309 6088038 6573360 6742812 6789817 7060922 7331282 7413386 7625854 7871089 7839425 7957732
15299 7957732 8415703 8915859 9358980 9647065 9854434 10210852 10465478 10649718 10894843
15290 10894843 11157448 11750001 12224404 12584819 13057678 13280743 13618093 14087553 14807092
$$ packed form
15359B570898m3145p1847o4569j64177M7724K12197O0297K9235J3147p0438n879
15348B513443k5608Q6809L14870J18416M9547n8887j97658j94341k553J42888
15338B746926L48618J02764K98581K85703j88539j73776J15731J63590J14931
15329C814529L05978l9067J63803K97424J18745o5308q1993J16162K36041K14723
15319E081037K40348J34043n1810j69649Q9148J90995K1964J82296J15084K54582
15309F088038M85322J69452M7005K71105K70360Q2104K12468K45235l1664J18307
15299G957732M57971N00156M43121K88085K07369L56418K54626J84240K45125
15290A0894843K62605N92553M74403L60415M72859K23065L37350M69460P19539
$$ plain form
15281 14807092 15483536 15962637 16578363 16900358 17391073 18107851 18778651 19203739 19593024
15272 19593024 20111651 20862050 21375409 21787079 22149923 22543708 22859117 23117442 23444043
15263 23444043 23731265 24272500 24705531 24921901 25151722 25438035 25673278 25915544 26027476
15254 26027476 26151756 26279277 26384889 26507398 26401570 26387058 26424391 26571397 26699960 26672397
15244 26672397 26680206 26824932 26813179 26662481 26700221 26772216 26336621 26102955 25878669 25678492
15234 25678492 25659539 25443217 25121662 24788224 24740259 24447094 24151968 23810496 23717402 23639028
15224 23639028 23484470 23158898 22856997 22432412 22358600 22192948 21886356 21894064 21763415 21696451
15214 21696451 21529286 21250071 21167584 21048989 20974241 21093701 21187716 21392525 21610549 21555387
$$ packed form
15281A4807092O76444M79101O15726L21995M90715P16778O70800M25088L89285
15272A9593024N18627P50399N13359M11670L62844L93785L15409K58325L26601
15263B3444043K87222N41235M33031K16370K29821K86313K35243K42266J11932
15254B6027476J24280J27521J05612J22509j05828j4512L7333J47006J28563k7563
15244B6672397P809J44726j1753j50698L7740P1995m35595k33666k24286k00177
15234B5678492j8953k16322l21555l33438m7965k93165k95126l41472r3094p8374
15224B3639028j54558l25572l01901m24585p3812j65652l06592P708j30649o6964
15214B1696451j67165k79215q2487j18595p4748J19460R4015K04809K18024n5162
$$ plain form
15204 21555387 21463644 21598931 21801979 21991377 22142826 22284277 22415935 22698721 22939180
15195 22939180 23144608 23383149 23766643 24087468 24415963 24571957 24802032 25028783 25358899
15186 25358899 25985801 26549252 27026361 27436895 27743396 28258958 28819264 29472174 29884134
15177 29884134 30245485 30816557 31280325 31849086 32079957 32509857 32814307 33262989 33745252
15168 33745252 33907122 34262020 34691887 35108495 35539754 35954987 36208416 36363634 36453972
15159 36453972 36608971 36712716 36834947 36968091 37142059 37433872 37491421 37307872 37172727
15150 37172727 37229887 37379263 37536530 37574601 37633536 37623808 37544926 37357555 37330427 37192706
15140 37192706 36968117 36633828 36335121 36161112 35872589 35806810 35620741 35333577 34995617
$$ packed form
15204B1555387r1743J35287K03048J89398J51449J41451J31658K82786K40459
15195B2939180K05428K38541L83494L20825L28495J55994K30075K26751L30116
15186B5358899O26902N63451M77109M10534L06501N15562N60306O52910M11960
15177B9884134L61351N71072M63768N68761K30871M29900L04450M48682M82263
15168C3745252J61870L54898M29867M16608M31259M15233K53429J55218R0338
15159C6453972J54999J03745J22231J33144J73968K91813N7549j83549j35145
15150C7172727N7160J49376J57267L8071N8935r728p8882j87371k7128j37721
15140C7192706k24589l34289k98707j74009k88523o5779j86069k87164l37960
$$ plain form
15131 34995617 34374551 34004373 33778859 33390887 32863960 32327791 31955528 31617276 31117583
15122 31117583 30604568 30065466 29411979 28889987 28383457 27621568 27028550 26557983 25954371
15113 25954371 25474161 24831854 24416302 23996697 23520521 23105787 22486632 21838536 21313143
15104 21313143 20899438 20324396 19891826 19589552 19138454 18784115 18689215 18361197 17908912
15095 17908912 17484985 16998200 16576054 16381495 16259261 15999617 15597285 15084749 14828400
15086 14828400 14558350 14236418 14028765 13585279 13118595 12961920 12765032 12511767 12303585
15077 12303585 11924049 11520187 11264518 11346669 11350500 11091099 10837031 10762587 10337281 9854999
15067 9854999 9733835 9566660 9440283 9542404 9527808 9228257 9063611 8787704 8630304 8416885
$$ packed form
15131C4995617o21066l70178k25514l87972n26927n36169l72263l38252m99693
15122C1117583n13015n39102o53487n21992n06530p61889n93018m70567o03612
15113B5954371m80210o42307m15552m19605m76176m14734o19155o48096n25393
15104B1313143m13705n75042m32570l02274m51098l54339r4900l28018m52285
15095A7908912m23927m86785m22146j94559j22234k59644m02332n12536k56349
15086A4828400k70050l21932k07653m43486m66684j56675j96888k53265k08182
15077A2303585l79536m03862k55669Q2151L831k59401k54068p4444m25306m82282
15067I854999j21164j67175j26377J02121j4596k99551j64646k75907j57400k13419
$$ plain form
15057 8416885 8198050 8193749 8113026 7877158 7651635 7582031 7266170 7183338 7104198 7157859 6929081
15046 6929081 6650897 6515935 6585490 6703160 6364879 6175765 6152200 6068924 6053517 6121543
15036 6121543 6114944 5911259 5672842 5550140 5433258 5300577 5315661 5399244 5370802 5219103
15026 5219103 5027802 4781037 4659107 4557976 4579741 4714036 4601159 4397371 4287824 4260588
15016 4260588 4098802 4222174 4239338 4117360 4119703 4151332 4062904 3894949 3728633 3694482
15006 3694482 3553675 3595147 3609711 3530517 3417172 3432640 3627868 3667455 3597478 3446008
14996 3446008 3195630 3274359 3210587 3155738 3116499 3120751 3107519 2966588 2807633 2782512 2921425
14985 2921425 2981163 2932533 2901404 2653880 2616563 2659154 2592886 2632926 2870469 3035915 2817704
$$ packed form
15057H416885k18835m301q0723k35868k25523o9604l15861q2832p9140N3661k28778
15046F929081k78184j34962O9555J17670l38281j89114k3565q3276j5407O8026
15036F121543o599k03685k38417j22702j16882j32681J5084Q3583k8442j51699
15026E219103j91301k46765j21930j01131K1765J34295j12877k03788j09547k7236
15016D260588j61786J23372J7164j21978K343L1629q8428j67955j66316l4151
15006C694482j40807M1472J4564p9194j13345J5468J95228L9587o9977j51470
14996C446008k50378P8729o3772n4849l9239M252j3232j40931j58955k5121J38913
14985B921425N9738m8630l1129k47524l7317M2591o6268M0040K37543J65446k18211
$$ plain form
14974 2817704 2516131 2425319 2454929 2300307 2178342 2148855 2193872 2353469 2365190 2198896
14964 2198896 1989170 2001158 2055213 2174391 2144497 2105385 2169765 2100664 2092552 2047822 2123271
14953 2123271 2139236 2189631 2151017 2158935 2114378 2009982 1999280 1968503 1654381 1688396 1803076
14942 1803076 1972006 1898102 1850107 1933625 1725596 1447614 1433682 1662427 1661614 1734736 1817042
14931 1817042 1855930 1745831 1536956 1315074 1249489 1191098 1183589 1403487 1573339 1601834
14921 1601834 1414224 1318256 1370671 1218187 1257800 1509093 1600161 1460774 1133870 1110246
14911 1110246 1249232 1532711 1534045 1344895 1230337 1175680 1258449 1154516 1067238 1001190
14901 1001190 988515 1210596 1292136 1280391 1282703 1286761 1278580 1378405 1324896 1297831 1179496
$$ packed form
14974B817704l01573r0812K9610j54622j21965k9487M5017J59597J1721j66294
14964B198896k09726J1988N4055J19178k9894l9112O4380o9101q112m4730P5449
14953B123271J5965N0395l8614P918m4557j04396j0702l0777l14122L4015J14680
14942A803076J68930p3904m7995Q3518k08029k77982j3932K28745q13P3122Q2306
14931A817042L8888j10099k08875k21882o5585n8391p509K19898J69852K8495
14921A601834j87610r5968N2415j52484L9613K51293R1068j39387l26904k3624
14911A110246J38986K83479J334j89150j14558n4657Q2769j03933q7278o6048
14901A001190j2675K22081Q1540j1745K312M058q181R9825n3509k7065j18335
$$ plain form
14890 1179496 1149490 1233242 1227031 1165260 1139886 1188687 1177156 1078272 1014535 984202 913399
14879 913399 1020780 926291 990227 958556 936506 1071176 1046230 1119934 1248081 1155873 966247
14868 966247 679321 541780 643045 799485 811820 1101341 934058 805195 713628 663390
14858 663390 708925 514339 662756 867569 837479 897269 888711 873727 945512 1071094 1082134
14847 1082134 869290 652142 724594 766571 760238 934909 990551 1024968 967743 870463 879220
14836 879220 715592 490667 479460 466705 521503 465396 443631 442240 616351 925976 978879
14825 978879 786436 793139 692762 755819 817045 639350 745089 738933 577260 622276 744370
14814 744370 854342 914229 1040206 935198 806268 653558 538281 541314 499248 462380
$$ packed form
14890A179496l0006Q3752o211o1771k5374M8801j1531r8884o3737l0333p0803
14879I13399J07381r4489O3936l1671k2050J34670k4946P3704J28147r2208j89626
14868I66247k86926j37541J01265J56440J2335K89521j67283j28863r1567n0238
14858F63390M5535j94586J48417K04813l0090N9790q558j4984P1785J25582J1040
14847A082134k12844k17148P2452M1977o333J74671N5642L4417n7225r7280Q757
14836H79220j63628k24925j1207j2755N4798n6107k1765j391J74111L09625N2903
14825I78879j92443O703j00377O3057O1226j77695J05739o156j61673M5016J22094
14814G44370J09972N9887J25977j05008j28930j52710j15277L033m2066l6868
$$ plain form
14804 462380 302181 304335 422934 287515 319368 316772 317751 392600 413288 586440 522570
14793 522570 535725 635414 552882 428759 427990 543583 420128 315353 282775 420642 415930
14782 415930 573236 757519 635899 588612 597780 687769 608412 747903 969790 1057071 968733
14771 968733 796217 642990 555378 549056 511037 592424 846734 942677 622593 471104 482872
14760 482872 654455 562211 463961 343669 320934 353846 430312 624033 618762 573166 709503
14749 709503 643260 713497 574160 440590 429027 325397 359735 246995 449137 573399
14739 573399 475118 465280 466027 382968 246828 281147 354082 340941 373058 511845 461933 537166
14727 537166 518699 425027 515112 580467 585150 615014 604342 566828 693096 685519 599908 669772
$$ packed form
14804D62380j60199K154J18599j35419L1853k596R79P4849K0688J73152o3870
14793E22570J3155R9689q2532j24123p69J15593j23455j04775l2578J37867m712
14782D15930J57306J84283j21620m7287R168Q9989p9357J39491K21887Q7281q8338
14771I68733j72516j53227q7612o322l8019Q1387K54310R5943l20084j51489J1768
14760D82872J71583r2244r8250j20292k2735L2912P6466J93721n271m5596J36337
14749G09503o6243P0237j39337j33570j1563j03630L4338j12740K02142J24262
14739E73399r8281r838P47q3059j36140L4319P2935j3141L2117J38787m9912P5233
14727E37166j8467r3672R0085O5355M683K9864j0672l7514J26268p577q5611O9864
$$ plain form
14715 669772 616669 486749 309514 163467 59058 -52713 -68015 -11196 129698 16520
14705 16520 109483 170681 93489 213998 70352 177528 176238 269635 244306 317458 342032
14694 342032 250702 297739 247852 371306 408933 425995 492492 526038 551795 565010 520490
14683 520490 495403 597895 510851 521415 494766 536903 573011 364602 414786 408319 128475
14672 128475 -187023 -392313 -333960 -152347 256021 411304 410032 446132 604645 506082
14662 506082 378215 478299 540725 493070 472574 481523 263667 264724 258400 349898 327607
14651 327607 336755 299690 104596 158403 241956 278153 155567 199623 243017 -9130 24623
14640 24623 171355 223814 328057 411721 516888 384901 172214 33222 96929 107373
$$ packed form
14715F69772n3103j29920j77235j46047j04409j11771j5302N6819J40894j13178
14705A6520R2963O1198p7192J20509j43646J07176j290R3397k5329P3152K4574
14694C42032r1330M7037m9887J23454L7627J7062O6497L3546K5757J3215m4520
14683E20490k5087J02492q7044J0564k6649M2137L6108k08409N0184o467k79844
14672A28475l15498k05290N8353J81613M08368J55283j272L6100J58513r8563
14662E06082j27867J00084O2426m7655k0496Q949k17856J057o324R1498k2291
14651C27607R148l7065j95094N3807Q3553L6197j22586M4056M3394k52147L3753
14640B4623J46732N2459J04243Q3664J05167j31987k12687j38992O3707J0444
$$ plain form
14630 107373 85171 298309 373858 101402 15402 -81921 -56051 -33258 52216 326187 545735
14619 545735 543633 397764 406527 502528 455237 534471 451014 354420 189198 140834 183385
14608 183385 269208 280581 135341 176798 120206 -20256 -73670 -38553 -15725 -91982 -9064
14597 -9064 168586 52655 153861 191302 37494 -125629 -45737 -65060 -64714 95875 192121
14586 192121 2830 -20206 284941 200195 237317 220195 330753 370700 -23832 -112793 3343
14575 3343 160710 247268 264724 227498 145104 212350 478594 439868 374098 373662 306698 296159
14563 296159 242938 209479 419992 451776 319765 163112 312242 291785 202060 42217
14553 42217 71436 112026 -36242 -117571 85070 115641 45305 101967 165115 253330 429993
$$ packed form
14630A07373k2202K13138P5549k72456q6000r7323K5870K2793Q5474K73971K19548
14619E45735k102j45869Q763R6001m7291P9234q3457r6594j65222m8364M2551
14608A83385Q5823J1373j45240M1457n6592j40462n3414L5117K2828p6257Q2918
14597i064J77650j15931J01206L7441j53808j63123P9892j9323L46J60589R6246
14586A92121j89291k3036L05147q4746L7122j7122J10558L9947l94532q8961J16136
14575C343J57367Q6558J7456l7226q2394O7246K66244l8726o5770m36o6964j0539
14563B96159n3221l3459K10513L1784j32011j56653J49130k0457q9725j59843
14553D2217K9219M0590j48268q1329K02641L0571p0336N6662O3148Q8215J76663
$$ plain form
14542 429993 356290 195931 238144 193216 163331 221733 144040 35674 93143 82176 52679
14531 52679 -28258 -36809 29480 150506 39744 -13867 -52776 -133140 -32793 154778 170205
14520 170205 206256 120065 261556 207102 157509 183659 220582 62439 -41868 -24743 -20210
14509 -20210 127458 149042 147758 43123 -52497 -109081 -77548 -48944 -105266 -28942 -22649 -100791
14497 -100791 -58709 206926 83505 85577 73163 213276 314308 235166 296192 198757 228041
14486 228041 91682 138567 122601 126019 146231 188448 59743 77121 258456 279339 377365
14475 377365 281705 257425 404248 298233 167212 195931 -13360 -133919 -14184 -40970
14465 -40970 -28017 11840 12118 81658 125823 53822 -129103 -125428 141974 364407 525241
$$ packed form
14542D29993p3703j60359M2213m4928k9885N8402p7693j08366N7469j0967k9497
14531E2679q0937q551O6289J21026j10762n3611l8909q0364J00347J87571J5427
14520A70205L6051q6191J41491n4454m9593K6150L6923j58143j04307J7125M533
14509b0210J47668K1584j284j04635r5620n6584L1533K8604n6322P6324O293p8142
14497a00791M2082K65635j23421K072j2414J40113J01032p9142O1026r7435K9284
14486B28041j36359M6885j5966L418K0212M2217j28705J7378J81335K0883R8026
14475C77365r5660k4280J46823j06015j31021K8719k09291j20559J19735k6786
14465d0970J2953L9857K78O9540M4165p2001j82925L675K67402K22433J60834
$$ plain form
14454 525241 476178 270655 181013 47789 -66254 -40863 -36326 -79270 -86146 -127453 55183
14443 55183 190378 220308 85516 12070 88045 6967 74523 70634 189975 265657 210087
14432 210087 266647 226916 382779 216967 38213 85939 -33590 22620 35618 117651 98657
14421 98657 67268 5455 -30523 182641 277932 200140 33629 -143535 -135855 47693 168462
14410 168462 90182 -150186 -200950 -173146 -786 128739 54947 63172 160922 211696 112395
14399 112395 147467 271606 204908 198339 187710 172274 46436 78944 41637 80540 -114403
14388 -114403 -355880 -459728 -429958 -321552 -207802 -107544 -7178 -195003 -117687 -21879
14378 -21879 -33679 -262116 -260991 -131916 -132518 -20846 203368 303148 310637 160041 -17819
$$ packed form
14454E25241m9063k05523q9642j33224j14043K5391M537m2944o876m1307J82636
14443E5183J35195K9930j34792p3446P5975q1078O7556l889J19341P5682n5570
14432B10087N6560l9731J55863j65812j78754M7726j19529N6210J2998Q2033j8994
14421I8657l1389o1813l5978K13164R5291p7792j66511j77164P680J83548J20769
14410A68462p8280k40368n0764K7804J72360J29525p3792Q225R7750N0774r9301
14399A12395L5072J24139o6698o569j0629j5436j25838L2508l7307L8903j94943
14388a14403k41477j03848K9770J08406J13750J00258J00366j87825P7316R5808
14378b1879j1800k28437J125J29075o02J11672K24214R9780P489j50596j77860
$$ plain form
14367 -17819 -198383 -104090 18069 130965 132085 241030 300035 235612 357794 489737 635028
14356 635028 474278 325857 130148 58058 86446 -5744 -65997 -142466 -186243 -66860 22192
14345 22192 44018 -154536 -433381 -242416 68054 96064 74275 106640 135637 -285218 -205637
14334 -205637 74620 121935 135877 185410 8177 -47705 -4003 36668 -38768 3578 67700
14323 67700 144563 112725 86362 263935 282656 174538 123496 120376 56795 188012 268837
14312 268837 235602 169942 121032 117852 -56687 -87413 -38581 189965 29924 -78379 110651
14301 110651 56572 -183636 -123035 143576 149603 41003 -14943 65998 70459 20365 94892
14290 94892 301114 302402 193338 169508 247800 301709 139628 104276 206964 111907 93937
$$ packed form
14367a7819j80564R4293J22159J12896J120J08945N9005o4423J22182J31943J45291
14356F35028j60750j48421j95709p2090K8388r2190o0253p6469m3777J19383Q9052
14345B2192K1826j98554k78845J90965L10470K8010k1789L2365K8997m20855P9581
14334b05637K80257M7315J3942M9533j77233n5882M3702M0671p5436M2346O4122
14323F7700P6863l1838k6363J77573J8721j08118n1042l120o3581J31217Q0825
14312B68837l3235o5660m8910l180j74539l0726M8832K28546j60041j08303J89030
14301A10651n4079k40208O0601K66611O027j08600n5946Q0941M461n0094P4527
14290I4892K06222J288j09064k3830P8292N3909j62081l5352J02688r5057j7970
$$ plain form
14279 93937 118897 193849 325941 425062 443449 351743 312360 227606 100449 194590 -41744
14268 -41744 -58365 -107013 -213668 -174733 -171304 -223866 -112714 25273 121088 137701 164578
14257 164578 118778 -117973 -199963 -215989 -320855 -359340 -148169 -121262 -92609 -307015 -389349
14246 -389349 -250901 19938 44220 109970 -47647 -139699 17291 37138 -252497 -104071
14236 -104071 135190 232393 45039 -52030 6026 70060 105134 172324 150275 28981 46049
14225 46049 -71284 -63593 155854 156022 119643 -27110 90747 48992 -182897 -242358 -305851
14214 -305851 -431712 -282234 -134160 -3319 39618 22146 89171 88501 32772 330110 380477
14203 380477 217206 191852 199644 142235 103349 225800 274873 396692 315212 115663 118164
$$ packed form
14279I3937K4960P4952J32092R9121J8387r1706l9383q4754j27157R4141k36334
14268d1744j6621m8648j06655L8935L429n2562J11152J37987R5815J6613K6877
14257A64578m5800k36751q1990j6026j04866l8485K11171K6907K8653k14406q2334
14246c89349J38448K70839K4282O5750j57617r2052J56990J9847k89635J48426
14236a04071K39261R7203j87354r7069N8056O4034L5074O7190k2049j21294J7068
14225D6049j17333P691K19447J68l6379j46753J17857m1755k31889n9461o3493
14214c05851j25861J49478J48074J30841M2937j7472O7025o70n5729K97338N0367
14203C80477j63271k5354P792n7409l8886J22451M9073J21819q1480j99549K501
$$ plain form
14192 118164 152766 31661 90854 52886 -11260 217909 122520 -91967 -95932 -106780 -19344
14181 -19344 589 16878 65662 58095 29988 -11430 -128779 -127310 167653 289471 139557
14170 139557 80530 86451 -58645 -194109 -167089 -316133 -313915 -394598 -280775 -257409 -28457
14159 -28457 20762 -46178 33976 -65592 -125968 -142447 -57091 -109318 -177086 -49631 142200
14148 142200 265107 98977 5170 43043 124479 73664 147240 136289 177097 -7806 -32345
14137 -32345 -157845 -178348 -175324 -61431 31091 4677 209721 379686 305834 237846 18781
14126 18781 -107698 -96938 -153000 -207588 -249041 -88024 27338 -196339 -111510 47587 -53848
14115 -53848 93344 214459 399192 432002 234242 82097 277217 403330 358330 215913
$$ packed form
14192A18164L4602j21105N9193l7968o4146K29169r5389k14487l965j0848Q7436
14181a9344J9933J6289M8784p567k8107m1418j17349J469K94963J21818j49914
14170A39557n9027N921j45096j35464K7020j49044K218q0683J13823K3366K28952
14159b8457M9219o6940Q0154r9568o0376j6479Q5356n2227o7768J27455J91831
14148A42200J22907j66130r3807L7873Q1436n0815P3576j0951M0808j84903k4539
14137c2345j25500k0503L024J13893R2522k6414K05044J69965p3852o7988k19065
14126A8781j26479J0760n6062n4588m1453J61017J15362k23677Q4829J59097j01435
14115e3848J47192J21115J84733L2810j97760j52145J95120J26113m5000j42417
$$ plain form
14105 215913 80250 28348 -120593 -33204 3256 381403 381253 210635 159418 91905 137516
14094 137516 224194 147691 176587 196949 261992 245028 255219 122038 2816 109944 321005
14083 321005 473417 356163 331809 276076 247646 192399 105829 130537 297521 263950 173303
14072 173303 157544 74058 68182 17243 16808 86518 3176 -77805 -8142 -9406 55839 77246
14060 77246 188639 60685 -24195 -150676 -127074 -250450 -279268 -200666 -161595 -40127 -2736
14049 -2736 129029 245046 223256 101412 47280 60231 -59227 9733 -11441 16951 6776
14038 6776 101195 67976 62318 -48172 -69229 98814 263085 306605 201151 69450 -5026
14027 -5026 181102 141086 236947 94568 88868 249044 294949 237822 191476 286482 265824
$$ packed form
14105B15913j35663n1902j48941Q7389L6460L78147j50j70618n1217o7513M5611
14094A37516Q6678p6503K8896K0362O5043j6964J0191j33181j19222J07128K11061
14083C21005J52412j17254k4354n5733k8430n5247q6570K4708J66984l3571r0647
14072A73303j5759q3486n876n0939m35O9710q3342q0981O9663j264O5245K1407
14060G7246J11393j27954q4880j26481K3602j23376k8818P8602L9071J21468L7391
14049b736J31765J16017k1790j21844n4132J2951j19458O8960k1174K8392j0175
14038F776R4419l3219n658j10490k1057J68043J64271M3520j05454j31701p4476
14027e026J86128m0016R5861j42379n700J60176M5905n7127m6346R5006k0658
$$ plain form
14016 265824 194521 -13835 -26921 145334 168115 14280 -32399 -85937 45877 164880
14006 164880 180083 -15203 -81296 175595 476576 380038 163309 77171 -38574 116114
13996 116114 242360 467568 415918 415543 381489 244612 185925 208672 285819 204344 181844
13985 181844 151210 97827 106896 136571 192698 213794 253982 347102 373669 97330 -47118
13974 -47118 114524 158107 124519 115137 157000 333986 411827 437729 406495 325595 405883
13963 405883 559762 592186 480605 322847 327143 582278 547917 613160 610472 422757 490209
13952 490209 388242 175401 112101 275975 410064 408502 340415 208388 72073 3184
13942 3184 188600 162567 97649 209164 264548 126637 78843 174905 483431 550876 398676
$$ packed form
14016B65824p1303k08356j3086J72255K2781j53835m6679n3538J31814J19003
14006A64880J5203j95286o6093K56891L00981r6538k16729q6138j15745J54688
13996A16114J26246K25208n1650l75l4054j36877n8687K2747P7147q1475k2500
13985A81844l0634n3383R069K9675N6127K1096M0188R3120K6567k76339j44448
13974d7118J61642M3583l3588r382M1863J76986P7841K5902l1234q0900Q0288
13963D05883J53879L2424j11581j57758M296K55135l4361O5243k688j87715O7452
13952D90209j01967k12841o3300J63874J34089j562o8087j32027j36315o8889
13942C184J85416k6033o4918J11515N5384j37911m7794R6062L08526O7445j52200
$$ plain form
13931 398676 251659 -48336 14098 256176 385266 434224 599159 616605 620236 611729 452886
13920 452886 192236 141991 247622 270888 61540 -76105 21090 120456 -102787 -159718
13910 -159718 -88989 137819 314402 282987 91328 156826 66308 28989 -43733 65432 133036
13899 133036 480096 636136 643442 449930 442952 567180 487065 504163 438220 475317 472807
13888 472807 487434 351219 92797 354713 498982 452551 465090 527237 374380 201272
13878 201272 320694 515562 722505 666136 592842 727758 739153 516943 385405 476150
13868 476150 516132 710464 595386 524011 384206 492053 633319 656150 745398 793816
13858 793816 888657 1006480 914194 800673 686949 503977 337325 199343 226141 361959
$$ packed form
13931C98676j47017k99995O2434K42078J29090M8958J64935J7446L631q507j58843
13920D52886k60650n0245J05631K3266k09348j37645R7195R9366k23243n6931
13910a59718P0729K26808J76583l1415j91659O5498r0518l7319p2722J09165O7604
13899A33036L47060J56040P306j93512o978J24228q0115J7098o5943L7097k510
13888D72807J4627j36215k58422K61916J44269m6431J2539O2147j52857j73108
13878B01272J19422J94868K06943n6369p3294J34916J1395k22210j31538R0745
13868D76150L9982J94332j15078p1375j39805J07847J41266K2831Q9248M8418
13858G93816R4841J17823r2286j13521j13724j82972j66652j37982K6798J35818
$$ plain form
13848 361959 378057 554986 570269 356194 94936 281300 594115 745701 566868 364997
13838 364997 446598 532969 571337 658598 756992 767776 707052 674868 689029 641067 613965
13827 613965 522828 657280 636866 417057 396606 442346 742384 831138 834208 717373 513169
13816 513169 518051 374316 303069 235318 276821 317364 205537 416870 502041 599806 508243
13805 508243 312077 422301 533590 549695 634893 526570 587757 525823 624363 662185 506923
13794 506923 480654 562913 424628 307310 440531 654278 648840 543705 600260 606800 628028
13783 628028 692555 520051 320622 353362 312318 274218 222205 203318 101711 155647 282485
13772 282485 503129 602928 507438 444191 264184 290219 464248 567928 703265 659163
$$ packed form
13848C61959J6098J76929J5283k14075k61258J86364L12815J51586j78833k01871
13838C64997Q1601Q6371L8368Q7261R8394J0784o0724l2184J4161m7962k7102
13827F13965r1137J34452k0414k19809k0451M5740L00038Q8754L070j16835k04204
13816E13169M882j43735p1247o7751M1503M0543j11827K11333Q5171R7765r1563
13805E08243j96166J10224J11289J6105Q5198j08323O1187o1934R8540L7822j55262
13794E06923k6269Q2259j38285j17318J33221K13747n438j05135N6555O540K1228
13783F28028O4527j72504j99429L2740m1044l8100n2013j8887j01607N3936J26838
13772B82485K20644R9799r5490o3247j80007K6035J74029J03680J35337m4102
$$ plain form
13762 659163 422982 138686 52395 228802 371549 401257 284043 454979 433369 251146
13752 251146 314130 440824 433882 407219 357596 304454 396594 332847 178084 209880 275007
13741 275007 164660 119016 256669 300119 68700 218001 427879 442660 440541 624706
13731 624706 668207 603545 550827 639649 471148 370850 346544 215442 353647 263039 284626
13720 284626 324521 304264 409931 584408 737628 706259 623710 539625 584127 528526 388888
13709 388888 510245 720103 621365 659222 726700 585271 390126 459333 554382 483056 526260
13698 526260 644481 543390 416672 402808 595532 634333 460879 488789 557041 647729
13688 647729 719671 656068 625827 558378 613986 634757 517415 201794 255090 314919 599563
$$ packed form
13762F59163k36181k84296q6291J76407J42747K9708j17214J70936k1610j82223
13752B51146O2984J26694o942k6663m9623n3142R2140o3747j54763L1796O5127
13741B75007j10347m5644J37653M3450k31419J49301K09878J4781k119J84165
13731F24706M3501o4662n2718Q8822j68501j00298k4306j31102J38205r0608K1587
13720B84626L9895k0257J05667J74477J53220l1369q2549q4085M4502n5601j39638
13709C88888J21357K09858r8738L7857O7478j41429j95145O9207R5049p1326M3204
13698E26260J18221j01091j26718j3864J92724L8801j73454K7910O8252R0688
13688F47729P1942o3603l0241o7449N5608K0771j17342l15621N3296N9829K84644
$$ plain form
13677 599563 531744 543077 471886 378808 366912 591230 659459 504165 497216 634709 646341
13666 646341 513044 384283 259220 293360 408410 451440 553802 574729 516620 593047
13656 593047 564212 574323 749161 868277 958568 1030069 907571 970069 890348 902078 943406
13645 943406 814369 878845 1013617 944924 812070 868867 820278 557715 450138 629146
13635 629146 794435 974619 851789 707634 673893 653832 638273 713694 774898 818266 792327
13624 792327 771914 871425 769924 804794 710942 787901 778429 775846 809303 788986 748041 943938
13612 943938 1024250 968983 945612 939713 961954 953220 959050 925308 858441 1004054 1127490 1316491
13600 1316491 1369966 1218283 1117198 1043210 1060687 1114193 1212384 1162913 1099194 1092788 1187353
$$ packed form
13677E99563o7819J1333p1191r3078j1896K24318O8229j55294o949J37493J1632
13666F46341j33297j28761j25063L4140J15050M3030J02362K0927n8109P6427
13656E93047k8835J0111J74838J19116R0291P1501j22498O2498p9721J1730M1328
13645I43406j29037O4476J34772o8693j32854N6797m8589k62563j07577J79008
13635F29146J65289J80184j22830j44155l3741k0061j5559P5421O1204M3368k5939
13624G92327k0413R9511j01501L4870r3852P6959r472k583L3457k0317m0945J95897
13612I43938Q0312n5267k3371n899K2241q734N830l3742o6867J45613J23436J89001
13600A316491N3475j51683j01085p3988J7477N3506R8191m9471o3719o406R4565
$$ plain form
13589 1187353 1174735 1189404 1272032 1423353 1405492 1340196 1349575 1340544 1372975 1390634 1499397
13578 1499397 1516718 1358079 1341087 1363589 1436800 1436627 1704624 1759774 1554064 1528894 1741955
13567 1741955 1770618 1899035 2039001 2121083 2247128 2282919 2364354 2439362 2405278 2504830 2784121
13556 2784121 2876937 3061801 3309948 3515250 3664859 3928571 4148172 4275532 4452693 4746845
13546 4746845 4960434 5066173 5458868 5799887 6363494 7015270 7545286 8092144 8784916
13537 8784916 9738313 10558321 11337110 12269892 13445786 14616094 15675522 17048334 18530265
13528 18530265 19857503 21159811 22744045 24255072 25505143 26684072 27559414 28247265
13520 28247265 28727910 29135299 29265951 29020360 28521137 27890958 27261419 26631668 25894234
$$ packed form
13589A187353j2618J4669Q2628J51321j7861o5296R379r031L2431J7659J08763
13578A499397J7321j58639j6992K2502P3211j73K67997N5150k05710k5170K13061
13567A741955K8663J28417J39966Q2082J26045L5791Q1435P5008l4084R9552K79291
13556B784121R2816J84864K48147K05302J49609K63712K19601J27360J77161K94152
13546D746845K13589J05739L92695L41019N63607O51776N30016N46858O92772
13537H784916R53397Q20008P78789R32782J175894J170308J059428J372812J481931
13528A8530265J327238J302308J584234J511027J250071J178929Q75342O87851
13520B8247265M80645M07389J30652k45591m99223o30179o29539o29751p37434
$$ plain form
13511 25894234 25281530 24767815 24375227 24196368 24105298 24222237 24503695 24655267 24755332
13502 24755332 24999820 25031129 25032019 24926405 24953177 24905824 24639535 24440122 24479443 24535137 24699913
13491 24699913 25023816 25578569 25983935 26320900 26781728 26927538 26843502 26398806 25979597
13482 25979597 25240882 24233917 23384424 22462704 21477522 20515189 19926931 19422111 18839087
13473 18839087 18281502 17859815 17640817 17581337 17513032 17588213 17737091 17927426 18193906 18816620
13463 18816620 19506739 20148356 20779209 21620018 22824939 24038645 25412654 27130992 28996099
13454 28996099 31255775 33485172 36087650 39229388 42590543 46132175 49841484 53757832
13446 53757832 58172656 62464248 66806419 71190414 75193280 79175253 82585671 85550172
$$ packed form
13511B5894234o12704n13715l92588j78859r1070J16939K81458J51572J00065
13502B4755332K44488L1309Q90j05614K6772m7353k66289j99413L9321N5694J64776
13491B4699913L23903N54753M05366L36965M60828J45810q4036m44696m19209
13482B5979597p38715j006965q49493r21720r85182r62333n88258n04820n83024
13473A8839087n57585m21687k18998n9480o8305P5181J48878J90335K66480O22714
13463A8816620O90119O41617O30853Q40809J204921J213706J374009J718338J865107
13454B8996099K259676K229397K602478L141738L361155L541632L709309L916348
13446E3757832M414824M291592M342171M383995M002866L981973L410418K964501
$$ plain form
13438 85550172 87852243 89199772 89454565 88991765 87962717 86280132 83991099 81612269
13430 81612269 79305646 76951794 74817680 73045522 71834177 71099861 70647777 70252034
13422 70252034 69969003 69560744 69540949 69799550 70080448 70180498 70425749 70769023 71423696
13413 71423696 72434436 73725658 74994889 76694718 78801099 80822240 82474559 83927446
13405 83927446 85082335 85466943 84959488 84047700 82822456 81110345 79125984 77077113
13397 77077113 75262169 73528972 72250233 71432890 71237523 71629698 72721915 74377932
13389 74377932 76143159 77813402 79625153 81375430 82538054 83303129 83350950 82624137 81001255
13380 81001255 78792217 76232673 73336994 70014274 66879824 63787403 60866104 58074759
$$ packed form
13438H5550172K302071J347529K54793m62800j029048j682585k289033k378830
13430H1612269k306623k353852k134114j772158j211345p34316m52084l95743
13422G0252034k83031m08259j9795K58601K80898J00050K45251L43274O54673
13413G1423696J010740J291222J269231J699829K106381K021141J652319J452887
13405H3927446J154889L84608n07455r11788j225244j712111j984361k048871
13397G7077113j814944j733197j278739q17343j95367L92175J092217J656017
13389G4377932J765227J670243J811751J750277J162624P65075M7821p26813j622882
13380H1001255k209038k559544k895679l322720l134450l092421k921299k791345
$$ [...]
##END NTUPLES=NMR SPECTRUM
##END=
