##TITLE=Analysis number 321291
Compound Code ac 34541
Project Code adrs
Chemist Name acros
##JCAMPDX= 6.0         $$ Bruker NMR JCAMP-DX V2.0
##DATA TYPE= NMR SPECTRUM
##DATA CLASS= NTUPLES
##ORIGIN= Bruker BioSpin GmbH
##OWNER= nmr
$$ XWIN-NMR		Version 3.5
$$ Thu Aug  3 09:19:15 2006 GMT Daylight Time (UT+1h)  MAYBRIDGE\nmr@NMR_250MHZ
##.OBSERVE FREQUENCY= 250.131544655141
##.OBSERVE NUCLEUS= ^1H
##.ACQUISITION MODE= SIMULTANEOUS (DQD)
##.ACQUISITION SCHEME= undefined
##.AVERAGES= 16
##.DIGITISER RES= 18
##SPECTROMETER/DATA SYSTEM= dpx250
##.PULSE SEQUENCE= zg30
##.SOLVENT NAME= DMSO
##.SHIFT REFERENCE= (INTERNAL, DMSO, 0, 16.522)
##AUDIT TRAIL= $$ (NUMBER, WHEN, WHO, WHERE, WHAT)
$$ ##TITLE= Audit trail, XWIN-NMR		Version 3.5
$$ ##JCAMPDX= 5.01
$$ ##ORIGIN= Bruker BioSpin GmbH
$$ ##OWNER= nmr
$$ C:\u/data/dgb/nmr/ADRS/110/pdata/1/auditp.txt
$$ ##AUDIT TRAIL=  $$ (NUMBER, WHEN, WHO, WHERE, WHAT)
(   1,<2006-08-03 09:18:54.58 +100>,<MAYBRIDGE\nmr>,<NMR_250MHZ>,
      <created by zg, POWCHK disabled, PULCHK disabled
       configuration hash MD5:
       E2 DF 36 D8 04 B2 41 60 5A D7 A3 38 5A 4B D0 FE
       data hash MD5: 64K
       3B 1C 2E D4 1A AE F4 DB A6 FC F0 59 75 4E BC C8>)
(   2,<2006-08-03 09:19:07.02 +100>,<MAYBRIDGE\nmr>,<NMR_250MHZ>,
      <Start of raw data processing
       ef LB = 0.3 FT_mod = 6 PKNL = 1 SI = 32K 
       data hash MD5: 32K
       C5 60 8B 6B 71 AD C7 78 D1 EB A7 89 D2 E7 D0 9F>)
(   3,<2006-08-03 09:19:08.68 +100>,<MAYBRIDGE\nmr>,<NMR_250MHZ>,
      <apk 
       data hash MD5: 32K
       DE AD 18 C3 94 A6 E7 36 1D DC A5 1B 93 40 9F 97>)
(   4,<2006-08-03 09:19:09.39 +100>,<MAYBRIDGE\nmr>,<NMR_250MHZ>,
      <abs ABSG = 5 
       data hash MD5: 32K
       6D 07 08 8C 58 97 10 D7 D6 24 A1 FB C2 00 58 43>)
$$ ##END=
$$ 
$$ hash MD5
$$ CC 7C F1 BC 66 DE 5D D3 91 07 BA D9 3E 6F CD 5B
##$RELAX= 
##$RELAX= 
##$RELAX= 
##$RELAX= 
##$RELAX= 
##$RELAX= 
##$RELAX= 
$$ Bruker specific parameters
$$ --------------------------
##$DU= <C:\u>
##$EXPNO= 110
##$NAME= <ADRS>
##$PROCNO= 1
##$TYPE= <nmr>
##$USER= <dgb>
##$AMP= (0..31)
100 100 100 100 100 100 100 100 100 100 100 100 100 100 100 100 100 100 
100 100 100 100 100 100 100 100 100 100 100 100 100 100 
##$AQSEQ= 0
##$AQ_mod= 3
##$AUNM= <au_zg>
##$AUTOPOS= <5 >
##$BF1= 250.13
##$BF2= 250.13
##$BF3= 250.13
##$BF4= 250.13
##$BF5= 500.13
##$BF6= 500.13
##$BF7= 500.13
##$BF8= 500.13
##$BYTORDA= 1
##$CFDGTYP= 0
##$CFRGTYP= 5
##$CHEMSTR= <none>
##$CNST= (0..31)
1 1 145 1 1 1 1 1 1 1 1 1 1 1 1 1 1 1 1 1 1 1 1 1 1 1 1 1 1 1 1 1 
##$CPDPRG= <>
##$CPDPRG1= <>
##$CPDPRG2= <>
##$CPDPRG3= <>
##$CPDPRG4= <mlev>
##$CPDPRG5= <mlev>
##$CPDPRG6= <mlev>
##$CPDPRG7= <mlev>
##$CPDPRG8= <mlev>
##$CPDPRGB= <>
##$CPDPRGT= <>
##$D= (0..31)
0 1 0 0 0 0 0 0 0 0.06 0 0 0 0 0 0 0.0002 0 0 0 0 0 0 0 0 0 0 0 0 0 0 
0 
##$DATE= 1154593133
##$DBL= (0..7)
120 120 120 120 120 120 120 120 
##$DBP= (0..7)
150 150 150 150 150 150 150 150 
##$DBP07= 0
##$DBPNAM0= <>
##$DBPNAM1= <>
##$DBPNAM2= <>
##$DBPNAM3= <>
$$ [...]
##$SUBNAM6= <"">
##$SUBNAM7= <"">
##$SUBNAM8= <"">
##$SUBNAM9= <"">
##$SW= 20.6930455092707
##$SWIBOX= (0..15)
0 0 3 0 0 0 0 0 0 0 0 0 0 0 0 0 
##$SW_h= 5175.983436853
##$TD= 65536
##$TD0= 1
##$TE= 295.16
##$TE2= 300
##$TE3= 300
##$TEG= 300
##$TL= (0..7)
0 120 120 120 120 120 120 120 
##$TP= (0..7)
150 150 150 150 150 150 150 150 
##$TP07= 0
##$TPNAME0= <>
##$TPNAME1= <>
##$TPNAME2= <>
##$TPNAME3= <>
##$TPNAME4= <>
##$TPNAME5= <>
##$TPNAME6= <>
##$TPNAME7= <>
##$TPOAL= (0..7)
0.5 0.5 0.5 0.5 0.5 0.5 0.5 0.5 
##$TPOFFS= (0..7)
0 0 0 0 0 0 0 0 
##$TUNHIN= 0
##$TUNHOUT= 0
##$TUNXOUT= 0
##$USERA1= <user>
##$USERA2= <user>
##$USERA3= <user>
##$USERA4= <user>
##$USERA5= <user>
##$V9= 5
##$VALIST= <valist>
##$VCLIST= <CCCCCCCCCCCCCCC>
##$VD= 0
##$VDLIST= <DDDDDDDDDDDDDDD>
##$VPLIST= <PPPPPPPPPPPPPPP>
##$VTLIST= <TTTTTTTTTTTTTTT>
##$WBST= 1024
##$WBSW= 4
##$XGAIN= (0..3)
0 0 0 0 
##$XL= 0
##$YL= 0
##$YMAX_a= 257298
##$YMIN_a= -307794
##$ZGOPTNS= <>
##$ZL1= 120
##$ZL2= 120
##$ZL3= 120
##$ZL4= 120
##$ABSF1= 16.522
##$ABSF2= -4.171173
##$ABSG= 5
##$ABSL= 3
##$ALPHA= 0
##$AQORDER= 0
##$ASSFAC= 0
##$ASSFACI= 0
##$ASSFACX= 0
##$ASSWID= 0
##$AUNMP= <proc_1d>
##$AZFE= 0.1
##$AZFW= 0.1
##$BCFW= 0
##$BC_mod= 0
##$BYTORDP= 0
##$COROFFS= 0
##$CY= 12.5
##$DATMOD= 1
##$DC= 0
##$DFILT= <>
##$DTYPP= 0
##$F1P= 14.0000005364418
##$F2P= -0.99999901652339
##$FCOR= 0.5
##$FTSIZE= 32768
##$FT_mod= 6
##$GAMMA= 0
##$GB= 0
##$INTBC= 1
##$INTSCL= 1
##$ISEN= 128
##$LB= 0.3
##$LEV0= 0
##$LPBIN= 0
##$MAXI= 10000
##$MC2= 0
##$MEAN= 0
##$ME_mod= 0
##$MI= 0
##$NCOEF= 0
##$NC_proc= -4
##$NLEV= 6
##$NOISF1= 0
##$NOISF2= 0
##$NSP= 0
##$NTH_PI= 0
##$NZP= 0
##$OFFSET= 16.522
##$PC= 1
##$PHC0= 133.909
##$PHC1= 11.68473
##$PH_mod= 1
##$PKNL= yes
##$PPARMOD= 0
##$PSCAL= 4
##$PSIGN= 0
##$REVERSE= no
##$SF= 250.13
##$SI= 32768
##$SIGF1= 0
##$SIGF2= 0
##$SINO= 400
##$SIOLD= 32768
##$SREGLST= <1H.DMSO>
##$SSB= 0
##$STSI= 32768
##$STSR= 0
##$SW_p= 5175.98343685301
##$SYMM= 0
##$S_DEV= 0
##$TDeff= 65536
##$TDoff= 0
##$TI= <Analysis number 999999
Compound Code 99
Book Reference 9
Project Code 9>
##$TILT= no
##$TM1= 0
##$TM2= 0
##$TOPLEV= 0
##$USERP1= <user>
##$USERP2= <user>
##$USERP3= <user>
##$USERP4= <user>
##$USERP5= <user>
##$WDW= 1
##$XDIM= 32768
##$YMAX_p= 407371172
##$YMIN_p= -484175
$$ End of Bruker specific parameters
$$ ---------------------------------
##NTUPLES= NMR SPECTRUM
##VAR_NAME=  FREQUENCY,     SPECTRUM/REAL,   SPECTRUM/IMAG
##SYMBOL=    X,             R,               I
##VAR_TYPE=  INDEPENDENT,   DEPENDENT,       DEPENDENT
##VAR_FORM=  AFFN,          ASDF,            ASDF
##VAR_DIM=   32768,         32768,           32768
##UNITS=     HZ,            ARBITRARY UNITS, ARBITRARY UNITS
##FACTOR=    0.157963299565203, 1,           1
##FIRST=     4132.6476996994, 0,             0
##LAST=      -1043.33573715361, 0,           0
##MIN=       -1043.33573715361, -484175,     0
##MAX=       4132.6476996994, 407371172,     0
$$ Real data points
##PAGE= N=1
##DATA TABLE= (X++(R..R)), XYDATA
$$ [...]
17383A60252r9143O9353J977q2429O855p7890j11636R0208Q9018r1817P5896L128
$$ 160252 61109 130462 132439 50010 56865 -21025 -132661 -42453 46565 -45252 30644 33772
17371C3772j6555j661M1394k1539j29815J1037O1171j6489J073j34561P671P7060
$$ 33772 17217 15556 56950 35411 -94404 -83367 -22196 -38685 -37612 -172173 -164502 -87442
17359h7442J33842j0892o6529j08647r5501O2099R3085K7387N9879o0311n7869
$$ -87442 46400 35508 -31021 -139668 -235169 -173070 -79985 -52598 7281 -53030 -110899
17348a10899K6382J13603K75960J15157K7295K42198p791j16389l2072r1629m2271
$$ -110899 -84517 29086 305046 420203 447498 689696 681905 565516 533444 441815 399544
17337C99544m8311m5195m3986l7429j29559p5068N5637J67923L0048O4678j91232
$$ 399544 351233 306038 262052 224623 95064 19996 75633 243556 273604 338282 147050
17326A47050j48316N5951J1199L3137N9570K8363L185q1042m2140N8896m1968
$$ 147050 -1266 54685 65884 99021 158591 186954 190139 109097 66957 125853 83885
17315H3885l1605P0280r659L5175m5074p2869m2439m9727r53L167q3381J27936
$$ 83885 52280 122560 112901 148076 103002 30133 -12306 -62033 -62986 -59819 -143200 -15264
17303a5264J64116n0502o6475n1487l6796P132O2236N3455O4219k8975j54186
$$ -15264 148852 98350 31875 -19612 -56408 -49276 12960 66415 130634 101659 -52527
17292e2527L91n3909r9319m8824k521P6561n7923L3705J09953P8018n6276l9284
$$ -52527 -52136 -106045 -205364 -254188 -256709 -180148 -238071 -204366 -94413 -16395 -72671 -111955
17280a11955j6683J539J7591o4513m4748J8339L5210J09473O382m3627K973J7141
$$ -111955 -128638 -127099 -109508 -174021 -218769 -200430 -165220 -55747 -49365 -92992 -90019 -72878
17268g2878l3342j29039K3612P6727N8264Q6870J18447o7653j66542j00912p9679
$$ -72878 -106220 -235259 -211647 -134920 -76656 10214 128661 61008 -105534 -206446 -286125
17257b86125N7960Q3196J088M407l3239M8313J7697L2689j37290N089J5777M1425
$$ -286125 -228165 -144969 -143881 -139474 -172713 -124400 -106703 -74014 -211304 -206215 -190438 -149013
17245a49013K3815K6482j5379K6342m0100J5846J1293j82198J1424J77884J8199
$$ -149013 -125198 -98716 -114095 -87753 -127853 -112007 -100714 -282912 -271488 -93604 -75405
17234g5405J06510o9950P7910P1065M8237l1116j28r1311k00430j03615M6806
$$ -75405 31105 -38845 39065 110130 158367 127251 127123 35812 -164618 -268233 -221427
17223b21427J19232N5858n9244j5351K8753n3273R688K4448n5355Q6446K2604
$$ -221427 -102195 -46337 -105581 -120932 -92179 -145452 -135764 -111316 -166671 -80225 -57621
17212e7621r0729N0566l7212p3243j1557P8056K21121L2547n7610j55469q8799
$$ -57621 -148350 -97784 -134996 -208239 -219796 -141740 79381 111928 54318 -101151 -189950
17201a89950J6246M6230J5830P4062q5879M0636j5155N4181o168j14490Q7428
$$ -189950 -173704 -127474 -111644 -37582 -123461 -82825 -97980 -43799 -49967 -164457 -77029
17190g7029R8194r2962K3793M2790j34406L0199J28056r07j9735j8484m7017r4749
$$ -77029 21165 -71797 -48004 -5214 -139620 -109421 18635 17728 -2007 -20491 -67508 -162257
17178a62257K7085J72018R4496J7983k1028j16854j10033k4498n2149Q921L1828
$$ -162257 -135172 36846 131342 149325 128297 11443 -98590 -123088 -175237 -166316 -134488
17167a34488k0767L9328Q8325R66l0800l7960K804J219l0266m7675N5528K5398
$$ -134488 -155255 -115927 -27602 -26636 -57436 -95396 -92592 -91373 -121639 -169314 -113786 -88388
17155h8388k2590J7533m2450J7196Q7456N7893j85464j02717P0186J15717N1830
$$ -88388 -110978 -93445 -135895 -118699 -31243 26650 -158814 -261531 -191345 -75628 -23798
17144b3798o6127j14690l860M4229K733k3645Q9288R0380o2957p5750l4536M9907
$$ -23798 -89925 -204615 -208475 -164246 -161513 -185158 -95870 -5490 -68447 -144197 -178733 -128826
17132a28826j15416l059M5014J39314P7890N6111N080o8562n7119k1263N8139
$$ -128826 -244242 -247301 -202287 -62973 14917 71028 76108 7546 -49573 -70836 -12697
17121a2697m8631J2258o3719k8652J33773n1119m8629p400K1404J5772j09911
$$ -12697 -61328 -49070 -112789 -141441 -7668 -58787 -107416 -114816 -93412 -77640 -187551
17110a87551P1213j805M4965P298k14640q5457N0664R5486J48982p9675k8857
$$ -187551 -116338 -118143 -73178 -65880 -280520 -365977 -315313 -219827 -70845 -150520 -179377
17099a79377l1357j71439O4832K0750j285m6492O4542J40775J17722n2789o6569
$$ -179377 -210734 -382173 -317341 -296591 -297876 -344368 -279826 -139051 -21329 -74118 -140687
17088a40687J14681R3922K2314l3877j09496M6346K6185p0949P9130Q9781J3271
$$ -140687 -26006 67916 90230 56353 -53143 -6797 19388 -51561 27569 117350 130621
17077A30621m4212m9591j21072n0196K329M9846L4136r006j6196K3226o6325K0997
$$ 130621 86409 36818 -84254 -134450 -132121 -82275 -48139 -57145 -73341 -50115 -116440 -95443
17065i5443N0247n3229N1629M9965M1296l7595L8306r7309m5506O7258P6049P5598
$$ -95443 -45196 -98425 -46796 3169 44465 6870 45176 -52133 -97639 -30381 45668 121266
17053A21266j54901m6080L7019J19726j14863q6124J086K2005l0166n3204R585
$$ 121266 -33635 -79715 -42696 77030 -37833 -123957 -122871 -100866 -131032 -184236 -174651
17042a74651M1334l4121Q070m7914L9353J63819J15995j39175j20244L6803P7440
$$ -174651 -133317 -167438 -159368 -207282 -167929 -4110 111885 -27290 -147534 -110731 -33291
17031c3291P3540R8879L3979j24392j08866J8512N6312n4590R255O105J1541M0365
$$ -33291 40249 139128 173107 48715 -60151 -41639 14673 -39917 -30662 -24557 -13016 27349
17019B7349M291m7615l0548l447r169L920k3247n4205j16735O1093J31734k2665
$$ 27349 31640 -15975 -46523 -49970 -59139 -55219 -78466 -132671 -249406 -188313 -56579 -79244
17007g9244O6910R0279J063j01018q4965O2376n0470j59236N6557R7709J6875
$$ -79244 -12334 77945 79008 -22010 -106975 -44599 -95069 -254305 -197748 -100039 -83164
16996h3164O0293M8042N7346j26588k7943l3237O3655O8665o0860j49039Q926
$$ -83164 -22871 25171 82517 -44071 -72014 -105251 -41596 27069 -33791 -182830 -173904
16985a73904M0745J19704K8079k8508m7281j62624j01132Q1242J72538j7919N2637
$$ -173904 -133159 -13455 14624 -13884 -61165 -223789 -324921 -243679 -71141 -89060 -36423
16974c6423o7523r702Q0038q7585P2470N463K7239Q409j61688m010n5917n9108
$$ -36423 -103946 -113648 -33610 -121195 -48725 -43262 -16023 -7614 -169302 -173312 -229229 -288337
16962b88337k1622k3054K3016J18193J11667N4624K6657j43253n0617L1423J04253
$$ -288337 -309959 -333013 -309997 -191804 -80137 -25513 1144 -142109 -192726 -161303 -57050
16951e7050R6016m1535m0443q9116k02122N1576N7509J42732k8184m4334R2227
$$ -57050 38966 -2569 -43012 -132128 -334250 -282674 -225165 -82433 -110617 -154951 -62724
16940f2724M3492l6626K7035P915L5455M287k3808P4451R8741m7254j35016o08
$$ -62724 -19232 -55858 -28823 -20908 14547 18834 -4974 69477 168218 120964 -14052 -14660
16928a4660m6470j2216P2091p2863m5853J8115k2650L0289N8371L4044O5960j07538
$$ -14660 -61130 -73346 -1255 -74118 -119971 -101856 -124506 -94217 -35846 -1802 64158 -43380
16916d3380n6579N0312L6643j44725q1171J14195L1M9174L8732J7503J1222k2052
$$ -43380 -99959 -49647 -13004 -157729 -238900 -124705 -124674 -75500 -36768 -19265 -8043 -30095
16904c0095M8773p1683o5083q7197P637P2197j2707K4478K0197P500r756l0350
$$ -30095 18678 -53005 -118088 -205285 -197648 -125451 -138158 -113680 -93483 -85983 -95739 -126089
16892a26089k8801J1926Q1650K2755p0169m2840j16976J16031k5506o394K2820
$$ -126089 -154890 -142964 -61314 -38559 -108728 -151568 -268544 -152513 -178019 -184413 -161593
16881a61593K5127N579m4424k0928L0585M7099M8327M3781L8254n55j15201l51
$$ -161593 -136466 -130887 -175311 -196239 -165654 -118555 -70228 -26447 11807 11252 -103949 -104300
16869a04300L3661k7545m1773M1143l6657p3611K891J47038Q4693K3505n6343
$$ -104300 -70639 -98184 -139957 -98814 -135471 -209082 -206191 -59153 25540 49045 -7298
16858g298r9603j07241K9252L7165q784l2356O5611M5438k7653k2132J47733o2336
$$ -7298 -106901 -214142 -184890 -147725 -156509 -188865 -123254 -77816 -105469 -127601 20132 -42204
16846d2204n9797P8515J44400k7660J8754j85427q7921l1872r170J20969R824
$$ -42204 -102001 -23486 120914 93254 112008 -73419 -161340 -193212 -202382 -81413 -71589
16835g1589q8396K8247O2617O9126M4565m8387k7076R7500k4290k5784K8593J7382
$$ -71589 -159985 -131738 -69121 5 44570 -3817 -30893 66607 42317 16533 45126 62508
16823F2508q441n1192r7172K049p190L0398J54195N5964N4299Q442j19124j01635
$$ 62508 54067 2875 -94297 -92248 -99438 -69040 85155 141119 195418 203860 84736 -16899
16811a6899J0680q5143k4038k1479J21697K7230M760N7574l6446Q0949J6281k51409
$$ -16899 -6219 -91362 -115400 -136879 -15182 12048 16808 74382 37936 118885 135166 -116243
16799a16243o8530P9326k2361J42512J16828r6174o1270o4768m255j02998m4581
$$ -116243 -184773 -105447 -127808 14704 131532 35358 -25912 -90680 -94935 -197933 -242514
16788b42514M3618O4313J09584P6951l236j0352Q5785q7931o1081J9055l5714
$$ -242514 -198896 -134583 -24999 51952 48716 38364 124149 36218 -24863 -5808 -41522
16777d1522q2333j07132m2571L5690J64052l9484q7795J05231P981l0324R043
$$ -41522 -123855 -230987 -273558 -237868 -73816 -113300 -201095 -95864 -87883 -118207 -109164
16766a09164J0631P2876j2234N1755J02889Q2955k4828j28317m9252j14747j49996
$$ -109164 -98533 -25657 -37891 13864 116753 199708 174880 46563 -2689 -117436 -267432
16755b67432J37147R0791L3127K0761J65203n4708j93800J1593J20002R6259L5400
$$ -267432 -130285 -39494 -6367 14394 179597 124889 -68911 -57318 62684 158943 194343
16744A94343j14496r7767j20321p9033J56027O4898j7893l7115J801m1457L1568
$$ 194343 79847 -17920 -138241 -217274 -61247 3651 -14242 -51357 -49556 -91013 -59445
16733e9445l0563l1120n6223n9932J2640k5919J25506O6438o190j8789m6928O4228
$$ -59445 -90008 -121128 -177351 -237283 -224643 -250562 -125056 -58618 -64808 -83597 -130525 -66297
16721f6297J0339O1839P5025o4023m9473n595m3397Q5313m404J03595n1340j4707
$$ -66297 -55958 5881 80906 16883 -32590 -38185 -81582 3731 -673 102922 51582 36875
16709C6875M5868J352n487j18964j46708m0428k7205R1072j11009n2107K8926
$$ 36875 82743 84095 78608 -40356 -187064 -227492 -254697 -163625 -274634 -326741 -297815
16698b97815P8663k8818M8275Q7650J24779k7182j8655L5063j60700n4700Q2227
$$ -297815 -219152 -247970 -199695 -112045 12734 -14448 -33103 1960 -158740 -213440 -131213
16687a31213M4284N8296L5112J17103j16182L4291l0100p4086L1448J7204M8248
$$ -131213 -86929 -28633 6479 123582 7400 41691 11591 -62495 -31047 -13843 34405
16676C4405j3140P10j30257r0734o2816P7210J5985M0723J58132O5095l8162k0700
$$ 34405 21265 21975 -108282 -199016 -261832 -184622 -168637 -127914 30218 95313 57151 36451
16664C6451J5233j15937o6552m4788M1853J57271L3903o4202r352m8511O521m0873
$$ 36451 51684 -64253 -130805 -175593 -133740 23531 57434 -6768 -16120 -64631 -58110 -98983
16652i8983m0356j6871R0476M4026l7344J0839n5845q534M7888K4586J03345m6408
$$ -98983 -139339 -156210 -65734 -21708 -59052 -48213 -104058 -112592 -64704 -40118 63227 16819
16640A6819j14695r5660J6363K4259J16512J23698P125n3787j40807P4524R4207
$$ 16819 -97876 -193536 -177173 -152914 -36402 87296 94421 40634 -100173 -25649 68558
16629F8558j05871L4535n2110p7605M1983j5794N5879o8047j08711J26659L8662
$$ 68558 -37313 -2778 -54888 -132493 -90510 -106304 -50425 -118472 -227183 -100524 -61862
16618f1862J877j5972M6004J04557j10811n2382k1443J25615K9580K2375p0860
$$ -61862 -59985 -75957 -29953 74604 -36207 -88589 -110032 15583 45163 67538 -3322
16607c322l1050N507j7174L4755P5000l7002l3354o9249M5985K1153L954N3273
$$ -3322 -34372 -28865 -46039 -11284 63716 26714 -6640 -75889 -29904 -8751 -4797 48476
16595D8476P9867r9724k38172m2641N4792J34064n3598j17642K606J58945j5526
$$ 48476 128343 28619 -209553 -252194 -197402 -63338 -116936 -234578 -231972 -73027 -88553
16584h8553l6560r4235J5808k1747J9365N4013O5425J15228l5869o1135K3240
$$ -88553 -125113 -219348 -203540 -225287 -205922 -151909 -86484 28744 -7125 -68260 -45020
16573d5020L4527j19751j8720j43688p8058J56934R5480K7961j33936O742N251
$$ -45020 -10493 -130244 -148964 -292652 -370710 -213776 -118296 -90335 -224271 -217529 -212278
16562b12278j639R9346P4424j7936N2519L0927J4843r2511o8652P4158P1022j15030
$$ -212278 -213917 -114571 -40147 -58083 -5564 25363 40206 -52305 -120957 -46799 24223 -90807
16550i0807j10096n0852P3125J94673R0847l9994j21015k1980J47134R1625Q262
$$ -90807 -200903 -251755 -178630 16043 106890 66896 -54119 -76099 71035 162660 170922
16539A70922j24801o1672p9076n6722N250k2300K2324L4147k1396L2409R6530
$$ 170922 46121 -15551 -94627 -151349 -146099 -168399 -146075 -111928 -133324 -100915 -4385
16528d385O6214l3987j85669l5547L3753J7214K2622K6289r4800m7369J74321
$$ -4385 61829 27842 -157827 -193374 -159621 -142407 -119785 -93496 -188296 -235665 -61344
16517f1344K07001k6225j10434j06837k9860L1533Q5260L5522K8252n0737J2981
$$ -61344 145657 119432 8998 -97839 -127699 -96166 -10906 24616 52868 2131 15112
16506A5112k4089p8204J9873l2629J35921J0915k6260m452J7789J15559N0810
$$ 15112 -8977 -87181 -67308 -99937 35984 46899 20639 16187 33976 149535 200345
16495B00345J1189p3609j68645m5107k9641j455j265m8967l1923K8139m9984m2310
$$ 200345 211534 137925 -30720 -75827 -105468 -106923 -108188 -157155 -189078 -160939 -210923 -253233
16483b53233M3048l9802k2438m0175j0548P1679Q4161J34224J02411m7010l7269
$$ -253233 -210185 -249987 -272425 -312600 -323148 -251469 -167308 -33084 69327 22317 -14952
16472a4952p4360m1609o8450k6511K8511J20667N4409p0641k20809O970J13063
$$ -14952 -89312 -130921 -199371 -225882 -197371 -76704 -22295 -92936 -313745 -306775 -193712
16461a93712J16604P9009L2029J41734L4499q4335j48113n6542j406J2848n8092
$$ -193712 -77108 1901 33930 175664 210163 125828 -22285 -78827 -80233 -67385 -125477
16450a25477K0979n8166j1090K7564q7802L1939M9382M3223r5776L5798Q3526
$$ -125477 -104498 -162664 -173754 -146190 -233992 -202053 -152671 -109448 -205224 -169426 -85900
16439h5900M4362K3883m3267j57718j08989J14243J90347Q1541o1748K4345O4909
$$ -85900 -41538 -17655 -60922 -218640 -327629 -213386 -23039 58502 -3246 21099 86008
16428H6008j69509q6747j18100j3480J35093J83028q6648j8833Q0136R969m3304
$$ 86008 -83501 -170248 -288348 -301828 -166735 16293 -70355 -89188 -9052 917 -42387
16417d2387j42155n1304O6945j06953m9456Q8929J1784J02733N9046J15238m3565
$$ -42387 -184542 -235846 -168901 -275854 -325310 -236381 -224597 -121864 -62818 52420 8855
16406H855L0991M6462l2190p5883j8144q2540l5063K7410L7087L0165N4840m3755
$$ 8855 39846 86308 54118 -21765 -39909 -122449 -157512 -130102 -93015 -62850 -8010 -51765
16394e1765k6744P4889J7268K5136O6123J5535O2767q8642r0754l8325l2829p7149
$$ -51765 -78509 -3620 13648 38784 104907 120442 183209 94567 3813 -34512 -67341 -144490
16382a44490R4261L0478L514o6625j06203L5432L1281J07970K4493O0997m0850
$$ -144490 -50229 -19751 -16237 -82862 -189065 -153633 -122352 -14382 10111 71108 30258
16371C0258q1781j6851k6995L7442r6095k4696L2833L6952l9269l9830O3028J01740
$$ 30258 -51523 -68374 -95369 -57927 -154022 -178718 -145885 -108933 -148202 -188032 -125004 -23264
16359b3264Q1051Q5294l9716l9009R9385M4959p8975j41621j86955R938k605j300
$$ -23264 57787 143081 103365 64356 163741 208700 129725 -11896 -198851 -188913 -191518 -192818
16347a92818O8451R5001M4173M6493q9668M9692L3481n800j3191r7578k4092K7822
$$ -192818 -124367 -29366 14807 61300 -28368 21324 54805 49005 35814 -61764 -85856 -58034
16335e8034l3905M352J0034P5181L6362O0542N5777J7591l9503q5657o4830j01380
$$ -58034 -91939 -87587 -77553 -2372 33990 94532 150309 167900 128397 42740 -22090 -123470
16323a23470K2332L3653o1809J2952L1792q508N7038m6092k9481q6812M4658J19228
$$ -123470 -101138 -67485 -129294 -116342 -84550 -93058 -36020 -82112 -111593 -198405 -153747 -34519
16311c4519J13864L35j61346Q5442Q4464J7024M3031q8943p6072m5265l6076K2632
$$ -34519 79345 79680 -81666 3776 88240 105264 148295 59352 -16720 -61985 -98061 -75429
16299g5429k5484N084O6088j45856N086O8034O0436l0243J6473l1119l6745q3683
$$ -75429 -100913 -95829 -29741 -175597 -170511 -102477 -42041 -72284 -55811 -86930 -123675 -207358
16287b07358Q658M6467p2351k5167p4326J3490M5792J925R3623L0561J120J08316
$$ -207358 -198700 -152233 -224584 -249751 -324077 -310587 -264795 -262870 -169247 -138686 -137566 -29250
16275b9250j03122P619M5160J8878m5959J9130K6623J07891n0150J8519Q2597
$$ -29250 -132372 -124753 -79593 -60715 -106674 -87544 -60921 46970 -3180 15339 97936
16264I7936j6183p8954J6074j4309J6706L5913R144J48621J30266j05347j50908
$$ 97936 81753 2799 18873 4564 21270 57183 66327 214948 345214 239867 88959
16253H8959j31230q0059Q972k9829o4395J8122L2433j7043R1735J13120j99237
$$ 88959 -42271 -122330 -113358 -143187 -207582 -189460 -157027 -174070 -82335 30785 -168452
16242a68452o2941J95129J37553r8913l6655J43208J70053j1030j52335n8778
$$ -168452 -231393 -36264 101289 2376 -34279 108929 278982 267952 115617 56839
16232E6839j52127j322j3352M6766L6587R6171m3006r8320J5193J56613M7807
$$ 56839 -95288 -96610 -109962 -63196 -26609 69562 26556 -71764 -56571 100042 147849
16221A47849q6248j16513p05n0593o0755O7598O3214R8620j172r7131j93418J927
$$ 147849 61601 -54912 -55617 -106210 -166965 -99367 -36153 62467 61295 -35836 -229254 -227327
16209b27327J2415M1385N2530J3132Q3356j186K3244j8648j20866k5873l4688
$$ -227327 -214912 -173527 -120997 -107865 -24509 -25695 -2451 -21099 -141965 -167838 -202526
16198b02526N0216J22901J64739N1409m257p0567K347j3135m3582r0992q6343
$$ -202526 -152310 -29409 135330 186739 182482 111915 114262 101127 57545 -33447 -119790
16187a19790J36759J9246l1947j5522m8437j26778q8400O9279O4746L048P2641
$$ -119790 16969 36215 4268 -11254 -59691 -186469 -274869 -205590 -140844 -137796 -65155
16176f5155M878l7797n074J04274L7070j8266o5411q190L8445R061r3722K532
$$ -65155 -60277 -98074 -103148 1126 38196 19930 -45481 -53671 -15226 -6165 -99887 -97355
16164i7355O1827j02020m4138K26115J07224j48454n6826R065m4345Q3278k9835
$$ -97355 -35528 -137548 -181686 44429 151653 3199 -53627 -44562 -88907 -5629 -35464
16153c5464q304N9644N95j33788p4425K6247O65q6460O5874P7430O6148O8805
$$ -35464 -43768 15876 16471 -117317 -191742 -165495 -164830 -251290 -185416 -107986 -41838 26967
16141B6967O2131o3239p6767k2459J1582J21868J80892J0q7632j24619j47717
$$ 26967 89098 25859 -50908 -73367 -61785 60083 240975 240985 153353 28734 -118983
16130a18983J6814N7281l29M8650j6396M2998n4449r4898p3698j2101J01259m896
$$ -118983 -102169 -44888 -45217 3433 -12963 30035 -24414 -119312 -193010 -205111 -103852 -108748
16118a08748J5847j43291p589P3283l4369Q44l3459n443O8454J09539J24140J5461
$$ -108748 -92901 -236192 -243781 -170498 -204867 -204023 -237482 -242925 -174471 -64932 59208 74669
16106G4669o3598n8891l1966J0777p0721O7921p0033o1386J01191j406r1636P4745
$$ 74669 11071 -47820 -79786 -69009 -139730 -71809 -141842 -203228 -102037 -103443 -195079 -120334
16094a20334j3425J2194Q5932K7781l4513n9497J01041J31025m9861n9519j6322
$$ -120334 -133759 -121565 -35633 -7852 -42365 -101862 -821 130204 80343 20824 4502
16083D502j76837o5687j431N2181M6649Q5339n3837q3082j1523P8610O7041L7448
$$ 4502 -172335 -238022 -239453 -187272 -140623 -55284 -109121 -192203 -203726 -125116 -58075 -20627
16071b0627m046o5117n4975K360O5050n4372M6126p077o5492K3668J1275j8928
$$ -20627 -24673 -89790 -144765 -142405 -77355 -131727 -85601 -92678 -158170 -134502 -123227 -142155
16059a42155Q949k7877L6612L5187n968r8642J4631J85288J4010o4609K7713Q0000
$$ -142155 -133206 -161083 -124471 -89284 -95252 -193894 -179263 6025 20035 -44574 -16861 63139
16047F3139L9193M338j9158n6690r5927j0327L0135j7316o9779p7879o4786m4738
$$ 63139 102332 106670 87512 30822 -65105 -75432 -45297 -62613 -132392 -210271 -275057 -319795
16035c19795R5885O9544Q9590J40813l2937K1162J1405j3837J0288J5065j24410
$$ -319795 -223910 -154366 -64776 76037 43100 64262 75667 61830 72118 87183 -37227
16024c7227n5032J19904P867L0979K857j4827o0305p8447j1085J9470M8350o6235
$$ -37227 -92259 27645 35512 66491 69348 54521 -5784 -84231 -95316 -75846 -27496 -93731
16012i3731j5991K3393L4474K323K2969m8753k0530l5533m9858n5602l50O6448
$$ -93731 -109722 -86329 -51855 -49532 -26563 -75316 -95846 -131379 -181237 -236839 -237189 -170741
16000a70741K0708R2040M0401L911N7675O60k2025R1976k2148P3282m7439l9448
$$ -170741 -150033 -57993 -17592 -13681 43994 44654 22629 114605 92457 165739 118300 78852
15988G8852j01374l8591n5464Q4384L6108J7662J0845m1286k08787p61J01215
$$ 78852 -22522 -61113 -116577 -32193 3915 21577 32422 -8864 -217651 -218412 -117197
15977a17197k048N1285q488j2633j9165o3430n0227l810J91368K0638j61795O8074
$$ -117197 -119245 -67960 -76448 -89081 -108246 -171676 -221903 -225713 -34345 -13707 -175502 -107428
15965a07428O6699p6487j02191L387Q7078l7101o9575P7702m472n2119k6698J01765
$$ -107428 -40729 -117216 -219407 -216020 -128942 -166043 -235618 -157916 -162388 -214507 -241205 -139440
15953a39440P9613J3220K2472j07124o5662J15053m7402m3624j72346q8804J5756
$$ -139440 -59827 -46607 -24135 -131259 -196921 -81868 -129270 -172894 -345240 -434044 -418288
15942d18288K07032J34178P1753l2478P6555J9219J0571j9842L7560L6043n4318
$$ -418288 -211256 -77078 -5325 -37803 38752 57971 68542 48700 86260 122303 67985
15931F7985p4077j65294m3635Q9978O736R2004Q074K8838P8083r0154q863P5835
$$ 67985 -6092 -171386 -215021 -125043 -118307 -26303 -18229 10609 88692 -1462 -10325 65510
15919F5510P0442O179R351p4198j14395M3657m0562k8664k2038m5245r8492O149
$$ 65510 135952 142131 151482 77284 -37111 6546 -34016 -62680 -84718 -129963 -228455 -222306
15907b22306R6318P8032Q5882l6340o2299j15687K2173O3835N502o3721o9938
$$ -222306 -125988 -47956 37926 1586 -60713 -176400 -154227 -90392 -84890 -148611 -218549
15896b18549N9228M8990n8131k4719m0682n3041p7389k5223J07839N8787N6789
$$ -218549 -159321 -110331 -168462 -193181 -233863 -286904 -364293 -389516 -281677 -222890 -166101
15885a66101J3938j14068J45704N3090j20118q2080J75359J26943p6718q5891
$$ -166101 -152163 -266231 -120527 -67437 -187555 -269635 -94276 32667 -44051 -129942
15875a29942j748J4275N9852P8773m8658k0848J07066J32943L7057L650o9373
$$ -129942 -131690 -117415 -57563 21210 -27448 -48296 58770 191713 228770 232420 163047
15864A63047n4304Q8408m7701q7582o4552M8992k00472M8556Q3527m6387Q0224
$$ 163047 108743 197151 149450 61868 -2684 46308 -154164 -105608 -22081 -68468 11756
15853A1756J51195J39414p8721k7111j66557j63304r4923J2293Q6052j1134R0683
$$ 11756 162951 302365 223644 196533 29976 -133328 -228251 -215958 -129906 -141040 -50357
15842e0357L5680o1766j30710L465J05479Q5022J09500J54685J8129p8272q149
$$ -50357 -14677 -76443 -207153 -203688 -98209 -13187 96313 250998 269127 190855 182706
15831A82706j99072j12019L3956J4641j29305m6900N623M7978M9754R5449q310
$$ 182706 -16366 -128385 -94429 -79788 -209093 -255993 -250370 -202392 -152638 -57189 -65499
15820f5499o6842J09580K5195n4437o3035L9064m6830J2081L3702N9688Q4270
$$ -65499 -132341 -22761 2434 -52003 -115038 -75974 -122804 -110723 -77021 -17333 66937
15809F6937N0012j01222p9070K6713L6993j1469p4464L681j61M9886M7857K2865
$$ 66937 116949 15727 -63343 -36630 363 -11106 -85570 -81889 -82050 -32164 15693 38558
15797C8558k5864r2500P4200p0992J7795K9851r3432n4234J4172O7401K7477J3794
$$ 38558 12694 -79806 -5606 -76598 -58803 -28952 -122384 -176618 -162446 -95045 -67568 -53774
15785e3774K6853M8246l2942r2159j3533P9205k834q112K908k4079m6982j8700
$$ -53774 -26921 21325 -11617 -103776 -117309 -38104 -40938 -49050 -46142 -70221 -117203 -135903
15773a35903O7301J89915n2918j13209l2584J8876L077P108P0367O9319J1853
$$ -135903 -68602 121313 68395 -44814 -77398 -58522 -55445 -48337 22030 91349 103202
15762A03202j21699m2109N6358J08499m0713j00291M5565J19043L2842n9875j42836
$$ 103202 -18497 -60606 -4248 104251 63538 -36753 8812 127855 160697 100822 -42014
15751d2014j42369L4522J42729O8310l3035k2575j7774l9040q9968J42404J55779
$$ -42014 -184383 -149861 -7132 61178 28143 5568 -12206 -51246 -141214 1190 156969
15740A56969J0314J3210p2619l9729o9838L996j08926l35r990K6128M3641Q4828
$$ 156969 167283 180493 107874 68145 -1693 2303 -106623 -106958 -116948 -90820 -47179 37649
15728C7649N122q0080R327n2419p3244J4911J11962o7925j05097p1792J7841p852
$$ 37649 42771 -37309 -27982 -80401 -153645 -138734 -26772 -94697 -199794 -271586 -253745 -261597
15716b61597p1498P2387J62015O3M6711J1236o7557M330Q2363O5770k6461K6757
$$ -261597 -333095 -260708 -98693 -98630 -51919 -40683 -108240 -103910 -21547 44223 17762 44519
15704D4519j1874M7234M1916Q221m5213K4602p0533j57020r299j0793K4718J2366
$$ 44519 32645 79879 121795 130016 84803 109405 38872 -118148 -127447 -138240 -113522 -101156
15692a01156q5894M1494R2089Q6939k5653O7487K5372j35133j9081l2717p3864
$$ -101156 -187050 -145556 -53467 33472 7819 75306 100678 -34455 -53536 -86253 -160117
15681a60117J0961J78652N6050l5019J6086J3425q0844N4699O3011n9459p0771
$$ -160117 -149156 29496 85546 50527 66613 80038 -806 53893 116904 57445 -13326
15670a3326M5848q8434L1538J539j06165o6893j0435q755N9458j2861J3438P9604
$$ -13326 32522 -55912 -24374 -22835 -129000 -195893 -206328 -215083 -155625 -168486 -155048 -75444
15658g5444O6975R469j2319m9717l8418k9631N4452M0998J08656Q3727l1423j37022
$$ -75444 -8469 1000 -11319 -61036 -99454 -129085 -74633 -33635 75021 158748 127325 -9697
15646i697n8972j4832J3167k4070Q4665K8652n8711l0162n0676J1359J2306K7530
$$ -9697 -68669 -83501 -70334 -94404 -9739 18913 -39798 -69960 -120636 -109277 -96971 -69441
15634f9441j12480q1833J13387J41107l3068q0802p833j5629K1267R1875P5908
$$ -69441 -181921 -263754 -150367 -9260 -42328 -123130 -130963 -146592 -125325 -33450 42458
15623D2458L394r8445q6246m5487J69865J36038K7475k4478j08971p4114o0935
$$ 42458 45852 -52593 -138839 -184326 -14461 121577 149052 124574 15603 -58511 -119446
15612a19446N9447O4289J06934J15839m9841m6408M7757J6917m7970q450N1719
$$ -119446 -59999 4290 111224 227063 177222 130814 178571 195488 147518 139068 190787
15601A90787l9415j99204J7111o5271p7097O946M3704L2373n0208N9643Q850J984
$$ 190787 151372 -47832 -30721 -95992 -173089 -166143 -122439 -90066 -140274 -80631 -71781 -69797
15589f9797l376o8747K410m9847K4948J01692P7827M9253L9043J2046K7378j6343
$$ -69797 -73173 -141920 -139510 -189357 -164409 -62717 15110 64363 103406 115452 142830 126487
15577A26487p6277j3781K7905l2774o8807K7506M6386p3341r2992j56087J1220
$$ 126487 50210 36429 64334 31560 -37247 -9741 36645 -36696 -129688 -285775 -274555
15566b74555K1112R0180J58862P246l3097j12863k353J11120P9648j3471j36393
$$ -274555 -253443 -163263 -4401 2845 -30252 -143115 -145468 -34348 45300 31829 -104564
15555a04564j30261q4235q5561O4161J81089J33712o245m3347J07354k4926j41773
$$ -104564 -234825 -319060 -404621 -340460 -159371 -25659 -31904 -75251 32103 7177 -134596
15544a34596l8624J20489M3567p5138q7615N2627m3167N4117K9372L156P4893
$$ -134596 -173220 -52731 -9164 -84302 -171917 -119290 -162457 -108340 -78968 -75812 -919
15533i19N445J47930O0388k9873j24216j76238l8795Q4271n7381m5005M8062N2905
$$ -919 4526 152456 212844 182971 58755 -117483 -156278 -72007 -129388 -174393 -126331 -73426
15521g3426l446L8187K9764j8583J1044K2955k6480J14501M3626q5318q0423k770
$$ -73426 -76872 -38685 -8921 -27504 -16460 6495 -19985 94516 138142 52824 -27599 -30369
15509c0369k0799n9967L7461J42211o5562j3982p0284j00815K3616o815N7575
$$ -30369 -51168 -111135 -73674 68537 2975 -11007 -81291 -182106 -158490 -165305 -107730
15498a07730N9429O9566j13060l140N4856p7532N2570m3131o972O783J26666m9693
$$ -107730 -48301 21265 -91795 -94935 -40079 -117611 -65041 -108172 -115144 -108361 18305 -31388
15486c1388j10994m3984N5240J792p6234N7653r0376R2246L5589k6187m7360r0248
$$ -31388 -142382 -186366 -131126 -129334 -205568 -147915 -238291 -146045 -110456 -136643 -184003 -274251
15474b74251Q2157L1098l0926N4249J57531j368n0604J4231j14784j42454j12644
$$ -274251 -192094 -160996 -191922 -137673 19858 18490 -32114 -17883 -132667 -275121 -387765
15463c87765R477Q920J45411Q9181k5605P5863J44987R4679K6840l9203P097j43255
$$ -387765 -378288 -369368 -223957 -134776 -160381 -84518 60469 155148 181988 142785 149882 6627
15451F627l211r3456R165J4271P8010Q9813k0626l1896j29204j20515K6194O4463
$$ 6627 3416 -90040 -80875 -66604 11406 101219 80593 48697 -80507 -201022 -174828 -110365
15439a10365j6837Q263L2404K2183k691K6575o0391l8873n7401N9125j6934J3828
$$ -110365 -127202 -118939 -86535 -64352 -67043 -40468 -100859 -139732 -197133 -138008 -154942 -141114
15427a41114q1403R7928j5817n402J2677m1845n4554L2881O848O3016L2335N9887
$$ -141114 -222517 -124589 -140406 -145808 -133131 -174976 -229530 -196649 -189801 -126785 -94450 -34563
15415c4563L4685q3810o0207J7063k3343N2625R3972J1129j3252R0091l0529O7234
$$ -34563 122 -83688 -143895 -126832 -150175 -97550 -3578 7551 -5701 84390 53861 121095
15403A21095l0337j10324j27801O2518M8365m9125M0271r990K0474J2884o8995
$$ 121095 90758 -19566 -147367 -84849 -36484 -85609 -45338 -55328 -34854 -21970 -90965
15392i0965O1208j5217m1873L5323m256K0449Q9133P1674R0236j9327j70576l7149
$$ -90965 -29757 -44974 -86847 -51524 -55780 -35331 53802 125476 215712 196385 25809 -11340
15380a1340l066Q9849M748K052r0089q1294Q729p0664N8707J0323J7746Q5438
$$ -11340 -14406 75443 80191 82243 -7846 -89140 -80411 -151075 -92368 -82045 -64299 21139
15368B1139n4255j16755M5888l1754K418J69966J0575m3963q073J01385J1272
$$ 21139 -33116 -149871 -103983 -135737 -133319 36647 47222 3259 -4814 96571 107843
15357A07843O0722j35509j03868Q805K7239k7370M2676l6415j7239n7980M5816
$$ 107843 168565 33056 -70812 -62007 -34768 -62138 -19462 -55877 -73116 -131096 -85280
15346h5280J35367N4704O5192j23799j14379M1310O2817R8019j4070n4423p2751
$$ -85280 50087 104791 169983 46184 -68195 -26885 35932 133951 119881 65458 -7293
15335g293j0743k5580N1484k2276Q8652J03501j01640j06868j08051Q5111J03173
$$ -7293 -18036 -43616 7868 -14408 74244 177745 76105 -30763 -138814 -53703 49470
15324D9470j2288j1948j17249o1263L482R8780J39626R3054q6377q1422j6160
$$ 49470 37182 25234 -92015 -153278 -149796 -51016 88610 181664 95287 13865 -2295
15313b295m9961q0322P1238j7069J364P8943P7641k5297r3037r7636R4602J0538
$$ -2295 -52256 -132578 -61340 -78409 -77045 1898 79539 54242 -38795 -136431 -41829 -31291
15301c1291M4080O5996Q810L8839R1816q439j25642j47365M734k1879o1708O6732
$$ -31291 12789 78785 87595 126434 218250 209811 84169 -63196 -58462 -80341 -142049 -75317
15289g5317P2854j705j49184L893N4408J1267K3699N1647l6039K855r1650j3827
$$ -75317 -2463 -4168 -153352 -149459 -95051 -83784 -60085 -8438 -44477 -41622 -133272 -147099
15277a47099L0104n7461k4476K2084K714O9847J09604m5917p0576K0505K4775
$$ -147099 -116995 -174456 -198932 -176848 -174134 -104287 5317 -40600 -111176 -90671 -65896
15266f5896P9942o418l9311m7389J07466r1607m4373N1309L0058J7250m9910J6358
$$ -65896 14046 7628 -31683 -79072 28394 -63213 -107586 -56277 -26219 -8969 -58879 -42521
15254d2521P6853J2775r2365j3869m260J8648L4280m3287M3519P0864r4000J4409
$$ -42521 34332 47107 -45258 -59127 -63387 -44739 -10459 -53746 -10227 60637 -33363 -18954
15242a8954m338L7920k251p2174k61n6663M9419J38547j1918j9062j28859j40482
$$ -18954 -23292 14628 12377 -59797 -60058 -116721 -67302 71245 59327 40265 -88594 -229076
15230b29076N3223M1848N3444j7498R6023J26117q7633j972M8660L6509L7734
$$ -229076 -175853 -134005 -80561 -98059 -2036 124081 36448 34476 83136 119645 157379
15219A57379j01059o0003J04229r4646j08056P3531J06577k5204p8021o079K8398
$$ 157379 56320 -3683 100546 5900 -102156 -28625 77952 52748 -25273 -31352 -2954
15208b954j7139p4083P9901k5688n3732J83209N3960k9489L1370Q1751j44492
$$ -2954 -20093 -94176 -14275 -39963 -93695 89514 143474 113985 145355 227106 82614
15197H2614j26584r0760J65691P7406P0206k4062j44010m673k2008k7827l9736
$$ 82614 -43970 -134730 30961 108367 178573 154511 10501 5828 -16180 -44007 -83743
15186h3743j3581K5810N2059m9652q1653L4511l3096P5586R1629J46080R299k39314
$$ -83743 -97324 -71514 -19455 -69107 -150760 -116249 -149345 -73759 17870 163950 173249 -66065
15174f6065j05827P1245L720m9230q72J8313Q2209k9469j09055l4513L6828L4723
$$ -66065 -171892 -100647 -96927 -146157 -147029 -128716 -46507 -75976 -185031 -219544 -182716 -147993
15162a47993N5029N9620k2004k1301J7420J05945J2972p5803L0532R1202J7448
$$ -147993 -92964 -33344 -55348 -76649 -59229 46716 59688 -16115 14417 105619 123067
15151A23067j43763k7482N0728n213m6222J9292n1321M025r69N5480M0989j048
$$ 123067 -20696 -48178 2550 -2663 -48885 -29593 -80914 -76889 -77858 -22378 18611 17563
15139A7563K8280J3207o0953l0855N438l9222j07703l077K8047O7736m420j32803
$$ 17563 45843 59050 -1903 -32758 -27320 -66542 -174245 -177322 -149275 -81539 -85959 -218762
15127b18762n9063Q6796j6408k8732J13246O3271J3300q3438R1116L5927L5549
$$ -218762 -277825 -191029 -207437 -236169 -122923 -59652 -46352 -129790 -38674 -2747 32802
15116C2802r7695r6891n1581p834R1751l8349K956P9633r53J4759k7753M6936
$$ 32802 -64893 -161784 -213365 -221199 -129448 -167797 -164841 -85208 -86161 -71402 -99155 -52219
15104e2219j5674q3197N5732J9477k9782J32434R6123M0028n3821o1952j83584
$$ -52219 -67893 -151090 -95358 -75881 -105663 26771 122894 162922 109101 47149 -136435
15093a36435K482R9179j4767r8097j3309P5408O0844o018j00883O1887L8564L0415
$$ -136435 -133953 -34774 -49541 -147638 -160947 -85539 -24695 -30713 -131596 -69709 -31145 -730
15081g30m5792l5158J1274N0895R2765p3860j33254o8936P1940J01968M6956K5780
$$ -730 -46522 -81680 -70406 -19511 73254 -606 -133860 -202796 -130856 -28888 18068 43848
15069D3848R6769O3151l038r4067o9808r582n3181k7320J37497n6040q2878m4165
$$ 43848 140617 203768 200730 106663 36855 27273 -25908 -53228 84269 28229 -54649 -98814
15057i8814O3570Q6782o7701o295J27573R1546P8442j52708m7644J3197o4411
$$ -98814 -35244 51538 -16163 -22458 105115 196661 275103 122395 74751 87948 23537
15046B3537p7834r353p4100L9604K3431R081l7405M1460J88613P062n3813p9374
$$ 23537 -54297 -63650 -137750 -98146 -74715 -65634 -103039 -61579 127034 134096 80283 909
15034I09p7310J24757j32118r1484J8498j2276n8660M3119J32398J19982J13650
$$ 909 -76401 48356 -83762 -175246 -156748 -169024 -227684 -184565 -52167 67815 181465
15023A81465j05887J1568m1351Q0625P5676p8756l4470L0999M3058K200r6962
$$ 181465 75578 87146 45795 126420 202096 123340 88870 119869 162927 165127 68165
15012F8165r4198m174r544o0203k6549J37178J07045m0226q1079j58407R4369
$$ 68165 -26033 -30207 -39751 -99954 -126503 10675 117720 77494 -3585 -161992 -67623
15001f7623O4470n5561m501n2611p8287L4694j17339j02363O1640K20068P328
$$ -67623 -3153 -58714 -63215 -115826 -194113 -159419 -276758 -379121 -317481 -97413 -90085
14990i0085K8989o3280r3054Q1820K7363J48323P4472N5716r221j07866q3944
$$ -90085 -61096 -124376 -217430 -135610 -108247 40076 114548 170264 161043 53177 -30767
14979c0767n3623j3198K529r8910Q3645M5795o3004Q2224k6487j38549L7967O4392
$$ -30767 -84390 -97588 -95059 -193969 -110324 -64529 -127533 -45309 -71796 -210345 -172378 -107986
14967a07986j1436m7153O211J43519R3773J08023j2856j20364K5884L3837K0128
$$ -107986 -119422 -166575 -160364 -16845 76928 184951 172095 51731 77615 111452 131580
14956A31580j47374j42317O5797q8550m477P7732n253m5220L1962K796k7495k4027
$$ 131580 -15794 -158111 -92314 -180864 -185341 -107609 -112862 -158082 -126120 -123324 -150819 -174846
14944a74846N6306p5985N352K310N8677p1544m2689N4986P2954J5884L2260j643
$$ -174846 -118540 -194525 -189173 -186863 -128186 -199730 -242419 -187433 -114479 -98595 -66335 -67978
14932f7978R346k4513J3193j7034l5407N7515J05680M1142j51063k38751M2357
$$ -67978 -58632 -83145 -69952 -86986 -122393 -64878 40802 81944 -69119 -307870 -265513
14921b65513N918N5018J59966N2600m4305J109j0467L606J41539m0845j34584
$$ -265513 -259595 -204577 -44611 7989 -36316 -35207 -45674 -42068 99471 58626 -75958
14910g5958K2862N6157R1508r4812j13841K4451L1770L4497L0675J23499k9612
$$ -75958 -53096 3061 94569 -243 -114084 -89633 -57863 -23366 7309 130808 101196
14899A01196j09478o1083K6719M6020k6236M5347L9663j3180k7245R7353r645
$$ 101196 -8282 -69365 -42646 3374 -22862 22485 62148 48968 21723 119076 109431
14888A09431n4153p7470j37029l8466L7395L6373M8719k2008k930R3318J37862
$$ 109431 55278 -22192 -159221 -197687 -160292 -123919 -75200 -97208 -100138 -6820 131042
14877A31042p7953L7607q4395n8487p066j0256j8807n4423p2922O1576k869m9299
$$ 131042 53089 90696 6301 -52186 -59252 -69508 -88315 -142738 -215660 -154084 -156953 -206252
14865b06252M8781P7487j4485R3107p8523j17999K5982P2321o3362K9216k8543
$$ -206252 -157471 -79984 -94469 -1362 -79885 -197884 -171902 -99581 -162943 -133727 -162270
14854a62270n5552o6029l2665K1022J05464M3130N549O1709M1620k3353P9755
$$ -162270 -217822 -283851 -316516 -295494 -190030 -146900 -141351 -79642 -38022 -61375 18380
14843A8380k2566j8659M9983n9900K2485M2421O1096j7644m3668K9004n1674o4039
$$ 18380 -4186 -22845 27138 -32762 -10277 32144 93240 75596 31928 60932 9258 -54781
14831e4781R3401K5411l5210N6602Q4727j6484l197j19973m3479m7976m6700j12435
$$ -54781 38620 64031 28821 85423 170150 153666 150469 30496 -12983 -60959 -107659 -220094
14819b20094k9066N7363q3063L6506J11381R0271M8078J561J1363K9058K5910
$$ -220094 -249160 -191797 -274860 -238354 -126973 -36702 11376 12937 24300 53358 79268
14808G9268l9163J2163l0497q4998M6832J8016Q0017k1725p9413n8761o0876J02936
$$ 79268 40105 52268 21771 -63227 -16395 1621 81638 59913 -19500 -78261 -139137 -36201
14796c6201O2979l2350j02034j0551J6636J88951P4758j48922N2999J15322j5426
$$ -36201 26778 -5572 -107606 -118157 -101521 87430 162188 13266 66265 181587 166161
14785A66161n0070j6463o8215j8237n0179k3077P319l662J9683M1218J902K3371
$$ 166161 116091 99628 31413 13176 -37003 -60080 -52761 -56423 -36740 4478 6380 29751
14773B9751q0852j2835M0025M6180j11807r8830p7336N8214Q9108n018J0491l9812
$$ 29751 -51101 -63936 -23911 22269 -89538 -188368 -265704 -207490 -118382 -123400 -112909 -152721
14761a52721q677J25877J21857n8716m7067o4172l5855L1700J8054J2376l1279
$$ -152721 -161398 -35521 86336 27620 -19447 -83619 -119474 -87774 -69720 -57344 -88623
14750h8623j19963N9845O1749J972j27317m4316J20152J04121K3337j12098J4308
$$ -88623 -208586 -148741 -86992 -85020 -212337 -256653 -136501 -32380 -9043 -121141 -106833
14739a06833j855p2281J47518L0986r7943J01065P3180k9533O564Q8186L8430
$$ -106833 -108688 -180969 -33451 -2465 -100408 657 73837 44304 50868 139054 177484
14728A77484l1940p4343M7194o3882n3648n2050p5609J18250O6705K0384K4688
$$ 177484 145544 71201 118395 54513 865 -51185 -126794 -8544 58161 78545 103233
14717A03233p9548j30650K8680k1483m9198J75848k6677j01311l6081q7929l2316
$$ 103233 23685 -106965 -78285 -99768 -148966 26882 205 -101106 -137187 -225116 -257432
14706b57432J28955J30230P202k2288q7531J07235K2090j20816o2912J7920Q5307
$$ -257432 -128477 1753 8955 -13333 -100864 6371 28461 -92355 -155267 -137347 -52040
14695e2040o5807J1014Q3295K1351m8832k3144O6300l9613Q4104M0225o9249o5188
$$ -52040 -117847 -106833 -23538 -2187 -51019 -74163 -7863 -47476 36628 76853 7604 -57584
14683e7584n3635m2004j9638L0976O3589j1364N218L976M6800r7211k8736j4390
$$ -57584 -111219 -153223 -172861 -141885 -78296 -89660 -84442 -80466 -33666 -130877 -159613 -174003
14671a74003Q2430q3732r9904j20510q8456R6566O9305P2952R0306J4662L4730
$$ -174003 -91573 -175305 -275209 -395719 -484175 -387609 -318304 -245352 -155046 -140384 -105654
14660a05654j09964J6395R0956j9165p037L8791J2654p2728Q214J11941J41644
$$ -105654 -215618 -199223 -108267 -127432 -134469 -95678 -83024 -155752 -147538 -35597 106047
14649A06047l7815q8571o9021O9639J5302M0170o2819r9093N801K3122N3644N3089
$$ 106047 68232 -20339 -89360 -19721 -4419 35751 -27068 -126161 -120360 -97238 -43594 9495
14637I495j27209R0193O7164o9446j14194l1817M7379l1771L5006l1304m9789
$$ 9495 -117714 -27521 39643 -29803 -143997 -175814 -128435 -160206 -125200 -156504 -206293
14626b06293M9801M6181J44348K1109j10828n8744o8091J8729J06609R4623r7788
$$ -206293 -156492 -110311 34037 55146 -55682 -114426 -182517 -163788 -57179 37444 -60344
14615f0344m2789Q1616P3987M1478o3168j21006j8418O8337j6165M9108j3679
$$ -60344 -103133 -21517 52470 93948 30780 -90226 -108644 -40307 -56472 -7364 -21043
14604b1043n1654N8934J7302R119N2252p9841p4494l9284q7656l5150Q6365Q6108
$$ -21043 -72697 -13763 3539 12658 64910 -14931 -89425 -128709 -216365 -251515 -165150 -79042
14592g9042k0064p88O5621L2532m4398r0299m8958N3450J30137k3806P317J33411
$$ -79042 -99106 -99894 -34273 -1741 -46139 -136438 -185396 -131946 -1809 -25615 -18298 115113
14580A15113N3172j35895o1813K6749p2698p3320J20536l3756k8220P7264k81
$$ 115113 168285 32390 -29423 -2674 -75372 -148692 -28156 -61912 -90132 -12868 -13149
14569a3149l7196K3926N3461Q3034j8725m1649L3976M7702j36995m4214M8380
$$ -13149 -50345 -26419 27042 110076 91351 49702 83678 131380 -5615 -49829 -1449
14558a449p4973J1599L9056k8050k833N2524M2490J7213m4821P870J47752l6034
$$ -1449 -76422 -64823 -25767 -53817 -56650 -4126 38364 55577 10756 18626 166378 130344
14546A30344o4463K2420j6986o0527j70651j3236J34400J40876j79578p540m3706
$$ 130344 65881 88301 71315 10788 -159863 -173099 -38699 102177 -77401 -84941 -128647
14535a28647P786O4892O0859k9309j01668l6548N778L3249n3772j3300l1926j35523
$$ -128647 -120861 -55969 4890 -24419 -126087 -162635 -156857 -123608 -177380 -190680 -222606 -358129
14523c58129M4688J36429J22126L2055P9419J33065N0039m41p7668o0098J4970
$$ -358129 -313441 -177012 -54886 -22831 56588 189653 239692 239251 161583 101485 116455
14512A16455J01916j20462j36850O7491N1686l9362Q737K7803J379j8635p5258
$$ 116455 218371 97909 -38941 28550 80236 40874 49611 77414 78793 60158 -15100
14501a5100O8917J2446q883n5216L2946k2077p9672j5210N4470J40527r9224j63447
$$ -15100 53817 66263 57380 2164 35110 13033 -66639 -81849 -27379 113148 13924 -149523
14489a49523o1530P8702K655L0775l556q4409M7385N9246l0572n1644J259N2678
$$ -149523 -211053 -132351 -129696 -98921 -102477 -186886 -139501 -80255 -110827 -162471 -161212 -108534
14477a08534M6445j549j01823j788J63245j3798n0001J14416N9700K4959n6406
$$ -108534 -62089 -63638 -165461 -167249 -4004 -17802 -67803 46613 106313 131272 74866
14466G4866n1464J7633o5286N808O6473n9314p6651N9294J4917L037l0367j19762
$$ 74866 23402 41035 -24251 -18443 48030 -11284 -87935 -28641 -13724 -10687 -41054 -160816
14454a60816M8238K19336O6610j2752p5067j03956q0618Q349N5572J40847r1893
$$ -160816 -112578 106758 173368 160616 85549 -18407 -99025 -90676 -35104 105743 13850
14443A3850l1433J03412M7476o0822o4283m3800j532R497Q3428K5324p5727o0351
$$ 13850 -17583 85829 133305 72483 8200 -35600 -37132 -27635 55793 81117 5390 -54961
14431e4961n0314R619q2679m4996O1399M9799M8637p3O0677J2911n3381L558p1528
$$ -54961 -105275 -95656 -178335 -223331 -161932 -112133 -63496 -63569 -2892 10019 -43362 -39804 -111332
14418a11332J9701O5331l2557P5309k7984j29998m243k0765p8335k7593J681J55515
$$ -111332 -91631 -26300 -58857 16452 -11532 -141530 -145773 -166538 -244873 -272466 -270785 -115270
14406a15270P402p7721N6205J3326L209m4914N2682P1151q4723l486Q5815Q2292
$$ -115270 -107868 -185589 -129384 -116058 -112849 -157763 -105081 -33930 -118653 -122139 -36324 45968
14394D5968j7381r316Q4998O7812p5824j51891l3332N4758l598O1317k9614L503
$$ 45968 28587 19271 104269 172081 96257 -55634 -88966 -34208 -37806 23511 -6103 -2600
14382b600J10458J45083o8828j64548K4993j5860n2436N2796P3648K559r4329
$$ -2600 107858 252941 184113 19565 44558 28698 -23738 29058 102706 105265 10936
14371A0936q6434L5307p7190p5855m9521L611J07633J26712q93J53552j147j55759
$$ 10936 -75498 -40191 -117381 -193236 -242757 -239146 -131513 -4801 -5694 147858 146711 -9048
14359i048m2261J16946J06559K9830j82708j59747N4463Q2282p3279p0783K478
$$ -9048 -51309 65637 172196 202026 19318 -140429 -85966 -3684 -76963 -147746 -145268
14348a45268P7394K2892o2220j22253L6819M9424o2584P3677R0803J29701l2775
$$ -145268 -67874 -44982 -107202 -229455 -192636 -143212 -205796 -132119 -41316 88385 55610
14337E5610r3610n168m7419r5989j56493K1259J78925J42216j31q5136q6386n8204
$$ 55610 -38000 -43168 -90587 -186576 -343069 -321810 -142885 -669 -800 -85936 -172322 -230526
14325b30526P7384J0694j3179L8305K9234J6950l1939J8733o9511J20286N2763
$$ -230526 -153142 -142448 -155627 -117322 -88088 -71138 -103077 -84344 -153855 -33569 19194
14314A9194o3098P6301L9866n6894j18904r8921J9689Q2833k7230M1302J6545
$$ 19194 -43904 32397 72263 15369 -103535 -202456 -182767 -99934 -127164 -85862 -69317
14303f9317n1491M9154L0209N5424J49998r4356N1900m3932j21321j7242j5086
$$ -69317 -120808 -71654 -41445 13979 163977 69621 121521 77589 -43732 -60974 -76060
14292g6060j41937m5160Q6054j4614p371j9860J85766J55297O9605j7428m0688
$$ -76060 -217997 -263157 -177103 -191717 -199088 -218948 -33182 122115 191720 174292 133604
14281A33604j4725K9470k0620P269K8958n4963j28488q0973L4935K2241m5383
$$ 133604 118879 148349 127729 134998 163956 108993 -19495 -100468 -65533 -43292 -88675
14270h8675P1760J24961m0121m4246l9742l619n1284m5720K3388O5672J01314
$$ -88675 -16915 108046 67925 23679 -16063 -19682 -70966 -116686 -93298 -27626 73688
14259G3688l3644P0256n1144j17312K7221K9096J1247M3448m9498l8700R1575
$$ 73688 40044 110300 59156 -58156 -30935 -1839 9408 52856 3358 -35342 56233
14248E6233L2084J01003l7358j77215o0980O8332M9497n7785L2415k3913j07137
$$ 56233 88317 189320 151962 -25253 -86233 -17901 31596 -26189 6226 -17687 -124824
14237a24824k5539j15510R602J8838J19037K13959j4247k3800M191n7394n1869
$$ -124824 -150363 -265873 -256271 -237433 -118396 95563 81316 57516 61707 4313 -47556
14226d7556l4119k285M5306k2705O8816M1207j9679J4151l3199M6772l6373k5490
$$ -47556 -81675 -83960 -38654 -61359 7457 48664 28985 43136 9937 56709 20336 -5154
14214e154j4653j0358k6343j40334o4323J46237R5215N6274o4723P9962n3724
$$ -5154 -19807 -30165 -56508 -196842 -261165 -114928 -19713 36561 -28162 51800 -1924
14203a924q058J4480p7181M3610K7960L7880J26743o5801r0145n0122Q279r1210
$$ -1924 -9982 4498 -72683 -29073 -1113 36767 163510 97709 7564 -42558 -34279 -125489
14191a25489j42471R9975n5236k2871N8326J2801N1870N9004M2239O9363J8823
$$ -125489 -267960 -167985 -223221 -246092 -187766 -174965 -123095 -64091 -21852 47511 66334
14180F6334Q4241K6931q1017K648k6297j03440r112N007J16267Q8470k6951r8039
$$ 66334 150575 177506 96489 99137 72840 -30600 -39712 -34705 81562 170032 143081 45042
14168D5042o4894r9135m966M1197J9878J040m1676o8244p0368Q6615J51155p2562
$$ 45042 -19852 -118987 -123953 -82756 -62878 -61838 -103514 -171758 -242126 -155511 -4356 -76918
14156g6918j86566k5428L6208J7644J01796Q6708J13917J1147j30969p4875M6750
$$ -76918 -263484 -288912 -252704 -235060 -133264 -46556 67361 78508 -52461 -127336 -80586
14145h0586Q5847l6504q0125J30037Q7458m5961k3793p2760O2532R642k8998p7140
$$ -80586 5261 -31243 -111368 18669 106127 60166 36373 -36387 26145 35787 6789 -70351
14133g0351q424J7704L8474Q8338L073o36J22548K6972j01880o6991o2475j13088
$$ -70351 -78775 -61071 -22597 65741 68814 68178 190726 217698 115818 48827 -13648 -126736
14121a26736k1700J42388J69586K5688p5789q4924M0541N3531M8048j30027o9551
$$ -126736 -148436 -6048 163538 189226 113437 28513 69054 122585 170633 40606 -28945
14110b8945l3436p5085j708P0614Q300Q7807O6781K4401l4653j8067k8798m3774
$$ -28945 -62381 -137466 -139174 -68560 -60260 27547 94328 118729 84076 66009 37211 -6563
14098f563l2145K2863J154m418q151L0603P1439j7582L3214J5603k2148R2351
$$ -6563 -38708 -15845 -14691 -19109 -27260 3343 74782 57200 90414 106017 83869 176220
14086A76220J80930M66j68869j23503l758O796j16200q808M4910k3981Q5242K843
$$ 176220 357150 357616 188747 65244 61486 68282 -47918 -56726 -11816 -35797 49445 52288
14074E2288J9568j5888O1488k4027j21578j1287M0814m6047q1144j2118K6598
$$ 52288 71856 55968 117456 93429 -28149 -39436 1378 -44669 -125813 -137931 -111333
14063a11333P427N7601J41592N0855L5679n8802K2699J6479j27183j18809j21839
$$ -111333 -103906 -46305 95287 146142 181821 123019 145718 162197 35014 -83795 -205634
14052b05634J1308J56241L4769K0730q0955j43979r777n933J48105J52368N4635
$$ -205634 -194326 -38085 -3316 17414 -63541 -207520 -217297 -223230 -75125 77243 131878
14041A31878j7311o6919L9827K544m9233o1880J4700J30609o2539p563J7256m9787
$$ 131878 114567 47648 87475 90019 40786 -21094 -6394 124215 61676 54113 71369 21582
14029B1582M5466L1697k0516Q0614o9959p5844r5350j07587n6002J45805K9262
$$ 21582 67048 98745 78229 158843 88884 13040 -82310 -189897 -245899 -100094 -70832
14018g0832J01492J13525q7985r9278r8424M8036N3525N8057Q9281L2357O94J9366
$$ -70832 30660 144185 56200 -43078 -141502 -93466 -39941 18116 107397 139754 140448 159814
14006A59814K9736j36298r271J1416L6949r7699k688k5592p153K424j38298L9667
$$ 159814 189550 53252 43981 55397 92346 -5353 -8041 -33633 -40786 -38362 -176660 -136993
13994a36993O7573J06955N4526n8264K9623M0056p3276n2967O1521k3964r5823
$$ -136993 -69420 37535 92061 33797 63420 103476 30200 -22767 38754 14790 -81033
13983h1033M6982r5316n0330J4549Q9519R944K2565L2917R925p2128Q9890N5563
$$ -81033 -34051 -129367 -179697 -165148 -75629 -65685 -43120 -10203 -278 -72406 17484 73047
13971G3047k2320n6927p0151K8059N2258l2745K4585n8416p5129L7593P7797Q6550
$$ 73047 50727 -6200 -76351 -48292 3966 -28779 -4194 -62610 -137739 -100146 -22349 64201
13959F4201R0868k683m720n9573m0530p1567k586m5351l5110M7662p8130l5898
$$ 64201 155069 152386 147666 88093 47563 -24004 -26590 -71941 -107051 -59389 -137519 -173417
13947a73417J05786P8556j3980k1414K6642m5703K6336k9186K1859n6825k3714
$$ -173417 -67631 10925 -3055 -24469 2173 -43530 -17194 -46380 -24521 -81346 -105060
13936a05060p1962K8672J48298M6207o9537m9500J08702N0081l4024q1777j09768
$$ -105060 -177022 -148350 -52 46155 -23382 -72882 35820 85901 51877 -29900 -139668
13925a39668r844K0344l6004Q0565M3828J09428L5873m226r1539m1524J30549
$$ -139668 -149512 -129168 -165172 -84607 -40779 68649 104522 100296 8757 -32767 97782
13914I7782J7166j06078k87M7485P9910J6824j6777q4259l8490o1547j17951J4803
$$ 97782 114948 8870 8583 56068 135978 152802 136025 51766 13276 -48271 -166222 -151419
13902a51419J71115K420o8770k517j4212L4386J59863j2516q3069q2426N4323
$$ -151419 19696 22116 -46654 -49171 -63383 -28997 130866 118350 35281 -47145 7178
13891G178m5170n2455p6358o8839N5332J04793m724n3826J9843P4002M127r6376
$$ 7178 -37992 -90447 -166805 -235644 -180312 -75519 -80243 -134069 -114226 -40224 -36097 -132473
13879a32473M4237l3352R3055M2501p3311k8292n979M1642l2601n7406O8202P9798
$$ -132473 -88236 -121588 -28533 13968 -59343 -87635 -93614 -51972 -84573 -141979 -73777 6021
13867F021M5208L4954l9549J11983l3551R245K9612j4512m9605R9413J2227q8795
$$ 6021 51229 86183 46634 158617 125066 134311 163923 149411 99806 199219 211446 122651
13855A22651K8892r1955L2967L2498j52502l1301Q2863J11384o9079l9222K2558
$$ 122651 151543 59588 92555 125053 -27449 -58750 24113 135497 66418 27196 49754
13844D9754q0433k9911j4410J9154L4258j03358k2997M0928N7451P6201r5041
$$ 49754 -30679 -60590 -75000 -55846 -21588 -124946 -147943 -107015 -49564 26637 -68404
13833f8404l236J04948k438j83649L797J04911P0261M7908n7077j59443k7331
$$ -68404 -71640 33308 30870 -152779 -148982 -44071 26190 74098 17021 -142422 -169753
13822a69753J65013R7746r6363j82120R3169P2010Q336n0975P184O5462N9930
$$ -169753 -4740 93006 -3357 -185477 -92308 -20298 -11962 -62937 -55753 9709 69639
13811F9639M955J5501m419j5690j4411l9696k8425m5912o0374k5020j6107N5030
$$ 69639 74594 90095 85676 69986 55575 15879 -12546 -58458 -118832 -143852 -159959 -104929
13799a04929J87417q876p8576Q3582P2453j01654r8110o5576l0682J6699M147
$$ -104929 82488 73612 -4964 78618 151071 49417 -48693 -114269 -144951 -128252 -124105
13788a24105j8059J07317L5405k0235O8523l2561n0782O6589Q274L7944L2510
$$ -124105 -142164 -34847 558 -19677 48846 16285 -34497 32092 40366 78310 110820
13777A10820j0640P4009j9175m6316K2256n4434j22836n4689N3265l77Q6967P1434
$$ 110820 100180 174189 155014 108698 130954 76520 -46316 -101005 -47740 -48117 38850 110284
13765A10284N108L0699P9311k9033m0568j6750k9111r4979N2209o3494p7221J4686
$$ 110284 115392 146091 225402 196369 155801 139051 109940 14961 67170 3676 -73545 -58859
13753e8859R8251n5294j25954K3486p62r214p8839m4892L6008J42535M7509K5185
$$ -58859 39392 -15902 -141856 -118370 -119132 -128346 -207185 -252077 -216069 -73534 -26025 -840
13741h40j00048j83357k1392J40730J75188k3865l0417j8323M9038O378N3732
$$ -840 -100888 -284245 -305637 -164907 10281 -13584 -44001 -62324 -13286 -6908 46824
13730D6824K2159q3216o5299m3529J3923J4989Q103N2351O5362l1066M2978j3037
$$ 46824 68983 -14233 -79532 -123061 -109138 -94149 -86046 -33695 31667 601 43579 30542
13718C0542j9769O7619R5311m1312m3470l2629L2307q7193j28270O4221N0619
$$ 30542 10773 78392 173703 132391 88921 56292 88599 1406 -126864 -62643 -12024
13707a2024K5180n5714m9246M4859p2922O7110N3324M0759M2993k2287j28941
$$ -12024 13156 -42558 -91804 -46945 -119867 -52757 567 41326 84319 62032 -66909
13696f6909J9093L242P5979Q6562l34j7492l5348p4719L710J04708l3139j80941
$$ -66909 -47816 -44574 31405 117967 117633 100141 64793 -9926 -6216 98492 65353 -115588
13684a15588O5411l310j326O8197K3442p1407k0774J01317R3249P7757j00639
$$ -115588 -50177 -53487 -54813 13384 36826 -34581 -55355 45962 139211 216968 116329
13673A16329K9849P3936M552j38922q4482m4385q6676r8144m207n551J26755K8201
$$ 116329 146178 220114 224666 85744 1262 -43123 -129799 -227943 -232150 -237701 -110946 -82745
13661h2745P854J35150j01504m4236J9625r46K5308Q3665M9277K4634r3325p4775
$$ -82745 -74891 60259 -41245 -85481 -65856 -66802 -41494 42171 91448 116082 22757 -52018
13649e2018K4606K1683j69017K0436R9049P0739K8131Q8473p2673j7388j29200
$$ -52018 -27412 -5729 -174746 -154310 -55261 15478 43609 132082 59409 42021 -87179
13638h7179m9138N1567L864o6464O0338N2970P8500R2837N51o9587P7917j43788
$$ -87179 -136317 -84750 -80886 -147350 -87012 -34042 44458 137295 137846 68259 146176 2388
13626B388n6292Q0564J5461p8923K528J10989O2120R172P2143j18714j66771p5687
$$ 2388 -53904 26660 42121 -36802 -34274 76715 138835 148007 220150 101436 -65335 -141022
13614a41022l3915q332K0748J30461p080L7645R4479J55510p9734m4827m3936
$$ -141022 -174937 -183269 -162521 -32060 -39140 -1495 92984 248494 168760 123933 79997
13603G9997o1951j80500K1663N5588q3056q8667M0900j4672J46007J13833o3037
$$ 79997 18046 -162454 -140791 -85203 -168259 -256926 -216026 -230698 -84691 29142 -33895
13592c3895j846q968j11864r0793N4983J92461J21713o5229N8265m8412j62533
$$ -33895 -35741 -44709 -156573 -247366 -192383 78 121791 56562 114827 66415 -96118
13581i6118J2645O2485O8025L0807n6982j12058M6648O2707j3892j03555k8675
$$ -96118 -83473 -20988 47037 77844 20862 -91196 -44548 18159 4267 -99288 -127963
13570a27963J0269J4450M7889l2939j05304K609R6889j13P916L4071J04435R3988
$$ -127963 -117694 -103244 -55355 -88294 -193598 -190989 -94100 -94213 -86297 -52226 52209 146197
13558A46197L2212O6216j3264m5306l58j57249j54930q11M4738P9169Q3659L2980
$$ 146197 178409 244625 231361 186055 185697 28448 -126482 -127293 -82555 -3386 80273 113253
13546A13253n3350N9045m3181L015p0406J0151J38708R1862j39810j53116m6747
$$ 113253 59903 118948 75767 78782 8376 18527 157235 249097 109287 -43829 -90576
13535i0576l3816P6918K4111K4836j8119N2269m1891l3908l7451M1762L7121O3215
$$ -90576 -124392 -47474 -23363 1473 -16646 35623 -6268 -40176 -77627 -35865 1256 64471
13523F4471j10947n8351Q2823R216J42945O812m6626n5876j7641K4141q6505j6334
$$ 64471 -46476 -104827 -22004 -12788 130157 136969 90343 34467 16826 40967 -45538 -61872
13511f1872P0541o321j8786p0936j09016R6968M9059Q075N8963J3657p7315J3324
$$ -61872 8669 2348 -16438 -87374 -196390 -99422 -50363 -42288 16675 30332 -46983 -33659
13499c3659O3644J3490l4513j3878R2753P9382j1267j35737j33639p6352J22422
$$ -33659 29985 43475 8962 -4916 87837 167219 155952 20215 -113424 -189776 -67354
13488f7354L4025L913o5136m4419m7653q3978K9294J13182L6504l7641L587j8578
$$ -67354 -33329 -29416 -94552 -138971 -186624 -270602 -241308 -128126 -91622 -129263 -125676 -144254
13476a44254l4807l1019k6681q2923N5659P0104O383o6692p249J64960m9607j08938
$$ -144254 -179061 -210080 -236761 -319684 -264025 -193921 -187538 -254230 -261479 -96519 -146126 -255064
13464b55064J17711J48296Q5181j43134j56287L0734L5407J18906R4060L2982
$$ -255064 -137353 10943 96124 -47010 -203297 -172563 -137156 -18250 75810 108792
13454A08792j21551K7750r652n5552k9566l3183J43607k4594j47713K2110K7689
$$ 108792 -12759 14991 5339 -50213 -79779 -112962 30645 6051 -141662 -119552 -91863
13443i1863k3604P5893Q308q9818N0561m3284K5683J4209n0590j0330M3479J37892
$$ -91863 -115467 -39574 -31266 -121084 -70523 -113807 -88124 -73915 -124505 -134835 -91356 46536
13431D6536J20421o7253p0617J6298M9478q335j42305p4001O6250Q3287Q1549
$$ 46536 166957 99704 29087 45385 94863 86528 -55777 -129778 -63528 19759 101308
13420A01308J0610j08867o8479M1912L335p4770K0613J15726R4043J00149p4793
$$ 101308 111918 3051 -65428 -23516 -20181 -94951 -74338 41388 135431 235580 160787
13409A60787r2752r1171k1314P5808o811j28219o9102L6060J34755O4202l8819
$$ 160787 68035 -23136 -44450 31358 24547 -103672 -172774 -136714 -1959 62243 23424
13398B3424o0194J1555J6747l9134K6322k6831q7779m5673J9805K60K3455K30055
$$ 23424 -36770 -25215 -8468 -47602 -21280 -48111 -135890 -181563 -161758 -161498 -138043 92012
13386I2012Q7853j8604l6537q2926j35377n9789O111J33421M4349N2633l1965
$$ 92012 179865 161261 124724 41798 -93579 -153368 -147257 -13836 30513 83146 51181
13375E1181o3991r9184l610Q0592L4142K7110k3899j8071k9996k6578K4136M9977
$$ 51181 -12810 -111994 -115604 -35012 -870 26240 2341 -15730 -45726 -72304 -48168 1809
13363A809l5552P7759j9610j02568m884R9724O7825j8884o2842l1803J0125o1554
$$ 1809 -33743 44016 24406 -78162 -83046 16678 84503 65619 2777 -29026 -18901 -80455
13351h0455J2002K5706l2374L9620L5873M1218p2285j57667n0578Q6277N1916
$$ -80455 -68453 -42747 -75121 -35501 372 41590 -30695 -188362 -238940 -152663 -100747
13340a00747J6057M7926J45717K1432j27676n7803N921n5804K4676L6709o9950
$$ -100747 -84690 -36764 108953 130385 2709 -55094 -49173 -104977 -80301 -43592 -113542
13329a13542M3947K4590r5455q8697R2180P9811Q8478m7052p4698R476L1171R5412
$$ -113542 -69595 -45005 -140460 -229157 -136977 -57166 31312 -15740 -90438 -80962 -49791 45621
13317D5621m43P7701j6006q4420J04124Q3605n091K4321r0707j36589p6111K3268
$$ 45621 45178 122879 106873 22453 126577 210182 205091 229412 138705 2116 -73995 -50727
13305e0727J3083J18106J1720l7971p3495o0019J31634J30928K55j26534m262
$$ -50727 -37644 80462 92182 54211 -19284 -79303 52331 183259 183514 56980 52718
13294E2718J7516L3738M2932j10662j24259J882O6098K9328j25669k6537k7214
$$ 52718 70234 103972 146904 36242 -88017 -86135 -20037 9291 -116378 -142915 -170129
13283a70129n4873r0170O1691m303j0236P9759J69472J33042k603n9414k6499
$$ -170129 -225002 -315172 -253481 -257784 -268020 -188261 -18789 114253 111650 52236 25737
13272B5737P0121k779p1259k4719J9836M7959q681n8847q7962m7435R7697N5788
$$ 25737 95858 93079 21820 -2899 16937 64896 56215 -2632 -90594 -138029 -40332 15456
13260A5456k56q907M7185q4507k1238M3448L2216J42654K7069M73L2525n886k1843
$$ 15456 15200 6293 53478 -31029 -52267 -8819 23397 166051 193120 193593 226118 220232 198389
13247A98389m9799j26310m158O2076K2694j14190l8419M3189J2769n0523Q4885
$$ 198389 148590 22280 18122 80198 102892 -11298 -49717 -6528 6241 -44282 40603
13236D0603L9722N9305l1296q4448k9309l3087n3236N6765K2049l7549J8464n0854
$$ 40603 80325 139630 108334 23886 -5423 -38510 -91746 -34981 -12932 -50481 -32017 -82871
13224h2871o9474m2710o3543j42426K0022J51769J84632Q7261q8800n0744l678
$$ -82871 -152345 -195055 -258598 -401024 -381002 -229233 -44601 42660 -46140 -96884 -100562
13213a00562M7143J34954l1585k3463K5322j3273N5066J43Q358l844o9950q2266
$$ -100562 -53419 81535 49950 26487 51809 38536 93602 93745 102103 98259 28309 -53957
13201e3957l0678N7404O1253m2827k1840J30553j677j30875o0485n153K4047k3521
$$ -53957 -84635 -27231 34022 -8805 -30645 99908 98231 -32644 -93129 -98282 -74235 -97756
13189i7756N3149n5654l5976j5256m9316N5956J9767p904O009m1984J07728n5474
$$ -97756 -44607 -100261 -136237 -151493 -200809 -144853 -125086 -132990 -126981 -168965 -61237 -116711
13177a16711m7256Q5786k295q7629m9018J04290J72333N174p6810n8244m3591
$$ -116711 -163967 -78181 -80476 -168105 -217123 -112833 59500 64674 -12136 -70380 -113971
13166a13971o0119K2320M9822J18754N2808M2065k9766L7426k0869K7K7212L7637
$$ -113971 -174090 -151770 -101948 16806 69614 111679 81913 119339 98470 98497 125709 163346
13154A63346M7631k0384n7510n1011L974q0565m2012J05218R9205l5699L9124
$$ 163346 210977 190593 133083 82072 86046 5481 -36531 68687 167892 132193 171317
13143A71317J33076j17452k01144o2955q8488L797j5091M4616R2393O4591l1146
$$ 171317 304393 186941 -14203 -77158 -165646 -161849 -176940 -132324 -39931 24660 -6486
13132f486n9000l1124J8072l7508M4913k3331l6160M6668n7466L1604J14530l4198
$$ -6486 -65486 -96610 -78538 -116046 -71133 -94464 -130624 -83956 -141422 -109818 4712 -29486
13120b9486k362r0668k6365J38000M8140k8484Q436J3317L0668Q961q667m7550
$$ -29486 -31848 -122516 -148881 -10881 37259 8775 17211 30528 61196 70157 61490 13940
13108A3940K373N3972N3366p1952o7370P7118J59856J27111q9733r8010j11093
$$ 13940 16313 70285 123651 51699 -15671 61447 221303 348414 258681 160671 49578
13097D9578r1309M8418O3493J2002q281n728l7056l8657j14027K7192K0837l8362
$$ 49578 -41731 6687 70180 82182 73901 68173 31117 -7540 -121567 -94375 -73538 -111900
13085a11900O6588L8595K9542O141j06475q5261O2379L1972K9475L5971j3660
$$ -111900 -45312 -6717 22825 28966 -77509 -162770 -100391 -68419 -38944 -2973 -16633
13074a6633o6319j45699P0065J29910m5548j6889M5905n9918p7291O4088L6953
$$ -16633 -82952 -228651 -158586 -28676 -74224 -91113 -45208 -105126 -182417 -118329 -81376
13063h1376k2891N9680Q2661k3661P0398o7378k1533R4261j1982j2974o7510N3489
$$ -81376 -104267 -44587 38074 14413 84811 17433 -4100 90161 78179 65205 -2305 51184
13051E1184L183J19086j622K1596k15758j26049N9366M3158J675m383L3048q193
$$ 51184 54367 173453 171831 193427 -22331 -148380 -89014 -45856 -44181 -48564 -15516 -23709
13039b3709K369O3147m0850n8551K7098q686k2246P3617J06917N3160q9351j30547
$$ -23709 -21340 41807 957 -57594 -30496 -39182 -61428 12189 119106 172266 82915 -47632
13027d7632p1592J2260Q0115O5800j9426J14803o986j55221j29851O6675J00897
$$ -47632 -119224 -106964 -26849 38951 19525 134328 127342 -27879 -157730 -91055 9842
13016I842N9438q099J0335P7942j31509J7453K1423K1346Q2541n9333n2711p9483
$$ 9842 69280 61181 71516 149458 17949 35402 56825 78171 160712 101379 48668 -30815
13004c0815k09318J23915J30285n4055j8936L9429L6476j8674n09J9823l5064
$$ -30815 -240133 -116218 14067 -39988 -58924 -19495 16981 -1693 -2202 17621 -17443
12993a7443P792J5511j1371l9490k9743J0708K0086J2743r2115l2925P1238J25987
$$ -17443 -9651 5860 -5511 -45001 -74744 -64036 -43950 -31207 -123322 -156247 -85009 40978
12981D0978k2785l611L4035n8069J452P8232M3430K760o5237L609J05796J4904
$$ 40978 18193 14582 48617 -9452 -8000 70232 113662 116422 51185 54794 160590 175494
12969A75494m6267L2544o266K7925l4675l1997L2034l9764j57699j20740P6268
$$ 175494 129227 161771 155505 183430 148755 116758 148792 109028 -48671 -169411 -93143
12958i3143l4381J40253J19849L0693N837K3313p4391j01096l0165L3315L483
$$ -93143 -127524 12729 132578 163271 169108 192421 118030 16934 -13231 20084 23567
12947B3567p3800P5271K1173p434J1929j1505q4684L9981M5599q76J03309J3602
$$ 23567 -50233 25038 46211 38777 50706 39201 -45483 -5502 40097 39221 142530 156132
12935A56132j30068l7683J0282m5899J4203K2888p0881r3883L5912O4178j3178
$$ 156132 26064 -11619 -1337 -47236 -33033 -10145 -81026 -174909 -138997 -74819 -87997
12924h7997L5269K0831k5696Q6066J9021j3068o1878j50562r0898J79290J68573
$$ -87997 -52728 -31897 -57593 28473 47494 34426 -27452 -178014 -268912 -89622 78951
12913G8951J9666j58347j06021K4197J12341O9552k5407m1784J3685j408j96m4806
$$ 78951 98617 -59730 -165751 -141554 -29213 40339 14932 -26852 -13167 -14575 -14771 -59577
12901e9577j8579Q582K3720k419P1880N7978j5099q3090j50066n8478L6928J66152
$$ -59577 -78156 -69574 -45854 -48273 23607 81585 66486 -16604 -166670 -225148 -188220 -22068
12889b2068M4518j1625p7252M567J12546j6249m9539l8343O1479L6259N1566J46108
$$ -22068 22450 10825 -66427 -61860 50686 34437 -15102 -53445 8034 44293 95859 241967
12877B41967L9281j08767j7547L4269n6979j05541j43011J20896J25842M2713
$$ 241967 281248 172481 154934 189203 132224 26683 -116328 4568 130410 173123
12867A73123L5014K2792n5223j20966m4206K8813M8889j24737M5408R0239K3526
$$ 173123 208137 230929 175706 54740 10534 39347 88236 -36501 8907 99146 122672
12856A22672p3985j38906J0213M6799j5908K9322j1207n7184K6835m0084O0587
$$ 122672 48687 -90219 -80006 -33207 -49115 -19793 -31000 -88184 -61349 -101433 -40846
12845d0846M4699J2345l449n4324M6658K7760j33104m4105N3925j02023J6996
$$ -40846 3853 16198 12749 -41575 5083 32843 -100261 -144366 -90441 -192464 -175468
12834a75468L2119J19934K8135m8587j67289o180N3634K932n146L9306M2136k2385
$$ -175468 -143349 -23415 4720 -43867 -211156 -217336 -163702 -160770 -165916 -126610 -84474 -106859
12822a06859q927J30900o8719j9736L9949l7712q5518J68843Q6301O1845N3176
$$ -106859 -115786 15114 -53605 -73341 -33392 -71104 -156622 12221 98522 160367 213543
12811B13543l2275o9104o3274r8191M2590J4707P005p5169j6124q3302K3805K4128
$$ 213543 181268 112164 48890 -49301 -6711 7996 15001 -60168 -76292 -159594 -135789 -111661
12799a11661O8656J057j6242P6429J08804R5084j51907j01895j9337l6192O8604
$$ -111661 -43005 -41948 -58190 18239 127043 222127 70220 -31675 -51012 -87204 -18600
12788a8600J0823L0217P6255M7820m6012j0920p1781m0961l325K6863J75793n3325
$$ -18600 -7777 22440 98695 146515 100503 89583 17802 -23159 -26484 379 176172 122847
12776A22847j28452O1293J32633k2059j19341j19749O0416L8864q085Q5922M1997
$$ 122847 -5605 55688 188321 166262 46921 -72828 -12412 26452 18367 104289 146286
12765A46286r8852q1933o9398j2456l9424k6674P7123N3931j29957L703Q1754
$$ 146286 47434 -34499 -103897 -116353 -155777 -182451 -105328 -51397 -181354 -177651 -95897
12754i5897j7089j8927M7787M7228j482N5788L5268j38727q1727P7179R7628J6771
$$ -95897 -112986 -131913 -84126 -36898 -38380 17408 52676 -86051 -167778 -90599 7029 23800
12742B3800l8024l8573M2946K1093j3024J3951L4350Q2394j5296P099K4322n6356
$$ 23800 -14224 -52797 -9851 11242 -1782 12169 46519 128913 113617 120716 145038 88682
12730H8682J15216m9879l4319o699K8635q7524l3525L3376K4250j3852O8369p1214
$$ 88682 203898 154019 119700 113001 141636 54112 20587 53963 78213 64361 132730 61516
12718F1516P485l8810k2222K3999j2020P22l7598m6534O1719J03695O6074n1706
$$ 61516 69001 30191 7969 31968 19948 20670 -16928 -63462 -1743 101952 168026 116320
12706A16320q1396n0217N3799m8445N7071j04146j9313K6493P7737O5326k9214
$$ 116320 34924 -15293 38506 -9939 47132 -57014 -76327 -49834 27903 93229 64015
12695F4015P4446m4086M0261K0613k4024o4302m9233j76109j7727J17033J5013
$$ 64015 138461 94375 134636 155249 131225 66923 17690 -158419 -176146 -59113 -44100
12684d4100L8341N7696j8158m0148M2169J06941L4905j39927r8747o4235L0139
$$ -44100 -5759 51937 33779 -6369 35800 142741 177646 37719 -61028 -125263 -95124
12673i5124k5738L5758N295J5624P3616R4152l362p5436N9373J54193k2248o8088
$$ -95124 -120862 -85104 -79809 -64185 9431 103583 100221 24785 84158 238351 216103 148015
12661A48015j53381n018m8632l8165J6392k0040j929Q711K9162k2115Q7969N0148
$$ 148015 -5366 -10384 -59016 -97181 -80789 -100829 -102758 -94047 -64885 -87000 969 51117
12649E1117J4491j01296O742O0008M8785m7488j9621N1995j7114Q1424O0807n2260
$$ 51117 65608 -35688 -28946 31062 79847 32359 12738 64733 47619 129043 189850 137590
12637A37590j4499L5575j8441j7039j466m7774P6402l6223l6890j14436R226P5727
$$ 137590 123091 158666 140225 123186 121720 73946 150348 114125 77235 -37201 -27975 47752
12625D7752L4078m3827K2826J765K4933L4501M4532n3031j20017k5179k6899M6729
$$ 47752 81830 38003 60829 62594 87527 122028 166560 113529 -6488 -31667 -58566 -11837
12613a1837J67402j31157J5620K8140q1140o7759O0641R0156j1131j12138N2222
$$ -11837 155565 24408 40028 68168 -12972 -80731 -20090 70066 58935 -53203 -981
12602i81Q2855l6356l0125p0941j8117K6000N6558k5559r0352k2729j13094R7230
$$ -981 81874 45518 15393 -55548 -73665 -47665 8893 -16666 -107018 -129747 -242841 -145611
12590a45611J62493m2183m7635M0804R0665j66051l3474q284j9761K308L0421
$$ -145611 16882 -25301 -72936 -32132 58533 -107518 -140992 -149276 -169037 -166729 -136308
12579a36308P488J24937N1977k7874o595j9002J6512J5154N8504k4105L2780o5226
$$ -136308 -128820 -3883 48094 20220 13625 -5377 11135 26289 84793 60688 93468 28242
12567B8242j94069J9652M2259M0955P1544k23L8098r388k2849j22446j2212P0499
$$ 28242 -165827 -146175 -103916 -62961 8583 8360 46458 37070 14221 -108225 -120437 -49938
12555d9938K1361j6264R7546Q0808L1149R469m5384j6065k0021N7662J04440m9322
$$ -49938 -28577 -44841 52705 133513 164662 174131 128747 112682 92661 150323 254763 205441
12543B05441j35769j12784j23305J00155M4372m3486j28491Q7615O6619j4815
$$ 205441 69672 -43112 -166417 -66262 -21890 -65376 -193867 -106252 -39633 -54448
12533e4448J8013q502L6498r5212N9429J24145N4612o1927m8789O6314j0522K3846
$$ -54448 -36435 -44937 -8439 -103651 -44222 79923 134535 72608 23819 90133 79611 103457
12521A03457L1971O684N8877j11823k3667K828p3738K6348p1094k2250p6212K1436
$$ 103457 135428 142112 200989 89166 65499 68327 -5411 20937 -50157 -72407 -148619 -127183
12509a27183L3121O3781P2513n0706J9119P1586o4039J5124M9557r434K6718O5522
$$ -127183 -94062 -30281 42232 -8474 10645 82231 18192 33316 82873 73439 100157 165679
12497A65679K7542r0116O214N0843p9240q3248Q8945q9621l7611K9117J3696K342
$$ 165679 193221 103105 109319 160162 80922 -2326 86619 -3002 -40613 -11496 2200 4542
12485D542K3596j41970N9818O3600J472K8544l1035K1811l917L5320M1378L2002
$$ 4542 28138 -113832 -54014 9586 11058 39602 8567 30378 26461 61781 103159 135161
12473A35161J6216n3323j19977M3603O3422m0128j2743j5434K9968r4759q6868
$$ 135161 151377 98054 -21923 21680 85102 44974 32231 16797 46765 -47994 -134862
12462a34862j1134J940L001L4508K9825r4538K7597J38180J2502j06677J0429
$$ -134862 -145996 -144056 -141055 -106547 -76722 -171260 -143663 -5483 7019 -99658 -89229
12451h9229k324K7036J49484o1112j11497O3943M5280j4795M38P812p6299L7475
$$ -89229 -91553 -64517 84967 23855 -87642 -23699 21581 6786 7224 15036 -61263 -23788
12439b3788J0580l8986Q182L0889J30330j2862o3013j18615j07999j24N3586K6117
$$ -23788 -13208 -52194 -44012 -13123 117207 104345 41332 -77283 -185282 -185406 -131820 -105703
12427a05703N6788O2028q3358o3389Q5568J08690n1724j44972M7377N7419N0018
$$ -105703 -48915 13113 -70245 -133634 -48066 60624 8900 -136072 -88695 -31276 18742
12416A8742M8429O8625N7158j02295q316L6134q0855j09312l1897K06703K0897
$$ 18742 67171 135796 192954 90659 82343 118477 37622 -71690 -103587 103116 124013
12405A24013j48671j8420n0780J56398L4704j12105k5013j44093N6864N7394L4424
$$ 124013 -24658 -43078 -93858 62540 97244 -14861 -39874 -183967 -127103 -69709 -35285
12394c5285o4900l2047J17113K7985P1073m5503r0708o4821P8554R1913L0885
$$ -35285 -100185 -132232 -15119 12866 83939 38436 -52272 -117093 -38539 53374 84259
12383H4259J5338j62351Q769J64299k8083p1540N5331M9896Q6376j4457j09359
$$ 84259 99597 -62754 -53985 110314 82231 10691 66022 115918 202294 187837 78478
12372G8478j4811J10527n6563o1064j8239o1910L3047R7891M8713J01396N7573
$$ 78478 63667 174194 117631 56567 38328 -23582 9465 107356 156069 257465 315038
12361C15038j6714q3877j42546j63389J6406j8062l3283j4049P4196Q2027j4814
$$ 315038 298324 214447 71901 -91488 -75082 -93144 -126427 -140476 -66280 15747 933
12350I33O7092O635J6089j908K0813j9003P0831M7489n3789q2119L4687J44731
$$ 933 68025 74660 90749 88841 109654 90651 161482 208971 155182 73063 107750 252481
12338B52481P2806r0958j4561p99P087k6300n0168j57688k4510P7267O5894q8602
$$ 252481 325287 234329 219768 218969 226056 199756 149588 -8100 -32610 44657 110551 21949
12326B1949n2646o2213r236N0392R7832r713m9952P0743p834j9795j01880p564
$$ 21949 -30697 -92910 -102146 -51754 46078 36365 -13587 57156 49322 29527 -72353 -79917
12314g9917M7876O2838J01740J8893k8035l3940o0267j08205K2877J53657J64
$$ -79917 -32041 30797 132537 151430 123395 89455 29188 -79017 -56140 97517 97681
12303I7681l9597J8068M104k1954L0145N5109R532M014M309K5708q9465m6786
$$ 97681 58084 76152 80256 58302 88447 143556 153088 157102 161411 187119 97654 50868
12291E0868k7488J3429O0651J39658P3907q4430j34204p5177m3166q127P1636
$$ 50868 23380 36809 97460 237118 311025 226595 92391 17214 -25952 -34079 37557
12280C7557L1907P5701K1251j449k4098j19793m9493J11145O8982m8659o5242
$$ 37557 69464 145165 166416 164967 140869 21076 -28417 82728 151710 103051 37809
12269C7809k3100K2350j167p0937K9936P9732p1730m5001l6274N5718k1624o4124
$$ 37809 14709 37059 35892 -35045 -5109 74623 2893 -42108 -78382 -22664 -44288 -108412
12257a08412P7071j7150m220J04278N3733O9504j04526j16936l5547Q940k9054
$$ -108412 -31341 -48491 -52711 51567 105300 174804 70278 -46658 -82205 -73265 -102319
12246a02319J19399P4302N7862J672P944r174Q8J2387j16765n1511n7119l8663
$$ -102319 17080 91382 149244 150916 158860 149686 149774 162161 45396 -6115 -63234 -101897
12234a01897n4795J03346J01139L5490j4498Q0356K5968N1406J336o5859J9064
$$ -101897 -156692 -53346 47793 83283 68785 149141 175109 226515 227851 161992 181056
12223A81056R859j42596r0042l3746J42903J95965L7417k8598n0040M771o4830
$$ 181056 190915 48319 -41723 -75469 67434 263399 300816 272218 222178 226949 162119
12212A62119m9696R649M4602O8387l7264q5624P7343k1835j00355l5289K9700
$$ 162119 112423 122072 166674 235061 197797 112173 189516 167681 67326 32037 61737
12201F1737o172O640p397N2570P7350n1818k3799K1220k1863o5680P4650l5459
$$ 61737 55565 62205 54808 107378 184728 132910 109111 130331 108468 42788 117438 81979
12189H1979l0557O8912j8370J2448l9929J08032O2328O0313r8190l2974J09553
$$ 81979 51422 120334 101964 114412 74483 182515 244843 305156 206966 173992 283545
12178B83545K6328K753L1672q6660J6812N7742M4824o2197j44292l729P9162K3048
$$ 283545 309873 312626 344298 257638 274450 332192 377016 314819 170527 166798 245960 269008
12166B69008Q8284K442j2699J6987j31465j61019N5383J05K4002J12652N7978
$$ 269008 357292 359734 347035 364022 232557 71538 126921 127026 151028 263680 321658
12155C21658J0519J5937l9568k2358m7828N9536l4782k6344P4438r150R66j04300
$$ 321658 332177 348114 308546 286188 238360 297896 263114 236770 311208 302058 303024 198724
12143A98724j14671k5092K93O0392L1331O0458O9831q3692L533r5108J15392J13468
$$ 198724 84053 58961 59254 119646 150977 211435 281266 197574 201107 105999 221391 334859
12131C34859p3874n0763j5280q4435p0715J0829q3476r3973O6390O1978P9256
$$ 334859 260985 210222 194942 110507 39792 50621 -32855 -126828 -60438 1540 80796
12120H0796R4108L6683j9385J29460J72832m0239p671n9899j7177n7791P1016
$$ 80796 174904 211587 192202 321662 494494 454255 446584 386685 369508 311717 382733
12109C82733M943n4594q2228q0822n5164J04254M5537N9439n3009l2438r272J24367
$$ 382733 387676 333082 250854 170032 114868 219122 264659 324098 271089 238651 229379 353746
12097C53746J16786M880j04884j18689j04838k5019J16253J36023l2225j29995
$$ 353746 470532 475412 370528 251839 147001 121982 238235 374258 342033 212038
12087B12038j49780L5283N3834k1058M2094K7022k0233o0378M0864J35952k2675
$$ 212038 62258 97541 151375 130317 172411 199433 179200 118822 159686 295638 272963
12076B72963m0679k2378Q3853J42850k2958j03477o2960j22279l149L6696Q3740
$$ 272963 232284 209906 293759 436609 413651 310174 247214 124935 121786 158482 242222
12065B42222L1875l0793L6864o592M4586K5301j02423r4526r127K0895J28704
$$ 242222 274097 243304 280168 273576 318162 343463 241040 146514 137387 158282 286986
12054B86986R1442J87355o2360k5220P2348R6691J4204Q1869K0057J1614J02365
$$ 286986 378428 565783 503423 478203 550551 647242 661446 743315 763372 774986 877351
12043H77351K11199J30519l362q1475O4481j8093q0287j80509k4645J20499j3425
$$ 877351 1088550 1219069 1215707 1134232 1198713 1180620 1100333 919824 895179 1015678 1002253
12032A002253p8591j1222P7821p0912q2448M0012p2477q5370R0033L0203O5786
$$ 1002253 923662 912440 990261 919349 836901 876913 804436 719066 809099 839302 905088
12021I05088j2943q5991k8325j7275J55560J35120R4738m8883j8034P2755o0102
$$ 905088 892145 806154 777829 760554 916114 1051234 1145972 1097089 1079055 1151810 1091708
12010A091708q0336M3962J02007k2262k9531o5284N7159M086q281J16863O4171
$$ 1091708 1011372 1055334 1157341 1135079 1105548 1040264 1097423 1101509 1093228 1210091 1274262
11999A274262q607L3405l649P3993Q6962n6741N6082J2543m9192K1561j40849
$$ 1274262 1265655 1299060 1295411 1369404 1456366 1399625 1455707 1468250 1419058 1440619 1299770
11988A299770o9008P7635L1115O8895J15358p3630k9384Q4070L4267L8693M8446
$$ 1299770 1230762 1308397 1339512 1408407 1523765 1450135 1420751 1504821 1539088 1577781 1626227
11977A626227J97909J65095K5700O1723O6978J21478L583R982N8596J94295m4358
$$ 1626227 1824136 1989231 2014931 2076654 2143632 2265110 2268693 2278675 2337271 2531566 2487208
11966B487208L7753R3325J36515N3171N9505J40978J78118K08266J48912J33570
$$ 2487208 2524961 2618286 2754801 2807972 2867477 3008455 3186573 3394839 3543751 3677321
11956C677321J14287J35259Q3690L23117L72366L04779K40651L69636K62957L25074
$$ 3677321 3791608 3926867 4010557 4333674 4706040 5010819 5251470 5621106 5884063 6209137
11946F209137L75139M30446N04418N36241N80833O27761Q65983R46293J121563
$$ 6209137 6584276 7014722 7519140 8055381 8636214 9263975 10129958 11076251 12197814
11937A2197814J257829J468592J612637J861031K095063K378001L016714L544614
$$ 12197814 13455643 14924235 16536872 18397903 20492966 22870967 25887681 29432295
11929B9432295M284755N175755O510861Q218998J0458653J3716590J8487666K4950151
$$ 29432295 33717050 38892805 45403666 53622664 64081317 77797907 96285573 121235724
11921A21235724L3152630M2328112M9194443M9217013M1052022K9577852K0443851
$$ 121235724 154388354 196716466 245910909 295127922 336179944 365757796 386201647
11914C86201647J4062296P107229m064625k2610030m4151174n6119396n3377263
$$ 386201647 400263943 407371172 403306547 380696517 336545343 280425947 227048684
11907B27048684m2894367l2255767k3969693j7826239j3513321j0423414q298091
$$ 227048684 184154317 151898550 127928857 110102618 96589297 86165883 77867792
11900G7867792o813263n327769m446074l775406l329123k840180k378054k084577
$$ 77867792 71054529 65726760 61280686 57505280 54176157 51335977 48957923 46873346
11892D6873346j799653j461384j405146j305035j108786r23720p51942r09370
$$ 46873346 45073693 43612309 42207163 40902128 39793342 38869622 38117680 37208310
11884C7208310p63317o80530n28278o36683p92697r26982r59698r13917j068022
$$ 37208310 36444993 35764463 35236185 34599502 33806805 32879823 31920125 31006208 29938186
11875B9938186r25922j044601j094806j197913j216549j217554j007025j065330
$$ 29938186 29012264 27967663 26872857 25674944 24458395 23240841 22233816 21168486
11867B1168486j020950j036482r94010r39009p96766p26569p45390o83007o31488
$$ 21168486 20147536 19111054 18117044 17178035 16381269 15654700 14909310 14226303 13594815
11858A3594815n73496n33739l77868m89717m25709l42445m77053n23737l62467
$$ 13594815 13021319 12487580 12109712 11619995 11194286 10851841 10374788 9851051 9488584
11849I488584k14607k94764j96576k24672m13798k82677j50110o2966k44201l20226
$$ 9488584 9273977 8979213 8782637 8557965 8144167 7861490 7711380 7648414 7404213 7083987
11839G083987l75214k86836j09462l5050j45713j14835k75317k91477j46103k39094
$$ 7083987 6708773 6421937 6312475 6277425 6131712 6016877 5741560 5450083 5303980 5064886
11829E064886k49382j16221p0418j09282j00173n6072m3740j56197k90663j57551
$$ 5064886 4815504 4699283 4628865 4519583 4419410 4363338 4319598 4163401 3872738 3715187
11819C715187l064j40135j69914j29585q8860J6731p678j2137r3885j09577p4394
$$ 3715187 3712123 3571988 3402074 3272489 3183629 3200360 3192682 3180545 3086660 2977083 2902689
11808B902689l4967k588M979Q1409j47415j27508j08997o2358m7691o8242j40630
$$ 2902689 2867722 2865134 2870113 2951522 2804107 2676599 2567602 2505244 2457553 2389311 2248681
11797B248681r6465K3195O7658m1123j92357j30851j29150m4792o5286j03879
$$ 2248681 2152216 2175411 2243069 2201946 2009589 1878738 1749588 1704796 1639510 1535631
11787A535631K6422m6491m4428K9568R2627N2327n2334m0849k7536j07284q5423
$$ 1535631 1562053 1515562 1471134 1500702 1593329 1645656 1593322 1552473 1524937 1417653 1332230
11776A332230j64773q5065O6279L5995r974P1153l1274j28249j19349m6796P6626
$$ 1332230 1167457 1082392 1148671 1184666 1174692 1245845 1214571 1086322 966973 920177 996803
11765I96803k5692J7302q074m4807j11653L4285m949P3410p4869n9505j3001q1063
$$ 996803 971111 988413 980339 935532 823879 858164 853215 926625 851756 792251 779250 698187
11753F98187j6004J10660l9516j18827p6228P7068J00506M8559p0424M0228r403
$$ 698187 682183 792843 753327 634500 558272 635340 735846 784405 713981 754209 744806
11742G44806O096o9008j48562K418R3149k6814j61653j01641l4010k8396N4831
$$ 744806 750902 681894 533332 535750 628899 602085 440432 338791 304781 276385 331216
11731C31216j6764J8730P6647J25070K16132n113n5256j37900q0816j22233r9823
$$ 331216 314452 333182 409829 534899 751031 745918 690662 552762 471946 349713 249890
11720B49890m3126m3299N1673N45J31958O138r3209n2145L0332M9458N0352N2637
$$ 249890 206764 163465 215138 215683 347641 353779 260570 208425 238757 288215 338567 391204
11708C91204P0627M9771j9831o2606n3161j60161m118P127j09780L286J02790
$$ 391204 461831 511602 491771 429165 376004 215843 211725 218852 109072 112358 215148
11697B15148Q9309K8547L4664j39898r7550J4719M7753M0087k4354M0086Q6864
$$ 215148 304457 333004 367668 227770 130220 144939 192692 232779 208425 248511 335375
11686C35375M7088k898l6221r0108j08357j0768J59643N0177m3504m3474J9109
$$ 335375 382463 379565 343344 253236 144879 134111 293754 343931 300427 256953 276062
11675B76062O8287J55248O765m3736k0757p2445J9107k9441R6037n1594m3356
$$ 276062 344349 499597 506362 462626 441869 369424 388531 359090 455127 403533 360177
11664C60177p0226Q7394k2916k3897l1937n3860N0302L6575K1988O988l1319J818
$$ 360177 289951 377345 354429 330532 298595 244735 295037 331612 353600 360588 329269 331087
11652C31087n2181j34209k4833j4927O558j7345J85161J23818r7811r6047P699
$$ 331087 278906 144697 119864 104937 111495 94150 279311 403129 305318 209271 216970
11641B16970j890N393p591R0746L3338j05279j06898J2588n9112l8292m2150O2546
$$ 216970 215080 220473 212882 303628 336966 231687 124789 137377 78265 39973 -2177 60369
11629F0369J82266l3598q4019r6170l9588j24301j20298O3065N0697m2043o6207
$$ 60369 242635 209037 125018 28848 -10740 -135041 -255339 -192274 -141577 -183620 -249827
11618b49827N4066J72409J01128P2784o0374J7796P2381o1051p9759q457l0073
$$ -249827 -195761 -23352 77776 150560 90186 107982 180363 119312 39553 31096 1023
11607A023p5000L7956J1966O6673L5701O9721M198K4447O4486k3086n9644q8936
$$ 1023 -73977 -36021 -24055 42618 78319 148040 152238 176685 241171 218085 158441 69505
11595F9505m9223J9780O0794R1936N5042l8688k7804j1068n9170N1797M6791J3512
$$ 69505 20282 40062 100856 192792 247834 209146 181342 170274 111104 162901 209692 223204
11583B23204r2066l645N7281M3650m6310j13952o3165J19677q219M9046L2385
$$ 223204 131138 127493 184774 228424 182114 68162 4997 124674 116455 165501 197886
11572A97886j12271o2388o6265r3019K464O8219J07281P3040j24782j03648k9173
$$ 197886 85615 23227 -43038 -136057 -133593 -65374 41907 114947 -9835 -113483 -142656
11561a42656J98214P3585k989L065O5234N575q8841j30094o157J20206J5229j07018
$$ -142656 55558 129143 126154 129219 194453 200028 111187 -18907 -25064 95142 110371 3353
11549C353p4857l3952P3988o623P7654K2351L2489m8982r6211O739K8245J11757
$$ 3353 -71504 -105456 -31468 -38091 39563 61914 94403 45421 -50790 -44051 -15806 95951
11537I5951J423j02064p0505j22800L0137J15110J17603m4864o7658m8941q229
$$ 95951 97374 -4690 -75195 -197995 -167858 -52748 64855 19991 -47667 -96608 -104837
11526a04837N9638J82717j2811L5220M005N124j18071j29501m784J33823M1035
$$ -104837 -45199 137518 124707 159927 163932 169056 50985 -78516 -83300 50523 91558
11515I1558K3283J40353N1220q7138l7103r305l8909R420j3160K6608q7335j5519
$$ 91558 114841 255194 306414 219276 182173 172868 133959 143379 130219 156827 69492 53973
11503E3973J25820L8285l2464j21367p1916J62446Q5917J6198K3527j17464p9208
$$ 53973 179793 218078 185614 64247 -7669 154777 240694 256892 280419 162955 83747
11492H3747J8560L1954K876l9800k2365n0177K8880k372j8601J6883M0344p3638
$$ 83747 102307 134261 137137 97337 74972 24795 53675 51303 32702 49585 89929 16291
11480A6291m6960J9420Q5411J32704J06013L4915r653m2054j49057j39482j3745
$$ 16291 -30669 -11249 74162 206866 312879 347794 338141 296087 147030 7548 -6197
11469f197n2852J19895n571K3706N022m521m9354m4704O9680J5438m5218M9715
$$ -6197 -59049 60846 55275 78981 84003 79482 30128 -14576 55104 70542 25324 75039
11457G5039Q466j1887L029l4901l20m3714L9014o946n8970j13685J7122J6497
$$ 75039 83505 71618 74647 39746 39426 -4288 34726 27780 -31190 -144875 -127753 -111256
11445a11256M169j4341m7284J17874P7960p8626j10415J3769J16544p0645j07246
$$ -111256 -107087 -121428 -168712 -50838 27122 -51504 -161919 -148150 -31606 -102251 -209497
11434b09497Q1324r752l7745q7040J09929n0385P6892p7474n4969P6634O0824
$$ -209497 -128173 -137925 -175670 -262710 -152781 -203166 -126274 -203748 -258717 -182083 -121259
11423a21259J56207J15618K8393R920j48549N2319Q1119j28728M4190J27677J52389
$$ -121259 34948 150566 178959 188879 40330 92649 173768 45040 89230 216907 369296
11412C69296J5822j14526j67636O9931O8614r7955j32133l335J17202M0305K0061
$$ 369296 385118 270592 102956 172887 241501 143546 11413 8078 125280 165585 185646
11401A85646M8107j62560k4598K3599R6740N159q0196p3563L8193k8324O6258
$$ 185646 233753 71193 46595 70194 166934 172093 91897 18334 56527 28203 94461
11390I4461L2371p7571L7900P7998K2098r3672k5195J8690M7644J8578m8369o0103
$$ 94461 126832 49261 87161 165159 187257 93585 68390 87080 134724 153302 104933 44830
11378D4830Q5116j3143q951L9388o2296j04787o9102j4855N9239J48024K12264
$$ 44830 129946 116803 107852 147240 84944 -19843 -88945 -103800 -44561 103463 315727
11367C15727j02834j51751j5399p3280R6012N5947L3359q004j19043K7804J17477
$$ 315727 212893 61142 45743 -27537 68475 124422 157781 149777 30734 58538 176015
11356A76015o16k1469J3678j71594n8722k0874R856q1757M5388J47760O2073O847
$$ 176015 175399 153930 167608 -3986 -62708 -83582 -73726 -155483 -110095 37665 99738 106585
11344A06585k0988R054n5807j3843L2851q3116j9775R2884j4333l015O404N0770
$$ 106585 85597 94651 38844 25001 57852 -25264 -45039 47845 33512 30497 36901 87671
11332H7671n1198n4533l0646N967n5450R899J7184r86n553j26404J8136L0561
$$ 87671 36473 -18060 -48706 -42739 -98189 -88290 -71106 -72092 -77645 -204049 -185913 -155352
11320a55352J72P2445J35600J56057l6384j2952j69282o8110j5417p2761O5212
$$ -155352 -155180 -82735 52865 208922 172538 159586 -9696 -77806 -93223 -165984 -100772
11309a00772L2370j4078o4031K3377L6200L2017p546K6097K3537N7038M1214p050
$$ -100772 -68402 -82480 -146511 -123134 -86934 -54917 -62463 -36366 -12829 44209 85423 78373
11297G8373J8605j47781m7725P0541m8119q2145J38264L058m2949l1385J31205
$$ 78373 96978 -50803 -98528 -27987 -76106 -158251 -19987 -16929 -59878 -91263 39942
11286C9942Q9039N0535l8454k14841m0536J08812M3913l8941q6791N2545p911
$$ 39942 128981 179516 141062 -73779 -114315 -5503 38410 -531 -87322 -34777 -42688
11275d2688p3864P8711k4157j02106O4867J06550J7966j24140k7430J10569J50215
$$ -42688 -116552 -37841 -61998 -164104 -99237 7313 25279 -98861 -126291 -15722 134493
11264A34493O5179K2051j01278P6828Q0349j08063j02019P1494P0911M0949q8268
$$ 134493 199672 221723 120445 197273 277622 169559 67540 139034 209945 250894 162626
11253A62626o4478j3183n1537j51280j1618J07890P4689p2231q1516k6451Q0322
$$ 162626 98148 84965 33428 -117852 -129470 -21580 53109 -19122 -100638 -127089 -46767
11242d6767R5511J471O2386J7406P996P4925j04948M2088N3143j0277j496r4612
$$ -46767 48744 50215 112601 130007 138003 212928 107980 150068 203211 192934 191438 96826
11230I6826n3397k4142n3953k5471O4421Q4777n8161J476n16L6979n8155K0746
$$ 96826 43429 19287 -34666 -60137 4284 89061 30900 32376 31860 68839 10684 31430
11218C1430l4476J8853J7769k0533j72273l142M3867J00361P5885l4739m6632
$$ 31430 -3046 15807 33576 13043 -159230 -162372 -118505 -18144 57741 23002 -23630
11207b3630K1343O1652Q327J1722P3014o639j31567j04866J4436k0452l7259Q6786
$$ -23630 -2287 59365 67692 79414 152428 145789 14222 -90644 -76208 -96660 -133919 -47133
11195d7133L435n0435N5998k2629P110o979J29799J32142J2239o1205M4366L4624
$$ -47133 -43698 -94133 -38135 -60764 -53654 -60633 69166 201308 213547 152342 196708 231332
11183B31332j48858K6828k2290m8788j3252q8113N9436Q8205P8724o265m0908
$$ 231332 82474 109302 87012 38224 24972 -63141 -3705 84500 163224 156959 116051
11172A16051J0750p3454K0817m1016J0346p2479l4458J3443q973j652P1771q069
$$ 116051 126801 53347 74164 33148 43494 -28985 -63443 -50000 -58973 -60625 11146 3077
11160C077J8576J6437J06983r2820q0814J02624J5665p0775j81969O0197J78362
$$ 3077 21653 38090 145073 52253 -28561 74063 89728 18953 -163016 -102819 75543
11149G5543j34454n6373J6244Q0955r406L271l2995k7314P8772J14091J00151
$$ 75543 -58911 -115284 -99040 -18085 -27491 -24220 -57215 -84529 -5757 108334 208485
11138B08485K666n5169J5514q9203j34586K6651R9901Q1311P798j71233p5754
$$ 208485 211151 155982 171496 82293 -52293 -25642 74259 155570 163368 -7865 -83619
11127h3619J1490q5914J7107N8908J33172O0083j32317j34379J0621K01127R8628
$$ -83619 -72129 -158043 -140936 -82028 51144 111227 -21090 -155469 -144848 56279 154907
11116A54907j27681J6103J8656n7062q121M1714q1174j6658J44586L3439k3910
$$ 154907 27226 43329 61985 4923 -3198 38516 -42658 -59316 85270 118709 94799
11105I4799l0166j1870m3660R3722p8601r7490L4003j8905N2922N7948o3902k575
$$ 94799 64633 52763 9103 102825 24224 -73266 -39263 -58168 -5246 52702 -11200 -13775
11093a3775N9399j5483j06584P399J45919N265n5294l5353q0798n7120Q9821m3809
$$ -13775 45624 30141 -76443 -69044 76875 82140 26846 -8507 -89305 -146425 -56604 -100413
11081a00413j7530L6013N0009l3270P8126M8264o9737J1687J6311M1406O3480
$$ -100413 -117943 -81930 -31921 -65191 12935 61199 -8538 3149 19460 60866 124346
11070A24346J00974M6608p604j57026j45423l8822m4345P6502Q4440k6718k2027
$$ 124346 225320 271928 264324 107298 -38125 -76947 -121292 -44790 39650 12932 -9095
11059i095P5546j8282j09546L0262l6572r8997l8961K5925J3642K2582J23244
$$ -9095 66451 48169 -61377 -31115 -67687 -166684 -205645 -179720 -166078 -143496 -20252
11048b0252J80202N5997o2531j2788J2104p1603o5010K900J02682J32115k5375
$$ -20252 159950 215947 153416 140628 152732 81129 16119 19019 121701 253816 228441
11037B28441L0285Q6768Q5661K2745o5553p3836l736J27638J35554J10644q976
$$ 228441 258726 345494 431155 453900 388347 314511 310775 438413 573967 684611 675635
11026F75635k4501Q0738P3835k7771j3036p5745p8729j05594K8422M6884N4916
$$ 675635 651134 731872 805707 777936 764900 689155 610426 504832 533254 580138 635054
11015F35054k0751l375k7236J5441O7710K3835l3780o7610J4326M8750K1158Q323
$$ 635054 614303 610928 583692 599133 666843 690678 656898 589288 603614 652364 673522 681845
11003F81845J5793o4092j24276r6380N046J15281l6284k6015l0766M5391j3179
$$ 681845 697638 633546 509270 412890 417936 533217 496933 470918 440152 485543 472364
10992D72364l2487P2293j8142O5321O5761j04930j09656j48155R8074O1616r752
$$ 472364 439877 512170 494028 559349 625110 520180 410524 262369 360443 422059 412307
10981D12307l6403j24862r6691j53506k0022Q1145k3404M9897O8024m4075j40230
$$ 412307 375904 251042 154351 845 -19177 61968 38564 88461 156485 112410 -27820
10970b7820m9403P8365K6582r1797N2133Q7210N7611j53029l2045K7016J9264
$$ -27820 -77223 1142 27724 -64073 -11940 75270 132881 -20148 -52193 -25177 -5913
10959e913j251L7735O9096l8630q3771N1948q9R714M2313m6998j8043j32126M542
$$ -5913 -7164 30571 99667 61037 -22734 29214 29125 38839 81152 34154 16111 -116015 -111473
10946a11473K20156M5897j46350O514l0827M231J24668J85177j33907j18690o9659
$$ -111473 108683 154580 8230 14744 -16083 -11852 112816 297993 164086 45396 -24263
10935b4263J14821k9980o8713L8748M4901J54522K858m4654q6249n3163j8190
$$ -24263 90558 60578 -8135 30613 75514 230036 232894 188240 101991 48828 30638
10924C0638O6300L8382p9219j25310m8550N3585N7832q6235M4521N6890n6609
$$ 30638 96938 135320 56101 -69209 -117759 -64174 -6342 -92577 -48056 8834 -47775
10913d7775N8207L9530n5915p327k1202r969o3277P9663K1092k6760j13328o6296
$$ -47775 10432 49962 -5953 -13280 -34482 -44451 -107728 -28065 -6973 -33733 -147061 -213357
10901b13357K10393J53420M9989l1605j2444L4676m5599q5860p2266m1446k8694
$$ -213357 -2964 150456 200445 168840 156396 191072 145473 59613 -12653 -54099 -82793
10890h2793L1925J64408J14874k581o1764q9139k2762n8051n3410P3481J03170
$$ -82793 -50868 113540 228414 225833 164069 74930 52168 -5883 -59293 14188 117358
10879A17358l3384n9856j6986o9015n2947k1628j37373k5998J4479N8155k1655
$$ 117358 83974 24118 7132 -61883 -114830 -136458 -273831 -299829 -285350 -227195 -248850
10868b48850K9315O7514J43477Q469m4060o9336O5345p720j14145N4209J65826
$$ -248850 -219535 -152021 -8544 -75 -44135 -113471 -48126 -55846 -169991 -115782 50044
10857E0044O6274j8241p6446L9094O0788n9868L2215N4548p6902j68791k273J04367
$$ 50044 116318 98077 21631 60725 121513 61645 93860 148408 71506 -97285 -99558 4809
10845D809L4543j2691O5241l9119j4814L6085P5402m537j9729L0358K2283j8099
$$ 4809 39352 26661 91902 52783 37969 74054 149456 144919 125190 155548 177831 159732
10833A59732j24002o8943k0708M4184J43662L9541r6290p3616L1070R8101O6867
$$ 159732 35730 -33213 -53921 -9737 133925 173466 77176 3560 34630 132731 199598
10822A99598l1353j04749r4472n8515L5074k874L8696P0900R886j6011N9474l2499
$$ 199598 168245 63496 -30976 -89491 -54417 -57291 -18595 52305 62191 46180 105654 73155
10810G3155M4789J4005p5528P0069J6429p9608K820P4873J54350Q9294j6799p7257
$$ 73155 117944 131949 56421 126490 142919 63311 66131 141004 295354 384648 367849 290592
10798B90592p3043r2280j21393j3284n9100k18760N1311J65423J5460N8285J01044
$$ 290592 217549 125269 3876 -9408 -68508 -287268 -235957 -70534 -55074 3211 104255
10787A04255p3908k3284N5503J12405O9733M0934J4576K1449p1948j00078j9406
$$ 104255 30347 7063 62566 174971 244704 285638 300214 321663 249715 149637 130231
10776A30231J4806r8594p755L63J7272l0751k9290O8325J907l1445j7404n712
$$ 130231 145037 46443 38688 39051 56323 25572 -3718 64607 66514 35069 17665 11953
10764A1953p6651K3762J02685R401n0033P8797J11575j69644j02052O4797P7630
$$ 11953 -64698 -40936 61749 71150 21117 99914 211489 41845 -60207 4590 82220
10753H2220l672r2704N5327L0890m4943m7322O9643r4879K5195N3320M2072J37539
$$ 82220 78548 -14156 41171 72061 27118 -20204 49439 -45440 -20245 33075 75147 212686
10741B12686J00690r296Q512p0272j41769k3767j175P1337k566M2587M7477j6005
$$ 212686 313376 304080 312592 242320 100551 76784 75609 146946 144380 186967 234444 218439
10729B18439j18359L5166k6344m3278j1162P5318J64578N7802O152k1411P778
$$ 218439 100080 135246 108902 65624 54462 129780 294358 352160 358312 336901 344679
10718C44679m8979j6338l8067J40413P7604R3267j10811j66345n9075L8009J58053
$$ 344679 295700 279362 241295 381708 459312 552579 441768 275423 216348 254357 412410
10707D12410O3263j06788n0505o2953N4297J07224L8455K8425l6244n614O6466
$$ 412410 475673 368885 318380 255427 309724 416948 455403 483828 447584 441970 508436
10696E08436N5852J8177p0550n7873J1653O9145N3646l8350j16133k9976O2378
$$ 508436 564288 582465 511915 454042 465695 534840 588486 550136 434003 404027 466405
10685D66405K12054j6177j33178l9028K4307L6359L3488L88j74169M2629J39809
$$ 466405 678459 662282 529104 490076 514383 550742 584230 584618 410449 453078 592887
10674E92887p2397o3459j00109p7115Q0491r0285O3749Q7580M9892j4764k1817
$$ 592887 520490 457031 356922 279807 360298 270013 333762 421342 471234 456470 434653
10663D34653L7792k5774m770Q056r1438L0588O7541J4861L6076k0895j3155L8386
$$ 434653 472445 446671 441901 449957 358519 389107 456648 471509 507585 486690 473535 511921
10651E11921n7186L2035J10714P5662o1950j1834J53595O9284q1598k5431O3565
$$ 511921 454735 486770 597484 673146 611196 599362 752957 822241 740643 715212 778777
10640G78777J14285k1376J21416J08061r9237R4764J56583R9426J01880J61759
$$ 778777 893062 871686 993102 1101163 1001926 1096690 1253273 1352699 1454579 1616338
10630A616338P9493L1763Q4010K64564L22989L06066K62492K94309L11929L72995
$$ 1616338 1695831 1727594 1811604 2076168 2399157 2705223 2967715 3262024 3573953 3946948
10620C946948N50389O15582O80182R22122J335184J763810K395349K930743L549665
$$ 3946948 4497337 5112919 5793101 6715223 8050407 9814217 12209566 15140309 18689974
10611A8689974L936072M046674L839782L362580L241798L174919K970286K694747
$$ 18689974 22626046 26672720 30512502 33875082 37116880 40291799 43262085 45956832
10603D5956832K306776K337857L208179M551658N802802O121121N327818M572589
$$ 45956832 48263608 50601465 53809644 58361302 64164104 70285225 75613043 80185632
10595H0185632M227712L784017L607634K534650Q81056n5699P70302L031598N193424
$$ 80185632 84413344 88197361 91804995 94339645 95220701 95165002 95935304 98966902 104160326
10586A04160326N724662M695012L490287K644991K033785R16084j313163m597770
$$ 104160326 109884988 114580000 118070287 120715278 122749063 123665147 122351984 117754214
10578A17754214o924961o360776l902101j661938n23268m11242o82358j024820
$$ 117754214 110829253 104468477 100566376 98904438 98381170 97969928 97287570 96262750
10570I6262750j205301j915394l569068n754247p258686o943508n153564l401394
$$ 96262750 95057449 93142055 89572987 83818740 76560054 69616546 64462982 61061588
10562F1061588k382077k188145j957100j972842k188871k562788l225986m244915
$$ 61061588 58679511 56491366 54534266 52561424 50372553 47809765 44583779 40338864
10554D0338864m888228m615703l768481l074311k399940j873590j577021j180204
$$ 40338864 35450636 30834933 27066452 23992141 21592201 19718611 18141590 16961386
10546A6961386j026539r75585q25903p00490o56540n64934m43134m91496n20343
$$ 16961386 15934847 14959262 14133359 13432869 12776329 12211395 11768261 11276765 10756422
10537A0756422l90645k95752l64859l60159k62197m64500k72182k53780k80896
$$ 10756422 10365777 10070025 9705166 9345007 9082810 8618310 8346128 8092348 7811452
10528G811452k94017k70306k83060k14604k12890k48155k26297j10445q2497k42447
$$ 7811452 7517435 7247129 6964069 6749465 6536575 6288420 6062123 5951678 5869181 5626734
10518E626734k66829k33793q0686j30793j43139k61756j5574k581n1094k29065
$$ 5626734 5359905 5126112 5045426 4914633 4771494 4509738 4494164 4491583 4440489 4211424
10508D211424j57487j59921q9311j17775j72050n7606m3422m1870J0242j82320
$$ 4211424 4053937 3894016 3804705 3686930 3514880 3457274 3413852 3371982 3382224 3199904
10498C199904k25167j00999K2342m0584j67775P4774j6672q6836j33912j66163
$$ 3199904 2974737 2873738 2896080 2855496 2687721 2762495 2745823 2658987 2525075 2358912
10488B358912R2454J48672j10492j43293n8855p544k3695p3855k8852j45494r4543
$$ 2358912 2451366 2600038 2489546 2346253 2287398 2279854 2256159 2182304 2153452 2007958 1913415
10477A913415n8250j26236o9331K4549r193j39687j42642p6082M394N7659Q4626
$$ 1913415 1855165 1728929 1659598 1684147 1674954 1535267 1392625 1316543 1320937 1378596 1463222
10466A463222j64899j07427k3790N2367J00538o8174j03120j11799L4603j0478
$$ 1463222 1298323 1190896 1167106 1219473 1320011 1251837 1148717 1036918 1071521 1061043
10456A061043k05127o7431J4001K2782m7894j57447k753l769j21415P9379J85391
$$ 1061043 855916 788485 802486 825268 777374 619927 617174 613405 491990 571369 756760
10445G56760Q4827N7434k7064p3652p6572o6419n0011l8807M848J15349J0452
$$ 756760 841587 899021 871957 798305 721733 655314 605303 566496 571344 686693 697145
10434F97145o0211l5892K528n4644N906O2455J4127r5750q9018l1745j9606P7981
$$ 697145 636934 601042 603570 548926 554832 617287 631414 535664 446646 414901 395295 473276
10422D73276p964l0106p2025j5172N4627j8082m8190N368j9903j4819O8012N5212
$$ 473276 465312 435206 363181 348009 402636 384554 336364 341732 321829 307010 375022 430234
10410D30234J5931j33260m1487J9390M7064j2102k4547r8064l0492p4731M029
$$ 430234 446165 312905 271418 290808 337872 325770 301223 203159 172667 97936 101965
10399A01965R768j9634R5803q2876p2440M6855O2554r1738k2077j2358R081j9760
$$ 101965 111733 92099 187902 105026 32586 79441 141995 50257 28180 15822 24903 5143
10387E143m2273K4994Q32Q0685k6695J44305M2280l6387j5160k5878Q0541K7807
$$ 5143 -37130 -12136 -11304 69381 42686 186991 229271 192884 177724 151846 232387 260194
10375B60194L8256J5433J4852M1726j16144o3970p6755j1706M4903K573j7449
$$ 260194 298450 313883 328735 370461 254317 190347 113592 101886 146789 149362 131913
10364A31913R0088l0969l1632L3711Q4115O6641j3977j03841K5768J11456N1029
$$ 131913 222001 191032 159400 193111 277226 343867 329890 226049 251817 363273 414302
10353D14302p440j43286m9728N8295Q990N5797j5805n0278q5222m83L9832K5047
$$ 414302 406862 263576 213848 272143 281133 336930 321125 270847 185625 185142 224974 250021
10341B50021l7962n8809j16747r642J38958j27498K2125Q0502L8608l11K6595
$$ 250021 212059 153250 36503 26861 165819 38321 60446 140948 179556 179245 205840
10330B05840m4809p3809r607j14477k0683J40913R5268m6735m663J0433l1705
$$ 205840 161031 87222 77615 -36862 -57545 83368 178636 131901 127238 137671 105966
10319A05966N8890P5838k7878M3540P8228n5446m1086p0950m0170p0627p5591
$$ 105966 164856 240694 212816 256356 334584 279138 238052 167102 126932 56305 -19286
10308a9286N9292O1753M036Q2798R0367j52683r8306M0506n3839N7894p1409O066
$$ -19286 40006 101759 105795 188593 278960 126277 27971 68477 14638 72532 1123 7189
10296G189m9828J0113P9295J6855j434J03426M3966K9765j34305q4210J3573O8226
$$ 7189 -42639 -32526 46769 63624 62190 165616 209582 239347 105042 20832 34405 102631
10284A02631M1699n3412j01740r5877j0325O6842o651j5340n6132J22219J91287
$$ 102631 144330 90918 -10822 -106699 -117024 -50182 -56833 -72173 -128305 -6086 185201
10273A85201P2782m2703j94235o158N2978K3855Q1709j6276O0143m4435J10197
$$ 185201 257983 215280 21045 14887 67865 91720 173429 157153 217296 172861 283058
10262B83058k5701J0011M7201k14553j07948r145R8159R59J3220J1146O2800M129
$$ 283058 257357 267368 314569 100016 -7932 -17077 81082 82041 95261 106407 169207 173336
10250A73336j11790q4792Q140K0762k8529R0615R3034R671J09026N4211k6377
$$ 173336 61546 -23246 -15106 5656 -22873 67742 160776 170447 279473 333684 307307
10239C07307k3060m6109J54189K0397j03385O9797q5348j61786l7982J7761M2444
$$ 307307 284247 238138 392327 412724 309339 379136 293788 132002 94020 111781 154225
10228A54225k2021J2815o1641n7824O7536o1676L5533j1704o7725L6391k8812
$$ 154225 132204 145019 83378 25554 93090 31414 66947 55243 -12482 23909 -4903
10217d903r585J03272N0746O228o0554j0344J8017M5973j0062j25579n8217J67519
$$ -4903 -14488 88784 139530 145758 85204 74860 92877 138850 128788 3209 -55008 112511
10205A12511j090q953k3700M6911L7268m1970l6768l6637J9413q4462J4360J14853
$$ 112511 111421 102468 78768 125679 162947 120977 84209 47572 66985 -17477 -3117 111736
10193A11736n198o0319P1005J47550o691M269l2338q9374o4889J3902j19436Q138
$$ 111736 106538 46219 117224 264774 258083 262352 230014 140640 75751 89653 -29783 -21645
10181b1645P0832o9485O7741P9302N9046N0829M2417o1075K8442P1045J9735N417
$$ -21645 49187 -20298 47443 126745 185791 236620 279037 217962 246404 317449 337184 342601
10169C42601Q6532L6776Q363O2053k6882O1991P027Q550n6109j04190m2828J15279
$$ 342601 429133 465909 474272 536325 509443 571434 578461 587011 530902 426712 383884 499163
10157D99163K6583K1491Q268j4893n046N7700N6212P7415j27552M3311J93284
$$ 499163 525746 547237 555505 540612 535566 593266 649478 726893 599341 642652 835936
10146H35936l1548j37708q3340K2107P2369k4234j05580r2087j27691M2667J14197
$$ 835936 804388 666680 583340 605447 677816 653582 548002 455915 328224 370891 485088
10135D85088J21372p0985j4847m1303j87686j02195J03498o8944L310L2774K0889
$$ 485088 606460 535475 520628 479325 291639 189444 292942 223998 227308 260082 280971
10124B80971Q9308r2975J9184J10391m4914j50397Q0846Q915k0569J0288n0979
$$ 280971 370279 277304 296488 406879 361965 211568 292414 301329 280760 291048 240069
10113B40069o8477j19461N8358J73583P8190n0601j3359j22570j08355p2884L815
$$ 240069 171592 52131 110489 284072 362262 311661 298302 175732 67377 -5507 -1692
10102a692K3625m5672N2130L9265P6679l2563M5741R7586N9252l8970l5935k7813
$$ -1692 21933 -23739 28391 67656 144335 111772 157513 255099 314351 275381 239446 211633
10090B11633j08679j71119L3677k0792Q2123L2336m0731r6570o9908P1326O0919
$$ 211633 102954 -68165 -34488 -55280 26843 59179 18448 -78122 -148030 -76704 -15785
10079a5785N5202P1000p534p2729o0098J23421Q5381O086j14070q3929l1969J42666
$$ -15785 39417 110417 102883 30154 -29944 93477 178858 184944 70874 -13055 -45024 97642
10067I7642L6461n0564j06688L1789M1907N796l582l8484J4488p6676m7447r884
$$ 97642 134103 83539 -23149 8640 50547 56343 52761 14277 28765 -47911 -95358 -105242
10055a05242K1667O5501l1367j56739K28635J14821q6575O1272J7867j04821P743
$$ -105242 -83575 -18074 -49441 -206180 22455 137276 50701 111973 129840 25019 32762
10044C2762N8880k3843o6961p8469n7254M2771P8661J35808j9630p3980j06352
$$ 32762 91642 67799 838 -77631 -134885 -92114 -13453 122355 102725 28745 -77607
10033g7607j9738N3276k935L2872M4715J3302P5022n5660r5985j23875Q390L398
$$ -77607 -97345 -44069 -47004 -14132 30583 43885 118907 63247 -32738 -156613 -148223 -144825
10021a44825j05446j07939J73688J3368K0057n4164K6890O4718M7627R71o9270
$$ -144825 -250271 -358210 -184522 -171154 -151097 -205261 -178371 -113653 -66026 -65055 -134325
10010a34325M4639R067j26141m1101K01099J22806k3027o0835l8805K1833q4686
$$ -134325 -89686 -80619 -206760 -247861 -46762 76044 53017 -7818 -46623 -24790 -109476
9999a09476Q8239Q1904r9730j13168o2670N002J24397J64958L3709r5417l865
$$ -109476 -21237 60667 -39063 -152231 -214901 -209899 -85502 79456 113165 17748 13883
9988A3883r7336J0565O5195N4768K1094O0293l747m9453Q104K3864r826K2004
$$ 13883 -83453 -72888 -7693 47075 68169 128462 124715 75262 83366 107230 97404 119408
9976A19408j0509n3293L522J2939q2413K1059L4553M8354k3138n7407j0795Q007
$$ 119408 108899 55606 59128 72067 -10346 10713 45266 93620 70482 13075 2280 10287
9964A0287N1395p2444O4031N2031J2323k0249n7547P3333N1978q8831q2175r316
$$ 10287 61682 -10762 53269 105300 117623 97374 39827 113160 165138 76307 -5868 -15184
9952a5184J37265Q2791r2678k7974N5010j4398l9107j12342n6996L0678L1796
$$ -15184 122081 204872 112194 84220 139230 124832 85725 -26617 -83613 -52935 -21139
9941b1139l1319j17867J60896J73333K2471M8535J31973m4246j54132l1104M5488
$$ -21139 -52458 -170325 -9429 163904 186375 234910 366883 322637 168505 137401 182889
9930A82889m1121j38148j43176O4433P6279L9515o7890Q0116J659j12164l2644
$$ 182889 141768 3620 -139556 -75123 1156 40671 -27219 52897 54556 -57608 -90252
9919i0252J2996j6566j7553J37491O6337k5802q4241o1368L3111K2752K11J31002
$$ -90252 -77256 -93822 -111375 26116 92453 66651 -17590 -78958 -45847 -23095 -22884 108118
9907A08118J13162r9037q9297M3178r563o2329l3150P7219Q71k4435j32600j35647
$$ 108118 221280 122243 32946 76124 66561 4232 -28918 48301 49172 24737 -107863 -243510
9895b43510P0915L4692N4039O8160k2158j25608m9108P9671J16911K2104j8531
$$ -243510 -172595 -137903 -83864 -15704 -37862 -163470 -212578 -132907 -15996 6108 -12423
9884a2423k1021M3284M7119r1789p2660O5782J07232M734n2606j8898L6071M5259
$$ -12423 -33444 9840 56959 -34830 -107490 -41708 65524 70258 17652 -1246 34825 80084
9872H0084K2416j14522j7632o8546j8386J95444k0340j11066P8978J28720m8690
$$ 80084 102500 -12022 -29654 -98200 -116586 78858 58518 -52548 26430 155150 106460
9861A06460j84255r146P509r3299j27690k5571J18526J62834J30177L3117n2002
$$ 106460 -77795 -86941 -79432 -172731 -300421 -325992 -207466 -44632 85545 118662 66660
9850F6660j996O5410q405l5095L5251p708q9399k4857m7178n9109J50876P3374
$$ 66660 64664 130074 121669 86574 121825 114117 24718 -139 -47317 -106426 44450 117824
9838A17824j25396p6660k9630P2470l4818J4415M6253O9499J11491r5411k49113
$$ 117824 -7572 -84232 -113862 -41392 -76210 -61795 -15542 53957 165448 70037 -179076
9827a79076n4442r194K3456O4640M7535K1342P4698J32300n696l1241J10171J9282
$$ -179076 -233518 -242712 -219256 -154616 -107081 -85739 -11041 121259 115563 84322 194493 213775
9815B13775j5878o971j04657j95007m486J17035N219Q6342j8562q5121k3652L0114
$$ 213775 197897 190926 86269 -108738 -113224 3811 9030 95372 76810 -8311 -31963 -1849
9803a849J15801O9276l7210k5915K6188j42374q3943P8547l2419P949q7935J4600
$$ -1849 113952 183228 146018 120103 146291 3917 -80026 -1479 -33898 -25949 -113884 -99284
9791i9284L2494P2448l5377N9257J55638j5260n1089m952j23559j51255J036J68930
$$ -99284 -66790 5658 -29719 29538 185176 169916 118827 113875 -9684 -160939 -159903 9027
9779I027P6078K0042q0484k4946p1592k2279L2860n8837L6527M9802m2535o0978
$$ 9027 85105 105147 24663 -283 -71875 -94154 -61294 -120131 -83604 -33802 -76337 -137315
9767a37315O2063R7150p1390j71632k986P5103N1381N9074L7964K9239L4998R2017
$$ -137315 -75252 21898 -49492 -221124 -224110 -149007 -97626 -38552 -588 28651 63649 155666
9755A55666k1788M02O613P9631m879n9502R364j23658j05344p7658j2943P7415
$$ 155666 133878 134280 140893 220524 215645 156143 165507 41849 -63495 -141153 -154096 -76681
9743g6681p515q0568l6793M7812l842K2936J04451J23618q643j21073j3545N2049
$$ -76681 -84196 -164764 -201557 -153745 -157587 -134651 -30200 93418 84775 -36298 -49843 2206
9731B206j064j4457j1063j4338L4345K8043r3326j22970M3918r4236l7306P3378
$$ 2206 1142 -13315 -24378 -38716 -4371 23672 -69654 -192624 -148706 -242942 -280248 -206870
9719b06870J02198P7202K3620J4527j4881J5748L9112l0514Q7564L3643m6914
$$ -206870 -104672 -27470 -3850 10677 -4204 11544 50656 20142 107706 141349 94435
9708I4435j6238P3183Q855l1812J52919K1379n6856N8341o8777j65051j28815
$$ 94435 78197 151380 160235 128423 281342 302721 245865 304206 235429 70378 -58437
9697e8437p1702n660R0286O3176J5865J8200J2303k5892J844J02660m5615p7075
$$ -58437 -130139 -135799 -45513 17663 33528 51728 64031 38139 39983 142643 97028 19953
9685A9953k30026q9342J88812K7358k5821j01788K6124L2218j3896P5075n3916
$$ 19953 -210073 -299415 -110603 -83245 -109066 -210854 -184730 -152512 -166408 -91333 -145249
9674a45249j5787N7728J64567N2713k8604k26O9233n3270j46263j24130N1514
$$ -145249 -161036 -103308 61259 113972 85368 85142 154375 101105 -45158 -169288 -117774
9663a17774N5123J19637r0806j050J04298k0060p0577q9197n0642o2219K2407
$$ -117774 -62651 56986 -33820 -34870 69428 49368 -21209 -110406 -161048 -223267 -200860
9652b00860J65225l9694Q3909K03030n2137R970K08698O7868j38750K5456M7208
$$ -200860 -35635 -75329 8580 211610 159473 169443 378141 446009 307259 332715 379923
9641C79923j4958q1886k26106j20730N6742K9564P7336m2952m0848N7088J4448
$$ 379923 364965 283079 56973 -63757 -7015 22549 99885 56933 16085 73173 87621
9630H7621o9286l3614N7884O8292J14638J05103p2696j4040r1737n4442J58634
$$ 87621 18335 -15279 42605 110897 225535 330638 257942 243902 152165 97723 256357
9619B56357R2317K809j77672k6047L4127j46885o6760J60310N22p3129K0280L477
$$ 256357 348674 351483 173811 147764 181891 35006 -31754 128556 129078 55949 76229 79706
9607G9706j41328j9917Q2543J50155l0506o0426j4524l7989M6118k9847o7405
$$ 79706 -61622 -81539 1004 151159 120653 60227 45703 7714 53832 23985 -43420
9596d3420o2631k2448N283L2247k4779J35542o546K429L1845n266J9081L262n4871
$$ -43420 -106051 -128499 -123216 -90969 -115748 19794 13248 15677 47522 42256 61337 64599 9728
9583I728l6271p4871o4036M597L2276M1923P2884J05122j68754p4133O5175o0061
$$ 9728 -26543 -101414 -165450 -160853 -128577 -86654 -13770 91352 -77402 -151535 -86360 -146421
9571a46421K3097P5518k4012K5505O6476n1245l9194J56300P8817p3899K055k9748
$$ -146421 -123324 -47806 -71818 -46313 20163 -31082 -70276 86024 164841 90942 92997 63249
9559F3249j2487p0336R3869j3267j00954m4941J4338J3131L8762q2503J59940
$$ 63249 50762 -19574 74295 61028 -39926 -84867 -70529 -57398 -18636 -101139 58801
9548E8801R8768r5183p2362m4779j15099L1000R6105J39531p8544n4239N2097
$$ 58801 157569 62386 -9976 -54755 -169854 -138854 -42749 96782 18238 -36001 16096
9537A6096O7544L1932m6283j01870n2183j47474N7159R3369J60431N0464l0722
$$ 16096 83640 115572 69289 -32581 -84764 -232238 -175079 -81710 78721 129185 98463
9526I8463p6139j53370J8522M6689J3364m219o2446j61502Q1545K09494O58l9461
$$ 98463 22324 -131046 -112524 -65835 -52471 -56690 -119136 -280638 -199093 10401 11059 -28402
9514b8402J23224R6284q8999o5165k9970J11096o1256p7063k8455P6244P880M9879
$$ -28402 94822 191106 102107 36942 6972 118068 56812 -20251 -48706 27538 35418 85297
9502H5297L346m346n3311Q0792L6657p8111q2975l1500J7063O02k76r9452M663
$$ 85297 88643 84297 30986 111778 148435 70324 -12651 -44151 -27088 -26486 -26762 -126214 -121551
9489a21551L7538O8064O263k6550n4323M097p489N8329k4066l8227K7056L8871
$$ -121551 -84013 -15949 -9686 -36236 -90559 -86462 -93951 -35622 -59688 -97915 -70859 -31988
9477c1988o6347m6370q293K4218m43m643J22320j2732M4365R620K7084m1640j7513
$$ -31988 -98335 -144705 -152998 -128780 -129223 -133866 -11546 -24278 20087 29707 56791 15151 -2362
9464b362r0161k1830J60816Q178q721K1335J2696m0895j44128L4599L2566j1055
$$ -2362 -92523 -114353 46463 54641 45920 67255 79951 39056 -105072 -70473 -37907 -48962
9452d8962n4464k3508q0393J19696K18710k6001j08684j15648o4120N598K5832
$$ -48962 -103426 -126934 -207327 -87631 131079 105078 -3606 -119254 -183374 -177776 -151944
9441a51944J37474R9883L3330o4013m3506l4437l5861K4150j2489O2289O3347
$$ -151944 -14470 85413 118743 54730 11224 -23213 -59074 -34924 -47413 14876 78223
9430G8223j6012O383r3613j03362M6211K5110m3730O5666J33993n4945j52035
$$ 78223 62211 68594 -25019 -128381 -82170 -57060 -100790 -35124 98869 43924 -108111
9419a08111J4479P7765j5062J4645k1293N5471k7202j48943m072K0435N9002J12063
$$ -108111 -93632 -15867 -30929 -16284 -37577 17894 -9308 -158251 -162323 -141888 -82886 29177
9407B9177P465K7740M2155N5945l6128n1813O388k8569j01082p9478K6871R2106
$$ 29177 36642 64382 106537 162482 126354 74541 80929 52360 -48722 -128200 -101329 -9223
9395i223J5774J8022R419O954l8563r9318J8682K3743P0087p6369J00741J5315
$$ -9223 6551 24573 33992 40946 2383 -96935 -78253 -54510 15577 -60792 39949 55264
9383E5264p633L6725k2272m4163L4278k7475n4271o7663N8967J54309m1593m8733
$$ 55264 47631 84356 62084 17921 52199 24724 -29547 -97210 -38243 116066 74473 25740
9371B5740R6860l4498j13474J5454R8806j82j07722n5673L1471q00K2002p8202
$$ 25740 122600 88102 -25372 -9918 88888 88706 -19016 -74689 -43218 -44018 -22016 -100218
9359a00218N9462N9104k8170p2742L2383J32718p7815O1468O3921n8464j14018
$$ -100218 -40756 18348 -9822 -82564 -50181 82537 4722 66190 130111 71647 -42371
9348d2371j04010k0072N0246M3669J13109N2766k2971j8880p6308m3256L0917
$$ -42371 -146381 -166453 -116207 -72538 40571 93337 70366 51486 -24822 -68078 -37161
9337c7161K1530Q3976L3584L7625J29718M1433l5582j18085q1028o065J326o0425
$$ -37161 -15631 68345 101929 139554 269272 310705 275123 157038 76010 69945 71271 10846
9325A0846m4336J36180R1409j00063r6479n4866L0899J25787N4033m2237j02234
$$ 10846 -33490 102690 194099 94036 -2443 -57309 -26410 99377 153410 111173 8939
9314H939p4195n1514J88J7054j5311j3579R712K7135J3794j7428Q952Q161M9125
$$ 8939 -65256 -116770 -116582 -99528 -114839 -128418 -118706 -91571 -77777 -95205 -86253 -78092 -28967
9301b8967M5131l6425n1138J8099j15192r054O5530J58333J20351q5605P0391
$$ -28967 16164 -20261 -71399 -53300 -168492 -177546 -112016 46317 166668 81063 151454
9290A51454J62877J26028j37718r3979K4476q5392k31134k7189L6414j9028K7577
$$ 151454 314331 440359 302641 208662 233138 147746 -83388 -110577 -74163 -93191 -65614
9279f5614k8591j1471m8943m3787j7561K6903L8568N847N4652J03537j7069p1294
$$ -65614 -94205 -105676 -154619 -198406 -215967 -189064 -150496 -144649 -89997 13540 -3529 -74823
9267g4823L4869K2736J07668n5197j39063j81258l303J77337J79725J06296P4989
$$ -74823 -39954 -17218 90450 35253 -103810 -285068 -288371 -111034 68691 174987 249976
9256B49976j22983K0033j5100j43183q2474p2502R1547Q8313J69635k0652j22130
$$ 249976 126993 147026 131926 -11257 -93731 -166233 -74686 13627 183262 162610 40480
9245D0480R4347M0660j37319l0011K1026J40551Q0795k9871m6280M1901q8336
$$ 40480 134827 175487 38168 8157 29183 169734 250529 220658 174378 216279 127943
9234A27943n7585j7195L5756R7014k9360K6143n710o5570K4084N8028J67358J4430
$$ 127943 70358 53163 88919 185933 156573 182716 177006 111436 135520 193548 360906 375336
9222C75336j61819j51364q4272n721J515M0345J01556Q230n4481j08465M7745
$$ 375336 213517 62153 -22119 -27840 -26325 14020 115576 123806 69325 -39140 8605
9211H605N2457N8702J04371O7354o6535r3768N4434p3249o9637Q4196J24331l0453
$$ 8605 61062 119764 224135 291489 224954 131186 185620 112371 42734 126930 251261 220808
9199B20808j49772m5743p6672p3050J1953P412O152r465P9055j4586p2386o4543
$$ 220808 71036 25293 -51379 -124429 -112476 -105064 -98912 -108377 -29322 -43908 -116294 -180837
9187a80837O2609J13809J04099j03799J0973K3262J4420L3453n9677r0495L589
$$ -180837 -118228 -4419 99680 -4119 6854 30116 44536 77989 18312 -72183 -68594
9176f8594R7359J18263m323j09739p9432J12148k7111j62584O3208m8129M338
$$ -68594 28765 147028 142705 32966 -46466 65682 38571 -124013 -60805 -108934 -104596
9165a04596Q5670P7932K5778Q013q6641l3254N8824j2390m1809o4464O818l3030
$$ -104596 -18926 59006 84784 92797 6156 -27098 31726 19336 -22473 -86937 -80119 -113149
9153a13149j2925J6714N1612P2795M7172J01758P2858j50732r5880q1951K9550
$$ -113149 -126074 -109360 -57748 15047 62219 163977 236835 86103 -9777 -91728 -62178
9142f2178J1544j53630o6989j29649M8956L1237K4073N903J21642P3696J41451
$$ -62178 -50634 -204264 -271253 -400902 -351946 -320709 -296636 -290733 -169091 -95395 46056
9131D6056M5010Q6748J2401q8705n2590l268L7703J4853R4021p1105j78132r3250
$$ 46056 91066 177814 190215 101510 48920 45652 83355 98208 192229 121124 -57008 -150258
9119a50258n294J35933N7622p1952n2898j3939M4861J1847q7793m5106M2284J70595
$$ -150258 -155552 -19619 38003 -33949 -86847 -100786 -55925 -44078 -131871 -176977 -134693 35902
9107C5902K8084k3371p8700J0458K7138R4898k992o3108O0392N431n5436q540
$$ 35902 63986 40615 -38085 -27627 -489 94409 91417 28309 88701 94132 38696 30156
9095C0156R9957L0807P53o0996K1474m1105p4006q3360n9957N8624p0938l9995
$$ 30156 130113 160920 161673 100677 122151 81046 7040 -76320 -136277 -77653 -148591 -188586
9083a88586M1297J11932M7232P6988O8731j00116l8289j1737K5322j0997l3298
$$ -188586 -147289 -35357 11875 88863 157594 57478 19189 7452 32774 21777 -11521
9072a1521M3416M5653j12935m4146M2889M2818r1109q6071M8380J15223O0158
$$ -11521 31895 77548 -35387 -79533 -36644 6174 -84935 -171006 -122626 -7403 52755
9061E2755Q8087j26018j55068R2510K598N0970j3660n4518o0307L9000L0921J75355
$$ 52755 140842 14824 -140244 -47734 -45136 5834 -7826 -62344 -122651 -83651 -52730 122625
9049A22625M4615p0710l0059j32660J8087j21692Q972P80L6279M6990J02286R832
$$ 122625 167240 96530 66471 -66189 -48102 -169794 -160822 -160042 -123763 -76773 25513 35345
9037C5345J7362m1378p067q4934l8425p7119j50955O625R4550J12179J2519M9690
$$ 35345 52707 11329 4262 -80672 -119097 -196216 -347171 -340546 -245996 -133817 -121298 -71608
9025g1608K0098k5652m3167R9004j5561o8860N9926M7956P4174j01049j17905
$$ -71608 -51510 -77162 -120329 -21325 -36886 -105746 -45820 2136 76310 -24739 -142644
9014a42644n5306k5454N2725M6623M2158O7024P5898q5120j1027P4250K5059n6646
$$ -142644 -197950 -223404 -170679 -124056 -81898 -14874 61024 -24096 -35123 39127 64186 7540
9002G540l1860J02856J2853p9060N9128Q82L3177j2025o5443J1766m3133R9890
$$ 7540 -24320 78536 91389 12329 71457 72339 105516 93491 28048 39814 -3319 96571
8990I6571K3508r8972q5582J841k8918K7845J26871n9788R182n7502J3557m8394
$$ 96571 120079 21107 -64475 -62634 -91552 -63707 63164 3376 12558 -44944 -31387 -79781
8978g9781o7351J1247J10016o8033m0350M7252J97004J02825m9059p6460n8900
$$ -79781 -147132 -135885 -25869 -93902 -134252 -87000 110004 212829 163770 87310 28410
8967B8410o9677p762N8748M9616k6213j8468l2567J5873o3266n5342K3982K36862
$$ 28410 -41267 -49029 9719 59335 33122 14654 -17913 -2040 -65306 -120648 -96666 140196
8955A40196O9396r5692q4475N4180j47209o5742k5911P0010J6369J8382J5971
$$ 140196 209592 113900 29425 83605 -63604 -129346 -155257 -85247 -68878 -50496 -34525
8944c4525n6009n1950r8277k1316l5535J18402N2358L5449L0343k8831P6836N2323
$$ -34525 -90534 -142484 -240761 -262077 -297612 -179210 -126852 -91403 -61060 -89891 -13055 39268
8932C9268N0583m698q9530J3022j6910L5527J33865l6777q7908o1037m2404k3591
$$ 39268 89851 85153 -4377 8645 -8265 27262 161127 124350 36442 -24595 -66999 -90590
8920i0590Q2255l8058q50P6584O0116j30891j16141J38059J00712N6278j16064
$$ -90590 -8335 -46393 -47243 29341 89457 -41434 -157575 -19516 81196 137474 21410
8909B1410l9594Q2426p7209p0235K1161K3349J20981J44949L1856r5021j3291
$$ 21410 -18184 64242 -12967 -83202 -62041 -38692 82289 227238 259094 164073 150782
8898A50782q9189j38182l6983J09767K0765j7484K7737J7018m5663O1507r5082
$$ 150782 61593 -76589 -113572 -3805 16960 -524 27213 44231 -1432 60075 -35007
8887c5007r2910K0756l3150J18480J37033M9704K3751j660j11513j30792p8589
$$ -35007 -127917 -107161 -140311 -21831 115202 164906 188657 186997 75484 -55308 -133897
8876a33897L5861J29652m5897K9811K6404P6957p1523l4845L151k3254L1957j987
$$ -133897 -98036 31616 -14281 15530 41934 118891 47368 12523 15674 -7580 24377 22390
8864B2390j07696L742P5990Q6687j2180j10471O8044M6295j2738p0726K9031p638
$$ 22390 -85306 -81564 -5574 81113 68933 -41538 26506 72801 60063 -10663 18368 10730
8852A0730J34026J9771j06059n1108k1490P7182J4548Q791M1873o7813p153J7701
$$ 10730 144756 164527 58468 7360 -14130 63052 77600 86391 128264 60451 53298 70999
8840G0999o0839l0998o2458M198M387J9492J3588J07868p8524l5022Q3129M8446
$$ 70999 10160 -20838 -83296 -79098 -74711 -55219 -41631 66237 -12287 -47309 35820 84266
8828H4266n4659n9136q9715m4632J28832j4023j13521L542J47828J52079L479
$$ 84266 29607 -29529 -119244 -163876 -35044 -49067 -162588 -159046 -11218 140861 144340
8817A44340m3237j5003j30847j11481N6161L6102p5575K6374P9073N0121P7752
$$ 144340 101103 86100 -44747 -156228 -100067 -63965 -139540 -113166 -34093 16028 93780
8806I3780O4805M842m4338k6143Q788M5452O1202k4753o8149j4105j2950p4626
$$ 93780 158585 163427 119089 92946 101734 147186 208388 183635 115486 101381 88431 13805
8794A3805p4148k6150n531J06894m6570l7075o2935k3484J11910J73839l4837
$$ 13805 -60343 -86493 -92024 14870 -31700 -68775 -131710 -155194 -43284 130555 95718
8783I5718o4046P2426l7230r9547n7967p8468Q9266O4573r2409K9041L2783r601
$$ 95718 31672 104098 66868 -32679 -90646 -169114 -79848 -15275 -107684 -78643 -45860 -55461
8771e5461K8474R0897k642l1563j53293m3760l2473q4327L4755j1443J27736J51813
$$ -55461 -26987 63910 61268 29705 -123588 -167348 -199821 -284148 -249393 -260836 -133100 18713
8759A8713l2760n8745n2631p9095N1810Q70P3430J26840j2332l3601K5565R8507
$$ 18713 -14047 -72792 -125423 -204518 -152708 -151838 -78408 48432 36100 2499 28064 126571
8747A26571j21229o1679J01538J63635p0868j27425j68428n5467J07375j2357
$$ 126571 5342 -56337 45201 208836 137968 10543 -157885 -213352 -105977 -118334
8737a18334M5873M2562O1658O3179j6031k1655k6781P062l7014m524l7071P2733
$$ -118334 -72461 -29899 31759 94938 78907 57252 30471 37533 519 -4005 -41076 31657
8725C1657K4832K6356K9452j08934m3183M9319O494m9349K837O2127o506j23986
$$ 31657 56489 82845 112297 3363 -39820 9499 15993 -33356 -30519 31608 25102 -98884
8713i8884p3983P8464R6138J37530j3462j03536j57975J6027J4525n3710R45O0923
$$ -98884 -172867 -94403 1735 139265 125803 22267 -135708 -119681 -105156 -158866 -157921 -96998
8701i6998Q0467J26488J6858j9435j03738q4597K7606J37151l1725J009K353n2864
$$ -96998 -16531 109957 126815 107380 3642 -80955 -53349 83802 52077 53086 55439 2575
8689B575P6755L6141m1159J6952J13664k3394n1481j5332j200M1202N0825m0017
$$ 2575 79330 115471 74312 91264 204928 181534 130053 114721 113521 154723 205548 165531
8677A65531j1154L5678q9140r6942P5244R752q4757M1966j1887N5071j03491j07132
$$ 165531 154377 190055 100915 3973 79217 88969 4212 46178 34291 89362 -14129 -121261
8665a21261M2111M3167L8992j3640m8684l9718K3301R9381N7380Q5442L2230j19597
$$ -121261 -79150 -35983 3009 -10631 -59315 -99033 -75732 23649 81029 166471 198701 79104
8653G9104p3550O7713Q0667j13013o5312P3427L9706m1087n495l8053L5935l4760
$$ 79104 5554 73267 153934 40921 -24391 49036 88742 47655 42160 4107 40042 5282
8641E282O8839o2684J351J20442K0105j88713M40J28629L1212q2788j01666R5637
$$ 5282 74121 11437 12788 133230 153335 -35378 -34938 93691 124903 42115 -59551 36086
8629C6086j2506m1864o3968M6762k2059j9604N6364J17136N5681Q1155p6361j51574
$$ 36086 23580 -18284 -82252 -35490 -57549 -77153 -20789 96347 152028 233183 156822 5248
8617E248q589K4317K4689m608L0714M443n810r5423n5062P320Q8705L021K7289
$$ 5248 -3341 20976 45665 41057 71771 76214 70404 -25019 -80081 -72761 15944 18965 46254
8604D6254J60969Q9693j1989j19009M8510j30310j52685Q3272J64845O8258l0335
$$ 46254 207223 296916 284927 165918 214428 84118 -68567 14705 179550 247808 217473
8593B17473r2084l9434O8164J89893O688r4375j63727j06595Q544Q6060p30M71
$$ 217473 125389 85955 154119 344012 350700 256325 92598 -13997 -5453 80607 79877 80348
8581H0348L0214M6534K3620j76369j01843N6615J31457l7733m1067r861j9483
$$ 80348 110562 157096 180716 4347 -97496 -40881 90576 52843 11776 1915 -17568
8570a7568j07287Q9436O8644J14639m6341o2053J5165Q2959O7805n9402j37825
$$ -17568 -124855 -35419 33225 147864 101523 39470 54635 137594 205399 145997 8172
8559H172J229J110M7199M6937P916o6857o7271K1939K1388L200l5074k512Q2615
$$ 8172 9401 10511 57710 104647 112563 45706 -21565 374 21762 24962 -10112 -12624 69991
8546F9991J63736K0586r2023l8875j18317q5526J47629R70L2715k6607n0519L4393
$$ 69991 233727 254313 162290 123415 5098 -80428 67201 68171 100886 74279 23760 58153
8534E8153k5610n2050l412J03137j54935o4509o802k2518K147M8183Q9277M7723
$$ 58153 32543 -19507 -22919 80218 -74717 -139226 -146028 -168546 -166399 -118216 -28939 18784
8522A8784N1213j9915l4688n395l8216r807J3429O1960n092m442L6768l8121k27690
$$ 18784 69997 50082 15394 9999 -28217 -38024 -24595 37365 32273 27831 64599 26478 -201212
8509b01212n7957K3703L6819l2342q433J21807r0609k6535M6023j1209o0639N3918
$$ -201212 -259169 -235466 -198647 -230989 -239422 -117615 -208224 -234759 -188736 -199945 -260584 -206666
8497b06666J49205Q0602M595p1836J645K1199j2532j8480R9088R5386m1023r6332
$$ -206666 -57461 23141 27736 -44100 -42455 -21256 -33788 -52268 46820 142206 101183 4851
8485D851r0434q2159M5686J75173K16096N3677p7690j02074k36562K5610P5985
$$ 4851 -85583 -167742 -122056 53117 269213 322890 245200 143126 -93436 -67826 8159
8474H159k5840l9974M2574l6150j1346L4985r55J320r7675j9071J05502P2982
$$ 8159 -17681 -57655 -15081 -51231 -62577 -27592 -28547 -27227 -124902 -143973 -38471 34511
8462C4511N530j16568K5276Q9304p3414q024M9931J30881k2470q1069j0880N2617
$$ 34511 40041 -76527 -51251 38053 -35361 -43385 6546 137427 114957 33888 23008 75625
8450G5625o0388j3171Q8625Q7162J4141J706m2015j336o8456m1628N159M6716
$$ 75625 15237 2066 90691 177853 191994 193700 151685 150349 81893 40265 45424 92140
8438I2140n5473N8182l1575J71061j23653j49003L234l231J84447L0130k32638
$$ 92140 36667 94849 63274 234335 110682 -38321 -35087 -38318 146129 176259 -56379
8427e6379q380O6303M1018K7523J4916O3631J22579m8274n9291Q2122p228j21062
$$ -56379 -64759 1544 42562 70085 85001 148632 271211 222937 163646 245768 238540 117478
8415A17478k9290N5281P7432k1659l141r5842q3269n3899q9401q5146J7536K046
$$ 117478 88188 143469 220901 199242 196101 100259 16990 -36909 -126310 -211456 -193920 -191874
8403a91874N5871Q4326o2865P2879j0185j5444k8924J22021P8094k9722k1325
$$ -191874 -136003 -51677 -114542 -41663 -51848 -67292 -96216 25805 103899 74177 52852
8392E2852p378M4911P3086K4637J7996P069m0147j01550k7560N2612r3955n1957
$$ 52852 45474 90385 163471 188108 206104 213173 173026 71476 43916 96528 2573 -49384
8380d9384P0861J7518J15745M4974J95m7486M5717O4292K9084j48824q3578l5107
$$ -49384 21477 38995 154740 199714 199909 152423 198140 262432 291516 142692 59114 24007
8368B4007j01780j35811Q968O0255p4789P7900P9823J11907O126o7655m3915m5173
$$ 24007 -77773 -213584 -204616 -144361 -219150 -141250 -61427 50480 56606 -11049 -54964 -100137
8356a00137k5023K8953L8686M2228L0130o6714l5350K3148P6823J25439M2592
$$ -100137 -125160 -96207 -57521 -15293 14837 -51877 -87227 -64079 12744 138183 180775
8345A80775m3068q0065l0756K7832Q1784J9255j21435p7389k0258J33715k9031
$$ 180775 137707 57642 26886 54718 136502 155757 34322 -43067 -63325 70390 41359
8334D1359P656m1245m9045l9656q5926J4841J25307p1465P7886J64718L5085j4278
$$ 41359 49015 7770 -41275 -80931 -166857 -152016 -26709 -98174 -20288 144430 179515 165237
8322A65237K727n6355m1279m3181M107M7550P216N9107O892j55947j8548m718
$$ 165237 167964 111609 70330 27149 31256 78806 86022 145129 152021 -3926 -22474 -27192
8310b7192j8149L6700J44779J23131J09330j31831n1853K4995M7569l533o7461
$$ -27192 -45341 -8641 136138 259269 368599 236768 184915 209910 257479 253946 186485
8299A86485j25078j62803R5480J3057o2690J2291l8975m8553L9937K7454l0096
$$ 186485 61407 -101396 -5916 7141 -55549 -43258 -82233 -130786 -90849 -63395 -93491
8288i3491K5387j1589j4735K0208L6612K5878J28742q557L0012j4920o2798J981
$$ -93491 -68104 -79693 -94428 -74220 -37608 -11730 117012 108455 138467 123547 60749 62730
8276F2730Q6015K4403k7721j0860J55768l5075m2940q0526J0272j0142q4440r8480
$$ 62730 148745 173148 145427 134567 290335 255260 212320 131794 142066 131924 47484 -50996
8264e0996j7746O7307N1651j00085j7514R7851R439j08778n0831n1039k197J34775
$$ -50996 -68742 -1435 50216 -49869 -67383 30468 39907 -68871 -119702 -170741 -172938 -38163
8252c8163j1092K8994O3844K1689L0739l8086m9705r1457m7130L4033M8870k0178
$$ -38163 -49255 -20261 43583 65272 96011 57925 8220 -83237 -130367 -96334 -47464 -67642
8240f7642N6515O0449m9887P7032j7653M3730Q2091q414N659j62739m7230J9225
$$ -67642 -11127 49322 -565 76467 58814 102544 184635 176221 181880 19141 -28089 -8864
8228h864J17098J38849o3801j39048j03947J14163p8332q296j4660P0656R0573
$$ -8864 108234 247083 183282 44234 -59713 54450 -23882 -32178 -46838 23818 114391
8217A14391L8581k2298j5809N0503j22587n1920P4484J05488n4007n8399n995
$$ 114391 152972 130674 114865 165368 42781 -9139 65345 170833 116826 58427 52432
8206E2432L5750j0051p5844J05260P9855L833P6277N594m7457j02686j07334L5177
$$ 52432 88182 78131 2287 107547 187402 191235 267512 273106 225649 122963 15629 50806
8194E0806J7944q237J854P897J2958j5520j09758k4578J9485o8580J802Q2620
$$ 50806 68750 60513 62367 70264 83222 67702 -42056 -66634 -47149 -115729 -113927 -31307
8182c1307J01552k638j1113Q7268m068r3008N0257N1912l8316o3153j1647k8869
$$ -31307 70245 67607 56494 143762 139694 46686 96943 148855 110539 47386 35739 6870
8170F870J3176p6809j52396o9295J86321J36349J43900j45770q3646k9375P3054
$$ 6870 20046 -56763 -209159 -278454 -92133 44216 188116 42346 -41300 -70675 2379
8159B379R0275L5835j27987k3845l3916Q3948R0279J29891q7965p3693J3725n3343
$$ 2379 92654 128489 502 -23343 -57259 26689 116968 246859 158894 85201 98926 45583
8147D5583m1008p3334j8824O5130L1392j08141K8121N7555N4155m7151j6147j45298
$$ 45583 4575 -68759 -87583 -22453 8939 -99202 -71081 -13526 40629 -6522 -22669 -167967
8135a67967R8013J73351R8797o0246j26450L9741j44900l3535j14094K4236J76605
$$ -167967 -69954 103397 202194 141948 15498 55239 -89661 -123196 -237290 -213054 -36449
8124c6449j8257j05183M1187N4055o9736j06098L7630O4825P9925L0980O7621
$$ -36449 -54706 -159889 -118702 -64647 -134383 -240481 -202851 -138026 -58101 -27121 40500
8113D0500K9965Q8957n8976q2998r1202n7667J8498J28891L1108q0033L8426J68335
$$ 40500 70465 159422 100446 17448 -73754 -131421 -112923 15968 47076 -32957 5469 173804
8101A73804K8125o8931n5170o8269j18761o7389N857R9783N1709r1125L4150J29339
$$ 173804 201929 132998 77828 9559 -109202 -176591 -170734 -70951 -19242 -110367 -76217 53122
8089E3122j16420n2779L9732J46479j8245n4320m1512Q0971N4533O8752o1743
$$ 53122 -63298 -116077 -76345 70134 51889 -2431 -43943 37028 91561 160313 98570
8078I8570m6090r2588R0978J80915n8853l6780o366m756J1650n3970O411J14780
$$ 98570 52480 -40108 50870 231785 172932 136152 129786 125030 136680 82710 89121 203901
8066B03901j18649p3357J1393P301M5990j5662j3181o1962p4004J72292L7399
$$ 203901 85252 11895 23288 30589 76579 60917 47736 -14226 -88230 84062 121461
8055A21461M7927N960m6730j51596m2471K5248Q0200p0545l7765m1818J00231
$$ 121461 169388 175348 128618 -22978 -65449 -40201 39999 -30546 -68311 -110129 -9898
8044i898J02540Q5000J08236M1700j52295j43324j6570q7123o0463J32572J45808
$$ -9898 92642 177642 285878 327578 175283 31959 15389 -71734 -132197 375 146183
8033A46183n74J3344m6248n2697J1917k305l1829j30871J052k5660N6937J5925
$$ 146183 145609 158953 112705 60008 71925 69620 37791 -93080 -92028 -117688 -60751 -44826
8021d4826P3978O8782L1806p7171j26987L1072J08649j0514L8480K4493o3905
$$ -44826 29152 97934 129740 52569 -74418 -43346 65303 54789 93269 117762 53857
8010E3857O034N708q5349l7640L7898o1839l4973L986m0495N6734J50895K0483
$$ 53857 59891 65599 -19750 -57390 -19492 -81331 -116304 -112318 -152813 -96079 54816 75299
7998G5299m5350j3277L5895k0163n6491M6059K7120P050o0905p3540k6539P1858
$$ 75299 29949 16672 52567 32404 -24087 21972 49092 56142 -4763 -78303 -104842 -32984
7986c2984J5292j09910J4651J43465l1387k9063n3296p146J1956L8275J01623
$$ -32984 -17692 -127602 -112951 30514 -873 -29936 -83232 -90378 -78422 -40147 61476
7975F1476K7933m3994j8162j28260o5365o0990M3910J2785m1300J6558l5295J14689
$$ 61476 89409 45415 27253 -101007 -166372 -227362 -183452 -170667 -211967 -195409 -230704 -116015
7963a16015J17670L6866q1382l3135j3104P5644J58394Q0109K7468l3369n9895
$$ -116015 1655 38521 -42861 -75996 -89100 -13456 144938 225047 252515 219146 159251
7952A59251p4624K0699l7412K3122O3644o7864m7049j1980p18O5023j9138R2411
$$ 159251 84627 105326 67914 91036 154680 86816 39767 27787 27069 92092 72954 165365
7940A65365m2528l9044l4124l5703L1832L4799J27676j129j12753l1442l5883
$$ 165365 122837 83793 49669 13966 45798 80597 208273 207144 94391 62949 27066
7929B7066k3711L2177n7880q286M3020J46629J01291r8299n9769n4679m4490N9328
$$ 27066 3355 35532 -22348 -30634 12386 159015 260306 162007 102238 47559 3069 62397
7917F2397R072N8018l7839j75065m5485K20354P189m7206J06558J9052m5497p640
$$ 62397 71469 129487 91648 -83417 -128902 91452 98641 51435 157993 177045 131548 123908
7905A23908O5008J2969q8085k99675j44114P1444J99366J48576L1991J7158j304
$$ 123908 188916 201885 113800 -185875 -329989 -258545 -59179 89397 121388 138546 137242
7894A37242P7991k9445K6103j8882M2725j9221j0843j74661j83574m6211o3905
$$ 137242 215233 185788 211891 193009 235734 216513 205670 31009 -152565 -198776 -262681
7883b62681l006J40979J03396R654m4680K7247N638p461O0884q945o0642n6011
$$ -262681 -265687 -124708 -21312 -11658 -56338 -29091 -23453 -30914 29970 21025 -39617 -95628
7871i5628J26121N671j1841p2963r6534N1900m7960j12937R7723Q8731J07820
$$ -95628 30493 36164 24323 -48640 -145174 -93274 -141234 -254171 -156448 -67717 40103
7860D0103p2897O9876l266j6212n8311j52025L7738R4320k0208K3828O067j1469
$$ 40103 -32794 37082 33816 17604 -40707 -192732 -154994 -60674 -80882 -57054 -50987 -62456
7848f2456j04428R1768R6182K8925q4801k0089L6789L7953M5802L468k18968n199
$$ -62456 -166884 -75116 21066 49991 -34810 -54899 -18110 19843 65645 69113 -149855 -155054
7836a55054J20630K829J06629M4363k9725j12161j2448n5702l6451Q739N7051
$$ -155054 -34424 -31595 75034 119397 89672 -22489 -34937 -90639 -127090 -118351 -61300
7825f1300l0338R4544J20344N8866Q5171n7040l4983j70516o2406Q489L5217J8673
$$ -61300 -91638 2906 123250 182116 267287 210247 175264 4748 -57658 -49169 -13952 4721
7813D721P8249n6214K2754N7176P4720N1841l7111k00655m1013N6850J8467J6227
$$ 4721 82970 26756 49510 106686 181406 233247 196136 -4519 -45532 11318 29785 46012
7801D6012n3366n2553P0896Q9320J07263l4331q3882m1919r7545j03799R055l3530
$$ 46012 -7354 -59907 10989 100309 207572 173241 89359 47440 -50105 -153904 -144849 -178379
7789a78379k8989P7345O4422p3764K4451J3075n1562K5558N0217P4798q6875n1230
$$ -178379 -207368 -130023 -65601 -139365 -114914 -101839 -153401 -127843 -77626 -2828 -89703 -140933
7777a40933M2147P5410j2542k0203M4570K8313J6695q0914r9580J12018P1791
$$ -140933 -98786 -23376 -35918 -56121 -11551 16762 33457 -47457 -147037 -35019 36772
7766C6772Q5134J16882o9800n3874p6544j19215r2582Q7864L2097n3553Q8494
$$ 36772 121906 238788 168988 115114 38570 -80645 -173227 -85363 -53266 -106819 -18325
7755a8325J1970j51005M3584M4055n4553p3781Q6600R5936N0096K6842p558q1883
$$ -18325 -6355 -157360 -113776 -69721 -124274 -198055 -111455 -15519 34577 61419 53861 -28022
7743b8022N3465m8569j348L2517j3270l6627r4842q3958N3531m3870r3941Q6722
$$ -28022 25443 -23126 -24474 8043 -5227 -41854 -136696 -220654 -167123 -210993 -304934 -218212
7731b18212P4488K2401J2981Q6018Q9699J1542m5205k2706L2686M6364n154r6385
$$ -218212 -143724 -121323 -108342 -22324 67375 78917 33712 11006 43692 90056 84902 -11483
7719a1483r3461N4052J28440n9796q0490J01057L7613P2446J4596o7712m3752
$$ -11483 -104944 -50892 77548 17752 -62738 38319 75932 148378 162974 95262 51510
7708E1510N4154Q7712J06612q3668j48384r5800N3533J0891m9396r951K9689O4075
$$ 51510 105664 193376 299988 216320 67936 -27864 25669 36560 -12836 -22787 6902 70977
7696G0977J9470k4663k5127o2090l9640J41349k6148n1265q635L3460n936p0113
$$ 70977 90447 65784 40657 -21433 -61073 80276 54128 2863 -5772 27688 21752 -48361
7684d8361n3342O2606o1544p0324p972O0075Q147L1297M9084p4811N8380J36995
$$ -48361 -101703 -39097 -100641 -170965 -178937 -118862 -110715 -79418 -30334 -105145 -46765 90230
7672I0230l2619o6903J0454J516K5432J47466j2242j29688n7082n2577l9020N4873
$$ 90230 57611 -9292 1162 2678 28110 175576 163334 33646 -23436 -76013 -115033 -60160
7660f0160K9835M7607J57423Q9089o5852j29208p0534N9151l6297M1735L3409
$$ -60160 -30325 17282 174705 263794 197942 68734 -1800 57351 21054 62789 96198
7649I6198r1991m1548K2627j7882L6674J4703j5849M4070j2641j5478P2682J8238
$$ 96198 4207 -37341 -14714 -32596 4078 18781 2932 47002 34361 18883 91565 109803
7637A09803m8185j41044N6545J3793L5333m1220j0746j7359j4363P358j04546
$$ 109803 61618 -79426 -22881 -9088 26245 -14975 -25721 -43080 -57443 -50085 -154631
7626a54631J6974K2188M0286J7115J7662M6368j68951j7398O5057j8234o444k5504
$$ -154631 -137657 -115469 -75183 -58068 -40406 5962 -162989 -180387 -115330 -133564 -140008 -165512
7614a65512K3355J01336J23845M5186p3358j6518O977l4776m419k9480j12015
$$ -165512 -142157 -40821 83024 128210 54852 38334 45311 10535 6116 -23364 -135379
7603a35379L6516J34816J13258K5143p9209K5539j6838j04794p1031N5404n4645
$$ -135379 -98863 35953 149211 174354 95145 120684 103846 -948 -71979 -16575 -71220
7592g1220R1095l2126j05733j9329J15072J50840k7839q8528j27545j4394N7590
$$ -71220 19875 -12251 -117984 -137313 -22241 128599 100760 12232 -115313 -129707 -72117
7581g2117J7699J6748L3504k5109j227p6869O9037K2861O5337l570q3979Q5200
$$ -72117 -54418 -37670 -4166 -29275 -30502 -107371 -38334 -15473 49864 46294 -37685 47515
7569D7515J2880L3057N8067n5332n5386r1021K2358M8203j03168k3494q1648N8755
$$ 47515 60395 93452 151519 96187 40801 -50220 -27862 20341 -82827 -106321 -187969 -129214
7557a29214L8044J5679M4360Q4202K6112r9928j02244j5180L2399J64069N536
$$ -129214 -91170 -75491 -31131 53071 79183 -20745 -122989 -138169 -105770 58299 63835
7546F3835j952r646j34657j05921J18500J92134p6789j53548q2309m5464Q2168
$$ 63835 61883 52237 -82420 -188341 -69841 122293 45504 -108044 -190353 -235817 -153649
7535a53649P1291j06356Q5148J04048j3354J1609J9877k6251N6418n2065j13791
$$ -153649 -82358 -188714 -103566 482 -12872 -1263 18614 -7637 48781 -3284 -117075
7524a17075J05665O7025J13533J16143J1882j37145r5639o2673r0769p5292R7232
$$ -117075 -11410 55615 169148 285291 297173 160028 64389 1716 -89053 -164345 -67113
7513f7113J2745o1842K1488J10313M9170j08358L45O155p3590n8807j667o3075
$$ -67113 -54368 -116210 -94722 15591 64761 -43597 -43252 -37097 -110687 -169494 -171161 -234236
7501b34236j4613J23720J81554K0973J21o9482o2475L0914P355r247k5747L6992
$$ -234236 -248849 -125129 56425 77398 77519 8037 -54438 -23524 -16169 -25416 -51163 -14171
7489a4171J09253j08114L1562j04534N9400L1879L6561K2501k25415K1575l8490
$$ -14171 95082 -13032 18530 -86004 -26604 5275 41836 64337 -161078 -139503 -177993
7478a77993M2327J38667R278R536j5358j9743K7166L42m9761L986L3346n4425
$$ -177993 -135666 3001 12279 21815 6457 -13286 13880 14222 -35539 -31553 1793 -52632
7466e2632N4618O9386l2991j16280J3095M7489O5538l309M8305K2683n945j54081
$$ -52632 1986 71372 38381 -77899 -64804 -17315 48223 44914 93219 115902 109957 -44124
7454d4124j9557Q3099J2011N292n2570k7189j5064j12587Q7867M0865l2120L6018
$$ -44124 -63681 19418 31429 36721 -15849 -43038 -58102 -170689 -82822 -41957 -74077 -38059
7442c8059J0073l3269J75513M375r7383n5147m032J7457K757J17959q412l0899
$$ -38059 -27986 -61255 114258 118633 21250 -33897 -37929 -20472 -17715 100244 91832 60933
7430F0933N2863M372r3060r377k1298j8405P3498J9675n0076o8597q0156n2982
$$ 60933 113796 118168 25108 15731 -5567 -23972 49526 69201 19125 -49472 -129628 -182610
7418a82610N2371J56498Q4305J58457k142j47720j06271l6481J2766J323L859
$$ -182610 -130239 26259 110564 269021 266879 119159 12888 -23593 -10827 -9504 -5645
7407e645L4542P8168P8598j14578r3841L0827K0305r259n610K6068J5662p0151
$$ -5645 28897 107065 185663 71085 -22756 8071 28376 19117 13507 39575 55237 -14914
7395a4914J571m047O7071P5776K3316n3865j11092l1293N7526M5030k0026L9139
$$ -14914 -13343 -17390 49681 125457 148773 94908 -16184 -47477 10049 55079 35053 74192
7383G4192J45568n3610r5688j20072o1333L8436N5667l5838l7058N5425O0652
$$ 74192 219760 166150 70462 -49610 -110943 -72507 -16840 -52678 -89736 -34311 26341
7372B6341L8471O584N8545l4551K5474l3390j20207r0101m6416K1908K5962J51763
$$ 26341 64812 71396 129941 95390 120864 87474 -32733 -122834 -169250 -147342 -121380 30383
7360C0383K6061k1454j07226k8711P6986M171n2015P4117n9485L2602p0620k5543
$$ 30383 56444 34990 -72236 -100947 -23961 -19790 -71805 2312 -57173 -24571 -95191 -120734
7348a20734J30592j874j8180J2704R8725K5717M6672R599l9765j1851K2805j95777
$$ -120734 9858 7984 -10196 2508 101233 126950 173622 183221 143456 131605 154410 -41367
7336d1367n3962J9419J551K7170n6679p6850M8835J7249O8634o7769j38010L1444
$$ -41367 -95329 -75910 -74359 -47189 -103868 -180718 -131883 -114634 -46000 -113769 -251779 -220335
7324b20335O4230P480M7847J36191l2994k8196L4738L8257J2139m8837r8044O3200
$$ -220335 -156105 -148625 -100778 35413 2419 -25777 8961 47218 59357 10520 -87524 -24324
7312b4324J23155m5383o6006n5889P6385l7122O3593L6335K9232K6069m9209o7179
$$ -24324 98831 53448 -12558 -68447 7938 -29184 34409 70744 99976 126045 76836 9657
7300I657q100n6985j23583l5599Q2879K7853J1120K9731M726l5723M2757j28379
$$ 9657 1557 -55428 -179011 -214610 -131731 -103878 -92758 -63027 -58301 -94024 -51267 -179646
7288a79646M5957K20623J30153P9917q061k11832r4962l8527Q2854Q5404n6839
$$ -179646 -133689 86934 217087 297004 288943 77111 -17851 -56378 26476 111880 55041
7277E5041L2439j11213m8259P7242R169m8172M2933L5502L7873K8952L4699K1281
$$ 55041 87480 -23733 -71992 5250 14419 -33753 9180 44682 82555 111507 146206 167487
7265A67487m7660L7117K3730j02950r2975m060n5287l9889L2253J02930M8881
$$ 167487 119827 156944 180674 77724 -15251 -19311 -74598 -114487 -82234 20696 69577
7254F9577J5379r2006J8503k6105J45416n1639j36110m912J08970P082j08209
$$ 69577 84956 -7050 11453 -14652 130764 79125 -56985 -61897 47073 54155 -54054
7243e4054Q7119K7470j02363j69416k029J718M636N8623L0747L593J0095n4233
$$ -54054 33065 60535 -41828 -211244 -213273 -211555 -206919 -148296 -117549 -113956 -103861 -158094
7231a58094R791K03782K1666K9705K1597p7359n9698Q7935M9698j20490l4357
$$ -158094 -148303 55479 77145 106850 128447 51088 -8610 79325 129023 8533 -25824
7220b5824j45597j48690N5398L5899N9954J7324J30171J17546Q3792k01440o3550
$$ -25824 -171421 -320111 -264713 -228814 -168860 -151536 -21365 96181 179973 -21467 -85017
7209h5017N353m6999J8534j7338l7101o0591r847P8197J3487P6905J42809m28
$$ -85017 -79664 -126663 -108129 -125467 -162568 -223159 -233006 -154809 -141322 -64417 78392 77964
7197G7964P332K7771K1815K80j27371O6827M0616N1408O2294k7289j43856j95921
$$ 77964 85296 113067 134882 135162 7791 74618 115234 166642 228936 201647 57791 -138130
7185a38130m2354n3046O1112R9435N5759j2424K8255L3225q3393l2678K9119J7208
$$ -138130 -180484 -233530 -172418 -72983 -17224 -29648 -1393 31832 -51561 -84239 -55120 -37912
7173c7912J6541J8637J09935J7003j1053l0015o9740j3686j60132n5512Q2361
$$ -37912 -21371 -2734 107201 124204 113151 83136 13396 -290 -160422 -215934 -133573
7162a33573P9585L197o4950M9872O5970M4752j4470M1337J0049K7893K6519k4355
$$ -133573 -53988 -50791 -115741 -65869 101 44853 30383 71720 81769 109662 136181 111826
7150A11826K0916p8778l1005m4251o038P3506Q1047R4010N9809q9671j19443o2932
$$ 111826 132742 53964 22959 -21292 -27330 46176 127223 221233 281042 191371 71928 8996
7138H996l9248J5411N2324k0045p1999j8167m2605R500N8660N3679K1603r2554
$$ 8996 -30252 -14841 37483 17438 -54561 -72728 -115333 -105833 -47173 6506 28109 -64445
7126f4445K3688J02865Q555j54838m6499Q5597J55500J9030p9668O9443p9489
$$ -64445 -40757 62108 70663 -84175 -130674 -45077 110423 129453 49785 119228 39739
7115C9739j43768o1374k4603R3964J33125k2645l7016n0466l0771k0195l4164
$$ 39739 -104029 -165403 -190006 -96042 37083 14438 -22578 -73044 -103815 -124010 -158174
7104a58174J06937M8898p2605R244k735R7176k7809L023P2179k7961r1369j10349
$$ -158174 -51237 -2339 -74944 -65700 -68435 28741 932 3955 76134 48173 -43196 -153545
7092a53545o4758R0802J09633N6506j13536j67076R1988J14137O9625J04433j3050
$$ -153545 -218303 -127501 -17868 38638 -74898 -241974 -149986 -35849 33776 138209 125159
7081A25159o4826K9387j21101j31715j9515K5728J65389K924P2709N5866n7528
$$ 125159 60333 89720 -31381 -163096 -182611 -156883 8506 11430 84139 140005 82477
7070H2477j22745J3721r032L5252R3281k3375p8355k1432M4401J3904N6413n3672
$$ 82477 -40268 -26547 -35579 -327 92954 69579 -8776 -30208 14193 28097 84510 30838
7058C0838j08984q7911o2597M0459O3702L0115M1644N5095n1691j57379J864P6084
$$ 30838 -78146 -166057 -228654 -188195 -124493 -94378 -52734 2361 -49330 -206709 -204845 -128761
7046a28761n259m9187L8634O0431m2072k6950N4837J18307J51097j29160o3343
$$ -128761 -134020 -183207 -144573 -84142 -126214 -153164 -98327 19980 171077 41917 -21426
7035b1426J12607j00342j53461Q209M1775M1502p0397o0816P5926J40064m636
$$ -21426 91181 -9161 -162622 -154413 -112638 -71136 -141533 -202349 -126423 13641 9005
7024I005k4793J4541l4405n7070J02530N4874n9015k9186J8097P3542j8447M6698
$$ 9005 -15788 -1247 -35652 -92722 9808 64682 5667 -23519 -5422 68120 49673 96371
7012I6371p2873P045q8575o7591Q9110M9438L6478k0641q25Q5549K2348j00760
$$ 96371 23498 30543 -58032 -125623 -36513 12925 49403 28762 27937 113486 135834 35074
7000C5074m0104j3809j06524K4287l3942J02308L6009K1567N8806m3861j17245
$$ 35074 -5030 -18839 -125363 -101076 -135018 -32710 3299 24866 83672 39811 -77434
6989g7434j1915J44055m0928p945j39784j09916n0336J1075P1364l434P608R8229
$$ -77434 -89349 54706 13778 5833 -133951 -243867 -294203 -283128 -211764 -215198 -207590 -109361
6977a09361N3421O75l6262O1741O2698n7441K8399K4527K478N8874p5338l4454
$$ -109361 -55940 -55265 -91527 -29786 32912 -24529 3870 28397 30875 89749 14411 -20043
6965b0043n8938n9167P6550j16162n1917R8127J24551O6766q7034j073O6810Q6142
$$ -20043 -78981 -138148 -61598 -177760 -229677 -131550 -6999 59767 -27267 -28340 38470 124612
6953A24612Q371j22709l0478n6124o016J34054j4490l4346K3476N8661l6379M3432
$$ 124612 132983 10274 -20204 -76328 -82344 51710 37220 2874 26350 85011 48632 92064
6941I2064O4212Q2448n6319j08222L9l1520J6189l3660j25621j5488N2284l439
$$ 92064 156276 238724 182405 74183 74222 42702 58891 25231 -100390 -115878 -63594 -67033
6929f7033q920P5840l168P1007j18911r2024M911P7945N0592n5222o4780L3797
$$ -67033 -75953 -113 -3281 67726 -51185 -143209 -138298 -60353 -9761 -64983 -129763 -95966
6917i5966O6141K3958p326L9548L8077M7483R5123j18219j13600J2666N0718J134
$$ -95966 -29825 -5867 -13193 26355 64432 111915 207038 88819 -24781 -12115 38603 39737
6905C9737J8520m1199O2709j2337p5094J6297p5146l6004K4355o5551r4869R2269
$$ 39737 58257 17058 79767 67430 -7664 8633 -66513 -102517 -78162 -143713 -238582 -146313
6893a46313R7289J25989j1137n5232J3034m502J4576j3799p5993j3127N4614l2152
$$ -146313 -49024 76965 65828 10596 23630 19128 33704 19905 -56088 -69215 -14601 -46753
6881d6753o6863N3526N4168m5537n1985k2431Q584J03944P1786P759M0271K1019
$$ -46753 -113616 -60090 -5922 -51459 -103444 -125875 -117291 -13347 58439 66198 106469 127488
6869A27488j49535m9589o446n7646n3790J82491J23787J0114n415p4695j00886
$$ 127488 -22047 -71636 -78082 -135728 -189518 -7027 116760 126874 121459 46764 -54122
6858e4122j2370O1499J1232J15742R612m8702p3951O783N0396L2200n834k3104
$$ -54122 -66492 -4993 6239 121981 131593 82891 8940 15723 66119 98319 92485 69381
6846F9381M1736p9347q4857N5748k8054N1714J6761k5649j03755R2241P3872o2755
$$ 69381 111117 31770 -53087 2661 -25393 26321 43082 17433 -86322 5919 79791 17036
6834A7036o9744r6889q668J7868K0564P5216j2837j5925n2697j8600O9459l0521
$$ 17036 -52708 -149597 -158265 -140397 -119833 -44617 -57454 -73379 -126076 -144676 -75217 -105738
6822a05738n3695o4492M2224j4975q9509Q2522J18195K2765r924o3979M7117J13846
$$ -105738 -159433 -223925 -181701 -196676 -286185 -203663 -85468 -62703 -72627 -136606 -89489 24357
6810B4357J94891k3055j97675q7791Q6263M1535j52851K5178J33997J21100M8276
$$ 24357 219248 196193 -1482 -89273 -3010 38525 -114326 -89148 44849 165949 214225
6799B14225K7835N928k2753L3099j82019n5112n2068P451l0171k2830J5802k8931
$$ 214225 242060 247988 225235 258334 76315 21203 -30865 -23414 -53585 -76415 -60613 -89544
6787h9544n21J35868J9988p1133m7920K1254N9516o4695j2859P9460m3122p905
$$ -89544 -90065 45803 65791 -5342 -53262 -32008 27508 -37187 -50046 29414 -13708 -21613
6775b1613J16602N3312m7651r4847o6266P41P4902j7861J678j7117o8782p7432
$$ -21613 94989 148301 100650 5803 -60463 -59722 15180 -2681 -1003 -18120 -86902 -164334
6763a64334l6879K5525q2863R5588J04859j8045Q5514J2218r2854M2394M0974
$$ -164334 -201213 -175688 -258551 -162963 -58104 -76149 9365 21583 -71271 -28877 12097
6752A2097P068J2713L360J5356J897m0554m1004o3106l6121P1399N2209j25976
$$ 12097 19165 31878 35238 50594 52491 11937 -29067 -92173 -128294 -56895 -4686 -130662
6740a30662o103R363O5001J02694k6928j60828M2493Q8168M139M6097j4801J0391
$$ -130662 -136765 -127402 -62401 40293 13365 -147463 -104970 -16802 -12663 33434 18633 29024
6728B9024j03682l4193m616J1493N0044j5885j4327O83o1030K2379J2767n5585
$$ 29024 -74658 -108851 -113467 -101974 -51930 -67815 -82142 -81459 -142489 -120110 -107343 -162928
6716a62928O7027J29915o9659K5122J16665P9649N283K59l8848j76136p8134J7401
$$ -162928 -95901 34014 -35645 -10523 106142 185791 191074 191333 152485 -23651 -101785 -84384
6704h4384J03020Q3173M2684j20645n9035l4242j4624j1020M7478L7688m6539
$$ -84384 18636 101809 144493 23848 -35187 -69429 -84053 -95073 -47595 -9907 -56446
6693e6446k3402r152j68039m5984Q7268Q3831J13012J43058M2516M8147j13260
$$ -56446 -79848 -89000 -257039 -303023 -215755 -131924 -18912 124146 166662 214809 101549
6682A01549k5049n309J7762O194r8762O1178J17658j2814n3942p4272n6072K8377
$$ 101549 76500 71191 88953 95147 -3615 57563 175221 162407 108465 34193 -21879 6498
6670F498M5427Q96P2351j5589q6993j23710l948Q4095l2616K1847M5969J1465
$$ 6498 51925 52821 125172 109583 22590 -101120 -105068 -20973 -53589 -31742 14227 25692
6658B5692Q8475k6891K0657K628j0541n8741q6240j60208M2614R2021J394J19161
$$ 25692 114167 87276 107933 110561 100020 41279 -44961 -205169 -162555 -70534 -69140 50021
6646E0021N6168k3651n3693n0213p1378N3527O2463l6787n6738J9286R5352p677
$$ 50021 106189 82538 28845 -21368 -92746 -39219 23244 -13543 -70281 -50995 44357 36680
6634C6680j914o036N0113j4987K9238j05925r5399N3039L9053L5636n1872m0802
$$ 36680 34766 28730 78843 63856 93094 -12831 -108230 -55191 -16138 19498 -32374 -73176
6622g3176j6852J5853n8410o3597O3756J01736p176N8856n2640p4892L2691J02825
$$ -73176 -90028 -74175 -132585 -196182 -132426 -30690 -37866 20990 -31650 -106542 -73851 28974
6610B8974P7818M7876L4776j16648p7280L0914j53954q7610R5601J02201J8770
$$ 28974 106792 154668 189444 72796 -4484 26430 -127524 -215134 -119533 -17332 1438
6599A438J8226J12428K8701J1383K7010o0051m6279q6171o0972j4441R4138o8627
$$ 1438 19664 132092 160793 172176 199186 139135 92856 6685 -54287 -68728 25410 -43217
6587d3217j17148j943M0404L8745p2403L2730n4359M8005M6101l1610J42730n288
$$ -43217 -160365 -162308 -121904 -83159 -155562 -122832 -177191 -129186 -83085 -114695 28035 22747
6575B2747N8057L9696L2523n4975n6499r9260l7546o8656N6628P2998j0640o239
$$ 22747 80804 120500 153023 98048 41549 -57711 -95257 -163913 -107285 -34287 -44927 -51166
6563e1166M026j7725Q101l2668l9603j9095J69348J25552J05120j19492J1241
$$ -51166 -47140 -64865 -56764 -89432 -129035 -148130 21218 146770 251890 132398 143639
6552A43639o4386R682j09021j16747J5862R9000M8031j75432j21639J51698R1194
$$ 143639 79253 88935 -20086 -136833 -120971 -21971 26060 -149372 -271011 -119313 -28119
6541b8119j7594m4000N8263M2421p330L7462M2106K1430N827j1345j21679k0019
$$ -28119 -45713 -89713 -31450 10971 3641 41103 83209 104639 110466 99121 -22558 -42577
6529d2577p5817J0395N0031r5205O5379N7705k1099K702O0871m1090k0723K3041
$$ -42577 -118394 -107999 -57968 -153173 -87794 -30089 -51188 -48486 12385 -28705 -49428 -26387
6517b6387J12478N3182k0995O9371p900J5920j04225p0805L1793n283p6786O0989
$$ -26387 86091 139273 118278 187649 179749 195669 91444 20639 52432 47149 -29637 31352
6505C1352k4092q1775j1547j3156J4734j1881L2065P3894J3483k285O9134J14720
$$ 31352 7260 -74515 -86062 -99218 -84484 -96365 -64300 9594 23077 20792 89926 204646
6493B04646l2463j01093J09900m817p9493j13846K2088j916N5462o1118j16129
$$ 204646 172183 71090 180990 176173 96680 -17166 4922 3006 58468 -2650 -118779
6482a18779m1736j3394K9957m1081J51511Q526q8901o3484N1819Q4764N9298K4104
$$ -118779 -160515 -173909 -143952 -185033 -33522 -24996 -113897 -177381 -125562 -40798 18500 42604
6470D2604j18514N6192K4287Q9380N0166j49410m4167p4847O7286k616K9367O4123
$$ 42604 -75910 -19718 4569 93949 144115 -5295 -49462 -124309 -57023 -59639 -30272 33851
6458C3851n8091j09483K3828J02884k3033j06662J1618J219L3061k6878J7585
$$ 33851 -24240 -133723 -109895 -7011 -30044 -136706 -125088 -123869 -90808 -117686 -100101
$$ [...]
##END NTUPLES=NMR SPECTRUM
##END=
