##TITLE=Analysis number 321406
Compound Code btb 09171
Project Code adrs
Chemist Name new century
##JCAMPDX= 6.0         $$ Bruker NMR JCAMP-DX V2.0
##DATA TYPE= NMR SPECTRUM
##DATA CLASS= NTUPLES
##ORIGIN= Bruker BioSpin GmbH
##OWNER= nmr
$$ XWIN-NMR		Version 3.5
$$ Wed Aug  9 11:32:31 2006 GMT Daylight Time (UT+1h)  MAYBRIDGE\nmr@NMR_250MHZ
##.OBSERVE FREQUENCY= 250.131544655141
##.OBSERVE NUCLEUS= ^1H
##.ACQUISITION MODE= SIMULTANEOUS (DQD)
##.ACQUISITION SCHEME= undefined
##.AVERAGES= 16
##.DIGITISER RES= 18
##SPECTROMETER/DATA SYSTEM= dpx250
##.PULSE SEQUENCE= zg30
##.SOLVENT NAME= CDCl3
##.SHIFT REFERENCE= (INTERNAL, CDCl3, 0, 16.522)
##AUDIT TRAIL= $$ (NUMBER, WHEN, WHO, WHERE, WHAT)
$$ ##TITLE= Audit trail, XWIN-NMR		Version 3.5
$$ ##JCAMPDX= 5.01
$$ ##ORIGIN= Bruker BioSpin GmbH
$$ ##OWNER= nmr
$$ C:\u/data/dgb/nmr/ADRS/480/pdata/1/auditp.txt
$$ ##AUDIT TRAIL=  $$ (NUMBER, WHEN, WHO, WHERE, WHAT)
(   1,<2006-08-09 11:32:08.08 +100>,<MAYBRIDGE\nmr>,<NMR_250MHZ>,
      <created by zg, POWCHK disabled, PULCHK disabled
       configuration hash MD5:
       E2 DF 36 D8 04 B2 41 60 5A D7 A3 38 5A 4B D0 FE
       data hash MD5: 64K
       D9 1A 1B 07 51 B6 DE 97 82 84 3E 53 50 DB 9F 02>)
(   2,<2006-08-09 11:32:20.27 +100>,<MAYBRIDGE\nmr>,<NMR_250MHZ>,
      <Start of raw data processing
       ef LB = 0.3 FT_mod = 6 PKNL = 1 SI = 32K 
       data hash MD5: 32K
       41 40 E0 8D 06 99 77 4D 38 34 43 01 8D 9B A6 1B>)
(   3,<2006-08-09 11:32:21.88 +100>,<MAYBRIDGE\nmr>,<NMR_250MHZ>,
      <apk 
       data hash MD5: 32K
       DA 2F 31 DC 09 70 51 94 0C 21 97 D9 E0 FB E3 BD>)
(   4,<2006-08-09 11:32:22.65 +100>,<MAYBRIDGE\nmr>,<NMR_250MHZ>,
      <abs ABSG = 5 
       data hash MD5: 32K
       43 F4 4B A1 4F ED 2D DC F2 73 AF 80 BF 8E 6F 24>)
$$ ##END=
$$ 
$$ hash MD5
$$ F5 F6 AF 24 89 60 B8 04 24 8F E4 5F 1B 8C 04 46
##$RELAX= 
##$RELAX= 
##$RELAX= 
##$RELAX= 
##$RELAX= 
##$RELAX= 
##$RELAX= 
$$ Bruker specific parameters
$$ --------------------------
##$DU= <C:\u>
##$EXPNO= 480
##$NAME= <ADRS>
##$PROCNO= 1
##$TYPE= <nmr>
##$USER= <dgb>
##$AMP= (0..31)
100 100 100 100 100 100 100 100 100 100 100 100 100 100 100 100 100 100 
100 100 100 100 100 100 100 100 100 100 100 100 100 100 
##$AQSEQ= 0
##$AQ_mod= 3
##$AUNM= <au_zg>
##$AUTOPOS= <19 >
##$BF1= 250.13
##$BF2= 250.13
##$BF3= 250.13
##$BF4= 250.13
##$BF5= 500.13
##$BF6= 500.13
##$BF7= 500.13
##$BF8= 500.13
##$BYTORDA= 1
##$CFDGTYP= 0
##$CFRGTYP= 5
##$CHEMSTR= <none>
##$CNST= (0..31)
1 1 145 1 1 1 1 1 1 1 1 1 1 1 1 1 1 1 1 1 1 1 1 1 1 1 1 1 1 1 1 1 
##$CPDPRG= <>
##$CPDPRG1= <>
##$CPDPRG2= <>
##$CPDPRG3= <>
##$CPDPRG4= <mlev>
##$CPDPRG5= <mlev>
##$CPDPRG6= <mlev>
##$CPDPRG7= <mlev>
##$CPDPRG8= <mlev>
##$CPDPRGB= <>
##$CPDPRGT= <>
##$D= (0..31)
0 1 0 0 0 0 0 0 0 0.06 0 0 0 0 0 0 0.0002 0 0 0 0 0 0 0 0 0 0 0 0 0 0 
0 
##$DATE= 1155119526
##$DBL= (0..7)
120 120 120 120 120 120 120 120 
##$DBP= (0..7)
150 150 150 150 150 150 150 150 
##$DBP07= 0
##$DBPNAM0= <>
##$DBPNAM1= <>
##$DBPNAM2= <>
$$ [...]
##$SUBNAM7= <"">
##$SUBNAM8= <"">
##$SUBNAM9= <"">
##$SW= 20.6930455092707
##$SWIBOX= (0..15)
0 0 3 0 0 0 0 0 0 0 0 0 0 0 0 0 
##$SW_h= 5175.983436853
##$TD= 65536
##$TD0= 1
##$TE= 295.16
##$TE2= 300
##$TE3= 300
##$TEG= 300
##$TL= (0..7)
0 120 120 120 120 120 120 120 
##$TP= (0..7)
150 150 150 150 150 150 150 150 
##$TP07= 0
##$TPNAME0= <>
##$TPNAME1= <>
##$TPNAME2= <>
##$TPNAME3= <>
##$TPNAME4= <>
##$TPNAME5= <>
##$TPNAME6= <>
##$TPNAME7= <>
##$TPOAL= (0..7)
0.5 0.5 0.5 0.5 0.5 0.5 0.5 0.5 
##$TPOFFS= (0..7)
0 0 0 0 0 0 0 0 
##$TUNHIN= 0
##$TUNHOUT= 0
##$TUNXOUT= 0
##$USERA1= <user>
##$USERA2= <user>
##$USERA3= <user>
##$USERA4= <user>
##$USERA5= <user>
##$V9= 5
##$VALIST= <valist>
##$VCLIST= <CCCCCCCCCCCCCCC>
##$VD= 0
##$VDLIST= <DDDDDDDDDDDDDDD>
##$VPLIST= <PPPPPPPPPPPPPPP>
##$VTLIST= <TTTTTTTTTTTTTTT>
##$WBST= 1024
##$WBSW= 4
##$XGAIN= (0..3)
0 0 0 0 
##$XL= 0
##$YL= 0
##$YMAX_a= 529433
##$YMIN_a= -557117
##$ZGOPTNS= <>
##$ZL1= 120
##$ZL2= 120
##$ZL3= 120
##$ZL4= 120
##$ABSF1= 16.522
##$ABSF2= -4.171173
##$ABSG= 5
##$ABSL= 3
##$ALPHA= 0
##$AQORDER= 0
##$ASSFAC= 0
##$ASSFACI= 0
##$ASSFACX= 0
##$ASSWID= 0
##$AUNMP= <proc_1d>
##$AZFE= 0.1
##$AZFW= 0.1
##$BCFW= 0
##$BC_mod= 0
##$BYTORDP= 0
##$COROFFS= 0
##$CY= 12.5
##$DATMOD= 1
##$DC= 0
##$DFILT= <>
##$DTYPP= 0
##$F1P= 14.0000005364418
##$F2P= -0.99999901652339
##$FCOR= 0.5
##$FTSIZE= 32768
##$FT_mod= 6
##$GAMMA= 0
##$GB= 0
##$INTBC= 1
##$INTSCL= 1
##$ISEN= 128
##$LB= 0.3
##$LEV0= 0
##$LPBIN= 0
##$MAXI= 10000
##$MC2= 0
##$MEAN= 0
##$ME_mod= 0
##$MI= 0
##$NCOEF= 0
##$NC_proc= -4
##$NLEV= 6
##$NOISF1= 0
##$NOISF2= 0
##$NSP= 0
##$NTH_PI= 0
##$NZP= 0
##$OFFSET= 16.522
##$PC= 1
##$PHC0= 152.8027
##$PHC1= 9.19837
##$PH_mod= 1
##$PKNL= yes
##$PPARMOD= 0
##$PSCAL= 4
##$PSIGN= 0
##$REVERSE= no
##$SF= 250.13
##$SI= 32768
##$SIGF1= 0
##$SIGF2= 0
##$SINO= 400
##$SIOLD= 32768
##$SREGLST= <1H.CDCl3>
##$SSB= 0
##$STSI= 32768
##$STSR= 0
##$SW_p= 5175.98343685301
##$SYMM= 0
##$S_DEV= 0
##$TDeff= 65536
##$TDoff= 0
##$TI= <Analysis number 999999
Compound Code 99
Book Reference 9
Project Code 9>
##$TILT= no
##$TM1= 0
##$TM2= 0
##$TOPLEV= 0
##$USERP1= <user>
##$USERP2= <user>
##$USERP3= <user>
##$USERP4= <user>
##$USERP5= <user>
##$WDW= 1
##$XDIM= 32768
##$YMAX_p= 351758297
##$YMIN_p= -350886
$$ End of Bruker specific parameters
$$ ---------------------------------
##NTUPLES= NMR SPECTRUM
##VAR_NAME=  FREQUENCY,     SPECTRUM/REAL,   SPECTRUM/IMAG
##SYMBOL=    X,             R,               I
##VAR_TYPE=  INDEPENDENT,   DEPENDENT,       DEPENDENT
##VAR_FORM=  AFFN,          ASDF,            ASDF
##VAR_DIM=   32768,         32768,           32768
##UNITS=     HZ,            ARBITRARY UNITS, ARBITRARY UNITS
##FACTOR=    0.157963299565203, 1,           1
##FIRST=     4132.6476996994, 0,             0
##LAST=      -1043.33573715361, 0,           0
##MIN=       -1043.33573715361, -350886,     0
##MAX=       4132.6476996994, 351758297,     0
$$ Real data points
##PAGE= N=1
##DATA TABLE= (X++(R..R)), XYDATA
$$ [...]
24245G9891m0568n7686M7660M4162n9283l8332n4325o2482P496M1407m001l3208
$$ 79891 39323 -18363 29297 73459 14176 -24156 -78481 -140963 -133467 -92060 -96061 -129269
24233a29269k7893P0596J24103M9528l2192l534n0895k7941P633J1362M4116l0890
$$ -129269 -157162 -86566 37537 87065 54873 51339 444 -27497 -19864 -8502 35614 4724
24221D724n1070N94O8141Q4228r847r3521m5499l6542o6475q637J18731J1282
$$ 4724 -46346 -45752 22389 106617 96770 3249 -42250 -78792 -145267 -153904 -35173 -23891
24209b3891m4950l0505K9130L8243Q039K7458j5613J7040K2132j0958q058k0535
$$ -23891 -68841 -99346 -70216 -31973 -23934 3524 -12089 4951 27083 16125 8067 -12468
24197a2468l344q133o014L3455Q5267l5223m9639l2020J8012J06882L5719o0630
$$ -12468 -15812 -23945 -29959 3496 88763 53540 3901 -28119 -10107 96775 132494 71864
24185G1864o3405k894O1145J336J7801M9043L323j01131k4465K3941m026J5225
$$ 71864 8459 5565 66710 68046 85847 134890 138213 37082 12617 36558 32532 47757
24173D7757J2344j6714n1644m3844q17P9121l3380j0858j9378q6757l9006N3547
$$ 47757 60101 43387 -8257 -52101 -52918 26203 -7177 -18035 -37413 -124170 -163176 -109629
24161a09629M6339J25487J5021m2529j2981P1922J0511k6623j07647j1847Q7237
$$ -109629 -63290 62197 77218 34689 21708 93630 104141 77518 -30129 -41976 45261
24150D5261P5636K0504o1615n5323j5363l3071M9056O8035j797p553r3255m6590
$$ 45261 120897 141401 79786 24463 9100 -23971 25085 93120 91323 83770 -9485 -56075
24138e6075O0509m1163l6494K9956n2438q0021K7028J47860Q1203j24852k3290
$$ -56075 4434 -36729 -73223 -43267 -95705 -175726 -148698 -838 80365 -44487 -67777
24127f7777J20555O3677q8588l2088m8272J852M5633o29l0890K4129Q7735j7398
$$ -67777 52778 116455 27867 -4221 -52493 -50641 -5008 -5637 -36527 -12398 75337 57939
24115E7939n0810P21l4360m2645L5648N8279P5807L4087j09820j04631n2353q178
$$ 57939 7129 7850 -26510 -69155 -33507 24772 100579 134666 24846 -79785 -132138 -140316
24103a40316K1902N4293j8546M2768L5884l3846L9052r957K4744L1905P0599R884
$$ -140316 -118414 -64121 -82667 -39899 -4015 -37861 1191 -8766 15978 47883 118482 128366
24091A28366m0901n4023k790R059L3369j9233l9558R15p2695m9375R2265K3584
$$ 128366 87465 33442 30652 39711 73080 53847 14289 15204 -57491 -106866 -14601 8983
24079H983k6820n760n3513j02245k1956K5176L3732L7652o312K1948P2665M4363
$$ 8983 -17837 -23597 -77110 -179355 -201311 -176135 -142403 -104751 -111063 -89115 -16450 27913
24067B7913J0673L246n2357p0652n4063K2805q254L4018J53181m3405q2129K9510
$$ 27913 38586 41832 -10525 -81177 -135240 -112435 -120689 -86671 66510 23105 -59024 -29514
24055b9514J9942L9175M3457K525j4572k7567M4811o132j30527o8662K8160M7185
$$ -29514 -9572 29603 73060 75585 61013 33446 78257 72125 -58402 -127064 -98904 -51719
24043e1719R0614L6868n3066m6618k3909L6451j6209k0183P1001o910j9586L4265
$$ -51719 38895 75763 22697 -23921 -47830 -11379 -27588 -47771 23230 16320 -3266 30999
24031C0999L4872n6525M1252o0764n8981k7450K1155r4240P9617M4704R1183k7667
$$ 30999 65871 9346 50598 -10166 -69147 -96597 -75442 -169682 -90065 -45361 45822 18155
24019A8155K8383O8299k5843J3307L6186N3381m4117n1480J5010R892n3024j26117
$$ 18155 46538 114837 88994 102301 138487 191868 147751 96271 111281 121173 68149 -57968
24007e7968j0113L8669Q0607m3745J8779M4203n106L707J2645q117l4291o8024
$$ -57968 -68081 -29412 51195 7450 26229 70432 65326 69033 81678 73561 39270 -28754
23995b8754p3650K8752k831O1233p632r317O812L2451Q1461l9637p0639l6267
$$ -28754 -102404 -73652 -76483 -15250 -22882 -32199 -25387 7064 88525 48888 -21751 -58018
23983e8018l7884q6568L118J32365J32155M414r4093j4356M4337p3041j21079
$$ -58018 -95902 -182470 -179352 -46987 85168 89582 -4511 -18867 25470 -47571 -168650
23972a68650K9019J40642m03l7292Q040N8966Q889o0059O2423M5767n0291n6174
$$ -168650 -139631 1011 608 -36684 -28644 30322 39211 -20848 41575 87342 37051 -19123
23960a9123N0566R348j26396l8586M3763Q8027P9220K6708k8889j4307p8637o9579
$$ -19123 31443 40791 -85605 -124191 -80428 7599 86819 113527 84638 70331 -8306 -77885
23948g7885n3946M0440K0377J2004j1134m9704l1478J55884P5067l5746J0201
$$ -77885 -131831 -91391 -71014 -59010 -70144 -119848 -151326 4558 79625 43879 54080
23937E4080n7394O950J3480q039K0468M3224R199q1450r4562q08m229j7305N1543
$$ 54080 -3314 3636 17116 9077 29545 72769 81968 518 -94044 -94852 -99081 -116386 -64843
23924f4843O8215J7877N7004J3334l1653n7325J5556o1547r0028M626K2870J47571
$$ -64843 3372 21249 78253 91587 59934 2609 18165 -43382 -133410 -128784 -105914 41657
23912D1657K4228j18745p5274m7886j4014M8406P6686P3313o4177M8376O6622
$$ 41657 65885 -52860 -128134 -176020 -190034 -141628 -64942 8371 -55806 -7430 59192
23901E9192q3494n2347P349k2517L4834j0074n945J879q8456r8618J27456R9185
$$ 59192 -24302 -76649 -69300 -91817 -56983 -67057 -73002 -71123 -159579 -258197 -130741 -31556
23889c1556k0119l677L7696j3150O0429J03431R149k0417o8958j037m8667n4777
$$ -31556 -51675 -55352 -17656 -30806 29623 133054 142203 121786 52828 51791 3124 -51653
23877e1653m0237J7674r4287J3238R5879k8067J3141O3581N8077k3511p2205n3256
$$ -51653 -91890 -74216 -168503 -155265 -59386 -87453 -74312 -10731 47346 23835 -48370 -101626
23865a01626J96j974n5005k1836J11975J14517l5945N5307M1296o0383j24197
$$ -101626 -101430 -103404 -158409 -180245 -68270 46247 10302 65609 106905 46522 -77675
23854g7675j2779K7096l2232L2137J5285K2922K9357k9505q1834J2609P9361R1809
$$ -77675 -90454 -63358 -95590 -63453 -48168 -25246 4111 -25394 -107228 -94619 -15258 76551
23842G6551L4525l3902J4519p3974o405R2869n2644k0368J7023o3141n1717J1801
$$ 76551 111076 77174 91693 17719 11314 104183 51539 31171 48194 -14947 -66664 -54863
23830e4863J0325K5012J1266M1328o6534n3805Q71N6128q652j5900n59M0615j4496
$$ -54863 -44538 -19526 -8260 33068 -33466 -87271 -86400 -30272 -38924 -54824 -55383 -14768 -29264
23817b9264k4560m5284Q9122R468k3003l3860K8326k6479j2046L8141M2161P732
$$ -29264 -53824 -99108 -9986 -518 -23521 -57381 -29055 -55534 -67580 -29439 12722 20454
23805B0454p4693j5054N6019l2267q806p020p0375J7387J8059K8669L2547K1516
$$ 20454 -54239 -69293 -13274 -45541 -54347 -61367 -131742 -114355 -96296 -67627 -35080 -13564
23793a3564N6018n8101q0720J9567O3743J8966n0546O8927M8994K3505m5253q3403
$$ -13564 42454 -15647 -96367 -76800 -13057 5909 -44637 24290 73284 96789 51536 -31867
23781c1867k7384k7289o5466K5792L2778K1387R4419L6757m4154O232J32434l9831
$$ -31867 -59251 -86540 -152006 -126214 -93436 -72049 22370 59127 14973 21205 153639 113808
23769A13808j08397m3767N8742M2255K8178j09975m2960M5095m7298K5944k3155
$$ 113808 5411 -38356 20386 62641 90819 -19156 -62116 -17021 -64319 -38375 -61530
23758f1530m3778m6995J3286R99l5278L9452L5898R886j2411l4038O983O507M7842
$$ -61530 -105308 -152303 -139017 -138018 -173296 -133844 -97946 -88060 -100471 -134509 -127526 -121019 -73177
23745g3177n5168J5781P8099N1126O271Q295k7441o5227J6999J9908J3344l6961
$$ -73177 -128345 -112564 -34465 16661 22932 31227 3786 -61441 -44442 -24534 -11190 -48151
23733d8151m2053q092j670J19382M674j4142K209j6846l6619Q290m6777j08056
$$ -48151 -90204 -98296 -99966 19416 24090 9948 12157 -4689 -41308 -33018 -79795 -187851
23721a87851j8058J27292M1049l935p9647m1166l4369M7601O9789N0082m0358
$$ -187851 -205909 -78617 -37568 -41503 -121150 -162316 -196685 -149084 -79295 -29213 -69571
23710f9571O774N2344m0548o4777n8060l5215L763O7109J7129n7706L3139P7722
$$ -69571 -62797 -10453 -51001 -115778 -173838 -209053 -205290 -138181 -121052 -178758 -145619 -67897
23698f7897Q8182k0847m7071L943L2547J9687n6014p5279l1018M5812L1024j0886
$$ -67897 20285 -562 -47633 -43690 -11143 8544 -47470 -122749 -153767 -107955 -76931 -87817
23686h7817K148N4335J01137p443k3080M3006n5759q4552m6314p5307m252P9323
$$ -87817 -85669 -31334 69803 62360 39280 82286 26527 -58025 -104339 -179646 -183898 -104575
23674a04575J4950M4243L0582K0251n7370j65841P7129R7264M7367M0819q1980
$$ -104575 -89625 -45382 -14800 5451 -51919 -217760 -140631 -43367 4000 44819 -37161
23663c7161k0896P3323L9336p6913k8544J1331j5476p3732o7707n959N0947P1614
$$ -37161 -58057 15266 54602 -22311 -50855 -39524 -55000 -128732 -196439 -202398 -151451 -79837
23651g9837P132k293N5753n3809N961O1963N8221K731k6575K303Q7361k8083p3466
$$ -79837 -72705 -74998 -19245 -73054 -67093 -5130 53091 55822 29247 31550 118911 90828 17362
23638A7362L1967N9423k0111k0570j02897M4757J8272n6546m3445l5593M5362
$$ 17362 49329 108752 88641 68071 -34826 9931 28203 -28343 -71788 -107381 -62019
23627f2019P3658O9535L7158l5877p0226m4888n8701Q732m191Q86N8846L454k4916
$$ -62019 11639 81174 118332 82455 12229 -32659 -91360 -82628 -86819 -85933 -27087 -23633 -48549
23614d8549K407N2964L3218K0550l8154o8125k3330p249m2584P0803P4728M7205
$$ -48549 -46142 6822 40040 60590 22436 -45689 -69019 -76268 -118852 -48049 26679 73884
23602G3884k3800n1268K2848k4139j108R0613k718p4392K80L0975l1779k6852
$$ 73884 50084 -1184 21664 -2475 -3583 87030 84312 9920 10200 41175 9396 -17456
23590a7456j5801q591J8211K3704O031q5396K1234K0475n3757O2636L7993L0276
$$ -17456 -33257 -41848 -23637 67 6098 -79298 -58064 -37589 -91346 -28710 9283 39559
23578C9559j9916n4637K8235k2840j0868n9123L0318L4185j4499L2764k3808l5829
$$ 39559 19643 -34994 -6759 -29599 -40467 -99590 -69272 -35087 -49586 -16822 -40630 -76459
23566g6459O6831K7724L3829o4147l5463j2530N3809O7128L631M3847l4545m1990
$$ -76459 -9628 18096 51925 -12222 -47685 -60215 -6406 60722 64353 108200 73655 31665
23554C1665n2395n4875K8980K2052k1800k5205j0339L5698M2157m045R968k1925
$$ 31665 -20730 -75605 -46625 -24573 -46373 -71578 -81917 -46219 -4062 -8107 1861 -20064
23542b0064k0980m6541j3176M0417K695P5917N7320m5267l3501j642k6999p9948
$$ -20064 -41044 -87585 -100761 -60344 -57649 18268 75588 30321 -3180 -4822 -31821 -111769
23530a11769k8210L8255j5M4010K7475p5962J0567k285O0569J21807L1408o8221
$$ -111769 -139979 -101724 -101739 -57729 -30254 -106216 -95649 -97934 -37365 84442 115850 47629
23518D7629j4883j2054n7432k5760p6367N3329L7536J837K7556p5023j8820P2917
$$ 47629 32746 20692 -36740 -62500 -138867 -85538 -48002 -46165 -18609 -93632 -112452 -39535
23506c9535k2156K5198K4871J5001J3760q1846L1812L2818K6885L1391o7744M992
$$ -39535 -61691 -36493 -11622 3379 17139 -64707 -32895 -77 26808 58199 -9545 -4553
23494d553Q3306J3932l4944p8082j11246k5251K9078O5501j8501l8401l6899O9240
$$ -4553 78753 92685 57741 -20341 -131587 -156838 -127760 -62259 -80760 -119161 -156060 -86820
23482h6820R300O4692N5384m0669p5578L900N947o2528M9097J39421Q5645k7794
$$ -86820 -77520 -12828 42556 1887 -73691 -69791 -63844 -126372 -77275 62146 147791 119997
23470A19997p5070p5871N2330O7691o4688m4199m5526r96L9562p5538J4896n9300
$$ 119997 44927 -30944 21386 89077 24389 -19810 -65336 -66332 -26770 -102308 -87412 -146712
23458a46712k9563J3277p976J04144K2608O2523O4800j4815j6682k5208K7502
$$ -146712 -176275 -162998 -170974 -66830 -44222 18301 83101 68286 51604 26396 53898
23447E3898q1658j8885J37342J39377q0463j42181m9172J4420m6200K2736j1232
$$ 53898 -27760 -46645 90697 230074 149611 7430 -41742 -27322 -73522 -50786 -62018
23436f2018P3936N8044n5081n7166j7933J04891J19648L6757m5689j2178n9347
$$ -62018 11918 69962 14881 -42285 -60218 44673 164321 201078 155389 143211 83864
23425H3864m8424o5771O6282N0961J01197n0649J9651j3968p7157l4098K7874
$$ 83864 35440 -30331 35951 86912 188109 137460 157111 143143 65986 31888 59762
23414E9762J9442j01072m3184p25K5848N2180N634L482L9904p087n4388j7618
$$ 59762 79204 -21868 -65052 -65777 -39929 12251 17885 21367 61271 54184 -204 -17822
23402a7822K357j047m9135m9816m639K5765L8709P2334p009k5206l352R0322Q9562
$$ -17822 -15465 -16512 -65647 -115463 -120102 -94337 -55628 16706 9697 -15509 -18861 71461 161023
23389A61023q5364m8153J0010j0269k8208M0935J9237n8164L7691O9085m2871
$$ 161023 75659 27506 37516 27247 -961 39974 59211 1047 38738 107823 64952
23378F4952j7510M7207k7579l9177p7112j8088N0415j625M5556K5195Q463m7710
$$ 64952 47442 94649 67070 27893 -49219 -67307 -16892 -18517 27039 52234 60697 12987
23366A2987M899R724L5643k531j5332Q1458m1687p5839l9097m634m4976L3078
$$ 12987 17886 27610 63253 60722 45390 126848 85161 9322 -29775 -34409 -79385 -46307
23354d6307p3385q2547l5405N4029Q5596q857N2325J14158l4359j26451n0263
$$ -46307 -119692 -202239 -237644 -183615 -98019 -106876 -54551 59607 25248 -101203 -151466
23343a51466N1239P6001M3090L5377j2463n5785Q1562J8633Q6869M8506p0878
$$ -151466 -100227 -24226 18864 54241 41778 -14007 67555 86188 173057 221563 150685
23332A50685l9796m7087j2168j06004p7431J13531N4032L5336l5485l6991O1360
$$ 150685 110889 63802 51634 -54370 -131801 -18270 35762 71098 35613 -1378 59982
23321E9982N3853j1591p8177k8734j8035j6416K9556n7885k0630J06118l5362
$$ 59982 113835 102244 24067 -4667 -22702 -39118 -9562 -67447 -88077 18041 -17321
23310a7321k272N037j0315j7917k0956N2670J0151j8976K7391J08745o0515j24395
$$ -17321 -19593 -14556 -24871 -42788 -63744 -11074 -923 -19899 7492 116237 55722 -68673
23298f8673q3302L3311Q0769N2041P1075j0418j02071k0535k6470M8497l6375
$$ -68673 -151975 -118664 -37895 14146 85221 74803 -27268 -47803 -74273 -25776 -62151
23287f2151R300O6580K1069m4191r4074q4597M5104M0001j0976O6046l4151J9389
$$ -62151 -52851 13729 34798 -9393 -103467 -188064 -142960 -102959 -113935 -47889 -82040 -62651
23275f2651N5445n4012p1297M8059P2585r03k6876J6908J06182l0820n4090j2199
$$ -62651 -7206 -61218 -132515 -84456 -11871 -12774 -39650 -22742 83440 52620 -1470 -13669
23263a3669L4737Q8138J41r9250j01903k6303K7125L8607l2009l4791o1472O1467
$$ -13669 21068 109206 109347 10097 -91806 -118109 -90984 -52377 -84386 -119177 -180649 -119182
23251a19182J5135O9279L6179m8204k6382m9690k0457k4859K420j3145L9589Q9781
$$ -119182 -104047 -34768 1411 -46793 -73175 -122865 -143322 -168181 -165761 -178906 -139317 -49536
23239d9536R9204l6902j0760J8588l5614j2803l9619o5774N3274J13442O4564
$$ -49536 49668 12766 2006 20594 -15020 -27823 -67442 -133216 -79942 33500 98064
23228I8064K1490K6672p9369j20760k2243M0804K163N257O9255J4837Q6603m3762
$$ 98064 119554 146226 66857 -53903 -76146 -35342 -33179 -27922 41333 56170 142773 99011
23216I9011j58746o8689K9023J0856P0490J5487k8213j11796r226J40913L8307
$$ 99011 -59735 -128424 -99401 -88545 -18055 -2568 -30781 -142577 -151803 -10890 27417
23205B7417J2172o0897j8977m3208n7549K7995k3295P4990M3929m1202K92K9272
$$ 27417 39589 -21308 -40285 -83493 -141042 -113047 -136342 -61352 -17423 -58625 -58333 -29061
23193b9061P9798Q3937R275r8636l4090J9426m0826J4417K2769o3147J8526J6108
$$ -29061 50737 134674 143949 45313 11223 30649 -10177 4240 27009 -36138 -17612 -1504
23181a504r0450r1802j5110J02058M6274l1519K2429l3738K014j4550L6433Q8524
$$ -1504 -91954 -183756 -198866 -96808 -50534 -82053 -59624 -93362 -91348 -105898 -69465 19059
23169A9059P1382K3061l266o1672n70n0514j02003J8904L5129P6206L0824l7986
$$ 19059 90441 113502 110236 48564 47994 -2520 -104523 -85619 -50490 25716 56540 18554
23157A8554P235J4865P7051n7720J8625p2361n5080L3466M7583l1318K265r63
$$ 18554 25789 40654 117705 59985 78610 6249 -48831 -15365 32218 900 3165 2202
23145B202p0203o5221R4071M7572L7346P3842J06450j11903m7660n6821o3328
$$ 2202 -68001 -133222 -39151 8421 45767 119609 226059 114156 66496 9675 -53653
23134e3653J384M4194m2238n9461m3113L4325Q1275J26178M8867l6158L266M529
$$ -53653 -52269 -8075 -50313 -109774 -152887 -118562 -37287 88891 137758 101600 104866 109395
23122A09395q6495r2145K325l4371L9955J0105l430l356L881m8486p2252L3859
$$ 109395 22900 -69245 -66920 -101291 -61336 -51231 -54661 -58017 -54136 -102622 -174874 -141015
23110a41015J41877J19j3700M0450N9816j14763q4725n6313J4748J05159j5948
$$ -141015 862 981 -12719 27731 87547 -27216 -111941 -168254 -153506 -48347 -64295
23099f4295j19908M9982O1258J8281j07784p7855P3953P3109n1579N233K8296
$$ -64295 -184203 -134221 -72963 -54682 -162466 -240321 -166368 -93259 -144838 -139605 -111309
23088a11309j692L4017K8788k389Q3293P5894N3205l7020l8061L0867l8972j9721
$$ -111309 -113001 -78984 -50196 -52585 30708 106602 159807 122787 84726 115593 76621 56900
23076E6900L3514o022j71326q3591m384N2506k1778K0749M9918q469o7007o7366
$$ 56900 90414 84392 -86934 -170525 -174909 -122403 -144181 -123432 -73514 -81983 -148990 -216356
23064b16356N6318M6073J3948M6715q751J4806p2791p5402J02751Q5122k249N1339
$$ -216356 -160038 -113965 -100017 -53302 -62053 -47247 -120038 -195440 -92689 -7567 -9816 41523
23052D1523p4022r0236J07002J12862J7916o5691l6823n7356k2920k820M2681
$$ 41523 -32499 -122735 -15733 97129 115045 49354 12531 -44825 -67745 -70565 -27884
23041b7884r89P5371N6198K7590J8544m4251m7685L2402J7422K351Q607P8342
$$ -27884 -28873 46498 102696 130286 148830 104579 56894 89296 106718 109069 117676 196018
23029A96018q4360m9698K2568O8806l3071j40587N89Q261R547k3056m112k4815
$$ 196018 111658 61960 84528 153334 120263 -20324 -19735 -11474 -1927 -24983 -29095 -53910
23017e3910P661P0089k3073p249k9827n6538Q2068O7955J2299l0880l642j23535
$$ -53910 -46249 23840 767 -6482 -36309 -92847 -10779 57176 69475 38595 34953 -88582
23005h8582K7462o510N2105M9220n4301n5072N4233O2827p243J080R676l45o2092
$$ -88582 -61120 -67630 -15525 33695 -20606 -75678 -21445 41382 34139 35219 44895 44550 -17542
22992a7542n2497N1494K1339l8407J8137J7418n1040q4365J0454o242R1515L4601
$$ -17542 -70039 -18545 2794 -35613 -17476 -58 -51098 -135463 -125009 -131251 -39736 -5135
22980e135L1013m072j8709L7401m3085l0075L3286K8321r03O973M1297r8492r1049
$$ -5135 25878 21806 3097 40498 -2587 -32662 624 28945 28042 35015 76312 -22180 -113229
22967a13229L9725N0774P4865N8746p5439k3367j7305N6355J1257N0318l0302
$$ -113229 -73504 -22730 52135 110881 35442 12075 -5230 51125 62382 112700 82398
22956H2398o7456l80K1629r7397p5066K1176J2013l2736o0092J092P5802J04872
$$ 82398 14942 14562 36191 -61206 -136272 -115096 -103083 -135819 -195911 -194819 -119017 -14145
22944a4145q265k422K3297M6764K4387o9602k6142q486J3979k8851n6915n4475
$$ -14145 -22410 -24832 -1535 45229 69616 14 -26128 -34614 -20635 -49486 -106401 -160876
22932a60876j5802M5727N0629O3136M5181P8643Q3492k1668r9703k7411o270L7713
$$ -160876 -176678 -130951 -80322 -17186 27995 106638 190130 168462 68759 41348 35078 72791
22920G2791m4063P772L7206m5738J6127K9353l8148M0774p4490r4481m1794K034
$$ 72791 28728 36500 73706 27968 44095 73448 35300 76074 1584 -92897 -134691 -132657
22908a32657M7104J16229K4875l6026J8947J3368N92j2757J4861l0293o18k650
$$ -132657 -85553 30676 55551 19525 38472 51840 52432 39675 54536 24243 23625 20975
22896B0975j9372R824P985l0262m6595J2320o76O9920O562n9375m5191o2881J6159
$$ 20975 1603 11427 19412 -10850 -57445 -45125 -45801 24119 30681 -28694 -73885 -136766 -120607
22883a20607R4879j0630K1623k7933k6127n4691r7626m340L4569q1783j4641l3751
$$ -120607 -25728 -36358 -14735 -42668 -68795 -123486 -221112 -225452 -190883 -272666 -287307 -321058
22871c21058R5428M9592O9636J3602n7452J7028R5899L7197L2915J0909p2154
$$ -321058 -225630 -176038 -106402 -92800 -150252 -133224 -37325 -128 32787 43696 -28458
22860b8458k3089p893m2486O387J70640J30846n3842q2848k5688j6241r2056L2053
$$ -28458 -51547 -59440 -101926 -95539 75101 205947 152105 69257 43569 27328 -64728 -32675
22848c2675L3798L3653J675m662j2678j6684j12058j2201J05746N1434l8294r7940
$$ -32675 1123 34776 36451 31789 19111 2427 -109631 -121832 -16086 35348 -2946 -100886
22836a00886l7018L0385O6630l698L3714m3997p773J123M9921J08773K7527l5672
$$ -100886 -137904 -107519 -40889 -44587 -10873 -54870 -62643 -61520 -11599 97174 124701 89029
22824H9029m6867O3028J00695L3030o1534l7092r520j1388k3433J6136O6319l5850
$$ 89029 42162 105190 205885 238915 177381 140289 130769 119381 95948 112084 178403 142553
22812A42553m0001n9486K19m5238k0705N6405N494k9842L5673m3747j8571N4562
$$ 142553 102552 43066 43285 -1953 -22658 33747 39241 9399 45072 1325 -17246 37316
22800C7316P927J4489M085L23L1554o5311m0270j9165O9392j0250p0668k8923
$$ 37316 45243 59732 63817 64140 95694 30383 -9887 -29052 40340 30090 -40578 -69501
22788f9501l6608K5639O4510o0799j0591J1475K954R1017Q3820m5895o5642l2494
$$ -69501 -106109 -80470 -15960 -76759 -87350 -75875 -72921 18096 101916 56021 -9621 -42115
22776d2115K9420K2907j1956n287Q708J3199l7866m2032J3202j1497k095J9542
$$ -42115 -12695 10212 -1744 -7031 1677 14876 -22990 -65022 -51820 -63317 -65412 -45870
22764d5870M1015K4187k0963j3776P2105l9598j03612K6105L0122J6663P713n1017
$$ -45870 -4855 19332 -1631 -15407 56698 17100 -86512 -60407 -30285 -13622 -5909 -56926
22752e6926k740P127M5801K9093K3056k2775n0640j7729o7299l0978j2776J0631
$$ -56926 -59666 -52539 -6738 22355 45411 22636 -28004 -45733 -113032 -144010 -156786 -146155
22740a46155L8036J7577m9586n6834K9744M4423R097O8799L2336o4173N0848Q4346
$$ -146155 -108119 -90542 -140128 -196962 -167218 -122795 -113698 -44899 -12563 -76736 -25888 58458
22728E8458Q1250n3723j5873k7796k2172k138q716J5062J6200k0706K7849r380
$$ 58458 139708 85985 70112 42316 20144 18006 9290 24352 40552 19846 47695 38315
22716C8315J08400Q4646q6908j13100J0305L9513R64o0858M143N5412J8923m0507
$$ 38315 146715 231361 144453 31353 41658 81171 82135 21277 25420 80832 99755 59248
22704E9248j16432q0910O6576P9299J7423M9867m1557r0489j1030K7449M471p041
$$ 59248 -57184 -138094 -71518 7781 25204 75071 33514 -56975 -68005 -40556 -36085 -43126
22692d3126j2768o1229j60M8144K5765j7112P1787N1292q806j2315O1772M9972
$$ -43126 -55894 -117123 -117283 -69139 -43374 -60486 11301 62593 53787 41472 103244 153216
22680A53216p3105l2657N4394Q721m7997m6042p5180l2733k8026K4877N2101m2373
$$ 153216 80111 47454 101848 110569 62572 16530 -58650 -91383 -119409 -94532 -42431 -84804
22668h4804R0127M1021n2477p5681O3937P1361J8916k6875K0157L2369m9818K0658
$$ -84804 5323 46344 -6133 -81814 -17877 53484 72400 45525 65682 98051 48233 68891
22656F8891N7543j161r1649J8843L8553n6806p3599J9506M1304k597J4722N9846
$$ 68891 126434 125273 33624 52467 91020 34214 -39385 -19879 21425 18828 33550 93396
22644I3396j3323l7815n0428Q552K0093J1903L1506O3301m1262q5489L9274M7379
$$ 93396 80073 42258 -8170 382 20475 32378 63884 127185 85923 434 39708 87087
22632H7087N3630m2812j8943k2140j0919r5569p8098J07760R4661l9916m9166
$$ 87087 140717 97905 78962 56822 45903 -49666 -127764 -20004 74657 34741 -14425
22621a4425K3177n1080m2437L6980O6265k4562J5652P7553J18888k0422l4048
$$ -14425 8752 -42328 -84765 -47785 18480 -6082 9570 87123 206011 185589 151541
22610A51541j6780m3540p5163L1666k101k07p5611q7815J7783M3763J4879M9471
$$ 151541 134761 91221 16058 47724 45623 45416 -30195 -118010 -100227 -56464 -41585 7886
22598G886K3045l511r3287l4484K3432k4921J4153k1027N8166M6168k3746J09440
$$ 7886 30931 27420 -65867 -100351 -76919 -101840 -87687 -108714 -50548 -4380 -28126 81314
22586H1314k0269j7867Q693l043N9342o9561j05367Q8845N6729l8562k9680L2064
$$ 81314 61045 43178 51871 48828 108170 38609 -66758 22087 78816 40254 10574 42638
22574D2638j12355n8209K0282J00831P5497O8719P847q2276p9675K8912j659j6826
$$ 42638 -69717 -127926 -107644 -6813 68684 137403 145250 62974 -16701 12211 10552 -6274
22562f274L7140O686j9409J1680k815L1220J407m0418n0035M5015Q239n4335k7709
$$ -6274 30866 37552 18143 29823 27008 58228 59635 19217 -30818 14197 22436 -31899 -59608
22549e9608M5650j2037j0531o99N8151O1633O1068n3584m4251m9457K4558Q0191
$$ -59608 -13958 -25995 -36526 -37225 20926 82559 143627 90043 45792 -3665 20893 101084
22537A01084K0962j00704l0348O196L6078j6730j6451J2756j2270l4572N0803
$$ 101084 122046 21342 -9006 -2810 33268 16538 87 12843 573 -33999 16804
22526A6804M947l7450l3306Q6941J8323N2058J20185j5400j32471q6011n3669
$$ 16804 21751 -15699 -49005 37936 56259 108317 228502 213102 80631 -5380 -59049
22515e9049o4347P0608N6495L5485m0847m6709r4219K2778L2291J2718l4002K9978
$$ -59049 -123396 -52788 3707 39192 -1655 -48364 -142583 -119805 -87514 -74796 -108798 -78820
22503g8820J52931k7869k6044J14633M2297j6623L636J2998n8822k7100Q5009
$$ -78820 74111 46242 20198 134831 177128 160505 164141 177139 118317 91217 176226
22492A76226k0613k0748n8290k5910q4502K2177J09867m229n0166L1151J525l3081
$$ 176226 155613 134865 76575 50665 -33837 -11660 98207 93978 43812 74963 76488 43407
22480D3407J4746l6949l6161k2176l6457m0550m4258P318J20541N9317k3672n420
$$ 43407 58153 21204 -14957 -37133 -73590 -114140 -158398 -151080 -30539 28778 5106 -314
22468c14L4542L3792q9989j40655M8820L3269L4018o8345M121J8673K4175O3196
$$ -314 34228 68020 -21969 -162624 -113804 -80535 -46517 -114862 -110741 -92068 -67893 -4697
22456d697O657J6785o0911l4203J7608L5395j4962k8305r5110J0096N9732M1418
$$ -4697 1960 18745 -42166 -76369 -58761 -23366 -38328 -66633 -161743 -151647 -91915 -50497
22444e0497j9847j487l1692m1316Q7022j0910n4709N196j01994j0079M9278L8223
$$ -50497 -70344 -71831 -103523 -144839 -57817 -68727 -123436 -118240 -220234 -230313 -181035 -142812
22432a42812M0956K363l1987K5939K1696M8907O2680n201O4152K8391j5254r7571
$$ -142812 -101856 -99493 -131480 -105541 -83845 -34938 27742 22541 86693 115084 99830 2259
22420B259N7507M4073K3731J1870k0293q4445o4757k0276m0597K2623O2488N0727
$$ 2259 59766 103839 127570 139440 119147 34702 -30055 -50331 -90928 -68305 -5817 44910
22408D4910Q113M9963Q7229r2756k8708q9989k1433N2491m7860q0460J3862l410
$$ 44910 53023 102986 190215 97459 68751 -21238 -42671 9820 -38040 -118500 -104638 -108048
22396a08048J13656J3695k7101k9653j949O2499M2817j1023m644l8597k7473J3354
$$ -108048 5608 19303 -7798 -37451 -39400 23099 65916 54893 50249 11652 -15821 -2467
22384b467L724j2688k5505O5600n691j19867k0127n5627K5255J31552L5948J0044
$$ -2467 1257 -11431 -36936 28664 22973 -96894 -117021 -172648 -147393 -15841 20107 30151
22372C0151m6829l0304R1669q462Q485K736K9537K9184J485o7943m9487R373k192
$$ 30151 -16678 -46982 44687 36225 44710 47446 76983 106167 107652 39709 -9778 -405 -2597
22359b597L7879k2040o8457l9399Q195r974n0133J8993N6126M106l4936L2407
$$ -2597 35282 13242 -55215 -94614 -86419 -96393 -146526 -127533 -71407 -67301 -102237 -69830
22347f9830M617q7207m7116P2600P062j6012J3405J4800J7026R1980q225j9755
$$ -69830 -65213 -152420 -199536 -126936 -119874 -135886 -122481 -107681 -90655 1325 -6900 -26655
22335b6655M6296L1769o3737P360K5973k9570K5443Q4904k5603o9238n3293J8645
$$ -26655 19641 51410 -12327 -4967 21006 -8564 16879 101783 76180 6942 -46351 -27706
22323b7706j19636K5466N9701l498p588L2691j80R083O829L4209N4808Q8916J4212
$$ -27706 -147342 -121876 -62175 -65673 -73261 -40570 -40750 -31667 -24838 9371 64179 153095 167307
22310A67307j10563J1206K4195l5815p1096k0047R3801R6784K4094p4219o2279
$$ 167307 56744 67950 92145 56330 -14766 -34813 58988 155772 179866 105647 43368
22299D3368j0669j5012M529P077j9157P180o3480M728L023K0145j6855K7278k6559
$$ 43368 32699 17687 22216 29293 10136 17316 -46164 -41436 -38413 -18268 -35123 -7845 -34404
22286c4404j7131J0823o242J3213J5948R331p6145k2857j8195Q3380l184n8036
$$ -34404 -51535 -40712 -46954 -33741 -17793 -8462 -84607 -107464 -125659 -42279 -45463 -103499
22274a03499n438o6291J07619R2266J1539j8607m771O6595P1385J2328O239l6652
$$ -103499 -108937 -175228 -67609 24657 36196 17589 12818 79413 150798 163126 169365 132713
22262A32713j14830l6592M779j1689k8960Q8663J6083j08654j576Q8041j7836
$$ 132713 17883 -18709 -13930 -25619 -54579 34084 50167 -58487 -60063 27978 10142
22251A0142o1010K8788J1868J09247k581P071n7416j5836K2301r6799l0602k4975
$$ 10142 -50868 -22080 -10212 99035 96454 103525 46109 30273 52574 -44225 -74827 -99802
22239i9802L9306M1090m6162K558P3975n7858r7683N0772L9122R2651J7232n3731
$$ -99802 -60496 -19406 -65568 -63010 10965 -46893 -144576 -93804 -54682 37969 55201 1470
22227A470j19334O5071P7474r3250R368L3105k5063P1337l9037J336J1178N4433
$$ 1470 -117864 -52793 24681 -68569 -59201 -26096 -51159 20178 -18859 -17523 -6345 48088
22215D8088P7450L3747j0247m2117o4823m8878O566j2951j0185K2943m3351q9696
$$ 48088 125538 159285 149038 106921 42098 -6780 -214 -13165 -23350 -407 -43758 -133454
22203a33454m2760J31558J1286k8766L7392J8331q9089m0177Q4943M7341o9711
$$ -133454 -176214 -44656 -33370 -62136 -24744 -6413 -95502 -135679 -50736 -3395 -73106
22192g3106m3768J31511L4393n4863j03642L1601P3945J2718O4612J0926l4777
$$ -73106 -116874 14637 49030 -5833 -109475 -77874 -3929 8789 73401 84327 49550
22181D9550Q018r069J0517J15209p5364j22478p8777n0672M6802J66966j2890
$$ 49550 57568 48499 59016 174225 98861 -23617 -102394 -153066 -106264 60702 47812
22170D7812n4487m9167m8966o1497J5546M7872N0614N4440N4033N2346j9684K5090
$$ 47812 -6675 -55842 -104808 -166305 -150759 -102887 -52273 2167 56200 108546 88862 113952
22158A13952L1861l6488o7532K7516o919l0420N5765N7664J9258L3099j03777
$$ 113952 145813 109325 41793 69309 62390 31970 87735 145399 164657 197756 93979
22147I3979q2968K9937m3289r72N621p5276o0064q878J6732K5996j7442k1469
$$ 93979 11011 40948 -2341 -3313 2308 -72968 -133032 -141910 -125178 -99182 -116624 -138093
22135a38093j7270M8463j4264K1531K3780J0439O4330k2924p7003J2176O5622
$$ -138093 -155363 -106900 -121164 -99633 -75853 -65414 -1084 -24008 -101011 -88835 -23213
22124b3213M2399J13036J78j7992j3469q5412k7689J3668l1807k7064j1168k9704
$$ -23213 19186 132222 132400 114408 100939 15527 -12162 1506 -30301 -57365 -68533 -98237
22112i8237q7960j730j97L0968O3721k5672q5570J9287K9437r372P5759q2118
$$ -98237 -186197 -187927 -188124 -157156 -93435 -119107 -204677 -185390 -155953 -165325 -89566 -171684
22100a71684n7063M4489P8449j3428R7407K0009q375q499L91n3532n2282M2208
$$ -171684 -228747 -184258 -105809 -119237 -21830 -1821 -10196 -18695 -18304 -71836 -124118 -81910
22088h1910K8056j372q2798N2341L9108k637R853K7749M708j2750J0364K5823
$$ -81910 -53854 -55226 -138024 -85683 -46575 -49212 -39359 -11610 -6902 -19652 -9288 16535
22076A6535o802q4991l9784o4647q222m82Q2645N7251p090O558P6035J4554J7177
$$ 16535 9733 -75258 -115042 -179689 -187911 -188393 -105748 -48497 -55587 -49029 27006 41560 58737
22063E8737j1326k5628L8255M4230m686M969l8079p0895k0534p5560n8440K5633
$$ 58737 47411 21783 60038 104268 99582 104551 66472 -4423 -24957 -100517 -158957 -133324
22051a33324K7457L7907P5546J0718p893M0141M7424O9992m3597p5311m0053O7938
$$ -133324 -105867 -67960 7586 18304 10411 50552 97976 167968 124371 49060 9007 76945
22039G6945L1356l4861M6482M9121J4680j94633k1895l2660j1055k4425j0612
$$ 76945 108301 73440 119922 169043 183723 -10910 -32805 -65465 -76520 -100945 -111557
22028a11557j6279L7674k2976j0907j2466p7094J5273J24834R4788r785o9045
$$ -111557 -127836 -90162 -113138 -124045 -136511 -213605 -198332 -73498 21290 11505 -57540
22017e7540p0401k8936Q7927M1028Q791O4980N4009Q115j36754l5758K4420O4443
$$ -57540 -127941 -156877 -68950 -27922 -19131 45849 99858 107973 -28781 -64539 -40119 24324
22005B4324R587o7003L7861J6722L854k4433n6112N271P1938m811K145L31J4713
$$ 24324 33911 -33092 4769 21491 25345 912 -55200 -49929 22009 17198 19343 19674 34387
21992C4387j4641j4932O68M9373m2991m8000j3076K8736l8524q821N979O5564
$$ 34387 19746 4814 5482 54855 11864 -36136 -49212 -20476 -59000 -67821 -61842 3722
21980C722l6143o7368L8727Q5169o3842l0505Q5178J7625m0494n1309K1151K7622
$$ 3722 -32421 -99789 -61062 24107 -39735 -70240 14938 32563 -7931 -59240 -38089 -10467
21968a0467Q7960L440l8275n3107N04J6799k011m4080n3534L8669P1079N2571
$$ -10467 77493 80933 42658 -10449 -9945 6854 4843 -39237 -92771 -54102 16977 69548
21956F9548p5049j15659l8896K7806P1222Q437Q4461k9629j13473K5644K3238
$$ 69548 -5501 -121160 -160056 -132250 -61028 -52591 31870 2241 -111232 -85588 -62350
21945f2350L9086M2456j4124j9830O3225p1096l74O9850n6345P963J8454O5209
$$ -62350 -23264 19192 5068 -14762 48463 -22633 -23007 46843 -9502 -1539 16915 82124
21933H2124o6089n3322m8011n0441L4315R289j16048j5067J22688P8872N2959
$$ 82124 16035 -37287 -85298 -135739 -101424 -92135 -208183 -223250 -100562 -21690 31269
21922C1269m415M298M1495K9080j7436l7534K1446o6069o5027j9334L526J8679
$$ 31269 26854 31152 72647 101727 84291 46757 68203 2134 -62893 -82227 -78701 -60022
21910f0022l1616p217N805J1583m6063q1751N5543P2624L4365K3574K2753j7129
$$ -60022 -91638 -98855 -93050 -81467 -127530 -209281 -153738 -81114 -46749 -23175 -422 -17551
21898a7551m1500p1134p167J19753J0082O4236J3307o2021l0317q8099o4232J4337
$$ -17551 -59051 -130185 -137352 -17599 -7517 56719 70026 8005 -22312 -110411 -174643 -160306
21886a60306O8299l7578P9643l0715l1645L4829k7154k3038j3827O353Q9675J40819
$$ -160306 -92007 -129585 -49942 -80657 -112302 -77473 -104627 -127665 -141492 -135139 -45464 95355
21874I5355K2492j0218l1522n9077k9803L1347M253o463m8008k3494K6147P4110
$$ 95355 117847 107629 76107 17030 -12773 18574 22827 16364 -31644 -55138 -28991 45119
21862D5119p3555n7542N5945o2903l0014K2299J29783l5060q1849J4604l2613
$$ 45119 -28436 -85978 -30033 -92936 -122950 -100651 29132 -5928 -87777 -73173 -105786
21851a05786N483N1467p1841J1948l6715j3794R325q882O5250l5904q917L8311
$$ -105786 -100303 -48836 -120677 -108729 -145444 -159238 -149913 -158795 -93545 -129449 -138366 -100055
21839a00055l0751p518N336K1261M1166O4869J7709O8550J3365j2740K287p4295
$$ -100055 -130806 -138324 -132988 -111727 -70561 -5692 12017 80567 93932 81192 83479 9184
21827I184J523J7452J2197M8936k0784l9109k364m649M146Q602o8584m1667J5264
$$ 9184 10707 28159 40356 89292 68508 29399 27035 22386 26532 35134 -33450 -75117 -59853
21814e9853j3746L2769K4969l3176M976N4508m0930n3638K9100L7647k3904L3005
$$ -59853 -73599 -40830 -15861 -49037 -44061 10447 -30483 -84121 -55021 -17374 -41278 -8273
21802h273J07541R1937j1977o6248m8841K4066N5928K4802k3313j15141l7065
$$ -8273 99268 191205 179228 112980 64139 88205 144133 168935 145622 30481 -6584
21791f584o6070r1009J04759J09000N051r1309m0852M940K4405N8735l0259k8029
$$ -6584 -72654 -163663 -58904 50096 55147 -36162 -77014 -72074 -47669 11066 -19193 -47222
21779d7222L0495L1704R9159J9548n1360o7331k5427R359o0539L5535j988n0226
$$ -47222 -16727 14977 114136 133684 82324 14993 -10434 -1075 -61614 -26079 -28067 -78293
21767g8293O7844k9949q3338K3996L1294L2937R378J0668K4701N1520R635J3768
$$ -78293 -10449 -40398 -123736 -99740 -68446 -35509 -26131 -15463 9238 60758 70393 84161
21755H4161p31L1966n7083p836O3380O0456o0991j18281n9613m0744J346j997
$$ 84161 83430 115396 58313 50477 113857 174313 113322 -4959 -64572 -105316 -103970 -105967
21743a05967N029l4509N2373m6412j5096O3014N9440J8143M7101j216j101J0821
$$ -105967 -100938 -135447 -83074 -129486 -144582 -81568 -22128 -3985 43116 41900 40799 51620
21731E1620k0035j1737Q240K6527l5871j7637R91j8743q501m167j557l7188O2565
$$ 51620 31585 19848 28088 54615 18744 1107 2098 -16645 -25146 -29313 -30870 -68058 -5493
21718e493J70698l0834j09680n7419O011Q190Q2563j4196j472M4240j1168q7537
$$ -5493 165205 134371 24691 -32728 -26717 -18527 64036 49840 48368 92608 81440 -6097
21706f097r6421P4249P0078K7184k8371J3709M0850k8814m2745J0597j6909k7363
$$ -6097 -102518 -28269 41809 68993 40622 54331 95181 66367 23622 34219 17310 -10053
21694a0053M137n9709j17792k1674M4333R2451J4417L9872M9992J1613J2489n1625
$$ -10053 -5916 -65625 -183417 -205091 -160758 -68307 -53890 -14018 35974 47587 60076 8451
21682H451j12296l4698Q2716L4628K3208K6602n5017k1721J3536J40551l1536
$$ 8451 -103845 -138543 -55827 -21199 2009 28611 -26406 -48127 -34591 105960 74424
21671G4424p137o8048K2029L1071m0876j1570L1481M9156L698p1339J9057l182
$$ 74424 67287 -761 21268 52339 11463 -107 31374 80530 84228 12889 31946 28764
21659B8764m867P323l4113k9669k0021M088K2659q9657M7014J6898r3957M86O2448
$$ 28764 23897 31220 -2893 -32562 -52583 -48495 -25836 -115493 -68479 -51581 -145538 -145052 -82604
21646h2604K9308l666r0621L8164M2341q5300l0946O255J4778P7560O5347J05385
$$ -82604 -53296 -56962 -147583 -109419 -67078 -152378 -183324 -177069 -162291 -84731 -19384 86001
21634H6001p3947j5452J10j4399O133j31269j1249J02978P6175k4922J2693l634
$$ 86001 12054 -3398 -3288 -17687 -11554 -142823 -154072 -51094 25081 159 12852 9218
21622I218o760r3522m8398O6409O691p4493J5845K9145o0347Q1717l6327L3289
$$ 9218 2458 -91064 -139462 -73053 -66362 -140855 -125010 -95865 -156212 -74495 -110822 -77533
21610g7533j7765o0980M8313Q5984O3400m3730K7083O9310K4458r7722J0652J00787
$$ -77533 -95298 -156278 -107965 -21981 41419 -2311 24772 94082 118540 20818 31470 132257
21598A32257L4042l3755k7892j01128n5120n4947M3949N2062n0696k3025R5123
$$ 132257 166299 132544 104652 3524 -51596 -106543 -62594 -10532 -61228 -84253 10870
21587A0870L7446q0432l7729m4527m0721K194J10368R2390M3014j02125k073q9176
$$ 10870 48316 -32116 -69845 -114372 -155093 -152899 -42531 49859 92873 -9252 -11325 -100501
21575a00501m2848K1916M5394K7866m3432r8666Q554Q8432J50768J2837q5313
$$ -100501 -143349 -121433 -76039 -48173 -91605 -190271 -181717 -93285 57483 70320 -14993
21564a4993J7684N747n0428L7776n980m5199j16039N9091N4323M1044K5806R876
$$ -14993 2691 8438 -41990 -4214 -10194 -55393 -171432 -112341 -58018 -16974 8832 18708
21552A8708j0108j4844P2587j3288j5213q8632P2974O3159n6404p3363K3488K7485
$$ 18708 8600 -6244 66343 53055 37842 -50790 22184 85343 28939 -44424 -20936 6549
21540F549P9065m3510r8313L0519o7600l475Q8468j7700M548M0161q937l9365
$$ 6549 85614 42104 -56209 -25690 -93290 -96765 -8297 -25997 -21449 18712 9775 -29590
21528b9590L7084O824n1163J11712j835r1420k8104M8789k0071l0297j9585k288
$$ -29590 7494 14318 -36845 74867 73032 -18388 -46492 2297 -17774 -48071 -67656 -69944
21516f9944K7508o774J0052L8724J8261L7169N6500l2347j05813K9512L1615p1155
$$ -69944 -42436 -49210 -39158 -434 17827 54996 111496 79149 -26664 2848 34463 -36692
21504c6692L6468l5894n0369O5625M2243L7715P0381k5714k1211J8185j09690
$$ -36692 -224 -36118 -86487 -20862 21381 59096 129477 103763 82552 100737 -8953
21493h953l7813N5327J6573J0584j7969k7091N7816R0676K0410m8607m229p5862
$$ -8953 -46766 8561 25134 35718 17749 -9342 48474 139150 159560 110953 106724 30862
21481C0862l9052J2083k0952j9008n9878L4966M685o632M9484m0849j00028L9635
$$ 30862 -8190 3893 -17059 -36067 -95945 -60979 -56294 -62926 -13442 -54291 -154319 -114684
21469a14684K8980n9278L2521n56Q513K2993M186L1765J09279M4626n8988j21094
$$ -114684 -85704 -144982 -112461 -113017 -104504 -81511 -77325 -45560 63719 108345 49357 -71737
21457g1737l3378k9645Q95P4737L6564L4351l6798j1338n6111K251M7828M6366
$$ -71737 -105115 -134760 -133865 -59128 -22564 11787 -25011 -36349 -92460 -90209 -42381 3985
21445C985j868K3879M1137j9904j3158o0519J0437J1829j6760L0562J4806m1902
$$ 3985 2117 25996 67133 47229 34071 -26448 -16011 -4182 -20942 9620 24426 -17476
21433a7476p6094n8473J35422J354M2222K3063J3608L4939J9925j01153j16239
$$ -17476 -93570 -152043 -16621 -15267 26955 50018 63626 98565 118490 17337 -98902
21422i8902l1861P2083R114N2733M6946p7660j1677N2350j5093r1554m3111J01996
$$ -98902 -130763 -58680 -49566 3167 50113 -27547 -39224 13126 -1967 -93521 -136632 -34636
21410c4636J05254j5167J5114k6714r8646o913L2320k7024p7532l1661M9118O7572
$$ -34636 70618 55451 70565 43851 -54795 -61708 -29388 -56412 -133944 -165605 -116487 -48915
21398d8915k413l02N8908K7325J1557n2443L5108j2070k9676L6853m1852M6351
$$ -48915 -51328 -51630 7278 34603 46160 -6283 28825 16755 -12921 23932 -17920 28431
21386B8431o058J7406k0954l5266K1487l2454n0081j5192M6908J00978m6444l9619
$$ 28431 22373 39779 18825 -16441 5046 -27408 -77489 -92681 -45773 55205 8761 -30858
21374c0858R0053k0256j3619L8672k0450J2559k803m7000n4245l1188P1136j8615
$$ -30858 59195 38939 25320 63992 43542 56101 53298 6298 -47947 -79135 -7999 -26614
21362b6614J333L6395J14647M6574j3785P4576m6932k11994r3007J4128J5496
$$ -26614 -25281 11114 125761 172335 158550 233126 186194 -25800 -118807 -104679 -89183
21351h9183M9465O1051r476J2570L016J9797N8004M8606q4506q9163j1226L8903
$$ -89183 -39718 21333 11857 24427 27443 47240 105244 153850 69344 -19819 -31045 7858
21339G858l8019J5365L1576j4502r4028L3561P8206M0222Q94j228l6563m1811
$$ 7858 -30161 -14796 16780 2278 -91750 -58189 20017 60239 61133 59905 23342 -18469
21327a8469n5637M6709J17449l0448j05445m50N8264L4837o1733K4254L8006N3951
$$ -18469 -74106 -27397 90052 59604 -45841 -46291 11973 46810 -14923 9331 47337 101288
21315A01288m1286k968r4642n2889R4516M7555j28254j19669K6839J04493L1913
$$ 101288 60002 57034 -37608 -90497 4019 51574 -76680 -196349 -169510 -65017 -33104
21304c3104k5563M5494o841J0822Q500p0844p9505Q826P0109O748J0967m523M1053
$$ -33104 -58667 -13173 -20014 -9192 -692 -71536 -151041 -142215 -72106 -65358 -54391 -58914 -17861
21291a7861P5564M8584L2375q604l75r2685o2196j612L2075j4884Q8763J6376
$$ -17861 57703 106287 138662 130058 129683 36998 -25198 -26810 5265 -9619 79144 95520
21279I5520j9706O807P509j4209p0318O5839k1869J3233l0323j8705L9541n9609
$$ 95520 75814 82621 90130 75921 5603 71442 49573 62806 32483 13778 53319 -6290
21267f290m4286K5807J6081k6634l6919m9836O4120K3782p3201J9593P4254l0405
$$ -6290 -50576 -24769 -8688 -35322 -72241 -122077 -57957 -34175 -107376 -87783 -13529 -43934
21255d3934j03597J14648R4206l4824l2544j6666M4284L5556n0467O371o6150
$$ -43934 -147531 -32883 61323 26499 -6045 -22711 21573 57129 6662 13033 -53117
21244e3117j3747M3865l9486n2352L30J2241k1926L6979K1027L9623k0974M1410
$$ -53117 -66864 -22999 -62485 -114837 -114507 -102266 -124192 -87213 -66186 -26563 -47537 -6127
21232f127j0413P8655J6864k0990n1745k3145K4226j0574k1005m4800m0339N6423
$$ -6127 -16540 62115 78979 57989 6244 -16901 7325 -3249 -24254 -69054 -109393 -52970
21220e2970N6039m8721R8187Q2235N844M9248n251p2048n7111p5081j07907N4005
$$ -52970 3069 -45652 52535 134770 140614 189862 184611 112563 55452 -19629 -127536 -73531
21208g3531P4804r127J4729j2914o352Q300l468k1000L6524j3080K6458J24589
$$ -73531 1273 -7854 6875 -6039 -12391 -4091 -7559 -28559 7965 -5115 21343 145932
21196A45932N0645j20459l4788N233k6802N3488J3952m2200p0197o7566j4024
$$ 145932 196577 76118 41330 46563 19761 73249 87201 45001 -25196 -92762 -106786
21185a06786q0004j6142J07769Q5118k3065j9347J0238M0917l8088j3836j7467
$$ -106786 -186790 -202932 -95163 -10045 -33110 -52457 -42219 -1302 -39390 -53226 -70693
21174g0693M3473R9470n4800M8174j6754n5056j45j3504m0293o0506O4445O0150
$$ -70693 -27220 72250 17450 65624 48870 -6186 -6331 -19835 -60128 -120634 -56189 3961
21162C961K6946l8720l0458M8631N1216M2036j08347o0847N1942Q6619J4434k3227
$$ 3961 30907 -7813 -38271 10360 61576 103612 -4735 -65582 -13640 72979 87413 64186
21150F4186j1656N102o3003p0759M035L1275k3309O3253L9005n8612p8734k1890
$$ 64186 52530 57632 -5371 -76130 -72095 -40820 -64129 -876 38129 -20483 -99217 -121107
21138a21107O5876l7145r2574R4693p222j2976L3148K5821k1483P1998K1478J8915
$$ -121107 -55231 -92376 -184950 -90257 -97479 -110455 -77307 -51486 -72969 -971 20507 39422
21126C9422M102j3476k1674m0586L1648K3019l8881m721j7100o175N3178j9207
$$ 39422 43524 30048 8374 -32212 -564 22455 -16426 -21147 -38247 -44422 8756 -10451
21114a0451J1904O6603J9314q6352p9153o2447M9046J7611r6676K4440M3309j3166
$$ -10451 1453 68056 87370 1018 -78135 -140582 -91536 -73925 -170601 -146161 -102852 -116018
21102a16018R0435k5796J6250L4944K613k5662r7472n8395O8797M2580K597J6796
$$ -116018 -25583 -51379 -35129 -185 2428 -23234 -120706 -179101 -110304 -67724 -65127 -48331
21090d8331m3112n8394n1374Q3257L1150M7209Q2579m485r4801m1616J9050q7866
$$ -48331 -91443 -149837 -201211 -117954 -86804 -39595 42984 38499 -56302 -97918 -78868 -166734
21078a66734m90k1974L9985J51455L3843J8399n9094l0648m3258k6920M8079o9927
$$ -166734 -167224 -189198 -149213 2242 36085 54484 -4610 -35258 -78516 -105436 -57357 -127284
21066a27284R968k3064L0536J5882n5469Q6657O4499n8317o7307j7282O8260P850
$$ -127284 -117316 -140380 -109844 -93962 -149431 -62774 1725 -56592 -123899 -141181 -72921 -65071
21054f5071J6539N6217N5129l2512p8348k3964K4026o563O1572O064k139K4745
$$ -65071 -48532 7685 62814 30302 -48046 -72010 -47984 -54547 7025 13089 10950 35695
21042C5695o5989m4655n8549Q2205J03868j7171j17292L9246R9298q4759n5428
$$ 35695 -30294 -74949 -133498 -51293 52575 35404 -81888 -42642 56656 -28103 -83531
21031h3531j2483J39540Q002K0465R157m4720l2412r104l836k7939l8388q372
$$ -83531 -96014 43526 51528 71993 81150 36430 4018 -5086 -8922 -36861 -75249 -83621
21019h3621P317L5140p038K0734j06256O1565K9385n862p6333o6752J20277J06672
$$ -83621 -76304 -41164 -48202 -27468 -133724 -72159 -42774 -48636 -124969 -191721 -71444 35228
21007C5228p0924k8758m9259Q7923N9508r2169n6506O7294L7904N4434r077p4555
$$ 35228 -35696 -64454 -113713 -25790 33718 -58451 -114957 -47663 -9759 44675 35598 -38957
20995c8957l887n0013m2076J80937Q7068p5819l5740j314M4590j7639k0129R49
$$ -38957 -42844 -92857 -134933 46004 133072 57253 21513 20199 64789 47150 27021 27970
20983B7970j6123r6907m1935L0585J16550J39208j18j06587l7575l9048k3573
$$ 27970 11847 -85060 -126995 -96410 20140 159348 159230 52643 15068 -23980 -47553
20972d7553j0656L1294J3863o169p6188j02365j3585Q5271Q4642O4374M2563K9310
$$ -47553 -58209 -26915 -13052 -19221 -95409 -197774 -211359 -126088 -41446 22928 65491 94801
20960I4801L4022m0767J7690K8649J8286J7434k8066n5666l0998p0119m276J9930
$$ 94801 128823 88056 105746 134395 152681 170115 142049 86383 55385 -14734 -19010 920
20948I20N8589K0542o8891n2155q823K12J0539N7129N5028O4752o1353n9355L2721
$$ 920 59509 80051 11160 -40995 -49818 -49606 -39067 18062 73090 137842 76489 17134 49855
20935D9855R8009L6153l5796r4159q3311M0765Q5997O713j01247m4158N8861j5856
$$ 49855 147864 184017 148221 54062 -29249 11516 97513 104226 2979 -41179 17682 1826
20923A826l7859j312K1354Q7047O2423k5554n4303q7159k1994l0950P7062k0532
$$ 1826 -36033 -37345 -15991 71056 133479 107925 53622 -33537 -55531 -86481 -9419 -29951
20911b9951P315o352O3258L2431j4131p2052l2585J1081o132j8071J1300j5663
$$ -29951 -22636 -28988 34270 66701 52570 -19482 -52067 -40986 -47118 -65189 -53889 -69552
20899f9552n1488o0990M0263N5711N9970O241P50l288k3272j9816K5496K1357
$$ -69552 -121040 -182030 -141767 -86056 -26086 -19845 -19095 -22383 -45655 -65471 -39975 -18618
20887a8618J1517O7455j0785N028q945N8278n4487j04430L8386K5509j9509M9178
$$ -18618 -7101 60354 49569 54597 45652 103930 49443 -54987 -16601 8908 -10601 38577
20875C8577l1577J2006M8584J9172k8089K8969l1922l7960l3845L5092N3653P886
$$ 38577 7000 19006 67590 86762 58673 87642 55720 17760 -16085 19007 72660 80546
20863H0546K6318O3260l4945o8101n4369l1954l9695J0098n4312r589j0758j3836
$$ 80546 106864 170124 135179 67078 12709 -19245 -58940 -48842 -103154 -112743 -123501 -137337
20851a37337L1357p433K1103O5836l1643n7787P750L3930o8404j3627k3964j4224
$$ -137337 -105980 -113413 -92310 -26474 -58117 -115904 -108154 -74224 -142628 -156255 -180219 -194443
20839a94443J0079k1558O2821J45901N0687m3770l7415k0898n4937l3326R4250
$$ -194443 -184364 -205922 -143101 2800 53487 9717 -27698 -48596 -103533 -136859 -42609
20828d2609K1830j2405P8046K9590p0306m085J1789l5958L4530K9980m3496J1666
$$ -42609 -20779 -33184 44862 74452 4146 61 11850 -24108 10422 40402 -3094 8572
20816H572j15732k4913L8368n527K666P1897o5892p2558j3266Q5808M0902Q2623
$$ 8572 -107160 -132073 -93705 -99232 -96566 -24669 -90561 -163119 -176385 -90577 -49675 32948
20804C2948L1494k498K7976O6816j5833n6517j32545k3753M6576l3912k1508m6849
$$ 32948 64442 61944 89920 156736 140903 84386 -48159 -71912 -25336 -59248 -80756 -127605
20792a27605J3359P6163O0942k8682p96L3505K4681N6247j6285p4612J2368k764
$$ -127605 -114246 -38083 22859 -5823 -6619 26886 51567 107814 91529 16917 29285 26521
20780B6521Q9754j8829j17144J3476P7539Q4186J4063o5904L7856l807l5253m6256
$$ 26521 116275 97446 -19698 -6222 71317 155503 169566 103662 141518 137711 102458 56202
20768E6202q2324K120L4822Q474Q038O3983M4865l8979J1208j223j26017l7243
$$ 56202 -26122 -24002 10820 19294 27332 91315 136180 97201 108409 107186 -18831 -56074
20756e6074m0706M2151M7471K685m5333l1717m1651P4318R8420l8710L2331j8425
$$ -56074 -96780 -54629 -7158 -4473 -49806 -81523 -123174 -48856 49564 10854 43185 24760
20744B4760l9992k5572n3018J2761O1572l8767J0778m110K5755K2974k1074Q596
$$ 24760 -15232 -40804 -93822 -81061 -19489 -58256 -47478 -51588 -25833 -2859 -23933 -15337
20732a5337K3491M5906L4669l4638l1355K4104R8867o7821k3960Q592q2939J0200
$$ -15337 8154 54060 88729 54091 22736 46840 145707 77886 53926 62518 -20421 -10221
20720a0221Q6193J1483k8242r6995J3697k7438K3395L4242Q269J6266J3473J5670
$$ -10221 75972 87455 59213 -37782 -24085 -51523 -28128 6114 14383 30649 44122 59792
20708E9792L1695r492M9671k4776n5993K1176L820J873K0881J2273p557o3762
$$ 59792 91487 81995 131666 106890 50897 72073 75893 77766 98647 110920 103363 39601
20696C9601j58385q5937O3878R2989R327L3766K2773j12995o384L0701L9734l4880
$$ 39601 -118784 -204721 -140843 -47854 -38527 -4761 18012 -94983 -101367 -70666 -30932 -65812
20684f5812R0963O3700l6316m0699m1359p1693R4550Q6008k1775r3686N6651M0373
$$ -65812 25151 88851 52535 11836 -29523 -101216 -6666 79342 57567 -36119 20532 60905
20672F0905n9696j7338o026k3524O766j319o1791N200J23764O642o8215Q0733
$$ 60905 1209 -16129 -22155 -45679 -38913 -40232 -102023 -96823 26941 33583 -34632 46101
20660D6101P0446l1707o5959q9698O2632K7131K3593M6755k2201p6644l9684k3271
$$ 46101 116547 84840 18881 -70817 -8185 18946 42539 89294 67093 -9551 -49235 -72506
20648g2506p3777P5394L0180j9402P1475k1643M7951l3602p5825m7915P0062j1788
$$ -72506 -146283 -70889 -40709 -60111 11364 -10279 37672 4070 -71755 -119670 -49608 -61396
20636f1396L1167j5132J0882m2145r1296K4816J9499N8004R1571n229J3194J01726
$$ -61396 -30229 -45361 -34479 -76624 -167920 -143104 -123605 -65601 25970 20741 33935 135661
20624A35661N6828K5319Q299r1644j22015M4478Q540R663P7490K8708m3824m4265
$$ 135661 192489 217808 226107 134463 12448 56926 65466 75129 152619 181327 137503 93238
20612I3238r317k0801M5981O4474j6715r187r8788r9104k8506n875L7888N1604
$$ 93238 83921 63120 109101 173575 156860 147673 48885 -50219 -78725 -84600 -46712 4892
20600D892L3147k0686P309p6042M2862l8671k2911K1937K8P8207J3740k9676K0403
$$ 4892 38039 17353 24662 -51380 -8518 -47189 -70100 -48163 -48135 30072 43812 14136 34539
20587C4539Q1131n4227K0924j8457j02901O1540L3126J5828j8889j00445n1646
$$ 34539 115670 61443 82367 63910 -38991 22549 55675 71503 52614 -47831 -99477
20576i9477J4023R9013O7379l9192l2280j4669P1466J62608J9747r5013o2569
$$ -99477 -85454 13559 80938 41746 9466 -5203 66263 228871 248618 153605 91036
20565I1036j5187K5943q8556m3429O0433O0929o2532j03246m3806J06976J66387
$$ 91036 75849 101792 13236 -30193 30240 91169 28637 -74609 -118415 -11439 154948
20554A54948k9263J0175K9442k839R292o2984l5966K2696j5565m976K5574M2269
$$ 154948 125685 135860 165302 162463 171755 108771 72805 95501 79936 74960 100534 142803
20542A42803m8775q3491l7322l747l5907m1221J3244J37677m6160q9651Q2548
$$ 142803 94028 10537 -26785 -30532 -66439 -107660 -94416 43261 -2899 -92550 -10002
20531a0002k2629n011j8983l8570K982R9195j2967k5105N1637j3678L9103J2972
$$ -10002 -32631 -37642 -56625 -95195 -92213 6982 -5985 -31090 20547 6869 45972 58944
20519E8944l1194K3987r773L4363m8400j9670j833q3833K007J2399N8393J6296
$$ 58944 27750 51737 41964 76327 27927 8257 6424 -77409 -75402 -63003 -4610 11686
20507A1686K3439k3929K8898q6140l7857l0156p948K294Q1642N5631O6676K0488
$$ 11686 35125 11196 40094 -46046 -83903 -114059 -122007 -119713 -38071 17560 84236 104724
20495A04724r1456m4177k9702N1332N636l208k4516j5452p350L5514Q2172m7274
$$ 104724 13268 -30909 -60611 -9279 -3643 -6851 -31367 -46819 -54169 -18655 63517 16243
20483A6243K9351N4912L8970o1724q293l8430P838J2791L5147j990o694J7855
$$ 16243 45594 100506 139476 77752 69459 31029 38867 51658 86805 84815 78121 95976
20471I5976k4342m9743J195l8895j5619J626Q9034M4790q764N1800O5824q3821
$$ 95976 71634 21891 23086 -15809 -31428 -29802 59232 104022 95258 147058 212882 129061
20459A29061j16693k037M377J738K7511L8941J01284k3262o6660N537p6697j7570
$$ 129061 12368 10331 14708 16446 43957 82898 184182 160920 94260 99797 23100 5530
20447E530k4215n6378R925n6967r967P2090K1567J01245J6554J1427k4780l9357
$$ 5530 -18685 -75063 -65138 -122105 -132072 -59982 -38415 62830 79384 90811 66031 26674
20435B6674P7682Q3926J0343l7536q0518o4491n1099M2509l5583k383L2295m2058
$$ 26674 104356 188282 198625 161089 80571 16080 -35019 7490 -28093 -30476 1819 -40239
20423d0239L1527L6742p0285M633J8826J492k86l4140O0722P0128L9m8601o3550
$$ -40239 -8712 28030 -42255 -37622 -18796 -17304 -17590 -51730 8992 79120 79159 30558 -32992
20410c2992n971J8878K2578l8108l5636o351J0523N2846n9441m1308O1403J7090
$$ -32992 -38963 -20085 2493 -35615 -71251 -77602 -67079 -14233 -73674 -114982 -53579 -36489
20398c6489K3970Q971k8510l1235m902j6646L0565K4594Q3108P8638M7266k7251
$$ -36489 -12519 -3548 -32058 -63293 -68195 -84841 -54276 -29682 53426 132064 179330 152079
20386A52079j4942N1050L8268J222J199J2261m1464n7820k2189j19197k5211L3461
$$ 152079 137137 188187 226455 227677 228876 241137 199673 141853 119664 467 -24744 8717
20374H717n0136n490j841N80N1783j8772j9419P2525k7638n851P3112j8508p9137
$$ 8717 -41419 -46909 -48750 -48170 3613 -15159 -34578 37947 10309 4458 77570 59062 -20075
20361b0075k1832K2372J6008K3497Q811P974l1002j2342L7968K949k0192j1207
$$ -20075 -41907 -19535 -3527 19970 28781 36755 5753 -6589 31379 34328 14136 2929
20349B929j1828m7495k1248J2340M5785K3209j9304L4692P0895r085l5444J284
$$ 2929 -8899 -56394 -77642 -65302 -19517 3692 -15612 19080 89975 80890 45446 46730
20337D6730K1047m9919M1592M1630J6484l6316K2730l0681k4405k1775n4124r275
$$ 46730 67777 17858 59450 101080 117564 81248 103978 73297 48892 27117 -27007 -36282
20325c6282O2093J2812l3444k9264K6286N7620M0891r1597l3584J4834L8746K236
$$ -36282 25811 38623 5179 -24085 2201 59821 100712 9115 -24469 -9635 29111 31347
20313C1347k8883m7897P266R860O115K2651j5533n1162O9745L936l5660K7385
$$ 31347 2464 -45433 -38167 -28307 -22192 459 -15074 -66236 3509 7445 -28215 -830
20301h30n1848K1473j240q990J2607L5272Q5899N0763m529m4499N4760M8084q9291
$$ -830 -52678 -31205 -32445 -41435 -28828 6444 92343 143106 138577 94078 148838 196922 107631
20288A07631k11o288j33215j31286j7965O0744L3340l9759R3915Q7334k6247m461
$$ 107631 107420 101132 -32083 -163369 -181334 -120590 -87250 -127009 -33094 54240 27993 23532
20276B3532J7294K5805L9065n8932q7590L2260q1309j6067L3565P9405R9368p070
$$ 23532 40826 66631 105696 46764 -40826 -8566 -89875 -105942 -72377 7028 106396 99326
20264I9326n7204m7836K3750n816n0369k8307Q44k6136r481J13211O8757p7273
$$ 99326 42122 -5714 18036 12220 -38149 -66456 -65612 -91748 -101229 11982 80739 3466
20252C466k6536K2176K1750J289p8886o3718m4445P1500L4182K6527o566P4163
$$ 3466 -23070 -894 20856 22145 -56741 -120459 -164904 -93404 -59222 -32695 -39261 34902
20240C4902O337p1138O324m3404n0743k5819O7584K7546O7262J9009j06250o4030
$$ 34902 41239 -29899 -23575 -66979 -117722 -143541 -75957 -48411 18851 37860 -68390 -132420
20228a32420P526O9009R3127Q8855j1431m5079k8492l3184L5956L5543Q682p8916
$$ -132420 -124894 -55885 37242 126097 114666 69587 41095 7911 43867 79410 88092 9176
20216I176j03292j707Q8617K6857K1219R339q0804J1715j703m6527r924L0434
$$ 9176 -94116 -95823 -7206 19651 40870 50209 -30595 -18880 -20583 -67110 -77034 -46600
20204d6600Q0737o9253o1150R4168Q374k4867n1588J8913L7825j2631n6230m2771
$$ -46600 34137 -35116 -96266 -2098 6276 -18591 -70179 -51266 -13441 -26072 -82302 -125073
20192a25073J3050j4363M8938N8200l1657o8958M0772Q4080K6739J7531K8106
$$ -125073 -112023 -126386 -77448 -19248 -50905 -119863 -79091 4989 31728 49259 77365
20181G7365O7049p162o1529O103n4086N6960K105k5813O5193J1667L749k1479
$$ 77365 144414 137252 75723 81826 27740 84700 86805 60992 126185 137852 141601 120122
20169A20122q30q6p9713k6812m9171K9862J1158m1322J9452K2383K1226L3133
$$ 120122 119292 119206 39493 12681 -36490 -6628 4530 -36792 -17340 5043 26269 59402
20157E9402M3734J4467q5339O6841l375q0295n7032k0852J00066O3835K737r0628
$$ 59402 103136 117603 32264 99105 95730 15435 -41597 -62449 37617 101452 104189 13561
20145A3561p4665q2894l8272k5169l0196Q056N5784J12462M2114m2332J7627J07674
$$ 13561 -61104 -143998 -182270 -207439 -237635 -229579 -173795 -61333 -19219 -61551 -43924 63750
20133F3750M7092m6389J1997n708L1337q3168n8939K6467J37606m780o0388O491
$$ 63750 110842 64453 76450 70742 102079 18911 -40028 -13561 124045 119265 58877 65368
20121F5368n4150j7258K158M819m911j1701J7841M3393n3985j4407L2965K3433
$$ 65368 11218 -6040 -3882 937 -3974 -15675 2166 45559 -8426 -22833 10132 33565
20109C3565K9758L1266O0243L658m8166o6633l2486r3153j17589n7667J8736J27990
$$ 33565 63323 94589 154832 158490 110324 43691 11205 -81948 -199537 -257204 -238468 -110478
20097a10478P1998O7279j6849j1460K3118N2730j0803l2872l5298j0372o6751
$$ -110478 -38480 28799 11950 490 23608 76338 65535 32663 -2635 -13007 -79758
20086g9758r084K1493k9109N2569l433K0142J12882K9883n3453o8810p8379m1952
$$ -79758 -88842 -67349 -96458 -43889 -47322 -27180 85702 115585 62132 -6678 -85057 -127009
20074a27009l6432J1991K0000l106O5089J6948Q58Q1548j9851p4793L1446J19275
$$ -127009 -163441 -151450 -131450 -134556 -69467 -52519 -51661 29887 10036 -64757 -33311 85964
20062H5964O8419m0553l0735R802j4330R2564j03761m7548L0075K7676j2099n9641
$$ 85964 154383 113830 83095 92897 78567 171131 67370 19822 49897 77573 65474 5833
20050E833m159J7653n453l4307J857l8807q8541j8953M6333R4835M6316O5898
$$ 5833 1674 19327 13874 -20433 -18576 -57383 -145924 -164877 -118544 -23709 22607 88505
20038H8505j2843j31273j10566j0889J06873J08841L3371n4369M7568P6031o6911
$$ 88505 75662 -55611 -166177 -177066 -70193 38648 72019 17650 65218 141249 74338
20027G4338o6247l6072L7715K1510o0337K4553O2303L8626j5120J15332p3484
$$ 74338 8091 -27981 9734 31244 -29093 -4540 57763 96389 81269 196601 123117
20016A23117q9787L5832K6835o4760l9690R7873J4916j7702N1842K213j4975n5562
$$ 123117 33330 69162 95997 31237 -8453 89420 104336 86634 138476 140689 125714 70152
20004G0152K295K8713L4008o9040r011m736n9179k3720M9533L7464k669J6609
$$ 70152 72447 101160 135168 66128 57117 52381 -6798 -30518 19015 56479 53810 70419
19992G0419K3862O3243Q475l4077p6048k2845R5492o1356n2339j3557J3293M472
$$ 70419 94281 157524 165999 131922 55874 33029 128521 67165 14826 1269 14562 19034
19980A9034K6623J7160p0690O403N1911N4454k463n0000k2086j833J7731m9160
$$ 19034 45657 62817 -7873 -1470 50441 104895 102432 52432 30346 28513 46244 -2916
19968b916L5682N3820K488j4841j4627j3761j671o046K7969J4942k4984j6953
$$ -2916 32766 86586 89074 74233 59606 45845 44174 38128 66097 81039 56055 39102
19956C9102M1309l9561l8367m8051P5843l744O1387l206L6328J404n0404k0445
$$ 39102 80411 40850 2483 -45568 30275 26531 87918 84712 121040 122444 72040 51595
19944E1595N6646j823m7599k0525J2469m3231m7386p07M1461N6206j1349r6490
$$ 51595 108241 106418 58819 38294 50763 7532 -39854 -40561 900 57106 45757 -50733
19932e0733j1645J5549M4929R0428p436j7154K4795K6527r3266k9324k6198J6014
$$ -50733 -62378 -46829 -1900 88528 81092 63938 88733 115260 21994 -7330 -33528 -17514
19920a7514K5536k6479O9288j8122l5517J11040k1749p6891k1185L1820j402k4700
$$ -17514 8022 -18457 50831 32709 -2808 108232 86483 9592 -11593 20227 18825 -5875
19908e875q70L2152M6978K8010l424m8662o2897r8040j9522J28451M0204L7942
$$ -5875 -6745 25407 72385 100395 96971 48309 -14588 -112628 -132150 -3699 36505 74447
19896G4447M7995k7188n5050K8623m2336o736k4673L6132l4589p1707k6565N3995
$$ 74447 122442 95254 40204 68827 26491 19755 -4918 31214 -3375 -75082 -101647 -47652
19884d7652O812o3532m034J30422M4839J1249k7512Q951o9017r37M0388j8791
$$ -47652 -40840 -104372 -108406 22016 66855 78104 50592 59543 -9474 -10411 29977 11186
19872A1186k1353k1256j0948J22286Q7256k589o6958l1010N856m8323o2333K4334
$$ 11186 -10167 -31423 -42371 79915 167171 164582 97624 66614 72470 24147 -38186 -13852
19860a3852n795k5336J4964r7051l997J27089K0934j1208J8916O8002O4370j7302
$$ -13852 -19647 -44983 -30019 -127070 -131067 -3978 16956 5748 24664 92666 157036 139734
19848A39734n4033L1807m751r8145m6782O606K9483j3180L1777O6481K3063r5319
$$ 139734 85701 117508 112757 14612 -32170 -25564 3919 -9261 22516 88997 112060 16741
19836A6741J1190L3002l7115m5295j5245J38983P0688m7181n6612k2654m1847
$$ 16741 27931 60933 23818 -21477 -36722 102261 172949 125768 69156 46502 4655
19825D655o9104J27431J05847o5672k3970l3086n4694q4053M9597L5338n8211
$$ 4655 -64449 62982 168829 103157 79187 46101 -8593 -92646 -43049 -7711 -65922
19814f5922j3665M0565M961j6924O8466K3654n0772N5511l0920l8417l0573Q3749
$$ -65922 -79587 -39022 -34061 -50985 17481 41135 -9637 45874 14954 -23463 -54036 29713
19802B9713L8645p1844p555L1932M2548k1978m5031N8336n5367K5335p3762m298
$$ 29713 68358 -3486 -11041 20891 63439 41461 -3570 54766 -601 24734 -49028 -53326
19790e3326J20290j3069O3143k1149q6943k9236O1904L2619p3341r850k8408J4324
$$ -53326 66964 53895 117038 95889 8946 -20290 41614 74233 892 -8958 -37366 -23042
19778b3042R7467m1012j4742k0565M9503N6577j6514l5313L7765M133p7236o9541
$$ -23042 74425 33413 18671 -1894 47609 104186 87672 52359 90124 94257 17021 -52520
19766e2520N5465L8024L732O6697Q5462K777m9132q695m600p0471L0692L5279
$$ -52520 2945 40969 44701 111398 196860 199637 150505 141810 137210 66739 97431 132710
19754A32710J7588j8710o9710k6957O5616P7854m6259m8542k7840n5291M13N4392
$$ 132710 150298 131588 61878 34921 100537 178391 132132 83590 55750 459 872 55264
19742E5264Q1534N9025m6460n5259m7603p4085J4884M9876M6080j561n0387n9148
$$ 55264 136798 195823 149363 94104 46501 -27584 -12700 37176 83256 81695 31308 -27840
19730b7840p6659j5567R6088l3656l7078L4770P2287L475j5818P2735Q79N978
$$ -27840 -104499 -120066 -23978 -57634 -94712 -59942 12345 15820 2 72737 73616 79594
19718G9594k0101l8147Q6980L6271K7810Q34N2755K9917n2129o1984l1417p2945
$$ 79594 59493 21346 108326 144597 172407 173241 225996 255913 203784 141800 110383 37438
19706C7438m9563N7242K5630L7935P8688L6622N0902j48360n3856K9238p921M4146
$$ 37438 -12125 45117 70747 108682 187370 223992 274894 126534 72678 101916 93995 138141
19694A38141P6855K6421L160n8717o0635p4527q6959K337P1461Q3075l044p9142
$$ 138141 214996 241417 244577 185860 125225 50698 -36261 -33924 37537 120612 117568 38426
19682C8426k0728L7821J6643K4061L3091M5057k069o7523k2821K9356M0923p1254
$$ 38426 17698 55519 72162 96223 129314 174371 172302 104779 81958 111314 152237 80983
19670H0983r8439l577L9746R4628L2225K2377l0577p621p6987K1080M3099O5140
$$ 80983 -17456 -21033 18713 113341 145566 167943 137366 129745 52758 73838 116937 182077
19658A82077m6002M0156L4254k6798J5917n1529o4928k3948Q4745L0548k8194
$$ 182077 136075 176231 210485 183687 199604 148075 83147 59199 143944 174492 146298
19647A46298p8584N2157J28014J2114O6076q1223k6483O8530J23709m4296o5586
$$ 146298 67714 119871 247885 259999 326075 244852 218369 286899 410608 366312 300726
19636C00726j19453p3065P450J47029O0967O1072J43520Q5086o460O2832N8265
$$ 300726 181273 108208 115658 262687 323654 384726 528246 613332 606872 669704 727969
19625G27969J08516k3182o0830R922J2081L3998p4200k5760r3780j43182q1905
$$ 727969 836485 813303 752473 762395 774476 808474 734274 708514 614734 471552 389647
19614C89647j8733M3652n4718q0633r9726q2286M0958l6370N9934R248m7376R8174
$$ 389647 370914 414566 359848 279215 179489 97203 138161 101791 161725 170973 123597 221771
19602B21771J0264l3250k5076l2152p0373k6334N4297M867J3834N8635L4821N4149
$$ 221771 232035 198785 173709 141557 71184 44850 99147 104014 117848 176483 211304 265453
19590B65453j05976l5990J40742J45521P1338L6166P9206R2915J26966J37779
$$ 265453 159477 123487 264229 409750 481088 517254 596460 689375 816341 954120
19580I54120J49167J31940J58059Q2626Q4201P0231j2584p184o5262p5109r4729
$$ 954120 1103287 1235227 1393286 1475912 1560113 1630344 1617760 1610576 1545314 1470205 1375476
19569A375476j95676j78218j11655p4341j28676q6437K413j01933k4950L923j9739
$$ 1375476 1179800 1001582 889927 815586 686910 600473 602886 500953 476003 479926 460187
19558D60187j01295j01930q4570k8857N8863P1039O2731P799r414j6070q6770
$$ 460187 358892 256962 172392 143535 202398 273437 336168 343967 334553 318483 231713
19547B31713o7580M2406o4610l3037J19860O0265K3897N0328N557L8170O7280
$$ 231713 164133 206539 141929 108892 228752 289017 312914 363242 368799 406969 474249
19536D74249j6069j9534K3387P1078J84961J32774J7142j04959l0095K02946J03460
$$ 474249 458180 438646 462033 533111 718072 850846 867988 763029 732934 935880 1039340
19525A039340M5692k5957r4149q3398j03948o9688J7983P893m9253j19878j04574
$$ 1039340 1085032 1059075 964926 881528 777580 707892 725875 733768 684515 564637 460063
19514D60063j18970l7949K753m385P8021L8163J971p7402l5906J0154r596J6552
$$ 460063 341093 303144 305897 301512 379533 417696 419667 342265 306359 316513 306917 323469
19502C23469M3306p717O4613m2138l4359m036j55521l3730N5767k2574r8681M0391
$$ 323469 366775 359058 423671 381533 347174 343138 187617 153887 209654 187080 88399 128790
19490A28790Q7329K5046p1269m221M2828k2381l9982l3220K3804O5547m174m0782
$$ 128790 216119 241165 169896 165675 208503 186122 146140 112920 136724 202271 198097 157315
19478A57315K0854M9395J8117o5083l450k3470o1285J653l8546Q7933J00381q6125
$$ 157315 178169 227564 245681 180598 177148 153678 92393 94046 55500 143433 243814 157689
19466A57689K1873m9283M2548M6361L0882j8599k5392m6856O507K2083J8232J6480
$$ 157689 179562 130279 172827 219188 250070 231471 206079 159223 165730 187813 206045 222525
19454B22525j1824Q010n7417k1733m55m325l2768N284o065k9011L2100k3223P113
$$ 222525 210701 218711 161294 139561 139106 134781 102013 107297 101232 72221 104321 81098 88211
19441H8211P2556n6608M891O0634k7783p5406j4559O5866R4305J4707K8992J4157
$$ 88211 160767 104159 109050 169684 141901 66495 51936 117802 212107 226814 255806 269963
19429B69963n720j2971o1316k8346K4445j8678O010L113m3867l4689k2673P3784
$$ 269963 264243 251272 189956 161610 186055 167377 173387 176500 132633 97944 75271 149055
19417A49055N0073J7012l0311r25l0627j9912K5635M5013J8542l2998o3175L2605
$$ 149055 199128 216140 185829 184904 154277 134365 160000 205013 223555 190557 127382 159987
19405A59987M1922j9566O0542J0187L1910J19416P1818o7532o1265m1701k1027
$$ 159987 201909 182343 242885 253072 284982 404398 476216 408684 347419 305718 284691
19394B84691p2300j29707N9300L4234k4841J7057N3329j15772m2056N9734O5414
$$ 284691 212391 82684 141984 176218 151377 168434 221763 105991 63935 123669 189083
19383A89083k0011K2352O0742j7219k4880n4206L9871O6532l1298m9289j6906
$$ 189083 169072 191424 252166 234947 210067 155861 195732 262264 230966 181677 164771
19372A64771n2454m4693k5077M8478M2829k4257J4496M8061K5781P8850K837o4486
$$ 164771 112317 67624 42547 91025 133854 109597 124093 172154 197935 276785 279622 215136
19360B15136k0146r5593k9952J27924K4872j536R926L5522J1388j7072Q1671N4143
$$ 215136 194990 99397 69445 197369 222241 220705 230631 266153 277541 260469 342140 396283
19348C96283j4470j17925j3338N7747Q2743M7947j50007j3226M7444O4792M7102
$$ 396283 381813 263888 250550 308297 391040 438987 288980 275754 323198 387990 435092
19337D35092n8462j6617q998l0054M8757q2756o2770o6379K4296J28599O0111
$$ 435092 376630 360013 351015 320961 369718 286962 224192 157813 182109 310708 370819
19326C70819P045r6700q668P5379M8660l6850o583l4116o6355j6699M1700J7625
$$ 370819 377864 281164 272496 347875 396535 359685 353102 318986 252631 235932 277632 295257
19314B95257P198j3729m0836k6929J00735P0414J65772L6666j7085L6609k6406
$$ 295257 302455 288726 247890 220961 321696 392110 557882 594548 577463 614072 587666
19303E87666l1837M5656M9740N6912j1993q993m1896q4831m1348r2910L9028O4102
$$ 587666 555829 601485 651225 708137 696144 687151 645255 560424 519076 426166 465194 529296
19291E29296m6279j1906K6757Q442q124K121j7893n0397N434n2476J2161J1122
$$ 529296 483017 471111 497868 506310 498186 500307 482414 432017 437451 384975 397136 408258
19279D08258k1234M9729L2192J612J02457O6323L2408L7348L8742p1390q5660
$$ 408258 387024 436753 468945 470557 573014 639337 671745 709093 747835 676445 590785
19268E90785L7602j4529q1926n5118m2958j5986Q206j4751J04315P7547N3441
$$ 590785 628387 613858 531932 476814 433856 417870 426076 411325 515640 593187 646628
19257F46628R6454O5232K9019L5736L7388P2135K34579N7682Q4306J45053P7037
$$ 646628 743082 808314 837333 873069 910457 982592 1217171 1274853 1359159 1504212 1581249
19246A581249J18867J09927K7914l7468L938Q7591M016m1567j70516j63870j41364
$$ 1581249 1700116 1810043 1837957 1800489 1804427 1892018 1896034 1854467 1683951 1520081 1378717
19235A378717j16161j47700J0113k6949r2958k5375K1534k8508P5990k9464J9046
$$ 1378717 1262556 1114856 1124969 1098020 1005062 979687 1001221 972713 1048703 1019239 1038285
19224A038285N2695m477r4215n3382K9352M580m3220n0173n7418l9185K3809p750
$$ 1038285 1090980 1086503 992288 938906 968258 972838 929618 879445 822027 782842 806651 798901
19212G98901K6608K1060J27639L7400l8621j8010O4391K3053J42391K59462K56673
$$ 798901 825509 846569 974208 1011608 972987 954977 1019368 1042421 1184812 1444274 1700947
19201A700947K31951K55677L10621J78520J00239N6314p7290o4400O7343N1005
$$ 1700947 1932898 2188575 2499196 2677716 2777955 2834269 2756979 2692579 2759922 2810927
19191B810927j21014j61524j71889k21467k08781m1583l5363l5067p0368p7257
$$ 2810927 2689913 2528389 2356500 2135033 1926252 1884669 1849306 1814239 1743871 1666614
19181A666614o2455O6326O942l2395j18464l1449o4267l1734m3625j5265k5149
$$ 1666614 1604159 1670485 1677427 1645032 1526568 1495119 1430852 1399118 1355493 1340228 1315079
19170A315079n3456r5335j3884j149M4083Q9198K7069M5406m6920p2619q194n5063
$$ 1315079 1261623 1166288 1152404 1151255 1195338 1284536 1311605 1357011 1310091 1237472 1229278 1174215
19158A174215p5829L9375L7064R7758Q2551k1544j4264m6131K2789k0973k2860
$$ 1174215 1098386 1137761 1174825 1272583 1355134 1333590 1319326 1273195 1295984 1275011 1252151
19147A252151q635R1439J30753J24959N1670J55738J85209J73277J24720J29130
$$ 1252151 1243516 1334955 1465708 1590667 1642337 1798075 1983284 2156561 2281281 2410411
19137B410411J32888J41151P4118M7119Q9363K14324J87522J20407R4917N2497
$$ 2410411 2543299 2684450 2758568 2805687 2895050 3109374 3296896 3417303 3512220 3564717
19127C564717J34184J28602J2372L8315J60251J43855M6737J91795J95552K16974
$$ 3564717 3698901 3827503 3839875 3878190 4038441 4182296 4229033 4420828 4616380 4833354
19117D833354M10227M82998O43530Q84729J268141J943855K942343M449320O393799
$$ 4833354 5243581 5726579 6370109 7254838 8522979 10466834 13409177 17858497 24252296
19108B4252296Q140711R226165J0781431J1857090J2270254J2110015J1880020
$$ 24252296 32393007 41619172 52400603 64257693 76527947 88637962 100517982
19101A00517982J0219526L123396j032803j235656n34597n207847j2803440j3332771
$$ 100517982 110737508 113860904 112828101 111592445 111057848 105850001 93046561 79713790
19093G9713790j0102991p592408q141251q434819o621614m332057k638161j815355
$$ 79713790 69610799 62018391 53877140 45442321 38820707 34488650 31850489 30035134
19085C0035134j629062j816678j681461j442964j175512q53778o12962m57140
$$ 30035134 28406072 26589394 24907933 23464969 22289457 21435679 20822717 20365577
19077B0365577j88388K8946P0681N2476J38194J09158J34000J14069O1699L28261
$$ 20365577 20177189 20206135 20276816 20329292 20467486 20576644 20710644 20824713 20886412 21214673
19067B1214673O87559J145333J683528K553181L993610O239396R244405J2847176
$$ 21214673 21902232 23047565 24731093 27284274 31277884 37517280 46761685 59608861
19059E9608861J6397223K0654431K4385646K6636752K8662146K9056389K9028549
$$ 59608861 76006084 96660515 121046161 147682913 176345059 205401448 234429997
19052B34429997K1593105J3584664R201942J479956n132806j5237235j9012937
$$ 234429997 256023102 269607766 278809708 280289664 275156858 259919623 240906686
19045B40906686k2666025k6922472k6129758k3423906j9967075j8446858j6098047
$$ 240906686 218240661 191318189 165188431 141764525 121797450 103350592 87252545
19038H7252545j2341611q948800o665322n143669m109312l399220k719645k275372
$$ 87252545 74910934 65962134 59296812 54153143 50043831 46644611 43924966 41649594
19030D1649594j793139j533114j290663r99908r86573q69635p18718o61010n30894
$$ 41649594 39856455 38323341 37032678 36032770 35046197 34176562 33457844 32796834 32265940
19021C2265940m61972m76776l33525j71148m9493K02217N76540J217870J983126
$$ 32265940 31803968 31327192 30993667 30822519 30773026 30975243 31551783 32769653 34752779
19012C4752779L443396N585880Q481885J1405406J3466060J5779924J8007474
$$ 34752779 38196175 43782055 52263940 63669346 77135406 92915330 110922804
19005A10922804J8934489J8854723J7929898J6782388P171669j435070k708420
$$ 110922804 129857293 148712016 166641914 183424302 190595971 189160901 186452481
18998A86452481j563363o476911j8991487k2271288j7749186j3300029j3600612
$$ 186452481 184889118 178412207 159420720 137149432 119400246 106100217 92499605
18991I2499605j4772628j2803517r503321o553666m753637l869539l174298k634039
$$ 92499605 77726977 64923460 55420139 48866473 44112836 40243297 37068999 34434960
18983C4434960k167965j753209j525344j401703j163592r30965q59259q27443
$$ 34434960 32266995 30513786 28988442 27586739 26423147 25492182 24632923 23805480
18975B3805480q03115q27887p00714o29928o36452o53502n51691n28519o20134
$$ 23805480 23002365 22174478 21473764 20843836 20207384 19553882 19002191 18473672 17853538
18966A7853538o76588p32629n15037n19116o19271n26250n76479m45519l71557
$$ 17853538 17176950 16444321 15929284 15410168 14790897 14264647 13688168 13242649 12871092
18957A2871092k81639l20449m49846l27665l67968l35621k88870k67357k86663
$$ 12871092 12589453 12269004 11819158 11491493 11123525 10787904 10499034 10231677 9945014
18948I945014k82662j81892k53322l58647l29857l52386k25049j41109k15231
$$ 9945014 9662352 9480460 9227138 8868491 8538634 8186248 7961199 7820090 7604859
18939G604859k54959j23170j23535j77795k49833j63487j16443k04725j26035
$$ 7604859 7349900 7226730 7103195 6925400 6675567 6512080 6395637 6190912 6064877
18930F064877j52891k12548k10193k30189l50089k26753j43273m7978j65311j03009
$$ 6064877 5911986 5699438 5489245 5259056 4908967 4682214 4538941 4490963 4325652 4222643
18920D222643j05621j26004j55697n9057l5153j63451j27823r4705j25877q1627
$$ 4222643 4117022 3991018 3835321 3776264 3741111 3577660 3449837 3355132 3229255 3147628
18910C147628l7956m2990j47312l1379L7496K7851m0673j15182n0419l5779j33680
$$ 3147628 3109672 3066682 2919370 2887991 2925487 2953338 2912665 2797483 2747064 2711285 2577605
18899B577605m3877j14911n3370P776q2458p2439q6947J06213K6009q9342j16431
$$ 2577605 2533728 2418817 2365447 2373223 2290765 2218326 2131379 2237592 2263601 2174259 2057828
18888B057828k9540n2231n6668q6986m8700o517L6896l0811r8777k7218j3561
$$ 2057828 2028288 1976057 1919389 1832403 1783703 1777186 1814082 1783271 1684494 1657276 1643715
18877A643715p5342j98734p5090j08533j53N5662k9162q2019j478L2470q9683
$$ 1643715 1568373 1369639 1294549 1186016 1185863 1241525 1212363 1130344 1128866 1161336 1071653
18866A071653q9516l1176n8917J8762M5867L3331J5370o7688j0003k4976L701
$$ 1071653 982137 950961 892044 910806 956673 990004 1005374 937686 927683 902707 906408
18855I06408k5231m2774L7215N1300n752k9958R9870Q2214N2182P1770m2839j4289
$$ 906408 881177 838403 875618 926918 921166 891208 991078 1073292 1125474 1197244 1154405 1140116
18843A140116J05601O2992j2295L0073N5215R1537J35852L1202N4240M2113j06065
$$ 1140116 1245717 1308709 1296414 1326487 1381702 1473239 1609091 1640293 1694533 1736646 1630581
18832A630581j58025p4102m441j3875J5568n8842j6631q7438j4679j5715m7998
$$ 1630581 1472556 1398454 1394013 1380138 1395706 1336864 1320233 1232795 1218116 1202401 1154403
18821A154403l9533r2282N2918R1962N315r494k191N0427o7229k2521J24623K1958
$$ 1154403 1114870 1022588 1075506 1167468 1172783 1163289 1161098 1211525 1144296 1121775 1246398 1268356
18809A268356o6183l4163o0982L5180o4073o1969k3628Q5015O0275K3526L9461
$$ 1268356 1202173 1168010 1107028 1142208 1078135 1016166 992538 1077553 1137828 1161354 1200815
18798A200815j466J19278J38725J55249L6681K2373J39192O3626J31860P1890
$$ 1200815 1199349 1318627 1457352 1612601 1649282 1671655 1810847 1874473 2006333 2078223
18788B078223n5496k3505n8161O697p7028k7466q30k9737k4427j07769j944n6583
$$ 2078223 2022727 1999222 1941061 1947758 1870730 1843264 1842434 1812697 1788270 1680501 1678557 1621974
18776A621974N3975P1984K4029l4153j768O9516P8461M6961k1575L626J24261
$$ 1621974 1675949 1747933 1771962 1737809 1736041 1805557 1884018 1930979 1909404 1913030 2037291
18765B037291J34488J31789J19264p9815j32360j28101j72718q2685j0624L5760
$$ 2037291 2171779 2303568 2422832 2343017 2210657 2082556 1909838 1827153 1816529 1852289
18755A852289R6636J10588j20065r9523m4494O1143J38925J69262Q8310R3371
$$ 1852289 1948925 2059513 1939448 1839925 1795431 1856574 1995499 2164761 2253071 2346442
18745B346442J53304J80882J05442P5907J70386J44232J76110K58240J43363R7125
$$ 2346442 2499746 2680628 2786070 2861977 3032363 3176595 3352705 3610945 3754308 3851433
18735C851433K80739L42612L63638N00898N93936O68462O12379M79492M86535
$$ 3851433 4132172 4474784 4838422 5339320 5933256 6601718 7214097 7693589 8180124
18726H180124N02998N72901P32899J021474J209145J460544J957362K502906L152429
$$ 8180124 8683122 9256023 9988922 11010396 12219541 13680085 15637447 18140353 21292782
18717B1292782M349390O189750R046522J3515733K0509089K9532464L9164186
$$ 21292782 25642172 31831922 40878444 54394177 74903266 104435730 143599916
18710A43599916M6533270M7353543M2500804L0554253J9247505J1606026P151038
$$ 143599916 190133186 237486729 279987533 310541786 329789291 341395317 348546355
18703C48546355L211942o336192k3305288l8865037m9362020m8066664l9106137
$$ 348546355 351758297 345422105 322116817 283251780 233889760 185823096 146716959
18696A46716959k7944821j8811839j2967655r720383p721439o202710n097365
$$ 146716959 118772138 99960299 86992644 77272261 69550822 63348112 58250747
18689E8250747m058092l367092k913182k521285k269530j782156j529788j209252
$$ 58250747 54192655 50825563 47912381 45391096 43121566 41339410 39809622 38600370
18681C8600370q03993p66359p03622n63959l93469k08563O8935J70543K58954
$$ 38600370 37796377 37030018 36326396 35762437 35368968 35160405 35229340 35399883 35658837
18672C5658837M39506O78658J047780J805986L282475N415859Q635468J3528915
$$ 35658837 36098343 36777001 37824781 39630767 42913242 48329101 56964569 70493484
18664G0493484K0503568K8470631L5724903L8171302L5620535K6986223J5486363
$$ 70493484 90997052 119467683 155192586 193363888 228984423 255970646 271457009
18657B71457009O928512J487475p73982m478021j4516428k5870835l5368179l7633479
$$ 271457009 278385521 279872996 279099014 274620993 260104565 234233730 198865551 161232072
18649A61232072l2357466k4167970j6559310j1470838q412621o675330n557186
$$ 161232072 128874606 104706636 88147326 76676488 68263867 61588537 56031351
18642E6031351m438441l582579k929060k478849k097491j813045j654580j459035
$$ 56031351 51592910 48010331 45081271 42602422 40504931 38691886 37037306 35578271
18634C5578271j357751j182131j076741j223284j135660j110809j107600r90822
$$ 35578271 34220520 33038389 31961648 30738364 29602704 28491895 27384295 26393473
18626B6393473q35295p94440p71869p58820p30094o82453n99923n53481n26573
$$ 26393473 25558178 24763738 23991869 23233049 22502955 21820502 21220579 20667098 20140525
18617B0140525o32502n75368m77038l84751l86641l60098l08705l18533k08232
$$ 20140525 19508023 18932655 18455617 18070866 17684225 17324127 17015422 16696889 16488657
18608A6488657k34038j37728j80992j69992k04009q4107n1116p115K6689J66781
$$ 16488657 16254619 16116891 15935899 15765907 15561898 15477791 15426675 15419560 15446249 15613030
18598A5613030L25368K54232L31236M79128N69315O15783O24663Q85606J010445
$$ 15613030 15938398 16192630 16523866 17002994 17572309 18188092 18812755 19698361 20708806
18589B0708806J312466J808146K508212L726492N712882Q960464J2970457J7225493
$$ 20708806 22021272 23829418 26337630 30064122 35777004 44737468 57707925 74933418
18581G4933418K2032229K8071747L1474250L1432657L4087047L4085746K4287754
$$ 74933418 96965647 125037394 156511644 187944301 222031348 256117094 280404848
18574B80404848J7630686J4944277M740382n336338j2392367k1392569k4705836
$$ 280404848 298035534 312979811 317720193 312383855 299991488 278598919 253893083
18567B53893083k4783044l0325881l1439114k5821119k1584800j9158141j5350065
$$ 253893083 229110039 198784158 167345044 141523925 119939125 100780984 85430919
18560H5430919j1185168q028682o040270m708336l762309l014769k524069k161287
$$ 85430919 74245751 66217069 60176799 55468463 51706154 48691385 46167316 44006029
18552D4006029j721791j429505j132457r34993p52350n54855j23693J29981L20647
$$ 44006029 42284238 40854733 39722276 38787283 38034933 37480078 37356385 37486366 37807013
18543C7807013L71147K75198j488m17849n41012k80943K30560R67885K120663
$$ 37807013 38178160 38453358 38451870 38034021 37493009 37212066 37442626 38410511 40531174
18534D0531174M128948O987519J0412265J3854817J7862401K2858421K5129722
$$ 40531174 44660122 51647641 62059906 75914723 93777124 116635545 141765267
18527A41765267K5152479K7878339K6825184J8439953J4008793J1666881K595270
$$ 141765267 166917746 194796085 221621269 240061222 254070015 265736896 268332166
18520B68332166m906143j0962103j8288450k0211222k0805589k5769149k5972366
$$ 268332166 263426023 252463920 234175470 213964248 193158659 167389510 141417144
18513A41417144k1039139j7837330j5883155j2550524r115490o536555m862232
$$ 141417144 120378005 102540675 86657520 74106996 64991506 58454951 53592719
18506E3592719l897064l254734k761344k322888j960229j682552j647781j576357
$$ 53592719 49695655 46440921 43679577 41356689 39396460 37713908 36066127 34489770
18498C4489770j479362j402658j286555j206454j152555j175133j051415q98085
$$ 34489770 33010408 31607750 30321195 29114741 27962186 26787053 25735638 24837553
18490B4837553q37071r37816p27331o56514o98289n99644n81206o12019n87524
$$ 24837553 24000482 23062666 22335335 21678821 20980532 20380888 19799682 19187663 18600139
18481A8600139n83068o14558n71000m77252n13067m31049m36174l99185l74666
$$ 18600139 18017071 17402513 16831513 16354261 15841194 15410145 14973971 14574786 14200120
18472A4200120m23998l82756m26031l98815l47660l75740m09114l11641l06940
$$ 14200120 13776122 13393366 12967335 12568520 12220860 11845120 11436006 11124365 10817425
18463A0817425k02405k49077k19459l24891k85456k30195k25409j45543k12619
$$ 10817425 10615020 10365943 10146484 9821593 9536137 9305942 9080533 8934990 8722371
18454H722371k12691k40434j74376k00633k76668k36878k31778k58011l88925
$$ 8722371 8509680 8269246 8094870 7894237 7617569 7380691 7148913 6890902 6501977
18445F501977l23558k46761k78192k42598j43096j70297r5971j44443j35198j63456
$$ 6501977 6178419 5931658 5653466 5410868 5267772 5097475 5001504 4857061 4721863 4558407
18435D558407j40738o7493r8512j75532j89515r9069k424m8386k00765j57889
$$ 4558407 4417669 4350176 4251664 4076132 3886617 3787548 3785124 3736738 3535973 3378084
18425C378084j08849K2984n511p5922q6191n0962q7616m2899J1993j8535j40398
$$ 3378084 3269235 3292219 3286708 3210786 3124595 3073633 2986017 2943118 2955111 2936576 2796178
18414B796178j17822p3571R248J4123J6660m7190j28622k5493o1260Q33q4197
$$ 2796178 2678356 2604785 2614033 2628156 2644816 2597626 2469004 2443511 2382251 2383084 2298887
18403B298887q9083m0376q4348q9207R124o1864j04464q3793l7339j07387j05024
$$ 2298887 2209804 2169428 2085080 1995873 2004997 1943133 1838669 1754876 1717537 1610150 1505126
18392A505126p1546k10025j32531j8474K9197m8865r5057K1840o2231M1421L9641
$$ 1505126 1433580 1223555 1091024 1072550 1101747 1052882 957825 979665 917434 958855 998496
18381I98496j0533n0288l7751o5977k7100R4531J9206r7853r9054k1460j10781
$$ 998496 987963 937675 899924 833947 806847 901378 920584 822731 723677 702217 591436
18370E91436p4198j1505k2849P440N3474K8241J11386P117M225m925O275j7645
$$ 591436 517238 505733 482884 490324 543798 572039 683425 690542 694767 689842 696117 678472
18358F78472p8212n1479J6147N9530Q4617K7374Q034m1003j07160J2249M6887
$$ 678472 600260 548781 564928 624458 709075 736449 744483 703480 596320 608569 655456
18347F55456N7456J667k7964k4611L4607n7776p6422M3946k6030o6516n8355j9489
$$ 655456 712912 714579 686615 662004 696611 638835 562413 606359 580329 513813 455458 435969
18335D35969M0578O7353N4135p1505k7093J11748M3103q7512j82516q5133Q8167
$$ 435969 476547 543900 598035 526530 499437 611185 654288 566776 384260 299127 387294
18324C87294P7709n213m4855K3242K2060m003l2449J00719P9207J7454l0431k2190
$$ 387294 465003 459790 414935 438177 460237 456234 423785 524504 603711 621165 590734 568544
18312E68544j1041K5524r09m9l10r6312m0851l3695l280k4793n8709j6342J0619
$$ 568544 557503 583027 582118 582069 581759 485447 444596 410901 407621 382828 324119 307777 318396
18299C18396l3312O4731M4336p202n192O2097L4423o0786p9294n5384M0707Q1878
$$ 318396 285084 349815 394151 386949 381757 443854 478277 417491 338197 282813 323520 405398
18287D05398j32923O674M1611o0883j9892k9457p4001m8939Q1040Q2361M3702
$$ 405398 272475 279149 320760 259877 239985 210528 136527 87588 168628 250989 294691
18276B94691q1477j08056K9895M3953Q9402R1719j00298o5499j971P2939O5204
$$ 294691 213214 105158 135053 179006 268408 360127 259829 194330 192359 265298 330502
18265C30502q6087k0791R1495m6962r4022J8985M6667J4370k8629j487J9161k0063
$$ 330502 244415 223624 315119 268157 174135 193120 239787 254157 225528 224041 243202 223139
18253B23139n067l8530M2504Q9949K9777L8103l6352q2889l5679m2293j1884Q5407
$$ 223139 218072 179542 222046 311995 341772 379875 343523 260634 224955 182662 170778 256185
18241B56185L2122n7285J0036L5560n3032N1482Q4687L3334m9427n9704J2312
$$ 256185 288307 231022 241058 276618 223586 275068 359755 393089 343662 283958 296270
18230B96270K7698M1480j17390m5490R5475l4926r3443K4277J4432k3976l5099
$$ 296270 323968 365448 248058 202568 298043 263117 169674 193951 208383 184407 149308
18219A49308P5588n6876j4359J3517k7653N6411J14012M3676o9277k4174k4827
$$ 149308 224896 168020 153661 167178 139525 195936 309948 353624 284347 260173 235346
18208B35346J5502J2243j24252j05L4999k1425O1064j3346k7287J5166R1449m5847
$$ 235346 250848 263091 138839 138734 173733 152308 213372 200026 172739 187905 279354 233507
18196B33507r4957l7548N4310J0164Q476j13405K2082Q0961p1118K2515m625N0880
$$ 233507 138550 101002 155312 165476 173952 60547 82629 163590 92472 114987 110362 161242
18184A61242O8386L2829O9802l9141K9439O5853O4375p5893n1101L9211Q0358
$$ 161242 229628 262457 332259 293118 322557 388410 452785 376892 325791 365002 445360
18173D45360K01031K76454K25803L01172K44986J57982J93721O1145n3916m6413
$$ 445360 646391 922845 1148648 1449820 1694806 1852788 2046509 2107654 2053738 2007325
18163B007325n9597j12902l13019k52534k46782j93702r3058k6093o9804r1514
$$ 2007325 1947728 1834826 1521807 1269273 1022491 828789 735731 709638 639834 548320
18153E48320p8134q0351M7460Q3379P1138R5567l6682p4177K5936O737L234N4921
$$ 548320 470186 389835 437295 520674 591812 687379 650697 576520 602456 609193 612427 667348
18141F67348N5172k8237n710o9732J707N1320K5106K6610J0169R5402J60957J33309
$$ 667348 722520 694283 688573 618841 620548 671868 696974 723584 733753 829155 990112 1123421
18129A123421K7938L5818J01318J57480K27396L09970L66383L53042L52529M03082
$$ 1123421 1151359 1187177 1288495 1445975 1673371 1983341 2349724 2702766 3055295 3458377
18119C458377L74017L56643L96836M42460O14763Q46602J245079J895388L112936
$$ 3458377 3832394 4189037 4585873 5028333 5643096 6489698 7734777 9630165 12743101
18110A2743101N392632R996906J7226134K2755462J8698401J3942291L125811
$$ 12743101 18135733 28132639 45358773 68114235 86812636 100754927 103880738
18103A03880738k2215756k7177809j7968661r536275m999089l180614k439826
$$ 103880738 81664982 54487173 36518512 26982237 21983148 18802534 16362708
18096A6362708k043585j742775j332405j065115q06057p31613o95652o84428m69664
$$ 16362708 14319123 12576348 11243943 10178828 9372771 8641158 7945506 7261078 6791414
18087F791414l81135k95976l08831k26051j20185j70128j87502j70887q4383j17224
$$ 6791414 6410279 6114303 5805472 5579421 5459236 5289108 5101606 4930719 4846336 4729112
18077D729112p0984k35094j21450j40644k09079k67332j69592j20282p6125r2290
$$ 4729112 4658128 4423034 4301584 4160940 3951861 3684529 3514937 3394655 3318530 3226240
18067C226240k16436j70436m4925j2355k5955n0254k3619m3883m7902p7392j07294
$$ 3226240 3009804 2839368 2794443 2782088 2756133 2705879 2682260 2638377 2590475 2513083 2405789
18056B405789j17524j13380n2086J0158n7835j03199j46432l2749l8956k0407
$$ 2405789 2288265 2174885 2122799 2132957 2075122 1971923 1825491 1792742 1753786 1733379
18046A733379o3327j51558n3797o9838N4071J01075q8367j9732o421m805J105
$$ 1733379 1670052 1518494 1464697 1394859 1448930 1550005 1461638 1441906 1435485 1430680 1431785
18035A431785K8291o514O1166O2008J25408J39725R5065J40639J33047J11683
$$ 1431785 1460076 1453562 1514728 1576736 1702144 1841869 1936934 2077573 2210620 2322303
18025B322303q929Q1484K8098L4195o3154j55525q9839j46834k32617j70358q8096
$$ 2322303 2313374 2394858 2422956 2457151 2393997 2238472 2148633 2001799 1769182 1598824 1510728
18014A510728j21607j41727o5274j7922l4547j9856o5168q3993j14259p9217k4356
$$ 1510728 1389121 1247394 1182120 1164198 1129651 1109795 1044627 960634 846375 767158 742802
18003G42802m1137k1118J00888l1460o7804K0206K3079J2351Q783r322P9111q800
$$ 742802 701665 680547 781435 749975 682171 702377 725456 737807 746590 737268 816379 807579
17991H07579n9069n6483L1940L2611N0349R357P655j1588o2427O3792J64553R8107
$$ 807579 748510 692027 723967 756578 806927 816284 823939 812351 749924 813716 978269 1076376
17979A076376J28830O6341Q6841R1433N9257J17434J64151P1802n0138o5211o7304
$$ 1076376 1205206 1271547 1358388 1449821 1509078 1626512 1790663 1862465 1812327 1747116 1679812
17968A679812j40294j75274j36103j10631j92100m6820j33475j36854o372p7006
$$ 1679812 1539518 1364244 1228141 1117510 925410 878590 745115 608261 601889 524883
17958E24883l7370o5111L8425L8493j54952l9327L3899l1002q959p243Q924J1412
$$ 524883 487513 422402 460827 499320 344368 305041 338940 307938 298979 291736 300660 312072
17946C12072l7268L7156n3043l5857l5056J38698M5530l0946P2703N5441O39r715
$$ 312072 274804 311960 258917 223060 188004 326702 372232 341286 413989 469430 470069 460354
17934D60354o7612l3862n6275P127N4662L6143J24526P0870J23712J38598L7695
$$ 460354 392742 358880 302605 309732 364394 400537 525063 595933 719645 858243 895938
17923H95938k8013L9491P5188j30808j55279j32434j00406q2035J2931l5022p4710
$$ 895938 867925 907416 982604 851796 696517 564083 463677 381642 394573 359551 284841
17912B84841P1223L3338k044r684l0654r197O2230O9204o0276n669l9231l9728
$$ 284841 356064 389402 387358 377674 347020 337823 400053 469257 408981 403312 364081 324353
17900C24353n5814J8270o0992M3674K5884j9130J692j7243L31J01599n5803n5419
$$ 324353 268539 286809 225817 269491 295375 276245 277937 260694 261025 362624 306821 251402
17888B51402k9227K8335j9149l4437J4688m1281k2916K4996J02657J29657j678
$$ 251402 222175 250510 231361 196924 211612 170331 147415 172411 275068 404725 403047
17877D03047N8164K1173m3883K5092m592K6535L9316J0150p1833Q0971L7651k2310
$$ 403047 461211 482384 438501 463593 459001 485536 524852 535002 463169 544140 581791 559481
17865E59481l7058j46282n0792k6376M0568q3346k4748O082k4971r9099j03476
$$ 559481 522423 376141 325349 298973 339541 256195 231447 237529 212558 113459 9983
17854I983Q2744O7352Q647J572N1044m6709k0944j4892J1821k7297Q0088M710
$$ 9983 92727 160079 168726 170298 221342 174633 153689 138797 150618 123321 203409 208119
17842B08119j48229q781M081Q493M4876P70l0653K0755p2558k319J08573P4997
$$ 208119 59890 51109 55190 63683 108559 109329 78676 99431 26873 24554 133127 208124
17830B08124M5234P1614p8766N5198O3759R171o603m303m1059n3471K4337k4534
$$ 208124 253358 324972 246206 301404 365163 374334 367731 363428 322369 268898 293235 268701
17818B68701j72057j0215l0233l3556P706J3450q7997O049J1704N601M3566J04402
$$ 268701 96644 86429 56196 22640 30346 43796 -44201 -38152 -26448 -20847 22719 127121
17806A27121Q7567q4008o4408O6194m9948K5770O8603n3076o5100j2463M7130
$$ 127121 214688 130680 66272 132466 82518 108288 176891 123815 58715 46252 93382
17795I3382O5311j522J2796n3157o7700P3518J07348n8379K3480M0028k534J2568
$$ 93382 158693 157171 169967 116810 49110 122628 229976 171597 195077 235105 232571 245139
17783B45139O9803R2340O9712J8025j5398L0375q3133p9412p6217l9592j4477
$$ 245139 314942 407282 476994 495019 479621 509996 426863 347451 271234 231642 217165
17772B17165k9410k1307m3776q844M0142k7780l4642l6077q729Q2887L0089m3763
$$ 217165 187755 166448 122672 113828 153970 126190 91548 55471 46742 129629 159718 115955
17760A15955k8253l5836k0689l6536j5190k034p2382p0337N0490P4170L4932J7650
$$ 115955 87702 51866 31177 -5359 -20549 -22583 -94965 -165302 -114812 -40642 -5710 11940
17748A1940J6443J9124N9980M2263m3267o3774q4639M8693P6557O8920K8606r0239
$$ 11940 28383 47507 107487 149750 106483 42709 -41930 6763 83320 152240 180846 90607
17736I0607j15014k1242r820M7924O45M7226K1720j09233m3757K8375P6147L7761
$$ 90607 -24407 -45649 -55469 -7545 -6900 40326 62046 -47187 -90944 -62569 13578 51339
17724E1339K0166k0138p1610K0552l262J9641M4795P0634p4599o5205O6805R9340
$$ 51339 71505 51367 -20243 309 -2953 16688 61483 132117 57518 -7687 59118 158458
17712A58458L8860q2100n6207J4303L5752j7894N331O2953K531O5860l934r1573
$$ 158458 197318 115218 59011 73314 109066 91172 96503 159456 161987 227847 223913 132340
17700A32340o5051n3296J2866J14870M3673k8270n978k6833M4989N0471J07759
$$ 132340 67289 13993 26859 141729 185402 157132 151154 124321 169310 219781 327540
17689C27540J9049M3339Q6872K9061L593k3960n9563q2175j02212J0746O5573
$$ 327540 346589 389928 476800 505861 509454 485494 425931 343756 241544 252290 317863
17678C17863J5909o3108j36718j13371O4785J23921P6010k4494n7681Q133m5798
$$ 317863 333772 270664 133946 20575 85360 209281 285291 260797 203116 211249 165451
17667A65451p0898O3842j609m7677l0303J1533P6503M6968m1251r7469K6700j3848
$$ 165451 94553 158395 156786 109109 78806 90339 166842 213810 172559 75090 101790 87942
17655H7942j1012o4618M0005M6181L9618j2125J2567Q3860K4804k9763k3121Q6642
$$ 87942 76930 12312 52317 98498 138116 125991 138558 222418 247222 217459 194338 280980
17643B80980O6863L1657J334k3810j6807N7817Q9133R3319n6584n3064k8641j42409
$$ 280980 347843 379500 380834 357024 340217 398034 487167 580486 523902 470838 442197 299788
17631B99788o0647j26416p800J9730K1939m130q2697n7027l7656n817R1404J15943
$$ 299788 239141 112725 104925 124655 146594 142464 59767 2740 -34916 -40733 50671 166614
17619A66614o8672p5710L2645Q7270p540k8169j3388N7146m7061l3561l9940O2346
$$ 166614 97942 22232 54877 142147 134607 106438 93050 150196 103135 69574 29634 91980
17607I1980K1785q6908k1000N093p641j7911o7223l2675R3617j244p8270O4015
$$ 91980 113765 26857 5857 10950 3309 -14602 -81825 -114500 -20883 -22127 -100397 -36382
17595c6382k0180L6957j6567P321L826O9437L6297O3565O881J5861m8687n5924
$$ -36382 -56562 -19605 -36172 -28851 -25025 44412 80709 144274 151155 167016 118329 62405
17583F2405n4688o5008m055K1868O1932J9746n3472j6210j8183o6789p7169J9196
$$ 62405 7717 -57291 -61346 -39478 22454 42200 -11272 -27482 -45665 -112454 -189623 -170427
17571a70427P8698N1082M1158K9623k2361M5842P6905j3681l7937j460K7697N793
$$ -170427 -91729 -40647 511 30134 7773 53615 130520 116839 78902 77442 105139 110932
17559A10932L2520p666l9688p271K0381J1637k584L5656m5834m4835l8300n2691
$$ 110932 143452 135786 96098 88827 109208 120845 118261 153917 108083 63248 24948 -27743
17547b7743o0061k2407L1484j3679M3579M4966P413M8061q707J7866j037O8120
$$ -27743 -87804 -110211 -78727 -92406 -48827 -3861 3552 51613 42906 60772 59735 127855
17535A27855k7565M1522K3219l4785m641l4336M3404k6531p0787p0260m7002L4829
$$ 127855 100290 141812 165031 130246 125605 91269 134673 108142 37355 -32905 -79907 -45078
17523d5078P0625M8846q654o8690Q6858J55773P1910L236K8036L8187O5529P2338
$$ -45078 25547 74393 65739 -2951 83907 239680 311590 314826 342862 381049 446578 518916
17511E18916M8821k2484q1610J0547J7519j24290n7250m7422M5288K6321j7289
$$ 518916 567737 545253 463643 474190 491709 367419 310169 262747 308035 334356 317067
17500C17067m0072m6675p5002L0232M2304j3331l8808J3648j7105l2266J62k7517
$$ 317067 276995 230320 155318 185550 227854 214523 175715 189363 172258 139992 140154 112637
17488A12637l2508P2031M8948J6924j26473j00002k8780n6043K5792J06496q8454
$$ 112637 80129 152160 201108 218032 91559 -8443 -37223 -93266 -67474 39022 -49432
17477d9432j12348L4159Q1390J07968P9440k7798m2363K4325J3016o740P2557
$$ -49432 -161780 -127621 -46231 61737 141177 113379 71016 95341 108357 101617 174174
17466A74174O0460K2008o6215L9615L4883R739J09220L3751m2006P4624J3220
$$ 174174 234634 256642 190427 230042 264925 274664 383884 417635 375629 450253 463473
17455D63473n6700m3100m3935Q7820K3321j01262j18316J0097M7882M7313r4592
$$ 463473 406773 363673 319738 407558 430879 329617 211301 221398 269280 316593 222001
17444B22001j7807R1762O4339Q4097N4760J6979l854p8401j51785o7821k8624
$$ 222001 204194 295956 360295 444392 499152 516131 512277 433876 282091 214270 185646
17433A85646q0223l4214n3220L791j336p6590K2235J5743J7355N4339q008j5827
$$ 185646 105423 71209 17989 21780 20444 -56146 -33911 -18168 -813 53526 45518 29691
17421B9691K2443N7668o328l1376J7379j1221J7623k8792L8054l5008l7058J17795
$$ 29691 52134 109802 103474 72098 89477 78256 95879 67087 105141 70133 33075 150870
17409A50870j3868p1144o5610k2021J3112N369K3275K8399M0927O1743L6321k2027
$$ 150870 137002 65858 248 -21773 -8661 -3292 19983 48382 89309 151052 187373 165346
17397A65346n9739j1029j7822K9029J4591p9037n4639J8517J24807K8972o5116
$$ 165346 105607 94578 76756 105785 120376 41339 -13300 5217 130024 158996 93880
17386I3880q026q7968p1433J16642K9873m1046L931n5202K782R7235L6236M6330
$$ 93880 85854 -2114 -73547 43095 72968 31922 35853 -19349 -16567 80668 116904 163234
17374A63234Q0873L3676j5198j17617p0462O4471J01825m420k0345o6438K6760
$$ 163234 244107 277783 262585 144968 74506 138977 240802 236382 216037 149599 176359
17363A76359Q92o6447l4768n2873m4871J54236n2471m8509J8016L409j28944p7054
$$ 176359 177251 110804 76036 23163 -21708 132528 80057 31548 49564 52973 -75971 -153025
17351a53025m0383M9839K1261J09687l4271m7963M4116M0649n5890J4245j6376
$$ -153025 -193408 -143569 -122308 -12621 -46892 -94855 -50739 -10090 -65980 -51735 -68111
17340f8111q607m472Q953R3495L8176R061N2110l9641q4033l2170k7738j2458
$$ -68111 -76718 -81190 -72237 21258 59434 68495 120605 80964 -3069 -35239 -62977 -75435
17328g5435J5850Q466L9001M0844J8244n8429q2395L4952O6306K3391n2926L8203
$$ -75435 -59585 -51119 -12118 28726 46970 -11459 -93854 -58902 7404 30795 -22131 16072
17316A6072l4568O009J12757p0391m9360k9948J8756K3213j6013Q0552P4048L987
$$ 16072 -18496 -12487 100270 29879 -19481 -49429 -30673 -7460 -23473 57079 131127 135114
17304A35114k0675k6103L8114M2801l2826j08020p9067N7024K0608j02821j15501
$$ 135114 114439 88336 126450 169251 136425 28405 -50662 6362 26970 -75851 -191352
17293a91352M1192O4967O737o4400J9293M1991M5741k7500L7707l0336J2067j5339
$$ -191352 -150160 -85193 -78456 -142856 -123563 -81572 -35831 -63331 -25624 -55960 -43893 -59232
17281e9232l2892J08841o000p824o7096n5918k15P728P3976K9170L2282k2463
$$ -59232 -92124 16717 10717 2893 -64203 -120121 -120336 -112608 -38632 -9462 22820 357
17269C57o6513l139K2467J7078J5160n883k8615m636O2258R2100j8392j68659
$$ 357 -66156 -69295 -46828 -29750 -14590 -20473 -49088 -53724 8534 100634 82242 -86417
17257h6417j16834J00612R2479M2403J4337l6790p5602p7672J3565N0961P9048
$$ -86417 -203251 -102639 -10160 32243 46580 9790 -65812 -143484 -129919 -78958 90
17246I0l1203K8000L8460K8043k505J1367l8267j0536J5056K3788m275p2533P819
$$ 90 -31113 -3113 35347 63390 60885 72252 33985 23449 38505 62293 58018 -14515 -6696
17233f696K4828N4253K229m8868l961K251K8180p6428q7864k2057J03746R6261
$$ -6696 18132 72385 74614 25746 21785 24036 52216 -24212 -112076 -134133 -30387 65874
17221F5874K8474p7697j43035k2995N5842J5469O1691m3266j1800n0303O72N2858
$$ 65874 94348 16651 -126384 -149379 -93537 -78068 -16377 -59643 -71443 -121746 -121074 -68216
17209f8216Q1632O620p0227M543J35736M1456l2892k3225j21447l4126L3186Q84
$$ -68216 13416 20036 -50191 -45648 90088 131544 98652 75427 -46020 -80146 -46960 -46076
17197d6076l5843n6718o91J04404P2653K3343M6518j8239o3397N073M5334N1290
$$ -46076 -81919 -138637 -139328 -34924 37729 61072 107590 89351 25954 31027 76361 127651
17185A27651m6042o9930l0837K8371M8109O713k5533m5354M2318L4686l1619P8809
$$ 127651 81609 11679 -19158 9213 57322 64035 38502 -6852 35466 70152 38533 117342
17173A17342J1276p0546m3452j3986M0816J358m0031k4533l7522r196J1411K7164
$$ 117342 128618 58072 14620 634 41450 42808 2777 -21756 -59278 -68474 -57063 -29899
17161b9899n6816J0689J00653P8415l3897J0569q8470o2734n0041l0867q3042
$$ -29899 -86715 -76026 24627 103042 69145 79714 -8756 -71490 -121531 -152398 -235440
17150b35440K9566J43710K063J0946L7579P012M049j01158P6739J65969M5136
$$ -235440 -205874 -62164 -60101 -49155 -11576 -4564 -515 -101673 -24934 141035 186171
17139A86171l773q4251m0715l5626k7454j739J900L2228j1412j754l3669P1862
$$ 186171 182398 98147 57432 21806 -5648 -7387 -5487 26741 15329 13575 -20094 51768
17127E1768N0325j12o0312k4535k5815j1109P330j1171l1947n5028J4132O2490
$$ 51768 102093 101981 41669 17134 -8681 -19790 -12460 -23631 -55578 -110606 -96474 -33984
17115c3984P950L6199K7654O5602l3391o0604m3991p5005q5575R1609J02316n1667
$$ -33984 -26034 10165 37819 103421 70030 9426 -34565 -109570 -195145 -103536 -1220 -52887
17103e2887n2108M6815O075N8552m2742l3314J8297M5867L1859K5616k6825j05545
$$ -52887 -104995 -58180 -52105 6447 -36295 -69609 -51312 -5445 26414 52030 25205 -80340
17091h0340P146J8231l0560j9421M163o8721j7513J82442L0345n6114K8123O462
$$ -80340 -73194 -54963 -85523 -104944 -100781 -169502 -187015 -4573 25772 -30342 -2219 4243
17079D243r6272L3051M5224p1322N9250P784k5008R7259j5778m4404l6498R526
$$ 4243 -92029 -58978 -13754 -85076 -25826 -18042 -43050 54209 38431 -5973 -42471 -32945
17067c2945k596N910j7857j8090k1508o043L4132J12863K4882n1350k5226M4607
$$ -32945 -35541 -29631 -47488 -65578 -87086 -93129 -58997 53866 78748 27398 2172 46779
17055D6779n9671p8144L1088J0019L7967k4978o3026L0514P5549N0537L5884L5031
$$ 46779 -12892 -91036 -59948 -49929 -11962 -36940 -99966 -69452 6097 56634 92518 127549
17043A27549J1850j06348n8926O2320M62P6511m3539o3123l2154N2282J00150
$$ 127549 139399 33051 -25875 36445 36907 113418 69879 6756 -25398 26884 127034
17032A27034l8134m1897m342L9040Q1989J67240Q3195L8930N61K147k7441o5727
$$ 127034 88900 47003 42661 81701 163690 330930 414125 453055 453616 455763 428322 362595
17020C62595K5363l7314p9848k7338n4476K2816j9632n9407N211k7012n6290m8629
$$ 362595 387958 350644 270796 243458 188982 211798 192166 132759 137970 110958 54668 6039
17008F039J5952O3413M4234m5239m4166j2309M7755m107L543J9867Q1483J10013
$$ 6039 21991 85404 129638 84399 40233 27924 75679 71572 75115 94982 176465 286478
16996B86478J02668p5200j23494q7038O2282L722j18275R972J02412N7703r9334
$$ 286478 389146 313946 190452 103414 165696 169418 51143 61115 163527 221230 121896
16985A21896k3496m109n5303o9050m6553j0167l9868N4820p832l4949O6075K2111
$$ 121896 98400 94291 38988 -30062 -76615 -86782 -126650 -71830 -79662 -114611 -48536 -26425
16973b6425K3098o4067k2043J10907M402l4865j976m2768m8498J25023O3227o4031
$$ -26425 -3327 -67394 -89437 21470 25872 -8993 -10969 -53737 -102235 22788 86015 21984
16961B1984q4115P5522L7935o6137J0319k940L7391j3086J5630N052P9531N7409
$$ 21984 -62131 13391 51326 -14811 -4492 -7432 29959 16873 32503 37555 117086 174495
16949A74495n1263j0259O2018l3567o3112l0403l4739l7039L4883M5001q1898
$$ 174495 123232 112973 174991 141424 78312 47909 13170 -23869 11014 56015 -25883
16938b5883p693j7685j858N6833j527J861J6077L5136J14521k2521j06415p8550
$$ -25883 -33576 -51261 -53119 3714 2187 4048 20125 55261 169782 147261 40846 -37704
16926c7704K6559j5040j3883K2462M3249P2939M3484k4166p9202j0950r2243k8588
$$ -37704 -11145 -26185 -40068 -17606 25643 98582 142066 117900 38698 27748 -64495 -93083
16914i3083l1513N0825M9230K3707l5140K3425J0593J6948P311p5553l3864l7656
$$ -93083 -124596 -73771 -24541 -834 -35974 -12549 -1956 14992 22303 -53250 -87114 -124770
16902a24770o5674l35R9477J4038M5762J5490j21596P4119J5660r207J7041M8332
$$ -124770 -190444 -190779 -91302 -77264 -31502 -16012 -137608 -63489 -47829 -57036 -39995 8337
16890H337q9096o4265K3454N3536L8820L2655J15001o4721l2555r3809m3690O0634
$$ 8337 -80759 -145024 -121570 -68034 -29214 3441 118442 53721 21166 -72643 -116333 -55699
16878e5699L8564R085k830O559L6337M0201L5657R251j8263r4641j60181N013
$$ -55699 -17135 -8050 -10880 -4321 32016 72217 107874 117125 98862 4221 -155960 -150947
16866a50947o29q615j0593M7660K7273J18826J05409K3437o8248j01117K3205
$$ -150947 -151576 -160191 -170784 -123124 -95851 22975 128384 151821 83573 -17544 5661
16855E661K732O7934j00914m8863N4998K2744R057j9988j3052N9641k9646k0179
$$ 5661 8393 76327 -24587 -73450 -18452 4292 13349 -6639 -19691 39950 10304 -9875
16843i875r2192j1402L1688Q6399J9727j3770l0054q4691P3504N4803L956k2298
$$ -9875 -102067 -113469 -81781 4618 24345 10575 -19479 -104170 -30666 24137 28093 5795
16831E795o0136j494K0791K7377J0919l9931m1250m4218L7966K6934M7834J1831
$$ 5795 -54341 -55835 -35044 -7667 3252 -36679 -77929 -122147 -84181 -57247 -9413 2418
16819B418J6155Q377M1841K2691j1798q2283m8037o1378l5544P4217K7308R360
$$ 2418 18573 26950 68791 91482 79684 -2599 -50636 -112014 -147558 -73341 -46033 -36673
16807c6673L2287j4702M9374Q8522P166m6987o878m6213L5330m4633L8294N2854
$$ -36673 -4386 -19088 30286 118808 125974 78987 72109 25896 61226 16593 54887 107741
16795A07741J952J5177N371O5764o0141l7513j4116m1895q5050m1159O7723J44337
$$ 107741 109693 124870 130241 196005 135864 98351 84235 42340 -42710 -83869 -16146 128191
16783A28191J5634j9586K2443n0672p5340k0364k1302l4051O2522J4719p735M5249
$$ 128191 143825 124239 146682 96010 20670 306 -20996 -55047 7475 22194 14459 59708
16771E9708k0489p758m5319l1310k3078l0256J6734p404N2373M5476m9343m8544
$$ 59708 39219 31461 -13858 -45168 -68246 -98502 -81768 -89172 -36799 8677 -40666 -89210
16759h9210M1393K9890L9975o5117k4416O0086P884q7605p5188Q2809P5442l981
$$ -89210 -47817 -17927 22048 -43069 -67485 -7399 485 -87120 -162308 -79499 -4057 -8038
16747h038m1026N3007j1045j48234j36618Q6938J43301N5903j637Q161k1590J0052
$$ -8038 -49064 3943 -7102 -155336 -291954 -205016 -61715 -5812 -7449 712 -20878 -10826
16735a0826Q952k7843N3394j9869j5572O6132Q4669l4122k6378l4322q1392k7637
$$ -10826 -1874 -29717 23677 3808 -11764 54368 139037 104915 78537 44215 -37177 -64814
16723f4814N9778Q6942J4032k3912o7458N0241M7081l4623p4376J3009K0157q02
$$ -64814 -5036 81906 95938 72026 4568 54809 101890 67267 -7109 5900 26057 25255
16711B5255M115M045M4513m5504k5351j1021O0536P1455K7426k9239q0897j12702
$$ 25255 29370 33415 77928 32424 7073 -3948 56588 128043 155469 126230 45333 -67369
16699f7369p7042K5771J9784M9530K6538J215M9683N0P5721l8217j1426J5365
$$ -67369 -144411 -118640 -98856 -49326 -22788 -21573 28110 28160 103881 65664 54238 69603
16687F9603M2514K0864l8408m9990j1428P6752R2585O4709L3057J95J01959R033
$$ 69603 112117 132981 94573 44583 33155 109907 202492 267201 300258 300453 402412 411445
16675D11445j98534o5289L8985L4029j5110L2522j7344o40M999k8325n9320n662
$$ 411445 212911 147622 186607 220636 205526 238048 220704 220064 225063 196738 137418 131756
16663A31756l9455O150L2413n0857L237k6701l8051n2249N3544N3554p7261J4200
$$ 131756 92301 98451 130864 80007 83244 56543 18492 -33757 19787 73341 -3920 10280
16651A0280M7524n3452m8086k5235k9664j1786O1463J7779N9510P1447M9909j10838
$$ 10280 57804 4352 -43734 -68969 -98633 -110419 -48956 -31177 28333 99780 149689 38851
16639C8851n105P6370p7536k0569j2733j1051l1096O1961L5290l6540l8100N7646
$$ 38851 33746 110116 32580 12011 -722 -11773 -42869 19092 54382 17842 -20258 37388
16627C7388M9785j45541p1800K6979Q4735P1857m7730m5823k055P1750M2025O75
$$ 37388 87173 -58368 -130168 -103189 -18454 53403 5673 -40150 -42205 29545 71570 72245
16615G2245J2480m3371l0809j01322J504J08995J3245m353J4271K7696P344n2715
$$ 72245 84725 41354 10545 -90777 -89273 19722 32967 28614 42885 70581 77925 25210
16603B5210p9686l0924N903L6511k8743j6097J8648K9815j5919p8068J1016M8261
$$ 25210 -54476 -85400 -79497 -42986 -71729 -87826 -69178 -39363 -55282 -133350 -122334 -74073
16591g4073M6875j643J2076l9538n3760M1750k523J2872L7974N884j4743j5205
$$ -74073 -27198 -28841 -16765 -56303 -110063 -68313 -70836 -57964 -19990 -14106 -28849 -44054
16579d4054N5332K7295j6551m8924K3438K8058j16173k0678j6763M0534O2761
$$ -44054 11278 38573 22022 -26902 -3464 24594 -91579 -112257 -129020 -88486 -25725
16568b5725O7807J6167k9289r2029K664O3194O7080K5209L6373M882j1441P140
$$ -25725 42082 58249 28960 -63069 -60405 2789 69869 95078 131451 136333 124892 132032
16556A32032p3932o9112k8980M8605L6928K827o2861L4330L394n0334j969L6569
$$ 132032 58100 -11012 -39992 8613 45541 48368 -14493 19837 23231 -27103 -29072 7497
16544G497n877l7091n4794J5562K062p9688M7380J34195N752J7594k3328m5990
$$ 7497 1620 -35471 -90265 -74703 -72641 -152329 -104949 29246 34998 52592 29264 -16726
16532a6726J0883P6213R2533L9947l6242n3151j3671M9392k8321o5278k5073M2758
$$ -16726 -5843 70370 162903 202850 166608 113457 99786 149178 120857 55579 30506 73264
16520G3264Q1110j1941n2400l7884n7285q6587N2667Q3934q929n9065N1563L3468
$$ 73264 154374 142433 90033 52149 -5136 -91723 -39056 44878 35949 -23116 28447 61915
16508F1915o0928M208O3658j5168o213k4995L022K9048m3728l5392J7665j8969
$$ 61915 987 5195 68853 53685 47472 22477 25499 54547 10819 -24573 -6908 -25877
16496b5877L5514K4989J1148n6924m8565P9202J06575j1470J3823N8651P0950
$$ -25877 9637 34626 45774 -11150 -59715 19487 126062 114592 128415 187066 258016
16485B58016J069p1301m4221n4048M3158O2042l381o0126j0493K0037j2955j490
$$ 258016 259085 187784 143563 89515 132673 194715 191334 131208 120715 140752 127797 126307
16473A26307n4022m610m973n6729m9652l6449J37N4212m0574q8542q260N5661
$$ 126307 72285 67675 62702 5973 -43679 -80128 -79991 -25779 -66353 -154895 -163155 -107494
16461a07494P5998J11479J7113l5664l6240P3518n38j0803m1702p362k1820k2976
$$ -107494 -31496 79983 97096 61432 25192 98710 98172 87369 45667 38305 16485 -6491
16449f491M0662J08768K0274o7902j08532l1717Q05J5985j4821K5966j2706k0034
$$ -6491 34171 142939 163213 95311 -13221 -44938 -44133 -28148 -42969 -17003 -29709 -49743
16437d9743O2118m546Q441l0853q0121k0093O5180N9437J0817p4014j41817r787
$$ -49743 12375 7829 16270 -14583 -94704 -114797 -49617 9820 20637 -53377 -195194 -204981
16425b04981O6225J062k5234L7290J7299K6348m4390L7354K5994K8487k4925k6931
$$ -204981 -138756 -137694 -162928 -125638 -108339 -81991 -126381 -89027 -63033 -34546 -59471 -86402
16413h6402O3497l4355l6273R9944q7580j26992J00837k650N0251R1215k7247
$$ -86402 -22905 -57260 -93533 6411 -81169 -208161 -107324 -109974 -59723 31492 4245
16402D245j5497l9471m4080P1350N591l9340k6368m8073L4388K6075J646j46O3755
$$ 4245 -11252 -50723 -94803 -23453 -17862 -57202 -83570 -131643 -97255 -71180 -69534 -69680 -5925
16389e925N2979j8994j22008P2592L2154j9376Q6848o844q5704n962L1909m4745
$$ -5925 47054 28060 -93948 -21356 10798 -8578 78270 71426 -14278 -20240 11669 -33076
16377c3076j26529N1069R2255L9788n7459k3452p004L5887M103k1399j0191J7741
$$ -33076 -159605 -108536 -16281 23507 -33952 -57404 -64408 -28521 -24418 -45817 -56008 -38267
16365c8267q447j05587j9785O3969L6026O534l048l4341J361J8166k748j3278
$$ -38267 -46714 -152301 -172086 -108117 -72091 -65557 -68605 -102946 -101585 -83419 -86167 -99445
16353i9445O0730J1222N4318Q175j31926r4547J1052J33013M4655p638P5142N4747
$$ -99445 -38715 -27493 26825 35000 -96926 -191473 -180421 -47408 -2753 -10391 64751 119498
16341A19498J695p8730Q221J1425J1423k4056q8363j2858J06036L0640m2826l1906
$$ 119498 121193 42463 50684 62109 73532 49476 -38887 -51745 54291 84931 42105 10199
16329A0199n3377m0295j7370j2156L1402O1666l6424p2433J06077O4943J3448
$$ 10199 -43178 -83473 -100843 -112999 -81597 -19931 -56355 -128788 -22711 42232 55680
16318E5680l4148k0033L955J3525j8444R883J8849L6859J1802p53K2369p7068
$$ 55680 21532 1499 5454 18979 535 10418 29267 66126 77928 77175 99544 22476
16306B2476M379n85k2639n0058N941J5577K1929k5231n7272K5850O5706M6838
$$ 22476 26855 26270 3631 -46427 -40486 -24909 -2980 -28211 -85483 -59633 6073 52911
16294E2911r512o1012j327O2843l1594o2849n793J291k712Q5709R7385O043p1896
$$ 52911 43399 -17613 -18940 43903 12309 -50540 -56333 -55042 -57754 27955 125340 131383 59487
16281E9487j13124l3271K2617k0831J9136L3230j0326k4823L6676M7837Q1411
$$ 59487 -53637 -86908 -64291 -85122 -65986 -32756 -43082 -67905 -31229 16608 98019
16270I8019O0180p0092r221N0545N6414O3994k2727l8710r7855j12355J4381j462
$$ 98019 158199 88107 78886 129431 185845 249839 227112 188402 90547 -21808 -7427 -8889
16258h889l2908k4809N1764N2582K2732p5887l805m6227Q7059J20857l0701o7648
$$ -8889 -41797 -66606 -14842 37740 60472 -15415 -19220 -65447 21612 142469 111768 44120
16246D4120o6018m7706k1449Q9052P3819o4896K4224j3309j7322m1305n3482K198
$$ 44120 -21898 -69604 -91053 -2001 71818 6922 31146 17837 515 -40790 -94272 -92074
16234i2074L8881n655j0819j8574L7810l834q007n542M9878l0392O767M3251N7797
$$ -92074 -53193 -58848 -69667 -88241 -50431 -54265 -62272 -67814 -17936 -48328 -41561 1690 59487
16221E9487J07396J7114k1842j18508l3508L6043k6579J3514K5663j5809o9052
$$ 59487 166883 183997 162155 43647 10139 46182 19603 33117 58780 42971 -26081
16210b6081l5806j7811L9724J07645N3307L8572J8821K4640l2624j80682j8797
$$ -26081 -61887 -79698 -39974 67671 120978 159550 178371 203011 170387 -10295 -29092
16199b9092m260n712L8585L0996O1796m5106j9305j02838m452R6244O8558L2333
$$ -29092 -33352 -39064 -479 30517 92313 47207 27902 -74936 -79388 16856 85414 117747
16187A17747m905p9839k7163J8095O4304N8422N5773J6841r7314q6943J796P2957
$$ 117747 112842 33003 5840 23935 88239 146661 202434 219275 121961 35018 36814 109771
16175A09771L4490l5961r4576l9435Q8896Q2138k7933m2814k4292o3285J0949
$$ 109771 144261 108300 13724 -25711 63185 145323 117390 74576 50284 -13001 -2052
16164b052N4889M3361l8642m7556J5456K5323n8390L8548Q6663K0530J035k3191
$$ -2052 52837 96198 57556 10000 25456 50779 -7611 30937 117600 138130 139165 115974
16152A15974j9039O720q5083m1849L872M6428p1774l1722l1827J0638L7635J40122
$$ 115974 96935 103655 18572 -23277 -19405 27023 -44751 -76473 -108300 -97662 -60027 80095
16140H0095l3611p4465j4918M1765M7933l1798l5966m1186N5190K0886M536L084
$$ 80095 46484 -27981 -42899 -1134 46799 15001 -20965 -62151 -6961 13925 18461 21545
16128B1545O5713L5388k2947J1173k6130n6613o4257K7403N9882o5626j0093P7797
$$ 21545 87258 122646 99699 110872 84742 28129 -36128 -8725 51157 -14469 -24562 53235
16116E3235R053k9895q7087l5843M4761K8805P3723J02238P5867m4131O463k7980
$$ 53235 62288 32393 -54694 -90537 -45776 -16971 56752 158990 234857 190726 197189 169209
16104A69209J0641k1190n7380j8424m6067j16265L1195J9944Q1228J41413k3314
$$ 169209 179850 158660 101280 82856 36789 -79476 -48281 -28337 52891 194304 170990
16093A70990m5349o9918L949L8822r1330k8522m2180J4126o237R7877N8640p406
$$ 170990 125641 55723 59672 98494 7164 -21358 -63538 -49412 -55649 42228 100868 93462
16081I3462j1525o8237j8705k6313l9524k3474M1409M3409J02708l9610M4471
$$ 93462 81937 13700 -5005 -31318 -70842 -94316 -52907 -9498 93210 53600 98071
16070I8071k0598k9446l9572L3132M2911o357q4427O2399O7785k54M6745l8587
$$ 98071 77473 48027 8455 41587 84498 78141 -6286 56113 123898 123644 170389 131802
16058A31802q9326o4968m196n7351L3670J06477p351m8048l5389r1097m1773k0813
$$ 131802 42476 -22492 -26688 -84039 -50369 56108 48757 709 -34680 -125777 -167550 -188363
16046a88363N5253J05760J46908Q6310L7030l58P486k5782o0447q9718n9104o1605
$$ -188363 -133110 -27350 119558 205868 242898 242540 250026 224244 163797 74079 14975 -46630
16034d6630K0543Q8463Q3493M4046j1938k3036k4258l5416K1675N2126q8855j02555
$$ -46630 -26087 62376 145869 189915 177977 154941 130683 95267 116942 169068 80213 -22342
16022b2342M19R1276Q7435o5674j12827j68430N6874J14619R6711m0198j31247
$$ -22342 -21923 69353 156788 91114 -21713 -190143 -133269 -18650 78061 37863 -93384
16011i3384j7382P2067P2706j5611L8372J21359N0390n9356l4779k3235n0490
$$ -93384 -110766 -38699 34007 18396 56768 178127 228517 169161 134382 111147 60657
16000F0657P573K7661l2800o737k9917P336r765l7312p6204K5374k3815k1178
$$ 60657 68230 95891 63091 56354 26437 33773 24008 -13304 -89508 -64134 -87949 -109127
15988a09127N9043J9595k9609O100o6361l0381P834Q1820O1545Q3064l8559n6878
$$ -109127 -50084 -30489 -60098 -53998 -120359 -150740 -142906 -61086 459 83523 44964 -11914
15976a1914o2768l1496N1924P1001M272l251j20992p7566Q063q8356J5711R1244
$$ -11914 -74682 -106178 -54254 16747 21019 17768 -103224 -180790 -172727 -261083 -245372 -154128
15964a54128K2658M6505M8396K4165N3534m7451N0940r225j6544Q475M1201K9862
$$ -154128 -131470 -84965 -36569 -12404 41130 -6321 44619 35394 18850 27325 68526 98388
15952I8388q2485K8455J2659Q644n9995p5333o078K7645K6562N2472R6419J03348
$$ 98388 15903 44358 57017 65661 5666 -69667 -75745 -48100 -21538 30934 127353 230701
15940B30701o2797j12169j03560J8229L7540O1797M3083p8096j8969M7323n9543
$$ 230701 167904 55735 -47825 -29596 7944 69741 112824 34728 15759 63082 3539
15929C539o0736m432l4008J6137k0485p579j1329k161M1992l3188m6910J9988
$$ 3539 -57197 -61629 -95637 -79500 -99985 -107564 -118893 -121054 -79062 -112250 -159160 -139172
15917a39172K2839R6314L6261q5458l1969N4298L2580L5882J2430j1023p5470
$$ -139172 -116333 -20019 16242 -69216 -101185 -46887 -14307 21575 34005 22982 -52488
15906e2488M7880M443q56L6042O4572m7660m3743o8385J4447J7800p4328m9884
$$ -52488 -4608 -165 -1021 35021 99593 51933 8190 -60195 -45748 -27948 -102276 -152160
15894a52160k7634O1022J07801M6029L906m5386k9246j1186r3913o6736K6415
$$ -152160 -179794 -118772 -10971 35058 38964 -6422 -35668 -46854 -140767 -207503 -181088
15883a81088N0602M6903O8307K7671J6217J2423N6048M1259m7043l2265l6149
$$ -181088 -130486 -83583 -15276 12395 28612 41035 97083 138342 91299 59034 22885
15872B2885L8102N2231j5561l740L8115l5809n1801k0548R3619N0316r4116o3788
$$ 22885 60987 113218 97657 93917 132032 96223 44422 23874 117493 167809 73693 9905
15860I905l1278p299j3085N1872l2383J1319M7479j7397m9853r045q306k5512
$$ 9905 -21373 -28672 -41757 10115 -22268 -10949 36530 19133 -30720 -39765 -48071 -73583
15848g3583J1052j0139l0417k7248L7021p4991k8095R0328P2987K4837r953l3106
$$ -73583 -62531 -72670 -103087 -130335 -93314 -168305 -196400 -106072 -33085 -8248 -18201 -51307
15836e1307K6060J925K5467M1374O8232n4599l7434K2122j0836J9381J228l7020
$$ -51307 -25247 -23322 2145 43519 111751 57152 19718 41840 31004 50385 51613 14593
15824A4593k9575J3298M8190k0374n2375L3159M2356p7734p4555m4637N4947O4116
$$ 14593 -14982 -1684 46506 26132 -26243 6916 49272 -28462 -103017 -147654 -92707 -28591
15812b8591R1988J4624K1592j2454j22542o2818R1871k8888M4481M2949j09323
$$ -28591 63397 78021 99613 87159 -35383 -98201 -6330 -35218 9263 52212 -57111
15801e7111J17854J39988p2538n4218n0770j7407N6249m8764k5356j8725K6580
$$ -57111 60743 200731 128193 73975 23205 5798 62047 13283 -12073 -30798 -4218
15790d218N0600j3682m0876J6434Q5740m4661n3111n503M6945L5311j4638m8899
$$ -4218 46382 32700 -8176 8258 93998 49337 -3774 -9277 37668 72979 58341 9442
15778I442m3029J9876M8605K7997j01258o3645N1521L4227m0189J2892L2835O820
$$ 9442 -33587 -13711 34894 62891 -38367 -102012 -50491 -16264 -56453 -43561 -10726 -3906
15766c906m3264j7831j8337j953L6956k2422k150J7326N4076N7767K77j1310p0634
$$ -3906 -47170 -65001 -83338 -85291 -48335 -70757 -72907 -55581 -1505 56262 56539 45229 -25405
15753b5405k7425Q8836J10539J6569l1117j49860j06863q166K7756j7341L0835
$$ -25405 -52830 36006 146545 163114 131997 -17863 -124726 -132892 -105136 -122477 -91642
15742i1642K9735j4293M2338N0379J6021k1576k6840j5823O9542j1539N3122r3613
$$ -91642 -61907 -76200 -33862 16517 32538 10962 -15878 -31701 37841 26302 79424 -14189
15730a4189r2855N5707P5491k9645o7406J0220k3704P1451N4636J5849n3495k911
$$ -14189 -107044 -51337 24154 -5491 -72897 -62677 -86381 -14930 39706 55555 2060 -851
15718h51k525L7912m9113n3448Q3141j3885O2560K630o8101m9014j3511J8502
$$ -851 -3376 34536 -14577 -68025 15116 1231 63791 66421 -1680 -50694 -64205 -45703
15706d5703o2354k9467O8052L2319O1132k701k7947l42o9118J5903L1575P1357
$$ -45703 -108057 -137524 -69472 -37153 23979 21278 -6669 -7011 -76129 -60226 -28651 42706
15694D2706J07393J3198l9733k5463J3084m7327N0637n5558m6319o6580k1392
$$ 42706 150099 163297 123564 98101 111185 63858 114495 58937 12618 -53962 -75354
15683g5354Q548q384L1594J9588O5598M41K5644L3202m1137r7744J16054L5813
$$ -75354 -66806 -75190 -43596 -24008 41590 42031 67675 100877 59740 -38004 78050 113863
15671A13863k3220q7297j02865j5819K3026O8789R4053n8553l7919N2288j4092
$$ 113863 90643 3346 -99519 -115338 -92312 -23523 70530 11977 -25942 26346 12254
15660A2254o5235Q6408l5722j05110K6265O1899k811Q5070l3932n6806p5358k8230
$$ 12254 -52981 33427 -2295 -107405 -81140 -19241 -22052 63018 29086 -27720 -103078 -131308
15648a31308P7216J34268P3693j801o8907m9811q3634K8619K3169k4134l3790
$$ -131308 -54092 80176 153869 152068 83161 33350 -50284 -21665 1504 -22630 -56420
15637e6420J5444J11119j6443p6252j9469N8549P5334K8804k322l6367q5855l8484
$$ -56420 -40976 70143 53700 -22552 -42021 16528 91862 120666 118344 81977 -3878 -42362
15625d2362J7441o0494O0491Q3487N9140p4298l9420M7329k9679m1846K1964j236
$$ -42362 -24921 -85415 -24924 58563 117703 43405 3985 51314 21635 -20211 1753 517
15613E17j1587M9375j5021j2114j0584q2685N7940M1042o134q111N3129L6243
$$ 517 -11070 38305 23284 11170 586 -82099 -24159 16883 10749 2638 55767 92010
15601I2010L9718M5552m2815l3308P658o361j8735m4032l3586J3361R691M317
$$ 92010 131728 177280 134465 101157 108815 102454 83719 39687 6101 19462 29153 33470
15589C3470l2378K3649Q7180P7070p2749k1583P99n2102p4507O150J06569m7136
$$ 33470 1092 24741 111921 188991 116242 94659 95458 43356 -31151 -25001 81568 34432
15577C4432p975l8944o4135O017o7420n0632O8929J09602L6763J7291J5599j3303
$$ 34432 26457 -12487 -76622 -70605 -138025 -188657 -119728 -10126 26637 43928 59527 46224
15565D6224o984k3944k5928P389M4744M086L6348O4009J2557p441M2845m6824
$$ 46224 39240 15296 -10632 -3243 41501 45587 81935 145944 158501 151060 193905 147081
15553A47081j04479J777p622o9829L2319p903k2702O2809l3346l731J1730j2571
$$ 147081 42602 44379 36757 -33072 -753 -8656 -31358 31451 -1895 -5626 6104 -6467
15541f467j4674M2846K3271L61o952K7304o7153n0770J8286k0744K0444k769j8775
$$ -6467 -21141 21705 44976 45337 38385 65689 -1464 -52234 -33948 -54692 -34248 -37017 -55792
15528e5792M7529O8924O2023P2813J740r6741o3501l5617J00976J3161o1384j6498
$$ -55792 -8263 60661 122684 195497 197237 100496 36995 1378 102354 115515 54131 37633
15516C7633K0572K1543j65k652q4659K496k4403J5071q12J5713M2926K1332J610
$$ 37633 58205 79748 79583 76931 -7728 -5232 -29635 -14564 -15376 337 43263 64595 66205
15503F6205p6319j0275k9839l8509M5447K7467k0402P4398M4973m9991l6850N2175
$$ 66205 -10114 -20389 -50228 -88737 -43290 -15823 -36225 38173 83146 33155 -3695 48480
15491D8480n1717j48050n4157j4913J26351Q9815M1006l9956o843J8945K2662
$$ 48480 -3237 -151287 -205444 -220357 -94006 -4191 36815 -3141 -9984 8961 31623
15480C1623l8000k514L134k0799k0321K8933j9364j7098L7076K7614m6218k1888
$$ 31623 -6377 -8891 -5757 -26556 -46877 -17944 -37308 -54406 -17330 10284 -35934 -57822
15468e7822K6163j7063K0322m979L8091L0059l1125m5377k9539K7162r2817n688
$$ -57822 -31659 -48722 -28400 -33379 4712 34771 3646 -41731 -71270 -44108 -136925 -142613
15456a42613N8116N6668P4822M2387m3609p6542n0896l910M3326O3921q36l0587
$$ -142613 -84497 -27829 46993 89380 45771 -30771 -81667 -85577 -42251 21670 20834 -9753
15444i753o1726K0498j1601m2784k8542Q525M6801J40202K2607m9227l0357j8415
$$ -9753 -71479 -50981 -62582 -105366 -133908 -125383 -78582 61620 84227 35000 4643 -13772
15432a3772l0595p879O4678K7104r7705m6107N819L8736O5290M749L2717k1433
$$ -13772 -44367 -52246 12432 39536 -58169 -104276 -98457 -59721 5569 10318 43035 21602
15420B1602j6377k1656J5308n5374j1406K2429l740J2749M7259N1766m1055o1675
$$ 21602 5225 -16431 -1123 -56497 -67903 -45474 -49214 -36465 10794 62560 21505 -40170
15408d0170k8297J43822L7076k8385n8339R119k0784j35016K617l0462L5257P6892
$$ -40170 -68467 75355 112431 84046 25707 34826 14042 -120974 -118357 -148819 -113562 -36670
15396c6670N7281L1762K3897J5040j17495l8098J0952J8573p7227J8983N4786
$$ -36670 20611 52373 76270 91310 -26185 -64283 -53331 -34758 -111985 -93002 -38216
15385c8216j7279J0680K1408O9560m9703l0826J6536J00099Q0835k7914n8917
$$ -38216 -55495 -44815 -23407 46153 -3550 -34376 -17840 82259 163094 135180 76263
15374G6263j7439Q5960L8833m5314j6157r1109p0818n9460Q7720k2088m2506j879
$$ 76263 58824 144784 183617 138303 122146 31037 -39781 -99241 -11521 -33609 -76115 -77994
15362g7994K6854K5461Q0569M4284K4992J2355q068K3467N1315r0567n2797o098
$$ -77994 -51140 -25679 54890 99174 124166 136521 128453 151920 203235 112668 59871 53773
15350E3773j2108P763M5096k2535j5915n8027l2877n151J2537J9762J932R339
$$ 53773 41665 49428 94524 71989 56074 -1953 -34830 -39981 -27444 -7682 -5750 3589
15338C589L2691l0337p4780m3263k6200K3532N0989j2195j251j03006L0631J9406
$$ 3589 36280 5943 -68837 -112100 -138300 -114768 -63779 -75974 -77225 -180231 -149600 -130194
15326a30194J0201j977n101M7332Q4506L1127o405k6467o8215N4516M8741j61344
$$ -130194 -119993 -121970 -127071 -79739 4767 35894 29489 3022 -65193 -10677 38064 -123280
15314a23280o5334J34001q346P521L3028o8216K583P651o501j6405N0837M1386
$$ -123280 -188614 -54613 -62959 -55438 -22410 -90626 -88043 -80392 -86893 -103298 -52461 -11075
15302a1075j5988j2355j2931P5087L8958k7358l9404m3957Q8563L1828o257n1156
$$ -11075 -27063 -39418 -52349 22738 61696 34338 -5066 -49023 39540 71368 65111 13955
15290A3955N775P2196q8044J0858L1225K270J2224n4363l4406p1148M2847R9263
$$ 13955 19730 91926 3882 14740 45965 48235 60459 6096 -28310 -99458 -56611 42652
15278D2652m0122p0215P4740R0716l0532m1100m8782J5481O5712k1273K2257j216
$$ 42652 2530 -67685 7055 97771 67239 26139 -22643 -7162 58550 37277 59534 58318
15266E8318k1154n8300j3873O1458O6899J4517M870j38288o2855j0641p6524m7129
$$ 58318 37164 -21136 -35009 26449 93348 107865 112735 -25553 -88408 -99049 -175573 -222702
15254b22702N4062L6619Q4743J25077N6490n8360Q090J00418J6280K6436q1346
$$ -222702 -168640 -132021 -47278 77799 134289 75929 84019 184437 200717 227153 145807
15243A45807r8612O8611m982r2395o1737k5429L3076O3327Q4923k6886k6091R974
$$ 145807 47195 115806 110824 18429 -43308 -68737 -35661 27666 112589 85703 59612 69586
15231F9586L863q4581m0008R2131Q2217j5103r5626l5822k5658K9294M675o9506
$$ 69586 73449 -11132 -51140 40991 123208 108105 12479 -23343 -49001 -19707 -15032 -84538
15219h4538k6746O1608J49427j432k5714m0278j0216l5090O2435m9807p5316k5830
$$ -84538 -111284 -49676 99751 98319 72605 32327 22111 -12979 49456 -351 -75667 -101497
15207a01497K2976Q4573K9348n2694m0970k4033R3222P2420L4078L3994n026p6980
$$ -101497 -78521 6052 35400 -17294 -58264 -82297 10925 83345 117423 151417 146391 69411
15195F9411p8485K6423j8852K4807n593l6046j4145J70161J01852m4474o5462
$$ 69411 -9074 17349 -1503 23304 17711 -18335 -32480 137681 239533 195059 129597
15184A29597j18918n029r7254k1709R3914k075J6881R250l0739m5918r405J7778
$$ 129597 10679 5650 -91604 -113313 -19399 -21474 -4593 4657 -26082 -72000 -81405 -63627
15172f3627K1621Q7657p7021j11417O0751J9936K8694n69K3328K075K52N8480
$$ -63627 -42006 45651 -31370 -142787 -82036 -62100 -33406 -33975 -10647 -8572 -8320 50160
15160E0160M4201p0423n3511J5904Q6627K2940o8244n2804k0105n8165r6998j0142
$$ 50160 94361 23938 -29573 -13669 72958 95898 27654 -25150 -45255 -103420 -200418 -210560
15148b10560M9674J12831J4623R1056P5740q6396n2999o500j0172J6123O9666
$$ -210560 -160886 -48055 -33432 57624 133364 46968 -6031 -12531 -22703 -6580 63086
15137F3086q33K955n6182k7160p1435J6841m722Q7571O1905P574j8668n3320n989
$$ 63086 62253 65208 9026 -18134 -89569 -72728 -77450 10121 72026 79600 60932 7612 1623
15124A623P328J1473o217L1524M9287N5o1054r2414Q747L3421l2495k0883p098
$$ 1623 8951 20424 14207 45731 95018 95073 34019 -58395 -49648 -16227 -48722 -69605 -76703
15111g6703n3490p37M4123Q4112Q858m6300Q952j2946N039L3393n2313J596K606
$$ -76703 -130193 -130930 -86807 -2695 6163 -40137 -31185 -44131 -39092 -5699 -58012 -56416 -53810
15098e3810p6536L2790K9326l2099K3993L0123j1659M5010J17568o1112j16713
$$ -53810 -130346 -97556 -68230 -100329 -76336 -46213 -57872 -12862 104706 43594 -73119
15087g3119m1485p3421l929P0308R2079M3292q2183L2858M4628l683p573k1058
$$ -73119 -114604 -188025 -191954 -121646 -29567 13725 -68458 -35600 9028 5345 -2228 -23286
15075b3286j8507o0081J6421R6516J0624Q266O1016L913k8902m8665M6791L4469
$$ -23286 -41793 -101874 -85453 11063 21687 29953 90969 94882 65980 17315 64106 98575
15063I8575j4727q1163o3326O1807M0749K2565K9285O726r927j08581m90P7313
$$ 98575 83848 2685 -60641 1166 41915 64480 93765 100491 90564 -18017 -18507 58806
15051E8806n987p2258m9082J02451L7495l88R43N4527L5312l9443j01045m0433
$$ 58806 52819 -19439 -68521 33930 71425 71037 71980 126507 161819 122376 21331 -19102
15039a9102l1841j327K4987L650J3352l466o07L9551N6137n2109k7724n3804J9963
$$ -19102 -50943 -52270 -27283 -23633 -10281 -13747 -14354 25197 81334 29225 1501 -52303 -32340
15026c2340O9437N080o9463k6435P2602P0650K1847O2466M8048k5975o8664o7340
$$ -32340 37097 42177 -27286 -53721 18881 89531 111378 173844 221892 195917 127253 59913
15014E9913N04K6761l3278p1371n1544P5627J32650q2691k9164m0359m3440O8172
$$ 59913 60417 87178 53900 -17471 -69015 6612 139262 56571 27407 -12952 -56392 11780
15002A1780M5757N3707J0899j8304l1623n6405Q41j9105N9700L5279j11453q583
$$ 11780 57537 111244 122143 103839 72216 15811 16652 -2453 57247 92526 -18927 -27510
14990b7510K7990K173Q4990M7331k7718j1339k3637r882J4186J7386o0609m3148
$$ -27510 480 2653 87643 134974 107256 95917 72280 62398 76584 93970 33361 -9787
14978i787p4943k1664Q3275P2548l549o8195r4423M9155L9613J2636m966k1483
$$ -9787 -84730 -106394 -23119 49429 45880 -22315 -116738 -67583 -27970 -15334 -20300 -41783
14966d1783l9313l1433q244l8012K5914O1173O9522K7465L4377m1245j4604J6016
$$ -41783 -81096 -112529 -120773 -158785 -132871 -71698 -2176 25289 59666 18421 3817 19833
14954A9833L92M350n4408q8777k2066j8135P896K9967m6605L7799M9542o3043
$$ 19833 20225 24575 -29833 -118610 -140676 -158811 -150915 -120948 -167553 -129754 -80212 -143255
14942a43255O1426J37718L0673q3591p128k6906j6746Q9064N8703m9370L6617
$$ -143255 -81829 55889 86562 2971 -4157 -31063 -47809 41255 99958 50588 87205
14931H7205L0865j5094k8095n8218K2204P325n8213l974J4956k9186m7623l0389
$$ 87205 118070 102976 74881 16663 38867 46192 -12021 -15995 -1039 -30225 -77848 -108237
14919a08237N0148Q6129q3215Q2141l1218p2583m0186O4403m4430o8284M6143
$$ -108237 -58089 28040 -55175 26966 -4252 -76835 -117021 -52618 -97048 -165332 -119189
14908a19189M1608J7484M9467K1195n3690k5997L7782M8532o1575J2838J6217
$$ -119189 -77581 -60097 -10630 10565 -43125 -69122 -31340 17192 -44383 -31545 -15328
14897a5328K0997J40707M8992q3015j2300J4209n3760L6319M3033K6762m4840
$$ -15328 5669 146376 195368 112353 100053 114262 60502 96821 139854 166616 121776
14886A21776l7398J595k9339P3734R4359n0710q6667k3129k3428l7784K2921n1411
$$ 121776 84378 85973 56634 130368 224727 174017 87350 64221 40793 3009 25930 -25481
14874b5481O8392p006l9220O095J7066L1173o5068p1678O0108o89k6135J2457
$$ -25481 42911 35905 -3315 2780 19846 51019 -14049 -85727 -25619 -26308 -52443 -39986
14862c9986O2056P7678o2328n4875n1240J6177J6431L1072P1217J3209j9725j1313
$$ -39986 22070 99748 37420 -17455 -68695 -52518 -36087 -5015 66202 79411 59686 48373
14850D8373k4815n7923j9134N2410j7767M622r7730J8482k1928N2184N4210l1820
$$ 48373 23558 -34365 -53499 -1089 -18856 -14234 -111964 -93482 -115410 -63226 -9016 -40836
14838d0836M2943K9328L9559m9227o6045L783n322n1937p3520R6995J06740q064
$$ -40836 2107 31435 70994 21767 -44278 -40495 -45817 -97754 -171274 -74279 32461 24397
14826B4397j8072R0475M5745j05289o8277o4859j4868J2435M6859M4294J4363
$$ 24397 6325 96800 142545 37256 -31021 -95880 -110748 -98313 -51454 -7160 7203
14815G203j0093R1297L0517k9285n4890o4273M3973K8006j6965m8248n3338L9780
$$ 7203 -2890 88407 118924 89639 34749 -29524 14449 42455 25490 -22758 -76096 -36316
14803c6316L4899p4803j9821J2348Q1549j1819K0479O8040L1132o0731j5554k8356
$$ -36316 -1417 -76220 -96041 -83693 -2144 -13963 6516 74556 105688 44957 29403 1047
14791A047k157p28n205K9571m6837k8625j1787N7669Q5902P0040j1291j0596K2841
$$ 1047 -1110 -1838 -7043 22528 -24309 -52934 -64721 -7052 78850 148890 137599 127003 149844
14778A49844L5262k1473j2481j5130n0142r2815l1231O4277j3747o7955k0942
$$ 149844 185106 163633 151152 136022 85880 -6935 -38166 26111 12364 -55591 -76533
14767g6533J39429J00260m0068m7046L0351k5886L806n7454l1232J4763n7937
$$ -76533 62896 163156 123088 76042 106393 80507 84313 26859 -4373 10390 -47547
14756d7547L6501M3699Q7604j6011M9314k011Q660L4347q0890p5827j4148J8036
$$ -47547 -11046 32653 120257 104246 153560 151549 160209 194556 113666 37839 23691 41727
14744D1727n2164j00102N1449O5546M4283k5741l1477J6972O32j02941K6832K9432
$$ 41727 -10437 -110539 -59090 6456 50739 24998 -6479 10493 11125 -91816 -64984 -35552
14732c5552j0818J9100n2015M7271N7028O1954K9605n8186P457P522j8957J5608
$$ -35552 -46370 -27270 -79285 -32014 25014 86968 116573 58387 65844 73366 54409 70017
14720G0017q7087J3791R6585l9144M9692k8784n6449j1926K0100o6061r070p4022
$$ 70017 -17070 -3279 93306 54162 103854 75070 18621 6695 26795 -39266 -48336 -122358
14708a22358q6755N7417J7505n3711Q3660L1968M8764R1348R832n1820q4717j4669
$$ -122358 -209113 -151696 -134191 -187902 -104242 -72274 -23510 67838 77670 25850 -58867 -73536
14696g3536N1820J56818K3994o7675k5757j36807j5388R8295O4904j2828j5077
$$ -73536 -21716 135102 159096 91421 65664 -71143 -86531 11764 76668 63840 48763
14685D8763J3786N0669k6176n7520j26615m7687L3239k0215J40771O6249m9963
$$ 48763 62549 113218 87042 29522 -97093 -144780 -111541 -131756 9015 75264 25301
14674B5301J9996p7701p8820Q7634P7829O562j6462N4395L4263j39192r6781l7226
$$ 25301 45297 -32404 -111224 -23590 54239 60801 44339 98734 132997 -6195 -102976 -140202
14662a40202L8092K3578J2404K1449m8079O8853M720j0875N9052m1396l0242L9460
$$ -140202 -102110 -78532 -66128 -44679 -92758 -23905 -19185 -30060 28992 -12404 -42646 -3186
14650c186J4744l9837l9449k0888k42P3188J06070L8224p3667j39081N8716N0483
$$ -3186 11558 -28279 -67728 -88616 -88858 -15670 90400 128624 54957 -84124 -25408 25075
14638B5075O7671J20449j3998j27236K8784j0827k3478M5747n1683N6944n6254
$$ 25075 92746 213195 199197 71961 100745 89918 66440 112187 60504 117448 61194
14627F1194m3067m8650m3589N8255l3312n5294J2602n1279J7632J6772P7638J5250
$$ 61194 18127 -30523 -74112 -15857 -49169 -104463 -91861 -143140 -125508 -108736 -31098 -15848
14615a5848N8342N1712K1484P313k8831L9380L2956j3337j8558m2088l1879l6355
$$ -15848 42494 94206 115690 123003 94172 133552 166508 153171 134613 92525 60646 24291
14603B4291K2616n1542J263k7916K3375P1909q3082K0827M2250M679m9351m5890
$$ 24291 46907 -4635 -3372 -31288 -7913 63996 -19086 1741 43991 48670 -681 -46571
14591d6571K1580j3773k5474M3428K9232Q1612K2496q2160j8697l10K5998J7674
$$ -46571 -24991 -38764 -64238 -20810 8422 90034 112530 30370 11673 11363 37361 55035
14579E5035r446K361j4315j7971L641J1039M4936n585n6336M2235M0881j8918
$$ 55035 45589 47950 33635 15664 19305 30344 75280 69695 13359 55594 96475 77557
14567G7557j7775L9549n2518j2237l602r2143l6400J6646J0409j0940O0926n0777
$$ 77557 59782 99331 46813 34576 30974 -61169 -97569 -80923 -70514 -81454 -20528 -71305
14555g1305r6870J38710J10570P3365j08009l7012k3301m3323m9169P2898M2446
$$ -71305 -168175 -29465 81105 154470 46461 9449 -13852 -57175 -106344 -33446 9000
14544I000K7293k0270R6052Q1220k0494r4555o972K3500m6875L389l535O7102
$$ 9000 36293 16023 112075 193295 172801 78246 71274 94774 47899 51288 47753 114855
14532A14855K7436m7597j7983j2704k3880J3191o419n1162m2938K6715O923J201
$$ 114855 142291 94694 76711 64007 40127 53318 46899 -4263 -47201 -20486 -13563 -12362
14520a2362p4677M610q460j9568N0992J01156M2528n6139j7220p2701l1916K8480
$$ -12362 -87039 -82429 -90889 -110457 -59465 41691 84219 28080 10860 -61841 -93757 -65277
14508f5277l3047L2889N5259M9624M6723n4751q137k6543o1009M1266L1006j8806
$$ -65277 -98324 -65435 -10176 39448 86171 31420 23283 -3260 -64269 -23003 8003 -10803
14496a0803p270L3433K8782k8448n3028J2899O1512m2111L0314K6433M3267j509
$$ -10803 -18073 15360 44142 15694 -37334 -24435 37077 -5034 25280 51713 94980 93471
14484I3471O41r3359j01119j7371N3901J9495L3392l825m6439J1903l6194r7656
$$ 93471 94112 753 -100366 -117737 -63836 -44341 -10949 -14774 -61213 -49310 -85504 -183160
14472a83160P131J89016m1982p7407j2841L920P7752P9517P6047K628j1729j0266
$$ -183160 -176029 12987 -28995 -106402 -119243 -115323 -37571 41946 117993 120621 108892 98626
14460I8626r7306N3819M5621j14614m3005j9715K1165J5347n248m0052l6887M982
$$ 98626 1320 55139 100760 -13854 -56859 -76574 -55409 -40062 -45310 -85362 -122249 -117267
14448a17267L8080l41o130o835K930P1778J64437r371j00860o0930j18965O9882
$$ -117267 -79187 -79528 -85658 -92493 -89563 -17785 146652 137281 36421 -24509 -143474 -73592
14436g3592j7516p1655K4443J27738O716p298k2933J4428L5514L789M6432k4659
$$ -73592 -91108 -162763 -138320 -10582 -3866 -11164 -34097 -19669 15845 19634 66066 41407
14424D1407M0837N8522l6803j7477l3422q2200J4752N8718R7801J5803j00298
$$ 41407 82244 140766 103963 86486 53064 -29136 -14384 44334 142135 157938 57640
14413E7640r8265j9116P9647m0318J6913L2751o0026J7090Q8228K184p523K7716
$$ 57640 -40625 -59741 19906 -20412 -3499 29252 -30774 -13684 74544 76728 69205 96921
14401I6921j7475p0459k436K869K466p7615l4393M1005m002J2228N9036K5639
$$ 96921 79446 8987 6551 9420 11886 -65729 -100122 -59117 -63119 -50891 8145 33784
14389C3784J9089K695R935k0106N867l1143K5511Q5032o752n7594m7014m7202
$$ 33784 52873 55568 65503 45397 51264 20121 45632 130664 123912 66318 19304 -27898
14377b7898K1701L4125N8314N7881r4144o3432O3324n3886l7123k3095l056P512
$$ -27898 -6197 27928 86242 144123 49979 -13453 49871 -4015 -41138 -64233 -67289 -59777
14365e9777M4949M7454p352J4275K5736q6476j03059n3291L8360k3236J0245N5361
$$ -59777 -14828 32626 25274 39549 65285 -21191 -124250 -177541 -139181 -162417 -152172 -96811
14353i6811O3654O1983J0079q01R33j2067l6459j3002K4339n433J5232K7943K3131
$$ -96811 -33157 28826 38905 38104 39037 26970 -9489 -22491 1848 -3585 11647 39590 62721
14340F2721n554q2968L8510p415m9471j3083J643J09337K1700q0681k7195Q5319
$$ 62721 57167 -25801 12709 5294 -44177 -57260 -55617 53720 75420 -5261 -32456 52863
14328E2863l1811l2095p666K4892J07625O8120j3747k8987p5432o1881o5885n7972
$$ 52863 21052 -11043 -18709 6183 113808 181928 168181 139194 63762 1881 -64004 -121976
14316a21976J18972R4284n3087j1057l0200L3832m633p9266j1191m47J5918J3163
$$ -121976 -3004 91280 38193 27136 -3064 30768 26135 -53131 -64322 -64769 -48851 -35688
14304c5688Q7825j2531K3469l1455K5745L058r2031M1407j0391m5437k4019M2726
$$ -35688 52137 39606 63075 31620 57365 60423 -31608 9799 -592 -46029 -70048 -27322
14292b7322n3616n346L0890m9836K7811M7491k0216k8494m6085k6133j2323n956
$$ -27322 -80938 -86284 -55394 -105230 -77419 -29928 -50144 -78638 -124723 -150856 -163179 -169135
14280a69135K4085j15R6722J71463n316p0447j04027n4750m9511j8927j3574J01935
$$ -169135 -145050 -145165 -48443 123020 117704 47257 -56770 -111520 -161031 -179958 -193532 -91597
14268i1597M7626Q6675r9170K7069N682m9150M1024J46266K2801r8483l1514M9216
$$ -91597 -43971 42704 -56466 -29397 -23715 -72865 -31841 114425 137226 38743 7229 56445
14256E6445Q6802L3400j01963m6087n3131O097M4407M7910J4868k8020o3480m811
$$ 56445 143247 176647 74684 28597 -24534 -18437 25970 73880 88748 60728 -2752 -7563
14244g563N9524K5711n9566l6265K6618L1550q3560l3703P2745l6274p9246P5634
$$ -7563 51961 77672 18106 -18159 8459 40009 -43551 -77254 -4509 -40783 -120029 -44395
14232d4395N7331m899M9917r9432j03501L3727Q2089O8083k0383q799k0281j8232
$$ -44395 12936 8037 57954 -41478 -144979 -111252 -29163 38920 18537 9738 -10543 -28775
14220b8775p3003Q609O1412L8288j6223K7781q4982m6880J16961P8985q0415n6442
$$ -28775 -101778 -93169 -31757 6531 -9692 18089 -66893 -113773 3188 82173 1758 -54684
14208e4684o2412J31374K6175n9819j9958o7316l4937O6991J7915l1319K0980
$$ -54684 -117096 14278 40453 -19366 -39324 -106640 -141577 -74586 -56671 -87990 -67010
14197f7010O1459P7389P8096L1499p3830n3121P615L8813K8825m3289p1617l3224
$$ -67010 -5551 71838 149934 181433 107603 54482 62097 100910 129735 86446 14829 -18395
14185a8395J5308N6168j9470q7241j1572K7183R3383k0812J7005l9484p1098K3976
$$ -18395 -3087 53081 33611 -53630 -65202 -38019 55364 34552 51557 12073 -59025 -35049
14173c5049j8788K9033P842O0429N5997K1798n6144q8542k0865O3462O9380O0697
$$ -35049 -53837 -24804 -16962 43467 99464 121262 65118 -23424 -44289 19173 88553 149250
14161A49250R744p7891O3m5362K46O2578K9454l495m725k9326o9466k8983j4383
$$ 149250 158994 81103 81166 35804 36050 98628 128082 124587 119862 90536 21070 -7913 -22296
14148b2296k2844N3293n0046j3767K8766n3468L9349N0427P1764o5437l4364J3719
$$ -22296 -45140 8153 -41893 -55660 -26894 -80362 -41013 9414 81178 15741 -18623 -4904
14136d904N5037K8608P5833l1392M2989J6778o3607q7895l6172p4124m6991J53261
$$ -4904 50133 78741 154574 123182 166171 182949 119342 31447 -4725 -78849 -125840 27421
14124B7421P2039R414q5362j15749m1195N5303k3775L8404K5693O0432k2092P5926
$$ 27421 99460 108874 23512 -92237 -133432 -78129 -101904 -63500 -37807 22625 533 76459
14112G6459K2178K7564m8428M0143j6205j3617O7303J6420j6881n5544j7453m8854
$$ 76459 98637 126201 77773 117916 101711 88094 155397 171817 154936 99392 81939 33085
14100C3085J4121j3090N6781Q9076k6281m1576o0815N040J21979L9543j17393
$$ 33085 47206 34116 90897 179973 153692 112116 51301 56341 178320 217863 100470
14089A00470q8570o3201l250P4060N2117l802n7748r3250l4567J21281J32132
$$ 100470 11900 -51301 -54551 19509 71626 67824 10076 -83174 -117741 3540 135672
14078A35672l457j25718k0920N5313Q1587r4006j07364j3625L3347k6385j4659
$$ 135672 132215 6497 -14423 40890 122477 28471 -78893 -92518 -59171 -85556 -100215
14067a00215j8800J8225P2798O4212O6792k7765j51183o151L5948L1217R6254
$$ -100215 -119015 -100790 -27992 36220 103012 75247 -75936 -82087 -46139 -14922 81332
14056H1332L1177j0352l9377n3062p0249j05486O2696Q571L1201L5761K1980J2075
$$ 81332 112509 102157 62780 9718 -60531 -166017 -103321 -94750 -63549 -27788 -5808 6267
14044F267M958l2693j7694J7406L7676k0705q0733M965M1178j0215j8992N777
$$ 6267 11225 -21468 -39162 -21756 15920 -4785 -85518 -80553 -39375 -49590 -68582 -62805
14032f2805l0937q2476O1133M1287P5922k8989p051J2930N3844l711k4795n0026
$$ -62805 -93742 -176218 -115085 -73798 2124 -26865 -33916 -20986 32858 29147 4352 -45674
14020d5674M1183J14115j4211j50918R70k8458L2670P1530m6158m0907j7641Q187
$$ -45674 -4491 109624 95413 -55505 -54535 -82993 -50323 21207 -24951 -65858 -83499 -75312
14008g5312m6356Q0521R3680M8220l8699m109L0140k3293j02993m8071J8899N9920
$$ -75312 -121668 -41147 52533 100753 62054 57945 88085 64792 -38201 -86272 -67373 -7453
13996g453L9097l5378r830K8853P110J1139L9118n0043n5565L8057L7336l0199
$$ -7453 31644 -3734 -13564 15289 22399 33538 72656 22613 -32952 5105 42441 12242
13984A2242l8451j4833m3888J10854m527j4843J907l3246J4708N3613N1675n4719
$$ 12242 -26209 -41042 -84930 25924 21397 6554 8461 -24785 -10077 43536 95211 40492
13972D0492l7754l1031j03629j9001K6471R9851N0798N2212j6K5284n2418q8383
$$ 40492 2738 -28293 -131922 -150923 -124452 -24601 26197 78409 78393 103677 51259 -37124
13960c7124q0023j2136P8275J37646L6245J1035q8682j12100N172J00662l6295
$$ -37124 -117147 -129283 -51008 86638 122883 133918 45236 -66864 -61692 38970 2675
13949B675q91n4958o9822N4837L7259o3335j09680Q0969J14434J4241J4530M0563
$$ 2675 1784 -53174 -122996 -68159 -30900 -94235 -203915 -122946 -8512 5729 20259 60822
13937F0822n755r8447r755P9136M6540P15j5459J3148K927L7485J6827O1321m666
$$ 60822 55067 -43380 -53135 26001 72541 73256 57797 70945 73872 111357 128184 189505 184839
13924A84839r8450p6907J0320J268L7321M948M4953J5311p9224m1529k8203q5078
$$ 184839 86389 9482 19802 21070 58391 63339 108292 123603 44379 2850 -25353 -110431
13912a10431m493M1254R2428O4023J5349j5219n383m5682q420J10594K8098J0348
$$ -110431 -114924 -73670 18758 82781 98130 82911 77528 31846 23426 134020 162118 172466
13900A72466J644m8804p8321n4481j0771R3871J9912o5335Q4282K4306m9781o7123
$$ 172466 174110 125306 46985 -7496 -18267 75604 95516 30181 114463 138769 88988 21865
13888B1865l0513l5281J4937O9160K962r924J3501R174l5232j7905J659J4117
$$ 21865 -8648 -43929 -28992 40168 43130 33206 46707 55881 20649 2744 4403 18520
13876A8520J2307n9614l4186K6444k4941j584M1554M9334j3220n4654p1376j0307
$$ 18520 30827 -28787 -62973 -36529 -61470 -63054 -21500 27834 14614 -40040 -111416 -121723
13864a21723N4204O3515O5496K4840L0389q0746k8905k8796J01321O864o3578
$$ -121723 -67519 -4004 61492 86332 116721 35975 7070 -21726 79595 86459 22881
13853B2881m6109k1165J11513J8689r3364J0104k2883l6930m5418m8363O6573
$$ 22881 -23228 -44393 67120 85809 -7555 2549 -20334 -57264 -102682 -151045 -84472
13842h4472p485m2851J2688J9086N6042l9575R951P5202j03196k0115K792M3088
$$ -84472 -91957 -134808 -122120 -103034 -46992 -86567 -76616 -1414 -104610 -124725 -121933 -78845
13830g8845K9624O2859L0264J02231O4982j9432k4557j17845m4177P3150n3875
$$ -78845 -49221 13638 43902 146133 211115 191683 167126 49281 5104 78254 24379
13819B4379k5838P7311L132j3765J695n296K5617K9939k9364m5919l0207K5498
$$ 24379 -1459 75852 78984 65219 66914 61618 87235 117174 87810 41891 11684 37182
13807C7182l2044r1929M7214M2274q3727k6258J0454p3637J10523P4154N1684
$$ 37182 5138 -86791 -39577 2697 -81030 -107288 -96834 -170471 -59948 14206 65890
13796F5890K7584j9108k3035L2502m3698o2005P2335m584j3635o515J9296L2933
$$ 65890 93474 74366 51331 83833 40135 -21870 50465 45881 32246 25731 45027 77960
13784G7960J24165k1749j7172n3577p4483j9633R7411o40l3619P096R492L5778
$$ 77960 202125 180376 163204 109627 35144 15511 112922 112282 78663 85759 95251 131029
13772A31029n0254j19602m4638J8048P5765J12285K0J5654l6019q1688l7590m5424
$$ 131029 80775 -38827 -83465 -65417 10348 122633 122653 138307 102288 20600 -16990 -62414
13760f2414M7573M9916Q6556O9637o63k3083m2205M6523q8474j59806k1237Q1162
$$ -62414 -14841 35075 121631 191268 190605 167522 125317 171840 83366 -76440 -97677 -16515
13748a6515L5202M1233m0642K3342R2012l558K796m673n3571j2994o2207m9340
$$ -16515 18687 59920 19278 42620 134632 131074 133870 129197 75626 62632 425 -48915
13736d8915L1113P503n653j1330o1367M1003K1303o5488k5935N5004k1793K262
$$ -48915 -17802 -10299 -15952 -27282 -88649 -47646 -26343 -91831 -117766 -62762 -84555 -82293
13724h2293P3483K1417P392K2832o7298m5824K161j0742J8440p7280j8562l0534
$$ -82293 -8810 12607 19999 42831 -24467 -70291 -68130 -78872 -60432 -137712 -156274 -186808
13712a86808O9315K1914O1728m858p8479L0056K1051J09054R024o3825P033L7924
$$ -186808 -117493 -95579 -33851 -38709 -117188 -87132 -66081 42973 51997 -11828 -4795 33129
13700C3129o9013j4224j1689n8290Q878O8536M5643M1353p0888r7417l2895k551
$$ 33129 -35884 -50108 -61797 -120087 -111209 -42673 2970 44323 -26565 -123982 -156877 -159428
13688a59428n214O6358P2986l2680p5824j9839P8016P0438L212K4706m7121r429
$$ -159428 -164642 -98284 -25298 -57978 -133802 -153641 -75625 -5187 -1975 22731 -24390 -33819
13676c3819O1852L4722o3835m9328L7063O7036n6357m7604l715q653N6277K8442
$$ -33819 28033 62755 -1080 -50408 -13345 53691 -2666 -50270 -53985 -62638 -6361 22081
13664B2081j0411L6417J3265q7402L816L8764q557N2165N3747R062q8277q591
$$ 22081 11670 48087 61352 -26050 -22234 16530 7973 60138 113885 122947 34670 26079
13652B6079M1754p7920q243j9008l1151R3599J7016k6217o3442r5465k1449R7353
$$ 26079 67833 -10087 -18330 -37338 -68489 25110 42126 15909 -47533 -142998 -164447 -67094
13640f7094Q3172n7882K0496j8788J6300k0370O5957R6356J03227L0777j52643
$$ -67094 16078 -41804 -21308 -40096 -23796 -44166 21791 118147 221374 252151 99508
13629I9508n8837M6850j1897J3728K4664n4446m9913k8246n4206k3470P9453l0783
$$ 99508 40671 87521 75624 89352 114016 59570 9657 -18589 -72795 -96265 -16812 -47595
13617d7595M8350K8683L3217J27960J4178j08926o0861n5799R5387N8497O2366
$$ -47595 755 29438 62655 190615 204793 95867 35006 -20793 74594 133091 195457
13606A95457m0442j26878j14334n2413O9439L4788N8980R3431l3948j0747M498
$$ 195457 155015 28137 -86197 -138610 -69171 -34383 24597 118028 84080 73333 77831
13595G7831n9534k2211N1081P852k269K3903p1916K9935j6284K7578J9928k449
$$ 77831 18297 -3914 47167 55019 52750 76653 4737 34672 18388 45966 65894 63445
13583F3445l6290Q1546O5709J5409o609j16920r6128m3699m632J19685J243m9128
$$ 63445 27155 108701 174410 189819 183210 66290 -29838 -73537 -78169 41516 42759 -6369
13571f369K6702L7277J60J8378J8016J4940J8122L262r5900m7114L0572P197K1148
$$ -6369 20333 57610 57770 76148 94164 109104 127226 130488 34588 -12526 18046 25243 46391
13558D6391j2743n0153J8150O272l1658n260L5491p059N3373k8608j7758l6716
$$ 46391 33648 -16505 1645 7917 -23741 -29001 6490 -569 52804 24196 6438 -30278
13546c0278Q7482j0684k2186k390L4999K8146l2264r1224j6583m6054q44O9474
$$ -30278 57204 46520 24334 21944 56943 85089 52825 -38399 -54982 -101036 -101880 -32406
13534c2406K8288k1053p0520m5074K884O3780L1327J6226M9961j495m3148r302
$$ -32406 -4118 -25171 -95691 -140765 -137881 -74101 -42774 -26548 23413 21918 -21230 -30532
13522c0532l9577q972J7788J5597K0376k5313K3862l8107K4643L8237k656m2781
$$ -30532 -70109 -79081 -61293 -45696 -25320 -50633 -26771 -64878 -40235 -1998 -4654 -47435
13510d7435k8886J8066R276N0777K9886p311j175j5627N8141M1234k0655k3446
$$ -47435 -76321 -58255 -48979 1798 31684 24373 23198 7571 65712 106946 86291 62845
13498F2845K7850L7856m1942j6901q458p763l0210m144l1285j4393n0369O016
$$ 62845 90695 128551 86609 69708 61250 53487 23277 19133 -12152 -26545 -76914 -70898
13486g0898J1395Q4370k6713k3166j00193L5971O4423K0233j19284J1338L6501
$$ -70898 -59503 24867 -1846 -25012 -125205 -89234 -24811 -4578 -123862 -112524 -76023
13475g6023K6734J9362o0118m1765Q7220M1077k2532l8431n8964q862L2023P7880
$$ -76023 -49289 -29927 -90045 -131810 -44590 -3513 -26045 -64476 -123440 -132302 -100279 -22399
13463b2399O1223M7350k9137k9204l4323n6336O2294K0899L8200r284q6490L5386
$$ -22399 38824 86174 57037 27833 -6490 -62826 -532 20367 58567 49283 -37207 -1821
13451a821l4554q5561P2207R6650R7391j36686k3771O091K849L4414M7549j4603
$$ -1821 -36375 -121936 -49729 46921 144312 7626 -16145 -10054 -7205 27209 74758 60155
13439F0155J827j4444m8224J5434M247P3833K7459l1179q0823J9371P0523j1486
$$ 60155 61982 47538 -686 14748 18995 92828 120287 89108 8285 27656 98179 86693
13427H6693K4680R6633j1529q3897p4387k3293K7251n868k09j5423k8276k0629
$$ 86693 111373 208006 196477 112580 38193 14900 42151 36283 36074 20651 -7625 -28254
13415b8254M2365J622M1721R1389k4799j35402L9949P0699K6448O201O228o1343
$$ -28254 14111 15733 57454 148843 124044 -11358 28591 99290 125738 131939 138167 76824
13403G6824n8386j6527o5552j8442K5368R4392M5453n3081r849N817m3410q9315
$$ 76824 18438 1911 -63641 -82083 -56715 37677 83130 30049 20200 26017 -17393 -106708
13391a06708m8247j499J466R7179P5114O1995k8914l5781M6140o564m7775l845
$$ -106708 -154955 -156454 -154988 -57809 17305 79300 50386 14605 60745 54181 6406 2561
13379B561J2421j099j7936j6523K9814L7712l9467p5947j9417r699K3972Q7953
$$ 2561 14982 13883 -4053 -20576 9238 46950 7483 -68464 -87881 -97580 -73608 14345
13367A4345K6791j35215n4975k3913J14517Q3266N2451r745r1327k6927N0249
$$ 14345 41136 -94079 -149054 -172967 -58450 24816 77267 67522 -23805 -50732 -483
13356d83J8809N4235K9775p2649p8698l9659j9807J5930J3939M8054P5309O5800
$$ -483 18326 72561 102336 29687 -49011 -88670 -108477 -92547 -78608 -30554 44755 110555
13344A10555m163p4043l1002M4410j3031N260O6160q9313q4736P9802K3500N6657
$$ 110555 106392 32349 1347 45757 32726 37986 104146 14833 -69903 9899 33399 90056
13332I0056l4369L3090M4139l02l2163m3901r8669m327j6929J5851O0612J7797
$$ 90056 55687 88777 132916 132614 100451 56550 -42119 -46446 -63375 -47524 13088 30885
13320C0885j0422l1287M204j2585j602R841O420J1760j2765O8497L387o8101l9700
$$ 30885 20463 -10824 -6620 -19205 -20807 -10966 -4546 7214 -5551 62946 66333 -1768 -41468
13307d1468L4851K6868l9508M0466j0716n3576k562K6848Q0409r405k2961o9232
$$ -41468 -6617 20251 -19257 21209 10493 -43083 -45645 -18797 61612 52207 29246 -39986
13295c9986q9187N3011O9762n933l3812J3112L5062K9010j7453O1592K8419l0477
$$ -39986 -129173 -76162 -6400 -12333 -46145 -33033 2029 31039 13586 75178 103597 73120
13283G3120j22258o9830J24069N3041L5691R990N1833M254r3907O0160O935m3285
$$ 73120 -49138 -118968 5101 58142 93833 103823 155656 159910 66003 126163 133098 89813
13271H9813k720q1981l0270k835L7775R9256O1008k0150J3697L3588M8033p0060
$$ 89813 87093 5112 -25158 -27993 9782 109038 170046 149896 163593 197181 245214 175154
13259A75154j17237o2111q4829l726K9622J20290Q0137n4091n9916k4054l2058
$$ 175154 57917 -4194 -89023 -92749 -63127 57163 137300 83209 23293 -761 -32819
13248c2819l8980o6351J193P4309O6803J8465p495m3628m6286j6440M5858p8572
$$ -32819 -71799 -138150 -136957 -62648 4155 22620 15125 -28503 -74789 -91229 -45371 -123943
13236a23943L1690R2448L541M4144K7248o2338m8819n6101L7690j1403J1988M7585
$$ -123943 -92253 195 3736 47880 75128 12790 -36029 -92130 -54440 -65843 -53855 -6270
13224f270p330n0660j9718L0281R2927P7581N5816l2291o3971k9555r1496O6141
$$ -6270 -13600 -64260 -83978 -53697 39230 116811 172627 140336 76365 46810 -44686 21455
13212B1455l6464p0503k4320M1896k9271J0955J7141Q8275L0042J2427l0933j37137
$$ 21455 -15009 -85512 -109832 -67936 -97207 -86252 -69111 19164 49206 61633 30700 -106437
13200a06437q8317Q1407Q8471N1258j9633M981J5290q6567m6068K4267O1317M6358
$$ -106437 -194754 -113347 -24876 26382 6749 11730 27020 -59547 -105615 -81348 -20031 26327
$$ [...]
##END NTUPLES=NMR SPECTRUM
##END=
