##TITLE=Analysis number 321336
Compound Code btb 14320
Project Code adrs
Chemist Name alfa chemicals
##JCAMPDX= 6.0         $$ Bruker NMR JCAMP-DX V2.0
##DATA TYPE= NMR SPECTRUM
##DATA CLASS= NTUPLES
##ORIGIN= Bruker BioSpin GmbH
##OWNER= nmr
$$ XWIN-NMR		Version 3.5
$$ Fri Aug  4 10:00:01 2006 GMT Daylight Time (UT+1h)  MAYBRIDGE\nmr@NMR_250MHZ
##.OBSERVE FREQUENCY= 250.131544655141
##.OBSERVE NUCLEUS= ^1H
##.ACQUISITION MODE= SIMULTANEOUS (DQD)
##.ACQUISITION SCHEME= undefined
##.AVERAGES= 16
##.DIGITISER RES= 18
##SPECTROMETER/DATA SYSTEM= dpx250
##.PULSE SEQUENCE= zg30
##.SOLVENT NAME= DMSO
##.SHIFT REFERENCE= (INTERNAL, DMSO, 0, 16.522)
##AUDIT TRAIL= $$ (NUMBER, WHEN, WHO, WHERE, WHAT)
$$ ##TITLE= Audit trail, XWIN-NMR		Version 3.5
$$ ##JCAMPDX= 5.01
$$ ##ORIGIN= Bruker BioSpin GmbH
$$ ##OWNER= nmr
$$ C:\u/data/dgb/nmr/ADRS/290/pdata/1/auditp.txt
$$ ##AUDIT TRAIL=  $$ (NUMBER, WHEN, WHO, WHERE, WHAT)
(   1,<2006-08-04 09:59:38.88 +100>,<MAYBRIDGE\nmr>,<NMR_250MHZ>,
      <created by zg, POWCHK disabled, PULCHK disabled
       configuration hash MD5:
       E2 DF 36 D8 04 B2 41 60 5A D7 A3 38 5A 4B D0 FE
       data hash MD5: 64K
       98 3E 7E 43 20 AB 83 C4 84 3F E3 DC 92 F5 22 9D>)
(   2,<2006-08-04 09:59:51.44 +100>,<MAYBRIDGE\nmr>,<NMR_250MHZ>,
      <Start of raw data processing
       ef LB = 0.3 FT_mod = 6 PKNL = 1 SI = 32K 
       data hash MD5: 32K
       30 6B 81 C4 22 14 71 1E D0 53 02 77 B5 0E 64 DE>)
(   3,<2006-08-04 09:59:53.85 +100>,<MAYBRIDGE\nmr>,<NMR_250MHZ>,
      <apk 
       data hash MD5: 32K
       01 9A 8A 5A 60 AA 33 6F 8A 19 8D 60 8A 78 F2 8E>)
(   4,<2006-08-04 09:59:54.77 +100>,<MAYBRIDGE\nmr>,<NMR_250MHZ>,
      <abs ABSG = 5 
       data hash MD5: 32K
       EB A4 FB 3A FA 94 BA E5 D7 E1 BD 48 88 9B 3A D6>)
$$ ##END=
$$ 
$$ hash MD5
$$ 3C 90 FB 50 C9 CB 17 6B 83 A6 8B 7F F2 16 98 19
##$RELAX= 
##$RELAX= 
##$RELAX= 
##$RELAX= 
##$RELAX= 
##$RELAX= 
##$RELAX= 
$$ Bruker specific parameters
$$ --------------------------
##$DU= <C:\u>
##$EXPNO= 290
##$NAME= <ADRS>
##$PROCNO= 1
##$TYPE= <nmr>
##$USER= <dgb>
##$AMP= (0..31)
100 100 100 100 100 100 100 100 100 100 100 100 100 100 100 100 100 100 
100 100 100 100 100 100 100 100 100 100 100 100 100 100 
##$AQSEQ= 0
##$AQ_mod= 3
##$AUNM= <au_zg>
##$AUTOPOS= <7 >
##$BF1= 250.13
##$BF2= 250.13
##$BF3= 250.13
##$BF4= 250.13
##$BF5= 500.13
##$BF6= 500.13
##$BF7= 500.13
##$BF8= 500.13
##$BYTORDA= 1
##$CFDGTYP= 0
##$CFRGTYP= 5
##$CHEMSTR= <none>
##$CNST= (0..31)
1 1 145 1 1 1 1 1 1 1 1 1 1 1 1 1 1 1 1 1 1 1 1 1 1 1 1 1 1 1 1 1 
##$CPDPRG= <>
##$CPDPRG1= <>
##$CPDPRG2= <>
##$CPDPRG3= <>
##$CPDPRG4= <mlev>
##$CPDPRG5= <mlev>
##$CPDPRG6= <mlev>
##$CPDPRG7= <mlev>
##$CPDPRG8= <mlev>
##$CPDPRGB= <>
##$CPDPRGT= <>
##$D= (0..31)
0 1 0 0 0 0 0 0 0 0.06 0 0 0 0 0 0 0.0002 0 0 0 0 0 0 0 0 0 0 0 0 0 0 
0 
##$DATE= 1154681977
##$DBL= (0..7)
120 120 120 120 120 120 120 120 
##$DBP= (0..7)
150 150 150 150 150 150 150 150 
##$DBP07= 0
##$DBPNAM0= <>
##$DBPNAM1= <>
##$DBPNAM2= <>
$$ [...]
##$SUBNAM7= <"">
##$SUBNAM8= <"">
##$SUBNAM9= <"">
##$SW= 20.6930455092707
##$SWIBOX= (0..15)
0 0 3 0 0 0 0 0 0 0 0 0 0 0 0 0 
##$SW_h= 5175.983436853
##$TD= 65536
##$TD0= 1
##$TE= 295.16
##$TE2= 300
##$TE3= 300
##$TEG= 300
##$TL= (0..7)
0 120 120 120 120 120 120 120 
##$TP= (0..7)
150 150 150 150 150 150 150 150 
##$TP07= 0
##$TPNAME0= <>
##$TPNAME1= <>
##$TPNAME2= <>
##$TPNAME3= <>
##$TPNAME4= <>
##$TPNAME5= <>
##$TPNAME6= <>
##$TPNAME7= <>
##$TPOAL= (0..7)
0.5 0.5 0.5 0.5 0.5 0.5 0.5 0.5 
##$TPOFFS= (0..7)
0 0 0 0 0 0 0 0 
##$TUNHIN= 0
##$TUNHOUT= 0
##$TUNXOUT= 0
##$USERA1= <user>
##$USERA2= <user>
##$USERA3= <user>
##$USERA4= <user>
##$USERA5= <user>
##$V9= 5
##$VALIST= <valist>
##$VCLIST= <CCCCCCCCCCCCCCC>
##$VD= 0
##$VDLIST= <DDDDDDDDDDDDDDD>
##$VPLIST= <PPPPPPPPPPPPPPP>
##$VTLIST= <TTTTTTTTTTTTTTT>
##$WBST= 1024
##$WBSW= 4
##$XGAIN= (0..3)
0 0 0 0 
##$XL= 0
##$YL= 0
##$YMAX_a= 477763
##$YMIN_a= -424189
##$ZGOPTNS= <>
##$ZL1= 120
##$ZL2= 120
##$ZL3= 120
##$ZL4= 120
##$ABSF1= 16.522
##$ABSF2= -4.171173
##$ABSG= 5
##$ABSL= 3
##$ALPHA= 0
##$AQORDER= 0
##$ASSFAC= 0
##$ASSFACI= 0
##$ASSFACX= 0
##$ASSWID= 0
##$AUNMP= <proc_1d>
##$AZFE= 0.1
##$AZFW= 0.1
##$BCFW= 0
##$BC_mod= 0
##$BYTORDP= 0
##$COROFFS= 0
##$CY= 12.5
##$DATMOD= 1
##$DC= 0
##$DFILT= <>
##$DTYPP= 0
##$F1P= 14.0000005364418
##$F2P= -0.99999901652339
##$FCOR= 0.5
##$FTSIZE= 32768
##$FT_mod= 6
##$GAMMA= 0
##$GB= 0
##$INTBC= 1
##$INTSCL= 1
##$ISEN= 128
##$LB= 0.3
##$LEV0= 0
##$LPBIN= 0
##$MAXI= 10000
##$MC2= 0
##$MEAN= 0
##$ME_mod= 0
##$MI= 0
##$NCOEF= 0
##$NC_proc= -6
##$NLEV= 6
##$NOISF1= 0
##$NOISF2= 0
##$NSP= 0
##$NTH_PI= 0
##$NZP= 0
##$OFFSET= 16.522
##$PC= 1
##$PHC0= 168.6762
##$PHC1= -39.5325
##$PH_mod= 1
##$PKNL= yes
##$PPARMOD= 0
##$PSCAL= 4
##$PSIGN= 0
##$REVERSE= no
##$SF= 250.13
##$SI= 32768
##$SIGF1= 0
##$SIGF2= 0
##$SINO= 400
##$SIOLD= 32768
##$SREGLST= <1H.DMSO>
##$SSB= 0
##$STSI= 32768
##$STSR= 0
##$SW_p= 5175.98343685301
##$SYMM= 0
##$S_DEV= 0
##$TDeff= 65536
##$TDoff= 0
##$TI= <Analysis number 999999
Compound Code 99
Book Reference 9
Project Code 9>
##$TILT= no
##$TM1= 0
##$TM2= 0
##$TOPLEV= 0
##$USERP1= <user>
##$USERP2= <user>
##$USERP3= <user>
##$USERP4= <user>
##$USERP5= <user>
##$WDW= 1
##$XDIM= 32768
##$YMAX_p= 562319486
##$YMIN_p= -1126756
$$ End of Bruker specific parameters
$$ ---------------------------------
##NTUPLES= NMR SPECTRUM
##VAR_NAME=  FREQUENCY,     SPECTRUM/REAL,   SPECTRUM/IMAG
##SYMBOL=    X,             R,               I
##VAR_TYPE=  INDEPENDENT,   DEPENDENT,       DEPENDENT
##VAR_FORM=  AFFN,          ASDF,            ASDF
##VAR_DIM=   32768,         32768,           32768
##UNITS=     HZ,            ARBITRARY UNITS, ARBITRARY UNITS
##FACTOR=    0.157963299565203, 1,           1
##FIRST=     4132.6476996994, 0,             0
##LAST=      -1043.33573715361, 0,           0
##MIN=       -1043.33573715361, -1126756,    0
##MAX=       4132.6476996994, 562319486,     0
$$ Real data points
##PAGE= N=1
##DATA TABLE= (X++(R..R)), XYDATA
$$ [...]
15600b27393k4796Q5199J85287L9659j04944r2555n2244m06934K56414L18204
15590b4103j13769m3363J75236K226k34151j84343o917j00226K10449N585q6699
15579d00075O8580j95514P8532j21194p4677K3205J07073J90053K05595J19204
15569G82j21453m9133j4024j7667l0671P942j80415j47709j61214L2059R9225
15558e82278P5048K30172k3757L93987J00579k00466o5815m9385p9020L2395P3719
15547i4821k45241M9660K62171k0018k25746P9990q5170m290p827j09329l7087
15536d37708N4712k7035r9302J2589K28902J7109M3908j66788J5744J22987k6249
15525b61131Q519k1364j0682j65762n211K28247M5053N2056n7541k92115p6182
$$ y = [-227393, -252189, -166990, 18297, 57956, -46988, -139543, -191787, -598721, -342307, -24103, -137872, -181235, -5999, -3773, -237924, -422267, -429184, -529410, -318961, -313376, -400075, -331495, -527009, -448477, -569671, -644348, -621143, -514070, -324017, -118422, 782, -120671, -169804, -183828, -201495, -232166, -224224, -404639, -552348, -713562, -681503, -582278, -507230, -277058, -300815, 93172, 193751, -6715, -72530, -121915, -200935, -168540, -94821, -340062, -290402, -28231, -48249, -273995, -194005, -279175, -283465, -291292, -400621, -437708, -382996, -410031, -509333, -496744, -267842, -250733, -206825, -373613, -357869, -234882, -261131, -252612, -273976, -284658, -450420, -455631, -227384, -182331, -130275, -187816, -479931, -556113]
15514e56113J65771J09300R6078M0964p8626n9494q8546O2593K07822J39635j64203
15503a24819k17820j29200K47541M0816j7274j5216j0695m0998J19551Q2848J31170
15492F5904J4708m105J09908K24111o1029k23957j24340k08285k10579j34399
15482e52063J17562J8716J63500K21473Q5188k2616R2519j25221j73828j00004
15472b74774L1345J16972m5198l92090k1700J32757Q4680K26718K58923k50152
15462a32519m4677j15139j05424M3767m6336J92717j8134j5593q7798j5858N4064
15451b90930K51423K51461P3565j50355j21431J98943l5758k64520o4860K73038
15441A20576J41294o1411J07652j5398j4913j00532R9702J32097n6305n53203
$$ y = [-556113, -390342, -281042, -184964, -144000, -222626, -282120, -370666, -308073, -100251, 39384, -124819, -342639, -471839, -224298, -183482, -200756, -215972, -226667, -267665, -148114, -65266, 65904, 80612, 76507, 186415, 410526, 349497, 125540, 1200, -207085, -417664, -552063, -434501, -415785, -252285, -30812, 54376, 31760, 124279, -942, -174770, -274774, -243429, -126457, -171655, -563745, -585445, -452688, -368008, -141290, 117633, -132519, -177196, -292335, -397759, -353992, -400328, -207611, -225745, -241338, -329136, -344994, -290930, -39507, 211954, 285519, 135164, 13733, 212676, 176918, -87602, -152462, 120576, 261870, 200459, 308111, 292713, 277800, 177268, 276970, 409067, 352762, -200441]
15431b00441j62235L25290m5080k09908J96143O8157K04873p541m1855N010k02100
15420f9687p8343J34137p1026N7607K78678O0119j51860k48891r6561J02178J12504
15409B8855M625K07111n0365j81281k1940J36979n5561n8415j60539q1284M8610
15398a83205n3699q4314j95140P9518K60956J85629j5469l50500p1043P8918J05167
15387b43182L53957l4868k07224l76043j23986N9588J10487L70659J32690l5074
15377G004K50739L4701k21116O8573j71195o7573k44336J02769J95685j92088
15367b36837l5864l3687j68391K19487K74242J38054j63859j34497J18821K6241
15357C710j02442k1643m3546n4200r7451j58611K4272Q2450J70022K37928k4040
$$ y = [-200441, -362676, -37386, -82466, -292374, -96231, -28074, 176799, 169258, 127403, 132413, -69687, -148030, -13893, -84919, -27312, 251366, 311485, 159625, -89266, -185827, -83649, 28855, 33480, 240591, 190226, 8945, -12995, 123984, 68423, 10008, -150531, -231815, -183205, -236904, -321218, -516358, -436840, -175884, 9745, -5724, -356224, -427267, -348349, -243182, 110775, 75907, -131317, -507360, -631346, -571758, -461271, -90612, 42078, 7004, 257743, 292444, 71328, 139901, -31294, -98867, -343203, -240434, -44749, -236837, -272701, -306388, -474779, -255292, 18950, 157004, -6855, -141352, -22531, 3710, -98732, -120375, -163921, -218121, -315572, -474183, -449911, -367461, -197439, 40489, 16449]
15346A6449r5556j90649r6104k979J38973N4236K27932M1961o0780j3713j20765
15335a00995p7394j371Q0400n0567j32669J6078M0578j14072q8812P950o2647
15324d83521o4161r4992L1861J52504J40520N5082m0643j0973L4526l8061L28123
15313A0265K7737k14188k31283J59694N0945L4531j11092k170n2404J28406q53
15302b00412j42906M583N7660k8366J30825L2829q3238N5925J68674R0995j76284
15291h9715k35738p6398L3371J20845j50764O4510J70652l8082j98273q6320L07062
15280a78850Q3747j65934k69264l1715J24001J91243o8016J83561M3402J76364
15270H8539j8162k27932k53435q5564K07732J23359r8455J16579J21374J46539
$$ y = [16449, -79107, -269756, -365860, -368839, -229866, -175630, 52302, 94263, 33483, 19770, -100995, -178389, -179760, -99360, -149927, -282596, -266518, -225940, -340012, -428824, -420874, -483521, -547682, -642674, -610813, -458309, -317789, -262707, -303350, -314323, -279797, -317858, 10265, 38002, -176186, -407469, -247775, -196830, -162299, -273391, -275561, -327965, -199559, -200412, -343318, -338735, -281075, -309441, -178616, -145787, -229025, -173100, -4426, 86569, -89715, -325453, -401851, -368480, -247635, -398399, -333889, -163237, -201319, -399592, -485912, -178850, -95103, -261037, -530301, -562016, -438015, -246772, -314788, -131227, -87825, 88539, 70377, -157555, -410990, -496554, -288822, -165463, -263918, -147339, -25965, 120574]
15260A20574L5310j13386k3107p7916q7448q3655K2739o06j27957J13263L42343
15249A20154M3905k6279l84476k03671n6856O7946P3008J5603n7032J31273j6808
15238b93233K5081R7814o8420o0702j35209j57044K16671l8336J01862j5356k27622
15227e54494K08071J19438p9814M7929j97457J92193j31334j94171K06341J21106
15217b62192K29362j16304J17439J31385K2565r2922k20504j27299j27440j4006
15207d59916K79634J72969N1055K47449j03969r3825k3726j24179p4291r0695
15197b19494l7631L942J52634q1920N4133K01222P4850j94034m22275k79569R6098
15186f52044M9543R2423J26293K1537p9630J7091L27787Q1268j89479k87258j38477
$$ y = [120574, 155884, 42498, 19391, -58525, -145973, -229628, -206889, -207495, -335452, -222189, 120154, 164059, 137780, -246696, -450367, -507223, -439277, -366269, -350666, -407698, -276425, -293233, -268152, -170338, -238758, -299460, -434669, -591713, -375042, -413378, -311516, -326872, -554494, -346423, -226985, -306799, -258870, -456327, -264134, -395468, -589639, -383298, -262192, -32830, -149134, -31695, 99690, 122255, 29333, -191171, -318470, -445910, -459916, -180282, -7313, 43742, 291191, 187222, 93397, 69671, -54508, -128799, -219494, -257125, -253183, -100549, -182469, -128336, 72886, 147736, -46298, -468573, -748142, -652044, -602501, -510078, -383785, -362248, -441878, -424787, -97000, -15732, -205211, -492469, -630946]
15175f30946L846J47638n8894J66749J16479k19305m4567J9247l0944J82417j03792
15164d52072l14973M1492J71489L45766R2911l8512N9700J65842p2095r8852K55447
15153A56143J61915l7959m20218k85054m0718J36933L08826N6634k21362l47307
15143e32167J07093K39092J63171j74994j67865J92273K958K35078K23760j48806
15133A39593n2969l42472j71875O2977J09700L9614m1317l01204j24932K0779
15123f62106R3126K3608J27400o3381J92474K89113J01316l16407l51199O1967
15113e04089L56850J10423R9057J12193O2833j48698p2495j99699k22356K10631
15103a95350R6387k16748j92522j76432L08247K04941q912J24546j28880j79131
$$ y = [-630946, -627100, -479462, -538356, -371607, -255128, -474433, -519000, -499753, -530697, -348280, -452072, -767045, -725553, -554064, -208298, -115387, -153899, -94199, 71643, -452, -99304, 156143, 318058, 280099, -140119, -425173, -465891, -328958, -20132, 36502, -184860, -532167, -425074, -185982, -22811, -197805, -365670, -173397, -170439, 64639, 288399, 139593, 86624, -255848, -427723, -364746, -255046, -215432, -256749, -557953, -682885, -662106, -568980, -545372, -417972, -481353, -288879, 234, 101550, -214857, -566056, -504089, -147239, -36816, 62241, 174434, 237267, 88569, 16074, -183625, -405981, -195350, -98963, -315711, -508233, -684665, -376418, -171477, -180389, -55843, -184723, -363854]
15093c63854j5005M6724o761q7872M2566J20885J25164K47443j68179j31412k2758
15082b13059j26155K03139J18332R0900J7872l06712m0347J92994l39978k04242
15072f07256K48079K05438P3787P9477J07398m46950j1815J10943J41463J96496
15062I7060J09411k11177j30013k48409o6153m7618O9609k7145K624J5486J82487
15051b53838l2889J54757J43092k65490k16925K1939O085J70601L05570L11007
15041C43909k63549q5419M8009J78217N16j58619j65801p5538r4964j65651j47666
15030e86556J6758r6740O3706K38815L5887j90985k71609O2986L49835L06580
15020g1323P7454j0335J96643J19858j24717j36194l04128j15431L0517J36060
$$ y = [-363854, -378859, -332135, -338896, -426768, -384202, -263317, -138153, 109290, -58889, -190301, -213059, -339214, -136075, -17743, 73157, 91029, -215683, -256030, -63036, -403014, -607256, -359177, -153739, -79952, -475, 106923, -340027, -351842, -240899, -99436, 97060, 206471, -4706, -134719, -383128, -449281, -496899, -427290, -454435, -451811, -436325, -253838, -286727, -131970, 11122, -254368, -471293, -449354, -443269, -272668, 32902, 343909, 80360, -5059, 42950, 221167, 221683, 63064, -102737, -178275, -273239, -438890, -586556, -569798, -666538, -602832, -364017, -328130, -519115, -790724, -727738, -377903, -71323, 6131, -4204, 192439, 312297, 187580, 51386, -252742, -368173, -337656, -201596]
15010b01596o189J53521j81097j84397J950r083Q7694P4416L17580o605n8507
14999a2313J67295j18865j61875p6361J1336R4695J70832R6136j57789m27249
14989d14158j3778P0986P3424j25127r05L22404J17010j46415O6055j70648m6187
14978b67339O7724n2513J16920K64833J55406k88214j62710J0886K27592O3227
14968A35812j30471k42487j71088j86574J50094j6444K17657K4276m0846j303
14958b61374J15588O1283Q1745n3694k29727J85108L02546K12569l49951j62797
14948i8704K25755k28481p1969n2636J58660M1803K9295q7425j58363m7451J06825
14937a82691J97006K71153j02751k46864J10055o4789j21923K17510k0166J53920
$$ y = [-201596, -207785, -54264, -235361, -419758, -417808, -426891, -339197, -264781, 52799, 46194, -12313, 154982, 36117, -125758, -202119, -190783, -96088, 74744, 170880, 13091, -414158, -427936, -356950, -283526, -408653, -409558, -87154, 29856, -116559, -50504, -221152, -267339, -199615, -252128, -135208, 129625, 285031, -3183, -165893, -155007, 72585, 135812, 5341, -237146, -408234, -594808, -444714, -461158, -243501, -219225, -260071, -261374, -145786, -84503, -2758, -56452, -286179, -101071, 201475, 414044, 64093, -98704, 127051, -101430, -173399, -226035, -67375, -25572, 3723, -83702, -242065, -289516, -182691, 14315, 285468, 182717, -64147, 45908, -18881, -140804, 76706, 56540, 210460]
14927B10460P1966l54254k48827M9596J48782O2747k13812o2497P8812N0453j40268
14916c46842O1297J2100l8659r8073M5611r1249M8364L62171P0248p6893m9064
14905a00989j52268m01813P4547Q304o9328Q5587K4470Q5772k1750q5267R6161
14894d56574m3308J01067K96300j16416L4753Q0107K75199J50167j06689J3441
14884B28047k85923k15163k831L7657J30497K5207p1554J3625n1729l067J49281
14873d5953k5140R2598o4195J16633j31945k5334k8741l7920j35051l2478k46252
14862e63778L5425O5048J52409P6631r6423Q6506K95561J65501j06080j95005
14852h4205l5163j75760J91004J45301j19608l05988j17654J63068p9545j61854
$$ y = [210460, 282426, -71828, -320655, -271059, -122277, -59530, -273342, -335839, -257027, -206574, -346842, -285545, -273445, -312104, -410177, -364566, -455815, -407451, -45280, 24968, -51925, -100989, -253257, -655070, -580523, -572219, -641547, -555960, -531490, -445718, -467468, -552735, -456574, -499882, -398815, -102515, -218931, -184178, -104071, 171128, 321295, 214606, 228047, -57876, -273039, -275870, -238213, -107716, -82509, -154063, -140438, -192167, -195234, -45953, -71093, 21505, -42690, 73943, -58002, -83336, -112077, -149997, -285048, -317526, -563778, -528353, -463305, -310896, -234265, -330688, -244182, 51379, 216880, 110800, -84205, -119368, -295128, -104124, 41177, -78431, -384419, -502073, -339005, -418550, -580404]
14842e80404p190J19104L90975M2514K0222j0658k63890r1554L4458J26938R0422
14831a29063M5939J02200n1019J53402k7681j58360J22301k4887j86092N3236
14821a00024k3792L4178M8965K672j66368k46196n4129K05142o4675K24728K16003
14810G6504k55426k51713q0073J69544K43506j1678j91459M3809L07341J31967
14800A82322j24408j12696j44528O5536J76899m9283j30396j4583o0410Q8771
14790a22776J84784j71501l10469k11759J43190J33330J16391j3990j08038k03433
14780e64271k8541K23575o940j46544j23971J81941q465k08599P0630L38952K40567
14769c1666j29097k97395P6476K11926R1309j44452J9753M2160M5811k75225j38139
$$ y = [-580404, -587594, -468490, -77515, -35001, -14779, -25437, -289327, -380881, -346423, -219485, -129063, -83124, 19076, -31943, 121459, 93778, -64582, 57719, 32832, -153260, -100024, -123816, -89638, -40673, -38001, -204369, -450565, -504694, -299552, -364227, -139499, 76504, -178922, -430635, -510708, -341164, -97658, -109336, -300795, -256986, 50355, 182322, 57914, -54782, -199310, -133774, 43125, -6158, -136554, -151137, -211547, -122776, 62008, -109493, -419962, -631721, -488531, -355201, -238810, -252800, -360838, -564271, -592812, -369237, -376177, -522721, -646692, -464751, -473216, -681815, -611185, -272233, -31666, -160763, -458158, -381682, -169756, -78447, -222899, -203146, -160986, -115175, -390400, -528539]
14758e28539R4977J16179K68272J20004J28642j07600m09112o6390J63340P5848
14748a44379N2739q3084j6716J80116k3884j08815O633J5417n2990L2527Q2227
14737f0209p2083j65705P4686J19555K2094l096j45068o7737J45099J79660j04678
14726g7482Q6682J0061j88439L702P7340N4883o7982j97980k827J19802Q0799
14715a01441J57133R732q222j76009l1728J0075j67518j44182p7459K8670j1592
14704e12541j56613J01556j23090j53175l9158N2903L06865K31828j45125k37453
14694f74003k40882P8781L30928M0467R7162Q4175K68065P4677p6831J3056k08852
14683b13257j19857N7282N8046k6624M8731r1436O2487k8217l9646j02292K23898
$$ y = [-528539, -433562, -317383, -49111, 70893, 199535, 91935, -317177, -383567, -220227, -144379, -91640, -174724, -191440, -11324, -35208, -144023, -137390, -121973, -174963, -142436, -60209, -132292, -297997, -223311, -103756, -81662, -84758, -229826, -297563, -152464, 27196, -77482, 9200, 19261, -169178, -165476, -88136, -33253, -101235, -299215, -302042, -182240, -101441, 55692, 65424, 57202, -118807, -150535, -140460, -307978, -452160, -529619, -500949, -512541, -669154, -567598, -690688, -843863, -883021, -830118, -523253, -291425, -436550, -674003, -914885, -836104, -505176, -464709, -367547, -283372, -15307, 59370, -17461, -4405, -213257, -333114, -275832, -217786, -244410, -195679, -287115, -224628, -252845, -292491, -394783, -170885]
14672a70885O4617K38918l3090j96895k43404k71503o7260K20478R3596o2911
14662d28339j43311J80833J24447n6279j8985M8793P038M5525J46408L49581j81928
14651G3783n27966L43210K3407l49131L03416J2538j65558J0876Q09o9940L1967
14640c12589q9077R3501k5267j22431J3441K30357J24637K1339O5133k85365k7277
14629c13598L474J42151q7779j71M291K80525J57597J53006l8332O2797l38079
14618B5882j99724j52020L8031N6113J6262j51027L9750J12879k5839o0069j28602
14607d28364J5089J34006N4899q5991k3069m4445j05193q391L19578J69100q2162
14596h4943J1875m2533j36155O6490L15713K5732p7843L1718n7351j55225o8086
$$ y = [-170885, -106268, 132650, 99560, -97335, -340739, -612242, -679502, -459024, -365428, -428339, -571650, -390817, -266370, -322649, -341634, -292841, -285803, -240278, -93870, 255711, 73783, -454183, -110973, -87566, -436697, -133281, -120743, -286301, -275425, -274616, -344556, -312589, -401666, -308165, -333432, -455863, -442422, -212065, -87428, -66089, -956, -286321, -313598, -310124, -167973, -255752, -255923, -251632, 28893, 186490, 339496, 301164, 363961, 25882, -173842, -325862, -287831, -231718, -215456, -366483, -326733, -213854, -239693, -299762, -428364, -413275, -279269, -224370, -310361, -333430, -377875, -483068, -491459, -171881, -2781, -84943, -73068, -115601, -251756, -185266, 130447, 156179, 78336, 110054, 52703, -102522, -170608]
14585a70608n2647K04182K8864J65720j7840k06905J04015j31216k15021k7988
14575c19444J92585J72618j41769r5262k0543R2761J35743J15962j47821n2595
14565f7765j82108R9123K01939j49079J1433L1837j62489p7819K23380o2746k17078
14554c51372N367j15250j6876J21497J18368J42679r0972k11521n0525J60131
14544b88474K3398j59766j02627l8283j82289K4681K07855r2101k29837p7131
14534i14574K44089J66202J60421J17333Q835O859J72889r1493j51291o3483q848
14523c53061J84065m2561J62983L7384J33383J54436K6555l4626L0005o4951j46071
14512H7541k23727j15473Q6772j00020l8971L13569O2065n9988J05436j09025
$$ y = [-170608, -223255, -19073, 9791, 175511, 157671, -49234, 54781, -76435, -291456, -319444, -126859, 45759, -96010, -191272, -211815, -119054, 16689, 132651, -15170, -67765, -249873, -150750, 51189, -97890, -86457, -54620, -217109, -294928, -71548, -134294, -351372, -346005, -461255, -478131, -356634, -238266, -95587, -186559, -398080, -448605, -288474, -265076, -424842, -527469, -565752, -748041, -723360, -515505, -607606, -837443, -914574, -670485, -504283, -343862, -226529, -217694, -210835, -37946, -129439, -280730, -344213, -353061, -168996, -211557, -48574, -11190, 122193, 276629, 303184, 268558, 298563, 233612, 87541, -136186, -251659, -164887, -264907, -303878, 9691, 71756, 11768, 117204, 8179]
14502H179j94235J32271J38430l7492k00908o9298k47373j01598N0335J84691
14492c36998k8030j45538k1572K57385K23679j14781p7991Q2604L3750l11881
14482d39373M4718L1655M0068j55329n3533K65484m7652j24648j60513K84412
14472c14711L03441O5097l24900j64928p2729J4798r939Q9485Q3565L7548Q7005
14461b06268L49237L0823k67736P544k46863K1872J36136Q8529m7681r6962J15164
14450a16205n1783Q1338k19579j64361j00941M3095J58513M3568J43144J9011
14440a64200p0074k16501l5594P1396O6280r8562k52339K81719J97405J01698
14430a18772O9531J67604r4444j14671r2365K10394L46143j55594K6029j8796
$$ y = [8179, -186056, -53785, 84645, 47153, -153755, -223053, -470426, -572024, -521689, -336998, -365028, -510566, -532138, -274753, -51074, -165855, -243846, -161242, -127492, -439373, -394655, -363000, -322932, -478261, -531794, -266310, -313962, -438610, -599123, -314711, -11270, 53827, -271073, -436001, -508730, -493932, -503871, -414386, -330821, -293273, -206268, 142969, 173792, -93944, -86400, -333263, -311391, -175255, -86726, -134407, -231369, -116205, -167988, -86650, -306229, -470590, -571531, -528436, -369923, -326355, -183211, -164200, -234274, -450775, -486369, -414973, -348693, -447255, -699594, -417875, -220470, -118772, -49241, 118363, 23919, -90752, -183117, 27277, 373420, 217826, 243855, 225059]
14420B25059k42575J6623K3950j08826k54207P9350N5451j68986p8322j75835
14410f28318k2234R3512L42288K61560k58166k609j57418k73K72778R1187k77491
14399b85184l2232k11652l655J10028J12881K9260J49916r0708k5956J83320J1819
14388e2163k6443L2157j51422J05051k7750j02482P5217l5889J72996q5221l317
14377i9266N8716n556K41959r3151j26177J04133r6996o9062j60641J15338J31177
14366D74j54115k71171K65009J18040N510k07934K4097r443M1502J77074K36492
14355B25535J19564j2672j90480p5874n7703j17465M2430J00600j03549l6919
14345a06533M9056J09959j27448j85860J40994P5613n8093k358k71176j9067L63116
$$ y = [225059, -17516, -893, 23057, -85769, -339976, -260626, -205175, -374161, -452483, -628318, -650552, -557040, -214752, 46808, -211358, -213967, -371385, -371658, -98880, -7693, -285184, -317416, -529068, -532723, -422695, -309814, -280554, -130638, -221346, -247302, -63982, -52163, -78606, -46449, -197871, -92820, -120570, -223052, -147835, -183724, -10728, -95949, -99266, -40550, -46106, 195853, 102702, -23475, 80658, -16338, -85400, -246041, -130703, 474, -153641, -424812, -159803, -41763, -36253, -244187, -220090, -229533, -188031, -10957, 225535, 345099, 332427, 141947, 66073, 8370, -109095, -66665, 33935, -69614, -106533, -57477, 52482, -74966, -260826, -119832, -44219, -102312, -104670, -375846, -394913, -31797]
14334c1797Q0384j1863L8480j88139j88438Q2641J47397K27806k51394m42348
14324e37271J4799N0691J88984L24897j21366r2268r1421R1837K6435Q778l2006
14313a67911J30985K2655J56442L32715k0557k18277k71329m35571p3039K13142
14303c30745J05756N354J3455l6739k91500o8725K776j32120j88632J38579K32759
14292e49782R4685J8263J03138j60349p1390L10013J44911j53825k54628q3747
14282f02711J00377K355o9169L1866L06225J02001J05217K11226j13434k67725
14272a93772r5505N6617J42027L8648k25561o1465o15Q6250K8774k63178n100
14261d92880L4883J91435m9006k8435R6824l4525N6277J44032j37357j48321J96849
$$ y = [-31797, 48587, 36724, 75204, -112935, -301373, -218732, -71335, 156471, -94923, -537271, -522472, -471781, -282797, 42100, -79266, -171534, -262955, -171118, -144683, -135905, -167911, -36926, -14271, 142171, 474886, 454329, 236052, -35277, -470848, -543887, -330745, -224989, -219635, -206180, -242919, -534419, -603144, -600368, -732488, -921120, -782541, -549782, -455097, -436834, -333696, -494045, -565435, -255422, -110511, -264336, -518964, -602711, -502334, -499979, -569148, -537282, -231057, -129056, -23839, 187387, 73953, -193772, -289277, -232660, -90633, -51985, -277546, -339011, -339626, -253376, -224602, -487780, -492880, -457997, -266562, -315568, -344003, -247179, -281704, -225427, -81395, -218752, -367073, -170224]
14250a70224l6671j39863l8911m7119p0306L9422j29382J24007k4246K30682J92896
14239f9715j02298o1558M9345L7872j64107j00201J22421P3439o5387o9311j90843
14228e40343L07179K29147Q8141l3052j08376l5714J69079R2762k5443k23130
14218g9750J39772M5619j91181j60376l13347J48188K93624P9643J01684M6488
14208A10364J2806J1534j77119j37343J06589j18791L5638Q0251j02355n8854
14198b37280l77J38546J14034o3696r6220j0222K9695L4567J35512J57348j10640
14187I1267q5912j60589j13962j09584p3924m7428J15201k789J10789J6902J28503
14176a31526O0257j3866K5556k33543r9252l4508R1731K7621l0508j6300N6691
$$ y = [-170224, -206895, -346758, -385669, -432788, -503094, -463672, -593054, -469047, -493293, -262611, -69715, -172013, -233571, -184226, -146354, -310461, -410662, -288241, -214802, -280189, -349500, -540343, -233164, -4017, 84124, 51072, -57304, -93018, 76061, 168823, 143380, -79750, 60022, 105641, -85540, -245916, -559263, -411075, -117451, -37808, 63876, 110364, 123170, 134704, -42415, -179758, -73169, -191960, -156322, -76071, -178426, -237280, -237657, -99111, 14923, -48773, -144993, -155215, -125520, -90953, 44559, 201907, 91267, 5355, -155234, -269196, -378780, -452704, -500132, -384931, -387720, -276931, -260029, -131526, -71269, -85135, -59579, -293122, -392374, -426882, -335151, -307530, -338038, -354338, -297647]
14165b97647J74950k49513k01347m3060J01748O375J12333j2731K84359K77816
14155A53283N3971O388q8474k70228m5412j3029j6515k04297m8227j60984M9291
14144e84233L19905K38370q4817j27136J50816j65199K5348K5588j4586l20395
14134e36339J1292J87990J07315J6770K40259J46611j68996J69309J85856j56536
14124B03531p48J59713j03673q7266q4294k53600N8690J77982O3025j51140K6825
14113I045J7786p4503r1394m3438r6627P5085J54199J6108K6632m0064J0218M4733
14101G780m4376J30240q1351l05917J08857Q7657J33461j62264j65336L3761O2403
14090a95085k11452M1881M32033K03110k95966j87975J65349j53511r1319j78281
$$ y = [-297647, -122697, -372210, -573557, -616617, -514869, -508494, -396161, -408892, -124533, 153283, 207254, 213642, 125168, -145060, -190472, -203501, -220016, -424313, -472540, -633524, -584233, -264328, -25958, -110775, -237911, -87095, -252294, -226946, -201358, -215944, -536339, -525047, -337057, -229742, -212972, 27287, 173898, 4902, 174211, 360067, 203531, 202783, 362496, 258823, 171557, 87263, -166337, -107647, 70335, 133360, -17780, 9045, 26831, -47672, -139066, -182504, -279131, -204046, -49847, -33739, -7107, -47171, -36953, 7780, -36596, 93644, 12293, -293624, -184767, -97110, 36351, -125913, -291249, -257488, -195085, -406537, -364656, 67377, 270487, -25479, -213454, -48105, -201616, -292935, -471216]
14080d71216L1276P6505K4758j87950J39028J97616j04903j51854J22171J82247
14070a42322l0266L7946L48602J51061m82150l76681j7052K65271J95801J4665
14060c5125P0649k3505J14946K20478k05639l78104k26453J55688J22220L348
14050a81497q428R1899k13871J45580L6065j17732n8516J96870J16157j07373
14040a00846M7544J11416j25647j02690P7266J64625j30620j78032j5940o9545
14030c22469N1424O0101o585r1958R7267m1147M5668J75040j75185k4841M47664
14019B14979J53275J4467k45945j93413q4386j92826p0391j47710K02380L55401
14009E831J71106m8426l2696j39965K192J36433j77222M4860J38997k1309j44535
$$ y = [-471216, -439940, -363435, -338677, -526627, -387599, -189983, -294886, -446740, -324569, -142322, -172588, -134642, 213960, 365021, -117129, -493810, -510862, -245591, -49790, -35125, 35524, 12019, 126965, 347443, 141804, -236300, -462753, -307065, -184845, -181497, -189925, -98026, -311897, -166317, -130252, -247984, -306500, -109630, 6527, -100846, -53302, 58114, -67533, -170223, -92957, 71668, -58952, -236984, -252924, -322469, -271045, -210944, -217529, -309487, -212220, -253367, -207699, -32659, -207844, -232685, 214979, 368254, 382721, 136776, -56637, -141023, -333849, -404240, -551950, -349570, 5831, 176937, 128511, 95815, -44150, -41958, 94475, -82747, -37887, 101110, 79801, -64734]
13998f4734J84627j1855Q3327j04955K0271j89486L3082j10837j53289j26886
13988d40735j2475J0846L02568J71471k61991j52227J66190j04934j45670L4674
13978d32283K6498P9483Q2562R529j7303R8674n907J14516K2395J47306M0244
13967A65714k29414k0190K7739N9638J94779k43724j48420m2118j50153J97685
13957a88464L57783M8250k59885n467r2585j51001K9116l30o7198l5823k45420
13946f11024N54M0909K2917K5785M4399J15134J37084P8469k51403O6792j3967
13935c44351K14394J63572p0170m74K75968N601k57780R5508J14515k08816j45486
13924a57519j55695J1443N7004J5793p6581k4045L4446L9047K23449l2132j0134
$$ y = [-64734, 119893, 108038, 191365, 86410, 106681, -82805, -49723, -160560, -313849, -440735, -453210, -442364, -139796, 31675, -230316, -382543, -216353, -321287, -466957, -432283, -405785, -326302, -243740, -234211, -251514, -152840, -158747, -44231, -21836, 125470, 165714, -63700, -83890, -56151, 3487, 198266, -45458, -193878, -235996, -386149, -188464, 169319, 217569, -42316, -47783, -140368, -291369, -262253, -262583, -329781, -365604, -611024, -610470, -569561, -546644, -520859, -476460, -361326, -224242, -145773, -397176, -330384, -344351, -129957, 33615, -36555, -37029, 238939, 244540, -13240, 82268, 196783, -12033, -157519, -313214, -301771, -244767, -228974, -305555, -329600, -295154, -256107, -32658, -64790, -74924]
13913g4924J23568P7177j29432j10556n0691J46901J04038k69154j38444k5631
13903c47148J23454q3625j55882J17817o1990j40829m0735o4994Q2151K75320
13893b96461K95003R9237m3752j06750l4425J03695r0337o8444k24999N5210K81384
13882c0639J46560n2901k58495J26141K08885j77847k49718J47509K04264n0508
13872A3251m5416j00865J51105j1926j55160k19866J4963m6047j01122L6597K93061
13861a71425J931j86948j47096q0306p4958K50187J21030K36382K55302l0002
13851A74097j51916j98150J2238K29770M4799J63650K6544j9092p0024K3076j05525
13840A29467l6760j02152k09787P0506J33845L7941J37678J78974j35891J6242
$$ y = [-74924, 48644, 125821, -3611, -114167, -164858, -17957, 86081, -183073, -321517, -347148, -223694, -307319, -463201, -345384, -407374, -548203, -588938, -653932, -571781, -296461, -1458, 97779, 54027, -52723, -87148, 16547, -73790, -142234, -367233, -312023, -30639, 115921, 63020, -195475, -69334, 139551, -38296, -288014, -140505, 63759, 13251, -32165, -133030, 18075, 6149, -149011, -368877, -353914, -399961, -501083, -464486, -171425, -169494, -356442, -503538, -583844, -658802, -408615, -287585, -51203, 204099, 174097, 22181, -175969, -163731, 66039, 110838, 274488, 301032, 281940, 211916, 234992, 129467, 92707, -9445, -219232, -148726, -14881, 23060, 160738, 339712, 203821, 220063]
13830B20063j39186j15830J28655J02649k56803k02519L8033K22475j23067k53209
13820c78739M5253M63568K06872j09140l94024l3992n1909n1211k02609j84463
13810f90394K7023j23814M8436K73711J6640K9787J51588N4632P0245J54308j27245
13799a15083j5695j20657j13470j01165j28020K83053K1438p6244J88051R6646
13789h1146j04767l057M0408j89820J35302L20596R0984j20208j9058R4472L2800
13778A96506k09960j70077l035k0985J27158k8607j3359K4926r7367J3960r9918
13767b80758N3586l6280J30050M6599j63187k15249r101J33708r7750O7456J50171
13756b20755k9016k12191L2656k65710K8848K55161J11656N5064p7445K13703
$$ y = [220063, 80877, -34953, 93702, 196351, -60452, -262971, -224938, -2463, -125530, -378739, -333486, 130082, 336954, 227814, -166210, -200202, -252111, -303322, -505931, -690394, -663371, -787185, -738749, -465038, -448398, -418611, -267023, -212391, -142146, 12162, -115083, -130778, -251435, -364905, -466070, -594090, -311037, -289599, -365843, -177792, -81146, -185913, -188970, -148562, -338382, -203080, 117516, 208500, 88292, 69234, 163706, 196506, -13454, -183531, -186566, -207551, -80393, -109000, -122359, -97433, -194800, -180840, -280758, -227172, -263452, -133402, -86803, -249990, -465239, -474340, -340632, -438382, -370926, -220755, -249771, -461962, -429306, -695016, -666168, -411007, -299351, -244287, -321732, -108029]
13746a08029j84705Q723k9437q2252M3889k9146J00650K324j04124Q7435R0836
13735b03836K19629J76599P156r1633L6235p9882j43515K09182R796l63017j53570
13724c76856j04848L2731q5049O6784P474K29801J8361K23163K25871o8328r8475
13713G0629l6197j44369j24757Q0699o2718j42077K47608L76876j10530m15889
13703b60725q9803L03153J22284j8700j42900o0316J93711K59829m0593l25870
13693e9930k97368j48853J35906K32539j63289l01491M4750J090J65846L04879
13683h5921l4823n8184J39207j9677Q8509O4877J16146P0607q3400m1614n3424
13672A02303j93123O5241Q3143M7848n8944k5874J20884R422j91046j62326J39832
$$ y = [-108029, -292734, -284011, -313448, -395700, -351811, -380957, -280307, -277983, -382107, -294672, -203836, 15793, 192392, 199548, 107915, 144150, 64268, -79247, 129935, 139731, -223286, -376856, -481704, -448973, -534022, -467238, -459764, -229963, -211602, 11561, 237432, 169104, 70629, 34432, -109937, -234694, -153995, -216713, -358790, -111182, 265694, 155164, -260725, -350528, -47375, 74909, 56209, -86691, -147007, 46704, 306533, 265940, -59930, -357298, -506151, -370245, -137706, -300995, -602486, -557736, -556646, -390800, -85921, -120744, -178928, -39721, -59398, 29111, 93988, 210134, 280741, 197341, 155727, 102303, -90820, -25579, 57564, 105412, 46468, 20594, 141478, 150900, -40146, -202472, -62640]
13661f2640J54387j20804l6773p7105K0559K47811k3014j33893j43648r6634J11663
13650a60091n1552j3624P20K6163O7759k5280j31835K58879J47441k65870l63066
13639e10356k5284N2232L4454k9746M5979J75416M7865j38467J81840m5393k18031
13628d29491p0007R8353J84776K7092N6342j62251j53057J35886K92000Q4335
13618F3978J58556k94278l20933K658j1452j32263K674J16895J99109j68789q6420
13607d70265O5492L12672N7332r4427j39620q6493j09401O7159j7457j59554Q3055
13596d91507K04375N2554l4631N7182p7785P4569L3901o6684J52339p0676j82756
13585c49119m9466Q3785j4460L0904J48275m3418l30700q7097j6769J17579L83646
$$ y = [-62640, 91747, -29057, -65830, -142935, -122376, 125435, 102421, -31472, -175120, -271754, -160091, -211643, -225267, -224547, -198384, -130625, -155905, -287740, -28861, 118580, -147290, -510356, -535640, -483408, -448954, -478700, -432721, -257305, -209440, -347907, -166067, -211460, -429491, -499498, -401145, -216369, -189277, -132935, -295186, -448243, -312357, -20357, 63978, 222534, -71744, -392677, -390019, -401471, -533734, -531060, -414165, -215056, -383845, -470265, -404773, -92101, -34769, -129196, -268816, -355309, -464710, -397551, -415008, -574562, -491507, -287132, -234578, -269209, -212027, -289812, -215243, -181342, -248026, -95687, -166363, -349119, -398585, -314800, -329260, -298356, -150081, -193499, -524199, -611296, -628065, -510486, -126840]
13574a26840K09368n4548J22869N0101O6420O057j07428J8884R9028R7404r8996
13563B82319j57630p7126j21430j64913O8508J07764r762n4668J55876O1309j43658
13552e3411k01886j85712l4576L18791O3611n6022k9851n1503p1125j19280J55853
13541b65111R3476J0607j16625K07075L6858R3504L6984j9401J632J4077j6861
13530G6215j62224p1923m8937m3371j84779J64643O0551J49156R5474j93327M1317
13519a17205k4538J79078K73033J24300l46379j52182O497j32001p6036P8865
13509a86568P4023n7007K25527J13831k68162l15951k7404J30398j99757k45919
13499g56989O2176K71991K92744K86366O4179j76285k65303m817K7882K1575K1113
$$ y = [-126840, 82528, 27980, 150849, 200950, 267370, 273427, 165999, 184883, 283911, 381315, 282319, 124689, 47563, -73867, -238780, -170272, -62508, -72270, -126938, 28938, 90247, -53411, -255297, -441009, -475585, -156794, -93183, -149205, -179056, -230559, -301684, -420964, -265111, -171635, -161028, -277653, -70578, -33720, 59784, 96768, 77367, 78999, 93076, 76215, -86009, -157932, -206869, -250240, -435019, -270376, -209825, -60669, 34805, -158522, -117205, -141743, 37335, 310368, 434668, 88289, -63893, -57396, -189397, -265433, -186568, -112545, -169552, 55975, 169806, -98356, -414307, -441711, -311313, -511070, -756989, -694813, -422822, -130078, 156288, 220467, 44182, -221121, -225938, -198056, -176481, -155368]
13488a55368o8727J77628K94371P6278j54015k02835J0913j34720Q2916M2954
13478c0605J3907N9847j52047l8573J46273L8183l7366j64726j55257N1947K38080
13467c0337J22283j54426m8997J47253O6034P3865k63498k25483P626j09569n3320
13456d68569j294R3838K9096m5373J5556J23627M09783o3730k63580q4212M0470
13445b14388M428J14835M6006L5871j58483n5203P0071m4974j77584J26560J02396
13434a50465q4517n1630K58573K2021P9939J75697j38265j52398m8524o5749n9983
13423b15301j92071j19871j76872j74896o6749K20941L14769K16693O4855J53988
13413B5486q1731k46419o7881k37273l1180Q7291L27119l5891O8484o6756k6320
$$ y = [-155368, -224095, -46467, 247904, 324182, 170167, -32668, -21755, -156475, -73559, -30605, -16698, 43149, -108898, -147471, -1198, 36985, -381, -165107, -320364, -268417, -30337, 91946, -62480, -111477, 35776, 101810, 175675, -87823, -313306, -305680, -415249, -468569, -469863, -376025, -346929, -392302, -376746, -253119, 156664, 92934, -170646, -254858, -214388, -209960, -95125, -49119, -13248, -171731, -226934, -156863, -201837, -379421, -252861, -150465, -234982, -286612, -28039, -6018, 73921, 249618, 111353, -41045, -89569, -155318, -215301, -407372, -527243, -704115, -879011, -945760, -724819, -410050, -193357, -128502, 25486, -56245, -302664, -370545, -607818, -638998, -551707, -224588, -260479, -191995, -258751, -285071]
13402b85071l45428l9335J92256J49651j02040j18931j7373K35369o273L35493
13392a682J09991Q0075K24889k17906j11778P5978k55857k84268m7482J52011
13382b76029J08404J21983j00273p0735R8471K20812M3978N4230o7559l24734
13372a91452j88313J12953Q0390j7553J84210K3625k42622J71458o2814o7884
13362a98002r7929k15615R7684N711p1475J52K10472j06523Q6063J37588J20718
13351c1156L8001j12209p163j40131p338j32217m5576j27484o9873K56757K24873
13340a53516J85846j69652j37770j08481M3014M58592k9508j26499p5131O5642
13330d7463j93693p6859R1431p4560p6710P0991K6257K12692J74225k9917j11043
$$ y = [-285071, -630499, -669834, -477578, -327927, -429967, -548898, -566271, -330902, -337175, -1682, 108309, 188384, 413273, 195367, 83589, 159567, -96290, -380558, -428040, -276029, -167625, -45642, -145915, -216650, -118179, 102633, 146611, 200841, 133282, -191452, -379765, -266812, -186422, -203975, -19765, 3860, -238762, -67304, -130118, -198002, -295931, -511546, -413862, -408151, -479626, -479474, -269002, -375525, -289462, -151874, -31156, 6845, -105364, -112527, -252658, -259996, -392213, -437789, -565273, -635146, -378389, -153516, 32330, -137322, -275092, -383573, -340559, 118033, 88525, -37974, -113105, -47463, -241156, -318015, -226584, -301144, -377854, -306863, -280606, -67914, 106311, 76394, -34649]
13319c4649j12444j56031O299K82965j46598j4144J1601J09646r8750L1519j30487
13308b51073k30468J87050J61350k7393m579L8548M7509q9558J44845j42466j23430
13297b89665k0775L2885R1211q3169r4840q3885P8834L9479L51840L8654n8586
13286A983J17790m1220j4652J30251j33277j34357j75713L1844N2315Q7185J53949
13275G6098N1647r9840J29933k02398j66467L43631K5161p6219j58376j39452
13265b16282L14995Q9250l11562J76556J38898j01931l0091n5595k3035K7752
13255H955L0968M3621j28371j17738k1621J59420j87017j07820K14052Q469R205
13244h7877N8972N628j55681N8093l394L5875k4974K05105j7062r9161J0790J88914
$$ y = [-34649, -147093, -303124, -296825, -13860, -160458, -174602, -163001, -53355, -152105, -120586, -251073, -481541, -294491, -133141, -160534, -165113, -126565, -79056, -168614, -23769, -166235, -289665, -310440, -277555, -186344, -269513, -364353, -448238, -369404, -329925, 21915, 60569, 1983, 119773, 78553, 63901, 194152, 60875, -73482, -249195, -217351, -165036, -77851, 76098, 127745, 27905, 157838, -44560, -211027, 132604, 157765, 81546, -76830, -216282, 98713, 187963, -123599, 52957, 191855, 89924, 59833, 4238, -18797, 8955, 39923, 83544, -44827, -162565, -184186, -24766, -211783, -319603, -105551, -97082, -87877, -28905, -23277, -178958, -120865, -124259, -88384, -113358, 91747, 74685, -24476, -13686, 175228]
13232A75228l51314j11653K32475j57929n2367K10373J16170L4975j84195Q8056
13222a81R0068k02028O9007J58443j5858J896j65554L386k53464m6143J61403
13211a99025J01386M5295J22426L1847M1307n3732j67372l7917R0797l31783o050
13200c62821J06305Q7029j1618j50051L2568J04403J11260r2709M4611p9989J03742
13189a07270K286j08665j13116r8629N4151J55993j1622j0916K64536J51771L5605
13178B14124O8283q5448k16283J3960J95289p8997k8828r7474K11234J85269R1952
13167D73081q5652l34365o8242l08030q0333J42308R2436K1599J62757Q8169K30231
13156C33959K36367L07291K29711j7862R1578j71559k90470M0948j34618j37327
$$ y = [175228, -176086, -287739, -55264, -213193, -265560, -55187, 60983, 95958, -88237, -181, 89887, -112141, -43134, 115309, 99451, 101347, -64207, -60821, -314285, -360428, -199025, -97639, -52344, 70082, 101929, 143236, 89504, -77868, -115785, -24988, -356771, -362821, -256516, -169487, -181105, -331156, -298588, -194185, -82925, -175634, -131023, -211012, -107270, -104984, -213649, -326765, -425394, -371243, -215250, -226872, -237788, 26748, 178519, 214124, 282407, 196959, -19324, -5364, 189925, 110928, 82100, -15374, 195860, 381129, 473081, 387429, 53064, -15178, -323208, -403541, -261233, -168797, -147198, 15559, 103728, 333959, 570326, 877617, 1107328, 1089466, 1181044, 1009485, 719015, 759963, 625345, 488018]
13146D88018J39290n6780l22044k41671K13704L16760N7697l5540J8214p2997
13136E04651K09957J99614p7520j32388j20937J0298N7796o4134R702j76299L3548
13125D54288o6049p1276L582J34215j08825r5695K24992K17570o0689k18240M51
13114D14324L92666k1862k273J21478j45584j44987k11007L2006k34225J04922
13104C05458J96319J94872k21762N1647k83346k11938P3321J60695K7172j6512
13094B75926j9429p1331J11822O8180L6109j4733L64016J16763k88788j84939
13084C93596j65216L9124J05281j48814l58979m4235J17500K10085J5710J14766
13074B78818J29285j22892k41173n1729p0886J19728j05625j55464Q3361Q1586
$$ y = [488018, 627308, 570528, 248484, 6813, 220517, 537277, 594974, 559434, 577648, 504651, 714608, 914222, 836702, 704314, 583377, 593675, 651471, 587337, 597039, 420740, 454288, 388239, 316963, 320545, 454760, 345935, 250240, 475232, 692802, 632113, 413873, 414324, 806990, 785128, 782855, 904333, 758749, 613762, 402755, 434761, 200536, 305458, 501777, 696649, 474887, 526534, 243188, 31250, 104571, 265266, 292438, 275926, 256497, 185166, 296988, 365168, 401277, 386544, 750560, 867323, 578535, 393596, 228380, 267504, 372785, 223971, -135008, -179243, -61743, 148342, 164052, 278818, 408103, 285211, 44038, -7691, -78577, 41151, -64474, -219938, -136577, -54991]
13064e4991L3074j21365L5301J70907M6001N7636k28388J65336K83138r3770k18486
13053G4393l7336j10994R3775j56866l21909J1012K68278K60663k5123j40767
13043h4874J850J02237l8666l75620k0411R9206m0527Q6972L95724K10134j2967
13032C23058j39449Q0510j85708m10684o930P5167P7438J09843J15305L5642k43357
13021a69165J62401k96307m0165K43725K66582Q0734l43152j64521q1664j33151
13011d74683Q9718M9612J20468Q6998J50056J3061R234K8429L8557m1324p7423
13000g297J84149j46249O7443J53670j94082j97913k994m3451L0177K9897J26903
12989B53j0256J33481j46615j06494j22587J22577K38737j71357J68711Q6954
$$ y = [-54991, -21917, -143282, -107981, 62926, 108927, 166563, -61825, 103511, 386649, 292879, 74393, 37057, -73937, 19838, -137028, -458937, -447925, -179647, 81016, 55893, -84874, -83024, 19213, -19453, -395073, -415484, -316278, -356805, -269833, 125891, 336025, 323058, 183609, 264119, 78411, -332273, -339203, -264036, -186598, -76755, 38550, 74192, -169165, -6764, -303071, -343236, -99511, 167071, 247805, -95347, -259868, -341532, -474683, -384965, -335353, -214885, -127887, 22169, 35230, 44464, 72893, 111450, 70126, -7297, 176852, 30603, 98046, 251716, 57634, -140279, -143273, -186724, -156547, -126650, 253, -10003, 123478, -23137, -129631, -252218, -129641, 109096, -62261, 106450, 193404]
12979A93404r6573o4517k58248K3708J7076j04662m0423Q3470j25499R0123J36352
12968a45789J53676R3749k88382k79857J43842L18522j42668p389N4131k60179
12958c60344J70515J36863L5432J34888K39706K4513q8235k09922j86900O5481
12948c8003Q7932R1099J39896M0484J06165j2006k09325n4051l502K7237O1764
12937B37690n9012o0031k05500j67199R0666K91522L7403o2545N1810Q4697n5819
12926A83682N026j2162Q548J27134k5373r9786O5887K04683o0595m9511j39457
12915B08076j50950o029m4109L2310J27237K30663J08531L5324n2219R5314P7693
12904F61841k74666j36474j39842K326R96J92789k41757j85061r9884P3209K00330
$$ y = [193404, 96831, 32314, -225934, -202226, -185150, -289812, -330235, -246765, -372264, -282141, -145789, 7887, 101636, -186746, -466603, -322761, -4239, -146907, -154296, -100165, -360344, -189829, -52966, -17534, 117354, 357060, 381573, 293338, 83416, -103484, -38003, 49929, 141028, 280924, 321408, 427573, 415567, 206242, 152191, 148689, 175926, 237690, 178678, 118647, -86853, -254052, -163386, 128136, 165539, 102994, 154804, 239501, 183682, 188708, 176546, 185094, 312228, 286855, 187069, 252956, 457639, 397044, 347533, 208076, 57126, 51097, 6988, 39298, 166535, 397198, 505729, 541053, 488834, 584148, 661841, 387175, 250701, 110859, 113185, 114181, 306970, 65213, -119848, -219732, -146523, 53807]
12893E3807K77509R2149R2940j70744m3630j36835m4688l3737j41106K26828J74053
12882C46546j13308r044J13572r9393J65397J32418o7673k63076P6977k1991r2565
12871A67860L0796J18594K1922j48791J5646J52J40341j6820R6343M5692j31404
12860C40331j52532k153j19328J10414K68810J16075K0340p480k7817J91609k0645
12849G17624l84959N1589K56375J26934J39630J5639j2036j7864l4382j85868
12839F72682l74087j22523K11654r029K32724J53947k5827J60622J2832j2157
12829I00838o8095j51915m4794J96144R0710K88035J05821j9706q3455J00752
12819A314335K18391P1200n0181l04399o8261k6928J05188J52987k7079n9793
$$ y = [53807, 331316, 423465, 516405, 345661, 302031, 165196, 120508, 86771, -54335, 172493, 346546, 233238, 224194, 337766, 238373, 403770, 536188, 468515, 205439, 282416, 260425, 167860, 198656, 317250, 339172, 190381, 206027, 206179, 346520, 329700, 426043, 471735, 340331, 187799, 185646, 66318, 176732, 445542, 561617, 581957, 574477, 546660, 738269, 717624, 332665, 384254, 640629, 767563, 907193, 922832, 910796, 892932, 858550, 672682, 298595, 176072, 387726, 378697, 611421, 765368, 739541, 900163, 912995, 900838, 832743, 680828, 636034, 832178, 922888, 1210923, 1316744, 1297038, 1213583, 1314335, 1532726, 1603926, 1553745, 1249346, 1181085, 1154157, 1259345, 1412332, 1385253, 1325460]
12809A325460k33741k24J58442J06272j38333O3484K23049K8992l3106J98549
12799A698844r185n5232J75195P638j99303M8131O4866J00194r12R3561J03666
12788B027463Q7939J41515Q4397j7897K44591Q9557j28341J12830J60365J46044
12778B948463L2163K7805K93528J77859q4923k9943N9428R0134L38543J0801M6538
12767C910396L9757K34342L21869l401M4372j29474p9510O5917K04254K10647
12757D819169O258K18870Q0160M16008K65387P411J94282K45671q0080J51728
12747F324864K30062L90037N17275J6478p4510q1375J79454L71801L37983L28371
12737H540440N55290M14647K15298J99424M80264M56174P9843M09036M03039K59827
$$ y = [1325460, 1091719, 1091495, 1249937, 1356209, 1217876, 1281360, 1504409, 1533401, 1500295, 1698844, 1689659, 1634427, 1809622, 1817260, 1617957, 1666088, 1730954, 1831148, 1830236, 1923797, 2027463, 2115402, 2256917, 2341314, 2323417, 2568008, 2657565, 2529224, 2642054, 2802419, 2948463, 2980626, 3008431, 3301959, 3479818, 3394895, 3364952, 3424380, 3514514, 3853057, 3863858, 3910396, 3950153, 4184495, 4506364, 4502963, 4547335, 4417861, 4338351, 4404268, 4608522, 4819169, 4825427, 5044297, 5124457, 5540465, 5805852, 5813263, 6007545, 6253216, 6173136, 6324864, 6554926, 6944963, 7462238, 7478716, 7404206, 7322831, 7502285, 7874086, 8212069, 8540440, 9095730, 9510377, 9725675, 9925099, 10405363, 10861537, 10941380, 11350416, 11753455, 12013282]
12727A2013282N19220N73808O91433N05487M38458M64770M45809Q01744R99331
12718A7453342J147506J098904J005809R32972J229641J149037J169243J510491
12710B6696945J498223J632953J746068J577032J750040J819823K177885J962891
12702D0861860K072857K203362K021345K267936K593697K519783K617430K605111
12694E9763381K662843K791666K899434L074444K922422K749957K894288L107712
12686H2866147L334596L201348L097695L145219L468964L189177L144388L084256
12678A08531790L322381L341589L037341L249809L061270K886900L007564L150116
12670A33588760L008557K614851K519336K356539K448304K406398K219902K151960
$$ y = [12013282, 12532502, 13106310, 13797743, 14303230, 14741688, 15206458, 15652267, 16454011, 17453342, 18600848, 19699752, 20705561, 21638533, 22868174, 24017211, 25186454, 26696945, 28195168, 29828121, 31574189, 33151221, 34901261, 36721084, 38898969, 40861860, 42934717, 45138079, 47159424, 49427360, 52021057, 54540840, 57158270, 59763381, 62426224, 65217890, 68117324, 71191768, 74114190, 76864147, 79758435, 82866147, 86200743, 89402091, 92499786, 95645005, 99113969, 102303146, 105447534, 108531790, 111854171, 115195760, 118233101, 121482910, 124544180, 127431080, 130438644, 133588760, 136597317, 139212168, 141731504, 144088043, 146536347, 148942745, 151162647, 153314607]
12662A53314607K053973J673096J577946J196365J241813J295004Q67494N08632
12654A63728930O49521N08424K01321l0382l42993m38825l41215n47016r49128
12645A62438637r45642j085221j334987j492054j600109j714673j919905k099922
12637A50246124k158680k289475k328246k398877k834323k668132k680378k851985
12629A30036028k635865k741346k947825l238469l157923k977416l159985l103168
12621A06074031l084099l012017l018917l010652l061113k834262k725971k820504
12613H2506496k937065k950522k785283k804466k593526k483848k421649k237830
12605F1292307k445408k497768k233360k108224k116642j864606j839164j941004
$$ y = [153314607, 155368580, 157041676, 158619622, 159815987, 161057800, 162352804, 163220298, 163728930, 164378451, 164886875, 165088196, 165057814, 164714821, 164275996, 163934781, 163387765, 162438637, 161492995, 160407774, 159072787, 157580733, 155980624, 154265951, 152346046, 150246124, 148087444, 145797969, 143469723, 141070846, 138236523, 135568391, 132888013, 130036028, 127400163, 124658817, 121710992, 118472523, 115314600, 112337184, 109177199, 106074031, 102989932, 99977915, 96958998, 93948346, 90887233, 88052971, 85327000, 82506496, 79569431, 76618909, 73833626, 71029160, 68435634, 65951786, 63530137, 61292307, 58846899, 56349131, 54115771, 52007547, 49890905, 48026299, 46187135, 44246131]
12597D4246131j688337j447960j515907j304600j423193j135124j113407q79648
12589C3737955q65224j152730j118894j118499r19852p37044o26778p45929q54674
12580B5598331m19363o87263o44716n86288p30344q38755o06792o83125l81229
12571B0020456n59452k32900j69474m28529l57593j10354k40184o14568n50683
12562A6756719n40756n31922l04741l56723l98165m16576m21214l22741l16201
12553A3147680l85857k91061j14389j29135l57958j87396k18180j51002l79601
12544A0933101l07216j72059l22414j25406j61898k10309p3936k55875j45546
12535I158442j96730k79764l94127j22453l4245j07506J20140l04451k53473r8807
$$ y = [44246131, 42557794, 41109834, 39593927, 38289327, 36866134, 35731010, 34617603, 33737955, 32872731, 31720001, 30601107, 29482608, 28562756, 27825712, 27198934, 26453005, 25598331, 25178968, 24491705, 23846989, 23260701, 22530357, 21691602, 21084810, 20401685, 20020456, 19461004, 19228104, 19058630, 18630101, 18272508, 18162154, 17921970, 17307402, 16756719, 16215963, 15684041, 15379300, 15022577, 14624412, 14207836, 13786622, 13463881, 13147680, 12761823, 12470762, 12356373, 12227238, 11869280, 11681884, 11463704, 11312702, 10933101, 10625885, 10453826, 10131412, 10006006, 9844108, 9633799, 9559863, 9303988, 9158442, 8961712, 8681948, 8287821, 8165368, 8131123, 8023617, 8143757, 7839306, 7585833, 7487026]
12525G487026q1262j48337k24472K18041k01610j40103o3986l46463k78032J55271
12515F376073J70041l41664k12247N1172n3609n7839l28496l96795K08548K65410
12505E680594p1416l22856j55068J05285K34281j03366k20357J40013j98873l85425
12495D702812k75633n9826O6934J96081k4125m8688j982J27585M387l12334R866
12484D385077j04564j27665L4423L4020J4387l6049k4722l62334k25058p3217
12474C514298K04162K42906L40839K1871k71648j40979o7750k7212k58167k09429
12464C348891R6220N1515j76714J50904K33242k24326m1221L7687P3305M4024
12454C593527l424j01242N9166q2291j0413o8925j09981k65419k35442q8100L6764
$$ y = [7487026, 7405764, 7257427, 7032955, 7250996, 7049386, 6909283, 6845297, 6498834, 6220802, 6376073, 6546114, 6204450, 5992203, 6043375, 5989766, 5931927, 5603431, 5206636, 5415184, 5680594, 5609178, 5286322, 5131254, 5236539, 5470820, 5367454, 5147097, 5287110, 5088237, 4702812, 4427179, 4367353, 4434287, 4630368, 4606243, 4557555, 4555573, 4683158, 4687545, 4375211, 4385077, 4280513, 4152848, 4187271, 4221291, 4235678, 4199629, 4174907, 3812573, 3587515, 3514298, 3718460, 3961366, 4302205, 4324076, 4052428, 3911449, 3843699, 3816487, 3558320, 3348891, 3445111, 3496626, 3319912, 3470816, 3704058, 3479732, 3438511, 3476198, 3549503, 3593527, 3590103, 3488861, 3548027, 3465736, 3455323, 3386398, 3276417, 3010998, 2775556, 2687456, 2724220]
12443B724220j7357o8362J7760J99240O2362O8072K479k19401J10693J348N3745
12432B934799j185L2542l07627j3910N2137K55217J3508L9821j64370o9199k03607
12421B568126P0279J95482j85664k68780k88959J93201R5464k12795q1256J33435
12411B218533J62960P1187m5323J09564M830j56071k87759J5098O4877j34681
12401B023215j87757j77458J04167Q9884J99378L41873j55606k00031N6692J44514
12391B238871m1491J10974p1655l1788O4164J1542k96352m6693p0174q0989q2799
12380A703610J98198J4469N0325q0385L2939j18170l4571J04168K3547l3825n9517
12369A800788n9762J75035q2959o6007o3051j70348p3990N0472L19585O1997j21132
$$ y = [2724220, 2706863, 2638501, 2656261, 2855501, 2917863, 2985935, 2988414, 2769013, 2879706, 2881054, 2934799, 2933614, 2966156, 2658529, 2644619, 2696756, 2951973, 2965481, 3005302, 2840932, 2771733, 2568126, 2638405, 2833887, 2648223, 2379443, 2090484, 2283685, 2379149, 2166354, 2085098, 2218533, 2381493, 2452680, 2407357, 2516921, 2521751, 2365680, 2077921, 2093019, 2157896, 2023215, 1835458, 1658000, 1762167, 1852051, 2051429, 2393302, 2237696, 2037665, 2094357, 2238871, 2197380, 2308354, 2236699, 2204911, 2269075, 2280617, 1984265, 1937572, 1867398, 1786409, 1703610, 1901808, 1916277, 1966602, 1886217, 1919156, 1800986, 1766415, 1870583, 1894130, 1860305, 1800788, 1741026, 1916061, 1833102, 1767095, 1704044, 1533696, 1459706, 1510178, 1829763, 1891760, 1770628]
12358A770628o5896j01760J87543J1024j84406k28270n5338K87840J95180j9225
12348A797320j31096j28276R5767m4295J29151N2827j60308o9009K62021J67282
12338A971384n0070j46297L9362n3945j09779m8329j65345j2958N2674n2245J07304
12327A531756L24271L0183p3297k3057l9716l6967l8569J03872P46k7052J08848
12316A861018r9507l35033m5K27045L07096l6642j22288r9238J35968J12883n7652
12305A893605j52215q7369m8665n2039O7580j1026j43586R8883J80798k17729
12295A528237J5419J22149n3757K14285o9600M6954m0853m3715J91842L37741
12285B248702K07038j99758k36649n5908k04557m4211L3887L490L0577J7386j40833
$$ y = [1770628, 1704732, 1602972, 1790515, 1801539, 1617133, 1388863, 1333525, 1621365, 1816545, 1797320, 1666224, 1537948, 1633715, 1589420, 1718571, 1771398, 1611090, 1542081, 1804102, 1971384, 1921314, 1775017, 1814379, 1760434, 1650655, 1602326, 1436981, 1424023, 1476697, 1424452, 1531756, 1856027, 1886210, 1812913, 1789856, 1750140, 1713173, 1674604, 1778476, 1779222, 1752170, 1861018, 1761511, 1426478, 1426433, 1653478, 1960574, 1923932, 1801644, 1702406, 1838374, 1951257, 1893605, 1741390, 1654021, 1605356, 1553317, 1620897, 1609871, 1466285, 1565168, 1745966, 1528237, 1543656, 1665805, 1612048, 1826333, 1756733, 1803687, 1762834, 1719119, 1910961, 2248702, 2455740, 2255982, 2019333, 1963425, 1758868, 1714657, 1748544, 1752034, 1782611, 1799997, 1659164]
12274A659164K23821o143k67653J09723P7073L5097j96267K45445L08962o8573
12264B120649j68766r3600R4288K47120k37536j14803j31410K0890R60O459K61620
12253B005871K83035P3765J6573j79988j50497K7453K13208K35828J5751M5687
12243B586686r3814j59769k59561j90867K38870L88061K5990j51239J46364J70960
12233B701681J21497n4869P8994n2691j38659N1735K1527l1896l1316j15937p2312
12222B477754R5273J42493L19785J52695K34011j01380M036l2865K988K13469
12212C508259R3994k99492j18413J48220q729P1868K44096J96024K31410J63470
12202D230707k1811K0987J80682L19200N0623J92800K90696J52255m550K6733
$$ y = [1659164, 1882985, 1876842, 1609189, 1718912, 1795985, 1831082, 1634815, 1880260, 2189222, 2120649, 1951883, 1858283, 1952571, 2199691, 1962155, 1847352, 1715942, 1736832, 1737792, 1744251, 2005871, 2288906, 2362671, 2379244, 2199256, 2048759, 2076212, 2289420, 2525248, 2540999, 2586686, 2492872, 2333103, 2073542, 1882675, 2121545, 2509606, 2535596, 2384357, 2530721, 2701681, 2823178, 2768309, 2847303, 2794612, 2655953, 2707688, 2729215, 2697319, 2666003, 2550066, 2477754, 2573027, 2715520, 3035305, 3188000, 3422011, 3320631, 3324667, 3291802, 3294790, 3508259, 3602253, 3302761, 3184348, 3332568, 3323839, 3395707, 3639803, 3835827, 4067237, 4230707, 4208896, 4229883, 4410565, 4729765, 4780388, 4973188, 5263884, 5416139, 5411589, 5438322]
12192E438322O5958J56458K22648L12774K56402L18763L48367N17570K19641J47518
12182H004421M17277L10626M37618N58777M24635N92255P54575M31367L88076
12173A2319627N35297R66903Q32631Q56219J085140J105746J132255J521026J559145
12164B1913989J609524J551896J782836J612053J889706K086975K027428J871029
12156C6345436J547187J431327J462783J270126J235784J047904O05406N58884
12148D5504837O19958K30962j99596m45840o74360n70488p74618j111392j249331
12139D1330132q00250j053079j070738r82356o48193p60782o32344m52879n46166
12130C4383345k86005J553M48766P09314O70315Q09033R95187J270563J590310
$$ y = [5438322, 5504280, 5660738, 5883386, 6196160, 6452562, 6771325, 7119692, 7637262, 7856903, 8004421, 8421698, 8732324, 9169942, 9728719, 10153354, 10745609, 11500184, 11931551, 12319627, 12854924, 13821827, 14654458, 15510677, 16595817, 17701563, 18833818, 20354844, 21913989, 23523513, 25075409, 26858245, 28470298, 30360004, 32446979, 34474407, 36345436, 37892623, 39323950, 40786733, 42056859, 43292643, 44340547, 44945953, 45504837, 46124795, 46355757, 46156161, 45710321, 45035961, 44465473, 43690855, 42579463, 41330132, 40529882, 39476803, 38406065, 37423709, 36775516, 36014734, 35382390, 34929511, 34383345, 34097340, 34098893, 34547659, 35256973, 35927288, 36736321, 37731508, 39002071, 40592381]
12121D0592381J795885K002419K026588K470163K981194L093848L014158L229443
12113F1206079L365178L416702L264781L304899L108558K798980K788518K190854
12105H5444549J740371J559328J337062M22546j84273l19047p35697j509104j748356
12096H6007379j987256k168738k675473k852760k995072k981679k912123k943592
12088F4490686k791197k539425k875548k702538k319089j966201j642698j394547
12080D6259443j167078r39112p92865n68348n10506l12875j5724J23723N15993
12071D2592651P07765N81316P22508J012922J366121J540390J585438J370277
12063E1479388J042437J079917J436957J323124J123073P35350L66232K37503
$$ y = [40592381, 42388266, 44390685, 46417273, 48887436, 51868630, 54962478, 57976636, 61206079, 64571257, 67987959, 71252740, 74557639, 77666197, 80465177, 83253695, 85444549, 87184920, 88744248, 90081310, 90503856, 90319583, 90000536, 89264839, 87755735, 86007379, 84020123, 81851385, 79175912, 76323152, 73328080, 70346401, 67434278, 64490686, 61699489, 59160064, 56284516, 53581978, 51262889, 49296688, 47653990, 46259443, 45092365, 44153253, 43360388, 42792040, 42281534, 41968659, 41952935, 42076658, 42592651, 43300416, 43881732, 44604240, 45617162, 46983283, 48523673, 50109111, 51479388, 52521825, 53601742, 55038699, 56361823, 57484896, 58220246, 58586478, 58823981]
12055E8823981M0136k06023l72134o92006j133587j238453j022427j326148j737937
12046E1135402j815027j834963k189409j849936j662917k064042k004537j778171
12038C5936400j425146j495291j643823j519945j133534j115032j285489q63222
12030B5454918n98681n85023o70640n82103n45474o64766o37881m51138k08855
12021B0510357j71728m10869j27285j9916k6823j76390j57514k86180j04240j03907
12011A8925505J18254J20266j13806k0734J01953J70067P6093L0817K77749L88872
12001B0075036L28518N53403L00153R619J84985L00376L89857L45945N01791N31588
11991B3521271N68201R18156R92200P11846P02147O15300P03825P03495Q72549
$$ y = [58823981, 58864117, 58658094, 58285960, 57593954, 56460367, 55221914, 54199487, 52873339, 51135402, 49320375, 47485412, 45296003, 43446067, 41783150, 39719108, 37714571, 35936400, 34511254, 33015963, 31372140, 29852195, 28718661, 27603629, 26318140, 25454918, 24856237, 24271214, 23600574, 23018471, 22472997, 21808231, 21170350, 20719212, 20510357, 20338629, 19927760, 19800475, 19780559, 19753736, 19577346, 19419832, 19133652, 19029412, 18925505, 19043759, 19164025, 19050219, 19029485, 19131438, 19301505, 19377598, 19408415, 19686164, 20075036, 20403554, 20956957, 21257110, 21266729, 21451714, 21752090, 22141947, 22487892, 22989683, 23521271, 24089472, 25007628, 25999828, 26711674, 27413821, 28029121, 28732946, 29436441, 30308990]
11982C0308990J191674J173276J279601J376567J390255J387453J634351J662366
11974D1404533J921891J975801K193749K039257K192847K238933K821105L214568
11966F0002684L614176L750378L928763M486959M688682N254784N513695O031579
11958I7271700O943395P556167Q158124R042799R880021J1320170J2443524J3755166
11950A76371066J5425788J6815853J8308754K0073879K1506908K3235398K4592258
11943C16329904K5067689K4948353K4395513K3105357K0933160J7675957J4226342
11936D66682275J0422646O780317L190225o35748l880000p251082j0066520j2990055
11928D52252058j5918738j8555878k0169859k1403131k2417808k2439636k2153188
$$ y = [30308990, 31500664, 32673940, 33953541, 35330108, 36720363, 38107816, 39742167, 41404533, 43326424, 45302225, 47495974, 49535231, 51728078, 53967011, 56788116, 60002684, 63616860, 67367238, 71296001, 75782960, 80471642, 85726426, 91240121, 97271700, 104215095, 111771262, 119929386, 128972185, 138852206, 150172376, 162615900, 176371066, 191796854, 208612707, 226921461, 246995340, 268502248, 291737646, 316329904, 341397593, 366345946, 390741459, 413846816, 434779976, 452455933, 466682275, 477104921, 483885238, 487075463, 486439715, 482559715, 475308633, 465242113, 452252058, 436333320, 417777442, 397607583, 376204452, 353786644, 331347008, 309193820]
11921C09193820k1036607j9950378j8810452j7079583j6105995j4499347j3058532
11914A88652926j1918115j0580034r956234q947781q282643p666075o997790o436523
11906A17867731n907968n360672n248513m795277m163717m013966l624121l424637
11898H1328860l112218l007218k906085k855633k704932k581648k311963k117857
11890E9731306k121907k068272j781606j654421j563656j332231j543311j319812
11882D6346090j410733j473080j534250j331891r47702j126221q53748j238429
11874C6430036j370057r39157r06043q29705q23859q12972p24006o17987p33958
11865B8672292q85114m96470o08229o70073o83923p61665n81641l65483n99645
$$ y = [309193820, 288157213, 268206835, 249396383, 232316800, 216210805, 201711458, 188652926, 176734811, 166154777, 156198543, 147250762, 138968119, 131302044, 124304254, 117867731, 111959763, 106599091, 101350578, 96555301, 92391584, 88377618, 84753497, 81328860, 78216642, 75209424, 72303339, 69447706, 66742774, 64161126, 61849163, 59731306, 57609399, 55541127, 53759521, 52105100, 50541444, 49209213, 47665902, 46346090, 44935357, 43462277, 41928027, 40596136, 39648434, 38522213, 37668465, 36430036, 35059979, 34120822, 33214779, 32385074, 31561215, 30748243, 30024237, 29406250, 28672292, 27787178, 27290708, 26682479, 26012406, 25328483, 24566818, 23985177, 23619694, 23020049]
11856B3020049n33551n38245l75620n71844m47162k86800l18630l88675p69302
11847A8790220q45293m20190j32254k31080m10620k43001j51097k22736l50199
11838A5783750k04415k13706l23134m03486j29427j50444l97562k67056l15680
11829A3378840j63711j44316k51559l15422k94149k17944n7544J41532m29755
11820A1645972j56992j32036j05736j53457k66193q9618M3202k34803l82121K7445
11810A0195663j67637j79669l10404k71916J9509k76247k81887j84537j81066
11801H361809k4660k83553j35108O0950j15131j28403j5023l87489j05157J39847
11791G368082J6827j00251m0670j28856k03054j95207j02556r3919M4397J9385
$$ y = [23020049, 22486498, 21948253, 21572633, 21000789, 20553627, 20266827, 19948197, 19559522, 18790220, 17944927, 17524737, 17392483, 17161403, 16750783, 16507782, 16356685, 16133949, 15783750, 15579335, 15365629, 15042495, 14639009, 14509582, 14359138, 13961576, 13694520, 13378840, 13215129, 13070813, 12819254, 12503832, 12209683, 11991739, 11934195, 12075727, 11645972, 11488980, 11356944, 11251208, 11097751, 10831558, 10741940, 10785142, 10550339, 10168218, 10195663, 10028026, 9848357, 9537953, 9266037, 9285546, 9009299, 8727412, 8542875, 8361809, 8337149, 8053596, 7918488, 7979438, 7864307, 7735904, 7720881, 7333392, 7228235, 7368082, 7384909, 7284658, 7243988, 7115132, 6912078, 6716871, 6614315, 6520396, 6564793, 6584178]
11781F584178r4591J9242J78360j09594k29326j14128P7302l09822j30597L9439
11771E910463N1742k63526j56153j87942L9686r4873j32041k34246j88896L4151
11761D778365K11789J75956O8768j69611o8845k6905j97476k3128l3306j17177
11751D598430r376J81525O8876j70055n7893J03061l5285o73r5500q9251r7896
11740D395963J59070J33502N7050j97811j79851j87137j06204q700J12305j38282
11730D039905J25162L72999j4245l98735l40018j25225Q0453K42658K48744j60117
11720D071581k18729k36598J8481K03479q2823j5305K00148p376K838j88062k94641
11709C452993q2852O5689J63678j3749j75078l4832J02264l02151J93690n9379
$$ y = [6584178, 6489587, 6508829, 6687189, 6577595, 6348269, 6234141, 6311443, 6001621, 5871024, 5910463, 5962205, 5698679, 5542526, 5354584, 5394270, 5299397, 5167356, 4933110, 4744214, 4778365, 4990154, 5166110, 5234878, 5065267, 4996422, 4969517, 4772041, 4748913, 4715607, 4598430, 4589054, 4770579, 4839455, 4669400, 4611507, 4714568, 4679283, 4678610, 4583110, 4493859, 4395963, 4555033, 4688535, 4745585, 4547774, 4367923, 4180786, 4074582, 4065882, 4178187, 4039905, 4165067, 4538066, 4523821, 4125086, 3785068, 3659843, 3740296, 3982954, 4231698, 4071581, 3852852, 3616254, 3634735, 3838214, 3755391, 3740086, 3940234, 3932858, 3935696, 3747634, 3452993, 3370141, 3435830, 3599508, 3585759, 3410681, 3375849, 3478113, 3175962, 3369652, 3310273]
11699C310273J97244J85559m049j35580l29048o0284n3328r3503J0252r506L93871
11688C411901K47712J42511r9863k93072J4465J06583J03190O919n8910m61384
11678C120052J18056P0737n3370O0727J1832P0892q3735m5538j41565m9753K39603
11667C317938j3448L6290k87034l09401m6857o7440m4567k41196j17841K55254
11657B481698J6593k5022J83666K32017J31569o9493j43419J55241m8845j72031
11647B741974p2608L7394j9755Q3672j11491m1997k3773M6454O3935J01900M265
11636B809970M0435k25328P1403L92108K81810r6432k52930k40466k68116q4009
11626B428445K54627K45314j10933R6218O0831j25j58109o4385j55436j17986
$$ y = [3310273, 3507517, 3693076, 3689027, 3553447, 3224399, 3164115, 3110787, 3017284, 3027536, 3018030, 3411901, 3659613, 3802124, 3702261, 3409189, 3423654, 3530237, 3633427, 3640346, 3581436, 3120052, 3238108, 3308845, 3255475, 3316202, 3328034, 3398926, 3315191, 3269653, 3128088, 3078335, 3317938, 3304490, 3340780, 3053746, 2744345, 2697488, 2630048, 2585481, 2344285, 2226444, 2481698, 2498291, 2473269, 2656935, 2888952, 3020521, 2951028, 2807609, 2962850, 2914005, 2741974, 2669366, 2706760, 2687005, 2770677, 2659186, 2617189, 2593416, 2639870, 2703805, 2805705, 2809970, 2850405, 2625077, 2696480, 3088588, 3370398, 3273966, 3021036, 2780570, 2512454, 2428445, 2683072, 2928386, 2817453, 2913671, 2974502, 2974377, 2816268, 2751883, 2596447, 2478461]
11616B478461j91457k5690P9026M4589k6048J21606r8898L8226P9769P4197n3998
11605B519783k59488k73378R8050O6658N0359J20512K28048L9197J22432j19029
11595B593144j37966N3369q6006N2384J33323P0476k89605L4389j02365j51410
11585B169733R5164J99176O9002N7750K28561R5843l23361k98478k90078r2540
11575A910772J066K25345J99254k7945L7138K00723l4475l0756o7439k76238n5073
11564B082372k33122K1800K17464K56886J6877j13314j82704J38921p5835j20940
11554B008405k51592p9586K75238r0920l905M68125P992j92780m8346j93783p2991
11543A825857J04379J74369r8931j12946p0902K94186k38912k38290J15559N7798
$$ y = [2478461, 2287004, 2261314, 2340340, 2384929, 2358881, 2480487, 2381589, 2419815, 2499584, 2573781, 2519783, 2260295, 1986917, 2084967, 2151625, 2201984, 2322496, 2550544, 2589741, 2712173, 2593144, 2455178, 2508547, 2422541, 2474925, 2608248, 2678724, 2389119, 2423508, 2321143, 2169733, 2264897, 2464073, 2533075, 2590825, 2819386, 2915229, 2591868, 2293390, 2003312, 1910772, 1911838, 2137183, 2336437, 2308492, 2345630, 2546353, 2511878, 2481122, 2413683, 2137445, 2082372, 1849250, 1871050, 2088514, 2345400, 2362277, 2248963, 2066259, 2205180, 2129345, 2008405, 1756813, 1677227, 1952465, 1861545, 1857640, 2325765, 2333757, 2140977, 2092631, 1898848, 1825857, 1930236, 2104605, 2005674, 1892728, 1821826, 2116012, 1877100, 1638810, 1754369, 1812167]
11533A812167K19613r1442r2373K44634K42219l2452k33414j85412j08762J72683
11523A947461Q6359n6666N9894l0709J27935o3399M0176k56185j41903J30621
11513A843584m3901O1496K1538K52532K04576j38398m48004j45968m3230j56783
11503A407442O9921J69590o7922J55467J46178M6270o2284m5278k7030K26695
11493B019049N2712j44789o6169m6012K13341J17553j5314O7187J44751J82496
11483B524805j51200l16477j50985j72606k51843l7306K99656Q4747K9606p1412
11473A786985r1008R0491Q0849N3176k4432j08541K0601K21653r4930P6447r2602
11462A918689j24504p5076m0230P1399P4147J21821J94251l5674l83594j34382
$$ y = [1812167, 2031780, 1940338, 1847965, 2092599, 2334818, 2302366, 2068952, 1883540, 1774778, 1947461, 2033820, 1977154, 2037048, 2006339, 2134274, 2070875, 2111051, 1854866, 1712963, 1843584, 1799683, 1861179, 1882717, 2135249, 2339825, 2201427, 1753423, 1607455, 1564225, 1407442, 1477363, 1646953, 1579031, 1734498, 1880676, 1926946, 1864662, 1819384, 1792354, 2019049, 2071761, 1926972, 1860803, 1814791, 2028132, 2145685, 2130371, 2197558, 2342309, 2524805, 2373605, 2057128, 1906143, 1733537, 1481694, 1444388, 1744044, 1828791, 1858397, 1786985, 1695977, 1786468, 1867317, 1920493, 1896061, 1787520, 1808121, 2029774, 1934844, 2011291, 1918689, 1794185, 1719109, 1678879, 1750278, 1824425, 1946246, 2140497, 2104823, 1721229, 1586847]
11452A586847K25297K57017K1479j71402p1237M8658K01479l1Q061J11601j60947
11441B056822q7258j94826J47528o9379L11468K6917k53258j15062m3099n6325
11431A723528m4625Q4879J81816j05971k11452R0166P2070J43167p3125P802k25802
11420A642453j43249Q4157K918J17462J45919K27311l20592j75293L23119K3784
11410A927989K3878Q3176j2405J1797o5033k09344k40451J83516J96013Q6373
11400A985509K6131j61372K0976o4842o4376L7120J9705j5985m6664Q5650J376
11389A823228j2051n4573q6292j05286q174J08451o5356N341O0695k9905K15527
11378A851605j15454k81195J00171K70309J12948j10435m7584k2074P3334J39197
$$ y = [1586847, 1812144, 2069161, 2090640, 1919238, 1848001, 1896659, 2098138, 2098107, 2106168, 2217769, 2056822, 1969564, 1774738, 1922266, 1852887, 2164355, 2191272, 1938014, 1822952, 1779853, 1723528, 1678903, 1763782, 1945598, 1839627, 1628175, 1718341, 1790411, 1933578, 1860453, 1868255, 1642453, 1499204, 1583361, 1586279, 1703741, 1849660, 2076971, 1756379, 1581086, 1904205, 1927989, 1951867, 2035043, 2022638, 2034435, 1969402, 1760058, 1519607, 1703123, 1899136, 1985509, 2011640, 1850268, 1871244, 1806402, 1742026, 1779146, 1798851, 1782866, 1736202, 1821852, 1823228, 1811177, 1756604, 1670312, 1565026, 1556852, 1665303, 1599947, 1605288, 1665983, 1636078, 1851605, 1736151, 1454956, 1555127, 1825436, 1938384, 1827949, 1780365, 1758291, 1831625, 1970822]
11368A970822L6467j68089J83432N6759k43565l22548J29792J96859n3366j15198
11358A671365K58985j7853m6638J58907j6087r0700P5304O9853Q4090o8159P8913
11347B157980m1363q9357q3882j35489Q1463l7837J01702o8381J56370R8253Q7725
11336B227184k44051j85489K59295R302k71177K16418J02j8530o5999k51101M9135
11325A725089J68728p7182r1761J45960J27993J87660p0530o1596k30857j29217
11315A694287R2501l3235j765K06235R4344J26434o3026q1594J2816m0007O6915
11304B073905L67179j18551J55531j45290k39719l940J49533P5138k30992Q4411
11294B167205K86460K34003K7500k86000j01570j14501j62207J06994J54702l0277
$$ y = [1970822, 2007289, 1839200, 2022632, 2079391, 1835826, 1513278, 1643070, 1839929, 1786563, 1671365, 1930350, 1912497, 1865859, 2024766, 2008679, 1917979, 1993283, 2063136, 2147226, 2079067, 2157980, 2116617, 2027260, 1943378, 1807889, 1889352, 1851515, 1953217, 1884836, 2041206, 2139459, 2227184, 1983133, 1797644, 2056939, 2066241, 1795064, 2011482, 2011584, 1993054, 1927055, 1675954, 1725089, 1893817, 1816635, 1724874, 1870834, 1998827, 2186487, 2115957, 2054361, 1823504, 1694287, 1786788, 1753553, 1751788, 1958023, 2052367, 2178801, 2115775, 2034181, 2046997, 2006990, 2073905, 2441084, 2322533, 2478064, 2332774, 2093055, 2089115, 2238648, 2313786, 2082794, 2167205, 2453665, 2687668, 2715168, 2429168, 2327598, 2213097, 2050890, 2157884, 2312586, 2282309]
11284B282309J28044L3716o1658N659j20719Q5544J13801r4855l37712Q1130K89300
11273B404559k1355K17456J22649j58749J57256K0100j24895k4307Q8350J045
11263B682109J25704J39547m0891m2343K42718j22829k27163j3894r7672J70846
11253B816132P8599O480K32832Q1500p1010n5068J54637L06774J71039k2815L04237
11242D003337n805J61667j8787J61196K63691r0753o7018L11753K85543j73416
11232D831408r5920P4604P8171K77594r3484l5820j65995p0560O3558p3703p5810
11221D714043P5745k35992k53861Q8419R8621j95166k97956k73151r6207l9943
11211C584552L515M9899L3092j18458j1260j54374j70846j70859L1216k2060j8905
$$ y = [2282309, 2410353, 2444069, 2382411, 2388070, 2267351, 2352895, 2466696, 2371841, 2034129, 2115259, 2404559, 2383204, 2600660, 2723309, 2564560, 2721816, 2741916, 2617021, 2592714, 2681064, 2682109, 2807813, 2947360, 2906469, 2864126, 3106844, 2984015, 2756852, 2742958, 2645286, 2816132, 2894731, 2901211, 3134043, 3215543, 3144533, 3089465, 3244102, 3550876, 3721915, 3699100, 4003337, 3997532, 4159199, 4140412, 4301608, 4565299, 4474546, 4407528, 4719281, 5004824, 4831408, 4735488, 4810092, 4888263, 5165857, 5072373, 5036553, 4870558, 4799998, 4863556, 4789853, 4714043, 4789788, 4553796, 4299935, 4388354, 4486975, 4291809, 3993853, 3720702, 3624495, 3584552, 3588067, 3637966, 3671058, 3552600, 3541340, 3386966, 3216120, 3045261, 3076477, 3054417, 3035512]
11200C035512J3234k7064P0633L0838J26665L4409k16601k49364m9029j07736
11190B661497l0739K80163L17734j6104k47251k60013Q374l1283J30662K6092
11180B839132k8946j56882n6809J25886P5950J70832K00096j08531p299O7042
11170C120471k19004r2159K10713Q9562p524j9784M6406K5170j57285m1928o3081
11159B891557J30059o4226m2691k54822N0597p9311J98934J86316j58988p6973
11149B780452J34154R1312J84804N2084K03531K9322J01398j39030q6775q4972
11139C266280R2552L4449L9832J51670k732k01684q8736j35765p7923L3853m0021
11128C071775J12339J44660J4694J69146O630r449j06068k0013j79384J04205
$$ y = [3035512, 3048746, 3021682, 3092315, 3123153, 3249818, 3284227, 3067626, 2818262, 2769233, 2661497, 2630758, 2910921, 3228655, 3212551, 2965300, 2705287, 2713661, 2682378, 2813040, 2839132, 2810186, 2653304, 2596495, 2722381, 2798331, 2969163, 3169259, 3060728, 3053429, 3120471, 2901467, 2809308, 3020021, 3109583, 3102059, 3082275, 3128681, 3153851, 2996566, 2954638, 2891557, 3021616, 2957390, 2914699, 2659877, 2710474, 2631163, 2830097, 3016413, 2857425, 2780452, 2914606, 3005918, 3190722, 3242806, 3446337, 3475659, 3577057, 3438027, 3351252, 3266280, 3358832, 3393281, 3433113, 3584783, 3582051, 3380367, 3291631, 3155866, 3077943, 3111796, 3071775, 3184114, 3328774, 3343468, 3512614, 3519244, 3509795, 3403727, 3383714, 3204330, 3308535]
11118C308535P3592j2498M9736K13741O1270J35967J32261j99003l78536q0223
11108C304842J40361J98212K6141K75129j07378j80891Q826J29643K7037j24665
11098C697257j93729J31610P7240K9031j1214m2565N08868K16424k57629l72731
11088C782562o4458R0252J89716m9516J11605m5652J07557J69906k23031J31760
11078D200701N4930k16723j92880j64537O8927Q2686N7572J30712Q8895j6881
11068D093402p3553M5435k35026k6704N4042J37604k1990m5584J02569K77154
11058D307349O4057l0356L26306K69821p4726j66372K3687j47808k47142m4536
11048D280280K73119M4087M1199K74514K72834m6160N4379O0662J07073j2225
$$ y = [3308535, 3382127, 3369629, 3419365, 3633106, 3694376, 3830343, 3962604, 3763601, 3385065, 3304842, 3445203, 3643415, 3669556, 3944685, 3837307, 3656416, 3665242, 3794885, 3821922, 3697257, 3503528, 3635138, 3712378, 3741409, 3730195, 3687630, 4196498, 4412922, 4155293, 3782562, 3718104, 3808356, 3998072, 3948556, 4060161, 4014509, 4122066, 4291972, 4068941, 4200701, 4255631, 4038908, 3846028, 3681491, 3750418, 3833104, 3890676, 4021388, 4110283, 4093402, 4019849, 4065284, 3830258, 3803554, 3857596, 3995200, 3973210, 3927626, 4030195, 4307349, 4371406, 4341050, 4667356, 4937177, 4862451, 4696079, 4719766, 4571958, 4324816, 4280280, 4553399, 4597486, 4638685, 4913199, 5186033, 5139873, 5194252, 5254914, 5361987, 5349762]
11038E349762K80950o0052J39419j19384K0128R7157K11988L08412J80671j5451
11028F393600K62022J1003P590n2348j35832k2413j13762O7927K29989J03255
11018F751031j22048l3605J03756K21058Q5590j66905k73576K16946J62751J33094
11008G078092J33099K7315l2656J27723j86096J34214N9005L4668o2777Q1314
10998G393901r8284J19974J03290R3640j75386k6036j6603l7456l7424q1240J36203
10987G374579r9913J56161J59314Q6167J45848R0327k2881j71043k35281l6677
10977G446601K47242k7922j10418J41572J98205l9413P681K10945L50207o287
10967H418413j2961K94441K57864j37411J2221j13338J01989K80599J19140Q936
$$ y = [5349762, 5630712, 5570660, 5710079, 5590695, 5610823, 5707980, 5919968, 6228380, 6409051, 6393600, 6655622, 6666625, 6674215, 6621867, 6486035, 6463622, 6349860, 6417787, 6647776, 6751031, 6628983, 6595378, 6699134, 6920192, 7005782, 6838877, 6565301, 6782247, 6944998, 7078092, 7211191, 7238506, 7205850, 7333573, 7147477, 7281691, 7340696, 7375364, 7312587, 7393901, 7295617, 7415591, 7518881, 7612521, 7437135, 7411099, 7394496, 7357040, 7319616, 7238376, 7374579, 7274666, 7430827, 7590141, 7676308, 7822156, 7912483, 7889602, 7718559, 7483278, 7446601, 7693843, 7665921, 7555503, 7697075, 7895280, 7855867, 7863548, 8074493, 8424700, 8418413, 8405452, 8699893, 8957757, 8820346, 8832567, 8719229, 8821218, 9101817, 9220957, 9229893]
10957I229893J05283K02935J93176j5346Q1041J06577M01582O5097J79994L5023
10947A0585255M8760O8912L07182K55457J71809K18399K62588K6009J52133J61925
10937A2258429K19756P7852l7289K58840M39986K54463L7578j26791m4154L15194
10927A3653864M52035J03819K74108M30845K45474L53718L53769K48129L11806
10918A6427567L17636N67572L90873P4837K99424M74558N30893L28677L66149
10909A9778186L24448K29782M76085L92300L26730L68963M93335M47013L25418
10900B3162260N50080M37348N61177P44331L85009N37518N67500N38928N76648
10891B8060799M96737M39364P08934Q40880Q09772P22195Q17358P71821N73305
$$ y = [9229893, 9335176, 9538111, 9731287, 9715941, 9796982, 9903559, 10305141, 10370238, 10550232, 10585255, 10634015, 10702927, 11010109, 11265566, 11437375, 11655774, 11918362, 11944371, 12096504, 12258429, 12478185, 12556037, 12518748, 12777588, 13217574, 13472037, 13509615, 13382824, 13338670, 13653864, 14105899, 14209718, 14483826, 14914671, 15160145, 15513863, 15867632, 16115761, 16427567, 16745203, 17312775, 17703648, 17778485, 18077909, 18552467, 19083360, 19412037, 19778186, 20102634, 20332416, 20808501, 21200801, 21527531, 21896494, 22389829, 22836842, 23162260, 23712340, 24149688, 24710865, 25455196, 25840205, 26377723, 26945223, 27484151, 28060799, 28557536, 28996900, 29705834, 30546714, 31356486, 32078681, 32896039, 33667860, 34241165]
10882C4241165O93914Q29486Q91764R74691N79530O25212Q95399P38331P11873
10873D1181365Q83290R48033Q19879Q55268J063692R99642O76820R28263J096544
10864D9452796R39701O90783O76078J112213R35750Q40163J095089Q11856P20419
10855E7274848N70541O01616P31938J055060J070443O84922P11264J093157J232304
10846F5026093P77813J165730J226253Q48331R00911R63102R97683J205516J101906
10837G4213338J185526J430482J302650J235755J109401J100634J145779J294186
10829H4017751J694690J657108J358706J602824J881869K047064K137580J954994
10821I8352586K053768K410783K690857K669762K837749L144878L353211L594027
$$ y = [34241165, 34935079, 35764565, 36656329, 37631020, 38210550, 38835762, 39731161, 40469492, 41181365, 42064655, 43012688, 43832567, 44687835, 45751527, 46751169, 47427989, 48356252, 49452796, 50392497, 51083280, 51759358, 52871571, 53807321, 54647484, 55742573, 56554429, 57274848, 57845389, 58447005, 59178943, 60234003, 61304446, 61989368, 62700632, 63793789, 65026093, 65803906, 66969636, 68195889, 69044220, 69945131, 70908233, 71905916, 73111432, 74213338, 75398864, 76829346, 78131996, 79367751, 80477152, 81577786, 82723565, 84017751, 85712441, 87369549, 88728255, 90331079, 92212948, 94260012, 96397592, 98352586, 100406354, 102817137, 105507994, 108177756, 111015505, 114160383, 117513594, 121107621]
10813A21107621L778686M008364M395779N017959N569324N601149N999390P156631
10805A62634903P514727Q129975R017847J0035776J0887085J2069814J3676424
10798B33966551J4612541J5981819J7627235J9554703K1116927K2411836K3949243
10791C69220855K5112073K5638080K5715617K5027268K2950530K0336743J7142406
10784E31143572J3318456R684976O038009K134473j518163n169351q556236j1446583
10776E35629153j4367868j7375728j9808273k1537695k2771227k3366869k3180458
10769C93221035k2578992k1582754k0404948j9098805j7665040j5991583j4468916
10762B61429997j3360238j1847606j0810093j0110849r306409q372801p576345
$$ y = [121107621, 124886307, 128894671, 133290450, 138308409, 143877733, 149478882, 155478272, 162634903, 170149630, 178279605, 187297452, 197333228, 208220313, 220290127, 233966551, 248579092, 264560911, 282188146, 301742849, 322859776, 345271612, 369220855, 394332928, 419971008, 445686625, 470713893, 493664423, 514001166, 531143572, 544462028, 554147004, 560185013, 562319486, 560801323, 555631972, 547075736, 535629153, 521261285, 503885557, 484077284, 462539589, 439768362, 416401493, 393221035, 370642043, 349059289, 328654341, 309555536, 291890496, 275898913, 261429997, 248069759, 236222153, 225412060, 215301211, 205994802, 197622001, 190045656]
10755A90045656o904113o108004n637447n422372n019630m619735m187765l592036
10747A48554554l606872l663945l351503k884998k913464k974187k487929k369771
10739A24301885k225203k205630k058945j848339j820363j722624j425794j570772
10731A09424215j421121j334212j715912j642782j405245j234650j236252j474303
10723I7959738j401687j255312r97716r59055j379264j027842r56279q48578r64049
10714H8169956r32071r29076r88887j261907j063742n59965r24742j085817r75107
10705G9448642q28822o61241j018601j141887q69971p49260j049970q90885o40714
10696G1597291q48372r67998r25843p27199j121515r07893o51705q81488q47158
$$ y = [190045656, 183141543, 177033539, 171396092, 165973720, 160954090, 156334355, 152146590, 148554554, 144947682, 141283737, 137932234, 135047236, 132133772, 129159585, 126671656, 124301885, 122076682, 119871052, 117812107, 115963768, 114143405, 112420781, 110994987, 109424215, 108003094, 106668882, 104952970, 103310188, 101904943, 100670293, 99434041, 97959738, 96558051, 95302739, 94305023, 93345968, 91966704, 90938862, 89982583, 89134005, 88169956, 87237885, 86308809, 85319922, 84058015, 82994273, 82434308, 81509566, 80423749, 79448642, 78619820, 77958579, 76939978, 75798091, 74928120, 74178860, 73128890, 72238005, 71597291, 70748919, 69780921, 68855078, 68127879, 67006364, 66098471, 65446766, 64565278, 63718120]
10687F3718120o24437o63063o69658n84515m32559q14284r84431q41022o43088
10678E7461063p46539q24482q38603r67128j128513q46121p45293r27934q57485
10669D9578965r30029r16163r39503r53329j093804r49184j093463j007878j069804
10660D0625808o57752j065374q36025o33856o84964o60211p99719m63404p00889
10651C4123614p44497l88196n50308l21629j91185m92531p48749o79755j76091
10642B9830673l41809k97525o7163k05037m32547m72578n7148k33720l02810o5258
10632B7355078r645j8385J73517J76778K49302M28035J86739K84911L84876N71912
10622B9783118N59996N89734R67076J508923J756554K299795K731542K900841
$$ y = [63718120, 63093683, 62430620, 61760962, 61176447, 60743888, 59929604, 58945173, 58104151, 57461063, 56714524, 55890042, 55051439, 54084311, 52955798, 52109677, 51364384, 50436450, 49578965, 48648936, 47732773, 46793270, 45839941, 44746137, 43796953, 42703490, 41695612, 40625808, 39968056, 38902682, 38066657, 37432801, 36747837, 36087626, 35287907, 34824503, 34123614, 33379117, 32990921, 32440613, 32118984, 31927799, 31435268, 30686519, 30006764, 29830673, 29488864, 29191339, 29124176, 28919139, 28486592, 28014014, 27956866, 27723146, 27420336, 27355078, 27345433, 27327048, 27500565, 27677343, 27926645, 28354680, 28541419, 28826330, 29211206, 29783118, 30343114, 30932848, 31899924, 33408847, 35165401, 37465196, 40196738, 43097579]
10614D3097579L919815M981413O377409O729186O347174N440853M516510M128660
10606H5538599M011189M499548N442152O959625R073237J1349383J2771966J2893661
10598A52539360J0519372O553509K635616P90383R59372K244149M756410P637469
10590A88635640J0746292J3637626J5106247J3681068Q545226J355724m396556
10583B47311267p154098o987100n037826k021274J048582L898120N798397N424302
10575B42280370K750569l004376r652880j3954153j4353405j2669355j0013233
10568A81383537p049475m431400k713831k046147k585816m376632p247135j0494728
10560A40438373j1905990j1301863r772934q127528o840973n472193m770259m230207
$$ y = [43097579, 47017394, 51998807, 58376216, 65105402, 71452576, 76893429, 81409939, 85538599, 89549788, 94049336, 99491488, 106451113, 115524350, 126873733, 139645699, 152539360, 163058732, 169612241, 172247857, 173038240, 173997612, 176241761, 180998171, 188635640, 199381932, 213019558, 228125805, 241806873, 250352099, 251707823, 247311267, 240157169, 233170069, 228132243, 226110969, 227159551, 231057671, 236856068, 242280370, 245030939, 242026563, 232373683, 218419530, 204066125, 191396770, 181383537, 174334062, 169902662, 167188831, 165142684, 162556868, 158180236, 150933101, 140438373, 128532383, 117230520, 107457586, 99330058, 92489085, 87016892, 82246633, 78016426]
10552G8016426m292897m777817n565198o184728n783234m983689m384510l636550
10544C8407803k920299k253167j841120j440225j310205j148557j074161q59974
10536B5560095p72882p77585r80882n92100o25057o24285n72582k39891k85921
10527B0088910o01036p79695n87053n63357n67017n61737j54371J5796l05222
10518A5985218m08994o98963k22509P2879q7932j81973k78229l65866m79200k14820
10508A3119611j47971l02922k09762j83699l49716j24087j26680l87092l05878
10499A0981804j33472l92400J5708j07961j38505l4539j59033p5055Q9159r5296
10489I950410M3683k59050l81141k32544j68909j29289m9718j93685J55636J21764
$$ y = [78016426, 73723529, 68945712, 63380514, 57195786, 51412552, 46428863, 42044353, 38407803, 35487504, 33234337, 31393217, 29952992, 28642787, 27494230, 26420069, 25560095, 24787213, 24009628, 23028746, 22436646, 21811589, 21187304, 20614722, 20374831, 20088910, 19487874, 18708179, 18121126, 17557769, 16990752, 16429015, 16274644, 16290440, 15985218, 15576224, 14877261, 14654752, 14727631, 14639699, 14457726, 14179497, 13813631, 13334431, 13119611, 12971640, 12668718, 12458956, 12275257, 11925541, 11801454, 11674774, 11287682, 10981804, 10848332, 10455932, 10471640, 10363679, 10225174, 10190635, 10031602, 9956547, 10045706, 9950410, 9994093, 9735043, 9353902, 9121358, 8952449, 8823160, 8773442, 8579757, 8735393, 8857157]
10479H857157p7670j62031m0048j66237j75324J8089n9504j51615j81824j66250
10469G694743p7786k0812L2563r1720l12239l35409N1927J65867q797o8523l9184
10458F990630J06203q6902l52493k13738L3564M9108J68686P9624k73344j09819
10448F391519M6288j75747r1321l73480j17047N42836m0366j9720J90802l00502
10438F053262l51284k94864J262m9503J93866K8160j85966M3650K54309R996k74408
10427E428480j25173J37961J37381j92319J04099J2876O3250j58842j28273J81043
10417E460483K8984j46191p0660M2342J67659N9344P2891o100j74164j02299N7653
10406E389942J49756J89085O0637q4836P5177j09553l54525Q6105K28415Q8392
$$ y = [8857157, 8779487, 8617456, 8577408, 8411171, 8235847, 8253936, 8194432, 8042817, 7860993, 7694743, 7616957, 7596145, 7628708, 7536988, 7224749, 6889340, 6941267, 7107134, 7098337, 7029814, 6990630, 7096833, 7009931, 6657438, 6443700, 6477264, 6526372, 6695058, 6774682, 6501338, 6391519, 6437807, 6262060, 6170739, 5797259, 5680212, 6223048, 6182682, 6162962, 6353764, 6053262, 5701978, 5407114, 5408376, 5358873, 5552739, 5580899, 5394933, 5438583, 5692892, 5702888, 5428480, 5303307, 5441268, 5578649, 5386330, 5490429, 5503305, 5566555, 5407713, 5279440, 5460483, 5489467, 5343276, 5272616, 5314958, 5482617, 5541961, 5614852, 5608752, 5434588, 5332289, 5389942, 5539698, 5728783, 5789420, 5704584, 5779761, 5670208, 5315683, 5401788, 5630203, 5718595]
10396E718595k17534j53615K52600L18286J24228M0192k6600k19028j99736K2527
10386E659915o1710L5579m4175n13J1708K61784R0188k11162k46916j29402K40554
10375E605850k1178j86707M1178J3240Q6919L07502K29870K14494J90155j0325
10365F470998Q02j98222P7318Q197N0685O1284N9247p548k48124k03435K50636
10354F321838K18644Q8008Q2686Q6721M5493L3171k32490K74881M85291n7262
10344G346981J26479j7003J76358J82951K57048J53752N7221P5999L1040K28847
10334H619673L24282K19469J87486K73416J22334j40515K1538K25587K11848K29613
10324A0294731J50616j11358J15289R4361j60607K5390J93720j23039o3658q8378
$$ y = [5718595, 5501061, 5347446, 5600046, 5918332, 6042560, 6082752, 6056152, 5837124, 5637388, 5659915, 5598205, 5633784, 5589609, 5589096, 5600804, 5862588, 5952776, 5741614, 5494698, 5365296, 5605850, 5584672, 5397965, 5439143, 5452383, 5539302, 5846804, 6076674, 6291168, 6481323, 6470998, 6471800, 6273578, 6350896, 6359093, 6409778, 6471062, 6530309, 6522761, 6274637, 6071202, 6321838, 6540482, 6628490, 6711176, 6797897, 6843390, 6876561, 6644071, 6918952, 7404243, 7346981, 7473460, 7456457, 7632815, 7815766, 8072814, 8226566, 8283787, 8359786, 8390826, 8619673, 8943955, 9163424, 9350910, 9624326, 9746660, 9606145, 9627683, 9853270, 10065118, 10294731, 10445347, 10333989, 10449278, 10543639, 10383032, 10408422, 10602142, 10479103, 10415445, 10327067]
10314A0327067j87162r1325J720K83233M26383J32091K02424J89709L96031K70160
10304A1950331r1103Q8558K84831P9487l3125K79139N45008K48279K10097R2474
10294A3653976J02685L72128L10270M27816N67013m701j53496O8244K62093M01129
10284A6007157L19871K29274K94647L28972N4450k51856K03553L85088L02178
10275A7873334L97866N37734L00141K83583L18033P9045J49155N00150N90566
10266B1029607N92089M32327P62711M85718M67484N14549R06017R40292M81386
10257B6612180N16210P99119J051997Q48789Q07566Q45718J046298Q12852O04552
10248C3945281Q61190P28045N82882J005935P65040K80219N22298P72500O99096
$$ y = [10327067, 10139905, 10048580, 10050300, 10333533, 10759916, 10892007, 11094431, 11284140, 11680171, 11950331, 11859228, 11947786, 12232617, 12312104, 12278979, 12558118, 13103126, 13351405, 13561502, 13653976, 13756661, 14128789, 14439059, 14866875, 15433888, 15429187, 15275691, 15343935, 15606028, 16007157, 16327028, 16556302, 16850949, 17179921, 17234371, 16982515, 17186068, 17571156, 17873334, 18271200, 18808934, 19109075, 19392658, 19710691, 19789736, 19938891, 20439041, 21029607, 21621696, 22054023, 22816734, 23302452, 23769936, 24284485, 25190502, 26130794, 26612180, 27128390, 27927509, 28979506, 29828295, 30635861, 31481579, 32527877, 33340729, 33945281, 34806471, 35534516, 36117398, 37123333, 37888373, 38168592, 38690890, 39463390, 40162486]
10239D0162486O44732Q45178R74102O45322P78717P24421N78971O31494P61567
10230D6746990J033794R14599O24231N81153Q76105Q15879N03700Q22340Q64034
10221E3782825M74285O32452O88859J92426P6382p73j37391j18491M3103k67548
10211E5366129o3930m19322m59370k74789j77448k26963l91565m47203j59009
10202E2746530J23968J67900J64444L39350N52618N28331O08356L63674P69312
10193E6364483P21357J051620J432962J128892Q52465J101797J120990J088302
10185F4862868J125921J142175J531222J297968J270872J341825J364808J303878
10177G5241537J349777J549895J325059J371581J665622J738947J889722J919432
$$ y = [40162486, 40807218, 41652396, 42626498, 43271820, 44050537, 44774958, 45353929, 45985423, 46746990, 47780784, 48695383, 49319614, 49900767, 50776872, 51592751, 52096451, 52918791, 53782825, 54257110, 54889562, 55578421, 55770847, 55847229, 55846456, 55709065, 55590574, 55633677, 55366129, 55302199, 54882877, 54423507, 54148718, 53971270, 53744307, 53352742, 52905539, 52746530, 52870498, 53038398, 53202842, 53542192, 54094810, 54623141, 55231497, 55595171, 56364483, 57085840, 58137460, 59570422, 60699314, 61551779, 62653576, 63774566, 64862868, 65988789, 67130964, 68662186, 69960154, 71231026, 72572851, 73937659, 75241537, 76591314, 78141209, 79466268, 80837849, 82503471, 84242418, 86132140, 88051572]
10169H8051572J907033K033006K050248K412850K648501K893889L101483L389714
10161A08488296L773245M119591M085200L958784M059968M044458M074005L986956
10153A40590503L689094L894891L542896K714808K607302K365042J806020J686110
10145A62896666J315401R68795J365259J062117R33313J149548P84848M94568
10137A70970515M84654M69967N9779l687j23431m17933m86338l88162o48169q36029
10127A69081166j019499j053945j109376j295997j056985j225814r72722r14774
10119A60432054o08332m89295k7768J37763N51571J153176J975973K202399K564583
10110A67892124K961722L102417L608841L287509L304650L330479L121845K727726
$$ y = [88051572, 89958605, 91991611, 94041859, 96454709, 99103210, 101997099, 105098582, 108488296, 112261541, 116381132, 120466332, 124425116, 128485084, 132529542, 136603547, 140590503, 144279597, 148174488, 151717384, 154432192, 157039494, 159404536, 161210556, 162896666, 164212067, 165180862, 166546121, 167608238, 168541551, 169691099, 170475947, 170970515, 171455169, 171925136, 171984915, 171981228, 171857797, 171439864, 170953526, 170565364, 169917195, 169081166, 168061667, 167007722, 165898346, 164602349, 163545364, 162319550, 161346828, 160432054, 159823722, 159334427, 159306659, 159444422, 159995993, 161149169, 163125142, 165327541, 167892124, 170853846, 173956263, 177565104, 180852613, 184157263, 187487742, 190609587, 193337313]
10102A93337313K535252K307318J734942J473367J632693J417610Q09093P01332
10094B05948920P48894O35772L83414J79674N08368R72274J321716J250121J108388
10085B13057541J372362J196414R84060N30210l40304q79276j142916j911831
10077B12866260k590172l532902m398090m822138n876500o741533o946711p473104
10069A70485110q121500p803901p786686p915917p964034p535924p063808p016598
10061A09276742o672614o109785n648331m881157m438449m108868l576279l228366
10053G0612893l075679k622641k148821k003358j924074j600736j336173j394780
10045E4506631j282182j191174p89001p47833p75097m79331k26300j62375m2506
$$ y = [193337313, 195872565, 198179883, 199914825, 201388192, 203020885, 204438495, 205247588, 205948920, 206697814, 207333586, 207717000, 207896674, 208405042, 209377316, 210699032, 211949153, 213057541, 214429903, 215626317, 216610377, 217140587, 216800283, 215921007, 214778091, 212866260, 210276088, 206743186, 202345096, 197522958, 191646458, 184904925, 177958214, 170485110, 162363610, 154559709, 146773023, 138857106, 130893072, 123357148, 116293340, 109276742, 102604128, 96494343, 90846012, 85964855, 81526406, 77417538, 73841259, 70612893, 67537214, 64914573, 62765752, 60762394, 58838320, 57237584, 55901411, 54506631, 53224449, 52033275, 51244274, 50496441, 49721344, 49242013, 49015713, 48853338, 48810832]
10036D8810832n620N99231R90572P31668Q45573J473505K155896K141411K289323
10027F0032391K586965K419737K417498K449661K396150K422506K277779J930656
10019G8933343J453406J427199J092314P51653R7385l1596m73211r98422j434217
10010H0817854j757971j982358k364490k718682l022915l049922l140679k932467
10002E9848370k851167k806737k801763k639541k539714k605537k114292j942526
9994C9547093j655620j810567j426911j070857j023886o40839n35905n59186k32308
9985C0591014l07961k5474J33297j30139m3748j84150k2447m2154K4913P2648
9975C0065799K15632K46852J88255O6415j7824L5946p9668Q531l19422m11868
$$ y = [48810832, 48805212, 49404443, 50395015, 51126683, 51972256, 53445761, 55601657, 57743068, 60032391, 62619356, 65039093, 67456591, 69906252, 72302402, 74724908, 77002687, 78933343, 80386749, 81813948, 82906262, 83657915, 83755300, 83723704, 83250493, 82252071, 80817854, 79059883, 77077525, 74713035, 71994353, 68971438, 65921516, 62780837, 59848370, 56997203, 54190466, 51388703, 48749162, 46209448, 43603911, 41489619, 39547093, 37891473, 36080906, 34653995, 33583138, 32559252, 31918413, 31382508, 30823322, 30591014, 30283053, 30257579, 30390876, 30260737, 30216989, 30032839, 30010392, 29968238, 29993151, 30065799, 30281431, 30528283, 30716538, 30782953, 30765129, 30801075, 30721407, 30729938, 30410516, 29998648]
9965B9998648k40943k43001l75161m94117k28476k95687l15936o51798m62391
9956B6691138l50769m63822o30257m35369k59847l90497m79434l32760J4718O3325
9946B3426426j61041k19734K5639O8673J81835K64852K77816J37537K68670N36262
9936B4806935K02104M84653P03485N32470O41469O73255Q36463N84286N10497
9927B9975617Q14243J442178J354087J041679J334467J273440J046860J324493
9919C9607064J492219J538438J737341J713302J720337K052365K256044J979507
9911E4096617J891204K295692K528285K547056K497128K564798K765276K796463
9903G3982519K996720K558662K509284K467389K707171K764119K819932K733172
$$ y = [29998648, 29757705, 29514704, 29139543, 28645426, 28416950, 28121263, 27805327, 27153529, 26691138, 26340369, 25876547, 25246290, 24810921, 24551074, 24160577, 23681143, 23348383, 23363101, 23426426, 23265385, 23045651, 23071290, 23139963, 23321798, 23586650, 23864466, 24002003, 24270673, 24806935, 25009039, 25493692, 26197177, 26729647, 27371116, 28044371, 28880834, 29465120, 29975617, 30789860, 32232038, 33586125, 34627804, 35962271, 37235711, 38282571, 39607064, 41099283, 42637721, 44375062, 46088364, 47808701, 49861066, 52117110, 54096617, 55987821, 58283513, 60811798, 63358854, 65855982, 68420780, 71186056, 73982519, 76979239, 79537901, 82047185, 84514574, 87221745, 89985864, 92805796, 95538968]
9895I5538968K297662K230574K255014J891165J550200J277015J655328J511810
9887A10207736Q80492O62930M18461J28985Q5125k67081p17691n03742q66773
9878A10028442r82727j057796j268957j619178j679301k186799k146010k110916
9870I6976758k307008k299764k427076k487150k211082k383789k428692k401693
9862G8030504k476966k416294k198221k314732k273981j943238k014417k258607
9854F0134048j852620j753745j586922j558129j429685j455436j336557j137898
9846D8023056j281366j240538j083220q43508p54842p67565n70940m56575o89983
9837D0334519n03604n83792n31051k77325l77491l1437P1327L376k17420m3374
$$ y = [95538968, 97836630, 100067204, 102322218, 104213383, 105763583, 107040598, 108695926, 110207736, 111088228, 111751158, 112169619, 112298604, 112383729, 112116648, 111398957, 110895215, 110028442, 109045715, 107987919, 106718962, 105099784, 103420483, 101233684, 99087674, 96976758, 94669750, 92369986, 89942910, 87455760, 85244678, 82860889, 80432197, 78030504, 75553538, 73137244, 70939023, 68624291, 66350310, 64407072, 62392655, 60134048, 58281428, 56527683, 54940761, 53382632, 51952947, 50497511, 49160954, 48023056, 46741690, 45501152, 44417932, 43574424, 42819582, 42052017, 41481077, 41024502, 40334519, 39830915, 39247123, 38716072, 38438747, 38061256, 38029819, 38101146, 38104522, 37887102, 37843728]
9827C7843728J69000J43221L30400L39367L51703L75242O30580Q08661O41342
9818D1633244P29528J029100J109948J151230Q71405R42416J230115J215247J475895
9809E1388128J496439J429442J619635J753324J884438J873624J978811J870667
9801F5294508J860839J877000J853423K049770J986671J668816J914337J946936
9793H0452300J757360J422912J232521J213266J110616J100073Q94012P72763
9785H9955823P39598M58847j7270j75j86847m60474m58562p61064r20985q96907
9775H7451984j278766j459062j585699j688544j793627j842907j858269k064672
9767G3880438k235919k122923k092491k138888k180678j952690j946341k061271
$$ y = [37843728, 38012728, 38155949, 38486349, 38825716, 39177419, 39552661, 40183241, 40991902, 41633244, 42362772, 43391872, 44501820, 45653050, 46524455, 47466871, 48696986, 49912233, 51388128, 52884567, 54314009, 55933644, 57686968, 59571406, 61445030, 63423841, 65294508, 67155347, 69032347, 70885770, 72935540, 74922211, 76591027, 78505364, 80452300, 82209660, 83632572, 84865093, 86078359, 87188975, 88289048, 89183060, 89955823, 90695421, 91154268, 91136998, 91136823, 90949976, 90489502, 90030940, 89269876, 88348891, 87451984, 86173218, 84714156, 83128457, 81439913, 79646286, 77803379, 75945110, 73880438, 71644519, 69521596, 67429105, 65290217, 63109539, 61156849, 59210508, 57149237]
9759E7149237j983028k025146k195982j986190k047527j803757j840052j629246
9751D1638309j371341j205466j425776j754028j496962j216798j350041j040950
9743C0776947r71618j165903j151845j164516o37557o24175q06656p78554o02072
9734B2874051q36245r10927o22983n54335m77714n75609o23076p33296o50700
9725A6889166l84859l01816m54692k90652l52990l58191l10994l29532k90976
9716A3814464m97179l70656k06798l01753m07889m15855l40908j21101l15701
9707A0836624k2654j78755j55977m03000k01605j05366q5390k23098q9537k47985
9697I123257l33848j16223k50449m5965j12488l29151k44944k66125R4670O7833
$$ y = [57149237, 55166209, 53141063, 50945081, 48958891, 46911364, 45107607, 43267555, 41638309, 40266968, 39061502, 37635726, 35881698, 34384736, 33167938, 31817897, 30776947, 29805329, 28639426, 27487581, 26323065, 25685508, 25061333, 24254677, 23476123, 22874051, 22037806, 21126879, 20503896, 19949561, 19471847, 18896238, 18273162, 17539866, 16889166, 16504307, 16202491, 15747799, 15457147, 15104157, 14745966, 14434972, 14105440, 13814464, 13317285, 12946629, 12739831, 12438078, 12030189, 11614334, 11273426, 11152325, 10836624, 10813970, 10635215, 10479238, 10076238, 9874633, 9769267, 9683877, 9460779, 9371242, 9123257, 8789409, 8673186, 8422737, 8376772, 8264284, 7935133, 7690189, 7424064, 7518734, 7586567]
9687G586567L640l02365k39542j42485k2840N823k1647j09511n3255k29242l16244
9676F158899j21536j90080k12377n3883r7439l6537j790K34573j35758k81108
9666E262964o3808M5350M1610k51161o7827J302k1568j48113L22791j05091l80896
9655D635553j76320k04325J3752j44798o7769J25868P614O2644J56039J40369
9645D548627K4565q4174R9636J64364M5218m25669j48260L8368J78206l3282j99961
9634D207638m8658k56048o9209p7106k60278j35979L241q3471k05503l4981J03207
9623C142853M7777J0591J32935j1133j97675o0918k22389j82842l2444N9705j11549
9612B574911m9188Q537j39728o4152J3962j2860j24809k05447O1853K11050j08016
$$ y = [7586567, 7590207, 7287842, 7048300, 6905815, 6882975, 6888798, 6867151, 6757640, 6704385, 6475143, 6158899, 6037363, 5847283, 5634906, 5581023, 5483584, 5447047, 5445257, 5679830, 5544072, 5262964, 5199156, 5244506, 5286116, 5034955, 4967128, 4968430, 4946862, 4798749, 5121540, 5016449, 4635553, 4459233, 4254908, 4268660, 4123862, 4056093, 4181961, 4189575, 4252219, 4408258, 4548627, 4573192, 4489018, 4588654, 4753018, 4798236, 4372567, 4224307, 4262675, 4440881, 4407599, 4207638, 4158980, 3902932, 3833723, 3756617, 3496339, 3360360, 3363601, 3280130, 3074627, 3039646, 3142853, 3190630, 3201221, 3334156, 3323023, 3125348, 3064430, 2842041, 2659199, 2626755, 2686460, 2574911, 2525723, 2534260, 2394532, 2330380, 2344342, 2331482, 2206673, 2001226, 2063079, 2274129, 2166113]
9601B166113p1900r9988N6044k44782j01377J98703P5989k8603p3636j6158m4352
9590A816053k1345j93103q3420J76827J20549J0057j80813L7039L6283J5531j81858
9579A551800M5868K1832k05403P1919j15458n1945j04694K01439L9518j29264
9569A325612N1359J38781j69706k87662K0313n8806J48259J88894J37556r6456
9559A398144j76373j07229k43965n8582n0156R7806n4840J36088L03108J76323
9549A420324J00021j67203j48527j2786k3302p2987M1347m2334M6065O4528j40554
9538A064592j85177L8644l6288m7743O3926k40621k00969K68111J0321j16230
9528F18566r6875P5444J79405p9275j96890n2300M02757j65273k03590j47371
$$ y = [2166113, 2094213, 1994225, 2050269, 1805487, 1704110, 1902813, 1978802, 1950199, 1876563, 1860405, 1816053, 1794708, 1601605, 1518185, 1695012, 1815561, 1825618, 1644805, 1681844, 1718127, 1733658, 1551800, 1597668, 1619500, 1414097, 1486016, 1370558, 1318613, 1213919, 1415358, 1454876, 1325612, 1376971, 1515752, 1346046, 1058384, 1078697, 1019891, 1168150, 1357044, 1494600, 1398144, 1221771, 1114542, 870577, 811995, 761839, 859645, 804805, 940893, 1244001, 1420324, 1520345, 1353142, 1204615, 1191829, 1168527, 1095540, 1136887, 1094553, 1140618, 1205146, 1064592, 879415, 918059, 881771, 834028, 897954, 657333, 456364, 724475, 734796, 618566, 521691, 597135, 776540, 697265, 500375, 448075, 850832, 685559, 481969, 334598]
9518C34598r843L62345L32812Q20j83707j65960j5632K4906J36556j74145J32184
9507G74934o1848j60175n3881J9851K23099l3523R7048O3395r152j7219r4953
9496G47576P2986K31502J01592j17797p0903M6496R1765L7717J806j29744j41548
9485H71448k08809q1965J33148j61322j4561M354j19606J86800j2278J2600K821
9474F12630o3885m7517q235j21350J1574J65295J45252K1098Q8542K27389J775
9463A032568l3194O6051K35914k93564m9218R0887o8451Q3159M4660n7099j77858
9452H73855j47237j04880j26387J8078L8835K4746J59145k12936j94880R7774
9442D26113R4475p7925j05698L42691K23148K5747j76793k44305j50880J24344
$$ y = [334598, 324755, 687100, 1019912, 1020732, 837025, 671065, 655433, 680339, 816895, 642750, 774934, 713086, 552911, 499030, 518881, 741980, 708457, 805505, 868900, 859748, 842529, 747576, 820562, 1052064, 1153656, 1035859, 964956, 1011452, 1103217, 1140934, 1142740, 1012996, 871448, 662639, 580674, 713822, 552500, 537939, 542293, 422687, 609487, 597209, 609809, 612630, 548745, 501228, 492993, 371643, 383217, 548512, 693764, 714862, 803404, 1030793, 1032568, 999374, 1065425, 1301339, 1007775, 958557, 1049444, 980993, 1064152, 1108812, 1051713, 873855, 726618, 621738, 495351, 513429, 552264, 577010, 736155, 523219, 328339, 426113, 520588, 442663, 336965, 679656, 902804, 928551, 751758, 507453, 356573, 480917]
9432D80917j23082J50558K17889j9979J29979J7242j86274k39275j90774Q8091
9422C25292O7653P1440r2334M6657l1994M3817O18J70552k22286p6121K09961
9411E13255J034J16708J09420j95390n1838o0425p3329J19075N0433O6305r3610
9400E01638m3282N183j22737j9997r7854P2771m448P5809J15030J90097k42553
9389D29657m0528K24614J96021P1897k17706j13593k39738j85290o0087O0414
9379A25661L6359L6018K42491j74536R1321L39539j4392j01013k5350j28283r648
9368D18167K64801J61752p6804j52408r0709j25163j16393j18005M5386J03186
9358C13810K76568J6051j37648j09686j40178K97210J23690n4868j35466j1230
$$ y = [480917, 357835, 508393, 726282, 706303, 836282, 853524, 667250, 427975, 237201, 325292, 392945, 464385, 372051, 418708, 386714, 430531, 431149, 601701, 379415, 303294, 513255, 514289, 630997, 740417, 545027, 493189, 432764, 359435, 478510, 528943, 595248, 501638, 458356, 463539, 340802, 320805, 222951, 295722, 291274, 367083, 482113, 672210, 429657, 389129, 613743, 809764, 881661, 663955, 550362, 310624, 125334, 65247, 125661, 162020, 198038, 440529, 265993, 357314, 696853, 682461, 581448, 556098, 427815, 418167, 682968, 844720, 767916, 615508, 524799, 399636, 283243, 165238, 210624, 313810, 590378, 606429, 468781, 359095, 218917, 516127, 639817, 584949, 449483, 438253]
9348D38253O3648J32059o667l0782k16948o5659r5526K8313q0943K85068O8366
9337E19182m2860m1926M6987j55269j69773r540K7121k59487o6118M15976J31780
9326C96073r3271j05364j28328J93818J20457j64928m204m1138j76225L793M31831
9315D32514L3398j08084q3221n3509O5756j64623J09846j7791k15797j88224N4829
9304a34906O6252L8399L5861l7956l0703m504k75342J87571o8364n5118J34893
9293a43917K80704J1343j98739r5796Q4859R9522N1543n1787k85412k6021K81740
9282H039L2774k3124J09969k6304k59408k44040O9247L50767J48192K87986L9058
9271D93156j48605j84219j20090j18747q9246N4468l7746l6913J75642M8148q5957
$$ y = [438253, 501901, 633960, 627293, 596511, 379563, 313904, 218378, 246691, 165748, 450816, 519182, 476322, 434396, 481383, 326114, 156341, 146801, 173922, -85565, -151683, 264293, 396073, 302802, 197438, 69110, 262928, 383385, 218457, 214253, 173115, -3110, 683, 432514, 465912, 357828, 274607, 221098, 286854, 122231, 232077, 214286, -1511, -189735, -134906, -68654, -30255, 5606, -32350, -63053, -67557, -342899, -155328, -223692, -278810, -143917, 136787, 148130, -50609, -146405, -61546, 37976, 89519, 37732, -247680, -273701, 8039, 40813, 17689, 127658, 101354, -158054, -402094, -332847, 17920, 166112, 454098, 493156, 344551, 160332, 40242, -78505, -167751, -113283, -151029, -187942, -12300, 35848, -50109]
9260e0109k0741l60587p9508j148l3679m9177k77566K02648L66093J92986L07858
9249A97070p5337p8614O220j2525p0964j90356L3713J3472n7335l9397r6152n2386
9237d22591N6375R1571Q6461J04383N6768k43586J7824L27767J78177k1571J57019
9226C88597l2208k12282k0467Q1224K61911J22279K4529p3051k19855O491k87826
9215C9342j63543R24L6393J47858L7834N0163J02985J61608l50531k94456P03
9204b30720J43963k38872J56983J20759M8154K14K15785J53123m33549k36148
9194c00308P2670j24551k14560j30597J61062J04944M9718J77878j77922m0867
9184d22533J19034q6234p8259K78485j48576j24915R8224K73266m679j57040r8964
$$ y = [-50109, -70850, -431437, -510945, -512093, -545772, -594949, -872515, -669867, -303774, -110788, 197070, 121733, 43119, 49339, 36814, -34150, -224506, -190793, -177321, -234656, -274053, -370205, -422591, -366216, -274645, -188184, -83801, -27033, -270619, -252795, 74972, 253149, 231578, 388597, 356389, 144107, 123640, 204864, 466775, 589054, 613583, 540532, 320677, 327168, 39342, -124201, -123277, -86884, 60974, 98808, 148971, 251956, 413564, 63033, -231423, -230720, -86757, -325629, -168646, -47887, 267, 481, 216266, 369389, -64160, -300308, -227638, -352189, -566749, -697346, -536284, -431340, -381622, -203744, -381666, -422533, -303499, -389733, -467992, -189507, -338083, -462998, -364774, -91508, -96187, -253227, -352191]
9173c52191K72908Q7503j20046P7775J37247M2637P9407J09068o9820m0844k04340
9162A9304J50763K73561M9984k91300j85422j77347r6426J21185J29079R7115
9152I0496n326J48447m7140K6196O0803j21993k04734q9488J01613N8021k04417
9141a87522k03005N5836K66260K11772j15938l53225J20070O2704m3699k5808
9131b12555P8637M0103K8180Q0085M7343q4657j32531J00201J1651l20750N3411
9120c10882P6830j549j23667M3247J24225L42600K35408j6565P2190l22260k05794
9109h6217J74968j06836k66965k10553m6259J9086O7967K2720p8688K36027M76961
9098B02211N8726l53870j56960K4376r2262p7362N3161J63271J70627j77604j88918
$$ y = [-352191, -79283, 8220, -111826, -34051, 103196, 145833, 225240, 334308, 264488, 223644, 19304, 170067, 443628, 493612, 202312, 16890, -160457, -256883, -135698, -6619, 90496, 85170, 233617, 186477, 212673, 273476, 151483, -53251, -142739, -41126, 16895, -187522, -390527, -334691, -68431, 143341, 27403, -325822, -205752, -143048, -186747, -212555, -133918, -93815, -65635, 14450, 61793, -22864, -155395, -55194, -43543, -364293, -310882, -234052, -235601, -359268, -316021, -191796, 150804, 386212, 369647, 441837, 119577, -86217, 88751, -18085, -285050, -495603, -541862, -522776, -454809, -432089, -510777, -274750, 202211, 260937, -92933, -249893, -225517, -317779, -395141, -341980, -178709, -8082, -185686, -374604]
9087c74604r5642j954K15748L70617L06661l46457l73171r3921K07648K63481
9077G8406o4353P4380r9701K4769l5827J39484R3541L6977p817o7960J6325j45737
9065D2487j84422q2056k16537L0243K49214J93261l90395m8119J50120J2016r0061
9054c34249J38923P5927j03442O2167L340j53079J2145L08375K22789q2697k79989
9043a29790k22618m0943j2568k5134k5615Q1050K67591n0279j29058J25509j74643
9032c36498L9904K0416J31696q0442R4415L4537J45954Q0838q3296k66334k0494
9021b39304N9319l235Q5831J79965m7J3433j49342o7051k1319j72979j08549P959
9009d15319O4922J51350r3587k1146o321L5317J06661L10189J56414L550j09047
$$ y = [-374604, -470246, -472200, -256452, 114165, 420826, 74369, -298802, -392723, -185075, 78406, 14053, 88433, -11268, 13501, -22326, 117158, 210699, 247676, 239859, 171899, 188224, 42487, -141935, -223991, -440528, -410285, -161071, 32190, -358205, -406324, -256204, -244188, -334249, -195326, -119399, -222841, -160674, -157334, -310413, -298268, 10107, 232896, 150199, -129790, -352408, -393351, -405919, -431053, -456668, -375618, -108027, -158306, -287364, -161855, -336498, -296594, -276178, -144482, -224924, -130509, -95972, 49982, 130820, 47524, -218810, -239304, -179985, -183220, -97389, 82576, 82529, 95962, -53380, -120431, -141750, -314729, -423278, -415319, -350397, -199047, -292634, -313780, -320101, -284784, -178123, 132066, 288480, 292030, 182983]
8998A82983o6614j60034N0525J30550j60316j36762N4788J48072k34351K44653
8988E3494K6685k6823P13J23122J65026r2697j01473o1850K76234J14796j94545
8977B82682k31329j25469m6525K13615J09577O5906j6421P1755O8253j5265j00792
8966B75987M9319L4351j71203l03410j06106J04577J20177R0265Q6127j46668
8956C3416j49490j27006p2555K75390L19835N8009j43011L9303k69112r6918J23688
8945h451L360J93937l0806q3753k2284k35303J6855J25799l6652l00493j46316
8934e24107Q9011j131j30976M4991J91236J31156N6488J2226R4218n9889m1512
8923a38289Q5114o8552R545J03293j29548J58997M4203j18723J29847N5728j71939
$$ y = [182983, 116369, -43665, 6860, 137410, -22906, -159668, -104880, 43192, -191159, 53494, 80179, 53356, 54069, 177191, 342217, 249520, 148047, 86197, 362431, 477227, 282682, 51353, -74116, -120641, 92974, 202551, 268457, 252036, 323791, 392044, 376779, 275987, 325306, 359657, 188454, -114956, -221062, -116485, 3692, 93957, 180084, 33416, -116074, -243080, -315635, -40245, 279590, 337599, 194588, 233891, -35221, -132139, -8451, -5091, 188846, 158040, 74287, 52003, -183300, -166445, -40646, -77298, -377791, -524107, -435096, -436227, -567203, -522212, -330976, -199820, -143332, -131106, -36888, -96777, -138289, -53175, -121727, -112182, -8889, -138437, 20560, 64763, -53960, 75887, 131615, -40324]
8912d0324o9150K09732o4210k0186l9629L2463n3838N4839M5392l32197l81009
8901f58117r5739L67797K39506J32442j76868j10542J41233j1496M6608p9848
8891b05024m5104J74227N7046o1877p7544N3298J72946k19315K475r7457J44977
8880a01352J14234J14822j21149J2088K87516j7323j79481j14832Q0654Q1803
8870A56980Q1413N541j8020r733l3513j73043j19567K5677P765N0922Q3041j39336
8858h1873j14367M0120Q7698j7408o0166Q1233n9018L02325M6947k62186k70951
8847c07646m7336J34291J0774j619r1246J119j22140J19234J16920r5152N4591
8836b28210J33741q1187Q5296n3146K1628J68656M202n0550n8828K03692n4499
$$ y = [-40324, -109474, 100258, 36048, 15862, -23767, 8696, -45142, 9697, 55089, -277108, -658117, -753856, -386059, -146553, -14111, -190979, -301521, -160288, -171784, -125176, -205024, -250128, -75901, -18855, -80732, -158276, -104978, 67968, -151347, -148872, -246329, -101352, 12882, 127704, 6555, 18643, 306159, 288836, 109355, -5477, 75177, 156980, 238393, 243934, 225914, 216181, 182668, 9625, -109942, -84265, -76500, -25578, 57463, -81873, -196240, -156120, -68422, -85830, -145996, -64763, -123781, 178544, 225491, -36695, -307646, -354982, -220691, -209917, -211536, -302782, -301663, -423803, -304569, -187649, -282801, -228210, -94469, -175656, -90360, -143506, -121878, 46778, 50980, 430, -58398, 145294, 90795]
8825I0795l16401j52555J74854p8871J66848R3604j4225K467k1795k28082Q0442
8814b02919P0094o1109O3082K362N28j35882J19287J02186j38559j03124m0387
8803c24441p4153o1934J03583q4742K9126J14829l5877J43697L7608j71975J43604
8792a80675J33354m1575j29505j31652J78524j16284j71164l9521K37605K6486
8782b34407p373q5681K20715J19033n4295J15911J04965q682j78553K45539M7132
8771B84304q4005k34529K6307j73856m1383M297J09825r2772j13317J49021L9867
8760a26241j02465n1375r4860J03481J14956K38067J09923p5852k05162l1908
8750a21436j54132r3681K43760L1620J58268J26209r6061J08019l4738J10358
$$ y = [90795, -225606, -378161, -203307, -282178, -115330, -21726, -35951, -33484, -55279, -283361, -202919, -132825, -193934, -130852, -128490, -127962, -263844, -144557, -42371, -180930, -284054, -324441, -398594, -460528, -356945, -441687, -412561, -297732, -333609, -189912, -152304, -324279, -180675, -47321, -88896, -218401, -350053, -171529, -287813, -458977, -498498, -260893, -234407, -241780, -327461, -106746, 12287, -42008, 73903, 178868, 170186, -8367, 237172, 284304, 200299, -34230, -7923, -181779, -223162, -218865, -109040, -201812, -315129, -166108, -126241, -228706, -280081, -374941, -271460, -156504, 81563, 191486, 115634, -89528, -121436, -275568, -369249, -125489, -93869, 64399, 190608, 94547, 202566, 167828, 278186]
8740B78186j29348l26720K9n965J57676K40008k1513M258q6875j19973r1510k8803
8728a30550M013O928k08581N7746J2947J19656m9827j59106o8397J80394J05280
8717a29497k08126J4248L83444J87692j03555k84512L6420N8400j9113o9321k25882
8706c59802k9784K84924j33882j33740K302p2456k0047J39949K37749l6359R7963
8695b3183J45421P729L1078o8170j71421M040K07756k37168r9760J81751M3258
8684B1331p7296j39643k9082r4270j25285K73874M54991j52867j68080j47596
8674a83923Q4932L24263o1837k02172N8488n289n1564L8935P5946J7819q6645
8663H953M7459J90111L9862j24580P0624j5241M2988M2682r131K2936n3476j73322
$$ y = [278186, 148838, -177882, -177853, -183818, -26142, 213866, 192353, 196611, 109736, -10237, -101747, -130550, -126537, -119609, -328190, -270444, -257497, -137841, -187668, -346774, -415171, -234777, -129497, -337623, -323375, 60069, 247761, 144206, -140306, -103886, -45486, -64599, -133920, -359802, -389586, -104662, -238544, -372284, -369982, -442438, -462485, -322536, -84787, -121146, -23183, 122238, 129967, 161045, 92875, -78546, -74506, 133250, -103918, -203678, -21927, 21331, -55965, -195608, -224690, -318960, -444245, -170371, 284620, 131753, -36327, -183923, -98991, 225272, 163435, -38737, 19751, 14462, -37102, 1833, 77779, 95598, 8953, 56412, 246523, 286385, 161805, 232429, 217188, 260176, 302858, 293727, 316663, 263187, 89865]
8651H9865K5760j17759J16265M5437L195k54576j33154J19619J17480j26829k57353
8640c72050J4150K79953M29089k1251k01433J5745j33521j08862K73925k1755
8630A53990j98228J7368j51788P2405M8008l5738j78808m3878K03803J10574m5764
8619d8056k47830K4042N8270j0299K1713O3179K88209J06264k6547O4098J95975
8608D89018j8720k7912M2002j10584j10744k54778j14693K9462J90454M2751j31160
8597B5096j29789J60625J84347k17881j43280J05775J24209k088J0175J1942Q1689
8586B10820J02580J40945j84178j33098j08992O1138m5411O3566k7583k83070
8576b03283j36307K52396R5563J24153K022P2199J05141R3835Q4528k04877o0149
$$ y = [89865, 115625, -2134, 114131, 159568, 162763, -91813, -224967, -105348, 12132, -114697, -372050, -357900, -77947, 351142, 329891, 128458, 144203, 10682, -98180, 175745, 153990, -44238, -26870, -178658, -106253, -58245, -93983, -272791, -316669, -112866, -2292, -48056, -295886, -271844, -213574, -223873, -202160, -138981, 149228, 255492, 228945, 293043, 489018, 470298, 442386, 484388, 373804, 263060, 8282, -106411, -76949, 113505, 156256, 25096, -104693, 55932, 240279, 22398, -120882, -15107, 109102, 107014, 117189, 129131, 210820, 313400, 454345, 270167, 137069, 28077, 89215, 43804, 107370, 79787, -203283, -339590, -87194, 8369, 132522, 134544, 206743, 311884, 405719, 490247, 285370, 225221]
8565B25221J6503k72377R2179J55246L21266Q6109j06060j24656r1492o4813N9200
8554B96326J64513K61145J80610j63285k86030j38274j99127m2769k366j25859
8544e5116J42785J34497J11559j4171k66417j20593M1698P2646J70665r1869l37052
8533b11368K20800J81718J262J31590R3301r8981k74464k79570J36516j69179
8523b68375j7639L10354P0125j71255r4678J29445P093O681p2507j21433J43770
8512g8419k06277l3826J9963J01299Q8599L7378r7399K384R0417R9102J01264
8501A24485N3515j68578q7933K984P8359m2191k82601J25859R5996J04215O2284
8490F6394r7415l0113n0030j6575n1340j2887k75957P3128L27506j01687P6461
$$ y = [225221, 241724, -30653, 61526, 216772, 538038, 624147, 518087, 393431, 301939, 237126, 296326, 460839, 721984, 902594, 739309, 453279, 315005, 115878, 73109, 70743, -55116, 87669, 222166, 333725, 319554, 53137, -67456, -25758, 46888, 217553, 125684, -211368, 9432, 191150, 192412, 324002, 417303, 318322, 43858, -235712, -99196, -268375, -286014, 24340, 94465, -76790, -171468, -42023, -34930, -28249, -100756, -222189, -78419, -284696, -318522, -298559, -197260, -108661, -71283, -168682, -166298, -75881, 23221, 124485, 178000, 9422, -78511, -75527, 2832, -39359, -321960, -196101, -100105, 4110, 66394, -31021, -61134, -111164, -127739, -179079, -191966, -467923, -394795, -67289, -168976, -92515]
8479i2515P7717j98931J61484J86717k85312q5790j870k6452P0380Q5924J24911
8468A6263q850l07094j38578J27660O7332J84539J20644J01942k55687l10481
8458d02310o0123P7343J35650O0374N7605K21728P377j33548O4355L4223j2333
8447E0341j15926j66072j49292q0760O8058J22694j65792j98623K18660K55103
8437a61609J95089J47721J43728l08276j87161K93419Q8467j81411j69921O9486
8427g0468J16029O5559L244J44600q6315o9263J19037J55387R8977k31796j74879
8416G0112N110M6037M8017j11466j60648J70342o843k14149L1847k7354L0138
8405a18857P667k25707Q0682J92066J7080n33k9762j56026j25830K74535O7020
$$ y = [-92515, -14798, -213729, -52245, 134472, -150840, -236630, -238500, -264952, -194572, -108648, 16263, 7413, -299681, -438259, -310599, -243267, -58728, 61916, 163858, -91829, -402310, -462433, -385090, -249440, -189066, -131461, 90267, 97644, -35904, 28451, 62674, 50341, -65585, -231657, -380949, -461709, -393651, -270957, -436749, -635372, -416712, -161609, 33480, 181201, 324929, 16653, -170508, 122911, 211378, 29967, -139954, -70468, 45561, 111120, 114364, 258964, 172649, 103386, 222423, 377810, 476787, 244991, 70112, 75222, 121259, 169276, 57810, -102838, 67504, 60661, -153488, -121641, -148995, -118857, -111190, -336897, -256215, -64149, -47069, -47602, -77364, -233390, -359220, -84685, -17665]
8394a7665m6107j05035k64996p205J25284J71125j7369n0301K23424j5271l0271
8383c4387m9967j20035J66595q7967m4949o0863K7453L9776P7261R173K33344
8372A55434J66476r5729J6415q4750P9163L7422r1034j46922j23505n0813n6160
8361a94003J41101p3845n5210j28777K0738J50286M39514p1668k52224j0997p9589
8350a14674J08223J41744K8541j25563o2491J41781j52749M7708j69422j16506
8340b73408J06504J20106L0463N5401k21316q6123r4190J15638P4657O772J74819
8329I323J5630k13578j71593K1940Q3868k5641J99305j39136n8028J28600L91291
8318B41981j02440j14437o5531J35130O5723j73961K3485J92909q2807L413n3986
$$ y = [-17665, -63772, -168807, -433803, -441008, -315724, -144599, -161968, -212269, 11155, -4116, -34387, -84354, -204389, -37794, -125761, -170710, -231573, -204120, -164344, -87083, -77910, 155434, 321910, 226181, 242596, 157846, 237009, 274431, 183397, 36475, -87030, -137843, -194003, -52902, -126747, -181957, -310734, -289996, -139710, 299804, 228136, -24088, -35085, -114674, -6451, 135293, 163834, 38271, -24220, 117561, -35188, 12520, -156902, -273408, -166904, -46798, -16335, 39066, -182250, -268373, -362563, -246925, -172268, -165496, 9323, 24953, -188625, -360218, -338278, -254410, -280051, -80746, -219882, -277910, -149310, 241981, 139541, 25104, -40427, 94703, 160426, -13535, 9950, 202859, 120052, 123465, 69479]
8307F9479N229j98474o0056J05275K4866k02738j65397r403j50108L72524L61087
8296A52284k38238m9556O0020l6576K78470J93904j27426n2378k01130p0834l42
8285i1802L4142j89992j34492j44617N6373K63089J90075M0275k75006j48932
8275d00887J51410k35144m9372J21813K50056R1975K2224k1405J75437K92599
8265C98706j30700k50460R9787J12804n409r64O3368j20002Q9246l2956N8627
8254B82047Q7257k23559q8698M6418L736P1506p1623j97326p1469n6627q5814
8243c04152l5945n8752r362J56388K11972J25217J16851l1134p7498k0985k8574
8232D4026r3145j39750j75770p4940J5233K91790J89932K5628J6482p334p811
$$ y = [69479, 74708, -123766, -183822, -78547, -53681, -256419, -421816, -431219, -581327, -208803, 152284, -85954, -135510, -75490, -112066, 166404, 360308, 232882, 180504, -20626, -91460, -91802, -57660, -247652, -382144, -526761, -470388, -207299, -17224, 23051, -251955, -400887, -249477, -484621, -533993, -412180, -162124, -70149, -47925, -69330, 106107, 398706, 268006, 17546, 117333, 230137, 224728, 223764, 287132, 167130, 256376, 223420, 282047, 369304, 145745, 57047, 103465, 107201, 178707, 107084, -90242, -161711, -218338, -304152, -340097, -398849, -408211, -251823, -39851, 85366, 202217, 171083, 93585, 72600, 44026, -49119, -188869, -364639, -439579, -424346, -132556, 57376, 83004, 99486, 92152, 84341]
8221H4341j70804o6916L5728P9642N8005J69870k18077k540J98059K5477k1398
8210A71387J18137M7419p4893j33362J596O9277o9578k11246K7508j05768R0662
8199f8861N064K1375l0162l7371j37799O7098K2270R7788j05133J00472L12049
8188B46790M9853o453O4745J49913K8433o6694n2822K3294l71434j63287R1758
8177e904O3685J64751J94135j63371l8241k8269n6322M1141m3153j06550l4165
8166a2263j12267m1671Q7426K78250m3958j52398m4279o2507j15703K66547L4658
8155H1835j20186L8022J80496O2420J32001o5043k54419q5017j98906J3779J52148
8144f2870q9569J32038J19385R888Q3572K23888j49713j68712j14162k1624J51464
$$ y = [84341, -86463, -153379, -117651, -38009, 19996, 189866, -28211, -30751, 167308, 192785, 171387, 289524, 336943, 262050, 128688, 130284, 199561, 129983, -81263, -53755, -159523, -68861, -63797, -42422, -72584, -109955, -247754, -180656, -158386, -60598, -165731, -65259, 246790, 296643, 290190, 354935, 504848, 533281, 466587, 413765, 437059, 65625, -97662, -5904, 57781, 222532, 416667, 253296, 215055, 186786, 130464, 171605, 128452, 21902, -12263, -124530, -166201, -78775, 199475, 155517, 3119, -41160, -103667, -219370, 47177, 81835, -38351, -329, 180167, 242587, 374588, 309545, 55126, -29891, -228797, -215018, -62870, -152439, -20401, 98984, 108872, 192444, 416332, 266619, 97907, -16255, -37879, 113585]
8133A13585J73997j39009K0000J8217J06820J43629j48142j05986M365N5450k36167
8122F759k3566J45916J124o0144k9575q8465n8636J67135O5190P5480K9749j30527
8110A00440m9705J16007O7002J61616j50168j03950j63695r9036J74509j2393
8100D0627L4640J62348k05608K1840J50248l8245r1647l38937J702K698J07085
8089a53249Q3558L7921J79837j46468j76780o0066J69364J63553Q5275k79206
8079i6261o8981J97462K08317j58571N6828P7582k19380l05324j84784O8123M29247
8068D258L86845j14693n4182J25911m7913M0066j9456k48765K5803J25783N534
8057B29191q1371M6064l6166q93m2205k16177k76184j9796J08802R7397K00694
$$ y = [113585, 287582, 148573, 168573, 186790, 293610, 437239, 289097, 183111, 187476, 242926, 6759, -16807, 129109, 130233, 70089, 40514, -47951, -106587, 60548, 125738, 201218, 230967, 100440, 50735, 166742, 233744, 395360, 245192, 141242, -22453, -121489, 53020, 40627, 75267, 237615, 32007, 53847, 204095, 165850, 74203, -264734, -263032, -260334, -153249, -69691, -31770, 148067, 1599, -175181, -235247, -65883, 97670, 182945, -96261, -165242, 32220, 240537, 81966, 138794, 216376, -3004, -308328, -493112, -424989, 4258, 391103, 276410, 222228, 348139, 300226, 340292, 320836, 72071, 97874, 223657, 229191, 147820, 193884, 157718, 156825, 114620, -101557, -377741, -397537, -288735, -191338, 9356]
8046I356J29723n1103K68120J11171j95006l0343L4967j61670J59752K25603M0544
8035E41114m6026L4709l10988j10820K19816J6202j27051l11961K4038J96195
8025A25228o5289k66454k12562M2844L1534J02143J00250J5703j28973j33193
8015c88769J90170J62828N838R0360K28325J50942j78159k45165J67134N6231
8005B39735P0076m9711k2985n8516n035k73201R6188P0152O7738J04911j24837
7994A14515j11778o3417L636j22260J94036J30716k16669R0458K63548j96985
7984H5800q8409K219L12286K00098k04570m31899p212J44605K19374o2140K7111
7973A97263O375J1146p4432L4815k19441N421L3288R0443j49687R5222K2060p3599
$$ y = [9356, 139079, 87976, 356096, 467267, 272261, 241918, 276885, 115215, 274967, 500570, 541114, 495088, 529797, 218809, 107989, 327805, 344007, 216956, -95005, -70967, 125228, 59939, -206515, -419077, -376233, -344699, -242556, -142306, -126603, -255576, -388769, -198599, -35771, -29933, 60427, 288752, 439694, 261535, 16370, 183504, 239735, 309811, 260100, 237115, 178599, 173564, -99637, -3449, 66703, 134441, 239352, 114515, 2737, -60680, -57044, -179304, 14732, 145448, -71221, 19237, 282785, 85800, -2609, -390, 311896, 511994, 307424, -124475, -131687, 12918, 232292, 170152, 197263, 203638, 214784, 140352, 175167, -44274, -38853, -5565, 84878, -64809, 30413, 52473, -21126]
7961b1126J99265n6752j77019Q9186J13041k9413J39101j0519l31335K5816K71006
7950B11251P7966M038j41307k96887j29400J42224q5305n2699M01595J72755J44630
7939D48861J368j04861k25592n4942N7375m0908l26695j27240R8469J25877J00311
7928d7977k1909L12092P8889k44545k820J4967j78280j60307Q3690M287j04892
7917b66805N6256L14401m0617p6541j11023K47614L12925J40015k74649p7042
7907B24534j62116j41050K27659K13258j8448k945l49380k5647L00392l6874j92661
7896C6722m6397o7060o4687j34211J07726K09859q561L2542k92006M7710J09407
7885f8956R9161K5508p7579j91565j43225K82801L4175P5336r6309J0830J17042
$$ y = [-21126, 178139, 121387, -55632, 33554, 146595, 117182, 256283, 245764, -85571, -59755, 211251, 289217, 293255, 151948, -144939, -274339, -132115, -217420, -270119, 131476, 304231, 448861, 450229, 345368, 119776, 64834, 122209, 81301, -245394, -372634, -274165, -148288, -47977, -69886, 242206, 321095, 76550, 73730, 88697, -89583, -249890, -166200, -161913, -266805, -210549, 103852, 63235, -13306, -124329, 123285, 436210, 576225, 301576, 224534, 62418, -78632, 149027, 362285, 343837, 340892, -8488, -34135, 266257, 229383, 36722, -9675, -76735, -141422, -275633, -167907, 41952, 33391, 65933, -226073, -178363, -68956, 30205, 55713, -21866, -213431, -356656, -73855, -39680, 35656, -60653, -49823, 67219]
7874F7219m6217J98039J80025k64415m41673Q9037K61514J01158l6554R0370L5695
7863B34198k35180j50064q1568o0313r5449j6913J73638K74431Q040l48706j69180
7852d67066m25O4177J40364j35035J50455J8148j45968J57158K68220Q7653j06682
7841C0999j3821J63503p911k09813k16320j19251Q2119P395J68779K25254k44503
7830a33570o1492J06207J72543O4745r8151n510Q6506O8535j01669J6020l3472
7819H0692l4369K12665N3204j58052k5797L4186n9713J07999J01687L8531k24621
7808A26412M3487l8693k07161n8848J82776K26233L2019J10538J221j44874L0223
7797C03333j15405j46504q5675Q7579K96666k0321l8980Q0319P6896j52807l71623
$$ y = [67219, 21002, 219041, 399066, 134651, -307022, -217985, 43529, 144687, 108133, 198503, 234198, -982, -151046, -232614, -292927, -388376, -405289, -231651, 42780, 50820, -297886, -467066, -467491, -403314, -262950, -397985, -247530, -229382, -375350, -218192, 50028, 137681, 30999, 17178, 180681, 172770, -37043, -253363, -372614, -290495, -283100, -114321, 110933, -133570, -195062, -88855, 83688, 148433, 50282, 44772, 131278, 199813, 98144, 114164, 80692, 46323, 258988, 312192, 154140, 128343, 162529, 102816, 210815, 312502, 351033, 126412, 169899, 131206, -75955, -134803, 47973, 274206, 306225, 416763, 417984, 273110, 303333, 187928, 41424, -44251, 43328, 339994, 319673, 280693, 361012, 437908, 285101, -86522]
7786h6522L0997L2377q6743j25443k9340J91706J62553N5439K03685J9884l70140
7775a547N1317J40913R703q200j0785R0028o4736J04187l34183j39023o06q011
7763a70943R8827p7625J04636L09578j68728j06180l74164K7757J75702J15418
7753f5722J20940n4901n2880r1476k11146J13734K09823J65022J97346j88280
7743A42460N8583j9806j17841N4554n8526R9017l9418j64566J83230M5004q9755
7732I2936k801N380N3065r9246j26615K71672L6604k57792r2720o8795n5421N7707
7720a86026O2518J14765K42765J8683k88973M0003O6537q7932K8202m6141r2718
7709a28317j37988P7432K57056J2833L2173k72973l04543J02857O0567N9941q9160
$$ y = [-86522, -55525, -23148, -109891, -235334, -264674, -72968, 89585, 145024, 348709, 368593, -1547, 49770, 190683, 200386, 192186, 181401, 271429, 206693, 310880, -23303, -162326, -162932, -170943, -72116, -149741, -45105, 264473, 95745, -10435, -384599, -356842, -181140, -65722, 55218, 317, -52563, -144039, -355185, -241451, -31628, 133394, 330740, 142460, 201043, 181237, 63396, 117950, 59424, 158441, 119023, -45543, 137687, 182691, 92936, 90135, 95515, 148580, 49334, -77281, 194391, 230995, -26797, -119517, -188312, -243733, -186026, -123508, -8743, 234022, 252705, -36268, 3735, 70272, -17660, 10542, -35599, -128317, -266305, -188873, 68183, 81016, 113189, -159784, -464327, -361470, -300903, -240962, -330122]
7698c30122L95923J58151j35312J4592K4369j14136J15600l26703M5402K11470
7688E9234k5295J43168k5625l0827J5994p6224M5945J68905J40184m7176j32047
7677B36236l57261J33434L14600J60883k40477j96909k60826J1592N8880R9452
7667d0396l0421k8315Q2529J84309L76328J0471n6256j63068p5043k8502p1584
7656A60052j86545k73092j48433J25311K49179R4742j06438J07768J52785j1135
7646A64194q5182J9006K28576N0443j63655o8280M9509r7507J82482M3665j63762
7635A59489l4136j30714j95401J43956K09917j5221p3835K98002r9883l35065
7625g2891k31901K49215J99075j63964l37935p6131K19520J34168M7814K50843
$$ y = [-330122, 65801, 223952, 88640, 103232, 127601, 13465, 129065, -197638, -152236, 59234, 33939, 177107, 151482, 120655, 136649, 60425, 106370, 275275, 415459, 368283, 236236, -121025, 12409, 327009, 487892, 247415, 50506, -210320, -198728, -139848, -40396, -70817, -99132, -16603, 167706, 544034, 554505, 498249, 335181, 260138, 231636, 160052, -26493, -299585, -448018, -322707, -73528, 21214, -85224, 22544, 175329, 164194, 79012, 98018, 326594, 377037, 213382, 145102, 194611, 97104, 279586, 323251, 159489, 125353, -5361, -200762, -56806, 153111, 137890, 64055, 362057, 262174, -72891, -304792, -55577, 143498, -20466, -358401, -434532, -215012, -80844, -33030, 217813]
7615B17813J71268j175k3030L7684k35320O6433J82240p8909j76997j46544k5105
7604a1642n9366r0911J27802J27803j51269r3052p498J29012J90465O3042j61204
7593F3182k0624r7240j88063j85135J01862J36052J13600k8926m8240K31802J6568
7582I4838m3257j4144J02341j57717k51171M906K13904J85428K0506k5266j44379
7571a4011k5075j720J11060Q0350O0771K14785j6378P9630K22140j29347K1757
7560F03962j06690j95327k25333l4234O6448j291J26526K2252p1713o0402r3544
7549C0654n1986K622L449l5934Q1728m7832O3027K62790o2433L5401K03651k94467
7537A90670k06279J18272k23758k70998J88091K53828o8809m2737P2319J48457
$$ y = [217813, 389081, 387906, 364876, 402560, 167240, 233673, 415913, 337004, 160007, 13463, -11642, -71008, -161919, -34117, 93686, -57583, -150635, -158133, -29121, 161344, 224386, 63182, 42558, -54682, -242745, -427880, -326018, -189966, -76366, -105292, -153532, 78270, 94838, 51581, 37437, 139778, -17939, -269110, -264204, -50300, 135128, 155634, 130368, -14011, -39086, -40806, 70254, 150604, 211375, 426160, 409782, 489412, 711552, 582205, 603962, 497272, 301945, 76612, 42378, 108826, 107535, 234061, 256313, 184600, 124198, 30654, -21332, -18710, -15261, -51195, 30533, -17299, 45728, 308518, 246085, 281486, 485137, 190670, -15609, 102663, -121095, -392093, -204002, 49826, -18983, -61720, 10599, 159056]
7527A59056J22857j39098l03237J9786N8524J08088J21133R3154Q1378k36951
7517H4690n4784K6264J83050K72342k07366k10550j95048k06862J11132L49375
7507A52243J96228p3900j61719j86677j71966N4459J44379J89307Q1527j6229
7497B07652r5724m8525p9741K24056p3706j22673O6844l3924j05828k03968L1529
7486b34008R266j35979q6284K82234N78535j03130j04889M9350k58523K0142k92165
7475b75451Q8793L04294Q5955j77549M7872l4823k10490m2127L5475j20311q9039
7464c87401K75430J99752J4016q5699k01683j30745m354J40327K48655j44847
7454g6549j80602k6941J49467m6607K403r191K36187J71655J25755K797k1290
$$ y = [159056, 281913, 142815, -160422, -140636, -82112, 25976, 147109, 240263, 321641, 84690, 29906, 56170, 239220, 511562, 304196, 93646, -101402, -308264, -197132, 152243, 348471, 274571, 112852, -73825, -245791, -191332, -46953, 142354, 223881, 207652, 111928, 63403, -16338, 207718, 134012, 11339, 78183, 44259, -61569, -265537, -234008, -224742, -360721, -447005, -164771, 413764, 310634, 205745, 255095, -3428, 16714, -275451, -186658, 117636, 203591, 26042, 73914, 39091, -171399, -213526, -178051, -298362, -387401, -111971, 87781, 101797, 16098, -185585, -316330, -320684, -180357, 68298, -76549, -257151, -284092, -134625, -181232, -178829, -188020, 48167, 219822, 345577, 348374, 327084]
7443C27084j8739j86647j40625J45138k4028J09121M9932j14596L193j10074P5112
7432A14871j25979Q3924m1614o9631q2363J70080m994j95200j06189J73732J55139
7421G1776J70967J28073l374r0282j04958m7751k17530M7399K28708J43033L4635
7410C60696j57525j28132R0606j3771o6229N4514j11594Q8388k95262N3840k2763
7399a47232o0686J27368P7276M4128k634o1488J2632j518L2495j19909M4649K31874
7387A76955O9352K48124J2483k24868j80322r2593j86456k8398p2702L6981O5816
7376a75628M9282K09690P6972j78181k3475n9269L16009J4871l43562j75966R1514
7365a97743N4850J11885j539k60811m7679L70263Q9858k29480l057L8289O241
$$ y = [327084, 308345, 121698, -18927, 126211, 102183, 211304, 261236, 146640, 149833, 39759, 114871, -11108, 72816, 31202, -38429, -120792, 49288, 44294, -150906, -257095, -83363, 71776, 242743, 370816, 367442, 277160, 172202, 124451, -93079, -45680, 183028, 326061, 360696, 203171, 75039, 165645, 151874, 85645, 140159, 28565, 116953, -178309, -124469, -147232, -207918, -80550, -3274, 40854, 38220, -23268, -10636, -12154, 20341, -99568, -54919, 176955, 246307, 494431, 506914, 282046, 101724, 9131, -177325, -205723, -278425, -241444, -175628, -126346, 83344, 160316, -17865, -41340, -100609, 215400, 230271, -113291, -289257, -197743, -142893, -31008, -32547, -293358, -341037, 29226, 119084, -110396, -113453, -75164, -68923]
7354f8923J487q190p1138J45003J68945j55929r7029R049l5327J18788P9963o470
7342H0229j4826J72216J46063R670r2572j35334k15849P8924K1k12162J40007
7331d3613J9876J0554l1594J07510J253j83315k07246j25117L3735J39985J25176
7320a52796j51519L0173Q3127J65965j44128k8443j20029j21215m2072R005Q6866
7309c85066N1765K32583J84364J22901q6504L2749J30321J27421N9297j06558
7299C63273k78699J30376M9506k47710L9114J41687K4991J13701k59571j24655
7289d7987M3456k2102J02360R0024k1067k57912j89812J39989K08901R9132R9178
7278B44160O2440j13934J28581j35266j66032L8949L6627M9407K21787M8205j82167
$$ y = [-68923, -67436, -75626, -146764, -1761, 167184, 11255, -85774, -76725, -112052, 6736, 86699, 80229, 65403, 237619, 383682, 393352, 300780, 165446, -50403, 28521, 28542, -183620, -43613, -23737, -13183, -44777, 62733, 63986, -119329, -326575, -451692, -417957, -277972, -152796, -304315, -274142, -191015, -25050, -169178, -197621, -317650, -438865, -480937, -471932, -385066, -333301, -100718, 83646, 206547, 120043, 152792, 283113, 410534, 469831, 363273, 84574, 214950, 264456, 16746, 55860, 197547, 222538, 336239, 76668, -47987, -4531, -26633, 75727, 165751, 144684, -113228, -303040, -163051, 45850, 144982, 244160, 306600, 192666, 321247, 185981, 19949, 58898, 95525, 144932, 366719, 414924, 232757]
7267B32757l93115J4740Q1223J67409n583j17244L14364M2097j68123P0051O5895
7256C04471r1970j71491R8407Q1726O9072k010P4346O8551j96724l71201k7509
7245a64332n5212R829J40527K3808P2674J8971J36440N666j36965j49799N2616
7234d5777K4996j42734J27906m1251J19855J00129J13536j611k10906n1295j20346
7223a27498P7088K65931m8440j31627k84532J07253L39036q0288o2160l1705J05918
7212A28976P3115j03424j22088q3128J92263O7428j0912J54665P2870j91871r0154
7201H7740K38308J44879Q8317J09665j51204m12200k05782O3761N4319J65342
7191A83145Q5197L3302J06010n1311k32812j51648p2076K68837n8176m4136k1474
$$ y = [232757, -160358, -145618, -64395, 103014, 97431, -19813, 294551, 336648, 168525, 238576, 304471, 212501, 41010, 139417, 221143, 290215, 288205, 362551, 431102, 234378, -136823, -164332, -219544, -209715, -69188, -45380, 27294, 46265, 182705, 188371, 51406, -98393, -45777, -20781, -163515, -35609, -76860, 42995, 143124, 256660, 255049, 44143, -7152, -127498, -50410, 215521, 167081, 35454, -249078, -141825, 197211, 116923, 54763, 23058, 128976, 202091, 98667, -23421, -106549, 85714, 153142, 142230, 296895, 369765, 177894, 87740, 326048, 470927, 559244, 668909, 517705, 105505, -100277, -36516, 17803, 183145, 268342, 301644, 407654, 356343, 123531, -28117, -100193, 168644, 110468, 66332, 44858]
7180D4858j13115K11545J56528k71771l1703r0522k25633q6812K03826L5027p9442
7169b47214J07005K19278l183j10875J51431j0229O0453R0489k62333k34094J32355
7158a06917K36647J16006j20226L1837J54800j26251j77903n503k16654R3342
7148a20822m9604p6568J23077J78032J74253J40033r5098m693K767j60637j44187
7137c3447l30132k57949J99741K27982J43641R0036K84845P0243Q4802k4892k57502
7126A97368j96980r1982m4057K75655j24206k15025J49856k8480J09362J79307
7116B10818j27557L3247J19582j71579j91235K15494O0730j42839j60292O1326
7106i2305K2732J32209O7215o197k13311n9094j11657k6847O2252J66901J52735
$$ y = [44858, -68257, 143288, 299816, 28045, -3658, -94180, -319813, -406625, -202799, -167772, -247214, -140209, 79069, 75886, -34989, 116442, 106213, 166666, 257155, -5178, -239272, -106917, 129730, 245736, 125510, 157347, 312147, 185896, 7993, 2490, -214164, -120822, -170426, -246994, -123917, 54115, 228368, 368401, 273303, 268610, 271377, 110740, -33447, -363579, -621528, -421787, -193805, -50164, 39872, 324717, 394960, 479762, 454870, 197368, 388, -91594, -135651, 140004, 15798, -199227, -49371, -77851, 31511, 210818, 83261, 116508, 236090, 64511, -126724, 88770, 149500, 6661, -153631, -92305, -69573, 62636, 129851, 123654, -89657, -148751, -260408, -287255, -225003, -58102, 94633]
7095I4633K78223K36158m18692m12135K9107l4763J83418j27118m9156o9279j1951
7084c01555K88583j66279j46552J65326N0188P6287j528p283j8870J53158Q8363
7073A79838m0128P2905O5974k02329J827p795k1946Q1920O4117K41635J77059
7062F13077k27527j93921r5828L523j32021l26268J21805K38192J4332j00244
7052h4880j74474J33401R8202L7210j85356N3874q2353J91906K44478l5602j66945
7041B9461r4639k60606P2781K91777M00046J2141j75679j5372m8339k23250q5839
7030i7518J17073Q127O4863K2234L6712j31024r1870n2450Q0275J0395R3346J98673
7018B58836k52420j54240J92447K9713q6770L3556O9318r6600K3725J3292N5220
$$ y = [94633, 372856, 609014, 190322, -221813, -192706, -227469, -44051, -171169, -220325, -289604, -301555, -12972, -179251, -325803, -160477, -110289, -34002, -35530, -42813, -61683, 91475, 179838, 139710, 212615, 278589, 76260, 78087, 70292, 48346, 130266, 194383, 436018, 613077, 385550, 191629, 95801, 99324, -32697, -358965, -237160, 1032, 15364, -84880, -259354, -125953, -27751, 9459, -175897, -122023, -204376, -12470, 232008, 196406, 29461, -65178, -325784, -253003, 38774, 438820, 450961, 275282, 259910, 211571, -11679, -97518, 19555, 27682, 92545, 114779, 151491, 20467, -71403, -123853, -43578, -33183, 60163, 258836, 6416, -147824, 44623, 74336, -12434, 21122, 90440, -6160, 17565, 30857, 86077]
7007H6077J30032R1050J31375J5990j02087k83655j93544J41932M0375j20934
6997f3389J40294J17173M945j87932J5455P4818N0916l50776k60542J89691L33843
6986F4496J10692P1261j41490J37881J06574k30807j32869P8876L6649k92531
6976a91268k79524K90035M03502J87299l20863j07958r1717m3839j09791l4798
6966b98922K78493K74811J64426j34723q0241N8670m4165j14629q0594K18998
6956B42124J10495K8223j27286l430n5717l1842q5355K36780K29285k39171l44263
6945d0157J11890L49679j91217K7084k06880j75306N8053J10286K82652q567j01
6934C17416m1615J21177K0767N2897j7380m26284q040J67161n3938L3832K07699
$$ y = [86077, 216109, 307159, 438534, 454524, 352437, 68782, -124762, 17170, 57545, -63389, 76905, 194078, 199023, 11091, 26546, 101364, 152280, -198496, -459038, -269347, 64496, 175188, 246449, 104959, 242840, 349414, 118607, -14262, 64614, 101263, -191268, -470792, -180757, 222745, 410044, 89181, -18777, -110494, -154333, -264124, -298922, -20429, 254382, 418808, 284085, 203844, 262514, 218349, 103720, 23126, 242124, 352619, 380842, 253556, 250126, 194409, 162567, 77212, 313992, 543277, 304106, -40157, 71733, 421412, 230195, 257279, 50399, -124907, -66854, 43432, 326084, 317517, 317416, 275801, 396978, 417745, 470642, 453262, 26978, 18938, 186099, 132161, 165993, 373692]
6923C73692J43727k6208m006j37964j31104j38906p2129j43409P7754K1577L5471
6912a505j08159M3731m6492N7117L03110n0350n8922N2635j33750j16901j8545
6901g8031L72645K05615k8575m29455L7288K34588O9190l1055j7671P9783k48489
6890A65833j52356j26924J36527Q2529l0184K1209j9719J71929j48018j5704r6389
6879a1267k8497q6463l8377Q5156K7317j11019k04465m745m9628N9357K56495
6868a06136k9857j16351r3911j952J17949K28593K28729m1303n5603K3522k32954
6857g9274o3601J14905J6812n3791J37970J7416p9185Q5922K1151K9383k6774
6846A20934j40500J71754K44483J42407k35303p0235N2829k58409K14047K83203
$$ y = [373692, 517419, 491211, 487205, 349241, 218137, 79231, 7102, -136307, -58553, -36976, -1505, -109664, -65933, -112425, -55308, 247802, 197452, 138530, 191165, 57415, -59486, -78031, 294614, 500229, 471654, 42199, 79487, 314075, 383265, 352210, 334539, 414322, 165833, 13477, -113447, 23080, 105609, 75425, 96634, 76915, 248844, 100826, 85122, -11267, -39764, -126227, -164604, -79448, -52131, -163150, -367615, -372360, -421988, -362631, -106136, -135993, -252344, -346255, -348207, -230258, -1665, 227064, 185761, 130158, 153680, -79274, -142875, -27970, -11158, -64949, 73021, 90437, 11252, 97174, 118325, 147708, 120934, -19566, 152188, 396671, 539078, 303775, 233540, 286369, 27960, 242007, 525210]
6836E25210j20993r7395M7092k75778j59127j10784K24003L89239N4388K7660
6826E03515m4279j83161j49163j78405j61841m2048O2869L0370P7785j03690r275
6815a97323M2616M6922p8537j45896o3335J92099J80782n3401k23793J44798K83793
6804A28725J73711M6805M6909o9719o049j5564J00807J7943j09917j87045L8186
6793A64792k9585j07971j16548k34499J57512K03072K3409k7413j45666p6477
6783a89374J21944M9951q4716k5467l01396j7344K82774K57777J88730J83915
6773D66794l7884j334j1444L6110o0881k65260J04390K2461j37940j58054l423
6762d6465q6974J80858O3078K5253K551n9996K7485r5704J01046l7760j01800
$$ y = [525210, 404217, 306822, 353914, 78136, -80991, -191775, 32228, 421467, 475855, 503515, 459236, 276075, 126912, -51493, -213334, -255382, -192513, -162143, -84358, -188048, -197323, -154707, -107785, -186322, -332218, -395553, -203454, -22672, -76073, -299866, -155068, 128725, 302436, 349241, 396150, 326431, 320382, 304818, 405625, 423568, 313651, 126606, 164792, 135207, 27236, -89312, -323811, -166299, 36773, 60182, 32769, -112897, -189374, -67430, -17479, -102195, -127662, -429058, -446402, -163628, 94149, 282879, 466794, 428910, 427576, 416132, 452242, 391361, 126101, 230491, 252952, 115012, -43042, -46465, -133439, 47419, 110497, 135750, 138301, 78305, 105790, 10086, 111132, 73372, -28428]
6751b8428K26047P9023j03879n9180j43126p2340L4533r2334N9134J50782K3111
6740G3343O6404J03515l118k08771j3257J33526j33607o6424j07076m6505k1092
6729b23062J94510K67107M4422k34488Q5617j18897J9605Q0237n2275p4263R9457
6718H7970o3598K06965k0629l02636j51094J92509n8343J52302j80773j59137
6708b96464M602J37858M7179O8035l8699J6833J44057r8771p0039o9553P2687
6697h2275J75259K27563J17707j61625j54088j71340P4327m1492l4428K4636k1047
6686d6803j11221l1536J5955p0940k38842K22055K53307J28165k19398q3670K56273
6675G3345J55128J42541j00540k69665j26465J67656J75434p08l1524j74014j72898
$$ y = [-28428, 197619, 276642, 172763, 113583, -29543, -101883, -67350, -159684, -100550, 50232, 73343, 139747, 243262, 240144, 31373, 18116, 151642, 18035, -48389, -155465, -201970, -223062, -28552, 238555, 282977, 48489, 134106, 15209, 34814, 115051, 62776, -11487, 87970, 24372, 231337, 210708, -91928, -243022, -50513, -108856, 43446, -137327, -296464, -291862, -154004, -106825, -38790, -77489, -60656, 83401, -15370, -85409, -154962, -82275, 92984, 320547, 438254, 276629, 122541, -48799, 25528, -15964, -50392, -25756, -46803, -158024, -189560, -173605, -244545, -483387, -261332, -8025, 120140, -99258, -182928, 73345, 228473, 371014, 270474, 809, -125656, 42000, 217434, 216726, 185202, 11188, -161710]
6664a61710K0358O8941J4037J5986P760j07686k2147J59737l8398J5704J7552
6653i866j59711m6017r6608j25978J10769J91544K67275j32311n6002r6757J66788
6642A3126L7528r0621N7388K67501j5324k86508j12539j29668n6368J17766J25661
6631g2058r5264j89876N1785J50647P7085J36502j21211j52925K70823J61585
6621B17093o2780m0358j87136k11232J55108K65539M3183k06478k66611J96930
6611i6742J80453j72657j67101K28574J76057K430m39687K0998K24830J73365
6601A30520j1349k1233J5344j4076q824j20416K3035j85994l5179J07112Q5788
6590c5272k99775J27790K24905k7503l9973J27118P5295j61018j49611L4973J55042
$$ y = [-161710, -141352, -72411, -58374, -42388, -34628, -142314, -164461, -4724, -43122, -27418, -9866, -169577, -215594, -312202, -438180, -327411, -135867, 131408, -903, -56905, -153662, 13126, 50654, -39967, 17421, 284922, 269598, -16910, -129449, -259117, -315485, -197719, -72058, -167322, -357198, -305413, -154766, -77681, 58821, -62390, -215315, 55508, 217093, 154313, 113955, -73181, -284413, -129305, 136234, 179417, -27061, -293672, -96742, 83711, -88946, -256047, -27473, 148584, 151014, -288673, -267675, -42845, 130520, 119171, 97938, 113282, 99206, 90382, -30034, -6999, -192993, -228172, -121060, -35272, -335047, -207257, 17648, -9855, -49828, 77290, 152585, -8433, -158044, -123071, 31971]
6579C1971K48296J00751n22226k91297r0238K48424L73770K97180p3792R5120
6569D17959P9818q8629j14977J2118k54209j42175J0950Q9687O3149Q3752M240
6558A61683J6967P6305m1160j15658K7836r2029Q6313J24255k01019o7726M4539
6547B0306K3386j02776j77570j4258J57187Q1375P6026J50585J79037j47298n0618
6536A95382K6534p195j88504l3104k08711J56748K28110j72379P5926K95261j06986
6525B61082j78048J40070K72962J41344j79077j79435k41669N9184J99386J04632
6515D00431r0471j44928J30117p4605j95684j3945J71n7789J95160J36032m8516
6504B35973j33678p4437r2263j4942J63936J6297K17986l8684m1541j26092q8204
$$ y = [31971, 280267, 381018, -141208, -432505, -522743, -274319, 99451, 396631, 322839, 417959, 497777, 409148, 294171, 306289, 52080, -90095, -79145, 10542, 73691, 157443, 161683, 178650, 254955, 213795, 98137, 125973, 33944, 120257, 244512, 43493, -24233, 20306, 43692, -59084, -236654, -250912, -93725, -12350, 63676, 214261, 393298, 246000, 195382, 221916, 214721, 26217, -6887, -215598, -58850, 169260, -3119, 72807, 368068, 261082, 83034, 223104, 496066, 637410, 458333, 278898, 37229, 96413, 295799, 400431, 309960, 165032, 295149, 220544, 24860, 10915, 11086, -46703, 148457, 284489, 235973, 102295, 27858, -64405, -79347, 84589, 100886, 318872, 280188, 238647, 112555, 24351]
6493B4351J92727J28308n74959q5289j18419J00856K90352J70432L8137j09451
6483E7045J36181P7946j37508N3487J05955j40018l41994k95903j62992o5074
6473g12875J31343L75066K17318Q3810N5007k09984j9763N6613L43090k54148
6463F5477k72744K5977J94028L10627j65558j84106j82504m6552j06785j7231
6453c79371j20888J31303J27158J62162J58963l6993q0877Q4172Q9453q5589o1533
6442a2040L9280N2304k4116O309k09623L7568J7063J15068j44091j11626J32332
6431a01572J74582r5300p2495k0902K7354N3477J13144J65220j97374P54J03022
6420A49910j72808K7420j22167P6307j1932k67837L8425k39322K33157r5134m4576
$$ y = [24351, 217078, 345386, -229573, -314862, -433281, -332425, -42073, 128359, 166496, 57045, 193226, 271172, 133664, 187151, 293106, 153088, -188906, -484809, -647801, -712875, -581532, -206466, 10852, 94662, 149669, -60315, -80078, -23465, 319625, 65477, -207267, -181290, 12738, 323365, 157807, -26299, -208803, -255355, -362140, -379371, -500259, -368956, -241798, -79636, 79327, 42334, -38543, 45629, 135082, 49493, -12040, 27240, 79544, 55428, 61737, -147886, -110318, -93255, 21813, -122278, -233904, -101572, 73010, -22290, -94785, -115687, -88333, -34856, 78288, 243508, 46134, 46888, 149910, -22898, 4522, -117645, -41338, -53270, -321107, -282682, -522004, -288847, -383981, -428557]
6409d28557N9080K82719R5730K49788R5485j40375K2427j56376L404K12857K3696
6398C19878j70900k96203J123j25299m6289Q4257J12531j425p9586l7749K03664
6387c5998J3300R1797q5246j81120k12734R6906Q751l2804J38463k2465J57426
6376f3724M9887j5334j44433j65100J7519l5071Q0932K20366K53992j55374j33106
6365h9446L1292J19855Q1453Q0385O6217j39499j28872P937k3323j50097l5484
6354a79582J07687J54674Q5546k93280K18792M66119O6398L6539q7048k67112
6344C08733j83054j32550j80285K8103K52091j62404j24472O7730q8386o2881
6334b77375M7956O5247L9778O7974j28302q4861k34502j5733J77231K94808J18660
$$ y = [-428557, -369477, -86758, 8972, 258760, 354245, 213870, 236297, 79921, 83325, 296182, 319878, 148978, -147225, -146102, -271401, -317690, -233433, -120902, -122327, -201913, -239662, -35998, -22698, 69099, -16147, -197267, -410001, -313095, -304344, -337148, -198685, -221150, -63724, -13837, -29171, -173604, -338704, -321185, -356256, -275324, -54958, 199034, 43660, -89446, -58154, 61701, 143154, 223539, 289756, 150257, 21385, 29322, 5999, -144098, -179582, -71895, 82779, 168325, -124955, 93837, 559956, 626354, 662893, 575845, 308733, 125679, -6871, -187156, -159053, 93038, -69366, -193838, -126108, -214494, -277375, -229419, -164172, -124394, -56420, -184722, -269583, -504085, -519818, -342587, -47779, 70881]
6323G0881N263K51762m8336r0559j56729P6859l0185j16131m8041N4968j87161
6312b17409j6024L5352O7416p406r7588k27120q3505P6757L59703O8729j50004
6301a91099o9421J18357p0911p1877J5317j3047Q9397J28153j8784m3052M2097
6290h4870J49146n5860k68530m4823K08478K41417O4351K5666K1855J4388j18634
6279A52584j32010J91739k322l00612k12115R0933M6682K15121J05171p5993J25404
6268B04582o3875P4332j43269l02468M773L38433Q6734J66474K84232j92828k02865
6257B54255M6443J43031o2178j31050k27686J2759K62008p0004j20830l7729j13253
6246d4234l97395j15844M8370N8341N0046k6388R6315R3258J53153j6462L3343
$$ y = [70881, 76144, 327906, 279570, 189011, 32282, 109141, 78956, -37175, -85216, -30248, -217409, -233433, -198081, -130665, -138071, -235659, -462779, -546284, -469527, -109824, -41095, -191099, -260520, -142163, -213074, -284951, -269634, -282681, -193284, -65131, -83915, -126967, -84870, 64276, 8416, -260114, -304937, -96459, 144958, 209309, 234975, 256830, 271218, 152584, 20574, 212313, 209991, -90621, -302736, -211803, -165121, 50000, 155171, 79178, 204582, 140707, 215039, 71770, -230698, -225925, 112508, 199242, 365716, 649948, 457120, 254255, 300698, 443729, 381551, 250501, 22815, 35574, 297582, 227578, 106748, 69019, -44234, -441629, -557473, -509103, -450762, -400716, -427104, -330789, -237531, -84378, -100840, -67497]
6235f7497L08355J30464k57966j75890N8778p6186j70633l0844l3460L1490K65403
6224a7986L16701P5410N809J0739k24938k47557J75118P7422o0160j22839o5715
6213g7996M0904J15507l7012L0027P7512N179p3998K4656j1702N754n8576j21012
6201h0757k7023k1967j03321P2863J40285Q6007N506k05250j39861J12661R0108
6190g0749O4873O5050P0356j72744q5401L3157q8659L0837K46192K66217L10132
6179F69261q2688j64618K8336j75630j56101J06690J68019M8109k73766j88942
6169b1330J81164K35117n2950k52480o6859l13697k2023q1747m0750K03267K60218
6158B7930P6712O9646R4133q869j60454K40808M4923J62512r1517l26324k6518
$$ y = [-67497, 240858, 371322, 113356, -62534, -3756, -79942, -250575, -281419, -314879, -283389, -17986, 298715, 374125, 379934, 390673, 165735, -81822, 93296, 170718, 110558, -12281, -77996, -37092, 78415, 41403, 71430, 148942, 154121, 80123, 104779, 93077, 98831, 40255, -80757, -107780, -129747, -233068, -160205, -19920, 66087, 71593, -133657, -273518, -160857, -70749, -5876, 59174, 129530, -43214, -128615, -95458, -184117, -153280, 92912, 359129, 669261, 586573, 421955, 450291, 274661, 118560, 225250, 393269, 441378, 167612, -21330, 159834, 394951, 342001, 89521, 22662, -291035, -313058, -394805, -435555, -232288, 27930, 104642, 174288, 268421, 259552, 99098, 339906, 384829, 547341, 455824, 129500, 102982]
6147A02982N0698o1413J57012K28472J86283r8075l90644j76384j78996j97139
6137c77204K94096J18633J22731P8590k3463j95132o00N6147J04764J44494J8620
6126C41676J2184j47308n9603J01022j59706k71611l8868J37555Q1451J02675
6116I9467N9862j36117J5274J02832J82243J82120j69651m7946O459n7223j99854
6105C7466l870K55923R1341p3717l38149J83687j302M4678J2738O7794m3367k65212
6093c1990j73462k9301P7398J87515L6453J77789k42397k40508J82734m0936J39983
6082D3278Q5595m9139k4385P3737j25259k05788j86550J21219J68169O4593K27683
6071A93153L5908M9304j1477j64445q1506j08374N7013K9522r0689O6901J86316
$$ y = [102982, 153680, 92267, 249279, 477751, 664034, 565959, 175315, -1069, -180065, -377204, -83108, 35525, 158256, 236846, 213383, 18251, 17651, 73798, 178562, 323056, 341676, 353860, 206552, 146949, 247971, 88265, -183346, -222214, -84659, -3208, 99467, 159329, 23212, 38486, 141318, 323561, 505681, 336030, 288084, 294543, 237320, 37466, 33596, 289519, 380860, 307143, -31006, 152681, 151379, 196057, 208795, 276589, 233222, -31990, -205452, -234753, -157355, 30160, 66613, 244402, 2005, -238503, -55769, -96705, 43278, 128873, 79734, 55349, 129086, 3827, -201961, -388511, -267292, -99123, -34530, 193153, 229061, 278365, 266888, 102443, 20937, -87437, -30424, -902, -91591, -24690, 161626]
6060A61626j75131n8161K5374M6562K24276Q0137o7558k35669J66894N0512J1712
6049B30574k00611o4221k5203r8347n6155L6511L6696J44028R4346n4785k1721
6038B1112n2979j0435m8467j47801l1145J12117L54119n8890j12776M1058n0298
6027A5615k594R7548K8409o9844l06696L5328L7851P9303j83543O918Q0998r5653
6015b76360M0939J26100J47459j52033m9280K12910j1317k95918L9267K46837
6005B8604J76860L9611N94L9590J71320q2716Q4175j4777j49350j36257J13519
5994B71173j55402p6104k401r190n798j17953O1014K24084j14463N9998R86j54677
5982a8733M9088K88837L6310o7555K20265j15502j82320j51694j44583k30630
$$ y = [161626, -13505, -71666, -46292, 270, 224546, 304683, 237125, 1456, 168350, 218862, 230574, 29963, -34258, -59461, -157808, -213963, -177452, -140756, 3272, 97618, 42833, 21112, -31867, -42302, -90769, -238570, -269715, -157598, 196521, 137631, 24855, 65913, 15615, 13021, 110569, 138978, 69134, -237562, -202234, -164383, -85080, -268623, -261705, -180707, -276360, -235421, -109321, 38138, -113895, -163175, 49735, 38418, -257500, -218233, 28604, 205464, 245075, 245669, 285259, 456579, 373863, 458038, 443261, 293911, 157654, 271173, 115771, 39667, 37266, 28076, 22278, -95675, -34661, 189423, 74960, 134958, 135944, -18733, 30355, 319192, 355502, 287947, 508212, 392710, 210390, 58696, -85887, -316517]
5972c16517L19652L14017j85971k47756j15246J71136O7088K11087J66244J56427
5962E40161q7152j79521n4031k05342L6262L12938K6317k63981l332J84974N005
5951C12298J06811K6674J06265J1161L2726j4913l1529j05365k00518l7668l05949
5940a00007k7334L538J77730r4139M5999L46216M3776k51688q28K06780p5322
5929B74721j30498J00294J7745k92494l8475j79084j74303J55986K56288J30531
5919A20711R957j05403J4097J80605Q2659k15245J5526O5856K4000o6025k4715
5908A02023L7254J02034m2161k03178J40237J49273P3797P9180K470J1102L1715
5897D83746q4932K091n2781j33823J09822k6696k41395r4761Q5073L76970l8319
$$ y = [-316517, 3135, 317152, 131181, -116575, -231821, -60685, 6403, 217490, 383734, 540161, 453009, 273488, 219457, 14115, 50377, 363315, 389632, 125651, 122319, 307293, 312298, 419109, 445783, 552048, 563209, 595935, 581022, 549493, 444128, 243610, 205942, -100007, -127341, -123803, 53927, -40212, 5787, 352003, 395779, 144091, 143263, 350043, 274721, 144223, 244517, 262262, -30232, -68707, -247791, -422094, -266108, -9820, 120711, 130668, 25265, 39362, 219967, 302626, 87381, 102907, 168763, 192763, 126738, 102023, 139277, 241311, 199150, -4028, 136209, 285482, 359279, 438459, 440929, 452031, 483746, 398814, 400905, 348124, 214301, 324123, 297427, 56032, -38729, 46344, 423314, 384995]
5886C84995k15778j05179N0226n0132j91298K4800K53946R4630j49525j25558
5876b8873R6229L89944R1312k99423j46532P9830M326k30623r1978j51972j85200
5865d72960m0783J25461J57541P0252R8989J83494O0549k26052j6449L66658n7905
$$ y = [384995, 169217, 64038, 114264, 64132, -127166, -102366, 151580, 246210, 96685, -28873, 67356, 457300, 548612, 249189, 102657, 182487, 186813, -43810, -135788, -287760, -472960, -513743, -388282, -230741, -160489, -61500, 121994, 182543, -43509, -59958, 306700, 248795]
$$ [...]
##END NTUPLES=NMR SPECTRUM
##END=
