##TITLE=Analysis number 321728
Compound Code cc 06603
Project Code adrs
Chemist Name ugmt
##JCAMPDX= 6.0         $$ Bruker NMR JCAMP-DX V2.0
##DATA TYPE= NMR SPECTRUM
##DATA CLASS= NTUPLES
##ORIGIN= Bruker BioSpin GmbH
##OWNER= nmr
$$ XWIN-NMR		Version 3.5
$$ Wed Aug 23 12:55:24 2006 GMT Daylight Time (UT+1h)  MAYBRIDGE\nmr@NMR_250MHZ
##.OBSERVE FREQUENCY= 250.131544655141
##.OBSERVE NUCLEUS= ^1H
##.ACQUISITION MODE= SIMULTANEOUS (DQD)
##.ACQUISITION SCHEME= undefined
##.AVERAGES= 16
##.DIGITISER RES= 18
##SPECTROMETER/DATA SYSTEM= dpx250
##.PULSE SEQUENCE= zg30
##.SOLVENT NAME= CDCl3
##.SHIFT REFERENCE= (INTERNAL, CDCl3, 0, 16.522)
##AUDIT TRAIL= $$ (NUMBER, WHEN, WHO, WHERE, WHAT)
$$ ##TITLE= Audit trail, XWIN-NMR		Version 3.5
$$ ##JCAMPDX= 5.01
$$ ##ORIGIN= Bruker BioSpin GmbH
$$ ##OWNER= nmr
$$ C:\u/data/dgb/nmr/ADRS/1500/pdata/1/auditp.txt
$$ ##AUDIT TRAIL=  $$ (NUMBER, WHEN, WHO, WHERE, WHAT)
(   1,<2006-08-23 12:55:04.14 +100>,<MAYBRIDGE\nmr>,<NMR_250MHZ>,
      <created by zg, POWCHK disabled, PULCHK disabled
       configuration hash MD5:
       E2 DF 36 D8 04 B2 41 60 5A D7 A3 38 5A 4B D0 FE
       data hash MD5: 64K
       63 8C 84 3B 98 B4 9B C6 39 A2 3A 5D FA CE 90 69>)
(   2,<2006-08-23 12:55:16.69 +100>,<MAYBRIDGE\nmr>,<NMR_250MHZ>,
      <Start of raw data processing
       ef LB = 0.3 FT_mod = 6 PKNL = 1 SI = 32K 
       data hash MD5: 32K
       8C FB F8 01 01 92 5E 27 FA 1E 31 61 8A 15 A8 1D>)
(   3,<2006-08-23 12:55:18.42 +100>,<MAYBRIDGE\nmr>,<NMR_250MHZ>,
      <apk 
       data hash MD5: 32K
       41 18 E7 60 BE 80 56 70 F6 4B 09 09 2C 7F B7 B9>)
(   4,<2006-08-23 12:55:19.19 +100>,<MAYBRIDGE\nmr>,<NMR_250MHZ>,
      <abs ABSG = 5 
       data hash MD5: 32K
       1B A7 4A 47 2E 7D 8E C9 DA DD E3 C0 EF 3E 07 DA>)
$$ ##END=
$$ 
$$ hash MD5
$$ E5 60 1E 43 C0 B2 C8 8D 1A 23 90 84 70 31 98 26
##$RELAX= 
##$RELAX= 
##$RELAX= 
##$RELAX= 
##$RELAX= 
##$RELAX= 
##$RELAX= 
$$ Bruker specific parameters
$$ --------------------------
##$DU= <C:\u>
##$EXPNO= 1500
##$NAME= <ADRS>
##$PROCNO= 1
##$TYPE= <nmr>
##$USER= <dgb>
##$AMP= (0..31)
100 100 100 100 100 100 100 100 100 100 100 100 100 100 100 100 100 100 
100 100 100 100 100 100 100 100 100 100 100 100 100 100 
##$AQSEQ= 0
##$AQ_mod= 3
##$AUNM= <au_zg>
##$AUTOPOS= <32 >
##$BF1= 250.13
##$BF2= 250.13
##$BF3= 250.13
##$BF4= 250.13
##$BF5= 500.13
##$BF6= 500.13
##$BF7= 500.13
##$BF8= 500.13
##$BYTORDA= 1
##$CFDGTYP= 0
##$CFRGTYP= 5
##$CHEMSTR= <none>
##$CNST= (0..31)
1 1 145 1 1 1 1 1 1 1 1 1 1 1 1 1 1 1 1 1 1 1 1 1 1 1 1 1 1 1 1 1 
##$CPDPRG= <>
##$CPDPRG1= <>
##$CPDPRG2= <>
##$CPDPRG3= <>
##$CPDPRG4= <mlev>
##$CPDPRG5= <mlev>
##$CPDPRG6= <mlev>
##$CPDPRG7= <mlev>
##$CPDPRG8= <mlev>
##$CPDPRGB= <>
##$CPDPRGT= <>
##$D= (0..31)
0 1 0 0 0 0 0 0 0 0.06 0 0 0 0 0 0 0.0002 0 0 0 0 0 0 0 0 0 0 0 0 0 0 
0 
##$DATE= 1156334102
##$DBL= (0..7)
120 120 120 120 120 120 120 120 
##$DBP= (0..7)
150 150 150 150 150 150 150 150 
##$DBP07= 0
##$DBPNAM0= <>
##$DBPNAM1= <>
##$DBPNAM2= <>
##$DBPNAM3= <>
$$ [...]
##$SUBNAM7= <"">
##$SUBNAM8= <"">
##$SUBNAM9= <"">
##$SW= 20.6930455092707
##$SWIBOX= (0..15)
0 0 3 0 0 0 0 0 0 0 0 0 0 0 0 0 
##$SW_h= 5175.983436853
##$TD= 65536
##$TD0= 1
##$TE= 296.16
##$TE2= 300
##$TE3= 300
##$TEG= 300
##$TL= (0..7)
0 120 120 120 120 120 120 120 
##$TP= (0..7)
150 150 150 150 150 150 150 150 
##$TP07= 0
##$TPNAME0= <>
##$TPNAME1= <>
##$TPNAME2= <>
##$TPNAME3= <>
##$TPNAME4= <>
##$TPNAME5= <>
##$TPNAME6= <>
##$TPNAME7= <>
##$TPOAL= (0..7)
0.5 0.5 0.5 0.5 0.5 0.5 0.5 0.5 
##$TPOFFS= (0..7)
0 0 0 0 0 0 0 0 
##$TUNHIN= 0
##$TUNHOUT= 0
##$TUNXOUT= 0
##$USERA1= <user>
##$USERA2= <user>
##$USERA3= <user>
##$USERA4= <user>
##$USERA5= <user>
##$V9= 5
##$VALIST= <valist>
##$VCLIST= <CCCCCCCCCCCCCCC>
##$VD= 0
##$VDLIST= <DDDDDDDDDDDDDDD>
##$VPLIST= <PPPPPPPPPPPPPPP>
##$VTLIST= <TTTTTTTTTTTTTTT>
##$WBST= 1024
##$WBSW= 4
##$XGAIN= (0..3)
0 0 0 0 
##$XL= 0
##$YL= 0
##$YMAX_a= 443233
##$YMIN_a= -494476
##$ZGOPTNS= <>
##$ZL1= 120
##$ZL2= 120
##$ZL3= 120
##$ZL4= 120
##$ABSF1= 16.522
##$ABSF2= -4.171173
##$ABSG= 5
##$ABSL= 3
##$ALPHA= 0
##$AQORDER= 0
##$ASSFAC= 0
##$ASSFACI= 0
##$ASSFACX= 0
##$ASSWID= 0
##$AUNMP= <proc_1d>
##$AZFE= 0.1
##$AZFW= 0.1
##$BCFW= 0
##$BC_mod= 0
##$BYTORDP= 0
##$COROFFS= 0
##$CY= 12.5
##$DATMOD= 1
##$DC= 0
##$DFILT= <>
##$DTYPP= 0
##$F1P= 14.0000005364418
##$F2P= -0.99999901652339
##$FCOR= 0.5
##$FTSIZE= 32768
##$FT_mod= 6
##$GAMMA= 0
##$GB= 0
##$INTBC= 1
##$INTSCL= 1
##$ISEN= 128
##$LB= 0.3
##$LEV0= 0
##$LPBIN= 0
##$MAXI= 10000
##$MC2= 0
##$MEAN= 0
##$ME_mod= 0
##$MI= 0
##$NCOEF= 0
##$NC_proc= -4
##$NLEV= 6
##$NOISF1= 0
##$NOISF2= 0
##$NSP= 0
##$NTH_PI= 0
##$NZP= 0
##$OFFSET= 16.522
##$PC= 1
##$PHC0= 144.7749
##$PHC1= 21.24505
##$PH_mod= 1
##$PKNL= yes
##$PPARMOD= 0
##$PSCAL= 4
##$PSIGN= 0
##$REVERSE= no
##$SF= 250.13
##$SI= 32768
##$SIGF1= 0
##$SIGF2= 0
##$SINO= 400
##$SIOLD= 32768
##$SREGLST= <1H.CDCl3>
##$SSB= 0
##$STSI= 32768
##$STSR= 0
##$SW_p= 5175.98343685301
##$SYMM= 0
##$S_DEV= 0
##$TDeff= 65536
##$TDoff= 0
##$TI= <Analysis number 999999
Compound Code 99
Book Reference 9
Project Code 9>
##$TILT= no
##$TM1= 0
##$TM2= 0
##$TOPLEV= 0
##$USERP1= <user>
##$USERP2= <user>
##$USERP3= <user>
##$USERP4= <user>
##$USERP5= <user>
##$WDW= 1
##$XDIM= 32768
##$YMAX_p= 531807599
##$YMIN_p= -447341
$$ End of Bruker specific parameters
$$ ---------------------------------
##NTUPLES= NMR SPECTRUM
##VAR_NAME=  FREQUENCY,     SPECTRUM/REAL,   SPECTRUM/IMAG
##SYMBOL=    X,             R,               I
##VAR_TYPE=  INDEPENDENT,   DEPENDENT,       DEPENDENT
##VAR_FORM=  AFFN,          ASDF,            ASDF
##VAR_DIM=   32768,         32768,           32768
##UNITS=     HZ,            ARBITRARY UNITS, ARBITRARY UNITS
##FACTOR=    0.157963299565203, 1,           1
##FIRST=     4132.6476996994, 0,             0
##LAST=      -1043.33573715361, 0,           0
##MIN=       -1043.33573715361, -447341,     0
##MAX=       4132.6476996994, 531807599,     0
$$ Real data points
##PAGE= N=1
##DATA TABLE= (X++(R..R)), XYDATA
$$ [...]
24126F3432k0426l1557J6061Q10M8227p628J3860n076n102q4541r4673N3276J05204
24113E1867N150l3154K2333J4873q3259J3814J94553O6100p1369j30464N4300
24102A04744J4543j04496K6124N5821j03050l1742n933O860q983N1251N3266l3764
24090B4641j88973K6953J53838J80494p4368k18311R8752q1181j33990j8430J32229
24079i8346J0255O489n8715k9193O9879l4686L7637N2644J45018O3339L784j03336
24067F4769o4425J2199P5981N5515J1517o3320O3833P0626r2092j42239l9615
24056d7251l7177j06963n0275P6147J58065O3837L7294j39456n2004N58o1800
24045a59025M7932P0225p0985o3110K6710Q9436K9898J7373J14907M7199j37219
$$ y = [63432, 43006, 11449, 27510, 28320, 76547, 68919, 82779, 77703, 72601, -11940, -106613, -53337, 51867, 57017, 23863, 46196, 61069, -22190, -8376, 186177, 252277, 180908, 50444, 104744, 119287, 14791, 40915, 96736, -6314, -38056, -43989, -37129, -46112, 5139, 58405, 24641, -164332, -137379, 16459, 196953, 122585, -95726, 3026, -78155, -212145, -230575, -98346, -88091, -81602, -140317, -169510, -99631, -134317, -96680, -44036, 100982, 164321, 168105, 64769, 344, 12543, 88524, 144039, 155556, 92236, 156069, 226695, 134603, -7636, -47251, -84428, -191391, -241666, -165519, -7454, 56383, 93677, -45779, -97783, -97225, -159025, -111093, -40868, -111853, -174963, -148253, -58817, -28919, -11546, 103361, 150560, 13341]
24034A3341J3462n6392N4076l368n6520n9731J7335N0034L1360P2309J09869l2265
24022A53510j8389q0056n9731M213q1948p2387P1696r1467l7241J7259J28406
24011f6135J54122K3528o1103O880j2436P5932q412j06097L9818M3258p4495p6408
23999f1548O738l352J04791o6933k9966Q8922O0011k304j57945k1123J02708l2672
23987a2673m0421L8257j8899q0983n16J5913M7627O816p6887L0833o2140L1751
23975a21322K33031J07621L3970r9386j00403j41517o1563q3688J26304J12112
23965E159L8289l8874J27801K13715O8839j23669l307p5710q7796j07646n6718
23954c9917o299Q7180R1479p4258j70939k9730J24853Q7434L0799K93k5880j19320
$$ y = [13341, 26803, -29589, 24487, 21119, -35401, -95132, -77797, -27763, 3597, 75906, 185775, 153510, 135121, 55065, -4666, -453, -82401, -154788, -83092, -174559, -211800, -194541, -66135, 87987, 111515, 50412, 57292, 44856, 120788, 112376, 6279, 46097, 89355, 14860, -61548, -54810, -58162, 46629, -20304, -50270, 38652, 98663, 96359, -61586, -82709, 19999, -12673, -53094, -14837, -33736, -114719, -115235, -99322, -51695, -44879, -121766, -90933, -153073, -121322, 111709, 219330, 253300, 153914, 53511, -88006, -149569, -233257, -106953, 5159, 43448, 4574, 132375, 346090, 414929, 291260, 287953, 212243, 124447, 16801, -39917, -46216, 40964, 132443, 58185, -112754, -142484, -17631, 69803, 100602, 100895, 75015, -44305]
23942d4305o5099N0158J6934L1608M2358m1562l2844P3893j30489L9140P2658
23931A2450N9271j2105m6358J6807k0295j13011K3692K647n3474l3760J4543J6030
23919a33563P426R6M3357n1470q2821M2517l3955J2118O9963P9438p0233p223
23907a24350n1149M3299J84315J52471k6037j68210q2864K3239R6263K144k736
23896D6385j9966L6052L0387M0494m1619k7712j46782j44711R2355J27684Q8802
23885H1369l6206m129k476O97j1845J28875N640j2129r4915r726N3345M2551R9110
23872B40161j07430j63070m9729j6139j32172K6141J14499J8350N205N0084K9904
23861A5804P51j00775j49231J56535M3882n8141M1420J34937K825m5311l9810
$$ y = [-44305, -109404, -59246, -42312, -10704, 31654, -9908, -42752, 31141, -99348, -60208, 12450, 71721, 59616, 13258, 30065, 9770, -103241, -79549, -76902, -130376, -164136, -149593, -133563, -126137, -126041, -82684, -134154, -216975, -174458, -208413, -196295, -126332, -46894, -117127, -124350, -175499, -132200, 52115, 204586, 178549, 10339, -72525, -49286, 46977, 49121, 46385, 26419, 62471, 92858, 133352, 91733, 64021, -82761, -227472, -135117, -7433, 81369, 45163, 41034, 38558, 39255, 27410, 156285, 161925, 149796, 54881, 45155, 98500, 141051, 240161, 132731, -30339, -80068, -96207, -228379, -202238, -87739, -69389, -64184, -14100, 15804, 16555, -84220, -233451, -76916, -33034, -91175, -49755, 85182, 88007, 42696, 2886]
23850B886O133M8832j1378l9056J6120K0603n1922n6031j9482O8496l0816O6317
23838B0702Q3565q7052p760Q1162k6667M9161L6023j19425j10906j6501j5294
23827a12992q851N7064N0178J4142m7465J5167k6106J8596q5678j15656J8640
23816b22961J42052R8559N3833k6453k6894K1993Q190j17482k8L3599j8169k9531
23804h3292N0794Q5857o1390n8492L7119k1941j63911m3649O2777J48151j3965
23793f1942P3183J31584J21337L659k2343n4404p1961o7909N7675R8517m3758
23782A63638j29295n4745J06234J5271R759N6050K15141k0184j08308q9738m9894
23771A13929L9764l4302r3762q1952p1687O340M599O3472J09894N5482m2854N3658
$$ y = [2886, 9019, 57851, 46473, 7417, 23537, 44140, -7782, -63813, -83295, -14799, -45615, 20702, 104267, 17215, 9455, 90617, 63950, 113111, 149134, 29709, -81197, -97698, -112992, -121843, -64779, -14601, -459, -47924, -32757, -58863, -40267, -125945, -241601, -222961, -80909, 17650, 71483, 45030, 18136, 40129, 48319, -69163, -69191, -35592, -53761, -83292, -32498, 53359, -8031, -66523, -29404, -51345, -215256, -258905, -196128, -47977, -61942, 11241, 142825, 264162, 267821, 245478, 191074, 119113, 51204, 108879, 207396, 163638, 34343, -20402, 85832, 101103, 110862, 166912, 382053, 361869, 253561, 163823, 113929, 153693, 119391, 25629, -56323, -128010, -121670, -117071, -53599, 56295, 111777, 68923, 122581]
23759A22581N4412k9421r8792r6469l1621j9522M6063K623m3618M5454K3578O3552
23747C8820J60770m3717j60932m5150k377j43235l7917J05138Q2488R600K0397
23736a6115r5030l6505N5333O3553J1235n2762M1421J24537O134j49426j37925
23725a85550R9677M8023n6362J4988O5900L9452J3636q222o533j18810o6798J33570
23713b7029L6013k4210r9522n6418J72268J48320l4617Q2344p7193m7331j5765
23702E6860k2462K5541O1926Q3180p8510j06114P1754n135j01160k3814O1982
23691B4048M5558j12823k3313M1887l4599K3776k5782J21532R353j44889n858
23680h1110J32483Q1256J6081J2257o9843P2673o3033q220n351N453j4381o7159
$$ y = [122581, 176993, 147572, 48780, -47689, -79310, -98832, -52769, -50146, -93764, -48310, -24732, 38820, 199590, 155873, -5059, -50209, -52586, -195821, -233738, -128600, -46112, -36512, -16115, -111145, -147650, -92317, -28764, -17529, -70291, -28870, 95667, 101801, -47625, -185550, -85873, -37850, -94212, -79224, -13324, 26128, 39764, 31542, 25009, -93801, -160599, -27029, 8984, -15226, -114748, -171166, 1102, 149422, 114805, 197149, 119956, 72625, 56860, 34398, 59939, 121865, 205045, 126535, 20421, 92175, 87040, -14120, -37934, 24048, 69606, -43217, -66530, -24643, -59242, -35466, -61248, 60284, 69637, -75252, -81110, 51373, 132629, 148710, 160967, 91124, 163797, 100764, 92544, 87193, 92646, 78265, 11106]
23668A1106Q823P2822K1894n8877o5232J6812l7496m6960j0116J24905K19780
23657B57461j65376j5495K7151m4529O8258L0987n8441q3408l7168K1242O1089
23646F1771P5234J08268j02254j02315l0828l150O1817J8818o2450j47779m34
23635a23302J21298L5919n9485l2714M4502o625K7393J18182l26k5596q1725J00848
23623A18369j3701p769j6527r0936p9065L0443J19110K5076j39288k8457O9438
23612a3307Q1543n8455o8282K1613q4796N1594L6528r2692j07074P9524M189N4716
23600i4899J06994q7282p2915J479k6537l4069N5247O1929r4077r1215J480r5906
23588c69771J12368M8603m6597q472l3027L2527P101K1428M7398Q0012L0098m4867
$$ y = [11106, 19929, 92751, 114645, 55768, -9464, 7348, -30148, -77108, -87224, 37681, 257461, 92085, 76590, 103741, 59212, 127470, 158457, 100016, 16608, -20560, 682, 61771, 137005, 245273, 143019, 40704, 9876, 6726, 68543, 87361, 24911, -122868, -123302, -2004, 33915, -25570, -58284, -13782, -20407, 6986, 125168, 124842, 99246, 17521, 118369, 104668, 96899, 80372, -10564, -89629, -59186, 59924, 85000, -54288, -82745, -13307, 68236, 9781, -58501, -36888, -121684, -70090, -33562, -126254, -233328, -153804, -149615, -94899, 12095, -75187, -148102, -146623, -173160, -207229, -151982, -90053, -184130, -275345, -273865, -369771, -257403, -208800, -255397, -263869, -296896, -264369, -257268, -235840, -188442, -108430, -78332, -123199]
23576a23199Q8953R2785l1512l0668J9302m7700j71733J8948J17288R4372j5963
23565A0873o6408n8893m46J01097l2991q265R4178j09559j15148J01175M6486
23554c7901k404j1706p5841O384K7849n0403J11317L9704n989k4340Q3253K498
23542F2421K0271j5949J3426O529J5543j01095o1499Q9140j3898k8785l8511o0157
23530a12564k399K1961J0135j3515j3626K7727J2012L605l6028K1363j5708N7066
23518c9971q2364J13211l540j29203Q241L7395j28883J06017R6500l1166m0131
23507i3894P876k3238k0790J6714j9859N0782J11056J139k6330o2229q3958J16189
23495b6542J64352N3305o3693j8782L6025m0942p5347p1793p2885r8096O0310
$$ y = [-123199, -34246, 58539, 27027, -3641, 15661, -32039, -203772, -184824, -67536, 26836, 10873, -55535, -114428, -114874, -13777, -46768, -55033, 39145, -70414, -185562, -84387, -37901, -40305, -52011, -127852, -121468, -93619, -144022, -32705, 6999, 1010, -23330, 59923, 62421, 82692, 66743, 80169, 86698, 102241, 1146, -60353, 28787, 14889, -13896, -52407, -112564, -114963, -93002, -82867, -96382, -110008, -82281, -70269, -66664, -102692, -81329, -97037, -39971, -122335, -9124, -12664, -141867, -133626, -96231, -225114, -119097, -22597, -53763, -93894, -86018, -109256, -130046, -113332, -133191, -82409, 28647, 29786, 3456, -58773, -142731, -26542, 137810, 191115, 127422, 108640, 144665, 103723, 28376, -43417, -116302, -214398, -154088]
23484a54088J28534J7863Q2031L5059j17112o4737R8457q8629j2056j6365N1289
23473c9754N6180L9798j24649j68197J6235J36121m8283j02868J1301J02999J09557
23462a1560K13296P3466p7329l1229j14916k2874r5223N0380L6248m323O6033
23451H1969j5505M7549j7184J0511m7593l062j21497k5242m3082J25773J14793
23440A07430j9193m2815o654q468m2515m5343J19686J65153k8427j58092o6621
23429b5859l0754j29275J00813J35465K05842m5220j14591q5521r0290k01507
23419b80897J23607J13222n9779j12017O3971O0615K1509K0033J2781l7464J38469
23408F4050p3600j73726j26274R9571M0364O0566J939k3102K5908Q439q532j1995
$$ y = [-154088, -25554, -7691, 74340, 109399, -7713, -72450, 26007, -62622, -74678, -91043, -39754, 16426, 56224, -68425, -236622, -220387, -84266, -132549, -235417, -224116, -121117, -11560, 201736, 275202, 197873, 166644, 51728, 28854, -66369, -15989, 20259, 15936, 81969, 66464, 114013, 96829, 107340, 59747, 56685, -64812, -90054, -133136, -7363, 107430, 88237, 45422, 38768, 30300, -12215, -57558, 62128, 227281, 198854, 40762, -25859, -56613, -185888, -85075, 50390, 256232, 211012, 96421, 10900, -79390, -280897, -157290, -44068, -103847, -215864, -151893, -91278, -69769, -49736, -36955, -74419, 64050, -9550, -183276, -309550, -209979, -169615, -109049, -107110, -130212, -104304, -95865, -104397, -116392]
23396a16392j8871J5062N230R9159P5706M7720N9375o455L5187j71084j15381
23385i0744N2810J27024J31490j17629j41980q0049r8098K6378K06984J6012m6300
23374a4102k2887J27355N3216j9584R842k7824p0122N599Q0057k3951j45811j13413
23362a61625P4709J29117k681O515J00710n8521M4947K7377J2830j17818j48134
23351i2574m834K3854J04626j7335J9490J4692q49j40816L2298J94228L8308n6832
23339A14256r2266J0513l4112k5335M9966K0357m0010k03452j0262K10511N1053
23328E1219m7129n7742k1205L0427l6683n2957j0347M6408K6097N4394m2449n85
23316f0552n0401o2062r3235k932O4229R2858O488P7539J28475Q7606k024m9315
$$ y = [-116392, -135263, -120201, -114971, -15812, 59894, 107614, 166989, 160534, 195721, 24637, -90744, -37934, 89090, 220580, 102951, -39029, -119078, -217176, -190798, 16186, 32198, -14102, -36989, 90366, 143582, 123998, 133840, 106016, 35894, 41493, 121550, 97599, -48212, -161625, -86916, 42201, 39520, 46035, 146745, 88224, 133171, 160548, 173378, 55560, -92574, -97408, -73554, 31072, 13737, 33227, 47919, 47070, -93746, -61448, 132780, 171088, 114256, 21990, 32503, -1609, -26944, 23022, 43379, 3369, -200083, -210345, 166, 51219, 4090, -53652, -74857, -44430, -81113, -134070, -144417, -98009, -71912, -17518, -59967, -60552, -110953, -173015, -266250, -269182, -204953, -112095, -105607, -28068, 100407, 188013, 185989, 136674]
23304A36674Q0804K6305l2894j27397j17377K1391l6230K346K4237J34706L9010
23293A51575j04552n2786q7032j48679l7332J46778K44544R5552o6842j77233
23283c6007j1782J1072j28584j8054L8548m472l9514m702O4607n318k91M9620
23271h4877L5793k5596r0624n907J16967K763O944K0726k3284k5311J29947J19414
23259A76955k1653r6404r9709O1318n1698m0267M7202o7917l884J9487M6255p2419
23247a02734o1313K0488K963O8541J05223j6359q2836j48880o4811J4870M5630
23236b19218k563J830K9735M8185P6201Q2029J04518l7505q396l0353N9626J1875
23224A15964n2200o8338j6604P3858J3184Q8708j04060r6059K1662J906R870j9818
$$ y = [136674, 217478, 243783, 210889, 83492, -33885, -12494, -48724, -46378, -22141, 112565, 151575, 47023, -5763, -92795, -241474, -278806, -132028, 112516, 208068, 141226, -36007, -47789, -36717, -165301, -183355, -144807, -149279, -188793, -193495, -128888, -134206, -134497, -84877, -49084, -74680, -165304, -171211, -54244, -51481, -44537, -23811, -47095, -72406, 57541, 176955, 155302, 58898, -40811, 20507, -31191, -71458, -24256, -92173, -96057, -76570, -30315, -102734, -164047, -143559, -140596, -72055, 33168, 16809, -66027, -214907, -279718, -264848, -219218, -221781, -219951, -190216, -142031, -65830, 16199, 120717, 83212, 74816, 44463, 104089, 115964, 63764, -4574, -21178, 52680, 65864, 154572, 50512, -45547, -23885, -21979, -12109, -31927]
23212c1927L8414P6570J0236J0065P7324n1076j17345q3397O4067J04010N3848
23201A50789m7354j80109k7991O3724J57666M0124j4129j28399r8960L9970J9225
23190b5444L5653K6653L2678j34505m9127l4906O7518P9234L2024K0782L092K4939
23178G8591l9052p6622m2081p1603L9757L7472N5110r324J5372K0947r9405j0224
23166a01062O6258k0233P713n2503N79R2997K4844Q9805Q086j72664k087Q8572
23154C0305P2083j3824q0347k1301j11100j3957N4962N0303O4235L3167q7579
23143b3053m5436n3330j19653M9998R9034p649Q1066l0073o6474Q1746O938n2733
23131g9619m7540K6406J76590J36903k18848j46912j31996J3859M9567M5531J30102
$$ y = [-31927, 6487, 83057, 93293, 103358, 180682, 129606, 12261, -71136, -7069, 96941, 150789, 103435, -76674, -104665, -40941, 116725, 156849, 142720, 14321, -84639, -44669, -25444, 10209, 36862, 69540, -64965, -114092, -148998, -81480, -2246, 29778, 50560, 53652, 78591, 39539, -37083, -79164, -150767, -111010, -73538, -18428, -27752, -12380, 8567, -90838, -101062, -34804, -55037, -47324, -99827, -99248, -6251, 18593, 108398, 116484, -56180, -58267, 30305, 102388, 88564, 8217, -13084, -124184, -138141, -83179, -32876, 31359, 64526, -23053, -68489, -121819, -241472, -191474, -92440, -100089, -19023, -49096, -115570, -33824, -26886, -79619, -127159, -100753, 75837, 212740, -6108, -153020, -285016, -271157, -221590, -176059, -45957]
23120d5957q7457r9124o2858m282P5690Q2428q3188L5204J46830J8143l4958j04430
23108a63959k839q3046R8286K532k720J5982N0452k0452k4062N4231N1667j375
23096b5303k6018J15326J05211q6624r9186K3553K4166M0334j17738j92816j2362
23085b51457J67572J36P7700J91917j7401j38577j76032k5049j0899L2388K9314
23074a20388J00191k1151k051q8352M6817Q6565m0465p1821K2362n5294K4200
23063a19387l414J53554J34129M0639p0319j70379j25740J4807J37833N2125l1002
23052A2846j6701Q6483k6735P3655l0556l2516q9805n6320N628R9696P333j3449
23040A9559q5277j1569Q9428J13503r0138j44401M6642j867J0050J2888j10121
$$ y = [-45957, -133414, -232538, -295396, -299678, -223988, -141560, -224748, -189544, -42714, -24571, -59529, -163959, -166798, -249844, -151558, -149026, -151746, -135764, -85312, -105764, -129826, -75595, -23928, -25303, -51321, 64005, 169216, 82592, -16594, 6959, 31125, 71459, -46279, -239095, -251457, -83885, -83749, -6049, 185868, 168467, 29890, -146142, -171191, -182090, -149702, -120388, -20197, -41348, -43399, -131751, -84934, 1631, -38834, -110655, -88293, -143587, -119387, -122801, 30753, 164882, 205521, 135202, -35177, -160917, -146110, -8277, 43848, 12846, -3855, 82628, 55893, 129548, 98992, 66476, -23329, -79649, -74021, 25675, 33008, 19559, -65718, -77287, 12141, 125644, 35506, -108895, -62253, -64120, -54070, -41182, -151303]
23029a51303j6459o203L2952J31750J4583n9467j5455P4122j3864m6191Q148J06971
23017E9584o1880m165O9623J04650K5196j34584l8006l8488m3727L9088l6809
23006e9518q1531l7139J41196M6117q7765q1978J08302R0045K2224n0382k6322
22995a6751J46754K0441p6325p0223q2656L8509L2624k5892J26794N1120m2408
22984A01987q6658K5983j27553l8246M4975k2195o0151k742P4687q6714K7096
22973a49531j1530K3271N5945j4398j2742L6360K1839J3551R2272J7512o0697
22962A1852j0809l1308L5410k7093j55058J39J25301Q1535K3614O9151o0632j22424
22950f0322o1759N8419R3302J7980R8239k7747K4514o8449l5274q971j39423j7796
$$ y = [-151303, -167762, -173965, -141013, -9263, 5320, -54147, -69602, 4520, -9344, -55535, -47387, 59584, -2296, -6461, 63162, 167812, 193008, 58424, 20418, -18070, -61797, -22709, -59518, -141049, -178188, -36992, 9125, -78640, -160618, -52316, 37729, 59953, 9571, -16751, 130003, 150444, 74119, 3896, -78760, -40251, -7627, -33519, 93275, 144395, 101987, 15329, 41312, -86241, -124487, -79512, -101707, -161858, -164600, -89913, -176627, -149531, -161061, -137790, -81845, -96243, -108985, -72625, -50786, -37235, 55037, 72549, 11852, 1043, -30265, 5145, -21948, -177006, -176867, -51566, 29969, 53583, 122734, 62102, -60322, -122081, -63662, 29640, 47620, 145859, 118112, 142626, 74177, 38903, 29932, -109491, -127287]
22938a27287J22424K3956P9984l3328q3586p3116n9833K028M9347j534J12097
22927A1152q3338L1369Q7696J0285r7058j6169r314O5005K3148O0709O050n0726
22915C8809q0006K0477J21480K6863j16773O441N2735O5524k6782n5626J4334
22904F7476j2753j68704q9863J17011J53150J7279m818L7553K2850q9841m9999
22893f59j54239k9211J63842Q7046o098Q1061J49981p6336j71319j44142l1251
22882a31325n1120P2270O5441N3808J7242n9036J2612M1202J9565k0715q8863
22871f8919M0854J30289J02850j18881N5316j00920o3534L2469m857k4966O7689
22860D7390l9763p6308l1193Q4282r254Q135L3077j81242K4050P7437k3043L732
$$ y = [-127287, -4863, 19093, 99077, 65749, -17837, -90953, -150786, -148758, -99411, -100945, 11152, -72186, -40817, 46879, 57164, -39894, -56063, -65377, -372, 22776, 83485, 89535, 38809, -41197, -20720, 100760, 127623, 10850, 17291, 70026, 135550, 108768, 53142, 67476, 54723, -113981, -203844, -86833, 66317, 83596, 78778, 116331, 139181, 49340, -659, -154898, -184109, -20267, 66779, 60681, 141742, 291723, 215387, 44068, -100074, -131325, -182445, -110175, -44734, 9074, 26316, -32720, -20108, 21094, 40659, 19944, -68919, -28065, 102224, 205074, 86193, 141509, 40589, -22945, 9524, 4667, -20299, 47390, 7627, -68681, -99874, -15592, -24846, -16711, 16366, -164876, -140826, -63389, -86432, -82700]
22848h2700J1096J6887L1720P4358q0207K7604j2829k7802j8280l526M0747r6976
22836a19908n4041R8593M271l0189J730J09989N8338q284m4914j7603o883K4692
22824A5791n4627o1933M6319P355K5046P5949K4469k9539j1711j1523j56718r9778
22812b30900O2694J23077R5264N1321m8554q3084k8683j09714P6313K6338L3218
22801c2710Q6750k6406J6369j8680n1192o4631N8587R0809P2774l9018k6668O3200
22789A29184O3473p7766O7714O1789k8721j6331L6504j52822l0766P3126q4280
22778D1104q7515K7541m9293L6287P3937j25566L4763o203L0764O3710j30438
22767i0909n9596M7780J46674O8592o1321l1892N0768K726j17810j07379R243
$$ y = [-82700, -71604, -54717, -22997, 51361, -28846, -1242, -14071, -41873, -60153, -63679, -22932, -119908, -173949, -75356, -71085, -101274, -99544, 10445, 68783, 60499, 15585, -2018, -8901, 15791, -38836, -100769, -54450, -47095, -22049, 53900, 78369, 48830, 37119, 25596, -131122, -230900, -168206, -45129, 50135, 101456, 52902, -30182, -58865, -168579, -92266, -65928, -32710, 54040, 27634, 44003, 25323, -25869, -90500, -31913, 58896, 131670, 92652, 65984, 129184, 192657, 114891, 182605, 244394, 215673, 199342, 235846, 83024, 52258, 125384, 41104, -46411, -18870, -68163, -31876, 42061, -83505, -48742, -54945, -24181, 39529, -90909, -150505, -102725, 43949, 112541, 51220, 19328, 70096, 72822, -44988, -152367, -143124]
22756a43124N0747K8224M5282m9797q3356Q150O929O5339O6307P5582Q7315J21823
22744B79421k1661p4223l3036K7462r206j00206K9239o9090p5525o0029J7418
22733h9436r199J24208J42101l8026p9443o8422L854M6696N8828m6007m3822j30836
22721a29504o8257k3071J31862P8156r789p5847P0550K4435J08383l4966O5327
22710A37279M1025j22492m1651J0652R8128k6729p7197k4265n6789j03376l2090
22699a97505j1189K8447J7266P6302M8387k7825k4789N2058Q4343J3316K6590
22688H5401o5904j33091m2856J57053P370r5963J24449p887o9831k0478p9697
22677a41434j0158j7723J46016K471l5178j4393j1145L6324O7352m403Q2225o342
$$ y = [-143124, -92377, -64153, -18871, -68668, -152024, -143874, -136945, -71606, -5299, 70283, 157598, 279421, 257760, 183537, 150501, 177963, 168757, 68551, 97790, 28700, -46825, -106854, -89436, -98635, 25573, 167674, 129648, 50205, -18217, -14363, 32333, 91161, 45154, 1332, -129504, -197761, -220832, -88970, -10814, -20603, -96450, -25900, -1465, 106918, 71952, 137279, 178304, 55812, 14161, 24813, 122941, 96212, 19015, -5250, -62039, -165415, -197505, -208694, -180247, -162981, -86679, -38292, -66117, -90906, -38848, 45495, 58811, 85401, 19497, -113594, -156450, 603, 7973, -87990, 36459, 28572, -41259, -61737, -141434, -151592, -169315, -23299, -20828, -56006, -70399, -81544, -45220, 22132, 17729, 99954, 93612]
22665I3612o8040r7127k8657O9792q5580o1183o4275J16632J58026n9143o3737
22654h9680k1849N6624L4083k5506p8184J12637O3314j013K067R838j852k7794
22642C2685r3461P7221M1551L217j11695j27909J161q251N0631O5259J38058L2357
22630A00824J9765j6353l1711Q8582j9851j41729n2616j3124R8219M528n8047
22619b1513k7134r6364O945N2311O7827J80588j9038k4707o9111j83603j01307
22608b35106j1188P7083P5765N5869J58228L0242j57818p5384q4144q3521J01439
22597a48535K4045J1830N6539J48133M8789o9106j78372p9375l2615o0674J76650
22586a02691J09464M4110O5941J0072o7680r0575j15027L6097P7105N3917N2076
$$ y = [93612, 25572, -71555, -100212, -30420, -116000, -177183, -241458, -124826, 33200, -25943, -89680, -111529, -54905, -20822, -46328, -124512, -11875, 51439, 50426, 52493, 62331, 60479, 32685, -60776, 16445, 57996, 61213, -50482, -178391, -177230, -185481, -134850, -69591, 68467, 100824, 120589, 104236, 72525, 161107, 141256, -473, -53089, -66213, 32006, 36534, -21513, -48647, -145011, -138066, -85755, -17928, 162660, 143622, 118915, 49804, -133799, -235106, -246294, -169211, -93446, -37577, 120651, 150893, -6925, -82309, -166453, -249974, -148535, -124490, -112660, -56121, 92012, 140801, 71695, -106677, -186052, -218667, -279341, -102691, 6773, 50883, 116824, 126896, 59216, -31359, -146386, -110289, -33184, 20733, 72809]
22575G2809Q4795k5131p3552l3444P1333K3046J4248J7013J5086j28291j5951
22564B1961L9884Q0501n7534j52739p576J28467J1584n0246P834J5791L3336p1090
22552A73M3945r078N0785R447k0256o4843m3353J48630m14O3618o8773j44385
22540c4504j45216m7046M3344p499L5253o5070M1583q820J33242L2070L5408j06141
22528i3396N4223L5283o2871k2478l3039M8601m9139l7238o3816J19014J16860
22517A2004n3361l7197o5668M2402l8347j6011N8906N8880K5461p1045R5950O5811
22505G7785L4143r8028k9013M9623J02898m0426j34882l3078L4354N8206K9199
22494E0781P9133O6112P7659l1162j45239k0697J05060N9903p2951j31170M3009
$$ y = [72809, 157604, 132473, 58921, 25477, 96810, 119856, 134104, 151117, 166203, 37912, 21961, 61845, 142346, 84812, -67927, -75503, 52964, 64548, 14302, 22136, 37927, 71263, 173, 44118, 35040, 85825, 95272, 75016, 10173, -33180, 115450, 115036, 178654, 109881, -34504, -179720, -226766, -183422, -190921, -155668, -220738, -179155, -187975, -54733, -22663, 12745, -93396, -39173, -3890, -66761, -89239, -122278, -73677, -122816, -160054, -223870, -104856, 12004, -41357, -78554, -144222, -101820, -140167, -156178, -97272, -38392, -12931, -83976, 11974, 77785, 111928, 13900, -15113, 34510, 137408, 96982, -37900, -70978, -36624, 21582, 50781, 129914, 196026, 273685, 242523, 97284, 76587, 181647, 241550, 168599, 37429, 80438]
22483H0438p0851J6473m0360N6147k2949q1452n4943k935J3167L7938Q2980K288
22471A5941j0833m4368l1327P4872M9408m3587M4998O0327r8057j28806L5981
22460g5451J07985L086j00202k117j3041j9498P746O4905J08550l1676j10697
22449f0410K3256Q4896L420o8034N6801M6281N4820o1333j78123O3966k9534o7426
22437a31420L3545O4346o0106j804L7880K1893P7128j0935m0307k0664j05735
22426a36179m8078M1810J07588L021L5614r850j53265l2279O5314Q9417N2535
22415A5648j5158K4252M6589M7692M0757K8140p0581m6151l3735P6759M6084m6916
22403A13380M0558J10728q7121m5199j32822j09304j6417n782R2386Q6150J8642
$$ y = [80438, 9587, 26060, -14300, 41847, 18898, -62554, -117497, -120432, -107265, -69327, 13653, 15941, 5108, -39260, -70587, 4285, 53693, 10106, 55104, 115431, 17374, -111432, -75451, 32534, 35620, -64582, -66699, -79740, -99238, -91492, -26587, 81963, 50287, -60410, -37154, 47742, 51162, -16872, 39929, 86210, 141030, 79697, -98426, -34460, -63994, -131420, -97875, -33529, -93635, -95439, -57559, -35666, 41462, 30527, -9780, -30444, -136179, -184257, -142447, -34859, -31838, 3776, -6074, -159339, -191618, -126304, -36887, 15648, 490, 24742, 71331, 119023, 159780, 187920, 117339, 71188, 37453, 114212, 160296, 113380, 153938, 264666, 177545, 132346, -476, -109780, -126197, -131979, -39593, 46557, 65199]
22392F5199N1746r386N7812j1826R8211q9108j08995j391j2926J5118k6832Q4961
22380A12583O2195j498K5291j4792J7935N5819m2637k9561N2906j05284p6091
22369E6866J146m3236K305l6291M8335P3958L4491K092n6410l7168n3461l2924
22357d0297P5337n1473l2781J01815J6938K4693k2262p9930p2317L5416q892j370
22345e5123J9229r276j00542j8077J70892M1861M8205N4969J16843j26734j96042
22334e3795p1907o1270n0991J05213N9560q387K1948P7710k741p797N9371O0506
22322A27420M1715r8163p9642p7584J823J37387q1205j33112o0962J0882J01915
22311a09526J36488J7742N157Q1105j4978n6853q2422Q4211J9298n0181J4056
$$ y = [65199, 116945, 107559, 165371, 153545, 251756, 162648, 53653, 52262, 39336, 54454, 27622, 112583, 174778, 173280, 198571, 183779, 201714, 257533, 214896, 185335, 238241, 132957, 56866, 58012, 14776, 17081, -19210, 29125, 103083, 137574, 139666, 83256, 46088, -7373, -40297, 35040, -16433, -49214, 52601, 69539, 94232, 71970, -7960, -80277, -44861, -53753, -55123, -35894, -45170, -145712, -163789, 7103, 48964, 97169, 152138, 268981, 142247, -53795, -125702, -186972, -237963, -132750, -73190, -81577, -59629, 18081, 15340, 7543, 66914, 127420, 169135, 70972, -8670, -86254, -84431, 52956, -28249, -161361, -222323, -211441, -109526, 26962, 44704, 49861, 130966, 115988, 59135, -23287, 60924, 80222, 30041, 44097]
22300D4097m1980J0166j02681K7977J67724L9681l4616M8048n9921N6437l9876
22289A15056j39044k8421R954J4664q709j4294M158L4584l9780M8634K4632Q6173
22277A07607n345J6908p0474j18677K7657J01302j16315j01780P7373O9558K3720
22266A1534j5366l9496K81M5386k3886P5393n2469l1702K9981L9558N5381R7913
22254A92508o2702j35325n1890P4167P9049O0406k3177N8893o6833k2182l6045
22243F6869J6828K4422N506Q6420j42281j45548k5290o9517N8075J57075l5870
22232c311P2470l6030K3672l4324q2500p4576M7280o0399K2531J78328j5032j7185
22220B0924J9344m0905j1548O9441J08639j10568N0268L0285J5838j42684J8205
$$ y = [44097, 2117, 12283, -90398, -62421, 105303, 144984, 110368, 158416, 98495, 154932, 115056, -23988, -52409, -42455, -27791, -36500, -50794, -46636, -12052, -51832, -3198, 21434, 107607, 102262, 119170, 48696, -69981, -42324, 58978, -57337, -159117, -81744, -12186, 11534, -3832, -43328, -43047, 2339, -21547, 53846, 1377, -30325, -344, 39214, 94595, 192508, 129806, -5519, -57409, 16758, 95807, 156213, 133036, 191929, 125096, 102914, 66869, 83697, 108119, 113625, 200045, 57764, -87784, -113074, -182591, -124516, 32559, -3311, 69159, 33129, 56801, 22477, -60023, -134599, -87319, -147718, -125187, 53141, 38109, 20924, 40268, -637, -12185, 57256, 165895, 55327, 105595, 135880, 151718, 9034, 27239]
22209B7239R7058P850o4269o6126q1897n89N8275L506j8917j6528l3177r4147
22197a81722m0503k9328M551J39295J19987k5959k9543L9074o811J2012N0192
22186E1245L7330n6217j88825l1729J38584O8179n155q90M6373L6274J285j01468
22174e014l0002r1249j5119M1761O7122q894J1851N0624l3815j3212L7954p5217
22162f3210p2178n0393r624m8455J70764J78923M0391j08127L9103Q8708R5936
22151B61838J5653j62403j17275r9109k9723R075N7029N8476Q6155k3940m3798
22140A1978L0889L2018j3262J8302p8718J3714J6922M9374J16758n9706p8652
22129E9617j4440q7606l5609M158p0066j2570l5069K00751n3054r9510l1836N1592
$$ y = [27239, 124297, 132147, 67878, 1752, -80145, -80734, -22459, -18953, -37870, -54398, -87575, -181722, -222225, -251553, -247002, -107707, 12280, -13679, -43222, -4148, -10959, 1053, 51245, 88575, 32358, -156467, -188196, -49612, 18567, 13412, 12522, 58895, 95169, 96454, -5014, -35016, -126265, -141384, -99623, -32501, -41395, -29544, 21080, -12735, -25947, 12007, -63210, -135388, -185781, -195405, -243860, -73096, 105827, 146218, 38091, 77194, 165902, 261838, 277491, 115088, -2187, -101296, -131019, -121944, -64915, -6439, 79716, 55776, 11978, 42867, 74885, 61623, 79925, 1207, 14921, 31843, 81217, 197975, 138269, 59617, 45177, -42429, -78038, -73880, -143946, -156516, -191585, 9166, -43888, -143398, -175234, -123642]
22117a23642M7380J21146J43369j6253n5702N5371l2570k6648q1173L7243j5681
22106E2840l4258q1394j27845J66079M0707j0382m892J79651J30637j01225K4126
22095B34044q7257j19750r2416Q0940O4627K8824k5949j03345k0011L9885M4935
22084D4527n2736N822m1590j05254m6357L9150O2686R4989J37178k0048L6635
22073A55002K8275j11635j25646j7040r2756J182Q9393O5746n1633q4690j2833
22062a56635R8433m4110J20930J6993j46888p0322m9482J2631L2156j104J54435
22051c2963N7953p4380O3173L2563j7079K267p5412j45128p2544N2362j7016Q5458
22039a40746k2776J09074N3473M5214N1917O2631j2374l8555o0346j12026J3773
$$ y = [-123642, -76262, 44884, 188253, 172000, 116298, 171669, 139099, 112451, 31278, 68521, 52840, 18582, -62812, -190657, -24578, 16129, 5747, 855, 180506, 311143, 209918, 234044, 146787, 27037, -65379, 15561, 80188, 109012, 83063, -20282, -40293, -408, 44527, -8209, -2387, -43977, -149231, -195588, -156438, -93752, 1237, 138415, 118367, 155002, 183277, 71642, -54004, -71044, -163800, -162618, -73225, -7479, -59112, -143802, -156635, -58202, -102312, 18618, 35611, -111277, -181599, -231081, -218450, -186294, -187398, -32963, 24990, -49390, 13783, 46346, 29267, 31534, -43878, -189006, -261550, -209188, -226204, -140746, -163522, -54448, -975, 44239, 96156, 158787, 146413, 107858, 47512, -64514, -50741]
22028e0741M2482o1463p5267J2055P5369j12775q8962L9344J66404R5006j26598
22017h5146j32547O7192J15516J1285L7354M7126n2510m3224k6338K9289k3575
22006e5578l7802P5473J24246J18984j56624j98460k7871J9237P9988p7660p9228
21995b15295n8640J06299K40772P5999n494r6571j46005j42991P7364K04424M7353
21984H7215k2025n324l6923K438M0860M9476Q897J541m6785j3770O0950j6300
21972A10250l5396j7941K9060r1509K1837P987k9637R3513J2639Q116l8409r6088
21960b5578Q6583L9816N3283k2539j1361j35313r2410n6842N08R1665P4439J07778
21948A10029p2863j19072j9468J22906L2026J33942j2296p4404q5354o2392N1613
$$ y = [-50741, -8259, -69722, -144989, -132934, -57565, -170340, -259302, -219958, -53554, 41452, -85146, -217693, -150501, -34985, -23700, 13654, 60780, 8270, -34954, -61292, -32003, -55578, -93380, -17907, 106339, 225323, 68699, -129761, -157632, -138395, -58407, -136067, -215295, -273935, -167636, 73136, 149135, 143641, 47070, -98935, -241926, -164562, 39862, 87215, 65190, 59866, 22943, 25381, 66241, 115717, 124614, 126155, 79370, 65600, 126550, 110250, 74854, 56913, 85973, -5536, 16301, 24288, -5349, 88164, 100803, 108919, 70510, -25578, 61005, 100821, 154104, 131565, 120204, -15109, -107519, -164361, -163853, -72188, 2251, 110029, 37166, -81906, -101374, 21532, 53558, 187500, 175204, 100800, 15446, -46946, 4667]
21937D667J33282L3714P979N7885p3888j39189J0920k2003M5068n834O6157N8494
21925A77252q8483l6678J15268N4460k31p144J2653J0904j39911j22023j32n2700
21913g6765K149J5739j14738L9537J62761M0346M1583r7222j66361j418J13220
21902d1169P6604K8944J41195N9369r5994r7768n4993l7723j6168o3314K6440
21891g4577M6649k1695K2142m3680O4859K0627K4646j2535q0612m6255J27953
21880B7522J00952j0926j27498j67140n5663O1251O4642Q3012O7975Q741k9182
21869B3686p1474R7883O4767R2140j0076j11092n9429J1370N702N1381j02298
21858g440r6006K263M9215O6546r814O103j0719r3718j6890K5304J02176j6211
$$ y = [4667, 137949, 171663, 179642, 237527, 163639, 24450, 35370, 13367, 58435, 52601, 118758, 177252, 88769, 52091, 167359, 221819, 221588, 214444, 227097, 238001, 98090, -23933, -24065, -76765, -74616, -58877, -173615, -134078, 28683, 69029, 110612, 13390, -152971, -154389, -41169, 35435, 64379, 205574, 264943, 168949, 71181, 16188, -21535, -37703, -101017, -74577, -27928, -49623, -27481, -71161, -6302, 14325, 38971, 26436, -54176, -100431, 27522, 128474, 117548, -9950, -177090, -232753, -171502, -106860, -23848, 44127, 52868, 23686, -47788, 50095, 114862, 207002, 196926, 85834, 26405, 37775, 43477, 94858, -7440, -103446, -101183, -51968, 14578, 4764, 10867, 148, -93570, -110460, -85156, 17020, 809]
21846H09K1924J66656l868j27260R363J9166n6092J8576M7687J2567q8123o241
21834A5164M1181L0126n257n5617n7913R403O8668o7083J2303Q7263M308q3909
21822a363q6490L484q6976k3761J25013M2403N8042r6622n3313p72J7481j657
21810a04531j4229J77619M4882j1208j5109p4449k5893O7027K2867l1514K4634
21799F0096J27948N6971j2337J9249q2216j47992o618n0545P855N1316q0981o2636
21787a19890O1550M1660K0091j52129n4132J13099P1985l7655q6145J3286L9464
21776h8816m1337o6517n204R8874P5033r4608m3201M9891q187M1272P3246O406
21764c148m3002p3277J5235Q1921L8895K4777q7552m0370o8267N0927J21302M7405
$$ y = [809, 22733, 189389, 185521, 58261, 67624, 86790, 30698, 49274, 96961, 109528, 21405, 15164, 56345, 86471, 81214, 25597, -32316, -22913, 45755, -21328, -9025, 78238, 82546, -1363, -87853, -84369, -171345, -195106, -70093, -27690, 30352, -66270, -119583, -120355, -102874, -104531, -118760, 58859, 103741, 92533, 77424, 2975, -22918, 44109, 66976, 35462, 60096, 188044, 245015, 232678, 251927, 169711, 21719, 15101, -35444, -27589, 23727, -57254, -119890, -58340, -16680, 3411, -148718, -202850, -89751, -17766, -55421, -141566, -128280, -88816, -130153, -196670, -201874, -103000, -27967, -122575, -165776, -115885, -124072, -82800, -9554, -3148, -46150, -119427, -104192, -22271, 16624, 41401, -46151, -86521, -154788, -103861, 17441, 64846]
21752F4846j5123p6342K574K1878j36445K3845J16512M7864N357K7118P891p8935
21740A1040n9281l803N2885J34782R4768j02531j05172m862j7942K2614P5096
21729I7594M7849M1129l3960K3634n9223L7574K2282j22410q2265j0747M5356
21718F813K2743M9999m573j6936J3109j03295M8330j1174k4247J4053n5176N7445
21706b909J05011n2852j0156J7307o9232j03981q078o7880K0905N7916K455K7367
21694h4127r287J16950M8251N9244p5800k3803o6312q1254J0759O0149J61584
21683A16354O1813k5170j43985N9777J04532j21403j15727J9401K07111L1634
21673A94337j96131j74682O1554P6510m2175k8693P7854l1633r7726P1544q5837
$$ y = [64846, 49723, -26619, -24045, -2167, -138612, -114767, 1745, 49609, 54966, 82084, 89975, 11040, -48241, -52044, 841, 135623, 230391, 127860, 22688, 17826, -116, 22498, 97594, 145443, 186572, 152612, 176246, 117023, 154597, 176879, 54469, -27796, -38543, 6813, 29556, 79555, 74982, 58046, 71155, -32140, 16190, 5016, -19231, -5178, -60354, -2909, 102102, 49250, 39094, 56401, -12831, -116812, -124890, -192770, -171865, -113949, -111494, -84127, -93414, 23536, 71787, 131031, 55231, 31428, -34884, -116138, -105379, -45230, 116354, 178167, 152997, 9012, 68789, 173321, 51918, -63809, -44408, 162703, 194337, -1794, -176476, -114922, -38412, -80587, -109280, -31426, -63059, -160785, -89241, -175078]
21662a75078j53601n9551J01955N9225O2194M4654J08995k7077j46924r3615N7303
21651b21520N7604J04425L8649m7110N681r2646m2777J9997p4545P9624J99071
21640B6453Q5052r887N2062j0526N174j6554l0630l381j0513m6398J0946n6325
21628d527j5851j6556L2545J21771r0890j34140o4892J4532j0596P4361J97462
21617A03219p731j40788j4930J16101J17749j02630n1923m8911Q4403M2316P1193
21606A68068N5447j2847j669L0038j12968j54183j03992J51712M8133q2195r067
21595b3523J23471l1838j52480k8897J02949O313O2691j193j26967k5825N6063
21584c9236J4056k3638l0896O5824L1559j00464p099O7608J2808j5804k3892k7350
$$ y = [-175078, -328679, -388230, -286275, -227050, -164856, -120202, -11207, -38284, -185208, -278823, -221520, -163916, -59491, -20842, -67952, -62271, -154917, -197694, -177697, -252242, -172618, 26453, 111505, 101618, 153680, 143154, 148328, 131774, 101144, 97763, 87250, 40852, 51798, -4527, -20378, -36934, -4389, 117382, 26492, -107648, -172540, -158008, -168604, -94243, 103219, 95488, -45300, -60230, 55871, 173620, 70990, 19067, -29844, 54559, 96875, 168068, 223515, 210668, 208999, 239037, 126069, -28114, -132106, 19606, 67739, -14456, -23523, 99948, 68110, -84370, -113267, -10318, -4005, 58686, 57493, -69474, -95299, -39236, -25180, -48818, -79714, -13890, 17669, -82795, -89894, -22286, -9478, -25282, -49174, -76524]
21572g6524j7586L2027R8313O3953L4036l8671n7594l1080L8776n600L4742Q541
21560H3333K87n0522q607L3002j36382j10366j1279J19480J08504p6523n5068
21549a04141L7914R054n9883K4808J43181N014j58785o5038J22998m2646j4044
21538a01568L4817J23031J46498j3280j64248L5934P0076q0720j34866k0994P537
21527i7783L7818J8074R1006O2291q2991o5770m1799k963M3195P2133o5493m7969
21515h0251l2772O7828O3047o3917j2320r03l491M286K3041R8580o4208p3701
21503g4781q427l9813N7325L7140j09748l8978P7136J70251L2702l3241J1386
21492H0952k4234K9576M0802Q2302J63538m0583j95923n1481N0260J702p8635
$$ y = [-76524, -94110, -62083, 36230, 100183, 134219, 95548, 37954, 6874, 45650, 40050, 74792, 83333, 83620, 33098, 24491, 57493, -78889, -189255, -200534, -81054, 27450, -49073, -104141, -66227, -57173, -117056, -92248, 50933, 55947, -102838, -167876, -44878, -87524, -101568, -66751, 56280, 202778, 189498, 25250, 61184, 131260, 50540, -84326, -105320, -97783, -59965, -41891, 49115, 111406, 28415, -37355, -79154, -82117, -38922, 33211, -32282, -80251, -113023, -45195, 17852, -46065, -58385, -59288, -62779, -58493, -35452, 63128, -1080, -74781, -83208, -123021, -65696, -28556, -138304, -177282, -100146, 70105, 102807, 69566, 80952, 56718, 86294, 127096, 209398, 372936, 332353, 136430, 84949, 135209, 136911, 58276]
21481E8276M7478Q7997q3241q0852o9944J94955J47739K4949j41466r7687j28622
21470d0418L3035J09855m6928k6628L3430p2692m4103M110L7578l9416M005L1215
21458a6957M0679j9769j1318q6000k4419j2479J8427Q0126N0529J05350p9939
21447D4230n7404Q2768Q0888K8319j2039O9743q6336j94198r4275O1534J3668
21436f3102P741J3459Q79j0966O6322n1212k6326L6798L5550l0220O3227L7873
21424H0023j09799q4053N5936l9478L1133k7440p6705N4279P1286p7910P2764
21413d9964O2136K5952N3571J6874m5953J0043p0584n0489J1801j06846l1676
21402a75135N0747K7853J03410R637k1417Q4335o3536r6648K3679J24491j1983
$$ y = [58276, 105754, 193751, 110510, 29658, -40286, 154669, 302408, 327357, 185891, 88204, -40418, -7383, 102472, 55544, 28916, 62346, -10346, -54449, -50339, -12761, -52177, -48172, -16957, 23722, 3953, -7365, -93365, -117784, -130263, -111836, -31710, 18819, 124169, 44230, -13174, 69594, 150482, 178801, 166762, 236505, 150169, -44029, -138304, -76770, -63102, -55361, -41902, -41023, -51989, 14333, -36879, -63205, -26407, 9143, -21077, 42150, 80023, -29776, -113829, -57893, -97371, -66238, -93678, -170383, -116104, -44818, -122728, -49964, 12172, 38124, 91695, 108569, 62616, 72659, 2075, -48414, -36613, -143459, -175135, -124388, -96535, 6875, 16512, -4905, 79430, 15894, -80754, -57075, 67416, 55433]
21391E5433K2512N2274j2261O401R0930o3073j23888m7701l1898j12187l5170
21380a98628K5757J2384l5189K4118J1022J05591J19131J17862O4327j40289j7858
21369H8228n9616p0990J9129l4779j11997K209P9991N9181J2113P105n0275o1549
21357a21250R7358L490p908L5318j3559R140N0303k275j0509j8167p6665j06779
21345a61503O4952R4291n9157k9683o496m4147N2040J1433o7673M6651J06819
21334G527J3634L4261j04969j06589J05860J7783k874p4933p4145K8780L7801
21323a17864N579J4716P1278l2539N4202L4648k5956n0468m3669m9675l0088M3976
21311a25860O1879P1543P4052m8003Q8780l5923n4038n460O8803R645j4866n1413
$$ y = [55433, 77945, 130219, 117958, 124359, 215289, 152216, 28328, -19373, -51271, -163458, -198628, -172871, -160487, -195676, -171558, -160536, -54945, 64186, 182048, 246375, 106086, 88228, 28612, -42378, -23249, -58028, -170025, -167816, -87825, -28644, -16531, -9426, -59701, -121250, -23892, -20402, -28310, 7008, -6551, 2589, 52892, 50617, 40108, 21941, -54724, -161503, -96551, -2260, -61417, -91100, -97596, -141743, -89703, -78270, -145943, -99292, 7527, 21161, 55422, -49547, -156136, -50276, -32493, -35367, -110300, -184445, -155665, -117864, -112285, -97569, -26291, -58830, -4628, 30020, 4064, -46404, -90073, -139748, -169836, -125860, -63981, 7562, 81614, 33611, 122391, 86468, 32430, 26970, 95773, 105418, 90552, 39139]
21299C9139j01633L6846o0986k4357J04812N743q6700o5114j1266J9246l1998
21288a76268M6629n794M5109o2384O0098J15506o5629n2952O8445P7426P3553
21277A23739J4917r1930p1344j9436J0211K6524J03424l283m7957j8661k2303
21266C901j7048L3122j4827o4285P8108n0063j68998j1565K9933n0371l810P5265
21254a60638P8495K00561j993p0314J17026K1582r6605j89840j31058n6754L7657
21243b51881R1682J28425L0578J4596l1030Q1968R0861j27684j04469R3958J11957
21232A28961o0093j02456j2732N6865n6681M1862J01062O6944N6172j0032j04438
21221A05434j14460j6505J2341j08105n040J18464O2770L6867n1601j03375r4811
$$ y = [39139, -62494, -25648, -86634, -110991, -6179, -436, -87136, -152250, -163516, -144270, -176268, -129639, -135433, -90324, -152708, -92610, 22896, -42733, -95685, -27240, 50186, 123739, 138656, 46726, -24618, -44054, -33843, -7319, 96105, 92822, 44865, 26204, 3901, -13147, 19975, 5148, -59137, 18971, -31092, -200090, -211655, -181722, -232093, -235903, -160638, -82143, 118418, 116425, 46111, 163137, 184719, 88114, -101726, -232784, -289538, -251881, -160199, -31774, -1196, 13400, -17630, 64338, 155199, 27515, -76954, 17004, 128961, 68868, -33588, -46320, 10545, -46136, -4274, 96788, 163732, 219904, 209872, 105434, -9026, -25531, -13190, -121295, -126335, -7871, 54899, 91766, 40165, -63210, -158021]
21210a58021O2978P6167m314q771L7916K14273Q4643r6599j46639q9492M8741
21199B0882j2001Q5000o8166n1813n7077K4895J22468J0198o8643l4370K2442
21188f185n2977n1349N2644P8716l3998j05224k0759N0460M0461Q7135P3887M2103
21176A54914P8295p5824j57036P251r9143o1482p8080M1197J34127O1308j17140
21165a11613q2920J44399m0028p747R2037J49544m1826n7130l7494l0261J6382
21154f657j7659j20710k2870P6986l2362J33755R9841l2881J06033o4027r9308
21143B0141o0654n6997M0481K431L8735L9016j05055j32408p773q995N2588N4049
21131a24441O3182J29953p8105p9274M5849L5315K2739o0259q455K5423K9762
$$ y = [-158021, -95043, -18876, -23190, -31961, 5955, 220228, 304871, 208272, 61633, -27859, 20882, 8881, 93881, 25715, -26098, -83175, -58280, 64188, 74386, 5743, -28627, -6185, -59162, -110511, -57867, 20849, -13149, -118373, -139132, -88672, -48211, 38924, 112811, 154914, 233209, 157385, 349, 7600, -91543, -153025, -231105, -189908, -55781, 5527, -111613, -194533, -50134, -90162, -97909, -5872, 143672, 101846, 44716, 7222, -23039, -6657, -24316, -145026, -167896, -90910, -123272, 10483, 110324, 77443, 183476, 119449, 20141, -40513, -97510, -57029, -54598, -15863, 23153, -81902, -214310, -222083, -231078, -178490, -124441, -61259, 68694, -9411, -88685, -42836, -7521, 15218, -45041, -53496, -28073, 1689]
21120A689L9174j55406j00735J03592J0537q949j21311M5173J07746J63168l1273
21109E3405r4609m5729O744k9067Q0471N2214n668j8620j13368M5697J26679P3723
21097A31872l5299n4114r932j09725k00624K0261Q6697k556N6440O6233l6178
21086h6925Q9638l623J6855n2238O6705M2966j0393j56085m4891K4229q853O0560
21074f2055k0045j41717O4263N5807J196j3109j4340N635K17619K1586j40144
21063b5304l2313N9390R8300J6782j29553l0660M1580K0069r8503J0755M2870
21052b6587o9224N7698j7219k7414Q4568N3564Q927l8005j04259K6080p7491p5204
21040b04566J25418M7683P304m9022J37338m8675m04J09244M9029p4985l3673
$$ y = [1689, 40863, -114543, -215278, -111686, -101149, -110098, -231409, -186236, -78490, 84678, 53405, -41204, -86933, -80189, -109256, -28785, 23429, 17761, -859, -114227, -68530, 58149, 131872, 96573, 42459, 32527, -77198, -277822, -257561, -170864, -173420, -116980, -50747, -86925, 2713, -910, 15945, -36293, 30412, 73378, 62985, -93100, -137991, -113762, -122615, -62055, -82100, -223817, -159554, -103747, -102551, -115660, -130000, -124365, 93254, 114840, -25304, -57617, 1773, 100073, 116855, -12698, -43358, -1778, 18291, -80212, -69457, -26587, -95811, -38113, -55332, -82746, 1822, 55386, 64313, 26308, -77951, -51871, -129362, -204566, -79148, -31465, -24161, -73183, 64155, 15480, 15076, 124320, 173349, 98364, 64691]
21029F4691J6713m7354r2442n7822l3156L8731J02414k983o4437J73496Q9274
21018A87125l6485n1064n4226j17015P450P2978R9750r7745j68873p5551J53386
21007h0270O0758m4943p044q238j05560q1414J01760P6584J32469M4566q0180
20996H488l2384p4761J5486R1628O3422n043K1959m2766p0569k2110q3813l303
20984a33766j8690P6783R888N866K1050M8533k6435o7962j2897P1074J19591M2439
20972A35474O9303q3970j15146l878K1530N1244N3243j06965j76432P069R6940
20961e1588J42376M6705R187p8400k14539J8250N8919r405j6921l8627P2610O5402
20949C969j12101o3672P6647n5922n1426J37750J08573k6705o2471l3380J7952
$$ y = [64691, 81404, 34050, -58392, -116214, -149370, -110639, -8225, -11208, -75645, 97851, 187125, 150640, 99576, 45350, -71665, -64215, 8763, 108513, 10768, -158105, -233656, -80270, -19512, -64455, -71499, -79737, -185297, -266711, -164951, -88367, 44102, 88668, 8488, -23896, -98657, -83171, 8457, 71879, 66836, 88795, 46029, -24540, -46650, -130463, -133766, -152456, -75673, -65785, -59919, -38869, 9664, -16771, -84733, -97630, -26556, 93035, 135474, 204777, 120807, 5661, 1783, 23313, 74557, 127800, 20835, -155597, -148528, -51588, 90788, 137493, 146680, 68280, -146259, -128009, -69090, -78495, -95416, -134043, -61433, 3969, -108132, -171804, -95157, -151079, -202505, -64755, 43818, 17113, -45358, -78738, -60786]
20938f0786N630l201O2455m326j7931L9426n9830o018Q6475n4155k27729J0422
20926b29568J38587n7225l6498P6167O0123L5885O3259r4856m2924K7637L2026
20915b7387k5758M864Q1096L2766o9141J6507P6475n5119l0253n2442K3017j7584
20903d2959N4260P7416j03681m3846J15268q9962K5364L9852l1272j42601k7505
20892a69666J18498O4745j4891l4571l8029M1389O0291M6561n2744L8191p8068
20881a8294p3541K3104l2285n0456k9201K668j4772L0713M8926M1760j0582k725
20869h4685l6501N5200l0860P4475J1546j06601j4002j4856N0740J82505K9921
20858A16882L1109k2649l1591n0107k132M836j28286q429P8689j6131j1237L6900
$$ y = [-60786, -55156, -58357, 4098, -228, -18159, 21267, -38563, -44581, 41894, -12261, -239990, -229568, -90981, -148206, -184704, -108537, -48414, -12529, 50730, -44126, -87050, -59413, -27387, -53145, -48281, 32815, 65581, -3560, 12947, 89422, 34303, 4050, -48392, -25375, -42959, 11301, 88717, -14964, -58810, 56458, -33504, -8140, 31712, 440, -142161, -169666, -51168, 13577, -1314, -35885, -73914, -32525, 27766, 74327, 21583, 59774, -18294, -91835, -68731, -101016, -151472, -180673, -178005, -192777, -162064, -113138, -71378, -81960, -84685, -121186, -65986, -96846, -22371, -10825, -117426, -131428, -146284, -95544, 86961, 116882, 147991, 125342, 93751, 43644, 41512, 46348, -81938, -90367, -11678, -27809, -39046, -2146]
20846b146o1139N9731J04064j00281r2528K7473j7714M7206L9976n2938m4879
20835i3175Q6000r3561o2561Q3219N126j9838Q7767M3194N6379P493o9735j42325
20823a12017q593P5229J88373O0866m4406l4616p4685k08q6336k7579K6663L8690
20811A381o4094j33985n9276J41595K68949L1446L3564l2134m6625k3063M2651
20800A60409l5944j54760k0654n642j42633l1963Q7223O8579J4702J8589Q0086
20789C7992R7656n0083j54982N9419K0644n7000m2258l4585J14015J22300j279
20778A11839o0541m2980J0301O6648R7812r5383l3741M2106j3101j21727j5610
20767e4377l4336O8536R8243l3727j15000j9818P4334R196K4059J36128m1751
$$ y = [-2146, -63285, -3554, 100510, 229, -92299, -64826, -82540, -35334, 4642, -48296, -93175, -7175, -100736, -163297, -80078, -74952, -94790, -7023, 36171, 92550, 100043, 30308, -112017, -120610, -45381, 142992, 203858, 159452, 124836, 50151, 49943, -36393, -63972, -37309, 1381, -62713, -196698, -255974, -114379, 154570, 186016, 219580, 187446, 140821, 117758, 160409, 124465, -30295, -50949, -56591, -199224, -231187, -143964, -75385, -60683, -42094, 37992, 135648, 85565, -69417, -9998, 10646, -46354, -88612, -123197, -9182, 113118, 111839, 51298, 8318, 18619, 85267, 183079, 87696, 53955, 96061, 82960, -38767, -54377, -88713, -20177, 78066, 44339, -70661, -90479, -16145, -6949, 17110, 153238, 111487]
20756A11487k0480l412j18215j32361M3886P3591N4130J2789j0041K20908M601
20745B36883j28212j21879M7999J35528L3719o5197p8303o7542j45238O6328O6042
20734a9872P5496m2787j10050n6115M3972J5391Q6472Q1850m9279n0724R116O2288
20722D5758k625k3795P797m4712l0529J3445j47362Q1032R6397o7308P3381N7328
20710E8807m8524l5011R7043R8147J02442k6491j44861j01126j30004Q2192J94947
20699A47561J8559j08042n8238k4168O4909o8035M1891m8455j39858j9270Q857
20688a84289M4359J03852m9169P8824J33872J5053l7970j4806M5770L8245j12038
20677F1703p0780L2712q2964r1241J10566M6752o3701m1286Q0647J73607n375
$$ y = [111487, 91007, 87595, -30620, -162981, -119095, -45504, 8626, 21415, 11374, 232282, 236883, 108671, -13208, 34791, 170319, 204038, 138841, 60538, -7004, -152242, -85914, -19872, 55624, 12837, -97213, -153328, -109356, -93965, -7493, 74357, 25078, -25646, -16530, 45758, 43133, 19338, 27135, -17577, -48106, -34661, -182023, -100991, -4594, -71902, 1479, 58807, 10283, -24728, 72315, 170462, 272904, 246413, 101552, 426, -129578, -47386, 147561, 166120, 58078, -160, -24328, 40581, -27454, 14437, -34018, -173876, -193146, -184289, -139930, -36078, -85247, -6423, 127449, 142502, 104532, 89726, 135496, 173741, 61703, -9077, 23635, -59329, -150570, -40004, 6748, -56953, -98239, -17592, 156015, 150640]
20666A50640j23904j26216J0318J20816Q9091k7185M980l6284J17930k1246L5444
20655A94384P185j78722q4918L8154M6562j8911R10N7285P0521q555P5893n1189
20643A48599j92433j62029O1518J25404K2882j49132M0443K01234Q306o4793N4348
20632I4347n1714j5974o8009M6781L0813m6243n1630n9204m0746M5143P4478k5176
20620f7134Q0766J6983o0921j2446R376N620n097K888j04771j04062J43674j2773
20608a07897M2999M5077p9066m4304Q006j6493K138O4873l6574q9699O4152J56123
20596I335o9180o8103q8065K9386Q3730J1740J9020P8219Q0060j39670n2868J43958
20584C7562J08700n463l2430q4923k5633J453K1991N0788o3035J05216M1531j87224
$$ y = [150640, 26736, -99480, -89162, 31654, 120745, 93560, 98540, 62256, 180186, 158940, 194384, 201569, 22847, -62071, -23917, 22645, 3734, 4644, 61929, 132450, 123895, 199788, 148599, -43834, -205863, -144345, -18941, 3941, -145191, -104748, 96486, 104792, 39999, 94347, 42633, 26659, -41350, 5431, 36244, -9999, -61629, -120833, -161579, -116436, -41958, -67134, 13632, 30615, -30306, -42752, -33376, -27756, -32853, -29965, -134736, -238798, -95124, -107897, -64898, -19821, -98887, -143191, -135185, -151678, -149540, -84667, -121241, -210940, -146788, 9335, -59845, -127948, -216013, -186627, -102897, -91157, -72137, 6082, 86142, -53528, -106396, 37562, 146262, 140799, 108369, 23446, -2187, -734, 21257, 72045, 9010, 114226, 155757, -31467]
20572c1467M1037M2552K4659n5512q8475n9554J62097O6810k3665j02121M6771
20561B3132l4825j92452j0221N1685R9201J08175J8747j79379J1896J24786j24755
20550a04010l2052q0417L3165k70K2o365L4096o807M3681M4434J85917n167j69296
20537f3069j41123o5872J00633J73649J9915j06781K745R3487n0007m932l9852
20526h1207Q6515J1684n7181Q1467o3369m5669q7492O3602j7362M4374N1496l143
20514a6285N7406J3443p7704j2213o904j2706k8727L7928Q1424l8294q9693J84986
20502I2661J71566j3023j37525j14270q2625O6769R3859n0621j28095L5798j151
20491f6657J23124J06298M1118r2031j30999n1679J15797J06422l8341m7865P834
$$ y = [-31467, 9570, 52122, 76781, 21269, -67206, -126760, 35337, 102147, 78482, -23639, 23132, -11693, -204145, -214366, -162681, -63480, 44695, 63442, -115937, -104041, 20745, -104010, -136062, -216479, -183314, -183584, -183562, -189927, -155831, -162638, -118957, -74523, 111394, 106227, -63069, -204192, -270064, -169431, 4218, 24133, -82648, -79903, 13584, -36423, -41355, -81207, 5308, 16992, -40189, 41278, -22091, -67760, -155252, -91650, -109012, -64638, -13142, -16285, 41121, 54564, -23140, -35353, -42257, -54963, -83690, -45762, 35662, -2632, -92325, 92661, 264227, 251204, 113679, -591, -83216, -16447, 77412, 26791, -101304, -65506, -66657, 56467, 162765, 203883, 111852, -19147, -70826, 44971, 151393, 113052, 65187, 73021]
20480G3021N4912O1935o1984l1765j1316O596r5338L4182k7988q762L9539M1853
20468G4885K9815q1292p8842p396L1659R0882L8831p3825j31526J31375J09913
20457A34479j14902l7512N2562O7818n7549J7626m6123n1727R9363l5431j5257
20446A3347O3224L3015L856j04739j36026o0626Q819P1363J294k6267r216O5546
20434g6410L3363L2308l3327M4522J99470O938r5718j3470j8306k4481l761n6240
20422e112K4373p2381M2992P1657N9516j20327l0570J18369N1245r1193R218M4399
20410A02186r34r6887r0697l0913J430J64400P3707N7551m9060j56845K40N6410
20398C0588j06067m6363p3904o3737j8746J15399J2028k1354l5954R2487L1234
$$ y = [73021, 127933, 189868, 127884, 96119, 84803, 91399, -3939, 30243, 2255, -6507, 33032, 74885, 104700, 23408, -55434, -62830, -31171, 59711, 98542, 24717, -106809, 24566, 134479, 19577, -17935, 34627, 102445, 44896, 62522, 16399, -35328, 64035, 28604, 13347, 76571, 109586, 113442, 8703, -127323, -187949, -179130, -107767, -106473, -132740, -141956, -76410, -43047, -10739, -44066, 456, 199926, 206864, 111146, 97676, 79370, 54889, 51128, -5112, 19261, -53120, -10128, 61529, 121045, 718, -29852, 88517, 139762, 48569, 57787, 102186, 101252, 4365, -86332, -117245, -115815, 48585, 122292, 179843, 130783, -26062, -25822, 30588, -75479, -121842, -195746, -259483, -278229, -162830, -150802, -172156, -208110, -115623, -84389]
20387h4389q7236R77J26429Q1651J6814P6840p9735M1915k077j15158k5792k0432
20375g0193P0317N4001m8593P706K9451r8597j13272p432R2278J09446l7261j38748
20363a50897O3573N7724N3835l1915k1887o3403j12257K6045R1273J36342N684
20352E4117J18085j2239n505m3707l8066L1947J31629r8242j06440j30552l4625
20341a33598J04801N505L567p3192j10192n7240Q2907J88134R9630k3779p4938
20330A1605R066R3089j30098p1278J8424j8945J00125N8542k7436j81721K5999
20319a12628J53069J33978O6683K4456q4098k4123n8126j09143j45433l0156L4483
20308a51038Q9862j828j686O0136J4360j25346M4677M2039n1578o4570Q9345L0821
$$ y = [-84389, -171625, -170648, -44219, 37432, 54246, 131086, 51351, 93266, 91189, -23969, -49761, -70193, 124, 54125, 5532, 13238, 42689, -55908, -169180, -176612, -84334, 25112, -12149, -150897, -87324, -29600, 24235, -7680, -29567, -92970, -205227, -179182, -87909, 48433, 54117, 172202, 159963, 154458, 110751, 72685, 104632, 236261, 138019, 31579, -98973, -133598, -28797, -23292, -19725, -92917, -203109, -260349, -177442, 10692, 110322, 86543, 11605, 20671, 113760, -16338, -87616, -69192, -88137, 11988, 70530, 43094, -138627, -112628, 40441, 174419, 241102, 265558, 181460, 157337, 99211, -9932, -155365, -185521, -151038, -61176, -63004, -64690, -4554, 9806, -115540, -70863, -28824, -80402, -144972, -55627, -24806]
20296b4806q4556J1301J51317Q729p3473P7280J7863p4690O9562J03813L897P9993
20284B66230n6071j94296k5064N9905q6913N1423J36707N5325q7106j17921M1232
20273D3451m1620j76786q5924N3019J12495k854n0073J62131K15684q0481q5279
20262F3763p30p1114L8821N8973O2331o3200j1486P3846L5536r5397q1915j4333
20250d905N9091J4138p3422k0630r2239n1213j3663J88672M7614J01185P4745
20239B29373j46665j44001N1546M3519l0709n995p3413M2246J6244J05n1729r611
20227g9090J80864K4482p4071o8351l271L4264M028m714m576J62335l7221l1942
20215A02737m6630O7955n3275k5829j3681p7083j05097k6183L3707Q7597K9126
$$ y = [-24806, -109362, -98061, 53256, 61985, -11488, 65792, 83655, 8965, 78527, 182340, 186237, 266230, 210159, 15863, -9201, 50704, -36209, 15214, 151921, 207246, 120140, 2219, 43451, 1831, -174955, -260879, -207860, -95365, -98219, -148292, 13839, 229523, 149042, 63763, 63033, -8081, 30740, 89713, 152044, 88844, 77358, 151204, 186740, 91343, 9428, -4905, 54186, 68324, -5098, -25728, -117967, -169180, -182843, 5829, 53443, 154628, 229373, 82708, -61293, -9747, 33772, 3063, -2932, -76345, -34099, -17855, -17750, -69479, -79090, 101774, 126256, 52185, -16166, -19437, 14827, 18855, 14141, 9565, 171900, 134679, 102737, 56107, 124062, 70787, 44958, 31277, -45806, -150903, -177086, -143379, -55782, -26656]
20204b6656q0036M2016O3930k1792J2742J5090R008N8042j9956n6951l3814m0385
20192g8762o1337n3184l2698j5120J14209L2627M574Q4850j87143J6080J48867
20181b7037q224P4721K857o9104J4489p4064L8837P6015l2507j133M7821K7144
20169F9815N1918M5129n0733k126J05560O8026o9960j44639p5699m181K4731J0432
20157B8273J1547L1520j3396l2901k8988j30104k2952J79844R3989p662J0419
20146A19589l553j45796M2823J81370J00134o0376q4610p3313r2494n252M980
20135a6498M5652K4026K3213n2075l0413L836o0254m510J03736P5629Q4094n7833
20123A38603n820L5380n0067k0545O1376k684o3866q0027r1035L4612J13944P5989
$$ y = [-26656, -106692, -64676, -746, -22538, -9796, 5294, 14302, 72344, 52388, -4563, -38377, -78762, -140099, -193283, -225981, -241101, -126892, -94265, -89691, -4841, -191984, -175904, -27037, -35261, 39460, 42317, -26787, -12298, -86362, -47525, 28490, -4017, -5150, 42671, 69815, 121733, 166862, 116129, 114003, 219563, 287589, 217629, 72990, -2709, -6890, 17841, 28273, 39820, 71340, 57944, 25043, -3945, -134049, -157001, 22843, 116832, 109170, 119589, 116036, -29760, 13063, 194433, 294567, 234191, 149581, 76268, -16226, -21478, -16498, 29154, 53180, 76393, 24318, -6095, -2259, -62513, -67023, 36713, 112342, 196436, 138603, 132783, 168163, 118096, 97551, 158927, 156243, 92377, 12350, -78685, -44073, 69871, 145860]
20111A45860K1169m2387o7591o3529n6088j07060l2366O8675J02238o2653R6054
20100B322N0166k8367o764n290J67035O4111j13543j01058K8985j9064l0177O0108
20088F8464j2319o32K7604N1247J8332p9189j8914K178j019k4077P5819O7737
20076A75231L48J9922N2086J6735j57673r1510J8191l0762k5756m9449o4597K1083
20064a16151o572K0167Q2878L2165L886m6457j1195N3755m7952J2707n1902M2239
20052c2432J08877K0889j42466j41786J12997N8155o6099o3611M5725J19759N5847
20041G5855p8886j0383P3801L9226P2650R1924K908j12705m4384k4383O3472Q8077
20029B37172o2999k7627n5096J4419j8470j22645k0810N5567J43098M6976K7406
$$ y = [145860, 167029, 124642, 57051, -6478, -62566, -169626, -201992, -133317, -31079, -93732, 2322, 52488, 24121, 17357, 12067, 179102, 243213, 129670, 28612, 57597, 38533, 8356, 68464, 56145, 55513, 83117, 134364, 152696, 73507, 54593, 56771, 55752, 31675, 107494, 175231, 175579, 195501, 247587, 264322, 106649, 15139, 33330, 2568, -23188, -72637, -137234, -116151, -122723, -102556, -19678, 12487, 16373, -30084, -41279, 12476, -35476, -22769, -74671, -32432, 76445, 97334, -45132, -186918, -73921, -15766, -81865, -145476, -99751, 20008, 75855, -3031, -13414, 60387, 99613, 172263, 264187, 267095, 154390, 110006, 85623, 149095, 237172, 174173, 146546, 91450, 105869, 87399, -35246, -56056, -489, 142609, 189585, 216991]
20018B16991r6377j09584L5026L8984J1802j5630p406l016L5716P7119K9700n1402
20006A61923Q1102O2099j91944k02838J8486Q6994Q1275K7628j3733n1888q8909
19995b9805o9093M3480R744r0914P9270Q2151K9408r1533p2389k7389J27492Q6516
19983G6938p0119n0132q6774m1966m082J13572K6256J8876R7022K3076j19783
19972a7116k9013j051p6073K859K7719k4495N2040L0186K8174K2571M1357p6566
19960a9408P5170P2584K2774j6327k0490j3950r6770j19683K2308n5781K7979
19949a21594J62693J03178l0965j04072n8960K5255j8058k3877K8156m8411j21277
19938b07932o885R9870Q2032j00580J027N050M0823L3913K6718j7006j04331q5222
$$ y = [216991, 120614, 11030, 46056, 85040, 96842, 81212, 73806, 70790, 106506, 183625, 213325, 161923, 243025, 305124, 113180, -89658, -71172, 15822, 97097, 124725, 110992, 59104, -29805, -98898, -55418, -45674, -136588, -57318, 24833, 54241, -37292, -109681, -137070, -9578, 76938, 6819, -43313, -130087, -172053, -176135, -62563, -36307, -17431, 79591, 102667, -17116, -46129, -47180, -123253, -120394, -92675, -117170, -65130, -34944, -6770, 15801, 57158, -19408, 55762, 128346, 151120, 134793, 114303, 100353, 3583, -116100, -93792, -149573, -121594, 41099, 144277, 113312, 9240, -49720, -24465, -42523, -66400, -38244, -86655, -207932, -214817, -114947, -32915, -133495, -132468, -127418, -86595, -52682, -25964, -42970, -147301, -232523]
19926b32523J11521R0520J5909j09576p9507J13874J28700J01959n1728m3382
19916D5767p138q93l0257M605R5333J2559N0091k6157j7128O314q1590j12983
19904f1477j09772O8652J81942j12601j1980N8549l9233M331p2240R4295J37707
19893A38173L1961q4206j15803o9044l4610j3026J05812J88744N5730r0174q3322
19882C0235j05566n0561R905J4327L3645J20384l754j18038K3277P3394q5905
19871e8657L1374J45676M0348m9760n724K9813O2560j1971m6775L0509r944l6775
19859A20674R7413J1183Q6538j2536K0890l4951j51450o3459Q927l469l1661m8183
19847h4M311M7185k1309j01119n8627o8553K0978L1565N015J44089J03374Q0368
$$ y = [-232523, -121002, -30482, -14573, -124149, -203656, -89782, 38918, 140877, 89149, 45767, 38629, 37736, 7479, 12084, 107417, 119976, 170067, 143910, 126782, 133096, 51506, -61477, -171249, -102597, 79345, -33256, -45236, 13313, -25920, -21589, -93829, 466, 138173, 170134, 85928, -29875, -98919, -133529, -146555, -40743, 148001, 203731, 113557, 30235, -75331, -125892, -115987, -101660, -68015, 52369, 48615, -69423, -46146, 27248, -58657, -27283, 118393, 158741, 108981, 103257, 133070, 195630, 183659, 136884, 167393, 157449, 120674, 218087, 229270, 315808, 303272, 324162, 289211, 137761, 74302, 83229, 79760, 48099, -84, 4227, 51412, 30103, -71016, -129643, -198196, -177218, -145653, -140638, 3451, 106825, 187193]
19835A87193n9120l6959O4372M4441J9216m1660n1813j17089R944J10252J21841
19824B50618R8282m0925j43998j23299o5095o5092R9144O172J01858j8132k1210
19813G8323L94l7832l757n1883O2967N7222J01183k9907p8736n2664l6298m2268
19801c3256O9998N7684j52571m8747J05061O1877m4485j32119j09089K0602J50605
19790e4440J06737J76549q3919j89025N7297N7926K4684p9346K0786k6524p0085
19779e9360P0543m0183o916M1029o887l6490L3191J13130L631j25467O6084J06107
19767A58412K1146r0080K3599L0136R2288k1578j74723J5904O6060p487m3295
19756G0382r1857K7463Q7931j6752N6108O7999j34087l4360j7455M0188J2076
$$ y = [187193, 128073, 91114, 155486, 199927, 219143, 177483, 125670, 8581, 18525, 128777, 250618, 348900, 307975, 163977, 40678, -24417, -89509, 9635, 15807, 117665, 99533, 78323, 78717, 40885, 37128, -14755, 48212, 105434, 206617, 176710, 97974, 45310, 9012, -33256, 36742, 94426, -58145, -106892, -1831, 60046, 15561, -116558, -225647, -205045, -54440, 52297, 228846, 144927, -44098, 13199, 71125, 95809, 16463, 37249, 10725, -59360, 11183, -29000, -35916, 5113, -1774, -38264, -5073, 108057, 111688, -13779, 52305, 158412, 179558, 89478, 113077, 143213, 235501, 213923, 39200, 55104, 121164, 113677, 70382, -21475, 5988, 93919, 77167, 133275, 201274, 67187, 32827, 15372, 55560, 67636]
19745F7636k5252K8465j07897j917L7996J7335R6001N0986o1004p011l0741N6909
19733A21506M6323l7075K5997o5802M6584j4178J9243J2118l3474P9645J31051
19722C31938j1353j50994m0697q9274M175M2270k6645J05789k885j03157o4951
19711e784K2138Q8445N8530q9230p968O2227Q1882N1327j9855k5661J410n218
19699B12243J8168m2186l9436Q8005l4910j37276O7337j0469m8298k4179J4650
19688F3649J22034M847o7071j12526l3437j21168J3201R6108J8118M5291o705
19677B2341Q9893R4755Q5085j00017j08262q0545J9784P2101M5997J16582n5195
19666B02519m9822m5309J1141K7568k19724j28975J67872Q7120J10886K4681m1438
$$ y = [67636, 42384, 70849, -37048, -38965, -969, 16366, 112367, 163353, 102349, 95338, 64597, 121506, 167829, 130754, 156751, 90949, 137533, 123355, 142598, 154716, 121242, 200887, 331938, 320585, 169591, 128894, 39620, 43795, 86065, 59420, 165209, 162324, 59167, -5784, 16354, 104799, 163329, 74099, 66131, 128358, 210240, 261567, 241712, 216051, 217461, 212243, 230411, 188225, 148789, 236794, 201884, 64608, 131945, 121476, 73178, 48999, 63649, 185683, 190530, 123459, 10933, -22504, -143672, -130471, -34363, -16245, 29046, 22341, 112234, 206989, 292074, 192057, 83795, 3250, 23034, 95135, 141132, 257714, 202519, 152697, 107388, 118529, 146097, -73627, -202602, -34730, 52390, 163276, 187957, 146519]
19655A46519q3142J9917R5478r5434j14386P0669J20917K08327m9677k88011J8258
19644D9435Q1275Q5410o4274K4414N0406L243n7259o9453k9825J0386j15746k2956
19632e4944m8827n1478j09284m6776P1268R6319R4336J30223L60j3118N9493k0373
19620A07199j2142L8731o3068o7436j8702R7660L0823N1608J33171l3211j13266
19609A51367M1931k3194j36020q1313R210l4791L4661K7198j4591R0451p3012
19598h103R6778Q7774j4942r3051J3297J00361j30972k0681l0106N767k6679M3222
19586B2665M541r6018k7081O1364J25368K2124q7459K0233o2705K8127j4243J0957
19574G873l0633J8876Q3397N8282N2894Q1407m0764j08453K2907Q0641o2607p3617
$$ y = [146519, 63377, 83294, 178772, 83338, -31048, 39621, 160538, 368865, 319188, 31177, 49435, 130710, 216120, 151846, 176260, 226666, 229909, 172650, 103197, 73372, 83758, -31988, -54944, -103771, -155249, -264533, -311309, -240041, -143722, -49386, 80837, 81197, 68079, 127572, 107199, 95057, 133788, 70720, 3284, -15418, 82242, 113065, 164673, 297844, 264633, 151367, 193298, 170104, 34084, -47229, -38019, -72810, -38149, -10951, -25542, 64909, -8103, 88675, 176449, 161507, 68456, 81753, 182114, 51142, 30461, 355, 6122, -20557, 22665, 27206, -68812, -95893, -34529, 90839, 112963, 25504, 45737, -16968, 11159, -3084, 7873, -22760, -3884, 79513, 137795, 190689, 272096, 231332, 122879, 145786, 226427, 163820, 90203]
19562I0203n2807L5800M3303m6176O6984j7935p2050J6936O461N6775N2252j20693
19550E9053n3616K3738O5717P7161O4253j18013M205n1719m9152J5158J11548
19539A48333J93535P9969K5645m7284j40643m1627P7644p9440p8629K9758J23108
19528B90369n4521j20896j2471N101r2144k7986r8313p3627M4987J49405M0161
19517E0065k9717M4537J02043J9877M0403Q2233n898l9644j22627k916Q580O7553
19505B14489k6491p009j1046j13151n230O1312k7995n8857M1545m6446k1375J08325
19493A08071p587Q3110P0486k1963j20765L1072m0861M0361R4253K1088r1597
19482A65668L8417j5721N4892J39526R664P8114r079M7441Q9099j5477M5008J21550
$$ y = [90203, 37396, 73196, 116499, 70323, 137307, 119372, 47322, 64258, 70719, 127494, 179746, 59053, 5437, 29175, 94892, 172053, 236306, 118293, 122498, 70779, 21627, 36785, 148333, 341868, 421837, 447482, 400198, 259555, 217928, 295572, 216132, 137503, 167261, 290369, 235848, 114952, 102481, 107582, 15438, -12548, -110861, -184488, -139501, 9904, 50065, 20348, 64885, 166928, 186805, 227208, 309441, 303543, 263899, 141272, 138356, 146936, 214489, 187998, 180989, 169943, 56792, 51562, 112874, 84879, 26022, 67567, 21121, -254, 108071, 100484, 183594, 254080, 232117, 111352, 142424, 101563, 141924, 236177, 257265, 165668, 204085, 188364, 243256, 382782, 392446, 470560, 461481, 508922, 598021, 582544, 627552, 749102]
19470G49102m8619p7759n6523J2718j01831P2154k4704l5569j81120l7923J56579
19459D26505J80653m9051k959o5049j23796o4820r1583m3402L6117l5120o078
19448A61417k6515J06220L345n8546l6968r036o109R817P5619J17903q0175j50467
19436A06505K1528O1196K1163O1558J78666K6697o5898M3873P6788M7452L2350
19425F11878P9650J39146J5981m1007J15202P3410j41288j49501n2429J10148
19415G61190q8181p7230n1605j37584q2270M4198M137K6072j6066P051R6848R0323
19403E76883N3279m6645k16062m6966N4281K69p9760J17251l5356p830o4902r9222
19391B05220r0983r5935J03467K28645J1951l0677q0693r1952l9197l1064O1012
$$ y = [749102, 700483, 622724, 566201, 578919, 477088, 549242, 524538, 488969, 307849, 269926, 426505, 607158, 558107, 555148, 490099, 366303, 301483, 209900, 166498, 202615, 167495, 161417, 134902, 241122, 244467, 185921, 148953, 139917, 133808, 143625, 219244, 337147, 256972, 106505, 128033, 189229, 210392, 271950, 450616, 477313, 411415, 455288, 532076, 579528, 611878, 691528, 830674, 846655, 805648, 920850, 994260, 852972, 703471, 651042, 761190, 673009, 595779, 544174, 406590, 324320, 368518, 372655, 398727, 382661, 389712, 486560, 576883, 630162, 583517, 367455, 320489, 374770, 375039, 295279, 412530, 377174, 369344, 304442, 205220, 114237, 18302, 121769, 350414, 362365, 331688, 250995, 159043, 119846, 88782, 149794]
19380A49794R9402P6036J036p6648j64404O1207J31926K3470j20376m9431P3213
19369B05225k7314n0010n0572L1241P5507Q4553P4696O3185o1870l4808j42942
19358A66891P4404J36105M0287P719l7345l3304p7498j1951K0181O1782M1518
19347C88789N7303j49883j8534O8770j39906N2768P0848Q685p5205N1655k7752
19336B87538p5072Q6055J2931l7592k9758j951M2859L0116L882O0322N9486J03564
19324E42380o1426j16231J83558J34676J08009O1191K46743L27327J60677N0784
19314A637688J58332J39096L3244O1764n2620J3249j13384j80429k30387j16784
19304A349769j72968Q38r246j65596q4665n8250n0689K0459J19121L6143l0669
$$ y = [149794, 249196, 325232, 326268, 249620, 85216, 146423, 278349, 301819, 181443, 132012, 205225, 177911, 127901, 77329, 108570, 184077, 268630, 343326, 406511, 344641, 309833, 166891, 241295, 377400, 417687, 425406, 388061, 354757, 277259, 265308, 285489, 347271, 388789, 446092, 296209, 277675, 346445, 206539, 259307, 330155, 338840, 263635, 315290, 287538, 212466, 298521, 311452, 273860, 244102, 242151, 285010, 315126, 319008, 379330, 438816, 542380, 480954, 364723, 548281, 682957, 790966, 852157, 1098900, 1426227, 1586904, 1637688, 1796020, 1935116, 1968360, 2030124, 1977504, 1990753, 1877369, 1696940, 1466553, 1349769, 1176801, 1177639, 1168393, 1002797, 918132, 859882, 809193, 829652, 948773, 984916, 954247]
19293I54247j39084k6316l7121M205J3677K2653j66697q1463J9803j6475K09L3977
19281E81615r1510l1380k1832o0042l5369l5999K9892j2764P2745m6191m8512
19270C00653O263L4370k2003j5860Q7767J479j12650k1774n2453M1940K313J73562
19258D23607K21582n5715r015J5404L7000O0743J25120j6948O0320l1137k0849
19247H10112N528j2775J07725N1911j4405J0843m0423j43757M3562J58209p7081
19236H99449o0555k9120L3627k7031l2007m7230q55p112j08850o3191J6501M068
19224E77694n4594j28024j04516m8831J82724O0203L5823k0017m7190k7197m7748
19213C78327K509J39019k7861M7500r3456p2790J9067k5139O5721J34916m2045
$$ y = [954247, 815163, 788847, 751726, 755931, 769608, 792261, 625564, 544101, 563904, 547429, 547638, 581615, 490105, 458725, 436893, 376851, 341482, 305483, 335375, 322611, 395356, 349165, 300653, 306916, 341286, 319283, 303423, 391190, 392669, 280019, 258245, 205792, 247732, 250045, 423607, 645189, 589474, 580459, 595863, 632863, 693606, 818726, 801778, 862098, 830961, 810112, 815640, 802865, 910590, 962501, 948096, 958939, 918516, 774759, 818321, 976530, 899449, 838894, 809774, 843401, 816370, 784363, 737133, 736278, 729166, 620316, 557125, 573626, 577694, 523100, 395076, 290560, 241729, 424453, 484656, 520479, 500462, 453272, 426075, 378327, 380836, 519855, 491994, 539494, 446038, 373248, 392315, 367176, 432897, 567813, 525768]
19202E25768r6429j7821N7074n0575r552L9951J71874J50928K5007o8860L960
19191G31325P2825p3553q3059J06698J62350R3298M9354o1678j03229J2783l0578
19180H76536r8044j50701O4685j5684k4394q3241j6391J08654p624N2754Q0656
19169G87206P163j17100p9101p2092q4944N6243Q9001k7157K5064J11029K4318
19158G19630j25678p7670M6849J05579j1245l8927o9378o1643j39723K0818M2848
19147D11460k366n4962l3201K8038j7328j1778J774Q0566Q8061Q8811l7103p2520
19135D69452k6066Q1197J44600N6212K7397N6599o6549j06951n3590J32584L9440
19124G54325j70871j00686k8672J7775L2452j170m3206R633O6522q1676q1820
$$ y = [525768, 429339, 411518, 468592, 418017, 408465, 448416, 620290, 771218, 796225, 727365, 731325, 804150, 730597, 647538, 754236, 916586, 1009884, 1059238, 997560, 894331, 907114, 876536, 778492, 627791, 692476, 676792, 652398, 569157, 552766, 661420, 653796, 706550, 787206, 794369, 677269, 598168, 526076, 441132, 497375, 586376, 559219, 584283, 695312, 719630, 593952, 516282, 563131, 668710, 657465, 618538, 549160, 487517, 347794, 368612, 411460, 409094, 354132, 320931, 348969, 331641, 319863, 321637, 402203, 490264, 579075, 541972, 469452, 443386, 524583, 669183, 725395, 752792, 809391, 742842, 635891, 582301, 714885, 754325, 583454, 482768, 454096, 471871, 504323, 503153, 459947, 469580, 536102, 454426, 372606]
19113C72606k6423j02430O7499o676m2407N591M6008j5097j24900P5417M2835
19102B92023k5004J7434j7910j32342j04816m6639p9120J15739J31679J6992n056
19091A62980l0179k7073l8020j6100P8637K44387J15182J7261p1091l2593j6743
19080C86648j5485P4825J62392J25618j21574j00699K4564L4793J25792j7804
19070F79070o4691K7729R4044M3519N2635o3858o5790J8597O0430j52683j59624
19059D69378n301Q0590O8200K5086k335M5397J04720J49284M99j30165r8945J19667
19047H26075Q6551j04388j26381j04797O148R0057M5176N0210m8393r9981L8568
19036F58845J27745l0584m1495k8858O6498J57225K55251Q2005Q0624K9699n7427
$$ y = [372606, 346183, 243753, 311252, 304576, 262169, 267760, 313768, 298671, 173771, 249188, 292023, 267019, 284453, 266543, 134201, 29385, -17254, -96374, 19365, 151044, 168036, 162980, 132801, 105728, 67708, 51608, 130245, 374632, 489814, 507075, 435984, 403391, 386648, 371163, 445988, 608380, 733998, 612424, 511725, 536289, 571082, 696874, 679070, 614379, 642108, 736152, 779671, 832306, 768448, 702658, 721255, 781685, 629002, 469378, 464077, 544667, 612867, 637953, 635618, 681015, 785735, 935019, 935518, 805353, 706408, 826075, 912626, 808238, 681857, 577060, 583208, 673265, 718441, 768651, 720258, 620277, 658845, 786590, 756006, 714511, 685653, 752151, 909376, 1164627, 1246632, 1327256, 1356955, 1299528]
19025A299528k1222L5966K585k04803p7407O1309J89543P5999k4838J17635K4815
19014A479110K4366K1513p2702l8570m2836P3033R7730p9878j33070N130J04583
19003A438409M0384O7916j27469l990J58789L5265n3832k4836M918J47543J45643
18992A828740J54741K02166J98886R9751J42008K13727J42524J96974K24478K87839
18982C691834K53927J45223K09476J34047N5802K59782K13224K39474K16838L48894
18972E768521N39872N45352Q15819R93236J262941J866587K738037L754142N559778
18963B3844285Q363838J0985906J0063725P655188P653856O148793N206738O717909
18955H6640238O284915P561453O200250j524657k498899R35700j437092n676113
$$ y = [1299528, 1278306, 1314272, 1316857, 1112054, 1034647, 1095956, 1285499, 1361498, 1336660, 1454295, 1479110, 1503476, 1524989, 1452287, 1413717, 1370881, 1443914, 1541644, 1461766, 1328696, 1333826, 1438409, 1478793, 1546709, 1419240, 1415250, 1574039, 1609304, 1555472, 1530636, 1535554, 1683097, 1828740, 1983481, 2185647, 2384533, 2484284, 2626292, 2840019, 2982543, 3179517, 3403995, 3691834, 3945761, 4090984, 4300460, 4434507, 4490309, 4750091, 4963315, 5202789, 5419627, 5768521, 6308393, 6853745, 7669564, 8662800, 9925741, 11792328, 14530365, 18284507, 23844285, 32208123, 43194029, 53257754, 60912942, 68566798, 74715591, 79922329, 86640238, 92925153, 100486606, 106686856, 105162199, 102663300, 103599000, 102161908, 96485795]
18947I6485795o710185o253038j0132881j2136369r239553o813112n515553m740485
18939C4944619m083373l199927k445258j854004j277446j068990q66316o34572
18931A9514733o10618o43552n89296m21120k05575j16964k92851k30132j10531
18922A6294094j43893N0569J81321N06804R76868J885790K624772L871013N861889
18913C2109227R109578J2470647J2494900R790752R424919Q536666O610931O423945
18905A06971565N782297P879632P381639k95243k614247J826634Q58624n318938
18897A22471963q384111p346497j0984923j5810050j2908420r162878p159358
18890E0715726o145897n257804m601536l734885k760089k093781j924471j707287
$$ y = [96485795, 89775610, 83522572, 73389691, 61253322, 52013769, 45200657, 39685104, 34944619, 30861246, 27661319, 25216061, 23362057, 22084611, 21015621, 20149305, 19514733, 18904115, 18260563, 17671267, 17250147, 17044572, 16927608, 16634757, 16404625, 16294094, 16150201, 16200770, 16382091, 16888895, 17865763, 19751553, 22376325, 26247338, 32109227, 41218805, 53689452, 66184352, 75975104, 85400023, 93936689, 100547620, 106971565, 112753862, 120633494, 128015133, 127719890, 125105643, 126932277, 127790901, 122471963, 114087852, 106741355, 95756432, 79946382, 67037962, 57875084, 50715726, 44569829, 39312025, 34710489, 30975604, 28215515, 26121734, 24197263, 22489976]
18882B2489976j296587j232181j040147q72295r15100q63490p10355o94299o43598
18873A4221924n83488o08834n71586m62727m58840m12820m64852m47057l97167
18864I814553l72655l16515k45036k55950j63407j37322k66379k34180k85294
18855G537815j91438J7491J13146m3086j12916k02684o0116n7313j87049j92765
18845F621085j76031k07013j30589j49921j35019j68471k35118j87690N4288r1405
18835E194116k07438j56397j16665J9379L7406n0692n4994j22024j06253j3439
18825D422999q0611M5939J7684p6980j67607J8009J0208R7663L7145L0287Q5807
18814D440543m3873p018P2324J83521Q3431Q7522L3998Q0212J95776J35046P4778
$$ y = [22489976, 21193389, 19961208, 18921061, 18048766, 17133666, 16270176, 15559821, 14865522, 14221924, 13638436, 13029602, 12458016, 11995289, 11536449, 11123629, 10658777, 10211720, 9814553, 9441898, 9125383, 8880347, 8624397, 8460990, 8323668, 8057289, 7823109, 7537815, 7346377, 7363868, 7477014, 7433928, 7321012, 7118328, 7058212, 7000899, 6813850, 6621085, 6445054, 6238041, 6107452, 5957531, 5822512, 5654041, 5418923, 5231233, 5285521, 5194116, 4986678, 4830281, 4713616, 4732995, 4770401, 4719709, 4664715, 4542691, 4436438, 4422999, 4342388, 4388327, 4406011, 4329031, 4161424, 4179433, 4189641, 4287304, 4324449, 4354736, 4440543, 4396670, 4389652, 4461976, 4645497, 4728928, 4816450, 4850448, 4930660, 5126436, 5261482, 5336260]
18803E336260P9955J94689K47502L57331N64413P80655Q75187J246965J695475
18794A1378432K041492J895062J922016K309264K508353K943484K405076K174088
18786B9577267K629975K103733J841055J408405J530984J865996J166295J167489
18778D3291199N92800J48604k36605k111833k277113j874317j968102k046927
18770C3517706l236125m033016l213421k196196j524673j232993q72078o99580
18762A6509624n37973l89921j40790r6324J33064L79159O82965Q70389Q77263
18753A8287456R64355Q90499J021209J178433J318558J589113J916593K276879
18745B9443095K974871M359228O144951Q607780J0677571J1283180J2623869J6644654
$$ y = [5336260, 5416215, 5610904, 5858406, 6215737, 6780150, 7560805, 8435992, 9682957, 11378432, 13419924, 15314986, 17237002, 19546266, 22054619, 24998103, 27403179, 29577267, 32207242, 34310975, 36152030, 37560435, 39091419, 40957415, 42123710, 43291199, 43883999, 44032603, 43795998, 41684165, 39407052, 37532735, 35564633, 33517706, 30281581, 26248565, 23035144, 20838948, 19314275, 18081282, 17209204, 16509624, 15971651, 15581730, 15440940, 15344616, 15477680, 15856839, 16539804, 17410193, 18287456, 19251811, 20142310, 21163519, 22341952, 23660510, 25249623, 27166216, 29443095, 32417966, 36777194, 42922145, 51529925, 62207496, 73490676, 86114545, 102759199]
18737A02759199K1730212K8707766L6397238M8608750O4332069O6836918N4784599
18730D24156751M7400084M5281074J4969690j8361261k0377327l1395503m9743772
18723D11929736n4344687m4231438l2637224k5881006j5326057o635106o107536
18716B26766682p603387r079660j5134423j7205136j1819086m642782j898536
18709A59383672l844975m477940o993092j2167374j3541785j3585061j1680169
18702I3093276r327758p490740o323939n442369m477323l984474l540229k854604
18694D9651840k390832k009042j614744j460323j119893r54415q17573o22782
18686C8662236r9003K35685N16298J102633K088245L508089N874888R123750J1431538
$$ y = [102759199, 124489411, 153197177, 189594415, 238203165, 302535234, 369372152, 424156751, 471556835, 516837909, 531807599, 513446338, 493069011, 461673508, 411929736, 357585049, 313353611, 280716387, 254835381, 239509324, 232874218, 226766682, 219163295, 210083635, 194949212, 177744076, 165924990, 161282208, 159383672, 155538697, 151060757, 144067665, 131900291, 118358506, 104773445, 93093276, 83765518, 76274778, 69950839, 64508470, 60031147, 56046673, 52506444, 49651840, 47261008, 45251966, 43637222, 42176899, 41057006, 40102591, 39285018, 38662236, 38563233, 38798918, 39315216, 40417849, 42506094, 46014183, 51889071, 61012821, 72444359]
18677G2444359J2077177J2367352Q217272K224193J231836j317253k022685K903975
18669A08126226O890170N368577J888335j855364o302571j1277915j3646575j0935525
18661G8255358q397434p110583n431718l879395k851286k212775k503133k984515
18653D2884519k849958l068833l062900k549992k316607k097448j634578j448561
18645B3855642j133466j046080r17963q06688n70103o23725n37038l96442m65172
18636A7358965m71840k80407l10813n4718k996J91172L33663N31674R54525J562637
18626A9811862K150649K588194L373662M291068L800906K734613K461076Q47409
18618D2059439k014227k106936j366035J16646J910178K022410Q70897n63429
$$ y = [72444359, 84521536, 96888888, 105106160, 107330353, 108562189, 107244936, 105222251, 108126226, 115016396, 120384973, 122273308, 120417944, 114115373, 102837458, 89190883, 78255358, 69857924, 62747341, 57315623, 53436228, 50584942, 48372167, 45869034, 42884519, 40034561, 36965728, 33902828, 31352836, 29036229, 26938781, 25304203, 23855642, 22722176, 21676096, 20758133, 19951445, 19381342, 18757617, 18220579, 17824137, 17358965, 16887125, 16606718, 16295905, 16241187, 16238191, 16429363, 16763026, 17294700, 18249225, 19811862, 21962511, 24550705, 27924367, 32215435, 36016341, 38750954, 41212030, 42059439, 40045212, 37938276, 36572241, 36688887, 38599065, 40621475, 41492372, 40928943]
18610D0928943k839792m735083n246475m193504l242604k467793j905572j581757
18602A4716363j326576j212531q21936o48170o45665n22214m24751m63301m62525
18593H188694m16746l42971k51512k82528k96357r3043l3098q9533k63230k54503
18583E865173l51717k11488k62622k59218j87591j06318l5044p0058r0633q1315
18573D209169j59264m6086O1430j12051j07809l4551q0841Q297j25403l3960n7841
18562C521090q1585o8522q2050J8375J1865j45754k72496j14179L5677R1403j38912
18551B774912p4969o2212q7386J348L3259k6674J4925Q8209K36416K15349M9809
18540C162986Q1463J01060Q4440j05749j80967m7705k2076r9844p9063q1843j39137
$$ y = [40928943, 38089151, 33354068, 28107593, 23914089, 20671485, 18203692, 16298120, 14716363, 13389787, 12177256, 11355320, 10707150, 10061485, 9539271, 9114520, 8651219, 8188694, 7771948, 7428977, 7177465, 6894937, 6598580, 6505537, 6472439, 6382906, 6119676, 5865173, 5513456, 5301968, 5039346, 4780128, 4592537, 4486219, 4451175, 4381117, 4290484, 4209169, 4049905, 4003819, 4065249, 3953198, 3845389, 3810838, 3729997, 3738294, 3612891, 3578931, 3521090, 3439505, 3370983, 3288933, 3307308, 3319173, 3173419, 2900923, 2786744, 2822421, 2913824, 2774912, 2699943, 2637731, 2550345, 2551693, 2584952, 2558278, 2573203, 2661412, 2897828, 3113177, 3162986, 3244449, 3345509, 3429949, 3324200, 3143233, 3095528, 3073452, 2973608, 2894545, 2812702, 2673565]
18529B673565o5091j02098j258l9938r846r3004J603L3201j401l2713m5321O3236
18517B380935q0943r1024Q1640K46424Q7160O5171O4921J64427L03871J72139
18507C394721J07586N3514J51043O9390J15172k4877j18357j10771l36817l60870
18497B939734j48938n1580r0633j28413k0027k7846j12861n7935j25333J88095
18487B364263K00502O2955m7149j9482q5393j36044L164Q3498n5176j51741n7844
18476B161553J1031J6836J44929K01118K40077J78559J77806J06033Q7098Q8408
18466C413448J06322R1535O8681K34418K99257K49687K77051K43106J71861J74300
18456E329666J60830J80930M03659N47161M65232O04484Q78885J259088J747248
$$ y = [2673565, 2608474, 2506376, 2505118, 2465180, 2455334, 2362330, 2363933, 2397134, 2395733, 2363020, 2317699, 2380935, 2299992, 2208968, 2290608, 2537032, 2624192, 2689363, 2754284, 2918711, 3222582, 3394721, 3502307, 3555821, 3706864, 3776254, 3891426, 3866549, 3748192, 3637421, 3300604, 2939734, 2790796, 2739216, 2648583, 2520170, 2500143, 2472297, 2359436, 2301501, 2176168, 2364263, 2564765, 2627720, 2580571, 2561089, 2475696, 2339652, 2342816, 2426314, 2371138, 2219397, 2161553, 2172584, 2189420, 2334349, 2535467, 2775544, 2954103, 3131909, 3237942, 3325040, 3413448, 3519770, 3611305, 3679986, 3914404, 4213661, 4463348, 4740399, 4983505, 5155366, 5329666, 5490496, 5671426, 6075085, 6622246, 7087478, 7691962, 8570847, 9829935, 11577183]
18447A1577183K341353L325998N093818Q386021J2806628J4259660Q750264M382643
18439G0923568J530766p174290r769774n710242j655924K402341P188439R156441
18431F6891325N541842J739262j553418q518681j1870395r111095o340548n172788
18423C1605504m171195l118788k196193j717345j434472j123345q03693n74380
18415A6466093m00213l20851j98415J97478L34911L25526L63976M72107O31197
18406A7871809J144180K160114L280318M247326N024341N979816O759047N024350
18398E1491301M060018M603918K969972K886339O461892R642047J1168113R227111
18390A02510711N511183K176790m775982q846830q930046p208784l269589J049190
$$ y = [11577183, 13918536, 17244534, 22338352, 30724373, 43531001, 57790661, 66540925, 70923568, 72454334, 65280044, 55510270, 49800028, 48144104, 50546445, 57734884, 66891325, 72433167, 74172429, 72619011, 64100330, 52229935, 43118840, 36778292, 31605504, 27434309, 24315521, 22119328, 20401983, 18967511, 17844166, 17040473, 16466093, 16065880, 15745029, 15546614, 15744092, 16079003, 16404529, 16768505, 17240612, 17871809, 19015989, 21176103, 24456421, 28703747, 33728088, 39707904, 46466951, 51491301, 55551319, 60155237, 63125209, 66011548, 72473440, 82115487, 93283600, 102510711, 108021894, 110198684, 105422702, 96575872, 87645826, 80437042, 77167453, 78216643]
18382G8216643L029904M72357j569974l760324r447781j1336040q618584o251392
18374D0734809m975159l963877l142365k340177j899899j511971j381449j204511
18366B0315401r28327p75791p45044m92050k35656k69751l95542k60265o0428
18357A6152547J51149N19035J170361J804939K627577L291727M032444N403473
18349C5153252N119838L613170K917905P51679j519987j321944p54488K01051
18341D4160476J280828K374219R55402j442528j784114l615578n432771m629804
18333C1866130m210736l874535l038088k392222k022667j459616j190829j023818
18325A2653619q01268o26332m84935m76361n13282l28535k57347l57534m08541
$$ y = [78216643, 81246547, 81718904, 80148930, 76388606, 66940825, 55604785, 46986201, 40734809, 35759650, 31795773, 28653408, 26313231, 24413332, 22901361, 21519912, 20315401, 19387074, 18611283, 17866239, 17374189, 17138533, 16868782, 16473240, 16212975, 16152547, 16303696, 16822731, 17993092, 19798031, 22425608, 25717335, 29749779, 35153252, 40273090, 43886260, 46804165, 47555844, 46035857, 44713913, 43959425, 44160476, 45441304, 47815523, 48770925, 47328397, 45544283, 41928705, 36495934, 31866130, 27655394, 23780859, 20742771, 18350549, 16327882, 14868266, 13677437, 12653619, 11852351, 11226019, 10741084, 10264723, 9751441, 9422906, 9165559, 8808025, 8399484]
18316H399484n68290l68072k70928k42512k40169j92931k04156j79057k82523
18307E850846j43046j07593k52312k86496j38022k25459j76555p387M0588k02436
18297D352128k52208j56073j05412j30157k24337k04021o5010o3992L844K6634
18287C181396k6873o6956q4631j19411n1706j43160p6127l1134Q818J0209m0416
18276B560009q4296j34408k6748r37m2895l2704j63852j57632m185k4862j58279
18265A729211P701J1533r122n1963p9275o0339q8692P1804j9619K569J0619P6540
18253A600967q831j6718P8931R2465J3117N0347q5828j39257k4516J20081J73930
18242A854688J09326L8330M3041N5415j3769j23810o6717K972k9855j02269p1328
$$ y = [8399484, 7831194, 7463122, 7192194, 6949682, 6709513, 6516582, 6312426, 6133369, 5850846, 5707800, 5600207, 5347895, 5061399, 4923377, 4697918, 4521363, 4513976, 4554564, 4352128, 4099920, 3943847, 3838435, 3708278, 3483941, 3279920, 3214910, 3150918, 3154762, 3181396, 3154523, 3087567, 3002936, 2883525, 2831819, 2688659, 2612532, 2581398, 2590216, 2600425, 2560009, 2475713, 2341305, 2314557, 2313620, 2270725, 2238021, 2074169, 1916537, 1912352, 1887490, 1729211, 1736912, 1748445, 1739323, 1687360, 1608085, 1547746, 1459054, 1530858, 1511239, 1513808, 1524427, 1600967, 1592136, 1575418, 1654349, 1746814, 1759931, 1810278, 1724450, 1585193, 1560677, 1680758, 1854688, 1964014, 2002344, 2045385, 2100800, 2087031, 1963221, 1896504, 1899476, 1869621, 1767352, 1696024]
18231A696024q8772k7890Q1575j12856p2271P3351n585m7856m5177m4297m0356
18220A365890J0561L0084l7602j41057q4277n3505q020J65231K33709j8928l5332
18209A426754J1188m7759J29106Q4880J2772o263o5073n9665L973J6425O9051
18198A575389P0934N6727l6967m3826M5057r930m2197O7641K663j8094R8896K0149
18186A786442Q1723J08342j15967j97040j13063P4141K5185k4518k6376r7368
18176A501501j51915N5473N1850P4544j01255K817O5763o916J8021M9300R5216
18165A654399J9112p1740j22128O4863J16205r728j10925K8260R6790J04164L2249
18154A801521P3589J32206k1591m3713M7819r9551k9840R1772J0243J17305J24151
$$ y = [1696024, 1607252, 1579362, 1660937, 1548081, 1475810, 1549161, 1543576, 1495720, 1450543, 1406246, 1365890, 1376451, 1406535, 1368933, 1227876, 1143599, 1090094, 1082074, 1247305, 1481014, 1462086, 1426754, 1437942, 1390183, 1519289, 1604169, 1616941, 1610678, 1545605, 1485940, 1489913, 1506338, 1575389, 1646323, 1703050, 1666083, 1622257, 1667314, 1657384, 1615187, 1682828, 1685491, 1667397, 1766293, 1786442, 1868165, 1976507, 1860540, 1663500, 1550437, 1624578, 1649763, 1625245, 1598869, 1501501, 1349586, 1405059, 1456909, 1531453, 1430198, 1433015, 1498778, 1491862, 1509883, 1559183, 1654399, 1673511, 1601771, 1479643, 1544506, 1660711, 1650983, 1540058, 1568318, 1665108, 1769272, 1801521, 1875110, 2007316, 1985725, 1942012, 1989831, 1890280, 1860440, 1952212, 1962455, 2079760, 2203911]
18143B203911K07292K26455J60126K35485M7103R9884n3465o8957Q2196o5381
18133C074649k90417k62297m6255J24830N7725o9772N6779P1304J26466J34126
18123B977138J65064J91972M81591M76171M57547M98789P39417R57833J217014
18114H162536J692617K033960L004224M612579P065355J2119157K1069433K9016750
18106H8776611J9554953O733159N548764j2435033k6193858j8311635j1545850
18099E2127111r159948p619100n953679m676155l607460k658542k097522j647774
18091A4706931j258167j068974q88022o54544p06438p71203o38152m78196l68928
18082G874307m38434l78811k97700l68983k10510k30451j04003l01548l16507
$$ y = [2203911, 2411203, 2637658, 2797784, 3033269, 3080372, 3180256, 3126791, 3057834, 3140030, 3074649, 2784232, 2521935, 2475680, 2600510, 2658235, 2588463, 2645242, 2716546, 2843012, 2977138, 3142202, 3334174, 3815765, 4291936, 4749483, 5248272, 5987689, 6945522, 8162536, 9855153, 11889113, 14893337, 19505916, 26571271, 38690428, 59759861, 88776611, 108331564, 115064723, 120613487, 108178454, 81984596, 63672961, 52127111, 42967163, 35348063, 29394384, 24718229, 21110769, 18452227, 16354705, 14706931, 13448764, 12379790, 11491768, 10837224, 10130786, 9359583, 8721431, 8243235, 7874307, 7435873, 7057062, 6759362, 6390379, 6179869, 5949418, 5845415, 5543867, 5227360]
18073E227360j66873k85356k03092L2511o0083k60181p6880l2936k71983k61222
18063C641265M0064l2175k36363j87943j07610K1216j3919j38596j33744j34558
18053B717637p5043m2127r4348q5204l8185j81607j79428q9587m562p8344p6144
18042A773058p6730J8606n815q3193j9472J30072O7679J1757n4148j48694j70951
18031A442169n1146R0855L0789m5021l6513j2263K6741j3233p4812K0917J7510
18020A395993r3582l0817j22354j3984R8739q6315j56134l5723K8850l5863m2180
18009I06630N0715L0431j16878m5163M9001J20041M1046j79259j04559K925k0310
17998G34620K1045n8331m3488M8989j4745n1783m9046O8102p5933j00864r2417
$$ y = [5227360, 5060487, 4775131, 4572039, 4604550, 4544467, 4284286, 4207406, 4174470, 3902487, 3641265, 3681329, 3649154, 3412791, 3224848, 3117238, 3138454, 3124535, 2985939, 2852195, 2717637, 2642594, 2600467, 2506119, 2420915, 2382730, 2201123, 2021695, 1932108, 1927546, 1849202, 1773058, 1696328, 1714934, 1709119, 1625926, 1606454, 1736526, 1804205, 1815962, 1761814, 1613120, 1442169, 1391023, 1481878, 1512667, 1467646, 1431133, 1418870, 1445611, 1432378, 1357566, 1378483, 1395993, 1302411, 1271594, 1149240, 1135256, 1233995, 1147680, 991546, 955823, 984673, 948810, 906630, 957345, 987776, 870898, 825735, 874736, 994777, 1035823, 856564, 752005, 754930, 734620, 755665, 697334, 653846, 702835, 688090, 636307, 587261, 655363, 579430, 478566, 386149]
17987C86149j05135M0577M4251J5145J409J1260n2883K6625r4050l2090N5985
17976B97243J58498O2009o4868q5292p4642o1886O3116K96349K3647n9330j24227
17965D30617k7102o2698j52746M201M4711j08281k7656L0372O1033J00252Q7374
17954C80077Q1839n0514m5669N638J12805L5766q0238m6547k7215O1259Q359o3012
17942C72548k13088m6646J54920O2869j7661k1178N2568o936j9473M6834l7044
17931C27713l3374O2656K9668K6848J05479N0222m6635P7710R7582L7123m5403
17920F89589l2539K2226r0923J15725J26975q247P1461K359o2017o7311m2284
17909G25014q5740n7088K1505j3743j68850j69917J11467m7122j636J10703l7647
$$ y = [386149, 281014, 321591, 365842, 380987, 382396, 393656, 340773, 367398, 273348, 241258, 297243, 455741, 517750, 452882, 367590, 292948, 231062, 294178, 590527, 614174, 554844, 430617, 403515, 340817, 188071, 192272, 236983, 128702, 101046, 131418, 192451, 292703, 380077, 461916, 411402, 365733, 371371, 484176, 519942, 439704, 393157, 365942, 427201, 435560, 372548, 159460, 112814, 267734, 330603, 312942, 291764, 344332, 337396, 317923, 364757, 327713, 294339, 356995, 386663, 413511, 518990, 569212, 522577, 600287, 697869, 734992, 689589, 657050, 679276, 588353, 704078, 831053, 822806, 894267, 896626, 834609, 767298, 725014, 639274, 582186, 603691, 589948, 421098, 251181, 362648, 315526, 313890, 424593, 386946]
17898C86946p4520m0100n9302K9190P0506j5021M5489o4971P915J69670L4085
17887D89887p8268Q0112k478m1308l1623N4856J04058O969k0043O2560M9340M7361
17875G21423o5932n9254N8023J10576n1095j20164r5038o9608J19765Q130J9286
17864E76112l1201n231r9852j3437P539K2874n2151l4892M6816l481m8060J1361
17852C76397J7752O9384R32j54745j15698Q9296P7319p1752m8397n4760j1287
17841A74441j13228M6189N3709j07145K1974K32846J28400l4118j77935q5956
17831A39177K3684L6951l7223p7173M7701P515J23050J58559k6009l5360j09673
17820B51199k5354J05855N1638n1715J5477J29289J0037j32055j07004k7077N6571
$$ y = [386946, 312426, 272326, 213024, 242214, 312720, 297699, 343188, 278217, 286132, 455802, 489887, 411619, 491731, 489253, 447945, 416322, 471178, 575236, 582205, 562162, 624722, 674062, 721423, 655491, 596237, 654260, 764836, 713741, 593577, 498539, 428931, 548696, 556826, 576112, 544911, 539680, 439828, 426391, 433930, 456804, 404653, 369761, 416577, 413096, 365036, 376397, 394149, 463533, 464465, 309720, 194022, 283318, 360637, 288885, 240488, 185728, 174441, 61213, 107402, 161111, 53966, 75940, 308786, 437186, 403068, 225133, 139177, 162861, 199812, 162589, 85416, 133117, 140632, 263682, 422241, 396232, 360872, 251199, 225845, 331700, 383338, 331623, 347100, 476389, 486426, 354371, 247367, 220290, 276861]
17809B76861N3285j9083M3017j54647n5822k3681l5073m9380m2807J19457M6641
17798A58768k8198Q9246J44090M9618J7279M3293J1239j65983j28740p6528L3195
17787A47279J22824q6641j25387k056k321k2385j5768L2089K4985O011p3946L6745
17775D1429R8545O5565p3885n7882O3069J11632j31652j34804L5335p922M6845
17764E6275Q5322L1368n7307l7164n8124J64925R598q5342j362j1315j25954L8976
17752I896J74277m7822j1134O2607j4763j12269r5181l6426n0773M2163J6695
17741f2730j22169J368L9565N0455J58708M515r668j0993l6942r4436N515J02290
17729B5478J66938k0556o5618n0562R049m5250K9479J03889N5551p8415K5087
$$ y = [276861, 330146, 311063, 354080, 199433, 143611, 119930, 84857, 35477, -7330, 112127, 158768, 130570, 219816, 363906, 413524, 430803, 474096, 485335, 319352, 190612, 114084, 147279, 270103, 183462, 58075, 56019, 53698, 31313, 15545, 47634, 72619, 78630, 4684, 41429, 139974, 205539, 131654, 73772, 136841, 248473, 116821, -17983, 17352, 9430, 56275, 141597, 172965, 115658, 78494, 20370, 185295, 194893, 109551, 108189, 96874, -29080, 9896, 184173, 136351, 125217, 187824, 173061, 60792, -34389, -70815, -121588, -79425, -62730, -184899, -183531, -143966, -93511, 65197, 69712, 60044, 49051, 12109, -82327, -76812, 25478, 192416, 171860, 106242, 55680, 64729, 19479, 48958, 152847, 208398, 129983, 155070]
17718A55070Q207M3713O9888M2628j6255J3532l4152j11935m5417L6090q1789
17707G9580P2558L9726p6225L6194j4994r4828J4480m8117K9292J56220j0395
17696A83491M6974j5201N0034k9297k6892q9969Q7772P2730p5491p3452L1292
17685A61991o1054j25598m2077J8087R6789J31698P9265R2982k5995k57750j32031
17674f3693n9210J1623m0987O5900R0951J24747k5185j4358J16713r494K3011
17663B20018n8816n5068N5919J26744k6312r5852j00292j2613P4674j2727j46496
17652c0821R9715R2275K4313L7104Q327l1812K7849O6972p3551m405j06100K5582
17640A35448p6690L9567O2354J8224M8590m0434q8892J3862L3827j6429K0457
$$ y = [155070, 163277, 206990, 276878, 319506, 303251, 316783, 282631, 170696, 125279, 161369, 79580, 152138, 191864, 115639, 151833, 136839, 42011, 56491, 8374, 37666, 193886, 183491, 230465, 215264, 265298, 236001, 209109, 119140, 206912, 279642, 204151, 130699, 161991, 100937, -24661, -66738, -48651, 48138, 179836, 259101, 352083, 326088, 68338, -63693, -122903, -111280, -152267, -86367, 4584, 129331, 104146, 89788, 206501, 197007, 220018, 161202, 106134, 162053, 288797, 262485, 166633, 66341, 53728, 128402, 115675, -30821, 68894, 161169, 185482, 222586, 230913, 199101, 226950, 293922, 220371, 215966, 109866, 135448, 58758, 98325, 160679, 178903, 227493, 187059, 98167, 112029, 145856, 129427, 149884]
17629A49884n4498j7668J8396N1653J4080k8637R4786M328N4027o960p6863o9097
17617A33431j4o362m7936R306P1080l0151K7298l4445J94162M2194j84313j24087
17605E0163J1849J2395o9969Q799p9570N003K3625J48772m6540j8184L9235n3096
17593C2482m9314J28171O659n0611J6539N0612O4113O317j16157k4378K7099m844
17581H6688k4878N2722R420m0699p5918M8930M0436M1713j4040j3341q8037L7510
17569F0506M7647P8686j3743O2999o0546k5923L8690o985j16982j20660o640j1968
17557g4919n1733K7939N9070J8377J04437o7485j1939k384n9300l4702L1148R761
17545e1730K068J39079M9260k2229n4568q1738K3539J68438P585j13321j46963
$$ y = [149884, 95386, 77718, 96114, 147767, 161847, 133210, 227996, 232324, 286351, 279391, 202528, 133431, 133417, 127055, 79119, 88425, 159505, 129354, 156652, 122207, 316369, 358563, 174250, 50163, 62012, 74407, 4438, 13237, -66333, -61330, -37705, 111067, 64527, 46343, 85578, 32482, -16832, 111339, 117998, 67387, 83926, 134538, 198651, 204968, 88811, 64433, 91532, 86688, 61810, 114532, 123952, 83253, 7335, 56265, 96701, 138414, 124374, 111033, 22996, 60506, 108153, 186839, 173096, 236095, 175549, 149626, 188316, 181331, 64349, -56311, -62951, -74919, -126652, -98713, -39643, -21266, 83171, 15686, 3747, 1363, -57937, -92639, -61491, -51730, -49662, 89417, 138677, 116448, 61880, -19858, 3681, 172119, 179704, 66383, -80580]
17534h0580M6533J31402l1673j6478o1654r5297k1944j26807n7581J71046J15888
17523b7145O2837k7385o9848N7894J53771N5935J9351j20057K2698j3150K7174
17512A42075M9580J23345j07918j95646o2892J4455j5091K7919m1116M1575k2011
17501d5725j06239K3396J31668O8146j19480R7612J84409K9488n2296J3005N4742
17490B78726j36804o8198m408m8146q640P0376M4829O4683p332N4258O7000p3137
17478B33207R9543J7630n0889j02878L7719J13560P5538k5414r3610J6336Q251
17467C28993j01823j62960q2307j6997k2907J7467R5464K0154p339p5878p4008
17456h2141K8873k3442J7377O1727J8818j23110m1705Q5433J20799R4248L0022
$$ y = [-80580, -34047, 97355, 65682, 49204, -12450, -107747, -129691, -256498, -314079, -143033, -27145, 35692, 8307, -61541, -3647, 150124, 206059, 225410, 105353, 128051, 114901, 142075, 191655, 315000, 207082, 11436, -51456, -37001, -52092, -24173, -65289, -23714, -45725, -151964, -128568, 3100, 71246, -48234, 49378, 233787, 263275, 210979, 223984, 278726, 141922, 73724, 69316, 21170, 12530, 82906, 127735, 192418, 185086, 239344, 306344, 233207, 332750, 350380, 299491, 196613, 234332, 347892, 423430, 398016, 304406, 320742, 328993, 227170, 64210, -18097, -35094, -58001, -40534, 54930, 75084, 67745, -8133, -82141, -53268, -76710, -59333, 2394, 21212, -101898, -143603, -58170, 62629, 156877, 186899]
17445A86899j10947J00634M9686J40959J93652K10915N0924j0830J2068j27654
17435F96306m9435k10911k06256j1862p2257p5521K1744m8459j8641k6460o9420
17424g1172k1013L8048J06306J02598K1327n7255j72729o9895N6173J5528K0902
17413c1182L3098N167k0382Q9425P6328l0636m5567r140k2558l6273j2404j2482
17401a6606L1419J37172J56440m6958m4499j13071j5917Q7028j0104j8500k9320
17390A17084M7166q5671P0310k4502K0031l5017m6200N3796P168K3119P3928N9656
17378B80868k7079j15404j22716R8395L7532p202O8621M8156p4850o8146n5033
17367F3142r465N4310k0981L9584o941n354k5410q811m3830J61856J32179k0016
$$ y = [186899, 75952, 176586, 226272, 367231, 560883, 771798, 822722, 811892, 823960, 696306, 646871, 435960, 229704, 217842, 145585, 70064, 91808, 43349, 24708, -1752, -71172, -92185, -54137, 52169, 154767, 176094, 118839, -53890, -123785, -67612, -52084, -31182, 1916, 7083, -13299, 76126, 152454, 121818, 76251, 67111, 44553, 8280, -4124, -16606, 14813, 151985, 308425, 261467, 216968, 103897, 87980, 175008, 164904, 146404, 117084, 164250, 78579, 148889, 124387, 144418, 109401, 63201, 116997, 124165, 147284, 221212, 280868, 253789, 138385, 15669, 114064, 151596, 144394, 213015, 261171, 186321, 118175, 63142, 53677, 107987, 87006, 126590, 119649, 114295, 88885, 80074, 36244, 198100, 330279, 310263]
17355C10263K4248r9572j27007l7280n9849k621K5811l1783l1372o8085J33819
17344C6572J00802k6532m1220k3008J2633q4838K3204M2789K02470J25272P996
17333C76140l0800p0957j06568K109j7580o6164p296Q5845o3718j6850M4575j12842
17321A5894q5366N6299J10758O1270j4443M6321M1731p4124j06968l6761N1652
17310F6263P7796o126k5182r8920j5035M5283K1362L5730j9965r4348O8712j38320
17298h2750M2584J63274j6941j14348m0365M3532J21071J22325r4561j06659n4553
17287a7391Q9589N5301j12149R915q8390o4206k5408j2232L3399R5045P8738n2007
17275i796J1903k9503R8202R5567m0532J9J01938j46534j65585Q4181J9418l239
$$ y = [310263, 334511, 234939, 107932, 70652, 10803, 8182, 33993, 2210, -29162, -97247, 36572, 137374, 110842, 69622, 46614, 59247, -25591, -2387, 40402, 242872, 368144, 376140, 345340, 274383, 167815, 169924, 152344, 86180, 78884, 164729, 101011, 84161, 128736, 15894, -69472, -13173, 97585, 158855, 144412, 190733, 232464, 158340, 51372, 14611, 66263, 144059, 137933, 112751, 13831, -1204, 44079, 65441, 101171, 81206, -13142, 55570, -82750, -40166, 123108, 106167, -8181, -48546, -5014, 116057, 238382, 143821, 37162, -17391, 72198, 127499, 15350, 25265, -63125, -127331, -152739, -164971, -131572, -36527, 42211, -9796, 2107, -27396, 70806, 166373, 125841, 125860, 227798, 81264, -84321, -140, 19278, 16039]
17263A6039q1547j7439R5158M0973K7087O1188o0108q8830J28290K9910j6198
17252A34523k5606j06441j12061J22569j861k4744n6804J33733J12022j6421r7932
17241F0977M7963L4192J7628J2849l8710J49105j365q9085P1367R7817R025j33521
17229B38242j77257o8645Q6183P8664P043k1072j11463q2176J02275N5199k5354
17218H1639M4889n1415j6067L5326n7066p5717p1103O1364J2400L4352l8537n0237
17206i0172K5079J26531l433q2789N8204O7463L5461R7261m6707L1717P1347O0305
17194C50267n3491j06323j21584J1322k7160r8896Q705m2130l1090j3667o9399
17183a93446N3013O1673l7448o7365m6982M3209K2542J1653j27471P1488J29874
$$ y = [16039, -65508, -82947, 12211, 53184, 80271, 141459, 81351, -7479, 120811, 150721, 134523, 108917, 2476, -109585, 12984, 11123, -13621, -70425, 63308, 175330, 158909, 60977, 108940, 143132, 160760, 173609, 134899, 284004, 282639, 193554, 264921, 362738, 371763, 238242, 60985, -7660, 78523, 157187, 164230, 143158, 31695, -50481, 51794, 106993, 81639, 126528, 75113, 59046, 94372, 37306, -38411, -109514, -48150, -35750, -1398, -39935, -90172, -65093, 61438, 58005, -24784, 33420, 100883, 136344, 233605, 186898, 218615, 289962, 350267, 296776, 190453, 68869, 80191, 53031, -45865, -37160, -79290, -110380, -124047, -193446, -140433, -78760, -116208, -183573, -230555, -187346, -164804, -153151, -280622, -209134, -79260]
17172g9260M2804P4285R1140M158m9776L832M1805j36508k7069P7808k4151M4739
17160F3807p6718p9732J0298j5026M2823J26836K6115R0979n1312o3277n1506
17149B3287r4399K7506n8275j40749J19738J10366m0633n3917o778J23910j6417
17138f361l8190M2926k5268N3125L8077N0841q1376j09863l9235J24100P9502
17127H8278N8118l5798K0634J2459j7900L5389K9783j57228l4522k828l2644j1553
17115d7812K064M2023K0140r217J2075l0416P0509J03998q4331n3730L2112K6843
17103H4258l6384j5296J15892R7048k5688l0087n1889j28118j2200M9811p9046
17092c1699p5760l4947J04904o270K3596j03575j5888J2582Q1942N9530M7363
$$ y = [-79260, -36456, 37829, 128969, 133127, 83351, 87183, 128988, -7520, -34589, 43219, 19068, 63807, -12911, -92643, -82345, -97371, -54548, 72288, 98403, 189382, 138070, 74793, 23287, -71112, -43606, -101881, -242630, -122892, -12526, -53159, -107076, -113854, 10056, -6361, -44551, -1625, -26893, 26232, 64309, 115150, 33774, -76089, -115324, 8776, 88278, 146396, 110598, 131232, 143691, 125791, 161180, 190963, 33735, -787, -3615, -36259, -47812, -45748, -3725, 16415, 7198, 19273, -11143, 59366, 163364, 79033, 25303, 57415, 84258, 47874, 32578, 148470, 245518, 219830, 189743, 137854, 9736, -2464, 47347, -31699, -107459, -142406, -37502, -43772, -20176, -123751, -139639, -127057, -45115, 14415, 61778]
17081F1778P0821m5784j6775l923K3081L070O5374k5797n230j30568j5108O3552
17069D4491m7711r9089N9816j289j07665J751P4398N975O5208l6379K4485o0022
17057g6031Q320O8393j28698m6359k9097Q487K42374K4130m1915o690N7898L5920
17045A16732L4799j5883j06840L3102L0119K7439K1673K681l6954p5624r2090
17034f0846q340J9068J13258P3937m5588j66249j19042m5395j0049O2379j1044
17023a97911L5563j11004q502M1817L9252Q2751o6563q2766K8644J58600K1303
17012e8816l9226O0996J6408L3538j7747O1249L1548k6453j9336N8447J5447j03178
17000A2877k2662p4231j25004K9159j6124R263O4348J24640j1773m0849m9620
$$ y = [61778, 132599, 86815, 70040, 66117, 89198, 92268, 157642, 131845, 126615, -3953, -19061, 44491, -3220, -102309, -42493, -43782, -151447, -149696, -75298, -69323, -4115, -40494, -16009, -76031, -67711, 682, -128016, -174375, -203472, -194985, 47389, 71519, 29604, 22914, 80812, 116732, 151531, 135648, 28808, 61910, 92029, 119468, 141141, 143822, 106868, 31244, -60846, -69186, -50118, 63140, 137077, 91489, -74760, -193802, -239197, -249246, -186867, -197911, -162348, -273352, -281854, -240037, -200785, -118034, -184597, -267363, -238719, -80119, -58816, -98042, -37046, -20638, 12900, -4847, 56402, 87950, 61497, 42161, 100608, 116055, 12877, -9785, -84016, -209020, -179861, -195985, -186722, -122374, 2266, -9507, -50356, -99976]
16989i9976j13546M4332J34374O5488j24318p6290j06892R8977J23507k0150Q5795
16978A1301J5708J4701l7214L2760O8968p43j16000N6401M7055K6463m2585n1770
16966B5045N2143R444j77503q9267O9435J18023m658L5582p2359k842N6480l2992
16954a3469k2028n1566Q2N7773M6418P0800l0725Q949n821j58314O1211p735P1430
16941B7005Q2911j15111j20586N0002J2259K5619M2416P23J1724L9233K5567L3671
16929A15433R935k3959M1479j17391r8579Q9842M7503j8900N1474J7580m1603
16918G2814O272J5279j30530j45837q7529L2573L8679L9453P281P8441J0335q680
16906g1449r7616k9174J5149P430K4140J16140j5097O4576J8468m1933J1678m4419
$$ y = [-99976, -213522, -169190, -34816, 30672, -93646, -169936, -276828, -177851, -54344, -74494, 11301, 27009, 41710, 4496, 37256, 106224, 105481, -10519, 45882, 92937, 119400, 76815, 25045, 77188, 86632, -90871, -180138, -110703, 7320, 2662, 38244, -34115, -36957, 19523, -13469, -35497, -87063, -86981, -29208, 17210, 88010, 57285, 66234, 60413, -97901, -36690, -44425, 27005, 109916, -5195, -125781, -75779, -63520, -37901, 4515, 5238, 16962, 56195, 81762, 115433, 125368, 101409, 142888, 25497, -73082, 16760, 64263, 45363, 96837, 114417, 72814, 79086, 94365, -36165, -182002, -269531, -236958, -198279, -158826, -151545, -73104, -62769, -71449, -169065, -198239, -183090, -175660, -151520, -35380, -50477, 14099, 32567, -9366, 2312, -42107]
16894d2107r271j195l9360J9674k0474O5261p5467J670J16458P5958N2483o5236
16882G8394j12440k97K0410N8823L5257j95866l6479l9208J30892L0454q7300
16871a17360o7673P9966P4763O9751n918M6769J02788N2611j2217j96860j59979
16860a33359k9396J46301K5602j24692j21418N9791J39840M6731M2629J0134J06928
16849A69091j23562n2584J20870m2064n0130M8022Q8343j28260p7129J12598M4319
16838A09514j4728j08922j15943k2381M3004Q7830J41096M0846j26825p2753N583
16827c3679l1110O5095N0827m0748j2118J36377o7999j28342Q3532P1999m9376
16816D4458J08394o7448r6629o38j7225q0807p1739n070n4507j07354O5614J6744
$$ y = [-42107, -51378, -52573, -91933, -72259, -92733, -27472, -102939, -101269, 15189, 91147, 143630, 78394, -34046, -34343, -13933, 44890, 80147, -115719, -152198, -191406, -60514, -30060, -117360, -185033, -105067, -30304, 39447, 33529, 80298, 183086, 235697, 223480, 26620, -133359, -162755, -16454, 9148, -115544, -236962, -177171, -37331, 9400, 52029, 62163, 169091, 45529, -7055, 113815, 71751, 21621, 69643, 157986, 29726, -47403, 65195, 109514, 94786, -14136, -130079, -152460, -109456, -21626, 119470, 160316, 33491, -39262, -33679, -64789, 306, 51133, 10385, -1733, 134644, 66645, -61697, 21835, 93834, 44458, 152852, 85404, -11225, -11863, -29088, -109895, -181634, -186704, -241211, -348565, -282951, -266207]
16804b66207J8173J54971J00329q989m928J8361K1935q3007J7682L300r0991j00524
16792b19895n753M1171O5494m1379J7640P62O5767N723J20093j03384j85854J8015
16780b21600N8330Q2101J20013k939j28213J3518K4416K5964J9608K2280l7739
16769b4261o6137J14563L1533p6235L1062j07759P4749P5830l3200j97524n1885
16758b29264J42717J70677O3339p4183o2090m9071L5830P5087m8502q2316j30054
16747a87830Q094N5020L9359q9805k3228R8781Q1903O7190M8146k6523j1726p074
16735E2307Q5390R763J6725j17766o8282J31860M2067m8701P0197J7865p0704
16724A20721L6796P6955J7290o0058j15897j3710K3613o9730n0354n0928k2230
$$ y = [-266207, -248034, -93063, 7266, -1723, -6651, 11710, 33645, -49362, -31680, -28380, -119371, -219895, -225648, -184477, -118983, -160362, -142722, -141960, -76193, -70470, 49623, -53761, -239615, -221600, -163270, -81169, 38844, 35905, -92308, -78790, -54374, -28410, -8802, 13478, -24261, -90398, 24165, 55698, -20537, 10525, -97234, -22485, 53345, 20145, -177379, -229264, -86547, 84130, 147469, 73286, 11196, -37875, -2045, 73042, 24540, -57776, -187830, -179736, -124716, -85357, -175162, -198390, -99609, -17706, 49484, 97630, 71107, 59381, 52307, 137697, 147460, 164185, 46419, -21863, 109997, 152064, 103363, 173560, 191425, 120721, 157517, 234472, 251762, 191704, 75807, 62097, 85710, 15980, -34374, -85302, -107532]
16713a07532j974K74k728j67623m7797O3505Q3314m110O8980P989Q8573m3928
16701f3057l2926J03457J0222j10368r4227J6514J09080P4373j41502n267J42064
16690H363O8868p7116o2822L3913Q7716J6602o2039j51806j13456L9393J48317
16679f4067J44104k5812j11183Q9465O3548P768j12606j27614O5762J40764J36818
16668B06947j59642j20337O8287O5422J30781j11924r5769P4154Q4663L9610K5332
16657B07524n0914j79439j81829J6596J47476J12420K0161M9794O3120O0824q3929
16646A81804j07430J03640O7585j3039j11377j44215j1677J8812q0430J8504P0979
16635f844J8550L3954j182j07400j2465P9558N8430K858L1095J0196j6509q91
$$ y = [-107532, -109506, -109232, -111960, -279583, -327380, -263875, -180561, -184671, -115691, -107702, -19129, -63057, -95983, 7474, 17696, -92672, -186899, -170385, -61305, 13068, -128434, -133701, 8363, 77231, 115, -62707, -28794, 58922, 75524, 13485, -138321, -251777, -212384, -64067, 80037, 54225, -56958, 32507, 96055, 103823, -8783, -136397, -70635, 70129, 206947, 47305, -73032, -4745, 60677, 191458, 79534, -16235, 57919, 142582, 182192, 207524, 156610, -22829, -204658, -188062, -40586, 71834, 91995, 141789, 204909, 265733, 181804, 74374, 178014, 245599, 232560, 121183, -23032, -34709, -15897, -96327, -77823, -6844, 11706, 45660, 44478, -62922, -75387, 4171, 62601, 65459, 96554, 106750, 90241, 89350]
16623H9350m8810n0178m702m23j0036n2336N1073Q5646J2227j3848L4100N8946
16611A51009k0071p2776k9246o5257J1849k4091j123J01629k8172r0442j42O7438
16599F05Q1209P143o0725k645m5796K6676L324n9617M1093l3011K1971J6033J6125
16586A2385P2212O820J8141j06014o1968J5573N4352N8340J88136l6998j93230
16575B7749j12335P8317n1291j10912O9827l3385k0498J08886J27927J8681M7655
16564A50621k3342k8895r9639l046l5975Q4253Q2307o6343k9132R0347L5478J2634
16552A69268k5512p1063j20646p0181o3365k5467N7651N587l4865J43765J51062
16541A16234J0743l0146j9993j03415j0102r574O7130K4731K5060L3521N5362
$$ y = [89350, 40540, -9638, -14340, -14763, -24799, -77135, -26062, 59584, 71811, 57963, 92063, 151009, 130938, 58162, 28916, -36341, -24492, -48583, -49706, 51923, 23751, -66691, -66833, 605, 81814, 88957, 28232, 25587, -20209, 6467, 9791, -49826, -8733, -41744, -19773, -3740, 12385, 84597, 91417, 109558, 3544, -58424, -42851, 11501, 69841, 257977, 220979, 27749, -84586, -6269, -57560, -168472, -98645, -132030, -152528, -43642, 84285, 102966, 150621, 127279, 98384, -1255, -4301, -40276, 43977, 126284, 59941, 30809, 121156, 156634, 169268, 143756, 72693, -47953, -118134, -181499, -206966, -149315, -143728, -178593, -34828, 116234, 126977, 96831, 76838, -26577, -36679, -46253, 20877, 45608, 70668, 104189, 159551]
16530A59551n0238n3131m1590j04215j17728k764J2047M1340J41665Q0626m5340
16519B0223p0929Q2112j7107j42597k3916K1726M6591L2240P7058L4897j9316
16508D0982n020k7575k8563m3189R9564J7405l4820L9031j09012j54562Q1326
16497a24433Q2476j2903M5700M3156J38742J553j10549m6044J3370L1132R6454
16486A58654o9553l3707P7747o5433p1227J7785J10461n1711m9902k6614N1812
16475D8312j3413j1230p79R1935r4445j12501r8497K0404M580M0790Q4594P9628
16463C9378k0644M4056k9645K1193K0640o5146n2870J0380Q5450L1649j15446
16452c1005q6434j5745L8011J337k7485K2431J51610K3328j23077k9084P5417
$$ y = [159551, 109313, 56182, 14592, -89623, -207351, -210115, -198068, -156728, -15063, 65563, 20223, -50706, 31406, 14299, -128298, -152214, -130488, -83897, -51657, 25401, 60298, 40982, 35962, 8387, -20176, -63365, 36199, 53604, 18784, 57815, -51197, -205759, -124433, -41957, -54860, -9160, 33996, 172738, 174291, 63742, 17698, 31068, 62200, 158654, 89101, 55394, 133141, 67708, -3519, 14266, 124727, 73016, 23114, -3500, 48312, 34899, 23669, 22890, 114825, 20380, -92121, -190618, -170214, -165634, -124844, -40250, 39378, 18734, 62790, 33145, 54338, 74978, 9832, -43038, -32658, 52792, 84441, -31005, -117439, -133184, -95173, -93836, -121321, -98890, 52720, 76048, -47029, -76113, -696]
16441f96R0n9748j6136J8625P4714M7752l6445k4646n8224o3019J17272J974L2790
16428C4303L2122M7636m0838o2773j96197L4124N3395k1207j8084J23690J07491
16417I3662Q6105k3536p5157q6619m9468j0999p240j3402P9037L4007p0669O6977
16405B2698J47640j6160m4415K8558M9233o6024j45782l7206l7549r3955K3697
16394a69265Q6409J07993J75219J00138l9565R681j60371j08571J74271k1285
16384A54654R4026p9728j13140m4277L2003q2827j15780j52027k377J31114M8664
16373a29695J34030K6125j14747N9663L9362P9276j3682l4422r4068j2136M3013
16362a7281N0733o2788j16245J33194Q3375j43797n7533N1757M3640J15966O0620
$$ y = [-696, -606, -60354, -76490, -57865, 16849, 64601, 28156, 3510, -54714, -117733, -461, 1513, 34303, 66425, 114061, 73223, 10450, -185747, -151623, -98228, -119435, -137519, -13829, 93662, 179767, 156231, 81074, -5545, -55013, -66012, -73252, -86654, -7617, 26390, -44279, 22698, 170338, 154178, 109763, 138321, 187554, 121530, -24252, -61458, -99007, -192962, -169265, -82856, 25137, 200356, 300494, 260929, 270610, 110239, 1668, 175939, 154654, 248680, 168952, 55812, 11535, 43538, -39289, -155069, -307096, -309473, -178359, -129695, 4335, 30460, -84287, -24624, 14738, 94014, 80332, 45910, -48158, -60294, -17281, 33452, -29336, -145581, -12387, 70988, -72809, -130342, -78585, -34945, 81021, 141641]
16351A41641j2276q47Q7279j51549k5084j08767j09260l2514n9857L1441O9327
16340a70466K9704O168Q8293j7869r6172O7395k3374j01327K8326N2338o6037
16329b03021m3315J25234O3164k9602P8014p7256P5088k898j29492p7600K4781
16318a96903L8751J32695l1361p58N0649J9292k1998O0535N8362j04086j1619
16307f441l8076N2332j2026Q0991R630m3369K8052P154N9057K3573j4004n6863
16295I0010n1638k5069n1943J9284P0916K1094n3833j8748O8398O0857m7457r5856
16283a3985n4426n4264N3002L70r0576l7232R0978M6722L432N7997q0954j42971
16271b21907L7357J62016l5051n0061K9856P9066P0431o9249j07071J46513M7344
$$ y = [141641, 129365, 128518, 215797, 64248, 39164, -69603, -178863, -211377, -271234, -239793, -170466, -140762, -134594, -46301, -64170, -160342, -92947, -116321, -217648, -189322, -136984, -203021, -246336, -121102, -57938, -87540, -9526, -86782, -11694, -14592, -144084, -221684, -196903, -158152, -25457, -56818, -57576, -6927, 12365, -9633, 50902, 109264, 5178, -6441, -44517, 7815, -4211, 76780, 86410, 43041, 71093, 78247, 137304, 160877, 146873, 90010, 38372, 13303, -38640, -19356, 51560, 72654, 18821, 73, 68471, 129328, 81871, -13985, -68411, -122675, -69673, -69303, -159879, -197111, -106133, -59411, -55979, 2018, -78936, -221907, -184550, -22534, -57585, -107646, -77790, 1276, 71707, 2458, -104613, 41900, 89244]
16260H9244R682j13243n7499P4180P8944O1080j22459k1983r217K37K6462P1978
16248H7406L8946j51314r4521O8483M7756N6683M9335j33147j15617n8092R2029
16237a12053M3266m1331j2659j4432o5304l0025N6520K9893L8072J04677M5856
16226D2480j15065l6572J63888J38848Q17l9523m6172q3041n6541q5293k4609
16215a40783k0049N6496R5482l8084K8823k9817O0148J8781N1367l372o325m6690
16203B5977J3202k1970K0749O9181q2585j58482j02208j1174J22469N7529L6347
16192c0965o3513k1435j26810R4035J74375J11236P3598M8563j37467j4248O9951
16181A77320n4205j48797j8858J0465k6010j3557R3334q360o4340l9766p1198
$$ y = [89244, 98926, -14317, -71816, 2364, 81308, 142388, 19929, -2054, -11271, -11034, 15428, 87406, 126352, -24962, -119483, -51000, -3244, 53439, 102774, -30373, -145990, -204082, -112053, -68787, -110118, -122777, -137209, -202513, -232538, -176018, -146125, -108053, -3376, 42480, -72585, -109157, 54731, 193579, 194396, 154873, 108701, 25660, -30881, -116174, -140783, -160832, -104336, -8854, -46938, -18115, -47932, 12216, 30997, 82364, 78992, 72667, 25977, 39179, 17209, 37958, 107139, 24554, -133928, -236136, -247310, -124841, -67312, -30965, -94478, -115913, -242723, -148688, 25687, 136923, 210521, 259084, 121617, 107369, 177320, 123115, -25682, -44540, -34075, -60085, -73642, 19692, 11332, -53008, -92774, -163972]
16170a63972O0538J25580j1796r1894k948j9193n4400L9718J6922J09532J2051
16159B0138O5980r9640o0135K226k5134k823p5367R5223K3597L940m9639K4626
16147g7008l9413Q8442j15515j6903M6298j7361R0325P2352K7110J2609n0647
16136B0289k2992l5342J12241Q8003o9421p5494M6522L1084J3951m6350q3886
16125b1395m4249J3519j0759J28868r1479l4740M6116j4183J26255O7939l3254
16114A32638n43n109o07n8087n9582J44671P0764j62201j20658j79020j0404J92918
16102e5220J32585r680o1780R0541J3353r3598O6036L2392J0876o7569l724j1861
16090D2351l9570r3375n1947M0386P1233J06325l7589M7006L4663o0189K4514
$$ y = [-163972, -103434, 22146, 10350, -81544, -84492, -103685, -158085, -118367, -101445, 8087, 20138, 86118, -13522, -73657, -71431, -96565, -99388, -174755, -79532, -55935, -51995, -101634, -77008, -116421, -27979, -143494, -160397, -114099, -131460, -41135, 31217, 58327, 70936, 20289, -2703, -38045, 74196, 162199, 92778, 17284, 63806, 94890, 108841, 62491, -21395, -65644, -52125, -62884, 65984, -25495, -60235, -14119, -28302, 97953, 165892, 132638, 132095, 126986, 126379, 68292, 8710, 153381, 224145, 61944, -58714, -237734, -248138, -55220, 77365, 67685, 5905, 96446, 109799, 16201, 82237, 114629, 125505, 57936, 54212, 42351, 2781, -90594, -142541, -102155, -30922, 75403, 37814, 84820, 119483, 59294, 83808]
16079H3808K6112j00231J3323Q5925q7409l9537R4736O5870r315m4656K3895R6957
16067B09478M3621M1970J8938n9770k0360o9255J8483n6874n9340p0823p9451
16056h3383N0177K0173j14904n6227M4066J18243J5510R8588K6991p7413N777
16045D7598j16193J1101K9612O2811J9422R1924p011j47140l7509j2196o9043
16034a26624j3789L5541M6858K9125m8919j6306K8048p31k7302K2683p845m2665
16022a21926J1405r5106J17182P0267o367L8727M8768q363M6108k2362M582R1010
16010A73925O1359j02714j2489k065M1405N7573n8108n9516N5087K397q657j09539
15998C8658r2605J16715J17052k6942L5269O5407l8614r2234m7211m0319q650
$$ y = [83808, 109920, 9689, 23012, 108937, 21528, -18009, 76727, 142597, 133282, 88626, 112521, 209478, 253099, 295069, 314007, 254237, 233877, 164622, 183105, 126231, 66891, -3932, -83383, -33206, -13033, -127937, -184164, -140098, -21855, -6345, 92243, 119234, 41821, 47598, -68595, -57494, -27882, 34929, 54351, 146275, 139264, -7876, -45385, -57581, -126624, -140413, -104872, -58014, -28889, -77808, -94114, -66066, -66797, -94099, -71416, -79261, -121926, -110521, -205627, -88445, -18178, -24545, 14182, 62950, 54587, 100695, 78333, 82915, 173925, 235284, 132570, 120081, 118016, 159421, 216994, 158886, 99370, 154457, 156854, 148197, 38658, -53947, 62768, 179820, 152878, 188147, 253554, 214940, 122706, 75495, 35176, 26526]
15987B6526l3514o8622L6645O2487J253P2892P035q4554N6312j08260l2728N688
15975e8840J7062j3965Q3927j1482o7275J39698K5850O992p5649j50411M8154
15964e5939J69017R061j15406k5093N4558L6120l8036K5427p1560o8592N5882
15953b4561R242M6952M3464j99176l2808L0512J35853O4056j80610k5639l2415
15942a65130k7605O7122P9981Q2835k841j4899n3214k5929k4254Q591M0400Q4291
15930D9348l2175j29963K6610J46881M9636J696r7935K1537k4001j25564l9763
15919a53693M0548K4756p9312L3874J5781N9370P9564N6097l6509j04039r9458
15908a63021M6831J30001Q0515r690p4340k9171j9221M0551J2235N1147m7259
$$ y = [26526, -6988, -75610, -38965, 23522, 24775, 97667, 104702, 20148, 76460, -31800, -64528, -58840, -41778, -55743, 28184, 16702, -50573, 89125, 114975, 121967, 46318, -104093, -55939, 113078, 122139, 6733, -18360, 36198, 72318, 34282, 59709, -11851, -80443, -24561, -15319, 31633, 75097, -124079, -156887, -126375, 9478, 73534, -107076, -132715, -165130, -192735, -125613, -45632, 37203, 34362, 19463, -33751, -59680, -83934, -75343, -34943, 49348, 17173, -112790, -86180, 60701, 110337, 112033, 14098, 35635, 11634, -113930, -153693, -113145, -88389, -167701, -133827, -118046, -58676, 20888, 76985, 40476, -63563, -163021, -116190, 13811, 94326, 84636, 10296, -18875, -38096, 2455, 14690, 65837, 18578]
15897A8578q3506k7903j8542k3819n1851K0161K2426R0606J22441J28956p3524
15886A24023l0562k919o2145j00342m5132K6601q0907q9166N4127J80954L3588
15875H120k7270p2474m095j04287N4642N2163j4620N5796Q2975n1090p1467o9862
15863a61469J44231o3297p9324q56k1514M4405J20377J2238Q021q9236Q5450J23955
15851A22981n4428j25036m8786j600O0598J67591J40865Q2046q8850l917n6693
15840A94771j60723p4857j2527m370q2869K1085N4994K2488J12692O428R3015
15829A70127j910j3095p0117j06041j09454J20747J12290K2455j00630j4204M3457
15818E3625l5966p8349l397J4420M8836K3095p4457P6923j0953P487j017j64578
$$ y = [18578, -64928, -92831, -111373, -135192, -187043, -166882, -144456, -53850, 68591, 197547, 124023, 93461, 90542, 28397, -71945, -117077, -90476, -171383, -260549, -206422, -25468, 8120, -19150, -91624, -95719, -200006, -145364, -93201, -107821, -52025, 30950, -20140, -91607, -161469, -17238, -80535, -159859, -160715, -182229, -137824, -17447, -5209, 2812, -86424, -974, 122981, 68553, -56483, -105269, -106869, -46271, 121320, 262185, 344231, 255381, 251464, 194771, 34048, -40809, -53336, -57706, -140575, -119490, -64496, -42008, 70684, 77112, 170127, 168217, 155122, 85005, -21036, -130490, -9743, 102547, 125002, 24372, 10168, 53625, 17659, -60690, -64087, -49667, -831, 22264, -52193, 24730, 13777, 21264, 20247, -144331]
15806a44331r1579n4669R6221J32354R104N7016K9634l0628K0331L507l654O57
15794B3963P2957j03197j996J07070Q413J10541L1564n2232m4243r7019l1414
15783B4407n267J268p1671o6206N296J92451N6892j79713K8125j13832q7563Q713
15771b07100K0096R154J16432j3263Q5081P3356j04009M8087J5456k3018j6165
15760D107R1599O912J5723j25200m8270q6638j03966k420Q8053J40097j05180
15749a25183q436O3055J81584Q4442m5056l8074K0277k1372p6651j8956j37326
15738a21696M2824M9703j3389L9646J26407o3794j26261P651o4390n2716p9669
15727b55684O0069j04074P5150M3139L469O7344l1406K2785J6154J23559J41980
$$ y = [-144331, -235910, -290579, -194358, -62004, -52900, 4116, 33750, 3122, 23453, 26960, 23306, 23963, 96920, -6277, -8273, 98797, 107210, 217751, 249315, 197083, 152840, 55821, 24407, 19140, 20408, -51263, -117469, -112173, 80278, 137170, -42543, -14418, -128250, -215813, -207100, -187004, -177850, -61418, -74681, 10400, 83756, -20253, 27834, 43290, 20272, 4107, 95706, 102618, 118341, -6859, -55129, -141767, -245733, -248153, -160100, -20003, -125183, -133619, -70564, 111020, 195462, 150406, 112332, 132609, 111237, 34586, 15630, -121696, -78872, -29169, -42558, -2912, 123495, 59701, -66560, -58909, -123299, -176015, -255684, -195615, -299689, -224539, -181400, -177931, -110587, -141993, -119208, -103054, 20505, 162485]
15716A62485K5034o6174k3018M0461j7064l0260m1063N2213J09315R494r4647
15705A26776L8492J8329P656j07160j38375n6480P2335M0255l380J503O912J6741
15693B3604J13929j3040j3134K0306q4653p7289r1229o7447N5552Q8015J04568
15682E9182M6153l2818R0846M7031j22470j26175j6143l2737m1360M2955J1156
15671g4380M491K7556J04031J38144K1217j6774p657N4387k6301p8704j8287J4920
15659A42643L4403j47450j22054j7543q3325R1115Q3639N0455J0853L265N9575
15648A05576J27427q6873O4770m6014j15160R1875P4352j0491k01596j30910J27179
15637A35J3867K0260O7775J5683l3438L0385P3697l9460q3142K0973Q0810n8731
$$ y = [162485, 187519, 121345, 98327, 138788, 121724, 91464, 50401, 102614, 211929, 221423, 126776, 165268, 183597, 191253, 84093, -54282, -110762, -38427, 1828, -1552, -49, 6863, 23604, 137533, 124493, 111359, 131665, 47012, -30277, -121506, -188953, -133401, -45386, 59182, 105335, 72517, 163363, 210394, 87924, -38251, -54394, -87131, -128491, -85536, -74380, -69889, -42333, 61698, 199842, 221059, 204285, 196628, 251015, 224714, 146010, 127723, 142643, 177046, 29596, -92458, -110001, -193326, -102211, -18572, 31883, 42736, 46001, 105576, 233003, 146130, 210900, 164886, 49726, 141601, 215953, 205462, 3866, -127044, 135, 14002, 34262, 102037, 117720, 84282, 114667, 188364, 148904, 65762, 86735, 167545, 108814]
15625A08814j51070r5187j41465k4840J86521J22868l5143P5022N6455L6454j59004
15614b0575m1940J03009J16961Q0960R1111n1162o6183j13094r1454k7787n1935
15603g2089P3150k8882m8926M6627P4962N0574M4559l9266m9019M6922J03154
15592B01766R053j06839l3570q859o855p8760r6947j02509q4869n7579j5412J05742
15580b75638J21155J04096P7564Q877j6673m0006l9108q5825l7552l1702j6308
15569b31120M929J15632k348l9989J19657Q4375j9709j46450k7923j8553k486
15558a63985M0158J14093o1710j32315o208J04007J05903K2714q0007j41430l8432
15547b37212m0588M6594J68700n7375k3524O6625L8847K2471j01860k1634M472
$$ y = [108814, -42256, -137443, -278908, -303748, -117227, 5641, -29502, 45520, 101975, 138429, -20575, -62515, 40494, 157455, 238415, 329526, 278364, 212181, 99087, 7633, -20154, -72089, 1061, -27821, -76747, -30120, 44842, 95416, 139975, 100709, 51690, 98612, 201766, 210819, 103980, 70410, 61551, 54696, -24064, -121011, -223520, -308389, -365968, -381380, -275638, -154483, -50387, 27177, 36054, 19381, -20625, -59733, -145558, -183110, -214812, -231120, -226191, -110559, -112907, -152896, -33239, 51136, 31427, -115023, -142946, -161499, -163985, -123827, -9734, -71444, -203759, -209967, -105960, -57, 22657, -57350, -198780, -237212, -277800, -231206, -62506, -119881, -143405, -76780, -37933, -15462, -117322, -138956, -134484]
15536a34484n6792M9201J85153J5588O121j2791M5629M795r077o4953l9827l6712
15524d8149p5192O9331Q7378p14M625K3667o3136m8985L047O1766k4856m9339
15512f0557n7367j34587J25632N3922k3362R7991Q1294Q2460K2284o7166l3901
15501H6643r4215m1558q3577m6819l5211J00100J30505R6567P6459J6787j1492
15490A94189j01565q6211m3787o2640J18530l6360p6773O1977p1705p0532M7479
15479a27398p045P5163p185K6689K9222q3845n080K1188k8951J8054K8262J0389
15467e0537L5078P1001p9794k2412M4773l860O762n1896j14331j54360Q0390J66060
15455g3126M9135J998M3116K08o3834l2336j04521J101J11430j2258L9801J55473
$$ y = [-134484, -191276, -142075, 43078, 58666, 64787, 51996, 97625, 102420, 93343, 28390, -11437, -48149, -123341, -54010, 33368, 32654, 37279, 60946, -2190, -51175, -48128, 13638, -11218, -60557, -117924, -252511, -126879, -72957, -96319, 1672, 82966, 165426, 187710, 120544, 86643, -7572, -49130, -132707, -179526, -214737, -114637, 15868, 112435, 188894, 205681, 194189, 92624, 6413, -37374, -100014, 18516, -17844, -94617, -32640, -104345, -174877, -127398, -134443, -59280, -66465, -39776, -10554, -94399, -99479, -78291, -107242, -89188, -60926, -50537, -15459, 55542, -24252, -46664, -1891, -5751, 1011, -50885, -165216, -319576, -239186, -73126, -23991, -21993, 21123, 21331, -42503, -74839, -179360, -178259, -66829, -79087, -39286, 116187]
15443A16187j1728j06880j5433N911L0806o9563k0274j16432r9334k5500K0147
15432b92093k5450J2987J58947J02521j1742m725j1667N2975J10011k0849j05775
15421c4860k2773J05677L6149L4990J13831Q5664m1723j06892j73616j34154J33652
15410d055L806O4545j5907m1498N4757j01983L319N5786J2995n4573m8450n8817
15398a30075O4346K4023j7337K4045N294R2362k7969P5518L8129P7732k5466o7034
15386A33568o3529k562R5379q0908n5571m8097q2971j7134o956O62N8663K5690
15374d3766J4851K3881R4986K9007M5621m9252k0067O8068j34377o3532O1579
15363B6999Q0489l9778p9940j3520M7226o2187j104q8308q2142L0990K4399r7866
$$ y = [116187, 104459, -2421, -17854, -11943, 18863, -50700, -70974, -187406, -286740, -312240, -292093, -317543, -304556, -145609, -43088, -54830, -59555, -71222, -18247, 91764, 70915, -34860, -57633, 48044, 84193, 119183, 233014, 318678, 276955, 170063, -3553, -137707, -4055, -249, 64296, 48389, 6891, 61648, -40335, -37016, 18770, 31765, -22808, -71258, -130075, -65729, -41706, -59043, -34998, -29704, 62658, 34689, 110207, 148336, 226068, 200602, 133568, 70039, 67477, 162856, 81948, 26377, -21720, -104691, -121825, -128781, -128119, -69456, -43766, -28915, -5034, 89952, 118959, 164580, 115328, 95261, 163329, 28952, -34580, 26999, 107488, 67710, -12230, -25750, 21476, -40711, -41815, -130123, -212265, -181275, -156876, -254742]
15351b54742p0239J14484K253k0563j3761P5469k4175K524J53262J13680N7502
15340A35694M3805j00731K6475r3607l0162q9932p5009J0632R7989J47584J04597
15329A77335o6087r9608j2666O2918J8842m4122n8809m2910J9743j29543j7397
15318a92304L5021R9923P2681R899J9041N9333o3254j02938o3562J6002P0330
15307c9828R2319n5626k9130o7655p4388J40296J22042o6952o6736p9493R9664
15296b5487J9282j73452o44O1834J9908k4528K37P1169P7840J24100O8986k3363
15284A95882n5497n0698Q038M1907k2184j07250l6141P3292L0120l1649j21400
15273g5580l3302Q8023Q3271K8374j41286l9826J42511l7440j32436M0750O5012
$$ y = [-254742, -324981, -210497, -208244, -228807, -242568, -167099, -191274, -188750, -35488, 78192, 135694, 179499, 78768, 105243, 11636, -18526, -108458, -183467, -172835, -74846, 72738, 177335, 111248, 11640, -1026, 61892, 80734, 36612, -22197, -65107, -45364, -174907, -192304, -157283, -57360, 15321, 25220, 44261, 103594, 40340, -62598, -126160, -110158, -39828, 52491, -3135, -32265, -99920, -174308, -34012, 88030, 21078, -45658, -125151, -25487, -6205, -179657, -180301, -118467, -98559, -123087, -122850, -51681, 26159, 150259, 219245, 195882, 140385, 89687, 97725, 139632, 117448, 10198, -25943, 47349, 77469, 45820, -75580, -108882, -20859, 62412, 90786, -50500, -90326, 52185, 14745, -117691, -76941, -11929]
15262a1929L0419J0170l6394o0639P5156N5895l2348j50811l9844p2710R8309
15251a34726Q9925N9099j9847l1593M0572p1204R829K38887j816O274n2334j69922
15239c6856K7400L6267N3093Q172r2386m9401r964l6226m1138m3191K7927j5385
15227a71688O2626N40M5293O6050q8161j04362p241o507m2492Q281n9179q9982
15215c86822Q5997J22481P6839k2526q774R7890K6715n7891r5083k1288J34389
15204d8073k9306l6876K841n0713j6270J95495J22661o5612L3010J44210j19831
15193A31536L5894J24716j38443m6877J39278n8108j55960o3249J10484k7729
15183E1542o3054J297K6684q503j2579k2281M1058R5816J9475j6920Q458K739
$$ y = [-11929, 18490, 28660, -7734, -68373, 6783, 62678, 30330, -120481, -160325, -233035, -134726, -44801, 14298, -5549, -37142, 3430, -67774, -57945, 180942, 179126, 185400, 133066, -36856, -9456, 26811, 79904, 88076, -4310, -53711, -63675, -99901, -141039, -184230, -156303, -171688, -109062, -108522, -63229, 2821, -85340, -189702, -196943, -203450, -245942, -237661, -296840, -386822, -300825, -178344, -101505, -124031, -132805, -34915, -8200, -66091, -161174, -182462, -48073, -77379, -114255, -111414, -162127, -178397, 17098, 139759, 74147, 107157, 251367, 131536, 167430, 292146, 153703, 106826, 246104, 187996, 32036, -31213, 79271, 51542, -11512, -10215, 16469, 7966, -4613, -26894, 14164, 109980, 129455, 112535, 120993, 123732]
15171A23732R5228k0270j42522j09731n6664o803L5949N3270j5435j3527K2163
15160c4610N5941P0218m7141j4069J24460M7770j64195N592O9502O3211J1082
15149A87761l9997p9720l7563j30245Q227L4367K6427Q4779N7070k0129K0819
15138A11796j18775j37637p281J39667J07721p05M2738j26774l6928R6231N359
15127G5412n3705j65867l8909M9031l2705k5860J06271J62747J8409j76256O2323
15116a9109J59322o8917n3549p3014j247J36756o7698p8653r097K2828o4840M4199
15104g3019J78046o3133k0722N5643M0120j43982j31129J04613J63763R4956N5671
15093B60827r4225k26862k5677K3364k5951K0184K2820K8925j7205p0421j9954
$$ y = [123732, 218960, 198690, 56168, -53563, -110227, -117030, -81081, -27811, -43246, -56773, -34610, 21331, 91549, 44408, 30339, 154799, 202569, 38374, 43966, 113468, 176679, 187761, 147764, 68044, 30481, -99764, -91537, -57170, -30743, 54036, 111106, 90977, 111796, -6979, -144616, -151897, -12230, 95491, 94786, 137524, 10750, -26178, 70053, 75412, 21707, -144160, -183069, -134038, -166743, -192603, -86332, 76415, 94824, -81432, -19109, 140213, 71296, 17747, -55267, -56514, 80242, 12544, -66109, -75206, -52378, -117218, -73019, 105027, 41894, 21172, 76815, 116935, -27047, -158176, -53563, 110200, 205156, 260827, 166602, -60260, -85937, -62573, -88524, -68340, -45520, -16595, -33800, -104221, -124175]
15082a24175K1799J01456K244j9457P2646o8504j21881j045m479o4887Q490l5822
15070b33615j3864J62773J00575n0385P0409M9022J5531k3887N4325K5404p0010
15059H6278j27758K3108O4993P308n5431p9275M0292M2140O18j1087j5300j5534
15047c9648N4087q6077n7468M1674O1818N8461j6187K4428M2440R4513n5953K1108
15035A43196K0294m1650L1652m0095j85046o2923j5950n5390p6334K0926J59895
15024a01425k585j37971k175M2295M8160K9787J5106m5028O6986r437k80j5991
15012a12558K8467N3102O1783m0155Q1605R8287P3327m0444Q7730K13122J08031
15001F12297k8686q1410J7120o3566j07415j13964L0688j02061j70986k482j8171
$$ y = [-124175, -102376, -920, 1324, -18133, 54513, -13991, -135872, -136917, -141396, -206283, -197793, -233615, -247479, -84706, 15869, -34516, 35893, 84915, 100446, 76559, 130884, 156288, 86278, -41480, -18372, 46621, 53929, -1502, -80777, -40485, 1655, 2273, -8814, -24114, -39648, 14439, -71638, -129106, -87432, -25614, 32847, 16660, 41088, 83528, 178041, 122088, 143196, 163490, 121840, 153492, 113397, -71649, -134572, -150522, -205912, -282246, -261320, -101425, -104010, -241981, -244156, -201861, -153701, -123914, -108808, -153836, -86850, -96287, -96567, -112558, -84091, -30989, 30794, -9361, 72244, 170531, 243858, 203414, 291144, 504266, 612297, 583611, 502201, 519321, 455755, 348340, 234376, 265064, 163003, -7983, -10465, -28636]
14990b8636j6558J05507O244J08275j4124L3875J14637J06612j20297j01450n9110
14979A34975r0907M5941j7048j6556R070n4970r981L7083P552L7843n4080P4262
14967A03184Q0451l2758L0237K4845m7834j099q5600K8271k354j5266O4203k0260
14955A26020j12904p4932M9538J38919P1142o9958j77273m2366O2930o0402K2912
14944f6374M436M8773K9847j400J7009L3943N5829P2665r5252k3169q7512l9895
14932e1100P4926N0946p9634o8708K5091n155L2906M3875Q274J6945P059j11933
14920e6508p4916m5803O7327R5784M3312Q824M2960K4258m0928q0633P2554k2436
14908C3795o5390j1915L4691J00190k672n9413K9812R5578L3226q1265K4631J9658
$$ y = [-28636, -45194, 60313, 66557, 174832, 160708, 194583, 309220, 415832, 295535, 194085, 134975, 44068, 90009, 72961, 56405, 65475, 10505, 524, 37607, 45159, 83002, 28922, 103184, 183635, 150877, 181114, 205959, 158125, 157026, 71426, 99697, 97343, 82077, 146280, 126020, 13116, -61816, -12278, 126641, 197783, 127825, -49448, -91814, -28884, -89286, -66374, -61938, -13165, 16682, 15282, 32291, 66234, 122063, 194728, 99476, 76307, -11205, -51100, 23826, 74772, -4862, -73570, -48479, -53634, -20728, 23147, 31421, 48366, 55425, -56508, -131424, -177227, -109900, -14116, 29196, 38020, 80980, 105238, 64310, -16323, 56231, 33795, -31595, -43510, -8819, 91371, 88699, 29286, 59098, 154676, 187902, 106637, 131268, 150926]
14896A50926R9866K040J0878p8244j55889K5033J4542N4928q1215j20525M8469
14885b9191q1555q6678O9779J6932j0964J8087n4336R0668M100J2921Q4055K1711
14873E5529J9110l0693m3626j13967p614J18820N0697L4221m9457q2537o0690
14862a10207m9485L9459N6080J58476l8294k6229J8876k8034j12859Q4985K3199
14851A5967j7386k8165L1636q48k0651P7258J0550p734R7548r94j88381m0902
14839g2102j01043p8536N4462M5769N5975M3394j989P126K5611k9528J0364J2448
14827b8049p5169O0935l2952o0788N6060j6615R4244m8887N0616J08469l6048
14816G1816p4023n216k6911n715p044l7282k8430J34431P9436j18308l1605R495
$$ y = [150926, 250792, 252832, 263710, 185466, 29577, 54610, 69152, 124080, 42865, -77660, -29191, -110746, -197424, -127645, -110713, -121677, -103590, -157926, -67258, -63158, -50237, 33818, 55529, 74639, 43946, 320, -113647, -121261, -2441, 48256, 82477, 33020, -49517, -110207, -159692, -120233, -64153, 94323, 56029, 29800, 48676, 20642, -92217, -7232, 15967, -1419, -29584, 2052, 1204, -19447, 57811, 68361, 60627, 158175, 157181, -31200, -72102, -173145, -251681, -197219, -151450, -95475, -52081, -54070, -46944, -21333, -50861, -40497, -28049, -103218, -42283, -75235, -136023, -79963, -96578, -2334, -51221, -605, 107864, 71816, -2207, -7423, -34334, -40049, -47093, -84375, -112805, 21626, 101062, -17246, -48851, -39356]
14804c9356K4432o5457l5393Q1581N0384q4297O788k05p7799J3931J39737j7116
14792b770N2774n2936k10386j07724L3498J18405N0420j679J4837J24346J7082
14781C5867j57405j22689P3082j3334k4431K8473l1915R9450Q9540O4861J7582
14770E9081o005R5311p6704j27551p8157k7668Q2265j3524Q8917R934L0903J097
14758C7899Q7504N7270p5640O2120q0334j46862j689J2116n7471M1118k3830M4519
14746d3280q9894q3954J47784O6503p1599K2046J4421q5183j3025j9586P4820
14735h0947M8243o1798l4805P4374N2382Q9172L9796K9679M7795m4530O4584j12518
14723A11427k6769L3864p9027J1661m0268j0345P5895q1110m9204p408O2636K6047
$$ y = [-39356, -14924, -80381, -115774, -34193, 16191, -68106, -61318, -61523, -139322, -125391, 14346, -2770, 50004, -2932, -213318, -321042, -287544, -169139, -118719, -120398, -105561, 18785, 35867, -121538, -244227, -171145, -184479, -208910, -180437, -212352, -112902, -23362, 41499, 59081, 53076, 148387, 71683, -55868, -134025, -161693, -79428, -92952, -4035, 5899, 36802, 37899, 125403, 182673, 107033, 169153, 88819, -58043, -59732, -47616, -105087, -63969, -87799, -43280, -133174, -217128, -69344, -2841, -74440, -52394, -37973, -123156, -136181, -155767, -80947, -32704, -94502, -129307, -54933, -2551, 86621, 126417, 156096, 203891, 159361, 223945, 111427, 84658, 118522, 39495, 51156, 10888, 543, 76438, -4672, -53876, -61284, 1352, 27399]
14711B7399k3886K3512n1428m7149r295N4388O0110k8164j3853p3476j8403K1283
14699g8962Q4904R8307J56896l9633j78574o1236J01362O9727j00696p3370O0149
14688C8874L1719P4296m161j02131l4569N4298Q7067k3345k1838K9987j6817q0267
14676C3113k2798l2590Q52M3899q7728K0064J44092K078o4434L4214J5627P5767
14664A62156K2595O1223j31946j03865K436J28916J77120j372j40994j77725J2321
14653A0865l913j00946o354j278J2680M5870O1257R2025L8146q5518q6124M6686
14641B3396N2814M7219j17410J701R7956j2875o4770m851m404j0485L8947k5809
14629B1429j30012l6800J01123O6579J4105K286o3755k4734M2864J0102N2644
$$ y = [27399, 3513, 27025, -24403, -71552, -80847, -26459, 33651, 5487, -8366, -81842, -100245, -78962, 5942, 104249, 261145, 221512, 42938, -18298, 83064, 152791, 52095, -21275, 38874, 70593, 144889, 140728, 38597, 4028, 58326, 145393, 122048, 100210, 130197, 113380, 33113, 10315, -22275, -21423, 22476, -65252, -45188, 98904, 100982, 36548, 70762, 86389, 162156, 184751, 245974, 114028, 10163, 12599, 141515, 318635, 317263, 176269, -1456, 10865, 6952, -93994, -100348, -101626, -88946, -43076, 18181, 110206, 148352, 62834, -23290, 23396, 76210, 123429, 6019, 7720, 105676, 92801, 28031, 23180, 18776, 8291, 47238, 21429, -108583, -145383, -44260, 22319, 36424, 38710, -25045, -49779, -6915, 3187, 55831]
14618E5831J23396R7188q6021n3514L501k372O0972M8983l7574m067k9641j09787
14606F6895k74100M3505k1621J9058K09275N949L437j956P3718J03381r3355j0309
14594A23877q3117n5645j5249O3312O0018K4698k7232n1615L6592J53461N1667
14583B80767k5855r6875K4978L6161j14038j18813N1078R0354Q2229J0517j07828
14572A12675l2202L0239j1777J6790N7880J4535q1832o5172o898l3610L8987N3183
14560I2798l5692L3675k5739L9608L7703N0449p2008j71905l4353N9271Q6888
14549F0695J485o7880o3475Q4996R6796N9065L422r9473P0562n4146Q3517n0814
14537A24750j31276P5736L7529l6527r1781l6058O0231K3716M3809k9315J280
$$ y = [55831, 179227, 276415, 190394, 136880, 140381, 138009, 198981, 247964, 210390, 206323, 176682, 66895, -207205, -163700, -185321, -166263, 43012, 48961, 52398, 50442, 124160, 227541, 134186, 123877, 40760, -14885, -30134, 33178, 93196, 117894, 90662, 39047, 75639, 229100, 280767, 254912, 158037, 183015, 219176, 105138, -13675, 37403, 127757, 209986, 220503, 112675, 80473, 110712, 98935, 115725, 173605, 188140, 106308, 41136, 34238, 628, 39615, 92798, 57106, 90781, 65042, 104650, 142353, 192802, 120794, -51111, -85464, -26193, 60695, 62180, -5700, -69175, 15821, 112617, 171682, 175104, 75631, 146193, 92047, 175564, 124750, -6526, 69210, 106739, 70212, -21569, -57627, 2604, 26320, 70129, 40814, 42094]
14526D2094P1920j7982j01846J1802K9564l718m0704n3884j4859O7858j4263K9075
14514E057m2769k4923P0714R8682O3973N857p2767o5055q5891p5756r0837L9188
14502a74527J32220Q3551K1775J5675N106J1580p9529j654P9689l9268N3092R0700
14490A98410J16586l7814K294J002j01887j60119p8308n4886q563J51523P3330
14479A01568j3624o8370l7730L9034M4084j29283k2188P5630J64530K7934l5953
14468A45632q086Q1369L943j26432r3514M6102m4413m8981M253K1860l2888o425
14456e7580k8063J26368N2000j3930o1506p5130m0013M3363Q0793O1541O2190
14445A50033K9953n3578L031j09049o8435o0832J82677J86377j7303n622r9524
$$ y = [42094, 114014, 96032, -5814, 5988, 35552, 31834, -8870, -62754, -77613, -9755, -24018, 5057, -37712, -62635, 8079, 106761, 170734, 176591, 103824, 38769, -47122, -122878, -213715, -174527, -42307, 41244, 63019, 78694, 83800, 95380, 15851, 14197, 93886, 54618, 107710, 198410, 314996, 277182, 279476, 280478, 178591, 18472, -59836, -114722, -123285, 28238, 101568, 87944, 19574, -18156, 20878, 64962, -64321, -86509, -10879, 153651, 181585, 145632, 137546, 218915, 222858, 96426, 2912, 49014, 4601, -44380, -40127, -18267, -51155, -57580, -85643, 40725, 92725, 78795, 17289, -57841, -97854, -54491, 26302, 87843, 150033, 179986, 126408, 129439, 20390, -48045, -108877, 73800, 260177, 242874, 237252, 137728]
14434A37728l8747k0379M859j01372j38069J1405K5587o1530k0669J18270J47480
14423F4563R7522N2476J2750j00209p9446J1257L5965N2719k2192q1619p523j2432
14411B3831N6463P3944O7859n7480r8212o4042J39144O5466J556p0242j52218
14400a3931n5956l5392m8113l6285P301J58731P4033p8531j27827m0993Q9069
14389a07894P5212M3359j4230j16390j5409J59577J2717l7201j2185O9765P5937
14378A33258J2177R4832r016m7938o5039k1629l2363o9906q9483K87M3899M9338
14366a583l7366M031J71958L7603R642r1669q5760K7993R146p8841J3161j4517
14354c6202j7295J6323K6175M3023J02596M0759k26105j40576J02909J52940J6813
$$ y = [137728, 98981, 78602, 83461, -17911, -155980, -144575, -118988, -180518, -201187, -82917, 64563, 162085, 214561, 227311, 127102, 47656, 58913, 94878, 147597, 125405, 43786, 36263, 23831, 80294, 154238, 222097, 164617, 66405, 2363, 141507, 206973, 208529, 138287, -13931, -69887, -105279, -153392, -189677, -182376, -23645, 50388, -28143, -155970, -196963, -107894, -32682, 10677, -3553, -119943, -135352, 24225, 36942, -259, -12444, 57321, 133258, 145435, 240267, 231251, 183313, 118274, 96645, 64282, -5624, -95107, -94820, -50921, -1583, -38949, -34918, 137040, 174643, 184285, 92616, 6856, 34849, 43995, -34846, -21685, -36202, -53497, -37174, -10999, 32024, 134620, 175379, -50726, -191302, -88393, 64547, 81360]
14343H1360p6707j20000q8313J2437N8861j14533k110Q7459m1146N7971J21795
14332b2926J34279Q958N8255n360j0594k2723p822o5196k1469l6657m1007J02575
14320G0313j4388j66693L469J56337q822j02421l1911J02865K5176O208J19686
14309A59819p3685m4273n6473n552n5321k7040N0604M0352P7071R9845k7025l7350
14297A00972M754O3798j872L8114m2730n3072j82978j3114r4581K4497M8365N8854
14285d8993Q3542l3528q956J21014m1669o8720q2138M25r1246m8435P1046R1381
14273e6277J1141J5603P8301j24767o0584M9822R5961O081j0204Q1806r5k2952
14261F3836o4360m3387o3952L4807j247j1204N3683P337R8660N3394n8996r9669
$$ y = [81360, 4653, -115347, -203660, -191223, -132362, -246895, -249005, -161546, -202692, -144721, -22926, 111353, 120311, 178566, 173206, 162612, 139889, 132067, 66871, 45402, 8745, -32262, 70313, 55925, -110768, -107299, 49038, 40216, -62205, -94116, 8749, 33925, 40133, 159819, 86134, 41861, -14612, -20164, -75485, -102525, -51921, -11569, 65502, 165347, 138322, 100972, 105726, 169524, 167652, 205766, 163036, 109964, -73014, -86128, -180709, -156212, -107847, -48993, 34549, 1021, -7935, 113079, 71410, 2690, -79448, -79023, -170269, -218704, -147658, -56277, -45136, -29533, 48768, -75999, -136583, -86761, 9200, 15281, 5077, 86883, 86788, 63836, -524, -43911, -107863, -73056, -74303, -85507, -31824, -24487, 74173, 127567, 68571, -31098]
14249c1098r0835n5280k8372L6512M1880J10379J24141P7646n5981l5336r9257
14238e601j3204M516p4039o7825k7409N96K5102N1587N1345N8018j2851r2763
14226a02528q756l2291n6535O6629J61701R395K0878m7923K088n900j35243o9177
14214a97662k3152K8712J18734K1793n4685p7760J77039M1651K4033M0849m0877
14203E8675P3199O2991L991j58046j8946Q3308J2332R056K6165q0599o6471q3583
14191g7928j3766l1284L9626m2023P0568N8576m6737m2029q4885K8431K1j28767
14179b70197N2599K9207L4746R6489p2426L7778l1833J0582N9296M4159j5481
14168b5081m461J0229R4836O5766j28543j15534m846l2479M5385J40362J22130
$$ y = [-31098, -121933, -177213, -205585, -169073, -127193, -16814, 107327, 184973, 128992, 93656, -5601, -18805, -14289, -88328, -156153, -183562, -182966, -157864, -106277, -54932, 3086, -9765, -102528, -111284, -143575, -200110, -133481, 28220, 37615, 58493, 10570, 12658, 6758, -128485, -197662, -220814, -192102, -73368, -51575, -106260, -184020, -6981, 34670, 58703, 99552, 58675, 131874, 194865, 198856, 40810, 21864, 105172, 117504, 126560, 152725, 72126, 5655, -77928, -91694, -122978, -83352, -125375, -54807, 3769, -42968, -84997, -169882, -141451, -141430, -270197, -217598, -188391, -153645, -57156, -129582, -91804, -123637, -113055, -53759, -9600, -25081, -29542, -19313, 75523, 141289, 12746, -102788, -107634, -140113, -94728, 45634, 167764]
14157A67764R1092K4834j44661m4214r2567p8212l3681q1597J28116Q3510m1617
14146b1233j52419O9727R6081o0231M1089q1851l5260J88340p9041r4686L3808
14135i5676L4449j00989l9122L5449J16132J32635O2547j77j02535m2271J2824
14124A3266O9090o0200k5131Q2992Q5603n3293J13228M934j01240j27035m0549
14113c8335m4981M7650Q3177K4138J08940m9991K1859j47214q828k118P914k1917
14101a9706j04679P5149N2907p7593r8542L2744K27418n8428j32544j6972N8086
14090f2160K4131L3947O2499J06939p5134j26287M1213R697J8283L0373k0566
14079D2935M9974N9839O1476j9143r4772j32745n6498Q9770J05702K991J7139
$$ y = [167764, 258856, 283690, 139029, 94815, 2248, -75964, -109645, -191242, -63126, 20384, -21233, -173652, -103925, -7844, -68075, -26986, -108837, -144097, 44243, -34798, -129484, -95676, -61227, -162216, -201338, -165889, -49757, 82878, 145425, 145248, 42713, 442, 13266, 82356, 22156, -2975, 80017, 165620, 112327, 225555, 230489, 129249, 2214, -38335, -83316, -35666, 47511, 71649, 180589, 130598, 152457, 5243, -3585, -5703, 2211, -19706, -124385, -49236, 3671, -73922, -172464, -139720, 87698, 29270, -103274, -120246, -62160, -38029, -4082, 58417, 165356, 90222, -36065, 5148, 14845, 33128, 63501, 42935, 92909, 152748, 214224, 195081, 100309, -32436, -88934, 836, 106538, 109529, 126668]
14068A26668J46249o6925J6073j7534o245p3753j90147n6866N2066j8202R9364
14057A0748k8635Q1828q6252K469K0205n613k1367l511j42127Q364J37368j1037
14045c7560M6288L9278l0898n9313p0582J9391K0394k2077k7811R4646K5081m5552
14033d8715l6733L2739j2341p052m5922n2738q7545M3387R9287L5549P2435M4550
14021C6901m5998o8044L2457O6915O1150q673Q8400k2873j18236K8984m5215o4878
14009e9110O5128j691N3512R7752p4240o9506N0053O8611j10400p4595L6939J03332
13997H5785L115l384k4602r5209j25172k2048K16032J53789k890j29923j62196
13986a06703K4443N4098N1245k0630n8206J18169L1286o9889n6137m4133M418
$$ y = [126668, 272917, 205992, 222065, 204531, 198286, 124533, -65614, -122480, -70414, -88616, 10748, -17887, 63941, -22311, -19842, 363, -5250, -26617, -30128, -172255, -163891, -26523, -37560, 8728, 48006, 17108, -42205, -112787, -93396, -73002, -95079, -122890, -28244, -3163, -48715, -85448, -52709, -65050, -72102, -118024, -170762, -258307, -214920, -115633, -80084, -7649, 36901, -9097, -77141, -44684, 22231, 83381, 74708, 163108, 140235, 21999, 50983, 5768, -59110, 6018, 4327, 57839, 155591, 81351, 11845, 61898, 130509, 20109, -54486, -17547, 85785, 88900, 85516, 60914, -34295, -159467, -181515, 34517, 188306, 185416, 55493, -106703, -82260, -28162, 23083, 2453, -55753, 62416, 93702, 23813, -32324, -76457, -72039]
13975g2039M3139l8319k4409L9648M8567k5586m0510m3280N7872R5313L5665j9684
13963E6377p9591j11319j1357n0865P4015J62001N7322K0023K0272j20118l1878
13952a5118Q685m6545K1410o8069M729K3681n2115j1446O8606j1089j8836J02014
13940E907Q4068m1246N8647M3252n649k4352j13235J8494J59100K4312J893j24667
13928H6524j13951j01137L3406r5717j52866L4708M6104J09479K5508O3512m398
13917f8828N9022m0078m2870M4379O1378O4495q4144j38189j3151J0472R0817
13906e6697J07758Q3474o0925l4455J0133k4950o3473m3931O3813J08177k379
13895H6545l4322j21645p74M7j0356j14958j867J5209M9542j0264n5517L3102
$$ y = [-72039, -28900, -67219, -91628, -51980, -3413, -28999, -69509, -112789, -54917, 40396, 76061, 56377, -23214, -134533, -145890, -196755, -122740, 39261, 96583, 116606, 136878, 16760, -15118, -6433, -52978, -31568, -99637, -94908, -71227, -123342, -134788, -66182, -77271, -96107, 5907, 89975, 48729, 107376, 150628, 144979, 120627, 7392, 25886, 184986, 209298, 211191, 86524, -27427, -128564, -95158, -190875, -343741, -309033, -262929, -153450, -127942, -64430, -68828, -9806, -49884, -92754, -48375, 13003, 77498, -6646, -144835, -157986, -147514, -56697, 51061, 134535, 73610, 39155, 49288, 24338, -39135, -83066, -19253, 88924, 86545, 52223, -69422, -70196, -70149, -80505, -195463, -197330, -182121, -132579, -142843, -198360, -165258]
13883a65258q2369j5454R9230P9340K8236j1118M528J00629O8338L0834L4874
13872A71810r5403j29873j9140j1210j1868k2832r0752j09921J30651J52792K8883
13861f863l762j8993M746J62044m6572m3068K3756o782o4964m1046j10482L9342
13849a12644O0698J4221k3314p978O4512M5169l6295J10621J33579l0818p6277
13838A41474j05583O5267n3182P5874o0392p1626m6490J6161J36918j3524j02870
13827a7973j7251J3717N5079j21109l0562M6039o779O1933J35828l6691j38301
13816e6070r907n698m366J15752M2949j01541j7534j11296Q1332Q6594j36268
13805a16053N3770L1454K904L5257l4836J55498J42114o7528m3456j8652R794
$$ y = [-165258, -247627, -263081, -163851, -84511, -56275, -67393, -62865, 37764, 106102, 136936, 171810, 76407, -53466, -72606, -83816, -95684, -118516, -209268, -319189, -188538, -35746, -6863, -10625, -29618, -24872, 137172, 90600, 47532, 71288, 64506, -458, -41504, -151986, -112644, -51946, -37725, -61039, -69017, -4505, 40664, 4369, 114990, 248569, 217751, 141474, 35891, 101158, 47976, 123850, 63458, -8168, -54658, -38497, 98421, 84897, -17973, -35224, -21507, 33572, -87537, -118099, -72060, -78839, -16906, 118922, 82231, -56070, -65977, -71675, -76041, 39711, 82660, -18881, -36415, -147711, -66379, 20215, -116053, -62283, -30829, -27925, 7332, -27504, 127994, 270108, 202580, 159124, 140472, 150266]
13794A50266n2542n2531l4253j14904j36224O2684K14595K6139N3461M3714k7206
13783A33199L0522p895r957o2201j40964O1684L9708J14254j5800j2952K8643
13772A58241O4872j23097j08785j9780j11879N1252J07747J50960o0211j17176
13762g856k394n1440r5519O6115J27375L6911k3678l8361n2262N0868J44758j21522
13750C2995L7350J4822l6323r5920l163L2413L2873k380j42448J16398P3857J627
13738F2101j36753O1889R7534M3936p485j3349j14412k1500O5842P7099M4268
13727A59170m8472r3759N7270J53159k7995Q518q2664n2967m8023j80680j2278
13716a68721M3615M1108J8711Q741K2629r0642j30887m5243L3386P5032L037N5755
$$ y = [150266, 97724, 45193, 10940, -103964, -240188, -177504, 37091, 63230, 116691, 160405, 133199, 163721, 155826, 145869, 83668, -57296, 4388, 44096, 158350, 142550, 129598, 158241, 223113, 100016, -8769, -28549, -140428, -89176, 18571, 169531, 109320, -7856, -10250, -61690, -157209, -91094, 36281, 73192, 49514, 11153, -41109, 9759, 154517, 32995, 70345, 85167, 48844, -47076, -50239, -17826, 15047, 12667, -129781, -13383, 60474, 62101, -74652, -12763, 84771, 128707, 121222, 107873, -6539, -28039, 37803, 114902, 159170, 110698, 16939, 74209, 227368, 199373, 207891, 125227, 72260, 24237, -156443, -168721, -125106, -83998, -65287, -56546, -33917, -124559, -255446, -300689, -267303, -192271, -189234, -133479]
13704a33479J09134K6500J1668J8939J4484m6004k2559j17047J4446M9207P8421
13693C710m825p8785L844j2887Q6576M4927M5014J0273l4673n5161o4469K0204
13681c6252O6573N5210O4023j45259j38627J48J7879l6646j7901J63158J55361
13670A47667k0828p513J5095L084k4915j15395o8203P5964P2452J7962N7184O5209
13658B17763n9357o1075O8356Q308p0923L0858O8991l7733o0273o9866L5337j65897
13646i5511l8064P5402N3536m846n767R0027N7061K3620K6393n4727q2696O680
13634E1108k9316l7340Q4619J12017j1379j40137K4647l1440J180M7944j30183
13623e8280j06760R5331J22357p6638K489K1753j14857J0313M8839J26897k89
$$ y = [-133479, -24345, 2155, 13823, 32762, 47246, 1242, -21317, -138364, -123918, -74711, 3710, -1115, -79900, -76056, -88943, -2367, 42560, 87574, 97847, 63174, 8013, -56456, -36252, 30321, 85531, 149554, 4295, -134332, -134184, -116305, -152951, -170852, -7694, 147667, 126839, 119326, 134421, 137505, 112590, -2805, -71008, 4956, 77408, 95370, 152554, 217763, 158406, 97331, 165687, 173995, 103072, 133930, 202921, 165188, 104915, 35049, 70386, -95511, -133575, -58173, -4637, -9483, -15250, 74777, 131838, 155458, 181851, 127124, 44428, 51108, 21792, -15548, 69071, 181088, 169709, 29572, 54219, 22779, 23959, 71903, -58280, -165040, -69709, 52648, -23990, -21501, 252, -114605, -104292, -55453, 71444, 71155]
13612G1155p6622l7872P174l8658O7113R9832k6074J1596M2811q7848p6411J18022
13600G4218Q3091n8543j78517K2389J65259o917j40503l7126J16965L2824r0652
13589a7512o1705r736J3756P1993j5221j07516l0335J49156L3425M6733K5112
13578I8150j1732J4445p7287r8851K0123k6860j55818J316J89276K8422r6411
13567a15227o6696K0924N863O0320P1071K1680P0062l9955R246m1566K0361j28948
13555a12865j6701P1345L0487L1132L2535L9923l6545r3070P2033J14811J03852
13544B36937k6664r5361r0455j40686Q0573R9544M5978j10800J5896p0785L6749
13533a9074M2925p5743k7467M6582J2685r1922N1644N8195k8798J6668k991l1065
$$ y = [71155, -5467, -43339, -36165, -74823, -7710, 92122, 66048, 77644, 120455, 32607, -43804, 74218, 157309, 98766, -79751, -57362, 107897, 100980, -39523, -76649, 40316, 73140, -17512, -79217, -88953, -75197, -3204, -18425, -125941, -156276, -7120, 26305, 73038, 98150, 86418, 100863, 23576, -75275, -55152, -82012, -237830, -236514, -47238, -18816, -115227, -181923, -160999, -155136, -94816, -23745, -2065, 67997, 28042, 37288, -4278, 16083, -112865, -129566, -58221, -27734, 3398, 35933, 75856, 39311, -53759, 18274, 133085, 236937, 210273, 114912, 24457, -116229, -35656, 63888, 109866, -934, 14962, -55823, -19074, 23851, -51892, -79359, -32777, -20092, -112014, -60370, -2175, -30973, -14305, -17296, -48361]
13521d8361M8290O8060N1004q2211q2196L6606O5548p906n2487J6682l3643l0112
13509e0726q281J25860P9071m1823j76984O7096J50353O1751K4825L8744q8853
13498A81033l1427p6114l3654l0097R6243L4434n4443j57369n5717p0698j0907
13487b08716L4211J16674J6009p8003l0114L6325L8744M5330l4542L5376p2273
13476a00979l7169j1141J3350R7647Q5686k8909k9178j8092J0506k8801L6831
13465a0249P0738q2960N0232P7609P0832L6509l3146r8238j5610R0937P474m3946
13453A20182m8357K0256L1688l5535p6124Q4652J5536o7434O9529K2738r2128
13442D5003j16980N206m8497P889J9146N7437J24152J11q8572j51039j20608l662
$$ y = [-48361, -71, 67989, 118993, 36782, -45414, -8808, 56740, 48834, -3653, 13029, -20614, -50726, -59007, 66853, 145924, 104101, -72883, -5787, 144566, 206317, 231142, 269886, 181033, 149606, 73492, 39838, 9741, 105984, 140418, 85975, -71394, -127111, -197809, -208716, -174505, -57831, -41822, -119825, -149939, -113614, -74870, -29540, -64082, -28706, -100979, -138148, -149289, -135939, -38292, 47394, 18485, -10693, -28785, -18279, -47080, -10249, 60489, -22471, 27761, 105370, 176202, 212711, 179565, 81327, 65717, 156654, 164128, 120182, 71825, 92081, 123769, 88234, 12110, 96762, 112298, 44864, 114393, 137131, 45003, -71977, -66771, -115268, -107379, -88233, -30796, 93356, 93467, 4895, -146144, -266752, -270414]
13430b70414Q244O3351k9609k231k2144O9848J29588p9536O2549J90258m4001
13419G5903r8103m1101L4023Q1666N126N8535O4703o4789m1355K9442j08997J3199
13407H252Q8625K3212j12479r1828r1768J08563J10969l988o2892j45781M4634
13396a24481J9134l043K4101n5966J712O8166L6851J0055J0661j0465m8260P4967
$$ y = [-270414, -262170, -198819, -228428, -230659, -252803, -182955, -53367, -132903, -70354, 119904, 75903, -22200, -63301, -29278, 52388, 57514, 116049, 180752, 115963, 74608, 104050, -4947, 8252, 96877, 120089, 7610, -84218, -175986, -67423, 43546, 39558, -23334, -169115, -124481, -105347, -108390, -84289, -140255, -138543, -70377, -33526, -23471, -12810, -23275, -71535, 3432]
$$ [...]
##END NTUPLES=NMR SPECTRUM
##END=
