##TITLE=Analysis number 321465
Compound Code cc 06604
Project Code adrs
Chemist Name molekula
##JCAMPDX= 6.0         $$ Bruker NMR JCAMP-DX V2.0
##DATA TYPE= NMR SPECTRUM
##DATA CLASS= NTUPLES
##ORIGIN= Bruker BioSpin GmbH
##OWNER= nmr
$$ XWIN-NMR		Version 3.5
$$ Fri Aug 11 08:41:09 2006 GMT Daylight Time (UT+1h)  MAYBRIDGE\nmr@NMR_250MHZ
##.OBSERVE FREQUENCY= 250.131544655141
##.OBSERVE NUCLEUS= ^1H
##.ACQUISITION MODE= SIMULTANEOUS (DQD)
##.ACQUISITION SCHEME= undefined
##.AVERAGES= 16
##.DIGITISER RES= 18
##SPECTROMETER/DATA SYSTEM= dpx250
##.PULSE SEQUENCE= zg30
##.SOLVENT NAME= CDCl3
##.SHIFT REFERENCE= (INTERNAL, CDCl3, 0, 16.522)
##AUDIT TRAIL= $$ (NUMBER, WHEN, WHO, WHERE, WHAT)
$$ ##TITLE= Audit trail, XWIN-NMR		Version 3.5
$$ ##JCAMPDX= 5.01
$$ ##ORIGIN= Bruker BioSpin GmbH
$$ ##OWNER= nmr
$$ C:\u/data/dgb/nmr/ADRS/670/pdata/1/auditp.txt
$$ ##AUDIT TRAIL=  $$ (NUMBER, WHEN, WHO, WHERE, WHAT)
(   1,<2006-08-11 08:40:30.36 +100>,<MAYBRIDGE\nmr>,<NMR_250MHZ>,
      <created by zg, POWCHK disabled, PULCHK disabled
       configuration hash MD5:
       E2 DF 36 D8 04 B2 41 60 5A D7 A3 38 5A 4B D0 FE
       data hash MD5: 64K
       12 27 E3 9B 8A 7C 04 48 AF 22 8F 3C 53 71 ED D9>)
(   2,<2006-08-11 08:40:51.49 +100>,<MAYBRIDGE\nmr>,<NMR_250MHZ>,
      <Start of raw data processing
       ef LB = 0.3 FT_mod = 6 PKNL = 1 SI = 32K 
       data hash MD5: 32K
       33 DB 13 47 65 A3 4C F4 21 2B 5D AB EB 1F 12 CD>)
(   3,<2006-08-11 08:40:56.09 +100>,<MAYBRIDGE\nmr>,<NMR_250MHZ>,
      <apk 
       data hash MD5: 32K
       8C A1 88 7E 77 6F 0B 25 34 36 C4 AD E3 AB 19 11>)
(   4,<2006-08-11 08:40:57.83 +100>,<MAYBRIDGE\nmr>,<NMR_250MHZ>,
      <abs ABSG = 5 
       data hash MD5: 32K
       C2 77 0A 9A 10 3A 04 5C F9 89 AD 67 08 A0 B4 5C>)
$$ ##END=
$$ 
$$ hash MD5
$$ 28 60 80 97 48 04 FA 55 63 D2 2A 03 3C 68 A9 02
##$RELAX= 
##$RELAX= 
##$RELAX= 
##$RELAX= 
##$RELAX= 
##$RELAX= 
##$RELAX= 
$$ Bruker specific parameters
$$ --------------------------
##$DU= <C:\u>
##$EXPNO= 670
##$NAME= <ADRS>
##$PROCNO= 1
##$TYPE= <nmr>
##$USER= <dgb>
##$AMP= (0..31)
100 100 100 100 100 100 100 100 100 100 100 100 100 100 100 100 100 100 
100 100 100 100 100 100 100 100 100 100 100 100 100 100 
##$AQSEQ= 0
##$AQ_mod= 3
##$AUNM= <au_zg>
##$AUTOPOS= <2 >
##$BF1= 250.13
##$BF2= 250.13
##$BF3= 250.13
##$BF4= 250.13
##$BF5= 500.13
##$BF6= 500.13
##$BF7= 500.13
##$BF8= 500.13
##$BYTORDA= 1
##$CFDGTYP= 0
##$CFRGTYP= 5
##$CHEMSTR= <none>
##$CNST= (0..31)
1 1 145 1 1 1 1 1 1 1 1 1 1 1 1 1 1 1 1 1 1 1 1 1 1 1 1 1 1 1 1 1 
##$CPDPRG= <>
##$CPDPRG1= <>
##$CPDPRG2= <>
##$CPDPRG3= <>
##$CPDPRG4= <mlev>
##$CPDPRG5= <mlev>
##$CPDPRG6= <mlev>
##$CPDPRG7= <mlev>
##$CPDPRG8= <mlev>
##$CPDPRGB= <>
##$CPDPRGT= <>
##$D= (0..31)
0 1 0 0 0 0 0 0 0 0.06 0 0 0 0 0 0 0.0002 0 0 0 0 0 0 0 0 0 0 0 0 0 0 
0 
##$DATE= 1155282028
##$DBL= (0..7)
120 120 120 120 120 120 120 120 
##$DBP= (0..7)
150 150 150 150 150 150 150 150 
##$DBP07= 0
##$DBPNAM0= <>
##$DBPNAM1= <>
##$DBPNAM2= <>
$$ [...]
##$SUBNAM7= <"">
##$SUBNAM8= <"">
##$SUBNAM9= <"">
##$SW= 20.6930455092707
##$SWIBOX= (0..15)
0 0 3 0 0 0 0 0 0 0 0 0 0 0 0 0 
##$SW_h= 5175.983436853
##$TD= 65536
##$TD0= 1
##$TE= 295.16
##$TE2= 300
##$TE3= 300
##$TEG= 300
##$TL= (0..7)
0 120 120 120 120 120 120 120 
##$TP= (0..7)
150 150 150 150 150 150 150 150 
##$TP07= 0
##$TPNAME0= <>
##$TPNAME1= <>
##$TPNAME2= <>
##$TPNAME3= <>
##$TPNAME4= <>
##$TPNAME5= <>
##$TPNAME6= <>
##$TPNAME7= <>
##$TPOAL= (0..7)
0.5 0.5 0.5 0.5 0.5 0.5 0.5 0.5 
##$TPOFFS= (0..7)
0 0 0 0 0 0 0 0 
##$TUNHIN= 0
##$TUNHOUT= 0
##$TUNXOUT= 0
##$USERA1= <user>
##$USERA2= <user>
##$USERA3= <user>
##$USERA4= <user>
##$USERA5= <user>
##$V9= 5
##$VALIST= <valist>
##$VCLIST= <CCCCCCCCCCCCCCC>
##$VD= 0
##$VDLIST= <DDDDDDDDDDDDDDD>
##$VPLIST= <PPPPPPPPPPPPPPP>
##$VTLIST= <TTTTTTTTTTTTTTT>
##$WBST= 1024
##$WBSW= 4
##$XGAIN= (0..3)
0 0 0 0 
##$XL= 0
##$YL= 0
##$YMAX_a= 825594
##$YMIN_a= -895700
##$ZGOPTNS= <>
##$ZL1= 120
##$ZL2= 120
##$ZL3= 120
##$ZL4= 120
##$ABSF1= 16.522
##$ABSF2= -4.171173
##$ABSG= 5
##$ABSL= 3
##$ALPHA= 0
##$AQORDER= 0
##$ASSFAC= 0
##$ASSFACI= 0
##$ASSFACX= 0
##$ASSWID= 0
##$AUNMP= <proc_1d>
##$AZFE= 0.1
##$AZFW= 0.1
##$BCFW= 0
##$BC_mod= 0
##$BYTORDP= 0
##$COROFFS= 0
##$CY= 12.5
##$DATMOD= 1
##$DC= 0
##$DFILT= <>
##$DTYPP= 0
##$F1P= 14.0000005364418
##$F2P= -0.99999901652339
##$FCOR= 0.5
##$FTSIZE= 32768
##$FT_mod= 6
##$GAMMA= 0
##$GB= 0
##$INTBC= 1
##$INTSCL= 1
##$ISEN= 128
##$LB= 0.3
##$LEV0= 0
##$LPBIN= 0
##$MAXI= 10000
##$MC2= 0
##$MEAN= 0
##$ME_mod= 0
##$MI= 0
##$NCOEF= 0
##$NC_proc= -3
##$NLEV= 6
##$NOISF1= 0
##$NOISF2= 0
##$NSP= 0
##$NTH_PI= 0
##$NZP= 0
##$OFFSET= 16.522
##$PC= 1
##$PHC0= 145.8867
##$PHC1= 4.938511
##$PH_mod= 1
##$PKNL= yes
##$PPARMOD= 0
##$PSCAL= 4
##$PSIGN= 0
##$REVERSE= no
##$SF= 250.13
##$SI= 32768
##$SIGF1= 0
##$SIGF2= 0
##$SINO= 400
##$SIOLD= 32768
##$SREGLST= <1H.CDCl3>
##$SSB= 0
##$STSI= 32768
##$STSR= 0
##$SW_p= 5175.98343685301
##$SYMM= 0
##$S_DEV= 0
##$TDeff= 65536
##$TDoff= 0
##$TI= <Analysis number 999999
Compound Code 99
Book Reference 9
Project Code 9>
##$TILT= no
##$TM1= 0
##$TM2= 0
##$TOPLEV= 0
##$USERP1= <user>
##$USERP2= <user>
##$USERP3= <user>
##$USERP4= <user>
##$USERP5= <user>
##$WDW= 1
##$XDIM= 32768
##$YMAX_p= 469553587
##$YMIN_p= -118576
$$ End of Bruker specific parameters
$$ ---------------------------------
##NTUPLES= NMR SPECTRUM
##VAR_NAME=  FREQUENCY,     SPECTRUM/REAL,   SPECTRUM/IMAG
##SYMBOL=    X,             R,               I
##VAR_TYPE=  INDEPENDENT,   DEPENDENT,       DEPENDENT
##VAR_FORM=  AFFN,          ASDF,            ASDF
##VAR_DIM=   32768,         32768,           32768
##UNITS=     HZ,            ARBITRARY UNITS, ARBITRARY UNITS
##FACTOR=    0.157963299565203, 1,           1
##FIRST=     4132.6476996994, 0,             0
##LAST=      -1043.33573715361, 0,           0
##MIN=       -1043.33573715361, -118576,     0
##MAX=       4132.6476996994, 469553587,     0
$$ Real data points
##PAGE= N=1
##DATA TABLE= (X++(R..R)), XYDATA
32767 -18588 -27692 -33957 -29516 -24089 -13698 -11348 -12245 -14319 -11778 -19457 -22089 -14747 -19672 -22719
32753 -22719 -30404 -27343 -25057 -21159 -25941 -24142 -16841 -13908 -21629 -19985 -13692 -15546 -14213 -8682
32739 -8682 -7348 -11146 -15610 -12509 -4355 6012 3818 -9084 -17957 -20687 -21428 -25019 -20897 -18090
32725 -18090 -12595 -14177 -7970 3414 -1541 -4185 -3899 -7112 -7075 -8445 -8783 -9405 -11159 -24101 -34350
32710 -34350 -24575 -15073 -10836 -12444 -18374 -24023 -10974 -16545 -19928 -14678 -9633 -11089 -5243 -3962
32696 -3962 -6127 -9439 -8229 -8252 -21375 -24755 -13520 -5514 -2640 1242 4655 12470 6176 -6417
32682 -6417 -17888 -24515 -20010 -9734 -8048 -21686 -22376 -23563 -13527 -4543 -3202 -1843 -10333 -16148
32668 -16148 -29836 -39716 -33815 -22051 -23412 -26620 -9517 1156 -7283 -22758 -19651 -16581 -10447
32655 -10447 4812 10843 -5337 -17799 -26157 -33470 -41322 -38950 -29210 -25458 -20675 -23779 -19620 -15591
32641 -15591 -19181 -24914 -28098 -28377 -29117 -20668 -9746 3446 5125 -4435 -6300 -5722 -2775 -3280 -4681
32626 -4681 -8328 -13890 -19373 -20470 -13940 -18832 -25935 -13638 -9879 -9314 -9272 -12443 -12540 -15293 -11672 -5078
32610 -5078 -1992 -9136 -23380 -22602 -23415 -14310 -4116 -10720 -19033 -9780 -11986 -17079 -19484 -19970 -13490
32595 -13490 -16140 -27082 -22819 -27547 -30105 -21492 -17376 -22669 -20534 -19928 -23797 -27780 -35249 -29169
32581 -29169 -28340 -20768 -14990 -20734 -21514 -18527 -19952 -19404 -26133 -14826 -6931 -12112 -15771 -11128 -11388
32566 -11388 -12672 -17336 -13575 -17568 -24907 -30344 -27880 -22591 -21776 -19136 -14297 -12325 -14641 -22401 -15031
32551 -15031 -11096 -18859 -29305 -25772 -18528 -19082 -29958 -24928 -15997 -19025 -15147 -15090 -4682 -7276
32537 -7276 -14551 -21249 -20896 -23178 -19143 -4981 8690 20008 18036 9465 1545 3268 -1124 -4030
32523 -4030 -6697 -19991 -27132 -16490 -7897 -9739 -11792 -17068 -10057 -6610 -19967 -14355 2448 1422
32509 1422 -5548 2292 -13706 -20845 -21894 -20368 -16334 -13802 -16084 -14199 -12664 -12412 -18118 -17630 -15502
32494 -15502 -20323 -13447 -6823 -7246 -13679 -15566 -7410 -534 -13460 -20636 -15873 -26883 -28580 -22717
32480 -22717 -16764 -12176 -17433 -15134 -11523 -19226 -33339 -32379 -21901 -19951 -24965 -14763 -5608 -17984
32466 -17984 -19919 -11239 -11937 -10884 -720 3257 -64 -10781 -16324 -12215 -16826 -28314 -27005 -11597
32452 -11597 -4440 -4494 -5851 -3766 -3049 5199 7411 305 -556 3995 -2043 -20023 -20009 -8018 -5347
32437 -5347 -813 1443 -1090 3981 2794 -23880 -37369 -39318 -39590 -36421 -27856 -21283 -10525 -5334
32423 -5334 -10964 -9378 -6079 -6060 -10070 -8615 -5324 -9884 -7501 -13764 -24343 -19237 -7546 -9736 3397
32408 3397 15329 9397 630 5442 10401 6265 -12952 -8003 6519 8244 -9689 -18933 -3826
32395 -3826 -4402 -8153 -3545 -5103 915 -10876 -8416 9754 19200 18480 9450 -6354 -25798 -40300
32381 -40300 -42776 -27456 -23873 -10150 7907 -8350 -20791 -4739 4382 2862 5038 2482 -33
32368 -33 10966 10635 -5847 -25879 -32541 -25716 -24801 -24867 -19161 -17360 3456 6769 -13864 -21483 -24076
32353 -24076 -33454 -30600 -17502 8996 9117 -2109 -9362 -4554 8289 -1412 -1707 1544 4407 3110
32339 3110 -14309 -19690 -6648 -799 9394 -826 -9716 -7839 -12457 -14152 -19988 -20764 -18528 -12666
32325 -12666 -12078 -11 3379 -7943 -33952 -36387 -27154 -21548 -20397 -29855 -36162 -26860 -15542 -14243
32311 -14243 -8495 -16067 -26880 -22232 -16305 -16045 -26034 -22917 -8972 -2390 -16650 -21834 -27950 -30297
32297 -30297 -7211 1760 6113 -438 4823 8800 -1639 -21742 -33753 -23705 -3288 -4732 -12213
32284 -12213 -25831 -30801 -29409 -35126 -26977 -30821 -21769 -10705 -1372 13149 15155 1500 -5212
32271 -5212 3074 -4592 -5293 -4946 -4733 -25591 -38709 -30313 -33682 -39895 -43248 -36204 -17291 -3484
32257 -3484 1759 -4818 -5504 -10584 -6865 676 -2328 -999 -2838 -18479 -34885 -23952 -19633 -14739
32243 -14739 -9491 -3985 -118 6757 12483 -4915 -8637 2945 5469 -4902 8571 -4501 -5241
32230 -5241 -2145 -5836 -10931 -5864 -13659 -28364 -26370 -9517 -4969 -1674 6537 -8848 -9624 -17319
32216 -17319 -25377 -18735 -2628 -2199 9117 3242 -12336 -18115 -4242 2718 -4268 -19163 -31194
32203 -31194 -26849 -21222 -15309 -16623 -13917 -17800 -21759 -17757 -26459 -36335 -21151 -14720 -12597 -7079
32189 -7079 -11771 -13878 -12690 -8191 -12044 -15484 -24566 -24530 -30504 -29632 -24158 -15645 -3677 1686 -14052
32174 -14052 -9812 9204 4204 18989 24337 22601 22055 6126 -3368 -13987 -7773 -1136 1427 10801
32160 10801 14844 5855 -5025 -17523 -35935 -31260 -22034 -20678 -28852 -35857 -34254 -36107 -40174 -25005
32146 -25005 -12673 -12679 -26473 -33528 -36344 -42665 -40645 -30625 -29023 -14121 -5859 2613 -16089 -34861
32132 -34861 -31056 -21336 -14488 -11352 -13991 -7547 2784 8056 10010 4488 -1322 3778 8154 8478
32118 8478 12666 9628 14272 2758 -21427 -33611 -28592 -5176 1053 4250 7826 -8289 -11517
32105 -11517 -6065 -10806 -19057 -19028 -2477 6070 16369 12357 11299 5523 -8956 -11524 -4622 -11556
32091 -11556 -14830 -5135 -392 -7747 -17874 -5952 -11767 -12914 -10962 -175 662 1980 -3778 10709
32077 10709 15257 -3536 -7486 11028 18578 3970 -7264 -11097 -2589 11384 2683 -13963 -14880
32064 -14880 -11116 -11026 -12127 -20700 -24447 -19828 -24901 -7362 12471 14188 16434 5022 4100 8078
32050 8078 5779 -4932 -112 16033 20923 3144 -7298 -3608 -9114 -4938 8487 9238 9830 5074
32036 5074 -1167 -9617 -26263 -33908 -26874 -22976 -11141 -5154 -3348 12680 9332 -4010 -21112
32023 -21112 -38555 -31919 -34153 -43319 -44334 -40410 -29225 -25046 -18032 -12134 -16729 -25530 -10118 8551
32009 8551 21395 18003 -3399 -9334 -15386 -28106 -18530 -8586 -11150 -16206 -3659 -7818 583 8417
31995 8417 8091 12062 11817 2997 4760 -4668 -11712 -5061 -6887 725 -207 -18307 -26094 -14477 -20055
31980 -20055 -23560 -13670 5107 13170 -103 -22956 -38884 -42883 -25357 -16042 -17665 -1467 -3884
31967 -3884 -5505 -1767 1476 -2013 1499 -1450 -9892 -17323 -9183 6210 9467 3266 449 -10557
31953 -10557 -12523 -8684 -11953 -27567 -41286 -54744 -58541 -29545 -10101 -12318 -3067 -5773 -8275
31940 -8275 -7019 -16348 -768 5636 -3605 -13052 -11835 -10668 -13127 2380 10194 6838 -3577 -2977
31926 -2977 -4390 3765 2739 -1584 -8901 -188 1643 1580 8276 15413 1196 6135 3254 8380 10813
31911 10813 3994 -305 1840 -3559 -5382 -13050 -6607 2334 3908 3336 1955 8255 208 -2042 -4866
31896 -4866 -8088 3256 9280 10945 -4755 -17439 -17499 -14723 -13055 -15160 -9141 -5752 -3561 -155
31882 -155 -5112 -15058 -13833 -1339 -2004 -2572 -7639 -23012 -28212 -24444 -23277 -22699 -11127 -8822 -5590
31867 -5590 -5111 -8246 -13852 -13888 -16297 -34997 -36402 -34555 -27996 -34584 -43300 -36887 -36355 -41359 -43737
31852 -43737 -28675 -10225 4384 -4157 -9981 3178 3549 -5823 -11351 -7818 -4091 -6121 3034 -2840
31838 -2840 -13216 -11929 -10724 -14737 -13156 -11285 -22823 -42850 -45512 -41593 -34662 -41384 -36158 -14422
31824 -14422 -4835 -1304 5567 10459 -2577 -6564 7357 1599 -16148 -23821 -25660 -17174 -170
31811 -170 -2707 -17020 -14337 -7035 -878 -11217 -13815 -19234 -25571 -26035 -30303 -28853 -24504 -16971 -25800
31796 -25800 -27803 -20866 -16156 29 -7860 -12293 -1937 3075 5443 -1462 -4613 -9234 -18604 -13090
31782 -13090 -547 -11881 -7881 -3849 -2906 6103 1541 -251 6983 3697 3391 -1925 -3605 -831
31768 -831 -5255 -12344 -14727 5626 11264 7445 6843 -12360 -21331 -14833 -3274 3607 -8548 -18257
31754 -18257 -9588 -16402 -29352 -34816 -27666 -15501 -8103 -8488 -13640 -10101 3200 18680 8110
31741 8110 -8591 -18494 -25572 -29562 -5271 1775 -4745 -3932 -5055 -11012 -4525 -3082 -10713 -12247
31727 -12247 -3877 16357 7750 3364 5467 6308 -19153 -24833 -19155 -15746 -6090 -4183 14019 19561
31713 19561 12083 -2252 -13602 -16212 -9104 2008 -5317 -621 113 2844 5818 4251 -6976 -6990
31699 -6990 2684 10931 6021 3752 -19657 -24780 -18020 -16933 -12097 -2661 9418 1085 -9344 -2847
31685 -2847 4885 15432 10479 -298 -6520 -11181 -6715 4120 -7592 -20124 -26716 -15291 -9130
31672 -9130 -12906 -14549 -19955 -27816 -30657 -32051 -41355 -41630 -32998 -17809 -21880 -10685 3227 -6990
31658 -6990 -15296 -11516 -6592 -7100 -1963 -2807 -5217 -8138 -16401 -18227 -18024 -24425 -20700 161 11506
31643 11506 -3185 -18698 -20299 -7077 -10989 -28055 -27942 -8832 -9132 -17483 -20549 -16633 -5628
31630 -5628 -14344 -21993 -24556 -23617 -22114 -17371 -9910 -12974 -18002 -17501 -12289 -22651 -4973 7369
31616 7369 -4314 -9398 -14498 -14588 -5071 5668 -4048 -5852 5271 4698 -2751 -949 4141 10432 4672
31601 4672 -1384 -1359 -5297 -19564 -9408 -3136 -7184 -7894 -12801 -6659 -2130 -542 599 -9830 4946
31586 4946 18701 -2286 -14813 -16312 -8600 -13542 -18397 -21411 -9081 4456 1022 -1191 6102
31573 6102 5805 -18761 -25611 -15512 -2883 971 6544 9630 2753 -3467 -5849 -465 -2108 -7516
31559 -7516 -10510 -12981 -7763 6912 12062 10916 -191 -6241 -513 7326 6741 6934 -3168 11700
31545 11700 15199 11762 7550 1839 -9480 -22333 -22401 -24335 -21548 -23351 -27247 -26837 -20555 -3387
31531 -3387 -7740 -14718 -9951 -26425 -32954 -21703 -22406 -22106 -21207 -23334 -14355 -4584 -3232 -10617 870
31516 870 5043 -2267 -7243 -1940 250 9008 -2610 -10765 -24177 -31268 -23104 -11366 -17867 -16883
31502 -16883 -8145 -282 66 -7616 -15502 -7426 2537 1233 -4356 3540 5160 5146 -393 -5753 -9426
31487 -9426 -7648 -537 -12960 -14865 -12063 -825 -3720 -9147 -4971 -18692 -28616 -12828 -24714
31474 -24714 -30814 -21493 -11601 -9704 55 2098 -6129 -6265 8164 13623 11382 4249 7619 10400
31460 10400 -611 -5403 -547 -4526 2791 11058 16362 5658 -9892 -10979 -15217 -4392 8422
31447 8422 11469 18108 35461 31947 11006 700 -17410 -26161 -19505 -6580 5276 8090 1559
31434 1559 -20108 -23924 -12810 -5651 -3650 -4818 -13748 -15986 -13661 -18825 -23477 -5850 12425 1380
31420 1380 -8465 -6931 6271 23485 21727 1931 -7941 6615 14276 11287 20250 14845 4916 -6338
31406 -6338 273 15739 23932 21532 13779 -8598 -7615 -12068 2957 11214 7268 -3792 -14643 -17535
31392 -17535 -19045 -27300 -22733 -17093 -5344 5139 -518 -12634 -23009 -16817 -13301 -12355 2258
31379 2258 8871 6630 15080 2606 -1020 4871 12962 4887 11059 22245 25502 24007 17662 8325
31365 8325 5937 9300 11724 2102 2597 -2562 -3614 2961 4515 2120 -8039 -4874 -2977 6102 -5916
31350 -5916 -18747 -19715 -15689 -11266 -13511 -9008 -3322 -17713 -21017 -10502 13825 18445 17275 3000
31336 3000 7512 12599 165 -9268 -24906 -38380 -26666 -10885 14575 27552 17476 -411
31324 -411 -10363 -5481 -12964 -21418 -28364 -22463 -22320 -2698 11223 10367 4880 -1966 -4159 504 6922
31309 6922 4455 6354 3413 -15060 -17115 -11190 -991 4239 -3322 -14831 -13166 -559 -3272 -6910
31295 -6910 -7303 -10841 -11338 -29981 -39993 -36625 -26437 -26685 -12053 4122 11718 19696 3409 -4826
31281 -4826 -4065 -4791 16647 24620 26343 16268 5188 2336 12412 939 -6898 -17613 -32930
31268 -32930 -21910 -4685 3460 8713 -1396 -4042 -2767 2478 -8543 -14734 -9920 4196 16351
31255 16351 16840 2875 -6176 -2983 1161 3442 17608 23601 19804 9910 6415 13049 21186 9592
31241 9592 -259 -16354 -19973 -19407 -16819 -21258 -19928 -14599 -2307 6017 19779 26951 20284 17499
31227 17499 7056 -15772 -20668 -8731 14570 22479 10703 -2501 54 11187 15847 6032 1436
31214 1436 9787 3843 -14166 -17974 -9428 -5684 2615 7691 6011 -2087 -7435 -17067 -27741 -11910
31200 -11910 -17668 -13893 -6752 -4156 -5314 -7924 -6717 -3890 -17749 -21531 -3971 -4430 6614 21325
31186 21325 14847 -2531 -5180 -1224 338 7266 9370 8687 -10212 -18304 -6461 -6703 -13770 -12647
31172 -12647 7833 19831 12328 -1901 -2448 7821 18747 12393 9502 4658 19326 9228 -9488
31159 -9488 -13307 -18780 -19532 -6052 8243 5773 9126 15301 6391 -2625 -3655 -8766 -26612 -36605
31145 -36605 -37468 -30731 -14743 -15313 -18158 -15954 -13551 -9997 -18169 -15253 -23234 -27943 -11149 -2993
31131 -2993 1110 -8582 -4297 3000 10259 -5327 -8985 82 9283 12190 9878 4073 2941 -1355
31117 -1355 -7813 -12453 -7763 -9988 -8210 4195 8744 8099 6902 16041 12878 2560 -2581 -7336
31103 -7336 -3078 -8189 -11782 -11616 -7459 3672 10444 9446 1109 -1108 -8526 -22558 -21089 -19135 -21678
31088 -21678 -20293 -21260 -19988 -7588 15828 20592 13627 13005 18538 12654 -4199 -19077 -24434 -22337
31074 -22337 -8251 -5960 -9290 -5660 -10401 -10840 -10931 -3899 13319 10964 -5683 228 -84 970 6615
31059 6615 1320 -984 -8582 -8872 -6156 -11616 -12186 -14097 -21036 -17461 -23133 -39058 -29610 -3445 9095
31044 9095 15997 17695 14964 -1562 -8451 -14681 -13869 -13263 -5091 9440 14737 12677 2258 -11683
31030 -11683 -1988 3306 -8667 -3170 -544 -11268 -4521 -3875 -13954 -12027 -6147 -2267 11 -5408
31016 -5408 -10037 -13117 -8289 -7944 -16047 -26153 -21289 -42547 -31127 -10925 -14886 -4974 -4914 6149
31002 6149 17228 4051 -6629 -17538 -22851 -20546 -14429 -27614 -37166 -20302 -8201 -10640 -7820
30989 -7820 -12723 -16094 -6043 5013 13951 2648 -5466 2843 14050 8535 -4401 7331 11588
30976 11588 11450 3269 -4983 -7796 -3663 -7836 -2612 -6854 -5663 4248 -7958 -12203 -17774 -17398 -13758
30961 -13758 -2191 12783 7546 3867 2078 -5078 -2244 5476 28385 39425 23493 15294 13739
30948 13739 7424 7873 -391 -534 -3646 -6223 -3570 -3789 -7043 -4747 -1356 2602 -11609 -18649 -21350
30933 -21350 -25387 -19211 -9718 14344 11448 18663 27162 3966 -5379 1926 -8205 -11941 -21179 -18877
30919 -18877 -12200 -2334 4772 -11107 -19629 -15852 -14411 -6530 -2618 -6626 -3074 -10677 -16912 -15997
30905 -15997 -2841 15754 14810 9942 5374 20811 21526 16400 16893 24944 22288 24943 20664 10304
30891 10304 7691 -4277 -7956 -10000 -2605 6835 9109 11627 14684 11351 2658 -7126 -10813 -20502
30877 -20502 -14168 3680 12766 8901 794 5889 14055 12632 10487 11056 3300 -1046 7775 4670
30863 4670 -2070 -6283 -1170 8849 192 -3556 -14590 -26901 -28652 -20143 -12161 -12483 -10591 3521
30849 3521 -640 5953 9737 674 -13156 -8714 -4768 346 16061 9658 -4984 3298 1389 -12705
30835 -12705 -25282 -26521 -42792 -25036 -9175 2781 17180 20131 5091 -3910 -3975 6140 11991
30822 11991 19657 21438 18656 18730 26543 24641 10867 7416 14176 -2 -12964 -11593 -995 426
30808 426 -4380 2775 -1772 3831 5175 -2289 -2421 -1138 -12407 -3482 -5692 -2066 -12032 -16816 -11531
30793 -11531 -4151 13118 11818 2818 -1802 8201 6962 2414 9837 8620 4426 8844 13411 14721
30779 14721 1818 -1194 -2613 -2474 1762 -123 -10196 -17530 -18587 -12646 -18698 -17360 -12984 5090
30765 5090 6820 5799 3084 -6220 -2190 6390 3093 1813 4059 -280 -8520 -5637 -14676 -17086 -15793
30750 -15793 -9327 -4580 -3556 26 -712 3617 8165 14913 28327 22516 20135 12207 15514 11024
30736 11024 11166 20746 17404 6440 12907 13196 19171 9954 9237 7675 4444 13842 9295 14867 19091
30721 19091 -3628 -11950 -16287 -5797 2421 16581 22935 15269 19921 19270 15248 12491 12965 18387
30707 18387 5649 -6167 -2094 2005 -7896 -10405 -2817 -354 -4399 -3320 773 1731 -15833 -21858
30693 -21858 -12375 -11481 -6496 7680 5267 9180 13196 9135 -8647 -4973 -5260 -6105 -9331 -14610 -14666
30678 -14666 -20095 -12938 -7808 -6067 7636 8668 4858 -676 2258 8546 -784 -10234 -410 9115
30664 9115 10333 11839 17520 6723 -13252 -15109 -12387 -25815 -18321 -12420 -11505 -23252 -24452 -12464
30650 -12464 -3281 9806 3781 4903 10966 3863 -4798 -9521 -2883 14765 17279 963 -7482 -12348
30636 -12348 -21164 -20434 -10393 4831 -7254 -5439 4423 11991 14104 19883 16672 19313 16008 13414
30622 13414 10487 10945 14408 16840 10567 20627 18225 15975 22864 14423 5205 10148 12564 9221
30608 9221 2042 4912 9177 12046 9831 7025 -8113 -17519 -10675 -12459 -12218 -21576 -19487 -18587 -13646
30593 -13646 -3657 -23957 -13006 11380 8880 -7701 -3577 872 -8016 -14896 -6291 5718 18392
30580 18392 25689 28588 26802 7142 -566 2826 8722 -2964 -6049 -142 4539 1307 1329 3131
30566 3131 1371 -11347 -18421 -11360 14293 24885 9466 11438 12865 8199 2568 3400 -571 -551
30552 -551 -936 -4447 6436 5582 -1018 -6219 -9669 -6793 -5248 -8669 -9378 775 -1023 13440 23421
30537 23421 14032 -576 10133 29362 16786 -1073 -16460 -18065 -18917 -1461 -6967 -6199 4221
30524 4221 -3780 -7132 13190 16037 16097 14478 11175 17784 11936 6418 4609 -1308 277 6553 4359
30509 4359 3241 9580 9207 14166 12292 9042 7185 840 -3288 -8424 -7699 -5742 -433 11430 11556
30494 11556 1762 9597 25327 27322 14207 16968 8840 12141 10345 -3759 7149 16398 18189
30481 18189 7687 -4350 -12896 -14200 230 -4157 -16410 -25147 -13720 -6596 -6805 -7954 -19975
30468 -19975 -21162 -1159 3417 2151 -2914 -6778 108 6629 9246 6247 -5479 -11958 -21775 -24475
30454 -24475 -14061 -7136 -2869 -1347 -512 1601 7218 23924 25092 15263 17983 19876 17136 10186
30440 10186 -2961 -2159 -4537 -8922 -18725 -6769 10584 5623 1760 -7129 -17947 -5691 2068
30427 2068 -5712 -4164 -1996 756 -3552 -4924 1801 -5419 -16664 -7517 -3034 4610 9616 -3683
30413 -3683 -1809 -1522 -3194 -5147 -5997 -6648 118 -4302 -8636 -10291 -7806 -8073 -3385 -510 -5347 -1241
30397 -1241 -6482 -12988 -13986 -7997 -3838 1100 -16318 -32784 -23876 -13678 -11123 -2978 -8233 -11716
30383 -11716 -3772 6869 7180 12889 4215 5751 5397 -9820 -7593 -3392 3244 4284 16339 19869
30369 19869 19897 27978 27591 11326 6678 8011 3401 -1407 -2707 -2344 -2896 -9464 -3419 10528 9014
30354 9014 -8036 -12087 -18762 -10692 40 17169 27240 22999 15727 4708 5215 5798 9732 15898
30340 15898 12720 8986 9067 7065 12062 27903 5309 -6675 -5470 2722 4111 17860 16533 8719
30326 8719 1004 5687 9041 9200 13523 6997 586 -1978 -17006 -21704 -22493 -14143 -3347 -5499 -2571
30311 -2571 11817 12963 18402 30364 25502 22194 11588 10264 7009 -1414 -7184 1220 1543 -2569
30297 -2569 -3222 -9770 -24624 -12717 -9264 -13017 -24927 -35694 -30123 -19070 -2945 11025 19104
30284 19104 15798 10959 5929 -11890 -12951 -7364 -10737 -4934 -4356 60 5518 -10649 -24064 -27330
30270 -27330 -21404 -5281 3196 8811 12545 10619 16630 26147 24619 19345 4448 -3879 -14243 -22126
30256 -22126 -14089 -11573 -9931 -6560 -927 3306 -1549 -11519 -9139 -7139 -5974 -4782 -5263 1512 5569
30241 5569 613 5867 8675 5100 -7306 -15548 -6529 -2127 -6469 6227 13098 11494 8381 419
30227 419 -22327 -32379 -10132 9188 21081 21341 23323 22004 14408 2437 -5226 -2368 10374
30214 10374 1418 5147 44 -5069 4859 9088 -4228 -23268 -17149 -10340 -2987 952 -3591 6656
30200 6656 9481 5433 -3097 4739 7247 -9176 -12085 -8066 -8227 -8028 -10962 -8665 -1815 -10411 -8854
30185 -8854 -506 -5732 -13501 245 12425 -4266 -5055 -9713 3909 12473 -132 921 -7662 -17520
30171 -17520 -23130 -13307 -7152 2080 4200 9874 13583 12694 27280 10421 -2582 -206 9084 5017
30157 5017 7701 12545 7938 3700 -4795 -6573 -7355 -2527 3133 322 1575 1260 8332 10419 -833
30142 -833 -6615 -4561 3167 11668 9724 18060 4307 -2629 -2597 -2857 -2292 -1267 11114 11453 5321 12068
30126 12068 28792 23295 10764 2034 3952 18743 13932 13481 17441 9914 -666 -170 -958 11329
30112 11329 23411 15665 7558 8067 8697 13597 12208 4244 184 -9605 -16551 -3139 5101 -1988
30098 -1988 -6980 -5820 1063 2500 -6438 -9426 -5068 11687 19445 6895 -13481 -15026 -11062 -12481
30084 -12481 -578 5010 1602 -23236 -25949 -21547 -6506 -2116 2206 -4978 -13365 5855 15622
30071 15622 15168 11079 6968 4708 4548 716 8221 11806 10465 11759 12018 12773 7741 3219 13256
30056 13256 8751 -1836 11057 17041 12301 11124 4943 -11345 -13785 -8519 -5222 -3701 -8760 -13713
30042 -13713 -4836 3353 13099 12644 10604 17600 22927 23184 15847 537 11352 9938 11664 16534
30028 16534 6470 701 8132 15936 8221 -3352 7711 4518 -2145 0 1178 4423 20076
30015 20076 16089 10999 14436 12412 6947 6128 2676 8065 5731 14877 20802 9944 7259 3304
30001 3304 -8409 9163 21987 20732 6900 3344 -7440 -19890 -10843 9637 19783 18271 18826
29988 18826 17964 10114 5636 10194 6322 4359 5793 13322 17621 -5535 -18463 -11895 -10848 -13062
29974 -13062 -10747 -876 -11145 -22890 -27111 -30064 -16690 -8381 -14304 -18210 -33070 -32509 -23928 -17395
29960 -17395 -16357 -3715 5184 8639 9417 15305 30241 40132 17153 2776 -6320 -10021 -3173 2096
29946 2096 -9916 -17683 -12730 -9028 9019 13267 7790 7691 8029 -7143 -3788 -3988 -827 -8913 -11324
29931 -11324 -4503 608 6458 8424 82 -8028 -223 18541 35526 26670 16742 10708 -4849 -5464
29917 -5464 5161 15775 4434 4472 -3458 -13300 -16181 -5729 -2252 10550 13611 19585 21389 -554
29903 -554 1334 7438 6635 5884 12457 4486 -21477 -33154 -22355 -12278 -15526 -17874 -12622 -1910
29889 -1910 -2504 1047 -6583 -2414 5138 5790 2512 -15322 -26336 -28215 -21496 -21417 -8812 6426 6271
29874 6271 7843 6787 16116 19504 28569 19299 12675 -5253 -9969 -6208 -10847 -1141 14319 9957
29860 9957 17438 22917 19252 13787 17879 16846 18321 20085 22925 25703 33285 31369 17988 11667
29846 11667 20605 32709 19483 17238 23129 20224 9421 3201 7121 15221 10102 11187 6284 15825
29832 15825 30930 15690 -7732 -7839 -13064 -5812 7430 10790 19329 19166 13859 13484 18923 26124
29818 26124 40699 37412 16542 5967 -2424 -5034 7467 12351 19992 17264 14371 5114 -1424
29805 -1424 9241 14618 2382 -4766 4718 17502 8303 -16987 -14592 -11222 -9852 -12709 -27647
29792 -27647 -38503 -24227 -12008 -7943 -2945 4995 -5771 -2967 1975 -9965 -23036 -27966 -17142
29779 -17142 -22850 -20141 -9352 -19826 -7337 -6438 -17097 -17314 -26019 -34275 -30519 -13165 5882
29766 5882 860 -9835 -5014 5705 9968 8559 13791 14085 6571 1422 -11529 -19904 -16789 -14506
29752 -14506 -8955 3062 10372 17784 27943 19436 6005 -5330 -6303 5149 3843 -1988 -11636
29739 -11636 -21862 -26050 -16201 3108 21852 19232 14693 9038 20394 26880 18625 13909 9361
29726 9361 3139 10593 16468 12994 11452 5803 14788 17539 17926 13630 7870 24252 35206 17639
29712 17639 -12780 -6133 1828 5663 26009 36313 26442 28545 25326 12705 3805 13743 16924
29699 16924 8114 4350 12444 17111 16275 16877 11523 12703 11820 5402 -7152 -15982 -18522 -15270 -12971
29684 -12971 -4652 8055 9325 6683 -2899 -3852 -10467 -36523 -39591 -27457 -25996 -28349 -13044 9290
29670 9290 6328 9571 4172 7390 -4860 -4304 596 -5646 -7833 -4064 3218 -1804 603 9481 14858
29655 14858 4171 -6810 -10329 -16002 -12017 2129 -8915 -383 9617 10518 17721 6680 -8844
29642 -8844 -7550 10925 14415 8291 -2729 -18491 -19041 -17274 -20251 -9101 -11158 6265 4275 9942
29628 9942 -2737 -1236 4731 4825 4458 13661 16579 3625 4954 9458 14742 -8542 -23190 -26239
29614 -26239 -24690 -12320 -10636 -1448 8050 8106 3161 594 -3395 -6296 5700 7555 5421 1980
29600 1980 -2843 -12574 -8257 -6632 -2547 2197 2902 -401 3484 10265 3060 3983 17285 23229 30511
29585 30511 20992 13701 15563 2925 -1229 -6461 -14355 -6744 -5658 9387 8464 -2385 1791 3614
29571 3614 -5143 -3004 2637 7816 6411 -10776 -12529 7069 28035 15881 3603 2953 7705 8747
29557 8747 5265 -342 -3633 18357 19128 -1574 -537 8919 12103 775 -10391 -12367 -17355 -24667
29543 -24667 -20867 -15780 -10109 248 10435 22829 11682 12144 25803 4370 2574 12263 17326
29530 17326 11046 -5242 710 4861 8004 2088 -6749 -3714 769 8847 22768 21561 16645 8683
29516 8683 -5275 -4412 1471 13646 11537 2393 -2192 2653 143 -642 15092 10130 5578 -7704
29502 -7704 -12018 -2410 -5453 -2665 2380 -6019 -11215 -13595 -6030 9282 15149 17826 10942 5628
29488 5628 3587 -15562 -15086 -13813 -9573 372 3241 -1421 -19858 -32304 -26919 -14205 -1714 5939
29474 5939 15385 7320 10227 -2971 7897 28814 24927 24993 17520 20109 30155 23656 339 -9536
29460 -9536 -8416 -15094 5216 14175 -16120 -17367 -912 -7131 14845 37971 31406 8498 11382
29447 11382 -142 -5027 -13646 -13796 -11651 -14657 -22151 -16309 -3574 -1876 1226 3977 -4936 -10591
29433 -10591 -4353 -2573 -6443 -21332 -12563 -1788 482 6587 -13444 -27278 -7109 -1821 -6466
29420 -6466 -8670 -6853 -3011 -2114 -9608 77 6391 3590 5092 -1373 -498 2544 6272 25050 29219
29405 29219 10690 -2074 -9803 -14208 -2915 -4832 -16110 -21030 -2180 1812 1549 3601 882
29392 882 -2519 -2412 2630 15181 10233 -3208 -12405 -5040 2582 10276 9918 -2615 -25482 -38758
29378 -38758 -26703 -20182 -15656 -18229 -8604 5527 5657 123 -6704 -6014 -11524 -3433 -158 -7110
29364 -7110 -11506 -6999 7071 -904 5227 11298 9081 523 -10224 -19895 -29719 -27982 -13223 -5205
29350 -5205 -3347 7434 13699 7257 938 -3201 -3116 1184 -2395 -7137 -3292 -1271 -10660 -20335 -8604
29335 -8604 4928 7039 7756 -2392 -757 3082 4129 8553 4519 -4811 -12105 -30247 -35368 -28112
29321 -28112 -27935 -14690 2025 2314 -88 -3498 1459 11296 6217 -5357 6140 16288 9282 4915
29307 4915 4903 11528 9801 1238 3342 24487 41473 20680 14177 13961 20370 8889 6953 -2311
29293 -2311 -11908 -4786 -1031 -1819 -6043 7197 12072 16174 19964 8106 6072 -282 -2033 -5165
29279 -5165 -8257 12128 22634 19709 21669 16871 2638 2433 -14095 -16488 -1642 -2321 -4482 -7498
29265 -7498 -8175 5103 2940 -11456 -17494 -7764 -5312 -6427 -8614 -16127 -8275 3159 15367 16181
29251 16181 13457 -3995 -12598 -11035 -2919 5898 6391 187 2482 3042 -3658 -7749 -1137 9190
29237 9190 9977 -4396 -6530 6551 7100 -3464 -914 -8098 -13939 -16253 -13123 -1004 5767 3780
29223 3780 423 -7950 -21742 -20328 5892 21533 26085 21142 20143 16161 7561 5737 12859 15720
29209 15720 8157 10621 20935 24256 10490 2904 -11027 -8979 -17596 -11902 12183 -3562 -28964
29196 -28964 -27650 -17249 154 21965 36517 27486 5645 -3763 11633 31786 26598 22200 25064
29183 25064 22304 14410 5047 942 4475 -8049 -12774 -1883 7566 16487 20865 14860 1396 -8621
29169 -8621 -1261 10226 13067 18424 19797 25077 24872 30495 32670 30623 34731 33851 23331 9332
29155 9332 -1710 9538 14232 4433 -198 -304 8999 19162 20145 9930 -720 -1546 8953 18952
29141 18952 31882 31888 19808 33340 32496 30225 25170 32119 35847 25847 18798 15076 3798 14888
29127 14888 25692 17431 15017 16880 10318 10039 12073 11737 7568 -861 -1746 -2435 1298 3148 10244
29112 10244 -120 15018 22951 36311 34839 22728 24926 14582 10543 17491 24576 11014 -439
29099 -439 13782 29195 28873 38775 40597 30510 5946 712 665 10239 15493 21210 16547 4243
29085 4243 5932 16820 14650 11188 11852 1517 -3718 7401 25999 27665 7511 2377 2065 10178
29071 10178 20274 24821 24433 6938 -4719 -829 -6669 -5051 -361 2723 2254 -1068 2027 6848
29057 6848 -4506 -14869 -4101 1791 8157 3178 -11219 -1928 1578 -13384 -8669 4737 13845
29044 13845 15942 1334 -19642 -7556 -4032 -10930 3250 11819 12735 6923 21794 25499 6863
29031 6863 1701 20104 19543 14457 2639 -14112 -10377 -12086 -2965 4461 5405 2386 8813 4150
29017 4150 1119 8664 12823 -638 -10996 2691 6977 -8561 -404 15140 8894 2165 -57
29004 -57 8408 12259 7398 13756 17593 15010 22094 32580 24611 16209 12139 15120 5891 17163 33622
28989 33622 24643 21111 10365 18121 30101 30781 25975 21230 17329 7621 6190 2179 366 2121
28975 2121 6931 2878 -4544 2022 6944 8942 218 22339 26500 19419 18195 23252 17949 17608 8728
28960 8728 2176 3872 7340 16702 14108 5734 5183 11014 11924 10357 13008 23901 28235 19440 15633
28945 15633 28858 32720 31389 31276 22230 2896 -2935 3258 4984 1565 7510 -2390 -7647 -1395
28931 -1395 -6970 -6000 11131 14547 10915 25401 33237 36355 41074 25350 19950 17554 11288 14378
28917 14378 11951 5695 1648 10966 16442 11689 8987 8821 8258 9015 15455 25712 21071 16217 12260
28902 12260 14313 2563 -12949 -13495 3456 22898 17580 22444 6948 1040 5008 6804 11305
28889 11305 6211 10722 9339 7458 -2108 -2856 989 2760 -1148 831 -337 -8579 -16435 -1357
28875 -1357 2604 7160 10141 12687 17033 20787 4516 -10653 -5823 5734 5984 10010 859 1014
28861 1014 8045 -2238 -305 -10561 -17905 -27128 -26903 -21027 -16080 -25255 -6059 3286 2412 -3457
28847 -3457 -12285 -16279 -9151 -2585 11632 4342 -2119 -3992 -5150 -15130 -13816 -16427 -6073 4617
28833 4617 6226 -1076 -15013 -15950 -9244 6281 7127 -13327 -2993 29532 26118 4693 7542 19700
28819 19700 19901 11778 5793 4538 -813 5425 -13092 -17840 -8084 -3851 -204 6960 3291 -3607
28805 -3607 1682 1750 4594 -2793 -6898 -1937 7260 8268 -6740 -17599 -8184 13818 17324 10875
28791 10875 17305 5645 1355 8063 -10 3732 -1806 -3597 -1209 4659 6102 4594 6008 8483
28777 8483 15201 23706 29055 34855 37944 27858 21453 2127 1673 -2619 -10406 5868 14085 9172
28763 9172 4044 -537 14079 30128 18526 5753 14252 17001 10829 16153 27855 39905 24864
28750 24864 24122 13614 7225 13197 -46 -6535 -4802 21595 17857 -1575 -12008 -1806 8357
28737 8357 14392 18319 14494 14728 8638 11579 4476 9450 8316 7920 17563 4480 3480 20316 30034
28722 30034 33120 23666 4433 4124 28972 34598 39831 40482 33311 24630 18529 13917 8266 -212
28708 -212 9174 6095 -10095 -8962 -3019 -8714 2154 17296 25988 24561 22640 17590 -601 -1761
28694 -1761 4947 4155 18723 23314 24791 15524 -2190 7666 5835 -2238 1952 12400 8148 2027
28680 2027 3415 -3166 -8452 -13720 -20810 -528 15858 11081 1487 -11874 -27916 -24262 -18541 -10761
28666 -10761 -4343 8796 19470 24886 12738 18817 12724 13399 10099 9138 12805 13157 27064 19037
28652 19037 16079 17180 16638 23462 23849 13367 14161 7899 8026 23892 8153 -22366 -42190 -39468
28638 -39468 -27218 -12987 4976 17358 15509 21936 23565 -1507 971 12762 28154 34172 25859
28625 25859 29773 22386 6149 -4602 -21401 -20313 -12919 493 8618 7300 7465 -257 -988 -830
28611 -830 2844 4969 11922 19104 30950 32618 17391 4016 3338 10724 14194 14160 11865 8057 7611
28596 7611 2884 9205 4765 -5165 -8775 -7918 -20302 -16543 -4955 -5663 -7945 -13616 -10140 -3145 1574
28581 1574 19397 28004 21792 14980 17443 -3872 238 9521 15889 27877 28937 26929 14317 2037
28567 2037 -1955 -565 -6609 5630 3316 8683 15407 -1105 -9863 -13084 -9630 -11173 -412 9203
28553 9203 13644 14817 19282 20651 17815 17185 16717 20141 23069 19275 5942 12708 21902 8635 12146
28538 12146 15638 10685 8240 9015 20834 30773 31514 32239 20174 5617 12301 26126 24183 16065
28524 16065 6892 -1743 1907 10859 21491 29859 36931 46037 46429 36615 33821 35095 33838 31289
28510 31289 28851 25748 18838 10043 12484 4894 8976 11118 22284 13281 -2337 6960 25808 34536
28496 34536 30284 10702 -1753 3170 13370 4336 -286 1575 12127 11489 14197 8706 1240 11953
28482 11953 14315 20846 4638 -171 3697 12356 13174 13501 15001 16285 292 -19395 -16145 -7141
28468 -7141 -13787 -16986 -15016 -6863 -6904 -7186 -16586 -18808 -11175 -4965 -14166 -13957 -14268 -9164 2392 16333
28452 16333 8570 2028 -9775 -3707 3444 1509 -4922 -4048 -5966 -7001 -14646 -5266 7156 5046
28438 5046 3068 8398 -4511 -7277 -2555 10299 3140 -1174 2663 13252 10426 3511 3269 -1714
28424 -1714 -15990 -20429 -8978 -6088 -4067 7406 13982 15804 13350 17949 28725 25102 23184 20688
28410 20688 24687 5806 -8229 5844 13376 10504 8626 9827 5102 -5717 -2113 13257 28767
28397 28767 27739 16492 20873 7869 -8859 -5769 10725 -2322 -19147 -32708 -46099 -32797
28385 -32797 -12815 -360 4002 -12847 -26973 -19357 -1912 10018 1922 -7767 -16563 -4700 13007
28372 13007 13068 6681 11522 15459 16484 17974 18691 24223 37587 30245 7472 -1651 3394 8967 11562
28357 11562 7415 13305 26469 32156 32400 25347 13396 3383 1776 -4899 -18284 -16039 -15347 -2853
28343 -2853 4643 2253 8260 19825 38040 43594 26354 19760 10534 3713 11350 12103 1708 -5040
28329 -5040 -10710 -18683 -16513 -28931 -26253 -18016 -4916 -5781 -8346 -1889 7702 8174 11238 14253 3189
28314 3189 -9300 -15533 -8149 1897 -5372 -968 4847 21024 12340 11481 -684 -13667 -2171
28301 -2171 6675 6732 -5814 -17681 -16173 -19158 -20704 -9154 -12889 -16593 -10539 -2073 5193 12331
28287 12331 14966 23936 20418 7305 -5304 4879 -975 5880 14641 8852 4329 9739 23663
28274 23663 4745 -9765 -10666 -8281 2792 13920 23284 35070 37673 17389 10902 8555 4414
28261 4414 7987 5205 8105 19549 26739 17502 6485 196 2837 5953 -11475 -15859 -294 4767
28247 4767 10526 7176 1968 -1971 3128 3917 3267 10969 21906 12506 7028 4098 11760 9317 16344
28232 16344 24878 29473 24044 21341 25913 5908 -5147 1372 2196 19895 21811 17071 19844 22470
28218 22470 22614 15113 1782 2156 12353 -3812 -3504 -13349 -22706 -12861 -7439 -2176 -7018 -1274
28204 -1274 8964 5258 3547 1015 6790 2002 -8448 -18456 -13783 -14975 -3477 14366 6411
28191 6411 -5141 -12890 -8169 2816 5929 2980 -1 -980 3346 5101 7370 11763 18294 15761
28177 15761 11445 9834 -243 -8327 -13200 -22155 -20831 -12715 -1808 3469 296 -4486 -6724 -21593
28163 -21593 -33466 -32112 -33356 -34974 -29497 -28363 -26918 -13349 8679 19764 12286 927 1220
28150 1220 1312 4580 453 -3412 -8636 -9060 -6633 3116 7221 14154 10427 10355 -487 -14616 -14962 -7311
28134 -7311 -3728 8997 19578 18748 14329 12501 10519 3597 -1497 5688 2215 -11061 -15175 -10345
28120 -10345 -397 -89 1598 2885 -4518 -1497 -4566 -5856 -2437 462 -4363 -6368 -6531 -4004 489
28105 489 11780 17498 27645 24848 10352 -1270 -2952 12892 15105 4543 5628 17602 24750
28092 24750 6425 -805 1916 19734 12339 7299 976 108 -4270 -6709 12385 18069 4040 5759
28078 5759 18695 29390 28890 6180 2427 15182 11051 9961 5105 2904 2327 -1449 20 -4106
28064 -4106 -1241 -5273 613 -848 10766 20327 16987 17576 9024 1450 -6613 1799 3593 -5795 -4979
28049 -4979 -13211 -1745 -3426 -12338 -15605 -5750 15905 12634 5985 4823 7048 -13826 -28896 -9728
28035 -9728 -3755 -10457 -6684 -7973 -2623 -3146 -5582 -4335 5591 547 -18222 -21681 -28620 -28691 -29284
28020 -29284 -20983 -15751 -30120 -18008 -4809 5863 12973 11112 7544 5012 1002 2912 9188
28007 9188 3381 11852 16372 9125 9963 11202 14098 10034 -864 1907 12311 12129 10277 7091 13045
27992 13045 7378 4030 11084 7659 -1990 -4199 -9731 -15980 -9711 -6759 1813 10412 14511 9094
27978 9094 -4563 -21036 -13309 10915 14575 24891 26075 14466 20290 29810 36815 22326 3394
27965 3394 2765 10484 19775 11899 1561 -1138 11427 26363 22225 16648 20146 23783 17049 20135
27951 20135 21389 24152 28901 30907 14138 1202 -9038 -5385 7017 9612 -3198 -5191 15440
27938 15440 32917 39149 21744 13915 6254 9743 12071 8932 4482 -8493 -12328 -2231 4913
27925 4913 8484 10354 13548 8065 2827 9798 18405 19144 3860 554 14635 14224 18176 9447 -8617
27910 -8617 -16592 -27075 -21085 -18135 -16574 -3267 6260 -862 772 2367 1405 13472 19957 20402
27896 20402 22014 27412 18054 12158 2220 -6569 5479 19223 37765 34292 20873 7978 7018
27883 7018 6380 11428 21989 24929 17162 19339 5405 6430 4802 6833 10691 20683 26859 20252
27869 20252 20131 17389 8073 6189 5376 9312 17551 6967 -124 -4065 2778 9377 10846 332
27855 332 -10895 6893 5718 7057 1450 1443 15628 12774 -2197 -8722 -13456 -17311 -19950 -13768 2583
27840 2583 5127 -11138 -11405 -1636 15028 25507 29037 30165 17290 2311 5986 6729 10176 14388
27826 14388 9514 -2228 -6731 -1573 1412 -10434 -13213 -8744 -7874 6840 26719 18827 4285
27813 4285 6372 15568 13603 12390 -1788 -16281 -22161 -18336 -12882 -8307 -9976 -1850 7721 24031
27799 24031 26306 31647 20915 23385 14808 19077 18015 10204 4542 2446 20187 26190 12906 11699
27785 11699 17176 10727 6437 4597 2342 775 15287 31184 27530 10154 17663 21520 21034 28107
27771 28107 24424 23121 22356 16895 31849 30416 9498 16322 35400 23956 4144 -7643 -12406
27758 -12406 -12860 -5169 -14957 -14651 3800 12627 12238 -6896 -9216 -20341 -20106 -11007 -8951 -10068 -2139
27743 -2139 4463 7449 -7504 -17662 -12642 2373 22717 31755 19158 5839 -9131 -2091 -159
27730 -159 1425 13363 13111 7196 17613 16989 11692 1128 10548 14275 5340 1800 9346 15149 13576
27715 13576 13889 -2620 -8598 -2212 -11992 -11825 5272 14460 2423 -6221 -11196 -6165 -4970 -9902
27701 -9902 -19944 -28449 -24103 -15415 -590 2925 -7913 -12052 -5275 13692 11765 10681 11528 12694
27687 12694 13899 18069 14509 9293 7025 12653 2586 -5925 1014 2863 10660 29370 40375 33273
27673 33273 22820 12737 14603 3674 -2219 4318 11048 5112 5885 2593 -1634 5625 6419 5905
27659 5905 10075 9712 -7936 375 5330 1691 -1643 -5900 6203 6077 3836 1538 -13747 -3155
27645 -3155 -2678 -2955 -1531 -9466 -14081 -2165 23583 27037 20312 16911 27466 18818 10548 2380
27631 2380 -9566 -15627 -8057 -1136 -2266 -5852 -19820 -10337 17689 12782 866 -330 3163 -1616
27617 -1616 273 1204 -192 3218 -3653 7365 17039 11575 14692 13739 9993 -3312 -1428 10381
27603 10381 5850 850 6437 2451 -7678 -10281 -8114 -10507 -13813 -11946 -9945 -7580 -12104 -11581
27589 -11581 -7961 -3680 -480 3097 4058 4708 7841 3715 5289 5833 8232 6364 7657 2861 11578
27574 11578 18012 19855 21456 11786 2447 249 8857 7558 4734 8770 27336 29026 25211 21010
27560 21010 19985 7487 8710 21186 22503 15869 4217 -2832 -6683 -11034 4692 12051 16605
27547 16605 11494 10216 26252 26998 25880 18424 20042 24332 17145 5276 -2320 -395 3007 -7
27533 -7 -6084 -14852 -17445 -6024 2533 1288 -2651 -10548 -9674 -10331 8818 24904 9152 3803 -6428
27518 -6428 3353 -9934 -18123 -7721 -475 -6572 -6200 1000 4525 6249 7727 19051 15930 -3176
27504 -3176 -27645 -26630 -15139 -15682 -14761 -22968 -41958 -26238 -18997 -14183 -27506 -31806 -38128 -21875
27490 -21875 2062 6905 11039 14794 7667 1438 -5635 12567 33925 23906 11953 21782 11552
27477 11552 3632 6553 4387 -3118 -4703 13315 18126 18244 18167 17770 3842 8925 4832 -3065 -12164
27462 -12164 -13099 -2179 4345 -5501 -15242 -12217 -14336 -2152 3955 1744 2321 1039 6467 5600 9784
27447 9784 8652 13940 27652 30349 16417 16882 16018 1134 -7341 -6149 2355 17665 -1934 -9606
27433 -9606 -8173 -12475 -6898 -554 -7721 -3053 5663 5270 15030 23114 592 -1458 -5450 6918
27419 6918 24320 22138 21878 26524 27558 21511 10991 10207 12676 21493 11653 -6328 -18304 -16639
27405 -16639 -8362 -4822 -5936 -11635 -9135 -6193 -5424 -5786 -332 -3964 -322 -1609 4780 17935 25627
27390 25627 12898 -4877 -13655 -11781 -795 -1835 -934 6062 10324 1140 -3449 -9224 -3217 -2999
27376 -2999 5901 7530 16916 7608 -244 2928 10851 5148 763 -15021 -5798 -6229 -13756 -3524
27362 -3524 11947 3741 1991 11378 7376 15163 20338 2136 -4940 -6899 -6810 -16771 -11326 3518
27348 3518 2471 -16069 -16840 -10234 -3009 15880 27341 22963 4307 -11911 -15713 -11832 -9221 -4200
27334 -4200 -14943 -22068 -16256 -1530 6442 2497 -1215 70 -3932 -1437 4470 18137 39501 36857
27320 36857 23298 9604 -1242 -9011 -9382 -19137 -20676 -8853 -4084 -9160 -21910 -9093 -8368
27307 -8368 950 12688 14898 15344 11406 8019 -1279 -3050 -5933 2916 6615 12281 13479 -3880
27293 -3880 -12778 -4565 3420 -4277 -17377 -32919 -36070 -39451 -35578 -26549 -15681 -11478 -16085 -20124
27279 -20124 -13369 1389 2380 1719 -4344 -12811 -12635 6691 16599 8185 7395 8296 9147 9016 4129 -1035
27263 -1035 9882 11332 532 -2188 -1499 -5664 -13188 -7150 2376 -3407 -6938 6417 1797 -8689
27249 -8689 -12476 -16547 -10767 -7067 -883 5908 -11798 2012 32791 34903 22460 22968 17377 4934
27235 4934 -3964 4678 13240 13447 1437 2997 -8135 -2187 19986 15386 4485 17113 23997 19622
27221 19622 1847 -3769 3086 4732 7856 5148 9714 5724 -3050 11413 19427 16380 4002 -4459
27207 -4459 -5042 -11321 -15217 -6859 6260 14396 7347 10927 17801 11345 -4273 -594 -1641 -9748
27193 -9748 -12626 -31859 -43765 -36344 -1382 1633 3985 -405 3946 12099 11461 -4363 -9794 -6127
27179 -6127 -15727 -16743 -15858 -9871 -7234 -16112 -18857 -14192 3543 -8008 -20581 -10031 -1208 -1317
27165 -1317 -4539 2076 -1736 -269 7446 -2471 -11680 -8448 -2774 -3241 -3955 -18862 -26697 -10151 -2469
27150 -2469 -1496 4220 12461 3883 3272 -2323 -1760 -504 -3972 5486 5945 -1494 2628 11758 11706 13828
27134 13828 16980 15113 18270 17517 6244 -597 10464 6755 3223 4909 1936 -6925 -4912 9482
27120 9482 -2690 -4385 -4110 7275 10189 4337 3808 12735 14565 15843 16055 14518 -437 -15371
27106 -15371 -18994 -12318 -19156 -5457 8983 4285 -10373 -13405 -9345 -11862 6934 17230 4148
27093 4148 3177 -3819 -14079 -11662 -13813 -10736 -5653 -8380 -11225 5088 9371 4460 4724 -1122 -4320
27078 -4320 -2157 -1911 4865 -1600 -20021 -18567 -2648 8228 -5449 -25966 -28809 -24499 -19666 -5602
27064 -5602 -8032 -9740 -4283 -5579 -1946 3641 12938 16587 10643 6893 10262 20277 23348 6083
27050 6083 -7200 -952 840 3968 265 5340 -2290 -882 17625 10106 212 6838 20421 31314
27036 31314 31813 22257 14334 1054 -5406 2766 -6735 -19325 -13475 -1449 11417 15295 7447 804
27022 804 8223 8471 9892 15010 1969 -12849 -15611 -7039 -3174 -6097 -3842 696 12669 2931
27008 2931 842 15048 14042 10807 20255 7045 284 -3594 6305 11075 10633 1370 521 -3304 -3771
26993 -3771 7599 10516 9648 4292 1908 -4220 -7827 2126 10770 21699 21297 10261 6395 -403
26979 -403 1728 -4987 -822 15037 11059 -3658 1377 6746 -16717 -7668 -2809 -8217 -8698 -3901
26965 -3901 -812 1317 -327 -399 -2759 6852 22385 24353 15975 7920 8108 11945 716 -4609 571
26950 571 -8547 -229 2151 -2523 -1326 -12372 -9556 -6003 9345 633 5608 9451 4519 -2188
26936 -2188 -17152 -23895 1265 7897 259 5271 16287 -1792 -16215 -25561 -17470 -7436 -4138
26923 -4138 -4924 12183 16074 16329 15883 17649 10564 1853 6776 -2026 -4972 -13795 -19401 -11717 6385
26908 6385 14626 22197 22034 12617 6913 13547 17260 8602 -1050 -8667 -20815 -23234 -26011 -15191
26894 -15191 -7442 -3564 -3614 -2034 15650 27801 20469 10153 -6546 -4228 4584 6187 5194 -607
26880 -607 -7852 -781 -5525 -4498 7122 22537 8413 -11733 -6293 -2693 -23353 -27954 -16522
26867 -16522 -14389 -7363 -5943 -15899 -5510 -10031 -5931 -2019 -7598 1978 1095 5218 4892 -3768 -8032
26852 -8032 -6233 7897 -2358 -10686 -11022 2193 7613 13761 18803 20309 25084 26761 13482 7002
26838 7002 15884 26065 14582 -6714 -20416 -13637 -10369 -12545 -17189 -25337 -23908 -9029 14071
26825 14071 14819 1535 6068 14706 8248 -2262 -3258 6556 6402 3056 7387 -1525 -4074 6897
26811 6897 5961 11274 9624 10884 -2887 -8418 2921 6610 -2664 2043 2554 5991 18794 12771
26797 12771 12303 9131 8892 21348 19750 21368 13681 -5001 -10094 -2531 1346 1228 12016 63
26783 63 209 6357 -190 -13077 -14356 -11043 -23090 -16318 -11661 -21882 -16620 -9535 -10980 -5122 4694
26768 4694 18503 12359 4880 -6428 -5792 553 -4534 -9263 -15118 -6123 6118 6971 5298 -11297
26754 -11297 -6063 -5155 -10996 -4464 -18147 -21368 -15443 -11032 570 10357 -1952 -3214 -17516 -11417
26740 -11417 4170 17298 24628 13083 -5673 9279 18624 22238 12211 8180 13083 28812 24657
26727 24657 17266 10195 13432 13856 13324 28934 23504 19029 29432 15677 933 -9311 2789
26714 2789 6177 9546 12585 20567 29569 30034 10650 -5103 -1732 10887 -10214 -21728 -13366 11241
26700 11241 27671 13995 5924 -4930 -6956 12583 15589 15588 11904 4433 -6117 -10030 -14465 -4737
26686 -4737 18315 28252 15544 5045 504 -14773 -23205 -8841 -1052 -3343 -2210 115 -6807
26673 -6807 1955 8412 8187 18593 11093 6869 275 -8521 -3290 4070 8195 -205 -10469 -20174
26659 -20174 -19427 -9420 725 8137 11069 274 -5795 -8268 -10413 7750 19061 11860 10725
26646 10725 8737 -1797 -7425 -9126 -6705 -16138 -7270 6176 15713 13402 6217 820 -5904 -10730
26632 -10730 -13744 -22221 -4940 6213 -3557 -846 14551 10984 15457 11336 -1571 -1836 -11654 -11368
26618 -11368 832 3264 -337 -12809 -21227 -12779 -6658 7781 6729 -313 -3514 4849 12729 4692
26604 4692 2076 9471 13748 7695 7777 -3444 -2846 -3700 -9298 -11114 -1889 13125 11809 5845 -2887
26589 -2887 -8781 -14778 -22005 -21095 -12421 -3448 15277 18354 20627 20457 25971 24395 6545 3050 3540
26574 3540 -15454 -30367 -25575 -17479 -11540 -7388 10971 13914 14841 10915 662 -10465 -15127 -4748
26560 -4748 -2884 -1792 13782 24033 24755 22897 28279 19003 12136 -16044 -30280 -20689 -17543 -20013
26546 -20013 -8737 2247 7506 10128 8459 -4261 -438 -2683 -8545 -9321 -14508 -12222 8166 21582
26532 21582 16489 1457 -12914 -17227 -12089 -17537 -28830 -16005 -15335 -20093 -18397 -16320 -22442 -11746
26518 -11746 -1381 11260 22523 6362 -2799 3747 -3844 -92 21112 37241 47849 34865
26506 34865 16027 697 6159 13524 15205 9416 5590 10552 2862 -795 1360 480 -6943 -13583
26492 -13583 -20145 -19710 -15009 -20267 -34383 -19278 2680 -298 -9433 -4364 -12471 -13650 -10672 -11513
26478 -11513 1448 7802 4411 22437 20445 23277 22435 19610 12135 -6687 -13701 1158 6965 16154
26464 16154 8755 4574 -2405 2918 -6013 -12454 -9929 -8274 -9931 634 4660 14085 16214 9232
26450 9232 12322 5978 -12280 -28379 -13018 -9149 -18699 -28423 -10603 -10290 -8613 2962 -2747 -3814
26436 -3814 9182 9057 4952 -3518 -4329 -4776 -7902 -3214 -2664 8092 6457 265 -542 -2585 6558
26421 6558 14214 3303 -10125 -15696 -11235 -5907 -13512 -5884 -6160 547 8699 4295 -9078 -4397
26407 -4397 -886 -5312 589 -658 -186 445 3369 4169 3035 3239 7461 8457 9021 11252 12988 18844
26391 18844 31900 22232 8469 3437 -115 7208 4798 3598 -1339 -663 -1906 -7151 -12751 -631
26377 -631 8865 6064 2474 7295 9949 -4703 -8553 -10602 -3862 -1097 2480 1459 -729 -12702
26363 -12702 -21263 -10256 -12955 -14570 -5441 -9026 -12260 -12079 -5674 3351 3490 -6659 6393 16819
26349 16819 6477 -1597 -2009 -1948 -23012 -14394 -3807 -5869 -5563 2463 4011 6603 7922 6770 121
26334 121 -11459 -7137 2160 9168 2320 -2555 -21767 -18252 912 8560 -2852 -7095 -9106 -6749
26320 -6749 -8754 -17843 -14225 -8969 -3901 -12792 -24014 -18731 -25300 -25862 -25797 -24058 -15952 6767 24223
26305 24223 5205 -7590 -10666 -13475 -8726 -7239 -21086 -25119 -18129 -11072 -17832 -18446 -893 3744
26291 3744 -998 -11223 8972 21049 6403 -5000 -7851 -10830 -3196 3724 12185 5794 -1834
26278 -1834 -4818 -4893 -745 11508 4897 8967 11203 9190 8602 6838 16165 3173 1929 -2914 -16878
26263 -16878 -16986 -13655 -3858 14323 6378 -11263 -7603 -7847 -6589 -8804 -14421 -18554 -16164 -11692
26249 -11692 -16104 -15009 -3404 7259 -10429 -12280 -11603 -13933 -21301 2295 -1559 -435 -201 -20532
26235 -20532 -23604 -23943 -15949 -10491 854 726 -1069 -6928 -15948 -20074 -16029 -19594 -21617 -30551 -28140
26220 -28140 -12656 -17419 -19892 -7757 -222 11627 -3678 -2532 3589 -6456 -13647 -14610 -22529
26207 -22529 -5477 5056 14346 18894 2864 -342 -7967 -16404 -6148 534 14437 7495 4019
26194 4019 4172 -6101 -14729 -2086 10166 13193 14696 5839 3155 9439 1682 -7098 5389 2419
26180 2419 -8850 -8889 -9273 -22324 -12523 -8609 705 211 -5649 2836 16991 9753 4184 6375 9502
26165 9502 12619 18264 11248 4640 3032 549 -4221 -2681 -4589 -13734 -13720 -13668 -24600 -17424 -15686
26150 -15686 -4456 2045 7866 17302 22994 23332 7539 4492 1073 -325 -6668 -12479 2430 11711
26136 11711 14863 6526 -8991 -18951 -23774 -25752 -26840 -14056 -14822 -12657 -9657 2273 21918 28005
26122 28005 20951 3782 -2023 -2110 9829 10966 6278 11071 11036 6161 -16196 -7317 1740 -8189 -18242
26107 -18242 -17147 -26343 -22038 -11393 -21780 -27105 -21710 -198 1098 3772 7385 5122 11588 7405
26093 7405 2223 -6348 -13463 -22591 -14030 -25733 -32600 -18781 -15514 -3813 4363 7052 -876 -4967
26079 -4967 -13308 -15969 -19506 -3789 4929 1072 -1924 898 -1410 -4662 -9084 -11497 -8781 4107
26065 4107 14855 7786 8946 10869 8146 8211 4764 2703 3458 -1222 -13550 -3655 12574 19344 14430
26050 14430 11992 3145 -16084 -18870 697 9833 18542 10111 14302 22553 12105 16445 25705 21645
26036 21645 11887 12304 9851 18145 6556 -10782 -9453 -9837 -3334 11912 12290 8203 2641 6703
26022 6703 12451 4412 14914 25417 14669 8359 -1719 -2426 18094 23155 9840 12510 15574
26009 15574 15458 5669 -4211 1008 7704 9948 -6493 -12775 -13285 -3976 4804 -7185 -8933 -7288
25995 -7288 -5845 -6886 -6838 -5299 -5542 -8186 -4750 3148 11461 -3825 -11131 3620 4571 -2272 -5356
25980 -5356 -12993 -21454 -15235 -16717 -8839 -16886 -14453 -5813 -12940 -10026 -8898 4408 2077 173
25966 173 2295 -7089 -11317 -9586 -23603 -15730 -22162 -40557 -50863 -46806 -37032 -16909 -152 324
25952 324 3380 2839 7790 -2485 -1928 -7133 -10982 -17404 -25426 -21796 -9561 -3491 -6149 -13000 -21317
25937 -21317 -20311 -31310 -23848 -15221 -11870 -17632 -32884 -26067 -9209 -7486 3126 2974 -17268
25924 -17268 -264 12833 13243 7879 5844 16154 25128 24815 21301 10189 -2907 -8838 -7398 -3590
25910 -3590 6257 8892 -9892 -21953 -24012 -19874 -3124 1197 9951 5210 3506 -2746 -11935 -13767
25896 -13767 -13639 -13635 -2537 -5691 -10777 -18452 -1331 14060 28449 15487 3602 9872 8968 -9934
25882 -9934 -2105 11780 -7019 -21028 -30731 -40268 -52408 -42770 -37083 -35396 -46847 -40326 -34538
25869 -34538 -12935 5478 -4204 -6462 -9934 -7044 -5413 -1507 2307 1857 4399 22537 10748 -3017
25855 -3017 -17331 -9523 -3395 -14267 -11849 -15517 -21572 -21325 -14837 -14602 -15344 -6921 -458 12081 11938
25840 11938 10907 10014 13256 7297 3240 4408 -11169 -19881 -26207 -11820 2241 14401 25661
25827 25661 37886 32081 9652 -12243 -5047 32377 47542 36921 14042 -13026 -32696 -39003
25815 -39003 -30692 -14007 -12780 -489 9355 22782 32354 21500 23558 28685 24226 26953 28682
25802 28682 24902 27291 13353 -990 -6545 -5577 -4424 -3166 8946 3270 -1326 7624 12600 7165
25788 7165 -3945 -3424 -17109 -24829 -11692 -9420 -1439 9421 11163 4373 -1192 -11369 -25959
25775 -25959 -34410 -15222 -4118 -10069 -5097 3930 -6918 -17919 -22248 -24203 -14325 -703 5065
25762 5065 -871 -8495 -15604 -6363 5632 14696 16841 22485 22159 19704 27120 20226 10117 4072
25748 4072 7560 8453 492 -12603 -5227 4264 13788 1853 -17163 -19082 -17407 -25131 -14868 -6961
25734 -6961 -12082 -4983 4551 3959 -1442 4142 3373 -7937 -12169 -4306 -3308 1486 14073 22771 21806
25719 21806 10434 -2105 -6998 -9475 -15929 -11169 -14244 -21605 -26787 -23532 -16761 442 7903 1048
25705 1048 -6000 -9849 -10187 -12674 -17623 -13041 -830 11282 14189 6488 -4238 -1756 8798 -2203
25691 -2203 -4544 2634 7642 10706 17423 11293 3197 12152 6193 12439 8826 22194 22494 6659
25677 6659 -221 -9182 -1886 15804 7145 -4702 -12395 -12330 -10046 499 4718 1884 9977 18994
25663 18994 18658 14474 15555 131 -15595 -17867 -13527 -4100 12887 18336 9645 -7344 -16303 -15426
25649 -15426 -6484 -5340 -14449 -13902 -3767 1436 10114 7290 5250 2946 2273 14865 22686 10604
25635 10604 -4240 -12482 -2460 -6936 -8079 1007 11263 7780 4098 -7963 -14635 -4491 15539
25622 15539 22629 10968 4590 -9930 -8939 -6517 -4936 -4419 4942 1882 -2279 -2417 1695 9635 11678
25607 11678 -2158 -13388 -7154 -3585 551 2847 -700 -8868 -1786 -6842 4021 16419 7483
25594 7483 853 -1034 5588 11433 12222 18027 11935 4535 3985 14235 20077 15658 5299 -2 -1522
25579 -1522 -2876 -1590 220 -2349 -11851 -19218 -20911 -4272 9662 11346 9734 -897 -3595 -16520
25565 -16520 -22068 -22439 -20470 -30009 -27654 -15017 -1532 -1257 -11607 -11379 4163 1564 -8436 -15829
25551 -15829 -23878 -19574 -5563 1042 387 -3708 224 3910 12899 640 7767 9833 15939 17916
25537 17916 17734 28165 30436 13631 224 5722 12528 19970 8865 -4651 -7242 -1502 -3071
25524 -3071 -5123 -21854 -12365 1692 -2184 5230 2276 -10940 -20945 -12047 -3265 -1902 25369
25511 25369 29803 25691 15641 1428 -1855 -7602 -5132 -2894 -13343 -16659 -15216 -7800 -9824 -15968
25497 -15968 -13015 -3090 -5543 -179 11725 15637 3150 -1793 5912 -1805 7234 17237 12747 7471
25483 7471 -13724 -8230 3251 -1067 -7557 -14405 -7729 157 -1178 -9979 -18546 -5979 -656 -8989
25469 -8989 -9728 9777 15546 11910 22468 24062 13649 4316 3212 6688 10123 13853 15536 -2980
25455 -2980 -11536 -12654 -400 -5406 -19197 -13940 -7924 -1210 4962 -22 -7628 -9685 -15522 -15449 -22560
25440 -22560 -18657 -13038 -23591 -30691 -14927 -22939 -30236 -32168 -26446 -31173 -28729 -13803 -9724 -6006
25426 -6006 784 1629 14697 4291 -18716 -8608 3985 2975 1376 3278 3350 4070 -9399 -17229
25412 -17229 -12399 -15482 -21650 -16667 -5520 1538 15718 12004 19271 9887 -10228 -17341 -19486 -14343
25398 -14343 -6437 2799 -5092 -7652 5534 22579 11509 2569 -25 6113 6271 -5670 -2256 8958
25384 8958 12920 13940 -3455 -24119 -33147 -24454 -15783 -13789 -3783 3845 -5519 -6609 4784 11135
25370 11135 5814 -1439 -2347 6679 6263 -9050 -14004 9520 28217 30598 16031 12240 4633 2594
25356 2594 -63 5721 4254 4742 10364 4587 -7504 3328 2198 -2870 -6527 -19353 -31517 -15780
25342 -15780 -14501 -14284 -16287 -12066 1332 12091 17854 15945 207 -9833 -8378 -10346 -13801 -14489
25328 -14489 -19862 -20521 -14759 -17883 -6291 -9234 -25580 -15820 4640 9486 -289 -18971 -29821
25315 -29821 -29454 -26693 -19528 -17583 -2335 11289 -2015 -2942 -5553 -1623 -10253 -16370 -11093 -8656
25301 -8656 -730 5835 -2598 -3519 6229 -6937 -8366 1483 -5904 -2161 1820 5597 6766 7266 9755
25286 9755 13590 -5137 -19335 -33729 -35814 -32765 -27074 -18219 -19983 -20354 -11640 -11121 -14082 -1302
25272 -1302 2489 15527 15966 545 -7201 -14491 -2639 6043 21951 19716 11050 16088 8937 -5151
25258 -5151 -11730 474 10382 -1094 -11374 -20444 -13765 -19191 -23559 -25240 -27387 -28368 -29739 -24502
25244 -24502 -17038 -3106 4486 1537 396 7511 -895 -10746 -12332 -8626 -3473 -12610 -1716 13727
25230 13727 1870 -7968 -11168 -12472 -11342 -9800 -15918 -10619 -20296 -26098 -23250 -13915 -16000 -29297
25216 -29297 -27345 -19456 -10847 8870 17479 21460 12400 8241 5186 6627 6984 5379 5489 -3442 -6697
25201 -6697 -9121 -2634 -8144 -9818 -4532 -14980 -4492 1838 9071 24726 15242 14427 790 -3058
25187 -3058 -13528 -14307 -6854 -19 124 -1855 13335 9079 -5791 5144 -9187 -21202 -18017 -10078
25173 -10078 -9184 -9158 -1381 5302 242 949 14860 18247 10660 12703 11014 9082 9036 1202 1320 3079
25157 3079 5022 -6597 -7443 -13329 -20177 -15915 -13690 -16365 -23631 -21663 -18592 -15538 -22176 -14408 -310
25142 -310 -2642 -4297 2215 2691 13297 6461 -2072 10770 9573 12039 10581 5625 8076 15656 -3936
25127 -3936 -10957 -30453 -38326 -39067 -21978 -3113 -3015 1514 -2994 1254 1483 -13714 -26048 -18144
25113 -18144 -8959 -18091 -18450 -24484 -11827 -3548 -4466 -3115 2808 12072 1194 -4422 -17222 -18771
25099 -18771 -16115 -18653 -24965 -25444 -25669 -11762 -208 -7118 -23097 -21544 -16006 -12507 -6892 3521
25085 3521 -4851 -9875 -7255 -11256 -26845 -30016 -17150 -1507 9458 8609 604 -8640 -6005 -6634
25071 -6634 -9660 -6688 -10437 -10971 -5267 -6604 -6031 -4190 -9317 97 -1190 -7346 -14428 -22261 -10908
25056 -10908 -4994 -11078 -25116 -24630 -30400 -31910 -25969 -26440 -11729 -14533 -10244 403 -12 -1283
25042 -1283 -15834 -24421 -13014 -10632 -3417 -2775 1194 4406 6846 21044 24522 28337 26894 -1748
25028 -1748 -7962 -12966 -12893 -9702 -13534 -18707 -18021 -19787 -16603 -19189 -9732 -5147 -4223 -12324 916
25013 916 12663 9323 8100 -8440 -29269 -37477 -28109 -18355 -21297 -13546 -7270 -10760 -8727 -2082
24999 -2082 15292 27707 23222 5798 -1344 -5096 -3482 -309 -10863 -22198 -26922 -20975 -5604
24986 -5604 -1549 -12009 -8761 -10621 -9100 -9856 -9311 -10344 6907 17013 25814 12604 3619 -13698
24972 -13698 -1480 1971 -8110 -17679 -12849 -9504 -3371 11814 15581 15201 19333 17125 4501 -2340
24958 -2340 -14371 -15977 -7512 -20888 -35297 -31540 -16152 -12210 -10719 -3488 -5694 -8846 -7519 -13844
24944 -13844 -9546 941 5283 12453 15443 4512 -10523 -15940 -22281 -27169 -16411 -5890 -2447
24931 -2447 1874 -567 -6944 5973 9676 11144 7986 -6385 -7374 -9407 -3788 -3573 -10979 -14097 -13422
24916 -13422 -16373 -19688 -18584 -3391 -10530 -14069 -18928 -10284 -5349 9868 17199 27011 18541 -7591
24902 -7591 -5056 6887 12240 9155 -8230 -6863 -2598 12403 14914 8318 -6157 -18503 -6852
24889 -6852 -820 6561 18500 3962 -5702 2544 -5800 -10404 -16013 -9792 -14115 -13577 -12723 -8224 -8703
24874 -8703 -12189 -7896 -1562 4966 -9262 -13208 -14259 -14652 -10600 -18131 -15635 -19657 -5310 -6413
24860 -6413 2249 1977 -257 -11630 -16337 -22806 -11254 -13023 -11622 -15839 -6665 2606 3260 -40 -11427
24845 -11427 -8990 -3531 -3520 1398 5470 8216 -2750 -20433 -29899 -23635 -4890 -6813 -12359 -5319
24831 -5319 1078 -20960 -29501 -32937 -24959 -7556 -2247 -12693 -28503 -27063 -14401 -3163 -14902
24818 -14902 -30362 -22879 -19522 -14127 -1378 2350 -3149 -3756 -6361 -1668 -3821 -261 -4749 -4807 -950
24803 -950 6083 29389 27215 10974 -10955 -12655 -6749 -1379 -4528 -13098 -11072 -14624 -14 17480
24789 17480 6228 -6597 8780 14917 14799 9710 -667 -11897 -13003 -9242 -16278 -16831 -7975 -7379
24775 -7379 -2 6171 5474 -10562 -17116 -4941 11386 9935 25724 25669 16921 10611 5984 -9155
24761 -9155 -22890 -28252 -29111 -12427 -6291 10080 20649 22564 2635 -8290 -5915 1464 -5148
24748 -5148 -12847 -18536 -5472 -1394 1530 5912 2084 -1441 -6080 -3861 -4977 8118 -1822 -8905
24734 -8905 -5713 -12557 -15608 -6042 7196 11444 15551 10984 136 1345 144 354 -1731 -3703
24720 -3703 -13581 -23395 -22372 -10095 -25656 -20475 -17451 -23590 -14318 -21485 -15403 10408 16748 11154
24706 11154 -6706 -13930 -17147 -12656 -10759 -20397 -7933 -4664 75 12423 6735 5670 -9590
24693 -9590 -14331 -5821 1835 -4071 -16999 -20840 -20580 -10256 -2606 11495 3877 -10340 -19031 -23709
24679 -23709 -23501 -21490 -13941 -1457 -1991 -21605 -11853 -7113 -6753 -488 -13290 -10242 -11455 -16737
24665 -16737 -23895 -15855 -13419 -3612 3193 -6819 12153 10120 3020 280 2068 -12848 -23642
24652 -23642 -26518 -12775 -7678 -10305 -3681 9528 9342 -8184 -7795 -4548 -1176 -11750 -19866 -37084
24638 -37084 -31849 -14993 -12143 1049 -5004 -21815 -25780 -27835 -19452 -4260 2947 2902 7576 8989
24624 8989 26519 18825 -3712 -10674 -4832 -3080 -571 -9476 -9852 -11612 -13157 -2703 8146 9005
24610 9005 16040 19080 18669 18150 5484 -2416 1223 -8596 -3723 7121 -6964 -16257 -16452 -10887 -5678
24595 -5678 -14364 -24519 -19002 2268 14958 945 -1508 -10920 -19346 -36948 -20647 -5173 4738
24582 4738 7492 2424 6110 -5593 -12606 -8723 -14473 -22127 -14886 -12602 -10932 -4461 -8819 -7500
24568 -7500 3789 8663 -3192 -9502 -1379 -5923 -6419 -4557 -19191 -37073 -31656 -19093 -13815 -7379
24554 -7379 -16590 -6244 14194 29331 27043 29008 29837 22182 13846 17865 9354 5135 5700 5831 -2547
24539 -2547 -6904 -10717 -18428 -11663 -3916 3413 5626 -1688 -5116 3370 -2831 -5327 461 -14642
24525 -14642 -27232 -31340 -17111 -7077 -5333 2358 19398 12728 4514 11999 2182 -10046 -8736
24512 -8736 -7337 -9928 -28131 -22170 -11149 -6158 -6725 -7340 -9470 -17198 -15208 -24410 -35062 -26667
24498 -26667 -20473 -22181 -18389 -18772 -14988 -5520 4349 -8732 -14278 -19700 -16423 -12513 -10841 -15439
24484 -15439 -16918 -13849 -8417 -14398 -13334 -9286 -13698 -9766 -17106 -23147 -11099 -12137 -5713 -10656
24470 -10656 -18653 -12983 -18628 -15795 -17174 -16612 -14475 -5169 -8735 -17326 -25624 -34180 -23662 -14666
24456 -14666 -19326 -36451 -38994 -33347 -20431 -19476 -21248 -21741 -31479 -27980 -25024 -30899 -12913 9377
24442 9377 11578 12769 13595 10898 21279 16310 -2132 1240 -7270 -10582 -2590 1499 -2446 -5801
24428 -5801 -12521 -20354 -17192 -15705 -6835 -5861 -3441 -1032 620 2632 -7447 -1457 7531 2897 -9570
24413 -9570 -15184 -7683 -8742 -16749 -12616 -935 2379 1294 -11750 -12756 -5312 -1248 4720 -5835
24399 -5835 -11104 -11375 -11415 -9813 -8969 -6149 -6137 -19468 -26818 -35009 -27836 -15428 -5893 -16391 -13347
24384 -13347 -10290 -14163 -515 416 992 -6852 1584 -13 -6177 -7840 -3221 -12078 -4488 22337
24370 22337 43861 32456 2139 -10548 -16055 -9560 -2864 4444 6096 1320 -19038 -26898 -24093
24357 -24093 -13840 -13515 -18283 -15390 -8389 -8913 -13896 -17237 -15765 -1136 16017 25033 19018 9263
24343 9263 1392 3085 3996 -5289 -5438 763 6220 -6649 -9857 3881 8432 -4274 -3716 10354
24329 10354 5692 2270 -727 -14171 -11146 -14075 -8482 -14590 -5055 18694 18076 5942 -11143 -5924
24315 -5924 6611 7223 -3772 2453 -2683 -11301 -24413 -23515 -13446 -487 1358 -8406 -13897 -30050
24301 -30050 -20691 -9220 777 -13404 -12067 -13462 -9772 -404 -2914 5718 13157 15320 -2382 -15627
24287 -15627 -13079 -2819 -3577 5091 9356 8173 9103 3218 -9241 -826 -1865 -9135 -13219 -11030
24273 -11030 -3680 1839 6713 2051 8354 -7005 -14365 -5164 -3787 -9428 4760 5179 2007 11570
24259 11570 10020 10870 19905 9042 -396 489 -12940 -15175 -12560 -4488 -4221 -15093 -21646 -18430
24245 -18430 -4757 4240 -11852 -8163 -14413 -21617 -23852 -19149 -4681 -4712 -15977 -12304 -10910 -7363
24231 -7363 1265 20434 7237 -4922 -6698 -14028 -3505 1920 531 16280 28572 26427 7819
24218 7819 -6058 -4682 -3589 -8522 -12807 -7272 3730 6558 2536 -16823 -24734 -20857 -21600 -13778
24204 -13778 3678 20568 13680 5430 8872 13183 9274 7259 -10438 -24305 -39513 -30564 -13571
24191 -13571 -508 1298 -807 -266 -6585 -4331 8912 9822 -10487 -9261 -991 -1652 3902 10695
24177 10695 7503 7694 3053 -11539 -15166 -11808 -6358 -6246 -19124 -9915 -14181 -20215 -12584 -6004
24163 -6004 2678 7655 9199 -1490 -10178 -17409 -23501 -16271 -8668 -7994 443 -3426 -23286 -20650
24149 -20650 -5369 1083 -157 3733 11419 15908 3750 -8147 -1207 3304 -1434 -6326 -5491 9956
24135 9956 11427 3633 -3930 -7064 -10978 -12803 -7731 714 -9897 -11390 -2961 2948 1151 2985
24121 2985 -8981 -13285 -12347 -18643 -19074 -4687 4284 6799 10973 9475 5262 -5395 -4352 1848
24107 1848 10050 5017 -11324 -7185 -11881 -8980 -15448 -23360 -14161 -5508 4811 10631 3936 -874
24093 -874 6882 7021 1397 11930 8232 14892 19830 4492 -8065 -16186 -3833 -6377 -6648 -368
24079 -368 6119 9921 -5730 -6322 -14218 -1989 4334 908 -6092 -6906 7355 -195 7489 15586 23199
24064 23199 28730 33446 41135 31947 35418 36090 32990 25166 34447 52193 59631 66604 78791 84128
24050 84128 87387 92762 99545 123217 131505 129904 124232 124627 120802 114381 101428 81631 75359 69138
24036 69138 56091 51458 41734 42670 38137 47609 52080 47563 49319 39469 40786 39666 45559 40491
24022 40491 34481 33245 32865 25697 19420 21754 14495 19431 20556 18456 16745 13330 8541 12157 14321
24007 14321 11530 2932 19607 18151 7370 3424 10881 527 -4113 -2176 -907 -4556 2181 10995
23993 10995 19303 21914 27789 21754 7129 -10024 -24586 -34611 -30124 -23222 -24246 -12737 3513
23980 3513 -3011 -14879 -12210 -16809 -19125 -17995 -16444 -6138 5861 14049 -413 -10221 -8995 -2262
23966 -2262 -5119 -14888 -19664 -13746 -12917 -945 818 -8783 1217 -2701 -5234 -3222 9529 11282
23952 11282 12136 9023 4045 6282 -4107 25 -8984 -23261 -26454 -26081 -22143 -22159 -23469 -14320 -18464
23937 -18464 -24440 -20692 -15950 -8726 -2228 3369 -8882 -8500 -2420 -8018 -21644 -21550 -19301 -24394 -20195
23922 -20195 -25193 -35582 -34927 -31342 -7401 6141 7978 12688 -1279 -8104 -15549 -15655 -1603 4210
23908 4210 6531 9810 62 -6557 6088 7711 4542 12147 13882 -857 -9259 -3087 -3657 1716
23894 1716 4838 -10255 -21718 -19011 -5611 4878 6952 10911 17530 21487 20393 21852 24584 22505
23880 22505 12926 1826 -10458 -22539 -25397 -15832 -1921 1959 9431 -6615 -18498 -18141 -24127
23867 -24127 -17369 -15555 -27561 -31020 -21230 -13415 -10693 -7442 -4987 -14328 -5627 9064 12807 247
23853 247 -5790 -9099 -29349 -21840 -21005 -25009 -14518 10755 16717 4215 604 -404 -11675 -11225
23839 -11225 -8738 -1459 8543 1001 -11085 -16835 -21585 -15788 -17230 -23774 -19498 -18495 -21059 -13425
23825 -13425 -9031 -5858 -14689 -12089 -11012 -27659 -30593 -33531 -34324 -40399 -49339 -38679 -13591 -14495
23811 -14495 -24292 -18243 2807 5605 -6899 -4295 11412 3600 -8241 -3221 -3031 -17070 -18730
23798 -18730 -9353 6720 -3393 -11547 -7604 -3861 -5093 -14999 -11113 4108 3428 -173 1477 2761
23784 2761 -1672 -7689 -19243 -29273 -22609 -18026 -13192 -8294 -3873 -19249 -33743 -30547 -25965 -18425
23770 -18425 -3868 2683 1847 -13983 -15812 -26531 -20191 -2482 7606 4407 -6998 -21548 -20155
23757 -20155 -9124 -5920 -15267 -13622 -6861 -7775 -8704 1312 7728 -1250 -8060 984 -4587 -14781
23743 -14781 -16636 -13306 -20585 -30058 -24819 -15403 -2866 822 -8483 -8216 -17505 -16798 -11388 -11769 -13330
23728 -13330 -21629 -28868 -22154 -5779 -5543 -5311 6653 8239 3171 10819 23447 22980 8803 -949
23714 -949 3419 16052 12103 -1288 3268 3216 1213 -800 -12374 -16006 -27227 -29632 -35718 -32728
23700 -32728 -19767 -11614 -5364 -8362 -14418 -21187 -26625 -17173 -19477 -22907 -16180 -6935 2342 9243
23686 9243 4097 -7709 -9196 -17158 -18399 -11424 -14459 -22025 -16998 -2753 -3001 4751 5687 -3607 -6529
23671 -6529 9558 8042 6681 9124 8440 5025 1487 -4168 -10015 6077 18970 24531 12850 1246
23657 1246 9093 6289 -1493 -10419 -8525 -3726 6461 17458 20425 21205 18927 20824 22047 23896
23643 23896 23972 26241 12449 -1164 185 -6429 3112 -6210 -15776 -5381 -466 291 2598 10142
23629 10142 12170 5419 278 -6597 -7862 -3534 -14389 1226 12226 5462 -3623 -13870 -30422
23616 -30422 -36104 -33557 -16362 -6691 -7891 -10076 -7085 -8793 -5973 2259 2296 10258 7590 13663 2250
23601 2250 -19217 -18422 -12405 -20194 -11305 -12393 -24048 -24213 -20601 -19407 -11442 -15343 -35476 -21563
23587 -21563 -9373 -15774 -17680 -19336 -1336 12694 -2027 -13496 -14702 -8016 -11973 -20111 -10585
23574 -10585 -20272 -34860 -46938 -38712 -20911 -8568 -10734 -25130 -21886 -8552 -3837 -10055 -19629
23561 -19629 -23236 -21315 -23117 -8464 -6759 -2415 -3012 -13698 -13678 5942 10024 8800 3059 1663
23547 1663 4431 5964 4720 -2043 -17310 -23078 -17879 -15943 -5901 2970 9587 14423 1016 -5067
23533 -5067 -11481 -18012 -24494 -24425 -9304 -7396 -17495 -13128 -23264 -16210 -19993 -11896 523 3409
23519 3409 -735 -5850 -2816 -4880 -10451 4253 26646 22101 11072 -3436 -14323 -17193 -16646 -23714
23505 -23714 -22947 -21911 -14757 9372 24699 6611 682 -4791 -21490 -6417 -4558 924 -836
23492 -836 2939 -5764 -8407 -14309 350 -7072 -20235 -18421 -8582 -13263 -18162 -3343 -13666 -26295
23478 -26295 -17635 -15843 -25162 -27029 -13077 -17227 -27763 -14978 -984 -3085 -4883 -4347 -3475 4905
23464 4905 13197 11310 15546 22216 4131 -10000 -1188 5788 9861 2069 -5293 -8033 -11214 -16761
23450 -16761 -16158 -12917 -23349 -27946 -23794 -23909 -19984 -28008 -32282 -28050 -12538 -7644 -10295 -11069 -4350
23435 -4350 -7950 -19106 -13795 1911 -288 4966 14924 21473 10166 9617 25797 16726 13548 3941
23421 3941 5315 -1764 -18417 -25592 -21782 -29946 -23777 -5768 -3958 -8075 -11486 -14224 -25847 -19909
23407 -19909 -19425 -12499 -912 2417 -15889 -31497 -23179 -22035 -20370 -26403 -11576 -810 -2244
23394 -2244 -4004 8187 10562 -6748 -3719 -7079 -13642 -14553 -7677 -6499 -8625 -10892 -16175 -25021
23380 -25021 -16298 -4424 -1017 -12605 -12122 -4502 -6058 -12153 -7267 -677 -11231 -14916 -14008 -865
23366 -865 -9382 -19246 -4605 3242 -2542 5851 3704 4833 10026 6964 -1868 -7964 -7343 -4644 -12128
23351 -12128 -18714 -21811 -24329 -29860 -24486 -12513 -13808 -21965 -18409 -20602 -19793 -20753 -10454 -5317
23337 -5317 -7571 -19963 -7060 4681 -2368 -5336 -10875 -19812 -14017 -6509 -5410 -19375 -12119 -11649
23323 -11649 -18006 -15241 -21835 -26858 -17787 -18068 -17057 -24318 -17412 -9772 -1753 -15970 -26108 -13405
23309 -13405 -4545 -7520 -4150 382 -1414 -10224 4690 22745 22116 13662 8843 152 -10450 -6527
23295 -6527 -20949 -29348 -17000 -20299 -27244 -28407 -21849 -20227 -10368 -9144 -9587 4153 695 -14638
23281 -14638 -12979 -8687 -1756 -1800 -10650 806 -1433 -3751 3919 3130 8282 23690 11289 -7183
23267 -7183 -16110 -5651 -10978 -10940 1262 -3306 -22304 -13350 -511 -5535 -11146 -13996 -8905 -4565
23253 -4565 -7818 -13879 -2492 -4433 -7548 -7105 -2442 2983 12343 28881 37571 33258 26869 27801 38159
23238 38159 53038 91894 145510 233905 332453 417022 482263 463920 419962 408750 437274 461553
23226 461553 411350 294720 203911 146065 110756 102408 104900 89168 70309 72272 59523 43915
23214 43915 52321 58907 59082 52110 35066 19859 11067 15134 9951 18087 37048 24322 15980 26672
23200 26672 32895 38958 29844 21330 18305 14455 18550 34536 39743 28110 26980 23626 15644 15034
23186 15034 27684 31167 34522 28412 1394 -908 -2118 2929 20097 31648 33700 31986 26879
23173 26879 36932 55194 77368 114310 150385 174564 204002 195382 169620 167672 179301 186218
23161 186218 184701 205059 242006 293978 343796 369613 359847 336546 328040 358574 368596 323857
23149 323857 235203 167562 136476 123220 99315 90943 79454 67700 71624 61427 55230 63567
23137 63567 66648 43624 21113 23351 39790 51573 44770 31496 17931 11362 8070 11711 11352
23124 11352 12038 12665 15583 11899 8419 17437 12790 7790 -7674 -7408 -3277 3292 11784 21655 10924
23109 10924 5658 23332 31513 12208 -6199 -4138 -11899 -22364 -24066 -17829 -9254 -7219 6643
23096 6643 26092 24116 17235 10833 -8958 -14714 -13012 -20714 -22742 -11673 4577 18539 14800
23083 14800 11245 -3072 -733 -5420 -1493 2186 3332 815 1916 5418 -4557 -12805 -6715 -2514
23069 -2514 -956 -506 14130 14277 15448 5283 -5190 -2561 -12187 -21265 -9815 -7010 -2118 2325
23055 2325 -16369 -16176 -19360 -26201 -20757 -14856 -18172 -25223 -26581 -18544 -8692 -6420 -1110 -5330 -18728
23040 -18728 -13309 -3856 -758 -1114 3100 8202 8775 7374 8771 4660 -5663 205 9035 15064 3151
23025 3151 -4418 -11016 -5191 3756 7962 -1046 -11804 9769 18846 17725 16484 13302 10954 8442
23011 8442 3085 -149 -7126 -17185 -24598 -35187 -32732 -20675 -9674 -3040 -12794 -14830 -4500
22998 -4500 -6390 -10424 -15548 -16327 -3225 -14075 -22852 -16494 -5130 2892 1932 -12772 -3359 4098
22984 4098 -137 4863 4822 -3187 -6273 -8124 -7188 -16015 -15527 -17986 -22232 -31362 -30474 -16154 8556
22969 8556 4940 -467 -8005 -23692 -35373 -31765 -21846 -25885 -14935 -8205 -19797 -27026 -33466 -33050
22955 -33050 -34903 -41351 -37720 -35156 -20103 3817 4320 3154 5312 -5144 4477 3059 -1849 -14320
22941 -14320 -25254 -30731 -25147 -19990 -21384 -20460 -7254 -4874 -2506 -4327 -11816 -6950 -106 -4500
22927 -4500 1132 -750 -5322 -196 -5841 -8430 -1279 11225 -6402 -3218 935 1437 8642 7606
22913 7606 5609 8820 -1519 -12352 -11862 -12156 10622 24062 9386 -5267 -11027 -11783 426 -10288
22899 -10288 -14028 -15553 -19731 -5174 9635 10013 2288 -2887 11366 18225 15739 2206 2001 4461
22885 4461 -6755 -11988 -14553 -12621 -9712 -2187 -9976 -17926 -22785 -16733 -20464 -21626 -18391 -10050
22871 -10050 1851 17540 30672 32451 20837 22148 17140 12158 26447 27140 23477 14484 3086
22858 3086 5807 2738 -2045 -10852 -10633 -12226 -7070 6356 19008 -4395 -9702 7812 16747 17143
22844 17143 18297 30903 31530 21221 16290 12462 30237 38972 29691 9016 4056 17585 25061
22831 25061 23655 30946 24111 20093 18286 24036 19808 32192 25995 17509 25066 29603 10773 2245
22817 2245 7205 8656 20192 25333 31115 29178 23108 14874 14548 22964 8172 -4721 2186 4015
22803 4015 795 5170 6815 390 4950 15026 15583 15334 25923 23289 24285 29544 32013 36547 32447
22788 32447 16516 9222 2528 -5577 4213 13758 8806 15289 20165 12569 9335 27486 42905 43043
22774 43043 48600 59633 66618 62878 58549 60526 68476 77022 96320 117328 150460 198689 256534
22761 256534 333835 498065 801587 1255939 1752095 2197206 2551638 2393309 1648720 1025578
22751 1025578 684581 516452 438437 378761 339001 301067 272390 254090 239249 223408 205831
22740 205831 189406 173893 176030 179483 182007 170872 165524 178113 167905 155922 140652 128194
22728 128194 119197 118255 120522 111667 104998 105307 103720 104775 98074 92665 97553 99324 88793 73000
22714 73000 72797 75958 75473 76629 71547 59903 60885 57316 38231 37306 53218 56274 53697 43266
22700 43266 25918 37087 51489 62117 66814 61009 48838 47465 49007 46541 36457 33813 45990
22687 45990 61163 68900 61011 45807 18830 5979 7558 27337 48786 49547 45944 38138 23922
22674 23922 22697 21837 21585 26417 32817 27400 23590 10738 15544 35349 27657 36909 54952 68653
22660 68653 67475 57456 60939 66831 56193 47077 54437 47723 64392 81545 101379 91287 85424
22647 85424 88336 53885 24506 3419 10351 23416 18041 20437 47684 60284 57783 52891 60037
22634 60037 61432 53876 53595 68096 79985 79476 74782 63543 38863 -5653 -9856 4386 16223
22621 16223 16114 16843 30149 42384 47555 45381 27712 6855 -20477 -23730 -15763 76 302 -8973
22607 -8973 -20074 -12707 -12209 -1189 8233 15192 20776 13142 12263 16426 19048 24846 23735 20938 10897
22592 10897 -578 2117 2942 -1183 5109 9664 3960 1748 4334 13205 13396 9869 7791 3443 -7342
22577 -7342 -18239 -18438 -1216 14407 12724 4995 2191 2018 12126 20161 24620 40214 42499 37699
22563 37699 35537 38544 30847 38468 43396 44410 33840 30384 23168 32081 39630 32894 36608 30502
22549 30502 35146 53780 55239 71077 74313 68767 52961 52754 53356 40249 34702 40657 40158 24521
22535 24521 15884 5006 11420 9247 8968 25306 42031 39860 34306 17415 11043 10746 21804 40544
22521 40544 44455 44337 21944 8676 857 -3864 18691 32500 36829 37289 25743 26125 28934 21370
22507 21370 21539 23339 21993 18635 8913 5525 -1861 15475 48562 101510 142173 186537 223095
22494 223095 205975 162742 128461 95481 84383 68048 55460 44779 25368 32001 38025 37226
22482 37226 20877 13571 10061 174 4491 12456 21486 34469 43703 41240 31373 27068 36642 43433
22468 43433 52633 55048 57997 48344 47347 51583 50203 35424 49323 59897 59461 53649 39342 34106
22454 34106 23180 21112 27357 46342 58735 71979 93765 98991 105176 135294 181298 211861
22442 211861 237135 264363 269844 266120 242927 217366 184351 154635 144044 126452 109704 100519
22430 100519 88713 94619 100315 90612 91389 93008 92422 98534 106852 109126 103228 100801 101325 93180 93523
22415 93523 90425 98090 103873 102720 91549 82924 67525 59102 61814 57727 54190 46915 51821 54200
22401 54200 48265 66485 81085 72899 67852 71380 68875 59184 60951 69463 71191 74120 59274 41349
22387 41349 51670 45803 34973 38909 78555 120581 134251 155393 170257 183779 190557 175132
22375 175132 137056 101095 88222 101560 131653 143010 123096 122224 116523 91782 74311 69046
22363 69046 80884 86338 95222 89426 67561 66536 80190 108166 128668 129376 124392 119779 106847
22350 106847 114843 146505 174778 188378 196434 189100 169791 154092 145892 107615 69243 65630
22338 65630 74426 109104 122259 121579 135198 139685 131543 130920 137757 145892 139642 143289 132989 115415
22324 115415 121864 139587 151551 132207 112455 101831 127896 184995 230057 286734 274853 195672
22312 195672 296088 349718 274373 230449 221382 223162 210977 196479 205874 224702 246579 279745
22300 279745 309344 353982 404815 478337 585911 749320 1003589 1422527 1939417 2364130
22290 2364130 2768650 2854463 2170678 1478733 1122172 953147 850065 771123 736044 715825
22280 715825 691952 662218 619720 590917 549511 506104 484011 487837 481907 481862 493150 495811 486412
22267 486412 468975 441556 416418 434374 490973 553132 566275 553330 567097 559453 522098 508218
22255 508218 514529 534866 577040 618237 642106 618450 599542 586288 565333 561592 574953 598062
22243 598062 643317 719693 800628 858207 872788 875637 848731 824828 829327 876566 932145 1013260
22231 1013260 1106847 1208961 1288863 1314398 1323521 1389638 1484763 1568765 1696045 1892350 2084342
22220 2084342 2270939 2447646 2567978 2668419 2817080 2930776 2993081 3107709 3237841 3342472
22210 3342472 3575420 3989724 4518178 5101276 5725709 6420203 7145384 7950523 8897850
22201 8897850 10103410 11562470 13305556 15662872 18992137 23825780 30752560 40744873
22193 40744873 57017889 86666507 140860360 227008283 322690779 398565628 469553587
22186 469553587 451203902 311089568 192577959 130290255 98781466 81662935 71167378
22179 71167378 63105179 56069262 50119462 45255973 41281362 38136536 35599548 33656494
22171 33656494 32430617 31750685 31341557 30998153 30404682 29257665 27628200 26000191 24605652
22162 24605652 23379661 22221774 21115593 20113162 19156047 18255230 17437125 16642929 15921851
22153 15921851 15328363 14841137 14366317 13882668 13424127 12969030 12554858 12165750 11741341
22144 11741341 11364465 11079246 10872662 10670387 10387598 10038225 9659025 9294650 8960513
22135 8960513 8659258 8388538 8128014 7878169 7642868 7435184 7231172 7009396 6792857
22126 6792857 6591314 6383004 6195700 6025130 5838822 5660554 5525459 5413966 5291626
22117 5291626 5142219 4992915 4837371 4709234 4629295 4571880 4513489 4457714 4373620 4242410
22107 4242410 4102858 3958113 3848546 3766385 3675756 3558919 3448775 3332116 3207116 3094239
22097 3094239 2989324 2892793 2798801 2735535 2693936 2638860 2602578 2584553 2570326 2596226 2735837
22086 2735837 3042491 3504885 3948641 4299770 4532668 4061664 3200566 2654925 2377361
22077 2377361 2211427 2092393 2006223 1938451 1874494 1817488 1771097 1739822 1704951 1693377 1675312
22066 1675312 1680988 1692198 1677349 1630800 1505340 1378224 1394414 1349105 1188678 1059484 991617
22055 991617 917981 829463 743462 668114 608211 544312 479887 442416 418285 411350 411217 416433
22043 416433 416723 407047 407539 416495 414886 421785 430608 430062 443757 438123 414126 375388 347807 323857
22029 323857 309913 293862 275327 298092 336517 339181 332516 323934 314140 312672 312528 301513 316013
22016 316013 328150 330312 325755 309559 301816 305516 315643 315783 291120 259233 248722 262372 285569
22003 285569 307302 311866 291940 259401 223844 188593 185637 192219 187976 187313 181601 199873 216699
21990 216699 239332 265084 282892 280989 266387 265052 263155 260486 241580 257196 275938 263793
21978 263793 226749 216078 224581 242378 258693 265281 278986 264467 240051 237843 248757 244021
21966 244021 225049 219400 212463 224575 233712 221461 216699 218740 209515 193151 182806 173155 187639
21953 187639 191264 189317 185769 188629 192525 196447 210569 223215 230684 243274 237609 222470 239170
21940 239170 251651 253322 254670 267007 275516 288937 300091 283421 283811 284010 267894 237088 215805
21927 215805 183060 146619 129525 121062 117398 114170 97403 97624 78400 54134 52017 65798 58812
21914 58812 48296 30289 39768 59229 62067 57389 50363 41241 20821 13934 15400 23768 26066
21901 26066 32484 33388 31663 28202 19731 21868 45824 62097 58289 55854 51579 35406 29696 13867
21887 13867 9021 24720 24301 -1056 -31869 -71915 -90587 -98568 -112215 -118576 -82364 -49254 -19652
21874 -19652 3601 10776 17996 39133 53758 48484 35034 33435 27503 9401 1699 7867 15261
21861 15261 17297 5718 -2521 4128 17051 21068 4517 4366 19857 23618 29373 36790 40630 26599
21847 26599 5367 12873 20287 16881 15467 23569 38635 40943 34588 20538 10746 1292 -17673
21834 -17673 -17146 1705 -798 -1551 9640 12996 18236 16456 6239 -1146 4739 3102 -4082 1555
21820 1555 20797 31750 36076 28223 10409 -155 96 6416 10793 17527 20895 15800 16967 20248
21806 20248 13228 24409 20164 20334 16389 16392 20264 15713 2114 2549 14903 34432 35780 19478
21792 19478 24347 36986 37013 25588 -4680 -182 17715 17478 21463 16086 5187 2427 -1652 3269
21778 3269 8473 15301 9318 -11774 -19037 -15589 -5440 10913 18338 26476 30495 21804 17685 26615
21764 26615 44109 53261 48739 45748 27096 8226 8149 14172 15588 25002 28881 27587 25728 25840
21750 25840 14535 7195 -14256 -33767 -42279 -35641 -32950 -35423 -39532 -43073 -34994 -30102 -18670
21737 -18670 -17753 -16128 -7921 7742 19645 33194 34274 19334 -1173 -35501 -62501 -91099 -99223
21724 -99223 -87735 -71654 -55274 -40043 -21563 -7945 -1901 -15508 -28040 -32964 -48486 -64597
21712 -64597 -52458 -35432 -31037 -23910 -13993 -1895 -5856 -18190 -22512 -20824 -31543 -45075 -41390
21699 -41390 -24358 -15370 -949 9108 -567 -17891 -19382 -18942 -14639 -8160 -4011 -9826 -5202 -1999
21685 -1999 -5431 -19078 -21835 -22404 -16892 -4281 -8919 -15659 -9439 -4083 2363 7550 10291 14953
21671 14953 20223 5307 7527 14715 11312 12570 10584 20941 19270 10336 -174 5472 8182 3814
21657 3814 14071 10078 3750 -3492 -9361 -9953 -13726 -7903 -279 1392 4985 6982 -2253 -5012 -8865
21642 -8865 -24886 -17721 -2170 11415 16374 10860 5424 14259 10479 10578 15357 23700 27875 26734
21628 26734 27694 29289 32188 30881 38650 54381 69717 71362 76072 106218 150532 223893 319473
21615 319473 448433 690591 1097466 1616372 2071900 2463056 2524056 1912154 1203022 786707
21605 786707 572217 466891 403917 371915 337192 302354 267928 239225 219014 209225 197034
21594 197034 170754 169515 159636 149819 149017 143836 139354 136246 129457 117911 103665 107223 99654 73939
21580 73939 59706 53061 60505 63150 53186 57295 42579 48151 47629 47933 53788 53693 62053 74678 77685
21565 77685 66722 58251 48047 43263 34615 37657 45582 47638 52271 59818 46870 20235 9056
21552 9056 6864 519 2103 2669 7308 1118 10368 19552 31087 29197 25936 16390 37 9266
21538 9266 14801 7408 10608 20169 24096 11661 11291 13286 11301 12721 18953 8829 -1331 -3296
21524 -3296 8261 12512 26187 28496 37917 40761 33310 8583 -9009 -45 11338 17110 10228
21511 10228 21018 27824 16906 3432 12799 5879 8839 7527 11497 9448 3366 7095 -5614
21498 -5614 -17814 -14098 194 4785 3885 7400 4050 7544 4754 -1157 -9848 -19356 -22949 -14628
21484 -14628 -9978 -151 3273 -8810 -15588 -5557 1538 5342 -5452 -18921 -26020 -39299 -30799
21471 -30799 -18750 -9861 -13201 -19416 -28347 -27485 -11802 -7442 -14960 -16779 -17755 -13397 -14290 983
21457 983 10351 -2473 -9206 -8444 -4687 -3479 597 13743 19209 15513 3464 -5259 928 -5655
21443 -5655 -27144 -51995 -49868 -37840 -48574 -29102 -14020 -11282 -12974 -16398 -17838 -7195 1701
21430 1701 -1173 -24243 -29192 -9173 3335 -8024 -16842 -12425 -20510 -30274 -27684 -23350 -17202 -1915
21416 -1915 -2655 -7692 -9534 -24715 -22011 -33711 -32899 -33012 -30369 -11929 -4338 -11320 -15089 -8234 -11949
21401 -11949 -14619 -10473 1672 1860 -5732 -8521 4285 7965 -3912 -7892 4228 16242 6918
21388 6918 8889 9445 -689 -16895 -29784 -21966 -14100 -8036 -7130 -10443 -14548 -15173 -23723 -38166
21374 -38166 -43990 -21561 -11819 -3420 279 -2400 842 -9560 -27263 -19425 -17651 -17157 -7902 4520
21360 4520 14847 14952 8466 -4806 -9002 -11707 -10095 -16707 -23892 -17004 -15387 -7797 -17947 -36869
21346 -36869 -27371 -32931 -37050 -32040 -29004 -22057 -12457 -15019 -8861 -9363 -5839 -1078 -22477 -26188
21332 -26188 -20066 -16990 -9852 -5208 -17714 -25913 -20157 -5613 -11817 -25150 -39597 -40724 -37858
21319 -37858 -19357 -17830 -15063 -2501 -15906 -33005 -38808 -27173 -12447 -14549 -30714 -29738 -25974
21306 -25974 -21505 -37445 -33551 -22107 -17972 -15558 -18197 -24029 -30725 -33710 -34469 -28837 -15686 -6801
21292 -6801 -5549 -13178 -20321 -13756 -18282 -24652 -30547 -39795 -21498 -11096 -596 -4914 -4953 -7356
21278 -7356 -4384 13524 21255 27047 49883 33724 7063 2498 -5671 -5353 5739 -9347 -12772
21265 -12772 -14522 -22842 -22605 -24074 -27246 -28942 -28845 -26102 -10495 -9103 -5600 -11225 -20438 -11282 5289
21250 5289 4635 4413 12825 8183 7271 -971 -3685 -1014 4559 14486 17962 9570 16076 10282 3842
21235 3842 -15732 -16799 -4278 -2968 4053 4633 16987 24158 23985 13182 6833 4104 -7350 -19650
21221 -19650 -30245 -19544 -16631 -25095 -16780 -9566 -12962 -18972 -6864 -3888 -10213 -2101 6459 -1994
21207 -1994 -13650 -25912 -33886 -36455 -21595 -18502 -23675 -29103 -34763 -35767 -24659 -22572 -16472 -8116
21193 -8116 -3139 4761 -160 -3131 3683 -3933 -357 -7094 -24914 -18185 -7996 -9062 -5364 -407
21179 -407 -1348 1379 10867 14278 1123 -1788 1003 -10849 -18802 -24603 -30801 -26182 -22615 -18016 -16176
21164 -16176 -29840 -36853 -17193 6930 -996 -9602 -4350 8045 10918 6270 -2317 -1691 6064 13763
21150 13763 3557 -12652 -22950 -28760 -33937 -17823 6794 9767 10274 9482 5068 3531 5696 10539
21136 10539 1974 -351 9789 10476 -5880 -27169 -25052 -7279 998 8879 3068 -2242 -6639 -10125
21122 -10125 -10000 -16263 -18104 -23079 -28559 -30639 -14236 -21058 -23837 -28457 -33728 -23956 -19740 -8343
21108 -8343 -907 -10230 -5154 2264 10243 -9452 -17927 -9113 -888 1102 -6893 -5085 -4154 -6996 -22307
21093 -22307 -26223 -17408 -10440 -3847 -6680 -8462 -7727 -7924 -11607 -17103 -7686 -14509 -16652 -17864 -24306
21078 -24306 -15946 -2840 734 -16078 -20027 -16674 566 1733 -13510 -23166 -14848 -15046 -15829 1537
21064 1537 4121 -3828 -3782 -11860 -3427 -2428 -15647 -23052 -36067 -14656 -477 -11724 -22907 -17622
21050 -17622 -23796 -22653 -19878 -16855 -9422 -1093 4703 831 -8023 -3707 -6649 -20775 -30718 -25985
21036 -25985 -8368 -7872 -14026 -11521 -10202 -11252 -15080 -20964 -27244 -27373 -26952 -27834 -30996 -18964 -12829
21021 -12829 -1337 -4323 -18251 -29091 -28191 -23456 -22892 -31252 -32353 -24872 -15300 -20711 -23522 -25015
21007 -25015 -20043 -22313 -28726 -24979 -13704 -15831 -16940 -14922 -15778 -12306 -7067 -9314 -17441 -17542 1370
20992 1370 11233 21147 13362 -2220 -8647 -10338 -8723 -4311 -8522 -8552 -14494 -14010 -9538 -11434 -16358
20977 -16358 -14361 -21029 -24267 -26459 -16904 -1784 -3330 -4061 -10569 -13021 -7494 -2093 1651 -5204
20963 -5204 -12836 -3214 3092 8724 16895 16618 7451 -2747 -17289 -16243 -29721 -34052 -36867 -32561
20949 -32561 -14983 -6943 2916 -5595 -5651 -6441 -290 -14159 -14017 -939 -2860 -3723 -8071 -21336 -18058
20934 -18058 -2590 6614 -7400 -14536 7991 8402 -3489 -2599 -9973 -17773 -29037 -12968 15959
20921 15959 29221 22168 2504 -19865 -26067 -28719 -28363 -21881 -17574 -13431 -10590 -15173 -23402 -19037
20907 -19037 -21898 -25091 -29098 -18997 -14113 -13002 -21625 -25405 -33455 -29369 -22027 -29294 -35306 -25960
20893 -25960 -14497 -15975 -17733 -5866 -6136 -10911 11055 -5053 -20180 -3467 5121 1462 12411
20880 12411 15830 -471 -5221 -9350 -11094 -6031 -8043 -19768 -23773 -24296 -17395 -18248 -30308 -38920
20866 -38920 -34201 -29945 -31292 -19216 -8034 -10148 -27593 -27894 -25276 -22793 -24300 -22912 -17271 -8319
20852 -8319 -7205 3020 850 -6319 -1759 -3824 524 1295 -6193 -18068 -18879 -26190 -24320 -24261 -16217
20837 -16217 -21063 -45068 -56004 -35704 -10033 710 -1665 -19472 -37733 -32468 -30437 -22841 -8981
20824 -8981 -15040 -14885 -13285 -11685 -14476 -20660 -6029 3621 12424 7620 -8751 -13234 -7202 -1645
20810 -1645 -2977 2719 5980 5628 -6155 -11713 -8095 -1162 6445 8347 2820 -4230 -5394 -9903 -20531
20795 -20531 -6758 -5953 2114 -5638 381 6062 -3097 -8023 -9759 -8035 -2466 8752 -6115 -18869
20781 -18869 -17474 -17231 -23828 -31539 -38817 -28594 -10152 -3032 -684 -9427 -24263 -27143 -19735 -23470
20767 -23470 -31726 -30678 -31246 -34623 -25661 -20556 -29124 -21703 -20312 -15356 -20456 -18739 -30213 -41714
20753 -41714 -46955 -29851 -20867 -19213 -13074 -9362 -13405 -6557 4123 17243 6525 11348 12261 -8304
20739 -8304 -20877 -9586 -4187 3586 13171 6344 -3646 -4472 -19732 -33234 -34493 -25076 -18627 -30170
20725 -30170 -19152 -11476 6115 22929 29371 27816 15959 1688 -8442 4064 20155 22146
20713 22146 15644 12656 19703 13332 -13140 -19149 -12630 -16861 -15865 -14420 -4305 3600 3974 -4285
20699 -4285 5916 10245 7268 -3704 -13331 -10994 -8197 -12089 -14706 -14311 -1996 17679 18772 10800
20685 10800 1123 -9651 -9737 -29286 -24539 -12864 -9983 -8332 -3705 -5888 -12100 -16641 -7404 5546
20671 5546 9686 5230 174 4354 2197 2017 -2778 -3751 -5713 1367 8536 5888 15527 6641 -14010
20656 -14010 -23829 -14459 -11423 -13820 -16520 -4507 9337 8151 -2568 -15616 -19201 -17033 -8686
20643 -8686 -20612 -18849 -14500 -15976 -17484 -17131 -16246 -15039 -28028 -19471 -13371 -18860 -23065 -32296 -33298
20628 -33298 -33705 -31182 -35921 -25777 -20645 -9448 -12880 -18452 -18391 -12934 -10755 -12399 -7619 -1759 -11612
20613 -11612 -7200 -5548 -9631 -9027 -4379 968 -2445 -5338 -9656 -12789 -10007 -681 -6607 -8756 -7985
20598 -7985 -19370 -27917 -16881 -12746 -15222 -6155 -1510 -623 8761 14999 5725 13594 15632 -4935
20584 -4935 -11260 -1071 -4056 -1393 -8759 -7424 -8248 -12388 -25449 -24354 -24707 -18826 -12488 -7505 7101
20569 7101 7090 -9809 -30684 -22899 -14797 -20877 -15961 -10227 -4556 -2064 -4522 -1542 -1451 -12768 -21780
20554 -21780 -11186 -10742 -20740 -27775 -24303 -26533 -19234 -30043 -36597 -25824 -36711 -31209 -20408
20541 -20408 -25553 -23289 -1000 2284 -2159 3591 9139 5718 -4034 -9245 -6698 -5644 -1564 -7961
20527 -7961 -8190 -8508 -1700 7798 905 -10225 -21415 -23024 -19697 -16092 -4479 -5484 -9510 -17517
20513 -17517 -21013 -25696 -24435 -26394 -22266 -20173 -21035 -9199 5382 11608 16073 21541 4806 -570
20499 -570 -3567 -10218 -4516 1036 618 -2612 -9761 -8107 -4756 -1259 -18948 -31491 -22717 -8163
20485 -8163 -977 -7082 -1912 7927 10093 4681 -6847 -2731 6132 16175 -244 -15187 -13526 -8871
20471 -8871 -5224 1794 -4842 -5674 -9056 -18178 -9554 -5983 3248 -1148 -5732 -3438 844 2312 -8004
20456 -8004 -17805 -9264 -3143 -1176 -12025 -8478 4769 3078 -10266 -6876 -1738 19780 24955 9371
20442 9371 7218 5444 8110 5724 5540 -1263 -12018 -7757 -3173 -2125 -1037 10564 11122 3594 1318
20427 1318 7204 13366 8398 -9210 -10018 -3490 7358 -4507 -20104 -21101 -16680 -764 11051 2615
20413 2615 3502 1872 2270 587 -7426 -10441 -6690 3753 3121 353 -5649 -10141 -20039 -25633 -29905
20398 -29905 -17432 -13443 -12040 -1561 -7932 -20115 -10010 -11244 -25117 -27503 -34782 -16770 -831
20385 -831 -7001 -1401 -1577 -1246 -15230 -20263 -17022 -12936 -12193 -17965 -14901 -6916 -14377 -8240 12724
20370 12724 19796 9635 -5439 -11226 -19639 -13464 -15890 -6550 -2367 -12663 -11449 -15557 -29993
20357 -29993 -20658 -6090 -12215 -6882 -2123 -10287 -20525 -5291 -5090 -15122 -17731 -26366 -23278 -2111
20343 -2111 26780 33080 7396 -72 4517 -18 3676 6259 8832 4267 -4284 -17859 -30941 -40389
20329 -40389 -35021 -19167 -18478 -16197 -17669 -7812 1605 2254 -10569 -16062 -10160 -18070 -12963 5780
20315 5780 -95 4219 9169 7859 1888 -6498 -11286 -21304 -21376 -12084 -2512 -7687 -21270 -29965 -9953
20300 -9953 1438 2258 1341 7066 3533 -4756 -13330 -3246 -1108 -3449 -8723 3883 5582 -9261
20286 -9261 -23129 -20681 -13338 1265 7451 7209 11402 7914 931 6871 8388 6252 13465 22405
20272 22405 22611 16325 16588 22059 5249 -7529 -5017 9493 19049 18161 17290 11936 7937 6354 10153
20257 10153 3273 -3824 -12235 -19906 -10817 3195 -7430 -2213 6714 4869 2365 -5593 -14873 -13537
20243 -13537 -10033 -21419 -24618 -23380 -1869 -5493 -22811 -23343 -25588 -22331 -16974 -3878 18481
20230 18481 18163 10159 7885 -648 -10737 -1752 1174 -709 -11946 -16837 -7206 -2840 -5653 -14864
20216 -14864 -14674 -23251 -27294 -22252 -15016 -13749 -16927 -13116 -15067 -10505 7110 14042 17139 19401
20202 19401 11844 1418 -6792 -6774 -14499 -5591 -5013 -12234 -25001 -13743 15857 18187 8200 2007
20188 2007 -360 -13552 -10444 -13004 -16239 -12242 -1797 -3534 2872 6907 5944 -5934 -7847 3149
20174 3149 3126 11191 12487 8282 6463 8043 3507 -15958 -21583 -12368 -664 4371 1085 -5725 -9579
20159 -9579 -3857 -6481 -11622 -4833 -5230 4219 11006 15561 748 -8341 -14847 -11028 -12473 -10661 -6914
20144 -6914 -14015 -22505 -16979 -8170 -6936 -7977 -2937 -471 3785 -1584 -9119 -1861 7636 17034 16680
20129 16680 16944 9315 424 5069 -6383 -1695 17204 32111 47143 36851 16023 99 -6543
20116 -6543 -1742 -8715 -3211 3838 8025 11204 23339 24855 13404 5611 3707 190 -11787 -15314
20102 -15314 -15558 -24302 -35464 -16713 -336 2703 3207 -1492 -9005 -10141 1569 9985 14597 9120
20088 9120 11194 9508 16102 4447 5198 15209 10071 9958 13518 4219 10059 18919 11667 -9472
20074 -9472 -6953 -17084 -23730 -12491 -8840 -8166 -10531 -16712 -11372 -6143 -1675 2744 1730 -7907
20060 -7907 -6540 -476 8849 21902 20705 -3411 -18100 -8529 3024 2973 -12279 -13010 -9390 538
20046 538 7656 -1237 -6535 -26141 -32231 -29802 -5031 8226 -6799 -16098 -22289 -14959 -18930 -15624
20032 -15624 -13877 -13641 -5929 -12754 -29126 -25537 -12497 -1990 3830 -10556 -4724 -2327 -4435 -6829
20018 -6829 -8987 -9278 -18871 -10423 -1237 10229 7388 5871 11876 -2509 -1275 -334 -105 -10004 -17891
20003 -17891 -15702 -8221 3059 -439 -5827 -12210 -23637 -16478 7877 7698 -3360 -2990 -7944 -19322
19989 -19322 -19827 -22904 -14326 -9855 -15100 -18569 1710 -5753 -10319 -11017 -4250 -10190 -810 10726
19975 10726 19706 15900 -1405 7555 12768 5143 3588 2998 2895 -3685 10521 22171 2764 -18571
19961 -18571 -19177 -14780 -15066 -9784 -4459 6992 5719 -5603 -4738 -16785 -15832 4120 2328 7239
19947 7239 2966 496 -658 2612 1746 -4918 -6603 4544 -6831 -10989 -1753 -2297 -8995 5856
19933 5856 19436 9417 6799 2261 5844 12231 6144 19929 14115 14140 10393 -12682 -20944 -8221
19919 -8221 -867 2634 16334 17204 7098 6453 421 -6209 -4935 -2113 -1347 -9386 -16040 -10219 3038
19904 3038 1973 1837 4700 9884 981 504 2747 4972 11517 23096 26413 10526 -6277 -17686
19890 -17686 -18557 -7949 -2642 5646 -412 2541 12213 24946 26690 6364 7679 10947 1548 -9747
19876 -9747 -18290 -27010 -29635 -24423 -20058 -11959 -2066 2239 -11005 -11644 580 1968 23 17231
19862 17231 25228 34422 28739 16370 10960 8626 12573 20490 20724 12146 5748 -150 -6717 -798
19848 -798 11045 10371 -346 -6071 -3084 8047 3184 4667 13565 15419 11157 19132 32177 40731
19834 40731 34334 16646 9281 -372 -9114 -6108 2319 16032 10348 20539 26736 19936 16566 11670
19820 11670 13154 20059 22063 13539 2267 -4685 -10539 904 6337 5111 11471 12198 7425 12498
19806 12498 17143 16848 25214 21211 16291 -5241 -13213 -9508 9993 11068 -1106 -3652 -11992 -14393
19792 -14393 -17453 -16117 -2572 19706 24203 20509 13494 21007 32575 20505 17396 35819 35649
19779 35649 13621 14458 4804 11007 16910 20784 18986 13366 -614 1286 1511 -8021 -5881 -1655
19765 -1655 5864 11561 10261 2435 -3528 -6997 -7760 -3496 897 7944 2049 -21400 -12119 -9844 -7149
19750 -7149 8660 15116 25203 19616 13921 5976 3030 -4075 -2191 6322 10183 11928 13676 2893
19736 2893 -5039 3011 10378 10110 -9368 -17745 -11216 -9425 -7535 6393 3959 -1614 17014 33484
19722 33484 27337 16157 12481 10147 485 4243 1903 -6566 -6296 12549 20225 28641 27114 11286
19708 11286 1825 4193 8424 10271 15070 19885 22260 12207 8743 8397 19983 7240 -5666 -14699
19694 -14699 -10937 -7355 3744 8418 4374 5332 5697 20350 22853 14614 21857 24874 25323 21991 22265
19679 22265 18947 11778 24729 36579 39413 30848 24844 31724 40288 30911 9201 -771 -6661 -18398
19665 -18398 -20547 -7159 24492 29824 19372 17440 24657 21644 33545 42997 45403 43054 41847
19652 41847 40268 20218 2820 3187 7113 1116 6140 4878 21567 32595 16717 14855 19478
19639 19478 26684 20824 11034 12843 7513 11924 12619 9717 18976 35732 41270 39655 32509 19375
19625 19375 7638 8717 11176 20437 17404 25537 30007 24196 22905 15024 13441 17236 26596 28960
19611 28960 19589 17383 20170 22689 29892 31013 37845 35607 30564 25314 22992 22380 24921 10693
19597 10693 11108 19284 29834 24929 20486 21098 14899 18578 34590 32008 23063 19377 34638 27547
19583 27547 25176 30214 15399 3552 10379 26267 34212 41719 42687 29530 23438 17977 24295 27690
19569 27690 25530 25145 15500 11180 14258 19420 15346 15482 13282 25935 30108 25946 32291 38929 44593
19554 44593 55086 49674 42687 33811 26720 32466 36315 33889 38527 35163 20213 33906 46061
19541 46061 37720 40254 46684 41798 52090 52978 56688 58672 53240 42711 36088 33215 31125 29055
19527 29055 25322 27868 32152 35802 31521 31656 38489 37175 38343 40860 36460 37306 42590 52637 57285
19512 57285 55688 53262 56164 58883 42716 29114 30193 34751 38075 37129 38462 28796 24491 31658
19498 31658 35537 29122 16790 22806 33443 42855 36536 40681 50296 44694 42553 39695 43196 27471
19484 27471 16372 26293 34071 39411 41035 44705 48364 42221 41431 44516 45460 47480 46779 41728 22280
19469 22280 11746 25958 40873 46468 37351 30167 19554 20527 34634 36819 55563 71549 71437
19456 71437 49909 36132 29373 48918 46596 45343 46506 43193 53629 50353 35060 30760 30463
19443 30463 31036 22534 42488 56379 50744 47478 35737 23858 31985 53570 66496 52843 52756
19430 52756 49735 46038 51583 48451 38101 35066 31577 29606 36546 54870 52902 37277 27996 27603
19416 27603 37001 46600 39755 28772 31740 32510 27403 37192 46959 42127 46227 51217 61018 61647 81705
19401 81705 89851 88770 87267 92515 90447 80014 66572 62679 62775 73467 85692 101086 103931 132081
19387 132081 182615 230889 291134 343869 387517 419021 428339 439318 470735 535049 605862 598863
19375 598863 565810 546343 505962 468322 449993 450463 433308 368287 291834 243579 221479 206286
19363 206286 193308 179394 169878 159025 164090 161489 165554 163491 158813 153238 139599 132089 128969
19350 128969 127025 122569 113544 126539 147122 144370 136282 136116 144863 152842 170007 181524 198105
19337 198105 233276 279202 340715 408137 474822 525391 522922 529940 563955 609659 648910 650186
19325 650186 645292 676349 674361 627030 595205 586957 543487 443519 360795 306532 275280 255492
19313 255492 234447 222474 211923 188041 164207 159072 167244 162153 165680 179416 169726 161466 151141
19300 151141 131852 121791 118901 117703 128983 144413 148643 127716 130361 133511 131137 130865 147698
19287 147698 156896 162885 172377 181008 173914 172470 184851 191832 189598 181530 163916 151309 152194 153261
19273 153261 144019 150526 148958 129612 139268 139536 127004 113697 104024 102463 114445 126400 121473
19260 121473 117037 116691 128268 125215 133828 124358 120438 111676 111722 117035 123141 131736 125307 129349 140547
19245 140547 137364 131521 122563 132066 128139 115290 118257 113402 115570 124221 109863 98174 106947
19232 106947 112245 95414 98027 105698 102602 118111 125537 119217 121390 125583 122948 132867 128729 117684
19218 117684 125159 127842 111319 116003 126008 132018 128214 122367 109597 101278 102324 102156 103263 101118
19204 101118 115177 111159 106594 104206 116747 118018 120278 118145 118646 110294 118130 134148 138271 125232
19190 125232 110733 121033 122263 121154 117865 104983 124535 127988 124397 134484 152355 154387 138088
19177 138088 141426 150191 153319 149733 178386 182276 174402 171612 174518 171793 187918 209050 203288
19164 203288 191677 195954 203451 211940 211872 214960 211800 208176 229191 228561 227140 231421 247663 256947
19150 256947 281827 329108 390310 444042 473907 503848 576135 633175 679219 711289 690467
19139 690467 653941 656341 683847 709590 683087 618010 556944 512688 481094 484938 475219 437802
19127 437802 414255 403177 410594 423558 441888 477339 520474 580802 673758 864441 1106951
19116 1106951 1353342 1574673 1714222 1660722 1528627 1520996 1627284 1734210 1745335 1532059
19106 1532059 1199579 947573 800415 703414 640187 610671 594915 586663 598793 637245 682630
19095 682630 711905 750429 779817 791086 813141 860370 921689 963139 961050 932191 902913 916915
19083 916915 940766 931398 872838 778039 701176 657289 635145 605360 553833 508000 475814 462488
19071 462488 445719 435501 437930 438559 427989 409027 409320 429855 440344 445264 439972 433661 423232
19058 423232 408543 406856 396237 380025 364068 361140 362173 366537 364472 370136 366515 344544 337940
19045 337940 330019 343760 343129 333751 337941 341431 350531 371585 382497 394572 421108 469385 509988
19032 509988 544935 568653 557228 518813 497343 491228 510383 530443 553207 578221 567502 527219
19020 527219 473892 450347 456898 462857 459620 451890 445954 468898 490077 511661 535238 540019 530423
19007 530423 509049 488807 477968 453290 437226 442083 460610 483570 512532 548889 564235 564994
18995 564994 564076 559018 535717 516406 529711 550519 602772 674646 715556 768382 806000 794007
18983 794007 758795 763951 826528 917901 991313 1038367 1041848 989241 926822 893310 880416 873430
18971 873430 879016 867387 806735 737560 699583 676001 683637 689950 699332 737012 754415 745092
18959 745092 732066 696803 657076 636607 643609 651047 649732 661751 675925 701291 716529 729586
18947 729586 718839 690667 659968 651566 683385 719974 740046 756361 774121 810388 847798 893969
18935 893969 954634 1011776 1036618 1027413 1002987 1010785 1045000 1101454 1149383 1168110 1166645 1135792
18923 1135792 1080356 1022626 995901 982664 952606 925587 913722 931672 945546 966976 973816
18912 973816 984999 998627 1012730 1021918 1041816 1088985 1119348 1161351 1208847 1241162 1266881 1306493
18900 1306493 1388030 1517716 1678152 1846412 2025645 2210840 2315842 2354301 2419920 2580394
18890 2580394 2802317 3003003 3118265 3238322 3418873 3574755 3740257 3995265 4350878
18881 4350878 4707736 5067903 5590377 6355786 7411411 8832940 10907438 14194691 19556938
18872 19556938 27779671 38287704 49200452 60203210 68420361 69675802 69866538 74905791
18864 74905791 85048831 94922750 95303028 91224974 90231906 86402041 79717248 76513525
18856 76513525 76845862 76919104 67865906 51682554 38914138 31511864 27257963 24577531
18848 24577531 22656759 21160675 20016029 19166325 18470034 17831885 17304385 16871623 16522364
18839 16522364 16214257 15922677 15695785 15495176 15236777 14992279 14797636 14667553 14591391
18830 14591391 14597433 14837544 15388598 16234579 17526174 19618885 23138060 29062968 38230984
18821 38230984 50090643 62566869 75211984 85232621 87455745 87416439 92242796 102658812
18813 102658812 112299860 111866061 107560555 108552370 107559910 100494400 95311180 94249718
18805 94249718 92631742 79767336 60533782 46580833 38470434 33579014 30314180 27842828
18797 27842828 25836277 24230152 22952436 21891931 20961084 20089845 19233338 18455091 17781666
18788 17781666 17211276 16712599 16153902 15534042 14919341 14327728 13716913 13132122 12623781
18779 12623781 12164281 11669988 11097436 10525825 10055311 9689138 9349511 9025456 8721484
18770 8721484 8437353 8171819 7917506 7684171 7479949 7279874 7085136 6905814 6746051
18761 6746051 6563048 6361626 6160025 5974045 5797527 5621221 5456795 5312045 5175849
18752 5175849 5044062 4916418 4821032 4741734 4700342 4664713 4624959 4577091 4537507 4419040 4277236
18741 4277236 4165734 4077437 4014402 3966624 3938078 3855440 3693065 3525859 3413594 3316062
18731 3316062 3209361 3117799 3051036 2984581 2886482 2778230 2667191 2578700 2522682 2475072 2419562
18720 2419562 2371371 2328659 2285835 2221434 2176663 2142871 2102285 2061841 2025362 1999378 1959096
18709 1959096 1930711 1924741 1918125 1907302 1932935 1978829 2029909 2086352 2115924 2094228 2045172 2027975
18697 2027975 2074356 2166688 2243220 2293200 2254426 2125043 2004282 1900577 1839501 1802998 1777240
18686 1777240 1728517 1650252 1597375 1590873 1574476 1546870 1488503 1444307 1470741 1480944 1456639
18675 1456639 1441079 1420320 1392996 1399713 1412137 1417797 1425673 1448769 1465540 1471043 1488266 1524131
18663 1524131 1563506 1621518 1655055 1676796 1706381 1763331 1843322 1909684 2003942 2094002 2204082
18652 2204082 2325605 2413424 2444348 2496903 2637174 2839642 3031077 3205176 3380756 3527665
18642 3527665 3672077 3873008 4133405 4477997 4916571 5539816 6470203 7893710 10144077
18633 10144077 13394469 17030719 20756197 24848431 27606418 29876617 34492630 41082835
18625 41082835 48772783 54076235 54507321 53915194 53452445 54835851 58764739 60619947
18617 60619947 59103150 54876573 47959961 42028234 39028130 37946379 36626615 31494980
18609 31494980 25174390 20930251 18398544 16807213 15705927 14880920 14222489 13690375
18601 13690375 13242205 12900460 12664594 12500138 12366076 12251122 12190284 12210848 12273106 12359245
18591 12359245 12498495 12685028 13006575 13486056 14099294 14954159 16127099 17612558 19643003
18582 19643003 22699266 27447578 34463893 42950875 51691673 61524764 69620928 75283097
18574 75283097 85445254 100488913 117954286 132692184 136290456 133226958 131526877
18567 131526877 135094174 145573234 151997817 148286731 142477421 134392779 128171318 129855204
18559 129855204 140386533 157450816 178813156 214748896 259960114 303810915 340688132
18552 340688132 327989919 270509566 234251170 229737869 237918354 246389495 226518230
18545 226518230 175117709 129999397 103896748 89273099 79970100 72911664 66848069
18538 66848069 61860814 58119409 55392766 53386936 51662321 49897359 48128423 46383155
18530 46383155 44789388 43605529 42870815 42390486 42070493 41838155 41825159 42593128 45074928
18521 45074928 50346727 59545436 72138742 84461543 95387950 100936856 90784814
18514 90784814 74403609 65774133 66507620 74285428 84232358 92942080 99035664 91475811
18506 91475811 71502756 54954355 45173344 39551272 36158952 33897728 32123407 30608732
18498 30608732 29282245 28032297 26846705 25813882 24988962 24428136 24108000 23906009 23719317
18489 23719317 23413219 22896368 22272090 21796921 21538085 21544537 21817755 22397591 23395482 25014879
18479 25014879 27619961 31982823 39383483 51363481 67703463 83956254 97780178
18472 97780178 107059800 99273587 80008664 67976337 67583989 77070237 92094596 106331812
18464 106331812 118211685 119142652 98628587 73236937 57337588 49990606 48053137
18457 48053137 48751807 49825361 50860228 48454807 40980981 33974422 29496781 26669455
18449 26669455 24804972 23533117 22550685 21685474 20908700 20172634 19431680 18729690 18146594
18440 18146594 17705419 17370939 17036180 16562435 15923900 15298083 14822570 14528336 14393605
18431 14393605 14356155 14414345 14557433 14772503 15238651 16221779 18014800 21206032 26748441
18422 26748441 34793077 43193820 50514452 55952234 52452830 41969934 35002587 34003993
18414 34003993 37654866 43297374 48346445 52468278 50019344 38859257 28511527 22413070
18406 22413070 18981223 16958343 15703816 14843315 14168450 13547914 12954316 12356557 11638909
18397 11638909 10947115 10402026 9991680 9667939 9344604 9032371 8734461 8457136 8227365
18388 8227365 8021105 7832529 7661278 7486308 7214638 6851878 6502529 6217119 6018805
18379 6018805 5858383 5715565 5590029 5446605 5246910 5024383 4812699 4653147 4521081
18370 4521081 4390819 4274003 4146769 4020068 3906465 3811853 3723567 3649436 3584060 3501440
18360 3501440 3398021 3311190 3249393 3204296 3168613 3161600 3174302 3155359 3125993 3094179 3055303
18349 3055303 3024256 3012282 3014478 3035114 3054711 3065802 3077384 3029429 2937326 2868113 2820336
18338 2820336 2793658 2788396 2742048 2571596 2375126 2224115 2093714 2007860 1953635 1887565 1825565
18327 1825565 1786395 1757981 1710553 1660994 1615403 1575168 1559906 1541930 1512021 1511451 1502484 1478716
18315 1478716 1465754 1451470 1454441 1453818 1444781 1453514 1465994 1455036 1454613 1493318 1569108 1683450
18303 1683450 1806991 1927281 2007311 2034386 2036024 2078529 2142137 2184278 2139322 2044618 2025139
18292 2025139 2051373 2058739 2035273 1969150 1863729 1769811 1661254 1536724 1414952 1311742
18282 1311742 1264037 1264784 1266173 1244964 1229747 1228396 1238511 1242871 1258290 1287599 1328786 1388973
18270 1388973 1457234 1546902 1682586 1818326 1971109 2080930 2112379 2167798 2277260 2361361
18260 2361361 2437497 2582248 2725808 2797646 2828412 2837744 2837583 2905360 3055773 3299368 3608255
18249 3608255 3989537 4498367 5212620 6214928 7610870 9587046 12568339 17361089 25411310
18240 25411310 37690483 51844978 64219549 75467795 76175469 61471507 49570690
18233 49570690 48166537 54997386 64667299 73357206 80237929 73377386 53513026 37669579
18225 37669579 28729788 23778033 20922864 19098312 17728029 16606200 15696697 14924159
18217 14924159 14319051 13856346 13409093 13043449 12847280 12764618 12710797 12634332 12544066 12449673
18207 12449673 12265613 12066526 11928906 11881467 12039031 12557593 13498389 14909776 16987789
18198 16987789 20272721 25769567 34456402 45449991 56043312 66701703 73676969 71660624
18190 71660624 72459691 82182483 96516064 112157885 118974547 111329690 96442583 81682465
18182 81682465 76368977 77871870 81329909 84262154 75203587 56839007 43058951 35085925
18174 35085925 30392103 27476333 25391576 23691452 22275810 21172043 20312475 19596536
18166 19596536 18954027 18306060 17661099 17048716 16547321 16183354 15837264 15448214 15045574
18157 15045574 14645834 14292870 13986651 13756022 13655127 13728017 14055589 14740264 15944868
18148 15944868 18039253 21798194 28089921 36466644 44485001 51763260 55891109 50250677
18140 50250677 41911125 39454018 42561187 47530721 52207272 55004761 49035044 36760179
18132 36760179 27363278 21945923 18751813 16730989 15351412 14308723 13466103 12746949
18124 12746949 12120267 11531828 11002624 10536298 10159414 9895463 9748302 9650929 9561311 9427259
18114 9427259 9172066 8862217 8598233 8466482 8497658 8710785 9223313 10402508 12728288
18105 12728288 16037970 18957886 21613688 22604721 17904209 12634802 9776200 8309979
18097 8309979 7469736 6952892 6575230 6229553 5922637 5661940 5461282 5336263 5269523 5236635
18087 5236635 5214129 5188951 5074406 4942038 4825199 4723380 4591346 4387016 4166696 3975095
18077 3975095 3808493 3674808 3576582 3463718 3334037 3233204 3128337 3024025 2969958 2931430
18067 2931430 2911063 2878834 2829755 2749324 2665735 2627426 2599667 2567731 2524689 2439792 2332428
18056 2332428 2234655 2185525 2136823 2089676 2066448 2026501 1969902 1921116 1837557 1726593 1651369
18045 1651369 1610827 1572188 1562952 1605328 1667091 1736523 1814441 1873899 1931165 1998050 2029971
18034 2029971 2021126 2001275 1956676 1920347 1929991 1948305 1911849 1803397 1684753 1578481 1482027
18023 1482027 1402726 1348133 1284666 1225092 1195637 1202323 1223290 1268976 1320848 1339510 1312634
18012 1312634 1272192 1211157 1146616 1123181 1157665 1222014 1281079 1331916 1374991 1326404 1183010
18001 1183010 1049187 979070 974700 1012472 1078775 1163657 1220482 1206671 1159253 1136253 1168615
17990 1168615 1285835 1504597 1777964 2043744 2293182 2412817 2304421 2180427 2136377 2120423
17980 2120423 2111777 2001504 1705868 1370944 1143029 1011297 941683 909057 881532 849636
17970 849636 819907 811608 819211 807354 787438 763506 732396 711662 735588 784742 826667 870156
17958 870156 909341 892235 832757 793557 821260 874731 935854 989217 994318 940958 871565 793064
17946 793064 758002 774839 798164 821521 818381 760557 668290 589443 562293 549757 536905 511742
17934 511742 480484 453995 443011 438550 413267 393010 388949 383111 372299 361095 344640 328243
17922 328243 317912 297244 283630 283017 296953 302898 303279 284725 269413 279368 281085 276111 287419
17909 287419 299712 323468 358489 396788 433688 415437 362151 326844 329856 352068 374427 391371
17897 391371 403676 384002 340548 293043 256832 247379 253657 243473 250453 245284 217114 197161
17885 197161 201214 209469 194696 175528 172864 166272 163189 152766 143804 144437 148419 137137 130552
17872 130552 123202 124597 111282 120451 125208 114087 113211 123657 134005 125523 126504 139941 144325
17859 144325 141190 143181 151056 152174 156396 164346 176541 170031 166763 166195 159905 153495 133312 114109
17845 114109 101149 90609 88705 91908 76699 72676 70537 76483 87091 71920 50722 44347 53518
17832 53518 69086 74962 58866 46631 47385 41303 48922 68181 75337 69300 62766 91235 96035
17819 96035 91021 91831 103039 90592 84748 93127 82106 83591 94001 96841 97067 112152 131043
17806 131043 142028 166288 178935 171827 164961 179183 186991 168935 153917 141980 121706 108575
17794 108575 95616 91521 89054 92168 90674 88098 90121 87720 77352 76118 73567 69227 63507 71642
17780 71642 74430 57951 46054 46591 48739 57509 52473 65034 82259 95216 96819 111519 133239
17767 133239 140443 143984 157458 176369 200501 212015 216055 201592 171279 157884 148744 145646
17755 145646 139926 128067 116108 115009 108371 99661 82254 81418 80035 72943 68721 70424 79581 76551
17741 76551 77771 79053 81927 89838 90228 90166 96691 101720 124078 146196 167379 187136 229682 318850
17727 318850 389370 445006 476035 456377 432840 440766 469691 512091 566492 624945 661431 638105
17715 638105 579414 514275 456581 411363 381106 350792 323671 295326 249050 218838 195461
17704 195461 170813 157766 147318 138983 152504 156594 137639 117789 106228 113168 128065 144721
17692 144721 158002 174886 181277 174457 178446 192355 229111 280465 320484 371911 436317 475308
17680 475308 505462 550052 616082 707889 793510 850677 843115 776356 712459 691329 701026 714412
17668 714412 725463 735764 698044 604346 537599 490065 452834 410089 371136 333137 319130
17657 319130 329220 354183 380275 414200 449185 479395 515992 566024 611942 657974 678789
17646 678789 693917 707555 702778 685676 665292 627216 574012 527830 503676 489827 491411 509001
17634 509001 549265 602535 658892 690763 660088 618668 592745 587451 581204 594304 611731 616561
17622 616561 580346 535243 507350 486609 478485 464689 428812 374472 334154 315624 314544 318339
17610 318339 315496 329864 335143 338793 344007 340692 335203 329600 327484 344794 382354 416937 454449
17597 454449 506600 546244 576966 599234 606925 610437 584716 563050 530861 499769 477147 452482
17585 452482 413518 375054 337349 316010 282779 249407 236273 222683 209265 205834 190226 173610
17573 173610 170775 170000 167979 164817 175492 189590 192293 180818 170736 177169 194492 217882 243792
17560 243792 254728 269521 273047 269169 288683 300682 309281 329794 347881 346352 359880 383848
17548 383848 391849 381729 348440 310535 289501 290786 334268 421563 538235 646729 729962
17537 729962 779247 776991 711391 645088 626232 647795 681017 675148 642472 619065 585708 539793
17525 539793 461259 396141 364629 365915 389885 437841 496088 528946 514169 474379 450207 454409
17513 454409 473155 486699 503597 518193 539128 560433 621157 674941 694843 661666 630750
17502 630750 627518 629602 618971 588672 562393 549318 565410 582181 586435 568589 549643 530801
17490 530801 533760 549528 561904 595732 657481 724504 804341 867591 871855 837527 814204 846823
17478 846823 909529 1008985 1077106 1043799 964099 885214 873800 917861 990230 1045108 1055555
17467 1055555 1037260 1021945 974783 858240 702395 608052 558884 545863 538615 527122 504134
17456 504134 496861 496296 473928 424264 386562 346603 329394 325479 317552 319015 335988 367946 391585
17443 391585 400427 389152 343688 313193 312142 320523 338621 361712 390620 366845 306084 251655
17431 251655 221764 209151 213129 216169 212815 211770 202008 192339 176477 148605 136966 138183 126811
17418 126811 123114 129952 124598 124983 117322 118342 121260 120751 120518 146819 168866 170801 147647 131392
17404 131392 118816 122991 128540 121080 108424 107844 108962 97968 90808 93397 91009 87730 89430 95673
17390 95673 82906 67296 70329 60502 58175 50369 50019 56322 81814 85952 68316 73717 72314 71608
17376 71608 79350 75145 67692 62603 61989 57220 44824 47816 62656 55349 41715 53171 59246 48924
17362 48924 39233 33586 35363 26849 17207 15206 6937 9877 25618 31120 22294 34830 38570 41816
17348 41816 46664 42271 32053 32397 27104 15873 18315 26773 23782 29402 35756 32801 47297 29693
17334 29693 11512 10307 21398 34061 29032 20820 27481 29682 25799 27005 21638 14025 15587 1064
17320 1064 387 1677 3388 5416 8890 12517 6344 470 13354 33082 34211 33412 24007 18596 21296
17305 21296 19321 16837 20834 18060 29950 50360 60988 68917 92250 118146 161570 227392 295029
17292 295029 357675 414557 412394 356939 336727 360893 388719 433153 438956 364269 300474 282203
17280 282203 294366 336594 387842 443648 448109 391243 355707 358150 373634 404218 410949 325047
17268 325047 237882 202925 189778 152951 132717 122211 115876 108813 98070 83883 86039 90059
17256 90059 85388 77561 72610 76659 76258 72262 65479 55065 43213 55926 67960 63101 63571 64908
17242 64908 53979 61552 52511 43597 33972 34603 46971 47537 38465 44414 38410 39759 34125 18329
17228 18329 12718 8660 15283 39276 49464 61416 60373 53868 56315 58210 59163 55230 55083 56089
17214 56089 46296 32723 30533 33749 24279 9435 8181 13493 25006 23405 19250 31333 31002 23601
17200 23601 31028 27812 28592 13655 12200 15804 6856 2874 -2267 -6563 1515 14282 20380 9958
17186 9958 6114 16514 30418 16004 3335 -21 2241 -946 -3270 2280 17377 25293 12641
17173 12641 -9027 -8634 -10118 2215 3322 1148 8412 12895 13334 24237 11467 -2344 -3412 5782
17159 5782 6094 -9517 -13314 -17944 -14790 -11782 -3189 -5855 523 -6118 -11603 -8772 -81 4763 827
17144 827 -1449 3726 -12666 -20151 -11737 748 4154 11353 22512 23789 21094 20952 30885 45837
17130 45837 43938 25358 16224 20010 30291 26914 21832 29785 31110 15368 9464 18436 9385 -77
17116 -77 7949 16134 27997 17582 15665 19565 9256 1450 6051 -3431 -3617 -3794 -10356 -6908 2039
17101 2039 4668 -317 -12277 -23583 -24834 -6636 1781 7319 21015 24790 30747 14517 -11403
17088 -11403 -9933 -226 435 2583 2001 -7390 -2698 5025 8156 7281 6363 13414 31184 20209 13544
17073 13544 13883 22836 21548 7646 -793 3338 8267 20578 28981 30195 17742 11968 2680 14932
17059 14932 8854 -1079 6183 9945 11973 683 -5012 -7371 -19339 -9351 12886 26303 17625
17046 17625 14001 18548 28050 28929 31143 19888 15074 14431 -1185 -2037 -5825 -16724 -3507 6361
17032 6361 1787 7116 6798 11006 1067 -4769 -10937 -9582 -12623 -1799 8240 -392 -10752 -6259
17018 -6259 -10383 -4133 1518 91 -12471 -18009 -25014 -18775 1293 11699 19410 29403 18403 1256
17004 1256 -7828 -306 -5832 -5556 14782 19394 20010 23640 24840 25891 26348 16925 -4746 -12607 -6834
16989 -6834 -9947 -18299 -15105 -12030 -6245 -918 -12591 -11363 -4991 8152 10561 12073 20475 16292
16975 16292 1387 18181 12349 8798 3666 -1202 -7874 -8124 -11872 -23512 -23041 -8910 -12858 -16383
16961 -16383 -18688 -26312 -26039 -17261 -15444 -14724 -8529 -2274 -666 9455 6372 9732 15748 11592 -66
16946 -66 2831 3500 -1443 -12210 -14369 -12374 -9001 -9828 -5252 -16983 -22578 -16517 -14340 -9570 -8252
16931 -8252 -6815 -9541 4644 16711 3431 -5138 -5736 -18600 -16181 -10372 -17983 -24574 -10854 -4453
16917 -4453 -9306 -3639 -6798 3907 9840 -7358 -13880 -6790 -1964 -6285 4243 9353 2393 1732
16903 1732 5727 117 12344 20330 10390 5618 5583 2624 6414 4591 5090 13275 5894 2309 8545
16888 8545 2792 5754 8953 5084 8717 11048 3803 6761 4804 3310 3350 1192 -7007 -12843 -6296
16873 -6296 -11624 -12605 -12310 -14343 -11242 -11528 -18355 -19877 -18750 -6335 2073 690 4296 6715 5118
16858 5118 16976 22938 15038 -1300 -6232 -10632 -8528 10421 18590 5452 -752 6458 2706 8360
16844 8360 11952 15980 15712 19529 17461 7992 -5162 -7011 -22663 -36316 -31762 -27318 -24283 -8031
16830 -8031 -1126 2703 6446 9733 16967 6640 4726 64 1213 16788 1314 3022 14792 20416
16816 20416 11104 -8099 -21393 -17645 -3501 6613 1690 4829 8885 15718 10833 9031 20654
16803 20654 22774 20496 29946 29357 27798 20684 551 -8113 -1483 4991 5164 15088 22354 16441 10831
16788 10831 10766 -2404 -32801 -35627 -13700 -94 10720 777 -13250 -13401 -11997 -16664 -22333 -21211
16774 -21211 -10467 -569 1843 -7578 -10855 -6553 -6570 -16180 -11257 -26567 -37834 -29442 -21153 -13692
16760 -13692 -17237 -14391 -7840 -15920 -10203 -7283 7828 32068 47630 59970 69896 83573 102888
16747 102888 93247 80473 62191 41896 34543 47218 52152 38020 21353 19731 21584 19831 6730
16734 6730 8902 12583 31261 34669 14694 282 10710 13736 9813 -5078 -5802 8448 23588
16721 23588 9742 -3603 10336 11973 12801 20452 13552 9551 10405 15544 12057 13235 1428 9027
16707 9027 17117 22666 19050 12993 1226 -18718 -23976 -7827 7580 25988 21759 34605 40163
16694 40163 47698 50470 54877 63926 62879 80394 93387 90013 84277 68246 57949 41202 33092
16681 33092 16443 13816 22312 23076 24727 7809 -3451 -75 17378 20116 21354 22846 29247 14196
16667 14196 -1215 10112 7564 -2698 -4956 -274 -9339 -17870 -15039 -6948 -5729 -4020 -1101 -1788
16653 -1788 -2721 -10419 -17993 -4828 -4545 -6857 281 6275 -2585 2939 19125 26278 20593 25452 4108
16638 4108 -4223 1586 2413 18687 17219 14400 -7641 -11587 168 6955 13396 4392 -11106 -5683
16624 -5683 -1910 13631 4615 -10044 -5870 -2986 1811 12263 12162 5254 7162 -2464 -18415 -6259
16610 -6259 4954 11929 16265 17220 5899 7407 8400 2872 15293 17249 26993 31103 21287 14230
16596 14230 7065 11844 4604 16490 29495 30607 24843 13297 17402 13405 1555 -10814 -13013
16583 -13013 -8449 -9196 -6376 2669 1771 -6700 -10907 -5667 13338 7329 -6443 -4914 -12821 -3600
16569 -3600 -6130 -9861 1617 3644 7802 -10203 -20138 -18549 -19004 -231 12981 14824 14637 9495
16555 9495 1921 18666 25822 27603 21147 9388 -10518 -14987 -2950 -1158 -922 -1848 -2569 5709
16541 5709 13122 20006 29990 10027 -9081 -6022 7211 25645 39230 35380 9505 -992 -7779
16528 -7779 -4919 -882 -408 1192 -3141 165 2653 1264 11134 18986 20704 14644 28704 26699 14889
16513 14889 21684 37682 18879 13863 10290 6665 4606 -293 5031 15475 12571 -15279 -26905
16500 -26905 -6806 -5245 -11100 -13497 -19337 -12933 -5009 -11381 -303 11377 14409 13691 -609 -7338
16486 -7338 4151 3921 -19044 -31852 -27502 -17011 -10089 -10660 -6873 -13115 -29145 -27316 -28028 -29265
16472 -29265 -8271 -5189 -2785 5317 -3745 -7026 3032 10531 16108 10529 -5320 -10929 -7107 -10495
16458 -10495 -15858 -21979 -22865 -10068 -6701 -441 1055 -4135 -19302 -20540 -1342 3178 10367 10518
16444 10518 14752 10822 3261 -9424 -13093 -4261 -2812 6781 9032 -2526 -14245 -23103 -9533
16431 -9533 -682 3135 7779 4713 -1166 -7401 -9759 -5184 -5922 -19174 -12861 5207 14778 3132
16417 3132 -2234 -1296 2969 -2437 -5024 -2671 3356 -4124 -5607 4906 6874 11430 8721 4422 -8896
16402 -8896 -11139 7850 20321 15310 19298 31813 30300 13029 10242 6440 4262 8709 17670 6636
16388 6636 -7009 -3277 2633 2085 -947 1105 14138 24532 28525 20278 9712 9618 1446 -4754
16374 -4754 19438 35757 35718 22763 14845 18304 34878 33082 18638 11710 7949 1377 4079 6066
16360 6066 4772 1161 7287 11052 6235 -2656 -9604 1969 15090 16418 -1910 7282 28416 19079
16346 19079 10760 17305 18823 16296 20313 24047 26154 25593 25218 19866 17481 21063 33836 32297 24245
16331 24245 27365 24786 9484 7531 17062 30969 26509 9562 13847 22370 22820 30007 24943 15860
16317 15860 12851 16405 14123 -947 5090 26367 28874 14031 13400 11115 10304 17843 10425 16755
16303 16755 17912 27391 37495 29659 25506 14045 -321 -8240 6150 25973 29849 18994 12268
16290 12268 23779 15549 7132 -257 -10443 -5568 2122 3469 17220 20861 16232 12149 5316 3229
16276 3229 2765 -5255 773 21905 22724 18803 9921 -1954 -4670 -8588 4838 -1751 -10945 -10042 -5730
16261 -5730 -4892 -3368 6925 -2483 -7980 -334 4410 5459 -675 -2989 8063 14065 7713 22418
16247 22418 30587 21877 13580 16690 13866 -877 -8253 -2867 46 1552 8541 13573 15499 31883
16233 31883 41747 34574 29224 29892 23592 11959 11125 5458 4384 13668 24859 29367 60487 96807
16219 96807 144510 187038 228970 272017 242040 165406 112204 88330 74326 59373 41480 34380
16207 34380 26071 32276 22292 20337 25827 12009 6674 10428 10987 16154 29311 39078 45754 36362
16193 36362 37555 33706 25746 14863 5841 14480 18362 10970 773 3980 4486 2356 13832 16524
16179 16524 23863 26201 21778 26465 42729 43060 35539 26209 7356 -3335 -11970 -7681 -4962 -3610
16165 -3610 -10516 -14745 -19338 -9682 4081 11096 10318 12243 8429 -4794 1442 6588 14076 14619 19933
16150 19933 16243 8143 -1100 -15853 -18993 -5991 7341 8029 -2186 -12791 -6668 6412 2019
16137 2019 -2656 6118 -2421 -10500 2295 5865 6100 6841 9440 18116 7447 -10350 -13859 -7525
16123 -7525 508 2708 -2655 -1475 11224 17352 21078 10704 -4984 -6788 -11819 6446 12204 -13221
16109 -13221 -24399 -24089 -21830 -30698 -30746 -21576 -12945 -10643 6125 13812 6738 -2717 -1286 2474 6748
16094 6748 -1336 -8782 -10412 -16914 -7056 16582 4460 -1669 -1971 9718 25935 20516 14609 9150
16080 9150 15068 15515 1763 -1262 2818 -295 -2562 300 -8872 -20215 -3435 -12651 -4150 9545
16066 9545 6173 8710 10044 16159 23939 35554 25264 19748 15218 13952 11575 -1872 -14492 -13260
16052 -13260 -1750 3061 8283 8057 -9665 -14326 1814 18455 13928 5217 5764 6756 -12469 -16914
16038 -16914 -23846 -10462 5447 3831 -15374 -15726 -14822 -5146 -15647 -15145 -9063 -10028 -17895 -10881
16024 -10881 -2163 -1161 1278 -838 4865 -2541 -3315 -12999 -15396 -10289 3557 8075 -1510 -4666
16010 -4666 -8760 7711 21610 16904 14994 4704 -353 16261 12217 14184 14995 6671 6499 14273
15996 14273 21676 28439 25589 23776 7793 -2897 -13422 -16351 -4751 7952 6262 3672 -2025
15983 -2025 -1266 -4630 -15559 -14837 -5029 8103 18330 19264 9696 -3922 4835 18554 10013 2017
15969 2017 5162 -524 2565 16296 17562 18774 14496 9881 -1140 -9559 -10866 -10449 -7847 1893
15955 1893 13945 11752 -1871 -3715 1164 -2667 -140 16641 16978 12839 10747 17255 7427 1700
15941 1700 4095 5521 14472 7164 4159 4397 4509 8360 18127 16580 3473 1084 -2882 -1468 6382
15926 6382 15789 10330 3617 4481 -247 -522 -16484 -17241 -13280 -7594 2727 23776 37977 22507
15912 22507 11043 14179 7259 -1099 6477 7160 13666 5125 -8481 -21754 -6095 1220 8811 6556
15898 6556 4318 -2161 -18306 -31120 -38741 -24862 -5492 -11009 -11055 1974 11862 13630 26752 12581
15884 12581 -9172 -18527 -26286 -21181 -16650 -1990 -4625 -6003 -10955 -15799 2156 14568 11205
15871 11205 2091 -6196 -17482 -15579 -9192 -12139 -19121 -14782 -19918 -18721 -9397 353 8333 3574
15857 3574 -15047 -17694 -17394 -2769 1687 -5744 -18153 -27422 -24974 -13654 -19961 -5078 3938 -71
15843 -71 -8733 -9948 -5620 9063 22018 15034 -5181 -15745 -12690 -9814 -5341 -4908 -2028 18583
15829 18583 13628 -6536 -18283 -12256 -3749 -13077 -7950 284 -5033 -2744 -4238 -12017 -17047 -22595
15815 -22595 -17346 -9448 -21366 -28695 -34146 -30305 -30235 -28062 -21617 -21656 -20832 -12434 -16913 -15872 -23627
15800 -23627 -29109 -27658 -22745 -2096 5650 -2591 -9146 1781 -402 -6249 -7464 -3328 3949 10685
15786 10685 -147 -6309 -6524 -14089 -19451 -28431 -21649 -12711 1765 21032 28031 23949 13078 18017
15772 18017 17771 4421 -139 1891 -5394 -14752 -25917 -19417 -3202 11408 12107 11795 8704 3454
15758 3454 1438 6698 12751 4344 3615 -14092 -24246 -25453 -14079 -6677 5889 16004 9827 3470
15744 3470 1788 8536 9816 18739 17216 11618 8707 1054 -5445 -11964 -20997 -28306 -12555 4337
15730 4337 1771 -15430 -35244 -30536 -29616 -42686 -32145 -7322 5434 7468 1522 -6606 -5211
15717 -5211 5841 -9968 -25177 -14522 -6796 -4836 -75 -3578 -26996 -23878 -14700 -15246 -20668 -14597
15703 -14597 -8771 -5385 -13162 -8063 10554 8438 7924 17916 3366 -2979 -7034 -11982 -12249 1277
15689 1277 10253 14803 18907 19443 -70 -2052 -8457 -996 -8012 -12501 -8531 -315 -4091 -10625 -14067
15674 -14067 -5355 -1282 -4328 -4429 -4339 -5861 -848 3162 -84 5376 8400 15388 14290 1296 -18077
15659 -18077 -23149 -17662 -2439 13021 16854 19211 7303 -11967 -12179 -2871 12955 19275 12348
15646 12348 9794 19778 21388 14547 -3958 -585 9247 13682 12400 10291 8947 3000 5493 11634
15632 11634 -6405 -2014 -5309 -6612 -10990 -6501 2972 3898 17790 20964 8647 -152 -14082 -17676
15618 -17676 -13159 -5773 -13823 1611 193 -6316 -6003 -2701 9358 21942 23513 19109 7474 15727
15604 15727 16958 18223 29054 20622 15221 9308 3539 6170 3400 3168 -1414 -11474 -24173 -24290
15590 -24290 -17388 -6700 -204 -1040 -6440 3349 12654 13533 26290 29176 20461 10241 0 -6570
15576 -6570 -3554 -16599 -13438 -18330 -22617 -19457 -10044 1223 5670 -11979 -34789 -40625 -31247 -21851
15562 -21851 -12359 -14057 -19772 -13356 -11597 -24038 -26211 -28150 -7290 9278 18324 14571 -4819
15549 -4819 -86 1863 16276 9552 5534 11917 12916 3844 5186 18080 19071 20303 15972 11525 1733
15534 1733 961 -5066 -4046 620 5258 14356 22931 24775 17946 14547 24507 26151 21451 21212 15499
15519 15499 5177 5057 1589 4227 4658 4129 3349 687 6880 3193 2242 -6881 -2901 530 -1742
15504 -1742 -6707 -6472 748 13479 20495 13187 5306 5420 2055 8374 7224 -9765 -13178 -5598 -1092
15489 -1092 -2366 1711 8678 -91 -7001 -1853 -2291 -4551 8025 13992 6172 -8084 -16918 -27302
15475 -27302 -24998 -14444 -13973 -8837 -4339 -10596 -24250 -24670 -20552 -9595 -3926 -13529 -17626 -6064
15461 -6064 4329 11934 10227 3509 9798 11602 14364 16050 12997 9526 4359 9098 12254 12353 23661
15446 23661 37758 40808 42360 42457 23773 6511 -2553 2560 2452 6425 20652 26579 26919 28460
15432 28460 22836 22267 9710 5009 5086 7517 11689 -1007 -16551 -20274 -10413 -17513 -16961 -732
15418 -732 -2861 -14762 -16810 -26057 -20606 -13222 -11170 -5168 -9989 -3541 4669 -3177 -10254 -11971 -13975
15403 -13975 -2775 -7114 4448 7284 -6199 2434 2590 -4467 3863 15712 16638 7491 -2129 -12048
15389 -12048 -13018 1570 6134 97 -737 1061 -4064 -8415 -15069 -16194 -17731 -9423 -4133 -4555 -3745
15374 -3745 -8292 -13729 -31457 -29933 -31796 -36826 -34712 -24546 -14580 -9869 -17461 -29552 -25182 -23230
15360 -23230 -17524 -985 -12321 -23199 -27589 -24278 -15225 -15871 -12016 -13017 -7662 -3455 51 -12397
15346 -12397 -13371 -15868 -2445 10362 1035 1530 2480 8523 -8865 -21178 -20625 -15074 -20998 -26850
15332 -26850 -15859 -10363 -3369 -4114 -7029 -9855 -12387 -8360 1103 512 6544 9449 -11626 -19158
15318 -19158 -2414 -2007 -8594 -12366 13256 14589 4372 5798 12568 1295 -19654 -14454 -8828
15305 -8828 -15110 -16917 -14941 -25393 -31579 -19457 -14608 -19029 -23866 -26384 -19562 -16114 -10257 6220
15291 6220 10280 7491 -6563 -6704 2618 8898 5924 -10852 -21375 -4946 5239 422 5790 12783
15277 12783 11348 7407 6615 -4081 -17230 804 6814 -632 -9532 -20237 -25906 -15923 -5645
15264 -5645 7021 18804 3372 -15656 -16357 -25997 -26387 -24431 -20685 -22765 -8611 -13477 -12696 -14912
15250 -14912 -8350 -3025 1018 -9444 -14789 -13509 -18465 -16074 -4902 -3543 -5997 -7450 -17790 -24342
15236 -24342 -23656 -5867 8948 14884 4042 -3518 -12108 -11666 -6437 -8694 -9074 -7802 9160 14227
15222 14227 9292 14287 14550 9565 -1092 -16056 -17432 -17882 -18316 -28961 -32447 -23187 -13357 -3192
15208 -3192 351 -4274 -9347 -15700 -10653 -10534 -12002 -963 -7725 -9866 -12657 -17300 -7323 -15493 -24666
15193 -24666 -15698 -7406 5679 25172 28060 25743 11442 2139 -2152 -7449 -11572 -14195 -17082 -10022
15179 -10022 -7086 -5949 -19570 -16457 -13519 -13598 -13662 -4280 3375 -1515 -837 -9413 -16164 -32322 -32248 -15350
15163 -15350 -3489 16976 2850 -15819 -27530 -16637 -8647 -12789 -27834 -29556 -9544 -1847
15151 -1847 -7334 -12040 -25098 -30236 -21464 -4555 -8207 -43 2084 -11196 -22753 -11919 -9535
15138 -9535 -18351 -12463 5637 2026 -247 -8006 803 7769 -2850 -14318 -13188 -11818 -24833 -31092
15124 -31092 -23235 -23320 -27597 -14902 -16234 -17344 -19417 -15191 -16401 -20727 -15674 -23190 -16609 -6335
15110 -6335 -9955 -3249 -9692 -15669 -10421 -2849 -6603 -808 7332 4575 9789 17917 17188 1039 -10438
15095 -10438 -8083 -11270 -8793 1655 2178 -4108 -9639 -5965 12223 7718 -728 833 15373 25363
15081 25363 25380 15659 -1874 -4957 -2231 7297 1198 -10242 -13542 -7098 -10447 -35010 -41607 -38739
15067 -38739 -30956 -23443 -2842 4297 5678 9119 10925 15825 16652 -1014 -17258 -18379 -8126 5806
15053 5806 9236 -6560 -21103 -14215 -2918 7419 -2012 -7698 -11234 -24707 -29519 -35089 -38017
15040 -38017 -34548 -21998 -22083 -30114 -36759 -38771 -40133 -26365 -12071 216 -8432 -5998 -11808 -5889
15026 -5889 5997 6416 11081 3605 -2589 -6604 -3170 706 -3446 -9708 -13027 -65 6497 -2623
15012 -2623 -11529 -15377 -11562 -9309 -5757 2935 -774 -1683 -7770 -7492 -108 17842 23585 23044 25856
14997 25856 22776 8524 3602 447 -5055 -19236 -29612 -35485 -22085 -2911 6263 10516 33722
14984 33722 27907 10803 -4145 -13720 -21533 -22785 -15093 -18037 -24045 -17386 -16922 -9728 12183 21122
14970 21122 13727 -3175 -5885 -10177 -12657 -181 -4332 -12923 -28501 -19289 -9165 -11159 -14920
14957 -14920 -23846 -24236 -22162 -16767 -5582 1298 13069 2557 -147 601 4683 -5173 -5170 -8271 -702
14942 -702 3850 -4502 -12754 -11388 -2354 4872 10770 357 -9564 298 -4110 -6545 -1163 2305 -1126
14927 -1126 1749 3504 3277 1676 10631 3695 -2299 2387 22877 4493 -7293 5427 18117 39568
14913 39568 47630 38431 6881 -7894 -9050 6438 14625 20032 19822 17343 12730 -61 -6848 -3024
14899 -3024 6634 5329 6697 5775 -925 -8886 -9250 -27132 -24115 -9618 -6963 -346 5486 -5430
14885 -5430 -6101 2102 -178 -15491 -16494 -15092 -21809 -20417 -5195 -9755 -8674 -14797 -25609 -18291
14871 -18291 -10216 -1443 22191 25926 25918 17759 11273 9902 19948 12689 6880 23683 32335 20165
14857 20165 7337 9812 10626 9933 -6764 -11851 -8592 -10684 -10235 -10478 -17195 -26330 -15446 -13614 -11090
14842 -11090 -12937 -1002 985 3339 1931 7022 -8581 1257 9577 17757 22381 21595 25137 16462
14828 16462 10782 4742 3280 -7261 -3255 -4266 -2659 1823 6838 -5117 -18479 -8697 -319 -230
14814 -230 2438 436 -5216 4816 19045 22892 31946 38642 55003 63184 49044 33376 17365
14801 17365 9423 19748 34276 22952 9111 -3543 -8731 -9151 -13711 -2784 13881 17550 26867
14788 26867 23272 12362 6680 22872 22238 19901 6184 -4427 -2708 5098 15521 37250 35091
14775 35091 23656 18378 28883 35733 33061 22078 15409 22959 30626 34828 15476 14840 6022 7680
14761 7680 11668 -510 20772 34443 27810 21209 9197 -4076 -10294 -4332 -323 -4271 -14024
14748 -14024 -15894 -2414 4746 2826 7405 12360 -863 -14339 -7130 470 1622 572 -1487 -1788
14734 -1788 -5055 6291 10275 -4329 -16851 -29638 -33092 -33232 -24662 -18815 -13562 -11579 -1766 -10032
14720 -10032 -19499 0 21291 33566 35794 26314 4213 10107 27781 38269 74547 107024
14708 107024 131351 152669 170928 169549 132663 93236 72991 72522 87257 120782 155983 210672
14696 210672 259441 288298 273787 257074 245821 205350 150416 116447 103549 100837 109213 121513
14684 121513 148717 177603 198895 189197 149000 94183 69281 56365 42600 31948 45275 58604
14672 58604 63172 55240 49929 52830 44956 41671 58875 52479 44112 40260 28722 27481 26472 15269
14658 15269 11646 12636 5458 -732 -1012 10405 11465 323 -6469 10390 18348 11451 9416 14357
14644 14357 12997 6984 7647 19052 6396 -5823 -10645 -16946 -19487 -13960 -6856 -10415 -18863 -10662
14630 -10662 -1634 10177 24390 37966 33586 20835 19623 26044 21466 9997 3510 -1928 -1516
14617 -1516 977 1341 9020 7242 825 -7699 -11730 -8074 -12118 -21369 -16369 -1826 -1154 751 -1529
14602 -1529 -9296 -24735 -22395 -7301 19154 29800 30175 31687 14555 975 3938 -5758 -13574
14589 -13574 -11674 -8705 -5499 -7317 -14354 -26353 -26089 -30997 -19300 -12579 -8410 -23526 -14402 -6144
14575 -6144 -2544 12741 5607 3290 8527 4624 -757 -20163 -21593 -12495 -2082 -8293 -18422 -36838
14561 -36838 -35363 -18521 -422 9478 12570 6329 5056 -6136 -13094 -11078 -4738 -1048 -791 -4895
14547 -4895 1101 999 -6922 -1615 -16125 -15365 -25455 -20043 -18689 -20973 -31233 -16788 -6088 -19550
14533 -19550 -36975 -51455 -46755 -34615 -34474 -32632 -24039 -17858 -12989 -7005 7023 25398 10867
14520 10867 -7405 -21353 -24476 -23686 -22702 -31093 -22098 -21251 -23517 -22507 -13346 -1929 1056 -10264
14506 -10264 -25231 -18443 -14699 -10794 5273 8424 -441 4033 -16499 -15027 -2715 8375 2192
14493 2192 -258 -6221 -8102 -16873 -14440 -1214 -8936 -12367 -11225 -30764 -33756 -14467 -11975 -11041
14479 -11041 -15442 -24682 -19765 -20738 -11552 -7745 -1773 -11954 -1001 1751 -9571 -26414 -30469 -18175
14465 -18175 -14773 -21435 -7795 3935 9195 3376 -11544 -6168 865 12547 22530 26087 23185
14452 23185 22737 9031 20913 23369 -2565 -14787 -1906 -10018 -26387 -18080 -12289 -610 -5809
14439 -5809 -4477 -17269 -27112 -15003 -9417 -25942 -33709 -39410 -35961 -28324 -25438 -10968 -10721 -5489
14425 -5489 7703 27872 15755 -1817 -5571 -4323 -18576 -21672 -19505 -12168 3838 14929 22557
14412 22557 19551 20660 18094 8967 -444 -8651 -26691 -16190 -6696 1427 -7045 -6209 -1004 1511
14398 1511 -4387 140 -3822 6034 20604 6024 -9573 -4876 13514 22689 17738 6103 10641
14385 10641 11447 4968 5453 23170 14979 -10505 -17153 -11818 -3499 -12306 -21216 -28452 -9823 -4225
14371 -4225 -1356 -6360 -3786 -1326 5874 5907 5992 3469 -2724 -2712 34 -9311 -23002 -26096 -16851 -4940
14355 -4940 577 2387 -5913 -7645 -15340 -14417 -2576 2537 -5538 -19767 -7585 556 -4296 -4644
14341 -4644 -7846 -13244 -15240 -7377 -3566 2591 8266 -1684 -9142 -11216 -3574 3476 -2090 -1582 -7649
14326 -7649 -8624 -11718 -1450 4222 -1374 -3273 -1268 4279 -3991 -12017 -14955 -11172 -9471 -7138 -6001
14311 -6001 5532 1556 -6996 691 16073 14947 12065 25079 17358 24123 21176 15655 17086 20988
14297 20988 15532 6991 876 764 -9749 -13792 -15385 -12573 3679 3145 -16205 -31661 -27986 -16235
14283 -16235 -22208 -21881 -14600 -12109 -789 -1690 -10514 -6571 1583 -2095 5917 13383 15053 19586 26940
14268 26940 17936 27925 23041 14908 7255 -1577 -711 3901 5432 2645 -3978 -5762 6847 14586
14254 14586 10635 6974 581 3721 -1373 -5059 5642 22406 10435 10526 10760 3618 -22350 -24864
14240 -24864 -18541 -9888 -14765 -23298 -23471 -28274 -17438 -6476 -3826 -10188 -15325 -9993 -4516 -9018
14226 -9018 -11248 -8149 -6287 -8373 -15262 -21095 -19926 -25097 -24827 -21536 -8070 -16769 -25203 -22744 -15698
14211 -15698 -32674 -36998 -20512 -11378 -674 9576 15387 2261 -3399 -12559 5798 10270 6101
14198 6101 6995 16322 7251 -2904 -12615 -7038 -2550 -11518 -9428 -2938 -203 -836 -1279 4497 3524
14183 3524 2205 13001 22958 16393 16138 17154 29477 34066 35895 33355 25752 36684 27349 17301
14169 17301 14475 6983 4055 -5634 -2703 10306 16141 27720 35492 44141 68470 91201 111981
14156 111981 137188 155523 151667 133798 95504 57530 40183 43160 30941 8321 -1402 -11126
14144 -11126 -8680 -303 -4211 3499 20738 11089 6822 17176 22071 21844 18533 18297 19359 32996
14130 32996 52470 50732 65552 99424 138708 182203 252596 304732 326833 307817 234739 168056
14118 168056 130212 106402 87828 67070 72023 71902 62265 48238 42476 38997 25625 10479 18489
14105 18489 20032 24660 22278 19121 11814 17220 32883 36231 31958 41892 60230 80217 94994
14092 94994 128217 165895 193395 204066 183359 139521 81068 54536 50381 47270 37175 43728
14080 43728 39231 18738 17719 19717 11636 11671 7576 10194 15120 8176 10887 19421 17983 4869
14066 4869 -1212 -3900 -6559 -5667 -1820 -5583 1835 5219 6202 7839 7650 19101 29331 24520 3845
14051 3845 -4198 3408 -8994 -21678 -14011 -5458 2808 9128 10382 12025 2503 -7967 -18700 -10082
14037 -10082 -3784 -13223 -11924 -8177 -3084 -6159 -26244 -22781 -11700 -14376 -13121 -27145 -19183 9889
14023 9889 16340 15336 9173 14474 7322 -1389 -5637 -16681 -23478 -25585 -28235 -23894 -15875 -25932
14009 -25932 -16681 -4826 -14014 -26226 -22845 -10746 6013 5963 5518 -3060 -4696 -14818 -25030 -25722
13995 -25722 -12347 -5276 -13074 -9341 7823 -1419 6149 10669 2325 3678 -121 -14757 -28243
13982 -28243 -33423 -38140 -33069 -6583 2634 9028 -2504 -12205 -19397 -25376 -19094 -7096 -215 -13889
13968 -13889 -8003 5253 5411 -5569 -4235 4592 7503 -18146 -22965 -25192 -30931 -29573 -35483 -40945
13954 -40945 -38846 -32426 -23591 -23433 -24457 -13500 -6009 -3805 -314 -7038 -14336 -18782 -22034 -30558
13940 -30558 -38084 -37107 -26435 -19832 -7405 -7119 -5422 -4134 -12225 -7444 -11629 -5383 -6923 -13345
13926 -13345 -1519 5545 5103 -6271 -8531 -19064 -28890 -28036 -8065 2513 4617 9522 8235 -8804
13912 -8804 -30020 -32384 -24974 -21064 -24438 -12916 -7447 -12424 -25489 -28484 -24691 -11408 -315
13899 -315 -7481 -22014 -12156 -8695 -549 -17208 -26303 -24812 -19810 -16202 -3825 -7493 -10067 3749
13885 3749 10463 2692 5349 4894 -1701 -12715 -14005 -11391 -1093 -9367 -15447 -15996 -12270 -14282 -13384
13870 -13384 -767 -873 3571 -2308 -10682 -2354 -8016 -5114 1650 841 1420 7082 13588 -1145 -8272
13855 -8272 -21039 -19835 -27784 -17918 -5081 -11117 -16310 -11162 -6840 9216 633 -4814 -3981 1115
13841 1115 4065 3662 6302 642 -17070 -19787 -12681 -18588 -14060 155 8820 10874 11720 -1091
13827 -1091 5630 4418 1084 -10633 -13466 -4938 -7974 -16171 -12798 -9385 -8768 -4552 616 -7967 -15559
13812 -15559 -11456 -14867 -13931 -20407 -15764 -10541 -15736 -21541 -15807 -18573 -29076 -44745 -29151 -17510
13798 -17510 -21748 -24285 -12888 -2084 -2642 978 11212 5712 -3368 -569 698 3083 -3094 6979
13784 6979 -5120 -22584 -22877 -14984 -7824 3652 11861 6639 2729 5558 -1383 -8607 3100 25702
13770 25702 19311 8970 12824 2993 7205 6146 -13494 -28374 -40562 -40106 -31542 -18485 -10163
13757 -10163 -18185 -13877 1619 -2448 -19561 -16920 116 10849 7192 17758 17154 -2358 -5056
13744 -5056 -3760 -13102 -12373 -10648 -21495 -30110 -27620 -17144 -10284 -6141 -4781 -4859 -6887 -2480 -1407
13729 -1407 -1153 523 -25463 -30560 -6740 635 -9911 -2240 9423 2670 -11468 -18000 -19048 -4308
13715 -4308 4029 -12058 -14020 -16771 -31085 -33021 -24537 -16404 -18427 -17331 -20395 -5511 -658 -472
13701 -472 4946 7710 5708 -747 3009 10469 18838 9862 -4784 -12185 -6712 -13589 -7363 2330 1476
13686 1476 -14050 -41776 -42153 -34913 -35767 -35292 -26895 -30191 -24058 -20080 -11164 -14124 -6800 2298 -4631
13671 -4631 -20350 -31089 -29187 -30006 -32199 -36302 -36942 -23511 -12414 -11950 -20488 -29646 -28414 -32971
13657 -32971 -27031 -27887 -18338 -22712 -21663 -17666 -13747 -8093 -16866 -26432 -27776 -23276 -25316 -33967 -31572
13642 -31572 -21515 -5348 -11134 -30715 -24973 -23745 -23544 -19199 -22659 -27180 -19829 160 1897 -7041
13628 -7041 869 13070 14345 1659 7234 14783 -2978 -8820 -12077 -27857 -30749 -21847 -13448 -14134
13614 -14134 -226 -2443 -22079 -24248 -21322 -25742 -21100 -21240 -24234 -21746 -10345 -878 6148 12338
13600 12338 12217 8307 -3214 -18059 -35653 -39377 -45043 -26639 -7960 -11567 -29342 -31358 -18688
13587 -18688 -9311 -9967 -6595 -10165 -7743 -9087 -33689 -36991 -39070 -26448 -13688 -6687 -13529 -20235
13573 -20235 -15562 -8303 -4521 -15842 -8204 -4598 -4559 -7189 -2145 6964 25087 23150 15814 26805
13559 26805 37220 32510 35984 40712 41970 37965 38674 30969 8332 -11652 -19633 -11784 -9680 -3553
13545 -3553 -3094 2522 6292 2123 -4908 -17353 -11234 -6767 -4834 -6283 -2407 -4979 -9929 -7438 114
13530 114 -5075 -21128 -22241 -6235 9915 13199 19 -18447 -19975 -15356 -16113 -9658 -4300 5622
13516 5622 8945 -6898 -13379 -16944 -18733 -12722 -8726 -10019 -12431 -24989 -28588 -22953 -6346 4441
13502 4441 -2312 -3128 -2167 -3757 -8040 -13719 -19403 -17247 -9734 -5731 2403 -8762 -35596 -40054 -35525
13487 -35525 -31174 -37307 -31117 -26101 -18127 -35837 -37062 -33849 -19568 -14669 -7530 -7719 4696 15798
13473 15798 14494 17900 21092 42993 54912 59382 45225 39659 40799 34412 25536 18975 11043 3969
13459 3969 -52 2302 3342 3467 2019 13087 19895 22340 26149 24467 18251 19509 19907 17905 10196
13444 10196 10861 17251 13200 2412 -11279 -3815 6903 3466 -5440 -20134 -27336 -28391 -25651 -16886
13430 -16886 -10040 10210 14567 31284 25404 4674 3810 5294 9579 8042 -7283 -15232 -27140
13417 -27140 -21840 814 4490 4702 -12365 -13268 -15305 -17284 -13459 -4249 8037 9551 -1851 -2127
13403 -2127 -356 630 -10075 -11145 6202 6976 -3923 -1476 6561 9085 1071 3490 6573 -10528
13389 -10528 -7941 -7826 -16371 -19979 -31801 -20044 -9793 -2 14740 9850 -8384 79 -4068
13376 -4068 2953 9490 6560 13441 16728 9580 18462 17674 16213 7455 -4396 -13425 5833 15936
13362 15936 23108 13476 2155 -8531 -5768 6097 -3058 -15740 -10377 -12255 -11118 -4940 -2
13349 -2 -6963 -13405 -6947 1282 -3376 -10965 -14530 -7567 -5550 -12850 -21341 -17066 -19454 -20984 -26214
13334 -26214 -27914 -19064 -9644 -9768 -10905 -11113 -10637 -14025 -17190 -19911 -24682 -15192 -3889 540 10960
13319 10960 -2608 -7553 -6742 12032 14808 16055 4009 5765 3439 5282 16588 23362 15633 14071
13305 14071 8582 -3131 -637 6963 7314 -13417 -15560 -10135 1813 8183 22258 13425 5102 15009
13291 15009 12065 7636 -3297 -4200 -12979 -11106 -15345 -7972 -5815 5850 3494 3210 -6324 -11851
13277 -11851 3614 27587 17193 12912 8025 7420 13509 7402 -5516 -11984 -6480 -5626 -8296 -9303
13263 -9303 -3055 -1285 2679 979 -1829 -1975 5163 16816 18750 22513 42206 63034 79613 99825
13249 99825 115737 116282 88586 64145 49689 45962 41807 33768 23359 17522 36228 56142 79237
13236 79237 101659 121540 127754 99276 68161 57219 38340 27891 22779 18002 12456 23431
13224 23431 44577 53692 41458 34492 40297 31830 29853 38947 24011 16007 10393 9752 17275 16036
13210 16036 13320 3372 -1306 -11313 -6401 -13551 -20865 -20556 -25332 -15794 -2278 9842 11156 15659
13196 15659 26254 32554 20501 8046 6227 15513 24487 23190 23344 34059 41551 47516 52124 70558
13182 70558 102057 137256 175247 206443 231674 255790 235622 165873 99210 78653 73509 63161
13170 63161 59147 76879 94912 124353 159883 212366 244167 251659 216394 148282 118255 97069
13158 97069 85314 73353 51140 38264 43336 56721 66783 62402 58687 47360 45238 58714
13146 58714 73404 76702 90635 97764 97421 76667 63334 62206 61339 46812 35477 34887 22172
13133 22172 9405 24705 41186 51248 51227 46304 58335 72184 80789 65336 57631 46118 31769
13120 31769 31378 26815 36176 44157 35726 27138 31065 42149 46728 47678 61620 71605 85201 122991
13106 122991 148180 169904 217762 309529 441864 584868 713878 783004 764040 666202 533461
13095 533461 423193 343869 309315 289746 273733 278434 282590 277773 275479 252992 202937 166270
13083 166270 157331 154747 159371 158422 143618 124896 116138 124087 134708 151067 165367 195623 252604
13070 252604 336294 433501 543382 651495 688507 656461 567707 431273 346527 290768 255365
13059 255365 244070 236991 217357 200060 196119 192592 182560 173012 168075 170401 182372 197681 197559
13046 197559 181312 189797 221134 272257 312298 325830 297520 235834 195264 169600 165740 175824
13034 175824 216266 270336 300578 318432 279470 206401 154628 138566 117790 102983 79820
13023 79820 65748 55090 52506 71208 81874 76469 64616 59867 58734 58084 45669 31324 23318
13010 23318 31810 37279 43535 58493 71821 77638 68405 58067 45574 36973 34818 35699 26127 4671
12996 4671 12230 13825 16818 30114 32855 28966 42078 38125 36611 38567 28957 14200 4612 1017
12982 1017 428 1621 995 1557 3083 16010 14637 27341 45345 72871 90515 107566 121572 101348
12968 101348 77834 61973 52366 55323 67871 81172 101434 123680 139560 140212 109952 79228
12956 79228 70535 48247 30748 32590 26748 30646 45354 48841 36074 29254 28618 26513 27112 32497
12942 32497 23261 16174 12414 6110 4520 13214 16130 10763 5531 -186 -15726 -4754 10788 24189
12928 24189 37215 14870 4513 14105 8696 9515 4671 204 8388 13683 2989 4239 9174 -3804
12914 -3804 -17206 -19894 -15212 -25098 -13096 7299 12587 15259 7666 3459 14243 6934 -642 -9064
12900 -9064 -18342 -14466 -25611 -45365 -37195 -20331 -26687 -30341 -26197 -10754 -8957 -13780 -15060 -12065
12886 -12065 -7882 -18532 -30696 -15244 -23 9234 11500 12761 13856 3858 -2265 -5809 -4309
12873 -4309 98 5613 5719 -7125 -6444 8470 5120 6560 17957 26969 40120 59232 79152 107318
12859 107318 143313 171680 171423 125184 80460 60554 54908 47753 40086 24761 23249 19612 33130
12846 33130 24047 9117 18324 16986 6747 1694 742 -11340 -4575 3681 15181 19678 10581 15021
12832 15021 13733 787 -28461 -23922 -13651 -9696 -2617 -10529 -5959 -8149 -5534 -3660 -13179 -6776
12818 -6776 -2113 10160 7521 -226 -5502 -3349 15377 13771 5294 6241 12982 14206 4707 -8996
12804 -8996 -16403 -974 14322 30551 32183 24804 38182 56138 75234 111072 108033 59653 27648
12791 27648 16846 8207 22360 29290 23436 11219 17461 25218 18701 13356 21397 33115 55561
12778 55561 67430 69621 83096 112462 144910 205205 302281 462851 684449 958772 1257106
12767 1257106 1493895 1525272 1337239 990766 663990 453951 345545 282441 237674 210311
12757 210311 189922 160955 154860 146595 149250 140593 131494 129017 121020 101328 83106 90203 80326
12744 80326 75076 68008 60259 66138 61835 51239 53517 51214 47145 47484 47002 50491 59805 62838 53299
12729 53299 36814 33772 32495 18057 19796 26422 37853 37173 30871 36921 32198 28589 26857 20568
12715 20568 10995 10896 11572 13391 23771 9749 12207 15199 19936 22296 25184 26924 26188 43080 52927
12700 52927 57418 41731 32612 15130 1873 7041 11206 21369 20363 12037 18155 19267 23154
12687 23154 19685 11979 10077 10986 17448 18307 19335 15631 11695 -2765 -10258 -22244 -33285 -20534
12673 -20534 -3592 6727 -360 -11849 -18432 -5120 -977 -11517 -18853 -17360 -6542 -12330 -10028
12660 -10028 -1006 -3076 -10785 -10140 -4654 -6986 -6640 -4156 -4809 -1497 1780 1135 2056 4888 6342 13072
12644 13072 9448 9092 -5732 -20104 -26199 -27413 -4516 5207 11459 11362 7768 6773 -6049 5952
12630 5952 31277 27156 17254 14254 994 -5667 -1829 4866 -2564 -11675 -17778 -13723 -14001 -33016
12616 -33016 -29188 -15305 1934 4765 4859 -12455 -16639 -5580 -3382 -18337 -15955 -9686 -3733 4881
12602 4881 6610 7557 -6084 -5999 -10913 -20425 -31498 -31585 -24335 -28167 -27793 -6619 -6074 5308 3208
12587 3208 -6770 -5878 -14931 -26070 -29707 -19132 -7763 -18386 -21569 -14100 -478 234 -7786 -18203
12573 -18203 -11210 -20276 -28542 -24344 -20064 -24217 -24322 -20151 -16374 -12846 -11768 -3968 -4077 -2270 8827
12558 8827 1596 2589 2761 -13015 -12663 -15171 -18490 4993 -2337 -12990 -7046 -13745 -13163 -7521 -6425
12543 -6425 5194 17254 15903 6244 -2322 -1558 5839 8224 26769 18770 15881 14588 -3013 -12418
12529 -12418 -2727 15340 23163 24921 18413 6395 8440 1758 -23994 -33398 -20729 -19857 -10794 4783
12515 4783 1994 8038 10301 11458 6226 4179 -1483 -4523 -7575 -1387 6081 -28 17081 9852
12501 9852 -4539 -8185 -8424 -3149 -1098 -1290 3728 -3015 -10886 2201 2156 4378 12784 15420 20284
12486 20284 8794 2113 13538 7897 12743 26579 49244 54899 41182 41902 53871 53163 48892
12473 48892 56544 70228 85920 87687 109165 158255 225668 342334 530584 829192 1241857
12462 1241857 1686990 2081983 2329662 2083553 1445665 927637 639751 497910 421306 372679
12452 372679 338351 301991 266774 230192 202051 196187 191058 189694 199024 191726 171846 169608 164947
12439 164947 154686 140697 132415 125633 125410 121373 115856 114162 95833 83562 76292 77958 71821
12426 71821 75821 78932 66841 66710 60569 63421 62001 64090 61024 39952 44056 42871 52581 56536
12412 56536 51519 28944 17974 23314 40542 43092 37747 43008 33128 38127 41522 40844 34489 28373
12398 28373 29027 30935 32289 34147 29229 27112 39539 41321 26456 17607 16684 15252 14171 19585
12384 19585 20596 15001 18014 13952 1557 -4106 -9531 -10375 -13925 -10794 11949 25939 18481 16578
12370 16578 15760 4618 -4624 -4621 -185 -5441 1654 12612 16315 20634 31291 25355 10134 -10481
12356 -10481 -4731 4240 10367 12780 84 2550 162 5784 23821 30027 29272 39724 60018 68919
12342 68919 64712 59234 45651 46831 60217 57811 52061 47503 47574 37295 22135 15800 -4969 -11161
12328 -11161 2240 8035 23676 29730 27782 10657 16845 17893 18305 9523 -2233 -2558 1251 -2312
12314 -2312 -3082 18259 22034 14502 13241 22023 24532 3304 -1826 3484 -2329 -8325 2062 17649
12300 17649 17162 12315 10330 2723 -134 6620 10839 8786 1574 -2557 -6506 -1639 5073 6684 -6660
12285 -6660 -11726 -6929 4355 210 -9606 -11375 -15710 -13590 -20797 -13064 -3619 5221 21482 16673
12271 16673 4629 -540 -1649 20172 17623 11138 1460 -3294 -16569 -20632 -11477 -19659 -31005
12258 -31005 -25902 -8010 4858 -1807 3105 -1483 933 838 -4848 1940 5805 -13991 -16422 -16971
12244 -16971 -8590 -5107 1864 5688 -380 -4699 6627 6343 -3355 -9766 -9274 -503 12569 15738
12230 15738 19920 10734 20471 21769 23983 13693 7226 7099 -1031 -4197 3605 14698 13374 21441
12216 21441 32592 31704 20769 19008 22376 23660 16241 12848 17198 10720 -6436 -2730 9505 12356
12202 12356 16467 35171 44891 43196 56386 49386 35480 30920 46271 58090 78320 97485 120770
12189 120770 145887 179617 268064 411708 651106 1025806 1502098 1907728 2277812 2251025
12179 2251025 1583870 992657 676878 514259 434584 375019 326765 288521 256506 222192
12169 222192 210805 195494 170757 163007 157608 149316 157023 163251 161431 152156 137629 127054 120835
12156 120835 122128 122318 121204 116444 115277 113962 115619 133011 154193 140148 114625 86921 81753
12143 81753 85358 87945 81881 71158 74109 63509 49119 44759 58368 68809 64751 50372 48453
12130 48453 53050 57560 57649 63757 60636 70055 62967 63923 57422 57278 54855 52786 50209 48603 46143
12115 46143 50982 79167 110355 172358 246407 320015 395213 461887 452554 358695 272866 214564
12103 214564 192914 193003 203588 215972 225587 237327 266034 298073 361253 463533 661090 993856
12091 993856 1540468 2361518 3301656 4124618 4766010 4504818 3217606 2061122 1423442
12082 1423442 1081904 895796 781043 699942 614217 542003 495215 465774 428491 392997 375413
12071 375413 365892 349840 332171 328572 331059 336414 311063 283019 262210 250351 248968 250355 236749
12058 236749 209205 193541 183205 187929 168591 159064 160815 154974 147818 141825 147291 137523 126251
12045 126251 119510 122168 121010 116887 123385 121583 111015 101097 106907 115268 122749 117167 98144 80071
12031 80071 76306 72754 60741 59239 60446 68890 59310 42943 42107 44827 50183 44785 27981 31842
12017 31842 43719 41863 38005 51164 49871 44562 35969 39990 28227 20046 15253 21625 25716 29054
12003 29054 23612 9523 15883 16429 8825 3193 14918 26992 21710 24757 32088 34083 37102 34541
11989 34541 35292 35628 22866 7148 -4355 10822 12197 9277 3603 -3555 -14643 -7712 1863 3792
11975 3792 1768 672 -174 5748 7627 4845 1354 -5121 -10150 -11310 -3880 6098 10512 12630 16765
11960 16765 25170 29610 47969 60484 82168 93617 80539 49965 19078 337 458 5757 15058
11947 15058 9392 -1222 4816 4049 -6092 -6464 -1573 -81 2246 -72 3600 -3361 2258 7765
11933 7765 11549 6925 12000 -1482 -8058 109 6767 9897 13238 11897 5498 3761 12477 13346 5130
11918 5130 -301 -7157 -8703 5705 19972 7856 3806 -1658 1538 4896 -4226 -9408 -16098 -13909
11904 -13909 -10882 -11016 -22746 -22506 -20950 -25584 -30354 -34472 -5452 10769 -3643 -9892 4635 26956
11890 26956 23607 5090 -4138 -12298 -1345 2491 -8963 -26492 -22971 -14317 -11787 -10325 -4614
11877 -4614 3755 -11720 -25562 -24371 -31396 -19961 -24329 -36140 -15620 2920 14103 11969 2981
11864 2981 -1529 -16763 -28602 -27605 -25237 -25733 -17721 -19231 -22576 -12561 -8640 -18756 -29658 -27276
11850 -27276 -15539 -2750 7469 15744 18679 26368 12009 -1554 -3966 -9832 -18566 -18591 -7230
11837 -7230 2788 -4089 -10140 -2159 -19018 -11589 -5641 6044 5187 -13065 -24934 -27166 -16377
11824 -16377 -17344 -11285 -8459 -12393 -16497 -9018 6797 13582 3548 -5546 -16079 -19059 -20259 -18882
11810 -18882 947 -7861 -9699 -10344 -14937 -2858 12576 13940 5652 -19265 -34639 -28469 -22788
11797 -22788 -17012 -14080 -8663 -14403 -18290 -15623 -22742 -40214 -45961 -31934 -30131 -30604 -32947 -34205
11783 -34205 -35728 -22781 -21256 -21225 -23049 -23277 -13801 -9178 -4434 -6903 -7141 -5944 -7591 -10166 -24490
11768 -24490 -25270 -23221 -18619 -12142 -10079 -29877 -24985 -28476 -33931 -35809 -21717 -5751 -5841 5444
11754 5444 9537 723 -12588 -4977 4997 -6190 -14575 -12306 -14181 -19183 -24558 -9265 3946 -7595
11740 -7595 -18933 -21486 -23393 -17156 -16680 -29816 -28216 -33236 -35478 -30402 -18102 -8160 -450 775
11726 775 -16156 -17334 -5461 843 -5821 -20334 -24954 -28020 -23464 -20659 -14878 -20506 -11555 -8347
11712 -8347 -4765 5310 25770 31414 24293 5978 -12793 -18166 -9657 -23223 -38665 -43343 -36823
11699 -36823 -35691 -19753 -9220 -10132 -12127 -5294 -8250 -1776 6526 -1580 -8262 -12872 -10700 -27327
11685 -27327 -30899 -17652 -10113 -15476 -23880 -19573 -17453 -13269 -6826 -11868 -13062 -4564 7264 13728
11671 13728 7689 13418 14356 7071 -4107 -19298 -19528 -12026 -14453 -9401 -11605 -22373 -16431 -11771
11657 -11771 -4024 2086 3001 -6943 -7976 -3859 -6430 -7657 -22343 -26633 -26795 -28088 -7411 4178
11643 4178 -3336 -6175 -3525 407 -9967 -12082 -2905 6790 2811 2987 723 15572 9126 1904
11629 1904 -619 -6490 -7371 -10102 -15523 11745 17534 4463 -16770 -9609 6778 -2708 -14971 -23456
11615 -23456 -19259 -19886 -8237 89 1159 -2441 -2227 4777 3766 -4156 -22223 -42124 -33095 -20825
11601 -20825 -16417 -10745 -20193 -16781 10032 12742 12778 4006 -4010 4542 19190 1517 -587 4297
11587 4297 4884 -18048 -22220 -18167 -19783 -8537 8775 10905 -1381 -10965 -8747 -6837 -9843 -9501
11573 -9501 -14927 -5608 -3870 276 6330 1966 -14360 -10259 -3099 -6738 -16044 -15135 720 6493
11559 6493 -4559 -9106 -18851 -24114 -16157 -13448 -24734 -29798 -26366 -26227 -15175 -5779 -9266 -14298
11545 -14298 -8189 -6477 -7323 -24219 -32623 -35213 -24284 -19146 -20418 -18207 -15757 -25416 -28640 -33172
11531 -33172 -22627 -20218 -14021 -502 -3995 -19482 -18853 -17390 -13155 818 4689 2785 20 -1461
11517 -1461 -6056 -6713 -10577 -9810 -10001 1314 -10670 -14833 314 951 -8854 -23187 -13185 -10058
11503 -10058 -15489 -7803 -14367 -24668 -18880 -5284 -936 -335 -3625 -12574 -17801 -14726 -10724 -7475
11489 -7475 205 -2173 -3692 -2486 -7428 -20424 -22404 -25001 -15864 -6485 -8599 3132 -4205 -19860
11475 -19860 -19501 -22951 -31136 -34291 -27303 -17858 -18655 -16406 -14650 -11826 -13869 -24112 -21791 -10557
11461 -10557 -13661 -18151 -22055 -16493 -20590 -39749 -46457 -45620 -41756 -38738 -28030 -30977 -27878 -23791
11447 -23791 -36679 -49076 -34275 -32971 -35633 -29763 -14880 -9901 -7336 -22872 -25607 -24143 -12875
11434 -12875 -9128 -5065 -12350 -16641 214 -333 -7107 -16309 -19234 -28385 -40147 -29792 -17001 454
11420 454 -12050 -28586 -24832 -29402 -30428 -32251 -27457 -13096 -4195 -9683 -24004 -15508 -16788 -16218
11406 -16218 -22714 -25354 -29782 -16620 1116 8398 6314 812 -3579 -17137 -17484 -14663 -8393 -5037
11392 -5037 -12207 -10530 -22285 -31261 -24051 -15932 -13392 -22840 -23535 -29740 -44673 -40950 -22761 -7856
11378 -7856 1808 -1998 3504 5050 -7516 -9047 -6008 -7528 -16978 -8218 -9576 -17039 -24665 -17014
11364 -17014 -16077 -12616 -11990 -15232 -3232 1676 -2742 -9601 -13053 -7579 -8283 -11769 -5465 -5925 -18962
11349 -18962 -23501 -25295 -36077 -31249 -20349 -11836 -14273 -15560 -12571 -7291 -4571 2000 6375 3159
11335 3159 -4973 -13176 -11146 -10299 -21001 -11840 -906 11669 7617 3301 -2236 -2558 -4767 -14369
11321 -14369 -30754 -33266 -22621 -6845 471 -1064 -10950 -15679 -23298 -26043 -20335 -18153 -17731 -17373
11307 -17373 -32301 -30945 -36763 -42032 -35222 -28686 -21734 -23628 -19226 -9555 -9281 -9264 -15235 -23338 -27010
11292 -27010 -26809 -14741 -11505 437 2813 -2365 -6776 -21416 -23247 -12645 -5971 -4213 -13658 -15627
11278 -15627 -6280 3937 -6425 -5349 -975 -7148 -4761 -18337 -27708 -27196 -27105 -30670 -17592 -7419
11264 -7419 -1723 4544 12702 11557 1365 -20996 -23865 -20339 -17280 -16927 -10794 -11117 -14395 -7557 -7201
11249 -7201 -7394 -10389 -12237 -10950 -8089 2763 -5945 -297 1427 5345 -2685 -9516 -8644 -7886 -2038
11234 -2038 977 -6143 565 -3274 -10042 -7179 -7769 -9374 8355 22639 6384 -3429 -7451 -16976
11220 -16976 -24587 -32968 -25714 -19771 -26825 -25888 -16915 -14338 -4638 -2721 -1672 9996 14018 5176
$$ [...]
##END NTUPLES=NMR SPECTRUM
##END=
