##TITLE=Analysis number 321409
Compound Code cc 09203
Project Code adrs
Chemist Name zy-chem
##JCAMPDX= 6.0         $$ Bruker NMR JCAMP-DX V2.0
##DATA TYPE= NMR SPECTRUM
##DATA CLASS= NTUPLES
##ORIGIN= Bruker BioSpin GmbH
##OWNER= nmr
$$ XWIN-NMR		Version 3.5
$$ Wed Aug  9 11:55:35 2006 GMT Daylight Time (UT+1h)  MAYBRIDGE\nmr@NMR_250MHZ
##.OBSERVE FREQUENCY= 250.131544655141
##.OBSERVE NUCLEUS= ^1H
##.ACQUISITION MODE= SIMULTANEOUS (DQD)
##.ACQUISITION SCHEME= undefined
##.AVERAGES= 16
##.DIGITISER RES= 18
##SPECTROMETER/DATA SYSTEM= dpx250
##.PULSE SEQUENCE= zg30
##.SOLVENT NAME= CDCl3
##.SHIFT REFERENCE= (INTERNAL, CDCl3, 0, 16.4531)
##AUDIT TRAIL= $$ (NUMBER, WHEN, WHO, WHERE, WHAT)
$$ ##TITLE= Audit trail, XWIN-NMR		Version 3.5
$$ ##JCAMPDX= 5.01
$$ ##ORIGIN= Bruker BioSpin GmbH
$$ ##OWNER= nmr
$$ C:\u/data/dgb/nmr/ADRS/510/pdata/1/auditp.txt
$$ ##AUDIT TRAIL=  $$ (NUMBER, WHEN, WHO, WHERE, WHAT)
(   1,<2006-08-09 11:55:12.01 +100>,<MAYBRIDGE\nmr>,<NMR_250MHZ>,
      <created by zg, POWCHK disabled, PULCHK disabled
       configuration hash MD5:
       E2 DF 36 D8 04 B2 41 60 5A D7 A3 38 5A 4B D0 FE
       data hash MD5: 64K
       81 5A 73 39 A6 F3 2E 24 4E C2 4A E6 92 1B C7 B7>)
(   2,<2006-08-09 11:55:26.46 +100>,<MAYBRIDGE\nmr>,<NMR_250MHZ>,
      <Start of raw data processing
       ef LB = 0.3 FT_mod = 6 PKNL = 1 SI = 32K 
       data hash MD5: 32K
       5F 04 27 76 88 8B 9F 60 D5 26 E8 A9 58 1A 09 85>)
(   3,<2006-08-09 11:55:28.32 +100>,<MAYBRIDGE\nmr>,<NMR_250MHZ>,
      <apk 
       data hash MD5: 32K
       F7 DE 9A AF E2 FC EF C9 8E 27 55 23 61 87 77 D1>)
(   4,<2006-08-09 11:55:29.07 +100>,<MAYBRIDGE\nmr>,<NMR_250MHZ>,
      <abs ABSG = 5 
       data hash MD5: 32K
       39 55 91 23 D8 85 4D 96 A4 23 B1 40 65 4C 10 E2>)
$$ ##END=
$$ 
$$ hash MD5
$$ 0D B7 3D 83 FE C1 E5 10 9A 43 B5 A6 53 0D AC AF
##$RELAX= 
##$RELAX= 
##$RELAX= 
##$RELAX= 
##$RELAX= 
##$RELAX= 
##$RELAX= 
$$ Bruker specific parameters
$$ --------------------------
##$DU= <C:\u>
##$EXPNO= 510
##$NAME= <ADRS>
##$PROCNO= 1
##$TYPE= <nmr>
##$USER= <dgb>
##$AMP= (0..31)
100 100 100 100 100 100 100 100 100 100 100 100 100 100 100 100 100 100 
100 100 100 100 100 100 100 100 100 100 100 100 100 100 
##$AQSEQ= 0
##$AQ_mod= 3
##$AUNM= <au_zg>
##$AUTOPOS= <22 >
##$BF1= 250.13
##$BF2= 250.13
##$BF3= 250.13
##$BF4= 250.13
##$BF5= 500.13
##$BF6= 500.13
##$BF7= 500.13
##$BF8= 500.13
##$BYTORDA= 1
##$CFDGTYP= 0
##$CFRGTYP= 5
##$CHEMSTR= <none>
##$CNST= (0..31)
1 1 145 1 1 1 1 1 1 1 1 1 1 1 1 1 1 1 1 1 1 1 1 1 1 1 1 1 1 1 1 1 
##$CPDPRG= <>
##$CPDPRG1= <>
##$CPDPRG2= <>
##$CPDPRG3= <>
##$CPDPRG4= <mlev>
##$CPDPRG5= <mlev>
##$CPDPRG6= <mlev>
##$CPDPRG7= <mlev>
##$CPDPRG8= <mlev>
##$CPDPRGB= <>
##$CPDPRGT= <>
##$D= (0..31)
0 1 0 0 0 0 0 0 0 0.06 0 0 0 0 0 0 0.0002 0 0 0 0 0 0 0 0 0 0 0 0 0 0 
0 
##$DATE= 1155120910
##$DBL= (0..7)
120 120 120 120 120 120 120 120 
##$DBP= (0..7)
150 150 150 150 150 150 150 150 
##$DBP07= 0
##$DBPNAM0= <>
##$DBPNAM1= <>
##$DBPNAM2= <>
$$ [...]
##$SUBNAM7= <"">
##$SUBNAM8= <"">
##$SUBNAM9= <"">
##$SW= 20.6930455092707
##$SWIBOX= (0..15)
0 0 3 0 0 0 0 0 0 0 0 0 0 0 0 0 
##$SW_h= 5175.983436853
##$TD= 65536
##$TD0= 1
##$TE= 295.16
##$TE2= 300
##$TE3= 300
##$TEG= 300
##$TL= (0..7)
0 120 120 120 120 120 120 120 
##$TP= (0..7)
150 150 150 150 150 150 150 150 
##$TP07= 0
##$TPNAME0= <>
##$TPNAME1= <>
##$TPNAME2= <>
##$TPNAME3= <>
##$TPNAME4= <>
##$TPNAME5= <>
##$TPNAME6= <>
##$TPNAME7= <>
##$TPOAL= (0..7)
0.5 0.5 0.5 0.5 0.5 0.5 0.5 0.5 
##$TPOFFS= (0..7)
0 0 0 0 0 0 0 0 
##$TUNHIN= 0
##$TUNHOUT= 0
##$TUNXOUT= 0
##$USERA1= <user>
##$USERA2= <user>
##$USERA3= <user>
##$USERA4= <user>
##$USERA5= <user>
##$V9= 5
##$VALIST= <valist>
##$VCLIST= <CCCCCCCCCCCCCCC>
##$VD= 0
##$VDLIST= <DDDDDDDDDDDDDDD>
##$VPLIST= <PPPPPPPPPPPPPPP>
##$VTLIST= <TTTTTTTTTTTTTTT>
##$WBST= 1024
##$WBSW= 4
##$XGAIN= (0..3)
0 0 0 0 
##$XL= 0
##$YL= 0
##$YMAX_a= 257477
##$YMIN_a= -361131
##$ZGOPTNS= <>
##$ZL1= 120
##$ZL2= 120
##$ZL3= 120
##$ZL4= 120
##$ABSF1= 16.45312
##$ABSF2= -4.240053
##$ABSG= 5
##$ABSL= 3
##$ALPHA= 0
##$AQORDER= 0
##$ASSFAC= 0
##$ASSFACI= 0
##$ASSFACX= 0
##$ASSWID= 0
##$AUNMP= <proc_1d>
##$AZFE= 0.1
##$AZFW= 0.1
##$BCFW= 0
##$BC_mod= 0
##$BYTORDP= 0
##$COROFFS= 0
##$CY= 12.5
##$DATMOD= 1
##$DC= 0
##$DFILT= <>
##$DTYPP= 0
##$F1P= 14.0000005364418
##$F2P= -0.99999901652339
##$FCOR= 0.5
##$FTSIZE= 32768
##$FT_mod= 6
##$GAMMA= 0
##$GB= 0
##$INTBC= 1
##$INTSCL= 1
##$ISEN= 128
##$LB= 0.3
##$LEV0= 0
##$LPBIN= 0
##$MAXI= 10000
##$MC2= 0
##$MEAN= 0
##$ME_mod= 0
##$MI= 0
##$NCOEF= 0
##$NC_proc= -5
##$NLEV= 6
##$NOISF1= 0
##$NOISF2= 0
##$NSP= 0
##$NTH_PI= 0
##$NZP= 0
##$OFFSET= 16.45312
##$PC= 1
##$PHC0= 156.5158
##$PHC1= 3.474605
##$PH_mod= 1
##$PKNL= yes
##$PPARMOD= 0
##$PSCAL= 4
##$PSIGN= 0
##$REVERSE= no
##$SF= 250.130017226153
##$SI= 32768
##$SIGF1= 0
##$SIGF2= 0
##$SINO= 400
##$SIOLD= 32768
##$SREGLST= <1H.CDCl3>
##$SSB= 0
##$STSI= 32768
##$STSR= 0
##$SW_p= 5175.98343685301
##$SYMM= 0
##$S_DEV= 0
##$TDeff= 65536
##$TDoff= 0
##$TI= <Analysis number 999999
Compound Code 99
Book Reference 9
Project Code 9>
##$TILT= no
##$TM1= 0
##$TM2= 0
##$TOPLEV= 0
##$USERP1= <user>
##$USERP2= <user>
##$USERP3= <user>
##$USERP4= <user>
##$USERP5= <user>
##$WDW= 1
##$XDIM= 32768
##$YMAX_p= 464983999
##$YMIN_p= -1063135
$$ End of Bruker specific parameters
$$ ---------------------------------
##NTUPLES= NMR SPECTRUM
##VAR_NAME=  FREQUENCY,     SPECTRUM/REAL,   SPECTRUM/IMAG
##SYMBOL=    X,             R,               I
##VAR_TYPE=  INDEPENDENT,   DEPENDENT,       DEPENDENT
##VAR_FORM=  AFFN,          ASDF,            ASDF
##VAR_DIM=   32768,         32768,           32768
##UNITS=     HZ,            ARBITRARY UNITS, ARBITRARY UNITS
##FACTOR=    0.157963299565203, 1,           1
##FIRST=     4115.41900841861, 0,            0
##LAST=      -1060.5644284344, 0,            0
##MIN=       -1060.5644284344, -1063135,     0
##MAX=       4115.41900841861, 464983999,    0
$$ Real data points
##PAGE= N=1
##DATA TABLE= (X++(R..R)), XYDATA
$$ [...]
$$ plain form
24676 -325136 -601789 -648087 -454266 -396540 -290107 -337825 -490504 -487459 -232680 79280
24666 79280 250223 253232 356310 333135 -43392 -27326 362980 262433 -45243 -35977 -77824
24655 -77824 -221045 -285545 -323368 -452346 -358381 -154464 -122067 -286111 -493736 -529208 -381028
24644 -381028 -184605 -10236 174859 180564 154806 131961 154327 150939 480803 408251 -10882
24633 -10882 -255024 -222982 -32519 -34359 -51133 -267988 -231400 32622 -12245 124582 213334
24622 213334 61870 -107847 -456373 -788770 -912537 -615368 -424633 -50674 54880 -54678
24612 -54678 139741 287112 191229 139919 -106309 -276664 -79352 174496 136965 -29070
24602 -29070 -80688 234263 377148 227868 71523 30468 -167504 -595550 -621552 -525186
$$ packed form
24676c25136k76653m6298J93821N7726J06433m7718j52679L045K54779L11960
24666G9280J70943L009J03078k3175l76527J6066L90306j00547l07676R266m1847
24655g7824j43221o4500l7823j28978R3965K03917L2397j64044k07625l5472J48180
24644c81028J96423J74369J85095N705k5758k2845K2366l388L29864p2552m19133
24633a0882k44142L2042J90463j840j6774k16855L6588K64022m4867J36827Q8752
24622B13334j51464j69717l48526l32397j23767K97169J90735L73959J05554j09558
24612e4678J94419J47371r5883n1310k46228j70355J97312K53848l7531j66035
24602b9070n1618L14951J42885j49280j56345m1055j97972m28046k6002R6366
$$ plain form
24592 -525186 -277453 -288851 -119873 56862 -73936 85576 252013 298807 -64950 -83267
24582 -83267 35259 -316678 -364026 94742 124398 118707 -76150 -177649 -355368 -14536
24572 -14536 127613 317521 431461 228430 73278 332813 505044 381013 353751 566408
24562 566408 253173 68725 276492 384972 270095 205255 -33018 8894 -231726 -155580
24552 -155580 40620 48609 22999 -53759 27755 67280 17526 -28787 48484 39473 -182189
24541 -182189 -115801 -272553 -409822 -298043 -93362 207142 186725 -118518 -133860 -112603
24531 -112603 -398662 -236101 -113460 230671 145158 -30563 148903 179638 -2936 -127401
24521 -127401 -6470 61726 42522 -134765 -232104 105874 344124 32780 -475030 -477066
$$ packed form
24592e25186K47733j1398J68978J76735j30798J59512J66437M6794l63757j8317
24582h3267J18526l51937m7348M58768K9656n691j94857j01499j77719L40832
24572a4536J42149J89908J13940k03031j55152K59535J72231j24031k7262K12657
24562E66408l13235j84448K07767J08480j14877o4840k38273M1912k40620P6146
24552a55580J96200P989k5610p6758Q1514L9525m9754m6313P7271r011k21662
24541a82189O6388j56752j37269J11779K04681L00504k0417l05243j5342K1257
24531a12603k86059J62561J22641L44131q5513j75721J79466L0735j82574j24465
24521a27401J20931O8196j9204j77287r7339L37978K38250l11344n07810k036
$$ plain form
24511 -477066 -323790 -187576 -94105 -324696 -283649 -174453 -72707 -58182 -136557 -270407
24501 -270407 -260387 -296921 -279104 -349918 -615292 -657013 -346885 -399411 -251898 54253 27544
24490 27544 8785 -88977 8953 -37832 -35918 11315 23739 -15669 123001 234319 316930
24479 316930 240101 -76252 94433 -152649 -328062 -204968 -58061 -151283 -213478 -216161
24469 -216161 -62823 84287 129641 46137 -215854 -409117 -584238 -634197 -540544 -128695
24459 -128695 260967 392625 363350 321985 127720 -34316 62204 33346 237050 379687
24449 379687 204487 120927 306202 303140 392071 234978 -302739 -473325 -519231 -326240
24439 -326240 -348926 -57659 220076 247778 228524 245265 25040 22141 120030 -95003 -157654
$$ packed form
24511d77066J53276J36214R3471k30591M1047J09196J01746J4525p8375j33850
24501b70407J0020l6534J7817p0814k65374m1721L10128n2526J47513L06151k6709
24490B7544j8759r7762R7930m6785J914M7233J2424l9408J38670J11318Q2611
24479C16930p6829l16353J70685k47082j75413J23094J46907r3222o2195k683
24469b16161J53338J47110M5354q3504k61991j93263j75121m9959R3653M11849
24459a28695L89662J31658k9275m1365j94265j62036R6520k8858K03704J42637
24449C79687j75200q3560J85275l062Q8931j57093n37717j70586m5906J92991
24439c26240k2686K91267K77735K7702j9254J6741k20225k899R7889k15033o2651
$$ plain form
24428 -157654 44981 139582 -172165 -300384 -113768 96675 361952 262674 239535 375325
24418 375325 92881 20060 2942 193776 -117294 -223839 -82616 -92834 -335530 -547674
24408 -547674 -693885 -747835 -758658 -767551 -495923 -262742 -317897 -482932 -536723 -602701 -587061
24397 -587061 -401396 -246789 -230656 -164585 -123041 -466702 -562943 -413510 -278834 -140439
24387 -140439 -34590 -53776 -142287 -26202 41150 -113918 -176283 -20239 -91704 -332880
24377 -332880 -592987 -604149 -582458 -309728 -149264 -231288 -304470 -577367 -561043 -459246
24367 -459246 -523845 -565784 -525103 -681998 -505987 -274207 71076 246181 43250 -155776
24357 -155776 -243242 -202244 15349 -58841 -189146 -582149 -760096 -555047 -493703 -526653
$$ packed form
24428a57654K02635R4601l11747j28219J86616K10443K65277r9278k3139J35790
24418C75325k82444p2821j7118J90834l11070j06545J41223j0218k42696k12144
24408e47674j46211n3950j0823q893K71628K33181n5155j65035n3791o5978J5640
24397e87061J85665J54607J6133O6071M1544l43661r6241J49433J34676J38395
24387a40439J05849j9186q8511J16085O7352j55068o2365J56044p1465k41176
24377c32880k60107j1162K1691K72730J60464q2024p3182k72897J6324J01797
24367d59246o4599m1939M0681j56895J76011K31780L45283J75105k02931j99026
24357a55776q7466M0998K17593p4190j30305l93003j77947K05049O1344l2950
$$ plain form
24347 -526653 -449548 -331404 -95738 37135 205037 -36488 -102396 -102992 -227877 -68690
24337 -68690 131206 -35042 -81243 1639 139490 -99792 -219297 -238977 -241290 -308140 -229175
24326 -229175 -279610 -331061 -235275 -171311 -404819 -680114 -239825 -157710 -209831 -159879 111131
24315 111131 39468 190596 380026 368560 461591 177671 -103046 -42681 172830 337156
24305 337156 439424 702458 935143 559136 355193 163526 87737 -142032 -144619 -152346
24295 -152346 -347599 -265303 -12071 33673 223152 438624 658719 612635 319309 -57939
24285 -57939 -225379 -113396 8485 89333 279206 281476 153362 252747 40793 154253
24275 154253 -41518 -255032 -274188 80249 332451 246212 183490 172846 -917 150352
$$ packed form
24347e26653P7105J18144K35666J32873J67902k41525o5908n96j24885J59187
24337f8690J99896j66248m6201Q2882J37851k39282j19505j9680k313o6850P8965
24326b29175n0435n1451R5786O3964k33508k75295M40289Q2115n2121M9952K71010
24315A11131p1663J51128J89430j1466R3031k83920k80717O0365K15511J64326
24305C37156J02268K63034K32685l76007k03943j91667p5789k29769k587p727
24295a52346j95253Q2296K53232M5744J89479K15472K20095m6084k93326l77248
24285e7939j67440J11983J21881Q0848J89873K270j28114R9385k11954J13460
24275A54253j95771k13514j9156L54437K52202q6239o2722j0644j73763J51269
$$ plain form
24265 150352 -170851 -543696 -350689 -233325 -310105 -433256 -832397 -799291 -786537 -843514
24255 -843514 -713507 -706628 -516945 -426718 -297694 111481 -18970 -291594 -580605 -388368
24245 -388368 -417959 -444115 -193840 37572 47101 -15447 -132209 -181464 30416 28494 90820
24234 90820 85584 190150 225208 231919 396119 398199 272307 205516 49043 -46575 91376
24223 91376 392001 318055 399603 173931 92135 134959 176606 -90551 -268137 -457674 -362602
24212 -362602 -161894 124406 121388 -17788 152801 77594 -7352 188355 390746 582849
24202 582849 283206 -260428 -99113 50255 -19024 122137 86056 -71750 -124412 11013
24192 11013 103774 192782 80987 -18337 -77047 145224 758 -20538 59027 332899 306921
$$ packed form
24265A50352l21203l72845J93007J17364p6780j23151l99141L3106J2754n6977
24255h43514J30007O879J89683R0227J29024M09175j30451k72624k89011J92237
24245c88368k9591k6156K50275K31412R529o2548j16762m9255K11880j922O2326
24234I0820n236J04566L5058O711J64200K080j25892o6791j56473r5618J37951
24223I1376L00625p3946Q1548k25672q1796M2824M1647k67157j77586j89537R5072
24212c62602K00708K86300l018j39176J70589p5207q4946J95707K02391J92103
24202E82849k99643n43634J61315J49368o9279J41161l6081j57806n2662J35425
24192A1013R2761Q9008j11795r9324n8710K22271j44466k1296P9565K73872k5978
$$ plain form
24181 306921 269203 2008 -132102 84198 -132809 -138999 -42029 240745 -92784 -250907
24171 -250907 -136484 -173861 -287486 -265325 -402003 -228234 -42380 -28611 -79995 -189731
24161 -189731 -185094 -276843 -22384 107749 270780 113352 -43944 -5991 -96737 -208700
24151 -208700 -391168 -549862 -500935 -298711 -154329 -88842 81482 169910 188674 -65000
24141 -65000 68196 255357 -23278 -243962 -461938 -462500 -317387 -195210 -147004 -199271 -413357
24130 -413357 -512747 -536211 -410463 -339405 -236083 -11618 13149 -18065 101604 217619
24120 217619 186672 210675 174292 -173129 -359944 -247060 718 66732 212700 169608
24110 169608 16316 121712 138951 215667 123244 73910 -166803 -216880 -360763 -557316
$$ packed form
24181C06921l7718k67195j34110K16300k17007o190R6970K82774l33529j58123
24171b50907J14423l7377j13625K2161j36678J73769J85854J3769n1384j09736
24161a89731M637r1749K54459J30133J63031j57428j57296L7953r0746j11963
24151b08700j82468j58694M8927K02224J44382O5487J70324Q8428J8764k53674
24141f5000J33196J87161k78635k20684k17976n62J45113J22177M8206n2267k14086
24130d13357r9390k3464J25748P1058J03322K24465K4767l1214J19669J16015
24120B17619l0947K4003l6383l47421j86815J12884K47778O6014J45968m3092
24110A69608j53292J05396J7239P6716r2423m9334k40713n0077j43883j96553
$$ plain form
24100 -557316 -570354 -44456 262510 102170 -321231 -495381 -367402 -304474 -74995 9839
24090 9839 47587 -255528 -347902 -418492 -470662 -231719 11503 -311371 -607417 -424197 -314552
24079 -314552 -488996 -633866 -471994 -275961 -61871 44691 173607 156909 182744 242656
24069 242656 215778 150218 26344 -95591 -86347 186596 261645 322993 187270 286076 542931
24058 542931 395090 169480 -284348 -485154 -381703 -307451 -84365 96531 -194275 -332670
24048 -332670 -236776 -34775 242728 181169 -76888 -34795 -140569 -225164 -88444 -35645
24038 -35645 -351887 -354969 -10112 174544 155721 263119 502179 130547 -220702 -354960
24028 -354960 -339952 -223051 -169159 -522610 -517090 -133169 -59199 18338 19348 261150 330150
$$ packed form
24100e57316j3038N25898L06966j60340m23401j74150J27979O2928K29479Q4834
24090I839L7748l03115r2374p0590n2170K38943K43222l22874k96046J83220J09645
24079c14552j74444j44870J61872J96033K14090J06562J28916j6698K5835N9912
24069B42656k6878o5560j23874j21935R244K72943P5049O1348j35723R8806K56855
24058E42931j47841k25610m53828k00806J03451P4252K23086J80896k90806j38395
24048c32670R5894K02001K77503o1559k58057M2093j05774q4595J36720N2799
24038c5645l16242l082L44857J84656j8823J07398K39060l71632l51249j34258
24028c54960J5008J16901N3892l53451N520L83921P3970P7537J010K41802O9000
$$ plain form
24017 330150 420437 313971 136313 79670 -99036 -185860 -172759 -184139 -335236 -185007
24007 -185007 -152417 -321986 -554098 -176811 242636 111461 -278584 -172018 -141508 -159301
23997 -159301 -248775 -564367 -526815 -351798 -323923 -369092 -308695 -204177 178977 299033
23987 299033 86214 -8862 156201 -29830 79661 226081 341900 224159 197634 2774
23977 2774 -71115 -36715 22378 179101 199452 51132 105420 -154643 -284700 -171159 -172969
23966 -172969 -206767 -76154 -89944 -423859 -216760 30678 -6516 -129529 -28435 142260
23956 142260 83121 15322 -55613 18108 19345 -4929 -381795 -392483 -516618 -661786 -737839
23945 -737839 -378819 198623 341171 203467 88625 -135166 -493606 -531816 -666369 -777511
$$ packed form
24017C30150R0287j06466j77658n6643j78706q6824J3101j1380j51097J50229
24007a85007L2590j69569k32112L77287M19447j31175l90045J06566L0510j7793
23997a59301q9474l15592L7552J75017K7875m5169O0397J04518L83154J20056
23987B99033k12819r5076J65063j86031J09491J46420J15819j17741k6525j94860
23977B774p3889L4400N9093J56723K0351j48320N4288k60063j30057J13541j810
23966a72969l3798J30613j3790l33915K07099K47438l7194j23013J01094J70695
23956A42260n9139o7799p0935P3721J237k4274l76866j0688j24135j45168p6053
23945g37839L59020N77442J42548j37704j14842k23791l58440l8210j34553j11142
$$ plain form
23935 -777511 -298719 -159054 -137227 -3631 148221 53837 -146891 -18932 164519 376374
23925 376374 210653 -226419 -275207 -109857 -120327 -51267 -156188 -184990 -299394 -97454
23915 -97454 227556 293366 172243 29551 -128811 -275117 -273236 -302058 -108021 283151
23905 283151 592763 504602 75747 -179320 -106811 -316021 -530552 -283340 -26361 211455
23895 211455 209292 41257 -79383 -68433 -326444 -545430 -586991 -188450 39792 55822
23885 55822 -118308 -204080 -89512 -182853 -97240 33726 121384 -1925 105442 196028 -77793
23874 -77793 -80780 -293630 -288321 3750 218497 104896 79304 52945 78330 -7379 159241
23863 159241 69366 98423 86938 -66658 -211174 -82638 22966 285613 433888 283646
$$ packed form
23935g77511M78792J39665K1827J33596J51852r4384k00728J27959J83451K11855
23925C76374j65721m37072m8788J65350j0470O9060j04921k8802j14404K01940
23915i7454L25010O5810j21123j42692j58362j46306J881k8822J94037L91172
23905B83151L09612q8161m28855k55067P2509k09210k14531K47212K56979K37816
23895B11455k163j68035j20640J0950k58011k18986m1561L98541K28242J6030
23885E5822j74130q5772J14568r3341Q5613J30966Q7658j23309J07367R0586k73821
23874g7793k987k12850N309K92071K14747j13601k5592k6359K5385q5709J66620
23863A59241q9875K9057j1485j53596j44516J28536J05604K62647J48275j50242
$$ plain form
23853 283646 168260 61335 113311 143882 83808 -138839 -489150 -408124 -456921 -454111 -142038
23842 -142038 307775 228503 -5618 24693 -142937 -160828 174670 379993 286896 344982
23832 344982 400772 316511 160221 46424 -219627 -470006 -181859 1281 -131192 -170684
23822 -170684 15118 -111533 -69262 189070 413016 486546 343859 175252 49254 14918
23812 14918 -66048 25364 -13763 34715 152342 105093 -4580 -43777 -29124 -145709 -110093
23801 -110093 -106213 -81779 -300125 -195444 1301 356770 359100 26272 -35487 76853 357811
23790 357811 357352 146330 -63441 44823 349360 359878 3173 -70680 -12170 -163933 -216881
23779 -216881 -213432 -62521 -108398 -472151 -391745 -118160 -181848 -8697 344976 497804
$$ packed form
23853B83646j15386j06925N1976L0571o0074k22647l50311Q1026m8797K810L12073
23842a42038M49813p9272k34121L0311j67630j7891L35498K05323r3097N8086
23832C44982N5790q4261j56290j13797k66051k50379K88147J83140j32473l9492
23822a70684J85802j26651M2271K58332K23946P3530j42687j68607j25998l4336
23812A4918q0966R1412l9127M8478J17627m7249j09673l9197J4653j16585L5616
23801a10093L880K4434k18346J04681J96745L55469K330l32828o1759J12340K80958
23790C57811m59k11022k09771J08264L04537J0518l56705p3853N8510j51763n2948
23779b16881L449J50911m5877l63753Q0406K73585o3688J73151L53673J52828
$$ plain form
23769 497804 312173 -169171 -379695 -554689 -201987 17615 58775 216367 331818 458751
23759 458751 490737 387510 525025 495905 41869 172419 245192 98788 -39796 230449
23749 230449 266234 296016 236797 167991 29017 167018 306268 321226 185567 115333 194778
23738 194778 137675 -265969 -324604 -184090 219793 633097 629461 670343 371434 -170929
23728 -170929 -295938 -158243 -12700 83583 -27264 -200699 -217215 86106 161342 29075
23718 29075 -118093 95203 142338 61872 36066 -10636 -72267 -226778 -121732 -156525 -5991
23707 -5991 79858 17157 128019 146637 46852 -104062 86970 189121 4255 -395114 -115598
23696 -115598 302213 369219 -37886 -153392 -280466 -524222 -406708 -228667 -124824 -88314
$$ packed form
23769D97804j85631m81344k10524j74994L52702K19602M1160J57592J15451J26933
23759D58751L1986j03227J37515k9120m54036J30550P2773j46404j38584K70245
23749B30449L5785K9782n9219o8806j38974J38001J39250J4958j35659p0234P9445
23738A94778n7103m03644n8635J40514M03883M13304l636M0882k98909n42363
23728a70929j25009J37695J45543R6283j10847j73435j6516L03321P5236j32267
23718B9075j47168K13296M7135q0466k5806m6702o1631j54511J05046l4793J50534
23707e991Q5849o2701J10862J8618r9785j50914J91032J02151j84866l99369K79516
23696a15598M17811O7006m07105j15506j27074k43756J17514J78041J03843L6510
$$ plain form
23686 -88314 -196596 57175 248810 308308 222624 200289 225641 98704 78943 28109 39038
23675 39038 -181974 -96189 -101047 10095 58995 -27284 -127332 -87212 -45012 -66808 -171007
23664 -171007 -159620 23648 102987 -65071 -136149 23514 34514 -120748 -426768 -801251
23654 -801251 -638692 -301872 -318474 -266782 -308469 -43897 20028 -89839 -375580 -458326
23644 -458326 -227491 46575 4655 -181252 -44538 -232787 -297551 -148576 -74869 -100065
23634 -100065 133706 174128 22229 155088 199445 256477 -73100 -24498 100775 -53599
23624 -53599 44601 -74915 -357501 -290373 -52802 -136013 -199216 21563 139117 225673 20089
23613 20089 27845 -54938 -99909 -172994 -233317 -256452 20519 90370 106801 180423 425041
$$ packed form
23686h8314j08282K53771J91635N9498q5684k2335K5352j26937j9761n0834J0929
23675C9038k21012Q5785m858J11142M8900q6279j00048M0120M2200k1796j04199
23664a71007J1387J83268P9339j68058p1078J59663J1000j55262l06020l74483
23654h01251J62559L36820j6602N1692m1687K64572O3925j09867k85741q2746
23644d58326K30835K74066m1920j85907J36714j88249o4764J48975P3707k5196
23634a00065K33771M0422j51899J32859M4357N7032l29577M8602J25273j54374
23624e3599R8200j19516k82586O7128K37571q3211o3203K20779J17554Q6556k05584
23613B0089P756q2783m4971p3085o0323k3135K76971O9851J6431P3622K44618
$$ plain form
23602 425041 394610 35834 -10674 -57755 -74334 -139700 -348895 -570644 -690579 -554963
23592 -554963 -568095 -407454 -477735 -533072 -401743 -16313 -90857 -102061 44358 -115482
23582 -115482 -75285 32109 -78806 -268962 -87124 41595 -60999 76414 133123 235466
23572 235466 205747 40578 -37445 -107579 -79764 -208992 -484876 -499511 -651350 -799888
23562 -799888 -648962 -333318 -142315 -289586 -27024 -89177 -231274 -291428 -423697 -442125
23552 -442125 -339328 -268723 -176992 158933 447070 472622 501272 120196 40880 -12754 -293327
23541 -293327 -200912 -363711 -325106 -109808 211959 68764 -40551 -8559 144428 154608
23531 154608 197938 99134 216096 253596 178086 295675 30825 -51225 -4641 -14757 -48309
$$ packed form
23602D25041l0431l58776m6508m7081j6579o5366k09195k21749j19935J35616
23592e54963j3132J60641p0281n5337J31329L85430p4544j1204J46419j59840
23582a15482M0197J07394j10915j90156J81838J28719j02594J37413N6709J02343
23572B35466k9719j65169p8023p0134K7815j29228k75884j4635j51839j48538
23562g99888J50926L15644J91003j47271K62562o2153j42097o0154j32269j8428
23552d42125J02797P0605R1731L35925K88137K5552K8650l81076p9316n3634k80573
23541b93327R2415j62799L8605K15298L21767j43195j09315L1992J52987J0180
23531A54608M3330r8804J16962L7500p5510J17589k64850q2050M6584j0116l3552
$$ plain form
23520 -48309 -10370 -238250 -431408 -627389 -443722 -301521 -192175 25587 84015 -284190
23510 -284190 -161172 -281154 -369926 -167766 161845 271317 106060 234747 347693 194350
23500 194350 3928 -35822 -291141 -104385 104908 227849 193167 179266 143677 -66684
23490 -66684 84556 19078 88164 30030 -239251 -145452 157061 316910 207913 40286
23480 40286 36863 175939 272922 -15036 34374 337232 26773 -184454 -373324 -211413
23470 -211413 -297257 20631 444697 410960 176649 229541 111905 -27461 -96594 327105
23460 327105 183479 -99614 -129545 -106382 -239660 -412549 -82607 79873 -61105 -242957
23450 -242957 -140991 -56093 -108495 -156837 -201647 -249713 -404098 -340209 -707703 -634550 -342984
$$ packed form
23520d8309L7939k27880j93158j95981J83667J42201J09346K17762N8428l68205
23510b84190J23018j19982q8772K02160L29611J09472j65257J28687J12946j53343
23500A94350j90422l9750k55319J86756K09293J22941l4682j3901l5589k10361
23490f6684J51240o5478O9086n8134k69281R3799L02513J59849j08997j67627
23480D0286l423J39076R6983k87958M9410L02858l10459k11227j88870J61911
23470b11413q5844L17888M24066l3737k34311N2892j17636j39366o9133M23699
23460C27105j43626k83093k9931K3163j33278j72889L29942J62480j40978j81852
23450b42957J01966Q4898n2402m8342m4810m8066j54385O3889l67494P3153K91566
$$ plain form
23439 -342984 103103 258377 372525 282782 -23659 16604 -67710 -350683 -112053 112383
23429 112383 433049 360165 242676 298262 98045 -211911 -29606 129071 167312 182472
23419 182472 187844 41600 -103266 173265 124912 -144117 -121664 -123046 -404070 -430321 -107639
23408 -107639 158133 332380 222496 -17105 -62751 77655 -146377 -347652 -181935 -13814
23398 -13814 208782 199581 212286 184060 249932 230202 -28891 -360028 -440756 -283647 -155644
23387 -155644 -94272 -43064 -68083 -219691 -403527 -432041 -231264 -367990 -270771 -157026
23377 -157026 -59323 -112970 -328372 -223008 -188945 -278557 -340042 -56053 151650 287227
23367 287227 412242 248589 -187596 -193166 157764 411285 320538 -69515 -203711 25021
$$ packed form
23439c42984M46087J55274J14148q9743l06441M0263q4314k82973K38630K24436
23429A12383L20666p2884j17489N5586k00217l09956J82305J58677L8241J5160
23419A82472N372j46244j44866K76531m8353k69029K2453j382k81024k6251L22682
23408a07639K65772J74247j09884k39601m5646J40406k24032k01275J65717J68121
23398a3814K22596r201J2705k8226O5872j9730k59093l31137q0728J57109J28003
23387a55644O1372N1208k5019j51608j83836k8514K00777j36726R7219J13745
23377a57026R7703n3647k15402J05364L4063q9612o1485K83989K07703J35577
23367B87227J25015j63653m36185n570L50930K53521r0747l90053j34196K28732
$$ plain form
23357 25021 -399187 -448393 -302409 -423575 -132804 -66755 -36371 -59599 119733 -199142
23347 -199142 61059 507108 407552 219510 339301 467882 440330 374662 70667 -7950
23337 -7950 267532 -30168 -36508 276767 434326 421021 51189 93593 43127 36003 -205443
23326 -205443 -174306 -108166 128683 66652 18261 129358 221527 -73874 -205299 -75902
23316 -75902 -38835 -193068 -164764 90677 27493 -84735 -235392 -91522 22001 127734
23306 127734 137222 412006 585979 459798 -2834 -198115 83141 -811 -163499 145001
23296 145001 295689 11505 -283285 -398347 47436 284208 98914 14432 -287925 -262199
23286 -262199 167187 68163 -144956 -87243 -213416 -454421 -357780 -339824 -361052 -217092
$$ packed form
23357B5021m24208m9206J45984j21166K90771O6049L0384k3228J79332l18875
23347a99142K60201M46049r9556j88042J19791J28581k7552o5668l03995p8617
23337g950K75482k97700o340L13275J57559j3305l69832M2404n0466p124k41446
23326b05443L1137O6140K36849o2031m8391J11097R2169k95401j31425J29397
23316g5902L7067j54233K8304K55441o3184j12228j50657J43870J13523J05733
23306A27734R488K74784J73973j26181m62632j95281K81256q3952j62688L08500
23296A45001J50688k84184k94790j15062M45783K36772j85294q4482l02357K5726
23286b62199M29386r9024k13119N7713j26173k41005R6641J7956k1228J43960
$$ plain form
23276 -217092 -281324 -306657 -109086 35426 -81135 -282293 -254874 -25246 -83925 -218739
23266 -218739 -99810 6862 -110846 -113247 -147737 -158782 -52442 -227213 -284944 -559575
23256 -559575 -862553 -799792 -300010 -226327 -397097 -374415 -57133 -7541 -18742 -287213
23246 -287213 -317217 -293871 -341831 -62125 -274714 -517762 -556434 -392608 -344612 -366354 -736763
23235 -736763 -430588 -301759 -234151 -234173 -146839 -100777 171063 262088 251391 274391 98036
23224 98036 103985 154914 509234 694499 685774 385869 -74891 -378762 -328069 -452719 -514476
23213 -514476 -224851 -127224 -21660 181712 282302 252917 391601 269808 285790 250793
23203 250793 240955 159621 -39104 227191 -28109 -157208 -162447 -87050 -48790 31420 207273
$$ packed form
23276b17092o4232k5333J97571J44512j16561k01158K7419K29628n8679j34814
23266b18739J18929J06672j17708k401l4490j1045J06340j74771n7731k74631
23256e59575l02978O2761M99782P3683j70770K2682L17282M9592j1201k68471
23246b87213l0004K3346m7960K79706k12589k43048l8672J63826M7996k1742l70409
23235g36763L06175J28829O7608k2Q7334M6062K71840R1025j0697K3000j76355
23224I8036N949N0929L54320J85265q725k99905m60760l03871N0693j24650o1757
23213e14476K89625R7627J05564K03372J00590k9385J38684j21793J5982l4997
23203B50793r838q1334j98725K66295k55300j29099n239P5397L8260Q0210J75853
$$ plain form
23192 207273 202666 300539 201095 202655 55504 -275421 -93913 33984 39192 107947 113091
23181 113091 -226515 -600274 -400258 -258661 -262975 28449 -78694 -146751 -171272 -394165
23171 -394165 -252845 -123407 -67245 -85517 -182625 -105241 5553 133115 40965 160579
23161 160579 264973 311489 98527 -17396 -251596 -244627 -222835 -35708 83925 224163
23151 224163 239658 -30747 36976 -16717 150224 218159 205316 190861 326566 4348 -138675
23140 -138675 -43905 -36319 -234269 -97816 -183548 -350678 -128253 5665 51231 -116314
23130 -116314 -203949 -365608 -501654 -570436 -420081 -75792 178963 169818 162730 18041 -256738
23119 -256738 -124285 -40543 -17861 107024 138957 -36156 -272935 -371966 637 215588
$$ packed form
23192B07273m607R7873r9444J560j47151l30925J81508J27897N208O8755N144
23181A13091l39606l73759K00016J41597m314K91424j07143o8057k4521k22893
23171c94165J41320J29438N6162j8272r7108P7384J10794J27562r2150J19614
23161A60579J04394M6516k12962j15923k34200O969K1792J87127J19633J40238
23151B24163J5495k70405O7723n3693J66941O7935j2843j4455J35705l22218j43023
23140a38675R4770P586j97950J36453q5732j67130K22425J33918M5566j67545
23130a16314q7635j61659j36046o8782J50355L44289K54755r145p088j44689k74779
23119b56738J32453Q3742K2682J24885L1933j75113k36779r9031L72603K14951
$$ plain form
23109 215588 136190 207108 69778 -57022 -79653 -63278 -251573 -484855 -579898 -782237
23099 -782237 -844567 -568341 -491904 -385826 -68455 -164089 -246757 -230699 -45942 97514
23089 97514 -45033 -159226 -15866 64620 28824 -79362 -93916 -123522 -121825 137616 229985
23078 229985 5176 -127855 -106975 -75065 99054 121958 64574 -87380 33804 -63576
23068 -63576 -235719 -121676 -143881 32350 112569 -29466 -179969 129775 158997 79251
23058 79251 127791 -86100 -87116 -54181 -3802 -77526 -297669 -396694 -473580 -698680 -507571
23047 -507571 -164182 -103193 -135573 78387 -83887 -284979 -414808 -700145 -563738 -111625
23037 -111625 -100391 -84618 -102184 -146666 -26353 13882 -35212 -31399 -77819 -128546 -204118
$$ packed form
23109B15588p9398P0918j37330j26800k2631J6375j88295k33282r5043k02339
23099g82237o2330K76226P6437J06078L17371r5634q2668J6058J84757J43456
23089I7514j42547j14193J43360Q0486l5796j08186j4554k9606J697K59441R2369
23078B29985k24809j33031K0880L1910J74119K2904n7384j51954J21184r7380
23068f3576j72143J14043k2205J76231Q0219j42035j50503L09744K9222p9746
23058G9251M8540k13891j016L2935N0379p3724k20143r9025p6886k25100J91109
23047e07571L43389O0989l2380K13960j62274k01092j29829k85337J36407M52113
23037a11625J1234J5773j7566m4482J20313M0235m9094L813m6420n0727p5572
$$ plain form
23026 -204118 -222586 -349283 -312287 -211475 -221876 -304744 -159743 260458 446642 501162
23016 501162 535935 363727 383844 320522 223641 74369 -289230 -523814 -318744 -101243
23006 -101243 119251 -10964 -147089 49246 56746 -86789 71214 44466 47048 -113299
22996 -113299 -89508 -98490 34059 103553 -245323 -392395 -147425 53980 -75587 -149007
22986 -149007 -211957 -136673 -396266 -711795 -638894 -262383 -252561 -468583 -534465 -616693 -387542
22975 -387542 -80755 57584 93160 -256579 -586479 -503651 -432850 -221188 37832 125804
22965 125804 -81898 -139767 -360100 -370773 -42932 223206 383527 263091 259369 -130735
22955 -130735 -300957 -416312 -202079 150387 261667 100733 92733 -208758 -47905 131246
$$ packed form
23026b04118j8468j26697L6996J00812j0401q2868J45001M20201J86184N4520
23016E01162L4773j72208K0117o3322r6881j49272l63599k34584K05070K17501
23006a01243K20494j30215j36125J96335P500j43535J58003k6748K582j60347
22996a13299K3791q982J32549O9494l48876j47072K44970K01405j29567p3420
22986a49007o2950P5284k59593l15529P2901L76511R822k16022o5882q2228K29151
22975c87542L06787J38339L5576l49739l29900Q2828P0801K11662K59020Q7972
22965A25804k07702n7869k20333j0673L27841K66138J60321j20436l722l90104
22955a30735j70222j15355K14233L52466J11280j60934q000l01491J60853J79151
$$ plain form
22945 131246 208830 250712 321990 336079 151974 167302 44929 123081 145116 168098 276850
22934 276850 263087 94530 -127791 -108558 -264947 -151571 -96837 -202125 -15816 35095
22924 35095 -210131 -477350 -445430 122561 -91022 -70264 50412 252569 235262 290128
22914 290128 440239 410697 208021 156481 403743 580182 723138 360451 98917 -33093
22904 -33093 141216 -14667 -177393 -210551 -410705 -160583 -159569 -7857 -125397 -128046 97688
22893 97688 -21528 -12340 220579 408581 340102 -185383 -196579 -104033 -165348 -50143 -143547
22882 -143547 -280776 10358 161551 -43302 -275420 -298506 -319574 -228779 -147384 -182027
22872 -182027 -162113 -157412 -54523 -142128 -537756 -391476 -138534 -44297 -228167 -14855
$$ packed form
22945A31246P7584M1882P1278J4089j84105J5328j22373P8152K2035K2982J08752
22934B76850j3763j68557k22321J9233j56389J13376N4734j05288J86309N0911
22924C5095k45226k67219L1920N67991k13583K0758J20676K02157j7307N4866
22914B90128J50111k9542k02676n1540K47262J76439J42956l62687k61534j32010
22904c3093J74309j55883j62726l3158k00154K50122J014J51712j17540k649K25734
22893I7688j19216R188K32919J88002o8479n25485j1196R2546o1315J15205r3404
22882a43547j37229K91134J51193k04853k32118k3086k1068R0795Q1395l4643
22872a82027J9914M701J02889q7605l95628J46280K52942R4237j83870K13312
$$ plain form
22862 -14855 -75929 -60226 135536 34089 40248 145238 -132643 -137985 -210176 10035 48436
22851 48436 77887 157369 241744 43324 -198909 -341075 -137223 -35351 -64094 -213471
22841 -213471 -77104 122954 264019 183267 31494 44307 74119 -126711 -165143 -173694 91343
22830 91343 4289 -250730 -563264 -576578 -532468 -597297 -401853 -296426 -195245 -289595 -417565
22819 -417565 -397672 -457865 -267203 -18983 49949 8553 35032 -60329 -441655 -546939 -442618
22808 -442618 -100337 -139935 -246505 -191228 27260 35211 55526 118459 172255 117399 104360
22797 104360 248574 215173 -25049 -366107 -367520 132506 128285 -98956 -316540 -297525 -239632
22786 -239632 56068 120853 -14112 -281235 -85468 -87054 -19854 207145 -72092 -195260
$$ packed form
22862a4855o1074J5703J95762j01447O159J04990k77881n342p2191K20211L8401
22851D8436K9451P9482Q4375j98420k42233j42166K03852J01872k8743j49377
22841b13471J36367K00058J41065q0752j51773J2813K9812k00830l8432q551K65037
22830I1343q7054k55019l12534j3314M4110o4829J95444J05427J01181r4350j27970
22819d17565J9893o0193J90662K48220O8932m1396K6479r5361l81326j05284J04321
22808d42618L42281l9598j06570N5277K18488P951K0315O2933N3796n4856j3039
22797A04360J44214l3401k40222l41058j413N00026m221k27241k17584J9015N7893
22786b39632K95700O4785j34965k67123J95767j586O7200K26999k79237j23168
$$ plain form
22776 -195260 -107903 -153448 -364665 -164142 -72085 -240143 -286108 -209312 -161840 -18267 -282630
22765 -282630 -377135 -44385 -122148 -172174 -150857 -154479 168493 329368 415923 602863 278212
22754 278212 134253 -218243 -376169 -237158 -355449 -376684 -412475 -584394 -557342 -502573
22744 -502573 -331032 -247180 -328124 -328389 -515335 -325721 -69192 -42212 52677 -20261 79143
22733 79143 164609 156610 217416 111926 162239 312395 201176 -131569 -292711 -118339 -59412
22722 -59412 -94772 -195670 65438 15759 -175914 -10619 -115219 -121640 -229040 -322650 -428985
22711 -428985 -107020 172870 171690 86770 -10817 -13820 11291 -135100 89066 378543 445816
22700 445816 249101 76354 -209314 -344242 -200022 -37479 -64013 -212699 -191934 -316761
$$ packed form
22776a95260Q7357m5545k11217K00523R2057j68058m5965P6796M7472J43573k64363
22765b82630r4505L32750p7763n0026K1317l622L22972J60875Q6555J86940l24651
22754B78212j43959l52496j57926J39011j18291k1235l5791j71919K7052N4769
22744e02573J71541Q3852q0944k65j86946J89614K56529K6980R4889p2938R9404
22733G9143Q5466p999O0806j05490N0313J50156j11219l32745j61142J74372N8927
22722e9412l5360j00898K61108m9679j91673J65295j04600o421j07400r3610j06335
22711d28985L21965K79890j180q4920r7587l003K5111j46391K24166K89477O7273
22700D45816j96715j72747k85668j34928J44220J62543k6534j48686K0765j24827
$$ plain form
22690 -316761 -270043 -408886 -421681 -234035 48038 106233 213076 241035 71594 -30956
22680 -30956 -8278 -57095 281281 444181 123649 -157659 -104141 23140 89631 -30739
22670 -30739 -70551 -168211 -193454 -243224 -37291 -178638 -637658 -615497 -117324 -96148 -220122
22659 -220122 -43134 -140719 -77253 107773 60278 -321374 -296509 67384 275740 262263
22649 262263 59549 25244 85407 -140 55941 251584 71912 76735 168737 -32048 -330730
22638 -330730 -220995 161424 85929 187127 556330 707054 535475 459390 531213 540130
22628 540130 200033 39235 -56446 -109586 50212 112806 266204 280425 147889 -125882
22618 -125882 -166415 53452 120329 -5931 6508 -191466 -249536 -57105 53987 56831 -87510
$$ packed form
22690c16761M6718j38843j2795J87646K82073N8195J06843K7959j69441j02550
22680c0956K2678m8817L38376J62900l20532k81308N3518J27281O6491j20370
22670c0739l9812r7660k5243m9770K05933j41347m59020K2161M98173K1176j23974
22659b20122J76988r7585O3466J85026m7495l81652K4865L63893K08356j3477
22649B62263k02714l4305O0163q5547N6081J95643j79672M823R2002k00785k98682
22638c30730J09735L82419p5495J01198L69203J50724j71579p6085P1823Q917
22628E40130l40097j60798r5681n3140J59798O2594J53398J4221j32536k73771
22618a25882m0533K19867O6877j26260J2439j97974n8070J92431J11092K844j44341
$$ plain form
22607 -87510 -305776 -240929 -66221 -79438 106012 194376 148208 80436 164507 666 -82631
22596 -82631 -50417 47341 -50199 33925 83498 57245 75995 164543 162857 -14617 -68947 1841
22584 1841 -231103 -497996 -389224 -104072 -51998 -45328 -39695 -44868 -65185 -7283 -76806 182485
22572 182485 198347 129178 54239 -19638 -15814 -3754 121653 216044 143416 244727 111500
22561 111500 -25815 85484 153001 -214562 -378446 -126332 152186 52210 -63823 -322415
22551 -322415 -65239 203715 182009 -84056 -303714 -231376 -256915 -162965 -95404 -68092 -209948
22540 -209948 -80177 28415 -89914 -181460 -312224 -394321 -288347 -230630 -303065 -161512
22530 -161512 185287 208480 143747 -50759 -227688 -82733 11521 93845 76068 -246428
$$ packed form
22607h7510k18266O4847J74708j3217J85450Q8364m6168o7772Q4071j63841q3297
22596h2631L2214R7758r7540Q4124M9573k6253J8750Q8548j686j77474n4330P0788
22584A841k32944k66893J08772K85152N2074O670N633n173k0317N7902o9523K59291
22572A82485J5862o9169p4939p3877L824J2060J25407R4391p2628J01311j33227
22561A11500j37315J11299O7517l67563j63884K52114K78518r9976j16033k58592
22551c22415K57176K68954k1706k66065k19658P2338k5539R3950O7561K7312j41856
22540b09948J29771J08592j18329r1546j30764q2097J05974N7717p2435J41553
22530a61512L46799K3193o4733j94506j76929J44955R4254Q2324j7777l22496
$$ plain form
22520 -246428 -519514 -366641 -241513 -193200 68529 253471 18582 -9023 -122107 46205
22510 46205 254748 106767 -123158 -218652 -256283 -385401 -180517 -76477 -402309 -451583
22500 -451583 -321308 -422425 -644979 -512432 -167899 -72955 -196721 -194163 -305498 -296839
22490 -296839 6496 40854 -9489 -219179 -250780 8757 -71096 -118477 -102102 196981 216570
22479 216570 5537 -260990 -208760 -247098 -272003 -224296 -128990 -354532 -538774 -446893 -203404
22468 -203404 -27131 120721 153798 -3710 -49473 -184015 -310308 43636 200725 188801
22458 188801 -140762 -137605 76680 46892 116468 140114 285765 22920 -308916 -489008
22448 -489008 -534557 -398018 -68192 -197464 -434699 -257355 -237771 -83589 -55464 -127254
$$ packed form
22520b46428k73086J52873J25128M8313K61729J84942k34889k7605j13084J68312
22510D6205K08543j47981k29925r5494l7631j29118K04884J04040l25832m9274
22500d51583J30275j01117k22554J32547L44533R4944j23766K558j11335Q659
22490b96839L03335L4358n0343k09690l1601K59537p9853m7381J6375K99083J9589
22479B16570k11033k66527N2230l8338k4905M7707R5306k25542j84242R1881K43489
22468b03404J76273J47852L3077j57508m5763j34542j26293L53944J57089j1924
22458A88801l29563L157K14285k9788O9576K3646J45651k62845l31836j80092
22448d89008m5549J36539L29826j29272k37235J77344J9584J54182K8125p1790
$$ plain form
22438 -127254 -204430 -384778 -182069 207161 151590 132976 98148 7202 149669 -167857
22428 -167857 -164940 98313 115529 93348 344581 310817 234423 148162 -5806 80818 75884
22417 75884 -118779 -110882 -47238 -261025 -399917 -255545 57226 222724 274480 -31540
22407 -31540 -134800 -123927 -232411 -350304 -316163 -444402 -279880 174775 489292 298158
22397 298158 151271 160363 -58049 -40966 -6828 36845 24134 -154620 -10790 112049 -89439
22386 -89439 -177223 -103833 -170354 -136163 -340021 -394110 -260642 -79978 -56402 93478 -152257
22375 -152257 -82296 -41406 3056 5726 -10052 163448 88871 -156012 -459318 -301282 -106543
22364 -106543 6947 111280 160112 -5820 -62885 -140136 -90247 203321 231432 384510
$$ packed form
22438a27254p7176j80348K02709L89230n5571j8614l4828r0946J42467l17526
22428a67857K917K63253J7216k2181K51233l3764p6394q6261j53968Q6624m934
22417G5884j94663P897O3644k13787j38892J44372L12771J65498N1756l06020
22407c1540j03260J0873j08484j17893L4141j28239J64522M54655L14517j91134
22397B98158j46887R092k18412J7083L4138M3673j2711j78754J43830J22839k01488
22386h9439q7784P3390o6521L4191k03858n4089J33468J80664K3576J49880k45735
22375a52257O9961M0890M4462K670j5778J73500p4577k44883l03306J58036J94739
22364a06543J13490J04333M8832j65932n7065p7251M9889K93568K8111J53078
$$ plain form
22354 384510 326740 11101 -233047 -677223 -598021 -379405 -227914 -92992 225022 405550
22344 405550 324001 -17903 -279331 -329149 -196410 -86442 -125815 -196026 -332869 -284638
22334 -284638 -234739 -459464 -571958 -421199 -426982 -415243 -254263 44583 211731 -26152
22324 -26152 -213017 -79546 114027 63206 132509 352178 363974 516003 387840 81398
22314 81398 84424 80919 243505 152886 -399278 -610284 -592594 -354046 -303199 -389129 -399647
22303 -399647 -416945 -51345 44140 152239 280639 84933 89499 269599 105193 -372765
22293 -372765 -645641 -570910 -301682 -194116 68633 47342 13715 10702 117043 168887 172444
22282 172444 360718 528075 474867 573278 595483 395065 353232 335327 265784 -135184 -187841
$$ packed form
22354C84510n7770l15639k44148m44176P9202K18616J51491J34922L18014J80528
22344D05550q1549l41904k61428m9818J32739J09968l9373p0211j36843M8231
22334b84638M9899k24725j12494J50759n783J1739J60980K98846J67148k37883
22324b6152j86865J33471J93573n0821O9303K19669J1796J52029j28163l06442
22314H1398L026l505J62586r0619n52164k11006J7690K38548N0847q5930j0518
22303c99647j7298L65600R5485J08099J28400j95706M566J80100j64406m77958
22293c72765k72876P4731K69228J07566K62749k1291l3627l013J06341N1844L557
22282A72444J88274J67357n3208R8411K2205k00418m1833j7905o9543m00968n2657
$$ plain form
22271 -187841 -144375 115904 -68 -214566 -181948 -123602 -204890 -145369 -11873 105192
22261 105192 317197 436954 429840 314362 -51227 -232101 -73331 140845 2697 7927
22251 7927 96898 -159755 77773 23676 -118726 -122891 33987 -207366 -411555 -392673 -280049
22240 -280049 -437502 -312278 -343751 -355720 -383495 -308695 -267636 -210964 -255850 -250797 -129025
22229 -129025 -178686 -418059 -389420 -295068 -379446 -386235 -397577 84346 367527 444685 395316
22218 395316 394613 270316 118000 -58751 -105321 99969 438062 287616 326763 351234 69846
22207 69846 57584 -37772 -227373 -395243 -479277 -275932 -276736 -241011 -356894 -322846 -155915
22196 -155915 -131628 -133878 -234224 -326647 -205903 6323 104375 -58392 -272972 -229349 -126409
$$ packed form
22271a87841M3466K60279j15972k14498L2618N8346q1288N9521J33496J17065
22261A05192K12005J19757p114j15478l65589j80874J58770K14176j38148N230
22251G927Q8971k56653K37528n4097j42402m165J56878k41353k04189J8882J12624
22240b80049j57453J25224l1473j1969k7775P4800M1059N6672m4886N053J21772
22229a29025m9661k39373K8639R4352q4378o789j1342M81923K83181P7158m9369
22218C95316p03j24297j52316j76751m6570K05290L38093j50446L9147K4471k81388
22207F9846j2262r5356j89601j67870q4034K03345q04L5725j15883L4048J66931
22196a55915K4287k250j00346r2423J20744K12226R8052j62767k14580M3623J02940
$$ plain form
22185 -126409 -218297 -83953 -63788 -262585 -246593 -189078 -55306 -89216 -7333 17133 -122181
22174 -122181 -412877 -304787 -45799 68414 -115839 14769 125768 263267 376319 385761
22164 385761 281352 173811 194265 96104 -156663 -374214 -385315 16977 11849 6894 -38460
22153 -38460 -96157 -15837 109188 274973 304991 152667 116559 -2210 -161942 -207236 -198586
22142 -198586 -217733 -260066 -247171 -177158 -152611 -36629 53618 278021 174296 19976 138880
22131 138880 -6329 -118464 115094 -149402 13445 330527 375645 501181 535575 353531
22121 353531 325530 114810 288036 420485 347321 137871 -138752 -181209 -250219 -223354
22111 -223354 -206366 -148703 19719 -65497 -179668 -363270 -316018 -345344 -333281 -484754 -443958
$$ packed form
22185a26409r1888J34344K0165j98797J5992N7515J33772l3910Q1883K4466j39314
22174a22181k90696J08090K58988J14213j84253J30608J10999J37499J13052R442
22164C85761j04409j07541K0454r8161k52767k17551j1101M02292n128m955m5354
22153c8460n7697Q0320J25025J65785L0018j52324l6108j18769j59732m5294Q650
22142a98586j9147m2333J2895P0013K4547J15982R0247K24403j03725j54320J18904
22131A38880j45209j12135K33558k64496J62847L17082M5118J25536L4394j82044
22121C53531k8001k10720J73226J32449p3164k09450k76623m2457o9010K6865
22111b23354J6988N7663J68422q5216j14171j83602M7252k9326J2063j51473M0796
$$ plain form
22100 -443958 -279963 -54559 105511 16056 -121744 -189449 -158684 -83087 134311 204490
22090 204490 17560 -253838 -366741 -254687 -297314 -180578 -116893 -171658 -276938 -38790
22080 -38790 116261 67494 267862 258524 161558 39951 -46359 -159666 -222848 -125640 76446
22069 76446 197301 227418 40362 35662 -90030 -192545 -434543 -636064 -416695 -31611
22059 -31611 217644 256783 408965 357362 67058 111574 263163 39530 -129044 -180060
22049 -180060 -161261 -177296 -50505 152536 121472 -173895 -82379 41229 124587 41218 -218779
22038 -218779 -111987 -84887 -218723 -191340 -36875 82590 244843 107875 117682 191927
22028 191927 -31539 42798 -111984 -128548 -220204 -306081 -251743 -420002 -188879 39578
$$ packed form
22100d43958J63995K25404J60070q9455j37800o7705L0765P5597K17398P0179
22090B04490j86930k71398j12903J12054m2627J16736O3685n4765j05280K38148
22080c8790J55051m8767K00368r338r6966j21607q6310j13307o3182R7208K02086
22069G6446J20855L0117j87056m700j25692j02515k41998k01521K19369L85084
22059c1611K49255L9139J52182n1603k90304M4516J51589k23633j68574n1016
22049a80060J8799j6035J26791K03041l1064k95367R1516J23608Q3358q3369k59997
22038b18779J06792K7100j33836K7383J54465J19465J62253j36968R807P4245
22028A91927k23466P4337j54782j6564r1656q5877N4338j68259K31123K28457
$$ plain form
22018 39578 -19426 -154870 -262751 134271 42516 -428878 -699757 -501825 -330656 -348138
22008 -348138 -546083 -468747 -424391 -549694 -551730 -546542 -457074 -367813 -326727 -388655 -574706
21997 -574706 -459419 -399315 -70131 42752 229386 -16481 -168541 -154350 62328 286
21987 286 1782 -34986 36356 101899 -82345 -347283 -193246 241794 498252 490587 236164
21976 236164 -95053 -246386 -253073 -214333 -81605 -59057 -41022 -242284 -361623 -276981 -97421
21965 -97421 -108918 -142244 -130205 -226100 -189167 -52085 93128 199533 139802 40310 227706
21954 227706 240265 82147 13867 180812 204945 36029 -309887 -275209 -259827 -113504
21944 -113504 -44289 -215940 -303140 -571452 -516954 -362451 -275098 -455465 -415794 -141558
$$ packed form
22018C9578n9004j35444j07881L97022r1755m71394k70879J97932J71169j7482
22008c48138j97945P7336M4356j25303k036N188Q9468Q9261M1086o1928j86051
21997e74706J15287O0104L29184J12883J86634k45867j52060J4191K16678o2042
21987B86J496l6768P1342O5543j84244k64938J54037M35040K56458p665k54423
21976B36164l31217j51333o687L8740J32728K2548J8035k01262j19339Q4642J79560
21965i7421j1497l3326J2039r5895L6933J37082J45213J06405n9731r9492J87396
21954B27706J2559j58118o8280J66945K4133j68916l45916L4678J5382J46323
21944a13504O9215j71651q7200k68312N4498J54503Q7353j80367L9671K74236
$$ plain form
21934 -141558 -4473 -142209 -315099 -552921 -628443 -517250 -586744 -407423 -201327 -234378
21924 -234378 -461790 -405124 -331776 -166491 -169594 -157031 3620 51112 134257 78396 -6723
21913 -6723 72253 166861 -25360 -301449 -51392 -205813 -263732 -61445 116806 21131 112438
21902 112438 154232 82617 27640 41392 -157796 -391882 -342219 -306051 -301163 -133202 143426
21891 143426 24528 -573578 -538288 -281155 -97691 729 45082 -149524 -32295 96680
21881 96680 13152 -180974 -170667 41633 67313 190185 315242 167722 -62204 -151166
21871 -151166 58103 -254672 -532175 -315647 -44770 117706 -40619 -241141 -361062 -352351
21861 -352351 -369572 -762034 -741211 -600438 -134784 -120829 158849 675280 703531 416483
$$ packed form
21934a41558J37085j37736j72890k37822p5522J11193o9494J79321K06096l3051
21924b34378k27412N6666P3348J65285l103J2563J60651M7492Q3145n5861q5119
21913f723P8976R4608j92221k76089K50057j54421n7919K02287J78251r5675R1307
21902A12438M1794p1615n4977J3752j99188k34086M9663L6168M888J67961K76628
21891A43426j18898n98106L5290K57133J83464R8420M4353j94606J17229J28975
21881I6680q3528j94126J0307K12300K5680J22872J25057j47520k29926q8962
21871a51166K09269l12775k77503K16528K70877J62476j58325k00522j19921Q711
21861c52351j7221l92462K0823J40773M65654J3955K79678N16431K8251k87048
$$ plain form
21851 416483 214874 -63260 -179980 -192112 -303086 -145913 -4468 117441 260755 204224
21841 204224 35505 -159873 -431611 -323906 -245193 -231716 -274012 -407618 -233095 -211957
21831 -211957 -401584 -328636 -250863 -179318 124182 209574 541169 492281 442228 292572 143589
21820 143589 -110278 -453096 -367910 -98066 133279 373743 335008 139598 238055 111657
21810 111657 206557 373280 76515 -123066 -161018 -88081 -70638 -309478 -471793 -480366 -206012
21799 -206012 -180736 56391 79811 -44236 -3699 367577 255569 -140982 -337162 -357409
21789 -357409 -263540 -84457 -99075 12577 -39460 -493 -123740 -225361 -157626 122579
21779 122579 102845 89409 163485 247642 284992 252757 87665 122487 17032 -268050 -417107
$$ packed form
21851D16483k01609k78134j16720j2132j10974J57173J41445J21909J43314n6531
21841B04224j68719j95378k71738J07705P8713J3477m2296j33606J74523K1138
21831b11957j89627P2948P7773P1545L03500Q5392L31595m8888n0053j49656j48983
21820A43589k53867l42818Q5186K69844K31345K40464l8735j95410R8457j26398
21810A11657R4900J66723k96765j99581l7952P2937J7443k38840j62315q573K74354
21799b06012K5276K37127K3420j24047M0537L71276j12008l96551j96180k0247
21789c57409R3869J79083j4618J11652n2037L8967j23247j01621O7735K80205
21779A22579j9734j3436P4076Q4157L7350l2235j65092L4822j05455k85082j49057
$$ plain form
21768 -417107 -186101 -157942 -321877 -189852 -39988 51256 -83113 60473 -48402 -198009
21758 -198009 -183810 -147393 -352843 -451857 -437273 -541501 -512228 -261845 -120792 -24723 -109948
21747 -109948 9474 43415 -145526 -162084 -426899 -316126 -74863 -463385 -367974 -187082
21737 -187082 -206001 -362240 -143486 -294839 -356409 -380200 -333442 -248747 72024 120405 -116129
21726 -116129 -390766 -459901 -474813 -505370 -343252 -390858 -126787 -118540 -191892 -341184 -283127
21715 -283127 -257286 -404300 -279416 -81055 14936 516732 433822 -26672 -396750 -422806
21705 -422806 -311962 -289429 -378595 -602745 -696973 -555394 -400795 -246336 -383442 65356
21695 65356 428642 328087 71706 -150960 -312158 -264326 -253415 -102824 -79523 -262671
$$ packed form
21768d17107K31006K8159j63935J32025J49864R1244j34369J43586j08875j49607
21758a98009J4199L6417k05450r9014J4584j04228K9273K50383J41053R6069q5225
21747a09948J19422L3941j88941j6558k64815J10773K41263l88522R5411J80892
21737a87082j8919j56239K18754j51353o1570k3791M6758Q4695L20771M8381k36534
21726a16129k74637o9135j4912l0557J62118m7606K64071Q247p3352j49292N8057
21715b83127K5841j47014J24884J98361R5991N01796q2910m60494l70078k6056
21705d22806J10844K2533q9166k24150r4228J41579J54599J54459j37106M48798
21695F5356L63286j00555k56381k22666j61198M7832J0911J50591K3301j83148
$$ plain form
21685 -262671 -369367 -216609 22368 -79880 127091 265680 229406 264480 18683 -109000
21675 -109000 12087 107432 -75050 -137577 -489225 -713784 -757949 -498981 -110532 269321
21665 269321 281716 117780 92187 88846 274631 290737 24018 -105927 -142796 136689 -656
21654 -656 -247523 -146794 79616 -72753 -317201 -366091 -384420 -100513 -84565 -129994 -236758
21643 -236758 -308842 -190996 -67605 -351789 -302570 -202759 -148275 -36149 -113191 -169006 20917
21632 20917 -144619 -232891 -313653 -364075 -289621 -275117 -282272 -238500 -281308 -309351 71350
21621 71350 177413 -32128 -263041 -332012 -279139 -221002 -150932 181440 321619 483408
21611 483408 244426 101844 318244 239784 -13773 5928 242568 209578 80553 100419
$$ packed form
21685b62671j06696J52758K38977j02248K06971J38589l6274L5074k45797j27683
21675a09000J21087R5345j82482o2527l51648k24559m4165K58968L88449L79853
21665B69321J2395j63936k5593l341J85785J6106k66719j29945l6869K79485j37345
21654f56k46867J00729K26410j52369k44448m8890j8329K83907J5948m5429j06764
21643b36758p2084J17846J23391k84184M9219R9811N4484J12126p7042n5815J89923
21632B0917j65536q8272q0762n0422P4454J4504p155M3772m2808k8043L80701
21621G1350J06063k09541k30913o8971N2873N8137P0070L32372J40179J61789
21611D83408k38982j42582K16400p8460k53557J9701K36640l2990j29025J9866
$$ plain form
21601 100419 -116291 -300049 -412881 -456766 -305921 -224314 -19716 -100367 -50331 -92870
21591 -92870 -157961 -345878 -133495 136459 3395 94197 438382 283452 85431 -77978
21581 -77978 -145142 -203413 -185791 -181703 -1909 15209 -93614 30572 118340 239408 -26051
21570 -26051 -196813 -222961 -386801 -308690 109265 179250 20168 -130248 -392218 -336403
21560 -336403 -257529 -20635 -106868 -134451 95607 41166 -142503 -47939 203869 96675
21550 96675 -31323 129871 308247 121816 125029 324042 308062 363509 208666 52656
21540 52656 -128818 -28346 36659 -15721 -48500 -112273 -74704 -138421 -283212 -457441 -444196
21529 -444196 -195461 43988 1874 -30860 12780 100041 127905 168993 270559 33894 -193062
$$ packed form
21601A00419k16710j83758j12832m3885J50845Q1607K04598q0651N0036m2539
21591i2870o5091j87917K12383K69954j33064R0802L44185j54930j98021j63409
21581g7978o7164n8271J7622M088J79794J7118j08823J24186Q7768J21068k65459
21570b6051j70762k6148j63840P8111M17955O9985j59082j50416k61970N5815
21560c36403P8874K36894q6233k7583K30058n4441j83669R4564K51808j07194
21550I6675j27998J61194J78376j86431L213J99013j5980N5447j54843j56010
21540E2656j81474J00472O5005n2380l2779o3773L7569o3717j44791j74229J3245
21529d44196K48735K39449m2114l2734M3640Q7261K7864M1088J01566k36665k26956
$$ plain form
21518 -193062 -57414 -111605 -9832 -43755 -269265 -341506 -293917 -114304 -14644 223321
21508 223321 361363 352102 508660 363601 -89301 -292118 -325277 -250975 -286783 -541614
21498 -541614 -414891 -96533 199803 73734 -114761 -165594 -81269 -186892 -414961 -595236
21488 -595236 -471392 -195540 -40094 87891 71374 -226482 -359646 -137376 -165239 -225275
21478 -225275 -206280 -207826 -476619 -720222 -433506 -74999 87039 106482 -44049 -8188
21468 -8188 -112877 -94312 142285 -18978 147273 323100 372697 256424 158027 -65658
21458 -65658 -181859 -100390 90826 -172684 -263045 61542 -2283 10210 3201 -116999 -132519
21447 -132519 -33247 -67310 -226895 -461774 -303231 -532763 -412663 -576489 -514368 -166098
$$ packed form
21518a93062J35648n4191J01773l3923k25510p2241M7589J79613R9660K37965
21508B23321J38042r261J56558j45059m52902k02817l3159P4302l5808k54831
21498e41614J26723L18358K96336j26069j88495n0833Q4325j05623k28069j80275
21488e95236J23844K75852J55446J27985j6517k97856j33164K22270k7863o0036
21478b25275J8995j546k68793k43603K86716L58507J62038J9443j50531L5861
21468h188j04689J8565K36597j61263J66251J75827M9597j16273r8397k23685
21458f5658j16201Q1469J91216k63510r0361L24587o3825J2493p009j20200j5520
21447a32519R9272l4063j59585k34879J58543k29532J20100j63826O2121L48270
$$ plain form
21437 -166098 -79692 86104 321522 429731 543022 382468 151918 68611 -137478 60109
21427 60109 268681 347144 530524 681444 548594 340463 -119932 -162871 -207091 -36398
21417 -36398 86988 65146 60670 -228857 -177085 33930 316314 447652 399464 117588 -237315
21406 -237315 -386081 -3428 261554 232294 128230 76673 234726 370066 592253 583525
21396 583525 410456 189654 -282130 -118397 -121372 -18208 -67594 -18499 2823 -189068
21386 -189068 -256725 -335510 -449092 -214595 266751 163344 697 -191223 21952 -86912
21376 -86912 -147460 -47370 -129130 -146488 109802 5889 -206228 148258 172758 -227923
21366 -227923 -402308 -180492 -137820 -456759 -613248 -608755 -730294 -512919 -127861 -66615
$$ packed form
21437a66098Q6406J65796K35418J08209J13291j60554k30550q3307k06089J97587
21427F0109K08572P8463J83380J50920j32850k08131m60395m2939m4220J70693
21417c6398J23386k1842m476k89527N1772K11015K82384J31338m8188k81876l54903
21406b37315j48766L82653K64982k9260j04064n1557J58053J35340K22187q728
21396E83525j73069k20802m71784J63733k975J03164m9386M9095K1322j91891
21386a89068o7657p8785j13582K34497M81346j03407j62647j91920K13175j08864
21376h6912o0548J00090q1760j7358K56290j03913k12117L54486K4500m00681
21366b27923j74385K21816M2672l18939j56489M493j21539K17375L85058O1246
$$ plain form
21356 -66615 -4189 72152 -81237 -159509 -74330 -194916 -51913 -54378 -58362 -42562 20773
21345 20773 -68495 -350281 -225217 -150637 27988 -301 -451524 -449845 -179408 -67152 -53296
21334 -53296 69045 242 -162417 -233764 -285157 -43327 -77459 -45535 5074 123903 124182
21323 124182 108079 -240510 -252135 -387417 -542650 -361561 64847 94774 1213 112934
21313 112934 333434 509109 448905 271170 -23853 -37211 123412 -31439 -72523 301869
21303 301869 264064 66265 -41803 -446095 -570917 -182675 86384 234355 680206 594374
21293 594374 489930 409342 466501 396731 339689 284949 194770 149679 -303083 -440939 -462941
21282 -462941 -203216 39637 7809 -74270 -385023 -360997 -315476 77829 38156 -428386
$$ packed form
21356f6615O2426P6341j53389p8272Q5179j20586J43003k465l984J5800O3335
21345B0773q9268k81786J25064P4580J78625k8289m51223J679K70437J12256J3856
21334e3296J22341o8803j62659p1347n1393K41830l4132L1924N0609J18829K79
21323A24182j6103l48589j1625j35282j55233J81089M26408K9927r3561J11721
21313A12934K20500J75675o0204j77735k95023j3358J60623j54851m1084L74392
21303C01869l7805j97799j08068m04292j24822L88242K69059J47971M45851q5832
21293E94374j04444q0588N7159o9770n7042n4740r0179m5091m52762j37856k2002
21282d62941K59725K42853l1828q2079l10753K4026M5521L93305l9673m66542
$$ plain form
21272 -428386 -429050 -258115 -143617 -192026 -259241 -271136 -31173 -171315 -119447 -298120 -339467
21261 -339467 -147908 18879 186298 205372 114111 59872 -95533 -118824 169262 149537
21251 149537 -54412 127946 209679 2896 80369 211845 232284 55304 -94527 -303637
21241 -303637 -335086 -215864 -211874 -247437 -172135 -49890 241219 217949 230795 254371 348123
21230 348123 321274 336640 171922 25059 -102402 70306 158206 16127 43933 147973
21220 147973 -106521 -189942 -145469 -84971 138322 93355 104976 138711 84596 50501 78769
21209 78769 118194 153140 336030 277875 102168 153154 23537 -102698 -226161 -210102 -3524
21198 -3524 -166216 17223 397688 381232 219660 359111 559544 525922 -36441 -194593
$$ packed form
21272d28386o64J70935J14498m8409o7215j1895K39963j40142N1868j78673m1347
21261c39467J91559J66787J67419J9074r1261n4239j55405k3291K88086j9725
21251A49537k03949J82358Q1733k06783P7473J31476K0439j76980j49831k09110
21241c03637l1449J19222L990l5563P5302J22245K91109k3270J2846K3576R3752
21230C48123k6849J5366j64718j46863j27461J72708Q7900j42079K7806J04040
21220A47973k54494q3421M4473O0498K23293m4967J1621L3735n4115l4095K8268
21209G8769L9425L4946J82890n8155j75707N0986j29617j26235j23463J6059K06578
21198c524j62692J83439L80465j6456j61572J39451K00433l3622n62363j58152
$$ plain form
21188 -194593 -27210 106106 137941 165057 -5629 -3248 103816 237506 57407 -50429
21178 -50429 -127578 -237183 -176662 -435456 -158047 128594 44619 113328 150566 -30867 -77063
21167 -77063 -264173 -108646 -68923 -4168 77929 -56017 78491 270236 398315 255362
21157 255362 138142 11115 246326 245271 167721 88188 2169 30876 139275 368512 287494
21146 287494 178785 26154 43770 295124 219276 154804 165763 -2895 -169307 -296481
21136 -296481 -298574 -62169 207831 293797 298294 613237 1104696 1653580 2084594 1962835
21126 1962835 1822589 1934963 1973201 2011652 1960712 1897682 2054214 1654727 1766056 1955128
21116 1955128 2202554 2275099 2158844 2133754 2180373 2350812 2241235 1805702 1370225 1130511
$$ packed form
21188a94593J67383J33316L1835K7116j70686K381J07064J33690j80099j07836
21178e0429p7149j09605O0521k58794K77409K86641q3975O8709L7238j81433m6196
21167g7063j87110J55527L9723O4755Q2097j33946J34508J91745J28079j42953
21157B55362j17220j27027K35211j055p7550p9533q6019K8707J08399K29237q1018
21146B87494j08709j52631J7616K51354p5848o4472J0959j68658j66412j27174
21136b96481k093K36405K70000Q5966M497L14943M91459N48884M31014j21759
21126A962835j40246J12374L8238L8451n0940o3030J56532l99487J11329J89072
21116A955128K47426P2545j16255k5090M6619J70439j09577m35533m35477k39714
$$ plain form
21106 1130511 864534 685726 829089 722156 848250 807674 774294 564948 448244 378997
21096 378997 384811 478773 341596 282211 429393 415465 190452 374016 302912 124583 172151
21085 172151 375789 120457 -70891 128744 296783 375809 481034 531770 548794 162168
21075 162168 103048 300149 286841 114709 643802 507446 375762 293350 263683 275832
21065 275832 173429 259467 299263 307184 432434 178045 121023 164524 153183 -6915 189346
21054 189346 203643 421386 61746 -118848 104637 362551 344376 258492 142937 87008
21044 87008 173107 232070 137096 297410 238100 240745 288304 302620 137251 167738 336641
21033 336641 254329 360351 304245 273392 161340 135538 -90855 -94912 161048 -179148 -277668
$$ packed form
21106A130511k65977j78808J43363j06933J26094m0576l3380k09346j16704o9247
21096C78997N814R3962j37177n9385J47182j3928k25013J83564p1104j78329M7568
21085A72151K03638k55332j91348J99635J68039P9026J05225N0736J7024l86626
21075A62168n9120J97101j3308j72132N29093j36356j31684q2412k9667J2149
21065B75832j02403Q6038L9796P921J25250k54389n7022M3501j1341j60098J96261
21054A89346J4297K17743l59640j80594K23485K57914j8175q5884j15555n5929
21044H7008Q6099N8963r4974J60314n9310K645M7559J4316j65369L0487J68903
21033C36641q2312J06022n6106l0853j12052k5802k26393m057K55960l40196r8520
$$ plain form
21022 -277668 -203335 -191194 -40854 439708 665759 572900 329419 330191 404111 330830 60662
21011 60662 -39177 82176 310614 392585 518407 916378 1414416 1778658 1984214 1909856
21001 1909856 1363678 1024396 1009174 728165 350911 -7941 46641 181432 149561 279476
20991 279476 328253 588406 674621 600680 402618 224832 81561 177821 256330 470997
20981 470997 334480 51635 27324 172226 116369 232919 644703 448152 368205 590695
20971 590695 594932 248177 1572 -248325 -259530 -403095 -399542 -145413 621 -58841 -439378
20960 -439378 -565644 -402818 -127172 69195 38244 -207091 -247583 -267731 -225223 -220630 132291
20949 132291 385271 392174 142609 20435 667 -4290 -11836 -190858 -209003 -10786 -23302
$$ packed form
21022b77668P4333J2141J50340M80562K26051r2859k43481P72P3920p3281k70168
21011F0662r9839J21353K28438Q1971J25822L97971M98038L64242K05556p4358
21001A909856n46178l39282j5222k81009l77254l58852N4582J34791l1871J29915
20991B79476M8777K60153Q6215p3941j98062j77786j43271R6260P8509K14667
20981D70997j36517k82845k4311J44902n5857J16550M11784j96551p9947K22490
20971E90695M237l46755k46605k49897j1205j43565L553K54129J46034n9462l80537
20960d39378j26266J62826K75646J96367l0951k45335m0492k0148M2508M593L52921
20949A32291K52980O903k49565j22174j9768m957p546j79022j8145J98217j2516
$$ plain form
20938 -23302 -251864 -285911 243029 283598 178314 376240 402598 23388 -361943 -574938
20928 -574938 -335934 -132184 30331 -146761 -221934 63178 41359 -146967 -139486 -277551
20918 -277551 -110068 190887 249103 252662 379601 663182 1152789 1009165 560547 103127
20908 103127 288868 527963 619144 444616 623163 737441 622757 686163 698523 701529
20898 701529 327083 349691 505397 559649 580330 541552 619285 604578 657833 660819 812025
20887 812025 633445 721754 731684 724354 454968 175063 83281 263816 122678 206714 234279
20876 234279 317315 299447 179008 -85925 -262807 -231316 -156882 -169427 -247991 -281091 -278196
20865 -278196 -342487 -231321 186681 164707 376079 452991 136488 77840 186570 353266
$$ packed form
20938b3302k28562l4047N28940M0569j05284J97926K6358l79210l85331k12995
20928e74938K39004K03750J62515j77092p5173K85112k1819j88326P481j38065
20918b77551J67483L00955N8216L559J26939K83581M89607j43624m48618m57420
20908A03127J85741K39095R1181j74528J78547J14278j14684O3406J2360L006
20898G01529l74446K2608J55706N4252K0681l8778P7733j4707N3255K986J51206
20887H12025j78580Q8309R930p330k69386k79905r1782J80535j41138Q4036K7565
20876B34279Q3036j7868j20439k64933j76882L1491P4434j2545p8564l3100K895
20865b78196o4291J11166M18002k1974K11372P6912l16503n8648J08730J66696
$$ plain form
20855 353266 511548 612327 505816 572907 539241 664692 663285 692563 635803 390448 159259
20844 159259 48512 44489 225663 418615 390266 437091 779286 924993 1014544 848173
20834 848173 884748 968475 875751 1024643 1040306 835173 295211 268459 677890 817811
20824 817811 770224 515811 449293 564885 565376 530539 625946 836035 691604 575888 769843
20813 769843 859189 660052 735687 803054 710983 588582 281505 193399 68077 273943
20803 273943 200969 154643 115798 -153835 -325121 -320445 -448705 -533798 -417960 -423573 -345934
20792 -345934 -271492 -224530 -196342 168184 460529 702987 584306 367001 302634 277981
20782 277981 232923 59969 -152323 109245 634991 872529 745924 655646 689861 929043
$$ packed form
20855C53266J58282J00779j06511O7091l3666J25451j407K9278n6760k45355k31189
20844A59259j10747m023J81174J92952k8349M6825L42195J45707Q9551j66371
20834H48173L6575Q3727r2724J48892J5663k05133n39962k6752M09431J39921
20824H17811m7587k54413o6518J15592M91l4837R5407K10089j44431j15716J93955
20813G69843Q9346j99137P5635O7367r2071j22401l07077q8106j25322K05866
20803B73943p2974m6326l8845k69633j71286M676j28260q5093J15838n613P7639
20792c45934P4442M6962K8188L64526K92345K42458j18681k17305o4367k4653
20782B77981m5058j72954k12292K61568N25746K37538j26605r0278L4215K39182
$$ plain form
20772 929043 774895 490684 224830 212902 250067 212778 217742 -256254 -654108 -644942 -528433
20761 -528433 -282688 -7947 227650 -36871 129990 346700 282725 30638 74852 -25611
20751 -25611 -175065 93589 345789 50598 165628 137547 -173142 -228709 12519 203787
20741 203787 456785 431871 91847 -274698 -456840 -598060 -312936 -139359 -46055 -123432
20731 -123432 17388 56864 225679 220151 66210 -9015 -169947 52086 168414 251602
20721 251602 326977 435642 508169 321254 319267 -59017 -129832 207111 438394 459182 414096
20710 414096 331970 536335 365611 227323 323494 226242 159992 282090 316487 209569
20700 209569 204313 184038 214442 89071 192537 335215 444466 345029 290013 357594 457277
$$ packed form
20772I29043j54148k84211k65854j1928L7165l7289M964m73996l97854R166J16509
20761e28433K45745K74741K35597k64521J66861K16710o3975k52087M4214j00463
20751b5611j49454K68654K52200k95191J15030k8081l10689n5567K41228J91268
20741B03787K52998k4914l40024l66545j82142j41220K85124J73577R3304p7377
20731a23432J40820L9476J68815n528j53941p5225j60932K22033J16328Q3188
20721B51602P5375J08665P2527j86915j987l78284p0815L36943K31283K0788m5086
20710D14096q2126K04365j70724j38288R6171r7252o6250J22098L4397j06918
20700B09569n256k0275L0404j25371J03466J42678J09251r9437n5016O7581R9683
$$ plain form
20689 457277 612025 764652 657460 187403 -14896 314763 631785 806618 686453 616242
20679 616242 604363 858838 920020 862903 766063 509236 496404 610938 823945 761282 650599
20668 650599 871477 780372 876406 1065585 1023408 1100792 1094202 1145796 1077433 957280 867254
20657 867254 1213473 1402723 1112942 926275 866305 710735 748331 946474 936672 1021083
20647 1021083 1161862 1258914 1208787 1249683 1533308 1376749 1367110 1062588 959378 1077381
20637 1077381 1454203 1794077 1774650 1563052 1496106 1727218 2016573 2016690 1842543 1938807
20627 1938807 2011872 1893907 2028053 1824784 1617899 1988396 2073560 2174114 2414321 2303753
20617 2303753 2355062 2486452 2587772 2489004 2533312 2825584 2869393 2972644 3139697 3331722
$$ packed form
20689D57277J54748J52627j07192m70057k02299L29659L17022J74833j20165p0211
20679F16242j1879K54475O1182n7117r6840k56827j2832J14534K13007o2663j10683
20668F50599K20878r1105R6034J89179m2177P7384o590N1594o8363j20153r0026
20657H67254L46219J89250k89781j86667n9970j55570L7596J98143r802Q4411
20647A021083J40779R7052n0127M0896K83625j56559r639l04522j03210J18003
20637A077381L76822L39874j9427k11598o6946K31112K89355J17j74147R6264
20627A938807P3065j17965J34146k03269k06885L70497Q5164J00554K40207j10568
20617B303753N1309J31390J01320r8768M4308K92272M3809J03251J67053J92025
$$ plain form
20607 3331722 3508110 3906398 4191656 4631053 5105028 5320135 5564495 6124723 6532244
20598 6532244 7216848 8047174 9045437 10183553 11335996 12503774 13986347 15496306 16822747
20589 16822747 18699275 21110177 24182805 27515768 32100529 38337914 46712168 59292852
20581 59292852 78445436 109211066 159354436 228240486 293530058 341605953 347958519
20574 347958519 332723099 346152192 372560933 389512784 361071490 300559252 267760695
20567 267760695 277754850 322474172 373887918 412657593 415009339 387940164 385771150
20560 385771150 399825507 405246481 367661046 287194050 219506020 176845614 149862144
20553 149862144 131790612 118556331 108815626 100996770 93987632 87706875 81974856 76871139
$$ packed form
20607C331722J76388L98288K85258M39397M73975K15107K44360N60228M07521
20598F532244O84604Q30326R98263J138116J152443J167778J482573J509959J326441
20589A6822747J876528K410902L072628L332963M584761O237385Q374254J2580684
20581E9292852J9152584L0765630N0143370O8886050O5289572M8075895O352566
20574C47958519j5235420J3429093K6408741J6951851k8441294o0512238l2798557
20567B67760695R994155M4719322N1413746L8769675K351746k7069175k169014
20560C85771150J4054357N420974l7585435q0466996o7688030m2660406k6983470
20553A49862144j8071532j3234281r740705p818856p009138o280757n732019n103717
$$ plain form
20545 76871139 72690434 69299149 66343586 63390603 60325558 57697301 55072461 52521396
20537 52521396 50123996 48134580 45863952 44186359 42908156 41580902 40316623 38924747
20529 38924747 37617691 35998001 34473581 33353014 32523002 31709807 30849063 30067729 29259523
20520 29259523 28260533 27467559 26577934 25649965 24983339 24403992 23798234 23113567 22288258
20511 22288258 21421584 20606567 20062917 19578649 19292334 18963716 18454063 17702977 17049554
20502 17049554 16575099 15963526 15430552 14966560 14712351 14300880 13928305 13538092 13426191
20493 13426191 13487545 13183297 12661641 12305654 11902538 11728070 11296648 11004398 10639676
20484 10639676 10262665 9733384 9404818 9328146 9228433 8977307 8684665 8682731 8455910 8534946
$$ packed form
20545G6871139m180705l391285k955563k952983l065045k628257k624840k551065
20537E2521396k397400j989416k270628j677593j278203j327254j264279j391876
20529C8924747j307056j619690j524420j120567q30012q13195q60744p81334q08206
20520B9259523r98990p92974q89625r27969o66626n79347o05758o84667q25309
20511B2288258q66674q15017n43650m84268k86315l28618n09653p51086o53423
20502A7049554m74455o11573n32974m63992k54209m11471l72575l90213j11901
20493A3426191O1354l04248n21656l55987m03116j74468m31422k92250l64722
20484A0639676l77011n29281l28566p6672r9713k51126k92642j934k26821P9036
$$ plain form
20474 8534946 8418602 8383029 7958063 7765004 7783336 7578765 7539066 7162877 6730094 6554700
20464 6554700 6542889 6402958 6254447 6144262 5989540 5704023 5508333 5285951 5340099 5401048
20454 5401048 5377656 5390828 5180257 4966910 5147914 5028174 5104721 5123039 5205791 4949253
20444 4949253 4752267 4659913 4554280 4438220 4028806 3852260 3988080 3818582 3733051 3931433
20434 3931433 3923172 3589951 3386811 3573783 3324158 3185676 3191520 2888893 2601434 2299894
20424 2299894 2199094 2240448 2018073 2127304 2155860 1980758 1981747 1818723 1758547 1647683
20414 1647683 1514747 1227225 1208138 988044 837750 717833 893229 1331788 1816801 1803977
20404 1803977 1529401 1526485 1164432 1144363 1043075 1212113 1299697 1166981 1058061 1331611
$$ packed form
20474H534946j16344l5573m24966j93059J8332k04571l9699l76189m32783j75394
20464F554700j1811j39931j48511j10185j54722k85517j95690k22382N4148O0949
20454E401048k3392J3172k10571k13347J81004j19740P6547J8318Q2752k56538
20444D949253j96986r2354j05633j16060m09414j76546J35820j69498q5531J98382
20434C931433q261l33221k03140J86972k49625j38482N844l02627k87459l01540
20424B299894j00800M1354k22375J09231K8556j75102R89j63024o0176j10864
20414A647683j32936k87522j9087k20094j50294j19917J75396M38559M85013j2824
20404A803977k74576k916l62053k0069j01288J69038Q7584j32716j08920K73550
$$ plain form
20394 1331611 1406860 1180714 1160447 1235695 1155176 975303 957587 1394359 1585150 1547792
20384 1547792 1764415 1899967 1594246 1378667 1464676 1493579 1512703 1417298 1227629 880120
20374 880120 794168 836597 718234 980789 900969 806808 1107019 1287948 1497038 1501234 1551873
20363 1551873 1592358 1762774 1469426 1410601 1334506 1279284 1388258 1212063 1221611 1319845 1304012
20352 1304012 1124200 1101977 1042848 1110868 1068605 1086036 1536361 1826354 1588536 1600346
20342 1600346 1391486 1475133 1454827 1506849 1509846 1596047 1423573 1228292 1317772 1378684 1419245
20331 1419245 1531474 1394719 1324412 1666960 1605328 1453875 1513007 1383106 1305463 1391135
20321 1391135 1143689 831282 802135 536258 495550 915718 1127913 1009911 909855 773746
$$ packed form
20394A331611P5249k26146k0267P5248q0519j79873j7716M36772J90791l7358
20384A547792K16623J35552l05721k15579Q6009K8903J9124r5405j89669l47509
20374H80120q5952M2429j18363K62555p9820r4161L00211J80929K09090M196N0639
20363A551873M0485J70416k93348n8825p6095n5222J08974j76195R548R8234j5833
20352A304012j79812k2223n9129O8020m2263J7431M50325K89993k37818J1810
20342A600346k08860Q3647k0306N2022K997Q6201j72474j95281Q9480O0912M0561
20331A419245J12229j36755p0307L42548o1632j51453N9132j29901p7643Q5672
20321A391135k47446l12407k9147k65877m0708M20168K12195j18002j00056j36109
$$ plain form
20311 773746 813858 962681 1122954 1211429 1242780 1286269 1285301 1204305 1270860 1245109 1445031
20300 1445031 1993897 2433294 2659604 2809225 2453643 2194016 2324245 2443066 2149553
20291 2149553 1826560 1496716 1328929 1454576 1577586 1528817 1561290 1501364 1205398 1057040
20281 1057040 691700 373788 310418 585897 794523 1043486 1156542 1132607 714106 504388
20271 504388 566885 844420 873159 638035 712364 599025 499910 319742 416433 558620
20261 558620 388169 367892 502693 476961 290970 168960 209909 471159 736483 1018752
20251 1018752 1113055 1192395 930136 696989 740842 934445 923868 1052871 1401824 1551054
20241 1551054 2106741 2829288 3252357 3094487 2546926 2485008 2440004 2449456 2321979 2006133
$$ packed form
20311G73746M0112J48823J60273Q8475L1351M3489r68q0996O6555k5751J99922
20300A445031N48866M39397K26310J49621l55582k59627J30229J18821k93513
20291B149553l22993l29844j67787J25647J23010m8769L2473n9926k95966j48358
20281A057040l65340l17912o3370K75479K08626K48963J13056k3935m18501k09718
20271E04388O2497K77535K8739k35124P4329j13339r9115j80168R6691J42187
20261E58620j70451k0277J34801k5732j85991j22010M0949K61250K65324K82269
20251A018752R4303P9340k62259k33147M3853J93603j0577J29003L48953J49230
20241A551054N55687P22547M23069j57870n47561o1918m5004R452j27477l15846
$$ plain form
20231 2006133 1472082 1196061 1256145 1322647 1113161 1088133 1108723 967608 758151 346539
20221 346539 107732 5020 213534 770463 894311 948909 850087 645275 773793 1101278
20211 1101278 1105161 1106778 948983 710685 618419 412052 207551 263780 708267 641092 524514
20200 524514 532955 398717 724316 1030409 1135313 909187 630404 751989 668434 519015
20190 519015 413442 609006 800720 554904 340152 480631 396976 410697 346627 506489
20180 506489 616862 699004 463895 335302 184569 57031 78598 414233 616626 688059
20170 688059 718961 694825 460129 554184 648161 567542 524037 339109 129120 147021 405514
20159 405514 565673 594733 552849 589256 573853 606953 518270 315412 554228 769877 808376
$$ packed form
20231B006133n34051k76021O0084O6502k09486k5028K0590j41115k09457m11612
20221C46539k38807j02712K08514N56929J23848N4598r8822k04812J28518L27485
20211A101278L883J617j57795k38298r2266k06367k04501N6229M44487o7175j16578
20200E24514Q441j34238L25599L06093J04904k26126k78783J21585q3555j49419
20190E19015j05573J95564J91714k45816k14752J40479q3655J3721o4070J59862
20180E06489J10373Q2142k35109j28593j50733j27538K1567L35635K02393P1433
20170F88059L0902k4136k34696R4055R3977q0619m3505j84928k09989J7901K58493
20159D05514J60159K9060m1884L6407j5403L3100q8683k02858K38816K15649L8499
$$ plain form
20148 808376 552293 414894 482696 418657 565832 751317 690662 795748 852890 745333
20138 745333 717558 580939 693355 913123 1097038 1374834 1687148 1628492 1835643 2079306
20128 2079306 2082129 2032950 1927748 2230440 2898992 3289730 3222536 2935042 2484690 2390246
20118 2390246 2488224 2701434 2716225 2500676 2358814 2552837 2422537 1890477 1427386 1451912
20108 1451912 1792143 1827209 1940126 1981274 2050025 2142160 2552369 2568220 2114264 1723938
20098 1723938 1594563 1434005 1593351 1662527 1572083 1688767 1563002 1401825 1515535 1650708
20088 1650708 1640180 1473532 1466615 1424121 1092916 895510 925270 1040607 913382 885025
20078 885025 892382 807046 594616 487091 159155 83167 223354 378470 389799 247113
$$ packed form
20148H08376k56083j37399O7802o4039J47175J85485o0655J05086N7142j07557
20138G45333k7775j36619J12416K19768J83915K77796L12314n8656K07151K43663
20128B079306K823m9179j05202L02692O68552L90738o7194k87494m50352r4444
20118B390246R7978K13210J4791k15549j41862J94023j30300n32060m63091K4526
20108A451912L40231L5066J12917M1148O8751R2135M10209J5851m53956l90326
20098A723938j29375j60558J59346O9176r0444J16684j25765j61177J13710J35173
20088A650708j0528j66648o917m2494l31205j97406K9760J15337j27225k8357
20078H85025P357q5336k12430j07525l27936p5988J40187J55116J1329j42686
$$ plain form
20068 247113 331336 216204 461980 602701 460346 527091 675531 526199 390413 265787
20058 265787 297192 148463 220044 363474 356050 404639 514245 711312 803904 913340 870988
20047 870988 1184019 1526078 1981653 2164543 2301126 2269025 2071674 1712939 1873575 1677064
20037 1677064 1406684 1130446 1130907 1276353 1634449 1868656 2003164 2286146 2253482 1890721
20027 1890721 1760864 1459231 1175713 1357279 1635324 1761245 2156428 2591187 3044704
20018 3044704 3026950 2971785 2795456 2749868 2651711 2476300 2429906 2582945 2730357 3091657
20008 3091657 3041435 3206870 3379348 3345823 3236817 2987961 2952422 2733533 2513291 1859753
19998 1859753 1744311 1544368 1279250 1032857 1205770 1190373 1088628 1004314 1096599 1148842
$$ packed form
20068B47113Q4223j15132K45776J40721j42355O6745J48440j49332j35786j24626
20058B65787L1405j48729P1581J43430p424M8589J09606J97067R2592J09436m2352
20047H70988L13031L42059M55575J82890J36583l2101j97351l58735J60636j96511
20037A677064k70380k76238M61J45446L58096K34207J34508K82982l2664l62761
20027A890721j29857l01633k83518J81566K78045J25921L95183M34759M53517
20018C044704j7754n5165j76329m5588r8157j75411m6394J53039J47412L61300
20008C091657n0222J65435J72478l3525j09006k48856l5539k18889k20242o53538
19998A859753j15442j99943k65118k46393J72913j5397j01745q4314R2285N2243
$$ plain form
19988 1148842 1040757 729125 539401 738964 776580 1083042 1320403 1149085 1206555 1275705
19978 1275705 1438860 1211534 1013908 917696 929960 927768 1053649 1265689 1305829 1263316
19968 1263316 1164498 1339778 1373743 1311972 1234273 1008998 977120 972792 797772 754804 793790
19957 793790 729899 586824 550043 289510 422083 539194 804107 958136 893966 804730
19947 804730 625305 381801 504517 673228 660737 649330 744213 800339 925019 1269570
19937 1269570 1397459 848379 546529 478878 399476 828053 1221203 1418476 1510573 1267807
19927 1267807 1120344 1005437 766828 696469 838207 1207389 1225670 802598 755222 878036
19917 878036 744552 910066 1007285 762935 676140 728569 638980 715580 997406 926314 725250
$$ packed form
19988A148842j08085l11632j89724J99563L7616L06462K37361j71318N7470O9150
19978A275705J63155k27326j97626r6212J2264k192J25881K12040M0140m2513
19968A263316r8818J75280L3965o1771p7699k25275l1878m328j75020m2968L8986
19957G93790o3891j43075l6781k60533J32573J17111K64913J54029o4170q9236
19947H04730j79425k43504J22716J68711j2491j1407R4883N6126J24680L44551
19937A269570J27889n49080l01850o7651p9402M28577L93150J97273R2097k42766
19927A267807j47463j14907k38609p0359J41738L69182J8281m23072m7376J22814
19917H78036j33484J65514R7219k44350q6795N2429q9589P6600K81826p1092k01064
$$ plain form
19906 725250 522749 434611 608569 982904 1305207 1318248 1594508 1967575 1946045 1878681
19896 1878681 1618494 1396739 1032974 603987 495559 498927 497906 496834 485353 370806 712457
19885 712457 997418 1051009 1063297 1170611 1332837 1128295 1146498 872968 890845 763625
19875 763625 739038 699840 747814 953691 848031 728026 823127 932660 969717 964512 1095301
19864 1095301 1182842 1074806 905016 1056177 1539083 1690619 2072508 2129765 2011598 1604871
19854 1604871 1436642 1655366 1777738 1559473 1637866 1713165 1648495 1474241 1408546 1479300
19844 1479300 1196945 1002180 1159171 1256194 1307348 1580130 1473986 1391623 1339182 1005307
19834 1005307 1027686 1210343 955850 1109270 1255939 1301390 1642108 1613246 1713701 1633757
$$ packed form
19906G25250k02501q8138J73958L74335L22303J3041K76260L73067k1530o7364
19896A878681k60187k21755l63765m28987j08428L368j021j072j1481j14547L41651
19885G12457K84961N3591J2288J07314J62226k04542J8203k73530J7877j27220
19875G63625k4587l9198M7974K05877j05660j20005R5101J09533L7057n205J30789
19864A095301Q7541j08036j69790J51161M82906J51536L81889N7257j18167m06727
19854A604871j68229K18724J22372k18265P8393P5299o4670j74254o5695P0754
19844A479300k82355j94765J56991R7023N1154K72782j06144q2363n2441l33875
19834A005307K2379J82657k54493J53420J46669M5451L40718k8862J00455p9944
$$ plain form
19824 1633757 1416009 1292133 1520111 1624371 1824425 1703004 1537837 1293229 1210961 1229684
19814 1229684 1450821 1514849 1802425 1978252 2120585 2225516 2195991 2018268 2144320 2409636
19804 2409636 2502489 2591285 2782473 2992051 3235675 3495830 3657976 3570952 3424686 3840516
19794 3840516 4206543 4436368 4456529 4528518 4802131 5139186 5305199 5059901 5049042 4976236
19784 4976236 4929256 4779994 4829497 5271989 5825770 6369489 7169571 8021461 8669579 9284336
19774 9284336 10266499 11622217 12941456 14347068 16142009 18715110 22137857 26778955
19766 26778955 33337051 44223592 62251367 92825865 140229709 192208231 233735280
19759 233735280 251708240 237669528 233808000 248177406 260078473 248531970 197755722
$$ packed form
19824A633757k17748j23876K27978J04260K00054j21421j65167k44608q2268J8723
19814A229684K21137O4028K87576J75827J42333J04931k9525j77723J26052K65316
19804B409636R2853Q8796J91188K09578K43624K60155J62146q7024j46266M15830
19794C840516L66027K29825K0161P1989K73613L37055J66013k45298j0859p2806
19784D976236m6980j49262M9503M42492N53781N43719Q00082Q51890O48118O14757
19774I284336R82163J355718J319239J405612J794941K573101L422747M641098
19766B6778955O558096J0886541J8027775L0574498M7403844N1978522M1527049
19759B33735280J7972960j4038712l861528J4369406J1901067j1546503n0776248
$$ plain form
19752 197755722 145068509 110574371 89614899 76239653 67306123 60985086 55689225
19745 55689225 50852482 46512042 42961421 40242780 37922100 35789603 34348217 33147672
19737 33147672 32206852 31206345 30214451 29283605 28543053 27464363 27130800 27050134 26437656
19728 26437656 25733631 25071921 24719215 24321994 23993516 24024110 24112206 24327692 24766371 25629411
19718 25629411 26454768 27153673 27947813 28964067 30696352 33039134 35377260 38464012
19710 38464012 42479548 48504609 57282625 70196742 89876412 121987394 176348356
19703 176348356 260677898 353802596 428545282 461226551 435749748 424759820 446282632
19696 446282632 464983999 444029177 354852454 261345631 199750527 161536326 136856109
$$ packed form
19752A97755722n2687213l4494138k0959472j3375246q933530o321037n295861
19745E5689225m836743m340440l550621k718641k320680k132497j441386j200545
19737C3147672r40820j000507r91894r30846p40552j078690l33563q0666o12478
19728B6437656p04025o61710l52706l97221l28478L0594Q8096K15486M38679Q63040
19718B5629411Q25357O98905P94140J016254J732285K342782K338126L086752
19710C8464012M015536O025061Q778016J2914117J9679670L2110982N4360962
19703A76348356Q4329542R3124698P4742686L2681269k5476803j0989928K1522812
19696D46282632J8701367k0954822q9176723r3506823o1595104l8214201k4680217
$$ plain form
19689 136856109 120086193 108207311 98686319 90670337 83764138 77583418 72463687 67905936
19681 67905936 63706791 60068021 57323194 54557113 51955061 49395065 46825048 44895635
19673 44895635 43378167 41839223 40598662 39811614 39246169 38346564 37325564 36203406
19665 36203406 35128487 34355473 33461357 31945579 30362349 29177854 27746588 26322060
19657 26322060 25460970 24650176 24262026 23774254 23051506 22575643 21862352 21499928 21259803
19648 21259803 20588736 20233547 19944761 19648151 19109952 18395866 18185924 17828974 17506876
19639 17506876 17153288 16972790 16913595 16924246 16985888 17276777 17163582 16494368 16353193 16352155
19629 16352155 16181427 15663960 15154209 14586318 14119654 14375006 15045739 15166591 14708832
$$ packed form
19689A36856109j6769916j1878882r520992q015982o906199o180720n119731m557751
19681F7905936m199145l638770k744827k766081k602052k559996k570017j929413
19673D4895635j517468j538944j240561p87048n65445q99605j021000j122158
19665C6203406j074919p73014q94116j515778j583230j184495j431266j424528
19657B6322060q61090q10794l88150m87772p22748m75863p13291l62424k40125
19648B1259803o71067l55189k88786k96610n38199p14086k09942l56950l22098
19639A7506876l53588j80498n9195J0651O1642K90889j13195o69214j41175j038
19629A6352155j70728n17467n09751n67891m66664K55352O70733J20852m57759
$$ plain form
19620 14708832 14450704 14513319 14187876 13584176 12561510 11868130 11485487 11123846 10777373
19611 10777373 10282494 10052296 9970813 9691585 9961018 10020756 9653416 9218087 9286315 9362687
19601 9362687 9231782 9023292 8844616 8979944 8642488 8497217 8876625 9282496 9902645
19592 9902645 10448093 10781532 10415174 9968405 9992577 10101291 9839209 9686592 9847331 10416358
19582 10416358 11354417 12263513 13288055 14228604 14836969 15461948 16272418 17231322 18452701
19573 18452701 19936467 21216873 22699813 24861423 28139373 32372041 38639271 47813265
19565 47813265 61428264 82425785 116881526 175181431 258374895 335891155 383578911
19558 383578911 365356374 281581339 206342035 161830387 139916821 133773052 141341449
$$ packed form
19620A4708832k58128O2615l25443o03700j022666o93380l82643l61641l46473
19611A0777373m94879k30198q1483k79228K69433N9738l67340m35329O8228P6372
19601I362687j30905k08490j78676J35328l37456j45271L79408M05871O20149
19592I902645N45448L33439l66358m46769K4172J08714k62082j52617J60739N69027
19582A0416358R38059R09096J024542R40549O08365O24979Q10470R58904J221379
19573A8452701J483766J280406J482940K161610L277950M232668O267230R173994
19565D7813265J3614999K0997521L4455741N8299905Q3193464P7516260M7687756
19558C83578911j8222537q3775035p5239304m4511648k1913566o143769P568397
$$ plain form
19551 141341449 164916337 211778088 283899076 354886622 399114810 385682679 302365205
19544 302365205 219349199 165437136 132858516 112983790 99945946 90514441 82962216
19537 82962216 75941205 69684767 65132985 61108060 57596171 55092897 52765532 50873233
19529 50873233 49292204 47987598 46265153 44597371 42859209 40963731 39463100 38507979
19521 38507979 37701239 36865692 36319911 36056939 35968046 36101498 36259059 36443206 36036177
19512 36036177 35752709 36026380 37011656 39154219 42248679 46971244 53435781 63420159
19504 63420159 81153789 112443546 158397274 201390410 227949453 218192052 171062733
19497 171062733 128921795 103976619 91824770 88117241 91992390 104641243 130812321
$$ packed form
19551A41341449K3574888M6861751P2120988P0987546M4228188j3432131q3317474
19544C02365205q3016006n3912063l2578620j9874726j3037844r431505p552225
19537H2962216p021011o256438m551782m024925l511889k503274k327365j892299
19529E0873233j581029j304606j722445j667782j738162j895478j500631r55121
19521C8507979q06740q35547n45781k62972q8893J33452J57561J84147m07029
19512C6036177k83468K73671R85276K142563L094460M722565O464537R984378
19504F3420159J7733630L1289757M5953728M2993136K6559043r757401m7129319
19497A71062733m2140938k4945176j2151849l707529L875149J2648853K6171078
$$ plain form
19490 130812321 172007655 212711056 237984618 230969406 182256144 134130485 103548952
19483 103548952 85123634 73358954 65597024 59751352 55195252 50957014 47175407 43916275
19475 43916275 41353536 39350079 37555794 36167156 35157760 34291975 33315486 31926627
19467 31926627 30530143 29315165 27870307 26659432 25593333 24969643 24107584 23167113
19459 23167113 22546720 21991805 21501825 21152520 20738078 20230593 19545109 18655582 17790622
19450 17790622 17136518 16722297 16470081 16086488 15815718 15415791 14649059 14035960 14062076
19441 14062076 13659190 13258454 12930318 12643950 12172837 12045807 12267111 12226632 12139856 12162644
19431 12162644 11929729 11733447 11497155 11201966 10703913 10159317 9812162 9930229 9911278
$$ packed form
19490A30812321M1195334M0703401K5273562p015212m8713262m8125659l0581533
19483A03548952j8425318j1764680p761930n845672m556100m238238l781607l259132
19475D3916275k562739k003457j794285j388638j009396q65785r76489j388859
19467C1926627j396484j214978j444858j210875j066099o23690q62059r40471
19459B3167113o20393n54915m89980l49305m14442n07485o85484q89527q64960
19450A7790622o54104m14221k52216l83593k70770l99927p66732o13099K6116
19441A4062076m02886m00736l28136k86368m71113j27030K21304m0479q6776K2788
19431A2162644k32915j96282k36292k95189m98053n44596l47155J18067j8951
$$ plain form
19422 9911278 9839742 10018363 9636271 8914215 8352311 8290410 8398299 8396637 8443560 8036170
19412 8036170 7746971 7571006 7342396 7423121 6998846 6478918 6279766 6181745 6125732 6405031
19402 6405031 6845695 7001535 7195194 7690895 8161359 8432341 8521351 8161391 8085526 8040652
19392 8040652 7559563 6966372 6657729 7041212 7386138 7662016 7944024 7626143 7335559
19383 7335559 7246308 7126176 6767249 6127499 5433255 4823074 4592439 4425788 4170419 4151745
19373 4151745 4010587 3935385 3773562 3773521 3900036 4066765 3989760 3773994 3883612 3983080 4144330
19362 4144330 3990597 3766025 3597740 3482500 3370881 3322641 3554433 3300617 3202748 3242081
19352 3242081 3174876 2858475 2595619 2602815 2619936 2687427 2823526 2666899 2499458 2406882
$$ packed form
19422I911278p1536J78621l82092p22056n61904o1901J07889j662M6923m07390
19412H036170k89199j75965k28610Q0725m24275n19928j99152r8021n6013K79299
19402F405031M40664J55840J93659M95701M70464K70982Q9010l59960p5865m4874
19392H040652m81089n93191l08643L83483L44926K75878K82008l17881k90584
19383G335559q9251j20132l58927o39750o94244o10181k30635j66651k55369j8674
19373D151745j41158p5202j61823m1J26515J66729p7005k15766J09618R9468J61250
19362D144330j53733k24572j68285j15240j11619m8240K31792k53816r7869L9333
19352C242081o7205l16401k62856P196J7121O7491J36099j56627j67441r2576
$$ plain form
19342 2406882 2330211 2334516 2617598 2915227 3177854 3327940 3170021 3065547 3506874 3643791
19332 3643791 4149335 4691786 5307242 5984706 6427090 6784326 7555311 8474384 9233624
19323 9233624 9761509 9957089 9875977 9414893 9249765 8924208 8624150 8133539 7711628 7170680
19313 7170680 6842579 6848416 7163067 7855143 8363633 8164547 7858985 8367346 8726550 8623935
19303 8623935 7961564 7384852 6851339 6589430 6667645 6561635 6011946 5314069 4508924 4038248
19293 4038248 4057043 3950400 4018554 3966396 3980189 3865873 3583555 3346664 3195216 3160956
19283 3160956 2979806 2513213 2464467 2425389 2551925 2696963 2691033 2841488 2818726 2681206
19273 2681206 2751097 2765149 3117813 3273169 3237901 3299829 3429602 3459046 3411376 3599917
$$ packed form
19342B406882p6671M305K83082K97629K62627J50086j57919j04474M41327J36917
19332C643791N05544N42451O15456O77464M42384L57236P70985R19073P59240
19323I233624N27885J95580q1112m61084j65128l25557l00058m90611m21911n40948
19313G170680l28101N837L14651O92076N08490j99086l05562N08361L59204j02615
19303H623935o62371n76712n33513k61909P8215j06010n49689o97877q05145m70676
19293D038248J8795j06643O8154n2158J3793j14316k82318k36891j51448l4260
19283C160956j81150m66593m8746l9078J26536J45038n930J50455k2762j37520
19273B681206O9891J4052L52664J55356l5268O1928J29773K9444m7670J88541
$$ plain form
19263 3599917 3455151 3413592 2983342 2701275 2636216 2593614 2616595 2500597 2448400 2547851
19253 2547851 2825666 3099577 3285162 3564497 3979480 4494541 5014729 5440741 5616376
19244 5616376 5254633 4783056 4561796 4514450 4612421 4510163 4174021 4218970 4301416 3812099
19234 3812099 3374997 3119487 2972766 2879410 2798054 2813293 2917382 2912180 3051173 3565699
19224 3565699 4105681 4553087 4429424 4034066 3991338 4162201 4208942 3921396 3496041 3452062
19214 3452062 3231528 3294308 3552711 3267672 3213515 3407866 3687716 3702904 4016931 4246494
19204 4246494 4139865 4181775 4314194 4315436 4039857 3267393 2628209 2646337 2612812 2424447
19194 2424447 2104771 2125466 2171989 2117604 2232270 2211944 2048609 1852859 1825791 1914454
$$ packed form
19263C599917j44766m1559m30250k82067o5059m2602K2981j15998n2197R9451
19253B547851K77815K73911J85585K79335M14983N15061N20188M26012J75635
19244E616376l61743m71577k21260m7346R7971j02258l36142M4949Q2446m89317
19234C812099m37102k55510j46721r3356q1356J5239J04089n202J38993N14526
19224C565699N39982M47406j23663l95358m2728J70863M6741k87546m25355m3979
19214C452062k20534O2780K58403k85039n4157J94351K79850J5188L14027K29563
19204D246494j06629M1910J32419J242k75579p72464o39184J8128l3525j88365
19194B424447l19676K0695M6523n4385J14666k0326j63335j95750k7068Q8663
$$ plain form
19184 1914454 1831783 1990812 2217689 2513630 2686117 2785471 2806863 3250718 3846532 4316527
19174 4316527 4639422 4401023 3935109 3419141 3296040 3625869 3895180 4743934 5721491
19165 5721491 6662069 7238137 7769375 7852212 7640089 7325915 6796909 5842331 4933927 4391242
19155 4391242 4269751 4447829 4285136 3663700 3529715 3820660 3720221 3747388 3888073 3758726
19145 3758726 3669771 3860829 4015413 3983633 3829359 3107784 2516315 2154717 2042099 1927325
19135 1927325 2043277 2111066 1815798 1658606 1763341 1652276 1457620 1674396 2010891 1846609
19125 1846609 1572406 1639753 1702570 2070730 2310137 2131457 2194274 2589224 3002649 3538132
19115 3538132 3868964 3653733 3236750 2731933 2472627 2372662 2320296 2243216 2651167 2975597
$$ packed form
19184A914454q2671J59029K26877K95941J72487R9354K1392M43855N95814M69995
19174D316527L22895k38399m65914n15968j23101L29829K69311Q48754R77557
19165E721491R40578N76068N31238Q2837k12123l14174n29006r54578r08404n42685
19155D391242j21491J78078j62693o21436j33985K90945j00439K7167J40685j29347
19145C758726q8955J91058J54584l1780j54274p21575n91469l61598j12618j14774
19135A927325J15952O7789k95268j57192J04735j11065j94656K16776L36495j64282
19125A846609k74203O7347O2817L68160K39407j78680O2817L94950M13425N35483
19115C538132L30832k15231m16983n04817k59306r9965n2366p7080M07951L24430
$$ plain form
19105 2975597 3233523 3848444 3679623 3085761 2761236 2369902 1878803 1868263 1885175 1475542
19095 1475542 1312615 1387122 1624142 1506511 1184671 1343225 1635464 1660903 1607014 1673237
19085 1673237 1559718 1326200 1135522 1080678 1007773 1203869 1286790 1113232 896408 841650
19075 841650 827629 690179 765585 837366 1165915 1261928 1449262 1657862 1725656 1815346 1767595
19064 1767595 1874903 1692729 1316706 1146337 1093160 1273818 1356822 1280818 943837 547856
19054 547856 450108 708646 1094298 1176479 1365968 1407503 1130337 992925 886335 532522
19044 532522 373596 321401 293498 465067 536554 776315 931405 975230 894961 795819 696314
19033 696314 783154 1043633 1032142 897329 612335 772578 904962 1173662 1437238 1621081
$$ packed form
19105B975597K57926O14921j68821n93862l24525l91334m91099j0540J6912m09633
19095A475542j62927P4507K37020j17631l21840J58554K92239K5439n3889O6223
19085A673237j13519k33518j90678n4844p2905J96096Q2921j73558k16824n4758
19075H41650j4021j37450P5406P1781L28549R6013J87334K08600O7794Q9690m7751
19064A767595J07308j82174l76023j70369n3177J80658Q3004p6004l36981l95981
19054E47856r7748K58538L85652Q2181J89489M1535k77166j37412j06590l53813
19044E32522j58926n2195k7903J71569P1487K39761J55090M3825q0269r9142r9505
19033F96314Q6840K60479j1491j34813k84994J60243J32384K68700K63576J83843
$$ plain form
19023 1621081 1878704 2124849 2062584 2053878 1887310 1764307 1355232 757065 762775 777008
19013 777008 917435 1173376 1600105 2013875 1989318 1898998 1818505 1814817 1724299 1820062 1653724
19002 1653724 1691674 1584715 1289652 1150994 799018 500829 615639 701479 728471 648361
18992 648361 733517 508466 641267 861427 1290580 1327034 1397490 1377763 1006623 930451
18982 930451 746610 728218 635405 388476 765921 1108053 1145489 1271839 1206014 1074233
18972 1074233 1042294 981615 1294167 1483210 1355689 1350285 1138783 1061730 1259091 1743887
18962 1743887 2002378 2129309 1884582 1778382 1838248 1726753 1701268 1725745 1686551 1832694
18952 1832694 2062694 2291423 2369137 2204737 1855574 1711487 1757164 1182607 935146 1009714
$$ packed form
19023A621081K57623K46145o2265q706j66568j23003m09075n98167N710J4233
19013G77008J40427K55941M26729M13770k4557r0320q0493l688r0518R5763j66338
19002A653724L7950j06959k95063j38658l51976k98189J14810Q5840K6992q0110
18992F48361Q5156k25051J32801K20160M29153L6454P0456j9727l71140p6172
18982I30451j83841j8392r2813k46929L77445L42132L7436J26350o5825j31781
18972A074233l1939o0679L12552J89043j27521n404k11502p7053J97361M84796
18962A743887K58491J26931k44727j06200N9866j11495k5485K4477l9194J46143
18952A832694K30000K28729P7714j64400l49163j44087M5677n74557k47461P4568
$$ plain form
18942 1009714 1042288 1040834 978698 874956 921229 956853 873075 939824 1062646 1131133 875315
18931 875315 286653 137438 127008 165180 562584 511225 378094 542692 796248 722683
18921 722683 501001 425102 770526 926974 758807 811770 813225 910733 1028894 677125
18911 677125 517660 536340 672764 417509 357993 348388 477012 570373 392404 455631 731821
18900 731821 912421 850261 750741 611912 721849 704053 566865 674968 986929 942343
18890 942343 600527 498560 384343 39824 -53752 -133913 -143524 -241032 -184318 127878 352034
18879 352034 644895 494786 398970 540344 592621 636573 658521 655231 694849 773970 784599
18868 784599 998393 847082 686321 625008 896898 1204649 1136437 1090037 894118 771079
$$ packed form
18942A009714L2574j454o2136j03742M6273L5624q3778O6749J22822O8487k55818
18931H75315n88662j49215j0430L8172L97404n1359j33131J64598K53556p3565
18921G22683k21682p5899L45424J56448j68167N2963J455R7508J18161l51769
18911F77125j59465J8680J36424k55255n9516r605J28624R3361j77969O3227K76190
18900G31821J80600o2160r9520j38829J09937j7796j37188J08103L11961m4586
18890I42343l41816j01967j14217l44519r3576q0161r611r7508N6714L12196K24156
18879C52034K92861j50109r5816J41374N2277M3952K1948l290L9618P9121J0629
18868G84599K13794j51311j60761o1313K71890L07751o8212m6400j95919j23039
$$ plain form
18858 771079 581697 566680 866281 787021 926732 812987 463673 273036 337474 458184
18848 458184 619701 876718 988855 790628 630164 543598 323099 589841 410165 343956
18838 343956 380571 472622 391360 333265 417330 529456 554082 716407 428627 195187 383028
18827 383028 348127 324726 412693 438987 501493 690158 723038 664183 463939 652839 725727
18816 725727 679742 549376 466028 292836 -78236 6839 116021 324143 221193 118794
18806 118794 212866 456603 440272 120551 81014 268531 393458 815221 903806 724847
18796 724847 443575 647765 730964 768545 448667 264074 220047 162641 380166 305803
18786 305803 342145 190972 -26009 315505 556160 723516 572225 184477 69522 169444
$$ packed form
18858G71079j89382j5017K99601p9260J39711j13745l49314j90637O4438J20710
18848D58184J61517K57017J12137j98227j60464q6566k20499K66742j79676o6209
18838C43956L6615R2051q1262n8095Q4065J12126K4626J62325k87780k33440J87841
18827C83028l4901k3401Q7967K6294O2506J88665L2880n8855k00244J88900P2888
18816G25727m5985j30366q3348j73192l71072Q5075J09182K08122j02950j02399
18806A18794R4072K43737j6331l19721l9537J87517J24927M21763Q8585j78959
18796G24847k81272K04190Q3199L7581l19878j84593m4027n7406K17525p4363
18786C05803L6342j51173k16981L41514K40655J67356j51291l87748j14955R9922
$$ plain form
18776 169444 383845 395565 480161 647815 691248 403633 287325 481825 278029 437539
18766 437539 1128714 1409703 1605383 1887235 2010782 1850622 1383765 892216 726163 780233
18756 780233 866241 734892 663641 637021 477490 167021 388585 492962 284212 142007
18746 142007 273217 209147 244887 285172 362082 453631 569542 389336 160349 397761
18736 397761 375999 449195 648256 687203 599194 284566 20564 23438 11889 149903 461006
18725 461006 794848 835949 967660 1112520 1703890 2392688 3116733 3208767 2531995 2038904
18715 2038904 1709057 1672736 1545876 1228021 1399610 2114982 2897926 3375740 3328480 2735619
18705 2735619 2003299 1513558 1240516 1056415 983306 1403063 1397236 1021965 970075 658692
$$ packed form
18776A69444K14401J1720Q4596J67654M3433k87615j16308J94500k03796J59510
18766D37539O91175K80989J95680K81852J23547j60160m66857m91549j66053N4070
18756G80233Q6008j31349p1251k6620j59531l10469K21564J04377k08750j42205
18746A42007J31210o4070L5740M0285P6910R1549J15911j80206k28987K37412
18736C97761k1762P3196J99061L8947q8009l14628k64002K874j1549J38014L11103
18725D61006L33842M1101J31711J44860N91370O88798P24045R2034o76772m93091
18715B038904l29847l6321j26860l17855J71589P15372P82944M77814m7260n92861
18705B735619p32320m89741k73042j84101p3109M19757n827l75271n1890l11383
$$ plain form
18695 658692 548052 816342 751238 364511 505182 747494 667971 635899 532187 721023
18685 721023 806815 503787 234569 29566 293593 380678 110876 110427 146075 198001 434497
18674 434497 725328 727727 699096 739550 563102 628879 894465 1185367 1267788 1438834 1714377
18663 1714377 1956160 2177752 2450853 2349379 1986782 1910340 1402719 1072466 1160175 1421184
18653 1421184 1762318 2186011 2716149 2758045 2307454 1944983 1656923 1238624 1294630 1223543
18643 1223543 1032524 855803 669223 596338 770475 902473 1087999 1177100 1067487 940543
18633 940543 923741 1133960 1157766 872430 842738 1096755 998800 909261 901033 868793 835296
18622 835296 435304 371218 398670 456460 622988 738132 1078463 1201656 1489449 2082505
$$ packed form
18695F58692j10640K68290o5104l86727J40671K42312p9523l2072j03712J88836
18685G21023Q5792l03028k69218k05003K64027Q7085k69802m49L5648N1926K36496
18674D34497K90831K399k8631M0454j76448O5777K65586K90902Q2421J71046K75543
18663A714377K41783K21592K73101j01474l62597p6442n07621l30253Q7709K61009
18653A421184L41134M23693N30138M1896m50591l62471k88060m18299N6006p1087
18643A223543j91019j76721j86580p2885J74137J31998J85526Q9101j09613j26944
18633I40543j6802K10219K3806k85336k9692K54017r7955q9539q228l2240l3497
18622H35296l99992o4086K7452N7790J66528J15144L40331J23193K87793N93056
$$ plain form
18612 2082505 2710341 3315894 3494152 3117482 2745273 2298546 1989479 1619863 1390941
18603 1390941 1419174 1825412 2151829 2686797 3234188 3147359 2572915 1878299 1529951 1377397
18593 1377397 1210967 1260678 1041584 881526 867473 959278 970957 902518 755908 616317
18583 616317 585601 505101 459830 629172 725562 721869 701192 772755 637057 668739 745786
18572 745786 815747 882945 944189 793199 887287 900383 546706 553122 758401 1030881 1108452
18561 1108452 1261881 1490037 1307729 1106480 1278404 1520758 2049555 2588782 2909037
18552 2909037 3118011 2894866 2377453 1827365 1633838 1501300 1513372 1570547 1512077 1509047
18542 1509047 1891084 2520907 3058749 3213487 2759694 1964614 1720816 1559644 1227426
$$ packed form
18612B082505O27836O05553J78258l76670l72209m46727l09067l69616k28922
18603A390941K8233M06238L26417N34968N47391q6829n74444o94616l48348j52554
18593A377397j66430M9711k19094j60058j4053R1805J1679o8439j46610j39591
18583F16317l0716q0500m5271J69342R6390l693k0677P1563j35698L1682P7047
18572G45786O9961O7198O1244j50990R4088J3096l53677O416K05279K72480P7571
18561A108452J53429K28156j82308k01249J71924K42354N28797N39227L20255
18552B909037K08974k23145n17413n50088j93527j32538J2072N7175n8470l030
18542A509047L82037O29823N37842J54738m53793p95080k43798j61172l32218
$$ plain form
18533 1227426 747686 987460 1217847 1114517 1025414 681013 620367 719592 633871 769363
18523 769363 783126 584199 459924 361647 177601 327970 505725 330598 547683 570494
18513 570494 529123 565293 431785 24526 203218 469891 296447 650244 809871 938270
18503 938270 718669 471195 317972 328292 24890 -26060 171718 596429 693404 318970
18493 318970 111830 148441 277397 13033 -170259 -166855 -69354 80225 315544 546517
18483 546517 558105 139789 122067 -75331 -78569 -111713 56196 28928 247749 198539 43382
18472 43382 -79414 -56413 108930 322743 604959 515189 509114 580446 734738 886863 692554
18461 692554 419057 388943 359592 686551 584805 333362 264445 454350 420403 270730
$$ packed form
18533A227426m79740K39774K30387j03330q9103l44401o0646R9225q5721J35492
18523G69363J3763j98927j24275r8277j84046J50369J77755j75127K17085K2811
18513E70494m1371L6170j33508m07259J78692K66673j73444L53797J59627J28399
18503I38270k19601k47474j53223J0320l03402n0950J97778M24711R6975l74434
18493C18970k07140L6611J28956k64364j83292L404R7501J49579K35319K30973
18483E46517J1588m18316j7722j97398l238l3144J67909k7268K18821m9210j55157
18472D3382j22796K3001J65343K13813K82216q9770o075P1332J54292J52125j94309
18461F92554k73497l0114k9351L26959j01746k51443o8917J89905l3947j49673
$$ plain form
18451 270730 155631 183464 3413 147796 554625 390827 531011 539461 571588 497836
18441 497836 617207 981339 759368 869485 1083070 978908 746069 511873 321079 12313
18431 12313 113560 528108 661974 408120 164614 353085 592225 589859 654412 815980
18421 815980 748386 689677 121799 117644 192721 184469 395765 626848 736875 561680 437271
18410 437271 329182 118787 345856 477707 262443 307395 321044 193033 116396 141987
18400 141987 526461 653653 905353 854568 495421 467019 398548 513010 347115 73372
18390 73372 48705 -146321 -615498 -629450 -367916 -273786 -162486 20761 168266 248222
18380 248222 201367 517070 433973 493444 542044 459321 391605 220993 304141 430403 376312
$$ packed form
18451B70730j15099K7833j80051J44383M06829j63798J40184Q450L2127p3752
18441D97836J19371L64132k21971J10117K13585j04162k32839k34196j90794l08766
18431A2313J01247M14548J33866k53854k43506J88471K39140k366O4553J61568
18421H15980o7594n8709n67878m155P5077q252K11296K31083J10027j75195j24409
18410D37271j08089k10395K27069J31851k15264M4952J3649j28011p6637K5591
18400A41987L84474J27192K51700n0785l59147k8402o8471J14462j65895k73743
18390G3372k4667j95026m69177j3952K61534R4130J11300J83247J47505P9956
18380B48222m6855L15703q3097N9471M8600q2723o7716j70612Q3148J26262n4091
$$ plain form
18369 376312 166329 228402 107760 92480 203725 408288 552313 493883 251147 347630
18359 347630 366399 439888 326599 277015 18420 32600 37499 2601 29320 244326 292680
18348 292680 297777 414070 474296 521477 646016 372123 195775 180969 203257 323956 352998
18337 352998 571664 628258 498716 546877 429278 643049 928593 973517 811085 610708
18327 610708 661610 764926 698121 359275 220898 390912 563807 404016 313746 362349
18317 362349 249974 169005 388027 593570 557657 396734 342958 286898 349691 262817 86398
18306 86398 259751 401103 662572 785903 806090 699588 627076 605241 517242 571630 738419
18295 738419 965528 746871 352202 -49155 -12634 73631 52230 298034 127038 62395
$$ packed form
18369C76312k09983O2073j20642j5280J11245K04563J44025n8430k42736R6483
18359C47630J8769P3489j13289m9584k58595J4180M899l4898K6719K15006M8354
18348B92680N097J16293O0226M7181J24539k73893j76348j4806K2288J20699K9042
18337C52998K18666N6594j29542M8161j17599K13771K85544M4924j62432k00377
18327F10708N0902J03316o6805l38846j38377J70014J72895j59791r0270M8603
18317C62349j12375q0969K19022K05543l5913j60923n3776n6060O2793q6874j76419
18306H6398J73353J41352K61469J23331K0187j06502p2512k1835q7999N4388J66789
18295G38419K27109k18657l94669m01357L6521Q6265k1401K45804j70996o4643
$$ plain form
18285 62395 253812 445918 508621 451047 190347 -184064 -438140 -165151 -224985 -171961
18275 -171961 79570 135399 131431 197184 261387 253742 320289 399214 123905 19930 -371967
18264 -371967 -434084 -268826 58698 210565 92833 348912 679724 678188 241998 84760
18254 84760 98260 63551 -10267 210473 280316 63884 197677 257635 249616 95119 152436
18243 152436 124297 230009 239473 350843 223672 352331 583940 701273 880737 802739
18233 802739 543771 813534 706645 686996 571211 88650 -208874 -114663 -18737 -29381
18223 -29381 81200 137301 230526 251707 185425 292592 468329 486103 469182 442689 267117
18212 267117 191143 145730 287829 368568 401002 382665 605667 763320 701048 417269 277829
$$ packed form
18285F2395J91417J92106O2703n7574k60700l74411k54076K72989n9834N3024
18275a71961K51531N5829l968O5753O4203p645O6547P8925k75309j03975l91897
18264c71967o2117J65258L27524J51867j17732K56079L30812j536m36190j57238
18254H4760J3500l4709p3818K20740O9843k16432J33793N9958q019j54497N7317
18243A52436k8139J05712R464J11370j27171J28659K31609J17333J79464p7998
18233H02739k58968K69763j06889j9649j15785m82561k97524R4211R5926j0644
18223b9381J10581N6101R3225K1181o6282J07167J75737J7774j6921k6493j75572
18212B67117p5974m5413J42099Q0739L2434j8337K23002J57653o2272k83779j39440
$$ plain form
18201 277829 108462 191394 405347 607185 412240 178653 259611 398888 487827 445788
18191 445788 199537 327628 468362 281985 275685 470303 525702 550908 686962 382995
18181 382995 287292 430578 711977 729890 682276 511546 394006 464141 488931 613213
18171 613213 576969 532115 633202 431852 44638 -197586 57815 199650 -13079 337069
18161 337069 640230 573322 443277 615860 652957 503844 902542 992019 1096864 1309835
18151 1309835 1538286 1522781 1450132 1283395 1160441 1232396 1289813 1408283 1733510 1582282
18141 1582282 1286818 1315378 1558576 1835536 1729516 1771205 2046784 2169294 2101123 1861167
18131 1861167 1708290 1944608 2381309 2790451 3227883 3506303 3876789 4219514 4570273
$$ packed form
18201B77829j69367Q2932K13953K01838j94945k33587Q0958J39277Q8939m2039
18191D45788k46251J28091J40734j86377o300J94618N5399K5206J36054l03967
18181C82995r5703J43286K81399J7913m7614j70730j17540P0135K4790J24282
18171F13213l6244m4854J01087k01350l87214k42224K55401J41835k12729L50148
18161C37069L03161o6908j30045J72583L7097j49113L98698Q9477J04845K12971
18151A309835K28451j5505p2649j66737j22954P1955N7417J18470L25227j51228
18141A582282k95464K8560K43198K76960j06020M1689K75579J22510o8171k39956
18131A861167j52877K36318M36701M09142M37432K78420L70486L42725L50759
$$ plain form
18122 4570273 5154431 5936711 6891008 7942176 8988173 10348099 12004706 14258887 17950784
18113 17950784 22723037 29004065 38696811 54419092 82105182 131861294 209482460
18106 209482460 287479394 339473176 332744019 248041912 165214885 114721072 86064944
18099 86064944 69847998 60194442 53840484 49308256 44613146 39934229 35975948 32731612
18091 32731612 30176168 28166184 26489927 24960847 23822712 22678598 21151133 19808359
18083 19808359 19080664 18555354 17639550 16734127 16024893 15496821 15050724 14659547 14253930
18074 14253930 13684996 13427259 13135821 12472623 11813778 11611588 11405040 10851645 10419604
18065 10419604 10012777 9693376 9392151 8976271 8698415 8393363 7989463 7664402 7581439
$$ packed form
18122D570273N84158P82280R54297J051168J045997J359926J656607K254181L691897
18113A7950784M772253O281028R692746J5722281K7686090M9756112P7621166
18106B09482460P7996934N1993782o729157q4702107q2827027n0493813k8656128
18099H6064944j6216946r653556o353958m532228m695110m678917l958281l244336
18091C2731612k555444k009984j676257j529080j138135j144114j527465j342774
18083A9808359p27695n25310r15804r05423p09234n28072m46097l91177m05617
18074A4253930n68934k57737k91438o63198o58845k02190k06548n53395m32041
18065A0419604m06827l19401l01225m15880k77856l05052m03900l25061q2963
$$ plain form
18056 7581439 7414370 7285334 7508137 7606031 7471477 7222669 6944523 6483692 6251751 5898010
18046 5898010 5803617 5792629 5649757 5458382 5243493 5001445 4742160 4879847 4601764 4254237
18036 4254237 3956285 3903734 3863514 3895572 3773032 3396494 3218003 3112247 3122974 3196010
18026 3196010 3130582 2977788 3094553 2913977 2979656 2867625 2769528 2805503 2994351 2782425
18016 2782425 2743928 2554446 2166751 2169573 2251163 2259552 2101551 2057181 1811794 1645464 1827255
18005 1827255 1784660 1874109 1979986 1982500 1785076 1574520 1597667 1677090 1639095 1557918 1544037
17994 1544037 1708427 1493927 1411720 1309498 1210274 1074777 973852 944619 1066358 1063434
17984 1063434 1230886 1372269 1466279 1402590 1394357 1604344 1484085 1242390 1260115 1271411
$$ packed form
18056G581439j67069j29036K22803R7894j34554k48808k78146m60831k31941l53741
18046E898010r4393j0988j42872j91375k14889k42048k59285J37687k78083l47527
18036D254237k97952n2551m0220L2058j22540l76538j78491j05756J0727P3036
18026C196010o5428j52794J16765j80576O5679j12031r8097L5975J88848k11926
18016B782425l8497j89482l87695K822Q1590Q389j58001m4370k45387j66330J81791
18005A827255m2595Q9449J05877K514j97424k10556K3147P9423l7995q1177j3881
17994A544037J64390k14500q2207j02222r9224j35497j00925k9233J21739k924
17984A063434J67452J41383R4010o3689q233K09987j20259k41695J7725J1296
$$ plain form
17974 1271411 1098823 987228 990651 1059598 1090320 1066541 1119420 1220097 1212981 942204 796622
17963 796622 965782 794202 743243 799101 667275 765175 730695 637182 512617 470049 542836
17952 542836 555539 553362 265557 28751 127570 173154 356202 514892 623256 683583 373182
17941 373182 288339 361820 360722 252968 167239 128229 194684 241653 129430 -41092 125662
17930 125662 245935 94945 -43727 34687 41652 79257 200697 304248 159207 72836
17920 72836 90360 264623 498177 649768 806574 743552 614946 408558 522835 559519
17910 559519 443886 463754 186434 50844 91280 134167 169193 266835 374084 470140 572437
17899 572437 695007 412957 455555 363677 60089 85435 376660 564143 418320 227918
$$ packed form
17974A271411j72588j11595L423O8947L0722k3779N2879J00677p116k70777j45582
17963G96622J69160j71580n0959N5858j31826R7900l4480r3513j24565m2568P2787
17952E42836J2703k177k87805k36806R8819M5584J83048J58690J08364O0327l10401
17941C73182q4843P3481j098j07754q5729l9010O6455M6969j12223j70522J66754
17930A25662J20273j50990j38672P8414O965L7605J21440J03551j45041q6371
17920G2836J7524J74263K33554J51591J56806o3022j28606k06388J14277L6684
17910E59519j15633J9868k77320j35590M0436M2887L5026R7642J07249R6056J02297
17899E72437J22570k82050M2598r1878l03588K5346K91225J87483j45823j90402
$$ plain form
17889 227918 314338 91157 -28574 34886 -88511 34238 180173 141272 327931 469650
17879 469650 175240 217216 460961 529583 268150 191368 405931 398306 474243 478320 660982
17868 660982 441396 241145 144333 141932 239550 140732 -129934 -183878 -133959 -68895 -102032
17857 -102032 -147016 15135 326681 287605 291 82616 221714 344549 171702 122050
17847 122050 195716 102478 80168 167861 -5262 -24326 108892 173737 183205 306400 129363
17836 129363 67596 110171 229969 481789 719388 691235 165710 -195981 -31551 112715
17826 112715 233467 449015 428888 369767 165713 -28828 63644 261909 451023 454133
17816 454133 347582 252820 322103 272180 337350 206726 64408 64877 151116 182374 141673
$$ packed form
17889B27918Q6420k23181j19731O3460j23397J22749J45935l8901J86659J41719
17879D69650k94410M1976K43745O8622k61433p6782K14563p625P5937M077J82662
17868F60982k19586k00251r6812k401R7618r8818k70666n3944M9919O5064l3137
17857a02032m4984J62151L11546l9076k87314Q2325J39098J22835j72847m9652
17847A22050P3666r3238k2310Q7693j73123j9064J33218O4845R468J23195j77037
17836A29363o1767M2575J19798K51820K37599k8153n25525l61691J64430J44266
17826A12715J20752K15548k0127n9121k04054j94541R2472J98265J89114L110
17816D54133j06551r4762O9283m9923O5170j30624j42318M69Q6239L1258m0701
$$ plain form
17805 141673 140106 335319 340464 426549 263390 238587 282725 14818 -166757 -62772 11726
17794 11726 32612 6773 255596 519786 279438 131302 119003 196899 329341 436086
17784 436086 448305 336456 437259 241988 407748 713763 717177 655824 592585 190592
17774 190592 45891 -77898 73032 264597 329843 -195378 -321843 -55472 2320 61544
17764 61544 130276 205760 399661 356322 294295 371769 238158 -3586 -14814 48091 228493
17753 228493 370901 311463 54465 139963 128717 66249 246739 109190 95522 -20336
17743 -20336 -37126 19532 375199 347157 221003 77970 16087 37746 -125392 -296364 -116865
17732 -116865 225178 417477 -48707 -152076 -28138 -152980 -112962 87302 196601 229903
$$ packed form
17805A41673j567J95213N145Q6085j63159k4803M4138k67907j81575J03985P4498
17794A1726K0886k5839K48823K64190k40348j48136j2299P7896J32442J06745
17784D36086J2219j11849J00803j95271J65760L06015L414o1353o3239m01993
17774A90592j44701j23789J50930J91565O5246n25221j26465K66371N7792N9224
17764F1544O8732P5484J93901m3339o2027P7474j33611k41744j1228O2905J80402
17753B28493J42408n9438k56998Q5498j1246o2468J80490j37549j3668j15858
17743b0336j6790N6658L55667k8042j26154j43033o1883K1659j63138j70972J79499
17732a16865L42043J92299m66184j03369J23938j24842M0018K00264J09299L3302
$$ plain form
17722 229903 220417 361003 465596 346668 127150 -58225 82382 304029 412026 318388
17712 318388 55648 -36647 -6736 179080 39000 -65990 -18297 231898 263197 24537
17702 24537 -24457 35619 -19144 -161367 -228345 1503 299121 326087 360120 445599 410534
17691 410534 470703 413253 280766 186313 77350 -141360 -357584 -255072 -206961 -115840
17681 -115840 10869 229306 132325 54151 159209 66007 110297 16471 -123802 -300761
17671 -300761 -206399 68983 268231 207686 323529 100570 -15691 164625 216679 173109
17661 173109 208110 79038 -227373 -243631 98235 147785 46874 127251 72239 113942 207004
17650 207004 275656 338827 5364 -84439 4407 258082 374814 157352 113650 177012 362589
$$ packed form
17722B29903r486J40586J04593j18928k19518j85375J40607K21647J07997r3638
17712C18388k62740r2295K9911J85816j40080j04990M7693K50195L1299k38660
17702B4537m8994O0076n4763j42223o6978K29848K97618K6966L4033Q5479l5065
17691D10534O0169n7450j32487r4453j08963k18710k16224J02512M8111R1121
17681a15840J26709K18437r6981p8174J05058r3202M4290r3826j40273j76959
17671c00761R4362K75382J99248o0545J15843k22959j16261J80316N2054m3570
17661A73109L5001j29072l06411j6258L41866M9550j00911Q0377n5012M1703R3062
17650B07004O8652O3171l33463q9803Q8846K53675J16732k17462m3702O3362J85577
$$ plain form
17639 362589 261841 25162 -35193 280863 147100 44540 -2944 -61418 -94088 -242817
17629 -242817 56165 261285 176756 19571 -171021 -259481 -163731 -92073 -81983 -5372 157757
17618 157757 183373 241283 142539 290792 162334 14509 187575 495768 609654 539112
17608 539112 447172 133721 36209 234752 347540 291635 310851 369453 272295 201791 336618
17597 336618 145482 66729 305588 537314 594271 572489 639807 739578 828196 329066 126826
17586 126826 311597 244830 152385 387029 330686 583958 328175 79092 -23677 -205518
17576 -205518 -315223 -741505 -515197 -96588 -132849 -20937 -220103 -472174 -440239 -115934
17566 -115934 172726 186507 35232 8959 -15357 168571 404665 608430 590544 346761
$$ packed form
17639C62589j00748k36679o0355L16056j33763j02560m7484n8474l2670j48729
17629b42817K98982K05120q4529j57185j90592q8460R5750P1658J0090P6611J63129
17618A57757K5616N7910r8744J48253j28458j47825J73066L08193J13886p0542
17608E39112r1940l13451r7512J98543J12788n5905J9216N8602r7158p0504J34827
17597C36618j91136p8753K38859K31726N6957k1782O7318R9771Q8618m99130k02240
17586A26826J84771o6767r2445K34644n6343K53272k55783k49083j02769j81841
17576b05518j09705m26282K26308M18609l6261J11912j99166k52071L1935L24305
17566a15934K88660J3781j51275k6273k4316J83928K36094K03765j7886k43783
$$ plain form
17556 346761 107029 -80098 -156030 -31499 -19169 -219930 -305555 -345793 -351689 -123040 -141415
17545 -141415 -63938 -27708 -190643 -81448 247341 169692 291381 418474 494799 403529
17535 403529 288789 324420 312768 266236 159531 -15965 -78886 35886 81478 154146 163458
17524 163458 221869 -28380 -11853 192447 306763 275987 211154 -33650 -565067 -458432
17514 -458432 -96965 169778 149542 254823 139900 -113276 -9015 182951 71106 103500
17504 103500 93277 -146337 -15940 277856 423606 479385 163077 86348 -68429 18769
17494 18769 -212748 -207059 -81145 -39015 -62317 -253659 -153371 -116658 -198458 -435946 -302909
17483 -302909 148576 456572 196008 34130 92648 -121345 -162614 -129210 73154 334158
$$ packed form
17556C46761k39732j87127p5932J24531J2330k00761q5625m0238n896K28649j8375
17545a41415P7477L6230j62935J09195L28789p7649J21689J27093P6325r1270
17535D03529j14740L5631j1652m6532j06705j75496o2921J14772M5592P2668R312
17524A63458N8411k50249J6527K04300J14316l0776o4833k44804n31417J06635
17514d58432L61467K66743k0236J05281j14923k53176J04261J91966j11845L2394
17504A03500j0223k39614J30397K93796J45750N5779l16308p6729j54777Q7198
17494A8769k31517N689J25914M2130k3302j91342J00288L6713q1800k37488J33037
17483c02909M51485L07996k60564j61878N8518k13993m1269L3404K02364K61004
$$ plain form
17473 334158 348117 7238 12207 246039 228064 54613 104681 -108841 -33485 219435 389227
17462 389227 196559 125732 175236 108861 46983 130178 85116 32007 101181 218743 46855
17451 46855 -30834 -191152 -221494 -348285 -239368 69967 393886 295461 46058 497990
17441 497990 1155086 1446514 1690989 2113810 1826163 1336305 1097517 881447 719046 852989
17431 852989 813389 645440 392283 271654 503620 518332 469739 280066 185456 94417
17421 94417 63381 101792 93337 -67657 -225819 -221916 -97320 -34570 55104 126915 111860
17410 111860 98857 346746 783649 896884 717188 568274 527739 398509 227523 11064
17400 11064 29090 -146288 -604709 -309022 234465 454712 199892 198504 168839 276482
$$ packed form
17473C34158J3959l40879M969K33832j7975j73451N0068k13522P5356K52920J69792
17462C89227j92668p0827M9504o6375o1878Q3195m5062n3109O9174J17562j71888
17451D6855p7689j60318l0342j26791J08917L09335L23919r8425k49403M51932
17441D97990O57096K91428K44475M22821k87647m89858k38788k16070j62401J33943
17431H52989l9600j67949k53157j20629K31966J4712m8593j89673r4610r1039
17421I4417l1036L8411q455j60994j58162L903J24596O2750Q9674P1811j5055
17410A11860j3003K47889M36903J13235j79696j48914m0535j29230j70986k16459
17400A1064J8026j75378m58421K95687N43487K20247k54820j388k9665J07643
$$ plain form
17390 276482 212994 3536 -72784 -36822 209485 355969 272077 326359 237339 -16568 55003
17379 55003 100251 -32205 -130015 22911 -51617 -174434 -149231 -118796 117767 79041 -336572
17368 -336572 -295135 -150662 79533 -14076 104337 187900 -26177 -23103 34885 349785 582134
17357 582134 326192 275855 228737 109827 52275 195914 188933 148848 121988 200607 331646
17346 331646 319164 129123 -6561 -264234 -210159 -261805 -158792 106447 79275 5654
17336 5654 -51616 -106984 -234685 -162995 107543 281615 345449 217778 -347129 -280610 -262478
17325 -262478 -215083 -15632 -1396 128794 158932 137250 148130 92655 199834 259126 -61445
17314 -61445 -138963 -200886 -83673 152194 377244 441270 286424 78420 96606 -66336
$$ packed form
17390B76482o3488k09458p6320L5962K46307J46484q3892N4282q9020k53907P1571
17379E5003M5248j32456r7810J52926p4528j22817K5203L0435K36563l8726m15613
17368c36572M1437J44473K30195r3609J18413Q3563k14077L074N7988L14900K32349
17357E82134k55942n0337m7118j18910n7552J43639o981m0085k6860P8619J31039
17346C31646j2482j90041j35684k57673N4075n1646J03013K65239k7172p3621
17336E654n7270n5368j27701P1690K70538J74072O3834j27671n64907O6519J8132
17325b62478M7395J99451J4236J30190L0138k1682J0880n5475J07179N9292l20571
17314f1445p7518o1923J17213K35867K25050O4026j54846k08004J8186j62942
$$ plain form
17304 -66336 49060 144250 206884 287533 157401 178866 -92690 -32623 156631 91819 335456
17293 335456 486662 241622 122213 -2045 -99293 46152 191291 -200504 -111813 159667
17283 159667 229689 153846 223823 304968 330184 435789 406679 88403 -254719 -359360 29057
17272 29057 182158 -137060 -80600 200323 439266 214889 251798 195969 267815 154435
17262 154435 41716 -228642 -537027 -590998 -49986 368920 227813 117746 17016 -116997
17252 -116997 -180465 -326895 -436608 -378443 -289707 -35951 -72619 -126197 -9094 -2973 27492
17241 27492 16230 52928 153724 129587 -1786 83091 -111785 76614 289588 607134
17231 607134 211737 110536 316205 359293 154041 -219243 -342461 -329992 -276037 -241085
$$ packed form
17304f6336J15396R5190O2634Q0649j30132K1465k71556O0067J89254o4812K43637
17293C35456J51206k45040j19409j24258r7248J45445J45139l91795Q8691K71480
17283A59667P0022p5843O9977Q1145K5216J05605k9110l18276l43122j04641L88417
17272B9057J53101l19218N6460K80923K38943k24377L6909n5829P1846j13380
17262A54435j12719k70358l08385n3971N41012M18906j41107j10067j00730j34013
17252a16997o3468j46430j09713N8165Q8736K53756l6668n3578J17103O121L0465
17241B7492j1262L6698J00796k4137j31373Q4877j94876J88399K12974L17546
17231F07134l95397j01201K05669M3088k05252l73284j23218J2469N3955L4952
$$ plain form
17221 -241085 -95695 62854 17049 85112 450854 512548 229041 -105880 -172013 -131876
17211 -131876 -366104 -194229 -142216 -379491 -440278 -384151 -156014 -205031 -360969 -289469
17201 -289469 -216058 -273007 -309725 -333129 -256308 -30761 15549 15181 168063 194670 -112800
17190 -112800 -225597 8920 311884 296899 -13488 -209874 -205186 -124344 27709 70148
17180 70148 64229 158252 177990 281212 118365 -79474 73781 265546 281810 196558 229091
17169 229091 320834 30304 -214783 -204557 -351109 -348504 -163001 28392 -172840 1723
17159 1723 98952 -24761 132915 -230563 -268912 -223092 -268079 -218402 -118571 -241943 -284573
17148 -284573 -311889 -291172 79506 -10706 -166889 -389105 -471489 -358650 -333604 -376338 -324680
$$ packed form
17221b41085J45390J58549m5805O8063L65742O1694k83507l34921o6133M0137
17211a31876k34228J71875N2013k37275o0787N6127K28137m9017j55938P1500
17201b89469P3411n6949l6718k3404P6821K25547M6310l68J52882K6607l07470
17190a12800j12797K34517L02964j4985l10387j96386M688Q0842J52053M2439
17180G0148n919R4023J9738J03222j62847j97839J53255J91765J6264q5252L2533
17169B29091R1743k90530k45087J0226j46552K605J85503J91393k01232J74563
17159A723R7229j23713J57676l63478l8349M5820m4987M9677R9831j23372m2630
17148b84573k7316K0717L70678r0212j56183k22216q2384J12839K5046m2734N1658
$$ plain form
17137 -324680 -192597 -108640 59111 -34863 -18181 135165 96420 -190958 -286415 45969
17127 45969 417629 610441 684159 470982 251828 156965 117534 -115782 -410955 -280528
17117 -280528 -327137 -374083 -454756 -379177 -137985 84194 62686 188717 119412 -213331 -6958
17106 -6958 300419 410862 336682 143834 -434992 -478295 -95592 -86597 -296920 -384377 -353303
17095 -353303 -369761 -442940 -738635 -579737 -264448 -288458 -352544 -68524 -324680 -433288
17085 -433288 -452935 -498352 -394194 -176833 125511 174114 -19203 -104196 44413 233831
17075 233831 225333 274565 356166 14386 -102844 80578 181943 130652 -11147 -159186
17065 -159186 -190784 14481 85289 79324 22122 219451 71910 15202 -215789 -249025 -154160
$$ packed form
17137c24680J32083Q3957J67751r3974J6682J53346l8745k87378r5457L32384
17127D5969L71660J92812P3718k13177k19154r4863l9431k33316k95173J30427
17117b80528m6609m6946q0673P5579K41192K22179k1508J26031o9305l32743K06373
17106f958L07377J10443p4180j92848n78826m3303L82703Q995k10323q7457L1074
17095c53303j6458p3179k95695J58898L15289k4010o4086K84020k56156j08608
17085d33288j9647m5417J04158K17361L02344M8603j93317q4993J48609J89418
17075B33831q498M9232Q1601l41780j17230J83422J01365n1291j41799j48039
17065a59186l1598K05265P0808n965n7202J97329j47541n6708k30991l3236R4865
$$ plain form
17054 -154160 -260705 -236383 -696 254215 -90392 -251276 -385954 -321311 -14558 65153
17044 65153 146034 171666 347888 374382 -147681 -265434 -104404 -9631 27439 -12520 118110
17033 118110 170233 272113 143561 -4410 -72967 -52979 -197735 -140081 -19880 143586
17023 143586 271760 221655 378519 327891 250534 284118 330468 215129 93785 107531 124504
17012 124504 323750 349626 196731 238370 321141 82440 -137907 -373762 -316186 -335373
17002 -335373 -260571 -61546 -297975 -172557 -185180 -220566 -62621 -271910 -673416 -558681
16992 -558681 -423541 -377101 -214044 -254671 -373427 -441419 -138103 195275 187801 179180 407320
16981 407320 470651 149222 -307853 -462426 -230045 189788 302356 217635 2834 -126777
$$ packed form
17054a54160j06545K4322K35687K54911l44607j60884j34678O4643L06753P9711
17044F5153Q0881K5632J76222K6494n22063j17753J61030R4773L7070l9959J30630
17033A18110N2123J01880j28552j47971o8557J9988j44756N7654J20201J63466
17023A43586J28174n0105J56864n0628p7357L3584M6350j15339j21344J3746J6973
17012A24504J99246K5876j52895M1639Q2771k38701k20347k35855N7576j9187
17002c35373P4802J99025k36429J25418j2623l5386J57945k09289m01506J14735
16992e58681J35140M6440J63057m0627j18756o7992L03316L33378p474q621K28140
16981D07320O3331l21429m57075j54573K32381M19833J12568q4721k14801j29611
$$ plain form
16971 -126777 15342 42120 191658 404854 224260 -202403 -329219 -250909 -197824 39797
16961 39797 311554 121886 -40938 131100 201847 183831 470653 368290 234027 -24235
16951 -24235 -68988 1231 123648 180421 117778 -56417 17512 -120661 -297757 -366459 -78100
16940 -78100 -126680 -183983 -77816 119551 -155628 -257101 79833 368996 372302 245471
16930 245471 46960 -149901 -220842 -318280 -194476 -246691 -93630 -20813 50305 -85769
16920 -85769 100877 224998 245904 130076 -54964 -24714 187001 283946 359580 15058
16910 15058 -282677 -220537 124492 457625 159299 59676 27476 -274611 -273608 -124865 -52509
16899 -52509 5652 63655 -126447 -353418 -249400 -107202 -163272 -176404 -218719 -24288 412077
$$ packed form
16971a26777J42119K6778J49538K13196j80594m26663j26816P8310N3085K37621
16961C9797K71757j89668j62824J72038P0747j8016K86822j02363j34263k58262
16951b4235m4753P0219J22417N6773o2643j74195P3929j38173j77096o8702K88359
16940g8100m8580n7303J06167J97367k75179j01473L36934K89163L306j26831
16930B45471j98511j96861p0941r7438J23804n2215J53061P2817P1118j36074
16920h5769J86646J24121K0906j15828j85040L0250K11715R6945P5634l44522
16910A5058k97735O2140L45029L33133k98326r9623l2200l02087J003J48743P2356
16899e2509N8161N8003j90102k26971J04018J42198n6070j3132m2315J94431M36365
$$ plain form
16888 412077 475106 284763 153173 25011 -131179 -225718 -272624 -181170 -263297 -315887 -43915
16877 -43915 -128874 -110940 -220696 -190425 -312052 -317394 -301385 -362947 -318719 -299613 -17073
16866 -17073 118034 168833 221388 180384 24853 -150294 -74608 19732 131872 912 -92026
16855 -92026 11031 -34537 8928 23256 -54130 -267580 -401042 -481588 -641252 -272083 -61205
16844 -61205 -242928 -186505 -308654 -369478 -186055 -173147 54803 220191 222646 151195 -14054
16833 -14054 -36712 -10908 -72832 -44814 173795 251945 271667 290168 420745 281064 -52146
16822 -52146 -68872 -45471 -45729 -27467 -52584 -18203 107313 146100 99168 -83209 147729
16811 147729 224859 69229 -53091 -71701 41064 -136360 -159563 -283919 -504054 -401235
$$ packed form
16888D12077O3029j90343j31590j28162j56190r4539m6906R1454q2127n2590K71972
16877d3915q4959J7934j09756L0271j21627n342J6009o1562M4228J9106K82540
16866a7073J35107N0799N2555m1004j55531j75147P5686R4340J12140j30960r2938
16855i2026J03057m5568M3465J4328p7386k13450j33462q0546j59664L69169K10878
16844f1205j81723N6423j22149o0824J83423J2908K27950J65388K455p1451j65249
16833a4054k2658K5804o1924K8018K18609P8150J9722J8501J30577j39681l33210
16822e2146j6726K3401k58J8262k5117L4381J25516L8787m6932j82377K30938
16811A47729P7130j55630j22320j8610J12765j77424k3203j24356k20135J02819
$$ plain form
16801 -401235 -276144 -414743 -218511 5378 -121110 -61811 -135669 -27152 -180224 21011
16791 21011 166307 108917 122857 -81799 42281 -165542 -121083 -297157 -344813 -227568
16781 -227568 -27670 -49433 -142376 -101605 45221 252981 271016 101633 236721 118075
16771 118075 -169655 -180607 -25881 -61713 126369 -25713 -235462 28244 118769 172794
16761 172794 30564 -225524 -207910 -94616 -70653 -255042 -204431 -252450 -200732 -281625 -387837
16750 -387837 -612315 -653620 -657029 -253358 -188137 -370459 -149633 -122756 -73404 -47049 -305551
16739 -305551 -344864 -194740 -326081 -274751 -13009 -86252 87019 -104463 -314673 -375514
16729 -375514 -333041 -437747 -358536 -326268 -273336 -188835 -129549 -30546 6742 -69709 -11321
$$ packed form
16801d01235J25091j38599J96232K23889j26488N9299p3858J08517j53072K01235
16791B1011J45296n7390J3940k04656J24080k07823M4459j76074m7656J17245
16781b27568J99898k1763r2943M0771J46826K07760J8035j69383J35088j18646
16771A18075k87730j0952J54726l5832J88082j52082k09749K63706R0525N4025
16761A72794j42230k56088J7614J13294K3963j84389N0611m8019N1718q0893j06212
16750c87837k24478m1305l409M03671O5221j82322K20826K6877M9352K6355k58502
16739c05551l9313J50124j31341N1330K61742p3243J73271j91482k10210o0841
16729c75514M2473j04706P9211L2268N2932Q4501N9286R9003L7288p6451N8388
$$ plain form
16718 -11321 66171 -31083 -173492 -166555 -85618 -148717 -339619 -220336 -231817 -339119 -223247
16707 -223247 -70842 -127138 -538309 -689792 -433210 -185954 42975 364926 140796 -223652
16697 -223652 -28737 179060 40212 335866 408393 187724 206861 -227371 -414006 -205107
16687 -205107 813 -47406 -18820 -103123 36162 67368 95541 325251 232485 57957 -262723
16676 -262723 -621723 -432180 -227463 -275484 -400721 -444587 -104237 -66431 -393348 -457539
16666 -457539 17984 2416 -35686 140616 182836 -10143 40397 163942 153989 101446 -611
16655 -611 -124376 -274668 -402418 -315336 -197396 120195 -3422 135726 -74099 -340760
16645 -340760 -199619 -64824 7398 -59373 -455252 -503256 -271810 -20796 -110388 98252
$$ packed form
16718a1321P7492r7254j42409O937Q0937o3099j90902J19283j1481j07302J15872
16707b23247J52405n6296m11171j51483K56582K47256K28929L21951k24130l64448
16697b23652J94915K07797j38848K95654P2527k20669J9137m34232j86635K08899
16687b05107K05920m8219K8586q4303J39285L1206K8173K29710r2766j74528l20680
16676b62723l59000J89543K04717m8021j25237m3866L40350L7806l26917o4191
16666d57539M75523j5568l8102J76302M2220j92979N0540J23545r953n2543j02057
16655f11j23765j50292j27750Q7082J17940L17591j23617J39148k09825k66661
16645c40760J41141J34795P2222o6771l95879m8004K31446K51014q9592K08640
$$ plain form
16635 98252 182958 275839 463303 286925 266408 217114 198646 174771 191256 93907 -12033
16624 -12033 -101215 -38257 78334 -8254 -144983 -79554 94273 -42414 -45256 220975 441861
16613 441861 -9356 -286960 -235716 -289815 -206125 -220548 -221202 -293208 -173563 121954 127559
16602 127559 1562 -257144 -124935 86367 151258 153779 143244 123877 138281 435261 589444
16591 589444 520962 336190 133157 -82300 -321274 -398592 -358884 -418217 -265880 -328394
16581 -328394 -472585 -253810 -322723 -259299 -135815 -659 90568 -179367 -302477 -364432
16571 -364432 -48108 -26053 -191116 -439191 -458585 -356914 47217 220483 192742 277256
16561 277256 -26525 100387 213326 293852 142450 88333 108469 146980 -3303 9446
$$ packed form
16635I8252Q4706R2881J87464j76378k0517m9294j8468k3875J6485r7349j05940
16624a2033q9182O2958J16591q6588j36729O5429J73827j36687k842K66231K20886
16613D41861m51217k77604N1244n4099Q3690j4423o54p2006J19645K95517N605
16602A27559j25997k58706J32209K11302O4891K521j0535j9367J4404K96980J54183
16591E89444o8482j84772k03033k15457k38974p7318L9708n9333J52337o2514
16581c28394j44191K18775o8913O3424J23484J35156R1227k69935j23110o1955
16571c64432L16324K2055j65063k48075j9394J01671M04131J73266k7741Q4514
16561B77256l03781J26912J12939Q0526j51402n4117K0136L8511j50283J2749
$$ plain form
16551 9446 33163 17031 -119166 -91672 58848 -63436 174275 37977 -45325 -126246 -5747
16540 -5747 52958 230461 94134 15446 102191 131817 157490 445425 407004 393361 38942
16529 38942 -413348 -404160 -230374 159646 391180 366 -370227 -495233 -590239 -663239
16519 -663239 -495326 -218675 -108043 -113428 113885 123990 -74702 -283155 -401340 -425836
16509 -425836 -615076 -404960 -306016 -149054 -48120 46128 256439 162367 -216703 -149055
16499 -149055 168193 80137 -137011 -106356 -306461 -276510 -20560 198513 546937 750875
16489 750875 671166 443752 164992 170307 364767 277374 105303 98025 -2252 -73526 -242181
16478 -242181 -262672 -51956 133905 176373 2556 -131329 123115 190805 105062 136065
$$ packed form
16551I446K3717j6132j36197K7494J50520j22284K37711j36298q3302q0921J20499
16540e747N8705J77503j36327p8688Q6745K9626K5673K87935l8421j3643l54419
16529C8942m52290R188J73786L90020K31534l90814l70593j25006r5006p3000
16519f63239J67913K76651J10632n385K27313J0105j98692k08453j18185k4496
16509d25836j89240K10116R8944J56962J00934R4248K10311r4072l79070O7648
16499a49055L17248q8056k17148L0655k00105K9951K55950K19073L48424K03938
16489G50875p9709k27414k78760N315J94460q7393j72071p278j00277p1274j68655
16478b42181k0491K10716J85861M2468j73817j33885K54444O7690q5743L1003
$$ plain form
16468 136065 127508 306661 -50901 -218966 -296181 -397985 -264703 -238365 -98791 -179175
16458 -179175 97888 135295 124429 270165 39041 -194261 -251365 -202636 -166510 -272016
16448 -272016 -153398 70979 -84904 -253798 -375769 -341590 -370706 -492469 -466943 -172665
16438 -172665 -465927 -525363 -400780 -218108 3551 -7917 -32186 -126604 106488 406684
16428 406684 410102 295219 268558 316519 346979 312955 284853 348171 167964 -281396 -217757
16417 -217757 -148258 -317883 -318829 -492205 -334732 -95438 -285986 -291258 -182272 -176300 -327793
16406 -327793 -305856 1165 200177 55164 55127 328937 419620 160805 54360 311322 203198
16395 203198 -24092 144540 250601 143514 262615 236304 205205 128274 -128056 19221
$$ packed form
16468A36065q557J79153l57562j68065p7215j01804J33282K6338J39574q0384
16458a79175K77063L7407j0866J45736k31124k33302n7104M8729L6126j05506
16448b72016J18618K24377j55883j68894j21971L4179k9116j21763K5526K94278
16438a72665k93262n9436J24583J82672K21659j1468k4269r4418K33092L00196
16428D06684L418j14883k6661M7961L0460l4024k8102O3318j80207m49360O3639
16417b17757O9499j69625r46j73376J57473K39294j90548n272J08986N972j51493
16406c27793K1937L07021J99012j45013l7K73810R0683k58815j06445K56962j08124
16395B03198k27290J68632J06061j07087J19101k6311l1099p6931k56330J47277
$$ plain form
16385 19221 245574 96955 23887 84242 89641 275894 470144 212161 -51642 -241214
16375 -241214 -65627 -79876 21564 -98561 137863 288673 328157 231309 76881 -365678
16365 -365678 -370326 -143459 -37587 176750 318871 106706 -105540 -221327 -360191 -249253
16355 -249253 -247792 -319291 3876 180886 43809 42656 180289 72031 -154647 -353989
16345 -353989 -214912 -256991 -122493 -129975 -693280 -788060 -427100 -365706 -372844 -171970 -77969
16334 -77969 -187547 -204672 -107993 -307446 -283176 -239102 -129945 137880 -37938 63084
16324 63084 199561 80756 24576 142490 224842 18206 139720 201339 145677 -172520
16314 -172520 -102662 -34210 -235915 -131584 39229 420225 423800 316559 271168 -63927
$$ packed form
16385A9221K26353j48619p3068O0355N399J86253J94250k57983k63803j89572
16375b41214J75587j4249J01440j20125K36424J50810L9484r6848j54428m42559
16365c65678m648K26867J05872K14337J42121k12165k12246j15787j38864J10938
16355b49253J461p1499L23167J77010j37077j153J37633j08258k26678j99342
16345c53989J39077m2079J34498p482n63305r4780L60960O1394p138K00874R4001
16334g7969j09578j7125R6679j99453K4270M4074J09157K67825j75818J01022
16324F3084J36477j18805n6180J17914Q2352k06636J21514O1619n5662l18197
16314a72520O9858O8452k01705J04331J70813L80996L575j07241m5391l35095
$$ plain form
16304 -63927 -430093 -444501 -319144 -75140 28408 35343 80964 24394 -189173 -165354 -25973
16293 -25973 195154 390006 353258 335074 17576 -194994 -52410 255850 329359 103468
16283 103468 7665 59796 49507 -160042 -181760 215666 326310 341425 149048 52323 -44432
16272 -44432 -51178 -11303 -183195 -75347 58852 223828 226772 137740 -42100 44391 46960
16261 46960 -11478 -72056 -145522 -209855 -142709 199068 559957 531719 135483 -59856 251101
16250 251101 354964 386529 95414 -3213 162940 381461 284147 212014 168163 -11850
16240 -11850 -62561 64758 116729 49405 2535 212286 260736 -69072 -250831 -38460 169528
16229 169528 159874 127466 -26203 -360196 -646079 -527865 -75615 202578 175591 56243
$$ packed form
16304f3927l66166j4408J25357K44004J03548O935M5621n6570k13567K3819J39381
16293b5973K21127J94852l6748j8184l17498k12570J42584L08260P3509k25891
16283A03468r5803N2131j0289k09549k1718L97426J10644J5115j92377r6725r6755
16272d4432o746L9875j71892J07848J34199J64976K944q9032j79840Q6491K569
16261D6960n8438o0578p3466o4333O7146L41777L60889k8238l96236j95339L10957
16250B51101J03863L1565k91115r8627J66153K18521r7314p2133m3851j80013
16240a1850n0711J27319N1971o7324m6870K09751M8450l29808j81759K12371K07988
16229A69528r654l2408j53669l33993k85883J18214M52250K78193k6987j19348
$$ plain form
16219 56243 -255778 -222295 -238980 111014 153215 -181697 -405238 -154553 -41722 -144940
16209 -144940 11127 -30847 -123105 -26410 61070 -101822 -88280 -17835 167597 170629 326655
16198 326655 197917 61737 268998 141057 -148787 -29370 78301 -301629 37915 52768
16188 52768 -354286 -444603 -268490 -207412 -310285 -426377 -312729 5034 257325 309068
16178 309068 222614 313125 144331 -56335 -39140 324466 231881 233660 232023 247144 -26711
16167 -26711 -84158 39681 -30564 -124341 -193024 -182614 -101039 -132626 -50393 30890 140745
16156 140745 175508 286338 219136 118152 47308 230837 72558 -243219 -284390 -133444
16146 -133444 -225604 45214 288112 195042 201133 95112 -16427 -173897 -218611 -272628 -132182
$$ packed form
16219E6243l12021L3483j6685L49994M2201l34912k23541K50685J12831j03218
16209a44940J56067m1974r2258R6695Q7480j62892J3542P0445J85432L032J56026
16198C26655j28738j36180K07261j27941k89844J19417J07671l79930L39544J4853
16188E2768m07054r0317J76113O1078j02873j16092J13648L17763K52291N1743
16178C09068q6454R0511j68794k00666J7195L63606r2585J779j637J5121k73855
16167b6711n7447J23839p0245r3777o8683J0410Q1575l1587Q2233Q1283J09855
16156A40745L4763J10830o7202j00984p0844J83529j58279l15777m1171J50946
16146a33444r2160K70818K42898r3070O091j06021j11539j57470m4714n4017J40446
$$ plain form
16135 -132182 -16877 -70111 -241509 -175619 39040 -67023 -245261 -247880 -470751 -453594
16125 -453594 -150651 103696 -7393 -121185 -258627 -525579 -429331 -498390 -568921 -474882
16115 -474882 95396 329450 302595 150105 135063 85083 -106113 -51802 117128 91564
16105 91564 301087 31135 162654 361970 56793 -94420 -59238 -1824 -132388 -183567
16095 -183567 -141778 -84604 11851 64750 -36186 -62237 -51609 -269986 -42178 121420 -305590
16084 -305590 -428968 -242017 -303164 -282513 -57043 -57034 -119791 -162449 -23846 13560 -61143
16073 -61143 -311136 -430425 -491993 -448573 -462833 -276533 -309269 -262184 -143749 -159205 119711
16062 119711 407968 188488 -101354 -284256 -105228 -212674 -371728 -246138 -71100 -139927
$$ packed form
16135a32182J15305n3234j71398O5890K14659j06063j78238k619k22871J7157
16125d53594L02943K54347j11089j13792j37442k66952R6248o9059p0531R4039
16115d74882N70278K34054k6855j52490j5042m9980j91196N4311J68930k5564
16105I1564K09523k69952J31519J99316l05177j51213L5182N7414j30564n1179
16095a83567M1789N7174R6455N2899j00936k6051J0628k18377K27808J63598m27010
16084c05590j23378J86951o1147K0651K25470Ro2757m2658J38603L7406p4703
16073f1143k49993j19289o1568M3420j4260J86300l2736M7085J18435j5456K78916
16062A19711K88257k19480k89842j82902J79028j07446j59054J25590J75038o8827
$$ plain form
16052 -139927 -201475 -91298 -229941 -483116 -407226 -231757 92526 308898 244086 301316
16042 301316 119058 67152 -16001 167347 206895 202760 4497 294210 613942 553525 224830
16031 224830 27391 114301 243958 505696 584005 340112 316464 245216 493546 555997
16021 555997 654920 528470 126819 48194 1587 -245867 -95096 274277 538693 274306
16011 274306 -5224 -85932 -62643 100366 -27159 -59761 -81229 -114074 60883 250498
16001 250498 210825 31554 154476 79441 52874 256656 94219 34168 146809 30384
15991 30384 -39650 -17387 -273350 -193836 -221062 -425446 -540245 -321244 -18999 -37332 -400944
15980 -400944 -624227 -344682 -57467 208666 160996 -32700 -164631 -435004 -494997 -478331
$$ packed form
16052a39927o1548J10177j38643k53175P5890J75469L24283K16372o4812N7230
16042C01316j82258n1906q3153J83348L9548m135j98263K89713L19732o0417l28695
16031B24830j97439Q6910J29657K61738P8309k43893k3648p1248K48330O2451
16021E55997R8923j26450m01651p8625m6607k47454J50771L69373K64416k64387
16011B74306k79530q0708K3289J63009j27525l2602k1468l2845J74957J89615
16001B50498l9673j79271J22922p5035k6567K03782j62437o0051J12641j16425
15991C0384p0034K2263k55963P9514k7226k04384j14799K19001L02245j8333l63612
15980d00944k23283K79545K87215K66133m7670j93696j31931k70373n9993J6666
$$ plain form
15970 -478331 -369773 -361501 -82550 -201516 -457492 -578039 -163483 310432 177434 -224238
15960 -224238 -260546 -355438 -210977 85168 96356 -154177 -414715 -490411 -328433 -110921
15950 -110921 -137219 23869 34549 114370 92317 3121 -210171 -351106 -127744 -80927 -307015
15939 -307015 -62351 237454 119255 -71603 -103523 -212946 -366795 -616563 -346555 -38406
15929 -38406 -188396 -319063 -472466 -429087 -370364 -292084 -136274 66303 -94271 -174328
15919 -174328 -243348 -632627 -558492 -474261 -700248 -723059 -668837 -474914 -478191 -143097 201732
15908 201732 460879 254900 90686 -24454 -59757 2932 122031 126772 -6854 -86808
15898 -86808 108862 292889 249191 99127 -124310 -406269 -385458 -51409 -140988 -246946
$$ packed form
15970d78331J08558Q272K78951j18966k55976j20547M14556M73915j32998m01672
15960b24238l6308r4892J44461K96145J1188k50533k60538p5696J61978K17512
15950a10921k6298J61088J0680P9821k2053q9196k13292j40935K23362M6817k26088
15939c07015K44664K99805j18199j90858l1920j09423j53849k49768K70008L08149
15929c8406j49990j30667j53403M3379N8723P8280J55810K02577j60574q0057
15919a74328o9020l89279P4135Q4231k25987k2811N4222J93923l277L35094L44829
15908B01732K59147k05979j64214j15140l5303O2689J19099M741j33626p9954
15898h6808J95670J84027m3698j50064k23437k81959K0811L34049q9579j05958
$$ plain form
15888 -246946 -142807 -92623 64705 261269 149362 113517 51471 -72740 -270779 -346625
15878 -346625 -296855 -118754 110803 258381 80482 73269 133948 -173558 -510237 -523743
15868 -523743 -388356 -183902 -200918 -150539 -242214 -129304 251978 243238 261892 202980 -194967
15857 -194967 -566745 -502522 -554975 -307912 -337903 -211428 -46067 148503 155990 108378 98577
15846 98577 8844 -84080 -40309 162769 178557 248591 262285 33359 -199848 -385624 -49288
15835 -49288 39910 117455 -182169 -416060 -69583 -18168 -229021 -105811 151715 459472
15825 459472 629342 263388 183872 108038 183829 93882 15450 -117646 -79314 85010 50973
15814 50973 168919 75372 95567 144719 70237 5722 -133552 -249484 -341016 -101522 89094
$$ packed form
15888b46946J04139N0184J57328J96564j11907l5845o2046j24211j98039p5846
15878c46625M9770J78101K29557J47578j77899p213O0679l07506l36679j3506
15868e23743J35387K04454j7016N0379r1675J12910L81282q740J8654n8912l97947
15857a94967l71778O4223n2453K47063k9991J26475J65361J94570P487m7612r801
15846I8577q9733r2924M3771K03078J5788P0034J3694k28926k33207j85776L36336
15835d9288Q9198P7545k99624k33891L46477N1415k10853J23210K57526L07757
15825D59472J69870l65954p9516p5834P5791q9947p8432j33096L8332J64324l4037
15814E0973J17946r3547K0195M9152p4482o4515j39274j15932r1532K39494J90616
$$ plain form
15803 89094 27864 256526 310322 84625 -180580 -135276 -320929 -206934 -118207 -144109 -124116
15792 -124116 -30808 -33721 -81259 84713 180805 -21032 -46378 -121451 -477104 -262415 -3845
15781 -3845 281456 88052 14630 -44329 -244518 32866 -88581 -339554 -448325 -584755
15771 -584755 -534786 -222928 64375 105149 178477 172907 -94427 -70922 81914 89916 57080
15760 57080 -46262 -339896 -590623 -343232 -380897 -215114 -88087 -85813 40960 157235
15750 157235 305154 129829 80740 15955 -255299 -281146 -182753 72817 65050 -30358 -119811
15739 -119811 -259695 -196713 -102332 21773 -105654 -89384 29731 17677 118744 339339
15729 339339 381712 201913 -48087 326 235394 347172 102569 5425 208641 376764
$$ packed form
15803H9094o1230K28662N3796k25697k65205M5304j85653J13995Q8727k5902J9993
15792a24116R3308k913m7538J65972R6092k01837k5346p5073l55653K14689K58570
15781c845K85301j93404p3422n8959k00189K77384j21447k50973j08771j36430
15771e84755M9969L11858K87303M0774P3328n570k67334K3505J52836Q002l2836
15760E7080j03342k93634k50727K47391l7665J65783J27027K274J26773J16275
15750A57235J47919j75325m9089o4785k71254k5847R8393K55570p767r5408q9453
15739a19811j39884O2982R4381J24105j27427J6270J19115j2054J01067K20595
15729C39339M2373j79799k50000M8413K35068J11778k44603r7144K03216J68123
$$ plain form
15719 376764 397324 372384 283439 286936 429750 173818 -331644 -482872 -278332 -4559
15709 -4559 48729 118083 37512 302783 471818 332052 453191 125018 -245281 -349867
15699 -349867 -394031 -451852 -157685 71165 235055 -94033 -171161 -404370 -150254 -57345
15689 -57345 -190351 10580 380911 333187 393925 173364 -127299 -129832 -308968 -381295 -284872
15678 -284872 -111212 -8373 91742 201718 187838 148828 161204 86480 7128 -226228
15668 -226228 -303642 -362301 -319362 -404768 -297367 42958 119758 52113 1666 -183340 106433
15657 106433 101724 -174746 -17693 315162 778862 608960 641639 491414 305968 -144146
15647 -144146 -497143 -808792 -650303 -437725 -248549 -102419 -39135 -10352 78094 35696
$$ packed form
15719C76764K0560k4940q8945L497J42814k55932n05462j51228K04540K73773
15709d559N3288O9354q0571K65271J69035j39766J21139l28173l70299j04586
15699c49867m4164n7821K94167K28850J63890l29088p7128k33209K54116R2909
15689e7345j33006K00931L70331m7724O0738k20561l00663k533j79136p2327R6423
15678b84872J73660J02839J00115J09976j3880l9010J2376p4724p9352k33356
15668b26228p7414n8659M2939q5406J07401L40325P6800o7645n0447j85006K89773
15657A06433m709k76470J57053L32855M63700j69902L2679j50225j85446m50114
15647a44146l52997l11649J58489K12578J89176J46130O3284K8783Q8446m2398
$$ plain form
15637 35696 82332 14795 -308389 -295918 -274118 -338272 -294206 -161633 -285779 -200411 54952
15626 54952 142044 -69050 -211819 -113026 10941 192586 298188 220071 96118 149671
15616 149671 -57683 20775 85783 -56812 -42406 -202474 -374072 -9709 166835 154883
15606 154883 173788 428243 392467 251602 269167 491747 677122 495535 174258 24476
15596 24476 95568 -196644 -177221 88063 40000 46969 -44420 -77116 14006 40793 17716
15585 17716 -96780 -186404 -116120 -16994 3718 85428 94353 -124332 -221829 -50087 -79715
15574 -79715 -64134 46896 9895 -79845 -87459 63611 -36141 -117024 -2146 124263 101312
15563 101312 184253 141544 -8552 -105147 234646 333821 260585 290159 447799 472629 330389
$$ packed form
15637C5696M6636o7537l23184J2471K1800o4154M4066J32573j24146Q5368K55363
15626E4952Q7092k11094j42769R8793J23967J81645J05602p8117j23953N3553
15616A49671k07354P8458O5008j42595J4406j60068j71598L64363J76544j1952
15606A54883J8905K54455l5776j40865J7565K22580J85375j81587l21277j49782
15596B4476P1092k92212J9423K65284m8063O969r1389l2696R1122K6787k3077
15585A7716j14496q9624P0284R9126K0712Q1710Q925k18685r7497J71742k9628
15574g9715J5581J11030l7001q9740p614J51070r9752q0883J14878J26409k2951
15563A01312Q2941m2709j50096r6595L39793R9175p3236K9574J57640K4830j42240
$$ plain form
15552 330389 179022 83061 99370 -137135 -274767 28392 45068 -61411 -12730 54602
15542 54602 257252 69663 57114 53087 25370 50565 -93642 -307955 -465090 -460230 -296131
15531 -296131 -64082 -3036 -195512 -435795 -243907 19255 364244 300626 42377 -88152
15521 -88152 -56014 -1185 -121445 -120728 28511 84179 -211648 -58124 43953 -50701 111411
15510 111411 -64468 -132832 -107971 101791 280472 75394 -114652 -299458 -47449 133830
15500 133830 -37137 -82081 -292785 -323107 -194294 31139 144537 108629 -78522 -185152
15490 -185152 -176632 -67199 -160559 -244633 125167 85867 -218825 -646849 -748046 -538861
15480 -538861 -385296 -98602 -94818 -246710 -303515 -68649 169358 79488 384 44544 -88244
$$ packed form
15552C30389j51367r5961J6309k36505j37632L03159J6676j06479M8681O7332
15542E4602K02650j87589j2549m027k7717K5195j44207k14313j57135M860J64099
15531b96131K32049O1046j92476k40283J91888K63162L44989o3618k58249j30529
15521h8152L2138N4829j20260P17J49239N5668k95827J53524J02077r4654J62112
15510A11411j75879o8364K4861K09762J78681k05078j90046j84806K52009J81279
15500A33830j70967m4944k10704l0322J28813K25433J13398l5908j87151j06630
15490a85152Q520J09433r3360q4074L69800l9300l04692m28024j01197K09185
15480e38861J53565K86694L784j51892n6805K34866K38007q9870p9104M4160j32788
$$ plain form
15469 -88244 -226195 39261 207373 234313 511758 482407 321622 325298 249584 -184678 -504214
15458 -504214 -558205 -213960 84767 172680 57971 -56073 -162260 -201217 -181508 -33792
15448 -33792 -127128 -291204 -188514 -19240 75626 -33415 -147588 -166212 -131139 -265004
15438 -265004 -225794 -130350 4387 303371 180067 335921 410724 292795 52007 -203904
15428 -203904 -319783 -326764 -226148 -126449 -108727 -18725 220846 373530 339241 363533 155863
15417 155863 -149547 -205873 205142 447941 517218 428039 -21591 -104488 -36038 118079
15407 118079 -21872 146402 343639 34182 -117018 -96801 -259238 47845 247791 285460
15397 285460 348565 320135 360322 276417 195636 51257 72134 -156894 -239214 -301265 -380182
$$ packed form
15469h8244j37951K65456J68112K6940K77445k9351j60785L676p5714m34262l19536
15458e04214n3991L44245K98727Q7913j14709j14044j06187l8957J9709J47716
15448c3792r3336j64076J02690J69274R4866j09041j14173j8624L5073j33865
15438b65004L9210R5444J34737K98984j23304J55854P4803j17929k40788k55911
15428b03904j15879o981J00616R9699J7722R0002K39571J52684l4289K4292k07670
15417A55863l05410n6326M11015K42799O9277q9179m49630q2897O8450J54117
15407A18079j39951J68274J97237l09457j51200K0217j62437L07083J99946L7669
15397B85460O3105k8430M0187q3905q0781j44379K0877k29028q2320o2051p8917
$$ plain form
15386 -380182 69585 13798 -171200 -478771 -411796 -195082 -282083 -289763 -573913 -685533
15376 -685533 -547257 -468671 -191166 -7548 5601 -261484 -306793 -147758 60394 -110358
15366 -110358 -219202 -283872 -103996 -111034 -135558 -226 -53116 -186581 -302820 -25524
15356 -25524 139708 53170 -171362 -184570 -58841 -98799 -105078 -74545 -18793 16403 142122
15345 142122 244915 350277 226289 -30830 188 -133918 -113061 -53108 -258860 -425329
15335 -425329 -556210 -396363 -155904 -145766 -184928 -150038 -139052 -72643 -166578 -379904 -223463
15324 -223463 -31135 -223464 -276043 -143633 -113148 73143 91348 162808 114658 -51287
15314 -51287 51670 -275758 -438338 -524479 -750659 -633236 -527620 -344548 -316689 -408411
$$ packed form
15386c80182M49767n5787j84998l07571O6975K16714q7001p680k84150j11620
15376f85533J38276P8586K77505J83618J3149k67085m5309J59035K08152j70752
15366a10358j08844o4670J79876p038k4524J35332n2890j33465j16239K77296
15356b5524J65232q6538k24532j3208J25729l9958o279L0533N5752L5196J25719
15345A42122J02793J05362j23988k57119L1018j34106K0857N9953k05752j66469
15335d25329j30881J59847K40459J0138l9162L4890J0986O6409r3935k13326J56441
15324b23463J92328j92329n2579J32410L0485J86291J8205P1460m8150j65945
15314e1287J02957l27428j62580q6141k26180J17423J05616J83072K7859r1722
$$ plain form
15304 -408411 -484341 -636870 -392053 -396858 -503413 -340280 -42467 -35744 -213853 -295320 -198903
15293 -198903 302874 344415 3903 -19888 145825 240748 -112433 -231070 -274237 -308107
15283 -308107 -180649 -122920 -274962 -81381 -113211 -119720 131090 -56442 -56691 125744 596240
15272 596240 416362 140409 56057 -62318 -73868 -63768 -246559 -235476 -239913 -229131 -165816
15261 -165816 -350333 -305264 -251661 -298557 -97219 -153695 -222791 -226283 -188837 -7636 -79079
15250 -79079 -9409 -94911 -63350 -155917 -278199 -254697 -259446 -356999 -61488 16496 235449
15239 235449 146911 109186 25369 -36541 48058 45641 -159119 -506138 -613337 -542997 -272006
15228 -272006 -285327 -314976 -168534 -193096 -174685 -305678 -379740 -125643 66761 425044
$$ packed form
15304d08411p5930j52529K44817m805j06555J63133K97813O723j78109q1467R6417
15293a98903N01777M1541l40512k3791J65713R4923l53181j18637m3167l3870
15283c08107J27458N7729j52042J93581l1830o509K50810j87532k49J82435M70496
15272E96240j79878k75953q4352j18375j1550J0100j82791J1083m437J0782O3315
15261a65816j84517M5069N3603m6896K01338n6476o9096l492L7446J81201p1443
15250g9079O9670q5502L1561r2567j22282K3502m749r7553K95511P7984K18953
15239B35449q8538l7725q3817o1910Q4599k417k04760l47019j07199P0340K70991
15228b72006j3321k9649J46442k4562J8411j30993p4062K54097J92404L58283
$$ plain form
15218 425044 461511 388515 443430 176698 -281238 -501661 -447342 -123343 72389 -20406
15208 -20406 -46992 -216432 -215257 -93099 -245204 -205828 -104189 13346 -43192 74593 -164373
15197 -164373 -275210 -200060 -324165 -367398 -209667 -37677 -244536 -262359 -329078 -254751
15187 -254751 -377299 -427215 -268932 -253960 -13973 105993 -151733 -227584 2205 330472
15177 330472 199748 7340 -256401 -297738 -196696 -66098 -124824 -58542 168232 93536
15167 93536 -162975 -60209 141396 429120 508744 722297 366996 152646 264310 63786
15157 63786 57160 19384 -37249 85133 105722 36146 62622 49925 403587 324203 8965
15146 8965 186399 121472 40159 -133951 -159651 -115909 -39119 62343 393603 414704 309116
$$ packed form
15218D25044L6467p2996N4915k66732m57936k20423N4319L23999J95732r2795
15208b0406k6586j69440J175J22158j52105L9376J01639J17535n6538J17785k38966
15197a64373j10837P5150j24105m3233J57731J71990k06859j7823o6719P4327
15187b54751j22548m9916J58283J4972K39987J19966k57726p5851K29789L28267
15177C30472j30724j92408k63741m1337J01042J30598n8726O6282K26774p4696
15167I3536k56511J02766K01605K87724P9624K13553l55301k14350J11664k00524
15157F3786o626l7776n6633J22382K0589o9576K6476j2697L53662p9384l15238
15146H965J77434o4927q1313j74110k5700M3742P6790J01462L31260K1101j05588
$$ plain form
15135 309116 245211 -71771 -282827 -304430 -40675 183076 297862 223953 -123565 -72418
15125 -72418 44148 -69702 -147019 -2839 20601 100932 215234 91989 -51296 21274
15115 21274 233158 -40240 -48066 165152 197679 -6080 -350929 -285156 -81979 2357 165635
15104 165635 575049 675298 751975 763676 576588 523705 677979 641956 278169 204424
15094 204424 262581 -37211 1728 151095 39243 115548 -95091 -331031 -242187 -72739
15084 -72739 83039 35179 38467 -78623 -119338 -229141 -143404 -244539 -98205 89103 -195309
15073 -195309 -406949 -151177 -236948 -453354 -540902 -481932 -327797 -256285 -268241 -172613 -14219
15062 -14219 63701 260142 173939 66734 -184 -181074 -411601 -468179 -373419 -655968 -601511
$$ packed form
15135C09116o3905l16982k11056k1603K63755K23751J14786p3909l47518N1147
15125g2418J16566j13850p7317J44180K3440Q0331J14302j23245j43285P2570
15115B1274K11884k73398p826K13218L2527k03759l44849O5773K03177Q4336J63278
15104A65635M09414J00249P6677J1701j87088n2883J54274l6023l63787p3745
15094B04424N8157k99792L8939J49367j11852P6305k10639k35940Q8844J69448
15084g2739J55778m7860L288j17090m0715j09803Q5737j01135J46334J87308k84412
15073a95309k11640K55772q5771k16406q7548N8970J54135P1512j1956R5628J58394
15062a4219P7920J96441q6203j07205o6918j80890k30527n6578R4760k82549N4457
$$ plain form
15051 -601511 -189274 -15036 93436 312092 172967 106192 285844 107808 -207064 -242398
15041 -242398 -162022 -209350 136599 386037 404971 409711 677077 772969 671596 657851 50336
15030 50336 7590 31170 -166216 -486690 -507237 -356494 -147580 106510 180663 217120 99314
15019 99314 100378 206500 165711 -218998 -253048 -155439 -318902 -29724 155676 135315 177779
15008 177779 274618 550972 812580 1344396 2122093 2968084 4780474 7235943 9142320
14999 9142320 9769401 8003764 5320572 3484440 2612974 2090513 1811460 1650688 1383027
14990 1383027 1373915 1421507 1266807 1223450 1192783 1089016 934317 650103 601636 825734
14980 825734 785090 486192 551908 367287 246179 405179 312872 122518 -116429 -197930
$$ packed form
15051f01511M12237J74238J08472K18656j39125o6775J79652j78036l14872l5334
15041b42398Q0376m7328L45949K49438J8934M740K67366R5892j01373j3745o07515
15030E0336m2746K3580j97386l20474k0547J50743K08914K54090P4153L6457j17806
15019I9314J064J06122m0789l84709l4050R7609j63463K89178J85400k0361M2464
15008A77779R6839K76354K61608N31816P77697Q45991J812390K455469J906377
14999I142320O27081j765637k683192j836132q71466n22461k79053j60772k67661
14990A383027r112M7592j54700m3357l0667j03767j54699k84214m8467K24098
14980H25734m0644k98898O5716j84621j21108J59000r2307j90354k38947q1501
$$ plain form
14970 -197930 10381 52011 269455 318836 14477 -212882 130656 401394 302503 24639
14960 24639 -240343 -86534 212544 340564 445317 501021 281247 143999 32440 284265
14950 284265 266984 91395 167691 128942 -88674 -12013 178054 172702 81530 227074 223537
14939 223537 197281 222388 284403 454903 373118 245857 -138549 -380457 -135233 -45798
14929 -45798 116550 35934 -524537 -499435 -364877 -189524 31998 272400 325956 260950
14919 260950 27958 108928 -26832 -41369 -2153 163361 265957 81280 -14826 32041
14909 32041 21688 222387 462016 551702 265828 -20555 -4323 101078 -128420 -94929
14899 -94929 24876 -166010 -254254 -247428 9823 126709 80821 -212252 -522566 -372875
$$ packed form
14970a97930K08311M1630K17444M9381l04359k27359L43538K70738r8891k77864
14960B4639k64982J53809K99078J28020J04753N5704k19774j37248j11559K51825
14950B84265j7281j75589P6296l8749k17616P6661J90067n352r1172J45544l537
14939B23537k6256K5107O2015J70500q1785j27261l84406k41908K45224Q9435
14929d5798J62348q0616n60471K5102J34558J75353K21522K40402N3556o5006
14919B60950k32992Q0970j35760j4537L9216J65514J02596j84677r6106M6867
14909C2041j0353K00699K39629Q9686k85874k86383J6232J05401k29498L3491
14899i4929J19805j90886q8244O826K57251J16886m5888k93073l10314J49691
$$ plain form
14889 -372875 -90931 -46252 -66492 -41204 -198067 -369232 -448340 -385625 111659 271164
14879 271164 67971 -53677 -189957 -296463 -175660 4801 199879 342374 557993 545394
14869 545394 415627 238027 21346 -33157 -200077 -104376 -2214 53145 104521 35455
14859 35455 231798 208773 118371 128311 82095 134589 -129763 -337260 -236837 -178332 131079
14848 131079 324731 174299 106130 314342 232868 -28270 -168800 -27910 -252694 -550976
14838 -550976 -394795 -230058 -315536 -332692 -25196 186288 398010 351604 143226 68164
14828 68164 1494 151778 35867 -154020 -336800 -418846 -440384 -485941 -433211 -354960 -433770
14817 -433770 -432293 -270765 -271781 -377067 -402272 -134133 332920 275179 165515 -66681 -316160
$$ packed form
14889c72875K81944M4679k0240K5288j56863j71165p9108O2715M97284J59505
14879B71164k03193j21648j36280j06506J20803J80461J95078J42495K15619j2599
14869E45394j29767j77600k16681n4503j66920R5701J02162N5359N1376o9066
14859C5455J96343k3025r0402R940m6216N2494k64352k07497J00423N8505L09411
14848A31079J93652j50432o8169K08212q1474k61138j40530J40890k24784k98282
14838e50976J56181J64737q5478j7156L07496K11484K11722m6406k08378p5062
14828F8164o6670J50284j15911j89887j82780q2046k1538m5557N2730P8251p8810
14817d33770J477J61528j016j05286k5205K68139M67053n7741j09664k32196k49479
$$ plain form
14806 -316160 -158362 -20742 -140652 -299664 -338339 -379496 -292503 -160014 -160875 -468610 -489406
14795 -489406 -144224 -51694 248359 193721 68120 19580 119067 42195 -184941 -424345
14785 -424345 -330803 -233602 -112258 232725 277501 454490 237418 126077 -26006 -234747
14775 -234747 -349530 -280950 -210111 -298309 -369286 -309877 61345 371618 78587 -60622
14765 -60622 -79642 -319251 -197320 -31838 9411 -275401 -371875 -406743 -236592 -142784 -31516
14754 -31516 24691 -139998 -388730 -629280 -481410 -131066 132135 -5447 -173832 101076
14744 101076 410196 139630 137769 170194 88159 37577 -93317 -114507 -292925 -73278 -99960
14733 -99960 -399766 -568791 -520961 -539429 -648048 -474675 -220095 -158157 -127740 -24283
$$ packed form
14806c16160J57798J37620j19910j59012l8675m1157Q6993J32489q61l07735k0796
14795d89406L45182R2530L00053n4638j25601m8540R9487p6872k27136k39404
14785d24345R3542R7201J21344L44983M4776J76989k17072j11341j52083k08741
14775b34747j14783O8580P0839q8198p0977N9409L71222L10273k93031j39209
14765f0622j9020k39609J21931J65482M1249k84812r6474l4868J70151R3808J11268
14754c1516N6207j64689k48732k40550J47870L50344K63201j37582j68385K74908
14744A01076L09120k70566j861L2425q2035n0582j30894k1190j78418K19647k6682
14733i9960k99806j69025M7830j8468j08619J73373K54580O1938L0417J03457
$$ [...]
##END NTUPLES=NMR SPECTRUM
##END=
