##TITLE=Analysis number 321506
Compound Code cc 10001
Project Code adrs
Chemist Name endeavour
##JCAMPDX= 6.0         $$ Bruker NMR JCAMP-DX V2.0
##DATA TYPE= NMR SPECTRUM
##DATA CLASS= NTUPLES
##ORIGIN= Bruker BioSpin GmbH
##OWNER= nmr
$$ XWIN-NMR		Version 3.5
$$ Mon Aug 14 11:11:57 2006 GMT Daylight Time (UT+1h)  MAYBRIDGE\nmr@NMR_250MHZ
##.OBSERVE FREQUENCY= 250.131544655141
##.OBSERVE NUCLEUS= ^1H
##.ACQUISITION MODE= SIMULTANEOUS (DQD)
##.ACQUISITION SCHEME= undefined
##.AVERAGES= 16
##.DIGITISER RES= 18
##SPECTROMETER/DATA SYSTEM= dpx250
##.PULSE SEQUENCE= zg30
##.SOLVENT NAME= DMSO
##.SHIFT REFERENCE= (INTERNAL, DMSO, 0, 16.522)
##AUDIT TRAIL= $$ (NUMBER, WHEN, WHO, WHERE, WHAT)
$$ ##TITLE= Audit trail, XWIN-NMR		Version 3.5
$$ ##JCAMPDX= 5.01
$$ ##ORIGIN= Bruker BioSpin GmbH
$$ ##OWNER= nmr
$$ C:\u/data/dgb/nmr/ADRS/780/pdata/1/auditp.txt
$$ ##AUDIT TRAIL=  $$ (NUMBER, WHEN, WHO, WHERE, WHAT)
(   1,<2006-08-14 11:11:36.74 +100>,<MAYBRIDGE\nmr>,<NMR_250MHZ>,
      <created by zg, POWCHK disabled, PULCHK disabled
       configuration hash MD5:
       E2 DF 36 D8 04 B2 41 60 5A D7 A3 38 5A 4B D0 FE
       data hash MD5: 64K
       D9 F9 65 78 34 BE 3E 47 D6 5C 22 F2 81 8C 8B C2>)
(   2,<2006-08-14 11:11:49.37 +100>,<MAYBRIDGE\nmr>,<NMR_250MHZ>,
      <Start of raw data processing
       ef LB = 0.3 FT_mod = 6 PKNL = 1 SI = 32K 
       data hash MD5: 32K
       4C 1D 61 18 65 02 46 98 63 19 73 AE CA CB 10 5A>)
(   3,<2006-08-14 11:11:51.10 +100>,<MAYBRIDGE\nmr>,<NMR_250MHZ>,
      <apk 
       data hash MD5: 32K
       6F C3 61 36 EA 41 25 A4 4A C6 3E 35 34 6F C4 FA>)
(   4,<2006-08-14 11:11:51.93 +100>,<MAYBRIDGE\nmr>,<NMR_250MHZ>,
      <abs ABSG = 5 
       data hash MD5: 32K
       77 3E 13 7C 5F 7C C1 23 C7 21 B5 24 30 97 FB 60>)
$$ ##END=
$$ 
$$ hash MD5
$$ 1C A7 4B 8D BF 43 FB 40 B2 E4 DD AE 00 13 D2 45
##$RELAX= 
##$RELAX= 
##$RELAX= 
##$RELAX= 
##$RELAX= 
##$RELAX= 
##$RELAX= 
$$ Bruker specific parameters
$$ --------------------------
##$DU= <C:\u>
##$EXPNO= 780
##$NAME= <ADRS>
##$PROCNO= 1
##$TYPE= <nmr>
##$USER= <dgb>
##$AMP= (0..31)
100 100 100 100 100 100 100 100 100 100 100 100 100 100 100 100 100 100 
100 100 100 100 100 100 100 100 100 100 100 100 100 100 
##$AQSEQ= 0
##$AQ_mod= 3
##$AUNM= <au_zg>
##$AUTOPOS= <10 >
##$BF1= 250.13
##$BF2= 250.13
##$BF3= 250.13
##$BF4= 250.13
##$BF5= 500.13
##$BF6= 500.13
##$BF7= 500.13
##$BF8= 500.13
##$BYTORDA= 1
##$CFDGTYP= 0
##$CFRGTYP= 5
##$CHEMSTR= <none>
##$CNST= (0..31)
1 1 145 1 1 1 1 1 1 1 1 1 1 1 1 1 1 1 1 1 1 1 1 1 1 1 1 1 1 1 1 1 
##$CPDPRG= <>
##$CPDPRG1= <>
##$CPDPRG2= <>
##$CPDPRG3= <>
##$CPDPRG4= <mlev>
##$CPDPRG5= <mlev>
##$CPDPRG6= <mlev>
##$CPDPRG7= <mlev>
##$CPDPRG8= <mlev>
##$CPDPRGB= <>
##$CPDPRGT= <>
##$D= (0..31)
0 1 0 0 0 0 0 0 0 0.06 0 0 0 0 0 0 0.0002 0 0 0 0 0 0 0 0 0 0 0 0 0 0 
0 
##$DATE= 1155550295
##$DBL= (0..7)
120 120 120 120 120 120 120 120 
##$DBP= (0..7)
150 150 150 150 150 150 150 150 
##$DBP07= 0
##$DBPNAM0= <>
##$DBPNAM1= <>
##$DBPNAM2= <>
$$ [...]
##$SUBNAM7= <"">
##$SUBNAM8= <"">
##$SUBNAM9= <"">
##$SW= 20.6930455092707
##$SWIBOX= (0..15)
0 0 3 0 0 0 0 0 0 0 0 0 0 0 0 0 
##$SW_h= 5175.983436853
##$TD= 65536
##$TD0= 1
##$TE= 295.16
##$TE2= 300
##$TE3= 300
##$TEG= 300
##$TL= (0..7)
0 120 120 120 120 120 120 120 
##$TP= (0..7)
150 150 150 150 150 150 150 150 
##$TP07= 0
##$TPNAME0= <>
##$TPNAME1= <>
##$TPNAME2= <>
##$TPNAME3= <>
##$TPNAME4= <>
##$TPNAME5= <>
##$TPNAME6= <>
##$TPNAME7= <>
##$TPOAL= (0..7)
0.5 0.5 0.5 0.5 0.5 0.5 0.5 0.5 
##$TPOFFS= (0..7)
0 0 0 0 0 0 0 0 
##$TUNHIN= 0
##$TUNHOUT= 0
##$TUNXOUT= 0
##$USERA1= <user>
##$USERA2= <user>
##$USERA3= <user>
##$USERA4= <user>
##$USERA5= <user>
##$V9= 5
##$VALIST= <valist>
##$VCLIST= <CCCCCCCCCCCCCCC>
##$VD= 0
##$VDLIST= <DDDDDDDDDDDDDDD>
##$VPLIST= <PPPPPPPPPPPPPPP>
##$VTLIST= <TTTTTTTTTTTTTTT>
##$WBST= 1024
##$WBSW= 4
##$XGAIN= (0..3)
0 0 0 0 
##$XL= 0
##$YL= 0
##$YMAX_a= 393260
##$YMIN_a= -445485
##$ZGOPTNS= <>
##$ZL1= 120
##$ZL2= 120
##$ZL3= 120
##$ZL4= 120
##$ABSF1= 16.522
##$ABSF2= -4.171173
##$ABSG= 5
##$ABSL= 3
##$ALPHA= 0
##$AQORDER= 0
##$ASSFAC= 0
##$ASSFACI= 0
##$ASSFACX= 0
##$ASSWID= 0
##$AUNMP= <proc_1d>
##$AZFE= 0.1
##$AZFW= 0.1
##$BCFW= 0
##$BC_mod= 0
##$BYTORDP= 0
##$COROFFS= 0
##$CY= 12.5
##$DATMOD= 1
##$DC= 0
##$DFILT= <>
##$DTYPP= 0
##$F1P= 14.0000005364418
##$F2P= -0.99999901652339
##$FCOR= 0.5
##$FTSIZE= 32768
##$FT_mod= 6
##$GAMMA= 0
##$GB= 0
##$INTBC= 1
##$INTSCL= 1
##$ISEN= 128
##$LB= 0.3
##$LEV0= 0
##$LPBIN= 0
##$MAXI= 10000
##$MC2= 0
##$MEAN= 0
##$ME_mod= 0
##$MI= 0
##$NCOEF= 0
##$NC_proc= -3
##$NLEV= 6
##$NOISF1= 0
##$NOISF2= 0
##$NSP= 0
##$NTH_PI= 0
##$NZP= 0
##$OFFSET= 16.522
##$PC= 1
##$PHC0= 138.2996
##$PHC1= 9.649044
##$PH_mod= 1
##$PKNL= yes
##$PPARMOD= 0
##$PSCAL= 4
##$PSIGN= 0
##$REVERSE= no
##$SF= 250.13
##$SI= 32768
##$SIGF1= 0
##$SIGF2= 0
##$SINO= 400
##$SIOLD= 32768
##$SREGLST= <1H.DMSO>
##$SSB= 0
##$STSI= 32768
##$STSR= 0
##$SW_p= 5175.98343685301
##$SYMM= 0
##$S_DEV= 0
##$TDeff= 65536
##$TDoff= 0
##$TI= <Analysis number 999999
Compound Code 99
Book Reference 9
Project Code 9>
##$TILT= no
##$TM1= 0
##$TM2= 0
##$TOPLEV= 0
##$USERP1= <user>
##$USERP2= <user>
##$USERP3= <user>
##$USERP4= <user>
##$USERP5= <user>
##$WDW= 1
##$XDIM= 32768
##$YMAX_p= 532924935
##$YMIN_p= -144805
$$ End of Bruker specific parameters
$$ ---------------------------------
##NTUPLES= NMR SPECTRUM
##VAR_NAME=  FREQUENCY,     SPECTRUM/REAL,   SPECTRUM/IMAG
##SYMBOL=    X,             R,               I
##VAR_TYPE=  INDEPENDENT,   DEPENDENT,       DEPENDENT
##VAR_FORM=  AFFN,          ASDF,            ASDF
##VAR_DIM=   32768,         32768,           32768
##UNITS=     HZ,            ARBITRARY UNITS, ARBITRARY UNITS
##FACTOR=    0.157963299565203, 1,           1
##FIRST=     4132.6476996994, 0,             0
##LAST=      -1043.33573715361, 0,           0
##MIN=       -1043.33573715361, -144805,     0
##MAX=       4132.6476996994, 532924935,     0
$$ Real data points
##PAGE= N=1
##DATA TABLE= (X++(R..R)), XYDATA
$$ [...]
16259e066O7K2283L1579j9612k4016j380q454O963K3471q729R713j4161j9248
16246f590J0617J0790j5864N972Q748r00L3130l012n1709J7721J3226k7944J7488
16233A1673O835j6110J0477k7253K686J5486J1665j3462m7012k4633L8187K4689
16221f772n420J1869l030R700O290k0739j3169P698k197R987k1720k5494K2980
16208c0017O3248K2329j2340k3972j0257K5304J0215r248j1047j6326j4201j6403
16196b2715j5044J7103J9179q952K4965J1699p038n062j4422k757l807P137q553
16183h267n372j897j7218k0740M077K6004K6695M946P805Q810k3400p61k2653
16170b1971L148m044N182K970k8951r904n125l3714n936J7678M6804J1384J0293
$$ y = [-5066, -4999, 17284, 48863, 29251, 5235, 3855, -4599, 2364, 25835, 17106, 26819, 12658, -6590, 4027, 14817, -1047, 4925, 13673, 12773, 45903, 42891, -8818, 8903, 22129, -5815, 11673, 18508, 2398, 12875, -14378, -11692, 3794, 15459, 1997, -45015, -69648, -31461, -6772, -12192, -323, -3353, 6347, 12637, -8102, -21271, -13573, -15770, -5783, -27503, -52997, -30017, 33231, 55560, 43220, 19248, 8991, 34295, 44510, 35262, 24215, 7889, -6312, -22715, -37759, -20656, -1477, -10429, 14536, 26235, 19197, 14135, -287, -3044, -6851, 286, -8267, -13639, -15536, -32754, -53494, -49417, -23413, 3282, 8228, 16033, 24843, 1443, 682, -21971, -18823, -22867, -17685, -14715, -43666, -53570, -58695, -92409, -98345, -80667, -33863, -22479, -12186]
16157a2186K1291k1312k640J1661J0443k7477K321M4820J2609r320L165k5855
16145G520L608K5750m521l3002k5681j7913j9467J3108K3548O819p611j8436L0946
16132a5332M282J82R103J0808M149j7328j1357p377J5682q385j6916r49L777J6992
16118a2669J1646j234p259j704J1686m81j1805K1803L42j9231l7137j4181J9877
16105d0347L2085k150K346j6008N192j113O482J8612K2922K0557j0852l0550k8850
16092b1674j0509P606L0625j6384O427K6867j9457l3471J07L338j9348J2763K3023
16079a0087N852k6244j8374n180p240K197o797K1525K9385J6607j431J1271k3167
16066a1683l3547q60M9017L418j9363J0897k6907p093J8175O386l343k2708k3569
$$ y = [-12186, 9105, -12207, -14847, -3186, 7257, -20220, -17899, 26921, 39530, 30210, 33375, 7520, 11128, 36878, 32357, -645, -26326, -44239, -63706, -50598, -27050, -20231, -27842, -46278, -15332, -11050, -10868, -1765, 9043, 13192, -4136, -15493, -22870, -7188, -15573, -32489, -33438, -29661, -12669, -1023, -2257, -9516, -11220, 466, -15, -11820, 9983, 10325, -8906, -46043, -60224, -40347, -8262, -10412, -8066, -24074, -18882, -19995, -13513, 5099, 28021, 48578, 37726, 7176, -21674, -32183, -24577, 6048, -10336, -3909, 22958, 3501, -29970, -29863, -26525, -45873, -33110, -10087, -4235, -30479, -48853, -54033, -61273, -59076, -65873, -44348, -14963, 1644, 213, 11484, -11683, -45230, -46090, 2927, 6345, -13018, -2121, -29028, -36121, -17946, -11560, -14903, -37611, -61180]
16053f1180k673J8287K5419J7003K1635O659j1499k6627j2888l179j364j4826
16041d5233J3975J3659k1689O57L5322n425k0198J9336o874j2913j0460K6281
16029a3562Q521Q941K3407L150k0148L882j2766P578m49J877k6345R853R062o083
16015c082j1870r483J2769j060r014j4177J8J5232L1433R797J968Q657J365j3374
16001A9179k8383q481k7648k6217j932L4354K6133l5431J4778K6314L3361j5545
15989A0482l126K807L7498M800k0553k8911m2334J365M0933J2964j1165j2766
15977h006p630K0324K5357j1770j2613j685J324k9622j1666K3810j1733J9336
15965d574K1257n717k2289o893j554j0056q233k2218l03K3504L0986M54Q975K6744
$$ y = [-61180, -63853, -45566, -20147, -3144, 18491, 25150, 13651, -12976, -25864, -29043, -30407, -45233, -31258, -17599, -39288, -38631, -3309, -8734, -28932, -9596, -16470, -29383, -39843, -13562, -5041, 3900, 27307, 30457, 10309, 14191, 1425, 9003, 8554, 10431, -15914, -6061, 3001, -3082, -14952, -24435, -11666, -12726, -21740, -35917, -35899, -20667, 10766, 20563, 22531, 31188, 32553, 19179, -9204, -17685, -45333, -71550, -73482, -39128, -12995, -48426, -33648, -7334, 26027, 10482, 7356, 10163, 47661, 52461, 31908, 2997, -39337, -37972, 2961, 15925, 4760, -8006, -15636, 4688, 30045, 18275, 5662, 3977, 5301, -24321, -35987, -12177, -23910, -4574, 16683, 10966, -11323, -18216, -19770, -29826, -38059, -60277, -60580, -37076, -6090, -5636, 3339, 30083]
15951C0083n2392r125J3842K9898K0041O714R94k3159j8255Q68J6972j4513J958
15938C926j532J964j383N982m526L1026j0582j8076k5207J0750j631m3139J1248
15925d1180N491j3987p249L0021P945M349j495L0902J9080p782l5513K861J2471
15912E914j8532N634J5592k4856j7040J840p807R243L0623o068J5983K1426m1871
15899i919j9752K0808o94k1946J7472L1823L1389j1826j4358j6423m1244K833
15887c1837K5346J0395Q067M1666k2617k9425n450k2965J1083j0879J0744K2406
15875F534K559k1549o186L0810K3724m9854n1350p871L3498J6247K3789k4615
15863b4264O150J691n193J2107L1565N5080k1414l4640j1680q655k8896j6286
$$ y = [30083, -22309, -31434, -17592, 12306, 32347, 39061, 40055, 16896, -1359, -491, 16481, 1968, 3926, 2394, 4358, 2975, 8957, 4431, 35457, 24875, 6799, -18408, -7658, -9289, -52428, -41180, -35689, -49676, -56925, -26904, -18959, -14610, -16105, 14797, 33877, 26095, -9418, -6557, 5914, -12618, -6984, 8608, -16248, -33288, -31448, -39255, -30012, 611, -5457, 10526, 31952, -9919, -29671, -8863, -9557, -31503, -14031, 17792, 49181, 37355, 22997, 6574, -34670, -31837, -6491, 3904, 11971, 53637, 31020, 1595, -3855, -26820, -15737, -26616, -15872, 6534, 9093, -12456, -18642, 12168, 35892, -13962, -65312, -73183, -39685, -23438, 351, -24264, -18114, -16423, -21616, -9509, 22056, 77136, 55722, 21082, 9402, 747, -28149, -44435]
15851d4435M4919J9590j8550l2870r189J6325M2042J7549k9891k8305k6473k5943
15839g5231R971L8042J4845p201K7089L134k4816p425J074J1543K1443J1613J8182
15826D2263K4601k7837j6135j1055j5586k0081o070K2584J9273r570k8541R015
15814a7139k307K3106k196l2598L108j1229J1716J0258N863K8277K9202j430j5695
15801B8936m9349j3678L7462L584O509Q495N338p994l5047R637J9922J6034Q632
15788C8481j4388j3876J6664J0896m5007N017O331m3710j9563K3405J9268J7990
15776A508K3471k0789m271J031m131P977l289k1240j8583K1771j0349k650N084
15763b4460m2359Q005M2733J8711J2010j7983j0392N921K0554m799j5936l299
$$ y = [-44435, 484, 20074, 1524, -31346, -40535, -24210, 17832, 35381, 5490, -22815, -49288, -75231, -65260, -27218, -12373, -19574, 7515, 10649, -14167, -21592, -20518, -8975, 12468, 24081, 42263, 66864, 39027, 22892, 11837, -3749, -23830, -29900, -7316, 11957, 2387, -26154, -17139, -19446, 3660, 1464, -31134, -28026, -39255, -27539, -17281, -11418, 16859, 46061, 44631, 28936, -20413, -34091, 3371, 6955, 13464, 21959, 27297, 19303, -15744, -6107, 13815, 29849, 38481, 24093, 10217, 26881, 37777, -7230, -2213, 4118, -39592, -59155, -35750, -16482, 1508, 24979, 4190, -81, 950, -3181, 4796, 1507, -19733, -38316, -16545, -26894, -29544, -24460, -66819, -58814, -16081, 2630, 14640, -3343, -13735, -7814, 12740, 7941, -7995, -11294]
15751a1294m751j4960n781J6312Q37N025K5010K3841M258J2860l890m307j5520
15738B7640l5976j3270r354P962P650j021J91l4933L0031J4444l3066l142J8639
15725b4205P282k2076k1336j0972J009K2820q861J1751J4753j777K3408O699k6782
15712b8287k6721J5712K306m286O737R631O002l0417P185K723j3688K502J7078
15699c3523P973p474L992K9286p283Q355k4994r287J3342O057l391j0123p443
15686c4513Q575o711l412L9402P322k4916o510J0631n404j5418j7880M2930J2144
15673F240O394r944o622k417J7786n151p451j8968j5231j7390J510J3494O708
15660c1042Q374j165k0977K1106K4377L1439N1q171J4944p148K6783j1766m4951
$$ y = [-11294, -16045, -31005, -36786, -20474, -19637, -14612, 10398, 34239, 38497, 51357, 47467, 43160, 27640, -8336, -21606, -30960, -22998, -15348, -16369, -16178, -51111, -21080, -6636, -39702, -42844, -24205, -16923, -38999, -60335, -71307, -70298, -47478, -56339, -44588, -29835, -31612, -8204, -1505, -28287, -55008, -39296, -36990, -41276, -34539, -24908, -18906, -49323, -42138, -39415, -53103, -50601, -33523, -25550, -33024, -29032, 254, -7029, 1326, -23668, -32955, -19613, -13556, -16947, -27070, -34513, -25938, -32649, -36061, 3341, 10663, -14253, -20763, -10132, -15536, -30954, -48834, -5904, 6240, 12634, 2690, -3932, -6349, 11437, 6286, -1165, -20133, -35364, -52754, -51244, -37750, -31042, -22668, -23833, -44810, -23704, 673, 32112, 32163, 23992, 38936, 31788, 58571, 46805, 1854]
15647A854l0317P107j7254j1343K6241o36j7949Q565L2274K4690k4592l6541J3899
15634b4002j0175K6253k710r489J1171L0732j6756J491N608r802q330J7153K0453
15621C1597M432o061k1762N86J3509j2702P950J6925r131j8989j5422r390R481
15608h977J6573K6837J68j3050o405R258L3277k0013j0474K3779l1534l2230j5857
15595b8648l758n535J1692Q214j9352j8475K0289L561O45K828O558O057J4143
15582a781J981k5176j7511j4736j7870J1187J3138J2483p63L4106J2946K2926
15570C0930Q184m3779k4623j3378K2714j6577N005J8554l248m505J1730K0377
15558A1384R854j5691m4254j4365K613k475L899J3096K4137J0254K1323l1390
$$ y = [1854, -28463, -21356, -38610, -49953, -23712, -24348, -42297, -33732, -1458, 23232, -1360, -37901, -24002, -34177, -7924, -10634, -20123, -8952, 21780, 5024, 6515, 12123, 2321, -6009, 11144, 31597, 36029, 29968, 8206, 8792, 22301, 9599, 17549, 34474, 25343, 6354, -9068, -18458, -8977, 7596, 34433, 34601, 21551, 15146, 24404, 57681, 37668, 27194, 50973, 19439, -12791, -28648, -32406, -37941, -26249, -18035, -37387, -55862, -35573, -32012, -31367, -28539, -21981, -15924, -1781, 200, -24976, -42487, -57223, -75093, -63906, -50768, -38285, -39048, -4942, 8004, 30930, 39114, -4665, -29288, -42666, -19952, -36529, -31524, -12970, -16218, -20723, -8993, 11384, 21238, 5547, -38707, -53072, -50459, -52934, -49035, -35939, -11802, -1548, 19775, -11615]
15546a1615k8005K7751J213O637K0248J2229j2736q258K7151J7326k0183k1279
15534A0479k848P740O502k8628j4806K1387N119k0764p695n243M709L2730O795
15521A5477L788k7961j2507J8027J0812M768N705J0894k4597q990J0812n708r381
15508h861M895l883R245J198j442q570l7178N647K4415M086k8013J1270m76k920
15494c0587P687M5842Q759l3138k2199r499L1509J2967k4774l8007J442N1299
15482A301q497J1881K8468k1498j0276j454k7573l661J643r526J5893J8054L1347
15469B6102K3163k5843j4321j7139M178L4157j1737O503p35l3909o678j3692J8905
15456a1046j9724o558j9369J4702L1782N968Q64k4892M334j3944M978j1705r2
$$ y = [-11615, -39620, -11869, -10656, -4019, 16229, 28458, 15722, 7464, 34615, 51941, 31758, 10479, 7631, 15371, 21873, -6755, -21561, -174, 4945, -15819, -23514, -28757, -24048, 8682, 15477, 19265, -8696, -21203, -3176, 7636, 12404, 18109, 29003, 4406, -4584, 6228, 520, -8861, -3966, -7849, 1396, 2594, 1152, -7418, -44596, -38949, -14534, -10448, -38461, -27191, -27667, -30587, -22900, 22942, 31701, -1437, -23636, -33135, -1626, 11341, -13433, -51440, -49998, 1301, -7196, 4685, 33153, 11655, 1379, -75, -27648, -31309, -29666, -39192, -23299, -5245, 26102, 49265, 23422, 9101, -8038, -3860, 30297, 18560, 25063, 24328, -9581, -16259, -29951, -11046, -30770, -37328, -56697, -41995, -10213, -4245, -3381, -28273, -23939, -37883, -32905, -44610, -44702]
15443d4702J262Q598R31j0479K6358K4884k2692k6121J1359p056J7263J8164J9453
15430A7222P262j0314K0340N616l230k3209k0157j2035M60O804k217K770p026
15417a7714n121j2432p730J4749J4741n854K8030m578l8628q318j9449J3630M0209
15404h465M278k4196J7181J6491J272r380J8319K8132m118k3983J4214k4076J2056
15391A7725R536l6071m2034J9239P971J6593J9965O985K0602j2294k5333K2530
15379B5414K4315K0076K4789j5914m7219l8225O19K4155J8131j560k1246m3973
15367c0638J0357K4372o468r248K1303J0505p327l0558j3092m409L943K5428L4930
15354B9098J7625l1143j9839j5451r549k3315j6233K5885L1404L152l3488k0135
$$ y = [-44702, -43440, -34842, -33911, -44390, -18032, 6852, -15840, -41961, -30602, -37658, -20395, -2231, 17222, 24484, 14170, 34510, 40126, 36896, 13687, -6470, -18505, -18045, -11241, -13458, -10688, -17714, -22835, -35267, -42997, -28248, -13507, -19361, 8669, 4091, -34537, -42855, -62304, -48674, -8465, -4187, -28383, -11202, 5289, 6561, -2819, 15500, 43632, 39514, 15531, 29745, 5669, 17725, 27261, -8810, -50844, -31605, -23634, -7041, 12924, 19909, 40511, 28217, 2884, 25414, 49729, 69805, 94594, 78680, 31461, -6764, -6145, 18010, 36141, 34581, 13335, -30638, -20281, 4091, -2377, -11625, 9678, 20183, 12856, -17702, -30794, -35203, -31260, -5832, 29098, 46723, 15580, -4259, -19710, -29259, -52574, -68807, -42922, -11518, -8366, -41854, -61989]
15342f1989q93K5839L883k527m285J7450J5760j1825l948J778J4429L0513R155
15329C3340k5143k2128l5218j4572K2587L0124K0133M2958R113k2058k3722K669
15317A8083L186j5701k0915l069K8991J2423k4762k1796k7639j7802M873M2686
15305b1442M4590J7704j8600l0693l2724J264P251r539L393r841J9979M0644K935
15292A4921k0839k5564r130J624J2211N00J4621J2343J0165j0804j0910J234j6809
15279b6437p679J671J733K6676J9025l2222J369j3001l0627J4229J7723O621j1155
15266c2074K4320K5475j081J2250J5826n2729k9870Q960j672J066q07L1706k3404
15253b2034k7020K0493L3168j7225m4231Q600K3357J7981Q342k0492m461j0111
$$ y = [-61989, -62882, -37043, -33160, -35687, -39972, -22522, -6762, -18587, -22535, -20757, -6328, 24185, 33340, 8197, -13931, -49149, -63721, -41134, -11010, 9123, 52081, 61194, 39136, 15414, 18083, 21269, 5568, -15347, -18416, 10575, 22998, -1764, -23560, -51199, -69001, -64128, -21442, 23148, 40852, 22252, -8441, -41165, -39901, -32650, -42189, -38796, -48637, -28658, 11986, 14921, -5918, -31482, -40612, -38988, -26777, -26277, -11656, 687, 10852, 48, -10862, -9628, -26437, -34116, -32445, -30712, -4036, 14989, -17233, -15864, -28865, -59492, -45263, -27540, -20919, -32074, -7754, 17721, 16640, 28890, 44716, -8013, -37883, -28923, -30595, -29529, -30336, 1370, -22034, -49054, -28561, 4607, -12618, -56849, -48249, -24892, -6911, 1431, -19061, -23522, -33633]
15241c3633J1853Q12J4119J2292N566K487J9715k2629k9698O001J3017q335j1872
15228b0305j2883J1366L356j3363J3026M552J432K1771J5467O8j8072l1098j8534
15215d3217j760J8349K1456J3400K462J8121L2630j7059k2148j0790R443M706
15203B5593k7304k9354j3928Q473j3410j7552J6901J8416J5858j3556J2074J8808
15191A019l111j4024o830j2428Q856L5513L049m6m402p880j7416k284J0514m434
15177a3904O707K0813k0061K892j3973k296J9546k3002r806Q988K4493N3591K5109
15164G9097k329l1565l1896o85k303k3931j135J817k5127l588K9610J0858j0508
15151a1685o245j5225P878n8337j6720M8257N4001J3205k7854m587R113l5832
$$ y = [-33633, -21780, -20968, -6849, 5443, 11009, 13496, 33211, 10582, -19116, -13115, -98, -8433, -20305, -33188, -21822, -18466, -31829, -18803, -14251, -12819, 8952, 24419, 24487, 6415, -24683, -43217, -44977, -26628, -5172, 8228, 10690, 28811, 61441, 44382, 22234, 11444, 20887, 25593, -1711, -31065, -44993, -36520, -49930, -67482, -50581, -32165, -16307, -29863, -17789, 1019, -2092, -16116, -22946, -35374, -26518, 8995, 12044, 11998, 7596, -284, -17700, -19984, -9470, -13904, -7197, 13616, -6445, -3553, -17526, -19822, -276, -23278, -33084, -24096, 397, 53988, 79097, 76768, 45203, 13307, 12622, 10319, -13612, -14747, -12930, -38057, -41645, -12035, -1177, -11685, -17930, -33155, -25277, -83614, -100334, -52077, 1924, 15129, -12725, -17312, -8199, -44031]
15139d4031j5525J8343M8782J3981l4422j2417q847j5048J6494M3563L1781J4446
15127E7100r868l234N966j8932j2917O047j2488m470k3673q471p982J4458J8863
15114C99j4257K4457m686m784j7197o394Q506K3375J6113J4678j8152j073j3860
15101G125j9501P928M582q036j2844l520m1213J9404L5632m3540l2926P772K5218
15088e3919j4794j8605K1190K5553L8170j5250j9324O05n887j509J4476K6800
15076b494L4163k6521k6762J8666O723r643j1632M141L542O453j942j6132J303
15063b0135L411k6222J4740N990R37J2928K0629l0718k9835j877J0444J4492k617
15050b7833N023K1936K616l9972o118K6407R497J2840J6915N388m8450n7417L0898
$$ y = [-44031, -59556, -41213, 7569, 21550, -12872, -25289, -34136, -49184, -32690, 10873, 42654, 57100, 47232, 43998, 49964, 31032, 18115, 24162, 11674, 7204, -16469, -24940, -32922, -18464, 399, -13858, 10599, 5913, 1129, -16068, -22462, -13956, 9419, 25532, 40210, 22058, 20985, 7125, -12376, -4448, 134, -7902, -20746, -24266, -65479, -46075, -10443, -53983, -86909, -79137, -53919, -68713, -87318, -66128, -40575, -2405, -17655, -36979, -36374, -42261, -43770, -29294, -2494, 31669, 5148, -21614, -2948, 3775, -5868, -17500, -13359, -9817, -3364, -5306, -21438, -20135, -16724, -42946, -28206, -22216, -21279, -8351, 12278, -18440, -48275, -50152, -39708, -25216, -27833, -22810, -874, 1742, -38230, -44348, -17941, -8444, 4396, 21311, 26699, -21751, -79168, -48270]
15037d8270L2118K3713k0056k9827j5054N775K3625J0569J7719J8830N4k752n170
15024A1274l0131l1949J6675q015P558k0255r182J2057P417L7172O991o962q938
15011a6288K2596q91J1868j0206k9614q414P896L9517j6053j7210L118J5955J2150
14998A4424k8156m7779J7362M1228K6098j6083j5473n526Q381L4198l9573j0330
14986b1229K208j8676j3478K6770R729R511k904j1170l3529m352J6394L5319q262
14973a3669j3855L334R030K181o212l3897L9911N56N868j3625Q26N326J1692J4327
14959A1793J6339K782j6009j2165J5038l531L672j1703j8153J3127j0948l6118
14947d5876j8864J1651J5364K1356M557P224P125N303j1884L140N167M1306j8479
$$ y = [-48270, -16152, 7561, -12495, -42322, -57376, -51601, -27976, -17407, 312, 19142, 19196, 16444, 11274, -18857, -50806, -34131, -42146, -34588, -54843, -64025, -51968, -44551, -7379, -388, -7350, -16288, 6308, 5417, 17285, 7079, -22535, -30949, -23053, 16464, 411, -16799, -13681, 2274, 14424, -13732, -61511, -44149, -2921, 23177, 7094, -8379, -13905, -5524, 28674, -10899, -21229, -19021, -37697, -51175, -24405, -14676, -5165, -8069, -19239, -52768, -57120, -40726, -5407, -13669, -27524, -24190, -15160, -12979, -19191, -53088, -13177, -12621, -6753, -20378, -19552, -14226, -2534, 11793, 28132, 30914, 14905, 2740, 17778, 14247, 17919, 6216, -11937, 1190, -9758, -45876, -64740, -53089, -37725, -16369, -11812, -4588, 2537, 7840, -4044, -904, 4263, 45569, 27090]
14934B7090j3334j561O677j1934Q994j9574l4437l2299P123L2056L0421J1597
14922A0819l014J415l5372j2386P646K0199M968j550n554L006k4416Q941L2811
14909G513J3680n579j2814j8775J8630J1632j406m38j5141l8585k2003j515K2692
14896d2109n062M699Q760L728j9027L8593K1324j0654k5959J0502J879k7251j1111
14883e1688K1544M5857K8369l6182r592J1427N546J2022M169L159k716q243l219
14870B0453k4894l7175K544J5152m408K1881j0667M718P098Q835K430j1214l9082
14857d4329j3352J3097j4743r772J2863L1358R636o50J8614N484M178j1562K825
14844C647k0235k8604m387L9461J0791K183K7165M916o870m574j9431k446q905
$$ y = [27090, 13756, 12195, 18872, 6938, 15932, -3642, -38079, -70378, -63255, -31199, -778, 10819, 7805, 9220, -26152, -38538, -30892, -10693, -5725, -7275, -12829, -9823, -34239, -25298, 7513, 21193, 15614, 2800, -15975, 2655, 14287, 12881, 12443, -2698, -41283, -63286, -64801, -42109, -47171, -42472, -33712, -29984, -49011, -10418, 10906, 252, -25707, -15205, -13326, -40577, -51688, -30144, 15713, 44082, 7900, -1692, 9735, 15281, 27303, 31472, 34631, 31915, 23672, 20453, -4441, -41616, -39072, -23920, -28328, -6447, -17114, -12396, -5298, 3537, 5967, -5247, -44329, -57681, -44584, -59327, -69099, -56236, -24878, -15242, -15892, 2722, 8206, 12384, 822, 3647, -16588, -45192, -49579, -10118, 673, 2856, 30021, 34937, 28067, 23493, 4062, 1616, -7289]
14831g289m0043n29J0630j2327L4633L1445k727j9555L0859J2917k6845J462j4031
14818a400j94r181m0506j5983Q600j451N488K0216K2278K6695J2136j5416q349
14805B933l834J1655O724j170j0348j8641j4468k7252J4714l922N175Q322J9862
14792a0250j4650k1122k70J9362K6933q990L918K7561n788j5802k4554L3782l5
14779A0095k5315j1458J3812M5364J9942n1471k0391j0003K1579J1483j1670r630
14767a7663k0987j0554L80J7659l473k0616P63l114M2057M1743k8316n0725j2357
14754f5203J9640K77q53L0450j5551K0777P891L40l956j5056K6672J0962j3216
14741C174l757k6287r059Q56K0064L388L983j1776q05K1825J1290n974j5945j9977
$$ y = [-7289, -47332, -47861, -37231, -49558, -14925, 16520, 13793, -5762, 25097, 38014, 11169, 12631, -1400, -1594, -10775, -51281, -67264, -58664, -60115, -54627, -34411, -12133, 14562, 26698, 11282, 2933, -901, 10754, 17478, 16308, 5960, -12681, -27149, -54401, -39687, -43609, -38434, -30112, -10250, -24900, -46022, -46292, -26930, 3, -8987, -5069, 22492, 16704, 902, -23652, 10130, 10095, -15220, -26678, -12866, 32498, 52440, 969, -19422, -29425, -7846, 3637, -8033, -17663, -38650, -49204, -48824, -31165, -34638, -55254, -54491, -57605, -15548, 26195, -2121, -52846, -65203, -45563, -45286, -46139, -15689, -31240, -10463, -2572, -2232, -6188, -21244, 5428, 16390, 3174, -583, -26870, -35929, -35073, -15009, -11621, -7638, -19414, -20219, 1606, 12896, 6922, -9023, -29000]
14727b9000k1715K0454M154J7750J3408P583o938j8587m5068l596L2618n406K1326
14714a3017K132J09o071N186j7050k1127p357K2525K7356L960k6691k9050J3945
14701d5150J3829n697N188L695n822p969J4641J712J9648M9399p945k4515P501
14688A8515j1290k5033L882L4308k0903j9492J3841L0077J3897l5680m624l0287
14676c2789n056N0502J3144m3828p911p47l316j3118J4912k6182r846p106K1755
14663d9586L5039J7499j4408j1132J3312R800N442L460J1015j9760m1426k5417
14651f6162K3755L6799M308k945j7327J2976r27k4846n753l163K6959K1341n355
14638c40R456K1969j8062j0141k8360N507K2333K3490N307n525M680J3666j48
$$ y = [-29000, -50715, -30261, -26107, -8357, 5051, 12634, 5696, -12891, -57959, -61555, -28937, -34343, -13017, -10885, -10776, -16847, -11661, -28711, -49838, -57195, -34670, -7314, -3354, -30045, -59095, -45150, -31321, -37018, -31830, -28135, -33957, -41926, -27285, -25573, -5925, 43474, 35529, 11014, 18515, 7225, -17808, -13926, 20382, -521, -20013, -6172, 23905, 37802, 2122, -2502, -32789, -37845, 12657, 25801, -18027, -25938, -26685, -30001, -43119, -28207, -54389, -64235, -71341, -49586, -14547, 2952, -11456, -22588, -9276, 524, 5966, 9426, 20441, 681, -40745, -66162, -42407, -5608, -1300, -4245, -21572, -8596, -9523, -34369, -40122, -43285, -16326, 5015, -340, 9116, 31085, 13023, 2882, -25478, -19971, 2362, 25852, 31159, 25634, 30314, 43980, 43832]
14625D3832j1354O109j1490P310J0412j7545k5733k116J1689l794R043k327J7863
14612C1899l3141j0367l00J196k454k8684J7677J3678L948l0019J81L630o521
14599c9277J5529p850K480P834p957R339K5618j488m785j6205r493L4176Q120
14586A6041j6861k2885p974k479k3706L3462J1442J5493j1858k0453r647J2986
14574b6439J9623M793j8142k8399K7696K5477K2044J144l1396K4072k4619m9092
14562e3238J14M4514p371j9249R045L8394J0570j5808n638k511j0381J9780p939
14549B82k9185j0797K6727M7128j590p862q159l626o424K023l343K01J7753K4522
14535D7650j5469m4973m4345J7727N2639Q390j6612j2029K681j2248j0906l64
$$ y = [43832, 32478, 38587, 27097, 34407, 44819, 27274, 1541, -575, 11114, 7320, 16363, 14036, 31899, -1242, -11609, -11909, -10713, -13167, -41851, -24174, -10496, -6548, -36567, -36386, -32756, -39277, -23748, -31598, -29118, -21284, -29241, -19902, 5716, 4228, -557, -16762, -26255, 7921, 16041, -820, -23705, -31679, -34158, -57864, -24402, -12960, 2533, -9325, -29778, -39425, -26439, -6816, -2023, -20165, -48564, -20868, 4609, 26653, 27797, -3599, 20473, -4146, -53238, -53124, -8610, -15981, -35230, -26185, 12209, 22779, 6971, 1333, -1178, -11559, 8221, 282, -28903, -39700, -12973, 34155, 32565, 24703, 16544, 12918, 6494, 8517, 5174, 5375, 23128, 47650, 32181, -12792, -57137, -39410, 13229, 21619, 5007, -7022, -4341, -16589, -27495, -27859]
14523b7859K0891j4050k8188J8298J3119j914J8738L2574J302q461j5383k708
14511F359N898j3447l6065k0473q109K9888K3810m362J7581L8684l307K779J1687
14498E0923j4930l160j5131k3997k6715J6754N375L7263K4814k6328j8895m351
14486A622j3644k6257k120K7989o876q186n451N82J6393K2245J7309j2120L0157
14473D1643o470n608k8117J1244K3349k1601j2185q8q790j0244j5024J4162J4030
14460c699J1412p330l038o1k266Q668p131j2139k4738M160Q964m954j5184Q989
14446c8347L1041J1493j3208J4066J3276j2648m1468k7647Q474K7928J8505m781
14434a3316m044m910r889L4890J2315p380J2731K1047J2867l180m0164l876J9182
$$ y = [-27859, -6968, -21018, -49206, -30908, -17789, -19703, -965, 31609, 32911, 24450, 9067, 6359, 12257, -1190, -37255, -57728, -65837, -35949, -12139, -16501, 1080, 39764, 36457, 39236, 50923, 35993, 32833, 17702, -6295, -33010, -16256, -10881, 26382, 51196, 24868, 5973, 1622, -12022, -38279, -40399, -12410, -19286, -27472, -32923, -32341, -15948, 6297, 23606, 11486, 41643, 35173, 29565, 1448, 12692, 36041, 14440, 2255, 2167, -6623, -16867, -31891, -17729, -3699, 7713, 383, -2655, -2716, -4982, 3686, -3445, -15584, -40322, -36162, -27198, -32152, -47336, -38347, -7306, 4187, -9021, 5045, 18321, 5673, -35795, -63442, -54968, -27040, -8535, -13316, -17360, -22270, -32159, 2731, 15046, 7666, 20397, 41444, 54311, 51131, 10967, 7091, 26273]
14421B6273j6212q150j8618j3645q164Q147O308k542J8213P236j1866l5789M045
14408d4764N8628j267l3471j3596J111K6433K3600k7810j0762M965Q026J5480
14396F573j2762K0630K2523k1294k1901j2583K5094J3392l4305l7530J1329M7060
14384F226J363o297m220k0640k5065k8431L9564M5617N495J5525k91l0405l5671
14371c7230K524j3477J850J0670L0349L226j0550K7171l230k4289j780Q764k8076
14358c4078j135K0251O628k7977Q565J3840J9599k2414j8885o906q787n616j155
14345e8070k1596J0258J7125L0105K2464L1077K7830n722m8484k4364k531j1979
14333c3887J4914J5140K2192o245O615k1942j6443K750K0003J3506K653m076k5412
$$ y = [26273, 10061, 1911, -16707, -30352, -38516, -30369, -24061, -26603, -8390, -1154, -13020, -48809, -44764, 13864, 12597, -20874, -34470, -33359, -6926, 16674, -11136, -21898, -16933, -8907, 6573, -6189, 14441, 36964, 15670, -6231, -18814, 6280, 19672, -14633, -52163, -40834, 6226, 7589, 1292, -2928, -23568, -48633, -77064, -37500, 8117, 13612, 29137, 28846, -1559, -37230, -34706, -48183, -46333, -35663, -5314, -2088, -12638, 14533, 11303, -12986, -14766, -6002, -34078, -35213, -14962, -8334, -36311, -27746, -13906, 5693, -16721, -35606, -42512, -51299, -56915, -58070, -79666, -69408, -52283, -22178, 286, 31363, 59193, 53471, 4987, -19377, -21908, -33887, -18973, -3833, 18359, 12114, 18729, -3213, -19656, -16906, 3097, 16603, 19256, 15180, -10232]
14320a0232J0014J1461l0676m482J5990k1679K5439L366O113Q197j0944J1812
14308A4379k1315j8442j4409j2394M0464K5416q178k1579j2842j5795J760K2757
14296b0178J6475J1636m1156J8071j4061m558K6432j656p966r368J5933m1455
14284e1851k6369O421L0376J6099M090k5647J8087L8594J5347J7862k759l0183
14272A0067l0190m751Q156J0428M101K2554J902q869n137j0193J399K0325j4480
14259E312m692K1095k4809p322K4882K7343j7187j7702q391Q225J0374l849m4030
14246c0751K1711o420o841J7597K153P505J9473J7388k0487n023k3838j5138j2450
14233c5121k855K4998R343N57o841j4489L468J185J1287n939J5244p96l1916R626
$$ y = [-10232, -218, 11243, -19433, -23915, -7925, -29604, -4165, -799, 5314, 13511, 2567, 14379, -6936, -25378, -39787, -52181, -11717, 13699, 5521, -16058, -28900, -44695, -42935, -20178, -3703, 7933, -33223, -15152, -29213, -33771, -7339, -8995, -16961, -26329, -10396, -51851, -78220, -71799, -41423, -25324, -21234, -46881, -28794, 9800, 25147, 43009, 40250, 10067, -20123, -24874, -16718, -6290, -2189, 20365, 22267, 13398, 8261, -1932, -533, 19792, 5312, 620, 21715, -3094, -10416, 14466, 41809, 24622, 6920, -1471, 6754, 17128, 13279, -30751, -9040, -15460, -22301, -4704, -2551, 4954, 24427, 41815, 21328, 16305, -7533, -22671, -35121, -37976, -12978, -3635, -3078, -9919, -24408, -20940, -19755, -8468, -14407, 837, 41, -31875, -22249]
14219b2249O546N880L3714J5693k7871l5983J9060K1500q1N241j4625J6714m175
14206A9364l6469k4260P784R572K673J2488K2266j161P253j0193j708j0707J701
14193a397k731r378J0540N5926J659n3694k2385N458k354j376r742k487j9005
14180e0966K7435K0291r724o367k7900j971O405J1845j0100J7579p867k7070R083
14167d9327M3583J8742q668J2606k940j9306j0362L604n24L5684L825k7556j3284
14154a3923j3554P243r466J4395K2729o35R039J7976J0128l9754k2589r247j769
14141b9427n129j2282K2078M509J5391q402N10J2278J3991k4552N522n749l1680
14128d2942r04J3465K4931K0021r045P14l31q586J8820J2511m657k2047K3629
$$ y = [-22249, -15703, -9823, 23891, 39584, 11713, -24270, -5210, 16290, 16209, 21450, 6825, 23539, 19364, -17105, -41365, -33581, -24009, -21336, -8848, 13418, 12257, 19510, 9317, 7609, -3098, -1397, -4128, -13506, -2966, 52960, 54619, 925, -21460, -16002, -18356, -19732, -29474, -31961, -50966, -23531, -3240, -12964, -19331, -47231, -49202, -42797, -30952, -41052, -23473, -31340, -58410, -49327, -5744, 12998, 4330, 16936, 13996, -5310, -15672, -12068, -12592, 23092, 26917, -639, -13923, -27477, -20234, -29700, -15305, 7424, 6789, 15828, 33804, 43932, 4178, -18411, -27658, -29427, -34556, -46838, -24760, -20251, -4860, -13262, -12752, -474, 13517, -11035, -5513, -11262, -42942, -43846, -30381, -5450, 14571, 5526, 6240, 5909, -2677, 16143, 28654, 23997, 1950, 25579]
14115B5579q655O925j2627j0505R466l9883j5732l811J9550J4836J0757p719J2288
14102D69l308j6537m407N372J4792O032k7366n7638p265P683L3648K0421O351
14089b1753J5455J6368j2520M537J2760N606n347m6412k5484P515q217j4840R842
14076f2490J8598J6396K3042L7711k9314j2172R734K360j5165M4986K4281l160
14064E4807j7386k2166m011j1458l1310J9320L8241k4912j0630j845K6823J5768
14052C1241k4219k9208j5952k142N660J9662Q58J3011M368j9885P614J7644k0545
14039a1893k9533J750N8015L0998L926k1786k9014q591J6957o072j1788N628j5847
14026a7250p798r790M790O889L3951L5139m412j826r111k5719o581j2661m105
$$ y = [25579, 16924, 23849, 11222, 717, 10183, -29700, -45432, -49243, -29693, -14857, -4100, -11819, 469, -2839, -19376, -23783, -18411, -3619, 2413, -24953, -82591, -89856, -82173, -48525, -28104, -21753, -6298, 10070, -2450, 2087, 14847, 20453, 15106, -31306, -56790, -49275, -57492, -72332, -62490, -43892, -27496, -4454, 33257, 3943, -8229, 1505, 3865, -11300, 33686, 57967, 54807, 37421, 15255, 11244, -214, -31524, -12204, 26037, 1125, -9505, -11350, 15473, 31241, 7022, -22186, -38138, -40280, -34620, -14958, -14100, -1089, 3279, -16606, -8992, 8652, -11893, -41426, -39676, 18339, 49337, 53263, 31477, 2463, -6128, 10829, 4757, -7031, -1403, -17250, -25048, -34838, -30048, -23159, 10792, 45931, 41519, 39693, 30582, 4863, -1718, -14379, -18484]
14013a8484j3684K8376L0211q700J6575O757k7751k0083K8378J5679j8146j5682
14001C446K958K4160J0437K119j4614p124l033Q794k6020j3258L305m040l4886
13988d7756K1711K3459J4030k120k0653O028q451K3543N442k631j4109M752M672
13975G917K2189k0026o898p561n404K4442j1642k1636J5693J7683J51Q376k2091
13962A193k3676M8923k152l0867k5863K0382M3114J8986K6888Q772l0435l2569
13950B2696l5618o4220J6037J6149Q520P798J629j5984j969q931K0581L5946k6113
13937b3479j4793j358O560R976K6003l021J665p312j0856J7126m692p621N3197
13924D1395J6462k8006j454P056J2193o267N552J1515l500k7894j3259j2304j1295
$$ y = [-18484, -32168, -3792, 26419, 17719, 34294, 41051, 13300, -6783, 21595, 37274, 19128, 3446, 6404, 30564, 41001, 43120, 28506, 21382, 18349, 27143, 1123, -12135, -8830, -12870, -47756, -26045, -2586, 11444, 9324, -11329, -5301, -13752, 9791, 15233, 12602, -1507, 3245, 7917, 30106, 10080, 3182, -4379, -9783, 14659, 3017, -18619, -2926, 14757, 14908, 23284, 1193, -22483, 26440, 24288, -6579, -32442, -12060, 31054, 50040, 76928, 85700, 55265, 22696, -12922, -77142, -61105, -44956, -36436, -28638, -27009, -42993, -44962, -53893, -33312, 2634, -23479, -38272, -39630, -33070, -23094, 2909, -112, 1553, -5759, -16615, 511, -4181, -11802, 41395, 57857, 29851, 28397, 35453, 47646, 41379, 46931, 58446, 54946, 27052, 13793, 1489, -9806]
13911i806J1552m943j022m065O548J878J0118k2331L90K4635K475k0848q585r514
13897b3518R740J706J8103K0813j0194k4895j9000J1068O823N076K8835k2093
13885B464l8677R947J8013O703k2270n673L4055K982K145m407j3251K7660N803
13872B5494k5438k4627L6920J3168k370q085k582K4889J9706j3756o513m077J95
13859C2924j7656R317L636K7j5076k8530M792r134n005k380N703k6993k9299M1736
13845c5938N9945O6282J3299m2155j0339j9978L833l9942k7994P270O270K947
13833a6500L4563J7931j8368k2077M465J1353K565L990J4043Q850j9961j1395
13821I459j6583p483J6083K8479o502r122K02j2344K0312L653P648o859l9506
$$ y = [-9806, 1746, -3197, -4219, -8284, -1736, 142, 10260, -12071, -11681, 12954, 15429, -5419, -14004, -23518, -13778, -12072, 6031, 26844, 16650, -8245, -27245, -16177, -9354, -4278, 24557, 2464, -36213, -26266, -8253, -1550, -23820, -29493, 4562, 7544, 9689, 5282, -7969, 19691, 25494, 56, -24571, 12349, 25517, 23147, 15062, 12480, 37369, 57075, 43319, 36806, 32729, 32924, 15268, 24585, 28221, 28248, 13172, -15358, -10566, -19700, -24705, -27085, -21382, -48375, -77674, -35938, 24007, 90289, 103588, 61433, 51094, 31116, 34949, -4993, -32987, -25717, -19447, -16500, 18063, 35994, 17626, -4451, 14, 11367, 13932, 17922, 31965, 40815, 20854, 9459, -7124, -14607, 1476, 29955, 23453, 14331, 14533, 2189, 22501, 26154, 33802, 26943, -12563]
13808a2563l8580j6037M517K4986J4995j607j3078r62J0330J3041k8167k7353
13796g0478K7349j1040J7606K8861N451K1257J2412q463j0479l488r339j0915
13784a1266L38J3177K1972P445j9147p864j2912k108P03k7362J6288K8917L421
13771A1602R013j366L491O81Q880k1108k2967R41J8257j3544o687L8090k7257
13758a974l0824L3776K6687k8667P710L5774n581j4881k3765J7491J2884j7033
13746A1597M176J7294l623l5976l5860j1204Q378M788K0022K5538R608r6k1369
13733f727j8848k1539j0758J4189M1798o392M9381K3917k7675k1664J7188j2991
13721A9879p733J0815R207j4946j9113K0661k4261j444K0731n326k2015N268J7440
$$ y = [-12563, -51143, -67180, -62663, -37677, -22682, -24289, -37367, -38329, -27999, -14958, -43125, -70478, -43129, -54169, -36563, -7702, -2251, 19006, 31418, 22955, 12476, 8988, -351, -11266, -10928, 2249, 24221, 31666, 12519, 4655, -8257, -10365, -9662, -37024, -20736, 8181, 11602, 20615, 19249, 22740, 23421, 32301, 11193, -11774, -10833, 7424, -6120, -12807, 25283, -1974, -32798, 978, 27665, -1002, 6708, 42482, 36901, 22020, -1745, 15746, 28630, 11597, 15773, 33067, 29444, -6532, -42392, -53596, -45218, -40430, -20408, 5130, 14738, 14642, -6727, -25575, -47114, -57872, -43683, -1885, -8277, 41104, 65021, 37346, 15682, 32870, 19879, 12146, 22961, 32168, 17222, -1891, 18770, -5491, -6935, 13796, 8470, -13545, -8277, 9163]
13708I163j9629r666J3631K4006p138k4685l1247j8227r001L6660K2112o205k1441
13695d1667r724Q945N940J5186K5639M529J2485J7073k246l4166k7971J666M250
13682b0061L1826J2556o910N841j4058k136j0238N046J9518n637q812k9302k008
13669b4375P795L6698m711Q718K261J5171l0610K2206O163j5707k5084O17L0601
13656B9743J9420m0186j9597m3469j2762M4965J3311j9053l2300Q928M040K1926
13644b5034k745p151q950J4716K3312J26k308K5652j406R912m150n986J0096P511
13630C3595N967l5009p855k2491K458L6486L9001k4032j4777j1588k1529k1024
13618d0798J9093J6551J5558o206R45q224p276O742k594p318M412P788M228J1540
$$ y = [9163, -10466, -20132, -6501, 17505, 10367, -14318, -45565, -63792, -72793, -36133, -14021, -20226, -41667, -51391, -42446, -36506, -21320, 4319, 8848, 21333, 38406, 36160, 1994, -25977, -24311, -20061, 11765, 24321, 17411, 23252, 9194, 7058, -3180, 1866, 21384, 15747, 6935, -22367, -24375, -16580, 20118, 15407, 24125, 26386, 41557, 10947, 33153, 39316, 23609, -1475, -858, 29743, 49163, 8977, -10620, -54089, -66851, -21886, -8575, -27628, -59928, -51000, -46960, -25034, -27779, -34930, -43880, -29164, -5852, -5726, -8034, 17618, 16212, 26124, 21974, 15988, 26084, 33595, 39562, 4553, -3302, -25793, -23335, 13151, 52152, 28120, 13343, 1755, -19774, -40798, -21705, -5154, 10404, 4198, 5143, -3081, -10357, -3615, -6209, -13527, -9115, -1327, 2901, 14441]
13604A4441o451j6085j2032j1631j1687J6259K2446K0385J0794j1523j6916J0194
13592H194L679J857N837m043L726N946o826k2461M361M0826j4173m0432J1844
13579a665J8768Q672K2206k472j1582j0320L697j9084l825N245R671J2291J9242
13566E0844n870j5836R719J0366L725p796J889P65K5488j3205j7928j6778j5489
13553I894j2703k0095j1453M175M3479R281j1469J9j3260O258l0349L3634jJ6087
13539B3497l443l7843J1565k466k6980J1453J1926M4511J0000k9644l135j1553
13527b112j2342L3471K7209j9723M265m292j7954P351q06k1755J7409L0727k3708
13514A7740j4558j3872K7640p329L533m920j278p611K9243K5832j1053k7912j0169
$$ y = [14441, 7990, -8095, -20127, -31758, -43445, -27186, -4740, 15645, 26439, 14916, -2000, 8194, 11873, 13730, 19567, 15524, 19250, 25196, 18370, -4091, 270, 41096, 26923, -13509, -1665, 17103, 25775, 47981, 45509, 33927, 23607, 27304, 8220, 4395, 9640, 19311, 31602, 50844, 44974, 29138, 38857, 49223, 52948, 45152, 47041, 47806, 73294, 60089, 42161, 25383, 9894, -2809, -22904, -34357, -30182, 13297, 22578, 11109, 11128, -2132, 4126, -26223, 7411, 7410, 23497, 20054, -17789, -6224, -8690, -35670, -24217, -12291, 32220, 42220, 12576, 9441, -2112, -14454, 19017, 46226, 26503, 30768, 26476, 8522, 15873, 15067, -6688, 10721, 41448, 17740, 3182, -10690, 16950, 9621, 13154, 8234, 6956, -655, 28588, 54420, 43367, 15455, 5286]
13501E286K258P804P46l2222o253j0074Q887P179k391L2688k122J0168j6001k3090
13487a7137J8945K4676J475j98o862j2709j3623J0070K441K5892l704k5618q274
13474d626k6208k4373J6387K2762J1000K4526j0738M188K0052j4368j4357Q376
13462A2621L3236K4795k0174k054k6559j3423q727K2604Q529p393j9311k5353
13450b1209k2875P799M6136R040K597q649J5624Q200O643j4377p324J6420Q823
13437D6848k0956j8284J2848o839k6607l154K521J6502L1970l813m8547J6786
13425g25J8271j768L424J5897J2262r213o930k2987K153l558J6908r546M727R902
13411B8817k0747k3151l3110L7740M1177p863J1693J6779L478k2515o508K1416
$$ y = [5286, 7544, 15348, 16094, -16128, -22381, -32455, -23568, -16389, -18780, 13908, 11786, 21954, 5953, -17137, 1808, 26484, 27959, 27761, 20899, 8190, -5433, 4637, 7078, 32970, 29266, 3648, -4626, -30834, -55207, -38820, -16058, -5058, 19468, 8730, 12918, 32970, 18602, 4245, 12621, 45857, 70652, 50478, 48424, 21865, 8442, -285, 22319, 30848, 23455, 4144, -21209, -44084, -36285, 9851, 18891, 21488, 12839, 28463, 36663, 43306, 28929, 21605, 38025, 46848, 25892, 7608, 20456, 13617, -12990, -16144, -13623, 2879, 34849, 31036, -17511, -725, 17546, 15778, 19202, 35099, 47361, 38148, 31218, 8231, 10384, 6826, 23734, 14188, 18915, 28817, 8070, -15081, -48191, -10451, 30726, 22863, 34556, 51335, 54813, 32298, 25790, 47206]
13399D7206j5834r714r356j0683K6597K5092J507j5999l1799J8754Q135k0256
13387A3650o365j6236l6616N255J7915r626K2782J7863K2515k6856j580J2301
13375A5002K5752p813m3710k0455M3842K9422r431k6725K0548j518n24k581k9354
13362g545J8135n528j4274q227j8813J1325K992J880J7008J0323l023K6079J1836
13349D2168l492j0852L0098J7581p914j2049l4052P034J2392k7207l9242j4417
13337c9952M9982L7296j4579m740K5038J065q23M737j7086l0689R308K0912j5768
13324B4701j9624j5592J461j0688L0804K2040J8544k177j4671k9148J4787J9431
13312C9868j3116N553j5819j607n687J1269K0249j2382p987p985J631L470q338
$$ y = [47206, 31372, 21658, 12302, 1619, 28216, 53308, 54815, 38816, 7017, 25771, 33906, 13650, 7285, -8951, -45567, -40312, -22397, -32023, -9241, 8622, 31137, 4281, 2701, 15002, 40754, 32941, -10769, -31224, 12618, 42040, 32609, 5884, 26432, 24914, 24390, 21809, -7545, 10590, 5062, -9212, -17439, -36252, -24927, -21935, -20055, -3047, 7276, 4253, 30332, 42168, 38676, 27824, 57922, 75503, 67589, 55540, 21488, 28522, 40914, 13707, -25535, -39952, 10030, 47326, 32747, 28007, 53045, 54110, 53287, 58024, 40938, 10249, 19557, 40469, 24701, 5077, -10515, -9054, -19742, 11062, 33102, 51646, 49469, 34798, 5650, 20437, 39868, 26752, 32305, 16486, 14879, 9192, 20461, 40710, 28328, 20341, 12356, 13987, 17457, 9119]
13299I119l344J9409J4757J5502l5606k1943K1212r029p887M893K6427R341o965
13286C5886L916j4285J4531K3298n103J2249q677k7844L196j0071l1230j0163
13274a4297J3702N904J730o154j2810k9613J1086K4305K1549l451j2286K851j5104
13261a2588n554J9885J1149J8882K761M862j2090j9163M281M2619R276l1018j1760
13248B1542K1663j1683q938M3J5662j7996j7711J6181K21l122k2265l1290K1828
13235a5865O441J7735M2773j1328m286l863o771N759O423m744j7326K7415m007
13222C8356k7736k705l0837m308J8607j3293n717K500k6308J2013K1791o671P185
13209a7123J0659K5994J7590k4440L0771J3007J6043l5653p276L190J2443j0309
$$ y = [9119, 5775, 25184, 39941, 55443, 19837, -2106, 19106, 10077, 2190, 7083, 33510, 42851, 35886, 39802, 25517, 40048, 63346, 58243, 70492, 61815, 33971, 37167, 27096, -4134, -14297, -595, 5309, 7039, 885, -11925, -41538, -30452, -6147, 15402, 11951, -335, 2516, -12588, -18142, 1743, 12892, 31774, 34535, 39397, 27307, 8144, 12425, 55044, 64320, 33302, 21542, 43205, 31522, 22584, 22627, 38289, 20293, 2582, 18763, 18984, 15862, -6403, -37693, -15865, -9424, 8311, 51084, 39756, 35470, 31607, 24836, 30595, 37018, 32274, 14948, 42363, 38356, 10620, 7915, -22922, -27230, -8623, -21916, -27633, -25133, -51441, -39428, -17637, -24308, -17123, -6464, 19530, 37120, 12680, 43451, 56458, 72501, 36848, 29572, 32762, 45205, 34896]
13197C4896j8375J5241j0942m923R135J7994K3685J0126l2403m2818L3704K077
13185C7397l4515j8043J1044k7041K9901K6180J3189l1418j1800K6136J4560R207
13173D4797k0292k6675J2646K8626K8110r686j1217j172K4861L119l6995M438
13161D0560K2807O528K5245k2443k2119r286j9732J0985k3187o820K5062M176
13149C1776K9477N129j2362l1374n710K517P128Q128K5214r088r402j4937k0571
13136E925n691k6811k0430K9880L4224M1423L2594j7745j8244j6374k3638P201
13124B2314K6323J502l169q163j0563o842j874K9330k1667j2884J4748L1403j0520
13111D9938j4594J1175L477N646r898l4253O270K5679J987r456k5935j0566r20
$$ y = [34896, 16521, 31762, 20820, 15897, 25032, 43026, 66711, 76837, 44434, 1616, 35320, 37397, 2882, -15161, -4117, -31158, -1257, 24923, 38112, 6694, -5106, 21030, 35590, 44797, 24505, -2170, 10476, 39102, 67212, 57526, 46309, 45137, 69998, 73117, 36122, 40560, 63367, 69895, 95140, 72697, 50578, 41292, 21560, 32545, 9358, 2538, 27600, 31776, 61253, 66382, 54020, 22646, 16936, 19453, 26581, 34709, 59923, 50835, 41433, 26496, 5925, 234, -26577, -47007, -17127, 17097, 58520, 91114, 73369, 55125, 38751, 15113, 22314, 48637, 50139, 46970, 38807, 28244, 21402, 19528, 48858, 27191, 14307, 29055, 60458, 49938, 35344, 46519, 49996, 55642, 45744, 11491, 17761, 43440, 45427, 35971, 10036, -530, -1450]
13098a450K98J5678K2310K650k1064K7467k417j6610O128L2961K1330m477o262
13085G6542k8660q87q284K4679q392k6158j5901l702J033N363k843j733m3577
13072c2520K8800L2642j3227j9971p439M4007K7020K3684j0713J1407K6676L9424
13060A49790J6348K5209K3922p86l592K7372J2661L681K1381k4550m8433n7069
13048A45934l8022k0559k1000j6057K1040J4563J1246M0231q380k3378j5534k6678
13036F3406l4072r35J8918J2192l1009l3884K4074L1933j0997M0344K8346j0034
13024I8282m4602r471L4797K6599J0274M2626M8212L0517M6111Q0938J23711J28982
13012F16976O8212N6192P7499N7033j9580j17664j49927j40944j58104n3990o413
$$ y = [-1450, -1152, 14526, 36836, 39486, 18422, 45889, 43472, 26862, 32990, 65951, 87281, 82804, 76542, 47882, 46995, 38711, 63390, 54998, 28840, 12939, 9237, 10270, 15633, 12790, 11057, -32520, -3720, 28922, 15695, -4276, -11715, 32292, 59312, 82996, 72283, 83690, 110366, 149790, 166138, 191347, 215269, 214483, 210891, 238263, 250924, 254605, 275986, 251436, 203003, 145934, 107912, 87353, 66353, 50296, 71336, 85899, 97145, 137376, 128996, 105618, 90084, 63406, 29334, 28399, 47317, 59509, 28500, -5384, 18690, 50623, 39626, 79970, 108316, 98282, 53680, 44209, 79006, 105605, 115879, 158505, 206717, 237234, 283345, 364283, 487994, 616976, 685188, 741380, 818879, 875912, 856332, 738668, 588741, 447797, 289693, 235703, 229290]
13001B29290m4105m4194j9741J7183R454o722n0274P033L882n0420N256L732K5422
12988H5796J7210K626j5297N760L794j0909J0137J0353K5896k302K6195P417l8306
12975A28370k3750J2003K8806N9587R7432R7942J35720J20243Q9911N9578M6438
12964H52280N6384j9758j10349j65547j65230j14967l6374m3447k8111J2306k4260
12953B12927j8020j5997j7479m8950j2734q894k6330J4905J9248J6908J7288q70
12941A32002k2526l192l7982k741K1570J4825K878J40N375J0511M315K8848L390
12928A57413j847l093J0102K7895L1358L3311L9099L707J6230Q520K6463k7542
12916C21616n8342n8960l8067j8006j3761p596k5953k7721L7181j1617l9785O167
$$ y = [229290, 185185, 140991, 121250, 138433, 147887, 141165, 90891, 97924, 101806, 51386, 56642, 60374, 85796, 103006, 105632, 90335, 96095, 99889, 88980, 99117, 109470, 135366, 133064, 159259, 166676, 128370, 104620, 116623, 145429, 205016, 302448, 400390, 536110, 656353, 746264, 805842, 852280, 908664, 888906, 778557, 613010, 447780, 332813, 296439, 252992, 224881, 237187, 212927, 194907, 178910, 161431, 112481, 99747, 90853, 64523, 79428, 98676, 115584, 132872, 132002, 109476, 106284, 68302, 65561, 87131, 101956, 104834, 104974, 110349, 120860, 125175, 154023, 157413, 155566, 152473, 162575, 190470, 221828, 255139, 294238, 297945, 314175, 322695, 349158, 321616, 263274, 204314, 166247, 148241, 134480, 126884, 100931, 73210, 110391, 98774, 58989, 65156]
12904F5156K9148l702r911k3291R610n749p417J4442p748k0168J4660M3546k9056
12891F9520k2185R652K5550M406k6371j1504J3539J5355l4576R602L323n200j4897
12878C6214n225J4647K2695Q281J0829O963l7203k6212J4321P246q46L0379k555
12865G9534J58J1611Q90R405J7797J0201m0077k2491o350J0660K152R606j9870
12852F3226l315m2398k883J2745K2593Q79m0524N45L8859L2373O092N153r880
12839H3465j7787j1798O226K6599j9135j2044j1792q754L7919K8342K1084j6657
12827A05668j192k1192r232l80k697l2156O331j3736J750Q737k0591k5648J5610
12814A1272M3805K5456L3279n461l8510j5356J7337K0818K6973j3327l1002l6518
$$ y = [65156, 94304, 90602, 80691, 57400, 67010, 61261, 53844, 68286, 60538, 40370, 55030, 98576, 69520, 47335, 56987, 82537, 86943, 60572, 49068, 62607, 77962, 43386, 52988, 56311, 51111, 36214, 30989, 45636, 68331, 76612, 87441, 94404, 57201, 30989, 45310, 52556, 51710, 82089, 79534, 79692, 91303, 92193, 101598, 119395, 129596, 89519, 67028, 60678, 71338, 73490, 83096, 63226, 59911, 17513, 14630, 27375, 49968, 50847, 10323, 10868, 49727, 82100, 88192, 93345, 83465, 65678, 53880, 60106, 86705, 67570, 55526, 43734, 34980, 72899, 101241, 122325, 105668, 104476, 83284, 74052, 73672, 70975, 38819, 45150, 31414, 33164, 41901, 21310, -4338, 11272, 55077, 80533, 113812, 108351, 69841, 54485, 71822, 92640, 119613, 106286, 75284, 38766]
12802C8766q403M0882J7341r613o421n043j4541j3472K984k653J6680j8129J4769
12789E3147O105j58Q659j8595J5111J7188k419J7750M32j5077K1947J4533N738
12776A24361m0835k6625J5025L2644J2338J0310j0398k0709k6162j445K012j7417
12764E3099p628J7424J0047K326l817J0271q272o411J6701j9817J3720K1701l484
12751I5860j5902j1459J3061J4524n960J2803j6836l8292J4323Q257P735q377
12739F9737J6518q094j8716l020J4150N161L5844J9664k539R6L220j7211k452
12726A12358k2540j5200l2094q063Q526K6117O650p456J289n352K3312J3959j1912
12713H9594l9386j6940j4596K9494J6018J2779Q771J8974k660j0619K2917j9023
$$ y = [38766, 30363, 71245, 88586, 78973, 72552, 67509, 52968, 39496, 42480, 39827, 56507, 38378, 53147, 59252, 59094, 67753, 49158, 64269, 81457, 79038, 96788, 97220, 82143, 104090, 118623, 124361, 83526, 56901, 71926, 104570, 116908, 127218, 116820, 96111, 69949, 68504, 70516, 53099, 45471, 62895, 72942, 75268, 71451, 81722, 73450, 67039, 83740, 63923, 77643, 99344, 95860, 79958, 68499, 81560, 96084, 90124, 102927, 86091, 47799, 62122, 70379, 78114, 69737, 86255, 78161, 59445, 56425, 70575, 75736, 111580, 131244, 128705, 128801, 132021, 114810, 112358, 89818, 74618, 42524, 34461, 42987, 69104, 75754, 68298, 69587, 64235, 87547, 101506, 89594, 50208, 33268, 18672, 48166, 64184, 76963, 85734, 104708, 102048, 91429, 114346, 95323]
12701I5323k9196j8263J5312N103K4731l2496m072L7595J2084l118k3730R040
12689H8313J0936j1898j2225P9L0288K832k0819j2583J1819l760j2431P594M0089
12676A18234J5495R771k7960l8525j9307J1224j4002k731R329K6980q352R152
12664H9308J0371M854j6516J0551K1588j201m322k1134r423J7155L241o308j3570
12651H4594K6960J9672k0495l0835j4523J8413J8787j9027N702l777o792j1871
12639F6808k657k5210j2027K5412J6790J7914j8103J7417L6746Q742k0772l433
12627A07627J4965K862n716j2354p744P403q319Q622O339N994M007k0572k6915
12614G6199l857J9732K0058k371o290j8699j4207O4907N2972j6962k9132m5490
$$ y = [95323, 66127, 47864, 63176, 68279, 93010, 60514, 56442, 94037, 106121, 103003, 79273, 88313, 99249, 87351, 75126, 75205, 105493, 108325, 87506, 74923, 86742, 82982, 70551, 78145, 118234, 133729, 143500, 115540, 77015, 57708, 68932, 54930, 52199, 61528, 88508, 80156, 89308, 99679, 104533, 88017, 98568, 120156, 118955, 114633, 93499, 84076, 101231, 104472, 98164, 84594, 111554, 131226, 110731, 79896, 65373, 83786, 102573, 83546, 89248, 85471, 78679, 66808, 64151, 38941, 26914, 52326, 69116, 87030, 68927, 86344, 123090, 131832, 111060, 107627, 122592, 125454, 119738, 107384, 99640, 107043, 98724, 107346, 113685, 119679, 123686, 103114, 76199, 72342, 92074, 112132, 109761, 103471, 84772, 70565, 135472, 188444, 171482, 142350, 96860]
12602I6860j9660O332j37M7546L8832l176l1083l6600j254l002J689J7101K2086
12589A35534K252j5627k0593l1453K5046K2413L54j8724k748N29j7609J9313l752
12576I4935J2102Q352p305j71k056m1776J1079J9612j2103q163O9J4750K932m815
12562H7442j4432k180K1872L6104R190Q961P58l561j7619l2588J7217N964l449
12549A13679j4877k054M0127J4316j0312J5755K3943p691j7495j0207j1610j5329
12537A18245P979J2971o799J5186k700j6544N838j5884o236k2408q189O021j685
12524H5795J616J4307K198O695K2963L0494J5121k8642j0634O058P65p269J1650
12511A51117r865j2894K2081J0042J9228n97j7787M8260L2098r801j1454j3103
$$ y = [96860, 77200, 83532, 83395, 130941, 169773, 166597, 135514, 98914, 97660, 94658, 96347, 113448, 135534, 137786, 122159, 101566, 70113, 95159, 117572, 117926, 99202, 96454, 96983, 79374, 98687, 94935, 107037, 115389, 108084, 107913, 105857, 64081, 75160, 94772, 82669, 74506, 74575, 89325, 92257, 87442, 73010, 70830, 92702, 128806, 137996, 146957, 147715, 144154, 126535, 93947, 111164, 117128, 113679, 98802, 96748, 136875, 151191, 140879, 156634, 180577, 172886, 155391, 145184, 133574, 118245, 126224, 139195, 132396, 147582, 144882, 128338, 134176, 118292, 112056, 89648, 81459, 87480, 85795, 87411, 101718, 103916, 110611, 133574, 164068, 179189, 150547, 139913, 145971, 146736, 139467, 151117, 141252, 128358, 150439, 160481, 179709, 179112, 161325, 209585, 241683, 231882, 220428, 207325]
12499B07325Q144l690j146k3394l9061J748O850r833r417n738k0095K1033M1863
12486A74589J7603k5382j2718m442K8563J4640j1474J589J6204l4717k3604J9369
12474A60220J3272k3163o848K119r946L4008L0834p1m330m1039J0758J2535J1327
12461A89676P137m0185O795P694o280J2673m609K2798J6234j157R605R811l5922
12448A94270k1695O216R626l852O268j1064k605L3n135M644M0563O883k6118k0111
12434A77923K6714j370j6176N461j0628k836j3552j5358J9542N1689k77j0990
12422B10142j3536J0423K5011J1175n595M041j6005K0453K0638L544K196L790
12410B76277r806j8520j9267J0280j5614k1559J6966K3317K2284J0528N4k188
$$ y = [207325, 215469, 211779, 210633, 187239, 148178, 149926, 156776, 146943, 137526, 131788, 111693, 132726, 174589, 192192, 166810, 154092, 149650, 178213, 192853, 181379, 182968, 199172, 164455, 140851, 160220, 173492, 150329, 143481, 145600, 135654, 169662, 200496, 200425, 196095, 155056, 165814, 178349, 189676, 196813, 156628, 163423, 171117, 164837, 177510, 172901, 195699, 211933, 210776, 220381, 230192, 194270, 172575, 178791, 188417, 184565, 190833, 179769, 177164, 177197, 172062, 176706, 217269, 224152, 198034, 177923, 204637, 203267, 187091, 192552, 181924, 179088, 165536, 150178, 169720, 221409, 221132, 210142, 196606, 207029, 232040, 243215, 237620, 241661, 225656, 246109, 266747, 270291, 272487, 276277, 266471, 247951, 228684, 238964, 223350, 201791, 218757, 242074, 264358, 274886, 274940, 272752]
12398B72752k2481l6219j2265Q298R490J1222m70R749j7866j4106K3822L0804
12386B62730Q686P417J2369k2551l566J3033k3296L604M1295K0083k8672k7908
12374B63224m681q040Q832O386n08R387Q445J2104j2396q149j1419j4996j38R302
12360B57353K847J0352k2880j4343L541o660R920N5783O983Q053L3729j8711k7666
12347B98301N687J3097j4213m247P619j4597k1510Q56J1856K6244R433L8748K4989
12334C82263m3834m5063j2421J8597K4752K6834J5716P644P624j4203q74O20l223
12321C64432k5719J0832P972K606j9400j5666p80L5834K1590R251k0487J0714
12309C81179k401K475m137J4772j4392k007J7942Q053j6872m0966j3354L7046
$$ y = [272752, 250271, 214052, 201787, 210085, 219575, 230797, 230327, 240076, 222210, 208104, 231926, 262730, 271416, 278833, 291202, 268651, 265085, 278118, 254822, 258426, 299721, 319804, 291132, 263224, 258543, 250503, 259335, 265721, 265213, 274600, 283045, 295149, 282753, 274604, 263185, 248189, 248051, 257353, 260200, 270552, 247672, 233329, 236870, 230210, 240130, 295913, 302896, 310949, 344678, 325967, 298301, 303988, 317085, 302872, 298625, 306244, 291647, 270137, 270993, 282849, 309093, 318526, 357274, 382263, 338429, 293366, 280945, 299542, 324294, 351128, 366844, 374488, 382112, 367909, 367035, 367655, 364432, 338713, 349545, 357517, 360123, 340723, 325057, 324277, 360111, 381701, 390952, 370465, 381179, 378778, 381253, 377116, 391888, 377496, 375489, 393431, 401484, 384612, 343646, 330292, 367338]
12297C67338J8799P085n696J1205J6030m2969j7762l925K4426K5412R315L498
12285D12756j0937q403K6639J5673n4004P11K5572L2171L9893J8637l005j7319
12273D78384k1457J6102L1133j0001n439j0379j2722r984o789L5347q915j6342
12261D58938p063j911K184j6044M3279K9229O052k4676m744j7797M7077K2588
12249E37112l5541l6576K054Q716N3339r982j4506J1168j7920J6260M1000k3284
12237E31840k1900N396M3302q659k6253J9276M9070J443o180J028Q110m388k1052
12224E71033n85M465l39J8529N755K3766o568K3660r277k4846k1656L088K76M961
12210E92262N268k4923j580K7924P554J9768J2421J1008J0491j7506Q643J4879
$$ y = [367338, 386137, 393222, 387526, 398731, 414761, 371792, 354030, 350105, 374531, 399943, 409258, 412756, 401819, 393416, 420055, 435728, 381724, 382435, 408007, 440178, 480071, 498708, 495703, 478384, 456927, 473029, 504162, 494161, 488722, 478343, 465621, 455637, 448848, 484195, 475280, 458938, 451875, 449964, 452148, 436104, 479383, 508612, 514664, 489988, 485244, 467447, 514524, 537112, 501571, 464995, 467049, 475765, 529104, 519122, 504616, 515784, 497864, 514124, 555124, 531840, 509940, 515336, 558638, 549979, 523726, 543002, 592072, 593515, 587335, 588363, 596473, 592085, 571033, 570448, 574913, 574574, 593103, 598858, 622624, 616056, 639716, 630439, 605593, 583937, 587025, 587301, 592262, 597530, 572607, 571027, 598951, 606505, 626273, 638694, 649702, 660193, 642687, 651330, 666209]
12198F66209l415l0061o743J9430J9549Q991j6633j5645L9474O643j1852j2582
12186F63365L6778k050J155K8450J8466n63r853L2388N1600k3558n1952j0978
12174G33248L1663L0872p978l7792L378L238N671J5395K8761J5514J1017j6538
12162H16449O697L2660l656J6122k7337j6175L4412K9697J7935n230J6182q724
12150I09032n980N39J1043O652j6686K0860J2123J4021p401J6895R795P536K2388
12137A000817k1728k6899J040K3465N350l858k5368Q314K6208k674K5027Q676
12125A018370L675L542J7420K6140K823l509M599Q106J7835M1200J4820j4049
12113A140972p091J0915R765J6483J4618n772K9739L2026L950k903j0547J8887
$$ y = [666209, 662794, 632733, 625990, 645420, 664969, 673960, 657327, 641682, 681156, 687799, 675947, 663365, 700143, 698093, 699248, 727698, 746164, 745601, 735748, 768136, 819736, 796178, 744226, 733248, 764911, 795783, 787805, 750013, 753391, 756629, 762300, 777695, 806456, 821970, 832987, 816449, 823146, 855806, 852150, 868272, 840935, 824760, 859172, 888869, 906804, 901574, 917756, 909032, 903052, 903591, 914634, 921286, 904600, 925460, 937583, 951604, 944203, 961098, 970893, 978429, 1000817, 979089, 952190, 953230, 976695, 982045, 978187, 952819, 961133, 987341, 984667, 1009694, 1018370, 1022045, 1025587, 1043007, 1069147, 1071970, 1068461, 1073060, 1081166, 1099001, 1140201, 1155021, 1140972, 1133881, 1144796, 1154561, 1171044, 1185662, 1179890, 1209629, 1241655, 1245605, 1242702, 1232155, 1251042]
12101A251042L1543K0064l994m7115q78R496L0032K5614J303q683J1360L5346
12089A355130L1810J36j5396o852L2128J9079q729j3897j1498J0393L5051J2016
12077A439371P83K3087M9979K7424m182j7227p427M0857q496J9953M867M454k1651
12064A551792j4826K6477M4673R102J3608J1369O346N807J309r521k757J3759
12052A657138O281N627K9366M368j729J8683J3576K0482M1137K2167J3438R986
12040A840520J6015K2134n540N336L5583M3137J7890K336k2804j4734P008M365
12028A951246R549Q332J5635K2924J1804J8354J6746Q300J9367j1777P781M5797
12016B124058P424P476K014J7936J4842p787k845M6707M829j4880N5280J7776
$$ y = [1251042, 1282585, 1302649, 1298655, 1251540, 1250662, 1260158, 1290190, 1315804, 1317107, 1308424, 1319784, 1355130, 1386940, 1387076, 1371680, 1364828, 1396956, 1416035, 1407306, 1393409, 1381911, 1392304, 1427355, 1439371, 1440154, 1463241, 1513220, 1540644, 1536462, 1519235, 1511808, 1552665, 1544169, 1564122, 1568989, 1573443, 1551792, 1536966, 1563443, 1608116, 1617218, 1630826, 1642195, 1648541, 1654348, 1655657, 1646136, 1643379, 1657138, 1663419, 1669046, 1698412, 1702780, 1701051, 1719734, 1733310, 1753792, 1794929, 1817096, 1830534, 1840520, 1856535, 1878669, 1873129, 1878465, 1914048, 1957185, 1975075, 1977411, 1954607, 1939873, 1946881, 1951246, 1960795, 1969127, 1984762, 2007686, 2019490, 2037844, 2054590, 2062890, 2082257, 2070480, 2078261, 2124058, 2131482, 2138958, 2140972, 2158908, 2173750, 2165963, 2163118, 2209825, 2214654, 2199774, 2255054, 2272830]
12004B272830m267p19M5335P534M5510j1329k3439K1635N323k1410J5283K5384
11992B377670K3706k123j5543R715L39N879K9047q467j5098J8258P752Q67J703
11979B433705J7895J5576j7294k4457K2506K1103K1824L2754O018k3106r981J4762
11967B511305L3213j341J101j1299q750L5794M0610j2915j1299J081j0240Q720
11955B575980m424N810J9122j6449k7578J8562K8269R269l5442k734K9547j8257
11943B581675k4815n988n319K1608M2568j741p353l1268j0910O405p116Q75N66
11930B559187k6257q652k0656J7215K0226k2692m109J8820k4157k7264p14K888
11918B483835K1225L2875j8046m9977j1301J4418R277J0411k4855j566j6717J429
$$ y = [2272830, 2268563, 2267844, 2313179, 2320713, 2366223, 2354894, 2331455, 2353090, 2358413, 2337003, 2352286, 2377670, 2401376, 2399253, 2383710, 2393425, 2393764, 2399643, 2428690, 2420223, 2405125, 2423383, 2431135, 2432002, 2433705, 2451600, 2467176, 2449882, 2425425, 2447931, 2469034, 2490858, 2523612, 2529630, 2506524, 2496543, 2511305, 2544518, 2543177, 2544278, 2532979, 2524229, 2560023, 2600633, 2587718, 2576419, 2577500, 2567260, 2575980, 2571556, 2577366, 2596488, 2580039, 2552461, 2571023, 2599292, 2608561, 2573119, 2570385, 2599932, 2581675, 2556860, 2550872, 2545553, 2567161, 2609729, 2607988, 2600635, 2569367, 2558457, 2564862, 2557746, 2558621, 2559187, 2532930, 2524278, 2503622, 2520837, 2541063, 2518371, 2514262, 2533082, 2508925, 2481661, 2480947, 2483835, 2505060, 2537935, 2519889, 2469912, 2458611, 2473029, 2482306, 2492717, 2467862, 2466296, 2449579, 2451008]
11906B451008j1606k9431j644j8157j4290m588K713Q727j1047r938J0199N02k9625
11893B342823M387k0388j2191k2183j3671j3331J3273j9000l5856l5656N485J9375
11881B213067j3092n3258l5829j0144j2534K5174K0919n408r202J2432L2749k0492
11869B144382n6807l6783p224p893k7998J9532L4812k588l1364r414l0088m8193
11857A940374l0701j1098j4556j3619j3950l9911O759k0967q063L106J5356J176
11845A813906k0150J6137K229l1324k8817n567l7281J7798R409j4725l4430m8659
11833A638526k0779L8756M7225j2197m4404n8546k7309J1828J3315l4565r9M4
11821A551795k4202l3076J0382m586k0298J1585N874k2410r512n563k4682j3776
$$ y = [2451008, 2439402, 2409971, 2408327, 2390170, 2375880, 2371292, 2374005, 2382732, 2371685, 2361747, 2371946, 2372448, 2342823, 2347210, 2326822, 2314631, 2292448, 2278777, 2265446, 2278719, 2259719, 2223863, 2188207, 2193692, 2213067, 2199975, 2146717, 2110888, 2100744, 2088210, 2113384, 2134303, 2128895, 2119693, 2132125, 2164874, 2144382, 2087575, 2050792, 2043568, 2035675, 2007677, 2027209, 2062021, 2059433, 2028069, 2018655, 1988567, 1940374, 1909673, 1898575, 1884019, 1870400, 1856450, 1816539, 1823298, 1802331, 1794268, 1797374, 1812730, 1813906, 1793756, 1809893, 1812122, 1780798, 1751981, 1746414, 1709133, 1726931, 1736340, 1721615, 1687185, 1638526, 1617747, 1656503, 1703728, 1691531, 1647127, 1588581, 1561272, 1573100, 1586415, 1551850, 1551751, 1551795, 1527593, 1494517, 1504899, 1500313, 1480015, 1491600, 1497474, 1475064, 1465552, 1459989, 1435307, 1421531]
11809A421531n762r979j3026J1475n5447j9727J4837J9077o591j8699K065J4366
11797A354120K3202J5506m8146n0036l5351p664J6528j1108J974k3247o514J3875
11785A243139j1495j6751o611l4093k0046P759L465l1517l3240M680R975L9078
11773A154343r429p362P609l9076m5653k1876M606j685l6755r281J7855j1454
11761A001842j207J2293O03J4185o198o328l3235L361J5490j734k5016j7590l5262
11748I21204q422j0504j6572j8155J5878J289L4969L2278k156q593J919j2534
11736I30601j8810k0419o854o433r632k5993j296K6219K264k6886j3226l8273
11724G91262J1615M0115o152j2992j6101l5741j5602J5723J8778N284p252q239
$$ y = [1421531, 1415769, 1405790, 1392764, 1404239, 1348792, 1329065, 1343902, 1362979, 1356388, 1337689, 1339754, 1354120, 1377322, 1392828, 1344682, 1294646, 1259295, 1251631, 1268159, 1257051, 1259025, 1235778, 1229264, 1243139, 1231644, 1214893, 1208282, 1174189, 1154143, 1161902, 1165367, 1133850, 1100610, 1105290, 1115265, 1154343, 1144914, 1137552, 1145161, 1106085, 1060432, 1038556, 1043162, 1041477, 1004722, 995441, 1013296, 1001842, 1000635, 1012928, 1013531, 1027716, 1021518, 1015190, 981955, 985316, 1000806, 999072, 974056, 956466, 921204, 912782, 902278, 885706, 867551, 883429, 884718, 919687, 951965, 949809, 941216, 943135, 930601, 911791, 891372, 884518, 878085, 868453, 842460, 841164, 867383, 869647, 842761, 829535, 791262, 802877, 842992, 836840, 823848, 807747, 772006, 756404, 772127, 790905, 796189, 788937, 780698]
11712G80698J2017p004o8566k2723J6380J3544r478J8121j4400j9237J1226j3239
11700F97339M00K5806K5124m0379m7863p812J5546k152K0667j0753j6577l4070
11688F25276P795J8542j6383K1154L3294j7693k6624l8477p862R945O569m885
11676F10651n015k7330l1368J5536L4661R182J2424p319o0350m2535R896K3704
11664E42137J7013l769L932j1143J2052J6098N1k6064l5923J4109J1879j3493
11652E26879j1046R668J4199L010j1060L1065J8411l5096j0345j8190J0594m4086
11640D84003O832j5131J5711K400J564j7354j6023j531N840j9371j5084K4789
11628D56645K1805O045j5101k9903J8358Q44l3475n606n084j2540k5335J984o53
$$ y = [780698, 792715, 785711, 717145, 694422, 710802, 724346, 714868, 732989, 718589, 699352, 710578, 697339, 697739, 723545, 748669, 708290, 660427, 652615, 668161, 666009, 686676, 675923, 659346, 625276, 633071, 651613, 635230, 656384, 689678, 671985, 645361, 606884, 599022, 608967, 615536, 610651, 605636, 578306, 546938, 562474, 597135, 606317, 618741, 611422, 551072, 508537, 518433, 542137, 559150, 555381, 559313, 548170, 560222, 576320, 576371, 550307, 514384, 528493, 540372, 526879, 515833, 525501, 539700, 542710, 531650, 562715, 581126, 546030, 535685, 517495, 528089, 484003, 490835, 475704, 491415, 493815, 495379, 478025, 462002, 460471, 466311, 446940, 431856, 456645, 478450, 484495, 469394, 439491, 457849, 458693, 425218, 419612, 414528, 401988, 376653, 378637, 377984]
11615C77984L7813r462k6179j0308l812J3758M4931O85j3590m465K3768L0617
11603D61740O716l2649m2751j7752r476K3769K5522j9367O981j9711l113J0029
11591C89938k2387r990J1509L803K800j9033J3810l121k7471K341P006J8120l1425
11578C35900j2411M3260J297j8192j0850J3248K0352j3756m6131K7281J3937K1026
11566C74961j0636m3969r608J107J2880p273L8094R832k0639m0395k0106J2982
11554B97230K1174k1021k2393j8200O401k0023q386K9993J0624M073M513l3352
11542B50633k5102J9670M3958L323l789j1611q176P437k2801P753J9372k0994
11530B59673P833j2037j139l785l188n225K629j841o075J7327L939k8257k6174
$$ y = [377984, 415797, 406335, 380156, 369848, 366036, 379794, 424725, 425410, 411820, 407355, 431123, 461740, 468456, 435807, 393056, 375304, 365828, 389597, 415119, 395752, 402733, 383022, 379909, 389938, 367551, 357561, 369070, 372873, 375673, 356640, 370450, 367329, 339858, 342199, 349205, 367325, 335900, 323489, 366749, 368046, 349854, 339004, 352252, 372604, 358848, 312717, 339998, 353935, 374961, 364325, 320356, 310748, 311855, 324735, 317462, 355556, 365388, 344749, 304354, 284248, 297230, 318404, 297383, 274990, 256790, 263191, 243168, 234782, 264775, 275399, 279472, 283985, 250633, 225531, 245201, 289159, 292482, 288693, 277082, 268906, 276343, 253542, 261295, 280667, 259673, 267506, 255469, 254330, 250545, 247357, 242132, 244761, 242920, 236845, 254172, 258111, 229854, 203680]
11517B03680k705l891J2563J9324j2286l0649l588M661R374M357m863L34M4495
11504B40806j0762m820P370l444K726J8245r389k094j5647J0484k7527J12o577
11491A99483r95P864K0462K546j5238l4720j0555j4742j5345M8094L6971M030
11479B27855k0502k5125j2087m7195j0112R135J648L44K4539J2978q680r381L0789
11466A74206L4313P052m8249l7853K2426J4808n631j2403N9445P304k7303j1190
11454A76925J7294N488L64K4534J3244J0700j1370l8502k4575l6820l6928R987
11442A10341K3445j0819J0573P880L2389l639Q600K2647p349k4513k5047j0786
11430A33722j7050K3897j6019m9325O0283J7814j3229p928K253J5226p370O059
$$ y = [203680, 200975, 197084, 209647, 228971, 216685, 186036, 182448, 187109, 196483, 200840, 195977, 196311, 240806, 230044, 225224, 232594, 229150, 231876, 250121, 240732, 238638, 222991, 233475, 205948, 206060, 199483, 198488, 206352, 226814, 229360, 214122, 179402, 168847, 154105, 138760, 186854, 223825, 227855, 207353, 182228, 170141, 122946, 112834, 121969, 123617, 123961, 148500, 161478, 152798, 143417, 174206, 208519, 215571, 167322, 129469, 151895, 166703, 161072, 148669, 208114, 215418, 188115, 176925, 194219, 199707, 200071, 224605, 237849, 248549, 237179, 198677, 174102, 137282, 100354, 110341, 133786, 122967, 133540, 141420, 173809, 170170, 178770, 201417, 194068, 169555, 144508, 133722, 116672, 140569, 124550, 75225, 135508, 153322, 140093, 132165, 134418, 149644, 142274, 148333]
11418A48333K5468J0328j1358q467J4703m225n725J3179l6124l5596J4539J0283
11406A35338j3115M379J6096l3j7794q075N503R38j4024j6211p320K1693K0807
11393A28182J5778o021j9138R143p267J3197P137J0102J2360k585n12o694m502
11380A49180Q897J1867L608j5871j4937j8594J3307k9175q109j0268K486O786
11368I9177k0370m986R382k6548O123J8976J3386L4387k4336k6960j560N030K2809
11355A04510K5676J7212O789M732r565P70j6965Q054K1533p400k9239k4268j2418
11342H9421M247J9830k350L166L037K6996J0007k960k0494l7807j2249M335J1524
11329I6703N004K2363L32q054J7706j3525l1508j4313j998K384k732P052J9022
$$ y = [148333, 173801, 184129, 172771, 164304, 179007, 174782, 169057, 182236, 146112, 110516, 125055, 135338, 122223, 126602, 142698, 142665, 124871, 116796, 122299, 123237, 109213, 93002, 85682, 107375, 128182, 143960, 137939, 118801, 127944, 120677, 133874, 141011, 151113, 163473, 160888, 160376, 153682, 149180, 158077, 169944, 173552, 157681, 142744, 124150, 137457, 108282, 100173, 89905, 92391, 99177, 78807, 73821, 83203, 56655, 62778, 81754, 95140, 129527, 105191, 78231, 76671, 81701, 104510, 130186, 147398, 154187, 158919, 149354, 150124, 133159, 141213, 162746, 155346, 126107, 101839, 89421, 93668, 113498, 111148, 114314, 117351, 144347, 154354, 151394, 130900, 93093, 80844, 85179, 96703, 101707, 124070, 124402, 116348, 134054, 120529, 89021, 74708, 72710, 75094, 72362, 79414, 98436]
11316I8436K508n660l610K0060j1853Q710R559J1895k901l694k2692k5039k4755
11303E0964r75m298J0784k452K5994J9631P872j7194k0661j641n49M419k0773
11290E1121j8203j9878P878K1548N537P824J4281J0703r144n65J4655J2424l4754
11277F3427l5415K5222N400J1942K2099j5155N553J4046J1011q565p482J8181
11265A10264m077j0125N275K4869Q77j4544n397J7197j4038j5445k6496q477J7410
11252G7293o519L2726J3508k6441j7906p747k2446K6984M596j5469O873q210J066
11239E8308o158J590p781J6408K7781j0153j2596k1551j2686J2072J6006n361
11227E5879q212j231k8768k2999J8255J8286K0506K8499K4246j6263o093j6800
$$ y = [98436, 100944, 95284, 91674, 111734, 99881, 108591, 118150, 130045, 127144, 123450, 100758, 75719, 50964, 49989, 45691, 56475, 54023, 80017, 99648, 107520, 90326, 69665, 68024, 67475, 71894, 51121, 32918, 13040, 20918, 42466, 48003, 55827, 70108, 80811, 71667, 71102, 85757, 98181, 63427, 28012, 53234, 58634, 70576, 92675, 77520, 83073, 97119, 108130, 99565, 92083, 110264, 106187, 96062, 101337, 126206, 127083, 112539, 107142, 124339, 110301, 94856, 68360, 59883, 77293, 70774, 103500, 117008, 90567, 72661, 64914, 42468, 69452, 74048, 58579, 65452, 57242, 58308, 52150, 53740, 45959, 62367, 90148, 79995, 67399, 45848, 33162, 45234, 61240, 55879, 47667, 46436, 17668, -5331, 12924, 31210, 51716, 80215, 104461, 88198, 82105, 65305]
11215F5305k7177j8657K3469J7272k0316M073J1726R863K8195R639k0010l8901
11203D4481k8373J611M0667L930P945K2924p808J998k1590j3490o988l7115L027
11190A1219N5056J1570j2255k6942O458J174P775J856l897q956k1374j8578j1200
11177h094J2667J5463M5951J8845M626l3922j5750J0988p232j8090L343J5264
11165D4059r119N518M987L618M533K706j9494Q035p185k5958p236R064J0222j7955
11151E795J0346R444L4758N571j4834j0847l201L799n90k1973L917m439j8455
11138g09J4169K1850m339k7096K8890l85n637J2885k79k058K1064M892J858j4877
11124E0228j0132j9019r986K8120J9682j8219j751j4021M578j8695j483j3665
$$ y = [65305, 38128, 19471, 42940, 60212, 39896, 43969, 55695, 65558, 93753, 103392, 83382, 44481, 16108, 17719, 58386, 62316, 70261, 93185, 85377, 87375, 65785, 52295, 45307, 8192, 11219, 66275, 77845, 65590, 38648, 45106, 46280, 54055, 55911, 52014, 43058, 21684, 3106, -8094, 4573, 20036, 65987, 84832, 89458, 55536, 39786, 50774, 43542, 25452, 28795, 44059, 34940, 40458, 45445, 49063, 53596, 56302, 36808, 44843, 37658, 11700, 4464, 13528, 23750, 5795, 16141, 25585, 60343, 65914, 51080, 40233, 37032, 40831, 40241, 18268, 22185, 17746, -709, 13460, 35310, 30971, 3875, 32765, 32380, 26743, 39628, 39349, 37291, 58355, 63247, 65105, 50228, 40096, 21077, 11091, 39211, 58893, 40674, 38923, 24902, 29480, 10785, 9302, -4363]
11112d363j4393J8223J6389Q409J872r862K0019J7461k11K5650J3742j9428m2545
11099C0963m9581J4417N9493J379k0275J9746j0793k635j6809j1634J5703J8218
11087D8192J246M150J4809m731r679k0834k3420k4279P946K0546J8673j7427j5782
11074e90J8138K3440K421M890j0463n563N4699J8743k0702l299R926J6126j6208
11061I1558J030r74L671J058k3893j1436j3973O831J4633L789p555j7858j0876
11048C6005O378Q095o320P598o987M094P20n589J7146L0277p18J8910L3065j7193
11034A25481M99j2669j6487M242O06k3024J1824L1447N1527K5582Q947m87J4175
11021B21663j5344k2124K706J9275K5322k096l480J6431K1553k2479l4219J4042
$$ y = [-4363, -18756, -533, 15856, 24265, 26137, 16275, 36294, 53755, 53544, 79194, 92936, 73508, 30963, -18618, -4201, 55292, 56671, 36396, 56142, 45349, 42714, 25905, 14271, 29974, 48192, 49438, 53588, 68397, 63666, 53987, 33153, 9733, -14546, -6600, 13946, 32619, 15192, -590, 17548, 40988, 43409, 48299, 37836, 32273, 86972, 105715, 85013, 81714, 91640, 107766, 91558, 92588, 91614, 95285, 96343, 72450, 61014, 47041, 53872, 68505, 72294, 64739, 46881, 36005, 42383, 50478, 44158, 51756, 44769, 48863, 49583, 43994, 61140, 91417, 90699, 109609, 142674, 125481, 125980, 113311, 96824, 101066, 101672, 78648, 90472, 121919, 173446, 199028, 207975, 207488, 221663, 206319, 184195, 186901, 206176, 231498, 229402, 225922, 242353, 263906, 241427, 207208, 221250]
11009B21250j4478l2698j2107P763K6486q846j1567K4713J4795J1050j3197j9637
10997A93527j4093m2587k210j6887k1287r974M709Q428j09K937l1119j7382j1829
10984D2124j7305P979J394j4782q264K8823J1888m7656l0767n872K1348K0548
10972I458M8j3261j3505K4756J3111N445j3601j5096j4938j7819L5605K9573J5795
10959D5571l2514k7158L6095J1804R372k6389n212P305j2701j6693K472J9075
10947A1027L461J7539n840l2759m163J3311j8510q763m940L2252N312K2593J6004
10934D6524p303m5456j9678K9186J225j6631j9066q483K5193K7041j3390k3993
10922b4831p198J4733j0680R027J2475J8975J8741k0844n715N201R206j7859l0777
$$ y = [221250, 206772, 174074, 161967, 169730, 196216, 187370, 175803, 200516, 215311, 226361, 213164, 193527, 179434, 136847, 134637, 117750, 96463, 86489, 91198, 99626, 99517, 102454, 71335, 53953, 42124, 24819, 32798, 34192, 19410, 11146, 39969, 51857, 4201, -26566, -32438, -11090, 9458, 9506, -3755, -17260, 7496, 20607, 26052, 12451, -2645, -17583, -35402, 203, 29776, 45571, 13057, -14101, 21994, 33798, 43170, 16781, 11569, 18874, 6173, -10520, -8048, 11027, 14488, 32027, 26187, -6572, -10735, 2576, -15934, -24697, -29637, 2615, 7927, 30520, 46524, 39221, -6235, -25913, 3273, 4498, -12133, -31199, -39682, -14489, 12552, -838, -24831, -32029, -17296, -27976, -18949, -6474, 12501, 31242, 10398, 4683, 9884, 19090, 1231, -29546]
10909b9546K642J7998J5503K6536M274j0017Q344J7750M446k9349p595j3058j0471
10896b543m166j2041l2118k577K1942M956j895Q773j527O635J2794J2060p877
10883B416k5420J4575l482j1618K1381o150l201J3422M900p195K2865K1398l4838
10870I053L2098L14N136K5499j7620k1941k2098L736M1322R389J7635K6214j1888
10857I6849l7301m421k9228J9469J5884J359K132k0940M503J498j9543k9264q300
10844g303J8870K3459M448J9245j9127l2576j2801K2023L095j5869k7593J1636
10832a2493J9374k3074j5793M4137K2582j1195o262N006l0824o922L1607J4538
10820C0681K4397K0284r290k0394l1216m257L3057J9056K4415m579n1298j9804
$$ y = [-29546, -26904, -8906, 6597, 33133, 37407, 27390, 35734, 53484, 57930, 28581, 20986, 7928, -2543, -6709, -18750, -50868, -53445, -31503, -26547, -28442, -19669, -21196, -14561, -1767, 10293, 2416, -23004, -8429, -11911, -23529, -2148, -8298, -11499, 1923, 6823, -372, 22493, 43891, 9053, 41151, 41465, 46601, 72100, 54480, 32539, 10441, 14177, 55499, 64888, 82523, 108737, 96849, 59548, 55127, 25899, 45368, 61252, 62611, 64743, 43803, 48306, 49804, 30261, 997, -7303, 11567, 35026, 39474, 58719, 39592, 7016, -5785, 16238, 19333, 3464, -24129, -12493, 6881, -16193, -31986, 12151, 34733, 23538, 17276, 22282, -8542, -15464, 16143, 30681, 55078, 75362, 66072, 45678, 14462, 10205, 43262, 62318, 86733, 82154, 30856, 11052]
10808A1052J957m420J7068Q507M224J2623J433K212J0286K4525N107O950M7962
10795A49486J8514J1728N0886P2487K7470J02989J86531K91495L46109K86864
10785A544559K78499L53058L45871K27480O4030j25853k23516k82515l96031m47774
10775A337808l14972k08745j41727r8050r1940o8929j7832k8644l4619k0077l8574
10764B73699n2565l5025j5025j842J6867j0432L640J2622k0612l4169m2853k9430
10752F4875m299J8281K7222L9258j9944j6064Q139j0820j9383J1963K2984K571
10740A24783j1985m2866j5704k8010j0297L0364n999M362j3698M856j3916j9929
10728A961o713n419M901L2584L0961K7013K0239l3311q826m625j8697q963j713
$$ y = [11052, 13009, 8589, 25657, 34164, 38388, 51011, 52444, 54656, 64942, 89467, 94574, 101524, 149486, 168000, 179728, 230614, 303101, 330571, 433560, 620091, 911586, 1257695, 1544559, 1823058, 2176116, 2521987, 2749467, 2813497, 2687644, 2464128, 2181613, 1785582, 1337808, 1022836, 814091, 672364, 574314, 482374, 413445, 395613, 366969, 332350, 312273, 273699, 221134, 186109, 171084, 169242, 186109, 175677, 179317, 191939, 171327, 137158, 94305, 64875, 60576, 78857, 106079, 145337, 125393, 109329, 117468, 106648, 87265, 99228, 122212, 124783, 112798, 69932, 54228, 26218, 15921, 46285, 40286, 44648, 30950, 35806, 21890, 1961, -4752, -10171, -5270, 27314, 58275, 85288, 105527, 72216, 63390, 58765, 40068, 31105, 29392]
10715B9392k6632Q988j593K5577L747o866k1590M376R630j1723j5846p275j387
10702a1202L4312M950l3605J050K5826K0537K6251M351k160J9277J1671q786M038
10689I6510j5516n25J278L2160J4845k1710j8691L653k2679M544J9793j7501k1019
10676E5142k1911P750K0473J86J2804M172P867j828n114l3261j2400j5068o599
10663A2213J5883J713P455N849K5268J416N600p690J1545K798k4250m287N0945
10650A04458M1417J6589J2553j177j363M846L1008L4574r663P196J8961K6736
10638B86135L9250K0049m647J4300M0737O3073O8863M8573O3911J26637P6535
10627H43416Q4381J13734J16595J12293J17496J32894Q6245J01409J13907J65671
$$ y = [29392, 2760, 11748, 10155, 35732, 39479, 32613, 11023, 15399, 25029, 13306, -2540, -9815, -11202, 23110, 28060, -5545, -4495, 21331, 41868, 68119, 72470, 70310, 89587, 101258, 92472, 96510, 80994, 80469, 81747, 113907, 128752, 107042, 88351, 92004, 69325, 73869, 93662, 76161, 55142, 33231, 40981, 61454, 61640, 74444, 78616, 86483, 84655, 79541, 46280, 33880, 18812, 12213, 28096, 29809, 37264, 43113, 68381, 69797, 75397, 67707, 79252, 82050, 57800, 53513, 104458, 145875, 162464, 175017, 173840, 172477, 177323, 208331, 242905, 233242, 240438, 259399, 286135, 325385, 345434, 340787, 355087, 395824, 458897, 527760, 576333, 640244, 766881, 843416, 927797, 1041531, 1158126, 1270419, 1387915, 1520809, 1607054, 1708463, 1822370, 1988041]
10617A988041K62734L77445N41152P55780R77692J194073J331662J334740J217312
10608I980631J143497J140561R90152O57671L22968K21698N39780J082597J691386
10599A7770941K119567K185255J971111J819193J763694J332506M24706n68550
10591B8818423r78086m33682O59655J725311K370326K348222K010587J812421
10583C8333177J525263O76917q23968k441591l041530k479432j387488l36722
10575C0024626L34256M84213M06600L15510R5179n18176j504558k468241k781272
10566B4388137k317851j588469r84870n80561l72978l49055l79598n06851p53925
10557A6553979j174441j571625j639779j491369j239799r91851p65282o05832
$$ y = [1988041, 2250775, 2628220, 3169372, 3925152, 4902844, 6096917, 7428579, 8763319, 9980631, 11124128, 12264689, 13254841, 13912512, 14235480, 14457178, 14996958, 16079555, 17770941, 19890508, 22075763, 24046874, 25866067, 27629761, 28962267, 29386973, 28818423, 27840337, 27406655, 28066310, 29791621, 32161947, 34510169, 36520756, 38333177, 39858440, 40535357, 39711389, 37269798, 34228268, 31748836, 30361348, 30024626, 30358882, 30843095, 31249695, 31565205, 31660384, 31142208, 29637650, 27169409, 24388137, 22070286, 20481817, 19496947, 18916386, 18543408, 18194353, 17814755, 17307904, 16553979, 15379538, 13807913, 12168134, 10676765, 9436966, 8445115, 7679833, 7074001]
10549G074001m58384m15071l63095k85447k68942k56744k17617k25345j78267
10540D405089j65288j14542j27634j35829j02594j39601j19751j02035j18135
10531C279680j06519j00009q4646q3776k8332j03445n7050l8362n6792o2591o4437
10520B493721n7276p5833q2981o3655p9116n3205J0040m4956m1066q4831q2307
10509A838535r5230j11009n5691m3397J9554M6288M0456M4309N7426M1080J0880
10498A793201P884j583n251j8698l4540j3374n083l8466k1307k9754j7644l3393
10486A581992m6317k4833l2459j9613k119J6586M134j9983n0699l878k0333l7375
10474A345103k1633j0186j7412k2557k1521J088J318M192J8748L4026L3956P0029
$$ y = [7074001, 6615617, 6200546, 5837451, 5552004, 5283062, 5026318, 4808701, 4583356, 4405089, 4239801, 4125259, 3997625, 3861796, 3759202, 3619601, 3499850, 3397815, 3279680, 3173161, 3073152, 2988506, 2904730, 2876398, 2772953, 2715903, 2677541, 2620749, 2558158, 2493721, 2436445, 2360612, 2277631, 2213976, 2134860, 2081655, 2091695, 2046739, 2005673, 1920842, 1838535, 1743305, 1632296, 1576605, 1533208, 1552762, 1599050, 1639506, 1683815, 1741241, 1782321, 1793201, 1801085, 1799502, 1794251, 1775553, 1741013, 1727639, 1722556, 1684090, 1662783, 1633029, 1615385, 1581992, 1535675, 1510842, 1478383, 1458770, 1456651, 1473237, 1477371, 1457388, 1406689, 1402811, 1382478, 1345103, 1323470, 1313284, 1295872, 1273315, 1251794, 1252882, 1254200, 1258392, 1277140, 1311166, 1345122, 1415151]
10462A415151J02190J17890J75816K47127L31887M60350N88392O21211N37480
10453D597494M43118L72921L15990R0778l17889o03121p60881p03572n06251l18342
10443B610245k68783j94162q9058q3769j04214q1821l2647j6947m2745k6529j5876
10432A653694Q551L9730N9372M1331K0373L7070J4358M7713O2955J6980L7517
10421B039644M1774O3948J04325J23468J23856J49064J87908J49181J75629J96800
10411C355597K17675K46526K76718L20778L65184M56877N81085P11968P23156
10402G255564P87220Q94407R92473R85844Q51965Q12967J066969J322720J450998
10393A6421127J728482K216244K889099L701117M540582N703221P545431J0787966
$$ y = [1415151, 1517341, 1635231, 1811047, 2058174, 2390061, 2850411, 3438803, 4060014, 4597494, 5040612, 5413533, 5729523, 5820301, 5502412, 4899291, 4138410, 3434838, 2928587, 2610245, 2341462, 2147300, 2058242, 1974473, 1870259, 1788438, 1755791, 1738844, 1696099, 1669570, 1653694, 1662245, 1701975, 1761347, 1802678, 1823051, 1860121, 1874479, 1922192, 1985147, 2002127, 2039644, 2081418, 2145366, 2249691, 2373159, 2497015, 2646079, 2833987, 2983168, 3158797, 3355597, 3573272, 3819798, 4096516, 4417294, 4782478, 5239355, 5820440, 6532408, 7255564, 8042784, 8937191, 9929664, 10915508, 11767473, 12580440, 13647409, 14970129, 16421127, 18149609, 20365853, 23254952, 26956069, 31496651, 37199872, 44745303, 55533269]
10385E5533269J6173757K5059889L9361429N7326272O4489829N5291119N9412914
10378C72648478P0884438N8947722L0444297p808270l8174698l6363622n2777848
10371C97800497q6202240p7868035n2067860l4561339k3914284j7258199j2760818
10364I3167722r803925p848012o473821n369154m367736l739659l289626k730140
10356D9545649k367458k121580j740474j497845j424672j465710j542182j441182
10348C5944546j353860j429910j409491j252235j180216j129823j050322j039887
10340B6098802j075997r52626q53701p71563p36415p08590o88028o43680n76689
10331A9091513n25944m53289m37833m45285m07260l94629m23647m37873m22880
$$ y = [55533269, 71707026, 96766915, 136128344, 193454616, 257944445, 313235564, 372648478, 443532916, 502480638, 532924935, 525116665, 486941967, 450578345, 397800497, 311598257, 233730222, 181662362, 147101023, 123186739, 105928540, 93167722, 83363797, 75515785, 69041964, 63672810, 59305074, 55565415, 52275789, 49545649, 47178191, 45056611, 43316137, 41818292, 40393620, 38927910, 37385728, 35944546, 34590686, 33160776, 31751285, 30499050, 29318834, 28189011, 27138689, 26098802, 25022805, 24070179, 23216478, 22444915, 21708500, 20999910, 20311882, 19668202, 19091513, 18565569, 18112280, 17674447, 17229162, 16821902, 16427273, 16003626, 15565753, 15142873]
10322A5142873m36423m21547m22349m01562l68262l53754l76583l36939k99711
10313A1725743k32573k39873k51260k54628k38454k20533k23428k30166k37690
10304I597138k51170k44690k08840j84951k21950k22680j89390j90736j95825
10295G686906j47849j18906j11611j17767j20254p5000p6160q4649k1157M8812
10285F862365J26076K59401M07662N34582M92124M09123L21238K65566J51526
10276I829663j45388n66671q74169r24027p61905n58485l99608l35608k69500
10267D994302k29065j83131j83075j55830j59671j28538j03638j20819j39206
10258C591329r7789q3507p4352m1337j3724l4943J2973N7096N189J4241O0586
$$ y = [15142873, 14706450, 14284903, 13862554, 13460992, 13092730, 12738976, 12362393, 12025454, 11725743, 11493170, 11253297, 11002037, 10747409, 10508955, 10288422, 10064994, 9834828, 9597138, 9345968, 9101278, 8892438, 8707487, 8485537, 8262857, 8073467, 7882731, 7686906, 7539057, 7420151, 7308540, 7190773, 7070519, 6995519, 6919359, 6834710, 6813553, 6862365, 6988441, 7247842, 7655504, 8190086, 8682210, 9091333, 9412571, 9678137, 9829663, 9684275, 9117604, 8243435, 7319408, 6557503, 5999018, 5599410, 5263802, 4994302, 4765237, 4582106, 4399031, 4243201, 4083530, 3954992, 3851354, 3730535, 3591329, 3493540, 3410033, 3335681, 3294344, 3280620, 3245677, 3258650, 3315746, 3320935, 3335176, 3395762]
10247C395762j0978k6598l2659p3691q3855r7664q9856r3684q3572o7161p8314
10236B657730p6383p5380q9431o2553k330Q769k1166j6595l0600k4369j5981l1193
10224B220518l0785l6933k1355p391m6110q5877n2550j5389k4464l9146k9759
10213A830759j457n371j8137n3370l3493n1951l3782J0097m4084l0845m0658p58
10201A526950J4816j0845l0025k0662k2302k5116j9062p989k131o0167k2973K6281
10189A346775l3j6642o4050l6582j4281Q429j7591l1443j4004m508l2168k8217
10177A095685l6797k9207l5148k0896k0320N2442N8580M809r726J6501K5083j3855
10165A087151m693l7824k1698J7024R619j3206j147j1478j2419k9688r687l6674
$$ y = [3395762, 3384784, 3358186, 3325527, 3251836, 3167981, 3070317, 2980461, 2886777, 2803205, 2736044, 2657730, 2581347, 2505967, 2416536, 2353983, 2351653, 2360422, 2339256, 2322661, 2292061, 2267692, 2251711, 2220518, 2189733, 2152800, 2131445, 2124054, 2077944, 1992067, 1939517, 1924128, 1899664, 1860518, 1830759, 1829302, 1823931, 1805794, 1752424, 1718931, 1666980, 1633198, 1643295, 1599211, 1568366, 1527708, 1526950, 1541766, 1530921, 1500896, 1480234, 1457932, 1432816, 1413754, 1405765, 1403634, 1343467, 1320494, 1346775, 1346742, 1330100, 1266050, 1229468, 1215187, 1223616, 1206025, 1174582, 1160578, 1156070, 1123902, 1095685, 1058888, 1029681, 994533, 973637, 953317, 1005759, 1064339, 1069148, 1059422, 1075923, 1101006, 1087151, 1082458, 1044634, 1022936, 1039960, 1049579, 1036373, 1035226, 1023748, 1011329, 981641, 971954, 935280]
10153I35280l2743n2879k187J6715k6144j3368K190L2638K1731k1714n1245j6013
10141G92261m340j7470l6127j2557r213J0543k9610j4322j5393l8734N588n431
10129F25195j8674j8002j9878N148Q517k8365l2808L0830K3305K0213n869j2305
10117E77307k433j0546m7129j9225j9684o214k261N349p242K2946L9543j9319
10105E11092j8722k24k1977l0156M443J4154l1965o701R760j1491r409k4336N738
10092C90206N704j4116J9678L0046k0657k0433J2325j6287k0613j2614N452n462
10080C53229j7506j7512R250n173R928j2908k5809j1116J5816K3306J052J4091
10068C36648n343O751O104k3624j2152J9545O499l1631r804k4813k356J8090J3883
$$ y = [935280, 902537, 849658, 847471, 864186, 838042, 824674, 826864, 859502, 881233, 859519, 808274, 792261, 787921, 770451, 734324, 721767, 712554, 723097, 693487, 679165, 663772, 625038, 630626, 625195, 606521, 588519, 568641, 573789, 582306, 553941, 521133, 551963, 575268, 595481, 589612, 577307, 574874, 564328, 517199, 497974, 478290, 472076, 469815, 475164, 467922, 490868, 530411, 511092, 492370, 492146, 470169, 440013, 444456, 458610, 426645, 419944, 429704, 418213, 408804, 384468, 390206, 395910, 381794, 401472, 431518, 410861, 390428, 402753, 386466, 365853, 353239, 358691, 353229, 335723, 318211, 327461, 322288, 332216, 319308, 293499, 282383, 298199, 321505, 322557, 336648, 331305, 338056, 344160, 320536, 308384, 327929, 334428, 302797, 292993, 268180, 265824, 283914, 297797]
10055B97797L6475q698J8203J4823P566J1173N939j8589r130k5130j7442r900
10043C03087q53N099j782l2581J5547K0666r918j8004J4466J0547J932k5561P394
10030B90039j2519k1741J4965J5106M163j8940L746R423N874J7965k7724l2044
10018B48313j4644Q488Q029k1454l2493j6682J2486N438j4466L995J4037q649
10006A92398L0556j1018l3140K120K8149L117J8266R512L5308p501k7670K3687
9994B63784M459O945j1399j6985N657L7K803j401p692J6053L1893p392k6765J3775
9980B73772M0236J072R588L8926O6583N4274L9963J04084J66069K57097L49672
9969A401336L15707K89651L56806L66513K34660N2799j43290j98829k56586l94895
$$ y = [297797, 334272, 325574, 343777, 358600, 366166, 377339, 383278, 364689, 355559, 330429, 312987, 303087, 302234, 307333, 305551, 272970, 288517, 309183, 299265, 281261, 295727, 306274, 308206, 282645, 290039, 277520, 255779, 270744, 285850, 290013, 271073, 274819, 284242, 290116, 308081, 280357, 248313, 233669, 242157, 250186, 228732, 196239, 179557, 192043, 197481, 183015, 187010, 201047, 192398, 222954, 211936, 178796, 180916, 209065, 212182, 230448, 239960, 275268, 267767, 240097, 263784, 268243, 275188, 263789, 246804, 252461, 252498, 255301, 253900, 246208, 262261, 294154, 286762, 259997, 273772, 314008, 315080, 324668, 363594, 430177, 484451, 524414, 628498, 794567, 1051664, 1401336, 1717043, 2006694, 2363500, 2730013, 2964673, 3017472, 2874182, 2675353, 2418767, 2023872]
9959B023872m29147l29776k19973j55576j12710n6869l6199n5809l3613m9300
9949E44900l0752o243k7179l3556k9365j6591k0159l1631j0816O171r057n1696
9937B84026j9929j9438J4995K588j0327N574J389j7833L5776j2109L377K4844
9925B92933K7052q471k9057j6503p875j3245R800j1497J3180J0146k6127j8771
9913B21565j3525J5906J8612j8866n876o644L970J8886j9452k5030n22O628N876
9900B01528K0391j0317l5659K1556J4519J2508r361k9430O889J8731n189m2463
9888A63703l9173m136J2703K8718N362j2014j5586k7491Q934M2859M6694J089
9876B11662m2556R10J1078L819n355J0106O083Q503l711j3862K2864q36l8480
$$ y = [2023872, 1594725, 1264949, 1044976, 889400, 776690, 719821, 683622, 627813, 594200, 544900, 514148, 507905, 480726, 447170, 417805, 401214, 381055, 349424, 338608, 344779, 335722, 284026, 264097, 244659, 259654, 262242, 251915, 257489, 258878, 241045, 276821, 264712, 268089, 292933, 319985, 311514, 282457, 265954, 258079, 244834, 254634, 243137, 256317, 266463, 240336, 221565, 208040, 223946, 242558, 223692, 217816, 211172, 215142, 234028, 214576, 189546, 189024, 195652, 201528, 221919, 211602, 175943, 197499, 212018, 224526, 215165, 185735, 192624, 211355, 206166, 163703, 124530, 120394, 133097, 161815, 167177, 155163, 139577, 112086, 121020, 163879, 210573, 211662, 169106, 170016, 181094, 184913, 179558, 189664, 195747, 204250, 200539, 186677, 209541, 208705, 170225]
9863A70225Q868K7335J676m3205k9025k6751k5512J3828J2026K979L470j2420
9851A03494j9692M3318J6746j1021M115q439m364J4626J3447k8994j4746j892
9839A06598j7701l05J2084k6818K008J388J8321j5120m849J1176N67r534j0279
9826F7536J0644K0141J7312K2391J3564J129l0062j6843J0067k739l846J1893
9814A21187O929j2665p852J3501Q591q497j6935r90l7726o307J4366J2289Q392
9801I4283j0147k636M357J7702p618J4823N137j3206k1783N341J8141j267Q006
9788A11133L266J497L0388L2520K3850j1455J2247P512j5413k607j1049L1800
9776B13689K5371R852l523K7683K4749L3609R3051J54305K32053L77387N22212
$$ y = [170225, 179093, 206428, 208104, 164899, 135874, 109123, 83611, 97439, 109465, 112444, 115914, 103494, 83802, 127120, 143866, 132845, 136960, 128521, 124157, 138783, 152230, 123236, 108490, 106598, 88897, 88592, 100676, 73858, 75866, 77254, 95575, 80455, 75606, 86782, 87349, 77815, 67536, 78180, 98321, 115633, 138024, 151588, 152717, 122655, 105812, 115879, 113140, 109294, 121187, 128116, 115451, 107599, 121100, 129691, 121194, 104259, 103269, 65543, 59236, 73602, 85891, 94283, 84136, 81500, 85857, 103559, 95941, 110764, 115901, 102695, 80912, 86253, 104394, 103127, 111133, 114399, 115896, 146284, 178804, 202654, 191199, 203446, 210958, 195545, 192938, 181889, 213689, 239060, 248912, 245389, 273072, 297821, 331430, 424481, 578786, 810839, 1188226, 1710438]
9765A710438N34100L62848K22352K91235L70149J42175l26809p42586p34378m93762
9755A335762l15180j90734j09668p8904r1276n3259J106o256l6646k3650p931
9744D23364k1234l2987j5548q478k3293l9459j1347L510q262J002K4162O412k2283
9731B75559k2478J0736J4365k5743l1006l1128k215K018J2353j8268l793l415
9719A76985J522J4330j4931j984j2146R497K5201K2255k0063J8620N62j7646k7073
9706A75129j6046j6630k1498j2414K7808j6092K2385J4025j9176K986J2744k2402
9694A30819k6192J8153N4050P293k0891j8398l5255O91K305J1131j5104J5475
9682A24077Q562K0148M223n088p828Q219k6989k1163L008M657J1595k8160j752
$$ y = [1710438, 2244538, 2607386, 2829738, 3120973, 3491122, 3633297, 3306488, 2563902, 1829524, 1335762, 1020582, 829848, 720180, 641276, 550000, 496741, 497847, 491591, 454945, 431295, 423364, 402130, 369143, 353595, 345117, 321824, 282365, 271018, 274528, 266266, 267268, 291430, 297842, 275559, 253081, 263817, 278182, 252439, 221433, 190305, 188090, 190108, 202461, 184193, 180400, 176985, 178507, 192837, 177906, 175922, 163776, 173273, 198474, 220729, 200666, 219286, 219848, 202202, 175129, 159083, 142453, 120955, 108541, 136349, 120257, 142642, 156667, 137491, 140477, 153221, 130819, 104627, 122780, 176830, 184123, 163232, 144834, 109579, 110270, 112575, 123706, 108602, 124077, 132639, 152787, 157010, 151922, 144094, 152313, 125324, 104161, 107169, 111826, 123421, 95261, 93509]
9669I3509J2102j3884o549J4481k2397k3284o840p345J0900K8856K9427L846k2667
9656I0155o241L1835J6901l4025k4325k857j7558P493L6006M003L06l174k2139
9643G6380L096J343j4446J1620L5537n414k806J3922k1692k9639j0615K7384n139
9630G9531J1883J8236n27m362k0042j50r625k2013Q281M4209j4465l4637O027
9617F2346Q303o112M0004r66l751m378P588J8508J100m0734j9539j5775O020n829
9603D6785J5664J6708N2276o337n1484n4220j1453L2472p425k0858j816O58J6386
9590B7356O976R769J4272J7314j8006j0544m216M442J4734R920O035j4695N022
9577F8379J992M624m618r86J5770q868n136r530j9574J1849K5188J7144k6539
$$ y = [93509, 105611, 91727, 85178, 99659, 77262, 53978, 47138, 39793, 50693, 79549, 108976, 112822, 90155, 83914, 115749, 132650, 98625, 74300, 71443, 53885, 61378, 97384, 101387, 101693, 98519, 76380, 79476, 80819, 66373, 77993, 113530, 108116, 105310, 119232, 97540, 67901, 57286, 84670, 79531, 91414, 109650, 109123, 104761, 84719, 84569, 74944, 52931, 61212, 105421, 90956, 56319, 62346, 70649, 64537, 104541, 103575, 99824, 95446, 103034, 121542, 122642, 81908, 62369, 46594, 52614, 46785, 62449, 79157, 131433, 125096, 73612, 19392, 7939, 40411, 32986, 12128, 10312, 10970, 27356, 34332, 44101, 58373, 75687, 57681, 47137, 42921, 47363, 62097, 72017, 78052, 63357, 68379, 70371, 74995, 70377, 69391, 85161, 76293, 71157, 61627, 42053, 53902, 79090, 96234, 69695]
9564F9695j0598j0802R226J9069Q096j459k836K775l478j6923j89k185L1784j3179
9550G8996j1465J1932R861k4932l2184J7487n719q341n156K4907J5994O006J3381
9537I0767J4371k4570j7959J3231k627K879N098J1538k2942J446J8903k0299k3082
9524D6754L455K4042Q746k4142M102L8906K6191l2841m6605l0531O153L8632L0745
9511I3607k6283k4178k92j2679K058J0058k8261j3007O58j1304o27J7121J7264
9498B4135J6026J3742Q305L7107J8457p307r269k45k0019J2931J16K2941j0166
9485A06754k398k1011l5038k1376K1057m557M0168J3960j7661k3277j1051P426
9473E2996R438L252l1022m888R569K022L0401L9388j1063l5851j8852M757J4614
$$ y = [69695, 59097, 48295, 57521, 76590, 84686, 83227, 80391, 83166, 79688, 62765, 62576, 60391, 92175, 78996, 67531, 79463, 89324, 64392, 32208, 49695, 43976, 35635, 30479, 55386, 71380, 77386, 90767, 105138, 80568, 62609, 75840, 73213, 76092, 81190, 92728, 69786, 71232, 90135, 69836, 46754, 50209, 74251, 82997, 58855, 62957, 101863, 128054, 95213, 48608, 18077, 24230, 62862, 93607, 67324, 43146, 42854, 30175, 32233, 42291, 14030, 1023, 1681, -9623, -10250, 6871, 24135, 40161, 53903, 62208, 99315, 117772, 110465, 101196, 100951, 80932, 93863, 93979, 116920, 106754, 104356, 83345, 48307, 26931, 47988, 43431, 83599, 97559, 79898, 56621, 45570, 52996, 62434, 65686, 34664, 29776, 39345, 41367, 71768, 111156, 100093, 64242, 45390, 50147, 64761]
9460F4761R741m0940l8660j1123J4467J4935K270L5016o75j3454K629j5980K1014
9447D4001L4868k1221K720j0942M827k0210j5652L1113K7966j4052m9091j8240
9435c913M1645J5074k5536o253l0597P842M767L503m298K8774M2294m2182l0349
9422G71Q342O364p819J0403J8097M629O552J3821j6379l1237Q770J5398P784J820
9408D7316k3481r273j7930k509R105L5017M260k6728O266r890J0012O832L2868
9395F1865l241l5643o221L7847J5218O255j0237m5010R953J8310n534K1076r966
9382E4672k2791k1300M428J9938J3348k741l0622j291K3703j5859K617q595j3180
9369B327J5582J68J3722K0376J8603j531n01k0417k2055J0175N879k1981k3250
$$ y = [64761, 74502, 33562, -5098, -16221, -1754, 13181, 15451, 50467, 49792, 36338, 38967, 22987, 44001, 78869, 57648, 60368, 49426, 54253, 34043, 18391, 49504, 77470, 63418, 14327, -3913, 37732, 52806, 27270, 21017, -9580, -1738, 3029, 6532, 2234, 31008, 73302, 31120, 771, 9113, 15477, 7658, 18061, 36158, 40787, 47339, 61160, 44781, 13544, 22314, 37712, 45496, 47316, 23835, 14562, -3368, -5877, 3228, 38245, 42505, 15777, 22043, 12153, 22165, 28997, 61865, 58624, 22981, 16760, 54607, 69825, 76080, 65843, 20833, 30786, 49096, 43562, 64638, 54672, 31881, 10581, 15009, 34947, 48295, 45554, 14932, 13641, 37344, 21485, 24102, 15507, 2327, 17909, 18077, 31799, 52175, 70778, 69247, 68746, 48329, 26274, 36449, 42328, 20347, -2903]
9356b903k2904J5044K2710L6810O330K1769J9211J4061j1323n197k5142l3362
9344C5104o059K8916k65j9305k992m906K0398k0880m0653j2614m139K7555N4346
9331E4506J2589R030j4981l7639q349J9398P159j54o297k0209J278Q724J7700
9318D2755J8107j3796J7365J1890j0643k6124J8059J2726O505k6496o918k0154
9306B3276L143N220j7076L5422L6685j2903k6522q603J2495P167K0454L1219j7389
9293I2588k1607l1941J0575o820j0990k2498R710K9984k6116j8312j4692j0267
9281b0386J4036l848k0423K5489L1090j5882k0851j9240J9988J4426r629j553
9269f783M847j0125L4908K7578j2222n13j807k4474O738K3032L5341k0164K333
$$ y = [-2903, -25807, -10763, 11947, 48757, 55087, 76856, 96067, 110128, 98805, 93608, 68466, 35104, 29045, 57961, 57696, 38391, 35399, 30493, 50891, 30011, -10642, -23256, -27395, 160, 54506, 67095, 76125, 61144, 23505, 15156, 34554, 41713, 41559, 35262, 15053, 16331, 25055, 42755, 60862, 47066, 64431, 76321, 65678, 39554, 57613, 70339, 76844, 50348, 43430, 23276, 26419, 31639, 14563, 49985, 86670, 73767, 47245, 38642, 51137, 58304, 78758, 109977, 92588, 70981, 39040, 49615, 42795, 31805, 9307, 19017, 49001, 22885, 4573, -10119, -20386, -6350, -10198, -30621, -5132, 25958, 10076, -10775, -30015, -10027, 4399, -5230, -6783, -1936, -12061, 22847, 50425, 38203, 37690, 35883, 11409, 18147, 41179, 76520, 56356, 58689]
9256E8689k315j2409j2465J8459j042k9596j9335J3812j6590r84N4328M0478j5230
9243G5800j5419j4179l354J3484M482n513m6536J4995M2837L8825o797k0645q629
9230F9351L671m585j4713j0191O151K7506j3602j4471P935J6964J4626j6432l0616
9217D1594L542m141K3400O531l7281j4895J137P975J8692q142L487j1205J885
9204C2579n046O771j9252O373J0400J213k414q427J3565k178j1097k085p757k772
9190I873J070N0662K2177o716Q740j4765n44l1681j0671K3783K4591m451n969
9177F6099R411R475J4839P758l0841l516k7201l5563n374L7987j7913O585K1051
9164E2797n3n933J1603L29k4532M552k990k1257m399J8880K1450r480k9248k2246
$$ y = [58689, 56374, 43965, 31500, 49959, 48917, 19321, -14, 13798, -2792, -3776, 50552, 91030, 75800, 60381, 46202, 42848, 56332, 60814, 55301, 8765, 23760, 66597, 105422, 98625, 77980, 69351, 73022, 68437, 53724, 43533, 49684, 77190, 63588, 49117, 57052, 74016, 88642, 72210, 41594, 45136, 40995, 64395, 70926, 33645, 18750, 19887, 27862, 46554, 38412, 41899, 30694, 32579, 27533, 34304, 15052, 21425, 31825, 33038, 30624, 22197, 35762, 33584, 22487, 20402, 12645, 9873, 10943, 61605, 83782, 77066, 85806, 71041, 70497, 38816, 28145, 51928, 76519, 72068, 66099, 75510, 84985, 99824, 107582, 76741, 73225, 46024, 10461, 5087, 43074, 25161, 31746, 52797, 52744, 46811, 58414, 58743, 34211, 38763, 35773, 14516, 10117, 28997, 50447, 40967, 11719, -10527]
9150a0527K370K9341j2900K342K2928K7175l677o614R547J0050J6642J7749o473
9137I7953n67m0659j5812N410R424j2044m2719J3350m125j3571K9197L3243K813
9124F1893Q395p82j4795q880J6946K2323l355k3519k0004J0425K3196l2833J0300
9111D9310j6607m551r490l174J1657M0768J6921l2124n094j3761P541L5665r723
9098F7338o072q094K8627J5785k4850j8634O944k7534j6354K1610J0144j9493
9086B9417l2651l9990J9385K2440K7637k876j6471n312K4866K4827j0972j8014
9074B2286k1755j3294J5920P471J5028R097j3219k4154k556K7425P7R231l572
9061B7985J637K42K720J9549R049j0986k1255Q499o59N86N209l896k6986J945
$$ y = [-10527, -8157, 21184, 8284, 10626, 33554, 60729, 57052, 50438, 59985, 70035, 86677, 104426, 97953, 97386, 56727, 40915, 46325, 55749, 43705, 986, 14336, 10211, -3360, 25837, 59080, 61893, 70288, 69506, 54711, 45831, 62777, 85100, 81745, 58226, 38222, 48647, 71843, 39010, 49310, 32703, 28152, 18662, 15488, 27145, 67913, 84834, 52710, 47616, 33855, 41396, 77061, 67338, 61266, 53172, 81799, 97584, 72734, 54100, 61044, 33510, 17156, 38766, 48910, 29417, -3234, -43224, -23839, -1399, 26238, 23362, 6891, 1579, 26445, 51272, 40300, 22286, 531, -12763, 3157, 10628, 25656, 34753, 21534, -2620, -5176, 22249, 22326, 31557, 27985, 29622, 29864, 32584, 52133, 61182, 50196, 28941, 37440, 36781, 37367, 42576, 38680, 11694, 13639]
9047A3639J3750K8369m550j1809j3082K8890k6473k7674N464R639K9950L6468
9035H2581J9335k5216n23K877j0148q824k1161m505k9938P667J5852k5656m431
9022b090j6146K4272M2692K0744k3075k1333K4J78m004k1978Q068K2814j4297
9009A5869K0806J0323k570K366j6160N740Q650j9993m026M1114n728k6058k290
8996B8043J067K2639r085J1035j0223Q527j0770o68P644P390L096k7480J0083
8983D1298m63l459O437P294N83p147j1669O185R262j0491k2590R388j4563n333
8969D732n515K2755n926k2834M563M914L0690j4753k0372m080K4591L9177p084
8956E0858k211M984J1076k3966l3537n01k011J3839J6198J7712J2842k5767k7477
$$ y = [13639, 27389, 55758, 51208, 39399, 26317, 55207, 28734, 1060, 6524, 16163, 46113, 82581, 101916, 76700, 76177, 79054, 68906, 60082, 38921, 34416, 4478, 12145, 27997, 2341, -2090, -18236, 6036, 48728, 69472, 46397, 25064, 25088, 25266, 21262, -716, 7352, 30166, 15869, 36675, 46998, 44428, 46794, 30634, 36374, 45024, 25031, 21005, 62119, 56391, 30333, 28043, 29110, 51749, 42664, 53699, 43476, 52003, 41233, 40565, 48209, 55599, 58695, 31215, 41298, 40835, 37376, 43813, 51107, 51690, 44543, 32874, 39059, 48321, 37830, 15240, 24628, 10065, 4732, -783, 21972, 16046, -6788, -2225, 2689, 33379, 18626, -1746, -5826, 18765, 57942, 50858, 48647, 53631, 64707, 40741, 7204, 6703, 4692, 18531, 34729, 52441, 65283, 39516, 12039]
8943A2039j934Q313P332K4022L0241l9499l9247J6081N3815J8844r719j584m382
8930G4322l9249K230J5096n20J6690J5998j1904P470M50k5060l0756j2138J1836
8917B4465K384L902J6001n901j2350J2341J0981K460k2161J925k919J8718L285
8904E3131j8280l446K942L332l5681k9120j1657L4584K0156p141k394K1447J9773
8891D7646j0534j1314j8264J4811K0648J1526n634j0522k5412R205R654N540p691
8878B9659J1295J8991k2154k604k534j6659M335j2749K331J8577O37J626m70J3415
8864D3696J2699q156K811J4523k2505k4693N247J0445J1039J8406j9525J4663
8852E8650L528n263j0681K766m430j1733R330o389L4359K2214l3245l4047k1137
$$ y = [12039, 10105, 18418, 25750, 49772, 80013, 40514, 1267, 17348, 71163, 90007, 80288, 78704, 74322, 35073, 37303, 52399, 51879, 68569, 84567, 72663, 80133, 80583, 55523, 24767, 12629, 24465, 26849, 30751, 46752, 40851, 28501, 40842, 51823, 54283, 32122, 34047, 31128, 49846, 53131, 34851, 31405, 34347, 37679, 1998, -27122, -38779, -4195, 15961, 8820, 6426, 27873, 47646, 37112, 25798, 7534, 22345, 42993, 54519, 48885, 38363, 12951, 22156, 31810, 37350, 29659, 40954, 59945, 37791, 35187, 32653, 15994, 20329, 7580, 9911, 28488, 29125, 30751, 30281, 43696, 56395, 48239, 51050, 65573, 43068, 18375, 23622, 34067, 45106, 63512, 43987, 58650, 62178, 56915, 46234, 49000, 44570, 32837, 42167, 35778, 70137, 92351, 59106, 25059, 3922]
8839C922J2689N134k1742j2499J9426K6953m992k57J7509j0397k1843J8031K1668
8826E3602l5724k0333L4061J2439M640m897j6094J1298j030j4619o895K0098K5941
8813F2487O241p619p481j816n897K3025p127n3877j1485J3630J4482r363k206
8800A2994K9956Q012l5600l1231N695M651M0110j917k7029O408J3330K97k7997
8787b321k8851J9895L1978J6122n760j0729K1843j1324k787j1215N883j1562o564
8774D608L091J9240J4689j6829q847K6751L267K0183k2847k5792L8670N045j8740
8761D2489O554J2446K812k3047k0568J1726J4157l3792k1847Q881P919J6591L9628
8748F3949o501k0168n110j777k2504O263J0145L2888Q793p196j7716j855J338
$$ y = [3922, 16611, 21745, 3, -12496, 6930, 33883, 28891, 28634, 46143, 35746, 13903, 31934, 53602, 17878, -2455, 31606, 44045, 48685, 43788, 27694, 38992, 37962, 23343, 16448, 36546, 62487, 68728, 61109, 53628, 51812, 45915, 68940, 61813, 7936, -3549, 10081, 24563, 15200, 12994, 42950, 50962, 15362, -15869, -10174, -5523, 34587, 32670, 5641, 12049, 25379, 25676, -2321, -31172, -11277, 20701, 36823, 31063, 20334, 42177, 30853, 28066, 16851, 22734, 11172, 4608, 7699, 26939, 41628, 24799, 15952, 42703, 45970, 66153, 43306, 17514, 56184, 61229, 42489, 49043, 61489, 64301, 41254, 20686, 32412, 46569, 12777, -9070, -189, 7730, 24321, 63949, 57448, 37280, 32170, 30393, 7889, 14152, 24297, 57185, 65978, 58782, 41066, 39211, 40549]
8735D0549l1464k6246m972r170J0679n137L1121K5816J99r857l0417p623J6504
8722a8J6238p345O180K619K0474K5550k8958j4753J6700j3713J0323j5572k7400
8709i675j5092q160M8912N1033m587l856r187l2939J608j0703m507p915P684K205
8695D821j33j0145p958J7219L0022K9459l128P730r648l7537j6775n463j2571
8682a4107j3426K1096J2074k852j7036J8421K8484o398k2372J3255K0342m17k1835
8669A5229J0627m549j8699L2249J3571j334R206j5836j5589J8173m361k2668k731
8656A3288j1433j5387J0458K3443J8893m335j2290k076r062K6734J4396j4281
8644C8348k6579L5743L5524L089k1108m8535k2393P72R877m045K6303K3842m956
$$ y = [40549, 9085, -17161, -22133, -31303, -20624, -25761, 5360, 31176, 31375, 21518, -8899, -16522, -18, 16220, 8875, 15055, 17674, 38148, 63698, 34740, 19987, 36687, 22974, 33297, 17725, -9675, -24767, -32927, 15985, 67018, 62431, 58575, 49388, 16449, 18057, 7354, 2847, -5068, 2616, 4821, 4688, -5457, -13415, 3804, 33826, 63285, 60157, 67887, 58239, 20702, 3927, -1536, -14107, -27533, -6437, 5637, 2785, -14251, 4170, 32654, 26256, 3884, 17139, 37481, 37064, 15229, 25856, 21307, 2608, 34857, 48428, 47094, 56300, 40464, 24875, 43048, 38687, 16019, 13288, 1855, -13532, -3074, 20369, 39262, 34927, 22637, 20561, 11499, 38233, 52629, 38348, 11769, 47512, 83036, 86125, 65017, 16482, -5911, -5139, 4738, 693, 26996, 50838, 45882]
8631D5882N351J9770K799R800k039l9354L465o777m2386L3131Q296l868K7081
8618F1151k967J1646j8156k5988M214L9403k989j5170l2721k3717L1428K7851
8606E3985k6983r308M9918N660l5512l0866j5433l2602J7136M4082L918q233M108
8593A9870M279M805l977r352k318Q065K524J1089K2466k3301l6729m518N0763
8580D3666L5035J5613l3721Q73q525O537K5231m1222k4886L5676J7509M2J7467
8567H9295L5855k602l6935n0072j4452M593J6534K176j360K602j7567r866K1420
8554C9621K5842q092j1906o70j7150p137J4681K3076L2645J6094k3514J2887P819
8541A04196J7141m2680m1772o837N325l571J6326l5978j2103O096M2903L1466
$$ y = [45882, 51233, 71003, 73802, 83602, 81563, 42209, 45674, 38897, -3489, 29642, 37938, 34070, 61151, 58184, 69830, 51674, 25686, 29900, 69303, 66314, 51144, 18423, -5294, 26134, 53985, 27002, 17694, 67612, 73272, 37760, 6894, -8539, -41141, -24005, 20077, 23995, 15762, 19870, 24149, 28954, 24977, 15625, 13307, 21372, 23896, 34985, 57451, 34150, -2579, -7097, 43666, 78701, 94314, 60593, 61466, 52941, 59478, 84709, 43487, 18601, 54277, 71786, 71828, 89295, 125150, 122548, 85613, 35541, 21089, 25682, 42216, 44392, 43032, 45634, 28067, 18201, 39621, 65463, 57371, 45465, 44795, 27645, 20508, 35189, 58265, 90910, 107004, 83490, 96377, 104196, 121337, 78657, 36885, 30048, 35373, 31802, 48128, 12150, 47, 6143, 49046, 80512]
8529H0512N895j493k0430o869R019K9080J2063q2K634M5947P0367J03290J58446
8516D88379J33057O6812R2902J05369P4271n4731k07066j76691j30503r1387o7485
8505B32927l2446k340k8715k7487p031j1470j8187O670j5447K5779O066k5985
8493A02334k0392r893J4130j4166J9949m3J0206j564Q152L3883J8888K3797J5012
8480B00293k6502k0606K1980M1294L3653J16857J50905K39875L11062K11447J04518
8469A384776J06904J98097K01381l9696m04496m21375k75535j88304j16623m8286
8459C96843m5678m3556j4925q942k8082o0728o403j5750K1974k700l3487q022
8447A50544j2683q973q679j4935j3570L7253M0947K2829l3629k4352o750K1669
$$ y = [80512, 86407, 84914, 64484, 57615, 66634, 95714, 107777, 107695, 110329, 156276, 226643, 329933, 488379, 621436, 688248, 781150, 886519, 960790, 906059, 698993, 522302, 391799, 300412, 232927, 200481, 198141, 169426, 141939, 134908, 123438, 105251, 111921, 96474, 122253, 128319, 102334, 81942, 72049, 86179, 72013, 91962, 91919, 102125, 100561, 108713, 142596, 161484, 185281, 200293, 173791, 153185, 175165, 216459, 250112, 366969, 517874, 757749, 1068811, 1280258, 1384776, 1491680, 1689777, 1891158, 1851462, 1446966, 1025591, 750056, 561752, 445129, 396843, 351165, 307609, 292684, 283742, 255660, 194932, 188529, 172779, 194753, 192053, 158566, 150544, 137861, 128888, 120209, 105274, 91704, 128957, 169904, 192733, 159104, 134752, 128002, 149671]
8435A49671J6762k0537j4676j257Q766N4521P3467J28469J64136R8452N5377M8597
8423G61748Q3313Q4723j4237j55822j85723j31817q1051l8681m8352l9714k4500
8412B09887k5134l3361n419L85p862J2144n392K4636j2687m795k1937j7207K8852
8399A42110J6611j7383l0098k519K305J038J015k717j2739Q564Q5k497n019k2184
8385G6572l0642j5834J1907K5855J7676M354j4623o514m536J3149M429q814j332
8372G1647O96R609k028J4044r79k5736k3691j1396j018K0700N566L030l6355p556
8358A6533n481J4611p847p340K0169J6617O174q192K2111M9151J3770o3743m4377
8345B2156n258j1445K0702K2799O151j3375l929r281K3384N117l1911J1926J4820
$$ y = [149671, 166433, 145896, 131220, 129963, 138729, 193250, 266717, 395186, 559322, 657774, 713151, 761748, 845061, 929784, 915547, 759725, 574002, 442185, 361134, 322453, 274101, 234387, 209887, 184753, 151392, 145973, 146358, 138496, 150640, 145248, 169884, 157197, 152402, 130465, 113258, 142110, 158721, 141338, 111240, 108721, 111026, 112064, 113079, 110362, 97623, 106187, 106272, 103775, 98756, 76572, 45930, 30096, 42003, 67858, 85534, 89888, 75265, 68751, 64215, 77364, 81793, 72979, 71647, 72343, 81952, 79924, 93968, 92989, 67253, 43562, 32166, 31148, 51848, 57414, 60444, 24089, 16533, 11052, 25663, 17816, 10476, 30645, 47262, 53436, 45244, 67355, 116506, 130276, 66533, 22156, 16898, 5453, 26155, 48954, 55105, 41730, 37801, 28520, 51904, 57021, 25110, 37036, 51856]
8332E1856j3929J4687m449l2606k0619p30L7402r455l9350J7088L2682J2442m499
8319D0520Q010l726j719j0926l455K0074j2683r922J5172J1152q612n981J3037
8306E0941m825p331j7116j8331Q565J3944K2360q689k01N137j6109k1521p038
8293b14J2896k2509P643J1929j7275M723j671J4027m854K1569j5152M288J3219
8280B8619p236J0404j9686l5897l8151J2106O1121N0366R20j6081p716k3030J8798
8267C4537j535p02K2255J6953K1446k2771l1968j635J8015k750k9382j6008L4824
8254D1279j3459l3455n640r575P12K5167N877J2540m955j8387K552L2243R574
8241D4473k0727j9746J9307M420L093P920k6233j9519J3749J5878K838j7129j324
$$ y = [51856, 37927, 52614, 48165, 15559, -5060, -5790, 31612, 22157, -17193, -105, 32577, 45019, 40520, 48530, 44804, 43085, 32159, 28704, 48778, 36095, 26173, 41345, 52497, 43885, 37904, 50941, 46116, 38785, 21669, 3338, 11903, 25847, 48207, 39518, 39317, 44454, 28345, 6824, -214, 12682, -9827, -2184, 9745, -7530, -2807, -4478, 9549, 4695, 26264, 11112, 15400, 28619, 21383, 31787, 12101, -23796, -61947, -49841, 11280, 61646, 62566, 46485, 38769, 15739, 34537, 33002, 32300, 54555, 71508, 92954, 70183, 38215, 36580, 54595, 51845, 22463, 6455, 41279, 27820, -5635, -11275, -20850, -20138, 5029, 10906, 23446, 18491, 104, 2656, 34899, 44473, 23746, 4000, 23307, 27727, 30820, 38740, 12507, -7012, 6737, 22615, 25453, 8324, 7000]
8228G000K1755j799L077k2749j1272J2534J2867j9662q28M1530n237o6593k0923
8215e0300L3408J2879J9906J8995K5672J9368q690k2124k1751K2939K272q045
8203D4529o514N666J7437P748k1725k3457j7917J5421K0552M677K2110j4213k6124
8190B8190J1636j9066j5306j360p732j4517K2890J6511l259K221J0691P042O403
8177D4344l4784j8024k0550o093L9667K1735L1600J6994q641J455o710k2529j2809
8164B5655k9938k8686K7321J2324J1861K564K931M534q628q191K4473K6350k7693
8151C4877j1221k4732m0485j943K4838J7148P844J4469J5254l0860j2329P07k779
8138i212K9112j4686k2780O874K218K1642M4037K7924J0390j9305j6500l1568
$$ y = [7000, 28755, 26956, 30033, 7284, -3988, 8546, 21413, 1751, 923, 42453, 37216, -29377, -50300, -16892, -4013, 15893, 34888, 60560, 79928, 71238, 49114, 27363, 50302, 52574, 44529, 38015, 43681, 61118, 68866, 47141, 23684, 5767, 21188, 41740, 46417, 68527, 54314, 28190, 39826, 20760, 5454, 4094, -3638, -18155, 4735, 21246, 17987, 20208, 30899, 37941, 44344, 9560, -8464, -29014, -35107, 4560, 26295, 57895, 74889, 66248, 67703, 60993, 38464, 25655, -4283, -32969, -5648, 6676, 18537, 21101, 24032, 28566, 19938, 11747, 36220, 62570, 34877, 23656, -1076, -41561, -43504, -18666, -1518, 6326, 20795, 36049, 5189, -7140, -6433, -9212, 19900, 5214, -17566, -10692, -8474, 13168, 57205, 85129, 95519, 76214, 59714, 28146]
8126B8146R20j5168k0982k0862J2440J8386K8557q866k8633J5107K6651j6893
8114A8803m7927K057L3749K4363P746k2296j5440m59J0074J8939k5956m4073k038
8101d2458J4796q792K4539N821M393K5796J527l735j6252j0278k668P890M739
8088E318r033j5030J7134n343j4612j1164m251K3038k736p711n748Q980M318J5878
8074i62K0111M132J0392J642j3070J7805j6244j8969n689J5419J8906p723J3101
8061C8851k4219J673L022j0108j4707j2491j7138J8812P558l741n283k719q735
8048b9225J8502K9088K8814J3484k024n4217l5319K7831J259J4784K9582p951
8036C4608l1648l0958k954J0101L3972K0187j969k0840r872K5304J0641j7009
$$ y = [28146, 29066, 13898, -7084, -27946, -15506, 2880, 31437, 22571, -6062, 9045, 35696, 18803, -29124, -27067, 6682, 31045, 38791, 16495, 1055, 596, 10670, 29609, 3653, -40420, -42458, -27662, -36454, -11915, -6094, -1701, 24095, 25622, 21887, 5635, -4643, -7311, 579, 5318, -3715, -18745, -1611, -6954, -21566, -32730, -36981, -13943, -16679, -24390, -30138, -21158, -16840, -962, 19149, 23281, 33673, 35315, 22245, 40050, 23806, 4837, -852, 14567, 33473, 25750, 38851, 14632, 16305, 19327, 9219, -5488, -17979, -35117, -16305, -8747, -12488, -17771, -20490, -29225, -10723, 18365, 47179, 60663, 58639, 4422, -30897, -3066, -1807, 12977, 42559, 34608, 2960, -27998, -30952, -20851, 13121, 33308, 31339, 10499, 627, 25931, 36572, 19563]
8024A9563j0535j2691P372l5353j5451J4210J3629j5166q3q389K3202J7760j7278
8011a9210j6744j674M3477K0335j5695q644k0279n476p538L0171L3453j1782r477
7998A0917J002r292N242J0506J1314j0279m104J1884q818k6091N101M747J1527
7985A3656J6395n131R643K541l501j2400P656Q603l7829k8128J7244K928p566
7972a5889P758P023J7785K3045n304j2296N96J4391R477j9276k1424L755K3072
7959C2713J553j5908l0392j5335Q215k765L6122j614j8150L471k214l593K4802
7946A6905L9444k1958k9347n963R015l631j2639j445J3553j3223m130L3510K6414
7933D6505N417r550L412N721j0367k1334j3612j7066L929K1575l392J1334j2133
$$ y = [19563, 9028, -3663, 3709, -31644, -47095, -32885, -19256, -34422, -34505, -42894, -19692, -1932, -19210, -35954, -37628, 5849, 26184, 10489, 1845, -18434, -23910, -31448, -1277, 32176, 20394, 10917, 11919, 2627, 7869, 18375, 29689, 19410, 15306, 27190, 18372, -7719, -2618, 2129, 13656, 30051, 24920, 34563, 37104, 33603, 21203, 28859, 37462, -367, -28495, -11251, -8323, -15889, -8131, -1108, 16677, 39722, 34418, 22122, 22718, 37109, 46586, 27310, 5886, 9641, 32713, 34266, 18358, -12034, -27369, -19154, -21919, 14203, 12589, -5561, -2090, -4304, -7897, 16905, 56349, 34391, 5044, -919, 8096, 4465, -8174, -9619, 3934, -9289, -13419, 20091, 46505, 51922, 42372, 45784, 51505, 41138, 19804, 6192, -10874, -6945, 14630, 11238, 22572, 10439]
7920A0439l8202j6876K2505j5709p73K0264K1875k283K2771O854N491k3154j461
7907A1741K029J1284J705j2389l308p033k5283j3763J4268K9004K3495m8053k1144
7894c7447M3416L3048k829l8175M640J7478J1889j5027o918j059J8462N501Q559
7881D1538k911l5119j4433N500l8402j3411O656P068J9708M3317K0295m0209j6040
7868a6443J8124J8398j8700J4546o158k2930j2394j0995N332j4917J0423K6335
7856i379m948M124L4311M7165n068l8464r900k416k111K773p188L790j3995l0949
7842c2255j7998M591J4067R853K622N542k0885j5472m476N503K1314L367P37L1519
7828H029L2505j7430j1795o400l413J1656M541l242k2640q466J9381J2262p162
$$ y = [10439, -27763, -44639, -22134, -37843, -38616, -18352, 3523, 1240, 24011, 30865, 36356, 13202, 11741, 13770, 25054, 26759, 14370, 11062, 4029, -21254, -35017, -20749, 8255, 31750, -16303, -37447, 5969, 39017, 36188, -1987, 2653, 20131, 32020, 16993, 10075, 9016, 27478, 32979, 41538, 38627, 3508, -10925, -5425, -43827, -57238, -50582, -43514, -23806, 19511, 39806, -403, -16443, 1681, 20079, 1379, 15925, 9767, -13163, -25557, -36552, -31220, -46137, -35714, -9379, -14327, -10203, 24108, 71273, 66205, 27741, 17841, 15425, 13314, 16087, 8899, 12689, -1306, -32255, -50253, -45662, -31595, -21742, -19120, -13578, -34463, -49935, -54411, -48908, -27594, -24227, -23490, 8029, 40534, 23104, 11309, 4909, 1496, 13152, 17693, 14451, -8189, -16655, 2726, 14988, 7826]
7815G826j4707p215L5379N723q453K963J4555k0788m0277j3344q913J3225k444
7802c6470O885p320k24L4173P914N24l1470L1538J8562L2280L9248k3093k7465
7789D5082j1193J3790m290m7046n6029L482K9765J9280J4446J2903R137k9679
7777c52k1053l558k9526J5859K208M1257M6391l376l0136k967R9n087j436P779
7763A6102j534K2094K2005k4103k6303O659J1201q499n965J4948q9J580M947j6582
7749A6461q812P736k260m11k3357J6790K0618j7638m4632J6414O331p371P399
7736a2732O15l856q027o94P997j2071J6271J1826j8746j372L986o596k5962K5297
7722b4064O1902J4398k2400k9678j3302K9276n647q580K5045J7074l231j7969
$$ y = [7826, -6881, -14096, 21283, 27006, 18553, 21516, 36071, 15283, -24994, -38338, -47251, -34026, -36470, -29585, -36905, -37129, -2956, 4958, 5482, -25988, 5550, 24112, 56392, 95640, 72547, 45082, 33889, 47679, 43389, -3657, -59686, -56204, -26439, -7159, 7287, 20190, 29327, -352, -21405, -24963, -54489, -38630, -36422, 4835, 51226, 47850, 17714, 14747, 14846, 9759, 8323, 16102, 14568, 36662, 58667, 34564, 8261, 14920, 26121, 17622, 11657, 26605, 26516, 28096, 33043, 16461, 7649, 15385, 13125, 12714, -10643, 6147, 26765, 9127, -35505, -19091, -12760, -20131, -12732, -12117, -15973, -24000, -24694, -16697, -28768, -12497, -671, -19417, -20789, -16803, -23399, -49361, -24064, 37838, 52236, 29836, 158, -13144, 16132, 10485, 1905, 26950, 44024, 40793, 22824]
7710B2824j656q971J1891k4693k3641j665K1207K7942p175q704j4600q440K8905
7697A3224k876L336j2501n638L2473j776p846J2525O763j3683l3259k0454P131
7684b2581K8820p134k5k382R668k1971j7522J7523K2721j5699j5579k37J1541
7671a2857p525j6000L001K0395Q872p218j2116K1451J8111q836l439J8045j4480
7658G404l34j1599N750j073l508J7830L5648Q941j5135l1032Q747J6681k1210
7645A7110l9123J7186K3612r373n488P484R68M067k206l0257j2128k409J4840
7632a5717L4169J8158j0899k253l4525k9218j941K6968K2167k0354o623J1399
7620h669J6682k7252l324q713m942J4688J2224K9760K759j9395Q53m914J9099
$$ y = [22824, 21168, 12197, 24088, -605, -24246, -25911, -4704, 23238, 16063, 7359, -7241, -15681, 13224, 10348, 13684, 1183, -4455, 28018, 26242, 18396, 30921, 37684, 24001, -9258, -29712, -22581, 6239, -895, -920, -3302, 6366, -15605, -33127, -15604, 7117, -8582, -24161, -24398, -12857, -20382, -36382, -33381, -12986, -4114, -11332, -23448, -1997, 16114, 7278, 3839, 21884, 7404, 7070, -4529, 1221, 148, -3360, 14470, 50118, 59059, 43924, 12892, 21639, 38320, 17110, -22013, -4827, 18785, 9412, 3924, 11408, 12376, 16443, 14237, -16020, -28148, -30557, -15717, 18452, 36610, 25711, 23458, -11067, -40285, -42226, -15258, 6909, -13445, -20068, -8669, 8013, -19239, -22563, -31276, -36218, -21530, -9306, 20454, 23213, 3818, 4671, -243, 18856]
7607A8856J7957k0967l7138M309o313P115J5359o676L6126K2443j205k2039j6362
7594A1465l6545m317K0107K8535K538n901m977j8856j8703j0147L9794K0293J2170
7581C5456J7440l7285k9776kK3690J6488k401l7524l5020j8197J4653K4508L3357
7568E387j6758k0348J400N511L2287j3256J4313L460J3348j4947q925J0384M241
7555A6097K3515o575j2777o049J1096O804O749j5450J4770J1786k7443k7925k3873
7542b9275j8951J8577J3765K1679Q116K061K7292m729j3097J503K3l2231J2974
7529G707l885Q090J2922k0021k5180N732n805P218R265J976p521L1975r979M75
7515A2969L293l342l72j8175k1510J366J0244m822L3889K1699j3236k2056k1620
$$ y = [18856, 36813, 15846, -21292, -16983, -23296, -16181, -822, -7498, 28628, 51071, 49866, 27827, 11465, -25080, -29397, -9290, 19245, 21783, 15882, 10905, -7951, -26654, -36801, 2993, 23286, 35456, 52896, 15611, -14165, -14167, 9523, 26011, 23610, -13914, -48934, -67131, -52478, -27970, 5387, -11371, -31719, -30319, -24808, 7479, -5777, 8536, 11996, 25344, 10397, 1472, 11856, 16097, 39612, 33037, 20260, 14211, 25307, 32111, 38860, 23410, 38180, 49966, 22523, -5402, -29275, -48226, -29649, -15884, 5795, 13911, 15972, 43264, 38535, 25438, 26941, 26964, -5267, 7707, 3822, 11912, 24834, 4813, -20367, -14635, -20440, -13222, -3957, -1981, -9502, 22473, 12494, 12969, 16262, 12920, 12548, -5627, -27137, -25771, -15527, -20349, 13540, 35239, 22003, -53, -21673]
7502b1673k5966n602k51L604K7430L2735K2450J143l4484q971K87p612j8632j0907
7488d6449J1572M0758Q466j5942j7277K4054K3749L4335J9513m7615l6647R160
7476G677N482m545P484J1395j4836r315j3703L3795l882k8062P047K1566M849
7463B4952n365J7313n793k4698o3161r352P146o331O652K4933L8545k5540j9124
7450c9823J7596k366j285K7156P141j9134j0426l499j2258k1833l184J3624R801
7437c8490j5267M019j089K4596K9640K8726J438J4039p927O257j98k0304j2321
7424A3119K2267J7862k9085Q144L157Q579j3517j115N99k818J34j688k3294j6979
7410a4635o002Q808P769K1754k9378p602l624K129O977L048n812k0902J6055J7066
$$ y = [-21673, -47639, -53241, -53492, -49888, -22458, 10277, 32727, 33870, -614, -9585, -9298, -16910, -35542, -46449, -34877, 5881, 14347, -1595, -18872, 5182, 28931, 63266, 82779, 35164, -1483, 7677, 13159, 8614, 16098, 27493, 12657, 3342, -10361, 23434, 19552, -8510, -1463, 20103, 24952, 19587, 36900, 31107, 6409, -56752, -66104, -58958, -65289, -58637, -33704, 4841, -20699, -39823, -22227, -24593, -25878, 1278, 8419, -10715, -21141, -24640, -36898, -58731, -61915, -48291, -38490, -53757, -49738, -50827, -26231, 3409, 32135, 33573, 47612, 39685, 45942, 45744, 25440, 13119, 35386, 53248, 24163, 32307, 35464, 44043, 30526, 29411, 30010, 27192, 27326, 25638, 2344, -14635, -20637, -11829, -4060, 17694, -11684, -19286, -22910, -20781, -13804, -10756, -16568, -37470, -21415, -4349]
7396d349m4315r953K2985j4222M051K8614m327J8875J4154o887j3464J9739j3041
7383b140k749j0237o22l534K9050j5213j4238J7291K8921L911j9862k3942K994
7370a0370K0870J2184m903l317p796K9592K0056p079j3370k7265J3821J7405p351
7357C2477o729j5134k2773r355j6136K6739K9092K2146J912m977k4164j5595j1885
7344a4382k5961K0051k3696J5964J5357K8741P850m7630m0264r382K6201J777
7332d5374R322M1386j0258o810r778l474J4859J6387J737k006j0121j1589j0010
7319b5729J515l7015l7846r47Q379K9503K4096p709j2873K8317r986K651R22n564
7305d2286J9908j4037M034M296l824P661J2294L767K3687J0998k8712L322J3213
$$ y = [-4349, -48664, -58617, -35632, -49854, -45803, -17189, -21516, -2641, 11513, 4626, -8838, 10901, -2140, -4889, -15126, -15748, -19282, 9768, -5445, -19683, -2392, 26529, 30440, 10578, -13364, -10370, 10500, 22684, 17781, 14464, 6668, 36260, 56316, 49237, 35867, 8602, 22423, 39828, 32477, 25748, 10614, -12159, -21514, -37650, -10911, 18181, 40327, 42239, 37262, 13098, -2497, -14382, -40343, -20292, -43988, -28024, -12667, 16074, 23924, -23706, -63970, -73352, -47151, -45374, -36052, 5334, -4924, -11734, -21512, -24986, -10127, 6260, 7997, 5991, -4130, -15719, -25729, -24214, -61229, -99075, -100022, -91643, -62140, -38044, -45753, -58626, -30309, -40295, -37644, -36722, -42286, -22378, -36415, -32381, -28085, -31909, -24248, -11954, -8187, 15500, 26498, -2214, 1108, 14321]
7292A4321k2059j5081r081N580Q174P740n9J7857m330K024j2247k9147k914L6195
7278c027J8127p34J5096k5831j7359l6310M6J2476O256N864L764j3607K9958K259
7264c022l3374p985K7000M1999P168l3720r138j0265J2189K9112r34m2951j9627
7251d3548O447K0105K4464J8784J1764o996M601p24o738q369j4733k464l763r600
7237a0770j0390N095M804J338J5113J5401r890p871K223J1131M574K203k0961
7224B000J4567K0334m7254k1526N870J2389P67K3615J4525r002j4134J2074k877
7211A1348m746K2697J8740j3519m936p174l2171j8406r726j4807J6250K2367K0145
7198F062l1909l2917Q218M0938J7986J9101j4221J4608P603n2067j0369O181K337
$$ y = [14321, -7738, -22819, -31900, -26320, -18146, -10406, -10465, 7392, 3062, 5086, -7161, -36308, -39222, -3027, 15100, 14366, 29462, 3631, -13728, -50038, -49992, -37516, -31260, -25396, -21632, -35239, -5281, -3022, -36396, -44381, -17381, 24618, 31786, -1934, -11072, -21337, -9148, 19964, 19030, -23921, -43548, -37101, -16996, 7468, 26252, 38016, 31020, 35621, 34897, 28159, 19790, 5057, 2593, -1170, -10770, -21160, -16065, -11261, -9923, 5190, 20591, 10701, 2830, 5053, 16184, 20758, 22961, 2000, 16567, 36901, -10353, -31879, -26009, -13620, -12853, 10762, 25287, 16285, 2151, 14225, 11348, 6602, 29299, 48039, 34520, 29584, 22410, -9761, -28167, -37893, -52700, -36450, -14083, 6062, -25847, -58764, -50546, -9608, 8378, 27479, 13258, 27866, 35469, -16598, -26967, -20786, -18449]
7185a8449J5471Q431K890l3213K5263J3416j4882J7743N336k2988p965J2826p120
7172c241j8755r092L0305k730k3267N501r755R572J3474l364n461J9393J1120
7159A3700J629r566j4538j9950L95j840j6751j284O429Q602p002j932M2906K6281
7145B7079j527L5528n525k9190r98Q737j5591p940k182R56J0633J703j4404j0148
7131b869q736P362n928J5743J065k8761K4177J5208n734k4568L074M706J9027
7118A3766P951k6928K5898k011p171n244J1204K0574J6873l2202l1780m470k2720
7105c6260j2367P242J8498L3382J8191j0473q572m3138l2767K4140J388J8046
7093b2690J1798J2413J1576r445P230K199J4489P960l0122p15j0359j6017K6005
$$ y = [-18449, -2978, 5453, 8343, -24870, 393, 13809, -1073, 16670, 22006, -982, -8947, 3879, -3241, -21996, -31088, -783, -3513, -26780, -21279, -31034, -21462, -7988, -11352, -16813, 2580, 13700, 15329, 5763, -8775, -28725, -28330, -30170, -46921, -48205, -41776, -33174, -40176, -42108, 798, 27079, 25552, 61080, 55555, 26365, 25367, 34104, 18513, 10573, 8391, 9347, 19980, 21683, 7279, -2869, -11605, -4243, -10171, 5572, 6637, -22124, 2053, 17261, 11527, -13041, -9967, -5261, 13766, 21717, -5211, 20687, 18676, 11505, 6261, 17465, 38039, 54912, 22710, -9070, -13540, -36260, -48627, -41385, -22887, 10495, 28686, 18213, 9641, -33497, -66264, -42124, -40736, -22690, -10892, 1521, 13097, 3652, 10882, 13081, 27570, 35530, 5408, 4693, -5666, -21683, 4322]
7080D322j2024k8809k0719R0J2725K1995j1262J5915K057j697j9430k181M1208
7067B190J3837k5925k2404J0647K824m246o563j75R877o039l059j0207j0377M4266
7053e354J2762j9110K0426J3309O990l7916Q600p69K861k2468j2740J6225J8754
7040A570K4754O558l8908q394P801Q751J3507J1348M936l0785j7593l6494J6230
7027c6719J070j550K269j6536J7709J4392k609j3063L4535K8761J0743j6515l1053
7014h566j7084J376J562J3191j0088j5909M200R282k225M093P461M183J7088K6262
7000C4826j072l9018k9961l917j6452m941K2497J1201K0971K8976K290P35K1944
6987D8079N100J2350k198j3963l8677j6333O278J2420L15M902m853J5707K7366
$$ y = [4322, -7702, -36511, -57230, -57140, -44415, -22420, -33682, -17767, -15710, -17407, -36837, -39018, 2190, 16027, -9898, -32302, -21655, -18831, -23077, -29640, -29815, -19938, -25977, -29036, -39243, -49620, -5354, 7408, -11702, 8724, 22033, 29023, -8893, -293, -1062, 1799, -20669, -33409, -17184, 1570, 26324, 32882, -6026, -14420, -6619, 2132, 15639, 26987, 31923, 1138, -16455, -52949, -36719, -35649, -37199, -34930, -51466, -33757, -19365, -21974, -35037, -502, 28259, 39002, 22487, -8566, -25650, -24274, -22712, -9521, -19609, -35518, -31318, -22036, -24261, -20168, -12707, -8524, 8564, 34826, 33754, -5264, -35225, -39142, -55594, -60535, -38038, -26837, -5866, 23110, 25400, 26135, 48079, 53179, 65529, 63331, 49368, 10691, -5642, 636, 13056, 13371, 18273, 13420, 29127, 56493]
6974E6493k2529k0524k827k6582r673k5128J968J6923J398p806p797J5870L0072
6961a42K7738l181j1504M471M217J7834R834k4152l0083K762n084r826k1430J9240
6947a9306J2804J2652q743k1137L1169J6799k8677q833J3860L362J4449j566m276
6934A2557m690l1337P837K6164J2182j3745k4746N233m620J3213m432j8825k6201
6921e1410o347J1663K6861o112N171R982L283r90J3561J4994J6399j7195k9992
6908a0132j0911j3850k7463p938R711J9281L3412J8460k235J7398P78k0242m694
6895A575O740K5073k0953o205J1167j3512j4032K441N977J3391o97l6886M918
6882b1003K1129J9194J9653l1621m354j9940J3512k3697k501J8039j1679K3722
$$ y = [56493, 33964, 13440, 10613, -15969, -25642, -50770, -48802, -31879, -30481, -38287, -46084, -30214, -142, 27596, 24415, 12911, 17382, 21599, 39433, 49267, 25115, -4968, -2206, -7290, -17116, -38546, -19306, -6502, 6150, -2593, -23730, 7439, 24238, -4439, -13272, 588, 3950, 18399, 16833, 12557, 7867, -23470, -15633, 10531, 22713, 8968, -15778, -10545, -15165, -1952, -6384, -25209, -51410, -57757, -46094, -19233, -25345, -20174, -10192, -6909, -7899, 5662, 20656, 37055, 19860, -10132, -21043, -34893, -62356, -70294, -60583, -41302, -7890, 10570, 8335, 25733, 26511, 6269, 1575, 8315, 33388, 12435, 6230, 17397, 3885, -10147, -7706, -1729, 11662, 10965, -25921, -21003, 126, 19320, 38973, 7352, 2998, -16942, -3430, -27127, -29628, -11589, -23268, 454]
6870D54L156l4368L601K21l1460l6409M3346K8598J1759j6081l836M497j2224
6857c8746N754M16K0263M276N381j5934m5884o376L5571J0024N851J4687K848
6844a869p472J787q632P618j3296l2363q381K9495J1299j0571L531j2729j6097
6831e7680P932r433K0169P261K3851K2143j1238L609m137l1326O481J2371P079
6818b918K9082J7245l170r202j3368M702Q786r196K2331j9258J2254l8329m9795
6805e0836L009j3677J8969M6785Q360j4720j0007J4496J3432l431p614j1503N388
6792a349J3156l938J1612O858J2749j5656l6230m1181K9110L7036k1342k8871
6780c8046n137n647J3427J5998N5466r130j2422J897K034K345j0708n1991J0936
$$ y = [454, 3610, -30758, -27157, -26936, -58396, -94805, -51459, -22861, -11102, -27183, -31019, -26522, -38746, -32992, -32576, -12313, -8037, -2656, -18590, -64474, -70850, -35279, -25255, -19404, -4717, -1869, -9341, -7554, -16186, -8568, -21864, -54227, -62608, -33113, -21814, -32385, -28854, -41583, -57680, -49748, -59181, -39012, -31751, -7900, 14243, 3005, 6614, 2477, -28849, -22368, -9997, -2918, 26164, 43409, 40239, 31037, 17669, 22371, 31157, 21961, 44292, 25034, 37288, -1041, -50836, -47827, -61504, -42535, 4250, 12610, -2110, -12117, 2379, 15811, 12380, 4766, -6737, -1349, 11807, 7869, 19481, 26339, 39088, 23432, -12798, -53979, -24869, 12167, -9175, -38046, -43183, -48830, -35403, -19405, 36061, 26931, 14509, 16406, 18440, 20785, 10077, -41914, -30978]
6767c0978L9774j0545r465L8560K934k5304j2339K2251q129J0084j3539P434p792
6754B946j2659J6891k7056O642n899R245k8045k667J5020M203k0524k7170j2639
6741h1712J9412O275K5017L8756k517k1750k2808K490L2688L9094j4919k7396
6729g370M397J4639M879j2231l3280k5488o555K3908J1421Q662j2980m3983p434
6716h1415K4487M1247K4084N180p051p30k7036k8213o534o992J8058L1007r540
6703b3448K5238k4591j3082j285Q433R261K3286k789n907l564J8781j773j4085
6690e525J1245q783l770K3212p841j3477j2948j2319k752L1734n508j7194J972
6677b1954J1396K7298J4380k060l9195j31J0862o195J7318K4747p175r743P911
$$ y = [-30978, 8796, -1749, -11214, 27346, 30280, 4976, -7363, 14888, 6759, 16843, 3304, 10738, 2946, -9713, 7178, -19878, -13236, -19135, -9890, -37935, -40602, -25582, -21379, -41903, -69073, -81712, -62300, -56025, -31008, 7748, 5231, -16519, -39327, -36837, -4149, 34945, 20026, -7370, -2973, 11666, 16545, 4314, -28966, -54454, -61009, -37101, -25680, -17018, -29998, -73981, -81415, -56928, -15681, 8403, 13583, 6532, 5802, -21234, -49447, -55981, -62973, -44915, -13908, -23448, 1790, -22801, -35883, -37168, -28735, -19474, 3812, 1023, -4884, -8448, 10333, 8560, -5525, 5720, -3063, -6833, 16379, 8538, -4939, -17887, -30206, -32958, -1224, -6732, -23926, -21954, -10558, 16740, 31120, 29060, -10135, -10266, 596, -5599, 11719, 36466, 29291, 19548, 27459]
6664B7459j727j0597O867J2898J7747j097m7032k0373k34J246j4472L3476K0649
6651B4810j7460j0542J448J1908j1673j9024j376k2063j0542M870M1440L854q829
6638a3179M993K2960r335j721j5631K072r145j6103Q613l190l492K4664J4870
6625F376R505j5707q22k641J3124J906M847l2873M444K6220K502j0386J1728J9228
6611C7451k9026l6346l044l164k1078p491J2699J9343J6322J2264p931l3454j3174
6598e6629J569L4463J0475J0617k103k807j7415n000m148m948J3825J718o276
6585b6659J0336m395k1604j133k2775k019J0147J7764K9893j050J3558m773k5824
6572b8534n360l46Q047K9871J0893L61p721J5782L624K3772j5556j2264k0139
$$ y = [27459, 25732, 15135, 22002, 34900, 52647, 51550, 4518, -15855, -16089, -14843, -29315, 4161, 24810, 7350, -3192, -1744, 10164, -1509, -20533, -21909, -43972, -54514, -49644, -8204, -4350, -13179, -8186, 14774, 5439, 3718, -11913, -9841, -18986, -35089, -26476, -29666, -33158, -8494, 6376, 15881, 174, -648, -3289, 9835, 11741, 16588, -16285, -11841, 14379, 16881, 6495, 18223, 37451, 8425, -27921, -30965, -34129, -55207, -62698, -49999, -30656, -14334, -2070, -10001, -43455, -56629, -55060, -20597, -10122, 495, -1608, -4415, -21830, -26830, -30978, -35926, -22101, -20383, -26659, -16323, -20718, -42322, -43455, -66230, -68249, -58102, -40338, -10445, -11495, 2063, -2710, -28534, -33894, -34240, -26193, 3678, 14571, 14932, 7211, 22993, 26617, 50389, 34833, 22569, 2430]
6559B430p975j2731j1168K627J378j9385l6484o620P210J8796N231L2605L0899
6546F813L7624K7633j5535m1691l833J7832j00k0233O026Q850k9913j0813L386
6533a3954l138l747R179j0717j9699J7442J1119P555J3838L370k382r01K9662
6520C7627j7945n0946o508K3609L4249k896J1767q527l6686m6052J4762Q199L980
6507c5367N010J0871o51P290J4574P156j170R272J0422n5922k7507M0787l905
6494a9140P069j4018j3981k6376j783L4238j6406J317J3997L2543P582k434K088
6481D696k0674j0057K9485r295J601N100R45K2344K1552j2537l6268p08J4126
6468A0310l9663R80k9690P677L3052O6j3134l0708j841L3117J3788R033j9019
$$ y = [2430, -5545, -18276, -29444, -26817, -25439, -44824, -81308, -87928, -80718, -61922, -56691, -24086, 6813, 44437, 72070, 56535, 14844, 11011, 28843, 28743, 8510, 14536, 23386, -6527, -17340, -13954, -17092, -20839, -11660, -22377, -42076, -24634, -13515, -5960, 7878, 11248, 8866, 7965, 37627, 19682, -31264, -37772, -14163, 20086, 17190, 28957, 20430, -16256, -62308, -47546, -39347, -35367, -30357, -19486, -20137, -12847, 1727, 8883, 7713, 16985, 27407, -28515, -56022, -15235, -19140, -12071, -26089, -40070, -66446, -68229, -33991, -50397, -49080, -35083, -2540, 5042, 2608, 4696, -15978, -26035, 3450, -5845, -4244, 856, 1801, 24145, 45697, 33160, -3108, -3816, 10310, -29353, -28373, -58063, -50386, -17334, -17268, -30402, -61110, -62951, -29834, -16046, -7013, -26032]
6455b6032l806O30J1402M6026R957l5288m1438j9719J2794K5372j770l19K8557
6442F366m878j097j1889L811m581R505P077J5562K4935l997J0109k9632k2541
6429a250k2039K373j3086J2332l485L680J9948R963k3877M661n881l466q810k7686
6415e6623k1291m984K9098K0154P990J3700o319K1744R49K0810J0028k850j0138
6402B2268j3113j0925Q24J5623j9148j841k3441O451J3393N126K4313q988L685
6389A4227J0838o626K305J5006j8710k124P859o395Q454J1499j5387k5491m831
6376i376N359Q011l1605k8043P824J2891o651q509K3524K0091R588K9569m679
6363B7994l8114k7321J2201L7599j5815P583j0830N900K8196J8327j1916k0832
$$ y = [-26032, -29838, -29208, -17806, 28220, 38177, 2889, -38549, -58268, -45474, -20102, -21872, -22191, 6366, 1488, 391, -11498, -7687, -12268, -2763, 4314, 19876, 44811, 40814, 50923, 21291, -1250, -23289, -20916, -34002, -21670, -25155, -21475, -1527, 8436, -15441, -10780, -16661, -20127, -28937, -56623, -77914, -82898, -53800, -33646, -25656, -11956, -18275, 3469, 4418, 25228, 35256, 32406, 22268, 9155, -1770, -946, 14677, -4471, -6312, -29753, -23302, -9909, -4783, 19530, 10542, 14227, 25065, 18439, 20744, 35750, 17040, 14916, 22775, 16380, 24834, 36333, 20946, -4545, -9376, -4017, 3994, -27611, -55654, -47830, -34939, -41590, -50099, -26575, -6484, 3104, 32673, 27994, -10120, -37441, -25240, 12359, -3456, 4127, -6703, -803, 27393, 45720, 33804, 12972]
6351A2972J4566p355m2959p678N3932j735j5667j0920j3717j7961J1010L2776
6339G264N423J7002j7174k7793L990o131o176J8381N0k4083J5408L802Q848R304
6325H115j9856j9510J3863Q527J6787r275L955J3504l3240r612L9936K6984k4229
6312A5949o171j582l12J0929J9806O468p178P316R501L959K7751l0152k1475J3304
6298D8113K8538m011l7035l3122J4424K4879J3714j7703j4241j1265j2641j218
6286a568o302k1608J264Q16p11k2424M232M3124k293J1418J3012r428P521l3566
6272a6513l0471J8395K5511K9846J7022j2974o4768k3136L288K8670k220N893
6260b1457j0607o911M966O27j038j5116P847L4078L329J7398j6213j710k0429
$$ y = [12972, 27538, 20183, -22776, -30454, 23478, 21743, 6076, -4844, -18561, -36522, -25512, 7264, 12687, 29689, 12515, -15278, -11288, -17419, -23595, -5214, -5164, -29247, -13839, -10037, -1189, 8115, -11741, -31251, -17388, -8861, 7926, -1349, 2606, 16110, -17130, -26742, 13194, 40178, 15949, 9778, 8196, 7884, 18813, 38619, 45087, 37909, 45225, 54726, 58685, 86436, 56284, 34809, 48113, 76651, 72640, 35605, 2483, 16907, 41786, 55500, 37797, 23556, 12291, -350, -1568, -7870, -29478, -28214, -27398, -28109, -50533, -46301, -3177, -5470, 5948, 18960, 9532, 17053, -16513, -46984, -28589, -3078, 26768, 43790, 30816, -33952, -57088, -53800, -25130, -27350, -21457, -32064, -38975, -34009, -33382, -34420, -49536, -41689, -7611, -4282, 13116, -3097, -4807, -25236]
6247b5236j835p874K7177J4604J0245J7105R146j0115L194k569J5489q543j9483
6234B1305k1821n260K1156K304J1875L7798J9926k4072j2614q719m1168j6112
6222a5402K2790O675j1078k4465k1546M699L4998j998k6341J7963K7097j1819
6210A573J2843J6976n731q184R788M197k853n087k5128q827Q721M128r226K70
6196f540j2316J2579Q86J3762K2200j7270k4139N192j3240j4726k3997J4626K8053
6183a4930q698p674j5511j9779j6058L6785J9961k4224r219O595L3302K3775r276
6170d951K0269L584J9885M166j4557j9561j6299J4854J5296L957N194p550K3683
6157D7970j6962k1406k504k3294m012m317N342J3712J2700Q491m741N458J7846
$$ y = [-25236, -27071, -34945, -7768, 6836, 17081, 34186, 43332, 33217, 36411, 33842, 49331, 40788, 21305, -516, -5776, 15380, 17684, 29559, 67357, 87283, 63211, 50597, 41878, 710, -15402, 7388, 14063, 2985, -21480, -43026, -38327, -3329, -5327, -31668, -13705, 13392, 1573, 14416, 31392, 25661, 17477, 27265, 31462, 28609, 23522, -1606, -10433, -1712, 2416, -6810, -6540, -18856, -6277, -5391, 8371, 30571, 13301, -10838, -5646, -18886, -33612, -57609, -42983, -14930, -23628, -31302, -46813, -66592, -82650, -45865, -25904, -50128, -59347, -52752, -19450, 4325, -4951, 15318, 18902, 38787, 42953, 28396, 8835, -7464, 7390, 22686, 26643, 31837, 24287, 47970, 31008, 9602, 7098, -16196, -20208, -24525, -19183, -5471, 7229, 15720, 10979, 16437, 34283]
6144C4283J2320P282J576k6663j7393p452J6729n140j6964J0544o110k2549o506
6131b6043p132k0904j2403L0409K528J5911K1724J296o023J5204J2988j5280k9699
6118a7424k9573J3920p469R30L741J2024m206j4996j5653j0312J3586M1252j3676
6105b7856l0081j2420k4178K7938L5905r88j1359p211L1772N324o75M400q50q296
6091a8575m260k0283J8975K3713j5179j4665J751J3934J6660J9428r931j5564
6079c996K5927M140J173p124l184Q02J1362R020m601k4076k8796j9075K9425P172
6065a831J8466p575j0291Q136n546o791J5691m198Q477o181k8081J2953K0188
6052A3417j6461j1869kK955J18k467p43J8898J2513P497p725q800J8515l091m92
$$ y = [34283, 46603, 53885, 55461, 28798, 11405, 3953, 20682, 15542, -1422, 9122, 3012, -19537, -26043, -33175, -54079, -66482, -36073, -33545, -17634, 4090, 5386, -637, 14567, 27555, 12275, -17424, -46997, -33077, -40546, -39616, -35875, -23851, -28057, -43053, -58706, -69018, -55432, -14180, -27856, -57937, -70357, -94535, -66597, -30692, -31680, -43039, -50250, -18478, -13154, -13829, -9429, -10279, -18575, -22835, -43118, -24143, -430, -15609, -30274, -28523, -14589, 2071, 21499, 11568, -3996, 21931, 26071, 27244, 20120, 16936, 17738, 29100, 38120, 33519, 9443, -19353, -38428, -9003, -1831, 16635, 9060, -1231, 6905, 1359, -5432, 10259, 6061, 14538, 8357, -19724, -6771, 13417, -3044, -14913, -14915, -11960, -11842, -14309, -15052, 3846, 16359, 23856, 16131, 7331, 25846, 22755, 22263]
6037B2263j3900m507j2277j4960k772J778L485R557K9738l305k9512r864J8859
6024e417K1990L4327k7507l5554J3164L9474k7019l5366k582J6377M475O604R915
6011A2881p325K5920J7718J4068m806j5085k7117m293J5562q316k1528R602L6853
5998D4134p968k5242k3065j8072j7894j8288j777J7960N666p587K2896k561m889
5985c6687R993L8519m424K9930m067l001l1608l7320m096M1761K7533K0838m3125
5972D246j5233J4685J9759J3262k1401M534k2050p560K3703M074p750K356l086
5959I539k6532K8610j4834k4842J8977M712K410p919l7449j3714K1352j108K4263
5946a6535L7816Q973N046j0715l1088m557R875n733J0479j4374j555K8745k803
$$ y = [22263, 8363, 3856, -8421, -23381, -26153, -24375, -20890, -11333, 18405, 15100, -14412, -24276, -5417, 16573, 50900, 23393, -12161, 1003, 40477, 13458, -21908, -24490, -8113, -3638, 2966, 12881, 5556, 31476, 49194, 63262, 58456, 43371, 16254, 11961, 27523, 19207, -2321, 7281, 44134, 36166, 10924, -12141, -30213, -48107, -66395, -68172, -50212, -44546, -52133, -29237, -31798, -36687, -26694, 11825, 7401, 37331, 33264, 30263, -1345, -38665, -42761, -1000, 26533, 47371, 4246, -10987, 3698, 23457, 36719, 15318, 19852, -2198, -9758, 13945, 18019, 10269, 12625, 9539, -16993, 11617, -3217, -28059, -9082, -4370, -1960, -9879, -47328, -61042, -39690, -40798, -16535, 21281, 30254, 35300, 24585, -6503, -11060, -1185, -6918, 3561, -10813, -12368, 16377, 13574]
5933A3574o148K970j6039k054K2137J0247L4669j4774k1442L462k6005n8653K1669
5920c6387J5259J7673J6844Q288N277M025q895j2045L17J1469j4519l1747k6544
5907e0985j4518K2606K3014K6599K0777l6309n3339j4272K5256N3166m370l0169
5895c2544j5937K5824O611L3841J42M605j625l4299j265J8607o311M882L048j5123
5881i544r608K3248J0928j2667k1676J4342k4991J2819J3824r350j4928k2807
5869e0410j0558L6878n844k2791k1390J2005J5728K1728M554r60m627j6047J2984
5856b8750J3015k907K5271p420k9377J2355J5468K815p368r45n6643k3001K1361
5843f6126J9319P327l6267k1704K0440J5893N202K7976K0043J841j4614l5129
$$ y = [13574, 7426, 10396, -5643, -7697, 14440, 24687, 59356, 44582, 23140, 26602, 597, -58056, -36387, -21128, -3455, 13389, 21677, 26954, 30979, 22084, 10039, 10356, 21825, 7306, -24441, -50985, -65503, -42897, -19883, 6716, 27493, -8816, -62155, -76427, -51171, 1995, -2375, -32544, -48481, -22657, -16046, 17795, 17937, 22542, 20917, -13382, -14647, 3960, -2351, 2531, 5579, -9544, -19152, 4096, 15024, 2357, -19319, -4977, -29968, -17149, -3325, -12675, -27603, -50410, -60968, -24090, -29934, -52725, -74115, -62110, -46382, -24654, -20100, -21060, -25687, -41734, -28750, -15735, -18642, 6629, -791, -30168, -17813, -2345, 470, -6898, -7843, -64486, -87487, -66126, -46807, -39480, -75747, -97451, -77011, -61118, -55916, -27940, -7897, -6056, -20670, -55799]
5831e5799Q331k703Q590O627R156j6635P28J9696M8795j6571n164J6205k899l8800
5817b0443j7753J9896r3k6231j2395K0324K5830O493j5373j7824R634N7539m559
5804B5045n0930m761J7142j4648R786K3660p88Q471j252j4986j7398J8006j0L444
5790G81Q840j1425k0397J9124M488j0042l199m336J3015j405j4936j4541N026
5777b9007k5008O472K9671N2045L3486m5195j6559J3778l3084j7109j813K5231
5765g092J1736O658r84p226l422l4097j6254L4573K0449K2348R306J9286J803
5752E7084l6616l7076N33J8520o091j4589K4318m001j2348R997J0766k2618l3084
5739d5205Q947L467k4885j0003J9453J5123J0134l0114J4183M2810K8962P726
$$ y = [-55799, -47468, -50171, -41581, -34954, -25798, -42433, -41705, -22009, 26786, 10215, 5051, 21256, 18357, -20443, -38196, -18300, -18393, -44624, -57019, -36695, -10865, -4372, -19745, -37569, -27935, 29604, 25045, -25885, -30646, -13504, -28152, -18366, 5294, 4506, 12977, 11725, -3261, -20659, -2653, -2663, 781, 9621, -1804, -22201, -3077, 1411, -8631, -11830, -16166, -3151, -4556, -19492, -34033, -29007, -54015, -47543, -17872, 34173, 67659, 22464, 5905, 19683, -13401, -30510, -32323, -7092, 4644, 11302, 10318, 3092, -330, -34427, -50681, -16108, 4341, 26689, 35995, 55281, 57084, 20468, -16608, -16075, 2445, -3646, -18235, 6083, 2082, -10266, -269, 10497, -12121, -45205, -36258, -32791, -57676, -67679, -48226, -33103, -22969, -53083, -38900, 3910, 32872, 40598]
5727D0598R009l685j2843p421k7415J4434K3108k2504r060k0305k0944q918q717
5714e4663K7267j0K757M174K3j6397J7318L7901m94l638k3497j1413k3740k2429
5700f6841J2123K962N6598N279l1444j1619Q729k673P158K0205j8934p674l8696
5687f4827k9425J8437K0638Q408j4275l7K190j1102n578M99N5589K2432l229l805
5673d085j0433j3881l1017l974L064J6149J8871P399L015K542j2803J4515J4845
5660D207R280q600j6981L709J0721K7198r549j9993n360K6241r194l66j3946m196
5646f829l1299j8859l3986J2555L2063J2821j1301K3910J6560k245k088j5618
5634b4316r780R634O842L170K1823J6748r91k1047J9496J0744l7198J3475k2418
$$ y = [40598, 49607, 45922, 33079, 25658, -1757, 12677, 35785, 13281, 4221, -16084, -37028, -45946, -54663, -27396, -27406, -24649, -20475, -20452, -36849, -19531, 18370, 17876, 14238, -9259, -20672, -44412, -66841, -54718, -51756, 4842, 10121, -21323, -32942, -24213, -26886, -19728, 477, -18457, -26131, -64827, -94252, -75815, -55177, -46769, -61044, -61081, -58891, -69993, -75571, -75072, -19483, 2949, -280, -4085, -14518, -28399, -59416, -63390, -60326, -44177, -25306, -17907, -14892, -12350, -25153, -10638, 4207, 13487, 4887, -12094, -8385, 2336, 29534, 19985, -8, -5368, 20873, 11679, 11313, -2633, -6829, -38128, -56987, -90973, -78418, -46355, -33534, -44835, -20925, -4365, -6610, -8698, -24316, -34096, -24462, -17620, -14450, 7373, 24121, 23130, 2083, 21579, 32323, -4875, 8600, -13818]
5621a3818l035M795k240K5813J2662m2709J4740K8369K8382q853k7249k4532J487
5608f188M0994n334l4178k1187k0562R612J3579o048j5838m450K9268O006m721
5595a9047j0981k7567O645L0910Q606j2233m50j6331j1748J0119j8640M880L9991
5582a5846Q570j0802k9380K9667J3378k3556J1855J2167j4929O188K288K091j8724
5569b7033j2511n459J9411j2517K4358O3673k2251l3243l5193J1535k358k1331
5557e2919N755J7820M5031L059o607m452q791J3645j5115n2800j1667L920k672
5544f5793J5781R228p055L0697L039k8462N534j5156K1066M1201k7945j0300K2995
5531e170l209J4695J3032o079Q404l213k5805o303J3939K26l5821q969L2120L666
$$ y = [-13818, -16853, -12058, -14298, 11515, 24177, -18532, -3792, 24577, 52959, 44106, 16857, -7675, -6188, 34806, 29472, -4706, -25893, -46455, -36843, -23264, -29312, -45150, -49600, -20332, -14326, -19047, -30028, -57595, -50950, -20040, -11434, -23667, -24117, -40448, -52196, -42077, -60717, -55837, -15846, -7276, -18078, -47458, -17791, -4413, -27969, -16114, -3947, -18876, -12688, -10400, -8309, -27033, -39544, -45003, -25592, -38109, -13751, 49922, 27671, -5572, -40765, -29230, -31588, -52919, -47164, -29344, 15687, 18746, 12139, 7687, -1104, 12541, -2574, -55374, -67041, -63121, -65793, -50012, -40784, -47839, -17142, -14103, -42565, -37031, -52187, -31121, 10080, -17865, -28165, -5170, -8379, 6316, 19348, 13269, 21673, 18460, -7345, -13648, 291, 517, -35304, -44273, -12153, -8487]
5517h487Q708p157K8898K7000o780k1955j7036j5395K491L148m3585r915J2032
5504d8033L200J2798J5765J3940Q316J4665K9622m0303l6538j4730k808j842J2554
5491c3394K4362k3839j6130J3784M248l0919J7577K1648K4245j055j2624j2274
5479b4371Q004K6506J9935o146k1928r927J0892R528k6045m082J1919K4237j7570
5466I52K9561j3480j8928p982J5379J5568n063N33K9982l702l0935l5091l703
5453b6909J4021j208r606J0583J5794J6452n747k5142l0931k5706J0677L7569
5441b0153L6906J6175l3704m5616K004K9243j6714j9893M7808N982M0721K6226
5429F8985l6599k304m9181R35q750Q219Q844j3918k0879k4692J8248J5095R600
$$ y = [-8487, 221, -6936, 21962, 48962, 42182, 20227, 3191, -12204, -9713, -6565, -50150, -60065, -48033, -44833, -32035, -16270, -2330, 5986, 20651, 50273, 9970, -26568, -41298, -44106, -45948, -33394, -9032, -32871, -49001, -35217, -30969, -61888, -44311, -22663, 1582, 527, -12097, -24371, -16367, 10139, 30074, 23928, 2000, -7927, 2965, 12493, -13552, -17634, -5715, 18522, 952, 30513, 17033, -1895, -9877, 5502, 21070, 16007, 16540, 46522, 42820, 11885, -23206, -26909, -12888, -14096, -23702, -13119, 2675, 19127, 13380, -11762, -42693, -68399, -57722, -20153, 16753, 32928, -776, -46392, -44388, -15145, -31859, -51752, -3944, 2038, 42759, 68985, 32386, 30082, -19099, -18164, -26914, -18695, -9851, -23769, -44648, -69340, -51092, -35997, -26397]
5416b6397J1848L5639L5714n825k3705j4662K1066J4941l4848o411J9492k2882
5404C970l9640j9788L6388J5491j8639j930J7454M782k3870k3388J2898L6985
5392G13J4307k1466j7589K2646O743l158j8174n632j347o283j9751J4256P892
5379b6843k4888q342l781l611N2473J499K0494J5048O192q788J316J1510k208
5366C0071j0843q662K0473o995j7684p894k691J8888K3636j8688q169j1564J342
5353A220J4151J3683n828J3054j4923k74j9068k5381l2302L1879K5574q086l8503
5340d4804J8065M5594K9348k6210j4553j9239N210J4582n933k6673K6776M596
5328F759m791K2083j1227k89K460j0708p416N347R549n53j7307N580J0473k2872
$$ y = [-26397, -14549, 21090, 56804, 50979, 27274, 12612, 33678, 48619, 13771, 7360, 26852, 3970, -35670, -55458, -19070, -3579, -22218, -24148, -6694, -1912, -25782, -49170, -36272, 713, 15020, -6446, -24035, -1389, 5354, 2196, -15978, -21610, -22957, -29240, -48991, -34735, -26843, -51731, -60073, -63854, -67465, -14992, -13493, 7001, 22049, 28241, 19453, 20769, 32279, 30071, 19228, 10566, 31039, 24044, 6360, -1534, -4225, 14663, 38299, 19611, 11442, -122, 1220, 15371, 29054, 23226, 36280, 21357, 21083, 2015, -23366, -55668, -23789, 1785, -6301, -44804, -26739, 18855, 48203, 21993, 7440, -11799, -6589, 7993, 2060, -24613, 2163, 6759, 1968, 24051, 12824, 12535, 14995, 4287, -3129, 2218, 11767, 11214, -6093, -513, 9960, -12912]
5314a2912j864R106K041j8911n310k197M546L786Q132J6912N943n99m300j5826
5300a1453Q160j4358k1160J35J261K8000M81j793K3641k42J2019j0982m8480l6869
5286g1640l3284N144M5984K7642n243r906N330m910k9501L517K5976K2339j3846
5273c2398j4703o171p490J5366m112N874L8202j6162j2632j14j3752N980l6104
5260g8216L908L2666J2985O645p410j622j0275M1548M207P367j444r490J7360
5247A8229K0115q526P126K8587J2160l75m0323j9924p294k0003J071N244O236
5234B323Q734K8530j1015p684j4247r634r144k0702K2307l53R323M204K5312j6093
5220A1861j1653q328J3198r69k8009j148K846p668J658m587O097J3286j2230J1679
$$ y = [-12912, -14776, -5670, -3629, -22540, -27850, -30047, -25501, -21715, -13583, 3329, 9272, 8673, 4373, -11453, -3293, -17651, -38811, -38676, -37415, -9415, -8934, -10727, 12914, 12672, 24691, 13709, -34771, -71640, -104924, -99780, -53796, -26154, -31397, -41303, -35973, -40883, -70384, -66867, -40891, -18552, -32398, -47101, -53272, -60762, -45396, -49508, -43634, -5432, -21594, -34226, -34340, -48092, -42112, -78216, -74308, -41642, -28657, -22012, -29422, -31044, -41319, 229, 4436, 11803, 10359, 869, 18229, 38344, 29818, 36944, 65531, 77691, 77316, 36993, 17069, 9775, -10228, -9157, -3913, 2323, 11057, 39587, 28572, 20888, 6641, -2993, -12137, -32839, -10532, -10885, -1562, 2642, 27954, 11861, 208, -8120, 5078, 4109, -23900, -25048, -22202, -29870, -28212, -32799, -26702, -13416, -25646, -13967]
5206a3967l2354j5635L3599J4620j0156J603K5775J4119o065m134q517K2893J2806
5193C4587j9395j1202r790l039O543q456n14J5562O563O255j733l8909K694K7949
5179G115M839J5209j2900j2022J56j0518k6615J1799Q962j8600m109j995p219
5166d5898J4819m657J0359Q639J0672k3462N77K3070L3185j7107m3567L136L5549
5153E315k514n108N005q321m5583k4729l418K2180L6829J6968l409l5634k671
5140d5090J6343q631k4355J347J8604K9514P823N244p031J6915j4220q82J1694
5127G275j0242j5889j9911L289K0280Q841L46k1740n070J560J9831M0354O494
5114C5418K4458q253m7687l9169m1311J0560L5265L6470O308k0687p042k305K6213
$$ y = [-13967, -46321, -61956, -28357, -13737, -23893, -22290, 3485, 17604, 11539, 7405, -1112, 21781, 34587, 15192, 3990, -5800, -8839, -2296, -10752, -11266, 4296, 10859, 17114, 15381, -23528, -20834, 7115, 11954, 27163, 14263, 2241, 2397, -8121, -34736, -22937, -13975, -32575, -36684, -38679, -45898, -31079, -35736, -25377, -16738, -6066, -29528, -28951, -5881, 27304, 10197, -33370, -30234, 5315, 2801, -2307, 2698, -5623, -51206, -75935, -79353, -57173, -20344, -3376, -6785, -42419, -45090, -28747, -37378, -61733, -60386, -41782, -12268, -4445, 799, -6232, 10683, -3537, -4419, 7275, -2967, -18856, -38767, -35478, -15198, -6357, -6011, -27751, -32821, -31261, -11430, 28924, 35418, 59876, 51623, 3936, -35233, -76544, -65984, -30719, 5751, 12059, -8628, -15670, -17975, 8238]
5101H238r172k1790k769J3565J7846J702l2269K345J0269K2056k2236J989m98
5088a0724k2368l945K3928K1500J5981J2714l1837j7014k639k370j8593K506j0832
5075d3693J0465L750r794J3487J1112J5708q389r424P576J3929M707K421K2866
5062C4721J607k8575m5607K448J5741K2918j7300k6392R576n01Q707J4309J2332
5049C984j516Q927J5574N0417k3599o5249k4252j8807K603Q381J0692J9411j2171
5036b5605O470r01m285K299j0343N043K6153N797l736J3380L2280M416P92l322
5022D8438l7331k0504L081J4736J2153l627J2921j4801j9607R097n648k0980j9110
5009d1182L545m972j4124n351N12j6063K6825K7133L0789O664q093J214j1340
$$ y = [8238, -934, -22724, -25493, -11928, 5918, 7620, -24649, -22304, -12035, 10021, -12215, -10226, -10724, -33092, -37037, -13109, 8391, 24372, 37086, 5249, -11765, -14404, -16774, -35367, -32861, -43693, -33228, -29478, -39272, -25785, -14673, 1035, -7354, -16778, -9202, 4727, 9434, 11855, 34721, 36328, 7753, -37854, -35406, -19665, 3253, -14047, -40439, -30863, -31364, -22657, -8348, 3984, 2468, 11395, 26969, 77386, 53787, -11462, -35714, -54521, -51918, -43537, -32845, -13434, -25605, -19135, -20036, -24321, -22022, -32365, -27322, -1169, 4628, 892, 14272, 46552, 50968, 51760, 48438, 11107, -9397, -6316, 8420, 20573, 16946, 29867, 15066, -4541, 4556, -1092, -22072, -41182, -37637, -42609, -56733, -62084, -61572, -77635, -50810, -23677, 7112, 13776, 5683, 6897, -4443]
4996d443L17K448O353m696J5805L629n50k3539k0669j123M347r614l328K7515
4982g548K8913q503j6166j7481J627K2951L5699k0721j1728m436R684J633k0614
4969f690k9444Q160K1183N960k918l3884j0037J2945J734M526N593L7176R987
4956B4291k413j8386k0295n831J4945L513k4193j9600k7099J8224R47K8880J1989
4943a5028j6422o592K6530n586J6708J5350k3640J0183j5699k5046O534j7514
4931e0222Q501n021M867m469L4158K174k3937j3577r688N094k163r285O602K0320
4917c6646K0140k5276j1326k692M829k097M670L2202K819m425k03L9268q67l853
4903A6543o933j4431l591j3042j5697K6992K8716o747k7593j0023j1837j7345
$$ y = [-4443, -4126, -1678, 4675, -21, 15784, 19413, 18863, -4676, -25345, -26468, -22121, -31735, -35063, -7548, 21365, 12862, -3304, -20785, -19158, 3793, 39492, 18771, 7043, 2607, 12291, 13924, -6690, -36134, -27974, -6791, -831, -3749, -37633, -47670, -34725, -32991, -28465, -22872, 14304, 24291, 21878, 3492, -16803, -22634, -7689, -4176, -28369, -47969, -75068, -56844, -55897, -27017, -15028, -31450, -38042, -11512, -17098, -390, 14960, -8680, 1503, -14196, -39242, -32708, -50222, -41721, -46742, -41875, -46344, -12186, -10012, -33949, -47526, -57214, -52120, -54283, -63568, -56966, -36646, -16506, -41782, -53108, -55800, -50971, -53068, -48398, -16196, -13377, -17802, -18005, 21263, 20396, 16543, 9610, -4821, -8412, -21454, -37151, -10159, 18557, 11810, -15783, -25806, -37643, -54988]
4891e4988j934J5657j6510J7864J7042p032J221J2002l4575J2534M3611Q958M355
4878A8205q188j1476j0161l85n886o801J7027k622J367J6506j6179K055J3948
4865G410J2763J0330J638K8996j8766l8952p157j4090L618o54k0579K5777R685
4852A9N692K6728j760j9440L5888m895m7076j669J1187j443K2166j8951j3189
4839f743j4280k7310M122K9870J7222r684J796J5908l2856j1986O101L720q39
4826b4959Q127r745J5428K3186m420o984l42Q788j9085j6346R950J3077l839p847
4812a5011M690O037R634r757j6748q170k0937p740J6445J4374M16J0102K967K1609
4798G911j2273O88J4379J2479m7125l6463j7485Q268J3021J5853K8026K8119k21
$$ y = [-54988, -56922, -41265, -57775, -39911, -22869, -29901, -28680, -16678, -51253, -38719, 4892, 13850, 18205, 10017, -1459, -11620, -12005, -17891, -24692, -7665, -10287, -8920, 7586, -8593, -6538, 7410, 20173, 30503, 32141, 61137, 42371, 3419, -3738, -17828, -14210, -14864, -35443, -9666, 19, 5711, 32439, 30679, 11239, 47127, 42232, -4844, -6513, 4674, 3231, 25397, 6446, -6743, -21023, -48333, -44211, -14341, 2881, -6803, -5007, 10901, -21955, -33941, -27840, -24120, -24959, -16832, -26577, -11149, 12037, 7617, 633, 291, 9079, -10006, -26352, -16402, -3325, -7164, -15011, -10321, -4284, 5350, -4407, -21155, -29325, -50262, -58002, -41557, -27183, -26767, -16665, -13698, 7911, -4362, -3674, 10705, 23184, -23941, -60404, -77889, -69621, -56600, -40747, -12721, 15398, 15177]
4785A5177p131k5748O379l5741j8748K1428J0992K0505N482k186n0432j4751L5675
4772c9099N606J0570L1427J5488l952j1055k5243j0085j7131R208K7635K5860
4760A9229R591k826l2334K675K056Q95j0856q880L967j9660o433o811j1040p29
4746f1156O478J5275J8734L5929r579j7682L6463L5130n444k9786l259j4104p379
4733c80k3861j3034Q273Q06q893n304J9472M8362k6304m7602k0714K529K946K179
4719f1525k565M3503N4056J7163J7427Q46k1562j5810j9639j5174j9564N040l776
4706b1580j163l0669l540K1387p096l727K3263J7339J9760j4870k7527J643j0732
4693c7512O56L2807N574j2770q813j6619j5767P878J6760L3362J2217j9468j4592
$$ y = [15177, 8046, -17702, -11323, -47064, -65812, -44384, -33392, -12887, -7405, -9591, -60023, -74774, -39099, -33493, -22923, 8504, 23992, 20040, 8985, -16258, -26343, -43474, -34266, -6631, 19229, 28820, 25994, -6340, -3665, -1609, -714, -11570, -20450, -16483, -36143, -42576, -49387, -60427, -61156, -54678, -39403, -20669, 15260, 5681, -12001, 24462, 59592, 54148, 24362, 21103, 6999, -380, -24241, -37275, -29002, -28196, -37089, -42393, -22921, 25441, -863, -48465, -69179, -66650, -63704, -61525, -64090, -20587, 33469, 50632, 68059, 68905, 47343, 31533, 11894, -3280, -22844, -17804, -21580, -22743, -53412, -56952, -35565, -42661, -46388, -23125, -5786, 13974, -896, -28423, -26780, -37512, -36856, -4049, 1525, -11245, -20058, -36677, -52444, -44566, -27806, 5556, 17773, -1695, -16287]
4680a6287r8J6620P400j4473N565m533J533j4420j5395n671R144N107o390O91
4666c1207M3174L6079o709j1877k1616k3207j5310K2891K0549m3646k4282J7695
4654c7466k0942l663L6778J0415j9921l8535J3627k0399J3338R485P460J9107
4642c0716J6348K5581J9575o198r63k2485q293j55j8611P49J7998k2057j0340
4629c9567J4084j1411O59j2225R893j1161o295N417o449K7759K4824J8815L600
4616A7943R58J0151j0685k4407J5947M8688k3652j2777j1338k3900n230J6818
4604a484L226k9738k2034J0994J7919j8133k3955k910J0623L967k2003o613K8750
4591e1391L3751l1143L0155J822J3283m588J0405J6282L168k1834k4406O979K9826
$$ y = [-16287, -16385, 235, 7635, -6838, -1273, -5806, -4273, -18693, -34088, -39759, -30615, -25508, -31898, -31207, 11967, 48046, 41337, 29460, 7844, -15363, -30673, -7782, 12767, -30879, -55161, -37466, -58408, -62071, -25293, -14878, -34799, -73334, -59707, -80106, -66768, -57283, -49823, -30716, -14368, 11213, 30788, 24590, 23627, 1142, -7151, -7306, -25917, -25168, -7170, -29227, -39567, -25483, -36894, -36235, -48460, -38567, -49728, -56023, -50606, -57055, -29296, -4472, 14343, 17943, 18901, 29052, 18367, -6040, 9907, 58595, 34943, 22166, 10828, -13072, -18302, -1484, 1742, -27996, -50030, -39036, -21117, -39250, -63205, -66115, -55492, -51525, -73528, -80141, -51391, -17640, -48783, -18628, -16806, -3523, -8111, 2294, 18576, 21744, -90, -24496, -17517, 12309]
4578A2309j2533j3478k6127J7610k419q209r248J7463L700N560k3665j1848K4
4565e0861J783p897L381m999J2885L3247K3888j0817p432j0452j8251R040j986
4552b8471J3269N144J9244J4720J446j8416k1715j0464k3001J1918L7249J6594
4540A7517R806k1140j0494m1562j4935K35L881K4374K5445J285j9002r119M548
4527b9161L8788R843l9646r90J1650L1004m764k0865o578L3929j2750k9872k878
4514b2290j5614j5380k028R543K1165N678k2978J4272L1443K1199j2629k4276
4502a1895j5125J0218K3379j668j4398l5615j814q18j5955K4063L6963J8284l6969
4489b1350j5135L4908k625L837l245k5566r036M267J0857M382J5072J44k8089
$$ y = [12309, -224, -13702, -39829, -22219, -24638, -32847, -42095, -24632, -20932, -15372, -39037, -50885, -50861, -49078, -56975, -53594, -58593, -45708, -12461, 11427, 610, -6822, -17274, -35525, -26485, -28471, -15202, -10058, 9186, 23906, 25352, 6936, -14779, -25243, -48244, -36326, 923, 17517, 27323, 6183, -4311, -45873, -60808, -60573, -56692, -32318, -6873, -5588, -24590, -33709, -29161, 9627, 19470, -20176, -21166, -9516, 21488, 16724, -4141, -10719, 23210, 10460, -19412, -22290, -37904, -53284, -55312, -45769, -24604, -18926, -41904, -27632, 3811, 25010, 12381, -11895, -27020, -16802, 6577, 4909, -9489, -45104, -46918, -47736, -63691, -39628, -2665, 15619, -21350, -36485, -1577, -4202, -365, -3610, -29176, -38212, -33945, -23088, -18706, -3634, -3490, -31579]
4476c1579P299L8080J0012j7742j6355k4416n092j7917K812J4218K5697L5998
4464B1015K1472m963l7005l731Q476J3964r07n047j8039R275K930l963j8615l0131
4450d5269j4339L89J018K6706K6266J4299J0331J6351j9289n3519l0654L4339
4438c3371K2602P676m821K9077K5849k3289j9016q793R40k3912j6753K3860K8579
4425H628o464r211n064M1Q196J9350O962k0315k508r201j679M9441L355k8909
4411A2622n668k8315k6306K5762J4867j4036K3558M486K1732J6266k0661l6721
4399a2414p216M913k0333K47R23L3746o715m0329r573J2072K9738K6184p647j261
4385B335j0440j0647j1248j921K0406J0065J5592m2540Q93K4039k0702j2979K1698
$$ y = [-31579, -24280, 13800, 23812, 6070, -10285, -34701, -39793, -57710, -54898, -40680, -14983, 21015, 42487, 37524, 519, -3212, 5264, 19228, 18321, 13274, -4765, 4510, 7440, 3477, -15138, -45269, -59608, -59219, -58201, -31495, -5229, 9070, 19401, 35752, 16463, -37056, -67710, -33371, -10769, -3093, -7914, 21163, 47012, 23723, 4707, -4086, -3146, -27058, -43811, -19951, 8628, 2164, -7047, -12111, -12070, -3874, 15476, 22438, 2123, -385, -9586, -11265, 38176, 41531, 12622, 6954, -21361, -47667, -21905, -7038, -21074, 2484, 6970, 28702, 44968, 24307, -12414, -19630, -14717, -35050, -34803, -33880, -134, -6849, -47178, -56751, -44679, -14941, 11243, 3596, 2335, -8105, -18752, -30000, -31921, -11515, -1450, 14142, -28398, -27505, -3466, -24168, -37147, -15449]
4372a5449J7380r095k4641K0445K0312J0144k0099j6287J7964J0060K470J9153
4360C2357j6257P651K0038l2289j5921q778m099K0251J1344l159j6404l3136j6987
4347e5389K3358J6820p026J4209p23k0166R085r395K3115K2081J8006R569k1779
4334B1765m0259j312J0548k260J0295J0711J688M989l077K3058L856j7668l7702
4321a5368j0784R48J0823N681L603K7114K1109r860K1574j0786k1468J3879k5919
$$ y = [-15449, 1931, -7164, -31805, -11360, 8952, 19096, -1003, -17290, 674, 10734, 13204, 32357, 16100, 23751, 43789, 11500, -4421, -13199, -17298, 2953, 14297, 11138, -5266, -38402, -55389, -32031, -15211, -22237, -8028, -8751, -28917, -19832, -29227, -6112, 15969, 33975, 43544, 21765, -18494, -19806, -9258, -11518, -1223, 9488, 11176, 16165, 13088, 36146, 40002, 22334, -15368, -26152, -25204, -14381, -8700, -5097, 22017, 43126, 33266, 54840, 44054, 22586, 36465, 10546]
$$ [...]
##END NTUPLES=NMR SPECTRUM
##END=
