##TITLE=Analysis number 321557
Compound Code cc 10510
Project Code adrs
Chemist Name andys
##JCAMPDX= 6.0         $$ Bruker NMR JCAMP-DX V2.0
##DATA TYPE= NMR SPECTRUM
##DATA CLASS= NTUPLES
##ORIGIN= Bruker BioSpin GmbH
##OWNER= nmr
$$ XWIN-NMR		Version 3.5
$$ Wed Aug 16 10:04:18 2006 GMT Daylight Time (UT+1h)  MAYBRIDGE\nmr@NMR_250MHZ
##.OBSERVE FREQUENCY= 250.131544655141
##.OBSERVE NUCLEUS= ^1H
##.ACQUISITION MODE= SIMULTANEOUS (DQD)
##.ACQUISITION SCHEME= undefined
##.AVERAGES= 16
##.DIGITISER RES= 18
##SPECTROMETER/DATA SYSTEM= dpx250
##.PULSE SEQUENCE= zg30
##.SOLVENT NAME= CDCl3
##.SHIFT REFERENCE= (INTERNAL, CDCl3, 0, 16.522)
##AUDIT TRAIL= $$ (NUMBER, WHEN, WHO, WHERE, WHAT)
$$ ##TITLE= Audit trail, XWIN-NMR		Version 3.5
$$ ##JCAMPDX= 5.01
$$ ##ORIGIN= Bruker BioSpin GmbH
$$ ##OWNER= nmr
$$ C:\u/data/dgb/nmr/ADRS/990/pdata/1/auditp.txt
$$ ##AUDIT TRAIL=  $$ (NUMBER, WHEN, WHO, WHERE, WHAT)
(   1,<2006-08-16 10:03:57.82 +100>,<MAYBRIDGE\nmr>,<NMR_250MHZ>,
      <created by zg, POWCHK disabled, PULCHK disabled
       configuration hash MD5:
       E2 DF 36 D8 04 B2 41 60 5A D7 A3 38 5A 4B D0 FE
       data hash MD5: 64K
       3C 8E 89 45 59 6B 9C 8F CD 9F 57 D0 78 C1 A2 51>)
(   2,<2006-08-16 10:04:10.40 +100>,<MAYBRIDGE\nmr>,<NMR_250MHZ>,
      <Start of raw data processing
       ef LB = 0.3 FT_mod = 6 PKNL = 1 SI = 32K 
       data hash MD5: 32K
       A0 19 0F 79 52 C3 ED 0E 65 7E D5 8D 5C 2B 1A 63>)
(   3,<2006-08-16 10:04:11.99 +100>,<MAYBRIDGE\nmr>,<NMR_250MHZ>,
      <apk 
       data hash MD5: 32K
       13 CD 46 55 95 0F 14 20 E9 DA 83 5B 09 35 EB BB>)
(   4,<2006-08-16 10:04:12.85 +100>,<MAYBRIDGE\nmr>,<NMR_250MHZ>,
      <abs ABSG = 5 
       data hash MD5: 32K
       95 73 51 13 F1 1A D5 D4 95 A2 42 2E 8A 53 BD 75>)
$$ ##END=
$$ 
$$ hash MD5
$$ B7 70 63 A2 4F BA B2 00 6F 82 FA 19 A3 0A 9E D5
##$RELAX= 
##$RELAX= 
##$RELAX= 
##$RELAX= 
##$RELAX= 
##$RELAX= 
##$RELAX= 
$$ Bruker specific parameters
$$ --------------------------
##$DU= <C:\u>
##$EXPNO= 990
##$NAME= <ADRS>
##$PROCNO= 1
##$TYPE= <nmr>
##$USER= <dgb>
##$AMP= (0..31)
100 100 100 100 100 100 100 100 100 100 100 100 100 100 100 100 100 100 
100 100 100 100 100 100 100 100 100 100 100 100 100 100 
##$AQSEQ= 0
##$AQ_mod= 3
##$AUNM= <au_zg>
##$AUTOPOS= <7 >
##$BF1= 250.13
##$BF2= 250.13
##$BF3= 250.13
##$BF4= 250.13
##$BF5= 500.13
##$BF6= 500.13
##$BF7= 500.13
##$BF8= 500.13
##$BYTORDA= 1
##$CFDGTYP= 0
##$CFRGTYP= 5
##$CHEMSTR= <none>
##$CNST= (0..31)
1 1 145 1 1 1 1 1 1 1 1 1 1 1 1 1 1 1 1 1 1 1 1 1 1 1 1 1 1 1 1 1 
##$CPDPRG= <>
##$CPDPRG1= <>
##$CPDPRG2= <>
##$CPDPRG3= <>
##$CPDPRG4= <mlev>
##$CPDPRG5= <mlev>
##$CPDPRG6= <mlev>
##$CPDPRG7= <mlev>
##$CPDPRG8= <mlev>
##$CPDPRGB= <>
##$CPDPRGT= <>
##$D= (0..31)
0 1 0 0 0 0 0 0 0 0.06 0 0 0 0 0 0 0.0002 0 0 0 0 0 0 0 0 0 0 0 0 0 0 
0 
##$DATE= 1155719036
##$DBL= (0..7)
120 120 120 120 120 120 120 120 
##$DBP= (0..7)
150 150 150 150 150 150 150 150 
##$DBP07= 0
##$DBPNAM0= <>
##$DBPNAM1= <>
##$DBPNAM2= <>
##$DBPNAM3= <>
$$ [...]
##$SUBNAM7= <"">
##$SUBNAM8= <"">
##$SUBNAM9= <"">
##$SW= 20.6930455092707
##$SWIBOX= (0..15)
0 0 3 0 0 0 0 0 0 0 0 0 0 0 0 0 
##$SW_h= 5175.983436853
##$TD= 65536
##$TD0= 1
##$TE= 295.16
##$TE2= 300
##$TE3= 300
##$TEG= 300
##$TL= (0..7)
0 120 120 120 120 120 120 120 
##$TP= (0..7)
150 150 150 150 150 150 150 150 
##$TP07= 0
##$TPNAME0= <>
##$TPNAME1= <>
##$TPNAME2= <>
##$TPNAME3= <>
##$TPNAME4= <>
##$TPNAME5= <>
##$TPNAME6= <>
##$TPNAME7= <>
##$TPOAL= (0..7)
0.5 0.5 0.5 0.5 0.5 0.5 0.5 0.5 
##$TPOFFS= (0..7)
0 0 0 0 0 0 0 0 
##$TUNHIN= 0
##$TUNHOUT= 0
##$TUNXOUT= 0
##$USERA1= <user>
##$USERA2= <user>
##$USERA3= <user>
##$USERA4= <user>
##$USERA5= <user>
##$V9= 5
##$VALIST= <valist>
##$VCLIST= <CCCCCCCCCCCCCCC>
##$VD= 0
##$VDLIST= <DDDDDDDDDDDDDDD>
##$VPLIST= <PPPPPPPPPPPPPPP>
##$VTLIST= <TTTTTTTTTTTTTTT>
##$WBST= 1024
##$WBSW= 4
##$XGAIN= (0..3)
0 0 0 0 
##$XL= 0
##$YL= 0
##$YMAX_a= 444881
##$YMIN_a= -552293
##$ZGOPTNS= <>
##$ZL1= 120
##$ZL2= 120
##$ZL3= 120
##$ZL4= 120
##$ABSF1= 16.522
##$ABSF2= -4.171173
##$ABSG= 5
##$ABSL= 3
##$ALPHA= 0
##$AQORDER= 0
##$ASSFAC= 0
##$ASSFACI= 0
##$ASSFACX= 0
##$ASSWID= 0
##$AUNMP= <proc_1d>
##$AZFE= 0.1
##$AZFW= 0.1
##$BCFW= 0
##$BC_mod= 0
##$BYTORDP= 0
##$COROFFS= 0
##$CY= 12.5
##$DATMOD= 1
##$DC= 0
##$DFILT= <>
##$DTYPP= 0
##$F1P= 14.0000005364418
##$F2P= -0.99999901652339
##$FCOR= 0.5
##$FTSIZE= 32768
##$FT_mod= 6
##$GAMMA= 0
##$GB= 0
##$INTBC= 1
##$INTSCL= 1
##$ISEN= 128
##$LB= 0.3
##$LEV0= 0
##$LPBIN= 0
##$MAXI= 10000
##$MC2= 0
##$MEAN= 0
##$ME_mod= 0
##$MI= 0
##$NCOEF= 0
##$NC_proc= -4
##$NLEV= 6
##$NOISF1= 0
##$NOISF2= 0
##$NSP= 0
##$NTH_PI= 0
##$NZP= 0
##$OFFSET= 16.522
##$PC= 1
##$PHC0= 151.0248
##$PHC1= 0.6952711
##$PH_mod= 1
##$PKNL= yes
##$PPARMOD= 0
##$PSCAL= 4
##$PSIGN= 0
##$REVERSE= no
##$SF= 250.13
##$SI= 32768
##$SIGF1= 0
##$SIGF2= 0
##$SINO= 400
##$SIOLD= 32768
##$SREGLST= <1H.CDCl3>
##$SSB= 0
##$STSI= 32768
##$STSR= 0
##$SW_p= 5175.98343685301
##$SYMM= 0
##$S_DEV= 0
##$TDeff= 65536
##$TDoff= 0
##$TI= <Analysis number 999999
Compound Code 99
Book Reference 9
Project Code 9>
##$TILT= no
##$TM1= 0
##$TM2= 0
##$TOPLEV= 0
##$USERP1= <user>
##$USERP2= <user>
##$USERP3= <user>
##$USERP4= <user>
##$USERP5= <user>
##$WDW= 1
##$XDIM= 32768
##$YMAX_p= 346891340
##$YMIN_p= -223579
$$ End of Bruker specific parameters
$$ ---------------------------------
##NTUPLES= NMR SPECTRUM
##VAR_NAME=  FREQUENCY,     SPECTRUM/REAL,   SPECTRUM/IMAG
##SYMBOL=    X,             R,               I
##VAR_TYPE=  INDEPENDENT,   DEPENDENT,       DEPENDENT
##VAR_FORM=  AFFN,          ASDF,            ASDF
##VAR_DIM=   32768,         32768,           32768
##UNITS=     HZ,            ARBITRARY UNITS, ARBITRARY UNITS
##FACTOR=    0.157963299565203, 1,           1
##FIRST=     4132.6476996994, 0,             0
##LAST=      -1043.33573715361, 0,           0
##MIN=       -1043.33573715361, -223579,     0
##MAX=       4132.6476996994, 346891340,     0
$$ Real data points
##PAGE= N=1
##DATA TABLE= (X++(R..R)), XYDATA
$$ [...]
23303D2003k545m1633k4800M388J6216L6872j0546l4396l1882J6126k2773k0595
$$ 42003 39458 -2175 -26975 -22587 -6371 30501 19955 -14441 -46323 -30197 -52970 -73565
23291g3565j037N6084r86o156K7650Q953o0662m963J9886O79m1368j6168K3417
$$ -73565 -74602 -18518 -19504 -25660 1990 10943 -49719 -54682 -34796 -34117 -75485 -91653 -68236
23278f8236P961K4221n8170o8583M1157N8102O8014o879k293J5798P312j4930
$$ -68236 -60275 -36054 -94224 -162807 -121650 -63548 4466 -2413 -4706 11092 18404 3474
23266C474m3137k0725O1247O5870J2859n3448k7360o526j7248j1883J0227K8230
$$ 3474 -39663 -60388 859 66729 79588 26140 -1220 -7746 -24994 -36877 -26650 1580
23254A580l5432m7901k6581J5684q115J4028R6750Q5530O813l6524k3035m369
$$ 1580 -33852 -81753 -108334 -92650 -100765 -86737 10013 95543 102356 65832 42797 38428
23242C8428K8143J4611l2984l7075j0366N6243K9935k6711k3951k9720l9591m6099
$$ 38428 66571 81182 48198 11123 757 57000 86935 60224 36273 6553 -33038 -79137
23230g9137N6218M4658j4836L7979J7981l2149j8083l4304k5911K4696N2239k3060
$$ -79137 -22919 21739 6903 44882 62863 30714 12631 -21673 -47584 -22888 29351 6291
23218F291p4990m1989J3633N6230K1700p142K454n2631K7364O7897M8638K8304
$$ 6291 -68699 -110688 -97055 -40825 -19125 -26267 -23813 -76444 -49080 18817 67455 95759
23206I5759l3295j3929k8534j2343J2071p4429K2044j8801m338j0995L757M5002
$$ 95759 62464 48535 20001 7658 19729 -54700 -32656 -51457 -55795 -66790 -63033 -18031
23194a8031M4997J4618k1433o1498j1825L1966N5658k5115K3672J9871l0500l0151
$$ -18031 26966 41584 20151 -41347 -53172 -21206 34452 9337 33009 52880 22380 -7771
23182g771J0087L0609J3170P2671k8071n3432k1257J8764K7008L685n8767K1376
$$ -7771 2316 32925 46095 118766 90695 37263 16006 34770 61778 65463 6696 28072
23170B8072L6955J6617k6933l9473N030l7207l8664J3783M7204K460k2853Q961
$$ 28072 65027 81644 54711 15238 20268 -16939 -55603 -41820 5384 7844 -15009 -6048
23158f048M5463J2341j3656p4283o2530N5859J08910L032p5368k8546j3932r0229
$$ -6048 39415 51756 38100 -36183 -98713 -42854 66056 69088 -6280 -34826 -48758 -138987
23146a38987j2046M2161o4495j8204N8240N1646j2899m5599M6961L5837k8031
$$ -138987 -151033 -108872 -173367 -191571 -133331 -81685 -94584 -140183 -93222 -57385 -85416
23135h5416r774m0194k280L6626N3520l9743k7344K5815J1076o9571J3366Q9121
$$ -85416 -95190 -135384 -137664 -101038 -47518 -87261 -114605 -88790 -77714 -147285 -133919 -44798
23123d4798M3298m515m7181k8726J4867L0321M3828K3597J535J9578L4070o4283
$$ -44798 -1500 -6015 -53196 -81922 -67055 -36734 7094 30691 32226 51804 85874 21591
23111B1591L120L1876J5230n059j09309j3346L8524L4432L5329J5731r580m0115
$$ 21591 24711 56587 71817 66758 -42551 -55897 -17373 17059 52388 68119 58539 18424
23099A8424J7785J0982M0863p010n9552l7018J5071N2727k7208j5651R4349p525
$$ 18424 36209 47191 88054 81044 21492 -15526 -455 52272 25064 9413 103762 96237
23087I6237n8289o7256J1011p977K8187m230K2960p98j9949j4252m854m701k6041
$$ 96237 37948 -29308 -18297 -26274 1913 -2317 20643 19845 -104 -14356 -19210 -23911 -49952
23074d9952L704k0699J6457k0902J4074R0004j229p876M9336r461o0483m0801
$$ -49952 -46248 -66947 -50490 -71392 -57318 32686 31457 23581 72917 63456 2973 -37828
23062c7828L4572N9784K5727m275l7309j5698k7460K3863K253l1204l3016K4021
$$ -37828 -3256 56528 82255 77980 40671 24973 -2487 21376 23629 -7575 -40591 -16570
23050a6570O7213K9924l8299m497j7879l3274l5418K671l1293K6187L8216P5852
$$ -16570 50643 80567 42268 37771 19892 -13382 -48800 -46129 -77422 -51235 -13019 62833
23038F2833j3801N924l26J7672o6882p1966K717L667N8254J1095L8764K0503k777
$$ 62833 49032 54956 54630 72302 5420 -66546 -63829 -60162 -1908 9187 47951 68454 65677
23025F5677K8245n332p7044Q812O891n6394L6345J7753J5110l9284p1140k3941
$$ 65677 93922 88590 11546 20358 27249 -29145 7200 24953 40063 779 -70361 -94302
23013i4302O9959q032O3526l1246J6119J2303k227k5876k3890j7945j547Q011
$$ -94302 -24343 -32375 31151 -95 16024 28327 26100 224 -23666 -41611 -43158 -35147
23001c5147O5086K3398l5922k7386J3462K2398j3026K7759J9383K4781k4733q2526
$$ -35147 29939 53337 17415 -9971 3491 25889 12863 40622 60005 84786 60053 -22473
22989b2473N5232R7117l1724N375J954l6882o2283Q36R177m6226K8279J4331m9378
$$ -22473 32759 129876 98152 103527 105481 68599 6316 7152 16329 -29897 -1618 12713 -36665
22976c6665m8432K1048K1860L4183M378p629p399J3186N7999r721K7173j5338
$$ -36665 -85097 -64049 -42189 -8006 -3628 -11257 -18656 -5470 52529 42808 69981 54643
22964E4643j9750j0704j6763k4782M4001J8495o287n828j631o4592p5433m6304
$$ 54643 34893 24189 7426 -17356 26645 45140 38853 33025 31394 -33198 -108631 -154935
22952a54935K9504M4701O3707Q11K8014l5052M9132M068Q383l4430J4630k1446
$$ -154935 -125431 -80730 -17023 -16212 11802 -23250 25882 29950 38333 3903 18533 -2913
22940b913m2102K6899L8505m6362o4437M0436K9061M0223N3324m7412q4954j4865
$$ -2913 -45015 -18116 20389 -25973 -90410 -49974 -20913 19310 72634 25222 -59732 -74597
22928g4597j4050J0421L0118l2195l5712L9964p216k1734L4125L4877K9994p698
$$ -74597 -88647 -78226 -48108 -80303 -116015 -76051 -83267 -105001 -70876 -35999 -6005 -13703
22916a3703l0822L6367m2752o6764o0882K4434L6110K8467K399K141j0289j6003
$$ -13703 -44525 -8158 -50910 -117674 -178556 -154122 -118012 -89545 -87146 -85005 -95294 -111297
22904a11297K5211L9695P8328K364p6497m2552n66J0138j1394j1060M5432r844
$$ -111297 -86086 -46391 31937 34301 -42196 -84748 -85314 -75176 -86570 -97630 -52198 -62042
22892f2042l6122M7665L6389n1173n8321J8434P2562M4584L0127j9617q476K0387
$$ -62042 -98164 -50499 -14110 -65283 -123604 -105170 -32608 11976 42103 22486 14010 34397
22880C4397l9424o949l8291m3295N475K0486k715K7809p298q34M4332O147L2047
$$ 34397 -5027 -11976 -50267 -93562 -88087 -67601 -70316 -42507 -49805 -50639 -6307 -160 31887
22867C1887q17j4675K6176l0070m2556M5175K0483m06K9420p182n0278J4411O8480
$$ 31887 31070 16395 42571 12501 -30055 15120 35603 35197 64617 57435 7157 21568 90048
22854I0048k6002m1106n7194p7982j5870O8822L913J2712L1341k4015p9342j1562
$$ 90048 64046 22940 -34254 -112236 -128106 -59284 -55371 -42659 -11318 -35333 -114675 -126237
22842a26237O3200J8838K1167J4665j6523N121P5630J2827o9410o3099K8452N576
$$ -126237 -63037 -44199 -23032 -8367 -24890 -19769 55861 68688 -722 -63821 -35369 -29793
22830b9793K0737r303J1520n13j7309M1478k1839K2541k8330j5748O9596q262
$$ -29793 -9056 -18359 -6839 -7352 -24661 16817 -5022 17519 -10811 -26559 43037 34775
22818C4775o3114q1540j1007j5515J6490n1294n2374M2769O6634M7459J148K0031
$$ 34775 -28339 -109879 -120886 -136401 -119911 -171205 -223579 -180810 -114176 -66717 -65569 -45538
22806d5538J3104l9518K3177Q1068k0122n9671j6629m9069j0763N7066K6909L2926
$$ -45538 -32434 -71952 -48775 32293 12171 -47500 -64129 -113198 -123961 -66895 -39986 -7060
22794g060L5046m853l0468n055M978P9K7186n7369k7922P635r564k870K9412j660
$$ -7060 27986 23133 -7335 -12390 -7412 -7333 19853 -37516 -65438 -57803 -67367 -70237 -40825 -42485
22780d2485j0753k5831o445J5564j6125l724K3962j3678K7202j1047P923P2114
$$ -42485 -53238 -79069 -85514 -69950 -86075 -89799 -65837 -79515 -52313 -63360 -55437 16677
22768A6677Q063l5068J5869N650n1560j2790J65Q935J9787M4703N5326n57j4000
$$ 16677 24740 -10328 5541 11191 -40369 -53159 -52994 -44059 -24272 20431 75757 75200 61200
22755F1200p097L4968o0969j2113O751l1505M245M1573n220r0195J4055K4546
$$ 61200 54103 89071 28102 15989 22740 -8765 -4520 37053 31833 -58362 -44307 -19761
22743a9761l7070K4502J6812o045l0242q866k031M6555Q5621K4812l5610n8811
$$ -19761 -56831 -32329 -15517 -21562 -51804 -60670 -62701 -16146 69475 94287 58677 -134
22731a34l7459J160L7692N5132l8555q5468m4158m806M9382Q8399J0655J2342
$$ -134 -37593 -36433 1259 56391 17836 -67632 -111790 -116596 -67214 21185 31840 44182
22719D4182j83K140n356K9241l2329k8992l2939p0555m8669j6794N370j0031K2379
$$ 44182 43999 46139 40783 70024 37695 8703 -24236 -94791 -143460 -160254 -154884 -164915 -142536
22706a42536P3155M5510j8941m8594n351K1100K5540L4812N2581K6749L0046K2731
$$ -142536 -69381 -23871 -42812 -91406 -96757 -75657 -50117 -15305 37276 64025 94071 116802
22694A16802R727k5626n0907q4242n721L1172J0629n158K3340K859l7456k1309
$$ 116802 126529 100903 49996 -34246 -39967 -8795 1834 -3324 20016 22875 -14581 -35890
22682c5890l4660K1879j6381P3995J4273l9057l2757N0684M1554l8706J781j5165
$$ -35890 -70550 -48671 -65052 8943 23216 -15841 -48598 2086 43640 4934 6715 -8450
22670h450K3205K6765k5404M7753j9010l6123P183L1879k1959q5853m2133N6735
$$ -8450 14755 41520 16116 63869 44859 8736 15919 47798 25839 -60014 -102147 -45412
22658d5412L3660N993K1613L0126J2734j2433l0273k8407K1338O3141m8541q0513
$$ -45412 -11752 -5759 15854 45980 58714 46281 16008 -12399 8939 72080 23539 -56974
22646e6974j6021l143M278L9750M6483o9155o3680Q576K8371K5991J9958j7554
$$ -56974 -72995 -76138 -71860 -32110 14373 -54782 -118462 -109886 -81515 -55524 -35566 -53120
22634e3120N2141J1525n343l087k6302j6684J5318J1811j3420J5648j388l6084
$$ -53120 -979 10546 5203 2116 -24186 -40870 -25552 -13741 -27161 -11513 -12901 -48985
22622d8985m8382M926N143M9767r997l7893j3947N9831K0112L9879l4341m6400
$$ -48985 -97367 -92441 -87298 -37531 -47528 -85421 -99368 -39537 -19425 20454 -13887 -60287
22610f0287k6240l2732N3692N5690K634N999M5595l200o132r456j9114L1376J8762
$$ -60287 -86527 -119259 -65567 -9877 -7243 -1244 44351 41151 35019 25563 6449 37825 56587
22597E6587j089K916R102l1562j4951N664J4199M4896q3915k5825m0956o196j9354
$$ 56587 55498 58414 67516 35954 21003 26667 40866 85762 1847 -23978 -64934 -71130 -90484
22584i0484o7364J1882M0116J0437j7632l6949J9939J1551r806k8082O3796N5198
$$ -90484 -157848 -145966 -105850 -95413 -113045 -149994 -130055 -118504 -128310 -156392 -92596 -37398
22572c7398n020P649K31j0990m7623K2962P7309L1332n3176j8942j4125K2249
$$ -37398 -42418 -34769 -34538 -45528 -93151 -70189 7120 38452 -14724 -33666 -47791 -25542
22560b5542L0964m179P06p0294O2412K5499k4555k1377k6114J6776M5087K7053
$$ -25542 5422 1243 1949 -68345 -5933 19566 -4989 -26366 -52480 -35704 9383 36436
22548C6436n4075n1299J2431L6873R394k3402r159L5983J4435m13k4956r826O921
$$ 36436 -17639 -68938 -56507 -19634 -10240 -33642 -42801 -6818 7617 7204 -17752 -27578 -20657
22535b0657K456k7518l059Q656L2051N7118R2306J0110o9094n2118n3084p4944
$$ -20657 -18201 -45719 -48778 -40122 -8071 49047 141353 151463 82369 30251 -22833 -97777
22523i7777J3154j1079P5816L6937o812o379k061j4918L349j3179k9168M29J1992
$$ -97777 -84623 -95702 -19886 17051 10239 3860 1799 -13119 -9770 -22949 -52117 -51688 -39696
22510c9696P4796L789o258o3878k5960O8399N513R451K5954J9911k647K360J5163
$$ -39696 35100 38889 32631 -31247 -57207 11192 16705 26156 52110 72021 69374 71734 86897
22497H6897j3733K316N3901Q123j7217q8839j11878p768J00372L5810l1326q399
$$ 86897 73164 75480 129381 137504 120287 31448 -80430 -88198 12174 47984 16658 8259
22485H259O437k8687N550K7696j3547o813l0092J162N775N7835O7483m3330q2281
$$ 8259 14696 -13991 -8441 19255 5708 -1105 -31197 -30035 -24260 33575 101058 57728 -24553
22472b4553O4K2344n0875k3170N5098K7051J5449O391o66L734m764R848j7902
$$ -24553 -24489 -2145 -53020 -76190 -21092 5959 21408 27799 27133 30867 26103 35951 18049
22459A8049O6640J04880m5415p6505n5906Q269J0799k7628l5450j5757K5005J3681
$$ 18049 84689 189569 144154 67649 11743 20012 30811 3183 -32267 -48024 -23019 -9338
22447i338J9958L246l215l9917M3826l6851j2820j5604l2507K1249L7922K1738
$$ -9338 10620 13866 10651 -29266 14560 -22291 -35111 -50715 -83222 -61973 -24051 -2313
22435b313j5601l9941K8927O8735n138l3043o3228L4123M0234N0610o0811n4583
$$ -2313 -17914 -57855 -28928 39807 34669 1626 -61602 -27479 12755 63365 2554 -52029
22423e2029L763M4908O1705k7466k8591k0964j1036O664K0960m2602q673N5691
$$ -52029 -48266 -3358 58347 30881 2290 -18674 -29710 -23046 -2086 -44688 -53361 2330
22411B330K170k601Q827J7061l011m0562j9896M757p292K5572J3284l9658j4938
$$ 2330 4500 1899 10726 27787 24776 -15786 -35682 -30925 -38217 -12645 639 -39019 -53957
22398e3957m364J38464K4276J3514q3675n6378J9112n0774o1367J9365K4222r283
$$ -53957 -58321 80143 104419 117933 34258 -22120 -3008 -53782 -115149 -95784 -71562 -80845
22386h0845m3097L9728J0860j2870J6294K3470l1642k2319K3580J8840K5173M4252
$$ -80845 -123942 -84214 -73354 -86224 -69930 -46460 -78102 -100421 -76841 -58001 -32828 11424
22374A1424m8917L2906K1855J6789j6582k646J7655L9511m00m2068m1969k1543
$$ 11424 -37493 -4587 17268 34057 17475 14829 32484 71995 71595 29527 -12442 -33985
22362c3985N0674Q8583O2214k292k7813j1192J532k6367j17307k5857n3744q1119
$$ -33985 16689 105272 167486 165194 137381 126189 127721 101354 -15953 -41810 -95554 -176673
22350a76673k2157N173K0212J122p4O2628O4433M6585K1345m0282o0281j7229
$$ -176673 -198830 -193657 -173445 -172323 -172397 -109769 -45336 1249 22594 -17688 -77969 -95198
22338i5198N8777O9021k5218k185O1575M6912p2063n5817L3562m0897J8618L9762
$$ -95198 -36421 32600 7382 5197 66772 113684 41621 -14196 19366 -21531 -2913 36849
22326C6849q208j8422j3930M3436K0951j9437L929L4648p5916j3371M121Q361
$$ 36849 28641 10219 -3711 39725 60676 41239 45168 79816 3900 -9471 -5350 3011
22314C011l6977K835N2521l287k1500j7248l385l656k6923m2191K6210J7347L6180
$$ 3011 -33966 -31131 21390 18103 -3397 -20645 -24030 -27686 -54609 -96800 -70590 -53243 -17063
22301a7063l91n5762r840J3883L4039m625M3256q736P6218J4402k6411j1806j2367
$$ -17063 -17454 -73216 -83056 -69173 -35134 -39759 3497 -5239 70979 85381 58970 47164 34797
22288C4797m519r352l2798j3940O937L4501K4390k9739m1991K193J8311j1245
$$ 34797 30278 20926 -11872 -25812 -18875 15626 40016 10277 -31714 -29521 -11210 -22455
22276b2455K1151L7083M6482J3523j2028p038r0921j4091k6226q2272L8992Q0906
$$ -22455 -1304 35779 82261 95784 83756 76718 -14203 -28294 -54520 -136792 -97800 -16894
22264a6894L9333j4669l8520j5052J4130l830N8347k7194p386j1654o669l5240
$$ -16894 22439 7770 -30750 -45802 -31672 -35502 22845 -4349 -11735 -23389 -30058 -65298
22252f5298L7510J0873n2670N0124N6470j3061L5404j5590m2121n5043j3503K4272
$$ -65298 -27788 -16915 -69585 -19461 37009 23948 59352 43762 1641 -53402 -66905 -42633
22240d2633Q5293M6644l1032p4131K892l9529o620J075L0829J58K1079n66r0601
$$ -42633 42660 89304 58272 -15859 -12967 -52496 -59116 -58041 -27212 -27054 -5975 -6541 -97142
22227i7142l6850O0184Q8667q385l3687Q411n433L4733O0579l8135k9146K0826
$$ -97142 -133992 -73808 14859 6474 -27213 -18802 -24235 10498 71077 32942 3796 24622
22215B4622K4958k8201m4984M0398L2456L7964l2267j6699j4544k0837p10m778
$$ 24622 49580 21379 -23605 16793 49249 87213 54946 38247 23703 2866 2156 -2622
22203b622J5983k7575n0868R685m11R600O931l0257J4168j2123L0315L1247O4814
$$ -2622 13361 -14214 -65082 -55397 -55808 -46208 -39277 -69534 -55366 -67489 -37174 -5927 58887
22190E8887K1693l2499k0199j1012n7397J6699K9029m0228k0631R059P692O619
$$ 58887 80580 48081 27882 16870 -40527 -23828 5201 -35027 -55658 -46599 -38907 -32288
22178c2288j8636N4107J1347M4873q806J4938o9819j8209n0455j9978R339K1085
$$ -32288 -50924 3183 14530 59403 50597 65535 -4284 -22493 -72948 -92926 -83587 -62502
22166f2502P0662L0428L4840l5724r445m8464j8018K4923K5262k3042q6571O9200
$$ -62502 8160 38588 73428 37704 28259 -20205 -38223 -13300 11962 -11080 -97651 -28451
22154b8451J06908l3k8947o8380l3879n1847K6875M6522K1953J238L0654L2325
$$ -28451 78457 78424 49477 -18903 -52782 -104629 -77754 -31232 -9279 -8041 22613 54938
22142E4938L7928o1599o5655j438O0829R487l0162k2063O802M9473k6142l9521
$$ 54938 92866 31267 -34388 -35826 25003 34490 4328 -17735 -10933 38540 12398 -27123
22130b7123K4709m7605N9194J0109m898m9319p541l9240J1016k5138K6491J4051
$$ -27123 -2414 -50019 9175 19284 14386 -34933 -42474 -81714 -70698 -95836 -69345 -55294
22118e5294j5414J3995K0837J7744L3185L5648k1957k5773O251K0493K1934J9043
$$ -55294 -70708 -56713 -35876 -18132 15053 50701 28744 2971 9222 29715 51649 70692
22106G0692j2753q744k227m3192k111K9431N6208J928J9971o8494j13699N42N8896
$$ 70692 57939 49195 46968 3776 1665 31096 87304 89232 109203 40709 -72990 -72448 -13552
22093a3552J6263J8975m8210J4878L9449l669k068N4843j9679n1797p9333M708
$$ -13552 2711 21686 -26524 -11646 27803 24134 22066 76909 57230 5433 -73900 -69192
22081f9192N2765k7668M4042R7956J6097m4600N751k6741j1186k0400k0123l7245
$$ -69192 -16427 -44095 -53 97903 114000 69400 75151 48410 37224 16824 -3299 -40544
22069d0544J2412k1311m2189k9050M3588M9457m850P693j0593l2258K0135K2322
$$ -40544 -28132 -49443 -91632 -120682 -77094 -27637 -32487 -24794 -35387 -67645 -47510 -25188
22057b5188J938j5277j6062l743j0247m5136L7669j17L7611J565O0056q886J412
$$ -25188 -23250 -38527 -54589 -58332 -68579 -113715 -76046 -76163 -38552 -36987 23069 14183 15595
22044A5595r425l3061J3139L0996p078J1087q774J3807M1968P176L2039k5502
$$ 15595 6170 -26891 -13752 17244 10166 21253 12479 26286 68254 75430 107469 81967
22032H1967o7829m5454P603K4505j6034Q354q255m5668l0695J7356P3345K4911
$$ 81967 14138 -31316 -23713 792 -15242 -6888 -15143 -60811 -91506 -74150 -805 24106
22020B4106l3637K9974n732l8912Q554o336K3672m003j0900J2034j2111m640m824
$$ 24106 -9531 20443 14711 -24201 -15647 -21983 1689 -2314 -13214 -1180 -13291 -17931 -22755
22007b2755K1607K1719J6564l0069p329K4885J01937J0928l8959p4276n0898O1759
$$ -22755 -1148 20571 37135 7066 -263 24622 126559 137487 98528 24252 -26646 35113
21995C5113J0892l2884l1248M2663Q2363L4066l9118m4512n471q094M2623j6785
$$ 35113 46005 13121 -18127 24536 106899 140965 101847 57335 51864 43770 86393 69608
21983F9608q9948Q489M3459k5921J4805M6799k5296j5167M3749k7714K6769L1057
$$ 69608 -20340 -11851 31608 5687 20492 67291 41995 26828 70577 42863 69632 100689
21971A00689o020o9294m4927j4037K9613K1187l494J9938K2941m509o7403n7914
$$ 100689 94669 25375 -19552 -33589 -3976 17211 13717 33655 56596 52087 -15316 -73230
21959g3230j4608J0134l015M9454N1022K1700j8034r417k7432k3902M937M021
$$ -73230 -87838 -77704 -80719 -31265 19757 41457 23423 14006 -13426 -37328 -32391 -28370
21947b8370j9957k4715l682K4664L0160m365J7888J0893o505k5816L8445N319
$$ -28370 -48327 -73042 -76724 -52060 -21900 -26265 -8377 2516 -3989 -29805 8640 13959
21935A3959q780l9231j2679K2048R078K2079K3552J122l5642K5665K0351M7954
$$ 13959 5179 -34052 -46731 -24683 -15605 6474 30026 31148 -4494 21171 41522 89476
21923H9476Q0955j8134q0384m1273o093M0927j2177o4114m2503J1318R5740J7694
$$ 89476 170431 152297 71913 30640 24547 65474 53297 -10817 -53320 -42002 53738 71432
21911G1432J9879O8499l1275q2543j2115o61O69l1543K6018J778l6141p917L2742
$$ 71432 91311 159810 128535 45992 33877 33216 33885 2342 28360 30138 -6003 -13920 18822
21898A8822l18l1354J1403M2826P0079k1007q5504l4436J9376J4826J8623K8606
$$ 18822 18504 -12850 -1447 41379 111458 90451 4947 -29489 -10113 4713 23336 51942
21886E1942k6774j4941L582M120j1234O134l0951P73P845k129k0160m1659O950
$$ 51942 25168 10227 13809 17929 6695 12829 -18122 -17349 -9504 -11633 -31793 -73452 -66502
21873f6502n429j0465N9766O3438m0711o8322o1980n248M903J3356M7757M3136
$$ -66502 -71931 -82396 -22630 40808 97 -68225 -130205 -135453 -130550 -117194 -69437 -26301
21861b6301L4638M3984M4887o4231m6276l1395p1729m1217P0252K8821J5185J8402
$$ -26301 8337 52321 97208 32977 -13299 -44694 -116423 -157640 -87388 -58567 -43382 -24980
21849b4980r113J4395m3541j2885l6986L9971q45M6394M0848j4751J9119l68m4791
$$ -24980 -34093 -19698 -63239 -76124 -113110 -73139 -73984 -27590 13258 -1493 17626 17258 -27533
21836b7533r279n3053K9412J9153M658L8285L6193j4931j7814n9559k0899m383
$$ -27533 -36812 -89865 -60453 -41300 -36642 1643 37836 22905 5091 -54468 -75367 -79750
21824g9750K8547L5142k4030k1525L9771M8421J3673p540j0958M725k9639q7694
$$ -79750 -51203 -16061 -40091 -61616 -21845 26576 40249 32709 21751 26476 -3163 -90857
21812i0857K1082L7802O0332k0205m0439n4456m749L4138l193m7429L4921K8725
$$ -90857 -69775 -31973 28359 8154 -32285 -86741 -91490 -57352 -60545 -107974 -73053 -44328
21800d4328j2723N829M0560K7102K7620n97k9328q648j1641M9270O4835l607q289
$$ -44328 -57051 -51222 -10662 16440 44060 43463 14135 5487 -6154 43116 107951 104344 96055
21787I6055l5786r6060m145N7288M5715N623j3967j428n894J9756j5727m8495
$$ 96055 60269 -35791 -39936 17352 63067 68690 54723 53295 47401 67157 51430 2935
21775B935l2200K5252M02k5886k3509k8399k3396k2988p317o457K7444L7003J04
$$ 2935 -29265 -4013 -3611 -29497 -53006 -81405 -104801 -127789 -135106 -141563 -114119 -77116 -77012
21762g7012J6255N4235N2858j2293o7234n5089r770J2417K0984M3777K1974J2248
$$ -77012 -60757 -6522 46336 34043 -33191 -88280 -98050 -85633 -64649 -20872 1102 13350
21750A3350j5991k3273K5150N7304j5764M520M050p692o161J92l3639j334r276
$$ 13350 -2641 -25914 -764 56540 40776 45296 49346 41654 35493 35685 2046 712 -8564
21737h564l3985O750M6550J8093j2055k17L866j8371p0662o800j0903J208L0647
$$ -8564 -42549 -35799 10751 28844 16789 16572 20438 2067 -68595 -75395 -86298 -85090 -54443
21724e4443M6270k0248k618j4531O6680j6214l2777N854M9711p290l6938j7505
$$ -54443 -8173 -28421 -31039 -45570 21110 4896 -27881 -22027 27684 20394 -16544 -34049
21712c4049k4529r542L0944j2606r946K3234J5605j6384m5053j8043N244Q005
$$ -34049 -58578 -68120 -37176 -49782 -59728 -36494 -20889 -37273 -82326 -100369 -95125 -87120
21700h7120p1k0828k406L0139K7215N2501Q139j1692k1039n5836K4241J7977k302
$$ -87120 -87191 -108019 -110425 -80286 -53071 -570 7569 -4123 -25162 -80998 -56757 -38780 -41082
21687d1082M414L0770o1119n5917j2828L0659M8044L7644K4204P817j3633j627
$$ -41082 -36668 -5898 -67017 -122934 -135762 -105103 -57059 -19415 4789 12606 -1027 -2654
21675b654l7669Q398K0341j5379n0941K3471P4848m036n5068M4120m439p3611
$$ -2654 -40323 -31925 -11584 -26963 -77904 -54433 20415 16379 -38689 5431 992 -72619
21663g2619k3843J9908N8555q459m3128l0445M2652L2731J8682j6946k1652j9717
$$ -72619 -96462 -76554 -17999 -26458 -69586 -100031 -57379 -24648 -5966 -22912 -44564 -64281
21651f4281k2328p470l2316M974n899M3401L1548M680k0501L167j9832j0452l76
$$ -64281 -86609 -94079 -126395 -121421 -127320 -83919 -52371 -47691 -68192 -65025 -84857 -95309 -95685
21638i5685J5238M927Q842j3556L129P8538j9212m3469m6025K4915O72N750r856
$$ -95685 -80447 -75520 -66678 -80234 -77105 1433 -17779 -61248 -107273 -82358 -81686 -75936 -85792
21625h5792l9600j1521j36L1151L3862N2517M4549k990M786L9965n953L833r7876
$$ -85792 -125392 -136913 -137049 -105898 -72036 -19519 25030 22040 26826 66791 60838 64671 -33205
21612c3205m4386k2225K5079L8541M5817K1485J5818j4L2977J6266K284j813K2557
$$ -33205 -77591 -99816 -74737 -36196 9621 31106 46924 46910 79887 96153 98437 96624 119181
21599A19181m1072o3039l4829Q641j3417j11592o7823Q2080P5399Q6721K5599
$$ 119181 78109 15070 -19759 -11118 -24535 -136127 -203950 -121870 -46471 40250 65849
21588F5849L8944M9325q647r652n6496j4992m7310l2149j1560N84j2580L2352
$$ 65849 104793 154118 145471 135819 79323 64331 17021 -15128 -26688 -26104 -38684 -6332
21576f332N3645j0787m0302M0873j0405m4121J9613J5201o6493m4271l1645K396
$$ -6332 47313 36526 -3776 37097 26692 -17429 2184 17385 -49108 -93379 -125024 -122628
21564a22628K6787L0682k6926J0091K8257L6120Q378j8125R303L4150J8831l6451
$$ -122628 -95841 -65159 -92085 -81994 -53737 -17617 -9239 -27364 -18061 16089 34920 -1531
21552a531J8105M3590L593n6606l1874L7951J8970r473J7257k4337K4523J960
$$ -1531 16574 60164 63757 7151 -24723 13228 32198 22725 39982 15645 40168 42128
21540D2128l3173j2775m0252K909o0382p4081L7869N431J0944R0992Q2212k6379
$$ 42128 8955 -3820 -44072 -41163 -101545 -175626 -137757 -132326 -121382 -30390 51822 25443
21528B5443k912k0869j7368N5755P760k1834k9605k0212j3547K642k293o193p183
$$ 25443 22531 1662 -15706 40049 47809 25975 -3630 -23842 -37389 -34747 -37040 -43233 -50416
21515e0416J4318K9689j4591K5704L4513k104L1603J0867J5069J8515r2328p0278
$$ -50416 -36098 -6409 -21000 4704 39217 37113 68716 79583 94652 113167 20839 -49439
21503d9439o36M7190N172j10818l9523N4784N4075J0223j0082j0794n119R376
$$ -49439 -50075 -2885 2287 -108531 -148054 -93270 -39195 -28972 -39054 -49848 -54967 -45591
21491d5591J1649j1151P045J4573J2173m094j6317n5160n883K7965n8098O997
$$ -45591 -33942 -45093 -38048 -23475 -11302 -15396 -31713 -86873 -92756 -64791 -122889 -115892
21479a15892N7965j4495J4412M5661K4226J2336k4304P097n0330K6080M3503J1397
$$ -115892 -57927 -72422 -58010 -12349 11877 24213 -91 7006 -43324 -17244 26259 37656
21467C7656j4643K0392P604j4162N458j2365J3832O475m5512k1453O3793K0611
$$ 37656 23013 43405 51009 36847 42305 29940 43772 50247 4735 -16718 47075 67686
21455F7686k113N209j9579n5314o1234k3856P8945K224k0373R6629j9085m4713
$$ 67686 65573 70782 51203 -4111 -65345 -89201 -10256 -8032 -28405 68224 49139 4426
21443D426o8436K1371L9439J9622n3752Q136j3169L0156m0801k1307K5958O4032
$$ 4426 -64010 -42639 -3200 16422 -37330 -29194 -42363 -12207 -53008 -74315 -48357 15675
21431A5675P2601l5033j5028k569o048j9752m0888m2870m6947l1657P208L808
$$ 15675 88276 53243 38215 35646 29598 9846 -31042 -73912 -120859 -152516 -145308 -141500
21419a41500N817K6322L9827Q810k7861j5104N6956L0694J9223j6035k7029K9995
$$ -141500 -135683 -109361 -69534 -60724 -88585 -103689 -46733 -16039 3184 -12851 -39880 -9885
21407i885j3169l7896O531j0272j7994P6065J0430o8645O528k3505J1113K0862
$$ -9885 -23054 -60950 -54419 -64691 -82685 -6620 3810 -64835 -58307 -81812 -70699 -49837
21395d9837N4251Q013n0613L4316N6960j292k3991o520k6678J1482L5074J686
$$ -49837 4414 12427 -38186 -3870 53090 51798 27807 21287 -5391 6091 41165 42851
21383D2851l6215l1936j0908l442l4577R939N5008O9655l2124m6378L9803L4429
$$ 42851 6636 -25300 -36208 -39650 -74227 -64288 -9280 60375 28251 -18127 21676 56105
21371E6105k7891O318M2250m8553o246R373L0423m4144m0545J2204L0717J0287
$$ 56105 28214 34532 76782 28229 21983 31356 61779 17635 -22910 -10706 20011 30298
21359C0298K8072J5939n5778l4959m7527K5405N0861M2842K158J8437R604p0132
$$ 30298 58370 74309 18531 -16428 -63955 -38550 12311 55153 57311 75748 85352 15220
21347A5220m8799o076M356k5508j7520j9270Q9J3225O6343K7445M1781o4334m0604
$$ 15220 -33579 -39655 -35299 -60807 -78327 -97597 -97508 -84283 -17940 9505 51286 -13048 -53652
21334e3652n799N907O174K5070K0038j9477L5936M4246P454m1443n5445r899P4142
$$ -53652 -59451 -53544 -47370 -22300 -2262 -21739 14197 58443 65897 24454 -30991 -40890 33252
21321C3252q12n1088j8091q745N2630N7623m2202j992N1156j4738n1760m1039
$$ 33252 32440 -18648 -36739 -45484 7146 64769 22567 20575 71731 56993 5233 -35806
21309c5806l1791N8053K8193k164L3485k1886m3725r7243K7468N4053J3912K9446
$$ -35806 -67597 -9544 18649 16485 49970 28084 -15641 -112884 -85416 -31363 -17451 11995
21297A1995j611k1184k9712j0977J194j3270j1431R559K7683M4943J6827j6431
$$ 11995 10384 -10800 -40512 -51489 -50295 -63565 -74996 -65437 -37754 7189 24016 7585
21285G585L6048l5140l0725n8103J7831m176K0319L9519n750k420J0748m435k1794
$$ 7585 43633 8493 -22232 -80335 -62504 -66680 -46361 -6842 -12592 -15012 -4264 -8699 -30493
21272c0493L4988k3618j3140L4910k8674M034M166K6173j8566r6985J4957Q5993
$$ -30493 4495 -19123 -32263 2647 -26027 -21993 -17827 8346 -10220 -107205 -92248 -6255
21260f255L7801l0920j05919j9575L493N1731K6245O2447J1209L3193O1784m7144
$$ -6255 31546 626 -105293 -124868 -121375 -69644 -43399 19048 30257 63450 125234 78090
21248G8090p7088P495J6190J2049P456m5142K8892K8647j1250p522n7176l5528
$$ 78090 1002 8497 24687 36736 44192 -950 27942 56589 45339 37817 -19359 -54887
21236e4887K725K9816L2309k5186N344o793o007K1707M3904j6414q944K77Q961
$$ -54887 -52162 -22346 9963 -15223 -9879 -16672 -22679 -972 42932 26518 17574 17851 26812
21223B6812o4482k812L3699K1607J9429l9075p5618m33N4836K4299O807O7473
$$ 26812 -37670 -40482 -6783 14824 34253 -4822 -80440 -80873 -26037 -1738 5069 72542
21211G2542o555q7300J6754K7876r934l3237m8834P2609N1321n379j7303l3581
$$ 72542 65987 -21313 -4559 23317 13383 -19854 -68688 3921 55242 49863 32560 -1021
21199a021j9424K4006N8067j7382o7512q406k7970L6386K4193K3712j7228m4254
$$ -1021 -20445 3561 61628 44246 -23266 -31672 -59642 -23256 937 24649 7421 -36833
21187c6833J142M2466L2132l9984n6296m360K9497m8275n4057O0810N322L14L7323
$$ -36833 -35691 6775 38907 -1077 -57373 -61733 -32236 -80511 -134568 -73758 -68436 -68122 -30799
21174c0799L6084k211k2344K4814J8575l6297q5767o126L7199Q871J6163k4448
$$ -30799 5285 3074 -19270 5544 24119 -12178 -97945 -104071 -66872 -58001 -41838 -66286
21162f6286J4101N0438R98o9351j9597q815J5982M027m447o202M9198J00344J2385
$$ -66286 -52185 -1747 -749 -70100 -89697 -98512 -82530 -78503 -82950 -89152 -39954 60390 72775
21149G2775M7724k4412o8276m6334L4397j9678M3170r91J2568J231q9922l9403
$$ 72775 120499 96087 27811 -18523 15874 -3804 39366 38375 50943 52174 -37748 -77151
21137g7151M6980Q1358N0093k8106r539l5963K8923o9605p0893j5259M6664J832
$$ -77151 -30171 51187 101280 73174 63635 27672 56595 -13010 -83903 -99162 -52498 -50666
21125e0666J1624M572Q7634R0273n4496m2009k0249q165K3091J578k8105K0888
$$ -50666 -39042 -34470 53164 143437 88941 46932 26683 18518 41609 43187 15082 35970
21113C5970Q3377o5842q548L6538J838k233k4950l7860J7479K3219p9444l8943
$$ 35970 119347 53505 44957 81495 83333 81100 56150 18290 35769 58988 -20456 -59399
21101e9399j6120j9553J3432j7746K6585M2951R243j4907P699j975q77k4017j1965
$$ -59399 -75519 -95072 -81640 -99386 -72801 -29850 -20607 -35514 -27815 -29790 -30667 -54684 -66649
21088f6649k613l6384p5798J5840O3901L3944M2214L6537K1987J0540L193k2898
$$ -66649 -69262 -105646 -181444 -165604 -101703 -67759 -25545 10992 32979 43519 46712 23814
21076B3814n1552p0922L1817K8610L5869K9137J7720L9802p614q0732n2073L5974
$$ 23814 -27738 -98660 -66843 -38233 -2364 26773 44493 84295 76681 -4051 -56124 -20150
21064b0150M8242m7141Q12O611l9882l4537M341L6842O2300J4487R91N28O7721
$$ -20150 28092 -19049 -18237 -11626 -51508 -86045 -81704 -44862 17438 31925 32916 33444 101165
21051A01165o5356o7796N0791N5441L5427Q082k0978l1521m4339p8101r4955L5766
$$ 101165 35809 -31987 18804 74245 109672 117754 96776 65255 20916 -57185 -152140 -116374
21039a16374P0001P8029N7607k5169J0043Q581p8996p3252J556j8358P2744K4506
$$ -116374 -46373 31656 89263 64094 74137 82718 3722 -69530 -67974 -86332 -13588 10918
21027A0918K6156N211m3067L9558M4409j0943m4520k1961m72K0936j3425J3169
$$ 10918 37074 42285 -782 38776 83185 72242 27722 5761 5289 26225 12800 25969
21015B5969L0020m4016P014k5651O837J930m6475l7856k0825L2385M7105m8605
$$ 25969 55989 11973 18987 -6664 173 2103 -44372 -82228 -103053 -70668 -23563 -72168
21003g2168J0783m133J2859j0281n837J9037J9901o9346O421M2983l0932J8186
$$ -72168 -61385 -65518 -52659 -62940 -68777 -49740 -29839 -99185 -92764 -49781 -80713 -62527
20991f2527J0742K1900K2686K5033J2079j1502o2733o4815L4833K3819r91k7633
$$ -62527 -51785 -29885 -7199 17834 29913 18411 -44322 -109137 -74304 -50485 -51476 -79109
20979g9109Q90J15376N8167L0250q269k7731J1568J0819k4932r258n48O457o4048
$$ -79109 -78219 37157 95324 125574 117305 89574 101142 111961 87029 77771 77223 83680 19632
20966A9632k3672o8084J826L6994O2067N3030P906P137l3194q040J7924q555m3328
$$ 19632 -4040 -72124 -70298 -33304 28763 81793 89699 96836 63642 55602 73526 64971 21643
20953B1643m7516p5632m905J0613M7445j2842q117j6414O198J8705K1261Q082
$$ 21643 -25873 -101505 -106410 -95797 -48352 -61194 -69311 -85725 -79527 -60822 -39561 -31479
20941c1479O7765j8538n7403L5448P2928K2843p3922j0160O263j3218O4700J0969
$$ -31479 36286 17748 -39655 -4207 68721 91564 17642 7482 13745 527 65227 76196
20929G6196J2012J6788k2996l2920o0129m5215K3930K9238j9374L6144r225O6695
$$ 76196 88208 104996 82000 49080 -11049 -56264 -32334 -3096 -22470 13674 4449 71144
20917G1144M5537q6360o6972m7440O8443N3100L8449r550l5940n6180K6708k4967
$$ 71144 116681 30321 -36651 -84091 -15648 37452 75901 66351 30411 -25769 939 -24028
20905b4028j8403m0489K1938K7679J264l4937j361Q0731J7255j2941m4635o6486
$$ -24028 -42431 -82920 -60982 -33303 -32039 -66976 -68337 12394 29649 16708 -27927 -94413
20893i4413k6307L0528R5861J3644n829o646j280J1552l4991r566L9502O2119
$$ -94413 -120720 -90192 5669 19313 13484 6838 5558 17110 -17881 -27447 12055 74174
20881G4174l8804J305j2937q2410M9989O5950k8789m0482O900M5508J5908o6963
$$ 74174 35370 36675 23738 -58672 -8683 57267 28478 -12004 -5104 40404 56312 -10651
20869a0651m8412j726M3182J3422J8428M6605J0316k0157L5664K5740o1674n2619
$$ -10651 -59063 -60789 -17607 -4185 14243 60848 71164 51007 86671 112411 50737 -1882
20857a882K8281N275n6668K257p649r800M3070J1796j4305j5282K0356m658m1593
$$ -1882 26399 31674 -24994 -22737 -30386 -40186 2884 14680 375 -14907 5449 791 -40802
20844d0802O6775K5968m9604m415k61j4670k8866n0963m656M9557O7254O9371
$$ -40802 25973 51941 2337 -2078 -2339 -17009 -45875 -96838 -101494 -51937 15317 84688
20832H4688k6567q0392n4952N4316P6484K7354n4585o2095m4289K1899Q0857O2986
$$ 84688 58121 -22271 -77223 -22907 53577 80931 26346 -35749 -80038 -58139 22718 85704
20820H5704q67K5061q3342m7359J1728M4531j1696m2305l450K6222O1123k2603
$$ 85704 84837 109898 26556 -20803 -9075 35456 23760 -18545 -21995 4227 65350 42747
20808D2747p9324K0483J0680l8459p203M3863L3758n0178k5972M031N7785l3278
$$ 42747 -36577 -16094 -5414 -43873 -51076 -7213 26545 -23633 -49605 -45574 12211 -21067
20796b1067j4208K9939n5671L0277P378j5085N8279q19k2991l0765R719N5381
$$ -21067 -35275 -5336 -61007 -30730 -23352 -38437 19842 19023 -3968 -34733 -25014 30367
20784C0367Q767k1302j0006o160k7225k9824K7308N3729K98j286p906J7452m4464
$$ 30367 39134 17832 7826 1666 -25559 -55383 -28075 25654 25952 24666 16760 34212 -10252
20771a0252J0186O4436j0056m8940k5137M0908K0162n7082j6098O2366M0277J0211
$$ -10252 -66 64370 54314 5374 -19763 21145 41307 -15775 -31873 30493 70770 80981
20759H0981j9487l3902j1729M7254M2017K5253K2637j38556p6339P5198j4146
$$ 80981 61494 27592 15863 63117 105134 130387 153024 14468 -61871 13327 -819
20748h19m5823n914r622j6239N164K0871L7590L2944r847J3312L7248j6667J4166
$$ -819 -46642 -52556 -62178 -78417 -73253 -52382 -14792 18152 8305 21617 58865 42198 56364
20735E6364m856K731l8327K6413J645n7560L3856M5617p289o0526Q395N6663q89
$$ 56364 51508 54239 15912 42325 43970 -13590 20266 65883 58594 -1932 6463 63126 62237
20722F2237n5859o850J2087K225K1338R584j0396j238M4546l0121l0055O8580
$$ 62237 6378 -472 11615 13840 35178 44762 34366 33128 77674 47553 17498 86078
20710H6078k857l8353j5755r102j3463P263m5490m4752O2888L3765P7619J3268
$$ 86078 83221 44868 29113 20011 6548 13811 -31679 -76431 -13543 20222 97841 111109
20698A11109o1495k044j8080m4586R369n530L0088L2742L8305k1798l8252j3784
$$ 111109 49614 47570 29490 -15096 -5727 -11257 18831 51573 89878 68080 29828 16044
20686A6044o0938m7576N9288M8812K5145J2553P0604k2675q6835o1577l4446L9517
$$ 16044 -44894 -92470 -33182 15630 40775 53328 123932 101257 14422 -47155 -81601 -42084
20674d2084j767K3130J6226m1987j7159K4578K8640m1135j0253N6981j3463k2763
$$ -42084 -43851 -20721 -4495 -46482 -63641 -39063 -10423 -51558 -61811 -4830 -18293 -41056
20662d1056P0689l1990k5570p802L4112J3235j3343k9173j6839N1370R520q736
$$ -41056 29633 -2357 -27927 -35729 -1617 11618 -1725 -30898 -47737 3633 13153 4417
20650D417j2276j0704P3639N1057q220J569m8194o3984J2560N2744j3113j8464
$$ 4417 -7859 -18563 55076 106133 97913 99482 51288 -12696 -136 52608 39495 21031
20638B1031n1537O0480J0407l3335p672J4701L1410r566n8372k8560J9535q394
$$ 21031 -30506 29974 40381 7046 -626 14075 45485 35919 -22453 -51013 -31478 -39872
20626c9872L4388L1833Q697j525k8207O4677J6265l0202k0948L0453k67j1997
$$ -39872 -5484 26349 35046 33521 5314 69991 86256 56054 35106 65559 65292 53295
20614E3295r675O807m9968m0980L7145M945L3710K2238J4397o324K1433J5849
$$ 53295 43620 50427 459 -40521 -3376 1569 35279 57517 71914 65590 87023 102872
20602A02872l4969k3353P135l221m8892K1286n2708p118K9460o283L5230O786
$$ 102872 67903 44550 51685 48464 -428 20858 -31850 -38968 -9508 -15791 19439 26225
20590B6225K882K0674M2249l6106j29542l581R8070R2744J6538k4282o7466K2739
$$ 26225 29107 49781 92030 55924 -73618 -77199 20871 113615 130153 105871 38405 61144
20578F1144L4757k6384n3917l9394l5297L0155P5944N5515n1567l0592l0937j8841
$$ 61144 95901 69517 15600 -23794 -59091 -28936 47008 102523 50956 20364 -10573 -29414
20566b9414L4305K2063O368l4075k0089P8397L7798k3189q3727k4814J0913n3188
$$ -29414 4891 26954 33322 -753 -20842 57555 95353 72164 -11563 -36377 -25464 -78652
20554g8652j722L0764K831K2665k5885p72n5031l1318K1328N1937P8542L4326
$$ -78652 -80374 -49610 -46779 -24114 -49999 -50771 -105802 -137120 -115792 -63855 14687 49013
20542D9013n6096L9988m7969K1247L4475J1545m3709J6353J0287K9822l1870n2418
$$ 49013 -7083 32905 -15064 6183 40658 52203 8494 24847 35134 64956 33086 -19332
20530a9332K0112K981j5085q5324k4704Q009N3545j5937M0577r590J0788R3171
$$ -19332 780 3761 -11324 -96648 -121352 -113343 -59798 -75735 -35158 -44748 -33960 59211
20518E9211N5998n4093J3369k7261n8191L5385l6652k835j4780L3612M8755K9580
$$ 59211 115209 61116 74485 47224 -10967 24418 -12234 -15069 -29849 3763 52518 82098
20506H2098N8971k1701j6935k8721n1321k7426M7688J73K2339J8377k0103q2902
$$ 82098 141069 119368 102433 73712 22391 -5035 42653 42826 65165 83542 63439 -19463
20494a9463p0838K8633M6880o676L850L1329L5422J0407p862n5665p4919J1647
$$ -19463 -90301 -61668 -14788 -21464 -17614 13715 49137 59544 51682 -3983 -78902 -67255
20482f7255L2752n8201J1616O1444j716k4358q2610o145L1540O6163O6903R38
$$ -67255 -34503 -92704 -81088 -19644 -21360 -45718 -128328 -134473 -102933 -36770 30133 31071
20470C1071J0150j1052l4299n3032M3175O5586n0624q0809N1225K1791k3248M8469
$$ 31071 41221 30169 -4130 -57162 -13987 51599 975 -79834 -28609 -6818 -30066 18403
20458A8403L450j4619l3905j2176l1026M381l7687M3682N1221k3380j380n8721
$$ 18403 21853 7234 -26671 -38847 -69873 -65492 -103179 -59497 -8276 -31656 -33036 -91757
20446i1757p550K5186L4687L0442K8001J0000M9951m0035p2212m4473l9383L8419
$$ -91757 -99307 -74121 -39434 -8992 19009 29009 78960 38925 -33287 -77760 -117143 -78724
20434g8724M9513J0514r766l9899k2208q334L5884K365K6307J06749N1697L60
$$ -78724 -29211 -18697 -28463 -68362 -90570 -98904 -63020 -60655 -34348 72401 124098 124458
20422A24458k9264J4062m6670o3325K7322J4905m6953j8934j156L5747j6109l0828
$$ 124458 95194 109256 62586 -739 26583 41488 -5465 -24399 -25555 10192 -5917 -36745
20410c6745J6741K8149j8745k1163j3536k9045k6439N3877j7096K0736L4885m3300
$$ -36745 -20004 8145 -10600 -31763 -45299 -74344 -100783 -46906 -64002 -43266 -8381 -51681
20398e1681o0069O9533M7274O410n058R597L4119J9867m2423m171J8761o5662
$$ -51681 -111750 -42217 5057 11467 6409 16006 50125 69992 27569 23398 42159 -23503
20386b3503l1291K5169J041O1263N0534n4304J550L4042n7232J1100R461j00809
$$ -23503 -54794 -29625 -28584 32679 83213 28909 30459 64501 7269 18369 27830 -72979
20374g2979l2022k2019J2286J07889N178m0154M0200J9869j0120M7359L3904K0808
$$ -72979 -105001 -127020 -114734 -6845 -1667 -41821 -1621 18248 8128 55487 89391 110199
20362A10199o8380l0796K1908K3342J746N580l9727l2965o920N0217P4391m2151
$$ 110199 41819 11023 32931 56273 58019 63599 23872 -9093 -16013 34204 108595 66444
20350F6444k7396K4156l1098K8079l7471K8489k3187j9869R961n766N816K4291
$$ 66444 39048 63204 32106 60185 22714 51203 28016 8147 18108 12342 18158 42449
20338D2449M7134R087l4063n7499J1260R542k0404o8918l4366P090J0514M2185
$$ 42449 89583 98670 64607 7108 18368 27910 7506 -61412 -95778 -88688 -78174 -35989
20326c5989K6911J4540l9121l4903j2979J3557J6139m3923N9621J16869N1595
$$ -35989 -9078 5462 -33659 -68562 -81541 -67984 -51845 -95768 -36147 80722 132317
20315A32317K5254m0231m6267n1350k7421j9884L8171J9118q9001k0998M1027
$$ 132317 157571 117340 71073 19723 -7698 -27582 10589 29707 -59294 -80292 -39265
20304c9265J0311m7333P8724J7882l3308j1334l432N4960k7788l1998L790M871
$$ -39265 -28954 -76287 2437 20319 -12989 -24323 -27755 27205 -583 -32581 -28791 -23920
20292b3920O2284K9317n1753k6481N6586M2047J0818K1957N717o5055j18019k7682
$$ -23920 38364 67681 15928 -10553 46033 88080 98898 120855 126572 61517 -56502 -84184
20280h4184O2813J2563N0534K3875l7036p7540K0817L8180J4091k2519R401j773
$$ -84184 -21371 -8808 41726 65601 28565 -48975 -28158 10022 24113 1594 10995 9222
20268I222L0830J015J3379J1901q644m2141l5735M5098M0612j4190L8228L9557
$$ 9222 40052 41067 54446 66347 57703 15562 -20173 24925 65537 51347 89575 129132
20256A29132j1681l1021n721p3540m2763K4074M1954L3571J0000m7380l0304k8738
$$ 129132 117451 86430 80709 7169 -35594 -11520 30434 64005 74005 26625 -3679 -32417
20244c2417N927j8063k7037J3472M4328L9255J7866j93r281J7588Q0583K2361
$$ -32417 -26490 -44553 -71590 -58118 -13790 25465 43331 43138 33857 51445 132028 154389
20232A54389q2482k9020O264k3858K6052J4496R69J2516J7730n1341j04555K2700
$$ 154389 71907 42887 49151 25293 51345 65841 66810 79326 97056 45715 -58840 -36140
20220c6140M4l9264j705K0527j0984j9132M3675j6830Q546p929L6746J6024N515
$$ -36140 -36096 -75360 -77065 -56538 -67522 -86654 -42979 -59809 -51263 -59192 -22446 -6422 -907
20207i07O008K0894l0462m0422Q454l6034L5689P2575m07j5320m1439L9342m547
$$ -907 5101 25995 -4467 -44889 -36435 -72469 -36780 35795 35388 20068 -21371 17971 13424
20194A3424j4924n912l5252p973J2923m5063M2325J9037L2993p759k1618L662
$$ 13424 -1500 -7412 -42664 -50637 -37714 -82777 -40452 -21415 11578 3819 -17799 -14137
20182a4137K2828j8929k7952K3158K5465J239J331q755K8645R829O819l2472k7774
$$ -14137 8691 -10238 -38190 -15032 10433 11672 13003 4248 32893 42722 49541 17069 -10705
20169a0705L1797M5599l7430p7989L729L0150j937m6471M8643Q1560N435j194
$$ -10705 21092 66691 29261 -48728 -44999 -14849 -16786 -63257 -14614 66946 72381 71187
20157G1187n9360p4685l6053K4964L9768J1432K2897L2702o619l2776p957L8500
$$ 71187 11827 -62858 -98911 -73947 -34179 -22747 150 32852 26233 -6543 -14500 24000
20145B4000p221n567R276M5603P6450j4389j17800n3015n5358K4425J9594J8120
$$ 24000 16779 11212 20488 66091 142541 128152 10352 -42663 -98021 -73596 -54002 -35882
20133c5882N3090M1528L1460p933l5150o8250r764l7937K1954O3686j0354O9635
$$ -35882 17208 58736 90196 82263 47113 -21137 -30901 -68838 -46884 16802 6448 76083
20121G6083R439J8624l5642l0542K4430K2321K9255j507o599k7321p6839j08609
$$ 76083 85522 104146 68504 37962 62392 84713 113968 112461 105862 78541 1702 -106907
20109a06907q2081r143K0410M8901J04913M8178k8115m3751m4531M0784R889L4299
$$ -106907 -188988 -198131 -177721 -128820 -23907 24271 -3844 -47595 -92126 -51342 -41453 -7154
20097g154O6955L849j1172M4022l3834o412K0839l1920j6992J8548K213q447k8674
$$ -7154 59801 63650 52478 96500 62666 56254 77093 45173 28181 46729 48942 40495 11821
20084A1821M601R949l3296j2896K1416l0341m244p4740k9505O9469R6458L5827
$$ 11821 16422 26371 -6925 -19821 1595 -28746 -32990 -107730 -137235 -67766 28692 64519
20072F4519n3247j3437m6882p5132j3806L9067Q5048M6608J4010p0709n4695L7677
$$ 64519 11272 -2165 -49047 -124179 -137985 -98918 -13870 32738 46748 -23961 -78656 -40979
20060d0979K1459j0312j7295o30K1835J4040K3588P164j5790m424k7949k990P4149
$$ -40979 -19520 -29832 -47127 -47757 -25922 -11882 11706 18870 3080 -1344 -29293 -32283 41866
20047D1866L5752k6104M4332j1514m3617q678k027J2245P4l9329K6799J5201K9921
$$ 41866 77618 51514 95846 84332 40715 32037 30010 42255 42329 3000 29799 45000 74921
20034G4921L0131m2417q910j4328j0213l5444M2595p647o5919k7732L1166L7756
$$ 74921 105052 62635 53725 39397 29184 -6260 36335 28688 -37231 -64963 -33797 3959
20022C959j2403L5655Q824K3948J6376l7164m8901K7709n898n6452L6911k4794
$$ 3959 -8444 27211 36035 59983 76359 39195 -9706 18003 12105 -44347 -7436 -32230
20010c2230Q469l1893o0755q536L7506J6658K6180J9948j904l0420j0157J872
$$ -32230 -23761 -55654 -116409 -124945 -87439 -70781 -44601 -24653 -26557 -56977 -67134 -65262
19998f5262L8853J3067p377l6696m0815P1408P6939m069L1062j6144j5692o373
$$ -65262 -26409 -13342 -20719 -57415 -98230 -26822 50117 46048 77110 60966 45274 38901
19986C8901k8409j991R053n172N943l627j9331L2991L6537M5811K560j7933m7165
$$ 38901 10492 8501 17554 12382 18325 14698 -4633 28358 64895 110706 113266 95333 48168
19973D8168M0774K5347L925L0140n4757j45240m218M9247k6095j0333M1456N1236
$$ 48168 88942 114289 118214 148354 93597 -51643 -55861 -6614 -32709 -43042 -1586 49650
19961D9650J9124k2725n6109k9908J4911L5454L4191j3982J5579O41K2487L2697
$$ 49650 68774 46049 -10060 -39968 -25057 10397 44588 30606 46185 46826 69313 102010
19949A02010k3936O50J2145O630o0252o555M5487o687p098l6741Q3007k4730o7493
$$ 102010 78074 78724 90869 97499 37247 30692 76179 69492 62394 25653 108660 83930 16437
19936A6437j6225J277p295O361O4747K9778r3732p3980K9419J6820p882L5249
$$ 16437 212 1489 -5806 555 65302 95080 1348 -72632 -43213 -26393 -34275 974
19924I74n220L6533L1046j896k6861k4210L103l2521j1459J9593M3357P926K3851
$$ 974 -4246 32287 63333 61437 34576 10366 13469 -19052 -30511 -10918 32439 40365 64216
19911F4216O3305j3827k0144m8243m8364N8283K3535J2955j9936q197k3865k9578
$$ 64216 127521 113694 93550 45307 -3057 55226 78761 91716 71780 63583 39718 10140
19899A0140p30J6315k946m3461K8882O0349N2049R327m5112n7993J4507N357K1673
$$ 10140 9410 25725 22779 -20682 8200 68549 120598 129925 84813 26820 41327 46684 68357
19886F8357J835p2915J0867P7253m1610m0885J2850K3391k5497K9572P11K0531
$$ 68357 70192 -2723 8144 85397 43787 2902 15752 39143 13646 43218 43929 64460
19874F4460k1389J9783J8522j1609k5812j2131j4070m1525q493N0720J1580M0868
$$ 64460 43071 62854 81376 69767 43955 31824 17754 -23771 -32264 18456 30036 70904
19862G0904n9329q9962M7401N9952k6336n7833K379J7212j4952j531N8262K9672
$$ 70904 11575 -78387 -30986 28966 2630 -55203 -52824 -35612 -50564 -52095 6167 35839
19850C5839k2392k0159P4849O0076l5293p6819l9576j306L4404K3735k663L5483
$$ 35839 13447 -6712 68137 128213 92920 16101 -23475 -24781 9623 33358 30695 66178
19838F6178P6415j0568p7059j9351L373M050Q812K9031l0849m6249N6783M508
$$ 66178 142593 132025 54966 35615 38988 43038 51850 80881 50032 3783 60566 65074
19826F5074N0946J4989n0999m3435j3482O2043K6217j2844p212m939K216j00676
$$ 65074 116020 131009 80010 36575 23093 85136 111353 98509 91297 86358 88574 -12102
19814a2102m2566Q8762j765l838K8224k6908j21717o200L8137L9241m767m8138
$$ -12102 -54668 34094 32329 28491 56715 29807 -91910 -98110 -59973 -20732 -25499 -73637
19802g3637K4249M0168j3383N52K8465l3179n965J6729o919l1490k4259P0786
$$ -73637 -49388 -9220 -22603 -22051 6414 -26765 -32730 -16001 -22920 -54410 -78669 -7883
19790g883J9245M3084R6384q3193j04333k6542m1873J08570N7131J6397k5970
$$ -7883 11362 54446 150830 67637 -36696 -63238 -105111 3459 60590 76987 51017
19779E1017O321K6430N925k7462j220j7127l6319K1970l3250l1370m1702L147
$$ 51017 57338 83768 89693 62231 61011 43884 7565 29535 -3715 -35085 -76787 -73640
19767g3640J4180K4813o705m2021m4431P374O6773L2877o187M633J6464M5213
$$ -73640 -59460 -34647 -41352 -83373 -127804 -120430 -53657 -20780 -26967 -22334 -5870 39343
19755C9343L4097n8671j6667k3392j4625M9635M1239j7057n902o6282k2946k8522
$$ 39343 73440 14769 -1898 -25290 -39915 9720 50959 33902 28000 -38282 -61228 -89750
19743h9750K5380N1915N4005M1201k9639k4484m5628L2848k3720n3521K9525L2370
$$ -89750 -64370 -12455 41550 82751 53112 28628 -17000 15848 -7872 -61393 -31868 502
19731E02L1022j8290j3422N1159P0158j8710o0021l2519L6607k3049p9287j7757
$$ 502 31524 13234 -188 50971 121129 102419 42398 9879 46486 23437 -55850 -73607
19719g3607P7942K3053r490Q492m3828l5721n176K5926J01368L1118O6927n1651
$$ -73607 4335 27388 17898 26390 -17438 -53159 -58335 -32409 68959 100077 167004 115353
19707A15353o0785k9970J6858J7307K7894n388N042n6805l6035M9745J7528j6774
$$ 115353 54568 24598 41456 58763 86657 81269 86311 29506 -6529 43216 60744 43970
19695D3970k3703Q199l034l2985O6010J2967l1513j3607l4407k6265l0620q723
$$ 43970 20267 28466 25432 -7553 58457 71424 39911 26304 -8103 -34368 -64988 -73711
19683g3711o040l2220O317L2649Q820P076J8426L5390K1113l0642k3188N5839
$$ -73711 -79751 -111971 -105654 -73005 -64185 -57109 -38683 -3293 17820 -12822 -36010 19829
19671A9829K6922m488K746j4614j3596P339o1488p384O590P8707Q1507j6573k282
$$ 19829 46751 42263 45009 30395 16799 24138 -37350 -44734 -38144 40563 122070 105497 103215
19658A03215K7900L4522q5368o1759M447j490k5910m724J7729J1008J9035j3682
$$ 103215 131115 165637 80269 18510 22957 21467 -4443 -9167 8562 19570 38605 24923
19646B4923o4665n9754K3667Q714Q4514Q1712J1479o9513q5987j1047Q0289J3840
$$ 24923 -39742 -99496 -75829 -67115 17399 99111 110590 41077 -44910 -55957 24332 38172
19634C8172n0885j4861Q6997K2618J2662L1087M0377l7582l2774o7216L7778L6936
$$ 38172 -12713 -27574 59423 82041 94703 125790 166167 128585 95811 28595 66373 103309
19622A03309n6103k2744J4276j5123r089N5460J1118n3442o2617k0581R8504L9482
$$ 103309 47206 24462 38738 23615 14526 69986 81104 27662 -34955 -55536 42968 82450
19610H2450m0214l7766M862k3437L3927J6460l0358L9076J8750r249n2003K7746
$$ 82450 42236 4470 9332 -14105 19822 36282 5924 45000 63750 54501 2498 30244
19598C0244N2716P356l5521q733k2264O5334P1053l7376n4202J1597K3511K9884
$$ 30244 82960 90316 54795 46062 23798 89132 160185 122809 68607 80204 103715 133599
19586A33599J4703J2069m217q9472o9644m0410k9333N30J07979N6266l6040J317
$$ 133599 148302 160371 156154 66682 -2962 -43372 -72705 -72175 35804 92070 56030 57347
19574E7347j9427k8838m9289J3662J5862l4997J6129K7833L4104l1347k9511k1573
$$ 57347 37920 9082 -40207 -26545 -10683 -45680 -29551 -1718 32386 1039 -28472 -50045
19562e0045K2969M0854M5457k6828J2828N2112K2930m7614L7065K7130p5610q646
$$ -50045 -27076 13778 59235 32407 45235 97347 120277 72663 109728 136858 61248 52602
19550E2602O746M5786o249j8419k2116m4291L3505Q1154m4031m1155k2579l3687
$$ 52602 59348 105134 98885 80466 58350 14059 47564 128718 84687 43532 20953 -12734
19538a2734j4197l7022q955J1857P3933M3460l2053m695j6771m7443J1653R4629
$$ -12734 -26931 -63953 -72908 -61051 12882 56342 24289 19594 2823 -44620 -32967 61662
19526F1662M9418K452M377k4886n9815Q565j0405k2939j7040J4998k1695L2271
$$ 61662 111080 113532 117909 93023 33208 41773 31368 8429 -8611 6387 -15308 16963
19514A6963J6012j2992n8305j4825J7806k071M3690n4748l7241O3846Q1382L6485
$$ 16963 32975 19983 -38322 -53147 -35341 -37412 6278 -48470 -85711 -21865 59517 96002
19502I6002K9617m730p5498k0373N2697R5395J2348k3782J9556l6148o3783j9813
$$ 96002 125619 120889 45391 25018 77715 173110 185458 161676 181232 145084 81301 61488
19490F1488P9727l5739j6781k1083m5675k3608q319N734l793k4275o441p497O041
$$ 61488 141215 105476 88695 67612 21937 -1671 -9990 -4256 -8049 -32324 -38765 -46262 -40221
19477d0221K3310N349m4337j2945N927N6452j3660K56n7291m7830o51O3806j5469
$$ -40221 -16911 -11562 -55899 -68844 -62917 -6465 -20125 -19869 -77160 -124990 -125641 -61835 -77304
19464g7304M842O7582P6618N7753j4092L5045j4576K9962R8j6751k1273J0623
$$ -77304 -72462 -4880 71738 129491 115399 150444 135868 165830 165928 149177 127904 138527
19452A38527k1976m3939j7214M5678K3906L9403j4287K1626r405m4569J4286l5473
$$ 138527 116551 72612 55398 101076 124982 164385 150098 171724 162319 117750 132036 96563
19440I6563l2718p2892j1906N8349Q845J7058K346J3630n3087m6899Q329L3882
$$ 96563 63845 -9047 -20953 37396 46241 63299 65645 79275 26188 -20711 -12382 21500
19428B1500P606j0956J5155n3014j1363p432P0709Q9203j1899m6282N3266j219
$$ 21500 29106 18150 33305 -19709 -31072 -38504 32205 121408 109509 63227 116493 115274
19416A15274j6872J1533n0890l6039L7633K5158k0705R735K7776l7010m4086j9772
$$ 115274 98402 109935 59045 23006 60639 85797 65092 74827 102603 65593 21507 1735
19404A735M0228K7783M3475J9420R363m088K6567k6011r1536J6190L3944O6346
$$ 1735 41963 69746 113221 132641 142004 137916 164483 138472 46936 63126 97070 163416
19392A63416K6280l3171N6426p817k515l9344L972j8872J5225k4561k6769r025
$$ 163416 189696 156525 212951 205134 202619 163275 167247 148375 163600 139039 112270 103245
19380A03245J660j7540k6059m5459k9566J1260l7189j8359K0400K2288K6599m776
$$ 103245 104905 87365 61306 15847 -13719 -2459 -39648 -58007 -37607 -15319 11280 6504
19368F504K4814j1636L2106N3559M3432k4033L412L2810K8876k9346m7651o7798
$$ 6504 31318 19682 51788 105347 148779 124746 128158 160968 189844 160498 112847 45049
19356D5049m5661q1066L9785L0212m117N3195K1999N8049n283k9611L6404Q033
$$ 45049 -612 -81678 -41893 -11681 -15798 37397 59396 117445 112162 82551 118955 126988
19344A26988j5257j3539R163P1927M1181q9923J5119k0941o2913j8132K5513O6464
$$ 126988 111731 98192 107355 179282 220463 130540 145659 124718 61805 43673 69186 135650
19332A35650J0135l8995j6257o7776k1696M812k0485j8525M2169L4444k9280l0824
$$ 135650 145785 106790 90533 22757 1061 5873 -14612 -33137 9032 43476 14196 -16628
19320a6628L4893M6323Q8461L2454K660m2824j6888m1688j9799j6260n6006N932
$$ -16628 18265 64588 153049 185503 188163 145339 128451 86763 66964 50704 -5302 630
19308F30J10228j0067m2620j2411M4416R763j4597k8803R942J0793K9690M8567
$$ 630 110858 100791 58171 45760 90176 99939 85342 56539 66481 77274 106964 155531
19296A55531N0653l0244o2347l6679l6774K0677Q717Q83k3926j5685j4188J1673
$$ 155531 206184 175940 113593 76914 40140 60817 69534 70417 46491 30806 16618 28291
19284B8291Q496j5852N2699R112J3352m177k7004l204K7932O8841j9214l0439
$$ 28291 36787 20935 73634 82746 96098 91921 64917 61713 89645 158486 139272 108833
19272A08833k3259k2422J2449J670k756P9541J560j05657j628J7024l935J7629
$$ 108833 85574 63152 75601 77271 74515 154056 155616 49959 48331 65355 61420 79049
19260G9049R131k5287l6791M3483n635j2351L6396K0515L2967L5291l736k1898
$$ 79049 88180 62893 26102 69585 63950 51599 87995 108510 141477 176768 173032 151134
19248A51134p7806l4752j8725k3756l7883O1849N3393l5363k1404M090J0945M3159
$$ 151134 73328 38576 19851 -3905 -41788 20061 73454 38091 16687 20777 31722 74881
19236G4881J0450k3324n1368M5062K0538L7754K3749L557M4419J7553q936j8478
$$ 74881 85331 62007 10639 55701 76239 113993 137742 141299 185718 203271 194335 175857
19224A75857l3957m5501k1028n66j1996m7450l2940O4923l7431k2980k731K240
$$ 175857 141900 96399 75371 74805 62809 15359 -17581 47342 9911 -13069 -15800 -13560
19212a3560Q268J5734L0057L8327r11k2919J7955N049q1192j5181P0015M0629
$$ -13560 -5292 10442 40499 78826 77915 54996 72951 78000 -3192 -18373 51642 92271
19200I2271j747M2200K2903j7064L28L5021l6364q6518P970k7068J7369J6481
$$ 92271 90524 132724 155627 138563 138891 173912 137548 51030 59000 31932 49301 65782
19188F5782L8610R237j5421L090J5819K5357J9367L5846L881j9513m0519l9251
$$ 65782 104392 113629 98208 101298 117117 142474 161841 197687 201568 182055 141536 102285
19176A02285l0213J9325K5872j271j9935j1688j870J4002P0865k0940j2952k1090
$$ 102285 72072 91397 117269 115998 96063 84375 82505 96507 167372 146432 133480 112390
19164A12390r643l949k5827N3303M6341k2388N6259N894n2267J6057n7430m9962
$$ 112390 102747 98798 72971 126274 172615 150227 206486 212380 160113 176170 118740 68778
19152F8778K7506L6180J2087K077p1174L9756O388N2161j1041L8194L9075k4402
$$ 68778 96284 132464 144551 146628 75454 115210 121598 173759 162718 200912 239987 215585
19140B15585p1595K5867n105p9785K0240M4892L382j0282m0285p0779J9783L5225
$$ 215585 143990 169857 164752 84967 105207 150099 153481 143199 102914 32135 51918 87143
19128H7143J4109K4053L9557K1937J313o6118n5613M1473M3029J2774J5658k6197
$$ 87143 101252 125305 164862 186799 188112 121994 66381 107854 150883 163657 179315 153118
19116A53118J9926r269j8186l3144o383j5240k3416M784n32n9697n2434J2071
$$ 153118 173044 163775 145589 112445 106062 90822 67406 72190 71658 11961 -40473 -28402
19104b8402M1215j0344j383P550L3369O579R636q39j0510N845O1423L6178n3124
$$ -28402 12813 2469 1086 8636 42005 48584 58220 57381 46871 52716 114139 150317 97193
19091I7193j0267q075K7457p786M6328J9387j2210N9582p588l7502N4571j5430
$$ 97193 86926 78851 106308 98522 144850 164237 152027 211609 204021 166519 221090 205660
19079B05660p3241k8323j4214l7901J5258P4845J2861m2294M035L670J0688j2750
$$ 205660 132419 104096 89882 51981 67239 142084 154945 112651 116686 120356 131044 118294
19067A18294P6736O758N607k0424q0781k1419k534J2310O9151J34455R9988P9604
$$ 118294 195030 201788 207395 186971 106190 84771 82237 94547 163698 298153 398141 477745
19055D77745K1215J12834Q6644J0914O237j5788J7082l6622j2296N5923R0249
$$ 477745 498960 611794 698438 709352 715589 699801 716883 680261 667965 723888 814137
19044H14137j0582j7575l0836r0309m3594l8665k4802k4088N1884P3278N8453
$$ 814137 803555 785980 755144 664835 621241 582576 557774 533686 585570 658848 717301
19033G17301k7880j7410l242q8511m8404m736n8966j0596P7096M1263p9446p6541
$$ 717301 689421 672011 668769 580258 531854 527118 468152 457556 534652 575915 496469 419928
19021D19928m2814n902m7328k3722j4382j2172j0750k5326L3110Q5111J07331
$$ 419928 377114 371212 323884 300162 285780 273608 262858 237532 270642 355753 463084
19010D63084N6971N1093J00197O2357p3861o4668K8930j1562N3515R6525J1720
$$ 463084 520055 571148 671345 733702 659841 595173 624103 612541 666056 762581 774301
18999G74301k1399L1156M1429Q6658L2232P145N1699P1556L901J9793J9935q1366
$$ 774301 752902 784058 825487 912145 944377 951522 1003221 1074777 1078678 1098471 1118406 1037040
18987A037040q5480j52232j03035l6831o2177P135K1378j3628m5090l0827l7940
$$ 1037040 951560 799328 696293 659462 597285 604420 625798 612170 567080 536253 498313
18976D98313n9061n9736K0414K6188l1704R504K7921J6750n5809m2429n2968o4604
$$ 498313 439252 379516 399930 426118 394414 403918 431839 448589 392780 350351 297383 232779
18964B32779N62m8012M2956Q114p1267L9339O3724J7164j866q653K1481n4030
$$ 232779 233341 185329 228285 236399 165132 204471 268195 285359 283493 274840 296321 242291
18952B42291l3167j5586L3634K5056j1297K475R921l0787j0425M9763l9664k7472
$$ 242291 209124 193538 227172 252228 240931 243406 253327 222540 212115 261878 222214 194742
18940A94742l396o6035m2873K305O6364j1758J9362J4931N920M8820K7893J6762
$$ 194742 191346 125311 82438 84743 151107 139349 158711 173642 179562 228382 256275 273037
18928B73037L203N3200l4250m8601n7431j2293R199K4664j7055j6396O7141M1299
$$ 273037 276240 329440 295190 246589 189158 176865 186064 210728 193673 177277 244418 285717
18916B85717k0725l7954j0673M9334O9119Q0395k056l7499m5734J0555n5229k8476
$$ 285717 264992 227038 216365 265699 334818 415213 413157 375658 329924 340479 285250 256774
18904B56774p611j9463j2517M6321j8149L2699m8743l3234P1111K1305j9503p8856
$$ 256774 249163 229700 217183 263504 245355 278054 229311 196077 267188 288493 268990 190134
18892A90134J1912k3461K6649K5339J9824k1697k946j6700J8932k1786J1235J932
$$ 190134 202046 178585 205234 230573 250397 228700 225754 209054 227986 206200 217435 219367
18880B19367L6807n1182m6320L4466R8845n8608j7974m8219M4353k1732L0598
$$ 219367 256174 204992 158672 193138 291983 233375 215401 167182 211535 189803 220401
18869B20401K6139q880L902M1532K6835R2802j91l8117K7035j7806O6290Q3860
$$ 220401 246540 237660 241562 283094 309929 402731 402540 364423 391458 373652 439942 523802
18857E23802o2952j303L0644P42Q415N6529L7416m928M856l6848l0572n7409r8049
$$ 523802 460850 459547 490191 490933 499348 555877 593293 588365 593221 556373 525801 468392 370343
18844C70343K7370N8386J9396J3422m5723j270L4100K5290l9463r1928n0855K6333
$$ 370343 397713 456099 475495 488917 443194 441924 476024 501314 461851 369923 319068 345401
18832C45401K5763k9099J1748J6375m0280O254N85k5030R153N9566l0037M483
$$ 345401 371164 342065 353813 370188 329908 336162 336747 311717 320870 380436 350399 354882
18820C54882P9170R6003J30438J52166M9624j54K3940N9700l6189k9541N4748
$$ 354882 434052 530055 660493 812659 862283 862129 886069 945769 909580 880039 934787
18809I34787N4135J00853J55809R5907N6922k7742q0221q5954k9327k7796p5661
$$ 934787 988922 1089775 1245584 1341491 1398413 1370671 1290450 1204496 1175169 1147373 1071712
18798A071712n5062J0666Q1739L9187l1547o8264j08123m9268n7614j55555j9737
$$ 1071712 1016650 1027316 1109055 1148242 1116695 1048431 940308 891040 833426 677871 658134
18787F58134j2456k6274K288O511m7910k2156l7733l0499J1378l4588L056j7843
$$ 658134 645678 619404 621692 628203 580293 558137 520404 489905 501283 466695 469751 451908
18775D51908J8045M683m168N8817J40951L4824J4547L8592J07374L4929J39263
$$ 451908 469953 474636 470468 529285 670236 705060 719607 758199 865573 900502 1039765
18764A039765J10947J21469Q2509J1750m5881j25884j23836o5088r731K4873k7113
$$ 1039765 1150712 1272181 1354690 1366440 1320559 1194675 1070839 1005751 996020 1020893 993780
18753I93780K0307N2069O1195O1507M313j05914q0130k8015r371m3528k5839p7755
$$ 993780 1014087 1066156 1127351 1188858 1193171 1087257 1007127 979112 969741 926213 900374 822619
18741H22619q7507o2142R302N1132K5107J9561L2354M0021K9245j3947j4417n6896
$$ 822619 735112 672970 682272 733404 758511 778072 810426 850447 879692 865745 851328 794432
18729G94432k0388r722l9019l7202n4216k3918Q946J7446k0956k2132N074M8548
$$ 794432 774044 764322 725303 688101 633885 609967 618913 636359 615403 593271 598345 646893
18717F46893o738J8972m9831m2551K2153K3449K8246O1128L71k7267m2480N2639
$$ 646893 640155 659127 609296 566745 588898 612347 640593 701721 702092 674825 632345 684984
18705F84984R4052J2679L7024P1319R1957J67129J31643J81005L11858L92711
$$ 684984 779036 791715 828739 900058 992015 1159144 1290787 1471792 1783650 2176361
18695B176361M41720O22786P67516Q05645N83917M47626L47617J36887m11294
$$ 2176361 2618081 3240867 4008383 4814028 5397945 5845571 6193188 6330075 5918781
18686E918781p01784j82000L70696P52328Q37746Q31019R20231O33102l30782
$$ 5918781 5216997 5034997 5405693 6158021 6995767 7826786 8747017 9380119 9049337
18677I049337j210056j225222r73943p13754o11888m74733l05690l6048L3368
$$ 9049337 7839281 6614059 5640116 4926362 4314474 3839741 3534051 3498003 3531371
18668C531371O2311O5422J0821j55054l17393l75991k53181j60153j19898j37747
$$ 3531371 3593682 3659104 3669925 3514871 3197478 2821487 2568306 2408153 2288255 2150508
18658B150508l4813P28K5635M4293Q0809J25861K65332M07375M99374N99528O60575
$$ 2150508 2115695 2116423 2142058 2186351 2267160 2393021 2658353 3065728 3565102 4164630 4825205
18647D825205O75773O18039L73063J69448l0904P9828L87073O00011O66738P83819
$$ 4825205 5500978 6119017 6492080 6661528 6630624 6710452 7097525 7697536 8364274 9148093
18637I148093R60308J088091Q05652k62580n58171p8123K5864j74559j39642j96741
$$ 9148093 10108401 11196492 12002144 11739564 11181393 11103270 11129134 10954575 10814933 10618192
18627A0618192l12941q29176j696375j570614r95813o99980m94452k87808k37858
$$ 10618192 10305251 9476075 7779700 6209086 5213273 4513293 4018841 3731033 3493175
18618C493175j19834j2999N554O6956M3214j132j22245k18408k27231j56107l7976
$$ 3493175 3373341 3360342 3365896 3432852 3476066 3474934 3352689 3134281 2907050 2750943 2712967
18607B712967m8769o2090p5409j09928j16645N5825R2857k7986k0404J6126o9076
$$ 2712967 2664198 2602108 2526699 2416771 2300126 2355951 2448808 2420822 2400418 2416544 2347468
18596B347468j7362L794l0061l9804K2105O3018N6560L3856L3998M7899O0935
$$ 2347468 2330106 2333900 2303839 2264035 2286140 2349158 2405718 2439574 2473572 2521471 2582406
18585B582406k0427q801J22006J10919R3767J82113J92800K16724K21508J92626
$$ 2582406 2561979 2553178 2675184 2786103 2879870 3061983 3254783 3471507 3693015 3885641
18575C885641K14700K50512K42142L25137L96287M59618M40000N75441O83247
$$ 3885641 4100341 4350853 4592995 4918132 5314419 5774037 6214037 6789478 7472725
18566G472725P03031J009487J386098K024773L002023M230938N699021P794753
$$ 7472725 8175756 9185243 10571341 12596114 15598137 19829075 25528096 33322849
18558C3322849R958712J1667791J3527514J4391143J0824472M417547K914693
$$ 33322849 43281561 54949352 68476866 82868009 93692481 98110028 101024721
18551A01024721j39886j1052870j2089334j641601Q459021J5219904J7987927
$$ 101024721 100884835 89831965 77742631 76101030 84560051 99779955 117767882
18544A17767882J7752096J5097866P830222n081017j7738955k1275261j9304469
$$ 117767882 135519978 150617844 158448066 153367049 135628094 114352833 95048364
18537I5048364j3177146j0594305j0312273o180070j557080J168917J736418J426037
$$ 95048364 81871218 71276913 60964640 54784570 53227490 54396407 56132825 57558862
18529E7558862J208164o14748n482167p948123n910301l823342k628439j669021
$$ 57558862 58767026 58152278 52670111 44721988 38811687 34988345 32359906 30690885
18521C0690885q82957k59282J92201P46725J802422L235459N499013R062870J2153148
$$ 30690885 29807928 29548646 29740847 30487572 32289994 35525453 41024466 50087336 62240484
18512F2240484J2305816J1359093J1987943J1193986K934077n640943l003266
$$ 62240484 74546300 85905393 97893336 109087322 112021399 106380456 103377190
18505A03377190M603226J1220892J5353099J7438116J7125190J9269614K2133477
$$ 103377190 107980416 119201308 134554407 151992523 169117713 188387327 210520804
18498B10520804J1023496j7264421j6786321P1600N457249L897253L73113j078298
$$ 210520804 221544300 204279879 187493558 187565158 193022407 196919660 197292773 196214475
18490A96214475o594585k1167549l5112138l1014411j9926982j2872062q851558
$$ 196214475 189619890 168452341 133340203 102325792 82398810 69526748 60675190
18483F0675190o149158m188827k328653p06559L19736M36577K43661J08799p33648
$$ 60675190 54526032 50337205 48008552 47301993 47621729 48058306 48301967 48410766 47677118
18474D7677118l546478n197834m125608k767626j895133j359904j173026j101022
$$ 47677118 44130640 38932806 34807198 32039572 30144439 28784535 27611509 26510487
18466B6510487j050081j049680j283567j013031n47777k90048j82955j83904k43762
$$ 26510487 25460406 24410726 23127159 22114128 21566351 21276303 21093348 20909444 20665682
18457B0665682n98700j179081j513161j276964r26337p00933n41933m02219j87806
$$ 20665682 20066982 18887901 17374740 16097776 15171439 14470506 13928573 13526354 13338548
18448A3338548l22514m15591l08259l93006n82270n73116m38020m23174l61171
$$ 13338548 13016034 12600443 12292184 11899178 11316908 10743792 10305772 9882598 9521427
18439I521427l04934k54339j85746j93477j40376j52068j05213k7994L8197k5372
$$ 9521427 9216493 8962154 8776408 8582931 8442555 8290487 8185274 8157280 8195477 8170105
18429H170105O5366J75974K36904P2093p3928Q3963L25051L93981M81292N68170
$$ 8170105 8235471 8411445 8648349 8720442 8646514 8730477 9055528 9449509 9930801 10498971
18419A0498971Q07009J195841J213126P45064M17687L07909J36310n68079j709424
$$ 10498971 11305980 12501821 13714947 14460011 14877698 15185607 15321917 14753838 13044414
18410A3044414j913017j312854p17331k28471O8320J98265K79763J79230k20635
$$ 13044414 11131397 9818543 9101212 8872741 8941061 9139326 9419089 9598319 9377684
18401I377684o66530p88421n88210o07369n54389m85238l78037l27763k28743
$$ 9377684 8711154 7922733 7334523 6727154 6172765 5687527 5309490 4981727 4752984
18392D752984j37170j10557r3832k4842m1196p716O8149Q9004R6906J49095J12121
$$ 4752984 4615814 4505257 4411425 4386583 4345387 4337671 4405820 4494824 4591730 4740825 4852946
18381D852946J16412K69839L62081M22763M26608K96680L54548L30720J35697
$$ 4852946 4969358 5239197 5601278 6024041 6450649 6747329 7101877 7432597 7568294
18372G568294K40621N34242P87732R55403J110273J030642R14953R13502J128280
$$ 7568294 7808915 8343157 9130889 10086292 11196565 12227207 13142160 14055662 15183942
18363A5183942J302102K328276M004684N338025O543119Q109104Q011029N592663
$$ 15183942 16486044 18814320 22819004 28157029 34700148 42809252 50820281 56412944
18355E6412944K033945N59018l254947p500053l198054L170791P374241R477352
$$ 56412944 58446889 59005907 55750960 48250907 45052853 48223644 55597885 65075237
18347F5075237J1005435J0456510N801070l509477p149837j0613713j5462661
$$ 65075237 76080672 86537182 92338252 88828775 81678938 71065225 55602564
18340E5602564j1486112o510739l237034m96634J728253K443259J949629J598694
$$ 55602564 44116452 37605713 34368679 33872045 35600298 38043557 39993186 41591880
18332D1591880J086014j711300n969621n670671l499642k017047j110812m96407
$$ 41591880 42677894 40966594 34996973 29326302 25826660 23809613 22698801 22202394
18324B2202394m5617K79967P88342J532044K753153L738037L821847M200441M845436
$$ 22202394 22156777 22436744 23225086 24757130 27510283 31248320 35070167 39270608 44116044
18315D4116044M160425J050075N45703L729216P234392J0832051J4758133J6783394
$$ 44116044 48276469 49326544 49872247 53601463 60835855 71667906 86426039 103209433
18307A03209433J8330151K2514060K6482539K0380472J0185614N535319P000765
$$ 103209433 121539584 144053644 170536183 190916655 201102269 206637588 213638353
18300B13638353M564611j6562483m2137268l5915388j9351494q238424j535204
$$ 213638353 218202964 201640481 159503213 123587825 104236331 95997907 94462703
18293I4462703J851686L892391N126286K179849n718866r446329p388376j0067104
$$ 94462703 96314389 100206780 105333066 107512915 101794049 92347720 84959344 74892240
18285G4892240j3344305r589576o033750m243915l007122k159054j698235j567866
$$ 74892240 61547935 51958359 45924609 41680694 38673572 36514518 34816283 33248417
18277C3248417j338355r82723p46357n50664k18535J90942O52578J254097K325792
$$ 33248417 31910062 30927339 30180982 29630318 29411783 29602725 30255303 31509400 33835192
18268C3835192M236355O780095Q292304P647669O715903O653318M872307r05785
$$ 33835192 38071547 44851642 53143946 60791615 67507518 74160836 79033143 78127358
18260G8127358j547897N449775J1036127J3502666J5159826J5093236J0393550
$$ 78127358 76579461 82029236 93065363 106568029 121727855 136821091 147214641
18253A47214641M30580m168681j0745581j2768783q931696j2129864j9747754
$$ 147214641 147645221 143476540 132730959 119962176 111030480 98900616 79152862
18246G9152862j6516982j0294973o520361m090440k142422p31916k59192k43648
$$ 79152862 62635880 52340907 45820546 41730106 39587684 38855768 38596576 38352928
18238C8352928j71629o17615k252437l119718k154799j213756n09525J92859J057598
$$ 38352928 38181299 37563684 35311247 32191529 30036730 28822974 28313449 28506308 29563906
18229B9563906K404467M553616O930992P688286O508009N699186M851121O20664
$$ 29563906 31968373 36521989 43452981 51141267 57649276 63348462 68199583 68820247
18221F8820247o108190n460233J019769Q068180J2686988J2280354R763186Q591386
$$ 68820247 62712057 57251824 58271593 66339773 79026761 91307115 101070301 109661687
18213A09661687M514989r964356k1019180j5158755o415325n51231J857410J827992
$$ 109661687 114176676 104212320 83193140 68034385 61619060 61067829 62925239 64753231
18205F4753231J962095J402742l782729j1425334j0843069o965985m603788l200738
$$ 64753231 66715326 68118068 64335339 52910005 42066936 35100951 30497163 27296425
18197B7296425k151729j378329q88045n53675j28014M61337J441878K642769L533659
$$ 27296425 25144696 23766367 22878322 22324647 22196633 22657970 24099848 26742617 30276276
18188C0276276L389415K775351K465281J472189k390159n622814m462552k330336
$$ 30276276 33665691 36441042 38906323 40378512 37988353 32365539 27902987 25572651
18180B5572651q40998L37895J737159L664367N855533P780037J0076038J2990478
$$ 25572651 24731653 25069548 26806707 30471074 36326607 44106644 54182682 67173160
18172F7173160J3899721J0220403N266936L666937j400609j0932673j5327390
$$ 67173160 81072881 91293284 96560220 100227157 98826548 87893875 72566485
18165G2566485j2977233q759039p227793p166457n949340m141033k807756k043010
$$ 72566485 59589252 50830213 43602420 36435963 30486623 26345590 23537834 21494824
18157B1494824j497719r33788k59985N42625J344523J614521J341864J033525
$$ 21494824 19997105 19063317 18803332 19345957 20690480 22305001 23646865 24680390
18149B4680390Q56100l04619k844530l392865k391710j686205j190807q25476
$$ 24680390 25536490 25231871 22387341 18994476 16602766 14916561 13725754 12900278
18141A2900278o35387l96511r8142K73332P20492J381276J846153J770132J567061
$$ 12900278 12264891 11868380 11770238 12043570 12764062 14145338 15991491 17761623 19328684
18132A9328684J566830J047244o97647j653768k39165J650621K623603K450280
$$ 19328684 20895514 21942758 21245111 19591343 19352178 21002799 23626402 26076682
18124B6076682K048019J803140K12690l483018m428151k476945o87465K13717
$$ 26076682 28124701 29927841 30140531 26657513 22229362 19752417 19064952 19278669
18116A9278669M32658N59949P31626r6372j155314O785K866760P404613J2398928
$$ 19278669 19711327 20271276 21002902 20906530 19751216 19758001 22624761 30029374 42428302
18107D2428302J2631087Q786772P934807Q107252k164785k2809049j7980962r179293
$$ 42428302 55059389 63846161 71780968 79888220 77723435 54914386 36933424 27754131
18099B7754131n613671l811109k643310j875281j359576j015808q23012o98256
$$ 27754131 22140460 18329351 15686041 13810760 12451184 11435376 10612364 9914108
18091I914108o14471m53716m33682m14114l59296l27300l22801k69421k59866
$$ 9914108 9299637 8845921 8412239 7998125 7638829 7311529 6988728 6719307 6459441
18082F459441k68076k54085k76879k54041k24675k23483j97775k20658j62389
$$ 6459441 6191365 5937280 5660401 5406360 5181685 4958202 4760427 4539769 4377380
18073D377380j46238j23917j40646r1674j24388k49234j07323k1190m4394n2678
$$ 4377380 4231142 4107225 3966579 3874905 3750517 3501283 3393960 3372770 3328376 3275698
18063C275698o7218j73530j34728j1288l5465m5696p0266m0617o7108j8832j1395
$$ 3275698 3208480 3034950 2900222 2888934 2853469 2807773 2737507 2696890 2629782 2610950 2599555
18052B599555K3695K5784o5613j8065j4398o5674m5449k2285m9830m9083l9427
$$ 2599555 2623250 2649034 2583421 2565356 2550958 2485284 2439835 2417550 2367720 2318637 2279210
18041B279210K2682N7624P7225o613m4610P8149M4887k8781m0944j9466l0800
$$ 2279210 2301892 2359516 2436741 2430128 2385518 2463667 2508554 2479773 2438829 2419363 2388563
18030B388563m5395o8940j33196j12777j04744j08863j23162p2358j18340o5629
$$ 2388563 2343168 2274228 2141032 2028255 1923511 1814648 1691486 1619128 1500788 1435159
18020A435159J2980O559P161O092Q503l8060n3062l1283J7727q562q2937o6847
$$ 1435159 1448139 1454698 1461859 1467951 1476454 1438394 1385332 1354049 1371776 1363214 1280277 1213430
18008A213430q5318R101J9584M2096J1991q842K9975l5440J1463J9844M0673l199
$$ 1213430 1128112 1137213 1156797 1198893 1210884 1202042 1232017 1196577 1208040 1227884 1268557 1265358
17996A265358m1260n5967k7038M519o1260N258n528L2584J09197L6738m4013j50735
$$ 1265358 1224098 1168131 1141093 1145612 1084352 1089610 1084082 1116666 1225863 1262601 1218588 1067853
17984A067853m5706K0044j01507o8730m0016K0911M7218l4426n4636J0766P114
$$ 1067853 1022147 1042191 940684 871954 831938 852849 900067 865641 811005 821771 828885
17973H28885k1547J5275q0818r4803J1915j0290j5578o5211J9401l8140K630N5002
$$ 828885 807338 822613 741795 646992 658907 648617 633039 567828 587229 549089 551719 606721
17961F06721j6423p1322P268o815J2581J5801J5811N614J7917n4305m4039M2951
$$ 606721 590298 518976 526244 519429 532010 547811 563622 569236 587153 532848 488809 531760
17949E31760K0020m4577O6844K3350o789k7911j5859o031l3842L9135J8595K9561
$$ 531760 551780 507203 574047 597397 590608 562697 546838 540807 506965 546100 564695 594256
17937E94256J0309r1150j02206J3289L0375K3067L447L7696k8713m9616o5680
$$ 594256 604565 513415 411209 424498 454873 477940 481387 519083 490370 440754 375074
17926C75074J7926P0929l948k451j740r005Q310J0878k4386K6792M6862j5898
$$ 375074 393000 463929 459981 457530 455790 446785 455095 465973 441587 468379 515241 499343
17914D99343L6484K351j608m5374l819O4187J8243J6748j9130k4661J8893J01494
$$ 499343 535827 538178 536570 491196 487377 551564 569807 586555 567425 542764 561657 663151
17902F63151O3211J1709r334n4320l6412k3911J2922P292j8228J6838j1301o759
$$ 663151 726362 738071 728737 674417 638005 614094 627016 634308 616080 632918 621617 614858
17890F14858J02589P1502j1929P931L0327K4896k1154m9885k1503l3687R695Q0824
$$ 614858 717447 788949 777020 784951 815278 840174 819020 769135 747632 713945 723640 804464
17878H04464M643j9361K2215O915N0923j2045M1017M1417k5874k1602P4342Q4782
$$ 804464 809107 789746 811961 818876 869799 857754 898771 940188 914314 892712 967054 1051836
17866A051836K462q0234J5242K7943N2197L5195L6555K0804n545r3779n8749j5112
$$ 1051836 1054298 974064 989306 1017249 1069446 1104641 1141196 1162000 1156455 1062676 1003927 988815
17854I88815p372N2814R5880N0271O7578J52059J68550J13342J08870J71224J44712
$$ 988815 981443 1034257 1130137 1180408 1247986 1400045 1568595 1681937 1790807 1962031 2106743
17843B106743K17j15611j03879k2419p2968l9053K7788P7845Q1763L3280P6754
$$ 2106743 2106960 1991349 1887470 1865051 1792083 1753030 1780818 1858663 1940426 1973706 2050460
17832B050460J26748J51396L9592J3395n8254m8937J20175J55573K12673L90249
$$ 2050460 2177208 2328604 2368196 2381591 2323337 2274400 2394575 2550148 2762821 3153070
17822C153070L07369K69116K88620K17643q496j15382k3716J35840L46546N24574
$$ 3153070 3460439 3729555 4018175 4235818 4227322 4111940 4088224 4224064 4570610 5095184
17812E095184O19458P91891Q53229J002207R96009J395208K354400M199684P857738
$$ 5095184 5714642 6506533 7359762 8361969 9357978 10753186 13107586 17307270 25165008
17803B5165008J3135348J5625635J2637135R988481R710220L881706j5865771
$$ 25165008 38300356 53925991 66563126 76551607 86261827 90143533 74277762
17796G4277762k2830973j3396150o908681m006712k218790r83870m62841m0921
$$ 74277762 51446789 38050639 31141958 27135246 24916456 23932586 23469745 23428824
17788B3428824P43285J443960K038747K211220K842185M456157P443034J2516061
$$ 23428824 24172109 25616069 27654816 29866036 32708221 37164378 44607412 57123473
17780E7123473K2781704M0334356N6004010N3414928M0268357L5883138K7708379
$$ 57123473 79905177 120239533 176243543 229658471 269926828 305809966 333518345
17773C33518345k4723067q4723412o8801057l7517980k1526940j3070726p094497
$$ 333518345 308795278 224071866 155270809 117752829 96225889 83155163 76060666
17766G6060666k408017J750206P020010J6692865L3735434N2869995N4756440
$$ 76060666 73652649 75402855 82422865 99115730 132851164 185721159 240477599
17759B40477599L9890025L4211301L2312415p162399q7720363p9141367m3656426
$$ 240477599 280367624 314578925 346891340 339728941 252008578 172867211 129210785
17752A29210785k6792083j8079863j2208920q634767o349947m683642l501657
$$ 129210785 102418702 84338839 72129919 63495152 57145205 52461563 48959906
17745D8959906k487184j731446r27344k49386L10568J174749K987647O181376
$$ 48959906 46472722 44741276 43813932 43564546 43875114 45049863 48037510 54218886
17737E4218886J0621934J3457002J0873672Q058319Q207140M869145j6624524
$$ 54218886 64840820 78297822 89171494 97229813 105436953 110306098 93681574
17730I3681574k6320829j5494817q884612n821817l831239k688123k411639k017651
$$ 93681574 67360745 51865928 42981316 37159499 33328260 30640137 28228498 26210847
17722B6210847j536892j233515j045686j156004j133686r28282q60108p52346
$$ 26210847 24673955 23440440 22394754 21238750 20105064 19176782 18316674 17564328
17714A7564328p19575o26948n51805n77377n47858n48807m67924m54934l61312
$$ 17564328 16844753 16217805 15666000 15088623 14540765 13991958 13524034 13069100 12707788
17705A2707788l27402m23227l68190k74749l06223m65933o18952m66157l48990
$$ 12707788 12380386 11957159 11588969 11314220 11007997 10542064 9923112 9456955 9107965
17696I107965k46671k23877k57971k87462k01378k21150k74902k64370k01606
$$ 9107965 8861294 8637417 8379446 8091984 7890606 7669456 7394554 7130184 6928578
17687F928578l19758k46452r3641q0012j94375j92408j81181j70046k45029k10593
$$ 6928578 6608820 6362368 6268727 6188715 5994340 5801932 5620751 5450705 5205676 4995083
17677D995083j45405o2616j69824j83997j55729j21312j29388j12071k7936q320
$$ 4995083 4849678 4787062 4617238 4433241 4277512 4156200 4026812 3914741 3886805 3878485
17667C878485k8669p9174n8928r0217j05466j56489j78058j60603j26047j31002
$$ 3878485 3849816 3770642 3711714 3621497 3516031 3359542 3181484 3020881 2894834 2763832
17657B763832p5618r971N8713K73307M12226L73085K59364K51468J58696l54365
$$ 2763832 2688214 2678243 2736956 3010263 3422489 3795574 4054938 4306406 4465102 4110737
17647D110737q05612o40019m00725k63018j76221j93660j41538m6022m1831r4385
$$ 4110737 3305125 2665106 2264381 2001363 1825142 1631482 1489944 1443922 1402091 1307706
17637A307706m0852M5142K3722J7406M8731J13882K68866M48997N78873N74304
$$ 1307706 1266854 1311996 1335718 1353124 1401855 1515737 1784603 2233600 2812473 3386777
17627C386777M65911L92974L22800n4141q79374r39798n63212l29119j96398j51301
$$ 3386777 3852688 4245662 4568462 4514321 3634947 2695149 2131937 1802818 1606420 1455119
17617A455119j01714j06718m6896o2749q9067K2938j9260j5023j1750o980Q766
$$ 1455119 1353405 1246687 1199791 1137042 1047975 1070913 1051653 1036630 1024880 1017900 1026666
17606A026666o1028n5350k9963q6483q2901j500M5345j4140n4945j3209O43k6918
$$ 1026666 965638 910288 880325 793842 710941 709441 754786 740646 685701 672492 673135 646217
17594F46217o4k9588m9975k5200L6694q934j4867r756j6732J6407K5594K338n1046
$$ 646217 646153 616565 566590 541390 578084 569150 554283 544527 527795 544202 569796 572134 521088
17581E21088l9550j9403q3402P6661N4674n516n8542m4036l3118l9403k0722N7503
$$ 521088 481538 462135 378733 455394 510068 504552 446010 401974 368856 329453 308731 366234
17569C66234j9828P2612P0915O3237J6227k386j6103m9044J9802J071k3895k5926
$$ 366234 346406 419018 489933 553170 569397 567011 550908 501864 521666 522737 498842 472916
17557D72916p072m5765J7679M2116l9600m1884K8033L8918n5523j6058k1920o8862
$$ 472916 465844 420079 437758 479874 440274 398390 426423 465341 409818 393760 371840 302978
17545C02978J6808P7983j012p1823K2808L1520k9109o6574o2250L3044J7556Q30
$$ 302978 319786 397769 396757 324934 347742 379262 350153 283579 221329 254373 271929 272759
17533B72759R814n167k9515q0831j6616K8822O0379M2932L5651K891m9307m181
$$ 272759 282573 277406 247891 167060 150444 179266 239645 282577 318228 321119 271812 267631
17521B67631j3046p9295q8748K2157N8674K9272Q1489K2399p8083o8903j9185
$$ 267631 254585 175290 86542 108699 167373 196645 278134 300533 222450 153547 134362
17510A34362N262j0803n7974j9900k1861l575k4677j6104Q5044K7114m5311k9154
$$ 134362 139624 128821 70847 50947 29086 25511 834 -15270 69774 96888 51577 22423
17498B2423L7181K1429j3395o0577o032L8058j0779k5036L2168L8830O6106K3098
$$ 22423 59604 81033 67638 7061 1029 39087 28308 3272 35440 74270 140376 163474
17486A63474O461J4999P7738M0176j5889K7781j2233k303K3459l545J30986K18550
$$ 163474 169935 184934 262672 302848 286959 314740 302507 300204 323663 320118 451104 669654
17474F69654M56736O17827N59656M59531M08034M25685n0379q29382q72808n61620
$$ 669654 1126390 1744217 2303873 2763404 3171438 3597123 3546744 2717362 1844554 1282934
17464A282934l91464j98568j43880n0096r314m03j2054K1943j6761k8108j0422
$$ 1282934 891470 692902 549022 498926 489612 489209 477155 499098 482337 454229 443807
17453D43807j5092R8337P7168K79621M17685M50542L76007L23261L58580N3083
$$ 443807 428715 527052 604220 883841 1301526 1752068 2128075 2451336 2809916 2862999
17443B862999m01712o50780m02741k24688j77009q1652j04015j90191r2769o9004
$$ 2862999 2461287 1810507 1407766 1183078 1006069 924417 820402 630211 537442 468438
17433D68438r0233l4898k4914L8692L8913o6200m822n0195O255j4878j5179N3021
$$ 468438 378205 343307 318393 357085 395998 329798 324976 274781 281036 266158 250979 304000
17421C04000K9003l3561m9818J5619k1662p2153J8184J0116m8731M0485M5623
$$ 304000 333003 299442 249624 265243 243581 171428 189612 199728 150997 191482 237105
17410B37105p2795l9492k3624q503K5056L5939m580r033k9982K0336j6808j5588
$$ 237105 164310 124818 101194 92691 117747 153686 149106 140073 110091 130427 113619 98031
17398I8031n0100j9771k2662O677k2685l0780N0926N0958M4687k1535l2889l2282
$$ 98031 47931 28160 5498 12175 -10510 -41290 9636 60594 105281 83746 50857 18575
17386A8575M3885L0681l1567q0187L0677N4957j9081r985q1655n3702J0333M9372
$$ 18575 62460 93141 61574 -18613 12064 67021 47940 37955 -43700 -97402 -87069 -37697
17374c7697M1875J6204o194K8935J975N118L3952m1656m559K587N8837J2663o9482
$$ -37697 4178 20382 14188 43123 45098 50216 84168 42512 37953 40540 99377 112040 42558
17361D2558J5270l5265L1531Q677k3773J5749K755K5145j1348n4602m5736L8081
$$ 42558 57828 22563 54094 62771 38998 54747 57502 82647 71299 16697 -29039 9042
17349I042R364K6318K9952J091j1061Q273k369K4773J692n654k9293K8908M3143
$$ 9042 18406 44724 74676 75767 64706 72979 70610 95383 97075 91421 62128 91036 134179
17336A34179J0885j8778n540k2163q6263o5616Q796r819j1101j5419m096M1432
$$ 134179 145064 126286 120746 98583 12320 -53296 -44500 -54319 -65420 -80839 -84935 -43503
17324d3503O7218L8716O9602k5960r362J7389J8066n8475j3969n7351l5634j646
$$ -43503 23715 62431 132033 106073 96711 114100 132166 73691 59722 2371 -33263 -34909
17312c4909Q5642L1293j4228m7577j5470J7020j7556k3122M2849j6791k4511M3940
$$ -34909 50733 82026 67798 20221 4751 21771 4215 -18907 23942 7151 -17360 26580
17300B6580J7110N7064m0492l4049Q510p1808J6795O2203l9550J6450j8068J2375
$$ 26580 43690 100754 60262 26213 34723 -37085 -20290 41913 2363 18813 745 13120
17288A3120n466K6470O4353J1163n7427p1349m2015j2013M5214M4159k3934K3144
$$ 13120 7654 34124 98477 109640 52213 -19136 -61151 -73164 -27950 16209 -7725 15419
17276A5419j0886j0067o627R288Q572k9380Q778P1847J1732N6898R0540J08996
$$ 15419 4533 -5534 -12161 -2873 5699 -23681 -14903 56944 68676 125574 216114 325110
17264C25110J61179J95719J52389J02030R2495k4093k21906k35560k25626j15939
$$ 325110 486289 682008 834397 936427 1028922 1004829 782923 547363 321737 205798
17254B05798J3041j25020j0664L8744M5313J3018n1080l291K0263r067j0605N5495
$$ 205798 218839 93819 83155 121899 167212 180230 129150 125859 146122 137055 126450 181945
17242A81945O5848O4922J41932K41453J90018J23862L2886K2077j53061k82130
$$ 181945 247793 312715 454647 696100 886118 1009980 1042866 1064943 911882 629752
17232F29752j99884o0711q0170o5318k6206J0503Q2498l5140o1952J6165J4527
$$ 629752 429868 369157 288987 223669 197463 207966 290464 255324 193372 209537 224064
17221B24064L6139J0457L542L7683K0822J37660K37618K03680J39949N7531R9532
$$ 224064 260203 270660 274202 311885 332707 470367 707985 911665 1051614 1109145 1208677
17210A208677m4704l24347l06668j60165j08842m4795J9450J4033j8976l9206
$$ 1208677 1163973 839626 532958 372793 263951 219156 238606 252639 233663 194457
17200A94457J810l8948k8534J520N138L5363J7310O7961R7629J40648J37531K18349
$$ 194457 196267 157319 128785 130305 135443 170806 188116 256077 353706 494354 631885 850234
17188H50234J48394Q0939N7564k11495l26100j67372j37378n6868j5986k3343
$$ 850234 998628 1079567 1137131 925636 599536 432164 294786 237918 221932 198589
17178A98589l441n6545m4897L8396j9235K2841M0172j8031m3778m2014K3K368
$$ 198589 195148 138603 93706 132102 112867 135708 175880 157849 114071 72057 72080 74448
17166G4448p3344j263O87K7538k5341n858k7941M568J7733N4917J4899o397n470
$$ 74448 1104 -159 528 28066 2725 -3133 -31074 -26506 -8773 46144 61043 54646 49176
17153D9176q063K2982K892m6567j2117m1557L735P611L7825J5825J9439l7682
$$ 49176 41113 64095 66987 20420 8303 -33254 -29519 -21908 15917 31742 51181 13499
17141A3499l9345R909P3095N9621k1397J2472o8148N0403l267l8043m2646n606
$$ 13499 -25846 -15937 57158 116779 95382 107854 39706 90109 86842 48799 6153 547
17129E47o53J1763m2611O1319M8826l7386j4120p7208j4470O9662Q2173K8521
$$ 547 -106 11657 -30954 30365 79191 41805 27685 -49523 -63993 5669 87842 116363
17117A16363j8437j8598J4155l7005n5925o4265q425K8385j8161L3382M2827l3279
$$ 116363 97926 79328 93483 56478 553 -63712 -72137 -43752 -61913 -28531 14296 -18983
17105a8983J1729M4048M4154n3382j2930j8875Q443p929l0619P4003N2320J1822
$$ -18983 -7254 36794 80948 27566 14636 -4239 4204 -3725 -34344 39659 91979 103801
17093A03801j07536m9826P6428R2n4278J507k4166j9027O949P6412M4982l0739
$$ 103801 -3735 -53561 22867 22959 -31319 -29812 -53978 -73005 -66056 10356 55338 24599
17081B4599l9416k8900m0727l1049J6324J8222P3436m817q9380m647P3750K0479
$$ 24599 -14817 -43717 -84444 -115493 -99169 -80947 -7511 -12328 -101708 -106355 -32605 -12126
17069a2126l1950L4259Q9457k0790J069p9812o1470m868K3351M1866N5725J6976
$$ -12126 -44076 -9817 79640 58850 59919 -19893 -81363 -86231 -62880 -21014 34711 51687
17057E1687l0963l977l6850j9310L9452L3666M8241M4361k0489o6946k2385k339
$$ 51687 20724 16747 -20103 -39413 39 33705 81946 126307 105818 38872 16487 14148
17045A4148K6911K7514K3158L7768J8815k3079j6116l1358k2672L460j3859m2789
$$ 14148 41059 68573 91731 129499 148314 125235 109119 77761 55089 58549 44690 1901
17033A901k7128k6043K1652J7066J5501M9418N386m7119J2217r837M1162l2031
$$ 1901 -25227 -51270 -29618 -12552 2949 52367 57753 10634 22851 13014 54176 22145
17021B2145m7388j7956P1089j3887P193n4752J0977j4147m0947M7778P9904N982
$$ 22145 -25243 -43199 27890 14003 21196 -33556 -22579 -36726 -77673 -29895 50009 55991
17009E5991j9030m0195M9558k1173n9300J4813N2864J9563q0n2214K2816M9264
$$ 55991 36961 -3234 46324 25151 -34149 -19336 33528 53091 53011 797 23613 72877
16997G2877J3458r465n5189l4445J5652M8204O391L5525l3302k7230l865j1170
$$ 72877 86335 76870 21681 -12764 2888 51092 57483 93008 59706 32476 28611 17441
16985A7441m5551j7282M4759L1463N8402k8796k8270J723J2205n8323K8551k3176
$$ 17441 -28110 -45392 -633 30830 89232 60436 32166 33889 46094 -12229 16322 -6854
16973f854k0967O2068K0693J6547L4506j0660k6454k0549n1881k5592L4425K8189
$$ -6854 -27821 34247 54940 71487 105993 95333 68879 48330 -3551 -29143 5282 33471
16961C3471O0109m1266l4241J4645j0684k9530o9760l6407Q835J2846k0554m410
$$ 33471 93580 52314 18073 32718 22034 -7496 -77256 -113663 -104828 -91982 -112536 -116946
16949a16946M8836L4044O875J1378m420j5386j3454K1411O99j8265q762J4746
$$ -116946 -68110 -34066 -27191 -15813 -20233 -35619 -49073 -27662 -26963 -45228 -53990 -39244
16937c9244r643K0096K3923k7338j6368J4728M1990J7328K1268o974m4279K14
$$ -39244 -48887 -28791 -4868 -32206 -48574 -33846 8144 25472 46740 39766 -4513 -4299
16925d299Q8947j1479o8538J6986O2341K3138m4929m1924j7792p237m9598q602
$$ -4299 84648 73169 4631 21617 83958 107096 62167 20243 2451 -4786 -54384 -62986
16913f2986k3554O3000L1515n0536m4530k2154J5619J08861M2428j3890k6727
$$ -62986 -86540 -23540 7975 -42561 -87091 -109245 -93626 15235 57663 43773 17046
16902A7046N737J0694R810k8642q6592o9846L6343N3267m802J6912O4517K206
$$ 17046 22783 33477 43287 14645 -71947 -141793 -105450 -52183 -56985 -40073 24444 26650
16890B6650j1424m4000N524L1925o330k5803L5519O1330n3774q1687l5961L5823
$$ 26650 15226 -28774 -23250 8675 2345 -23458 12061 73391 19617 -62070 -98031 -62208
16878f2208J6427k3877J2753L3633n7585k5422N381k4684p4811Q6756M8676L7997
$$ -62208 -45781 -69658 -56905 -23272 -80857 -106279 -100898 -125582 -200393 -113637 -64961 -26964
16866b6964j6679P5434l2834m9480R323k2382L2242K2997K0526O5723J9930l3133
$$ -26964 -43643 31791 -1043 -50523 -41200 -63582 -31340 -8343 12183 77906 97836 64703
16854F4703K0654n410L7556m3576k9294J7186K4828R687o7893k9485k8643j1567
$$ 64703 85357 79947 117503 73927 44633 61819 86647 96334 28441 -1044 -29687 -41254
16842d1254N2332m5085J6032M4339K8921J567j0066m2006J6366K0102k3215J7041
$$ -41254 11078 -34007 -17975 26364 55285 56852 46786 4780 21146 41248 18033 35074
16830C5074k8292o951K6069j7027l1630L5794L2286p1045k5858O142n622M9244
$$ 35074 6782 -169 25900 8873 -22757 13037 45323 -25722 -51580 -45438 -51060 -1816
16818a816J5851k12j5561l6702J6074m3288K0830N5954r963M2472J5625m5561
$$ -1816 14035 13823 -1738 -38440 -22366 -65654 -44824 11130 1167 43639 59264 13703
16806A3703n9956m8743k2318O3895M7049j8589L8229j2681J5474r081q5883j853
$$ 13703 -46253 -94996 -117314 -53419 -6370 -24959 13270 589 16063 6982 -78901 -80754
16794h0754J6015J8407O7927j4353M913o6411o9937M5324Q041M0982M9774k765
$$ -80754 -64739 -46332 21595 7242 12155 -54256 -124193 -78869 -70828 -29846 19928 17163
16782A7163J344J3009r608l7830l2832m7802k382P1885m7609Q901M8976j7750
$$ 17163 18507 31516 21908 -15922 -48754 -96556 -98938 -27053 -74662 -65761 -16785 -34535
16770c4535L6503k3918l5031O804M1722k3349k6447J7861O470j1672K8547K789
$$ -34535 1968 -21950 -56981 -50177 -8455 -31804 -58251 -40390 -33920 -45592 -17045 -14256
16758a4256o260L578j6249m4687j6546J7363N1135P1849M6141J5075j7857l4791
$$ -14256 -20516 -16938 -33187 -77874 -94420 -77057 -25922 45927 92068 107143 89286 54495
16746E4495j0137o9200K9177M1598O6o347j7430l8395r1632P5362L6810L330m3631
$$ 54495 44358 -24842 4335 45933 45999 39652 22222 -16173 -107805 -32443 4367 7697 -35934
16733c5934k6750j2913q330l5506J0238N6535O3064l917j6518m5665Q440N0232
$$ -35934 -62684 -75597 -83927 -119433 -109195 -52660 10404 6487 -10031 -55696 -47256 2976
16721B976K4457m5409o8225p251k4060M3336J0844L0318j9006j5500j5342r1227
$$ 2976 27433 -17976 -86201 -93452 -117512 -74176 -63332 -33014 -52020 -67520 -82862 -174089
16709a74089R8378P8216k5354j1239j7322j6757M631P6103K2951m1060J3520M0449
$$ -174089 -75711 2505 -22849 -34088 -51410 -68167 -63536 12567 35518 -5542 7978 48427
16697D8427k6157k2878J1695J3395j1673k0262L6852j516l7552K7494l4142o6272
$$ 48427 22270 -608 11087 24482 12809 -7453 29399 27883 -9669 17825 -16317 -82589
16685h2589k498K3626P2918O2738l904k8605K0176n3885n7908j3741J5921q03
$$ -82589 -85087 -61461 11457 74195 70291 41686 61862 7977 -49931 -63672 -47751 -48554
16673d8554j1040q858Q2961M1951J2283K2641k9627l6439l8554k9650j2658P2518
$$ -48554 -59594 -68452 14509 56460 68743 91384 61757 25318 -13236 -42886 -55544 16974
16661A6974J5028m7613m0608m8222r411Q2305R9542N3437l6724K0293L7106m0762
$$ 16974 32002 -15611 -56219 -104441 -113852 -31547 67995 121432 84708 105001 142107 101345
16649A01345q7200k4129k216l7727L9459K2904m5895k7914J4126j0050j2894n0307
$$ 101345 14145 -9984 -12200 -49927 -10468 12436 -33459 -61373 -47247 -57297 -70191 -120498
16637a20498k8987O6366Q2200j1604l4285j5610J7846Q6230N9014o352M4214K5410
$$ -120498 -149485 -83119 -919 -12523 -46808 -62418 -44572 41658 100672 94320 138534 163944
16625A63944R156l3856l7894l2040k2660J4360l1482k7405J8012M646j808n6417
$$ 163944 173100 139244 101350 69310 46650 61010 29528 2123 20135 24781 22973 -33444
16613c3444J7599O3450N9214n7143n3837l3452m4737O669M671L7042j2749N301
$$ -33444 -15845 47605 106819 49676 -4161 -37613 -82350 -75681 -71010 -33968 -46717 -41416
16601d1416O6734N6968k722p2737j00653M1949P6565o1388n9539m3816K0176M9051
$$ -41416 25318 82286 79564 6827 -93826 -51877 24688 -36700 -96239 -140055 -119879 -70828
16589g0828M2900O525O894k3656N3812k8041j4647K3288j5699N3893N7949m7825
$$ -70828 -27928 -21403 -14509 -38165 15647 -12394 -27041 -3753 -19452 34441 92390 44565
16577D4565j3848k6989N2753k6399m3933n980m5797m0155L6600O8763r352k2160
$$ 44565 30717 3728 56481 30082 -13851 -19831 -65628 -105783 -69183 -420 -9772 -31932
16565c1932J8252R303K8384j8896p0573r203K0824K0861J334q634k5082n972J9498
$$ -31932 -13680 -4377 24007 5111 -65462 -74665 -53841 -32980 -31646 -40280 -65362 -71334 -51836
16552e1836O8719M9234M3848j3813p2341k2993P615K8867J3533K6850M7867K4008
$$ -51836 16883 66117 109965 96152 23811 818 8433 37300 50833 77683 125550 149558
16540A49558n4091j5907k9942j5046O0820j700j32375o1409K4985j2946m180N7488
$$ 149558 95467 79560 49618 34572 95392 93692 -38683 -100092 -75107 -88053 -92233 -34745
16528c4745J1116j4969R60J1179K8765K4621q242K7031N7087L8952k1307n8078
$$ -34745 -23629 -38598 -37638 -26459 2306 26927 18685 45716 102803 141755 120448 62370
16516F2370M7499L296p7073K4009N030m4401n3381J0127L0107j4593J3940K7172
$$ 62370 109869 113165 36092 60101 65131 20730 -32651 -22524 7583 -7010 6930 34102
16504C4102Q214l419L1988O913j3450m4651m0925m952N0790K3849p205m3729n1787
$$ 34102 42316 38897 70885 77798 64348 19697 -21228 -26180 24610 48459 41254 -2475 -54262
16491e4262J8247L5012N021n3399q6505j5502O5500L0721L8758N1549L0346K1153
$$ -54262 -36015 -1003 4018 -49381 -135886 -151388 -85888 -55167 -16409 35140 65486 86639
16479H6639k7850l7058j4946k638N3035q436K7953m1997m5249k7495m8345r045
$$ 86639 58789 21731 6785 4147 57182 48746 76699 34702 -10547 -38042 -86387 -95432
16467i5432P728J05171Q6160l2388L3446l999p8279N1201P3928l1171p1759k4513
$$ -95432 -87704 17467 103627 71239 104685 100686 22407 73608 147536 116365 44606 20093
16455B0093k3361L539L9256j4789j6475J6657m457k2351l3179K6984L6965L466
$$ 20093 -3268 271 39527 24738 8263 24920 20463 -1888 -35067 -8083 28882 32348
16443C2348m2120N720K1616Q017J4511j7288n3860j1671j918O2368N376k0415
$$ 32348 -9772 -4052 17564 25581 40092 22804 -31056 -42727 -44645 17723 23099 2684
16431B684k2769K9111q725L4931m2486Q672j9986m2091J2075j9207J6368P4987
$$ 2684 -20085 9026 301 35232 -7254 1418 -18568 -60659 -48584 -67791 -51423 23564
16419B3564M19j6223R213j7389l259l8329M6531K1155j3519M701j2590m5496p8650
$$ 23564 23983 7760 16973 -416 -3675 -42004 4527 25682 12163 16864 4274 -41222 -119872
16406a19872K4093N7964K5357k8900l2095L5232j4009q582k987J0429K7202L7311
$$ -119872 -95779 -37815 -12458 -41358 -73453 -38221 -52230 -60812 -63799 -53370 -26168 11143
16394A1143J129L7828J7503n3575o0938q270Q5998M9055p4645r990K1711J7821
$$ 11143 12272 50100 67603 14028 -46910 -55180 30818 79873 5228 -4762 16949 34770
16382C4770j9953N6708j8201j6588j0625n1951l7007p587r933K2387M9335L4697
$$ 34770 14817 71525 53324 36736 26111 -25840 -62847 -70434 -80367 -57980 -8645 26052
16370B6052k0907m4885K6764l7366o0061o348L9847J5026M836J7541L3798K0277
$$ 26052 5145 -39740 -12976 -50342 -110403 -116751 -76904 -61878 -57042 -39501 -5703 14574
16358A4574J8313j1097j1929M922p768q0647j9572K314K0721M2619J4664q231
$$ 14574 32887 21790 9861 14783 7015 -73632 -93204 -90890 -70169 -27550 -12886 -21117
16346b1117J5587q133L5096N3068K4068j3807n5491j7672j1127M3258m338p2454
$$ -21117 -5530 -13663 21433 74501 98569 84762 29271 11599 472 43730 39392 -33062
16334c3062k1733J01332K4658p2511Q167M6444k8077j36393L8829J07834J9065
$$ -33062 -54795 46537 71195 -1316 6851 53295 25218 -111175 -72346 35488 54553
16323E4553J377m1232l723j2208l4455J2640j1761m252L3089j4454p0440m2387
$$ 54553 55930 14698 10975 -1233 -35688 -23048 -34809 -39061 -5972 -20426 -90866 -133253
16311a33253J2115l0498j1473j3875Q4988K1629J9625n1404J8946J4472L6529
$$ -133253 -121138 -151636 -163109 -176984 -91996 -70367 -50742 -102146 -83200 -68728 -32199
16300c2199J6450L5997j7090k1852m9579J9999L6813Q31k1783k3081n2825j4179
$$ -32199 -15749 20248 3158 -18694 -68273 -48274 -11461 -10630 -32413 -55494 -108319 -122498
16288a22498J4455j3688L5181O5586J1810k5078n958K1742P8829K4915j8200n3597
$$ -122498 -108043 -121731 -86550 -20964 -9154 -34232 -40190 -18448 60381 85296 67096 13499
16276A3499k3031M4142l5370l8786k62N678M7746j4660j6901K301R0129K6958
$$ 13499 -9532 34610 -760 -39546 -39808 -34130 13616 -1044 -17945 -15644 74485 101443
16264A01443j3549q2844o3813L6964j5071n1178M5541R877l598r311j1707j0738
$$ 101443 87894 5050 -58763 -21799 -36870 -88048 -42507 -32630 -36228 -45539 -57246 -67984
16252f7984p748l0748J2836P0711J6225O96n2571q0547o8711N6525J04182M6567
$$ -67984 -75732 -106480 -93644 -22933 -6708 -6012 -58583 -139130 -207841 -151316 -47134 -567
16240e67J1562n311O2661m6897j5743J8127J0288l3776o4246L4895Q2339L7296
$$ -567 10995 5684 68345 21448 5705 23832 34120 344 -63902 -29007 53332 90628
16228I0628J0518j00112n8111K5184M3076M0950m9135l538m608j3056m4031k9243
$$ 90628 101146 1034 -57077 -31893 11183 52133 2998 -540 -5148 -18204 -62235 -91478
16216i1478N1548k6815l4356n6652k5396j9400O1214M0322N4409L3641l6932q169
$$ -91478 -39930 -66745 -101101 -157753 -183149 -202549 -141335 -101013 -46604 -12963 -49895 -58064
16204e8064k5400L8801K2813P731k2674j3627J3768L1907j0419M560L7275M6307
$$ -58064 -83464 -44663 -21850 -14119 -36793 -50420 -36652 -4745 -15164 -10604 26671 72978
16192G2978q9879r1242L0262K2043L7386M7062k2055m9423N6787L0221q850J0531
$$ 72978 -16901 -108143 -77881 -55838 -18452 28610 6555 -42868 13919 44140 35290 45821
16180D5821P658l2679q2759l2020N2041O8507K8657j8790K2418k956j7638n7976
$$ 45821 53479 20800 -61959 -93979 -41938 26569 55226 36436 58854 55898 38260 -19716
16168a9716k6191N5670K1007K811k4174K7076J2018r2997j2771L0433k7801m3811
$$ -19716 -45907 9763 30770 33581 9407 36483 48501 -44496 -57267 -26834 -54635 -98446
16156i8446N2283J8925J3076n2777j756R5335J2310k0164m2166o1745K4683J2748
$$ -98446 -46163 -27238 -14162 -66939 -68695 26640 38950 18786 -23380 -85125 -60442 -47694
16144d7694n569j7019j0989j8971j6738J3106J3951L5575K1493K0153j7321j2892
$$ -47694 -53263 -70282 -81271 -100242 -116980 -103874 -89923 -54348 -32855 -12702 -30023 -42915
16132d2915J4232J5812K6674J7370k9011q4033L50M5659K5668L546K0075M6272
$$ -42915 -28683 -12871 13803 31173 2162 -81871 -81521 -35862 -10194 -6648 13427 59699
16120E9699j0904L697N0237r377J42n1350o8196k9111q862k2858J2367P4846N2980
$$ 59699 48795 52492 102729 93352 93494 42144 -26052 -55163 -64025 -86883 -74516 330 53310
16107E3310M2821k0269l0646p5581o1973j5079L1750N212k7078N4455L0417J3405
$$ 53310 96131 75862 45216 -30365 -92338 -107417 -75667 -70455 -97533 -43078 -12661 744
16095G44k3730m6607k9882N9720N0596j1022m4962M833J7395K491J8044K5270
$$ 744 -22986 -69593 -99475 -39755 10841 -181 -45143 -40310 -22915 -20424 -2380 22890
16083B2890l6157l0149k1961K8808k797J6309k8120L3277L0817L3978N020K700
$$ 22890 -13267 -43416 -65377 -36569 -39366 -23057 -51177 -17900 12917 46895 51915 54615
16071E4615P9J1665M247m8129l2343J16l2243m2935J7554M2223K027L9668m475
$$ 54615 54694 66359 70606 22477 -9866 -9750 -41993 -84928 -67374 -25151 -23124 16544 12069
16058A2069L0722N9591m2534q707J8954J171o9352m3996L701p59J4336j4875K3639
$$ 12069 42791 102382 59848 51141 70095 71266 1914 -42082 -38381 -39140 -24804 -39679 -16040
16045a6040K4550J880L6800j7305J2373M4519J7942J3370K0726m428r6582o5736
$$ -16040 8510 10390 47190 29885 42258 86777 104719 118089 138815 134387 37805 -27931
16033b7931L6762K4236q648O924k0185K450L1324n0418k7379L8162J7833j4426
$$ -27931 8831 33067 24419 31343 11158 13608 44932 -5486 -32865 5297 23130 8704
16021H704J7001k94r1585j0111N2469Q2979M9675q687q8912m4833L752K7308j3783
$$ 8704 25705 25411 -66174 -76285 -23816 59163 108838 100151 11239 -33594 -29842 -2534 -16317
16008a6317R70j2085L755M8147M6166j3131j1653l6162N077K7850O2125n8610
$$ -16317 -15347 -27432 -23677 24470 70636 57505 45852 9690 14767 42617 104742 46132
15996D6132m5728n0216l7244K0793M5968K404M7251J2568l6823j4611j9778K4610
$$ 46132 404 -49812 -87056 -66263 -20295 -17891 29360 41928 5105 -9506 -29284 -4674
15984d674k4526j7288O2295N1910P2119J706n970j2301j15202q4401M4522o521
$$ -4674 -29200 -46488 15807 67717 139836 141542 135572 123271 8069 -76332 -31810 -38331
15972c8331L84M9136k756m5580k4149j352M0357j8842M397M7515Q942l5802L0924
$$ -38331 -37947 11189 8433 -37147 -61296 -62648 -22291 -41133 -36736 10779 19721 -16081 14843
15959A4843L6136K1572K0110q0195m537N2606J6364M6220l5078n2749k6634l4008
$$ 14843 50979 72551 92661 12466 7929 60535 76899 123119 88041 35292 8658 -25350
15947b5350P3944P0369q117m3287k5331M2371J866n9553r4260J52M1610k2209
$$ -25350 48594 118963 110846 67559 42228 84599 86465 26912 -67348 -67196 -25586 -47795
15935d7795l713Q734l8399q56J8167J9015l821R649K6243N730m8601l5948M932
$$ -47795 -51508 -42774 -81173 -82029 -63862 -44847 -48668 -39019 -12776 -7046 -55647 -91595 -86663
15922h6663K022N088K5884l9920M53Q3166N0049k4411p3840j15153P5205Q4295
$$ -86663 -84641 -79553 -53669 -93589 -93136 -9970 40079 15668 -58172 -173325 -98120 -13825
15910a3825n5949L9846J4784o5141J9369j5087j3510K1206p562K629M1979P157
$$ -13825 -69774 -29928 -15144 -80285 -60916 -76003 -89513 -68307 -75869 -73240 -31261 -24104
15898b4104k7924o0935m2801N1148K3629J8919N7522K0945j5627L9992L1666p880
$$ -24104 -52028 -112963 -155764 -104616 -80987 -62068 -4546 16399 772 40764 72430 64550
15886F4550n5248L6358R640P800k4686m6343J2838O918m367n6410k9734J5915
$$ 64550 9302 45660 55300 63100 38414 -7929 4909 11827 7460 -48950 -78684 -62769
15874f2769k9603j8265L8983K3208K6749l2560J8558L4811K640L0130j5927q4094
$$ -62769 -92372 -110637 -71654 -48446 -21697 -54257 -35699 -888 1752 31882 15955 -68139
15862f8139j5183j6350M8893L8381M0321j9837o901p5780l0652j842J6608L1648
$$ -68139 -83322 -99672 -50779 -12398 27923 8086 1185 -74595 -105247 -107089 -90481 -58833
15850e8833r568l56j8986Q722P614R484j4504O5514l230J2248R839M1071J6149
$$ -58833 -68401 -68757 -87743 -79021 -71407 -61923 -76427 -10913 -14143 -1895 7944 49015 65164
15837F5164n1651j0254J286K31j1151L4895L038K9375j4684p339K0052j4503R214
$$ 65164 13513 3259 4545 4776 -6375 28520 31558 60933 46249 38910 58962 44459 53673
15824E3673O06m3947k6394K5477L3245k6964m4631l3810k6927m488K7755M5278
$$ 53673 54279 10332 -16062 9415 42660 15696 -28935 -62745 -89672 -94160 -66405 -21127
15812b1127k1709k1668K8217j6093k7689J7926Q51o90N1519M9034J0753j9867
$$ -21127 -42836 -64504 -36287 -52380 -80069 -62143 -61292 -61982 -10463 38571 49324 29457
15800B9457o1181q920Q264K7369J2565m5114L938j0566J7607M5702n1576K780
$$ 29457 -31724 -40644 -32380 -5011 7554 -37560 -33622 -44188 -26581 19121 -32455 -29675
15788b9675P5357l94n2201J7240R021J1236J0846J660k7900l7891r664p5663M1132
$$ -29675 45682 45288 -6913 10327 19348 30584 41430 43090 15190 -22701 -32365 -108028 -66896
15775f6896J6845j8584K9063m8759L4753P1057K4040m2919P887k5L1177j4478
$$ -66896 -50051 -68635 -39572 -88331 -53578 17479 41519 -1400 6487 6462 37639 23161
15763B3161J1885J5668P431J0659L1883k562k7336j3124j5387K8516k249L4027
$$ 23161 35046 50714 58145 68804 100687 98125 70789 57665 42278 70794 68545 102572
15751A02572l3562o8748L5611R4292K6418j3082n8503j3539l746p731k5532q1417
$$ 102572 69010 262 35873 130165 156583 143501 84998 71459 67713 59982 34450 -46967
15739d6967L1801M341j293M3168L1911K4664l178n9070l8196O4036O5038p0873
$$ -46967 -15166 -10825 -12118 31050 62961 87625 84447 25377 -12819 51217 116255 45382
15727D5382r375n0536j343j7728N1380k5851j5684k581J8158L421l3316L0879
$$ 45382 36007 -14529 -15872 -33600 17780 -8071 -23755 -26336 -8178 -4757 -38073 -7194
15715g194P6911J5118k4331p8546o3720J4364K3778J0844J2622k0458K7369J7544
$$ -7194 69717 84835 60504 -18042 -81762 -67398 -43620 -32776 -20154 -40612 -13243 4301
15703D301M672k0372j9025j9945k7317K9431p920n3337j1595N1625O1171j3600
$$ 4301 8973 -11399 -30424 -50369 -77686 -48255 -56175 -109512 -121107 -69482 -8311 -21911
15691b1911n3865k646M5995O1463N9822l4235o1197N3506M8230J6980m159m851
$$ -21911 -75776 -78422 -32427 29036 88858 54623 -6574 46932 95162 112142 107983 103132
15679A03132l4152m7890J6107o9418k5623P3180O9175J3323k5477M3549K667q6715
$$ 103132 68980 21090 37197 -32221 -57844 15336 84511 97834 72357 115906 118573 31858
15667C1858J3526k8170l2821l82m4823k9508l679L1077O5955O4678r7065K1195
$$ 31858 45384 17214 -15607 -15989 -60812 -90320 -93999 -62922 3033 67711 -29354 -8159
15655h159J7047N5396J0217J984j376m5592M431J6725n19l672k0462k6289k7512
$$ -8159 8888 64284 74501 76485 75109 29517 33948 50673 50154 46482 26020 -269 -27781
15642b7781m4584N6362K2150m3495j1151j485K2060l098L1259K1674N689j8881
$$ -27781 -72365 -16003 6147 -37348 -48499 -49984 -27924 -31022 237 21911 27600 8719
15630H719L0882l6068n6332M986K3334p928M5224k220n223p7300l338P5941J6622
$$ 8719 39601 3533 -52799 -47813 -24479 -32407 12817 10597 5374 -71926 -75264 677 17299
15617A7299k6821k8928p79l8055L901L9731J0355j7949L1752N6164N903j4514
$$ 17299 -9522 -38450 -39229 -77284 -73383 -33652 -23297 -41246 -9494 46670 52573 38059
15605C8059j2859j2477J7776L9726l912m7988Q679M2221O111r051p2696J522Q102
$$ 38059 25200 12723 30499 70225 66313 18325 27004 69225 75336 66285 -6411 -4889 3213
15592C213K2027P7104L8484q379l7037o6867p1592l5943N1053K7344J6605l5844
$$ 3213 25240 102344 140828 132449 95412 28545 -43047 -78990 -27937 -593 16012 -19832
15580a9832L0796k4560M03L6598l151J16j254M5671O831p170m9433p3934M9941
$$ -19832 10964 -13596 -13193 23405 20254 20370 19116 64787 71618 64448 15015 -58919 -8978
15567h978L3569n0875j1064p884k5238j4273o166P5993N8448k8555p755O8481
$$ -8978 24591 -26284 -37348 -45232 -70470 -84743 -90909 -14916 43532 14977 7222 75703
15555G5703l352n0799n3080O074K4689J0961m844o416l0744o884K5183l5277K5743
$$ 75703 72351 21552 -31528 -25454 -765 10196 5352 -1064 -31808 -38692 -13509 -48786 -23043
15542b3043O8757J2017k5720k4338K4815q085m0130k2586l3834k1868N7844N7199
$$ -23043 45714 57731 32011 7673 32488 24403 -15727 -38313 -72147 -94015 -36171 21028
15530B1028O766q509R921J6117k341l4782L2472K7248k2073n4480L8729n1024
$$ 21028 27794 19285 29206 45323 42982 8200 40672 67920 45847 -8633 30096 -20928
15518b0928m0634N849M6367J4804l8617m4176J6305j8629r398K2860Q5431L5156
$$ -20928 -61562 -55713 -9346 5458 -33159 -77335 -61030 -79659 -89057 -66197 19234 54390
15506E4390o2738n4185j5571k3150q108K7162L7353O1687J7226L7195M7011l6442
$$ 54390 -8348 -62533 -78104 -101254 -109362 -82200 -44847 16840 34066 71261 118272 81830
15494H1830j12512k199L099l1014j906M6507m950n4288l2979O8801L1111m832
$$ 81830 -30682 -32881 -29782 -60796 -62702 -16195 -21145 -75433 -108412 -39611 -8500 -13332
15482a3332m9048M5366k7964L7901J9938l9900L5607J9347n512L2301M8789k7311
$$ -13332 -62380 -17014 -44978 -7077 12861 -27039 8568 27915 22403 54704 103493 76182
15470G6182j9373K3637k5911k6054k1838J4740N5947K1798n2278p1003M2966N5589
$$ 76182 56809 80446 54535 28481 6643 21383 77330 99128 46850 -24153 18813 74402
15458G4402L2692J5555l2634q7201n8582R740J8715K3071K0949N97l1572O888
$$ 74402 107094 122649 90015 2814 -55768 -46028 -27313 -4242 16707 17304 -14268 -7380
15446g380M2345j1886k9351J5608J374P795l3998K0812k363o966P709J5408K4923
$$ -7380 34965 23079 -6272 9336 10710 18505 -15493 5319 2956 -4010 3699 19107 44030
15433D4030j3456l0092m2751o5220l7526M3686N3951L6098J2845k5785j2885M4746
$$ 44030 30574 482 -42269 -107489 -145015 -101329 -47378 -11280 1565 -24220 -37105 7641
15421G641J9015J6045l3272J783K58n7688J981L6822M5778l4509L3702j2206q0084
$$ 7641 26656 42701 9429 11212 11470 -46218 -44237 -7415 38363 3854 37556 25350 -54734
15408e4734J199L0724L018K6370Q48J9881O3291M0860m3974k851o5655m8022J59
$$ -54734 -53535 -22811 -19793 6577 7425 27306 90597 131457 87483 84632 18977 -29045 -28886
15395b8886N139K2529k3876K109l8354O6846K6769R229j4286P8418l2440o9290
$$ -28886 -23747 -1218 -25094 -22985 -61339 5507 32276 41505 27219 105637 73197 3907
15383C907M481l7409N201M2367L041j6018m1312N7085O6112J5191p6021o4150
$$ 3907 8388 -29021 -23820 18547 21588 5570 -35742 21343 87455 102646 26625 -37525
15371c7525J6503L2882Q464p8167k2389j3516Q2536o296J8504j9578n6773K4298
$$ -37525 -21022 11860 20324 -57843 -80232 -93748 -11212 -17508 996 -18582 -75355 -51057
15359e1057N3729j0374j990q410m3820J3805K7415j9464j7802L7189p182K7066
$$ -51057 2672 -7702 -9692 -18102 -61922 -48117 -20702 -40166 -57968 -20779 -27961 -895
15347h95N5492l0483r3101L8939O4428L6591K8066m3252r5326l2253J7419j592
$$ -895 54597 24114 -68987 -30048 34380 70971 99037 55785 -39541 -71794 -54375 -55967
15335e5967M6236l0011K3528L7441L982j6835Q8918j3360q6131n0971J7559q056
$$ -55967 -9731 -39742 -16214 21227 25209 8374 97292 83932 -2199 -53170 -35611 -43667
15323d3667L55M46j7919N8894L6791J5159P940j1551o2708N8249j4996k3025M4333
$$ -43667 -43312 -42866 -60785 -1891 34900 50059 57999 46448 -16260 41989 26993 3968 48301
15310D8301M1613q710j3407r738K2100j2510k4118N4060L9737l221k7029m5434
$$ 48301 89914 81204 67797 58059 80159 67649 43531 97591 137328 134107 107078 61644
15298F1644n4710j8752l2310M0881O3559J283p142p131p2233O4253P4512L4483
$$ 61644 6934 -11818 -44128 -3247 60312 61595 54453 47322 -24911 39342 113854 148337
15286A48337n3869M065K9077o9391k565N1910n7640k7511J8483j8016J9958n20
$$ 148337 94468 98533 127610 58219 55654 107564 49924 22413 40896 22880 42838 42318
15274D2318j8441L0584M7979l9554o28J3520l8138k1392m5741k328K7854k5994
$$ 42318 23877 54461 102440 62886 62258 75778 37640 16248 -29493 -31821 -3967 -29961
15262b9961J2127K9336J3454l8266K1493N5046m3425m1021l1612l131O3006M5107
$$ -29961 -17834 11502 24956 -13310 8183 63229 19804 -21217 -52829 -55960 7046 52153
15250E2153j9088l7798m1652o2994j9101M2872J806L3550N2771N5121r1177p5921
$$ 52153 33065 -4733 -46385 -109379 -128480 -85608 -83802 -50252 2519 57640 -33537 -109458
15238a09458j1315R0550N5686j1536j295n1612k6618o719J5862k365r09l904j4074
$$ -109458 -120773 -30223 25463 13927 12632 -38980 -65598 -72317 -56455 -58820 -59729 -63633 -77707
15225g7707j9402O4867O1996q108m5585l4559L7563K4824J9926j542k7546k7647
$$ -77707 -97109 -32242 29754 21646 -23939 -58498 -20935 3889 23815 22273 -5273 -32920
15213c2920P262O1102N7228k4730j9475k6163Q381L7765N3180l9331j1134K548
$$ -32920 -25658 35444 92672 67942 48467 22304 30685 68450 121630 82299 71165 73713
15201G3713m9178j8636K5400m0912N81K1443J143l1222J058M5809m0179j4425
$$ 73713 24535 5899 31299 -9613 -9032 12411 13554 -17668 -16610 29199 -10980 -25405
15189b5405L0252J9952L4091m7929q2123l1342P522L6883L6013Q0455N6044k5201
$$ -25405 4847 24799 58890 10961 -71162 -102504 -94982 -58099 -22086 58369 114413 89212
15177H9212m1696j8577k4212K3169k043m3272m5778K0395J00540N5146n2412n9746
$$ 89212 47516 28939 4727 27896 25853 -17419 -63197 -42802 57738 112884 60472 726
15165G26M0730O3297q592n2661l5669L1052j1041k308j5801n6298k0838l000j6729
$$ 726 41456 104753 96161 43500 7831 38883 27842 25534 9733 -46565 -67403 -70403 -87132
15152h7132j140q626l7M9581L4339L848K0204K3053J468p747j6155j8509k2001
$$ -87132 -88272 -96898 -96935 -47354 -13015 -9167 11037 34090 35558 27811 11656 -6853 -28854
15139b8854k8071M3148L5213k1606l6856M657L8331J343m4388j6139K5348Q5502
$$ -28854 -56925 -13777 21436 -170 -37026 -32369 5962 7305 -37083 -53222 -27874 57628
15127E7628k8700P16N282N1858o7252p4761L1046P5741K2309j3371J6045L3322
$$ 57628 28928 29644 34926 86784 19532 -55229 -24183 51558 73867 60496 76541 109863
15115A09863L7649k8678k6553j5977k0438k4863k0147k5411l1760K0273n9836
$$ 109863 147512 118834 92281 76304 55866 31003 10856 -14555 -46315 -26042 -85878
15104h5878l802J4984L3078M4791m8110L3985Q2375l2501l2346K406j5905L1988
$$ -85878 -89680 -74696 -41618 3173 -44937 -10952 71423 38922 6576 8982 -6923 25065
15092B5065K3701N8607K1940m7864n2465p6134K9443O2713K3353j468k4320q0066
$$ 25065 48766 107373 129313 81449 28984 -47150 -17707 45006 68359 66891 42571 -37495
15080c7495J9691O5579L2906o657q4884L3598m8007k2795J3713k4948J7123j1727
$$ -37495 -17804 47775 80681 74024 -10860 22738 -25269 -48064 -34351 -59299 -42176 -53903
15068e3903N3168J8014l5049k3426Q141J8886M0840J5015k5474j9470l6857j1227
$$ -53903 -735 17279 -17770 -41196 -33055 -14169 26671 41686 16212 -3258 -40115 -51342
15056e1342L9640J4190q889o3646m0038J502J6230O0734L7189R130m8621k2291
$$ -51342 -11702 2488 -6401 -70047 -110085 -108583 -92353 -31619 5570 14700 -33921 -56212
15044e6212K2663M0942l5536l4385J6595j022l9546k4932K8914L8044L1380K3444
$$ -56212 -33549 7393 -28143 -62528 -45933 -46955 -86501 -111433 -82519 -44475 -13095 10349
15032A0349k2471K0156l1154m3021M3357j2792n593K8876M7980J4465m9648K5810
$$ 10349 -12122 8034 -23120 -66141 -22784 -35576 -41169 -12293 35687 50152 504 26314
15020B6314nK0454K4252l5473K7948N2209l9672r1322m9755n502Q5943M3625J9756
$$ 26314 26309 46763 71015 35542 63490 115699 76027 -15295 -65050 -70552 15391 59016 78772
15007G8772l7333q9046m5221j7263L7339Q921L0759J1999j4753N5853N0972K6521
$$ 78772 41439 -47607 -92828 -110091 -72752 -63831 -33072 -21073 -35826 20027 70999 97520
14995I7520l967L670m2247k6776m8245m1045l918O1143L3401n4327J8450k2498
$$ 97520 93553 97223 54976 28200 -20045 -61090 -65008 -3865 29536 -24791 -6341 -28839
14983b8839m2950N469K9713M7013N0014n1697n1510M916m920n5096K2538L9387
$$ -28839 -71789 -66320 -36607 10406 60420 8723 -42787 -37871 -42791 -97887 -75349 -35962
14971c5962l089P249J9858j3327P309J2297M735P381j6205M1593O6619n118k8732
$$ -35962 -39051 -31802 -11944 -25271 -17962 -5665 -930 6451 -9754 31839 98458 93340 64608
14958F4608m756N2949L741l1424o4083M518j1794j4330J719j3944K2671j1503
$$ 64608 59852 112801 116542 85118 21035 25553 13759 -571 1148 -12796 9875 -1628
14946a628m8106J1429M9593O4468l375O602o4679l8660k3617k7943P742o532N5654
$$ -1628 -49734 -38305 11288 75756 72381 78983 14304 -24356 -47973 -75916 -68174 -74706 -19052
14933a9052J8100K6M9510N166l8165j744J3669J1122J6008o399K1353k5022k4687
$$ -19052 -952 -926 48584 53750 15585 13841 27510 38632 54640 48241 69594 44572 19885
14920A9885j3850K3966M2566M0853o9235n4286J6409J8460J246j5290M2096k9568
$$ 19885 6035 30001 72567 113420 44185 -10101 6308 24768 26014 10724 52820 23252
14908B3252j694n791J1296l856k768K7339K2546K1793o586l7990o5796m5734O6185
$$ 23252 21558 15767 27063 23207 20439 47778 70324 92117 85531 47541 -18255 -63989 2196
14895B196k3991q538L303l4363J2113K0055K0847N626l3755j7590j1193j7942
$$ 2196 -21795 -30333 -27030 -61393 -49280 -29225 -8378 -2752 -36507 -54097 -65290 -83232
14883h3232M6413P9213m855k2362p0055K3334O9351K6922L1150m5561j0213M2262
$$ -83232 -36819 42394 37539 15177 -54878 -31544 37807 64729 95879 50318 40105 82367
14871H2367k5039r8096n645K6257k0321J7780J8092L901K0371l4802n5522M5972
$$ 82367 57328 -40768 -46413 -20156 -40477 -22697 -4605 -704 19667 -15135 -70657 -24685
14859b4685K4519n9254k2313j1914M1210N4722J2825k9985J1278k5757O629J0855
$$ -24685 -166 -59420 -81733 -93647 -52437 2285 15110 -14875 -3597 -29354 -22725 -11870
14847a1870O984m747K3085j0908o1109n262J5186L7878j309j6982M7746P060j8303
$$ -11870 -4886 -9633 13452 2544 -58565 -63827 -48641 -10763 -12072 -29054 18692 25752 7449
14834G449K2372k3597j3901K1937J3680k6180j866j6615r627p215l5382l6368
$$ 7449 29821 6224 -7677 14260 27940 1760 -106 -16721 -26348 -33563 -68945 -105313
14822a05313K3420L3085K4612l464j1228m2326N0771K922O673K7736L8755o556
$$ -105313 -81893 -48808 -24196 -27660 -38888 -81214 -30443 -27521 -20848 6888 45643 39087
14810C9087j9887Q630J5911K6618L0845j9627K5408j3660M2840m067n9285o5250
$$ 39087 19200 27830 43741 70359 101204 81577 106985 93325 136165 132098 72813 7563
14798G563k667J5903L801j3175J085l4080j5052K2093L9566J2729k7311k4596
$$ 7563 4896 20799 24600 11425 12510 -21570 -36622 -14529 25037 37766 10455 -14141
14786a4141k8800q824Q218m2244K6787K4894J4461n466J1380r172r605K4922J8724
$$ -14141 -42941 -51765 -43547 -85791 -59004 -34110 -19649 -25115 -13735 -22907 -32512 -7590 11134
14773A1134J6974k1732p688m6968p4208k0672J4754N7804Q0121k0698L6545p395
$$ 11134 28108 6376 -1312 -48280 -122488 -143160 -128406 -70602 9519 -11179 25366 17971
14761A7971j5191R230k3028M0826P4673m728j3219o928j6222l7452K7490l0044
$$ 17971 2780 12010 -11018 29808 104481 99753 86534 79606 63384 25932 53422 23378
14749B3378K986m5649m0369N274k7438k2930K1258K8287N4189J3596K5090j4697
$$ 23378 26364 -19285 -59654 -54380 -81818 -104748 -83490 -55203 -1014 12582 37672 22975
14737B2975j8372k1405Q870J8232k3149k5140m440l6488L70K8298j578J0712j416
$$ 22975 4603 -16802 -7932 10300 -12849 -37989 -42429 -78917 -78547 -50249 -51827 -41115 -42531
14724d2531R928J5775k4903N4202K0503K492K5271l8790J053K5711L6151j5437
$$ -42531 -32603 -16828 -41731 12471 32974 35466 60737 21947 23000 48711 84862 69425
14712F9425n7620O1158j969m195q475l6045L2700L7712L1877m6644l9655k6839
$$ 69425 11805 72963 70994 66799 58324 22279 54979 92691 124568 77924 38269 11430
14700A1430K6760J7186K471K0472r140l6059j1941K2215K9030j5821n9048k5103
$$ 11430 38190 55376 57847 78319 69179 33120 21179 43394 72424 56603 -2445 -27548
14688b7548O613J3177j9480L3496K0169l2335J7095K9258L829p5133n9965M2295
$$ -27548 -20935 -7758 -27238 6258 26427 -5908 11187 40445 44274 -30859 -90824 -48529
14676d8529M2784Q1844O639n1824J2690q122m3916k3230N614l869l0184N3116
$$ -48529 -5745 76099 82738 30914 43604 35482 -8434 -31664 -26050 -29919 -60103 -6987
14664f987O9110L8102n8693n2945L4454L8805n1575J7026m0288n8919j9399L6848
$$ -6987 62123 100225 41532 -11413 23041 61846 10271 27297 -12991 -71910 -91309 -54461
14652e4461j6151L8170J9726m0107k4752K0432K1020N6965k549m6754P249L1648
$$ -54461 -70612 -32442 -12716 -52823 -77575 -57143 -36123 20842 18293 -28461 -21212 10436
14640A0436J0894o0471K5176M0165L7271K5035L436j5623L616o2741l2595N4946
$$ 10436 21330 -39141 -13965 26200 63471 88506 91942 76319 79935 17194 -15401 39545
14628C9545K5686O7342J7717k5396p847N014k4530j02345j8775L9822J4304K7790
$$ 39545 65231 132573 150290 124894 117047 122061 97531 -4814 -23589 16233 30537 58327
14616E8327j012J9740o1380p2669k391M0764L4009j760k0405k4468K7417N2376
$$ 58327 57315 77055 15675 -56994 -59385 -18621 15388 13628 -6777 -31245 -3828 48548
14604D8548j4667p273J5122p5274k6159l3389k862Q4643M4483Q48m5396o0293
$$ 48548 33881 26608 41730 -33544 -59703 -93092 -95954 -11311 33172 34020 -11376 -71669
14592g1669l6874k9010P6247R1468Q432l3707P39M793m8926Q245k6735J3899K6218
$$ -71669 -108543 -137553 -61306 30162 38594 4887 5626 10419 -38507 -30262 -56997 -43098 -16880
14579a6880K410J9570K6533M7583k0312n3639N0361J0122k4953k3780L0923k2236
$$ -16880 -14470 5100 31633 79216 58904 5265 55626 65748 40795 17015 47938 25702
14567B5702m2232r9113J945j9510N2271R5090J0603P240M0294K4897n1300j5791
$$ 25702 -16530 -115643 -113698 -133208 -80937 14153 24756 31996 72290 97187 45887 30096
14555C0096k3711m5094l117J6513O4018q534K4429m1686k7691j4473M976o372
$$ 30096 6385 -38709 -41826 -25313 38705 30171 54600 12914 -14777 -29250 -24274 -30646
14543c0646m7943p4710M6684M9897N2738l8301m6374k8760O8709L9844j2431l7561
$$ -30646 -78589 -153299 -106615 -56718 -3980 -42281 -88655 -117415 -48706 -8862 -21293 -58854
14531e8854K5335n657J3327J0387p080m636R177j9528K9290j2811l6616L2862
$$ -58854 -33519 -39176 -25849 -15462 -22542 -27178 -18001 -37529 -8239 -21050 -57666 -24804
14519b4804n637J2784N1382R398l8767k6521K1820P2450N728j1160L1017k8086
$$ -24804 -30441 -17657 33725 43123 4356 -22165 -345 72105 77833 66673 97690 69604
14507F9604j9372k665R544N2853l1495n0139P687J9273N637J0408M8667n7832
$$ 69604 50232 47567 57111 109964 78469 28330 36017 55290 60927 71335 120002 62170
14495F2170l5414k6772n6898P239P9031L8959o620K1666k2905o3381j6223J5703
$$ 62170 26756 -16 -56914 -49675 29356 68315 61695 83361 60456 -2925 -19148 -3445
14483c445K2372o069M1356L2295p8727k4794O6028L9150k6724o4712K8721j9441
$$ -3445 18927 12858 54214 86509 7782 -17012 49016 88166 61442 -3270 25451 6010
14471F010m1606K2209L0576K2020j6975n0254j4820J6608J5968N8161n788p3856
$$ 6010 -35596 -13387 17189 39209 22234 -28020 -42840 -26232 -10264 47897 42109 -31747
14459c1747l5500P4662j3038n361l1351L9404O1519p0602J7791K5163K9394J358
$$ -31747 -67247 7415 -5623 -10984 -42335 -2931 58588 -12014 5777 30940 60334 61692
14447F1692l8684m9312k5463j166L3134l763Q061l1569k6436K7639P344k4732
$$ 61692 23008 -26304 -51767 -52933 -19799 -23562 -15501 -47070 -73506 -45867 -38523 -63255
14435f3255K6186J8677K9203L283p857J0510j1532k7559P2834L5121j7755j5857
$$ -63255 -37069 -18392 10811 14094 6237 16747 5215 -22344 50490 85611 67856 51999
14423E1999l3248j0691L5625J280j5624p0215O480M9382Q648j4971l2763k4651
$$ 51999 18751 8060 43685 44965 29341 -40874 -34394 14988 23636 8665 -24098 -48749
14411d8749j4275k1444K5599R4370L6661n5919m3295j3201k5167l123K3131M5760
$$ -48749 -63024 -84468 -58869 35501 72162 16243 -27052 -40253 -65420 -68543 -45412 348
14399C48l24L9401j2870p6368o3604K2348N9914L1476k2317k1826N2076J0342
$$ 348 24 39425 26555 -49813 -113417 -91069 -31155 321 -21996 -43822 8254 18596
14387A8596L8464J5282p0006j1529J3430j3833l4231k9801j3714L8518K4175K2365
$$ 18596 57060 72342 2336 -9193 4237 -9596 -43827 -73628 -87342 -48824 -24649 -2284
14375b284j6760p065K0749K5070k3843O031L7330j845l4977N335K346O2667L5229
$$ -2284 -19044 -26109 -5360 19710 -4133 1898 39228 37383 2406 7741 10087 72754 107983
14362A07983o631k1277n2660J9936L0354k6554J508L9254o282l5806n2572r888
$$ 107983 101352 80075 27415 47351 77705 51151 52659 91913 85631 49825 -2747 -12635
14350a2635L7905k2480j9650L7827N0172j8248n5593n1897P707k0970R922K7479
$$ -12635 25270 2790 -16860 20967 71139 52891 -2702 -54599 -46892 -67862 -57940 -30461
14338c0461L5465L842J593o444J001k2911J6582K838n7636k241O7355K3430n665
$$ -30461 5004 8846 10439 3995 4996 -17915 -1333 1505 -56131 -58372 8983 32413 26748
14325B6748K769J2161M560M511n955K4924l6979o5550l3456N0390m885j3127q847
$$ 26748 29517 41678 46238 50749 44794 69718 32739 -32811 -66267 -15877 -20762 -33889 -42736
14312d2736L046P299J9924K1522J4223J2362J7330l8172Q862K9699n7847J2143
$$ -42736 -39690 -32391 -12467 9055 23278 35640 52970 14798 23660 53359 -4488 7655
14300G655M6040j724K0213r949o4946j301j4165k9088L6136M8169k7000o6969
$$ 7655 53695 51971 72184 62235 -2711 -4012 -18177 -47265 -11129 37040 10040 -56929
14288e6929l4650k6005J1878M1631M8916L9825N8450P3725q978p2732l2369N796
$$ -56929 -91579 -117584 -105706 -64075 -15159 24666 83116 156841 147863 75131 42762 48558
14276D8558O6341o4k1775j3438n3462k3421m339j2063m378q204K0611P4055l7589
$$ 48558 114899 114835 93060 79622 26160 2739 -1600 -13663 -18041 -26245 -5634 68421 30832
14263C0832n8990l5171k570Q5188J088m5016l3057K596n0559j5004M0864L5999
$$ 30832 -28158 -63329 -65899 19289 20377 -24639 -57696 -55100 -105659 -120663 -79799 -43800
14251d3800K7536O1097J1448q9941n3381R1007J02740K6839J7911m4423K5044
$$ -43800 -16264 44833 56281 -33660 -87041 3966 106706 133545 151456 107033 132077
14240A32077J6602J5748j1169m9578k0484n9355o5202M0503Q529n5542J368N5792
$$ 132077 148679 164427 153258 103680 83196 23841 -41361 -858 7671 -47871 -46503 9289
14228I289J6912l3360m9908J9996L6723L5644l1978L1566r157k8904K0359j5199
$$ 9289 26201 -7159 -57067 -37071 -348 35296 3318 34884 25727 -3177 17182 1983
14216A983l9827R082q091K5020n003l2242l1511j5450J3229O1794P461L4838m779
$$ 1983 -37844 -28762 -36853 -11833 -16836 -49078 -80589 -96039 -82810 -21016 -13555 21283 16504
14203A6504n484L8002m958k0327J9178l061Q954J4286m2862j6742j8014K4537
$$ 16504 11020 49022 44064 23737 42915 39854 48808 63094 20232 3490 -14524 10013
14191A0013L9235m576k6249m2845N458k5989j0019M5347O052N477L6122J01143
$$ 10013 49248 44672 18423 -24422 -18964 -44953 -54972 -9625 -3573 1904 38026 139169
14179A39169J0209k2767k3848P916o2155m6201L3092J4990j7654k6494m4926j631
$$ 139169 149378 126611 102763 110679 48524 2323 35415 50405 32751 6257 -38669 -40300
14167d0300M414k0386Q0810K6063L0901K1547k2702l1913l9576n2224j0626l0288
$$ -40300 -35886 -56272 24538 50601 81502 103049 80347 48434 8858 -43366 -53992 -84280
14155h4280j1372n1084L3101p755k1740Q799M4975R3394K294l0303R021J5441
$$ -84280 -95652 -146736 -113635 -121390 -143130 -134331 -89356 4038 6332 -23971 -14950 491
14143D91j4940k5927k2951M976M1838J0050k9407L8277M6281N0699n6672o7451
$$ 491 -14449 -40376 -63327 -58351 -16513 -6463 -35870 2407 48688 99387 42715 -24736
14131b4736J9360J8968K7461L2470j0975l3296J8929j8626m4486j1613M618M0583
$$ -24736 -5376 13592 41053 73523 62548 29252 48181 29555 -14931 -26544 -21926 18657
14119A8657n280j1004n3999L8653J5202J6486J4147o6603p9826J9089k794J3221
$$ 18657 13377 2373 -51626 -12973 2229 18715 32862 -33741 -113567 -94478 -97272 -84051
14107h4051N4689M6069j8027K6857L0841j4676j2375J4761o614M1946M3895j9239
$$ -84051 -29362 16707 -1320 25537 56378 41702 29327 44088 37474 79420 123315 104076
14095A04076k9432n0206k3534j1675L0348M9695L6583o3138R465J4602k6662n332
$$ 104076 74644 24438 904 -10771 19577 69272 105855 42717 52182 66784 40122 34790
14083C4790n1347l9547J1810N5756K2878J4861k8304J969k2631L0705O714q7075
$$ 34790 -16557 -56104 -44294 11462 34340 49201 20897 22866 235 30940 37654 -49421
14071d9421m839J0913J774l040O570K6533N467j744L8595k536l5832l2595L8509
$$ -49421 -54260 -43347 -41573 -44613 -38043 -11510 -6043 -7787 30808 28272 -7560 -40155 -1646
14058a646J154L8802L476J8726k3167k5439M010J15j8563J8392j6545j4235k910
$$ -1646 -492 38310 41786 60512 37345 11906 15916 16031 -2532 15860 -685 -14920 -17830
14045a7830O234q170j096J463Q567L2805N0143j4066n8271M5392O1970o4746M07
$$ -17830 -11596 -19766 -20862 -19399 -10832 21973 72116 58050 -221 45171 107141 42395 42802
14032D2802j0356n7977r1598j1730N5994N4723j990l2322K8960J22899n603l5564
$$ 42802 32446 -25531 -117129 -128859 -72865 -18142 -20132 -52454 -23494 99405 93802 58238
14020E8238l8792J9789J7805o8402R928k7316O542O9965k5439q0492o680K8080
$$ 58238 19446 39235 57040 -11362 -1434 -28750 -22208 47757 22318 -58174 -64854 -36774
14008c6774l6991L9408O7426N5875n5629o9609j6293k4440O7807Q2755R853m5005
$$ -36774 -73765 -34357 33069 88944 33315 -36294 -52587 -77027 -9220 73535 83388 38383
13996C8383k2374L4598Q992n4287r3737m2702R1298O0654l0095j217J020l4555
$$ 38383 16009 50607 59599 5312 -88425 -131127 -39829 20825 -9270 -10487 -9467 -44022
13984d4022o351K4071m8128m4270J0640Q4240q671k291m3917p967o24k1304M5522
$$ -44022 -50373 -26302 -74430 -118700 -108060 -23820 -32491 -34782 -78699 -86666 -87290 -108594 -63072
13971f3072l0202O4036M8763j2958Q076j2006K367j2646L3370M2400n8183o7329
$$ -63072 -93274 -29238 19525 6567 14643 2637 5004 -7642 25728 68128 9945 -57384
13959e7384j893K2294L4405k6894r691Q5343m8648n0925m558L7610k2871j0844
$$ -57384 -59277 -36983 -2578 -29472 -39163 46180 -2468 -53393 -57951 -20341 -43212 -54056
13947e4056N5650J5792j1652J7784k5725o3897j6921j2826J7521O2540k8714K8598
$$ -54056 1594 17386 5734 23518 -2207 -66104 -83025 -95851 -78330 -15790 -44504 -15906
13935a5906K8247l7332j1640j9794O397N835N4496N2248J8173m7507m5200k8377
$$ -15906 12341 -24991 -36631 -56425 -50028 -44193 10303 62551 80724 33217 -11983 -40360
13923d0360J1965P5120k1278k6044m8165l1431M2228L6976k7508K1076N2200K5537
$$ -40360 -28395 46725 25447 -597 -48762 -80193 -37965 -989 -28497 -7421 44779 70316
13911G0316r7252m5681O688Q3534P0485j1906j8617J2209q953o0795l1960J0463
$$ 70316 -26936 -72617 -65929 17605 88090 76184 57567 69776 60823 28 -31932 -21469
13899b1469j5875K0006M1429J7879P394k0745l778l7347m0296n4970L1617N9772
$$ -21469 -37344 -17338 24091 41970 49364 28619 24841 -12506 -52802 -107772 -76155 -16383
13887a6383J7340L1128N1730n5669j22090l2199N5217P1798P2210J005j5471j4520
$$ -16383 957 32085 83815 28146 -93944 -126143 -70926 872 73082 74087 58616 44096
13875D4096m3790p4741K4863L8449L0770J9225L4767J7995k3483l9849m308J4242
$$ 44096 306 -74435 -49572 -11123 19647 38872 73639 91634 68151 28302 23994 38236
13863C8236m058K4854K9207k4820l9290M9448q103o8066o5565M909M6675M6294
$$ 38236 34178 59032 88239 63419 24129 73577 65474 -2592 -68157 -63248 -16573 29721
13851B9721P094L330q8598n156J1298l3004K7531N5864J6150q074k6049k7366
$$ 29721 36815 40145 -48453 -53609 -42311 -75315 -47784 8080 24230 16156 -9893 -37259
13839c7259L9143K8762l432M7241k8724m0515K7108K9486j9884m0190k346q64
$$ -37259 1884 30646 27214 74455 45731 5216 32324 61810 41926 1736 -610 -1474
13827a474L9528M5393J0838n611j3592R557k0015p463m1405n115l0656j1933P5065
$$ -1474 38054 83447 94285 88674 75082 84639 64624 57161 15756 10641 -20015 -31948 43117
13814D3117O8272o6733q9531N2524J9795n0115j4243r953r058j5642l953L6547
$$ 43117 111389 44656 -44875 7649 27444 -22671 -36914 -46867 -55925 -71567 -75520 -38973
13802c8973L4627N0349M2031l1208o2062J7885K1347k8374k6248J0343m942M702
$$ -38973 -4346 46003 88034 56826 -5236 12649 33996 5622 -20626 -10283 -15225 -10523
13790a0523L4002P178J0165j0688m3990L1198O523o935N476n1995m7175j8810
$$ -10523 23479 30657 40822 30134 -13856 17342 23865 16930 22406 -29589 -76764 -95574
13778i5574j4320J4188J7153K3796L5523N5408J7821j9858k8609K1710l469j5215
$$ -95574 -109894 -95706 -78553 -54757 -19234 36174 53995 34137 5528 27238 23769 8554
13766H554P6330K0690l2946m4507m7249K0445l8928q674K5438O3786L1322J9802
$$ 8554 84884 105574 72628 28121 -19128 1317 -37611 -46285 -20847 42939 74261 94063
13754I4063Q4099j458p6187l8474j897K94l9277k6006j1493N714N5960n868K2954
$$ 94063 178162 176704 100517 62043 60146 60440 21163 -4843 -16336 -10622 45338 39470 62424
13741F2424N8718N196k6255m0858n0011j6182O0293M1971l7164k9100k017l8819
$$ 62424 121142 126338 100083 59225 9214 -6968 53325 95296 58132 29032 27015 -11804
13729a1804M2066M7014j3321m8545j9873K1421O8864l3092m577o682k0622M9596
$$ -11804 30262 77276 63955 15410 -4463 16958 85822 52730 48153 41471 20849 70445
13717G0445J3574Q957j12363M3L9200k8560k5243m462j7980L062q31K4700J3744
$$ 70445 84019 92976 -19387 -19344 19856 -8704 -33947 -38409 -56389 -53327 -54158 -29458 -15714
13704a5714M2002l8938k6120L2567j2479M5757M0902j0388K847N6137R027k3841
$$ -15714 26288 -12650 -38770 -6203 -18682 27075 67977 57589 60436 116573 125600 101759
13692A01759m4777n9041l8812N3949J3049N619K5115j1353m4942k7699l8618m8120
$$ 101759 56982 -2059 -40871 13078 26127 31746 56861 45508 566 -27133 -65751 -113871
13680a13871K5105N9505K0896J2542L5719j7968k9986L7161K6613L1124Q0325
$$ -113871 -88766 -29261 -8365 4177 39896 21928 -8058 29103 55716 86840 167165
13669A67165p3620p4657j1882P553K3787J3337M6789l3632p3771m9616j2456P0370
$$ 167165 93545 18888 7006 14559 38346 51683 98472 64840 -8931 -58547 -71003 -633
13657f33k3399M0655L7264M4806K4532n2319m2091n954m99j9133J3315K0107O61
$$ -633 -24032 16623 53887 98693 123225 70906 28815 22861 22362 3229 16544 36651 37312
13644C7312l5647j1932K4234L7936K534J5348p3055j2654J8875k3337M490n383
$$ 37312 1665 -10267 13967 51903 54437 69785 -3270 -15924 2951 -20386 -15896 -21279
13632b1279L91J4041l5587k301R0939J6415n0435M8683l5768n4168J1968l0921
$$ -21279 -20888 -6847 -42434 -44735 46204 62619 12184 60867 25099 -29069 -17101 -48022
13620d8022P552L5780J2699r652J9513J3191N614l2795j6649l0612r522N4942
$$ -48022 -40470 -4690 8009 -1643 17870 31061 36675 3880 -12769 -43381 -52903 2039
13608B039K7691N9230j6797r7638q8827k0433L8476P557o010M3153L5460O4063
$$ 2039 29730 88960 72163 -25475 -114302 -134735 -96259 -88702 -94712 -51559 -16099 47964
13596D7964N315k7190j5739k0201O815j3469n9280L7683J3271J4548L1204L1636
$$ 47964 53279 26089 10350 -9851 -3036 -16505 -75785 -38102 -24831 -10283 20921 52557
13584E2557q760j7154N103o4376m9589K2911k2523L6715m1579o4109Q5259k6635
$$ 52557 43797 26643 31746 -32630 -82219 -59308 -81831 -45116 -86695 -150804 -65545 -92180
13572i2180J9391P5995N8546j4597o866k5805j4936m866m7589j0491K1132m2845
$$ -92180 -72789 3206 61752 47155 40289 14484 -452 -5318 -52907 -63398 -42266 -85111
13560h5111j8522K7963P5811j7401k1691P157N898n975J6968L7566J4207k5639
$$ -85111 -103633 -75670 141 -17260 -38951 -31794 -25896 -31871 -14903 22663 36870 11231
13548A1231L7573M9445K3263P911l3284r0942m7290k8903K289L7454M3237O0753
$$ 11231 48804 98249 121512 129423 96139 5197 -42093 -70996 -68707 -31253 11984 72737
13536G2737j9157J6852k6270l5938k6266P779L7572J6841J7780R280j9948l485
$$ 72737 53580 70432 44162 8224 -18042 -10263 27309 44150 61930 71210 51262 47777
13524D7777j1964n3503N1923N6731k2828m9580m6050J3519j8807Q942m8097O6402
$$ 47777 35813 -17690 34233 90964 68136 18556 -27494 -13975 -32782 -23840 -71937 -5535
13512e535R7786n0503n4619j3996r721M6319J6289k5043m350L535J0172j6187
$$ -5535 92251 41748 -12871 -26867 -36588 9731 26020 977 -3373 162 10334 -5853
13500e853l5461O2519j2239j0659J1222K5409k2728k1201L8890M3119l1581l8363
$$ -5853 -41314 21205 8966 -1693 9529 34938 12210 -8991 29899 73018 41437 3074
13488C074k2381R295J4793k939K0053J120l8541m0973l3437l4569N7698K3842
$$ 3074 -19307 -10012 4781 1842 21895 23015 -15526 -56499 -89936 -124505 -66807 -42965
13476d2965J6766J596M0581R8748m7932m1407K2649k8984k3625k9380M3917K2616
$$ -42965 -26199 -24603 15978 114726 66794 25387 48036 19052 -4573 -33953 9964 32580
13464C2580K3352o21m9750j6396n2019j0388R209L7386k0335j1732L7408J9460
$$ 32580 55932 55311 5561 -10835 -62854 -73242 -64033 -26647 -46982 -58714 -21306 -1846
13452a846J8406K8720n4423N308j2515k8730L2674l7862N0164N8626q322n1660
$$ -1846 16560 45280 -9143 -3835 -16350 -45080 -12406 -50268 -104 58522 50200 -1460
13440a460k6864o124j0905q7834M3981O0096L2710J3837P591j2925j9099N9m4424
$$ -1460 -28324 -34448 -45353 -133187 -89206 -29110 3600 17437 25028 12103 -6996 -6937 -51361
13427e1361O4395N2947l0667m128j329q723J9707m7631n4534P5623K4497j0223
$$ -51361 13034 65981 35314 31186 29857 21134 40841 -6790 -61324 14299 38796 28573
13415B8573L0038j8570p251j2353l4l6026r38o224j0526k2754r974n554l8001
$$ 28573 58611 40041 32790 20437 20403 -15623 -16561 -22785 -33311 -56065 -66039 -71593 -109594
13402a09594j4152O314P1385P6462l1679O235L4045l3894K058N7227m3504l6224
$$ -109594 -123746 -117432 -46047 30415 -1264 4971 39016 5122 7180 64407 20903 -15321
13390a5321O455l8039l5133j607j6163N899O8088P2721L7015l0209l13J7932R195
$$ -15321 -8866 -46905 -82038 -83645 -99808 -93909 -25821 46900 83915 53706 53393 71325 80520
13377H0520P656j1220J5538l0144j4463m343k5837m369k0129j2926k7441j7705
$$ 80520 88176 76956 92494 62350 47887 43544 17707 13338 -6791 -19717 -47158 -64863
13365f4863l227M2405M9935n5595k1304J5305M613J7524j04678n6100M3872M8684
$$ -64863 -68090 -25685 24250 -31345 -52649 -37344 -32731 -15207 -119885 -175985 -132113 -83429
13353h3429L8816l7267P3428M6717M234M094q2496p2036j6718P9502J7247J5518
$$ -83429 -44613 -81880 -8452 38265 42499 46593 -35903 -107939 -124657 -45155 -27908 -12390
13341a2390k8013Q019R032o544N330J9687p885j7973K1010O8927j1120l5031K6994
$$ -12390 -40403 -32384 -23352 -29896 -24566 -4879 -12764 -30737 -9727 59200 48080 13049 40043
13328D0043o7461k3117K5288m4224m2735M8866R6301K8526j1214k4545J5629M6033
$$ 40043 -27418 -50535 -25247 -69471 -112206 -63340 32961 61487 50273 25728 41357 87390
13316H7390J0044J3466n2892j3443K1325p061o8781n8716l0794j7380L4932K5431
$$ 87390 97434 110900 58008 44565 65890 58829 -9952 -68668 -99462 -116842 -81910 -56479
13304e6479M2927Q1578N6738j5389l4580k4582m4129l3046K8197p220j4360J455
$$ -56479 -13552 68026 124764 109375 74795 50213 6084 -26962 1235 -5985 -20345 -18890
13292a8890K5533J4311K8411k0490n6863j5762K0159O6396j5193o1105j5113j2347
$$ -18890 6643 20954 49365 28875 -27988 -43750 -23591 42805 27612 -33493 -48606 -60953
13280f0953m9872p0582K7423J03413N2273j0598m2439K5176L1436K9298q228o116
$$ -60953 -110825 -181407 -153984 -50571 1702 -8896 -51335 -26159 5277 34575 26347 20231
13268B0231J1525K74n3020l0777J3815K4563L299r188K1712j6527k7159K1129
$$ 20231 31756 32030 -20990 -51767 -37952 -13389 -10090 -19278 2434 -14093 -41252 -20123
13256b0123L1384l569J0651O1330J4939m3787l8234N598J9537L365K3426k0855
$$ -20123 11261 7692 18343 79673 94612 50825 12591 18189 37726 41091 64517 43662
13244D3662m2007m2160J3983L7491L9169K244l6696L2149j3224J5262r086P646
$$ 43662 1655 -40505 -26522 10969 50138 52382 15686 47835 34611 49873 40787 48433
13232D8433J7401k7333j3370K440k3957N768n4832o6834J8514L1237J7352M4275
$$ 48433 65834 38501 25131 27571 3614 9382 -45450 -112284 -93770 -62533 -45181 -906
13220i06k963m850J6044L1124J0630k6875j0296L3847N1651n5557r4621M1413
$$ -906 -3869 -8719 7325 38449 49079 22204 11908 45755 97406 41849 -52772 -11359
13208a1359L5550n3785l7459k0519j6347J8409P7192L7742O2906l2960k5891O422
$$ -11359 24191 -29594 -67053 -87572 -103919 -85510 -8318 29424 92330 59370 33479 39901
13196C9901j4912l5856m2426l4124Q930P0566J192j6767k3348J0621N4761J5119
$$ 39901 24989 -10867 -53293 -87417 -78487 -7921 -6729 -23496 -46844 -36223 18538 33657
13184C3657j7257k1992o965n4859k4176j2795K6595P8620N6588K816Q7813m956
$$ 33657 16400 -5592 -12557 -67416 -91592 -104387 -77792 828 57416 60232 148045 143089
13172A43089J1628n2622n5359k9636r5875j5666M7977M4426K5214m669l4515p011
$$ 143089 154717 102095 46736 17100 -78775 -94441 -46464 -2038 23176 18507 -16008 -23019
13160b3019L3315o461j8849k5416j1001M630L191J9725K2246P219P24N3079J4704
$$ -23019 10296 3835 -15014 -40430 -51431 -46801 -43610 -23885 -1639 5580 6304 59383 74087
13147G4087k4481J0369Q035o454q5650k4091k884O1952L5654N5457l7516j06606
$$ 74087 49606 59975 68010 61556 -24094 -48185 -51069 10883 46537 101994 64478 -42128
13135d2128q3708l1590J02733M0316q369L6828n2839n6402L432N7299O2671K9196
$$ -42128 -125836 -157426 -54693 -14377 -22746 14082 -38757 -95159 -91727 -34428 28243 57439
13123E7439k1483K9391P806m995R982k5311R513l5743o7597k7082k1222K4395
$$ 57439 35956 65347 73153 68158 78140 52829 62342 26599 -40998 -68080 -89302 -64907
13111f4907L9437J2701K2416N0902J6462j4358k7467m3002m2657k5853J3722N2640
$$ -64907 -25470 -12769 9647 60549 77011 62653 35186 -7816 -50473 -76326 -62604 -9964
13099i964N4917j7070o4516k9000J3836K2131j6190K1479L6031L8848l2898l287
$$ -9964 44953 27883 -36633 -65633 -51797 -29666 -45856 -24377 11654 50502 17604 14317
13087A4317M3807r717k5589O647M9372o929q7525l4710j389k4718l5830P4154
$$ 14317 58124 48407 22818 29465 78837 71908 -15617 -50327 -51716 -76434 -112264 -38110
13075c8110J8114j0819k3444K0588N0084L171M9561k8234l8898L6318R710J7803
$$ -38110 -19996 -30815 -54259 -33671 16413 19584 69145 40911 2013 38331 48041 65844
13063F5844m3826J0015M5373M7315m6593j04538m154L4936p878n6865J7396o005
$$ 65844 22018 32033 77406 124721 78128 -26410 -30564 4372 -3506 -60371 -42975 -48980
13051d8980O0577M5488O798l5328q832k9845J4316J9186L257J1376l5323k6124
$$ -48980 11597 57085 63883 28555 19723 -10122 4194 23380 26637 38013 2690 -23434
13039b3434L1337k5278j7348M0202L7786j025p1688k4197N346J03610Q596j4195
$$ -23434 7903 -17375 -34723 5479 43265 42240 -29448 -53645 -48299 55311 63907 49712
13027D9712j684k3649k4537k5127K0079P5050O8007k9883n9787l0822l6648l5328
$$ 49712 48028 24379 -158 -25285 -5206 69844 137851 107968 48181 17359 -19289 -54617
13015e4617l220j0495M1504J273o332p784R1150M9481l173j6243l3157J6932o1664
$$ -54617 -57837 -68332 -26828 -25555 -31887 -39671 51479 100960 97787 81544 48387 65319 3655
13002C655k6273N973J7539m84N2526Q808k4794j5711L1993L6754L1747j5536l2529
$$ 3655 -22618 -16645 894 410 52936 61744 36950 21239 53232 89986 121733 106197 73668
12989G3668J7584P448r9269M7471o2162l8625P0453J8876K6125O3396J5116j19937
$$ 73668 91252 98700 -569 46902 -15260 -53885 16568 35444 61569 124965 140081 20144
12977B0144o8387l5698j2442L4985O7520k6142o0202M3862L3722K310J1260P122
$$ 20144 -48243 -83941 -96383 -61398 6122 -20020 -80222 -36360 -2638 -328 10932 18054
12965A8054M7251K2120j4117J9144m0848l3945k8650r6590k5975K8159J0701K4090
$$ 18054 65305 87425 73308 92452 51604 17659 -10991 -107581 -133556 -105397 -94696 -70606
12953g0606K8516p902N769L4009m3966m6205Q7384N4120M06J5816j5225q166n3014
$$ -70606 -42090 -49992 -44223 -10214 -54180 -100385 -13001 41119 41525 57341 42116 33950 -19064
12940a9064o3481K062O0273j572l550k0017M1593O2527n0372m6083Q053J0358
$$ -19064 -82545 -80483 -20210 -21782 -25332 -45349 -3756 58771 8399 -37684 -29631 -19273
12928a9273j993K5669M2591j7932o6166J0385K1685j5887k2824K4182K5513l0268
$$ -19273 -21266 4403 46994 29062 -37104 -26719 -5034 -20921 -43745 -19563 5950 -24318
12916b4318j5800r499L1404O8574l7892m0057J4909n459m814J302L604M8643L1562
$$ -24318 -40118 -49617 -18213 50361 12469 -27588 -12679 -18138 -22952 -21650 -18046 30597 62159
12903F2159n4044l7741k7019j2504k0018J5890J0269o960K9069p55J300J7763
$$ 62159 8115 -29626 -56645 -69149 -89167 -73277 -63008 -69968 -40899 -41654 -40354 -22591
12891b2591O173J7229l6296l2362N0832N3042K8145k8444o7332k2394J3360N8693
$$ -22591 -16418 811 -35485 -67847 -17015 36027 64172 35728 -31604 -53998 -40638 18055
12879A8055M3329o8589n2299l653k6791m0032J767M8495Q3032Q505n0603k683
$$ 18055 61384 -7205 -59504 -63157 -89948 -129980 -128213 -79718 3314 11819 -38784 -41467
12867d1467J7687J4639O440j401M160n7242k1648J9262J1705L5286j7800p3767
$$ -41467 -23780 -9141 -2701 -4102 58 -57184 -78832 -59570 -47865 -12579 -30379 -104146
12855a04146m558K1782J9054J3258j7298n4243J8368J7290O920J9310j4048Q377
$$ -104146 -108704 -86922 -67868 -54610 -71908 -126151 -107783 -90493 -83573 -64263 -78311 -69934
12843f9934K4445O4823j8083j8473K1448n4042n8423M8666K6367k6254m0594j6671
$$ -69934 -45489 19334 1251 -17222 4226 -49816 -108239 -59573 -33206 -59460 -100054 -116725
12831a16725O071j6379J7996N1608J8466k3163P4740M0343j9202l9157J3923j9507
$$ -116725 -110654 -127033 -109037 -57429 -38963 -62126 12614 52957 33755 -5402 8521 -10986
12819a0986N2248l1104j7311j0705k234J5183O6161K7819l9362l7864N924K5007
$$ -10986 41262 10158 -7153 -17858 -20092 -4909 61252 89071 49709 11845 17769 42776
12807D2776K0305o2865k9309M3979o383k9683O2491K5608n580l2662m0201o1037
$$ 42776 63081 216 -29093 14886 8503 -21180 41311 66919 61339 28677 -11524 -72561
12795g2561K738L9118n2576M7059M6555k1166J970l0949Q0789N0761o9875J6161
$$ -72561 -69823 -30705 -83281 -36222 10333 -10833 -8863 -39812 40977 91738 21863 38024
12783C8024j5910M2199j0995l1573k5973m3918N0736J9318l2506j4885m3925L719
$$ 38024 22114 64313 53318 21745 -4228 -48146 2590 21908 -10598 -25483 -69408 -65689
12771f5689J6100L3157K2195K4868n086N748k138o686l8514q114L2933K4055L644
$$ -65689 -49589 -16432 5763 30631 25545 31293 29155 22469 -16045 -24159 8774 32829 36473
12758C6473n252k7363l9376n029N8401O2416n2744m9757M9394R94j7291L143j05438
$$ 36473 31221 3858 -35518 -40547 17854 80270 27526 -22231 27163 28157 10866 14009 -91429
12745i1429n9040Q2071O2922j5063K3684O8185K3063l7296l1521k5540R169j6362
$$ -91429 -150469 -68398 -5476 -20539 3145 71330 94393 57097 25576 36 9205 -7157
12733g157k2600Q626M9917L083J6255N1263k0200p0766L0541l0928k2001L2491
$$ -7157 -29757 -21131 28786 31869 48124 99387 79187 8421 38962 8034 -13967 18524
12721A8524K7470n0241K0531n279l4774M678j2614k8601k0155L0642r66l698M3991
$$ 18524 45994 -4247 16284 11005 -23769 -19091 -31705 -60306 -80461 -49819 -50785 -54483 -10492
12708a0492J6035k0401j2776L5793m5317J3215L5850J2841j0288J4016l2556k7789
$$ -10492 5543 -14858 -27634 8159 -37158 -23943 11907 24748 14460 28476 -4080 -31869
12696c1869J7056l0109K2852M3261K0317l799O726j56k9169m6373M6573j2836
$$ -31869 -14813 -44922 -22070 21191 41508 37709 44435 44279 15110 -31263 15310 2474
12684B474M2631P042m0397m659o734k6507l4518j94N5249r85j7793m6701m8788
$$ 2474 45105 52147 11750 7091 357 -26150 -60668 -60862 -5613 -6598 -24391 -71092 -119880
12671a19880J3971M1869N992k5355k4457R667M1762K5231O173J8618J3646K6255
$$ -119880 -105909 -64040 -58048 -83403 -107860 -98193 -56431 -31200 -25027 -6409 7237 33492
12659C3492o8522q737P018M9186J4517n4297k3977M1878L3372j3836k1367J3790
$$ 33492 -35030 -43767 -36749 12437 26954 -27343 -51320 -9442 23930 10094 -11273 2517
12647B517j5041l2053J3788Q2271J9039m8431p93K9036L2268J4151n776l5026
$$ 2517 -12524 -44577 -30789 51482 70521 22090 21297 50333 82601 96752 90976 55950
12635E5950J1563n1651k6307K5877J0731N598j7650l1155R504m8511n24N2127
$$ 55950 67513 15862 -10445 15432 26163 31761 14111 -17044 -7540 -56051 -56575 -4448
12623d448k7188j7436Q237L9729M671L1170O5361k97p1652l3089l4230P8802J2966
$$ -4448 -31636 -49072 -40835 -1106 3565 34735 100096 99799 28147 -4942 -39172 39630 52596
12610E2596m4304p844P933N2291l9865n8542r6702P1031O6709O1572k6085o321
$$ 52596 8292 448 8381 60672 20807 -37735 -134437 -63406 3303 64875 38790 32469
12598C2469L312L1611j1808j864l7770m8483m5119N5146L7652l9513J4939n346
$$ 32469 35781 67392 55584 53720 15950 -32533 -77652 -22506 15146 -24367 -9428 -14774
12586a4774K0596M2953q846j3423k7599L0866Q561K7066l0253k357j9501j9453
$$ -14774 5822 48775 39929 26506 -1093 29773 38334 65400 35147 32790 13289 -6164
12574f164K0447n1188j7471J1081P313r141K311O5134J8280N9342K7666m7813
$$ -6164 14283 -36905 -54376 -43295 -35982 -45123 -42812 22322 40602 99944 127610 79797
12562G9797J1710m5738q5499O308n779L7051j8161K7252M2719KK1353l2071m7131
$$ 79797 91507 45769 -39730 -33422 -39201 -2150 -20311 6941 49660 49662 71015 38944 -8187
12549h187o4739j9196k922J7127J2864L2669N1249K1413l1509k8726N6568P0435
$$ -8187 -72926 -92122 -95044 -77917 -65053 -32384 18865 40278 8769 -19957 36611 107046
12537A07046L7766N5361L064l8068q2263R069J9746j05971P292Q5100j2775p8095
$$ 107046 144812 200173 203237 165169 82906 91975 111721 5750 13042 98142 85367 7272
12525G272L2764O4770l231J4569n142l1091k5951K7029k0326K2144j9166j7787
$$ 7272 40036 104806 101575 116144 111002 79911 53960 80989 60663 82807 63641 45854
12513D5854J2733P4182k2218Q007L9376n4421m4125M3930k0876k4313p2344j4111
$$ 45854 58587 132769 110551 118558 157934 103513 59388 103318 82442 58129 -14215 -28326
12501b8326l2754k3220N3047k352K263k1899l0464P818L1205k0167o2347L5664
$$ -28326 -61080 -84300 -31253 -33605 -31342 -53241 -83705 -75887 -44682 -64849 -127196 -91532
12489i1532n402P5154N2652k7511P914O1610K6970r139r053K0715q4846q7441
$$ -91532 -96934 -21780 30872 3361 11275 72885 99855 90716 81663 102378 17532 -69909
12477f9909n762M8900O4267O635n8227J8855J0654o450o2886j1785N8886P7366
$$ -69909 -75671 -26771 37496 44131 -14096 4759 15413 8963 -53923 -65708 -6822 70544
12465G0544n7365m2772k7059k7939K8458P6522k5364n1984K9284M6891p829o7589
$$ 70544 13179 -29593 -56652 -84591 -56133 20389 -4975 -56959 -27675 19216 11387 -56202
12453e6202m1895L1421k3777P743J00056O401k338N3142p834o097l7396p4244
$$ -56202 -98097 -66676 -90453 -82710 17346 23747 21409 74551 66717 60620 23224 -51020
12441e1020P19n482l6678j1821m089L3736Q1782O4342j0251k7879k4926k8810
$$ -51020 -50301 -55783 -92461 -104282 -108371 -74635 7147 71489 61238 33359 8433 -20377
12429b0377J6128J3272j4063M0504J6592m5112j5754l761j1841o6202l3507L3025
$$ -20377 -4249 9023 -5040 35464 52056 6944 -8810 -12571 -24412 -90614 -124121 -91096
12417i1096P3095M0124J9835l7104l3982J4957O1509l930j5324l3688k9539N831
$$ -91096 -18001 22123 41958 4854 -29128 -14171 47338 43408 28084 -5604 -35143 -29312
12405b9312L8408m779k1799K2737m0802K5042P1626J7726N283K3302j2574j7982
$$ -29312 9096 4317 -17482 5255 -35547 -10505 61121 78847 84130 107432 94858 76876
12393G6876N77l6429J39K549J7786M0760K796l3596k3772o582m843L2109P2341
$$ 76876 77453 41024 41163 43712 61498 102258 105054 71458 47686 41104 36261 68370 140711
12380A40711J1658j16164o5321j5107L0833J4169O593J6633K5720k5286l4669
$$ 140711 152369 36205 -29116 -44223 -13390 779 7372 24005 49725 24439 -10230
12369a0230l170m7917k0312N2528L650k1772k5534M145N699L1147J3936m3979
$$ -10230 -13400 -61317 -81629 -29101 -25451 -47223 -72757 -68612 -62913 -31766 -17830 -61809
12357f1809l6845M5020j2992j7035M1293M7126r186q653J0419j3970L6875J709
$$ -61809 -98654 -53634 -66626 -83661 -42368 4758 -4428 -13081 -2662 -16632 20243 21952
12345B1952l3215O377J7726K459j2650j6867m9663o506P6366J1967n139q423o410
$$ 21952 -11263 -4886 12840 15299 2649 -14218 -63881 -70387 5979 17946 12807 4384 -2026
12332b026Q10N8970K9659m1611k7606O111p178j172M9689j9739K629j3969O592
$$ -2026 -1216 57754 87413 45802 18196 24307 17129 15957 65646 45907 48536 34567 41159
12319D1159K340J7206N4870M1060q003k3599q1495l9128o9431K3440K8088j163
$$ 41159 43499 60705 115575 156635 148632 125033 43538 4410 -65021 -41581 -13493 -14656
12307a4656J8220K989L7436M777m2370R117J8364k6764j031J4254J7828j5961
$$ -14656 3564 6553 43989 48766 6396 15513 33877 7113 6082 20336 38164 22203
12295B2203R939J7766R081m7469L3976j6909n3788L5049L8070j80Q733J8622l1283
$$ 22203 32142 49908 58989 11520 45496 28587 -25201 9848 47918 47738 56471 75093 43810
12282D3810L389k5998o9830k0722J8444L341M953P934K4017l5013n8097K111N9493
$$ 43810 47199 21201 -48629 -69351 -50907 -47566 -42613 -34679 -10662 -45675 -103772 -101661 -42168
12269d2168P2042n0448l512N3390m911m4733l4182l3851p918O6244N8875J8175
$$ -42168 29874 -20574 -24086 29304 24393 -20340 -54522 -88373 -96291 -30047 28828 47003
12257D7003J5984R910l0676l9266l4012o0464N6207R6453J0217L3259J6687L1512
$$ 47003 62987 72897 42221 2955 -31057 -91521 -35314 61139 71356 104615 121302 152814
12245A52814j4919m0898j6544o9151n9879L6307k2261k6895Q002K8778M986k7520
$$ 152814 137895 96997 80453 11302 -48577 -12270 -34531 -61426 -53424 -24646 -19660 -47180
12233d7180m1130k1621p1145O4785R7169P445J571O3070j1232m9309l6201l7023
$$ -47180 -88310 -109931 -181076 -116291 -19122 -11677 -10106 52964 41732 -7577 -43778 -80801
12221h0801j8996M6075K2498k0047p7502P886O2748P2237K8188K010n1100k62
$$ -80801 -99797 -53722 -31224 -51271 -128773 -120887 -58139 14098 42286 44296 -6804 -7066
12209g066J2035J8585K775n7029M671k870n1512n2944P5617Q8479J05278L0220
$$ -7066 4969 23554 26329 -30700 -26029 -28899 -80411 -133355 -57738 30741 136019 166239
12197A66239p6539j4884q520m4813J9521O251o1564k6961K3810N2065Q9064p1456
$$ 166239 89700 74816 66296 21483 41004 47255 -14309 -41270 -17460 34605 123669 52213
12185E2213l346j3671n8585o1522L348l0021K484J7233K8223N2945m4260n405
$$ 52213 48867 35196 -23389 -84911 -81563 -111584 -109100 -91867 -63644 -10699 -54959 -60364
12173f0364L3257N0531L7267M4918k1100m0473l65J7567N4051K443o3088j4901
$$ -60364 -27107 23424 60691 105609 84509 44036 43671 61238 115289 117732 54644 39743
12161C9743K0855K387J0658K3091K9600p7137m3045k1295K3471K5140l287K4959
$$ 39743 60598 62985 73643 96734 126334 49197 6152 -15143 8328 33468 30181 55140
12149E5140L6527J2206J940j8450l9973k553j4468J6523j2346J604P858o8036
$$ 55140 91667 103873 105813 87363 47390 44837 30369 46892 34546 36150 44008 -24028
12137b4028o0857k1229K2473K2012N3531P2137P8393N6021j8792l4142n8731K3249
$$ -24028 -84885 -106114 -83641 -61629 -8098 64039 142432 198453 179661 145519 86788 110037
12125A10037k7086m6240m0435n981k298j6881L5611O8976l8831n0760m693J2449
$$ 110037 82951 36711 -3724 -9705 -12003 -28884 6727 75703 36872 -13888 -18581 -6132
12113f132O839K2189K6370P476O431n0375l6631j9446M0187k7573L0135J8640
$$ -6132 707 22896 49266 56742 63173 12798 -23833 -43279 -3092 -30665 -530 18110
12101A8110n9172q041P9450L3870j1916k1329j1696j4499j5471l003j0073K7010
$$ 18110 -41062 -49103 30347 64217 52301 30972 19276 4777 -10694 -13697 -23770 3240
12089C240J5173o7123m946l030O4189p779K277Q648J4931J1893L5925l487l1531
$$ 3240 18413 -48710 -53656 -56686 7503 -276 2001 10649 25580 37473 73398 69911 38380
12076C8380j9317n7966j630P624k3975l2310k1501r845N3923L0085o6026n669
$$ 38380 19063 -38903 -40533 -32909 -56884 -89194 -110695 -120540 -66617 -36532 -102558 -108227
12064a08227K5351J9181J22704K0421j7390j3925L003k3444j22898K7765M9909
$$ -108227 -82876 -63695 59009 79430 62040 48115 51118 27674 -95224 -67459 -17550
12053a7550O395k3030P9084j4942o685k6902q801M0798l2997q457J7012J271K3021
$$ -17550 -11155 -34185 44899 29957 23272 -3630 -12431 28367 -4630 -13087 3925 5196 28217
12040B8217N3735J7423m8629q1157p7862K315O6877N4910K4506j491o0334k4324
$$ 28217 81952 99375 50746 -30411 -108273 -105958 -39081 15829 40335 38844 -21490 -45814
12028d5814m1229J0373P386L2547J8014j7490j7035k3556p355l1982r670l5789
$$ -45814 -87043 -76670 -69284 -36737 -18723 -36213 -53248 -76804 -84159 -116141 -125811 -161600
12016a61600L9242N4072N8943M5825J4570L802Q166M406j7235l271L3673j9697
$$ -161600 -122358 -68286 -9343 36482 51052 54854 63020 67426 50191 46920 80593 60896
$$ [...]
##END NTUPLES=NMR SPECTRUM
##END=
