##TITLE=Analysis number 321607
Compound Code cc 13102
Project Code adrs
Chemist Name scafell
##JCAMPDX= 6.0         $$ Bruker NMR JCAMP-DX V2.0
##DATA TYPE= NMR SPECTRUM
##DATA CLASS= NTUPLES
##ORIGIN= Bruker BioSpin GmbH
##OWNER= nmr
$$ XWIN-NMR		Version 3.5
$$ Thu Aug 17 15:32:03 2006 GMT Daylight Time (UT+1h)  MAYBRIDGE\nmr@NMR_250MHZ
##.OBSERVE FREQUENCY= 250.131544655141
##.OBSERVE NUCLEUS= ^1H
##.ACQUISITION MODE= SIMULTANEOUS (DQD)
##.ACQUISITION SCHEME= undefined
##.AVERAGES= 16
##.DIGITISER RES= 18
##SPECTROMETER/DATA SYSTEM= dpx250
##.PULSE SEQUENCE= zg30
##.SOLVENT NAME= CDCl3
##.SHIFT REFERENCE= (INTERNAL, CDCl3, 0, 16.4268)
##AUDIT TRAIL= $$ (NUMBER, WHEN, WHO, WHERE, WHAT)
$$ ##TITLE= Audit trail, XWIN-NMR		Version 3.5
$$ ##JCAMPDX= 5.01
$$ ##ORIGIN= Bruker BioSpin GmbH
$$ ##OWNER= nmr
$$ C:\u/data/dgb/nmr/ADRS/1150/pdata/1/auditp.txt
$$ ##AUDIT TRAIL=  $$ (NUMBER, WHEN, WHO, WHERE, WHAT)
(   1,<2006-08-17 15:31:40.61 +100>,<MAYBRIDGE\nmr>,<NMR_250MHZ>,
      <created by zg, POWCHK disabled, PULCHK disabled
       configuration hash MD5:
       E2 DF 36 D8 04 B2 41 60 5A D7 A3 38 5A 4B D0 FE
       data hash MD5: 64K
       CF 41 49 B6 CE 22 25 06 A5 36 67 EC 38 DF CE 66>)
(   2,<2006-08-17 15:31:52.18 +100>,<MAYBRIDGE\nmr>,<NMR_250MHZ>,
      <Start of raw data processing
       ef LB = 0.3 FT_mod = 6 PKNL = 1 SI = 32K 
       data hash MD5: 32K
       B3 2C BD 89 24 BD 72 4C D3 D7 8E E6 AF 45 4D B4>)
(   3,<2006-08-17 15:31:53.88 +100>,<MAYBRIDGE\nmr>,<NMR_250MHZ>,
      <apk 
       data hash MD5: 32K
       15 D4 38 99 6F FF 97 07 0B DC 21 56 88 3A C6 51>)
(   4,<2006-08-17 15:31:54.68 +100>,<MAYBRIDGE\nmr>,<NMR_250MHZ>,
      <abs ABSG = 5 
       data hash MD5: 32K
       2F B6 CC F0 77 48 EB 55 8D A9 73 F2 99 4F 05 33>)
$$ ##END=
$$ 
$$ hash MD5
$$ 47 64 4B 49 71 54 C4 E5 4B AB 82 5E 0F 72 56 F1
##$RELAX= 
##$RELAX= 
##$RELAX= 
##$RELAX= 
##$RELAX= 
##$RELAX= 
##$RELAX= 
$$ Bruker specific parameters
$$ --------------------------
##$DU= <C:\u>
##$EXPNO= 1150
##$NAME= <ADRS>
##$PROCNO= 1
##$TYPE= <nmr>
##$USER= <dgb>
##$AMP= (0..31)
100 100 100 100 100 100 100 100 100 100 100 100 100 100 100 100 100 100 
100 100 100 100 100 100 100 100 100 100 100 100 100 100 
##$AQSEQ= 0
##$AQ_mod= 3
##$AUNM= <au_zg>
##$AUTOPOS= <51 >
##$BF1= 250.13
##$BF2= 250.13
##$BF3= 250.13
##$BF4= 250.13
##$BF5= 500.13
##$BF6= 500.13
##$BF7= 500.13
##$BF8= 500.13
##$BYTORDA= 1
##$CFDGTYP= 0
##$CFRGTYP= 5
##$CHEMSTR= <none>
##$CNST= (0..31)
1 1 145 1 1 1 1 1 1 1 1 1 1 1 1 1 1 1 1 1 1 1 1 1 1 1 1 1 1 1 1 1 
##$CPDPRG= <>
##$CPDPRG1= <>
##$CPDPRG2= <>
##$CPDPRG3= <>
##$CPDPRG4= <mlev>
##$CPDPRG5= <mlev>
##$CPDPRG6= <mlev>
##$CPDPRG7= <mlev>
##$CPDPRG8= <mlev>
##$CPDPRGB= <>
##$CPDPRGT= <>
##$D= (0..31)
0 1 0 0 0 0 0 0 0 0.06 0 0 0 0 0 0 0.0002 0 0 0 0 0 0 0 0 0 0 0 0 0 0 
0 
##$DATE= 1155825099
##$DBL= (0..7)
120 120 120 120 120 120 120 120 
##$DBP= (0..7)
150 150 150 150 150 150 150 150 
##$DBP07= 0
##$DBPNAM0= <>
##$DBPNAM1= <>
##$DBPNAM2= <>
$$ [...]
##$SUBNAM7= <"">
##$SUBNAM8= <"">
##$SUBNAM9= <"">
##$SW= 20.6930455092707
##$SWIBOX= (0..15)
0 0 3 0 0 0 0 0 0 0 0 0 0 0 0 0 
##$SW_h= 5175.983436853
##$TD= 65536
##$TD0= 1
##$TE= 296.16
##$TE2= 300
##$TE3= 300
##$TEG= 300
##$TL= (0..7)
0 120 120 120 120 120 120 120 
##$TP= (0..7)
150 150 150 150 150 150 150 150 
##$TP07= 0
##$TPNAME0= <>
##$TPNAME1= <>
##$TPNAME2= <>
##$TPNAME3= <>
##$TPNAME4= <>
##$TPNAME5= <>
##$TPNAME6= <>
##$TPNAME7= <>
##$TPOAL= (0..7)
0.5 0.5 0.5 0.5 0.5 0.5 0.5 0.5 
##$TPOFFS= (0..7)
0 0 0 0 0 0 0 0 
##$TUNHIN= 0
##$TUNHOUT= 0
##$TUNXOUT= 0
##$USERA1= <user>
##$USERA2= <user>
##$USERA3= <user>
##$USERA4= <user>
##$USERA5= <user>
##$V9= 5
##$VALIST= <valist>
##$VCLIST= <CCCCCCCCCCCCCCC>
##$VD= 0
##$VDLIST= <DDDDDDDDDDDDDDD>
##$VPLIST= <PPPPPPPPPPPPPPP>
##$VTLIST= <TTTTTTTTTTTTTTT>
##$WBST= 1024
##$WBSW= 4
##$XGAIN= (0..3)
0 0 0 0 
##$XL= 0
##$YL= 0
##$YMAX_a= 466390
##$YMIN_a= -584013
##$ZGOPTNS= <>
##$ZL1= 120
##$ZL2= 120
##$ZL3= 120
##$ZL4= 120
##$ABSF1= 16.42676
##$ABSF2= -4.266411
##$ABSG= 5
##$ABSL= 3
##$ALPHA= 0
##$AQORDER= 0
##$ASSFAC= 0
##$ASSFACI= 0
##$ASSFACX= 0
##$ASSWID= 0
##$AUNMP= <proc_1d>
##$AZFE= 0.1
##$AZFW= 0.1
##$BCFW= 0
##$BC_mod= 0
##$BYTORDP= 0
##$COROFFS= 0
##$CY= 12.5
##$DATMOD= 1
##$DC= 0
##$DFILT= <>
##$DTYPP= 0
##$F1P= 14.0000005364418
##$F2P= -0.99999901652339
##$FCOR= 0.5
##$FTSIZE= 32768
##$FT_mod= 6
##$GAMMA= 0
##$GB= 0
##$INTBC= 1
##$INTSCL= 1
##$ISEN= 128
##$LB= 0.3
##$LEV0= 0
##$LPBIN= 0
##$MAXI= 10000
##$MC2= 0
##$MEAN= 0
##$ME_mod= 0
##$MI= 0
##$NCOEF= 0
##$NC_proc= -4
##$NLEV= 6
##$NOISF1= 0
##$NOISF2= 0
##$NSP= 0
##$NTH_PI= 0
##$NZP= 0
##$OFFSET= 16.42676
##$PC= 1
##$PHC0= 147.1937
##$PHC1= 4.632457
##$PH_mod= 1
##$PKNL= yes
##$PPARMOD= 0
##$PSCAL= 4
##$PSIGN= 0
##$REVERSE= no
##$SF= 250.130023821537
##$SI= 32768
##$SIGF1= 0
##$SIGF2= 0
##$SINO= 400
##$SIOLD= 32768
##$SREGLST= <1H.CDCl3>
##$SSB= 0
##$STSI= 32768
##$STSR= 0
##$SW_p= 5175.98343685301
##$SYMM= 0
##$S_DEV= 0
##$TDeff= 65536
##$TDoff= 0
##$TI= <Analysis number 999999
Compound Code 99
Book Reference 9
Project Code 9>
##$TILT= no
##$TM1= 0
##$TM2= 0
##$TOPLEV= 0
##$USERP1= <user>
##$USERP2= <user>
##$USERP3= <user>
##$USERP4= <user>
##$USERP5= <user>
##$WDW= 1
##$XDIM= 32768
##$YMAX_p= 355764846
##$YMIN_p= -273806
$$ End of Bruker specific parameters
$$ ---------------------------------
##NTUPLES= NMR SPECTRUM
##VAR_NAME=  FREQUENCY,     SPECTRUM/REAL,   SPECTRUM/IMAG
##SYMBOL=    X,             R,               I
##VAR_TYPE=  INDEPENDENT,   DEPENDENT,       DEPENDENT
##VAR_FORM=  AFFN,          ASDF,            ASDF
##VAR_DIM=   32768,         32768,           32768
##UNITS=     HZ,            ARBITRARY UNITS, ARBITRARY UNITS
##FACTOR=    0.157963299565203, 1,           1
##FIRST=     4108.8258000364, 0,             0
##LAST=      -1067.15763681661, 0,           0
##MIN=       -1067.15763681661, -273806,     0
##MAX=       4108.8258000364, 355764846,     0
$$ Real data points
##PAGE= N=1
##DATA TABLE= (X++(R..R)), XYDATA
$$ [...]
28583 -15215 -69260 -49333 -30448 2619 -21070 -107234 -109933 -50078 -47192 -26495 20492 40201
28571 40201 32414 -3630 -59190 -46207 6397 55237 117799 84906 35868 14543 -28559 -23060
28559 -23060 38952 66414 71305 53493 85881 80569 14766 -33273 -50066 -39827 -83880 -80315
28547 -80315 -67643 -129850 -117320 -77437 9392 80617 92796 67087 30355 17911 12079 14668
28535 14668 -853 -3565 43454 24486 79377 29634 -13859 9482 16715 4211 -23738 -20277
28523 -20277 -3157 18078 -18430 11669 -17950 -72643 12155 13257 6630 25846 -33462 -61200
28511 -61200 -57031 -57256 -37779 -34088 15370 60164 42045 10877 -4102 44444 24486 1471
28499 1471 -63011 -85573 -76101 -50383 -6239 49751 47553 68236 55679 -5678 -48793 -21081
28487 -21081 -39647 -28734 344 16872 -7071 -55127 -14164 28540 44554 -2828 -30946 -27442
28475 -27442 -20698 -27882 -84764 -77059 -35592 -3213 -4348 -14734 39448 59509 -29715 -57125
28463 -57125 -29555 43718 123519 86280 51250 58628 3661 28230 37221 43073 -16416 -35687
28451 -35687 10505 27400 30192 40652 -800 -19604 -8279 73899 128016 96743 64279 24474
28439 24474 44782 52044 60826 58323 -8928 -62097 -64752 -61532 -6404 57031 67831 98918 50896
28426 50896 30382 71424 82104 80204 97716 75427 15026 -42852 -1327 10759 6586 18491
28414 18491 -4697 -29601 -33961 1845 -3322 -8617 38220 31755 -14305 -33284 -53203 -35799
28402 -35799 28353 105105 120226 110896 108093 133776 107902 93434 85215 81643 95840 138623
28390 138623 109619 80272 75659 140034 94840 95660 99896 12795 -70499 -50340 -40204 -43193
28378 -43193 -26381 -26579 154 68728 60872 3141 14705 56292 85471 131007 92653 45554
28366 45554 26149 -38731 -25530 45186 55751 30535 -8353 -8961 23055 -3502 -41978 -28197
28354 -28197 -13952 20560 21734 31575 -30185 -70775 -84625 -2161 7204 12192 49605 29837
28342 29837 39220 65707 48978 12360 5951 42057 37200 16051 -36878 -57239 -22522 55164
28330 55164 85986 60050 56928 39090 39210 21604 -38685 -44036 -23383 11935 64468 54695 9329
28317 9329 -52253 25159 34515 -5106 21901 6237 29796 -6701 17848 28989 9747 -60049
28305 -60049 -29941 43674 43071 1255 964 -11665 -30214 8205 25658 35864 67582 70978 40341
28292 40341 61427 16603 18601 11633 -40842 -97824 -149308 -139139 -90002 -23730 -41979 -86396
28280 -86396 -52738 -2111 28185 1721 -13456 -19521 -57993 -102327 -42532 51835 67000 49282
28268 49282 5137 37638 55116 63587 83797 71222 20234 11204 69084 23294 -61984 -63827
28256 -63827 -44884 -25196 -70678 -102441 -118533 -128190 -150988 -86186 -46676 -6318 18010 -28142
28244 -28142 -58174 -53690 -21277 3677 -21676 15111 48473 36053 -25804 -20541 -26921 -20631
28232 -20631 -45704 -23057 127 46358 17160 -9421 -3419 -6906 -35700 -13946 -11466 3275
28220 3275 35979 -3026 -27583 -21460 25854 54912 24375 -32876 -43814 -48287 -38404 -10862
28208 -10862 -13199 -42824 -20830 -13026 36594 14485 38896 60506 32902 22088 7225 -308
28196 -308 33640 36445 29663 34788 10929 -5006 4623 33862 28534 28153 15725 -20535 -32722
28183 -32722 43178 85328 76830 29780 37149 28145 358 28444 66801 105164 74326 94141
28171 94141 23664 -31051 -14587 18946 37440 86893 123287 90283 50855 25152 -12844 -43853
28159 -43853 -3296 63344 131109 65129 18887 13783 -10476 26519 67883 4255 -57547 -19082
28147 -19082 -25333 -70428 -49715 4750 64172 76640 33143 7675 6288 -13482 67102 69380
28135 69380 25595 13522 -11516 -45505 -44065 -87555 -64173 -77812 -42064 -32030 -5535 19968
28123 19968 31174 88479 84139 58846 40901 26456 36254 19238 11858 27255 63804 108498
28111 108498 57931 13759 -22184 -67465 -33183 66946 71055 4584 -22156 -9856 -20470
28100 -20470 -39305 -3229 -38755 -31650 -1827 35674 18699 -13273 -1747 89507 48003 42144
28088 42144 24914 6146 -18685 -44305 -25859 28253 -22916 -40775 -20103 -56535 -23184 18585
28076 18585 53113 75603 39525 48966 43666 26065 26969 72704 12802 -51629 -49638 -8768 41393
28063 41393 56493 20574 13171 48312 121561 167124 85229 42150 30176 31827 -11940 -3380
28051 -3380 45418 82794 63616 35796 33490 14115 -8098 -20233 -9340 -6297 7193 26399
28039 26399 16695 -67392 -62464 -46536 21144 4141 7572 11918 65217 62540 27571 -6822 -49185
28026 -49185 -34161 -2645 5555 -7929 -8337 -30347 -30872 12155 54791 37207 36648 16750 -38899
28013 -38899 -33727 -24808 19145 -6102 37874 67920 68077 192295 162628 81442 28677 255
28001 255 31679 72335 72230 42047 -8814 -6318 5663 -17605 -18420 4432 19854 21868 63000
27988 63000 42569 -74585 -44105 43560 -10002 -32097 1804 4160 -41763 -893 -8024 -53893
27976 -53893 -96246 -34302 -11299 409 29785 124069 100586 23087 57507 57352 81897 72865
27964 72865 47753 28844 -1747 -41445 -17464 18233 21812 40542 86753 48501 -8648 -32487
27952 -32487 8150 1045 10436 -113 -35446 -59665 924 6322 14168 12978 1740 32001 17471
27939 17471 -67025 -99250 -96725 -106954 -101588 -66653 -17976 29663 26326 31792 -16397 2037
27927 2037 19539 3714 -14338 -5094 2363 3882 29037 11071 -55410 -26121 71815 114987
27915 114987 90816 68234 78817 96668 99868 55015 25463 65109 55944 74217 45264 -13760
27903 -13760 -26811 -5663 563 -99578 -103703 -95240 -57995 -92388 -90029 -5088 46505 42334
27891 42334 109404 110904 69110 31012 577 -18925 -31985 -57257 -68550 -27921 37957 6200
27879 6200 11692 -58204 -68565 -64498 -62833 -60352 -39955 -23004 -57481 -6818 -6122 -11137 9011
27866 9011 58324 34945 -20518 2467 31696 31151 29832 86021 142850 144583 154130 139530 49462
27853 49462 -52661 -85875 -71235 -5276 -8579 -28479 -1169 58780 120820 86125 -344 -37826
27841 -37826 -37856 -50673 -33690 84710 114678 64574 42642 -2315 -22564 25351 110573 97503
27829 97503 45404 51210 12622 -41955 -20114 -14899 -5037 43559 69552 101368 77403 81884
27817 81884 65914 42707 45650 42883 26174 7856 -6376 -53639 -72500 -49829 -51349 26027
27805 26027 31964 -10378 -5585 -37803 -33605 15714 20436 32845 4572 -6666 15493 -20517
27793 -20517 -52781 -66587 -38985 -20769 -48687 42967 123711 84220 72985 95495 87544 75049
27781 75049 55627 58316 58221 66378 78506 118477 108358 48092 69202 65528 38614 -7866 24310
27768 24310 67597 97211 117984 25377 5336 -10041 -3199 -8798 -21780 -48460 15340 41126
27756 41126 -42358 -56639 -62031 -23105 269 439 4374 26887 58736 61335 84789 82531 59787
27743 59787 56691 54549 44688 47157 31022 23123 6780 23918 67067 89028 52934 29750 35383
27730 35383 55571 13937 47489 31835 -28702 -35073 -35821 -15409 -1525 9429 23556 -7652
27718 -7652 -23095 -51021 -8062 28015 60824 11545 -72563 -55663 14832 37893 19028 -52253
27706 -52253 -88611 -24944 44786 60608 -22365 -79204 -79775 -76119 -52629 -29073 -60733 -41759
27694 -41759 -56380 -55993 -78787 -95969 -56845 -6246 60693 127296 116410 72879 55464 64425
27682 64425 54814 -39326 -30165 20058 -15747 -67097 -41380 -39793 -47997 -75039 -84034 -15424 31072
27669 31072 35530 -10684 -7876 56553 81299 76006 81169 38906 28386 3783 -32575 -39494 32100
27656 32100 41952 -27537 -77191 -39864 10606 46865 18707 -76424 -78818 -15530 1068 11017
27644 11017 56661 51282 44300 44209 8920 -18454 26315 22577 50425 -4111 -74277 -94182 -87945
27631 -87945 -77486 -94426 -109761 -74698 -47206 -24237 16465 18232 15737 24123 45397 -747
27619 -747 -53770 -46482 -17861 -11571 -48889 -60233 -10721 -35310 -20603 64658 54189 14479
27607 14479 -19954 -24397 14232 76631 83500 132148 169308 104413 45869 67359 51818 43656
27595 43656 25190 33213 6757 20159 -1951 -18186 -25066 7425 54809 20188 -15566 -94879
27583 -94879 -44449 36646 51753 61524 60354 62018 57334 16265 -32430 26219 53705 47022 72444
27570 72444 84867 145743 192225 203754 131429 47981 30647 6359 42772 107982 105575 61550
27558 61550 78731 83543 29693 -23972 -41718 -1046 12796 67046 66556 11033 51132 35888
27546 35888 -41488 -56533 23787 54663 34312 109 45179 45507 -3557 32976 120459 109298
27534 109298 84119 105790 117878 73703 93355 53613 -22507 -66461 -44775 -19744 -31566
27523 -31566 -65727 -67931 -14837 29641 35499 37909 30267 -21988 -6322 14454 13453 25371 98187
27510 98187 90861 34333 -1136 -13023 -59761 -56615 -19694 31068 72135 45149 12272 31998
27498 31998 49557 39508 10250 -34329 -55936 -71416 -116616 -78796 29851 46374 -6233
27487 -6233 35680 -2318 6099 41568 28289 2176 26557 68992 6294 225 5856 29968
27475 29968 13188 -9235 37235 70805 60007 56796 73432 -17747 -84991 -53757 -45972 -12465
27463 -12465 1210 5980 27292 13306 -22006 -29563 -29837 -60541 -57641 -102274 -61400 -8185 52085
27450 52085 87961 81185 82549 85810 46931 42867 33466 -4422 -85308 -98803 -77723 -32088 23530
27437 23530 17140 -7502 5605 46016 -8856 -33018 -43349 11041 24356 -37185 -32533 16102
27425 16102 66366 40821 -6308 -17630 -41126 -111618 -107850 -55804 -26236 1012 -22151 41484
27413 41484 8404 -33873 -47492 -25287 29070 83808 93189 65054 -6158 -29697 33562 22549
27401 22549 -12211 -2113 4915 40970 56313 56973 47638 -12816 -13147 -15980 -2998 -7894 -47072
27388 -47072 -44349 -10456 8510 -22692 -100124 -124257 -59086 -19502 50854 96057 91180 49317
27376 49317 29063 11534 -29195 -47602 -69338 -111772 -85937 -109107 -39569 66568 7029
27365 7029 -1122 7496 -16676 -29181 -28461 -16741 39980 41237 73774 40469 58260 47547 1764
27352 1764 -38785 -54690 -39401 -124112 -177399 -69261 -15355 -53492 -38370 -20940 19115 67533
27340 67533 -2863 -14164 -16753 -57921 -49595 24939 21497 32044 74843 105039 143044 161363
27328 161363 92798 19124 -23853 -88804 -98757 -39090 19559 33107 48413 77119 21795 -50263
27316 -50263 -41698 30660 107847 96651 53929 79111 44042 7937 35785 58988 98287 106573
27304 106573 24791 -5840 -829 95943 158156 101250 36048 -12411 21098 53488 31184 7174
27292 7174 -28979 -58752 -97790 -147051 -157027 -67106 -5848 1464 15169 9911 16865 -36717 -95668
27279 -95668 -80157 -13778 32899 4100 -61021 -76196 -69635 -47998 6480 -46357 -106157 -83398
27267 -83398 -48741 -14642 -18689 -3587 32957 77186 95310 24274 -39877 -52218 -58097 -25473
27255 -25473 6859 -20622 -44975 -20295 -25678 -47106 -103741 -148573 -99627 -50991 -74935 -43737
27243 -43737 15467 56495 66011 36261 -13881 -9200 12342 26912 30235 74312 72299 -25037
27231 -25037 -59741 -50008 -23081 52978 157032 104461 10917 -23443 -43506 -51052 -27284 -46719
27219 -46719 6455 64985 58174 24535 -33138 -48085 -41737 -13080 -16994 18973 16242 26140 32320
27206 32320 23908 -5773 -37559 -15990 -5221 5706 46597 36588 525 -23202 -9054 61325
27194 61325 121190 80021 42479 17982 -34810 -10045 21935 50539 3387 -29193 -38214 -65113
27182 -65113 -24281 9690 -15457 -66812 -66871 -9255 -3959 -86919 -72867 -35470 13801 57159
27170 57159 36280 -8948 -38957 8633 21646 38293 49266 30452 74617 87641 64221 19746
27158 19746 -22092 -47000 -39891 -42493 -44493 -31548 3724 6405 -10385 36578 6785 -69650
27146 -69650 -43813 7286 -14745 -23660 -68991 -73356 -52369 30670 30105 2601 -13956 7456
27134 7456 -7049 18653 -3256 -36571 -6098 16068 48961 42786 -18256 -13030 34436 72935
27122 72935 100409 143485 129364 48848 -7543 -49836 -51058 -40486 3740 119460 112991 91840
27110 91840 85823 35184 -35677 -17953 85809 125719 147035 83719 11313 -15359 -30223 -75356
27098 -75356 -80212 -76216 -128977 -98251 -81265 -125944 -179497 -157865 -107413 -20247 5466 56530
27086 56530 81001 45459 44467 21902 17081 18050 -32170 -30469 -58758 -61173 -34294 -43674 -44169 -61897
27072 -61897 -42979 14165 38873 56267 50247 49819 18302 7636 35157 35685 37269 34698 83714
27059 83714 46061 72528 46015 20491 -14282 8471 5439 -45476 -36715 -12850 -9450 27923
27047 27923 78308 30115 -41106 -18081 -52988 -86513 -101703 -86585 -65907 -128645 -169601 -103551
27035 -103551 -46229 -47639 -58559 -59843 -10595 -2512 -10875 -22593 -2580 17970 37210 7208
27023 7208 -38518 -43215 -6576 21628 49885 64623 24236 -30939 -100755 -110362 -86852 -35055
27011 -35055 4096 16385 29803 77009 44661 -12950 -58006 -71252 -77740 -66706 -45060 -106520
26999 -106520 -69736 -17084 22817 59815 -40445 -106416 -136755 -123831 -96124 -50300 -18329
26988 -18329 9498 22340 94461 85982 26673 -3725 -75177 -50416 28462 14388 -9579 11754
26976 11754 -7199 -35842 -62728 -100250 -53751 -17730 -14630 -15899 -10036 -15217 -35240 -47983
26964 -47983 -20045 -13356 -13495 39496 64016 44976 56521 57888 18456 8208 -1181 -56640 -31796
26951 -31796 -197 29182 122422 187538 158629 150944 87715 10014 -27896 -59711 -42550 -29546
26939 -29546 7585 24812 64349 57377 -35773 -53137 -3925 -21222 -46013 -59862 -49174 -17726
26927 -17726 20519 40653 28336 -13400 -2170 57682 80613 88530 104378 102758 40834 36640
26915 36640 -25434 -7993 72571 92504 85315 58446 -18217 -90756 -97235 -41446 39415 68817
26903 68817 40680 10629 31979 44514 13538 -45464 995 115158 154420 99525 65359
26892 65359 47290 -657 -30810 -7743 43634 37929 -14734 -62998 -62714 -74339 -30879 25740
26880 25740 22575 13457 48413 46907 11920 -1593 -42175 -28127 -31866 -20942 62844 75414
26868 75414 85916 93468 2344 -57972 -79805 -80495 -34853 -4845 29095 6263 24786 27337
26856 27337 -272 7121 -23129 -62251 -101237 -61172 -11368 612 45958 53618 11471 -37100
26844 -37100 -41075 12804 15177 1200 -58968 -84329 -112890 -100092 -61578 -12164 -1469 -21044
26832 -21044 -16573 12990 2621 -13684 19707 21397 62672 112359 53078 -291 19498 -27550
26820 -27550 3866 48868 22997 -23525 -8575 -37764 -37281 -65853 -54277 -37332 -34311 -19095
26808 -19095 10715 10908 56826 9036 -25429 -8223 30613 33591 35500 36168 -20100 -24217 -10938
26795 -10938 41884 89975 109496 58041 -15788 -12400 11065 -21074 47119 80691 59717 38201
26783 38201 -15088 1997 60998 88638 82421 41267 32200 3975 -117307 -82031 -12804 -27751
26771 -27751 -58487 -43673 -67207 -77296 -40592 15884 31937 57425 32219 -59847 -49513 -14485
26759 -14485 -35045 -31673 -50308 -53143 -36021 -43347 -84206 -40867 48163 58511 34316 -11099
26747 -11099 -22967 -88986 -110066 -69412 9053 45254 252 8049 -9460 -16488 -27014 -96873
26735 -96873 -140462 -75584 -39963 -94088 -135938 -110125 -41666 -28832 -2789 27654 36660 -7771
26723 -7771 -29845 26444 58453 64445 669 -46931 -50568 -30432 49552 29230 -276 -3025
26711 -3025 -6906 -25318 23352 -37623 -143696 -158067 -127031 -73195 -39660 -6330 9607 -4275
26699 -4275 -30193 -56622 -21161 16480 -69905 -140465 -63412 17366 7913 10943 72270 96591
26687 96591 95733 138038 91171 58301 64497 57394 24554 -6629 -17161 -42750 -44789 -47856 -3687
26674 -3687 55942 55423 75418 34052 15705 -47239 -47801 9076 -59063 -105071 -94726 -107931 -78935
26661 -78935 -59928 -57748 -86712 -36140 -14494 -26857 -16426 41613 117947 131680 72440 -6333
26649 -6333 -46902 -47375 -82253 -74290 -63328 -37773 57772 99892 3871 -59234 -33204 -33654 -10288
26636 -10288 50954 29829 3916 15525 68683 63845 53595 22218 -10814 -16159 -36724 -31305
26624 -31305 -32184 -6728 26087 19019 17124 40121 27323 21158 -6900 9116 71024 82571 -18989
26611 -18989 -68928 -9687 39264 57810 -25535 -57362 -18745 -29144 -13009 42460 53250 29167
26599 29167 -8454 15533 24654 -34185 -59282 -107382 -73197 -36805 -46943 -68865 -43240 -36061
26587 -36061 11436 26968 13383 -36091 -71424 -43916 -26336 -5126 -10368 -29356 -1666 10294
26575 10294 -17170 -24910 -18658 -5724 -4790 57647 40609 44375 95391 98378 105276 83964 33318
26562 33318 56168 33963 22262 53844 9455 6061 8427 -30878 -46838 -28212 37913 54610
26550 54610 47358 81088 76485 9567 25310 48897 96909 101367 94409 47066 11239 60035
26538 60035 36274 3522 -11486 -15105 14729 -7058 -14007 52366 104228 24405 -18215 51791
26526 51791 87788 18242 29944 -8702 15341 7460 10967 15235 -25975 -96928 -94221 -58117
26514 -58117 -33180 -48295 -43951 -11023 6471 -6798 -24150 -27073 -8468 -47232 -48727 -39501
26502 -39501 -8731 3546 22122 65618 142182 181533 137230 55722 -14598 -5821 54231 41099
26490 41099 -1271 -47885 -78886 -99864 -101511 -77128 -41226 -19492 -8731 -26972 -46956 -43671
26478 -43671 -56972 -60401 -86483 -70016 -55700 -35940 2829 9027 -15391 13795 20051 -25910
26466 -25910 -94003 -108342 -62488 32637 64436 82035 113998 78685 94733 87881 75938 50039
26454 50039 52372 45955 -32230 -65619 -72051 -75112 -9202 -17920 -25766 19549 29832 28678 29888
26441 29888 89298 76841 76695 67844 118173 114092 87592 66103 57099 54951 12212 -6507 64507
26428 64507 24664 -6067 -10434 8792 16620 52961 54399 -14156 -88585 -51754 56668 86046
26416 86046 36132 9868 1399 -8745 18816 40856 19525 -27984 -34497 -15807 -13954 -32625
26404 -32625 -96570 -96921 -74475 -84895 -68309 -25565 43910 60339 40963 23220 -8 -39558
26392 -39558 -64297 -37411 40277 36561 9445 50992 78530 56256 46076 7632 -49031 -91278
26380 -91278 -87355 -84837 -39388 13170 18524 3636 28782 30389 21364 -30222 -11599 48044 52897
26367 52897 44450 43262 47387 45344 70222 119012 74969 45044 89136 130515 45511 -45889
26355 -45889 -37657 27731 34209 -19266 5416 18625 -39244 -38460 -44058 -32478 22410 53824 -2863
26342 -2863 -48265 -96272 -69739 -102242 -106783 -33206 54857 61174 3175 -18237 -14198 -22608 -16523
26329 -16523 23716 -10655 -32757 -70109 -64763 -91983 -85698 -43871 -37829 -90974 -122989 -38182
26317 -38182 -16929 -26006 -86149 -129994 -81501 -27009 -8180 24046 89308 105634 35473 8374
26305 8374 33057 11731 -10842 20404 36746 36092 58324 46675 -15506 -100479 -62840 -59221
26293 -59221 -60751 -22452 7145 23465 24427 15906 37837 28722 12239 2052 2811 -20607 -4200
26280 -4200 -23482 10870 43098 77396 39895 -12534 16735 5927 16910 61787 68351 66832
26268 66832 47136 22597 12250 22477 -47755 2917 51763 13318 76032 77482 82042 119493
26256 119493 87077 45960 -10358 -24368 8269 22752 -10504 -37951 -72517 -59896 -63920 -86024
26244 -86024 -130862 -101972 -72838 -60248 -33750 -2347 -38674 -77401 -96819 -77224 -75907 -51037
26232 -51037 -92027 -163187 -102872 -40691 -11419 -34250 -41329 -53669 -70907 -69350 -83987 -96377
26220 -96377 -33357 29506 20109 52567 73719 117887 66978 13004 67231 107118 45722 2052
26208 2052 -9019 27004 79512 60884 63517 29497 -402 -27158 14244 66593 72095 112133
26196 112133 78897 75973 106605 104691 127384 69231 -10023 -58487 -23679 -10218 24453 113983
26184 113983 107662 87857 7915 -11876 957 50805 19581 19984 19916 13753 12583 63676 87376
26171 87376 81980 69348 48249 35452 45675 50827 60608 41795 11792 4484 -35837 24794
26159 24794 43266 25145 20364 24559 -12467 -60350 -11827 25695 -10080 -48096 -6081 71696
26147 71696 29360 -8540 6944 36117 47204 79212 177069 146785 123829 57481 -30376 -19141
26135 -19141 45189 57109 50006 39337 29528 -22406 -67640 -64164 -38947 -13831 53525 83933
26123 83933 98186 124456 159885 118742 115979 130603 59600 30926 4689 -46202 45525 118311
26111 118311 96018 76476 62520 21595 -32464 -56500 -33618 -13781 36238 67101 37866
26100 37866 -26904 -54200 -4453 38450 28076 23793 32696 33867 -346 29978 112376 82573
26088 82573 -21305 -84035 -44192 -17598 4206 34790 68561 10236 -45884 -8361 2418
26077 2418 46703 81625 115559 65827 45504 51971 81110 61577 41058 57814 143594 142026
26065 142026 95697 58092 45829 81032 81926 63724 56461 74218 92767 107476 102555 101396
26053 101396 36024 13480 30909 18124 47613 50879 29885 -88719 -126320 -96912 8795
26042 8795 84637 51187 6806 21739 6571 32979 21186 86597 116050 80098 34929 -50027
26030 -50027 -46704 21921 44968 37623 19556 -12305 64890 101797 91882 -14854 -100835 -51823
26018 -51823 24883 77027 33273 -4837 19870 4003 63276 32222 11577 50032 -19258 -107654
26006 -107654 -139506 -121870 -129269 -87735 -23663 -32526 -7996 -3769 -30959 -12665 -16349 20790
25994 20790 90794 116203 88561 76018 77248 68176 44227 43183 -3694 -36754 -32341 -40912 -37489
25981 -37489 3117 43021 37713 11096 -9980 -66602 -88017 -67947 -71947 -40576 -2279 1130
25969 1130 3149 17772 70517 57101 45155 33839 10582 22474 39884 45685 199 734 -40377
25956 -40377 -62909 -16774 12457 8534 56322 82266 72469 2452 34417 86608 42931 78078
25944 78078 87113 72131 5585 -12353 -13117 -50504 -28044 -61872 -69488 -71490 -57122 -30434 -42617
25931 -42617 -23334 2596 45253 56403 14580 16238 30526 40619 60657 20231 -11518 -27213
25919 -27213 -61405 -69193 -45819 -41841 -35710 -1047 -26429 -58315 -43007 -3506 23943 17104
25907 17104 -17737 1993 4114 -16990 46383 13053 -27344 14974 8014 3390 -26367 -53665
25895 -53665 -37183 -49000 -61209 -108861 -110904 -89547 -75381 -92292 -93844 -60523 -75623 -59183
25883 -59183 -87851 -45082 -77961 -118190 -85629 -44836 -37707 -28676 -10363 -9281 11913 2390
25871 2390 28923 69977 92717 94663 91047 40828 -43825 -112325 -61002 -12869 19252 13210
25859 13210 30312 18918 12510 -6865 6668 56612 66139 57395 54520 77953 105751 162282
25847 162282 151134 69840 -8163 -72744 -57256 -33026 -78214 -39069 -31081 -49178 -3341 66344
25835 66344 103054 119995 97767 -22171 -145112 -152863 -141797 -150137 -140017 -89656 -64914 -28960
25823 -28960 18484 52976 33539 -6386 -62756 -11305 57693 58225 35299 19482 28433 -7850
25811 -7850 13143 122 -16232 -37737 3861 13599 5736 -11770 -69170 -27342 854 24983
25799 24983 51912 81792 105570 132998 118420 90994 2508 -20545 323 28397 9584 6786
25787 6786 -48905 -108034 -80873 -31829 19055 92482 96253 82897 120835 81232 21918 -38116
25775 -38116 -77539 -49334 -19331 3407 18007 -40762 -97914 -98224 -77073 -58753 -70453 -60829
25763 -60829 -72581 -85919 -24678 -47531 -65683 -80683 -8396 15098 34127 -1148 -62082 -71058
25751 -71058 -58489 -8416 -18335 -3898 4125 9407 -75681 -79271 -32133 -39849 -64986 -43187 -31310
25738 -31310 -44353 -123260 -135253 -126848 -131101 -99439 -96628 -73912 -16674 -16396 -20420 -19288 -2512
25725 -2512 33918 61825 38082 23466 -47747 -33464 288 20523 -2980 -39811 -43977 -41988
25713 -41988 13883 60303 28425 -10098 -30947 -6099 -2171 -7306 -11190 -6949 39160 65258
25701 65258 110002 150019 90983 26594 -13934 -14456 -37274 -36184 -64669 -33679 69400 95215
25689 95215 58608 65814 85966 73104 61540 51757 45927 -11397 -3651 -8266 5816 -25829 18796
25676 18796 17561 -46468 -108528 -57625 -11500 13876 12130 30376 -11355 -76172 -61568 -11628
25664 -11628 21079 -30553 -14368 21338 33810 -4162 -33312 -35248 -12460 78445 85443 76981
25652 76981 45104 -4536 13231 -19018 -18023 5514 55862 66122 27039 23696 3003 -3173
25640 -3173 12595 43327 67949 66277 80510 108123 95767 89360 133621 63602 -3257 -2379 -34439
25627 -34439 -81984 -88602 -59301 -5546 -12871 -16443 -19372 -7900 -29995 -54781 -37724 -34042 -36960
25614 -36960 -74916 -100265 -76619 -28373 11228 2799 -38382 -34417 -34619 -18498 -36943 -43918 -72042
25601 -72042 -71705 -43632 -46654 -34376 -62839 -70848 -60243 -74347 -53876 21867 16410 -5912 5801
25588 5801 44179 46362 21449 -1216 6681 24722 40760 30933 24108 55517 49085 63127 54838
25575 54838 13477 63410 110730 54649 56354 103933 98199 96588 58376 16521 -5443 14116
25563 14116 25369 51373 42256 -33993 -70535 -85867 -15869 -1833 33923 85481 95049 33983
25551 33983 4785 40033 10164 4674 -22287 6648 30982 47725 48710 67028 8640 -67823
25539 -67823 -80035 -66763 -9057 32839 58572 5822 -44202 -37517 -26633 7098 23825 33897
25527 33897 37288 50977 -53350 -93698 -67214 -25318 -2443 -78813 -138062 -61487 -5078 -25973
25515 -25973 -46973 -6053 -17935 16656 28277 -6387 -44191 -78693 -26171 1919 60101 62258
25503 62258 36579 33726 30377 15162 48243 40121 -20109 -22131 -52249 -55209 -22646 28616 43695
25490 43695 21655 63667 12505 -3337 12491 17003 19220 -26490 -29200 -46900 7186 22825
25478 22825 73360 72851 49489 25903 -31911 -20604 -54020 -54435 -22456 -21700 -46001 -36143 -65842
25465 -65842 -10698 -66607 -76173 -50604 -6950 5960 -27264 -83236 -88849 -89636 -45970 -10689
25453 -10689 -11836 -21119 -64112 -42378 -25472 -8637 28856 33770 -6355 -40572 -28236 -89223
25441 -89223 -93217 -36919 -21848 12355 34647 41941 53268 70232 53818 71240 -12203 -10628
25429 -10628 11683 42243 52649 -38910 -35669 -33308 -36096 35546 49081 85879 108999 120599
25417 120599 46607 -26035 -47083 -20095 22500 82273 52617 -24909 -69729 -46929 -33722
25406 -33722 7726 47159 367 -42069 -47479 -91550 -127254 -98012 -96524 -55144 17195 -5646
25394 -5646 -66925 -54338 -64941 -59019 -122876 -127635 -61106 11087 8963 1174 -38803 -35846 -8759
25381 -8759 45791 42150 87927 95054 93106 58764 -7785 -38032 -46353 -6237 -29474 -22246 3947
25368 3947 -58924 -95314 -73746 1249 17178 89157 112148 -18605 -90689 -74373 3884 23528
25356 23528 2977 -61608 -104224 -109936 -70056 -19926 -552 36242 -2701 -34530 10664 63174
25344 63174 41844 2676 -38912 -39922 -2834 31125 -19113 24329 13814 -803 -19597 27748
25332 27748 66466 74438 59016 51870 67956 48475 81937 92082 33458 -17065 7339 12881
25320 12881 -28646 -63640 -33880 -12378 8960 20907 22146 18721 7440 24859 83074 65758
25308 65758 63342 100665 124962 124595 98728 57799 43899 5961 -5044 -56771 -85759 -13108
25296 -13108 21941 -25745 -44864 -43136 -47426 -30188 -27441 -8518 22322 28342 21791 -10 10329
25283 10329 91335 130854 88681 92587 52571 -2511 -1876 -20322 11739 -5457 24062 24929 15016
25270 15016 4450 16593 38836 70346 93664 47370 24044 22509 68297 86495 78510 57481
25258 57481 38142 27904 45486 -7400 -39026 -58957 -12635 -1415 -11862 10793 -22121 -9720
25246 -9720 19225 13381 -37817 8288 -24187 -41026 -89149 -117709 -136565 -141260 -106897 -65657
25234 -65657 -52537 9776 -28400 -34466 44101 72803 -24532 -90283 -60373 -49643 9629 15194
25222 15194 19724 28645 -56119 -117380 -61114 15797 11182 -44540 -92481 -73302 -36289 -92281
25210 -92281 -102100 -19929 -12037 28719 44100 -16691 -63940 -68978 -62764 -42081 -32393 2134 12169
25197 12169 -36461 -83147 -98458 -18821 -62505 -63464 -20931 -29195 -80537 -74457 -99757 -115013
25185 -115013 -127083 -57166 -23359 19240 58866 50404 -22178 -47084 -28422 -15927 330 8632
25173 8632 -5177 -24203 -40141 -70664 -105232 -109448 -51947 46800 27592 -11358 -25340 34843
25161 34843 88035 91279 108914 133984 152033 82494 25412 -4741 40868 73964 49696 -28616
25149 -28616 -74178 -38550 -17012 -29735 30215 75789 60003 28455 44638 53273 40589 -5073
25137 -5073 -47415 -63181 -97662 -88228 -16013 -35325 -116420 -134212 -109544 -80071 -30967 -40238
25125 -40238 -50904 -8841 11476 -38532 -101267 -54912 -43391 -4323 10607 66735 85897 60542
25113 60542 79295 63939 79629 71793 60148 57220 5004 -18526 -43370 -24308 -2103 -41541
25101 -41541 -64631 -42849 -47164 -79064 -64841 -40284 19278 49765 -15772 18708 32786 22390
25089 22390 -2137 -33665 -47616 -42945 -79055 -102814 -77059 -57525 -66251 -91257 -86498 -36618
25077 -36618 -5912 1079 -16430 19484 66645 63656 77848 33483 12706 -41291 -73797 -37206
25065 -37206 -20395 -62596 -14936 -13324 -44802 -110007 -38171 49383 19047 28059 31053 50313
25053 50313 22027 -34447 -32841 -8207 -19 -12684 -8917 -26053 2060 -7816 28179 42464
25041 42464 7303 -9960 -23456 -84762 -114320 -20606 63312 10917 6096 -805 -6674 17534
25029 17534 39013 2079 -73377 -138642 -128896 -54896 -49045 -49703 -40436 -37084 34942 90986 63039
25016 63039 -6419 4075 28758 2145 -14749 -41753 -46136 -60658 -50821 9091 82205 122321
25004 122321 87670 26762 48282 89635 36285 -11052 -61336 -105550 -41808 -36597 -64205 -8301
24992 -8301 23387 1207 -47306 -41722 -40767 -66418 -53229 -44066 -12744 -5989 -8096 -4697 49318
24979 49318 121907 114231 80242 71007 63877 34663 74828 56390 48832 37823 7194 -1136 19407
24966 19407 -2469 15792 -52225 -17331 30 -42783 -25536 15921 65555 76437 89553 85768
24954 85768 57533 56149 49149 80182 90866 37109 26833 -27039 -29854 -36416 -20600 -14238 -37810
24941 -37810 -61181 -110046 -129548 -114840 -108136 -129444 -122136 -107349 -101389 -78398 -28405 1497
24929 1497 -25906 -47814 -43256 42872 52943 53028 21700 -30134 -27794 -3435 -13269 -20868 2692
24916 2692 14965 48946 48253 26878 65259 147602 72985 35891 33561 48069 93602 125963
24904 125963 73058 -23844 -15308 -24584 -9660 -18378 -56682 -91360 -43076 21792 30951 53655
24892 53655 56437 74125 3308 -55297 -53544 -16027 -17160 -24522 -30063 21536 27643 -53292 -109001
24879 -109001 -88197 -75467 -95000 -51636 -27327 60369 101603 79431 51930 59853 76432 56768
24867 56768 -29910 23190 98176 87839 64047 26913 -35969 -67429 -31998 -45466 -54989 -29763
24855 -29763 -21192 60760 76501 -9589 -62711 -73715 -86998 -114674 -104144 -86745 -26135 22930
24843 22930 61258 48774 58861 86529 41599 -36270 -29296 12748 38815 -4094 14775 16160
24831 16160 -25099 -12044 50396 -1824 -29067 -12852 -10805 -18023 43235 23891 -11662 19757
24819 19757 34342 51455 16901 -36914 -43038 -49344 -17329 -11429 -210 19850 0 -27234
24807 -27234 -88528 -76640 -62146 -7357 44408 62348 6494 32221 59278 7737 41354 19489
24795 19489 15167 1564 169 11843 25957 -16404 -59554 -12774 16277 65700 108622 103617
24783 103617 42090 22960 64139 445 -40924 -47181 -38831 -28236 2902 57949 40163 26640
24771 26640 22092 -28888 5076 24458 -37338 -15198 1368 -8900 16627 5748 -15696 -8637
24759 -8637 -40716 -30762 -14660 9361 15264 -41012 -43744 -47277 -53152 -72436 -91796 -76440 -17507
24746 -17507 27911 34960 1182 -79124 -82289 -75584 -31540 -62208 -58571 -68103 -64303 -36408 16715
24733 16715 29626 -3354 24235 13953 26924 31503 25234 22098 -17032 -24875 13763 38859
24721 38859 -8753 11628 27353 39514 43188 95710 93982 123659 93575 27035 -11535 -53919
24709 -53919 -10347 59982 47624 58450 47300 10222 -12947 20124 41112 7394 -72601 -81362
24697 -81362 -107774 -50916 -3102 -22631 -16620 -48994 -122666 -72908 -36808 -15400 -44414 -36355
24685 -36355 10067 16487 -42801 -79335 -52747 43587 73943 53815 71145 117521 69224 27170
24673 27170 1792 -48086 -20335 15980 36312 32883 -4169 -39582 -60684 -74437 -111581 -114522
24661 -114522 -83046 -9030 11191 5057 859 -15202 -66057 -5259 26079 67813 74644 45983
24649 45983 -15202 -81701 -65526 -65357 -104025 -117268 -98192 -7371 -47776 -106998 -137984 -125775
24637 -125775 -104831 -86249 -56658 -33295 -22198 -48362 -65337 -64316 -45264 -25904 -27976 -5843
24625 -5843 18281 -2755 -5056 -92 -2197 8361 -3795 -50899 -17357 30060 -5186 -5962 73279
24612 73279 58786 29785 15198 12040 33552 68245 92010 95215 140857 98421 16567 31421
24600 31421 41200 13773 -65074 -79218 -41296 -2994 67480 51984 -14658 2559 -9326 -34520
24588 -34520 -55818 -37747 25096 49559 62472 110754 76825 11012 231 81689 97352 82694
24576 82694 48578 6877 -20166 -69640 -131052 -117414 -69647 -37171 -5714 2519 14850 14287
24564 14287 64699 66130 87140 72156 32352 4122 -41323 -48133 -48128 -50949 -4452 -13438 -7414
24551 -7414 -81429 -101217 -28796 -36717 -109378 -106677 -72694 -71174 -98638 -63279 -36192 -24040
24539 -24040 -44941 -39982 -47551 -53124 -62980 -73468 -42755 -28163 -42554 -42249 -32714 -8848 31579
24526 31579 67083 13808 27138 56520 44128 20680 38700 -6457 -15016 8779 -7773 -46970
24514 -46970 -34742 -4889 2451 499 -12695 1484 -12531 -32472 -5150 27760 29195 40863
24502 40863 67045 62986 28240 55788 55293 -3896 20193 31006 78432 73425 81628 47744 2581
24489 2581 -3671 -35689 -59950 -63156 -55383 -3574 -28358 -39010 -3593 16310 -19404 -60247
24477 -60247 -105482 -67296 -38661 -46952 -23823 -1097 47974 8518 -9135 -59263 -78248 -28196
24465 -28196 27343 -2001 -18645 -60525 -97599 -129461 -53646 24496 64212 79055 47602 55506
24453 55506 90732 14950 -27022 4272 61798 -24213 -66326 -18748 13451 12791 14053 1466
24441 1466 20736 15035 -4530 -45510 -3278 -18799 -9987 40187 105313 113091 82434 52282
24429 52282 1309 -61797 -111462 -58805 -44720 7761 34685 72228 5160 12396 23485 -34480
24417 -34480 -78074 -108101 -70369 14134 43855 24361 9058 44927 -3154 -50089 34942 85293
24405 85293 41273 -24434 -63992 -31401 10368 12573 38237 -1038 -70613 -22477 -49307 -52438
24393 -52438 43691 79131 52461 76333 39518 47243 42308 45937 -30874 -56496 -59359 -19119
24381 -19119 -15020 -17153 34234 91845 86510 72422 102828 57968 -25315 -101746 -86500 -68793
24369 -68793 -20438 1980 -22604 -20276 -36853 36748 42203 34746 6370 -60278 -44553 33557
24357 33557 28609 -28012 -68777 -98665 -83453 -45071 -4325 -7762 -12718 10442 6957 58784
24345 58784 79144 49480 34426 35540 -7224 -49614 -42094 -44960 -78495 -150334 -194665 -183710
24333 -183710 -209143 -157383 -80584 -72842 -62193 -9315 17569 -418 54615 51663 54647 92816
24321 92816 76154 37327 30084 34256 29966 32174 67801 34056 34951 31837 38679 28543 -12878
24308 -12878 -7765 -4910 -12907 13836 34848 -8171 -33670 19405 90488 33449 20905 56304
24296 56304 83848 55353 1328 25555 -25038 -41597 -89587 -50421 -26742 -4729 -750 -38373
24284 -38373 -60484 14286 58262 42271 10919 -22165 -66967 -115549 -114443 -51943 -15089 -1813
24272 -1813 14675 -33140 8475 33996 44445 27675 -9027 28515 26216 33204 33971 50716 44706
24259 44706 5957 -46079 -52632 -22858 -23132 -8121 -33883 -31152 -36960 -29662 18533 12409 1071
24246 1071 14478 40895 29443 32287 30138 -55929 -81407 -64551 -22638 -17626 -7812 -5717 -25968
24233 -25968 -21646 -17060 35213 31646 39382 -11816 -1058 56569 43328 -29095 -13443 17096
24221 17096 39488 51920 72343 126292 77741 51520 46744 -12468 -40317 -74243 -45979 6977
24209 6977 -18759 -35966 -21415 -56833 -74122 -10178 71340 62440 62268 66885 3639 -39869 -92966
24196 -92966 -103280 -40386 14513 25101 35472 51912 79386 60283 59153 80085 85417 27046
24184 27046 32409 42674 1037 -36003 15911 31508 59633 31585 29864 18495 6094 26851
24172 26851 32888 67832 25544 -71664 -38358 13422 2094 -84962 -68636 11425 25097 53569
24160 53569 84372 86079 81806 43603 5305 -27976 -27359 -42250 -71580 -81100 -56605 30758 58990
24147 58990 3171 -8184 31822 45720 66081 87863 134597 113064 60759 47408 53044 24510
24135 24510 48717 56110 27011 -6098 -65852 -44341 -28872 -61902 -91983 -134092 -88250 -64655
24123 -64655 -104764 -174052 -201082 -165278 -142082 -131801 -109390 -80334 -26703 -7315 -60643 -67097
24111 -67097 -50029 -19588 26336 79385 64460 9427 -74401 -48817 30502 50924 65477 87898
24099 87898 15450 -33928 9165 54838 81768 98363 75219 28751 3856 -6347 -16071 -61041
24087 -61041 -70133 -42955 -16017 15484 -5263 -27655 -22351 -17384 -42002 -62648 -75511 -40246
24075 -40246 -14784 -43187 -36868 -26428 -65489 -33460 10310 36742 48846 77305 -100 -68441
24063 -68441 -76909 -3170 -7112 -17770 5135 47678 96908 87485 87159 95984 82116 45332 -10824
24050 -10824 -70175 -85657 -31225 53038 63932 -6364 -53643 -32631 -16808 832 -2871 -30071
24038 -30071 -11760 -25742 -63534 -104940 -93455 -45272 -17628 10650 -7899 -13464 3595 12166
24026 12166 981 74556 59541 58416 41863 39921 28498 8817 -51082 -126303 -126244 -56854 2018
24013 2018 48668 28081 -342 7899 45483 40426 72914 51448 12467 38134 30459 25122 54886
24000 54886 -5797 23695 113654 134387 84574 42701 85 38629 58719 77231 7223 -32482
23988 -32482 -69112 -53576 -22904 51092 55998 53098 65166 31456 1353 -54905 -67080 -58782
23976 -58782 -34671 7808 17285 47102 45142 72225 98217 117601 122445 100218 122190 114260
23964 114260 51322 -2195 -3164 2013 8113 6162 41862 4579 16247 46350 18329 23569 -9439
23951 -9439 12316 51733 33458 13561 -26209 -7140 21746 43663 41948 51513 -73306 -86500
23939 -86500 -28861 -30694 14337 36061 -2108 -26120 -22970 -36920 -31476 -39164 11700 33448
23927 33448 41813 14061 -18120 -31538 47318 71903 99159 63523 5915 -3263 9229 22621
23915 22621 30559 35187 51093 13460 3227 14832 52765 81550 37324 -32128 -44624 -16856
23903 -16856 1519 -2300 -7811 -9143 20377 -17110 -44871 -41667 -49054 -93325 -145088 -142043 -137529
23890 -137529 -120576 -68996 2430 -15413 -70117 -66832 -64833 -77395 -121126 -131784 -146515 -62535
23878 -62535 -52138 -63725 -54760 -110333 -93369 -95622 -79247 -78985 -45134 -43873 -34068 4799 -19023
23865 -19023 -95447 -100513 -86705 -49360 -19574 9195 40410 -5981 -45319 -41406 -38549 -27950
23853 -27950 11737 -12308 7212 66034 63798 102212 41141 -64751 -62738 11425 32181 -16735
23841 -16735 -58493 -69549 -77057 -31466 31093 50854 49440 66787 65549 122 -48271 -53738
23829 -53738 -108253 -24780 66049 160201 92139 42411 -11327 -18156 31935 67216 58048 16751
23817 16751 -44429 -60938 -33130 -2586 23380 19966 -26717 -51591 -105637 -150646 -113010 -80702
23805 -80702 -101256 -76037 -34276 -20247 69571 90092 62729 -20496 -59921 -109385 -72015 -16262
23793 -16262 779 -1338 -29292 -25837 -58851 -57026 -27168 -76937 -101624 -67575 -70045 -57825
23781 -57825 29968 33010 -70158 -128264 -64832 -83332 -123843 -98403 -29481 30277 37105 73291
23769 73291 62523 63625 20515 30117 62370 -1113 -37557 -86251 -116582 -141039 -107256 -19957
23757 -19957 -43377 -42506 -8310 28856 40625 14487 -19271 -30792 -10006 10966 65347 81410
23745 81410 26042 10427 -13904 -12028 -21341 -15818 61799 65627 3866 12720 -4149 -17309 -48782
23732 -48782 -33594 -7891 63155 -194 4684 34427 -32771 -81251 -9614 61218 12126 -4834
23720 -4834 -24630 1166 -20701 -1237 20593 -15549 1930 -4711 -5757 -48830 -52897 -51568 -53189
23707 -53189 3262 18223 -43760 -56750 -72353 -43949 -37235 -46384 -96790 -105855 -70780 -5775
23695 -5775 -1931 11924 46244 32961 44944 79707 59922 24971 -11487 -24569 8468 10273
23683 10273 -12013 -6953 18355 57283 10507 30955 36505 -4756 -35479 -62655 -97236 -94215
23671 -94215 -59156 -67155 -56305 -67021 -46253 -72863 -63922 -8198 16622 1829 -59715 -15678
23659 -15678 13430 18967 8549 -18786 -21218 -70541 -70641 -33963 -13441 -34792 -22599 -38929
23647 -38929 -114526 -135484 -89947 -92866 -91141 -60993 -29695 -19048 -3526 -18973 10198 57491
23635 57491 114445 121745 73472 17082 45414 77354 27175 -25406 -50262 -108888 -126361 -52787
23623 -52787 44552 47992 6607 41985 21931 10237 49854 51183 54979 -7604 3631 -20540
23611 -20540 -23049 -24043 8160 15329 7752 30841 -16101 -69309 -33245 -20888 -29643 40662 60122
23598 60122 -6499 21544 59278 45633 48408 66780 5179 -12383 6844 -71095 -83622 -41999
23586 -41999 -64928 -90199 -128149 -84443 -69792 -76167 -87685 -75925 -65997 -43438 10908 31480
23574 31480 64825 45508 69109 1813 581 -17642 -31494 -5961 -22930 -60233 -66444 27576
23562 27576 -22990 -37940 -26235 2848 6292 69770 103680 98739 94986 23293 -59861 -65123
23550 -65123 -24805 -25219 -40243 -50587 -35844 -14957 -35202 -23052 -21430 11524 61969 49652
23538 49652 37733 -12282 -78983 -91492 -85316 -88943 -27640 3421 13731 25084 15007 24522
23526 24522 22213 4301 27077 35251 -4691 25653 59653 58590 51141 -14141 -70847 -58968
23514 -58968 -56189 12002 24961 -8 5835 24909 28820 48664 80226 50469 33913 38694
23502 38694 27695 45672 34630 28536 45166 61326 42092 48998 12074 -41382 -128609 -127490
23490 -127490 -126271 -52234 15202 71615 56154 70118 73242 19215 -28118 30405 44771 21307
23478 21307 61098 122684 62321 20922 -52940 -69433 -12756 5873 -9023 -68174 -32904 -12893
23466 -12893 -30811 -124629 -164353 -196221 -206280 -154430 -77804 -33766 3976 19068 599 -21855
23454 -21855 -37206 -7013 22248 -2333 -43018 -57799 -62631 -21017 31147 91090 82982 33960
23442 33960 33962 5452 11046 28984 28458 95986 68975 62479 84775 68758 50935 5657 -13144
23429 -13144 17726 36515 42200 46396 103074 64238 23745 -36029 -33307 -21777 -14604 27230
23417 27230 49727 10896 -3185 -77347 -75397 -46372 -18536 17593 -6442 4198 22475 8842
23405 8842 174 -20258 -61483 -31669 -10146 -68098 -54937 -33998 -25182 -19499 2463 -35737
23393 -35737 -4129 5289 6380 -12450 -20300 21469 19483 -10246 53074 82780 71465 67109 -6738
23380 -6738 -27111 13086 37487 82489 60951 30116 -404 -12524 -3494 -45785 -110961 -113888
23368 -113888 -86062 -58029 17009 78441 64916 48820 60745 47452 17606 31728 2690
23357 2690 -20844 40094 60995 79916 100730 93599 45208 1350 -29221 -49712 -32807 -4566
23345 -4566 -18800 4773 -940 -63457 -90893 -52522 -63409 -67582 -21418 -15008 -74079 -73131 -88711
23332 -88711 -63370 11569 -21676 -40561 1443 -1360 -46081 -25964 -13872 8878 2749 22950
23320 22950 30952 42164 30502 13808 9460 -3830 -52919 -74528 -95200 -92099 -117921 -79633
23308 -79633 -71718 -71437 -26351 16946 18169 5047 16076 6455 14276 23714 -21847 -26842 -48739
23295 -48739 -115638 -74405 12961 -20238 -61136 -110874 -81178 30932 112338 110137 12048 -8508
23283 -8508 11891 7253 -29812 -101279 -87795 -33355 -13096 -48905 -63580 -45972 56889 119657
23271 119657 85252 31569 30988 39422 28306 32438 17823 -17679 15626 8812 57722 66574 59706
23258 59706 71194 50510 7960 -37897 -38033 5868 -4114 7788 32914 -30790 -69130 2007
23246 2007 21407 -6007 -60335 -50670 -20234 -11473 -24095 -50534 -18702 -20110 -108559 -99937 -52924
23233 -52924 -41338 -96412 -72233 -62180 -36855 8325 39666 45070 35386 25537 -12795 -28593
23221 -28593 -4395 84359 87880 66056 4324 -5357 -8035 24936 12733 16962 -9105 -52959
23209 -52959 -23885 32710 87198 83482 56257 59993 6602 -8739 9974 34444 20173 42086
23197 42086 22485 23487 22388 31552 27408 27573 26035 46423 -3780 -88941 -78046 -10608 25756
23184 25756 -8844 -6546 54944 84666 40293 -24369 -30866 -43798 -46569 -47979 -53768 -33284 -32067
23171 -32067 -84268 -88570 -66574 -39745 -72845 -89335 -81557 -13373 16940 14612 9994 -46850
23159 -46850 -96431 -91920 -59580 -51512 -52654 -74126 -93164 -77709 -21688 -50346 -77885 -111192
23147 -111192 -100151 -78635 -25558 3532 67313 140133 114804 60956 12450 -6105 -2635 -19176
23135 -19176 -57939 -969 46849 74566 55989 45773 38767 91976 136972 58277 60687 99628
23123 99628 99458 66192 -1868 -5794 6313 -27785 -51469 -71225 -46715 18801 11816 -3559
23111 -3559 -6612 -73294 -123814 -129680 -89705 -77401 -31764 -10680 -29054 -33184 -28965 -67543 -62633
23098 -62633 -60351 -35291 -5316 6906 30375 31321 19581 19780 -8555 -59832 -79301 -109111 -70906
23085 -70906 -13699 17 -53254 -49806 -72572 -84327 -29657 -28378 -11637 -10178 -41091 -10927
23073 -10927 25345 -46625 -150125 -97795 -43648 -23922 -33997 -27634 -22884 2977 20907 19716
23061 19716 -11277 35449 18161 -13647 -13942 -1591 40691 70817 34529 47903 90548 28590
23049 28590 -26101 -35864 -13726 -35684 -56041 -43617 -3173 -19118 -43986 -12425 -4287 44665
23037 44665 66218 -8358 -54061 -24532 -30300 -25360 -41943 -56699 -14746 -125 -53977 -4304
23025 -4304 25038 -977 69229 51649 53256 82494 73381 47703 -39716 -43602 -53092 -48398 -29368
23012 -29368 -12905 45139 27014 -15036 40583 -1345 -22930 19027 -26674 11817 85067 91555
23000 91555 31624 -53783 -98735 -109381 -96294 -29153 -33730 -10937 -7242 -70790 -41904 3560
22988 3560 8146 -6363 -39463 -97018 -127933 -49073 -28258 -26650 -62489 -55078 -37392 -11174
22976 -11174 -12451 -14989 -9927 14491 -8460 -30291 15617 -12046 -31438 -7926 -14140 -68732
22964 -68732 -63775 -15798 -13147 1290 -6325 -19774 16541 18978 6375 -57701 -101675 -70876
22952 -70876 -62860 -95746 -72397 -15147 31659 33348 43741 -25028 -24700 68096 28569 -45735
22940 -45735 -19764 28038 65622 62322 22375 42691 7873 -25080 -27389 -22709 328 21529
22928 21529 15740 17151 26183 19325 -13035 -85331 -52129 -33636 -7522 24386 18550 6738 -12756
22915 -12756 -21902 -38901 -109830 -92368 -14130 8160 8310 -39218 -91499 -106548 -111596 -116350 -81455
22902 -81455 -11666 57009 64547 46112 -3229 -70742 -89463 -84645 -90918 -84622 -40879 -34699 16254
22889 16254 96442 33357 3424 61669 15750 -37741 -27032 -5648 14906 14396 72994 118359
22877 118359 115973 79958 84101 97677 43131 4348 -44808 -118880 -99093 -41152 -14949 36474
22865 36474 26676 14157 16470 31820 66209 46997 7753 29599 -1644 -49655 -47195 -34593
22853 -34593 -29325 -40392 -63416 -96071 -51697 7230 -10827 -31048 -31763 -3495 16964 -25711
22841 -25711 -16611 -29122 -70120 -27720 -9741 -68759 -52940 -63111 -64847 -78147 -69730 -9785
22829 -9785 32233 -21895 -18224 18354 14333 28941 24421 -6705 17922 65426 23384 -14501
22817 -14501 -58666 -65805 -75804 -77575 -19754 5455 -25515 6055 -418 13087 60443 -22804
22805 -22804 -65370 -17665 -16766 -15943 -52216 -41418 -42303 -5840 36779 72259 77463 113538 102014
22792 102014 46310 -31685 -108854 -108791 -57978 -25005 -23863 -55043 -55339 -16069 33507 25235 -14270
22779 -14270 -9476 6493 51035 53273 27353 14696 -12547 -57695 -18198 -151 -34887 -37899
22767 -37899 -6032 918 -45367 -8855 55400 99950 112370 68002 -679 -49937 -28040 11201
22755 11201 -2531 25473 19577 -15838 -2303 22181 -21853 -66849 -62619 -4485 52326 -997
22743 -997 -65675 -99866 -87654 -55309 -12183 206 38178 31325 -29050 -74094 -72532 -39669
22731 -39669 -21649 52313 26312 -23998 -26957 14029 46840 22783 53424 89007 137388 112082
22719 112082 62418 32971 13008 9876 15808 41770 60808 37885 34822 -36835 -99528 -97454
22707 -97454 -32106 -26479 -57127 5523 25707 51978 25895 21987 -12351 -57540 -63428 -48811
22695 -48811 -33044 -15088 -47295 -47780 -8412 -5729 -51212 -82186 -79849 -100250 -55993 -459
22683 -459 -31212 -33734 -96958 -146577 -89135 -47405 -4140 14607 49461 50162 29765 16255 -24892
22670 -24892 -58931 -41419 -77357 -33126 39660 46394 35388 -11179 -65800 -127856 -82331 -63601
22658 -63601 -40156 -73076 -52260 -41171 -77193 -83077 -93702 -82866 -63112 -69258 -28281 -6594
22646 -6594 17438 -38495 -54827 -59972 16178 20138 -12799 16774 34506 -13587 -6133 -22946
22634 -22946 -26165 -1004 65217 2126 -78567 -96623 -86301 -18149 7215 27355 -9493 13505
22622 13505 -48374 -141740 -140548 -100149 -92537 -80688 -74606 -29504 13850 36299 19346 14422
22610 14422 -24939 2987 -62779 -62353 15322 -1595 -18883 -54988 -73604 15939 29167 -35564
22598 -35564 -25519 32435 40423 -9024 9111 34157 -38037 -71423 -94851 -59526 -54004 -59378
22586 -59378 -25682 2081 12883 -17825 8094 -3537 -51373 -65381 -112756 -127057 -61691 -56966
22574 -56966 -93758 -106650 -59733 -21604 -36347 -35860 -121849 -97710 3722 46605 38025 10470
22562 10470 890 -24976 -29813 12496 -10264 -13303 21082 -51139 -40329 65331 141025 140881
22550 140881 69278 77991 96586 81420 86963 48472 -19513 -45886 -15558 -4860 35654 81831
22538 81831 123628 149878 109528 59797 54055 34382 54403 29018 26922 66183 94687 55254
22526 55254 3442 -17976 21888 -60681 -104468 -107659 -107915 -67199 -24864 42491 58153 32477
22514 32477 -9870 1138 3702 -31372 -66713 -83033 -27520 1211 -47654 -97921 -73654 20683
22502 20683 47647 45932 47781 41631 22234 51875 96917 73909 31564 -7156 -28905 -72765
22490 -72765 -69803 -89957 -70989 -95835 -95518 -3474 75788 52871 1577 36932 -20508 -35332
22478 -35332 21453 -33091 -20591 -23880 -25421 -19019 -54153 -115905 -122616 -66454 -666 -56937
22466 -56937 -91611 -106358 -54274 -4785 16170 39390 4676 -54534 -48899 -47365 19688 17908
22454 17908 -16456 15589 31452 13655 27008 50636 59260 -22346 -69397 -100345 -109101 -106116
22442 -106116 -124896 -86758 -39588 -17873 6070 -34133 3400 63101 26219 -41723 -49371 -12887
22430 -12887 11602 36232 40573 72021 70746 50741 95050 94021 76344 96437 104674 59051
22418 59051 -22158 -42523 -32142 -22316 -20604 -31362 -43025 -49306 -27758 -83405 -61077 -47448
22406 -47448 -134744 -111523 -59720 -62317 -69245 -35857 -22978 -23178 60323 85788 76337 74460 60827
22393 60827 43692 58745 23969 -44839 -93017 -55606 -12674 -14606 -42857 -70358 -29713 -13674
22381 -13674 -24841 7039 65224 17581 -32114 32513 86998 74098 -8884 -57065 -40103 -14272
22369 -14272 -44266 -64550 -107553 -81923 -94078 -84972 -45633 -93889 -73208 -87007 -55352 -10561
22357 -10561 -84071 -77156 -116058 -75281 -52164 -26071 -42592 -90359 -35780 -10165 -47092 11187
22345 11187 28342 6576 -42642 -85267 -83313 -61420 -25606 24446 21056 -18419 -13340 15560
22333 15560 43052 26569 40945 40264 39951 43941 38654 -34835 -82000 -31849 -16846 13238 -9606
22320 -9606 -34388 -32719 -15337 56209 68904 42851 5043 -25044 -1569 19702 2536 -10320
22308 -10320 -27921 -80190 -70468 -21827 7548 38614 16009 26893 73925 -21231 -54598 -50603
22296 -50603 -84594 -67486 -72011 -95152 -96041 -75076 -53892 -88341 -97813 -112778 -96981 -131617
22284 -131617 -114660 -87137 -46911 16152 32700 10830 -290 60997 97805 98278 79134 68918
22272 68918 -7800 -25915 -12885 -60986 -106317 -86469 -25565 25137 56201 69759 60921 24930
22260 24930 40888 98535 73920 46885 10497 -9621 -42904 -42219 -20503 24741 111232 188755
22248 188755 167039 96534 8122 3291 -15268 -66823 -9303 1594 62055 134984 113236 90498
22236 90498 81409 93034 68878 50290 10538 -19752 -60888 -60473 -55310 -72102 -21055 -40596
22224 -40596 -100069 -118395 -53277 -40299 -29462 22146 38786 61265 8292 -25312 -54073 -38552
22212 -38552 -53806 -10429 -16010 7844 9381 4659 1901 -31077 -16293 -46199 -48512 -81934 -80060
22199 -80060 -49351 -45909 -63433 10496 27204 -11435 -37110 -47446 -41513 -10450 -54613 -42977
22187 -42977 -47337 -3194 23722 -5348 12481 20889 -23990 -40317 -24877 -68641 -91626 8854
22175 8854 54505 90896 104655 100547 60033 17604 68216 73738 -12357 -19903 14669 1577
22163 1577 -69730 -111286 -157274 -139626 -102873 -104138 -54937 -28157 -31417 21345 -12403 -9636
22151 -9636 27037 -9454 18724 22491 58449 77458 13768 -29252 -70224 -53286 87174 129426
22139 129426 110284 99370 68910 -8133 -45217 21959 -11033 -21354 -33434 -70338 -85384
22128 -85384 -94804 -83812 -70519 -34718 -23841 -11504 17041 68368 62782 11120 -22435 -71424
22116 -71424 -57879 -176 -2571 -13015 -44132 -24226 61073 36260 -7724 -58746 -85909 -95046
22104 -95046 -89998 -116699 -112173 -28547 -72609 -134536 -142053 -105723 -75834 -48663 -43900 -18433
22092 -18433 -57891 -61113 -103359 -47447 -23594 17515 56888 80710 72011 37796 -15416 15515
22080 15515 20189 7246 8259 -34670 -51645 -18461 -57259 -86876 -39112 -28715 -1362 11217
22068 11217 30635 -14552 -12702 -4666 33822 69705 138435 99291 11131 61037 71074 31363
22056 31363 32447 57136 42440 58890 10444 -26281 -31008 -27517 32209 11427 -17711 -11873
22044 -11873 34755 48635 38931 -9166 6170 -10948 -2132 1688 -21198 -83026 -104994 -110149
22032 -110149 -28740 11680 5844 -60094 -103076 -56691 -20675 -70106 -114548 -70133 -7607 -15594
22020 -15594 -44763 -44484 -29094 40139 29264 -21880 -85343 -52621 17575 21215 78278 72393
22008 72393 65913 20752 -10125 -33899 -23419 39143 59055 56443 50236 73433 77253 72794 96236
21995 96236 55365 67539 92587 82961 26579 -11635 21162 6483 -22578 -27081 -19899 -82348
21983 -82348 -77018 -60564 -40354 5714 55667 58818 -20413 -73783 -50939 4842 -84196 -79345
21971 -79345 -21619 -21450 -75550 -100118 -67758 -20402 -13934 -26351 7268 -1466 -50599 -44239 44044
21958 44044 11730 -7991 30196 8617 -7411 -10358 11203 6934 30259 28309 29603 58768
21946 58768 51839 11992 -23012 -48554 -64808 -67359 -43406 -49407 -84726 -82855 -117212 -56044
21934 -56044 -32003 -73815 -75084 -39345 -49264 -35566 134 55381 36527 -8658 -18395 31513
21922 31513 28730 27069 -26629 28444 74893 44101 33337 -1886 -24873 57192 56355 -23112
21910 -23112 -149950 -132188 -64025 36602 59538 11415 -48936 -25398 21466 33180 61533
21899 61533 83754 46386 35636 -18134 -107117 -53668 -32453 14670 -9391 -63916 -27350 -59266
21887 -59266 -112317 -133039 -61400 31465 41393 4061 -2558 -7784 15881 -14194 -34117 11763
21875 11763 22916 -4938 -18687 -65767 -46153 15334 25489 38394 35623 -6615 59294 99543
21863 99543 84594 6800 32488 33681 56482 66515 84056 80894 60790 3409 -20418 -19017
21851 -19017 -27002 -37356 -84872 -32361 -72970 -112152 -42004 -29290 -48673 12224 13968 10354
21839 10354 26840 10871 22822 48394 41713 20317 3446 -46055 -137990 -105414 -81421 -74700
21827 -74700 -63023 -18183 27079 -6111 -63863 -84316 -41143 -38508 -39929 -22684 3037 -25555
21815 -25555 -32362 -73126 -72374 -77075 -47786 -63327 -21008 27007 93570 104838 42179 46182 18226
21802 18226 23804 34428 -7303 -69658 -127212 -105535 -42352 -23766 -10995 -30535 -49427 931
21790 931 30975 31486 -22353 -35428 -25178 -11718 15597 49136 39827 39608 30109 -255 -20011
21777 -20011 18598 72815 58983 -1331 -23458 -21194 60247 50224 -6303 -35288 -67558 -63034
21765 -63034 -108104 -84863 -62612 -30457 428 -22170 -43722 -21185 -49687 -20426 -5372 -16117
21753 -16117 -57715 -53130 -45178 -12093 -56106 -91878 -55795 -60164 -10227 10894 -2719 26863
21741 26863 -28055 -79780 -44819 -5790 -90558 -69109 -50529 -48466 -16745 21815 8601 -34030
21729 -34030 -25855 -12101 -23727 5751 27780 -40989 -55725 -54418 -38164 -64322 -92390 -58435
21717 -58435 7834 13727 4555 -46566 -79814 -95580 -55311 -9209 -34001 5990 44741 6727
21705 6727 -2716 -29080 -14753 18285 11428 -78896 -147470 -156710 -103281 -33639 -16119 -18029 34494
21692 34494 26959 31322 98595 71027 30788 -5336 9212 -37498 -34590 -75214 -101935 -87042
21680 -87042 -43438 -50202 -15671 11632 6959 -47182 -68080 -63617 -64413 -70428 -65061 -46145 -74124
21667 -74124 -84750 -28573 -7588 -81157 -87363 -89980 -83744 -93744 13000 55093 27229 77726
21655 77726 135861 127810 102606 58534 37878 46269 -44159 -110407 -67487 -10999 -33138 -94921
21643 -94921 -96108 -17096 2958 -35359 -18002 4851 -431 8495 587 -12268 -14463 -28916 -24287
21630 -24287 -50899 -29022 20761 1406 -36394 -78427 -60753 -14391 -37419 -56057 -84157 -95911
21618 -95911 -51791 23394 -16884 46245 107217 118195 133336 104038 53986 18647 33231 85768
21606 85768 79005 3674 -4363 11069 -9435 -58281 -62597 -96034 -28555 6753 -26845 -38307
21594 -38307 -25126 -49066 -80569 -47113 -12257 -22846 -30295 -55995 -64328 12122 27471 13845
21582 13845 -2854 -72487 -79655 -32726 41981 7662 -10961 -9733 -23293 -16928 -16555 -12803 -15265
21569 -15265 -86061 -76720 1833 -7877 -84358 -145230 -147265 -96627 -10917 -6837 -32392 -59141
21557 -59141 -68082 -54624 -34586 -47773 -18362 -56325 -49307 -12868 -27214 -102509 -118091 -22011
21545 -22011 32155 55172 47493 -7338 -86670 -70043 6317 6612 -14042 -76771 -25506 -11811
21533 -11811 14201 5798 5496 -14003 -2068 -7308 -52512 -123264 -152125 -103409 -88680 -114618
21521 -114618 -30041 22299 -14631 -76297 -51520 -22017 2009 -69648 -46001 -43777 -23728 -26417
21509 -26417 -8337 43428 64282 80620 25849 -6756 -5790 -53391 11811 28034 39952 11433
21497 11433 11015 49040 13974 -10816 -9429 14986 47726 26056 5670 -56168 -63896 -46664
21485 -46664 -12553 -27796 -51958 -17113 15788 41058 27820 -14494 -66024 -15108 45914 29783
21473 29783 -26950 -9700 15542 -71088 -19398 18659 47036 17206 -8984 -5427 -53108 -37798
21461 -37798 -25586 -12676 32541 -22844 -29468 19831 39585 65497 42437 -21950 -28453 40750
21449 40750 29169 -17735 -61230 -78227 -7438 24655 5476 2378 4734 13751 20184 20276 17362
21436 17362 17493 55916 33136 -43479 -70911 -35670 -41740 -29722 7287 -8620 -31123 -29695
21424 -29695 -6881 -8516 -44769 -20927 16837 3407 -13957 31415 32773 -10768 -17928 -47537
21412 -47537 -58915 -71778 -70604 -37789 21547 20244 22143 -18086 -21830 -44870 -116336 -118131 -112090
21399 -112090 -111812 -67272 -23252 17467 54887 111871 102780 49805 7637 -10959 -9159 -26183
21387 -26183 23920 99745 64475 -6242 -61271 -29413 -3518 27848 -1440 -14841 -16071 13930
21375 13930 -744 -3456 -7762 -36697 -41233 -69379 -50926 -15360 23870 53861 15768 4512
21363 4512 -39253 -76841 -32096 -27588 -68748 -59108 -69127 -108692 -64765 -28237 -29607 2330
21351 2330 -34093 -7188 -983 -37636 -14015 -34942 -79675 -123894 -118958 -123181 -110785 -86803
21339 -86803 -87391 -8988 3257 49350 52844 19924 4215 -13642 -16125 20148 15463 -22658 -6063
21326 -6063 -25881 -41244 -44998 -34490 24777 50954 12987 8813 -25908 -5172 74221 93341
21314 93341 79602 85983 73712 42506 43384 30014 67814 53750 48342 49345 54198 -869 -11657
21301 -11657 -53793 -81994 -112061 -78214 -40841 -42151 -44720 -4396 -6994 -11411 -45747 -25689
21289 -25689 40640 21487 -57384 -91947 -31105 -13381 -25996 -49932 -5478 6155 -29978 -44378
21277 -44378 -82219 -64031 -39472 6042 46403 41085 3176 -5727 29671 35600 12258 -33904
21265 -33904 -62578 -80437 -124157 -93019 -66883 -44092 -38344 -22075 -51747 -70263 -62071 -42027
21253 -42027 -72097 -96795 -86394 -75627 -56638 -59821 -58272 -20292 -16695 25173 53082 33311
21241 33311 64866 107752 78950 12506 -11102 -8286 50537 26099 -60165 -17403 32759 63696
21229 63696 44 -29182 -28510 17807 17090 -29722 -80561 -121661 -58996 1566 33193 -24558
21217 -24558 -38947 -80696 -63398 -39890 -6778 26483 61212 69839 120308 148185 134971 89501
21205 89501 85428 46300 23466 -19238 -35150 -96628 -95120 -31682 21013 28485 811 -16721
21193 -16721 -650 -39373 -54903 -50610 -47414 -46817 -29698 -48125 -64587 -30407 -48121 -59502
21181 -59502 -72244 -21977 34062 36813 1150 -61993 -141357 -98743 -71526 -24425 -75835 -78858
21169 -78858 -67303 -79136 -64392 -77830 -74698 -34438 -50402 -24108 -22031 35188 102073 80491
21157 80491 84281 124063 70276 62670 59120 84986 63554 23232 -6013 16898 63261 75918
21145 75918 73033 92163 110508 95835 49181 8836 7051 24764 77 38508 29601 -400
21133 -400 14202 41168 41653 -2228 -4485 -43035 -39920 -110773 -135788 -74313 -63808 -96772 -114001
21120 -114001 -104836 -103874 -133260 -41805 33489 -10714 -43199 -14266 18183 -7014 -30221 -42813
21108 -42813 -32336 -51054 -90463 -29974 62859 116556 86888 37674 43475 25430 -16511 -2240
21096 -2240 48194 36174 47049 31798 -34291 -50695 -29815 -21201 -30212 -53849 -54360 23593 -952
21083 -952 -5843 -45755 -54294 -54381 -31938 -63289 -69378 -60871 -53734 17651 -28966 -34748 -17705 -11743
21069 -11743 -21332 -27139 -65890 -84765 -47868 -57705 -59992 -79313 -83358 -84467 -54500 -10360 -9349
21056 -9349 -6489 9083 22838 40078 31371 7345 13784 57248 63552 46226 34438 84285 119938
21043 119938 120256 70645 -79058 -168934 -121150 -116015 -68799 3086 43465 -18000 -51137 -3017
21031 -3017 12149 37786 47478 1991 -1824 -13790 -23647 -33415 -61599 -57800 -71028 -71232 -45509
21018 -45509 -58653 -85223 -69426 -80214 -78569 -78294 -39381 -11246 2721 43244 13811 -34453
21006 -34453 -63013 -25189 -18286 -54145 -1139 -5138 -33901 -14127 -7034 -13978 -20053 18377 74679
20993 74679 88339 31108 34856 11450 -38343 -36094 -61594 -57426 -41785 -34366 -33237 -8744 5524
20980 5524 -5949 22858 32603 -14709 -24839 -38174 -14928 -26246 -43804 -35065 36904 78647
20968 78647 59023 -5831 -37017 -45184 -28163 -37864 -44310 -75023 -115395 -92599 -65319 -48100
20956 -48100 -5428 -17061 -20961 9651 -63754 -51562 -47290 -54106 15234 8609 -46678 -63067
20944 -63067 -63459 -20498 40389 89277 66277 23797 6706 -3545 -18665 -74410 -36128 -22
20932 -22 -1954 44550 3520 11223 4813 23789 41483 22257 26154 65941 -5951 -44225 -59925
20919 -59925 -79703 -78425 -66538 -84499 -67458 -40647 -29535 -8544 -55831 -44313 -29508 22122
20907 22122 62297 23833 9412 12338 33811 46622 71572 107435 95738 38111 5293 17334
20895 17334 -18772 -10753 -33585 -42153 -18446 6811 41368 94018 28282 -5419 -37454 -37214
20883 -37214 8583 57174 1345 16277 52701 -752 -48494 -42198 -20189 -54750 -40424 12073
20871 12073 51299 71622 42157 -9401 -43257 -58253 -39149 -35113 -7203 -1181 10740 -19999
20859 -19999 -50900 -136110 -165720 -122685 -69018 -48705 -92501 -51509 -5908 -57272 -88396 -133158
20847 -133158 -104648 -34551 2353 -22343 -99018 -88803 -89053 -67335 -40645 -38139 -18261 -1208
20835 -1208 -22441 -38372 -102658 -9331 35175 -22311 -106454 -68758 -11960 -40936 -98621 -103013
20823 -103013 -89351 -137856 -156756 -170913 -160771 -93784 -47196 -71816 -131461 -175797 -201327
20812 -201327 -170361 -93804 -96994 -75860 -57308 7742 -1973 -5209 8411 17918 -25629 -55603
20800 -55603 14192 62324 39755 64220 58816 -2653 -36393 -71546 -96584 -51880 -13155 -53832
20788 -53832 -94401 -46068 -57352 10199 53775 -1301 -21160 27450 31536 -12764 -44046 -15798
20776 -15798 -18363 -18921 31338 54255 33334 12793 44549 61352 43813 11074 -12372 13455
20764 13455 -1354 -19760 -24554 -42943 -43804 -27912 -61228 -64242 -23031 -29329 -41484 -36269 -45958
20751 -45958 -10573 -16261 -30971 13197 3094 -9584 -13601 -12213 23962 9674 11122 28367
20739 28367 50687 -4670 -16738 37751 31531 -3783 12246 -11566 -20386 -1445 -21956 -13971
20727 -13971 -46585 -45573 12484 40743 51913 -10248 7942 48351 -10631 53602 126214 78610
20715 78610 64441 94455 84197 36447 14450 -4937 -16514 -44901 -71461 -100951 -107859 -86792
20703 -86792 -70771 -61648 -68442 19308 60820 84569 87183 59429 57921 49412 34661 40560 75170
20690 75170 60790 70514 61370 57880 60853 34619 -4227 -45951 -19348 4202 -41806 -67746
20678 -67746 -39911 -14843 2211 21201 69431 104617 65514 25218 -35787 5960 30367 21016
20666 21016 -18838 -27026 -2698 7182 49038 93763 37544 -22266 36408 63692 -19758 -45831
20654 -45831 -5210 63246 98503 80578 88417 83571 73872 37706 40335 31835 43013 15291 43351
20641 43351 68317 61073 34798 26084 21764 18459 18354 19523 -19674 20608 26801 22348 83749
20628 83749 133960 231374 292063 265452 158833 106653 74510 25167 21823 61611 92012 54296
20616 54296 26269 5411 41506 49467 9484 4814 21676 -17843 -7102 5469 71738 71767 39306
20603 39306 24714 53911 87722 722 24619 98955 84471 77274 35811 16153 27042 45787
20591 45787 4681 8304 2949 -17334 14492 931 24735 35865 24224 -43579 9097 53942
20579 53942 36433 -4879 -10701 26645 42535 2809 -28050 -58035 -41505 -10037 -15022 13017
20567 13017 21655 57737 37688 92094 162568 208967 173854 100804 89144 56559 8455 -18949
20555 -18949 -40332 4064 71078 83144 99312 64459 32378 3135 -4506 -40293 -66598 -45312
20543 -45312 22881 85578 116569 111420 63938 -2731 -16058 -1182 61023 59206 58576 37903
20531 37903 24201 15805 48075 53202 55359 32084 44485 138912 171530 146289 115174 118440
20519 118440 94532 69526 66627 120232 88008 38098 78609 44754 16204 43774 41390 12849
20507 12849 34530 64943 57732 1180 -24385 -16365 42640 137269 133270 98873 50610 35283
20495 35283 33952 9069 -41244 -7131 14266 28877 40029 52124 45543 120400 138255 89957
20483 89957 90553 150493 214209 218921 168322 171633 167154 185295 352004 545024 779426 1123547
20471 1123547 1418393 1629678 1694953 1396077 1008437 898014 1027877 1264762 1500609 1708232
20461 1708232 1855590 1500471 1081518 893380 820264 807108 896817 1096928 1402023 1695932
20451 1695932 1859393 1919852 1688905 1314555 1115672 1123600 1299159 1562423 1809438 1927738
20441 1927738 1683861 1194560 870482 754206 704928 685396 557294 412103 390619 365295
20431 365295 311987 345212 357278 320453 265702 276608 259145 234893 307991 309819 311192 314560
20419 314560 338064 278200 253264 237472 199690 190354 215494 186325 177911 187862 192059 169864
20407 169864 151048 116711 86487 83858 56412 78952 105856 70505 45699 8596 83711 160467
20395 160467 169693 143376 148728 150747 185387 201343 146776 117771 64497 75499 56275 75956
20383 75956 194090 222882 260500 288070 340158 356244 341597 309802 313987 372587 317476 222730
20371 222730 220247 283397 356747 328375 156260 99920 211609 236815 186266 116809 104131
20360 104131 140221 173395 146642 171772 164157 194365 200178 202506 144104 89993 97031 113215
20348 113215 155801 184927 154377 90116 93542 184126 158739 99839 139318 135877 106329 113191
20336 113191 56990 48071 31157 13663 -13935 -44370 14501 40861 51451 69458 57981 -10497
20324 -10497 -35770 -25681 -48915 -39320 -16299 34783 56432 78001 34169 29644 36064 54529
20312 54529 69590 32325 77105 159741 176841 102544 51989 69531 82748 66841 112399 177478
20300 177478 184837 167725 168457 182015 195248 125296 48468 52237 76306 129041 140540 129103
20288 129103 122238 105286 40804 53466 107465 100049 72392 96220 154899 179698 150167 108337
20276 108337 97398 53040 66181 51383 87357 98286 143370 142483 123373 117924 105538 92428
20264 92428 136962 137851 128620 131439 154992 107178 115279 118505 124915 172529 190870 130758 138621
20251 138621 108067 93585 157983 232418 236652 177289 168033 77953 60911 110928 92540 64807
20239 64807 73486 141562 179582 153079 132310 105479 118112 161350 195063 167415 104420 78954
20227 78954 111135 130938 150938 114467 98668 95454 34628 26610 59349 9410 -48297 -61447
20215 -61447 -14014 16056 62142 153295 162875 178216 213648 186191 201037 195883 142059 97177
20203 97177 65543 40071 63722 110152 9472 27118 131029 199635 182818 102575 20285
20192 20285 25989 33700 43315 63251 112758 137987 133090 142414 169681 106182 7595 -765 19701
20179 19701 67285 52246 69177 87329 39777 62637 93805 78061 91952 124391 169736 140724
20167 140724 109854 61629 -25509 -46935 29520 116510 188347 148739 63768 -37195 -31982
20156 -31982 -35209 -67451 -60327 -35105 23664 59199 109408 106288 57278 35369 111507 117692
20144 117692 92231 64594 53780 68468 92263 177219 248349 256814 231273 174134 116799 113333
20132 113333 114495 112973 177519 259636 244954 242072 278018 308739 262821 286513 297405 239924
20120 239924 222207 257577 292472 264793 233775 253391 343634 343788 299089 322777 340525 287747
20108 287747 261873 309640 344152 406769 447396 434138 375554 346294 303759 275483 231464
20097 231464 314802 345075 374597 366101 354948 324584 251745 185020 171264 195855 258313 275363
20085 275363 302932 294913 314326 340145 320029 281266 245261 259323 292532 216954 172887 144774
20073 144774 148016 119113 146592 203373 183433 170106 208786 217422 177045 150830 180770 159158
20061 159158 163670 154140 150478 155615 130235 108260 124189 72445 32279 -42540 -63214 3512
20049 3512 44118 42808 72251 89332 59089 63383 54493 -29111 -44447 115 47293 14019
20037 14019 35551 41533 14198 30658 6628 82033 129331 139714 156313 141434 103401 115964
20025 115964 149113 179947 194135 144473 160626 188235 164340 167859 173367 163970 192635 242029
20013 242029 270458 288633 281504 304705 277884 225313 210459 180358 237643 305066 338372 377347
20001 377347 458422 547019 545445 533778 541794 656002 699149 642789 550050 567208 534582 517262
19989 517262 569240 686509 732563 707893 648869 659388 702002 735018 773161 839730 846302
19978 846302 882636 923323 980055 965108 882314 886445 979937 1019938 1025924 1022343 1061513 970977
19966 970977 891928 880207 880096 864923 855712 838679 851423 866507 920856 959271 959190 944215 978750
19953 978750 950500 945487 909886 912693 887526 915654 916519 957154 940296 914852 888249 925184
19941 925184 988917 1013678 1050786 1035688 1017510 1042875 1075342 1162788 1175425 1142028 1140684 1126542
19929 1126542 1143892 1196940 1218737 1172155 1094195 1194700 1278008 1365998 1380875 1350650 1352336
19918 1352336 1382001 1409962 1463418 1595050 1699778 1805470 1904190 1948785 2007087 2166345
19908 2166345 2330914 2512514 2765057 2987908 3220653 3363732 3474515 3646461 3957714
19899 3957714 4485376 5124097 5756510 6331537 6728465 6890382 7238301 7880195 8748508
19890 8748508 9470312 10107549 11064360 12149161 13291991 14795824 16683984 18922704 21119673
19881 21119673 23600744 27783349 34544698 44967246 61809354 91200611 139918871
19874 139918871 200104615 249681211 289883616 281089792 210300078 165689701 161720844
19867 161720844 191837911 243236810 288198643 322848036 314500665 232008024 165828308
19860 165828308 134190850 122688761 125153982 141803570 177694671 232098435 283349445
19853 283349445 322833856 338877781 278270647 212350185 189311329 203789541 247183676
19846 247183676 294543970 329430545 343875614 279408725 193632521 143491967 116526752
19839 116526752 101113371 91550706 84582356 78600103 73052204 67983805 63643412 59721304
19831 59721304 56076248 52931578 50171984 47941704 45871876 44066119 42548843 41136383
19823 41136383 39613292 38073784 36682033 35341052 33827185 32326241 31013448 29794913
19815 29794913 28693743 27794814 26937259 26082628 25268082 24486725 23795307 23146826 22377815
19806 22377815 21552442 20849653 20255341 19741821 19281266 18799894 18256906 17713991 17215991
19797 17215991 16747233 16281221 15882972 15463869 15053299 14602279 14225738 13877418 13512113
19788 13512113 13175141 12800048 12487820 12190035 11920803 11600968 11321514 11045648 10660700
19779 10660700 10250704 9936842 9728814 9486747 9300780 9100401 8847526 8599684 8419056
19770 8419056 8176148 7984564 7786688 7599106 7355966 7121739 6946416 6771931 6582679
19761 6582679 6445939 6328755 6173545 6028798 5861739 5721608 5569489 5375905 5291050 5171266
19751 5171266 5075588 4962725 4873160 4808296 4654065 4446727 4266292 4131411 3987699 3965631
19741 3965631 3985478 3999388 3954523 3854453 3652570 3443899 3234822 3100991 3046887 2937351
19731 2937351 2847882 2867916 2858368 2804078 2682340 2548921 2469385 2364718 2209174 2132229 2067198
19720 2067198 1992889 1890659 1787564 1765564 1667660 1591411 1604156 1550595 1492326 1394921 1242921
19709 1242921 1162053 1066550 1047958 1037262 997217 1011054 1040459 1029503 985197 1008366 961787
19698 961787 822822 831306 870619 866333 825136 783991 847167 831365 748990 775469 796885 813660
19686 813660 853241 851218 846935 820510 776699 746898 741999 776031 780803 761733 773027 829631
19674 829631 829862 773172 719110 733375 766639 767264 793044 863687 847463 800633 794280 782293
19662 782293 702316 686314 652631 580419 536636 635481 682999 654071 614522 597336 563802
19651 563802 534053 542391 556783 454359 438293 525120 558242 538530 509768 501546 530436 513410
19639 513410 542176 506300 423293 378464 393541 415333 444867 447397 444035 525834 467404 370090
19627 370090 418998 465434 443180 447199 481795 521201 509719 494657 498970 475123 439846 417758
19615 417758 488250 469382 408360 428655 424509 386649 385703 395740 424280 452407 469286 438877
19603 438877 467893 472864 507998 599401 719787 806187 859665 839157 688238 592913 607814
19592 607814 634331 723379 789404 817001 767624 665804 548658 450483 440052 533876 573195
19581 573195 605812 637462 741226 816249 808669 715739 524652 440001 492619 549827 591359
19570 591359 629839 651213 572609 477797 406210 351897 346787 350565 340726 282762 257754 318579
19558 318579 341283 341842 297391 243685 258902 236262 258905 225053 196343 209424 215487 173385
19546 173385 175773 167966 170304 174306 165048 178655 175465 208378 233437 189722 127729 173974 217030
19533 217030 174295 176843 182105 213468 259494 278379 270564 263682 255283 281562 366505 420703
19521 420703 507680 715257 1071248 1456565 1718953 2004942 1767029 1194601 864158 771915
19511 771915 742439 852466 1108018 1471887 1791650 2069715 2239051 1794208 1254232 955407
19501 955407 784497 661194 622160 571958 584108 543914 494255 409639 367118 325410 360612
19490 360612 378938 397975 405757 382389 391647 344407 265778 220114 157174 183068 243854 248677
19478 248677 234170 203233 174918 191910 136040 83194 83647 98085 158152 169813 150688 129687
19466 129687 130785 172196 237510 237502 158658 122894 126506 138431 122729 53961 -43255 25022 96031
19453 96031 114714 161060 220022 228148 213793 169790 136231 133153 231016 235268 210733 225668
19441 225668 192223 155201 128728 150310 184891 185304 104167 58845 46204 65905 117203 137096
19429 137096 173390 109203 40440 69279 71644 79007 111844 156929 138734 111411 59402 13832
19417 13832 -15859 29008 109308 102487 93847 87138 4317 -4208 26373 96297 112593 82688
19405 82688 75655 52615 51902 86236 88761 91124 123228 201216 200921 176477 116253 117225 147904
19392 147904 148809 148305 151520 162749 135801 73827 113074 105241 43578 64809 52186 69933 73977
19379 73977 82491 64341 82893 97995 43695 82606 112664 108581 95042 91050 151418 143016
19367 143016 74724 79199 90583 102496 136845 118385 154180 146593 137492 69104 33209 57430
19355 57430 140958 158137 105788 110048 90429 64731 94899 101846 100743 21684 -19819 -23427
19343 -23427 5234 101345 105625 143937 110984 123980 145294 62804 70678 58136 58535 21935
19331 21935 -30975 2305 38512 80669 89650 90569 55669 41543 65136 48360 23876 31767
19319 31767 42461 10080 -5320 12247 62255 102611 107942 123570 146670 113798 110429 95883
19307 95883 83399 20408 26133 101175 80656 62995 74145 61958 54428 46136 33705 92226
19295 92226 49537 109503 168296 179780 191954 196127 202421 175477 182306 181194 174088 199069 189391
19282 189391 159131 120103 127742 140545 203472 231096 229586 202043 276658 381177 505879
19271 505879 659440 966841 1328689 1638791 1937342 2010810 1739594 1555097 1637289 1679928
19261 1679928 1771671 1946668 2241064 2388175 2038647 1664327 1581162 1439471 1188654 1118789
19251 1118789 1262195 1556226 1913487 2149711 2253012 1983059 1583854 1357014 1431176 1715346
19241 1715346 2090008 2447655 2686658 2443407 1849040 1376722 1168228 1090378 1141462 1218861
19231 1218861 1178943 1178789 1128458 948348 805537 768489 681504 611741 552495 516667 515584
19220 515584 536007 514471 538729 533528 494757 535279 582259 598681 673832 857368 1142219
19209 1142219 1447578 1682920 1788110 1581783 1300467 1216852 1348935 1626262 1874581 2063308
19199 2063308 1995131 1571577 1224856 964121 885336 868601 942800 1117303 1375180 1663682
19189 1663682 1860784 1973116 1654148 1342411 1240451 1353344 1645966 1824637 1973444
19180 1973444 1840310 1418547 1067498 879798 785402 726067 677450 644868 581748 506409
19170 506409 514073 524919 511908 495936 494304 459342 448354 435290 369887 368972 331877 406768
19158 406768 492494 517819 596639 791604 1141958 1527384 1829741 1970142 1742016 1390204
19148 1390204 1216460 1261561 1480816 1752871 1919264 1976604 1709282 1278999 1018061 793220
19138 793220 618567 523275 548397 558338 517915 487377 522226 519679 423449 431571 460708 525830
19126 525830 558845 524441 580981 712773 935800 1262415 1637601 1926950 2041452 1721765
19116 1721765 1352683 1221895 1260093 1489068 1681558 1830562 1867464 1519192 1094550 785572
19106 785572 619605 573779 526826 496364 487858 437600 398731 385570 385647 381549 332803 346833
19094 346833 347318 322197 289576 302485 311285 313733 295135 228682 166033 181115 216292 195539
19082 195539 174653 172239 213954 243009 233672 248476 231958 175010 146760 166315 172825 170569
19070 170569 144081 101205 159683 197861 163672 186619 157478 144063 111132 126508 122844 105797
19058 105797 162348 197920 178087 121797 69348 78985 138474 216418 200703 152941 146250 87724
19046 87724 101957 113514 149495 176095 233268 197679 140905 173336 192590 167089 173258 169709
19034 169709 198991 215013 237157 197125 242882 234728 296048 427156 549296 697190 804916
19023 804916 794860 648557 522700 495601 525323 616479 736932 838830 872571 769478
19013 769478 627094 562392 458867 413278 392701 380979 368225 375015 379947 370284 375969 434834
19001 434834 455314 415388 399586 436090 458514 470937 581056 720778 890708 974535 880584
18990 880584 679147 544078 537463 673864 794270 851169 922726 910166 756051 624474
18980 624474 558113 496940 458725 377099 328936 290553 345948 372500 307257 283966 249254
18969 249254 282605 294141 290840 255203 260951 260440 290566 253111 188718 202939 241977 248914
18957 248914 271228 293270 346288 358530 362899 334241 287319 259290 241766 234003 254014 198880
18945 198880 181365 232514 291277 309620 295633 277905 263726 268627 298862 281712 329593 399680
18933 399680 414838 404679 506932 767218 1090970 1352145 1512550 1555983 1224883 845335
18923 845335 637585 593981 586105 522630 523194 472642 446691 451756 507412 565772 583326 627366
18911 627366 818280 1051806 1277246 1450397 1584144 1441291 1030245 820402 722078 693170
18901 693170 664557 728134 854518 1023620 1390472 1774209 2063643 2240887 2155364 1693407
18891 1693407 1374851 1166778 1065143 1004602 990038 961436 973394 1034832 990439 946827 963682
18880 963682 998153 1096430 1373444 1670085 1973089 2107808 2108443 1689166 1227261 1008688
18870 1008688 872990 763142 744079 673484 610801 583004 615549 539538 536872 558772 574533
18859 574533 574065 494307 489209 509905 472348 501483 556502 591174 695740 737441 795944 869818
18847 869818 881266 911661 819609 705938 741225 776974 859742 990060 999892 1005703 984903
18836 984903 932053 909605 827110 815857 837958 895298 921601 953354 924721 804010 751760
18825 751760 681271 661798 717075 684906 621670 610309 640577 676624 638613 533223 531963
18814 531963 571478 593810 565044 472754 424252 414263 431689 412252 426104 436177 423848 417032
18802 417032 365894 329199 326646 323488 347771 314669 280319 273038 231120 248918 319550 311799
18790 311799 371432 358615 307248 238877 247563 219172 272734 290816 302958 310372 283106 242073
18778 242073 233936 284520 339684 363765 349939 328177 323765 329383 301902 286044 256840 290988
18766 290988 396881 532618 617994 661459 618290 470397 369111 374158 415920 402468 318528
18755 318528 219865 201517 237311 205924 230307 243330 245850 227938 280480 285213 280211 356086
18743 356086 411194 414897 410920 457331 511517 481149 488288 532663 518369 475589 506708 617482
18731 617482 644261 619314 631105 671580 709052 677171 626010 703948 818602 932628 903913
18720 903913 928088 857418 800231 788581 863427 826815 779367 736140 703605 701761 776748 859900
18708 859900 934630 943650 953654 914190 897743 918403 952351 1011683 1096686 1198854 1235282
18697 1235282 1187574 1330659 1351583 1265583 1230603 1325294 1351687 1260516 1206391 1249625 1285302
18686 1285302 1259029 1143338 1072907 1077638 1107237 1124541 1184234 1206941 1147080 1126102 1179425
18675 1179425 1200078 1258586 1280399 1262042 1221323 1198444 1254612 1300542 1328300 1361556 1343029
18664 1343029 1342621 1346462 1382350 1340893 1303931 1344401 1370968 1430438 1475060 1533127 1527396 1486869
18652 1486869 1431838 1425886 1506708 1581127 1691572 1825084 1938711 2004774 2065309 2105108 2117546
18641 2117546 2290188 2532877 2815831 3032975 3288440 3556792 3720217 3962461 4309089
18632 4309089 4788717 5251787 5665905 5895246 5897811 6115414 6630699 7476906 8523906 9506624
18622 9506624 10212541 10627379 10994733 11765323 12925748 14493031 16099838 17796973 19849099
18613 19849099 22670858 27570020 35455990 48197500 70728695 109384167 162841419
18606 162841419 211880150 250662377 264668725 208265359 154461642 139564024 156869427
18599 156869427 197636492 239840260 271147637 281608899 220691665 149141885 109606103
18592 109606103 89404498 78511571 71874093 66510768 61870370 58167415 55504687 54094052
18584 54094052 53819941 54145954 54897881 56039538 58897686 64717317 74340802 91570170
18576 91570170 123636297 177576395 245518805 301873788 346932813 340223856 257022296
18569 257022296 200810748 191951617 221168032 274267323 321247827 355764846 347357196
18562 347357196 255317911 175901091 133313812 110337523 96721404 87539720 79835356
18555 79835356 73159284 67427586 62610654 58849948 55910745 53633500 51415077 49018772
18547 49018772 46834559 44495951 42017267 39970726 38478681 37428012 36640462 35830352
18539 35830352 34898725 33470345 31579318 29839183 28455843 27409351 26509537 25640940
18531 25640940 24716038 23878450 23113659 22458687 21863887 21216755 20515458 19826185 19246439
18522 19246439 18711126 18194858 17697963 17198817 16735117 16313570 15900861 15454158 15012210
18513 15012210 14708604 14378734 14027175 13684713 13328411 12890953 12481125 12052914 11720184
18504 11720184 11425807 11160657 10940278 10701642 10347340 9959784 9612974 9350078 9137466
18495 9137466 8923540 8749797 8585620 8430345 8191881 7924435 7655166 7463339 7255581
18486 7255581 7131671 7063772 6977588 6776174 6530071 6388013 6239257 6050093 5875282 5702114
18476 5702114 5487887 5359662 5321958 5214322 5039736 4792407 4596206 4501417 4330134 4155370
18466 4155370 4091080 4034628 3981220 3885874 3800697 3681428 3658232 3649677 3660954 3625730 3576514
18455 3576514 3505946 3478666 3348140 3227340 3081358 2957707 2908771 2910105 2837598 2777849 2719230
18444 2719230 2720280 2626371 2595869 2629678 2462719 2419016 2392649 2360565 2337424 2365404 2372139
18433 2372139 2318845 2174233 1999833 1893970 1863105 1875585 1866560 1884015 1947913 1888889 1825263
18422 1825263 1889228 1939855 1910712 1872335 1845349 1827983 1862942 1865419 1819180 1785254 1803942
18411 1803942 1801050 1965141 2249346 2593865 2969395 3332923 3520720 3360108 2964952 2733551
18401 2733551 2493346 2341376 2235316 2199117 2106496 2032183 2001417 2058254 2158371 2213281
18391 2213281 2241609 2404593 2630490 2881959 3102921 3195012 2952172 2644934 2526216 2451287
18381 2451287 2388587 2398111 2449648 2580398 2830398 3173845 3518838 3853341 4121876 4152951
18371 4152951 3749769 3433425 3338737 3332832 3470883 3856369 4349936 4860346 5214342 5397649
18361 5397649 5112977 4803332 4787292 5025335 5495041 6086316 6670672 7143004 7339636 7230915
18351 7230915 7240029 7556774 8123932 9018185 10425309 12166048 13886928 15336981 16051261
18342 16051261 16594032 17533891 19404789 22445683 27413159 35420801 48335281 70920761
18334 70920761 111345425 173416296 238610586 288102880 319893060 269070202 177118260
18327 177118260 121797767 93935523 79353804 71006479 65513676 61483755 58839055
18320 58839055 57540781 58361066 62755945 71766152 88294238 118846385 170220291 234570995
18312 234570995 287197149 326887489 314405752 224558257 154014119 118131888 100827260
18305 100827260 93806661 93715172 99733162 115537735 147866505 196349446 242098384 276892328
18297 276892328 288438788 227337945 157796220 118616930 98014053 86611752 79435705
18290 79435705 74229075 70391761 67809095 66440771 67113482 70493156 77377657 91490171
18282 91490171 118412513 161933906 210952390 247996132 273694023 241391422 165532952
18275 165532952 116235146 90564645 76419229 68111686 62582993 57862330 53763242
18268 53763242 50211169 47312725 45123213 43321138 41398370 39348572 36939048 34483602
18260 34483602 32601418 31151832 29824816 28650249 27564704 26556827 25705010 24958530
18252 24958530 24242031 23689305 23118600 22495138 22076358 21580968 21060214 20383618 19441423
18243 19441423 18600875 17964682 17349165 16740971 16279822 15791056 15330472 14968380 14654087
18234 14654087 14357614 14035149 13739900 13436758 12985694 12541950 12151064 11766888 11449858
18225 11449858 11171563 10923328 10605511 10304702 10133890 9999791 9827065 9571022 9274762
18216 9274762 8961718 8670718 8403648 8145260 7970142 7788564 7613702 7456043 7382217 7340579
18206 7340579 7356487 7408718 7633226 7883257 8030432 7941057 7524777 7124992 6804905 6720736
18196 6720736 6808362 6822424 6731812 6339518 5721773 5258565 4962790 4777094 4626794 4474651
18186 4474651 4283219 4140421 4058277 3914095 3728229 3614980 3573091 3422300 3325797 3283767
18176 3283767 3220986 3153145 3120187 3195489 3324698 3500212 3648467 3682037 3347821 3005071
18166 3005071 2927923 2984108 3108401 3204742 3254600 3158753 2756362 2414244 2203208 2024176
18156 2024176 1967766 1981201 1934777 1920831 1864033 1793790 1729168 1656680 1606392 1599713 1567389
18145 1567389 1492639 1517556 1529075 1500696 1464674 1454006 1465410 1477166 1476365 1395054 1350181 1329217
18133 1329217 1307326 1342766 1392043 1434994 1468980 1485725 1554085 1581738 1636018 1684551 1811464
18122 1811464 1844412 1932535 2131594 2356559 2609437 2827721 3159030 3645373 4274605 4996073
18112 4996073 6129594 8050641 11186418 16854505 27396477 43603364 59838786 72003653
18104 72003653 79139515 62618721 38743157 25443632 18870224 15493125 13601421 12262027
18096 12262027 11073908 10021787 9020812 8119328 7457109 6928703 6489070 6069297 5701590
18087 5701590 5467366 5225426 4990994 4793899 4607947 4476531 4348115 4318335 4198957 4040093
18077 4040093 3923422 3800218 3700015 3628594 3532238 3361091 3205055 3051575 2928701 2837211
18067 2837211 2761163 2771113 2796635 2773883 2804717 2730050 2637047 2591741 2618394 2638698 2599548
18056 2599548 2587443 2537410 2526321 2575120 2790879 3149070 3405643 3588593 3512327 3082142
18046 3082142 2773821 2652006 2741852 3003444 3293659 3460749 3413325 2933437 2404143 2096795
18036 2096795 1992943 1985410 2014151 2038650 2073759 2172646 2151011 1931226 1791774 1706667 1672803
18025 1672803 1659502 1643100 1661970 1736268 1856439 1911553 1984458 2236515 2435546 2539666
18015 2539666 2431992 2126158 1889615 1901408 2207133 2492311 2686838 2905553 2916454 2627483
18005 2627483 2316815 2061624 1896328 1817420 1813294 1797284 1690055 1456887 1204143 1054366
17995 1054366 989047 983722 981781 947095 850825 832077 807761 782290 735040 770310 736114 675381
17983 675381 696028 725289 779467 757049 806307 869998 947236 995514 1070087 1123822 1027097
17972 1027097 817399 720526 680392 636596 602331 525280 430970 464513 430602 397190 451657
17961 451657 461357 385773 351177 341460 364271 346475 287334 230603 218484 246042 233739 219637
17949 219637 215230 226833 227392 185929 228928 261391 251019 191970 160176 184129 221474 259054
17937 259054 229019 208263 107890 19439 63243 72226 153468 227306 320011 375821 463096
17926 463096 427900 348332 289696 257193 227742 245989 260952 251491 218848 143310 127958 141731
17914 141731 218188 275605 187499 112845 135653 162560 148826 198648 216712 201456 228683
17903 228683 229367 228251 193517 180062 174502 112943 128432 141156 103092 109976 138584 202149
17891 202149 272604 305400 337216 287349 200452 131947 112018 76720 73177 86312 37493 67453
17879 67453 115817 182228 220482 169550 93170 73799 84116 96092 135057 113038 138762 183838
17867 183838 229027 160448 118110 38096 50451 83853 106405 118525 104289 58644 -8364
17856 -8364 -32665 15973 17013 210 37714 25842 72134 182655 198308 176777 112280 38402
17844 38402 100031 106795 22225 65320 138075 178460 99125 69674 74018 113699 164402 109285
17832 109285 106522 153253 100998 30485 35250 61349 63336 50825 63873 43442 42664 60068
17820 60068 62715 92166 101000 157563 184758 118610 125616 99375 87147 89901 113001 116265 78097
17807 78097 75710 48886 41378 52132 25568 6381 -2164 11533 58858 78622 109047 93163
17795 93163 86026 94620 33931 25202 75876 125818 90013 30713 -39092 24168 46399 98726
17783 98726 116349 81776 31159 64523 80064 46640 74038 78565 70861 33011 47864 55392
17771 55392 2362 23772 86719 98710 97574 76585 70816 81133 99588 122225 94975 95814
17759 95814 99009 56597 78296 93225 84020 74434 43820 55328 47016 37838 27164 43246 90971
17746 90971 57959 38703 46663 25623 6333 34406 49241 63807 127148 138829 169922 216725
17734 216725 297716 415814 642642 973733 1314621 1567864 1732324 1413402 924213 605782
17724 605782 449440 368184 318833 264077 270594 305675 320944 343014 354529 417073 517785
17713 517785 635614 891583 1244494 1546482 1731579 1627996 1260228 949533 723272 551691
17703 551691 519717 549091 583660 659534 888506 1187088 1496911 1628539 1609320 1231928
17693 1231928 861658 733015 700740 604965 527526 449333 423056 434205 414699 380525 387020
17682 387020 422461 522435 712170 963848 1202384 1405051 1523612 1379618 1006499 720885
17672 720885 493488 426853 384405 418373 392800 358219 381062 342231 354752 361333 338544
17661 338544 342903 261442 225851 235651 234313 230005 238124 215372 195806 179182 124352 115006 172055
17648 172055 171790 124989 80937 136575 182732 186462 199723 219330 194040 161263 136068 128536
17636 128536 102640 84828 22375 25787 29157 47137 122597 139359 119718 196095 209308 180165
17624 180165 115905 145739 163762 117285 83487 46482 55607 101343 119101 93583 94185 57346
17612 57346 99174 115672 109638 115023 149471 130451 132871 90000 83232 77315 78986 89271 -23303
17599 -23303 -37906 -17067 -1092 18247 -25671 -90423 -52346 -9004 -13926 28658 -2461 -30170
17587 -30170 -8931 -16147 -44657 -26221 -42879 4260 20026 -13054 5862 70722 62299 62356 98224
17574 98224 101409 71832 110181 178270 181097 108803 34010 47831 105764 115876 74220 14926
17562 14926 19951 25039 32753 31161 66077 81571 44776 816 49756 72732 59111 48332
17550 48332 46062 31014 -10779 50113 111968 140967 91195 17814 -14282 -264 14341 -13916
17538 -13916 -34234 21665 67676 101015 23852 -4342 1081 19824 74554 137076 110817 73688
17526 73688 36815 33593 20992 43005 71412 52437 11299 -3042 -22414 -3234 11557 31812
17514 31812 46439 35391 31509 -61817 -106043 -79899 -6571 13034 -16408 -28388 664 17281
17502 17281 -33142 -70192 -58422 2372 32284 6961 -32448 2158 -1616 -14917 -25396 -6979
17490 -6979 -33708 -53650 -34280 -41251 -42746 -4796 65224 55475 -22524 2600 -8593 -926 -14096
17477 -14096 -30160 -40890 -2252 20048 17047 -13043 -66338 -76279 -77318 -48211 14447 38550
17465 38550 79088 39738 15905 47328 43921 27727 -39367 -10475 25321 70384 72110 43893
17453 43893 60739 95921 133129 120274 99144 32928 -34953 -64336 -31538 20533 45930 104482
17441 104482 151357 263335 371910 475660 388588 166784 86592 140002 134329 114689 128703
17430 128703 145657 46538 -31492 17841 24814 8290 33910 94307 73069 91305 135320 136553
17418 136553 85320 84526 149188 139122 99108 58308 32025 1023 -8226 6889 28489 28886
17406 28886 5753 2513 21866 79609 18891 -45746 -25559 25289 57355 62211 54835 -18388
17394 -18388 29527 44958 15076 -9163 8645 25419 81961 112273 62887 33415 91538 77794
17382 77794 38353 65052 97669 46521 42661 53348 46693 82466 117065 67670 5472 22707
17370 22707 28000 18710 -6761 17867 71767 18556 -36098 -59815 -80666 -48330 -31985 -13765
17358 -13765 -3818 35982 55099 -10062 -50027 -51899 -30997 7052 64143 58345 57501 39280 -9708
17345 -9708 -28355 -64316 -13691 20576 9423 5828 42157 32581 4851 4715 30177 -4962 -55953
17332 -55953 -20196 -26511 -56479 -79229 37968 35574 26379 47117 68731 13697 -29876 5862
17320 5862 -3434 22024 37897 -32938 -41045 12681 -49027 -48426 -54862 -86216 -98632 -52602 -58184
17307 -58184 6528 37220 40822 46861 -7732 -20923 4437 32235 29590 54214 63886 50381
17295 50381 68175 44107 -21589 -80251 -33658 22340 78587 30820 -7820 -35767 -11159 -42232
17283 -42232 1628 18338 12327 40418 66788 48093 14108 -15287 -67286 -70048 -26007 -5074
17271 -5074 -40018 -85514 -55576 -43807 -29048 -43583 -16955 11352 21256 11315 15286 -49707
17259 -49707 -104035 -121431 -61982 -51901 -19625 5531 6329 2125 -29756 7342 40124 58588
17247 58588 39047 50406 17668 -34987 -73035 -65486 22476 40723 -4192 -65234 -80898 -41506
17235 -41506 -4065 1169 -33794 -67406 -75844 -80612 -72687 -96919 -94240 -29128 -26766 -20331 22069
17222 22069 -22481 -9981 -51668 -17299 3439 -34862 -10857 -17814 -16677 -32844 -38847 -47459
17210 -47459 -72650 -67237 -73876 -38069 66621 92460 34197 -2412 55294 50786 -1553 17514
17198 17514 -25325 -69594 -47375 13383 43381 14179 33420 37510 -15457 59009 71464 46452
17186 46452 31131 13177 325 -14563 29371 -15645 -42184 -48285 -48378 -85431 -94645 -25151 3066
17173 3066 10617 25683 26091 39364 66042 40388 109 -14675 -1346 54334 96583 100228 105683
17160 105683 140304 123460 101763 79525 9169 -39728 -60804 -5994 34943 21832 9652
17149 9652 -21178 -41379 -94503 -96491 -61434 -19667 -418 -28726 -17771 -27176 -5039 85447
17137 85447 93485 12762 -37683 -65447 -101087 -87221 -48599 -24719 7093 13103 857 -33801
17125 -33801 -84885 -44024 1096 -16509 -42626 -82155 -82193 -91927 -44466 -22705 -24725 -21096 523
17112 523 24054 78719 130263 146383 155742 150598 101548 38561 -6033 5085 47405 66647
17100 66647 15861 30037 3741 -51649 -43235 -32776 -76132 -79230 6079 1414 12734 16737
17088 16737 27057 10949 457 36452 65624 44927 7668 -35312 -73163 -48436 -15909 -29974
17076 -29974 -6732 -35076 -43096 -60708 -17695 -41387 -4097 70410 66276 6392 -37197 -2373
17064 -2373 10533 21257 -14923 -3567 -33065 15908 69633 73760 35107 59917 33175 17123
17052 17123 59102 117518 74992 34009 26203 10175 46693 72677 133936 128090 110905 56233
17040 56233 39036 82325 130741 11427 -42388 -61048 -49632 -10450 20236 37496 32348 30010
17028 30010 -27544 -33638 -29309 -54571 -71604 -51896 -103507 -68419 -30242 -10622 -7225 -7021 -32163
17015 -32163 -75498 -54830 -45606 -91196 -84067 -40634 -45961 -6034 22256 -3323 5313 80703
17003 80703 87283 37211 35678 51745 -12301 -33380 -3909 -25111 -34344 -60679 -43881 -107672
16991 -107672 -104744 -67124 -32310 1088 78350 8894 -24411 8927 -1695 33355 52700 -2454
16979 -2454 10893 60988 32908 -39473 -85829 -30042 49280 36514 70647 106385 69537 51787
16967 51787 8822 29522 11772 -30882 -15920 -3607 42311 19476 -66989 -59731 -15206 -30947
16955 -30947 -33884 -19154 -18561 -49576 -70180 -13369 -6566 20806 -17006 -21551 -28667 24836 17283
16942 17283 5378 3019 13132 9963 2089 -24898 9727 56387 62955 66720 -1195 -57005 -39848
16929 -39848 9504 16190 -18167 -12343 -530 -704 -9460 43141 1012 31599 100907 74783 -9189
16916 -9189 -21727 1240 -38942 -88674 -93522 -29003 -2351 -49108 -61460 -47136 -64172 -100918
16904 -100918 -85734 -76003 -80096 -23038 34868 78788 36942 34160 32805 -21415 -56376 -52820
16892 -52820 -69724 -34786 -3351 15860 49326 45466 31113 -3145 -23000 -21650 24286 43612
16880 43612 11236 -4400 -23430 -16139 26836 -9771 -21788 -50210 -49352 -31145 -17724 -41506
16868 -41506 -81486 -68378 -45814 -42932 -38188 -38907 -32833 16922 -4033 16615 31629 -21307 -94026
16855 -94026 -132770 -160860 -133434 -29477 -25685 -75821 -84267 -63224 -44438 -74855 -79687 32084
16843 32084 27479 -39560 -91226 -50805 -26569 -12607 13976 15236 14610 22227 -1058 -62736 -68335
16830 -68335 -18262 11555 12487 -37751 -467 -3203 10019 28173 -5522 -64376 -18963 36572
16818 36572 14166 -10172 41240 76769 17152 9732 35766 7087 27111 55312 85378 19680
16806 19680 -18397 -8605 23881 24140 -10073 -55804 9241 73832 82837 69760 -26971 -73556
16794 -73556 -40755 -11232 -50918 -93726 -28317 19796 15438 -72303 -122651 -151933 -70934 -32544
16782 -32544 -58487 -110486 -130222 -63069 -31578 -6247 36720 45388 -27668 -10681 8596 -18433
16770 -18433 -35375 -28376 -36898 -44273 -38835 -41393 5011 43788 60249 49913 22078 33479 1757
16757 1757 2019 25654 22790 -6997 12880 13967 -31762 -99703 -58804 -31077 -33994 -43445 23437
16744 23437 92276 55740 -4393 -27058 -8133 18460 -19010 -69625 -87255 -28837 -43896 -70526
16732 -70526 -13734 -14094 -35243 21006 -35791 -49625 -5037 -27488 -32525 -2783 -15449 -23727
16720 -23727 -42579 8769 48463 66059 61271 52285 15716 20953 -28651 -92364 -85839 -45853
16708 -45853 -73356 -134090 -107240 -86947 -119265 -89328 -79949 -16637 27326 48599 65650 22734
16696 22734 -54059 -11225 21207 23387 43368 31704 -39878 -93788 -96376 -83527 -63598 -6802
16684 -6802 -13733 -66743 -54869 -51819 -58793 -35124 -42711 -78233 -39558 -63338 -74433 958 33487
16671 33487 103768 130638 77594 4829 5254 10097 5243 -13209 -46221 -71506 -60592 -95551
16659 -95551 -106910 -74880 -17014 -24073 -31811 -46355 -36062 5112 12694 -4274 -17268 14315
16647 14315 15869 -14210 -18579 50426 75999 48474 62374 38752 56212 64169 63584 9909 -48753
16634 -48753 -69202 -97244 -71094 -39536 -69963 -123348 -114182 -46866 14779 -42414 -67991 -40773
16622 -40773 -46206 -12778 -61543 -135604 -97552 -69200 -32917 -29031 1327 27763 19949 -72162
16610 -72162 -124894 -81271 -3893 22914 36841 11916 5585 27731 -1610 -34608 -24378 -57869
16598 -57869 -61248 -35794 29849 43711 -14952 -35977 -45094 -10755 35646 23574 -46923 -70909
16586 -70909 -51261 -9497 -19550 -7557 12377 -13578 -6240 34833 21464 28167 21327 16019
16574 16019 23436 2648 -15314 -16214 60 8226 -24951 -5169 2687 -65207 -31460 15309 54032
16561 54032 24017 -4832 23292 43514 30309 -26648 12763 36309 10909 -35873 -55512 -61213
16549 -61213 -10846 22943 30427 38606 -27475 -4529 -14365 -23899 -7546 22737 31701 -59539 -73002
16536 -73002 -88512 -78635 12833 39210 42563 26823 -11535 22231 54072 67847 -11597 -8299
16524 -8299 25147 -25946 -4155 10170 60265 34325 48653 87007 64910 6664 36048 50450
16512 50450 12200 -28758 -11475 32089 48317 38148 54079 -3321 -7104 12876 12683 -22970
16500 -22970 -6457 28033 8255 8279 50645 67008 56844 51002 6942 40284 85819 66468
16488 66468 55260 5556 -76453 -92306 -96685 -58304 -54966 -45377 12441 83530 68624 20339
16476 20339 68549 76191 35717 -36598 -38001 -59035 -126066 -122837 -84362 -43801 -106414 -105499 -67859
16463 -67859 1877 -19176 -50315 -35979 -17885 -47393 -24962 -49069 -34839 -10891 -21531 -34043
16451 -34043 -83906 -97976 -41089 -33991 -18830 28 -24422 -58252 -15932 35689 83555 50921
16439 50921 11295 -427 38117 43010 -51728 2278 44257 23583 17890 57831 -359 -65174
16427 -65174 -37415 -47209 -99698 -53270 31502 103506 104429 64907 -15180 -85098 -78954 -94193
16415 -94193 -84209 -43737 17376 9428 44361 45605 44878 78312 111008 124797 43709 -37794 9260
16402 9260 72394 32276 -54447 -73718 -63990 -69852 -16883 60731 82717 49308 -16198 -37523
16390 -37523 -37243 -5974 58492 84912 72631 57598 28440 48491 97836 113772 42562 4124
16378 4124 -29046 -50610 -54468 -14686 46061 86133 83268 113172 80076 -11410 -19754 -82504
16366 -82504 -35352 -2364 -9227 -23975 -34069 -66958 -116928 -142424 -145061 -146043 -98146 -25315
16354 -25315 -3949 -12368 -73668 -87907 -44327 -23930 2999 -70971 -108742 -102290 -26244 -43933
16342 -43933 -76436 -44481 -40132 25426 108276 120264 41749 -80121 -75236 -15446 39850 12624
16330 12624 -75072 -117543 -105793 -50635 -32869 -31529 -13539 14015 23302 16969 3796 13842
16318 13842 -53298 -87431 -108111 -95803 -61923 43068 70343 43511 90946 96905 34474 -15928
16306 -15928 -12725 -5110 -61532 -91188 -14831 7525 -18306 -35320 -51026 22460 -9187 -40143
16294 -40143 -34350 671 22620 33988 46135 65830 87340 73067 68866 39884 -16814 -25451
16282 -25451 52 57629 91770 33149 -20430 -5817 3028 19746 -1272 -20595 -41514 -34879
16270 -34879 -24398 -26406 -53570 -61619 -49404 -37263 -56774 -77535 -52691 -63978 -59627 -34709
16258 -34709 -40791 -63020 -60206 -66688 -96328 -92217 -128109 -172031 -70179 -27481 -32929 -11532
16246 -11532 31060 33987 -48881 -130571 -134346 -69583 -36526 -10845 -34519 -62760 -53369 -73388
16234 -73388 -77637 -115739 -123313 -71519 10030 5875 10540 50777 113082 93017 36437 6205
16222 6205 149 12451 8725 921 9561 11165 36612 15258 31297 38571 -10947 -58984 -38214
16209 -38214 -19523 -71454 -123912 -126103 -98145 -77894 -67731 -32471 19143 62621 29250 -32282
16197 -32282 -56319 -57532 -58401 -7394 33521 38016 47937 40912 49040 102417 116167 37350 -27594
16184 -27594 -64895 -56054 -3990 14311 -9047 29837 68642 84795 -5647 -46328 664 -9545
16172 -9545 -82825 -102638 -70925 -31118 -65199 -33389 16104 51307 54093 5272 -34135 -38792
16160 -38792 -52977 -1200 18889 -26968 -42876 -57840 -65972 -69182 -73696 -70092 -63786 -107933 -154251
16147 -154251 -110387 -19957 -3359 -37920 -82952 -125289 -79134 -70107 -58270 -63579 -69314 -50489
16135 -50489 -23370 -28474 -27708 -72380 -69664 -49331 -25256 42745 6149 -47532 -84457 -79461 -18201
16122 -18201 -33987 -102865 -97046 -54737 -37425 11791 30934 -6436 -31147 -32439 26584 31001
16110 31001 -1018 38202 45409 39678 22830 18416 88704 3503 -30085 -33941 -3691 24636
16098 24636 50278 54442 7764 8660 4705 -72869 -56082 20419 44718 25174 9008 -22429
16086 -22429 14575 99332 78511 5774 -27755 -21403 -24188 -470 -2119 -24066 -3920 12093
16074 12093 27010 9729 26523 9106 -50167 -92982 -110921 -104798 -88928 -79248 -72394 -6042
16062 -6042 28439 -13503 34426 25087 12121 -1670 -52914 -7539 -35348 -48822 28966 75953
16050 75953 40705 -2893 -9645 7698 3336 11834 6638 41163 40413 33516 -20884 -27004 -74672
16037 -74672 -112662 -88831 -25612 43707 51031 21869 2370 32993 102346 113861 44398 -277
16025 -277 -50568 -82224 -68448 -17412 12967 -17734 -42508 5431 75964 70494 45521 -20272
16013 -20272 -56628 -59768 -56436 -21639 -7849 -7594 -639 15755 45436 11251 -34111 -50277 -46126
16000 -46126 -26136 -44537 -76362 -45386 10387 34575 -13178 -24538 -37298 3136 55216 61619
15988 61619 68098 79398 99952 50006 -35522 -73090 -88559 -87535 -27072 27046 23586 -61569
15976 -61569 -78795 -79556 -58231 -16040 -7846 -35775 -77375 -46164 -11526 7396 31364 31525 1910
15963 1910 -36529 -11713 12615 -8248 -7049 6768 17050 -14567 -111746 -99529 -84743 -123010
15951 -123010 -47830 -4681 -18848 -80372 -107622 -97214 -46408 -21824 6738 -7426 -65602
15940 -65602 -63755 -23551 -22041 -41896 -53820 2642 46795 52397 25786 5597 35966 23058
15928 23058 24496 13850 -83 39824 28404 25317 24317 30255 -5047 545 10538 13316 -9588
15915 -9588 76341 94879 52008 -32757 -96129 -127462 -59993 3921 42243 41650 44006 5583
15903 5583 13945 26912 71966 36956 -28253 -11170 64217 27935 -711 8500 47506 47208 34760
15890 34760 2039 -22888 -16724 58995 60584 52041 20000 78589 49364 56352 36526 -7223
15878 -7223 -36387 -12421 -33122 -64976 -76847 -62302 -54110 -37338 18894 -31494 -40820 -19725
15866 -19725 -6619 3197 51469 37582 45764 9691 -49672 2112 41230 45524 56317 -6515
15854 -6515 26501 32256 36613 10470 -12688 -4568 -2606 -28262 -62607 -70170 -39202 -52140 -34645
15841 -34645 -46111 -116784 -179550 -183190 -99867 -25718 71387 65215 4624 -3995 56287 93533
15829 93533 106556 73836 83837 32567 -72904 -73879 -33188 13135 34452 66263 -4664 -97493
15817 -97493 -110252 -109650 -87424 -80191 -77968 -30876 -14140 -3170 -25642 -25647 -27370 -72544 -42139
15804 -42139 3111 -8792 -38253 -82553 -134763 -87562 -53995 -36928 20169 68214 63019 54571
15792 54571 21750 -16704 -71310 -95632 -97800 -89349 -41502 -8615 27625 71779 82663 15818
15780 15818 -67906 -50488 -4795 62113 85795 104332 65691 26692 -19487 -91203 -52511 -1957
15768 -1957 18522 -30774 -42443 -51676 -8930 26494 41378 8483 -5072 -56896 -60861 -67276
15756 -67276 -97217 -38751 16388 30301 61474 -41151 -83983 -68062 -18760 -35943 -56214
15745 -56214 18171 15341 -22759 -79226 -97366 -75361 -44785 -53374 -71919 -14280 29967 72152
15733 72152 17618 -15191 -25445 -37756 -77724 -40811 -16526 30157 21857 18260 48653 74381
15721 74381 39787 -28424 -100855 -107573 -108609 -142147 -138524 -66287 -46862 -110448 -38076 25476
15709 25476 6108 30096 47839 16922 13527 13797 -3716 -22295 -31045 3201 -78639 -73602 -74061
15696 -74061 -64666 -79281 -104034 -64400 -36432 -71885 -68702 -27688 -27596 -42807 -37315 -35319 -21632
15683 -21632 -20022 14026 53452 48527 25742 -11224 -62574 -82176 -113136 -116778 -102201 -85701
15671 -85701 -96627 -116908 -124131 -111125 -104414 -63155 -1138 -28680 -49899 -34128 11054 26221
15659 26221 37973 408 -49494 -85337 -61015 -30442 -86955 -69819 -65684 -17672 -29665 -35554
15647 -35554 -17301 14869 81578 119567 74489 66888 71438 20960 -75789 -70275 -36878 -8426
15635 -8426 7416 37364 51029 65115 6764 -50266 -59445 -75665 -49720 -61307 -141182 -124931
15623 -124931 -91852 -136054 -74765 -32005 -21833 -23485 -15707 -6018 -33991 -65780 -14104 3747
15611 3747 -6232 -13315 1277 16426 -14044 -11013 -5482 -32905 -11754 626 -44718 -74489 -51635
15598 -51635 -53565 -36526 -38881 -30979 19706 32033 15927 -28002 -12469 -3592 -22301 -100983
15586 -100983 -116188 -95590 -11779 -19321 -48433 -11598 -2350 -36037 15294 3526 -13284 -21558
15574 -21558 -26089 -45393 -50253 -36801 -30030 -8004 30006 -25659 -54350 -74156 -98195 -95406
15562 -95406 -33696 -40268 -74485 -36739 28422 60826 -16400 -8349 25141 19301 -13245 -19952
15550 -19952 -7044 -33109 -7040 18253 -7055 -39049 -49887 -38387 3353 29903 74180 67027
15538 67027 9843 8021 -16419 -5012 -24390 -29171 -4533 10420 53044 109946 148420 148893
15526 148893 117138 137343 132781 184918 174907 124011 11192 9784 55983 39983 32887 41037
15514 41037 32808 58633 38751 -6913 15049 58277 62477 69541 65023 62065 9989 -14681 -14075
15501 -14075 -19342 8541 5550 -64147 -151337 -103714 -38288 58326 57648 -21973 -30823 -7089 23513
15488 23513 -6219 19155 79055 92059 52210 -9706 2054 30129 82441 69538 38909 31936
15476 31936 51023 62450 52466 77549 70312 46712 88400 75009 28809 30763 -8394 37834
15464 37834 -23044 -16520 68217 28063 15679 62565 1750 -4157 -2783 -2929 -60783 -126535 -83773
15451 -83773 -36846 -35955 -36517 -55228 -45920 3999 20899 7716 31141 52289 35963 -24733 -55005
15438 -55005 -4234 19358 21416 -28185 -67133 -78336 -56711 -26639 -14639 -23714 3676 19765
15426 19765 50651 41250 -6623 35118 30665 14333 -29914 1774 31440 -3587 -9691 35104
15414 35104 30189 -11140 -49822 -75738 -38205 -46789 -89831 -92778 -70007 -70809 -23628 -44683 -25857
15401 -25857 -13204 60891 99479 95350 60376 41013 32901 30018 46786 66786 28358 3482
15389 3482 -17865 -39896 10630 15089 21048 633 -54435 -104993 -67609 -57325 -65787 21541
15377 21541 16424 42015 42051 37767 49845 56424 42522 24573 12549 7119 -24191 -25311 -40993
15364 -40993 -48993 -46335 -27607 -2315 -37978 -50783 -39349 -25272 -71840 -76645 -23006 -46345
15352 -46345 -55214 -22277 28651 18196 8679 -61222 -64155 -13056 12003 40041 31569 38339 -7908
15339 -7908 8195 11537 126 37988 46774 36555 38975 39463 52926 61759 44996 -34666 -12483
15326 -12483 26462 18336 28887 -18334 -46859 -45057 -97739 -86245 -21576 -13949 -2932 -4866
15314 -4866 -41059 29699 75605 92464 72204 17386 -26882 10084 -39624 -40195 -15397 -9998
15302 -9998 19757 23175 28087 -31585 -53201 -44698 -66006 -29170 58532 53725 16371 -32186 -19396
15289 -19396 -46502 -115650 -100695 -83519 -26627 59764 80721 21536 23673 21535 7048 -36813
15277 -36813 -64924 -31595 -33602 -34639 22483 -16714 -66622 -84171 -72023 -57352 -105877 -105573
15265 -105573 -53503 -13284 -11811 -20596 -13054 -34038 -61442 -111796 -135009 -68157 -53296 -74085
15253 -74085 -86462 -54925 -69746 33988 39201 -6904 -46964 36287 11376 -16651 -18295 43256
15241 43256 86546 -1468 -44588 -65243 843 25120 6131 -8292 2494 32206 38904 16731
15229 16731 -15386 -15753 -10361 17683 14697 -21507 -50239 -19741 -13378 -44339 -54194 -2333 25772
15216 25772 -8969 -61937 -19582 -27026 -64237 -63642 -58172 -29210 -6367 -16078 23279 31272 59283
15203 59283 49801 -359 1846 -13753 -16460 -29790 -55462 -57621 -125227 -167969 -87558 -42309
15191 -42309 -30632 -55469 -31041 11015 19333 -4564 -35304 -61394 -57403 -43951 -26811 54995
15179 54995 46874 -29655 -14109 21632 15283 49995 58156 42741 -3942 12167 30082 18835
15167 18835 -25850 -37323 -76741 -76904 -2715 -1581 -36010 -45564 -51687 -104932 -118636 -86878 -58893
15154 -58893 -20765 25625 28331 40336 30151 67983 89532 177574 240177 263705 251425 248626
15142 248626 217263 250416 228955 166221 140996 131311 116435 151790 138458 118938 133390 142121
15130 142121 103861 92476 117791 122097 79962 16074 16319 32164 63575 97070 59499 54331
15118 54331 49087 52770 32950 53707 -142 -15077 -34493 -16368 3177 -8228 -46013 -79192
15106 -79192 -30170 25270 16130 -53856 -19574 25139 87795 86688 20386 -48033 -39777 -32287
15094 -32287 -38895 -40370 -8338 88406 84648 20208 8245 -5382 -51924 -59019 -43247 -25075
15082 -25075 1681 26041 43313 46100 600 -9974 -9038 -13234 -55429 -81854 -111566 -95530
15070 -95530 -51679 -78552 -21170 3984 7454 61933 54058 -184 -14464 27523 38145 22281
15058 22281 2597 -1288 59756 70498 23333 75802 63959 101787 156484 130400 99488 20190
15046 20190 -45187 -15475 11232 -62041 -109061 -83464 -8070 44707 7946 -3702 -18143 29311
15034 29311 32858 1733 40984 88445 28607 -16443 -40069 -27184 -35395 2224 -32099 -7409
15022 -7409 19306 -14891 -81484 -104033 -140854 -78506 -14051 6425 28364 11491 -9813 -99386
15010 -99386 -148201 -133322 -89261 -69847 -47128 17114 -18240 -23821 -17063 70339 108010 59596
14998 59596 -32251 -15628 -37967 -53715 -65139 -41870 8561 3630 -12027 33697 9513 -24416
14986 -24416 -1863 -10912 -32014 -19910 -37249 -10593 25073 -10478 14649 47673 34608 -42961
14974 -42961 -88980 -78522 -60051 -103456 -104738 -90962 -89758 -57007 -3983 15315 61305 91415
14962 91415 91799 108552 106325 113847 76394 56749 5001 -22333 -22953 9565 -10821 -39413 -53596
14949 -53596 -68454 -31636 17394 -15646 -24735 13621 44796 34684 2248 9743 -9208 -39023
14937 -39023 -35567 -35051 12244 32085 36849 47331 55166 16665 -44256 -81963 -79775 -90969 -82686
14924 -82686 -36979 -12355 -26468 -11189 37077 79919 39642 23625 19562 73125 144223 161262
14912 161262 229416 211860 236576 183216 140808 211911 165851 127311 180222 178726 132084 74038
14900 74038 37834 16205 -46969 10483 40534 54650 20911 -19957 -48472 -67753 -48306 3279
14888 3279 3746 33143 -2792 -33780 6285 -48083 -7037 9083 -35374 -6620 5187 2709
14876 2709 -3226 3402 -20190 -63955 -101545 -122695 -92834 -93921 -84220 1518 -9023 -44097 -37261
14863 -37261 -10668 -63636 -99947 -124152 -55177 -19659 13111 17495 -1098 -60243 -102829 -162777
14851 -162777 -177505 -153781 -124774 -105665 -12885 5808 -44781 -19888 5410 -13968 -25409
14840 -25409 -14880 -35451 -68711 -42209 -52536 -92896 -56226 -25757 -7224 23401 33727 22910
14828 22910 7404 -26427 -26363 23316 65201 21488 849 -20001 19870 41268 98333 107372
14816 107372 44538 -32450 -5492 36606 32442 3062 49780 1892 -76158 -108401 -92629 -120992
14804 -120992 -127652 -97941 -58084 24061 79621 82037 2397 -95799 -95282 -64133 -96337 -49395
14792 -49395 -5363 1142 -32308 22542 63053 89837 75841 62412 106425 46667 -64054 -119006
14780 -119006 -131447 -81485 -6969 28037 43779 44975 -10685 -21224 -16633 -64513 -56809 9642
14768 9642 66736 70007 45779 63866 77098 77073 39222 -14482 17952 21398 -26198 8745 103408
14755 103408 101282 40537 -8941 -35687 -9223 58159 45888 25989 36302 80837 50999 -13780
14743 -13780 -50116 -35906 -54724 -50708 -31973 -29386 -91275 -150051 -169328 -155013 -167301 -113216
14731 -113216 -91724 -61340 -7524 24650 78365 18246 -4596 -14062 -54656 -80691 -38699 -18343
14719 -18343 -99799 -93170 -14489 24522 13147 3425 -21380 -70340 -96221 -75343 -1688 -26517
14707 -26517 -103546 -103568 -143797 -56065 40711 120673 165856 156328 125219 64066 19061 30310
14695 30310 68856 33059 -6228 -34448 -80250 -71115 -39649 -3647 32364 34412 6317 -58307
14683 -58307 -34064 23671 30342 -26771 -83969 -56524 -16119 -34227 -34469 -17119 21667 38134
14671 38134 78502 46157 -13520 -22153 -2322 -7442 5458 13776 8192 -8326 -86881 -59630
14659 -59630 40090 40316 11139 23959 36918 27440 30168 64045 84467 126686 80322 32987
14647 32987 16091 -4339 -10541 -76551 -70008 -48716 -46275 -49552 1364 -36496 -25477 14669
14635 14669 36537 -3991 -35971 -35179 -7684 -11193 22183 -13393 -17886 6441 -11028 -18577 -30392
14622 -30392 -34009 -48042 -42862 -40659 -61690 -45692 -8170 3646 -45502 -60457 -69291 -42595
14610 -42595 -54965 -84664 -63578 -6661 -1074 24104 64993 65693 113729 172453 155263 140857
14598 140857 65132 35929 73161 17375 31773 24843 -13038 -27933 -99641 -129223 -41776 6947
14586 6947 -6587 -3673 73112 79496 39195 11457 -27448 -41594 -25700 -2291 60731 59420
14574 59420 8456 16600 62448 44822 47192 67552 83247 107626 45207 -17321 -11049 11291
14562 11291 51866 51623 68534 55229 4612 9632 37730 68764 65564 28015 1370 -45619
14550 -45619 -31503 -7216 36464 102431 99133 43877 46637 -12320 -47306 -28792 4914 30616
14538 30616 32244 10325 -17953 -16538 -25309 -49732 -64489 -46280 -45138 -75922 -4674 85804
14526 85804 51464 -660 9821 20307 12737 45318 36104 52292 80514 106619 82020 15832
14514 15832 -14553 -16955 8058 -8300 -32637 -22456 -52397 -30890 -2329 26164 39036 -5814
14502 -5814 -46213 -26540 63806 66205 51465 60341 43837 47927 85848 117571 103891 63858
14490 63858 21565 -11709 -12422 12346 52937 47196 79869 147295 182135 200678 150528 99481
14478 99481 69150 3523 -75278 -101160 -103680 -101658 -169487 -128853 -132746 -99605 -99007 -32708 -80
14465 -80 -18667 -216 -37260 -111280 -100243 -93748 -80663 1397 26055 63141 -7351 -34500
14453 -34500 -23396 1471 -1775 19431 22425 35196 23410 45946 -6258 -36972 -3258 24067
14441 24067 54860 45460 78695 66684 80683 65811 28439 30380 27941 59325 87205 37799
14429 37799 -656 -34499 -28875 -36763 -59359 -55250 -29889 -6825 -14941 -62738 -60768 204 -32977
14416 -32977 -81182 -88146 -29902 19742 -6833 -74030 -58417 -33929 -12138 -51583 -68748 -68000
14404 -68000 -51275 -47727 32481 16863 12256 15970 236 -7673 -29254 -61124 -119250 -180826
14392 -180826 -162452 -112550 -46022 -8188 -4867 52822 86201 32144 5067 -9997 -16856 -12012
14380 -12012 -3162 -20379 -94218 -95758 -39740 -27793 15994 44936 2265 -69214 -112835 -81259
14368 -81259 -42877 -20531 -67761 -117136 -112323 -95376 -88653 -95267 -69565 -25619 -58665 -65510
14356 -65510 -10448 10935 -2712 -11039 5025 -11823 -37179 -1268 5177 -13487 -9707 7882
14344 7882 17689 17538 -12197 -35878 -41938 -22934 -37698 -17682 17246 33952 35356 -6606 -16562
14331 -16562 -16496 18772 57807 10172 -33442 -12574 42749 -11726 -113129 -177275 -104046 -35878
14319 -35878 -292 -6029 -39135 -40478 1403 -14248 3551 53505 26555 -15649 -53953 -51066
14307 -51066 -30800 -33114 -59653 -36836 -9530 53189 45808 16668 -45897 -82376 -90655 -154198
14295 -154198 -106336 -30892 13423 13661 11656 45168 29940 -7466 -22546 15004 46073 51839
14283 51839 12669 -21075 -29153 42296 133930 64669 -9164 -7725 63804 43359 -17030 13180
14271 13180 13009 -45088 -44913 7060 49313 24884 48416 80975 100442 107984 62984 53838 13652
14258 13652 -57914 -74519 -81610 -85197 -76462 -28296 -6593 2491 -36130 -84119 -86660 -109625 -164637
14245 -164637 -159667 -132867 -95381 -65736 -34030 153 61567 85473 112246 129007 46827 13614
14233 13614 -13490 -30563 -25482 -13220 33541 15995 26326 51958 46281 18129 9499 25701
14221 25701 51251 75228 92201 75943 48109 30249 -28558 -42351 -11955 31308 53719 60720
14209 60720 38189 76969 140183 130630 84412 107189 115843 139155 111077 84339 82079 35730
14197 35730 -39229 -40374 -17919 4125 82108 108128 140510 186853 184617 113728 76675 85383
14185 85383 44078 -23339 -32453 -84983 -104338 -87629 -26632 -23116 -5585 -3378 1930 -11509
14173 -11509 -6354 -47501 -30671 9171 -7289 -10262 -15600 25565 66378 99799 134930 116531
14161 116531 44961 19868 -5575 -46659 -80321 -18233 16949 -5613 -42975 -114033 -106410 -21421
14149 -21421 -153 3075 32721 36841 57019 34884 49905 59492 95475 66841 89343 58856
14137 58856 67963 27563 -15250 -4017 -12530 -37538 -32546 -21057 -42275 -63633 -2914 38407
14125 38407 42751 41432 11234 -17531 -51334 -46749 -70494 -10960 65009 61681 65378 23717 27822
14112 27822 81216 49135 -7887 -18871 -70397 -68003 -22721 32507 1046 -21495 -16742 38484
14100 38484 27441 -21771 29676 36802 7602 -19947 -52677 -33038 -22792 -42258 19576 56705
14088 56705 91685 150484 89230 21361 -14716 23426 35173 -7950 -44981 -90513 -46244 -41431
14076 -41431 -50528 -4060 38816 60816 67855 103928 107829 72220 94098 78843 78185 83616 45714
14063 45714 52604 25231 48556 70437 33116 -27935 3337 -36775 -13095 -14482 -71092 -63762
14051 -63762 -79406 -117444 -87203 -90411 -82948 -47253 -8866 -46586 -92448 -71379 -10348 -38143
14039 -38143 -50482 -64854 -48116 -86522 -77198 -17289 7844 40007 40515 -230 26780 30286
14027 30286 25803 -5216 26391 70281 10568 -51290 -28163 -70856 -69120 -61279 -52661 -51395 -9076
14014 -9076 16152 -34843 -90204 -90542 -60681 -9053 -22446 -60564 -54563 -58709 -83157 -99045 -96413
14001 -96413 -101997 -96209 -104939 -85776 -6708 9480 2234 -24676 21366 84522 59087 73652
13989 73652 97631 13743 -46915 -111577 -37969 13043 43565 94250 88479 53122 59061 83349
13977 83349 15697 14151 64611 101870 109044 76831 72881 62597 14107 -43049 -23626 15712
13965 15712 6692 13107 37084 13040 -18207 -9393 8174 -17210 -37508 -55278 -38034 -15807
13953 -15807 11351 4873 -46059 -45145 -54490 -26494 12828 24590 20260 33015 63694 55634 23546
13940 23546 20313 -22675 -26806 -3672 29194 7955 -39785 -1917 64989 21445 -4790 -49786
13928 -49786 -45702 -52098 -77450 -48363 17129 13628 -26228 -3847 -76366 -108111 -139297 -162013
13916 -162013 -122690 -80657 -58720 -45411 -52069 177 3919 -49813 -104070 -114630 -86239 -65775
13904 -65775 -97194 -102810 -81850 -69140 -86240 -120399 -98501 -47674 40037 77455 56851 28124
13892 28124 36097 -4622 -17926 25465 22022 -33917 -69662 -69007 -17945 5879 -25203 -46330
13880 -46330 -64574 -49829 17867 29524 -6251 -49148 -19136 16099 56168 54855 -11239 -27766
13868 -27766 -54094 -69987 -26606 -38008 -11568 -22876 -35154 -71317 -38536 -18066 -49147 -78517
13856 -78517 -18888 4021 -55579 -73389 11058 30556 -11134 -5760 92974 99887 99663 42118
13844 42118 -36498 -60045 -67711 -22320 -92468 -145103 -87744 5640 68976 111036 161533 133168
13832 133168 67047 11723 -50418 -49933 34613 95589 55937 3963 -27380 -79319 -92858 -61007
13820 -61007 29961 97801 32573 10098 53812 -3513 -17325 1249 -2550 -8087 22421 63474
13808 63474 58567 45287 504 -14755 32531 42897 66464 50014 23758 -1586 -27731 -2310
13796 -2310 -48023 -33085 -29919 -30372 19827 52350 -14133 -9750 -18256 17088 26041 23831 -13605
13783 -13605 -3306 -30142 -71184 -91289 -135334 -64197 52193 27423 -34827 -52340 -29820
13772 -29820 -75300 -106908 -115370 -81473 -96185 -66442 -38671 -64960 -61974 -91560 -60144 -66442
13760 -66442 -94173 -77425 -72668 -73991 -61756 -2911 9872 14876 -39105 -93856 -52326 -64926
13748 -64926 -105359 -88153 -54282 -13095 -23232 -43370 -89711 -106111 -129408 -140010 -90751 -59999
13736 -59999 -58085 -28220 -50532 -72547 -78773 -82983 -41259 -48443 -34402 -28498 -86914 -95650 -72444
13723 -72444 -35836 14277 -23268 -26533 -18257 -49066 -86163 -96538 -87944 -88800 -110918 -91764 -30093
13710 -30093 15952 32216 3042 -19654 -15633 4778 39851 86744 68162 58605 18342 -57935
13698 -57935 -86278 -47799 -14515 -27825 1788 23863 15439 -48924 -78609 -88457 -104262 -114680
13686 -114680 -80463 -92089 -157008 -132330 -55650 2643 5076 5102 34524 32873 11949 98123
13674 98123 114846 44390 -44101 -41515 -74721 -81407 -52074 -42628 -26038 8354 35677 27782
13662 27782 22364 30511 27510 1570 4955 -36741 -34844 -44352 -50103 -41522 -35609 -59596 -96707
13649 -96707 -74023 -45448 -47188 -45427 -54606 -95735 -30970 -4891 4918 26240 69432 73857 -10848
13636 -10848 -29936 -55464 -140499 -153909 -108016 -102029 -50657 4820 -35856 -33005 1649 25120
13624 25120 76594 76950 23536 23842 18387 -27570 -53979 -59584 -6914 -26925 -28538 4422 44947
13611 44947 24674 -8457 -6407 -86430 -92427 -41357 -271 -20436 -31543 -51292 -34534 -40117
13599 -40117 -53770 -52741 -59604 -68644 -101333 -128262 -145794 -126140 -113170 -75637 -49063 -46700
13587 -46700 -55351 -17974 -29681 -60119 -44382 26371 5482 -42162 -37559 -97938 -97998 -54745 -68349
13574 -68349 -127638 -118802 -57053 -21038 23277 48661 14177 -56223 -27741 -12176 -3946 -64584
13562 -64584 -55982 -34186 39858 90635 22319 -39481 -69989 -68404 -27263 -54524 -54971 -30287
13550 -30287 -2622 4053 12087 35441 18341 45906 102321 97508 57315 13140 17807 4376
13538 4376 50728 26498 10708 72129 66423 -17133 -47382 -74811 -99761 -61800 -17660 2977
13526 2977 -18251 -40373 -95293 -119937 -83627 -91697 -56636 -34332 -28310 -49719 -85447 -52561
13514 -52561 13461 14301 32206 15169 69766 110955 85783 66752 60525 21329 -51141 -68897
13502 -68897 -4997 22942 57622 54861 45929 -5356 -29947 5840 19503 -11688 -26522 19169
13490 19169 13337 -349 3118 -51418 -106935 -166270 -138023 -68363 -35938 -69362 -112253 -129871
13478 -129871 -148786 -117194 -134596 -96357 -56774 -32768 -28539 -65599 -76935 -70908 -33315 -59716
13466 -59716 -86723 -53586 -74595 -54744 -30717 -40034 -43075 -39825 -30071 -48884 -44127 -45918 -20650
13453 -20650 -25364 -3141 7429 17533 26711 55220 41675 59482 49402 46272 8277 -2485
13441 -2485 29928 90541 129505 84199 46251 2140 -119317 -98301 29058 102282 55236
13430 55236 13433 78780 73780 5121 -28420 14890 106484 138587 86912 75960 74654 49221
13418 49221 25518 35802 -8853 -15230 -662 -24192 152 27350 -1499 -84302 -81611 -43437
13406 -43437 -26021 -450 9355 4348 -70448 -85564 -113102 -122836 -67431 -35198 30240 4736
13394 4736 -5705 -4460 -7149 -22933 1634 85013 91178 42477 41183 -11547 30916 46460 73870
13381 73870 42896 36763 15225 -46891 -5429 -8445 -22553 -14499 1609 51730 20961 16281
13369 16281 28080 40592 54667 26376 -30816 -34160 17678 1482 -48544 -46968 -29908 -4121
13357 -4121 34004 26165 100680 124978 40004 14553 15154 53242 126890 127219 106390 15153 -16570
13344 -16570 63304 83594 33852 2182 -16111 -10901 14285 -24196 -65546 7006 41369 128396
13332 128396 98787 17956 -29792 -49370 -60829 -67301 -14122 -2336 -16083 -82098 -97553 -123416
13320 -123416 -85227 -29817 -21227 -42582 -15040 23149 40446 20893 53968 98887 154885 27931
13308 27931 -9449 15751 -10882 -18609 4651 -21460 10198 30940 -46183 -73354 -66216 -74653
13296 -74653 -31214 -43292 -33584 8278 21076 8338 15508 51252 39578 7002 -24639 -1343
13284 -1343 11583 15267 16393 8531 -59271 -70394 -8834 24077 -12400 -34164 -31401 -10755 28340
13271 28340 85915 43648 22406 30034 54981 46958 20176 69011 79755 42566 34823 22448
13259 22448 46207 70760 63335 64081 -32287 -28210 44353 70808 115670 80018 42988 41970 40259
13246 40259 6228 -32374 -4976 88284 61741 1834 -52368 -43614 -80209 -127238 -117756 -77401
13234 -77401 -16336 51922 5941 -5542 24406 67528 45419 21890 -49512 -41112 -76163 -71579
13222 -71579 -49403 -49374 18993 39520 17600 -8081 -19127 -19549 -2526 -5467 4836 4387 -12035
13209 -12035 -5026 41270 48458 1888 -25431 37284 82720 6081 -88966 -58488 -95927 -117201
13197 -117201 -92988 -17146 10989 14621 23506 43121 81957 23176 -16559 -27040 -43731 -132164
13185 -132164 -185848 -179748 -81814 -15021 10538 -26798 -80772 -98962 -35999 32330 95275 86720
13173 86720 31361 18147 -4905 -9463 4243 -47721 -86684 -46194 15293 12987 3444 -5386
13161 -5386 12015 39552 -1473 -21728 -10984 -50664 -32070 -14939 -2064 33519 15834 -19042
13149 -19042 11721 -20287 5392 76935 71124 17913 31312 19473 -33837 -43417 5512 58412
13137 58412 46494 -5737 -7403 27861 34262 33803 -2564 -32894 -94830 -79809 -13577 26865
13125 26865 65630 57482 30406 11670 -25333 -38853 -72536 -29075 21514 10490 -28654 -81911
13113 -81911 -37763 -100701 -135037 -77584 28 29936 37777 55655 75120 90925 31392 25066
13101 25066 63503 97964 89168 65699 49507 2246 -15273 46399 32166 -8829 13416 10797
13089 10797 13636 -3019 45547 51318 -16729 -159542 -154496 -107885 -75874 -47732 -77766 -80144
13077 -80144 -74476 -73834 -45011 -27837 -52067 -39802 22939 -14042 -81707 -144011 -141204 -99882
13065 -99882 -105306 -75349 -55019 -59708 -104750 -66612 172 35943 -12095 -39550 -52428 -71319
13053 -71319 -20134 -26770 2279 25381 39607 -13 -38380 -60181 -62185 20233 82110 47660
13041 47660 19946 9844 -7794 -14529 17289 7049 -13896 2923 -27299 -90093 -74806 -31424
13029 -31424 -52366 -36688 24179 93843 131878 127406 77525 -52300 -76378 -55041 -19880 31293
13017 31293 55588 26174 -5199 -9776 -42434 -35292 -23040 -88280 -123261 -122101 -87803 -30580
13005 -30580 -39122 -114655 -103471 -56881 -24871 -16775 -8978 15248 45913 36144 35318 30210 24455
12992 24455 10462 37026 16877 55680 29138 -435 -2868 -13793 5259 14171 5809 -50187
12980 -50187 -7181 23797 13969 -11716 -16636 22850 36257 25585 24994 65299 130452 145755
12968 145755 97910 29574 -11664 -21658 238 29112 -4044 -32296 5020 -10453 -27812 -73622
12956 -73622 -76563 -32876 -42019 -72615 -24352 885 -17101 43944 28724 5841 32421 4583
12944 4583 -52370 -36770 5900 -1427 -4929 12431 15683 2235 -46624 -32903 -27787 -21960 -27744
12931 -27744 -6002 -21829 -50572 -8534 -1012 -36235 -19119 9745 17108 18036 -4035 19417
12919 19417 -11809 -55165 -76116 -19637 10005 13452 -74253 -106312 -73147 13208 82185 63081
12907 63081 55608 60426 28505 18535 5858 -21575 -10032 -13724 -47624 -95900 -42734 -47365 -78291
12894 -78291 -75920 -20510 29813 34528 -28381 -56175 -51328 -89755 -101097 -62462 -57225 -46079
12882 -46079 -35550 -52854 -55009 -34716 -18192 21358 17448 -11885 -61588 -90107 -20726 -1782
12870 -1782 -55622 -72652 -69879 -104522 -55362 -2439 23509 46374 39650 23438 43788 46614
12858 46614 38289 23066 51482 89184 82649 33833 -31433 17686 83284 80276 67958 46550
12846 46550 58319 76233 45460 42555 14651 22022 37275 76086 43387 -36250 -57642 -52814
12834 -52814 64799 141233 83745 18923 4278 -36413 -64668 -18540 18765 4215 -33330
12823 -33330 -30250 -7137 46208 37133 365 1526 4497 -13338 -34828 -51591 -88791 -62945
12811 -62945 -2497 32540 15095 32617 45181 18362 -50526 -19488 -11165 8277 -49450 -82129
12799 -82129 -30346 -20070 -5821 5007 -31892 -10614 -12232 -58390 -83555 -101661 -23366 32933
12787 32933 -28891 -13593 27020 38243 9699 19368 12097 26752 45180 103326 110674 119710
12775 119710 34504 4505 -28313 18610 50259 35159 65766 69102 98373 131813 105983 43243
12763 43243 -22553 -6425 53027 77271 82992 55197 31097 86383 116219 137773 134914 111406
12751 111406 206868 292573 391617 383332 353538 358616 423711 488451 607438 807940 1078927
12740 1078927 1521783 2303476 3508691 4988423 6446945 7498700 7426040 6101550 4241027
12731 4241027 2885509 2087728 1666123 1483571 1298947 1181359 1025252 922599 903564
12722 903564 823395 824389 787105 798134 770140 647097 514454 464268 459028 456128 497215 559113
12710 559113 553287 546262 474683 420409 392577 393511 325308 294856 258813 277101 321860 333717
12698 333717 291195 211759 188467 216539 206163 185214 151716 159781 205165 263174 299313 292827
12686 292827 312656 329528 312426 326731 320695 334765 484372 625614 689207 680177 531895
12675 531895 427624 391120 305653 245753 230416 216240 183605 137447 111597 108962 102573 153595
12663 153595 169207 150072 165804 158343 155410 170786 116287 57730 42985 49451 29281 53606
12651 53606 107865 118076 100978 104088 106291 85865 43902 -37583 20418 84743 84914 56386
12639 56386 56614 12176 23315 18060 63593 103522 103328 123582 176797 189390 190751 194958 187823
12626 187823 119204 72829 64209 98631 57752 11733 -933 88892 155392 51158 -4422
12615 -4422 13953 -24589 -19615 16821 27668 43901 73019 99936 115071 114039 85824 79830
12603 79830 60449 79862 29733 40471 75577 35316 23801 41288 60478 30921 10278 42097
12591 42097 49552 9713 -12282 -36864 -56020 -41521 29466 27546 -15956 24130 21100 -21501
12579 -21501 21029 54805 63183 61764 -13678 -3409 54242 50004 -7480 -28486 -40498 -24854
12567 -24854 -48977 -63185 -86872 -41702 -55 -27193 5198 31735 37448 30271 14028 -9899
12555 -9899 -1070 39608 81640 79097 -8245 10568 27792 50120 71339 65618 20436 -31693
12543 -31693 -14206 69417 60115 54942 102418 80465 28544 -8326 -51314 -15047 15134 -43059
12531 -43059 9876 25985 -30942 -39661 -56085 -60672 -31362 -11494 -25963 -45830 -90818 -93391
12519 -93391 -61429 -50233 -34059 -46450 -66174 -7231 -7612 29789 26968 6431 55999 86148
12507 86148 117309 105508 27778 1513 22642 -4771 -10225 -47608 -52732 -52386 -34513 -10015
12495 -10015 -17759 -39988 6946 -5378 -70760 -15940 -14488 -15742 -61391 -109440 -110140 -61764 -58651
12482 -58651 -72941 -34729 -9525 13736 55980 104486 82615 21081 17766 -7741 -26619 -22340
12470 -22340 27215 1731 51225 68238 83034 66927 46607 -27403 -56105 -61986 -67840 -25380
12458 -25380 -26353 -61322 -63553 -61994 -87743 -58255 -34207 -39749 -36732 -35233 -43664 -46919 -25062
12445 -25062 -26969 12805 56075 39989 -12680 -58330 -54578 -21382 45663 60071 38418 -48963
12433 -48963 -58169 -43277 17102 32702 -14881 15703 -20008 -57016 -17844 11475 37691 54860
12421 54860 75021 100380 95761 94423 59069 77619 108455 79022 -2041 -19137 10930 -10347
12409 -10347 26839 14563 29573 27053 30933 -47914 -31903 -4235 -35395 -65778 -68993 -10979
12397 -10979 20453 46754 -24835 -26031 -7781 43527 20824 73018 68312 56965 20078 5079
12385 5079 -12606 -21423 -47580 -55250 -38236 -21076 -43368 -43155 -44197 -42339 -7532 -11459 -58677
12372 -58677 -34092 44848 85915 72633 78477 63166 7563 -1385 48786 43040 20466 18644
12360 18644 -13867 -21984 20300 22475 -17360 -25280 -6314 30636 101052 120388 77770 26327
12348 26327 34074 20093 -55290 -82420 -6140 -8621 -52443 -28585 -4193 25990 -2985 -55244
12336 -55244 -60631 -31829 -52508 -99208 -98778 -44486 -25604 -2322 9268 33861 6609 41997
12324 41997 31790 2638 -20926 -27131 8701 19783 40099 -2056 -27205 -12393 -6412 -74734
12312 -74734 -14991 20735 44230 56521 33319 -7 -27287 -20622 -76550 -106711 -117477 -69226
12300 -69226 -40522 -53261 -58468 -87351 -65203 -60144 -34624 52860 77078 38386 3549 15277
12288 15277 -1114 -39081 -82941 -86376 -25083 36117 64153 24958 221 -9829 24783 49568
12276 49568 41452 51033 65718 2445 34522 -5364 15770 50382 43571 25504 15133 42007
12264 42007 83826 39482 34154 33663 19461 -850 24117 3664 38289 24404 944 19793
12252 19793 360 6267 18202 19615 -3858 7580 -2194 -73890 -140779 -145122 -76152 6049
12240 6049 45706 17752 -15435 -31968 -71850 -79733 -46076 8165 1282 -44443 11300 -43511
12228 -43511 -91921 -51150 -48159 -64949 -83960 -67506 -83611 -27246 -6233 35295 65976 55142
12216 55142 -11605 -8031 -43211 -40685 -2840 42431 56050 28297 26465 42513 39581 90098
12204 90098 51378 24029 12237 22897 44316 66062 11244 2961 42818 8471 21284 51870
12192 51870 44863 12145 -30694 -40582 -12992 -47440 -75975 -34621 -46844 -78718 -61106 -13189
12180 -13189 -14487 -42733 -57017 -60630 21259 19589 32436 8304 -45092 -68709 -52903 -77604
12168 -77604 12679 56590 20666 17078 15142 58563 147579 205050 150572 117630 34589 -7029
12156 -7029 12240 89088 67870 58909 82669 86610 24262 2319 15505 51985 101366 5202
12144 5202 16300 9 -56278 -38225 8397 10650 7492 23853 -26247 -61681 -87574 -87224 -131001
12131 -131001 -110031 -100010 -87179 -53967 -39340 16619 12256 22799 43334 7378 -5748 -2325
12119 -2325 -33244 -48233 -19899 -2746 -21985 13740 20301 -25125 -75006 -74937 -51317 -52256 -70588
12106 -70588 -43913 -17498 27001 47123 59880 34904 18249 13885 8564 26740 16504 -11494
12094 -11494 -18425 -36740 -66433 -54978 -42216 -92808 -129816 -96550 -53729 22873 57264 44517
12082 44517 44760 10898 1550 -2193 -11450 24350 51327 55643 21491 23064 65354 116506 89708
12069 89708 31549 12507 9475 12164 -4350 -17374 5461 1451 -31789 -110203 -115580 -62255
12057 -62255 -13264 34768 35751 -14694 39121 30729 95745 86246 57056 50626 78951 89822 111073
12044 111073 199539 244771 321833 389378 398409 287305 191451 184134 192321 133665 119685 74792
12032 74792 36149 2038 20811 67518 47442 35311 4511 -28217 -133681 -121366 -61944
12021 -61944 -32875 78438 157432 170529 75876 63339 47322 18567 52640 80222 161152
12010 161152 132884 119293 129112 33936 -51698 -25739 -123 31744 45942 18121 8131 -36944
11998 -36944 -101637 -83629 -92244 -103565 -54912 -32937 -29883 12706 69337 63999 -6835 -11998
11986 -11998 -4300 -31731 7776 38682 68074 45415 28985 48225 75945 61801 107033 98691
11974 98691 105055 117154 75813 104732 81237 66989 112822 102791 57468 31193 27190 -6858
11962 -6858 -17326 -16792 -22060 30133 43772 18312 -3596 -29013 -32728 -32862 -15188 -18552 -29125
11949 -29125 -19412 -54421 -55339 -44121 -72379 -138903 -135657 -79906 -65967 -107548 -118969 -77165
11937 -77165 -38271 16558 14198 44279 31073 51421 74962 66117 69573 45468 -26369 -64565
11925 -64565 -56749 -16927 20967 93940 89368 -825 74068 123105 105026 52827 37978 52009
11913 52009 51239 14022 46724 67900 27133 -17929 38257 91688 43465 39878 89336 127167
11901 127167 177207 214422 291465 304338 291829 374875 390125 329530 272267 232281 194272
11890 194272 170950 151843 174355 133310 105548 91217 111265 116031 93142 99050 142650 144286
11878 144286 135867 122648 108328 84828 36227 26594 63648 106181 53016 -10335 11479 78674
11866 78674 82879 47833 59421 81776 35537 19318 -39446 -47279 16198 48872 98274 119910
11854 119910 88293 3088 -28240 11008 15136 -18047 -29194 -8762 -7794 -36068 -1678 65492
11842 65492 77407 68926 41926 15724 28642 24291 -29440 -25247 23135 39147 67549 86703
11830 86703 29082 39 111258 138624 77689 53214 76377 73754 76610 66813 49836 37028
11818 37028 61020 65457 69222 97719 92160 117191 124351 71177 60724 52766 75631 64450 75756
11805 75756 102056 88976 51521 57314 52962 10696 -21086 1556 20493 22663 44365 -25641
11793 -25641 -27008 -8211 8260 12166 10500 12502 16322 64143 82383 49337 9193 52445 57586
11780 57586 -14440 -63450 -78280 -18430 -16811 9828 14695 47353 65436 -18375 -2943 43340
11768 43340 111830 169519 204552 242797 236670 257562 267857 245806 263498 261242 262197 281690
11756 281690 247161 124467 123215 142750 144290 149679 152771 145666 180112 199979 125453 68395
11744 68395 70222 34150 73555 117292 147029 148552 139185 157376 102934 61373 108849 145286
11732 145286 107199 117026 141847 164144 191979 254643 193823 151590 185839 154542 104088 102355
11720 102355 131282 159583 187638 180300 120741 145709 142790 136057 153951 229492 193133 206781
11708 206781 266875 326426 270628 200093 196337 163788 173647 182263 114969 50456 41178 70311
11696 70311 148256 219810 213386 203600 217896 197178 142247 150025 206177 187616 185414 197543
11684 197543 158714 139438 187117 249543 192956 122891 120628 165920 132579 83945 75276 119381
11672 119381 134622 163326 159025 112035 86143 98922 97602 92704 121984 224834 266142 319995
11660 319995 342010 286496 286796 260808 243533 271593 327806 382512 427725 433454 397184 389707
11648 389707 364019 335742 340860 382390 449830 533153 620505 637545 604884 628355 668218 753770
11636 753770 822999 884075 923029 922877 999699 1168404 1178763 1199356 1326470 1435171 1537740
11625 1537740 1679479 1836786 2034056 2311705 2630471 2959558 3356024 3874731 4392879
11616 4392879 4975102 5719796 6546634 7561122 8935774 10739882 13246574 16718631 21630913
11607 21630913 28649559 38027822 49158524 60283784 68734259 71731316 67645114 58060801
11599 58060801 47091975 37856162 31115162 26283233 22811612 20186983 18079086 16310829
11591 16310829 14737725 13409886 12361182 11423470 10558401 9771374 9131855 8508946 8018912
11582 8018912 7578510 7186649 6862317 6597043 6309002 5993360 5706753 5453731 5310766
11573 5310766 5159589 5000613 4842555 4657643 4458921 4316651 4148939 3972268 3862839
11564 3862839 3816045 3722265 3580521 3465635 3362819 3235438 3133717 3039848 2975757 2870328
11554 2870328 2767536 2655779 2623791 2603109 2522549 2462262 2402039 2389606 2332503 2291917 2264082
11543 2264082 2239904 2221483 2160994 2106126 2078453 2065808 1991869 1922247 1831530 1799377 1754260
11532 1754260 1706262 1695477 1688960 1704836 1706435 1698263 1637807 1597831 1555653 1524360 1539678 1491816
11520 1491816 1481560 1486190 1431470 1420873 1463766 1491952 1484491 1467913 1477389 1459432 1480360 1457872
11508 1457872 1521883 1640755 1703039 1757100 1759841 1672985 1613174 1598606 1571563 1539776 1492990
11497 1492990 1526537 1545737 1523325 1576796 1641575 1713045 1722860 1733777 1730714 1766286 1812314 1900576
11485 1900576 2041140 2088798 2152968 2234034 2284214 2371321 2497233 2633783 2776930 2990867
11475 2990867 3235523 3493521 3775769 4175440 4701976 5310644 6024471 6893681 7985567
11466 7985567 9321419 10863814 12775393 15389337 19090196 24377438 31750344 41360898
11458 41360898 52426329 62985893 70186913 71355125 65470474 54979188 44003144
11451 44003144 35207585 28915267 24455098 21220836 18798435 16805179 15109821 13599661
11443 13599661 12302388 11157933 10238067 9488892 8784945 8162182 7641808 7247307 6830963
11434 6830963 6446071 6180552 5923606 5593881 5317814 5084137 4923580 4756108 4610597
11425 4610597 4362828 4188693 4081834 3958298 3801827 3688168 3596720 3499331 3403146 3270632
11415 3270632 3119623 2971995 2853255 2769263 2720171 2642829 2564217 2514195 2477226 2446104 2370832
11404 2370832 2273417 2157072 2099381 2027535 1958809 1947743 1909138 1790765 1753705 1730771 1690254
11393 1690254 1639249 1601793 1534891 1533711 1523710 1528742 1489672 1414977 1300999 1278130 1187172
11382 1187172 1146634 1190082 1253695 1209418 1114626 1090450 1103725 1102254 1077223 1089988 1032989
11371 1032989 934618 899023 900265 855838 800420 779054 777623 752821 715669 673744 680143 693392
11359 693392 689257 675684 682651 646238 619844 577646 546722 588723 590281 550211 552642 546608
11347 546608 545507 558246 567340 538331 503580 468684 410482 412614 446976 440326 375522 394630
11335 394630 446779 414853 401106 423504 370987 300314 313914 307328 288012 326766 323006 286014
11323 286014 279595 243976 235494 223662 227662 207850 153572 155650 99400 77837 105450 40344
11311 40344 -6921 -5357 42078 29677 11852 61790 62730 125460 150797 138505 147872 52733
11299 52733 80324 159012 162829 203371 300169 376372 369330 390237 378932 374492 317642 260767
11287 260767 147771 117832 153636 163366 120826 127029 111902 124713 45028 38318 109106 126059
11275 126059 165622 200542 100633 74787 82591 101266 87370 83419 90227 74738 40390 21462
11263 21462 69399 85844 124800 137839 104488 52766 44310 43885 46946 20745 22287 38014 66483
11250 66483 42426 25274 35364 -57460 -84789 -39607 18117 -14051 -20226 21679 63444 104215
11238 104215 114043 39827 50752 93377 142787 91462 -2227 11042 26655 -7098 43207 52263
11226 52263 31352 27462 54760 16399 -14723 24539 97444 62057 43846 37627 5595 16182
11214 16182 64564 89118 21286 54603 35705 -13156 -31920 -14340 12044 -13757 -30446 -109973
11202 -109973 -117170 -54138 -55309 -51931 -33706 11478 37295 99223 164825 148224 140388 143731
11190 143731 132196 109576 52626 31291 -25066 -7906 65134 107854 110587 92083 146262 184704
11178 184704 185810 246153 291920 276540 274837 278066 236719 96574 77490 100153 159939 112580
11166 112580 97847 135203 140775 151060 179797 220670 272196 321303 395013 383624 365969 413817
11154 413817 394937 324964 265474 273817 220589 152790 109725 83278 81431 73661 53872 50843
11142 50843 13462 -4770 34216 109474 86326 -3053 -20964 11636 63231 38293 -4850 23664
11130 23664 44013 -8812 1104 10343 -35 -19760 -24012 31633 81341 82780 92080 73459 -29815
11117 -29815 -32365 -8616 -16746 -38819 -37933 -25927 4575 -56902 -69773 -6306 49915 71233
11105 71233 9064 13722 -7426 4512 2989 16386 35740 69315 70510 71414 32661 70130 82215
11092 82215 77872 24055 -39039 -60984 -8982 -1794 20223 9855 28898 46611 27925 19060
11080 19060 -42242 -56321 -33906 -23450 -8602 23105 44677 48380 57166 3108 -11401 -16991
11068 -16991 -55409 -69872 289 52475 28254 6156 -8546 -6435 -6356 -17842 -36099 -29952 6596
11055 6596 19920 36753 40780 18005 -4186 -26743 11945 95100 126194 99344 22302 -36633
11043 -36633 -38799 2558 47340 93226 94073 67365 61644 74479 99173 87567 95757 78363 125572
11030 125572 219090 205320 158999 147113 153924 165314 178591 179424 161858 182651 185239 138201
11018 138201 140267 146724 158378 241477 306622 306343 279286 358429 430353 463061 463672 437895 386657
11005 386657 309380 290433 286353 240235 232811 230233 223272 227317 270897 233204 179626 162706
10993 162706 204305 270908 300723 223610 156988 134905 89927 95088 177505 247712 278441 234805
10981 234805 178683 180135 179036 208830 214519 166316 109674 121319 121126 82194 57528 96786
10969 96786 140625 144331 107730 126354 146789 120274 102289 142100 104264 80721 49990 58701
10957 58701 107207 131997 129700 106318 69433 78032 76915 54447 44969 54213 71332 89851 108533
10944 108533 94769 71198 63510 60374 35926 22702 36084 60276 103234 47283 7720 32272
10932 32272 58830 54344 78541 48374 48375 79981 57552 37005 -13005 -50397 -22039 8812 -3103
10919 -3103 -36539 -26072 -18639 32699 9405 28182 31287 54340 41534 -4922 -51101 14430
10907 14430 46975 45433 39383 45827 60447 85482 104221 105130 119543 72935 91850 105266 62496
10894 62496 -32233 -50768 -14843 4561 17945 -770 15271 -19851 -9902 38429 -4667 -3822
10882 -3822 -3417 -28032 -38113 -12723 -5364 32005 61203 80068 101572 89934 58426 21021
10870 21021 35703 22952 7460 -34665 -53726 -32295 37745 37558 21766 12611 -13006 -2761
10858 -2761 16719 34884 11190 -1543 7366 2732 47205 122887 75733 -39499 -78454 -102478
10846 -102478 -84366 -31624 58618 13654 -1567 36498 66102 85291 33400 -37110 -3272
10835 -3272 -85757 -147664 -125532 -67049 -18559 -40269 -29139 -6813 -34674 -86713 -116780 -112010
10823 -112010 -69732 -51809 -19266 -208 6356 6205 25777 42195 79398 136659 114357 79050
10811 79050 55567 -3003 -31329 -68311 -54667 -25403 -13006 20424 5422 -1364 1143 -22853
10799 -22853 -105982 -121301 -113879 -61084 -40084 -64809 -75591 -28614 -1655 25091 43327 36321
10787 36321 26918 9371 24998 79636 84166 50895 6189 -4588 -44394 -52480 -10009 -433
10775 -433 -4222 33009 28337 -15096 -60649 -74121 -59523 -55651 -35718 -15931 15506 -9524 -4356
10762 -4356 26667 -11602 -76279 -50648 52907 146817 130364 119846 107544 81609 43752 24479
10750 24479 -34492 -36782 -24521 -5033 4124 -28003 -78775 -54662 -28362 1221 -24815 -71022
10738 -71022 -72793 -84229 -49344 7765 33268 -14194 -15626 1386 52988 40019 -36510 -52429
10726 -52429 -12620 973 44592 75429 27205 -3406 15656 26985 -23149 -45124 -31670 -63066
10714 -63066 -54847 -38874 -116215 -113985 -91570 -123506 -140644 -73457 -16222 -22087 40648 43831
10702 43831 46898 55262 52186 30774 -11483 -15942 -19054 -26926 -76033 -74317 -39127 -96157 -115779
10689 -115779 -66306 -13526 48722 58056 25820 21642 19356 46346 107509 140078 131435 73825
10677 73825 26770 4445 -49344 404 65608 72678 41965 56860 70580 62471 82173 35959
10665 35959 -20556 -17669 -17704 -11422 6097 -203 8653 82677 109348 21891 1890 12619 3031
10652 3031 -34435 -33186 -59723 -18705 -5324 -34729 -58309 -65333 -22701 -11337 14466 -36772
10640 -36772 -68029 -7963 -40348 -66781 25558 83631 49024 50450 -174 -41623 -75619 -101645
10628 -101645 -59296 -96472 -111920 -68325 -85237 -68902 -65084 50608 102276 81969 112523
10617 112523 116535 143979 108484 95052 109100 74999 -31468 -89949 -67203 -87959 -94927 -99758
10605 -99758 -81553 -56418 -18431 -45141 -31181 -31047 733 -33232 -63426 -44008 -19934 -33707
10593 -33707 -71188 -78482 -59708 -49319 -17243 -13831 -48676 -46763 -25097 -38813 -35814 -46312
10581 -46312 -23831 -1209 12499 -25974 -59143 -33620 -65103 -64613 -10219 42813 45442 -2052
10569 -2052 -39704 -119433 -139281 -55043 2127 24132 43974 38293 46959 -14324 -4140 -933
10557 -933 22805 5333 -4421 28604 4075 35145 25674 22328 79637 140321 123829 136242 146426
10544 146426 53887 -15034 -6147 32832 33439 63025 29622 -44451 -37348 -8332 -32663 -81662
10532 -81662 -99246 -83365 -64142 -30697 -63024 21768 85282 54187 36116 23813 -7394 -18375
10520 -18375 -21923 -52267 -22466 -3493 6526 6123 -70642 -75040 -9710 -24870 16907 27678
10508 27678 -24241 -51059 3571 10790 -4638 56446 88904 46954 43604 32917 23145 15097
10496 15097 -27572 14063 99326 74452 29683 34669 726 302 87558 151974 191111 173665
10484 173665 180448 168315 179180 179885 132958 132612 163423 154342 109525 111425 66389 13865 34970
10471 34970 44308 44558 46734 45396 35371 -68771 -96540 -72730 -6246 -17429 -48867 -28187
10459 -28187 61506 75953 26906 -659 36317 69550 56179 2226 -14389 27414 34724 -3963
10447 -3963 -852 79245 105256 81925 27683 -5693 32022 24979 39369 65387 41629 34519
10435 34519 -2036 31514 96730 66673 14691 2737 33897 22016 -9402 -26005 39083 71085
10423 71085 100803 68109 73076 73199 65495 104940 127761 148139 133111 178435 154822 90605
10411 90605 80375 79483 62324 46528 32196 17856 -4367 -21018 -58806 -24765 -18042 -30709
10399 -30709 48648 32186 -50013 -66208 1034 98990 79609 55165 21147 -11488 9961 61612
10387 61612 128907 151449 84186 25324 -56516 -78516 -29435 -51776 -17013 17086 -28656 -35797
10375 -35797 -8331 -36339 -25153 -88604 -114343 -93045 -61101 -17092 12517 -11580 -33370 -13349
10363 -13349 4799 80461 128681 100497 5231 -26701 -936 -28882 -40790 -33084 413 43069
10351 43069 3083 1742 -15481 13299 17330 5200 -11570 35000 56161 52683 -2224 24914
10339 24914 59142 43558 40745 86507 71663 41281 19855 57020 85063 109901 83470 65391
10327 65391 32979 36521 35887 71028 101358 113020 153012 110867 27847 -27440 22830 101702
10315 101702 43411 12327 42350 3116 23031 24891 32122 -7121 8363 -61928 -100936 -58593
10303 -58593 -44658 -25768 -24434 22369 56274 125630 157884 95729 -4458 -60727 -1737 36363
10291 36363 71634 76358 68758 47660 -54132 -104057 -91407 -22653 1537 33074 46090 48502
10279 48502 14808 63010 68735 44737 26633 -2595 47409 14394 -16201 -23978 53299 76053
10267 76053 83663 40119 11740 6046 -15438 31427 22144 -28278 13680 33722 37144 6002
10255 6002 15437 18400 -20506 22221 25243 65210 128597 115756 71355 48936 65009 70847 63064
10242 63064 64620 78436 126720 73186 -57776 -61022 -27694 -7553 36619 24092 31800 -10149
10230 -10149 -39881 -79857 -97682 -2761 42565 95382 87985 54309 22815 -9450 -44898 -75174
10218 -75174 -94458 -52385 -10030 25675 47895 22993 34882 7628 252 32683 -3762 35627
10206 35627 104279 82504 120960 115261 125274 103085 83927 6626 -29337 -31998 -45075 -60756
10194 -60756 -43931 -24472 48578 53183 31585 -38931 -68309 -66168 -71525 13708 78596 1051
10182 1051 -96234 -57962 -28835 23901 37900 75209 96217 92628 108717 81007 106761 103985
10170 103985 78585 69073 64711 52921 48694 59562 22801 -22582 34724 54800 40605 52122
10158 52122 49287 1037 29918 73669 72046 53216 16900 15603 5944 11105 -9009 -62858 -37338
10145 -37338 30943 1165 35023 81414 63416 53240 70741 -20236 -35355 -19691 10932 78074
10133 78074 131775 141103 98211 43164 40651 44787 52234 80040 69019 70236 3087 -51536 -25790
10120 -25790 28586 86517 75298 79335 75791 88476 96736 41646 12888 8009 41778 36831 -28832
10107 -28832 -43132 -71304 -34246 -19426 28599 12336 -21278 -34468 9877 61369 46568 76328
10095 76328 119820 110975 124496 75570 96933 87523 15603 -12306 6700 34359 44703 1621
10083 1621 -24559 -46245 -29843 -45939 19382 33893 19411 32614 29663 4606 14559 29295
10071 29295 10891 17682 22952 -5888 24597 87141 53299 19726 11374 75144 119954 141007
10059 141007 121960 116038 77369 115913 122762 123012 134651 133501 84677 12059 -32057 -17086
10047 -17086 -44992 -93556 -56817 4470 43496 19821 12498 40132 30345 9620 2240 -33489
10035 -33489 -36541 -46423 -8614 60318 105766 50671 8466 14242 42974 44280 -6584 -7577 60028
10022 60028 117745 135432 104731 148688 127502 45179 38653 57204 91370 86407 68067 47270
10010 47270 71878 58662 36318 30362 27975 27237 31856 124355 139885 81940 64152 48459 105282
9997 105282 165209 134160 115269 80592 63820 28252 -9938 4239 25460 43900 -196 31177
9985 31177 34316 104594 173748 153601 125041 94204 60534 51925 8185 11031 19425 9350 26207
9972 26207 -35 -18749 -37089 -62397 -13040 68068 56049 63342 95268 113569 46585 -6633
9960 -6633 -13008 29403 69945 97489 98727 143214 159731 169608 199958 214695 175286 137529 117669
9947 117669 162814 180520 186154 158080 123530 66654 61569 73339 108739 86107 112230 138555
9935 138555 139185 116186 45070 98064 99222 120399 105862 44794 32950 92572 133297 202482
9923 202482 215051 180730 168005 114456 130344 191323 181216 162263 108896 100150 121323 131371
9911 131371 110176 68776 80909 118669 117378 143928 143831 164391 132343 118965 103119 93417 101188
9898 101188 104833 99617 47279 73219 128215 131806 113530 123891 208959 307481 359278 349153
9886 349153 298097 214808 120701 62348 137809 209543 236820 269860 267087 245488 272119 293223
9874 293223 274112 165633 119728 166881 145316 103571 107097 91435 85929 87313 98081 88409
9862 88409 127585 139950 71907 78590 71266 98550 165410 189268 195682 188698 196044 258330 246506
9849 246506 231415 233199 229513 193655 219798 216273 241388 188306 161712 193090 123272 95825
9837 95825 122107 96685 50809 32470 64019 99175 119891 127023 92944 164174 155252 148363
9825 148363 160446 184687 180734 175130 189989 212484 166961 119424 175693 166577 129251 187867
9813 187867 204447 151939 143478 154991 88482 94578 125041 126577 139646 160758 188841 157844
9801 157844 104489 90675 119038 109159 183848 246268 272204 254520 240152 229656 260841 254265
9789 254265 245072 241201 209693 217349 200083 188154 159664 170400 197965 232669 235086 153126
9777 153126 141924 144423 180742 299930 344345 276879 250115 228554 286399 364457 328697 261350
9765 261350 270361 285232 272207 251668 245931 187482 162381 153222 159742 147616 178919 234013
9753 234013 164463 119234 210197 205066 191146 187134 227519 178872 190127 183929 227399 250759
9741 250759 269517 301908 274277 269317 259603 280686 250256 224497 281492 291097 328391 295555
9729 295555 276463 310654 282607 238205 274490 281126 239406 236454 248019 296706 324831 355750
9717 355750 329970 321271 285168 273243 301467 371087 370946 346624 299808 292649 362903 422443
9705 422443 410743 395598 382629 388463 323498 341082 319590 312632 285720 286339 313606 303621 370143
9692 370143 408321 405438 439525 411780 410650 391862 334252 322066 310046 318522 333248 378589
9680 378589 439465 451819 408728 359060 387244 365764 396339 413800 419735 409964 365311 308583
9668 308583 305273 278608 292725 290912 307280 341731 341747 296110 311176 362136 433310 456441 442982
9655 442982 457627 505863 497639 475237 382503 319771 349432 357139 345718 399520 432896 467073
9643 467073 548482 539387 498709 505735 491996 531654 529104 448136 433678 489936 455647 408409
9631 408409 444590 467747 504330 530951 518552 476948 490902 455194 418979 429895 435641 439397
9619 439397 440021 480010 553604 535011 529637 507193 530872 558322 555104 498312 422831 399360
9607 399360 419623 448689 463977 441802 433685 444742 465084 459461 432849 479788 555072 533696
9595 533696 533681 508950 467219 456282 453784 430637 435121 480280 500339 547722 639807 631805 582835
9582 582835 632648 706641 655794 609185 612553 563330 558399 584268 577316 537725 562108 580807
9570 580807 542688 486492 488614 575518 600049 637729 691601 658615 583246 532654 593897 591314
9558 591314 606419 598391 590477 603263 605902 595344 606736 588947 539111 593511 604230 549342
9546 549342 549097 583567 615221 604399 625768 624818 670413 680674 684933 642766 594668 583960 585864
9533 585864 597686 644588 636820 625337 548295 519902 504054 527454 570540 528300 496186 522751
9521 522751 530361 504745 553555 588037 635530 620868 605216 620632 602739 594091 581998 600419
9509 600419 556540 548403 570797 602977 614301 602160 549886 505752 490265 568284 558174 552013
9497 552013 548394 542256 536712 570731 572440 537918 531737 557234 619458 639032 576501 532459 500925
9484 500925 536436 507196 487944 484560 486755 574386 631448 663639 667016 680584 667582 588394
9472 588394 577405 617812 605434 601674 548149 531191 574399 550238 531396 553744 532257 499577
9460 499577 500931 478632 478684 536495 568287 621091 570847 541939 530480 518884 549277 532125
9448 532125 521129 526798 492495 496816 489252 489745 468549 482313 484262 480484 516414 474415 490287
9435 490287 502097 503673 468799 445801 475453 465857 478393 511771 525950 501851 527094 596813
9423 596813 509163 423039 427142 483091 516209 559619 458625 369827 432232 423520 385790 371263
9411 371263 394695 377528 417097 455557 460063 446387 444798 483887 473433 468042 464696 464800 463504
9398 463504 473921 408804 387382 435271 417588 438440 443380 403048 389171 405639 379471 329735
9386 329735 324825 359447 403595 455727 497481 491093 390262 411286 434779 400147 393049 407865
9374 407865 430328 488576 485341 417087 405408 425393 464835 433748 434825 508162 485685 506922
9362 506922 517116 531594 506237 472372 373462 300146 293537 291519 306735 329041 362733 394961
9350 394961 391935 364058 350076 363043 407594 417975 361278 360901 390905 411115 389733 356123
9338 356123 301912 318217 340250 333918 315653 310523 297837 335731 366703 450036 493395 463200
9326 463200 407407 457921 462890 476056 469160 416692 363111 333230 289817 327444 305188 306071
9314 306071 318413 313428 294396 303956 291826 309321 328997 343204 319594 286986 247836 217298
9302 217298 178059 185439 268093 312094 311577 299807 254779 258936 285930 257332 267240 272878 295579
9289 295579 244413 299540 319482 261426 230580 259896 289602 247427 262485 241395 256957 260009
9277 260009 174542 130339 198109 229048 183921 147740 203887 279792 265475 165625 129340 122801
9265 122801 86940 85850 104542 150018 175783 209164 239025 255094 234821 212964 232771 253405
9253 253405 295856 252437 217623 210957 249025 250517 207251 206030 213898 235880 275304 336536
9241 336536 333772 291784 279325 247383 229741 189839 198594 193340 193458 176601 197978 186181 133916
9228 133916 166663 148956 142116 121810 170267 143702 109925 159155 216902 246111 217701 234712
9216 234712 204726 208634 239654 260697 216529 157981 64074 107881 155515 197745 233523 272907
9204 272907 240440 220040 196037 203963 207903 171022 119026 146779 196999 200620 196003 209373
9192 209373 200086 200209 218186 192008 175742 191626 157315 161118 154434 148563 114033 122927 134445
9179 134445 120950 166102 170323 95209 55062 61186 138901 129778 93748 42301 46119 47144 54346
9166 54346 100236 118594 107672 126688 150415 140549 144575 153652 172709 173553 112241 130120 122847
9153 122847 72681 118062 120768 119051 115209 116620 89015 99531 159959 166225 149860 186820 247713
9140 247713 201924 181643 233849 199244 200621 187287 156418 156599 186550 201636 169548 156906
9128 156906 174703 141088 115503 121943 151315 124104 142964 115909 103452 80052 141938 180322
9116 180322 166971 139035 109121 88404 91769 80335 96710 164103 136043 43665 -2409 -4212
9104 -4212 -49824 16671 87782 74887 72787 147461 194406 160414 150101 149474 125820 92323 114853
9091 114853 172606 171436 160226 145159 133570 130446 90480 18957 -32685 26431 71422 57432
9079 57432 51752 53801 9582 57347 89097 104582 109289 110300 81786 87732 90053 98275 132228
9066 132228 138030 87020 92426 105804 100261 149308 93033 106634 82801 77370 106031 145017
9054 145017 105746 58232 47395 98158 146281 215880 211970 203489 154657 90001 94267 80819
9042 80819 75932 95625 116172 138995 154998 133375 100850 90154 37501 44806 31460 15139
9030 15139 46252 73646 110281 91916 -25304 -35916 -7580 59170 95286 122357 75026 11078
9018 11078 -38341 -48111 -3797 42482 69987 93818 81186 86108 70717 80301 85000 91829 29803
9005 29803 27226 80408 52489 57030 21555 49267 107157 78098 -7451 -23631 21924 33363
8993 33363 61648 85409 38642 -44581 -30742 -15450 -3965 48193 63122 59990 14136 27089
8981 27089 12439 22474 25477 2389 -2201 25309 77109 102907 144220 126952 96812 119829
8969 119829 92519 67195 86063 98967 30684 3692 10122 39562 80388 82175 41629 43647
8957 43647 61756 4673 -54112 -17551 46578 73809 85070 75501 76555 46731 37871 25728
8945 25728 30527 -2389 -8207 13474 61610 126267 140296 68352 -15113 -33458 -4220 17619
8933 17619 29348 -402 6843 16004 13069 -39910 -54195 -60117 -64705 -79031 -93736 -82685 -38066
8920 -38066 -16094 -31923 16553 71590 -4061 -16418 18457 21482 -26610 5922 14519 51669
8908 51669 48873 12749 20356 -2167 -15331 51111 95722 122541 132503 105579 96778 102492 147142
8895 147142 135106 175847 174817 137056 147988 156831 148952 42990 16578 15803 -12141 3285
8883 3285 24241 6992 -9701 -18894 -32988 -44333 35252 48768 51237 29470 33513 25922 34992
8870 34992 9747 30923 46892 13275 13132 -11853 20305 85951 56012 4107 -25627 -13323
8858 -13323 -18793 45023 49857 16274 753 -15978 -42879 -72387 -63226 -75666 -30175 42607
8846 42607 105692 156557 107730 52686 115848 102346 83154 35433 24312 39347 47258 94467
8834 94467 96272 130442 164865 141742 74999 39618 67705 55160 64642 79764 64245 116636
8822 116636 70182 -8186 23925 34809 41935 93681 139200 134578 139307 149556 128055 63711
8810 63711 -2829 30619 61914 89806 75800 54410 17815 6721 -3193 58130 97948 66301
8798 66301 27415 44920 42588 17888 -20309 -31795 -9674 5822 4076 -22030 6218 -4862
8786 -4862 25580 37187 30318 63625 78201 55813 18856 17907 6843 5018 31752 61704 46100
8773 46100 35973 45671 17581 -32137 -60098 -109058 -50941 -4476 -38028 -23684 -24940 -29717
8761 -29717 9209 49101 62734 43573 23700 -23998 26510 78479 111396 86446 59743 62952
8749 62952 52627 52573 -38607 -68865 -6715 -1922 -15122 26705 -7503 -4525 10323 25554 110943
8736 110943 22245 -11206 55905 122288 141866 78378 11760 -28766 13641 16833 76257 94232
8724 94232 66343 92479 102690 88315 68152 56804 25860 7877 -13855 30376 39315 37329
8712 37329 10602 -73039 -96163 -63703 -20043 41839 74255 82581 -16747 -27035 -34400 -44517
8700 -44517 6156 18546 -6976 -20495 -11569 25032 41748 3265 -18504 -4449 -17287 -24864
8688 -24864 -10830 1817 -55318 -36326 33867 28537 44189 25975 15997 44 8665 -12723
8676 -12723 -42511 -52102 20647 48699 17608 -23765 5640 -9329 16742 2032 -20355 -36942
8664 -36942 -18208 -9719 -23589 -25067 2560 73544 114763 94486 131651 90001 29966 73127
8652 73127 163966 142123 53369 -8287 -1050 3373 -8631 -1136 -15422 21217 13521 11180 26591
8639 26591 -15757 -47723 -19403 66513 58573 50800 70744 93807 65466 27051 569 -21567
8627 -21567 -28905 20829 38091 45432 8618 -16613 9346 28579 -58425 -75571 -30239 -66883
8615 -66883 -40929 24839 26461 56394 65260 73285 111827 133653 148976 179281 172695 163749 165428
8602 165428 181624 209988 237851 273703 316880 356811 387059 449950 512860 518404 640258 811390
8590 811390 962908 1154153 1341094 1426397 1479620 1410075 1183663 968392 758186 626320
$$ [...]
##END NTUPLES=NMR SPECTRUM
##END=
