##TITLE=Analysis number 321727
Compound Code cc 14704
Project Code adrs
Chemist Name ugmt
##JCAMPDX= 6.0         $$ Bruker NMR JCAMP-DX V2.0
##DATA TYPE= NMR SPECTRUM
##DATA CLASS= NTUPLES
##ORIGIN= Bruker BioSpin GmbH
##OWNER= nmr
$$ XWIN-NMR		Version 3.5
$$ Wed Aug 23 12:47:59 2006 GMT Daylight Time (UT+1h)  MAYBRIDGE\nmr@NMR_250MHZ
##.OBSERVE FREQUENCY= 250.131544655141
##.OBSERVE NUCLEUS= ^1H
##.ACQUISITION MODE= SIMULTANEOUS (DQD)
##.ACQUISITION SCHEME= undefined
##.AVERAGES= 16
##.DIGITISER RES= 18
##SPECTROMETER/DATA SYSTEM= dpx250
##.PULSE SEQUENCE= zg30
##.SOLVENT NAME= CDCl3
##.SHIFT REFERENCE= (INTERNAL, CDCl3, 0, 16.522)
##AUDIT TRAIL= $$ (NUMBER, WHEN, WHO, WHERE, WHAT)
$$ ##TITLE= Audit trail, XWIN-NMR		Version 3.5
$$ ##JCAMPDX= 5.01
$$ ##ORIGIN= Bruker BioSpin GmbH
$$ ##OWNER= nmr
$$ C:\u/data/dgb/nmr/ADRS/1490/pdata/1/auditp.txt
$$ ##AUDIT TRAIL=  $$ (NUMBER, WHEN, WHO, WHERE, WHAT)
(   1,<2006-08-23 12:47:34.97 +100>,<MAYBRIDGE\nmr>,<NMR_250MHZ>,
      <created by zg, POWCHK disabled, PULCHK disabled
       configuration hash MD5:
       E2 DF 36 D8 04 B2 41 60 5A D7 A3 38 5A 4B D0 FE
       data hash MD5: 64K
       D0 8D 39 83 70 76 A5 9E 61 96 30 A7 88 B2 A0 4B>)
(   2,<2006-08-23 12:47:49.45 +100>,<MAYBRIDGE\nmr>,<NMR_250MHZ>,
      <Start of raw data processing
       ef LB = 0.3 FT_mod = 6 PKNL = 1 SI = 32K 
       data hash MD5: 32K
       C9 75 F3 45 98 59 88 45 9D 40 31 C6 21 9B 8A 3A>)
(   3,<2006-08-23 12:47:50.98 +100>,<MAYBRIDGE\nmr>,<NMR_250MHZ>,
      <apk 
       data hash MD5: 32K
       FC 7E 8A 64 FC 2A 16 FF 64 10 A5 FA E8 03 81 D2>)
(   4,<2006-08-23 12:47:51.81 +100>,<MAYBRIDGE\nmr>,<NMR_250MHZ>,
      <abs ABSG = 5 
       data hash MD5: 32K
       9B 8B DA 64 BA 22 B4 21 16 1C 41 21 A8 F6 9A 0F>)
$$ ##END=
$$ 
$$ hash MD5
$$ 46 3F A8 87 53 05 4D 44 33 02 6A 3F 3E 28 E3 49
##$RELAX= 
##$RELAX= 
##$RELAX= 
##$RELAX= 
##$RELAX= 
##$RELAX= 
##$RELAX= 
$$ Bruker specific parameters
$$ --------------------------
##$DU= <C:\u>
##$EXPNO= 1490
##$NAME= <ADRS>
##$PROCNO= 1
##$TYPE= <nmr>
##$USER= <dgb>
##$AMP= (0..31)
100 100 100 100 100 100 100 100 100 100 100 100 100 100 100 100 100 100 
100 100 100 100 100 100 100 100 100 100 100 100 100 100 
##$AQSEQ= 0
##$AQ_mod= 3
##$AUNM= <au_zg>
##$AUTOPOS= <31 >
##$BF1= 250.13
##$BF2= 250.13
##$BF3= 250.13
##$BF4= 250.13
##$BF5= 500.13
##$BF6= 500.13
##$BF7= 500.13
##$BF8= 500.13
##$BYTORDA= 1
##$CFDGTYP= 0
##$CFRGTYP= 5
##$CHEMSTR= <none>
##$CNST= (0..31)
1 1 145 1 1 1 1 1 1 1 1 1 1 1 1 1 1 1 1 1 1 1 1 1 1 1 1 1 1 1 1 1 
##$CPDPRG= <>
##$CPDPRG1= <>
##$CPDPRG2= <>
##$CPDPRG3= <>
##$CPDPRG4= <mlev>
##$CPDPRG5= <mlev>
##$CPDPRG6= <mlev>
##$CPDPRG7= <mlev>
##$CPDPRG8= <mlev>
##$CPDPRGB= <>
##$CPDPRGT= <>
##$D= (0..31)
0 1 0 0 0 0 0 0 0 0.06 0 0 0 0 0 0 0.0002 0 0 0 0 0 0 0 0 0 0 0 0 0 0 
0 
##$DATE= 1156333653
##$DBL= (0..7)
120 120 120 120 120 120 120 120 
##$DBP= (0..7)
150 150 150 150 150 150 150 150 
##$DBP07= 0
##$DBPNAM0= <>
##$DBPNAM1= <>
##$DBPNAM2= <>
##$DBPNAM3= <>
$$ [...]
##$SUBNAM7= <"">
##$SUBNAM8= <"">
##$SUBNAM9= <"">
##$SW= 20.6930455092707
##$SWIBOX= (0..15)
0 0 3 0 0 0 0 0 0 0 0 0 0 0 0 0 
##$SW_h= 5175.983436853
##$TD= 65536
##$TD0= 1
##$TE= 296.16
##$TE2= 300
##$TE3= 300
##$TEG= 300
##$TL= (0..7)
0 120 120 120 120 120 120 120 
##$TP= (0..7)
150 150 150 150 150 150 150 150 
##$TP07= 0
##$TPNAME0= <>
##$TPNAME1= <>
##$TPNAME2= <>
##$TPNAME3= <>
##$TPNAME4= <>
##$TPNAME5= <>
##$TPNAME6= <>
##$TPNAME7= <>
##$TPOAL= (0..7)
0.5 0.5 0.5 0.5 0.5 0.5 0.5 0.5 
##$TPOFFS= (0..7)
0 0 0 0 0 0 0 0 
##$TUNHIN= 0
##$TUNHOUT= 0
##$TUNXOUT= 0
##$USERA1= <user>
##$USERA2= <user>
##$USERA3= <user>
##$USERA4= <user>
##$USERA5= <user>
##$V9= 5
##$VALIST= <valist>
##$VCLIST= <CCCCCCCCCCCCCCC>
##$VD= 0
##$VDLIST= <DDDDDDDDDDDDDDD>
##$VPLIST= <PPPPPPPPPPPPPPP>
##$VTLIST= <TTTTTTTTTTTTTTT>
##$WBST= 1024
##$WBSW= 4
##$XGAIN= (0..3)
0 0 0 0 
##$XL= 0
##$YL= 0
##$YMAX_a= 517396
##$YMIN_a= -576700
##$ZGOPTNS= <>
##$ZL1= 120
##$ZL2= 120
##$ZL3= 120
##$ZL4= 120
##$ABSF1= 16.522
##$ABSF2= -4.171173
##$ABSG= 5
##$ABSL= 3
##$ALPHA= 0
##$AQORDER= 0
##$ASSFAC= 0
##$ASSFACI= 0
##$ASSFACX= 0
##$ASSWID= 0
##$AUNMP= <proc_1d>
##$AZFE= 0.1
##$AZFW= 0.1
##$BCFW= 0
##$BC_mod= 0
##$BYTORDP= 0
##$COROFFS= 0
##$CY= 12.5
##$DATMOD= 1
##$DC= 0
##$DFILT= <>
##$DTYPP= 0
##$F1P= 14.0000005364418
##$F2P= -0.99999901652339
##$FCOR= 0.5
##$FTSIZE= 32768
##$FT_mod= 6
##$GAMMA= 0
##$GB= 0
##$INTBC= 1
##$INTSCL= 1
##$ISEN= 128
##$LB= 0.3
##$LEV0= 0
##$LPBIN= 0
##$MAXI= 10000
##$MC2= 0
##$MEAN= 0
##$ME_mod= 0
##$MI= 0
##$NCOEF= 0
##$NC_proc= -3
##$NLEV= 6
##$NOISF1= 0
##$NOISF2= 0
##$NSP= 0
##$NTH_PI= 0
##$NZP= 0
##$OFFSET= 16.522
##$PC= 1
##$PHC0= 146.5541
##$PHC1= 4.537749
##$PH_mod= 1
##$PKNL= yes
##$PPARMOD= 0
##$PSCAL= 4
##$PSIGN= 0
##$REVERSE= no
##$SF= 250.13
##$SI= 32768
##$SIGF1= 0
##$SIGF2= 0
##$SINO= 400
##$SIOLD= 32768
##$SREGLST= <1H.CDCl3>
##$SSB= 0
##$STSI= 32768
##$STSR= 0
##$SW_p= 5175.98343685301
##$SYMM= 0
##$S_DEV= 0
##$TDeff= 65536
##$TDoff= 0
##$TI= <Analysis number 999999
Compound Code 99
Book Reference 9
Project Code 9>
##$TILT= no
##$TM1= 0
##$TM2= 0
##$TOPLEV= 0
##$USERP1= <user>
##$USERP2= <user>
##$USERP3= <user>
##$USERP4= <user>
##$USERP5= <user>
##$WDW= 1
##$XDIM= 32768
##$YMAX_p= 382968213
##$YMIN_p= -214733
$$ End of Bruker specific parameters
$$ ---------------------------------
##NTUPLES= NMR SPECTRUM
##VAR_NAME=  FREQUENCY,     SPECTRUM/REAL,   SPECTRUM/IMAG
##SYMBOL=    X,             R,               I
##VAR_TYPE=  INDEPENDENT,   DEPENDENT,       DEPENDENT
##VAR_FORM=  AFFN,          ASDF,            ASDF
##VAR_DIM=   32768,         32768,           32768
##UNITS=     HZ,            ARBITRARY UNITS, ARBITRARY UNITS
##FACTOR=    0.157963299565203, 1,           1
##FIRST=     4132.6476996994, 0,             0
##LAST=      -1043.33573715361, 0,           0
##MIN=       -1043.33573715361, -214733,     0
##MAX=       4132.6476996994, 382968213,     0
$$ Real data points
##PAGE= N=1
##DATA TABLE= (X++(R..R)), XYDATA
$$ [...]
20849 -36415 -33904 -7984 -15912 -11390 -8192 -11325 -4740 -24438 -40296 -16317 -9328 -20727 -47525
20836 -47525 -75950 -89869 -78586 -71365 -43664 -37730 -18958 -11554 -7529 -6657 -14535 -22590 -29097
20823 -29097 -32279 -27159 -15850 18655 -2896 -32665 -19840 -4458 -14308 -16476 -16290 -4874 -6824
20810 -6824 5259 10486 -19710 -6414 12071 16157 -15442 -34534 -37031 -38864 -59810 -71823 -57926
20797 -57926 -60474 -57861 -40110 -24034 -11920 26484 15055 -8657 20765 30708 3744 -25432
20785 -25432 -55119 -55751 -43664 -38306 -4944 -11151 -22909 -57054 -62303 -59140 -48579 -47269 -22126
20772 -22126 -22159 -20288 -5117 8639 4790 7469 13750 8844 -7591 -8954 -4188 18269 32590 -4357
20758 -4357 4683 4156 4163 24435 19111 10990 -14873 -29528 -19511 -4464 -21264 -33261 -54580 -42953
20744 -42953 -4653 -8733 -21790 -15614 15782 -14605 -6884 10609 -11588 -25785 -17576 3411
20732 3411 6050 12139 -8799 -34312 -19767 -31008 -35964 -22208 19442 30366 19976 13521 -7675
20719 -7675 -6595 8665 30338 36489 20290 -33479 -35425 -13124 -15106 -20399 -16430 -30536 -52351
20706 -52351 -68461 -48146 -42837 -53905 -71368 -44688 -9250 8178 -688 -22284 -39364 -43754
20694 -43754 -28504 8895 20442 8168 -10561 -6273 -11213 2669 12822 14403 8839 20580
20682 20580 -4489 -26700 -8384 -14461 -31408 -20115 1375 3587 -19387 -17244 -22006 -26378 -35625
20669 -35625 -54363 -71428 -70315 -45491 -8886 9693 21226 11101 5669 21070 29395 10716
20657 10716 12911 -10116 -27099 -33101 -63515 -88116 -102392 -68339 -30717 -30238 -32944 -31726 -11238
20644 -11238 -15135 -33907 -45157 -38739 -27175 -21708 -20081 -3519 -15800 -33364 -39379 -34708 -47206
20631 -47206 -45730 -49807 -50662 -17685 19566 10170 19523 19085 5049 -1446 -6020 -7194 -859 -27040
20617 -27040 -36263 -29724 -40008 -71376 -60975 -47975 -39497 -24095 409 9110 -3284 -21017
20605 -21017 -21745 -14174 -11146 -6453 -6768 -5251 -38062 -38392 2481 22764 -2063 -38928 -46807 -24988
20591 -24988 -17955 -20601 -28945 -22173 -8249 3080 2868 10727 12277 23637 46976 50533 30433
20578 30433 24464 21417 1470 -15364 -36956 -17679 12010 25588 20637 12234 2630 16598 38330
20565 38330 12473 -39205 -24858 16684 48039 25735 30677 9203 -42631 -50493 -38842 -13570
20553 -13570 35428 18475 -14876 -36365 -37778 -36326 -23880 -29 -10561 -12680 3716 -1301
20541 -1301 -1461 1544 3423 -2674 14166 35218 36827 -12755 -34531 -48591 -35619 -21179 -8980
20528 -8980 7894 6722 5683 -12739 -41022 -40292 -25836 -12483 -6788 17263 13371 36423 35473
20515 35473 14675 31025 54364 21067 -7676 -30232 -46097 -31821 -12452 -4532 -7799 -22016
20503 -22016 -24861 -219 -13865 -16826 -12997 1911 11003 -38155 -37203 -16426 -46394 -41190 -35168
20490 -35168 -23274 941 9094 14067 3423 -823 3189 -21755 -37115 -18148 -21930 -16945 1852
20477 1852 18823 -25814 -39335 -34725 -22131 -8316 -31895 -24014 7019 -5194 -16770 -23807
20465 -23807 -34344 -17967 -25255 -60607 -68204 -44038 -42369 -33310 16995 9717 -26008 -46541 -47200
20452 -47200 -23343 -21846 -19634 -23896 -48416 -57207 -37960 -19289 2378 -4762 5695 2361 1601
20439 1601 3083 23552 35144 18029 20248 23527 17347 13127 -8112 7049 26334 3464 -27146
20426 -27146 -47256 -36243 -13757 -24695 -42226 -27714 -24432 -6154 2302 3509 14511 20326
20414 20326 21512 17298 -85 -23646 -31592 -9653 14825 44290 63666 59788 28657 20658 21144
20401 21144 6016 3389 -20047 -23543 -1266 5307 16715 6645 7567 -24674 -32665 -17732 -36040
20388 -36040 -38921 -36669 -35171 -30099 -37584 -5162 5175 -4102 -4655 -10830 -4460 157 -1325 -1053
20374 -1053 -16914 -15624 -7830 -4958 -16756 -6085 10451 20995 2763 2138 -16116 -16981 -18309
20361 -18309 -35638 -51597 -45053 -26349 -8143 954 30363 31724 6107 -1404 -14160 13325
20349 13325 48905 64043 55724 33585 4056 10291 9050 -6913 -11001 -8699 -9043 -21406 -32623
20336 -32623 -54859 -78023 -67795 -33497 -726 19096 -6822 403 -6465 -23280 5572 11097
20324 11097 11276 -90 -8267 6169 -7128 -8719 2800 -12975 -8029 -4279 3101 1093 -13914
20311 -13914 -28484 -22282 -7402 2782 12215 13858 26918 12141 3998 -12967 -42225 -30295
20299 -30295 -7249 -16088 -6292 2669 8346 14549 23401 2511 -14382 -26669 -39930 -25179 -10905
20286 -10905 18927 20820 11516 18104 -33480 -52075 -10128 6108 -22873 -14917 -8703 -17915 -34933
20273 -34933 -15151 -6897 -3258 5054 -6741 -2826 16197 14005 -4317 4707 -24920 -58101 -49649
20260 -49649 -19463 -40573 -52974 -61034 -74694 -58330 -43941 -52808 -45039 -29094 -13353 3693
20248 3693 15134 5741 7314 25311 45161 38437 9484 7513 -8625 -15207 -17344 5207 10632
20235 10632 20309 10720 23130 27100 13941 -194 -2781 5834 10630 -4425 -11763 3117 4987
20222 4987 4160 -9877 -9737 -21136 -39016 -33601 -7172 -464 -18264 -33812 -18872 -33360 -43110
20209 -43110 -38212 -25780 -22694 5612 -2628 12995 17879 -3818 -6114 -5858 -18305 -58341 -68707
20196 -68707 -35915 -32084 -55388 -56895 -31979 10866 9372 11552 10350 5804 -5438 -13392 8596
20183 8596 20628 12608 12469 3846 11933 14728 -10193 -15558 -6781 22632 14497 -6953 -8637 -27653
20169 -27653 -15825 -21065 -23243 -43270 -57179 -50970 -66297 -51205 -44875 -47280 -35704 -5715 -20625
20156 -20625 -28854 -29569 -45265 -57956 -72870 -76859 -61733 -56524 -30310 -16038 -7392 -8993 -15848
20143 -15848 -8907 3004 11419 -17610 -28802 -23978 -11481 23064 41998 37214 14814 -9328
20131 -9328 1218 -2635 -16310 -35984 -28759 -21754 -42263 -36959 -15558 -39416 -36892 -44661 -37115
20118 -37115 -24897 -28663 -33952 -31749 -38043 -28141 -10262 8294 4691 -16060 -21685 -14912 3400
20105 3400 9949 25917 5273 -4474 4448 6983 4268 22377 16004 -64 21290 19556 16398
20092 16398 15157 -24846 -38086 -11724 -13594 -32722 -29744 -12111 9620 17733 4876 -13851
20080 -13851 -23565 1834 -1005 -12947 -15635 -44750 -57019 -59980 -51275 -18750 -9708 -19150 -35837
20067 -35837 -77125 -88404 -40559 -20612 -18877 -25771 -39244 -22547 -17626 8546 17446 10678 17107
20054 17107 34531 42659 22436 23558 17121 -10074 -21568 -31231 -25768 -11330 -173 -6120 -32461
20041 -32461 -23023 2700 -2755 -7618 -22222 -32187 -38090 -44475 -34583 -18800 17689 -4545 -27331
20028 -27331 -34598 -26909 -23126 -21850 -22683 -4860 -20758 -28988 -14920 -26547 -28472 -16529 -40657
20015 -40657 -52251 -50992 -56075 -16665 -4896 -6595 -2651 -21136 -11234 -2603 1537 -21322 -42631
20002 -42631 -47343 -43176 -18487 -21486 -23588 -9169 -11320 -3634 5913 -4165 6323 14984 -7732
19989 -7732 -43195 -34188 -41729 -60496 -51539 -46875 -36722 -45470 -43505 -17902 -4730 -18618 -31806
19976 -31806 -13049 -30977 -16037 14118 37443 8187 -20165 12463 25266 6840 -103 -14689
19964 -14689 -15568 -17344 -30898 -31843 -3807 6701 -5069 -22977 -33156 -37038 -33061 -46517 -63012
19951 -63012 -62066 -52342 -6851 -12302 -25609 -7773 -11988 -16038 -26438 -42069 -44215 -18914 -10725
19938 -10725 -11082 28926 17056 -584 -18767 -15115 -19171 -8577 -24626 -27941 -8059 3180 -6099
19925 -6099 -18074 -14971 -14913 2123 30196 39586 47193 32789 12237 -5800 -43136 -80465 -64406
19912 -64406 -20904 -7351 -25706 3699 26243 7951 1662 -12473 -36514 -34693 -23120 -21271
19900 -21271 -7572 -613 -15766 -24508 -27435 -26834 -15880 -5894 -23806 -18455 -62 14229 19746
19887 19746 17805 -9137 -27153 -25081 -49303 -56562 -36855 -24885 -13503 -3117 -3095 20777 3600
19874 3600 6785 7116 -20118 -20242 -9368 -7083 -16301 -38047 -26516 -10713 -20418 -11077 -14844 -19948
19860 -19948 -6478 -14985 -36493 -66866 -80928 -80677 -57932 -53651 -38084 -22621 -26482 -33704 -49240
19847 -49240 -45865 -45363 -24834 -3403 9142 -16779 -10576 -11076 -20666 -21273 -63187 -61040 -28088 -22081
19833 -22081 -12228 -14501 -14764 -26815 -14908 5547 22044 32880 6178 -5733 665 6803 -4633
19820 -4633 -7528 3780 -7027 -19721 -11370 10937 -576 -11547 -23420 -7268 4964 7121
19808 7121 21462 11824 27041 27115 -3742 7530 4174 5548 -1563 -5701 -15717 -22830 -24977 -36342
19794 -36342 -31336 -19470 -33647 -27795 2860 16095 -15207 -17523 -11529 -19823 -29366 -22960 -11197
19781 -11197 2424 11376 18497 -16830 -44618 -56118 -42907 -56525 -65240 -74466 -40877 -11845
19769 -11845 -40747 -71360 -62642 -32205 6832 9979 6513 3589 -3425 -11171 737 15855 2286
19756 2286 -20009 -25063 -30271 -32383 -35352 -32854 -32284 -24869 6521 4125 3561 -4769 -37728 -49649
19742 -49649 -31770 -31583 -51526 -47238 -30134 -6463 -10653 -17436 -21635 -5516 3156 -27373 -57344
19729 -57344 -16837 -6535 -18005 6223 15610 28145 14848 -8973 -13142 -18226 -23423 2609
19717 2609 8956 11544 11175 10460 15725 -1675 -44075 -38648 -25975 -30504 -62211 -49287 -29896 12706
19703 12706 30209 48758 33497 -12563 -27800 -19243 7971 14421 -30059 -56002 -46371 -40352
19691 -40352 -38094 -14770 -915 -21445 -6576 5026 2496 3627 -5575 -23783 -45729 -18558
19679 -18558 2141 -14259 3306 -12529 -27897 -13713 1718 -9126 -31204 -31397 -19518 -8945
19667 -8945 -30103 -24232 -34753 -28499 -6354 2499 14317 25617 3061 -11129 -22368 -27278 -28388
19654 -28388 -35264 -23290 -27380 -23481 -8000 -12595 -30325 -24656 -11615 -4977 -7042 -22408 -39895
19641 -39895 -34202 -27080 -35484 -12970 6888 -10468 -32906 -39410 -22491 -4557 27860 33170 2666
19628 2666 -23619 -14605 -6480 -4533 -905 -3162 -18630 18601 41820 31994 3246 -21574 -27113
19615 -27113 -43648 -40741 -40292 -47201 -46752 -42463 -35838 -20129 -33898 -25358 -30036 -24133 -31697 -41155
19601 -41155 -39714 -20253 -16920 -22587 -29282 -18101 1023 18401 35568 36199 24313 13516 -3876
19588 -3876 -42030 -38331 -22342 -3183 -22330 -33836 -14770 4818 -16455 -31502 -41503 -45228
19576 -45228 -46062 -48437 -32853 -7759 1435 14578 -10614 -49435 -35786 -2185 -5907 4360 -7008
19563 -7008 -6303 -18868 -5320 -11027 -35453 -53398 -30667 -17715 -1731 4604 1905 11635 -14356
19550 -14356 -25557 -19685 -43217 -51651 -47037 -48536 -30673 -17027 -6129 -9600 -12038 -19683 -26052
19537 -26052 -8529 7015 46034 51577 47718 33259 8876 13068 3955 10804 24484 25195 5282
19524 5282 -9714 -11159 -23217 -31482 -21442 -25916 -23372 -16444 -20773 -24060 -21596 -2268 -184 -6346
19510 -6346 -19458 -14339 -12516 -33937 -63752 -48403 -45120 -11474 36123 41785 27720 18332 290
19497 290 -10213 -12389 -14430 143 4294 23692 29681 17197 18141 5697 -6753 -15287 872
19484 872 -6467 -24185 -41099 -25521 -31462 -39609 -28128 -53195 -19333 27461 30912 32316 18602
19471 18602 7970 1593 -9726 -23881 -30841 -15678 -13578 -9861 -41768 -81256 -60898 -42905
19459 -42905 -6791 -26776 -40975 -32450 -36364 -39994 -32622 -21884 -10815 -11643 -18780 16313 35330
19446 35330 11137 -7363 17582 7406 -30006 -43081 -49341 -37100 -18564 -7397 23900 35153
19434 35153 28246 14559 -757 9612 21130 23577 16294 21362 11014 10031 18968 28223 36903
19421 36903 23750 14704 15395 9267 22043 19300 7194 8286 13683 -7379 -27709 -37705 -44163
19408 -44163 -20343 -8042 10024 10901 16401 8176 -8002 722 6178 -5698 -25387 -27194 -10009
19395 -10009 -192 8986 -6566 -17718 14091 2187 2160 9216 -3056 -26922 -12228 9096 -1801
19382 -1801 -16385 -11916 -9184 -14273 -16474 3392 34801 -1522 14743 -1484 -28921 -13969 18331
19369 18331 45899 76988 53984 39099 56215 53884 70402 92249 119925 121497 142154 156207
19357 156207 171159 202864 208426 206597 201501 173841 162669 128448 104664 95786 60459 60941 63582
19344 63582 47748 47544 66952 70489 55117 22294 33176 29202 42250 81895 92621 51828
19332 51828 46896 33594 17410 16301 27423 27351 51750 74184 87160 58512 31004 7133 2753
19319 2753 13256 -11172 -10801 19256 17977 3113 10324 14386 -18069 -3898 -17767 -49226 -35700
19306 -35700 4992 1513 3311 31330 4115 -22351 -31535 -42132 -35639 -19038 18948 32761
19294 32761 -24121 -25274 7839 19544 5043 -2290 -3568 -873 -10299 -25053 -45970 -47157 -14672
19281 -14672 -2815 -19972 -31096 -32921 -23191 17349 4809 -19539 1841 -1434 -9176 -25025
19269 -25025 -20912 -19594 -34135 -4159 12560 664 -2791 16285 -6741 11523 5912 -3546 -8085
19256 -8085 -5362 23422 26322 2705 1039 -34608 -39021 -27897 -4354 -3616 10080 -7498 -26567
19243 -26567 -5229 -41683 -63143 -72794 -73045 -62227 -36624 -11672 -20816 -28633 -7868 -7608 -20158
19230 -20158 -16261 -27528 -21807 -6252 6880 5329 -9563 -10225 -9674 -2121 -35952 -34116 -20582
19217 -20582 -2748 -19650 -10712 -23857 -29541 -3362 -8207 -11196 -11143 -44531 -40795 -19100 -22065
19204 -22065 -51133 -55126 -10236 -181 21199 38817 16792 -11817 -9023 -38299 -45118 -33402
19192 -33402 -45077 -79317 -35508 -25950 -33537 -29219 -30357 -30691 -53634 -59752 -48494 -56302 -49335
19179 -49335 -42085 -44051 -35170 -7366 462 12297 24368 44462 36303 4435 -7831 16228 24492
19166 24492 22226 24360 19845 6857 -29827 -22975 -9222 2558 -12528 -26024 -40811 -32762 -21853
19153 -21853 1480 8284 15901 7012 -34889 -18368 -4697 -11123 4639 26787 25568 13348 7570
19140 7570 -785 -6475 8753 27261 29192 16072 11293 -2549 1875 -31511 -36982 -25275 -22510
19127 -22510 -17602 -22796 -40305 -48966 -41746 -38730 -11443 5430 -10833 -30507 -69675 -82788 -63334
19114 -63334 -40445 -49014 -49649 -30481 -32845 -54441 -46549 -18258 -2018 19046 29046 25368 15610
19101 15610 16737 25335 20518 10303 5207 -1777 -22208 -22520 -30226 -38075 -28716 -15182 -9872 713
19087 713 17684 2620 -24714 -21614 -5716 -10198 -52082 -59184 -21283 -754 -20187 -15785 -38366
19074 -38366 -46628 -52709 -40958 -16784 -25037 -55949 -66379 -33737 -31400 -32137 1601 -17535 -49147
19061 -49147 -43780 -39299 -33866 -16426 -26249 -26544 -24863 -32573 -2404 17062 38880 3020 -20065
19048 -20065 -19840 -17167 -3021 -6134 -6749 -20880 -43104 -38783 562 37962 33074 25232 37988
19035 37988 41385 53382 43049 23808 14197 12254 15291 14898 33345 55032 63987 34473 12109
19022 12109 27552 7365 13988 22066 35066 40298 31872 10394 -1500 -19375 -17790 -12576 -47394
19009 -47394 -51806 -47596 -44629 -32694 713 28869 25080 8069 20751 42694 28666 22895 28720
18996 28720 28682 30459 -1798 -16721 8580 1460 -18612 -37180 -55510 -44586 -54772 -54631 -66420
18983 -66420 -85089 -97035 -59720 -17797 -31439 -43465 -27919 -19594 -24939 -9807 -21323 -31345
18971 -31345 -17709 846 -25708 -26939 9907 19732 26105 -3990 5727 17665 61 -9783 -15982
18958 -15982 -8057 -12452 11994 -3850 -25774 -50446 -43054 -10239 -6935 -20672 -14428 -11365 -26401
18945 -26401 -39219 -40640 -43085 -23841 -9352 -8922 -23800 -4612 -12176 14213 37490 30470 27810
18932 27810 45408 53755 47382 20702 -17993 -38243 -4450 1265 3938 -2084 -21818 -24535 -15715
18919 -15715 -10571 -13982 -28593 -19445 -31876 -21410 -7631 -15976 6774 17618 21915 24533 38612
18906 38612 30493 52282 13358 -478 16043 21948 30275 22220 -12215 -13828 18083 35196 24108
18893 24108 11691 17141 31821 27504 19312 4729 -25531 -12601 -12223 -1655 40310 56926 28154
18880 28154 -544 -22568 -24120 3861 1269 -8678 -26971 -38043 -39865 -54281 -39091 4004
18868 4004 13041 -3270 8066 13993 -439 25444 30095 4343 3848 10457 -645 -2456 19453
18855 19453 12273 -20886 -23550 -33796 -31133 -30344 -36381 -27566 -38030 -38457 2456 27281 7319
18842 7319 -26412 -27937 -16997 5744 2590 -8874 -3896 11857 16329 643 -28047 -58552 -50699
18829 -50699 -34048 -48618 -28491 -2973 -11041 -13569 -11601 -23271 -8315 -17560 -20222 -11228 3688
18816 3688 19479 14608 2316 -14842 -8923 -12990 -11626 -26437 -6071 9294 5131 6207 12839
18803 12839 13306 25481 42168 21400 17735 20013 24906 9828 -16645 -18720 -11730 10553 27082
18790 27082 39250 48488 36589 3802 -10586 4911 -4616 -18009 -44970 -43069 -39814 -32047 -12878
18777 -12878 -6494 -4821 -5860 -7537 8771 22860 8815 -22864 -4004 36663 92718 142380
18765 142380 147819 153332 135964 147734 142855 103499 84925 76670 65775 61783 50847 52046 37696
18752 37696 44016 29475 29002 26941 27520 -22353 -38793 -23285 -21775 -23904 -11966 3008 19583
18739 19583 18250 12575 40 -3830 -17909 15961 36727 24113 -16362 -47600 -50003 -21626
18727 -21626 -6641 3168 -8179 -24894 -29940 -32819 -29555 -35096 -20759 -9433 -1337 14253 33606
18714 33606 36599 29875 23981 -18330 -34144 -31652 -20907 -1644 -4302 -5552 -12179 1047 12793
18701 12793 9529 13018 23152 20000 13821 -9711 -34231 -19186 -6750 3929 25676 40839
18689 40839 6083 -44017 -11309 -11878 -27411 -44012 -52481 -33040 -30670 -13657 -6201 7013 657
18676 657 -25458 -18255 3695 9315 20918 28929 27905 1090 -21433 -22031 12742 7551 12774 43256
18662 43256 25327 -8205 -25466 -11792 -12962 -3583 -15289 -7535 -5112 -12370 2556 9678 -2277
18649 -2277 -20984 8058 7801 3331 -1039 8433 -8708 -48766 -48257 -53350 -46168 -54448 -59134 -22234
18635 -22234 -12309 -24441 -12365 915 -3849 -33837 -49119 -52098 -58808 -56303 -45012 -40185 -42406
18622 -42406 -20555 -10389 -23607 -41789 -51688 -53873 -50039 -41799 -20689 -22296 -12655 -15258 -40227
18609 -40227 -46110 -15092 -1454 -14766 -39536 -36087 -14649 -21864 14099 1040 -38035 -25997
18597 -25997 -15526 -2692 -2967 -12318 -13315 -14830 -12439 -4144 10879 12622 -8919 -10933 -4009 -16963
18583 -16963 -43872 -43166 -4781 -13516 -27334 -9084 6355 5328 27074 63649 53346 44877 49939
18570 49939 32115 8873 -315 11172 6606 -12027 -3227 -668 -2716 -11304 -5345 2598 10837
18557 10837 20739 17920 23327 39107 43485 -1976 -4579 6548 17307 23099 14769 -6467 3147
18544 3147 -11714 -17585 -17088 -23913 -1629 1610 -4429 -21084 -31956 -10448 -15737 -8479 -6985 -12543
18530 -12543 -22393 -19405 -27311 -17317 2307 -24319 -42775 -57443 -47385 -40598 -31802 -15378 -12524
18517 -12524 10909 8110 25636 35617 38980 47904 37202 20624 33851 39532 46108 27880 -12679
18504 -12679 -14186 5629 -152 28929 12775 -15957 -2909 -6173 -1966 5839 -294 -16323 -33097
18491 -33097 -52382 -32853 31365 37329 11485 -10480 -28984 -25912 -37662 -32573 -687 -603 -24384
18478 -24384 -12250 20323 24482 3479 -18969 361 31646 32228 4611 -6606 -3358 -11518 -13242
18465 -13242 -25949 -20001 -34051 -22796 -6504 17813 22948 36837 29945 463 -4641 -24041
18453 -24041 618 17939 5739 13991 33842 25831 37003 42492 24537 9228 11842 -3403
18441 -3403 -2445 -19379 -8753 25947 43924 18403 -21407 -39405 -31111 -19593 -12176 -18984 -26496
18428 -26496 -16771 -3695 -1273 992 11475 21641 37063 34695 39857 40131 23290 33044 6670
18415 6670 -6468 -9215 6669 1695 778 15042 11450 11085 -1191 -37043 -33190 -6987 14126
18402 14126 30060 22407 20146 22586 16450 1257 -18525 -54898 -67736 -41551 -39593 -24938 -21548
18389 -21548 -22990 -13580 -23065 -52875 -53893 -42100 -35071 -63219 -53079 -14361 3171 -4098 -21339
18376 -21339 -34827 -7916 15816 -95 22616 32759 27168 32207 15442 -23837 -28548 -19137
18364 -19137 -17644 -642 18311 8926 6601 14623 8827 -6159 -33100 -36727 -42627 -45796 -39636
18351 -39636 -40186 -29172 -22259 -2186 -12666 -8060 10066 5278 -3134 -884 -9361 -430 -1172 -3857
18337 -3857 -2695 -8960 5765 190 -5473 6431 7593 18057 5325 -9285 -16976 -287 -1640
18324 -1640 -22692 -23763 -32667 -19634 -4774 5007 -347 7066 33771 6332 -21310 -16240 8740
18311 8740 16379 34436 54489 63357 47947 35414 25154 33846 65478 56849 35447 28095 5294
18298 5294 -12636 -37801 -55265 -45186 -34816 -20072 -8832 -5090 -6348 12473 36223 27501
18286 27501 18305 3540 5138 17693 18711 12117 -8541 -24825 -34244 -25090 -11747 -3450 14764
18273 14764 30408 29353 22370 35553 14134 3414 -11204 -8000 -7968 1276 -11390 -15574 -19092
18260 -19092 -17908 -14225 -10537 27354 51454 37927 34320 38252 12171 5166 19948 3522 2880
18247 2880 23363 26219 -2443 -16551 -15464 -27958 -34335 -7804 -14607 -7493 -17347 -52173 -29746
18234 -29746 11801 7366 18383 32705 23931 24714 23150 37969 13404 -1568 10625 21184 21956
18221 21956 5124 28688 29814 21409 34885 30681 16073 36913 28121 16797 22018 14926 25266
18208 25266 29039 35189 56080 50947 36135 26901 19569 -2332 -11690 12900 12949 16068 24996 -3274
18194 -3274 -1067 -4483 -29408 -49885 -24995 687 1052 -38348 -13811 36185 38625 39269 49321
18181 49321 36540 -5163 -17584 -2246 29467 32705 33209 30327 45997 70100 62048 39823 21243
18168 21243 5192 5789 19699 22440 35655 35420 37307 48980 51627 53248 28457 64131 96812
18155 96812 95284 109421 107368 88334 78750 77675 66143 71934 78704 72655 75803 104158 104055 84865
18141 84865 90139 103921 124474 113718 99169 113351 156391 168929 160497 186270 200362 217344
18129 217344 259404 268468 303464 344765 402209 475128 526498 598265 647220 721958 777232 899681
18117 899681 1082774 1300713 1573760 1897660 2327248 2954891 3922261 5522944 8363227
18108 8363227 12998474 18337602 21519182 22764395 24213021 24504132 20583787 15742675
18100 15742675 12646505 10663990 9000752 7446332 6179919 5218943 4492798 3912074
18092 3912074 3429257 3055780 2754101 2499058 2297264 2145602 2008161 1905407 1798697
18083 1798697 1699781 1591874 1529097 1460936 1367629 1255332 1189673 1143953 1091474 1034216 982979
18072 982979 946911 927820 874935 822678 780595 781201 775628 722742 679797 657376 612932 570182
18060 570182 566736 550972 540436 534588 537030 502511 491675 478036 457208 440722 440532 424057
18048 424057 412469 423450 422332 404084 393067 387321 367456 326833 287287 283379 300976 276530
18036 276530 254005 257058 283647 289362 270599 230260 198927 159506 159678 174717 186684 189656
18024 189656 191136 186916 201675 230308 228963 217271 187017 192241 193472 169542 141143 113312
18012 113312 120823 133496 136163 142054 144613 153330 130173 132696 145347 135340 100463 96095 85855
17999 85855 68438 60086 64349 93257 86116 44873 58203 83496 94486 97788 96172 80094 63351
17986 63351 66645 99968 118465 106832 112180 116970 98692 72158 37293 27410 35629 39810 14651
17973 14651 7448 15480 31901 28693 23361 45243 74765 72661 64786 70317 68315 47951 23631
17960 23631 7760 9594 34428 52414 70315 69919 64495 60006 24245 191 -1164 -14769 -18071
17947 -18071 -20129 -19695 -28582 -18686 -9955 2621 -3453 -33678 -31567 -7713 13849 6723 -4349
17934 -4349 10658 12780 -4628 -31551 -44254 -37526 -19155 -18018 -38510 -47812 -15485 -622 19527
17921 19527 39536 48884 35503 21608 -23374 -22448 -19118 -27299 -42850 -36077 -44329 -44913 -21089
17908 -21089 -3494 6725 -3512 -14305 -8155 -5110 4574 14920 41104 42524 67962 71653 28575
17895 28575 33311 38224 39004 39534 8063 -14839 -33519 -14576 -6461 -22838 -2230 43938 34590
17882 34590 25070 5235 4382 2273 4967 24570 21367 14084 10768 12922 24929 12477 12458 928
17868 928 -8584 1577 7932 -27078 -47226 -53455 -36563 3142 10024 9287 -4314 -24857 -23937 -26472
17854 -26472 -4323 11172 -12652 -7052 3508 16066 13895 2998 -9450 -11552 -15660 2128
17842 2128 8221 -5010 -11890 -52954 -21057 10412 32825 -210 -32961 -20860 -19422 -55117
17830 -55117 -57784 -54575 -36312 -7375 10032 169 27656 42943 40465 33002 41922 40463 19723
17817 19723 -6478 -15646 -4367 7615 -1113 6173 28835 38993 22258 -12949 -15265 -23323 -315
17804 -315 -7809 -6518 -13795 -3923 16713 26718 42909 46278 27525 1304 -26637 -32939 -27003
17791 -27003 -22404 -36995 -22062 -29376 -35700 -45509 -57998 -58923 -53552 -41097 -30721 -15204 448
17778 448 -32980 -60001 -50355 -25097 -21127 -29940 -30901 -36652 -52752 -60596 -69841 -76080 -59593 -77769
17764 -77769 -107905 -91714 -63480 -56215 -54192 -67315 -54366 -53415 -50896 -37756 -11506 -7017 -13539
17751 -13539 -6076 20201 32687 26710 21018 -8880 -14057 7874 16820 -6276 -8431 -13929 -12565
17738 -12565 3426 4460 -19459 -24042 1132 14500 17093 -15094 -30223 -43198 -49275 -21318
17726 -21318 -2591 13688 10534 -29151 -37719 -17927 -23966 -15273 11455 -10631 -7813 2576 6772
17713 6772 15062 -2553 -15053 14364 -9366 -20306 3951 -10739 -39010 -36132 -26154 13978
17701 13978 18242 9358 2288 3258 15819 17378 13234 -1488 -19886 -19149 -41688 -27491 344
17688 344 15364 28689 944 -3012 4925 10411 5247 -11304 -37415 -53976 -35461 984 18299
17675 18299 25321 1856 -6424 -23995 -48048 -26556 -11279 -12973 -10528 -20305 -26511 -24785 -29311
17662 -29311 -4202 -2399 -12396 -52399 -32647 -17384 15307 39156 49737 20901 16514 11566
17650 11566 -17563 -30109 -17946 -7620 5165 1070 -1873 28576 34335 36311 30051 -1658 -11387
17637 -11387 11533 9522 15375 -13308 -13525 -2541 -8115 131 14347 14900 -10354 -20248 3137
17624 3137 -1167 -24437 -29302 -20734 5821 -4292 15380 27586 12974 -6528 12932 26685
17612 26685 11247 -46 -6836 -23985 -31536 -44183 -51020 -44418 -41095 -30825 -51328 -48885 -33147
17599 -33147 -42920 -62759 -53337 -29600 -3898 15131 27168 15430 -9436 19040 6127 -15767
17587 -15767 -28480 -24988 -6350 7227 9806 24893 61173 55916 49389 8211 -22770 -21854 -18046
17574 -18046 -17450 -34556 -50230 -26438 1825 5683 14915 41780 45683 28807 5574 -8614 -9258
17561 -9258 -15131 -14112 10934 1064 -19300 -20708 -32403 -30713 -18045 -6755 -2282 -2478 19069
17548 19069 7145 5 14204 -3814 2882 3592 22372 40563 23577 10623 16802 -12295 -29591
17535 -29591 -8376 8194 47007 33165 21512 10901 -18678 -22483 -13696 -21277 -25302 2121
17523 2121 2389 30276 46798 42195 30502 -4139 -56887 -61231 -22060 9259 9944 -6383 -6423 6542
17509 6542 22154 34511 29598 22216 40985 26319 3326 -28050 -29887 -12584 10766 -2562
17497 -2562 -8148 -13825 -4923 3227 -12722 -17850 2568 5561 -3108 -34669 -48782 -34572 -58776
17484 -58776 -50555 -17637 40634 33429 8429 -17185 -47786 -41817 -30139 -42392 -32303 -19759
17472 -19759 -14604 -8751 -8598 576 -10654 -13256 -20246 -12063 2144 4255 -11081 -1038 18847
17459 18847 8534 6453 28835 26330 16925 17197 5989 1320 -7381 -24172 -26365 -40715 -37673
17446 -37673 -27997 -20402 -3592 28647 58859 108286 148013 145034 147657 156422 154444 121850 113539
17433 113539 90378 78441 63181 54337 45432 24055 -12894 -25117 -20960 4226 -392 19454
17421 19454 26839 11130 -11242 -36427 -63220 -29551 7553 9418 -6916 -20415 -21410 -4829
17409 -4829 21871 21680 -4361 911 -7944 -16856 -46254 -69894 -37721 -16062 -5737 4599 -25626
17396 -25626 -30315 -29164 -12469 1649 -4498 -19469 -14367 -10226 -22645 -13489 4029 4283 10834
17383 10834 10554 -2492 -29831 -35098 -28410 -27311 -39649 -23045 -41609 -45687 -23724 -7262 28810
17370 28810 32680 -5076 -27557 -17654 13949 25583 26309 19057 8403 2198 20468 45370 46717
17357 46717 22722 -13842 -47214 -63649 -25909 7288 13550 35956 45027 -12069 -31131 -9138
17345 -9138 4655 -7253 -16467 -17060 -20717 -13614 5966 -759 -12882 12307 34364 26041 16079
17332 16079 -1907 -11605 -8168 -11406 5183 7733 -450 -26423 -57637 -84215 -70691 -37795 -10779
17319 -10779 -6943 -12852 -39020 -45487 -25637 -2003 29495 36300 17134 -8340 -12087 858 3385
17306 3385 -852 -24296 -34521 -14693 -1287 21875 31654 9990 -4182 -34086 -35211 -7389
17294 -7389 -5708 -8222 -11567 -22965 1498 8833 2603 30047 13028 -16104 -16143 -13847 -20096 -483
17280 -483 13690 -8835 -4371 17162 26251 6701 9428 17121 21044 -759 15962 11214 22480
17267 22480 32074 37390 47209 44662 31312 12105 26413 24954 -2044 -9781 -35662 -52454 -61153
17254 -61153 -38335 281 2038 -904 17476 22120 -1201 17764 19538 3905 9676 9087 10211
17241 10211 -3879 -7883 -14161 -17089 -33046 -35751 -25969 -17729 -15862 552 10816 -2209 -22124
17228 -22124 -18769 -41294 -22791 5770 38282 27396 6846 10282 34965 40199 31357 19955
17216 19955 32537 34264 35939 31567 34715 -785 -3909 -14345 -33067 -12421 -9955 -22816 -27949
17203 -27949 -25322 -66994 -73792 -74137 -54121 -51980 -53415 -50900 -20843 4584 -6882 -34085 -37047
17190 -37047 -44761 -38066 -17495 -11827 -1968 -35524 -68419 -60377 -43239 -25194 -32000 -13606 3577
17177 3577 -13413 -26034 -36780 -18449 -31852 -13536 7764 15930 21027 4045 -2943 976 9345
17164 9345 8532 6622 -24629 -7578 3100 -8905 -4883 -10332 -13912 -10096 13268 21308 -1480
17151 -1480 344 26437 12301 17195 16898 10049 20251 10250 -21535 -1904 -10980 -21763 1222
17138 1222 7827 30549 61396 37853 3110 -20670 -31754 -8331 -1171 -15601 -15132 -5580 3616
17125 3616 15168 -3318 -28799 -30595 -20320 -18742 -13744 7012 -5472 -13114 -16461 -10796 13793
17112 13793 -13723 -21546 -397 -7253 -4325 -1708 -17445 -21488 -8103 -21050 -24287 8352 22511
17099 22511 19314 12193 -32091 -52402 -60839 -41293 -24749 -20879 -13749 7942 26972 27950 23210
17086 23210 7698 -10243 -41566 -43972 -32690 -27493 -43066 -49275 -51148 -40153 -46063 -43547 -16589
17073 -16589 11914 33056 36249 46751 16722 -5865 -31365 -38351 -29544 -5427 17054 -6959
17061 -6959 -13222 -21547 -321 16487 15549 9669 -9094 -29386 -37086 -50406 -60937 -55541 -40580
17048 -40580 -40349 -49898 -14073 9007 5863 5760 11685 20705 33506 39626 29551 -1619 -7355 -33696
17034 -33696 -37824 -35234 -22537 3391 17655 24167 45374 27309 1458 6823 10464 7767 -20376
17021 -20376 -36077 -28747 -8503 -1791 -12469 -7904 2982 -6308 3831 8205 -6768 -21656 -9404
17008 -9404 22652 33083 26772 25350 6061 -3447 -2069 18674 32242 19913 -28362 -39078 -21010
16995 -21010 11057 17886 3684 -35003 -51277 -32801 -16115 12731 13641 -18930 -34853 -27529
16983 -27529 -29425 -19308 -18392 -28677 -38152 -19511 -21645 -11869 -29572 -56306 -44869 -22224 -9506
16970 -9506 -35233 -29220 -22897 -16206 -16002 -25149 -27928 -23232 -10986 10581 -977 -1916 -4192 11065
16956 11065 22444 14910 25755 54822 67050 31758 10012 25392 28546 17338 11328 -17438
16944 -17438 -3606 46355 40990 28974 31755 27056 33820 27864 -1019 -34522 -34689 -59306 -59960
16931 -59960 -76924 -68591 -40380 -30162 -10325 -8649 1195 -3139 -9818 -10692 -5873 -9594 -13395 -12654
16917 -12654 19939 24328 17078 11334 17190 1606 -15466 -2142 -13303 -42018 -51211 -19200 15746
16904 15746 30798 12251 -8233 -21521 -10600 17135 31198 30352 13577 2498 1524 -16710
16892 -16710 -30336 -16321 -23215 -29718 -5027 3479 -2267 -5136 26631 39037 37380 26926 -12683
16879 -12683 -14478 20080 48157 43742 23901 4661 5102 16734 8342 -8425 -42149 -72170 -56980
16866 -56980 -43337 -30221 -25544 -5767 -12320 -28053 -21373 -33872 -35059 -29074 -21530 -56405 -48879
16853 -48879 -20097 -33596 -41684 -28658 -43324 -21962 -19912 -14262 -7665 3650 -16259 -44056
16841 -44056 -34389 -23244 -19711 -11627 2843 19406 -2403 -28539 -44321 -34354 -15532 -2851
16829 -2851 -4008 -52015 -44185 -27120 -19436 -18268 -28791 -13038 -7386 9483 17667 4647 13979
16816 13979 -8139 -28064 -27280 -11369 5474 27134 21685 10290 -10867 -29387 -13438 -8158
16804 -8158 -35529 -30499 -16543 -19358 -4671 20684 47741 35033 22930 23493 13660 13837 -1516
16791 -1516 -22836 10477 21779 10616 27541 39075 30274 22086 671 -11179 6760 -11974
16779 -11974 -31144 -31023 -10073 -10985 -30069 -24165 -9081 -4488 -15374 -35108 -41612 -46487 -16856
16766 -16856 10364 2306 -10573 -18412 -16963 4805 7840 18814 8978 -9809 -9337 6382 8482
16753 8482 -4715 -4096 -7510 29443 54285 17064 -13791 -29422 -65328 -66143 -36333 -25989 -34855
16740 -34855 -16639 -5875 -15156 -29086 -34481 -18791 8462 8385 -8043 -16590 -16512 4506 -4755 -6164
16726 -6164 -2136 -5115 -12162 17402 15204 -10087 -13037 -21223 -15179 -10919 -442 5500 28436 42612
16712 42612 50568 28412 34450 23972 32651 37856 21486 17751 49415 38730 8610 -2980 -4239
16699 -4239 14223 18012 6850 -11264 3183 6040 3977 7598 14292 43260 19523 -3032 -30331
16686 -30331 -35033 -50183 -46705 -13241 -17831 -14873 -37831 -3359 -3361 -10492 7973 -5126 -18159
16673 -18159 -1316 30385 19394 11760 12037 13715 16360 621 -2775 -13455 -40171 -24759 -10367
16660 -10367 -5158 -31261 -30550 -7905 21018 38028 9286 -13671 16856 5372 -7127 17484
16648 17484 13303 5942 16171 8706 -969 15616 9376 12650 18280 8886 15400 -6112 -31600
16635 -31600 -20795 -6456 -16760 -32457 -9339 23560 20698 2465 -18347 -17524 -5525 1255
16623 1255 -627 3853 20116 -7186 -30442 -4392 -10938 -22618 -3435 -11413 -3690 -3219 -836
16610 -836 9733 17814 12906 28114 30327 23406 27986 23968 18213 -2482 -14153 -4507 19871 22196
16596 22196 18837 32563 26850 -5232 -1444 8045 6495 15723 9472 24824 35467 11448 -9821
16583 -9821 -19822 -28624 -12859 -5638 -9781 -21772 -9955 -9686 -29297 -17295 -760 17634 -1623
16570 -1623 -31005 -12002 -4192 -8494 5434 17129 12343 -14347 -44058 -44029 -55106 -53182 -32909
16557 -32909 -24510 -15417 -846 -16038 -9522 -7963 -511 7522 23134 22184 8613 10382 20821
16544 20821 -5232 -56644 -46962 -6594 4311 3402 17307 24299 31926 31542 -5165 -9169 -5399
16531 -5399 -37593 -46070 -42519 -32058 -24706 -55463 -31412 9097 42340 26404 -9694 -24892
16519 -24892 -26987 -44114 -38669 1605 10034 -7865 -16254 -5783 4639 -47 -11696 -15562 6419
16506 6419 23035 20855 -3403 -27233 -40291 -44040 -34119 -36225 -35843 -14033 23667 62730 66080
16493 66080 57227 53552 46192 26683 26947 30458 -381 16305 37616 20454 -6628 -9922 -6117
16480 -6117 -5260 -6208 -22885 -29638 -11568 -10501 -10206 979 994 -18610 -20570 -11228 -7125 -20589 -22298
16465 -22298 -19674 -11403 -16987 -22399 1147 37421 36317 14736 25336 32518 31940 44035 38978
16452 38978 -1212 -19502 -3282 -11773 -31618 -9240 -4974 -15614 -13105 -6376 1775 22271 2571
16439 2571 -3380 11753 23650 12732 -8622 -21168 -23262 -25157 -36151 -34226 -14400 13506 21517
16426 21517 11051 -5183 1058 -7638 -17118 -29778 -39121 -26038 -15529 4464 -1330 8475 13806
16413 13806 23503 14672 13813 -14332 -25663 -1773 10323 26445 28942 6915 -23204 -27559 -4412
16400 -4412 9429 -2403 -11643 -509 -10599 -28625 -42443 -50749 -75570 -45332 -35201 -40014
16388 -40014 -11029 2661 -12688 -22140 -13736 -4483 5946 27844 37644 38909 29330 30130 25353
16375 25353 30692 28368 25802 20287 1222 -7115 7162 -867 182 1912 -13844 -37106 -21793
16362 -21793 5077 -9393 -4555 14266 21205 18171 18104 10061 8704 19753 13087 2078 -9576
16349 -9576 -8047 -6012 21148 42099 21168 2228 22028 21053 12049 -30789 -35238 -11212 6448
16336 6448 -29083 -41394 -8407 16056 1588 -12108 -5574 -15000 -13591 1498 3926 -3517 -10114
16323 -10114 -7720 -9564 -8632 -6600 -30553 -38433 -2332 19727 22991 6450 -23503 -20944 -2235
16310 -2235 -998 -3725 -20493 -18359 20944 6033 16164 21699 52197 81508 70949 29245 6744
16297 6744 -216 8530 6440 -5246 -19258 5687 16530 20309 37310 43241 27758 43888 53050
16284 53050 41063 36149 6979 10589 20481 26271 22304 28293 29773 14071 2591 -293 -17246
16271 -17246 -25530 -23351 -17326 -12204 -13455 1625 27117 61819 51954 20913 -24938 -41139 -25811
16258 -25811 -6306 9236 18250 29313 34561 15912 8278 -10933 -34334 -29014 -15558 -9810 10753
16245 10753 17187 -17754 -66816 -51814 -44332 -32819 -16688 -29723 -51072 -43206 -14161 -16826
16233 -16826 -9717 21115 23357 11961 9936 19954 18451 17267 35356 64072 65511 47459 19705
16220 19705 11615 5073 4580 1031 7949 23223 28223 1524 4921 -9916 10692 20378 3111
16207 3111 8386 18431 -12364 -18644 -26115 -26691 -14474 -19119 -6499 12742 8770 3307 2520 -12550
16193 -12550 -25965 -30014 -28607 1739 27677 9787 14 -5192 -1994 -23936 -32622 -17019 2762
16180 2762 6796 27822 14403 10906 6604 -5936 2783 13685 -1765 -36280 -39479 3644 25769
16167 25769 -573 -26137 -25396 -15947 -19757 -9735 888 2880 27012 16778 3769 13413 -4612
16154 -4612 -655 7982 1527 11430 -7708 -24120 -8984 -13147 -20600 -15075 -3684 2983 -14355
16141 -14355 -22060 -2888 -14468 -28333 -26974 -28149 -38956 -32657 2808 10509 2531 14996 38028
16128 38028 31168 5522 -21122 -18513 -27086 -55351 -78158 -48784 -11376 22107 22396 1392 -8116
16115 -8116 -4870 20691 13223 10280 -9141 5202 23171 15874 11967 14041 27375 21765 21257 8521
16101 8521 -2062 22660 13942 21007 50434 37217 -2098 -6637 -443 8824 14982 9879 -10458
16088 -10458 -24644 -19534 -17672 -26611 -11014 -6687 -15660 -19312 -38675 -35784 -12716 -12592 -29161
16075 -29161 -14136 -9462 9141 49612 29430 -12424 -9313 -14549 -15062 -14124 3905 6702 -10244
16062 -10244 -26823 -20623 -7936 9855 -29471 -20029 -14949 -18074 6102 12368 5356 9176 28659
16049 28659 57173 77654 43830 27116 14748 10722 4112 -3201 -12513 -6714 5878 -3406 9200
16036 9200 21395 20859 20733 5381 5668 36482 22700 33049 28245 1586 19032 15476 5696 14455
16022 14455 37253 43134 28668 -4499 8403 24064 14110 2688 13683 18114 28877 34671
16010 34671 5726 -5467 -3291 -2178 14292 6046 4732 9075 -11831 -16785 -7915 -15851 -25054
15997 -25054 -14048 -9346 7758 25262 26037 10030 9727 662 -27825 -44291 -35847 -26886 -36220
15984 -36220 -36757 -4380 24688 24832 3077 8524 29569 27446 5888 -19181 -28422 -40233 -49243
15971 -49243 -39146 -33912 -22432 -18514 -37379 -19049 2687 4338 2629 14675 6295 -5368 -10740
15958 -10740 -15280 2875 -34429 -30893 -13345 -5060 -10247 -15231 -14861 -1973 -1865 -24676 -29151 -14227
15944 -14227 -6482 -655 5729 -18226 -32203 -18323 -8793 -9837 -6915 -8306 -17946 -20950 8740
15931 8740 47671 37725 48731 41719 44196 61305 54038 41323 37737 37501 41834 40168 22593 25787
15917 25787 35872 -2629 -23626 -3121 -23627 -31325 -9162 14106 -4453 -4640 17795 37334
15905 37334 8317 -10932 -18150 -23297 -23367 -13743 -2031 29516 12630 561 -6391 -738 -4551
15892 -4551 14868 34019 11350 15698 28361 31837 31266 32215 -7 -15785 -28231 1910 24724
15879 24724 13544 14941 13618 -8848 11753 40006 18562 3087 11666 13529 1763 5494 -22275
15866 -22275 -48118 -37033 -37017 -1453 24489 18590 20522 17649 36406 54890 38206 14251 10674
15853 10674 10173 3748 -8866 13358 23342 29625 16818 13958 7435 -13573 -15743 -7203 -19754
15840 -19754 -45189 -10009 13526 -10150 -21573 -6106 16197 4212 -31360 -55231 -35938 -6016
15828 -6016 -3744 -27535 -35946 -64934 -50578 -58460 -53665 -32737 -20077 -8563 -1131 -33192 -29355
15815 -29355 285 -12059 -31194 -37223 -34317 -39420 -29553 -26522 -33073 -33042 15664 43490 22533
15802 22533 19391 45515 44321 37940 32050 23603 14104 -1258 -2232 14300 20174 4416 2913 24591
15788 24591 6201 9490 28679 5123 -6174 -16343 15139 27429 -4804 -22379 -13118 -21870
15776 -21870 -11243 -2225 -8645 -22790 -26335 -24805 -39640 -45116 -39289 -28099 -17087 -10209 -47157
15763 -47157 -42165 -28804 -20068 -17443 -16716 -8029 12687 14678 -7856 -16647 -32177 -30512 -21291 612
15749 612 28248 12011 13185 24632 27781 8295 -10812 -18958 -14851 -31219 8559 43663 48611
15736 48611 34045 10325 30212 32100 12856 -1939 -21988 -10272 6354 6880 29859 59065
15724 59065 47670 2033 -18285 -3879 -6878 6058 1154 19437 -5944 -18327 9724 17465
15712 17465 -2465 -1162 -5636 18121 35141 25410 16662 14388 14500 20880 -11278 -14372 -15740 -23839
15698 -23839 -30323 -5715 12769 24934 20937 8703 3930 5130 -5857 17232 44246 10307
15686 10307 -9244 8685 32728 27662 38490 22283 21443 29857 23978 35032 32347 31289 5919
15673 5919 -366 -33104 -21301 -12843 -13286 -8405 -21976 -30379 -32102 -43666 -48009 -17430 -710
15660 -710 8481 24051 11324 -14158 -29850 -5167 -26282 -38046 -27989 -32629 -46655 -49518 -29647
15647 -29647 -51642 -65132 -43687 -13042 -23998 -39237 -15655 -1093 11170 17217 18225 28625
15635 28625 24812 9361 12993 19333 18288 14292 -6760 -32315 -34840 -14633 3802 -12610 -32888
15622 -32888 -45736 -34528 -8868 -15509 -20722 -842 21295 41892 32535 30879 28900 55980 42257
15609 42257 31461 28036 29884 17837 6030 12709 10593 20693 26308 17272 14677 4953 8704
15596 8704 -21883 -48242 -57454 -52436 -38079 -32086 -2020 1998 13616 20783 17568 25001 19431
15583 19431 -1249 17802 17403 22696 26448 22803 -8551 -30935 -55142 -28895 -29586 -39107 -67677
15570 -67677 -71387 -30662 -10287 1630 3386 4854 -9491 -7184 -3381 -533 25167 13222 5145
15557 5145 4205 -3908 -20095 -18832 -36718 -42913 -23800 -25188 -25075 -3308 9769 1040 -19262 -19604
15543 -19604 -14033 -14737 -5500 1749 -14326 -7009 15892 12641 30531 45591 41333 21032 2975
15530 2975 8566 17428 12181 40402 60680 37660 17771 7031 10401 20195 30351 56573 50714
15517 50714 37776 57286 48289 22716 12550 10015 -17421 -2392 19785 12498 -7265 -21358
15505 -21358 -57327 -66739 -47624 -49657 -39818 -10421 5782 1772 31073 44576 64155 55147 29639
15492 29639 14443 5042 8216 -4027 -24387 -39434 -41774 -39898 -36712 -26838 -30769 -348 19913
15479 19913 25779 8641 -3719 -11704 -12077 -12233 7545 -3587 -17367 -711 15364 9845 6141
15466 6141 -24485 9059 30979 12562 -10182 -12283 -17267 -6707 20830 22019 20800 41169 31995
15453 31995 36288 31958 11812 25687 49541 60387 51216 35086 -7910 -19713 -4121 -5193
15441 -5193 -17925 -21730 -18591 -17 10286 3973 -28378 -27503 -3131 14096 15940 27544 30815
15428 30815 -604 -5990 4135 4872 -24015 -27616 10242 20589 21252 31132 26878 29137 34573 19695
15414 19695 -8021 -29130 -64624 -69818 -42689 1329 27952 42182 48466 44121 45688 51720 31505
15401 31505 6887 4093 40449 43780 13593 28670 30365 6249 -5703 -3923 -10614 10462 14341
15388 14341 6197 -8366 -1691 -15486 -5358 23096 37760 24479 24803 9464 991 7802 14751
15375 14751 39843 55470 37148 27827 18240 -1522 -6830 -5019 2928 -5722 -14699 -11181 -177
15362 -177 630 1009 2720 9467 -21183 -19173 -6227 12383 22241 31643 14008 20035 26781 29415
15348 29415 -7038 -16601 -6640 22202 17256 3205 3467 -12562 -22691 -11822 -11674 -40797 -39700
15335 -39700 5725 38763 66669 67910 33156 21383 42796 33442 -2600 -24020 -16070 -3541
15323 -3541 -21765 -21350 -24121 -14068 -15410 -33807 -38841 -13497 2021 14368 29546 10112 3130
15310 3130 -12191 -20528 -20289 -30389 -29369 -11845 1839 14207 22584 26008 15310 7498 13365
15297 13365 1906 -41729 -55217 -63624 -51333 -32722 -11186 2926 -2298 -24044 -17078 -37374
15285 -37374 -36378 -23200 -27510 -34509 7707 38421 11054 4845 -22310 -13393 14763 48956 34858
15272 34858 24967 22246 18239 18351 11721 12416 13285 -4587 -6020 1009 3985 20275 37541 33787
15258 33787 31658 39216 37653 23685 12987 19131 23387 38834 21730 -29820 -3692 18644 15050
15245 15050 -157 3741 15038 30403 39943 42271 19739 14958 12916 2499 -16253 -827 -13115
15232 -13115 -4020 22902 21581 -8753 1238 4073 16140 28802 34613 24031 21843 42828 46874
15219 46874 31154 49469 53278 61847 59023 33379 27107 38664 18173 -2905 28719 32707 25864
15206 25864 28244 29961 58939 51645 33020 1568 5662 1994 -31426 -43537 -42209 -40689 -19893
15193 -19893 -14132 -4788 1428 7706 -19933 -9023 -7649 -24532 -31245 -13084 5100 -12313 -5323
15180 -5323 13219 12544 8250 15980 18704 -3037 -22294 -32686 -6543 5252 -5579 -15080 24143
15167 24143 -11388 -7397 16205 23222 5196 -4795 17061 28471 13438 15164 -18560 -38183
15155 -38183 -24190 -15163 -8097 3442 -7468 1548 24906 15145 -9060 -24886 -16375 12997 26927
15142 26927 19589 3819 -10749 -3255 21383 5216 -14108 -572 -1920 -9031 -6995 -48996 -46149
15129 -46149 -17806 5752 -2096 4590 32610 39188 30427 5514 -196 5228 -12803 -21274 -27023
15116 -27023 -23856 -6965 -2988 -11349 -13313 -17037 -9684 -21843 -19198 -7580 7912 -1493 -9716
15103 -9716 9978 36532 50738 51032 60927 51899 34628 18414 32606 29720 23769 9984 14205
15090 14205 8754 -6716 16226 42197 36178 22904 11767 -12048 27341 18676 11348 -6411
15078 -6411 -555 1089 7971 30943 44712 37614 59377 81790 72428 68846 39974 24306 13009
15065 13009 92 7364 26090 17514 12963 -742 22315 29490 -1369 -4699 -2396 8742 -3632
15052 -3632 -5168 -4991 23293 22962 24789 56205 65456 55768 13523 -1689 8519 22350 22477 -1222
15038 -1222 13534 56487 62246 42043 46617 33913 21817 2267 20667 29899 4817 -13294
15026 -13294 -36932 -37189 -47088 -40456 -26003 -27697 -4004 17314 7170 3441 1453 -870 -218 -8955
15012 -8955 3694 7552 2479 8032 43126 32033 12123 -3684 8063 2217 -40 8887 12227
14999 12227 3714 -12939 6419 5887 5857 987 -26558 -26626 -6524 15072 -8865 -36852 -33502 -39163
14985 -39163 -34522 -24962 -22066 -27465 -3952 9920 5329 9111 21278 -3683 -37442 -25497 8594
14972 8594 21107 6503 -3530 -8493 -14337 -5599 -22279 -39588 -43629 -45732 -53959 -25540 -15626
14959 -15626 -20939 -22303 -24136 -20944 -6552 -31782 -25173 -4996 23721 22057 -11677 -20933 -2377
14946 -2377 10155 -2365 -3612 6336 14159 30072 26311 13887 19771 29725 27978 39996 60578
14933 60578 37778 5754 13600 21252 13765 28339 21501 8779 8949 11225 -4844 -23357 -1796
14920 -1796 -11829 -13583 -10666 -6279 -7763 1157 27396 55107 66562 58262 54049 28470 1750
14907 1750 -9011 15743 15899 21888 36875 26847 5213 8201 -5405 -34935 -41171 -47084 -37969
14894 -37969 -7747 8103 999 -21918 -31528 2616 42128 48908 37383 15027 36194 16938
14882 16938 -5467 24095 63933 75899 88441 73384 72945 51223 39409 53506 68524 105906
14870 105906 71254 21295 -13473 -47076 -22737 17082 20255 21437 15651 33515 58782 53697
14858 53697 68487 46163 31911 43215 41108 27647 23929 16577 -5500 5519 34361 17286
14846 17286 6988 33589 53123 61278 69921 50233 24479 -1609 -7714 4114 -12778 -22115
14834 -22115 -9511 5103 -4135 -10410 -27988 -20270 -6410 -5419 -15138 -12442 13547 9328 8489 11041
14820 11041 24086 50520 49440 26905 7607 -3636 2537 26439 47151 61259 73945 51490
14808 51490 53612 33280 9960 6389 18707 25918 14534 -18163 -13135 -18404 -11787 -6896 4306
14795 4306 18092 -1523 -20873 -13736 6247 9096 50856 53003 21087 37308 35788 34553 33713
14782 33713 14679 22385 41611 46074 58032 53199 42258 22825 20257 20859 1236 9073 12203
14769 12203 -15160 -27743 -12847 -16862 -38094 -37935 -35520 -29744 -26466 -26680 -29403 -7284 16225
14756 16225 19803 12018 31458 21386 18537 29046 36386 -7403 -12272 -12775 -3228 22307 26397
14743 26397 51684 22557 911 7177 8917 9818 13573 14813 10540 8546 -23469 -2046 16323
14730 16323 19403 1336 12046 34991 23572 -23382 -34020 -20924 3506 18386 37333 1920
14718 1920 -6379 11944 9179 -6463 14956 42792 31954 20647 37030 54689 47240 17258
14706 17258 26866 35388 18477 14430 -3672 -5032 -15267 -4505 2238 21635 16878 25436 30524
14693 30524 42143 36385 55762 64879 50942 55359 38873 7886 890 5293 14419 29056 33478
14680 33478 43433 31074 12152 4173 22521 48033 35975 12489 943 7113 11899 8671 -1888
14667 -1888 28784 36227 32806 25894 26082 10167 5838 14868 17604 28789 26198 4325 3249 27952
14653 27952 47190 14838 -11360 2613 25474 42765 29444 11631 -15315 -37633 -23297 -25770
14641 -25770 -34217 -33491 -24873 -10996 -8954 -20225 -23912 -31630 -26926 -27335 -46409 -25959 -6644 12245
14627 12245 30315 21288 5984 -3164 -18011 -10299 11274 10878 -11436 -15332 -16767 -10572 -3574
14614 -3574 21920 18677 7308 27176 23302 22746 33914 30513 24722 7807 479 10026 14455 31409
14600 31409 41404 12451 2640 -561 -2478 -24674 -43912 -29072 -7896 12552 35484 34743 29578
14587 29578 24772 31950 38061 56185 31528 -9310 8772 27528 12198 13076 17931 25953 17262
14574 17262 982 -5605 -2942 5134 23307 47216 50588 17655 -4295 -3 -4910 -21724 -42269
14561 -42269 -475 34739 37969 7493 -276 10202 28251 42025 50674 53324 39640 15043
14549 15043 15528 17100 27855 65548 55267 53797 56068 56437 27557 23474 21115 46738 29283
14536 29283 3377 -7081 -12926 6077 33743 21686 1564 18970 -1480 -3407 21921 32046
14524 32046 6721 24198 17802 -1148 7637 29790 27827 34 8532 3904 -22328 -22382 -10203
14511 -10203 13288 41254 40689 28718 16678 1994 -1371 25722 30982 34728 24611 39581 17150
14498 17150 6998 3960 -5963 13432 48639 61284 29144 42395 48289 47692 37363 6088 -8052
14485 -8052 10213 10520 36147 65730 83750 72185 49892 22072 10120 20691 31222 33985
14473 33985 39262 29319 22295 55066 52552 34983 19441 36745 30789 27066 8914 1132 23321
14460 23321 33878 26468 6846 2595 -13620 -12812 -16145 -1256 15235 -2144 -12199 11180 37476
14447 37476 37813 11084 4490 27583 13281 17917 6112 -17883 -15004 -24775 -19151 18851 29856
14434 29856 27737 15765 15819 24437 -4749 -35706 -20865 -11401 10495 21886 40109 41347 26423
14421 26423 32602 57177 42916 14157 26240 47906 47079 45109 18778 -3055 -8466 7944 13948
14408 13948 -6954 529 39316 34733 30100 37378 20144 32783 23252 31208 21678 13544 29538
14395 29538 21210 17072 38669 40741 44954 41583 21714 24115 39519 35977 6281 -11023 -610
14382 -610 14597 41128 56967 55222 60075 52136 47545 51476 21273 18570 3734 127 7335 30342
14368 30342 25878 25642 23775 7487 28042 51146 39886 21099 42658 40218 24082 6269 17634
14355 17634 34145 29774 1237 1842 7346 26680 39369 34341 41156 68005 68876 46126 49617
14342 49617 54546 28174 7027 8079 13186 38367 29194 31202 21391 19794 8070 -13483 -27867
14329 -27867 -23806 -15668 11145 21688 12609 1305 10910 11854 21904 25553 2721 -33324 -39087
14316 -39087 -40201 -11023 40517 54815 45684 54512 33528 11565 22572 29193 27190 40159 46114
14303 46114 28947 16771 12569 41850 54003 60283 83455 52448 42988 25438 37151 29367
14291 29367 25299 19497 22911 31874 10247 12530 35422 46901 73865 86966 77140 71204 83765
14278 83765 51564 50298 42015 5094 -8384 -14505 -34154 -13220 6208 16131 18880 18185 46576
14265 46576 44729 58406 68835 55408 47679 50421 15947 4925 -41 17939 19428 6554 23226
14252 23226 42068 45538 63107 84839 97101 78039 63536 50452 26536 44522 62547 59280
14240 59280 56771 34303 28787 47269 56864 25674 17860 25924 47967 53629 40543 15117 11914
14227 11914 32205 79822 72508 20692 -4771 18989 29957 34130 45875 68035 64712 50858
14215 50858 26055 31973 43561 36580 26093 -17058 -5320 6943 -350 -23368 -17651 -11364 -10102
14202 -10102 9151 6614 22049 5187 -24680 -12034 4736 -17185 -12608 -25343 -25020 -32506 -32610
14189 -32610 -39562 -27211 9621 37069 46507 38359 23545 13812 -3715 6806 7887 6982 23545
14176 23545 4485 11112 21569 27108 50719 44904 41651 14252 -10089 -7018 -8168 -33657 -27666
14163 -27666 26065 43523 31360 14555 19404 11413 22196 14366 14929 32487 12282 2859 9573
14150 9573 -638 3454 12950 6875 13199 29062 37858 8274 -5051 -9899 -11930 17701 51703
14137 51703 44476 35087 34976 16554 10139 16878 57493 70178 86823 102000 68523 44751 42047
14124 42047 37171 44929 37812 43225 41656 51862 51996 5515 5822 7065 8048 -17134 -20383 -31573
14110 -31573 -4374 21368 -1440 -170 11582 -4408 -9839 17699 44304 26698 13035 14977
14098 14977 15334 15746 24423 33388 19466 28287 41270 32902 12171 -5374 -8592 -1838 -13729 5268
14084 5268 32033 27662 15834 -12124 -32921 -18606 2911 31818 25578 12302 31496 41645
14072 41645 40138 31340 20268 10306 8442 21058 34727 43434 33609 30127 47234 45333 36363
14059 36363 42640 44895 45188 16979 -1656 -6310 2596 51478 80587 75784 72571 76695 85316 85710
14045 85710 51661 24425 8833 15162 30643 17421 28764 56930 76012 61099 15143 4862
14033 4862 11248 34645 19771 24563 24260 35770 52701 48989 40425 32048 64395 83523 104058
14020 104058 98631 96319 80115 80353 81359 49244 51355 56594 36692 36242 48543 42863 22806
14007 22806 5929 11310 -6686 -10835 671 16480 35605 76764 90959 44625 39793 25190
13995 25190 -5 -2681 7951 2448 9616 21194 39638 52811 42553 26015 27328 25981 15979
13982 15979 5098 31781 30164 3709 -7716 7910 39448 65071 55260 43497 35472 18025
13970 18025 21120 57091 65559 59964 48258 40991 22616 20855 14627 23 -14332 3025 7950
13957 7950 25357 31949 42038 46758 41304 53811 73186 65524 61085 46592 57811 68293 59750
13944 59750 53616 58314 47047 60749 79862 61757 72541 80060 75757 73988 64160 37711 14275
13931 14275 42666 50459 40436 43622 51505 38588 18225 20177 15285 16835 27676 33136 13765
13918 13765 -6598 -6387 31268 41550 16991 18015 35817 29423 719 8991 23779 58740 39490
13905 39490 14597 5470 -14795 -10933 -33 6311 36538 38735 47880 40616 51673 56451 50055
13892 50055 37007 55576 45218 54619 26098 35174 46641 56410 36946 56018 75566 57042
13880 57042 58740 61889 32195 4236 -4785 17565 18804 15950 23719 21191 8041 10236 28848
13867 28848 51361 35322 24828 26288 33738 31367 17092 32804 28105 12897 18357 2796 23429
13854 23429 27993 34524 38315 54723 67843 86343 65428 34936 30323 18852 17564 34959 50671
13841 50671 34500 19482 38863 39589 17440 1526 29596 50505 51544 59401 52725 28917 29045
13828 29045 -710 -7406 13475 20360 13220 21123 21725 21497 3433 5320 3460 3316 17764 36667
13814 36667 66068 56820 73813 59773 36667 17332 20611 13738 19385 40750 49140 46580 51101
13801 51101 54359 66493 91516 93167 97856 85644 82268 64881 67425 91861 73307 50605 53216
13788 53216 32679 11669 30719 52356 38569 36914 26614 9750 21771 7177 345 9142
13776 9142 10032 -17695 20785 62498 63033 35210 30659 18249 46624 39452 41751 48316 34177
13763 34177 21004 -15253 -22758 -3023 6142 35163 36970 28199 -2114 -14365 30478 51832
13751 51832 31253 20182 3918 -9366 -39885 -27138 -993 4335 33748 54544 28460 29452
13739 29452 54571 79630 81172 42445 39316 55955 30687 46236 52629 29561 3839 1137
13727 1137 2217 27550 36319 5060 1219 9629 22260 33719 7305 8596 21205 63134 61865
13714 61865 53003 41022 1717 -20363 13255 28162 53485 69289 66126 69163 63597 80462
13702 80462 68685 61976 72780 80432 81023 88722 63656 53451 74747 45763 44033 60163 70689
13689 70689 54310 36348 24854 57485 65869 42059 24910 3721 4859 7254 29115 49048
13677 49048 42259 28875 41969 42309 37155 23358 16558 40012 47334 53142 57024 44693 38466
13664 38466 40696 22175 15167 6083 25724 44320 21028 16517 23443 36515 37848 27175 27039
13651 27039 27739 46057 38854 20881 17028 24436 44245 58168 87728 57405 26538 29168 45930
13638 45930 49561 63341 74605 101444 89760 69554 59397 54354 36879 29820 12710 -4571
13626 -4571 -15026 -961 -3821 -23725 -23938 -13706 11058 -3290 -3010 32807 77821 46799 34263
13613 34263 44019 59670 57917 38938 41709 48925 43086 48114 29460 28035 51954 68845 51915
13600 51915 43273 33378 37604 45781 76584 82731 58816 43313 53275 49490 41724 37695 43768 39613
13586 39613 38346 20108 5457 12606 17801 5446 -2954 7293 34050 46177 31661 -6405
13574 -6405 -19885 1974 10183 11958 11760 14979 24016 49876 52410 45018 42667 58966 63016 59079
13560 59079 37813 30009 55558 32038 53477 49488 42278 50525 40162 21922 14819 28449 29669
13547 29669 29353 29985 35651 40877 47983 45810 36814 34603 26176 8109 17702 30714 19610 39361
13533 39361 45852 41313 61948 75196 65608 59856 80338 64740 15243 15326 24753 21581 19913 28885
13519 28885 32047 62842 69044 48940 37204 41493 57622 62558 104921 106722 47178 37273 44442
13506 44442 24953 -1761 30261 28989 38662 31045 8805 4483 27584 63141 59313 25894 17655
13493 17655 30335 19211 20995 41453 57311 60061 57314 43357 47204 41690 62026 61651 50348
13480 50348 51007 39650 37159 47916 55952 46597 41467 44037 26466 20302 10934 61465 83005
13467 83005 80633 56595 33758 20021 22019 41862 45260 36679 36812 14754 7112 10746 11460 36882
13453 36882 51467 58988 59244 53480 57896 42029 37368 33903 36860 31916 42444 50757 56173 67936
13439 67936 76609 82748 85464 73440 90811 87839 103956 112278 84873 70833 89522 92709 97155
13426 97155 90769 62851 65542 49033 56658 33793 27620 47714 53622 51161 52016 52670 28901 34440
13412 34440 54032 93840 94479 77449 74390 48067 20163 48719 79127 84997 73170 49152
13400 49152 34110 69444 62897 53234 46934 42703 39631 54792 62811 84736 66504 49728 47260
13387 47260 45772 32051 36778 33777 46941 71228 61795 41381 45914 36696 51648 68066 58236
13374 58236 31507 31039 57942 59488 60035 58726 43914 50570 69108 82807 68573 49742 45101
13361 45101 63295 71766 51400 43726 35159 31386 50613 54804 48293 20836 26140 61063 66095
13348 66095 59020 69634 58472 23088 17922 5872 35009 68059 68420 48310 48371 36232 28880
13335 28880 48466 37742 32052 53089 56274 42085 44752 26512 23528 19183 15922 40876 43305
13322 43305 62165 76943 70776 48369 64968 62202 39913 12574 33736 27974 30422 37929 38479
13309 38479 55580 55752 55529 52534 58364 58019 34175 9241 -14576 -7985 9723 30734 42880
13296 42880 39014 29470 15497 20698 20580 19026 44803 64957 91795 115983 118791 72478 78023
13283 78023 89558 81520 58671 36897 26547 14372 35836 41571 48691 51467 19034 1016
13271 1016 21573 33685 32940 32386 20495 49324 88933 95013 91348 71258 77998 68885 63046 67004
13257 67004 42586 49606 72044 42994 47421 69968 73678 86195 105973 105391 95967 72788 67699
13244 67699 76028 81780 82329 107267 78705 37560 35080 44839 38002 16562 12359 62296 111618
13231 111618 108125 92282 79886 64224 94865 125982 119452 102568 80191 88942 87849 93085
13219 93085 80972 72509 60954 49541 45066 32325 43729 66251 86547 77345 93149 107914
13207 107914 79458 57157 59012 69150 58931 72395 83970 88061 91591 92133 91026 80849 71659
13194 71659 66294 55802 37515 43279 83667 88879 79277 87938 96727 77721 77641 100561 96526 64615
13180 64615 68333 65186 24354 5846 10266 31496 67308 92910 88048 94216 85172 50307 51944
13167 51944 64992 66641 34251 19249 57342 104233 105941 111596 118749 123205 106702 92645 56768
13154 56768 46742 50700 71178 102545 76938 64620 80058 77622 71002 81616 80610 72732 63950
13141 63950 66489 69128 63313 75008 79961 92900 81097 86627 71817 41940 29670 46299 72889
13128 72889 67803 69454 50032 51099 65146 74665 71706 67843 93896 93628 78340 67630 58314
13115 58314 61240 84563 78242 71252 60604 73154 83100 79032 77644 85840 114556 115211 93563
13102 93563 93536 100127 134875 149108 131832 130293 138419 128131 112289 90327 89452 106300 104882
13089 104882 84504 74543 95573 78733 43423 54970 97198 130383 104985 80565 87175 87471
13077 87471 58968 42413 50317 69754 81346 66010 72573 89723 82553 74022 82507 91263 82735
13064 82735 69090 79437 119607 133328 111032 85010 86783 98722 98667 82694 79556 100854 84369
13051 84369 72792 73770 61554 60037 68584 95688 98122 105927 94265 107109 133073 112057 86874
13038 86874 95869 76833 65272 88267 84121 100229 90015 76408 84857 80711 57957 48088 76602
13025 76602 98161 121869 114508 91343 78321 68814 65604 66646 92536 73671 50397 81969
13013 81969 124560 148316 128160 116101 129929 156575 177565 149224 140131 132660 132758 105074 94715
13000 94715 113835 113782 90423 104552 130941 109692 106486 91716 86775 109787 106967 100050 134055
12987 134055 160178 150742 141844 119721 122868 142015 167359 176910 188493 193521 169121 177897 197088
12974 197088 181323 189463 163460 142255 113643 82865 97554 114718 107402 133582 133941 160611
12962 160611 177927 167131 159860 185298 189408 184044 193161 263469 320578 347479 392709 499240
12950 499240 642888 863262 1122717 1393606 1672552 1917794 2049098 2047604 1973187 1774057
12940 1774057 1542648 1325140 1127079 985996 861288 719486 631299 551576 484587 442513
12930 442513 416791 396159 380196 348799 295089 267150 281445 279235 265808 284263 287924 272150
12918 272150 262287 249615 230439 210337 196232 186892 169647 183465 193531 193139 198406 181585
12906 181585 163118 162724 178884 187698 181225 187738 193481 199794 195306 188581 165194 131238 139998
12893 139998 144843 131074 134972 146297 156507 145724 136164 121956 128633 120054 128432 159216 174703
12880 174703 150353 150456 167317 184043 163072 154223 148367 168974 151220 123667 126143 127217 126373
12867 126373 133275 137151 117024 121370 136623 129716 150356 165309 146637 143475 159458 162622 162484
12854 162484 169970 172123 202743 206499 215589 224781 224415 193893 178345 166523 153993 155703 143026
12841 143026 150844 163653 175416 173566 169985 153677 123570 131462 175574 189835 182811 159897
12829 159897 161081 176148 168736 175438 174852 174486 183686 177960 205826 190966 188313 190819 181927 170993
12815 170993 181929 158386 130268 136735 147014 160228 179397 198539 198622 203582 212098 206571 215703
12802 215703 237758 260580 226406 180447 178642 169551 149901 111448 100789 93091 76406 83071
12790 83071 93193 93121 92386 116241 134840 146953 143441 115454 125524 135522 164929 173176 177768
12777 177768 180863 180896 179175 189050 196641 187091 178783 185237 205613 217882 223106 208196 211707 248238
12763 248238 266356 303664 332291 384902 410229 418054 408585 393334 376297 376914 365771 341377
12751 341377 302237 269086 261246 283007 277812 270320 291625 307500 307940 308426 311226 326420 323719
12738 323719 295736 298135 303041 282256 295466 287654 275523 253550 242117 253480 288615 296274
12726 296274 297598 286752 305128 290091 287335 291705 318261 320172 320620 308835 294766 307069 292988
12713 292988 286335 318677 331821 303484 267205 269186 266956 284655 285858 275404 263011 258831
12701 258831 270911 289062 290839 319023 364370 428205 464413 477542 482754 487225 503723 502843
12689 502843 480486 448039 444534 454807 441775 434919 437004 452889 447957 395801 404412 418299
12677 418299 401277 397209 394748 406654 405375 431784 441480 452294 428712 422850 432461 469729 540235
12664 540235 604557 645802 692657 751293 741644 705434 661180 589989 542758 492891 421775 385837
12652 385837 369857 360958 341585 329425 325039 331494 329836 340173 362176 385575 385390 401684 419597
12639 419597 420065 448433 475184 525518 579530 632276 717809 798659 833973 845232 873283 894400
12627 894400 910243 928393 879781 819693 776643 750057 726581 699799 687675 690290 679522 682894
12615 682894 698340 732324 738797 740740 754567 777068 791438 792912 779503 770047 765988 749613
12603 749613 700696 704309 719336 706891 692240 697729 701071 723011 745657 741335 723604 706942
12591 706942 715078 716280 729781 730151 712689 712170 738795 764010 783899 798308 802402 816642 830543
12578 830543 852215 883384 893883 925814 941300 957453 989707 1023867 1074211 1124202 1159662
12567 1159662 1193353 1256267 1293731 1326719 1364713 1397414 1433952 1465077 1505200 1542639 1582957
12556 1582957 1620833 1645022 1674347 1705065 1692461 1709610 1731601 1730709 1736620 1774622 1843430 1926795
12544 1926795 2032316 2166818 2289670 2433616 2629109 2814591 2989935 3169006 3319531
12535 3319531 3488835 3697235 3942236 4219762 4507278 4839316 5232665 5700838 6247834
12526 6247834 6876162 7633521 8466495 9431939 10556938 11826005 13268166 15039161 17177791
12517 17177791 19805506 23129768 27381687 32979211 40515205 51116871 66629840 89804381
12509 89804381 123506996 168578116 221669226 275392820 321112967 351967412 363436295
12502 363436295 353818585 325417641 284870030 241130436 201457671 168537894 141790808
12495 141790808 119838094 101821329 87209544 75462832 66130410 58627073 52509512
12488 52509512 47497402 43365000 39939475 37064363 34607758 32500410 30648135 28988860
12480 28988860 27491277 26095451 24763359 23503195 22319166 21196318 20125136 19113516
12472 19113516 18191884 17332885 16529540 15804774 15152805 14580369 14060850 13580034 13139202
12463 13139202 12664729 12169580 11695024 11257953 10862748 10454902 10056718 9683547 9335503
12454 9335503 9040761 8769053 8506600 8269056 8033033 7792837 7585572 7385614 7190981
12445 7190981 7006563 6832393 6653568 6466486 6280286 6076934 5913365 5740753 5611715
12436 5611715 5452537 5259496 5074188 4916098 4778083 4654662 4527787 4405261 4300702
12427 4300702 4195411 4092208 4036501 3953923 3870244 3787018 3717735 3654313 3566479 3452878 3384016
12416 3384016 3303211 3190776 3097692 2974137 2852742 2772764 2689616 2608486 2531585 2465438 2407186
12405 2407186 2323448 2236924 2188720 2158937 2134705 2090942 2020457 1981945 1915611 1851958 1816057
12394 1816057 1787860 1792643 1771372 1735558 1697378 1666579 1635309 1591408 1510107 1469933 1445364
12383 1445364 1403482 1351591 1276154 1192833 1099872 1018431 941456 833343 752471 699749 650515
12372 650515 635409 642417 635265 632966 651328 658246 647812 630434 635294 648874 636286 633820 624086
12359 624086 596560 572237 570422 565664 528758 466505 412476 353761 259353 196903 126252 53917
12347 53917 -9974 -53714 -44840 -16129 -12544 20862 72397 103370 128428 146188 150399 149512 163022
12334 163022 152375 168782 152910 132609 136737 143482 162419 137419 123107 117443 119120 115983
12322 115983 107571 131247 164372 155532 88985 64365 25386 -23368 -36230 -35179 -20933 8665
12310 8665 49458 74807 86049 120879 132127 131150 131116 146888 162069 154990 166762 182444 180732
12297 180732 158534 131935 124117 113428 139271 159098 168481 149291 154530 167748 202696 232138
12285 232138 234117 227650 247700 247630 261005 274933 287928 293349 278886 259053 230296 226114 210372
12272 210372 198875 215561 232645 223712 217326 216078 196244 205478 197999 216683 231563 244633
12260 244633 241155 235607 270810 291326 311408 329213 317444 309512 304157 288652 301180 316420
12248 316420 305461 281895 261331 269698 254925 225114 229863 244473 237908 226119 196160 175032
12236 175032 172600 155557 134567 138858 135649 129772 117624 136111 137556 150801 125805 102358
12224 102358 90643 119634 140348 152681 146802 151710 183337 178649 177269 183990 169386 136251
12212 136251 105680 69425 64040 69851 36683 3281 3893 9807 13181 9059 19211 20527 29632
12199 29632 34366 26664 57753 63360 70568 54541 8528 -30287 -35443 -10336 20204 21320 -68
12186 -68 -13450 -18563 16079 18638 23319 58503 73928 52873 36304 58541 48335 28533 28288
12173 28288 24833 8526 -8057 -3629 -6658 17912 9515 3419 -6126 -26169 -12107 6712 -3290
12160 -3290 -13064 -4466 -30187 -40657 -6446 -19664 -5796 -7443 -26000 -36732 -38835 -47724 -48362
12147 -48362 -31081 -9084 -29359 -34534 -11776 -4576 14092 7409 -16821 -6202 -3899 -874 44278
12134 44278 54444 41738 39074 31179 18931 26061 38877 8167 -9341 -15699 78 -5976 -18376
12121 -18376 -4948 27379 27681 6296 13497 8312 4664 19333 24067 23985 22555 4929 -4874 5417
12107 5417 13787 -18033 -3723 11836 21944 -4504 -28098 -2739 4257 -22075 -14482 -10080 10233
12094 10233 34321 406 -14501 -5410 -2340 21460 37988 27404 37949 2568 1651 17864
12082 17864 22415 9858 36495 38385 39475 47657 50494 27382 16821 60270 75896 84251 111780
12069 111780 141472 184779 200097 211329 257124 334886 431069 614791 842484 1110248 1421526
12058 1421526 1719591 1907131 1981805 1941682 1804711 1605163 1382280 1165382 999797 845546
12048 845546 686026 564533 484585 413202 372463 317591 277275 248944 222104 200801 168131
12037 168131 177864 202628 175733 153903 152225 131740 133299 149651 141035 132159 131622 110732 99449
12024 99449 101697 129372 125324 92090 91956 96170 93235 77175 71719 76664 85259 108164 88465
12011 88465 112227 149481 175111 173883 174992 164831 184495 189081 195289 181491 184273 187132 171025
11998 171025 160780 143024 136552 129217 121265 95856 113395 113320 96658 92312 109756 93992 112240
11985 112240 125409 123900 135615 168249 191799 184152 171089 149219 155035 194968 241239 237398
11973 237398 204259 193807 161245 157448 161917 205363 197143 172061 168350 153017 104135 82537
11961 82537 89590 99324 90142 86997 93976 54198 54676 37827 56389 68781 60304 68269 75281 93209
11947 93209 142303 148377 159780 163609 144634 140993 156759 151767 154548 117584 70292 65445 83313
11934 83313 88595 115037 118927 108721 99823 97786 86731 61340 38129 43151 62978 60702 67027
11921 67027 93882 71597 29839 14732 17765 13888 16906 13530 -3788 -20975 -23465 -20559 -12189
11908 -12189 -8804 -13230 2268 26489 6750 -15635 -9014 -6535 -10759 13607 46237 20667 -4822
11895 -4822 -18846 -6269 -11725 -31614 131 23262 25782 28965 32705 36786 18772 -13538 -13276
11882 -13276 -10745 -8432 -6396 16391 22102 -30100 -31396 -18756 -37152 -49162 -40069 -21584 -417
11869 -417 -473 -3942 -13869 -14789 -730 27055 1928 -17696 12338 52640 56886 49255 20608 -8465
11855 -8465 -24933 -9563 -18567 -23293 -21266 -2544 26301 33834 14809 21635 20922 4925 28028
11842 28028 15929 -5847 6346 6894 36992 54052 62349 47287 50665 62123 42451 12447
11830 12447 18965 34040 29964 48163 51809 36987 1808 -18646 3077 -3668 -7692 -17345 -7116
11817 -7116 24280 7328 -7635 -15798 -10427 -455 28493 38284 21878 19195 36118 23232 39883
11804 39883 52542 59416 50608 35563 6778 -14873 9075 29766 38947 31594 7638 -42952
11792 -42952 -34469 -14834 -7497 3533 13094 22397 33026 48911 57227 46539 33907 35192 33869
11779 33869 27184 46553 44398 32430 37965 42923 28023 29355 34327 21678 29774 43093 65012
11766 65012 83610 72680 76229 102788 92779 81117 58711 53369 59105 46541 36281 23537
11754 23537 12605 37374 54517 33265 16027 21379 46117 56335 35370 11669 -1171 -36906
11742 -36906 -22703 9922 -448 -3103 8669 1563 4493 33707 78946 95370 86486 93504 55785
11729 55785 49049 60384 48418 26534 35759 29518 -10620 -5863 6731 22536 46329 30578
11717 30578 8505 3643 23383 35183 42981 19277 7563 25453 40658 37278 44046 55587
11705 55587 45047 33992 19115 19545 51048 65836 52136 53025 55427 16275 20149 30008 11984
11692 11984 32687 53548 40729 61211 60114 32233 7171 5104 -7189 12794 14403 23881
11680 23881 6201 -6777 2297 9004 12500 19019 32438 50414 40676 32662 57636 75874 79944
11667 79944 82182 87560 72989 78953 71060 33112 40818 29679 634 -1538 -4060 19147 33677
11654 33677 36940 34813 26662 16718 7058 5074 -9819 -21307 -10326 -5919 9659 13830 2676
11641 2676 -2801 10209 18234 13096 450 22089 18695 20314 16651 -13733 5458 41839 47664
11628 47664 46283 57463 30448 7253 33275 52984 68258 57741 40065 6114 2836 3234
11616 3234 -5890 13642 61434 71716 41107 3720 -8916 1469 15112 12674 455 -8435
11604 -8435 1609 4471 43702 59253 64507 65440 77200 62826 62150 24626 -7605 15005 30824
11591 30824 21004 23699 61244 98539 94682 66733 51759 31618 17587 15334 44604 64422
11579 64422 43067 35021 21387 52222 57270 49967 29930 23180 28792 24118 20806 11984 -15076
11566 -15076 -34384 7611 17499 648 -940 -12777 -30542 -18105 15136 42016 46813 22295
11554 22295 13848 19944 28818 31918 60859 26520 12456 43676 44299 46795 44833 68566 99634
11541 99634 128290 111791 44887 30780 42081 39392 41394 33152 13191 12212 27540 41009 54056
11528 54056 56516 34517 18593 34526 52494 52028 51619 36906 43457 44155 43869 45984 52621 72961
11514 72961 85823 66886 47857 63061 48968 38354 13796 21301 38935 55530 66280 74974
11502 74974 77653 88666 70437 40604 43521 65817 65191 70095 52317 35250 26236 40994 53230
11489 53230 36573 26075 17848 13678 15660 3594 373 3462 12324 17145 31239 26777 15067
11476 15067 21312 15658 38338 73014 74688 63410 70934 53315 49956 87811 82728 61769 66174
11463 66174 101848 122019 127141 137471 119100 90779 68879 71597 59708 39125 26915 19608
11451 19608 -6946 4229 42193 48237 77814 89641 89813 63354 81891 61255 57554 50494 34610
11438 34610 46562 47293 41048 24682 32640 49230 48930 57429 40576 46455 53492 75898 88458
11425 88458 72436 86318 78631 50393 17961 31372 66041 73681 61572 59579 76076 97216
11413 97216 97840 84006 63091 73042 79344 60948 58854 37881 53126 54003 60760 57991 43606
11400 43606 23926 25927 42087 64238 70995 56715 29127 48853 65430 51719 45967 29233
11388 29233 23533 742 19809 31621 59627 68180 69222 65986 53592 54069 53701 72925 66792
11375 66792 54708 40323 47604 56593 43866 38065 41571 47656 49496 38546 18058 40364 78125
11362 78125 75944 39748 37639 38513 54664 62422 67459 87109 88194 85022 64487 55450 32809
11349 32809 27440 32762 32379 44889 58141 57557 73973 97155 85532 73495 69914 75708 88525
11336 88525 103631 98198 108409 105603 95472 78202 57625 48428 44894 62638 63414 62998 80294
11323 80294 101364 116075 124665 121779 136808 115435 94305 79771 71269 94342 77507 72101
11311 72101 100087 85693 86576 79430 78217 80797 65543 62541 73593 90642 106762 118028 131213
11298 131213 142242 147503 131252 109858 102324 96374 106768 83221 69333 62598 66750 78768
11286 78768 78197 76651 73581 79748 93283 74957 51541 49109 48220 70981 64489 75221 82661 83653
11272 83653 73642 58109 60172 75549 84514 73462 54084 76186 103315 132742 143680 128098
11260 128098 107196 132387 126093 89581 73132 90118 97557 68891 72033 87107 76267 85135
11248 85135 66473 57281 56642 75547 121646 137721 111965 95205 99255 132634 129505 121497 94250
11235 94250 78351 95998 118660 132310 118055 103857 92918 108966 136258 136687 142314 139492
11223 139492 122586 123159 133439 108888 82478 77880 88331 87329 91031 83809 82667 87234 91886
11210 91886 82861 79665 133421 171614 159131 147633 153417 141391 134221 127130 107931 103119 100591
11197 100591 95362 121276 117626 102694 96677 124233 141899 147265 142911 98447 68006 87507
11185 87507 110847 85346 86870 107525 137311 124561 103426 124368 148895 165719 160647 139532
11173 139532 127910 125750 148035 147221 129868 107992 118922 144322 125714 112600 146626 150975
11161 150975 133457 120339 107089 119200 118577 99464 97984 116943 134323 150999 140173 146089
11149 146089 147806 127140 119884 140714 146517 141779 119920 115091 121133 150591 140788 141629 122726
11136 122726 136078 165330 147968 149520 137697 128658 130573 126262 121379 86563 109678 138853
11124 138853 128242 143068 180310 171549 189478 176425 119895 118006 104180 102758 101434 130035
11112 130035 142229 144483 145467 148682 144870 146164 135846 133292 127498 126751 137927 135859 152482 168579
11098 168579 158815 152268 152200 179107 192248 186508 156746 119817 128573 140099 132128 140096 152837
11085 152837 162922 180115 176780 172553 137194 140970 133422 125263 163698 199363 202536 178702 167608
11072 167608 188580 185722 179227 167732 157161 160958 163137 171165 148407 131985 138251 163920 168096
11059 168096 162141 138261 119550 133049 179628 180517 174731 178989 179747 152974 133927 144864 152471
11046 152471 148488 156812 173543 176680 206837 210199 199945 189169 181702 161102 133121 147646
11034 147646 163075 148134 176097 189997 175912 170751 178790 184976 172378 183286 180134 159874
11022 159874 174641 182536 170442 157720 154266 164342 170742 192845 197667 208320 213132 209893 195656
11009 195656 191522 196673 180325 155333 152644 181600 200348 195468 190746 181064 177438 194016 180593
10996 180593 159351 160061 189310 182919 148244 117170 117381 134195 141462 148329 178778 211319 212733
10983 212733 200169 219917 220784 218930 207432 213087 234312 271676 298684 308609 314028 330335 348610
10970 348610 377126 451532 537522 620823 740360 949263 1231014 1502784 1765389 1994373
10960 1994373 2110562 2109122 2020298 1822373 1577009 1331467 1112641 976675 886551 778430
10950 778430 706952 639559 574801 508468 470639 449873 444962 416163 385037 382651 360648 363730
10938 363730 373572 376603 378758 367340 360124 341117 314124 316326 303989 280148 300611 331387
10926 331387 340209 313623 283827 269663 263512 274879 277468 295753 296545 273306 258553 254279 238745
10913 238745 229451 256933 241741 237666 261496 274083 256985 259296 246955 232973 243968 269369
10901 269369 252546 237413 258409 264533 262126 237070 240864 236889 271205 290722 279717 272997
10889 272997 267303 270926 266012 251544 249923 247553 234653 193196 185397 198749 193668 200025 189002
10876 189002 149278 153343 150726 139545 174303 196453 198341 206208 237551 262563 239019 224632
10864 224632 250672 241918 224295 211641 215720 222335 218454 245411 294287 320017 330900 344763
10852 344763 351725 371716 381280 376986 380757 387414 405054 421071 425437 439884 501426 592234 732752
10839 732752 919277 1196737 1578777 1906010 2125809 2268997 2280111 2159122 1922291 1644833
10829 1644833 1425334 1232885 1100504 979064 851930 797865 731058 650905 599306 583253
10819 583253 593086 561753 551003 523506 501526 487937 493779 495433 536532 573327 597874 582256
10807 582256 554906 568243 568718 584916 559698 540087 529419 534023 518360 493171 482555 441794
10795 441794 437128 463567 484495 483259 472861 466322 459889 457402 450814 450916 440218 448378 449433
10782 449433 436304 409920 422490 402016 392400 409005 406866 396340 404317 418854 415771 419160
10770 419160 428233 442382 477807 485357 498865 506185 485505 479946 482051 468006 447352 434751
10758 434751 429793 389319 348171 342247 336946 332613 320058 329531 341235 367690 414586 430292
10746 430292 466434 524116 566522 585065 608028 636934 623425 587416 584541 570274 551213 553414
10734 553414 586489 628602 655881 653892 634338 613375 580881 528459 515529 503046 502878 484249
10722 484249 466708 488746 498000 501916 493337 518590 566332 589628 643811 706156 771231 812855
10710 812855 834051 861267 853667 844739 819725 763570 683409 657651 629690 574467 534705 511592
10698 511592 515150 513151 491192 483113 503474 527262 518299 544292 582650 641548 679496 723867
10686 723867 795212 880518 941884 1004778 1032276 1078181 1143781 1178147 1199192 1197976 1171211 1142362
10674 1142362 1109578 1065840 1027381 978574 954646 926805 897096 894875 911278 946406 963922
10663 963922 980726 1002806 1004481 979282 933193 924790 966465 1013403 1024005 1028993 1016450 1010265
10651 1010265 985013 989952 1008718 1024304 1048183 1074949 1058436 1040931 1045216 1043411 1013362 997763
10639 997763 993157 1003700 1010078 994940 990975 1010429 1026554 1061194 1102504 1114940 1126133 1141766
10627 1141766 1153964 1206050 1271997 1296542 1376254 1452932 1490298 1517639 1553112 1585790 1632078
10616 1632078 1662171 1678535 1680153 1711731 1767474 1825205 1851307 1888928 1926719 1944137 1963088
10605 1963088 2001837 2020914 2057313 2092846 2133359 2161454 2166676 2203029 2218244 2251425 2314865
10594 2314865 2406570 2552148 2745770 2980530 3217973 3430360 3636163 3825012 3991741 4124866
10584 4124866 4262882 4452638 4684925 4965500 5326303 5772684 6335513 7020153 7836200
10575 7836200 8747073 9746939 10750418 11731119 12750522 13855593 15099277 16547582 18345457
10566 18345457 20666629 23740752 27751128 32936893 39845304 49414694 63307307 84229643
10558 84229643 115421960 158708598 211637624 266668972 314861655 348911463 363815407
10551 363815407 357090102 330454109 289940846 245027524 204227610 170679646 143581056
10544 143581056 121388208 103192717 88463668 76655678 67194115 59614829 53523672
10537 53523672 48613321 44633527 41412567 38798120 36615226 34713571 32980850 31342190
10529 31342190 29763484 28209485 26675787 25192675 23824769 22548323 21362510 20265302
10521 20265302 19256594 18295010 17416391 16641935 15945991 15326406 14759139 14275719 13818516
10512 13818516 13341983 12882010 12442436 12013651 11594231 11190793 10824117 10455345 10081737
10503 10081737 9732588 9402006 9151174 8940734 8718129 8547144 8391614 8233174 8092759
10494 8092759 7936249 7757296 7597874 7464869 7359864 7278977 7162256 7006322 6853256 6710334
10484 6710334 6573680 6468536 6359034 6237831 6111527 5989180 5888657 5799477 5707104 5623247
10474 5623247 5581355 5542534 5531663 5529552 5582142 5680789 5790058 5880130 5953851 6024031 6075016
10463 6075016 6164179 6299736 6496831 6703004 6969023 7318913 7724778 8269974 9005205 9822013
10453 9822013 10684665 11564667 12460887 13378615 14261120 15203412 16309656 17749420 19605634
10444 19605634 22030110 25138491 29155487 34401407 41347577 50929088 64921763 86518719
10436 86518719 120661163 171422466 235408038 298171117 344872053 372797608 382968213
10429 382968213 367986377 325250161 270340202 221894759 184938362 155742453 131277050
10422 131277050 110840984 94306661 81193811 70826857 62562105 55895325 50469512
10415 50469512 46023802 42412261 39532732 37267332 35329284 33566211 31951550 30438555
10407 30438555 28932203 27366196 25792885 24298376 22946539 21690747 20501704 19357297
10399 19357297 18244549 17214127 16309937 15510593 14842664 14268445 13742629 13281716 12882383
10390 12882383 12470604 12026594 11596009 11169122 10728621 10322556 9948138 9577913 9216612
10381 9216612 8885861 8583898 8291995 7993183 7736019 7521389 7308518 7126680 6950926
10372 6950926 6775061 6625880 6451396 6239992 6037490 5882062 5700684 5501959 5282740
10363 5282740 5085804 4947649 4801266 4670903 4568063 4454556 4324551 4209708 4139421 4090550
10353 4090550 4020999 3932671 3844181 3740227 3647351 3571173 3489780 3367255 3235287 3135943 3040264
10342 3040264 2944074 2838002 2745875 2647450 2580105 2508787 2432914 2363697 2284950 2218925 2163529
10331 2163529 2099376 2051701 2001187 1948688 1905877 1851374 1819682 1783558 1735661 1675623 1639757
10320 1639757 1617374 1622010 1638878 1584304 1548030 1517396 1450189 1384478 1358182 1328336 1292243
10309 1292243 1254052 1187945 1102118 1021159 926020 803455 716785 646149 607168 576693 565282
10298 565282 571771 563838 532846 507856 529331 495188 471546 448117 426706 410496 386891 372824
10286 372824 369828 376821 364653 315191 290854 250029 212626 174307 86481 -26573 -80970 -141885
10274 -141885 -188099 -214733 -185933 -164110 -132028 -67938 -45683 -14447 49370 99053 123622
10263 123622 132930 124941 136666 135250 133054 96123 52904 33131 3859 10427 2600 -6524 -26647
10250 -26647 -12744 10195 48286 44213 17338 -40357 -102257 -134488 -149336 -148739 -168526 -144184
10238 -144184 -89871 -34630 -22995 -18851 13840 59016 82128 80306 80566 82296 73928 79904 76234
10225 76234 81324 75267 48931 29751 16529 40681 62070 52578 17341 -4999 -25811 -61326
10213 -61326 -67546 -72712 -69691 -60691 -44685 -38846 -29858 -2956 25192 53907 67490 85408 61720
10200 61720 32624 29039 25371 11356 8863 -17166 -20486 13235 44341 48252 43999 45483 62145
10187 62145 75377 70118 67599 75091 66850 48884 72222 81685 70692 79180 92570 88114 75941
10174 75941 74318 88069 63640 52802 74627 95013 75176 48712 23620 18866 10261 -10434
10162 -10434 -8004 -10748 10477 21409 42991 55818 43315 38842 40987 67090 84104 78985 74256
10149 74256 109887 189032 276799 383566 529646 773511 1070566 1381580 1653428 1852821
10139 1852821 1933451 1919233 1804803 1575513 1311103 1073965 874246 723568 596816 475865
10129 475865 359034 290303 250639 207704 207827 209747 191855 135370 99133 93680 80851 68104
10117 68104 79926 81660 78866 86176 58731 56401 80428 62314 36310 51473 68480 58365
10105 58365 56291 68843 56879 43970 57148 65603 51337 23719 5939 -29216 -47534 -71030
10093 -71030 -58070 -36327 -17306 -23047 -28383 -46340 -41633 -41069 -70784 -78533 -84763 -87055 -89326
10080 -89326 -69942 -43782 -50119 -40796 -36780 -50205 -62290 -43147 -31820 -40410 -62540 -52017
10068 -52017 -18208 -17043 -20771 -24099 -24262 -36441 -39149 -46840 -60488 -40812 -37193 -9882 -11260
10055 -11260 -25322 -4713 -28193 -52137 -21261 -22977 -38617 -22040 -6345 -15674 -36601 -43664
10043 -43664 -51541 -30392 -3756 10849 42393 71116 88941 127363 139221 152035 153918 178482
10031 178482 203251 307890 471721 691127 1003685 1511539 2166850 2759067 3122756 3366515
10021 3366515 3515831 3273867 2725932 2186766 1778599 1451285 1189909 966137 817937
10012 817937 706613 630361 537504 457249 417149 344861 311307 283726 269258 254049 224677
10001 224677 239458 256488 220179 189326 177479 168329 163149 167233 145727 120740 87040 95178
9989 95178 69642 45484 40289 59610 65097 81915 98887 88929 89180 90582 73291 60211 40775
9976 40775 36333 10456 2566 -37268 -44269 -52969 -71712 -74257 -48728 -45351 -50061 -33427 -27643
9963 -27643 -25280 -30929 -32061 -19250 -30082 -33668 -28604 -38177 -37867 -3740 -36429 -35845 -43797 -49598
9949 -49598 -67907 -83834 -84246 -68505 -29039 -10464 -48264 -57815 -75646 -74451 -35102 -38185 -72802
9936 -72802 -89118 -69802 -85682 -73836 -21381 -20124 -39411 -70425 -88311 -87446 -68759 -70658 -60284
9923 -60284 -45123 -32234 -44628 -72511 -73424 -49421 -56093 -82089 -88821 -108085 -109803 -111371 -91073
9910 -91073 -65238 -65054 -82910 -103924 -100785 -79282 -58653 -51388 -40978 -40099 -46782 -55708 -62935 -52914
9896 -52914 -68846 -87232 -104949 -132471 -111248 -102027 -116929 -116695 -110377 -76323 -72637 -87325 -59696
9883 -59696 -55373 -72110 -66871 -45928 -46147 -52312 -41208 -69682 -83597 -79882 -65426 -55969 -50932
9870 -50932 -38068 -38182 -19815 -36712 -39025 -43090 -48294 -42323 -57170 -76657 -111709 -107913 -105587
9857 -105587 -95206 -81251 -63565 -35805 -25865 -30021 -36517 -60531 -71754 -88077 -129629 -113410
9845 -113410 -114291 -141292 -142804 -124472 -94044 -66893 -74567 -96972 -75910 -55227 -70529 -88100
9833 -88100 -58659 -73243 -74232 -44747 -71177 -96966 -71031 -68367 -77827 -89680 -86149 -82779 -57630
9820 -57630 -32334 -49253 -57521 -66255 -74735 -70409 -70454 -78107 -84012 -69560 -54023 -67069 -86486 -96345
9806 -96345 -62615 -39999 -56121 -68685 -74013 -81149 -87271 -59295 -46618 -38179 -35176 -52006 -82785
9793 -82785 -94268 -95382 -82670 -57893 -56183 -40022 -39522 -50054 -55433 -50125 -48134 -24529 -17984
9780 -17984 -9450 11736 -4270 -54817 -73388 -58378 -60587 -75239 -97880 -91618 -67062 -57954 -62693
9767 -62693 -77630 -65683 -31960 -41965 -61762 -79208 -94677 -56907 -49785 -78401 -76474 -70186
9755 -70186 -70962 -63037 -57868 -57464 -63571 -85817 -102809 -97518 -78351 -81669 -50427 -42248 -52879 -36527
9741 -36527 -49613 -36655 -30038 -52396 -54574 -49344 -51933 -35140 -35424 -34467 -38222 -50943 -52994 -41446
9727 -41446 -55086 -63075 -53104 -61261 -82656 -87752 -94980 -83224 -88112 -88282 -61422 -45178 -58276
9714 -58276 -57199 -75887 -75417 -60784 -28305 -10679 -61424 -61826 -48479 -29265 -17192 -35283 -56059
9701 -56059 -102698 -113931 -87853 -42114 -15487 -59766 -75796 -69336 -69047 -60324 -34196 -31072 -29406
9688 -29406 -48558 -56614 -27466 -33608 -38801 -34791 -22398 -35003 -61966 -60947 -57769 -81387 -110362
9675 -110362 -82317 -49738 -34549 -24447 -24356 -28744 -62847 -81189 -49048 -40994 -34327 -37577 -58996
9662 -58996 -54994 -48238 -44281 -41754 -48113 -38622 -28094 -9990 -15116 -32362 -41396 -36690 -39315 -54650
9648 -54650 -42187 -36364 -34176 -38529 -50479 -44612 -49012 -83254 -78622 -62872 -39064 -52327 -55849
9635 -55849 -46029 -48529 -67342 -82813 -69578 -50601 -56732 -68672 -62201 -43471 -28780 -45991 -52719
9622 -52719 -53163 -77256 -87768 -81257 -53065 -46156 -27493 -58832 -74150 -68460 -73797 -76051 -68957
9609 -68957 -46301 -44305 -23880 -27057 -25756 -35950 -38732 -49989 -34726 -34132 -30277 -41041 -17867
9596 -17867 -6064 -8395 -21216 -6144 31634 11531 -17023 -36549 -54216 -54344 -23928 3969
9584 3969 -23726 -46095 -90742 -62537 -23753 -45556 -51584 -50956 -42252 -36752 -20846 -32658 -20141
9571 -20141 -3139 7575 -19098 -8973 -2890 -15082 -17120 -5394 1327 367 5597 -5659 20323
9558 20323 7897 -6453 2104 39235 50018 30832 1834 -16602 -29232 -40432 -29225 -28959
9546 -28959 -34032 -28513 -46038 -21375 -6504 -16702 -17899 -12864 -40561 -42533 -13931 -8004 1343
9533 1343 -1931 -19331 -1650 11731 -16162 -54895 -54785 -52611 -28193 -8774 7547 -15561 -6602
9520 -6602 7932 7663 2528 -16291 -9861 14131 27474 16729 -4730 -28760 -9980 16073 8057
9507 8057 -1263 -3380 5628 -22360 -47929 -43680 -18319 -23900 -12947 3171 5821 2818 -2049 37849
9493 37849 58708 34836 26692 10456 -121 -11198 7355 18837 29065 57802 53499 34983
9481 34983 41171 49745 17820 33975 38393 42742 54710 60333 46091 56701 75437 126813 117109
9468 117109 118984 134723 134521 129823 123436 145900 166215 179188 175133 192553 232082 249650 246800
9455 246800 244447 283098 314515 377480 401420 427086 485426 561675 625901 695741 779750 897188
9443 897188 1031355 1211739 1416751 1675844 2069122 2573237 3253381 4243868 5660448 7655288
9433 7655288 9993180 12049916 13379411 14130248 14309183 13468153 11740990 9895089 8381257
9424 8381257 7136850 6106016 5212897 4453882 3851864 3362499 2957764 2633669 2351759
9415 2351759 2111661 1930499 1788674 1661498 1556934 1478823 1383633 1270656 1175373 1115159
9405 1115159 1063139 1009548 961744 903096 868399 798877 763636 743070 711033 687863 645823
9394 645823 620343 600227 586412 571843 569371 539393 500702 471387 469875 451217 405867 370985
9382 370985 338620 318586 306534 281439 272220 281875 299723 285561 247639 222314 209711 209645 224767
9369 224767 230609 226905 234392 227191 191339 166952 165047 163815 161333 162086 152892 130565 121826 132985
9355 132985 165734 158329 163979 142940 85843 62135 86505 102990 109690 117590 115549 97498 72998
9342 72998 74771 79628 86455 91959 83610 74187 91068 101367 75041 34918 45254 52133 38183
9329 38183 44673 33964 1619 1544 -14331 -6010 -4316 -16279 -4975 14083 11478 5117 19541
9316 19541 19011 6167 22813 2794 -22236 -6745 17657 23197 20375 -5414 -28219 -34809 -48933
9303 -48933 -55147 -21968 33102 17614 2781 17992 37896 23929 16009 19728 48193 53276 6812
9290 6812 -17720 -8960 -25922 -8703 11006 14073 16877 29241 40936 38615 7776 -3158 -26558
9277 -26558 -47687 -45783 -35262 -25558 -42555 -15905 -2690 -19844 -21833 -3053 -20195 -10784 -9734
9264 -9734 4558 -2154 -22579 -46433 -23321 -31838 -44635 -38139 -47572 -73984 -90729 -42855 -24457
9251 -24457 -32651 -26369 -26737 -34723 -31018 -40765 -26629 -24439 -29343 -38794 -40070 -35395 -39240 -44757 -46755
9236 -46755 -53344 -56388 -35147 -29542 -61231 -63931 -82327 -76959 -42822 -41995 -49138 -58742 -61456 -23526
9222 -23526 8432 -2337 -26455 -33949 -34688 -40366 -41110 -24669 -25623 -49706 -37203 -23056 -25313 -38351
9208 -38351 -30216 -39772 -29242 -22004 -30759 -32361 -17232 -34068 -56492 -64546 -40684 -6908 -13695
9195 -13695 -13165 -13370 1740 -8753 -5899 -6879 -13696 -1428 7075 -8069 -25554 -34423 -14827 -21583
9181 -21583 -18388 -20166 -60031 -57868 -48500 -45653 -36377 3571 19711 13923 530 4142 9633 4667
9167 4667 -3401 -25772 -26606 -9965 617 15184 12149 -11054 -33068 -9405 12128 -9484 -54768
9154 -54768 -64539 -28602 -2324 -12489 -9275 478 -22043 -25970 -17640 -22817 -24234 14188 -1296
9141 -1296 -19340 -10695 -13084 -21642 -36278 -44128 -39463 -21908 -3374 -15245 -11004 -21725 -32758
9128 -32758 -43835 -39331 -24312 -24129 -26290 -35716 -54487 -60353 -64573 -68624 -51198 -56460 -71907 -69693
9114 -69693 -28073 5161 23101 10126 -10566 -17082 4746 -3684 -17989 -22556 -39543 -55983
9102 -55983 -85092 -67576 -55567 -34597 -8708 -23988 -41386 -19242 -1812 -12160 9152 13593
9090 13593 -11925 -35387 -19361 -23530 -28386 -12172 -12838 -6443 3488 -9105 -20452 -22826 -33458
9077 -33458 -30805 -28844 -8523 14696 4257 -5465 -6674 -3203 -6224 -14187 -21053 -20403 -2695 -10949
9063 -10949 -36649 -38842 -24340 -21842 -24214 -18491 1035 1542 -14241 -5921 -4825 -8373 -13134 -10579
9049 -10579 -19363 -1034 4080 6848 14624 21053 28254 28225 21211 27293 8571 -15280 -24713 -22203
9035 -22203 -22839 -19199 -36284 -24290 26023 18849 -29100 -36442 -36700 -13124 -11990 -17621 -16203 -16762
9021 -16762 -561 -2071 170 -26278 -39053 -25642 12242 11966 -9672 -14156 -10951 -11511 -19168 -34076
9007 -34076 -14257 -3941 -2063 -28396 -1460 -5507 -10687 -13687 -30445 -30959 -34096 -44156 -39180
8994 -39180 -17266 6917 7729 -4376 4856 -9675 -28204 -2672 17240 23450 35341 34424 37130
8981 37130 19674 13356 26856 42095 30781 6245 -18528 -26496 -28652 -1868 838 8762 7242
8968 7242 14341 17721 2465 -20261 -28564 -42996 -45555 -43095 13906 14966 -11178 -15850 -19148 -14139
8954 -14139 -11638 -17375 -21448 -8483 -8282 -21129 -31896 -5019 36326 30498 3204 7141 4534
8941 4534 -17769 -5395 -6335 -7509 11006 14007 -4732 -9270 -21755 -29940 -44269 -34523 -4953
8928 -4953 -43004 -48442 -34069 -48452 -59233 -65955 -72579 -44946 -46679 -36349 -10483 -19415 -36455
8915 -36455 -47239 -52366 -47305 -36585 -26935 17346 25942 -1430 -26698 -8952 -16488 -21841 -17820
8902 -17820 11484 1380 6141 12469 12403 10265 -10166 -31127 -25818 -3199 -16171 -15103 -4211
8889 -4211 -5146 2873 3152 -30348 -56021 -60795 -56167 -52287 -37510 -56772 -66764 -30432 -5531 7841
8875 7841 -21703 -29223 -22556 -36799 -43009 -17219 -6111 7506 2522 17460 20654 -1028 -5686
8862 -5686 -22792 -29166 -20775 -18734 19866 49258 6589 -24747 -39415 -30050 -24989 -13804 -31289
8849 -31289 87 16616 15923 -30522 -48340 -19160 -15553 -22954 -10900 -5769 17376 24337 11432
8836 11432 -22008 -14088 -6007 -1413 -10881 -28944 -56708 -42122 -23953 -37606 -59969 -67657 -53608
8823 -53608 -31933 -14887 -17156 -5594 -14985 -36960 -19018 -32004 -50637 -34680 -21484 -11241
8811 -11241 -3447 -11425 -20941 -31090 -36743 -46117 -45666 -31029 -12394 -20182 -29064 -14510 -23982 -56849
8797 -56849 -48891 11320 10663 -45208 -60126 -39714 -16733 -12255 -16713 -19541 -22626 -25462 -36857
8784 -36857 -39519 -33146 -6898 -6402 -38838 -56515 -37777 -24485 -10773 -6227 -28507 -11205 -877
8771 -877 -23007 -38327 -33071 -2752 860 -7663 -32743 -20105 -26243 -28058 -36816 -21513 -17551 -58984
8757 -58984 -43048 -26103 -41255 -45815 -33336 -30169 -33987 990 21439 32893 14595 32700
8745 32700 26091 17034 3635 -13962 21391 6753 -47645 -51496 -23625 -14225 -15534 -16418 3864
8732 3864 26113 35288 23383 21451 33083 16495 3279 -9719 7631 7867 -1883 -20099 -12384
8719 -12384 -8106 -14694 -24749 -19899 -34956 -32837 -37968 -16332 -14603 -1557 20227 40372 56971
8706 56971 63533 60842 51192 53579 58665 37479 31224 60603 65035 65613 82758 70336 65841 65313
8692 65313 76072 71019 54984 41492 49306 41279 27046 17674 -994 -251 -21032 -8072 8999
8679 8999 22009 45042 54031 48085 37576 43003 84477 100294 109374 105333 79223 88853 92869
8666 92869 65078 27596 21401 12038 16489 16600 43967 74074 76956 80129 93672 126545 107830
8653 107830 81083 88581 83801 74113 76384 95940 104957 74738 71318 74718 77602 84046 88244 90139
8639 90139 97216 130317 117362 93160 98630 117189 88933 79494 105369 97401 99091 141872 162726
8626 162726 189109 186666 198170 186643 180926 188448 195704 184082 199871 185057 170037 192322
8614 192322 211812 223038 225230 247592 249806 255006 282209 280610 268633 271606 254515 240887 275930
8601 275930 306580 347947 364367 389210 445440 432121 457395 491637 491285 502867 513743 550224
8589 550224 568537 581477 569438 573222 575325 563472 548016 543976 531275 516418 501729 494096
8577 494096 444557 406667 431863 462410 463357 439404 434936 455290 462003 442754 427898 396377
8565 396377 373307 354446 336138 309144 303627 293580 255932 235590 215510 215079 212527 184708
8553 184708 197009 178955 142184 140215 137907 119247 123702 152197 153127 141909 132978 106942 80920
8540 80920 60020 84346 108665 133022 131365 112031 92770 53232 60618 80547 108672 85803
8528 85803 66934 43765 53470 42765 46210 58452 56196 57754 74300 67587 85894 90722 97230
8515 97230 99566 78150 59184 48413 45513 26777 44904 37651 28951 42772 49137 55716 54182
8502 54182 57511 52541 35042 39265 51578 58845 37029 11461 21029 14670 3133 -7328 -4013
8489 -4013 -18129 -4498 -6933 -2828 -12658 -3990 18064 22532 33341 26302 31077 31461 36789 19483
8475 19483 403 16215 32947 29702 30703 10892 13518 16454 29657 42230 36444 11105 -2453
8462 -2453 30533 55905 60080 49787 26615 8083 -9204 -9645 -8551 8625 -22128 -31897 -12536
8449 -12536 -20138 -30758 -33506 -28234 -13945 -1005 24226 43944 47387 36983 30800 71931 94441
8436 94441 78307 33428 32072 33547 46277 33510 -9653 -17564 -7037 -13816 -11790 -16946 -22735
8423 -22735 -9517 -9705 -4238 -5320 -2895 -31692 -41758 -24788 -4581 17557 19054 24965 54244
8410 54244 43916 5448 9665 6999 4883 2317 30275 42059 25383 7183 -16918 -19157 -5394
8397 -5394 14561 12087 25660 36224 42337 68962 71832 51247 32472 15544 11517 6186 32382
8384 32382 50101 60163 28810 -12696 -22432 -26816 -15113 10350 6318 -9731 -26810 -33540 388
8371 388 12666 9360 -3358 6672 7949 4950 20552 5840 43546 51774 35423 16639 13361
8358 13361 17908 12493 15396 27660 47533 71426 69806 61118 39535 22878 19771 21661 33071
8345 33071 24904 -11945 -16218 3719 3058 -11642 -914 3464 20962 25927 10980 -16425 -14299
8332 -14299 -3976 26650 23571 18042 24070 17394 -16017 -43014 -12385 11549 6754 12255 21767
8319 21767 48670 44523 15242 -1980 -12788 -12113 1961 -14652 -39105 -21261 23675 46962
8307 46962 38438 8087 -5413 5027 13985 28637 33610 28865 27146 35953 25730 19860 18375
8294 18375 13910 -13119 -27028 -29503 -27925 -9740 -4780 -13635 26771 28961 22225 5952 8671
8281 8671 19522 12244 -18449 -34777 -36927 -31190 -46911 -48128 -45419 -23427 -30715 -8198 -7400 5101
8267 5101 14287 8149 2268 -2243 24814 36691 32124 33457 11214 8460 -1662 -3064 534 -10219
8253 -10219 -22600 -39412 -26949 12121 23973 10881 -22446 -18327 -12763 -30983 -51901 -44778
8241 -44778 -32325 -9228 -6842 -16666 -225 -14659 -39925 -21525 3182 3311 26603 38194 37155
8228 37155 17977 14327 20838 17096 12044 10408 -1580 -39377 -51408 -32728 -11430 -23127 -24773
8215 -24773 -37586 -27563 -10260 -3646 376 9584 25431 29057 12695 6275 -5502 6016 15171
8202 15171 6775 -5984 -10223 -11394 -20246 -38244 -49249 -36819 -39457 -54066 -65894 -41327 -5120
8189 -5120 6713 -7200 -7078 150 14671 10732 -4150 -25855 -30010 -13110 -6331 -2353 -12415
8176 -12415 -24176 -29000 -18993 -5331 18793 2026 -24146 -32460 -21337 -10308 4679 6849
8164 6849 -14114 -4101 17505 6614 18545 31107 4372 -19706 -7855 18303 28601 35596
8152 35596 58219 81150 78573 34475 -8794 9475 4074 12194 7545 9702 10625 7702 2914 3440
8138 3440 23437 24773 49112 43656 32173 37805 55162 41549 26980 56451 73392 94899 68884
8125 68884 63737 31435 23966 29363 14490 9372 21702 38886 31461 24445 13739 6830 -654
8112 -654 -11045 -15882 14838 49838 18703 10504 3391 -579 9091 1665 -4160 21029 27065 44174
8098 44174 42525 38919 23584 9729 9615 40316 87082 86905 67720 52626 39561 34807 45569
8085 45569 45732 28870 35209 25554 -23352 -41658 -14268 7305 6224 3778 21707 38984 42543
8072 42543 53898 51405 44963 50114 18627 27979 32523 -1767 2733 9260 -8378 -20292 -21291 -44728
8058 -44728 -18473 1191 3757 -22281 -37770 -16098 14580 9574 -15242 -25738 6259 14038
8046 14038 7353 262 24320 58391 36933 9897 25687 90895 65699 38793 43181 39225 59331
8033 59331 77160 78889 86472 73860 68638 60829 81276 110104 128853 118121 116780 143947 200256
8020 200256 205727 202724 211604 218841 223636 215926 185000 184723 191440 196004 182525 191152 191965 175915
8006 175915 185482 204955 203502 197353 198269 190003 179057 185624 194508 194964 208048 230403 213013 205935
7992 205935 191683 191335 194987 226002 244047 241202 258745 302553 350357 428164 537398 617126
7980 617126 663401 694361 742504 786286 743379 667545 589568 522212 511049 505122 497769 474931
7968 474931 486021 520978 526526 526958 517595 460314 391744 349790 325437 316969 279550 252322 248059
7955 248059 221018 192250 204962 182117 151355 157802 166529 173298 186061 198306 199023 223445 251285
7942 251285 274349 320479 348260 378066 444094 514630 570488 611430 647218 634935 630630 641559
7930 641559 638455 605971 548410 512740 501444 495265 489451 486627 452858 440186 397162 366416
7918 366416 310922 271010 264753 272002 259727 214467 204359 187964 192490 169653 159652 162688
7906 162688 153043 167526 150354 144358 122534 118734 148819 185695 197434 187209 190925 215780
7894 215780 268538 300962 308727 290903 250799 237000 203789 161298 150391 163218 178987 163565
7882 163565 149884 142732 138685 116007 81449 71803 95248 108171 97662 82694 85595 91579 101663
7869 101663 88535 100918 81731 73075 63778 49176 42930 56931 64967 57994 51602 32956 5259
7856 5259 -1061 9523 8671 -14132 -19881 -9368 23322 43890 30305 10945 26876 32326 50358
7843 50358 58886 58566 45307 25274 35658 58450 73048 59499 21654 19062 8036 -8380 269
7830 269 18826 78 -10498 -8957 16631 38508 14485 21186 32724 16306 24962 -6462 -17493
7817 -17493 -16403 -13585 -9494 12042 6454 -15808 -4825 18867 15359 19110 12404 4873 -10766
7804 -10766 -7810 5473 -6386 -30842 -30346 -22237 -1499 -15062 -22597 -28379 -6644 16858 5678
7791 5678 -4778 5962 -4821 -7089 -5440 -15682 -33382 -45136 -32762 -8181 -10201 -19601 -35262
7778 -35262 -11731 5044 891 7248 7288 740 -4605 -11270 -163 21503 22217 -10228 -26451 -21743
7764 -21743 -25519 -49787 -75646 -50743 -24156 -2509 -4580 12294 13153 18637 31892 10987 7962
7751 7962 -14188 -7976 4137 5856 -14574 -22089 -22066 -455 18021 39473 38638 20666 -11362 -16398
7737 -16398 -7773 -6665 -9206 -34117 -23266 -33403 -52358 -34067 -21392 -18192 -11652 -19084 -28560
7724 -28560 -21919 -29660 -7598 19670 1873 29493 24008 -37658 -29556 -32648 -18772 -17862 -42412
7711 -42412 -41058 -21285 -18503 -10987 7054 12685 15347 -3798 -27834 -44316 -42641 -47622 -40624
7698 -40624 -25028 -9982 -11274 -10006 -11154 9242 57045 56163 34964 12339 -6918 -10885 14553
7685 14553 16057 7321 -16294 -35891 -36983 -18454 -7279 -20294 -39739 -39196 -9107 8283 -10307
7672 -10307 -21256 -37575 -38841 -41210 -14300 587 -5883 -1772 -6173 9953 17334 18026 18326 9777
7658 9777 4440 -11428 -21502 -618 3382 -2338 -24222 -29261 -35532 -36526 -32154 -6540 18951 18695
7644 18695 5523 3595 2808 5102 33207 47463 47543 26104 -30 11270 27756 29106 31839 15979
7630 15979 -6340 -36337 -25717 -10566 -11953 -6465 5562 3667 9676 17603 21883 8825 -5723
7617 -5723 -1948 -3906 16098 40416 39159 10190 10073 23121 -62 -19996 -18302 -16049 -15382 -13582
7603 -13582 -10677 -22756 -12167 -9973 -38977 -47090 -35604 -34400 -20740 -19686 -33560 -4268 10845
7590 10845 -9716 -26556 -22437 -23386 -39955 -42454 -32798 -55949 -31705 -1282 18007 6628 -4071
7577 -4071 -5129 8518 2279 3506 16442 33109 30086 22816 10277 3727 -4409 -8828 8856 20080
7563 20080 22768 23276 5608 -9668 -20006 -15498 -22459 -30344 -28599 -26987 -14354 -22760 -28124 -28350
7549 -28350 -9855 -17503 -27238 -17869 -2643 1657 19932 27702 35293 60035 42854 5273 -14130
7536 -14130 -19916 -12145 3520 10941 6441 -19961 -26706 -21910 -28148 -14486 6509 -45290 -44410 -29592
7522 -29592 -14112 -26193 -45723 -28632 -20778 -23435 -22070 -12630 1734 -1529 -6284 -14398 3697
7509 3697 20881 19042 -4366 4803 -3758 -13693 -12111 -10642 8645 13218 18290 19769 2200 -18511
7495 -18511 -64176 -37525 -1446 -7010 -18144 -31783 -21158 -47669 -44623 -40148 -42171 -30434 -14065
7482 -14065 -25900 -17190 -9233 -12435 8902 21343 1184 10647 -1959 -14437 2275 -3375 -28211
7469 -28211 -21648 -27114 -38581 -9893 10951 -453 -9845 -12672 -2151 10667 -7735 -25123 -53406
7456 -53406 -56956 -39731 -26752 -25571 -3088 15826 -11265 -27703 -19842 -25644 -8040 12722 37700
7443 37700 33515 30042 29228 26454 9603 -26780 -38024 -40914 -49359 -35821 -7754 14516 8356
7430 8356 4296 -2435 -16675 -18387 -14717 -1120 -19579 -14093 -7805 -322 -15658 -33166 -55800
7417 -55800 -60779 -47904 -26308 -20240 -5934 7679 -15777 -29461 -30411 -34240 -19408 -6882 -3765
7404 -3765 3963 3892 -6678 -16406 -9534 -24986 -33448 -30167 -41435 -51331 -50841 -44052 -24416 -19648 -29718
7389 -29718 -37 34563 10590 -28824 -76415 -60394 -24386 -40474 -44073 -23319 -175 530
7377 530 -25142 -11223 7866 -2238 -9205 -4285 -13794 -10243 10272 14994 5895 -3453 -9174 -12972
7363 -12972 -27902 -55319 -56747 -41276 -7459 29036 21201 6600 4036 -11599 -6344 18019 3327
7350 3327 -21169 -29285 -15601 -1620 21919 31653 11563 13304 21262 15808 23312 14802 -24437
7337 -24437 -53119 -64306 -72441 -65128 -64099 -50801 -29270 -19569 -26642 -24205 -16029 -6605 14025
7324 14025 -8994 -30927 -21350 28715 50616 18004 -15180 -21650 10031 14841 -9493 -18026 -3183
7311 -3183 -18952 -29398 -43785 -8973 -424 15955 23041 33558 50009 35553 2507 934 18287
7298 18287 39489 15806 -5871 -27353 -2430 30682 15096 1664 -1637 16705 4197 -12292
7286 -12292 -21350 -23749 -35297 -14973 -3704 -22821 -15154 -14907 -38367 -66118 -44055 -8830 6006
7273 6006 -2515 -1426 -5199 -6686 6576 -1874 -14578 1298 -14188 -56534 -52310 -26967 -24533
7260 -24533 -23890 -32105 -22446 -1775 10451 15475 28590 40620 28275 -16023 -42743 -25278 -17204
7247 -17204 -15005 -29618 -12794 4770 6727 19306 36381 23261 -6193 -25247 -16835 -18701 -22583
7234 -22583 -16357 13129 33708 23090 -8688 2299 35814 48969 20114 -5850 3559 32141
7222 32141 39243 32126 20720 150 -34001 -55554 -69782 -72624 -45400 -5015 21151 32571
7210 32571 25512 15698 9991 -24470 -42382 -36939 -46958 -27116 -28045 -48182 -61607 -68944 -52616
7197 -52616 -48328 -49507 -28705 -15589 -40994 -60112 -54228 -39596 -29004 -10951 -18286 -21707 3229
7184 3229 17919 31574 32765 15012 18687 44670 63903 38505 19204 3479 -9889 -17264 -16446
7171 -16446 -6324 -35298 -55322 -40305 -38942 -14663 1853 18193 -6085 -39890 -21012 -18145
7159 -18145 -19346 -3316 -10977 -35342 -22285 -203 -602 25657 22266 19285 5646 2329 -2270
7146 -2270 -7939 -24643 -11431 5963 1496 7791 620 -9650 -11530 -22825 -124 7390 -40267
7133 -40267 -54704 -25612 -2203 -11569 -30082 -22609 -8162 10571 2091 -21696 -27053 -30815 -9936
7120 -9936 629 2428 -24469 -37822 -32176 -18259 813 -5457 7750 12231 2950 13185 11006
7107 11006 276 2511 12416 6402 -21547 -13494 -19069 -23598 -29375 -27533 -15744 8543 -11889
7094 -11889 -28629 -39286 -43593 -2357 23307 79 -9034 -15327 -17900 -26033 -15036 -20259 -32716
7081 -32716 -68181 -64771 -37585 -13796 -56894 -67448 -40302 -25155 -16502 3641 5138 -28734
7069 -28734 -50967 -45634 -50233 -48652 -68462 -47385 -5085 24155 16518 -11104 -42060 -39439 -42268
7056 -42268 -39971 -23255 -13639 -2908 18579 8480 -2942 -9530 -14184 -30930 -18306 -20963 -14552
7043 -14552 33418 29302 22739 13867 -30214 -38998 -42570 -35163 -33757 -35686 -26252 -14630 -12085 -10603
7029 -10603 -22566 -17782 -9949 -5345 -12177 -42198 -45929 -27638 -19785 -23763 -4327 30629 10664
7016 10664 9658 5948 -14412 -19782 -7883 -21617 -34075 -32584 -31682 5085 21414 23717 23037 15136
7002 15136 16057 -3165 -35120 -43393 -34778 -25146 -20054 -37616 -35584 -24927 -7369 -572 -12690
6989 -12690 -23027 -21591 -8004 -6171 10394 3241 -6429 13181 45437 32903 -9982 -44503 -39826
6976 -39826 -29536 -47260 -32391 -15965 -12842 -28014 -37701 -33275 -35051 -32290 30 20146 44334
6963 44334 23706 -31191 -51165 -27070 12196 13626 -245 -7172 8169 6884 -16149 -35902
6951 -35902 -26258 -29168 -712 23313 41328 22084 -45 -9114 -10112 9318 3695 14824 13707
6938 13707 1293 -4673 -27906 -52252 -41165 -27711 -50068 -46678 -38264 -42548 -57931 -50170 -62846
6925 -62846 -46213 -18335 -14996 -11712 -9408 -28010 -33814 -36135 -35667 -25920 -16491 8249 12946 -10899
6911 -10899 -24285 -21108 -37986 -25338 -26721 -32224 -21368 -42624 -47314 -10209 5157 -17914 -34405
6898 -34405 -33237 -30370 -32295 -48122 -52507 -19599 9373 -8162 -21609 -37406 -46302 -19094 -15654
6885 -15654 -5552 23309 16507 4583 6274 1424 2132 -8878 -12799 -10382 -3560 -16226 -51021
6872 -51021 -47998 8164 -695 125 4332 -7628 -6709 -1784 5464 1020 1259 -9281 -26155 -12370
6858 -12370 -2769 -448 18844 28607 445 9923 19322 9365 -3105 -14172 -8788 -13854 -22192 -19082
6844 -19082 -20844 -49545 -42751 -27996 -24453 14814 44205 49330 35047 20835 24173 22507 33154
6831 33154 17751 -27613 -40179 -60948 -55117 -47277 -52764 -64507 -71110 -65877 -61699 -76594 -60351
6818 -60351 -56352 -38708 -41591 -44102 -50891 -27198 -1456 5836 34448 27676 10500 24840 35770
6805 35770 17142 21151 37191 25740 9363 3683 -29121 -43497 -40030 -38793 -25339 -23462 -39073
6792 -39073 -55301 -54217 -27799 -25869 -40796 -36212 -40221 -34339 -8159 -18565 -30737 -19443 -13588
6779 -13588 -24356 -43608 -32547 -41587 -18823 9660 12287 11420 22760 41043 50353 19072 -11937
6766 -11937 -12121 -690 -20964 -39124 -62691 -46828 -25491 6475 1440 6867 15758 -16477 -17479
6753 -17479 -29966 -30377 -9830 -11074 4633 7291 -19261 -43851 -41049 -29485 -33651 -12922 -22134
6740 -22134 -31235 -26208 -41417 -22877 -16144 -48307 -57987 -71812 -67358 -24841 14893 -2686 -22912
6727 -22912 -1010 4225 12906 22107 51248 48136 28145 15126 -2930 -4861 4441 8091 22866
6714 22866 10946 17353 34450 33344 14115 -22041 -42845 -13228 -20933 -2614 -34870 -24464
6702 -24464 -9082 -23303 -10914 -14709 -11659 -4454 -4728 24864 13237 -19044 -32673 -15947 -19983
6689 -19983 -34393 -53093 -54205 -33840 -6476 12430 6782 -6290 12957 5207 -4115 -11630 9213
6676 9213 17248 16395 37205 46522 37952 45134 29082 597 11 -21035 -15619 -2547 20496 14086
6662 14086 -10180 5760 17612 17040 25345 2761 -2926 -11302 -7257 11890 25903 39272 53976
6649 53976 34800 4780 1996 -4125 -6748 -1673 12511 9978 18530 62425 54907 15543 -25059
6636 -25059 -16356 -8036 -26521 -5237 -12006 -24028 -23177 -7341 4364 3990 -9045 -12442 -9776 14415
6622 14415 33531 6678 -6760 -5801 -8713 -24115 -25701 504 9534 -6805 -34584 -55417 -55661
6609 -55661 -55730 -45167 8143 4909 -960 -7457 2522 3921 -23978 -32833 -30158 -38180 -46322 -21921
6595 -21921 27643 32422 -1602 -6731 -24535 -27663 -33642 -28332 -17951 -33596 -45970 -60543 -27539
6582 -27539 -19260 -23312 -13003 -11781 -42392 -47076 -47552 -29170 20042 6434 -41625 -26912 -20330
6569 -20330 -13659 -17645 -28790 -57645 -96600 -90884 -51493 -31857 -16321 -20528 -20181 -5414 8549
6556 8549 11376 22524 -11543 -20830 -2519 6003 -2693 6109 -11758 -17041 -10698 -7258 -19709 -39627
6542 -39627 -44105 -15830 -23316 -2997 33556 32178 17590 14907 -3751 6490 -19306 -51991 -41966
6529 -41966 -1477 11233 34083 41207 30425 25648 4836 31 -11158 -2950 32330 38486 12571
6516 12571 -33733 -36642 -26006 14192 25069 6755 829 -6283 5840 -4160 3814 10072 10886
6503 10886 921 6879 11336 1019 22387 1508 -11173 -18161 -2493 10344 19830 -7626 -17572
6490 -17572 7637 17419 1359 -31168 -23442 -20344 -30538 -27079 527 9747 4424 -6039 -4805
6477 -4805 -10223 10690 29972 7789 2088 -12516 -12841 -22205 -13041 -3427 -14095 -29984 -52406
6464 -52406 -36243 -10600 -4922 1446 15201 26033 19023 11984 702 -15864 -24298 -30937 -19541
6451 -19541 -11817 18179 21861 36508 29535 34903 7956 -12458 -5221 21464 54719 67122 31695
6438 31695 14006 3537 3820 -9462 -2161 10585 9588 -14373 -31221 -26822 -29344 -29857 -13833 -11453
6424 -11453 -5067 -5253 -3644 -14732 -17360 -24460 -56416 -41821 -12377 -395 6059 -3055 -14765
6411 -14765 -11637 -22542 -23677 -11686 -8349 -27331 -40912 -47167 -45299 -28529 2205 10443 9362
6398 9362 -4985 -26365 -41912 -34573 -15024 13699 2988 3173 13020 21003 19327 11051 -3463
6385 -3463 5434 -18891 -42468 -43945 -23286 2083 22300 -9017 -15726 -10332 23705 19682 17071
6372 17071 30518 19651 368 -34391 -23634 -1183 -14720 -12485 4354 1073 -21323 -5748
6360 -5748 -17252 -21254 -23798 -31175 -42617 -40716 -23949 -15514 -39189 -41576 -23403 -3582 -8798
6347 -8798 -14168 -20336 -18860 -44773 -57088 -40896 -23321 -41966 -12200 30019 50074 41652 24988
6334 24988 33825 43433 48715 52657 27047 -10010 -24240 -20508 3930 19901 28469 33938 37302
6321 37302 35761 20809 -29191 -35599 -27640 -33441 -43274 -22148 -25533 -41581 -55359 -51238 -49808
6308 -49808 -28535 -27824 9374 17320 18933 34177 20284 -11275 -15855 442 29148 44842 33981
6295 33981 26957 21736 36087 45143 57271 49927 54246 55338 39203 26898 21820 8967 21577
6282 21577 29349 6736 17686 34192 24257 44044 43072 36852 35397 28358 15608 20881 44156
6269 44156 24896 -1041 9280 51149 46188 29134 26732 18110 -824 1572 12398 891 -21768
6256 -21768 -14718 -21732 -20044 -30218 -67252 -35559 -9327 -5293 -9543 -6154 10098 -5064 -22567
6243 -22567 -13825 -934 -18035 -42563 -26975 52 -17477 -25217 -9130 5928 22036 31783
6231 31783 23067 11261 28066 14456 8940 -133 -15874 -89 13470 16719 30665 23335 34405
6218 34405 57904 55018 42854 4653 7716 23252 41542 42817 23736 13503 15719 6462 1263
6205 1263 -18608 -13251 -6052 -31320 -33466 -13398 28265 27408 -811 -22850 -9597 650 -3803
6192 -3803 4789 24980 26455 13801 -885 -15707 -7287 -26532 -45228 -47398 -8215 7034 -525
6179 -525 -695 6367 -7495 -15947 -11996 -18883 -29982 -38631 -10088 -17860 -27467 -21563 1056 34863
6165 34863 29682 28995 34705 24173 31146 32358 1542 13344 26541 445 -1552 27399 22621
6152 22621 -6702 -27023 -17485 2903 9351 -18137 -25728 -14550 -24766 -27521 -17084 -4049 2830
6139 2830 19683 40310 30700 -937 -7170 -14957 -21831 -38190 -33291 -27196 15694 30995 45228
6126 45228 68300 49767 14763 21411 44206 8728 -9120 -12389 -28236 -19061 -3219 -3920 3451
6113 3451 6868 -17200 -41137 -35154 -35488 -39500 -32286 -30771 -12246 14232 16733 36462 33617 6944
6099 6944 -12249 -34477 -26557 22027 48346 24970 33487 29054 10684 -28874 -57421 -17681 31437
6086 31437 18292 -21581 -34199 -6722 -3521 -17761 -14970 -9782 1191 26343 28044 30633 8065
6073 8065 5242 -14779 -10090 -25185 -42398 -43121 4241 19471 12467 8651 6205 15277 -7936 -8832
6059 -8832 -18861 -34344 -31039 -24291 -9933 6299 11299 23342 -947 -155 24010 9971 -12784
6046 -12784 -23377 -33288 -24471 -24383 -29668 -20866 -1445 -11366 -12762 -10481 -31995 -25635 -50772 -54420
6032 -54420 -19646 -6642 -3170 -41929 -65884 -59981 -41109 -17322 -6281 -13286 -41763 -36124 -17416
6019 -17416 -24530 2706 9515 15659 2618 -9233 -2796 5449 15437 18272 2607 -10836 -14622
6006 -14622 2511 3139 -1390 5078 29167 24550 -11309 -36396 -45055 -8017 -3974 -12247 -5156 3864
5992 3864 10430 3518 -31691 -44608 -28264 -4039 35023 46167 32953 -1249 -20116 -4021
5980 -4021 -5702 -31623 -29978 -27380 -28478 -10089 -3210 23755 33391 38686 44116 29835 29244 4586
5966 4586 19415 44335 70945 32958 13009 -4020 1219 19710 18333 -10980 -28944 -28721 -10481
5953 -10481 25704 20017 25946 38672 17205 -18358 -37614 -7439 2730 35489 28919 -2850
5941 -2850 -8672 18526 26907 33610 8092 -15354 -18920 -10654 -22935 -32195 -7020 -19006 -21394
5928 -21394 -8490 -30745 -45713 -13981 -10442 -20098 -5938 -26402 -71794 -74061 -48092 -21455
5916 -21455 5181 -1553 -27689 -48734 -49744 -27535 -16806 -22655 -20506 572 -8886 -18983 -26508
5903 -26508 -15726 -2929 -14964 -33648 -11707 8743 3551 2607 -9148 -28795 -36785 -31335 -17425
5890 -17425 -4839 859 -8019 -3908 -4845 5909 33163 23797 -4185 4482 -2562 -7724 -2731 -3534
5876 -3534 22092 40626 24645 6152 2767 -508 -7660 6356 34996 36189 36276 31551 30828 31579
5862 31579 49187 29275 35521 11508 -5774 -3281 -26194 -12338 12321 853 7829 45693
5850 45693 33566 33801 27365 -7955 -9371 -13655 -26223 7417 19237 5951 -9242 -2701 11547
5837 11547 16551 9553 -8373 10114 8590 -12725 5658 5093 -2516 -19021 -30144 -21292 -32377
5824 -32377 -34045 -34626 -26218 -12459 489 -19138 -9076 -11456 4572 27914 22161 6917 -26129
5811 -26129 -28470 -17334 -24889 -45864 -25734 454 -17684 -39559 6385 44400 49074 66965
5799 66965 58605 51097 46797 36693 28299 32593 11281 -547 -7366 1452 27533 18672 3329
5786 3329 -7941 -9925 -9792 -1459 -250 -7454 12625 10940 7867 11317 -15311 -13999 3356 15762
5772 15762 18343 20848 14841 -2963 4497 -9778 15155 33863 29958 11141 17525 6819 18875
5759 18875 -1468 -11028 7742 14695 19035 12512 18953 23627 -14977 -40501 -3553 11753 19627
5746 19627 32041 24571 12503 10915 14196 -10062 -9228 -18123 -42616 -25347 286 -22240 -36721
5733 -36721 -50980 -41779 -21136 6108 29342 35131 24134 16241 -2905 -15485 -23862 -53928 -59560
5720 -59560 -46466 -16150 35921 12791 10224 26368 4344 -206 21403 17151 -13446 -36964
5708 -36964 -13229 323 -9332 -41504 -47234 1461 24828 46659 37912 13506 -8433 -49619
5696 -49619 -44992 -28083 -26172 -34559 -13443 9964 19683 15057 16594 24735 26901 18280 -12361 -12297
5682 -12297 -11277 -41999 -27046 8722 2 -18441 14749 17407 15308 12499 10581 8927 -3640
5669 -3640 -10512 10735 1203 -14026 -305 12993 9343 17333 7585 -4564 -12953 -19420 -12327 -21261
5655 -21261 -21079 -6325 -12483 12572 23304 39087 56877 48763 29470 -5743 -17170 7036 24259
5642 24259 38470 39781 10317 18730 11809 7466 179 11957 26957 -2187 -8482 -115 14398
5629 14398 32937 49691 23337 -22740 -41234 -40665 -32229 -17854 -11813 -15291 -10548 5533 -16916
5616 -16916 -22201 -24416 15058 12397 -32859 -20425 -3723 11128 27093 53534 43762 31950 53010
5603 53010 71685 71354 39523 8734 -16086 -18415 -19037 -20693 -7028 -8519 -19161 -8730 -8966 -15495
5589 -15495 -169 -6415 -13053 -43714 -29194 -1816 8452 11062 -1824 3929 23654 39935 43420
5576 43420 -13567 -12700 5526 15692 5067 -850 6439 -5506 -3708 4015 5452 6164 1899 15467
5562 15467 37713 45178 19859 9659 12450 14574 35708 44607 19259 -24673 -42507 -28038 -23837
5549 -23837 -39428 -37644 15268 20749 -3739 -18331 2326 0 -5022 -15014 -41847 -14636 -2976
5536 -2976 -18871 -45793 -22004 6477 -1183 214 5031 34235 25731 -7767 -21884 -28861 -51588
5523 -51588 -32780 -14875 -2791 22933 30938 13243 -11095 -9353 -3261 -18936 -6387 870 -21620
5510 -21620 -12281 -7069 8453 18405 9640 -11259 -15481 -5213 3649 -10279 -1164 -3926 5870 20639
5496 20639 15804 -12811 -16297 -3261 13460 59375 46158 26245 17208 28654 33756 40202 32519
5483 32519 24771 -10778 -29608 -16051 253 -8303 4843 9387 10633 9722 5603 12172 13973 4512
5469 4512 -20177 -11579 -22882 -50036 -39807 -11364 16912 5640 -23554 -22075 -22032 -29523 -65222
5456 -65222 -15108 24435 25290 -14933 -17956 -12364 9951 -11585 -30763 2909 28053 742 -9277
5443 -9277 -5219 -4805 -16291 -13220 -14973 -7455 6461 29900 33197 28506 25100 15309 -3039 2162
5429 2162 28995 30585 21356 -1899 -13981 -5749 -11419 -29664 -35349 -26346 6937 20510 3570
5416 3570 12285 28550 12489 5643 -738 1289 -2041 328 20734 23801 11520 -1204 -18334
5403 -18334 -40732 -38724 -41584 -58342 -48374 -39848 -27904 -41137 -39063 -22590 -22026 -3800 -4019 -19529
5389 -19529 -32080 -24638 -19449 -19943 -9111 -364 -21071 -27390 -20800 -16268 -3769 801 14306 31357
5375 31357 34098 10317 2222 28196 31775 35072 40470 18730 1961 4042 -1597 -241 2055 -13777
5361 -13777 -48556 -52079 -42171 -28974 18210 28206 12217 13375 7327 7596 -8855 -25268 -34890
5348 -34890 -7802 6343 11700 -2421 -4522 -25663 -27821 -18182 -9873 -2834 25906 7883 8722
5335 8722 14953 26620 18712 12020 7791 -10070 -18293 -42747 -26537 -4060 -17733 -21005 -16235
5322 -16235 13176 19746 -10039 -8754 3739 -1159 -13020 -5971 12506 16816 19509 36874 391
5309 391 -25531 -4022 -15420 -13788 -3111 17021 11242 -18990 -21493 -28047 -10321 -24196 -59675
5296 -59675 -56622 -53811 -30998 -19219 -25489 1976 13526 29444 15005 8637 17406 19766 26815
5283 26815 -9746 -7266 18307 448 -11753 136 6332 -1722 12637 -4080 8815 28187
5271 28187 11290 1972 10806 21558 -10891 -24168 -16762 2354 21961 17443 25330 29709 14257
5258 14257 19164 12471 9043 21822 36503 39093 35113 13042 -7231 1730 -9494 -16808 -14958
5245 -14958 -19073 -20670 -1844 23137 33968 26525 21838 37918 7807 -21074 -17177 -12436 16665
5232 16665 2501 -15863 15222 8568 13508 -3737 -2199 10501 -358 1530 4779 -13804 2324
5219 2324 -4520 -17613 -30202 -25833 -15702 -5099 3444 3422 -13174 -27488 -22393 -11430 2278
5206 2278 2646 15903 32405 37968 49615 30436 34895 23376 8737 4216 -13132 -23803 -14079
5193 -14079 -531 33112 59682 21385 -7379 -26256 -22139 -15152 -2985 -12389 -5205 -10673 -22228
5180 -22228 -16253 -3194 -14701 -7881 -1894 4629 10149 20521 11116 -12381 -22252 -17064 -1020
5167 -1020 -5113 -5337 16522 15889 6685 21991 14172 33664 53617 47513 44112 42975 47863 37442
5153 37442 36851 31569 23528 4179 13270 15150 -4566 -38508 -14871 -10984 -12933 -6062 7379 1657
5139 1657 16049 6776 12145 16827 32671 34112 43935 27563 -769 3847 14703 23891 35988
5126 35988 28983 29690 21872 16402 13468 6674 12018 25889 28830 31206 35975 24341 11177 7074
5112 7074 16249 38334 41599 24818 463 -17877 -247 15153 5331 -27423 -41586 -55826 -65371
5099 -65371 -57105 -10887 19414 681 -7573 -13602 -1555 13886 31872 22780 24402 48921 67314
5086 67314 65168 59179 53333 63892 49058 10249 3378 1923 698 33608 23184 29421 25377
5073 25377 11247 -1203 23238 32313 28771 -1784 1244 4176 -28977 -31853 -47761 -31504 -5079
5060 -5079 1821 12362 -14813 -13132 -6666 -3056 -25 16977 27024 33222 33226 8356 -6479 -12928
5046 -12928 -30749 -13869 -18847 -15579 -1569 6816 20716 14867 7234 -9575 -30480 -48419 -33140
5033 -33140 -36315 -30919 5987 13366 19901 28763 1979 4385 10735 5923 35669 42484 41589 43578
5019 43578 20068 -11358 -9156 -1409 -326 -7171 -24410 -19898 11934 5715 16148 52855 41984
5006 41984 7957 -5805 7612 3890 -8351 8001 14334 636 -19293 -3733 4788 15376
4994 15376 24345 29287 24734 7929 -8116 -22052 -23167 4131 10913 11279 21663 19748 -3280
4981 -3280 -14914 12840 41494 29027 21971 19645 439 -18378 -3059 2678 -1275 -7454 -42490
4968 -42490 -60589 -24976 -12498 -24609 -15232 -12722 -15585 -581 -12147 -10968 5469 -178 15248
4955 15248 8040 -12069 -32202 -18678 -10907 -16302 -5126 -18467 -17338 3870 11979 -1631 17072
4942 17072 42420 21519 -8096 -7877 -6854 12315 27056 29474 4939 12724 -1476 -5924 -3618
4929 -3618 13694 17119 15631 3533 16211 285 -4772 16707 24168 971 -14866 -3969 -2932
4916 -2932 26358 19130 -12491 -29200 -27679 -34089 -39390 -36750 -51633 -39314 -27111 -19881 -2474
4903 -2474 -13964 -18483 -24562 -16713 -480 7465 -3300 734 3059 -1913 -21111 -40407 -47381 -45868
4889 -45868 -51964 -45568 -30896 -34676 -30363 -26664 -12147 2763 23005 6841 -19860 -26391 -26171
4876 -26171 -2305 10397 14245 16868 -2948 -3719 -3931 23636 20409 27237 28123 6136 9945 16047
4862 16047 23071 -671 -11705 -32759 -40737 -29793 -15438 5421 32973 20721 8197 15948
4850 15948 8986 27173 42036 26895 9 5995 25766 53796 28167 7821 4207 -547 -14987
4837 -14987 -15175 -1637 -8244 -8149 5856 14214 42294 47878 39936 6782 -5134 23496 5193 -8281
4823 -8281 4101 -16297 -1469 -4645 -20867 -13416 22878 22036 10822 -20008 -41674 -19960 -16506
4810 -16506 -17802 -8664 -59 -8565 7229 34312 27261 23122 64081 63805 26290 10024 4000 24436
4796 24436 26469 32183 43053 23756 7600 -44 -16150 -15668 -10490 -2866 -12873 -2670 16157
4783 16157 2721 -24825 -31681 -15228 -21179 -3720 -23373 -44610 -20281 -23025 -7110 3133
4771 3133 -18304 1901 12773 7766 11752 20234 30 467 -12189 -16881 -23699 2589 25912
4758 25912 21864 -1728 1139 35513 22867 24121 32298 11964 -6962 -21730 -36369 -29339 -44817
4745 -44817 -32348 -31494 -16399 -26555 -2356 -2289 2924 22614 12872 22792 15888 -5265 18974 43363
4731 43363 39662 40522 42531 41811 25024 -473 3201 14479 12224 -1753 -3069 10355 34958 25400
4717 25400 2414 11334 37282 43984 49104 37186 29769 31025 51126 39899 22437 11346 -2813
4704 -2813 -13172 -6403 -15092 -29974 -24209 9414 32745 -3450 -10541 -7991 -9067 -15069 -23089 -475
4690 -475 24111 54022 50673 22484 10414 8807 31885 45554 48876 19496 -4226 -21114 -33726
4677 -33726 -13570 -7833 -12045 -10580 8997 -20200 -27079 -21074 -21727 -16919 274 -7448 7542 5459
4663 5459 13718 -6904 -2420 -10978 -30050 -19045 -3325 -20123 -18324 -5325 -15550 -15944 9813
4650 9813 8578 -20047 -11626 9747 21115 21297 3689 -4363 -2680 8427 23617 18048 7703
4637 7703 22618 29078 8928 -23383 -19693 -5624 -19326 -42354 -58833 -47331 -38371 -29793 -42076
4624 -42076 -19412 -2630 -24752 -23392 -19779 -21903 -22337 -28680 -27149 -18278 550 -6955 -16055 -21603
4610 -21603 -21702 -8416 -14191 3790 10389 -2060 5898 28880 54630 54739 47371 25136 12536 373
4596 373 -10338 -45559 -58680 -65703 -51244 -27118 -661 6866 -2195 8497 20379 28952 -10132
4583 -10132 -47318 -9179 15096 12709 19878 40564 29724 23670 8656 16497 1999 -18524 -11642
4570 -11642 10891 20691 17603 6661 12114 37118 37614 25898 -14990 -6014 12607 2719 -3536
4557 -3536 -18689 -29194 -18257 -11616 8668 5479 18283 41537 25056 -2971 -11085 -26862 -15048
4544 -15048 -4156 -16619 915 -8050 -13084 -1245 -6781 -43240 -50746 -23435 -9754 6324 33202
4531 33202 45045 42364 15696 -864 -6666 18825 12426 11888 18459 17056 8867 27854 7946
4518 7946 -2623 -29397 -55290 -31585 -7275 6098 8053 28290 28359 -12138 -46925 5725 39558
4505 39558 41789 33581 38451 41044 26131 -3899 8370 38002 31381 32365 59546 21316 -14394
4492 -14394 -18202 -17652 -30196 -53815 -64604 -61264 -36353 -19043 -39682 -47130 -12034 -15188 -29558
4479 -29558 -22465 2031 4242 14453 49065 69685 64157 46292 47019 52608 30413 8757 13655
4466 13655 15739 29041 12994 -26510 -53204 -16424 -7547 -853 -24450 -10299 26527 56880
4454 56880 56994 3857 -6309 3639 7532 30652 60098 45999 62258 57844 42314 39846 36879
4441 36879 36177 40146 26606 18858 26637 13354 -9850 -16049 -11299 23454 21340 -10628 1980
4428 1980 7772 14228 12201 2584 31055 17481 14215 12173 -4051 -14897 -2531 30076 42795
4415 42795 7749 3564 -1254 -10524 -1433 5033 -5287 -19260 -18430 -7547 -40363 -32247 5553
4402 5553 26920 47982 41229 11902 2258 18595 635 17181 35596 25554 11470 1001
4390 1001 -10360 -37657 -34107 -41037 -39783 -42628 -31029 -22593 -2202 400 -4548 27305 24835 -6763
4376 -6763 764 4554 -87 -13124 -24177 -30764 -31129 -10350 3428 -10450 -13502 4813 1029 -27799
4362 -27799 -38679 -9921 4316 3407 566 11186 27008 13259 2293 -227 30945 25198 -3842
4349 -3842 -19210 -16474 3591 36123 39601 24482 -12237 -34182 -5963 10717 9334 12034 22149
4336 22149 14096 -608 15744 24512 19553 28518 36415 33364 23104 33441 24080 8859 -6497
4323 -6497 19118 14951 -9952 -18421 -6976 11750 37849 59379 43417 26757 4220 4888 25222
4310 25222 -164 -25786 -31976 -21054 -130 -12112 -29574 -16797 -242 -1719 -9698 -9318 -9765
4297 -9765 -9188 -3275 11775 15226 28036 35028 35288 6750 2097 -1434 -4437 -6064 -18431 -34324
4283 -34324 -1390 2217 -14435 -22496 5653 31162 30499 18081 -2516 -22872 -27235 -30081 -14942
4270 -14942 29714 54024 23344 -7381 16747 23787 11771 -1130 -5578 -2932 -17359 -30994
4258 -30994 -16505 -24635 -24691 6277 14921 -11614 -20334 -2354 -9368 -6156 -10908 -4561 500 7967
4244 7967 -402 25104 24491 -7060 -16476 30313 31696 35099 16246 10092 28971 13599 8848 5487
4230 5487 2136 23859 40423 45448 43116 26545 -3060 -4004 24707 31939 15481 5917 -12225
4217 -12225 3801 34221 9625 -30239 -32090 -21260 -3319 -1081 -8149 -10517 28406 44610 31795
4204 31795 -7318 -5109 1910 3200 -19030 9800 38609 9624 18678 30083 27887 17625 19081
4191 19081 -5036 -20008 -18861 -22081 10240 33069 17554 3805 3081 16804 46816 49942 50925
4178 50925 60004 48069 20391 28998 33198 35234 38138 50448 55585 42556 59835 35155 -1851
4165 -1851 -21567 -14086 -19762 -40891 -43112 -27248 -37030 -27175 -19664 -7332 -3411 4412 -8538 -16675
4151 -16675 -26686 -40371 -44258 -28677 -40767 -44786 -31482 -22047 -23969 -17705 -50853 -41963 -24247
4138 -24247 -12692 3079 -28 -3480 -562 -26326 -40755 -31733 -11662 1618 -9027 2004 5760
4125 5760 8329 2912 1342 6942 14756 15013 27122 58551 56213 35832 46251 48278 49675 30983
4111 30983 20972 18419 18294 8112 10353 13986 17393 11935 14137 13176 11288 13762 27239 25383
4097 25383 15873 14956 15702 11499 11981 -7893 -31112 -25208 -2945 -10863 -3051 -11795 11715 16427
4083 16427 3299 5039 23082 23677 22414 27541 17008 2998 -34163 -36717 -24077 -34284 -47756
4070 -47756 -55763 -7213 10658 4201 33207 40870 17402 20816 28518 23171 23055 39439 20038
4057 20038 9189 19980 16827 -6396 -49692 -48924 -36280 -25114 -9025 -4969 362 -783 -25119
4044 -25119 -43207 -50890 -3768 29904 4797 7441 18814 19790 29735 7631 -9612 -17621 -7381
4031 -7381 4911 10875 11755 27878 14400 -4407 -14292 -3119 5627 7040 26784 32902 21277
4018 21277 18685 22035 18245 24582 36776 35216 24082 29411 -5633 -4350 14575 22500 36274
4005 36274 38936 28022 2911 -4639 2060 -15157 -44327 -37711 -29239 -23328 -6475 -5956 31186
3992 31186 40097 32797 3385 7509 25957 49308 26986 11517 -6574 -9869 -11392 13330 13989
3979 13989 -15521 -33898 -2254 10208 30835 2374 -28379 -33452 -27513 -6792 2291 31035
3967 31035 26673 6274 17182 -7149 -879 7923 14216 46391 46477 32242 19431 11318 16852 -7742
3953 -7742 -10504 -6227 -3552 25974 26526 18471 15038 -828 -15967 1390 -625 -7479 -3687 3153
3939 3153 -3000 -17348 -7942 22977 7146 -11347 -4404 26063 23342 24300 2903 -15170 -23036
3926 -23036 -19524 -3917 831 16141 33907 43831 70142 43360 37527 40588 33408 6493 -6096
3913 -6096 -11445 25303 39609 22190 37979 44992 58419 42819 22073 33715 30010 27760 14873
3900 14873 6605 -5845 -7406 -3655 -1614 -6176 5652 13555 7621 -17747 -29761 12918 11180
3887 11180 -8979 -17344 4230 23120 42 -11196 -22454 -863 16879 12026 10236 12622 5397
3874 5397 14327 8947 -10890 -29504 -27105 -14022 9738 17629 15092 11557 21430 8845 11408 22831
3860 22831 7646 10866 35756 53641 50645 43024 38636 47985 38284 52968 62415 37848 7152
3847 7152 -2223 6363 -7326 -1287 -11623 -26592 -42139 -46530 -40373 -14742 7515 -3585 -24567
3834 -24567 9125 32671 29238 13123 21997 3333 -22915 -36953 -22769 -9126 3568 14823
3822 14823 36604 47461 31634 3009 1555 -27241 -43052 -41502 -16281 2023 3509 13092 24226
3809 24226 23561 12546 31003 35141 16653 2672 920 -7184 11165 24653 23813 32499 37402 55303
3795 55303 61943 35232 22439 -17280 -2056 9008 -8500 -15579 -5334 -2145 -10930 638 11776
3782 11776 19301 24656 20715 6522 -1093 19972 59085 47306 28919 29212 31046 13042 13455 -4433
3768 -4433 -4018 -5379 -5044 16549 30505 13458 29527 52274 41438 43808 41611 45104 32769 30977
3754 30977 27440 8001 -842 6610 23824 45275 35473 -7805 -19699 -5299 -26313 -34983 -24091
3741 -24091 -34895 -26768 -31397 -8377 -22791 -32629 -26124 -5634 37550 30312 22594 36997 27816
3728 27816 18605 22063 28697 23102 7263 5986 33754 29504 43724 59838 29701 16634 -2894
3715 -2894 -2297 -1987 -10075 -31930 -35724 -17386 -19670 -19604 -5015 18994 24573 42840 52588 31623
3701 31623 7744 -13024 -13651 -26889 -33921 -20362 -26565 1973 20903 15545 14369 -4695 8606
3688 8606 8794 -11151 -4522 20247 31924 43919 26092 -6498 -5000 5890 17369 37134 40545
3675 40545 33728 41572 33645 49064 54762 54394 45635 30456 20537 35975 29913 29769 27011 42342
3661 42342 24579 5214 -4640 756 23611 39503 32293 1843 -9187 -10229 4206 28550 22276
3648 22276 16092 8723 3888 2099 -12701 13439 33524 33552 44534 4619 3251 5903 -492 -14021
3634 -14021 3365 8001 7926 15828 17809 -6216 3109 8790 14580 16403 -13804 -25014 -12918 15162
3620 15162 11428 4931 4416 13012 13267 26056 46971 42730 47355 42793 40213 36673 37253 37853 21241
3605 21241 11213 5037 6481 8471 -4765 -14780 -12492 -10454 -4172 15926 -857 -18217 257
3592 257 11414 30204 44830 19419 -19167 -12774 10252 2180 -16202 -6306 -1808 17281 29083
3579 29083 30790 40036 50037 36391 18204 7594 -5302 -8744 -7191 4276 -607 30150 48867
3566 48867 41209 33084 25279 -4054 -15134 -9242 12775 22811 15921 -17345 -22038 4832 2908
3553 2908 13529 14703 6353 -5009 8528 5379 -6189 -16946 -22362 -24850 -26276 13833 46188
3540 46188 62337 50272 44500 28106 -18963 -7270 10745 10976 7366 17849 43530 58851 41286
3527 41286 14932 21406 22128 38592 40811 10856 6420 -2678 -15935 14788 20770 1852 -6366
3514 -6366 -14648 -3379 16771 43245 57958 71438 73706 56732 36235 48188 17679 -2037
3502 -2037 -13133 -20825 -45037 -25233 -5777 1784 -5917 6954 17631 4916 -8523 6003 -17769
3489 -17769 -24213 -20512 -13225 -6236 18428 46708 77325 70748 63993 42508 13040 -8120 -4170
3476 -4170 4190 2521 9900 33583 16667 -15647 -350 11723 28507 40268 26316 -78 22707
3463 22707 22880 -6210 -4165 -4218 9727 1966 22255 14716 -1180 37097 9400 -4246 16768
3450 16768 7222 4908 -14373 -14464 -740 -6430 -5223 5879 20744 21843 -7930 -6348 -967 -16939
3436 -16939 -13055 -4487 -12792 498 32880 45788 51414 48018 27312 14548 -13113 -19249 -13979
3423 -13979 -13934 -19973 -11481 -19359 -36168 -6735 3909 -37644 -72883 -69657 -67439 -39405 20367
3410 20367 25690 26887 17471 -6165 -8498 11784 19618 15022 7600 6007 366 -8448 -7672 15329
3396 15329 -1764 -32857 -28075 -15543 -14074 -33276 -25679 232 9100 -11355 -19205 -3922 4736
3383 4736 7621 14798 31090 26862 3874 10390 3989 18053 20678 17777 18570 16825 4279 13202
3369 13202 17261 17750 7702 9631 34753 48188 36613 32889 41478 54371 51967 29105 21751
3356 21751 35418 14163 -7529 -6435 -22956 -24552 -1474 334 -5172 -3712 -26023 -15671 -4145
3343 -4145 -21318 -25400 -13368 25785 44982 9358 -20234 -3166 5686 18963 6538 5605 18722
3330 18722 27199 54240 30905 11484 38053 57290 49177 29302 37817 12513 -2560 -2522 4070
3317 4070 -20326 -47421 -42197 -11328 -9006 -25466 -7670 4297 6981 18828 22831 5263 -21754
3304 -21754 -43541 -33485 -34753 -15308 -19133 -2814 19139 27653 6692 -20502 -21915 -499 -16235
3291 -16235 -25835 -4335 -14600 -19501 -27671 -37085 -37234 -54471 -38377 2485 9912 -8048 4041
3278 4041 9774 4322 35856 26868 -7020 -11085 -6611 -5211 4549 13878 22351 21939 -10735 -30860
3264 -30860 -640 29709 33011 -5844 -5590 49474 72905 60515 35691 21716 21801 32260 43196
3251 43196 50675 50220 19757 -855 -2651 11089 18812 -15201 -14159 29698 37040 25299 28193
3238 28193 11878 14336 4213 23718 55395 53774 36537 24063 29101 31677 36607 11892 -9931
3225 -9931 -33337 -28642 8345 41642 47591 3274 -32264 -48157 -59305 -60364 -39277 5245 36342
3212 36342 33819 10438 12616 15074 -17171 -39357 -27240 -27410 -17844 -23001 -19579 -8491 -18018 -22384
3198 -22384 -31088 -11331 -11075 -17455 -14623 -20685 -9809 -17450 -25116 -13761 -4160 -17758 -2741 -3583
3184 -3583 -17165 -9605 -11872 -15019 -12380 -15642 -20931 -10123 4032 38919 28985 17860 3356
3171 3356 -16981 -4131 16239 14820 3792 13138 15865 31439 30362 2393 1162 5540 14695
3158 14695 33231 29616 -2457 -13831 -30150 -23784 5882 29460 46616 39063 10041 10790 29132
3145 29132 21017 14965 -18781 -39824 -33565 -31539 -37822 -24250 124 17546 26173 -194 -22965
3132 -22965 -7773 -11690 -16674 -549 28082 23241 39739 62769 57132 65857 54148 30399 26663
3119 26663 9780 4528 -16752 -22815 -11490 4062 -563 30355 15853 2129 14106 -28610
3107 -28610 -40180 -16727 6304 13296 6380 -3439 -44849 -37289 -17728 -26740 -20908 -18308 -27354
3094 -27354 -14805 -29741 -1224 -1956 -37056 -34410 -26204 6099 34558 33043 33428 13812 -6372
3081 -6372 -23918 -9465 11044 5650 -12552 -13330 12060 24677 11593 -4207 -35866 -64211 -42242
3068 -42242 -10620 -6456 -24750 -30628 -48539 -58401 -27051 -5866 1318 211 5659 -15850 -25477
3055 -25477 -11987 6632 895 8520 38399 25373 6844 4194 -17016 -34871 -18611 -9172 1263
3042 1263 7163 -7514 -10589 6735 19322 8407 -5428 10084 18248 -3488 5519 6371 18558
3029 18558 5005 -268 -5667 -20502 -16007 -7565 -1192 17088 35978 22442 2987 9163 -1885
3016 -1885 -779 -6010 -8088 -24723 -10682 -7802 -28622 -38387 -11036 15226 36187 51411 26563
3003 26563 36408 12205 14058 29527 34935 43136 50154 26887 42717 73767 74826 53490 50339
2990 50339 36642 18362 22359 22201 5487 -609 24160 31610 32469 25554 28878 18602 23765 30807
2976 30807 26488 16547 31224 42593 5705 -14468 -2011 -9258 9615 8874 11219 2779 -15120
2963 -15120 -15243 -24919 -17442 -2604 -7297 -36338 -38055 -10712 11719 8964 23187 56312 58404
2950 58404 39305 13295 -4456 -21024 -14235 -39845 -21297 5516 -17106 -6011 21646 24198
2938 24198 23709 28300 30692 33634 22198 26819 35008 37838 36122 24212 23167 13630 -8677 -4349
2924 -4349 -3488 3522 4506 17801 33595 42058 30588 6350 17547 35083 43041 36574 21231 26842
2910 26842 4536 21450 15168 -1723 12685 10821 15306 -1828 -23647 -14107 -2962 -947 -2209
2897 -2209 -14630 -2067 8021 22392 18366 24569 50653 62723 32705 11007 -2658 -24050
2885 -24050 -30531 -16466 7366 37296 51269 38771 18759 25648 38461 29434 20148 -24169 -48579
2872 -48579 -60181 -58823 -39623 -48870 -65891 -63775 -46822 -30949 -30252 -45550 -37463 -9581 2424
2859 2424 -3724 -15506 -42344 -63616 -30594 -18862 -17076 -22364 -6511 13181 52871 67708 51131
2846 51131 35414 23592 9158 5597 -6524 -2213 8890 26853 35445 15920 13648 10562 20499
2833 20499 18114 4634 27404 26889 19538 32427 12017 -8967 -20073 -11477 -9074 2717 4472
2820 4472 10897 10279 -17388 -21299 -31014 -40914 -14343 -9331 1780 30408 11178 -32146 -31596 -30240
2806 -30240 -32246 -19745 1953 21718 49001 22932 -10737 -12757 -13556 8007 29752 26429 11706
2793 11706 14902 21899 19010 -1000 -10002 -8769 -16368 -27021 -9894 -2433 -18350 -3098 7644
2780 7644 8357 -2167 5360 1289 5321 3715 11068 6702 -969 18465 34937 20288 -6343 -5067
2766 -5067 826 9756 -3661 -24068 -29721 -26203 -1238 -11078 -1705 17320 22609 -1120 -11571
2753 -11571 -7117 2925 29324 16935 6497 -15859 -7936 1558 -19042 -48001 -51282 -22354 -7105
2740 -7105 -417 20905 16342 5814 -7908 -29 968 -22859 -34525 -37051 -32553 -9302 8046
2727 8046 14107 26503 48273 32396 4995 4102 -27440 -6561 1175 15647 40447 24391 -1223
2714 -1223 -21498 -20575 -7069 10917 25495 21973 12156 30711 44676 15437 -13478 -21248 -30448
2701 -30448 -27362 -20016 -1879 21868 22114 -12359 -7993 9356 -15300 -4070 12548 5707 11016
2688 11016 16065 -16249 -38724 -19534 2140 8336 -16717 -2015 29210 45450 51670 68444
2676 68444 47182 21409 7920 2400 868 -142 -20354 -15032 4379 5780 25793 -22433 -45340
2663 -45340 -36159 -25833 -18439 -7396 -22135 -54836 -58120 -53469 -44184 -32547 -38279 -18197 1223
2650 1223 9859 26400 39411 29440 29610 -3205 -10803 10139 30430 51797 31832 11151 -2945
2637 -2945 1619 17277 17050 5379 10320 10704 -8705 -17916 -10357 -10688 -4767 2369 -11097 -36630
2623 -36630 -40769 -30441 -37419 -20777 -16150 -20578 -3618 -7540 -2557 16606 35559 40075 22971
2610 22971 23138 40634 12630 -23043 -41500 -1872 28124 34027 29177 15909 26016 19079 4315
2597 4315 5846 -15108 -43954 -55396 -33772 -21978 -44033 -20810 -13338 -36989 -59263 -49405 -51515
2584 -51515 -37661 -28255 -41435 -27542 -27417 -32592 -22010 -11423 6823 -3489 -19534 -17429 21702
2571 21702 30500 13537 3542 17247 14069 -28283 -33243 -4715 -23748 -21735 -18603 -32055 -9912
2558 -9912 13344 31703 42849 57468 46659 35111 50995 47894 27500 15325 35582 55087
2546 55087 52746 21547 -13316 -21701 -9747 102 9729 279 3673 -9986 -40088 -30193 153
2533 153 28966 25445 30461 46640 35218 -904 -24303 -6547 -13145 -15660 975 1461 -10147
2520 -10147 5550 -25374 -23197 -12013 -19262 -15259 -9775 11141 27292 24760 7800 11688 25196
2507 25196 44014 40034 31233 30399 28062 17415 594 -16059 -17148 -22039 -27331 -33066 -15898 6263
2493 6263 17560 22136 34122 40121 28745 8416 13219 13446 30638 52083 25579 749 -4683
2480 -4683 -18837 -11503 -8156 -16485 -39270 -52489 -34456 -10366 -26974 -20404 -18257 -32574 -13507
2467 -13507 9535 6838 17319 28439 13851 2219 19565 14032 46817 48049 14565 -23257
2455 -23257 -26282 -1013 17041 21322 16265 -5085 -1027 25461 19403 -22074 -15418 9988 12074
2442 12074 25353 28296 14489 17683 11972 6217 11203 14676 -2656 4552 6625 23061 18988 6447
2428 6447 24315 31787 9508 -2105 26952 15103 -10130 -29488 -9874 -22752 -32845 -14394
2416 -14394 -1148 -2775 7986 37940 64524 22839 871 -18137 -24139 7628 39487 17020
2404 17020 -3987 -16982 -25503 -11509 -9970 -2104 -6645 13397 -5941 -13560 -14356 -19462 -36505
2391 -36505 -39640 -18326 -2099 5625 -17850 -18311 -8956 -13053 -14547 -17473 3118 -28636 -32453 -41388
2377 -41388 -58216 -56929 -54185 -34266 -2293 2483 -13486 15853 6379 -10462 622 1501 -1082
2364 -1082 -13254 -38525 -35465 -28907 -15520 -13103 -15060 -33247 -58244 -61374 -73072 -31694 4736
2351 4736 8018 214 -5420 21098 6522 -4856 -13778 6559 15548 3092 -19480 -27337 -30768
2338 -30768 -44087 -11652 10974 7441 17275 -8814 -20747 -15087 -10600 10899 26574 34588 11279
2325 11279 -1337 -4030 5913 22981 33937 14966 6943 9525 35966 50484 40956 28990 20715
2312 20715 1143 -30781 -29403 -15177 -5613 -5433 -11035 -28223 -33758 6735 32958 2920 -14512
2299 -14512 -26282 -3616 -16106 -30125 -37859 -17887 -13238 -2509 -20105 -47707 -53407 -12852
2287 -12852 9215 6132 18966 42242 42328 18889 7400 16860 7672 8365 -2984 1749 12417 13370
2273 13370 20883 25311 1574 -10318 -5418 10348 17807 16299 8882 -423 -6998 -24623 -33635 -47968
2259 -47968 -34986 -32954 -6508 13700 24134 29833 30243 41491 30789 23310 23464 34050 33945 29996
2245 29996 12437 170 1911 -7957 -35931 -39942 -30016 -36777 -48050 -33249 -27223 -23485 -25750
2232 -25750 -16511 -9645 -13090 -7584 -12743 -15185 -25451 -1268 27626 24709 5081 27413 18879
2219 18879 5799 27314 18996 5009 3002 641 -27161 -15439 12479 13355 20814 13944 4728
2206 4728 -590 -1148 7783 -8334 -20828 -249 2984 9677 32057 14131 11218 20860 13438 18077
2192 18077 46487 32884 -131 10144 10362 -18280 -22400 -23635 -29700 -10084 -12637 -4351 4445
2179 4445 -20451 -5805 6771 3957 25382 63153 60592 9677 -3682 -13352 -16604 -68 25006
2166 25006 42262 65673 81133 49347 31421 14900 25373 -6541 -18379 -7005 -2444 -29145
2154 -29145 -30778 6512 22942 11213 -5183 11125 8685 7939 12042 16255 24960 21805 -15465
2141 -15465 -35149 -22804 -6018 -32838 -43244 -24743 -13583 -9652 -8282 -2632 -2247 -4629 -24284
2128 -24284 -26000 7419 15430 -12373 -27915 -2352 10004 13114 16277 8805 -4045 -18646 2033
2115 2033 21592 30000 15514 -13099 -15626 -25873 -41534 -36505 -25791 -19367 -27922 7592 969
2102 969 -7680 -23266 -66271 -63059 -50874 -22674 9906 36027 19096 5916 4321 24767 1491
2089 1491 -25604 -33463 -18362 -45212 -45617 2177 37701 20311 -633 5073 -715 219 28890
2076 28890 56303 27672 -6445 6437 6952 -18517 -26504 -6971 -14773 -28972 -25138 -36024 -53178
2063 -53178 -52313 -42793 -38998 -1061 30873 18631 12638 -2946 -11167 -6747 -52845 -36872 -4780
2050 -4780 17763 12986 3596 -7576 -29092 -23371 -24122 -18626 -10621 -29375 -17447 -15536 -12135 11353
2036 11353 23717 22827 18127 9468 6863 9911 -9384 -45348 -54160 -45463 -33686 6843 32448
2023 32448 24966 39864 41618 48386 20222 -8891 -53981 -56897 -61299 -16802 -4020 10667 24039
2010 24039 28801 14891 25864 41324 44298 45575 22572 7888 13749 30401 19893 30479 43313
1997 43313 38515 27477 1207 -3318 15312 17290 1991 -7964 -39736 -27681 -36445 -25456 30857
1984 30857 25899 6654 -11027 -22746 -26463 17308 21533 7176 4741 -7455 7981 3931 9674
1971 9674 21148 17916 2510 6110 20912 32084 20029 6409 18612 29446 11759 16337 5710
1958 5710 -19930 -13560 -11086 -4476 4627 -15100 -23769 -18575 -8222 1883 -9953 -4183 20826
1945 20826 22601 29450 5500 18528 31002 32899 41234 39545 36222 37602 -10511 -35130 -40331
1932 -40331 -23032 -30516 -43155 -20041 159 21328 14719 -13770 -10360 20183 9842 23868
1920 23868 27207 28338 53384 53973 54047 15932 4316 -5044 -8562 6547 -9528 -17430 7335 23819
1906 23819 16318 6112 2042 -35340 -46193 -36172 -24810 -22113 -4789 -11450 -16598 -20230 -36043
1893 -36043 -26980 -37699 -26334 -24699 -37752 -31625 -21500 -35292 -24249 -9658 -2993 19066 -3852
1880 -3852 -18222 1628 5321 -9963 -23808 -28937 -15262 -16987 -9541 8303 23605 12999 8882
1867 8882 -24529 -32351 -26033 -20058 -23807 -20279 -11919 17179 26004 15517 28006 38438 42685 17600
1853 17600 308 5212 20357 6821 -15805 -4856 -13928 -11464 -5597 21851 24678 -11491 -6155
1840 -6155 4230 -11984 -22385 -3408 -3127 13616 58636 75461 58629 34779 21397 639
1828 639 -15634 -515 8873 17262 23921 31528 21630 -11983 -47247 -50685 -29149 -13069 9377
1815 9377 24428 11402 -43513 -57002 -35296 -33017 -36423 -49891 -41857 -23885 16918 3150 -22182
1802 -22182 -11671 -2788 6753 -4149 18701 20342 4597 5961 11988 25938 43977 37011 27218
1789 27218 25173 -6113 -19208 9980 25336 4503 96 -1022 -19726 -3235 13772 896
1777 896 -10377 -17460 -1203 20008 10516 10974 5185 5469 6936 27851 48232 26769 1675 5773
1763 5773 29711 -1819 -17558 -10540 -1876 4410 -14921 58 2873 -2694 -6934 9561 13821
1750 13821 838 13180 -7198 -32847 -33588 -15260 -19051 -37400 -23485 9972 23232 12534
1738 12534 22195 5192 -4610 -4409 -23172 -24770 7390 23976 25503 25857 18062 -12075 5119 8827
1724 8827 37322 33755 -4781 -10229 -14193 -10020 8505 7695 6562 6363 -13218 -29762 -26989 -25830
1710 -25830 -31763 -40756 -47641 -32915 -16285 -17503 -20011 -1066 -115 2460 7597 7243 -14855 -3081
1696 -3081 18555 7369 -13546 -93 17935 20406 20314 23627 16407 17496 -4328 -21285 -29627 -38038
1682 -38038 -25028 -6635 7141 -20313 -8898 -17517 -8495 24085 19911 -9064 -10419 -250 16914
1669 16914 20095 3973 -7141 1723 4930 -20383 516 36617 27120 34673 63355 63178 28517
1656 28517 22879 30268 15517 -29843 -40385 -52297 -26516 13605 27428 15489 8163 10824 25636
1643 25636 7898 -14423 3220 -19717 -10900 -7591 -7991 -14975 -24104 4531 2901 11699 7959 38289
1629 38289 50212 37998 43369 17638 -10589 -30677 -28798 -43712 -50231 -26914 -25040 -16579 3289
1616 3289 34041 24131 44014 40877 29417 -7646 -18812 -20942 -18839 -17044 -1537 2129 -2725
1603 -2725 -8121 -14692 -18347 -28252 -24148 -18508 -5950 14818 6406 -35422 -33541 -23196 -17486 2946
1589 2946 20508 -4328 -2219 20629 16825 8615 -10923 -33045 -41616 -17295 1604 25108 22725
1576 22725 16921 13996 2869 13728 -7011 -2121 -9351 -17369 -26297 5786 8437 -6356 1626
1563 1626 2946 14477 23820 33142 37562 19192 7591 4266 31510 36812 36843 25988 37727 47789
1549 47789 33581 25810 13999 -9388 -22504 -5558 -8694 -32496 -28169 -24182 -15802 910 -12472
1536 -12472 -17984 -3740 34198 38462 15329 22452 22869 -11200 -25210 -19238 -11110 -14393 291
1523 291 -14664 -7309 -8714 -6406 -23709 -24968 -25437 3722 3035 4391 10578 13224 45377 48994 34110
1508 34110 30006 16441 32311 44486 31217 185 -6804 -11247 -21870 -29186 11545 58581 46775
1495 46775 31949 12244 -17026 -19800 -14352 1901 23460 12365 -13697 -11308 -30293 -32984 -7918
1482 -7918 13968 24469 11177 5935 -5387 10859 26588 4322 -15234 7511 21075 35241
1470 35241 41124 26197 2316 7222 10996 -633 10104 30202 35087 35465 25678 7679 14496
1457 14496 18729 22855 24454 38735 17799 1922 -20575 -20403 -18053 -3747 134 -32112 -30185
1444 -30185 -10429 -8447 6327 -1223 -15842 -13251 -19273 10184 10406 -1074 -8701 19181 27555
1431 27555 -6739 -39616 -52330 -47450 -60824 -50796 -24335 20738 29446 16157 10076 18250 -5290
1418 -5290 -36205 -44222 -42014 -32196 -8756 -2171 -22330 -3011 11333 9607 -7484 -5167 8476
1405 8476 31003 -4487 -19644 -9688 20382 24647 10257 -9231 -21062 -39222 -40939 -18366 -11848
1392 -11848 28511 50315 25725 6783 -22947 -1766 21159 4238 2248 23551 42891 20291
1380 20291 18385 7276 -13355 -19273 66 27797 2153 -11301 -1768 -6094 -37120 -60364 -64406
1367 -64406 -59610 -18840 -3208 -24252 -12684 1560 -6313 -29951 -33306 -1084 12688 -6191
1355 -6191 -11933 -20705 -39236 -29153 -23376 -21718 -17419 -12384 -300 -10849 -7816 6264 -8871
1342 -8871 -7005 -29386 -67565 -76176 -62238 2832 20229 32183 49724 67779 54307 40797
1330 40797 56185 34751 20413 -5612 -26145 -1447 13587 28255 27392 30474 1352 -9438
1318 -9438 -43965 -36567 -9245 2563 19156 24784 -10916 -44044 -41046 -11304 12335 9345 -2347
1305 -2347 6274 33971 32148 24115 9411 -10355 -29686 -2193 30099 38095 35630 13117 -5430
1292 -5430 2319 10935 14394 10017 -11645 20188 41543 18586 13738 10563 -4513 -20867 -21523 -12805
1278 -12805 -44772 -66928 -52441 -19611 -22087 -14854 -15496 -23084 -34132 -29892 -26147 -21979 5446
1265 5446 25792 -1343 -7806 -29303 -14504 15561 28238 3768 -2611 -22285 -38618 -25643
1253 -25643 5017 8178 1362 2338 8566 -1903 -8621 -13651 -7098 12420 -7052 -14323 3110 -1520
1239 -1520 -22840 -25358 5025 -1043 -29104 -52053 -45363 -10801 -9895 -2954 -551 -5107 -15698 2458
1225 2458 29900 24998 47930 40559 21155 27255 14344 -12203 3881 20611 -4381 -10091 -19745
1212 -19745 -25143 -28479 -31068 -23071 -34530 -16057 16205 25396 -4445 -1465 -10096 -21094 -22935
1199 -22935 -30188 -29434 -16627 7975 23998 27114 14254 9901 21142 14946 -10167 6467 19233
1186 19233 -1456 -39 -10390 -18310 -19902 -7818 -21940 -10108 -7750 -11261 -33911 -18661 -4192
1173 -4192 -21801 -10182 16034 39841 60771 60057 23969 15028 -1154 10075 15093 8962 15359
1160 15359 16427 13203 6451 -24422 -38750 -38281 -26368 -22229 -13074 19144 35396 33323 11061
1147 11061 20962 31850 56074 28758 -7878 -22427 -54965 -60515 -49077 -32564 -20596 -11825
1135 -11825 -11225 -18274 13398 37714 38434 27068 22057 22834 16707 -3983 -19154 -26388 -6112 35407
1121 35407 11716 17222 21326 13210 -11549 -15093 -1494 -5600 -2196 5943 10144 -4876 2212 10150
1107 10150 -15537 -25689 -1418 5835 -3770 11630 17607 21470 9610 -1333 6982 18262 29811
1094 29811 4681 -37491 -31998 373 -6719 -18682 -1796 7552 -1407 -4248 8543 10681 26192
1081 26192 25681 19009 -6856 -6213 -11258 -16088 -8666 24813 26878 6599 1634 -16190 -25667 -23625
1067 -23625 -39568 -32149 1206 701 3663 1402 -3921 -12057 -39300 -35233 -4409 -19693 -18875 1418
1053 1418 13920 8642 -10831 -15940 -21509 -42916 -25740 11412 9325 14281 29340 35506 -3691
1040 -3691 -12377 8717 12001 -20060 -34413 -33577 -11828 -17469 -6288 -17945 -36619 -45189 -23287
1027 -23287 -4462 10899 8897 18005 8446 -27647 -6512 9612 22031 2583 -9649 -9895 10565
1014 10565 22455 10151 -4869 -3676 7131 -5071 5681 23866 13863 12593 20086 1960
1002 1960 5665 19106 33198 19424 16325 19748 14799 25770 7204 13682 3170 -13064 -40645
989 -40645 -29915 -21267 -19500 -16047 -17163 -10548 -17428 -5692 48948 59745 28535 -954 38433
976 38433 63199 65521 65767 40911 19003 33076 37122 6164 -15871 -6890 -1548 -2141 6939 28450
962 28450 47646 46124 25801 10398 -19435 -22959 1015 18311 22005 -7749 -12688 -14902 -13455
949 -13455 4184 11870 7707 -18210 -26240 -10053 -11062 -14785 -3706 -909 -4749 -14555 -30013 -27470
935 -27470 -11915 -37371 -51143 -46046 -27787 -18539 -21713 -40756 -51315 -53851 -22479 -752 -1346
922 -1346 -14364 -28787 -22643 7364 21053 1353 -19824 -9574 -37875 -58655 -69581 -51277
910 -51277 -41825 -53315 -65873 -48783 -53096 -45138 -46170 -39245 -17677 -22762 -54842 -48297 -42400 -20298
896 -20298 2565 -12292 -16892 -12997 11810 11987 -12004 -33296 -49660 -32036 -3268 2306 -8495
883 -8495 -759 2270 22071 11232 6689 27884 8608 -10187 -6760 16881 -1923 -45558 -66613
870 -66613 -62409 -48377 -33927 3301 14729 10924 -2548 -35644 -63926 -33619 -26210 -11125 15778
857 15778 51001 24892 -20315 -27807 -16823 -4275 8848 -16127 -37330 -20360 -3312 2263
845 2263 -9937 -28625 -23829 -12529 -15279 489 30799 7538 27959 16338 -16163 -45669 -27125
832 -27125 -23238 -35 11491 -10265 -21040 -44046 -56877 -75459 -71870 -45208 -26686 -16608
820 -16608 -12311 4432 7809 1896 -7684 -9673 -7391 5124 -4964 -11736 -14533 -1009 13606 6719
806 6719 18831 28209 10787 30724 53162 29055 27430 17474 -2736 -14779 -14240 -11875 -10901 -7206
792 -7206 -20819 -29237 -21460 -15721 -1549 8968 13679 30547 14976 -9610 -11922 -5317 -5675 -7382
778 -7382 12789 37047 21450 16371 27004 55107 73604 70701 62420 56914 42381 45949 66829
765 66829 73839 52976 16585 6526 1389 12594 38966 49256 23091 2082 6222 14795 2229
752 2229 29372 62818 66349 51212 16859 -2140 -12781 -21439 -6399 -3332 -5267 16515 -4501
739 -4501 -10493 1480 -27957 -15245 -13178 -27258 -34245 -22229 -9326 -26 3943 8407 34947
726 34947 45250 24655 24232 16364 23261 31996 29154 16140 7677 -11446 -16861 -494 -5425 -12211
712 -12211 -10586 26859 53257 42689 25983 26008 30306 33027 18187 6331 -3690 7142 26056
699 26056 7272 -33830 -43949 -37489 -12144 -17054 -11095 -3563 -1235 -4250 -22635 -38132 -57822
686 -57822 -61236 -49746 -55511 -28101 2316 -8668 -37964 -24939 28969 29406 13032 9429 6432
673 6432 170 6885 -10626 5836 -17107 -22283 -8779 10384 10682 3749 14399 17167 38667 50416
659 50416 31064 25110 23945 26075 42308 28188 16043 11668 -3921 -14335 -10950 290 -5532
646 -5532 -18386 -36238 -70055 -75195 -37214 -16138 349 9977 35515 32092 13680 3711 -4036
633 -4036 21781 32122 29336 34862 49064 41237 23725 10605 8688 13525 8103 86 -727 3514
619 3514 4650 26422 44399 42867 44138 41795 30261 30645 41104 33889 13173 5312 -4464 -2340
605 -2340 -9928 7869 22816 18770 21777 13707 -4931 -23469 -6140 -20887 -43604 -41060 -10029
592 -10029 -8897 8616 21935 38979 38461 13957 12360 30756 53142 27185 -11943 -22135 -22874
579 -22874 -30380 -46173 -11764 -5211 -7019 5423 19018 -6682 -25001 -25492 -22407 -28105 -30217 940
565 940 24734 10220 -27149 -40596 -13456 -11642 -11246 8769 50789 46409 33581 27327 26469 11585
551 11585 15255 27469 12437 22112 9610 -10437 5136 22516 12664 1880 8522 -734 -9426
538 -9426 17402 21067 22452 5887 -17340 -19632 -18112 -40579 -28819 -3729 -11701 -4723 6732
525 6732 8498 16114 11772 12998 -18183 -7182 14680 5073 5249 8142 38214 38976 7210 -4435
511 -4435 4190 34148 27192 3178 5652 16676 22877 33468 20763 11172 24496 60902 55518
498 55518 45520 30954 14825 14692 35585 24856 27835 37851 51534 40520 4393 -41585 -58941
485 -58941 -33979 -1006 31967 41958 21357 -3323 -19664 -30363 -33243 -16983 -29631 -53567
473 -53567 -44582 -9218 -11747 -24035 -26367 -18710 -16019 -25388 -37561 -23115 4017 13782 11385 8131
459 8131 3676 12387 4194 4437 18989 18733 -1748 -10851 -9344 27670 26408 16544 19222 4706 1552
444 1552 12201 -1382 -14270 13 -11535 -2567 12264 2187 8146 28998 12082 -11001 -21498
431 -21498 14641 13439 16013 11552 -11740 -11323 1470 -10186 -3723 -6852 -2175 -3279 -11584 -15509
417 -15509 -7692 14360 7333 8200 26860 27746 13101 -8671 -16355 11817 24700 11698 -3100
404 -3100 3334 21295 40539 27602 14820 5297 2096 9834 -4979 -14016 -3095 10880 10019 19840
390 19840 36813 668 -23891 -12556 -29400 -26066 -22941 -5086 -11777 -1280 10288 38348 33261
377 33261 35006 35135 1241 -19440 3185 4976 -2569 -7013 -5239 -1928 7869 29127 31628 6115
363 6115 -10337 -14464 -4693 8979 6729 -2562 -25307 -25363 -9329 519 2152 27651 49004 43161
349 43161 53146 42472 10352 17632 4983 -6350 -1101 -8647 11845 10733 -771 -10489 336
336 336 19657 8636 11413 10283 -7279 -29043 -45172 -23402 12185 30123 6785 -16921 -1683
323 -1683 -1600 -9961 16382 14705 2109 849 23793 21152 13424 2426 10317 24389 40946 20945
309 20945 13826 18742 36837 39907 18253 17703 10908 9148 -10293 -19916 -25132 -31442 -40487 -31001
295 -31001 -5972 -8728 -14864 -17446 -4609 -6085 -15308 2429 20894 -3098 -19479 -18628 -13707 4074
281 4074 4219 194 477 -12490 -45599 -73029 -87495 -61834 -29978 -14484 -25125 -51534 -29331
268 -29331 550 11596 5603 29563 31874 22421 16265 19326 15566 -12376 -18594 -11672 -11795 -20501
254 -20501 -23388 -4819 -737 -13336 -39807 -19530 8244 24061 24688 -8632 -27520 -29380 -33389
241 -33389 -31329 -27158 -29982 -3791 8434 -11696 -6577 16220 4037 8753 6053 2947 -17673
228 -17673 -34885 -5669 2070 3798 31020 21100 9416 22046 12122 2374 3231 2394 -11409 -12921
214 -12921 -526 18853 28346 36717 39963 40190 7714 -32990 -32594 -9103 6015 -21215 -45837
201 -45837 -32552 -7853 10399 11254 11085 8405 -8914 -20629 -30505 -37365 -28120 -7137 18001 3392
187 3392 6630 1413 11381 29276 34765 28587 1881 -16302 -23187 -19462 -13173 788 13917 1201
173 1201 -10708 -5834 -1443 -7944 2619 -4787 -18412 -15782 -473 3452 -12604 -22475 -9620 -14657
159 -14657 -26930 -1253 7703 -12583 -8445 -3890 21067 24662 6470 -11374 -20540 -15670 -18197
146 -18197 -13214 6110 19027 2904 8422 5407 7896 22031 25272 36440 28687 36643 41232 43392
132 43392 26349 7791 24588 24410 46 -13945 -48 19746 9863 -3892 -23898 -15103 -1667
119 -1667 -14959 -15429 3565 792 -6818 7669 21564 13509 15060 -9854 -21823 -11498 -10721 -8087
105 -8087 13850 34411 26623 -5878 -17871 -19831 -44 24203 6366 5948 8127 15271 16299 -6541
91 -6541 -7765 9838 10072 21690 27163 19526 5991 -4973 -2766 -2745 11410 3978 -4068 3134 3980
76 3980 -12900 -28487 -23768 -10599 -15672 -41944 -54125 -39581 5648 26798 17353 22272 14057
63 14057 12129 -1742 -14732 -26748 -32031 -20510 -13718 -31448 -29945 -22330 -40490 -62190 -60433
50 -60433 -18227 616 -15182 -10450 -6799 -13319 -14843 -1955 -9317 -23664 -5594 -8090 -7306 468
36 468 4894 -1023 2544 10596 16071 19877 28444 16953 -9898 -14363 -17624 -18980 -23752 -12926 -6070
21 -6070 -20372 -7689 -229 -1698 20964 41113 43812 12449 6543 2522 1706 -20172 -10467 -22445
7 -22445 -42292 -42815 -13718 -1854 14743 12227 18067
0 18067
$$ Imaginary data points
##PAGE= N=2
##DATA TABLE= (X++(I..I)), XYDATA
32767 41048 49500 67548 67307 54194 60702 89855 90371 64402 56322 59264 62913 81559 79720 57197
32753 57197 65229 73484 97520 109900 101598 87836 86568 99677 78282 57355 63536 83166 87568
32740 87568 98862 100797 105032 99089 102660 101303 78151 75883 88565 104210 121481 130438 119004
32727 119004 123809 131996 115578 108624 110084 103129 110574 109959 123266 134410 120264 98884 97777
32714 97777 95291 112194 135958 143187 134485 114921 113871 114568 128748 132665 138773 146404 156328 144448
32700 144448 128580 124942 138228 133983 125971 123257 118419 145745 145974 138201 144048 140085 168113
32687 168113 183121 177854 168060 172325 173320 155641 158084 171270 172402 183972 187824 179128 183652
32674 183652 184399 180289 174478 157943 165308 179186 166848 164675 171029 172282 170244 179203 189308
32661 189308 188991 186856 178915 160465 167724 158048 156943 166570 177178 195955 191793 163699 181059
32648 181059 181840 178781 171074 170510 180701 188381 176251 179741 187394 193575 191467 178366 166889 180693
32634 180693 181533 177309 174309 165154 162196 165630 181570 196635 207832 191902 170517 158831 157548
32621 157548 158402 184141 206520 221095 217641 225988 255249 255465 236265 211759 185940 204176 221945
32608 221945 216025 218340 229775 242093 242059 245795 255449 238642 226402 220959 226027 220342 208096
32595 208096 206560 207597 209355 207362 228718 212404 198466 201799 230799 231239 219856 210958 231751
32582 231751 244818 247962 246467 251366 264383 266930 265943 248113 261111 278238 254853 237151 236984
32569 236984 236551 222175 235023 253819 255986 236147 236209 244361 250898 265366 259334 244807 259237
32556 259237 262530 250534 249309 272436 250773 229155 225352 233707 245087 258805 257484 246812
32544 246812 253927 245777 240018 241989 245731 246285 251352 249373 255502 251017 272046 284442 281698 288514
32530 288514 281268 266803 258576 274465 269773 274149 269371 274415 251601 261399 269139 282399 291445
32517 291445 283193 283243 294965 288043 282762 271841 258768 285179 289207 294729 281932 277541 288647
32504 288647 290429 304602 311894 305649 292008 296524 299159 288641 295473 279702 266897 274375 289858
32491 289858 296949 285194 274142 267336 267433 273824 283833 301271 293515 310814 337381 328599 323536
32478 323536 331211 338406 350110 321226 312957 325340 333818 316469 292663 281429 281941 288675 295010
32465 295010 312362 323257 327179 320086 322478 300356 288260 294625 305564 301447 299596 331741 347879
$$ [...]
##END NTUPLES=NMR SPECTRUM
##END=
