##TITLE=Analysis number 321367
Compound Code cc 17404
Project Code adrs
Chemist Name endeavour
##JCAMPDX= 6.0         $$ Bruker NMR JCAMP-DX V2.0
##DATA TYPE= NMR SPECTRUM
##DATA CLASS= NTUPLES
##ORIGIN= Bruker BioSpin GmbH
##OWNER= nmr
$$ XWIN-NMR		Version 3.5
$$ Tue Aug  8 09:08:17 2006 GMT Daylight Time (UT+1h)  MAYBRIDGE\nmr@NMR_250MHZ
##.OBSERVE FREQUENCY= 250.131544655141
##.OBSERVE NUCLEUS= ^1H
##.ACQUISITION MODE= SIMULTANEOUS (DQD)
##.ACQUISITION SCHEME= undefined
##.AVERAGES= 16
##.DIGITISER RES= 18
##SPECTROMETER/DATA SYSTEM= dpx250
##.PULSE SEQUENCE= zg30
##.SOLVENT NAME= CDCl3
##.SHIFT REFERENCE= (INTERNAL, CDCl3, 0, 16.4546)
##AUDIT TRAIL= $$ (NUMBER, WHEN, WHO, WHERE, WHAT)
$$ ##TITLE= Audit trail, XWIN-NMR		Version 3.5
$$ ##JCAMPDX= 5.01
$$ ##ORIGIN= Bruker BioSpin GmbH
$$ ##OWNER= nmr
$$ C:\u/data/dgb/nmr/ADRS/400/pdata/1/auditp.txt
$$ ##AUDIT TRAIL=  $$ (NUMBER, WHEN, WHO, WHERE, WHAT)
(   1,<2006-08-08 09:07:57.68 +100>,<MAYBRIDGE\nmr>,<NMR_250MHZ>,
      <created by zg, POWCHK disabled, PULCHK disabled
       configuration hash MD5:
       E2 DF 36 D8 04 B2 41 60 5A D7 A3 38 5A 4B D0 FE
       data hash MD5: 64K
       D2 62 3F C9 07 5B 25 59 2F EA D2 CB A3 24 F1 5C>)
(   2,<2006-08-08 09:08:08.69 +100>,<MAYBRIDGE\nmr>,<NMR_250MHZ>,
      <Start of raw data processing
       ef LB = 0.3 FT_mod = 6 PKNL = 1 SI = 32K 
       data hash MD5: 32K
       71 ED B4 B3 52 AD 34 A5 B7 F7 05 72 7C 0A 88 22>)
(   3,<2006-08-08 09:08:10.25 +100>,<MAYBRIDGE\nmr>,<NMR_250MHZ>,
      <apk 
       data hash MD5: 32K
       D2 8B 78 6C 0A 40 07 39 48 64 41 5E C2 B3 42 63>)
(   4,<2006-08-08 09:08:11.00 +100>,<MAYBRIDGE\nmr>,<NMR_250MHZ>,
      <abs ABSG = 5 
       data hash MD5: 32K
       AB 8D CC 51 DC 9C 8C B5 7A EA 58 DA 88 95 1B 07>)
$$ ##END=
$$ 
$$ hash MD5
$$ B5 33 81 C3 B9 18 65 34 87 00 68 B9 DB 19 50 3A
##$RELAX= 
##$RELAX= 
##$RELAX= 
##$RELAX= 
##$RELAX= 
##$RELAX= 
##$RELAX= 
$$ Bruker specific parameters
$$ --------------------------
##$DU= <C:\u>
##$EXPNO= 400
##$NAME= <ADRS>
##$PROCNO= 1
##$TYPE= <nmr>
##$USER= <dgb>
##$AMP= (0..31)
100 100 100 100 100 100 100 100 100 100 100 100 100 100 100 100 100 100 
100 100 100 100 100 100 100 100 100 100 100 100 100 100 
##$AQSEQ= 0
##$AQ_mod= 3
##$AUNM= <au_zg>
##$AUTOPOS= <3 >
##$BF1= 250.13
##$BF2= 250.13
##$BF3= 250.13
##$BF4= 250.13
##$BF5= 500.13
##$BF6= 500.13
##$BF7= 500.13
##$BF8= 500.13
##$BYTORDA= 1
##$CFDGTYP= 0
##$CFRGTYP= 5
##$CHEMSTR= <none>
##$CNST= (0..31)
1 1 145 1 1 1 1 1 1 1 1 1 1 1 1 1 1 1 1 1 1 1 1 1 1 1 1 1 1 1 1 1 
##$CPDPRG= <>
##$CPDPRG1= <>
##$CPDPRG2= <>
##$CPDPRG3= <>
##$CPDPRG4= <mlev>
##$CPDPRG5= <mlev>
##$CPDPRG6= <mlev>
##$CPDPRG7= <mlev>
##$CPDPRG8= <mlev>
##$CPDPRGB= <>
##$CPDPRGT= <>
##$D= (0..31)
0 1 0 0 0 0 0 0 0 0.06 0 0 0 0 0 0 0.0002 0 0 0 0 0 0 0 0 0 0 0 0 0 0 
0 
##$DATE= 1155024476
##$DBL= (0..7)
120 120 120 120 120 120 120 120 
##$DBP= (0..7)
150 150 150 150 150 150 150 150 
##$DBP07= 0
##$DBPNAM0= <>
##$DBPNAM1= <>
##$DBPNAM2= <>
$$ [...]
##$SUBNAM7= <"">
##$SUBNAM8= <"">
##$SUBNAM9= <"">
##$SW= 20.6930455092707
##$SWIBOX= (0..15)
0 0 3 0 0 0 0 0 0 0 0 0 0 0 0 0 
##$SW_h= 5175.983436853
##$TD= 65536
##$TD0= 1
##$TE= 295.16
##$TE2= 300
##$TE3= 300
##$TEG= 300
##$TL= (0..7)
0 120 120 120 120 120 120 120 
##$TP= (0..7)
150 150 150 150 150 150 150 150 
##$TP07= 0
##$TPNAME0= <>
##$TPNAME1= <>
##$TPNAME2= <>
##$TPNAME3= <>
##$TPNAME4= <>
##$TPNAME5= <>
##$TPNAME6= <>
##$TPNAME7= <>
##$TPOAL= (0..7)
0.5 0.5 0.5 0.5 0.5 0.5 0.5 0.5 
##$TPOFFS= (0..7)
0 0 0 0 0 0 0 0 
##$TUNHIN= 0
##$TUNHOUT= 0
##$TUNXOUT= 0
##$USERA1= <user>
##$USERA2= <user>
##$USERA3= <user>
##$USERA4= <user>
##$USERA5= <user>
##$V9= 5
##$VALIST= <valist>
##$VCLIST= <CCCCCCCCCCCCCCC>
##$VD= 0
##$VDLIST= <DDDDDDDDDDDDDDD>
##$VPLIST= <PPPPPPPPPPPPPPP>
##$VTLIST= <TTTTTTTTTTTTTTT>
##$WBST= 1024
##$WBSW= 4
##$XGAIN= (0..3)
0 0 0 0 
##$XL= 0
##$YL= 0
##$YMAX_a= 354018
##$YMIN_a= -503240
##$ZGOPTNS= <>
##$ZL1= 120
##$ZL2= 120
##$ZL3= 120
##$ZL4= 120
##$ABSF1= 16.45457
##$ABSF2= -4.238602
##$ABSG= 5
##$ABSL= 3
##$ALPHA= 0
##$AQORDER= 0
##$ASSFAC= 0
##$ASSFACI= 0
##$ASSFACX= 0
##$ASSWID= 0
##$AUNMP= <proc_1d>
##$AZFE= 0.1
##$AZFW= 0.1
##$BCFW= 0
##$BC_mod= 0
##$BYTORDP= 0
##$COROFFS= 0
##$CY= 12.5
##$DATMOD= 1
##$DC= 0
##$DFILT= <>
##$DTYPP= 0
##$F1P= 14.0000005364418
##$F2P= -0.99999901652339
##$FCOR= 0.5
##$FTSIZE= 32768
##$FT_mod= 6
##$GAMMA= 0
##$GB= 0
##$INTBC= 1
##$INTSCL= 1
##$ISEN= 128
##$LB= 0.3
##$LEV0= 0
##$LPBIN= 0
##$MAXI= 10000
##$MC2= 0
##$MEAN= 0
##$ME_mod= 0
##$MI= 0
##$NCOEF= 0
##$NC_proc= -5
##$NLEV= 6
##$NOISF1= 0
##$NOISF2= 0
##$NSP= 0
##$NTH_PI= 0
##$NZP= 0
##$OFFSET= 16.45457
##$PC= 1
##$PHC0= 150.989
##$PHC1= 6.677924
##$PH_mod= 1
##$PKNL= yes
##$PPARMOD= 0
##$PSCAL= 4
##$PSIGN= 0
##$REVERSE= no
##$SF= 250.130016865193
##$SI= 32768
##$SIGF1= 0
##$SIGF2= 0
##$SINO= 400
##$SIOLD= 32768
##$SREGLST= <1H.CDCl3>
##$SSB= 0
##$STSI= 32768
##$STSR= 0
##$SW_p= 5175.98343685301
##$SYMM= 0
##$S_DEV= 0
##$TDeff= 65536
##$TDoff= 0
##$TI= <Analysis number 999999
Compound Code 99
Book Reference 9
Project Code 9>
##$TILT= no
##$TM1= 0
##$TM2= 0
##$TOPLEV= 0
##$USERP1= <user>
##$USERP2= <user>
##$USERP3= <user>
##$USERP4= <user>
##$USERP5= <user>
##$WDW= 1
##$XDIM= 32768
##$YMAX_p= 365807647
##$YMIN_p= -510042
$$ End of Bruker specific parameters
$$ ---------------------------------
##NTUPLES= NMR SPECTRUM
##VAR_NAME=  FREQUENCY,     SPECTRUM/REAL,   SPECTRUM/IMAG
##SYMBOL=    X,             R,               I
##VAR_TYPE=  INDEPENDENT,   DEPENDENT,       DEPENDENT
##VAR_FORM=  AFFN,          ASDF,            ASDF
##VAR_DIM=   32768,         32768,           32768
##UNITS=     HZ,            ARBITRARY UNITS, ARBITRARY UNITS
##FACTOR=    0.157963299565203, 1,           1
##FIRST=     4115.78206427556, 0,            0
##LAST=      -1060.20137257745, 0,           0
##MIN=       -1060.20137257745, -510042,     0
##MAX=       4115.78206427556, 365807647,    0
$$ Real data points
##PAGE= N=1
##DATA TABLE= (X++(R..R)), XYDATA
$$ [...]
17151e577n9592K41932L101o8301n07n8691M7457j06729P2618J97662R4325m6810
17139C10888n5936M644l6401j55578p9230n2195m2496N7623q0624k2526K03016
17128E1185K5153K9933M8237j01316p5497q307J39317L5979j5845O9680n1512
17117A47007k18736o4530o151R6164O138J14588R8287n9341l7214R2973O9125
17106B38310R7338j8673J80474R1678k6963K0444p329M2638J79866J50265j8520
17095I29528M6597j10453j05895L2334J665l601n69J2239N5026l2197p6864M810
17083G52620J01581n0239j45076r1054o5130K4375J03953k8410K662K2175j29032
17072D98425k06785p7784J63861J40742j07383k30212J3240n7663L5124K3511
$$ y = [-5577, -65169, 176763, 179864, 111563, 111056, 52365, 99822, -6907, 65711, 263373, 357698, 310888, 254952, 259596, 223195, 67617, -11613, -63808, -106304, -48681, -129305, -151831, 51185, 76338, 106271, 154508, 53192, -22305, -30612, 108705, 144684, 128839, 198519, 147007, -71729, -136259, -142410, -46246, -40108, 74480, 172767, 113426, 76212, 169185, 238310, 335648, 316975, 497449, 589127, 562164, 582608, 575279, 617917, 797783, 948048, 929528, 976125, 865672, 759777, 792111, 793776, 790175, 789606, 801845, 856871, 824674, 747810, 752620, 854201, 803962, 658886, 567832, 502702, 527077, 631030, 602620, 605282, 627457, 498425, 291640, 213856, 377717, 518459, 411076, 180864, 194104, 136441, 171565, 195076]
17062A95076J04524n1836j39458j06134L0702L6584O6587k6013j081m6993J03966
17051A65924J19480m4766J11838L6728R2303J03765n641J11038k6311k8046K4576
17040F60888P7713N2877J00839o195M745j06009j09412K7172j53960R1317J80077
17029H20052J2002J5244n0260o1681j35896m5641N7136J26571n3881j25273j28928
17018D29445q1021n4696J40908J16355O7420j88694k56139l7526l080K9136O4265
17007B26373m4162J07044j59499R0472J11919o7859K8438J60562j28258o3616
16997B61414o9025j28096o7970Q6348p5623P8220k3982m1107m6920J2786j09268
16986a23223J36261J92710m3763q1580o2011r7556j18445k3594J08582J52725
$$ y = [195076, 299600, 247764, 108306, 2172, 32874, 69458, 136045, 110032, 108951, 61958, 165924, 285404, 240638, 352476, 389204, 481507, 585272, 579631, 690669, 664358, 636312, 660888, 738601, 791478, 892317, 886122, 890867, 784858, 675446, 702618, 548658, 639975, 820052, 832054, 847298, 797038, 735357, 599461, 553820, 610956, 737527, 683646, 558373, 429445, 348424, 293728, 434636, 550991, 618411, 429717, 173578, 136052, 132972, 162108, 226373, 182211, 289255, 129756, 220228, 332147, 264288, 292726, 453288, 325030, 261414, 192389, 64293, -3677, 82671, 7048, 85268, 61286, 20179, -26741, -13955, -123223, 13038, 205748, 161985, 80405, 18394, -79162, -197607, -221201, -112619, 40106]
16976D0106P9262n1619M3416M6254p2730m9991k9027j70102Q3117J22706J9637
16965F1029K4864o176p0441P0417l3050o0467L4291J02946R9924j32447j36858
16954d5968M7340M3534L6213p8088o3340Q0383J01544o6093j24682M0003N372
16943b3782j45926k1440R2554M1805R134k7756L2701J46896J51470n8509j16691
16932H0456q7019j540m5357J8045j578K8631J14196J03493o6279R546j2404l9152
16920A01038k3888L8340J6539L3643p5525o2453M6157O3320R9338K3055m1319
16909B18245o9164r0077m6606P8028J4025P540j36797q1153L2745J9949j8895
16898g2160O0350J03488J06164l2636j02383N0419L3053o7296r1529n2136J61305
$$ y = [40106, 119368, 67749, 111165, 157419, 84689, 34698, 5671, -164431, -81314, 41392, 61029, 85893, 79717, 9276, 79693, 46643, -13824, 20467, 123413, 223337, 90890, -45968, 1372, 44906, 81119, 3031, -60309, 20074, 121618, 55525, -69157, -29154, -23782, -169708, -191148, -98594, -56789, -47655, -75411, -42710, 104186, 255656, 197147, 80456, -6563, -8103, -53460, -35415, -36993, -8362, 105834, 209327, 143048, 152594, 140190, 101038, 77150, 115490, 132029, 165672, 90147, 27694, 73851, 137171, 236509, 259564, 218245, 149081, 59004, 12398, 90426, 104451, 111991, -24806, -105959, -73214, -53265, -72160, -11810, 91678, 197842, 165206, 62823, 113242, 146295, 78999, -12530, -64666, 96639]
16887I6639j1066N4860N6649K4772j21346k21290n7465j5595J3550J17206J6844
16876d6242J54020O4890n229J6431j23098j78938k8855J5629J34190Q373j00484
16865h9313n0757O555q3253K4740J52765M4976n7497N9104j29084j04664O6350
16854a60078J50028j0017p8018k0373K01376P6117q7264j40126J7818n418k8849
16843h4804n6309l4826k4418m0203q2982m6903q4373Q9046K2843p3054R0955K84185
16831d0843J64335j9007n746j27614K7554J00385k37333q4592J54631Q4006Q3626
16820I9402k026k04102J7585L5475O6175J23325m7941j34869n6809n7195K5344
16809a35636O1270r0451j5673J32715M3565K4094o2228p3350J8395K2108j50865
$$ y = [96639, 85573, 140433, 197082, 221854, 100508, -120782, -178247, -193842, -180292, -63086, -46242, 107778, 172668, 167439, 183870, 60772, -118166, -147021, -131392, 2798, 11171, -89313, -140070, -133515, -216768, -192028, -39263, 5713, -51784, 7320, -121764, -226428, -160078, -10050, -20067, -98085, -118458, 82918, 159035, 71771, -68355, -50537, -55955, -84804, -141113, -175939, -200357, -240560, -323542, -370445, -454818, -365772, -342929, -415983, -325028, -40843, 123492, 104485, 98739, -28875, -1321, 99064, -138269, -222861, -68230, 15776, 99402, 97376, -106726, -89141, -53666, 12509, 135834, 87893, -46976, -103785, -160980, -135636, -74366, -164817, -180490, -47775, -4210, 19884, -42344, -115694, -97299, -75191, -226056]
16798b26056j07257L0576Q9999J22965J44379j06569l1187J27602P6795N4995
16788A76242q1000p5464p366J07582J04523K8043j24171j50175j26410k6608P4630
16777a00174Q105k7638j5392k3706J90140J84552k8831j05451j31823j1539j0818
16766g2575j3258K12560O5335q5199R6141j1217k0631R8411j7499q7141n5299
16755A09628k7384R9705K4880m0914p1618k7581J17127Q0222J3149n1147n7223
16744A68844q5593j49672L0492J69932K6138m5664J3034P9909n9572j07920p9749
16733c9821n6417o7366J16692M2887Q3270r211N142q5137L6153N2696k11168j06908
16721b39188Q1890j9264M3910J89819R0359j5911j12364P581j00292m7446R9845
$$ y = [-226056, -333313, -302737, -212738, -89773, 54606, -51963, -83150, 44452, 121247, 176242, 95242, 19778, 12412, 119994, 224517, 252560, 128389, -21786, -148196, -174804, -100174, -92069, -119707, -135099, -158805, 31335, 215887, 187056, 81605, -50218, -61757, -72575, -85833, 126727, 192062, 106863, 203004, 191787, 171156, 269567, 252068, 164927, 109628, 82244, 181949, 206829, 165915, 94297, 66716, 183843, 264065, 277214, 226067, 168844, 83251, -66421, -35929, 134003, 160141, 114477, 127511, 207420, 147848, 39928, -39821, -96238, -163604, -46912, -4025, 79245, 70034, 75176, -9961, 26192, 78888, -132280, -239188, -157298, -176562, -132652, 57167, 147526, 131615, 19251, 26832, -73460, -120906, -21061]
16710b1061J34954J14588K5174j14640m4099L2994L8875k2384J8992j31444k42180
16699b10231Q068J62240N5306M8431m2544j7900p5919R2930L3820J36810r4031
16688I6980j45488J2487R2982j5336p759j12775p8366j0048m9835P8728J06940
16677c1490o8149j188M5933m8739M7569J07667J19049k7692m2947j78763j09197
16666a87947P9600n2325J33789J20748J0218O582L5211j42078r9468o09j16527
16655b12806P8757M0369J36839k7929K3438L2174Q1691l7047o3859j30107o58
16644g9138Q8429P1445J02803j492m6790q4347j38756L9210P5963m9153j08653
16633a30479k4135L9558J8199K7343l3737p0628j2598j5655J34233l1647j51701
$$ y = [-21061, 113893, 228481, 253655, 139015, 94916, 127910, 166785, 144401, 163393, 31949, -210231, -202163, -39923, 15383, 63814, 21270, 3370, -72549, 20381, 54201, 191011, 96980, -48508, -36021, 56961, 41625, 33866, -78909, -157275, -167323, -217158, -138430, -31490, -99639, -100827, -54894, -103633, -56064, 51603, 170652, 142960, 100013, -78750, -187947, -108347, -160672, -26883, 93865, 104083, 110665, 145876, 3798, -95670, -96279, -212806, -134049, -93680, 43159, 15230, 38668, 70842, 152533, 115486, 51627, -78480, -79138, 9291, 80736, 183539, 182047, 135257, 50910, -87846, -48636, 27327, -21826, -130479, -154614, -115056, -96857, -69514, -103251, -173879, -186477, -202132, -67899, -99546, -251247]
16622b51247k8497J1222J80837J76255M8613o6751k00026m9778J46981l4896o9539
16611a36826J44875R5806n0225j01424n6124J34690Q4709k4467J0572q0846j76371
16600a55631m7965J06730R1467J14866o7894n8564Q9117j2798q9464q1090Q8471
16589b2755k6779O0542M7334p1538O5519N1650k7513m2963K8523j07035l9201
16578h4216J07766j19335q1777K6646r0756J18062R1663Q5417k4513n7948l8316
16567f7307R364J9493j3213M4251O9193K4351O464M0352K2069J05391M3066m2450
16555B61024j21430k43331n0646Q2256n6901n4052J5504Q1227Q6652m6412J9076
16544b7033O5986J0139P1169j0173Q3037j51041p3076J07685J06225L8455n5237
$$ y = [-251247, -279744, -268522, -87685, 88570, 137183, 70432, -129594, -179372, -32391, -67287, -136826, 8049, 103855, 53630, -47794, -103918, 30772, 115481, 91014, 101586, 20740, -155631, -203596, -96866, -5399, 109467, 41573, -16991, 72126, 59328, -30136, -111226, -22755, -49534, 11008, 58342, -13196, 52323, 103973, 76460, 33497, 62020, -45015, -84216, 23550, -95785, -177562, -150916, -241672, -123610, -31947, 53470, 28957, -28991, -67307, -57943, -38450, -51663, -7412, 61781, 86132, 92596, 132948, 155017, 260408, 303474, 261024, 139594, -103737, -154383, -72127, -129028, -183080, -167576, -86349, 303, -46109, -27033, 38953, 49092, 120261, 110088, 193125, 42084, -30992, 76693, 182918, 221373, 166136]
16533A66136j53202M1155k0925J7166J037o0390n31J00729k1855M6888K6088n1625
16521I0671l5716L4160N4427j55674q9533L6054j1899K00939J17382J02141n2073
16510B90879j20486k02240n3554J5338k3747n1111k4778J55987J11029J683j35667
16499c6667J07781M6099o2748P463q2950j50715k3409J093J6159J22485N4497
16488i12K9275K921m2283m3802j05221P0262M7377l0692q0654o8805K8054O0369
16476a34111L5594J3833K3522j0158J5123J48321r1938m1392J53498j52945j25360
16465a66013o6293J00446J54055K4161o0702o0231M4634K7878j15514p6340N4528
16454a39391J33524J3238N3495m7176j6538K0903n4888R6990M3071l8607k7308
$$ y = [166136, 12934, 54089, 33164, 50330, 51367, -9023, -9554, 91175, 69320, 116208, 142296, 90671, 54955, 89115, 143542, -12132, -101665, -65611, -77510, 123429, 240811, 342952, 290879, 170393, -31847, -85401, -70063, -93810, -144921, -169699, -13712, 97317, 99000, -36667, 71114, 117213, 54465, 61928, -21022, -171737, -195146, -194053, -177894, -55409, -912, 28363, 31284, -10999, -54801, -160022, -89760, -42383, -73075, -153729, -222534, -194480, -134111, -98517, -84684, -61162, -71320, -56197, 92124, 186, -41206, 112292, -40653, -166013, -232306, -131860, 22195, 46356, -14346, -74577, -29943, -2065, -117579, -193919, -139391, -5867, 7371, 60866, 13690, -2848, 18055, -36833, 60157, 103228, 64621, 37313]
16443C7313j7076R5030N7025q3889M4315m7718q4270J03798J41179N5579p8582
16432B22704k15341o1089L1890J53701J2304j7048p0348r7915j26837k1163J49798
16421c9344k3271K1864k581K9528Q20l949L4214l9032r1441j08796L777N0258
16409a67953J2330R1530N0797J67420Q5424j31380j97667q5343J2602N9939Q2766
16398a9535K787q7396j34826P1190K20099k8532n9457J2807j7610J19399O2897
16387A41823k1876k5570j129j30237j46253K0175P7024J2711q232K3317p8614
16376a36861R1871O4101p2322p2994Q1037J31994L6226J3977q2079j34360j40069
16365b19479M060P2972J10284R7782q2839m8804L3168M4638r1174j47213p6330
$$ y = [37313, 20237, 115267, 172292, 88403, 132718, 85000, 730, 104528, 245707, 301286, 222704, 7363, -53726, -21836, 131865, 144169, 127121, 56773, -41142, -167979, -189142, -39344, -62615, -40751, -43332, -13804, -12984, -16933, 17281, -21751, -113192, -221988, -218211, -167953, -155623, -64093, -13296, 154124, 239548, 108168, -89499, -174842, -162240, -102301, -19535, -16748, -104144, -238970, -167780, 52319, 23787, -35670, -22863, -40473, 78926, 141823, 119947, 94377, 93248, -36989, -183242, -163067, -86043, -73332, -81564, -58247, -136861, -44990, 19111, -53211, -126205, -45168, 86826, 123052, 137029, 54950, -79410, -219479, -215419, -142447, -32163, 65619, -17220, -66024, -32856, 11782, -79392, -226605, -302935]
16354c02935J57505J18458p4884j26910N5971P0684J20653M9988K8610k5833r7298
16343b5991j13823m2758J22854J00040N3528j0227J171j51604p8529L6153Q3247
16332b5939Q8372K3070j40822j24766M6897J25687K57333j04639j76299O1893
16322C0787k40399r8589K15858K09639K551J02789o1786j98459q6146k231Q1839
16311d4147O616N5889J24593k4261m4419Q252K4828m432K1141r6173j79745Q3446
16299f8412L7409j06464J11725O864J16757R148m6380j16550L1141J16680l922
16288H7996K9793n7482l8204m7758M2081J6025Q0927N0409j13766o63j06712r7355
16276a54709k879J63507j7235r7237M105L3029o8070K0257n5728N6929K8198p4242
$$ y = [-302935, -145430, -26972, -101856, -228766, -172795, -102111, 18542, 68530, 97140, 71307, -25991, -139814, -182572, -59718, 40322, 93850, 83623, 84794, -66810, -145339, -109186, -25939, 62433, 85503, -55319, -180085, -133188, -7501, 249832, 145193, -31106, 30787, -209612, -308201, -92343, 117296, 119847, 222636, 160850, -37609, -123755, -125986, -44147, -37531, 18358, 142951, 118690, 74271, 82523, 107351, 102919, 124060, 27887, -151858, -68412, -31003, -137467, -25742, -18878, 97879, 107027, 60647, -55903, -24762, 91918, 87996, 117789, 60307, 22103, -25655, 16426, 32451, 113378, 163787, 50021, 49358, -57354, -154709, -157588, 5919, -11316, -108553, -104448, -71419, -139489, -119232, -174960, -118031, -89833, -164075]
16264a64075M2487J31931Q9558n5293p8530k4153L866j08725Q2789k1524O4787
16253c6882J3700j5756q6379o489J83396J24114J8396l1091j59763r7172K7938
16242f5988j04820J38459J03583P968j08141J08691O9879p2921j43403N693Q2797
16231B1797p1837j0462J6014p6458K8301Q6701J152j4754p1313j03287J14115
16220h0031J35359P651r6990q7348k430k2662K3252l919l062P85o5205M0752R6691
16207e7157j3480M6178N0112l4859J07680J01428n5464j22290k3128L4825j6459
16196A7386L1541l8480j18763M3038R9150M4889m006N2609J13100J193j54091
16185H7566m9753r3673q6914O7930R7748q9441j5583J45473j03804m6602n5952
$$ y = [-164075, -121588, 10343, 99901, 44608, -33922, -58075, -54209, -162934, -80145, -101669, -36882, -23182, -38938, -125317, -131806, 51590, 175704, 194100, 163009, 3246, -93926, -65988, -170808, -32349, 71234, 79202, -28939, 79752, 149631, 76710, -66693, -61000, 21797, -50040, -60502, -44488, -120946, -92645, -5944, -4792, -19546, -90859, -194146, -80031, 55328, 62979, -34011, -121359, -123789, -146451, -123199, -127118, -130180, -129395, -194600, -153848, -57157, -70637, -24459, 25653, -9206, 98474, 199902, 144438, 22148, -980, 33845, 17386, 48927, 10447, -108316, -65278, 33872, 78761, 74755, 127364, 240464, 241657, 87566, 37813, -55860, -142774, -74844, 22904, -66537, -82120, 63353, -40451, -87053, -143005]
16174a43005k4015O178j28830Q9563J23554q3029K3713Q9939J09683j35330K3481
16163d8098J72596O7263j70587j8995r2700m568P4208m7076k915R8472p0954l4989
16151g8343J7725n1646p9193j8650O9686J03484p2190P2209P6509n9920J32958
16140A12629P4083j33876R6802Q7590o5690o8583j39961K7326j4535p5805k5685
16129a25705l4587N432J60939J9520q5419n7548Q4604P8028j63805L9425J981
16118g7135L6467m7392N6189j115m6086R0654j22279L6979P0028L211j22447k8705
16106a51631P1958p7295J1510J01806J16707N5833L1205j64641j52075j65688
16096c22311o1467O314J29457m2231j7448L1681J39074M7506J07594N4468N8076
$$ y = [-143005, -167020, -160842, -289672, -200109, -76555, -159584, -135871, -45932, 63751, -71579, -48098, 124498, 191761, 21174, 2179, -90521, -95089, -20881, -67957, -70872, 27600, -43354, -78343, -60618, -112264, -191457, -210107, -140421, -36937, -109127, -36918, 39591, -20329, 112629, 186712, 52836, 149638, 237228, 171538, 102955, -37006, -9680, -24215, -100020, -125705, -160292, -154860, 6079, 25599, -59820, -117368, -32764, 45264, -118541, -79116, -77135, -40668, -88060, -31871, -32986, -79072, 11582, -110697, -73718, -3690, -479, -122926, -151631, -79673, -156968, -145458, -43652, 73055, 128888, 160093, -4548, -156623, -322311, -383778, -377464, -248007, -290238, -307686, -276005, -136931, -89425, 18169, 72637, 130713]
16085A30713K9555n8060j84266P5361R8187M2425n6377j96326K7101J01942L7726
16074D7981j21624l8923K3560p597N569L7842M3461J14876l3143p6113j00256
16063a04367J45731R086O8990J20183k4374m7890q8199m6819n0918q9272K4462
16052h3387O8438p372N1868m862r8103j2966m7993J91551P2461p5923j07293J6825
16040c6756O4614J12798L3994j07113K366j6808q4961J0400N5708m6989j49685
16029a62432o7827J53973K393p1371J31628Q7012p7387p4751j06387r7831J06495
16018a76485O0940J05375q4094j382J78324k6692k0902m1847O705n56k1495P5293
16006E3184J45675j6877j23022N5755q6677n7904j45369j0712M0412N7195J14040
$$ y = [130713, 160268, 102208, -82058, -6697, 91490, 133915, 77538, -118788, -91687, 10255, 47981, -73643, -112566, -89006, -96603, -91034, -53192, -9731, 105145, 72002, -4111, -104367, 41364, 50450, 119440, 239623, 215249, 167359, 79160, 32341, -18577, -107849, -83387, -14949, -22321, 29547, 24685, -73418, -86384, -134377, 57174, 129635, 53712, -53581, -36756, 27858, 140656, 174650, 67537, 69903, 53095, -31866, -21466, 34242, -12747, -162432, -230259, -76286, -73893, -145264, -13636, 73376, -4011, -78762, -185149, -282980, -176485, -115545, -10170, -94264, -95646, 82678, 55986, 35084, -6763, -58, -614, -22109, 53184, 198859, 181982, 58960, 114715, 28038, -29866, -175235, -185947, -145535, -88340, 25700]
15995B5700J38800o8260p2685j15539P0529R3353j7948q1838o2639j67934j0846
15984b69307J02859k0368N1794J6818k9137K3407l3304k699P3312j8571P0758
15973c4438K1939m2815J4932n4731l0963j1539p9368P8551K4783j04874M363K9317
15961a84843N6580J6083P656R5937P1117p7356J3239R2086o5304k9015P1962n1741
15949A6401q9846j72622n6774Q9474N1967o4894R5587J32999k7766L2264J23481
15938A30271p0623p5728o033K0968k04484J6186J63486J70761J8937L1198m4950
15927A49989j4873Q676m1529j62393o9559k3430N0299L0124j11513j32428M1423
15916b75214J67845o9314M4483O2623j62629j21879q233J07848N0736K7239P9734
$$ y = [25700, 164500, 96240, 23555, -91984, -21455, 71898, 53950, -27888, -90527, -258461, -269307, -166448, -186816, -135022, -118204, -147341, -123934, -157238, -159937, -86625, -105196, -34438, -12499, -55314, -40382, -95113, -126076, -137615, -216983, -138432, -113649, -218523, -214160, -184843, -128263, -112180, -104524, -8587, 62530, -14826, -1587, 90499, 25195, -3820, 68142, 16401, -73445, -246067, -302841, -213367, -161400, -226294, -130707, 2292, -25474, 6790, 130271, 59648, -16080, -22113, -1145, -205629, -189443, -25957, 144804, 163741, 194939, 149989, 135116, 143792, 102263, -60130, -129689, -153119, -102820, -72696, -184209, -316637, -275214, -107369, -176683, -132200, -69577, -232206, -354085, -362318, -254470, -203734, -176495, -96761]
15905i6761l6660r8762R7468K08339P2136q4297j04148P6221J4532K3961l4995
15894C7034j8239k0172n9711K61o2594P7125j6336q1260j2822O6109j23M276j00610
15881a87062M2682R6029R6829J13665r693n1870j39108m3239o9391M1400J08473
15870a285J12870l1413m8756L3412J33805L0662j18381r5169n0148J13494O5034
15859A44125m5626n1696N6442P2152j4802J54166j7302j59200L6731o6474j86141
15848g7625j04174J080J77537k2853k9391o8815M7133M0012J2644O9984K0409
15837F5941j6832l3789M5338k5578o3140Q9641J6611J6313m8951j41395j44468
15826b40309Q4642J17886J31446j51134k1296p1633J5668n6264J09201k280L1820
$$ y = [-96761, -133421, -232183, -134715, 73624, 145760, 61463, -42685, 33536, 48068, 72029, 37034, 18795, -1377, -61088, -60827, -123421, -46296, -62632, -143892, -156714, -90605, -90728, -86452, -187062, -144380, -48351, 48478, 162143, 152450, 100580, -38528, -81767, -151158, -109758, -1285, 111585, 80172, 31416, 64828, 198633, 229295, 110914, 15745, -34403, 79091, 144125, 98499, 46803, 103245, 175397, 160595, 314761, 297459, 138259, 174990, 108516, -77625, -181799, -180719, -3182, -26035, -55426, -124241, -77108, -37096, -24452, 45532, 65941, 49109, 15320, 60658, 35080, -28060, 61581, 78192, 94505, 45554, -95841, -240309, -155667, -37781, 93665, -57469, -78765, -150398, -134730, -190994, -81793, -84073, -52253]
15815e2253o2183n0863K3603K2540J51594N5123o9479o204L0905J4367L8971N4903
15803A51024j45350o1824O1645K2243L5403M7945r511k28n5404Q864o9999j18030
15791a33222J7371m9604L2054L3156m8180j4662P4744J1394j84308j1508J27917
15780a44848l9175K3175n086P177n7816Q5654J23596J4984r1996J2758M7973R1421
15768F7817M3252n5895o3061P473R480O1568N3373J9622o6629j7051j81700o3394
15756a85145K9421M0793l3772Q5479J05527r427O0119j01615j03570k7699n961
15745a45850r390n9277K242K2039r2070R6151J32563P0327l9689Q1080j28483
15734g0357o6266N7039m7419J6017O6322J14724P716l05576j21179K14074Q619
$$ y = [-52253, -114436, -165299, -141696, -119156, 32438, 87561, 18082, 11878, 42783, 57150, 96121, 151024, 5674, -56150, 5495, 27738, 63141, 111086, 101575, 101347, 45943, 54807, -15192, -133222, -115851, -165455, -133401, -100245, -148425, -163087, -88343, -76949, -261257, -272765, -144848, -184023, -160848, -165934, -158757, -216573, -130919, -7323, 7661, -84335, -71577, -23604, 67817, 111069, 55174, -7887, -414, 9066, 70634, 124007, 143629, 77000, 59949, -121751, -185145, -155724, -114931, -148703, -63224, 42303, 32876, 92995, -8620, -112190, -139889, -145850, -155240, -214517, -212275, -190236, -282306, -186155, -53592, 16735, -22954, 58126, -70357, -136623, -79584, -127003, -110986, -44664, 70060, 77776, -227800, -348979, -134905, -126286]
15723a26286L1890N8422j9159l5514N1960j83492p4901P5674J59583N9166r8718
15712a01375p1012k3373J31525M4689K6245r535o2188J634k9780k6983O4838J7876
15700c7439J37533o2916j27766n2141L7780K1776N1661k3714K532j09436k2140
15689a84270J24235N9017N2873K8881M0799j15700j94400L1724J45995N8071K2470
15678F9695R8254P7437j25667m8806J70524j2774n4015l2456j07653j00796j9892
15667h6149j05968j00073O1976Q1371J14532J47989q7851j39412J27829L2572
15657D6816j35579q7767p7990P5138R026R8313K9261o7946o4124J5095O3210l5887
15645a32434j43491N2786J18392j01811m5359Q0318J04970L2982K1585P3818j37329
$$ y = [-126286, -94396, -35974, -55133, -90647, -38687, -222179, -297080, -221406, -61823, -2657, -101375, -172387, -195760, -64235, -19546, 6699, -2836, -65024, -63390, -93170, -120153, -55315, -37439, 100094, 37178, -90588, -142729, -104949, -83173, -31512, -55226, -52694, -162130, -184270, -60035, -1018, 51855, 80736, 121535, 5835, -188565, -156841, -10846, 47225, 69695, 167949, 245386, 119719, 70913, 241437, 228663, 174648, 142192, 34539, -66257, -86149, -192117, -292190, -230214, -148843, -34311, 113678, 25827, -113585, 14244, 46816, -88763, -176530, -254520, -179382, -170356, -72043, -42782, -110728, -174852, -159757, -96547, -132434, -275925, -223139, -104747, -206558, -251917, -171599, -66629, -33647, -12062, 61756, -75573]
15634g5573j19392m3093L1664j01215J6991P3408k8041r3022J68344K04280o0482
15623b6131J04897J64382j34820j64332M9169J38752k7996j71059P3225L3644
15613C9731j36045j9898J03804J1351p0794K03436n1153j04188K3617Q782M660
15602A3303j6829q7039J6197R5896K1803j27797P5082p4404N4436N2616K4510
15591D7774K4811Q7082m3799m1118j02494M3021M033n3461N1367j6091p8016Q7315
15579A0424O5450j36290j92085J0984N6706L9670k5417j02988k5435J559R6308
15568b01114M8824J3871J6363k9735O4299J8953O0493L3356m2071j48909m9452
15557b15122J23642J43292n1899p5373j31315k5028P2760n3467R954J26079L4294
$$ y = [-75573, -194965, -238058, -206394, -307609, -290618, -217210, -245251, -338273, -169929, 34351, -26131, 78766, 243148, 108328, -56004, -6835, 131917, 103921, -67138, 6087, 39731, -96314, -116212, -12408, -1057, -71851, 131585, 80432, -23756, -139, 8643, 13303, -3526, -90565, -74368, 21528, 43331, -84466, -9384, -83788, -29352, 23264, 47774, 72585, 159667, 115868, 74750, -27744, 15277, 19310, -34151, 17216, 1125, -76891, 10424, 75874, -60416, -252501, -241517, -184811, -145141, -170558, -273546, -298981, -297422, -201114, -152290, -138419, -122056, -151791, -87492, -68539, -8046, 25310, -16761, -165670, -215122, -91480, 51812, -87, -75460, -206775, -231803, -159043, -212510, -202556, -76477, -42183]
15546d2183r1158o6016L1865Q8864p0618j25254n2044J50789L1127O8299R3402
15535A7073K0606P5666n9268j54460m9097r3443O9647p1008K5092M8466J3247
15524a57479R1973q1181k7026j666p1545q142M1349j0642j52834P7986J45785
15513a53422ol1359J8958l38o0924L3892R6605r8819r8103j1307K7643P0518K233
15500b04429M311Q1631K8689p5071L7870K0823o2133j35042L6181K11937M1388
15489a3845m0869r6432J26795J63274L9139L284j01432j99024q4782P1820O0963
15478g1109K1036m0133m5714J2785k0500o9128r526l5340L6363M2385m8527M8297
15466a79111J91771J0703p731m3184m4365l0058N7410R2988J0587K4738r1624
$$ y = [-42183, -133341, -199357, -167492, -78628, -149246, -274500, -326544, -175755, -144628, -76329, 17073, 37679, 113345, 54077, -100383, -149480, -242923, -173276, -244284, -219192, -170726, -157479, -65506, -146687, -173713, -175379, -246924, -255066, -213717, -224359, -377193, -299207, -153422, -153428, -184787, -165829, -166167, -227091, -193199, -96594, -195413, -293516, -304823, -277180, -206662, -204429, -200118, -118487, -89798, -164869, -126999, -106176, -168309, -303351, -267170, -55233, -13845, -54714, -151146, -24351, 138923, 178062, 181346, 79914, -119110, -203892, -132072, -71109, -50073, -90206, -135920, -123135, -143635, -212763, -222289, -257629, -221266, -178881, -227408, -179111, 12660, 23363, 15632, -27552, -71917, -101975, -44565, 48423, 59010, 83748, -7876]
15455g876j18229N8247Q6424r8799n6436N0317q069L7526l3961L1354J18262n4668
15443D092n9318P376m5174k1937K2166J0471J68247J5163k4512j48668o9083L4585
15431a06592l1467l4566r9894o188J18541J97174J18131k5443M1724m6570o0915
15420F3935j4888j34546j15948L6165J54397M0884k2755n7978n3856P4712K3059
15409f819k3918P829K5777l5843M1461j52534R9048J47028n5211j25503m2236
15398a20921M9941m8041p0083M8288J01549m2906j958J3081L88j45740n8730N0086
15386b25046J76392J13187j8083q111q8707j0882K9598o7127J06250Q4891K1270
15375A13632L4025j98590j64331j0170L1587P4375j1605k5827Q222Q7758P5540
$$ y = [-7876, -126105, -67858, 18566, -80233, -136669, -86352, -94421, -56895, -90856, -59502, 58760, 4092, -55226, -47850, -93024, -114961, -92795, -82324, 85923, 101086, 76574, -72094, -141177, -106592, -138059, -172625, -272519, -278707, -160166, 37008, 155139, 129696, 171420, 124850, 63935, 49047, -85499, -201447, -165282, -10885, 29999, 7244, -50734, -104590, -29878, -6819, -30737, -22908, 2869, -32974, 8487, -144047, -44999, 102029, 46818, -78685, -120921, -70980, -119021, -189104, -140816, -39267, -82173, -84131, -71050, -70662, -216402, -275132, -225046, -48654, 64533, 46450, 38339, -50368, -61250, -31652, -98779, 7471, 92362, 113632, 147657, -50933, -215264, -225434, -193847, -119472, -131077, -156904, -148682, -60924, 14616]
15364A4616N3017Q2917j0409q1203j36052j3176Q8605o8188q7942P9367J9608
15353e8840L9733M3043l1512r348m2577o2400J15654J11508P8153q9621p3353
15342B0440M5621l0177K229O9636j36228o4532M9599n9327N7896J75347J03885
15331B34389q3837j97371O0870J52469j8712O4379m4073j85544o6343K6000l1363
15320h9136R677P6087O4616J2711M5107O0861q7749p9615n3878N1510J3724m597
15308A9318l2866m2193l0625l8587o7383N8662l7983J0470P8518j6481j42721
15297b41871L8427J67232P1784M774o7751j0759K0934p9931m1360O5866L167l945
15285g3433j2216O8714k186J2616Q0270m8693p2111J42557R0165Q4982j04365
$$ y = [14616, 67633, 150550, 140141, 58938, -77114, -90290, -1685, -69873, -157815, -78448, -58840, -19107, 23936, -7576, -16924, -59501, -121901, -6247, 105261, 183414, 93793, 20440, 66061, 35884, 38113, 107749, -28479, -93011, -43412, -102739, -44843, 130504, 234389, 150552, -46819, 14051, 166520, 147808, 212187, 168114, -17430, -83773, -57773, -89136, -79459, -3372, 61244, 73955, 119062, 179923, 92174, 12559, -41319, 10191, 23915, 19318, -13548, -55741, -86366, -124953, -192336, -133674, -171657, -161187, -82669, -99150, -241871, -203444, -36212, 35572, 40346, -27405, -38164, -17230, -97161, -138521, -72655, -69488, -73433, -85649, -16935, -19121, -6505, 73765, 25072, -47039, 95518, 185683, 270665, 166300]
15274A66300k5592L4185j04560j42906l5758k7210k8997L3276j7850P3454K46448
15263A70790R197j54689R3340M3025J10795j25981q8184O9393L2540n5194j05603
15252e71j27105Q5918J9631j233M9915O6025O212r0588j354J33329J91817j5999
15240C15997j24600j16237n1560k2569N4737r8024k0617m4327Q2113M6275R8684
15229A19872m0263j4387m5275l0806J1192L5503j5454k9901K3162L7928j04013
15218e2442p7469J2077M2640J79569J11882r8108k46530J24516l859q4196N0929
15207d0991q0514l5414N2346O6247q3239j1948j7674M208n4803K1365J08167Q9618
15195A7368q5849o8040K6122L4331J70750l4532j23947r0604O1527N8627p8507
$$ y = [166300, 140708, 174893, 70333, -72573, -108331, -135541, -164538, -131262, -149112, -75658, 170790, 179987, 25298, 118638, 161663, 272458, 146477, 58293, 127686, 160226, 105032, -571, -127676, -41758, -22127, -23360, 26555, 92580, 98792, 8204, 6850, 140179, 331996, 315997, 191397, 75160, 23600, 1031, 55768, -42256, -62873, -107200, -25087, 21188, 119872, 79609, 65222, 19947, -10859, 333, 35836, 20382, -9519, 13643, 51571, -52442, -129911, -117834, -75194, 104375, 216257, 118149, -128381, -3865, -7724, -91920, -40991, -121505, -156919, -104573, -38326, -121565, -133513, -151187, -146979, -201782, -180417, -72250, 17368, -68481, -136521, -110399, -76068, 94682, 60150, -63797, -154401, -92874, -34247, -112754]
15184a12754j1789j8452R7842Q14o9770n1010j72703m4508O7936j9083O4210N2892
15172b16375J9806P6188P628N4676l5242n7881R1740M9831M2782j16931J812l315
15160h5281K9695J5165o4069j30529L3800n1940m5977J28353P0329J17119J34696
15149A51361m425k6726J7613n9342p4979l2136J35914J1202l127J5699L991o0623
15137G4422k7575O3626J24034K8073K1608j44839j21869M9763L7619J7007M3571
15126A65440q6419m7428j75113q2773J46308R9317P4774L2215l3862j9735o6328
15115F396q2646J7090R9114N3161k1793q3644j0182M070q6284K7720J12901q807
15103B7096J45786L0432j69029j58511j39249m4137q9672R0136J07365q787N0381
$$ y = [-112754, -124543, -142995, -45153, -44339, -114109, -165119, -337822, -382330, -314394, -333477, -269267, -216375, -196569, -120381, -112753, -58077, -93319, -151200, -59460, -9629, 33153, -83778, -81966, -85281, -55586, -40421, -104490, -235019, -201219, -253159, -299136, -170783, -100454, 16665, 151361, 146936, 120210, 137823, 78481, 3502, -28634, 107280, 118482, 115355, 131054, 135045, 74422, 46847, 110473, 234507, 262580, 284188, 139349, 17480, 67243, 104862, 121869, 165440, 79021, 31593, -143520, -226293, -79985, 19332, 94106, 126321, 92459, 72724, 6396, -76250, -59160, 39954, 93115, 71322, -12322, -22504, -18434, -104718, -76998, 35903, 27096, 172882, 203314, 34285, -124226, -263475, -307612, -397284, -307148, -199783, -208570, -158189]
15092a58189J07522k4136K1265k7859K7748J797J02156p7496k35380l6554J48286
15081a50840J14917J03907R0777r9013j87719m6831j0294p177J2048L019n4002
15070b31208k3567m9221J19464J13379p0057j41M771N0190o8744p9999L748l9152
15058b70537n6187M6874O1859R3458j12537l3649L1610J7015k8050j09414L4821
15047c24737l5252J40721J67269K543J23513k0885q4530j7259n3634q744l7896
15036a48891J8693J40408K1598j7295K6032q2311q761m0169l7518m981j14951
15025b48146l7399L6237K4040Q3736K5515Q2075O5136J11255p5959j02585j05053
15014a41148j37173N9527J55708P2581J39202Q7523q1497R1752j04688j85087
$$ y = [-158189, -50667, -74803, -53538, -81397, -53649, -51852, 50304, -27192, -262572, -299126, -150840, -35923, 67984, 158761, 59748, -127971, -174802, -185096, -192273, -180225, -177206, -231208, -254775, -303996, -184532, -71153, -141210, -141351, -136580, -86390, -155134, -235133, -231385, -270537, -326724, -279850, -217991, -124533, -237070, -270719, -239109, -222094, -250144, -359558, -324737, -359989, -219268, -51999, -49456, 74057, 53172, -31358, -48617, -102251, -110995, -148891, -130198, 10210, 31808, 14513, 40545, -41766, -50527, -90696, -128214, -133195, -248146, -285545, -249308, -225268, -141532, -116017, -33942, 31194, 142449, 66490, -36095, -141148, -278321, -218794, -63086, 9495, 148697, 236220, 154723, 246475, 141787, -43300]
15004d3300j59927O2626L0956O9250J80103J79975K63372J95537Q4884L8801j03855
14993G98422k22406n2211q8287p4337j08903K3175M5802o3843q7339o1115j9630
14982H9328k5483j77477L8719J14339j22711m4887N6623M7804M4925J6626n7727
14971a9921n9784N2080j6394n2898R1547k078k4923r663n8953n7263L6161J49627
14959B7538J35259p9044p7663k1967j53707o375q481R8299Q0762j22394L6015
14948i1758J24006r1684o4685j1694k5688J6767n0562l4528l502P5022O4404M6363
14936d7539J537J03461J11344o0883j54654n4224P1589P3252N9717l5315j07890
14925c9605n8526j13125Q6282O5104q7634J5260p0028J18156L4896k305M8680
$$ y = [-43300, -203227, -140601, -109645, -40395, 139708, 319683, 583055, 778592, 863476, 902277, 798422, 576016, 523805, 435518, 361181, 252278, 275453, 321255, 257412, 170073, 108958, 89328, 63845, -113632, -74913, 39426, -83285, -128172, -71549, -23745, 21180, 37806, -19921, -79705, -27625, -44019, -96917, -5370, -7448, -32371, -42034, -100987, -158250, -122089, 27538, 162797, 83753, 6090, -15877, -169584, -175959, -184440, -86141, -5379, -127773, -91758, 32248, -59436, -124121, -135815, -161503, -144736, -195298, -229826, -233328, -158306, -93902, -47539, -46002, 57459, 168803, 107920, -46734, -100958, -29369, 43883, 103600, 68285, -39605, -98131, -211256, -124974, -59870, -147504, -132244, -202272, -84116, -49220, -51525, -2845]
14914b845p765J15923J00966k12044j42465O5695J04172M6963J098l052m4456
14903B2190j59909j30621n5369k4049J32136J23756l9423k7736q9222j75249O2966
14892c60530j6455K864N0178N7372P6594J58026P1394k04410j89840Q4694l8698
14881c08811L7718J29434J45015K1289M6513j30960m4722J64677J91471L6573
14871B88197m7963k35102j65071j16974m4869l5804K2914J31434O8229n9475n2146
14860b46630k9838J58280P2328M313O1539j16982j6942J2156j14206P365J88120
14849b0497O1668P4382j27123p5448L5071L5025j2708r7257p8016P8660O4757
14838f1486j0025m7880J1999N6924j23510n2154j299M5359J29153K10943j53901
$$ y = [-2845, -10610, 105313, 206279, -5765, -148230, -82535, 21637, 68600, 69698, 66646, 22190, -137719, -268340, -323709, -347758, -215622, -91866, -131289, -159025, -248247, -423496, -360530, -376985, -374121, -323943, -266571, -189977, -31951, 39443, -164967, -354807, -270113, -308811, -271093, -141659, 3356, 24645, 71158, -59802, -104524, 60153, 251624, 288197, 240234, 5132, -159939, -276913, -321782, -357586, -334672, -203238, -135009, -194484, -246630, -276468, -118188, -45860, -41547, 19992, -96990, -113932, -101776, -215982, -208617, -20497, 41171, 115553, -11570, -87018, -51947, -16922, -29630, -126887, -204903, -126243, -61486, -71511, -119391, -107392, -50468, -173978, -226132, -227431, -182072, -52919, 158024, 4123]
14827D123j87372L5566J50182J09892P6350r2844n7024o1018n4309M4187M0461
14816H194J7492r0490j2645k233J07297j1527P9649k1479l3020K5265p4463l1095
14804c9055o6380j16509j705J35306O2052p4433k3727K3647R2136j17162k8901
14793a54731k9461m893L5238N7306p1731j5116J42685J17608L7961m2660p2269
14782f3J9419M2269O9272J04722M1182K0930q6936R5895J3481j76307r0874l0192
14770B2798J1522j47514L6742L5698Q8325J08444l7761j14472q6685K307m8460
14759a29056m7451M7675j1507M6479J2705p0999M4507O9508J28556Q4193p9852
14748I4758j31942L9438n4424n1838M274L0126M7093j2751K2976o5829j5520q6406
$$ y = [4123, -183249, -147683, 2499, 112391, 188741, 95897, 38873, -22145, -76454, -32267, 8194, 25686, -64804, -77449, -79682, 27615, 16088, 95737, 74258, 41238, 66503, -7960, -39055, -105435, -221944, -223649, -88343, -26291, -100724, -124451, -100804, -8668, -125830, -154731, -184192, -189085, -153847, -96541, -168272, -183388, -40703, 76905, 114866, 72206, -63, 19356, 61625, 130897, 235619, 276801, 297731, 210795, 306690, 320171, 143864, 52990, 22798, 34320, -113194, -76452, -40754, 47571, 156015, 118254, 3782, -82903, -80596, -129056, -176507, -128832, -140339, -93860, -81155, -152154, -107647, -38139, 90417, 174610, 94758, -37184, 2254, -52170, -104008, -99734, -69608, -22515, -35266, -12290, -78119, -93639, -180045]
14736a80045O4069M2558n2246p0127J6143P1677Q9375L2132l9566M2099k9764
14725a3695n8641J093j42297n2654p0076q8296J82469J54638j8692Q0391l6597
14714f2357o9817p28K9601p3177K8339J3484K6256J27219Q181P2685o2541j05900
14702f8755j17598J2918P2640J0559N0859k5815R8743N4421m6250j3676P6696
14691A04742N1490J6444j20177j41824n5926J31742k3564l0647L1752N2647J033
14680A7712k5143j6287J6240P6199K9241j04864q6796N0273L2882q1917o6578
14669a59038K7753M9005l5417J0592K13620k3900j57823j3768J10879o9168R6487
14658D9222J71325k6431J1783O295r1597j98527o4790J1756j80510k0988o268
$$ y = [-180045, -115976, -73418, -125664, -195791, -179648, -107971, -18596, 13536, -26030, 16069, -13695, -72336, -71243, -213540, -266194, -336270, -424566, -242097, -87459, -106151, -25760, -62357, -132174, -132902, -103301, -176478, -148139, -134655, -108399, 18820, 27001, 99686, 37145, -68755, -186353, -173435, -100795, -90236, -39377, -65192, 33551, 87972, 41722, 28046, 104742, 156232, 172676, 52499, -89325, -145251, -13509, -37073, -67720, -35968, 16679, 17712, -7431, -23718, -7478, 68721, 97962, -6902, -93698, -43425, -10543, -92460, -159038, -131285, -82280, -117697, -107105, 106515, 82615, -75208, -88976, 21903, -47265, 49222, 220547, 194116, 205899, 212194, 120597, -77930, -142720, -130964, -311474, -332462, -338730]
14647c38730P2834J17011J40416R2412O3093j0274n8461J7755p2458M8708R1584
14636A63890l882m4966j01538J3560L2475O0278L212n2778J5917L1504P9317n5995
14624A40994j35048L0984m2511j43592M4304J94218J94782o0612j15153j48247
14614c9881q2902O6646M5167O3329n4537j4584p232O2148P4493j48547r4206J03033
14602b7073M8008j75266K5770J05450O2464Q4547j37281j7691p0343j00962N6482
14591a45895l276o0016o3805K2499J30338J88618j5996j38960l3146M3197L3420
14580d3022J8775P1013l2844M6303K6809l3155j34661R7802N3303j57475r1639
14569a78791r8150J27880P779J5019m6885L5269K43788R897j76603k80595j28060
$$ y = [-338730, -265896, -148885, -8469, 83943, 147036, 136762, 78301, 96056, 23598, 72306, 163890, 160008, 115042, 13504, 27064, 59539, 119817, 123029, 70251, 86168, 117672, 196989, 140994, 5946, 36930, -5581, -149173, -104869, 89349, 284131, 223519, 108366, -39881, -122783, -56137, -10970, 52359, -2178, -16762, -23994, 38154, 112647, -35900, -130106, -27073, 20935, -154331, -128561, -23111, 39353, 123900, -13381, -31072, -101415, -202377, -145895, -149171, -209187, -272992, -250493, -120155, 68463, 52467, -86493, -119639, -76442, -43022, -24247, 46766, 13922, 60225, 87034, 53879, -80782, 17020, 70323, -87152, -178791, -276941, -149061, -141282, -126263, -173148, -137879, 105909, 115806, -60797, -341392, -469452]
14558d69452J85175J49757J77512r4240M3103R1211l7981r8272L4823K8778P9000
14547H9414l3491q2157n0119n1298R2703n3892k5789J9888o6050k1323k4187L7724
14535a68577o9174q324P8192K41923J79662j4883p1226j20619r280Q6475m2555
14524H1614r8508l7761o1249K3067j4640j335p4079k4495M8049K23695L6908k4203
14512G7063J8347N0678K2586l8610k7959O0513k3470r1366j12147p0559p9322
14501b14246k9048J25470L9538M2945j789l4818R4408J5997j54280O088M3643
14490f6092m8790m4463j6558N9090M0256Q9282o1271j79636j06114o7305l0613
14479d32214J11932M5763L3052K2543k0921L8163O4431M1763J26474N7866l7312
$$ y = [-469452, -284277, -134520, 42992, -51248, -8145, 83066, 45085, -53187, -18364, 10414, 89414, 55923, -26234, -76353, -127651, -34948, -88840, -114629, -94741, -160791, -182114, -206301, -168577, -237751, -246075, -167883, 74040, 253702, 238819, 167593, 46974, 37694, 124169, 81614, -16894, -54655, -115904, -92837, -107477, -108812, -182891, -207386, -159337, 64358, 101266, 77063, 95410, 146088, 168674, 130064, 102105, 162618, 139148, 47782, -64365, -134924, -214246, -243294, -117824, -78286, -35341, -37130, -71948, 22460, 38457, -115823, -109735, -66092, -114882, -159345, -175903, -116813, -76557, 12725, -48546, -228182, -334296, -401601, -432214, -320282, -274519, -241467, -218924, -239845, -201682, -137251, -95488, 30986, 88852, 51540]
14468E1540j19307r2466J13405m9723k9328m6905M6991j4155m7042j00351j4163
14457c01504K19251N0403m3328o5031r776L4533m6710J19964M9078n8673r0478
14446a42271K7140J20586k2941j22810M2168O6417K43379J46810J8406R503j58721
14435B27666k13911r9810J00607k8278q5444M8807J99901l6532J4936l8811m3044
14424D6087Q6509J0706l9701J22273P6890p2404k5447L5242j30110j76515K305
14413f4165M6426K5101J3563o5096J19753L5658k1365j9357j1600k4048p9606
14402d4736o778Q9169l561q8288L0069p5586J64335K5459L1523j45291r4166M9545
14390f8306M705r9149j50750Q6284J56448P620k8132L6733R8633Q5843L7099m2569
$$ y = [51540, -67767, -160233, -46828, -96551, -125879, -172784, -125793, -139948, -186990, -287341, -301504, -82253, -31850, -75178, -140209, -149985, -115452, -162162, -42198, 6880, -51793, -142271, -115131, 5455, -17486, -140296, -98128, -31711, 211668, 358478, 376884, 386387, 227666, 13755, -86055, 14552, -13726, -99170, -50363, 149538, 113006, 127942, 89131, 46087, 132596, 143302, 103601, 225874, 302764, 230360, 204913, 240155, 110045, -66470, -64165, -17739, 7362, 20925, -44171, 75582, 111240, 89875, 70518, 58918, 34870, -44736, -51514, 37655, 34094, -54194, -24125, -99711, 64624, 90083, 121606, -23685, -117851, -68306, -63601, -162750, -313500, -227216, -70768, -63148, -91280, -54547, 44086, 129929, 167028, 124459]
14378A24459p1237q2022l8053o2206j17656N642J10562J19283m9065k297R5334
14367C2744L2377N1145Q920J1199k8801J1458j8128O2810j51846k25524M9124
14356a64522Q7295K6386n5436j1938J13934L3549J3367j78574p6275J18678l9462
14345a32998J8291J21162J69198L2560j06987j20842M3820r8919k0658j114o2873
14334a59360j7341K70177K044j38960j78522n3650L4803q64m0039J39236Q8591
14323e3885Q6682R746K318p5147q2368P6j76630K7315J22897q2026p9271N0143
14311b50150J22581J63867R99r6512p7935n1210k7398O8969M1586L9449K3656
14300d2098l2472j7269k9593j54628k5431J67884J73272Q9562j25609M704k5068
$$ y = [124459, 53222, -28800, -66853, -129059, -246715, -241073, -130511, -11228, -60293, -62590, 32744, 65121, 116266, 125186, 136385, 107584, 119042, 100914, 163724, 11878, -213646, -164522, -77227, -50841, -106277, -118215, -4281, 29268, 42635, -135939, -212214, -93536, -132998, -114707, 6455, 175653, 208213, 101226, -19616, 24204, -74715, -95373, -96487, -159360, -176701, 93476, 95520, -43440, -221962, -275612, -240809, -241673, -281712, -142476, -53885, 32797, 42543, 44861, -30286, -112654, -112578, -289208, -261893, -138996, -221022, -300293, -250150, -127569, 36298, 37297, -59215, -137150, -188360, -215758, -146789, -105203, -65754, -42098, -74570, -91839, -121432, -276060, -301491, -133607, 39665, 129227, 3618, 8322, -16746]
14289a6746k9963p0796j3096K3555J42198O5705k072j04997k08203l2866J26252
14278a21029k8877r6585Q068M2869J14505P3751q1167j28924o180N639K3034Q9995
14266a04901N4060o7626q7258r9552j5747K2072R2602J68325R7178K0053j93287
14255a14081o9262R8887m3132l8729l208J21089k7875P2209N0327p1477j86706
14244b11958q0332J3193J11331N3015k5402J10905J8262J46245J5130j21463p6157
14233d7231j955K0927o4780J13846o5876j16915M8543N683q523N1600M5033q9146
14221a08794o4849j54024J26561P1938L9154Q2112N549j902J29140J5239r0294
14210D9830n7028J4020N0623l0354j85665r5507o3398O5322K0259K3216L2598
$$ y = [-16746, -46709, -117505, -130601, -107046, 35152, 100857, 98785, -6212, -214415, -247281, -121029, -149906, -246491, -238423, -195554, -81049, -7298, -88465, -217389, -223569, -217930, -194896, -104901, -50841, -118467, -205725, -305277, -321024, -298952, -206350, -38025, 59153, 79206, -114081, -183343, -84456, -127588, -166317, -169525, -48436, -76311, -4102, 46225, -25252, -211958, -292290, -279097, -167766, -114751, -140153, -29248, -10986, 135259, 150389, 28926, -47231, -49186, -28259, -93039, 20807, -45069, -161984, -113441, -107758, -116281, -64681, -19648, -108794, -173643, -327667, -201106, -129168, -90014, -7902, -2353, -4255, 124885, 140124, 49830, -7198, 6822, 57445, 27091, -158574, -254081, -317479, -252157, -231898, -208682, -176084]
14199a76084O4154J25491J05361r8972m3498j02718J4046J1525p4821K0484k3988
14188a79020K6468J6087R4289k0757l3247K7453k5203n7764p7258j37610l1515
14177c98077J38392J27597O5044J6286k2078J6988j14556J486M9730p0781M1843
14166a48126Q4103M6659K1124m8825n1852M0336r233k12843r8056J97872J24146
14155e4695J43113J4260P7364R201l0327j25667j26120q4968Q3732P856N909q7245
14143a67587N3114L1128J12855l3214J83076J3823n0172q5804n9680J05613N1288
14132A54440j16979j43988l7013q5512P7816J07788j1061J6099J2532m9787o9043
14121a44708l5593R1384J59057o9128o3974R3217K6602j15462q8842l6086K1186
$$ y = [-176084, -111930, 13561, 118922, 19950, -23548, -126266, -112220, -100695, -175516, -155032, -179020, -152552, -136465, -42176, -62933, -96180, -68727, -93930, -151694, -228952, -366562, -398077, -259685, -132088, -67044, -50758, -72836, -55848, -170404, -168918, -119188, -189969, -148126, -64023, -17364, 3760, -45065, -96917, -56581, -65814, -278657, -376713, -178841, -54695, 88418, 102678, 180042, 189243, 158916, 33249, -92871, -177839, -94107, -86251, -80342, -167587, -114473, -83345, 29510, -3704, 179372, 193195, 143023, 57219, -2461, 103152, 154440, 37461, -106527, -143540, -229052, -151236, -43448, -54509, -38410, -25878, -75665, -144708, -180301, -88917, 70140, 1012, -62962, 30255, 56857, -58605, -147447, -183533, -162347]
14110a62347L3016M6733M6113j6551q2574r7865j3823K2873L1259O3658K7006
14099a02502J0301P2797J26690j04369N697P7138J13219j50679j6009k850m1365
14088a1932j26944k8079J38688j249N4460K1593q3849j07479N0911k8150Q2099
14077c9931J78221l2351l6481m9136o3433q71Q5708l0004l9026J6685O0308N2745
14065A02434J0066p4854j25363L7947o0125o3522N0403k6641n0887N9042J3305
14054a28195o5077P9089J22751M9266k0014k2982R5280N98Q542j46256j48372
14043a75370m0326M3847o4284k43331k8949J57649J27421J22153J19992J5195
14033C3997o2356K2519Q8984O833n1688q1859j10226j57919M9335J06183J5213
$$ y = [-162347, -129331, -82598, -36485, -53036, -135610, -233475, -247298, -224425, -193166, -129508, -102502, -92201, -19404, 107286, 2917, 8614, 85752, 198971, 48292, 32283, 29433, -11932, -138876, -166955, -28267, -29516, 24944, 46537, -37312, -144791, -93880, -122030, -39931, 138290, 105939, 69458, 20322, -43111, -43982, 41726, 11722, -27304, -10619, 49689, 102434, 112500, 37646, -87717, -49770, -109895, -173417, -123014, -149655, -200542, -141500, -128195, -193272, -114183, 8568, 57834, 37820, 14838, 110118, 110716, 119258, -26998, -175370, -215696, -171849, -236133, -479464, -508413, -350764, -223343, -101190, 18802, 33997, -28359, -5840, 83144, 89977, 38289, -43570, -153796, -311715, -262380, -156197, -140984]
14022a40984Q4599Q9033J2820j15135j13609L7844J0933J02086Q5344p8071Q4777
14011E9637O0017j55906j7962n7962L6431p7045L7615J11848J12N6451J10617
14000A63853J93467M2923L1954k01295k23054j38175O6285L0830k0785R5045j3504
13989B7544k2718k9062k4537R9931p620r058j5817o1634K7409J0662p8701k0101
13977a03702M1942J4288L0967O7981m9842j3800j25687o2404P8833J65947M2315
13966H6838j77258n4571M2648j6244L0055l5992N6815J13977M8575J3084j35089
13955b7162k1936N6227J57392o6649m7867j38658N811j9424j62605p3779N6908
13944b81742K716N9817J00598o271J6871J6N7077J56621K2391l8665j15347o1313
$$ y = [-140984, -56385, 32648, 45468, -69667, -183276, -145432, -134499, -32413, 52931, -25140, 59637, 119654, -36252, -54214, -112176, -75745, -152790, -115175, -3327, -3215, 53236, 163853, 357320, 400243, 432197, 230902, 7848, -130327, -64042, -33212, -53997, 41048, 27544, 4826, -24236, -48773, 51158, 43538, 34480, 18663, -42971, -15562, -4900, -83601, -103702, -61760, -47472, -16505, 51476, 1634, -12166, -137853, -200257, -121424, 44523, 86838, -90420, -144991, -102343, -118587, -88532, -124524, -67709, 46268, 94843, 107927, -27162, -49098, 7129, 164521, 97872, 50005, -88653, -82842, -102266, -264871, -338650, -281742, -279026, -219209, -118611, -124882, -108011, -107995, -50918, 105703, 128094, 89429, -25918, -87231]
13932h7231j3228j16860J35145M0345J14026J08761K299j08085j22034P2149j7182
13921H105r6642j40221o2287M3673J09654K1052M9294Q4312p6355j81833n091
13910b46339L5250n7105J0390O9599N4684n7394K4486K3111O8302N4904L3432
13899A3320R4095l7428j09547k4976P6001o8821R800m024j4463Q3430K13591q9937
13887A41041j85615j11599j53709P6489M23296M4595p5368k19511k9334p0542
13877a60257q4965m0671N6630J59182J34020p6586o3449l6604j5689o2264M9057
13866a41596L0213O1905Q8920r0498q292L8478j34845k3909J70709J20809J33596
13855B45490o8709j37862j79442k3461Q8941p5874q139M436J3712l8615k0735
$$ y = [-87231, -100459, -217319, -82174, -41829, 72197, 180958, 183257, 75172, -46862, 25287, 8105, -88537, -228758, -291045, -247372, -137718, -116666, -67372, 16940, -59415, -241248, -246339, -211089, -268194, -257804, -188205, -133521, -190915, -166429, -143318, -75016, -20112, 13320, 107415, 69987, -39560, -64536, 11465, -57356, -47556, -51580, -66043, 17387, 230978, 141041, -44574, -156173, -309882, -233393, 189903, 234498, 159130, -60381, -89715, -160257, -245222, -285893, -229263, -70081, 63939, -12647, -76096, -112700, -128389, -190653, -141596, -111383, -49478, 39442, -51056, -59348, -20870, -155715, -179624, -8915, 111894, 245490, 176781, 38919, -140523, -163984, -75043, -150917, -159056, -154620, -140908, -179523, -200258]
13844b00258J1105q734J652J5458J18886J12388k1780O994J1836J5221k3420L1710
13832G1058k6633R439P6431q2565p1421L7881l1424j76212q3473P5393N3119Q0908
13820f7499K2301q832r9038k4715J49385Q1344n0544j5546J11094m498M6079n3291
13808H6240m2584j4907n7212p262R0954j56775K5894J16623n3840j83209P6069
13797a20009J28294Q1153m1078p9184k7951l6316l2262K8549O0222j4937K4590
13786b8929O1078q622j10420n6786j71108j4774o3529K20354N3386J0719P527
13775a01104k2123K6679p9340K0635O0708j64732M516j79375p5906K24860J66077
13764a19105J65164l8709j01253K1871R9346o782r2991j14631O5447J22768J51705
$$ y = [-200258, -189153, -197887, -196235, -180777, -61891, 50497, 28717, 35711, 47547, 62768, 39348, 71058, 44425, 53864, 130295, 47730, -23691, 14190, -17234, -193446, -276919, -201526, -148407, -67499, -45198, -54030, -153068, -177783, -28398, 52946, 2402, -13144, 97950, 93452, 139531, 86240, 43656, 28749, -28463, -35725, 55229, -101546, -75652, 40971, -12869, -196078, -120009, 8285, 89438, 48360, -30824, -58775, -95091, -127353, -98804, -38582, -53519, -28929, 32149, 23527, -86893, -143679, -314787, -329561, -393090, -172736, -119350, -108631, -101104, -123227, -96548, -175888, -155253, -94545, -259277, -254761, -434136, -510042, -285182, -119105, 46059, 7350, -93903, -72032, 27314, 20532, -72459, -187090, -121643, 1125, 152830]
13753A52830R5868j05404l0490j13514j55843R7576M4871j7604k1990p5460J6437
13742a12723J2032R6940K3543N8284K4970l2503j3187q5171j26868K596J7341
13731a34746J10968J45436K2752j04880O9500L5207l100N176m967l3678j9657
13720H8011l8774q9880n1089K5979O5345L3438L292Q709k0546K4190L0389k7672
13708E1392n9878n1942p3380Q3657L9986q0703N0208l5236n4827n5340j00625
13697b86688Q6205J7156L496p7447P5139p497J5535R2717M8390J09269J0002l7859
13685D8418O0296O2150n0533n5914J02288L0948j36659k03221m3894J12837p019
13674h0303J17573o0591r088P7540j9617j5656r0112J21668o38j25046j30489
$$ y = [152830, 248698, 143294, 112804, -710, -156553, -58977, -14106, -31710, -53700, -129160, -112723, -100691, -3751, 19792, 78076, 103046, 70543, 57356, -27815, -154683, -152087, -134746, -23778, 121658, 144410, 39530, 109030, 144237, 141137, 146313, 141346, 107668, 88011, 49237, -40643, -91732, -65753, -408, 33030, 36322, 45031, 24485, 48675, 79064, 51392, -8486, -60428, -133808, -50151, -10165, -90868, -40660, -75896, -130723, -186063, -286688, -200483, -183327, -179831, -257278, -182139, -189636, -174101, -81384, -32994, 76275, 86277, 48418, 108714, 170864, 120331, 64417, 166705, 197653, 60994, -142227, -186121, -73284, -80303, 37270, -23321, -32409, 45131, 25514, 9858, -80254, 41414, 40776, -84270, -214759]
13663b14759j03508R4328l6441n5076J03431J16908n9576P1603O3020j2567p5928
13652a08565r2541j67781n4317J13401Q1384p2567P3696R2844N8491l9871R1341
13641b4485J39938M8675r5221k02538q4261J57640N2399l07J06850O2921j5603
13630A46008M5771r4348j11131O0480q3876l8576J1221o8372j6439n763L5948
13619a19077J9191n8382j22078J87178m1284p5802K4634P5953J23727P3812l3468
13608E4404n3071j78440K2017p2670R498M5600k999q1299N2081J57778J7939o841
13596c6003r6468p4416Q3681J12344j68787n4158J9574L2012K8118O864J65352
13585A8113L9156r7692p764J13894P20r1675J21103O6164J00675m7983j21010
$$ y = [-214759, -318267, -223939, -260380, -315456, -212025, -95117, -154693, -83090, -20070, -32637, -108565, -201106, -368887, -423204, -309803, -228419, -300986, -227290, -134446, -75955, -115826, -24485, 115453, 164128, 68907, -133631, -217892, -60252, -7853, -8160, 98690, 161611, 146008, 191779, 97431, -13700, 46780, -37096, -75672, -64451, -132823, -149262, -155025, -119077, -99886, -158268, -280346, -93168, -134452, -210254, -185620, -109667, 14060, 87872, 54404, 1333, -177107, -155090, -227760, -218262, -172662, -175661, -256960, -204879, -47101, -29162, -36003, -132471, -206887, -123206, -10862, -179649, -233807, -214233, -182221, -154103, -147239, 18113, 57269, -40423, -48187, 65707, 66427, -25248, 95855, 162019, 262694, 214711, 93701]
13574I3701n9108j9943N4163l9443q9370N5543k3756O3890P1966j24436p0885
13563h7678R9478O9816Q6202p8390j57338j81007M0536J98664Q8676j64397o6153
13552a51591Q1433o1747J16849N647O9591k2940Q0071N3698K341K883n8986L8093
13540A55342Q8516J38733K1531j60778j69753Q857m135K6570j62084j33599j4057
13529b04857K6987Q3326J6099j10882K8032J34539R9501J08623j9474N5592j33086
13518H4400m1698j3364j19228j27511R7471n3617n7685J35776o450m5747O4647
13507h3006J59725K8258n6014q9676m5856m2499M3501J28321j9390k08652k3640
13496b08928J04061r705o3841R5422J36358l157j17796k5443O3219m0235l6486
$$ y = [93701, 34593, 14650, 68813, 29370, -60000, -4457, -28213, 35677, 107643, -16793, -87678, 11800, 81616, 167818, 89428, -67910, -248917, -208381, -9717, 78959, -85438, -151591, -70158, -131905, -15056, -9409, 60182, 37242, 117313, 171011, 173352, 176235, 117249, 155342, 243858, 382591, 404122, 243344, 73591, 82448, 78313, 104883, -57201, -190800, -204857, -177870, -94544, -78445, -189327, -161295, -26756, 72745, 181368, 161894, 217486, 84400, 42702, 29338, -89890, -217401, -119930, -173547, -231232, -95456, -101906, -147653, -83006, 76719, 104977, 48963, -40713, -86569, -129068, -85567, 42754, 23364, -185288, -208928, -104867, -114572, -178413, -82991, 53367, 50210, -67586, -93029, -29810, -70045, -106531]
13485a06531p5294Q3601K89263J35255j03981k3728j26017j13472m46r945K017
13474d9278k2576k8062J29907M4915r2334J0753o7223j0908P3587J09794k3393
13463G5182k5573N0201k4313j7987N78l0288r2599L9442J77290m948j22055o4850
13451c9920p7432M7718p3174l3155O6231L5252j06402N7389K09313P5216j4482
13440A46554K3273o7498r0179o2001N0684p6892L5738o7299j16464J12515R2318
13429a9251p0645J39492J25224j31915L9760N6167q0569N329n234R8354J96178
13418C52890j84146j57630k3459q3512j1397J58500J64492k9004q7666n5555Q8521
13407A32034o0877m6615K9757k9108j9129p4799M4751M5432M0732j09404K8221
$$ y = [-106531, -181825, -98224, 191039, 326294, 222313, 198585, 72568, -40904, -41350, -51295, -49278, -71854, -99916, 29991, 74906, -17428, -6675, -73898, -84806, -11219, 98575, 75182, 49609, 99810, 75497, 57510, 58088, 27800, -64799, -25357, 151933, 146985, 24930, -39920, -117352, -69634, -142808, -175963, -109732, -74480, -180882, -123493, 85820, 161036, 146554, 169827, 102329, 12150, -49851, 833, -76059, -40321, -107620, -224084, -111569, -19251, -89896, 49596, 174820, 42905, 82665, 138832, 58263, 63592, 58358, 156712, 352890, 168744, 11114, -12345, -95857, -107254, 51246, 215738, 186734, 99068, 43513, 132034, 71157, 24542, 54299, 25191, 6062, -68737, -23986, 21446, 62178, -47226, -19005]
13396a9005m684r4171K2519R6616k0630k340L2520l7310j22028j02037J5186P8804
13384a56560N9257M2925J8119P2750O2702j827m1173j07666q8691p2679R5297
13373a17546P3997l9406n7140N2489J10024q301j23646o6505k5825m2562J3439
13362b30982q75Q5089R4580N1834K9928K5860n6165m751R4185k7610j05682J37621
13350I3032K3992k7221o1691Q7199r4247l9616L5017m0829M468j9577r145N0011
13338A393p1899j28982L9871J20265Q722l3685P6779J13497K578L93j38820j90810
13326b00698k6968J32689J44821O2506j04295n2085J7972J401M2527R6750R2342
13315B06962M1993P38n1487j56557m0799O890m9966j3930O342j5157m3313N9638
$$ y = [-19005, -23689, -117860, -95341, 1275, -19355, -21695, 10825, -26485, -148513, -250550, -235364, -156560, -97303, -54378, -36259, 36491, 99193, 97366, 56193, -51473, -140164, -212843, -117546, -43549, -82955, -140095, -87606, 22418, 14117, -109529, -176034, -201859, -244421, -230982, -231857, -146768, -52188, -354, 29574, 55434, -731, -5482, 88703, 61093, -44589, 93032, 117024, 89803, 28112, 115311, 21064, -18552, 16465, -24364, -19896, -39473, -48618, 1393, -70506, -199488, -159617, -39352, -30630, -64315, 12464, 125961, 128539, 128932, -9888, -200698, -227666, -94977, 49844, 112350, 8055, -44030, -26058, -24657, 17870, 114620, 206962, 248955, 249693, 198206, 41649, 850, 7740, -42226, -56156, -49814, -64971, -108284, -48646]
13303d8646R0252k5184J71134j30231k50181R0779J70752p9917n2242j01811P1180
13292i4115Q0330R899K1395R7766L7451j49561m0688p2042m4647J62722l4491
13281b5981J51760l4412J04313R2853O3546p6517L0217m435j52372O8181O049
13270B23202Q9775R4941m4085k33681m6568L0831o1148o9620j7278N5442l0440
13259h629l3669r4300P0862J21818J25179J27252m0192l7443q5829L0543L2049
13248B07641q8119p9669j01234q851J9788m8679J60882N2449N889N1280l1766
13237A39611L2425j37481J8330r4055L7155k12J53990L7108j05118J1685P4671
13226A68109j30445M944N8184o9784m3095l9111J11924M1632J89626R4M9738j03211
$$ y = [-48646, 41606, 16422, 187556, 57325, -192856, -102077, 68675, -11242, -63484, -165295, -94115, -13785, -3886, 17509, 115275, 152726, 3165, -37523, -109565, -154212, 8510, -25981, 125779, 91367, 195680, 288533, 352079, 275562, 305779, 301344, 148972, 217153, 223202, 312977, 407918, 363833, 130152, 83584, 114415, 53267, -16353, -33631, 21811, -8629, -42298, -136598, -65736, 56082, 181261, 308513, 268321, 230878, 145049, 175592, 207641, 119522, 39853, -61381, -70232, -50444, -99123, 61759, 114208, 120097, 171377, 139611, 172036, 34555, 52885, -41170, -4015, -4227, 149763, 186871, 81753, 93438, 168109, 37664, 42608, 100792, 31008, -12087, -51198, 60726, 102358, 291984, 292078, 341816, 238605]
13214B38605N8076R8704j216q2855Q4170J48426J56903Q5675J32068J51599R0468
13203A160623J62770J07241q8386J001L1040k20079l25522j26697J4274n1636
13193F64629J44562P5184l3522o9063j96831P7825m3001p9662J62282K33445J52228
13182A088076J54182M3040k9829P6377J29244l4778J04212J81024r1313M8037
13172A668272J1277L2839O9160p5829j95373r0732J41784p3582j01726j39033
13162A247057k24333o4079L9154j10240l5717N8929j23565j08348M9604M4549
13152G73011j38455k7233J04871K7190J3015J20395J69386K42070K11955J69663
13142A665868Q9816j5849j5798j5436n0712q1247k49109k45674o1367j11465j54152
$$ y = [238605, 296681, 395385, 394169, 311314, 395484, 543910, 700813, 786488, 918556, 1070155, 1160623, 1323393, 1430634, 1342248, 1343249, 1374289, 1154210, 828688, 701991, 716265, 664629, 809191, 884375, 850853, 781790, 584959, 662784, 619783, 540121, 702403, 935848, 1088076, 1242258, 1285298, 1255469, 1331846, 1461090, 1426312, 1530524, 1711548, 1620235, 1668272, 1679549, 1712388, 1781548, 1705719, 1510346, 1419614, 1561398, 1487816, 1386090, 1247057, 1022724, 958645, 997799, 887559, 851842, 910771, 787206, 678858, 728462, 773011, 634556, 607323, 712194, 739384, 752399, 872794, 1042180, 1284250, 1496205, 1665868, 1755684, 1739835, 1724037, 1708601, 1657889, 1576642, 1327533, 1081859, 1020492, 909027, 754875]
13131G54875n5098j45479q5596k6048r9317j74242o4931Q3966M0406K5965q2785
13120A71716j9111j780J5034l1840R094M9432j09642r8551J50260J27537j08534
13109A53615j2631K9615n1242r7501J300L8989p4790n6891N2215J98225l013k0731
13097A57160k17319L8121J66264R4312j60020r5587J6814Q8820J5543l849l582
13086I6677p5332k0608M3129N0945N2528l2565o3376o1476n8036m5564M476j7902
13074a27104Q8839j2303M1987r5586J02086M8948R448J43756J14572j05047j61226
13063D8370m9876J49051j8496L7841o1451Q4234J26157q0559m1753j11270j79827
13052i7579M0877K19046m1493j58333O7203j08987K4711L5186L4509J50941R0540
$$ y = [754875, 699777, 554298, 468702, 442654, 343337, 169095, 104164, 188130, 228536, 254501, 171716, 152605, 150825, 165859, 134019, 143113, 192545, 82903, -15648, 134612, 262149, 153615, 140984, 170599, 119357, 21856, 23156, 62145, -12645, -69536, -17321, 180904, 177891, 157160, -60159, -22038, 144226, 238538, 78518, -17069, -255, 88565, 104108, 100259, 96677, 21345, 737, 43866, 94811, 147339, 114774, 51398, -10078, -68114, -113678, -109202, -127104, -38265, -50568, -8581, -104167, -2081, 46867, 56315, 200071, 314643, 209596, 48370, -1506, 147545, 129049, 166890, 105439, 189673, 315830, 235271, 193518, 82248, -97579, -56702, 162344, 120851, -37482, 29721, -79266, -54555, -19369, 15140, 166081, 256621]
13041B56621M2396o4511k05569q0213j09549R411J00282P387m7044j3738R7293
13030g234N4379J3048j3744O6988Q462l0945k8599O1186J5951O2981l8974j56104
13018G395j64320m3331R5472J44295Q5522M5725n764j25844k5618J22634J71808
13007C07974o4337r5302N8653N1383J02883N7449N2561j33758j29425m2063m2857
12996A23161K4190Q178k5263J2188J53454N450o406R0416l8735m8065j28133K13711
12984C84146J21071J9248o0793p0634j10748K0635O4274n3609P848m631K8486
12973C45293j9203j6158L3712j62258n6372j07853P1723K16704k2969j21762j52940
12962G917J25568L0800k5385j5857P2127r305o9491j51864Q20J68213J12562o5229
$$ y = [256621, 299017, 234506, 28937, -51276, -160825, -151414, -51132, -43745, -90789, -104527, -7234, 47145, 60193, 46449, 113437, 121899, 90954, 62355, 123541, 139492, 202473, 163499, 7395, -156925, -200256, -104784, 39511, 125033, 170758, 164994, 39150, 13532, 136166, 307974, 243637, 148335, 206988, 258371, 361254, 418703, 471264, 337506, 208081, 166018, 123161, 147351, 155529, 130266, 142454, 295908, 301358, 294952, 385368, 346633, 298568, 170435, 384146, 505217, 524465, 463672, 393038, 282290, 302925, 367199, 313590, 321438, 316807, 345293, 326090, 309932, 343644, 181386, 125014, 17161, 88884, 305588, 282619, 160857, 7917, 133485, 164285, 138900, 123043, 195170, 185865, 116374, -35490, -34670, 133543, 246105, 180876]
12950A80876M0432J2330k2617J44812J00201K088N6973n0524k0881M6291k2659
12939D67322k9761k7238r4810L1827l4591j14981L4869K8353M5484l4450j28309
12928A43715j00763J6878J34368J12981J44219J5348m8882m8725J21022J47645
12918F37806j04182q3505j19205O2653J1095j32866n4081M8074O6398l047r5691
12907B33449o744n4266K1371K06973J2616j07854j35819j13817l9809J29902O0567
12896B06569o3839j10083Q8351J65860K088q7189O2647o1186l3654O5273R4625
12885C29462J9073O9210P5281J75761P5182J4314k9019J32711J75697J49113O4722
12874A251507L8358j47129j4753N9778n4357q9150j63255K5868Q6482J05238p4969
$$ y = [180876, 221308, 233638, 211021, 355833, 456034, 458122, 515095, 464571, 443690, 489981, 467322, 437561, 410323, 315513, 347340, 312749, 197768, 232637, 260990, 306474, 272024, 143715, 42952, 59830, 194198, 307179, 451398, 466746, 417864, 369139, 490161, 637806, 533624, 450119, 330914, 393567, 404662, 271796, 217715, 265789, 332187, 329140, 233449, 226705, 172439, 193810, 400783, 413399, 305545, 169726, 55909, 16100, 146002, 206569, 142730, 32647, 120998, 286858, 288946, 201757, 264404, 203218, 169564, 234837, 329462, 348535, 417745, 493026, 668787, 743969, 758283, 729264, 861975, 1037672, 1186785, 1251507, 1289865, 1142736, 1127983, 1187761, 1133404, 1044254, 880999, 906867, 993349, 1098587, 1023618]
12863A023618r2785j23272n8604M8435J73245R9020M5897K6442K4394k4311M7512
12852A189591N7744j04743O6115J69603J3295j04317J4542m0639O691J59834p5064
12841A352652k7423m9842N9069N2883m7120j19792O4435Q0288K289j3957J30831
12830A484313K1022k5108j215L0896J12478Q7735n0448O0953J5224j02050K3268
12819A657068J08366M2300M0137N9236J54480j97J45412j7290q1492J20079N0386
12808B278485o1768q4959N3309K9357Q3147M9447q5212Q0081J40462J0556J28265
12797B621170J30677Q0794Q1016J89554J07272n6765l6829K71886K84225K17074
12787C890074O1697L0944P6392K40272L34579K61579K71759L85917L77109M84841
$$ y = [1023618, 930833, 807561, 748957, 797392, 970637, 1069657, 1115554, 1141996, 1166390, 1142079, 1189591, 1247335, 1142592, 1208707, 1378310, 1391605, 1287288, 1301830, 1261191, 1267882, 1427716, 1352652, 1325229, 1275387, 1334456, 1387339, 1340219, 1220427, 1284862, 1365150, 1367439, 1353482, 1484313, 1505335, 1480227, 1479012, 1509908, 1622386, 1710121, 1659673, 1720626, 1735850, 1633800, 1657068, 1765434, 1807734, 1847871, 1907107, 2061587, 2061390, 2206802, 2189512, 2108020, 2228099, 2278485, 2216717, 2131758, 2185067, 2214424, 2297571, 2347018, 2261806, 2341887, 2482349, 2492905, 2621170, 2751847, 2832641, 2913657, 3103211, 3210483, 3153718, 3116889, 3388775, 3673000, 3890074, 3951771, 3982715, 4059107, 4299379, 4633958, 4895537, 5167296, 5553213, 5930322, 6415163]
12777F415163M83168N59328P61750Q27343P63358J029607J215219J471806J512568
12768A5039310J608029J962529K357299K883797L504612M241754N575470P610951
12760D4783751J0219797J3809820J8903755K5019700L1457277L5842623L5078096
12753B15114819K8335707J8529077R022639J955583l834058j0596296j9832721
12746B38694750k7946873l0377863k6941481k0722796j3998582p957731l196222
12739A07553202N98333L836093O684966Q672054J0312774J1771723J2836281J3867105
12731A76132531J4389625J4302013J4246676J5189006J7560311K0929757K3984417
12724B96734336K4605782K1369186J5025622P394604O78117l877425p195077j1247094
$$ y = [6415163, 6898331, 7457659, 8219409, 9046752, 9810110, 10839717, 12054936, 13526742, 15039310, 16647339, 18609868, 20967167, 23850964, 27355576, 31597330, 37172800, 44783751, 55003548, 68813368, 87717123, 112736823, 144194100, 180036723, 215114819, 243450526, 261979603, 271002242, 272957825, 269123767, 258527471, 238694750, 210747877, 180370014, 153428533, 132705737, 118707155, 110749424, 107553202, 108151535, 111987628, 118672594, 127344648, 137657422, 149429145, 162265426, 176132531, 190522156, 204824169, 219070845, 234259851, 251820162, 272749919, 296734336, 321340118, 342709304, 357734926, 365129530, 365807647, 361930222, 354735145, 343488051]
12716C43488051j6704134k1312079k1653655j8297129j3668263r895366p752452
12709B34204973o735030o730041p717325r285972j0798428j1622875j1419818
12702A69895484j0085997q419643o647030m393777n21359M572907J0689716J8055324
12694A73145625K6045772L3046362L6385328L3967304K5017408J3258262K485902
12687C43351963n862368j2857276k0898583l0624198l8575589m0238574l5308434
12680A58986941k7685911k0600944j5201663j1255326q457758o822854n580307
12673F3382178m759757m196957l613350l140253k919012k654913k345547k189758
12665C7562631k005718j780061j638601j562779j566140j432321j129750j101557
$$ y = [343488051, 326783917, 305471838, 283818183, 265521054, 251852791, 241957425, 234204973, 227469943, 220739902, 213022577, 203736605, 192938177, 181315302, 169895484, 159809487, 151389844, 144742814, 140349037, 139827678, 144400585, 155090301, 173145625, 199191397, 232237759, 268623087, 302590391, 327607799, 340866061, 343351963, 337489595, 324632319, 303733736, 273109538, 234533949, 194295375, 158986941, 131301030, 110700086, 95498423, 84243097, 75785339, 68962485, 63382178, 58622421, 54425464, 50812114, 47671861, 44752849, 42097936, 39752389, 37562631, 35556913, 33776852, 32138251, 30575472, 29009332, 27577011, 26447261, 25345704]
12657B5345704j090658r64224r14253r74781q32370r99728o85209o38852p63869
12648A7481760o36043n12362m28427m97051p18736n85470n92924n07471l29524
12639A2673752k56336n46768n79257k40740l41051m61606m84233l93544l35315
12630I034902k86156k44175m40629l32271k18426l31111k64041k21434k47797
12621F448862k29903k89844j71692j55902j14345j36374j31352n4545j11578p8656
12611D974671j90008k25170k61350j78376j73980j41922p4324n7611j68298j02216
12601C401416O9814l9940j01185j02104j78124j69685j1996j42302j39747j74545
12591B411602J7401k0018j32896j10105O7891o2292r3552j5273n6401O2715M9005
$$ y = [25345704, 24255046, 23290822, 22376569, 21401788, 20569418, 19569690, 18884481, 18245629, 17481760, 16845717, 16333355, 15904928, 15407877, 14689141, 14103671, 13510747, 13003276, 12673752, 12417416, 11870648, 11291391, 11050651, 10709600, 10247994, 9763761, 9370217, 9034902, 8748746, 8504571, 8063942, 7731671, 7513245, 7182134, 6918093, 6696659, 6448862, 6218959, 5929115, 5757423, 5601521, 5487176, 5350802, 5219450, 5164905, 5053327, 4974671, 4784663, 4559493, 4298143, 4119767, 3945787, 3803865, 3729541, 3671930, 3503632, 3401416, 3471230, 3431290, 3330105, 3228001, 3049877, 2880192, 2868196, 2725894, 2586147, 2411602, 2429003, 2408985, 2276089, 2165984, 2233875, 2171583, 2078031, 2062758, 2006357, 2069072, 2118077]
12580B118077p6302n5594J5056P7171L3053J00662o406K9475K22170J60703R7897
12569B715962O1579N7871m8819L2446j2476r4654k9231m4800j66509k49748j86714
12558B034907j89290N7994M5895p5113O1213J21702o3799q1556m258M5515N841
12547A959051O618q5674j29998j30682j5774p0142l9328Q2296J03714k6237k06281
12536A447563j36001l4424j618Q9938k6205K2179K03686k2220k13398p7366J46598
12525A398732J33567p3234k73674L1500J45959n3094j01012p8022J5319J41856
12515A287897n9656l6833k2772o9997O7337J05399j32162p9734r0130Q3122J52529
12504A205000L2555j08406m5437J4130M0129m4602O7852J55282q9836p3699p1961
$$ y = [2118077, 2041775, 1986181, 2001237, 2078408, 2111461, 2212123, 2205717, 2235192, 2457362, 2618065, 2715962, 2777541, 2835412, 2786593, 2819039, 2806563, 2711909, 2682678, 2637878, 2471369, 2221621, 2034907, 1845617, 1903611, 1949506, 1874393, 1935606, 2057308, 1993509, 1911953, 1907695, 1953210, 1959051, 1965669, 1879995, 1749997, 1619315, 1603541, 1533399, 1494071, 1576367, 1680081, 1653844, 1447563, 1311562, 1277138, 1275520, 1365458, 1339253, 1361432, 1565118, 1542898, 1329500, 1252134, 1398732, 1532299, 1459065, 1185391, 1216891, 1362850, 1309756, 1208744, 1130722, 1146041, 1287897, 1228241, 1191408, 1168636, 1098639, 1165976, 1271375, 1139213, 1059479, 969349, 1052471, 1205000, 1237555, 1129149, 1083712, 1097842, 1137971, 1093369, 1161221, 1316503, 1226667, 1152968, 1081007]
12493A081007O4447o1240j37973m6346L3522m7539O1199r6113k4747J69066O9899
12482A065182j63034o6492k7651L8740J02439M1007o983p9306j02873K460q6489
12471G17000j36571N2646J07106K9460l4634r5484j19339K2359Q4892K04174j7457
12460H14152p2736O9571q6508j7872L654j52422J2173J68798R2811p8234j82224
12449E71163o4456O2353j6089j23248l7682J38137j1003L2420l8165j46473n2918
12438C14039K4800J4546K05219o2120m9066p3692p7092k0236N0553O2210L4969
12427D24130j05187l2715P221L1316m34P1536J4371k7912j23756L6314M7713L1839
12415C74436L2482N5563J15656L2200q8456r1663J4578R0275R1766j5188q1574
$$ y = [1081007, 1145454, 1084214, 946241, 899895, 933417, 885878, 947077, 850964, 826217, 995283, 1065182, 902148, 835656, 808005, 846745, 949184, 990191, 983208, 903902, 801029, 803489, 717000, 580429, 633075, 740181, 769641, 735007, 639523, 520184, 542543, 627435, 831609, 814152, 741416, 810987, 724479, 706607, 710261, 557839, 570012, 738810, 831621, 753387, 571163, 506707, 569060, 552971, 429723, 392041, 530178, 519175, 551595, 513430, 366957, 314039, 338839, 353385, 558604, 496484, 447418, 373726, 296634, 276398, 326951, 389161, 424130, 318943, 286228, 293449, 324765, 324331, 395867, 410238, 382326, 258570, 294884, 342597, 374436, 406918, 462481, 578137, 610337, 521881, 430218, 444796, 535071, 626837, 611649, 530075]
12404E30075o8900q9558n5270Q8697P96l3683J0587o844O3953j83413L542Q7729
12392C47711N8671j3508K7830m9589M9824N5522m1033K7657P3310P8837L06806
12381I22038R2102Q930J6143R7568J00159J06447J78059J90694K17988L02376
12371B232504J74304l2490n3143j91041j86701k31576j99165k07116j42218j10067
12361A053291j582O585q5753Q8954J91086l2503L7470L8526P6388N7046l1447
12350A398061n6789K1312P5125K00622R2531q4071k3016l9410J61332K51042Q0501
12339B077240O5650J35612j04678j20510p1956q6402j46791j25201m6401n2125
12329A524438k1428l0674k4858j62280j88060q7933o6081J97703m5530O6378J1637
$$ y = [530075, 461175, 371617, 316347, 405044, 405840, 372157, 382744, 375900, 439853, 256440, 259982, 347711, 406382, 392874, 420704, 371115, 420939, 476461, 435428, 463085, 536395, 615232, 922038, 1014140, 1023070, 1039213, 1136781, 1236940, 1343387, 1521446, 1712140, 1930128, 2232504, 2406808, 2374318, 2321175, 2130134, 1943433, 1711857, 1512692, 1305576, 1163358, 1053291, 1051709, 1058294, 972541, 1061495, 1252581, 1220078, 1257548, 1296074, 1372462, 1429508, 1398061, 1341272, 1362584, 1437709, 1638331, 1730862, 1646791, 1623775, 1584365, 1745697, 1996739, 2077240, 2142890, 2278502, 2173824, 2053314, 1981358, 1894956, 1748165, 1622964, 1576563, 1524438, 1503010, 1472336, 1447478, 1285198, 1097138, 1009205, 943124, 1140827, 1095297, 1161675, 1173312]
12318A173312j0972o9358L2088N2242O1664L9581p749J91330J4677R0154J04300
12307A671269Q833p8557l2354o1821j34221M8762M3022P0812M8300o953k6301
12296A550791J21848J77939Q1548r4519k7383n5414p4423j84001j50252j53538
12286A192596l8999j57815j62576R9468L6348m8953K3556J32248K6473R7984o6039
12275A134291o2700K47515J49943J10343P696p543K20842K04004J67181J00015
12265B271587l7533K2976n1301j27911m9233j42959n6674r1360J0646q316r9557
12254A640365j2238j88723j30389J03251Q4119j1651K7187J8343n6365n8452q4292
12243A331155m9894K15K2262k7538O481J18002J17011J74282R5259J30376N8904
$$ y = [1173312, 1162340, 1092982, 1125070, 1177312, 1238976, 1278557, 1270808, 1462138, 1476815, 1566969, 1671269, 1680102, 1601545, 1569191, 1507370, 1373149, 1421911, 1464933, 1535745, 1584045, 1577092, 1550791, 1672639, 1850578, 1932126, 1837607, 1810224, 1754810, 1680387, 1496386, 1346134, 1192596, 1153597, 995782, 833206, 932674, 969022, 920069, 943625, 1075873, 1102346, 1200330, 1134291, 1071591, 1319106, 1469049, 1579392, 1587088, 1579545, 1800387, 2004391, 2171572, 2271587, 2234054, 2257030, 2205729, 2077818, 2028585, 1885626, 1828952, 1737592, 1748238, 1739922, 1640365, 1628127, 1439404, 1309015, 1412266, 1496385, 1484734, 1511921, 1530264, 1473899, 1415447, 1331155, 1281261, 1281476, 1303738, 1276200, 1282681, 1400683, 1517694, 1691976, 1787235, 1917611, 1976515]
12232A976515J47340O6284K1716j04054k68548j84199p193q1965j12798k83068
12222A170030k03657q1927q522k2979L8733p86j78218J1745O4623L2090j23948
12211F97184l5452o7647k1709j17750J8200r232j40030j07891J13932J82387J01040
12200F13032K4577Q566m2731M4638j9277k9316l1368k3149K9058l3155q8806o9882
12188C82187p7594j48002m8667L5002q8969J161J35053J80501J37327k8636j4388
12177D64975m2025r9158K4629k4224j01333l0012P1784j07009L5848O9099Q0869
12166C43443o6668L2591K08656N6580o3394o7167n2069L3205j31856L6980P2520
12155D02821L8039j5131J731M5660r124m3853r6234J7673P4675P2173L1872j75685
$$ y = [1976515, 2123855, 2190139, 2211855, 2107801, 1839253, 1655054, 1647861, 1565896, 1453098, 1170030, 966373, 884446, 875924, 852945, 891678, 890892, 712674, 724419, 789042, 821132, 697184, 661732, 594085, 572376, 454626, 472826, 463594, 323564, 215673, 329605, 511992, 613032, 637609, 646175, 603444, 648082, 628805, 599489, 568121, 544972, 574030, 540875, 452069, 382187, 304593, 156591, 107924, 142926, 53957, 55118, 190171, 370672, 507999, 479363, 464975, 422950, 323792, 348421, 324197, 222864, 192852, 264636, 157627, 193475, 262574, 343443, 276775, 309366, 518022, 574602, 511208, 444041, 391972, 425177, 293321, 330301, 402821, 440860, 425729, 427460, 473120, 463996, 420143, 323909, 341582, 416257, 488430, 520302, 344617]
12143C44617J567J5527n1544r4578J5228K3302O2078J64162J00655O0944M9946
12132F91904j37069j30238o7611o2648J10859O8462M7651K1980m9382j2613j8183
12121D63112P0201j7800m6350l1608n6820j90070p7487o1215Q8426K32667j2233
12110C60823J0709J5483l0464J15023j89167j59306J59798m5870L2763K18454
12100D88246L9740p1999k42761k251L8345R8822J17321j17498k8041R6689J49258
12089E65871L2614n4458J08173P5762m5961k0556k1445P4502P0066j4844Q7746
12078H57470R8069J72069N7465P2806J22241o9532l2536J28274N9446K81468K19051
12067A966291J23287Q4202l8152l9372N8460l1973k18785j59825k72375j16811
$$ y = [344617, 346184, 361711, 310167, 215589, 230817, 254119, 316197, 480359, 581014, 641958, 691904, 554835, 424597, 356986, 294338, 405197, 473659, 521310, 543290, 493908, 481295, 463112, 533313, 515513, 469163, 437555, 380735, 190665, 113178, 51963, 140389, 373056, 360823, 371532, 387015, 356551, 471574, 282407, 123101, 282899, 237029, 269792, 488246, 527986, 455987, 213226, 210975, 249320, 348142, 465463, 347965, 319924, 416613, 565871, 598485, 544027, 652200, 727962, 682001, 661445, 640000, 714502, 784568, 769724, 857470, 955539, 1127608, 1185073, 1257879, 1380120, 1310588, 1278052, 1406326, 1465772, 1747240, 1966291, 2089578, 2173780, 2135628, 2096256, 2154716, 2122743, 1903958, 1744133, 1471758, 1354947]
12057A354947r412N8393M8612j68762j02055Q7549j2626O6509L5126K4296Q5482
12046A468059j116J61147N1755k6172o7918l6588K0393K659j44312J894L1209
12035A461010M043K6503j01690K2773N9548j8361k1027N2498K1101M3737p990
12024A542145j95344o221J99538J84288J72434k2578j00624M2318P4879j10646
12014A780189K579K30577J75941M1422O4679p937J49869o9717L538M5051o549
12003B409642p5314j34888l6635K4081R1490M5641R7297J02613O196N25K85508
11992B816156M3090Q4530Q2649K5309J00351r3133k5123J28637L52569J11300
11982C626335O5744K21053J84237N0052L71694L86086L74184L79889N09041K85365
$$ y = [1354947, 1345535, 1403928, 1452540, 1283778, 1181723, 1269272, 1256646, 1323155, 1358281, 1382577, 1468059, 1466943, 1628090, 1679845, 1653673, 1585755, 1549167, 1569560, 1572219, 1427907, 1429801, 1461010, 1465053, 1491556, 1389866, 1412639, 1472187, 1453826, 1432799, 1485297, 1506398, 1550135, 1542145, 1346801, 1340580, 1540118, 1724406, 1896840, 1874262, 1773638, 1815956, 1890835, 1780189, 1782768, 2013345, 2189286, 2230708, 2295387, 2287450, 2437319, 2367602, 2371140, 2416191, 2409642, 2334328, 2199440, 2162805, 2186886, 2278376, 2324017, 2421314, 2523927, 2530123, 2530648, 2816156, 2859246, 2943776, 3026425, 3051734, 3152085, 3058952, 3033829, 3162466, 3515035, 3626335, 3692079, 3913132, 4097369, 4147421, 4519115, 4905201, 5279385, 5659274, 6168315, 6453680]
11972F453680K14853M17206M83012N64526O73487Q62627J086459J191009J408495
11963A3355354J484553J677090J934965K573826K965844L484864M609160N630762
11955C7716418O941302R295024J2566606J6930747K2500391K9018742L5161845
11948A70131075L8930486L7770666L1201041K1665394J1447058K580650n199027
11941C08527343j3452393k2261623k9559833l2421200k9886525k3687794j6295134
11934A40962841r297922l300852J086925M097936O303318P697081R268612J0601709
11926A67419648J1348188J1167642R757722Q080048P089411P527692R679077J2662089
11918B44731517J6113716J9337478K1088186K0719015J8032330J3373921Q192156
$$ y = [6453680, 6668533, 7085739, 7568751, 8133277, 8806764, 9669391, 10755850, 11946859, 13355354, 14839907, 16516997, 18451962, 21025788, 23991632, 27476496, 32085656, 37716418, 44657720, 53952744, 66519350, 83450097, 105950488, 134969230, 170131075, 209061561, 246832227, 278033268, 299698662, 311145720, 313726370, 308527343, 295074950, 272813327, 243253494, 210832294, 180945769, 157257975, 140962841, 131664919, 128364067, 129450992, 133548928, 139852246, 147549327, 156817939, 167419648, 178767836, 189935478, 199693200, 207773248, 214862659, 222390351, 232069428, 244731517, 260845233, 280182711, 301270897, 321989912, 340022242, 353396163, 361588319]
11911C61588319L510482r99485o069801j1845561j7481151k1160224k1760582
11904B85781997j9534419j6520212j4223240j3367563j3661863j3952732j4096991
11897A80424977j3243736j1600267r849804q389692o349090l871139n70721L513540
11889A30064068Q667982J4351878K0326552K5859878K8666020K7457219K1635073
11882B77028670J2661316L642601l862391r872004j6441657k3834866l0235726
11875B09085943l2449601k9869368k4596894j8843988j3997400j0523819q227512
11868G0577361o577505n301189m529621l967218l547551l142241k761135k369793
11860C8381108k105746k045753j714009j563813j386296j396285j363476j243262
$$ y = [361588319, 365098801, 364099316, 358029515, 346183954, 328702803, 307542579, 285781997, 266247578, 249727366, 235504126, 222136563, 208474700, 194521968, 180424977, 167181241, 155580974, 145731170, 137341478, 130992388, 127121249, 126550528, 130064068, 138732050, 153083928, 173410480, 199270358, 227936378, 255393597, 277028670, 289689986, 293332587, 289470196, 279598192, 263156535, 239321669, 209085943, 176636342, 146766974, 122170080, 103326092, 89328692, 78804873, 70577361, 63999856, 58698667, 54169046, 50201828, 46654277, 43512036, 40750901, 38381108, 36275362, 34229609, 32515600, 30951787, 29565491, 28169206, 26805730, 25562468]
11852B5562468j123225j091126r55488r11494r63918p86586p56027p55325o53552
11843A7565727o67680o22192n39474m19285n14521o34279n21735m67514m13858
11834A2765189m31442n82754m76819l94825k05132l71331m08173l46451m34986
11825I113276k22172l03163l10252k48189k85034k98643l33322l61790k73900
11816F476811j48939k76193k82766k07071n4614k703n5016j72610k80951j74926
11806D821022j47031l4285p1851n8049L7513j31396k81021k51097k14838j53040
11796C515927K8059k1460j40589k76062M1995n6164k69359j55827N449j09024
11786B562945J5056K0946K1681m2680j9216j70445j05456p6437j16294p2825l8901
$$ y = [25562468, 24439243, 23348117, 22392629, 21481135, 20517217, 19730631, 18974604, 18219279, 17565727, 16898047, 16275855, 15736381, 15317096, 14802575, 14168296, 13646561, 13179047, 12765189, 12333747, 11750993, 11274174, 10879349, 10674217, 10302886, 9894713, 9548262, 9113276, 8891104, 8587941, 8277689, 8029500, 7744466, 7445823, 7112501, 6750711, 6476811, 6327872, 6051679, 5768913, 5561842, 5507228, 5504525, 5449509, 5276899, 4995948, 4821022, 4673991, 4639706, 4567855, 4509806, 4547319, 4415923, 4134902, 3883805, 3668967, 3515927, 3543986, 3522526, 3381937, 3105875, 3147870, 3091706, 2822347, 2666520, 2671969, 2562945, 2578001, 2598947, 2620628, 2577948, 2558732, 2388287, 2282831, 2206394, 2090100, 2017275, 1978374]
11775A978374N551l0800J292o8064L9933Q5111M291P2447O1586r2660k2380N4457
11763B089138N2805O0240L297m7373N9566K1260o1292K45227K8544n9391j17957
11752B274064j33620j17507j94740j91520p3250j09574L0320J89511J62736N6494
11742A892914j44595J3652k3673k02680p4719j03420O4693R7145J52921j70662
11732A501576j25589n7479M3995K11057P3534J38465R4811k1666j48335j52475
11722A557894j729R7717m0259m819k2654k01332j47708l6223O6593J34978O5619
11711A468077J34909n4835j73484j07923k1503K37129q7640j84243J32428N7567
11701A400482n1026j3253l7133o5668j08412L634p4217Q415J2497K6031n4713
$$ y = [1978374, 1983925, 1953125, 1954417, 1886353, 1926286, 2011397, 2015688, 2088135, 2149721, 2057061, 2034681, 2089138, 2141943, 2202183, 2205480, 2158107, 2217673, 2238933, 2177641, 2422868, 2451412, 2392021, 2274064, 2140444, 2022937, 1828197, 1636677, 1563427, 1453853, 1484173, 1673684, 1836420, 1892914, 1748319, 1761971, 1738298, 1535618, 1460899, 1357479, 1422172, 1519317, 1672238, 1501576, 1375987, 1318508, 1362503, 1573560, 1647094, 1785559, 1880370, 1858704, 1710369, 1557894, 1556165, 1653882, 1613623, 1608804, 1586150, 1384818, 1237110, 1200887, 1267480, 1402458, 1468077, 1602986, 1548151, 1374667, 1266744, 1245241, 1482370, 1394730, 1210487, 1342915, 1400482, 1349456, 1336203, 1299070, 1233402, 1124990, 1128624, 1054407, 1062822, 1075319, 1101350, 1046637]
11690A046637p6763p5285k9360R1275j4249L4745k8898l0576R345n3844L2436
11679I05463M4449j10375L7760N9814K1245m7951m7555K5034q0185K7804P3676
11668I09179J8181L8134r0486J01103L98j12621j02549q8224L9285j08682m2418
11657E61300J01144l59R020J07175k9315l5362q0422k3112J24812p2755o0624
11646F01502k9486P906j3442R886K17114j36138l6461j70607K760L8596O4648
11635E56278R9640j41492l1606o8758L9446O9333K401j42111L3059N9847k9283
11624D46754l5575P1224p1657m8748L9975j6644o5046k4564P640N6583L0375Q078
11612C98395O9356L8896o2530K1855K4908N557n2902K6213L31o363J38246O0336
$$ y = [1046637, 969874, 894589, 865229, 956504, 942255, 977000, 948102, 917526, 926871, 873027, 905463, 949912, 839537, 877297, 937111, 958356, 910405, 862850, 887884, 807699, 835503, 909179, 927360, 965494, 875008, 976111, 976509, 863888, 761339, 673115, 712400, 603718, 561300, 662444, 662085, 671105, 778280, 748965, 713603, 633181, 610069, 734881, 662126, 601502, 572016, 579922, 566480, 576366, 793480, 657342, 620881, 450274, 453034, 491630, 556278, 655918, 514426, 482820, 414062, 453508, 522841, 525242, 383131, 416190, 476037, 446754, 411179, 482403, 410746, 361998, 401973, 385329, 320283, 295719, 303359, 359942, 390317, 398395, 467751, 506647, 444117, 465972, 490880, 496437, 443535, 469748, 470079, 463716, 601962, 662298]
11600F62298j8689M6327j01850p1085p6815k8912r0703J0833m0302J04710p0239
11589C25573m2428R0591L3081p2555J03536Q3509O7031o0013j413M5997l0185
11578E42724L0887q8958l1401K2791r9281M4186J47051p6087K3863O6540m1111
11567E41204k9217j3129m8013O1224j7077L8525j00189L95k2508J25753j22364
11556D14604k6168k4956M1169J9941N7568l7063j19291M542j8222j2182K2628
11545C22570q3524o1510O1385k6386j35044o5342N2387j8023J28975J72759J5632
11534C63879j26201n6189M0499j3716M8438k66J13400j3809j11997R3164N7753
11523C94955j63036r1358R523J33570L05512K20505K6275J05398L0300L03595
$$ y = [662298, 643609, 689936, 588086, 517001, 440186, 411274, 320571, 331404, 291102, 395812, 325573, 283145, 373736, 406817, 334262, 437798, 521307, 588338, 528325, 526912, 572909, 542724, 573611, 484653, 453252, 476043, 376762, 420948, 567999, 491912, 515775, 582315, 541204, 511987, 498858, 450845, 512069, 494992, 533517, 433328, 433723, 411215, 536968, 414604, 388436, 363480, 404649, 424590, 482158, 445095, 325804, 330346, 312124, 299942, 322570, 239046, 177536, 238921, 212535, 77491, 12149, 64536, 46513, 175488, 348247, 363879, 237678, 181489, 221988, 208272, 256710, 256444, 369844, 356035, 244038, 337202, 394955, 231919, 140561, 150084, 283654, 589166, 809671, 835946, 941344, 971644, 1275239]
11513A275239K86443J82081J69100J89741N3331j88771n3923p8243p6341j73408
11503A585249k24310j63645m5354L1856j9920J77843J33145j26102j79663Q0878
11493A249977J04356J91660K3795r9948j4775o6842K5113O5746J7619P8076R1551
11482A666328J2548J66919J87526P0280N9625R0248o287p9039n2160n9986L3555
11471B089557r8091k4425O9470j01523j46351j74134j49794R8551p3864j56293
11461A333103Q001r4966r2838N0439m745j05048p2888K869R9267K59435R0604
11450A473233K7571J45829J82760L6099j48616K9188P5320p8557r2047l31302
11440A319478k34738n7640p9175n7336k5992r3759j50118j72166j12056J11228
$$ y = [1275239, 1561682, 1743763, 1912863, 2102604, 2155935, 1967164, 1913241, 1834998, 1758657, 1585249, 1360939, 1197294, 1151940, 1183796, 1163876, 1341719, 1474864, 1348762, 1169099, 1249977, 1354333, 1545993, 1569788, 1469840, 1455065, 1388223, 1413336, 1479082, 1496701, 1574777, 1666328, 1678876, 1845795, 2033321, 2103601, 2163226, 2253474, 2247187, 2168148, 2115988, 2056002, 2089557, 1991466, 1967041, 2036511, 1934988, 1788637, 1614503, 1464709, 1563260, 1489396, 1333103, 1341104, 1246138, 1153300, 1203739, 1198994, 1093946, 1021058, 1023927, 1123194, 1382629, 1473233, 1500804, 1646633, 1829393, 1865492, 1716876, 1746064, 1821384, 1742827, 1650780, 1319478, 1084740, 1027100, 947925, 890589, 864597, 770838, 620720, 448554, 336498, 447726]
11430D47726M2796M3193j2672j27980J0321M1721m2915n2844P1899J07578j5259
11419E13564J053Q4608j38578j03433o4213j48735k5365Q0k8725o5016M660J65333
11407A95233j2659r3699k1759J4389j5462Q1617L9543K6639N4729j08327j72382
11396a2138N7818J02834q2213J05322J34015m4o3562j88605p6808k1375l6559
11385h1315N7125J08033P1824J04787L9169q1915J3160R1914n7394j40535K8975
11374A53828J42794q7829q6409K2163j7228J20926O3074j47331j31985N6975k989
11363H5989P4036J01479j7680o1659J9318q5388J6661J98627J0487n8331l4376
11352B49163O6963l2614P407O0742K648p2682m3462Q230l5181m7836O478J76189
$$ y = [447726, 490522, 533715, 521043, 393063, 403384, 445105, 402190, 349346, 421245, 528823, 513564, 514617, 599225, 460647, 357214, 293001, 144266, 118901, 118981, 90256, 25240, 29900, 195233, 182574, 88875, 67116, 81505, 66043, 147660, 187203, 213842, 268571, 160244, -12138, 45680, 148514, 66301, 171623, 305638, 305594, 242032, 53427, -23381, -44756, -81315, -24190, 83843, 155667, 260454, 299623, 217708, 230868, 322782, 265388, 124853, 153828, 296622, 208793, 122384, 144547, 127319, 248245, 311319, 163988, 32003, 88978, 85989, 160025, 261504, 243824, 182165, 201483, 116095, 132756, 331383, 341870, 283539, 249163, 316126, 283512, 290919, 351661, 354309, 281627, 238165, 246395, 211214, 163378, 169856, 346045]
11340C46045p1115r9213J19801n5999o4108l7979j12409J2006p2195j6638J22758
11329G0954R7786r003q3570j50304l8731l101O5523N8418O0066O372n2887l9681
11317a8158J75613O5701l5137m2684k0598j23566J11195J68229P2589n6072j13267
11306A83845j02385J18983j3316k06276n5658M5862o9878r1255O1495L6632J01690
11295I739J35109N5241n6458L9695N8272n41j16648k13050j31404P8094J76344
11284C4393L6992J513L360L5417o6669r041L9431m0009N9579J9089m9736j5602
11272D8717J8825l1013j20001j0355j469O5645q4043n9548J07455J13676J40264
11261A88153l7488p5481m9089j7783K6800P9232M1377P1965K2022l0272o2339
$$ y = [346045, 274930, 175717, 295518, 239519, 175411, 137432, 25023, 37029, -35166, -51804, 70954, 168740, 159737, 76167, -74137, -112868, -115969, -50446, 7972, 68038, 74410, 21523, -18158, 157455, 223156, 188019, 145335, 124737, 1171, 112366, 280595, 353184, 297112, 183845, 81460, 200443, 187127, -19149, -74807, -28945, -98823, -190078, -128583, -91951, 9739, 144848, 200089, 143631, 183326, 241598, 241057, 124409, -88641, -220045, -141951, 34393, 71385, 72898, 76258, 111675, 45006, 35965, 75396, 35387, 94966, 114055, 64319, 48717, 67542, 36529, -83472, -93827, -95296, -29651, -113694, -173242, -65787, 47889, 188153, 150665, 75184, 26095, 8312, 35112, 114344, 155721, 227686, 249708, 219436, 157097]
11250A57097J4211j63460L1066M5413j15612M1087J27190J04471R8177m9517j40071
11239A50052j06612n5305j8875J28847K4166J9471l0291j6638L1701O3694N0678
11228B40888J6233L6398K0595m7614j41113J6084Q1567j8267j57796q4049o562
11217d3636K0073J1452J42033O5763j38911J7110l8909o0690Q7438J46862j2417
11206A96168m1755o2648n8421j3148O2756j51309K7461M9637l4554o2644L5170
11195e3287K3538j232n8961j42630K4691L2716j3459K0290l460M9730O9141N2444
11183d79M8225L0284j52285M6362j2567Q0905j859k4876l3005k4403m6821p8512
11171a69031J35973j061P0684P7899j42752Q3756N0132j6184M487M2656M7383
$$ y = [157097, 171308, 7848, 38914, 84327, -31285, 9802, 136992, 241463, 339640, 290123, 150052, 43440, -11865, -30740, 98107, 122273, 141744, 111453, 94815, 126516, 190210, 240888, 257121, 293519, 314114, 266500, 125387, 141471, 223038, 204771, 46975, -37074, -43636, -23563, -12111, 129922, 195685, 56774, 73884, 34975, -25715, 61723, 208585, 196168, 154413, 91765, 33344, 20196, 82952, -68357, -40896, 8741, -25813, -88457, -53287, -29749, -30981, -89942, -232572, -207881, -175165, -188624, -168334, -171794, -122064, -52923, -479, 47746, 78030, -74255, -27893, -40460, 40445, 38586, 13710, -19295, -43698, -90519, -169031, -33058, -34119, 36565, 114464, -28288, 55468, 105600, 89416, 93903, 136559, 183942]
11160A83942j23267p4823m083k2540L9825J0971M8030p1045k6050k63p6084Q0425
11148c4962j4116R6360K2875n3429J62158R5470M8476k8271k5944o04m7266j3705
11136B07042j776q403L2756k16507N3552J22601l2926r6755K521N7298o2826L0509
11124H7086J08283J29330j00438Q5836m4089j53032j34833l0250P2240L0259q7543
11113c7151j04100k16K35406Q8205j66285J7604J61635R3362j38568j10196k9020
11102A0676n3876M11n832R8359O2737N4426m6608r0070J11002M2297j70493m1366
11090b8337j5766o5088l3372K8246J0041K8796J75094M0050N3879k8355L3681
11079A98869N7904N9578n9088p8608K8348N121n3375j301n5627K9587M0305l8389
$$ y = [183942, 60675, -14148, -18231, -40771, -946, 10025, 58055, -12990, -39040, -39303, -115387, -34962, -49078, 47282, 70157, 16728, 178886, 274356, 322832, 294561, 268617, 268013, 220747, 207042, 205266, 196863, 229619, 13112, 66664, 189265, 156339, 59584, 62105, 119403, 56577, 87086, 195369, 324699, 224261, 310097, 266008, 112976, -21857, -52107, 20133, 50392, -37151, -141251, -141467, 93939, 182144, 15859, 33463, 195098, 288460, 149892, 39696, 10676, -43200, -42789, -48621, 49738, 112475, 166901, 120293, 30223, 141225, 183522, 13029, -28337, -44103, -109191, -142563, -114317, -104276, -75480, 99614, 139664, 193543, 165188, 198869, 256773, 316351, 257263, 178655, 207003, 212124, 158749, 157448, 101821, 131408, 171713, 133324]
11067A33324n3040R872N9352j47916j2544l9884p3566J4364n8277l7240P9155
11056a26400J11256K7297N6161N6754m5728q4721l4460N7588j07194K8458j15043
11045a76032k153J14823N1011j23288n1462Q5480J74400N1730M2615k9445p7765
11034E9914k918P0519J7677j2616L0609j4018p7390K3090N3535N2581j30746K9082
11022I9319o0253M6893Q1950O9623Q7720j36949j52246o2828K5147k0325j0921
11011c2870n2003m8579J0867L9037M0756O3835j8441K5177P8567N8245P7551j0523
10999B31619n1915m8424o4409j03684P5873j4785j47790L9746J14757M8405J24618
10988B04011j74119k15805j7273N6638R0225m5364K5498l7914j19690J12277K00775
$$ y = [133324, 80284, 90156, 149508, 1592, -10952, -50836, -124402, -110038, -168315, -205555, -126400, -15144, 12153, 68314, 125068, 79340, -5381, -39841, 17747, -89447, -60989, -176032, -178185, -63362, -12351, -135639, -187101, -101621, 72779, 124509, 167124, 137679, 59914, 56996, 127515, 145192, 132576, 163185, 149167, 71777, 94867, 148402, 200983, 70237, 99319, 39066, 85959, 167909, 237532, 325252, 188303, 36057, -26771, -1624, -21949, -32870, -84873, -133452, -122585, -83548, -42792, 21043, 2602, 27779, 106346, 164591, 242142, 231619, 179704, 131280, 66871, -36813, 39060, 24275, -123515, -83769, 30988, 79393, 204011, 29892, -185913, -203186, -146548, -56323, -101687, -76189, -114103, -233793, -121516, 79259]
10977G9259l4529j14270j54884l5068J49444k8759K2340K48112J6611o2143j86
10966H5927o0031o7329L9213M4283Q76K8422P7065q402m7204p4521r9870K1732
10954e9839l4511j49253O0465J35042j8939P6858J02607j57991r1571J47652R1877
10943A02397q7517j41157J8854n4235L3511n6954J14190L0878J04617j5890k5115
10932B3579j8340p7089r359L8036l8545l0575R1050p3028j18594l6263Q2186P8686
10920h8256o0463m274r815O5361J56594L6013N5078o6609j60632k8086O6325j2978
10908e1742P3393K2122J4173P4510k1550n3327m1632O7879J1498p4873j66815
10897a46364o2138j48400M0282K66308K3979R6852j17473k35590j023P7972R4452
$$ y = [79259, 44730, -69540, -224424, -259492, -110048, -138807, -116467, 131645, 148256, 86113, 85927, 25896, -41433, -2220, 42063, 42939, 71361, 148426, 140024, 92820, 18299, -81571, -59839, -94350, -243603, -183138, -48096, -67035, 9823, 112430, -45561, -137132, 10520, 102397, 14880, -126277, -107423, -161658, -128147, -185101, -70911, -40033, 64584, 48694, 23579, 5239, -71850, -81209, -43173, -81718, -112293, -21243, -94271, -212865, -249128, -166942, -88256, -148719, -152993, -162808, -97447, 59147, 95160, 150238, 83629, -77003, -105089, -38764, -51742, 21651, 43773, 57946, 132456, 110906, 57579, 15947, 83826, 95324, 20451, -146364, -208502, -356902, -316620, -50312, -26333, 70519, -46954, -282544, -283567, -205595, -111143]
10886a11143k9190J2171R1472O4126P5387L6469p7004r27j6310o0711l3400n8289
10874a07349m0256n5284J9526K16325K8893j38762J9023O6915q4008P7668R3277
10863I5968m0234j25398j8054p9377p3898l7625L5793N7771j17331J30931L4787
10852a36667J9397Q907N248O7328R0791N486o8802j14391j24203L6961J11875
10841i8070k6469K418J35103J38948R9385q362j19595Q423j43386j02555N4977
10830e9183J64648k0595n9083N4448L0410p6458r8902K2907o7664O2086l3433
10819h0819m5743P693J35487Q6675L4502j01388L5011J26966Q523j89691M1572
10808E8788L7517k3634O1484O880J3197K1502m0020K8659J01669k6831j49300
$$ y = [-111143, -140333, -128162, -36690, 27436, 102823, 139292, 62288, 61361, 45051, -15660, -49060, -107349, -147605, -202889, -183363, 32962, 61855, -76907, -57884, 9031, -74977, 2691, 95968, 55734, -69664, -87718, -167095, -240993, -278618, -242825, -185054, -302385, -171454, -136667, -117270, -108363, -103115, -35787, 55004, 60490, -8312, -122703, -246906, -209945, -98070, -124539, -122121, 12982, 151930, 251315, 242953, 123358, 131781, -11605, -114160, -59183, 105465, 84870, 25787, 80235, 110645, 34187, -64715, -41808, -109472, -47386, -80819, -126562, -118869, 16618, 103293, 137795, 36407, 71418, 198384, 206907, 17216, 58788, 96305, 72671, 134155, 141035, 154232, 175734, 135714, 164373, 266042, 239211, 89911]
10797H9911k345j16446j09789O8731J12131J25156J29387M3488j11050q5653O150
10786A49671Q8839p0441k3032O8234n2770r383j4421L4875j0731j30154o7963
10775c7276L7981J6232j00555N1131N4857L7039M5849L8037j25697L3967P0995
10764A22560Q7998j24786N695K7088O8085N7038o4878J7435k3963n3729J8023
10753A36566j13732l9769J340r2501M0274J81089j9296r197p219J5190m7210N2469
10741I8004J22207k2300L3829r3078l8984j10154L5474J31364K6842l6100O942
10730A54046O0774J29331q1266o4539J3448j9226k608m7001j11376p4482l4739
10719g7638Q8816l1754r8549j4262K8070J08121J52300R0062j23301p5482l2889
$$ y = [89911, 87566, -28880, -138669, -69938, 42193, 167349, 296736, 340224, 229174, 143521, 149671, 238510, 168069, 145037, 213271, 160501, 151118, 136697, 171572, 160841, 30687, -37276, 705, 16937, -83618, -32487, 22370, 59409, 105258, 143295, 17598, 51565, 122560, 210558, 85772, 91467, 118555, 186640, 243678, 178800, 196235, 172272, 118543, 136566, 22834, -16935, -15595, -108096, -67822, 113267, 93971, 84774, 77555, 92745, 45535, 98004, 220211, 197911, 231740, 138662, 99678, -10476, 24998, 156362, 183204, 147104, 154046, 214820, 344151, 262885, 198346, 211794, 192568, 189960, 142959, 31583, -42899, -77638, 11178, -20576, -119125, -133387, -105317, 2804, 155104, 245166, 121865, 46383, 13494]
10708A3494L1219M1649n3706j8295O6936j6489q960N7658J1452L3957k7228k3096
10696A08591N025r1995N6842j2260M7332o4296l779n9742k9974J1052J827j5102
10684d6479O5030p6332n0973L7035M5389q5940L471P5311L9277M1897Q2101M4815
10672A74602j20809M4373K3268r214q445Q5832k527k628o0077K4469J5224j13006
10660E1062j30588J5414l1324j28261j8283J42161l3100J03613R9057j07347J13895
10649G6299J01931P2656j83205l3414K3333k6940J19612M6803o3076k6701n7788
10638D9510l7524l2632j2050K0905J71473J07152k2903q9320j75183q1049J18480
10627A6859k7666j8705P9673R3033m0873j96923o9407O0933J36954Q4936M7538
$$ y = [13494, 44713, 86362, 32656, 14361, 81297, 64808, 55848, 113506, 124958, 158915, 131687, 108591, 113616, 21621, 78463, 66203, 113535, 49239, 45460, -14282, -44256, -33204, -31377, -46479, 18551, -57781, -108754, -71719, -26330, -112270, -108799, -33488, 5789, 47686, 129787, 174602, 53793, 98166, 121434, 112220, 103775, 189607, 187080, 184452, 124375, 148844, 164068, 51062, -79526, -64112, -95436, -223697, -241980, -99819, -132919, -29306, 69751, -37596, 76299, 178230, 250886, 67681, 34267, 57600, 30660, 150272, 197075, 133999, 107298, 49510, 11986, -20646, -32696, -11791, 159682, 266834, 243931, 154611, -20572, -101621, 16859, -10807, -29512, 50161, 143194, 102321, -94602, -164009, -103076, 33878, 118814, 166352]
10616A66352O58j05310k2381P6523J15254Q5969o099j13838j22750l5813K3689
10605F2254Q3336J3254j46242p6132p9847Q9560J51919J04287r0959j65708j08363
10594a62641J7601J16051L0955j6802N0585O8810J26808J40046j3651j28816j27947
10583A00999R226J1333n0179r7203m3766M8308k9622P398J51768O2091l9325O8170
10571A99198j27033J52793K3432o300q6771m4325N61j3049k9328O3860K0478j10142
10559D3374l3188j0416k6418j6792J63547M7826o579M9895J8685m2245j26385
10548F1304M5509Q9267N8148n3971L0562o2365j15622O7246J23489O3488j91898
10537A15157j25125J40311n426O786q526R1148J928N1077N3138q1982j59372j33628
$$ y = [166352, 167010, 61700, 39319, 115842, 231096, 317065, 310966, 197128, 74378, 38565, 62254, 145590, 158844, 12602, -63530, -143377, -53817, 98102, 202389, 111430, -54278, -162641, -145040, -28989, 1966, -14836, 35749, 104559, 231367, 371413, 357762, 228946, 100999, 110225, 121558, 71379, -25824, -69590, -21282, -50904, -43506, 108262, 170353, 131028, 199198, 72165, 224958, 248390, 242090, 155319, 110994, 111555, 98506, 69178, 133038, 153516, 43374, 10186, -230, -26648, -43440, 120107, 167933, 161354, 211249, 229934, 187689, 61304, 106813, 196080, 254228, 200257, 230819, 168454, 52832, 120078, 243567, 307055, 115157, -9968, 130343, 124917, 131703, 123177, 214325, 216253, 267330, 320468, 238486, 79114, -54514]
10525e4514j4607R4339J62005k7672j04702j18491J8015K583K5549q92o9255j12503
10513b00145J71200R8120N4991m4441j16175k5454J84396J13930o9834j3075J1498
10502A65011J1676j8813j4978o9717l2622R469j0537q6306j8891o761Q6576J32641
10490A46748K6525j77222j17148o7103J5300J4991R1458K62433L2390j92131K3904
10479F0145J31517J40140J6564j51529l9639m4632Q2774j39546k20865n9508R8352
10468a26227L5460K3298R0761M1648l6651J29139K9026k37317j13531k9544m2165
10457b36103Q9849R7046J12960K1734q1419k8371Q308j2440R3327J06925l6374
10446A35442K6567n834l2403k5004O434k8955J694k9296o5701j33687Q1813R8731
$$ y = [-54514, -69121, 25218, 187223, 159551, 54849, -63642, -45627, -43044, -17495, -18387, -87642, -200145, -28945, 69175, 124166, 79725, -36450, -61904, 122492, 236422, 166588, 153513, 165011, 176687, 157874, 142896, 73179, 40557, 50026, 39489, -46817, -65708, -72469, 14107, 146748, 173273, -3949, -121097, -188200, -172900, -157909, -66451, 195982, 228372, 36241, 60145, 191662, 331802, 348366, 196837, 157198, 112566, 195340, 55794, -165071, -224579, -126227, -90767, -67469, 23292, 64940, 28289, 157428, 186454, -50863, -164394, -193938, -236103, -146254, -49208, 63752, 85486, 4067, -24304, -15996, -28436, 64891, 171816, 135442, 162009, 156175, 123772, 98768, 105202, 76247, 77941, 48645, -17056, -150743, -68930, 29801]
10434B9801J1966l9236r7617q4540N9838K5398N7492K4745p6548O0929J08252
10423H0480J41070K124j7217j13685j04682p5145O7237r1543q1901o059J0808
10412a88513j0177M4060P8492J29437Q0969K3768q827q44M2153l2871N9270n5279
10400A61638j82219j74505p3635K9940O2926P0094J02098k0630j646J13523J2951
10389A00535L4661m3076m4280J1505k2309q2778j78362j0007L4097O0339J73295
10378C3620M7682j215J11270K4350N0193j09817l5385J7071r3528l2283Q8058
10367A00016q9588n2133o9923j6686J5292Q0024K5910N262K6383l5582L3418J7615
10355D0008j60684J4864J58642J56601o3560n9881k7391m0196j64452L798O2768
$$ y = [29801, 41767, 2531, -95086, -179626, -119788, -94390, -36898, -12153, -88701, -27772, 80480, 221550, 223674, 206457, 92772, -11910, -87055, -19818, -111361, -193262, -199321, -188513, -198690, -154630, -76138, 53299, 134268, 158036, 149209, 148365, 190518, 157647, 216917, 161638, -20581, -195086, -268721, -238781, -175855, -105761, -3663, -24293, -25939, 87584, 100535, 135196, 92120, 47840, 59345, 37036, -45742, -224104, -234111, -200014, -139675, 33620, 81302, 80087, 191357, 215707, 265900, 156083, 120698, 137769, 44241, 11958, 100016, 10428, -41705, -111628, -128314, -113022, -32998, -7088, -1826, 24557, -11025, 22393, 40008, -120676, -105812, 52830, 209431, 145871, 85990, 58599, 18403, -146049, -142251, -79483]
10344g9483M2455K3567K3074L0746J2492l3726L4184j5469L4509l351n8699q8278
10332g7979Q5071J19918m8534n2791K8296o7563j23528M2341Q1695L098l5701
10321d5677k0740K7362p6471p9812r078j10659J12351J46715R9911j60758R440
10310a07416O6769Q2807R9450p5090r6092j45781Q9587l4424J47011J29023M3214
10299A99058K3920q270j43183N491J4303r0548j61117n2430J8918M8291O292k7379
10287a66654J28466M0673J36903L7243p9347k5394j13265n7637n6435j1945J29837
10276c7555J09890k3060kJ12905M1659r3395m6622J6075O2002j851k778K6256
10264A63524Q7659n5538l5648j20940q1714o0902J3995p649J15540R8409P6391
$$ y = [-79483, -37028, -13461, 9613, 40359, 52851, 19125, 53309, 37840, 72349, 68998, 10299, -77979, 7092, 127010, 78476, 25685, 53981, -13582, -137110, -94769, -13074, -9976, -45677, -66417, -39055, -115526, -195338, -204416, -315075, -202724, -56009, 43902, -116856, -107416, -40647, 42160, 141610, 66520, -29572, -175353, -85766, -120190, 26821, 155844, 199058, 222978, 214708, 71525, 77016, 91319, 771, -160346, -212776, -193858, -145567, -139275, -166654, -38188, 2485, 139388, 176631, 97284, 71890, -41375, -99012, -155447, -167392, -37555, 72335, 49275, 49273, 162178, 203837, 110442, 63820, 79895, 141897, 140046, 137268, 163524, 251183, 195645, 159997, 39057, -42657, -103559, -89564, -97213, 18327, 116736, 193127]
10253A93127o1129k0392r4932k1334P2963j304N3466N0094n5586k7847l8151K2717
10241G1692o4450j13502j9614N6865L7807m2752K8874M745L5858K3548P8281p0932
10229B6420j04719N7939J4340Q53l898j2183j5108j09054N008R1062j52485O133
10217a95692J48157O882k3067j848k3230J0086J48631N5862L8437J4024J3p7433
10205A00822j61707J2396L6194m9559J0758L5871J8224J705Q4250L2912j68165
10194d6299o3008P3576K7423j450K08325P1021p6407j8599J09179o6593O9037
10183B86205O776o3202p8383j23917j01548L4622L5999J5816o231m9445K7782
10172a5526M8236l8004Q5930Q4161j2521M6870O4510j16296q3979R328L0251k5326
$$ y = [193127, 131998, 111606, 16674, -4660, 68303, 66999, 120465, 170559, 114973, 87126, 48975, 71692, 7242, -106260, -125874, -69009, -31202, -73954, -45080, -40335, -4477, 19071, 97352, 26420, -78299, -20360, -6020, -5167, -9065, -21248, -36356, -145410, -140402, -49340, -201825, -195692, -47535, -40653, -63720, -65568, -88798, -78712, 69919, 125781, 164218, 178242, 178255, 100822, -60885, -48489, -12295, -61854, -51096, -15225, 2999, 4704, 88954, 121866, -46299, -109307, -35731, -8308, -9758, 198567, 269588, 193181, 174582, 283761, 217168, 286205, 292981, 229779, 151396, 27479, -74069, -39447, -3448, 12368, 6137, -43308, -15526, 32710, -5294, 80636, 164797, 152276, 199146, 263656, 147360, 63381, 72709, 102960, 77634]
10160G7634r4248k4759r9332n7144J03865P1022p1699l2924k3701m112P7999O2813
10148a4586N4891n673r2032j32860J6049n9064J0597N6870P7507J19053J68130
10137A98882l9587q5039l0512N5410p4112o0520N6272K1891N3455N3634J35749
10126B85523p2080l17001j58793K9848J94586R3495n5498n2503j393n3574P5764
10115c1626j70873Q5329R5494M0819K4786n9430M9062J2807J8338J9519r9079
10104a4854J10949k5324K2694j14762j74686M2784M3766n9268J1643n980K40932
10093G7894J13563r8445j68389k1978p21j23425J61192J06532n531Q2519k7742
10082I5469n3409j25997j4525l4269M0895P6936m0072L2994o9412J715J52456
$$ y = [77634, -16614, -41373, -140705, -197849, -93984, -22962, -94661, -127585, -151286, -155398, -77399, -14586, 40305, 34632, -57400, -190260, -174211, -233275, -222678, -165808, -88301, 30752, 198882, 159295, 74256, 43744, 99154, 25042, -35478, 20794, 42685, 96140, 149774, 285523, 213443, -103558, -262351, -232503, -37917, 55578, 80, -52423, -53816, -107390, -31626, -202499, -117170, -21676, 19143, 43929, -15501, 33561, 46368, 64706, 84225, -14854, 96095, 70771, 93465, -21297, -195983, -153199, -109433, -168701, -157058, -163038, 77894, 191457, 93012, -75377, -97355, -98076, -221501, -60309, 46223, 40692, 123211, 95469, 42060, -83937, -98462, -132731, -91836, -14900, -54972, -21978, -91390, -89675, 62781]
10071F2781o707M8586J04265J4848k3348J1636j20775j63331J7807n0667j04843
10060b09748K25410J94664j01193j89778J3275p124Q5187l7726l6578N047N8201
10049c63o6520k2353M5743P534R3253l5798O1494K7034l2486M3596l3309o0415
10037B7410j70159N8574K5689J22715J2846l8805M3280j57163j4279N3022j07437
10026a44307o9351Q3675j3833l8211J25573J36276J44630j27878k88254k9049
10016b20729K08502R1688j30054n8136J8180J7634R0718K8307j24813J20774K3655
10005F5726r2273Q3271j8269l0124L6708l8740p2835j15541K9354j5829K8180
9994a40372Q4808R649J652J25512j4379j49736J725M343Q4588J9288O9758o2672
$$ y = [62781, 56074, 104660, 208925, 223773, 200425, 212061, 91286, -72045, -54238, -104905, -209748, 15662, 210326, 109133, -80645, -67370, -74494, 10693, -27033, -63611, -58564, -363, -66883, -89236, -43493, -35959, 57294, 21496, 82990, 110024, 77538, 121134, 87825, 27410, -142749, -84175, -58486, 64229, 77075, 38270, 81550, -75613, -89892, -36870, -144307, -213658, -129983, -143816, -182027, -56454, 79822, 224452, 96574, -191680, -220729, -12227, 79461, -50593, -108729, -90549, -72915, 17803, 46110, -78703, 42071, 65726, -26547, 56724, 38455, 8331, 45039, 6299, -66536, -182077, -152723, -168552, -140372, -55564, -45915, -44263, 81249, 66870, -82866, -81141, -76798, 7790, 27078, 96836, 34164]
9982C4164n0784O9052P5284q1852j9030j770P6038J22971J23780M2856o4821m939
9970C20949k16284j1266j7745o4521j46845L470P6646M5300P524l5190J66752
9959A28790K01971O850O308q4527j22338j18594j7773J8283n4936J3764J82828
9948A60626O3j4074P5374o3780q0997l2269O0237J0863l0557J43394J09847j29485
9936B09242m3863m2075M6615Q7506K8186j08133L8533m9624r0424J01553p8188
9925I9328k08075j16424R0452J18866Q583Q3226M7236N2665R3317l1530K8808
9914B66452R4504Q1192j41949k89131j51414L1309j5795J8125N1683j9447K9491
9903d4980Q3336K1494N9266M0057p1599j9590j50204N6650K23009L0863n5271
$$ y = [34164, -16620, 52432, 127716, 45864, 26834, 25064, 101102, 224073, 347853, 390709, 325888, 320949, 104665, 93399, 75654, 11133, -135712, -132242, -55596, -10296, -2772, -37962, 128790, 330761, 337611, 343919, 259392, 137054, 18460, 687, 18970, -35966, -22202, 160626, 160689, 146615, 221989, 158209, 77212, 44943, 105180, 116043, 85486, 228880, 338727, 209242, 165379, 123304, 169919, 257425, 285611, 177478, 216011, 166387, 75963, 177516, 99328, -108747, -225171, -134719, -15853, -7270, 75956, 123192, 175857, 269174, 237644, 266452, 360956, 442148, 300199, 11068, -140346, -109037, -124832, -106707, -55024, -74471, -44980, 38356, 59850, 119116, 159173, 87574, 67984, -82220, -25570, 197439, 228302, 173031]
9892A73031k30661P5164n4292m2915J27663J46422R211m0832q0826P6189L5672
9881A93826l8805J6213n2426r9838J299k4349r7857O3700N2366R2773j76901K561
9869f7438J18784Q2570J9403p083r2478J922Q144M9517J35468p41k8266j01503
9857A18299l0866n5837J076l1519L3598N871P0140O3156K1071r4077q5925l6800
9845b1813O346J09379l0050r3053j16494Q526J14211J14271J27160J36925k6832
9834C28576j51751J597R5640M0659n8660k01376r2287n6856n325l1774n36J48959
9822A6866K1870J0680M9533M1484j3669K5126P4813j02679j21733o7237K1316
9811d3630J8256R4520J12322l190N4347J55349o5772j14974p0460J589l846l158
$$ y = [173031, -57630, 17534, -36758, -79673, 47990, 194412, 203623, 162791, 81965, 158154, 193826, 155021, 171234, 118808, 18970, 20269, -4080, -101937, -38237, 14129, 106902, -69999, -67438, 51346, 133916, 153319, 146236, 53758, 55680, 63824, 113341, 248809, 248068, 219802, 118299, 87433, 31596, 32672, 1153, 34751, 40622, 110762, 173918, 194989, 100912, 14987, -21813, -15467, 93912, 63862, -29191, -145685, -137159, -22948, 91323, 218483, 355408, 328576, 176825, 178422, 274062, 314721, 256061, 54685, -37602, -94458, -99783, -131557, -132093, 16866, 38736, 49416, 98949, 140433, 126764, 151890, 226703, 124024, 2291, -64946, -43630, -25374, 69146, 181468, 178278, 232625, 387974, 322202, 207228, 136768, 138357, 134511, 131353]
9799A31353O163k2732p0270Q7792P9763p6887k14864m1455K0162N4563o964N2233
9787a143M0316l8607j03655p2391J56381K43921R5037r2582J4600k6648r7794
9776A17435j64355p0428J57716m0146N532L4597J6367j55239j08312J00774j9086
9765a25145Q5990J73626K27636n3961m5282m5361p1515P7481q9325n7641n0516
9754B5987p8113k05504r5379J30231P9454j0213J10469J1784l0926j02472J6028
9743a48654m1299L0007N355L9237Q0133Q9245p1820Q7263K9951K2883M1524L6875
9731B00700J8520P307N6060r6744j32860n8173L4066n892m6578n3097j33498R2801
9719a17388J48911M0181k5179n48k4192R19L4438m1406o7238j06769k8139P1093
$$ y = [131353, 137516, 114784, 44514, 132306, 212069, 135182, -79682, -121137, -100975, -46412, -53376, -1143, 39173, 566, -103089, -175480, -19099, 224822, 319859, 227277, 241877, 215229, 117435, -46920, -117348, 40368, 222, 5754, 40351, 56718, -98521, -206833, -106059, -125145, -39155, 134471, 362107, 308146, 262864, 217503, 145988, 223469, 134144, 76503, 25987, -52126, -257630, -353009, -222778, -143324, -153537, -43068, -31284, -62210, -164682, -148654, -189953, -159946, -154591, -115354, -35221, 54024, -17796, 69467, 99418, 122301, 163825, 200700, 219220, 226527, 282587, 185843, 52983, -5190, 28876, 22984, -23594, -76691, -210189, -117388, 31523, 71704, 46525, 45977, 21785, 22704, 57142, 15736, -51502, -158271, -186410, -115317]
9707a15317R867R0303J15056j25807r4482m4053M2876J48091K6934j9066N2448
9696H6850O363k08650k3365J10831q529R544l8588K2466O3271R9873O4372n3146
9684A31292j7782J8966o2764J7592J7570r8989R2095J3905N216m9970j24731o4242
9672a21842J12133J35785J53204o725o688j11194r8087k3855K1321j9108j69129
9661a34185p2109J39128J28782K0750k0545l4327J08010r819j77428q0221l2689
9650a64653p3558L7743J58802j7595Q6739l0623R281j1162l486R07O2990l1653
9638B3732n3516O325k25167q8846N3861p701l5738K08918J155j49773N3059K5700
9626a87991J00104K4822r2596O1838J21023K129j6959p9096J1071j88921m0651
$$ y = [-115317, -105450, -15147, 99909, -25898, -120380, -164433, -121557, 26534, 53468, 34402, 86850, 93213, -115437, -138802, -27971, -36500, -26956, -65544, -43078, 20193, 120066, 184438, 131292, 113510, 132476, 69712, 87304, 104874, 5885, 97980, 111885, 117101, 67131, -57600, -121842, -9709, 126076, 279280, 272555, 265867, 154673, 56586, 32731, 54052, 34944, -134185, -206294, -67166, 61616, 82366, 61821, 27494, 135504, 125685, -51743, -131964, -164653, -238211, -200468, -41666, -59261, 27478, -3145, 6136, -5026, -8512, -7605, 55385, 23732, -29784, -23459, -248626, -337472, -283611, -291312, -327050, -118132, -116977, -266750, -213691, -187991, -87887, -63065, -155661, -93823, 27200, 29329, 12370, -66726, -55655, -244576, -285227]
9615b85227O9635L5741J37466Q6986l2432k7698Q1334J6707j61586o3936J05614
9604c7396O0468K099m7903q8431p6335O035j29990R7249N8491K4796o7886l5595
9592b34398R0076Q7118J07394K1796o7175q9671O6020K8533j00109j2388j2946
9581a15750P7690O4032j33730L6993N7970J6771L1930J12134p034j16061n3115
9570b8170J02325M3767O2519J35307j52741j50617p9692k8852o522N6531N2340
9559F195n4327j11174p899m3584j8991P6721J63565J7455L8525R0472j44414p0883
9547e8339p4845n3024k1660J39467j0724K9521J796j15003k4482Q8721J15109
9536A6537O8124J3830q3354o2241q4537P9660J12719j019j7132J4113M3919J1924
$$ y = [-285227, -215592, -179851, -42385, 44601, 12169, -15529, 65805, 82512, -79074, -143010, -37396, 23072, 25171, -22732, -111163, -187498, -181463, -311453, -214204, -155713, -130917, -198803, -234398, -144322, -57204, 50190, 71986, 4811, -84860, -18840, 9693, -90416, -102804, -115750, -38060, 25972, -107758, -70765, -12795, 3976, 35906, 148040, 141006, 24945, -28170, 74155, 117922, 180441, 315748, 163007, 12390, -67302, -96154, -102676, -46145, 6195, -48132, -159306, -167205, -210789, -229780, -153059, 10506, 27961, 66486, 156958, 12544, -58339, -133184, -186208, -207868, -68401, -79125, -49604, -47808, -162811, -187293, -98572, 16537, 84661, 98491, 15137, -47104, -131641, -51981, 60738, 59719, 42587, 56700, 100619, 112543]
9524A12543J5240q224J19892j3993l4474j13527p2426M5359M217J04839j10501
9513D8945j3282m2730r791M6346q0799M8336J05321j49461n8188N6792N3517K476
9501G482j5276q9823p076j32727n0553J95412J35485L8412j35434P9139J21635
9490A46676j7448J7807P8411K7781J3509m3509j05393J9956R7955p7718k06135
9479d8108n9987r5957r2053J57559K4227j25325L36O7230R132l6235J24706n7942
9467a32417m354m633O3922J07110L8199q0231m2261j09250j48162J69625J33277
9456i175K926R8768J82001p262J24809M8346j86780j99189n3177o461p0678K5961
9444d9911L080K1646M1475Q8711O481j24615q83p530J02190J3974R9911K8473
$$ y = [112543, 127783, 119559, 239451, 225458, 190984, 77457, 5031, 50390, 54607, 159446, 48945, 35663, -7067, -16858, 29488, -51311, -2975, 102346, -47115, -105303, -48511, 5006, 7482, -7794, -97617, -104693, -237420, -287973, -92561, 42924, 81336, -54098, 25041, 146676, 129228, 147035, 225446, 253227, 266736, 223227, 117834, 137790, 235745, 158027, -48108, -108095, -204052, -296105, -138546, -114319, -239644, -239308, -172078, -162946, -199181, -74475, -132417, -136771, -141404, -77482, 29628, 67827, -12404, -54665, -163915, -312077, -142452, -9175, -6249, 92519, 274520, 267258, 392067, 440413, 253633, 54444, 1267, -5194, -75872, -49911, -46831, -25185, 16290, 105001, 111482, -13133, -14016, -21546, 80644, 94618, 194529, 223002]
9432B23002k9255j31169r4276O3716J11730J222k2118j0250l616o7905n2433j19587
9420a30939m8601j14167j11059J36879K96448Q4769p1764j65889q665O9257K6494
9409c7237M9179J4340k8149p5326l8328m0981m1122J27151J72693J89844j9808
9398B72256m747j04128j11066j2558k3527m0290o3673Q9134R1867M0396J0409
9387A44073p846r2294p0070J35049j20387q3924k450M1992O7473O7600j3766L1740
9375I7190m9852p6100j3708J04784K1439Q772o7584m5284n2912M896J46117P8649
9363A56407J5322j32738o9174J2003K9813Q4859j1821m030k5886J15611K8142
9352A98508J09007m8769j34903o8988K3537j7734j19980K3987P6664o9482n233
$$ y = [223002, 193747, 62578, -31698, 32018, 143748, 144970, 122852, 112602, 108986, 41081, -11352, -130939, -179540, -293707, -404766, -267887, 28561, 113330, 41566, -124323, -132988, -63731, -37237, 11942, 26282, -1867, -77193, -115521, -156502, -197624, -70473, 102220, 292064, 272256, 267509, 163381, 52315, 39757, 16230, -24060, -87733, 1401, 93268, 133664, 144073, 136227, 43933, -26137, 108912, -11475, -95399, -97849, -55857, 11616, 79216, 65450, 97190, 47338, -28762, -42470, 62314, 83753, 92525, 24941, -20343, -73255, -68359, 77758, 156407, 171729, 38991, -30183, -18180, 11633, 96492, 84671, 80641, 54755, 170366, 198508, 307515, 258746, 123843, 54855, 78392, 60658, -59322, -35335, 41329, -28153, -33386]
9341c3386O1650l9552M788n3259o3272J27449J81433Q0692p9027l0639j0013J1699
9329A58563K1939j98522q4063o8560l6196J77694K828l4666Q2250N3725J7989
9318I2981Q450j65546l8332J3347J23707J6605k0316J8428J0744o1060o2360M9178
9306a4174J55420O4281n4980j77739O2010M9788o3393P096O6695K2033j8813O1123
9294A59347l9621p7470j1778J11195P8595M0995l7917K3108J07019O4475Q011
9283D25959q0611M8036n8542j94461j59828K7009K9499Q1249k1885n1246M0727
9272H5906J90922q6495j37675p5591N2214J03639P9197j67478l2736K1181P4211
9261A07295Q7520k16779k7535J80704Q5366M8436j77855m7488N0729N2185k3637
$$ y = [-33386, 28264, -11288, -6500, -59759, -123031, 4418, 185851, 266543, 187516, 156877, 146864, 158563, 180502, -18020, -102083, -170643, -206839, -29145, -26317, -60983, 21267, 74992, 92981, 101431, -64115, -102447, -89100, 34607, 51212, 30896, 49324, 60068, -992, -63352, -14174, 141246, 205527, 150547, -27192, 34818, 84606, 21213, 28309, 95004, 117037, 98224, 159347, 119726, 42256, 30478, 141673, 220268, 261263, 223346, 246454, 353473, 417948, 425959, 345348, 393384, 334842, 140381, -19447, 7562, 37061, 118310, 96425, 45179, 85906, 276828, 190333, 52658, -22933, 29281, 132920, 212117, 44639, 11903, 33084, 107295, 194815, -21964, -49499, 131205, 216571, 265007, 87152, 39664, 90393, 142578, 118941]
9250A18941J4045Q089m0689K701o6786R470K09606N8424r2376j63518r4817J14691
9238G7781J23705k40985K9526J04346p779n3795N9668N9457P4501n0283P928O2096
9226B46166l5456k2351K683O0036K72n2537J5177R6272K5955j17757K8191J36108
9214C82759O147N4529j0277o7750J05175m2427p3768N6340O7832m7171N4019j3923
9202D71485M1827M4812J00273M4053L4596J19575J14276R871N3720J57135J69561
9191A361184K35780J41657N5773K47931L37990L19730L96156N50654O66579R84803
9181E298237J680235K197242L421534N965705R491455J2135550R985074M270000
9173E4445032N20031j880252j058050K59804j851451q952129j2405566r219098
$$ y = [118941, 132986, 141075, 100386, 103087, 36301, 45771, 255377, 313801, 221425, 57907, -36910, 77781, 201486, -39499, -9973, 94373, 86594, 32799, 92467, 151924, 226425, 176142, 184070, 246166, 210710, 188359, 191042, 251078, 251350, 198813, 213990, 310262, 336217, 218460, 246651, 382759, 388906, 443435, 433158, 365408, 470583, 428156, 354388, 410728, 478560, 431389, 485408, 471485, 513312, 558124, 658397, 702450, 737046, 856621, 970897, 980768, 1034488, 1191623, 1361184, 1596964, 1738621, 1794394, 2042325, 2380315, 2700045, 3096201, 3646855, 4313434, 5298237, 6978472, 9175714, 12597248, 18562953, 28054408, 40189958, 50175032, 54445032, 54965063, 53084811, 52026761, 52286565, 50435114, 41482985, 29077419, 19858321]
9165A9858321n288408l126153j951581j445011j014723p61144n51843m79359l89849
9156D850250k88399k32915j99230l08778m29293j52472j27654j2623n9887j60218
9146B878781k00894j30568J29020j05769m09928k43524n9744j78791m5967Q2981
9136A715597j48431r0328O03j00608j00811j11988J39820p311L2777j15423j98821
9125A015076q1099l5331R0824q3r937j00277j38044R9465j36934l5075p5036j1967
9113E81582n6769O4147R2140J1069K5908J8991N4844o9214j68220k1293M3801
9102E76986J2265j26009j4500q8529K5891J21983K7556o1177l69j45267j04673
9091B24157N1545Q912O1231k9306J21928q8097j65444p7070R4457J3252P4388
$$ y = [19858321, 14569913, 11443760, 9492179, 8047168, 7032445, 6271301, 5719458, 5240099, 4850250, 4561851, 4328936, 4129706, 3820928, 3391635, 3239163, 3111509, 3098886, 3038999, 2878781, 2677887, 2547319, 2676339, 2570570, 2160642, 1917118, 1857374, 1678583, 1632616, 1715597, 1567166, 1476838, 1477441, 1376833, 1276022, 1164034, 1303854, 1296543, 1329320, 1213897, 1015076, 933977, 898646, 989470, 989387, 979450, 879173, 741129, 840594, 703660, 668585, 593549, 581582, 524813, 588960, 681100, 692169, 718077, 737068, 791912, 722698, 554478, 533185, 576986, 589251, 463242, 448742, 360213, 386104, 508087, 535643, 474466, 474097, 328830, 224157, 275702, 284614, 345845, 316539, 438467, 350370, 184926, 107856, 202313, 215565, 289953]
9080B89953J88793j01078k20653j93039j1759J20771M7796K34606k1654k00867
9070A32869n8894k969r2670l0130l6536J15185O2133J05444L8640n7986j74510
9059E76R2555K07878k6650r5402j74202r9586J18684P2975L0095q7863j47928
9048a08868q3873J70631J54171J05352K6581q6215J8772P2810k7195l6555k8651
9037A76960o2716k21858K9066l213l6017O7580L3170N3410k1302L8771m4616J9550
9025B8785j0954j01823R2135Q7549l1653M2206l0558o7011K911j8828p750q2749
9013i7740P4979k9505j2756Q3508l4744k3647Q5030M7870o5577q0772R7377K7570
9001G1593r4900P6634n9292j07704p2955m1871j40886J98786K0471L6258J22512
$$ y = [289953, 478746, 377668, 157015, -36024, -47783, 72988, 120784, 355390, 333736, 132869, 73975, 71006, -21664, -51794, -88330, 26855, 88988, 194432, 233072, 175086, 576, 93131, 301009, 274359, 178957, 4755, -94831, 23853, 96828, 126923, 39060, -108868, -192741, -22110, 132061, 237413, 263994, 177779, 196551, 269361, 242166, 205611, 176960, 114244, -107614, -78548, -81761, -117778, -50198, -17028, 36382, 15080, 53851, 9235, 28785, 17831, -83992, 8143, 95692, 64039, 106245, 75687, 8676, 11587, -7241, -14991, -97740, -22761, -52266, -65022, 18486, -16258, -39905, 45125, 92995, 27418, -53354, 44023, 71593, -23307, 53327, -5965, -113669, -186624, -228495, -369381, -170595, -150124, -113866, 8646]
8990H646l1529J31877j1002j99932j01959R0904N2201Q2744k9928P0453o6141
8979c666M5184J21161p0791N0920J85465l123j29796r8351j942J26636P4878O9322
8967C65897j03550j3865o9340M2558J51433n1472p2916j08426k19622J26891J64908
8956B12496K0454N373J5664J5868k37646k25694J01776Q7713J42519N0670K8874
8945B18067j76745j37535J23087k2466j05051n8157L5403J61991J00966j06325
8935C3235r9901J16695J43027l3276j52457J8108K61561l0426j76489J1211j5210
8924G6078K7871R1686J1664j3862o3551j9233p2568j21476J3488J3024J5879K0046
8912b0954O2481J20631N0121O7243k6507j21218j47718q6156r0451K4991J45477
$$ y = [8646, -22883, 108994, 97992, -101940, -203899, -112995, -60794, 21950, -7978, 62475, -3666, 41518, 162679, 91888, 142808, 328273, 325150, 195354, 97003, 95061, 221697, 296575, 365897, 262347, 248482, 179142, 221700, 373133, 321661, 248745, 140319, -79303, 47588, 212496, 232950, 238323, 253987, 269855, 32209, -193485, -91709, -3996, 138523, 189193, 218067, 41322, -96213, 26874, 4408, -100643, -158800, -123397, 38594, 139560, 33235, -66666, 50029, 193056, 159780, 7323, 25431, 286992, 256566, 80077, 91288, 76078, 103949, 195635, 207299, 193437, 129886, 110653, 38085, -83391, -69903, -56879, -41000, -20954, 41527, 162158, 212279, 279522, 253015, 131797, -15921, -102077, -192528, -167537, -22060]
8901b2060O0779l5285o0088J12721K03488p8433q3400k3195l9071J44529J52574
8890C32559j88235m5931N2456O682N7901j62362j36793k3609Q7938n396M2588
8879A7798J2301l1413O2012k1912j34561n4748J26719N6682q7820M067k6745p733
8867h5353J30683O2117Q4191M6319j67261N2197Q3753n0127L4030K2250r8816
8856A13983K9031J9016j44481n4240M7499L6393M4774j48461q7479P8839R285
8845e5841n2479o0332N1236J17731q058l2597M6654M396r8908M9058Q3881N9790
8833A04531Q1770p8735M7707l7088r4883L0609J6533p6192p239o7002k7725J9586
8821h8128Q7342K071O114O9418o7348j64593n8180K9538J43204J27053Q6928J9979
$$ y = [-22060, 38719, 3434, -56654, 56067, 259555, 181122, 97722, 74527, 35456, 179985, 332559, 144324, 98393, 150849, 157531, 215432, 53070, -83723, -107332, -19394, -24790, 17798, 30099, -1314, 60698, 38786, -95775, -150523, -23804, 32878, -54942, -50875, -77620, -85353, 45330, 107447, 191638, 237957, 70696, 122893, 206646, 156519, 190549, 212799, 113983, 143014, 162030, 17549, -36691, 10808, 47201, 91975, -56486, -143965, -65126, -55841, -108320, -168652, -117416, 315, -7743, -40340, 6314, 10710, -88198, -39140, 44741, 104531, 186301, 107566, 155273, 118185, 23302, 53911, 70444, -5748, -12987, -79989, -107714, -88128, -786, 1285, 7399, 76817, 9469, -155124, -213304, -183766, -40562, 86491, 173419, 193398]
8809A93398n8430O2989P4668r7369J6395l1819n7243j04750j16453m8603J54390
8798a2827k4545J25582Q5777j04519l2810J40452p116k8590M7527r0978j97817
8787i9864j15082J17307J17539j5533l9903J23255P8767j49885k3338M3427J11191
8776A47881j24839l7716Q3939L636J7469n336j32328L4793P1400p2895j06137
8765a20133m2235O8231J20606J5864m9339P3180J67189Q39j58239o6899j8930
8754i866O8687o6808j5405P6414N5457k9500J10383L8924Q7893K4744k00949r305
8742A30669M0009J9806o7203o5351l6002L2812J09073Q3670K1032q4904n558N7669
8730B35722P9778j49997j77067J22355N7568m8612L8104L7738O342l740j69850
$$ y = [193398, 134968, 197957, 272625, 175256, 191651, 159832, 102589, -2161, -118614, -167217, -12827, -37372, 88210, 173987, 69468, 36658, 177110, 169994, 141404, 188931, 97953, -99864, -214946, -97639, 19900, 4367, -35536, 87719, 166486, 16601, -6737, 36690, 147881, 23042, -14674, 69265, 72901, 90370, 85034, -47294, -12501, 58899, -13996, -120133, -162368, -94137, 26469, 42333, -7006, 66174, 233363, 234202, 75963, 9064, -9866, 58821, -7987, -23392, 53022, 108479, 78979, 189362, 228286, 316179, 340923, 139974, 130669, 170678, 190484, 123281, 57930, 21928, 54740, 163813, 247483, 268515, 183611, 178053, 235722, 315500, 165503, -11564, 110791, 168359, 119747, 157851, 195589, 201931, 198191, 28341]
8719B8341j9397O179K9829J39755J33398K2502j14078M7711m0840J1122P8216
8708C22738k2035O9903J37123J01886j2620r4797n1287p9705j23445j40657J08655
8697B15759N8602O787K6783j15327o6603J20129P7167l1794n2425n8478J08240
8686B88840o8694J2261R3388m2407Q4833o2011j72939K6580L4597j14865p9634
8675e1O8469J73521K7070k9185J09455j856m4097j28992k5588n179j56109J39113
8663A26571J33639l3337j6740j13892j46638M1106L4929R7382K3054k2364J8306
8652A42016J20026M3753J20211m0740k2469J38449j36198j31048j54004J1420
8642I1416N621J00505J07535l0818m2593L2562j15633r9847k1668J01575R3798
$$ y = [28341, 8944, 15123, 44952, 184707, 318105, 340607, 226529, 274240, 233400, 244522, 322738, 300703, 370606, 507729, 609615, 596995, 502198, 450911, 371206, 247761, 107104, 215759, 274361, 281148, 307931, 192604, 126001, 246130, 323297, 291503, 239078, 180600, 288840, 220146, 232407, 325795, 283388, 368221, 306210, 133271, 159851, 194448, 79583, -51, 68418, 241939, 269009, 239824, 349279, 347423, 303326, 174334, 148746, 143567, -12542, 126571, 260210, 226873, 210133, 96241, -50397, -9291, 25638, 123020, 146074, 123710, 142016, 262042, 305795, 426006, 385266, 362797, 501246, 365048, 234000, 79996, 91416, 97037, 197542, 305077, 274259, 231666, 264228, 148595, 48748, 27080, 128655, 222453]
8631B22453J28652M1038j35505q4440R3545R4003O3682q2619j26486K6539J31911
8620C72773l8773j8632j2415K541J95787j525l6692L1415J08656N51j38848J28973
8608E93811R2770K4009J0014K9641J4223J62659J20069n778r0318q5264J35008
8597A000844K52324K105M9951J76385K20384O2200J09261M7963Q148J71734J18870
8586B220169r9134k08659j0693j05604L5409K3342j29818j12423p7227k59403
8576A275959k56867j60999q0226L5397j18807K6911J4584j13501j71464j19937
8566C31050r2130p438J02482J28227J14873O062J16229N5803j45642j14764p1019
8555D23733r0149r9143O8891J75334R4697j47582J4440J7643n1785M1870P7903
$$ y = [222453, 351105, 392143, 256638, 172198, 265743, 359746, 423428, 340809, 214323, 240862, 372773, 334000, 315368, 302953, 305494, 501281, 499756, 463064, 494479, 603135, 603686, 464838, 593811, 686581, 710590, 720604, 750245, 764468, 927127, 1047196, 1041418, 951100, 865836, 1000844, 1253168, 1255273, 1305224, 1481609, 1701993, 1764193, 1873454, 1921417, 1929565, 2101299, 2220169, 2121035, 1912376, 1901683, 1796079, 1831488, 1854830, 1725012, 1612589, 1535362, 1275959, 1019092, 858093, 777867, 813264, 694457, 721368, 735952, 622451, 450987, 331050, 238920, 231482, 333964, 462191, 577064, 583126, 699355, 755158, 609516, 494752, 423733, 333584, 234441, 303332, 478666, 573363, 425781, 440221, 457864, 406079, 447949, 525852]
8544E25852n5410n1181J53993O4733j15012j06284P1395k3704j54859j27661r9655
8533H2207m3506k9138Q6640P3697O4004J02404K777o7051J2489k7842N7022O52
8521C14355o847l9893J8575P5469o1220Q0580P4512p8344m7146j64420q4004K7907
8509A09524L6512k604o8783J6666N9340O1257L8786L1810j1969j50366Q2867o7869
8497A35171j48780l2453M7184J53248P8611J18283j35770r4426k3954j28974r6041
8486a27901j626O7995K8316n5370J45993Q4329n2192M60J03380m3695j9020N5683
8474A86352l0479p7005k9404M7940Q9267R704l7346n7859n3079Q7880J74640p1970
8462B38641q0924J24211L3760m7998n1271o8809N9655n4973J28970J4648j28856
$$ y = [525852, 470442, 419261, 573254, 637987, 522975, 416691, 488086, 464382, 309523, 181862, 82207, 38701, 9563, 96203, 169900, 233904, 336308, 339085, 272034, 284523, 256681, 313703, 314355, 307508, 267615, 286190, 361659, 300439, 381019, 455531, 377187, 330041, 165621, 81617, 109524, 146036, 143432, 74649, 91315, 150655, 211912, 250698, 282508, 270539, 120173, 203040, 135171, -13609, -46062, 1122, 154370, 232981, 351264, 215494, 121068, 97114, -31860, -127901, -129527, -61532, -33216, -88586, 57407, 141736, 89544, 90004, 193384, 149689, 130669, 186352, 155873, 78868, 49464, 97404, 186671, 196375, 159029, 101170, 48091, 135971, 310611, 238641, 157717, 281928, 315688, 267690, 216419, 147610, 207265, 152292, 281262, 295910, 167054]
8451A67054j57174J1747p0905n7947J01855R7919L7278j16703k4097Q703L3837
8440C1567L9022r7784n1404l3584m2104m950J29175R8631J57153N3953q1349k07043
8428h717K3271J5914O6764m485o3198l2791p2481J2257q646P3186R6007o064o5491
8415B5526L2881J05604P2292p2911k3667O2517j74049p2146P1794m2369p8734
8404i3262M5191J90742J79156k4840l3052r6701o1309j1328Q2600K0753j91627
8393F323p3857P0366K6994j5916m6650J19778J00227J39274l4661j49221L932
8382A46589M7018J04786R8280n3381j05200j09664O9455n6160r9113L2169J03002
8371A77781Q9250p2391q0014r8648k3242n775N4942n7969k4586o9412J3808m2848
$$ y = [167054, 9880, 21627, -49278, -107225, -5370, 92549, 129827, 13124, -10973, -2270, 31567, 70589, -27195, -78599, -112183, -154287, -159237, -30062, 68569, 225722, 279675, 198326, -8717, 14554, 30468, 97232, 92747, 29549, -3242, -75723, -63466, -72112, 1074, 97081, 91017, 25526, 58407, 164011, 236303, 163392, 139725, 202242, 28193, -43953, 27841, -14528, -93262, -48071, 142671, 321827, 296987, 263935, 167234, 105925, 94597, 177197, 197950, 6323, -67534, 2832, 29826, 13910, -32740, 87038, 187265, 326539, 291878, 142657, 146589, 193607, 298393, 396673, 343292, 238092, 128428, 197883, 141723, 42610, 74779, 177781, 267031, 194640, 114626, 15978, -7264, -13039, 41903, -16066, -40652, -110064, -96256, -139104]
8359a39104q5897m0151O8890K59495J09345k7215Q327M0635j3316q9397n2877
8348C8735K0998j562q638j36779J10786K7488L676J97981p3453q6650n1481j74863
8336a33762n3216J84963N5811M661j04661J4272J09510J13684J06259L371J6134
8325C17026n0422j90184q210N9143j19554J8800R7691j8199r4487R292L869N2840
8313G7605o2670m8181m3492J19233J45320M2744r9999p1524o4937q5816N0702
8302d1015R9926J09687k8742o5743l1814j50322j5814J20835J395M4011J12038
8291A54442R7310n801j08139p5389q18j22837O7754M420j74683P7759O8670K33959
8279B16647o9011k05752J60336j20101L2210K7690j31460j2514J8072L8894J49043
$$ y = [-139104, -225001, -265152, -196262, 63233, 172578, 145363, 153690, 194325, 181009, 91612, 38735, 59733, 58171, 49533, -87246, 23540, 51028, 54704, 252685, 179232, 92582, 41101, -133762, -186978, -2015, 53796, 58457, -46204, -31932, 77578, 191262, 297521, 300892, 317026, 266604, 76420, 68210, 127353, 7799, 26599, 124290, 106091, 11604, 20896, 24765, 77605, 14935, -33246, -76738, 42495, 187815, 230559, 130560, 59036, -5901, -91717, -41015, 58911, 168598, 139856, 74113, 42299, -108023, -123837, -3002, -1607, 42404, 154442, 251752, 245951, 137812, 62423, 61605, -61232, 6522, 10942, -163741, -85982, -17312, 216647, 147636, -58116, 102220, -17881, 14329, 42019, -89441, -101955, -83883, -44989, 104054]
8268A04054J84691r8852j57132j534M9138J37537J2961j2363j04611m7250R6284
8257A62923l4031N1429O2151j04120k4552l6419j53860o4810j12681M5808O4967
8246a43195j7456o1210P1362J00706K8712n4934q5502J04070Q4363J01909O0795
8235A89620K0007n5919p8207N8476L4084n4751L7888l5491n0869J3105O0616J5970
8223A54529J12439m4733j5978j2102l2716k1722M648J9430P2462J2170j21019
8212A27408J2147k5321j04409k8201O8849J14126N2055k4750r8525M6671j5904
8201A24146q2265n5774q9567J8629Q0903l0815j24512l2612J2378N7822L756R5430
8189b2481k4546j9453O3601N5187l3533j5327j585J7383R8515k5756Q2083K8957
$$ y = [104054, 288745, 189893, 32761, 31227, 80365, 217902, 230863, 218500, 113889, 66639, 162923, 128892, 180321, 242472, 138352, 113800, 77381, -76479, -141289, -253970, -208162, -143195, -160651, -221861, -150499, -49793, -21081, -76015, -161517, -57447, 26916, 128825, 189620, 209627, 153708, 75501, 133977, 168061, 113310, 151198, 115707, 64838, 77943, 138559, 154529, 266968, 222235, 206257, 194155, 161439, 139717, 144365, 163795, 236257, 248427, 127408, 139555, 114234, 9825, -18376, 50473, 164599, 216654, 191904, 93379, 140050, 124146, 41881, -13893, -103460, -84831, -3928, -34743, -159255, -191867, -179489, -121667, -117911, -22481, -47027, -66480, -2879, 52308, 18775, 3448, 1863, 19246, 117761, 92005, 174088, 203045]
8177B03045j37573M5433J75631k12365j67586k865J53466J31043N1131Q1207j00791
8166B19776j71651q763j39128j1944K9003K02530Q7889N96N9619j114r393m8631
8154B08789k18782j29805J57401Q3715P6359l1537j29683J6965N0180O982k8050
8143F2534J49964P7819j05546j16186R3044o8764m0394Q5730o2055J0955p1993
8132A5108M2907J0593r6036m4965L6403O2461K2569Q9502M9297P3770p0011n1320
8120A40278k5580l02M4566k3322P737o384L7041j82775r7350o2231J0231J52316
8108e775R5582P4073N0853R838j33433k15120Q3426N3955J6198N7663J26159p3812
8096A39607j31543o3924P3802O5486M7179P6546n6845O261K1470p4407j21029
$$ y = [203045, 65472, 110905, 286536, 74171, -93415, -96280, 57186, 188229, 239360, 320567, 219776, 48125, 39362, -99766, -111710, -82707, 119823, 207712, 208308, 267927, 266813, 257420, 208789, -9993, -139798, 17603, 101318, 177677, 146140, 16457, 33422, 83602, 90584, 62534, 212498, 290317, 184771, 68585, 161629, 92865, 52471, 138201, 76146, 87101, 15108, 58015, 68608, -27428, -72393, -35990, 26471, 49040, 138542, 187839, 261609, 191598, 140278, 114698, 114396, 158962, 135640, 143377, 136993, 174034, -8741, -106091, -168322, -158091, -5775, 89807, 163880, 214733, 224571, 91138, -123982, -40556, 13399, 29597, 87260, 213419, 139607, 8064, -55860, 17942, 83428, 130607, 207153, 150308, 156569, 178039, 103632, -17397]
8085a7397R7616J01739j1079J03902k4551j65617O8649j59883j89815Q020L732
8074a84684P7590K30082k530j0120J933q1449n8795Q5764P1635m0280n3506O655
8062D2295N6702M4380j7051m2593J08362J40341l5899k5592j04046j00007r2073
8051b5181L881M0634K900O4799O4906j9699j19625p3534J52517Q1334L4454J43155
8039C50541p3062j08875J13080P0211j69373j35054R7746J11098J4952J23749
8029C95013M0622j39597n1878l0322k5503j4576P6291N7940K0029J15107K9095
8018D72221P1989l4899o3385n6988o1620l0483j3296P4208Q3598j19079m8136
8007B74130j2915K3689n262M8726j12715M098j55824J2509k0965J83046j0253
$$ y = [-17397, 80219, 181958, 170879, 274781, 250230, 84613, 153262, -6621, -196436, -188416, -184684, -107094, 122988, 120458, 110338, 112271, 30822, -27973, 57791, 129426, 89146, 35640, 42295, 98997, 143377, 126326, 83733, 192095, 332436, 296537, 270945, 166899, 66892, -25181, -21300, 19334, 22234, 87033, 151939, 132240, 12615, -60919, 91598, 172932, 207386, 350541, 277479, 168604, 281684, 351895, 182522, 47468, 145214, 256312, 271264, 395013, 435635, 296038, 244160, 213838, 188335, 173759, 250050, 307990, 328019, 443126, 472221, 544210, 509311, 445926, 388938, 327318, 296835, 283539, 357747, 441345, 322266, 274130, 261215, 284904, 279642, 328368, 215653, 219751, 63927, 76436, 55471, 238517, 228264]
7996B28264o6723k8780m0979k2259J93455K35124J5859l8588m0991r5175j20579
7985B18628L664l5381l3280R741J56257R9196l7282n113o2995j02476m433K6195
7973B32721J08564N7136O2140N0955j52924r1360P3297n6593J8483j7441l5225
7962B49753m2152j14M2695l9528J16752J57180n7700l930N4573Q6818j06608j41445
7950C16294j70569p6313O7592J18748K9748J9833J35156N4518j18795j82980K0280
7939B13512J06991q8580O6480l379J17868l4817m5717j5517q8254N4456n9787
7928B23256q2031J34036O9752j41231j1090J18826L0793k6868l6100k864J7829
7917B94308J10504r5116n4218o1511K4512J41732p5119j06552j18542L3189N6893
$$ y = [228264, 161541, 132761, 91782, 69523, 262978, 498102, 513961, 475373, 434382, 339207, 218628, 222292, 186911, 153631, 163372, 319629, 418825, 381543, 376430, 313435, 210959, 206526, 232721, 341285, 398421, 460561, 511516, 358592, 267232, 340529, 283936, 302419, 284978, 249753, 207601, 207487, 250182, 210654, 327406, 484586, 426886, 422956, 477529, 564347, 457739, 316294, 145725, 69412, 137004, 255752, 285500, 305333, 440489, 495007, 376212, 193232, 213512, 320503, 231923, 298403, 295024, 412892, 378075, 332358, 316841, 228587, 283043, 223256, 141225, 275261, 345013, 203782, 192692, 311518, 342311, 315443, 279343, 276479, 294308, 404812, 309696, 255478, 193967, 218479, 360211, 285092, 178540, 59998, 93187, 150080]
7906A50080Q8119J1817q5332J74974J48467k8312q1116j58666j99509o2614J67275
7895A25183P3478k5592p0825l8636L5211J10228q3711K0191J46689k6205n6759
7884B09252o3637r7633m0423L734m1802Q7534L2133M6096m6118j1726K1103J65868
7872B64381O7065o8078K0475k5296j87807O7466N572q2692K1063K1651R8571k8891
7860A73480k22278q7374q5650J5583J68643P7469m1356O057J09895K378J5955
7849A32802N873r5370p1034L1763J7597R546M4312k6892j09142l6691M0075R6191
7837C9030M8817K6272r1015j67465J82J84809O7939o5810j12332m4275M4483J60194
7825I0829m4799r4059J23587L8086q4207O0816j1958n9062K3737m1478j40171
$$ y = [150080, 238199, 250016, 164684, 339658, 488125, 459813, 378697, 220031, 20522, -42092, 125183, 198661, 173069, 102244, 63608, 98819, 209047, 125336, 145527, 292216, 266011, 209252, 145615, 47982, 7559, 11293, -30509, 57025, 89158, 135254, 89136, 77410, 98513, 264381, 331446, 263368, 283843, 258547, 70740, 138206, 143778, 61086, 82149, 103800, 202371, 173480, -48798, -136172, -221822, -206239, -37596, 39873, -1483, 4574, 114469, 116847, 132802, 138675, 43305, -27729, 4034, 21631, 31177, 75489, 48597, -60545, -97236, -57161, 39030, 87847, 114119, 23104, -144361, -144179, 40630, 108569, 42759, -69573, -113848, -69365, 90829, 46030, -48029, 75558, 113644, 29437, 90253, 78295, 19233, 42970, 1492, -138679]
7814a38679o7115R6345o4318J37486M9493l7923j14264o6656N5573m4325r7124
7803b91507L082k0058J15900R6588J69628J0202K3760j24960j90030O3930R3708
7792d9757N8666N0418N063p6914m9651K3145J19860j7437k6294L3135j0383O5212
7780A25063k2099L6608J06795J2042j46900r3927Q5470q612p4487p6619p3634
7769a30300m2971J3183M0177L0995L2777J3570J08796O703q1533m6511J25448
7758G0334M9979L6098o8338k2748K086o8804q348N9363o8843m6145m3179O7599
7746d0946J10909K04216L8937j19050m845K932p2909l1535q1467M5864K8603j9706
7734F1003p1345r8329P787P0381j74841j14754O7639N7013m6481J95592K3735
$$ y = [-138679, -205794, -109449, -173767, -36281, 13212, -24711, -138975, -205631, -150058, -194383, -291507, -288425, -308483, -192583, -95995, 73633, 83835, 107595, -17365, -207395, -143465, -49757, 8909, 59327, 64390, -12524, -62175, -39030, 80830, 63393, 37099, 70234, 59851, 125063, 102964, 139572, 246367, 258409, 111509, 17582, 103052, 94440, 19953, -56666, -130300, -173271, -160088, -119911, -88916, -56139, -42569, 66227, 72930, -8603, -55114, 70334, 120313, 156411, 88073, 65325, 67411, -1393, -9741, 49622, -19221, -65366, -108545, -40946, 69963, 274179, 313116, 194066, 189221, 192153, 119244, 87709, 6242, 52106, 80709, 61003, -10342, -108671, -100884, -30503, -205344, -320098, -252459, -195446, -241927, -46335, -22600]
7723b2600j47707J1516J38114N4304J9306L5102j21578j93223J54595J30285N1429
7712A09543n3543R4790j08108p7223O3677L7189P0028O9723p5241j35624n9066
7701f3855L664l0567N0562j3297r331M5608P3726O9148j11391o6798m5483N1820
7689d6194Q2170R8120q6691j15308j727O3091k3950K2340k9006p7660j03156J0200
7677b07771M1289n8756K0735Q4415K50788K4783k0114q4603o8486l6340O1182
7666G122l8921n3540J2326J62275O7885r5724R4343n6869l0660R3891O496j34856
7654C3768p360l276O0523L2415q6110j9623J54945j6963j09355p4126j5554O9993
7642A9277o3557n4085J2552J19901L7347L0654j04010R83R7170q9939j33170J07328
$$ y = [-22600, -170307, -158791, -20677, 33627, 52933, 88035, -33543, -226766, -72171, 58114, 109543, 56000, 150790, 42682, -34541, 29136, 66325, 136353, 206076, 130835, -4789, -63855, -60191, -90758, -40196, -53493, -62824, -17216, 56510, 125658, 14267, -52531, -98014, -46194, 35976, 134096, 47405, -67903, -69630, -6539, -30489, -8149, -37155, -114815, -217971, -207771, -166482, -225238, -204503, -120088, 130700, 155483, 135369, 50766, -17720, -54060, 7122, -31799, -85339, -73013, 89262, 157147, 61423, 155766, 98897, 68237, 162128, 168624, 33768, 26408, 23132, 83655, 116070, 29960, 10337, 165282, 148319, 38964, -35162, -50716, 19277, -44280, -98365, -85813, 34088, 71435, 102089, -1921, -938, 96232, 6293, -126877, -19549]
7630a9549P2772k3652m0152K1184J12138R7626j45318j68059K6262K6274l660
7619d4134m362P1212O4607J83653l1704j17172r5226j8868J20336j5235j07662
7608E445N488n7472r7934J05658K04019M5863j12724k58207j04622L3376J79289
7597e1821R0607k521k541o2316K4296q514j07406j26293Q5137J97431J2893j11105
7585f2153Q2767N6716j7249j19519p1420N4851q2075Q4404L07364R8710l0818
7574C01578k5084r6125o7809K8840p2084j19534J59026L598n9130o6643O5015
7563E1648j16901j6776p6310Q8616J29011P6327K1343j66838m2119P5578m6676
7552b3097k7414P9623K8263J449j2539M668J20872J7077j90408j70901j7328J3616
$$ y = [-19549, 53223, 29571, -10581, 10603, 122741, 220367, 75049, -93010, -66748, -40474, -44134, -48496, 22716, 87323, 270976, 239272, 122100, 26874, 8006, 128342, 113107, 5445, 10933, -46539, -144473, -38815, 165204, 211067, 98343, -159864, -264486, -231110, -51821, 38786, 36265, 33724, -28592, -4296, -12810, -120216, -246509, -161372, 36059, 48952, -62153, 20614, 77330, 60081, -59438, -130858, -76007, -158082, -73678, 233686, 332396, 301578, 276494, 180369, 112560, 141400, 69316, -50218, 108808, 112406, 53276, -13367, 51648, -65253, -82029, -158339, -69723, 59288, 135615, 156958, -9880, -51999, 23579, -23097, -50511, 29112, 57375, 58824, 46285, 50953, 171825, 188902, -1506, -172407, -189735, -176119]
7540a76119J47428N6718q4276o568Q9911j6053M675k047n3567J1884r729O7528
7528B9785P074k1109p4887m114M3035J04472J17255m2041l9897p5289k2139n1383
7516b9238J44423J4987o9936j04350j39226p0344k28R4978K9708n3115N3556J29478
7504F93J55462O3544j1926L2312n1676j24429j91955R8086P1029k7251j79521
7493a65632k2302J12180q7073L8695J52678k132m6988j17051J139P4505j3587
7482g5568l8125J35132N6255m5540n7191M3541J035j04708j28197R0865O4140
7471e8361O5633L7522K4002j08398N3301p6574K7658n7008n6029J03124K2829
7460b2301l4221k8815q6937m6906R7694R9808k0827P4496J1784j83551j27394
$$ y = [-176119, -28691, 28027, -56249, -62817, 27094, 11041, 15716, 13669, -39898, -28014, -37743, 29785, 36859, 15750, -59137, -63251, -20216, 84256, 201511, 159470, 119573, 44284, 22145, -29238, 115185, 130172, 60236, -44114, -183340, -253684, -253912, -158934, -129226, -182341, -128785, 693, 156155, 219699, 207773, 240085, 188409, 63980, -127975, -29889, 41140, 13889, -165632, -187934, -75754, -162827, -124132, 28546, 26414, -20574, -137625, -136486, -61981, -75568, -113693, 21439, 77694, 32154, -25037, 18504, 19539, -85169, -213366, -122501, -58361, 7272, 44794, 68796, -39602, 13699, -62875, -35217, -92225, -148254, -45130, -22301, -56522, -85337, -172274, -219180, -121486, -21678, -42505, 31991, 43775, -139776, -267170]
7449b67170P8906K19508K4714j37976o1629J79544m69J7915m7358p2479P8755
7438A2261o806j25836m5091J39359k2967l4940j8427j2123N0557N8921N5611P1380
7426A21899n9780j30562Q9923j6746l7112k5666o4529p2982Q409K14465P7012
7415A04331j5543j12313J5829j18583L512R7912m5540j4398R5768N2436j00959
7404c7548N6520p5166n8795P0146J00183N0085n6549j34569j30846L0609j5325
7393b01255k0464J37420K82035o0709q4827J34553K1982q744K8841n1478m2049
7382A35305k9347n9746J07180o7596o9679j22387J03020Q332N5296Q4269J276
7371A45923r7269k2101k8443L861p8696J94282J33291q6709j16400j26137r3227
$$ y = [-267170, -188264, 31244, 55958, -82018, -143647, 35897, 35428, 53343, 5985, -66494, 12261, 5455, -120381, -165472, -26113, -49080, -84020, -102447, -114570, -64013, -5092, 50519, 121899, 62119, -68443, 21480, 4734, -32378, -58044, -122573, -195555, -187146, 27319, 104331, 88788, -23525, -7696, -126279, -122767, -24855, -70395, -84793, 10975, 63411, -37548, 18972, -56194, -114989, -44843, 55340, 105425, 48876, -85693, -216539, -185930, -201255, -221719, -84299, 197736, 137027, 52200, 186753, 208735, 199991, 228832, 177354, 135305, 105958, 46212, 153392, 85796, 16117, -106270, -3250, 5082, 60378, 144647, 145923, 48654, 26553, -1890, 1971, -76725, 117557, 250848, 164139, 47739, -78398, -171625]
7360a71625J45370R6273P0181P7084j7641k9156m6790o0440j9659l4706j46741
7349a37850k4329J67144K3494N9441m8253p9567o9168Q2304P82J4376P6460r5345
7337c0511q7950J13762J74159k9362p0126k8971j41083p1808N2948Q4589N6907
7326B2554L1615j05984J7042N9756j13371r0298Q3905R1530K5177J7971j9220
7315B0677o5984n1819l488n3990O1207n049K6331o3727k3437k5824l5121P5738
7303a44486J04234J10941m6340m7345N4007N7935j9348m7938O2754k6280l395
7292E4739O4623j43828j15256R8207k6328L3881J13281j27654O081k4509J8874
7281d7889O8167L1664n9823j63290p7720k0760j7233J7678O5476M3505J2168Q2545
$$ y = [-171625, -26255, 70018, 140199, 217283, 199642, 170486, 123696, 63256, 43597, 8891, -137850, -162179, 4965, 28459, 87900, 39647, -39920, -109088, -26784, -26002, -11626, 64834, -30511, -118461, -4699, 169460, 140098, 69972, 41001, -100082, -171890, -118942, -34353, 22554, 54169, -51815, -34773, 24983, -88388, -178686, -94781, -3251, 21926, 39897, 20677, -45307, -97126, -100614, -154604, -93397, -98446, -72115, -135842, -159279, -185103, -220224, -144486, -40252, 70689, 24349, -22996, 31011, 88946, 69598, 21660, 84414, 58134, 54739, 119362, -24466, -139722, -41515, -67843, -33962, 79319, -48335, -42254, -66763, -47889, 20278, 51942, -7881, -171171, -248891, -269651, -286884, -269206, -203730, -160225, -148057, -65512]
7269f5512R299p0038q1162K4504L2425P3640l1920n811m8830q2745Q4809m5249
7257b06590K7721r546l9489L7306k7100P9156M362J26891J17643k23931n9222
7246a72799J07716J38322J6633j68354j57899R7159J06771Q0011j18459p1761
7236a42660K6880Q4752J5783k1994J82277O2960k6991j08849j66181j02103J45985
7225e0141k3026J8370l0270O5520J302l3373p1543K8238m1809P7876J48526L3090
7213A22760N1118q3828l5839J10189j64921j31145j20829J30612N1611p5946l9350
7202a85568J28337P3679q0406j3723M6625j27250L814M9077Q9181l6338l1557
7191h4129M815P0974q7576K9876M5075R1415q8487q3285q2768o0967n5575J12515
$$ y = [-65512, -56213, -126251, -207413, -182909, -150484, -76844, -108764, -114575, -163405, -246150, -161341, -206590, -178869, -188415, -227904, -190598, -217698, -138542, -134180, -7289, 110354, -113577, -172799, -65083, 73239, 89872, -78482, -236381, -139222, -32451, 47560, -70899, -142660, -115780, -31028, -15245, -37239, 145038, 207998, 181007, 72158, -94023, -196126, -50141, -73167, -54797, -85067, -19547, -18245, -51618, -123161, -94923, -136732, -58856, 89670, 122760, 173878, 90050, 54211, 164400, -521, -131666, -252495, -121883, -70272, -146218, -185568, -57231, 16448, -63958, -77681, -31056, -158306, -154492, -105415, -16234, -52572, -84129, -79314, -8340, -95916, -66040, -20965, 70450, -18037, -101322, -184090, -245057, -300632, -188117]
7179a88117J26583P7643n3775j33813J9471R8584m8371j39552J43334J03208K8724
7168C3919q8273N5450J07891o4824j34396p2992o3279J20075R663n5087P7785
7157g4068j379P2007j04869k1402N9381P262J1540p945N0560N4799m7365n9135
7145f0614j21413m2109K6727k9737q4278l1168J47826J91930P6833Q2364q3708
7134G2653o9147K9205j34109j7300M5328J9324m0128k1355O6563J11353j48538
7123h6151j51001K82j5806p7722K9271L1524O7806p440J62798J06433l0528J61893
7111A91359J6147j64711r2567J19929l6938n207j36780m4969n6888K2432M0509
7100a47684J23647P2380J02214N4178o6333q6407L7588J9778J5419L27j05656
$$ y = [-188117, -61534, 16109, -37666, -171479, -152008, -53424, -101795, -241347, -98013, 5195, 33919, -54354, 1096, 108987, 44163, -90233, -163225, -226504, -106429, -96766, -151853, -74068, -75447, -3440, -108309, -129711, -70330, -63068, -51528, -59473, -8913, 45886, -1479, -60614, -182027, -224136, -197409, -227146, -311424, -342592, -194766, -2836, 73997, 156361, 72653, 3506, 32711, -101398, -118698, -73370, -54046, -94174, -115529, -48966, 62387, -86151, -237152, -236870, -252676, -330398, -301127, -269603, -201797, -209237, -46439, 59994, 29466, 191359, 207506, 42795, -49772, 70157, 33219, 28012, -108768, -153737, -210625, -188193, -147684, -24037, 48343, 150557, 204735, 138402, 51995, 89583, 109361, 124780, 125107, 19451]
7089A9451J75942q123j42192R7884J33637l3278j48993j14481Q9838J64691o6552
7078A67824j32273r1002J5822J9276m2971O6471j98157l907N7027k9079L0392
7067a40577P9978q9479j4143l7228Q0429J46600p875l8417j38250J2968K40307
7056I4313r220j08269L241j04335p2820R79L5262l434J5981j01490O8789O2053
7044a18950O4786J05507Q9921P2737l1202j91925n6627j8197P6411l1384l9682
7033g8605M5480R9703M1645K0931p462L8352p0577j189N4043r075j19881p3000
7021e9635p599R8005J67919L3423j28524l1389K2162l1745q1424j47027M6149
7010a19685M4255J01972M6984j16541j04391P470j43786N2456O5970L676L2271
$$ y = [19451, 195393, 187270, 45078, 142962, 276599, 243321, 94328, -20153, 69685, 234376, 167824, 35551, -55451, -39629, -20353, -63324, 3147, -195010, -198917, -141890, -170969, -140577, -60599, -150078, -164221, -201449, -121020, 25580, 17705, -20712, -158962, -145994, 94313, 85093, -23176, -19935, -124270, -197090, -196111, -160849, -164283, -148302, -249792, -181003, -118950, -54164, 51343, 141264, 214001, 182799, -9126, -65753, -83950, -7539, -38923, -78605, -33125, 66578, 108223, 129154, 121692, 160044, 89467, 88278, 142321, 133246, 13365, -59635, -67234, 30771, 198690, 232113, 103589, 72200, 94362, 62617, -18807, -165834, -119685, -75430, 26542, 73526, -43015, -147406, -139936, -283722, -231266, -165296, -161620, -129349]
6999a29349J20013K9459q8329p7163K3431J06958l1937o5860J5060j25630j89591
6988d12938Q3819J23299J46699M20l4678J103J41053N3807O8506m2574r8447q2854
6976e2785J21375N7306k9839J02980l4448o2265j1314o5619J2857P959o1959L0524
6964A4772K3651Q0314j22647j01613P005p1886J38631O5473K6242p3035J69016
6953A55923n0447j12727J9958o3739J6006J17670o3889k1572j29559n1000O7160
6942a16216p0326o4111K3184J04527l5794P4165K15529O3818n3210j65759Q2117
6931E7924J19179N3515J31333K0326j69500l53511j0220J14603M8377j5302p6085
6920g9361N6759N0911j65524l6745j11724p5059J21480M5979Q0354J5131N026
$$ y = [-129349, -9336, 20123, -68206, -145369, -121938, -14980, -46917, -112777, -97717, -223347, -412938, -329119, -205820, -59121, -58701, -93379, -92276, 48777, 102584, 171090, 128516, 30069, -52785, 68590, 125896, 96057, 199037, 164589, 102324, 91010, 25391, 38248, 46207, -15752, 14772, 38423, 118737, -3910, -105523, -98518, -170404, -31773, 33700, 59942, -13093, 155923, 105476, -7251, 12707, -51032, -35026, 82644, 18755, -2817, -132376, -183376, -116216, -186542, -250653, -227469, -122942, -158736, -84571, 130958, 194776, 141566, -24193, 57924, 177103, 230618, 361951, 382277, 212777, -140734, -150954, -36351, 12026, -3276, -79361, -22602, 28309, -137215, -173960, -285684, -360743, -239263, -193284, -112930, -97799, -92773]
6909i2773M3631P109Q6194q2714J3786Q7596M8714m2477j23007j20806Q6658L6600
6897e1489K2299j42991o4216K2642R0380P9947N8947K8526Q5477j5622N3796q3310
6885H4386j39446o4960L7783K5949O359J31242K5694K4368p3843j67628j05417
6874b15513J41471J52802r8261n673K3957q4344l1468k811L6638j02997O9239
6863a16960L6679l2657l6448J11365P6895Q9279J7286n4246j2619j38305q793
6852f8524p090L4892M695O5140L9715O8996r9517J102n8423R470k7763L1692o3649
6839f9264N9098O7343J5027j49178p7406J69143J38255O161k53234j70285J0891
6828b53449j6385j05958N1706J79276K00338J00657K9321j25532l2080N5169q6195
$$ y = [-92773, -49142, -42033, 44161, -38553, -24767, 62829, 111543, 69066, -53941, -174747, -88089, -51489, -29190, -172181, -236397, -213755, -123375, -43428, 15519, 44045, 129522, 113900, 167696, 84386, -55060, -120020, -82237, -56288, -49929, 81313, 107007, 131375, 57532, -110096, -215513, -74042, 78760, -19501, -25174, -1217, -85561, -117029, -119840, -83202, -186199, -116960, -80281, -112938, -149386, -38021, 38874, 128153, 145439, 91193, 78574, -59731, -68524, -75614, -40722, -36027, 29113, 68828, 137824, 38307, 39409, -19014, -9544, -37307, -5615, -69264, -10166, 57177, 72204, -76974, -154380, 14763, 153018, 159179, -94055, -264340, -253449, -269834, -375792, -324086, -144810, 55528, 156185, 185506, 59974, 27894, 83063, -3132]
6817c132M3607k133n3407o2467l7842k9375J9814j8087p1968J06804k7422J15718
6805a9890N5898R2299o9587J747o4275r0519J37560M7276m3387J2806p9292n0009
6793f9373k087P5733j21323L9888P0477r7424k0491J14783K8375L8808L9832l2637
6781F4561j5370M0201L4354l8736O6895J5686O324j02495q850q5803j80365O8230
6769a35368N5405M0261p5175l0203M0496R1167L5531n7100k09262q5549K10590
6758a19207J26788j65961q665n700j07136J927J17839k1409M5582M0606k5455
6747a20791Q4877n986l0905m5650O1385J06388Q8773N3176K8381M2822j13168
6736A49302j02082r1837r1271q7319R4108n4664K9620M0657J34267J14477j06015
$$ y = [-3132, 40475, 38342, -15065, -77532, -115374, -144749, -124935, -143022, -214990, -108186, -135608, -19890, 36008, 128307, 58720, 60467, -3808, -94327, 43233, 90509, 47122, 59928, -19364, -69373, -71460, 4273, -117050, -77162, -6685, -104109, -124600, -9817, 18558, 57366, 97198, 64561, 49191, 89392, 123746, 85010, 151905, 167591, 173915, 71420, 62570, -23233, -203598, -135368, -79963, -39702, -114877, -145080, -104584, -13417, 22114, -34986, -244248, -329797, -119207, 7581, -158380, -167045, -172745, -279881, -277954, -160115, -181524, -135942, -95336, -120791, -35914, -41900, -72805, -118455, -57070, 49318, 138091, 191267, 219648, 262470, 149302, 47220, -44617, -135888, -223207, -129099, -183763, -154143, -113486, 20781, 135258, 29243]
6725B9243r5950P5842P2107K50588L3623L7522N7585k0175J31103K21790P1065
6714H64343P2994P0697J38822r3535q7660j94851p1050j29783j68858l1665K1486
6703C90940o1569K7647j13068m5227j14427j01211p7928P3512L6058L871J0145
6692B8743J18493L6210j9935j32969o5244m8644j38634N3711J26254L9364K4722
6681B2071L5821J15968j07337l0113J06454j22056j36522o6510N8237k1661r8715
6670b44363K6385K26848J37072k8030j35525j86927N7782L6630r7706M1504J08523
6659e7807J120M121n7165p6148R4948J42694K7050J1215K6402j50584N8250k2333
6647A763r7475J58333J55537K5337j74128j87963K7626J63087m3114m3152L9287
$$ y = [29243, -66707, 9135, 81242, 331830, 365453, 402975, 460560, 440385, 571488, 793278, 864343, 937337, 1008034, 1146856, 1053321, 965661, 770810, 699760, 569977, 401119, 369454, 390940, 329371, 357018, 243950, 198723, 84296, -16915, -94843, -21331, 14727, 18598, 28743, 147236, 183446, 163511, 30542, -34702, -83346, -221980, -168269, -42015, -2651, 22071, 57892, 173860, 66523, 36410, 142864, 20808, -115714, -182224, -123987, -145648, -244363, -217978, 8870, 145942, 117912, -17613, -204540, -146758, -110128, -207834, -166330, -57807, -56687, -52566, -109731, -185879, -90931, 51763, 78813, 90028, 116430, -34154, 24096, 1763, -95712, 62621, 218158, 243495, 69367, -118596, -90970, 72117, 29003, -14149, 25138]
6636B5138l0702o6343M9113Q9007o352o3847j5449k4657j65103M4299M7584o2281
6624a79593k37j8394J19826P8278O8092L6608J8153J3362r1152J3991J365q3150
6612b2851m3520j67052J30096j4319N9814M2227j0777q1834l1207l7475k1435
6601a98333q89J9990n7365J04409J54718j7226R3415j40941j11063l3295n7105
6590b43685N4440J9461J8699L7331M9198j0673p1261P3984J4174j55382j41579
6579c55293M6038J68287J41409Q3956M1297r1148m6029p3421j07095m5569p0744
6568c08312j0146Q9531J09772R0585J03178J30110O3438k07521r4176j28540p9440
6557b41521J24530Q2796j09997j00293n1578N4718K33877l756j23936R3916K01059
$$ y = [25138, -5564, -71907, -22794, 66213, 59861, -3986, -19435, -44092, -209195, -164896, -117312, -179593, -179830, -198224, -78398, -120, 67972, 104580, 122733, 136095, 44943, 58934, 60299, -22851, -66371, -233423, -103327, -117646, -57832, -15605, -26382, -108216, -139423, -176898, -198333, -199222, -179232, -236597, -132188, 22530, 5304, 98719, -42222, -153285, -186580, -243685, -189245, -169784, -151085, -113754, -64556, -75229, -146490, -72506, -58332, -213714, -355293, -309255, -140968, 441, 84397, 125694, 34546, -11483, -84904, -191999, -237568, -308312, -318458, -228927, -119155, -28570, 74608, 204718, 268156, 60635, -33541, -162081, -241521, -116991, -34195, -144192, -244485, -296063, -241345, -7468, -11224, -135160, -41244, 159815]
6546A59815r0796l9276j01054j7332m2762n8539L466J16028K66582j31015k25586
6535a60469O8192P7559J18675O2407l6122j36014j71838Q5072L0320p1742P931
$$ y = [159815, 69019, 29743, -71311, -88643, -131405, -189944, -186478, -70450, 196132, 65117, -160469, -92277, -14718, 103957, 166364, 130242, -5772, -177610, -92538, -62218, -133960, -126029]
$$ [...]
##END NTUPLES=NMR SPECTRUM
##END=
